##TITLE=Analysis number 319130
Compound Code cc 00603
Project Code adrs
Chemist Name endeavour
##JCAMPDX= 6.0         $$ Bruker NMR JCAMP-DX V2.0
##DATA TYPE= NMR SPECTRUM
##DATA CLASS= NTUPLES
##ORIGIN= Bruker BioSpin GmbH
##OWNER= nmr
$$ XWIN-NMR		Version 3.5
$$ Wed May  3 12:09:58 2006 GMT Daylight Time (UT+1h)  MAYBRIDGE\nmr@NMR_250MHZ
##.OBSERVE FREQUENCY= 250.131544655141
##.OBSERVE NUCLEUS= ^1H
##.ACQUISITION MODE= SIMULTANEOUS (DQD)
##.ACQUISITION SCHEME= undefined
##.AVERAGES= 16
##.DIGITISER RES= 18
##SPECTROMETER/DATA SYSTEM= dpx250
##.PULSE SEQUENCE= zg30
##.SOLVENT NAME= CDCl3
##.SHIFT REFERENCE= (INTERNAL, CDCl3, 0, 16.522)
##AUDIT TRAIL= $$ (NUMBER, WHEN, WHO, WHERE, WHAT)
$$ ##TITLE= Audit trail, XWIN-NMR		Version 3.5
$$ ##JCAMPDX= 5.01
$$ ##ORIGIN= Bruker BioSpin GmbH
$$ ##OWNER= nmr
$$ C:\u/data/dgb/nmr/ADRS/3640/pdata/1/auditp.txt
$$ ##AUDIT TRAIL=  $$ (NUMBER, WHEN, WHO, WHERE, WHAT)
(   1,<2006-05-03 12:09:37.17 +100>,<MAYBRIDGE\nmr>,<NMR_250MHZ>,
      <created by zg, POWCHK disabled, PULCHK disabled
       configuration hash MD5:
       84 BC 41 DB A1 6E 1D 46 DA 25 12 A5 C1 ED C5 3A
       data hash MD5: 64K
       6D DD 7F 47 04 5A 0F 95 E5 A1 24 37 08 CE 40 00>)
(   2,<2006-05-03 12:09:49.02 +100>,<MAYBRIDGE\nmr>,<NMR_250MHZ>,
      <Start of raw data processing
       ef LB = 0.3 FT_mod = 6 PKNL = 1 SI = 32K 
       data hash MD5: 32K
       09 5B 93 8E 2A 9D 2F F6 E6 87 85 89 6A B5 5D 58>)
(   3,<2006-05-03 12:09:50.68 +100>,<MAYBRIDGE\nmr>,<NMR_250MHZ>,
      <apk 
       data hash MD5: 32K
       F9 C2 92 94 1D 38 C0 91 A1 01 F9 CF A4 D1 E1 A7>)
(   4,<2006-05-03 12:09:51.42 +100>,<MAYBRIDGE\nmr>,<NMR_250MHZ>,
      <abs ABSG = 5 
       data hash MD5: 32K
       75 4B B6 D8 9A CB 58 4B 6E 6D E6 69 4A D8 EB 35>)
$$ ##END=
$$ 
$$ hash MD5
$$ 2D 51 37 56 24 7B 13 CA 1D 9C 1F AB 37 FF D0 92
##$RELAX= 
##$RELAX= 
##$RELAX= 
##$RELAX= 
##$RELAX= 
##$RELAX= 
##$RELAX= 
$$ Bruker specific parameters
$$ --------------------------
##$DU= <C:\u>
##$EXPNO= 3640
##$NAME= <ADRS>
##$PROCNO= 1
##$TYPE= <nmr>
##$USER= <dgb>
##$AMP= (0..31)
100 100 100 100 100 100 100 100 100 100 100 100 100 100 100 100 100 100 
100 100 100 100 100 100 100 100 100 100 100 100 100 100 
##$AQSEQ= 0
##$AQ_mod= 3
##$AUNM= <au_zg>
##$AUTOPOS= <22 >
##$BF1= 250.13
##$BF2= 250.13
##$BF3= 250.13
##$BF4= 250.13
##$BF5= 500.13
##$BF6= 500.13
##$BF7= 500.13
##$BF8= 500.13
##$BYTORDA= 1
##$CFDGTYP= 0
##$CFRGTYP= 5
##$CHEMSTR= <none>
##$CNST= (0..31)
1 1 145 1 1 1 1 1 1 1 1 1 1 1 1 1 1 1 1 1 1 1 1 1 1 1 1 1 1 1 1 1 
##$CPDPRG= <>
##$CPDPRG1= <>
##$CPDPRG2= <>
##$CPDPRG3= <>
##$CPDPRG4= <mlev>
##$CPDPRG5= <mlev>
##$CPDPRG6= <mlev>
##$CPDPRG7= <mlev>
##$CPDPRG8= <mlev>
##$CPDPRGB= <>
##$CPDPRGT= <>
##$D= (0..31)
0 1 0 0 0 0 0 0 0 0.06 0 0 0 0 0 0 0.0002 0 0 0 0 0 0 0 0 0 0 0 0 0 0 
0 
##$DATE= 1146654571
##$DBL= (0..7)
120 120 120 120 120 120 120 120 
##$DBP= (0..7)
150 150 150 150 150 150 150 150 
##$DBP07= 0
##$DBPNAM0= <>
##$DBPNAM1= <>
##$DBPNAM2= <>
$$ [...]
##$SUBNAM7= <"">
##$SUBNAM8= <"">
##$SUBNAM9= <"">
##$SW= 20.6930455092707
##$SWIBOX= (0..15)
0 0 3 0 0 0 0 0 0 0 0 0 0 0 0 0 
##$SW_h= 5175.983436853
##$TD= 65536
##$TD0= 1
##$TE= 295.16
##$TE2= 300
##$TE3= 300
##$TEG= 300
##$TL= (0..7)
0 120 120 120 120 120 120 120 
##$TP= (0..7)
150 150 150 150 150 150 150 150 
##$TP07= 0
##$TPNAME0= <>
##$TPNAME1= <>
##$TPNAME2= <>
##$TPNAME3= <>
##$TPNAME4= <>
##$TPNAME5= <>
##$TPNAME6= <>
##$TPNAME7= <>
##$TPOAL= (0..7)
0.5 0.5 0.5 0.5 0.5 0.5 0.5 0.5 
##$TPOFFS= (0..7)
0 0 0 0 0 0 0 0 
##$TUNHIN= 0
##$TUNHOUT= 0
##$TUNXOUT= 0
##$USERA1= <user>
##$USERA2= <user>
##$USERA3= <user>
##$USERA4= <user>
##$USERA5= <user>
##$V9= 5
##$VALIST= <valist>
##$VCLIST= <CCCCCCCCCCCCCCC>
##$VD= 0
##$VDLIST= <DDDDDDDDDDDDDDD>
##$VPLIST= <PPPPPPPPPPPPPPP>
##$VTLIST= <TTTTTTTTTTTTTTT>
##$WBST= 1024
##$WBSW= 4
##$XGAIN= (0..3)
0 0 0 0 
##$XL= 0
##$YL= 0
##$YMAX_a= 526288
##$YMIN_a= -508518
##$ZGOPTNS= <>
##$ZL1= 120
##$ZL2= 120
##$ZL3= 120
##$ZL4= 120
##$ABSF1= 16.522
##$ABSF2= -4.171173
##$ABSG= 5
##$ABSL= 3
##$ALPHA= 0
##$AQORDER= 0
##$ASSFAC= 0
##$ASSFACI= 0
##$ASSFACX= 0
##$ASSWID= 0
##$AUNMP= <proc_1d>
##$AZFE= 0.1
##$AZFW= 0.1
##$BCFW= 0
##$BC_mod= 0
##$BYTORDP= 0
##$COROFFS= 0
##$CY= 12.5
##$DATMOD= 1
##$DC= 0
##$DFILT= <>
##$DTYPP= 0
##$F1P= 14.0000005364418
##$F2P= -0.99999901652339
##$FCOR= 0.5
##$FTSIZE= 32768
##$FT_mod= 6
##$GAMMA= 0
##$GB= 0
##$INTBC= 1
##$INTSCL= 1
##$ISEN= 128
##$LB= 0.3
##$LEV0= 0
##$LPBIN= 0
##$MAXI= 10000
##$MC2= 0
##$MEAN= 0
##$ME_mod= 0
##$MI= 0
##$NCOEF= 0
##$NC_proc= -2
##$NLEV= 6
##$NOISF1= 0
##$NOISF2= 0
##$NSP= 0
##$NTH_PI= 0
##$NZP= 0
##$OFFSET= 16.522
##$PC= 1
##$PHC0= 163.6418
##$PHC1= 14.19661
##$PH_mod= 1
##$PKNL= yes
##$PPARMOD= 0
##$PSCAL= 4
##$PSIGN= 0
##$REVERSE= no
##$SF= 250.13
##$SI= 32768
##$SIGF1= 0
##$SIGF2= 0
##$SINO= 400
##$SIOLD= 32768
##$SREGLST= <1H.CDCl3>
##$SSB= 0
##$STSI= 32768
##$STSR= 0
##$SW_p= 5175.98343685301
##$SYMM= 0
##$S_DEV= 0
##$TDeff= 65536
##$TDoff= 0
##$TI= <Analysis number 999999
Compound Code 99
Book Reference 9
Project Code 9>
##$TILT= no
##$TM1= 0
##$TM2= 0
##$TOPLEV= 0
##$USERP1= <user>
##$USERP2= <user>
##$USERP3= <user>
##$USERP4= <user>
##$USERP5= <user>
##$WDW= 1
##$XDIM= 32768
##$YMAX_p= 352476081
##$YMIN_p= -58870
$$ End of Bruker specific parameters
$$ ---------------------------------
##NTUPLES= NMR SPECTRUM
##VAR_NAME=  FREQUENCY,     SPECTRUM/REAL,   SPECTRUM/IMAG
##SYMBOL=    X,             R,               I
##VAR_TYPE=  INDEPENDENT,   DEPENDENT,       DEPENDENT
##VAR_FORM=  AFFN,          ASDF,            ASDF
##VAR_DIM=   32768,         32768,           32768
##UNITS=     HZ,            ARBITRARY UNITS, ARBITRARY UNITS
##FACTOR=    0.157963299565203, 1,           1
##FIRST=     4132.6476996994, 0,             0
##LAST=      -1043.33573715361, 0,           0
##MIN=       -1043.33573715361, -58870,      0
##MAX=       4132.6476996994, 352476081,     0
$$ Real data points
##PAGE= N=1
##DATA TABLE= (X++(R..R)), XYDATA
$$ [...]
16909e495J0171O835P564q291k5094j2415j4422P87K2131N795p836L794P098j8547
16895b7925L115O926J496q844p369j375J4523J7747j8180n999O227N423m439m554
16881b3228M587R111k94O758j441l59J0120J178J2347L32r489j2922L095O893
16867F688J8962K723n793L485j4040j1697l313J1131J5984l904j5733P76J3468
16854A8737N665k5299j3918j5509J1091J775o846N171p49j7798k849J2632K2166
16841e731J8735J0678r844k089j6301j6921m645J4993l013l227r28k725M820J84
16827a6014p628o396M783R165q205J5233M984m461N481O476R090r029l755j4096
16813a4372p527J1954J7473P734m27K603O60m885n741j269L886J032l835p901
$$ y = [-5495, 4676, 11511, 19075, 10784, -14310, -26725, -41147, -40360, -18229, -12434, -20270, -16476, -9378, -27925, -24810, -17884, -16388, -25232, -32601, -33976, -19453, -1706, -19886, -25885, -19658, -14235, -18674, -23228, -18641, -9530, -9824, -3066, -4507, -4866, 5254, 6432, 18779, 19111, 9622, -3300, -205, 6688, 25650, 28373, 22580, 26065, 12025, 328, -2985, 8146, 24130, 20226, 4493, 5269, 18737, 24402, -897, -14815, -30324, -19233, -17458, -24304, -19133, -19882, -37680, -40529, -27897, -5731, 13004, 23682, 13838, 11749, -4552, -21473, -26118, -11125, -14138, -17365, -18293, -21018, -16198, -16014, -23642, -30038, -25255, -16090, -24295, -9062, -4078, -8539, -3058, 3418, 12508, 3479, -276, -14372, -21899, -9945, 7528, 15262, 14835, 17438, 18098, 13213, 7472, 6203, 10089, 11121, 7286, -615]
16799f15L640M436Q886n506j9J475J755j2016j4108M498j635K871o255J04n023
16784a7512j4024P02k155N877K4362K854k042p358q298N533J9625K30n641o55
16770A498o19m270j0698q940J4706K1218o320k81j671j2213q334r386K5571M667
16756D928q362l101N762K2191j28p586L302mJ2457o641j3641j5772l152m142Q176
16741e713J15k0600j2474M070J0519J9592J7020M111J3561M763n630j5338j489
16728A2507l770J56Q84J0775J187m237j925k1846j663N749M410q379q933q086
16714b3171J5905J5802J4973O103N031j3663k5190j3875J0262K398N498N764O402
16701A2239k2930j2695P766k190R232J5487l073k3077o104N212o358P872J2395
$$ y = [-615, 3025, 7461, 16347, 10841, 10822, 12297, 14052, 2036, -12072, -7574, -9209, -6338, -12593, -12489, -17512, -31536, -30834, -32989, -27112, -2750, 104, -1938, -9296, -17594, -12061, 7564, 7794, 2153, 1498, 879, -3391, -14089, -23029, -8323, 12895, 6575, 6294, 4623, -7590, -15924, -25310, 261, 4928, -3434, -6535, -773, 21418, 21290, 13704, 17006, 17002, 29459, 22818, 9177, -6595, -9747, -13889, -5713, -5598, -26198, -38672, -34602, -24083, -4491, 12529, 16640, 30201, 34964, 29334, 13996, 12507, 8737, 8893, 9777, 20552, 21739, 17502, 15577, -6269, -7932, -2183, 2227, -6152, -15085, -23171, -7266, 8536, 23509, 29612, 34643, 20980, -4210, -18085, -7823, -5425, 73, 5837, 12239, -10691, -23386, -15620, -17810, -8578, 6909, 3836, -19241, -25345, -20133, -26491, -18619, -6224]
16688f224j0457j624K582j399L100j6732N522j14L070P221p891Q182J4284o358
16674f838l079J0687j1870j1172m323M337R632R750j459l189l355r33O823Q230
16660C241m814j9144r423O804P747l51Q624j03M078j80l263k1419P917J5807n670
16645a0149k088o038m777L471n570j465J2854J6821O377N165r525j2969j3197
16632b1090N931R834o139J341P582j062p318p238J4905k119k2092m819Q069J1301
16618a2914K3554J9891k2013j4946N316J2025M770q426o916K0471O626n559j0108
16605A1771M81P034n836p094n971j5784l84Q012K80P389J8950P930j9347j0701
16591c270K677P017Q126k436k2432j5408q84J730R113N896j827J568P958l306
$$ y = [-6224, -16681, -18305, -15723, -17122, -14022, -30754, -25232, -25346, -22276, -15055, -22946, -14764, -480, -6838, -9917, 770, -11100, -22272, -26595, -22258, -12626, -2876, -4335, -7524, -10879, -11812, -4989, 3241, -1573, -20717, -30140, -23336, -15589, -15940, -7316, -7419, -3341, -3521, -6784, -28203, -20286, -4479, -10149, -12237, -18275, -23052, -19581, -25151, -26616, -13762, 3059, 9436, 14601, 5076, -7893, -21090, -15159, -5325, -11464, -10123, -2541, -3603, -10921, -18159, -3254, -5373, -27465, -32284, -24215, -12914, 10640, 30531, 8518, -6428, -1112, 10913, 15683, 7257, 341, 20812, 27438, 21879, 11771, 12252, 19286, 13450, 6356, 385, -15399, -15783, -7771, -7491, -102, 18848, 26778, 7431, -3270, -593, 6424, 14550, 12114, -10318, -25726, -26610, -24880, -15767, -9871, -11698, -10130, -2172, -5478]
16577e478Q27R129j0526j8109j6235J2090J4746P418o433l359n415q402L449O96
16563b5602P007J4141J1k05Q475m332j178R737j944m742M500N361n007O587N601
16548A8410j1480L622J0025n219j8089l822j378Q610j6665n442J8193O196n919
16535b958k1920K479J2038o146r225P297K4192J6029q93o644j3097L761K013j262
16521E664L837O74l198J2664K834j2901p287k2879R004P585j5133j1254K027L794
16507b4569O905J6252J7969K423r102j3653j100o514p129L382J1474K370M096
16494B804l913j1923n569q486Q632J9759j9L283J384q710P760J658j0183n92n273
16479i388K145L074J5740J0111J1532o226q811n462J415M634N606q11Q572n619
$$ y = [-5478, -4651, 4478, -6048, -24157, -40392, -28302, -13556, -6138, -12571, -15930, -21345, -29747, -26298, -25602, -18595, -4454, -4443, -4648, 3827, -505, -1683, 8054, 6110, 1368, 5868, 11229, 6222, 12809, 18410, 6930, 10552, 20577, 15358, -2731, -6553, -7931, 679, -15986, -21428, -3235, 2961, -2958, -24878, -22399, -10361, -16507, -25732, -18435, 5757, 21786, 20893, 14249, 1152, 4913, 6926, 5664, 9501, 10175, 6977, 19641, 22475, 9574, 2287, -20592, -11588, -4003, -19136, -30390, -28363, -24569, -17664, -1412, 16557, 18980, 9878, -3775, -4875, -11389, -18518, -15136, -3662, -1292, 2804, -1109, -13032, -18601, -27087, -18455, 1304, 1285, 4568, 5952, -2758, 5002, 6660, -3523, -4115, -9388, -7243, -4169, 11571, 21682, 33214, 26988, 18177, 12715, 14130, 18764, 24370, 23559, 32131, 26512]
16465B6512j0554M109Q959j947r009q947o148Q09j2092k776N222L885J1240J2920
16451B2183n986j3469J096J0524m839p861j1812N718Q006J0217n592j5595L564
16438c846R791N199J0542K019m910N770k887m755o323k122q96o528Q04j3022M000
16423g164J0093n079o861j00m306J2793Q739m700r423o860k493j2059j4212J1569
16409c0063J5181K233J1974K0422O135j7319r782M675k043J7360l959k2338j3583
16396b1107J7216J1110l019k11l264p878n029m325R522m21l055N841J1309K103
16382H792j4933j7839R86P256n834J4105J2443o67m582r625J0170J6880k639r225
16368E288j9304j5245R311K1431K303r365n792L232Q092P306J4547q648J229m986
$$ y = [26512, 15958, 20067, 29026, 27079, 18070, 9123, 2975, 3784, -8308, -11084, -5862, -1977, 9263, 22183, 16197, 2728, 3824, 14348, 9509, 1648, -10164, -4446, 3560, 13777, 8185, -7410, -3846, 5945, 11144, 21686, 23705, 18795, 24565, 21678, 16923, 10600, 8478, 7582, 1054, 1858, -11164, -7164, 2929, -2150, -9011, -9111, -13417, -624, 8115, 3415, -6008, -12868, -15361, -27420, -41632, -30063, -14882, -12649, -675, 19747, 25882, 8563, -1219, 3456, 1413, 18773, 14814, -7524, -21107, -3891, 7219, 4200, 3989, 725, -7153, -12182, -16507, -6985, -7406, -10461, -4620, 6689, 8792, -6141, -23980, -22994, -15738, -21572, -7467, 4976, 4309, -273, -9898, 272, 17152, 14513, 5288, -14016, -29261, -19950, 1481, 3784, -5581, -11373, -8141, -49, 7257, 21804, 13156, 14385, 9399]
16354I399j3908q889m966j0151J2632n659j3807K165J6904J1225Q734p62j5226
16341a2309j7793O196J6512o392o618M498L891Q213O141l036J4157l848p493r725
16327g606m54q745L512k108k424P886J0719j8183l730M670J3173m406l060j110
16313a1866Q750L282L470j1546J070J6497r135j7870P345K3029L146q591j7623
16300a0042J3863N123j4796k304J0783J390j609k46Q118J333J901M163j148j6204
16286C25j862Q638l720k39j1713r84k624p95P56m639j2622j97N793M459j93p40
16270b0357P320Q534j126k912p48p133J587m6q113J506J6163P384O9J913o944
16255b903J305j0213J0012K257N051k557p702r935k596l779k603J2135J7452J1321
$$ y = [9399, -4509, -13398, -18364, -28515, -15883, -21542, -35349, -33184, -16280, -5055, 3679, 2917, -12309, -30102, -23906, -7394, -13786, -20404, -15906, -12015, -3802, 2339, -697, 13460, 9612, 2119, -7606, -8060, -16805, -13293, -15401, -17825, -9939, 780, -17403, -21133, -16463, -3290, -7696, -10756, -11866, -3116, 166, 3636, -7910, -6840, 9657, 522, -17348, -10003, 13026, 16172, 7581, -10042, 3821, 8944, -5852, -8156, 2627, 4017, 2408, 2162, 10280, 11613, 13514, 17677, 16529, 325, -1537, 7101, 3381, 3142, -8571, -9555, -12179, -12974, -12218, -16857, -29479, -29676, -23883, -19424, -19617, -20357, -13037, -4503, -5629, -8541, -9289, -16422, -14835, -14881, -22994, -21488, -5325, 2059, 2128, 4041, -2903, -1598, -11811, -1799, 458, 5509, 2952, -4750, -14685, -17281, -21060, -23663, -11528, 5924, 17245]
16241A7245m920J4753M051q182k336p600o656m834O364K864O839L599l663J0176
16227B7700P737j431k0965j998o022k912m940M972J2185k73N148q958o209M287
16213H321l193m530P781j7637j2055L259J7208r222Q83P572P812K048j2685P127
16199B689J1987J022j394m159j0868j4297m938J3467P801j2415j0013l964p216
16186c2298m584Q997k999K894J4705L130j0358o817P678J3156p549o618j521R442
16172a2742o501N931R138J471J1154J4411l520k3107j1029O369m633O821J7393
16159A1156k512j0017n459j3965K725o133J2005K1782Q298k2818j481J039m759
16146a0139P820P4l495l260o204K46J4114J5066j3003k1614J493J8441J9300m539
$$ y = [17245, 12325, 27078, 31129, 22947, 20611, 13011, 6355, 1521, 7885, 10749, 17588, 21187, 17524, 27700, 35437, 34006, 13041, 11043, 5021, 2109, -2831, 2141, 14326, 14053, 19201, 10243, 4034, 8321, 5128, 598, 8379, -9258, -21313, -18054, -846, -10068, -9185, -1613, 6199, 8247, -4438, 2689, 14676, 15698, 14304, 10145, -723, -15020, -19958, -6491, 1310, -11105, -21118, -25082, -32298, -36882, -27885, -30884, -27990, -13285, -10155, -20513, -27330, -19652, -6496, -14045, -20663, -22184, -12742, -19243, -13312, -4174, -2703, 8451, 22862, 19342, -3765, -14794, -8425, -13058, -6237, 11156, 8644, -1373, -6832, -20797, -18072, -24205, -12200, 9582, 17880, -4938, -6419, -5380, -10139, -2319, -2245, -5740, -9000, -15204, -14958, -844, 14222, 1219, -20395, -18902, -461, 18839, 14300]
16132A4300j7845k846L93j1825P70J1284J6053p18n845o569o041J420K724O41
16118d104L066J9507J1872k234j8491k6348M801O398K866J9869o763O439N304
16105B2182m755m35J8575P271p193n063o402q528p514o047m354j1196j645M955
16091a0149M089m33P197K206r415L552J0915k654J856J0747J4071O10j0364j1648
16077A0580j0448j4148K355M633R729J503K94O627k658o93r774j823m977l16L384
16062e732p212n587m052N227q793K882J0329L872k384O202M476p432l555j651
16048a3410j026k80j771j0914m976J4436J6491P424m042L26l149m80j748l485
16034f604R061J549o477j013k0273J0575J181p202n990k788J911K055J0152O295
$$ y = [14300, -3545, -6391, -5998, -17823, -17053, -5769, 10284, 9566, 3721, -2848, -8889, -7469, -4745, -4104, -1038, 18469, 30341, 28107, 9616, -16732, -11931, -5533, -2667, 17202, 10439, 16878, 22182, 17427, 16992, 35567, 42838, 35645, 30582, 24180, 15652, 8138, 2091, -2263, -13459, -15104, -10149, -6060, -6493, 704, 2910, -6505, -2953, 7962, 5308, 7164, 17911, 31982, 32592, 22228, 10580, 132, -14016, -11661, -7028, 2701, 4204, 4498, 11125, 8467, 7774, -2000, -3823, -8800, -9116, -5732, -12944, -18531, -22583, -17356, -26149, -23267, -12938, -9066, -11450, -5248, -772, -8204, -11759, -13410, -14436, -14716, -16487, -27401, -32377, -17941, -1450, 5974, 1932, 2258, -891, -1371, -3119, -6604, 2457, 4006, -2471, -3484, -23757, -13182, -12001, -19203, -25193, -27981, -26070, -24015, -13863, -7568]
16020g568j1626m149K0190Q199q134J870n150k361j1066l772L691R639K238l717
16006a1716K0529n129n635J3059O419j0064p953o244j4826j7847J6587Q541j024
15993a5303j5120n66J7968J8480J846k32Q17p512q224N27J0928p016k4260p11
15979b8378J1763J1062J5321J2830j2298j1955L982J3981M736j4375m889L124
15967D904O542j7547J516J7942O802j1076k2471o051M097O684m771o482L445K4759
15953H293l021L806J3q918j3930j1187J6851Q242P19q524o932j1035N231Q128
15939a2264R401M677O102k66l177P078k299n792J2550j5090j8956J2314q473j4497
15925b8692j0541K120n865o727J5479J6723Q583K902J0708r989j6195j3774J8228
$$ y = [-7568, -19194, -23343, -3153, 5046, -3088, -1218, -6368, -8729, -19795, -23567, -19876, -10237, -7999, -11716, 8813, 3684, -1951, 11108, 17527, 7463, -490, -6734, -21560, -39407, -22820, -14279, -15303, -30423, -30989, -13021, 5459, 7305, 7073, 7890, 378, -7846, -7319, 3609, -3407, -27667, -28378, -16615, -5553, 9768, 22598, 10300, -1655, 2327, 16308, 21044, 6669, 1780, 4904, 11446, -6101, -4585, 13357, 20159, 9083, -13388, -19439, -15342, -8658, -13429, -19911, -16466, 8293, 5272, 9078, 9091, 173, -13757, -24944, -8093, 149, 868, -7656, -14588, -25623, -20392, -12264, -2863, 1814, 7916, 7650, 4473, 11551, 9252, 3460, 16010, 920, -18036, -5722, -14195, -28692, -39233, -37113, -42978, -49705, -34226, -17503, -8920, -6018, 4690, -5299, -21494, -35268, -17040]
15912a7040J8831J3118r958n043n399j6117L945J1758j3848r71n06J8917Q120
15899E807m786N554N436k105q075k453l89M990K287KM5n652j2524k937j46J0222
15883d724J8469J6821j591j2462j9945j2045k669R327K1820J5622j1866r280j768
15870E709l230J297J19O827r209j3415p858J564o18L984P728q194J092j0936R575
15855a5565J7242J0282N90r414J7718J6493m728j5671j5700o449r246j0847J7265
15842h030K3156j0151K660P141n812j1163r063j1622l567J3012Q412J1371L064
15829I408m800n828J4918J4463j0676k3244m393R95J510R03K646R91P397P819
15815A2109J3215O015k350O753o793j0034j836j904l402j6158o536N374k670K871
$$ y = [-17040, 1791, 14909, 4951, -92, -5491, -21608, -17663, -5905, -19753, -20724, -21230, -2313, 5807, 1021, 6575, 12011, 9906, 1831, -622, -1011, 3979, 6266, 6268, 6313, 661, -11863, -14800, -14946, -4724, 13745, 30566, 28975, 16513, -3432, -15477, -18146, -8819, 13001, 28623, 16757, 7477, 5709, 2479, 3776, 3895, 10722, 1513, -11902, -19760, -18196, -18814, -14830, -7102, -15296, -14204, -25140, -15565, 1677, 11959, 12549, 3135, 20853, 37346, 32618, 16947, 1247, -5202, -14448, -25295, -8030, 15126, 4975, 7635, 14776, 8964, -2199, -11262, -22884, -26451, -13439, -5027, 6344, 9408, 4608, -1220, 13698, 28161, 17485, -5759, -10152, -9157, -7647, -6744, -4098, -3107, 4290, 12109, 25324, 31339, 28989, 35742, 28949, 18915, 17079, 15175, 11773, -4385, -10921, -5547, -8217, -5346]
15801e346P914O778M329k650k088R304j6465K957J6240r809k1157P110k204o895
15787a1982k681J125J471j938R96J5750M075K674J2484k650r074m692r682o920
15773a1044N827r38l499o291j048K178k789j5936L506J2036J4822N914Q723R297
15759B0758J757n672k048P988n10j9798k141r583M30J660m42P618P522O372P496
15744B1407r972Q85q954Q760l562j7896K623N483j790q28J7397J3806L795k0686
15730A0468n374q460n843O887J8490K907N579j7852k7096r309r202K200l508J5842
15716b4271K108M615J3833j587o608J360M083J998Q77K19K6073k028j8030p318
15702d676m135r636l10J4047J1790o977l296n339q631O528N485p797q785Q704
$$ y = [-5346, 2568, 9346, 13675, 11025, 8937, 18241, 1776, 4733, 20973, 11164, -9993, -2883, -5087, -11982, -14663, -13538, -12067, -14005, -13009, 2741, 6816, 9490, 21974, 19324, 10250, 5558, -4124, -11044, -5217, -6155, -9654, -15945, -16993, -14815, -17604, -33540, -30034, -17998, -3176, 2738, 11461, 20758, 22515, 16843, 14795, 22783, 22273, 2475, 334, -9249, -8819, -7159, -7601, 17, 7539, 13911, 21407, 11435, 12320, 3366, 12126, 8564, -9332, -6709, -1226, -3016, -3844, 13553, 27359, 31154, 10468, 5094, -3366, -9209, -2322, 16168, 19075, 24654, 6802, -20294, -29603, -38805, -36605, -40113, -24271, -22163, -17548, -3715, -5302, -11910, -10550, -6467, -4469, -3592, -3373, 22700, 20672, 2642, -4676, -8811, -18447, -18757, -4710, 7080, 103, -3193, -8532, -17163, -10635, -5150, -12947, -21732, -13028]
15688a3028o05m717m849o370J1368J9542J1247N172P078J3065j2o267j5823j6444
15674f43p489M228k453K726j0272K120P840k13K500K200j934M85L283K451j8584
15659a3755n796R760k379j302r877r158J8337J2321o372L828M922J1971m206j2944
15645d650j6120N893J2722j214J4860N969O293l011j3427j7180j2202l994O502
15632a9559O915J2756m060J4484J7218L846p001p527j850j1528r498J5291M512
15619A3999o748K857L660q647m151Q998o202o864R689j854P004q475j7316o721
15605b0771J344j4467M213J558k593r487N079J9155K3040J1012o094m38l827p931
15591b07k696N206Q438M162k431l520o94o832K887r665k239J0597M62m583R02
$$ y = [-13028, -13633, -18350, -23199, -29569, -18201, 1341, 12588, 17760, 24838, 37903, 37891, 31624, 15801, -643, -8132, -3904, -6357, -3631, -13903, -11783, -3943, -4156, -1656, 544, -1390, -905, 2378, 4829, -13755, -19551, -9791, -12170, -13472, -23349, -32507, -14170, -1849, -8221, -4393, 529, 12500, 8294, -4650, -20770, -14877, -2155, -3369, 11491, 17460, 23753, 20742, 7315, -9865, -22067, -26061, -19559, -12644, 112, -3948, 10536, 27754, 31600, 24599, 17072, 15222, 3694, -5804, 9487, 13999, 7251, 10108, 13768, 5121, 970, 9968, 3766, -3098, 6591, 4737, 11741, 3266, -14050, -20771, -19427, -33894, -29681, -28123, -30716, -40203, -35124, -15969, 7071, 18083, 11989, 11551, 7724, -207, -2903, 2303, 10741, 14903, 12472, 8952, 8258, 1426, 4313, -5352, -7591, 3006, 3468, -1115, -213]
15576b13n922N948R098J6551k1734m436J7917J1996P69j8828k4995k992J2265
15563d576R077k103q640o949l417Q978P29j5749j553J6575M315J2522N620M73
15549A5302N892j009o094p296j4440p741o598K443L807J5790J5657n812j3295
15536c394o265M63L365l388J6024L804Q486K574Q16P149j3621j7488j3244r227
15522b3946l368M503J2290M430M78J1463J3734n088j1896q71n536r659J396N485
15508f585k361k833N001j2947J792N866k514J0586O413O849j9137r034J1270o644
15494a4278o354n765p222R300o448J4983m283K154L933J2531M054L855j4340o680
15480a4560N272P86p440J45O980j040R682P16k307J1547K118l367Q621P052j3253
$$ y = [-213, -6135, -187, 8911, 25462, 3728, -708, 17209, 29205, 29974, 11146, -13849, -16841, -4576, 4501, 2398, -6242, -13191, -16608, -7630, -6901, -22650, -24203, -7628, -3313, 9209, 14829, 15302, 21194, 20185, 14091, 6795, -7645, -15386, -21984, -19541, -15734, 56, 15713, 9901, -3394, -9659, -9196, -5831, -9219, 6805, 10609, 19095, 21669, 22485, 29634, 16013, -1475, -14719, -23946, -27314, -22811, -10521, -6091, -5613, 5850, 19584, 14496, 2600, 1729, -3807, -13466, -12070, -6585, -8946, -11779, -6778, -19725, -17933, -12067, -14581, -3995, 2418, 9267, -9870, -18904, -7634, -14278, -20632, -26397, -33619, -24319, -30767, -15784, -20067, -17913, -13980, -1449, 2605, 6460, -7880, -14560, -9288, -8502, -15942, -15797, -8817, -9857, -175, 541, -1766, 9781, 11899, 8532, 17153, 24205, 10952]
15465A0952M47J1813O982j2508j3885K373j8624l115N342Q356l739r208j4321
15452b9135K372J7384O761n974r647O640o853n842R256Q772m524M303p442K331
15438a1598k039J4376m570j0055R97K1458n131p434J1509J1351p746j4178N678
15425B618L329j6129r757p201J3320P565p103R763P635Q102P093O00P969k1049
15411F755O220J438n008L773j624n409M640j088p327j508o745p561N674n41j1968
15396b0279q188K613R707Q124j0362N873M077Q42J0113N896r266q71j4251p93
15382a6765P437J1643N463j1114k568k234m898n124n98K4895Q206n993j8511m466
15368a4627n940k520K6991K7763k1143j6283j100r86m978m070j032j092j0713
$$ y = [10952, 11399, 23212, 30194, 17686, 3801, 6174, -12450, -15565, -10223, -1867, -5606, -14814, -29135, -26763, -9379, -2618, -8592, -18239, -11599, -18452, -24294, -15038, -6266, -10790, -6487, -13929, -11598, -13637, 739, -3831, -13886, -12889, 8569, 3438, -3996, 7513, 18864, 11118, -3060, 2618, 5947, -10182, -19939, -27140, -13820, -6255, -13358, -3595, 4040, 12142, 19235, 19835, 27804, 6755, 12975, 14413, 9405, 13178, 11554, 6145, 10785, 9697, 2370, 862, -5883, -13444, -7770, -8311, -20279, -28467, -25854, -16147, -8023, -18385, -12512, -8435, -7593, 2520, 8416, -850, -1721, -15972, -16765, -9328, 2315, 7778, -3336, -5904, -8138, -13036, -18160, -18758, 6137, 14343, 8350, -10161, -14627, -20567, -23087, 3904, 31667, 10524, -5759, -6859, -7845, -12823, -16893, -17925, -19017, -29730]
15355b9730N512M070l510N954J0322Q223j3578r391J3521O449j1285k5654o554
15342d5651J9137K2697P446j3473p910J1234O783k728R809o394M366K102j7863
15329a0445j8654N001M312J2191R313J354n592j6260J808L648r499N598J239K096
15315a3890P353L847L839l002K553p90p26j6859p6j7007N023K2063o409J173J4694
15300A786R322l718p606J571R70j2483P09M156l010O07j3812K0116N206O69j0178
15285e695R44J263k446K733j3878r836N851N172L988J4274M539J518r565N4j020
15270b104l504J0522n245R588k874r718m094O527m509J612m018j0248L562Q817
15256e686l863o62K519J2958n290p716q45K179J5501J6680P20k14k2575K846J4688
$$ y = [-29730, -24218, -20148, -23658, -17704, -7382, 841, -12737, -22128, -8607, -2158, -13443, -39097, -45651, -26514, -3817, 3629, -9844, -17754, -6520, 263, -2465, 7344, 950, 5316, 7418, -10445, -29099, -24098, -19786, -7595, 1718, 3072, -2520, -18780, -16972, -13324, -22823, -17225, -15986, -13890, -6537, -2690, 1149, -1853, 700, -90, -816, -17675, -17751, -34758, -29735, -7672, -14081, -12908, 1786, 11108, 7390, -216, 1355, 2325, -10158, -9449, -5293, -8303, -7696, -21508, -1392, 3814, 4483, -5695, -4751, -3488, -5934, -3201, -17079, -26915, -21064, -15892, -11904, 2370, 6909, 8427, -1138, -1084, -2104, -5608, 4914, -331, 9257, 6383, -3335, -7429, -902, -5411, -3799, -7817, -18065, -14503, -5686, -9549, -10211, -7692, 5266, -24, -7740, -8585, -6406, 9095, 25775, 26495, 26281, 3706, 6552, 21240]
15241B1240m291j91N39J4517k135r93j0741j0895j8051o484j0473Q083N672q815
15227b3018P382K9375K763m003k674J2364k923k9651k81j4022M347N544k547Q604
15213h740N359L576N777l514k35p325j5643l918q25K3193k86o074l347K565Q664
15198g73J4334o801j5693k826Q164M333J2756j390j2392l525k280J817J4938J0040
15184B0702n835j1068L878O260R351k339j7120j2418j3525J1939K037l313r72
15171a2423j1509j151m677j3627J9279J7004J0150J0761J134j0978j9036o492
15159b1565J1704M040K171R97j78j1741n66p530O812m679o418o089R47J0020o93
15144b2768M776Q958O35R854J4556o149j8736j6101l559J8429O701k100j4319
$$ y = [21240, 16949, 16758, 17297, 31814, 29679, 28686, 17945, 7050, -11001, -17485, -27958, -19875, -14203, -23018, -15636, 13739, 16502, 12499, 9825, 22189, 19266, -10385, -10666, -24688, -20341, -14797, -17344, -8740, -3381, 195, 5972, 2458, 2223, -5102, -20745, -24663, -25488, -2295, -2581, -8655, -12002, -9437, -773, 13561, 6760, -8933, -11759, -3595, 738, 13494, 12104, -288, -3813, -6093, -4276, 10662, 20702, 14867, 3799, 7677, 13937, 23288, 20949, 3829, -8589, -22114, -10175, -8138, -11451, -12423, -23932, -25083, -29760, -43387, -24108, -7104, 3046, 13807, 14941, 3963, -15073, -21565, -9861, -5821, -3650, -2653, -2831, -14572, -15138, -22668, -15856, -20535, -26953, -33042, -32095, -22075, -22768, -17992, -9034, -8399, 1455, 16011, 9862, -8874, -24975, -28534, -10105, -3404, -5504, -19823]
15131a9823q032m337J6191J5373Q155k604r653J47K81j2919j1852J5831J1969
15118a273j1607r287j594R970R249j3171k1076r844M374J7671J7176J0284J479
15105B351o582P47K654m101j5156L518Q414j2005N158M022q995n838j431J6483
15091a0761p850l842P800O21j1080q836M139j655J1059L0360J6289k936l82j3672
15077I254k033j447j3291P7j6698j2387L49M251R515J2844K7796N985k0060k947
15063A208J4074J138j3895j1928n458p568M516J1298P382l224M25o265p373m134
15049a9804J1795J1421Q626Q023k417L804j7439K122n611k1406j3331J1187M170
15036a8860J6829J2965L214r548n122j388j0573j1923k837o689M537J5772K1577
$$ y = [-19823, -27855, -32192, -16001, -628, 7527, 4923, -4730, -4583, -4302, -17221, -29073, -13242, -1273, -12880, -22167, -23761, -13791, -4542, -17713, -38789, -48633, -44259, -26588, -9412, 872, 2351, -4231, -3484, -830, -4931, -20087, -16569, -8155, -20160, -15002, -10980, -19975, -25813, -27244, -10761, -18611, -22453, -14653, -14032, -25112, -33948, -29809, -31464, -20405, 9955, 26244, 23308, 22926, 9254, 7221, 5774, -7517, -7440, -24138, -36525, -36176, -31925, -22410, -9566, 18230, 24215, 4155, 1208, 15282, 16420, 2525, -9403, -14861, -22429, -17913, -6615, 767, -2457, -2032, -8297, -15670, -19804, -8009, 3412, 12038, 20061, 17644, 21448, 4009, 6131, 520, -20886, -34217, -23030, -18860, -2031, 10934, 14148, 4600, -522, -1910, -12483, -24406, -27243, -33932, -29395, -13623, 7954]
15023G954J619m579P386N008j7826j4813J273J5940L011M046o902Q165Q726k118
15009A6890L776m951j2281j4639r335L628K2257n898m000J3428K0729O37j5099
14996A5142j8791j2151Q220J5866K1806J3543j2178r702q565N863k28R92j0742
14983I075j2134j659Q79O536j2289K202m238l382m557Q309J0378O954j4415r141
14969a7482N274O543J5185l925K942M737j5605o130k291J073j6400n649n550R882
14955b7396K429Q7J6756J3611o781M796O087K6365j3579q323n837j1649n07r039
14941a2980K122J901Q87N244J1260l812q689N142R513Q087n025j3845m992k796
14927g983J4968R821J2657m643j0225l118O178L016j4848j2239j3681r913R711
$$ y = [7954, 9573, 4994, 12380, 17388, -438, -15251, -13978, 1962, 4973, 9019, 2117, 10282, 19008, 16890, 20666, 15715, 3434, -11205, -20540, -16912, 5345, -553, -4553, 8875, 29604, 30241, 15142, -3649, -15800, -7580, 8286, 30092, 43635, 31457, 21755, 13190, 19053, 18825, 19817, 9075, -3059, -4718, -3839, 2697, -9592, -7390, -11628, -15010, -19567, -11258, -880, 6074, -8341, -17482, -12208, -5665, 9520, 5595, 8537, 13274, -2331, -8461, -10752, -9679, -26079, -31728, -37278, -27396, -24967, -24880, -8124, 5487, -1294, 3502, 9589, 35954, 22375, 14052, 8215, -3434, -3941, -12980, -10858, -8957, -8070, -2826, 8434, 4622, -4067, 1075, 10588, 18675, 13650, -195, -5187, -7983, 6985, 16806, 29463, 24820, 14595, 11477, 17655, 20671, 5823, -6416, -20097, -30010, -20299]
14914b0299J9965L526N2n365M558M587m08p085j2028J9822p511j1280m177j182
14900a6825N857J445r22j6903P354q589N615K680o2j092J2992J2516L194l70j963
14885D927J4962N001J477m284n730m201l571J172J9692L526r851j8579p85N355
14871I111j2622O587l581k630L583j379K9r31k206l000Q278q373o224k548n165
14856b1071j502P24N923J4579J448J0647Q233n920q409o289R702K0733K4403j2338
14842D0863j8007n050j4383k0035L794O318J0695Q088J215O939R397j8699j0215
14829I20q721l079K676K2450j077J160o41m166J0303J873n004k403k610l254p531
14814H96m932m087N195l058J2170o008l178p276P137j88r391l62r40M020l758
$$ y = [-20299, -334, 3192, 3244, -2121, 2437, 7024, 6616, -469, -12497, 7325, -186, -11466, -15643, -16825, -10968, -9523, -10445, -27348, -19994, -28583, -22968, -20288, -20350, -21442, -8450, 4066, 7260, 6890, 4927, 19889, 24890, 26367, 22083, 16353, 12152, 8581, 9753, 29445, 32971, 23120, 4541, 3756, 9111, -3511, 3076, -505, -3135, 448, -931, -902, -1833, -4039, -7039, 1239, -7134, -13358, -15906, -21071, -22573, -21849, -15926, -1347, 101, 10748, 18981, 13061, 4652, -1637, 8065, 28798, 53201, 40863, 22856, 17806, 3423, -16612, -12818, -6500, 4195, 12283, 13498, 20437, 29834, 11135, 920, -7801, -10880, -8204, 14246, 13169, 14329, 13688, 9522, 19825, 21698, 16694, 14291, 11681, 8427, 896, -4036, -8123, -2928, -5986, 6184, 176, -3002, -10278, -3141, -3329, -12720, -13082, -14022, -10002, -13760]
14799a3760M088J8066l184m024J0962O953r199n196J7182j1355l555L293J4546
14786B4817l726j8700K729N123P648p97r393r090k418l371j0168M2J3970O466
14772C132J6257Q04J838j1560O841l494j7000J0646j0214q227L608K6880k2857
14759c346j6809J9125O653j0695j7936n798Q566J0139J970N341N576P800m275
14746F311j6733j720J081m126R569J0348L189P663M287M600o676J2050O586j7774
14732A8655p91J413k6182o003N262q204o206k635L351J1708k875j984J3279K313
14718A101r045R688n527r588k313O575R640j9387l740J1290Q214J6869J3896p958
14704A9715q934M825J2034j1668p419Q567k564q596r090k229j2501q181m360J0854
$$ y = [-13760, -9672, 8394, 5210, 1186, 12148, 19101, 9902, 4706, 21888, 10533, 6978, 10271, 24817, 21091, 2391, 5120, 10243, 17891, 17094, 7701, -1389, -3807, -7178, -17346, -17304, -3334, 3132, 19389, 20193, 22031, 10471, 17312, 13818, -3182, 7464, -2750, -10977, -7369, 19511, -3346, -20155, -1030, 5623, -5072, -23008, -28806, -20240, -10101, -8131, -2790, 2786, 10586, 6311, -10422, -12142, -11061, -15187, -5618, 4730, 7919, 15582, 19869, 24469, 17793, 29843, 36429, 18655, 17864, 19277, -6905, -12908, -7646, -15850, -22056, -24691, -21340, -9632, -12507, -14491, -1212, 1101, -7944, 1744, -3783, -13371, -15684, -9109, 531, -18856, -22596, -11306, -3092, 13777, 27673, 19715, 10781, 15606, 27640, 15972, 8553, 17120, 14556, 5960, -3130, -5359, -17860, -26041, -30401, -19547]
14690a9547J0246R215q22K302O873J3970Q41q169j7001m830J1248K519k3646M087
14676a2714Q125N383q148l472J5053m659r123n66k370j23J6494J868J74R019j0863
14661D078j0584O990m472m446O849j1525p5L752n58R82J2185L121m187o941n120
14646i951Q491N931o305j2998j538N310N848O829o079M034m547m164n735P919
14632f955N104J591n620L999K439l577O685r132k2656j6553J9860N342N579N979
14618g915k353J6119m073j1768M574K0425M735o671q521j137P056Q267m677n089
14604H972j0854L32J2109k3040L034L414N4L285K818J4200J412p770k047M69j2969
14589f581j9813N61P716J2424K2793o567j6438M305K2943R95j1780j2728j0314
$$ y = [-19547, -9301, -86, -908, 1394, 8267, 22237, 23078, 14909, -2092, -6922, 4326, 6845, -16801, -12714, -4589, 794, -7354, -10826, 4227, -432, -9555, -10121, -12491, -12614, 3880, 5748, 5922, 14941, 4078, -6506, 484, -3988, -8434, -1585, -13110, -13185, -9433, -9991, -9009, 3176, 6297, 2110, -4831, -9951, -1460, 4471, -1834, -14832, -16370, -11060, -5212, 1617, -4462, -428, -4975, -9139, -14874, -6955, -1851, -260, -5880, -1881, 558, -3019, 3666, -5466, -28122, -44675, -24815, -19473, -13894, -7915, -10268, 5851, 1778, -9990, -5416, 15009, 19744, 13073, 4552, 3415, 10471, 18738, 14061, 8972, -1882, -1550, 10559, -12481, -9447, -6033, -5979, -2694, 124, 14324, 15736, 7966, 5919, 6388, -6581, -26394, -25833, -18117, -5693, 17100, 10533, -5905, -1600, 21343, 22338, 10558, -2170, -12484]
14576a2484N019P634Q378J179m405K453L990j665j962j324p739j6245l035J2140
14562h066Q931M336J734j1033J9793N218j4790q960N91J1302R422j1969l0633
14549b4124j9350M422K2573M273O8q213j292j4083J5393J2163m995N50j3550Q778
14535a7387K0895N797j6056o39J0265Q052O232N256L283k837k376O079j5602q702
14521B260K507l784R017N657r754p644j2921J0792L2384R720l151l210k398j3811
14507A5664j0298P214J0484k516r141j980m967N170J1440j4115j7742p312P264
14494a0835J2790k743n250N676j053O333N872m356j8099p925k94k812J467O312
14480a4917l505p483Q89J0141Q195q853j2987R557J2670N587N377k82L098l138
$$ y = [-12484, -7465, 169, 8547, 9726, 5321, 7774, 11764, 10099, 8137, 6813, -926, -17171, -20206, -8066, 865, 5201, 6935, -4098, 15695, 20913, 6123, -2837, -2246, 9056, 18478, 6509, -24124, -43474, -39052, -16479, -12206, -12138, -20351, -21643, -35726, -20333, -8170, -13165, -12615, -26165, -17387, 3508, 9305, -6751, -7390, 2875, 10927, 17159, 22415, 25698, 22861, 20485, 26564, 10962, 2260, 4767, 983, 10000, 15657, 5903, -1741, -14662, -3870, 28514, 38234, 35083, 31873, 29475, 15664, 5366, 12580, 23064, 20548, 11407, 9427, 4460, 9630, 21070, 6955, -10787, -18099, -10835, 1955, -788, -6038, -362, -1415, 4918, 10790, 6434, -11665, -19590, -19884, -22696, -21229, -14917, -18422, -25905, -25016, -14875, -6680, -15533, -28520, -18963, -6293, -706, 4671, 4389, 7487, 4349]
14466D349N221L113o403q264K728m060l346L447J7331m252p992J0878k131J1710
14452B2329R236r337r293L625k751r902m724M403M883J3812j417j1058j0531q479
14438i204P727N808p607m38N989l703j1181j1106O361M037J506j423K955j695
14424a1974N224P625n28O949l456J1884L241k061O842m254l340r789o084P563
14410G842J471r353Q622J5420J052R889j478j3678K962j0507p117J383M971l767
14396G712L179j2617j5698K876J1910j1940r514L067j288J6974k169Q154j0654
14383a0008k803m258J265K2354P121R274P083j0907n664o678K59k6298j1386J686
14369b8960K1229N629j7495N238M306o016J4404j1705k12M482J8467R247n836
$$ y = [4349, 9570, 12683, 6280, -1984, 744, -3316, -6662, -3215, 14116, 9864, 1872, 12750, 10619, 22329, 31565, 22228, 12935, 16560, 13809, 3907, -817, 3586, 8469, 22281, 20864, 9806, -725, -9204, -1477, 4331, -3276, -3714, 2275, -1428, -12609, -23715, -17354, -13317, -11811, -13234, -10279, -11974, -6750, 875, 347, 7296, 3840, 15724, 18965, 16904, 23746, 19492, 16152, 6363, 279, 7842, 9313, -40, 8582, 24002, 25054, 34943, 33465, 19787, 22749, 12242, 5125, 6508, 11479, 7712, 10891, -1726, -17424, -14548, -2638, -14578, -24092, -21025, -22313, -5339, -7508, 646, -10008, -12811, -17069, -15804, 6550, 13671, 22945, 30028, 19121, 13457, 6779, 7038, -19260, -30646, -28960, -7731, -2102, -19597, -14359, -10053, -16069, -1665, -13370, -13582, -9100, 9367, 18614, 12778]
14356A2778q2L479m877r501J4238o030j5162k723L491m830P864q08o499J0557
14342A895q496k352q133J0648J0525k11q57Q177m570l925j6047J0799J1471M288
14328A3212r471j0368J1993J9557R151l856j2711j2998q433k633J6970J6376m263
14315B2526j0674j2078L359k498k257N569o811L446K2849J4096r465k1053j0380
14302c371Q775J0806P027o876j5349j1295J8808Q571J629j7388j1823j367O634
14289e219J0362M446N509p145J2853m270m210l054m37l837l808N456K7437Q67
14275C4950k0261k149L771M228j754j29r297K038j7808j5065J3494K6273M721
14262B3012j1223n361j0704j0445O61M151R227J669L798P346m172O05j896j7077
$$ y = [12778, 12696, 16175, 11298, 1797, 16035, 10005, -5157, -7880, -4389, -9219, -1355, -2163, -8662, 1895, -6601, -8953, -17086, -6438, 4087, 3876, 3019, 11196, 6626, 2701, -13346, -2547, 8924, 13212, 3741, -6627, 5366, 24923, 34074, 30218, 17507, 4509, -3924, -6557, 10413, 26789, 22526, 11852, -226, 3133, 635, -1622, 3947, -2864, 582, 23431, 37527, 28062, 7009, -3371, 5404, 16210, 23237, 16361, 1012, -10283, 8525, 17096, 18725, 1337, -10486, -11853, -5219, 5143, 9589, 15098, 7953, 20806, 16536, 12326, 9272, 8835, 4998, 1190, 6646, 34083, 34950, 14689, 12540, 16311, 20539, 18785, 18656, 9359, 11397, -6411, -21476, -7982, 18291, 23012, 11789, 6428, -4276, -14721, -14060, -9909, -682, 987, 4785, 12131, 7959, 8564, 6668, -10409]
14248a0409q602J4444J8848J6824n886l0542J504J649J039j728P769J5858N696
14235B6464J25O787j3230k4879Q556K1416J3543k2607l2588l257j6259P426J9682
14222h821L834o42O505n558l263j549J693J0565m723o032k273J474K18k316N292
14207e596j0970j6781Q703J4019K3834O068k296j0707o534q47j0890Q058n592
14194i531l386J531J311r242J0588K4500K848q686m668O835m254J0902m469k289
14180A1990r447l563l359J8705K863j1633j2785l314L277j301j786Q798J1336
14167I781K2968K9516K1906K3476J030j7286k4753k0395j8198j614Lj2295o196
14154G943n32J953l592l738N144N891k00K614j3875n276R050l953q395k174J4366
$$ y = [-10409, -19011, -4567, 14281, 31105, 25219, -5323, -3819, -2170, -1131, -2859, 4910, 20768, 26464, 26589, 33376, 20146, -4733, 3823, 25239, 38782, 16175, -16413, -19670, -35929, -28503, -8821, -4987, -5629, 876, -4682, -7945, -9494, -7801, 2764, -1959, -7991, -10264, -8790, -8572, -10888, -5596, -16566, -33347, -24644, -10625, 13209, 19277, 16981, 6274, -260, -1107, -11997, -3939, -9531, -12917, -11386, -10075, -19317, -8729, 15771, 18619, 9933, 5265, 12100, 7846, 18748, 14279, 11990, 2543, -1020, -4379, 14326, 17189, 5556, -7229, -10543, -7266, -8567, -10353, -1555, 9781, 32749, 62265, 84171, 107647, 108677, 91391, 66638, 46243, 28045, 26431, 26434, 14139, 7943, 7411, 9364, 5772, 2034, 7178, 13069, 12869, 15483, 1608, -3668, 5382, 1429, -6966, -9140, 5226]
14139E226p15l114M913N011M979j1038m054Q301K1047j0629j8370P480K955n067
14125F925j3950k206j2130Q88J0897l662l416K4508J2020N79j3692j3816P047
14112hM676q354j937n959k137k597j0065k0443L373R622N663Q451J0243m674N075
14097i071J1273O802M035L792M877K151j082j0530j6358J2260k672j5366k607
14084a2496j870p16J3349j1661K737J9232L048j9623L797O837j0296m672J1313
14071a021O111O89N516k943O824l741j1996j1952j930j99J7615J1919n763p873
14057A256R625J2443j5251n269N49J948M382j330q429j1799M326L863j4873K0110
14043A551J4706p441J715O990j3873m545n75N778q05n847p764r861m613j4403
$$ y = [5226, 4511, 1397, 6310, 11321, 16300, 5262, 1208, 9509, 30556, 19927, 1557, 9037, 11992, 6925, -7025, -9231, -21361, -20473, -9576, -13238, -16654, 7854, 19874, 20453, 6761, -7055, -8, 4668, -3686, -5623, -11582, -13719, -16316, -26381, -46824, -43451, -33829, -28166, -19715, -9472, -14146, -9071, 2202, 9004, 13039, 16831, 21708, 23859, 22777, 12247, -4111, 8149, 5477, -9889, -12496, -14366, -15082, -1733, -13394, -10657, 8575, 11623, -8000, -4203, 2634, -7662, -12334, -1021, 5090, 5779, 11295, 8352, 15176, 11435, -561, -12513, -14443, -14642, 2973, 14892, 9129, 1256, 10881, 23324, 8073, 2804, 3353, 5301, 9683, 8353, -76, -11875, -7549, -3686, -18559, 1551, 16257, 8816, 10531, 17521, 3648, -897, -1472, 4306, 3501, -2346, -10110, -19971, -24584, -38987]
14029c8987P680J2574N822N181K683q458J1499M979l484j6022J587J9441j250
14016C245j3942O864J678k924j2794L417P540O125j6517j0432J294K771R964O271
14002g440r059J437J0343R866k392N04k739r304M571j281J922l733J2813J1444
13988A6952k174j3304j9002K5300Q152j1443j0608o567N223j0887J195M463P477
13975e223J455j0689j39L883J3581j220r374k580r295J559J530Q657p51j2367
13961b0973O408K5415O861k2914n714J4068r871r263r056n756n30q597k471J2998
13947b9395L5170J6167j0929P198j195j2430j0679J0743N529j2165K992O400J194
13934H600r288L763j1980p414K74l58K597P069j0774j1327J2390P681O246J8591
$$ y = [-38987, -31307, -18733, -12911, -7730, -5047, -13505, -2006, 2973, -511, -16533, -14946, 4495, 3245, -10697, -3833, -2155, -5079, -17873, -14456, -6916, -791, -17308, -27740, -26446, -23675, -13711, -7440, -16499, -15062, -4719, 5147, 2755, 3259, 520, -8784, -4213, -5494, -3572, -7305, 5508, 16952, 14778, 1474, -17528, 7772, 15924, 4481, -6127, -12694, -7471, -18358, -17163, -12700, -5223, -3768, -14457, -14596, -10713, 2868, 1648, -7726, -10306, -19601, -18042, -16512, -7855, -8606, -20973, -14565, 10850, 17711, -5203, -10917, 3151, -6720, -15983, -25039, -30795, -31325, -39922, -42393, -29395, 5775, 21942, 11013, 18211, 17016, 4586, -6093, 4650, 10179, -1986, 1006, 7406, 8600, -688, 3075, -8905, -16319, -16045, -16403, -13806, -6737, -17511, -28838, -16448, -8767, -2521, 16070]
13920A6070J4687j3673q121n369P703J5647r586k835J296l755m844J0675Q249
13907B6144k2414p230Q290J435J3273l309j7604q580J0290J0666p06k4144j6607
13894c0496J0616J1298J2683m818q934l006K5447qm706j8520j0931J6190J1694
13881F509J8375j4629j1205l944O379J886M669k925j2928l611J060R119J3924
13868A2679l419r872N60q779L082o281j0046j892J1064o794q790K0078R737r705
13854h378J549J1235K754P027r372j3513N432k77Q790N188n813L921R693J797
13840B0033j5227r568J2458k164j512J3091r884r275l53m760n18l199M117L811
13826b950l3j995m069p893O45J975O57J528j3661P309K2882N717r902j0409m177
$$ y = [16070, 30757, 17084, 8963, 3594, 11297, 26944, 17358, 14523, 15819, 12064, 7220, 17895, 26144, 3730, -3500, 4790, 6225, 19498, 16189, -1415, -9995, 295, 10961, 10255, -13889, -30496, -19880, -8582, 4101, -717, -9651, -12657, 12790, 12782, 8076, -10444, -21375, -5185, 6509, 24884, 10255, -950, -4894, 1485, 3371, 8040, 5115, -7813, -11424, -10364, -1245, 12679, 9260, -612, -52, -8831, -5749, -12030, -22076, -23968, -12904, -19698, -28488, -8410, 1327, -8378, -6829, 4406, 7160, 14187, 4815, -8698, -3266, -3543, 5247, 10435, 4622, 8543, 18236, 20033, 4806, -4762, 7696, 5532, 4020, 17111, 7227, -2048, -2401, -7161, -7679, -10878, -6761, -2950, -2983, -4978, -9047, -16940, -16295, -14320, -13663, -12135, -25796, -18487, 4395, 10112, 210, -10199, -14376]
13811a4376p289r904J9238Q882J79L41j0885J1363J6944j6502o916J3422o864
13798b367o816P927P559j1065m895K3425J3661j5191j8463j0283j2622J9069P587
13785b474L437R531O944R847L585q492p901j3314q007J519P591L687L293r669
13771d23K452j621K442J9630k722j9960r777K133k686L447J85J1873j1830R279
13757B422K1225P347k6021j2364m456p908J646J6508M105p360j8757J0050K6352
13744A2789j0107r45J1342j0794N477L828Q041J1798j6003o496N673p879J3643
13731B0367P859L443l992n15k732o171k4675J549P312J0653r452j7568M448J0577
13717A103K94p908R231m176j1259J3721J4950j5638q899P525J2019k093L510O293
$$ y = [-14376, -21665, -31569, -12331, -3449, -3270, -2929, -13814, -2451, 14493, -2009, -8925, 4497, -2367, -9183, -1256, 6303, -4762, -9657, 13768, 27429, 12238, -6225, -16508, -29130, -10061, -2474, 963, 10494, 17438, 27285, 30870, 22378, 14477, 1163, -6844, -5325, 2266, 5953, 9246, -423, 2029, 408, 2850, 22480, 19758, -202, -9979, -7846, -10532, -7085, -6900, 4973, -6857, 2422, 23647, 30994, 4973, -7391, -11847, -19755, -18109, -1601, 2504, -4856, -23613, -13563, 12789, 2682, 1737, 13079, 2285, 7762, 11590, 19631, 31429, 15426, 8930, 14603, 6724, 20367, 28226, 31669, 27677, 27162, 24430, 18259, -6416, -4867, 2445, 13098, 3646, -13922, -9474, 1103, 1397, -6511, 2720, -1456, -12715, 1006, 15956, 318, -8581, -1056, 10963, 8870, 12380, 18673]
13703A8673m788L416J663m121j0014o300j3397K808O447m832P762J4696P61R397
13689B2171M415p50o115r322J6K964m987M36p872j8992L638O270m368J1161M971
13674C636J48q226N7J967J0002K0981L696j7138j5370N553L536k445n782l696
13660c081Q469j892j3929L211K4525R993j0596p225j1502j933m489J159J7765
13647A0475K134J615O31q379P769O843L617l986j730M791M55m773o217J5510n885
13632B2870j5050o596p32M385J0732o328n636J0919j520j7286n385P811J6877
13619A5061P811j3153j9858n625R00o361J0220J6334Q964q489j3515M067R05j5886
13605a8625Q425J0797k381j2737R68R256J8072m741j6401J5871p23j9686R36J3449
$$ y = [18673, 13885, 17301, 18964, 14843, 4829, -1471, -14868, -12060, -5613, -10445, -2683, 12013, 12774, 22171, 26586, 25836, 19721, 10399, 10415, 13379, 8392, 8828, 956, -18036, -14398, -8128, -12496, -1335, 3636, 3784, -4442, -4385, -2418, 7584, 28565, 32261, 15123, -247, 5306, 8842, 6397, 615, -3081, 5388, 3496, -10433, -7222, 17303, 27296, 16700, 9475, -2027, -3960, -8449, -7290, 10475, 12609, 14224, 14855, 6476, 14245, 21088, 24705, 20719, 18989, 23780, 24235, 19462, 13245, 28755, 22870, 7820, 1224, 492, 4877, 15609, 9281, 3645, 14564, 13044, -4242, -9627, -1816, 15061, 22872, 9719, -10139, -15764, -14864, -21225, -11005, 5329, 14293, 5804, -7711, -3644, -2739, -18625, -10200, 597, -1784, -14521, -13553, -4297, 13775, 9034, -7367, 8504, 7781, -11905, -10969, 2480]
13591B480O717n974j6291K0638J2922m92j1294m120j936l744P41J5149R242j131
13577B2907j1804j5144j3585j270n340q345P529J4044l771L244R556J776J478
13564A275j7063J0654P246r37q159j9848R938K5056J1050L414j529k279n792j1390
13550A636J0731K882j3878j0421N49J40Q099j2829n729P109L434J5673L09j2145
13536d440j5922N804P374L356R566k511j1278k932M534J2430p533J355j329J3102
13522A1576J6988o312k7372L390j033o895O342P257j78J575j3655q118J0621m685
13508a0499O770n805J0508M609p546J242q824M383O490Q610o26r923j0846p98
13494a2255J4891R255O854n505m005P63k903N424P285J604O694k4220m495K5320
$$ y = [2480, 9197, 3223, -13068, 7570, 20492, 20000, 8706, 4586, 2650, -1094, -353, 14796, 24038, 22907, 11103, -4041, -17626, -18896, -24236, -32581, -25052, -11008, -14779, -11535, -1979, -203, 1275, -15788, -5134, 2112, 1175, -6984, -26832, -16894, 8162, 19212, 22626, 21097, 18818, 13026, 1636, 12367, 15249, 1371, -9050, -8501, -8361, -262, -13091, -18820, -11711, -8277, 7396, 7705, -4440, -20362, -14558, -7184, -3828, 5738, 3227, -8051, -10983, -6449, 5981, -1552, -197, -1526, 11576, 28564, 22252, -5120, -1730, -2763, -9658, -3316, 3941, 3763, 5338, -8317, -16435, -5814, -10499, -3729, -9534, 974, 5583, -1963, -721, -9545, -5162, 1328, 9938, 9312, -611, -11457, -12255, 2636, 11891, 18745, 13240, 9235, 9998, 7095, 12519, 19804, 21408, 28102, 3882, -613, 24707]
13480B4707L294K389l126j1209K932l145r345n651j4514J802M982K8312Q785j0447
13466A9766j0107L329O74m422m496L614M900N422K972p574j6720r270m276L3O487
13451i668O617J1324L126j27k586j1573r478p675N064J1638J4325Q043L137q796
13437A3371k333K617O664N829K965o038j1465o346k20R12j2877p268n69L948Q019
13422b791n806m318R846p209J3736J2636k855o246j792o02O551K5883m007l7966
13408d940p332O261p079n630J2073J5702J927j2447m093K5059R522l740o874q327
13394A0082r916r454j335J1932K872Q891k306L784M070P025k213J334N136o891
13380B3011n802l414l629l381n681Q721R664j8006j793K3585k297n881j2186j0968
$$ y = [24707, 28001, 30390, 27264, 16055, 18987, 15842, 6497, 846, -13668, -11866, -6884, 21428, 30213, 19766, 9659, 12988, 13662, 9240, 4744, 8358, 13258, 18680, 21652, 14078, -2642, -11912, -16188, -16155, -9668, -3051, 8273, 11399, 11272, 8686, -2887, -12365, -20040, -14976, -3338, 10987, 19030, 22167, 13371, 11038, 13655, 20319, 26148, 29113, 23075, 11610, 5264, 5044, 5956, -6921, -14189, -14758, -10810, -2791, -8597, -12915, -3069, -10278, 3458, 16094, 13239, 6993, 5201, 4599, 11150, 37033, 33026, -4940, -12272, -6011, -13090, -18720, -6647, 9055, 10982, -1465, -5558, 19501, 29023, 25283, 18409, 10082, 166, -9288, -10623, 1309, 4181, 13072, 10766, 14550, 18620, 25645, 23432, 24766, 29902, 23011, 17209, 13795, 10166, 6785, 1104, 9825, 19489, 1483, -310, 23275, 20978, 15097, 2911, -8057]
13366h057J972J055q207o243J6810K068j0965L883P745M408M41k673J6519m188
13352A4568M82O256M824j0408j2382j0881J1180Q484m902N510J0948n688m96M930
13338B2425P173j0099j2493Q270K446j3609m130m178Q60J7090K1832n63k4842
13325A0182k6037K708J8659O201l717N082l330J112R165L999p581k2672k606R455
13311F20k458L082N13j0651j0030N846Q105O01n992j614P124l42k25J345J464
13296b612R744M450O960j0292r990j4473l773J2401J1748m103k722K471N483M129
13282I421j3743k6708K382K8267J5116R758J0977O04m290m780J0717l174k3275
13269A1272r178J016o051N762R245j2672q52Q662j5162k661J3751K938J255k345
$$ y = [-8057, -6085, -5030, -13237, -19480, -2670, -602, -11567, -7684, 61, 4469, 4910, 2237, 18756, 14568, 15050, 21306, 26130, 15722, 3340, -7541, 3639, 12123, 7221, 12731, 23679, 17991, 17495, 22425, 29598, 19499, 7006, 15276, 17722, 4113, -17, -4195, -3335, 13755, 35587, 35024, 10182, -15855, -13147, 5512, 11713, 7996, 13078, 9748, 10860, 20025, 24024, 16443, -6229, -8835, 620, -1838, 1244, 1757, -8894, -18924, -13078, -4973, -4372, -10364, -11978, -4854, -5196, -5421, -4076, -2612, 7132, 11582, 18542, 8250, -1740, -16213, -19986, -7585, 4163, 60, -2662, -191, 5292, 9421, -4322, -31030, -28648, -381, 14735, 24493, 35470, 36074, 31784, 27004, 37721, 34547, 11272, 2094, 3110, -2941, 2821, 12066, -606, -1458, 7204, -7958, -10619, 3132, 6070, 7325, 4980]
13255D980m923n186L213q09j0275N611M703J288P376P036n647J5300k0679k2035
13241b0047P081M469k715J3787J8682l621k1525r401Q436J4677n101l976N278
13228F024L274j9863J909m465Q647K130p081J3938p064k2178J386J275j0127k48
13214c2443J4301J0130p762j0143j7738J336J2156l596l402J7570R582K647M135
13201c227J1341P046q211p081J0488k370L14J76M115n756j8732L690K0057J3086
13187B4936k374l870j2919j044N029j0264p308Q273J717o848J728K262O148k030
13173C436l119Q002K650K971o857J819J1648k460Q103J806j1759j626P991N713
13159B8318Q776q067j4772n551l945Q30J7561J0196O38j574k6559j1599p423j127
$$ y = [4980, 57, -5129, -1916, -2725, -13000, -7389, -2686, -1398, 5978, 13014, 7367, 22667, 1988, -20047, -12966, -8497, -11212, 2575, 21257, 17636, -3889, -13290, -4854, 9823, 4722, 746, 6024, 9298, -10565, -8656, -13121, -4474, -2344, -9425, 4513, -2551, -24729, -23343, -22068, -32195, -32443, -18142, -8012, -15774, -25917, -43655, -42319, -30163, -33759, -37161, -19591, -10009, -7362, -3227, 8114, 15160, 6949, -132, 10356, 7986, 8300, 8476, 12591, 6835, -11897, -8207, 11850, 24936, 22562, 18692, 5773, 4729, 9758, -506, -7814, 459, 2176, -4672, -2944, -682, 5466, 3436, 317, 8319, 10969, 13940, 7083, 8902, 20550, 18090, 26193, 27999, 16240, 14614, 22605, 28318, 37094, 29027, 14255, 8704, 4759, 5589, 23150, 33346, 33984, 32410, 5851, -5748, -13171, -14298]
13145a4298o738Q77J148J9249j2356r931J1646O779o717P03L498O851O542n620
13131A633p67P267M869N66J7L93l2190k0940K7176J4347p659r753J6990Q627j1031
13116d55j0408o424J749j529J1091K620j382K76M496J7335K976M148q972l827
13102A1694K746J0992K76j4062q590j1112j139J1698l885J946K0134Q766k7296
13089B168m025M435P198o583o284j5045RJ7598J2659K113j6865o465k600Q981
13075b706k634J4829J3318O487k099r834m112O294n478k358p457j3714O511L03
13061b650K432n707J907P025K261q189o286q137o189m888K0460J9924k00l406
13047H357O946l259p387K333N186l192J692k362M579O005m309n945K123K3K189
$$ y = [-14298, -21036, -20159, -19011, 238, -12118, -22049, -10403, -3624, -10341, -9638, -6140, 711, 7253, 1633, 866, 8133, 13002, 13568, 13585, 13978, -18212, -39152, -11976, 2371, -5288, -15041, 1949, 10576, -455, -10863, -17287, -15538, -17067, -5976, -3356, -4738, -4462, 34, 17369, 20345, 24493, 15521, 11694, 14440, 25432, 25708, 11646, 3056, -8056, -9195, 2503, -1382, 564, 20698, 29464, 2168, -1857, 2578, 9776, 3193, -3091, -18136, -18127, -529, 12130, 14243, -2622, -9087, -11687, -2706, -5340, 9489, 22807, 29294, 27195, 17361, 13249, 19543, 14065, 11707, 4250, -9464, -2953, -2650, -218, -5925, -4018, 3007, 5268, -2921, -9207, -17344, -23533, -28421, -7961, 11963, 11763, 8357, 15303, 12044, 4657, 6990, 12176, 8984, 10676, 8314, 12893, 18898, 14589, 8644, 10767, 10790, 12979]
13032A2979J0011r875q630P46k925N1k192J2033j1965M160k935p185O569j2245
13018a1403p014J4677J6187Q78o428K549j889J153K649r419K664J5506O982j1964
13004A5128j3543k932O875j621n540M76Q277J3063j763J143L264M016M004o335
12990B4512j3497j4264K717P189o346J1791m470j2170p80j1168J7155P382r161
12977a110j0049K057j230L952J071M178j1808L431Q575J2739j1570p914q29K4441
12963A5934m001k876q840q450O213R398j2727j6592K694J805m991J295N245N115
12949a0778O924J628R040L543q477J831K047J7174l113l17j6092M074N614J5091
12935B8189q162k5480j599n442Q20J2006Q086j4409j0815k54K238N933O144j0687
$$ y = [12979, 22990, 13115, 4485, 5231, 2306, 2357, 165, 12198, 233, 4393, 1458, -5727, 842, -11403, -18417, -3740, 12447, 13325, 6897, 9446, 7557, 8710, 11359, 1940, 4604, 20110, 27092, 15128, 1585, -1347, 5528, 3907, -1633, -1157, 7120, 20183, 18420, 19563, 22827, 26843, 30847, 24512, 11015, -3249, -532, 6657, 311, 12102, 7632, -4538, -5318, -16486, 669, 8051, -1110, -11159, -9102, -10332, -6380, -5309, -1131, -12939, -9508, -933, 11806, 236, -7678, -8507, 15934, 11933, 9057, 217, -8233, -2020, 7378, -5349, -21941, -19247, -17442, -22433, -21138, -15893, -10778, -3854, -2226, 6814, 10357, 1880, 3711, 5758, 22932, 19819, 19502, 3410, 7484, 13098, 28189, 20027, -5453, -7052, -12494, -11674, 332, 8418, -5991, -16806, -17060, -14822, -8889, -2745, -13432]
12921a3432M236J7058K783m239J9690R786n274j5493j985q28J3340m979k0717
12908e4J979J9247J0698r309j611k0900n882J7464j2148j0917J315J7865P346
12895A5093j8863k2516Q903J0285j066r92J4714M362L516j1339j4708j8135O833
12882b3913M933l79l308p545J1328J7685Q124j4507m541J1684N049K663L996Q47
12868A2116n408k5o067m405J9812j392m302J0546p220K51K491O140j1378p313
12854C846Q509j8516O330K682R25L19j0011N481L578o429p716j1131l891K0887
12840e137M652J2841n971j7494m031Q671k433j854J3878k987J895p476N999J4782
12826A5335J608n465n724K193Q249k336n204N811k842k579l984k238Q048J3315
$$ y = [-13432, -9196, 7862, 10645, 6406, 26096, 35882, 30608, 15115, 13130, 12302, 25642, 20663, -54, 1925, 21172, 31870, 22561, 20950, 50, -5832, 11632, -516, -11433, -10118, 7747, 15093, -3770, -26286, -17383, -7098, -8164, -9156, 5558, 9920, 13436, 2097, -12611, -30746, -23913, -18980, -19359, -22667, -30212, -18884, -1199, 6925, -7582, -12123, -439, 4610, 7273, 11269, 12116, 6708, 6683, 616, -3789, 16023, 14631, 10329, 20875, 13655, 13906, 16397, 22537, 11159, 3846, 12355, -6161, 169, 2851, 3776, 4095, -5916, -435, 3143, -3286, -11002, -22133, -26024, -5137, -485, 12356, 6385, -11109, -15140, -6469, -8902, -10756, 3122, 135, 2030, -5446, 553, 15335, 16943, 11478, 5754, 7947, 16196, 13860, 8656, 14467, 11625, 9046, 5062, 2824, 10872, 24187]
12812B4187m54m511j2757K85J477k777K296j5818l336J1481L114l301m289p154
12798a1557L834J0318K202r31J1869J2267m119m650r56j2586j1558j4972j2238
12785c3077P181K0691K857j2269J4764j1092J0772K3875J0887j0488n432p61R243
12772B7151n440j1427l502q619J0882J4164j741o980K212k807J522p819K864L827
12758A4287j0598j2675k079Q146p628M289J2149J0966J5700r283M033J259j0491
12745A8075j2969j1930J8549J3731N648l697j2161O738m561o336K801n146j711
12732G031Q664K540m328j6333k8489l743K0794J0698P779P284q072j6011k962
12719a5148P52J0859J225L203N890j005M286p696P069n633j5278K550R148O608
$$ y = [24187, 23733, 19222, 6465, 6750, 8227, 5450, 7746, -8072, -11408, 73, 3187, -114, -4403, -11557, -7723, 2595, 4797, 3866, 15735, 28002, 23883, 19233, 18277, 5691, -5867, -20839, -33077, -25896, -5205, -2348, -14617, 147, -10945, -173, 23702, 34589, 24101, 18669, 17908, 27151, 21711, 10284, 6782, -1837, 9045, 23209, 21468, 14488, 16700, 13893, 15415, 7596, 10460, 14287, 3689, -8986, -11065, -2919, -10547, -6258, 5891, 16857, 32557, 23274, 27307, 28566, 18075, 5106, -6824, 11725, 25456, 31104, 27407, 15246, 21984, 17423, 11087, 13888, 8742, 7031, 15695, 18235, 13907, -2426, -30915, -34658, -13864, -3166, 4613, 11897, 3825, -12186, -15148, -14396, -3537, -2312, 891, 6781, 5776, 10062, 2366, 9435, 3802, -11476, -8926, 222, 6830]
12705F830q187j5055N532q57j486J4054Q876J090p971j9142j0281L2429J1985
12692A7817j913R526k930r653j4923R18J3223P467M385k776j5256k117o826R350
12678F292k881R94j3626r757J4781p06N756k893j2000R225P656O204P005j1148
12664D902p142q400J321Q544K468L331J1573p098k0242m751n857N466K8410L49
12650A2874j4541n423n962P570K1385M730o440k970k661o745M918n14J52K1801
12636B8174N216q904j0733R14J6995m477M18P592j7513J2163L588r586j750k2443
12622c46p518m806K181K2807J1519j677j8981j3441p550q587P158K3302J7316
12609B1377r824j1944O47J0083m044j6781n193L455K299J8515m515j1124O652
$$ y = [6830, -1357, -16412, -10880, -11737, -13223, 831, 9707, 10797, 2826, -16316, -26597, 5832, 17817, 15904, 25430, 22500, 12847, -2076, -1158, 12065, 19532, 23917, 21141, 5885, 3768, -3058, 6292, 3411, 4405, -9221, -18978, -4197, -4903, 853, -2040, -14040, -4815, 2841, 9045, 16050, 4902, -2240, -10640, -9319, -775, 1693, 5024, 16597, 9499, -10743, -15494, -21351, -15885, 12525, 12874, -1667, -7090, -13052, -5482, 15903, 20633, 14193, 11223, 8562, 1817, 6735, 6221, 6373, 28174, 33390, 24486, 13753, 14667, 31662, 27185, 27603, 35195, 17682, 29845, 33433, 23847, 22097, -346, -7864, -12670, -10489, 12318, 23837, 22160, 3179, -10262, -17812, -26399, -19241, 4061, 21377, 11553, -391, 256, 10339, 6295, -10486, -15679, -12224, -9925, 8590, 4075, -7049, -397]
12596c97o258k548l587R447Q294L437n87j8099k034J7185K2878j2340p348J0487
12582A8530J569J1731l279k633j0653j1161n750J2839J6182l741k2002j8462r667
12569b6497J1664J1504N714N855J7531R890j3296j1457n291l706P318J124l224
12556G129p009P982J901O506m215J1264O479L188Q135j0880j2835N984p661j6685
12542g17r168m562k020J0005N520Q930n093n294J6644P750n078j440M795N74j0457
12527A0389j8485J47l246P523J3444J668k779J1581P856j4245j0262R359J47r690
12513C407n113J2309J0485p066k683j042k356q37j576r811O558R896J3583j3760
12499A1994j2817j1463K420M285k176j3366O589J6192j209J631O791K340N457
$$ y = [-397, -6655, -9203, -12790, -3343, 4951, 8388, 7801, -10298, -12332, 4853, 27731, 15391, 8043, 18530, 20099, 31830, 28551, 25918, 15265, 4104, -1646, 11193, 27375, 23634, 1632, -16830, -26497, -14833, -3329, 2385, 8240, 25771, 35661, 22365, 10908, 5617, 1911, 9229, 10353, 7129, 120, 8102, 10003, 16509, 12294, 23558, 30037, 33225, 41360, 30480, 17645, 23629, 15968, -717, -9885, -14447, -16467, -6462, -942, 7988, 2895, -2399, 14245, 21995, 16917, 15477, 20272, 20846, 10389, -8096, -7949, -11195, -3672, 9772, 11440, 8661, 20242, 28098, 13853, 3591, 12950, 13097, 3407, -1706, 10603, 21088, 14022, 11339, 10297, 7941, 7104, 5528, -4283, 2275, 12171, 25754, 11994, -823, -12286, -9866, -5581, -7757, -21123, -14534, 1658, 449, 2080, 8871, 11211, 16668]
12486A6668M68K269j166R564l2658q232N487o94L872q38J7957Q912k123j532j0222
12471G732j0465p126p329K3940P18j4656n152J4492J6704N81K852j5090j9285
12458a2084j2554L56J4427Q759j4253K216J0818J0453J1601j071J34n721K413
12445A5494j1457p555L523P369J1670J1886J513j0405J225k36j654J019m860O610
12431B4142p190j5370p627o909M791J6437N030k714L449q58o140L644J091p880
12417C896j6596l430q12N567K0002p914o130J643J4656J475o951M716L77j785
12403H714j17L207J5003o146n325k64K086Q045j9574p598j565L219M733J880l117
12388C181M703M267m871Q986J3065Q744k442j3062j1376K678l295j9327J35R258
$$ y = [16668, 17136, 19405, 18239, 27803, -4855, -13087, -7600, -8294, -4422, -5260, 12697, 21609, 19486, 17954, 7732, -2733, -9859, -17188, 6752, 7470, -7186, -12338, 2154, 18858, 19439, 22291, 7201, -12084, -24638, -24282, -9855, -1096, -15349, -13133, -2315, 8138, 19739, 18668, 18802, 13081, 15494, 4037, -3518, 5, 7374, 19044, 30930, 32443, 22038, 23263, 23027, 21373, 22392, 17532, 24142, 16952, 1582, -6045, -12954, -8163, 8274, 13304, 10590, 14039, 13181, 7041, 10685, 11776, 3896, -12700, -16130, -16942, -11375, 8627, 713, -5417, -3774, 10882, 12357, 5406, 10122, 10499, 8714, 8597, 11804, 26807, 20661, 15336, 15072, 17158, 25203, 5629, -1969, -3534, -315, 4418, 6298, 3181, 7884, 12151, 7280, 16266, 29331, 38075, 35633, 22571, 11195, 13873, 10578, -8749, -8614, 644]
12374F44P917O012N790N578O542r838j8275j0283j1781J5810K4655L816p874j7171
12360A542o389L368J3524J0326L961n080r841Q454j0397k3811k753J6846M719
12347D469q71L686l647l844n59o774J2343K0413J0979k6116o562L91m529j0563
12333a1184q159O781J0557K3323J4057k4712l1391J2455J3091J2098n651q232
12321C033l711r651R216j7571M393J2912Q642J4140O591j2102j5765o379l75J2028
12307E401O863L13j1857m055J0645J7185o938p907n068J712K380p587l806r264
12293a1983k610R009r2O601Q015J307P701L149R540k159j870j7533M792K417k631
12278A3653k882l356N017O979n370L156L648P65j4733j2821k834Q730N295R858
$$ y = [644, 8561, 14573, 20363, 25941, 32483, 22645, 4370, -5913, -17694, -1884, 22771, 26587, 18713, 1542, -4847, -1479, 12045, 22371, 26332, 21252, 11411, 19865, 9468, -14343, -17096, -250, 4469, 3598, 7284, 3637, -207, -766, -7540, 4803, 25216, 36195, 10079, 3517, 3908, -621, -11184, -19343, -12562, -2005, 21318, 35375, 10663, -20728, -8273, 4818, 16916, 11265, 3033, -678, -10329, -1113, -18684, -14291, -1379, 7263, 21403, 27994, 15892, 127, -6252, -6627, 5401, 12264, 12577, 720, -3335, 7310, 24495, 17557, 9650, 4582, 6294, 8674, 1087, -2719, -11983, -14593, -5584, -5676, 925, 8940, 10247, 17948, 21097, 30637, 28478, 26608, 9075, 13867, 16284, 13653, 10771, 7415, 12432, 19411, 14041, 17197, 20845, 21610, 6877, -5944, -8778, -48, 5247, 15105]
12264A5105R445l208j4652k0121m305J3383K262k465l90j3732L86J6967J1774
12251A0449o713l037n545p841j682J8762J3313n199r997m062J2959o881P551q84
12237A1193j6180j279K256O256L595N6m571k048j131R13N630K6145n926j9150
12223E759p267J0394J312q676n514J0135m892l870J161M3n629k135K560J4472
12209G853O537Q805Q744J876j2242j6199O940O074j649J0400k424o450o634r27
12195A0704K1871O578j6050j2054R153O191j3330j438J4116l967o500L923J1802
12182C0999P601k4504j9277Q044Q365q272J1993Q442j104j1945n947K303Q455
12169A5153J8997J939l771n321J0691o967L900j3836p471O271L39J011O021N14
$$ y = [15105, 24550, 21342, 6690, -13431, -17736, -4353, -2091, -4556, -4946, -18678, -18292, -1325, 10449, 3736, 699, -4846, -12687, -14369, 4393, 17706, 12507, 2510, -1552, 11407, 4526, 12077, 11193, -4987, -6266, -4010, 2246, 5841, 5897, 1326, -722, -1853, -940, 4690, 30835, 24909, 5759, -1508, 8886, 10198, 1522, -3992, 6143, 1251, -2619, -1458, -1415, -7044, -9179, -6619, 7853, 14390, 23195, 31939, 33815, 21573, 5374, 12314, 18388, 16739, 27139, 24715, 18265, 11631, 10704, 32575, 39153, 23103, 11049, 20202, 26393, 13063, 11625, 25741, 21774, 15274, 19197, 30999, 38600, 14096, -5181, 2863, 11228, 2956, 14949, 23391, 22287, 10342, 4395, 6698, 15153, 34150, 36089, 32318, 26997, 37688, 30721, 34621, 20785, 13314, 19585, 19924, 20935, 26956, 27470]
12155B7470Q95Q86q686r148J7472J968k1908j6826q76K3364m92r067r340N241
12141I53R581J0397Q496n219j0516k0175M451j3843J3895J6160j2328o487Q352
12128C717o419k2623J3979K0652J5203r853m160R66p098j899J0515P977N324l295
12114B2986M22O671P659r955j9381j5408m237N634K0074R055j3474j091K6370
12101C5325J8416J1806m381l2683j276J1442P33m130j8009q965R23J102j928O353
12087A4728l001j14n754M760O949P889K298o220j068l404L331o945r276K607K985
12072I765j9334K4847L5661O80k2496j6579L669N650J9135k758q528j6735j3407
12059d30K588J5988N679K400R378J147J963O926J776j7068o878m023q843m824
$$ y = [27470, 28365, 29251, 20565, 11417, 28889, 30857, 8949, -7877, -8753, 14611, 14119, 5052, -4288, 953, 10534, 20931, 29427, 24208, 13692, -6483, -2032, -15875, -1980, 14180, 1852, -4635, 3717, -2702, -25325, -11346, 9306, 24509, 14656, 10496, 11462, 4364, 2465, 12980, 20957, 26281, 22986, 23408, 30079, 37738, 27783, 8402, -7006, -11243, -5609, 14465, 23520, 10046, 8955, 35325, 53741, 65547, 61166, 28483, 27207, 38649, 39382, 35252, 17243, 8278, 9201, 10303, 8375, 14728, 11727, 11613, 5859, 10619, 17568, 25457, 27755, 21535, 20467, 17063, 20394, 13449, 4173, 6780, 9765, -9569, 15278, 50939, 51619, 29123, 12544, 16213, 21863, 40998, 38240, 29712, 12977, -430, 2158, 18146, 23825, 26225, 35603, 36750, 38713, 45639, 47415, 30347, 23469, 19446, 10603, 5779]
12045E779k0138j0343K464K4685J2379k0081l758j420K7493J0387L190l032m475
12032B3130j2896j6615j829P754J8380J650J816O326K315k5153M208J3782M795
12019B7663q941j6503l949l627J3013P723o76j835r837M301L91M343N839p325
12005A0580j5013l17P179N928J0582J1107O432L804L591j2018q592j2623q101
11992B539o763j567M136O882m657m435O2P516N556J8920l882j3619L533Q567J6888
11977C9676q964k6903j1838l19n486J6184J2873K3357n224j0014J934M610r344
11964B0542j6578p510l310J9129j1169O44N572r176m564J3684j249N705l173K714
11950A1261m334o850q283O228R485K134l412P508O755j884j9711j6696r775J3966
$$ y = [5779, -14359, -24702, -22238, 2447, 14826, -5255, -9013, -10433, 17060, 27447, 30637, 27605, 23130, 10234, -6381, -8210, -456, 17924, 19574, 21390, 27716, 30031, 4878, 9086, 22868, 27663, 18722, 2219, -1730, -5357, 7656, 15379, 14703, 12868, 3031, 7332, 7723, 12066, 17905, 10580, -4433, -4750, 2429, 8357, 18939, 30046, 36478, 40282, 43873, 31855, 23263, 10640, 2539, -4224, -5791, -1655, 5227, 570, -3865, -3803, 3713, 9269, 28189, 24307, 10688, 14221, 22788, 39676, 30712, 3809, -8029, -8348, -13834, 2350, 15223, 38580, 33356, 23342, 25276, 29886, 20542, 3964, -3546, -6856, 12273, 1104, 1748, 7320, -1856, -6420, 7264, 6015, 11720, 8547, 11261, 6927, 77, -8206, -1978, 7507, 9641, 6229, 13737, 20492, 18608, -1103, -17799, -27574, -13608]
11936a3608J7835O214k944p59j5733M73P125K799K414m76Q165O414M367j414o667
11921A4205j4085M29J4760m408q352o984k803l655l307m291N055K6358N25j1945
11907A502K854J1558R77J12J835R116k551j960l491j626O578P86j9523j1358J3304
11892H113K9151l97j9562j3707j6294m842o27K0296J9590j8861M625J6003l089
11879B0399n402M522J759j0713j1958J793N175K1578J7799j3317p856M456O885
11866C5120k298q578n74l071n532l895R596J9806J5619q671o661r55r575K929
11852C3260J6283N105L371n757k7915j0188m018P131J1382p447j639L709N347
11839B8624n35k252k963j566O392O348j641L58j8279j3548L619J2185J672N635
$$ y = [-13608, 4227, 10441, 7497, 6738, -8995, -8522, -1397, 1402, 3816, 3340, 11505, 17919, 22286, 20872, 14205, 120, 549, 15309, 10901, 2549, -4435, -7238, -10893, -14200, -18491, -13436, 12922, 13447, 1502, 4356, 15914, 16891, 17003, 18838, 27954, 25403, 23443, 19952, 18326, 24904, 25690, 6167, -5191, 8113, 37264, 36867, 17305, 3598, -12696, -17538, -18165, 2131, 21721, 2860, 7485, 23488, 20399, 14997, 19519, 21278, 10565, -1393, 400, 5575, 27153, 44952, 31635, 23779, 28235, 35120, 32822, 24244, 23670, 20599, 15067, 11172, 20768, 40574, 56193, 47522, 40861, 39906, 30331, 33260, 49543, 54648, 58019, 52262, 24347, 14159, 10141, 17272, 28654, 21207, 19568, 23277, 28624, 28089, 25837, 22874, 21308, 27700, 34048, 32407, 32765, 14486, 938, 4557, 16742, 18414, 24049]
11825B4049J8160O170o7k2053k767L590m440j2577j844L834Q720k707O758k323
11811B2503q586Q01l270M879j4678K860R532J5755j758J0578K2737P755j8230
11798E0878j7436k977k781j4775p343J7758M835N30Q222O912r209j2K89J2372
11784D7263q9j1470r708j3228L740J1701m865N843J4477L598j0759J631k0044
11771A8090j5789R932R422J7556O063k1752l785j6813K023q879j315Q018J318
11758D089P490O912J0390l461K078l789M475k554J3609j0918j7476q093J0666
11745A3418J8245P843j1078P160J012l871M702J4240k55j5321r505Q527k0461
11732A4656j5672n408M230K2768J5285L008M22J625O513p943j2251l616J3656
$$ y = [24049, 42209, 48379, 48312, 26259, 23492, 27082, 22642, 10065, 8221, 12055, 20775, 18068, 24826, 22503, 13917, 14718, 11448, 16327, 1649, 4509, 14041, 29796, 28038, 38616, 61353, 69108, 50878, 33442, 30465, 27684, 12909, 5566, 23324, 28159, 28689, 36911, 43823, 34614, 34602, 34891, 47263, 47174, 35704, 25996, 12768, 16508, 28209, 23344, 29187, 43664, 47262, 36503, 38134, 18090, 2301, 12233, 21655, 39211, 45274, 23522, 19737, 2924, 4947, -3932, -5247, 2771, 4089, 11579, 18491, 28881, 25420, 27498, 23709, 28184, 25630, 39239, 28321, 10845, 2752, 13418, 31663, 39506, 28428, 35588, 36600, 32729, 37431, 51671, 51416, 36095, 26590, 35117, 14656, -1016, -6424, -2194, 20574, 35859, 38867, 39289, 40914, 47427, 39484, 27233, 23617, 37273]
11719C7273P725j7962q456q388k363j936N74J0534K2015Q006j0193k925q154N61
11705B6311m712M125J0992O336j3135j5741k566R710P48p92n840l289j839J0400
11691B0708j828j4484j9272j7416J9193K6892K1720J0911j819k3548o985j389
11679A2683J57J0188K003k549p847M48J0029M41k162J159J4391O740O460j2660
11665C9481N576Q918L447j580O088Q025n362p856k730q920j279J5419j296q693
11651D9238Q88R191p672j0222k3962n69P693J4924J0027j6800j0590k990J5392
11638C4548L721r407J5571M187l974p17O121o301J0000O064n676j1267J3807k038
11624E4639j9580j0433j1183J3080n147n828M297J3412J2850L542k167R421O10
$$ y = [37273, 44998, 27036, 18580, 10192, 7829, 5893, 6467, 17001, 39016, 47022, 36829, 33904, 25750, 26311, 21599, 25724, 36716, 43052, 29917, 14176, 11610, 21320, 22068, 21276, 15436, 12147, 10308, 20708, 18880, 4396, -14876, -32292, -13099, 13793, 35513, 46424, 44605, 21057, 14072, 12683, 12840, 23028, 25031, 22482, 14635, 15083, 25112, 25553, 23391, 24550, 38941, 45681, 52141, 39481, 45057, 53975, 57422, 55842, 61930, 69955, 64593, 56737, 54007, 45087, 43808, 59227, 57931, 49238, 50126, 59317, 51645, 41423, 17461, 16892, 24585, 39509, 49536, 32736, 22146, 19156, 34548, 38269, 28862, 44433, 48620, 44646, 43929, 50050, 43749, 53749, 59813, 54137, 42870, 56677, 54639, 35059, 24626, 13443, 26523, 21376, 15548, 19845, 33257, 46107, 49649, 47482, 56903, 57513]
11611E7513j3907j2894J0589J2278N079j0672j0019L227J2209j104k7893q4J3919
11598C8241j0113q886Q662J4506n361m145m468N481M631L399J0300o096M959r599
11584D1511o912J384J1276j2058k0080l874K496J3047M844J530o529j5325p71
11571A0539J0524L515n138O623j0157N895Q9K889k08Q200N71o71m107M236K102
11556C4902O00j7637J1598J6813j399j7405k048M826l249J0938O512J420n291
11543D0580l420Q196R279o753p990n610J366K288J0868l576j4627m861J1884J5373
11529E2997M29j5579j1957m295P173J4158j2058J0055K100j8164J0244J1456m084
11516D2475m896k097L65j5641K1420M487P261K843O659P915r988j8275l574L386
$$ y = [57513, 43606, 30712, 41301, 53579, 58658, 47986, 37967, 41194, 53403, 52299, 24406, 24322, 38241, 28128, 19242, 27904, 42410, 37049, 32904, 28436, 33917, 38548, 41947, 52247, 46151, 51110, 41511, 34599, 35983, 47259, 35201, 15121, 11247, 13743, 26790, 31634, 33164, 26635, 11310, 10539, 21063, 24578, 19440, 26063, 15906, 21801, 21890, 24779, 24571, 32771, 33342, 32671, 28564, 32800, 34902, 35502, 17865, 29463, 46276, 44877, 27472, 25424, 30250, 27001, 37939, 44451, 45871, 40580, 37160, 45356, 54635, 47882, 39892, 34282, 35648, 37936, 48804, 45228, 30601, 25740, 37624, 52997, 53426, 37847, 25890, 21595, 28768, 42926, 30868, 40923, 43023, 24859, 35103, 46559, 42475, 37579, 35482, 35847, 20206, 41626, 46113, 53374, 56217, 62876, 70791, 60803, 42528, 38954, 42340]
11502D2340o575p633K261M324m892J1335K379k2178R310N873N982J2048L51p149
11488D7776J469K771j3861r38J1789k65j2138l851j0114j96J0849j351j974N286
11474C5252N804M919J4247j2060j5082j2922K667J153L579N712J0092J0199M409
11461E7969Q64l157O107O122M051j6715r380J8063J5374o094j0703P24L469l558
11447F3136m78O507l246j1861j3400l321L463J4288N737j1654j0881L731N710
11434D7731J7579j260m981L741O55j6929o446J0721Q698o910O365l754j0925m447
11420C9838r873J9681L433j4581k958R555j652O032P404o102M38K4862N470m816
11406G6731j3881k251k1204p123P043M207o718q597K0966K3217K3724J5579Q293
$$ y = [42340, 35765, 28132, 30393, 34717, 29825, 41160, 43539, 21361, 30671, 36544, 42526, 54574, 54925, 47776, 49245, 52016, 38155, 37217, 49006, 48741, 36603, 32752, 22638, 22442, 33291, 31940, 29966, 35252, 41056, 45975, 60222, 48162, 33080, 20158, 22825, 23978, 27557, 33269, 43361, 53560, 57969, 58833, 55676, 61783, 67905, 71956, 55241, 45861, 63924, 79298, 73204, 62501, 63225, 66694, 63136, 62658, 69165, 65919, 54058, 40658, 37337, 40800, 55088, 60825, 49171, 38290, 42021, 47731, 65310, 64050, 59069, 62810, 63465, 46536, 40090, 50811, 59509, 52599, 58964, 55210, 44285, 39838, 29965, 49646, 53079, 38498, 35540, 45095, 43443, 49475, 56879, 50777, 51215, 76077, 81547, 76731, 62850, 60599, 39395, 32272, 39315, 43522, 36804, 28207, 49173, 72390, 96114, 111693, 119986]
11393A19986l388p801n389J1805N7454L4380L6780N7124Q9034J72061K92243M04683
11381A258972M07109K77696j3390l10943m28871l53401k24383j27911p3989m9494
11371C61395l1123j8304j0988j7078j3993j2455j1254k3364j8312j9005m721j5309
11359A65489J964K2341L797o940n019p539o31j1992j4536q486Q305L669j455j890
11345A47077l095Q391P658l807j7614q332j0187J43J1717K054J055L351j1370
11332A27041j9524K494J481J2065J0124J8599K9210O995k5900l4710k2371j0692
11320I4812J7927J2572j369j8250l860J2567J1747j6851j0008O493J587q405J0253
11307A09215Q88j2957N669K454Q873J3382j2481j3755j1959j155n97Q51O003J728
$$ y = [119986, 116598, 108797, 103408, 115213, 172667, 207047, 243827, 300951, 389985, 562046, 854289, 1258972, 1666081, 1943777, 1930387, 1619444, 1190573, 837172, 612789, 484878, 410889, 361395, 330272, 311968, 300980, 283902, 269909, 257454, 246200, 222836, 204524, 185519, 180798, 165489, 167453, 189794, 193591, 186651, 181632, 174093, 173462, 161470, 146934, 138448, 146753, 150422, 148967, 147077, 143982, 152373, 160031, 156224, 138610, 130278, 120091, 120234, 131951, 134005, 135060, 138411, 127041, 107517, 110011, 111492, 123557, 133681, 152280, 181490, 188485, 162585, 127875, 105504, 94812, 112739, 125311, 123942, 105692, 101832, 114399, 126146, 109295, 99287, 105780, 107367, 98962, 109215, 110103, 97146, 102815, 105269, 114142, 127524, 115043, 101288, 89329, 88174, 87577, 88428, 94431, 96159]
11293I6159L724J7306J223j7081m945J8092J7638j0021n297p502o87p540m418
11280I6651r513M931O642l644J1201L117Q472k298r541j3528r092N744l18o626
11266H2198j0462q49r062J53O042J3942L201K690j0686J0183J6757Q366J0172
11253A22645n792j4592p644J618J955J1058Q805L95m057m131r710l070j2182j0154
11239G5144P800M684J3457o182k012J5695l140K510Q068M62K508J557o242j1035
11225A03274n261j8031J5779L1933M5250K7563L0643K2424J4753J5856M706j1544
11213B77345k1102k3079l4913k9157j6510n76k04M003N232l845M873j0790M552
11200A55829P218K343J575k685J1292j53K234n716j4170K442o108j2313Q362Q516
$$ y = [96159, 99883, 117189, 118412, 101331, 96386, 114478, 132116, 122095, 116798, 109296, 108609, 101069, 96651, 87138, 92069, 98711, 95067, 106268, 109385, 117857, 115559, 106018, 92490, 83398, 89142, 88824, 82198, 71736, 70887, 61825, 61978, 68020, 81962, 85163, 87853, 77167, 87350, 104107, 112473, 122645, 116853, 102261, 94617, 96235, 98190, 109248, 118053, 118448, 114391, 110260, 100550, 97480, 85298, 75144, 82944, 87628, 101085, 94903, 92891, 108586, 105446, 107956, 116024, 116486, 118994, 120551, 114309, 103274, 98013, 79982, 95761, 127694, 172944, 200507, 231150, 253574, 268327, 284183, 288889, 277345, 256243, 233164, 198251, 169094, 152584, 152008, 151804, 155807, 161039, 157194, 162067, 151277, 155829, 163047, 165390, 166965, 164280, 175572, 175419, 177653, 171937, 157767, 160209, 154101, 141788, 150150, 158666]
11186A58666k629k431J1634J8997j8025k7624j174j56j443p21J4375J8366M294
11173A72129j4570o081j0348k0664j6330j4443P159Q661J4258J3425j793K666
11161A34069k1088j4847m864j2169k087J258J0241L4295M2153L0803Q462j9032
11149A87194j1596j3044k669Q430J2077N987k384j0670l287k361K232q89o507
11136A62513J3827L876j1858j2375j0637j1382l168O500K564j2763L304R103K0508
11123A60012O101m2j2933j371J7957k511J586J4800J1734n893k0363j4463j8709
11110A35905j1699J197O973L1331L2334J8732o718m061K6569Q802j262m460m221
11097B29422j4659J7825M7180M9761P6638O4683K1372O907J3102k943l0377l4071
$$ y = [158666, 156037, 153606, 165240, 184237, 166212, 138588, 137414, 137258, 135815, 135094, 149469, 167835, 172129, 157559, 151478, 141130, 120466, 104136, 89693, 96852, 105513, 119771, 133196, 131403, 134069, 112981, 98134, 93270, 81101, 79014, 80272, 90513, 124808, 166961, 197764, 206226, 187194, 175598, 162554, 159885, 168315, 180392, 186379, 183995, 173325, 170038, 167677, 169909, 169020, 162513, 176340, 180216, 168358, 155983, 145346, 133964, 130796, 137296, 139860, 127097, 130401, 139504, 160012, 166113, 166071, 153138, 151767, 169724, 167213, 168799, 183599, 195333, 189440, 169077, 154614, 135905, 124206, 125403, 132376, 163707, 196041, 214773, 208055, 203994, 230563, 239365, 238103, 233643, 229422, 214763, 232588, 279768, 329529, 406167, 470850, 492222, 499129, 512231, 509288, 478911, 444840]
11085D44840k7863j5943k2488j5121j5452j3444j1661j4289m064J3304O438J989
11073C26246j4936K639J8563J4855K5799K6044Q322M035j844J4448J4466p095
11061D31542j6199r600j2371r99M929K3464J9147L5629M2471N259j3229l6367
11049D73676l3458J2387J9127J7709K0314J6623r468j4054N63K451K927K431K5541
11036E36769J03J8732K4390K8323J9370P134R475P168j749J8797J5547J9080K5673
11023G28812K2282J7650M5606R7165J69225K98066M24059M61077L64767J33099
11013B761808k01797l68296l45882k38503j62876j14649r2251o0488j7154q313
11003A151599L0471N3301M5947M6605P3036J04019J18190J16701R1897J05509
$$ y = [444840, 416977, 401034, 378546, 363425, 347973, 334529, 322868, 308579, 304515, 317819, 324257, 326246, 311310, 313949, 332512, 347367, 373166, 399210, 407532, 411567, 409723, 424171, 438637, 431542, 415343, 405743, 393372, 392373, 397302, 420766, 439913, 475542, 518013, 523272, 510043, 473676, 440218, 452605, 471732, 489441, 509755, 526378, 516910, 502856, 503419, 505870, 508797, 511228, 536769, 536872, 555604, 579994, 608317, 627687, 634821, 644296, 651464, 649715, 668512, 684059, 703139, 728812, 751094, 768744, 814350, 911515, 1080740, 1378806, 1802865, 2263942, 2628709, 2761808, 2560011, 2191715, 1845833, 1607330, 1444454, 1329805, 1237554, 1177066, 1159912, 1151599, 1182070, 1235371, 1281318, 1327923, 1400959, 1504978, 1623168, 1739869, 1831766, 1937275]
10993A937275O2596O8136J36093K36698L56297M97607O30783O90692N94583L45772
10983E556532J19921O9477K52251M76751O67847Q32903J047485J351222J789870
10974A2164259K387483L104694M020211N393206P883663J2872597K2625597L9806358
10966A10258068O2637600P8401803O9894614L1283996k5147866o8745758p6299922
10959A82282535n5490904l2688241j8876881j1876723q264775o332942n245646
10952D3506423m430759l663244k934834k321152j856297j478104j176460r37914
10944B4707659o99909m73841k74286j89511k79873n22275p96239r81555r78618
10935A9511552r11540q50892q04362p20540o39703n69671m88052m49423m20101
$$ y = [1937275, 1999871, 2068007, 2204100, 2440798, 2797095, 3294702, 3925485, 4616177, 5210760, 5556532, 5676453, 5745930, 5998181, 6474932, 7142779, 7975682, 9023167, 10374389, 12164259, 14551742, 17656436, 21676647, 27069853, 34953516, 47826113, 70451710, 110258068, 172895668, 251297471, 321192085, 352476081, 327328215, 258582457, 182282535, 126791631, 94103390, 75226509, 63349786, 55085011, 48752069, 43506423, 39075664, 35412420, 32477586, 30156434, 28300137, 26822033, 25645573, 24707659, 24007750, 23533909, 23259623, 23070112, 22790239, 22267964, 21471725, 20490170, 19511552, 18600012, 17749120, 16944758, 16224218, 15584515, 15014844, 14526792, 14077369, 13657268]
10926A3657268m27859m08176l61381l22290l01348k89387l02739l23804l04881
10917A0615403l12183l00778k72124k62022k73760k60279k36156k30419j98822
10908H268860j79278j54699j74579j98634j70977j71614j92848j74238j75238
10899F676755j54354j44224j46130j33856j41376j20681j02337p8738r3668r0453
10889E470938r7202r4237q2390r7525j17483j23204j29103r9650p5511p1800n5069
10878D427764n5286o4815o9174q5207j03099q8900q6807q3875o2803q3269o9237
10867C575292o0396o3069o0817o2070p3336o8907m5880k5362k5548r933k0390
10856C059584j4103j2417j6676l3528p2453p5034q3576q6104o1206o5673p0678
$$ y = [13657268, 13229409, 12821233, 12459852, 12137562, 11836214, 11546827, 11244088, 10920284, 10615403, 10303220, 10002442, 9730318, 9468296, 9194536, 8934257, 8698101, 8467682, 8268860, 8089582, 7934883, 7760304, 7561670, 7390693, 7219079, 7026231, 6851993, 6676755, 6522401, 6378177, 6232047, 6098191, 5956815, 5836134, 5733797, 5655059, 5561391, 5470938, 5373736, 5279499, 5197109, 5099584, 4982101, 4858897, 4729794, 4630144, 4554633, 4482833, 4427764, 4372478, 4307663, 4238489, 4153282, 4050183, 3961283, 3874476, 3790601, 3727798, 3644529, 3575292, 3514896, 3451827, 3391010, 3328940, 3255604, 3186697, 3140817, 3115455, 3089907, 3079974, 3059584, 3045481, 3033064, 3016388, 2982860, 2910407, 2835373, 2751797, 2665693, 2604487, 2538814, 2468136]
10845B468136o6816m8218n4806p2907n4187m9109l8938k2525k6729m6449m5281
10834A942171l4018j8276j8761l1221l8608k9710n1523o3055n7063l7411k4208
10823A538317o164j6956j1375m648j8045l7811l6427m3865m4099k5562k6409j5682
10811A251274j9050k1421q676k4377k6061k4244m0025k5218j5539j379r116k2611
10799A013557k4580k3998k8840j7583o687k165j4208p690P230Q789O669n873k0035
10786H84586k6781j8253j6360l2403n915n784o766o110j9785m0869l3634j8864
10774F53062J9759K0004J4581J8014P837l031j9080j0829p246J2430l009o543
10762F95949j8797k04l481k2672q920k3079k5157O1M819o261r647P206j206k4793
$$ y = [2468136, 2401320, 2353102, 2298296, 2225389, 2171202, 2122093, 2083155, 2060630, 2033901, 1987452, 1942171, 1908153, 1889877, 1871116, 1839895, 1801287, 1771577, 1720054, 1656999, 1599936, 1562525, 1538317, 1532153, 1515197, 1503822, 1499174, 1481129, 1443318, 1406891, 1363026, 1318927, 1293365, 1266956, 1251274, 1232224, 1210803, 1202127, 1177750, 1151689, 1127445, 1087420, 1062202, 1046663, 1045284, 1036168, 1013557, 988977, 964979, 936139, 918556, 911869, 909704, 895496, 887806, 895036, 903825, 910494, 904621, 884586, 857805, 839552, 823192, 790789, 784874, 779090, 772324, 766214, 746429, 705560, 671926, 653062, 672821, 692825, 707406, 725420, 733257, 730226, 711146, 700317, 693071, 705501, 702492, 695949, 677152, 676948, 673467, 650795, 641875, 618796, 593639, 593700, 598519, 592258, 582611, 589817, 588611, 563818]
10748E63818k7797k7740r485k576r849K4948L2613K5184j470P849k1855l6221
10736E17419k5965m724M114J9865N0841P3496O2320L4259J7041R694q886k1473
10724G28001l6349l2544j9672l1358k9819k3270j4781J4514K4q459j6021j1885
10712E18381j351L251J0846J4033P645l851P661Q269K6474J1637j058M048j5629
10699E90356k0109j3763k6112j2467K782J6529J5749L093N78l0184k6621l3597
10687D66234j5665Q263K4734M6413M6003K8896M041K927l1581k7937P605J5138
10675E75071J5626j7086j5342L71J2925J3621L610J8780J5863n372k655j674k728
10662F11010j537J421o957J2666J4563K4012K9173L2293M6978N8080L9102J7151
$$ y = [563818, 536021, 508281, 498796, 496220, 486371, 511319, 543932, 569116, 567646, 575495, 553640, 517419, 491454, 486730, 490844, 510709, 561550, 635046, 697366, 731625, 748666, 758360, 749474, 728001, 691652, 659108, 639436, 608078, 578259, 554989, 540208, 554722, 554746, 546287, 530266, 518381, 517030, 520281, 531127, 545160, 552805, 548954, 556615, 564884, 591358, 602995, 601937, 605985, 590356, 570247, 556484, 530372, 517905, 520687, 537216, 552965, 556058, 556636, 526452, 499831, 466234, 450569, 458832, 483566, 529979, 575982, 604878, 608919, 611846, 580265, 552328, 559933, 575071, 590697, 573611, 558269, 558640, 571565, 585186, 588796, 607576, 623439, 618067, 615412, 613738, 611010, 609473, 610894, 603937, 616603, 631166, 655178, 684351, 716644, 763622, 821702, 860804, 877955]
10650H77955L6594L6316J6102M032n598l5155m2404j0508J1009P1107Q6463O9025
10638A114938N0562N6502R6544J03782J35091J29263R9250O2223M8023R4866J90234
10627B181278L18506M36416N87631O84006O64396M97518K58373J12750J85370
10618E926244M02725O09590Q19982J054520J385629J805884K302658K870627L522922
10609B0700781M536625O425307J0198653J7542016L0980758N1436369P1492446
10602B13312955P4947065N0493014J253106m9675242p4333714o5217346m2251017
10595A08528821k4435417j4684886r705449p041870n567434m722067m071328l415480
10587C4884890k785357k234152j759748j397989j121743q51925o04704l83420
$$ y = [877955, 914549, 950865, 966967, 970999, 965401, 930246, 887842, 877334, 888343, 959450, 1045913, 1114938, 1165500, 1222002, 1318546, 1422328, 1557419, 1686682, 1785932, 1848155, 1896178, 1991044, 2181278, 2499784, 2936200, 3523831, 4207837, 4872233, 5369751, 5628124, 5740874, 5926244, 6328969, 6938559, 7758541, 8813061, 10198690, 12004574, 14307232, 17177859, 20700781, 25237406, 31662713, 41861366, 59403382, 90384140, 141820509, 213312955, 288260020, 338753034, 340006140, 290330898, 215997184, 150779838, 108528821, 84093404, 69408518, 59703069, 52661199, 47093765, 42371698, 38300370, 34884890, 32099533, 29865381, 28105633, 26707644, 25585901, 24733976, 24129272, 23745852]
10579B3745852k63089k73394m55020p18140r06293r68378r29779q84458q37898
10570A7509403p72630o80848n89237n23147m41876m38513m36758m21609l93991
10561A2810794l68388l25132k96078k81734l20452l15925l11996l03258k86012
10552A0001819k69025k54018k35362k23730j97525j58485r0601J2390J25469K16430
10542H927362K14919O8920k07778m80232o05296n28588l94640k58430j99427j84693
10532F352117j71879j60184j29534j04552r3992j03046j14397r5510j11330j12233
10522E155460j19607j23305r1150q8526p5292p7547o3010n5430o5825r1670r1201
10511D212897j15747q8945q9210j15315r3741o0290n5676p5181o8741n3971o0647
$$ y = [23745852, 23482763, 23209369, 22754349, 22036209, 21129916, 20161538, 19231759, 18347301, 17509403, 16736773, 16055925, 15466688, 14943541, 14501665, 14063152, 13626394, 13204785, 12810794, 12442406, 12117274, 11821196, 11539462, 11219010, 10903085, 10591089, 10287831, 10001819, 9732794, 9478776, 9243414, 9019684, 8822159, 8663674, 8573073, 8585463, 8710932, 8927362, 9142281, 9211201, 9003423, 8523191, 7917895, 7389307, 6994667, 6736237, 6536810, 6352117, 6180238, 6020054, 5890520, 5785968, 5691976, 5588930, 5474533, 5379023, 5267693, 5155460, 5035853, 4912548, 4821398, 4732872, 4657580, 4580033, 4517023, 4461593, 4395768, 4304098, 4212897, 4097150, 4008205, 3918995, 3803680, 3709939, 3649649, 3593973, 3518792, 3450051, 3396080, 3335433]
10500C335433n6089m9518o7468n2564m6293n6882m7676m2631m8303n0890n6985
10489B760134n2102n0467l5556l8543n1658m7251n4190p6748o9321o6860o3336
10478B154102n4250l9455k9008l1227m3694m4640n1536l8068k6456k2729k3358
10467A749681j3770j9370k7139m9942n3058n8923m8377k3229j2653L002J248j7249
10455A430221l4621l8983k2783k6490l5521l5651k4297j6384k6551k5453k2029
10444A121458k3883q861k3523k2132j8968j9420j152r946k6197k1763k5955j9525
10432I00133j7372o276j1057j2997k0518j0646j7115j7702l0556q087j4620k0137
10420G13050j2118r615n535J7352j6198m0585m2404k8777O221L4374K5072K8004
$$ y = [3335433, 3279344, 3229826, 3162358, 3109794, 3063501, 3006619, 2958943, 2916312, 2868009, 2817119, 2760134, 2708032, 2657565, 2622009, 2583466, 2531808, 2484557, 2430367, 2353619, 2284298, 2217438, 2154102, 2099852, 2060397, 2031389, 2000162, 1956468, 1911828, 1860292, 1822224, 1795768, 1773039, 1749681, 1735911, 1716541, 1689402, 1639460, 1586402, 1527479, 1479102, 1455873, 1443220, 1446222, 1447470, 1430221, 1395600, 1356617, 1333834, 1307344, 1271823, 1236172, 1211875, 1195491, 1168940, 1143487, 1121458, 1097575, 1088714, 1065191, 1043059, 1024091, 1004671, 1003519, 993573, 967376, 945613, 919658, 900133, 882761, 876485, 865428, 852431, 831913, 821267, 804152, 786450, 755894, 747807, 733187, 713050, 700932, 691317, 685782, 703134, 686936, 646351, 603947, 575170, 581391, 615765, 640837, 668841]
10408F68841J6791J3731j2675k7876l0650j4595O118j5963j3230j0971j176j7584
10396E60761k3890k2023j4823k0795l729j1612M306J76q52n174O47k4568k6610
10383D11814k3260P97r140k782l863L105N041j0585k900m805M454R695p39R319
10369C86151J1281J197r554N27l267j361N725k0929k1924j6118J879K960j7147
10356C19420j358j4828p123j157j5474j3390j5599k829N926M796j2672j1736m860
10343B29116Q734J7793k5349j5394l968q040n54O942p685j381o014k348J1946
10330B03798m385l231J0890j5401r479m203q58J794n861q588O325Q57n715j097
10316A64846n158O806n001j0850j085K695j1364j8751O476R593M429j3183n929
$$ y = [668841, 685632, 699363, 686688, 658812, 628162, 613567, 619685, 603722, 590492, 579521, 578345, 560761, 536871, 514848, 500025, 479230, 475501, 463889, 468195, 468371, 467519, 462345, 462992, 438424, 411814, 388554, 389351, 380211, 377429, 373566, 376671, 381712, 371127, 368227, 363422, 367876, 377571, 376832, 386151, 397432, 398629, 389075, 389602, 386335, 384974, 390699, 369770, 347846, 331728, 333607, 336567, 319420, 318062, 303234, 296111, 294954, 279480, 266090, 250491, 247662, 253588, 258384, 245712, 233976, 229116, 237850, 255643, 230294, 214900, 210932, 202892, 202338, 209280, 201595, 200214, 194200, 191852, 203798, 199413, 196182, 207072, 191671, 182192, 177989, 177131, 178925, 173064, 164476, 170801, 171658, 165943, 164846, 159688, 166494, 161493, 150643, 149558, 152253, 140889, 122138, 128614, 138207, 142636, 129453, 123524]
10303A23524n41n406J822j1297J2993L944p689r574J782n405j0367L769O384L909
10289A07848m395P614j2320m988K623m653l096l81n260p502j1776k0471m339K0565
10275E9469J3826l558k919L505Q010n241n356J2688k321l111r879j6891l359N444
10261E0307J3655o686l532P525o741p315p638M137J0246P822j5277j3635J258
10248C4126L305q490P067M85m90q729J0208k993J2941L2181M273k3780k8307k4640
10234G157l748j490K364J0301M233L299J5033J6765P49J096m626m788j4535j2877
10220A8933J6156K2224Q990j6524j7956k477o36J098m14j0126k357J0611J3841
10207D1363J0777M381j2395m071J5184J3857J2215m23j2467p956n620m087J2074
$$ y = [123524, 122983, 117577, 119399, 108102, 121095, 125039, 117350, 107776, 109558, 104153, 93786, 97555, 103939, 107848, 103453, 111067, 98747, 93759, 96382, 91729, 88633, 88252, 82992, 75490, 63714, 43243, 38904, 59469, 73295, 69737, 66818, 70323, 78333, 73092, 67736, 80424, 78103, 74992, 65113, 48222, 44863, 50307, 63962, 57276, 53744, 61269, 54528, 47213, 39575, 43712, 53958, 61780, 46503, 32868, 34126, 37431, 28941, 36008, 36493, 36003, 27274, 37482, 34489, 47430, 79611, 83884, 60104, 31797, 7157, 3409, 1919, 4283, 14584, 18817, 22116, 37149, 53914, 54663, 55759, 51133, 46345, 31810, 18933, 35089, 57313, 66303, 49779, 31823, 29346, 28710, 29808, 29394, 19268, 16911, 27522, 41363, 52140, 56521, 44126, 40055, 55239, 69096, 81311, 80888, 68421, 60465, 54845, 50758, 62832]
10194F2832J3556l046N016J5368K0757J4813L6712P0495J28284K08542L29940
10183I03269M17328L77270J79503j07928l48346l77642k67255j56462r3666n4381
10173D71690l5296n7424m6917m2247m3962k7678j9033j2501j3186r624q370Q506
10161A63958j337J3269j5927j0231r931j2262j9343q061N381R784Q194J316j0675
10148A14135r537m78K355j2574o915j1789O536J0129j34j2325r34j2096p021N694
10134F5046k4962j1466O678J5794P191j2795n1J1230n447K741P203j667R49n006
10120E5438j873R614n735j8638J786J1639R041r430j7178k2065r551J8804Q986
10107C0838k621j73n167k194K1389K3442j2382k7023k0387M645n649p35N215j1122
$$ y = [62832, 76388, 73342, 78358, 93726, 114483, 129296, 166008, 236503, 364787, 573329, 903269, 1320597, 1697867, 1877370, 1769442, 1421096, 1043454, 776199, 619737, 526071, 471690, 436394, 378970, 332053, 289806, 245844, 218166, 199133, 186632, 173446, 163822, 155452, 163958, 162621, 175890, 159963, 149732, 139801, 127539, 108196, 100135, 105516, 115300, 123494, 124810, 114135, 104598, 104120, 106475, 93901, 86986, 75197, 81733, 91862, 91728, 79403, 78469, 66373, 59352, 65046, 40084, 28618, 35296, 51090, 58281, 45486, 45435, 56665, 51218, 53959, 61162, 59495, 60444, 55438, 53565, 63179, 57444, 38806, 40592, 52231, 61272, 51842, 34664, 12599, 3048, 21852, 30838, 28217, 28044, 22877, 20683, 42072, 65514, 53132, 26109, 5722, 10367, 4718, 3983, 9198, -1924]
10093a924l979J830R972J0324j4244p695k100J5372n0P273K6140L023o794r737
10079B7411n507l45O81m762L806L664j1965r703M095J6832j272j7795J70m378
10065I32K1138K102K046l802O81o426j6097j0195P081O820p376j565Q247j999
10051A587l716J0744J0466K0782N253l670P624j053M332R213j2734k4264j3899
10038A0665r316P963R734l789Q384j4828k2911r539L907P467P509P983K693k360
10024C562k0097o501J2642J6362Q57j0011m958n180J3730M422J273p378j180Q846
10010F389K274j399j8636p234l688k235j3336P454J7050M492j0929q861J4840
9997a3819J0519j0522j1486J3563K4129J574N402o078m800J0008O543l887M133
$$ y = [-1924, -5903, -4073, 5899, 16223, 1979, -5716, -7816, 7556, 7506, 14779, 40919, 43942, 37148, 27411, 21904, 21559, 22240, 17478, 21284, 24948, 12983, 3280, 7375, 24207, 22935, 5140, 5310, 932, 22070, 24172, 26218, 22416, 23097, 16671, 574, -9621, -2540, 4280, -3096, -4661, 3586, 1587, -2129, 8615, 19081, 39863, 45116, 41446, 49070, 48017, 52349, 61562, 48828, 24564, 10665, 1349, 9312, 19046, 15257, 23641, 8813, -14098, -23637, -19730, -12263, -4754, 3229, 5922, 3562, -16535, -23036, -10394, 5968, 6825, -3186, -8144, -13324, 406, 4828, 6101, -1277, -2457, 6389, 8663, 7264, -11372, -18606, -22294, -24529, -37865, -30411, -13361, -8869, -19798, -28659, -13819, -3300, -13822, -25308, -11745, 12384, 13958, 19360, 13282, 8482, 18490, 25033, 21146, 25279]
9984B5279j4857k3492N223J2578M09j081o29j7808j482Q379J822L370m76m146
9970f911k686O512l750P142J4035Q420Q903o771j3204L34j2039k0572n04O373
9956a4718O083P27J2347P984J3978j2020j0226j4940k169O524o076Q605J2100
9943H199j0042o028R431j008j1495J403l128j8554m716P608n799R59J2382J4230
9929f558L463k599Q361R774J5491M266k1028r738q765L506K5689k185p78R35n282
9914A4552j0275l118N715J0297Q665p339k0739m021J076j1283J63J3242J2235
9901I170j4414r299K35r849j80J8516L564p471P255J5215p669k834J3429P337
9887B3005j6401n484j6609n932Q698l984P704J7740M844p656j5223j1531j3860
$$ y = [25279, 10422, -13070, -7847, 4731, 5140, 4059, 3430, -14378, -15860, -7481, -5659, -2289, -2765, -6911, -9597, -3085, -6835, 307, 14342, 22762, 31665, 24894, 11690, 12024, -15, -20587, -21091, -14718, -8635, -7908, 4439, 12423, 26401, 14381, 4155, -10785, -12954, -6430, -12506, -3901, 8199, -1843, -7871, 1560, 552, -10943, -9540, -12668, -31222, -35938, -28330, -34129, -33170, -20788, -6558, -3095, -5694, 2667, 12441, 27932, 32198, 11170, 1432, -7333, -3827, 21862, 19677, 18899, 19834, 14552, 4277, 1159, 6874, 17171, 25836, 18497, -2242, -6263, -5187, -16470, -16307, -3065, 9170, -5244, -14543, -14308, -24157, -24337, -5821, -2257, -9728, -2473, 12742, 5073, 2239, 15668, 23005, 6604, 1120, -15489, -21421, -12723, -16707, -9003, 8737, 13581, 5925, -9298, -20829, -34689]
9874c4689O185J3430J9747p754m652J0392j6564J650J274L21J2616R533J0364
9861B1853O098l124j0836j1797n440J47R11k152l333k158J4114P60j0067R112
9847D088O962j1744l763J8281K0751j7153j2207R051M193j0991j9545n425K0730
9834C228Q76j3195j2874O288N138Q490R090O731l247p681P229k903r00Q228l952
9819A0546l065o969N219k047l418j64O720P576j6296k971n130k0580o628R164
9805b8043p299j0135K725P632j114o618K1138J7031Q911n149o969q821q442K579
9791b2574m364l191Q415J3331r423j2023L23P569O282q799K833J1690l504k359
9777a5794M891k025j256N926l291Q951k077n41M444J4466J6455n144j5795n943
$$ y = [-34689, -28504, -15074, 4673, -3081, -7733, 2659, -13905, -12255, -10981, -10660, 1956, 11489, 21853, 27951, 24827, 13991, 2194, -3246, -3099, -2188, -4340, -7673, -9831, 4283, 5043, -5024, 4088, 11050, -694, -4457, 13824, 34575, 17422, 5215, 14266, 18459, 7468, -12077, -17502, 3228, 4104, -9091, -21965, -15677, -10539, -2049, 7041, 13772, 10525, 2844, 10073, 7170, 6270, 14498, 10546, 7481, 512, 5731, 3684, 266, 102, 6822, 14398, -1898, -4869, -9999, -30579, -37207, -28043, -35342, -45477, -42752, -35120, -36234, -42852, -21714, -4683, 4228, -921, -7890, -16711, -25153, -22574, -26938, -30129, -21714, -8383, -17806, -29829, -29506, -21937, -15655, -24454, -21621, -9931, -13435, -15794, -10903, -12928, -14184, -8258, -11549, -2598, -4675, -5216, -772, 13694, 30149, 25005, 9210, 3267]
9763C267j6757k036J1012J0479j4779j4345K986M465Q528j6326j007J4799m512
9750a4226J700O416Q058j2343N83J4742N320q291j7616j222J0875J180Q303n816
9736b337L82O243J722R70m137j0856k912L628l437J0637J2767j3166J51N306o45
9721D316J25n543O317o32N418J5498l779p884k893o18P576k2369k0591J3204J3878
9706B023J0550L276k2862m068q335l876Q352l245J1715J3329n567p221j3427j7264
9692c6620M772N094R845R363P028Q947k1913K99N59N438m160P00J3748o268p380
9677a0548K326n670L744N277j18p936j1865l102n660M452J3942Q409J3549Q065
9663A4865j1084n381O079N882n196o862j6849R078k765j3004J345J2416J5595
$$ y = [3267, -13490, -15526, -4514, 5965, -8814, -23159, -20173, -15708, -7180, -23506, -24513, -9714, -14226, -12526, -6110, 1948, -10395, -9812, 4930, 10250, 1959, -15657, -16879, -6004, -4824, 3479, -2337, -1955, 4288, 6010, 6980, 2843, -8013, -10925, -7297, -10734, -97, 12670, -496, -345, 4961, 4316, 4441, -1102, 5215, 4583, 10001, 25499, 21720, 13836, 10943, 10325, 17901, -4468, -25059, -11855, 2023, 12573, 15849, -7013, -11081, -19416, -23292, -14940, -18185, -6470, 6859, 1292, -5929, -19356, -36620, -31848, -26754, -16909, -7546, -518, 8429, -13484, -13185, -12626, -7188, -11348, -10648, 3100, -3168, -10548, -8222, -13892, -10148, -4871, -4989, -12925, -24790, -27892, -33552, -29100, -15158, -6749, 6800, 14865, 3781, -1600, 4479, 10361, 5165, -1697, -18546, -9468, -12233, -25237, -23892, -11476, 4119]
9650D119J5941P137j4328l58Q145j8180O769J1699K120j9447k3082n042O468M157
9636a3882J3019O629K22k0637r47p259q296l842K611J1701J3711N142m245j0832
9622a6905R234R903R904n541n436K119l615j0430k0317K143J3751J6941J0059
9609A1810J071P564L725j5181j2668K268k815O190N850P831j5396j8299K3439
9596E389K4271o514k2764j6959J797J0462Q31p849l665J1278K115o677L535J1042
9582F292j826J6063O180P465p74j3285j2465k631p140J600Q938K667O03o626j828
9567C233P516o203j4582M260q875M368J3408k900o652j596J832m626R206J1374
9553I763l650k483l825j659N181J016Q953n07K77J5200n55j6743j0170J6188N001
$$ y = [4119, 20060, 27197, 12869, 12511, 20656, 2476, 9245, 20944, 23064, 3617, -19465, -24507, -18039, -13882, -863, 5766, 5988, -14649, -15596, -22855, -31151, -34993, -32382, -20681, -6970, -1828, -6073, -16905, -7671, 2232, 12136, 6595, 1159, 3278, -337, -10767, -31084, -28941, -15190, 1751, 11810, 12881, 20445, 24170, 8989, -3679, -1411, -4226, 1964, 7814, 15645, 249, -18050, 5389, 29660, 23146, 382, -16577, -14780, -4318, -3487, -11336, -15001, -3723, -1608, -8285, -4750, 6292, 4466, 20529, 26709, 34174, 33400, 20115, 7650, 5019, -2121, -521, 8417, 11084, 11687, 5061, 3233, 10749, 4546, -10036, -5776, -14651, -10283, 3125, 225, -6427, -8023, -6191, -10817, -1611, 9763, 6113, 3630, -195, -1854, 3327, 4343, 13296, 12789, 13066, 28266, 27711, 10968, 798, 16986, 21987]
9538B1987o585j5254q165M483l248k148k044N779J021m391J1247m01j0067m498
9524a2284P994m652k831k379N127J5300n534r759j225J976j316J9624R876k3277
9510c360o628J471O968j899m686n003J240J3359K6070J299j3907l777k760J0531
9496A8918K932j0633o037o226N891Q069k0675k5302M76J6396r01J1797p827n588
9482a8710P360J9169L851K18r744J5083J2788q918k0537k6580j2781K1065p685
9469b5421j7320R722J1803R258J7942P015p173j8942p171P117n537J60j3964O279
9455b6232J7386K210O88J366J83o977j4123K98Q362J2259r321J1085Q265L76N008
9440A0833j0290j51J2986J274j9926m412J595K115n520J1275J1356p842j4443
$$ y = [21987, 15402, 148, -8017, -3534, -6782, -8930, -10974, -5195, -4174, -8565, 2682, 2281, -7786, -12284, -4290, -8942, -11773, -14152, -9025, 6275, 741, -9018, -10243, -8267, -9583, 10041, 19917, -3360, -9988, -8517, -1549, -3448, -8134, -13137, -11897, 1462, 27532, 28831, 14924, 11147, 8387, 18918, 21850, 11217, 5180, -1046, 4845, 12914, -7761, -33063, -32587, -16191, -17092, -5295, -13122, -18710, -11350, 7819, 11670, 11888, 2144, 17227, 30015, 21097, 560, -26020, -38801, -17736, -25421, -42741, -33019, -21216, -11958, 5984, 12999, 5826, -13116, -20287, -13170, -18707, -18547, -32511, -26232, -8846, -6636, -5948, -4582, -4399, -11376, -25499, -25201, -16839, -4580, -13901, -2816, 5449, 5825, 10833, 543, 392, 13378, 14652, -5274, -9686, -8091, -5976, -11496, -221, 11135, 3293, -11150]
9427a1150K217J6193j3558k32k418Q895P238p197Q582k529r929J0802N086j1662
9413C38M93j834J368j035j0825J4158L0467L181p338j865j143Q489J022p973j6039
9398A1464o414p042j1665j3464k511J437J5018Q113N322m42O463k914o259n572
9384h466M149O874J59N553n843O749Q858L289p025J0817j2720k180j5199o08J0427
9369D834Q200p695j5351M775K277J0964J2302L562q963k1030j3090L431J7682
9356A898N799Q12j2123j654p510J1112P160l315k3438q846K2010K2392O671j0482
9342A0486m71p398q003J6076J8389L933J3106p189k6987r102J731J7953J2333
9329C4857l950k019q726j1525r670J1105O605J3291p329o132o573q884r809j109
$$ y = [-11150, -8933, 7260, -6298, -6530, -8948, -53, 7185, -12, 8570, 6041, -3888, 6914, 12000, 338, 831, -1003, 365, -670, -11495, 2663, 33130, 36311, 28973, 27108, 25965, 34454, 35476, 27503, 11464, 5050, -1992, -13657, -27121, -29632, -28195, -13177, -5064, 258, -184, 6279, 3365, -2894, -8466, -4317, 2557, 2716, 8269, 2426, 9175, 18033, 21322, 14297, 25114, 12394, 10214, -4985, -5593, 4834, 13034, 5339, -10012, -5237, -2960, 8004, 20306, 23868, 14905, -6125, -19215, -15784, 1898, 7697, 8509, -3614, -5268, -12778, -1666, 5494, 2179, -21259, -30105, -8095, 14297, 20968, 10486, 10015, 2617, -5386, 10690, 29079, 33012, 46118, 38929, 11942, 2840, 4571, 22524, 34857, 30907, 28888, 20162, 8637, -1033, 10072, 16677, 29968, 22639, 16507, 9934, 1050, -8759, -9868]
9315i868J587j0429J0049J7269M332n874q654p063K457m107N340J4550Q686j0354
9301G921j459n065Q263N362j608k955L807p612j1516r085O694k717l091J7127
9287D066K274R633m88j689Q921J629L638K895P308j3723o718J5899K401R290k997
9272D2339P529q96q13L852P516j1113j4201Q099j0897l68j020P468J7603J4450
9258F9548J0660k0938k2312j9867j2336Q85N069M621Q812M113j650O863O55J467
9244C5590j370n4q942Q366Q628O726M632O060k676j2305j63J586M706Q608j3999
9229D5393m903n955r689R595K1742P981q908k053M202K525O404j4968L842J2404
9215F7612R556P189Q226O56o035r009o86K446O944M593P311J6701N378n349Q582
$$ y = [-9868, -8281, -18710, -8661, 8608, 12940, 7066, -1588, -8651, -6194, -10301, -4961, 9589, 18275, 7921, 6462, 1397, 9660, 15022, 13414, 10459, 14266, 6654, -4862, -13947, -7253, -9970, -13061, 4066, 6340, 15973, 15485, 13796, 22717, 24346, 27984, 30879, 38187, 24464, 17746, 33645, 36046, 45336, 42339, 49868, 48972, 48159, 52011, 59527, 48414, 34213, 42312, 31415, 31047, 30027, 37495, 55098, 69548, 80208, 59270, 36958, 17091, 4755, 5640, 10709, 15330, 24142, 28255, 26605, 33468, 34123, 35590, 34220, 34166, 25224, 33590, 42218, 48944, 53576, 59636, 56960, 44655, 44492, 46078, 50784, 59392, 45393, 40490, 34535, 24846, 34441, 56183, 64164, 55256, 53203, 57405, 59930, 66334, 51366, 55208, 67612, 77168, 84357, 92583, 93239, 87204, 78195, 77509, 79955, 86899, 91492, 98803, 115504, 120882, 115533, 124115]
9200A24115j736j2222Q232M997J5836Q043L232J385M171J7417M595q851J5228
9187A84442K5896J3153K416J8342K029O942K3606J0406R493L2041M0528K5431
9175C94725L0998L2657L8064N5458O3057N5883P1579P8000O7772Q5316J08639
9164A082148J13767J26698J51414J64682J71325J59270J87156J65128J35395J08800
9154B565783M2437q417l1057p4161j18461j21373j29793j65937j40404j20783
9144A697834j18034j14564r7276r2730q7222p8473p1781n7024l6973m2897m4637
9133H56223m6704l6936l6527l8727l3038j7390k4596j2645k0518j1432l0899l1371
9121E15440r933k3302k5858K516j4385j1986o453n740j2590k0329j9204o675q771
$$ y = [124115, 122379, 110157, 118389, 123386, 139222, 147265, 150497, 151882, 156053, 173470, 178065, 169214, 184442, 210338, 223491, 225907, 244249, 246278, 253220, 276826, 287232, 296725, 328766, 369294, 394725, 425723, 458380, 496444, 551902, 614959, 670842, 742421, 820421, 888193, 973509, 1082148, 1195915, 1322613, 1474027, 1638709, 1810034, 1969304, 2156460, 2321588, 2456983, 2565783, 2608220, 2599803, 2568746, 2494585, 2376124, 2254751, 2124958, 1959021, 1818617, 1697834, 1579800, 1465236, 1367960, 1275230, 1188008, 1109535, 1037754, 980730, 943757, 900860, 856223, 809519, 772583, 736056, 697329, 664291, 646901, 622305, 609660, 589142, 577710, 546811, 515440, 505507, 482205, 456347, 458863, 444478, 432492, 426039, 420299, 407709, 387380, 368176, 361501, 352730]
9108C52730j1128n753k571m011r106j3486j6783j5441J2268j2039j6165n777j4725
9095B38013k7305r594J6585J5035O038n978o544n279k766p172q918J205k0171
9082A83149L964R2m177M212j136J0909p156p45j0226Q57k213j5665J976l46j9804
9067A43691j4376k380R089J6436l902n813R986J3093j7177k5161j0481N965l425
9054A15545p565j060q572j3607R386j545q541j1561J4810K0874Q749k539K777
9041A17151q320l127J2974O422k1135r207N665J0187O394p129j1223k0025p02
9028G7925j929J2404J893L107P198K191O599m718j4516K744k430j2696k706o001
9014F9065j8644K703m662j3164j2624L169K9710n19O0O663l676M622p484P923
$$ y = [352730, 341602, 335849, 333278, 329267, 320161, 306675, 289892, 274451, 286719, 274680, 258515, 252738, 238013, 210708, 201114, 217699, 232734, 238772, 232794, 226250, 220971, 218205, 211033, 202115, 203320, 183149, 187113, 187205, 183028, 187240, 186104, 197013, 189857, 189112, 178886, 179743, 177530, 161865, 163841, 163495, 143691, 129315, 126935, 136024, 152460, 148558, 142745, 152731, 165824, 148647, 123486, 113005, 118970, 115545, 107980, 106920, 98348, 84741, 94127, 92582, 84041, 72480, 87290, 108164, 116913, 114374, 117151, 108831, 105704, 118678, 125100, 103965, 94758, 100423, 110610, 117004, 109875, 98652, 78627, 77925, 75996, 88400, 90293, 93400, 100598, 102789, 109388, 104670, 90154, 92898, 90468, 77772, 75066, 69065, 50421, 53124, 48462, 35298, 22674, 25843, 55553, 55034, 55094, 61757, 58081, 62703, 55219, 63142]
9000F3142n609j9665j416K1459M745L115l468M076r41L059N62q351l18j0891N410
8985E4909P349j4177n594r19Q11k719J0855R255J0525l197L393R310N446j8171
8971F7076j8013j5525J609P315j025n035o176L92n221J742K567J787J0819P224
8957D9536J057Q611J5439j626o652m918J231j9429j6554k896N526N768J516m062
8943C2547r553r854O301r155o999K822J2844M02q207J4353J0341j591p608k567
8929B4076o115n994Q997N404j791O935l98j4907N728J0279p266q382M630n304
8915A5892J835j687O103k287q330J2204p64J1499O753Q138q897K875k289k445
8901C8600l28q300N487J3464r956j0261j751j689j3815L318P828K568J679j5634
$$ y = [63142, 57533, 37868, 36452, 57911, 62656, 65771, 62303, 66379, 65438, 68497, 69059, 60708, 60390, 49499, 54909, 62258, 48081, 42487, 41568, 42379, 39660, 50515, 59770, 70295, 67098, 70491, 79801, 85247, 67076, 49063, 33538, 35147, 42462, 41437, 36402, 30226, 30618, 25397, 27139, 29706, 31493, 42312, 49536, 50593, 59204, 74643, 73017, 66365, 61447, 62678, 43249, 26695, 23799, 29325, 35093, 36609, 32547, 22994, 13140, 19441, 10286, 3287, 6109, 18953, 19355, 11148, 25501, 35842, 34251, 26643, 24076, 17961, 11967, 20964, 26368, 24577, 31512, 31114, 16207, 21935, 32214, 24948, 16566, 21196, 15892, 17727, 16040, 22143, 19856, 11526, 23730, 22966, 34465, 41218, 49356, 40459, 43334, 41045, 38600, 38272, 29972, 35459, 48923, 38967, 28706, 26955, 25266, 11451, 14769, 22597, 25165, 26844, 11210]
8887A1210q505N266p182K482L805N704p402J028n237m112K228R433O118j4912
8873g6k904K04k247J344J6572N856l430L02O64K837j269J6417k903j7247k109
8858A2011k070j574J1634K2840J4541j7824k0766L172j192j555l655k3846j4752
8845b3036Q592J4377l190Q549R271j285l88l259j0386J0830J5045n076q593M544
8831A5995j5037J0671q97O338K021L582k084j580p827J0968l535O569K084j8089
8817I179l023M957J928m613O626K646m78J105m511j189p477L677M846j105J2868
8802B5436K712k038q70l561J76j2033K694o63P222P816O309j622q958J580J2435
8787C6635M587p559k0086J207k952J2898R036j2398k3536j1248J0678j454q7J6232
$$ y = [11210, 2705, 7971, 789, 3271, 7076, 12780, 5378, 6406, 1169, -2943, -715, 8718, 14836, -76, -2980, -2776, -5023, -3679, 12893, 18749, 15319, 15621, 16285, 19122, 17853, 34270, 31367, 14120, 12011, 9941, 8367, 20001, 42841, 57382, 39558, 18792, 21964, 20772, 19217, 15562, -8284, -23036, -14444, -67, -3257, 5292, 14563, 13278, 12890, 9631, -755, 10075, 25120, 20044, 11451, 15995, 958, 11629, 10732, 17070, 19091, 22673, 20589, 19009, 11182, 22150, 18615, 25184, 27268, 9179, 6156, 11113, 13041, 8428, 15054, 17700, 17222, 18327, 13816, 12627, 5150, 8827, 13673, 12568, 25436, 28148, 26110, 25240, 21679, 21855, 9822, 12516, 11853, 19075, 26891, 33200, 31578, 22620, 24200, 36635, 41222, 33663, 13577, 14784, 11832, 24730, 33766, 21368, -2168, -13416, -2738, -4192, -4279, 11953]
8773A1953P468J2048P535K370j2478j2458M414K257J1175J419l609m602O35Q141
8759C6268K784j2624j154P005J722l536J717m808J2837j719p9J0661R715N253
8745F4042l803j7935k158P779J2178l36l138n198R926m426j2355J990J561N055
8731E3182p060J996K252j4161q350K7955R052j3760j3787N249O222J641j11N120
8717E5440q72Q021k038k030L253J5670l688N83k737j0787L75J5205k704j0385
8703F3306j3289P035o834j3152K652J1813K5427P341j0359P60L492M795J3154
8690I6141M237J2452J691p077N609l533l553n718M1l243k994J3410J0625j895
8676A16193J94j2697J861J6627j1455j68J1657J4329J7572M357j4742n052n119
$$ y = [11953, 19421, 31469, 39004, 41374, 28896, 16438, 20852, 23109, 34284, 35703, 32094, 27492, 28127, 36268, 39052, 26428, 25274, 32279, 34001, 30465, 32182, 27374, 40211, 38492, 38413, 49074, 58789, 64042, 60239, 42304, 40146, 47925, 60103, 59767, 56629, 51431, 61357, 56931, 44576, 46566, 48127, 53182, 46122, 48118, 50370, 36209, 27859, 55814, 64866, 51106, 37319, 42568, 48790, 50431, 50320, 55440, 54568, 62589, 60551, 58521, 61774, 77444, 73756, 74339, 71602, 60815, 61190, 76395, 73691, 63306, 50017, 57052, 50218, 37066, 39718, 51531, 76958, 84299, 73940, 74700, 78192, 82987, 96141, 100378, 112830, 114521, 107444, 113053, 109520, 105967, 100249, 100290, 97047, 94053, 107463, 118088, 116193, 116387, 103690, 105551, 122178, 110723, 110555, 122212, 136541, 154113, 158470, 143728, 138676, 133557]
8663A33557j0947k93J2978j4093j2508R685Q899n635p781P987K1891O436q44N52
8649A49884n651J868N251n90j0156J4721J4350J6452J2100J532k800O852M121
8636B07934o681L68k283L879J3334O340o379j1564J009N928J0115K267k361J9170
8622B41076O986l569J5359L9649L1624J2124R260L1767L3608J4051L3899J3578
8610D79412K0744L1456L2334J1385q325n035N415J1532N376j0162k4163j6706
8598E33263k2610k5184j4674p906J531j0035o73K267p237k646O70n80j7357j7913
8584D10916r535j854o234k4001k8849l4160l423k521j4413j5595j0241k3068k7987
8571B09035L729O826J371j186j449j9702n034N335K63K201j784k1111k5915m316
$$ y = [133557, 122610, 122317, 135295, 121202, 108694, 118379, 127278, 121643, 113862, 121849, 143740, 150176, 149332, 149884, 144233, 146101, 151352, 150762, 140606, 155327, 169677, 186129, 198229, 199761, 196961, 203813, 207934, 201253, 201621, 199338, 203217, 216551, 222891, 216512, 204948, 205957, 211885, 222000, 224267, 221906, 241076, 248062, 244493, 259852, 299501, 331125, 343249, 352509, 384276, 417884, 431935, 465834, 479412, 500156, 531612, 563946, 575331, 567006, 561971, 567386, 578918, 584294, 574132, 549969, 533263, 510653, 485469, 470795, 462889, 464420, 454385, 453712, 455979, 448742, 446096, 446766, 446186, 428829, 410916, 401381, 399527, 393293, 369292, 340443, 306283, 302860, 300339, 285926, 270331, 260090, 237022, 209035, 212764, 219590, 220961, 219775, 218326, 198624, 193590, 198925, 199188, 201389, 199605, 178494, 152579, 148263]
8557A48263n506N662j0036k9837l954J2828J5924K1335q703r939o519j8491o123
8544A04904m475J0628Q183p260j726j1154r484j3443R320J804n478m324L968J1071
8530I2534J1264m443p476J1528j518l0202j3929O160L465j249j1286j7274N229
8517D2803K9021L42r697M998J3789O143j1743j3429m602l71J0379k169m670p971
8503E2823M723J0160p327M646k26J763m743j1209m565j1685m805k939Q022J9246
8489E3884N635J7827Q900j4804J137m248r401q541o371J5440O844Q492J3269j546
8475H6517q046j355o701n12K753m58J2791J0736L061k5578j9383O576J418l983
8461E7836m991m903n434L38k076J3553J1867J770k2009k1441R625J4846J515p641
$$ y = [148263, 142757, 148419, 138383, 108546, 104592, 117420, 133344, 154679, 145976, 136037, 129518, 111027, 104904, 100429, 111057, 119240, 111980, 110254, 99100, 89616, 76173, 85493, 87297, 81819, 77495, 81463, 92534, 103798, 99355, 91879, 103407, 101889, 71687, 57758, 63918, 67383, 66134, 54848, 37574, 42803, 71824, 72166, 62469, 67467, 81256, 87399, 75656, 62227, 57625, 57254, 67633, 65464, 60794, 52823, 57546, 67706, 60379, 65025, 64799, 66562, 61819, 50610, 46045, 34360, 29555, 26616, 34638, 53884, 59519, 77346, 86246, 71442, 72579, 68331, 58930, 50389, 44018, 59458, 66302, 74794, 88063, 86517, 78471, 77116, 70415, 69903, 72656, 72198, 84989, 95725, 98786, 73208, 53825, 60401, 61819, 57836, 52845, 47942, 42508, 42846, 40770, 54323, 66190, 67960, 45951, 24510, 34135, 48981, 50496, 42855]
8447D2855J653J3554P954K828M17j1685L729M625k818k545M505n393k2367q895
8433B8417N917K3493Q150p506M999K978Q429P317p566k2290j0652N945J4171P912
8419F9714M727j2002j3523K668J1368J5554M577J0136L562n015p974q88j4996
8406F7908J010J9837N863k5241k797J1237n147j2607j3068j083m784J6688n218
8393E2598j2867j2598k831J0917k765L13j551l51m214J960J1072J2141m558P548
8379E4814p41O902J5391M549k4676J2565N386J11J7218R247j4680j8412j5193
8366E2481q831k4564J0877O879p854M591L313K465j625Q437m897Q349J0112j6569
8352D3164p169O284O100k985r556j5305J3198k426J0944K08J278n494l0727O742
$$ y = [42855, 44508, 58062, 66016, 68844, 69261, 57576, 61305, 65930, 63112, 60567, 65072, 59679, 37312, 28417, 34334, 57827, 65977, 58471, 63470, 66448, 74877, 82194, 74628, 52338, 41686, 47631, 61802, 69714, 74441, 62439, 48916, 51584, 62952, 78506, 83083, 93219, 96781, 91766, 83792, 82904, 67908, 68918, 88755, 94618, 69377, 66580, 77817, 72670, 60063, 46995, 45912, 41128, 57816, 52598, 39731, 27133, 24302, 35219, 32454, 32767, 31216, 30865, 26651, 28611, 39683, 51824, 47266, 54814, 54073, 60975, 76366, 80915, 56239, 68804, 74190, 74301, 91519, 100766, 86086, 67674, 52481, 43650, 19086, 29963, 36842, 28988, 33579, 36892, 39357, 37732, 46169, 41272, 49621, 59733, 43164, 35995, 42279, 48379, 45394, 35838, 20533, 33731, 31305, 42249, 42457, 43735, 38241, 7514, 14256]
8338A4256J2498P962q982J3600J2128n864O22p389N421K905K0048L577L314r871
8324F4225j1449j380N264k540Q021j157P703J1173p836p132j451j5148r645K598
8310D1246o468n784L160j5655L28p140O752r774o076O51P832J9880R922j8204
8296B0670L4o232k87K140N040q299r200j3392r0K1297Q930K83O329K937L709m807
8280B9062p355O916J701p856J276p955Q116K2493Q981r508o300m319l0L665o309
8265C2578p816L460k548o504L426q718r886J7359j374r935p14J3498O771j002
8251B8595J1062O948L859q051M791M07j7096j4613n532R340q621j2416L314R165
8237A1152J0994m003k1799K934J8128k583M000n266K393J0848r996j1926K122
$$ y = [14256, 26754, 34716, 25734, 39334, 51462, 45598, 46220, 38831, 44252, 47157, 67205, 70782, 74096, 64225, 52776, 51396, 56660, 54120, 62141, 60984, 68687, 79860, 72024, 64892, 63441, 48293, 38648, 41246, 34778, 28994, 32154, 16499, 16827, 9687, 16439, 6665, 589, 1240, 9072, 28952, 38874, 20670, 20704, 14472, 14185, 16325, 21365, 13066, 3866, -9526, -9616, 11681, 20611, 20894, 27223, 30160, 33869, 29062, 21707, 28623, 30324, 22468, 23744, 15789, 23905, 46398, 55379, 45871, 39571, 35252, 35222, 38887, 32578, 24762, 28222, 25674, 19170, 22596, 13878, 3992, 21351, 19977, 10042, 9328, 22826, 29597, 28595, 39657, 46605, 50464, 42413, 47204, 47611, 30515, 15902, 10370, 19710, 11089, -1327, 1987, 11152, 22146, 18143, -3656, -722, 17406, 14823, 18823, 13557, 15950, 26798, 16802, 4876, 6998]
8224F998R088R939k2805j023J1499J4402j0526J3642m196j6928n672K2984P673
8211C5075n462r540l775J386R734K42j0896j6592k984Q19J1176q424O398J5622
8197B2779O46Q775K378j4763n158j1143l230K049r04Q9J191M67p279R08J7748
8182A4553N80q612l143N340j0394K400O119N126r741K314J2866M663m830m15J466
8167A8292N236j3125j9554j8935R803j921J070p660K1030K1000M237j134r76K044
8153A9407k4O81J2980K5072K0673K7107K0156k677k6147k1229k9333q828M144
8140D1982k983J309j3616j1463q883M006O057j1q570r467J4088l736j66j0227
8126a680k6Q947j024p089j862R675n639K2177N101K260p997l860J1967J2693j1064
$$ y = [6998, 16086, 26025, 3220, 2197, 13696, 28098, 17572, 31214, 27018, 10090, 4418, 27402, 35075, 29613, 20073, 16298, 17684, 27418, 27660, 16764, 172, -2812, -1993, 9183, 759, 7157, 22779, 23425, 32200, 34578, 19815, 14657, 3514, 284, 2333, 1429, 1518, 2709, 3176, -4103, -3195, 14553, 15133, 6521, 3378, 8718, -1676, 724, 6843, 11969, 2228, 4542, 17408, 22071, 17241, 16826, 18292, 23528, 10403, -9151, -28086, -18283, -20204, -19134, -26794, -5764, 15236, 19473, 18339, 17363, 19407, 19383, 20064, 33044, 58116, 78789, 105896, 126052, 123375, 97228, 75999, 46666, 37838, 41982, 38999, 40308, 26692, 15229, 6346, 10352, 16409, 16398, 7828, -1639, 12449, 8713, 8547, -1680, -1706, 7241, 6217, -872, -2734, 6941, 1302, 23479, 28580, 30840, 22843, 18983, 30950, 43643, 32579]
8111C2579m49N468P276K0838K7674J9001m269k3621k7093j4771p615p815j5071
8098A2132p962M041Q00J0418l350j1144j0018k354O044J5379j688M711k438N264
8084A9835O797L526o357k618M257m282o478j6479j2753J0565R573M110k804L133
8070A0025J2252k410o285k041J1061J2781J0259j368j1962P664l492m109K010
8057C4385J0516j5012O239J0306m152L79J0842P837O858J3705J5247O850M946
8044A08946Q64M09J1568O546K0190K4602K0014J8728O330r848K124n101O279J6020
8030B27671J8434J0942q465J3510o110o374j3375k1024l116N625j1338o267N067
8017B05180P28j2309j7736L975J6594J6884l010p150o101o363Q548N138P448K1982
$$ y = [32579, 32130, 37598, 44874, 65712, 93386, 112387, 108118, 84497, 57404, 42633, 35018, 27203, 12132, 4170, 8211, 9011, 19429, 16079, 4935, -5083, -7437, -1393, 13986, 12298, 17009, 14571, 19835, 26632, 30158, 23801, 21183, 25440, 21158, 14680, -1799, -14552, -3987, 5586, 9696, 6892, 10025, 22277, 19867, 13582, 11541, 22602, 35383, 45642, 44274, 32312, 39976, 36484, 32375, 34385, 44901, 29889, 36128, 46434, 42282, 42661, 53503, 61340, 68198, 81903, 97150, 104000, 108946, 109810, 110219, 121787, 128333, 148523, 173125, 193139, 211867, 218197, 208349, 210473, 205372, 211651, 227671, 246105, 257047, 248582, 262092, 255982, 249608, 236233, 215209, 212093, 217718, 206380, 200113, 205180, 205908, 193599, 175863, 179838, 196432, 213316, 210306, 203156, 197055, 190692, 199240, 204378, 211826, 233808]
8003B33808J6730M8005O2161O4053P3863J13584J40984J16524N1727k1192q5167
7992H15080j14348j07526p1306l8658j0683J9715P8949J26362J34539R2972n500
7981I19596q5859j57383j38774r3129m6374k5635k4509l2610p537n044J638K111
7969C06491k604m110J3326K6009L3711L5014J9773j31k5680j6247j2412J2750
7957C85890L3294M5049P6906R3620R7637R3775P1062K2654r049n6673o3820n2064
7945G38281k9718K0473O4599R9392M8998k5711q9876j25693j10621q0174l5192
7934D74758l2754l5449l5998l5544k6726j0044j6939j8017j0614L543O754J2118
7922B75088O83N499m324k0252j255R574O504K576K0235M7634M8794M0956M2496
$$ y = [233808, 250538, 298543, 360704, 424757, 498620, 612204, 753188, 869712, 921439, 900247, 815080, 700732, 593206, 521900, 483242, 472559, 492274, 571223, 697585, 832124, 925096, 919596, 833737, 676354, 537580, 444451, 398077, 372442, 347933, 315323, 307786, 302742, 304380, 306491, 303887, 299777, 313103, 339112, 372823, 407837, 427610, 427479, 401799, 385552, 373140, 385890, 419184, 464233, 541139, 634759, 732396, 826171, 897233, 919887, 910838, 854165, 790345, 738281, 708563, 729036, 793635, 893027, 942025, 916314, 826438, 700745, 590124, 509950, 474758, 442004, 406555, 370557, 335013, 308287, 298243, 281304, 263287, 252673, 256216, 262970, 275088, 275771, 281270, 276946, 256694, 255439, 265013, 271517, 274093, 294328, 341962, 390756, 431712, 474208]
7909D74208J2755l1316l5778k4074k0256k3308j8844k0724J389M467p268j3246
7897B98005l2263l2831l853l203k5497j0350j1262j9337k1491r450K615j3647
7885A17436J896K0925N833p327m124r957j5431j5292O234L510k721j712k500O866
7871A03636P09j0912l948j2139k3017L257m863p068j0840j1737J8030J0359Q352
7858E9819Q044J098j245r112k439m633P700p503j8694m638J9962P367l003j0486
7844D2237p299J4930Q051j0953j1729O193N935p476n964J697J0500J8329M906
7831F9357p603p510l528K4796o439k1631j0234R315K502R64p284j0900J2627O112
7817E0544j2201o590j9818m687Q095J3438R329O214k045j4364r447J87J3553o054
$$ y = [474208, 486963, 455647, 419869, 395795, 375539, 352231, 333387, 312663, 314052, 318519, 311251, 298005, 265742, 232911, 229058, 225855, 200358, 190008, 178746, 159409, 137918, 128468, 131083, 117436, 119332, 140257, 146090, 138763, 134639, 124682, 109251, 93959, 100193, 103703, 100982, 99270, 96770, 103636, 104345, 93433, 89485, 77346, 54329, 57586, 52723, 45655, 34815, 23078, 41108, 51467, 59819, 67863, 68961, 67716, 58604, 56165, 51532, 59232, 51729, 33035, 28397, 48359, 55726, 52723, 42237, 34938, 49868, 57919, 46966, 35237, 41430, 47365, 39889, 33925, 35622, 46122, 64451, 69357, 61754, 54244, 50716, 75512, 69073, 47442, 37208, 46523, 49025, 49989, 42705, 31805, 44432, 50544, 38343, 31753, 11935, 7248, 15343, 28781, 38110, 44324, 42279, 27915, 18468, 18655, 32208, 26154]
7803B6154j3868P197Q37L287L969J435j727o260j0319k126k397o326K843M643
7789G342O631k710p13J8121K644k707J880r131J648J17p35n421j5514o523P719
7774B648L049l919o177M71N082O785P591J783q226J8144O146j1576m102m690m844
7759H165j3563j949O949m006l917P01J8275p321M147J0774L111q639l93q52j9062
7744g580j3033j1321J1839R315N499J6554j273p612o037N284N110N191J913Q608
7730B2457R89r573k436j3777M809J6917O198j9071P87q297N739Q050j9445j6660
7716b3313J5556K5496J7455p425j7264j3907n532p241l958M341L5571K1209j9530
7703B1458k3662j6373R108J3598j1068l606K392j319j2279j3448J453J9066Q735
$$ y = [26154, 12286, 19483, 20320, 23607, 27576, 29011, 27284, 21024, 10705, 8579, 6182, -144, 2699, 7342, 13973, 11263, 10550, 28671, 31315, 28608, 30488, 21357, 23005, 23122, 22387, 16966, 1452, -5071, 2648, 5697, 1778, -4399, -3928, 1154, 7939, 15530, 17313, 9087, 27231, 33377, 21801, 17699, 13009, 8165, -5398, -7347, -398, -4404, -8321, -7620, 10655, 3334, 7481, 18255, 21366, 12727, 12334, 11482, -7580, -20613, -31934, -20095, -10780, -5281, 11273, 10000, 2388, -3649, 1635, 6745, 11936, 13849, 22457, 23446, 13873, 11437, -2340, 2469, 19386, 25584, 6513, 7300, -997, 4742, 12792, -6653, -23313, -7757, 17739, 35194, 27769, 10505, -3402, -8934, -16175, -20133, -15792, 19779, 40988, 21458, -2204, -18577, -9469, 4129, -6939, -10545, -8153, -9472, -21751, -35199, -33746, -14680, -5945]
7690e945n851l207r217j0403J4595K6570O321j8530p029O300M541l789J0722J0225
7676A5303K321q878j3586m16r992p343J2075N88R365L132M930O883j2422N151
7662G111RL230J430j1831r929j0310O614J3985N398J469m265o467M641J2779J3492
7647B7356j3889j6563j0671O94K3683j708j7329j9294J5697J2987O814j143j0663
7634d029j3439J2236P529R336Q616J368j9181j0388j4616q674l396k347J1504
7621b5481J0571Q479N605O042k34j169k988N097K608n570k97k427j0157L554Q672
7606B305k765J647J1146j2599p615l076O4P40j767j2289N264M134L830k049l437
7591a6467P247J1064J0169R271o094n621J4573J1174j8987k4842j3086m745j245
$$ y = [-5945, -11796, -15003, -24220, -34623, -20028, 6542, 12863, -5667, -12696, -6396, -1855, -5644, 5078, 15303, 17624, 8746, -4840, -5256, -15248, -22591, -10516, -9928, -563, 2569, 7499, 14382, 1960, 7111, 7120, 10350, 11780, -51, -9980, -20290, -13676, 309, 5707, 7176, 2911, -3556, 1085, 13864, 27356, 13467, -3096, -13767, -13073, 10610, 8902, -8427, -27721, -12024, 963, 7777, 6634, -4029, -17468, -5232, 2297, 11633, 20249, 21617, 2436, -7952, -22568, -31242, -34638, -36985, -25481, -14910, -6431, -826, 5216, 4982, 3813, 825, 5922, 8530, 2960, 2663, 236, -9921, -6367, 2305, -460, 1187, 12333, -266, -7881, -10957, -10893, -10153, -11920, -24209, -18945, -14811, -10981, -13030, -16467, -9220, 1844, 12013, 21284, 15190, 9569, 24142, 35316, 16329, -8513, -21599, -26344, -27589]
7578b7589J1811J3659k932q774k070o643Q235J0588P87L236J259p597M914R957
7564H841j4701o566N787j1028j0312J6311K4478K99J662j5189p439K2991J1686
7551B6820O319p687j2209o773l488p936O159L999j934M817p782k205n533J193
7537f240p277l942L889K8788O426j5403P418n013J6502j581j1088j327M146O164
7523B1462p753j5620J2497N639q365j2010J1774k132p679J208j2092o663o013
7510b5747j0037M481J3290l980K508o56o372M528J0611O171O435r27q53N134j1903
7495g317r504J4873L745q721O35J2715L478j2619j817J717n388J2250J0808J30
7481A4985Q175j4610O999J0661q116k0504q779M444R80j6746P584J7425l358j1420
$$ y = [-27589, -15778, -2119, -5051, -13825, -15895, -22538, -14303, -3715, -2928, 308, 1567, -6030, -1116, 8841, -5860, -12426, -6639, -17667, -27979, -11668, 12810, 13109, 14771, -418, -7857, 15134, 26820, 33139, 25452, 13243, 6470, 2982, -4954, 1205, 5204, 3270, 8087, 305, -1900, -7433, -6240, -13517, -17459, -13570, 15218, 21644, 6241, 13659, 8646, 25148, 23567, 12479, 11152, 15298, 21462, 13709, -1911, 10586, 16225, 7860, -4150, 7624, 5492, -2187, -979, -13071, -19734, -25747, -35784, -31303, -18013, -21993, -19485, -20141, -26513, -21985, -11374, -5203, 1232, 305, -548, 4586, -7317, -16821, -1948, 1797, -6924, -6289, 6426, 9904, -2715, -4532, -2815, -8203, 4047, 14855, 14985, 23160, 8550, 15549, 26210, 18094, -2410, -11189, -6745, -5765, -22511, -14927, 2498, -860, -12280]
7467a2280N643M583n950j5198P637j530j18P985j322O953J4562o623j237q992
7453e887j103O979J3349j2397k3254R6O171R86M138M404l516Q967J4473J4086
7439B7492r303j6632j3334l369L069o654P68O771N182l393P8O118J0602n312j5236
7424a3153n847J4642M095j2795n598o241L02o531Q995R048M720P110m717j2937
7410a8907o366R050J5197K41M833j0652P3q994M11j3771j0582R611J4033Q078
7396g745p16j1844j734K403N031N897K253k10m777n206o40K531L635N838j0451
7381a5735o218M964L362j2742J866J8674Q838m293k623J4451k029j898J848J5335
7367B3800R932k1153O52L863n491o090Q335n609N80j3290n436N36q283K731l530
$$ y = [-12280, -6637, -2054, -8004, -23202, -15565, -17095, -17213, -9228, -10550, -3597, 10965, 4342, 3105, -5887, -6990, -11, 13338, 941, -22313, -22217, -16046, -15060, -10922, -6518, -10034, -1067, 13406, 27492, 18189, 1557, -11777, -15146, -12077, -18731, -17963, -11192, -6010, -9403, -9325, -3207, 7395, 2083, -13153, -19000, -4358, -263, -13058, -18656, -24897, -24595, -31126, -22131, -13083, -8363, -1253, -5970, -18907, -25273, -16223, -1026, -785, 4048, -6604, -6531, -15525, -15114, -28885, -39467, -29856, -15823, -7745, -8461, -20305, -22039, -19636, -14605, -8708, -6455, -6665, -11442, -16648, -17288, -14757, -11122, -5284, -15735, -21953, -16989, -13627, -26369, -24503, -5829, 3009, -1284, -3907, 10544, 8515, 6617, 8465, 23800, 33732, 12579, 13231, 17094, 11603, 5513, 13848, 8239, 8819, -4471, -9907, -9371, -17654, -14923, -18453]
7352a8453k146J2055R741J532p126q170P341O375J78M240o825O730J2122j1609
7338E985j3446o269J250q354k499M78J2202L550J1702k024r591L204J2271j2661
7324d202J6818M409o653r974j5813Q429J6302r105m117M603l677N695R161M73
7310A2349j492j1090O449Q901J318M731o508k4095j0838R657l011o021O230o65
7296a4085J0435o288l672n751j247J0100o422J2142R36J2774l283j1441o678j4961
7282b7441O764J2344l09K851J1583P09J6949l449j6876J2593L410M153j771o431
7268A5079j0751j0342J082j114o493L636n586Q614j10j0823q296P585N125m461
7254a6855M444K524m907J119M925Q597m873k2761P148j0786q513J1480J7069J1045
$$ y = [-18453, -20599, -8544, 1197, 2729, -4397, -12567, -5226, 1149, 1327, 5567, -1258, 5472, 17594, 5985, -7461, -13730, -12480, -20834, -23333, -22855, -10653, -7103, 4599, 2575, -7016, -3812, 8459, -4202, 12616, 17025, 10372, 398, -15415, -6986, 9316, 211, -3906, 697, -2980, 2715, 11876, 12349, 10857, -233, 6216, 15117, 16435, 21166, 14658, -9437, -20275, -10618, -13629, -19650, -13420, -14085, -3650, -9938, -13610, -19361, -20608, -10508, -16930, -4788, -3852, 8922, 5639, -5802, -12480, -27441, -20677, -8333, -8642, -5791, 5792, 6501, 23450, 20001, 3125, 15718, 19128, 23281, 21510, 15079, 4328, -6014, -4932, -6046, -12539, -8903, -14489, -5875, -5985, -16808, -25104, -17519, -12394, -16855, -12411, -9887, -14794, -13675, -8750, -153, -5026, -27787, -20639, -31425, -39938, -28458, -11389, -344]
7240c44k234o033p246l057J168J4594M406k798K49k061q141J186l558l537p50
7225a8156j251J7096J5169j623p023p373J819q519P69K924K0267m672k0900M869
7211f604L268L075P201Rj026o239O247j689j6179j8929M825M886M830P230J0144
7196A049O285k1530j514M102j1352j988Q514P260J2549Q235K825j6502o801M458
7182d410J353r463j5865l319J6941J4303O108m221j39Q035p449o480j634q455
7168a4695r055J1508J1146k595M110J1534l345j1211m890j6603k571L982J0600
7155a2085R202j2768O127J1371j1014k2599j5352J9439J8164K259L161J4463J4388
7142B4756q245n907m513M327j1849J169K805n24p945j8030l284r671K918L912
$$ y = [-344, -2578, -8611, -15857, -18914, -17746, -3152, 1254, -1544, -1295, -3356, -11497, -10311, -13869, -17406, -18156, -19407, -2311, 12858, 11235, 4212, -3161, -1342, -9861, -9092, -6168, 14099, 9427, -11473, -6604, -3336, -261, 6940, 6949, 5923, -316, 5931, 4242, -11937, -30866, -26041, -21155, -16325, -9095, 1049, 7334, -14196, -15710, -11608, -22960, -24948, -16434, -9174, 3375, 11610, 14435, -2067, -8868, -4410, -3057, -12520, -28385, -31704, -14763, -460, 5648, 1427, 1288, 9323, 1874, -4606, -6240, -14695, -23750, -12242, -1096, -3691, 419, 11953, 8608, -2603, -7493, -24096, -26667, -22685, -12085, -2883, -15651, -9524, 1847, -9167, -31766, -47118, -27679, -9515, -7256, -4095, 10368, 24756, 16511, 10604, 6091, 10418, -1431, -262, 2543, 2019, -5926, -23956, -27240, -36911, -33993, -30081]
7128c0081Q023M455R433p125P365K3447J387l2229k0744J3570O981l792J4121
7115e189J3415k427l145q623J72J404P087p43K026m826o280n39L16N565J371L848
7099C432O312M156j5611k0333L054J1755R185o933O621J6537J2693q300k4494
7086a926J1250O900O04k679P57J0690l484M180L842j4722j3853P539n469K233
7072E862k460L454j576j1426j4309m197J0372j729M712O40j1097K595l332J6282
7058f209o31j259j2793m143Q494L273J4375q494R788p206l134m320M881J0435
7044C057J496j2972j701j641L057m31r682p060L465Q128J4321O599j1039j8469
7030b2872k6421M703K0006O556j324K3319M645P114q911J704J6427j2093q518
$$ y = [-30081, -22058, -17603, -8170, -15295, -7930, 15517, 16904, -15325, -36069, -22499, -15518, -19310, -5189, 8226, 5799, 2654, -5969, -5797, -4393, 2694, 1951, 3977, -849, -7129, -7668, -7352, -1787, -416, 3432, 9744, 13900, -1711, -22044, -18990, -7235, 1950, -4983, 1638, 18175, 30868, 22568, -1926, 9324, 16224, 16828, 14149, 14906, 25596, 22112, 26292, 30134, 15412, 1559, 9098, 3629, 5862, 3402, 6856, 5280, -6146, -20455, -24652, -14280, -16009, -11297, -10657, -21754, -19159, -22491, -6209, -6840, -8099, -20892, -25035, -16541, -13268, 1107, -7387, 2401, -4805, -7939, -12259, -7378, 3057, 4553, -8419, -10120, -11761, -8704, -9135, -18817, -25877, -22412, -14284, 37, 6636, -4403, -22872, -49293, -44590, -24584, -18028, -19352, 3967, 8612, 15726, 6815, 8519, 24946, 12853, 4335]
7017D335j2004N96N698k695K8668r825j4266J5910L122j946n857L363L655j3777
7003D977J2288K057q31j617L16r801j9593n065J4969J1274J691q725m502j4331
6989a6893M718M226q236J548m836k676m678N90J2640L844n117n447m754L06J0066
6974a4699o138L35K936Q258p096N089R354K955o35p200J2038K608J13J995j717
6959H196L71k440j7954j096N193q293Q372l390j0305j0764K7369J8582L520L007
6945B0368q531m567m748l192n239J0778J0433j413k5616L392k01K135P457J0168
6931A1224n554j0540q578r368O562P74K951Q716j806r1j1978L788o795m174K1751
6916c118J5916j1227N74j646p206K979p897P45M979n999L504J17q137L523j1993
$$ y = [4335, -7669, -7073, -1375, -4070, 24598, 14773, 507, 16417, 19539, 17593, 11736, 15099, 18754, 4977, 17265, 19322, 18491, 16874, 17190, 7389, -12204, -17269, -2300, 8974, 10665, 1940, -2562, -16893, -12175, -7949, -16185, -14637, -19473, -22149, -26827, -26237, -13597, -9753, -14870, -20317, -25071, -24765, -14699, -20837, -20502, -17566, -9308, -16404, -11315, -1961, 994, 359, -6841, 5197, 7805, 7918, 9913, 8196, 8567, 6127, -11827, -12923, -7730, -16023, -7651, -11041, -21346, -32110, -4741, 13841, 17361, 20368, 11837, 7270, 2522, -670, -5909, 4869, 15302, 13889, -11727, -8335, -8536, -6401, 1056, 11224, 5670, -4870, -13448, -22816, -16254, -15480, -12529, -3813, -5619, -5710, -17688, -13900, -20695, -24869, -3118, 12798, 1571, 2145, 499, -6707, -3728, -11625, -10880, -5901, -11900, -8396, -8279, -16416, -12893, -24886]
6901b4886m672l589m172J3815O783l076O961n889k90K378R802j541o73O735O334
6886D020j986K591J0519j163j8621k3210M256J2770J1458M956O708r03m315M622
6872A1702K205j639r680j5310m022p101J0905K6600J3900m972n687j4915j9594
6859a7608N480Q020N117j2163J2111J0338j0230Q334Q053j872q005o626P456p740
6845F65j2092J1858J6625j3410k546j4357j7725l71R833p72K235q6J0707O173
6831c263p04k852O162o299J015j0203o940K6625J4260r075n265r507J2962o412
6817E04j3968P210K372j699o413m463R923L164q69J83o487p437o721J1883P447
6802e371r841j031p10l006J2039j523l450M515N971P67j5927M813J2995J646Q509
$$ y = [-24886, -29558, -33147, -37319, -23504, -16721, -19797, -12836, -18725, -19015, -16637, -6835, -8376, -9049, -2314, 4020, 2034, 4625, 15144, 13981, -4640, -27850, -23594, -10824, 634, 5590, 12298, 11395, 7080, 11702, 13907, 12268, 2588, -12722, -16744, -23845, -12940, 13660, 27560, 22588, 16901, 1986, -17608, -12128, -4108, 1009, -11154, 957, 11295, 1065, 9399, 17452, 15580, 7575, 949, 8405, 665, -11427, 431, 17056, 3646, 1100, -13257, -30982, -31353, -21520, -22292, -20057, -20143, -9436, -3263, -3967, -6819, -657, -6956, -5941, -16144, -23084, 3541, 17801, 8726, 3461, -6046, 6916, 504, -13464, -6254, -3882, -5581, -11994, -16457, -6534, -3370, -4239, -4056, -10543, -17980, -24701, -12818, -5371, -15212, -16243, -16953, -19959, -7920, -9443, -12893, -8378, -2407, -1640, -17567, -12754, 241, 1887, 10396]
6787A0396m613j4599J2614J6296N486j1113j4732m406M248J2226q993l252m429
6774d871n152J1447J6703j0502m666Q447K947j8314k0741l472R164Q555N06R551
6760c98J9337M573m049k0457r131N963K8447R751j7089j8307q693n985j6546m540
6746c7124O584K2657M387j3976k062P318N015P866N008N077o842J51j620L081
6732E520M669j6565j6234K211K0668J237j2567k0490r163J2371R911R217P695
6719a520N020n010p173j0557O815J4490j288J2729J3570k526l030N421j6849J30
6705A0222o416q953L699p858L194J0923q327Q855O688l657J344l936j3280P489
6691a3L41j4598j777l189M053K160J044M852n034R83J1869P250m818m827m50m283
$$ y = [10396, 5783, -8816, 3798, 20094, 25580, 14467, -265, -4671, -423, 11803, 2810, -442, -4871, -10023, 1424, 18127, 7625, 2959, 11406, 14353, -3961, -24702, -28174, -19010, -10455, -9949, -398, 18939, 23512, 19463, -994, -10125, -4162, 24285, 34036, 16947, -1360, -10053, -16038, -32584, -37124, -30540, -7883, -3496, -17472, -19534, -12216, -7201, 665, 5673, 10750, 3908, 4059, 2439, 5520, 10189, -6376, -22610, -20399, 269, 1506, -11061, -31551, -40714, -28343, -18432, -9215, -1520, 3500, -1510, -8683, -19240, -12425, 2065, 777, 13506, 27076, 24550, 21520, 26941, 10092, 10222, 3806, -5147, -1448, -9306, -6112, 4811, -3516, 5339, 12027, 8370, 9714, 5778, -7502, -13, 328, -14270, -16047, -19236, -15183, -13023, -11979, -7127, -12161, -11178, 691, 7941, 3123, -1704, -2154, -6437]
6675f437M633Q410j67l47j0023J806J0353L386o506j5893M447J0038n322J4197
6661A2575n414k0j193J1818J192q825k0777J065J2040K871J677j234q843O784
6647C716l150j1506k468J5048K280n486l688r577K4522N995j6387m111o377l877
6633a5066L952K773R758L608p520L932O771J0043M039j162j0378m634p761j128
6619b773r69K276m931m612R908O695n866r171J1708J411o614m272L960J2066K083
6604A0899o424M409P674j6300q537r67J7557J049j8357r216n689q439O376J1057
6590a4908m938L605n407N022L604j661J2906j8886J0964J1961o082K02J7510L417
6576A7309j5535r74M008j408J1052j952j6261n612j615J395o00R112r650o105
$$ y = [-6437, -1804, 6606, 6439, 6092, -3931, -2125, 8228, 11614, 5108, -10785, -6338, 3700, -1622, 12575, 7161, 7141, 5948, 17766, 18958, 10133, -10644, -9579, 2461, 5332, 7009, 5775, -3068, 3716, 566, -10940, -13408, 1640, 3920, -1566, -5254, -14831, 9691, 15686, -701, -4812, -11189, -15066, -11114, -8341, 1417, 5025, -2495, 1437, 8208, 18251, 22290, 21128, 10750, 6116, -1645, -2773, -3742, -1466, -6397, -11009, -1101, 5594, -272, -9443, 2265, 3676, -2938, -7210, -3250, 8816, 10899, 4475, 8884, 16558, 258, -8279, -9246, 8311, 9360, -8997, -18213, -23902, -32341, -25965, -14908, -19846, -16241, -21648, -16626, -13022, -14683, -1777, -20663, -9699, 2262, -3820, -3618, 13892, 17309, 1774, 800, 4808, 3400, 14452, 12500, -3761, -9373, -10988, -9593, -10193, -1081, -10731, -16836]
6562a6836J5035N666p553n122k665Q463K0741j162l258m942l057j8094k705r412
6548b4901N617R19p335o382P011J4413J2148M842j0366j4054J5644J995q157l689
6534a2295Q599Q901J66j431k086l450j2766N089Q464r898J406N321l169j0432
6520a7581J088o395m043N024n441J1152j127J7468o743l027J1078K209m806M310
6506C166m742Q33j0941j7023J147p917J4436J170o189K0862J532n316J4797k791
6492C024p220j2150p303P752L649J3923O102J3234p755j5766j0391j7207P115
6479b2993J0922k053O517l569J7576K506j807O097P426p570j6205k281J958J381
6465b095O850J947p960Q073l65j1037r622J0636J8887l18n382O854m587j5419
$$ y = [-16836, -1801, 3865, -3688, -8810, -11475, -3012, 17729, 16567, 13309, 8367, 5310, -12784, -15489, -24901, -19284, -18365, -25700, -32082, -25071, -10658, 1490, 6332, -4034, -18088, -2444, -449, -8606, -12295, -3696, 5205, 5371, 3940, 1854, -1596, -14362, -9273, -809, -10707, -9301, -3980, -7149, -17581, -16493, -22888, -26931, -21907, -27348, -16196, -17323, 145, -6598, -9625, 1453, 3662, -1144, 3166, -1576, -743, -11684, -28707, -27560, -35477, -21041, -19871, -26060, -5198, -3666, -8982, 5815, 3024, -4196, -16346, -23649, -15897, -12248, 1675, 7777, 21011, 13256, -2510, -12901, -30108, -22993, -12071, -14124, -7607, -11176, 6400, 8906, 7099, 13196, 20622, 13052, -3153, -5434, -3476, -2095, 4755, 6702, -1258, 6815, 6450, -4587, -14209, -3573, 15314, 14996, 9614, 16468, 11881, -3538]
6451c538j6114j1730r985J6158K6457J2104j066q880K707Q666L505n267j0680
6438B337J4701N566K015K202o309k380m921l26j2320p216k403L270K636M074L032
6423C958m486O465K928k788j5193l732N66k268J0955R807L166Q284N527J831m943
6408B0077q616k0453j7979L987q720j3621K047J8486L938J131N840j790j2903
6395b8576J5691p552j3486K2763K6672O871q992R230L180j2590J076j0772n289
6382a774Q937M75j4405J357l758j2278j029J0465r151M698M150Q965J1563j1215
6368c000j606r105R752J0182j0086q079k902R205J5445M674J2398M259j1190j6438
6354C509j8842q277Q332o174k3257j0876Q165J9218K3025l076o359N662J3225
$$ y = [-3538, -19652, -31382, -41367, -25209, 1248, 13352, 12286, 3406, 6113, 14779, 18284, 13017, 2337, 17038, 22604, 24619, 26821, 20512, 18132, 13211, 12885, 565, -6651, -9054, -5784, -3148, 926, 3958, -528, 5937, 8865, 6077, -9116, -12848, -12282, -14550, -3595, 6212, 9378, 17662, 23189, 25020, 20077, 11461, -8992, -26971, -22984, -31704, -45325, -43278, -24792, -20854, -19723, -13883, -15673, -28576, -12885, -20437, -33923, -11160, 15512, 22383, 13391, 22621, 25801, 13211, 14287, 3515, -1774, 7163, 7638, -6767, -5410, -9168, -21446, -22475, -12010, -21161, -16463, -12313, -3348, 8215, -3000, -4606, -13711, -3959, 6223, -3863, -11942, -14844, -5639, 9806, 14480, 26878, 31137, 19947, 3509, -15333, -23610, -15278, -21452, -44709, -55585, -47420, -28202, -5177, -8253, -14612, -8950, 4275]
6341D275l002m843j402M101p067j0332L807J1780O999j0545l81p912o538P998
6327a3062j262N122K669J971l600l001N343n066R862J2955j4312j8325r39J4201
6313g444k943K523j2963j8105l498P458J6945O898J4183R577j1097m663M804J627
6299C302p892J715j136n015j274q096m11J6639o784r754N292o50R685K176p275
6284i478m754P850j2081j1201p057K0375K4133O258k8o331k1311r369k829J3199
6270a2624L932J5393M368j1142j8223n95K111M527M885J656P012j7687j3458M694
6256b5151L17q909k813J2795o01O470n650Q847Q529j125n155j746J1731J1553
6242I092L311m675o678J3309P11p526q233M785l635o317J1945r560j6420Q570
$$ y = [4275, 1273, -3570, -4972, -871, -7938, -18270, -14463, -2683, 4316, -6229, -6610, -14522, -21060, -13062, -14324, -9202, -6533, -4562, -8162, -11163, -5820, -10886, -1024, 11931, -2381, -20706, -21645, -7444, -10387, -7864, -20827, -38932, -42430, -34972, -18027, -11129, 3054, 12631, 1534, -3129, 1675, 3302, -4590, -2875, -4011, -9026, -10300, -18396, -18807, -2168, -8952, -18706, -13414, -14064, -4379, -2203, -9478, -14232, -6382, -18463, -29664, -36721, -16346, 7787, 14045, 14017, 7686, -13625, -22994, -25823, -12624, -8692, 6701, 11069, -73, -18296, -18891, -16780, -12253, -7368, -5712, 1300, -16387, -29845, -25151, -24834, -33743, -36556, -23761, -24362, -17892, -23542, -14695, -6166, -7291, -12446, -14192, -2461, 9092, 12403, 7728, 1050, 14359, 15070, 7544, -689, 4096, 461, -5856, 6089, -3471, -19891, -11321]
6228a1321j430j373L479q239M443M389J3780M406n289J1983M726j2072o229j5198
6214a3945l4J8699n93j1503k943m150n721O670N449K2300J218m549J3646R029
6200C3573q253k1217n290J9223Q308k197M340n889j4213k2487j3659J1821J4512
6187a428N438r33j950k5m52j2612M691J9657K204j5369r259N558O289l057O652
6172E404N686o777j1947J0582L285K673j0236Op968p197J0797j940n55o605n217
6157b0009J3480N237J0846m271K338K656P242m12q466O918O206J5988k470p867
6143B7416j5617j0707j4496l041N856j07O722K1928L149q436p711k948R82r497
6129f507j5613O076J1144j0218L655J2754m415j3486q306p277m90Q246j47j812
$$ y = [-11321, -12751, -14124, -10645, -18884, -14441, -10052, 3728, 8134, 2845, 14828, 19554, 7482, 1253, -13945, -13979, 4720, 4127, -7376, -10319, -14469, -20190, -13520, -8071, 14229, 15447, 10898, 24544, 33573, 25320, 4103, -1187, 18036, 26344, 24147, 28487, 22598, 8385, -14102, -27761, -15940, -1428, 4010, 3077, 1127, 1102, 650, -11962, -7271, 12386, 14590, -779, -10038, -4480, 1809, -1248, 5404, 11090, 4313, -7634, 2948, 6233, 8906, -1330, -1324, -9292, -16489, -5692, -7632, -8187, -14792, -20009, -6529, -1292, 9554, 5283, 7621, 10277, 17519, 17107, 8641, 15559, 21765, 37753, 35283, 27416, 11799, 1092, -13404, -16445, -10589, -10696, -3974, 17954, 21103, 12667, 4956, 2008, 2990, -6507, -22120, -16044, -4900, -15118, -11463, 1291, -3124, -16610, -24916, -32193, -32683, -24437, -24584, -26396]
6115b6396J5977J3079R585K246o116L5j5160j2798L984J1228J0252P303N40L616
6101A7375j172p678j0225O626K5658K118j0860j5144o456K222o811N608j0207
6088h946J704R663j14p094o99n76J7987N378l628j4217j104j307n099N742j495
6073c805m54l936r338J5041J5653J5263R251r520k0590M798j153j2907p209L333
6059e573n135K189K997o289Q097o466R773L493lp097N407O975L684j490j0897
6044c35j2112j0878J082r894l696J8900J6789l804J1566L800j2820L251m045J2731
6030A0535L187J274o267o754K438r59K455J3786o44q899j0388j0711k43O871m54
6015d773m990Q551l098R491j2465p343J690Q105j593J3550O974r530j0081o266
$$ y = [-26396, -10419, 2660, 12245, 14491, 8375, 8410, -6750, -19548, -15564, -4336, 5916, 13219, 13759, 17375, 16203, 8525, -1700, 4926, 30584, 32702, 21842, 6698, 242, 2464, -4347, 1261, -8946, -7242, 2421, 2307, -4787, -5486, -6062, 11925, 17303, 13675, -542, -1646, -2953, -8052, -2310, -3805, -4259, -8195, -17533, -2492, 13161, 28424, 37675, 28155, 7565, 12363, 11210, -1697, -8906, -5573, -10708, -8519, -5522, -11811, -3714, -10180, -407, 3086, 3083, -4014, 1393, 8368, 12052, 10562, -335, -12447, -23325, -22243, -32137, -35833, -16933, -144, -3948, 7618, 11418, -1402, 1849, -2196, 10535, 13722, 14996, 8729, 1975, 4413, 3454, 5909, 19695, 19051, 10152, -236, -10947, -11190, -4319, -4773, -9763, -1212, -4310, 5181, -7284, -14627, -12937, -4832, -6425, 7125, 14099, 4569, -5512, -11778]
6001a1778N502o915O798N968q68P261O137p26n690j1741j3263j259J4583L910
5987b081K126o086j2458M116L430n150M248J1547L9j573k4j6303o550P175R594
5972g950J2402L394j0412O059J181L995L849K332R13L540p722r431r450n25J0306
5957B481J20p160K507J1572J021n363q48J977p81k801P073j0769o028O811J524
5942A336L986k952j8J065j0568j1226L746J0744O55n0l931R44K326N398j603j1303
5926a1451L872j37R111J3864n734j0703j1955r404Q908R880m832J0354J1903q708
5912D968j8658P737J3820m555o055k449P2l215N708R514r204R27K668M964O093
5897A2335K112j2914j6618K769J576J976Q784p556n471k0786O590q55M497J8087
$$ y = [-11778, -6276, -13191, -6393, -425, -1293, 5968, 12105, 11379, 5689, -6052, -19315, -20574, -5991, -2081, 45, -6041, -18499, -14383, -10953, -16103, -11855, -308, -269, -1842, -1866, -18169, -24719, -17544, -7950, 4452, 7846, -2566, 3493, 4674, 8669, 12518, 14850, 15763, 19303, 11581, 2150, -7300, -7825, 2481, 2601, -4559, -2052, 9520, 10541, 5178, 4330, 6307, 5526, 2725, 9798, -971, -6999, -188, 1336, 5322, 2370, 2352, 3417, -7151, -18377, -14631, -3887, -3232, -3282, -7213, -6269, -3943, 1455, -148, -11451, -7579, -7716, 1395, 15259, 9525, -1178, -13133, -22537, -13629, -3749, -8581, 1773, 13676, 4968, -13690, -5953, 7867, 3312, -2743, -5192, -5120, -8335, -2627, 6887, -2317, -1390, 1278, 6242, 12335, 14447, 1533, -15085, -12316, -10740, -8764, 20, -7536, -13007, -33793, -27203, -28058, -23561, -5474]
5883e474Q172j5645j189l769J082J8970M690M984j6656J650J0425K882K718l976
5869H864p611j1516O985P264j0627R401J2813J2156J587j1884j1183j4600r326
5856a7677J0282J3382l329n904P245p067j5361q197q711O401O609K7557K2884
5843B8114j2047j2613J2476n048j2921r752K490k2896p630L259J8559J4826Q804
5830E621Q0j4352j3958Q648N866j4042j1008J4053l72l2P525j0053l138m029K0288
5815h903J665q853j0389L696J2228L496n361J3987J181l158M635L549J066n922
5801B917j920Q733J0018r024O775J6123r867j6188p97J7095J957k0475r119L417
5787c55j0689J827Q918J4158q909p386l596O107Q985k12j0400L020l351j7430
$$ y = [-5474, 2698, -12947, -14136, -17905, -16823, 2147, 6837, 11821, -4835, -3185, 7240, 10122, 12840, 8864, 1253, -10263, -3278, 3986, -6641, 2760, 15573, 27729, 29316, 17432, 6249, -8351, -17677, -7395, 5987, 2658, -3246, 3999, -3068, -18429, -26626, -35337, -28936, -22327, 5230, 28114, 16067, 3454, 15930, 10882, -2039, -11791, -9301, -32197, -39827, -36568, -18009, -3183, 5621, 5701, -8651, -22609, -13961, -8095, -22137, -33145, -19092, -19464, -19496, -11971, -22024, -25162, -29191, -8903, -7238, -16091, -26480, -22784, -10556, -7060, -12421, 1566, 2747, -411, 4224, 7773, 8839, 2917, 997, 9730, 19748, 10724, 17499, 33622, 23755, 7567, 6770, 23865, 25822, 5347, -3772, -355, -11044, -9217, -299, 13859, 4950, -2436, -6032, 75, 9060, 8848, -1552, 1468, -1883, -19313]
5773a9313Q91J7455Q769n698l760q892O26J556L698k817o617p658M486r4J3870
5758c498J622j6922m308Q120N078J9607J8561L722k4264j0976m665O88j172m313
5744a2720J0032J067q962J1408k678K221l181J2323k595r989P39K9q61m480R219
5729A572N7R448m400k1661O499J7315n08N389N22O729m822N904m729k4752q503
5714a5940J0281R514Q158r260j2478j8l609l878R443Q311l454k174N06j8108j99
5699b2905O143K301N613n189l758O098J5268r20O995k470n796j8457k693N290
5685a4480J0865J1542j1750j469J3994K912N915j570l6530n350R049J0642J6464
5672A0234K1395Q657n363j1058r531j7105K140l304m283J861J7082J1021R990
$$ y = [-19313, -18422, -967, 7802, 2104, -1656, -10548, -9922, -8366, -4668, -7485, -14102, -21760, -17274, -17368, -3498, -1876, -18798, -23106, -14986, -9908, 9699, 28260, 31982, 7718, -3258, -7923, -7235, -8407, -12720, -2688, -1621, -10583, 825, -1853, 368, -2813, 9510, 6915, -3074, -2335, -2306, -3167, -7647, 1572, 1629, 11077, 6677, -14984, -8485, 8830, 8322, 13711, 14233, 20962, 16140, 22044, 17315, -7437, -15940, -5659, 3855, 12013, 2753, -9725, -9743, -13352, -17230, -7787, 524, -2930, -5104, -4598, -22706, -22905, -16762, -14461, -8848, -14037, -17795, -11697, 3571, 2651, 9646, 7176, 1380, -17077, -19770, -14480, -3615, 7927, -3823, -5292, 8702, 11614, 17529, 15959, -20571, -25921, -16872, -6230, 10234, 31629, 40286, 34923, 23865, 14334, -2771, -631, -3935, -8218, -6357, 10725, 21746, 31736]
5659C1736P341j3334j3815j2407o457R412J0271J2338L393j558N217m535L48j4246
5645A3704j5546k973l423K102n452j968P648J948j7198M470l264O668J7543O878
5631A1137j0872J7509L678j8864o039Q900j716r822j9417O567J8602M979n869
5618a227j490o669k2124J608N199J5621N116J31J1446M579j9616j1681k424J3273
5604h258m613N093L305l665L230J1837J1331q309j7462O672M985j0590n174j64
5590a1782J877M061M850M137o947L835J467j4826j97N364J5488J3596j1362j895
5576G666j61J06n358n12N418R720n160p932R629j0531l855j879j6729k685p194
5561b9457r137j988P195J2387j1976P389J0329r721K963P624R206l300k541l861
$$ y = [31736, 39077, 25743, 11928, -479, -6936, 2476, 12747, 25085, 28478, 26920, 32137, 27602, 27950, 13704, -1842, -4815, -8238, -6136, -11588, -13556, -5908, -3960, -21158, -16688, -19952, -13284, 4259, 11137, 265, 17774, 21452, 2588, -3451, 5449, 3733, -6089, -25506, -18939, -337, 4642, -1227, -2717, -9386, -31510, -29902, -24703, -9082, -3966, -3835, 7611, 12190, -7426, -19107, -21531, -8258, -12871, -7778, -4473, -8138, -4908, 6929, 18260, 9951, -7511, -839, 4146, -6444, -11618, -11782, -9905, -5844, -994, 3143, -3804, 31, 1498, -13328, -13525, -8161, 7327, 20923, 9561, 7666, 7505, 7611, 2253, 1741, 7159, 16879, 11719, 3787, 13416, 2885, -970, -2849, -19578, -22263, -29457, -38594, -40582, -33387, -21000, -32976, -25587, -15258, -24979, -22016, -14392, -5186, -8486, -11027, -14888]
5547a4888o947P383K06l771O943j806j673K322o322j6736j053o505Q696K3213
5533a0938J2598n297j3198L241n666o453J8612K597j936m34J1715J3230K792o961
5519A3902j3954m627k303j1505J2191J7413l825j6578j2340m695M171J5174O351
5506f25J0542l63l767j807r314M984n286q929j856j032N138j7882P435N90J5680
5491f492O654q030J2250R776j537j7782j1604j0140k986J617J4837J2946J3876
5478A3385J2077p22k62n644r462k240j2092j2352p786J0508J1896l687n160J0742
5464g99r136r456L662J2016k721p757R560K5319Q512p540k6133r122J0068J4177
5450A0650j217l252J642J5326N813j6621p360j191q383J0055Q718K357K762q489
$$ y = [-14888, -21835, -14452, -14246, -18017, -11074, -12880, -14553, -12231, -18553, -35289, -36342, -42847, -34151, -10938, 1660, -3637, -16835, -13594, -19260, -25713, -7101, -4504, -6440, -6874, 4841, 18071, 20863, 13902, -52, -4679, -6982, -18487, -6296, 11117, 7292, -9286, -21626, -26321, -22150, -6976, -625, 9917, 9554, 5787, 3980, -5334, -350, -5636, -14565, -16421, -17453, -12315, -30197, -22762, -22172, -6492, 162, -7868, 4382, 14158, 12621, -5161, -16765, -26905, -29891, -28274, -13437, -491, 13385, 25462, 24740, 24478, 18834, 9372, 7132, -4960, -17312, -25098, -14590, -2694, -6381, -11541, -799, -9935, -19391, -15729, -3713, -6434, -14191, -4631, 20688, 29200, 21660, -4473, -13595, -3527, 10650, 9433, 6181, 7823, 23149, 28962, 12341, 4981, 3790, -4593, 5462, 14180, 16537, 19299, 10810]
5436A0810n51J098o441n767p385q356R153J5689L38j1906L089N153L68k0175q789
5421b3672j35J6857J3835J0408j1193n070K96j584r916j4725J4182L841l901r877
5407b0654j4021o771P346J3326K079L877N334O736q436P415O183j701o994N651
5393f30O206L255n466q985j1104J5063o530J087K704j5067p236M521j230m230
5379b7642j783M752J1677K2512J3837J5221j205K366j1043k832j4081j4654L520
5366F45R208j964m190k203j7701r055Q393Q424J7363J168p474k478k999J803o92
5351a752l765k008j0698j5865j834L075J2293J0973r001L640J2153Q838J2418
5338A8467R387j0175k0907o353p01R940L883K009L105j968j5423M094J3996J2279
$$ y = [10810, 10259, 11357, 4916, -851, -8236, -16592, -7439, 8250, 8588, -3318, -229, 4924, 5292, -14883, -23672, -23807, -6950, 6885, 17293, 6100, 1030, 1326, -258, -10174, -24899, -10717, -6876, -10777, -20654, -34675, -41446, -34100, -20774, -18695, -14818, -9484, -2748, -11184, -3769, 2414, 713, -6281, -630, 5576, 8831, 3365, -5620, -16724, -1661, -8191, -7104, -4400, -19467, -26703, -22182, -23412, -27642, -29425, -24673, -12996, 9516, 23353, 38574, 37369, 39735, 28692, 25860, 11779, -2875, 645, 9853, 7889, 3699, 1496, -16205, -25260, -16867, -8443, 8920, 10088, 2614, 136, -2863, -1060, -1752, -5517, -7525, -18223, -34088, -35922, -32847, -20554, -9581, -18582, -14942, -2789, 6049, 18467, 27854, 17679, -3228, -9581, -10282, -342, 3541, 5550, 8655, 6687, -8736, -4642, 9354, 21633]
5324B1633p476j0075N950j5512j577L747j0162J245p606j1650O229J8704K1540
5311A4990k947j1354j6737j4920O932M576R80K463J4204L602m325J2738J597n395
5297F404j2553o168M710j682P121J0075l925k2007j2760j9057J0829K4509M542
5284i962j0877j482J2605j461l45j528k818j43L489J2714k062l407r088p460m432
5269b6257R024J2844R347j1277K603k144l668Q493p456R62l132J2950N507r58
5255F838n213N260n802p719J1023L095l636M796O716P038M244o152n015r888L157
5240H742l397l116p338l263J4184K1877j734K560L557p903k0988j4811j337M569
5226h398k091N82k629k261j1583m371J1194J1369L136p095J95Q849M640L422p752
$$ y = [21633, 14157, 4082, 10032, -5480, -7057, -3310, -13472, -12227, -19833, -31483, -25254, -6550, 14990, 12043, 689, -16048, -30968, -24036, -19460, -18480, -16017, -1813, 1789, -2536, 10202, 11799, 6404, -6149, -12317, -7607, -9289, -2168, 7907, 3982, -18025, -30785, -49842, -39013, -14504, -9962, -20839, -22321, -9716, -11177, -11522, -13050, -15868, -16011, -12522, 192, -1870, -5277, -14365, -21825, -26257, -17233, -4389, 4958, -6319, -3716, -5860, -9528, -1035, -8491, -7529, -10661, 2289, 7796, 6838, 1625, 6885, 1083, -6636, 4387, 7482, 3846, 8642, 15358, 22396, 26640, 20488, 15473, 5585, 8742, 5345, 2229, -5109, -8372, 5812, 27689, 25955, 28515, 32072, 24169, 3181, -11630, -12967, -8398, -10489, -9907, -12536, -14797, -26380, -30751, -19557, -8188, -5052, -12147, -11952, -3103, 1537, 4959, -2793]
5211b793l852L857j744L231j3232r662L870r982n36J2484Q468Q853k914j0403
5197a4355q656P048P093O695l580j3091j941J8678N221o669J6237K711j94N807
5183B1004J827j1548Q97k837J614o159J524J2897r114l373J143J2721K159m920
5169A7835k355j3o260l787P977p301J220q036q591n479l725l410J484O569J1258
5154b614k745j341J0481m097j0542o701J925J7088K405m209O821l106k495k233
5140a363l345j8961j3067J2405J2595J6160O202r861J1694l842p517J3065j5387
5127a222o179L134J664j7122k4270N369K2676J4791L475M788o640m945P469M337
5113G325j5955k84P366K244r369M197j1934n903n920J8462J7181K1940o54k1762
$$ y = [-2793, -6645, -2788, -4532, -1301, -14533, -24195, -20325, -30307, -30843, -18359, -9891, -1038, -3952, -14355, -23011, -15963, -8870, -2175, -5755, -18846, -20787, -2109, 3112, -3557, 12680, 15391, 15197, 21004, 22831, 11283, 12180, 9343, 10957, 4798, 6322, 19219, 10105, 6732, 7875, 20596, 22755, 17835, 15480, 15467, 9207, 5420, 13397, 6096, 7316, -720, -9311, -14790, -18515, -21925, -20441, -13872, -2614, -5359, -6700, 3781, -316, -10858, -17559, -15634, 1454, 3859, -350, 6471, 3365, 870, -1363, -4708, -23669, -36736, -24331, -11736, 4424, 10626, 765, 12459, 8617, 1100, 14165, -1222, -7401, -4267, -2603, -19725, -43995, -38626, -15950, -1159, 2316, 7104, 464, -4481, 2988, 7325, -8630, -8914, -1548, 696, -8673, -4476, -16410, -22313, -28233, -9771, 7410, 29350, 28696, 6934]
5099F934j0296J1255O487J2786O452p405J919M143k6137j0050R156m529m146j977
5085e408K797n062l489M104J2731k778n357O098n320K277p542k284J997p275j2014
5070b6525r224O514J9262j102n820p112J6892N775L612M019j32p374q621n319
5056a5155R297K63R885J7093L432o918j84m307j4710K601L55j2099j3227P829
5042a5845J4709O682J2091J2719r030K149Q775r70r909j6036J2185l983k876n433
5028E228R029L678j4590m539Q792O629k868n620l671n316l512m093J727q81j2265
5013b2272p974j070K0416J8895o883p829K528M307J660o750M581J0083j2347N542
4999B887n979K068j1996n718M017m06k654J2153p124j6168K595p861O716J6347
$$ y = [6934, -3362, 7893, 14380, 27166, 33618, 26213, 28132, 32275, 6138, -3912, 5244, 715, -3431, -5408, -2611, -7673, -11162, -7058, 5673, 2895, -2462, 3636, -1684, 593, -6949, -9233, -7236, -14511, -26525, -35749, -29235, -9973, -11075, -16895, -24007, -7115, -1340, 2272, 6291, 6159, -1215, -9836, -15155, -5858, -5595, 4290, 21383, 24815, 17897, 17713, 13406, -1304, 1297, 1652, -10447, -23674, -15845, -1136, 5546, 17637, 30356, 21326, 23475, 32250, 31280, 21371, 5335, 17520, 13537, 10661, 5228, 14257, 17935, 3345, -1194, 7598, 14227, 11359, 5739, 2068, -3248, -6760, -10853, -9126, -10007, -22272, -30246, -31316, -10900, 7995, 1112, -6717, -4189, 118, 1778, -4972, -391, 9692, -2655, 2887, -3092, -1024, -13020, -18738, -14721, -15127, -17781, -5628, -12752, -28920, -26325, -34186, -27470, -11123]
4985a1123J241r814L128J1983N834J2497O154k585j1601n381k143M816j1928N71
4971h351o412m175O283L308r098J2738O560Q47M859l600n164J286n057j2298q988
4956b7262P083P036L426R785J519K936Q020j0077o407P828M471J4375r856o612
4942F265j3029l595J2498q098r49P453R436l292p539j3117n839L125J858l707
4928a8530Q428J78p448J979j1067k939J716K0093J4475K078r716j03J0228p595
4914A777o228J256R813j8208l107J1185J7219J190O52J279j2077r882m086m010
4900a3227O930L0629J0845n62m057p813j740j1479l511R02K512R48M613l270q832
4885B888j8156L342J8995j551L865j0555M799L129N690J344j0063P113N719N62
$$ y = [-11123, -9882, -19696, -16568, -4585, 1249, 13746, 19900, 17315, 5714, 333, -1810, 3006, -8922, -8351, -14763, -18938, -12655, -9347, -18445, -5707, 853, 1700, 6559, 2959, -2205, -919, -5976, -18274, -27262, -20179, -13143, -9717, 68, 1587, 4523, 12543, 2466, -3941, 3887, 8358, 22733, 12877, 6265, -6764, -10359, 2139, -5959, -6908, 545, 9981, 6689, -850, -13967, -19806, -16681, -14823, -18530, -10102, -9924, -17372, -15393, -26460, -29399, -27683, -7590, 6885, 8963, -753, -856, 9372, 1777, -4451, -3195, 6618, -11590, -14697, -3512, 13707, 14897, 15549, 16828, 4751, -5131, -9217, -13227, -6297, 24332, 35177, 34615, 30558, 22745, 21005, 9526, 6015, 6917, 9429, 10377, 14990, 11720, 2888, -15268, -11926, 7069, 5518, 9383, -1172, 3627, 6756, 12446, 13790, 3727, 10840, 16559, 17121]
4871A7121n66o587l442M46K423J0025j5703o241j42R985m756J0551j731K749o42
4856A3490o268M005O132p97j0437m242k178Q446Q027K444o440q271N776J3048
4842B2735k128p98j6663k0217N525J127J1629l925l638J3728m037p268J4334M762
4828A5166o092p376L989n176p256J2211J4047K587p411O77o161l218q366o096
4814h475o003J387o909N544O477J2764M981k212j6516P016N883J5785O260O431
4800C2413n261j2528r4o069O974K641l619j770j4642p683N810J378l252j215l427
4785a0344O39r839n021M510p15N05n470M854J1975M294O511n230q233p366J762
4770a7168J2652q234j9370M962q357p937Q809p373r404J4557R494P124K248m609
$$ y = [17121, 16555, 9968, 6526, 6972, 9395, 19420, 3717, -2524, -2666, 7319, 2563, 13114, 11383, 14132, 13490, 7222, 11227, 17359, 16562, 6125, 1883, -295, 8151, 16178, 18622, 12182, 3911, 9687, 22735, 20607, 19809, 3146, -17071, -11546, -10419, 1210, -2715, -6353, 7375, 3338, -3930, 10404, 15166, 9074, 1698, 5687, 511, -6745, 5466, 19513, 22100, 14689, 15366, 9205, 5987, -2379, -8475, -14478, -13091, -20000, -14456, -7979, 4785, 9766, 7554, -8962, -1946, 3937, 19722, 25982, 32413, 27152, 14624, 14530, 8461, 15435, 18076, 14457, 12687, -1955, -9638, -3828, -2450, -5702, -6917, -10344, -9705, -19544, -24565, -20055, -20770, -20265, -25735, -20881, -8906, -4612, 1899, -3331, -11564, -18930, -17168, -4516, -12750, -32120, -27158, -35515, -43452, -34643, -42016, -51420, -36863, -27369, -20245, -17997, -22606]
4756b2606N892K697n372R602M412m692K494L69J2400p344m050n602J5609Q258
4742A2067j3941n327q963j839O371J443J3096J7063k968o848Q542O358r485j0725
4728D844j0922J2029J4841Q192r371k4434K307j0165j223L029J770J2884n556
4715a775p388J965R19j4158p495Q046J8494o163l660o90J496Q458j749m899o588
4700a5187J0685K3366L384l489j2696q784j62J072R183J4109Q850M821j0440l4895
4686a0183o372J011j905K123K037l18K516P177K854j995j563k637m038j241M694
4671g840K922O023M559o135J9832o796k0789j1922J9783K785j7132j925J6463
4658a72j2505J93N264j677N855N312M495Q191k075J0165j507K326j664j0847m247
$$ y = [-22606, -16714, -14017, -19389, -9787, -5375, -10067, -7573, -7204, 5196, -2148, -6198, -11800, 3809, 12067, -1874, -7201, -16164, -18003, -11632, -10189, 2907, 19970, 17002, 10154, 18696, 25054, 15569, 4844, -6078, 5951, 20792, 28984, 19613, -4821, -2514, -12679, -13902, -10873, -9103, 3781, -1775, -9163, -7198, -6279, -20437, -27932, -19886, -1392, -7555, -11215, -11905, -10409, -1951, -3700, -8599, -15187, -4502, 18864, 22248, 18759, 6063, -2721, -2883, -1811, 7372, 21481, 30331, 35152, 24712, -10183, -16555, -15544, -17449, -15326, -13289, -13607, -11091, -3914, -1060, -3055, -4618, -7255, -11293, -12534, -7840, -4918, 1105, 5664, -471, 19361, 12565, -8224, -20146, -363, 2422, -14710, -16635, -172, -12677, -12484, -7220, -8897, -3042, 2270, 6765, 14956, 12881, 23046, 21539, 23865, 22201, 11354, 7107]
4643G107O830L562j0450r490L261j2736J7220M754p399j3187o682j711J3810J3536
4629H425p790o193k7N695M080O293L477L00n354p7O91j5288k8554R378J3704J8296
4613G056P095K629R13j612n78K509K23L584J0459q731l443q76j1630J0m937J0871
4597A3542J716L688q090o814o582j751k736k529j0463M32r702J764Q954P994J9532
4582H955P482q367l449J3278J1406m753l641R243m515J0328j018k7637p807j8043
4568a8538m77O946o089K569J831J9239j2866o586p660J1558R922L908m866k811
4554c920Q559n314j0099j6198j4226J4094J3739K5600J3994n648k3158j748R556
4541E231R827j7518k8013j1599J2186K1816J679m497J5735J3395q425n158l593
$$ y = [7107, 13937, 17499, 7049, -2441, 820, -11916, 5304, 10058, 2659, -10528, -17210, -18921, -5111, 8425, 635, -5558, -5585, 110, 4190, 10483, 13960, 14260, 8906, 8829, 9520, -5768, -34322, -24944, -11240, 7056, 14151, 16780, 17693, 16081, 15503, 18012, 18235, 21819, 32278, 23547, 20104, 19228, 7598, 7608, 2671, 13542, 15258, 18946, 10856, 4042, -2540, -4291, -7027, -9556, -20019, -19587, -29289, -27525, -18571, -10577, 8955, 16437, 8070, 4621, 17899, 29305, 24552, 20911, 30154, 25639, 35967, 34949, 7312, -495, -18538, -19015, -12069, -18158, -15589, -13758, 5481, -7385, -13971, -21631, -10073, -151, 3757, -1109, -3920, 4639, -675, -10774, -26972, -41198, -27104, -13365, 12235, 26229, 20581, -2577, -4325, 5231, 15058, -2460, -30473, -42072, -29886, -8070, -6391, -10888, 4847, 18242, 9817, 4659, 1066]
4528A066l239K013N337R681J090j1098j0683N568P25j911N927P623N663n632o047
4513F083j3235n699J1656P91K872J8890Q041q6j469r746j4170l942J724P182o3
4498H829o978P413J3966o690n284r21p639j6976O472J757j2631J0569J761M415
4484a937j5331j6119O864k755M026J2987P927O477p236j5484j9627K12J3713J9812
4470f471Q049o593M85R49o381n257J093J605R100J4954J4418o280j46R042L080
4455C1647j8657j6771q041j977m928L370O081m325m520N371O445J9293j779k334
4441H875n883q467M282l091L488j788N833p083k428N742J8997O296r036P55p580
4426H912j6168j841n300R520Q555l996O124k171M914O366J249l915j235j2666
$$ y = [1066, -2173, -160, 5177, 14858, 15948, 4850, -5833, -265, 460, -1451, 4476, 12099, 17762, 12130, 6083, -7152, -12851, -1195, -404, 2468, 21358, 29399, 29313, 27844, 18098, 3928, -14, 1710, 8892, 8829, 1851, 9264, 23230, 16540, 11256, 10335, 2696, -14280, -7808, -6051, -18682, -8113, -6352, -1937, -17268, -33387, -26523, -29278, -25252, -12265, -4338, 2139, -5097, -20581, -40208, -39996, -26283, -6471, 1578, -5015, -4530, -3581, -9962, -15219, -14126, -12521, -3421, 11533, 25951, 19671, 19525, 28567, 31647, 12990, -3781, -11822, -13799, -18727, -15357, -9276, -13601, -18121, -12750, -6305, 12988, 11209, 8875, 2992, -5475, -1193, -4284, -796, -2584, 3249, -3834, -6262, -520, 18477, 24773, 15737, 16492, 8912, -7256, -9097, -14397, -4877, 3678, -318, 5806, 3635, 8549, 14915, 16164, 12249, 11014, -1652]
4412a652p668K352l221J954J2512J1243r391j8006P432P423M796j0846p261J286
4398i047L326M077J878J4650q303k4547J3695Q365J509n364q612j3123p511J0546
4384a8461J2533p442l891L621R60j1288k446J0522r88q765M470P03J0195j587
4370a1864M319m852j0291J071J7805K3400P57j3234j3858j2447L10p92j296j3305
4356c4277j4610Q180Q858l146J7064J9944P152j5541L694K0378P135q060L619
4343B0390M636j7451o202N48M815j3572o295N67j825n273n521L94J2649k058l135
4328a7333P780J2652M12j825L413j2806j2946P387J3569n477o570J3600j2949
4315a1093L442J4836k418O547l549k949q543r213N188N066n786J3913j1823j3355
$$ y = [-1652, -9320, -6968, -10189, -8235, 4277, 15520, 6129, -11877, -4445, 2978, 7774, -3072, -10333, -9047, -5721, -1644, 234, 14884, 6581, -17966, -4271, 4094, 5603, 239, -8373, -21496, -29007, -18461, -5928, -13370, -17261, -13640, -12680, -23968, -26414, -15892, -16880, -25645, -21175, -20472, -10277, -11864, -7545, -12397, -22688, -21617, -3812, 19588, 20345, 7111, -6747, -19194, -18884, -19676, -20972, -34277, -48887, -40707, -31849, -34995, -17931, 2013, 9165, -6376, -2682, 17696, 24831, 16771, 20390, 25026, 7575, 1373, 1921, 6736, -6836, -13131, -12564, -14389, -19662, -25183, -24789, -12140, -14198, -17333, -9553, 3099, 3511, 1686, 5099, -7707, -20653, -13266, 303, -5174, -11744, 1856, -11093, -7651, 7185, 4767, 11314, 7765, 4816, -3727, -12940, -7752, -2686, -8472, 5441, -6382, -19737]
4301a9737K2521J0117n002O956q72j1885j2519N326J7584J358r488n40L415K498
4287I732j686j578M100o263P068J1117j510m299J0431j9000r051j2667O43j108
4273a4071o580J9290J7604j383q71R04J14j2683n293o56O260P122n829K614r547
4258c005j4541j919J3872R475r268j1814q086M238J7301j0183j046N778o100o169
4244b1467N082Q513Q832N400J0174L355m870L058l96r882P977J1371l973j6769
4230F405J033L580l318M531K273K804q108q221j574j2486m967J0345Q029p661
4216g335p772O96N01Q224R024R81j0369L570k751l559M077K163j114m364j3204
4201b1232n63J7816Q809J808R564O515N5j0895j4689L986o941j071N516p519o20
$$ y = [-19737, 2784, 12901, 7899, 14855, 13983, 2098, -10421, -5095, 12489, 13847, 4359, 3819, 7234, 9732, 8046, 6468, 10568, 4305, 11373, 22490, 20980, 16681, 27112, 8112, -939, -13606, -12963, -14071, -20651, -1361, 16243, 14860, 13989, 14893, 15007, 2324, -2969, -3625, 2635, 9757, 3928, 6542, -3005, -17546, -19465, -5593, 3882, -5386, -17200, -25286, -21048, -3747, -13930, -14976, -9198, -15298, -21467, -16385, -7872, 960, 6360, 16534, 19889, 15019, 18077, 17681, 7799, 15776, 27147, 23174, 6405, 7438, 11018, 7700, 12231, 14504, 17308, 9200, 979, -595, -13081, -18048, -7703, 326, -7335, -15107, -14411, -13910, -5686, 3338, 4319, -6050, -2480, -5231, -8790, -4713, -2550, -3664, -8028, -21232, -21795, -3979, 4830, 6638, 16202, 22717, 22772, 11877, -2812, 1174, -5767, -6838, -1322, -8841, -9461]
4186i461J0921q784p39m80K456l341K826N371P12q66p922Q463J2510L704r001
4171F369k18j5544p627k860L410j0415k137R839Q693R217l979o65J827M794l864
4156c160p423k135P451O836o675O225N566l522N838l907o120l411j6358j6719
$$ y = [-9461, 1460, -7324, -8063, -8543, -6087, -9428, -6602, -1231, -519, -1385, -9307, -844, 11666, 15370, 6369, 6151, -9393, -17020, -19880, -16470, -26885, -29022, -19183, -10490, -1273, -5252, -5917, -4090, 704, -3160, -10583, -12718, -5267, 1569, -5106, 1119, 6685, 3163, 9001, 5094, -1026, -4437, -20795, -37514]
$$ [...]
##END NTUPLES=NMR SPECTRUM
##END=
