##TITLE=Analysis number 314903
Compound Code cc 00612
Project Code adrs
Chemist Name ugmt
##JCAMPDX= 6.0         $$ Bruker NMR JCAMP-DX V2.0
##DATA TYPE= NMR SPECTRUM
##DATA CLASS= NTUPLES
##ORIGIN= Bruker BioSpin GmbH
##OWNER= NMR
$$ XWIN-NMR		Version 3.5
$$ Mon Oct 31 11:34:45 2005 GMT Standard Time (UT+0h)  MAYBRIDGE\NMR@NMR_250MHZ
##.OBSERVE FREQUENCY= 250.131544655141
##.OBSERVE NUCLEUS= ^1H
##.ACQUISITION MODE= SIMULTANEOUS (DQD)
##.ACQUISITION SCHEME= undefined
##.AVERAGES= 16
##.DIGITISER RES= 18
##SPECTROMETER/DATA SYSTEM= dpx250
##.PULSE SEQUENCE= zg30
##.SOLVENT NAME= DMSO
##.SHIFT REFERENCE= (INTERNAL, DMSO, 0, 16.522)
##AUDIT TRAIL= $$ (NUMBER, WHEN, WHO, WHERE, WHAT)
$$ ##TITLE= Audit trail, XWIN-NMR		Version 3.5
$$ ##JCAMPDX= 5.01
$$ ##ORIGIN= Bruker BioSpin GmbH
$$ ##OWNER= NMR
$$ C:\u/data/dgb/nmr/ADRS/11620/pdata/1/auditp.txt
$$ ##AUDIT TRAIL=  $$ (NUMBER, WHEN, WHO, WHERE, WHAT)
(   1,<2005-10-31 11:34:25.44 +000>,<MAYBRIDGE\NMR>,<NMR_250MHZ>,
      <created by zg, POWCHK disabled, PULCHK disabled
       configuration hash MD5:
       62 19 C7 07 E1 42 D1 B7 37 6C 3D D0 77 39 F9 E6
       data hash MD5: 64K
       11 E4 13 09 5E F6 4D 23 1C B5 7B B8 CA DE 44 B6>)
(   2,<2005-10-31 11:34:36.93 +000>,<MAYBRIDGE\NMR>,<NMR_250MHZ>,
      <Start of raw data processing
       ef LB = 0.3 FT_mod = 6 PKNL = 1 SI = 32K 
       data hash MD5: 32K
       2D F1 45 2C B7 D4 A8 13 6E 40 90 F1 C4 40 E1 33>)
(   3,<2005-10-31 11:34:38.61 +000>,<MAYBRIDGE\NMR>,<NMR_250MHZ>,
      <apk 
       data hash MD5: 32K
       4F 49 AF 46 99 BC AA 98 5B 40 8E EF D2 7A EB E5>)
(   4,<2005-10-31 11:34:39.36 +000>,<MAYBRIDGE\NMR>,<NMR_250MHZ>,
      <abs ABSG = 5 
       data hash MD5: 32K
       E6 96 9A 30 C9 65 CD DA 9A BC 24 D1 6C 27 90 4C>)
$$ ##END=
$$ 
$$ hash MD5
$$ E1 FE EC 2A 17 E5 B3 93 17 C4 1A 3C 30 A5 C2 A0
##$RELAX= 
##$RELAX= 
##$RELAX= 
##$RELAX= 
##$RELAX= 
##$RELAX= 
##$RELAX= 
$$ Bruker specific parameters
$$ --------------------------
##$DU= <C:\u>
##$EXPNO= 11620
##$NAME= <ADRS>
##$PROCNO= 1
##$TYPE= <nmr>
##$USER= <dgb>
##$AMP= (0..31)
100 100 100 100 100 100 100 100 100 100 100 100 100 100 100 100 100 100 
100 100 100 100 100 100 100 100 100 100 100 100 100 100 
##$AQSEQ= 0
##$AQ_mod= 3
##$AUNM= <au_zg>
##$AUTOPOS= <20 >
##$BF1= 250.13
##$BF2= 250.13
##$BF3= 250.13
##$BF4= 250.13
##$BF5= 500.13
##$BF6= 500.13
##$BF7= 500.13
##$BF8= 500.13
##$BYTORDA= 1
##$CFDGTYP= 0
##$CFRGTYP= 5
##$CHEMSTR= <none>
##$CNST= (0..31)
1 1 145 1 1 1 1 1 1 1 1 1 1 1 1 1 1 1 1 1 1 1 1 1 1 1 1 1 1 1 1 1 
##$CPDPRG= <>
##$CPDPRG1= <>
##$CPDPRG2= <>
##$CPDPRG3= <>
##$CPDPRG4= <mlev>
##$CPDPRG5= <mlev>
##$CPDPRG6= <mlev>
##$CPDPRG7= <mlev>
##$CPDPRG8= <mlev>
##$CPDPRGB= <>
##$CPDPRGT= <>
##$D= (0..31)
0 1 0 0 0 0 0 0 0 0.06 0 0 0 0 0 0 0.0002 0 0 0 0 0 0 0 0 0 0 0 0 0 0 
0 
##$DATE= 1130758464
##$DBL= (0..7)
120 120 120 120 120 120 120 120 
##$DBP= (0..7)
150 150 150 150 150 150 150 150 
##$DBP07= 0
##$DBPNAM0= <>
##$DBPNAM1= <>
##$DBPNAM2= <>
##$DBPNAM3= <>
$$ [...]
##$SUBNAM7= <"">
##$SUBNAM8= <"">
##$SUBNAM9= <"">
##$SW= 20.6930455092707
##$SWIBOX= (0..15)
0 0 3 0 0 0 0 0 0 0 0 0 0 0 0 0 
##$SW_h= 5175.983436853
##$TD= 65536
##$TD0= 1
##$TE= 295.16
##$TE2= 300
##$TE3= 300
##$TEG= 300
##$TL= (0..7)
0 120 120 120 120 120 120 120 
##$TP= (0..7)
150 150 150 150 150 150 150 150 
##$TP07= 0
##$TPNAME0= <>
##$TPNAME1= <>
##$TPNAME2= <>
##$TPNAME3= <>
##$TPNAME4= <>
##$TPNAME5= <>
##$TPNAME6= <>
##$TPNAME7= <>
##$TPOAL= (0..7)
0.5 0.5 0.5 0.5 0.5 0.5 0.5 0.5 
##$TPOFFS= (0..7)
0 0 0 0 0 0 0 0 
##$TUNHIN= 0
##$TUNHOUT= 0
##$TUNXOUT= 0
##$USERA1= <user>
##$USERA2= <user>
##$USERA3= <user>
##$USERA4= <user>
##$USERA5= <user>
##$V9= 5
##$VALIST= <valist>
##$VCLIST= <CCCCCCCCCCCCCCC>
##$VD= 0
##$VDLIST= <DDDDDDDDDDDDDDD>
##$VPLIST= <PPPPPPPPPPPPPPP>
##$VTLIST= <TTTTTTTTTTTTTTT>
##$WBST= 1024
##$WBSW= 4
##$XGAIN= (0..3)
0 0 0 0 
##$XL= 0
##$YL= 0
##$YMAX_a= 465551
##$YMIN_a= -422502
##$ZGOPTNS= <>
##$ZL1= 120
##$ZL2= 120
##$ZL3= 120
##$ZL4= 120
##$ABSF1= 16.522
##$ABSF2= -4.171173
##$ABSG= 5
##$ABSL= 3
##$ALPHA= 0
##$AQORDER= 0
##$ASSFAC= 0
##$ASSFACI= 0
##$ASSFACX= 0
##$ASSWID= 0
##$AUNMP= <proc_1d>
##$AZFE= 0.1
##$AZFW= 0.1
##$BCFW= 0
##$BC_mod= 0
##$BYTORDP= 0
##$COROFFS= 0
##$CY= 12.5
##$DATMOD= 1
##$DC= 0
##$DFILT= <>
##$DTYPP= 0
##$F1P= 14.0000005364418
##$F2P= -0.99999901652339
##$FCOR= 0.5
##$FTSIZE= 32768
##$FT_mod= 6
##$GAMMA= 0
##$GB= 0
##$INTBC= 1
##$INTSCL= 1
##$ISEN= 128
##$LB= 0.3
##$LEV0= 0
##$LPBIN= 0
##$MAXI= 10000
##$MC2= 0
##$MEAN= 0
##$ME_mod= 0
##$MI= 0
##$NCOEF= 0
##$NC_proc= -3
##$NLEV= 6
##$NOISF1= 0
##$NOISF2= 0
##$NSP= 0
##$NTH_PI= 0
##$NZP= 0
##$OFFSET= 16.522
##$PC= 1
##$PHC0= 56.58742
##$PHC1= 19.13763
##$PH_mod= 1
##$PKNL= yes
##$PPARMOD= 0
##$PSCAL= 4
##$PSIGN= 0
##$REVERSE= no
##$SF= 250.13
##$SI= 32768
##$SIGF1= 0
##$SIGF2= 0
##$SINO= 400
##$SIOLD= 32768
##$SREGLST= <1H.DMSO>
##$SSB= 0
##$STSI= 32768
##$STSR= 0
##$SW_p= 5175.98343685301
##$SYMM= 0
##$S_DEV= 0
##$TDeff= 65536
##$TDoff= 0
##$TI= <Analysis number 999999
Compound Code 99
Book Reference 9
Project Code 9>
##$TILT= no
##$TM1= 0
##$TM2= 0
##$TOPLEV= 0
##$USERP1= <user>
##$USERP2= <user>
##$USERP3= <user>
##$USERP4= <user>
##$USERP5= <user>
##$WDW= 1
##$XDIM= 32768
##$YMAX_p= 413756540
##$YMIN_p= -148938
$$ End of Bruker specific parameters
$$ ---------------------------------
##NTUPLES= NMR SPECTRUM
##VAR_NAME=  FREQUENCY,     SPECTRUM/REAL,   SPECTRUM/IMAG
##SYMBOL=    X,             R,               I
##VAR_TYPE=  INDEPENDENT,   DEPENDENT,       DEPENDENT
##VAR_FORM=  AFFN,          ASDF,            ASDF
##VAR_DIM=   32768,         32768,           32768
##UNITS=     HZ,            ARBITRARY UNITS, ARBITRARY UNITS
##FACTOR=    0.157963299565203, 1,           1
##FIRST=     4132.6476996994, 0,             0
##LAST=      -1043.33573715361, 0,           0
##MIN=       -1043.33573715361, -148938,     0
##MAX=       4132.6476996994, 413756540,     0
$$ Real data points
##PAGE= N=1
##DATA TABLE= (X++(R..R)), XYDATA
$$ [...]
$$ plain form
16254 43191 52777 56301 69095 87105 84179 53567 63596 118777 152574 138358 143539 134450 120932
16241 120932 143056 195272 277735 366405 463398 608874 848363 1076359 1299864 1533294
16231 1533294 1801799 2162237 2571320 2917001 3143852 3256096 3266373 3285909 3285417 3251420
16221 3251420 3124577 2863400 2533866 2190161 1856789 1562042 1319035 1079032 847789
16212 847789 642160 472364 321720 207068 144243 101041 95793 82468 56059 54695 52383
16201 52383 34142 23681 57658 77634 43411 10076 3607 7284 -17229 -3966 -1955 11729
16189 11729 22644 22484 12214 2243 -28835 -32817 -11441 -300 -16435 -40122 -49940 -39556 -78536
16176 -78536 -85512 -63514 -40869 -64977 -96114 -100815 -62766 -32370 -40268 -17433 -24463 -30489 -49334
$$ packed form
16254D3191R586L524J2794J8010k926l0612J0029N5181L3797j4216N181r089j3518
16241A20932K2124N2216Q2463Q8670R6993J45476K39489K27996K23505K33430
16231A533294K68505L60438M09083L45681K26851J12244J0277J9536m92l3997
16221C251420j26843k61177l29534l43705l33372k94747k43007k40003k31243
16212H47789k05629j69796j50644j14652o2825m3202n248j3325k6409j364k312
16201E2383j8241j0461L3977J9976l4223l3335o469L677k4513J3263K011J3684
16189A1729J0915j60j0270r971l1078l982K1376J1141j6135k3687r818J0384l8980
16176g8536o976K1998K2645k4108l1137m701L8049L0396p898K2835p030o026j8845
$$ plain form
16163 -49334 -71708 -80319 -82851 -62396 -42754 -18978 -19988 12889 53263 45051 39725 25420 13329
16150 13329 -9908 -29160 -20320 -16699 -19632 14641 38289 -3808 -37237 -44742 -28427 -20300 -26046
16137 -26046 -13012 -33583 -56872 -82150 -72083 -65211 -58665 -22062 1424 -10713 -39706 -40351
16125 -40351 -28589 -46405 -40731 -18007 -20135 -5136 18420 19492 -28 -14856 -18433 -10871 -20602
16112 -20602 -31999 -29662 -41140 -28956 -41076 -21736 -43801 -43527 -30039 -40970 -36901 -18895
16100 -18895 -25957 -37621 -23401 -43553 -44626 -19143 -11199 -24187 -45397 -39494 -27103 -46429
16088 -46429 -32712 -16516 -21911 -10160 4050 -17855 -43119 -28079 -2293 1402 7147 -9766
16076 -9766 -55468 -69337 -47226 -37590 -20547 8597 13146 -19848 -19576 2698 31106 36060 39314
$$ packed form
16163d9334k2374q611k532K0455J9642K3776j010L2877M0374q212n326j4305j2091
16150A3329k3237j9252Q840L621k933L4273K3648m2097l3429p505J6315Q127n746
16137b6046J3034k0571k3289k5278J0067O872O546L6603K3486j2137k8993o45
16125d0351J1762j7816N674K2724k128J4999K3556J072j9520j4828l577P562r731
16112b0602j1397K337j1478J2184j2120J9340k2065K74J3488j0931M069J8006
16100a8895p062j1664J4220k0152j073K5483P944j2988k1210N903J2391j9326
16088d6429J3717J6196n395J1751J4210k1905k5264J5040K5786L695N745j6913
16076i766m5702j3869K2111R636J7043K9144M549l2994K72K2274K8408M954L254
$$ plain form
16063 39314 13836 -471 -18620 -64530 -57557 -18965 -27629 -32296 -46007 -26339 -3391 -21450
16051 -21450 -22243 -948 4069 -19292 2153 -10825 5862 16054 -5119 -23801 -55875 -34999
16039 -34999 -42473 -52998 -43130 6942 3015 -34870 -50987 -90182 -69315 -31377 -12976 -19327
16027 -19327 -28541 -39806 -37780 -28755 -13670 -1727 -14752 -24793 -7015 -9181 -10000 -41295 -56081
16014 -56081 -68403 -97112 -95195 -79141 -64711 -70608 -74310 -51042 -24919 -21774 -32878 -77291
16002 -77291 -60149 -6641 -7280 8847 27352 8476 1825 -12685 28419 45631 -5676 -40945
15990 -40945 -13042 3306 7367 -19616 -19027 -5384 6567 -13974 -50167 -43330 -62213 -27364
15978 -27364 -8582 15089 11360 35863 27478 -7455 -28771 -32018 -24702 -17291 -16816 -36833 -49463
$$ packed form
16063C9314k5478j4307j8149m5910O973L8592q664m667j3711J9668K2948j8059
16051b1450p93K1295N017k3361K1445j2978J6687J0192k1173j8682l2074K0876
16039c4999p474j0525R868N0072l927l7885j6117l9195K0867L7938J8401o351
16027a9327r214j1265K026R025J5085J1943j3025j0041J7778k166q19l1295j4786
16014e6081j2322k8709J917J6054J4430n897l702K3268K6123L145j1104m4413
16002g7291J7142N3508o39J6127J8505j8876o651j4510M1104J7212n1307l5269
15990d0945K7903J6348M061k6983N89J3643J1951k0541l6193O837j8883L4849
15978b7364J8782K3671l729K4503q385l4933k1316l247P316P411M75k0017j2630
$$ plain form
15965 -49463 -25582 2642 37960 37908 15708 8361 -3126 -38784 -25528 -4903 -39003 -22620
15953 -22620 -43732 -39126 -17369 -38107 -48879 -47270 -59650 -75941 -78037 -81873 -68304 -13796
15941 -13796 -9215 -39370 -35038 -11245 7868 558 -30386 -62488 -118075 -101742 -55257 -69868
15929 -69868 -88679 -90010 -81662 -59949 -52305 -74609 -64149 -53323 -63229 -59961 -77335 -88171 -42634
15916 -42634 -24224 -34292 -30804 -40105 -45231 -35385 -8507 6367 -16121 -6499 -34006 -22817 19326
15903 19326 21084 12935 16596 21199 3211 8838 -748 -4761 -6632 1630 9339 5878 13399 29906
15889 29906 38532 8795 6308 27930 18411 17455 -14836 -54592 -74865 -45308 -33095 -31868 -40913
15876 -40913 -30685 -6313 2779 -10142 -14349 20312 73985 83209 74863 18868 -38609 -34942 -36430
$$ packed form
15965d9463K3881K8224L5318n2k2200p347j1487l5658J3256K0625l4100J6383
15953b2620k1112M606K1757k0738j0772J609j2380j6291k096l836J3569N4508
15941a3796M581l0155M332K3793J9113p310l0944l2102n5587J6333M6485j4611
15929f9868j8811j331Q348K1713P644k2304J0460J0826r906L268j7374j0836M5537
15916d2634J8410j0068L488r301n126R846K6878J4874k2488R622k7507J1189M2143
15903A9326J758q149L661M603j7988N627r586m013j871Q262P709l461P521J6507
15889B9906Q626k9737k487K1622r519r56l2291l9756k0273K9557J2213J227r045
15876d0913J0228K4372R092j2921m207L4661N3673R224q346n5995n7477L667j488
$$ plain form
15863 -36430 -28745 -64390 -67177 -37928 -40326 -47648 -57668 -57240 -57170 -50203 -16338 -23762 -52395 -61264
15849 -61264 -43720 -56059 -67704 -47335 -32733 -24959 -18400 -22099 -15810 -42334 -48621 -38182 -31919
15836 -31919 -25226 5863 -24776 -34708 -25568 -28605 -25524 -24285 -15501 -4762 11474 -18144 -35832
15823 -35832 -28500 -41661 -46765 -41020 -9234 9483 29030 -24947 -97124 -108762 -87084 -33005
15811 -33005 16140 12844 -28887 -36739 -28046 -12190 -10757 -6942 -5683 -15290 -24667 -48605 -70515
15798 -70515 -61828 -15467 8133 -11297 -59908 -51931 -51959 -29759 -8656 3567 22514 14210 2993
15785 2993 11713 -2841 -5399 -15620 -29271 -67504 -63869 -28483 -40303 -83764 -41947 -10740
15773 -10740 -917 -15101 847 -16471 -65964 -88261 -61014 -42752 -61871 -45748 -45859 -45861 -49414
$$ packed form
15863c6430P685l5645k787K9249k398p322j0020M28P0O967L3865p424k8633q869
15849f1264J7544j2339j1645K0369J4602P774O559l699O289k6524o287J0439O263
15836c1919O693L1089l0639r932R140l037L081J239Q784J0739J6236k9618j7688
15823c5832P332j3161n104N745L1786J8717J9547n3977p2177j1638K1678N4079
15811c3005M9145l296m1731p852Q693J5856J433L815J259r607r377k3938k1910
15798g0515Q687M6361K3600j9430m8611P977k8K2200K1103J2223J8947q304j1217
15785B993Q720j4554k558j0221j3651l8233L635L5386j1820m3461M1817L1207
15773a0740R823j4184J5948j7318m9493k2297K7247J8262j9119J6123j11kl553
$$ plain form
15760 -49414 -43520 -58505 -55332 -36686 -8906 -600 -1676 40171 24999 29095 -1277 -33070 -22075
15747 -22075 -22595 -57306 -47348 -26383 -22668 -21490 12534 6074 -24242 -41311 -44299 -28720 -38259
15734 -38259 -18518 -36117 -53299 -76507 -94697 -64680 -39111 -18272 -29864 -38661 -24274 890
15722 890 21495 13025 9841 11888 26037 15658 -11516 -40986 -18145 4574 -1128 31455 24672
15709 24672 -20769 -26931 -22630 -6219 -17390 -51298 -63443 -60835 -30006 -21524 -6454 -5831 -1811
15696 -1811 2487 -24354 -34210 -25872 -20730 759 13769 -2617 -47098 -64839 -61618 -42780 -60317
15683 -60317 -44300 -55485 -52588 -21463 -12198 -24159 -20083 -4782 -35225 -67087 -50869 -26811
15671 -26811 -15351 -6304 -2473 3363 -27641 -60846 -72614 -82372 -53352 -41438 -40204 -17901 -14972
$$ packed form
15760d9414N894j4985L173J8646K7780Q306j076M1847j5172M096l0372l1793J0995
15747b2075n20l4711R958K0965L715J178L4024o460l0316j7069k988J5579r539
15734c8259J9741j7599j7182k3208j8190L0017K5569K0839j1592q797J4387K5164
15722H90K0605q470l184K047J4149j0379k7174k9470K2841K2719n702L2583o783
15709B4672m5441o162M301J6411j1171l3908j2145K608L0829Q482J5070O23M020
15696a811M298k6841r856Q338N142K1489J3010j6386m4481j7741L221J8838j7537
15683f0317J6017j1185K897L1125R265j1961M076J5301l0443l1862J6218K4058
15671b6811J1460R047L831N836l1004l3205j1768r758K9020J1914J234K2303K929
$$ plain form
15658 -14972 -11318 -11586 -19982 -28585 -25644 -56942 -69274 -59206 -41046 -22477 -17147 -5309 19261
15645 19261 31058 29008 14863 4212 -12571 -7592 -15787 -28801 -13336 -13094 -9765 -6182 -15481
15632 -15481 -20906 -21150 -9658 505 9104 15493 8894 550 -4552 -16939 -19045 4235 -4555 10686
15618 10686 5268 -16584 -39245 -11669 16242 13310 9190 -7328 -20298 -52123 -35297 -45844
15606 -45844 -58690 -52141 -38007 -30384 -26971 -28417 -42483 -42660 -33191 -15376 25820 20255 -16810
15593 -16810 -4537 16393 1503 -34696 -34874 -25780 -22014 -26017 -38235 -45031 -47586 -55423 -69710
15580 -69710 -82227 -61375 -54446 -61805 -33232 1033 -19294 -62071 -97959 -113655 -120854 -84553
15568 -84553 -70430 -71745 -59931 -22259 -13236 -22487 -17628 -14891 -52466 -57233 -34146 -4325 609
$$ packed form
15658a4972L654k68q396q603K941l1298j2332J0068J8160J8569N330J1838K4570
15645A9261J1797k050j4145j0651j6783M979q195j3014J5465K42L329L583r299
15632a5481n425k44J1492J0163Q599O389o599q344n102j2387k106K3280q790J5241
15618A0686n418k1852k2661K7576K7911k932m120j6518j2970l1825J6826j0547
15606d5844j2846O549J4134P623L413j446j4066j77R469J7815M1196n565l7065
15593a6810J2273K0930j4890l6199j78R094L766m003j2218o796k555p837j4287
15580f9710j2517K0852O929p359K8573L4265k0327m2777l5888j5696p199L6301
15568h4553J4123j315J1814L7672R023r251M859K737l7575m767K3087K9821M934
$$ plain form
15555 609 1029 -32935 -15290 5784 15399 3205 -3213 9982 9752 -14038 -5576 -22027 -28242 -50345
15541 -50345 -81313 -89912 -69323 -29581 -38034 -41202 -22335 -30578 -20569 5544 -12223 -49404
15529 -49404 -60894 -52559 -29865 -40366 -38729 -58534 -68807 -52778 -41060 -83255 -100276 -81776
15517 -81776 -72081 -69280 -57671 -64676 -64091 -44369 -17734 16214 5911 3334 -37496 -24423 -15605
15504 -15605 -70186 -103040 -74463 -46930 -19736 -57710 -58666 -39576 -48537 -74694 -84942 -88596
15492 -88596 -95576 -103482 -87703 -98005 -91908 -101428 -117420 -83332 -50054 -21359 -22437 -10559 7781
15479 7781 17117 -20952 -35862 -52978 -54037 -15947 -25916 -29217 -8568 -21450 -50958 -55089 -38203
15466 -38203 -53948 -42779 -54947 -74284 -48891 -63813 -96670 -79184 -26726 -26176 2883 -4317
$$ packed form
15555F09M20l3964J7645K1074R615j2194o418J3195k30k3790Q462j6451o215k2103
15541e0345l0968q599K0589L9742q453l168J8867q243J0009K6113j7767l7181
15529d9404j1490Q335K2694j0501J637j9805j0273J6029J1718m2195j7021J8500
15517h1776R695K801J1609p005N85J9722K6635L3948j0303k577m0830J3073Q818
15504a5605n4581l2854K8577K7533K7194l7974r56J9090q961k6157j0248l654
15492h8596o980p906J5779j0302O097r520j5992L4088L3278K8695j078J1878J8340
15479G781R336l8069j4910j7116j059L8090r969l301K0649j2882k9508m131J6886
15466c8203j5745J1169j2168j9337K5393j4922l2857J7486N2458N50K9059p200
$$ plain form
15454 -4317 -23366 -25621 -26572 -26643 3423 -20650 -45670 -43468 -56801 -48121 -49198 -68685 -90427 -120262
15440 -120262 -118961 -93430 -31554 2398 -1687 -17860 -37245 -58772 -71786 -26979 5700 17545
15428 17545 10041 -14724 -18522 -17171 -35125 -66187 -83552 -50032 -27635 7542 25825 16333
15416 16333 -56650 -102697 -116359 -91832 -106842 -102176 -84695 -72542 -66531 -69608 -68126 -67155 -47992
15403 -47992 -36072 -21484 -33999 -31803 -52104 -56784 -34012 -4150 -14977 -46608 -39872 -20132
15391 -20132 -26973 -16839 -11971 -46755 -78840 -83364 -90419 -78448 -64242 -64844 -33308 -6821 -18910
15378 -18910 -26249 -10420 21374 1406 -41315 -34869 -41753 -44014 -29269 -26223 -14227 -28187 -57026
15365 -57026 -72546 -79855 -58789 -70197 -82826 -91895 -36367 -18418 -62540 -62874 -43166 -19012
$$ packed form
15454d317j9049k255r51p1L0066k4073k5020K202j3333Q680j077j9487k1742k9835
15440a20262J301K5531O1876L3952m085j6173j9385k1527j3014M4807L2679J1845
15428A7545p504k4765l798J351j7954l1062j7365L3520K2397L5177J8283r492
15416A6333p2983m6047j3662K4527j5010M666J7481J2153O011l077J482R71J9163
15403d7992J1920J4588j2515K196k0301m680K2772K9862j0827l1631O736J9740
15391b0132o841J0134M868l4784l2085m524p055J1971J4206o02L1536K6487j2089
15378a8910p339J5829L1794j9968m2721O446o884k261J4745L046J1996j3960k8839
15365e7026j5520p309K1066j1408j2629r069N5528J7949m4122l34J9708K4154
$$ plain form
15353 -19012 -29911 -53613 -46543 -37323 -34385 -23702 -26089 -35683 -34340 -19892 3736 -8597 -38225
15340 -38225 -7910 9476 4215 -9877 -22828 -34055 -26006 6412 20280 32166 11464 -43050
15328 -43050 -70448 -36015 3709 13777 -12552 -7067 -23920 -46909 -77814 -64590 -52485 -30419
15316 -30419 -20715 -28602 -24958 -19493 -15563 14761 290 -43544 -44210 -30623 -8498 -29148 -69561
15303 -69561 -102225 -75797 -42387 -36152 -31658 -42929 -69305 -55264 -54096 -66253 -50403 -32041
15291 -32041 -46149 -46590 -47681 -59416 -84288 -93744 -104706 -84732 -65076 -73723 -66289 -31219 -13759
15278 -13759 -16875 -27428 -34026 -45169 -49601 -37600 -23349 -26187 -44113 -39360 -33058 -48184 -52347
15265 -52347 -65200 -62846 -28472 -2525 -19675 -34851 -28355 -16730 -15526 -7370 -11303 2262 17175
$$ packed form
15353a9012j0899k3702P070R220K938J0683k387r594J343J4448K3628j2333k9628
15340c8225L0315J7386n261j4092j2951j1227Q049L2418J3868J1886k0702n4514
15328d3050k7398L4433L9724J0068k6329N485j6853k2989l0905J3224J2105K2066
15316c0419R704p887L644N465L930L0324j4471m3834o66J3587K2125k0650m0413
15303f9561l2664K6428L3410O235M494j1271k6376J4041J168j2157J5850J8362
15291c2041j4108m41j091j1735k4872r456j0962J9974J9656q647P434L5070J7460
15278a3759l116j0553o598j1143m432J2001J4251k838j7926M753O302j5126m163
15265e2347j2853K354L4374K5947j7150j5176O496J1625J204Q156l933J3565J4913
$$ plain form
15252 17175 16228 6133 -21217 -19339 -25783 -21063 -22774 -31490 -38955 -48434 10782 38153 62738
15239 62738 19797 9959 13689 16431 8664 25925 31245 9755 11998 -4870 -33285 -61749 -74543
15226 -74543 -91613 -72079 -85535 -106068 -77757 -41311 -37862 -69912 -29022 6192 -12168 -17732
15214 -17732 291 3391 -18076 -33226 -5796 4815 27213 38906 15320 -16021 -14003 6524
15202 6524 438 12696 8367 -7200 -14798 -36236 -39195 -20198 15064 35091 14224 7327 -12215
15189 -12215 -22037 -11049 -34502 -54939 -65858 -57863 -58814 -37588 -14235 -2193 -8500 -43880 -29937
15176 -29937 -18445 -20327 -18517 13531 23304 9541 16397 15933 20894 40773 36055 -10588 -22824
15163 -22824 -37655 -72147 -70731 -35070 -41516 -60653 -47005 -39609 -72162 -61554 -20735 3886
$$ packed form
15252A7175r47j0095k7350J878o444M720j711q716p465r479N9216K7371K4585
15239F2738m2941r838L730K742p767J7261N320k1490K243j6868k8415k8464j2794
15226g4543j7070J9534j3456k0533K8311L6446L449l2050M0890L5214j8360n564
15214a7732J8023L100k1467j5150K7430J0611K2398J1693k3586l1341K018K0527
15202F524o086J2258m329j5567p598k1438k959J8997L5262K0027k0867o897j9542
15189a2215r822J0988k3453k0437j0919P995r51K1226K3353J2042o307l5380J3943
15176b9937J1492j882J810L2048R773j3763O856m64M961J9879m718m6643j2236
15163b2824j4831l4492J416L5661o446j9137J3648P396l2553J0608M0819K4621
$$ plain form
15151 3886 -13143 -24326 -9421 -20387 -59468 -95629 -77774 -54678 -76475 -51896 -10963 15036
15139 15036 13441 -10739 -24675 -30553 -48857 -41383 -27601 -37791 -55927 -10730 -14036 -40807
15127 -40807 -54631 -35112 -7317 -5221 -27703 -31436 -47354 -64848 -76611 -84938 -81664 -48918
15115 -48918 -39518 -34562 -19808 -31596 -76800 -84657 -71672 -58366 -59476 -75295 -66150 -43584 -45292
15102 -45292 -22897 -55684 -55117 -33743 -8815 9594 -10827 -38438 -19146 -28447 14197 40136
15090 40136 6876 -14053 -26872 -23516 118 -17998 -37663 -46859 -19361 -10116 -46227 -46676 -18550
15077 -18550 -25788 -12709 -24968 -32958 -9615 -16422 -18878 -20751 -23771 -2945 -9929 -14203 -29536
15064 -29536 -33447 -52317 -52507 -25496 -48543 -73117 -68939 -72135 -59211 -22330 2833 1642 -19392
$$ packed form
15151C886j7029j1183J4905j0966l9081l6161J7855K3096k1797K4579M0933K5999
15139A5036j595k4180j3936n878j8304P474J3782j0190j8136M5197l306k6771
15127d0807j3824J9519K7795K096k2482l733j5918j7494j1763q327L274L2746
15115d8918R400M956J4754j1788m5204p857J2985J3306j110j5819R145K2566j708
15102d5292K2395l2787N67K1374K4928J8409k0421k7611J9292r301M2644K5939
15090D0136l3260k0929j2819L356K3634j8116j9665r196K7498R245l6111m49K8126
15077a8550p238J3079j2259p990K3343o807k456j873l020K0826o984m274j5333
15064b9536l911j8870j90K7011k3047k4574M178l196J2924L6881K5163j191k1034
$$ plain form
15051 -19392 -42790 -57632 -40419 -21974 -10667 -14498 -21222 -31031 -23004 -31067 -9031 32768 11571
15038 11571 -22812 12884 27329 22142 29867 23362 20123 32150 9430 6874 1561 -1633 -10944
15025 -10944 -33828 -51527 -44754 -24313 -9776 5264 34113 40685 -2131 -21446 -6659 30313
15013 30313 -8364 -56820 -80781 -96906 -86428 -44749 -38912 -23117 -16586 -18229 -26923 -61107
15001 -61107 -80921 -55860 -69469 -58903 -65745 -68258 -39196 -26450 -20190 2932 -28265 -55049
14989 -55049 -30039 -38999 -60980 -88627 -81584 -67529 -50167 -31501 -37595 -39096 -45394 -82995 -93504
14976 -93504 -56260 -24957 -23098 -52041 -53430 -43536 -23627 -9366 -12471 -32575 -42894 -28044
14964 -28044 -18868 -31254 -46468 -35501 -62507 -52442 -36807 -52470 -49552 -44712 -30772 -25442
$$ packed form
15051a9392k3398j4842J7213J8445J1307l831o724r809Q027q063K2036M1799k1197
15038A1571l4383L5696J4445n187P725o505l239J2027k2720k556n313l194r311
15025a0944k2884j7699O773K0441J4537J5040K8849O572m2816j9315J4787L6972
15013C0313l8677m8456k3961j6125J0478M1679N837J5795O531j643q694l4184
15001f1107j9814K5061j3609J0566o842k513K9062J2746O260K3122l1197k6784
14989e5049K5010q960k1981k7647P043J4055J7362J8666o094j501o298l7601j0509
14976i3504L7244L1303J859k8943j389R894J9909J4261l105k0104j0319J4850
14964b8044R176j2386j5214J0967k7006J0065J5635j5663K918M840J3940N330
$$ plain form
14952 -25442 -24884 -25443 -31837 -17743 -15595 -28287 -37516 -50338 -32417 -8689 -23727 -44692 -44474
14939 -44474 -26882 -18172 -12044 -9902 -6091 -6482 -54179 -82223 -28871 -19359 -42456 -31977 -26654
14926 -26654 -27253 -42610 -18832 -31954 -51471 -50523 -15264 -6935 -15097 -29917 -26360 -64863 -84666
14913 -84666 -65008 -22162 -13730 -40772 -82747 -46938 994 34173 33614 23093 19261 -22033
14901 -22033 -54057 -46889 -39839 -36791 3165 -5860 -41979 -76546 -83098 -116552 -108630 -68094 -39785
14888 -39785 -31568 -41539 -44081 -33824 -52555 -57435 -9323 4000 -1804 -6892 -10364 -40618 -69002
14875 -69002 -81789 -72401 -49194 -54367 -68355 -61678 -41586 -20041 9172 14623 27153 42546
14863 42546 23989 19811 3810 -12836 -14488 -63895 -56416 -53074 -65957 -45073 -34474 -43752 -22030
$$ packed form
14952b5442N58n59o394J4094K148j2692r229j2822J7921K3728j5038k0965K18
14939d4474J7592Q710O128K142L811l91m7697k8044N3352R512k3097J0479N323
14926b6654n99j5357K3778j3122j9517R48L5259Q329q162j4820L557l8503j9803
14913h4666J9658M2846Q432k7042m1975L5809M7932L3179n59j0521l832m1294
14901b2033l2024P168P050L048L9956r025l6119l4567o552l3454P922M0536K8309
14888c9785Q217r971k542J0257j8731m880M8112J3323n804n088l472l0254k8384
14875f9002j2787R388K3207n173j3988O677K0092K1545K9213N451J2530J5393
14863D2546j8557m178j6001j6646j652m9407P479L342j2883K0884J0599r278K1722
$$ plain form
14850 -22030 -34019 -24158 4025 26253 505 -11622 289 -5462 -18526 5513 -415 -43392
14838 -43392 -88333 -78999 -29347 -28809 -60846 -74087 -61294 -35813 -54142 -35110 -9912 -26410
14826 -26410 366 19169 20099 9381 -36604 -58487 -65915 -50589 -57703 -65110 -61690 -17812 14760
14813 14760 7717 -36594 -70542 -84632 -67189 -49820 -22953 -2926 13463 -9730 -34802 -36620
14801 -36620 -38519 -22948 -26698 -14608 -1261 1342 -24663 -44805 -14108 -5794 -11935 -24764 -34483
14788 -34483 -38816 -36685 -33559 -10039 6248 4646 -19865 -5464 -33452 -22647 -30666 -24715 16415
14775 16415 29237 16381 28838 21521 19498 -7289 -15745 290 -16647 4650 -3570 -34195
14763 -34195 -3109 -10828 -38974 -47656 -51657 -69645 -73948 -58699 -47451 -48277 -49691 -59842 -47128
$$ packed form
14850b2030j1989R861K8183K2228k5748j2127J1911n751j3064K4039n928m2977
14838d3392m4941R334M9652N38l2037j3241J2793K5481j8329J9032K5198j6498
14826b6410K6776J8803R30j0718m5985k1883p428J5326p114p407L420M3878L2572
14813A4760p043m4311l3948j4090J7443J7369K6867K0027J6389k3193k5072j818
14801c6620j899J5571l750J2090J3347K603k6005k0142L0697Q314o141j2829r719
14788c4483m333K131L126K3520J6287j602k4511J4401k7988J0805q019N951M1130
14775A6415J2822j2856J2457p317k023k6787q456J6035j6937K1297q220l0625
14763c4195L1086p719k8146q682m001j7988m303J5249J1248q26j414j0151J2714
$$ plain form
14750 -47128 -62727 -82799 -81028 -39263 -12061 -9426 -11161 -22460 4679 9919 -10367 -23781
14738 -23781 -8743 -132 -23812 -17969 -10410 -47725 -62506 -61155 -39825 -63606 -67836 -59327 -25531
14725 -25531 -26780 -19928 -30827 -44962 -46113 -58521 -62133 -54149 -319 19927 -6027 -34529 -50955
14712 -50955 -57357 -65242 -47456 -12911 -14353 -39380 -52269 -58197 -65264 -88987 -72276 -49507 -56870
14699 -56870 -47859 -5727 -25952 -45116 -37873 -45146 -52380 -51122 -59334 -38659 -47204 -71443 -58936
14686 -58936 -35317 -69261 -100631 -96643 -45762 -9679 -25006 -35908 -26729 -23617 -23335 -25105 -25794
14673 -25794 -28043 -23144 -37111 -60015 -61888 -54606 -31697 8106 -7465 -37503 5451 24926
14661 24926 -32313 -57984 -49492 -47906 -48934 -52298 -55587 -51019 -53407 -50461 -44526 -58804 -41059
$$ packed form
14750d7128j5599k0072J771M1765K7202K635j735j1299K7139N240k0286j3414
14738b3781J5038Q611k3680N843P559l7315j4781J351K1330k3781m230Q509L3796
14725b5531j249O852j0899j4135j151j2408l612P984N3830K0246k5954k8502j6426
14712e0955o402p885J7786L4545j442k5027j2889n928p067k3723J6711K2769p363
14699e6870R011M2132k0225j9164P243p273p234J258q212K0675q545k4239J2507
14686e8936K3619l3944l1370L988N0881L6083j5327j0902R179L112K82j770o89
14673b5794k249M899j3967k2904j873P282K2909L9803j5571l0038M2954J9475
14661B4926n7239k5671Q492J586j028l364l289M568k388K946N935j4278J7745
$$ plain form
14648 -41059 -3043 -7525 -35682 -47734 -41417 -4797 16894 1386 7576 -5917 162 -15422
14636 -15422 -12477 13233 42175 36342 -2506 13346 37714 701 -31089 -69682 -88300 -59982
14624 -59982 -55874 -32373 -44344 -35403 -45590 -54360 -22882 19890 44950 31635 6166 220
14612 220 -5152 19221 34817 54528 40943 -5449 -19375 -26125 -38406 -29481 -7446 -22320 -47248
14599 -47248 -36628 -34367 5217 26469 39072 38029 26846 40404 22893 33595 16481 -6256
14587 -6256 -2637 1018 -25666 -58512 -32923 -52048 -81170 -57584 -20081 -6495 3640 -2618
14575 -2618 -37403 -48472 -50110 -11635 12346 6676 -61885 -75983 -11265 6429 -28212 -58290
14563 -58290 -70873 -65570 -45461 -39728 -51679 -77949 -77711 -44570 -54255 -69928 -95430 -105456 -108329
$$ packed form
14648d1059L8016m482k8157j2052O317L6620K1691j5508O190j3493O079j5584
14636a5422K945K5710K8942n833l8848J5852K4368l7013l1790l8593j8618K8318
14624e9982M108K3501j1971Q941j0187q770L1478M2772K5060j3315k5469n946
14612B20n372K4373J5596J9711j3585m6392j3926o750j2281Q925K2035j4874k4928
14599d7248J0620K261L9584K1252J2603j043j1183J3558j7511J0702j7114k2737
14587f256L619L655k6684l2846K5589j9125k9122K3586L7503J3586J0135o258
14575b618l4785j1069j638L8475K3981n670o8561j4098O4718J7694l4641l0078
14563e8290j2583N303K0109N733j1951k6270K38L3141r685j5673k5502j0026k873
$$ plain form
14550 -108329 -75145 -56912 -31795 -37166 -32929 16768 10392 -16678 -38192 -33089 -26103 -10962
14538 -10962 -13154 -51064 -78755 -83806 -48771 -17732 -28270 -59646 -38370 -47357 -27270 -20887
14526 -20887 -18027 -48014 -42770 -61432 -78933 -63901 -31143 -15331 -16782 -23183 -21566 -31234 -4426
14513 -4426 -17058 -23422 -45348 -67713 -73826 -63858 -52617 -46370 -37389 -36562 -35265 -58400 -84414
14500 -84414 -97905 -69226 -34757 -9091 -37918 -61983 -45986 -44045 -45402 -40528 -25775 -58310
14488 -58310 -49625 -41013 -39574 -37252 -23257 -31232 -45806 -25740 -16884 -51968 -30374 -31171 -50639
14475 -50639 -40387 -13285 -9418 -40656 -68344 -84748 -74033 -62760 -44897 -49567 -33837 -37271
14463 -37271 -72584 -46242 -16077 -14726 -31440 -26882 -32831 -33034 -24739 -10741 -4839 735 10608
$$ packed form
14550a08329L3184J8233K5117n371M237M9697o376k7070k1514N103O986J5141
14538a0962k192l7910k7691n051L5035L1039j0538l1376K1276q987K0087O383
14526b0887K860k9987N244j8662j7501J5032L2758J5812j451o401J617r668K6808
14513d426j2632o364k1926k2365o113R968J1241O247Q981Q27J297k3135k6014
14500h4414j3491K8679L4469K5666k8827k4065J5997J941j357M874J4753l2535
14488e8310Q685Q612J439K322J3995p975j4574K0066Q856l5084K1594p97j9468
14475e0639J0252K7102L867l1238k7688j6404J0715J1273J7863m670J5730l434
14463c7271l5313K6342L0165J351j6714M558n949k03Q295J3998N902N574R873
$$ plain form
14450 10608 -550 -17741 -22707 -30249 -33214 -4660 -2595 -11044 -24361 -17983 -25041 -17098 -31424
14437 -31424 -12398 -29974 -69829 -31852 -10095 -21944 -13321 -4407 5083 -3345 -20973 -30121 -14307
14424 -14307 -34300 -48710 -14687 -21543 -31439 -31358 10422 34496 20678 9890 -16921 -41685 -24631
14411 -24631 -11152 3488 -5071 -12675 -33700 -48028 -79623 -88011 -66097 -51281 -5596 33418
14399 33418 34811 33021 16772 -722 -7312 -46148 -35263 -14812 -6574 -13032 1607 567 19958
14386 19958 18963 -10604 -10212 -26267 -49406 -32774 -31147 -2898 2819 3726 -14546 -5210 -25382
14373 -25382 -23159 2416 1133 -24402 -10709 7985 -9344 -39472 -45640 -33623 -46085 -72037
14361 -72037 -51176 -47672 -29437 -14311 -6048 -9985 -26691 -48414 -69884 -68245 -63315 -60317 -51875
$$ packed form
14450A0608j1158j7191m966p542k965K8554K065q449j3317O378p058P943j4326
14437c1424J9026j7576l9855L7977K1757j1849Q623Q914R490q428j7628r148J5814
14424a4307j9993j4410L4023o856r896Q1M1780K4074j3818j0788k6811k4764J7054
14411b4631J3479J4640q559p604k1025j4328l1595q388K1914J4816M5685L9014
14399C3418J393j790j6249j7494o590l8836J0885K0451Q238o458J4639j040J9391
14386A9958r95k9567L92j6055k3139J6632J627K8249N717R07j8272R336k0172
14373b5382K223K5575j283k5535J3693J8694j7329l0128o168J2017j2462k5952
14361g2037K0861L504J8235J5126Q263l937j6706k1723k1470J639M930K998Q442
$$ plain form
14348 -51875 -23043 -40422 -29297 -9315 -7614 -11507 -26 5466 -10530 -24340 -7981 -1462
14336 -1462 -12357 -20648 -30100 -57749 -58173 -25495 15839 36579 6602 668 -35488 -37393 -20644
14323 -20644 -26123 -51096 -18877 4412 -7087 -1353 -48508 -53607 -57128 -44231 -23074 -8620
14311 -8620 -10585 -15230 6435 -7956 -18612 -20411 -13110 -8073 -3710 -6029 10674 2136 -13456
14298 -13456 -17667 -31010 -31938 -27729 17220 1072 -15057 -32106 -37174 -21822 -27296 -45750 -46023
14285 -46023 -9400 -21020 -26064 -35600 -20348 -28265 -40330 -19579 -5363 -14693 -57799 -90515
14273 -90515 -80677 -41839 -9657 -234 13218 17926 -680 -19484 -33182 976 -7665 6386
14261 6386 3658 -15898 -27750 -19116 -9337 -3528 -457 4807 3163 -19830 -69298 -88433 -66535
$$ packed form
14348e1875K8832j7379J1125J9982J701l893J1481N492j5996j3810J6359O519
14336a462j0895q291r452k7649m24L2678M1334K0740k9977n934l6156j905J6749
14323b0644n479k4973L2219K3289j1499N734m7155n099l521J2897K1157J4454
14311h620j965m645K1665j4391j0656j799P301N037M363k319J6703q538j5592
14298a3456m211j3343r28M209M4949j6148j6129j7049n068J5352n474j8454k73
14285d6023L6623j1620n044r536J5252p917j2065K0751J4216r330m3106l2716
14273i0515R838L8838L2182R423J3452M708j8606j8804j3698L4158q641J4051
14261F386k728j9556j1852Q634R779N809L071N264j644k2993m9468j9135K1898
$$ plain form
14248 -66535 -48620 -10313 2305 11019 8094 6846 6201 -6895 -6784 -5225 -31638 -37024 -10093
14235 -10093 -6081 -15548 -23044 3668 9017 11878 -21655 -44964 -41860 -35311 -43149 -58145 -82575
14222 -82575 -53856 -1700 16455 1715 -14350 -27408 -45360 -27120 4223 9662 13048 -16017
14210 -16017 -33323 -40658 -35093 8990 19145 26541 24811 -4276 -10830 -41020 -38647 -22046 24245
14197 24245 31770 -9870 -40461 -32310 -8175 25504 26460 -6030 -17928 -20410 -30846 -55008 -56368
14184 -56368 -58462 -96967 -86623 -80408 -66457 -25912 -35589 -37565 -59298 -52495 -52127 -5092 35274
14171 35274 51600 33878 42615 14972 -31120 -48422 -58181 -48122 -45902 -49897 -37006 -48469
14159 -48469 -65384 -49896 -22798 2116 24754 27514 6948 -10278 -18315 -19029 13073 12256 -12203
$$ packed form
14248f6535J7915L8307J2618Q714k925j248o45j3096J11J559k6413n386K6931
14235a0093M012r467p496K6712N349K861l3533k3309L104O549p838j4996k4430
14222h2575K8719N2156J8155j4740j6065j3058j7952J8240L1343N439L386k9065
14210a6017j7306p335N565M4083J0155P396j730k9087o554l0190K373J6601M6291
14197B4245P525m1640l0591Q151K4135L3679R56l2490j1898k482j0436k4162j360
14184e6368k094l8505J0344O215J3951M0545r677j976k1733O803L68M7035M0366
14171C5274J6326j7722Q737k7643m6092j7302r759J0059K220l995J2891j1463
14159d8469j6915J5488K7098K4914K2638K760k0566j7226q037p14L2102q17k4459
$$ plain form
14146 -12203 4297 6530 -16714 -36523 -31371 2386 32019 43577 38674 24452 8778 7074
14134 7074 -17879 -21156 -8777 2639 -21852 -28728 -16661 -16756 -6873 14865 37488 31959 29917
14121 29917 15093 -20863 -49714 -23040 19760 20426 15766 -18681 -21418 -38378 -37964 -53095 -81671
14108 -81671 -55213 -49317 -57349 -62519 -52033 -13521 29905 3133 -15214 -2733 -14517 -29066
14096 -29066 -27086 -77995 -63575 -31484 -20621 -23913 -11434 1250 10563 -3550 -6245 2305 -10255
14083 -10255 -52787 -81065 -79476 -68965 -71423 -43135 -10270 -38585 -61411 -68443 -83391 -66079
14071 -66079 -57182 -48541 -36307 -37297 -33378 -5272 -7300 -12547 295 -25971 -18949 -9360 -29297
14058 -29297 -57948 -57435 -58403 -70267 -30481 4002 22134 19984 42740 34632 50310 60456 24110
$$ packed form
14146a2203J6500K233k3244j9809N152L3757K9633J1558m903j4222j5674j704
14134G074k4953l277J2379J1416k4491o876J2067r5R883K1738K2623n529k042
14121B9917j4824l5956k8851K6674M2800O66m660l4447k737j6960M14j5131k8576
14108h1671K6458N896q032n170J0486L8512M3426k6772j8347J2481j1784j4549
14096b9066J980n0909J4420L2091J0863l292J2479J2684R313j4113k695Q550j2560
14083a0255m2532k8278J589J0511k458K8288L2865k8315k2826p032j4948J7312
14071f6079Q897Q641J2234r90L919K8106k028n247J2842k6266P022R589j9937
14058b9297k8651N13r68j1864L9786L4483J8132k150K2756q108J5678J0146l6346
$$ plain form
14045 24110 32503 29790 6159 -25269 -38784 -24920 -14500 -21479 -53064 -79543 -62926 -26164
14033 -26164 -12806 -3414 -6649 -30395 -52737 -55304 -37178 -8046 8210 19863 4520 5774
14021 5774 20690 6458 -21377 -29723 -41607 -43509 -29763 3232 -36763 -33008 -43567 -89580
14009 -89580 -114016 -88887 -64907 -46920 -58030 -48883 -82193 -96949 -65705 -23917 -54803 -59352
13997 -59352 -41799 -32792 -40535 -42850 -10114 18283 -5730 -9297 -22099 -31799 -30516 -52668 -29481
13984 -29481 -4842 -7948 14493 30388 18257 -11930 -14585 8808 -16435 -50310 -46118 -48913
13972 -48913 -12043 4200 -47269 -35677 12765 41035 29177 -4726 -27506 -25329 -6794 14780
13960 14780 25629 -6291 -1129 -13813 -18830 -44873 -59169 -37854 8642 -23898 -36490 -21102
$$ packed form
14045B4110Q393k713k3631l1428j3515J3864J0420o979l1585k6479J6617L6762
14033b6164J3358R392l235k3746k2342k567J8126K9132J6256J1653j5343J254
14021E774J4916j4232k7835q346j1884j902J3746L2995l9995L755j0559m6013
14009h9580k4436K5129K3980J7987j1110R147l3310j4756L1244M1788l0886m549
13997e9352J7553R007p743k315L2736K8397k4013l567j2802r700J283k2152K3187
13984b9481K4639l106K2441J5895j2131l0187k655K3393k5243l3875M192k795
13972d8913L6870J6243n1469J1592M8442K8270j1858l3903k2780K177J8535K1574
13960A4780J0849l1920N162j2684n017k6043j4296K1315M6496l2540j2592J5388
$$ plain form
13948 -21102 -20188 -30900 -11856 48435 41780 11030 -23492 -996 33605 41839 20611 11041 19784
13935 19784 -13390 -27644 -26459 -20111 -14437 -19284 -36389 -36069 -48181 -34469 -30085 -28397 -13166
13922 -13166 643 -2870 6572 -22880 -26857 -4435 9903 7988 -13686 -27724 -30413 -26542 -23165
13909 -23165 -32568 -21579 21959 11166 -20206 -45623 -45255 -41290 -36283 -51599 -46867 -10836 16511
13896 16511 20760 -12906 -12595 -6453 -4731 -11115 -6831 -56953 -66307 -15651 26688 30674 23996 21384
13882 21384 20741 29405 38665 -10718 -49270 -30308 8069 -4504 -16614 -46097 -63304 -48523
13870 -48523 -24309 12480 9643 -3525 -13761 -19838 -11581 -4948 -3406 -29852 -41854 -15705 -2804
13857 -2804 -9093 -28620 -5756 -1360 -8813 -20630 -18546 3423 17141 20860 871 5251 9078
$$ packed form
13948b1102R14j0712J9044O0291o655l0750l4522K2496L4601Q234k1228r570Q743
13935A9784l3174j4254J185O348N674m847j7105L20j2112J3712M384J688J5231
13922a3166J3809l513R442k9452l977K2422J4338j915k1674j4038k689L871L377
13909b3165r403J0989M3538j0793l1372k5417L68L965N007j5316M732L6031K7347
13896A6511M249l3666L11O142J722o384M284n0122r354N0656M2339L986o678k612
13882B1384o43Q664R260m9383l8552J8962L8377j2573j2110k9483j7207J4781
13870d8523K4214L6789k837j3168j0236o077Q257O633J542k6446j2002K6149J2901
13857b804o289j9527K2864M396p453j1817K084K1969J3718L719j9989M380L827
$$ plain form
13844 9078 13606 14489 -19274 -17591 -14285 13252 41330 13444 7551 25797 17443 28809 13810
13831 13810 30168 1289 -23875 21828 57666 20464 -25861 -35480 -7919 -11149 -13059 -25026
13819 -25026 -36979 -61641 -41653 -25530 -24288 -2377 -6183 1653 18324 17293 1231 1296 -15074
13806 -15074 -23621 -62993 -88571 -37546 -30619 -55477 -74505 -31968 -3961 -5424 21365 14759
13794 14759 -18364 13446 19970 8753 342 -18049 -14613 1715 12169 17080 46820 26079
13782 26079 -9124 -9565 25795 32945 42169 49296 42488 44744 42548 32155 46453 18119 -1992
13769 -1992 -16795 -26587 -22822 -40973 -48051 2322 30359 31569 7042 -20930 -11437 37029 59672
13756 59672 32495 11042 9505 -27954 -42753 -12275 -21092 -24744 -41730 -42878 -42490 -37128 -18935
$$ packed form
13844I078M528Q83l3763J683L306K7537K8078k7886n893J8246q354J1366j4999
13831A3810J6358k8879k5164M5703L5838l7202m6325r619K7561l230j910j1967
13819b5026j1953k4662J9988J6123J242K1911l806P836J6671j031j6062O5j6370
13806a5074q547l9372k5578N1025O927k4858j9028M2537K8007j463K6789o606
13794A4759l3123L1810O524j1217q411j8391L436J6328J0454M911K9740k0741
13782B6079l5203m41L5360P150R224P127o808K256k196j0393J4298k8334k0111
13769a992j4803r792L765j8151p078N0373K8037J210k4527k7972R493M8466K2643
13756E9672k7177k1453j537l7459j4799L0478q817l652j6986j148L88N362J8193
$$ plain form
13743 -18935 -17037 8368 11566 -11523 -35402 -33520 -48350 -41930 -22727 -33726 -34007 -18985 -21224
13730 -21224 -2207 -46200 -76073 -70624 -69995 -53151 -66001 -45720 -9813 7815 -5511 -10158
13718 -10158 13343 -1377 -9534 8661 6957 -32319 -22556 3623 -8084 -3521 18934 20100 -16361
13705 -16361 -23922 -2993 -26911 -23683 -3385 12772 508 8789 33269 1700 -19918 -34684
13693 -34684 -21925 -13725 -30598 -18916 -16338 -11624 -32275 -45938 -39626 -48984 -48310 -35429 -5806
13680 -5806 -31789 -47141 -17893 -5455 1639 21776 16313 -11202 -19271 -35899 -21059 16739
13668 16739 21351 1945 2255 -12320 -23694 -1162 24744 36010 53187 5762 -18254 -22670
13656 -22670 -20059 -18536 -2549 13778 30833 22738 14797 17041 44951 15261 -16267 -6717 29820
$$ packed form
13743a8935J898K5405L198k3089k3879J882j4830O420J9203j0999k81J5022k239
13730b1224J9017m3993k9873N449O29J6844j2850K0281L5907J7628j3326m647
13718a0158K3501j4720q157J8195j704l9276R763K6179j1707M563K2455J166l6461
13705a6361p561K0929k3918L228K0298J6157j2264Q281K4480l1569k1618j4766
13693c4684J2759Q200j6873J1682K578M714k0651j3663O312r358O74J2881K9623
13680e806k5983j5352K9248J2438P094K0137n463k7515q069j6628J4840L7798
13668A6739M612j9406L10j4575j1374K2532K5906J1266J7177m7425k4016m416
13656b2670K611J523J5987J6327J7055q095p941K244K7910k9690l1528R550L6537
$$ plain form
13643 29820 62117 86093 46429 13822 -4952 -2890 -716 -33134 -38421 4156 171 -16084
13631 -16084 -23410 -14454 -3225 31328 38570 -4846 -49342 -62376 -59481 -66792 -40552 -6812 113
13618 113 -18461 -31399 -17189 -18887 -3576 11795 10520 17516 34280 25810 14866 -18148 -32681
13605 -32681 -15076 -19624 -20298 -18734 5395 -5283 -5119 4904 37792 31176 27320 24696 44428
13592 44428 2614 285 22802 36464 8086 -1842 13299 38983 16185 3079 12508 18905
13580 18905 -2365 -42038 -59305 -55371 -26998 -2703 -26389 -24824 -22359 -58634 -43444 -31524
13568 -31524 -53420 -20049 -21514 -21529 -25674 -42117 -44269 21289 72665 55559 19193 -40067 -58186
13555 -58186 -25527 9440 38203 49802 40682 16557 26453 4334 3157 -2287 4134 3260 29279
$$ packed form
13643B9820L2297K3976l9664l2607j8774K062K174l2418n287M2577l985j6255
13631a6084p326Q956J1229L4553P242m3416m4496j3034K895p311K6240L3740O925
13618A13j8574j2938J4210j698J5311J5371j275O996J6764q470j0944l3014j4533
13605c2681J7605m548o74J564K4129j0678J64J0023L2888o616l856k624J9732
13592D4428m1814k329K2517J3662k8378r928J5141K5684k2798j3106R429O397
13580A8905k1270l9673j7267L934K8373K4295k3686J565K465l6275J5190J1920
13568c1524k1896L3371j465j5m145j6443k152O5558N1376j7106l6366n9260j8119
13555e8186L2659L4967K8763J1599r120k4125R896k2119j177n444O421q74K6019
$$ plain form
13542 29279 24699 13993 7649 -27285 -27435 -13197 -3942 5459 739 -11338 -27418 -25867 -27221
13529 -27221 -36069 -25319 -550 10534 16762 8821 4668 12946 2291 -12349 -6512 2090 67
13516 67 11755 15053 28159 16128 6055 -7783 -41934 -23190 -6911 -19240 -16708 2250 17516
13503 17516 -2072 -14106 -3786 6959 12562 -2234 2113 15626 3569 7811 2617 12377 6189
13490 6189 2508 18699 12115 -7686 -14796 16568 22354 -28466 -19793 9852 10180 -14902 7430
13477 7430 3236 -51428 -56421 -34486 -21975 -18354 -16275 -29899 -46915 -30639 23393 28421 -762
13464 -762 -37016 -39226 -20855 -42239 -25836 -2055 -14588 -36504 -40013 -30699 -24153 -15360 -53388
13451 -53388 -42654 -2567 16359 9654 -20068 -41404 -37785 -33792 -37158 -41394 9420 13452 -1302
$$ packed form
13542B9279m580j0706o344l4934j50J4238R255R401m720j2077j6080J551j354
13529b7221q848J0750K4769J1084O228p941m153Q278j0655j4640N837Q602k023
13516F7J1688L298J3106j2031j0073j3838l4151J8744J6279j2329K532J8958J5266
13503A7516j9588j2034J0320J0745N603j4796M347J3513j2057M242n194R760o188
13490F189l681J6191o584j9801p110L1364N786n0820Q673K9645L28k5082K2332
13477G430m194n4664m993K1935J2511L621K079j3624j7016J6276N4032N028k9183
13464g62l6254k210J8371k1384J6403K3781j2533k1916l509R314O546Q793l8028
13451e3388J0734M0087J8926o705k9722k1336L619L993l366m236N0814M032j4754
$$ plain form
13438 -1302 -5551 -7637 -4229 -19931 -8930 2511 6003 32197 30806 23388 24204 12763 25665
13425 25665 42364 48493 35241 15662 8524 4061 -4027 12260 19333 -4124 2119 -8342 -22788
13412 -22788 9407 34169 27834 21214 -5157 8887 17368 6684 24641 43819 58540 62008
13400 62008 42279 47026 36281 30038 29865 25762 44686 49552 66825 53249 41414 20215 4701
13387 4701 10148 686 -6426 -23778 -13898 26474 37683 33755 -8781 -16796 15813 39970 62173
13374 62173 44827 40137 46556 59593 76025 54088 1729 -9105 -14254 17156 39580 50563
13362 50563 27247 13691 34912 44443 34938 19420 23154 23472 -16040 -37203 -13240 10610 6166
13349 6166 -19026 -27394 1590 2593 10924 18184 1444 31317 37318 17938 -50642 -49137 -57215
$$ packed form
13438a302m249k086L408j5702J1001J1441L492K6194j391p418Q16j1441J2902
13425B5665J6699O129j3252j9579p138m463q088J6287P073k3457O243j0461j4446
13412b2788L2195K4762o335o620k6371J4044Q481j0684J7957J9178J4721L468
13400F2008j9729M747j0745o243j73m103J8924M866J7273j3576j1835k1199j5514
13387D701N447r462p112j7352R880M0372J1209l928m2536q015L2609K4157K2203
13374F2173j7346m690O419J3037J6432k1937n2359j0834n149L1410K2424J0983
13362E0563k3316j3556K1221R531r505j5518L734L18l9512k1163K3963K3850m444
13349F166k5192q368K8984J003Q331P260j6740K9873O001j9380o8580J505q078
$$ plain form
13336 -57215 -78464 -78155 -86216 -38635 15474 16617 37181 27159 20539 28119 4382 -12364 33007
13323 33007 21343 -6720 -163 -4984 -1680 -11536 -12989 -30924 -11620 12527 20198 11649 13972
13310 13972 41066 12961 -34575 -20493 -16157 -25664 -19419 -9302 -11077 38656 38326 44382 51387
13297 51387 42194 24103 16232 5835 11352 6447 -21868 -19423 -15326 10005 12831 -47906 -52228
13284 -52228 -24824 -11648 12825 20097 655 -2018 -2242 4183 25874 21734 7489 30030 50688
13271 50688 46272 18042 39267 37951 53846 67308 96863 65433 56403 41893 31595 970
13259 970 -9061 -8422 -6484 6489 46265 45671 47449 63496 77753 100626 56708 61138 88469
13246 88469 109532 84706 79632 74444 76115 72150 38574 55670 33765 38459 42905 46295 30527
$$ packed form
13336e7215k1249L09q061M7581N4109J143K0564j0022o620P580k3737j6746M5371
13323C3007j1664k8063O557m821L304r856j453j7935J9304K4147P671q549K323
13310A3972K7094k8105m7536J4082M336r507O245J0117j775M9733l30O056P005
13297E1387r193j8091p871j0397N517m905k8315K445M097K5331K826o0737m322
13284e2228K7404J3176K4473P272j9442k673k24O425K1691m140j4245K2541K0658
13271E0688m416k8230K1225j316J5895J3462K9555l1430r030j4510j0298l0625
13259I70j0031O39J938J2973L9776n94J778J6047J4257K2873m3918M430K7331
13246H8469K1063k4826n074n188J671l965l3576J7096k1905M694M446L390j5768
$$ plain form
13233 30527 55337 97440 79712 50124 43605 40826 848 -5178 10626 37001 49112 51632
13221 51632 65246 61324 48455 17563 33823 33746 23617 11240 33888 64604 65487 60851 61105
13208 61105 37673 8280 41 2948 8319 41644 39846 12014 18065 47845 17016 13499 29095
13195 29095 8686 42715 46995 -25349 -38632 -30652 -13723 -7302 -316 33046 46553 11860
13183 11860 1249 21122 9914 -30269 -39245 -23927 7157 18569 -17232 -30469 -21379 -56
13171 -56 -7982 26447 74142 93193 59541 42410 29979 32648 38500 53767 48299 56732 20131
13158 20131 9601 51770 74581 97371 60112 16584 11249 41518 25185 -1565 -22064 -24021
13146 -24021 28812 10255 -3835 103 11596 30305 36054 21875 6839 38603 63353 76777
$$ packed form
13233C0527K4810M2103j7728k9588o519k779l9978o026J5804K6375J2111K520
13221E1632J3614l922j2869l0892J6260p7j0129j2377K2648L0716Q83m636K54
13208F1105k3432k9393q239K907N371L3325j798k7832O051K9780l0829l517J5596
13195B9095k0409L4029M280p2344j3283P980J6929O421O986L3362J3507l4693
13183A1860j0611J9873j1208m0183q976J5318L1084J1412l5801j3237R090K1323
13171e6p926L4429M7695J9051l3652j7131j2431K669N852J5267n468Q433l6601
13158B0131j0530M2169K2811K2790l7259m3528n335L0269j6333k6750k0499j957
13146b4021N2833j8557j4090L938J1493J8709N749j4179j5036L1764K4750J3424
$$ plain form
13134 76777 67344 23971 -7915 -6206 -10430 22664 65915 71602 56621 36114 14772 -606
13122 -606 42832 68431 59482 26584 7696 15697 13526 37138 28998 32616 55495 69410 71439
13109 71439 70538 70327 61989 41226 59599 44041 41948 36778 17650 15577 29597 14000 -4043
13096 -4043 5065 24793 82198 102991 85458 99378 68294 31847 19931 3080 -11752 45095
13084 45095 62767 34535 49313 48427 47948 52811 61056 54301 51835 45770 39500 43198 40720 47946
13070 47946 42553 43395 67754 32547 19374 23767 26437 27003 27797 -4231 9313 30416 50562
13057 50562 87806 73013 71158 81288 49955 29011 45959 47396 34952 31841 38444 62225
13045 62225 84932 87743 90579 71028 65064 37034 56584 59971 88220 84374 68468 41523 56601
$$ packed form
13134G6777r433m3373l1886J709m224L3094M3251N687j4981k0507k1342j5378
13122f06M3438K5599q949l2898j8888Q001k171K3612q140L618K2879J3915K029
13109G1439r01k11q338k0763J8373j5558k093n170j9128k073J4020j5597j8043
13096d043R108J9728N7405K0793j7533J3920l1084l6447j1916j6851j4832N6847
13084D5095J7672k8232J4778q86m79M863Q245o755k466o065o270L698k478P226
13070D7946n393Q42K4359l5207j3173M393K670N66P94l2028J3544K1103K0146
13057E0562L7244j4793j855J0130l1333k0944J6948J437j2444l111O603K3781
13045F2225K2707K811K836j9551n964k8030J9550L387K8249l846j5906k6945J5078
$$ plain form
13032 56601 62032 72935 65154 46408 19739 35390 57364 30129 11925 44608 71543 94418
13020 94418 92096 56750 43973 32325 34953 34054 47353 52079 69117 75137 41122 37116 39649
13007 39649 54462 65500 53968 43750 40280 63855 75000 92053 61340 40896 21127 30171
12995 30171 40357 43281 67923 68460 41658 36454 36120 34835 43628 50948 64277 60191 59564 109747
12981 109747 139941 139068 126873 116308 98553 90105 45911 51455 49795 63702 82970 63428
12969 63428 48987 82192 73931 60935 44618 39947 64071 79614 75129 78496 112724 120740 129464
12956 129464 135132 121676 130747 132005 98545 74180 60396 87833 93158 97423 107954 94467
12944 94467 82692 71541 77606 81621 69176 57199 55761 42562 58650 59391 66381 75396 84979
$$ packed form
13032E6601N431J0903p781j8746k6669J5651K1974k7235j8204L2683K6935K2875
13020I4418k322l5346j2777j1648K628q99J3299M726J7038O020l4015m006K533
13007C9649J4813J1038j1532j0218l470K3575J1145J7053l0713k0444j9769R044
12995C0171J0186K924K4642N37k6802n204l34j285Q793P320J3329m086o27N0183
12981A09747L0194q73j2195j0565j7755q448m4194N544j660J3907J9268j9542
12969F3428j4441L3205q261j2996j6317m671K4124J5543m485L367L4228Q016Q724
12956A29464N668j3456R071J258l3460k4365j3784K7437N325M265J0531j3487
12944I4467j1775j1151O065M015j2445j1977j438j3199J6088P41O990R015R583
$$ plain form
12931 84979 81203 50083 23116 38138 58887 83485 62683 67294 88385 95144 71898 66606
12919 66606 96489 111074 107259 96613 86799 94221 124705 127652 100393 99266 73995 71811 62171
12906 62171 62888 71117 65365 61711 66365 65689 72552 32244 43957 44433 69132 70162 63786 83533
12892 83533 95110 90094 104384 87346 46297 35562 56198 53766 40037 55622 76227 54460
12880 54460 60259 58585 47554 49915 58029 51747 47817 82939 96044 84753 56967 44717 57777
12867 57777 54294 37053 38891 29680 28135 67027 106720 121319 117352 109259 71684 91749 95925
12854 95925 99068 75722 87137 82403 107875 115033 111610 110251 93637 89249 83730 79752 88675
12841 88675 86164 75471 94156 115161 116236 104805 116743 116904 91796 113448 153353 129856
$$ packed form
12931H4979l776l1120k6967J5022K0749K4598k0802M611K1091O759k3246n292
12919F6606K9883J4585l815j0646r814P422L0484K947k7259j127k5271k184r640
12906F2171P17Q229n752l654M654o76O863m0308J1713M76K4699J030o376J9747
12892H3533J1577n016J4290j7038m1049j0735K0636k432j3729J5585K0605k1767
12880E4460N799j674j1031K361Q114o282l930L5122J3105j1291k7786j2250J3060
12867E7777l483j7241J838r211j545L8892L9693J4599l967q093l7575K0065M176
12854I5925L143k3346J1415m734K5472P158l423j359j6614m388n519l978Q923
12841H8675k511j0693J8685K1005J075j1431J1938J61k5108K1652L9905k3497
$$ plain form
12829 129856 109308 89953 84494 67330 78045 88073 90059 114516 141965 118938 60273 54056
12817 54056 63526 59613 77933 113921 119598 127303 67733 36401 71592 126694 154753 144314
12805 144314 120447 94326 85460 44780 32489 41815 54079 51348 77743 81529 97800 136585
12793 136585 145860 151976 146901 129291 107445 124430 125412 93781 97056 134300 119275 74504 67853
12780 67853 71421 64550 88738 82200 103441 127537 108646 99505 124213 117921 148831 131329 127336
12767 127336 126588 119728 103791 84206 80603 108272 113860 126541 129076 113990 118342 121284 125249
12754 125249 121683 101148 100608 116636 128449 149725 124867 137492 132695 137781 138695 158357 198284
12741 198284 175316 137776 116880 118462 163561 163542 129070 118073 139705 149157 180924 170874
$$ packed form
12829A29856k0548j9355n459j7164J0715J0028J986K4457K7449k3027n8665o217
12817E4056R470l913J8320L5988N677P705n9570l1332L5191N5102K8059j0439
12805A44314k3867k6121q866m0680j2291R326J2264k731K6395L786J6271L8785
12793A36585R275O116n075j7610k1846J6985R82l1631L275L7244j5025m4771o651
12780F7853L568o871K4188o538K1241K4096j8891r141K4708o292L0910j7502l993
12767A27336p48o860j5937j9585l603K7669N588J2681K535j5086M352K942L965
12754A25249l566k0535n40J6028J1813K1276k4858J2625m797N086R14J9662L9927
12741A98284k2968l7540k0896J582M5099j9l4472j0997K1632R452L1767j0050
$$ plain form
12729 170874 109252 88628 122423 141278 147973 140131 156950 160049 138337 146891 154084 134150
12717 134150 137441 137384 132422 115351 100810 90070 91587 97885 110573 135121 145795 112947 107605
12704 107605 135644 145862 160112 160323 170190 153198 150375 159933 178479 188048 192792 145544 117871
12691 117871 143376 121395 116228 145040 112831 118285 130090 156084 139489 128505 149960 123107
12679 123107 108018 91026 113031 117905 105923 129638 160579 172570 166247 187115 192184 174542
12667 174542 174068 164997 179753 178698 168137 124312 113911 137075 154830 161000 163287 166110 198986
12654 198986 234228 233803 190558 154371 151314 161192 185113 172360 169085 163532 139422 156378 159612
12641 159612 171194 165688 166846 158589 161191 163820 160101 174516 202747 213608 210583 219829 224974
$$ packed form
12729A70874o1622k0624L3795J8855O695p842J6819L099k1712Q554P193j9934
12717A34150L291n7m962j7071j4541j0740J517O298J2688K4548J0674l2848n342
12704A07605K8039J0218J4250K11R867j6992k823R558J8546R569M744m7248k7673
12691A17871K5505k1981n167K8812l2209N454J1805K5994j6595j0984K1455k6853
12679A23107j5089j6992K2005M874j1982K3715L0941J1991o323K0868N069j7642
12667A74542m74r071J4756j055j0561m3825j0401K3164J7755O170K287K823L2876
12654A98986L5242m25m3245l6187l057R878K3921j2753l275n553k4110J6956L234
12641A59612J1582n506J158q257K602K629l719J4415K8231J0861l025R246N145
$$ plain form
12628 224974 218395 185764 176991 191543 188432 214494 256816 245549 228815 216695 220251 218610
12616 218610 211063 200118 210021 224049 211403 228995 243456 229312 266019 279685 261727 249306
12604 249306 243293 241146 238286 245801 211446 232684 253243 268453 284820 294203 300471 303817 281268
12591 281268 244082 230877 252759 247560 245841 244216 211217 219885 225580 237081 239216 246800 273181
12578 273181 260356 253009 243170 250263 255799 227720 241430 283085 260178 234546 223369 212321
12566 212321 189738 188270 207610 259935 289569 292820 304281 295471 333249 352268 340397 358878
12554 358878 347588 344699 333178 308377 258410 237710 240215 265441 304981 311669 309640 311433
12542 311433 294741 259874 233749 256410 253920 261660 252843 243332 262690 266280 254838 266788
$$ packed form
12628B24974o579l2631q773J4552l111K6062M2322j1267j6734j2120L556j641
12616B18610p547j0945R903J4028j2646J7592J4461j4144L6707J3666j7958j2421
12604B49306o013k147k860P515l4355K1238K0559J5210J6367R383O268L346k2549
12591B81268l7186j3205K1882n199j719j625l2999Q668N695J1501K135P584K6381
12578B73181j2825p347r839P093N536k8079J3710M1655k2907k5632j1177j1048
12566B12321k2583j468J9340N2325K9634L251J1461q810L7778J9019j1871J8481
12554C58878j1290k889j1521k4801m9967k0700K505K5226L9540O688k029J793
12542C11433j6692l4867k6125K2661k490P740q817r511J9358L590j1442J1950
$$ plain form
12530 266788 286280 289935 270504 303287 295380 295669 310916 278481 274944 309902 325528 332924 333936
12517 333936 308424 308715 312020 326755 298386 267477 268760 247143 238288 245729 280578 296429 291985
12504 291985 287418 273395 291899 328129 356562 337912 314633 320997 339137 308629 296433 310393
12492 310393 283437 308649 301723 319708 337938 347770 363865 364741 358925 359882 365486 374580 368578
12479 368578 372780 377628 387020 374644 349729 366179 364001 352694 345974 336587 332263 311505 352890
12466 352890 347338 350071 369954 349780 372397 395308 377658 357992 389404 404815 397875 371505
12454 371505 344927 357479 389273 380411 385679 392605 390029 408384 408393 404434 400574 422906 400086
12441 400086 372997 337891 341144 374616 358863 363680 382516 383924 407952 441631 418013 414670
$$ packed form
12530B66788J9492L655j9431L2783p907K89J5247l2435l537L4958J5626P396J012
12517C33936k5512K91L305J4735k8369l0909J283k1617q855P441L4849J5851m444
12504B91985m567j4023J8504L6230K8433j8650k3279O364J8140l0508j2196J3960
12492C10393k6956K5212o926J7985J8230R832J6095Q76n816R57N604R094o002
12479C68578M202M848R392j2376k4915J6450k178j1307o720r387m324k0758M1385
12466C52890n552K733J9883k0174K2617K2911j7650j9666L1412J5411o940k6370
12454C71505k6578J2552L1794q862N268O926k576J8355Rl959l860K2332k2820
12441D00086k7089l5106L253L3472j5753M817J8836J408K4028L3679k3618l343
$$ plain form
12429 414670 411055 403935 388463 420891 450815 449917 442936 440303 449165 459206 463428 483340 502431
12416 502431 495490 453238 441976 453081 436851 446738 462090 454034 466336 448082 448542 452023 474407
12403 474407 485455 479155 491143 483881 467654 469519 481731 465143 457783 481851 500208 500721 528476
12390 528476 519268 530687 558221 567230 575181 545734 523558 518934 535373 493616 485151 472331
12378 472331 506192 534441 570229 589678 565917 570742 597758 585529 570154 568437 584925 579332
12366 579332 613652 622461 578998 580087 615493 621287 605019 604907 599200 591570 596798 600409 618657
12353 618657 641707 632664 634390 623216 605600 648585 682405 676002 670957 689412 711166 715750
12341 715750 688119 667935 642122 627245 641393 671436 677038 687909 671538 694989 707153 692734
$$ packed form
12429D14670l615p120j5472L2428K9924q98o981k633Q862J0041M222J9912J9091
12416E02431o941m2252j1262J1105j6230R887J5352q056J2302j8254M60L481K2384
12403D74407J1048o300J1988p262j6227J865J2212j6588p360K4068J8357N13K7755
12390E28476r208J1419K7534R009P951k9447k2176m624J6439m1757q465j2820
12378D72331L3861K8249L5788J9449k3761M825K7016j2229j5375j717J6488n593
12366E79332L4320Q809m3463J089L5406N794j6268j12n707p630N228L611J8248
12353F18657K3050r043J726j1174j7616M2985L3820o403n045J8455K1754M584
12341G15750k7631k0184k5813j4877J4148L0043N602J0871j6371K3451J2164j4419
$$ plain form
12329 692734 697736 702516 722416 726694 731061 721509 759898 771963 772615 761581 785156 790772 803744
12316 803744 805715 789351 799981 830367 836810 821333 795918 792384 784456 798362 830872 841845
12304 841845 840306 820183 832677 831965 817175 821228 801444 802367 838854 863911 873208 899463 905632
12291 905632 905035 879759 877093 916158 928439 949904 958247 926127 911988 913190 941504 958749
12279 958749 938991 948655 983104 977452 983724 985362 1020958 1027336 1023791 1005700 1024372 1021880 1019503
12266 1019503 1028738 1044974 1086744 1094281 1090391 1093309 1087600 1078676 1081927 1090959 1092722 1105578 1089109
12253 1089109 1117276 1157537 1155030 1161100 1172944 1218217 1235246 1235876 1235745 1197336 1187133 1191745 1218225
12240 1218225 1259786 1265184 1242808 1242641 1240810 1278493 1318944 1335433 1322728 1301400 1315928 1342334
$$ packed form
12329F92734N002M780J9900M278M367r552L8389J2065O52j1034K3575N616J2972
12316H03744J971j6364J0630L0386O443j5477k5415l534p928J3906L2510J0973
12304H41845j539k0123J2494p12j4790M053j9784R23L6487K5057R297K6255O169
12291I05632n97k5276k666L9065J2281K1465Q343l2120j4139J202K8314J7245
12279I58749j9758R664L4449n652O272J638L5596O378l545j8091J8672k492k377
12266A019503R235J6236M1770P537l890K918n709q924L251R032J763J2856j6469
12253A089109K8167M0261k507O070J1844M5273J7029O30j31l8409j0203M612K6480
12240A218225M1561N398k2376j67j831L7683M0451J6489j2705k1328J4528K6406
$$ plain form
12228 1342334 1351194 1368875 1370265 1364571 1364628 1362204 1376712 1412426 1416032 1424617 1407265 1415272 1443045
12215 1443045 1466380 1498640 1507822 1480587 1474011 1463317 1482513 1517183 1526703 1543538 1557596 1576108
12203 1576108 1603840 1587198 1599835 1657737 1650566 1653565 1672974 1675115 1695240 1697132 1701832 1728978
12191 1728978 1741452 1740405 1741185 1766099 1778563 1792388 1807198 1826035 1872138 1931150 1956834 1941563
12179 1941563 1957567 1978502 1989248 1982365 1994727 2027855 2051629 2077938 2086912 2048106 2065999 2106137
12167 2106137 2122508 2152004 2182663 2177536 2215278 2249892 2256988 2301385 2316948 2319942 2330644 2389109
12155 2389109 2440611 2463780 2467552 2441053 2454692 2493705 2523042 2562194 2595421 2594991 2587064 2631544
12143 2631544 2660088 2642635 2646862 2670552 2703945 2750730 2795873 2770072 2789249 2828495 2855185
$$ packed form
12228A342334Q860J7681J390n694N7k424J4508L5714L606Q585j7352Q007K7773
12215A443045K3335L2260R182k7235o576j0694J9196L4670R520J6835J4058J8512
12203A576108K7732j6642J2637N7902p171K999J9409K141K0125J892M700K7146
12191A728978J2474j047P80K4914J2464J3825J4810J8837M6103N9012K5684j5271
12179A941563J6004K0935J0746o883J2362L3128K3774K6309Q974l8806J7893M0138
12167B106137J6371K9496L0659n127L7742L4614P096M4397J5563K994J0702N8465
12155B389109N1502K3169L772k6499J3639L9013K9337L9152L3227m30p927M4480
12143B631544K8544j7453M227K3690L3393M6785M5143k5801J9177L9246K6690
$$ plain form
12132 2855185 2903754 2929288 2965085 2990003 3007711 3037023 3052433 3108552 3129113 3164486 3209108
12121 3209108 3213015 3268083 3294744 3293486 3314575 3359487 3397530 3427681 3455224 3481276 3494825 3541730
12109 3541730 3572147 3612609 3662801 3668714 3656072 3710914 3778685 3828121 3834105 3854887 3884998 3910210
12097 3910210 3876152 3896198 3937015 3958052 3987358 4063436 4116305 4151785 4209770 4251336 4258436
12086 4258436 4298236 4305976 4329718 4387877 4405368 4453051 4530382 4584774 4610761 4624440 4654502
12075 4654502 4710029 4723504 4719190 4736557 4768735 4780038 4798908 4824777 4888426 4929526 4974752
12064 4974752 5003971 5068528 5119419 5137661 5180463 5181346 5177833 5214775 5247429 5278161 5322576 5376516
12052 5376516 5434499 5446858 5459000 5442139 5445448 5507570 5542605 5567288 5582027 5614224 5661025
$$ packed form
12132B855185M8569K5534L5797K4918J7708K9312J5410N6119K0561L5373M4622
12121C209108L907N5068K6661j258K1089M4912L8043L0151K7543K6052J3549M6905
12109C541730L0417M0462N0192N913j2642N4842O7771M9436N984K0782L0111K5212
12097C910210l4058K0046M0817K1037K9306P6078N2869L5480N7985M1566P100
12086D258436L9800P740K3742N8159J7491M7683P7331N4392K5987J3679L0062
12075D654502N5527J3475m314J7367L2178J1303J8870K5869O3649M1100M5226
12064D974752K9219O4557N0891J8242M2802Q83l513L6942L2654L0732M4415N3940
12052E376516N7983J2359J2142j6861L309O2122L5035K4683J4739L2197M6801
$$ plain form
12041 5661025 5694221 5726670 5763261 5802804 5829829 5850540 5842614 5859015 5887777 5893180 5914229 5960413
12029 5960413 5970868 5963206 5980984 6011041 6010303 6038748 6026291 6055070 6074250 6072202 6092717 6094163
12017 6094163 6088957 6077783 6080319 6116344 6143403 6139667 6144740 6128135 6097771 6098352 6105366 6061133 6019909
12004 6019909 6035616 6059281 6025596 6011771 6002034 6003810 6052910 6063307 6118857 6154097 6127966 6067635
11992 6067635 6009937 5963711 5908278 5874727 5850711 5841945 5847219 5810294 5763144 5711456 5704070 5685023
11980 5685023 5670855 5679023 5653981 5610115 5576523 5529672 5471941 5442508 5429592 5401062 5379096
11969 5379096 5387735 5372472 5338330 5280798 5239305 5208269 5163508 5120680 5103051 5048080 4998681
11958 4998681 4975505 4947080 4886114 4844703 4848068 4910413 4968427 4990895 4939810 4820225 4725176
$$ packed form
12041E661025L3196L2449L6591L9543K7025K0711p926J6401K8762N403K1049M6184
12029E960413J0455p662J7778L0057p38K8445j2457K8779J9180k048K0515J446
12017F094163n206j1174K536L6025K7059l736N073j6605l0364N81P014m4233m1224
12004F019909J5707K3665l3685j3825r737J776M9100J0397N5550L5240k6131o0331
11992F067635n7698m6226n5433l3551k4016q766N274l6925m7150n1688p386j9047
11980E685023j4168Q168k5042m3866l3592m6851n7731k9433j2916k8530k1966
11969E379096Q639j5263l4142n7532m1493l1036m4761m2828j7629n4971m9399
11958D998681k3176k8425o0966m1411L365O2345N8014K2468n1085j19585r5049
$$ plain form
11947 4725176 4657604 4568614 4508442 4464116 4416460 4385207 4349571 4319672 4265569 4206989 4191107
11936 4191107 4193272 4133397 4089764 4042561 3995883 3956904 3933077 3923461 3903061 3845568 3815023 3786275
11924 3786275 3762890 3732430 3687567 3657936 3629164 3609085 3580598 3569990 3536874 3474013 3440521
11913 3440521 3427115 3410465 3381296 3354006 3339692 3322251 3283964 3250791 3205617 3153898 3110043
11902 3110043 3057409 3033343 3022326 2991760 2957826 2966323 2946134 2901419 2866007 2804419 2752699
11891 2752699 2727390 2723309 2715384 2695268 2661473 2597745 2585118 2590609 2608895 2589836 2549110 2531231
11879 2531231 2514578 2483526 2458916 2430217 2407216 2393219 2390391 2386625 2359203 2354116 2329245 2302872
11867 2302872 2280525 2245602 2192906 2183148 2189426 2178585 2121488 2050785 2081104 2103394 2091951 2076787
$$ packed form
11947D725176o7572q8990o0172m4326m7656l1253l5636k9899n4103n8580j5882
11936D191107K165n9875m3633m7203m6678l8979k3827r616k0400n7493l0545k8748
11924C786275k3385l0460m4863k9631k8772k0079k8487j0608l3116o2861l3492
11913C440521j3406j6650k9169k7290j4314j7441l8287l3173m5174n1719m3855
11902C110043n2634k4066j1017l0566l3934Q497k0189m4715l5412o1588n1720
11891B752699k5309m081p925k0116l3795o3728j2627N491J8286j9059m0726j7879
11879B531231j6653l1052k4610k8699k3001j3997k828l766k7422n087k4871k6373
11867B302872k2347l4923n2696r758O278j0841n7097p0703L0319K2290j1443j5164
$$ plain form
11855 2076787 2066196 2052202 2003576 1948675 1928405 1939627 1920348 1929503 1905473 1859929 1809820
11844 1809820 1772728 1754402 1744311 1755895 1775314 1742106 1712350 1745656 1750173 1692487 1616760
11833 1616760 1613087 1649082 1661472 1669971 1648046 1615347 1590951 1591687 1587333 1524201 1484967 1504701
11821 1504701 1492432 1470186 1437996 1470733 1502357 1498942 1461688 1426789 1434402 1427303 1427647 1426672 1414392
11808 1414392 1367499 1316382 1299392 1301280 1279393 1244660 1248024 1290471 1262478 1223412 1204367 1198449
11796 1198449 1245854 1263286 1247145 1217214 1202396 1196336 1174130 1155709 1143894 1112219 1083315
11785 1083315 1094187 1096391 1104844 1060485 1053498 1038999 1027426 1029602 1014899 1019313 999477 973097
11773 973097 977247 992400 996365 1016201 995342 977276 967355 959671 973792 977032 991630 943268
$$ packed form
11855B076787j0591j3994m8626n4901k0270J1222j9279R155k4030m5544n0109
11844A809820l7092j8326j0091J1584J9419l3208k9756L3306M517n7686p5727
11833A616760l673L5995J2390Q499k1925l2699k4396P36m354o3132l9234J9734
11821A504701j2269k2246l2190L2737L1624l415l7254l4899P613p099L44r75j2280
11808A414392m6893n1117j6990J888k1887l4733L364M2447k7993l9066j9045n918
11796A198449M7405J7432j6141k9931j4818o060k2206j8421j1815l1675k8904
11785A083315J0872K204Q453m4359o987j4499j1573K176j4703M414j9836k6380
11773I73097M150J5153L965J9836k0859j8066r921p684J4121L240J4598m8362
$$ plain form
11761 943268 891647 874830 890089 911417 904785 884709 894686 867400 854966 841846 824347 827650
11749 827650 849513 845978 841905 823013 814808 818395 808497 783123 759760 788838 764278 754600 748984
11736 748984 761567 761216 742343 755986 782434 760054 737516 716731 719262 711025 711273 730682 744674
11723 744674 758245 759223 711309 676583 668814 672005 678381 681764 673639 685479 696009 702110 688002
11710 688002 644774 640703 668305 658006 658598 638432 615611 578664 570400 567567 577554 569183 557568
11697 557568 571613 596587 629199 638945 605125 576330 550463 567234 587050 584421 553443 533800
11685 533800 550862 513296 522018 496054 487324 478739 475081 465200 477918 472247 476315 533624 565199
11672 565199 547416 550779 536729 486255 463453 469451 462546 497515 508403 532200 523688 527806
$$ packed form
11761I43268n1621j6817J5259K1328o632k0076R977k7286j2434j3120j7499L303
11749H27650K1863l535m073j8892q205L587r898k5374k3363K9078k4560r678n616
11736G48984J2583l51j8873J3643K6448k2380k2538k0785K531q237K48J9409J3992
11723G44674J3571R78m7914l4726p769L191O376L383q125J1840J0530O101j4108
11710F88002m3228m071K7602j0299N92k0166k2821l6947q264k833R987q371j1615
11697E57568J4045K4974L2612R746l3820k8795k5867J6771J9816k629l0978j9643
11685E33800J7062l7566Q722k5964q730q585l658r881J2718n671M068N7309L1575
11672E65199j7783L363j4050n0474k2802N998o905L4969J0888K3797q512M118
$$ plain form
11660 527806 514937 501709 458201 433598 448138 460554 437565 444894 425880 442503 434663 425267
11648 425267 450085 478870 460359 477944 465168 466367 457775 427931 406743 357118 375999 404824
11636 404824 397190 358302 372104 384571 405657 403454 368438 370784 390461 380329 364164 356974
11624 356974 354414 358143 380919 357044 338068 333748 309744 317598 334128 353816 364622 341475
11612 341475 305838 342321 357008 369305 378728 361099 362592 360888 331416 349914 362241 372538
11600 372538 363243 346391 323209 310550 298080 309419 305451 288638 298079 312850 319455 328710
11588 328710 313873 324459 289333 285126 295604 262397 261996 272825 310393 312730 317042 329498
11576 329498 314262 295539 270748 270786 271370 286965 304422 313218 275911 263325 277790 292900 285699
$$ packed form
11660E27806j2869j3228m3508k4603J4540J2416k2989P329j9014J6623p840r396
11648D25267K4818K8785j8511J7585j2776J199q592k9844k1188m9625J8881K8825
11636D04824p634l8888J3802J2467K1086k203l5016K346J9677j0132j6165p190
11624C56974k560L729K2776k3875j8976m320k4004P854J6530J9688J0806k3147
11612C41475l5637L6483J4687J2297R423j7629J493j704k9472J8498J2327J0297
11600C72538r295j6852k3182j2659j2470J1339l968j6813R441J4771O605R255
11588C28710j4837J0586l5126m207J0478l3207m01J0829L7568K337M312J2456
11576C29498j5236j8723k4791L8N84J5595J7457Q796l7307j2586J4465J5110p201
$$ plain form
11563 285699 298149 256514 225265 246970 241150 200856 182319 190491 191328 214677 228648 203222
11551 203222 219063 257852 259988 215173 201466 193035 226793 246296 265404 258993 236194 224296
11539 224296 216525 211984 195953 163859 156454 165392 183950 198501 225446 248333 229923 213901
11527 213901 206118 210743 200893 204908 206553 223411 222884 219991 221457 205612 172560 159056 153979
11514 153979 168086 167317 172088 196388 183132 217262 237040 226936 238444 273066 241311 184057
11502 184057 188687 213085 213811 226237 202963 184097 182415 164035 168371 200483 209036 177223 172175
11489 172175 186866 181122 176018 178470 195622 187241 161011 156098 181521 200516 185087 134899
11477 134899 114871 137891 132217 140401 148118 173890 200071 191014 176088 166871 177022 159135
$$ packed form
11563B85699J2450m1635l1249K1705n820m0294j8537Q172Q37K3349J3971k5426
11551B03222J5841L8789K136m4815j3707q431L3758J9503J9108o411k2799j1898
11539B24296p771m541j6031l2094p405Q938J8558J4551K6945K2887j8410j6022
11527B13901p783M625r850M015J645J6858n27k893J466j5845l3052j3504n077
11514A53979J4107p69M771K4300j3256L4130J9778j0104J1508L4622l1755n7254
11502A84057M630K4398P26J2426k3274j8866j682j8380M336L2112Q553l1813n048
11489A72175J4691n744n104K452J7152q381k6230m913K5423J8995j5429n0188
11477A34899k0028K3020n674Q184P717K5772K6181r057j4926r217J0151j7887
$$ plain form
11465 159135 165196 158085 162771 180408 160413 151057 163195 123349 139707 152495 124161 167146
11453 167146 158951 129553 134219 154222 145023 145159 154840 172488 145752 125725 148774 193603 201465
11440 201465 152807 104993 110336 112536 83669 88390 122586 129459 153904 157308 127063 84880
11428 84880 74408 104275 129796 135745 132214 111059 108455 107257 94308 116722 136767 131620 114455
11415 114455 146423 185193 190432 168411 165711 130930 134768 144158 124552 121770 128900 122026 108341
11402 108341 85395 108038 137467 139001 127082 111113 105535 119738 124404 139922 139343 147716 141370
11389 141370 158883 112143 85068 109921 154337 181603 157477 145170 88467 46986 77721
11378 77721 98543 87425 87365 119780 161177 149720 141240 136805 93106 70074 90382 90632 72861
$$ packed form
11465A59135O061p111M686J7637j9995r356J2138l9846J6358J2788k8334M2985
11453A67146q195k9398M666K0003r199J36R681J7648k6736k0027K3049M4829P862
11440B01465m8658m7814N343K200k8867M721L4196O873K4445L404l0245m2183
11428H4880j0472K9867K5521N949l531k1155k604j198j2949K2414K0045n147j7165
11415A14455L1968L8770N239k2021k700l4781L838R390j9606k782P130o874j3685
11402A08341k2946K2643K9429J534j1919j5969n578J4203M666J5518n79Q373o346
11389A41370J7513m6740k7075K4853M4416K7266k4126j2307n6703m1481L0735
11378G7721K0822j1118o0L2415M1397j1457q480m435m3699k3032K0308K50j7771
$$ plain form
11365 72861 77387 42580 33252 48542 86691 106186 91178 82836 59589 41731 60151 75517
11353 75517 64030 47620 33759 -11507 12348 50314 62220 88238 95174 75381 62892 51341
11341 51341 42968 11418 10059 -2861 16736 55227 53861 80421 77656 44154 3305 18907
11329 18907 36236 58889 71918 94703 95741 80045 93692 77587 56292 20759 4189 9190
11317 9190 24709 53639 50286 53180 28762 24376 47034 59874 62321 68737 60025 70639 96868
11304 96868 122585 142420 110348 51297 49373 53506 62330 49434 77186 90369 96097 60088
11292 60088 34180 59290 68662 74083 73503 47916 21825 5477 338 -31632 -37065 -26333 38454
11279 38454 44925 41052 28928 15023 21889 17502 30296 65187 69046 40158 11565 27381 41805
$$ packed form
11365G2861M526l4807r328J5290L8149J9495j5008q342k3247j7858J8420J5366
11353G5517j1487j6410j3861m5266K3855L7966J1906K6018O936j9793j2489j1551
11341E1341q373l1550j359j2920J9597L8491j366K6560k765l3502m0849J5602
11329A8907J7329K2653J3029K2785J038j5696J3647j6105k1295l5533j6570N001
11317I190J5519K8930l353K894k4418m386K2658J2840K447O416q712J0614K6229
11304I6868K5717J9835l2072n9051j924M133Q824j2896K7752J3183N728l6009
11292F0088k5908K5110R372N421n80k5587k6091j6348n139l1970n433J0732O4787
11279C8454O471l873j2124j3905O866m387J2794L4891L859k8888k8593J5816J4424
$$ plain form
11266 41805 49718 49218 48891 54430 83919 71373 65929 50509 15779 23455 22277 2192 -9699
11253 -9699 -35727 -18126 10716 -11994 -24055 -20902 -21571 6447 45854 48375 6272 17676 1516
11240 1516 8311 23310 43676 31612 35508 18707 20586 27250 34669 58183 45630 38648 49619
11227 49619 30214 26315 20897 41965 39293 27620 42417 16448 -11681 -31280 -13804 11449
11215 11449 -23162 -5170 -488 5890 -806 -6501 20143 19290 50599 88329 68577 35368 51728
11202 51728 75666 71087 74120 55923 81802 81948 76092 78494 62131 34255 -3759 207 27690
11189 27690 41187 49793 44542 51643 29617 40099 67707 54893 34636 27172 28843 18459 25531
11176 25531 33457 32314 26859 33249 41018 64763 86507 97496 98096 97216 89419 62871 35099 18617
$$ packed form
11266D1805P913n00l27N539K9489j2546n444j5420l4730P676j178k0085j1891
11253i699k6028J7601K8842k2710j2061L153o69K8018L9407K521m2103J1404j6160
11240A516O795J4999K0366j2064L896j6801J879O664P419K3514j2553o982J0971
11227D9619j9405l899n418K1068k672j1673J4797k5969k8129j9599J7476K5253
11215A1449l4611J7992M682O378o696n695K6644q53L1309L7730j9752l3209J6360
11202E1728K3938m579L033j8197K5879J46n856K402j6363k7876l8014L966K7483
11189B7690J3497Q606n251P101k2026J0482K7608j2814k0257p464J671j0384P072
11176B5531P926j143n455O390P769K3745K1744J0989O00q80p797k6548k7772j6482
$$ plain form
11162 18617 -332 8810 35284 -5987 -43940 -33449 -33237 -25890 -18002 -11673 -31327 -21292 17329
11149 17329 48895 57846 39740 15641 -14733 -23875 -19165 -10740 2807 6951 4619 36714 71173
11136 71173 64750 62222 72170 77305 96197 125791 92124 57302 34592 14731 42936 50985 63833
11123 63833 37630 28051 46667 43171 41166 63111 53042 56974 62290 57982 99578 102240 62289
11110 62289 66182 50334 17742 45272 57357 28379 -6780 18950 9398 -4970 31785 27890
11098 27890 12117 21597 36907 32660 24215 34230 33457 -5707 -17021 -44004 -46955 -36819 -28096
11085 -28096 -19398 8321 2428 -3988 27027 38295 44403 7306 -27272 -23162 -31584 -73169 -71498
11072 -71498 -88380 -60739 -41550 -24887 -17528 -1322 -5613 -9034 -24469 -26197 -16530 -3677 -14872
$$ packed form
11162A8617j8949R142K6474m1271l7953J0491K12P347P888O329j9654J0035L8621
11149A7329L1566Q951j8106k4099l0374r142M710Q425J3547M144k332L2095L4459
11136G1173o423k528R948N135J8892K9594l3667l4822k2710j9861K8205Q049J2848
11123F3833k6203r579J8616l496k005K1945j0069L932N316m308M1596K662l9951
11110F2289L893j5848l2592K7530J2085k8978l5159K5730r552j4368L6755l895
11098B7890j5773R480J5310m247q445J0015p73l9164j1314k6983k951J0136Q723
11085b8096Q698K7719n893o416L1015J1268O108l7097l4578M110q422m1585J671
11072g1498j6882K7641J9189J6663P359J6206m291l421j5435j728R667J2853j1195
$$ plain form
11059 -14872 -2308 -11856 -17059 -34124 -9970 -7057 14152 -4561 -9984 -17994 -22026 -18879 -1421
11046 -1421 15216 16621 21613 48729 70314 28760 57098 79674 91363 99118 146109 158083
11034 158083 113789 71969 70644 111552 142834 165567 199220 237301 259232 278832 246132 205407
11022 205407 182915 148961 153306 161620 181574 221302 252833 268344 261761 245730 254454 247714
11010 247714 228645 204851 161269 180743 201585 210831 222913 251547 305612 348011 372792 401716
10998 401716 424689 458390 502179 572228 632468 675399 680487 669597 628317 529635 424639
10987 424639 346000 268273 214766 159579 106506 102263 109868 70159 50629 62815 74797 60293
10975 60293 72945 50026 17009 36019 45530 15500 4724 17524 25805 12152 43736 65794
$$ packed form
11059a4872J2564r548n203j7065K4154K913K1209j8713n423q010m032L147J7458
11046a421J6637J405M992K7116K1585m1554K8338K2576J1689P755M6991J1974
11034A58083m4294m1820j325M0908L1282K2733L3653L8081K1931J9600l2700m0725
11022B05407k2492l3954M345Q314J9954L9728L1531J5511o583j6031Q724o740
11010B47714j9069k3794m3582J9474K0842R246J2082K8634N4065M2399K4781K8924
10998D01716K2973L3701M3789P0049O0240M2931N088j0890m1280r8682j04996
10987D24639p8639p7727n3507n5187n3073m243P605l9709j9530J2186J1982j4504
10975F0293J2652k2919l3017J9010R511l0030j0776J2800Q281j3653L1584K2058
$$ plain form
10963 65794 57994 21080 11167 19570 40088 40289 47058 50172 46484 12606 1294 -12957 -24025
10950 -24025 -30342 -13511 6386 -13799 -37294 -18705 -10048 11868 42523 29121 -14227 -26269
10938 -26269 -33306 -48913 -49546 -23231 7187 -695 -12443 -23871 -44105 -30725 18818 7812
10926 7812 -10731 22847 23726 19398 14539 20537 17853 2994 -9044 2612 -31849 -32877 12046
10913 12046 -23790 -41126 -65555 -56647 -12341 12943 31590 -5562 -2231 -11527 -15871 17949
10901 17949 23623 11838 50379 33904 720 -25118 -25477 -48352 -57203 -59918 -57466 -26939 10108
10888 10108 -7362 -29805 -48110 -46017 -19970 5524 30554 635 7979 48813 51662 23433
10876 23433 18098 43110 53086 99449 100109 70248 116479 110139 104979 105874 110532 137744 131898 121818
$$ packed form
10963F5794p800l6914r913Q403K0518K01O769L114l688l3878j1312j4251j1068
10950b4025o317J6831J9897k0185k3495J8589Q657K1916L0655j3402m3348j2042
10938b6269p037j5607o33K6315L0418p882j1748j1428k0234J3380M9543j1006
10926G812j8543L3578Q79m328m859N998k684j4859j2038J1656l4461j028M4923
10913A2046l5836j7336k4429Q908M4306K5284J8647l7152L331r296m344L3820
10901A7949N674j1785L8541j6475l3184k5838l59k2875q851k715K452L0527L7047
10888A0108j7470k2443j8305K093K6047K5494K5030k9919P344M0834K849k8229
10876B3433n335K5012R976M6363O60k9861M6231o340n160Q95M658K7212n846j0080
$$ plain form
10862 121818 145952 218472 266888 303245 314927 362209 455894 646568 949842 1354584 1777655
10851 1777655 2075291 2150355 1981752 1659472 1284545 947820 723758 569367 451887 353254
10841 353254 274216 196296 158098 124897 119619 117499 80211 65890 58380 59176 67558 75217 78895
10828 78895 63366 30202 19263 6601 31985 19730 10430 1312 26580 64666 71627 25148
10816 25148 17110 17781 31074 10825 -12325 -8436 9170 -16124 -27115 -31951 -38470 -32365 -29317
10803 -29317 -4762 10796 12551 -25355 -29284 -23843 -3655 24251 28779 24896 46224 55855 26647
10790 26647 33379 24068 22997 23458 29845 19510 31536 26647 53609 48740 32814 17448 -18632
10777 -18632 -39811 -53357 -37313 4493 59636 69288 44541 61941 86160 102586 134197 123604
$$ packed form
10862A21818K4134P2520M8416L6357J1682M7282R3685J90674L03274M04742M23071
10851A777655K97636P5064j68603l22280l74927l36725k24062j54391j17480r8633
10841C53254p9038p7920l8198l3201n278k120l7288j4321p510P96Q382P659L678
10828G8895j5529l3164j0939j2662K5384j2255r300r118K5268L8086O961m6479
10816B5148q038O71J3293k0249k3150L889J7606k5294j0991m836o519O105L048
10803b9317K4555J5558J755l7906l929N441K0188K7906M528l883K1328R631k9208
10790B6647O732r311j071M61O387j0335J2026m889K6962m869j5926j5366l6080
10777a8632k1179j3546J6044M1806N5143R652k4747J7400K4219J6426L1611j0593
$$ plain form
10765 123604 102518 58977 60173 68284 76513 92057 69892 15324 -5096 -40597 -97728 -138040
10753 -138040 -148938 -148620 -141475 -113611 -111207 -84848 -62986 -65652 -65558 -43908 42409 26799 -16643
10740 -16643 2768 15858 30569 63797 71630 88965 60207 28793 -2822 -5795 -9901 -16600
10728 -16600 42 -31062 -58441 -80600 -63145 -93178 -124784 -142301 -141975 -64996 -7632 57456
10716 57456 176397 257322 313281 338401 378781 401624 400980 394698 398532 387492 401972 427390
10704 427390 454285 440668 470090 547049 603161 585668 578138 556760 561084 541609 497312 484156
10692 484156 480132 452003 435734 440580 432275 414634 403680 416731 441727 482456 568261 627803
10680 627803 686565 761946 845893 895776 891259 834208 740994 661541 579032 509233 486211 456138
$$ packed form
10765A23604k1086m3541J196Q111Q229J5544k2165n4568k0420l5501n7131m0312
10753a38040j0898L18P145K7864K404K6359K1862k666R4K1650Q6317j5610m3442
10740a6643J9411J3090J4711L3228P833J7335k8758l1414l1615k973m106o699
10728a6600J6642l1104k7379k2159J7455l0033l1606j7517L26P6979N7364O5088
10716E7456J18941Q0925N5959K5120M0380K2843o44o282L834j1040J4480K5418
10704D27390K6895j3617K9422P6959N6112j7493p530k1378M324j9475m4297j3156
10692D84156m024k8129j6269M846q305j7641j0954J3051K4996M0729Q5805N9542
10680F27803N8762P5381Q3947M9883m517n7051r3214p9453q2509o9799k3022l0073
$$ plain form
10668 456138 422092 416110 453747 418636 421041 429291 424409 445067 475772 485704 461061 433327
10656 433327 430683 443078 471855 504914 546954 559991 567606 565899 588214 597865 612940 623171
10644 623171 615778 656039 677413 682471 739040 776038 791914 771644 762661 781541 834771 918279
10632 918279 1078025 1206213 1288835 1385095 1521920 1653168 1804058 1966465 2118184 2272586
10622 2272586 2460776 2675361 2937103 3191954 3509859 3955719 4547439 5322978 6317669
10613 6317669 7662135 9530249 11895373 14711218 17715209 20428310 22322215 23027860
10605 23027860 22747181 22033446 21437528 21526232 22615605 24975726 28944419 34650977 42027766
10596 42027766 50011171 56989223 62321558 66970236 72785928 81997461 96315747 115642891
$$ packed form
10668D56138l4046n982L7637l5111K405Q250m882K0658L0705R932k4643k7734
10656D33327k644J2395K8777L3059M2040J3037P615j707K2315R651J5075J0231
10644F23171p393M0261K1374N058N6569L6998J5876k0270q983J8880N3230Q3508
10632I18279J59746J28188Q2622R6260J36825J31248J50890J62407J51719J54402
10622B272586J88190K14585K61742K54851L17905M45860N91720P75539R94691
10613F317669J344466J868114K365124K815845L003991K713101J893905P05645
10605B3027860k80679p13735n95918Q8704J089373K360121L968693N706558P376789
10596D2027766P983405O978052N332335M648678N815692R211533J4318286J9327144
$$ plain form
10588 115642891 137419216 156703287 168681480 170997944 163544638 147815332 127072397
10581 127072397 105220745 85211112 68855752 56761728 48661439 43966650 42133441
10574 42133441 42678550 44624495 46300249 45882708 42725874 37603846 31865701 26776280
10566 26776280 23033258 20682083 19484259 19156352 19514684 20146619 20372644 19658671 17932284
10557 17932284 15449418 12718253 10228538 8246354 6771902 5673365 4891595 4295470
10549 4295470 3832335 3478716 3191181 2929979 2721957 2559899 2457999 2373752 2285336 2242016
10539 2242016 2239845 2280283 2393076 2638923 2994033 3363063 3631779 3610913 3326289 2899477
10529 2899477 2461925 2138295 1898866 1756273 1643405 1584924 1569280 1523475 1461458 1393963
$$ packed form
10588A15642891K1776325J9284071J1978193K316464p453306j5729306k0742935
10581A27072397k1851652k0009633j6355360j2094024q100289m694789j833209
10574D2133441N45109J945945J675754m17541l156834n122028n738145n089421
10566B6776280l743022k351175j197824l27907L58332O31935K26025p13973j726387
10557A7932284k482866k731165k489715j982184j474452j098537p81770n96125
10549D295470m63135l53619k87535k61202k08022j62058j01900q4247q8416m3320
10539B242016k171M0438J12793K45847L55110L69030K68716k0866k84624m26812
10529B899477m37552l23630k39429j42593j12868n8481j5644m5805o2017o7495
$$ plain form
10519 1393963 1328485 1253782 1202261 1183239 1176598 1167698 1161170 1136840 1135749 1132882 1099341 1095034
10507 1095034 1079832 1084559 1109439 1127960 1155114 1189033 1210874 1291586 1375544 1480398 1638815
10496 1638815 1848852 2149592 2535090 2946534 3253639 3348665 3198969 2938431 2710770 2578192
10486 2578192 2510214 2519013 2551219 2627107 2719423 2801399 2903070 3030271 3228789 3528466 3895733
10475 3895733 4350359 4917825 5680719 6750166 8197699 10036892 12230973 14680119 17134628
10466 17134628 18977455 19810522 19441579 18106700 16370954 14727410 13612356 13136041
10458 13136041 13263140 14040080 15552999 17888517 21168525 25679710 31790562 40181804
10450 40181804 52391630 71277868 101827819 151605646 226646463 316966927 389864895
$$ packed form
10519A393963o5478p4703n1521j9022o641q900o528k4330j091k867l3541m307
10507A095034j5202M727K4880J8521K7154L3919K1841Q0712Q3958J04854J58417
10496A638815K10037L00740L85498M11444L07105R5026j49696k60538k27661j32578
10486B578192o7978Q799L2206P5888R2316Q1976J01671J27201J98518K99677L67267
10475C895733M54626N67466P62894J069447J447533J839193K194081K449146K454509
10466A7134628J842827Q33067l68943j334879j735746j643544j115054m76315
10458A3136041J27099P76940J512919K335518L280008M511185O110852Q391242
10450D0181804J2209826J8886238L0549951M9777827P5040817R0320464P2897968
$$ plain form
10443 389864895 413756540 380902665 309708412 227386130 156092573 105867989 74225925
10436 74225925 54646906 41988363 33272030 26881398 22068089 18409954 15605031 13402670
10428 13402670 11673732 10327570 9292434 8537138 8034195 7816717 7799387 7779214 7550376
10419 7550376 7064830 6351341 5597177 4895941 4306895 3788399 3423388 3125591 2826828
10410 2826828 2628504 2455543 2253800 2103873 2023574 1986680 1970194 1984933 1999365 1968631
10400 1968631 1927117 1893803 1870446 1848324 1807386 1736519 1665217 1599324 1561633 1546726 1524428
10389 1524428 1545430 1536404 1482690 1443714 1413842 1381033 1328049 1267624 1219001 1173480 1132945
10378 1132945 1096098 1054039 1014288 998006 979711 948650 936278 940584 901653 919074 899141
$$ packed form
10443C89864895K3891645l2853875p1194253q2322282p1293557n0224584l1642064
10436G4225925j9579019j2658543q716333o390632m813309l658135k804923k202361
10428A3402670j728938j346162j035136p55296n02943k17478j7330k0173k28838
10419G550376m85546p13489p54164p01236n89046n18496l65011k97797k98763
10410B826828j98324j72961k01743j49927q0299l6894j6486J4739J4432l0734
10400A968631m1514l3314k3357k2122m0938p0867p1302o5893l7691j4907k2298
10389A524428K1002r026n3714l8976k9872l2809n2984o0425m8623m5521m0535
10378A132945l6847m2059l9751j6282j8295l1061j2372M306l8931J7421j9933
$$ plain form
10367 899141 876741 850661 799106 782798 722803 731568 736470 781679 805895 773181 746366 763594
10355 763594 773547 808656 810425 823376 871522 906594 918973 931698 960310 987275 1028929 1112712
10343 1112712 1176704 1235852 1278331 1331165 1392984 1450125 1524924 1700239 1889255 2180127 2713136
10332 2713136 3607273 5130205 7517921 10532957 13182892 14586519 14594252 13969514 13808668
10323 13808668 14298809 14669437 14044372 12077056 9357573 6716382 4666328 3310933
10315 3310933 2511664 2063894 1923190 1951490 2115506 2343740 2473788 2523306 2529908 2560363
10305 2560363 2597044 2643939 2701070 2776502 2892208 3069986 3315843 3544953 3817524 4153251
10295 4153251 4475261 4779936 5078320 5388959 5732041 6197640 6845275 7697937 8823091
$$ packed form
10367H99141k2400k6080n1555j6308n9995Q765M902M5209K4216l2714k6815J7228
10355G63594R953L5109J769J2951M8146L5072J2379J2725K8612K6965M1654Q3783
10343A112712O3992N9148M2479N2834O1819N7141P4799J75315J89016K90872N33009
10332B713136Q94137J522932K387716L015036K649935J403627P733o24738j60846
10323A3808668M90141L70628o25065j967316k719483k641191k050054j355395
10315C310933p99269m47770j40704K8300J64016K28234J30048M9518O602L0455
10305B560363L6681M6895N7131P5432J15706J77778K45857K29110K72571L35727
10295D153251L22010L04675K98384L10639L43082M65599O47635Q52662J125154
$$ plain form
10286 8823091 10178961 11890083 14101843 16928752 20575647 25323074 31747869 40523681
10278 40523681 52591647 68866969 89503478 112091963 130859822 139444222 135037938
10271 135037938 119802705 98915964 77779376 59867176 46177779 36231499 29077767
10264 29077767 23927687 20212729 17567598 15720524 14352957 13175995 11992527 10777838
10256 10777838 9626566 8608531 7840079 7240069 6789330 6353394 5892813 5437398 4979156
10247 4979156 4546640 4142620 3789909 3446229 3131876 2854005 2625868 2445927 2306151
10238 2306151 2201765 2120962 2031438 1944752 1872543 1810837 1705337 1585583 1512383 1476232 1433125
10227 1433125 1373377 1357614 1380246 1369485 1334239 1276391 1269568 1240057 1208134 1192072 1210003
$$ packed form
10286H823091J355870J711122K211760K826909L646895M747427O424795Q775812
10278D0523681J2067966J6275322K0636509K2588485J8767859Q584400m406284
10271A35037938j5235233k0886741k1136588j7912200j3689397r946280p153732
10264B9077767n150080l714958k645131j847074j367567j176962j183468j214689
10256A0777838j151272j018035p68452o00010m50739m35936m60581m55415m58242
10247D979156m32516m04020l52711l43680l14353k77871k28137j79941j39776
10238B306151j04386q0803q9524q6686p2209o1706j05500j19754p3200l6151m3107
10227A433125n9748j5763K2632j0761l5246n7848o823k9511l1923j6062J7931
$$ plain form
10216 1210003 1187269 1153235 1113638 1079454 1099502 1112172 1091283 1093500 1095521 1067940 1069276 1082101
10204 1082101 1035393 1048583 1083862 1078345 1059569 1053986 1010033 975810 959521 978409 997306 1010798
10192 1010798 1026729 1030237 1025437 1000107 1030932 1067438 1075049 1106471 1135943 1202471 1321470 1438377
10180 1438377 1546180 1702139 1906804 2095114 2226432 2338405 2444666 2546771 2642152 2715756
10170 2715756 2808663 2869042 2968442 3188044 3465702 3804903 4261373 4851159 5635465 6644742
10160 6644742 7907556 9591305 11654496 13989990 16074243 17313353 17414014 16540380
10152 16540380 15195094 13867465 12883944 12195546 11650608 11194917 10837168 10723395 10896354
10143 10896354 11536715 12733848 14541344 17079420 20539831 24988153 30722232 38448437
$$ packed form
10216A210003k2734l4034l9597l4184K0048J2670k0889K217K021k7581J336J2825
10204A082101m6708J3190L5279n517j8776n583m3953l4223j6289J8888J8897J3492
10192A010798J5931L508m800k5330L0825L6506P611L1422K9472O6528J18999J16907
10180A438377J07803J55959K04665J88310J31318J11973J06261J02105R5381P3604
10170B715756R2907O0379R9400K19602K77658L39201M56470N89786P84306J009277
10160F644742J262814J683749K063191K335494K084253J239110J00661q73634
10152A6540380j345286j327629r83521o88398n44938m55691l57749j13773J72959
10143A0896354O40361J197133J807496K538076L460411M448322N734079P726205
$$ plain form
10135 38448437 49439054 66240983 93348112 137798146 206692231 295315682 375342258
10128 375342258 412994224 393407002 329591430 248106166 172819913 117373584 81748298
10121 81748298 59829734 45987213 36618849 29801127 24600276 20537471 17349357 14855643
10113 14855643 12857121 11321541 10154170 9248501 8654274 8334921 8170054 7954008 7475020
10104 7475020 6759097 6021836 5369448 4807474 4347183 3995259 3690097 3441488 3206846
10095 3206846 2992886 2790603 2608811 2478730 2363078 2252890 2163513 2091632 2054271 1996292
10085 1996292 1972916 1969125 1925055 1825939 1749907 1681101 1612610 1551953 1511043 1477291 1469611 1448724
10073 1448724 1466307 1444478 1415009 1392647 1424123 1438163 1444904 1413218 1408018 1429969 1435564 1474466
$$ packed form
10135C8448437J0990617J6801929K7107129M4450034O8894085Q8623451Q0026576
10128C75342258L7651966j9587222o3815572q1485264p5286253n5446329l5625286
10121H1748298k1918564j3842521r368364o817722n200851m062805l188114k493714
10113A4855643j998522j535580j167371r05669n94227l19353j64867k16046m78988
10104G475020p15923p37261o52388n61974m60291l51924l05162k48609k34642
10095C206846k13960k02283j81792j30081j15652j10188q9377p1881l7361n7979
10085A996292k3376l791m4070r9116p6032o8806o8491o0657m0910l3752p680k0887
10073A448724J7583k1829k9469k2362L1476J4040O741l1686n200K1951N595L8902
$$ plain form
10061 1474466 1516520 1576222 1717149 1946807 2275569 2728539 3363276 4224602 5572671 7812514
10051 7812514 11312805 15628956 19747554 22333834 22404756 19983623 15964644 11683133
10043 11683133 8083448 5569466 4058249 3267950 2803320 2521097 2326089 2221377 2188777
10034 2188777 2284018 2492230 2845927 3109400 3144237 2906446 2465990 2002039 1612524 1346129
10024 1346129 1144752 978538 849478 787357 767631 720812 695996 658302 621724 611350 544163
10013 544163 535704 518428 473765 424460 397915 365509 330090 260937 198412 148046 130075 110723
10001 110723 40626 -45450 -99038 -95317 31636 244637 466358 678151 810916 821565 754124
9990 754124 704307 678141 669069 670877 626029 603366 619266 597815 583262 519676 451039 428997
$$ packed form
10061A474466M2054N9702J40927K29658L28762M52970O34737Q61326J348069K239843
10051G812514L500291M316151M118598K586280P0922k421133m018979m281511
10043A1683133l599685k513982j511217p90299m64630k82223j95008j04712l2600
10034B188777R5241K08212L53697K63473L4837k37791m40456m63951l89515k66395
10024A346129k01377j66214j29060o2121j9726m6819k4816l7694l6578j0374o7187
10013E44163q459j7276m4663m9305k6545l2406l5419o9153o2525n0366j7971j9352
10001A10723p0097q6076n3588L721J26953K13001K21721K11793J32765J0649o7441
9990G54124m9817k6166r072J808m4848k2663J5900k1451j4553o3586o8637k2042
$$ plain form
9978 428997 410863 373780 343499 298926 307114 322394 303500 337807 400863 453743 476487 459263
9966 459263 429334 434041 417356 394362 353352 335454 359217 388629 372635 328985 316136 304469
9954 304469 243690 174147 184445 183790 167237 146866 130490 111494 75141 82470 144924 176156
9942 176156 234860 256820 278286 311536 376035 434564 450253 445724 348219 226394 188202 170646
9930 170646 153798 147221 106799 103806 158310 192074 172985 162707 164039 123786 132175 181994
9918 181994 195365 176988 225534 264584 282951 286879 274581 290302 307066 312424 320202 328629
9906 328629 329994 329283 324595 283031 210776 213851 221453 240685 232311 235744 269704 297331 311359
9893 311359 285506 274612 292334 294953 279656 243093 230301 216283 243122 249734 222971 166966
$$ packed form
9978D28997j8134l7083l0281m4573Q188J5280j8894L4307O3056N2880K2744j7224
9966D59263k9929M707j6685k2994m1010j7898K3763K9412j5994m3650j2849j1667
9954C04469o0779o9543J0298o55j6553k0371j6376j8996l6353P329O2454L1232
9942A76156N8704K1960K1466L3250O4499N8529J5689m529r7505j21825l8192j7556
9930A70646j6848o577m0422k993N4504L3764j9089j0278J332m0253Q389M9819
9918A81994J3371j8377M8546L9050J8367L928j2298J5721J6764N358P778Q427
9906C28629J365p11m688m1564p2255L075P602J9232q374L433L3960K7627J4028
9893C11359k5853j0894J7722K619j5297l6563j2792j4018K6839O612k6763n6005
$$ plain form
9881 166966 147626 172902 192370 183486 176732 174360 172783 197359 242388 280028 325468 360163
9869 360163 377322 405028 471834 570093 702424 805647 843523 822300 754401 639717 534334
9858 534334 460478 391537 355823 349169 332048 301017 277214 245250 206377 179092 176447 192904
9846 192904 174603 197497 195204 179586 191881 212605 220797 242066 252249 200501 161430 166339
9834 166339 189881 190135 183215 177280 182048 179819 196185 178470 165231 193836 234791 278327 304952
9821 304952 346862 354244 314058 230886 225926 250332 261657 296728 283726 250524 185291 161075
9809 161075 159222 101612 82477 106941 134363 128721 135847 106371 126345 153398 165967 133762
9797 133762 101367 103148 100369 125406 146911 162409 158367 142571 109781 127705 124691 109285
$$ packed form
9881A66966j9340K5276J9468q884o754k372j577K4576M5029L7640M5440L4695
9869C60163J7159K7706O6806R8259J32331J03223L7876k1223o7899j14684j05383
9858E34334p3856o8941l5714o654j7121l1031k3803l1964l8873k7285k645J6457
9846A92904j8301K2894k293j5618J2295K0724Q192K1269J0183n1748l9071M909
9834A66339K3542K54o920n935M768k229J6366j7715j3239K8605M0955M3536K6625
9821C04952M1910P382m0186q3172m960K4406J1325L5071j3002l3202o5233k4216
9809A61075j853n7610j9135K4464K7422n642P126k9476J9974K7053J2569l2205
9797A33762l2395J781k779K5037K1505J5498m042j5796l2790J7924l014j5406
$$ plain form
9785 109285 115436 127454 160352 149306 176395 170472 132962 107158 125187 109226 113420 118530
9773 118530 121598 114969 147472 149344 110086 112775 96591 103748 128682 144994 120856 84275 85907
9760 85907 94936 112855 121808 132246 127946 115359 133992 137810 128329 153538 166623 181805 204901
9747 204901 254394 253158 234068 228780 220931 220259 204878 194478 190810 191828 186616 179934 186606 220940
9733 220940 234107 201576 222356 234158 247129 246770 270297 317352 373450 473815 614375 833637
9721 833637 1152156 1548429 1920157 2168715 2163942 1912632 1528709 1151609 857632 644001
9711 644001 456339 374146 339892 321110 299739 254841 218540 187999 160724 143558 130187
9700 130187 135963 137727 131206 102432 105904 108128 85450 80172 83746 92794 106590 101044 106470 90869
$$ packed form
9785A09285O151J2018L2898j1046K7089n923l7510k5804J8029j5961M194N110
9773A18530L068o629L2503J872l9258K689j6184P157K4934J6312k4138l6581J632
9760H5907R029J7919Q953J0438m300j2587J8633L818r481K5209J3085J5182K3096
9747B04901M9493j236j9090n288p849o72j5381j0400l668J018n212o682O672L4334
9733B20940J3167l2531K0780J1802J2971l59K3527M7055N6098J00365J40560K19262
9721H33637L18519L96273L71728K48558m773k51310l83923l77100k93977k13631
9711F44001j87662q2193l4254j8782k1371m4898l6301l0541k7275j7166j3371
9700A30187N776J764o521k8774L472K224k2678n278L574R048J3796n546N426j5601
$$ plain form
9686 90869 70376 96218 119490 123447 121809 93706 64032 57665 50465 57516 88560 90408 63900
9673 63900 64535 86684 59399 40770 69128 60196 57153 72575 82036 83091 97151 63851 68411
9660 68411 91902 99688 106316 71789 74444 95016 81978 59009 75054 125136 122828 101766 103347
9647 103347 117327 121183 151843 215123 268426 282561 289972 284524 254034 255770 243388 182713
9635 182713 150593 164181 133933 104098 75936 88228 119669 121606 100972 68671 66380 26801
9623 26801 24920 55910 107417 126256 112577 94872 104004 90197 97852 100230 92794 63879 81402
9610 81402 64915 56125 77643 107137 122092 104984 87313 92959 93193 63634 56663 53649 68236
9597 68236 66070 63057 49005 54167 70678 95762 76458 53304 53710 82695 91911 96624 107665
$$ packed form
9686I0869k0493K5842K3272L957j638k8103k9674o367p200P051L1044J848k6508
9673F3900O35K2149k7285j8629K8358q932l043J5422R461J055J4060l3300M560
9660F8411K3491P786O628l4527K655K0572j3038k2969J6045N0082k308k1062J581
9647A03347J3980L856L0660O3280N3303J4135P411n448l0490J736j2382o0675
9635A82713l2120J3588l0248k9835k8162J2292L1441J937k0634l2301k291l9579
9623B6801j881L0990N1507J8839j3679j7705R132j3807P655K378p436k8915J7523
9610H1402j6487q790K1518K9494J4955j7108j7671N646K34k9559o971l014J4587
9597F8236k166l013j4052N162J6511K5084j9304k3154M06K8985R216M713J1041
$$ plain form
9584 107665 79785 52944 42680 38621 49663 66814 108507 136881 110275 91299 95981 88750
9572 88750 94947 58634 24468 -605 23193 36500 40218 43581 73725 52134 18292 40837
9560 40837 62161 88988 129043 127827 71710 64234 82385 86162 65901 46676 60443 86775
9548 86775 95014 97782 108874 112543 95666 103271 96895 106770 92726 51252 49754 44002 44876 39719
9534 39719 39479 40836 47432 30949 41051 36869 65930 57593 24630 30110 38749 31331 17080 28813
9520 28813 45118 55204 72876 92628 70428 59197 72525 76199 54361 53046 40554 14290
9508 14290 -8676 2009 20718 80628 104969 72634 51656 27102 -3700 15939 12318 12404 4341
9495 4341 -3148 7991 3219 -8622 18085 34209 13997 9163 21428 42653 40601 30957 5441
$$ packed form
9584A07665k7880k6841j0264m059J1042J7151M1693K8374k6606j8976M682p231
9572H8750O197l6313l4166k5073K3798J3307L718L363L0144k1591l3842K2545
9560D0837K1324K6827M0055j216n6117p476J8151L777k0261j9225J3767K6332
9548H6775Q239K768J1092L669j6877P605o376R875j4044m1474j498n752Q74n157
9534C9719k40J357O596j6483J0102m182K9061q337l2963N480Q639p418j4251J1733
9520B8813J6305J0086J7672J9752k2200j1231J3328L674k1838j315j2492k6264
9508A4290k2966J0685J8709N9910K4341l2335k0978k4554l0802J9639l621Q6q063
9495D341p489J1139m772j1841K6707J6124k0212m834J2265K1225k052r644k5516
$$ plain form
9482 5441 8348 35356 21881 36377 48226 48387 69189 72493 72384 65595 74630 77063 77063 74732 79262
9467 79262 70350 39706 47347 55847 31640 49967 43493 11240 -2286 -7957 -32010 -14449 8176
9454 8176 10090 4726 28868 68323 72088 79999 81978 87619 72280 20394 34829 36653 7491
9441 7491 27312 60544 57011 73689 67166 48485 43276 37195 23360 18644 55958 57319 55006
9428 55006 71864 33210 11346 46295 51324 26157 30831 44934 53891 42754 39167 48402 54067
9415 54067 29159 14770 34784 40119 40012 9440 7109 27375 55466 85194 84011 91642 117327
9402 117327 132967 130771 112983 92869 101138 110780 115088 83406 48299 47020 55856 76071 71038
9389 71038 56266 36726 22165 11841 -1879 -23592 -56557 -38853 -15179 -771 33048 62791
$$ packed form
9482E441K907K7008j3475J4496J1849J61K0802L304j09o789R035K433%k331M530
9467G9262q912l0644P641Q500k4207J8327o474l2253j3526n671k4053J7561K2625
9454H176J914n364K4142L9455L765P911J979N641j5339n1886J4435J824k9162
9441G491J9821L3232l533J6678o523j8681n209o081j3835m716L7314J361k313
9428E5006J6858l8654k1864L4949N029k5167M674J4103Q957j1137l587R235N665
9415E4067k4908j4389K0014N335j07l0572k331K0266K8091K9728j183P631K5685
9402A17327J5640k196j7788k0114Q269R642M308l1682l5107j279Q836K0215n033
9389G1038j4772j9540j4561j0324j3720k1713l2965J7704K3674J4408L3819K9743
$$ plain form
9377 62791 69632 93440 74892 41243 30122 38440 39659 39530 57967 56455 48293 27478 -5531
9364 -5531 2635 29641 39833 44521 32668 44826 36089 55427 72068 72721 64459 52375 40799
9351 40799 55818 49881 21959 23616 51286 35642 5766 -25375 -1162 34107 50970 38709
9339 38709 11973 -8556 -8429 -24559 -17754 -6314 31760 90943 98741 95868 81852 76660 71379
9326 71379 67871 70078 28614 3808 -15890 -36263 -21706 -15225 -13084 10075 25356 4182 10702
9313 10702 34181 45292 50759 53351 53413 43148 50430 39191 8437 -20461 4551 13736 1292
9300 1292 13862 12389 26518 37054 42841 39071 25688 29114 65958 102786 98167 71954 66942
9287 66942 66738 36037 -12406 -26790 -16294 15378 53708 70058 41130 24461 42538 57750
$$ packed form
9377F2791O841K3808j8548l3649j1121Q318J219j29J8437j512q162k0815l3009
9364e531Q166K7006J0192M688j1853J2158q737J9338J6641O53q262j2084j1576
9351D0799J5019n937k7922J657K7670j5644k9876l1141K4213L5269J6863j2261
9339C8709k6736k0529J27j6130O805J1440L8074N9183P798k873j4016n192n281
9326G1379l508K207m1464k4806j9698k0373J4557O481K141K3159J5281k1174O520
9313A0702K3479J1111N467K592O2j0265P282j1239l0754k8898K5012R185j2444
9300A292J2570j473J4129J0536N787l770j3383L426L6844L6828m619k6213n012
9287F6942k04l0701m8443j4384J0496L1672L8330J6350k8928j6669J8077J5212
$$ plain form
9275 57750 29707 15547 39947 23265 27386 58721 30232 7274 15426 -127 -17468 -9754
9263 -9754 6760 27491 46082 55376 21771 1312 23129 36346 23413 22918 -1167 -11988 -13804
9250 -13804 -16002 -763 -21590 -11197 -14008 -1337 5127 -7271 37087 66919 59323 27432 8783
9237 8783 17374 23475 48101 53622 69175 72698 69255 37982 11761 26568 43942 61542 75602
9224 75602 86417 85346 52080 29153 11194 7685 -25793 -2475 18416 13270 23025 13138 15412
9211 15412 20208 17531 12171 -6323 -1989 44865 58839 51923 82035 115950 88978 80942 105600
9198 105600 85052 63315 39727 32378 45569 39669 44154 24436 16995 -16169 -4536 12734
9186 12734 34240 17488 34500 25765 22908 31205 44890 43793 8370 -14274 -26835 -27866 -16939
$$ packed form
9275E7750k8043j4160K4400j6682M121L1335k8489k2958Q152j5553j7341P714
9263i754J6514K0731J8591R294l3605k0459K1817J3217j2933m95k4085j0821j816
9250a3804k198J5239k0827J0393k811J2671O464j2398M4358K9832p596l1891j8649
9237H783Q591O101K4626N521J5553L523l443l1273k6221J4807J7374J7600J4060
9224G5602J0815j071l3266k2927j7959l509l3478K3318K0891n146R755r887K274
9211A5412M796k677n360j8494M334M6854J3974o916L0112L3915k6972q036K4658
9198A05600k0548k1737k3588p349J3191n900M485j9718p441l3164J1633J7270
9186A2734K1506j6752J7012q735k857Q297J3685j097l5423k2644j2561j031J0927
$$ plain form
9173 -16939 24296 6374 15699 18589 -16710 -32041 -30162 8533 56752 54964 64679 61974 64687
9160 64687 79226 70138 45566 29906 32611 36798 38214 30427 16192 26993 18506 23288 41330
9147 41330 64694 70475 46768 21048 35901 51204 39080 38073 41784 60161 88529 81660 49622
9134 49622 34166 20019 -6959 -5444 16052 37333 75811 117056 94362 67998 57367 48130
9122 48130 37383 28349 12647 6087 873 1026 36022 64536 81555 95324 111139 85254 42067
9109 42067 36164 56290 63136 52720 46549 55327 35237 24806 35812 26034 24947 20312 9736
9096 9736 -31655 -70260 -64906 -58661 -6970 25281 40705 1908 16411 48452 51705 61662 43215
9083 43215 19615 1757 372 7318 -8090 1153 10984 -118 19756 55749 43134 20985 27582
$$ packed form
9173a6939M1235j7922R325K890l5299j5331J879L8695M8219j788R715k705K713
9160F4687J4539r088k4572j5660K705M187J416p787j4235J0801q487M782J8042
9147D1330K3364N781k3707k5720J4853J5303j2124j007L711J8377K8368o869l2038
9134D9622j5456j4147k6978J515K1496K1281L8478M1245k2694k6364j0631r237
9122D8130j0747r034j5702o560n214J53L4996K8514J7019J3769J5815k5885m3187
9109D2067n903K0126O846j0416o171Q778k0090j0431J1006r778j087m635j0576
9096I736m1391l8605N354O245N1691L2251J5424l8797J4503L2041L253R957j8447
9083D3215k3600j7858j385O946j5408R243R831j1102J9874L5993j2615k2149O597
$$ plain form
9070 27582 41543 47175 51452 8039 10982 56964 67955 73342 43428 51786 43398 -3117 -10774
9057 -10774 26299 10224 18875 9202 22743 20209 7870 -4827 -4688 22353 14896 1777 -6572
9044 -6572 -30689 4971 39363 49786 50403 48857 36398 15467 -8291 -30627 6457 33457 16881
9031 16881 -2360 12068 15817 6481 35672 49679 55896 46274 20516 3923 18771 9428 -31139
9018 -31139 -4243 16813 -19219 -27267 18028 55019 41008 29128 38080 52789 56278 46401 23044
9005 23044 66561 74257 95803 80726 27258 -8258 -22354 -575 25359 39869 33683 24543
8993 24543 35694 28806 36973 29011 11800 -5753 28862 -4268 -38714 -16697 -6230 -13029 9764
8980 9764 46237 61954 49132 38279 -3157 -9831 10987 7816 8875 -7405 -12495 17271 44482
$$ packed form
9070B7582J3961N632M277m3413K943M5982J0991N387k9914Q358q388m6515p657
9057a0774L7073j6075Q651r673J3541k534j2339j2697J39K7041p457j3119q349
9044f572k4117L5660L4392J0423O17j546j2459k0931k3758k2336L7084K7000j6576
9031A6881j9241J4428L749r336K9191J4007O217r622k5758j6593J4848r343m0567
9018c1139K6896K1056l6032q048M5295L6991j4011j1880Q952J4709L489r877k3357
9005B3044M3517P696K1546j5077n3468l5516j4096K1779K5934J4510o186r140
8993B4543J1151o888Q167p962j7211j7553L4615l3130l4446K2017J0467o799K2793
8980I764L6473J5717j2822j0853m1436o674K0818l171J059j6280n090K9766K7211
$$ plain form
8967 44482 36704 34940 36897 25832 30974 3398 15335 19542 2321 20170 7693 26025 57612
8954 57612 62692 51897 33052 48328 61024 61977 49664 43718 50182 25224 10968 4443 -11607
8941 -11607 -29160 -36186 -16515 10325 25025 15914 7645 -2534 -26868 -18813 -22413 -32224 -52314
8928 -52314 -12950 -22522 -44817 -30277 -9293 -5621 18665 26083 21026 29076 18317 -53047 -56642
8915 -56642 -13756 15872 21941 22649 -10847 -19465 1713 -22973 -41527 -43222 -19974 20443 20671
8902 20671 13650 7362 7579 9878 6084 7588 29677 36202 7859 8396 -3750 -21453 -829 14667
8888 14667 11250 8242 21753 19419 7269 17186 27249 54086 51408 23553 37410 48097 74003
8875 74003 78664 97231 82216 60327 25242 9875 -3198 7140 26644 27401 31735 52707 51891
$$ packed form
8967D4482p778j764J957j1065N142k7576J1937M207j7221J7849j2477J8332L1587
8954E7612N080j0795j8845J5276J2696R53j2313n946O464k4958j4256o525j6050
8941a1607j7553p026J9671K6840J4700r111q269j0179k4334Q055l600r811k0090
8928e2314L9364r572k2295J4540K0984L672K4286P418n057Q050j0759p1364l595
8915e6642M2886K9628O069P08l3496q618K1178k4686j8554j695K3248M0417K28
8902B0671p021o288K17K299l794J504K2089O525k8343N37j2146j7703K0624J5496
8888A4667l417l008J3511k334j2150R917J0063K6837k678k7855J3857J0687K5906
8875G4003M661J8567j5015k1889l5085j5367j3073J0338J9504P57M334K0972q16
$$ plain form
8862 51891 39108 47234 33953 28031 -29493 -36816 -18841 13941 66193 67793 34476 12418 -18359
8849 -18359 -14317 10847 30505 54644 56820 72394 58784 48091 40143 83322 77474 56648 44976
8836 44976 35172 50294 20991 7906 23368 30837 28451 43899 39679 32276 53358 25078 -691
8823 -691 -7555 -8639 1434 6625 665 14811 16958 21695 25287 25092 17761 -16916 -18498 2508
8809 2508 26675 39673 35683 25018 36357 78765 90871 75380 13765 6449 16029 32358 28277
8796 28277 17282 24732 3959 17162 36652 23103 9248 16432 25921 35516 71837 46578 39772
8783 39772 54630 79793 81612 94507 93787 71765 73294 48119 72118 55098 39241 62592 56275
8770 56275 38991 37872 121 23688 36609 -10897 7923 17336 41908 81205 105552 104039
$$ packed form
8862E1891j2783Q126j3281n922n7524p323J7975L2782N2252J600l3317k2058l0777
8849a8359M042K5164J9658K4139K176J5574j3610j0693p948M3179n848k0826j1672
8836D4976r804J5122k9303j3085J5462P469k386J5448m220p403K1082k8280k5769
8823f91o864j084J0073N191n960J4146K147M737L592j95p331l4677j582K1006
8809B508K4167J2998l990j0665J1339M2408J2106j5491o1615p316R580J6329m081
8796B8277j0995P450k0773J3203J9490j3549j3855P184R489R595L6321k5259o806
8783C9772J4858K5163J819J2895p20k2022J529k5175K3999j7020j5857K3351o317
8770E6275j7284j119l7751K3567J2921m7506J8820R413K4572L9297K4347j513
$$ plain form
8758 104039 70176 17588 17095 11471 8000 33322 45550 42942 89370 95292 78667 70608 70331
8745 70331 68956 80453 61944 60925 50629 57025 59384 45055 22288 14011 -21178 -2291 19430
8732 19430 28295 53873 51902 11254 -12847 10023 30826 27419 9075 10629 33223 19165 19704
8719 19704 26102 -3297 5219 32206 13407 10099 18891 28843 32184 22530 22800 -7543 -5036 -17056
8705 -17056 -7783 46623 67574 81602 91756 52695 28047 28576 50353 75386 59330 33260
8693 33260 25961 17354 30738 41530 -7432 -28880 3976 52815 56294 32701 40144 35896 42286
8680 42286 35034 20498 26459 12985 13893 -1905 6405 19556 34581 36239 28251 52002 73944
8667 73944 34537 -1412 -4937 23512 25726 50087 98551 80228 70005 69177 60365 71303 61886
$$ packed form
8758A04039l3863n2588m93n624l471K5322J2228k608M6428N922j6625q059k77
8745G0331j375J1497j8509j019j0296O396K359j4329k2767q277l5189J8887K1721
8732A9430Q865K5578j971m0648k4101K2870K0803l407j8344J554K2594j4058N39
8719A9704O398k9399Q516K6987j8799l308Q792R952L341r654K70l0343K507j2020
8705a7056R273N4406K0951J4028J0154l9061k4648N29K1777K5033j6056k6070
8693C3260p299q607J3384J0792m8962k1448L2856M8839L479k3593P443m248O390
8680D2286p252j4536N961j3474R08j5798Q310J3151J5025J658p988K3751K1942
8667G3944l9407l5949l525K8449K214K4361M8464j8323j0223q28q812J0938r417
$$ plain form
8654 61886 62612 59758 78164 78700 52903 53702 38442 35186 -2277 -17813 -23638 5288 23204 22795
8640 22795 -5954 -1494 37762 71141 64886 59786 43968 24508 3697 24296 35609 35554 76496
8627 76496 114411 92440 88864 65584 36281 8919 46700 75580 82133 51783 43968 39174 30089
8614 30089 35506 23383 15182 38728 60247 74412 73386 46127 80436 72158 37556 27046 22460
8601 22460 23589 22846 61132 79031 77459 45370 34325 63518 90086 104250 118901 80001 56559
8588 56559 43811 39252 71470 115724 117315 92212 50642 50886 66222 62538 46888 17477 -10260
8575 -10260 -6289 29658 26969 60341 83273 77834 79975 71116 55726 62600 60232 59829 42940 49375
8561 49375 60342 62132 55067 39041 57777 71149 60552 87273 127521 133838 118821 108407
$$ packed form
8654F1886P26k854J8406N36k5797P99j5260l256l7463j5536n825K8926J7916m09
8640B2795k8749M460L9256L3379o255n100j5818j9460k0811K0599J1313n5M0942
8627G6496L7915k1971l576k3280k9303k7362L7781K8880O553l0350p815m794r085
8614C0089N417j2123q201K3546K1519J4165j026k7259L4309q278l4602j0510m586
8601B2460J129p43L8286J7899j572l2089j1045K9193K6568J4164J4651l8900k3442
8588E6559j2748m559L2218M4254J591k5103m1570K44J5336l684j5650k9411k7737
8575a0260L971L5947k689L3372K2932n439K141q859j5390O874k368m03j6889O435
8561D9375J0967J790p065j6026J8736J3372j0597K6721M0248O317j5017j0414
$$ plain form
8549 108407 95438 85702 56388 49284 64677 71348 48504 48424 52037 42662 40928 1185 2070 42544
8535 42544 20810 9615 29574 48281 66717 55418 33122 28332 17234 -2151 22343 16248
8523 16248 -17350 -8027 23539 29109 9174 -17749 -11434 17677 29809 8779 -16624 -6103
8511 -6103 27883 35471 46125 14817 -8107 -34203 -27016 7881 30411 63519 74401 69225 100493
8498 100493 100281 90851 81808 59524 7276 -20757 -34841 10356 23441 -22813 -40679 -39026 -17774
8485 -17774 4402 14974 12716 -1425 -7344 5090 25446 40091 46073 25161 35515 44803 51769
8472 51769 47308 23710 13665 11283 67883 80996 80234 75674 101105 115275 114066 107856 110358
8459 110358 94700 98688 86915 47726 27061 29545 13292 -9656 27183 34071 35044 58995 66650
$$ packed form
8549A08407j2969r736k9314p104J5393O671k2844q0L613r375j734l9743Q85M0474
8535D2544k1734j1195J9959J8707J8436j1299k2296m790j1098j9385K4494o095
8523A6248l3598R323L1566N570j9935k6923O315K9111J2132k1030k5403J0521
8511f103L3986P588J0654l1308k2924k6096P187L4897K2530L3108J0882n176L1268
8498A00493k12r430r043k2284n2248k8033j4084M5197J3085m6254j7866J653K1252
8485a7774K2176J0572k258j4141n919J2434K0356J4645N982k0912J0354R288O966
8472E1769m461k3598j0045k382N6600J3113p62m560K5431J4170j209o210K502
8459A10358j5658L988j1773l9189k0665K484j6253k2948L6839O888R73K3951P655
$$ plain form
8446 66650 64100 73641 53241 17435 31737 49434 54816 61090 28570 -9869 -4634 4980 44655
8433 44655 77531 93242 69326 19276 27474 42673 55028 27953 -26620 -50183 -51067 -44179 -15863
8420 -15863 -17223 -9836 8484 -18312 -41163 -55842 -46296 -1685 -1543 -31373 -54404 -27139 -16607
8407 -16607 -11999 11876 16803 -9818 -9340 13067 36116 26396 16913 22869 32537 44637 41741 38502
8393 38502 54865 106861 134902 174749 167390 163380 162140 114668 46346 10271 4568 21702 19839
8380 19839 35101 27328 6694 11107 44885 36579 -8549 -18505 15435 34415 31341 15956 27840
8367 27840 76564 70653 7792 -15498 37018 42083 -10570 -16374 11022 60160 64088 21335 -3450
8354 -3450 -1573 11613 37243 44403 48438 59979 89895 136510 244027 337219 366484 301612
$$ packed form
8446F6650k550R541k0400l5806J4302J7697N382O274l2520l8439N235R614L9675
8433D4655L2876J5711k3916n0050Q198J5199J2355k7075n4573k3563q84O888K8316
8420a5863j360P387J8320k6796k2851j4679R546M4611J42k9830k3031K7265J0532
8407a6607M608K3875M927k6621M78K2407K3049r720r483N956R668J2100k896l239
8393C8502J6363N1996K8041L9847p359m010j240m7472o8322l6075n703J7134j863
8380A9839J5262p773k0634M413L3778q306m5128r956L3940J8980l074j5385J1884
8367B7840M8724n911o2861k3290N2516N065n2653n804K7396M9138L928m2753k4785
8354c450J877J3186K5630P160M035J1541K9916M6615J07517R3192K9265o4872
$$ plain form
8342 301612 222143 113232 46916 15810 27066 20197 16925 33145 41708 10045 7038 14149
8330 14149 -9278 -33491 -49805 -75404 -59189 -31349 -10440 -5034 31861 34990 18932 37046
8318 37046 44383 48561 62601 43513 9156 -3363 6571 15142 36613 31591 11560 6432 -21365
8305 -21365 -5445 34899 73395 99669 126822 159973 157814 145730 104862 54938 28733 43872
8293 43872 47926 63481 43090 -5972 4127 26834 39279 38893 41536 137666 229880 354073
8281 354073 564554 658734 602076 488379 355948 219591 139826 78279 39651 43621 20753
8270 20753 -3637 681 14745 10378 -32685 -36128 -30883 -23042 -20541 -22648 -33210 -16110 12935
8257 12935 -4402 404 16683 9254 24075 37422 15511 6115 28524 64034 48799 93380
$$ packed form
8342C01612p9469j08911o6316l1106J1256o869l272J6220Q563l1663l007P111
8330A4149k3427k4213j6314k5599J6215K7840K0909N406L6895L129j6058J8114
8318C7046P337M178J4040j9088l4357j2519R934Q571K1471n022k0031n128k7797
8305b1365J5920M0344L8496K6274K7153L3151k159j2084m0868m9924k6205J5139
8293D3872M054J5555k0391m9062J0099K2707J2445l86K643R6130R2214J24193
8281C54073K10481R4180n6658j13697j32431j36357p9765o1547l8628L970k2868
8270B0753k4390M318J4064m367m3063l443N245P841K501k107j0562J7100K9045
8257A2935j7337M806J6279p429J4821J3347k1911r396K2409L5510j5235M4581
$$ plain form
8245 93380 178801 297610 488985 681995 702790 591831 439187 279580 140803 66895
8235 66895 27445 43913 32239 19631 19565 3182 13987 26052 53364 67977 73715 59636 1007
8222 1007 -53582 -31677 403 13538 27622 14200 5674 2655 26017 19212 10997 -513 7159
8209 7159 31026 40740 42698 -13007 -17369 -4439 -21212 7195 12218 14150 -10574 -24717 -12439
8196 -12439 -24872 -13764 1094 37106 33775 26216 13990 -28703 -31890 -29749 -20753 -21541 -28182
8183 -28182 -28880 -15467 11978 7339 21306 1745 9135 32720 57081 41089 69282 85681 68364
8170 68364 46055 45816 8343 27304 9032 6641 375 19907 37790 -8296 -30593 -1678 9110
8157 9110 16378 22897 33904 48163 41065 64770 29472 9249 25465 69810 25778 -13870 768
$$ packed form
8245I3380Q5421J18809J91375J93010K0795j10959j52644j59607j38777p3908
8235F6895l9450J6468j1674j2608o6j6383J0805J2065K7312J4613N738j4079n8629
8222A007n4589K1905L2080J3135J4084j3422q526l019K3362o805q215j1510P672
8209G159K3867R714J958n5705m362J2930j6773K8407N023J932k4724j4143J2278
8196a2439j2433J1108J4858L6012l331p559j2226m2693l187K141Q996p88o641
8183b8182o98J3413K7445m639J3967j9561P390K3585K4361j5992K8193J6399j7317
8170F8364k2309k39l7473J8961j8272k391o266J9532J7883m6086k2297K8915J0788
8157I110P268O519J1007J4259p098K3705l5298k0223J6216M4345m4032l9648J4638
$$ plain form
8144 768 -656 -24656 -44163 -78033 -48746 -37910 -39412 -31721 -20784 -21008 -21420 755 -796 -29220
8130 -29220 -20069 6344 -15231 21766 63397 23311 -12458 -18224 -13532 -4261 -20469 5949 42153
8117 42153 52762 43915 28779 18094 -88 26146 22492 37226 58159 35641 41436 46130 18880
8104 18880 3015 4624 9926 17608 1656 -12661 -20042 4670 12827 29910 2303 -36238 -48329
8091 -48329 4836 40210 47424 51032 71649 21146 10521 36833 36551 36514 43149 57815 75029
8078 75029 80123 64175 23136 -12127 -33989 -18591 10652 -7977 -13661 -8535 -5661 308 -6388
8065 -6388 -9039 36998 53270 45187 25015 38133 74654 83155 84517 43552 45797 44647 54396
8052 54396 30067 49942 73253 84273 62547 8872 -4633 -11820 -4471 2730 -2746 15007 3707
$$ packed form
8144G68j424k4000j9507l3870K9287J0836j502P691J0937k24m12K2175j551k8424
8130b9220R151K6413k1575L6997M1631m0086l5769n766M692R271j6208K6418L6204
8117D2153J0609q847j5136j0685j8182K6234l654J4734K0933k2518N795M694k7250
8104A8880j5865J609N302P682j5952j4317p381K4712Q157J7083k7607l8541j2091
8091d8329N3165L5374P214L608K0617n0503j0625K6312k82l7O635J4666J7214
8078G5029N094j5948m1039l5263k1862J5398K9243j8629n684N126K874N969o696
8065f388k651M6037J6272q083k0172J3118L6521Q501J362m0965K245j150R749
8052E4396k4329J9875K3311J1020k1726n3675j3505p187P349P201n476J7753j1300
$$ plain form
8039 3707 -46208 -79437 -70069 -51299 -12198 13588 27101 37431 51143 53070 45872 53521 55499
8026 55499 70719 69236 36236 -5392 3042 6336 -6805 -14018 12638 44100 76191 61255 39089
8013 39089 34779 28051 66951 83236 67352 27276 15131 81788 109311 105367 125830 117665 88717
8000 88717 84132 79542 71917 56261 51849 27030 536 16718 52354 69473 49399 53940 92524
7987 92524 144582 157039 151592 144438 100869 93573 90115 105892 141986 111025 102642 99557 83030
7974 83030 58206 38528 76497 82688 41337 19361 -8752 49862 67105 38830 52457 63276
7962 63276 61154 70384 100190 113193 125128 117702 122992 129759 124122 96353 55692 73648 81777
7949 81777 67641 49716 61238 93751 96170 63842 52316 44075 26257 -2355 11619 37645
$$ packed form
8039C707m9915l3229R368J8770L9101K5786J3513J0330J3712J927p198P649J978
8026E5499J5220j483l3000m1628Q434L294j3141p213K6656L1462L2091j4936k2166
8013C9089m310o728L8900J6285j5884m0076j2145O6657K7523l944K0463q165k8948
8000H8717m585m590p625j5656m412k4819k6494J6182L5636J7119k0074M541L8584
7987I2524N2058J2457n447p154m3569p296l458J5777L6094l0961q383l085j6527
7974H3030k4824j9678L7969O191m1351k1976k8113N8614J7243k8275J3627J0819
7962F3276k122R230K9806J3003J1935p426N290O767n637k7769m0661J7956Q129
7949H1777j4136j7925J1522L2513K419l2328j1526q241j7818k8612J3974K6026
$$ plain form
7937 37645 72893 57884 85385 99562 68916 61546 62214 76124 70871 43802 29769 22167 -2078
7924 -2078 -7443 743 15427 21989 23635 39212 34151 16513 3321 -297 22695 23018 10252 22337
7910 22337 7940 -25953 -6067 24006 14888 25054 5813 2095 1050 15993 35871 23894
7898 23894 5145 15818 18574 931 -24524 -4605 68 -7109 8508 22971 10921 6613 -1915
7885 -1915 51224 57273 42221 35372 44050 40632 55197 33616 40128 35656 46056 47427 4116
7872 4116 -12880 -2324 -4140 -9566 13730 20025 -4526 -4635 -21657 -31421 -22762 15664 30559
7859 30559 19115 29692 12019 -39052 -45881 -51157 -57060 -58262 -67602 -68801 -59768 -50732 -33354
7846 -33354 -9766 807 25488 37093 29045 40137 35581 1630 -22915 -48260 -38673 1857
$$ packed form
7937C7645L5248j5009K7501J4177l0646p370O68J3910n253k7069j4033p602k4245
7924b078n365Q186J4684O562J646J5577n061j7638j3192l618K2992L23j2766J2085
7910B2337j4397l3893J9886L0073r118J0166j9241l718j045J4943J9878j1977
7898B3894j8749J0673K756j7643k5455J9919M673p177J5617J4463j2050m308q528
7885a915N3139O049j5052o849Q678l418J4565k1581O512m472J0400J371m3311
7872D116j6996J0556j816n426K3296O295k4551j09j7022r764Q659L8426J4895
7859C0559j1444J0577j7673n1071o829n276n903j202r340j199R033R036J7378
7846c3354K3588J0573K4681J1605q048J1092m556l3951k4545k5345R587M0530
$$ plain form
7834 1857 27009 91248 91512 66694 26916 43718 48110 49975 56428 62919 41678 30202 37930
7821 37930 30593 -14112 -43355 -27859 14073 19705 2539 12129 24240 21426 5304 34071 51199
7808 51199 52987 33416 37075 27443 386 7605 7464 7707 20561 881 -27198 -51440 -67313
7795 -67313 -75581 -58576 -45299 -22032 -23565 -7811 -4971 -21546 -24072 -47794 -39158 -17807 -18706
7782 -18706 -59116 -62098 -3796 24809 41911 49828 32413 25602 27603 4713 -2622 -6722 -8559
7769 -8559 16233 -8352 -23437 -2929 17598 12888 -6123 -10566 6208 25393 51585 74363
7757 74363 49776 12052 -18693 -7225 -29452 -10961 -2658 -4360 -20053 -44269 -52002 -44279 -26002
7744 -26002 -4674 15063 -3037 5045 12750 -13118 15308 8550 -20565 -26379 -27715 10293 47073
$$ packed form
7834A857K5152O4239K64k4818l9778J6802M392J865O453O491k1241j1476P728
7821C7930p337m4705k9243J5496M1932N632j7166R590J2111k814j6122K8767J7128
7808E1199J788j9571L659r632k7057P219j41K43J2854j9680k8079k4242j5873
7795f7313q268J7005J3277K3267j533J5754K840j6575k526k3722Q636K1351q99
7782a8706m0410k982N8302K8605J7102P917j7415o811K001k2890p335m100j837
7769h559K4792k4585j5085K0508K0527m710j9011m443J6774J9185K6192K2778
7757G4363k4587l7724l0745J1468k2227J8491Q303j702j5693k4216p733P723J8277
7744b6002K1328J9737j8100Q082P705k5868K8426o758k9115n814j336L8008L6780
$$ plain form
7731 47073 42852 21536 12686 10526 15831 22295 -6112 -16079 13292 -10120 -28950 -22010 -44182
7718 -44182 -74343 -60306 -45018 -40121 -18059 -12314 -8502 9577 69276 48421 22507 48375
7706 48375 55317 44306 9681 -31082 -44294 -24795 -29201 -60085 -57440 -7733 29477 51396
7694 51396 47744 40276 12587 -15760 -56641 -103109 -101680 -89850 -76749 -101930 -103905 -63175 -29912
7681 -29912 -13885 -23354 -36560 -7134 -2138 -6276 4008 18167 33215 40339 -2152 -25622 -34021
7668 -34021 -34940 -13488 13350 15316 19644 30035 1067 -14789 -28262 -21542 -5997 -323 -29840
7655 -29840 -38953 -16801 13380 25485 19749 32187 62463 68299 43144 29760 -3872 -31662
7643 -31662 -33109 18831 40496 26704 9948 3472 2600 4063 4047 -851 8467 -23573 -7481 44136
$$ packed form
7731D7073m221k1316q850k160N305O464k8407r967K9371k3412j8830O940k2172
7718d4182l0161J4037J5288M897K2062N745L812J8079N9699k0855k5914K5868
7706D8375O942j1011l4625m0763j3212J9499m406l0884K645M9707L7210K1919
7694E1396l652p468k7689k8347m0881m6468J429J1830J3101k5181j975M0730L3263
7681b9912J6027r469j3206K9426M996m138J0284J4159J5048P124m2491k3470q399
7668c4021r19K1452K6838J966M328J0391k8968j5856j3473O720J5545N674k9517
7655b9840r113K2152L0181J2105n736J2438L0276N836k5155j3384l3632k7790
7643c1662j447N1940K1665j3792j6756o476q72J463j6m898R318l2040J6092N1617
$$ plain form
7629 44136 60564 53645 27205 22834 24434 -11409 -47169 -22842 -2537 7889 -13116 -23697
7617 -23697 -35066 -56676 -71660 -70244 -42164 -14700 -13125 -10301 1548 -33797 -63226 -43935
7605 -43935 -37080 -22732 -17642 -22006 -30345 -23670 -50680 -88251 -77380 -25356 16031 2902 -2812
7592 -2812 3516 8893 13133 11024 -4784 -1721 7032 -19147 -11692 -51159 -91155 -120244 -93165
7579 -93165 -67985 -34892 -40693 -38585 -18434 -55037 -30945 -2038 -15199 -2897 24763 32068
7567 32068 57323 42418 8976 -19739 -20815 -36391 -12549 21056 43935 17978 -8320 -44134
7555 -44134 -70064 -55418 -69195 -72492 -76184 -71297 -51186 -44575 -13078 -18090 -34754 -33069 -35377
7542 -35377 -81600 -91447 -110275 -98259 -27233 11168 -3622 1114 10913 10579 11549 20369 21786 4876
$$ packed form
7629D4136J6428o919k6440m371J600l5843l5760K4327K0305J0426k1005j0581
7617b3697j1369k1610j4984J416K8080K7464J575K824J1849l5345k9429J9291
7605d3935O855J4348N090m364q339O675k7010l7571J0871N2024M1387j3129n714
7592b812O328N377M240k109j5808L063Q753k6179P455l9467l9996k9089K7079
7579i3165K5180L3093n801K108K0151l6603K4092K8907j3161J2302K7660P305
7567C2068K5255j4905l3442k8715j076j5576K3842L3605K2879k5957k6298l5814
7555d4134k5930J4646j3777l297l692M887K0111O611L1497n012j6664J685k308
7542c5377m6223r847j8828J2016P1026L8401j4790M736R799l34R70Q820J417j6910
$$ plain form
7528 4876 10338 24750 -693 -15104 6864 8942 11588 -7575 -46766 -28124 5395 -5770 -12823
7515 -12823 -850 8324 21248 16242 19329 29046 -3999 -11115 13444 23415 34929 64389 75049
7502 75049 16199 -46491 -38758 -20090 17369 29395 23731 -24474 -17715 1169 -14376 -27625
7490 -27625 -41669 -63955 -70717 -30003 -3970 -17648 -10029 -11507 -7013 -37904 -25129 -5724 -17906
7477 -17906 -31248 -41787 -33665 -35283 -41863 -27153 -46513 -46165 -38417 -29158 -9361 26826 46780
7464 46780 40604 36582 52932 30459 -12272 -22863 -28579 -35182 -38294 -17413 -1555 -6868 -53152
7451 -53152 -78894 -74876 -46313 -34728 -8683 -18079 -17352 -387 -16388 -24791 -19758 -16126 -15882 -23193
7437 -23193 -38234 -20804 -16404 3592 3888 15124 16784 56394 56449 31555 45595 43294 39207 47843
$$ packed form
7528D876N462J4412k5443j4411K1968K078K646j9163l9191J8642L3519j1165p053
7515a2823J1973R174J2924n006L087R717l3045p116K4559R971J1514K9460J0660
7502G5049n8850o2690P733J8668L7459J2026n664m8205O759J8884j5545j3249
7490b7625j4044k2286o762M0714K6033j3678P619j478M494l0891J2775J9405j2182
7477a7906j3342j0539Q122j618o580J4710j9360L48P748R259J9797L6187J9954
7464D6780o176m022J6350k2473m2731j0591n716o603l112K0881J5858n313m6284
7451e3152k5742M018K8563J1585K6045r396P27J6965j6001q403N033L632K44p311
7437b3193j5041J7430M400J9996K96J1236J660L9610N5k4894J4040k301m087Q636
$$ plain form
7423 47843 -17461 -64760 -77383 -48792 -51222 -37071 -19052 10589 7541 -4796 -4127 28 9858
7410 9858 -6409 -9491 -25277 -27726 -5964 21242 50026 14439 -23512 -29868 -20401 -17684 -14476
7397 -14476 -17358 -5559 15294 -6669 -20431 -39486 -47467 -43839 -29580 -15374 -25045 34120 55486
7384 55486 32429 -10904 -14163 9659 -4641 4141 10017 13956 897 8160 -3243 -11911 -2157
7371 -2157 -16777 -40127 -30716 11271 29824 29787 4019 5373 31209 29929 21426 50168 53474 81788
7357 81788 50201 -15324 -22004 4001 -6454 -20784 -13707 -32248 -52754 -49098 -35134 -49240
7345 -49240 -76639 -60357 -20504 -27007 -56904 -64222 -50368 -38527 -34585 -57524 -64568 -55004 -43961
7332 -43961 -43197 -21062 -15662 -19001 25148 3649 -15195 -5407 3167 -6892 -37395 -50504 -34921
$$ packed form
7423D7843o5304m7299j2623K8591k430J4151J8019K9641l048j2337O69M155R830
7410I858j6267l082j5786k449K1762K7206K8784l5587l7951o356R467K717L208
7397a4476k882J1799K0853k1963j3762j9055p981L628J4259J4206r671N9165K1366
7384E5486k3057m3333l259K3822j4300Q782N876L939j3059P263j1403q668R754
7371b157j4620k3350R411M1987J8553l7k5768J354K5836j280q503K8742L306K8314
7357H1788l1587o5525o680K6005j0455j4330P077j8541k0506L656J3964j4106
7345d9240k7399J6282L9853o503k9897p318J3854J1841L942k2939p044R564J1043
7332d3961P64K2135N400l339M4149k1499j8844R788Q574j0059l0503j3109J5583
$$ plain form
7319 -34921 -22649 -28645 12723 11839 14141 29400 32469 30924 45649 23824 8591 24791 16345
7306 16345 -22933 -37532 -43822 -32262 8400 3394 -41854 -66806 -57150 -60476 -51124 -57426 -57311
7293 -57311 -25168 -17440 -6236 -5317 36837 55741 10711 -38284 -53164 -40483 -27297 -36261 -36590
7280 -36590 -28144 -10668 -17269 9337 17724 20588 -37111 -38552 -3046 16377 23938 19583 -14453
7267 -14453 -46183 -32914 -19511 -26915 -58679 -49908 -24258 -35223 -32938 -34983 -53678 -23560 26667
7254 26667 53519 54681 46992 32770 16982 -1104 -21618 -18247 -8317 -20292 11324 34677 51708
7241 51708 41591 30531 13232 34765 24502 22154 42073 63401 47215 26516 -5603 5527
7229 5527 28890 20940 12460 25628 12914 24600 62362 49968 -10427 -19633 -2125 8457 6446
$$ packed form
7319c4921J2272n996M1368q84K302J5259L069j545J4725k1825j5233J6200q446
7306A6345l9278j4599o290J1560M0662n006m5248k4952R656l326R352o302J15
7293e7311L2143P728J1204R19M2154J8904m5030m8995j4880J2681J3186q964l29
7280c6590Q446J7476o601K6606Q387K864n7699j441L5506J9423P561m355l4036
7267a4453l1730J3269J3403p404l1764Q771K5650j0965K285k045j8695L0118N0227
7254B6667K6852J162p689j4222j5788j8086k0514L371R930j1975L1616K3353J7031
7241E1708j0117j1060j7299K1533j0263k348J9919K1328j6186k0699l2119J1130
7229E527K3363p950q480J3168j2714J1686L7762j2394o0395r206J7508J0582k011
$$ plain form
7216 6446 -20103 -9430 -17720 -18996 -4419 4681 21682 41802 57550 57880 62337 61145 32859
7203 32859 -6369 -62142 -61190 -29794 -27779 -51436 -48386 -50419 -38678 -26395 -13371 12776 -3688
7190 -3688 -36654 -50959 -52744 -4565 13558 29409 22507 4618 655 10686 -14320 -32135 -14223
7177 -14223 -34966 -56644 -56951 -23684 -19939 -39922 -3703 -6808 -36339 -21312 17712 32581 15641
7164 15641 -50298 -46235 -14803 14253 11676 -6837 6388 8506 -9212 14291 19582 18158 25504
7151 25504 -4977 -17703 -18511 -1746 -6706 -31887 -6869 -15427 -18578 -33995 -26211 -14689 -20059
7138 -20059 -48414 -52741 -49371 -32324 -5678 4141 -22093 -59658 -79504 -89800 -59240 -15780
7126 -15780 -13084 -11859 22768 -14690 -34727 -43137 -33683 -36681 -42328 -26707 -9647 -34539 -49936
$$ packed form
7216F446k6549J0673q290j276J4577R100J7001K0120J5748L30M457j192k8286
7203C2859l9228n5773R52L1396K015k3657L050k033J1741J2283J3024K6147j6464
7190c688l2966j4305j785M8179J8123J5851o902j7889l963J0031k5006j7815J7912
7177a4223k0743k1678l07L3267L745j9983L6219l105k9531J5027L9024J4869j6940
7164A5641o5939M063L1432K9056k577j8513J3225K118j7718K3503N291j424P346
7151B5504l0481j2726q08J6765m960k5181K5018q558l151j5417P784J1522n370
7138b0059k8355m327L370J7047K6646R819k6234l7565j9846j0296L0560M3460
7126a5780K696J225L4627l7458k0037q410R454k998n647J5621J7060k4892j5397
$$ plain form
7113 -49936 -50338 -63798 -40288 -7984 -8084 -27802 -31161 -10280 -2694 -34066 -46677 -28193 7231
7100 7231 9029 16051 12719 7343 25492 39194 29343 17370 22387 9733 -657 -2769 -35228
7087 -35228 -45073 -18296 -14571 -1569 20925 22765 44898 57566 29162 -15025 -13296 -39287 -46694
7074 -46694 -3201 30598 8722 -17815 -12230 23260 43344 39032 10730 -15761 -30335 -25236
7062 -25236 829 -3969 7576 -15803 -474 -11908 -2827 32460 8256 8813 22179 356 6696
7049 6696 1441 4366 -444 -42605 -41389 -5146 23247 61626 33632 1642 987 -759 -29467
7036 -29467 -27348 -25856 -40664 -25201 1793 18910 5666 1161 -6070 -24665 -14027 -15345 -36151
7023 -36151 -18616 -33286 -52427 -47968 -68043 -42023 -51447 -92582 -98853 -76029 -49073 -23893
$$ packed form
7113d9936m02j3460K3510L2304j00j9718l359K0881P586l1372j2611J8484L5424
7100G231J798P022l332n376J8149J3702r851j1973N017j2654j0390k112l2459
7087c5228r845K6777L725J3002K2494J840K2133J2668k8404m4187J729k5991p407
7074d6694M3493L3799k1876k6537N585L5490K0084m312k8302k6491j4574N099
7062b5236K6065m798J1545k3379J5329j1434R081L5287k4204N57J3366k1823O340
7049F696n255K925m810m2161J216L6243K8393L8379k7994l1990o55j746k8708
7036b9467K119J492j4808J5463K6994J7117j3244m505p231j8595J0638j318k0806
7023c6151J7535j4670j9141M459k0075K6020r424m1135o271K2824K6956K5180
$$ plain form
7011 -23893 14496 -3706 -1013 -5988 -1467 21811 45109 8858 -12629 -20846 -40095 -47423 -30606
6998 -30606 -35883 -56421 -48071 -48170 -34548 -21493 6881 26444 -8830 -25637 -18315 -34520 -26504
6985 -26504 -37938 -59576 -56826 -19359 4617 18204 33127 44673 55651 20598 -13953 -15709
6973 -15709 -18590 -2423 19811 -10049 -24429 -10754 7512 29977 46284 30639 12239 -670
6961 -670 11061 32027 26614 12998 12732 13635 30685 31528 12318 1590 -20446 -30412 -38858 -37521
6947 -37521 -13560 21148 8497 7845 -1689 13178 21263 24331 -8516 -28872 -49330 -41687 -26450
6934 -26450 -17733 12083 11709 18295 9454 -14175 -16570 164 10625 -20788 -33712 -33989 -30873 -35960
6920 -35960 -35219 -21283 7349 10972 -3296 -12417 -14972 -19494 -29046 -16466 -19829 -5334 37601
$$ packed form
7011b3893L8389j8202K693m975M521K3278K3298l6251k1487q217j9249p328J6817
6998c0606n277k0538Q350r9J3622J3055K8374J9563l5274j6807P322j6205Q016
6985b6504j1434k1638K750L7467K3976J3587J4923J1546J0978l5053l4551j756
6973a5709k881J6167K2234k9860j4380J3675J8266K2465J6307j5645j8400j2909
6961f70J1731K0966n413j3616k66R03J7050Q43j9210j0728k2036r966q446J337
6947c7521K3961L4708j2651o52r534J4867Q085L068l2847k0356k0458P643J5237
6934b6450Q717K9816l74O586q841k3629k395J6734J0461l1413j2924k77L116n087
6920c5960P41J3936K8632L623j4268r121k555m522r552J2580l363J4495M2935
$$ plain form
6907 37601 13728 -23300 -15321 4724 3904 -4413 -10356 -42731 -50601 -5342 37718 -11853 -42055
6894 -42055 -27518 -26899 -49757 -30251 1088 44845 59345 66749 38128 35068 12751 -6802 -9784
6881 -9784 -5116 -33271 -58612 -51839 -40155 -35526 -24904 -5104 28558 9236 1902 -267 2702
6868 2702 -37890 -51551 -57394 -27996 -24922 -3330 5101 2990 12922 -17185 27042 38441 45410
6855 45410 12470 14697 24805 20850 361 -10851 -18769 3276 7576 -18527 -36522 1927 -6160
6842 -6160 -26153 -57485 -52555 -33263 -11892 19432 762 -4852 -22208 -26863 -367 -22546 -29940
6829 -29940 -11547 -11391 -20399 -1643 -8221 16013 13275 15659 29243 48843 72992 58061 38024
6816 38024 26876 -52 9727 19602 20751 -1705 -24635 -24704 -31002 -45726 -33652 -45970 -48605
$$ packed form
6907C7601k3873l7028P979K0045q20q317n943l2375p870M5259M3060m9571l0202
6894d2055J4537O19k2858J9506L1339M3757J4500P404k8621l060k2317j9553k982
6881i784M668k8155k5341O773J1684M629J0622J9800L3662j9322p334k169K969
6868B702m0592j3661n843K9398L074K1592Q431k111R932l0107M4227J1399O969
6855D5410l2940K227J0108l955k0489j1212p918K2045M300k6103j7995L8449q087
6842f160j9993l1332M930J9292K1371L1324j8670n614j7356m655K6496k2179p394
6829b9940J8393J56r008J8756o578K4234k738K384J3584J9600K4149j4931k0037
6816C8024j1148k6928R779R875J149k2456k2930o9o298j4724J2074j2318k635
$$ plain form
6803 -48605 -48133 -40962 -26793 -18681 -13700 -54139 -66806 -28346 15148 8909 -6583 -11319 -26980
6790 -26980 -12950 -12930 13369 46507 40998 15041 7800 19031 31335 36969 51513 59302 24831
6777 24831 1224 -27379 -37382 -24359 10930 7127 9177 11208 3654 -9465 10010 12490 -6521
6764 -6521 -43228 -45322 -64506 -54567 -695 -2094 1617 -12084 3555 44394 84981 66254 15556
6751 15556 13097 42699 59374 52471 41465 15750 3478 7488 -15433 -30099 -27162 -35117 -36219
6738 -36219 -28558 -38037 -69945 -65836 -70568 -52218 -28951 -20898 -6625 -9771 -25876 -34387 -12983
6725 -12983 -20132 -38252 -10862 17616 21422 18630 7160 -23050 -58724 -70053 -52599 -42037
6713 -42037 -12047 913 -19894 -19856 -20945 -94464 -110230 -80784 -57188 -54771 -38082 -13333 5795
$$ packed form
6803d8605M72P171J4169Q112M981m0439j2667L8460M3494o239j5492m736j5661
6790b6980J4030K0K6299L3138n509k5957p241J1231J2304N634J4544P789l4471
6777B4831k3607k8603j0003J3023L5289l803K050K031p554j3119J9475K480j9011
6764f521l6707k094j9184R939N3872j399L711j3701J5639M0839M0587j8727n0698
6751A5556k459K9602J6675o903j1006k5715j2272M010k2921j4666K937p955j102
6738c6219P661r479l1908M109m732J8350K3267Q053J4273l146j6105q511K1404
6725a2983p149j8120K7390K8478L806k792j1470l0210l5674j1329J7454J0562
6713d2037K9990J2960k0807L8j089p3519j5766K9446K3596K417J6689K4749J9128
$$ plain form
6700 5795 4062 -14388 3683 -20807 -52897 -49655 -18024 14568 23743 25107 33546 8034 -15236
6687 -15236 -44793 -46721 -39023 -28627 -14731 -14202 -25675 -30887 -6229 8272 -7054 11810 29475
6674 29475 26725 40681 6603 -2321 -11092 20875 7685 -16824 -8913 -18661 0 18116 31535
6661 31535 30234 30025 14872 20969 10810 -4507 -7265 1181 35836 47096 38095 25696 -25522
6648 -25522 -29649 -45951 -41687 -13014 2272 1714 16693 -7911 -5150 55659 51420 15063 -582
6635 -582 208 2508 -24279 -32952 7712 12341 34835 4489 -23779 -6674 4429 4587 -29112 -29943
6621 -29943 -40481 -17857 -19177 -30426 -16047 -17585 -30356 -50494 -56211 -44716 -9028 3042
6609 3042 7315 -3466 -20727 -47839 -51212 -13143 -19956 -52005 -61818 -56266 -37134 -41409 -24460
$$ packed form
6700E795j733j8450J8071k4490l2090L242L1631L2592R175J364Q439k5512k3270
6687a5236k9557j928P698J0396J3896N29j1473n212K4658J4501j5326J8864J7665
6674B9475k750J3956l4078q924q771L1967j3190k4509P911r748J8661J8116J3419
6661C1535j301k09j5153O097j0159j5317k758Q446L4655J1260r001j2399n1218
6648b5522m127j6302M264K8673J5286n58J4979k4604K761O0809m239l6357j5645
6635e82P90K300k6787q673M0664M629K2494l0346k8268J7105J1103J58l3699q31
6621b9943j0538K2624j320j1249J4379j538j2771k0138n717J1495L5688J2070
6609C042M273j0781j7261k7112l373L8069o813l2049r813N552J9132m275J6949
$$ plain form
6596 -24460 -13457 13303 20513 4051 3095 3248 7984 4460 567 5876 22341 47129 59257 27209
6582 27209 339 -8835 -44956 -17535 8245 -33541 -9368 809 -19874 -14160 -14984 -16885 -17729
6569 -17729 -13785 -27943 -40824 -3115 50465 45442 1503 -9390 -24328 1523 37126 12564
6557 12564 -3156 -7672 18240 -440 18019 31663 8549 -8240 12594 -5763 -4069 -12966
6545 -12966 -32300 -29770 -44144 -48234 -29968 -23622 -7176 35026 54543 54851 12450 -8444 -1449
6532 -1449 -21938 -31364 -45912 -65789 -74972 -64873 -49483 -27150 7891 12026 -12163 -135 6517
6519 6517 -16774 -1924 8396 -6410 -14066 -22919 -44361 -4532 27523 23294 534 -12300 -6699
6506 -6699 -14457 -16543 -30689 -32121 -14002 -38738 -36153 -53095 -71669 -65025 -36870 33827 35052
$$ packed form
6596b4460J1003K6760P210j6462r56J53M736l524l893N309J6465K4788J2128l2048
6582B7209k6870r174l6121K7421K5780m1786K4173J0177k0683N714q24j901q44
6569a7729L944j4158j2881L7709N3580n023m3939j0893j4938K5851L5603k4562
6557A2564j5720m516K5912j8680J8459J3644k3114j6789K0834j8357J694q897
6545a2966j9334K530j4374m090J8266O346J6446M2202J9517L08m2401k0894O995
6532a449k0489r426j4548j9877r183J0099J5390K2333L5041M135k4189J2028O652
6519F517k3291J4850J0320j4806p656q853k1442L9829L2055m229k2760j2834N601
6506f699p758k086j4146j432J8119k4736K585j6942j8574O644K8155P0697J225
$$ plain form
6493 35052 22887 26502 54175 48541 31080 26167 43928 43235 15960 -2919 -8 10510 -18397
6480 -18397 2441 5146 -17803 -16295 12071 1203 -2523 12656 -4077 -10741 -20782 -6696 -25842
6467 -25842 -55743 -46480 -6303 14925 18043 -10950 -577 27877 20959 13755 4106 -22133 -25695
6454 -25695 -33988 -11438 -4755 -954 8272 -23666 -37673 -16369 13333 15547 23582 30209 30972 22146
6440 22146 23316 -29850 -57589 -11277 26939 17273 29236 34055 36054 62077 60995 50331 48863
6427 48863 49104 22236 -16569 -54035 -45510 -28538 -6309 23589 32705 21871 -12567 -11236 -4458
6414 -4458 2275 -12411 -3769 3490 21395 -2917 -46044 -50862 -34972 -45596 -63129 -10732 9660
6401 9660 -15892 -20870 -28882 -10350 -1594 11726 -15465 -8057 -8031 -20543 -31182 -36240 -42149 -40630
$$ packed form
6493C5052j2165L615K7673n634j7461m913J7761o93k7275j8879K911J0518k8907
6480a8397K0838K705k2949J508K8366j0868l726J5179j6733o664j0041J4086j9146
6467b5842k9901R263M0177K1228L118k8993J0373K8454o918p204r649k6239l562
6454b5695q293K2550O683L801R226l1938j4007K1304K9702K214Q035O627P63q826
6440B2146J170n3166k7739M6312L8216r666J1963M819J999K6023j082j0664j468
6427D8863K41k6868l8805l7466Q525J6972K2229K9898R116j0834l4438J331O778
6414d458O733j4686Q642P259J7905k4312m3127m818J5890j0624j7533N2397K0392
6401I660k5552m978q012J8532Q756J3320k7191P408K6j2512j0639n058n909J519
$$ plain form
6387 -40630 -39400 -41707 -33069 -25899 -2509 -4326 -17762 -17611 -19863 -588 22567 9098 -21054
6374 -21054 -21976 -43154 -31565 -11149 -20813 -49417 -61333 -40454 -10581 -15341 4821 -26146 -82603
6361 -82603 -64525 -45503 -30382 4088 1138 -28837 -17903 -38560 -56684 -61755 -59995 -33809
6349 -33809 -38681 -32869 -28475 -46547 -49343 -35878 -22804 -21234 -8184 -7500 -8484 -9523 -15369 -42251
6335 -42251 -30623 -13359 -18098 -6404 -10564 -15356 -7108 -5506 21929 17630 -22883 -45876 -43975
6322 -43975 -25755 -7194 -22090 -23540 -31756 -35065 -17783 -30942 -56646 -32245 -8857 -19425
6310 -19425 -42280 -50963 -45625 -47150 -66670 -74319 -48232 -24934 -29790 -3812 13210 -10608 -46656
6297 -46656 -52169 10732 36068 41781 14821 -7325 -13536 -9167 1915 -27334 -55884 -56363 -2429
$$ packed form
6387d0630J230k307Q638P170K3390j817j3436J51k252J9275K3155j3469l0152
6374b1054r22k1178J1589K0416r664k8604j1916K0879K9873m760K0162l0967n6457
6361h2603J8078J9022J5121L4470k950k9975J0934k0657j8124n071J760K6186
6349c3809m872N812M394j8072k796J3465J3074J570J3050O84r84j039n846k6882
6335d2251J1628J7264m739J1694m160m792Q248J602K7435m299m0513k2993J901
6322d3975J8220J8561j4896j450q216l309J7282j3159k5704K4401K3388j0568
6310a9425k2855q683N338j525j9520p649K6087K3298m856K5978J7022k3818l6048
6297d6656n513O2901K5336N713k6960k2146o211M369J1082k9249k8550m79N3934
$$ plain form
6284 -2429 -4935 -28921 -79283 -107268 -79898 -6907 -22086 -44455 -18333 -15337 23508 31471 -6228
6271 -6228 -23424 -11984 14640 -9705 -28623 -27086 -213 -3353 -13656 -44887 -50562 -25781 -10418
6258 -10418 -4501 9864 17360 19812 -5085 -28434 -7622 14645 15667 14254 -1531 -42431 -32775
6245 -32775 -25808 -31464 -27902 -12353 -13355 -25609 -19021 17879 37330 19336 -1738 -6656 394
6232 394 9270 18752 -12442 -36169 -24735 15050 2345 -15080 -40200 -34441 -16514 -15624 -3960
6219 -3960 -1103 -12083 -17318 -36789 -24784 -7706 -9666 -24600 -40393 -29629 3008 17441 -5473
6206 -5473 -33308 -58874 -51794 -50704 -46662 -61386 -48007 -21304 -7660 1484 10300 -16275 -22140
6193 -22140 -22948 1140 5345 -5417 -35759 -20326 6379 -14952 -7418 -11403 -42999 -55503 -6480
$$ packed form
6284b429k506k3986n0362k7985K7370P2991j5179k2369K6122K996L8845P963l7699
6271f228j7196J1440K6624k4345j8918J537K6873l140j0303l1231n675K4781J5363
6258a0418N917J4365P496K452k4897k3349K0812K2267J022j413j5785m0900R656
6245c2775O967n656L562J5549j002j2254O588L6900J9451j7994k1074m918P050
6232C94Q876R482l1194k3727J1434L9785j2705j7425k5120N759J7927Q90J1664
6219c960K857j0980n235j9471J2005J7078j960j4934j5793J0764L2637J4433k2914
6206e473k7835k5566P080J090M042j4724J3379K6703J3644R144Q816k6575n865
6193b2140q08K4088M205j0762l0342J5433K6705k1331P534l985l1596j2504M9023
$$ plain form
6180 -6480 32089 22642 39754 23523 16634 -1068 -25324 -18374 -42293 -22166 -37224 -53607 -25286
6167 -25286 10006 2510 -28131 -5265 31995 42848 -8935 -22126 -38049 -5715 -3327 -3176 -8182
6154 -8182 -21767 -24759 -9703 33448 66416 43607 23242 30268 35879 42570 14471 -47030 -38454
6141 -38454 -32110 -33228 -16686 -19984 -21110 -36596 -31621 -26474 -394 18349 -1571 -42007 -71955
6128 -71955 -54527 -56256 -52019 -56486 -49776 -32622 -26508 -13773 8274 -27744 -72382 -79798 -73684
6115 -73684 -55308 -57136 -24239 5802 -22980 -50923 -6364 14796 46042 50425 3573 -26853
6103 -26853 -1763 -12516 -5012 -3277 -8694 999 21969 29362 43928 45675 19672 6334 22847
6090 22847 6950 13349 -3904 -4929 -24562 -17448 -32218 -42905 -36546 -29212 -36064 -31806 -17084
$$ packed form
6180f480L8569r447J7112j6231o889j7702k4256O950k3919K0127j5058j6383K8321
6167b5286L5292p496l0641K2866L7260J0853n1783j3191j5923L2334K388J51n006
6154h182j3585k992J5056M3151L2968k2809k0365P026N611O691k8099o1501Q576
6141c8454O344j118J6542l298j126j5486M975N147K6080J8743j9920m0436k9948
6128g1955J7428j729M237m467O710J7154O114J2735K2047l6018m4638p416O114
6115g3684J8376j828L2897L0041k8782k7943M4559K1160L1246M383m6852l0426
6103b6853K5090j0753P504J735n417R693K0970P393J4566J747k6003j3338J6513
6090B2847j5897O399j7253j025j9633P114j4770j0687O359P334o852M258J4722
$$ plain form
6077 -17084 -445 8282 6241 -12337 1353 -15192 -46614 -55807 -50418 -28948 -36934 -44186 -46406
6064 -46406 -34005 -29829 -49232 -50134 -68444 -77599 -27495 -11674 -58463 -39433 -20165 8400 -5639
6051 -5639 -41923 -40971 -52591 -67685 -98784 -86033 -56139 -43439 -37503 -24757 -41197 -69187 -41742
6038 -41742 -8320 -13030 -27104 -54058 -31421 -27532 -21698 -46931 -118132 -123318 -61481 -46594 -41341
6025 -41341 -24833 -1602 4900 13205 1992 -12234 -4105 1616 10107 -7329 -49949 -57866 -63130
6012 -63130 -55684 -37967 -19592 44 13499 1020 -26 -28226 -43021 -49372 -88398 -97033 -38742
5999 -38742 -735 4399 8380 -33901 -41605 -15317 -1960 -50943 -81481 -24412 18563 -4076
5987 -4076 -34109 -37792 -46253 -28853 -25491 -13682 -16040 -19969 -20076 -22801 -9752 3108 1363 26835
$$ packed form
6077a7084J6639Q727k041j8578J3690j6545l1422r193N389K1470p986p252k220
6064d6406J2401M176j9403r02j8310r155N0104J5821m6789J9030J9268K8565j4039
6051e639l6284R52j1620j5094l1099J2751K9894J2700N936J2746j6440k7990K7445
6038d1742L3422m710j4074k6954K2637L889N834k5233p1201n186O1837J4887N253
6025d1341J6508K3231O502Q305j1213j4226Q129N721Q491j7436m2620p917n264
6012f3130P446J7717J8375J9636J3455j2479j046k8200j4795o351l9026q635N8291
5999c8742L8007N134L981m2281p704K6288J3357m8983l0538N7069M2975k2639
5987d076l0033l683q461J7400L362J1809k358l929j07k725J3049J2860j745K5472
$$ plain form
5973 26835 27378 9876 -3164 -5562 -2027 -11182 -8624 -26217 -67542 -25184 32747 2396 8173
5960 8173 -24500 -11403 12311 6214 526 14058 74076 54971 33621 23408 -1826 5865 10142
5947 10142 2695 16772 42250 62860 23181 24355 25386 -6631 10514 24251 33927 16032 -11987
5934 -11987 -25865 -34199 -31597 -53848 -62590 -63272 -44687 -39412 -30499 -10854 17482 -13361 -41687
5921 -41687 -26102 -15527 9685 -41685 -37267 -20522 537 41643 39470 4769 -22922 -40481
5909 -40481 -9296 11907 37171 41797 25125 13089 11052 45851 82393 53724 35745 22361
5897 22361 15580 -25234 -54487 -65125 -65058 -44572 -47406 -34144 -23880 -53643 -78231 -79780 -52342
5884 -52342 -32862 -19050 -43253 -17018 -12426 -28784 -41829 -53202 7490 12857 25225 8392
$$ packed form
5973B6835N43j7502j3040k398L535r155K558j7593m1325M2358N7931l0351N777
5960H173l2673J3097K3714o097n688J3532O0018j9105k1350j0213k5234P691M277
5947A0142p447J4077K5478K0610l9679J174J031l2017J7145J3737R676j7895k8019
5934a1987j3878q334K602k2251q742o82J8585N275Q913J9645K8336l0843k8326
5921d1687J5585J0575K5212n1370M418J6745K1059M1106k173l4701k7691j7559
5909d0481L1185K1203K5264M626j6672j2036k037L4799L6542k8669j7979j3384
5897B2361o781m0814k9253j0638O7K0486k834J3262J0264k9763k4588j549K7438
5884e2342J9480J3812k4203K6235M592j6358j3045j1373O0692N367J2368j6833
$$ plain form
5872 8392 -2524 -15064 -40808 -42703 -8441 -12335 -385 4474 3241 15268 -8409 -3068 -15922
5859 -15922 -58950 -66696 -32196 -14248 -41490 -78842 -64745 -44448 -15784 3123 -13405 -43083
5847 -43083 -62474 -61347 -41007 -32388 -15424 -2618 18701 -10055 -46935 -43681 -34387 -53659 -58356
5834 -58356 -80084 -76405 -44920 -58272 -76386 -53591 -30276 -18622 -23553 -39572 -20681 -65571
5822 -65571 -74528 -50858 -61024 -76425 -105701 -73138 -24310 384 24936 20066 -32976 -81986
5810 -81986 -45524 -10384 19907 19358 -2855 2383 -496 -451 21485 25262 1996 7224 28327 39119
5796 39119 6942 12379 8891 23391 30397 6781 1316 -29534 -18917 6092 22022 31187 53251
5783 53251 46557 817 -1243 39348 -5272 -24210 -19719 -32761 -43010 -24942 -10937 2175
$$ packed form
5872H392j0916j2540k5744j895L4262l894J1950M859j233J2027k3677N341j2854
5859a5922m3028p746L4500J7948k7242l7352J4097K0297K8664J8907j6528k9678
5847d3083j9391J127K0340Q619J6964J2806K1319k8756l6880L254R294j9272m697
5834e8356k1728L679L1485j3352j8114K2795K3315J1654m931j6019J8891m4890
5822f5571q957K3670j0166j5401k9276L2563M8828K4694K4552m870n3042m9010
5810h1986L6462L5140L0291n49k2213N238k879M5K1936L777k3266N228K1103J0792
5796C9119l2177N437l488J4500P006k3616n465l0850J0617K5009J5930R165K2064
5783E3251o694m5740k060M0591m4620j8938M491j3042j0249J8068J4005J3112
$$ plain form
5771 2175 -1014 31751 66835 67138 46332 42637 41565 32330 7590 -28039 -16705 -11928 4383
5758 4383 924 -2691 -29273 -41497 -44265 -48055 -45130 -14690 -10901 -9818 1033 5596 -17251 1820
5744 1820 1153 -20388 -18231 -32112 -51226 -15993 10569 -28902 -57263 -82201 -93898 -96364 -41856
5731 -41856 14264 38013 25467 -18823 -46698 -77576 -93041 -55776 -20548 23325 47382 55864
5719 55864 22480 -4313 -4505 12430 8959 6893 30150 31578 45917 45791 31101 15270 6130
5706 6130 -2251 21978 2384 -38021 -36037 -47218 -45198 -12332 -9665 -15891 2492 35755 83783
5693 83783 74764 55839 36684 30560 28555 26926 -7776 -12332 815 -36568 -16108 4832 -7520
5680 -7520 -667 -1307 -24037 -25416 -29059 -49837 -25346 -1637 79 2404 6294 29102 33797 21598
$$ packed form
5771B175l189L2765L5084L03k0806l695j072r235k4740l5629J1334M777J6311
5758D383l459l615k6582j2224k768l790K925L0440L789J083J0851M563k2847J9071
5744A820o67k1541K157j3881j9114L5233K6562l9471k8361k4938j1697k466N4508
5731d1856N6120K3749j2546m4290k7875l0878j5465L7265L5228M3873K4057Q482
5719E5864l3384k6793j92J6935l471k066K3257J428J4339j26j4690j5831r140
5706F130q381K4229j9594m0405J984j1181K020L2866K667o226J8383L3263M8028
5693H3783r019j8925j9155o124k005j629l4702m556J3147l7383K0460K0940j2352
5680g520O853o40k2730j379l643k0778K4491K3709J716K325L890K2808M695j2199
$$ plain form
5666 21598 7111 -1658 -13836 4892 -3254 8940 12485 26653 24245 -7338 432 11089 25531
5653 25531 22942 26214 8794 17069 38110 11041 -9725 2600 4281 -18497 -27768 -1747 16009
5640 16009 35097 73143 98514 67944 26119 719 4649 17814 1292 15920 -1352 -54471
5628 -54471 -92274 -72168 -30260 -20230 180 -8680 -3589 -1656 10272 10491 4939 22626 11323
5615 11323 -27577 -13467 13352 19410 14417 -8145 306 50070 37497 2629 -700 32661 13248
5602 13248 -13442 -19251 -18629 1808 16527 29193 4195 10216 10790 -5430 -57262 -67058 -37738
5589 -37738 -48150 -29551 14284 27800 32163 32776 13031 12147 -774 -23631 -34578 -40576 -52684
5576 -52684 -35950 -9343 3803 15052 11669 -31727 -54630 -19172 31506 18199 14958 3328
$$ packed form
5666B1598j4487q769j2178J8728q146J2194L545J4168k408l1583P770J0657J4442
5653B5531k589L272j7420Q275K1041k7069k0766J2325J681k2778r271K6021J7756
5640A6009J9088L8046K5371l0570m1825k5400L930J3165j6522J4628j7272n3119
5628e4471l7803K0106M1908J0030K0410q860N091J933J1928K19n552J7687j1303
5615A1323l8900J4110K6819O058m993k2562Q451M9764j2573l4868l329L3361j9413
5602A3248k6690n809O22K0437J4719J2666k4998O021N74j6220n1832r796K9320
5589c7738j0412J8599M3835J3516M363O13j9745q84j2921k2857j0947n998j2108
5576e2684J6734K6607J3146J1249l383m3396k2903L5458N0678j3307l241j1630
$$ plain form
5564 3328 -4395 -7024 -13725 -60251 -94198 -63786 -49127 -29719 7586 5928 -8098 4685 16659
5551 16659 3362 23665 27005 30592 24107 10153 -2615 1796 20158 25111 4425 -1504 -6754
5538 -6754 22665 14461 -19788 -24539 -11631 -11354 -46526 -30246 -37318 -55595 -27319 -21464 -27159
5525 -27159 -23594 -45979 -26966 7146 21509 -14576 -12967 -8253 -25903 -33471 -61434 -54692 -61698
5512 -61698 -24114 16456 21353 8597 -33070 -72253 -68654 -37467 -20394 -25268 -60940 -67493 -49862
5499 -49862 -24903 -6740 -24289 -67030 -54177 -26002 -32227 3904 24093 27315 29341 21704 10134
5486 10134 -33094 -27128 5380 -1101 -978 6553 22616 17790 -27884 -38488 -13229 -18251 -1567
5473 -1567 1873 -22327 -14034 -11640 8565 23786 30258 36036 4354 28219 7279 -14376 -3651
$$ packed form
5564C328p723k629o701m6526l3947L0412J4659J9408L7305j658j4026J2783J1974
5551A6659j3297K0303L340L587o485j3954j2768M411J8362M953k0686n929n250
5538f754K9419q204l4249m751J2908K77l5172J6280p072j8277K8276N855n695
5525b7159L565k2385J9013L4112J4363l6085J609M714j7650p568k7963O742p006
5512f1698L7584M0570M897j2756m1667l9183L599L1187J7073m874l5672o553J7631
5499d9862K4959J8163j7549m2741J2853K8175o225L6131K0189L222K026p637j1570
5486A0134m3228N966L2508o481J23P531J6063m826m5674j0604K5259n022J6684
5473a567L440k4200Q293K394K0205J5221O472N778l1682K3865k0940k1655J0725
$$ plain form
5460 -3651 -11794 -30137 -17742 -4755 7065 -21377 -36294 -31602 9040 52636 27705 -12134
5448 -12134 -42144 -52184 -59946 -34814 -15689 -35831 -61115 -115072 -120140 -59679 -31453 -19918
5436 -19918 -14711 -12294 -10662 -12966 -24572 -20302 -44406 -62730 -78693 -76210 -55811 -15789 -27414
5423 -27414 -23540 -14483 -15468 -13362 -31629 11868 19387 -10278 -2802 -22830 -3463 -21089 -43682
5410 -43682 -30441 -14305 -12198 -1257 -2342 -5361 -2278 -10905 -55344 -52650 -45783 -78999 -63467
5397 -63467 -77737 -82208 -39373 -34605 -25855 -52326 -56186 -42853 -44964 -30463 4367 -11503 -47034
5384 -47034 -30078 -41598 -49759 -32268 6623 3039 10753 -133 18735 -1368 -5876 -31574 -44373
5371 -44373 -44700 -48547 -33568 8735 8802 16063 23537 30693 2747 -1514 -4063 11257 8299 10758
$$ packed form
5460c651q143j8343J2395J2987J1820k8442j4917M692M0642M3596k4931l9839
5448a2134l0010j0040p762K5132J9125k0142k5284n3957n068O0461K8226J1535
5436a9918N207K417J632k304j1606M270k4104j8324j5963K483K0399M0022j1625
5423b7414L874R057r85K106j8267M3497P519k9665P476k0028J9367j7626k2593
5410d3682J3241J6136K107J0941j085l019L083q627m4439K694O867l3216J5532
5397f3467j4270m471M2835M768Q750k6471l860J3333k111J4501L4830j5870l5531
5384d7034J6956j1520q161J7491L8891l584P714j0886J8868k0103m508k5698j2799
5371d4373l27l847J4979M2303O7P261P474P156k7946m261k549J5320k958K459
$$ plain form
5357 10758 12519 -27972 -82651 -75111 -61027 -25241 1523 14013 28648 -5503 -25092 -12673
5345 -12673 -7081 4391 -21483 -51334 -32379 -39013 -45477 -22669 -14022 -48321 -63857 -55560 -42999
5332 -42999 -48425 -16691 7280 9413 23778 2889 -20584 -35065 -38703 -19765 -5228 7145
5320 7145 -8276 -28419 -5112 11606 17449 -9320 -29063 -24437 -40707 -40369 -24496 -25769 -40935
5307 -40935 -50635 -44285 -52293 -68789 -51806 -21392 -39292 -47130 -29206 8900 40554 40508 34750
5294 34750 49193 44077 39188 24598 -6729 -31540 -49629 -32480 -22317 -38556 -41957 -74376
5282 -74376 -71613 -31612 -40694 -46312 -40177 -24840 26067 46058 34007 7801 -24193 -44842 -42994
5269 -42994 -26852 -14475 -18180 -1190 -12999 -21084 -20038 33540 88020 72710 45430 51364 52827
$$ packed form
5357A0758J761m0491n4679P540J4084L5786K6764J2490J4635l4151j9589J2419
5345a2673N592J1472k5874k9851J8955o634o464K2808Q647l4299j5536Q297J2561
5332d2999n426L1734K3971K133J4365k0889k3473j4481l638J8938J4537J2373
5320G145j5421k0143K3307J6718N843k6769j9743M626j6270L38J5873j273j5166
5307d0935r700O350q008j6496J6983L0414j7900p838J7924L8106L1654m6n758
5294C4750J4443n116m889j4590l1327k4811j8089J7149J0163j6239l401l2419
5282g4376K763M0001r082n618O135J5337N0907J9991j2051k6206l1994k0649J848
5269d2994J6142J2377l705J6990j1809q085J046N3578N4480j5310k7280N934J463
$$ plain form
5256 52827 25958 -37230 -24989 14279 3270 -18044 -3511 12837 11572 6989 13053 26594
5244 26594 26487 11341 -39871 -62290 -36771 -29883 -39140 -2855 -4763 461 -25751 -8950 2920
5231 2920 34715 30617 14770 -15056 -9579 5022 12497 -7294 -20157 -31751 15360 45492 20687
5218 20687 -743 21890 15171 -1725 -8835 -53493 -73846 -66299 -52390 -30753 -15587 -13559 -50499
5205 -50499 -56946 -40853 7179 16129 21465 38505 35346 -13219 -5273 -28567 -22666 4850 38012
5192 38012 58982 84413 88610 92705 57035 28316 4416 -963 9389 20652 32572 28858 29299
5179 29299 52014 51181 25133 -1979 -14935 -48454 -39808 -27887 -19058 -22792 -31535 -35820 -11090
5166 -11090 -17275 -12661 1735 11533 6098 -7588 -30882 -50262 -57438 -31509 -37094 -50467 -61721
$$ packed form
5256E2827k6869o3188J2241L9268j1009k1314J4533J6348j265m583O064J3541
5244B6594j07j5146n1212k2419K5519O888r257L6285j908N224k6212J6801J1870
5231B920L1795m098j5847k9826N477J4601P475j9791j2863j1594M7111L0132k4805
5218B0687k1430K2633o719j6896p110m4658k0353P547J3909K1637J5166K028l6940
5205e0499o447J6093M8032Q950N336J7040l159m8565P946k3294N901K7516L3162
5192C8012K0970K5431M197M095l5670k8719k3900n379J0352J1263J1920l714M41
5179B9299K2715q33k6048k7112j2956l3519Q646J1921Q829l734q743m285K4730
5166a1090o185M614J4396R798n435j3686k3294j9380p176K5929n585j3373j1254
$$ plain form
5153 -61721 -44248 8516 26166 5482 -50532 -42412 -17382 12967 44712 24324 -15424 -41995
5141 -41995 -16188 13242 -4112 -32980 -28343 -3296 -3328 -27479 -18485 -10046 -39000 -42469 -24694
5128 -24694 -11768 5412 4456 -21995 -10749 26483 18679 3714 -27033 -32007 -24914 -18021 100
5115 100 -3407 -35885 -67376 -71010 -31069 -21658 -41796 -45863 -37398 -33344 -7462 7419 1078 -4096
5101 -4096 8859 11539 -5757 -24029 -28256 15585 63121 70908 32459 -19264 -41407 -45670 -17400
5088 -17400 12430 44700 9438 2124 21726 53808 53088 17053 2743 22075 47538 33974
5076 33974 -3919 -31676 -26031 -26959 -46957 -21463 10289 2813 -24799 -41003 -18548 -24170 -7032
5063 -7032 8514 -2283 -20293 -30848 17579 45744 32944 34481 13113 12076 47790 41470 29061
$$ packed form
5153f1721J7473N2764J7650k0684n6014Q120K5030L0349L1745k0388l9748k6571
5141d1995K5807K9430j7354k8868M637K5047l2k4151Q994Q439k8954l469J7775
5128b4694J2926J7180r56k6451J1246L7232p804j4965l0747m974P093O893J8121
5115A00l507l2478l1491l634L9941R411k0138m067Q465M054K5882J4881o341n174
5101d096J2955K680j7296j8272m227M3841M7536P787l8449n1723k2143m263K8270
5088a7400K9830L2270l5262p314J9602L2082p20l6035j4310J9332K5463j3564
5076C3974l7893k7757N645r28j9998K5494L1752p476k7612j6204K2455n622J7138
5063g032J5546j0797j8010j0555M8427K8165j2800J537k1368j037L5714o320j2409
$$ plain form
5050 29061 9608 9850 19410 22660 15397 14443 -14815 -44329 -25597 -34129 -36991 -37316 -24919 -20985
5036 -20985 -40150 -37068 -11524 2592 -1402 30443 67876 62944 52044 14155 -2903 -9500 -15166
5023 -15166 -34161 -43384 -25416 -2457 7402 3852 2394 -15687 -11538 -9598 163 34504 32638
5010 32638 47046 83839 82067 51558 29413 -22520 -78494 -87709 -68487 -43596 -1911 -8763
4998 -8763 -22440 -17373 -7243 -31804 -33923 -14595 21794 44563 32943 25588 -6143 -18596 -8441
4985 -8441 4437 25751 29490 26004 -3489 -2215 22556 19422 -18575 -31740 -24887 -23585 12771
4972 12771 33743 -5518 -39351 -49192 -38788 -3652 -20097 825 21232 6541 -651 -35656
4960 -35656 -57756 -85522 -78044 -46257 -12033 -13972 -14917 -20875 -21669 -10712 -13168 -53519 -74990
$$ packed form
5050B9061j9453K42R560L250p263r54k9258k9514J8732q532k862l25J2397L934
5036b0985j9165L082K5544J4116l994L1845L7433m932j0900l7889j7058o597n666
5023a5166j8995r223J7968K2959R859l550j458j8081M149J940R761L4341j866
5010C2638J4408L6793j772l0509k2145n1933n5974r215J9222K4891M1685o852
4998h763j3677N067J0130k4561k119J9328L6389K2769j1620p355l1731j2453J0155
4985h441J2878K1314L739l486k9493J274K4771l134l7997j3165O853J302L6356
4972A2771K0972l9261l3833r841J0404L5136j6445K0922K0407j4691p192l5005
4960c5656k2100k7766P478L1787L4224j939r45n958p94J0957k456m0351k1471
$$ plain form
4947 -74990 -39485 3683 34260 35726 -2081 -22525 -33872 -43129 -24746 -31251 -67090 -61663 -31713
4934 -31713 -16419 -206 -27551 -22586 -23403 -50372 -85983 -52898 -31126 3950 26740 40604
4922 40604 30273 4830 -4317 3432 -43815 -61966 -60934 -11491 -6464 -22032 -23640 -33339 -11802
4909 -11802 9557 -4391 25237 31545 16078 32083 26162 29741 36635 50525 52731 37631 15362
4896 15362 16227 -16058 -38169 -16950 -6969 -2352 -11077 -24241 -27883 -34179 -26120 5254 14791 10454
4882 10454 2349 22518 38089 14983 13073 42846 64826 68467 49582 28414 3095 -27304
4870 -27304 -9950 18846 -20887 -59576 -59767 -25730 8713 21312 43443 41988 24069 -5737
4858 -5737 -4066 16525 12086 12534 11802 -32176 -49603 -29168 -4117 -12084 -36567 -40794 -25726 -14671
$$ packed form
4947g4990L5505M3168L0577J466l7807k0444j1347r257J8383o505l5839N427K9950
4934c1713J5294J6213k7345M965q17k6969l5611L3085K1772L5076K2790J3864
4922D0604j0331k5443r147P749m7247j8151J032M9443N027j5568j608r699K1537
4909a1802K1359j3948K9628O308j5467J6005n921L579O894J3890K206j5100k2269
4896A5362Q65l2285k2111K1219R981M617q725j3164l642o296Q059L1374R537m337
4882A0454q105K0169J5571k3106j910K9773K1980L641j8885k1168k5319l0399
4870b7304J7354K8796l9733l8689j91L4037L4443J2599K2131j455j7919k9806
4858e737J671K0591m439M48p32m3978j7427K0435K5051p967k4483m227J5068J1055
$$ plain form
4844 -14671 -2533 1164 12658 17381 -31010 -15458 -13414 12953 19316 -22162 -39285 -7380 -20235
4831 -20235 -14958 -34441 -33848 -37146 -36130 -4613 3699 15762 9111 -12928 -31208 -30613 -12021 -18948
4817 -18948 -39444 -37682 -39528 -67602 -45402 12312 59680 77654 51481 32557 50743 43438
4805 43438 27143 39112 42741 36405 5429 -24868 13065 24613 25650 -5642 -26591 -38214
4793 -38214 -29109 -22459 -41064 -52657 -30195 -11085 -13219 -21423 -11299 8000 23636 -1989 12558
4780 12558 3931 -18514 -11534 -26282 -6635 17544 439 -22376 -23950 -27025 -17729 17248 4170
4767 4170 -1356 21429 26165 -9463 -21118 5548 16051 1336 8808 -26726 -36166 -46915 -28373
4754 -28373 -35382 -23379 2524 3354 10148 13810 850 -1899 26609 34479 -1704 -5853 19428
$$ packed form
4844a4671J2138L697J1494M723m8391J5552K044K6367O363m1478j7123L1905j2855
4831b0235N277j9483N93l298J016L1517Q312J2063o651k2039j8280N95J8592o927
4817a8948k0496J762j846k8074K2200N7714M7368J7974k6173j8924J8186p305
4805D3438j6295J1969L629o336l0976l0297L7933J1548J037l1292k0949j1623
4793c8214R105O650j8605j1593K2462J9110k134q204J0124J9299J5636k5625J4547
4780A2558q627k2445O980j4748J9647K4179j7105k2815j574l075R296L4977j3078
4767D170n526K2785M736l5628j1655K6666J0503j4715P472l5534r440j0749J8542
4754b8373p009J2003K5903Q30O794L662j2960k749K8508P870l6183m149K5281
$$ plain form
4741 19428 16352 24741 23947 18930 -7909 -28549 -19197 -28049 -19485 -13964 -7222 11328 10832 4567
4727 4567 13807 9916 3569 -36275 -22243 27134 25153 -5816 -27970 -34273 -43636 -56608 -39062
4714 -39062 -35306 -22016 -16942 -23577 -23035 1233 33159 27313 -8845 -12014 -11964 3338 28401 22830
4700 22830 -7667 -43538 -40641 5613 30697 36710 3445 -7310 -3326 11895 24448 -931
4688 -931 7046 1728 -15975 -48092 -60405 -5624 25638 -7450 11101 19040 12938 14208 -34606
4675 -34606 -60731 -26924 -18785 -28901 -29876 -34496 -7470 14605 13648 -10544 -11355 -15455 -36495 -38487
4661 -38487 -47251 -38236 -34350 -16772 -4092 -17043 -31675 -24415 -20284 -12841 -10089 -8104 -46321
4648 -46321 -12020 26971 35185 -1489 -34599 -54296 -61463 -45703 -26897 10301 47327 63205
$$ packed form
4741A9428l076Q389p94n017k6839k0640R352q852Q564N521O742J8550m96o265
4727D567R240l891o347l9844J4032M9377j981l0969k2154o303r363j2972J7546
4714c9062L756J3290N074o635N42K4268L1926n846l6158l169N0J5302K5063n571
4700B2830l0497l5871K897M6254K5084O013l3265j0755L984J5221J2553k5379
4688i31P977n318j7703l2117j2313N4781L1262l3088J8551P939o102J270m8814
4675c4606k6125L3807Q139j0116r75m620K7026K2075r57k4192q11m100k1040j992
4661c8487q764R015L886J7578J2680j2951j4632P260M131P443K752J985l8217
4648d6321L4301L8991Q214l6674l3110j9697p167J5760J8806L7198L7026J5878
$$ plain form
4636 63205 65245 14015 -32640 -55259 -35932 -14862 9191 -3176 23266 43021 28927 10292
4624 10292 -33607 -58336 -16973 13192 -12344 16053 11349 -6708 881 24449 41266 45365
4612 45365 26660 14026 35248 23659 -13261 -28570 5438 19980 13031 -9516 -33621 -25314
4600 -25314 -24713 -34221 -4424 7526 -17003 -22211 961 12314 6095 11036 -16125 -43522 -67412
4587 -67412 -46871 -60491 -47506 -38856 -25394 -1474 -21392 -36349 -55246 -73674 -77491 -38716
4575 -38716 -7695 6535 -9337 2068 8375 28674 34952 3656 -24259 -8654 22858 14761
4563 14761 2574 9101 5002 10386 -7717 1551 -2117 15563 -9808 -15233 -13748 9262 28653
4550 28653 37433 39795 23127 10513 5102 13759 16527 8984 15616 12855 32398 21842 1095
$$ packed form
4636F3205K040n1230m6655k2619J9327K1070K4053j2367K6442J9755j4094j8635
4624A0292m3899k4729M1363L0165k5536K8397m704j8057P589K3568J6817M099
4612D5365j8705j2634K1222j1589l6920j5309L4008J4542o949k2547k4105Q307
4600b5314O01r508K9797J1950k4529n208K3172J1353o219M941k7161k7397k3890
4587f7412K0541j3620J2985Q650J3462K3920j9918j4957j8897j8428l817L8775
4575c8716L1021J4230j5872J1405O307K0299O278l1296k7915J5605L1512q097
4563A4761j2187O527m099N384j8103R268l668J7680k5371n425J485K3010J9391
4550B8653Q780K362j6668j2614n411Q657K768p543O632k761J9543j0556k0747
$$ plain form
4537 1095 21192 20120 38809 28121 1219 17046 59164 76218 35089 43185 66819 75405 40607
4524 40607 -7631 -14102 -12144 -25297 -33604 -41059 -32978 -38453 -9539 12571 31314 40489 24333
$$ packed form
4537A095K0097j072J8689j0688k6902J5827M2118J7054m1129Q096K3634Q586l4798
4524D0607m8238o471J958j3153q307p455Q081n475K8914K2110J8743R175j6156
$$ [...]
##END NTUPLES=NMR SPECTRUM
##END=
