##TITLE=Analysis number 319129
Compound Code cc 00812
Project Code adrs
Chemist Name endeavour
##JCAMPDX= 6.0         $$ Bruker NMR JCAMP-DX V2.0
##DATA TYPE= NMR SPECTRUM
##DATA CLASS= NTUPLES
##ORIGIN= Bruker BioSpin GmbH
##OWNER= nmr
$$ XWIN-NMR		Version 3.5
$$ Wed May  3 11:22:46 2006 GMT Daylight Time (UT+1h)  MAYBRIDGE\nmr@NMR_250MHZ
##.OBSERVE FREQUENCY= 250.131544655141
##.OBSERVE NUCLEUS= ^1H
##.ACQUISITION MODE= SIMULTANEOUS (DQD)
##.ACQUISITION SCHEME= undefined
##.AVERAGES= 16
##.DIGITISER RES= 18
##SPECTROMETER/DATA SYSTEM= dpx250
##.PULSE SEQUENCE= zg30
##.SOLVENT NAME= DMSO
##.SHIFT REFERENCE= (INTERNAL, DMSO, 0, 16.522)
##AUDIT TRAIL= $$ (NUMBER, WHEN, WHO, WHERE, WHAT)
$$ ##TITLE= Audit trail, XWIN-NMR		Version 3.5
$$ ##JCAMPDX= 5.01
$$ ##ORIGIN= Bruker BioSpin GmbH
$$ ##OWNER= nmr
$$ C:\u/data/dgb/nmr/ADRS/3630/pdata/1/auditp.txt
$$ ##AUDIT TRAIL=  $$ (NUMBER, WHEN, WHO, WHERE, WHAT)
(   1,<2006-05-03 11:22:23.45 +100>,<MAYBRIDGE\nmr>,<NMR_250MHZ>,
      <created by zg, POWCHK disabled, PULCHK disabled
       configuration hash MD5:
       84 BC 41 DB A1 6E 1D 46 DA 25 12 A5 C1 ED C5 3A
       data hash MD5: 64K
       AD CA 33 86 E5 F4 B4 A1 D8 6F 47 CE 16 60 AE F2>)
(   2,<2006-05-03 11:22:36.76 +100>,<MAYBRIDGE\nmr>,<NMR_250MHZ>,
      <Start of raw data processing
       ef LB = 0.3 FT_mod = 6 PKNL = 1 SI = 32K 
       data hash MD5: 32K
       F8 0C 34 F5 68 EC E6 4E 88 3D 1F 25 7D 2C 21 00>)
(   3,<2006-05-03 11:22:38.37 +100>,<MAYBRIDGE\nmr>,<NMR_250MHZ>,
      <apk 
       data hash MD5: 32K
       AB 0F D7 97 93 4E 70 BC 87 74 33 A3 25 AD 10 27>)
(   4,<2006-05-03 11:22:39.23 +100>,<MAYBRIDGE\nmr>,<NMR_250MHZ>,
      <abs ABSG = 5 
       data hash MD5: 32K
       7C 56 DA 97 B7 05 D6 07 15 01 ED C0 E1 2D F8 39>)
$$ ##END=
$$ 
$$ hash MD5
$$ 79 4A 51 E2 11 06 80 17 F2 EA 7B 1E 03 5A 86 49
##$RELAX= 
##$RELAX= 
##$RELAX= 
##$RELAX= 
##$RELAX= 
##$RELAX= 
##$RELAX= 
$$ Bruker specific parameters
$$ --------------------------
##$DU= <C:\u>
##$EXPNO= 3630
##$NAME= <ADRS>
##$PROCNO= 1
##$TYPE= <nmr>
##$USER= <dgb>
##$AMP= (0..31)
100 100 100 100 100 100 100 100 100 100 100 100 100 100 100 100 100 100 
100 100 100 100 100 100 100 100 100 100 100 100 100 100 
##$AQSEQ= 0
##$AQ_mod= 3
##$AUNM= <au_zg>
##$AUTOPOS= <16 >
##$BF1= 250.13
##$BF2= 250.13
##$BF3= 250.13
##$BF4= 250.13
##$BF5= 500.13
##$BF6= 500.13
##$BF7= 500.13
##$BF8= 500.13
##$BYTORDA= 1
##$CFDGTYP= 0
##$CFRGTYP= 5
##$CHEMSTR= <none>
##$CNST= (0..31)
1 1 145 1 1 1 1 1 1 1 1 1 1 1 1 1 1 1 1 1 1 1 1 1 1 1 1 1 1 1 1 1 
##$CPDPRG= <>
##$CPDPRG1= <>
##$CPDPRG2= <>
##$CPDPRG3= <>
##$CPDPRG4= <mlev>
##$CPDPRG5= <mlev>
##$CPDPRG6= <mlev>
##$CPDPRG7= <mlev>
##$CPDPRG8= <mlev>
##$CPDPRGB= <>
##$CPDPRGT= <>
##$D= (0..31)
0 1 0 0 0 0 0 0 0 0.06 0 0 0 0 0 0 0.0002 0 0 0 0 0 0 0 0 0 0 0 0 0 0 
0 
##$DATE= 1146651742
##$DBL= (0..7)
120 120 120 120 120 120 120 120 
##$DBP= (0..7)
150 150 150 150 150 150 150 150 
##$DBP07= 0
##$DBPNAM0= <>
##$DBPNAM1= <>
##$DBPNAM2= <>
$$ [...]
##$SUBNAM7= <"">
##$SUBNAM8= <"">
##$SUBNAM9= <"">
##$SW= 20.6930455092707
##$SWIBOX= (0..15)
0 0 3 0 0 0 0 0 0 0 0 0 0 0 0 0 
##$SW_h= 5175.983436853
##$TD= 65536
##$TD0= 1
##$TE= 295.16
##$TE2= 300
##$TE3= 300
##$TEG= 300
##$TL= (0..7)
0 120 120 120 120 120 120 120 
##$TP= (0..7)
150 150 150 150 150 150 150 150 
##$TP07= 0
##$TPNAME0= <>
##$TPNAME1= <>
##$TPNAME2= <>
##$TPNAME3= <>
##$TPNAME4= <>
##$TPNAME5= <>
##$TPNAME6= <>
##$TPNAME7= <>
##$TPOAL= (0..7)
0.5 0.5 0.5 0.5 0.5 0.5 0.5 0.5 
##$TPOFFS= (0..7)
0 0 0 0 0 0 0 0 
##$TUNHIN= 0
##$TUNHOUT= 0
##$TUNXOUT= 0
##$USERA1= <user>
##$USERA2= <user>
##$USERA3= <user>
##$USERA4= <user>
##$USERA5= <user>
##$V9= 5
##$VALIST= <valist>
##$VCLIST= <CCCCCCCCCCCCCCC>
##$VD= 0
##$VDLIST= <DDDDDDDDDDDDDDD>
##$VPLIST= <PPPPPPPPPPPPPPP>
##$VTLIST= <TTTTTTTTTTTTTTT>
##$WBST= 1024
##$WBSW= 4
##$XGAIN= (0..3)
0 0 0 0 
##$XL= 0
##$YL= 0
##$YMAX_a= 285824
##$YMIN_a= -435124
##$ZGOPTNS= <>
##$ZL1= 120
##$ZL2= 120
##$ZL3= 120
##$ZL4= 120
##$ABSF1= 16.522
##$ABSF2= -4.171173
##$ABSG= 5
##$ABSL= 3
##$ALPHA= 0
##$AQORDER= 0
##$ASSFAC= 0
##$ASSFACI= 0
##$ASSFACX= 0
##$ASSWID= 0
##$AUNMP= <proc_1d>
##$AZFE= 0.1
##$AZFW= 0.1
##$BCFW= 0
##$BC_mod= 0
##$BYTORDP= 0
##$COROFFS= 0
##$CY= 12.5
##$DATMOD= 1
##$DC= 0
##$DFILT= <>
##$DTYPP= 0
##$F1P= 14.0000005364418
##$F2P= -0.99999901652339
##$FCOR= 0.5
##$FTSIZE= 32768
##$FT_mod= 6
##$GAMMA= 0
##$GB= 0
##$INTBC= 1
##$INTSCL= 1
##$ISEN= 128
##$LB= 0.3
##$LEV0= 0
##$LPBIN= 0
##$MAXI= 10000
##$MC2= 0
##$MEAN= 0
##$ME_mod= 0
##$MI= 0
##$NCOEF= 0
##$NC_proc= -4
##$NLEV= 6
##$NOISF1= 0
##$NOISF2= 0
##$NSP= 0
##$NTH_PI= 0
##$NZP= 0
##$OFFSET= 16.522
##$PC= 1
##$PHC0= 158.7595
##$PHC1= 16.20632
##$PH_mod= 1
##$PKNL= yes
##$PPARMOD= 0
##$PSCAL= 4
##$PSIGN= 0
##$REVERSE= no
##$SF= 250.13
##$SI= 32768
##$SIGF1= 0
##$SIGF2= 0
##$SINO= 400
##$SIOLD= 32768
##$SREGLST= <1H.DMSO>
##$SSB= 0
##$STSI= 32768
##$STSR= 0
##$SW_p= 5175.98343685301
##$SYMM= 0
##$S_DEV= 0
##$TDeff= 65536
##$TDoff= 0
##$TI= <Analysis number 999999
Compound Code 99
Book Reference 9
Project Code 9>
##$TILT= no
##$TM1= 0
##$TM2= 0
##$TOPLEV= 0
##$USERP1= <user>
##$USERP2= <user>
##$USERP3= <user>
##$USERP4= <user>
##$USERP5= <user>
##$WDW= 1
##$XDIM= 32768
##$YMAX_p= 283232504
##$YMIN_p= -498713
$$ End of Bruker specific parameters
$$ ---------------------------------
##NTUPLES= NMR SPECTRUM
##VAR_NAME=  FREQUENCY,     SPECTRUM/REAL,   SPECTRUM/IMAG
##SYMBOL=    X,             R,               I
##VAR_TYPE=  INDEPENDENT,   DEPENDENT,       DEPENDENT
##VAR_FORM=  AFFN,          ASDF,            ASDF
##VAR_DIM=   32768,         32768,           32768
##UNITS=     HZ,            ARBITRARY UNITS, ARBITRARY UNITS
##FACTOR=    0.157963299565203, 1,           1
##FIRST=     4132.6476996994, 0,             0
##LAST=      -1043.33573715361, 0,           0
##MIN=       -1043.33573715361, -498713,     0
##MAX=       4132.6476996994, 283232504,     0
$$ Real data points
##PAGE= N=1
##DATA TABLE= (X++(R..R)), XYDATA
$$ [...]
17244E083761k69299j24641o4761O4706P4917N805o1777o5987j27914l7578k4052
17233D453180K0367J55967K75282K03746L00388M67618P77755J190821J656212
17224I501336K410674L263265L838248M006253M107105L882172L320270K060681
17216C6390004K58628j426019k448627l411943m453771m624460l859880l179517
17208A3244415k441438j702711j304513q58965o83371l91538k95476k62298l02642
17199E001463k91760k11193j47408j41403n8392j80696j82710j96997j87904k30075
17189C172925j95357k08049o8720K2881j71046j12915n3929o693l610l7055m6666
17178B291766o8263n5093k9344m904j50446j19834j32421j43781m3827J1219R949
$$ y = [5083761, 4814462, 4689821, 4625060, 4689766, 4764683, 4770488, 4708711, 4642724, 4514810, 4477232, 4453180, 4473547, 4629514, 4904796, 5108542, 5408930, 5876548, 6654303, 7845124, 9501336, 11912010, 15175275, 19013523, 23019776, 27126881, 31009053, 34329323, 36390004, 36648632, 35222613, 32773986, 29362043, 24908272, 20283812, 16423932, 13244415, 10802977, 9100266, 7795753, 6936788, 6253417, 5861879, 5566403, 5304105, 5001463, 4709703, 4498510, 4351102, 4209699, 4151307, 3970611, 3787901, 3590904, 3403000, 3172925, 2977568, 2769519, 2700799, 2723680, 2552634, 2439719, 2385790, 2379097, 2375487, 2338432, 2291766, 2223503, 2168410, 2139066, 2134162, 1983716, 1863882, 1731461, 1587680, 1543853, 1555072, 1565021]
17167A565021P1551k5218r8843K0988l1352j00943q8127j05416j36110l2284Q1653
17156A120920o6946p6323J05468k9731n465p7817l7632O5805J00853r7371q7817
17145I13944L013O6265j5971N2143o7916q4237M8859O3629P7886J3812j43403
17134I28024p6050n1804j09828L0036O5735L041j41012k8265L6085K0648J5629
17123F92239j15020M1831J22696K3236r1666r4495q7378p8738J8610K6539o1476
17112C96378l2528j48553m1848N5789M4442k4004Q8349n547K0454P5426N8506
17101D86864J7111O5035j07672q1528L7748l5888K3016o7713m4574K9014N2488
17090C73901N3746k9499q6750q2719K4553M1985k773q3690j16695O9777Q7326
$$ y = [1565021, 1636572, 1611354, 1512511, 1533499, 1502147, 1401204, 1313077, 1207661, 1071551, 1039267, 1120920, 1053974, 977651, 1083119, 1053388, 1047923, 970106, 932474, 998279, 1099132, 1001761, 913944, 916957, 983222, 967251, 1019394, 951478, 867241, 916100, 979729, 1057615, 1071427, 928024, 851974, 800170, 690342, 720378, 786113, 789154, 648142, 619877, 655962, 676610, 692239, 577219, 619050, 741746, 764982, 673316, 578821, 491443, 412705, 431315, 457854, 396378, 363850, 215297, 173449, 229238, 273680, 249676, 338025, 332478, 352932, 428358, 486864, 503975, 569010, 461338, 379810, 417558, 381670, 404686, 336973, 292399, 321413, 373901, 427647, 398148, 311398, 228679, 253232, 295217, 292444, 208754, 92059, 161836, 249162]
17079B49162m8229J17312O5025j05213j17250j6140p909J6840r419j2937K8843
17068A60085L3557j6971o431l0425m6791J2243L1150J9730p6380j3663k1411K0508
17056F5201o0805l0325P6684j0842N7120M9699R0218j11316J2557O707o9521p0813
17044D564P6780L0629j04812o4514K1001M9600o3144P8726l5787p1579k4930q0433
17032a83899L4441N9477O3339K8147L443J10164q4526r3854N9942J2289R041J69398
17020A87402P7871q5925q1319j39900p5193Q2416J74580K0082Q9242k5881L8912
17009B62287L2498N5582J11916J26563m2440L4210j529l4949R7483M0167R1830
16998G73618J36803O6141P6296J56947K99024L34748K55883L04339K38322Q9855
$$ y = [249162, 200933, 318245, 383270, 278057, 160807, 144667, 136758, 153598, 144179, 131242, 160085, 193642, 176671, 170240, 139815, 93024, 105267, 136417, 156147, 79767, 66104, 44693, 65201, 4396, -25929, 50755, 39913, 97033, 146732, 236950, 125634, 138191, 144898, 75377, 4564, 81344, 111973, 7161, -57353, -36352, 13248, -49896, 28830, -6957, -78536, -103466, -183899, -149458, -89981, -26642, 1505, 4948, 115112, 30586, -63268, -3326, 8963, 18004, 187402, 265273, 179348, 98029, -41871, -117064, -34648, 139932, 160014, 249256, 223375, 262287, 294785, 350367, 462283, 588846, 546406, 580616, 579087, 544138, 641621, 681788, 773618, 910421, 976562, 1052858, 1209805, 1508829, 1843577, 2099460, 2403799, 2642121, 2731976]
16988B731976Q0595o2937j01658j79741k48937l11379j65424j35507k79509k59081
16978A068398j77009j00452l7850n6363O4322j13007j66127j00645k3203Q9104
16968D47168l765M0270l527j13202j07604l7318K4065Q4071K3964l9017q6278
16957B28827p184k5466j1030j1854l3244J1574L0219l6116n200l1103J49o6024
16945D3548l9629l599o4402K8284J21714Q1262p4204j05477J3513J65080m4886
16934A21204m1443J28755J75421M888L6357j50157P796l1388q2992J0041Q2838
16923B61320q9077j40037Q700k8195N8607o724n6701j7023N5678n7088p7594n9935
16911a48069k2148m4305j596P7538R4851N8263J4519k6922N2741L2686n0850J03688
$$ y = [2731976, 2812571, 2749634, 2647976, 2468235, 2219298, 1907919, 1742495, 1606988, 1327479, 1068398, 891389, 790937, 753087, 696724, 761046, 648039, 481912, 381267, 358064, 447168, 443403, 483673, 480146, 366944, 259340, 222022, 246087, 330158, 354122, 315105, 228827, 221643, 196177, 185147, 173293, 140049, 151623, 181842, 145726, 140526, 109423, 109572, 43548, 3919, 320, -64082, -35798, 85916, 167178, 92974, -12503, 1010, 166090, 121204, 79761, 208516, 383937, 388825, 425182, 275025, 282821, 251433, 168441, 178482, 261320, 172243, 32206, 40906, 12711, 71318, 64594, 7893, -9130, 46548, -10540, -88134, -148069, -170217, -214522, -216118, -138580, -43729, 14534, 29053, 2131, 54872, 87558, 36708, 140396]
16899A40396N517k3326P557K8838p1860k1231r9165l4365j2815L8252N7986m9595
16887c3811j7382K4297m4062j08137q5236m228J80882J19280O9004l6171j15336
16876e0900o3613M3457k3352k2999K3587n7138o1562N8354K8684J0629p8951L088
16864a90716N064p8542j24319l5439M5484J86902J92663m6247n7427o312J05990
16853b899l3191N6537J6096q9046L906O5798Q0036P1473j88327O6572l2506j45473
16841a31024Q8986J09339N4038M2273k457j34365m0631j21989k3644J29361J00599
16830G0486k7797Q6966k2996j51864j07262q379Q772k2158N726L2378L7123M9497
16818d9508r8072n1563p3879j53199p2492O6349M5013P5767J88469R9629p8146
$$ y = [140396, 145913, 122587, 130144, 158982, 87122, 65891, -33274, -67639, -80454, -42202, 15784, -33811, -51193, -26896, -70958, -179095, -264331, -268559, -87677, 31603, 100607, 64436, -50900, -114513, -71056, -94408, -117407, -93820, -150958, -212520, -154166, -125482, -114853, -193804, -190716, -185652, -264194, -388513, -423952, -378468, -191566, 1097, -45150, -102577, -108889, -2899, -36090, 20447, 36543, -52503, -48597, 17201, 97237, 168710, -19617, 46955, 14449, -131024, -42038, 67301, 121339, 163612, 161155, 26790, -13841, -135830, -159474, -30113, 70486, 42689, 129655, 106659, -45205, -152467, -160846, -152074, -174232, -168506, -136128, -99005, -49508, -147580, -199143, -273022, -426221, -498713, -432364, -387351, -311584, -123115, -23486, -101632]
16807a01632o8046n6691k5411O1709m9655l4651O3738Q8710r7284O063J1568R6356
16795a05226N5026N8084j9820j9327O2032J05365n9585n1047m5732j4630J67625
16784A32765j8573j2640p3396r4652P0387P088j1758m996n8359j0593M8603k931
16772b9055J9579p0430j9397N7970P9380J11302O607o4767q4356k87Q075J7768
16760C2389o6610M0101n0549m6313j39738M7747P2435N719J16365J29922o8430
16749G3038j15594L214m0711m7095j1538N3696Q9707P937n8364o4100L37P4694
16737c4779j40947o9136O9523J75423k0739j33592M3794l9405Q7706L3696p8813
16726a07269l4167J30922P3189l6230k5375K1462L8644Q7444k8304o3990j1283
$$ y = [-101632, -169678, -226369, -251780, -190071, -239726, -274377, -210639, -121929, -219213, -213150, -201582, -105226, -50200, 7884, -11936, -31263, 30769, 136134, 76549, 25502, -20230, -34860, 132765, 114192, 101552, 28156, -66496, 3891, 10979, -779, -5775, -64134, -74727, -26124, -29055, -9476, -79906, -99303, -41333, 38047, 149349, 155956, 91189, 6833, 6546, 14621, 32389, -34221, 5880, -44669, -90982, -230720, -182973, -110538, -104819, 11546, 141468, 73038, -42556, -39342, -80053, -127148, -138686, -84990, 4717, 12654, -45710, -109810, -109473, -34779, -175726, -244862, -175339, 84, -20655, -154247, -110453, -149858, -62152, -28456, -107269, -141436, -10514, 62675, 26445, 1070, 22532, 61176, 148620, 120316, 56326, 45043]
16715D5043N6668M289r2871J15062o156m1823R0146k9463k0497j0129K1608m9007
16703H2870M3122K6463m9087l3006M33k020m5754r662n6172N9650K0425j00L7107
16690G4269q3732k4810N4664m2206p5745k0336J0421o6842O1093p7631l5728l5578
16678b62161M3935P7631J35705J50326L9660j52179o1593n6646m7234J01598M7889
16667A6931m8741M8809J34958k1583k2546k5106M4602m3959m064j28168j06828
16656a55695L700J32457j5289l4307m8615j8458K2777J8939j4411j09553L6582
16645a81873Q9632P6533J3077q5524k1221j62507m7366j130P2728j5015K1782
16634b40884P2665J01982L9158P118p7470j55101l0427j037M9841R4156q889L2200
$$ y = [45043, 101711, 106000, 13129, 128191, 122035, 80212, 170358, 140895, 120398, 110269, 131877, 82870, 125992, 152455, 103368, 70362, 70795, 68775, 23021, 13359, -42813, 16837, 37262, 37162, 74269, -9463, -34273, 20391, -21815, -97560, -117896, -107475, -174317, -113224, -190855, -226583, -262161, -218226, -140595, -4890, 145436, 185096, 32917, -28676, -85322, -132556, -30958, 16931, -31810, 16999, 151957, 130374, 107828, 82722, 127324, 83365, 79301, -48867, -155695, -151995, -19538, -34827, -69134, -117749, -136207, -113430, -94491, -108902, -218455, -181873, -92241, -15708, -2631, -88155, -109376, -271883, -319249, -320379, -247651, -262666, -240884, -168219, -66237, -27079, -19961, -97431, -252532, -282959, -283996, -234155, -139999, -148888, -116688]
16622a16688l5643k5351J6541k8969L3808O4054M9570M5848M175J2966r1463q2932
16610a54084Q0592J36562L3112m615r0221n3555j2421k2037o0423k5432K7074
16599a45448l936o9482J9908m524J7245J03910j12793l6233j1507l4207O0849
16588b16218J295L495n9172r3025J0507P7506L9974J22232J49603n833K4975m5983
16576I356j2556M4805l8921p0887l1064O5774J8387l2260j83732J8096K05392
16565g610R7803j63121j23219J20901L2729p814j8581r6486o6381J24921J07407
16554E49m5679k7200n5104k3818p1821Q8478J9804o2384K8653N4067p7236j20627
16542b92318P1416J15175M8608l2818k4822N8366M5458j08776j4263R9084p7806
$$ y = [-116688, -152331, -177682, -161141, -190110, -156302, -92248, -42678, 3170, 7345, 20311, -71152, -154084, -73492, 63070, 96182, 91567, 1346, -52209, -64630, -86667, -147090, -172522, -145448, -149384, -218866, -198958, -203482, -186237, -82327, -195120, -231353, -242860, -277067, -216218, -214923, -211428, -270600, -363625, -353118, -275612, -235638, -113406, 36197, 30364, 55339, 9356, -3200, 41605, 2684, -68203, -99267, -33493, -15106, -47366, -231098, -213002, -7610, 90193, -72928, -196147, -75246, -42517, -50331, -68912, -165398, -231779, -106858, 549, -45130, -72330, -127434, -151252, -223073, -134595, -114791, -177175, -148522, -94455, -171691, -292318, -220902, -105727, -57119, -89937, -114759, -56393, -10935, -119711, -133974, -34890, -112696]
16531a12696j3192P7351L3555j7007q1858j75279m0295N9847o1770R747J31426
16520a90171K02838k9933j07028k0667p943m2022k254m3374q4005P2334L2358
16509b19867L5850P8252m2557O462J59517r808k3931J13259j04033j63703p2750
16498b43309J28420J44764K2291N3463q9833j37798N719M7856j4112l1967M3944
16487g0562l4883o2161N1457Q5891J7941j19042q1668n0613M6096J4690M5781
16476a57073m9670J3678L2146r701M6927K6931J35076L5643J47471q7973j52467
16465a9012J4982o3982M7391N4158L2511P4619J7592k1796j40593j83958N2642
16454a35446R8181q2547J3097m066K409O1497R366l4134j71248p6198J44396Q3419
$$ y = [-112696, -125888, -48537, -14982, -31989, -113847, -289126, -329421, -269574, -331344, -321597, -190171, 12667, -17266, -124294, -144961, -152904, -194926, -197180, -240554, -324559, -252225, -219867, -184017, -105765, -148322, -141860, 17657, 7849, -16082, 97177, -6856, -170559, -243309, -114889, 29875, 52166, 105629, 15796, -122002, -116283, -68427, -82539, -114506, -70562, -105445, -167606, -116149, -30258, -12317, -131359, -213027, -263640, -217544, -202854, -157073, -206743, -193065, -160919, -170620, -123693, -96762, 38314, 73957, 221428, 133455, -19012, -4030, -68012, -20621, 33537, 66048, 140667, 158259, 136463, -4130, -188088, -135446, -37265, -119812, -106715, -110781, -108372, -46875, -37509, -71643, -242891, -319089, -174693, -91274]
16442i1274j58932p7339J17658J1540J8855O1813m9589J176n0511k3627J09888
16431a30342K9833P0930k2359J5645L291O6706M2570o3264j00596P6323p6702
16420h7965j0990R592j64930j36140O7987O2122p9125n6003M9616J51453M4566
16409a49817M3943J7936k18j39705L3927J6718m6048o5742r314J65907J14818
16398a7595k9088j16596j5064N9005L611m6417N9870R9794j06979o9842j16449
16387b95750P0172J21326P5560Q71o0492L9143J57649Q4005p3414j51750R9939
16376F7259J3498l3931m3472P520o3692m5732n5708L448J2639Q9578K5680j13476
16364a36389J10439K23275M3556j25878j48640j5090L6090o7759j7885p1916q1543
$$ y = [-91274, -250206, -327545, -209887, -198347, -179492, -117679, -167268, -166092, -216603, -240230, -130342, -100509, -29579, -51938, -36293, -33002, 33704, 76274, 13010, -87586, -11263, -87965, -98955, -89363, -254293, -390433, -322446, -260324, -339449, -395452, -345836, -194383, -149817, -105874, -87938, -88156, -227861, -193934, -177216, -223264, -289006, -298320, -132413, -17595, -46683, -163279, -178343, -119338, -115727, -162144, -102274, -2480, -109459, -179301, -295750, -225578, -104252, -28692, -27821, -88313, -49170, 108479, 192484, 119070, -32680, 67259, 80757, 46826, 3354, 10874, -52818, -98550, -154258, -150810, -138171, -48593, -22913, -136389, -25950, 197325, 240881, 115003, -33637, -48727, -12637, -80396, -98281, -170197, -251740]
16353b51740R5688R6874j26717p9719M5801O3404l2030j23591J11705K05821p4102
16342f8606L6650J4767j64359j6035M3734L7843p100m6801j00390P2051J19651
16331g8595N4516L8003L7407R501q1298o9498k14L0749k3041n6239L8623k9098
16319a29184p6875q4355k742J79437J547j38874r8472J32395R2656J4760K1509
16308h8198L3381N5976N3258m2651m9154r6803j751m1073J7047p3532j14857J3172
16296c35185K26198Q1946j5646M9250k6840j04766M8599K5503M346n1464L6508
16285f1551J01819j43182p6283P500r175m0239M505j5816R4222M6768m4794K7485
16273a08741R0367J9150R437J02668o5853q7650o5302k1j1752m055j3612J13522
$$ y = [-251740, -156052, -59178, -185895, -265614, -219813, -156409, -188439, -312030, -200325, 5496, -68606, -31956, -17189, -181548, -197583, -153849, -116006, -123106, -169907, -270297, -198246, -78595, -24079, 13924, 51331, 60832, -20466, -89964, -90178, -59429, -82470, -138709, -100086, -129184, -206059, -290414, -293156, -113719, -112172, -251046, -349518, -217123, -124467, -109707, -88198, -54817, 1159, 54417, 11766, -37388, -134191, -135942, -177015, -159968, -233500, -348357, -335185, -108987, -27041, -42687, 6563, -20277, -125043, -76444, -50941, -46595, -98059, -61551, 40268, -102914, -179197, -171697, -180872, -221111, -216606, -232422, -138200, -91432, -136226, -108741, -18374, 776, 10213, 112881, 47028, -40622, -105924, -105945, -117697, -121752, -135364, -21842]
16261b1842l5685l375m7874M0516O6520j13125J1104M8680k6301k5199O5624k4382
16249f5339j12334K0416J83999J9165n3211R2649P0441O216o498o7632k4825m2502
16237B0545M1215o1511K8635M7557n9368q7632j0888O3816k8721k5723K3670p7402
16225a25807o5388P5806M2278m9760n8440j6299L0441J9789k5497n987J84383
16214E519J71977P9959J1939j73606j68811O163l9859l4612l9939m320R2157M6050
16202d7383R3495Q6536j02324j30349n4291r6973K7213L3186J93035J6442o522
16191A2065J4295j00117j0133q9972N1827l6338N53O1449R3344P52j260r548K9939
16178A6856j8910K2892m3962k9113r0233k5936N6271k8099L932J3548J40686O5958
$$ y = [-21842, -57527, -60902, -108776, -68260, -1740, -114865, -103761, -55081, -81382, -106581, -40957, -65339, -177673, -157257, 26742, 45907, -7304, 85345, 155786, 162002, 155504, 87872, 63047, 20545, 61760, 249, 28884, 76441, 17073, -70559, -81447, -17631, -46352, -72075, -48405, -125807, -191195, -115389, -73111, -122871, -181311, -197610, -167169, -147380, -172877, -178864, 5519, 177496, 257455, 269394, 95788, -73023, -66860, -106719, -141331, -181270, -185590, -93433, -47383, 46112, 132648, 30324, -100025, -154316, -251289, -224076, -190890, 2145, 18587, 12065, 26360, -73757, -83890, -173862, -122035, -158373, -157820, -96371, -3027, -2275, -3535, -13083, 16856, -2054, 20838, -23124, -52237, -142470, -168406, -112135, -140234, -136302, -122754, 17932, 83890]
16166H3890o3813k3629l8537o0778p0335K2825L6359M2847L3124n2603r7041n5198
16154b42889O4593Q1318k2864J5523j4306J5694k2656r912J4859j19178n5557
16143b95375K8719J08157J8561Q2708O2582m0775M145q2523o2063J1252L219P9441
16131h1952K12970M6936p6822j55746o2701o8365M0908N824l4210Q474J24820
16120c9864M2401o1270o8486J386m3555N4748K2298M5222L5992K0744P4101K4199
16108A07916l9717K2707n1587j33853L3254M8472l6662n5461n3734k7977K3343
16097a63299O3560p9429J8453k8746j03963p6714M2033L8641Q8365J0139q3567
16086b74527N0049m9185J9767J05077J05732p2963j69471n7795M5835J44631M8261
$$ y = [83890, 20077, -3552, -42089, -102867, -173202, -150377, -114018, -71171, -38047, -90650, -187691, -242889, -178296, -96978, -119842, -104319, -118625, -102931, -125587, -135499, -120640, -239818, -295375, -266656, -158499, -139938, -57230, 5352, -35423, -31278, -113801, -175864, -164612, -161393, -81952, 131018, 177954, 101132, -54614, -117315, -185680, -144772, -138948, -173158, -164684, -39864, 2537, -58733, -127219, -125833, -169388, -114640, -92342, -47120, -11128, 9616, 83717, 107916, 68199, 90906, 39319, -94534, -61280, -12808, -49470, -104931, -158665, -186642, -163299, -99739, -179168, -160715, -189461, -293424, -370138, -328105, -289464, -201099, -190960, -274527, -224478, -273663, -253896, -148819, -43087, -116050, -285521, -343316, -297481, -152850, -104589]
16075a04589K3976L0436j50781j02754O3427R4998R0742L0094j20233L9557L0308
16064g4819m5520J9961p4590R260K227k1459P8827P1754k2603j33067l330m0596
16052b33955M676k682q2661n49J43479O0177K7230J09133J2928p144l5419Q0333
16040G5546r042n7789L8702P0350p1022k8536r5558n8758m2662N8739R9527K5089
16028D586r5400l5542Q5348R7307j31462j00463L3861L4184K8177M3914k4908
16017f0398r697j1183O1442K1228j14525n1019J1581O6408J41657K5018K1714
16006A02226n0744j87921j18350Q2788k421J2039J12386l6865q156N4827M391
15995c5800j10491p5221J27889j9485l3207P9647J62638k5702j72214m9837P6803
$$ y = [-104589, -80613, -50177, -200958, -303712, -240285, -145287, -54545, -24451, -144684, -105127, -74819, -120339, -100378, -174968, -165708, -163481, -184940, -106113, -34359, -56962, -190029, -193359, -233955, -229279, -231961, -314622, -315171, -171692, -111515, -84285, 24848, 37776, 30632, -4787, 75546, 66504, 8715, 47417, 117767, 46745, 18209, -77349, -136107, -178769, -120030, -20503, 4586, -90814, -126356, -41008, 56299, -75163, -175626, -141765, -107581, -79404, -35490, -60398, -70095, -81278, -19836, 1392, -113133, -164152, -152571, -86163, 55494, 80512, 102226, 51482, -136439, -254789, -172001, -174422, -162383, -49997, -86862, -95018, -40191, -35800, -146291, -221512, -93623, -113108, -146315, -66668, 95970, 70268, -101946, -151783, -74980]
15984g4980N7852r871J23193M9483o1945R1557j2472q6729l1098n5135j61648
15973a71793J8308J13066J0940K6239J23781p2049q7225r4711N9677R6870O1725
15962H4828l6208j11409j42206r0479o7500P9453L7662j22571N6266J04207J56598
15951e1359J1303N2818l27p3593m9138k2954L6698j7417p2871l461J30538O0736
15939I73l801K1126o2331M3576P4765O873L6090k3557o070J4670p6756j54484
15927a28926P3214l1472L4046M4617j27379O0980O5392o2522L4541L3959j02710
15916a06260l1706M6624O3455l3541r1117r7266l7403R9400R5939m4407K4231
15905a12051o3498m4602J20151J40664k2727o7365J3074o7451l2080N5559K9584
$$ y = [-74980, -17128, -26999, 96194, 145677, 83732, 175289, 162817, 76088, 44990, -10145, -171793, -153485, -40419, -29479, -3240, 120541, 48492, -38733, -133444, -73767, 23103, 84828, 48620, -62789, -204995, -295474, -362974, -283521, -245859, -368430, -312164, -207957, -51359, -40056, 12762, 12435, -61158, -110296, -133250, -96552, -113969, -186840, -190301, -59763, 973, -2828, 18298, -44033, -457, 74308, 81181, 117271, 93714, 87644, 102314, 25558, -128926, -55712, -87184, -53138, -8521, -135900, -74920, -9528, -72050, -37509, -3550, -106260, -137966, -91342, -27887, -61428, -152545, -249811, -287214, -187814, -91875, -136282, -112051, -175549, -220151, -100000, 40664, 17937, -49428, -36354, -103805, -135885, -80326, -50742]
15894e0742j6574J8621k0500L3801J1319k0156o009m620M2094N6041m9066J2813
15882G022p2113L4227n9706o0309j74521M1835J39417O3612n1734k9130o1631
15871b23031m5768R2304P9985L3552Q3264J86475r633j5251n6693j16966k7108
15860a8870r6989l5371k197o7254L2779R2546M1416m520J22984M1376q6185m8138
15848b8423j10773m8501P7486P0701L5441k7098m4259L5322M3044R8606n7020
15837D4526r9398k0937l826M190Q3866p7025j60490l7647R7243K04302N7060j2553
15825G9311l329p6148j1426P3388L2308q9040q4088j9803J38978Q6132m5335o4208
15813A6740r2109M720R5445R4264N6329j03729J7765M3302q6734m2207n7264j81695
$$ y = [-50742, -67316, -48695, -69195, -35394, -24075, -44231, -50240, -54860, -12766, 43275, -5791, 7022, -65091, -30864, -90570, -150879, -325400, -283565, -144148, -80536, -132270, -161400, -223031, -268799, -176495, -96510, -62958, 20306, 206781, 197148, 181897, 125204, 8238, -18870, -115859, -151230, -153427, -220681, -187902, -95356, -53940, -58460, 64524, 105900, 19715, -28423, -139196, -187697, -110211, -39510, -4069, -31167, -75426, -40104, 2940, 101546, 44526, -54872, -75809, -79635, -75445, 8421, -68604, -229094, -266741, -169498, 34804, 91864, 79311, 75982, -166, -11592, 61796, 94104, 5064, -79024, -98827, 40151, 126283, 80948, 16740, -75369, -70649, 24796, 119060, 175389, 71660, 89425, 132727, 45993, 3786, -53478, -235173]
15801b35173L3113P4673l7887l6049L0571K430N9841J16697K8253k7012r0621
15790h1164N5577j1969K4224J06621l1962L8918R9474k2828j48839k42648l2467
15779b47063J5343N9979R595K2490J65819R832j16835k5920N4268o163L5716o028
15767b8967P16q0431q0519J10738M8465m3673M0660K27396l1518j19886j41699
15756i8718l2430P1672l3163m0396l4127O6244Q5080j4951k9636J5013o0625j8969
15744a25006N049L6264J2102J4288o7160r1295m0578Q9902O3680P0726n9028j12026
15732b03082o8739L4175J57171L9851j29584k4291J8416j73482k0752J62707P7703
15721a29907k1251j4348L3161K1314R9944J35660M9837p946Q888n7529J3093p2411
$$ y = [-235173, -202060, -127387, -165274, -201323, -170752, -168322, -108481, 8216, 36469, 9457, -81164, -25587, -37556, -13332, 93289, 61327, 100245, 199719, 176891, 28052, -214596, -247063, -231720, -171741, -162146, -139656, 26163, 35995, -80840, -106760, -52492, -58655, -22939, -28967, -28251, -108682, -189201, -78463, -29998, -73671, -33011, 194385, 162867, 42981, -98718, -131148, -59476, -92639, -133035, -167162, -100918, -15838, -30789, -60425, -45412, -106037, -125006, -119957, -83693, -71591, -57303, -124463, -215758, -256336, -166434, -102754, -32028, -91056, -203082, -271821, -237646, -80475, -40624, -170208, -194499, -176083, -349565, -370317, -207610, -129907, -151158, -165506, -132345, -111031, -11087, 124573, 174410, 166464, 175352, 117823, 130916, 58505]
15709E8505j06285j04201O4240J11870o9230j38510M0070R3199J40280k7662j06654
15698d4378q7972q670j20191Q9383m0297M2083K01567L2337j1504p0392p621K6551
15686H96K8532P2146l170p5781P3258l5978k7491J23930Q5850l7769q3017l4943
15674H6463j27060j11543p2176L3961R9950M6703j3389q0501M2008n0322N8145
15663h7761Q8700p3953L1065L4398Q785l9765O5579m1075m4852p1221O2366L9210
15651b8524K3302M5066j04489M7916P1307r9216l7909J56666o2826L1865J94507
15640B37665k9365n2950j58512l6112l8735n2181k5656O5193m3435n0664L1930
15629a52822M5171K5164p1108J6870J43224k7966j1360j20706j44757O4745J00329
$$ y = [58505, -47780, -151981, -87741, 24129, -45101, -183611, -143541, -50342, 89938, 62276, -44378, -132350, -141020, -261211, -171828, -212125, -170042, 31525, 63862, 52358, -18034, -25655, 896, 29428, 101574, 98404, 22623, 95881, 59903, 32412, 156342, 242192, 204423, 121406, 86463, -40597, -152140, -224316, -190355, -90405, -43702, -57091, -137592, -95584, -145906, -87761, 939, -73014, -41949, -7551, 1234, -38531, 27048, -14027, -58879, -130100, -67734, -28524, -5222, 39844, -64645, -16729, 54578, -44638, -82547, 74119, 11293, 43158, 237665, 208300, 155350, -3162, -39274, -78009, -130190, -155846, -90653, -134088, -184752, -152822, -107651, -82487, -153595, -136725, 6499, -21467, -32827, -153533, -298290, -233545, -133216]
15618a33216P4004N8262n5176J6995J49895k3926J0666j0192K3915R541L8135
15607A58903o8244m3744J2968j1399j8070m5195o5162J01324L0178j14737o2078
15596a25256K3641r4882K4407J37907Q3180n771N355p6093J04586J8399p5265
15585B0208j52143N7426M5295M205m736M9879M3217m105r4407q490n1107r418
15573a04176k356j17467o1644K6422p859O7297O0257P9881M2231O4921O4471q0010
15561C1968m5228Q5555O2844k422r7612n6265n9955j13746k8147J13920J00879
15550h209J0718n2246K9m2140p2621m4118N8128P1718m5097N2024N0241n0439
15538g2012m2493N8168J4534m3958q7097M0571j0261j04220N6813L1557N361M4223
$$ y = [-133216, -59212, -950, -56126, -39131, 110764, 86838, 97504, 87312, 111227, 120768, 158903, 90659, 46915, 59883, 48484, 30414, -14781, -79943, 21381, 51559, -63178, -125256, -101615, -196497, -172090, -34183, 48997, 43226, 48581, -27512, 77074, 95473, 20208, -131935, -74509, -29214, -25009, -29745, 20134, 63351, 59246, -35161, -43651, -94758, -104176, -106532, -223999, -285643, -259221, -267080, -199783, -139526, -59645, -17414, 47507, 111978, 31968, -13260, 72295, 135139, 132717, 35105, -21160, -81115, -194861, -223008, -109088, -8209, 2509, -49737, -49708, -91848, -164469, -208587, -150459, -78741, -123838, -71814, -21573, -72012, -114505, -56337, -41803, -85761, -172858, -132287, -142548, -246768, -189955, -158398, -153037, -108814]
15526a08814l4878o8228M833J16334P2910k3238L5969N0516R381j31322p4303
15515a50840M1414J07802n580n8817n0446M5082J32619J5231J5109j78933m8179
15504a35538O5897k9221L3650k9498L8197q5866L4243M8680N4463p7863n4792
15493a37648l8167p8509M1849P9594M8415l4998L4886m4509l1400J0298J8534
15482a31655L8404j9886J14334n6210r5473M3621L8232j2455k5554n5356J8454
15471a43544Q757P4793J2860l7423p3748M5500n0923M7587J23496O9082P2236
15460A48673j25442j87904m9028J38926R8033l1988n9753r4875p3396J6466P4821
15449a45467R4232j02111N6090L4356q4714r3494o7654N9145L806K5720J16440
$$ y = [-108814, -143692, -211920, -207087, -90753, -17843, -41081, -5112, 45404, 54785, -76537, -150840, -109426, -1624, -7204, -66021, -116467, -71385, 61234, 76465, 91574, -87359, -135538, -69641, -98862, -65212, -94710, -56513, -142379, -108136, -59456, -4993, -82856, -137648, -175815, -254324, -212475, -132881, -84466, -119464, -84578, -129087, -160487, -150189, -131655, -93251, -113137, 1197, -55013, -150486, -106865, -68633, -81088, -106642, -161998, -143544, -134787, -59994, -47134, -84557, -158305, -112805, -163728, -116141, 7355, 76437, 148673, 23231, -164673, -213701, -74775, 23258, -8730, -68483, -163358, -236754, -220288, -145467, -51235, -153346, -97256, -62900, -147614, -241108, -308762, -249617, -245811, -220091, -103651]
15438a03651J08304o4106p4112J21063J18498o9068r7680q2958N7421r2431j41239
15427c19959J9458O9724J11609j674l1781J20709O9708L80N2067j18029k9852
15416e7640K9119O4179J0145j15199N4383m4554J6959J2958L5220j01095l1595
15405a27120J03244M6392J1182J34467n1867m3229j20486l6642N498J15271M4829
15394H1539j17195j21939n253J3126L4714k7305N3130R31L8940J21749k6906o3303
15382a7772k09641j18280j04750J78636K08508J16056J40628L4217p3236n6747
15372I7619j2062L1813r3779P455J74538N0873r4877o6123k7810p9998j13651
15361a26002J23653m185J0422p7954n9143R6165J1775r3351Q497j0138N6378J10150
$$ y = [-103651, 4653, -59453, -133565, -12502, 105996, 36928, -60752, -143710, -86289, -178720, -319959, -300501, -230777, -119168, -120842, -152623, -31914, 37794, 38174, 90241, -27788, -57640, -28521, 35658, 45803, -69396, -15013, -59567, -42608, -29650, 5570, -95525, -127120, -23876, 22516, 33698, 168165, 116298, 73069, -47417, -84059, -78561, 36710, 81539, -35656, -157595, -162848, -149722, -115008, -142313, -89183, -88252, -49312, 72437, 45531, -17772, -227413, -345693, -450443, -271807, -63299, 52757, 193385, 227602, 154366, 97619, 85557, 117370, 23591, 31046, 205584, 256457, 161580, 95457, 67647, -12351, -126002, -2349, -6534, 3888, -74066, -133209, -37044, -25269, -118620, -110123, -120261, -63883, 46267]
15349D6267K3668o6891k6099j7331l5383j68923Q0644J02684n9094P2630J20241
15338G2413Q0866L0641n5897j15928p9731L6930P0077q4501r7764q5370P6240
15327a52024M4782J06343l6608p7593P8004J8153j344j6826P8987M1304j05696
15316b2518O0796M3744r0278j03677j053P6950r1754N1267J62159J3290m6509
15305E2417N353R2881k2757k5041j00976j37748M2938L3735m7016M2471K5390
15294c8353n1711N2003P2179l0874m1133k6982m8751L7624m655m7116j08122J57590
15282g8301J20296P5215n7730r3641J512P7494Q0688m722k452j2649j2938J15521
15270B08293j41507m3276q2659k4216J23744n0752j61132r1082J13162J13213
$$ y = [46267, 69935, 3044, -23055, -40386, -75769, -244692, -164048, -61364, -120458, -47828, 72413, 153279, 183920, 128023, 12095, -67636, -30706, 39371, -45130, -142894, -228264, -152024, -107242, -899, -37507, -115100, -37096, -18943, -20287, -37113, 41874, 83178, -22518, 38278, 82022, -8256, -111933, -112986, -36036, -127790, -76523, 85636, 98926, 52417, 57770, 150651, 127894, 102853, 1877, -135871, -92933, -59198, -106214, -63743, -38353, -90064, -38061, 34118, 3244, -37889, -64871, -113622, -75998, -80653, -127769, -235891, -78301, 41995, 117210, 59480, -34161, -32649, 44845, 125533, 120811, 118359, 105710, 92772, 208293, 66786, 23510, -59149, -83365, 40379, -10373, -171505, -262587, -149425, -36212]
15260c6212m1291l78l1919L2676m100r5341n5673J00952J70312j30869j31642
15249b23485R6453k657L7000J42953M4029k3234j5587m2634o0826o8700m3785
15238a60473M0747M3901j0973o476J2207O1382n2316o1467N5028m274J9396m5961
15226a09279J3170L3644j3512O672J977M6187m2126o8362K0458k1607r539m1982
15214a84299J18643L0991k8500K0617k9982j06359L075Q3144K4591J09091P7242
15203A18254k2648l5078j19059L1889L3681K79L1741j7303J7449K3335n0199k8997
15191a6656q325n7625M5316M9127N9761K7317j74548m5696n470r452J1218o6514
15179a91547L8675J28635J22958M5397L9622o8117M019r5582o5931O983L9787
$$ y = [-36212, -77503, -77881, -109800, -77124, -81224, -176565, -232238, -131286, 39026, -91843, -223485, -127032, -129689, -92689, 50264, 94293, 71059, 55472, 12838, -47988, -116688, -160473, -119726, -75825, -86798, -93274, -81067, -19685, -72001, -133468, -78440, -82714, -63318, -109279, -96109, -62465, -75977, -69305, -67328, -21141, -63267, -131629, -111171, -132778, -142317, -184299, -65656, -34665, -63165, -42548, -72530, -178889, -175814, -92670, -68079, 41012, 118254, 95606, 60528, -58531, -26642, 7039, 7318, 39059, 21756, 39205, 62540, 12341, -16656, -24981, -82606, -37290, 11837, 71598, 98915, -75633, -121329, -126799, -136251, -125033, -191547, -152872, -24237, 98721, 144118, 183740, 115623, 119642, 24060, -41871, -34888, 4899]
15168D899O1134k608N1362r131o4475r4423p2460n5353n0565J14609J54223l0557
15156F655o6919j60987J6751L9030M9123J29426p5600K310L0670n3558j14257
15145a97356n593J08732J27932j02599j03496j21834L9558J30217q011K2172P2731
15134c7547j78330M4729K3228L0704P4099O5271N0684r9676j3372J4459J2140
15123a3611R2230j3938K6519J05745j7078j13719k13906o8928l9035J42802J66791
15112E3872P2535n4588j16341J38262J57600m6346R031j6566k7733j21297j33949
15101h5520J07111P058j21305j20755L9644n127j01188J48160L5402m9824K544
15090a43800P9316J44173K0630q8096k278j7166j68742p5094M7868k2259O2994
$$ y = [4899, 66033, 63425, 114787, 105656, 41181, -53242, -125702, -181055, -231620, -117011, 37212, 6655, -60264, -221251, -204500, -165470, -116347, 13079, -62521, -60211, -29541, -83099, -197356, -202949, -94217, 33715, -68884, -172380, -294214, -254656, -124439, -132450, -110278, -37547, -215877, -171148, -147920, -117216, -43117, 22154, 72838, -26838, -40210, -25751, -13611, 78619, 64681, 91200, 196945, 179867, 66148, -147758, -216686, -255721, -112919, 53872, 126407, 71819, -44522, 93740, 251340, 204994, 214025, 197459, 169726, 48429, -85520, 21591, 28649, -92656, -213411, -173767, -178894, -280082, -131922, -96520, -146344, -143800, -64484, 79689, 100319, 12223, 9945, -7221, -175963, -251057, -203189, -225448, -162454]
15079a62454J01803O70n0725k5726m339K9845J1343Q322N0171K4120m6776n1664
15067a15410p5690q015L9261J0881j3430Q0402J9790N4105j54920o6120P661R1514
15055a29971J01780R013J2365r2742j9392J03230L9635o052l0506j05835j94656
15044c13131p1849J98940J52839J1534n0731j4608O0101J908J11609n658j8130
15033F2824j14866j30206K3614J16726L3304o792j04160P3443N8588k2136j6061
15022b5722p38K8651P9968J6341K8545l6006j405k5266j20712j05554J44585K20101
15010B02788m3346j00696l9538j3763j11026J09101N2904j22437j23942k4470
15000b14425Q7652P5046n4323K9362R5873k2667o5325J7495K3964m2069K7902
$$ y = [-162454, -60651, -59981, -110706, -136432, -140771, -110926, -99583, -91261, -41090, -16970, -63746, -115410, -191100, -199115, -159854, -148973, -162403, -82001, -62211, -8106, -163026, -229146, -221485, -129971, -28191, -19178, -6813, -99555, -118947, -15717, 23918, 17866, -12640, -118475, -313131, -384980, -186040, -33201, -21667, -72398, -87006, -26905, -24997, 86612, 80954, 62824, -52042, -182248, -158634, -41908, -8604, -15396, -119556, -46113, 12475, -9661, -25722, -26460, 2191, 82159, 98500, 127045, 91039, 89634, 64368, -56344, -161898, -17313, 202788, 159442, 58746, 19208, 5445, -105581, 3520, 56424, -66013, -189955, -214425, -126773, -51727, -106050, -76688, 19185, -3482, -68807, -51312, -27348, -69417, -41515]
14989d1515M4019K33J3203k3992J49307M1628O5116N1999m9194j22105j13384
14978A5315j99792l7896P2081j1584p9824j1789M3011J0894L8299K24510P7318
14967A40543m8260j80340j11309p2081J7414O5285j7103J32750J10207p7506r167
14956d9567k8714L4259J39276r0203K5910M3508J06553m0547j11257N1837n0439
14945C0616o9058K6187K4587R0118Q6551p5980n4858l0287j6402m8087J1489K9650
14933D526l2350p7842q872Q3583J22175K115j22688j02103O7765J40843L8118
14922A15270o0377j37268q8172M2582J8266P9372N4084j01645l7402j8753R603
14911a24440k5124m2594p303j2775K9467K2474J31488k0803l3153r028K08855
$$ y = [-41515, 2504, 2737, 15940, -8052, 141255, 182883, 247999, 299998, 250804, 128699, 15315, -184477, -222373, -150292, -161876, -241700, -253489, -210478, -199584, -161285, 63225, 140543, 92283, -88057, -199366, -271447, -254033, -188748, -205851, -73101, 37106, -40400, -49567, -78281, -44022, 95254, 5051, 30961, 74469, 181022, 140475, 29218, 81055, 30616, -38442, -12255, 12332, 102450, 189001, 113021, 58163, 27876, 11474, -36613, -25124, 4526, -27824, -105666, -114538, -30955, 91220, 93335, -29353, -131456, -63691, 77152, 115270, 54893, -82375, -170547, -127965, -109699, -30327, 23757, -77888, -115290, -134043, -124440, -149564, -192158, -199461, -212236, -182769, -160295, -28807, -49610, -82763, -91791, 117064]
14900A17064K8169l4809J6485j01880m6813M6982J23458K3143Q231p8579o1525
14889C9926m3699O6314m6776k3793J10324Q4873o196n1425j26833K83N6043l3852
14877B5189p1521N2008M6248k0811j7402R767k1493o524j7973j27675J8947L07
14865a30933l2550L8735Q0035L5280n8837M1673q106n1106j273j11617Q9611N6397
14853e2691P5803J68619o0894j8241M1027j14730j05209m2410k5914l2946J00814
14842f6772P6969o2227k6415R37J38646J6506j15996j06420r366n0965j04751
14831c09854Q4093J83162R4734K5423K872K473j03723r6578k623M5480M0481Q3413
14819D9353m9685J802j0506m7498O8610k2043m8796M3350K4533m8061O6275Q8542
$$ y = [117064, 145233, 110424, 126909, 25029, -21784, 25198, 148656, 171799, 180030, 101451, 39926, -3773, 62541, 15765, -8028, 102296, 187169, 180973, 129548, 2715, 2998, 59041, 25189, -46332, 5676, 51924, 31113, 13711, 23478, 1985, -4539, -22512, -150187, -131240, -130933, -163483, -124748, -44713, -9433, -68270, -26597, -34703, -85809, -87082, -198699, -109088, -52691, 23112, 191731, 130837, 112596, 153623, 38893, -66316, -108726, -134640, -167586, -66772, 10197, -52030, -78445, -77508, 61138, 77644, -38352, -144772, -154138, -205103, -309854, -225761, -42599, 52135, 77558, 80430, 82903, -20820, -117398, -120021, -74541, -34060, 49353, -332, 1470, -9036, -56534, 12076, -9967, -58763, -15413, 9120, -38941, 27334, 115876]
14807A15876j22260J0942l1126p3311J28734J48699O1101j34972j01327m6288
14797d3932o2431J14599J48470k5899n6114l4807K3191j07009k3112Q0236Q6954
14786A00146L3394o9144N6169J08947n9000q9984K4601n737L0739q3235j03284
14775e6388P3598k2406j23974k8962K45651n937j3600K4586o8399r5360j46821
14764b18012O9346R2292J2267n8472j5010p036K8484P3577K5198j33753K5373
14753a05746M0926J18661M5026l5448q8004l3515n2742J3808R8370J0955j94067
14742a81776j5796Q3709Q4612N8642m7708j08916p1113O2354J25639R3803k3092
14731F0358o8990L9764j6509j38659l2424J6639J1579Q945K2181L9201q8420K587
$$ y = [115876, -6384, 4558, -26568, -99879, 28855, 177554, 238655, 103683, 2356, -43932, -106363, 8236, 156706, 130807, 74693, 39886, 63077, -43932, -67044, 13192, 100146, 133540, 64396, 120565, 229512, 170512, 80528, 105129, 99392, 130131, 46896, -56388, 17210, -5196, -129170, -158132, 87519, 81582, 67982, 92568, 24169, -71191, -218012, -148666, -56374, -44107, -102579, -117589, -124625, -96141, -22564, 2634, -131119, -105746, -64820, 53841, 98867, 63419, -24585, -58100, -110842, -97034, 1336, 12291, -181776, -197572, -113863, -29251, 29391, -18317, -127233, -198346, -135992, -10353, 83450, 60358, -8632, 31132, 14623, -124036, -156460, -139821, -128242, -119297, -97116, -57915, -146335, -143748]
14719a43748q183j7012P1465P3738Q6215L5219n646o6339p044O5138o7966n6465
14707d0628j06777N8005J2314Q027Q726j5627N3457m5835K2399O325J4559l7410
14695f2465J2597J18696M011j8919o617j5565j7916j23556R1683J05024O5727
14684A52700p78j12564l9832q6203q0919J8515O6010O2693P876L2819L270q1347
14672e7760p5865N9062J8147J108k626K5021L6588L5666q8394n3880L8056K7046
14660c7831j30280j1155O6706k8328M9844Q8834J08126L2855o1220l1762n3141
14649g352L9271K7867O0815l2676j4624m1385o6057J8721O663p0483P3799k0690
14637b6131O3677J16798M3704j20270j41999q9444K0313l6935J23140J37699J3816
$$ y = [-143748, -151931, -168943, -97478, -23740, 62475, 97694, 92048, 25709, 18665, 83803, 15837, -40628, -147405, -89400, -77086, -69059, -60333, -75960, -22503, -68338, -45939, -39614, -25055, -62465, -49868, 68828, 72839, 53920, 47303, 31738, 13822, -109734, -18051, 86973, 152700, 151922, 39358, -474, -86677, -167596, -149081, -83071, -20378, -12502, 20317, 23587, -57760, -133625, -74563, -56416, -55308, -57934, -32913, 3675, 39341, -49053, -102933, -64877, -37831, -168111, -179266, -112560, -140888, -91044, -2210, 105916, 138771, 77551, 45789, -7352, 31919, 59786, 120601, 87925, 73301, 31916, -34141, -15420, -8757, -79240, -5441, -26131, 37546, 154344, 198048, 77778, -64221, -153665, -133352, -170287, -47147, 90552, 104368]
14626A04368N239l1409r4717k04505n1849J24990J28029N3117k9078O0004k2032
14615D2157j30179l2618K8913n1030o0578R612J00151J36012K4263o4161k0294
14604a7752K5404l4987j4285J3431P1852j2331n050p4092O7731P1234O3106j45835
14592H426j13981p358M7563P5417J45181o651r0380r2268j35124j27317o9591
14581c66083J27142m765r510j4889N1741K4398n0967R3174J46579P6028J2114
14570H4962j07895r0914L1681M8208k86q6097J1687P1592m0301n2105k298l4520
14558a66286J35783N0631j31740L3153r3708N5113J1552j1675R025N8083J7698
14547c2371O8270K3985r885l7930J08016M3404l2104K8480j33893j17258j52430
$$ y = [104368, 109607, 78198, -16519, -221024, -272873, -147883, -19854, 33263, 4185, 64189, 42157, -88022, -120640, -91727, -142757, -203335, -193723, -93572, 42440, 66703, 2542, -17752, 7652, -27335, -41620, -28189, 43663, 31332, 26282, -47810, 19921, 91155, 154261, 8426, -105555, -112913, -65350, 10067, 155248, 148597, 58217, -34051, -169175, -296492, -366083, -238941, -243706, -253216, -268105, -216364, -191966, -242933, -149759, -3180, 72848, 84962, -22933, -113847, -82166, -33958, -34244, -120341, -108654, -37062, -77363, -129468, -131766, -166286, -30503, 20128, -111612, -78459, -172167, -117054, -105502, -117177, -108152, -50069, -32371, 35899, 59884, 49999, 12069, 120085, 163489, 131385, 159865, 25972, -91286, -243716]
14536b43716j9710M4561Q1433P9375M0272L7540r8151L0976R6353L176J01414
14525A53523J14459N7617L6515p5053k77964j01312N9414L7184K9839Q6982k9997
14514I1207j2479q1594N410P5662N7524r0897n5616O720M5592K4269l012q6306
14502b3520o1238J1103M5680n766k2881o463J05572M7031N4222L4217R378o8032
14490A19303j60619r686p3733m8797M9817J40571m4896j12182N4259M8793J88
14479c6982N0622j07874L2394Q2350P2984L8449q9752p2223N1708M389M9923K9492
14467A05480j5703j10014r3294p3058J02721J53274J93806J1282j77799j12048
14457a5353j1730M224O3338l7981O4446l9049L6333j3750r5049o513J17628p0952
$$ y = [-243716, -263426, -218865, -137432, -58057, -17785, 19755, -78396, -47420, 48933, 52109, 153523, 267982, 325599, 362114, 287061, 9097, -92215, -32801, 4383, 34222, 121204, 91207, 78728, -2866, 2544, 78206, 135730, 44833, -10783, -4063, 41529, 65798, 62786, -23520, -84758, -73655, -27975, -33741, -56622, -63085, 42487, 89518, 143740, 177957, 187335, 119303, -41316, -51002, -124735, -173532, -123715, 16856, -28040, -140222, -85963, -37170, -36982, 13640, -94234, -61840, 20510, 93494, 131943, 42191, -30032, 21676, 26065, 75988, 105480, 89777, -20237, -113531, -186589, -83868, 69406, 263212, 274494, 96695, -15353, -27083, -22859, 40479, 2498, 66944, 27895, 64228, 50478, -44571, -51084, 66544, -4408]
14445d408m3686N1918k7090j02419J1347L9811M4509p3796j4500Q1265P3690l7269
14433f28L207m0529N8125m81p3614m8178J15647R0410j57316R5834J17837J6739
14421A77053k5340l3533n2537r8856J80347N7880j30359j26395L8622P362o5736
14410g1492l2137O4693K7264k9803l0468n8622p3736Q7805K17607J02275O5737
14399B69123n2570q8978r3817l9107q8754j17429p503L8829L4079K1654K6629
14388i7844Q0769M3595k6823q0606R685L6717J01052n9659K8721o5098j26926
14377a56417M6831p7913q0498J01046J07502o0550J2919N7095n3554L6828L0033
14366c6678k2982o0252j13545J18489K363j33117M5944K6517N2421j22863K4272
$$ y = [-4408, -48094, 3824, -23266, -125685, -114338, -74527, -30018, -103814, -118314, -37049, 36641, -628, 2579, -37950, 20175, 19694, -53920, -102098, 13549, 103959, -53357, 42477, 160314, 177053, 151713, 118180, 65643, -33213, 147134, 205014, 74655, -51740, -13118, -5756, -71492, -103629, -38936, -11672, -41475, -71943, -130565, -204301, -116496, 101111, 203386, 269123, 216553, 127575, 33758, -5349, -94103, -211532, -219035, -180206, -146127, -124473, -97844, -17075, 26520, -303, -80909, -71224, -34507, 66545, 6886, 35607, -29491, -156417, -109586, -187499, -267997, -166951, -59449, -119999, -107080, -49985, -103539, -66711, -36678, -59660, -119912, -233457, -114968, -112605, -245722, -199778, -173261, -120840, -243703, -219431]
14355b19431P8916J15449J66650N9598n491J7371j07416j89631r957L4978J9512
14344c9452k8223O2898K295R1625m4718J01204L7911j914j24108o20J40470o687
14332A90681j69165J0674Q4914O5953j8753o3767Q2374P9538o6362j08588J7654
14321A05153M6083m9271q8035j3435m2498k363M4072Q9323j2926l3138K7081J3325
14309H3371k6637p6320q134Q0106J63653l3331p2787m3034J55584J10173K7969
14298C60613j5124j45352j8271P8524m5173j01116J6120L1242l9824r518k0587
14287I1534K5261j29638l8988k9036R4888L926N5219J1907m1084R6477K1845q274
14275A54037O8440k4674j27899p2004j5813R7278K2594p5951M2628J15694M1542
$$ y = [-219431, -140515, -25066, 141584, 201182, 195691, 213062, 105646, -83985, -93942, -58964, -39452, -67675, -4777, -2482, 89143, 44425, 145629, 183540, 181626, 57518, 56898, 197368, 190681, 21516, 32190, 117104, 183057, 164304, 100537, 182911, 262449, 196087, 87499, 105153, 151236, 101965, 13930, 495, -42003, -44366, -294, 89029, 76103, 42965, 70046, 83371, 56734, -19586, -27720, 52386, 216039, 182708, 109921, 66887, 222471, 332644, 360613, 345489, 200137, 181866, 260390, 215217, 114101, 130221, 161463, 121639, 112121, 91534, 116795, -12843, -51831, -80867, 14021, 17947, 73166, 85073, 43989, 140466, 162311, 154037, 222477, 197803, 69904, -2100, -17913, 79365, 101959, 26008, 68636, 184330, 225872]
14264B25872K1694Q6419p3583q022l5248q3588r535k7090J8720K9394n976R4756
14252B33813j10476j80787J0553J7344P4133O0378l182J66128J15930p8550M8412
14241C53696K8815r3663J11084j0602j2574m7042j22120P2973J44776m4689p3045
14230C07609j23175r3377q2726L6817J02143J35350Q880j92785j02328j17607
14220a21199J0767M6653R6980P2386M12l8680J9355k3779J05608O6687j2826n5514
14208A66850j00799r0793M503K9378J32405p0513J5417n5101L596j03242k5867
14197i4166j48065m4814L8489Q0844K8264J76104J80812M5426r930k9349N0154
14186B73769p519M9887m4137o2045P970l0425n9892m8583Q076K4665j27465j57
$$ y = [225872, 247566, 333985, 260402, 252380, 217132, 133544, 124009, 96919, 115639, 145033, 139057, 233813, 123337, -57450, -46897, -29553, 44580, 104958, 101776, 267904, 383834, 305284, 353696, 382511, 288848, 399932, 389330, 376756, 329714, 207594, 280567, 425343, 380654, 307609, 184434, 91057, 8331, 45148, 147291, 282641, 291521, 98736, -3592, -121199, -110432, -63779, 33201, 105587, 105999, 67319, 86674, 62895, 168503, 235190, 222364, 166850, 66051, -24742, -20239, 9139, 141544, 71031, 86448, 31347, 34943, -68299, -94166, -242231, -287045, -248556, -167712, -139448, 36656, 217468, 262894, 252964, 223615, 273769, 266250, 316137, 272000, 209955, 217925, 187500, 127608, 79025, 87101, 111766, -15699, -15856]
14174a5856Q6282K5831R8397K8266j28546l1509M4343p1068J27795L875q7136
14163H0674l7580n6q8191k7579n3742o0361P6523J20372j37832L7996k0739j3076
14151a23591R3785M8418l611n9401l6134l7540M2527p6624j136J02076J43651
14140I2420J33704L2470j18978o5670N5073j8844j69581O604m1416J5838L149
14129g5231Q5209K118m9914j4200j31777k5292Q0033P6649J50365l346p3453J73416
14117A94577M8562k6165l7036q5801j5024N6814J1069N0208L4921j43831k07992
14106a19698L3584J7181r8615M8633P1290J3647K3228n3129Q8144J05852K1029
14095A51146P3167j8715m2674L7835J6833J4177j84331q207j0128k1146J11890
$$ y = [-15856, 70426, 96257, 194654, 222920, 94374, 62865, 107208, 36140, 163935, 167810, 80674, 43094, 43038, -45153, -72732, -126474, -186835, -110312, 10060, -127772, -89776, -110515, -123591, -29806, 18612, 15001, -44400, -80534, -118074, -75547, -152171, -153307, -51231, 92420, 226124, 258594, 139616, 73946, 129019, 110175, -59406, -52802, -94218, -78380, -75231, 9978, 12096, -37818, -52018, -183795, -209087, -129054, -52405, 97960, 94614, 21161, 194577, 243139, 216974, 179938, 94137, 79113, 135927, 146996, 197204, 232125, 88294, -119698, -86114, -68933, -167548, -118915, -47625, -33978, -10750, -63879, 24265, 130117, 151146, 224313, 205598, 162924, 200759, 217592, 231769, 47438, 39231, 29103, 7957, 119847]
14084A19847J03149L7783o8894j88550j09236L0352O9863O1083N4271k4601o1408
14073B3659J11416K8568O946j07707j38324M4658N120J26286K5594p1749j50322
14062i5855l4216K8987O163K0906l7622P899J36464P9367L4460n2217l5723r909
14050D8704l355n5580J3489m4608K0791K2115Q7424K5021L4792r2891K8345R7360
14038A81607K1134j36586m2437M9316j972K4509L9718J12664k0365j38074j3370
14027G6144K2865Q768m601l2315n5785M5497j6421J336J10283o731p0441n4613
14015B3986r8L7712P5143n7186n5918O1747R6447J28124K2721q7672l9895N2022
14003B57133j8587j18493p4463n9510Q5743J35131j75026J0932M9567L822k2265
$$ y = [119847, 222996, 260779, 191885, 3335, -105901, -75549, -5686, 55397, 109668, 85067, 23659, 135075, 163643, 170589, 62882, -75442, -30784, -25664, 100622, 126216, 54467, -95855, -130071, -101084, -94921, -74015, -111637, -103738, 32726, 112093, 146553, 94336, 58613, 48704, 45349, -10231, 3258, -41350, -20559, 1556, 88980, 114001, 148793, 55902, 84247, 181607, 202741, 66155, 23718, 73034, 71062, 95571, 135289, 247953, 227588, 89514, 76144, 99009, 107777, 103176, 70861, 15076, 60573, 44152, 45488, 155771, 149040, 78599, 23986, 23888, 61600, 136743, 79557, 23639, 85386, 181833, 309957, 332678, 245006, 205111, 257133, 238546, 120053, 45590, -13920, 71823, 206954, 31928, 42860, 92427, 96249, 73984]
13992G3984L649k5079j6118p0046K7817N6227p0921j6301M7251J3440M3715K3762
13980I1380L185k2181P6952J3132J3198m9545j11101q0825Q956l0294J07926P3068
13968I3851J48759L8119j4324o9308j26816l597J06163L6649P0056m6464K2329
13957B55417L0984k2542r5185M7658p871K9195J0124m6655n7779o589q6777j5619
13945C4361Q7682J66326q5651p8576k6960o0386j2680k7568J46770N2815j9139
13934A76994J05481M7959k9078Q56p419O43J08220K3615o2035m8577j15549P0859
13922B71969J0465K1547P5780J12011j21293j66307j2806M8250m6925K9482J61997
13911C84170k5639k4657r790k09512K556O5675P9634j5837J02129k8371j805l848
$$ y = [73984, 77633, 52554, 36436, -33610, -5793, 50434, -20487, -36788, 10463, 23903, 67618, 91380, 94565, 72384, 149336, 162468, 175666, 126121, 15020, -65805, -56849, -87143, 20783, 93851, 242610, 280729, 266405, 197097, 70281, 66684, 172847, 209496, 279552, 233088, 255417, 286401, 263859, 168674, 216332, 208461, 237656, 247780, 201125, 143346, 136757, 49980, 34361, 122043, 288369, 202718, 124142, 97182, 36796, 24116, -3452, 143318, 196133, 176994, 282475, 330434, 301356, 302212, 294793, 295436, 403656, 427271, 365236, 316659, 201110, 271969, 282434, 303981, 379761, 491772, 370479, 204172, 191366, 239616, 192691, 222173, 384170, 358531, 333874, 324084, 114572, 117128, 182803, 262437, 246600, 348729, 320358, 318553, 314705]
13899C14705K265Q4501k5866o5341p3254l8300M5592J31769J15173L3419Q2723
13888F07386N2842p7576l4614L7646M6760R1777O3373R6983J28454N2643n5546
13877A010128j18655j51789N3417J13473Q4661J3458n2983M0848P742j4214K2484
13866A008570Q2503K92414J93373J16945J63203J12715j34816Q0967J01370l642
13856B013602k1866q9179M2955J50414J97977K53570J26573N9584J29428Q9224
13846B952282J50846J80224L31822K33593K51051J66490J92482K64325L33502
13837E056617K41194K54118L22324M27547N05734P23756O97007R47831J313205
13828A0489333J743407K421519L075334L536890L482380K969327K334134J894260
$$ y = [314705, 316970, 401471, 375605, 310264, 237010, 198710, 244302, 376071, 491244, 524663, 607386, 660228, 582652, 548038, 585684, 632444, 724221, 787594, 884577, 1013031, 1065674, 1010128, 891473, 739684, 793101, 906574, 991235, 1004693, 951710, 992558, 1000300, 986086, 1008570, 1091073, 1383487, 1576860, 1693805, 1857008, 1969723, 1834907, 1915874, 2017244, 2013602, 1991736, 1902557, 1945512, 2095926, 2293903, 2547473, 2674046, 2733630, 2863058, 2952282, 3103128, 3283352, 3615174, 3848767, 4099818, 4266308, 4458790, 4723115, 5056617, 5297811, 5551929, 5874253, 6301800, 6807534, 7531290, 8228297, 9176128, 10489333, 12232740, 14654259, 17729593, 21266483, 24748863, 27718190, 30052324, 31946584]
13820C1946584P41695o52237k070475l192274l522669l186957k890361k172252
13812A5001054j432608j101788q96058o11556l84319j75307j76630m92525l53609
13803I376654q3202K7366k43789j17402Q0720j06497n2053J30118J19787K8574
13793I160276M2336R6438M7286Q1766J11424L69980L33027L22481K78852K63617
13783A1107483K81348L59365N44287N00406N47736O74731J150210J353407J729520
13774A8248493K433778L549778M940704O389965P491191P155771O459713O104702
13766F2774095N104708K612473j233277m778097o407693p048068p562274p396992
13758C6064875o028403m389622l183487k392110j883229j488173j061263q56902
$$ y = [31946584, 32688279, 32036042, 29965567, 26773293, 23250624, 20063667, 17173306, 15001054, 13568446, 12466658, 11570600, 10959044, 10574725, 10399418, 10222788, 9730263, 9376654, 9293452, 9320818, 9077029, 8959627, 9040347, 8933850, 8881797, 9011915, 9131702, 9160276, 9202612, 9299050, 9346336, 9428102, 9539526, 9909506, 10242533, 10565014, 10843866, 11107483, 11388831, 11748196, 12292483, 12792889, 13340625, 14015356, 15165566, 16518973, 18248493, 20682271, 24232049, 29172753, 35562718, 43053909, 50209680, 56669393, 62774095, 67878803, 70491276, 69257999, 64479902, 58072209, 51024141, 43461867, 36064875, 30036472, 25646850, 22463363, 20071253, 18188024, 16699851, 15638588, 14781686]
13750A4781686o61536n89272m67594l05735k06609j41815q4338k63202l21760
13741A1739825j90975q2118q8223j35670k81441l34519l16904l35872j06070l6997
13731I831036O9148J63400K42260J11103L3129P7543L33324L15057M06494O73497
13721A2255991O27595P45607J027488J442639J932466K633374L484879L884623
13713B8034662L512729K782397K115352J296215J17490j608906l343621m346479
13705B8559839m330720l770092l061481k229101j630387j286051j107666r07422
13697A0236919p41441n10399m90929m76834l65679l71645k99682l19420k62850
13688F398040j7885l5794l8458j39208j77929k07899l78226m74806k93488j83196
$$ y = [14781686, 14120150, 13530878, 13063284, 12757549, 12550940, 12409125, 12324787, 12061585, 11739825, 11548850, 11466732, 11378509, 11242839, 10961398, 10626879, 10309975, 9974103, 9868033, 9831036, 9900184, 10063584, 10305844, 10416947, 10450076, 10527619, 10860943, 11176000, 11582494, 12255991, 12883586, 13629193, 14656681, 16099320, 18031786, 20665160, 24150039, 28034662, 31547391, 34329788, 36445140, 37741355, 37858845, 36249939, 32906318, 28559839, 24229119, 20459027, 17397546, 15168445, 13538058, 12252007, 11144341, 10236919, 9495478, 8985079, 8494150, 8017316, 7651637, 7279992, 6980310, 6660890, 6398040, 6380155, 6344361, 6305903, 6166695, 5988766, 5780867, 5402641, 4927835, 4634347, 4451151]
13678D451151m6581j72566l09713j84637q9524J07198k01675j48300q219j11270
13668C285864j62895j07017k4932j52853N728r4437m6273J1301l0919j45023l6235
13657B502309k0384j21077j3481J8707O7676j00633j44839N5226n9325k8486p6937
13646B078756n5575m8333m1926o7237m9634o233n9323j3458k4143K500n7194n4515
13634A603685j13776j32109M8435N4733L6097J1114O2090K9243p4485r7802q3524
13623A343701j16047m757o8148K820o5899r4227K2988J13713J2746m5014r7517
13612A004359R874r8693P2449l4715l7613j6696p354J9999Q0229Q4926J38281
13601A215046R3542n5366j23968n1773J2745n2372j3447j76730p6458k276M1520
$$ y = [4451151, 4404570, 4232004, 3922291, 3737654, 3648130, 3755328, 3553653, 3405353, 3397134, 3285864, 3122969, 3015952, 2991020, 2838167, 2843895, 2749458, 2703185, 2714486, 2683567, 2538544, 2502309, 2481925, 2360848, 2347367, 2366074, 2433750, 2333117, 2188278, 2243504, 2184179, 2155693, 2078756, 2023181, 1974848, 1932922, 1865685, 1816051, 1809818, 1750495, 1737037, 1712894, 1715394, 1658200, 1603685, 1489909, 1357800, 1406235, 1460968, 1497065, 1508179, 1570269, 1599512, 1525027, 1427225, 1343701, 1227654, 1222897, 1154749, 1157569, 1091670, 997443, 1020431, 1134144, 1146890, 1101876, 1004359, 1014233, 915540, 987989, 953274, 915661, 898965, 891611, 911610, 991839, 1076765, 1215046, 1308588, 1253222, 1129254, 1077481, 1090226, 1037854, 1024407, 847677, 771219, 768943, 810463]
13590H10463m0905M7734L7145N080J4119m3849j49513j43127M2187j8630P6635
13579F37339J02197m9136O6428J28250K8767p9679j71994q0623r643L5514l3188
13568E74232j29770O0656M876n7068p0961j5484j2420m4875O506j1442Q1614M952
13556C90816J6681O4410Q5948k2754J4145q1859j8590J6877Q8947O0924q1096
13545E34449p1455l9981p9661J27625J23098j39561j77637j46734l3600J40907
13535B37450R7122m9122k2318J05994K7362o1369o1825K4376r282L026n4510N368
13523B42272Q6537N6798L8844p9144j84796j4199N8333M4636J66978k1385n8469
13512C36405r1530j21347j3501J15627j6475k5530Q3225p577j3514k1273L8731
$$ y = [810463, 769558, 817292, 854437, 859517, 873636, 829787, 680274, 537147, 579334, 560704, 637339, 739536, 690400, 756828, 885078, 913845, 834166, 662172, 581549, 571906, 607420, 574232, 444462, 505118, 509994, 452926, 381965, 366481, 354061, 309186, 315692, 304250, 385864, 390816, 407497, 471907, 557855, 535101, 549246, 467387, 448797, 465674, 554621, 615545, 534449, 462994, 423013, 343352, 470977, 594075, 454514, 276877, 130143, 96543, 237450, 334572, 285450, 263132, 369126, 396488, 335119, 273294, 297670, 288388, 291414, 236904, 242272, 328809, 385607, 424451, 345307, 160511, 146312, 204645, 249281, 416259, 394874, 336405, 244875, 123528, 110027, 225654, 209179, 183649, 266874, 259297, 245783, 224510, 263241]
13501B63241N451n276o2935o2202k276M5472L3765L1433p5737o7620K7408J3246
13489A43970J03648r671j06174k3647o4040K9870K5419R9097Q081j03016Q4706
13478A88243R7989k6942k6052n3870l3364N1866j5170j33874m1010O6984m8406
13467B6394j9970j2926n6742o535J29034J56829N8194j19336n1255N1217m2615
13456A12289m2629l5854L2700r1919q8266J5732J86792l3582p6407Q5622J82736
13445B47214K211l9526j32773j03644P4225M5993J21794K086r1155J11155o4052
13434A73528j53621J01556j56683j2772M156L024M9109M6627p434o9792L6843
13423A4541J04175P0750J4767p5007N613o6155j10831J3616K5350J7871J10879
$$ y = [263241, 268692, 263416, 200481, 138279, 136003, 181475, 215240, 246673, 170936, 103316, 130724, 143970, 247618, 237947, 131773, 108126, 44086, 73956, 99375, 198472, 206553, 103537, 188243, 286232, 259290, 233238, 179368, 146004, 197870, 182700, 48826, 7816, 74800, 26394, 6424, -6502, -63244, -69779, 59255, 216084, 274278, 154942, 103687, 154904, 112289, 69660, 33806, 66506, -25413, -113679, -97947, 88845, 55263, -21144, 64478, 247214, 249425, 209899, 77126, -26518, 47707, 93700, 215494, 217580, 126425, 237580, 173528, 19907, 121463, -35220, -47992, -43836, -40812, 8297, 54924, 47490, -22302, 14541, 118716, 189466, 204233, 129226, 134839, 68684, -42147, -28531, -3181, 14690, 125569]
13412A25569p8913p7569J41838M8320o1595r6492J756O0259P5427k7483O9376
13401A80493R0942j37481j26074k5421K4193j9207R4841J7197j7372j19082l610
13390d0581r24p0402O1391J18681l6561P2609J22304j23671n0976l3678j9809
13379a617r3125o4313L4504Q808l2164K9462Q8133n7893m1551j2966M7231m6650
13367a42141N9869j8816N2464J10113M5810K5768j03875j38297j7287O4604M8622
13356a3166L0702R379Q2375j29830q3069Q8112R1214J1178j02792k200J1185L0876
13344B3964k6437K2065k4611k3405q767l7480Q6791P7978o0569M1874M4475j1023
13332A04855n5392o4431q2572J36676P7162o9076J1886N3853L7909p8913j19368
$$ y = [125569, 46656, -30913, 110925, 159245, 97650, 1158, 2914, 63173, 138600, 111117, 180493, 271435, 133954, 7880, -17541, 6652, -12555, 82286, 99483, 82111, -36971, -40581, -41505, -111907, -50516, 68165, 31604, 104213, 226517, 102846, 51870, 18192, -1617, -94742, -159055, -124551, -115743, -147907, -118445, -30312, -88205, -129756, -142722, -95491, -142141, -82272, -101088, -48624, 61489, 107299, 133067, 29192, -109105, -126392, -61788, -13166, 17536, 26915, 109290, -20540, -103609, -15497, 75717, 86895, -15897, -18097, -6912, 23964, -2473, 19592, -5019, -28424, -37191, -74671, 12120, 90098, 29529, 71403, 115878, 104855, 49463, -14968, -97540, 39136, 116298, 47222, 59108, 112961, 150870, 71957, -47411]
13321d7411P7988O2766k3548q490J21999n9738j16637O9622R3348j13588k91366
13310b35055n9341J20990j9664k2869J07452R0339m8797M0619k2114O5492M6236
13299F3288K0823M2499N0461O5234o4620n1972N0493R5816O6307k3332J5957j2617
13287C18337q5764L5146M4105l7392L8746m5255j35861J2168j57362K2495R7664
13276A07027J7553Q8602M422K1159j23841n4575M5395P904Q16k3772Q1133J2726
13264A84549m6783K8850M1611J1120l4510O5651o1704p9593R3691q666l3111o5557
13252I5548N1237r545j47634Q0490j6667j16527M0955q854n358p4054k4402J59618
13240B4807J68829k1723j05885N6100Q1889L1644J5343q4174o6992L4348J23863
$$ y = [-47411, 30577, 93343, 69795, 61305, 183304, 123566, 6929, 76551, 169899, 56311, -235055, -294396, -173406, -193070, -215939, -108487, -18148, -66945, -26326, -48440, 17052, 63288, 84111, 126610, 177071, 242305, 177685, 125713, 176206, 272022, 338329, 314997, 330954, 318337, 232573, 267719, 311824, 274432, 313178, 267923, 132062, 144230, -13132, 9363, 107027, 124580, 213182, 217604, 238763, 114922, 60347, 105742, 113646, 114462, 90690, 171823, 184549, 137766, 166616, 208227, 219347, 184837, 250488, 188784, 109191, 202882, 194216, 161105, 95548, 146785, 137240, -10394, 70096, 53429, -63098, -22143, -30997, -36355, -110409, -134811, 24807, 193636, 171913, 66028, 122128, 204017, 235661, 251004, 166830, 99838, 134186, 258049]
13229B58049N0720p9078j05311m2307P0148j19056j26650J00384K8884n1502O7849
13218E2130j698j57820m4013J13368J54511J2137O5432O0950o8894j02268L8758
13207A22593n4896P2831j0012j33494o4001j2917k3953l8511K6887l7149M4241
13196a08381R4643m0982K5364K316N8720M9236M5489J1315l1421k1438j03310
13185a8449j0557P0256q3143M4481K8147Q9937J38708n6836j04378P0014p2810
13174I5370p412J01779P9791k7489j77933K142l041l7039J8386l8684m8735K4473
13162a8392J5140R3136n5571j9974j1927N885P022l5855P2809k78m7369m9991
13150d5365j1170k0531J1930J07883P2855j03294M913n7285o4770O5638K7203
$$ y = [258049, 308769, 229691, 124380, 82073, 152221, 33165, -93485, 6899, 35783, -15719, 52130, 50432, -107388, -151401, -38033, 116478, 128615, 194047, 254997, 186103, 83835, 122593, 67697, 140528, 130516, -2978, -66979, -79896, -103849, -142360, -115473, -152622, -108381, -13738, -54720, -29356, -27040, 31680, 80916, 126405, 137720, 106299, 84861, -18449, -29006, 41250, -41893, 2588, 30735, 120672, 259380, 202544, 98166, 168180, 95370, 87958, 189737, 269528, 242039, 64106, 66248, 63207, 26168, 44554, 5870, -42865, -18392, -3252, 89884, 34313, 14339, 2412, 8297, 15319, -20536, 52273, 51995, 4626, -45365, -56535, -77066, -65136, 42747, 115602, 12308, 17221, -40064, -104834, -39196, -11993]
13139a1993j9157k459K0666j1919n4615j5949O4245J2320L6734r460k5917o0561
13127g8065N4038K6546k5053j06629l8880P5900P5929P9232J31005j77191p1530
13116e4698M5590O7188J79506N9191k85964j31571M3646N3219Q0503L3601j16523
13105b6312j2084K7605J2388k2157j38303J05566O3059r8857J7548Q3112J37730
13094A49295J21931m9386r7327o7338r8634P8698N5522R3133n9103j07307Q910
13083B8394N1962n4841N2871N999M2831K675j6818l4325q8569K8358Q3247l511
13071I8273J8790Q117j25342j33696m6876J47388J68817M590p7415l6406j19114
13060i2874M3838Q9942J4740L334R916k30389m7768J23682Q5282L8158L1524J33691
$$ y = [-11993, -31150, -33609, -12943, -24862, -79477, -95426, -31181, -18861, 17873, 8413, -17504, -78065, -24027, 2519, -22534, -129163, -168043, -92143, -16214, 63018, 194023, 16832, -54698, -9108, 58080, 237586, 296777, 10813, -120758, -77112, -23893, 56610, 90211, -26312, -38396, -10791, 1597, -20560, -158863, -53297, 9762, -89095, -71547, 11565, 149295, 271226, 221840, 124513, 57175, -41459, 37239, 92761, 185894, 126791, 19484, 28394, 80356, 25515, 78386, 84385, 127216, 129891, 113073, 78748, -9821, 18537, 101784, 98273, 117063, 125180, -162, -133858, -180734, -33346, 135471, 140061, 62646, 26240, -92874, -49036, 40906, 55646, 58980, 68896, -161493, -209261, -85579, -297, 37861, 69385, 203076]
13048B03076l4062j32520j1463j07596n4864P5713J11675R0886On2029m6025j43118
13036a00321k2676Q4088Q3720L3553j08846l1046J61638k4442O9562R753q9921
13025F5062l8734J17341k2446o8324j24119l8571l4366Q9619p6041j07276L1867
13014b05988R3412K04096j29458l8130J04755O9640p2193Q4823J07613n5712m5587
13003A17271k6050j10838j7101R1400Q582O9145j93703m4133R321m2132K7480
12992a10758k794J6927m7908N9291P2098J7360J9705P787N4409o2789k7693j04879
12980a09244l428J05192P2023k632k5413q5592j40705Q1804L5686j71472k0627
12969b64408P3596O7585l2270J45978J22382J6183j59535k0566n8784R1346L6080
$$ y = [203076, 169014, 36494, 25031, -82565, -137429, -61716, 49959, 140845, 140851, 88822, 42797, -100321, -122997, -38909, 44811, 78364, -30482, -61528, 100110, 75668, 145230, 154983, 65062, 26328, 143669, 121223, 52899, -71220, -109791, -144157, -54538, -130579, -237855, -205988, -112576, 91520, -37938, -76068, 28687, 98327, 26134, 110957, 218570, 162858, 117271, 91221, -19617, -36718, 54682, 63264, 132409, -61294, -105427, -96106, -138238, -110758, -113552, -96625, -144533, -85242, -13144, 4216, 23921, 31708, 86117, 23328, -4365, -109244, -112672, -7480, 64543, 61911, 36498, -49094, -189799, -107995, -72309, -243781, -264408, -190812, -123227, -155497, -9519, 112863, 129046, -30489, -51055, -109839, -18493, 17587]
12958A7587l4155j38046l5989k1498K1028J30241M1069j00357o8162J46081j2100
12947e4301R1602n0018J342J42961L8328j36470r210N3267L7038N5840l4209j18647
12935A7523o392l7865J8084Q7411K6619j18140m8660J42445O4753l3167K5950
12924A38561k468L4608j77363j23245L8398N5805O1383L7407k6241l6271q0222
12913g9648l2880M8621P3008M681p4323j1598P8556k2932J1075o2187N4317j03452
12901a16762o7965R1862J25335K3772k0592j0197j71960Q5999J90344j0537o3547
12890E5752l7193j04022n4839k4962j5732J767K0861J7432l623J51679P5980m3031
12878D0069j5623o7155K6091P8115K3149k7277O3640k3071p1271l1455m4255Q3501
$$ y = [17587, -16568, -154614, -190603, -212101, -191073, -60832, -19763, -120120, -188282, -42201, -54301, 37301, -12717, -11375, 131586, 169914, 33444, 24234, 77501, 114539, 170379, 136170, 17523, 11131, -26734, -8650, 78761, 105380, -12760, -61420, 81025, 145778, 112611, 138561, 136093, 170701, -6662, -129907, -91509, -35704, 25679, 63086, 36845, 574, -79648, -112528, -63907, 9101, 13782, -60541, -72139, 6417, -16515, -5440, -67627, -13310, -116762, -184727, -92865, 32470, 56242, 35650, 25453, -146507, -60508, 129836, 119299, 55752, 18559, -85463, -140302, -165264, -180996, -179229, -158368, -140936, -144559, 7120, 83100, 40069, 24446, -42709, -16618, 61497, 84646, 57369, 121009, 97938, 26667, -4788, -49043, 34458]
12866C4458K4393J9565M805M0691p0018j17071O2195J64559q4418j55463L6683
12855c9621p1177p5651J3661J06097P3230m5044M4020J05902n5823j50764p0033
12844a65203R3237J86005q7199k28614j7514J21062k4976O8285Q3925L147j08188
12833g6033j85432l4333J04144J37590j1769Q0745J8804n5077l0893m6242n4660
12822a53156R2637j997j06897l3130o1818J46818J64144j25016o3398o606J61867
12811A3448Q6404L7856j07008j30531N8351Q7114M0240n0320m3697n2571J09935
12800D9221Q9166o2580p9976J10224P2523n2000m8023j39773N0657O4581O0762
12789A14782l5290j46654r5405P9P5451k5796j9415P6181R3490O746m735q0868
$$ y = [34458, 58851, 78416, 83221, 123912, 53894, -63177, -982, 163577, 79159, -76304, -39621, -110798, -186449, -172788, -66691, 6539, -38505, 5515, 111417, 55594, -95170, -165203, -71966, 114039, 26840, -201774, -219288, -98226, -123202, -54917, 29008, 32155, -76033, -261465, -295798, -191654, -54064, -65833, 14912, 33716, -21361, -52254, -98496, -153156, -60519, -62516, -169413, -202543, -264361, -117543, 46601, -78415, -141813, -148419, 13448, 99852, 137708, 30700, -99831, -41480, 45634, 85874, 35554, -8143, -60714, 49221, 138387, 75807, -4169, 106055, 178578, 126578, 78555, -61218, -10561, 54020, 114782, 79492, -67162, -162567, -162488, -87037, -112833, -132248, -56067, 37423, 44169, 39434, -41434]
12777d1434p2077P9318M437J2506L0044O4520l8816j15564k3498J34388l5856
12766b032j32208q3913M4804R0947P1462L6894J2392Q3692l3614P0599J9386j18181
12754F0228j73428l3198K4297N4868L4967K009q1008J07585L5377N2140o0635
12743B3202m6982N3629J2904R1742M4305p2095l3542j58235j71815o319J10415
12732a52791J16404R8851M550n4845M1256k925M0286p7103j07546J56489L4458
12721I7084j04247Q309J02768K0175j09823m1272r6323o9363J34190P5118L7320
12710E3936o3656N6162J4673K7959J01281J831j3897j4021L1369p7395j18719
12699d77j04667N0996l6887r0291j31364N4256K8647N7957K8352J2744j6701k0755
$$ y = [-41434, -113511, -34193, -29756, -17250, 12794, 77314, 38498, -77066, -100564, 33824, -2032, -134240, -218153, -173349, -82402, -10940, 25954, 38346, 122038, 88424, 159023, 178409, 60228, -113200, -146398, -122101, -67233, -32266, -30257, -111265, -3680, 31697, 83837, 23202, -23780, 29849, 42753, 134495, 178800, 106705, 73163, -85072, -256887, -263206, -152791, -36387, 62464, 67014, 12169, 53425, 50500, 90786, 13683, -93863, 62626, 97084, -7163, 1146, 103914, 124089, 14266, -27006, -123329, -192692, -58502, 16616, 53936, -9720, 46442, 61115, 89074, 190355, 192186, 178289, 164268, 195637, 118242, -477, -105144, -54148, -91035, -181326, -312690, -258434, -229787, -171830, -143478, -130734, -147435, -168190]
12687a68190O4079J10373O9648l8533j3042Q9566j35922n7741L0472M7758L1951
12676C0419n27j14212j39562O9249O8584O7878q6401o2756K8300M1088L4649M0803
12664b2488K4107q4963n6413m2998l2344O6271J320p9039J11975M4681K829J8362
12652d8700J13693N8990Q9152O7205m8682j15844j43218j06059L0165J05819j42903
12641a40382k5026Q6365P6693R0947O4875k3733j37436o9488O9121m3052N0390
12630g26L5018J2444j33906k5004J2888O0192J63071P9911K8424j23588j30701
12619b1977n2642J48339R6583r1615r5054o3884N9817k9423R6632L7831j47807
12608f3200K5334J40113R311m7910j5447k5124J120M8955m7190q6937p7534m3835
$$ y = [-168190, -104111, 6262, 75910, 37377, 24335, 113901, -22021, -79762, -49290, -1532, 30419, 29892, -84320, -223882, -154633, -86049, -18171, -104572, -167328, -139028, -97940, -63291, -22488, 1619, -83344, -139757, -182755, -215099, -148828, -147508, -226547, -114572, -69891, -67062, -48700, 64993, 123983, 213135, 280340, 231658, 115814, -27404, -133463, -103298, 2521, -140382, -165408, -79043, -2350, 88597, 153472, 129739, -7697, -77185, -8064, -51116, -726, 34292, 46736, -87170, -112174, -99286, -39094, 123977, 203888, 232312, 108724, -21977, -74619, 73720, 170303, 78688, -16366, -80250, -20433, -49856, 46776, 84607, -63200, -37866, 102247, 111558, 63648, 48201, 23077, 24197, 73152, 25962, -60975, -138509, -182344]
12596a82344N45L7003Q6718q7236m2418J73962J39287o2881q9891L9074J595K497
12584A5911n3216j36733j32628l0359J40573K1528L5318Q7127j1200O5994l9432
12573c7117m6326l6243n525l130M1654n5272J2550j5219j5126J03147k8770l3362
12561a18739K0744q362R2986R3577O0622j2935N8814p7296n258m1018J05381R463
12549A77979r5028j7223M6282k0845q5904m6400P8373Q5124m692j20995K7702
12538B4373M5438l809l7657N171N7314m135n6220n0458r8240J52342J30354Q836
12526A73309M478q5539l8764j77606n7811J71420L8641n0958k5936Q4796L1954
12515F7984l3908l1420J10714R4374o5942j16282m7852l1118O2642r749j43130
$$ y = [-182344, -181799, -144796, -58078, -145314, -187732, -13770, 125517, 62636, -27255, 11819, 13414, 15911, -37305, -174038, -306666, -337025, -196452, -174924, -139606, -52479, -63679, 2315, -37117, -83443, -119686, -125211, -128341, -86687, -141959, -129409, -144628, -159754, -56607, -85377, -118739, -97995, -106357, -13371, 80206, 140828, 127893, 186707, 109411, 104153, 63135, 168516, 177979, 82951, 65728, 112010, 91165, 5261, -41139, 37234, 122358, 117666, -3329, 24373, 69811, 66002, 28345, 33516, 90830, 86695, 30475, -19983, -118223, 34119, 164473, 173309, 177787, 92248, 53484, -124122, -181933, -10513, 28128, -22830, -48766, 36030, 67984, 34076, 2656, 113370, 207744, 141802, 25520, -22332, -53450, 9192, -557, -143687]
12504a43687P2159J06898J390L5718j33902k06J07319O9426m2641l1748j267k7712
12492A1747j3508l3872j11194k7786r6759P9712J805m456M0598N2390J34500L4579
12480F7756R8665k4148j6111o4467j9985L7832P1760O8348j82131n4149n6354
12469g2984k5951j5800R4119J51960O5185J24384N622j60628j49703k5545r068
12458a8409m7205K5767j11425n0345N2436J08127M6362o5870j016J15648n335
12447D8735j5451M5819J33207k3696j79535k00492R679M6341J6692J81222K3486
12436H6007j71600N1183N1653m239N9078j9929J6069l8856N4324j56495n5465
12425a28270J47617J6250l7394p8870J23257M6860Q8278j40164K6358Q7466R4288
$$ y = [-143687, -71528, 35370, 36760, 72478, -61424, -61630, 45689, 115115, 72474, 40726, 39459, 11747, -1761, -35633, -146827, -174613, -271372, -191660, -189855, -194311, -153713, -101323, 33177, 67756, 166421, 142273, 126162, 61695, 41710, 79542, 151302, 219650, 37519, -16630, -72984, -98935, -114735, -20616, 131344, 196529, 320913, 326535, 165907, 16204, -9341, -18409, -65614, -39847, -151272, -201617, -149181, -41054, 5308, -60562, -61578, 54070, 48735, 33284, 79103, 212310, 188614, 9079, -191413, -181734, -135393, -118701, 62521, 86007, -85593, -34410, 17243, 13004, 72082, 52153, 68222, 29366, 83690, -72805, -128270, 19347, 35597, -1797, -80667, 42590, 89450, 177728, 37564, 63922, 151388, 245676]
12414B45676J6133L6096m5444j06774J0221m1124j1085m1248j7104o4895Q3061
12403F3513J15118j31992r3532Q1720k0117m9813P4931N3212q556j37120k1925
12392g4561O368J15486O7920q230j18186n7400k4214M4211J21100J45603P1330
12381B89427m1070M6241p0905q3291k0004J20697n87m1815L6795K0879J25668
12370C82035K8725j22299p88N7220O4394M6282O0910K56801O9098j29405L3331
12359G46304J4132m5743j70827j66992j45682J22186K02706o422q430j68785K5111
12348C97558L461O4746K9865N1922k9868L8062R7856K6053N3458J3159o4635o3839
12336F17798k3920K2020M070l5892M4356J33392J02291J22440J17706J17953L29514
$$ y = [245676, 261809, 297905, 252461, 145687, 155908, 114784, 103699, 62451, 45347, -19548, 63513, 178631, 46639, -46893, 34827, 14710, -35103, 39828, 93040, 84484, -52636, -74561, -68193, 47293, 115213, 106983, -11203, -68603, -92817, -48606, 72494, 218097, 289427, 248357, 294598, 223693, 140402, 120398, 241095, 240508, 198693, 235488, 256367, 382035, 410760, 288461, 287673, 344893, 409287, 455569, 516479, 773280, 842378, 712973, 746304, 760436, 714693, 543866, 376874, 231192, 353378, 556084, 549662, 541232, 372447, 397558, 401019, 465765, 495630, 547552, 517684, 555746, 653602, 679655, 733113, 746272, 681637, 617798, 593878, 615898, 619968, 584076, 628432, 761824, 864115, 986555, 1104261, 1222214, 1551728]
12325A551728J56508L4620J19668K6969R6538k2730l33332j51177n1483p3935
12315A353374k5270l8605j73485j93299L2023J06562M178m3343Q1544K13964O2321
12304A379964r5141k52079j29773J0336o564J01787j7887J158N220q3397p9575
12293H34049k05573r6047o83J38057J05419k1424Q484J20530K43208M3374J0434
12282A179828l1871L5079O5847j4564j69391k54353j06992j12317j7229p0681
12272E03356j5377l0756N935M6176M8230M630o2327k415j09010j44140R140P3974
12260C27416o567J46734K5474k33428o2279n8677j16606J33389J13666R1931J9855
12249C80908k3977q8981j05052O5985m2126O0148K8096L034J2468j1895r4121
$$ y = [1551728, 1708236, 1742856, 1862524, 1889493, 1986031, 1963301, 1629969, 1478792, 1427309, 1353374, 1328104, 1289499, 1116014, 922715, 954738, 1061300, 1065478, 1022135, 1103679, 1317643, 1379964, 1284823, 1032744, 902971, 913307, 906743, 1008530, 990643, 991801, 997021, 913624, 834049, 628476, 532429, 531746, 669803, 775222, 753798, 762282, 882812, 1126020, 1169394, 1179828, 1147957, 1183036, 1248883, 1234319, 1064928, 810575, 703583, 591266, 574037, 503356, 487979, 457223, 463158, 509334, 557564, 562194, 499867, 497452, 388442, 244302, 253442, 327416, 320849, 467583, 493057, 259629, 197350, 138673, 22067, 155456, 269122, 361053, 380908, 356931, 267950, 162898, 228883, 186757, 246905, 275001, 278035, 290503, 278608, 184487]
12238A84487m8795J21567P5277N0202k006l1717q0928m5365P1241j64116O34j2843
12226A17638m9983k0616m807l5977o4078j3467O4129J255R1290J11927j46178
12215E1133M6242J07083M144j1257p6099q1209q169J38332n8229j09316K6220
12204B8875J16782J6168p67k894p8087l4148M394N1466Q4992J41833n193o4777
12192B58644q9166k5905N0973K1290L7767j4338q4781J0234o0085n865L5085l3741
12180A00112J4464L4669j9695R2753M3956j4105r9222l8901o6419o7453M7385
12169B7544q7163J30953O2213J7639P577k0991q3880m0880M3328M616J2907M3687
12157A17550J3809O6636K4510k3605q6821q1046J2722Q1053J44755K1269N5033
$$ y = [184487, 135692, 257259, 332536, 382738, 380732, 349015, 268087, 222722, 293963, 129847, 130481, 117638, 67655, 47039, 42232, 6255, -57823, -71290, -7161, -5906, 85384, 197311, 51133, 97375, 204458, 208602, 197345, 121246, 40037, 31868, 170200, 111971, 2655, 28875, 145657, 161825, 161058, 158164, 80077, 45929, 50323, 101789, 186781, 328614, 323421, 258644, 169478, 143573, 194546, 215836, 253603, 239265, 154484, 164718, 104633, 98768, 133853, 100112, 114576, 149245, 129550, 222303, 266259, 252154, 152932, 114031, 47612, -19841, 27544, -59619, 71334, 133547, 151186, 158763, 137772, 53892, 13012, 56340, 60956, 73863, 117550, 131359, 197995, 222505, 198900, 112079, 31033, 43755, 124808, 269563, 290832, 345865]
12146C45865O8254n564N4102j6413j13372r8634n5162j274R2265n8066L4631j26117
12134A20515o9054n3197N6444M1118L8105J03084R3409j70244q3735M3692n4412
12123F5725j0734J15713J50837n52n9297j6313l7281j74230J8410J17544n9446
12112A10376p7205j4909N1716J01461p4776k7832o2413p1132L5886J00659O3674
12101A35505k4839M2902R4200j9208r556K9714J25341J02909n8195m9889n84N8199
12089D26499k7551n2227o2928L315O1831n1795n6945N7548K9893O4279N6805K6460
12077D75184j00548l4340P5683N6440Q5163r6559q0975J24908M3841j73877J4219
12066C89139L1220L6322K1771j29770l8840l0407Q4194P1741j5151k8564l9471
$$ y = [345865, 414119, 408555, 462657, 446244, 332872, 234238, 179076, 177802, 270067, 212001, 246632, 120515, 51461, -1736, 54708, 95826, 133931, 237015, 330424, 160180, 76445, 120137, 65725, 54991, 170704, 321541, 320989, 261692, 245379, 208098, 33868, 52278, 169822, 110376, 33171, 18262, 69978, 171439, 96663, 68831, 6418, -64714, -28828, 71831, 135505, 110666, 153568, 247768, 228560, 219004, 248718, 374059, 476968, 418773, 368884, 368300, 426499, 398948, 346721, 283793, 287108, 348939, 297144, 240199, 297747, 327640, 391919, 448724, 475184, 374636, 340296, 415979, 472419, 557582, 461023, 380048, 504956, 548797, 374920, 389139, 420359, 456681, 478452, 348682, 309842, 279435, 363629, 435370, 420219, 391655, 352184]
12055C52184n3k4949k3117N2277J13838j5231J62883O3541j39574m335N0042J06466
12043F93972J2060k0013K241M6969l3717j788K4757N0218P3398J752L0582p0456
12031H09975l2314j2679P2059J12610J31947j9839j45681o8066K7489l2076j9379
12020H24046n9871m2826J0943m1914l0191n7113N5173J82356J27281q3766n4866
12009H29252p3023j1394K7039L1279J6744o4542l2125K9634K0533l6464K489J95161
11997I34583Q4463J11407J6230o2897R600o7927L5381P785J09169M7353L6290
11986A261437p8586J9246O494J04833K0679m0066l0859N0135l0118M0639P8299
11975A402133l3155m7874O9856p5852J05677K13798K10784R0966Q3639M5843j02023
$$ y = [352184, 352131, 327182, 304065, 356342, 470180, 454949, 617832, 681373, 541799, 537464, 587506, 693972, 706032, 686019, 688260, 735229, 701512, 699724, 724481, 774699, 848097, 849849, 880431, 809975, 777661, 764982, 837041, 949651, 1081598, 1061759, 916078, 848012, 875501, 843425, 824046, 764175, 721349, 732292, 690378, 660187, 603074, 658247, 840603, 967884, 884118, 829252, 756229, 744835, 771874, 803153, 819897, 755355, 723230, 752864, 773397, 736933, 739422, 934583, 1019046, 1130453, 1146683, 1083786, 1093386, 1025459, 1060840, 1068625, 1177794, 1225147, 1261437, 1182851, 1202097, 1208591, 1313424, 1334103, 1294037, 1263178, 1313313, 1283195, 1323834, 1402133, 1368978, 1321104, 1390960, 1315108, 1420785, 1634583, 1845367, 1936333, 2019972, 2065815, 1963792]
11964A963792r6385Q511k695O9418O9704J53771J35895K92203K42309J04795j7938
11953B923380J44577K60411L07321J62285J90174J69573K35782K07013J60280
11944D760796K90738L60087L66898M64169O35580P67253O21762O07059P36471
11935I610813Q19566J015800J366908J519745J932186K114060K523566L182040
11927B4084684M014816N000114O445171Q803938J2014772J6843562K3439703L1124446
11919A31771206L6871187L6437486K9595608K2193240J6911543R452234n670688
11912B77561816k6442194m0496326m1250648l3994688k5362465j8381387j3533955
11905G8100153j0010559p626435o026545m770011l942745l220712k739908k381426
$$ y = [1963792, 1867407, 1875918, 1873223, 1942641, 2012345, 2166116, 2302011, 2594214, 2836523, 2941318, 2923380, 3067957, 3328368, 3635689, 3797974, 3988148, 4157721, 4393503, 4600516, 4760796, 5051534, 5411621, 5778519, 6242688, 6878268, 7645521, 8267283, 8874342, 9610813, 10430379, 11446179, 12813087, 14332832, 16265018, 18379078, 20902644, 24084684, 28099500, 33099614, 39544785, 48348723, 60363495, 77207057, 100646760, 131771206, 168642393, 205079879, 234675487, 256868727, 273780270, 283232504, 277561816, 251119622, 210623296, 169372648, 135377960, 110015495, 91634108, 78100153, 68089594, 60463159, 54436614, 49666603, 45723858, 42503146, 39763238, 37381812]
11897C7381812k138100j937448j776647j545398j464992j344889j322895j221378
11889B4630065j033794r41674r28351q67867q75189o39145p64636o21451o32841
11880A7325117n70445o16595n46787n11300k67660l04300n55127m80317l08614
11871A3163972m60597l16522k03885l17146m37444k99579k39821l38814k18693
11862A0331471k61871k55979o3545k67860l02392l29386j97842j52746k27875
11853H271975k13069j31248j95119q4689j14141l18431k13696k01782j50787j59537
11843F489476q9836p7447j28109r6325q7518j54802r5313j54636j42474j95084
11833E267932r3086j0653k26987j54201j92937j59085k6286l1434J806j50430
$$ y = [37381812, 35243712, 33306264, 31529617, 29984219, 28519227, 27174338, 25851443, 24630065, 23596271, 22654597, 21726246, 20858379, 19983190, 19344045, 18579409, 17957958, 17325117, 16754672, 16138077, 15591290, 15079990, 14812330, 14508030, 13952903, 13472586, 13163972, 12703375, 12386853, 12182968, 11865822, 11428378, 11128799, 10888978, 10550164, 10331471, 10069600, 9813621, 9750076, 9482216, 9179824, 8850438, 8652596, 8499850, 8271975, 8058906, 7927658, 7732539, 7647850, 7533709, 7215278, 7001582, 6799800, 6649013, 6489476, 6399640, 6322193, 6194084, 6097759, 6010241, 5855439, 5760126, 5605490, 5463016, 5267932, 5174846, 5164193, 4937206, 4783005, 4590068, 4430983, 4404697, 4373263, 4375069, 4224639]
11823D224639j3206L9744p5007k45256j18385J3763N1K610r5662j17501j03600
11812C512190R699l658j72616j88997n8118R9004N0786k0550j1861r7424k45740
11801B872715j29558l3738l117r418l994k2062j89228k9925J3015l8865p4065
11790B351760r094j26198k03014P5061L58Q216j7405m797l7258j01587q7520K5472
11778A873994L8000J3338k9300l6471p2001n2673K5321N9610n6312j131J1769
11767A774144k5256l460L7755Q0363R638L9092J18421m4221p2116l6294N4809
11756A932875N1080r2205j22245Q466J28697J32273J6542p3296M2104J35454Q4907
11745B244652P6237N8007J63786J14198J76020P4196j03033L5399N6323L1663
$$ y = [4224639, 4211433, 4251177, 4176170, 3930914, 3812529, 3826292, 3826343, 3828953, 3733291, 3615790, 3512190, 3521889, 3518231, 3345615, 3156618, 3098500, 3197504, 3248290, 3227740, 3215879, 3118455, 2872715, 2743157, 2709419, 2706302, 2696884, 2692890, 2670828, 2481600, 2451675, 2464690, 2425825, 2351760, 2342666, 2216468, 2013454, 2088515, 2088873, 2097089, 2079684, 2074887, 2037629, 1936042, 1848522, 1873994, 1911994, 1925332, 1896032, 1859561, 1787560, 1734887, 1760208, 1819818, 1763506, 1762375, 1774144, 1748888, 1745428, 1783183, 1863546, 1873184, 1912276, 2030697, 1986476, 1914360, 1878066, 1932875, 1983955, 1891750, 1769505, 1777971, 1906668, 2038941, 2055483, 1982187, 2024291, 2159745, 2244652, 2320889, 2378896, 2542682, 2656880, 2832900, 2907096, 2804063, 2839462, 2895785, 2927448]
11735B927448R946P520J3246k4342P0760j2708n4337K2935j487J03757J77090
11724C239828K1922M1409L2454J26837J02773L1110q4384j66974r7768j01852
11714C145355n6646k8596n6466k6397j11759r3066J72450K0742j42121r8028K877
11703B728345p618J14778N5452o5304k7546J81645K66559P4578M4191J74479J02439
11692C641998J56368L32497M38454L70510K83267K24621K60804L79456M03325
11683F491300K43466K86617L52646L51659K81006L93838M02118M66448O63140
11674I932238Q22951R15447J173541J327677J441180J622141J759773J817981
11666B0812929J701294J678675J497258J228799R44769N20040P6062j81582n74828
$$ y = [2927448, 2937394, 2944914, 2958160, 2933818, 3004578, 2991870, 2937533, 2960468, 2958981, 3062738, 3239828, 3261750, 3303159, 3335613, 3462450, 3565223, 3596333, 3511949, 3344975, 3247207, 3145355, 3088709, 3060113, 3003647, 2977250, 2865491, 2772425, 2944875, 2965617, 2823496, 2725468, 2728345, 2720727, 2835505, 2890957, 2825653, 2798107, 2979752, 3246311, 3320889, 3365080, 3539559, 3641998, 3798366, 4130863, 4569317, 4939827, 5223094, 5447715, 5708519, 6087975, 6491300, 6734766, 7021383, 7374029, 7725688, 8006694, 8400532, 8802650, 9269098, 9932238, 10755189, 11670636, 12844177, 14171854, 15613034, 17235175, 18994948, 20812929, 22514223, 24192898, 25690156, 26918955, 27863724, 28383764, 28459826, 28278244, 27703416]
11657B7703416r26402j069672j307385j458166j630972j620339j610834j564177
11649A6515469j432724j228724j096660q32152p51503n02617m97927m21442l15547
11640I436173k43588l22181j34403k0997j03497J66136J85122O3401N7765J39885
11630I223816K28099L23492J72023K53656L91501L05696M27612M62580N40534
11621A2329009Q22454J133054J462353J650358J973305K468959K714551L014494
11613B7568537L347675L414943L348713L125397K895732K454966J822986J204133
11605D9183082M12152k86390q83913j684594k234407k618802k946852l188265
11597C5752011l182162l168101l062474k810285k481810k203347j850684j426075
$$ y = [27703416, 26777014, 25707342, 24399957, 22941791, 21310819, 19690480, 18079646, 16515469, 15082745, 13854021, 12757361, 11925209, 11173706, 10671089, 10173162, 9751720, 9436173, 9192585, 8870404, 8736001, 8715004, 8611507, 8777643, 8962765, 9026166, 9083931, 9223816, 9451915, 9775407, 9947430, 10201086, 10592587, 10898283, 11325895, 11788475, 12329009, 13151463, 14284517, 15746870, 17397228, 19370533, 21839492, 24554043, 27568537, 30916212, 34331155, 37679868, 40805265, 43700997, 46155963, 47978949, 49183082, 49595234, 49308844, 48424931, 46740337, 44505930, 41887128, 38940276, 35752011, 32569849, 29401748, 26339274, 23528989, 21047179, 18843832, 16993148, 15567073]
11589A5567073j006629q04886q23599p41335o36709n40010n22151k88204k50664
11580I952886l32323l02951m09810j54552j13202m0106l4693k6868r0523O1022
11570H508880K9572J74740K41615J47457L06738M80337M92469N37328P95284J086185
11560A2800605J228417J358871J391674J400698J395687J354728J303752R87016
11552B3221448P97271N96158K67884j53786l26266n35763q35790j200091j529100
11543B0301965j484365j571917j508917j507775j286088j123029r82841r61680
11535I875353q15705o36643n42014m82307k55178k99629m31977l93863k95890
11526E722147k57033k37076k99889k28098k75037k05620j4978r3715k29965j41420
$$ y = [15567073, 14560444, 13755558, 12931959, 12190624, 11553915, 11013905, 10491754, 10203550, 9952886, 9620563, 9317612, 8907802, 8753250, 8640048, 8599942, 8565249, 8538381, 8447858, 8508880, 8538452, 8713192, 8954807, 9102264, 9409002, 9889339, 10381808, 10919136, 11714420, 12800605, 14029022, 15387893, 16779567, 18180265, 19575952, 20930680, 22234432, 23221448, 24018719, 24614877, 24882761, 24728975, 24402709, 23866946, 23031156, 21831065, 20301965, 18817600, 17245683, 15736766, 14228991, 12942903, 11819874, 10837033, 9875353, 9059648, 8423005, 7880991, 7398684, 7143506, 6843877, 6411900, 6018037, 5722147, 5465114, 5228038, 4928149, 4700051, 4425014, 4219394, 4204416, 4110701, 3880736, 3739316]
11516C739316O3m3598j7087k7834j22288l9303o6227r8060j19483j49761j05024
11505B950714k0533n8916o9082q6982k03484J0250M1604k7139q0504j35196N8666
11494B379398n5963J5758j09190k165O7780J3215O7077p5580r0702q7303l5449
11483B086876o1642j3462n3634o6533n7211o1381k669l7685K9030j08145J8798
11472A672342l449m7638p2408P2330r4762k41135q4245n8614K1061r943p8002
11461A075537K3725L7065k7955n8834p046k8012P1444K166Q379l5993K1998M076
11449A086550l5976J8100K945m4275j23266m6866q3939k4853O0050L8007J6688
11438H63165M5762k0744L8095j0895o2000q3774j41402j30585j00365l3230P503
$$ y = [3739316, 3739379, 3695781, 3678694, 3650860, 3528572, 3489269, 3423042, 3324982, 3205499, 3055738, 2950714, 2930181, 2871265, 2802183, 2715201, 2511717, 2521967, 2563571, 2536432, 2455928, 2320732, 2379398, 2323435, 2339193, 2230003, 2227838, 2295618, 2308833, 2375910, 2300330, 2209628, 2122325, 2086876, 2025234, 2011772, 1958138, 1891605, 1834394, 1773013, 1770344, 1732659, 1761689, 1653544, 1672342, 1668893, 1621255, 1548847, 1621177, 1526415, 1285280, 1201035, 1142421, 1163482, 1153539, 1075537, 1099262, 1136327, 1108372, 1049538, 1042492, 1014480, 1085924, 1088090, 1096469, 1060476, 1082474, 1086550, 1050574, 1068674, 1071619, 1027344, 904078, 857212, 773273, 748420, 808470, 846477, 863165, 908927, 888183, 926278, 915383, 853383, 769609, 628207, 497622, 397257, 364027, 371530]
11427C71530R9630K09240N9543o9770j9711J463q3112p8196p9138l9659J5665
11416C87485m6358o2640L7577j7557Q5802Q7276Q386J711O9484L414m6400r7052
11404D11128L3833P0195O4141N9038J6423n9973j22980j58316j0076R7249j8751
11393C81911Q7121L2087r9485k45930q3306J27392K03634Q6861m3679l0782l3410
11382C82414p832J3362m0996o8689J14717k3473K3314j05970N8830J11409J2306
11371D69392p2258j37285m5020m4770r2532P8260M7282n9914p290L8264K9132
11360B03261J92217P518j00896o7682M4032n1916M9093K0206j8732J4323l5229
11349B56195K0047M8868N8451n0731n8307j39037n5416J19042J2462Q1L9495r3639
$$ y = [371530, 471160, 680400, 739943, 670173, 650462, 651925, 568813, 490617, 411479, 371820, 387485, 341127, 278487, 316064, 298507, 384309, 471585, 479971, 481682, 551166, 554580, 508180, 411128, 444961, 515156, 579297, 638335, 654758, 594785, 471805, 313489, 303413, 400662, 381911, 469032, 501119, 401634, 155704, 72398, 199790, 403424, 490285, 446606, 415824, 382414, 374582, 387944, 346948, 278259, 392976, 369503, 392817, 286847, 345677, 457086, 469392, 397134, 259849, 214829, 170059, 77527, 155787, 203069, 143155, 135865, 174129, 203261, 395478, 402996, 302100, 234418, 278450, 226534, 275627, 295833, 277101, 291424, 256195, 276242, 325110, 383561, 332830, 274523, 135486, 80070, 199112, 211574, 211655, 251150, 157511]
11337A57511j05042J0555m3248J9650L8505r136J16188Q5561l5017j34458j32862
11326c1793L8409J17147J08680q4242j0167L7804K8536R8951J13243P0297r7780
11315C89085l5167m7198r6135M354l8113o8769j414P8044P513O4169l3459j52478
11303G0432j55218N0896J58668M6779O2938O9596r4083j29442P38O7167J21293
11292B69764o8408r9269o6752K7232O6552M4677N2776K7969K4264J7565m4458
11281B51912q1406K0905L1944m771j14871K1100J25777n0996L7515J9491n6337
11270B00263n1882L9718j1625P6292o905l6518m5693r018p9230j03744Q5605N6363
11258A13626k2994j5784K1027R4714J1801p9495N874j0789q4145l3836J12709
$$ y = [157511, 52469, 63024, 19776, 39426, 77931, 68795, 184983, 270544, 235527, 101069, -31793, 6616, 123763, 232443, 148201, 138034, 175838, 204374, 303325, 416568, 486865, 389085, 353918, 306720, 210585, 214939, 176826, 108057, 106643, 184687, 192200, 256369, 222910, 70432, -84786, -33890, 124778, 171557, 234495, 304091, 210008, 80566, 81304, 148471, 269764, 201356, 102087, 35335, 62567, 129119, 173796, 226572, 254541, 278805, 296370, 251912, 170506, 191411, 223355, 218584, 103713, 124813, 250590, 199594, 237109, 256600, 200263, 148381, 188099, 176474, 252766, 245861, 209343, 163650, 154632, 75402, -28342, 57263, 113626, 90632, 74848, 95875, 190589, 202390, 122895, 128769, 117980, 33835, -1, 112708]
11247A12708J12426J7958p4220j13467Q4946r07O9846j932p6076r3768p4837J9670
11235a7653K8114M1861Q0108j7133q016m0523k0486n7843j13110j00718M2660
11224a82739J06113Q0823O6862O690J5651q4741l7649P2214J0965k2897k000J5815
11212D5107P5438J7159n7797p326Q9935j48211o8866L6060O4436k9566P4835J1450
11200A02654q1027J14867n1274j3460J09502N1504r227j78183q025Q2351K2011
11189A41693q700m4448k8509l7467P066j4158K0458O2611Q8431P3509J40404m7573
11177C53317o4938j368r0277l3942L1299l3762N8774q2185j05473M5644o0405
11166A6684o628o1277o2664L3380P436L4601J18969J60720K721j50213j8896l2767
$$ y = [112708, 225134, 243092, 168872, 55405, 140351, 139444, 209290, 207358, 131282, 37514, -37323, -17653, 10461, 52322, 132430, 115297, 107281, 66758, 46272, -11571, -124681, -225399, -182739, -76626, 4197, 71059, 77749, 93400, 8659, -28990, 43224, 54189, 31292, 29292, 45107, 120545, 137704, 79907, 72581, 162516, 14305, -54561, -18501, 45935, 16369, 91204, 102654, 21627, 136494, 85220, 71760, 181262, 232766, 223539, 45356, 37331, 119682, 141693, 132993, 88545, 60036, 22569, 29635, 15477, 35935, 98546, 186977, 260486, 400890, 353317, 288379, 287011, 196734, 162792, 194091, 160329, 219103, 136918, 31445, 77089, 16684, 10056, -51221, -113885, -80505, -73069, -38468, 80501, 241221, 243942, 93729, 74833, 42066]
11154D2066j7306j5123M7107M1301n5678o0358n9205q621n7578K1190R6639J20755
11142I5189k8887j62075l0653Q4231N5450k7621l8893l238M3346P4318K884O60
11130F4711k0384J19658O152o5976P7147o9890N8120o1330j38107k1203J79019
11119A27917P4715m679j10288l9935j6828J10594J60393O5601l8232K0015m4112
11108C05161j43713j5927N9487q8752m3892K2206J06465Q0718k8220J6971O9105
11097C39609j8247o9473j26057j07937O3861p602j40075o7643J33740J46878K4059
11086A71113n7041q132P5407O9952k9287n7492n1140l4398j10924j8792j0783
11075f1517m598J4533o0088k3169M9823J60560P7756O1234m0666j02574r3753
$$ y = [42066, 24760, 9637, 56744, 98045, 42367, -17991, -77196, -85817, -143395, -122205, -25566, 95189, 66302, -95773, -126426, -42195, 13255, -14366, -53259, -56497, -13151, 61167, 64051, 64711, 44327, 163985, 170137, 104161, 181308, 111418, 169538, 108208, -29899, -51102, 127917, 202632, 197953, 87665, 47730, 30902, 141496, 301889, 367490, 329258, 349273, 305161, 161448, 145521, 205008, 116256, 72364, 94570, 201035, 281753, 253533, 270504, 339609, 321362, 251889, 125832, 17895, 81756, 74154, -65921, -133564, 176, 147054, 171113, 114072, 105940, 181347, 251299, 222012, 164520, 113380, 78982, -31942, -50734, -61517, -66115, -51582, -111670, -134839, -85016, 75544, 153300, 214534, 173868, 71294, -22459]
11064b2459Q779J20828J11051o0079J8623j3712M8433m4145l9060r8041M184K9245
11052F3647q5115p8228N169R0082r2214J0944L4362P1601L3783J60884P3784K3666
11040C12365Q5518p2095K4479P5674k8246q4747r7554J14508J06299J31492J08899
11029F76592k4209Q6536N0451j130K8715M3600J8604N537p5820o5100L3982R0803
11017H68561Q8338Q9711O4020O4076o2103l2436k4643P5891l6972M9045o5356
11006A078132m1455j6337Q3821K5355m0067j10358Q3075Q329j54271r4037j08702
10995G13485j14129J6114o7916K0421p451m7309q9171j46640k0400l4934o5424
10984A56646P0280R5242j7862L9454J24166P1329r2170o5748j24020K0735k0160
$$ y = [-22459, -13680, 107148, 218199, 158120, 176743, 163031, 211464, 167319, 128259, 30218, 34402, 63647, -21468, -99696, -94527, -4445, -96659, -85715, -51353, 20248, 54031, 214915, 288699, 312365, 397883, 325788, 350267, 425941, 397695, 312948, 215394, 329902, 436201, 567693, 676592, 652383, 738919, 789370, 788240, 816955, 860555, 879159, 884696, 808876, 743776, 777758, 868561, 956899, 1046610, 1110630, 1174706, 1112603, 1080167, 1055524, 1131415, 1094443, 1143488, 1078132, 1036677, 1020340, 1104161, 1129516, 1089449, 979091, 1062166, 1070495, 916224, 822187, 713485, 599356, 615470, 547554, 567975, 560524, 513215, 424044, 277404, 257004, 222070, 156646, 226926, 322168, 304306, 343760, 467926, 539255, 447085, 381337, 257317, 278052, 257892]
10973B57892j14863p2514k3525J08408m9599o1698J21692p9156N5274O4385l6691
10962A69605m2455j53224J992m8623M0152m474J05442K2104j14656n9962J35215
10951E1116J41017J6805q1921l6378N9663N0535K2345J7263j6226n6094P293N1925
10939B27343m9559K089K8193k205n8383j06707j34922p1946J35991P1554J1943
10928E3391l4418O0912m1834J7181m5367l9167N9517J3525J60725j3158j35702
10917E5605r5646l9360Q3325N2696O7001N0609Q4094j36782j05180Q8041M1713
10906A46116K8484r214j01599r9217M854r1664m3274O8573J89008R8180N0624
10895B40871M1489o6287l1600K0133j3673m3476j49769P5003J30543j12675j00994
$$ y = [257892, 143029, 70515, 46990, 155398, 105799, 44101, 165793, 86637, 141911, 206296, 169605, 127150, -26074, -24082, -72705, -32553, -37027, 68415, 90519, -24137, -84099, 51116, 192133, 208938, 127017, 90639, 150302, 200837, 223182, 240445, 224219, 168125, 175418, 227343, 177784, 179873, 208066, 205861, 147478, 40771, -94151, -166097, -30106, 41448, 53391, 18973, 79885, 38051, 55232, 9865, -29302, 30215, 43740, 204465, 191307, 55605, -40041, -79401, 3924, 56620, 123621, 174230, 258324, 121542, 16362, 104403, 146116, 174600, 165386, 63787, -35430, -30576, -122240, -165514, -96941, 92067, 190247, 240871, 282360, 216073, 184473, 204606, 190933, 147457, -2312, 72691, 203234, 90559, -10435]
10884a0435J2399j6960j562n1267j0491K4054k2464R7795l8360j53376O1535r3305
10872b02437p9987N7129Q5363Q4383J6429N3343K2161J6370q2190Q439j3489O7001
10860C2515j297J4600m6794J672l3292N2512Q0899m338L7853O7606j20766K2031
10848A03201M2819M3248j14754j5627Q3915l122L5108L3572Q1673M1830k3342
10837C08521O032j30131j44787n948L8495L866j4298M3179n3972l438J3645n8023
10825C141n6573R0086N6605P9781j00393j39941r9449K1463J3329L1196O0526
10814d0229N8198J35374k7612m0312l142m6916j42077j19205J28241n2808M199
10803a46289J4931j69782q230J70845J52368J1534j6856r2589r1966o1653n59
$$ y = [-10435, 1964, -14996, -16558, -67825, -78316, -54262, -76726, 21069, -17291, -170667, -109132, -202437, -282424, -225295, -139932, -55549, -39120, 14223, 36384, 52754, -29436, -20997, -34486, 32515, 31218, 45818, -976, 696, -32596, 19916, 100815, 96477, 134330, 201936, 81170, 103201, 146020, 189268, 74514, 58887, 142802, 139680, 174788, 208360, 290033, 331863, 308521, 314553, 184422, 39635, 33687, 72182, 76048, 61750, 104929, 50957, 47519, 61164, 3141, -53432, 36654, 93259, 173040, 72647, -67294, -166743, -145280, -131951, -100755, -40229, 17969, 153343, 125731, 85419, 82277, 35361, -106716, -225921, -97680, -150488, -146289, -131358, -301140, -309370, -138525, 13843, 25377, 8521, -84068, -176034, -237687, -238246]
10792b38246R6192J36410j56013j08013O5571p0820N57j7203m7734J08070R8627
10781a32602L7666M5087j4789l6390m3101Q116k4454m0542P2280L425R54O5848
10769e8502L6697J5732l7081q7938q3721J4700K42274J40076m296P5897j32613
10758A21225k0492J58403n8284p4611o2244L5294m1923l1400P5675k7350N9229
10747A33522N2154Q8184J5986o3627L1212M3145J5972m8256q3515M0479J14474
10736C39730Q493j51712q7155L017J48557R6406O3055M3536O389l5358l2182o5375
10724C37401j4386Q0940O0416k625P8308P5364j21109o2199j90604p8746M5400
10713B08160J17805k2807q8337J13625R4845q7995J9107O3941J2425p041j0202
$$ y = [-238246, -142054, -5644, -161657, -269670, -204099, -274919, -274362, -291565, -339299, -231229, -132602, -94936, -49849, -64638, -101028, -144129, -136013, -160467, -201009, -128729, -125304, -124350, -58502, -21805, -6073, -43154, -131092, -214813, -200113, 42161, 182237, 177941, 253838, 121225, 100733, 259136, 200852, 126241, 63997, 99291, 57368, 25968, 101643, 74293, 133522, 185676, 273860, 289846, 226219, 257431, 300576, 316548, 268292, 184777, 225256, 339730, 348223, 196511, 109356, 112373, 260930, 357336, 420391, 463927, 470316, 434958, 402776, 337401, 323015, 403955, 464371, 461746, 540054, 615418, 494309, 432110, 241506, 162760, 208160, 325965, 303158, 214821, 328446, 423291, 335296, 354403, 418344, 430769, 423728, 413526]
10702D13526m5759M6510L2177N2371m9483J3817m8221m5471o1536J6766O2854
10691C87551J43381L7747j11691n5454K9880m9280J10235m565r7908O5199N3244
10680E08339j7761k1950k9729J4382L1468k1533q4857m732Q8077O7730L419n7990
10668D74863o0012J4642o6813n2615Q4586J42824L4226J8764K4956l3694m444
10657E77283R5775J69076p433J01710o0353k9866O8460L1604l4988J18217J71035
10646A200520J03882K20697K28581J88662Q9197j20494J9861N0030q0690j96192
10636A704054j32734n1556O5223K37444L28879L03585K95214L91784M70263N27133
10626D139289N94351N52216M18322N05309N44197O09835M28131M23360Q44503
$$ y = [413526, 367767, 414277, 446454, 498825, 449342, 463159, 414938, 369467, 307931, 324697, 387551, 530932, 568679, 456988, 401534, 431414, 382134, 492369, 487804, 389896, 455095, 508339, 490578, 468628, 438899, 453281, 484749, 463216, 378359, 373627, 461704, 529434, 532853, 474863, 414851, 429493, 362680, 310065, 394651, 537475, 571701, 590465, 615421, 581727, 577283, 673058, 842134, 834701, 936411, 876058, 846192, 914652, 946256, 911268, 1029485, 1200520, 1304402, 1525099, 1753680, 1942342, 2031539, 1911045, 1930906, 1980936, 1900246, 1704054, 1571320, 1519764, 1584987, 1822431, 2151310, 2454895, 2750109, 3141893, 3612156, 4139289, 4733640, 5285856, 5704178, 6209487, 6753684, 7363519, 7791650, 8215010, 9059513]
10617I059513J269519J863150K607450L553665M876078O082648P102261P200221
10609D3614505O527934N814359N427392M553983K860420Q42446J12176J612153
10601G1365368M926306Q850541J1853458J2450109J1073727R380914Q329908O256610
10593A44486941J402247m493055o740837l734858K575123R297561J3859390J4306234
10585A70958746J1931592R532016P423703L062922n148180j4086738j7444470
10578A66229591j4013969p398699p08589L646728M568843L572759K167054P66758
10570A58830476k170114p793622j3523037j5180286j2563596q015786m068837
10563I5515198j670411o08218q91611j504558k425267l960198o149859q051162
$$ y = [9059513, 10329032, 12192182, 14799632, 18353297, 23229375, 29312023, 36414284, 43614505, 50142439, 55956798, 61384190, 65938173, 68798593, 69641039, 69753215, 71365368, 76291674, 85142215, 96995673, 109445782, 120519509, 129900423, 138230331, 144486941, 145889188, 141396133, 134655296, 130920438, 133495561, 142793122, 156652512, 170958746, 182890338, 192422354, 199846057, 202908979, 197760799, 183674061, 166229591, 152215622, 144816923, 144108334, 147755062, 152323905, 155896664, 158063718, 158830476, 156660362, 148866740, 135343703, 120163417, 107599821, 99584035, 95515198, 93844787, 93236569, 92344958, 90840400, 88415133, 84454935, 78305076, 70253914]
10555G0253914q552023p584766o129695m886915l793017k817049k244650j970667
10547C2275132j730799j459810j267276j122629j006729j014569q31725p72391
10539B3069204o48637o59053p07682o67001n47293n37909n24405n21904m74321
10530A7780999m05150m34892n37865l76401m67392l54226k77576k83999l50176
10521A4293322m19650l07583m69312l41662l45447l51753k47549l20509k50457
10512A1239400k24775k22217k42729j95390j37428k76112j79278o8399k53889
10503I439183l10424j84833j35697j69686k61230k33330j20879j18297j82970
10494G721837j12934j18417j79167j04000j06409j93062r5402j63368k35604j57697
$$ y = [70253914, 61701891, 54117125, 47987430, 43100515, 39307498, 36490449, 34245799, 32275132, 30544333, 29084523, 27817247, 26694618, 25687889, 24673320, 23841595, 23069204, 22420567, 21761514, 21053832, 20386831, 19839538, 19301629, 18777224, 18255320, 17780999, 17375849, 16940957, 16403092, 16026691, 15559299, 15205073, 14927497, 14643498, 14293322, 13873672, 13566089, 13096777, 12755115, 12409668, 12057915, 11810366, 11489857, 11239400, 11014625, 10792408, 10549679, 10354289, 10216861, 9940749, 9761471, 9693072, 9439183, 9128759, 8943926, 8808229, 8638543, 8377313, 8143983, 8023104, 7904807, 7721837, 7608903, 7490486, 7311319, 7207319, 7100910, 6907848, 6812446, 6649078, 6413474, 6255777]
10484F255777m5739j70286j59499o0641K973j79692j16251n7535k63754j59276
10474E046077j12414j03428p4773k8191r6603n5290q3586q2771o3128p6337k1651
10463D247905j20556j04938K0296j56698j86107k05413m6146j3763l3866P8336
10453C479050p6412l7604j03024j02173l728k7017q2168o264k17075j43435K9376
10442B709526k60p9935n2296j0240p5807m8295o2253J70652j4808o6521j05502
10431B364261l4172m4014o8972j34242q1469j9735p6983r308k5168R8214O762
10420A975174j8807j00313l0879j8382L390J1700n1564O371J34448P4059j9078
10409A966119j11478p359j17643j38341n6806p8991j4813o2147R2627M9670n9102
$$ y = [6255777, 6210038, 6039752, 5880253, 5819612, 5822585, 5642893, 5526642, 5469107, 5205353, 5046077, 4933663, 4830235, 4755462, 4727271, 4630668, 4575378, 4491792, 4409021, 4345893, 4269556, 4247905, 4127349, 4022411, 4042707, 3886009, 3699902, 3494489, 3448343, 3434580, 3400714, 3479050, 3402638, 3365034, 3262010, 3159837, 3156109, 3129092, 3046924, 3040660, 2823585, 2680150, 2709526, 2709266, 2629331, 2577035, 2566795, 2490988, 2442693, 2380440, 2551092, 2536284, 2469763, 2364261, 2330089, 2286075, 2217103, 2082861, 2001392, 1981657, 1904674, 1895366, 1870198, 1968412, 1975174, 1956367, 1856054, 1825175, 1806793, 1810183, 1821883, 1770319, 1776690, 1911138, 1985197, 1966119, 1854641, 1847282, 1729639, 1591298, 1534492, 1455501, 1440688, 1378541, 1471168, 1520838, 1461736]
10398A461736p2929K5989N805M5040O6254l4071j2241m25l8015j08182l9974p1864
10386A227123k1182K0188K5650k5584j09053l5724j20892m0509L7890J8155K2307
10375I98369M482j995o9116k4115M427p1549L8735m345M520M2723O5428M1173
10363A028737Q0443o3395k57623m0628L058m707o9084J19175J05761o5562Q5435
10352I21610K934k363o1632j90652n7650Q698K2956J4038k906l673J1434L4273
10340F97067K1043k0643R141P3092n238L1239j17291p7042J50368k5804j17763
10329F18169k06600j0228J14680L5159o4611m8065N077J52065J05254r1799j371
10318F07730K840l9296J2847K6445P4068j16519j18215L4301J3175J22774Q7342
$$ y = [1461736, 1388807, 1414796, 1420601, 1465641, 1531895, 1497824, 1485583, 1485158, 1447143, 1338961, 1298987, 1227123, 1205941, 1226129, 1251779, 1226195, 1117142, 1081418, 960526, 920017, 957907, 976062, 998369, 1002851, 1000856, 931740, 907625, 912052, 840503, 879238, 874893, 879413, 922136, 987564, 1028737, 1109180, 1045785, 788162, 747534, 750592, 745885, 676801, 795976, 901737, 836175, 921610, 924544, 922181, 860549, 669897, 612247, 620945, 643901, 657939, 655033, 651360, 662794, 697067, 718110, 697467, 706608, 779700, 774462, 805701, 688410, 611368, 761736, 735932, 618169, 411569, 401341, 516021, 551180, 486569, 438504, 443581, 595646, 700900, 609101, 607730, 610570, 571274, 584121, 610566, 684634, 568115, 449900, 484201, 497376, 620150, 707492]
10307G07492J379o1756j27529j53072o2849M1016n7151m4083M6722l52P0277L5421
10295C95515p6408Q3572q4041q2827M0831O1569k3501m3053J6480M5105m734j65404
10283A63104l6802O4748N2891R74P1828n6992o9491P0469R2999q6435p7687N8560
10271B48166Q4345l6032j16065j24932K24654J6245l8727j8551o2671n6854k7032
10260I2546k7620o0986K02046J3981q38L1014Q7824o1296j14523M2757K4408k5243
10248B04070j49983p9679J19580O0310o2388J1066K7206l2669J57645Q4382j07668
10237B31872r6080l7771m1994Q2669Q8992r1388Q954L8652m3167L370n0329j11575
10225a7795K9145N1635n1114n1040o0867m2300R4237K6868n0740O4842O8755K8685
$$ y = [707492, 708871, 647115, 519586, 366514, 303665, 344681, 287530, 243447, 290169, 289817, 360094, 395515, 319107, 402679, 318638, 235811, 276642, 338211, 314710, 271657, 288137, 333242, 328508, 163104, 126302, 191050, 243941, 244915, 316743, 259751, 190260, 260729, 353728, 267293, 189606, 248166, 332511, 296479, 180414, 55482, 280136, 296381, 257654, 239103, 176432, 119578, 92546, 64926, 3940, 205986, 219967, 219129, 250143, 337967, 276671, 162148, 204905, 229313, 204070, 54087, -25592, 93988, 154298, 91910, 102976, 130182, 97513, 255158, 339540, 231872, 135792, 98021, 56027, 138696, 227688, 136300, 145254, 183906, 140739, 144109, 93780, -17795, 11350, 62985, 11871, -39169, -100036, -142336, -48099, -21231, -71971, -7129, 61626, 90311]
10213I0311O5209p2555L9328j9936q6844j22700q223K6970O8229K7533O7534j7903
10201E6953P2563k1102j06019J7309j5212n6816J08284m1681r6144p623m4642
10190a34130j4691M6588m1092N6479J78563R6770n1589O766m0976m9297L6803
10179I0194K7032Q147L2688L4212n579q3469J78510R3076J86500n035n6857k9823
10167D69596P4916l545K0936k7668l3628M4428J53257m5246p5080L3398J41289
10156G52653M49K5639p2810l8620J16681K7792O0045Q0171p7547J4923K7067J56621
10144A073064Q0499o5259j4305l6258j65073l2328l9089M584J26970J9586k434
10133I49957L9131m5635j34908n9721J7431o0614O6595L5182m6009k6855l4215
$$ y = [90311, 155520, 82965, 122293, 102357, 15513, -107187, -115410, -88440, -20211, 7322, 74856, 56953, 129516, 108414, 2395, 19704, 4492, -52324, 55960, 14279, -81865, -89488, -134130, -148821, -102233, -143325, -86846, 91717, 188487, 136898, 143664, 102688, 53391, 90194, 117226, 125373, 158061, 192273, 186694, 103225, 281735, 374811, 561311, 556276, 499419, 469596, 544512, 540967, 561903, 534235, 500607, 545035, 698292, 653046, 577966, 611364, 752653, 753102, 778741, 705931, 667311, 783992, 811784, 871829, 952000, 874453, 889376, 916443, 1073064, 1153563, 1088304, 1073999, 1037741, 872668, 840340, 801251, 805835, 932805, 952391, 949957, 989088, 943453, 808545, 748824, 766255, 705641, 772236, 807418, 761409, 734554, 700339]
10122G00339q2774j65414j82172L3997M1597j00316j87018L3572J39500M2301
10112B73612q0199n0845j592M8745j26189j66399Q0174N4763k9454l9189K1908
10101a4665q8625k9527L0048K74397J71368K3925j37081j71805j04939N9874R9534
10090A12504j5563K2081K2998L6966J7926m3133l1356R9538L5212l3975n0288
10079A72910q9987K5517l7565o1583n8358n0581O0929r387Q6127J05416J01192
10068B44630L6686J29001j15241j14125L9186l380q6208n2159j61301r9991J25081
10057e7821P1008j43698l9162J2042K2893J31827N0244Q2853N3660j094j8709
10046A64043l6396M9647j0627K8663k1897j7280l7915L871P6324l0119o230M9392
$$ y = [700339, 617565, 452151, 269979, 303976, 345573, 245257, 58239, 91811, 231311, 273612, 193413, 142568, 140976, 189721, 63532, -102867, -22693, 32070, 2616, -36573, -14665, -103290, -132817, -102769, 171628, 342996, 366921, 229840, 58035, -46904, 12970, 112504, 96941, 119022, 142020, 178986, 196912, 153779, 122423, 221961, 257173, 223198, 172910, 82923, 108440, 70875, 9292, -49066, -99647, -38718, -48105, 38022, 143438, 244630, 281316, 410317, 295076, 180951, 220137, 216757, 130549, 78390, -82911, -182902, -57821, 13187, -130511, -169673, -157631, -134738, -2911, 47333, 130186, 183846, 182752, 164043, 127647, 177294, 166667, 195330, 173433, 156153, 118238, 122109, 198433, 168314, 162084, 211476]
10034B11476j29762j20806k9580j02591O5399J84357j802r6222n5018J47730n7766
10023A5415j17488R2122p0879O2838k3958n5546r517N3782P4953J1828l2704q2715
10011h1869j0303K4802m0119O7500m1378R9866R2486N775j14632j05679Q225o6402
9999a61728N8632J0073R9792L8152K700p9415j3316l2900K9651j03027N7726J27650
9987C3990J9704n8604j3372M2080R1654N4996N2871j57512j94344k8766J28038
9976b9265J12110J7510M4960l5080K5368R3191n5131m1046l9465J56118j9918
9965B29352j03835p1467J6565M2477j482P7062R0341o0887j92112j22893P035
9954h9844M9606O611j52783m585q6484N0708J39071k5766q0135L8041n5904N3559
$$ y = [211476, 81714, -39092, -68672, -171263, -105864, 78493, 76691, -19531, -74549, 73181, 15415, -102073, -9951, -80830, -17992, -41950, -97496, -107013, -53231, 21722, 33550, 846, -81869, -92172, -67370, -107489, -39989, -81367, 18499, 110985, 116760, 2128, -103551, -95326, -161728, -103096, -93023, 6769, 44921, 47621, -31794, -45110, -78010, -48359, -151386, -93660, 33990, 53694, -4910, -18282, 23798, 115452, 170448, 223319, 65807, -128537, -157303, -29265, 82845, 100355, 145315, 110235, 135603, 228794, 173663, 132617, 93152, 249270, 229352, 125517, 54050, 70615, 113092, 111610, 188672, 279013, 218126, 26014, -96879, -89844, -40238, -33627, -186410, -190995, -277479, -226771, -87700, -113466, -193601, -155560, -211464, -157905]
9942a57905l6480J567J37433L1484l8984N922k7950L202O5034N7616n0160j35527
9930a44748l3147Q1275J14384J35273R5167N1858q4863j75600j05379l9707k5693
9919a31180R648L9539J68909K2404l5800p6705j6055m7611J12954P4000J1443
9908A31546J41949j05290k23865l1734J33511m540l6233L5348j0733J25836L4069
9897A89864j4069r0640k2844k4525J257O2081k3829N070L1942o7643j9688j7114
9885I862J9760m0134n9397J7880k8248O033m5579K4413P4853k9227k7816M9907
9873b7693P7196L2220r902j24362j18259Q672N1386J05702R453n5468Q9275J02775
9861A40995j3902J0906n0268j0384j7879r1257M7146P736M0428O3181n4865j3277
$$ y = [-157905, -194385, -192818, -55385, -23901, -62885, -56963, -84913, -81711, -16677, 40939, -9221, -144748, -177895, -96620, 17764, 153037, 248204, 300062, 215199, 39599, -65780, -105487, -131180, -121532, -81993, 86916, 109320, 73520, -3185, -19240, -66851, 46103, 120103, 131546, 273495, 168205, -55660, -87394, 46117, 41577, 5344, 40692, 29959, 155795, 189864, 175795, 85155, 62311, 37786, 39043, 101124, 77295, 82365, 114307, 46664, 26976, 9862, 29622, -10512, -69909, -52029, -80277, -74244, -119823, -95410, -20557, -49784, -77600, -27693, 49503, 81723, 71821, -52541, -170800, -162128, -110742, -5040, 4413, -51055, 38220, 140995, 127093, 137999, 87731, 77347, 59468, -31789, 15357, 23093, 63521, 126702, 71837, 58560]
9849E8560O8992R003q2348Q1354L9603k6302J3090q4138l3401m4687P7725J19143
9837A96594o799J3253j26685j17220p2330R3108j368m3615k5751l3480r028O0192
9825g3129L4189K2509Q4228k418j5791j08576m912J9132N8451k4433M7971O6356
9813A03577k7813N0514l7983m5278k8144l5737l785J09349P3488j28978l5871
9802f661k0684j05938m878J7071p3633j5355J62647R8734J92431r0501j41975
9791A1258J6043k0395r8828j05309K1485J34616J30580j0739r2704K9587K1731
9780C7325k281Q1750M3225p0614O2420R569q5031r2834m5209P9809N469r5529
9768g1931j6444J0230j8838j9430n3592M0127R7625L1558j8016L3587J5743j09193
$$ y = [58560, 127552, 136555, 54207, 135561, 175164, 148862, 161952, 77814, 44413, -274, 77451, 196594, 189795, 203048, 76363, -40857, -113187, -20079, -21447, -65062, -90813, -124293, -133321, -73129, -38940, -16431, 67797, 65379, 49588, -58988, -63900, -44768, 13683, -10750, 37221, 103577, 75764, 126278, 88295, 43017, 14873, -20864, -24649, 84700, 158188, 29210, -6661, -27345, -133283, -138161, -121090, -194723, -210078, -47431, 51303, 243734, 153233, 11258, 27301, 6906, -91922, -197231, -175746, -41130, 89450, 78711, -13993, 15594, 37325, 35044, 116794, 160019, 89405, 151825, 161394, 76363, -16471, -61680, 18129, 23598, -71931, -88375, -78145, -96983, -116413, -170005, -129878, -32253, -695, -18711, 14876, 30619, -78574]
9756g8574N8468l16k3573M6670N4173J30991p1225k9466K8850M9225k7201r1124
9744D6898l3096J2516R1073m8744r3187q7846P9655q1382k1012J70577n7650j49419
9732a71617L4411R1338K0917p1259k801M1780N3723j2929J70105R5663k6017r5493
9720A27821k4511r92m4297n7011o3894q4385j8205J57894M2621K0907M3820O8076
9708A67844j51948J6966K4356J42365L2201K1794q8661j9432k479o8358j5238
9697E9410k7780N6788r3316K4007J3386o2892p8147m0175o175M1518J23562O3689
9685G3875J44557O2046j16648n9600M908l1376k954M1896O145m7729j790j07697
9673c4367R541J30114m492j14035j421L3151N0499m5850K1976M2758P0412M8202
$$ y = [-78574, -20106, -20422, -43995, 2675, 56848, 187839, 116614, 87148, 115998, 165223, 138022, 46898, 13802, 26318, 117391, 68647, -24540, -112386, -32731, -114113, -135125, 35452, -22198, -171617, -137206, -45868, -24951, -96210, -99011, -57231, -3508, -16437, 153668, 249331, 223314, 127821, 103310, 102318, 58021, 1010, -62884, -147269, -165474, -7580, 35041, 55948, 99768, 167844, 15896, 32862, 57218, 199583, 231784, 253578, 164917, 145485, 143006, 74648, 59410, 31630, 88418, -4898, 19109, 32495, -30397, -108544, -148719, -154894, -113376, 10186, 73875, 218432, 280478, 163830, 104230, 109138, 77762, 74808, 116704, 122849, 75120, 73330, -34367, -24826, 105288, 100796, -13239, -14660, 18491, 68990, 23140, 45116, 87874, 158286, 206488]
9661B06488m8443m5467Q3185j6944p786L9493P8728j20698p3784j46804M348J43721
9649I6037J57172J72516J05346m4847n8439L0806M1960J14246J2254k00800r7698
9638C28553q7488n2430n3071j03933k7361P2114r6270j28111m6196K20393J31003
9627A57203N0152l9043r1712j34514m9871P9912k9850K7325O6021J4190q967j3061
9615B7785r4880j17773M0675J01725L9482n0132K928P8530J52596p9450j50577
9604d9091K14078J44380j18396j08528Q786j62410j33228J08463O7313m055l1871
9593f4559L351P9067M8004l748R236n2086j70578K272J0255M5832P0235m9344
9581g2063n8147K0775n1485o7277M7209O6251R5455K4513o9579p6519M6267J29020
$$ y = [206488, 158045, 112578, 195763, 178819, 171033, 210526, 289254, 168556, 94772, -52032, -47684, 96037, 253209, 425725, 531071, 486224, 427785, 458591, 500551, 614797, 627051, 426251, 328553, 241065, 188635, 135564, 31631, 4270, 76384, -19886, -147997, -194193, 26200, 157203, 207355, 168312, 76600, -57914, -107785, -27873, -57723, -30398, 35623, 49813, 40846, 27785, -67095, -184868, -144193, -42468, -2986, -53118, -50190, 28340, 180936, 101486, -49091, 164987, 309367, 190971, 82443, 91229, -71181, -204409, -95946, -28633, -32688, -64559, -61208, 17859, 65863, 62115, 71351, 19265, -151313, -149041, -138786, -92954, -22719, -72063, -130210, -109435, -160920, -228197, -180988, -114737, -19282, 5231, -64348, -140867, -94600, 34420]
9569C4420k9898o4453Q4957j50472n9793J42593J14647n060k0454q6971m6127
9558h6611J19028J4921j14530j04830j16288J0717L7243O7451Q8097M2200j070
9547d3672M432o3435q5834R6229J43395L6471j43473l5910o3140N5532r1265M8845
9535a41825R0979n505N5944j0108M8655K2755j0716m3347p8248L5107O6161j99460
9523a69608K3848j3579N1693Q8901O2600r2539o7070J92251O3018k8600l9524
9512G1391N005N741J00942L623m5532j8668R7084j86616q9807L1524M4745K2486
9500D1918O1349L6096k385l2200q8802P8151L6820N4475R907j9990P088m9474
9488A32953q7273K2948j0637k8770o268m2359J17089k6554O0808N2054j46845
$$ y = [34420, 4522, -59931, 25026, -125446, -185239, -42646, 72001, 66941, 46487, -40484, -86611, 32417, 47338, -67192, -172022, -288310, -277593, -240350, -172899, -84802, -42602, -43672, -39240, -102675, -188509, -92280, 51115, 87586, -55887, -91797, -154937, -99405, -190670, -141825, -50846, -56351, -407, -10515, 38140, 60895, 50179, 6832, -71416, -36309, 29852, -169608, -145760, -159339, -107646, -18745, 43855, -48684, -115754, 76497, 139515, 110915, 71391, 76396, 82137, 183079, 186702, 141170, 122502, 219586, 32970, -56837, -25313, 19432, 41918, 103267, 139363, 136978, 104778, 15976, 94127, 130947, 185422, 195329, 175339, 182427, 132953, 45680, 68628, 57991, 29221, 22953, -19406, 97683, 71129, 131937, 183991, 37146]
9477C7146j26041O5046J11199j4973K5632J29959j672r2735j12214n8347L457
9466c3543J30597O7093r1934j5450o1517R09O7779m6511j8434P7889N5566J2957
9454A45401j3565R2762O5983J62188Q9909J12684J62404O3293J15844p830j48524
9443H40549j44946m8133j55552k12422j36984M6340N3380j2805J10918K29566
9433E69911J82715J27111N5574o0145k0259o2353M2091N7444P9784l31p2099j50300
9421G49143q577n0048n0289k9210J3456J5828k1919R1946K1841n2491N673K54261
9409I39614M47458L37863J41409K14045R4967Q1259j32316m15493l53974k17247
9399A137585r6210o3966j669M602j31862k01961P5885Q7099J55111O5349q2646
$$ y = [37146, -88895, -23849, 87350, 72377, 98009, 227968, 226296, 133561, 21347, -37000, -33543, 97054, 164147, 72213, 56763, -4754, -3845, 63934, 17423, -1011, 76878, 132444, 145401, 131836, 224598, 290581, 452769, 542678, 655362, 817766, 881059, 996903, 989073, 840549, 695603, 647470, 491918, 279496, 142512, 188852, 242232, 229427, 340345, 569911, 752626, 879737, 935311, 875166, 854907, 792554, 834645, 892089, 971873, 971542, 899443, 749143, 740566, 690518, 640229, 611019, 624475, 640303, 618384, 710330, 732171, 679680, 685353, 939614, 1387072, 1724935, 1866344, 2080389, 2175356, 2256615, 2124299, 1708806, 1354832, 1137585, 1041375, 977409, 975740, 980342, 848480, 646519, 722404, 809503, 964614, 1029963, 947317]
9388I47317l9075O2745R6953j8597J09350L5049j01321m3562j36303n3619j23259
9377G35678j05218j03188l0976L7950k5362K1714m8655O1433m217J66405O1291
9366G66855Q7526J0500K3750o5189k1658P0531P164j35456j68003r0083j41098
9355C44839M8212M7864j06148r1413P82q5093l1661P6612j39079M3902J12523
9344B21340R3031o7364l5892R7358J4300j12626j77623O2202J02242O9679j1785
9333B54862k819j76172j28223Q861M8146P867N0514o4165N3180J8227l2138j16940
9321g8800l2254J13410O2198J1025j5426O050R0058J02105L415j24868n3605n3142
9309C0166k9126J19952R8272L4738q9809L8593k5737j16120q2221P392N8977K5560
$$ y = [947317, 908242, 970987, 1067940, 1049343, 1158693, 1193742, 1092421, 1048859, 912556, 858937, 735678, 630460, 527272, 496296, 534246, 508884, 530598, 481943, 543376, 539159, 705564, 766855, 854381, 864881, 888631, 823442, 801784, 872315, 879479, 744023, 576020, 485937, 344839, 393051, 440915, 334767, 243354, 244136, 159043, 127382, 203994, 64915, 108817, 221340, 314371, 247007, 211115, 308473, 322773, 210147, 32524, 94726, 196968, 266647, 254862, 252043, 75871, -52352, -43491, 4655, 12522, 63036, -1129, 52051, 70278, 38140, -78800, -111054, 2356, 64554, 75579, 60153, 66203, 156261, 258366, 261781, 136913, 83308, 30166, 1040, 120992, 219264, 254002, 164193, 202786, 177049, 60929, -21292, -13900, 45077, 70637]
9297G0637p3633j35418o375J50382J47479j39525p6811j030l95L1762O3606R9608
9285A30287o825m860N922m7214R3138N7976r3199l2574p2259K1002Q3421P8179
9273B12994m2227L5514L3476n503J4937Q58O5384M3054k31828j28773J805J45862
9261A45553K0484L3598n5523q3753l2715L1117K0544j76804o3885L4769N6554
9250g0061O8001O3653k5973M962J2294L3576j54960N8399J36062O421k45213k5329
9238a38168J18360L5868R4718R2036K6090J6076M3264j27826p6594j2408M1007
9227A12423K6628l2991J4630J8967n2888k3012K680J17475j07751j72553n481
9216a01873J23768J30179L5560o8899p7355o468m2415k1160k3020P2163P6740
$$ y = [70637, -2996, -138414, -144789, 5593, 153072, 13547, -63264, -64294, -64689, -32927, 30679, 130287, 123462, 118602, 124524, 77310, 170448, 228424, 135225, 102651, 30392, 51394, 134815, 212994, 170767, 206281, 239757, 234254, 249191, 250049, 315433, 358487, 126659, -2114, -309, 145553, 166037, 199635, 144112, 60359, 27644, 58761, 79305, -97499, -161384, -126615, -70061, -2060, 61593, 35620, 40582, 52876, 86452, -68508, -10109, 125953, 132374, -112839, -138168, -19808, 16060, 110778, 202814, 228904, 244980, 288244, 160418, 83824, 71416, 112423, 139051, 106060, 120690, 139657, 86769, 63757, 66437, 183912, 76161, -96392, -101873, 21895, 152074, 187634, 118735, 41380, 34912, -7503, -28663, -51683, 20480, 97220]
9205I7220o9484m371K5957N7324j2169J22037K6219j03530j06894p6162j6379
9194f0232L6883p0494K0188L6089o0317p8163M7310J47800Q5538k3926n3412K3871
9182E1135r2251k8898J2412N1777j966M5337m4888l7277n0494O7013J31541M5756
9170A49197j47835k08494o503K4421J64226M6200p1841l4788R7025J397L7157
9159E0162j79137l0161R3397q592M3159J9592Q8998N7736l5859m9725O1183l4024
9147G6729R373m9509p0518L2767k9658O161q4516n7870P9627J39877j7649q8036
9135e3222l8606J803J1384j17596k2273Q3115J25787P9263p1539M7019n3153j08582
9123a16600o3286K0570L8086R2025N991o8397J92754J06994j22917j70761N962
$$ y = [97220, 27736, 23365, 49322, 106646, 94477, 216514, 242733, 139203, 32309, -43853, -60232, -23349, -93843, -73655, -37566, -97883, -176046, -128736, 19064, 104602, 80676, 27264, 51135, -41116, -70014, -57602, -5825, -7791, 37546, -7342, -44619, -95113, -28100, 103441, 149197, 1362, -207132, -213635, -189214, -24988, 21212, -50629, -85417, 11608, 13005, 50162, -128975, -159136, -65739, -74331, -31172, -11580, 77418, 135154, 99295, 49570, 110753, 76729, 86102, 36593, -33925, -1158, -30816, -24655, -109171, -167041, -87414, 52463, 34814, -53222, -91828, -90025, -78641, -196237, -218510, -135395, -9608, 69655, -1884, 45135, -8018, -116600, -179886, -159316, -121230, -29205, -23214, -91611, 101143, 208137, 85220, -85541, -79579]
9112g9579O5189m849J66835L4216n5845m0348L8873o0893k4231M3147L4495j49438
9100c2428m5111K0028P5328J1586n1474L4890m0914n0865N0378j1571l3715n5303
9088a29171L9415N1279O0756l8624j821O5656k2924j2157J12056J2643q4029O1962
9076A15041O848n1621M7314m2759j03668K1459N4774j3595l0015P888l1039J07202
9064H7829P3591R5465j54898j45069p1619j4407J24735N6737K6503L9194L72K6980
9052A45413P5738J70707q6054q5812o1434j16046p631N4022K4749j79673J156
9041f4865R5073q0381K120L6416k3661p2658K3400O4571k2636j6924m3801l377
9029a06723P2636L699M7224L1372j69434l6201M0660Q757K1681P0506P7714j5469
$$ y = [-79579, -14390, -19239, 147596, 181812, 125967, 85619, 124492, 63599, 39368, 82515, 117010, -32428, -77539, -57511, 17817, 29403, -22071, 12819, -28095, -78960, -28582, -40153, -73868, -129171, -89756, -38477, 22279, -16345, -18166, 47490, 24566, 12409, 124465, 137108, 53079, 115041, 121889, 70268, 117582, 74823, -28845, -7386, 47388, 33793, 3778, 11666, -19373, 87829, 161420, 256885, 101987, -43082, -114701, -129108, -4373, 52364, 78867, 118061, 118433, 145413, 221151, 391858, 305804, 219992, 158558, 42512, 34881, 88903, 113652, -66021, -64865, 30208, -50173, -48053, -11637, -35298, -107956, -84556, -19985, -42621, -59545, -103346, -106723, -34087, -30388, 16836, 48208, -121226, -157427, -116767, -108010, -86329, -15823, 61891, 46422]
9017D6422j54159J31571O2102p8216l6269J71255j8552o9870K1067O8818J812
9006A45981p1122k0181J0066l0304K1501M7480p2593r1447k3035J707J94586N1781
8994A64420M4158K3513o4008q5145l6223N7905R6677j8752j36864m7591l4667
8983c6577k4385n0138J35717O7014L4087l7774k7279O0645J32347p3479j39219
8972D0959p0093J08232J01525k628J8043k9758j02154k7035L695o4985j1222M0420
8960D999L2288j2559M821M0797o51j86881J02985J50819J7405m9643o2957j6447
8948B4976l907J8501M0457j9056j68384q1980J87042j7725L2331o52j09774O0729
8936c7442L8060L5284K8744J8700K709n0869J2001j6304Q8684K8981p5209j70421
$$ y = [46422, -107737, 23834, 85936, 7720, -28549, 142706, 124154, 54284, 75351, 144169, 145981, 74859, 54678, 64744, 34440, 55941, 103421, 30828, -60619, -83654, -81947, 112639, 164420, 208578, 232091, 168083, 82938, 46715, 104620, 201297, 182545, 45681, -1910, -36577, -60962, -111100, 24617, 91631, 125718, 87944, 60665, 121310, 253657, 180178, 40959, -29134, 79098, 180623, 177995, 196038, 166280, 64126, 37091, 40786, -24199, -35421, 4999, 37287, 24728, 29549, 70346, 69695, -117186, -14201, 136618, 154023, 104380, 41423, 24976, 21069, 39570, 80027, 60971, -107413, -189393, -2351, -20076, 12255, 11603, -98171, -37442, 618, 35902, 64646, 83346, 86055, 35186, 47187, 30883, 119567, 148548, 73339, -97082]
8924i7082p0671j2270J01236j2874m9491N133J55906P6055j5781J8498j26227
8913b7568J0516J06316K0830r5567j26507p0588J6101J2186m6774N4679q5102
8902b31478j7904J8694L4236N0079J04339P3188p8083j07038n2345Q3107P0337
8891e2868j8416j8219r5114j23745P3007J18837N0069r943R3161J05988m4917
8880G7840j2395m2173J6141J14406r6029l8994N889Q155q4979J6998j0903L7752
8868h292J06925J20539q2007J43207P9280m7931m0842p6120r2264n9491q7531
8857d4527o9054j5001R904P209P648O9717P2948O4968M8577j7104j56964j15769
8845a37448m1433N533P2260l3358Q5776J29024P1003j07384J4212M8695Q814p212
$$ y = [-97082, -167753, -180023, -78787, -91661, -141152, -136019, 19887, 95942, 80161, 98659, -27568, -17052, 89264, 110094, 14527, -111980, -182568, -166467, -154281, -201055, -146376, -231478, -249382, -230688, -196452, -146373, -42034, 31154, -46929, -153967, -206312, -123205, -52868, -71284, -89503, -184617, -308362, -235355, -116518, -66449, -76392, 16769, 122757, 77840, 65445, 23272, 39413, 153819, 57790, 18796, 24685, 32840, -52139, -35141, -46044, -8292, 98633, 219172, 137165, 280372, 359652, 311721, 270879, 194759, 102495, 43004, -44527, -113581, -128582, -118678, -111469, -103821, -34104, 38844, 103812, 152389, 135285, -21679, -137448, -178881, -173348, -101088, -134446, -48670, 80354, 151357, 43973, 58185, 106880, 115694, 108482]
8833A08482M3682J9072r2211r9356q8133q8361M6996J73202O0216p0804n9157
8822d6372n7661m8865N6563N1968P2500M6928R571n1475j9779M763O8256j075
8810H5322j18118R914K10389J15547J0696l5241j02166p85J52764N5233r0646
8799B92909o7380j73733o9865K0398r2893r24O7111r996J6967M3026k4860l2804
8787c2044n9416K3874R4332R1000R235o8773m2654j3647n7674m8870J01293Q6245
8775H2901o1439M3697J11945J8084k1947J1380j46696j00543p0068Q718J47698
8764B3730P3229j4777r0155J07977R9151K2881J95356J01506r1597j14267k04597
8753A08437o2771o3340q3601Q5004P5049M1274l2777j6056R8420K1218o413J4460
$$ y = [108482, 152164, 171236, 79025, -20331, -108464, -196825, -149829, 23373, 83589, 12785, -46372, -104033, -152898, -96335, -44367, 28133, 75061, 84632, 33157, 13378, 18141, 86397, 85322, -32796, -22882, 187507, 303054, 313750, 278509, 176343, 175558, 328322, 383555, 292909, 225529, 51796, -18069, 2329, -90564, -91488, -24377, -34373, -17406, 25620, 760, -32044, -91460, -67586, 26746, 117746, 126981, 58208, 15554, 1907, -55767, -104637, -3344, 82901, 21462, 65159, 177104, 195188, 173241, 184621, 37925, -62618, -132686, -123968, 23730, 96959, 82182, -7973, 100004, 199155, 222036, 417392, 518898, 427301, 313034, 108437, 45666, -17674, -101275, -16271, 58778, 100052, 67275, 51219, 149639, 170857, 164444, 178904]
8741A78904r268p6429n964n0634p8489m9126Q0539J0918n1509n6449j2524Q0712
8729c9319N0560J8546q1388o1592o8359k6119R2070J39497J16603k4331p9715
8718C6453P679n0951j36249k7715J47080R4452l0111p5624O815r107j1527J8659
8706c0146K9459j8967J6131P1843o2316k2759L713l2858L4502n528n9156m021
8694h0103J05833J19882j14157j08730m69N3046Q5572p0670o2646M471O6428N8753
8682E7210j8360P4975L3246O490J19474J9441k02506o0599q767J7508M5862K5768
8670A09742K4364M8374l6725Q9288k0285l8474j1022O5339p9595M7337M506p5850
8658A26999l3165J198k7673k8420l0192o0326P7236J21379k5390K3547L1260n2367
$$ y = [178904, 169636, 93207, 87243, 36609, -41880, -91006, -10467, 451, -51058, -107507, -120031, -39319, 11241, 29787, -51601, -113193, -181552, -207671, -115601, 23896, 140499, 116168, 36453, 44132, -6819, -143068, -170783, -23703, 70749, 40638, -34986, -28171, -37278, -48805, -30146, -687, -19654, -3523, 68320, 6004, -16755, -13042, -45900, -11398, -16926, -76082, -80103, 25730, 145612, 31455, -77275, -77744, -24698, 60874, -9796, -72442, -67971, -1543, 57210, 38850, 113825, 147071, 153561, 273035, 292476, 89970, 29371, 20604, 38112, 83974, 109742, 134106, 182480, 145755, 235043, 214758, 176284, 165262, 230601, 151006, 198343, 202849, 126999, 93834, 95032, 67359, 38939, 8747, -51579, 25657, 147036, 121646, 145193, 176453, 124086]
8646A24086j76460o8438J6031J31998J559j7278q0069l3951p445n9748J1780o0140
8634b18075k0143J28701R2548K7034J3279o4014n6916k7347O5429J8761j2417
8623e3160n7375O2254N4486O893J089J28130p2048Q924j3089o4151J235p9146
8611g5958l5334j54M247j01356Q0698L4883R3842q2247j30508J08794J05339J37279
8599A39525J2648j52488n1054m7265J45035l2045j31544O9110J3325l9042L6280
8588c7515M7053L2547K9858J979r039m55k4829K3584N176M2349j903O250j4299
8575A00756m0622n3992p5219m3957J48593O4191q3721k5575k3715L8870M076O1686
8563G1371L8577n2887m7207m7912r1645o7305K54195J87084j05615j17149o8066
$$ y = [124086, -52374, -120812, -104781, 27217, 28776, 11498, -68571, -102522, -109967, -169715, -157935, -218075, -238218, -109517, -16969, 10065, 23344, -40670, -97586, -124933, -59504, -40743, -53160, -110535, -48281, 6205, 13098, 14187, 142317, 70269, 79193, 66104, 1953, 3188, -75958, -111292, -111446, -107199, -208555, -127857, -92974, 868, -81379, -211887, -103093, 2246, 139525, 152173, -315, -51369, -98634, 46401, 14356, -117188, -48078, -34753, -73795, -37515, 9538, 42085, 71943, 73922, 64883, 64428, 39599, 63183, 68359, 110708, 108805, 115055, 100756, 60134, 6142, -69077, -113034, 35559, 99750, 16029, -9546, -33261, 5609, 9685, 71371, 109948, 57061, 9854, -38058, -129703, -197008, 57187, 244271, 138656, 21507, -46559]
8552d6559M2770P2177K02746K1514j27593j16366O462R6705l6189J801R640p3986
8540E3122m3744Q5380L4313M8593k2525j8928k6865j49094N8383J49088j3048
8529A54675p0467j855L8633j5556M0894J51314j19861j06215L4020P4524k6456
8518A53650P9256P4446j40668o0064o4259p729o3657j63847o2993J22897J07386
8507b5582q253O6892M6065j17693J2570J5353j12853J3904L6571n8887R481k9836
8495a52268J16681J08818O6446r4724p5162m5223J9897R3388K2826l1407m8385
8484a9113O3779n3112j21607m993J5113M2398L9069j8427q4160J65509J12759
8473A37215j56524p2756K1982R8332l6658k465M9368l9887j09131k0477J8162
$$ y = [-46559, -3789, 68388, 271134, 292648, 165055, 48689, 55151, 151856, 115667, 117468, 127108, 53122, 9378, 94758, 129071, 177664, 155139, 136211, 109346, -39748, 18635, 167723, 154675, 84208, 82353, 120986, 105430, 146324, 297638, 177777, 71562, 105582, 180106, 153650, 232906, 307352, 166684, 106620, 42361, 34632, -29025, -192872, -255865, -132968, -25582, -33835, 33057, 79122, -38571, -26001, -10648, -123501, -109597, -73026, -131913, -122432, -152268, -35587, 73231, 139677, 44953, -30209, -75432, -55535, 37853, 60679, 29272, -19113, 44666, -8446, -130053, -135046, -119933, -77535, -38466, -56893, -141053, 24456, 137215, -19309, -92065, -70083, 28249, -8409, -10874, 38494, -1393, -110524, -131001, -112839]
8462a12839P2257M2707J32488P0880L0463j13719j61259J18890P1201j7323k348
8451A31398J15690k3296j37574m9900K8980J2660r0373j63869N4965M9720J03992
8440C2393J06395j47154K798J33549n9523j83022J1957J87308L1121J3O791P3074
8428A95700j6418m5779k5875L142M0420j23332j0773j3753K2766M4197N696j64362
8416h8371k7942K6616J1569j1916k2126N8233J13521o3007p9480k7568k061Q5861
8404b6671O8797J6000n1367k6932q1652L084K9324j661m7248Q7953J61032k9483
8392A01176m4585n4963k2148r1957o75O1069j35494J783l599r5254J57401P3527
8380e3719N1148p390j03123P9610M5207K5583k4777J5273J61103J4229J02971
$$ y = [-112839, -40582, 2125, 134613, 205493, 235956, 122237, -39022, 79868, 151069, 133746, 131398, 247088, 223792, 86218, 36318, 65298, 77958, -12415, -176284, -121319, -71599, 32393, 138788, -8366, -5568, 127981, 68458, -114564, -102607, 84701, 115822, 115835, 122626, 195700, 179282, 133503, 107628, 110770, 151190, 27858, 17085, 3332, 26098, 70295, 75991, -88371, -116313, -89697, -78128, -90044, -112170, -53937, 59584, -3423, -82903, -110471, -112532, -26671, 42126, 58126, 6759, -20173, -101825, -98741, -69417, -71078, -118326, -30373, 130659, 101176, 56591, 1628, -20520, -112477, -113152, -52083, -187577, -185794, -189393, -284647, -127246, -53719, -2571, -9961, -113084, -33474, 11733, 37316, 12539, 27812, 188915, 203144, 306115]
8369C06115J7846k5458j19178k61356o8832o3773L2652P6001K2290J05585N5594
8358G7486l6782j17214j7101J57399o5582m1036o3040n4453K8951R3291M2612
8347D531K41270j1643p3534j00656j44839O9197J2730n2531O5750O8447L4154
8336A12876m5635m4766p9610r8020J48593J65054P7421p3175o5139j11916k3679
8325c7996K1463N3419r3207o0037P9416O6019k9140j6594P3887N3701P9898q2108
8313A08721q1697j17447m8146J06632Q2688Q3508j3160p3183J18472p611j09017
8302D9760j57787L2765J00097L9495K7187K804n7723P9330m095k1805P9692Q336
8290A78056o8034j4478J030M241k1153l6933k4473m6061l2663l5422N624j6652
$$ y = [306115, 323961, 298503, 179325, -82031, -150863, -214636, -181984, -105983, -83693, 21892, 77486, 40704, -76510, -93611, 63788, -1794, -42830, -105870, -160323, -131372, -38081, 4531, 245801, 234158, 160624, 59968, -84871, -15674, -2944, -55475, 10275, 78722, 112876, 67241, 22475, -57135, -155155, -6562, 158492, 235913, 162738, 97599, -14317, -37996, -16533, 36886, -56321, -116358, -36942, 29077, -63, -16657, 57230, 110931, 190829, 108721, 27024, -90423, -138569, -31937, 50751, 134259, 121099, 47916, 166388, 158777, 49760, -108027, -75262, 24835, 64330, 91517, 94321, 36598, 115928, 111833, 90028, 169720, 178056, 110022, 95544, 96574, 100815, 79662, 42729, 18256, -27805, -60468, -95890, -90266, -106918]
8278a06918L4538m2879L2512L0918J61253Q6864j10497q8656L9882r6817R4601
8267C4801J20193L7339p7906j22963L2659K4906n872l3806n3949J47016O9793
8256A72211l0163n7666n4208p8732K600J7044M2256p3583r4265q8956R4831J03867
8244d4764J7979O3276Q4013m6679o8545o5087K7488K7431J14254J26907j23029
8233A13244j31158l1086j3468o1765o826O9022L7144J1505O0072n9636r7931L3459
8221g7424J4305K2284M6787n31m3112l7834K7821p4331r4823o2012J27537O5844
8209h5489l7978j3682J6300r4168k6690M6988K5506r6133M264R785J9793J47070
8197h4434J01437J4441P916j16028k2790K602P5090R561o6806N966p934q483j0742
$$ y = [-106918, -72380, -115259, -82747, -51829, 109424, 196288, 85791, -2865, 37017, -59800, 34801, 154994, 192333, 114427, -8536, 24123, 49029, 43157, 9351, -44598, 102418, 172211, 142048, 84382, 30174, -48558, -45958, -28914, 13342, -60241, -154506, -243462, -148631, -44764, -26785, 36491, 120504, 73825, 5280, -59807, -32319, -4888, 109366, 236273, 113244, -17914, -49000, -62468, -124233, -131059, -62037, -24893, -13388, 46684, -12952, -110883, -77424, -63119, -40835, 5952, 5421, -37691, -75525, -47704, -122035, -216858, -278870, -151333, -85489, -123467, -137149, -120849, -215017, -241707, -194719, -169213, -265346, -261082, -251297, -231504, -84434, 17003, 31444, 39360, -76668, -99458, -96856, -21766, -12205, -79011, -73045, -80979, -89462, -100204]
8184a00204M0253O9348K3142J0944p7041n1921M9053M1913p4686r4904n0088J89231
8172b4960R1786J21023K9388o5335n9524m6804P5381R0628J4692n8942j27241
8161D0092j58496j48183k1589J91356O9514L8985K8433j9961K844m7013j3650
8150c7668l8096L2061K1090Q822j09045L0484J18229n1165J0751R6385M1830N680
8138A29358j9337L9486K0296l6878j03500j47569l4228K0652Q0468J19399L0700
8127I8847m1985m5846P3447P3580n1045q7750J8111j3453O1954L7644r1285J7789
8115E0008K628J1131q1255K9173n4259j7417J13688M4150p0565j24871j04229
8104b01818k3848N4487O7100q54j10907p8716O4730J27044k7630j11119N9422
$$ y = [-100204, -59951, 9397, 32539, 43483, -33558, -85479, -36426, 5487, -69199, -164103, -214191, -24960, 66826, 187849, 217237, 151902, 92378, 45574, 120955, 211583, 226275, 167333, 40092, -118404, -266587, -288176, -96820, -27306, 11679, 40112, 20151, 22995, -24018, -37668, -75764, -43703, -22613, -13791, -122836, -92352, 25877, -25288, -14537, 81848, 123678, 129358, 110021, 149507, 169803, 132925, 29425, -118144, -152372, -131720, -51252, 68147, 98847, 56862, 11016, 84463, 158043, 106998, 19248, 37359, 23906, 85860, 123504, 32219, 50008, 52636, 63767, -17488, 11685, -42574, -59991, 53697, 97847, 27282, -97589, -201818, -225666, -171179, -104079, -104933, -215840, -294556, -229826, -102782, -130412, -241531, -182109]
8093a82109R59Q5378N4882q188j05365k8771r2446Q7181J69396M0983o9736q7006
8081a34842j3610O6686m1091j9425P4594L8003m0665o2691r5566K3435J12370
8070i2802M9180J2505J9724O0184o1526o3570l5010L0489L8837N6754l1038k03504
8058b19777l7996L2933M7024n276r7177J14033J08840J9162m5335J3665l0402
8047a00306l2028N653O2612Q4419Q9077J01951j12720J9561L5215j25361j36373
8036a08300O0763k7111n8663O764N6999k7585p1317J05099N7789l5212P182m796
8024c8388m2705j4222M6162L8844k6368L0973J6662M7387J1194m300M5901p693
8012A03447l77m4792j13874N6882l5608M964p2749p5133N1167J38663L3055J1347
$$ y = [-182109, -181150, -95772, -40890, -49078, -154443, -183214, -275660, -188479, -19083, 21900, -47836, -134842, -148452, -81766, -122857, -142282, -67688, -29685, -70350, -133041, -228607, -205172, -92802, -43622, -31117, -11393, 48791, -12735, -76305, -111315, -80826, -41989, 14765, -16273, -219777, -257773, -224840, -177816, -183092, -280269, -166236, -57396, -38234, -83569, -69904, -100306, -132334, -126681, -64069, 20350, 109427, 211378, 98658, 118219, 153434, 28073, -108300, -47537, -74648, -133311, -126547, -69548, -97133, -168450, -63351, -5562, -40774, -33592, -38388, -81093, -95315, -49153, -10309, -36677, -5704, 10958, 58345, 69539, 65239, 111140, 103447, 103070, 58278, -55596, 1286, -34322, -29358, -102107, -177240, -126073, 12590, 45645, 56992]
8000E6992M8203j20067q9515Q4312J83433P3130r2147m3954n9713M5475K0271
7989A06420L5776j01627j71643N1811J0102l5091n613L9455M9115j7789l6908
7978g5992J1229n2718n8511n053P9067M2394j7567L1370j56081l5389L0588M8981
7966a57682J31376L612N597j10156n9963p0936L0490L7276N7147L9555L9669K4034
7954b9981n2745K1270J08385k1861l369K9156p1141K5814P2550M0821L9248m5890
7942A12257j16258J40506J19955l3986j21556n0503j64916o2427l3812M4401O4830
7931a01509J9659o4652N4891L5615n1320O7125J23253K7511k2240m5418N966k6469
7919B2412l0435o2847j28298P47P2741J48122J73054n8813j55051o4721J8993
$$ y = [56992, 105195, -14872, -104387, -20075, 163358, 236488, 144341, 100387, 40674, 86149, 106420, 142196, 40569, -131074, -79263, -69161, -104252, -109865, -70410, -21295, -39084, -75992, -64763, -117481, -175992, -181045, -101978, -59584, -77151, -45781, -201862, -237251, -206663, -157682, -26306, -22694, -17097, -127253, -187216, -258152, -227662, -190386, -133239, -93684, -54015, -29981, -82726, -61456, 46929, 25068, 21699, 50855, -20286, 5528, 78078, 118899, 158147, 112257, -4001, 136505, 256460, 222474, 100918, 50415, -114501, -176928, -210740, -166339, -101509, -81850, -146502, -91611, -55996, -107316, -40191, 83062, 110573, 88333, 42915, 48881, 22412, -8023, -70870, -199168, -198421, -125680, 22442, 195496, 136683, -18368, -83089, -64096]
7908f4096P7753J48328l1030p9950o957p547P9573l1525P2311K5186j62815o9809
7896e0578K5440o017J03347N5622K4041L934k7205j2831R98r395M9990L9339l7314
7883A59371j09002m5729J26998M0061j5936R9952k9482p5104j71062r6262J0853
7872a05342M3979K563L5798p4692j08978m229L9458J5487J42848P1149k2405q6574
7860e0938L8790J11015j37470N823M9469k3740j3346P7352P2614k1111O7952m3332
7848A33078j8722m977m8460n5237R6002J5538r6789O8529m0084m1656o307J521
7836B436r8979j8972J14190J22827k4118j10129j29624j10999J9207M8099J09051
7825g7011j5617j9442O2034k692Q9836M6811p1230K7839K7633K5608l655r2001
$$ y = [-64096, 13657, 161985, 130955, 51005, 44048, 36501, 116074, 84549, 156860, 182046, 19231, -50578, -25138, -31155, 72192, 127814, 151855, 155789, 128584, 115753, 116751, 107356, 157346, 196685, 159371, 50369, 4640, 131638, 171699, 155763, 255715, 226233, 151129, -19933, -116195, -105342, -61363, -58800, -23002, -97694, -206672, -210901, -171443, -155956, -13108, 58041, 35636, -50938, -12148, 98867, -38603, -32780, 16689, -7051, -20397, 56955, 129569, 108458, 176410, 133078, 114356, 109379, 60919, 5682, 101684, 117222, 20433, 88962, 48878, 7222, 915, 2436, -96543, -115515, -1325, 121502, 97384, -12745, -142369, -253368, -234161, -186062, -77011, -92628, -112070, -50036, -52728, 37108, 83919, 12689, 40528, 68161, 93769, 90114, -1887]
7813a887m2758m1644L2636K231O4749M5166m4841j26636k8916j3369L7654P6523
7801d1092j1090J2831R3183p2415j83441L253O9651J6640l0012O3966r644m3180
7789a31350L1437K9698J9361m3626l424n2707M7271R5797N9738N3209l3105j21640
7777d9341j75094J58884N2608k3894J31602l1006q9986m9627p557N4321J24242
7766I5152J22099l5677n8596q2921M679j30247M3773k922l1490o6636J6020J6547
7754a10219N2272L2321J28331N4772j27361n6307k7235k5095j8589K5616J1304
7743f0190K0078p7090l2280p050J43350R599L5324N8527j4532K1226O5071q4116
7731G7917j56661j52338L3756J42018J07688q9654j32981Q698J31654l0574P3564
$$ y = [-1887, -44645, -86289, -53653, -51422, 13327, 58493, 13652, -112984, -141900, -155269, -117615, -41092, -52182, -39351, 53832, -18583, -202024, -198771, -129120, -112480, -142492, -78526, -88170, -131350, -99913, -70215, -50854, -94480, -97904, -150611, -103340, -7543, 52195, 105404, 72299, -49341, -224435, -65551, -12943, -36837, 94765, 63759, -26227, -75854, -83411, -29090, 95152, 217251, 181574, 122978, 40057, 44736, -85511, -41738, -44660, -76150, -142786, -126766, -110219, -57947, -25626, 102705, 157477, 30116, -26191, -53426, -78521, -97110, -71494, -60190, -40112, -117202, -149482, -156532, -13182, -3583, 31741, 90268, 75736, 96962, 162033, 77917, -78744, -231082, -197326, -55308, 52380, -37274, -170255, -161557, -29903, -60477, 13087]
7720A3087R1182j02336O6976J30744M8081j56219j41536o2081J00012M3338K5373
7709E6621J59425J13941k11141o2250m9763j3644k5033N4944j20775m2152k0691
7698a60518L223P7864O1497K6381J08434l7165p7810p5334M547j21755R5449J55906
7686F0719P1614o7004k891p5766r2551m3269M6329N9369L4701K9610Q3646M6144
7674A50651j09649j31597M5671J12161N7587p2693m1002p6259j07983q319Q4699
7663i6733l1061k6437P7300J00640K4337j06931j03339j6984R0331L3021P0990
7652A5134M4128r7279J1747r3886p845J4365n6336k9946R6876J56999j5203p9716
7640d0962j36132Q2956J35201L7648O5881k3785j80112j23298o8464J50626R7463
$$ y = [13087, 104269, 1933, 68909, 199653, 247734, 91515, -50021, -112102, -12090, 31248, 56621, 216046, 329987, 118846, 56596, 6833, -6811, -31844, 23100, -97675, -139827, -160518, -157295, -79431, -17934, 8447, 116881, 79716, 1906, -73428, -68881, -190636, -95187, 60719, 132333, 65329, 62438, -13328, -105879, -149148, -102819, -43450, -8749, 20861, 104507, 150651, 41002, -90595, -44924, 67237, 124824, 52131, 11129, -65130, -173113, -181432, -96733, -127794, -154231, -76931, 23709, 48046, -58885, -162224, -179208, -88877, -55856, 15134, 59262, -38017, -26270, -120156, -128001, -113636, -169972, -199918, -103042, 53957, 38754, -40962, -177094, -94138, 41063, 78711, 144592, 120807, -59305, -182603, -251067, -100441, -2978]
7629b978O8535J00301N802j10501m3277j38104n8204M1671p500J68154J37219
7618A61118k8058l6516n1096N8428j469j3182p6058q7001l0717M7212k5809j3181
7606i6329j554K4410m4709l5762J7634K2180j8961J5915k6825J27603N4526q3764
7594d5636j3074P779m4243J05114O2104o47l2096M4008l4377O5310R760P2714
7582A96716k7749p130p5910p3226o0185l3363j02690r5367q6443o074J34157J21815
7570a15449J00883l49J4078N6866n0625k6586l2551L2650n3512n6463K0099J7276
7558i3683N0405L7856N9368K1406l9879r6310j09884K4507l9277L9730M188m4784
7546a86357L5291L2348p0294n6148R8118O2411j8696K2159R355Q6741j2298l1623
$$ y = [-2978, 65557, 165858, 171660, 61159, 17882, -120222, -178426, -136755, -144255, 23899, 161118, 133060, 96544, 45448, 103876, 102407, 89225, 13167, -73834, -104551, -57339, -83148, -96329, -97883, -73473, -118182, -153944, -136310, -114130, -133091, -117176, -144001, -16398, 38128, -45636, -58710, -50931, -95174, 9940, 72044, 71397, 39301, 83309, 48932, 114242, 124002, 196716, 168967, 161837, 85927, 12701, -47484, -80847, -183537, -278904, -365347, -371421, -237264, -115449, -14566, -14915, -837, 56029, 5404, -21182, -53733, -21083, -74595, -131058, -110959, -93683, -43278, -5422, 53946, 75352, 35473, -60837, -170721, -146214, -185491, -145761, -141573, -186357, -151066, -118718, -189012, -245160, -147042, -84631, -103327, -81168, -71813, 14928, 2630, -28993]
7534b8993R806R7936M5882j40090j85862m8566J27228j554n5727L3383Q8014P8107
7522A9564j01387j55018m9910J0438Q4703N3993m0908k9069K9632J0706O4822
7511a02434o3386M5208J41829m791m0012j13955r8893M743N1422M5694R168j1483
7499a36890j02327j02849J12525J2967J34842p4502p4723M3878J32373O6911j08937
7488i6732p4512l2042p3977K839J33873J02218J164m272R0343K2758L5631O699
7476A13990m7020p8828J2685J48295n3214j16145N3226R7719p167n8756k0618
7465D4167j95560j41954P1888R6158Q5545n4090p8716J07523M5981l0701J20401
7454G0642m7564p1483p6948Q807q8255J5034R7128P6661N2189J8059q9845o9760
$$ y = [-28993, -19187, 78749, 124631, -15459, -201321, -249887, -122659, -124213, -179940, -146557, -58543, 19564, -81823, -236841, -286751, -276313, -191610, -137617, -178525, -207594, -177962, -167256, -102434, -165820, -120612, 21217, 16426, -23586, -137541, -236434, -231691, -180269, -134575, -125407, -136890, -239217, -342066, -229541, -216574, -81732, -156234, -230957, -187079, -54706, 12205, -96732, -171244, -203286, -277263, -274424, -140551, -38333, -37169, -41441, 48902, 71660, 107291, 113990, 66970, -11858, 827, 149122, 95908, -20237, 32989, 130708, 123541, 64785, 44167, -151393, -293347, -221459, -125301, -39756, -93846, -172562, -65039, -19058, -49759, 70642, 23078, -48405, -125353, -116546, -204801, -189767, -92639, -15978, 36211, 54270, -35575, -105335]
7442a05335R4980J06518R3601L4534m0935q0414n9428L1228O7693K1691j9K5260
7430A89374n8964j10519n6844Q7177o0633R703Q334q0220J13551L6076o595l0878
7418C9562o4802J41278M0217P0217J949j40454j17258K5892J57861l2908j30767
7407i213r778k7187k03879j3642J18724J43530j72613j17165M3824P030P5504
7396a64865J1323k3172j581M9488J3122k3697o3073J0964N8028J06073m407K9524
7384b273M8305R4327Q1592J60320l1836j29590j54711k8318j28o5044P017M1496
7372B1157R1607k1583o9810m1834M1399K088o6523q173M2404n8593P0423P6223
7360G8785n2262K7544M3684o9973o8704M9546p4326P3063M3096o738J2175p4050
$$ y = [-105335, -10355, 96163, 189764, 224298, 183363, 102949, 43521, 74749, 142442, 164133, 164114, 189374, 130410, 19891, -36953, 50224, -10409, -706, 7628, -72592, 40959, 77035, 70440, 39562, -25240, 116038, 156255, 226472, 228421, 87967, -29291, -3399, 154462, 121554, -9213, -18991, -46178, -250057, -263699, -144975, -1445, -174058, -291223, -247399, -240369, -164865, -153542, -176714, -178295, -128807, -115685, -139382, -202455, -191491, -133463, -27390, -31797, -2273, 46032, 140359, 221951, 382271, 350435, 220845, 66134, 37816, 37688, -27356, -20339, 21157, 112764, 91181, 21371, -20463, 20936, 23024, -43499, -51672, -9268, -67861, 2562, 78785, 26523, 54067, 97751, 27778, -40926, 8620, -65706, 7357, 50453, 43715, 55890, -18160]
7348a8160J2634j49798j39039K3751J01285O7293K5381k6290j4791J0583L4811
7337g2340N9063j7341r2482O5407j2096o0525L5909N4348J18526K6185Q6767m0271
7325A51150j95674q1713J5231P644J18441P4434m3898p4485j17064m2146Q685
7314a79395n2526l7885l103P0370J5799J34307P0869n4917p244J19616K4027j05817
7302e899l9184j7777O8068P8862k9230n8174o0361K9366l587N3956J4575L2617
7290F3232M1823M8593j37776k3514m6064K8324M4161j862q8164L2654J14223l8642
7278C6988j64611k3907L5445m4075o5800N580J88205o130J8718P9911q4459k5726
7266d9861k6118Q9582J0716p5408L6576M3365L2274L2313o6754j4126j22175O4904
$$ y = [-18160, -5526, -155324, -294363, -270612, -169327, -102034, -76653, -102943, -117734, -107151, -72340, -13277, -30618, -123100, -57693, -69789, -130314, -94405, -40057, 78469, 104654, 191421, 151150, -44524, -126237, -111006, -103362, 15079, 89513, 45615, -28870, -145934, -188080, -179395, -231921, -269806, -272909, -202539, -186740, -52433, 18436, -36481, -43725, 75891, 99918, -5899, -45083, -62860, 5208, 84070, 54840, -3334, -63695, -34329, -37916, 16040, 30615, 63232, 105055, 153648, 15872, -7642, -53706, -25382, 18779, 16917, -71247, -38593, 75630, 36988, -127623, -151530, -116085, -160160, -225960, -220380, -32175, -38305, -19587, 60324, -24135, -49861, -75979, 13603, 24319, -51089, -14513, 28852, 61126, 93439, 26685, 12559, -109616, -44712]
7254d4712J17228r8557j57641P8894p4420n886O3615M6204L5913O0336Q8563M6592
7242A56129K4675r457L6485L3056p5270j12836m0024K716L6838L2396j2784K1416
7230I3340j25900o7903Q6397L3442l2009o0137p4170l65O189m891R1471Q4948
7218C0412l2134o3331k267R8449k6624L089K4624l1953J8291J21526R0905n8156
7206A72831j42308Q7273R1187n4150P845J3442o0889n1875l1746j34608j76904
7195b79902p4353J54922Q9787J20121M1206O0261K3984L0109j67760p2543R4281
7184B0113o2452j0465Q765o7989N8006Q4920O7265j08031j43603Q3268J48536
7173G8333P7529p8121j41871J059O1018Q1303j22063L5738K6231J1673n3034p9411
$$ y = [-44712, 72516, -26041, -183682, -104788, -179208, -185094, -121479, -75275, -39362, 20974, 109537, 156129, 180804, 171347, 207832, 240888, 165618, 52782, 12758, 15474, 52312, 84708, 71924, 93340, -32560, -100463, -14066, 19376, -12633, -72770, -146940, -147305, -141116, -146007, -54536, 30412, -1722, -65053, -67320, 31129, 4505, 7594, 32218, 265, 18556, 140082, 230987, 172831, 30523, 117796, 208983, 154833, 162678, 176120, 115231, 63356, 31610, -102998, -279902, -354255, -199333, -109546, 10575, 51781, 112042, 136026, 166135, -1625, -74168, 20113, -42339, -52804, -44039, -112028, -54022, 30898, 98163, -9868, -153471, -70203, 78333, 155862, 77741, -64130, -63071, -2053, 79250, -42813, -7075, 19156, 30829, -22205, -101616]
7161a01616j1982L5600J03523r4441J0144M8903J8897o4426j06175K9366m4186
7150a76393K3788P3248J06225J1854k4161N6794J0864l9824j20928J35433J5443
7139G2343m1955n9788Q3319J9364m2654k0298R3353O9089n1394J16948n6878j46339
7127C5110L4773L6780j8437j17127p0638J46659N9625j06336r5473k5092J11934
7116h222O3376N6509p3220o2463p1955k596n3655p1570L4587l9749N8814J18386
7104e1758K0791n0231l766m9111l1527R7295Q5506j654n259O2316M2938P0400
7092A85940J06157o548j08848J7899q3919m5829Q1417j16348k00138J7245J61607
7081H635j3031k2611R6218l7273J2220r5990M0431q333j04567K3495J01900J2593
$$ y = [-101616, -113598, -77998, 25525, -68916, -58772, -9869, 9028, -55398, -161573, -132207, -176393, -152605, -79357, 26868, 38722, 14561, 71355, 82219, 42395, -78533, 56900, 72343, 30388, -29400, 53919, 73283, 30629, 10331, 103684, 172773, 121379, 238327, 181449, 35110, 69883, 106663, 88226, -28901, -99539, 47120, 106745, 409, -95064, -120156, -8222, 55154, 111663, 38443, -24020, -95975, -98571, -152226, -223796, -189209, -228958, -170144, -51758, -30967, -81198, -84964, -134075, -165602, -68307, 17199, 15545, 10286, 72602, 115540, 185940, 292097, 285549, 176701, 194600, 110681, 64852, 146269, 29921, -170217, -152972, 8635, -4396, -27007, 69211, 31938, 44158, -51832, -11401, -19734, -124301, -100806, 1094, 13687]
7069A3687q6407m677n4595J83716Q0170j23977p492O5655O042j29007J6484Q8177
7057D7776n3130j15774j2995N7032R3774k9026l2013M9632K0954j07455J0135
7046g1090N2220j40237K6649k5986j0111N3664J01106j41680p8665J29671M0624
7035f3835j12551O837J03021M6717n4679J01877k5335l0089n6126n6851l214L7359
7023a06869M5417k9760N5056o0900n5930O8119j0880l1420j0668R6538L0042J15791
7011A04536K4267J17849n8518m9265Q1706r5860o8888j15083p1949M0585L0998
7000e9622j0259n771L9299k0360j18741R8025Q0388N0161L2689j33551J04151
6989E6409J3212k0201J397M09o953l4429J6531K4213j31430r5550L9181J08353
$$ y = [13687, -72720, -77397, -131992, 51724, 131894, 7917, 425, 66080, 72122, -56885, -40401, 47776, -5354, -121128, -134123, -77091, 16683, -12343, -44356, 5276, 26230, -81225, -71090, -18870, -159107, -132458, -158444, -168555, -114891, -13785, -155465, -234130, -104459, -63835, -176386, -169549, -66528, -19811, -74490, 27387, 2052, -28037, -84163, -141014, -144228, -106869, -61452, -91212, -36156, -97056, -152986, -84867, -95747, -127167, -137835, -41297, -11255, 104536, 128803, 246652, 188134, 138869, 220575, 124715, 55827, -59256, -131205, -90620, -59622, -69881, -75652, -36353, -56713, -175454, -77429, 2959, 53120, 85809, -47742, 56409, 69621, 49420, 50817, 51226, 44273, 9844, 26375, 50588, -80842, -176392, -137211, -28858]
6977b8858M7810m0265l7591k8841r138P7971L831M0460q925m8619l9469L6918
6965c4716m2672j53981J2665J7842L3131k4400J31657L7813L2117k4386l8953
6954e3883P5454R9200K4318l3151P982n5533K1877K7234j60196P8840N2524j39342
6942e4676k93J09295J5842N1287K5923j56005q7634R1765J39126r1443j32515
6931h9328N8431O6506L8617O5697M9365o2463j73346J5024J51025j9072J8961
6920A19417N4267q1934k28521j36558J09971L7952r860O244K6515M4088q2731
6909a41150L0080j7343L3896q5980k1263M5440R4089O3602J61857l4953m784Q2257
6897B05748P3083j12192j21615o6380p4278k0103M0820J3901J6043R2225P4007
$$ y = [-28858, 18952, -21313, -58904, -87745, -96883, -18912, -15081, 25379, 16454, -32165, -71634, -34716, -77388, -231369, -218704, -200862, -167731, -192131, -60474, -22661, 9456, -14930, -53883, 21571, 120771, 145089, 111938, 119920, 64387, 86264, 113498, -46698, 32142, 84666, -54676, -54969, 54326, 70168, 121455, 147378, -8627, -96261, -4496, 134630, 43187, -89328, -30897, 35609, 74226, 139923, 189288, 126825, -46521, -31497, 119528, 100456, 119417, 173684, 91750, -136771, -273329, -163358, -125406, -135266, -129022, -102507, -58419, -141150, -111070, -128413, -94517, -180497, -201760, -156320, -62231, 1371, 163228, 128275, 123491, 205748, 278831, 166639, 45024, -21356, -95634, -115737, -74917, -61016, -44973, 47252, 121259]
6886A21259k1010l2644o6198q0466m5105N6369Q3359J4113j21702j42360p3775
6875c08160K37840J15928n3934m6891k6004k4527J05404L0706q5394j3722J16947
6864D8193J26411Q0789j40731j55684o9427j6623r553j06330N3547J08188M4241
6853c6979J5433J8316M025n1673n2184R2064Q4933M6867l4018o7006j5349k4576
6841b0147J0789q9222m3297M4994J19323o4491m4669O243K8439o5325L8184M0053
6829c9126N0446j3153q3141P9191p982K5815k1229Q9114p4069j27419J7402M5880
6817e8271O0719J08068Q532j19480J7772K9452M1287L919l7414m65P138k9597
6805C1660p4843K2870J39215L7981N7304j8219J8617M364j288j76097p1008P1125
$$ y = [121259, 100249, 67605, 1407, -79059, -124164, -67795, 15564, 29677, -92025, -234385, -308160, -70320, 45608, -8326, -55217, -81221, -105748, -344, 30362, -55032, -68754, 48193, 174604, 255393, 114662, -41022, -110449, -127072, -136625, -242955, -189408, -81220, -36979, -21546, -3230, 795, -50878, -103062, -10998, 73935, 120802, 86784, 19778, 4429, -20147, -9358, -98580, -141877, -96883, 22440, -42051, -86720, -80477, -52038, -117363, -79179, -39126, 11320, -1833, -84974, -5783, -13765, 12050, -9179, 79935, 5866, -121553, -104151, -58271, 2448, 110516, 119048, -432, 17340, 46792, 88079, 91998, 54584, 54119, 61257, 31660, -43183, -20313, 118902, 156883, 214187, 195968, 214585, 218949, 217661, 41564, -29444, 41681]
6793D1681J9700o733K023M4743k9563p1061r022J8111j12654k935O4986P9450
6781C8726m9725Q8000q6522N485Q8020Q2967j08840j18430J1088R8211r3994K6329
6769a8685J7011j03690j4041J10460P0397o5236L6837n8272m0570k2009O283K1472
6757f0043J2814m4370j01606m453J18157K34206l3858o1066O7114l1497O8687
6746A64085l8894J6608l6611m7170J5101j12182r9612Q4536n6833p7268J03432
6735h4808J12954J07549k9649j79708j67674R225P8664L424j692L5774m1790l8991
6723a96722K190M0154J7741Q5258n235K523N5862k0212j6096M1109j03554Q009
6711h8973J47065N851r6137j7700M5578K2735q8158j10126j2640O3009k9612J3388
$$ y = [41681, 61381, 54648, 56671, 101414, 71851, 790, -8232, 9879, -102775, -105710, -40724, 38726, -10999, 77001, -9521, -4036, 83984, 166951, 58111, -60319, -49231, 48980, -45014, -18685, -1674, -105364, -119405, -8945, 61452, -3784, 33053, -25219, -65789, -87798, -81515, -60043, -47229, -91599, -193205, -197658, -79501, 154705, 120847, 59781, 126895, 95398, 164085, 125191, 141799, 105188, 58018, 73119, -39063, -138675, -54139, -110972, -188240, -84808, 28146, 135695, 106046, -73662, -241336, -232111, -153447, -150023, -151715, -115941, -157731, -196722, -194532, -154378, -136637, -51379, -56614, -54091, 1771, -18441, -34537, 6572, -96982, -88973, 58092, 63943, -32194, -49894, -4316, 18419, -69739, -179865, -192505, -129496, -159108, -145720]
6699a45720M842j24738r4534j5685J31959O1997K5802M4335J00735M4211l1010
6688B194P986M7423K3229m5320N505n0360J682P3250L3201j3700n9956N6840K2645
6675A04619l0854K2021J52j2864j29280O415J62848O3888q1256Q4709j03932j29411
6663d2945j24064j02339N6422Q933m819P9253J57496R3438N9223K2097j54534
6652D8161j33329j15304Q811Q0525o444Q9122l5808o4670m9949O8681J94582Q3718
6640A68096j68677Q121J12437O7058j14068p2868N2300M3914o3809N73l3632p9354
6628g9909O7228j2968m4071k4311M4204K8689k167J0262l1193m5758K6976p9467
6616a42485l0850J72128J36775Q7794N8484j6639o8983p3041p6824p9096j34731
$$ y = [-145720, -140878, -265616, -360150, -375835, -243876, -181879, -156077, -111742, -11007, 33204, 2194, 10180, 57603, 80832, 35512, 41017, -9343, -7661, 65589, 98790, 85090, 25134, 81974, 104619, 73765, 95786, 95938, 83074, -46206, -39791, 123057, 186945, 105689, 190398, 86466, -42945, -167009, -269348, -212926, -203993, -208812, -129559, 27937, 121375, 180598, 202695, 48161, -85168, -200472, -191661, -111136, -117580, -28458, -64266, -128936, -178885, -110204, 84378, 168096, -581, 7540, 119977, 187035, 72967, 99, 52399, 96313, 32504, 33077, -555, -79909, -12681, -25649, -69720, -94031, -49827, -21138, -23305, -13043, -44236, -89994, -63018, -142485, -173335, -1207, 135568, 223362, 281846, 265207, 196224, 123183, 46359, -32737, -167468]
6605a67468P7394K5365j42594r4022J15045R8194M9044K0311J64046J3353L7374
6594A96042J4600o0141K8072p94j11143O6327l0897r0546r5643L9692j6562P7385
6582A6392Q2708p9898m9707K6369L1269N4513j9664j0489N2002o9387q0806N9293
6570A2595n112k5399k7288p599j8424J1138Q057q5138j0305J03888O2518Q181
6558B7112q3825p9214L0456K9267n4849l2980J14702K14025M5678N647M9444j63524
6546A01939j32954o7595J30100J72438N2388j26875j51451N3768P3804r647M1087
$$ y = [-167468, -90074, -64709, -207303, -301325, -186280, -88086, -39042, -18731, 145315, 158668, 196042, 210642, 150501, 178573, 177779, 66636, 132963, 102066, 11520, -84123, -44431, -60993, 16392, 99100, 19202, -30505, -4136, 27133, 81646, 61982, 51493, 103495, 34108, -46698, 12595, 7483, -17916, -45204, -52803, -71227, -60089, -52032, -137170, -147475, -43587, 18931, 27112, -56713, -135927, -105471, -76204, -131053, -164033, -49331, 164694, 210372, 216019, 265463, 101939, -31015, -98610, 31490, 203928, 256316, 129441, -22010, 31758, 105562, 95915, 137002]
$$ [...]
##END NTUPLES=NMR SPECTRUM
##END=
