##TITLE=Analysis number 319408
Compound Code cc 01103
Project Code adrs
Chemist Name af chempharm
##JCAMPDX= 6.0         $$ Bruker NMR JCAMP-DX V2.0
##DATA TYPE= NMR SPECTRUM
##DATA CLASS= NTUPLES
##ORIGIN= Bruker BioSpin GmbH
##OWNER= nmr
$$ XWIN-NMR		Version 3.5
$$ Fri May 12 12:49:56 2006 GMT Daylight Time (UT+1h)  MAYBRIDGE\nmr@NMR_250MHZ
##.OBSERVE FREQUENCY= 250.131544655141
##.OBSERVE NUCLEUS= ^1H
##.ACQUISITION MODE= SIMULTANEOUS (DQD)
##.ACQUISITION SCHEME= undefined
##.AVERAGES= 16
##.DIGITISER RES= 18
##SPECTROMETER/DATA SYSTEM= dpx250
##.PULSE SEQUENCE= zg30
##.SOLVENT NAME= CDCl3
##.SHIFT REFERENCE= (INTERNAL, CDCl3, 0, 16.522)
##AUDIT TRAIL= $$ (NUMBER, WHEN, WHO, WHERE, WHAT)
$$ ##TITLE= Audit trail, XWIN-NMR		Version 3.5
$$ ##JCAMPDX= 5.01
$$ ##ORIGIN= Bruker BioSpin GmbH
$$ ##OWNER= nmr
$$ C:\u/data/dgb/nmr/ADRS/4230/pdata/1/auditp.txt
$$ ##AUDIT TRAIL=  $$ (NUMBER, WHEN, WHO, WHERE, WHAT)
(   1,<2006-05-12 12:49:21.05 +100>,<MAYBRIDGE\nmr>,<NMR_250MHZ>,
      <created by zg, POWCHK disabled, PULCHK disabled
       configuration hash MD5:
       84 BC 41 DB A1 6E 1D 46 DA 25 12 A5 C1 ED C5 3A
       data hash MD5: 64K
       4F B8 EA 0F D6 BA 10 49 96 A7 2D 5F FA 2E 5A 70>)
(   2,<2006-05-12 12:49:39.14 +100>,<MAYBRIDGE\nmr>,<NMR_250MHZ>,
      <Start of raw data processing
       ef LB = 0.3 FT_mod = 6 PKNL = 1 SI = 32K 
       data hash MD5: 32K
       AF 50 43 6B FE 4E 9C AD 7B 57 2E A9 C6 DA 48 1E>)
(   3,<2006-05-12 12:49:44.05 +100>,<MAYBRIDGE\nmr>,<NMR_250MHZ>,
      <apk 
       data hash MD5: 32K
       5E 12 CB 13 4E D2 0F A2 D6 0D 68 FE 49 4A BF 75>)
(   4,<2006-05-12 12:49:44.96 +100>,<MAYBRIDGE\nmr>,<NMR_250MHZ>,
      <abs ABSG = 5 
       data hash MD5: 32K
       36 C5 17 06 6A D9 61 00 A7 E6 67 4F E0 E6 39 17>)
$$ ##END=
$$ 
$$ hash MD5
$$ F5 50 9B 5E DC 6B 6F C1 FC D6 6A 24 78 DF 10 54
##$RELAX= 
##$RELAX= 
##$RELAX= 
##$RELAX= 
##$RELAX= 
##$RELAX= 
##$RELAX= 
$$ Bruker specific parameters
$$ --------------------------
##$DU= <C:\u>
##$EXPNO= 4230
##$NAME= <ADRS>
##$PROCNO= 1
##$TYPE= <nmr>
##$USER= <dgb>
##$AMP= (0..31)
100 100 100 100 100 100 100 100 100 100 100 100 100 100 100 100 100 100 
100 100 100 100 100 100 100 100 100 100 100 100 100 100 
##$AQSEQ= 0
##$AQ_mod= 3
##$AUNM= <au_zg>
##$AUTOPOS= <33 >
##$BF1= 250.13
##$BF2= 250.13
##$BF3= 250.13
##$BF4= 250.13
##$BF5= 500.13
##$BF6= 500.13
##$BF7= 500.13
##$BF8= 500.13
##$BYTORDA= 1
##$CFDGTYP= 0
##$CFRGTYP= 5
##$CHEMSTR= <none>
##$CNST= (0..31)
1 1 145 1 1 1 1 1 1 1 1 1 1 1 1 1 1 1 1 1 1 1 1 1 1 1 1 1 1 1 1 1 
##$CPDPRG= <>
##$CPDPRG1= <>
##$CPDPRG2= <>
##$CPDPRG3= <>
##$CPDPRG4= <mlev>
##$CPDPRG5= <mlev>
##$CPDPRG6= <mlev>
##$CPDPRG7= <mlev>
##$CPDPRG8= <mlev>
##$CPDPRGB= <>
##$CPDPRGT= <>
##$D= (0..31)
0 1 0 0 0 0 0 0 0 0.06 0 0 0 0 0 0 0.0002 0 0 0 0 0 0 0 0 0 0 0 0 0 0 
0 
##$DATE= 1147434559
##$DBL= (0..7)
120 120 120 120 120 120 120 120 
##$DBP= (0..7)
150 150 150 150 150 150 150 150 
##$DBP07= 0
##$DBPNAM0= <>
##$DBPNAM1= <>
##$DBPNAM2= <>
$$ [...]
##$SUBNAM7= <"">
##$SUBNAM8= <"">
##$SUBNAM9= <"">
##$SW= 20.6930455092707
##$SWIBOX= (0..15)
0 0 3 0 0 0 0 0 0 0 0 0 0 0 0 0 
##$SW_h= 5175.983436853
##$TD= 65536
##$TD0= 1
##$TE= 295.16
##$TE2= 300
##$TE3= 300
##$TEG= 300
##$TL= (0..7)
0 120 120 120 120 120 120 120 
##$TP= (0..7)
150 150 150 150 150 150 150 150 
##$TP07= 0
##$TPNAME0= <>
##$TPNAME1= <>
##$TPNAME2= <>
##$TPNAME3= <>
##$TPNAME4= <>
##$TPNAME5= <>
##$TPNAME6= <>
##$TPNAME7= <>
##$TPOAL= (0..7)
0.5 0.5 0.5 0.5 0.5 0.5 0.5 0.5 
##$TPOFFS= (0..7)
0 0 0 0 0 0 0 0 
##$TUNHIN= 0
##$TUNHOUT= 0
##$TUNXOUT= 0
##$USERA1= <user>
##$USERA2= <user>
##$USERA3= <user>
##$USERA4= <user>
##$USERA5= <user>
##$V9= 5
##$VALIST= <valist>
##$VCLIST= <CCCCCCCCCCCCCCC>
##$VD= 0
##$VDLIST= <DDDDDDDDDDDDDDD>
##$VPLIST= <PPPPPPPPPPPPPPP>
##$VTLIST= <TTTTTTTTTTTTTTT>
##$WBST= 1024
##$WBSW= 4
##$XGAIN= (0..3)
0 0 0 0 
##$XL= 0
##$YL= 0
##$YMAX_a= 578905
##$YMIN_a= -644683
##$ZGOPTNS= <>
##$ZL1= 120
##$ZL2= 120
##$ZL3= 120
##$ZL4= 120
##$ABSF1= 16.522
##$ABSF2= -4.171173
##$ABSG= 5
##$ABSL= 3
##$ALPHA= 0
##$AQORDER= 0
##$ASSFAC= 0
##$ASSFACI= 0
##$ASSFACX= 0
##$ASSWID= 0
##$AUNMP= <proc_1d>
##$AZFE= 0.1
##$AZFW= 0.1
##$BCFW= 0
##$BC_mod= 0
##$BYTORDP= 0
##$COROFFS= 0
##$CY= 12.5
##$DATMOD= 1
##$DC= 0
##$DFILT= <>
##$DTYPP= 0
##$F1P= 14.0000005364418
##$F2P= -0.99999901652339
##$FCOR= 0.5
##$FTSIZE= 32768
##$FT_mod= 6
##$GAMMA= 0
##$GB= 0
##$INTBC= 1
##$INTSCL= 1
##$ISEN= 128
##$LB= 0.3
##$LEV0= 0
##$LPBIN= 0
##$MAXI= 10000
##$MC2= 0
##$MEAN= 0
##$ME_mod= 0
##$MI= 0
##$NCOEF= 0
##$NC_proc= -3
##$NLEV= 6
##$NOISF1= 0
##$NOISF2= 0
##$NSP= 0
##$NTH_PI= 0
##$NZP= 0
##$OFFSET= 16.522
##$PC= 1
##$PHC0= 162.6519
##$PHC1= 8.701553
##$PH_mod= 1
##$PKNL= yes
##$PPARMOD= 0
##$PSCAL= 4
##$PSIGN= 0
##$REVERSE= no
##$SF= 250.13
##$SI= 32768
##$SIGF1= 0
##$SIGF2= 0
##$SINO= 400
##$SIOLD= 32768
##$SREGLST= <1H.CDCl3>
##$SSB= 0
##$STSI= 32768
##$STSR= 0
##$SW_p= 5175.98343685301
##$SYMM= 0
##$S_DEV= 0
##$TDeff= 65536
##$TDoff= 0
##$TI= <Analysis number 999999
Compound Code 99
Book Reference 9
Project Code 9>
##$TILT= no
##$TM1= 0
##$TM2= 0
##$TOPLEV= 0
##$USERP1= <user>
##$USERP2= <user>
##$USERP3= <user>
##$USERP4= <user>
##$USERP5= <user>
##$WDW= 1
##$XDIM= 32768
##$YMAX_p= 513037326
##$YMIN_p= -57169
$$ End of Bruker specific parameters
$$ ---------------------------------
##NTUPLES= NMR SPECTRUM
##VAR_NAME=  FREQUENCY,     SPECTRUM/REAL,   SPECTRUM/IMAG
##SYMBOL=    X,             R,               I
##VAR_TYPE=  INDEPENDENT,   DEPENDENT,       DEPENDENT
##VAR_FORM=  AFFN,          ASDF,            ASDF
##VAR_DIM=   32768,         32768,           32768
##UNITS=     HZ,            ARBITRARY UNITS, ARBITRARY UNITS
##FACTOR=    0.157963299565203, 1,           1
##FIRST=     4132.6476996994, 0,             0
##LAST=      -1043.33573715361, 0,           0
##MIN=       -1043.33573715361, -57169,      0
##MAX=       4132.6476996994, 513037326,     0
$$ Real data points
##PAGE= N=1
##DATA TABLE= (X++(R..R)), XYDATA
$$ [...]
21587 5289 4684 3805 9173 -5134 -4807 6560 15339 1156 -12509 -9484 -16173 -18604 -10455 1899
21573 1899 5651 3855 480 85 -12988 -15503 -14132 -18417 -22091 -10368 -12895 -27251 -21788 -7905
21559 -7905 4005 14853 6298 -3057 5636 -7919 -5445 213 -8660 -2957 13218 26214 28852
21546 28852 7890 8288 17831 13198 3267 5313 -1259 -1654 3864 14037 22274 5247 -3491 9206
21532 9206 17444 22438 18790 14954 2147 -13925 -18828 -23120 -26391 -24109 -5407 3612 1203 -6638
21518 -6638 944 -5678 -7897 -15089 -23372 -29554 -32007 -23504 -14873 -15721 -13541 -19913 -9784 -525 9167
21503 9167 3420 -9573 -7972 -5447 -5138 -7536 -10439 -10838 3350 8120 10105 8832 -2328 -9831
21489 -9831 -5774 -6618 -6285 5651 20997 14384 11529 13792 7438 -5369 -3063 4034 7416 13124
21475 13124 14462 22502 10232 12168 6903 1963 -3198 -4861 -1687 -4837 1856 7575 -9455 -13560
21461 -13560 -6206 -8030 -12556 -8354 -7949 -8208 -9309 -15445 -14615 -8559 -12744 -20056 -13255 -3542 6859
21446 6859 12695 4452 -12904 -14151 -16851 -9884 -4653 -2010 5985 1649 -3160 -6405 -6351 -3006 3546
21431 3546 6001 688 -11126 -13934 -2600 -1775 -2758 -5206 -3513 -487 673 -21987 -21659 -23296 -5700
21416 -5700 -6966 -15160 -18000 -7433 -3043 4656 -1101 4727 -3891 -16577 -21986 -6419 955 2276
21402 2276 23409 38704 29069 1614 -7986 -4702 3829 13182 13921 1031 -7614 -27922 -34458 -32255
21388 -32255 -25231 -12220 -16195 -15305 -13341 -13288 -12459 -7237 -4330 2206 10971 12172 7230 240 -16356
21373 -16356 -18523 -22968 -26244 -16958 -3131 -554 -9288 -9594 -15355 -6535 -2963 -7253 -6621 -4005 1949
21358 1949 3431 14447 14646 18435 17944 4865 -993 13786 27185 19404 -4286 -10305 -9721 -4133
21344 -4133 -5468 -11958 -21404 -21085 -23859 -14662 -14040 -3520 -5153 -13687 -12503 -6146 -12371 -14922 -10407
21329 -10407 -24525 -24682 -31438 -24625 -7130 -8158 -4312 -15467 -15702 -7163 -1762 4598 15056 16019
21315 16019 14176 7707 -14805 -20540 -1878 12190 1238 -6005 -16586 -22258 -5297 15532 3399
21302 3399 -24044 -40300 -28465 -9718 -9048 -18488 -25575 -4595 13414 10979 410 3155 -680
21289 -680 14468 22140 19901 18991 20045 21407 17220 7532 -14067 -18470 -3193 -140 6416 -3636
21275 -3636 -8553 -5865 -12634 -15734 -8548 -18767 -19203 -14073 -8174 -11346 -16802 -15969 -12420 -8384 -1833
21260 -1833 5074 6070 15195 20646 6639 7478 7225 -505 -23644 -20791 -18798 -16651 -17900 -18245 -5994
21245 -5994 2273 -8683 -11591 -9151 -8131 -6411 -5759 -11327 -5324 2924 -1087 -8606 -15616 -18451 -3036
21230 -3036 -9830 -32977 -28700 -5234 -2898 -364 17 -5879 -477 6309 7499 3133 10760 7691
21216 7691 4161 -1891 -2768 -1645 4937 12735 12718 4866 8588 6152 -5236 -7620 -9060 -708 6697
21201 6697 5769 8182 2362 -978 842 7955 10049 15988 25807 20546 9866 -10578 -21285 -20489
21187 -20489 -24133 -18505 -21920 -33809 -23680 -23335 -27719 -22497 -23335 -23792 -16615 -14840 -24234 -24960 -18090
21172 -18090 -8056 -5378 -352 5108 -4100 -25337 -23536 -16184 -13251 -25939 -31926 -37013 -39431 -34178
21158 -34178 -25298 -15122 -7113 -80 7375 3386 -78 -2639 -10330 -12656 -12863 -9487 -21013 -30701
21144 -30701 -32224 -17147 4021 4508 -2855 -14351 -22119 -27036 -17783 -11474 -9805 -3872 -11586 -6027
21130 -6027 -5231 -9923 -11745 -10566 -14198 -15141 -16483 -20731 -9781 -5783 -18569 -10080 -10444 -2377 1210
21115 1210 -8113 2204 -5670 -22103 -24488 -10067 5394 -5827 -5844 -4565 -3920 -1917 -3737 6006
21101 6006 -2491 -8910 -2719 3410 2881 8277 5309 -1678 -8512 -16194 -15032 -14774 -17247 -24923 -13092
21086 -13092 -4559 -8966 -20806 -15086 -20193 -36807 -37390 -8100 -219 -5844 -5304 -10143 -6537 -4996
21072 -4996 -7586 -8921 -4918 1861 3861 954 10243 12466 5360 -3981 -19139 -17991 5185 7437
21058 7437 -481 -6677 1587 6257 -3909 -10951 -14645 -16827 -10048 -24891 -28788 -17014 -1072 10129
21044 10129 4168 910 -3578 -4080 1146 -804 -4088 9325 16282 24717 18864 -1305 -914 8678
21030 8678 912 -14710 -9425 -1870 2531 22143 38150 33186 19347 12739 14219 5075 341 -13530
21016 -13530 -20324 -19919 -10198 -8340 -8894 152 3685 -1310 -34131 -33861 -28429 -26615 -12015 -9773 -7201
21001 -7201 -1622 748 -2603 364 -8963 -19861 -18487 -4475 -1597 9087 8590 6074 19246 7151
20987 7151 -9868 -16098 -21286 -24135 -20155 -761 291 -1961 -5498 -780 15113 16549 5469 -9476
20973 -9476 9134 8445 -3340 2585 3856 -8884 -20812 -22931 -23548 -24078 -19478 -10346 1894 -3292
20959 -3292 -11131 -4656 -15847 -13575 3787 2086 -17080 -26413 -26564 -12198 -12891 -15468 -11266 5919
20945 5919 24828 13496 9091 5816 -5899 -16201 -11931 -921 4876 23770 22734 15651 -2515
20932 -2515 -3401 4078 4842 7462 15521 685 -3783 -9657 -19990 -39470 -38767 -35926 -24733 -14411
20918 -14411 -16019 -38028 -31987 -14318 -18740 -15620 -8618 -10393 -18830 -13360 -8248 1523 11058 31006
20904 31006 13864 -14 -18257 -15652 -9455 6058 1710 3603 7374 8057 -7430 -7110 -11257 -21439
20890 -21439 -16463 -5040 10442 2267 3096 11018 6497 9819 15773 17157 19952 21464 17980 14532
20876 14532 11232 -1791 -8113 -4938 -321 -6179 -13222 -12463 -23170 -47758 -48137 -43008 -38136 -34378
20862 -34378 -34278 -24433 -16943 -19014 -19980 -12931 -14029 -5696 -11641 -15449 -10823 13206 10925 1062 6052
20847 6052 3418 -6858 -17384 -25994 -23429 -12276 7030 8186 11816 -4432 -12095 2072 2197
20834 2197 -10444 -12408 -11529 -5774 -7244 -2115 247 -904 6232 8955 20051 12208 11910 17799 9361
20819 9361 6589 5381 -1077 -1642 -13931 -14576 407 -1949 3162 -2394 -10030 -14434 -16198 -11065 -10000
20804 -10000 -14522 -15773 -15833 -406 -3412 -13096 -17176 -24290 -25268 -31280 -27716 -21193 -1565 3905 221
20789 221 -10203 3581 18251 10045 -4502 -5690 -5812 3800 15403 16552 17531 27133 33640 12268
20775 12268 522 10771 6671 -1783 -7849 -6973 -14258 -7071 6041 8632 -334 615 6834 1767
20761 1767 -10020 -1169 -3815 -9113 -7537 -6317 1731 -21698 -27789 -8140 3186 -2482 -5982 -1643
20747 -1643 -7988 -10383 -9724 -19131 -24589 -17903 -18156 -20840 -15980 -9731 -1871 9250 7047 -1231 -1309
20732 -1309 2251 5613 12160 7528 1514 11010 14238 9505 10627 748 2507 -2471 -6464 -6307 -6561
20717 -6561 -13895 3757 1984 -9847 5635 14461 13384 -6046 -17910 4005 19977 17369 5456
20704 5456 880 -3681 -6809 -1976 -12219 -10872 1501 2711 -15096 -21676 -21601 -9738 -11096 -29411
20690 -29411 -39645 -28313 -7745 -927 -13285 -9278 -3425 -9085 -15370 -10265 -13336 -12281 -11916 -23744
20676 -23744 -16915 -2012 -5261 -10236 -8667 -12590 -21740 -25566 -22221 -12189 -24552 -34648 -27129
20663 -27129 -15519 -13743 -13360 4644 8556 5697 4401 4842 -4150 -11595 -23167 -26144 -6000 7915
20649 7915 6137 2473 3321 4279 2878 7769 234 -19837 -24415 -19312 -26169 -18707 -19861 -14897 -3500
20634 -3500 -9961 -11068 -25066 -17160 -208 389 -3757 -12364 -14719 -17421 -13924 -16738 -18582 -21259
20620 -21259 -13215 -15222 -15237 -24502 -17082 -19958 -19758 -12017 3378 -14259 -21646 -8226 3210 -2676
20606 -2676 -28119 -23568 -14196 -107 1377 468 2428 -4803 -12371 -19430 -4211 5866 -11474 -18119
20592 -18119 -5222 -675 3698 6543 5589 -1178 -8979 -12318 -22911 -30821 -21373 -6261 10824 8295
20578 8295 10762 17494 18305 17003 5788 -11695 -18654 -11489 -8084 -14770 -20026 -25320 -25602 -22018 -20174
20563 -20174 -13916 -16960 -26520 -31048 -18599 -16813 -10247 302 4349 1237 13680 17493 20665 31045
20549 31045 28329 16580 16514 3329 6226 8775 -1400 -1430 3859 8127 12526 7164 -2859 -328
20535 -328 13095 20672 10942 17863 27747 15723 1531 5168 2690 2822 13222 15760 21136 18455
20521 18455 21304 27979 13888 8139 10662 2097 2418 2375 9232 9123 -8392 -10067 6559 23633
20507 23633 29447 26124 21875 23602 34519 36649 17790 19600 35066 38648 26034 15396 15843
20494 15843 17899 9167 9787 17294 25922 35372 23557 23071 24278 30963 25348 7108 11382 26403
20480 26403 23018 9984 13982 17584 17017 35039 51345 42191 17999 25985 43351 47157 48109 38252
20466 38252 38478 36621 34928 39446 35154 16513 7403 24929 22844 14386 16588 14987 29636 28046
20452 28046 12910 13204 7472 5010 10499 28639 23488 11372 3645 -6846 -2718 -5302 -4203 1715
20438 1715 1646 14604 18920 8850 3743 2655 600 -702 -2240 -606 -8775 -6483 -11542 2056
20424 2056 8650 7719 8542 -1337 -13221 -10768 -15190 -14986 -18075 -26674 -22993 -21673 -4738 7460 1453
20409 1453 -8965 -16766 -16645 -11103 729 -3446 -23150 -13850 -1673 203 17881 14320 -7262
20396 -7262 -10904 1229 8358 14687 6609 10427 10692 866 -7308 -11517 -28376 -28410 -28228 -22993 -23502
20381 -23502 -24001 -16442 -6323 5459 5699 4883 -13723 -27052 -30972 -22435 -8186 2685 16120
20368 16120 20588 8927 -9666 -12505 -15227 -10816 1439 5980 3637 -9181 -12418 -4272 7864
20355 7864 12970 4337 1746 9757 8039 862 -9575 -13910 -14371 -13901 -1920 -648 -2954 -6958 -18441
20340 -18441 -17203 2013 6269 -1075 -21920 -22624 -10216 -142 10531 8688 10620 9795 -1528
20327 -1528 -4669 -12268 -8953 1428 10863 -1909 -4460 -10404 -14220 -14095 -15801 -16420 -7855 -7092 -10927
20312 -10927 -8322 -2064 13220 -1307 -5304 7722 6518 -2549 -11252 -6689 8709 21978 18250
20299 18250 15227 -1199 -15050 -17214 -2019 -3884 -7478 -15587 -18065 -22811 -24711 -29822 -26352 -20879
20285 -20879 -15901 6800 19343 4504 -8123 -1326 7671 -417 -12794 -22857 -20836 -16612 -15120
20272 -15120 -11719 -58 6042 6733 -7316 8615 8751 -1039 -3960 6818 5559 7276 7500 6623
20258 6623 8652 -6997 -33130 -37588 -33741 -24343 -17693 -20760 -13310 -17729 -6068 1018 -8101 -2843
20244 -2843 -4102 -5490 -10141 -12040 -16020 -17219 -21218 -13878 -15558 -16453 -11832 -9339 -964 -5595 -6217
20229 -6217 -2465 -13057 -21343 -14740 -9677 -8935 -19831 -19565 -6671 -5583 -6249 -3522 3774 -4928 -274
20214 -274 -5379 -582 14615 12059 1291 1785 2164 -1859 944 -4148 -5210 5965 6762 3579 -10409
20199 -10409 -7699 -244 -2083 7303 3979 474 -2116 -2252 3070 -6956 374 -3914 -15897 -18626
20185 -18626 -28162 -30987 -18109 -8993 -2488 7055 11881 -1782 -6598 -9686 -5958 3297 1214 4308
20171 4308 -6025 -13980 -7465 6368 14867 18903 3179 759 5962 3125 -2822 -10430 -13144 -10864
20157 -10864 -14996 -28906 -15176 6165 18819 3811 -4159 -4659 -6438 -8501 -6343 -6901 82 10700
20143 10700 3395 -9711 -7009 -2609 3286 -5321 -13175 -7249 -12123 579 8850 10675 -521 -4858
20129 -4858 -1380 7335 18352 19899 13583 1387 3093 -2086 2254 2253 4368 -2892 -8312 -8373 -767
20114 -767 1049 -8223 6009 19444 22432 2889 -8791 -353 1828 -6459 -7390 -16801 -5489 4798
20100 4798 5823 4260 8848 -7348 -7699 -1067 -12276 -9743 -21698 -26686 -6449 1949 3363 23342
20086 23342 27049 14251 -10071 -18267 -9376 -11723 -23469 -16401 -9687 -1440 -4188 -7846 -5049 5715
20072 5715 10945 5650 -13429 -12576 -6809 -8123 -13836 -8969 -6275 -1561 -10973 3627 22658 18191
20058 18191 -5469 -17005 -25538 -15554 -18193 -8669 4562 2375 -7926 -9328 -5667 314 -643 2690
20044 2690 3885 -6573 5667 -612 -10139 7506 26586 31321 10140 -6269 -14083 -11726 -7584
20031 -7584 -4869 -3189 10863 7666 2404 -48 1841 1425 -1156 452 -1346 -3174 538 18598
20017 18598 18203 17733 15351 11199 5792 3810 -7764 -19512 -27412 -20178 -15319 -20033 -27402 -25275
20003 -25275 -29413 -23407 -12694 12159 23907 22056 29529 29720 15866 2445 4551 19270 18719
19990 18719 17269 18630 21070 18563 8717 14941 14965 15685 13981 3079 7376 903 8284 17753 -1221
19975 -1221 -4154 7997 22355 25461 11605 10743 14174 13956 6547 9483 21317 21499 14495 10428
19961 10428 7011 -939 -2280 259 1479 -2914 17777 21131 7787 13444 4116 2183 12705 -5064
19947 -5064 -12625 5098 24834 35344 25117 10524 10678 16595 20936 19363 -114 -5385 3472
19934 3472 1632 -4372 -7316 -1943 -6087 -13916 922 1845 -563 -5040 -6304 -7893 8196 13522
19920 13522 14458 16480 14816 12679 8485 -3793 -4891 -4540 -11896 -12853 -17626 -28324 -25337 -5130
19906 -5130 2307 1242 4392 5504 3549 2338 7358 1307 495 -1816 -5837 -16300 -25023 -10237
19892 -10237 8837 15587 1908 -4665 -2250 -8678 -3371 -825 4561 -3971 -9992 -16490 4146 10289
19878 10289 8345 15436 12961 9274 3761 1709 2597 8156 20689 21524 18875 24998 20942 18398 7538
19863 7538 -3159 -9550 -5457 3418 6132 10756 16242 25547 19837 18792 -2378 -12059 -1664 1560
19849 1560 -1614 -6414 -9063 -1320 -9061 -12619 -21604 -16192 -11428 -8724 -10435 -7481 -7471 -2982 7948
19834 7948 11844 -4954 -22440 -18890 -10000 -13033 -21346 -27460 -21898 1641 10488 855 -2649 -8214
19820 -8214 -10502 -7537 -4316 -9221 -23047 -24390 -10235 2520 6124 7460 -5760 -14698 -3935
19807 -3935 1857 6657 15863 24463 17484 6980 50 -7448 -9522 11277 12552 4868 3878 6564
19793 6564 7849 8390 15294 7385 2191 -1446 5108 8191 23951 29389 15597 6578 4261 2056
19779 2056 8683 -2729 -16597 -14215 -16936 -10435 -5711 -20450 -10582 -2749 -19983 -20096 -936 8261
19765 8261 11590 13810 17537 15068 7945 2465 -6171 -10717 -665 746 3855 1594 9850 11643
19751 11643 -5472 -18646 -11255 7546 -2529 -5867 -5873 -12907 -10287 22576 28790 20106 24505 15903
19737 15903 1230 -3718 -3571 -2409 -794 -17340 -17917 -7907 -5415 8927 11205 680 -3056 3561
19723 3561 9910 5802 8740 15239 4747 1521 -3642 -6697 -6457 1339 3686 -1611 -11322 -16414 -7612
19708 -7612 2937 8638 9398 -3558 1773 7791 6519 15112 18402 23587 14396 10839 18312 24828
19694 24828 17082 -3512 -11026 -11609 -12263 -16036 -9388 -7969 -8856 -19964 -19648 -7365 -10842 -31162
19680 -31162 -24195 -2529 9968 7407 -2317 2420 4393 2953 -1565 -11776 -15467 -10428 -5729 -3025
19666 -3025 -6574 -13156 -14472 -16055 -12171 -8425 -14846 -6931 -16618 -31161 -16856 -5573 -16920 -17630
19652 -17630 -8553 -1921 -5888 -3327 5616 11330 10268 7058 8149 8133 -1140 5192 13338 25868 28086
19637 28086 26340 2949 -10236 -11612 -6791 -6035 808 -1935 -3937 -20158 -23981 -11255 -13311 -18196
19623 -18196 -16111 -17699 -12285 -14599 -19385 -8442 -6627 -23445 -28472 -16362 -11595 -3229 -5689 -14795
19609 -14795 -28961 -18192 -14853 -8633 369 -3328 4917 15258 14658 -11872 -16426 -13598 -14080 -29072
19595 -29072 -39813 -30159 -19716 568 5215 -5966 -14244 6310 11810 3711 4685 1865 -8124
19582 -8124 -9538 -10994 -7974 5817 2650 -13492 -14080 -16411 -14165 -7336 -23957 -24791 2678 18023
19568 18023 6154 7667 -1803 -10553 1685 5663 6176 2312 -8317 -9279 -6809 -9350 -1487 -11151
19554 -11151 -20726 -19529 -13731 -6250 -7354 3221 16393 14793 11032 12797 4372 1230 -19093 -36962
19540 -36962 -36141 -32972 -34682 -22457 -10832 -14072 -15387 -6760 -6177 -1139 -757 4597 -1006 -10008 -15539
19525 -15539 -15631 -16332 -20330 -27178 -28628 -31778 -20740 -16844 -10379 -15468 -11992 4033 7997 9573 1980
19510 1980 2313 8981 7341 -6577 -18180 -22436 -18402 -13583 -12687 -20135 -9639 -1204 -2227 6309
19496 6309 3299 13323 17480 13779 1564 -15851 -15486 -18400 -23487 -28963 -12503 169 14992
19483 14992 15104 15236 9430 6175 10194 19013 10989 -12917 -27121 -8438 -13514 -18387 -6631 5135
19469 5135 -2354 -14157 -18774 -8768 -9245 -18873 -14364 -6015 -27723 -32986 -23101 -7480 3944 11311
19455 11311 71 -7732 -10755 -11873 -1162 -3083 2136 3822 2183 -6897 -21783 -16953 -12747 -6201
19441 -6201 -4427 1763 -2520 -15201 -10428 5440 9165 16784 13712 9149 4517 9133 7500 4274
19427 4274 -9458 -20453 -22471 -20543 -23219 -14374 -5286 4262 561 702 9187 25938 19489 248
19413 248 -2868 -7824 -2426 4138 1135 -3374 -3216 5038 -2552 -16563 -32556 -33020 -33166 -25707 -13499
19398 -13499 -7144 -19740 -19958 -18539 -10394 1246 4831 6028 7976 608 -10332 -7287 -260 -1124
19384 -1124 -15923 -23349 -18801 -5614 9814 32680 14700 5963 7541 -950 -8952 2746 12068
19371 12068 4554 -7776 -11755 -25862 -26597 -17459 -16728 -10039 -2561 -12685 -6138 -6475 -5120 896
19357 896 13623 22054 16146 19159 13845 -11 -4718 -8435 -9524 -21246 -20085 -18396 -30954 -23315
19343 -23315 -23521 -25448 -16864 -18078 -15705 -7967 15742 14461 -12783 -24224 -17553 -25714 -25621 -16735
19329 -16735 -14498 -8142 7159 7706 -1495 -12952 -17651 -14004 -17251 -22445 -27646 -19869 -20882 -31838
19315 -31838 -5682 12744 2211 -8146 -13572 -20530 -13355 -3017 -5716 -4037 -2304 -7963 -21288
19302 -21288 -27183 -11220 3243 4961 894 -10169 -13821 -7311 -9685 -11202 -4703 -9564 -6231 7155
19288 7155 10462 3145 -4428 -5144 -6369 -7439 -3525 -20785 -24480 -10220 10838 9081 5518 -10906
19274 -10906 -20387 -18468 -7736 6618 12993 15385 11200 14424 15599 8249 5554 -4675 -10269 -329
19260 -329 -4881 3638 11585 10103 4449 -15916 -9133 16373 21409 27301 23384 11641 19576 20943
19246 20943 14948 19697 23530 15225 5546 4532 1981 -14281 -7990 4536 6069 3641 1223 5857
19232 5857 22650 31995 30790 20051 17870 1493 -9648 -2039 13351 28270 28945 26754 14788
19219 14788 25142 35497 37087 32246 35207 26941 -7480 -14718 5928 20408 27232 31734 46619
19206 46619 44048 34482 34943 42554 38033 42494 40498 34604 31025 21335 18677 38361 31643 33456
19192 33456 39112 30255 23746 18543 5710 7525 15977 19257 29405 33729 37845 34102 32763 19597
19178 19597 20706 14108 -3077 858 2731 2603 8770 16523 18958 15565 24879 26996 21776 29492
19164 29492 31409 8840 9445 14582 15611 17539 5656 10938 20345 30790 31504 24991 25873 12878
19150 12878 2872 9659 14517 22692 26102 25891 11476 11460 22124 16905 19330 21316 9442 -5630
19136 -5630 -13926 8948 20809 14776 5545 1414 -3910 -3029 6187 13707 8708 6503 4977 19530
19122 19530 25081 10891 -6401 -9208 -10985 3001 18240 18245 11347 11257 19533 16464 7964 10106 -623
19107 -623 -1310 5798 22290 22217 22196 6089 -6515 -4911 3434 4888 1278 -4509 -14593 -8245 -1171
19092 -1171 911 -805 4666 13078 16504 12324 8940 -2761 -1623 12130 16599 13209 -2222 -14708
19078 -14708 -14731 -18297 -20768 -15178 -3263 10583 11355 808 -7569 -9055 -4966 1499 4828 -3895
19064 -3895 1268 15913 27440 22517 22402 13135 1459 -10182 -19286 -6239 513 -7986 -13555 -2247
19050 -2247 7929 16870 15173 5847 -17044 -19988 -25517 -20085 -13991 -14151 -9513 2093 5215 2189
19036 2189 8357 -997 6885 17372 19940 13106 27802 30943 14864 14831 15400 10830 3545 2638 -3848
19021 -3848 3693 9828 12229 863 -2317 -7637 -13935 -284 3557 7837 10452 9790 7788 -6574
19007 -6574 -17743 -14835 -9418 3933 5101 9741 7616 -8947 -5927 -6281 -12930 -17380 -19028 -24845
18993 -24845 -25457 -17361 -11551 393 -16538 -39151 -20743 -7094 -3146 -4844 2208 -3941 -19700
18980 -19700 -28835 -22155 -7624 -4632 6475 13297 1234 -8562 -19155 -30640 -17252 -14185 -22476
18967 -22476 -35580 -31633 -14779 -10782 -1331 23146 12710 4958 3426 16304 21290 13826 -1419
18954 -1419 -106 5295 -3258 -11149 -18149 -17377 -22423 -21175 -4890 8441 724 -10449 -2581 413
18940 413 -11204 -11280 -5786 -11028 -10017 -11661 -7204 4224 21851 23294 17826 18931 28051 28717 24777
18925 24777 5720 -8728 3810 15477 24063 23326 23142 13724 5597 -2211 -4309 2036 2391 17179
18911 17179 17161 9488 5252 907 -5786 -3701 -919 4377 5340 10954 20236 3599 -19240 -16992 -1511
18896 -1511 7036 -3523 -4510 11462 19062 9448 2387 664 7003 7638 12256 3600 -11161 -3043
18882 -3043 6438 8450 7317 -678 205 -6870 -12541 -4195 -6938 -17157 -10054 5148 4115 1898
18868 1898 -10802 -9141 709 -2325 -2227 4415 1266 9960 16010 23862 17571 6423 7913 5628 2974
18853 2974 -1835 1124 -5527 -8462 -11509 -1054 -238 -2190 -1849 1618 -1122 297 13774 28932
18839 28932 24799 24002 16014 2195 -12149 -12179 -8806 952 4504 11876 2130 -11685 -10359 -6412
18825 -6412 -10261 -18458 -7711 1338 2819 -4173 -16018 -14960 3226 2752 -4782 9865 26690 29012
18811 29012 2514 -13636 -18705 -16224 -10033 117 -6375 -13666 -4007 -5787 -18141 -11851 -6347
18798 -6347 -6087 -19239 -21666 -26984 -22790 -21867 -20035 -22413 -24268 -15752 -3124 704 -12296 -22074
18784 -22074 -18648 -8107 10647 11258 9766 8126 851 -7370 -2320 -5802 -6481 1943 -3310 -10616
18770 -10616 501 7541 16586 16840 30586 51401 67890 70110 56046 37862 40160 33411 21870
18757 21870 13945 20625 37838 44013 32686 21576 13610 5682 -1150 3226 -8532 -21183 -24908
18744 -24908 -12663 -4448 -161 -3740 -10948 -8647 -12520 -20855 -10527 -2997 -125 7038 14471 12916
18730 12916 12993 19073 8230 445 -10122 -26372 -16600 -11820 -12108 -17095 -18478 -2470 20071 25375
18716 25375 27148 19424 9652 11739 20464 29070 23150 24158 23672 11859 3709 1534 -12006 -15806
18702 -15806 -12863 -9605 -12863 -20257 -10527 -2726 -5105 -17234 -14201 -21422 -24649 -19760 -11397 -6358
18688 -6358 -14889 -28183 -32619 -28517 -32055 -11667 13751 26830 14215 7674 -2949 -6115 -8830
18675 -8830 -12879 -13187 1427 7357 3249 1628 4999 -14023 -15536 -12512 -19989 -20601 -6557 929
18661 929 2965 7563 -2639 -13469 -2212 2912 -586 -12613 -19216 -29925 -30524 -19526 -6479
18648 -6479 -5311 6222 3753 -14790 -2464 17213 20335 8457 11003 8259 5703 6027 8077 631
18634 631 -6490 -30642 -42514 -33554 -29045 -28860 -12633 -11122 -9645 -8413 -15819 -19237 -16961 -5136
18620 -5136 -6015 -12376 -4902 -5993 -19284 -20401 -17244 -11326 4655 12626 -2574 -24200 -16848 -2597
18606 -2597 -9796 -26003 -15994 -17108 -6841 1363 -15917 -12574 2719 13865 11716 2992 4268
18593 4268 1691 10324 31072 25893 14582 6992 4682 13239 13911 3528 1520 -1085 1104 -1943
18579 -1943 6697 3182 203 4160 8816 7043 -273 371 2280 1226 -7680 -7098 14336 15427 14949
18564 14949 11325 10223 10928 3544 -5544 -9443 -14374 -16757 526 11805 11989 6689 3550 2765 -3415
18549 -3415 -18119 -30471 -28319 -12546 -2270 -4097 -19637 -16103 -5102 -2739 7639 -5169 -14782
18536 -14782 -10717 -17575 -13079 -7546 -17581 -18002 -9355 8609 16272 5067 1183 1917 2301 10371
18522 10371 12770 4210 -1012 4953 -8082 -11817 976 23819 14985 -7029 -29053 -22465 -18235
18509 -18235 -6483 4962 -1421 -8952 -11215 -15143 -8976 15605 21048 17167 8946 20295 27916
18496 27916 34239 27050 14257 952 434 8665 -4816 4941 8527 225 4419 -127 -11584 -10373
18482 -10373 -4829 -36 6369 3826 -8387 -3671 -8307 -12819 -17444 -22544 -26756 -23649 -20202 -19908
18468 -19908 -23488 -12750 -16081 -18662 -12640 5574 4034 4424 454 -7632 -8605 -5049 8486 14601
18454 14601 337 -2018 6389 11626 10647 18689 32482 31810 21051 10751 -30 11236 20313
18441 20313 17626 3599 9443 -4387 -9233 3861 14949 22441 18884 19336 27098 25615 30427 9807
18427 9807 -1597 -10331 -13236 -12275 -8846 -975 8098 15840 14136 10517 9968 11503 6022 13239 13477
18412 13477 8049 3458 6310 12339 -4034 -19935 -6673 15259 22503 9773 -1007 12139 21230
18399 21230 16837 25588 27041 21598 16909 8158 8085 -3024 -19961 -29870 -19179 -16070 -6844 -2932
18385 -2932 8791 16333 27600 19230 12759 9471 11447 -819 -14506 -14764 -13710 -8650 -6441 -11243
18371 -11243 13588 17572 22497 14394 4478 7837 10959 8700 6951 14518 4518 2640 20188 15577
18357 15577 7080 17816 17635 143 1565 5755 -4321 -10416 -9237 -9025 758 3688 12460 13384
18343 13384 14687 -4436 -14009 -15952 -8638 -1685 13946 31559 21685 7674 6677 4900 -762 3546
18329 3546 -434 6114 19776 22257 12579 13191 10188 -1414 -5269 -12354 -19560 -26911 -27272 -13948
18315 -13948 -17190 -21748 -18502 -13637 -9499 -11244 1515 19745 6715 9505 11884 5942 11309 20695
18301 20695 21330 5795 -11822 -12160 1613 830 -3409 -10056 1197 10215 38601 34313 17210 14613
18287 14613 3523 -8041 -3021 784 6633 -2493 -4289 252 3314 -4184 8228 21788 6225
18274 6225 7369 7418 6747 9313 12098 7391 8852 7821 5863 6709 -365 7862 3584 -5849 -3448 3283
18258 3283 18240 27453 29391 20980 6684 -5634 -382 8857 -6655 -21661 -19708 -1552 5926
18245 5926 25210 13860 15614 18563 9052 9858 6312 11821 23224 25201 27102 35244 47101 52177
18231 52177 43665 35169 36930 34461 21807 23421 19024 23255 30014 22342 16566 21334 24416 14372
18217 14372 11985 8169 2885 6338 29088 14594 17432 16493 9636 -5262 1454 3206 9065 4083
18203 4083 -1309 -13692 -13682 -4259 8947 10845 13316 10176 18505 23207 23354 18916 15055 7838 14243
18188 14243 25768 20191 20477 32539 22088 21760 28642 25783 25095 30491 39261 33486 12503 -327
18174 -327 16776 33465 35932 42710 43428 43616 33134 29509 24871 47679 63469 52988 39648 33860
18160 33860 42566 42069 49789 54749 54236 51852 63480 64549 51926 54946 51727 63782 81777 83144
18146 83144 73515 63796 61779 72056 81015 89353 80084 82434 90849 89496 92646 95052 105325 114097
18132 114097 119512 123906 129540 141513 156646 170228 186115 195268 224004 258342 290203 316209
18120 316209 343353 374499 414343 473356 534913 602211 684507 832992 1049918 1369238 1866435
18109 1866435 2712828 4246666 6926383 10423574 12745512 13016353 11048123 8138038
18101 8138038 5948068 4398457 3333391 2632001 2164368 1848984 1613433 1436504 1304743
18092 1304743 1189123 1108949 1032929 956609 891637 847867 821813 798190 774025 755579 748985
18081 748985 732015 717645 705070 680992 666277 648289 630321 614763 595265 577207 563111
18070 563111 538438 526013 538324 543790 533521 512504 499335 483321 482300 470530 465917 471244
18058 471244 443873 419719 397516 394003 387751 380898 377550 366166 376690 388207 385683 387789 379048
18045 379048 365797 339334 342303 339890 322155 290346 288646 279346 269775 262637 271667 284329 273204
18032 273204 255241 241974 238744 244561 256383 254545 242540 240761 232503 214750 204936 202115 191820
18019 191820 188549 186922 188818 183180 193520 187043 174520 177235 164701 145131 146556 148257 159466
18006 159466 158563 152787 161649 154444 151391 137575 135800 134747 127818 126789 129723 124043 125032 132458
17992 132458 118882 105447 105839 116142 109430 106320 99993 93600 97203 100474 89053 92344 105847
17979 105847 102086 97438 102112 104629 107083 110936 110672 118911 126668 107385 94055 84573 76136 79889
17965 79889 82295 78829 72639 68487 67502 66953 84408 82727 79023 86977 86500 80788 84056 67865 62804
17950 62804 62695 54743 51961 46521 60483 73802 74091 68248 73613 70707 83617 70561 52936 41885
17936 41885 51446 66547 71131 66893 62975 64761 61074 53462 63390 57385 57757 50719 49922 48103 49323
17921 49323 55004 48035 46937 47124 40506 45763 39560 44835 57475 46663 38324 39519 40420 42680
17907 42680 39405 38129 35222 33223 38818 38263 27822 16902 10748 19223 32814 35403 29086 22981
17893 22981 19385 22691 30522 31368 32133 39879 34949 12473 24489 35315 25747 20402 22110 27756
17879 27756 26099 30393 37472 32756 27631 24196 20480 14170 21731 29301 31889 32499 32971 26645 11551
17864 11551 14239 14102 14612 20387 24940 32549 36984 25278 7589 -1755 207 -9 -7362 -1240 -10026
17849 -10026 -7070 6441 681 -8810 -3433 10856 21180 25756 27007 27195 19412 14596 15971 13608
17835 13608 15402 11653 18876 25479 11820 25464 24775 20564 22541 6414 979 274 -141 4154
17821 4154 15431 13888 10288 24096 26292 24011 17017 10862 7317 10583 -1138 1836 588 10820
17807 10820 17974 20956 19519 22288 26712 24833 29094 29081 24756 27040 21917 15637 13315 17231 5963
17792 5963 -3388 6514 18321 32457 34020 32903 32461 14337 1874 -7104 -970 21743 26835 34289
17778 34289 21447 15949 25264 29752 23387 23575 19534 17603 14375 3719 -5823 -11953 -13247 -26268
17764 -26268 -35062 -19310 4427 18213 16371 11741 6082 7910 12119 7033 2101 917 600 -6666
17750 -6666 -12873 -13287 -13620 -9404 -4190 4732 8388 9407 7254 -5577 -4627 7271 14657 31022 38373
17735 38373 30074 23930 37532 37272 30924 27939 27816 26459 22642 28428 24767 15046 7074 325 2714
17720 2714 11939 15195 15164 21101 24316 12469 12614 5748 5274 2498 6639 -5043 854 477 1984
17705 1984 3486 5680 7803 9323 7819 -3743 -5628 -3731 4586 2386 6822 10691 12813 -10621
17691 -10621 -31233 -23993 -10953 -1897 -1456 -12461 -3804 -6262 -572 15352 16850 6813 5110
17678 5110 -1833 -3135 1932 8949 5225 1360 12483 14872 26943 19946 900 -8432 -4037 -8377
17664 -8377 -9981 -9208 2360 7936 -3053 1808 4560 10826 3680 10995 17434 5300 9466 -860
17650 -860 -10994 -9748 10124 6881 424 11402 10496 789 -5306 2877 4862 -2581 -13809 -20525
17636 -20525 -16734 -4208 10427 14893 9299 3605 20631 31888 28393 12249 8195 2165 -1345
17623 -1345 1527 -5774 -13985 975 -1104 -12678 -2122 13146 13225 -1324 -12228 2703 7790
17610 7790 -6148 -4910 -5826 -7775 10754 23454 26136 19592 7559 -2833 4095 5098 20752
17597 20752 18501 14243 9342 4922 -768 3715 907 -5927 6065 19429 18800 26784 23806 11434
17583 11434 4744 3045 5370 8713 4718 3901 13206 26750 40373 45676 43714 40311 41766 42851
17569 42851 45612 41856 29516 30024 10016 -3338 -668 -5738 -10344 -3210 -10659 -14440 -11413 -7309
17555 -7309 7392 23130 20912 15171 15271 5318 11038 10327 8860 25930 29121 29807 18475 -70
17541 -70 -7360 14919 22839 23697 14493 19697 28962 40836 56275 52920 43903 50405 63879 77056
17527 77056 76810 73224 63021 52486 67649 64689 56962 46395 47758 40408 28877 18221 14988
17514 14988 -16717 -23337 -84 13912 24849 16773 16203 10313 11613 9501 14216 13064 13533 9143
17500 9143 1623 13688 14043 15729 19162 14124 8830 13795 23396 23085 26529 35818 22158 -4110
17486 -4110 -4604 12411 17830 20155 20377 21401 13783 19995 4429 -9102 5992 18645 6562 362
17472 362 -5153 -3546 19261 24695 30765 31019 21475 20979 1179 -11447 -4813 -1895 -1530 6676 13804
17457 13804 31480 32352 31955 32289 27798 20278 27676 30461 29905 29506 15533 7463 2967 4177 12018
17442 12018 30371 41197 58237 87768 93725 83801 63691 46510 35866 25643 21375 23440
17430 23440 14914 13764 8454 3182 -1558 -2371 2297 19637 20844 12719 4560 7028 10184 16185
17416 16185 15764 14000 14581 19152 23293 29735 44183 38392 25372 29995 28290 25153 34941 31581
17402 31581 40908 39400 29310 24139 18835 15011 16686 26491 32276 31692 16652 18024 37162 40206
17388 40206 34408 31799 32083 29175 33305 23037 15534 12815 -6682 6812 17867 17182 12963 9823
17374 9823 16821 26932 29290 34639 26667 31924 28294 24914 21160 21422 19806 29145 33128 39325 42550
17359 42550 35453 9606 -5725 -917 7843 7083 23976 34086 40711 45967 35916 19892 6760
17346 6760 11261 19115 29238 38296 43012 46138 40604 39814 29757 28697 43149 43248 38682 38195 33389
17331 33389 28234 39261 60051 55382 37464 35162 44429 39555 39337 35271 23764 16526 20265 28107
17317 28107 30599 16359 6557 19922 25499 15728 23573 36657 39012 39228 34949 26096 23583 25948
17303 25948 32860 34848 28079 31347 42317 32097 23950 28080 24992 28516 49806 58596 55062 24009
17289 24009 5667 1627 7636 21601 21687 33466 34659 29506 23481 21203 18351 15722 19169 20966
17275 20966 19706 15719 9397 12796 16208 30428 56125 52281 43842 53578 56025 60513 71529 71097
17261 71097 65965 54380 55174 66083 65002 55376 57869 56177 55183 55688 58058 63211 62625 57658 64932
17246 64932 68560 83339 96165 110778 118274 144883 192742 228152 236349 230431 220694 210167 201309
17233 201309 202624 197122 180969 174364 146658 129264 124728 121576 114483 110013 90793 99342 117654
17220 117654 116739 121501 153628 171566 179166 209308 252885 301156 336372 374479 415821 449281
17208 449281 498869 527375 546114 557363 554547 545576 561457 581986 596243 578516 558998 518473
17196 518473 468936 423220 378683 353580 331870 298823 284088 260357 226040 189034 170323
17185 170323 158626 157051 164727 154743 142193 131876 131352 128460 123118 113514 102596 100339 92203
17172 92203 82342 80413 86143 94820 108026 91299 91790 94270 98812 110594 104003 96983 99019 96937
17158 96937 97766 84308 81246 89520 91569 80388 84078 74086 79605 93108 82524 69573 70513 82888
17144 82888 86144 84573 84917 67977 75991 70865 68051 62470 70590 73071 72265 76192 75493 71470 78650
17129 78650 79557 76034 76568 73484 69042 76359 71761 65112 63198 61895 67132 79784 63779 50706
17115 50706 48109 54470 64000 63445 62397 69123 65717 72177 68145 65596 73574 74850 64196 57986
17101 57986 54562 55894 52369 52865 59769 55540 60524 83421 90312 76917 85446 85528 81452 77665 91060
17086 91060 92595 109487 104925 93180 91291 84351 69080 69922 79666 85215 75196 61978 42426
17073 42426 50812 60950 66415 61307 54674 48799 53003 66719 55110 48671 50240 52612 65215
17060 65215 73490 55883 63596 66019 56143 58047 58750 63354 65666 75643 69599 64676 58228 55676
17046 55676 59128 65139 57518 40899 39589 51745 60584 56643 59943 57897 59958 64921 67179 62651
17032 62651 53325 44843 57441 59300 68615 77141 60913 51874 49591 50400 54938 62066 61185 62571
17018 62571 55831 58994 80209 86118 74059 74868 79206 85676 95265 91267 82638 77585 62483 57078
17004 57078 53739 61444 67763 62536 63404 71759 70866 59573 51921 42268 31311 18825 13671 20542
16990 20542 44095 46987 43610 41456 54459 55297 63107 74830 75359 68202 61030 55090 58769 55945
16976 55945 64132 81496 91550 74440 59273 49987 38023 43128 59197 61071 50874 53755 54985
16963 54985 47943 46038 40440 52396 58990 57673 61818 59186 69069 84156 83253 74820 68701 75189
16949 75189 78551 55771 67791 80703 74188 74162 88290 95496 90799 82888 89765 82508 80294 73349
16935 73349 70367 76086 76409 74745 72384 71940 75295 82459 91967 92591 66613 53994 45168 42494 51757
16920 51757 57810 57296 59550 61233 69878 62325 64963 70145 73769 70865 79878 86899 89115 77190
16906 77190 76217 92316 95330 88371 82405 98121 119695 131443 139146 139229 143372 145915 134632 121614
16892 121614 122587 119605 127594 145874 146143 154717 161863 164895 162697 164015 158960 168669 167724 168144 183135
16877 183135 177051 172094 166123 145320 158386 165351 162330 168948 161917 155463 144725 128749 132292
16864 132292 152387 161082 170761 175847 179999 170526 163155 170574 151422 134633 131619 130753 132576 135362
16850 135362 132267 113121 108555 94629 96168 105540 111658 125367 118328 114534 105639 105011 114672 99524
16836 99524 92802 93922 112723 126474 115417 111625 106833 98264 110543 127696 128684 119894 111476
16823 111476 105838 87742 88476 101994 115395 117870 99706 89319 88396 92340 94137 103091 110975
16810 110975 126222 128866 148289 155584 162606 169821 176535 196659 217657 227728 243701 261931
16798 261931 248605 235131 234977 244261 257187 266062 256776 240232 225643 240977 241859 237951 241306
16785 241306 240048 232167 235992 240106 235971 240033 249803 245804 237107 235850 232259 241741 227850 201384
16771 201384 198494 210736 225789 234142 255897 270623 281278 277968 289404 303439 319489 333034
16759 333034 357803 377227 391787 394604 397396 407043 411232 422741 416544 405388 413690 417199 409592
16746 409592 375266 369174 361163 360965 368551 371730 367011 356240 341896 320612 314334 313069 317917
16733 317917 313473 318939 314237 320231 334354 335656 342464 364272 359292 351124 357477 371026 369460
16720 369460 378604 386810 387989 402523 402658 419344 438038 448377 452750 452635 460327 466633 471960 472312
16706 472312 490119 496940 505808 514544 503210 497860 493039 502688 520802 532414 539205 563871 587184
16693 587184 596242 601737 607956 637348 652060 655123 659670 682828 699629 718102 738501 749661
16681 749661 778569 812123 838708 877011 907331 945907 993503 1039792 1083926 1116113 1162751
16670 1162751 1219720 1300704 1381331 1464103 1563578 1660025 1756891 1876033 2004928 2168134 2353723
16659 2353723 2562483 2768514 2972909 3192008 3420668 3673583 3979533 4347381 4779251
16650 4779251 5282304 5839459 6491661 7303712 8389055 9928478 12197295 15457688 19823480
16641 19823480 25126259 30729784 36073535 40847216 45553766 51433968 59415350 69732759
16633 69732759 80458556 89332120 94315449 94948770 93770442 92790395 94495687 97911307
16625 97911307 100784770 100737073 95950849 88160170 78771156 70502687 64027571 58957955
16617 58957955 54363924 49314890 43828269 38165550 32954813 28608372 25202766 22650136
16609 22650136 20760708 19310352 18149071 17218696 16459001 15829222 15272502 14773579 14329789
16600 14329789 13910809 13527405 13169012 12839132 12559339 12297533 12025973 11750784 11470270
16591 11470270 11176124 10886917 10626931 10387574 10177344 9963339 9749063 9542429 9308802
16582 9308802 9082440 8873843 8671271 8481951 8305224 8139466 7967041 7777968 7594292
16573 7594292 7435826 7271288 7133432 6993227 6846908 6692901 6546756 6416818 6295433
16564 6295433 6165438 6032775 5922678 5805977 5687702 5554915 5418925 5300033 5192761
16555 5192761 5083642 4988325 4879620 4781691 4692991 4604873 4522042 4439377 4353381 4269017 4192004
16544 4192004 4117140 4056050 3988003 3919952 3844761 3786304 3720557 3652214 3605213 3538618 3476402
16533 3476402 3414975 3354494 3303864 3250252 3185300 3132563 3082635 3044358 2990771 2933557 2889039
16522 2889039 2850026 2814068 2757820 2688516 2626274 2575027 2525197 2487563 2440887 2397714 2359281
16511 2359281 2316230 2262399 2235412 2198573 2150566 2113217 2067125 2017827 1983223 1958049 1915685
16500 1915685 1875628 1836159 1795615 1765961 1748972 1719526 1701156 1687192 1676023 1658465 1626034
16489 1626034 1585928 1563170 1541189 1513773 1488418 1446493 1403152 1380669 1357934 1315659 1297662
16478 1297662 1292000 1273525 1242418 1203757 1165757 1153723 1129137 1113175 1103263 1100290 1082100 1063923
16466 1063923 1050073 1044020 1042995 1027665 1011600 1000305 994316 980091 973801 967830 947372 942407
16454 942407 932965 917178 889351 874917 872437 876645 853266 824667 824837 816064 798979 782786 780442
16441 780442 776632 774447 755089 730206 728379 713732 713817 705844 697245 691107 673647 665068 643051
16428 643051 629762 616072 599164 596781 612535 612211 587886 580973 572683 557054 545289 540242 548854
16415 548854 552758 546656 534412 514001 494138 485006 486265 479145 471376 460101 454783 451047 443957
16402 443957 431102 418051 407639 393721 376074 371433 348257 344781 347175 344849 337876 321695
16390 321695 309397 301140 292928 290617 295079 305844 298396 292489 302745 315702 317892 303580 292331
16377 292331 284433 276667 275134 272189 262405 253368 256225 264906 272542 264443 252439 249885 259375 256258
16363 256258 241424 229135 237808 232582 230864 236038 228606 217121 216282 218622 212807 205009 198607 205094
16349 205094 213136 223343 221173 203519 185092 190600 184798 171702 171844 179230 186561 171611 162531
16336 162531 148074 143576 162330 166960 149577 146213 132841 128409 139542 141191 139312 130106 127924
16323 127924 129474 126025 126354 124645 115941 115606 130075 142928 146958 139339 143775 140202 131365 123908
16309 123908 117815 114943 113203 117284 112748 101041 98480 88520 70941 67316 67301 60230 51385 62962
16295 62962 74616 80979 66441 57228 57970 60738 69665 68728 65526 70521 62640 61023 62854 52475
16281 52475 42499 55145 67325 73552 65203 61319 62344 52888 44191 32147 35061 43655 37342 35854
16267 35854 39211 41265 54710 55494 42009 29402 25314 29145 24773 15038 16360 22284 11752 15914
16253 15914 26741 31299 34942 39491 34702 25898 29231 26769 24232 19066 3127 5723 21872 15920
16239 15920 19843 12671 10349 9983 9728 8741 16179 7621 922 -2835 7377 22318 22757 10270 -2827
16224 -2827 10454 12100 11666 -6252 -15908 -14932 -11082 1233 13666 16262 3346 -17615 -7039
16211 -7039 -2826 3006 342 -10645 1541 21200 20625 23903 13874 15346 16610 13206 6943 7159
16197 7159 6348 23199 40040 49534 27269 14004 3503 1970 10742 5353 13230 21087 12971 23459
16183 23459 21257 20438 23646 24814 18240 20518 13001 1788 4121 11785 2108 2704 12503 15913 7465
16168 7465 11083 11254 7157 3945 7085 920 -3938 -14313 -8688 -8558 -13686 -12175 -13539 -7014 3117
16153 3117 3566 1931 5816 8067 -6291 -18353 -17148 -10442 5494 5020 -32 -4378 -252 7843
16139 7843 5015 -13207 -13133 -4774 -17863 -12157 -3987 -4199 -17144 -30955 -27158 -20708 -23096 -20847
16125 -20847 -27018 -21863 -17404 -11617 149 -11550 -20195 -14715 -16566 -20018 -8530 -2329 -2622 -1886
16111 -1886 -6825 474 11514 -4876 -4807 -112 -5507 -13028 -21763 -41554 -49462 -21888 -9539 497
16097 497 -15267 -23755 -34836 -29840 -11697 7025 6705 1565 2528 -97 -2611 3909 11178 6699
16083 6699 -1642 448 -8083 -19493 -7800 4369 -194 5756 14169 -3604 -24600 -21125 -6361
16070 -6361 8512 21037 21459 22730 26370 16974 8378 11990 16958 40119 84281 133133 158145
16057 158145 186969 210747 238600 272398 305772 366556 432326 477813 507562 505262 495105 494445
16045 494445 504725 518808 527497 525042 510159 458106 401231 357632 326320 298163 260620 225764
16033 225764 201326 165320 138985 120334 108057 102078 102611 101027 97410 89417 93329 87745 68319
16020 68319 65432 64093 62981 55958 44430 45734 51036 52929 41962 39562 45671 44392 39132 46294
16006 46294 40526 42825 34406 24351 21533 19166 18762 12312 -11532 -19483 -5180 -35 9487 467
15992 467 10003 29781 26075 36800 26565 18006 14611 26612 35593 26982 13281 13583 15218 16711
15978 16711 16471 20331 18920 21852 17030 6629 9603 29547 34555 25555 22464 11449 2785 1514
15964 1514 7226 13747 5421 -8001 -7681 -20031 -26144 -14114 6969 6062 -3885 -6057 -1709 292
15950 292 -2547 -4543 -6067 -12806 -11090 -17045 -11337 -8035 -11161 -3516 14914 10968 -9285 -18205
15936 -18205 -17894 -17815 -8937 -6925 -13170 -7553 -14804 -7746 1722 5957 5401 -1915 -13314 -10971 -4848
15921 -4848 -4135 -7098 -22032 -15980 -13273 -32788 -24885 -16814 -11471 -3025 6 -6107 -25526 -26198
15907 -26198 -21503 -25697 -26458 -19993 -28414 -43394 -45843 -33208 -27606 -21486 -9093 -13945 -5316 -9051
15893 -9051 -8787 -5244 -5092 -12571 -29421 -29571 -27386 -30594 -41938 -51566 -45714 -44188 -41672 -40449 -41009
15878 -41009 -44173 -27805 -21920 -29737 -19646 -10645 -5429 -8722 -22189 -37567 -31847 -19387 -5297
15865 -5297 2670 8830 14698 -3380 -3991 283 2457 -7012 -26191 -29505 -26541 -11541 -8990 -8281
15851 -8281 1479 2765 -5650 -9642 -14001 -29900 -46217 -38887 -33847 -26303 -25558 -15726 -6400 -9664
15837 -9664 -24563 -31277 -34795 -38109 -25446 -7368 -10213 -20124 -24753 -21842 -39071 -43415 -33724 -29009
15823 -29009 -18192 -21865 -24847 -17108 -14218 -13692 -13120 1141 -8265 -34867 -31789 -14090 -6251 -8623
15809 -8623 -25801 -27193 -25031 -24453 -25693 -24399 -23660 -24837 -24240 -28605 -22625 -15917 -36195 -47554 -29598
15794 -29598 -21320 -15126 -11672 -17597 -39481 -44465 -28993 -17590 -22552 -30276 -27609 -11633 -10806 -6470
15780 -6470 -18580 -17567 -23187 -28254 -8780 -875 2005 -7173 -3561 2409 15338 11095 7130 4743
15766 4743 -7014 -10243 -17410 -24636 -40903 -36163 -27069 -27117 -28325 -27508 -28220 -27737 -34369 -30841 -37841
15751 -37841 -46576 -41175 -43307 -43812 -28395 -20102 -23177 -33082 -42650 -42403 -37017 -35803 -41316 -38950 -36785
15736 -36785 -41307 -47047 -46450 -41761 -44185 -38843 -28187 -33965 -54382 -51487 -37366 -24036 -27273 -27078
15722 -27078 -19806 -22705 -31244 -33075 -26696 -24755 -32124 -32934 -39414 -33267 -41542 -52544 -54856 -46564
15708 -46564 -40471 -40799 -44157 -39181 -48166 -47063 -36550 -35939 -46316 -49387 -43846 -39012 -29749 -22856
15694 -22856 -9078 9312 11204 11847 -4218 -8331 -3118 -9102 -14257 -13207 -6985 -10868 -11298 -20163
15680 -20163 -18344 -21774 -8849 -8020 -14819 -11339 -7236 11594 5320 -10666 -21097 -21654 -36609 -26177
15666 -26177 -16705 -22989 -16911 -17605 -24420 -25669 -23321 -28399 -32167 -26250 -23872 -27449 -26047 -42384
15652 -42384 -51182 -44718 -35599 -16695 -9076 -7835 -2854 -10782 -262 -5318 -21529 -27408 -26613 -19770
15638 -19770 -9467 -7647 -21692 -38240 -48789 -48348 -42315 -40769 -29311 -9548 10957 8642 -17820
15625 -17820 -19492 -26338 -42438 -40183 -26411 -14918 -12752 -9362 -14853 -13942 -16656 -18838 -23428 -26411
15611 -26411 -18170 -13407 -14500 -14142 -16644 -21503 -22770 -18217 -10753 -10870 -20926 -21342 -23928 -33996 -35196
15596 -35196 -37740 -35706 -24463 -10860 -6969 -1883 -912 -8515 -9053 -1570 -7520 -12936 -20545 -23149
15582 -23149 -18346 -7788 -13359 -26242 -23581 -32089 -32774 -18814 -16501 -23808 -32359 -28641 -15092 -20737
15568 -20737 -5322 750 787 -19028 -33118 -25160 -23982 -29487 -23617 -17169 -5407 -8686 -22685 -28330
15554 -28330 -24382 -30276 -15026 -13853 -16460 -15211 -9817 -11813 -8176 -13059 -14394 -18422 -22331 -24716
15540 -24716 -25472 -27089 -30470 -25755 -22219 -19036 -24162 -30997 -39992 -36573 -38081 -28863 -33843 -29136 -24661
15525 -24661 -39607 -36797 -24626 -36137 -36841 -26238 -34352 -38876 -28964 -27865 -27935 -31647 -28994 -18353
15511 -18353 -23616 -31947 -24370 -15056 -15255 -12229 -9302 -8181 -20854 -19932 -16546 -10920 -16935 -27883
15497 -27883 -10583 -7533 -10898 -14885 -1416 11437 -10340 -23458 -15501 -11535 -19404 -24551 -28359
15484 -28359 -30519 -12415 -7409 -13882 -11108 8404 5952 -2643 4151 -3290 -28128 -38042 -43329 -36702
15470 -36702 -27058 -34456 -45522 -41164 -30232 -40765 -35370 -25090 -29786 -35803 -37061 -39300 -43209
15457 -43209 -29645 -28249 -40560 -47769 -46173 -40990 -36080 -39018 -27776 -11468 -13306 -12255 -9050
15444 -9050 -1747 4139 -15688 -14218 -16653 -29527 -29289 -18070 -13087 -22783 -30811 -27693 -18993 -24353
15430 -24353 -34179 -31617 -34848 -23790 -12600 -13404 -7592 -5688 -12012 -16205 -23593 -18672 -11070 6503
15416 6503 -6988 -15556 -1722 -18337 -27343 -28072 -20433 -13897 -15175 -20535 -20181 -18873 -10281 3077
15402 3077 -3394 -5834 -13543 -19532 -28541 -22979 -11748 -7987 -13536 -36844 -39650 -19111 -19610 -39450
15388 -39450 -54709 -46309 -31581 -23187 -18331 -17983 -22951 -28616 -42170 -20412 -13227 -11807 -15198 -5322
15374 -5322 -11806 -25543 -29613 -19978 -7100 -15615 -24343 -18502 -20441 -17648 -11917 -12410 -16625 -10278
15360 -10278 -16146 -14348 1786 -1514 373 5280 2959 3040 -3951 -14841 -21157 -23667 -19267 -2364
15346 -2364 7772 9490 -2972 -22471 -19158 -17355 -9806 9224 20356 4954 -11332 -19181 -40240
15333 -40240 -41538 -24154 -23178 -7366 2591 -5721 -26311 -26177 -25089 -22074 -16944 -31274 -21565 -28166
15319 -28166 -28248 -18889 -15385 -13527 -10364 -23778 -33117 -30465 -28850 -25821 -28807 -29504 -35025 -44930 -39724
15304 -39724 -30449 -21601 -12184 -8129 -3602 1074 5168 7727 -8457 -8322 3081 9547 11719 7222
15290 7222 -5843 -22055 -13099 -6907 -8813 -17192 -18543 -28370 -31447 -15980 -2673 4621 1277 -3933
15276 -3933 -9511 -18734 -19675 -14019 -3294 -1756 -9982 -25942 -38846 -41824 -31993 -17421 -6161 42
15262 42 3889 -5706 -2396 1567 790 -9657 454 -1689 -3177 -1358 -8383 -18464 -26184 -29895 -26559
15247 -26559 -12831 2934 -3418 3421 182 -2961 -16132 -26634 -7576 -7994 -20298 -23920 -20458
15234 -20458 -22484 -15182 -12112 -12390 -23360 -19541 -27025 -21199 -16507 -32276 -35949 -41170 -48837 -43785
15220 -43785 -37523 -33456 -21669 -7510 -6908 -9886 -16484 -29710 -24605 -16671 -16989 -7190 -14439 -20243
15206 -20243 -22411 -16641 -18548 -11307 -22761 -28658 -28483 -26509 -27506 -27054 -16505 -14905 -13241 2138
15192 2138 872 -19531 -36422 -49863 -50572 -42322 -34510 -34471 -36813 -33201 -21465 -17574 -8667 -7783 -15727
15177 -15727 -23653 -16743 -25670 -20084 -5835 -13455 -15827 -10122 -11470 -20213 -28718 -30236 -22216 -6385
15163 -6385 -2828 -17727 -27261 -31398 -45643 -43120 -29718 -21992 -21691 -14259 -32162 -43304 -28400
15150 -28400 -30120 -41917 -45701 -42430 -33154 -32090 -37478 -37078 -32053 -10193 10146 9835 -2402 -7835
15136 -7835 -9561 -17373 -17797 -10324 -15211 -15377 -4443 -11219 -26686 -22367 -21735 -25345 -20682 -11579 -6222
15121 -6222 11645 9417 15623 -2950 -16880 -22894 -9718 -2340 -12235 -5860 -6276 -10603 -4910 -8938
15107 -8938 -6126 -2242 -545 -3296 -3469 -4876 -10041 -1811 -12512 -29520 -32804 -29962 -17408 3643
15093 3643 2483 -10782 -23804 -29237 -23481 -15252 -12490 -17271 -19062 -9942 1733 1879 -1283 3041
15079 3041 998 -13621 -13578 -4389 -2494 32 -9599 -21377 -11458 -13671 -16163 -5831 433 1711
15065 1711 1213 12920 19621 16106 16730 16778 6082 -11682 -13359 -6656 -3949 4648 10824 -8472 -19573
15050 -19573 -11390 -8584 7391 6091 -7662 -5686 -15672 -19486 -2604 11443 14568 22263 27646
15037 27646 24241 8238 -1138 -4734 -10329 -12144 -18463 -14976 -3167 -1455 5134 11308 -5518 -6978
15023 -6978 -5847 -2460 1549 19126 26056 28257 28796 33957 30415 35195 41773 51918 66858 69419
15009 69419 64756 62364 78498 89270 105419 120529 134159 165003 205688 271024 362562 505162
14997 505162 753312 1189688 1957526 2940952 3577750 3645955 3063404 2246911 1635273 1201076
14987 1201076 897714 707745 584885 498843 427150 360658 322944 300183 283540 254946 227269
14976 227269 221825 212181 203229 185852 175203 177967 173334 172601 181452 194871 191279 181202 187200
14963 187200 172678 155373 148125 149900 152369 149971 145639 154705 147427 139639 130293 126034 125013 115163
14949 115163 103193 111585 118177 115337 119823 112231 106234 96461 88030 103575 101847 96775 97920 99521
14935 99521 103549 107244 108819 103780 102778 93454 91951 84954 72221 65572 61028 58337 53829 44526
14921 44526 47509 45398 40354 52380 61900 63088 60106 36952 25936 27902 32142 40604 31099 25388
14907 25388 34234 32331 44688 49097 38335 19143 14906 17430 28282 22523 27568 25314 28897
14894 28897 25935 31868 33579 35851 29149 19381 25497 31333 33878 33452 37364 24067 15643 8092
14880 8092 9426 33154 41768 30533 21456 25091 22458 22739 13225 21518 28749 28990 31678 36209 23449
14865 23449 21978 23782 14990 9426 3811 8721 6918 16071 17902 18005 1606 -1074 19399 18861
14851 18861 5862 -9503 -3824 1911 -1299 19278 29106 24891 8813 11523 21151 27440 28456
14838 28456 13565 349 11754 7294 1311 11393 8048 1757 784 -7432 -21315 -15937 -7149
14825 -7149 -4709 837 -6343 -13046 -13026 -12893 -16394 -12913 -15782 -3873 1355 -443 -13992 -11654 -2004
14810 -2004 -9530 -6356 305 1609 7126 8918 698 -17198 -23822 -13448 -5012 -10822 -18444 -10231
14796 -10231 -10723 -16346 -18380 -15551 -1351 13118 17871 -11298 -23060 -6740 -813 -4640 -13550
14783 -13550 -26167 -30755 -25763 -17250 -16283 -17611 -13954 -12401 3566 10854 11060 5964 781 14015
14769 14015 8635 -3307 -16926 -24571 -30549 -22964 -16021 -2666 -11711 -20561 -19295 -23749 -33948
14756 -33948 -28337 -12266 -15067 -7979 -3688 -13455 -20239 -21637 -20969 -12695 -4289 -1738 -19724 -15206
14742 -15206 -8623 -17131 -25420 -7950 -5217 -1800 -9762 -8526 -20703 -19896 -24676 -13868 -11492 -15580
14728 -15580 -17896 1272 -2657 -108 -715 -21953 -25921 -17127 -15169 -22764 -15260 -3918 -9708 -16224
14714 -16224 -8701 -1400 -1378 3796 5410 19285 16734 16713 9686 -8670 -21519 -10316 3072 17379
14700 17379 2644 -3938 -9509 -12987 -19810 -7409 4730 3693 -10041 -6940 1516 6504 10760
14687 10760 6255 -326 -3963 -10914 -14784 -22145 -37173 -32913 -30704 -38206 -30969 -11332 -22901 -32004
14673 -32004 -27105 -21654 -26060 -23829 -12671 1294 -9188 -20777 -10552 -16181 -18026 -10107 -4911
14660 -4911 -11657 -24240 -27187 -24207 -21363 -19156 -21820 -19611 -21696 -22339 -22138 -28853 -22718 -18301 -30275
14645 -30275 -36586 -35767 -24718 -19818 -11124 -15546 -20159 -21008 -21032 -12243 -3035 -4302 -16759 -20213 -22565
14630 -22565 -5816 -12632 -25032 -38360 -35887 -28892 -31068 -36776 -23053 -13396 -4768 -9673 -12309
14617 -12309 -12300 -8362 -3379 -5863 -28067 -29451 -21402 -22256 -21407 -15505 -32689 -36688 -21767 -12081 -9118
14602 -9118 -10625 -22975 -32542 -30789 -25744 -20243 -14721 -13307 -7312 -15661 -14027 -11345 -13312 -6579
14588 -6579 -1559 -6039 -23312 -30580 -32244 -26124 -22244 -19459 -11158 -6014 -11240 -6555 -4481 -14627
14574 -14627 -24614 -23668 -15149 -6917 1132 -9910 -33729 -37343 -34535 -28056 -18546 -27471 -17750 -11206
14560 -11206 -18637 -25279 -32282 -32582 -19668 -18991 -30680 -26062 -15417 -1641 -988 -2381 -4300 -7288
14546 -7288 -12143 -15673 -8281 1012 10899 18241 18414 19791 25438 21749 -512 -14105 -6419 -11348
14532 -11348 -9107 4160 533 -2781 -10476 -9913 6908 14604 12971 -3903 -12280 -16245 3617 20219
14518 20219 22959 2896 3548 1811 -10702 -24423 -15392 -24148 -39223 -26302 -10332 -10583 -9846 -11313
14504 -11313 -11667 -9653 2353 10308 -1447 -15845 -15300 -8418 -407 -3074 57 -780 -6171 3295
14490 3295 2078 -12956 -11004 -8708 6033 14288 17410 10983 9332 -11709 -22462 -24973 -18190 -20254
14476 -20254 -29327 -23038 -16042 -19152 -22846 -21735 -18960 -13267 -26988 -35234 -20904 1589 10544 -1939
14462 -1939 -823 -3813 -12745 -8931 -917 4239 -3421 -8467 -15120 -15932 -6969 558 -17782 -27670 -37845
14447 -37845 -31753 -21284 -21666 -24981 -20702 -18201 -14543 -17115 -21366 -3434 4067 4007 3933 -234 5321
14432 5321 -2612 -9304 -10061 720 17264 25982 23439 19325 5803 9706 17447 15698 5699 -3879
14418 -3879 -15037 -19144 -19144 -23871 -17389 -14277 -11941 -146 5671 -1715 -2429 -2424 -10212 -22479 -12244
14403 -12244 -14432 -11235 -17090 -19113 -17292 -8915 -2557 -2879 -5132 -4438 -9863 -8420 -13907 -25066 -19541
14388 -19541 -25941 -20357 -5807 10569 -1638 -13726 -13500 -15745 -23234 -9941 -6631 -7239 -6525 -8341
14374 -8341 -5712 -8624 -2650 -4685 -14297 -12619 -14581 -14370 10179 23437 19269 2399 -10287 -7563
14360 -7563 -19391 -26408 -27455 -43666 -37440 -33550 -23474 -920 979 -20845 -22096 -25307 -29485
14347 -29485 -23863 -24965 -12239 -5870 8031 -1331 -3998 -2170 1406 -5331 -25073 -21131 -12808 -11330
14333 -11330 -9592 -18442 -24809 -23208 -26484 -17841 1763 12739 18950 -6467 6674 22057 19345
14320 19345 8440 1335 -464 -5028 -9618 -7942 -13875 -11098 -14451 -11922 -9670 -11029 -19677 -24031
14306 -24031 -32416 -20695 -2242 6754 748 2088 -9745 -10060 -58 9683 10790 13117 2595
14293 2595 -1333 10554 17322 -809 -4663 -11593 -16115 -3708 -1274 791 13320 2013 3222
14280 3222 -4314 -2152 8011 4426 -9544 -25635 -9926 10198 3202 -3459 -6644 417 -5046
14267 -5046 -7258 -57 -2968 6220 12801 17321 13270 -1985 -11556 2877 5616 4162 9374 11504
14253 11504 25210 15573 15882 20350 35248 49261 61380 90024 143575 212101 285577 341021
14241 341021 388842 407835 380731 333023 269447 203145 149996 124093 111773 92879 76944
14230 76944 62222 55316 46312 33075 19034 26891 41287 30610 21900 24622 29839 19512 28840
14217 28840 47507 37359 28114 41554 40265 32510 25646 20525 11229 6536 -960 3813 8703 17570
14203 17570 31936 37568 26875 3345 10121 15079 16813 -4250 -10234 -11304 1397 19682 -987
14190 -987 -3366 -5712 -603 4319 8070 11050 11001 7015 -4848 -20370 -15435 -6418 -18907 -6910
14176 -6910 8783 5557 8396 7872 2257 1335 4244 3694 6473 5664 2963 -17796 -11732 -4779 2002
14161 2002 683 -444 -6357 -8577 14918 21883 18577 -71 -14534 -19145 -25003 -14136 -3207
14148 -3207 -6922 -5487 -2055 1400 2647 -1543 -12365 736 -1855 -2821 -6490 -7170 4921 6018
14134 6018 7265 12849 10958 6505 10557 5827 -884 -44 -4516 -20006 -19106 -22863 -15201 11428 15724
14119 15724 17658 10652 7930 9503 9379 7302 -1583 -9871 -3463 -102 -7557 1264 8001 -7103
14105 -7103 7838 14472 5182 3314 71 11095 10911 2494 -9291 -12035 -9007 -8392 -18352 -8846
14091 -8846 5161 8661 6671 -10666 -1370 7436 -3901 -2258 5754 -901 2048 -92 -3381 -64
14077 -64 10856 9729 6131 1656 2542 -1690 -4065 -20702 -25475 -12420 -12151 -3462 3434 1012 2053
14062 2053 -6907 -20175 -18234 -12130 -1148 9003 2183 -14677 -12734 5759 9952 205 -9464
14049 -9464 -21386 -18512 -962 1924 8042 9491 4384 3084 3437 10000 6168 22835 22223 33334
14035 33334 32178 9868 -3610 -9913 -16573 -22469 -20584 -7398 -1548 -16507 -26126 -8672 -7349
14022 -7349 -14642 -18406 -14141 -12874 -2704 -2607 3376 6676 12483 -1425 101 -1197 13199 20398
14008 20398 6701 2691 -2069 -13222 -12179 -9110 -7789 -8045 -6147 -7795 2262 -7206 -5713 7315
13994 7315 -1586 -6520 -6278 -4607 -16602 -19009 -2401 -151 -324 1676 1626 16147 18878 3564 -10055
13979 -10055 -16101 -15765 -10357 -6396 5473 10931 11525 15443 4192 11186 21158 24596 31553 27191
13965 27191 18437 5318 3258 152 -13264 -15110 -17068 -18812 -17710 -22957 -32257 -24444 2120 14247
13951 14247 7552 -3095 -11168 -17342 -24028 -28872 -13170 -5135 -9823 -4926 -1090 -10416 -28609 -21720
13937 -21720 -283 -3689 -17057 -14900 -11864 -298 -555 1125 3854 1384 9334 6147 14772 6928
13923 6928 -5224 814 2205 2195 -6519 -13552 -755 22279 20949 10258 9194 10441 -4691 -8593
13909 -8593 -16527 -20652 -11118 3 -596 -12240 -13619 -12942 -284 5648 5134 19775 39400 41257
13895 41257 25380 12749 3950 14150 36319 36743 34241 29750 27745 29580 30279 49116 60725
13882 60725 60998 46064 36604 41688 37076 28238 12124 3069 769 -7400 -22337 -21578 -5275 2222
13868 2222 7024 4758 1909 7322 6710 12788 8735 12619 29465 37107 35396 37907 52514 50126
13854 50126 40167 48859 65412 68559 66313 70565 87408 116822 188815 286739 376764 442641 444100
13841 444100 393638 308318 227670 178044 147473 119352 101741 90631 68734 49143 43723 46331
13829 46331 44206 25404 39613 46656 45514 47357 48001 42508 22220 20731 28128 30829 22875 12677
13815 12677 15774 18767 25970 35015 40594 42222 37051 27961 26833 24799 25587 35592 59436 49955
13801 49955 16944 -487 1303 10326 6300 10315 24319 36112 32506 34494 38151 30758 31943
13788 31943 28127 20618 17682 15916 4721 20304 32553 45966 41810 34366 40895 40116 35106 53421
13774 53421 87040 109385 139511 199054 267187 335425 393780 426598 430339 430733 399832 361494
13762 361494 303919 243704 192244 158445 141546 127996 107404 89976 69798 75709 78711 85106
13750 85106 102894 109174 102860 105211 91118 70745 63970 59884 59694 57529 58136 46803 54009 62715
13736 62715 52956 41204 46074 46957 54183 44231 33671 33466 34143 44633 33276 27641 30457 31016
13722 31016 30497 33316 29285 20477 29914 41847 75467 98805 102083 101601 112952 112247 105920 88124
13708 88124 58216 46114 43107 36569 44140 47849 47637 37073 21042 13211 19871 30434 27683
13695 27683 21793 12685 -1802 3165 22417 28585 26032 29148 21306 1851 6171 22209 28098
13682 28098 11969 8386 3603 2046 4650 -964 1113 9185 8348 2680 3634 4000 8198 5829 13282
13667 13282 18347 12211 10959 12698 8954 5751 -7900 -18163 -11391 -10470 -1126 8543 14246 16612
13653 16612 14623 11711 15490 22991 7386 -586 5251 -2892 -5014 -1534 -5640 4011 14371 7090
13639 7090 -753 -2001 -10300 -3512 5862 236 -12288 -18276 -19123 1864 4113 4570 491 -7759 -441
13624 -441 -17 -8 -8176 -6537 2816 8491 120 771 8029 8067 4166 8185 23063 16291 7066 8781
13608 8781 19692 5399 1868 13746 12514 7298 1075 970 -8240 -16829 -11362 -14686 -15588 -2885
13594 -2885 5571 -2534 -8286 -19786 -30022 -26781 -13677 -6864 -11213 -15796 -12228 -13500 -20408 -7988
13580 -7988 4215 9704 6202 7648 5939 -12021 -16925 -8510 -3963 -2846 1425 -8444 -16663 -23533
13566 -23533 -19462 -15015 -14868 -13689 -22407 -10908 -1262 -8191 -22848 -14190 -8056 -4338 2750 5989
13552 5989 -10339 -27046 -26964 -26050 -10407 -3337 -10021 467 5503 10180 4364 955 5690 1381
13538 1381 2185 10546 4294 -14454 -21877 -27710 -27189 -25364 -15306 2678 -8338 -16766 -6293 -12375
13524 -12375 -15779 -20651 -16688 -18443 -31276 -35789 -40534 -35834 -19895 -17657 -13576 -20885 -27147 -25363
13510 -25363 -7579 -11390 -2779 19455 18353 9381 -4066 -5883 -5667 8647 7365 1834 4118 -10214
13496 -10214 -7252 11218 27259 24491 19594 8141 1772 4914 7799 8160 -5070 114 2119 7595
13482 7595 8966 981 -5943 -9850 -22031 -17620 2435 19736 15388 11082 2427 -10965 -8280 -5057
13468 -5057 -1562 -6736 -4414 7551 1092 -13271 -17211 -15988 -15696 -11050 -4954 -11577 -7638 23
13454 23 6413 10455 19068 14952 9109 12191 7478 12385 20246 25743 14801 -3146 -6662 1595 15153
13439 15153 12129 -6810 -13368 13877 25609 21499 16851 17284 14554 7879 8814 13789 16805 15564
13425 15564 4412 2604 627 -15798 -17349 -10873 -10309 -17159 -10144 6585 22270 6583 -15641
13412 -15641 -15887 -13807 -11527 -2948 -4659 -1900 2283 -1361 -12274 -22919 -13257 -9966 -20429 -9260
13398 -9260 -7934 -10436 -10341 -15543 -13171 -21786 -21977 -21530 -15902 -4763 -5112 -752 6479 4961 1307 8451
13382 8451 8092 7632 4870 1607 526 -923 6611 21998 55556 82877 69269 70739 85527 111991
13368 111991 117439 109603 108157 113052 103631 91191 74280 52932 52138 56943 47122 39587 34401 36740
13354 36740 36243 52176 36539 28842 26315 28216 40204 66087 80424 91719 105632 122385 127221
13341 127221 133151 141120 132519 128723 118337 101444 78954 71890 66310 64981 48556 26332 23384
13328 23384 22999 32640 25252 21376 11886 10878 17675 18879 9378 19672 25225 12209 6839 17821
13314 17821 19349 21379 14036 12900 17402 20089 3898 -6710 4038 8093 -5442 -4580 3992 -2652
13300 -2652 7856 24140 28448 24775 13832 4241 13672 20057 22321 26130 41240 44354 29858
13287 29858 4098 5511 15280 14541 30546 46283 55279 48550 30207 23980 16675 6632 -4468
13274 -4468 -2382 -3593 -626 -9153 -1867 4849 6183 -2545 -8681 -6141 6355 11889 10024 18850
13260 18850 22497 21377 16382 18292 19149 24484 17326 17711 -4284 -24839 -23735 -9588 8914 11410
13246 11410 3414 -3522 -2336 1016 -20410 -26042 -19531 -20627 -18286 3543 2436 3481 -10370 -13614
13232 -13614 -20147 -14945 -8676 -448 14386 29324 18584 23520 17194 6359 362 -3096 -5713
13219 -5713 -1887 -5489 -11245 -7398 -12512 -16126 -29975 -21813 -9873 -2482 -7088 -4638 -12095 -20268
13205 -20268 -14853 -19843 -9620 -8337 -115 5030 -2551 -8911 -15318 -10610 -3674 -6527 -22434 -28740
13191 -28740 -24574 -17076 -6403 9514 15898 15576 29369 22001 7449 -8825 -21333 -8694 -563
13178 -563 -11414 -16804 -5322 -5 -12296 -25410 -17793 -5588 2601 4630 488 6678 11927 8061
13164 8061 -9722 -14744 -27178 -31300 -31776 -22933 -8743 295 3323 -2701 -6028 -2238 4391 11212
13150 11212 13757 22575 9952 -1271 -3750 -9514 2182 10020 4214 -12488 -31152 -32124 -17754
13137 -17754 -9994 -13570 -12947 -2527 -13434 -22423 -17245 -7741 -5874 -3555 -6058 -24255 -27908 -17903
13123 -17903 -15791 -13780 -17980 -25760 -16311 -13167 -9379 -3739 -7421 -3187 1396 -7068 -18461 -19573
13109 -19573 -7165 3468 69 -360 15829 23352 13355 14582 16472 8054 3429 1208 -5596 -1167
13095 -1167 -8775 -10962 -19316 -18628 8101 27372 25001 9923 3215 2246 -2948 7584 10682 11778
13081 11778 15898 5786 -6510 -19822 -20726 -7253 -2151 1560 -2241 -5480 -18270 -32905 -24618
13068 -24618 3450 7877 2900 3275 4958 7094 11265 13392 11401 3192 -10029 -5013 6091 12593
13054 12593 17308 5127 8635 1681 -6073 12516 7839 13683 7688 -6543 -3319 -6401 -6107 -10954
13040 -10954 -9735 -4832 -12904 -12451 -7403 -5511 -3566 1967 4161 10787 10268 21534 31510 21202
13026 21202 15237 7001 1244 -5675 -7834 -8574 -11381 -12247 -9220 -477 -1486 -8613 -556 -637 -4418
13011 -4418 452 1786 10417 3647 1487 -15819 -18998 -8695 -5193 4258 1533 -5341 -1502 5006
12997 5006 7944 -2823 -3462 -6783 -8328 -3506 14495 9571 5939 12093 -171 -6486 -16597 -9190
12983 -9190 -5978 -696 -1183 -7039 -7993 -5161 -5037 -12772 -19424 -9612 12950 23649 29264 25807 5487
12968 5487 -2534 3794 11411 21172 11562 233 3228 -3591 -4260 12934 3372 -5165 -9563 3999
12954 3999 30568 32314 7422 -5763 -2242 3009 11194 -1776 -2681 5856 -4239 -13472 -10115 902
12940 902 10844 -6997 -9161 -15612 -22302 -11346 2631 -8367 -16669 -6510 276 -23095 -31052
12927 -31052 -13059 -15082 -23990 -15709 -8572 5709 4826 8308 23324 22674 -560 -10337 -3904 -5247
12913 -5247 -4120 11224 8907 3655 5209 -543 4443 12174 7861 9044 3970 8001 6464 -8194
12899 -8194 -5943 -8638 4621 10203 10396 17307 15648 22578 24009 14523 11607 -269 7248 11195
12885 11195 10159 14274 2383 -7204 -9700 -4273 1879 3772 6507 16031 25857 34626 33804 26865
12871 26865 21690 14008 17149 4270 -11511 -986 6644 -7260 19759 39578 27958 27991 23873
12858 23873 19629 -2682 -21805 -17940 -9329 -11119 -11054 -9923 -14821 -14412 -7831 -14735 -12867 -15075 -18519
12843 -18519 -12968 -7425 -187 -2103 -4650 -4678 -1866 -607 242 -5395 1963 11895 10811 308 -5765
12828 -5765 -21205 -17185 -32616 -40367 -26484 -21661 -20457 -13314 -2543 -12983 -18512 -8342 7099
12815 7099 8463 -2823 -16385 -11342 446 -1674 -12603 -17133 -13683 -7579 19324 29289 28170
12802 28170 22367 5760 -6026 -1878 -485 -1565 7322 1560 8172 16358 10916 12415 21733 8284
12788 8284 4928 21199 38287 35080 28517 24048 10840 11285 14341 14433 19306 18296 11186 -2169
12774 -2169 3088 -9 127 3019 6849 17966 57602 106383 144596 150214 121307 91008 60055
12761 60055 38438 23923 20315 20047 28357 33217 27220 39009 32720 5505 4063 14091 17065
12748 17065 13278 4494 2139 12729 11044 14084 21140 22945 19829 8852 1926 17316 16461 3792
12734 3792 -7651 -4625 9208 8124 1057 7354 7775 13697 10231 10503 -1724 4278 19842 27848
12720 27848 32180 18896 -85 8533 2263 3416 620 2291 4752 9330 9213 9310 14297 4860 4131
12705 4131 6449 16249 17388 30030 32010 34572 29197 25249 17601 13073 13181 22489 27600 23789 25819
12690 25819 29700 16548 27742 37672 43584 32043 27829 33282 27302 23755 21733 26826 37477
12677 37477 36046 15851 13677 14022 14268 18451 14530 12968 5769 4523 -2466 10134 25545 23666
12663 23666 19094 15355 30637 59127 83836 125728 140314 135889 114523 87144 65895 54856
12651 54856 64156 56221 31650 25445 22864 31014 43172 46087 47301 43117 37846 36246 44025 55577
12637 55577 49169 27512 11110 13044 25675 23772 19775 28347 35235 29259 22738 9203 13596
12624 13596 20577 37398 39134 18552 15439 15478 29343 44590 35678 26374 24847 50708 64254
12611 64254 67433 67006 90686 143047 195086 225097 233970 205564 162154 118385 102053 72653
12599 72653 44087 35730 45170 43963 31461 28917 24940 22908 26289 28586 34994 32153 14590 9231
12585 9231 17622 17978 15316 13234 5115 3646 11211 24946 20824 8221 22635 11621 5273 11135
12571 11135 -4325 -3020 6656 10787 16884 9929 3425 11191 15047 20318 27748 27351 18696 22485
12557 22485 11477 5970 10393 16271 24209 27391 27455 26754 34537 26637 19442 23881 24611 3850 13943
12542 13943 31783 28277 16871 -299 -4897 3342 22599 33407 19916 5987 2325 4185 19019
12529 19019 1555 1183 14403 6750 11893 16293 19247 17144 15449 16927 29237 30090 25615 10968
12515 10968 17464 44493 58214 72505 72807 76555 61573 43589 27948 17188 5259 7976 19746
12502 19746 18655 19739 21391 10963 3494 1813 11405 23180 33013 39297 52366 56698 46664
12489 46664 33604 20224 20374 7988 12631 3859 1418 13430 18228 21874 32584 41633 47025
12476 47025 34930 26541 19517 25267 24197 27476 17836 9824 16882 22523 29393 34110 37168 25706
12462 25706 16002 17346 25946 27479 16128 31320 43966 33837 20243 1951 -6217 5869 4048
12449 4048 3565 6789 10906 8433 15679 8574 13044 20271 22828 31691 38862 24350 11449 18228
12435 18228 24983 27133 25788 48224 45726 41377 46607 38895 36998 48733 55305 54786 46332 29433
12421 29433 25820 13886 9077 19296 17263 21535 12024 9529 16382 27778 30341 26865 14133
12408 14133 16933 21090 22042 5137 3531 -2243 -15022 -4748 -8127 -5925 2161 15464 21626 34164
12394 34164 38672 17697 16081 19625 17891 22041 13791 22544 26988 17177 7807 13219 13270 11326 1027
12379 1027 -4311 282 -8545 661 20171 22048 12163 10891 18593 33636 31459 33139 18273 13319
12365 13319 12695 -6240 -19919 -5882 7282 -3637 -16244 -5972 10095 22555 15727 12005
12353 12005 6992 9614 6917 6341 -1653 1176 2193 3052 3199 6010 16434 6730 -9933 -1696 14290
12338 14290 6683 837 2274 6123 -10104 -24352 -17402 604 13365 9066 10657 10664 11072 10773 7053
12323 7053 -4696 -14555 -13654 -7386 3032 2383 4032 -8652 -1106 8181 6128 -8783 -5101 1270
12309 1270 -529 -11189 -7084 19700 17027 23516 25542 -886 -6695 -6604 -3892 4749 18710 16836
12295 16836 -215 -4065 -1424 10348 16005 12308 11608 20211 13673 9058 18581 19295 8323 5888
12281 5888 20539 35225 24764 12137 11126 6886 6564 13736 16760 13311 7033 12798 17416 22712
12267 22712 22045 8073 14432 24434 13174 1371 560 18973 24753 22565 30106 28764 42045
12254 42045 37838 16186 10980 2890 -7425 -801 7194 172 1757 -8446 -6713 7661 15727
12241 15727 7838 -3858 -8939 -4513 6248 20590 26447 21760 32428 21185 9160 4893 -6194
12228 -6194 8619 15281 8241 -4273 4104 1538 1505 8798 19585 33443 39602 34649 31109 17600
12214 17600 4184 2986 10590 14682 20076 30740 27400 9085 8194 10209 17091 12880 -1589 -5030
12200 -5030 5143 6086 -1964 -780 12496 7748 8018 10201 -1429 -9098 -12768 -9684 1074 6414
12186 6414 255 -10759 -12439 -10048 6646 19469 23755 14539 8082 16525 25237 29877 22465 9432
12172 9432 -4779 -5313 12526 10977 9260 10034 -7947 -12351 -7979 6907 16240 6451 12544 12989
12158 12989 14992 14367 15832 7141 3904 5279 6120 12681 9692 20606 27209 29033 15530 16494 10360
12143 10360 12148 29473 30698 28825 24386 17021 20512 2848 -4364 10880 19397 22034 33069
12130 33069 30427 26059 27367 11084 15515 30418 32476 25505 20078 18601 7915 5339 1606 -4020
12116 -4020 -5 7312 18576 22804 22916 11936 10179 9916 15191 7021 4895 12474 16225 5016
12102 5016 -2518 275 14295 15204 13610 12780 16766 13494 14730 18348 23469 27803 23265 7557 3219
12087 3219 -331 -6720 16361 20647 3480 -819 18695 32308 26152 24380 17053 10815 20236 25213
12073 25213 33825 34870 21694 22156 24661 17511 17425 22015 22752 25942 34838 25785 21774 9933 1315
12058 1315 -889 -3343 2931 22934 39407 31158 20555 13673 15103 24 -7421 5211 10656
12045 10656 12212 273 -8446 -13636 -4831 -3783 16643 31611 21298 11958 15579 17582 14100
12032 14100 11423 2570 -14179 -4923 7199 3497 -13066 6292 26239 22473 11414 20520 38521
12019 38521 26828 6286 14538 25188 32470 40151 46960 42111 22423 9329 11860 8217 3203
12006 3203 12792 19580 18403 12495 10913 11033 16525 15000 5673 4140 2430 11611 18001 8014 -8277
11991 -8277 -10363 -5831 3557 9635 7918 -7372 -3321 -2783 432 14544 16985 23433 23857 23156 36886
11976 36886 35256 23672 22498 14413 17039 30765 35693 18479 12959 11988 17744 15252 5384 5118
11962 5118 6528 11375 22858 24050 20174 16019 12043 21513 31564 13328 -276 -6318 -14867 -1354
11948 -1354 10586 24671 19528 24264 31310 27530 27819 28365 23551 22396 15514 961 1728 5200 727
11933 727 13177 13895 5357 21174 36407 40751 41471 42354 42233 23450 12374 24990 22216 14485
11919 14485 16190 16910 17607 16175 26300 20022 10363 20141 19117 26458 20456 30665 43407 44831
11905 44831 36766 19282 16545 19919 28214 29105 44156 45345 29196 19986 13994 7527 12857 38415
11891 38415 41710 42919 43570 34128 24887 24153 36419 35746 30139 32670 34671 30724 25506 15019 12153
11876 12153 9291 20709 18507 16298 17968 21712 18963 24820 29558 24282 18081 21663 16842 9431
11862 9431 14262 31469 26876 19204 21106 19201 19160 19998 19118 25969 41348 39801 27148 19903 22651
11847 22651 26017 34458 38139 32530 10205 -4601 -7873 16593 16240 11667 28281 39500 43473
11834 43473 43549 49329 39275 20569 21622 26017 17725 15061 -554 988 7006 7241 8739 8828 2696
11819 2696 597 16040 19495 12662 7899 -1271 629 13661 31406 30828 25117 22420 9063 -2205
11805 -2205 -8950 6783 8944 47 19094 34323 45668 43210 38022 36393 29031 28742 34782 33023
11791 33023 30137 39066 35542 28465 22702 26245 34693 25651 19228 22204 23379 24950 35088 36405
11777 36405 18438 15675 25159 25734 19682 14507 22762 41394 43123 33088 19750 28002 33048 34824
11763 34824 31205 32838 45813 39476 36411 32384 33233 46525 49862 44327 43037 54891 45044 35806
11749 35806 43693 31786 27510 36265 33306 27609 30102 22771 15379 13073 16658 36770 44372 34145
11735 34145 26611 24963 33824 37784 37014 29185 32344 34911 33576 40121 46467 50290 69191 76977
11721 76977 63482 64168 59155 57282 53145 34681 27439 37439 48054 42934 23666 15041 15813 18567
11707 18567 21682 28086 33379 31681 21216 20700 21565 19069 7494 19823 22517 32851 36187 28080
11693 28080 19891 33730 31952 21082 29918 40327 33543 30847 35165 46488 44779 44306 46764 46966
11679 46966 46678 44648 37324 19955 16811 27147 37910 35636 43456 45879 42990 36323 33462 35063
11665 35063 34470 39252 42270 34235 23995 31991 36384 33521 41150 42037 23124 2510 4649 16069
11651 16069 26198 26785 24177 31139 43936 56164 46892 38244 42023 46215 36851 34231 26259 35405
11637 35405 48677 57980 56663 50428 41508 39896 42110 48253 55578 58768 57010 39921 29526 27049
11623 27049 29680 14983 7128 -2656 2381 6818 4260 19278 43357 44300 35114 22496 33785
11610 33785 27671 17031 17106 36170 30444 32121 42015 48249 34999 13684 12588 27228 39066
11597 39066 28310 22033 38912 47794 51126 53843 53819 57176 53458 51706 32676 29095 25271 26861
11583 26861 46121 44953 39027 40873 43536 44058 43197 38837 33123 37697 42479 43922 42263 45794 42772
11568 42772 47147 51088 54894 51087 44034 37344 35372 23876 26328 22935 28178 33637 40968 54045
11554 54045 45393 35613 39365 35471 40427 38158 34120 47280 44045 45115 48643 45096 36660 30425
11540 30425 33994 40344 33521 34342 44378 41249 41723 41168 53145 60366 54705 50918 53105 64751
11526 64751 68066 70520 68303 47200 33956 39646 58426 61657 59600 61572 67482 64323 50010
11513 50010 46201 48142 40745 19734 35567 55310 53099 54977 45275 32685 33710 52591 62626
11500 62626 66347 73673 79887 63132 60591 61755 73523 73735 76862 58297 63664 63623 61481 44814
11486 44814 49556 56025 55359 41374 41869 46692 61414 66250 79168 81797 75342 62293 59945 41303
11472 41303 32314 50481 53721 51098 44709 44421 42141 47135 54495 60195 56594 56527 47710 45546 56886
11457 56886 63434 64129 72439 70347 64485 65935 74101 56648 41849 42287 47940 46077 45757 53710 51453
11442 51453 46870 35521 47857 66115 67546 63045 70533 69934 65611 50399 57126 68546 59171
11429 59171 71705 79189 82094 81297 70178 69843 73275 69127 65471 64249 71444 66913 68115 67572 71229
11414 71229 71525 69009 63668 55846 61416 49179 49267 53473 54323 46839 45304 44550 52899 60852 59992 62245
11398 62245 66493 75390 69245 66735 70699 71527 56875 56882 76403 72809 71563 72938 67678 63343 66743
11383 66743 63877 63598 67825 76108 84541 82109 78746 70308 65668 73240 71940 78857 77323 78533 92834
11368 92834 91514 83104 74014 75162 85214 98629 98713 85211 87957 87662 86888 97216 110643 113531
11354 113531 101561 95664 92626 87556 86599 91401 92185 88767 102680 97659 96707 89312 93971 102493
11340 102493 106179 109028 102329 111937 109812 106375 99895 100920 100420 91308 86153 93247 88957 86331
11326 86331 94043 93053 96470 102159 114250 119472 118761 113250 95316 101102 111714 101807 87858 86174
11312 86174 101433 116089 113616 109762 89868 90296 87533 87953 95080 90786 93615 102429 101598 112249
11298 112249 105682 96729 95372 98092 89290 95681 94159 81524 95186 100755 92573 98748 97744 96404
11284 96404 87302 75316 65466 57749 62544 82043 105091 109417 98467 93563 100954 102745 110035
11271 110035 114587 105534 105647 90985 92164 100139 113087 103204 105276 109242 119226 115067 99444 99205
11257 99205 101882 90774 93335 97543 103748 100404 98826 100604 94981 104918 114702 123502 122393 113499
11243 113499 116207 104605 107096 107121 105550 116080 105197 97953 108543 107867 110298 132254 144747
11230 144747 143622 130526 118648 112637 101690 95933 96447 106597 112828 115367 110042 113281 109111
11217 109111 95327 97185 111421 128070 131422 135218 138218 134609 139582 136859 132173 141949 146604
11204 146604 131439 109317 104460 108911 97120 95734 102979 94925 92466 93665 102378 116775 125446
11191 125446 127195 124194 125742 125447 120328 108062 124232 132819 116232 123228 127545 131912 141468 148688
11177 148688 129086 114934 117698 122965 119323 119901 125951 142696 153588 159599 168440 179944 187397
11164 187397 185199 179959 173294 170087 167507 176928 165332 154726 150022 139129 125186 115931 114936
11151 114936 107142 103056 100860 99997 102692 110322 130908 146743 148517 156599 166482 167193 152905 160412
11137 160412 174110 176128 182550 193998 194231 195493 201818 219634 231156 244537 268461 293533 338557
11124 338557 378080 436323 506780 635156 832661 1093807 1426220 1836521 2256898 2626956
11114 2626956 2877839 3004675 2965703 2743277 2425821 2065096 1712031 1403111 1152275 959114
11104 959114 818012 714457 649215 609519 575221 540717 505117 453995 426169 421710 426164
11093 426164 429078 413195 405669 409273 397187 381157 367536 371560 367655 361565 358995 359743 352675
11080 352675 353256 356082 369736 375735 391481 392110 382893 351380 330344 321071 321458 319752 317543 314362
11066 314362 301561 286806 281293 279624 273141 263750 247673 256515 273057 275780 273015 264762 262128
11053 262128 277116 278587 277360 280686 263443 256143 255655 268011 269577 252957 253751 250727 245639 245099
11039 245099 250998 262051 256138 245440 246899 246655 258609 270595 261796 250574 249255 260975 279565
11026 279565 280015 270533 259802 257281 258282 260835 257516 242100 229683 216673 207330 205130 199953
11013 199953 204214 192035 186233 192203 204086 216818 213443 231295 233318 226938 228003 223236 231445
11000 231445 234470 227632 221403 220597 226526 224116 228376 221587 214552 216434 212551 211024 207695 205810
10986 205810 203791 206495 216622 225092 230622 242151 250235 245503 237754 250690 249231 250651 258543
10973 258543 254027 247277 241838 242377 250223 264091 264858 267004 274879 304530 327825 346719 373523
10960 373523 398026 445572 482534 519568 539244 560273 587929 593724 569828 544244 531078 531932
10948 531932 504609 468561 451872 431968 440777 439973 429482 426983 424716 426140 440915 454203 446196
10935 446196 445773 445878 447129 437934 430443 418099 414547 401858 391018 375621 363894 366094 355355
10922 355355 342000 334072 324313 320336 317992 325363 339154 335527 314429 310278 303109 308768 317732
10909 317732 329484 334659 341625 346132 354781 366025 367757 368999 380441 383988 391348 377516 364097
10896 364097 375766 396263 427805 469045 530233 659188 874980 1215570 1729210 2243604
10886 2243604 2484908 2421237 2050537 1671555 1395652 1204688 1047778 927222 842464 783258
10876 783258 732439 678521 643922 620779 601492 590296 566953 556294 560443 591019 630812 673876
10864 673876 716653 734043 748656 760784 756004 752904 754672 757217 742346 734727 754471 760408 753242
10851 753242 738119 730562 717932 705348 698462 678266 665101 661111 658575 656864 659425 668247 688480
10838 688480 708015 732652 765598 801005 844253 912947 1006768 1128550 1264231 1405248 1532996
10827 1532996 1637521 1735698 1812435 1911978 1998532 2037580 2033261 1939660 1805597 1652799 1511649
10816 1511649 1387273 1282975 1216137 1178080 1147895 1109535 1076093 1059505 1053642 1028667 1016841
10805 1016841 1028896 1043852 1042747 1048020 1063770 1069511 1073548 1081225 1085167 1060337 1048112 1039880 1028589
10792 1028589 1032706 1059207 1081107 1097945 1128302 1176047 1242574 1304992 1365546 1407325 1429408
10781 1429408 1455299 1465093 1464530 1444885 1420110 1404189 1386613 1372321 1368849 1381516 1417736 1456154
10769 1456154 1489697 1519208 1549220 1602654 1655888 1706717 1770019 1810783 1844621 1893588 1941482
10758 1941482 1996524 2067185 2150838 2218421 2306350 2406630 2509328 2598275 2702594 2799564 2899848
10747 2899848 3016975 3144649 3281726 3409574 3567681 3737164 3916224 4119386 4357333
10738 4357333 4605130 4852087 5106527 5378246 5670169 5999985 6402387 6906071 7532275
10729 7532275 8293089 9206065 10224649 11330889 12440662 13503466 14528916 15516549 16543535
10720 16543535 17687523 19058542 20797786 23007245 25791755 29309258 33752989 39490908
10712 39490908 47130586 57929019 74008905 98419053 134333330 183505494 246820057
10705 246820057 319163874 390685977 454662167 496520528 513037326 503240579 464975912
10698 464975912 411256323 347688378 284300573 229609505 184893788 150993036 126466916
10691 126466916 108643139 95439044 85375609 77465672 71097911 65933838 61770590
10684 61770590 58436271 55809679 53772384 52205984 50974361 49936324 48965286 47971003
10676 47971003 46873321 45593640 44182251 42695702 41174957 39715081 38390424 37215858
10668 37215858 36222475 35420348 34770736 34230672 33751071 33329399 32911237 32435453 31922026
10659 31922026 31388990 30821504 30240077 29661316 29131887 28613015 28107905 27631030 27153398
10650 27153398 26693053 26273291 25897714 25515303 25124100 24678834 24122281 23509842 22861215
10641 22861215 22182643 21521196 20889071 20287243 19723982 19222206 18751096 18310542 17891044
10632 17891044 17486154 17087883 16722675 16385440 16055177 15730384 15418919 15142445 14867060
10623 14867060 14604893 14345389 14094905 13865418 13628254 13387731 13154860 12923962 12696381
10614 12696381 12472492 12264056 12060675 11877976 11696732 11504434 11311411 11101215 10903689
10605 10903689 10692540 10497043 10331534 10167877 10006589 9848685 9707880 9572563 9430546
10596 9430546 9293008 9165852 9028205 8898462 8772544 8649331 8542280 8429919 8301241
10587 8301241 8167900 8007210 7828937 7669799 7530454 7370122 7189054 7013960 6834759
10578 6834759 6654692 6480062 6340441 6231480 6142229 6072013 6017976 5960364 5879249 5811565
10568 5811565 5739083 5668533 5604666 5531893 5472125 5411148 5334333 5250006 5168641 5070087 4949199
10557 4949199 4827973 4705251 4578338 4474536 4364151 4268920 4193485 4116087 4028601 3948032
10547 3948032 3881964 3833261 3776406 3722269 3673808 3620215 3568283 3537136 3511008 3491151 3473383
10536 3473383 3459786 3425515 3380554 3346387 3312748 3308953 3296129 3257966 3221218 3180014 3146927
10525 3146927 3102122 3067105 3039981 3022784 2986551 2940532 2882491 2826829 2778177 2742115 2725900
10514 2725900 2711417 2714250 2704215 2662622 2626289 2601739 2557008 2514932 2462520 2422627 2397185
10503 2397185 2380420 2369285 2361852 2358830 2374762 2381037 2371531 2352833 2330490 2329344 2314715 2283454
10491 2283454 2261948 2229383 2191488 2146914 2093667 2053506 2024332 2003346 1980776 1963853 1936664
10480 1936664 1894639 1852630 1812912 1772953 1742747 1706184 1676777 1654417 1617889 1584360 1562316
10469 1562316 1532795 1510553 1477033 1442924 1413560 1388155 1375168 1347067 1322692 1310635 1291378
10458 1291378 1273025 1274773 1273242 1277094 1258159 1243973 1240920 1230052 1219846 1206880 1193829 1184563
10446 1184563 1165614 1165151 1154705 1135394 1124712 1098658 1086561 1068457 1062273 1075038 1067850 1057538
10434 1057538 1032427 1011122 984177 964833 947296 926822 917947 930313 928827 919671 905519 888604
10422 888604 887767 895685 897541 893175 897390 897240 892278 889752 883654 880958 873312 877142 877623 885192 887168
10407 887168 876673 885678 902543 917547 933375 932796 942058 962947 972482 980479 991211 1001865 998397
10394 998397 996837 1014579 1022995 1020181 1007073 995779 1009262 1008565 998537 1002413 1010966 1016560 1056837
10381 1056837 1139176 1219341 1302387 1335209 1341417 1348767 1397788 1490435 1596583 1682086 1709680
10370 1709680 1691887 1665913 1651595 1633970 1630108 1615154 1594732 1565917 1526291 1498121 1456364
10359 1456364 1401471 1354635 1292855 1247176 1209661 1193963 1163174 1141918 1146521 1151454 1151393 1139991
10347 1139991 1134658 1136531 1143053 1148286 1143276 1131132 1133087 1136338 1141240 1146533 1137101 1138862 1144690 1143473
10333 1143473 1140809 1145160 1174062 1190736 1208783 1222817 1258860 1292346 1321401 1341965 1379718 1408605
10321 1408605 1416915 1422954 1433765 1431103 1437303 1453883 1465381 1465348 1469761 1482705 1500067 1529478 1554503
10308 1554503 1580514 1634038 1689048 1744717 1793092 1844078 1890601 1947285 2016904 2091240 2168728
10297 2168728 2250233 2347256 2448234 2556533 2705020 2882113 3129468 3457787 3854257 4317252
10287 4317252 4831702 5366832 5862887 6249052 6501916 6582686 6528800 6408734 6250728 6121880
10277 6121880 6074007 6096962 6265829 6545809 6905330 7371092 7937044 8618163 9360733 10158694
10267 10158694 11015548 11905720 12878171 13974342 15228282 16685866 18353768 20291118
10259 20291118 22502697 25060704 28138909 32008340 37187329 44479555 55314317 71725639
10251 71725639 95592111 127170408 166023512 210395056 252495899 288886042 318201465
10244 318201465 336645541 349275935 356527428 361498034 365429926 364448611 358022934 340761131
10236 340761131 314936328 280985795 240534730 202057156 167691480 138886281 117012362
10229 117012362 100941580 89156679 80443427 73844460 68715133 64600197 61188450 58305556
10221 58305556 55834988 53678706 51771813 50080818 48569973 47181621 45864353 44608639
10213 44608639 43374695 42178461 41009453 39880395 38809298 37819995 36903832 36053451
10205 36053451 35276660 34521047 33808959 33139620 32485954 31841262 31195457 30543160 29882189
10196 29882189 29231918 28573268 27900649 27241012 26604981 25994799 25422142 24853096 24321671
10187 24321671 23832082 23373806 22923095 22486927 22057012 21624186 21185957 20739504 20313272
10178 20313272 19880309 19440685 19022325 18609471 18205408 17815988 17440276 17061728 16719034
10169 16719034 16356756 16030856 15722173 15418690 15128086 14857584 14592121 14353460 14114953
10160 14114953 13889489 13684003 13501905 13283790 13076547 12861755 12640128 12425593 12221068
10151 12221068 12023757 11834359 11668359 11506554 11345987 11187850 11025921 10857583 10658156
10142 10658156 10448437 10243550 10055417 9867471 9695596 9550844 9392368 9217624 9053997
10133 9053997 8902928 8754878 8590763 8421351 8268252 8112091 7967268 7815778 7657334
10124 7657334 7502903 7352298 7211504 7089075 6971519 6853687 6737634 6631472 6538798 6434219
10114 6434219 6340553 6244910 6155020 6081286 6009076 5932382 5846582 5762912 5674721 5590343 5487367
10103 5487367 5385522 5293508 5215860 5140581 5034708 4943385 4844542 4730254 4629784 4544951
10093 4544951 4468906 4386227 4300202 4206669 4106573 4022842 3933348 3851130 3797469 3755753 3687859
10082 3687859 3634428 3598420 3566012 3524067 3489214 3462793 3445924 3408616 3361443 3336505 3320074
10071 3320074 3280498 3233437 3191601 3161844 3121967 3098254 3066457 3024131 2965587 2914729 2873521
10060 2873521 2843216 2807573 2782044 2742551 2711499 2693089 2659555 2622803 2581629 2541372 2513998
10049 2513998 2484764 2456012 2418124 2378510 2337625 2282635 2257456 2225148 2190862 2168460 2162338
10038 2162338 2148349 2109845 2074498 2032350 1998578 1956396 1921197 1889744 1869731 1849855 1822069
10027 1822069 1797527 1767060 1727968 1692594 1654540 1627804 1598347 1576828 1553638 1528885 1502689
10016 1502689 1470094 1445034 1421219 1384822 1352864 1333699 1313614 1296766 1270119 1241806 1223102
10005 1223102 1184279 1158475 1149724 1143761 1124450 1111356 1094462 1083614 1084080 1093924 1095491 1103769 1103130
9992 1103130 1092703 1075665 1049874 1046459 1043837 1033418 1010549 983595 975018 978207 946565 931911
9980 931911 927396 917381 912481 912892 888497 868282 858549 854439 847170 839426 830264 820942 796784 787808
9966 787808 774521 765126 751367 773828 784050 766143 745721 731526 736434 719917 712562 713249 714779
9953 714779 709245 701509 681056 668896 653064 633632 618707 614361 610999 606302 587467 587089 588269
9940 588269 577209 576389 585027 578277 575825 563094 558321 548370 540369 541522 540204 526114 511749 511921
9926 511921 508991 495311 484174 477310 468485 447892 453312 467593 478441 497553 520637 541152
9914 541152 528107 496717 470469 442726 428897 400521 371551 365259 369291 361497 361696 363282 372076
9901 372076 367539 348523 343837 360359 356441 327846 322514 338637 341140 313724 293910 295163 294966
9888 294966 297724 307924 321314 314501 311522 310171 316083 307735 314685 324282 316863 303583 291486
9875 291486 278971 266981 262608 259269 251318 244984 253672 247997 225917 224811 227894 219360 230246
9862 230246 237527 232694 234086 223453 223179 220257 223731 225929 233428 256131 275880 274927 256142 255387
9848 255387 265971 289176 307626 307594 312863 341660 379978 415923 473341 554823 686470 849279
9836 849279 1063141 1313539 1546552 1764272 1916696 2008916 2096306 2150098 2180094 2197682 2183516
9825 2183516 2133117 2019843 1850669 1648188 1435780 1216044 1001614 844493 739948 659568
9815 659568 587048 553295 531415 513032 483295 456136 438380 417823 405461 392453 372778 364768
9803 364768 370875 371423 365717 349196 337170 326236 327454 323800 322551 327881 333597 343292 331696 321715
9789 321715 303919 280957 253630 248960 268016 279999 287019 290872 278847 251158 240454 221981
9777 221981 214709 215688 214682 210527 191154 185401 183242 190075 192915 179988 174665 171935 166349 151173
9763 151173 157040 181137 187009 178711 170365 160210 131643 123244 120755 124736 121858 121386 127466 119928
9749 119928 105264 89690 84004 107679 126970 127928 123212 120186 116160 112123 127932 141626 133580
9736 133580 127138 118366 120533 125897 124041 114740 105473 103967 100085 106871 117578 114763 114644 105051
9722 105051 96098 86889 87802 96455 95519 87549 79807 71959 55952 53826 39610 41430 52425 49159
9708 49159 55584 62656 58776 46744 50540 54735 50403 50530 41870 45289 45532 40444 41281 26188 30030
9693 30030 33111 36466 43856 46956 53222 56475 49780 39518 35229 45542 39998 23362 16319 23972
9679 23972 32825 37788 42066 37863 36348 30468 33743 41277 43291 50006 66220 49186 43432 44190
9665 44190 44507 50854 57059 58761 58567 54970 36800 34486 48444 53099 24625 21989 31026 29017
9651 29017 28993 38332 43022 32198 18666 6763 -187 -9983 3265 24841 35364 37063 26233
9638 26233 39106 45317 26409 15965 21470 17809 8633 17599 7528 -1369 -6043 -2386 2122 4696
9624 4696 3888 58 8722 9200 4860 -2605 4212 20132 26528 34233 46839 40249 25198 18025 13620
9609 13620 20368 23294 29298 27820 17289 31612 36374 22789 8981 -10166 -12389 5870 13718
9596 13718 13922 21461 22898 15276 5665 2020 15444 9881 9766 22049 24519 5221 -1129 7937
9582 7937 14698 18900 6185 -219 15781 7973 -10541 -246 -948 7036 17178 18219 13978 11306
9568 11306 -1953 -6282 -4375 1431 12728 13443 22963 11088 -144 -4783 -2921 -2840 -7348 -3543
9554 -3543 3372 1616 -12879 -10061 6942 24452 31271 25962 23415 23615 21646 5341 -4468 -11913
9540 -11913 -10543 -12400 -12055 14164 12836 9878 5530 3825 6815 -7425 -9520 -7206 -8740 -970
9526 -970 11089 4256 5695 3919 9215 -1348 -6993 -11538 -17734 -9428 2892 -4352 -10296 10249
9512 10249 17217 5607 8254 11537 13799 1482 2326 -1960 9304 24591 7216 -6148 -10610
9499 -10610 169 9295 4549 -3732 -3175 5731 8576 5309 2291 6962 -185 -9306 -2503 7165 6805
9484 6805 19247 21338 31898 34894 3928 -6084 9872 348 6463 20637 1657 3267 -2951
9471 -2951 -15164 -8892 -8730 -6505 3433 -4439 -4675 -12145 -12271 -5001 -2117 5787 7167 -19366 -17283
9456 -17283 -22010 -29841 -32877 -26486 -20014 -18102 -12644 -5985 -15744 -2809 -1213 9597 19968 3734
9442 3734 1196 5882 4284 5233 -8421 828 8737 3511 316 -6562 -720 14570 10276 -14103
9428 -14103 -23063 -16443 -12830 -9270 -5527 -8296 -9298 -6117 -6500 -8391 1341 -318 -4007 -5583 -8440
9413 -8440 -21 -4360 -23857 -31427 -28185 -28969 -8722 4095 12142 480 -2572 -2014 -11739 -19854
9399 -19854 -16754 4084 12219 13815 6879 8284 2141 4213 13482 1466 11197 16597 14892 14271
9385 14271 13973 12719 16842 17103 5688 -16533 -20705 -23798 -16960 -11689 -4492 5946 2196 -6132
9371 -6132 -3295 1047 4484 2985 -4446 -11909 -3322 -12235 -19969 -19044 -9947 9813 17391 15802 7461
9356 7461 12088 11270 1240 9051 -1408 -18799 -17318 8719 14920 13378 17048 16823 14339 11002
9342 11002 -829 -453 14743 6103 2938 10719 16054 9748 -2300 2167 -1167 -21753 -15267 13060
9328 13060 7351 10186 4358 -5130 -167 -4450 -2189 10731 -598 -5462 -15393 -16549 -1826 -4971
9314 -4971 -11097 549 1184 2662 5719 7437 8882 2404 12913 22014 28023 33701 22975 -897
9300 -897 3110 14011 12238 11660 3298 25771 27316 30929 35778 23465 24469 34266 22690 27545
9286 27545 18982 24940 31836 21028 15753 24260 18285 21362 32510 41121 23534 9651 16791 24594
9272 24594 24333 29901 39734 37912 34321 30764 37002 41870 30574 28784 28535 30240 30904 43010 45198
9257 45198 42852 44277 46536 35604 40136 39921 36867 29979 38359 49958 55424 62468 62351 58242 43930
9242 43930 46464 45787 40114 31815 38222 29489 43226 60586 70275 68450 61306 72095 84856 87424
9228 87424 86999 93394 94965 94665 97315 78842 67790 71351 81613 71714 73797 76266 84677 109175
9214 109175 123628 105394 100096 99904 87468 78537 74422 81234 105389 103372 98138 110802 143639
9201 143639 154962 152606 143671 128342 130192 117559 113100 125067 138279 141173 128558 131438 133290
9188 133290 150412 160813 157481 161535 184339 191791 183418 184638 189696 201029 210941 213310 211677
9175 211677 216479 231313 241385 252536 265668 269169 276325 299615 305583 315096 319722 320291 328860
9162 328860 326519 343356 365297 380377 376843 372951 381509 406919 438994 447705 441135 455981 483055
9149 483055 505126 523613 540548 559014 578423 604435 625816 641977 667086 701119 727932 726718
9137 726718 745811 779680 806678 840619 861000 879953 900284 910801 940170 946024 955005 966030
9125 966030 974354 981522 987268 995885 999772 1004450 1001964 1009162 1017572 1015883 986202 967652 958021 953494
9111 953494 944572 934949 921099 906735 899889 875859 863366 861530 864016 840550 812044 780116 756292
9098 756292 734315 726927 720047 713781 691113 672458 648481 626057 611242 596491 598441 591978 577777
9085 577777 563456 552938 545477 539841 515843 484862 468245 467215 472495 466912 462537 449487 448191
9072 448191 441717 431257 421568 410154 390162 382926 398996 393023 363359 345459 325721 329838 342942
9059 342942 333647 336332 322773 298270 290755 305186 301190 288795 290230 281855 271909 267434 258135
9046 258135 258592 265005 263722 267980 252283 231260 233250 222130 224027 231275 215916 200327 199113
9033 199113 192378 186783 196682 205109 209592 219570 198516 183505 187946 190627 197048 200844 193281 176579
9019 176579 164701 159764 154678 154860 176001 179677 170360 167762 139882 130671 129509 130700 134142 129330
9005 129330 125212 115357 113178 116752 120260 117610 116795 120189 129222 124462 125061 113778 117852 119253 113630
8990 113630 98094 93821 86816 89548 86154 83725 82073 76063 76925 74123 69410 61706 65461 82507
8976 82507 90525 84378 73425 67243 72603 66736 74738 80624 80836 70714 72551 66492 57622 49343
8962 49343 52434 59280 70051 69765 78495 76656 78906 68992 53125 51032 57827 50919 38399 38827
8948 38827 43517 47988 48543 54121 41306 42971 48673 49081 42332 41390 44511 37603 26512 34427 36348
8933 36348 37537 59459 76228 77165 63463 58157 50326 35040 21887 26544 31173 43766 46238
8920 46238 40282 31106 18179 10284 20553 29156 33146 38834 44842 36260 45462 56953 59225 51103
8906 51103 44983 33686 27713 18883 16436 15557 8598 7988 11398 26174 22684 24802 21976 14866 20552
8891 20552 26133 25356 36446 46974 45810 37554 18576 5517 7471 32078 30702 42970 38982
8878 38982 25913 31829 16035 13537 35942 34035 28795 19465 3408 5501 26373 31444 45360
8865 45360 46716 31956 22956 31896 27540 9737 -956 -6591 4760 18391 31662 34158 24656
8852 24656 15291 10477 -7576 -22042 -19664 -1888 -11253 -1547 11958 16919 18097 6786 10317
8839 10317 8763 8520 -2024 2180 19294 22826 18607 7034 331 -917 -5022 -1644 393 5010
8825 5010 17367 23709 24750 32118 23350 6599 -8153 -8774 2795 -7326 -4222 -3202 5275 17181
8811 17181 10634 10705 15092 13735 21601 24211 19005 17897 9787 9367 12325 13586 12480 10304 816
8796 816 -4059 1567 -9768 -862 -14514 -29378 -17485 -19652 -17909 -2058 -4314 1137 3464 -7051
8782 -7051 -11575 -13853 -5868 11014 11695 3722 5000 10592 8824 18994 15960 14050 17765 25787 27286
8767 27286 15228 12093 8486 -3325 -8581 -2915 4136 10999 24110 27447 18075 22258 18665 17917
8753 17917 24833 18126 269 -4625 -14018 -24451 -24829 -5892 -3319 -1598 -1298 8630 16733 15756 5241
8738 5241 3175 9599 3786 10160 21469 20150 9247 15463 20371 10729 16637 23422 27801 22691
8724 22691 14335 17806 30236 21456 615 -3643 9641 19525 1258 -15089 -7494 2426 7923
8711 7923 11657 4626 -2546 -3624 -1433 4448 -1469 182 6037 11450 11156 -62 3645 -2056 -3660
8696 -3660 687 2498 -4682 -12185 -10102 -8866 -4589 -3199 -2400 -1787 20410 30369 10959 -11496 -17031
8681 -17031 -10282 -16 450 -2960 2198 13509 16057 1564 4626 4386 -5996 -2668 -9618 -9795
8667 -9795 -1037 6938 5819 10185 13471 2623 927 -2120 12886 24935 21426 23302 18254 11924
8653 11924 24443 18209 12864 17404 20546 21180 41051 45659 26501 15509 1798 10742 27429
8640 27429 21159 19434 19081 11091 11174 22973 11168 9948 16892 12163 12366 14012 16626 13401 18564
8625 18564 8245 -883 989 11367 15655 14532 6536 -32 1016 4925 9582 19505 24282 13585
8611 13585 11590 22106 34367 45119 44935 40187 19862 18637 38967 52966 60484 64883 54466
8598 54466 50480 50761 62055 70055 73157 79292 88063 95505 107811 96740 96703 103888 122751 130656
8584 130656 146908 141108 130940 126332 123333 122133 118924 117335 101210 86710 82113 83163 77652
8571 77652 66817 70908 73225 67074 61355 52525 48223 36637 48846 48542 37413 34076 29304 34687
8557 34687 25140 27985 39118 42237 42065 46299 50874 46882 45537 48474 45998 42027 43476 49552 55782
8542 55782 41447 46682 50163 44484 44818 43518 32348 28503 22753 16678 13438 16943 24596 30459
8528 30459 30014 29115 46496 42177 30472 34141 49969 42368 36738 29709 23435 9557 24327 35506
8514 35506 30919 7790 3713 17183 22871 11877 16840 7708 8529 14215 14462 25861 28574 11004
8500 11004 8990 19712 17654 19040 23075 20465 24121 23890 25123 27737 35693 30252 15789 25247
8486 25247 31480 25297 22782 22576 15625 24593 20961 18105 30744 41647 43925 34222 20273 7352
8472 7352 -9561 -3454 -6172 -11340 -15540 -10993 411 9945 26947 36819 35756 17676 151 -5928
8458 -5928 -6542 -2853 4905 -5466 -4701 827 12658 13834 306 -11012 -9541 2686 4405 14710
8444 14710 14103 17998 10498 2562 4231 12194 1093 -16748 -26484 -31521 -14882 -4954 -8235 -8139 11423
8429 11423 9242 -68 2292 3674 10131 17281 14063 8184 10125 466 3450 -912 3101 -7429
8415 -7429 -14925 -6440 13901 9928 192 -8137 3152 8667 10770 -879 -8481 -17282 -26929 -21622
8401 -21622 -20992 -18831 -5189 -5625 -7114 -5974 -8985 -16260 -5484 13700 18926 19677 12462 250
8387 250 4778 3065 -9688 -16281 -2129 16395 13239 9092 10966 -5228 -11323 -5651 7353 21508
8373 21508 6950 5876 16567 27776 13263 -6426 -21422 -19723 -14528 -675 10239 1206 6833
8360 6833 19811 23978 34497 26768 14176 6056 7601 4038 -1931 875 -5658 -16865 -28973 -34818
8346 -34818 -20491 -9444 -16772 -10720 7537 22505 12847 7542 11305 12399 4626 -4006 7251
8333 7251 -4978 -15620 -25423 -27859 -19678 -16935 -12094 3795 12770 21368 9932 -7081 -4284 -6134
8319 -6134 -3273 -11708 -6212 -1804 -1283 -7916 -14441 -3515 11470 -966 -21889 -19330 -16390 -5163
8305 -5163 -6173 -18017 -16098 -4521 -6752 -17700 -12968 -9255 -12602 -13525 -3519 -513 -5839 -17231
8291 -17231 -10726 -11586 -35783 -43975 -37813 -19787 -12655 -2272 1423 2258 -2016 -7647 -10500 -15052
8277 -15052 -14636 -10006 -2004 -2884 -9194 12268 26812 18334 21662 18351 18545 25289 3718 -19340
8263 -19340 -10653 3984 7262 -7376 -13454 378 -3709 -18262 -15596 -5881 8222 2269 -782
8250 -782 -1191 -3089 3143 2695 8307 11334 -9058 -8466 8220 9077 4661 5694 8413 3858 1904 -13802
8234 -13802 -17297 -16149 -25930 -23383 -17028 -7639 -11048 -14746 -337 -7254 -19136 -20048 -20116 -24519 -32600
8219 -32600 -32969 -17231 -22841 -27401 -15102 -21224 -15411 -13395 -8656 -4705 -7162 -24495 -30795 -23603
8205 -23603 -21326 -14915 -8387 7568 18918 12251 -2140 -13866 -10950 -2765 10204 3760 -10035
8192 -10035 -9291 7085 6296 -2461 -13980 -13163 -13585 -901 -5973 -4922 605 7956 15711 21481 24361
8177 24361 9775 -18292 -18790 -14668 -7677 -8641 -10336 -532 13905 9430 603 8418 10676 25681
8163 25681 16935 13570 2135 4632 22845 20119 15363 4520 -215 9081 5135 762 6550 -34
8149 -34 -2898 -11188 -11652 -15663 -19602 -9696 -10772 -15036 -18608 -16325 -5943 -4258 -5412 -2998 12820
8134 12820 8072 7251 20861 22286 12118 393 -6150 -7113 -172 1107 17736 27470 16904 18663
8120 18663 12632 14617 26070 36636 33036 20455 4345 -17660 -17857 810 10948 10250 8616
8107 8616 17451 12746 3661 5502 -1467 -974 1796 3789 6719 12755 13704 2537 85 1840 14205
8092 14205 21784 27934 34513 31864 9980 -1818 -5049 -1178 -7759 -16392 -15445 -1329 13379 16874
8078 16874 7159 1603 -8224 -8734 -4664 -2363 -8145 -15474 -22113 -28221 -42464 -26988 -7902 242
8064 242 -5708 1278 -2138 -4997 7843 6837 4737 7468 4525 -4140 -6643 -9688 -12047 -6433 849
8049 849 -4623 -3842 -9106 -413 9593 20307 30736 25383 17730 21127 12153 371 -3047 2739
8035 2739 7710 16432 13522 10375 7387 6871 7875 -641 -6644 -10412 -9596 851 -127 2807 4148
8020 4148 -6015 -19811 -9268 433 -2576 1891 -2555 -9039 -25484 -18688 6392 21079 34556
8007 34556 28053 7399 -4739 -2349 4602 -341 -7500 -14230 -24483 -19589 -11599 -7503 -6625 3436
7993 3436 2014 -3820 15478 30260 33256 25706 22147 36434 46836 53109 45264 30308 17843
7980 17843 21148 27350 25070 21360 8377 -4591 -7005 -9210 -15006 -6156 -3801 -6375 -5786 -11198
7966 -11198 -2933 16786 25614 21686 12293 5892 -297 -14465 -4950 4560 -7440 -22336 -7868
7953 -7868 9067 13910 22091 24618 20176 17585 16701 27832 26389 11402 18135 23199 21291 40577
7939 40577 33093 17024 17737 16344 15221 13012 8907 16450 23814 21551 19912 26137 32635 41138 17556
7924 17556 -3958 -24598 -4279 12355 10295 14648 16980 14784 20006 33204 38325 46144 29623
7911 29623 8338 7334 1355 2670 11044 21518 24136 10390 677 7796 27453 44336 43613 26536
7897 26536 10375 23114 38940 28184 15764 3003 14531 19605 25081 24177 7784 -2252 5765
7884 5765 13179 -4507 -7508 -3229 -4453 3182 -852 -2782 -8725 -8901 11019 20833 9950 -4798
7870 -4798 5239 19774 26702 21343 21807 11697 3992 1587 2088 4230 5301 12480 15045 26200
7856 26200 33270 28020 20445 5708 -2127 1067 10143 14291 14173 12457 10140 7983 7630 -10236 -11378
7841 -11378 -9847 -13501 -7107 -1648 2527 11258 9482 21717 29464 29588 19094 -2781 -14338 -8129
7827 -8129 -1604 7315 14479 21829 14097 9935 8131 12048 7197 -903 8019 13044 23182 34991
7813 34991 27731 26134 19641 15677 12130 1845 19765 16812 5430 7855 10747 14060 11630 92
7799 92 609 -3645 2866 12507 10790 -2906 6374 15695 27346 13896 987 -9201 -13199 -9527
7785 -9527 -8890 -2509 1581 10716 18261 5354 15169 26610 10246 13714 5883 1554 1641 -4963 -10770
7770 -10770 -19277 -15864 -8263 3620 720 -13731 3153 15565 21781 24347 17307 24038 28009 29417
7756 29417 27993 7009 7051 8636 8490 11414 10818 5562 -3212 -10832 -21119 -22946 -12440 -14217 -30030
7741 -30030 -18496 -12155 -13547 -11497 -7142 -14300 -18575 -16512 -15593 -30299 -14342 -6346 -1336 -8324
7727 -8324 -13933 -24520 -22601 -16592 -11083 -9013 -1519 17256 14785 -2173 -17301 -28613 -15989
7714 -15989 -10975 -29411 -31610 -15884 -5641 -5229 -2571 340 -4923 -4759 -2236 4037 7312 8517
7700 8517 -3342 -25050 -24303 -20470 -25169 -12541 264 3102 6901 16477 3160 -7475 2707
7687 2707 -1224 -9666 -10935 -7486 -8613 -11597 -3997 -804 -3329 -1731 -3412 -1438 -3950 -12148 -9420
7672 -9420 -15256 -27243 -28871 -21128 -20463 -11334 -10394 -406 -1653 3620 -6689 -5595 -12767 -17020 -13528
7657 -13528 -28260 -24203 -14822 -9239 753 -10473 -16977 -24351 -25991 -33352 -29807 -30582 -17782 -23619
7643 -23619 -5410 -8558 -14117 -11235 -21875 -12693 1340 5218 3674 21725 31698 27466 23900 15033
7629 15033 8798 4078 -833 -13115 -21011 -18297 -11587 -4535 -9742 -15081 -29432 -33092 -33398 -24531
7615 -24531 -12099 -10939 -6815 2773 -2807 -5835 -3017 460 -2942 -11859 -5045 1548 1745 14698
7601 14698 7978 4968 4500 -4888 -12372 -6741 -4715 -5999 -12836 -22988 -16938 -3547 5537 -849
7587 -849 -3750 -6512 -8444 -1760 -8418 -20530 -23925 -22126 -18932 -8783 -9998 -3244 -2162 9682
7573 9682 16526 19028 15058 11652 -840 -9895 -7081 -17822 -27323 -20031 -9334 -8189 -3325 -15328
7559 -15328 -13925 -19145 -23826 -5513 4317 48 -11979 -8848 -4587 -17548 -26640 -23337 -6402 -15489
7545 -15489 -24102 -35846 -23053 -8832 2344 6067 8821 9389 3334 5104 8641 3012 -11630 -11362
7531 -11362 -5713 532 -6537 -10413 -21765 -28235 -8825 -6630 -8763 6911 4141 -7402 -5998 4381
7517 4381 -3077 -8458 1403 -101 4548 8823 -7521 -18637 -15999 -9187 -11641 -6961 6567 479
7503 479 -10186 -9837 -19223 -18817 -29110 -25624 -22018 -17102 -8291 2788 1464 -14226 -14770 -16911 -17729
7488 -17729 -9129 -5935 -6529 -7291 -4528 -14289 -17716 -17584 -25961 -21418 -24325 -17293 5227 -4235 -17606
7473 -17606 -27753 -35870 -39011 -25585 -6228 -11551 -20464 -18003 -10416 -5854 -5356 -16781 -15052 -11048
7459 -11048 3029 8453 3463 -11555 -12294 -19298 -4766 -7613 -22882 -23526 -10291 -9533 -13487 -9134
7445 -9134 5979 15713 27281 17574 1324 -8613 -15049 -11072 -26907 -35627 -30350 -40499 -47356 -36252
7431 -36252 -24402 -19120 -22797 -20755 -22153 -16013 -2978 1569 2510 5472 -2975 -17015 -34671 -35559
7417 -35559 -41842 -39759 -29487 -13965 -22546 -33898 -16863 -8197 -4775 3524 4857 -2840 -12784 -4282
7403 -4282 -705 1685 9619 9762 6693 -2637 -14625 -11721 -4085 -5144 -7940 5933 8926 -1894
7389 -1894 -2701 5561 -3582 -7185 -3710 924 8820 10533 -9456 -35272 -24773 -18386 -15139 -17010
7375 -17010 -11793 -5089 -11495 -18784 -18980 -10684 -8734 -21109 -37907 -18226 4212 17323 12437 -1817
7361 -1817 -12394 -20093 -10777 -8238 1258 -3034 6065 10939 304 -3867 -10918 -19302 -36632 -45331
7347 -45331 -30940 -21662 -10399 -14689 -16961 -15060 -16191 -24179 -14359 1490 21078 9796 -1571
7334 -1571 -4650 -11565 -22127 -11867 -7081 -6812 -2925 15688 25519 13721 4356 -5644 -11048 -18857
7320 -18857 -15534 -81 -4622 -3387 -8309 -7153 -8320 -3330 -3821 -5724 431 473 -4785 -20097 -16853
7305 -16853 -376 -174 2413 828 -3594 -3505 -8641 -10689 -19483 -26609 -26677 -16517 -12318 -4306 4317
7290 4317 -4307 -10161 -8120 -2624 -14170 -28271 -21916 -9567 -561 -2295 -7988 -27033 -32198 -12093
7276 -12093 6112 -897 231 2843 1283 -14288 -13053 -1373 -3059 -12804 -19426 -10281 -1525 -912
7262 -912 908 3694 3376 1710 -6607 -17107 -17245 -13841 -3666 -5621 -18990 -9984 10804 11036 10258
7247 10258 4125 7621 -9488 -28557 -26697 -9757 -4475 -10109 -6155 -15422 -23371 -25045 -25698 -28323
7233 -28323 -32877 -25380 -22405 -33057 -27772 -26790 -35521 -28932 -17792 -10632 4413 7285 13698 25519
7219 25519 19794 7334 5593 7280 -1822 -17651 -24216 -14685 -14701 -13872 -24198 -27410 -25693 -7560
7205 -7560 8563 1997 -14459 -17232 -4143 8981 9448 -4539 -14931 -25861 -31592 -23811 -15905
7192 -15905 -11147 -4752 11128 17414 10075 11173 4511 -1682 -2927 -7898 -15754 -5141 20606 24787
7178 24787 11640 -14209 -26868 -28150 -21796 -21113 -19707 -9720 -14031 -13781 -22662 -31151 -23731 -11495
7164 -11495 -5454 1770 -11359 -11068 179 3879 339 -2008 -179 -2889 -7044 -10452 -16095 -1351
7150 -1351 -3980 -13170 -980 -7587 -23420 -33436 -22819 -20582 -17235 -17024 -27593 -26310 -17658 -8324
7136 -8324 -12244 -13233 -18946 -10393 -14015 -28355 -42376 -36717 -31159 -24395 -13364 -1334 -4170 -19010
7122 -19010 -18468 -10825 -4093 -3120 10618 7785 7642 11994 7761 2589 -9998 2275 5086 -2316 -4183
7107 -4183 -13550 -15861 -13137 -17737 -12732 -9712 -5526 -6337 -186 6497 436 6822 8550 5092 15669
7092 15669 23560 20136 26529 33459 28972 28452 12133 15716 23130 10414 -3423 -16298 -17592 -10789
7078 -10789 -6459 -2859 13341 16334 5910 -9885 -17986 -32766 -29809 -20315 -12950 -4436 2800 6277
7064 6277 -3035 -17758 -30029 -19108 -6897 -2869 -10627 -18316 -22548 -11781 -5867 -14395 -17857 -3663
7050 -3663 -877 -2003 7085 16407 15089 12492 10895 -5711 -12773 -13674 5050 14091 8003 -3812
7036 -3812 -11557 -12043 360 9626 -3984 995 2229 10381 4329 518 -15535 -25524 -28438 -28897 -23142
7021 -23142 -14382 -890 -6407 -17317 -12444 -509 -6258 -10620 -11482 -1496 12582 13726 14282 34764
7007 34764 37831 19950 6038 -5869 -16827 -9890 -2306 742 1697 -6764 -8201 -7738 -9744 -10470
6993 -10470 -18728 -3728 1752 -2655 8586 8806 1562 -12646 -15254 -14009 1288 -8240 -16379 -17978
6979 -17978 -14164 -6280 -1542 -12785 -12877 6232 3182 -6205 -1915 -1034 4891 11723 -3794 -8611 -10674
6964 -10674 3113 1779 4811 4745 8561 -2611 -1303 8758 374 -10573 -15808 -15589 -20894 -21533 -23987
6949 -23987 -23029 -11159 -11444 -6850 -6771 -11666 -14953 -4650 -7619 -21694 -26524 -28458 -13969 -6737 -4579
6934 -4579 -16817 -23100 -22206 -14051 -8615 -18840 -15643 -10561 -13086 -15137 -3198 -912 4183 9601
6920 9601 3355 7260 2878 825 -9700 -5100 -6712 -16010 -14900 -9322 -4963 5744 8679 4977
6906 4977 6725 9160 8821 -5062 -7329 -7545 -9 -6756 -13810 -16386 -9763 -9834 -13794 -10455 -20057 -14422
6890 -14422 -6116 -10558 -6959 9927 13245 11809 8541 12939 12521 6776 -1792 -6905 -7438 5114 6627
6875 6627 969 -12205 -18280 -7685 -4879 1323 -11308 -8793 -4557 338 6568 15501 17733 18602
6861 18602 24638 23416 11807 -6405 -3269 -6997 -4282 -15258 -15931 -11604 -12747 1597 2547 5049
6847 5049 855 -16531 -34112 -26149 -26324 -30617 -23252 -14940 -10588 -14961 -7437 521 2596 1545 10696
6832 10696 17874 3679 552 5871 4360 4355 507 -2808 2565 575 -9843 -4740 -13789 -19783 -17306
6817 -17306 -10703 7957 10010 -8452 -19016 -20880 -25333 -19922 -3893 5473 5781 10781 7368 -5829
6803 -5829 -15335 -19775 -19147 -13643 -9141 -9490 -5019 -21336 -10079 10747 18062 1718 -3159 -5387
6789 -5387 -10462 -8024 -21535 -38587 -22270 -8752 -3802 848 -7952 -15813 -17046 -8549 -11121 -4428
6775 -4428 3753 14411 11809 7753 -1157 -4944 1682 1923 -1223 -10707 -26998 -26278 -14310 11562
6761 11562 4052 -18380 -33285 -31103 -30945 -19498 -2775 6632 5263 10470 5768 1467 2610 -3508
6747 -3508 5044 12326 5417 -6617 -11900 -7539 629 9956 19190 11351 -3105 -14092 -14585 -16755
6733 -16755 -11452 -15261 -10394 -1981 2195 242 650 10442 17231 6531 20417 10797 3512 -137
6719 -137 -2731 -2652 -5943 -5725 -12207 -7332 -3768 5204 3876 9312 7601 7734 7616 5210 -7946 -15969
6703 -15969 -12375 -6669 -9986 -19220 -16805 -19596 -33202 -43617 -43521 -38506 -21216 -16109 -25921 -15000
6689 -15000 2854 7894 10998 9228 10629 8694 -4679 -11037 -8597 -285 6490 2999 -6389 -897
6675 -897 2715 -3269 -3392 -9187 -15671 -10775 -8734 -11374 -10609 -12754 -6893 -3060 -1229 -2704 8693
6660 8693 22492 29336 27786 18760 12395 4422 -2889 -6118 -1781 7124 14400 14177 9095 1813 6468
6645 6468 6269 19392 26062 29082 25392 8623 -985 -2788 15942 17748 8622 2940 11059 4994
6631 4994 -741 -9098 -18349 -11260 4751 17449 15939 7377 -7675 -12273 -14304 -1906 13535 18148
6617 18148 14178 8254 5447 5342 3071 3736 -470 -19934 -24928 -30130 -29751 -12855 -12366 -14964 -11443
6602 -11443 -13210 -17922 -16326 -10838 1108 4131 -487 -2641 -3767 -8152 -13825 -13654 -21736 -5671
6588 -5671 -8032 -2376 -2419 -9897 -2356 13423 13082 8209 17603 3568 1065 -2064 -4456 -5603 -10358
6573 -10358 -1949 12693 11250 10040 22873 5342 -10581 -9485 -13481 -5915 1363 3120 3984 -2434
6559 -2434 2079 -10160 -28688 -36065 -24220 -8110 -1154 -12476 -10478 -1799 -4910 -16756 -18488
6546 -18488 -20639 -17941 145 7216 2975 12769 7681 -5430 -8347 -193 -11083 -20518 -16949 -9017
6532 -9017 2931 961 -690 -10226 -8074 -5358 -463 -12842 -5664 2348 7035 -11207 -18518 -12919
6518 -12919 -20655 -15640 2166 20399 20892 2270 6142 14336 1373 552 7817 7347 8903 7052
6504 7052 6423 -1138 -14640 -22720 -22411 -29509 -15150 -18528 -25585 -19742 -25117 -30319 -13392 -1394
6490 -1394 -8646 -23107 -11082 -1366 -4400 -1341 -2668 -9821 -14870 -17848 -23075 -22303 -6792 8475
6476 8475 15010 7646 15504 26400 16829 4978 8847 9088 6143 -987 8378 -3764 -15242 -17256
6462 -17256 -25484 -29703 -24979 -19914 -4079 10012 -7143 -4143 -8089 -14629 -12562 -15249 -21349 -17011
6448 -17011 -16541 -19652 -24100 -22099 -16813 -10103 -9828 -11636 -1342 9532 12643 3068 5261 9851 21388
6433 21388 9459 -743 -9568 -16627 -15656 -17105 -3584 -9954 -14452 -17034 -3629 -7147 -13665 -26420
6419 -26420 -27068 -29998 -38121 -57169 -45502 -22243 -12483 -1914 1624 4595 2664 -9119 -3709 5055
6405 5055 1297 5546 406 12514 22309 16058 -2496 -5060 -2791 -13304 -25551 -18152 245 3650
6391 3650 6008 6462 11131 3426 -3823 1160 5667 8328 818 36 -5800 -13569 2880 9905 2140
6376 2140 10633 852 10146 4865 -11370 -9646 -10270 -12218 -15595 3637 14549 9759 9343 8030 -3611
6361 -3611 -7372 1608 10338 21520 19276 13276 14961 9664 -7050 -15976 1854 30361 32070 22622
6347 22622 11959 -345 -7222 2287 6444 9268 7498 5117 157 -13964 -11765 -11138 -12661 -13649
6333 -13649 -7396 -12554 -20448 -7566 -2650 -4411 -11659 -14401 -15642 -3867 4349 10496 14237 8531
6319 8531 21500 24647 22435 13048 -5182 -8787 -18334 -19400 -15498 -8692 5953 -9036 -14379 -17409
6305 -17409 -13600 -10798 -1093 6513 8765 -5782 -9658 -24233 -19966 -7862 -6292 -2549 9639 2001
6291 2001 -3175 9478 22399 2271 -12985 -2298 -1432 -3740 873 3368 -838 -12754 -15370 -12863
6277 -12863 -6366 -872 108 7759 378 -6028 -4952 -11563 -25937 -35391 -19256 -1633 2591 -2799
6263 -2799 6243 19101 1063 -5271 -11390 -8655 -3635 10618 -2331 -16463 -10730 -7710 -8780 -20839
6249 -20839 -7228 -1656 -13352 -6043 11744 15157 13018 4863 -6495 -16181 -20811 -23582 -10039
6236 -10039 -1439 -7976 -14054 -7561 1141 17189 26226 17933 6263 -9905 -20649 -19631 -23619 -22377
6222 -22377 -22499 -31718 -23661 -8836 -11637 -5098 -11297 -18467 -13763 2709 2099 -6765 -4541 -4981 -4629
6207 -4629 -7880 2712 5482 1769 -9363 -20956 -15714 -29220 -30231 -19234 -7801 -6626 -17757
6194 -17757 -9416 8995 17952 106 -13718 -17870 -20893 -25067 -11111 -9229 -17241 -17612 -7203 -2069
6180 -2069 -13468 -14627 10926 15859 16944 25953 21527 14717 1786 -3497 3200 2235 -2410 -19097
6166 -19097 -14783 -4726 -9578 -12867 -11561 -17965 -5847 2566 -16222 -23239 -21749 -8218 -4908 -11153
6152 -11153 -9530 -13921 -9562 6455 6044 9838 4160 -8627 -18825 -18303 -4844 5499 15657 20521
6138 20521 12515 -2501 -1581 12588 14928 3254 -13094 -30723 -32883 -31920 -15678 -15144 -17176 -27963
6124 -27963 -27605 -25449 -10801 -243 4860 -9232 -8953 -7348 943 -11701 -31024 -12925 627
6111 627 -5539 -445 -8152 -17368 -11920 -3552 -9813 -12015 -1027 -2759 3847 6000 -2768 -8641 -12119
6096 -12119 7843 16105 -7288 -13656 -16513 -19165 -21489 -18574 -11959 456 3022 -4230 -5408 1093
6082 1093 5456 -643 5181 5812 -12034 -5406 -1394 -8513 -18788 -21209 -5661 -1459 -6983 -23167
6068 -23167 -33587 -29157 -13161 -5219 -9834 -5479 -5535 -20952 -22939 -22349 -18386 -13275 -5691 -10602 -17067
6053 -17067 -17865 -2397 -8158 -9943 -12500 -12365 -11896 -8816 -8686 -4441 -1087 -11507 -15827 -9428 -11553
6038 -11553 4862 19545 26077 12446 -8227 -7152 -3865 3144 -2080 -3427 16268 23406 11980
6025 11980 -17475 -21381 -15596 1727 4302 -5325 -4401 -11839 -9379 -25764 -20586 -25530 -18555 -26407
6011 -26407 -21854 -14826 -11834 1088 13800 9535 -10243 -28255 -31958 -13274 3624 -5575 -12950
5998 -12950 -21706 -11140 764 2319 -3952 -8232 -4381 4165 7699 11218 26881 12006 -8814
5985 -8814 -6100 7751 -358 -11764 -16653 -16717 -23181 -25561 -13047 -10355 -13166 -7562 3277 -8356
5971 -8356 -5132 3898 4106 -8736 -12444 -3949 5748 10838 5645 6287 220 -4461 -5419 -2419 -15794
5956 -15794 -19830 -18394 -19089 -8754 4938 13400 26349 26015 18020 5195 -8796 -12962 -14772 -16068
5942 -16068 -3139 648 6393 7627 -4802 -14853 -23473 -15295 -18860 -16017 -4437 -5752 -932 7570
5928 7570 16689 16291 -1235 -17881 -21039 -24265 -20473 5376 -76 -7380 -8700 -3847 646 11113
5914 11113 10933 -321 -5784 1922 -2250 -5691 835 450 589 -3804 -683 4687 6601 16404 13087
5899 13087 -4985 -6767 -2533 -1611 4295 411 -4645 -1354 2991 902 -6394 -3723 -10588 -15779 9203
5884 9203 14015 -203 -4344 -169 7304 5247 3427 -5834 -7634 -3990 -2076 -14395 -12067 -2153
5870 -2153 12810 12534 8668 8270 10960 12627 -1909 -14173 -14935 -13464 -16229 -12548 -6017 -4071 7502
5855 7502 14446 6680 13956 10479 6553 10362 5297 -3238 -274 1402 6176 12784 3584 1812 -1825
5840 -1825 -7364 -4658 15390 34353 35841 14302 3803 7296 18772 23934 15112 17202 -2553
5827 -2553 -13229 -20321 -22574 -16042 -4238 5943 10124 22808 15422 16589 9703 12133 15368 21019
5813 21019 36231 28681 14838 3067 4019 -188 -1435 -3277 -14904 -24967 -29272 -8797 -13294
5800 -13294 -20395 -17063 -1154 5521 10234 16706 21235 6624 1213 -7177 -7885 190 2388 8846
5786 8846 8446 17388 14543 -1036 -11310 -3205 168 3034 12548 17667 25880 20559 11830 8394 13643
5771 13643 7629 2625 -872 -8509 -6781 -4230 -8138 -8499 4408 8845 -228 -541 -5606 3369 6249
5756 6249 -8715 -11980 -18062 -14375 -16880 -3768 4622 2773 6691 8237 -4695 -5016 1300 -1072
5742 -1072 487 6432 2500 -1414 6619 9169 -618 -11162 -9533 -8243 -9565 -16131 -14246 2060
5728 2060 -6856 -3421 1802 942 -2297 -3296 11022 4995 -9110 -2055 9432 4092 -4282 -11403 -21439
5713 -21439 -19082 -18226 -11129 -725 -850 -9141 -5409 -5951 -4885 -13921 -23253 -23460 -17733 -250 439
5698 439 6105 6066 2296 -4475 5144 12687 13348 14092 5407 -416 3266 7256 17385 12546 3449 18358
5682 18358 12695 5863 12432 31026 37422 36597 24893 948 -5424 -1583 4449 13284 15083 7287
5668 7287 -3509 -12828 -20049 -17439 -12279 5192 15823 10083 6850 -15876 -21241 -18989 -23357 -23724
5654 -23724 -21669 -14853 -4484 -4226 -4466 6989 20141 29356 17591 6567 2575 -3142 -7475 -4098
5640 -4098 2568 5679 10597 -984 -11000 -5510 -5535 -11897 -12232 -16101 -25101 -20487 -8294 11987 15427
5625 15427 13009 9227 18995 16630 24161 9271 -1538 2457 -2270 5413 -4149 -8731 -959 563
5611 563 8219 13058 1378 -10926 -1382 4697 13131 24640 18718 10437 -9333 -15387 -16337 -7291
5597 -7291 4424 29796 14141 -8318 2106 3916 -3640 -1380 6600 15121 17228 1246 -19394
5584 -19394 -31815 -32876 -27473 -10985 -10202 -23534 -26422 -15035 -16631 -14673 -3191 5042 11213 1411
5570 1411 -15130 -6634 -1826 -2532 2886 -2891 -1972 17266 16326 16935 18143 12240 1831 1602 17886
5555 17886 25769 5323 -7342 1360 -12235 -23902 -28022 -15878 -10359 -13188 -15617 -20936 -11565
5542 -11565 -9410 -15161 -18321 -14451 -2743 -284 9079 9983 -10186 -23059 -21675 -13229 -9192 -8463
5528 -8463 -2089 11100 13624 10981 4504 11860 20185 -3192 -12964 -18385 -14632 -12449 -9800 -1332
5514 -1332 -5710 -2839 -657 -5145 -12353 2649 7827 7795 8128 1955 3588 7145 19135 23616 18852
5499 18852 10642 14208 17251 14384 -5737 -23398 -15952 -22713 -16200 -12754 -14070 -9935 -9863 -5255 -9321
5484 -9321 -11054 -19216 -11637 -15903 -19926 -2647 20139 26240 18919 9123 2882 -4926 -1824 11686
5470 11686 7078 14318 -409 -12350 -7461 -4087 10580 15129 10255 6583 6839 -706 4200 8767
5456 8767 7511 151 -10779 -12857 -22000 -40786 -34627 -21091 -12446 -9229 -15228 -17660 104 19483
5442 19483 16112 6888 12394 6201 18612 23088 26811 9967 18427 16857 -1066 2559 2165 -3512
5428 -3512 -14986 -17354 -9004 -6442 343 -6668 -14711 -7951 -4124 -11137 -6031 -613 -2776 5101 6998
5413 6998 11966 17896 16232 24355 32266 25800 17705 2561 -10859 -10423 -12960 -5676 -6556 -13981 -19857
5398 -19857 -20828 -23634 -18508 2050 -927 -6669 -2611 16783 22746 19975 21194 13022 5331 14426
5384 14426 11679 -2840 -12628 -11880 7213 5587 4819 5746 12956 19654 27625 18830 17039 14217 10785
5369 10785 -3073 -23700 -30476 -20301 -13336 -5516 -11396 -20416 -4548 -1845 -9825 -16556 -9380 -7045
5355 -7045 -18481 -23742 -26974 -17880 -5062 1177 -8986 -3858 2848 -556 6188 3101 -5280 -11256
5341 -11256 -12588 -18683 -21334 -27493 -26688 -19519 -2281 -6774 -7940 3166 -4040 3513 13514 17597
5327 17597 17956 9566 9827 8837 5830 6273 3451 -18429 -23183 -6010 -1696 -23356 -30977 -23530 -12086
5312 -12086 -8451 -11823 -9393 -21253 -37113 -27102 -3902 7213 6939 -5530 -13019 -18755 -17998 -19007
5298 -19007 -17100 -4402 -7397 -17461 -14342 -10896 2327 9492 17107 15132 -819 -6495 -348 8081
5284 8081 6562 2963 8448 -6171 -6718 -3612 -1014 637 1513 10414 30870 28241 14431 9005 -11360
5269 -11360 -824 10799 4237 -9754 -21941 -21391 -13445 3410 20176 23170 12634 2894 -7502
5256 -7502 -6962 -2657 -3523 -3924 -5565 -2639 -3802 3627 19393 8977 3337 1302 2752 4651 -31
5241 -31 -1805 -11460 -19567 -22131 -21117 -25029 -23658 -10038 -2320 8515 10534 -21301 -32338 -25482
5227 -25482 -1443 6495 12793 12615 11815 9430 21219 18382 13712 9376 3143 -1163 2364 12738
5213 12738 12403 14392 2075 -1102 -5481 -13923 -10594 4865 7229 5674 -3271 -16119 -12960 -10152
5199 -10152 -3605 -4114 -14432 -15337 -9604 10483 14764 10338 4532 -14852 -14042 -7975 503 9057 8274
5184 8274 17630 18201 8376 7189 6576 22615 19740 9731 -7 2473 8133 5918 2015 1665 9093
5169 9093 8930 -2962 -5164 4688 13778 10385 4106 8508 2631 2866 13014 16019 -1834 -7954 -7837
5154 -7837 -17909 -14820 -5407 5766 10038 -1897 8632 6318 1075 995 -1520 -7445 -9324 -2333
5140 -2333 7521 638 -12736 -10078 -1858 -7415 -19408 -1029 28596 29344 13552 2930 5022 4895
5126 4895 357 4971 2080 -9689 -18928 -23493 -20889 -22804 -21430 -13147 -10444 -7483 -297 -4391 -14450
5111 -14450 -12237 -4534 -12485 -8871 -15610 -17157 -3979 8222 1467 -3755 -14625 -23899 -24802 -16583
5097 -16583 -3943 -4066 -10117 -6164 1534 4271 -7893 -238 1565 -6794 -7783 -4603 575 -9807
5083 -9807 -17961 -15215 -12509 -11538 -15872 -16379 -17086 2790 26475 8953 -6349 9341 9907 1811 -6006
5068 -6006 -3116 -9778 -7954 -3413 4906 15121 21732 14914 -135 -33516 -36727 -27449 -10141 -4135
5054 -4135 -4146 -2616 -1101 -6598 -17924 -19537 -19431 -17361 523 447 -3904 7938 11156 1430 7414
5039 7414 -5752 -4750 -35 429 9177 22480 13775 -1744 -15690 -15786 -12235 1198 2365 8473
5025 8473 4237 3840 -997 -1203 -3911 1427 -482 -6572 1031 14206 15767 8147 -11421 -20625 -13092
5010 -13092 -10040 -4510 -17445 -19432 -12052 -13248 -11061 -18239 -3600 -4267 -24946 -35540 -31952 -17706
4996 -17706 -18718 -21683 -10981 -7669 -2092 -2513 -5199 -2864 -2624 3767 8450 4924 -3289 -8110 -8703
4981 -8703 -8182 6191 4360 -8775 -13937 -17989 -13751 13146 35653 26488 6815 4369 7897 7882
4967 7882 1661 -10476 -14667 4465 9694 -7457 -19371 -25285 -6843 16309 10526 3791 831
4954 831 714 8198 13762 11065 10020 5098 5389 12286 14517 7866 3244 2020 -8061 -19823 -14769
4939 -14769 6477 4511 -8765 -7154 5455 5894 -7706 -16301 -14592 -22582 -32614 -29108 -17674
4926 -17674 861 14342 10791 3071 -7640 -19989 -23517 -12660 287 1123 -9568 -14941 -16839
4913 -16839 -7395 5997 -3094 -4769 -3080 -2722 7963 2099 -6346 -8569 3464 14815 13056 2410
4899 2410 -13464 -19212 -17830 -13564 -1628 1552 -3340 -3159 -4859 -3616 -13692 -24969 -24219 -21484
4885 -21484 -5149 3714 13453 20635 22532 24898 13657 7879 8445 15129 16901 7585 7854 17008 12722
4870 12722 17457 12265 -464 -9762 -4220 7484 15548 4769 -2699 -7563 -5102 7041 6364 1705
4856 1705 7017 2852 -3437 -16765 -23824 -34227 -19468 -12088 -23526 -25389 -27325 -19103 -10588 -3574
4842 -3574 -10776 -11648 -11807 -3382 5138 1576 -4806 3436 11794 4693 -854 623 9771 -1623 -19230
4827 -19230 -8882 5979 1770 10490 18549 13640 29837 20601 2066 -2233 -10954 1786 6275
4814 6275 2539 5957 -367 -5688 -7186 -14038 -14268 -21367 -10361 1601 5372 -1432 -5845 -15670 -22554
4799 -22554 -13535 -14874 -9602 -13723 -4936 -1170 7284 11418 12307 1042 -5988 -3129 -5110 -16901
4785 -16901 -14026 -1405 -4039 -9312 -5123 -8951 -21951 -27952 -25480 -27850 -28215 -20783 -13441 -4414
4771 -4414 2476 5567 2444 4397 6535 5952 6602 11239 3511 -11511 -17612 -16802 -14763 -9259 -6812
4756 -6812 565 9391 17544 22407 4761 -5173 -13895 -27618 -32582 -34334 -32950 -43487 -32863 -18142
4742 -18142 -1427 4343 12614 16818 7693 1372 -747 9475 19689 10668 -6082 -19431 -1586
4729 -1586 19118 19391 14063 1569 -525 5563 8339 6548 10516 2194 1816 4337 11543 15420 13456
4714 13456 26753 15348 -9078 -7540 -5047 -11309 -14249 -14821 -9680 -4837 -10605 -12564 -5041 -6164
4700 -6164 -18137 -25687 -22040 -26240 -20746 -10359 -12495 -4735 -1060 7144 10661 10654 10583 2476 -12416
4685 -12416 -2005 -4437 -6523 -11922 -18980 -21952 -7086 12239 14071 -2620 -13534 2508 6547
4672 6547 18025 32444 21612 6613 8955 5695 -4944 -11344 -16971 -18657 -4860 -10405 -17395
4659 -17395 -14957 2425 11525 10300 252 -3453 -15418 -15774 -5860 -2160 -9008 -27328 -43755 -30468
4645 -30468 -7292 -3533 -10947 -5431 -1245 -3545 13593 15129 3817 2032 994 3089 4092 14332
4631 14332 8231 -3208 -15186 1520 10231 12890 7383 8006 4280 -18106 -14636 -6268 -2143 -14277
4617 -14277 -7162 -1787 -4968 -6909 -1470 9578 10680 10737 16102 23892 19995 10153 7196 2739 1240
4602 1240 8172 15428 10501 5789 676 2420 9738 1037 -7966 -900 756 -2063 -12441 -14364 175
4587 175 -5404 2204 -11326 -23070 -25341 -11255 -12460 -13367 657 13921 11438 2958 -1650 -2662
4573 -2662 -2444 -2309 -4375 -12350 -15364 -15921 -12052 -1666 -2844 -10460 -8850 -1936 5414 5562 -3102 -3325
4557 -3325 -2075 -11401 86 -722 -9339 -4230 -1980 3686 -11799 -14024 -4266 2724 -2206 -13647
4543 -13647 -19250 -17009 -8483 -4595 -18235 -22062 -9820 -7794 -218 -11116 -14466 -12961 1796 12529
4529 12529 12301 15279 6203 -8969 -5301 2355 3250 5503 1296 -3198 -837 -5804 -18104 -34244
4515 -34244 -30048 -29575 -21742 -15496 -13908 -12213 -6094 -4228 13558 6693 2396 12131 7377 9771 8547
4500 8547 13157 18667 15439 6609 4172 3431 5000 1591 17 -3385 -6556 -10192 -12275 -5811 -5769 994
4484 994 15587 1662 -5966 -2174 -438 -2249 -6181 2399 10228 8671 9304 9582 5710 159 -644
4469 -644 -14696 -21243 -24267 -21149 -6731 10290 11909 -2086 -2793 -864 10995 5111 -17822 -9483
4455 -9483 -4156 -11145 -7959 -5862 -17566 -18513 -10927 -3482 2600 885 1654 -6975 -15498 -15820 -3897
4440 -3897 9184 16490 2754 -5079 4852 11132 15344 8563 22473 18728 492 -6539 294 -7887
4426 -7887 -10585 -17436 -8609 -7305 -5589 -5261 566 5088 -2007 140 -9405 -23883 -11638 1903
4412 1903 -7145 -8174 -11596 -12431 -3787 4314 8464 -13024 -25233 -26410 -17924 -14989 -12950 -4480 1652
4397 1652 18919 18181 -3382 -7599 -2429 6819 3448 8166 13337 24536 14503 11793 4070 3689
4383 3689 13103 5207 -15154 -16750 -10344 -5626 -182 -3064 773 -6922 -13022 -9943 -9078 -2857 -2925
4368 -2925 -5622 -4107 8811 12652 -1804 -8812 -16356 -11806 -4321 -5003 696 -8993 -8926 6888 11785
4353 11785 9192 14371 11017 -12914 -17427 -262 4033 9321 7915 20970 15983 20827 15589 13166
4339 13166 14776 12080 7213 -4693 -19880 -18935 -19255 -14864 -14497 -21057 -13212 -11315 -14469 -16811 -14676
4324 -14676 3384 -203 -11181 -6957 6616 1973 -14210 -17591 -12864 -13033 -1329 18403 34567
4311 34567 30412 26441 17012 16738 20268 9299 1572 -4692 -8465 -5051 573 -8290 -3645 -1891 -3214
4296 -3214 -976 -5198 -7705 -1556 2497 9060 6345 -1011 -2187 1986 -4032 -12444 -8352 -1550 -267
4281 -267 3643 18560 590 -1835 -4532 -14565 -2982 3189 -4126 2131 -2705 -7216 -717 -5410
4267 -5410 5790 6702 3703 17413 2567 -7429 -6565 -18246 -20905 -23678 -16687 -14058 -12800 11845
4253 11845 11798 -3710 -12939 -16777 -15598 -17758 -2672 3839 5836 11489 588 -8024 -2271 4314
4239 4314 1386 -8825 -7771 -17241 -13423 -14635 -11063 -2876 2771 12667 -1440 -3437 -2618 11820
4225 11820 11388 759 4366 12858 6156 9881 12652 8485 6560 -153 -16530 -24328 -35924 -38775
4211 -38775 -33883 -28815 -19645 -11619 -19560 -15108 -13854 -21590 -17827 -9290 -2587 -8066 1930 3373 -6417
4196 -6417 483 10364 1347 -6364 -3497 -4111 -6510 -3909 -373 4417 5433 6250 9690 8918 8285 3741
4180 3741 -713 -191 13397 6251 -8817 -11471 -3143 -3526 2673 12973 15084 3783 -5489 -9536
4166 -9536 -1356 14142 22084 12592 14618 4329 -4534 5521 2963 -5942 -9604 -12807 -14893 -20259
4152 -20259 -15562 -8301 1174 17193 21370 5342 -9863 -13913 -10186 -13932 -28926 -31526 -21788 -226
4138 -226 16212 23688 29144 17580 15152 10213 -6467 -22118 -12091 2007 1492 3933 -4736 -20290
4124 -20290 -10640 -5680 -17540 -16113 -9651 5748 16686 13855 7275 8717 17382 1085 -5927 636
4110 636 7630 12573 11210 11133 -8666 -27197 -19073 -16956 -17515 -12340 8462 22559 6480 -2215 -262
4095 -262 -8061 -5192 -11733 -31487 -17507 -3658 -2797 -10230 -2286 -3422 -9503 -13973 -13429 -2882 13362
4080 13362 15206 -10302 -20051 -902 -2725 -1790 -7970 -12265 -18632 -12270 -21460 -19820 -14007 -6199
4066 -6199 1202 7518 20229 20866 17865 12873 1392 -1508 -10094 -8295 -15489 -12169 -1796 4770
4052 4770 -6666 -9632 -2790 1770 -6887 -13105 -20697 -31698 -23402 -19943 -23452 -23386 -22734 -25978 -15791
4037 -15791 -13041 -17049 -16827 -9900 -10908 -12494 -13544 -14688 -8433 -1100 -3939 -10987 -17347 -21348 -9085
4022 -9085 1556 12380 15701 20294 19339 17926 17597 10701 25081 20104 12427 3235 -5607 -15327 -8969
4007 -8969 -4198 1368 -4958 -13958 -16115 -20960 -23903 -14036 -10108 -9091 -657 -2765 -1616 -4980 -1213
3992 -1213 -5384 -8720 2918 27389 19608 -4862 -16145 -11517 -6186 -2044 2134 -120 -2807 3814
3978 3814 -12517 -10966 7739 21425 8938 2084 7270 11595 7281 5676 11052 20165 24290 23790
3964 23790 -3599 -11442 -10208 -10619 -5673 -2886 1938 -3659 -9879 -16490 -9403 -13045 -12650 -3540 -7350
3949 -7350 2732 2758 -4942 -11244 -13834 -8164 -5887 -3519 -21160 -15998 -2197 -8325 -19552 -19042 -5222
3934 -5222 -156 -3803 -15668 -11395 -9432 -24767 -34150 -29535 -13135 -549 3658 -16370 -18039 -5265
3920 -5265 7699 642 -6700 -20855 -19540 -595 9255 5735 15388 8234 -1536 -6544 -14808 -17857
3906 -17857 -5417 4949 14871 10053 10707 8353 -12507 -12308 -12255 -12248 -7069 -1752 7355 13564 4276 512
3890 512 -3450 96 20722 24221 7370 -8558 -3119 11986 1571 -10077 -918 6395 6624 12865
3876 12865 9426 6960 10807 13558 3883 9544 22514 22365 12827 5364 4905 -1513 7399 16622 28657
3861 28657 29347 14372 -431 -20349 -4786 560 5722 15897 4836 -14 -7985 -9303 -5769
3848 -5769 4049 13513 9062 7490 -3662 -13686 -10807 -368 2897 -1179 -7273 -8111 -13155 -8911
3834 -8911 -8649 -6354 532 2890 4255 -1381 -2518 868 6465 -4729 -7326 -3655 -5590 2049 -2183
3819 -2183 6728 -2738 -6086 -10871 -16645 -19859 -16366 -26614 -31486 -24373 -19038 803 7524 26118
3805 26118 41894 20250 10416 5574 -8653 -10106 -13816 -24577 -35378 -32032 -22357 -14431 -14781 -20290
3791 -20290 -12955 -6436 7518 17390 24903 14597 546 -4342 -6715 -15945 -23625 -14497 -17849 -22617
3777 -22617 -28059 -21650 -14549 -7805 -8999 -3522 187 -1790 -5101 18034 13103 1907 8833 13601
3763 13601 10683 9068 -1414 4068 7865 270 2062 -5016 -6298 -4524 -9489 -7996 -2946 -7153
3749 -7153 -15277 -15607 -10364 -12263 2418 -5298 -19402 -14988 7646 15231 9918 5898 1495 -2136
3735 -2136 409 17360 22313 26223 32565 20597 3871 -11795 -10223 -20740 -17423 -461 -7522
3722 -7522 -14351 -6049 2999 7523 -7742 -22654 -18280 -30529 -29170 -22552 -9620 -553 -1181 -5073
3708 -5073 -2156 -5937 -21152 -14345 -2944 13205 16067 7395 18316 18047 4220 14518 14945 3892
3694 3892 156 10925 13301 8806 1332 -486 -14666 -19748 -19335 -17821 -464 2854 -13794 -18986
3680 -18986 -22431 -11709 -10950 -15 762 4463 11964 20075 17660 5456 4691 7319 23084 18802
3666 18802 15300 11205 6292 5965 -4195 6933 -1994 -7431 506 7359 5091 5103 4778 5122 195
3651 195 -11473 -15636 -2155 8172 4165 -12300 -2106 17093 11229 -6235 -2786 -7487 -16972
3638 -16972 -28800 -15193 -9121 -8221 5825 2345 -7967 -11703 -15319 -5896 3969 9060 1127 302
3624 302 9212 -10981 -19549 -22323 -21592 -22036 -10779 5006 6443 5292 12561 1949 -7985 -8814 5973
3609 5973 15261 9854 16624 4910 -9058 -10188 4292 17432 30824 29947 10876 5905 5179 12468
3595 12468 13057 21482 28454 29889 20683 6769 9242 -4902 -15687 -3889 -2745 -10159 -11673 -22188
3581 -22188 -18805 -3563 865 14411 12652 923 7496 3471 -6506 5233 29431 35669 26315
3568 26315 24959 11293 1421 8254 17701 26674 17553 16389 23394 8092 19708 29485 17317 2884
3554 2884 11330 32354 27918 17531 10233 7565 18448 23096 22239 11633 2471 586 -7502 -20225
3540 -20225 -9223 5199 7660 6202 -5056 -228 4264 6391 9758 20301 9279 -724 6883
3527 6883 814 -16210 -6704 -9357 -6233 -3571 -3726 -11317 -18542 -16753 -17096 -14596 -3595 11494 20357
3512 20357 13512 11585 12561 7419 -534 6402 25371 22384 4847 -1441 579 10968 23847 33992
3498 33992 37103 34405 38662 37135 28924 16892 9821 139 -8017 -19439 -16394 -10745 13620 16613
3484 16613 20950 5231 4721 3248 8743 21924 13731 17853 25285 27227 24211 21345 19592 16346
3470 16346 19375 30464 25727 17071 15611 8366 843 6479 7047 6818 763 -3778 -11907 -9555 -9416
3455 -9416 7272 17043 17777 17828 25573 12690 -1521 -6773 -6948 -6111 4181 10586 775 -3496 -2884
3440 -2884 3063 -9805 -2344 4340 1122 -1316 9531 19483 19509 26407 27454 14427 11596 -1823
3426 -1823 -1346 -210 -6575 -8733 -9195 -5252 -20957 -27781 -22030 -7065 -10529 -15632 -16402 -21432 -41619
3411 -41619 -52812 -47238 -34691 -17681 -7320 -468 326 -12459 -10006 -11932 -9233 -7190 1569 12016
3397 12016 15602 2856 2337 10088 11477 12351 21273 12940 15366 20076 16614 584 -7706 -11390 -3788
3382 -3788 3391 8992 20526 15462 -39 -7740 1762 9751 12835 6465 3316 10567 20659 21212
3368 21212 9077 16070 15897 7783 -7234 -8202 -9827 -12166 -7201 1168 1606 -8405 -5086 -5738 -27738
3353 -27738 -23607 -5119 -4163 -6641 -12934 -15306 -14777 -17948 -27079 -15724 99 -3986 -11795 -13839
3339 -13839 -562 -5012 -3652 -10885 -30297 -7406 9448 5043 -8331 -14698 -12338 -6128 3789
3326 3789 13150 10899 9712 7562 6622 8723 3960 -18749 -7870 12414 24694 6277 -14324 -14162
3312 -14162 -21466 -20577 -18688 -15022 -5667 2124 -2048 -4419 -13479 -7889 -5845 -2818 4731 16633 6372
3297 6372 -16810 -7923 -1481 -4181 3094 16965 20217 25826 32211 41902 37521 35614 12159 5281
3283 5281 4304 2760 8250 -212 4551 18983 8584 -11537 -8509 602 -2821 -10333 -16944 -22337
3269 -22337 -15146 -6716 -15474 -2824 408 10476 20393 6872 2006 3375 3743 18350 13998 1727
3255 1727 -8579 -24658 -22637 -21323 -15306 -16738 -13133 -19742 -2114 4341 9240 14960 1140 622
3241 622 10341 35375 22386 5551 7517 -6948 -1012 6481 1870 8340 12431 -9195 -18767 -3152
3227 -3152 4677 -1167 -2527 1454 -655 -2230 374 -1185 -6106 564 -364 -2842 2294 -6284 -2793
3212 -2793 4116 8383 2934 6351 16773 15403 4239 4424 3832 7354 9917 8881 -3386 -24184
3198 -24184 -12114 8432 11063 -3764 4282 17038 12176 14247 4501 9741 8653 1484 1854 3918
3184 3918 -9589 -15392 -25824 -20790 -11711 -14313 -458 14277 5437 -5350 -2128 1180 -5114 -4649
3170 -4649 10116 21983 6775 -10300 -8941 -2516 -871 14334 29329 26681 13274 13429 27638
3157 27638 27823 8683 4777 10864 7858 8503 6233 10787 26227 26367 22054 13168 8727 7059 13107
3142 13107 12365 7681 16940 20582 19016 23040 15336 10962 5940 -7834 -10399 -11138 -15497 -13262 -7459
3127 -7459 845 4227 2639 1563 -6343 -7336 9757 22562 18631 12587 5841 12055 11954 801 -7451
3112 -7451 -16182 -12206 -14444 -6136 1484 1679 5504 12436 7097 -1385 -13273 -559 7094 -1708 -1878
3097 -1878 18129 17121 14217 8215 8273 7520 10169 23167 30033 26086 10528 21549 30878 30803 20537
3082 20537 10629 13780 17222 -1055 -1732 -1643 -1182 -12325 -17368 -21638 -20544 -22290 -25667 -21482 -28732
3067 -28732 -28105 -11713 -3998 3870 6084 -4714 -7139 555 -5274 -5626 -6765 -14046 -6997 906 -2325
3052 -2325 133 6694 7633 5282 -8432 -8351 -1420 1256 -5832 -7124 -2385 -2333 -14394 -14942 -3513 -3930
3036 -3930 4128 8449 11389 10096 -11032 -314 4012 5871 9574 12571 20777 9828 3218 16462
3022 16462 21522 12738 -2231 -14635 -13670 -12011 -3791 -2683 -7645 -957 3848 1696 3116 6306
3008 6306 -3098 9329 27331 23878 20219 22423 17909 4364 -6586 -1339 -13690 -644 5845
2995 5845 -4 -6404 -1494 2817 9517 8051 -53 12646 10641 5775 5156 -13880 -8166 -17532 -28117
2980 -28117 -24139 -10066 -9109 3451 4066 9156 1047 749 6526 10722 16919 16749 10016 1777 11271
2965 11271 6941 8803 -901 -3546 -10820 -12017 -1375 -5989 5016 7407 10532 17119 6513 -10172
2951 -10172 -9064 -13443 -8875 -8832 1415 12849 4278 -5240 13072 24158 12547 1548 -3146 -15096
2937 -15096 -16499 -3082 11927 10339 3247 7585 -5395 -8470 1950 6105 12141 18452 21616 15142
2923 15142 19298 22695 27959 26350 18006 20100 13831 3184 -587 -6223 1439 -6753 -12440 -12492 -11555
2908 -11555 -17013 -14552 -8411 1433 20187 18233 13220 4168 -9595 -15705 -20964 -11689 -450 -3425
2894 -3425 2965 2639 6650 5314 -3868 -10220 -14399 -12349 -15408 -15086 -4137 -1086 327 8117 12737
2879 12737 10030 13346 11149 17684 19413 15080 19624 8672 -4901 -7710 -4013 -2385 -2090 7759
2865 7759 7270 662 1042 -5397 -22535 -15284 -5950 851 2528 9073 16342 2039 -5724 1274 -10189
2850 -10189 -9232 -4309 885 4080 -2166 -11695 -16235 -12260 -2232 -1288 10398 4432 7599 13576 27378
2835 27378 29088 19475 14094 12110 12778 23212 14181 2778 2847 -7656 -1908 -6405 -8014 -1259 609
2820 609 -2406 -6587 2944 7923 830 -318 4869 -3433 -13743 -19068 -8196 -9204 -6976 14340
2806 14340 14090 6806 10925 6422 13778 13368 2596 4299 5849 8195 19146 20124 12498 2291 7718
2791 7718 13661 23591 26781 26288 28194 26611 20649 18104 13205 16814 -2164 -5415 7698 10985 2081
2776 2081 -3587 -6625 -10165 -15626 141 14374 -4774 -10920 -14784 -21840 -22071 -8892 8102 7384
2762 7384 7688 12568 12596 7282 -3646 -18036 -22599 -15454 -11369 -19451 -8405 2153 2365 -15932 -14038
2747 -14038 1148 -122 -4899 3723 6910 -4601 10370 12792 -3161 8773 12992 -5838 -25165
2734 -25165 -18982 417 8292 3658 -1020 11713 15086 17634 7323 -1083 17735 26039 18381 12357
2720 12357 5945 10327 12601 21751 32120 30715 23425 19279 7591 4640 -1056 -3283 -8438 -9315
2706 -9315 -3721 -3184 -1658 2719 5074 3454 34 3774 -5701 -9035 -1694 18591 34570 21327
2692 21327 11077 8123 15060 9849 -13916 -20624 -8123 -567 -2670 -9610 -7410 -10723 -19933 -3309
2678 -3309 14481 16778 8415 -9232 -9228 -15084 1333 5131 9534 15442 1462 -1485 211 -282 9749
2663 9749 4864 -404 594 -6819 -19829 -21732 -16311 -3942 9867 11446 7497 6809 13140 26814
2649 26814 13934 9456 3937 12590 14039 16021 7469 11956 4569 -6721 -1518 14287 12094 21766
2635 21766 8358 -4469 -5660 -10904 -4175 5583 7114 15336 14230 3083 783 2794 -2948 -11753
2621 -11753 -13015 -11998 -1251 -6515 9501 18967 22257 17024 6401 -764 6693 -2619 -6370 2741
2607 2741 8142 13026 -9389 -6466 -5848 -2362 -1493 -1232 -3068 -220 3420 2349 11045 11610 -8582
2592 -8582 -10167 -11850 -10003 4881 5386 -10367 -1357 8465 -3709 -3926 -16278 -23394 -16402 -15966 -18416
2577 -18416 -10688 7684 10731 12274 4850 7547 17711 15513 3016 -3562 -12038 -11362 -7297 -5057
2563 -5057 -6064 -2241 360 4708 7836 13413 5633 -4056 -116 8817 18923 4210 -7668 -2708
2549 -2708 5525 -3347 -13084 -7227 -9479 -8596 1988 19284 24241 26671 35115 28050 12313 5353
2535 5353 7645 -5535 -9376 -287 7296 1790 1945 -5282 -6962 150 3297 5060 19314 31881
2521 31881 16819 576 12626 21829 24227 24142 34311 30650 25619 32637 14205 2003 -15108
2508 -15108 -9548 2810 6149 -11662 -16360 -7904 -5745 -10016 -3244 1789 -3764 -459 7771 7008
2494 7008 3124 -1377 -1250 -6539 -4771 20161 33414 27079 -5609 -3756 15265 23125 19343 8395
2480 8395 16585 16206 3020 -4800 -17154 -9105 376 6352 16513 17414 4261 -4279 -8726 -2133
2466 -2133 -10939 -8560 -10760 -1311 -9013 -6272 10017 5448 -4570 4461 3123 -1447 -9275 529
2452 529 -2906 -9461 -1196 -3413 -17689 -14636 1216 4330 5506 5152 -3625 -24548 -25034 -6165 3563
2437 3563 10824 8843 11683 28776 49415 41024 12228 6445 17827 15187 8022 7001 9652 30123
2423 30123 30314 26003 17747 11514 15909 12075 3422 -14937 -15741 -18004 -19646 -8277 -1071 906 8618
2408 8618 7483 14385 28853 21680 4830 -2279 -1703 5466 12615 10062 -2640 -6488 311 6649
2394 6649 -2064 -13122 9199 22987 11537 4843 -1454 -16252 -7605 1185 21770 25336 33853
2381 33853 19510 -577 -19484 -8135 -12598 -15647 -13719 2482 17047 8022 -6387 -17352 -16489
2368 -16489 -9452 -23594 -24717 -14631 -9874 -7197 -6676 -1542 -482 -4314 -3916 5667 12188 1496
2354 1496 11062 17077 11809 2912 -2212 -6670 -13997 -9501 10122 684 -710 -3598 -7962 -1901 -6333
2339 -6333 -9162 -23077 3511 16359 7436 -569 -13821 -30340 -34174 -28049 -21830 -13763 -8236 -3046
2325 -3046 -6940 -31457 -19762 264 -20 -11734 -14249 -9025 -15984 -18614 -12115 -25003 -26007 -4306
2311 -4306 -1671 -7055 -17242 -27954 -33874 -18481 5948 4799 -11674 -14837 5393 9594 2894
2298 2894 5367 1957 2071 5281 7882 24167 36185 33640 15226 11781 9681 9169 -5805 -10296
2284 -10296 -29707 -18756 7441 21038 19451 12083 8741 4086 6704 6892 14684 15940 14231 14935
2270 14935 6370 -1023 20521 39337 50085 32642 2921 -9998 -12661 -23253 -24764 -12890 -17491
2257 -17491 -14017 -13197 -15141 -16590 -31726 -42670 -34731 -37876 -34173 -25970 -11801 -4869 -3765 3131
2243 3131 4730 -8485 -28570 -20450 -4832 -2154 -4750 -4182 7920 -853 623 10373 2510 -3327
2229 -3327 8659 17641 17702 18009 14724 4810 10226 6759 6126 6654 9288 6428 -466 -3009 -1213 -12947
2213 -12947 -8885 -6967 -4146 3949 12690 5271 7161 4161 -2397 6704 16034 7478 -2648 -8461
2199 -8461 -23967 -28245 -25272 -32016 -24646 -18355 -13468 -9843 -11137 -16821 -17366 -23809 -22052 -13848 -9284
2184 -9284 -10432 -4425 9086 10121 21776 29892 21338 22546 20419 13704 2801 -6557 -10574 -1381
2170 -1381 -6656 -8632 -3513 -11293 -20212 -16113 -4777 -791 -12381 5286 -2121 -6625 -6431 -2913
2156 -2913 7672 5033 6960 4173 -10730 -26419 -22509 -11861 -7622 -8249 -3297 1312 3936 1494
2142 1494 -1399 -10826 -4819 4941 1068 -26 8642 23566 29274 23045 13387 12270 32226 35629
2128 35629 22103 11469 22276 41012 40308 32435 22447 9665 9211 11868 14739 17369 18443 25453
2114 25453 22223 14875 22837 24347 16317 17204 19354 15814 10365 18072 38075 47277 35282 8365
2100 8365 -2270 15098 21033 25219 26305 25333 13727 -4476 -9420 -15055 -15652 -10238 -5203 5220
2086 5220 4760 4340 -8535 -10559 1626 16412 14317 10828 19572 8236 -9066 -1050 10152 14339
2072 14339 18133 21237 19990 14508 11285 16126 4536 -3345 7289 5325 6072 6687 -5890 -14455
2058 -14455 -6022 1742 8256 10165 8091 944 -3394 -8441 -6733 7497 11280 4045 2572 -8931
2044 -8931 -10154 3011 12550 21758 9262 6482 12489 6654 -606 6183 17387 15966 2418 -14493
2030 -14493 -15282 -21888 -23907 -2507 10758 -8759 -20521 -23124 -27199 -11238 3788 -5130 -8013
2017 -8013 -395 1026 5522 23825 38766 31536 6915 -15510 -22552 -21708 -13545 -8168 11440 29917
2003 29917 30475 18892 681 -12528 -8036 -18534 -31272 -24055 710 6846 9739 11674 11347 12069
1989 12069 6189 8670 19095 16239 5331 -4430 -22415 -30487 -22931 -2866 6688 -3540 3908
1976 3908 9727 3892 -8289 -13497 -8523 -10256 -12055 -16382 -10702 2075 -2696 -4706 11282 13045
1962 13045 11391 10832 12863 15172 8153 275 -2713 -1631 -3908 -3804 -4483 7812 22779 16675 -4941
1947 -4941 -15559 -19621 -25053 -17380 -8490 -23990 -27070 405 7685 607 7026 2346 3930 13953
1933 13953 3394 -5701 -11922 -4283 9966 23666 19073 11202 5157 14017 12148 -3398 9040
1920 9040 18826 22101 33805 29379 20881 35944 35047 17205 8743 -12883 -19001 -11017 -25678 -26933
1906 -26933 -14921 -13820 -10806 -20754 -14528 5190 -1218 -8208 3398 -3588 -1409 686 -8133 -22107
1892 -22107 -23512 -13687 15791 17649 13281 12038 15860 11250 2290 -2288 10865 8833 -3434 -5317
1878 -5317 -10866 -5021 -8170 -12869 -14166 -9104 -2610 -4358 2044 7224 9244 5663 7042 -8646 -8293
1863 -8293 -3939 -11858 -6313 9201 290 -8695 1251 14242 13215 3595 17703 33663 19870 3147
1849 3147 -2160 -19382 -22818 -19431 -12636 4809 14849 9571 6324 -3583 9914 11020 8504 -349
1835 -349 452 6477 11616 15867 11276 16221 15117 8665 10175 7267 20468 7872 -7558 -7467 -8552
1820 -8552 -15179 -10229 7843 2178 -9505 -10503 -6245 -2154 -6987 -9638 -22389 -30648 -20485 -1612
1806 -1612 3177 -10338 -8978 -8428 -19750 -35750 -33766 -27328 -35977 -26904 -15360 -9474 -6718 -9829
1792 -9829 -10487 -2300 -3599 -7976 -19180 -17754 -26889 -30240 -24444 -37444 -41772 -22739 -8078 -11752
1778 -11752 -22630 -15957 -3235 8079 3983 6262 12593 3503 5971 -938 -1428 -19146 -30180 -19238
1764 -19238 -9838 3050 -5594 -13251 -12228 -11051 -11209 -6856 -23637 -27253 -10935 2084 5108 -12858
1750 -12858 -18243 -9913 -753 8069 17305 12073 2771 6681 12444 9123 -17446 -20007 -9095 -7177
1736 -7177 -9003 -12389 -19040 -16673 1530 10775 11566 9566 20158 29347 21807 -5987 -10792 -18810
1722 -18810 -22703 -8338 6988 1511 -12965 -18436 -4955 -7868 -6046 -5782 2618 -3104 -4683 12639
1708 12639 8555 4966 8334 3873 5031 9625 6936 10960 1645 -9948 -4139 2688 13709 28013
1694 28013 16710 -2812 -10846 3124 18000 15163 10584 10256 9903 -6958 -9723 -1694 11663 953
1680 953 -5035 -4375 -10704 -8449 2783 2118 614 -509 -6513 -7783 -3522 5461 23036 25506 16976
1665 16976 14662 7407 7882 5988 -4669 -6785 -1670 9370 424 1221 10527 11858 8759 -6776
1651 -6776 -17123 -2810 12446 12724 6081 18547 16117 -866 9961 17214 16524 9125 -358 -1379
1637 -1379 5478 20068 18480 11470 -6083 -3837 -12395 -8861 2018 -10366 4499 27457 28994
1624 28994 16157 9919 10780 746 2326 12186 9972 13203 13468 340 -13049 -15747 -308 -6457
1610 -6457 -24128 -22374 -6014 -1699 11018 9027 -2200 -1022 4533 -65 -11476 -10174 -7860 -11563
1596 -11563 -9817 -6559 2171 11181 20227 16970 30823 34384 24232 20812 14615 4924 -2126 6247
1582 6247 1690 6576 -4617 -10722 -10406 -9875 4686 12036 7255 -12055 -1042 15021 17692 10347
1568 10347 4412 19058 35338 35185 28506 11953 4790 -5954 -2915 2511 4443 -2375 -2316 -2721 7570
1553 7570 18396 20621 19400 2969 -6099 -11583 -17697 -16038 5775 18428 8234 8785 4680 7258
1539 7258 16841 5521 -4281 6300 16789 10630 13071 8440 4955 -3631 -3377 -4084 -3050 -3757 -5714
1524 -5714 -5835 1767 -7236 -18739 -15682 -15982 -12914 -13560 -17244 -24559 -16411 1312 -1017 -6936 -11225
1509 -11225 -10588 -9589 1622 4484 13308 27487 23021 9111 2787 224 2575 11362 19776 24166
1495 24166 22475 20747 8084 3192 7214 -4554 -874 5117 8171 -7832 -16750 -21128 -8725 9206
1481 9206 26087 13647 20688 25332 16913 -2839 -19118 -9057 -3737 -4693 -6323 146 -3393 -733
1467 -733 -4597 -1997 -9880 -1136 6068 5546 -5932 -7260 -7947 1749 11520 2658 1397 7443 7468 4896
1451 4896 4381 14326 22487 30339 21021 15822 14099 10572 11237 13739 376 -17958 -6524 -5959 -11570
1436 -11570 -223 1367 -9498 -7323 -895 -5487 -7759 -8587 -12210 -14755 -23839 -36000 -33695 -26841
1422 -26841 -32609 -31630 -31948 -31922 -27969 -22949 -24251 -18875 -7202 -1796 21127 22741 3011 -5449 2715
1407 2715 4556 5582 141 7526 9823 -245 -12483 -8716 2805 4801 4417 -5972 -4003 5247
1393 5247 4877 7079 -8331 -7028 938 -2252 -6159 101 19779 30656 26741 16643 15536 3146
1379 3146 23900 33845 17960 -6704 -13939 -13119 -14824 -1095 8259 7460 6011 10795 11422 7938 11033
1364 11033 22966 19750 28063 24298 29088 22191 22920 11644 -4438 -5304 -2581 -8189 -2150 5001
1350 5001 10546 8311 12961 14770 11251 5285 -3522 -16539 -13150 -5407 2870 9690 20292 27189
1336 27189 25017 18579 14170 4141 675 -4867 4342 9398 18381 10137 5786 1529 -15667 -12423
1322 -12423 -13609 -475 4262 -2948 6784 5982 -5558 1497 2895 -3478 8385 12667 -44 -3710
1308 -3710 17009 31265 24286 12853 12741 23158 27503 21322 17477 14443 6216 -5196 -8913 -10705
1294 -10705 -9031 5029 10747 15565 24066 13397 -3850 10981 16780 16335 5418 17476 19781
1281 19781 22471 20263 15797 29825 24295 3852 4046 6453 14194 21348 17111 20394 19795 6672
1267 6672 14997 -1443 -3176 -5177 -3559 -10305 -18147 -21884 -32277 -13581 -4020 -19573 -19595 -10975
1253 -10975 67 -3512 -9729 -11269 -4842 -1876 -2925 -485 -1982 -9612 -7553 -14921 -23190 -20305
1239 -20305 -7661 -21353 -20289 -13222 -9454 1222 1911 -8456 -15651 -6541 -4782 -18109 -15418 2691
1225 2691 13976 8504 9039 -6229 -2094 16586 10721 -4791 -6275 -9232 -10457 -8689 -9972 -8874
1211 -8874 5711 18429 11105 7609 2609 8624 17473 27216 21438 675 -8842 -8489 -6152 -6485 1851
1196 1851 2242 6893 16972 9010 -5091 -4632 -4293 20448 28286 17362 2394 -326 -5015 -8291
1182 -8291 -18529 -28047 -16032 -1595 -997 -2854 -3584 1801 10095 11809 16621 18710 9027 2580 -1107
1167 -1107 -3745 -1451 7383 14792 12243 11314 2739 -2073 5202 9688 9072 -1700 -7503 -4756 710
1152 710 7392 10354 12090 8687 7543 -5009 -1117 7444 4894 6867 -2560 -27317 -31913 -20147
1138 -20147 -17512 -2798 4341 -3324 -1895 -5222 -6656 -11048 -9579 -9498 -7338 530 13603 28706
1124 28706 28877 20717 14195 16801 5677 8438 6472 666 -2497 -5070 -5281 5642 3132 3493 15871
1109 15871 14163 11265 13513 2363 -3496 9250 16650 2753 -4168 6938 18122 19338 8513
1096 8513 7068 10310 3954 3248 8054 -4396 -2928 -1048 -5109 -8547 -7481 -7468 -12802 -10397 5014
1081 5014 10494 -2802 6809 23102 18508 9840 12086 -1862 -18373 -17386 -13859 -8581 8703 8959
1067 8959 2152 1476 -1943 18 -9296 -13855 -14048 -27637 -18954 -346 86 -11967 -9399 -4492 -14240
1052 -14240 -17482 -5981 -13558 -20103 -7349 -4130 -24262 -26026 -13339 -2984 7884 7555 -4027
1039 -4027 -1992 3445 -3112 563 -14270 -13561 -8490 7175 10131 -9836 -9203 3722 8733 11361
1025 11361 -586 -5122 10287 24281 26500 21887 16439 19272 19008 17595 14982 3336 2958 -2716
1011 -2716 5 -3174 10566 12022 6106 3535 1376 -9120 -17392 -24698 -33371 -28128 -16419 -4238
997 -4238 -312 -2950 -2899 5132 12339 7315 7562 3529 1259 -7426 -13415 -22266 -19472 -19670 -14864 1784
981 1784 -9929 -5709 4476 -597 -3557 -5000 1837 5205 4434 676 -1304 1726 1320 6084 11594
966 11594 -2696 2367 1004 -6477 -6092 -360 3541 -4248 -22002 -12745 -1724 -9245 -5384 -5927 -5908
951 -5908 -5265 -1756 -5393 -11685 -22976 -26606 -21047 -16750 -16866 -18304 -6092 -8648 -18804 -17408 -1272
936 -1272 7389 3280 4776 -6863 -12615 -9649 -17500 -22597 -10944 1012 -475 306 -6540 -8053 -6568
921 -6568 3995 1072 5943 48 -12243 -19261 -4090 16854 25951 24923 21024 14669 12924 9050
907 9050 -2302 -6895 8244 16730 5842 -164 -10155 -18007 4 5831 10271 7374 5149 -2201
893 -2201 3435 -1040 -8071 1000 11712 -2464 -7566 -3991 -1856 1258 -13 11438 8206 13806
879 13806 18883 916 -8286 -5149 -2150 7287 6794 -3169 -8966 -9706 -11233 -9546 -2139 7218 14447
864 14447 26834 31697 21000 7643 -2798 -5769 -7547 -5384 -5782 -13660 -16619 1844 7378 16082
850 16082 28081 21696 12854 15416 9229 -1646 -5411 4095 6104 -1234 2249 7328 1113 -2912
836 -2912 3251 12740 19184 5766 -7027 -8592 -4135 415 -4725 4737 5709 -1143 -4603 4441 16269
821 16269 23692 17401 11329 1806 -3076 -7613 -7474 807 9287 -9211 -15058 -1784 192 -5080 -4973
806 -4973 -2592 -13069 -9565 2777 2618 -356 -10715 -12346 -8641 -19857 -26199 -14808 -8397 -6488
792 -6488 -1054 -3937 -11001 -13905 -12756 -7917 -9773 -6025 5135 11215 15868 15895 6181 20473 33084
777 33084 19192 16335 12716 7428 15039 28817 32464 32517 16192 11877 12223 12859 3024 -1016 -4362
762 -4362 -2185 12280 14833 13598 15792 18165 31952 17523 3526 11807 13466 -1601 1647 20902
748 20902 3549 -4145 7763 2599 -657 -7814 12249 11865 2616 -10085 -19290 -2523 3355 -15519
734 -15519 -14400 -3916 3028 1369 2784 -5762 -21683 -15651 -6154 6230 421 -872 859 -13094
720 -13094 -12857 -1844 15451 17217 8829 326 -11421 -1397 695 4918 11894 18239 23595 20600
706 20600 5641 2544 5433 -3514 -9973 -14298 -10158 -4489 -1703 -5869 -1505 -9820 -4367 5610 -851
691 -851 -11702 -20272 -13374 -11794 -14913 2891 17973 31458 26450 22951 20612 813 1116 5666
677 5666 5813 13489 12513 -6688 -10801 4510 9562 11010 3335 -16810 -21216 -15445 -5562 -2485 1087
662 1087 4789 15935 11574 6496 7087 16602 16997 9958 -3746 -19964 -31327 -22327 -13197 -14234 -2990
647 -2990 6339 -1567 -4611 -6905 4905 -1810 -7119 -2267 4525 11931 18140 18641 25752 22057 7821
632 7821 -7027 -24843 -22083 -9768 -15797 -20768 -13990 -5983 -2909 -17479 -20511 -22588 -17405 -14774
618 -14774 -9554 -3189 2085 8221 5194 761 -8072 -5253 -4715 -9991 -3419 -2973 -11151 661 6335
603 6335 9340 7850 -512 5511 6840 4564 2407 -8811 -24402 -18734 -10779 -3792 7544 7132 8407
588 8407 -2118 -1921 -310 3179 10459 11159 -12263 -27541 -42438 -35268 -24970 -24431 -9995 7911
574 7911 -1714 -12027 -17065 -22624 -26818 -30222 -10114 7593 13476 9423 -8009 -17130 -21045 -27945
560 -27945 -20241 -10614 436 -515 -2373 4290 4835 12264 16259 2239 -999 18893 22834 10621
546 10621 11542 5268 -1164 12392 18681 8995 503 33 2770 -2980 -1797 4738 -8021 -10229 -9165
531 -9165 1258 5265 2180 -13967 -16541 -1512 -3187 -10961 -18034 -11942 -6478 7407 13735 17154
517 17154 22376 25106 23206 12732 9258 15923 12820 2008 5663 13414 11106 15282 12059 7187
503 7187 6994 10448 27241 21226 4220 4104 709 7372 11288 16142 15177 13671 7244 4377 -564
488 -564 5788 4698 14091 23662 19879 14794 8102 11528 6 -12455 -18877 -10630 -1011 6457 18162
473 18162 13538 13684 8474 2770 -11417 -1877 -77 -6364 -9697 213 -6760 -2854 -2409 9240 -2287
458 -2287 -8665 -13231 -8042 -4961 -1350 1234 2974 -850 -832 -8769 506 15478 17661 23101 27843
443 27843 25727 15623 12307 28975 42196 33063 13489 3020 3098 -1033 -13101 -21029 -7058 3574
429 3574 466 -8761 -4350 650 -9422 -11387 790 -7626 -7707 -5505 -3399 1380 -8383 -6685 -13250
414 -13250 -35313 -25210 -7262 -13905 -163 5669 9070 5145 8275 13911 8458 7618 2832 -5034
400 -5034 -5008 -3221 -2928 -10913 -8281 -7662 -12053 -9698 -6879 -2394 -3362 -2465 17533 32801 34218 22893
384 22893 22185 26231 14317 7470 4226 5820 6676 10256 18646 7449 -14156 -10058 -4860 -4762 1222
369 1222 6765 1443 -27839 -34061 -16403 -5355 4040 9385 11351 3826 -3372 -1993 -10579 -12095
355 -12095 184 -2530 -642 -6363 -9685 6 1248 3738 1268 -9037 3367 2019 -10825 -8124
341 -8124 -4003 716 3988 4314 2681 6846 3818 -1617 -14267 -22966 -21205 -3722 -14493 -17536 -20416
326 -20416 -13765 -11502 -14573 -4306 16613 27436 24768 13590 2129 -7742 -9885 -22061 -26636
313 -26636 -21141 -8296 -20011 -14298 22 1068 3664 -8108 -8667 -9022 -9216 -6194 -10803 -23932
299 -23932 -27416 -11713 5461 14869 12069 1267 -2124 3128 11575 7949 -2444 -12350 -14555 -7549
285 -7549 -6063 -2839 10295 -4467 -10091 -5723 -8461 2604 1098 -1295 -5572 -8293 -7313 -5945 -5361
270 -5361 4218 2987 8572 10156 9373 6523 2196 6587 -607 -8935 -9466 -5724 1279 1440 -10720 -11109
254 -11109 -12692 -17439 -5130 -11682 -19466 -13527 -5085 5953 8184 2755 842 2432 12089 5563
240 5563 188 14586 12183 4798 -3693 -9313 -4831 -2312 5651 6881 6262 5913 6708 8357 118 638
224 638 -3013 2320 3533 -693 -289 3938 454 -7921 -7621 3074 79 1799 7121 3958 -4888 -3775
208 -3775 -2808 -6347 -2055 1219 -5248 -8974 1782 12056 14146 -2157 927 5507 13266 23083 24893
193 24893 23776 23404 12160 -288 -5227 -2313 -1555 -9886 -7627 3065 6213 4329 -2538 -11474 -187
178 -187 11309 3863 -615 -359 4622 -8713 -17079 -9481 -841 14602 19279 26774 25787 12237 -4853
163 -4853 -19735 -16331 -7233 -3105 -963 164 -9002 -13839 -16976 -16291 -13055 -8864 -2004 1182 -170
148 -170 -13680 -14888 -7980 -5805 3697 4747 3699 11253 15374 3109 -10313 -1041 -6639 -9312 -7302
133 -7302 -4092 1931 1519 2917 899 -2492 -4388 -12824 -11340 -16744 -16924 -12601 -4518 -1556 3860 14030
117 14030 3083 -15100 -15668 -550 6366 11677 11687 20095 15218 8003 7734 8613 16460 15697 7519 -315
101 -315 -92 5263 5287 4528 -3327 4681 14695 7918 -2340 -3167 -2891 -4381 -9180 -2828 8271 7956
85 7956 6414 2165 3195 4629 6110 1337 -4071 -14253 -13454 -4674 -5719 -10422 -8760 -3586 2841
70 2841 -1241 -4168 -10427 -7694 -11186 -11967 -4738 -3383 3090 -2747 -10036 -18863 -13948 -14510 -2006 7927
54 7927 8970 12691 24129 31586 23707 12079 12311 5748 -7423 -12824 -5336 3118 2838 -13709 -10764
39 -10764 -10884 -13795 -16168 -18197 -16151 -8264 3394 5354 498 -3347 -8142 -6742 -2751 -1374 125
24 125 798 -1367 -528 -4187 -2744 -4551 -3130 -2143 3186 -499 -1503 5070 4017 4846 3312 181 968
7 968 -4509 -800 -4246 -3070 2892 -297 -2949
0 -2949
$$ Imaginary data points
##PAGE= N=2
##DATA TABLE= (X++(I..I)), XYDATA
32767 71167 79357 80812 81427 85520 90159 88770 83576 79390 71953 70737 81651 86533 83131 80746
32753 80746 82239 88908 89484 90793 92653 91144 95267 89560 85915 83141 78388 84277 80537 75402 80762
32738 80762 81196 89842 85483 92724 103771 98770 90787 100445 109267 113245 114613 118342 114310 106548
32724 106548 119097 123621 113135 112175 113087 116306 119841 122086 133839 139329 134305 127052 128062 120777
32710 120777 124022 131920 136784 130168 124913 125081 124359 124301 133015 134460 132811 135440 133665 128747 133365
32695 133365 138819 138526 145161 145651 143095 135630 125672 132206 151463 159124 154552 148605 139567 141102
32681 141102 139388 134770 141428 152270 157069 149978 156381 157357 152201 159083 156639 154843 166816 173274
32667 173274 167729 166607 171124 174002 171751 170386 175482 167053 156343 167293 175714 174731 174488 165404
32653 165404 167811 174427 169581 173823 184268 193135 180576 185613 190664 182322 178576 177038 181405 185889
32639 185889 198732 198481 188118 189146 183574 180457 175029 179448 176157 189118 206355 210474 212417
32626 212417 211820 215755 212540 204270 203328 201418 200376 195771 195247 199700 200650 194533 189765 185121 175110
32611 175110 187252 195168 199962 210142 211042 203173 203129 210348 212003 212863 218027 212271 211482 208907 206039
32596 206039 207692 208136 204357 201961 204818 209425 215108 227845 235831 238281 226117 214635 210571 210938
32582 210938 216565 227185 222672 221995 227987 234604 235340 233992 244484 245379 242174 254703 253853 246236
32568 246236 243723 250157 265304 266881 260887 253303 254066 263531 273753 279225 279038 270138 266844 269738
32554 269738 259512 255797 264031 269994 260329 258272 263996 266761 263643 257757 270683 276032 274812 275821
32540 275821 266248 268550 266071 263432 262800 243517 240711 242807 255848 271993 284544 283002 269534
32527 269534 271686 278386 283938 275716 272456 276066 273750 271838 267809 280761 292419 285573 285113 284128
32513 284128 283934 287645 291225 286336 297723 308420 298212 279993 273107 278267 292653 282895 279766
32500 279766 292194 301681 297811 282435 276249 280087 285562 299816 307494 308051 305128 305618 295378 285040
32486 285040 289393 284813 278341 286949 291824 284886 285826 288227 287969 284021 293127 314182 319147 324071
$$ [...]
##END NTUPLES=NMR SPECTRUM
##END=
