##TITLE=Analysis number 317803
Compound Code cc 01201
Project Code adrs
Chemist Name durham
##JCAMPDX= 6.0         $$ Bruker NMR JCAMP-DX V2.0
##DATA TYPE= NMR SPECTRUM
##DATA CLASS= NTUPLES
##ORIGIN= Bruker BioSpin GmbH
##OWNER= nmr
$$ XWIN-NMR		Version 3.5
$$ Mon Mar  6 09:38:33 2006 GMT Standard Time (UT+0h)  MAYBRIDGE\nmr@NMR_250MHZ
##.OBSERVE FREQUENCY= 250.131544655141
##.OBSERVE NUCLEUS= ^1H
##.ACQUISITION MODE= SIMULTANEOUS (DQD)
##.ACQUISITION SCHEME= undefined
##.AVERAGES= 16
##.DIGITISER RES= 18
##SPECTROMETER/DATA SYSTEM= dpx250
##.PULSE SEQUENCE= zg30
##.SOLVENT NAME= DMSO
##.SHIFT REFERENCE= (INTERNAL, DMSO, 0, 16.522)
##AUDIT TRAIL= $$ (NUMBER, WHEN, WHO, WHERE, WHAT)
$$ ##TITLE= Audit trail, XWIN-NMR		Version 3.5
$$ ##JCAMPDX= 5.01
$$ ##ORIGIN= Bruker BioSpin GmbH
$$ ##OWNER= nmr
$$ C:\u/data/dgb/nmr/ADRS/30/pdata/1/auditp.txt
$$ ##AUDIT TRAIL=  $$ (NUMBER, WHEN, WHO, WHERE, WHAT)
(   1,<2006-03-06 09:36:52.62 +000>,<MAYBRIDGE\nmr>,<NMR_250MHZ>,
      <created by zg, POWCHK disabled, PULCHK disabled
       configuration hash MD5:
       84 BC 41 DB A1 6E 1D 46 DA 25 12 A5 C1 ED C5 3A
       data hash MD5: 64K
       17 EE F1 D2 96 5A 06 AD 60 BD 43 95 97 1E 00 D5>)
(   2,<2006-03-06 09:37:32.62 +000>,<MAYBRIDGE\nmr>,<NMR_250MHZ>,
      <Start of raw data processing
       ef LB = 0.3 FT_mod = 6 PKNL = 1 SI = 32K 
       data hash MD5: 32K
       EA D3 C4 FC D3 E7 30 59 8A CE 7F 00 48 32 8F 0C>)
(   3,<2006-03-06 09:37:37.50 +000>,<MAYBRIDGE\nmr>,<NMR_250MHZ>,
      <apk 
       data hash MD5: 32K
       73 6A FA 10 60 70 75 35 61 D3 53 DF 57 C5 EA 95>)
(   4,<2006-03-06 09:37:45.87 +000>,<MAYBRIDGE\nmr>,<NMR_250MHZ>,
      <abs ABSG = 5 
       data hash MD5: 32K
       3B 19 CA EA 09 19 0A 67 4E B9 F3 28 83 12 59 89>)
$$ ##END=
$$ 
$$ hash MD5
$$ 86 D4 A4 6F 35 49 C0 B0 18 68 2B 28 16 82 EF CF
##$RELAX= 
##$RELAX= 
##$RELAX= 
##$RELAX= 
##$RELAX= 
##$RELAX= 
##$RELAX= 
$$ Bruker specific parameters
$$ --------------------------
##$DU= <C:\u>
##$EXPNO= 30
##$NAME= <ADRS>
##$PROCNO= 1
##$TYPE= <nmr>
##$USER= <dgb>
##$AMP= (0..31)
100 100 100 100 100 100 100 100 100 100 100 100 100 100 100 100 100 100 
100 100 100 100 100 100 100 100 100 100 100 100 100 100 
##$AQSEQ= 0
##$AQ_mod= 3
##$AUNM= <au_zg>
##$AUTOPOS= <5 >
##$BF1= 250.13
##$BF2= 250.13
##$BF3= 250.13
##$BF4= 250.13
##$BF5= 500.13
##$BF6= 500.13
##$BF7= 500.13
##$BF8= 500.13
##$BYTORDA= 1
##$CFDGTYP= 0
##$CFRGTYP= 5
##$CHEMSTR= <none>
##$CNST= (0..31)
1 1 145 1 1 1 1 1 1 1 1 1 1 1 1 1 1 1 1 1 1 1 1 1 1 1 1 1 1 1 1 1 
##$CPDPRG= <>
##$CPDPRG1= <>
##$CPDPRG2= <>
##$CPDPRG3= <>
##$CPDPRG4= <mlev>
##$CPDPRG5= <mlev>
##$CPDPRG6= <mlev>
##$CPDPRG7= <mlev>
##$CPDPRG8= <mlev>
##$CPDPRGB= <>
##$CPDPRGT= <>
##$D= (0..31)
0 1 0 0 0 0 0 0 0 0.06 0 0 0 0 0 0 0.0002 0 0 0 0 0 0 0 0 0 0 0 0 0 0 
0 
##$DATE= 1141637809
##$DBL= (0..7)
120 120 120 120 120 120 120 120 
##$DBP= (0..7)
150 150 150 150 150 150 150 150 
##$DBP07= 0
##$DBPNAM0= <>
##$DBPNAM1= <>
##$DBPNAM2= <>
##$DBPNAM3= <>
$$ [...]
##$SUBNAM7= <"">
##$SUBNAM8= <"">
##$SUBNAM9= <"">
##$SW= 20.6930455092707
##$SWIBOX= (0..15)
0 0 3 0 0 0 0 0 0 0 0 0 0 0 0 0 
##$SW_h= 5175.983436853
##$TD= 65536
##$TD0= 1
##$TE= 293.16
##$TE2= 300
##$TE3= 300
##$TEG= 300
##$TL= (0..7)
0 120 120 120 120 120 120 120 
##$TP= (0..7)
150 150 150 150 150 150 150 150 
##$TP07= 0
##$TPNAME0= <>
##$TPNAME1= <>
##$TPNAME2= <>
##$TPNAME3= <>
##$TPNAME4= <>
##$TPNAME5= <>
##$TPNAME6= <>
##$TPNAME7= <>
##$TPOAL= (0..7)
0.5 0.5 0.5 0.5 0.5 0.5 0.5 0.5 
##$TPOFFS= (0..7)
0 0 0 0 0 0 0 0 
##$TUNHIN= 0
##$TUNHOUT= 0
##$TUNXOUT= 0
##$USERA1= <user>
##$USERA2= <user>
##$USERA3= <user>
##$USERA4= <user>
##$USERA5= <user>
##$V9= 5
##$VALIST= <valist>
##$VCLIST= <CCCCCCCCCCCCCCC>
##$VD= 0
##$VDLIST= <DDDDDDDDDDDDDDD>
##$VPLIST= <PPPPPPPPPPPPPPP>
##$VTLIST= <TTTTTTTTTTTTTTT>
##$WBST= 1024
##$WBSW= 4
##$XGAIN= (0..3)
0 0 0 0 
##$XL= 0
##$YL= 0
##$YMAX_a= 503851
##$YMIN_a= -485129
##$ZGOPTNS= <>
##$ZL1= 120
##$ZL2= 120
##$ZL3= 120
##$ZL4= 120
##$ABSF1= 16.522
##$ABSF2= -4.171173
##$ABSG= 5
##$ABSL= 3
##$ALPHA= 0
##$AQORDER= 0
##$ASSFAC= 0
##$ASSFACI= 0
##$ASSFACX= 0
##$ASSWID= 0
##$AUNMP= <proc_1d>
##$AZFE= 0.1
##$AZFW= 0.1
##$BCFW= 0
##$BC_mod= 0
##$BYTORDP= 0
##$COROFFS= 0
##$CY= 12.5
##$DATMOD= 1
##$DC= 0
##$DFILT= <>
##$DTYPP= 0
##$F1P= 14.0000005364418
##$F2P= -0.99999901652339
##$FCOR= 0.5
##$FTSIZE= 32768
##$FT_mod= 6
##$GAMMA= 0
##$GB= 0
##$INTBC= 1
##$INTSCL= 1
##$ISEN= 128
##$LB= 0.3
##$LEV0= 0
##$LPBIN= 0
##$MAXI= 10000
##$MC2= 0
##$MEAN= 0
##$ME_mod= 0
##$MI= 0
##$NCOEF= 0
##$NC_proc= -2
##$NLEV= 6
##$NOISF1= 0
##$NOISF2= 0
##$NSP= 0
##$NTH_PI= 0
##$NZP= 0
##$OFFSET= 16.522
##$PC= 1
##$PHC0= 240.4264
##$PHC1= 7.684075
##$PH_mod= 1
##$PKNL= yes
##$PPARMOD= 0
##$PSCAL= 4
##$PSIGN= 0
##$REVERSE= no
##$SF= 250.13
##$SI= 32768
##$SIGF1= 0
##$SIGF2= 0
##$SINO= 400
##$SIOLD= 32768
##$SREGLST= <1H.DMSO>
##$SSB= 0
##$STSI= 32768
##$STSR= 0
##$SW_p= 5175.98343685301
##$SYMM= 0
##$S_DEV= 0
##$TDeff= 65536
##$TDoff= 0
##$TI= <Analysis number 999999
Compound Code 99
Book Reference 9
Project Code 9>
##$TILT= no
##$TM1= 0
##$TM2= 0
##$TOPLEV= 0
##$USERP1= <user>
##$USERP2= <user>
##$USERP3= <user>
##$USERP4= <user>
##$USERP5= <user>
##$WDW= 1
##$XDIM= 32768
##$YMAX_p= 506469847
##$YMIN_p= -184546
$$ End of Bruker specific parameters
$$ ---------------------------------
##NTUPLES= NMR SPECTRUM
##VAR_NAME=  FREQUENCY,     SPECTRUM/REAL,   SPECTRUM/IMAG
##SYMBOL=    X,             R,               I
##VAR_TYPE=  INDEPENDENT,   DEPENDENT,       DEPENDENT
##VAR_FORM=  AFFN,          ASDF,            ASDF
##VAR_DIM=   32768,         32768,           32768
##UNITS=     HZ,            ARBITRARY UNITS, ARBITRARY UNITS
##FACTOR=    0.157963299565203, 1,           1
##FIRST=     4132.6476996994, 0,             0
##LAST=      -1043.33573715361, 0,           0
##MIN=       -1043.33573715361, -184546,     0
##MAX=       4132.6476996994, 506469847,     0
$$ Real data points
##PAGE= N=1
##DATA TABLE= (X++(R..R)), XYDATA
$$ [...]
16405c1231Q01J7145P507j348p067K925J1567k34j8281L444K4571k162J0630M141
16391B2408k6845r163j5598k637N667L875J9411J7547J3121m727j250L904R825
16378C5538r541q753l5119k1603n350M850Q555O663J2095M979J4481K0131r125
16365A7801j8097j2950k1471R354P605J1637m153k6850J2304J2406m764j043j8125
16352c6346J6393p27o047P731J1702J4686r383J099j2141n567J4902O411q089
16339e376j4705j6584K2126J8378K0152n091o140j0969L743O476r962J575n607
16326a984J8861M1296m55j7377j4913k8517k7615K0980K7869J1569o134l5252
16314a1672l3589J0991P754o940J3573K6721O889l4354k5750K1208K449K070O425
$$ plain form
16405 -31231 -30430 -13285 -5778 -7126 -14193 -11268 299 65 -18216 -14772 9799 7637 18267 22408
16391 22408 -4437 -13600 -29198 -31835 -26168 -22293 -2882 14665 27786 23059 21809 25713 35538
16378 35538 25997 17244 -17875 -39478 -44828 -39978 -31423 -24760 -12665 -7686 6795 26926 17801
16365 17801 -296 -13246 -34717 -25363 -17758 -6121 -10274 -37124 -24820 -12414 -17178 -18221 -36346
16352 -36346 -19953 -20680 -26727 -18996 -7294 7392 -1991 -892 -13033 -18600 -3698 2713 -5376
16339 -5376 -20081 -36665 -14539 3839 23991 18900 12760 1791 5534 12010 2048 3623 -1984
16326 -1984 16877 58173 57718 40341 25428 -3089 -30704 -9724 18145 29714 23580 -11672
16314 -11672 -45261 -34270 -26516 -33456 -19883 6838 13727 -20627 -46377 -25169 -22720 -20650 -14225
16301a4225o743k2145P901L1685P608j767k1320j4825q664R531L9468q563M644
16288B585J6655J2132L159k3863j9017r519L351j530k018J1233r24P633m874l299
16274h296j2472K083K1757j1505k6249N903L6473M114p447q633p140K5924Q765
16261B3277m392j3044j9363P715L491R309K197j390J0309k466m741p447P048R351
16247A9854L156j2994r614k0750O534J4091M136N90m536n911l59k933l0981L160
16233c6557n878N183J2394Q862P462j537J51J7031m844k246k578j7928p562l357
16219c1404o385p112m834K7515J333l483R191J1749m960n322K0714K4335r404
16206B1933j3125n530l195j1333n349J7834K799j532p436n358R318K1814J1950
$$ plain form
16301 -14225 -20968 -43113 -35212 -3527 4081 2314 -19006 -33831 -42495 -32964 6504 -2059 2585
16288 2585 19240 31372 34531 10668 -8349 -17868 -14517 -16047 -18065 -6832 -7756 -123 -4997 -8296
16274 -8296 -20768 -18685 3072 -8433 -34682 -28779 7694 11808 4361 -4272 -11412 14512 23277
16261 23277 18885 5841 -13522 -5807 -2316 6993 9190 7800 18109 15643 10902 3455 10503 19854
16247 19854 23010 10016 402 -20348 -13814 277 4413 5003 467 -5444 -5803 -8736 -39717 -36557
16233 -36557 -42435 -37252 -24858 -15996 -8534 -10071 -9920 7111 2267 21 -2557 -20485 -28047 -31404
16219 -31404 -37789 -44901 -49735 -22220 -20887 -24370 -15179 -3430 -8390 -13712 7002 31337 21933
16206 21933 8808 3278 83 -11250 -16599 1235 4034 2502 -4934 -10292 -974 20840 32790
16193C2790k4550p875N242J4977Q430p79j4406j4505J5675j4962l472k349M75
16180e309j309J5256N083j3623n882j1342R347l991k727l425K655Q76J2576J4875
16166A3060q013j076n101l142P96l261r234j6877j1152L0861O468O302j0689l408
16152a4466l210l496R005L314J0J7280J2489J1770N306o545j1981j5955J1748
16139A5269j3291J730R905l526j6155j2087R077J880n48k1040o77n903p836o898
16125e0100J1927J4069L4359J4459r244P019j9863j7051J5767K3091P507j0507
16113B1433l676j6004j5831K125L220q001r238r548J2390k959j5872J9915O354
16100a5692R513j7341k1554k3353J3289K5260M198J7779J0476m365p595j4905
$$ plain form
16193 32790 8240 365 5607 20584 29014 28235 13829 -676 14999 37 -3435 -5784 -5309
16180 -5309 -6618 8638 13721 98 -5784 -17126 -7779 -11770 -14497 -17922 -15267 -14391 -1815 13060
16166 13060 5047 3971 -1130 -4272 -3476 -6737 -15971 -32848 -44000 -13139 -6671 -369 -11058 -14466
16152 -14466 -17676 -21172 -12167 -8853 -8843 8437 20926 32696 38002 31457 19476 3521 15269
16139 15269 1978 3708 13613 10087 -6068 -18155 -9078 -7198 -7746 -28786 -29463 -35366 -43202 -50100
16125 -50100 -38173 -24104 10255 24714 15470 22489 2626 -14425 1342 24433 31940 21433
16113 21433 17757 1753 -14078 -11953 -8733 -16734 -25972 -35520 -23130 -26089 -41961 -22046 -15692
16100 -15692 -6179 -23520 -45074 -68427 -55138 -29878 -25680 -7901 2575 -1790 -9385 -24290
16088b4290p516K4302J626K396j9598J7788K2237j4365j4257n262J3403R812J608
16075G884j398n313L673n277M261r513R531k1094q630P747J0116K883j8972o379
16061c0481K0873M34J8532k5661m020J2323L1273J4029j7669j4204r554k511L270
16048c366k643L63r757k166J9971J1434o553m550j6998k1350J8820J9144j1581
16035i232q159K2063j2465J911p624j6407p154R847N640q723m569K9158j4789
16022b0503j3434L033J8519J0391Q51J1114j8333r173K88r494P53J994K1623J6946
16008A4575j2649o383m505J0979J643j5582l209M442K1249j2773j2232l5523J1349
15995c8619J0568L553J3345K0317Q41k7762p892J7826K232m106k116m799j0962
$$ plain form
16088 -24290 -31806 -7504 -5878 -3482 -23080 -5292 16945 2580 -11677 -16939 -3536 6276 7884
16075 7884 6486 1173 4846 -431 3830 -5683 3848 -17246 -25876 -18129 -8013 -5130 -24102 -30481
16061 -30481 -9608 -9174 9358 -16303 -20323 -8000 23273 37302 19633 5429 -4125 -6636 -3366
16048 -3366 -6009 -5646 -15403 -17569 2402 13836 7283 2733 -14265 -35615 -16795 2349 -9232
16035 -9232 -17391 4672 -7793 -5882 -13506 -29913 -37067 -27220 -21580 -30303 -34872 -5714 -20503
16022 -20503 -33937 -30904 -12385 -1994 -1143 9971 -8362 -17535 -17247 -26741 -25988 -23994 -2371 14575
16008 14575 1926 -4457 -8962 2017 3660 -11922 -15131 -10689 10560 -2213 -14445 -49968 -38619
15995 -38619 -28051 -24498 -11153 9164 10005 -17757 -25649 -7823 -5591 -9697 -11813 -16612 -27574
15982b7574J5744J4249k514j7166N87J2078m132q733j2376J9680J1724J6112K6827
15969D4506j9447m1615j2652o831l171m324K541L2680K0231j6151j698J0515n828
15956a244k705K540L086Q76M829q1q933k4039j8760K9862K0350p195J4948o798
15942F736j2610R558j6753k1994O527j1071j0212P511J0831l217L298j2572J3371
15929c0597r309Q237j8496K902L5377K8492J0518k4918k325J1456o800l4637k1867
15916e1967J1806P870Q849J5794J8034Q543j2619j1200k1997p899J0353J7547
15904f886J2979J6293n633j3203r621J4975L310k2683o734N43n048N567P706j0841
15890a9276j9402K337K6481Q240j5384J0394m926l278J1463J6988K2041j7504
$$ plain form
15982 -27574 -11830 2419 -95 -17261 -16674 -4596 -8728 -17461 -29837 -10157 1567 17679 44506
15969 44506 25059 -16556 -29208 -36039 -39210 -43534 -40993 -8313 11918 -4233 -5931 4584 -1244
15956 -1244 -3949 -1409 1677 2553 7382 7301 -1632 -25671 -44431 -14569 5781 -1414 13534 6736
15942 6736 -5874 3684 -13069 -35063 -28536 -39607 -49819 -42308 -31477 -34694 -31396 -43968 -30597
15929 -30597 -39906 -31669 -50165 -47263 -11886 16606 27124 2206 -119 11337 4537 -30100 -51967
15916 -51967 -40161 -32291 -23442 -7648 10386 18929 6310 -4890 -26887 -34786 -24433 -6886
15904 -6886 6093 22386 16753 3550 -6071 8904 12214 -10469 -17203 -16660 -21708 -16141 -8435 -19276
15890 -19276 -38678 -36341 -9860 -1620 -17004 -6610 -11536 -14814 -3351 13637 35678 18174
15878A8174l509p801J3896J4061k793j8177l765j529N408O727j543j7570j3675
15865a2096j605n81R848J7460K4698j9349N38j2944p501M246J8273j0302k1197
15852a0512o067J0387l415R96J5250n847j7386q054K5804J1900q651J3207J1294
15839B8906Q955O694m766j6609k2535L580K690J559j3685L756Q110R923j3249
15826C329k736M482J0903j0755j0143J2177J8227n092l824l1440j2768L599L946
15813b0095O381n417Q630j638J095L897j1544o049l628j32K5625K06p998P636
15799c031J1884J5777q357j7751o282j9795k056Q218o675K472K971K77l572J5451
15785a0469K3782o004J651p464n885P859j0816K540J2622j915k6232P573J3074
$$ plain form
15878 18174 14665 6864 20760 34821 32028 13851 10086 8557 13965 20692 19149 1579 -12096
15865 -12096 -13701 -14282 -4434 13026 37724 18375 18913 5969 -1532 2714 20987 10685 -10512
15852 -10512 -16579 -6192 -9607 -8611 6639 792 -16594 -24648 1156 13056 4405 17612 28906
15839 28906 37861 44555 39789 23180 645 4225 6915 8474 -5211 -1455 6655 16578 3329
15826 3329 593 5075 15978 5223 -4920 7257 25484 20392 16568 -14872 -27640 -24041 -20095
15813 -20095 -13714 -19131 -10501 -12139 -11044 -7147 -18691 -24740 -28368 -28500 -2875 -2669 -10667 -3031
15799 -3031 8853 24630 16273 -1478 -7760 -27555 -29611 -21393 -28068 -25596 -22625 -22348 -25920 -10469
15785 -10469 13313 7309 8960 1496 -4389 3470 -7346 -4806 7816 5901 -20331 -12758 316
15772C16J574K99j4033R37Q672k098O805l238j1784J3724p105o195Q010j27j1693
15757a5936p25J3326P782j633k1563J0144K4986m874j8163j5318J1320J0660k0150
15744b0144J2899J4447k2107q389J619J4463j027p943l957J1805J0329J302l758
15731d61J5605o77k2673j2499q606J2482N994Q056K511L2430J7020J934l433k771
15717D4912k332k5561q821j1606j972J8751K4887O733j2152n751P29M688m967
15704B7538K477K3404R329J1640k796q105M412K7824N853J2942k3441j3595j0290
15691F7192M288n941j0494k0334j9746j1870J3663o908N123n681p371k0775K768
15678a6086J9984K3853J7118l901r294k431P898j2991k8534r138J4733Q742r406
$$ plain form
15772 316 1890 2189 -11844 -10907 -2235 -4333 2472 -766 -12550 1174 -5931 -12126 -4116 -4243 -15936
15757 -15936 -16661 -3335 4447 2814 -18749 -8605 16381 11507 -6656 -21974 -10654 6 -20144
15744 -20144 -7245 7202 -14905 -23294 -21675 -7212 -8239 -16182 -20139 -8334 1995 3297 -461
15731 -461 15144 14467 -8206 -20705 -29311 -16829 -10835 -2779 -268 32162 49182 51116 47683 44912
15717 44912 42580 17019 8198 -3408 -5380 13371 38258 44991 32839 27088 27817 32505 27538
15704 27538 30015 53419 62748 74388 71592 63487 67899 95723 101576 114518 91077 77482 67192
15691 67192 71480 65539 55045 34711 14965 3095 16758 9850 14973 9292 1921 -18854 -16086
15678 -16086 3898 27751 44869 40968 31674 29243 37141 24150 -4384 -13522 1211 9953 547
15665E47j927l3091p884J7601M2444O019r552J1261R737K577k07J4393k3881l9877
15651a1840N619N245J0556k2278j2773N27N748k037L948K0032K1137j5036k1756
15638a2908p343M649J1626O875k0064Q517j1125J2840m067q944J4847J3525P924
15625A6352J570k1759k938q546k338j4061N468J7222K7750k19j5871k5351j7275
15612c9996m61J1283J7629L082M871J8401l880p575k291J0305P615O664k022J3481
15598C7106j560k0229K4459j4729k6439k854l262R476O373L072j5924m289l01
15585i101J2544r245n075J206K5660J3288j6966j2996m315p243k304J0609R235
15572E297J3169o116l3302j1335r279L9395K3265j7189m162j1405k9370k0920
$$ plain form
15665 547 -1380 -34471 -42355 -24754 17690 23709 14157 25418 35155 37732 37525 51918 28037 -11840
15651 -11840 -6221 -976 9580 -12698 -25471 -24944 -19196 -21233 -17285 2747 23884 8848 -12908
15638 -12908 -20251 -15602 -3976 2899 -17165 -8648 -19773 -6933 -11000 -19944 -5097 8428 16352
15625 16352 17922 -3837 -6775 -15321 -17659 -31720 -26252 -9030 18720 18501 2630 -22721 -39996
15612 -39996 -40457 -29174 -11545 -8463 -3592 14809 10929 3354 1063 11368 18983 25647 23625 37106
15598 37106 35546 15317 39776 25047 -1392 -4246 -7508 1968 8341 11413 -4511 -8800 -9101
15585 -9101 3443 -5802 -10877 -9671 15989 29277 12311 -685 -5000 -12243 -14547 -3938 5297
15572 5297 18466 12350 -20952 -32287 -41566 -2171 21094 3905 -257 -11662 -41032 -61952
15560f1952o99L0749J9756N927o076j6232J2979J5359J4280K871k4465p060J1037
15547c526J6194J5845j3091l1391J0435P587J0026J2885Q187J1241j0280l4326
15535b14j9091Q350m91K816P358J1651P321j4895j4634K335k78k644M212Q536
15521C32k306k54P998j9372R409L6301q629j2704J5794o846Q658J5171L451j3891
15507C3112l8615l0417O045q567O798K6127j8927m104K433j2497M640Q415Q253
15494a7304M742n895R251K187K3928J0159j7592J8459o750q336j7825L97O278
15481A699R125k510K093p638l597J4751M900k4967p580J9270R472Q459n764m680
15467A3033J701n767j6986l168O874R792Q020K741p100m24k3837p912J277L611
$$ plain form
15560 -61952 -62651 -31902 -12146 -6219 -12295 -28527 -15548 -189 14091 16962 -7503 -14563 -3526
15547 -3526 12668 28513 15422 -15969 -5534 2053 12079 24964 33151 44392 34112 -214
15535 -214 -19305 -10955 -11446 -8630 -1272 10379 17700 2805 -11829 -9494 -9772 -12416 -8204 332
15521 332 -1974 -2228 5770 -13602 -4193 32108 23479 10775 26569 19723 28381 43552 47003 33112
15507 33112 -5503 -35920 -29875 -38442 -31644 -5517 -24444 -28548 -26115 -38612 -33972 -25557 -17304
15494 -17304 -12562 -18457 -9206 -7019 16909 27068 9476 27935 21185 12849 -4976 -4579 1699
15481 1699 10824 8314 10407 2769 -828 13923 18823 -6144 -13724 5546 15018 23477 17713 13033
15467 13033 14734 8967 -8019 -11187 -4313 5479 13499 16240 9140 8716 -15121 -23033 -21756 -18145
15453a8145K2594j77j9955O53M050j2423m702J1519J1783O805Q259o373m128j4500
15439a4740j1878J2320J4512L120R288J3212k8091j2044M874R169n130J00o629
15426a1917J7301K8412m995m5504l1422J1626K8494J0391J512j4482j1772N406
15414a6950K4182J5372J1087j3962k1878Q64q269o677O760J0457n386q581J8272
15401E291R289R155K0922m592j735l915k4663j6304P182O835M233K565M924o929
15387A2258k5084N46R832m07Q17L254P271L381K870M252l371o956J554J367k6829
15372a5245N205J2634j690K844l872j3253r08l394p379P988K5904o273l993M754
15358C322J2403L788J97j1182j7156j8623J3931J8500J4556n910j8545J0332L124
$$ plain form
15453 -18145 4449 4272 -15683 -15030 -10980 -23403 -28105 -16586 -4803 2002 10261 3888 -240 -14740
15439 -14740 -26618 -14298 214 3334 12622 25834 -2257 -14301 -9427 -258 -5388 -5288 -11917
15426 -11917 5384 33796 28801 -16703 -48125 -36499 -8005 2386 3898 -10584 -22356 -16950
15414 -16950 7232 22604 33691 19729 -2149 -1285 -9554 -16231 -9471 986 -4400 -12981 5291
15401 5291 14580 23735 44657 40065 38330 34415 9752 -6552 630 7465 11698 14263 19187 12258
15387 12258 -12826 -12280 -2448 -2855 -2038 1216 8487 11868 14738 18990 15619 8663 10217 11584 -15245
15372 -15245 -10040 2594 904 3748 -124 -13377 -14285 -17679 -25058 -17070 8834 2561 -1432 3322
15358 3322 15725 19513 19710 8528 -8628 -27251 -13320 5180 19736 13826 -4719 5613 8737
15345H737l586M271R261j6492l693J4007J744j1628k1356j1437K4214J1972r162
15332c148j1074J9703L592N891R492P290k170k0159o546j1445K2207Q027k3932
15319b272j1810J812J2426M486J0119q19r180j2605J3307K6393q676l3043O39
15306i223L9822l45j6671P441R745j867K631m779j7983q051j0916j970M846R4
15292g226J223O969J3979K9632l849l7235j7803n511J2829K112j9962p07o965
15279c2514J0839k358m182L964O039N834j1397j9882J7828K7957j2427J0725R634
15266A0060k4487J602P475J9517K3919J4083k0281j5117l956M339j2109N61J5741
15253B1347o616k2825m052n401j2268N26o236r108R100J2205k056R706k486j5704
$$ plain form
15345 8737 5151 9422 18683 2191 -1502 12505 14249 2621 -18735 -30172 -5958 6014 -3148
15332 -3148 -14222 5481 9073 14964 24456 31746 29576 9417 2871 -8574 13633 21660 -2272
15319 -2272 -14082 -12270 156 4642 14761 13942 4762 -7843 5464 31857 23181 -9862 -9223
15306 -9223 30599 30254 13583 21024 30769 28902 31533 26754 8771 720 -10196 -12166 -7320 -7226
15292 -7226 -6003 966 14945 44577 40728 3493 -14310 -19821 -6992 -4880 -24842 -25549 -32514
15279 -32514 -21675 -24033 -28215 -24251 -18212 -12378 -23775 -43657 -25829 2128 -10299 426 10060
15266 10060 -14427 -12825 -5350 14167 38086 52169 31888 16771 12815 17154 5045 5606 21347
15253 21347 14731 -8094 -12146 -17547 -29815 -29289 -35525 -44633 -35533 -23328 -25384 -15678 -18164 -33868
15239c3868l416J5162J4888Q399k370M081j4277p791J751J2244k504l892k427
15226a4020j081O989M633M193O660J0293k3184k5808K0996L4635J3193l278K876
15213C7097n743j1784j350q059r142j5139J4393J5156J3960J252j268P450K162
15200C8985j6064j5942n460M139k908n32K006j773p360l06J1032K481r112j4298
15186a5112m371J8639q457K119o680j8059j0700R240J1173p046R863j855r251
15173c0497k016N038n939m093Q604Q813n314L82J4217L834j7357N282J9825J497
15159B276M226j4612k1273q596m72K1153L278L725N122k1156j5949L218J1515
15146b7545j5903l888K5303L4078L235j6128n6R977R340j0666k5218j829O519
$$ plain form
15239 -33868 -37284 -22122 -7234 1165 -1205 2876 -11401 -19192 -17441 -5197 -7701 -11593 -14020
15226 -14020 -15101 -8112 -3479 714 7374 17667 -5517 -31325 -10329 24306 37499 34221 37097
15213 37097 31354 19570 18220 10161 1019 -14120 273 15429 29389 30641 29373 36823 38985
15200 38985 22921 6979 1519 5658 2750 2218 4224 2451 -4909 -5215 5817 8298 -814 -15112
15186 -15112 -19483 -844 -9301 -7182 -13862 -31921 -42621 -33381 -22208 -29254 -19391 -21246 -30497
15173 -30497 -32513 -27475 -33414 -37507 -28903 -20090 -25404 -25022 -10805 -6971 -24328 -19046 779 2276
15159 2276 6502 -8110 -29383 -37979 -38451 -17298 -14020 -10295 -5173 -26329 -42278 -39060 -27545
15146 -27545 -43448 -47336 -22033 12045 15280 -848 -904 9073 18413 7747 -17471 -19300 -12781
15133a2781L894J8416p480j5548o888j0222m124K2150m560j7690J6976N822m451
15120a6486j1908l2301J9363K6103K5355J0967j4090j6543K191n213R037K1598
15108A8073M233r595J0556K2365k5394m3944k2241Q619J1181j922p908p605j6259
15095e9841L4986K4312O424q737J99j1055J2090j896j9055N313J349j3511J2017
15082a7405O74j271J4503n40l286O492k0377m744J0819j1924O044L9289P613K253
15068B8140p531R296p42m375j342o427M052j6263l638j0379l769J4533Q401j5110
15054e154j8372j0832P289L1590K2584l2433j6619J8360k839j3393N593J7778
15042C552P949N713l870K076J2399R325k11J0779j600k3719j7134N344j9426r569
$$ plain form
15133 -12781 -8887 9529 2049 -13499 -20387 -30609 -34733 -12583 -17143 -34833 -17857 -12035 -16486
15120 -16486 -28394 -60695 -41332 -15229 10126 21093 7003 -9540 -7349 -12562 -3525 18073
15108 18073 22306 12711 23267 45632 20238 -23706 -45947 -37328 -26147 -28069 -35977 -43582 -59841
15095 -59841 -24855 -543 5881 -2856 -2657 -13712 -1622 -3518 -22573 -17260 -15911 -29422 -17405
15082 -17405 -16731 -18002 -3499 -4039 -7325 -833 -21210 -25954 -15135 -27059 -21015 18274 25887 28140
15068 28140 20609 29905 29163 24788 23446 17019 21071 4808 1170 -9209 -12978 1555 9956 -5154
15054 -5154 -23526 -34358 -27069 4521 27105 -5328 -21947 -3587 -6426 -19819 -14226 3552
15042 3552 11501 17214 13344 15420 27819 37144 36933 47712 46112 22393 5259 10603 -8823 -18392
15028a8392j4904J0620J825p670J5769K8618J1075k0871l0508P514J5978o67N433
15015C820O140K255k0366o326j1482r804o102J082J570R30M318L13O271K232M981
15000b0168K1024j8151j8410J746j332J2225R995O025Q161p13R17j948l27j251
14986b207j9892O442J5270l197J3837k6055j1586n436J2122q004R115J6429J5528
14973A2366P62R030j1549M306P101o39M441j9041j6515j289K40j7271J4242n015
14959a8831K1369O7j7959J0035J7963j1481j268J088j356j0217o698q217J2549
14946a2956L346K336m11j1219o1l08R08J9174k1315J0803J1687k728K815J0651
14932A2722O165N48j1246L709J0793r235L996M148J825m509o922n392M306j5778
$$ plain form
15028 -18392 -33296 -22676 -20851 -28521 -12752 15866 26941 6070 -24438 -16924 -946 -1613 3820
15015 3820 9960 12215 -8151 -14477 -25959 -35763 -41865 -40783 -39213 -38283 -33965 -33652 -27381 -25149 -20168
15000 -20168 856 -17295 -35705 -33959 -35291 -23066 -13071 -7046 1115 402 1319 -629 -956 -2207
14986 -2207 -22099 -15657 -387 -3584 10253 -15802 -27388 -32824 -20702 -28706 -19591 -3162 12366
14973 12366 13128 22158 10609 14915 22016 21377 25818 6777 -9738 -11027 -10787 -28058 -13816 -18831
14959 -18831 2538 2605 -15354 -5319 12644 1163 -105 983 -373 -10590 -17288 -25505 -12956
14946 -12956 -9610 -7274 -7685 -18904 -18965 -19273 -18365 809 -20506 -9703 1984 -744 2071 12722
14932 12722 18887 19435 8189 11898 22691 13456 17452 21600 23425 18916 11994 6602 10908 -4870
14918d870K066K6097r69n842o186K504k29K1593R300k2422j6016m418j7448O359
14904a0481M399M26J0996J5508N747P933k2483k5503N079R613m115k8110j1693
14891d2684J6379J8333Q381j5592q213Q467m854k930J1980R94J1107J2009O410
14878A9787n518j0479k558J0417j52r48N419K214p149k430O801q600K009k2478
14864a3665r778q557j824K020N428L421J3046l5211O276J6902J2943J0452J464
14851B917K014J5345N624l550r74n689k0376m827J6223l09j1373j1260N509J029
14837i697P74k94N05k312j2609m560O785p001J4319R330j1032j6747J3192K0694
14823A347K279j61o533j2047P986J1531l4305r149J8340J1703k94K031p417J2580
$$ plain form
14918 -4870 -2804 23293 22324 16482 10296 12800 12571 34164 43464 21042 5026 608 -16840 -10481
14904 -10481 -6082 -5656 5340 20848 26595 34528 12045 -13458 -8379 1234 -2881 -30991 -42684
14891 -42684 -26305 -7972 409 -15183 -23396 -14929 -19783 -22713 -10733 -9739 1368 13377 19787
14878 19787 14269 3790 1232 11649 11497 10549 15968 18182 11033 8603 15404 6804 8813 -13665
14864 -13665 -23443 -32000 -33824 -31804 -26376 -22955 -9909 -45120 -38844 -21942 -8999 1453 2917
14851 2917 4931 20276 25900 22350 21376 15687 -4689 -9516 6707 6398 -4975 -16235 -10726 -9697
14837 -9697 -8923 -9217 -8712 -11024 -23633 -28193 -21408 -28409 -14090 -4760 -15792 -32539 -19347 1347
14823 1347 3626 3465 -3068 -15115 -7129 4402 -29903 -39052 -20712 -9009 -9303 -7272 -14689 -2109
14809b109J3773j2099j5325L95l73J2718M607r703j0668M998J016J7059J560j3151
14795g302j4404m484N922o628L472J0675K4479q944j1405N507J083j2435m669
14782a9133j76J6595J1800J7337r989o109k0001q864J0295J445J0663o95J745
14769D913r666L419R975r445k8926j0671m031L3144J4364J7778K165r104q000
14756E915N944O460K65l462J1129l22q47j0562l607K969L801O350j0606Q828J0415
14741C2670j82r448j4119O628m742r432l1056j0264J6573K2763p186R372n139
14728c562k1717l695J0739K0264k841N851r179L67J0210l877j3438O262K96J55
14714d165O394P106O353K757l477j7010j128O414J965q812N936M286L938o674
$$ plain form
14809 -2109 11664 -435 -15760 -15365 -15738 -3020 1587 -8116 -18784 -13786 -12770 4289 5849 -7302
14795 -7302 -21706 -26190 -20268 -26896 -23424 -12749 11730 2786 -8619 -3112 -2029 -14464 -19133
14782 -19133 -19309 -2714 9086 26423 16434 10325 -9676 -18540 -8245 -6800 3863 3168 4913
14769 4913 -4753 -1334 8641 -804 -29730 -40401 -44432 -11288 3076 20854 23019 13915 5915
14756 5915 11859 18319 18584 15122 26251 25929 25082 14520 10913 13882 17683 24033 13427 22255 32670
14741 32670 32488 23040 8921 15549 10807 1375 -29681 -39945 -23372 -609 -7795 1577 -3562
14728 -3562 -25279 -28974 -18235 2029 -812 5039 -4140 -3773 6437 2560 -10878 -4616 -4320 -4165
14714 -4165 2229 9335 15688 18445 14968 -2042 -3170 3244 5209 -3603 2333 6619 10557 3883
14700C883J0002k819J2723J3347O573k7705k0405r763P676K6341n592k4888J764
14687h863k467K3128J2615n831L378p327j1539K443J706O26p704q314j1647n968
14673b5764J0783K8876o769n103J2816m325N695N452o638j5773j1184r942r568
14660c1444j1637j2733N396K1574J0546r075N179K2644K3824k322j8093R72q948
14647d117k0258m056j1319K056j0859k817M110m436J7040K1725N184j7474l825
14634b9046J0584k210p007Q16J6263K5328o889j4713j230J0278n500j0204n178
14621a8708Q575K6082O24J143p126L585j0549j851O605m238j0339l084P432K2842
14607B0993q847l1942j1526l4J6329K1642O874m457p876M597K5313R450j6231
$$ plain form
14700 3883 13885 11066 23789 37136 43709 16004 -4401 -14164 -6488 19853 14261 -10627 -8863
14687 -8863 -11330 11798 24413 18582 21960 14633 3094 5537 7243 7869 165 -8149 -19796 -25764
14673 -25764 -14981 13895 7126 2023 14839 10514 16209 21661 15023 -750 -11934 -21876 -31444
14660 -31444 -43081 -55814 -50418 -28844 -18298 -27373 -22194 450 24274 21952 3859 4831 -4117
14647 -4117 -24375 -28431 -39750 -37694 -48553 -51370 -47260 -51696 -34656 -12931 -7747 -25221 -29046
14634 -29046 -18462 -20672 -27679 -26863 -10600 14728 7839 -6874 -8104 2174 -3326 -13530 -18708
14621 -18708 -10133 15949 16573 17716 10590 14175 3626 1775 8380 4142 -6197 -9281 -1849 20993
14607 20993 12146 -19796 -31322 -31356 -15027 6615 13489 9032 1156 5753 31066 40516 24285
14594B4285l2135k1958Q44l753K826Q42R38J3876J24j8200j430k579P615M240
14580b4465n010J5230J2493J8582q050j5822j3238j1993K5725M242o274J0134
14568A554J0675k1886l3221k873K6317O152k295l523R36J7290j8973k686J3915
14555h618K1920k843p643P07oj6270R623j7854J9010K5564j0458j7059P099J0238
14541A3410j7325J3270J0138n198j2066P425k42q751L691L873J832J7581L748
14528C1386q979m808Q4J2555R759j3670k1345J8455N967j1631J5462o932k1019
14515E284j6019p189j945Q492r921L30q716j8669L0053L2309k1013k1999j0235
14502c9238L241J7076J4247r540M819N666J2909j0477P27M655J2352K0570m939
$$ plain form
14594 24285 -7850 -29808 -28964 -32717 -29891 -29049 -28111 -14235 -14111 -32311 -33741 -36320 -28705 -24465
14580 -24465 -29475 -14245 -1752 16830 8780 -7042 -20280 -32273 -6548 -2306 -8580 1554
14568 1554 12229 -9657 -42878 -45751 -19434 -13282 -15577 -19100 -18164 -874 -19847 -22533 -8618
14555 -8618 13302 10459 2816 3523 3517 -12753 -3130 -20984 -1974 23590 13132 -3927 3172 13410
14541 13410 -3915 9355 19493 14295 2229 9654 9412 661 4352 8225 10057 27638 31386
14528 31386 22407 17599 17683 30238 39997 26327 4982 23437 29404 17773 33235 26303 5284
14515 5284 -10735 -17924 -19869 -11377 -21298 -20968 -29684 -48353 -18300 14009 -7004 -29003 -39238
14502 -39238 -35997 -18921 -4674 -14214 -9395 -3729 9180 -1297 -570 4085 16437 37007 32068
14489C2068n062j6422j4647L415J3710J1696J1366n120l4832N795j292K38K05
14476A118k047r251q524n671J6416R027k106l7l699P887j115r305k509o884J8437
14461A737K2127j1684j0419K4963J7053M099j7394q835R472Q89N474l3635j8003
14448a4156J5274j1763j1887J2750k874j0625j506R683K7337K1479j57J4950j1172
14435C7333p425j1749k4500n210J9477M555M849J986j0982P070K013j5886j2356
14422a0825L3663Q340j538P74j8495M430P15j7043k00r938j0462q965m541J0002
14408b4083K1985J3978q345K166J8833J7080k631j7129k9176k9134N055J4673
14396a6728L634M135r995m726m155R992J9784J4781p974R056k0850j2321N407
$$ plain form
14489 32068 27006 10584 -4063 -648 13062 24758 36124 31004 -3828 1967 675 913 1118
14476 1118 -929 -10180 -18704 -24375 -7959 1068 -1038 -1075 -4774 3113 1998 -7307 -9816 -16700 1737
14461 1737 23864 12180 1761 26724 43777 47876 30482 21647 31119 32008 37482 3847 -14156
14448 -14156 1118 -10645 -22532 -9782 -12656 -23281 -24787 -15104 12233 33712 33555 48505 37333
14435 37333 29908 18159 -6341 -11551 7926 12481 17330 19316 8334 15404 17417 1531 -10825
14422 -10825 22838 31178 29640 30414 11919 16349 17064 21 -179 -10117 -20579 -29544 -34085 -24083
14408 -24083 -2098 11880 3535 5701 24534 41614 38983 21854 -7322 -36456 -31401 -16728
14396 -16728 -13094 -8959 -18954 -23680 -27835 -17843 1941 16722 8748 17804 -3046 -15367 -9960
14383i960p72j4495j4522M366J7475P410K534K3289J1913k0538j9574j9418j5774
14370d8066M803L784P492J4065Q859M172o86n325j91R234K0593N747j2087j6096
14356c702J6681J7359n133m455j86j695J299j9014Q165j079l781j1948J912K0703
14342A5126J1399M10k2197j0962J19K3164j2359j5015O079J390J3257k233O822
14329A5000l615Q568p593l100l98m176r984J6954J6687o903k2996j706r085J0135
14315b212k0231j9733k1917K9707L3969O419j0823j387j1346J1625J8955K5618
14303C8644r233j1485M893j1258j4842K100J2766K517j6501R293k1098j1223K9720
14290D293J7439m672r349M995Q699k4981j6172J6176J9144J5663j4357m633O029
$$ plain form
14383 -9960 -10732 -25227 -39749 -35383 -17908 -10498 -7964 15325 27238 6700 -12874 -32292 -48066
14370 -48066 -43263 -39479 -31987 -17922 -9063 -4891 -5577 -10902 -11093 -1859 18734 24481 12394 -3702
14356 -3702 12979 30338 25205 20750 20564 18869 20168 1154 9319 8240 4459 -7489 -5577 15126
14342 15126 26525 26935 4738 -6224 -6105 17059 4700 -10315 -4236 -2846 10411 8178 15000
14329 15000 11385 19953 12360 9260 8862 4686 -5298 11656 28343 21440 -1556 -3262 -12347 -2212
14315 -2212 -22443 -42176 -64093 -34386 -417 6002 -4821 -6208 -17554 -5929 13026 38644
14303 38644 29411 17926 22819 11561 -3281 -1181 11585 14102 -2399 6894 -14204 -25427 4293
14290 4293 21732 17060 7711 12706 21405 -3576 -19748 -3572 15572 31235 16878 12245 18274
14277A8274p640j0449n383l2371J944L1289K1816K610K168j1063M978m737L829
14264A5265k4308K944J9745R698j0026m107j1944l741k358L062m9N165l844j676
14250f174K0996O490j3934j5780O709K1321j245j0155o601j154J7847J8253J0952
14237D7525l771J3354j8391j0959o823j9623j9833J6888O402k043n1Q840j5737
14224d222N981O103j4682j418J3933J6129l217k2587l345J6J913O643m541k317
14210e611J2834K3764l736k3133j3227k612j1738R098J8681p202j1282K4430L1061
14197D1327N14l0479j2639o409L571K996j6947l074J8933R864j8914j5872O177
14184b0952M703p481j2093j2999q219R634K6988L6695r13o234J3826L856j2594
$$ plain form
14277 18274 10634 185 -5198 -37569 -35625 -4336 17480 20090 22258 11195 16173 11436 15265
14264 15265 -9043 -6099 13646 23344 13318 9211 -2733 -6474 -8832 -5770 -5819 -654 -4498 -6174
14250 -6174 14822 21312 7378 -8402 -1693 19628 18383 8228 1627 473 18320 36573 47525
14237 47525 43754 57108 38717 27758 20935 1312 -18521 -1633 4769 2726 2675 11515 -4222
14224 -4222 1759 7862 -6820 -8238 5695 21824 18607 -3980 -7325 -7309 -5396 1247 -3294 -5611
14210 -5611 7223 30987 27251 4118 -9109 -11721 -23459 -14361 4320 -2882 -14164 10266 41327
14197 41327 41841 11362 -1277 -7686 -4115 -1119 -18066 -21140 -2207 7657 -11257 -27129 -20952
14184 -20952 -16249 -23730 -35823 -48822 -57041 -47407 -20419 16276 15363 9129 22955 26811 14217
14171A4217j4054k1287J4060L5390R794p330j3542J0651L382O331l786k5155p137
14158A534q014j0159j206p989j790J2024K3311L310j0157L730L853Q340M380L029
14144B4196J281o770l973j196Q002M450r617j2400r957q381J528N727O629m325
14130d806j0606j2176J2832J5353n194j1413P567j0447k368J4852J6424K0395
14118C0413P023j507j7289r391k6090j2377l760j384n274J0358K7177J4717n705
14105F911K48O809j155q096k1361N952o336K0841q086L040j919K862q513k0407
14091b9210m688M332p24L945K0033j0534o641K9687J5241j1803r979n298L40o068
14077a1367J548r130r582K69N144K055J2923R879K821j6238j9176K1164L6706
$$ plain form
14171 14217 163 -21124 -7064 28326 38120 30790 17248 27899 31281 37612 33826 8671 1534
14158 1534 -6480 -16639 -17845 -25834 -27624 -15600 7711 11021 864 4594 8447 16787 21167 24196
14144 24196 25477 18707 14734 13538 21540 25990 16373 3973 -5984 -14365 -12837 -7110 -481 -4806
14130 -4806 -15412 -27588 -14756 597 -4597 -16010 -8443 -18890 -21258 -6406 10018 30413
14118 30413 37436 35929 18640 9249 -16841 -29218 -32978 -34362 -39636 -29278 -2101 12616 6911
14105 6911 7159 13968 12813 4717 -16644 -10692 -17028 3813 -4273 -1233 -3152 -290 -8803 -29210
14091 -29210 -33898 -29566 -30290 -26345 -6312 -16846 -23487 6200 21441 9638 -341 -5639 -5299 -11367
14077 -11367 -9819 -18949 -28531 -28262 -23118 -21063 -8140 1739 4560 -11678 -30854 -9690 27016
14064B7016J443k487r957P475J1169O049k1840j2602L366j0872j3142M133R381
14051h68K1316j2139j0218J2643J7746k500k2090l158j613r230Q366L6430n132
14038B9553L689Q228k4965l9706p201J9968K1372J329k287Q791j6360k880J1290
14025A0821K372q13L148M650k2780l3135J5692O634k6337k899L179J1570R083
14012a8815J1307q902j6837J8389J9748O695j1906j3503K4404Q746J8463N009
14000D2798o120j5964j0011n197L784k950L685J177J1740J2059L228n518q289
13987B4422N556m808R904K183k0006k5956k2343j225R331J09J3390J6474J7284
13974B4315r227j7370l109J5478l487j9200J8075P199o351N30n702K745J9001
$$ plain form
14064 27016 28459 25972 16015 23490 34659 40708 18868 6266 9632 -1240 -14382 -10249 -868
14051 -868 20448 8309 -1909 10734 28480 25980 3890 732 -881 -10111 -1745 34685 29553
14038 29553 33242 41470 16505 -23201 -30402 -10434 10938 12267 9980 18771 2411 -469 10821
14025 10821 13193 12380 15528 20178 -2602 -35737 -20045 -13411 -39748 -42647 -39468 -27898 -18815
14012 -18815 -7508 -16410 -33247 -14858 4890 11585 -321 -13824 10580 19326 37789 42798
14000 42798 36678 20714 10703 5506 9290 6340 10025 11202 22942 35001 38229 32711 24422
13987 24422 29978 25170 35074 37257 17251 -8705 -31048 -32273 -22942 -22833 -9443 7031 24315
13974 24315 15088 -2282 -5391 10087 6600 -12600 5475 12674 6323 6853 1151 3896 22897
13961B2897q016O425J2507p657l2630j0238K3349J1812j3938j8340m43m487M188
13948a4571J5942J6433J4173K7979j1083k3754j5558k0875j2279L1678n06k6437
13936a8858j0261j2498L30J8269J4081R228m82Q456k261q268k4789J2517J3488
13923a048j406R383j6527j6566K4619P00q178j5200Q495J5653q127L015k4538
13910b9725j4467p835m72k109J2536M652K4943L2399j0099j7400J0867p867P731
13897C154j407k4250k0598J2129M1497J8895p924k31K418k5528j0856r525r289
13884c1515n201J0661M102j2586j193M52j4150K5983K5864j725j3370J9119K0049
13871B6490l0515m4367o9O967j957J6449K0275k462n024J5753J9183J3774j0583
$$ plain form
13961 22897 14881 21306 33813 26156 -6474 -16712 6637 18449 4511 -13829 -14272 -18759 -14571
13948 -14571 1371 17804 31977 59956 48873 25119 9561 -11314 -23593 8085 7579 -18858
13936 -18858 -29119 -41617 -41287 -23018 -8937 291 -191 8265 6004 -2264 -27053 -14536 -1048
13923 -1048 -2454 6929 -9598 -26164 -1545 -845 -9023 -24223 -15728 -75 -8202 -5187 -29725
13910 -29725 -44192 -52027 -52499 -54608 -42072 -37420 -12477 19922 9823 -7577 3290 -4577 3154
13897 3154 1747 -22503 -43101 -30972 10525 29420 21496 21265 23683 -1845 -12701 -22226 -31515
13884 -31515 -36716 -26055 -21953 -34539 -35732 -35280 -49430 -23447 2417 692 -12678 6441 26490
13871 26490 -4025 -48392 -48461 -41494 -43451 -27002 -6727 -9189 -14213 1540 20723 34497 23914
13858B3914k5401j1813K3172K3216M980l641m978j1671k107O621j0866k0805R122
13845b57p074L126L1431o080j1454J7130j5108j5915K676J7920j927o614M759
13832A2613j774o345J4919P346p096k8546o150p558j573J0384p015O651k152l534
13818a9830k761j412k44K787j0747K4005K2719J545k0395k7150K89J9597J0072
13805a525j752j3219K5085J8993q924j1939R646r683p014P507J4287j5571k2566
13792a6675J3984p963J4603p299K3677L932j1478q34j0946o68O559N121j3598
13779a585j3924L382R484j233Q268J444J815q683l4250j8927K6514L5031J1229
13766A8565j1463m549p992l956J5453J9555j2388l305L709o414j2844R033O933
$$ plain form
13858 23914 -1487 -13300 9872 33088 38068 34427 29449 17778 15671 22292 11426 -9379 -257
13845 -257 -7331 -4205 27226 21146 9692 26822 11714 -4201 -1525 16395 14468 7854 12613
13832 12613 10839 4494 19413 26759 19663 -8883 -15033 -22591 -24164 -13780 -20795 -14144 -16296 -19830
13818 -19830 -22591 -24003 -24247 -21460 -32207 -8202 14517 16062 -4333 -31483 -31194 -11597 -1525
13805 -1525 -3277 -16496 8589 27582 18658 6719 16365 6682 -332 7175 21462 5891 -16675
13792 -16675 -2691 -10654 3949 -3350 20327 24259 12781 11947 1001 333 6892 12013 -1585
13779 -1585 -15509 -12127 -2643 -3876 4392 5836 7651 -1032 -35282 -54209 -27695 7336 18565
13766 18565 7102 2553 -5439 -9395 6058 25613 13225 9920 13629 7215 -5629 3404 10337
13753A0337L762N624j8304j0771P064J2853P378K926j1566m262J1367j537k5731
13740a0860J6119J8806j3869l0187r090J1363M527m092R019J2583o787J1738r998
13727g28j6992j4328j189M118J2209q54K68k691j5698M451J0286l060J1960J9555
13713G307K128m063P834l682J1368j5319q353k802J3096j652Q061j462k4259Q449
13699c349O756P266L528j8285j8182j2917O812J9363R393j5826l393L030M717
13686a1087J7416K239n868j231k800K0106J6500l333M587j3776k2746k0056n701
13673b5750J4345K2039P962O282j1385l1344j2240L6714J0090n764k132M399J6789
13660C0005J9801j3421p446r279l202q059L201p907o999l722Q365J4142J4081
$$ plain form
13753 10337 14099 19723 1419 -9352 -2288 10565 17943 20869 9303 5041 16408 14871 -10860
13740 -10860 5259 24065 10196 -19991 -29081 -17718 -13191 -17283 -8264 4319 -2468 9270 -728
13727 -728 -17720 -32048 -33237 -29119 -16910 -17764 -17496 -20187 -35885 -31434 -21148 -24208 -12248 7307
13713 7307 9435 5372 13206 9524 20892 5573 -2780 -5582 7514 5862 13923 12461 -11798 -3349
13699 -3349 3407 10673 14201 -4084 -22266 -35183 -28371 -9008 385 -15441 -18834 -15804 -11087
13686 -11087 6329 8568 2700 1469 -1331 18775 35275 31942 36529 22753 7 -20049 -25750
13673 -25750 -11405 10634 18596 24878 13493 -17851 -30091 6623 16713 10949 8817 13216 30005
13660 30005 49806 36385 28939 19660 16458 8399 11600 3693 -3306 -7028 1337 15479 29560
13647B9560n394j1514k2712j2080J2189R321k4781M68J7493J4206j7638n923k800
13634a9605r584j3114J8600J2853j6837J8460K7617J0873k8312k0157K2386L1243
13622C4423j3634j290J1345k8998K468J6780j6772K94K002J2192N003j0637m586
13609H590m031M056j2815M197J1205R935K163j2955m844K141L977q307k0228j299
13595a8215J9704P764P99L216q607p427J2970p311j5290K1683J1536j1824q228
13582G70K776m595j3336K2067P595q534Q29j5804r38n870M51q048j5294j0739
13568d8670R517K1619J7571J6482j4022j2278k6486j3895K7811J1695q970n531
13556b5157m302J9039L385l394k421J7110J7212m522j6673J0207k938J3865J1796
$$ plain form
13647 29560 24166 12652 -10060 -22140 -9951 -630 -25411 -24943 -7450 6756 -10882 -16805 -19605
13634 -19605 -29189 -42303 -23703 -10850 -27687 -9227 18390 29263 951 -19206 3180 34423
13622 34423 20789 19499 30844 1846 4314 21094 4322 4616 6618 18810 23813 13176 8590
13609 8590 4559 8615 -4200 -3 11202 21137 23300 10345 5501 7642 11619 3312 -16916 -18215
13595 -18215 1489 9253 10052 13268 4661 -2766 10204 2893 -12397 9286 20822 8998 770
13582 770 3546 -1049 -14385 7682 15277 6743 7572 -8232 -9170 -15040 -14589 -22637 -37931 -48670
13568 -48670 -39153 -17534 37 16519 2497 -9781 -36267 -50162 -22351 -10656 -19626 -25157
13556 -25157 -29459 -10420 -7035 -10429 -12850 4260 21472 16950 277 10484 7546 21411 33207
13543C3207J6119k649k5097j3190J9687J5120r343q380j2937q097K3934J426k5511
13530D289J102j1208Q187Q423n532j7273O171J7735J2555j5616j3905j8759k2421
13517d6252Q541L5085K0858j4610J3482J5759R298j0515r721j1949J2220N081
13505B7277j4743J2719k5402j5982J1373K351j1200j357R653J6988M255n897K230
13492A2265J682j4870R754K093J6817J0336J7110O000j1205k7248j7881J6317
13480B1170K1297J59j3j8072n704o761j2828J0192J3110j5691k2002K7763J8635
13467C1255o399k2639J652o931J7848J7218o804j7775k2569j3441J2361N267n79
13454a1536k250j5993j1655J5227K5600l534p578m618P975K2720J5256M15J1948
$$ plain form
13543 33207 49326 46677 21580 8390 28077 43197 33854 25474 12537 4440 28374 29800 4289
13530 4289 5391 -5817 2370 10793 5261 -12012 -5841 11894 24449 8833 -5072 -23831 -46252
13517 -46252 -37711 -2626 18232 3622 17104 32863 42161 31646 21925 9976 22196 27277
13505 27277 12534 25253 -149 -16131 -4758 -2407 -13607 -14964 -5311 11677 15932 10035 12265
13492 12265 13947 -923 8831 10924 27741 38077 55187 61187 49982 22734 4853 21170
13480 21170 42467 42626 42613 24541 18837 12076 -752 9440 22550 6859 -15143 12620 31255
13467 31255 24856 2217 3869 -3062 14786 32004 25200 7425 -15144 -28585 -16224 -10957 -11536
13454 -11536 -13786 -29779 -41434 -26207 -607 -4141 -11719 -16337 -8362 14358 29614 30029 41977
13441D1977o124m4727o26R549J5567j187J1143J5134k7329m399J7569K822L348
13428C2717j7332j6640J3414o005l858R291L862J3218K75o437j3766j0245J1388
13415I882K6276j1351j7617O161J1692L881j222m563Q63j5655n181J0914k1913
13402g833l1003j11J7270R483K763J361J4208P723j5686q597P096R685J7198J4
13388B3571j5759O343k930j4363m918R102J3195L729q031o748J1641Q190n703
13375A7319k1851J0265O336r219j5933M573J9869L932j6885j0976n060J1040k240
13362h830r634J040Q615J8127o331J5878J0077p730j0813q292r591P455N650k0141
13348a4520k2547Q59K1941K0532J0080n555J7910q242k1654j5306O237n953j7487
$$ plain form
13441 41977 35853 -8874 -9500 49 15616 14429 25572 40706 13377 8978 26547 29369 32717
13428 32717 15385 -1255 12159 6154 2296 11587 15449 28667 28942 22505 8739 -1506 9882
13415 9882 36158 24807 7190 13351 25043 28924 27702 23139 24002 8347 3166 14080 -7833
13402 -7833 -38836 -38947 -21677 -12194 -9431 -8070 6138 13861 -1825 -10422 -3326 6359 23557 23571
13388 23571 7812 14155 11225 -3138 -8056 1046 14241 17970 9939 3191 14832 23022 17319
13375 17319 -4532 5733 12069 2850 -13083 -8510 11359 15291 -1594 -12570 -17630 -6590 -8830
13362 -8830 -18464 -17424 -8809 9318 2987 18865 28942 21212 10399 2107 -7484 -29 5621 -14520
13348 -14520 -37067 -36208 -14267 6265 16345 10790 28700 20458 -1196 -16502 -10265 -16218 -33705
13335c3705J826K0909K896j6478N690J0905J3228j897r095q53j1503m969p706
13322c0752l324J4647J6633K0059j3986j2541m662K494J4678J9697j4425Q678
13310A7196N738o360K619L988k2799P7R218j3323j4773j0179P608l075k5870j5012
13296f4947l488n081m069M822J8459N2879j04J909J5255l087r046l60J5879n479
13282A3542r770K0535m116k1359p176J1657n018n747Q552Q619P033q337j2717
13269d302p71O691J5527M641j6514L193J01q241j2379j1436N513O222k3095J0259
13255b4591M389K3502N894p102j2525o001L732j1073J3517k132r965L216J440
13242a7699J299j1821J5214L017O991o086R140R621k28j7332k9957N256K2728
$$ plain form
13335 -33705 -31879 -10970 -8074 -24552 -18862 -7957 5271 3374 -5721 -6574 -18077 -23046 -30752
13322 -30752 -34076 -19429 -2796 17263 3277 -9264 -13926 -11432 3246 22943 8518 17196
13310 17196 22934 16574 19193 23181 382 459 9677 -3646 -18419 -28598 -20990 -24065 -49935 -64947
13296 -64947 -68435 -73516 -77585 -72763 -54304 -1425 -1529 380 15635 12548 3502 3142 19021 13542
13282 13542 3772 24307 20191 -1168 -8344 3313 -1705 -7452 1100 9719 16752 8415 -4302
13269 -4302 -5073 1618 17145 21786 5272 8465 8566 325 -12054 -23490 -17977 -11755 -34850 -24591
13255 -24591 -20202 3300 9194 2092 -10433 -16434 -12702 -23775 -10258 -12390 -22355 -19139 -17699
13242 -17699 -16400 -28221 -13007 -9990 -2999 -9085 55 9676 9448 -7884 -37841 -32585 -9857
13229i857J0411R736O244q676K48N210L67L404j6771j8853p078O681l282K048
13215b0168K178j4506Q455Q907J211K0359J2265J0816n054L842m610j2941m987
13202E767N090L267m169J8781J1991l6528n30j890k362n157j7723J4007L9761
13189C0305O448Q535P885j2840n059j30k380p592j375Q619N543J0337j9859n791
13175B2646n262j8162m695p054K0620K0527j3372j2942N400N414N090Q207q112
13162A8305j0980Q407j8711j0276J1857r667l498R593o17j033J0243m491P468
13149F600N964j50j0319j505M036J6447J3498j8052n455J456q762l395N730J9947
13135B6040K044M557j895j259k50M303q082k0298j8936K2066K2047J1088j1307
$$ plain form
13229 -9857 554 10290 16534 7858 8106 13316 13683 17087 316 -18537 -25615 -18934 -22216 -20168
13215 -20168 -17990 -32496 -24041 -15134 -13923 6436 18701 29517 24463 28305 23695 10754 5767
13202 5767 10857 14124 9955 28736 40727 4199 3669 1779 -583 -5740 -23463 -9456 30305
13189 30305 36753 45288 53173 40333 35274 35144 32764 25172 23797 32416 37959 48296 28437 22646
13175 22646 17384 -778 -5473 -12527 8093 28620 15248 2306 7706 13120 18210 26417 18305
13162 18305 7325 15732 -2979 -13255 -1398 -11065 -14563 -4970 -5587 -6620 3623 -868 6600
13149 6600 12564 12414 2095 590 4626 21073 34571 16519 11064 12520 3758 363 6093 26040
13135 26040 28084 32641 30746 29487 29237 33540 25458 5160 -13776 8290 30337 41425 30118
13122C0118k9921J3211J0681Q587r264l89J962P92j5185N128P518j6044r252J8408
13108A6350K0955j025p399r512p343j601J631l490k645J0612k791N909J160k88
13094B0523m382k2770N226k0510m765Q838K9118K657r756J6512J5792Q561j7721
13081B7323j7380k0600K086J8535K528K940j1812j8560l351J2664J1680L4449
13069D0502l700J723j015j8204k2549m310L706J3617l531P532K2206j1988J6700
13056D0689J813m0866j1137K4790j809j9096l913M484J595n564j3648J9364J9274
13043A5976J5308n724j5669L700j5745k1695j5170J7081j1610K655r7p825J305
13030c7510J128P867O312J7484L442J0121R805Q541r213l169J5960k281j3681
$$ plain form
13122 30118 197 13408 24089 32676 23412 23023 24985 25777 10592 15720 23238 7194 -2058 16350
13108 16350 37305 36280 28881 19369 12026 10425 12056 8566 5921 16533 13742 19651 20811 20523
13094 20523 16141 -6629 -1403 -21913 -26678 -17840 11278 13935 4179 20691 36483 45044 27323
13081 27323 9943 -10657 -8571 9964 12492 15432 3620 -14940 -18291 -5627 6053 40502
13069 40502 36802 38525 37510 19306 -3243 -7553 -3847 9770 6239 13771 35977 23989 40689
13056 40689 42502 1636 -9501 15289 13480 -5616 -9529 -5045 -3450 -9014 -22662 -3298 15976
13043 15976 31284 25560 9891 13591 -2154 -23849 -39019 -21938 -33548 -30893 -30990 -38815 -37510
13030 -37510 -36382 -28515 -22203 -4719 -1277 8844 18649 27190 17977 14808 30768 28487 14806
13017A4806j4216m709k0638j5601J236J5365J7699K909L064k446j271k979r667
13004a6448k656j9650J2148P096P975N174m557o314R65K1412o098k9470k5879
12991e6302K846J9977K3504j7935r066J5782O446J0464l015J8232j26j0167k721
12978b081p434n335J0197M95J0386o161Q01J5386J2181q022k2273k083J466O797
12964D320j6989j5734R710J1034K6608O008k3086r280J6279K588m910J2607J1856
12951C1011R718J1522K890j4536j5069q498j5825L364J353j2211J2856J5842p053
12938A5364j6937q258P420j0529Q594K6840P612l009j197j0980O753Q783N362
12925C5818k1306j4276M619j3161j2176R694j0355j1402K2482J388J1864n109
$$ plain form
13017 14806 590 -4119 -24757 -40358 -39122 -23757 -6058 -3149 -85 -2531 -3802 -6781 -16448
13004 -16448 -19104 -38754 -26606 -19510 -11535 -6361 -10918 -17232 -16267 5145 -953 -30423 -56302
12991 -56302 -53456 -33479 -9975 -27910 -36976 -21194 -14748 -4284 -7299 10933 10807 640 -2081
12978 -2081 -9515 -14850 -4653 -4158 6228 67 868 16254 28435 20413 -1860 -3943 -2477 4320
12964 4320 -12669 -28403 -18693 -7659 18949 24957 1871 -7409 8870 11458 6548 19155 31011
12951 31011 40729 52251 55141 40605 25536 17038 1213 4577 5930 -6281 6575 22417 15364
12938 15364 -1573 -9831 -2411 -12940 -4346 22494 30106 27097 25900 14920 21673 30456 35818
12925 35818 14512 236 4855 -8306 -20482 -10788 -21143 -32545 -10063 -8675 3189 -1920
12913a920j1682J1468J0181l219P215j6896m704n968J2849J2127J886K536M639
12900A8512j3342j4059O624K458M309N033l715j5179j1416J891J2583K1128L613
12887A8440k426M95j7190l901L5049k449j6275p78Q550Q995l835Q042K210r136
12873B5791p977O758k061j2126k293p472j196N927j3778M870J7102K0059N14K171
12859C6289r763k1019N98N518j5899N876J8057j3126P081K4317R401o73q370k8199
12845A0088r640r165P105O420M894M252J7354j6313J5495p89k093m243j9886Q11
12831D290J837o897p000j0382k855J4917K1747J2094J1985k6492j7036J1865j3339
12818e266L138N549R403M595M86j3602l024j5450j4183n604K5142J0908J4045
$$ plain form
12913 -1920 -13602 -2134 8047 4828 12043 -4853 -9557 -15525 -2676 9451 11337 13873 18512
12900 18512 5170 -8889 -2265 193 4502 9535 5820 -9359 -20775 -18884 -6301 14827 18440
12887 18440 16014 16509 -681 -4582 30467 28018 11743 10965 19515 28510 24675 32717 34927 25791
12873 25791 17814 24572 22511 10385 8092 620 -576 5351 -8427 -3557 13545 33604 34118 36289
12859 36289 26526 5507 6105 11623 -4276 1600 19657 6531 13612 37929 47330 46657 38287 10088
12845 10088 448 -8717 -1612 4808 9702 13954 31308 14995 30490 29701 27608 23365 3479 4290
12831 4290 6127 -770 -7770 -18152 -21007 -6090 15657 27751 39736 13244 -3792 8073 -5266
12818 -5266 -2128 3421 12824 17419 17905 4303 1279 -14171 -28354 -33958 -8816 2092 16137
12805A6137M678m556k3794P44J0484j3095j0105j5756Q798j9293J0370L4687k904
12792c605r45K6919J877r340q227J4922j5467k0565N035j1583j3078J8169K8097
12779A2209P00J883k349k6724K2445N38l5321M76J2776N663J0964J4791j6663
12766A388r596j8572l349J7664K41P195J4496K0157Q339k1203o64M353o686J090
12752A4853O562j2574q403K092k0078j578J0680K7478J1068l943k1236j8257O321
12739g015K036L480J8268K907J931r690r703K0150m687j6341N579M899Q24O107
12725A8745L0724L1423o717l1011l8950J0197K3420n210j0598j9606L249J5724
12713B1390j2046j5251j6385K145J9660L665m503J3392o420O253M341P030j3376
$$ plain form
12805 16137 20815 16259 -7535 -6791 3693 -9402 -19507 -35263 -26465 -45758 -35388 -701 -3605
12792 -3605 -4550 22369 24246 14906 6679 21601 6134 -14431 -9396 -20979 -34057 -15888 12209
12779 12209 12909 14792 12443 -14281 8164 8702 -26619 -26143 -13367 -7704 3260 18051 1388
12766 1388 -8208 -26780 -30129 -12465 -12224 -5029 9467 29624 37963 16760 16096 20449 13763 14853
12752 14853 21415 8841 438 2530 -17548 -19126 -8446 19032 30100 26157 4921 -13336 -7015
12739 -7015 -4979 -1499 16769 19676 21607 11917 2214 22364 17677 1336 6915 11814 12638 18745
12725 18745 49469 80892 74175 43164 4214 14411 37831 32621 22023 2417 5666 21390
12713 21390 9344 -5907 -22292 -20147 -487 3178 -1325 12067 5647 11900 16241 23271 9895
12700I895k284N974j1742k9301k2062L562J4807J1222O198j1440N402m590Q420
12687a5939J3627M490P798J9355m816k468k0003k4868J1537K2754J5551o023J1681
12674C2676j1257p800j1135J0681N361P795N468J0981J81l2322k0277p669j027
12661a8344J2833M895n669k574L450p046N585N62m375K658L901J8010N977j3444
12647F419j7705q560Q282J7185O0j9151k0997O527K6458J1228j9838P405j208
12634c895R515L0595k5119L660J1599k3483M488j3442j1973K4744J3649J2278
12622C2616j3567k0129j038J5729P832j3401k1239j2099J4056M1923J454k6490
12610E647L529N841j2306j1581J2784j596k316J1379j9546n299L387k071J2731
$$ plain form
12700 9895 7611 13585 1843 -27458 -49520 -45958 -31151 -19929 -13731 -25171 -19769 -24359 -15939
12687 -15939 -2312 2178 9976 29331 24515 22047 2044 -22824 -11287 11467 27018 20995 32676
12674 32676 21419 13619 2484 13165 18526 26321 31789 42770 42951 10629 -9648 -17317 -18344
12661 -18344 -5511 -616 -6285 -8859 -5409 -12455 -6870 -6308 -10683 -8025 -4124 13886 19863 6419
12647 6419 -11286 -19846 -11564 5621 5681 -13470 -34467 -27940 -1482 9746 -10092 -2687 -3895
12634 -3895 5620 36215 11096 14756 26355 2872 7360 -6082 -18055 6689 20338 32616
12622 32616 19049 -1080 -2118 13611 21443 8042 -13197 -25296 -11240 30683 32137 5647
12610 5647 9176 15017 2711 -8870 3914 2318 2 11381 -8165 -13464 -10077 -12148 583
12597E83n994M645J5658Q101k4369l476k7888j4100J613J5336K7824n408R239
12584A764O781l4284P895N1735P31j3665k2723P295N682j904N797P687N265L510
12570C1566m270p137q354M086l79m198j2876L157k7821k750P963K1756L844k424
12556B163j1795N651J0988J3121K236k9090M962M726p501J2555J9006K074K159
12543C1255m656l508k244J5864j1507j0299Q490j5133j0809J7587R483J010R917
12530C5450K1398k1227k3707j362k369K874J8628o423r297J7213J8807J1971j7213
12517D4743l63k6770r564k3304J4747K4820M155p444l672p055l084k653N849M662
12503A5067j444m939L105P084J6357K1958J2187k9308K764K7072j8847j6528j9539
$$ plain form
12597 583 -5411 -766 14892 22993 -1376 -4852 -32740 -46840 -45227 -29891 -2067 -7475 1764
12584 1764 8545 -25739 -17844 33891 34622 20957 -1766 5529 11211 9307 15104 22791 28056 31566
12570 31566 27296 20159 11805 15891 15512 11314 -1562 1595 -26226 -28976 -21013 743 4587 2163
12556 2163 -9632 -3981 7007 20128 22364 -6726 -1764 2962 -4539 8016 27022 29096 31255
12543 31255 26599 23091 20847 36711 25204 14905 23395 8262 -2547 15040 24523 25533 35450
12530 35450 56848 35621 11914 10552 8183 11057 29685 23262 13965 31178 49985 61956 44743
12517 44743 44380 17610 8046 -15258 -511 24309 28464 21020 17348 10293 7209 4556 10405 15067
12503 15067 13623 8684 11789 18873 35230 57188 69375 40067 42831 69903 51056 34528 14989
12490A4989Q543k059r078L45J3066J0210k0087j87l113K0536J54j1604J3103Q663
12476D3481M752j384k0458L501J2215n265k0495j2107M704R114J4000M003q359
12463B7702J788J275K411k63k864k452l771j296k455K618J0975j88l455J1853
12449D1878j0512K954P539l218j1157J0708J65k70M11K972J4586q099M703n55
12435E2105l80q966J0405k39k839l989N932M326k7849k9203l804R197Q56J3396
12421A8948J47N26O478M520J093j3985r190R961J9669M498R229K304j9329M91
12407C5360m629J8788N729k2506r544n8j624n400j4830j514N350K0045o284j2087
12393F796M756R669j2640p356K3617K4298j2299P25p271p453K1950J338J9275
$$ plain form
12490 14989 23532 21473 12395 12740 25806 36016 15929 15742 12629 33165 33319 21715 34818 43481
12476 43481 48233 46849 26391 29892 42107 36842 16347 4240 8944 18058 32058 36061 27702
12463 27702 29490 30765 33176 32913 30049 27597 23826 22530 20075 22693 33668 33480 30025 41878
12449 41878 31366 34320 41859 38641 27484 38192 38357 38087 38498 41470 56056 47957 52660 52105
12435 52105 51725 42759 53164 52925 50086 46097 52029 56355 28506 -697 -4501 4696 5552 18948
12421 18948 19095 19621 26099 30619 31712 17727 8537 18498 38167 42665 51894 54198 34869 35360
12407 35360 30731 49519 55248 32742 23198 23140 21516 16116 1286 -228 5122 25167 18883 6796
12393 6796 11552 21221 8581 1225 24842 49140 36841 37566 30295 22842 44792 46130 65405
12380F5405o642j2866q018k119k480p677k2818o631K3857K0178N942l759R349
12367E1721L562j8228o043J2202j4013J193M189N613r821k4415j9621K5173L5542
12354D7054p041j0387j1282J778q25o601l633q646K1949K9717m591j0900J0231
12341D6823j2573J679j0346j9004Q579K2810J4761M303J1398J5936L030Q679j5747
12328H0328l793j4926M854P22j1729l79k914l7104j3730p49J2620J2695J2702
12315C8597j3689N146J2894J3902j6343R705j810J1847p530K543K270j2156R643
12302E5019n105m349O035p000O387o794Q66P100m57j3999Q540j1712m697Q060
12288C7894L037J252M532K6219Q769l4300l6360L78J196J0178J6219l35j745M363
$$ plain form
12380 65405 58763 45897 37879 35760 33280 25603 2785 -3846 20011 40189 46131 42372 51721
12367 51721 55283 37055 31012 43214 29201 30394 34583 40196 30375 5960 -13661 11512 47054
12354 47054 40013 29626 18344 20122 19297 12696 9063 417 22366 52083 47492 36592 46823
12341 46823 34250 35929 25583 6579 15158 37968 52729 57032 68430 84366 87396 96075 80328
12328 80328 76535 61609 66463 67185 55456 55077 52163 15059 1329 580 13200 25895 38597
12315 38597 24908 30054 42948 56850 40507 50212 48402 60249 52719 55262 57532 45376 55019
12302 55019 49914 45565 51600 44600 50987 44193 45059 52159 51702 37703 46243 34531 29834 37894
12288 37894 40931 42183 46715 72934 81703 47403 11043 11421 12617 22795 39014 38679 36934 41297
12274D1297l650J3723K0752R211j0382J5946j998O521J288j9060j6824j0734J030
12261D7120M775J2600K5221Q205j625J1397j871k4719J0555K4339J2151j4103
12249A14045l594j6949k3829o757O272m963K81O940K1915R879N69j6378L325K7823
12235A18579K299m2971l4064m359R000o409K8298J8979J850p988J0110j0479q544
12222G4301K1684J1325j3239R464k461o705K410J5150o262k388l233J5112M048
12209A19206J8789K974j8850j7623p85q170q483K2770k141j9519Q25L4373J615
12196A24981o688k0325j6348J7318K6549j4583K9662L4352j4167j6858k0299n861
12184A17733q154N582N012j8197k499J7357K6794R028j1522q729j3831j615J478
$$ plain form
12274 41297 37647 51370 72122 81333 70951 86897 84899 91420 92708 73648 56824 46090 47120
12261 47120 51895 64495 89716 97921 96296 107693 105822 81103 91658 115997 128148 114045
12249 114045 110451 93502 69673 62916 69188 64225 64506 71446 93361 103240 103809 87431 90756 118579
12235 118579 120878 77907 43843 39484 48484 42075 70373 89352 91202 83214 93324 82845 74301
12222 74301 95985 107310 94071 103535 101074 94369 96779 111929 105667 103279 100046 115158 119206
12209 119206 137995 140969 122119 104496 103711 95541 87058 109828 107687 88168 88993 123366 124981
12196 124981 118293 97968 81620 98938 125487 110904 140566 174918 160751 143893 123594 117733
12184 117733 109579 115161 120173 101976 99477 116834 143628 152656 141134 132405 118574 116959 118437
12171A18437Q876P239J0236O204n407q273r412J7861n728K3808r737j925P320
12158A59499O680j694j909j5769R056m813O642L0258J2219j2122k9894j0201J0577
12145A58529J9053K5846q542j1729r897k370M27M614k3157o541K4698L612L953
12132A78496J7239L0471q915q116j5120L440k068j1343j5783J8373N269M212m604
12119A91551j2249n832J036L924R792K208K4070L937j8749J1684K895n260O524
12106B15531K0839l395J041J2558J6187L233J620j1507J2190J254q083j549l678
12093B56241m649J755K2738K090J8258k615K1649j0688k0605K0764m886j2394
12081B87658M71O573O125K289n515N712J8895J6489J3655j4291J2751M248J4121
$$ plain form
12171 118437 127313 134552 144788 150992 145585 137312 127900 145761 140033 163841 154104 152179 159499
12158 159499 166179 164485 162576 146807 155863 151050 157692 187950 200169 188047 158153 147952 158529
12145 158529 177582 203428 194886 183157 173260 170890 171317 175931 152774 146233 170931 174543 178496
12132 178496 195735 226206 217291 209175 194055 197495 195427 184084 168301 186674 191943 196155 191551
12119 191551 179302 173470 174506 178430 188222 190430 214500 218437 199688 211372 214267 209007 215531
12106 215531 236370 232975 234016 246574 262761 265994 267614 256107 268297 269551 261468 259919 256241
12093 256241 251592 253347 276085 278175 296433 293818 315467 304779 284174 304938 300052 287658
12081 287658 288129 294702 300827 303116 297601 303313 322208 338697 352352 338061 350812 355060 369181
12068C69181K740J3343J1511P998O134j4321n037J0284l591J4145J5093Q938M766
12055D41184K594p756J050K3051K9043J7074j7124K2346J7Q53j4279P082J883
12042E07018R892J1493K5301J2892K5816n958j5328J5967K6511J5339J4636l275
12030F40304o448P552L0878K6463N782R210k883K5522L5263K7740P624p923L342
12017H02426l310l696J9523K1466J9487O914K3023o549O277J380K0613N1839K6919
12004I86312J1121J7871J2821o977J8514M1536K9947J3696K6784L901R564J5380
11992A180470M6698M9595M6121l080K3514M7190K4974L6105K1218J4313J4256
11981A501374L5030K0824K1409K7348L9088L1297L1040M2447K9362j009K4418
$$ plain form
12068 369181 371921 385264 396775 404773 410907 396586 391549 401833 398242 412387 427480 436418 441184
12055 441184 443778 436022 437072 460123 489166 506240 489116 511462 511479 512332 498053 505135 507018
12042 507018 516910 528403 553704 566596 592412 586454 571126 587093 613604 628943 643579 640304
12030 640304 633856 641408 672286 698749 704531 713741 710858 736380 771643 799383 807007 799084 802426
12017 802426 799116 795420 814943 836409 855896 862810 885833 879284 885561 886941 907554 959393 986312
12004 986312 997433 1015304 1028125 1021148 1039662 1081198 1111145 1124841 1151625 1155526 1165090 1180470
11992 1180470 1227168 1276763 1322884 1319804 1343318 1390508 1415482 1451587 1472805 1487118 1501374
11981 1501374 1536404 1557228 1578637 1605985 1645073 1676370 1707410 1749857 1779219 1778210 1802628
11970A802628K8166M3683K4513K8199L4467L4944K7371L8746K4383J4109M5263
11959B146472J744L1456Q0934O9368K5813J4131L708L0547L3993K9485J1707J7755
11947B497113J4138L1307L4771K7751L2139L2737j6114J375Q356J9742K0374R673
11935B713362j4371j9359j4208N702k22q783J8082j7503l9849k491J6098q06j9578
11922B616074k9080l0759j9087r267j2409l2584l2048k9737k3162m546j8171m2526
11910B332698m3798m8932k2340k2254l4245l0559P953l438m7395o5958m4166l8051
11898A939515j4144j6468l2602n1812l0546k8914j9176j2408k9546n8337k5653
11887A619909j8741l2247k7969k4254m1026j6842k9078k0298j7321k3976j3205
$$ plain form
11970 1802628 1830794 1874477 1898990 1927189 1961656 1996600 2023971 2062717 2087100 2101209 2146472
11959 2146472 2148216 2179672 2260606 2329974 2355787 2369918 2373626 2404173 2438166 2467651 2479358 2497113
11947 2497113 2511251 2542558 2577329 2605080 2637219 2669956 2653842 2655217 2663573 2683315 2703689 2713362
11935 2713362 2698991 2679632 2665424 2671126 2670904 2662121 2680203 2662700 2622851 2620360 2636458 2635652 2616074
11922 2616074 2586994 2556235 2537148 2527881 2515472 2482888 2450840 2421103 2397941 2393395 2375224 2332698
11910 2332698 2288900 2239968 2217628 2195374 2161129 2130570 2138523 2135085 2087690 2021732 1977566 1939515
11898 1939515 1925371 1908903 1876301 1824489 1793943 1765029 1745853 1733445 1703899 1645562 1619909
11887 1619909 1601168 1568921 1540952 1516698 1475672 1458830 1429752 1409454 1392133 1368157 1354952
11876A354952j4580k7071j8672k7655k7392k6919k5245j9612k1169k5451k4845
11865A096341k1963n78m478j5941l0532m4125l8043j4078j045P809k0927k4751
11853H87689l6801k9373J400o230Q609r331j0820j2428j8769j1205j4258k2165
11841G26318j4643k4652j9076O955j0001j0952M178r422k6141j2453k4483k874
11829E82754j5986r836J9704k341k2816N64O745j390k2582j9953p822q791k3192
11816D75058n076N592p98j1144j507O481j2356j9949k507l108j2724l1247j145
11803C85570J3827j4148j1640j673j1988K302P76j508j4954j471Q079M864l039
11790C54997k446j4435Q29J0189O25k3655j4220p383K660j8158k852K883R859
$$ plain form
11876 1354952 1340372 1313301 1294629 1266974 1239582 1212663 1187418 1167806 1146637 1121186 1096341
11865 1096341 1074378 1073800 1069322 1053381 1022849 978724 940681 926603 925558 933367 912440 887689
11853 887689 850888 821515 822915 816685 825294 815963 805143 792715 773946 762741 748483 726318
11841 726318 711675 687023 667947 674902 664901 653949 658127 648705 622564 610111 585628 582754
11829 582754 566768 556932 576636 574295 551479 552043 558788 557398 534816 514863 507041 498250 475058
11816 475058 469982 475574 474776 463632 462125 468606 456250 436301 433794 430686 417962 386715 385570
11803 385570 399397 385249 373609 371936 359948 362250 363026 361518 346564 345093 353172 358036 354997
11790 354997 352551 338116 338945 349134 349759 326104 311884 304501 307161 289003 286151 289034 298893
11777B98893J0970jK023j3919p104n489k230J1677q069k6624k7629J792M088L200
11763B41578P465j4205m337K946J1044L0262j452j8232J8715J0761k7459j0245
11751B46841j3721m108j43j8953q115j016J1976R194n830k4139j0093J1720j6877
11738A76736q743J5762K656J807R593l809m503k218k0174J603J2270j1062J503
11725A71421j2499j4584k514j2199Q123K4556j0488r320j2325J3680K1595k459
11713A62987J576j1901n938K243q443k489k990n851J0788J6674P38L058j9301
11700A41151j2419n311N43J9992M188m936J745k9869q953r089p022R251L037L7069
11686A39377J1447j8430J3694N42J714j6759q36L0086j5095n061l615k273n296
$$ plain form
11777 298893 309863 309862 311885 297966 290862 285373 283143 294820 286751 260127 232498 234290 238378 241578
11763 241578 249043 234838 230501 233447 244491 274753 273301 255069 273784 284545 257086 246841
11751 246841 233120 229012 228869 209916 201801 200785 212761 221955 216125 191986 181893 193613 176736
11738 176736 167993 183755 186411 188218 197811 194002 189499 187281 167107 168710 180980 169918 171421
11725 171421 158922 144338 141824 129625 137748 162304 151816 142496 130171 143851 165446 162987
11713 162987 164563 152662 146724 148967 140524 138035 135045 129194 139982 156656 157394 160452 141151
11700 141151 128732 123421 123964 143956 148144 143208 144953 115084 106131 97042 90020 99271 102308 139377
11686 139377 150824 132394 146088 146630 148344 131585 130749 160835 145740 140679 137064 134791 129495
11673A29495j4990k5764M474J5586k704j4518j575p001J0614J4930J9136q908
11661A18775j9257j2815l771p291m932k8025J0028J7796j421K924P782J506O06
11648H1905Q034K4350j2970l7359j3145J1814K7463J938K3968J0991k1017j7243
11636H8729j1692p646J8363L3078L209k9050l1938q502l324N698p469K225J0731
11623F2412K508J04J1741n98O083m745j427J9815m214o739j6408L924r27J5350
11609H6879O97l1453O215J4324j040k4341J1524J9020o238j8527j0538r483J111
11596C8150j6822Q855J8683J132K37j6067o853J3329j084M814J3050o49q592j4455
11582C3728J496p120k3753k69K118q704K6852J5285L645J1453j855p747K563o205
$$ plain form
11673 129495 114505 88741 93215 108801 106097 91579 90004 83003 93617 108547 127683 118775
11661 118775 99518 86703 82932 75641 70709 42684 52712 70508 69087 72011 79793 81299 81905
11648 81905 89939 114289 101319 63960 50815 62629 90092 92030 115998 126989 105972 88729
11636 88729 77037 69391 87754 120832 124041 94991 63053 54551 51227 56925 49456 51681 62412
11623 62412 64920 65024 76765 76167 82250 77505 76078 95893 91679 84940 68532 72456 71529 86879
11609 86879 87576 56123 62338 76662 75622 51281 62805 81825 75587 57060 46522 37039 38150
11596 38150 21328 30183 48866 49998 50235 34168 27315 40644 39560 44374 57424 56775 48183 33728
11582 33728 35224 28104 4351 4082 6200 -2504 24348 39633 43278 54731 52876 45129 47692 41487
11568D1487J6581R068q731j7893K3985K801p392j9217k8520J1757K4814K1730
11556G0470J538m078j5158J0057J0155j1241M695j548R242M624p654L556k2969
11543E1689k2815Q032j768j247n64l302j6960L752J376K1397J4546j3719q112
11530C2305l448J2740j442L5474J656j2679J5564j1364j992J852q430l120L728
11517F0844J5841k4935P368J0492j4643L457Q469k686j2832k0009j5193J9019
11505C5192j111p883p51K1582J002j442j204j4540j4200j7003K0784L6218J9865
11492G6509j7309j8101R733N751K7241o181j2982m163jj5766j1725r924J2549
11479C5631K4199j3915k3447j858J7031r666q910m933J6783M399j6965J2593L79
$$ plain form
11568 41487 58068 67136 58405 40512 64497 67298 59906 40689 12169 23926 48740 70470
11556 70470 72008 67930 52772 62829 72984 61743 66438 64890 74132 78756 71102 74658 51689
11543 51689 28874 36906 35138 33891 33327 30025 13065 16817 18193 39590 54136 40417 32305
11530 32305 28857 41597 40155 75629 77285 64606 80170 68806 66814 68666 60236 57116 60844
11517 60844 76685 51750 59118 69610 54967 58424 66893 64207 51375 31366 16173 35192
11505 35192 34081 26198 25447 47029 48031 46589 45385 30845 16645 -358 20426 56644 76509
11492 76509 59200 41099 50832 56583 83824 77643 64661 60498 60497 44731 33006 23082 35631
11479 35631 59830 45915 22468 20610 37641 27975 19065 14132 30915 35314 18349 30942 31321
11466C1321N671j5745k5785j9521O927P470J0434K7160J3254j4568J4872p81J962
11453D2671K134l975J1534l792k448k9856k4787J1722o693o878J4082J9827K1109
11440D4650k5583K466l666j6307O606K4175k452j0654j5981j7025J132P877J2299
11427G537L329J858j0493J865J4567K587J1744K725j6530K834J123L263k363n580
11413A8466j7100J6555J0628r404J4164R510k9829j5789N169j0705O924N187k1223
11400a7447j3526P96Q526J3228r04r353m126J3649K392J01J4867J7442J282j2970
11386A3957J5143k0q490k0013j888J5494J0392J3248K138L219j7110n167o747
11373A4156o540M21k038j9464L530J995K947K724j4256r57Q350K3534J4077q950
$$ plain form
11466 31321 36992 21247 -4538 -24059 -17132 -9662 772 27932 41186 26618 41490 40709 42671
11453 42671 44805 40830 52364 48572 46124 16268 -8519 3203 -3490 -10368 3714 23541 44650
11440 44650 19067 21533 17867 1560 8166 32341 29889 19235 3254 -13771 -12639 -4762 7537
11427 7537 10866 12724 2231 4096 18663 21250 32994 35719 19189 22023 23146 26409 24046 18466
11413 18466 1366 17921 28549 19145 33309 42819 12990 -2799 2370 -8335 -1411 3776 -17447
11400 -17447 -30973 -30177 -21651 -8423 -9327 -18680 -22806 -9157 -6765 -6664 8203 25645 26927 13957
11386 13957 29100 29080 20590 577 -1311 14183 24575 37823 39961 43180 26070 20903 14156
11373 14156 7616 8037 5999 -13465 -9935 -7940 -4993 -2269 -16525 -17482 -9132 14402 28479 19529
11359A9529j258k3497j428Q663q64J6221N999L30j0040J6736K088n05j2101r930
11345I943p584j7523k3693r968Q608K8106J3513N247n633m863J5669N761j2749
11332D834K71J8631M018j199j2971O573p797J6906L7003P590q262k0873l499P087
11318D8312r993P74O970j4295k4419J1648K85J239R534k0518N939K786j4983M625
11304G904j1106j5385L888L9195J9943q164p104n303q003k0562j7351J053O068
11291a4927M964Q4R017P408K1011q983M659M015j4644J1606P029j5785N48j6362
11277c60n674J866L2928q476k9585o809K874N355P032O36r600r07P115J7327k5992
11262a2270k5777l074J0377j911K64J7471L7068K159J5909m053M448O662l3929
$$ plain form
11359 19529 18271 -5226 -6654 2009 1145 17366 23365 23695 13655 30391 32479 31974 19873 9943
11345 9943 2359 -15164 -38857 -48825 -40217 -12111 1402 6649 1016 -3847 11822 17583 4834
11332 4834 5105 23736 27754 26555 13584 20157 12360 29266 66269 73859 65597 44724 41225 48312
11318 48312 38319 39093 46063 31768 7349 18997 19282 20521 30055 9537 15476 18262 3279 7904
11304 7904 -3202 -18587 -14699 24496 44439 36275 29171 23868 15865 -4697 -22048 -20995 -14927
11291 -14927 -9963 -9879 -862 6546 27557 18574 23233 27248 12604 24210 31239 15454 16002 -360
11277 -360 -6034 -4168 28760 20284 -9301 -16110 -13236 -7881 -849 -213 -9813 -10720 -3605 13722 -12270
11262 -12270 -38047 -41121 -30744 -32655 -32391 -14920 22148 24307 40216 36163 40611 47273 13344
11249A3344m0666J375J1638L567L055j2624k841M704K1922J9052k2683j6762M423
11236a2496J6839J3776j9458O571K0652R781n71k2698k5914j0632K350J0138K3664
11223A2002K1898m668r099k966J7444J5613j9762K123k3442k5492M397L10R107
11210b535j529k1467j9983K7084J9777M916J65l0665l4452j90J3262M850Q859
11197c1908N923J2510J5365Q012j8252k3253l156J8522P499J4315J4147j2548
11185G176j3365m898K0805J6949J3806k4979j0778O63l78k6641k4080K18J0808
11172c4694K0705K187j4707J6344J4306J774Q836P955M418j1897K844m99j5955
11159A617q954k9594q34L5839J5693P236n543l950o683n839O591j0838J2342J954
$$ plain form
11249 13344 -27322 -25947 -14309 -10742 -7687 -20311 -23152 -18448 3474 22526 -157 -16919 -12496
11236 -12496 4343 18119 -1339 5232 25884 35665 35094 12396 -13518 -24150 -21800 -11662 12002
11223 12002 33900 29232 20133 17167 34611 50224 30462 32585 9143 -16349 -11952 -11642 -2535
11210 -2535 -4064 -25531 -45514 -18430 1347 6263 6428 -24237 -58689 -58879 -45617 -40767 -31908
11197 -31908 -25985 -13475 1890 9902 -8350 -31603 -34759 -16237 -8738 5577 19724 7176
11185 7176 -6189 -11087 9718 26667 40473 15494 4716 5379 5001 -21640 -45720 -45502 -34694
11172 -34694 -13989 -11802 -26509 -10165 4141 5915 14751 22706 27124 15227 18071 17572 1617
11159 1617 -7337 -36931 -37765 -1926 13767 21003 15460 11510 4827 -1012 5579 -5259 7083 9037
11145I037j1228J6359q879j1441J8135k15J6489l733j8118M624K2461R233j1910
11132C0814j1193k06j485o852p190j3434P635K0234J392k3297K1232J2964J2238
11119D2852j6211p527M579j2812q607l222j7556o585J6046J3436K0035J8805n64
11106D2669p485j4272q469j6410j9479J0773K6950K0918J7215j5919j7353p998
11094A1140Q566J1671R077N249o366j859o518k1133j9373j1538J2466l854n665
11081a8137J1291J9001M239k2901R307J7852O422j1418j8779N926J1373R491r140
11068A4527M646n712J6676k791j7985N305J2388j0077r54J9583r718M583j6996
11055A3475L696q262k2397m963J377o81R989K41K138m95J6753J8649P31J5419
$$ plain form
11145 9037 -2191 14168 5289 -6152 11983 11768 28257 24524 6406 11030 33491 42724 30814
11132 30814 19621 19415 17930 11078 3888 -9546 -1911 18323 19715 -3582 17650 30614 42852
11119 42852 26641 19114 23693 10881 2274 -948 -18504 -25089 -9043 4393 24428 43233 42669
11106 42669 35184 20912 12443 -3967 -23446 -12673 14277 35195 52410 36491 19138 11140
11094 11140 19706 31377 40454 45703 39337 37478 30960 9827 -9546 -21084 -8618 -12472 -18137
11081 -18137 -6846 12155 16394 -6507 2800 20652 27074 15656 -3123 2803 14176 23667 14527
11068 14527 19173 13461 30137 27346 9361 14666 27054 16977 16023 35606 25888 30471 13475
11055 13475 17171 8909 -13488 -18451 -17074 -17755 -7766 -7525 -5387 -5882 10871 29520 30251 45670
11041D5670Q674O671K39o335j1306k504j1358o653p79J6991J0854J3157j2090
11028E1231J4249M4651L781Q275J6983j966r44j0435J5861j2634j6709Q076J1992
11015A32411Q135J1127J4068J5171j3615j4131K0k1038j4862m27j3188k4220M276
11002H3727K8416K5662J8520J192l3965l1316j952Q722Q274q530k4052k2930K243
10989E4011R348j0414r576j493j0202Q066j712l158K29k147o783j2177M437O01
10975A9030p705p342k1873J0175J7079K157J386J1044j078K024J1987q469j3465
10962A4950j1406N787p899o536j9169k78O748L119J0052n620J6375J9506O675
10949C2304j411o117r455J991L668o057N931O295j5661N550o083j0233r897M903
$$ plain form
11041 45670 54344 61015 61254 54919 43613 41109 29751 23098 22319 39310 50164 63321 51231
11028 51231 65480 110131 113912 122187 139170 137204 136260 125825 141686 129052 112343 120419 132411
11015 132411 140546 151673 165741 180912 167297 153166 153186 132148 117286 116859 103671 79451 83727
11002 83727 112143 137805 156325 157517 123552 92236 90284 99006 107280 98750 74698 51768 54011
10989 54011 63359 52945 43369 41876 31674 39740 38028 34870 35099 32952 26169 13992 18429 19030
10975 19030 11325 3983 -17890 -7715 9364 11521 12907 23951 22873 24897 36884 28415 14950
10962 14950 3544 9331 1432 -5104 -24273 -24551 -17803 -14684 -4632 -10252 6123 25629 32304
10949 32304 30893 24776 15321 17312 20980 14923 20854 27149 11488 17038 10955 722 -9175 -4272
10935d272M78j0239j7259J2339J7247k349p28l239K4616P319r595j1141J3218
10922A6395N190k6388J743n721j0734J127O866R503K9k1478n655K2615K9627p61
10908B2358j6838k224o13l344j5961J2764L7580o259k5314M091j6962P31J6917
10895F926k566R726M732O548l902j3283j8832N499j1854J31J2372k5866J9150
10882a1219K7571j4873p960J3619P396K142N209Q762j2454k112N901J2632m409
10869C0205j2083k0683M310q004p154J9723L154q26r010l436L826Q614J4814K868
10855B6318j5370k4897J180J5217Q581j0851J0970J1333J1349N87j9859L076J2095
10842B9729M356k352p488O303O198p259p441l493p748n975o762J2397J3143k7812
$$ plain form
10935 -4272 -3794 -14033 -31292 -18953 -1706 -4055 -4783 -8022 16594 23913 14318 3177 16395
10922 16395 21585 -4803 -3060 -8781 -19515 -18388 -11522 -2019 -1990 -23468 -29123 -6508 23119 22358
10908 22358 5520 3296 2683 -661 -16622 -3858 33722 27463 2149 6240 -10722 -9991 6926
10895 6926 4360 14086 18818 25366 21464 8181 -10651 -5152 -17006 -16875 -4503 -30369 -11219
10882 -11219 16352 1479 -6481 7138 14534 16676 21885 30647 18193 16081 21982 34614 30205
10869 30205 18122 -2561 1749 -6255 -13409 6314 9468 8642 -368 -3804 22 8636 23450 26318
10855 26318 10948 -13949 -12769 2448 11029 178 11148 22481 33830 34417 14558 17634 29729
10842 29729 34085 31733 24245 30548 36746 29487 22046 18553 10805 4830 -1932 10465 23608 -4204
10828d204K4127K5873J1420M330p791k0881j3152k326j3865o29j33M237p461J0415
10814I960Q057j6428J7074K3441Q996O021j1524j1161L159P336M464k4563j7534
10801G298J0240j0742n404M701K4516M629r259N23N356L011P493o859k5585j8694
10787h776J7955J5463j0420k5093q633K7904J3415j4214Q514K4468J4139j2525
10775D2197j1341l620Q313o060r32N714J0617J0878k3673l355N572J1863r394
10762C6779k4233l0224j2044P047M841K8775L7160J2388j5589M553j2321j2270
10750B4862J0673R48j9010M103K016j2815j059P04k1632j5153n12R49o112L736
10736b8302J2654K0598Q51m261R715J698J176K603j834Q974J7693k52r598j1713
$$ plain form
10828 -4204 19923 45796 57216 61546 53755 32874 19722 17396 3531 2902 2769 7006 -455 9960
10814 9960 18017 1589 18663 42104 51100 57121 45597 34436 37595 44931 49395 24832 7298
10801 7298 17538 6796 1392 6093 30609 35238 25979 26502 31858 34869 42362 35503 9918 -8776
10787 -8776 9179 24642 14222 -10871 -19504 8400 21815 7601 16115 40583 54722 42197
10775 42197 30856 27236 35549 29489 28557 34271 44888 55766 32093 28738 34310 46173 36779
10762 36779 12546 -17678 -29722 -22675 -17834 10941 48101 60489 44900 49453 37132 24862
10750 24862 35535 36483 17473 21576 23592 10777 9718 10422 -11210 -26363 -26875 -25926 -32038 -28302
10736 -28302 -15648 4950 5801 1540 11255 12953 14129 16732 14898 23872 41565 41313 31715 20002
10722B0002K1434K4616q00q578K944m56j2722j1315q634P725k826K7413L4990
10709I3793j573J1815J8371J0115J0484J3417l669J4709N028N454L0800J6792
10697B25536K9439K9918O1590R2571O6424P9911J13633J58392K14553K90513M14396
10686A776876M43828L33792Q4435j61470l40353m21061l92064k83900j94327j50889
10676F94867j10479q0676m7300n4201l2220l8923k7947k1064l1969j4790l974
10665B31324r072M165Q394p576l108j357P757J4489L005l953m369r493O10J1626
10651B42442j7171K1327J4410n066p405J2362M2724K8256K0343K4039L0322M3592
10639D50175J5056j4310j8943k2103l3335O651L3429J3747J2934J8490K1710L2434
$$ plain form
10722 20002 41436 66052 65252 56674 59618 59162 46440 35125 26491 34216 31390 58803 93793
10709 93793 92220 104035 122406 132521 143005 156422 152753 167462 172490 177944 208744 225536
10697 225536 254975 284893 346483 439054 505478 585389 699022 857414 1071967 1362480 1776876
10686 1776876 2220704 2554496 2638931 2477461 2137108 1716047 1323983 1040083 845756 694867
10676 694867 584388 503712 456412 402211 369991 331068 303121 282057 250088 235298 231324
10665 231324 222252 226417 234811 227235 224127 222770 230527 245016 248021 244068 239699 230206 230816 242442
10651 242442 225271 246598 261008 255942 248537 260899 303623 331879 352222 376261 406583 450175
10639 450175 465231 450921 431978 409875 376540 383191 416620 430367 443301 461791 483501 515935
10627E15935N8955P1734M8084P4380P8453Q2804P3931P9254Q6967J12374J26079
10616A408950J74517K09672K93542L99241N30669O81989Q97924J169344J427352
10607G193200J568037J429660R86837M06430p7963k89691j82739J58787O53653
10598A1846211J244237K005918K769458L115971K649062J344931j45084j241330
10590B3589374j677731j445866o98571K70195J362301K493156L463159L739257
10582C1095274K735082O64102j490987k997367l510984l112567k177337j097771
10574B0107445q99R40344J639059J759582R94807m60949j850291k714911k900585
10565A7513602k498896j792177j043100m76981k3479K66101K80219o9731o43237
$$ plain form
10627 515935 574890 646624 694708 769088 847541 930345 1004276 1083530 1170497 1282871 1408950
10616 1408950 1583467 1793139 2086681 2485922 3016591 3698580 4596504 5765848 7193200
10607 7193200 8761237 10190897 11177734 11584164 11506201 11216510 11033771 11192558 11846211
10598 11846211 13090448 15096366 17865824 20981795 23630857 24975788 24830704 23589374
10590 23589374 21911643 20465777 19767206 20037401 21399702 23892858 27356017 31095274
10582 31095274 33830356 34494458 33003471 30006104 26495120 23382553 21205216 20107445
10574 20107445 20106546 21046890 22685949 24445531 25440338 24979389 23129098 20414187 17513602
10565 17513602 15014706 13222529 12179429 11702448 11678969 11945070 12225289 12155558 11512321
10556A1512321j177752j491847j535703j357800j088394q53598o25033m79008
10548B903186l59857k66242j85578j49236j36040j15072q9016o3331n9390p4070
10538A405354o3098m5160k3396l1647k1858k1396p3729q7591q2901o5375o5437
10527H23766l4847l2643k3365l9923n7568n5248k7227l4129l6902l0922N12J3004
10515D64508j6375k7626k0374j1223j3789k118j302j2551N245P411q230k843n3733
10502C07000k3473p915r065j9600k616J7194P034K2896K5426O126r752m218J3164
10489C22201k4041k2331q909n690k5086q554j1060p710J06L258K6024p273j3010
10476B17925o345L0982J9894R813j1815m1305k5406m382o942m849Q030J1506J7433
$$ plain form
10556 11512321 10334569 8842722 7307019 5949219 4860825 4007227 3382194 2903186
10548 2903186 2543329 2277087 2091509 1942273 1806233 1691161 1602145 1538814 1479424 1405354
10538 1405354 1342256 1297096 1273700 1242053 1220195 1198799 1125070 1037479 954578 889203 823766
10527 823766 788919 756276 732911 692988 635420 580172 552945 518816 481914 450992 451504 464508
10515 464508 448133 420507 400133 388910 375121 373003 371701 359150 364395 371806 363576 360733 307000
10502 307000 283527 275612 266547 246947 244331 261525 268559 291455 316881 323007 313255 309037 322201
10489 322201 298160 275829 266920 261230 236144 227590 216530 208820 208926 212184 238208 230935 217925
10476 217925 211580 242562 262456 272269 260454 219149 193743 189361 182419 177570 185600 197106 214539
10463B14539j3731j1878O262j202K2184K4464K5695m543j0647M410J0689j5089
10451B51153M511n413j6948k3892k3220j091Q248k5203m5103m6138m7342m0749
10439a1187m1932n5341n1899k4187J3300K8075O7779N9633N7211M8781N4644L3072
10427A77949J3541R358N971P011j2941p204j9902j3983m83j0689m045p906k715
10414A33962o770j8692j7721M7876Q7975R7426Q5421P2586M9964L3936J4817l627
10402E77153n0194k8342J2191o187Q927J6589P225R199M106j7343o765k1842l713
10389E01004N396J1822L17n313n190J320N992J2469J2029K2250J8556j3718k6655
10376E40279J1792J2007K2011L5328L2090M0190K3388K4069L1927J4504J0481
$$ plain form
10463 214539 200808 188930 195192 193990 216174 240638 266333 261790 251143 255553 266242 251153
10451 251153 255664 250251 233303 209411 186191 185100 193348 168145 123042 76904 29562 -11187
10439 -11187 -53119 -108460 -160359 -184546 -171246 -143171 -75392 -15759 41452 90233 144877 177949
10427 177949 191490 200848 206819 213830 200889 193685 173783 159800 159317 148628 144583 136677 133962
10414 133962 127192 108500 90779 138655 226630 324056 409477 482063 532027 565963 580780 577153
10402 577153 526959 498617 510808 504621 513548 530137 537362 546561 550667 533324 526559 504717 501004
10389 501004 506400 518222 518539 513226 508036 509356 515348 527817 539846 562096 580652 566934 540279
10376 540279 552071 564078 586089 621417 653507 693697 717085 741154 773081 787585 798066
10365G98066K7938J0269n221q865L3607J8440J760n010l780J2246L2943M9610
10353I62003L3144L2708J4177K2183K9478K4045J7548J9551K4286K9896J3770
10342A222789N9356N8163O1495O5743M6631N1408R4791R2704N8783P3211Q7390
10331A972464N9538M1969O1198P9452Q4751Q9452J08557J25970J46141J94522
10321B964014K26090K35185K24650K41000K45387K29328K53837K68024K85583
10312E173098L22715L69559M20934N06714O20033O98700Q41141R96383J179593
10303A1128870J349765J368838J233168J159138J183932J402545J841119K369919
10295B3037294L009988L805377M793846O025287P625556R599915J2184950J5802662
$$ plain form
10365 798066 826004 836273 831052 822187 855794 874234 875994 870984 867204 879450 912393 962003
10353 962003 995147 1027855 1042032 1064215 1093693 1117738 1135286 1154837 1179123 1209019 1222789
10342 1222789 1282145 1340308 1401803 1467546 1514177 1565585 1660376 1753080 1811863 1885074 1972464
10331 1972464 2032002 2073971 2135169 2214621 2299372 2388824 2497381 2623351 2769492 2964014
10321 2964014 3190104 3425289 3649939 3890939 4136326 4365654 4619491 4887515 5173098
10312 5173098 5495813 5865372 6286306 6793020 7413053 8111753 8952894 9949277 11128870
10303 11128870 12478635 13847473 15080641 16239779 17423711 18826256 20667375 23037294
10295 23037294 26047282 29852659 34646505 40671792 48297348 57897263 70082213 85884875
10287H5884875K1291656K9818504M2773104O1459220Q4231735R7637243P2559445
10280D95655782J0814065m1659418p4562542q7020240p5592822n5530949l8472726
10273A33631150k6734708j9370675j4622755j1398022r098030p244009n763849
10266C9399102m579693l692120l043667k504527k015326j551581j224644j048634
10258A9738910j110537j270641j372826j374992j270384j098856r19132p84931
10250A0536611o94030o40029n94695n24704m50746m13314l77297l39035k81214
10241F221547k35200k08726j78680j73072j89081j83345j93699j85284j66290
10232D508170j43535j14938j15079j28299j36651j31527j30973j56361j55386
$$ plain form
10287 85884875 107176531 136995035 179768139 241227359 325459094 423096337 495655782
10280 495655782 506469847 464810429 390247887 303227647 227634825 172103876 133631150
10273 133631150 106896442 87525767 72903012 61504990 52406960 45162951 39399102
10266 39399102 34819409 31127289 28083622 25579095 23563769 22012188 20787544 19738910
10258 19738910 18628373 17357732 15984906 14609914 13339530 12240674 11321542 10536611
10250 10536611 9842581 9202552 8607857 8083153 7632407 7219093 6841796 6502761 6221547
10241 6221547 5986347 5777621 5598941 5425869 5236788 5053443 4859744 4674460 4508170
10232 4508170 4364635 4249697 4134618 4006319 3869668 3738141 3607168 3450807 3295421
10223C295421j38452j54648j40303j65148j40865j16865j15306j17178r2574r3679
10213B020403p6772r8190r7046p5067n6175o4546m2917n1244n9888o1104k0027
10202A317427k0346n7807n9879n3399l5516l4252k3242j1152k6552o805j3485
10191I74992l205j6966k6870p526k6232k9116k2678k0530l0747j5441j6233l2848
10179G26600m767O359N762L234N999l1807l4333j8212k4806j0712j3902q985k7788
10166E72642j6791j5332j0112k3432J0105L5596k286m872j0254j3187R96J4455
10154E37528Q448M7409Q7003R8066R7378M2190q209k9288r714r877l0370l9821
10142G90743l3544k5944q117k7116k9515j0402J913J839j602k8856N805J1819
$$ plain form
10223 3295421 3156969 3002321 2862018 2696870 2556005 2439140 2323834 2206656 2114082 2020403
10213 2020403 1943631 1845441 1748395 1673328 1617153 1552607 1509690 1458446 1398558 1337454 1317427
10202 1317427 1297081 1239274 1179395 1125996 1090480 1056228 1032986 1021834 995282 988477 974992
10191 974992 971787 954821 927951 920425 894193 865077 842399 821869 791122 775681 759448 726600
10179 726600 721833 728192 733954 737188 743187 711380 677047 658835 634029 623317 609415 600430 572642
10166 572642 555851 540519 530407 506975 517080 552676 550390 545518 535264 522077 523073 537528
10154 537528 545976 593385 680388 778454 875832 918022 909813 880525 870811 860934 830564 790743
10142 790743 757199 731255 723138 696022 666507 656105 658018 659857 658255 629399 635204 647023
10130F47023L2198M6014N0120L5568N1150N0143j1186n0460p8916p2999n6178
10119F42477n5469o0137l4697j4695k5675k7349m4664l2491l1154l9302l192j0884
10107B62768J0867O076J8620J102j7272O440L1409k387J9861J2929q995q380J91
10094C33229K4751K5916n610l0821o2989o6994m9172J2750J2747J3156K7784J7933
10082B52680p063m86n653J3741K1674J8068j4858k4329l4083j1393k3369k6327
10070A58602n085k1449j8220o53J7741J6415K9421L4479J4729N334N504j323l5748
10057A99747l0879r085j6129M120M184q496R656J4791J3588k313j5580J608p318
10044A57894p40J3833r713o986j1033k0603j734k5021M458Q537L525P206P103
$$ plain form
10130 647023 679221 725235 775355 810923 862073 912216 901030 850570 771654 698655 642477
10119 642477 587008 526871 492174 477479 451804 424455 379791 347300 316146 276844 273652 262768
10107 262768 273635 279711 298331 299433 282161 288601 320010 317623 337484 350413 341418 333038 333229
10094 333229 357980 383896 378286 347465 284476 217482 168310 181060 193807 206963 234747 252680
10082 252680 245617 245131 239478 253219 274893 292961 278103 253774 219691 208298 184929 158602
10070 158602 153517 132068 113848 113195 130936 147351 176772 211251 225980 231314 236818 235495 199747
10057 199747 168868 159783 143654 147774 151958 143462 153118 167909 181497 179184 163604 165212 157894
10044 157894 157154 170987 161274 154288 143255 122652 120918 95897 100355 108892 112417 119623 126726
10031A26726P447k377P175p840j4626j3522K5407J9492J0313k780n727o92j0358
10018A38638N976J9655J7136J9221L2636J3743Q783m793j5985j9784k8340r81
10006A85905m047n964Q860K6931J1482j3776N744J3276n094k6338J1698K5064
9994B33741J7787k5727j4376m802p254j4564K269K3937j2283p502q617j3370P568
9981A76807j3147K0583K8399J983J7994j263J8345L5840L5103P4731J22975J54903
9969F73253J29915N2389P0209N5679m1404j09432j34767j38437j33921q3279m8977
9958B91228k3521k4595m1905L900j6462j4365r336j8512m583k1877J0177L774
9946A33923m280L720o032j0931J020N847L894j666O050N029j6600m823r94Q768
$$ plain form
10031 126726 134173 131796 138971 131131 116505 102983 128390 147882 158195 155415 149688 148996 138638
10018 138638 144614 164269 181405 200626 233262 247005 255788 250995 235010 215226 186886 185905
10006 185905 181858 175894 184754 211685 223167 209391 215135 228411 223317 196979 208677 233741
9994 233741 251528 225801 211425 206623 199369 184805 187074 211011 198728 191226 182609 169239 176807
9981 176807 163660 184243 212642 214625 232619 231356 249701 285541 320644 395375 518350 673253
9969 673253 803168 855557 925766 981445 940041 830609 695842 557405 423484 340205 291228
9958 291228 267707 243112 201207 205107 188645 174280 164944 146432 141849 119972 130149 133923
9946 133923 129643 133363 127331 116400 117420 123267 127161 125495 131545 136574 119974 115151 114157 122925
9932A22925R3l1080R608J4321J567j1902p721J2375K687r099k6044j4210R54K5129
9918H9603K4645p313J2204J3426M822j5116j0723R996J3490O069l633q181m501
9905A24788J0991Q265j889K503o151k319K3933N830J072K430K9900Q792m2836
9892A65309j2436J8538q27J1900L1695K3895J2484J0634R768K5719J4452L9290
9880C50421P8007Q5069R3487J36884J78209K63431L57118M32273M37957K54074
9870B666930l8433k50500l92806m22371l59202k43051j68303j27777p9326p7260
9860E07901r5642m4383k3032k9734k067j6096m8856l4168j1028o444j560q95j64
9847A93832j5536j5810O189J6456k3307j3665j23k414m073k7991k1153M192Q614
$$ plain form
9932 122925 123018 91938 101546 115867 117434 105532 97811 110186 112873 103774 77730 63520 64474 89603
9918 89603 114248 106935 119139 132565 137387 122271 111548 121544 135034 141103 137470 129289 124788
9905 124788 135779 144044 142155 144658 138507 136188 160121 165951 167023 169453 199353 208145 165309
9892 165309 152873 171411 170584 182484 214179 238074 250558 261192 270960 296679 311131 350421
9880 350421 428428 513497 606984 743868 922077 1185508 1542626 1974899 2412856 2666930
9870 2666930 2628497 2377997 1985191 1562820 1203618 960567 792264 664487 585161 507901
9860 507901 412259 367876 344844 315110 313043 296947 248091 213923 202895 196451 194891 193996 193832
9847 193832 178296 162486 168675 185131 161824 148159 148036 145622 141549 113558 92405 96597 105211
9834A05211k035J343J451m407o159Q257J9360k1267K44J8611K2613K694K286R36
9820A49138j9940j2570P2P702j2671n199j2005j7278j4907p795j415J2716n679
9807F0169m930j3741J0493J6707O272N598m103K2169j4809k1317n542m145j0788
9794D2033r41P940n608J8480N649K1797J2879o231l0653M812O855j0908Q16L347
9780G0267r959o077N121P641L637k2471k4835M623N203J1633k545L1706J1758
9767H5702j9555p647J062J054N29l898O443j8797J2459j066k440J2364q658j8390
9753C9162j5347l201Q817j705K783O637k641O142j7410j6674J1005M334n005j2088
9739D809M732R229o868O551L310N712K911n064J2351j0142j5450J798R788J1982
$$ plain form
9834 105211 103176 104519 105970 101563 95404 103661 123021 101754 101998 120609 143222 145916 148202 149138
9820 149138 129198 116628 116700 124402 111731 106532 94527 77249 62342 54547 53132 65848 60169
9807 60169 55239 41498 51991 68698 74970 80568 76465 98634 83825 62508 56966 52821 42033
9794 42033 41092 49032 43424 61904 67553 89350 102229 95998 65345 70157 77012 66104 66920 70267
9780 70267 60308 54231 59352 66993 70630 48159 23324 27947 33150 44783 42238 73944 85702
9767 85702 66147 58500 59562 60616 61145 57247 63690 44893 57352 56286 53846 66210 57552 39162
9753 39162 23815 20614 29431 27726 30509 37146 34505 40647 23237 6563 17568 21902 16897 4809
9739 4809 9541 18770 11902 18453 21763 27475 30386 25322 37673 27531 12081 13879 23667 35649
9725C5649k173J4059K2898J6278q273k3220l197M239j6250J070L526M842J9620
9712F9068J6036n329m7124n088J9222j1181O851j383J0945L88m637o218K246O185
9698D9981M260N192J2976l883j215j0312K359p73Q767Q576m769j8509M074K3727
9684H0451l272l1531j207K6588n299p158r629j6231q114J9027Q260o915j0575
9671C4395q836J0348L1992J0098M89j4396j0182N186n265k0664N264J9286n122
9658E2593L278J7650k0134j7939O145p804n526j764K2545K639j048j3229L560
9645D0966K9115J3062J9347N6341R8082R8654J9977l8563p8962p4292n6312m2552
9633H4863l528l0580k105R562J4091J0515J4485k45p707k2078j5285O896j309
$$ plain form
9725 35649 33476 47535 70433 86711 78438 55218 52021 56260 40010 41080 44606 49448 69068
9712 69068 85104 79775 32651 27563 46785 35604 42455 41072 52017 52405 47768 41550 43796 49981
9698 49981 54241 59433 72409 68526 67311 56999 59358 58585 67352 75928 71159 52650 56724 80451
9684 80451 77179 45648 44441 71029 65730 58572 48943 32712 24598 43625 51885 44970 34395
9671 34395 25559 35907 67899 77997 78486 64090 53908 59094 53829 33165 38429 57715 52593
9658 52593 55871 73521 53387 35448 41593 33789 28263 26499 49044 51683 50635 37406 40966
9645 40966 70081 83143 102490 158831 256913 355567 375544 336981 258019 183727 127415 84863
9633 84863 81335 50755 48650 58212 72303 82818 97303 97058 89351 67273 51988 58884 57575
9620E7575j2811r536J16J2104L058k878O322K277l363k559j2607n270Q376l122
9606C7682Q299m34O791J2241K80k0626j1245P684J9181l252j7909o901k491p041
9592B2259P639k982q425k8174N80J9537J4582K6878J7621j230j0842j3443M768
9579D8768k3588n109J6813k323j513k0202j3357J091J5062J2555k2117q147p665
9566i732K2184K6458J5674r648j8359m451j4164l453O83j8689K6607J5625j3308
9553A5427l31J5857k1224j3538k0154L693K5718J3298j1752K04R969k2199J1839
9540F807L434K379J0690n073m203m342Q930n27n515j1594j8992N012K6164q612
9526D558q206k968K3318J3695n689M707j381J2249l476k9437M102K401O420l820
$$ plain form
9620 57575 44764 35228 35344 47448 50506 47628 53950 56227 52864 50305 37698 32428 40804 37682
9606 37682 45981 45547 52338 64579 64859 44233 32988 40672 59853 56601 38692 31791 29300 22259
9592 22259 29898 26916 18491 -9683 -9103 10434 25016 51894 69515 68285 57443 44000 48768
9579 48768 25180 20071 36884 34561 33048 12846 -511 580 15642 28197 6080 -2067 -9732
9566 -9732 12452 38910 54584 44936 26577 22126 7962 4509 5192 -13497 13110 28735 15427
9553 15427 15096 30953 9729 -3809 -23963 -20270 5448 18746 6994 7198 17167 -5032 6807
9540 6807 10241 12620 23310 18237 14034 9692 18622 18095 12580 986 -18006 -12994 13170 4558
9526 4558 -3648 -6616 16702 30397 24708 29415 28034 40283 36807 7370 11472 13873 20293 16473
9512A6473N993L640n70k692j0900J8519R215p150J4362q493k8224k300N406J4449
9498B7728M653q241O973Q492O412j137K093o593q001m651j143r552l513N746M333
9483B3599K5255J0390p388j0105p226M030j7961k5540J1923J0976J761K602R093
9470C1409j888M521J3214j5905q585J0986j6320M233M678l557l349Q157J0076
9457C7670J7617L405k3058q118Q46j2407o247j478R914P309J1367j8022J5466
9444C4264l198R667k817j9643q658M018J9997K4832k017k1341k3364k963J0716
9431A9493j1449r87P147R191J4431l875j0586p858r894j5865O856L4047K3072
9418E3723L844k168p706k498l8817l2378j4748J797m109p455R403J3668n70j0069
$$ plain form
9512 16473 22466 26106 25536 22844 11944 30463 39678 32528 46890 38397 10173 7873 13279 27728
9498 27728 32381 24140 31113 39605 46017 44880 46973 40380 32379 27728 26585 17033 13520 19266 23599
9483 23599 48854 59244 51856 41751 34525 38555 20594 -4946 6977 17953 19714 22316 31409
9470 31409 29521 34042 47256 31351 22766 33752 17432 21665 26343 22786 19437 27594 37670
9457 37670 55287 58692 35634 27516 28362 15955 9708 8230 18144 25453 36820 18798 34264
9444 34264 31066 40733 37916 18273 9615 13633 33630 58462 56445 35104 11740 8777 19493
9431 19493 8044 7057 14204 23395 37826 33951 23365 15507 5613 -10252 -3396 30651 53723
9418 53723 57567 55399 47693 45195 6378 -26000 -40748 -38951 -43060 -50515 -41112 -27444 -28014 -38083
9404c8083K9241L2175k4555k858O487p450Q231Q025q674k3245l096K2065J8993
9391A7256N381k4224k7090J9049J1374l676j244O004J7630R057O3k498J1330j0695
9377B7717j8194o50k3912j8387K2803K1274K1889Q837J585K102j5061O284J535
9364C7822J776J1870r394o387r545J2578J4249j5713m589J1266r109l454j1990
9351A9380J8179K1042r074j9261j9887j0323J7389p412J71n62l0083N906J2505
9338b030L73k4356J1540J5326j5693o194J4087K929J2179K1176o907l97O878r774
9324A9137k1342L414n820k4614K3744K0444J9484J1459j8724j6666O021j583k446
9311A2508J2968j3794J1205Q246K754r356j3548r219o626j9941R088J9542J9966
$$ plain form
9404 -38083 -8842 23333 -1222 -4080 2407 -5043 3188 11213 2539 -20706 -23802 -1737 17256
9391 17256 22637 -1587 -28677 -9628 1746 -1930 -3174 2830 20460 29517 29580 27082 38412 27717
9377 27717 9523 8873 -15039 -33426 -10623 10651 32540 41377 42962 45064 30003 36287 37822
9364 37822 39598 51468 42074 35687 26142 38720 52969 37256 32667 43933 34824 31370 19380
9351 19380 37559 58601 49527 30266 10379 56 17445 10033 10204 9642 -20441 -14535 -2030
9338 -2030 -1657 -26013 -14473 853 -14840 -21034 -6947 -4018 8161 29337 22430 22033 28911 19137
9324 19137 -2205 1209 -4611 -29225 -5481 14963 34447 45906 27182 10516 16537 14954 12508
9311 12508 25476 11682 22887 31133 33887 24531 10983 1764 -4862 -24803 -15715 3827 23793
9298B3793k594l001r78j033L748j7158j8072J3443O719N263K226J633j969P8k555
9283I543j7241p242K8599m547j1901r84J0831K5156P76j1199J0374l671O605P293
9269D2392j2027q517J381q778p765R755R582j0222O658j7379j4430J367K1109
9256A3126J6284j1948k2967K409n028q10N860J1047l153j0552r309J0313p398
9243a2126P829J8023J3881k97k788L450j5027j793R751l456r587o67R163J4551
9229C0907j4244l7312J2335J8726p377O145n170j0826J677O700L2617O868j3326
9216B7720l017j1514Q75J9084O672j553k461j4960o461J1141N451k8201j842m909
9202c975J1236K599M246J1530l448M442K599k695m825j7922Q166L657q382P020
$$ plain form
9298 23793 21199 18198 17220 16187 19935 2777 -15295 -1852 4867 10130 12356 13989 12020 12098 9543
9283 9543 -7698 -14940 13659 9112 -2789 -3773 7058 32214 32990 21791 32165 28494 35099 42392
9269 42392 30365 21848 23229 14451 6686 16441 26023 15801 22459 5080 -9350 -7983 13126
9256 13126 29410 17462 -5505 -3096 -8124 -8934 -3074 7973 4820 -5732 -15041 -4728 -12126
9243 -12126 -4297 13726 27607 27310 24522 27972 12945 11152 20903 17447 7860 7193 16356 30907
9229 30907 16663 -20649 -8314 10412 3035 9180 4010 -6816 -5139 1561 34178 41046 27720
9216 27720 24703 13189 14064 33148 39820 38267 35806 20846 14385 25526 30977 2776 934 -3975
9202 -3975 7261 9860 14106 25636 22188 26630 29229 26534 21709 3787 11953 15610 7228 14248
9188A4248j326M491q191j4014l489J089m66k946L4381J1973q005j9703j6406j1171
9174a9535o504J8517J5125j476O390J6931q197P003k616j0125J5293N210k886
9161C3130L150j0078j7608j3585k8551M663K5358J4122O683j1688l1585L942J5625
9148f422J6165K4624J1331J3166n12l3526l4643j8846O63L641k938K7030K2341
9135B2074K327j8210j2966p968M145K2501J8707k8481j888l689j7316m778J5954
9122i588P054q320n657K1474J3608J2608J2143l232j3993j7206j2616l061k490
9109i276J2432j3304j1330J7405J8559J1359m06j1148k092J453J2650J265P93
9096B8360k8577n486K6694J1484J9089k6514l3493K9892K2078K052J2000K200
$$ plain form
9188 14248 12922 17413 9222 -4792 -8281 -7192 -7658 -10604 23777 35750 27745 8042 -8364 -19535
9174 -19535 -26039 -7522 7603 6127 12517 29448 21251 28254 25638 15513 30806 36016 33130
9161 33130 36280 26202 8594 -4991 -33542 -28879 -3521 10601 17284 5596 -25989 -22047 -6422
9148 -6422 9743 34367 45698 58864 58352 24826 -9817 -28663 -28000 -24359 -27297 -267 22074
9135 22074 24401 6191 -6775 -14743 -10598 11903 30610 2129 241 -3448 -20764 -25542 -9588
9122 -9588 -2534 -10854 -16511 4963 18571 31179 43322 40090 26097 8891 -3725 -6786 -9276
9109 -9276 3156 -10148 -21478 -4073 14486 25845 25439 14291 12199 13652 26302 27567 28360
9096 28360 -217 -5703 20991 32475 51564 25050 -8443 21449 43527 45579 57579 59779
9084E9779l4983o58R852P995k533p378k051k9509j7348k933q119J1686K8628J5177
9070B7605O75l9381p671J4328K5318J844q936J4497O258N103R371k1684q498p615
9056A1214k0673q404Q463j7473K877L3709j2795k5823R650J6757K3819R469M72
9043C1262k4863J9815J7755M454m555k3904m643M738K8425N804j7854k3422n161
9030G851K4727n691k8152j6156j2325J2069J1829l593m276P457o696m980n407
9017b3343j388J6574M375R80k0236J5402O521J0096N07j7586k395M3290L8738
9004G1535o566j6743r636j040k2266o711k4408o483K7868J542j4845n529J9738
8991F456J7759j3664J0577q732j1583p309n989r68j3209l070j146J1750R997J8651
$$ plain form
9084 59779 24796 24138 33990 41985 39452 32074 30023 514 -16834 -19767 -27886 -16200 12428 27605
9070 27605 28280 -11101 -18772 -4444 20874 22718 13782 28279 34537 39640 49011 27327 18829 11214
9056 11214 -9459 -17863 -9400 -26873 -23996 9713 -3082 -28905 -19255 -2498 21321 30790 31262
9043 31262 6399 26214 43969 48423 43868 19964 15321 20059 48484 54288 36434 13012 7851
9030 7851 32578 26887 -1265 -17421 -29746 -17677 -5848 -9441 -13717 -6260 -12956 -17936 -23343
9017 -23343 -24731 -8157 -3782 -2802 -23038 -7636 -1115 8981 9488 -8098 -10493 32797 71535
9004 71535 64969 48226 38590 37550 15284 8573 -15835 -22318 5550 7092 -7753 -13282 6456
8991 6456 24215 10551 21128 12396 813 -6496 -12485 -13453 -26662 -29732 -30878 -19128 -9131 9520
8977I520j402j568L669J1268p686k3270q586R218o355L130Q567j0212K4357k735
8963G915q676L537j20J2157J5367m668o013k603p732N620J0336O304j3516j935
8949A5973Q936j0400j6584j9944K6249J2869N062Q573j5749r755j0641q954r656
8936b4021Q383K209J0646K141j551q100J7331J6848j1577j8971p222L2736Q232
8923B7084K2689P344j4749K690j0839L759p552L436k1877j0271j2329j9661K5987
8910d289J8655j9132j4826o59P193Q670R874K688J7797o5P961K105k0609r488
8896E875j0207N87J4288J0589O441j3756m993j61P916N454m497r700k4638m66
8882a7268O196j169J8156J0589J2660M725J3361j0906l590k2912j8679l804J6635
$$ plain form
8977 9520 8118 6550 10219 21487 13801 -9469 -18055 -8837 -15192 -12062 -3495 -13707 10650 7915
8963 7915 -761 2776 2656 14813 30180 25512 19499 16896 9164 14784 25120 31424 17908 15973
8949 15973 24909 14509 -2075 -22019 4230 17099 22161 30734 14985 5230 -5411 -14365 -24021
8936 -24021 -15638 -13429 -2783 -642 -2193 -10293 7038 23886 12309 -6662 -13884 18852 27084
8923 27084 49773 57117 42368 45058 34219 37978 30426 33862 11985 1714 -10615 -30276 -4289
8910 -4289 14366 -4766 -19592 -20251 -13058 -4388 5486 8174 25971 25906 33867 35972 15363 5875
8896 5875 -4332 -3745 10543 21132 27573 13817 8824 8663 16579 22033 17536 7836 -16802 -17268
8882 -17268 -11072 -12241 5915 16504 29164 33889 47250 36344 32754 9842 -8837 -12641 3994
8869C994J463R741J2256n556o353k8923j7334L526J4423m421j981K6614J5708
8856B3157Q943j366Q632n503r264J208O47J6064m325j1991r137J1701M769k0783
8842A2752L701m81l942o00j2881p487j4449l612j893J2781J9036R150k2610j2745
8828b3280R162o40k021R973J1650q617J4367Q992j2386j552K699K1442J170r685
8814B1274j0556l190j938p472P56K2160J2574j2510l82m397j4235j1128R444J5780
8800A6180j547l1365j8404J4010l631J288L1905J4055K1119p047l3531l844L025
8787B213O160l6P942p971p254j853J5165p237K052k840r054k1870L945K7958O468
8772A3788J6086o319Q213O671j8682k0704J879Q488J3876J8270j8307k5707n640
$$ plain form
8869 3994 5457 15198 27454 21898 15545 -13378 -30712 -27186 -12763 -17184 -19165 7449 23157
8856 23157 32100 30734 39366 33863 24599 25807 26454 42518 38193 26202 17065 28766 33535 12752
8842 12752 16453 15972 12030 11430 -1451 -8938 -23387 -26999 -28892 -16111 2925 12075 -10535 -23280
8828 -23280 -14118 -14758 -16779 -6806 4844 -3773 10594 19586 7200 5648 8347 29789 30959 21274
8814 21274 10718 7528 5590 -1882 -1126 21034 33608 21098 20716 16319 2084 -9044 400 16180
8800 16180 14633 -16732 -35136 -21126 -24757 -23469 8436 22491 43610 36563 3032 -812 2213
8787 2213 8373 8337 16279 8308 1054 -799 14366 7129 9181 6341 -2713 -24583 -20638 7320 13788
8772 13788 29874 23555 31768 38439 19757 -947 932 9420 23296 41566 23259 -2448 -8088
8759h088o039j3532J6688R740J2579Q739K650j5400j4961j2638l968k566J92J987
8745b4617R590O670J0685j277r523J7563J3460m983k4475n101Q329N522J5410
8732A7253j3727k1370J4914j269j5922N037J5911J511r619j5938N209O578K9195
8719A7763J1776p135j1157m07J0623J0323p479k5485J1070Q436n601r217K017
8706E527J6164J5208J0740j4040r058j0474K404K0356L682j0651l322r807l2884
8693a6155l0057n911K6450L4214j916l506q847N447K970K076L333l536J861k2546
8679a6123j6740p811J8934J3344k930J5384P837J0409j8791r264Q301J988j8294
8666a3756p655J0104p683o559J1385K0394Q569J9884J5135m752p160P412j6895
$$ plain form
8759 -8088 -14127 -27659 -10971 -1231 11348 20087 22737 7337 -7624 -20262 -24230 -26796 -26604 -24617
8745 -24617 -15027 -8357 2328 1051 -8472 9091 22551 17568 -6907 -12008 -3679 1843 17253
8732 17253 3526 -17844 -2930 -4199 -20121 -15084 827 2338 -7281 -23219 -18010 -11432 17763
8719 17763 29539 22404 11247 10840 21463 31786 24307 -1178 9892 18328 12727 3510 5527
8706 5527 21691 36899 47639 33599 24541 14067 16471 36827 40509 29858 26536 16729 -16155
8693 -16155 -46212 -52123 -25673 8541 6625 3119 -5728 -281 2689 4765 8098 4562 6423 -16123
8679 -16123 -32863 -40674 -21740 -8396 -11326 4058 11895 22304 3513 -5751 2550 4538 -13756
8666 -13756 -21411 -11307 -18990 -25549 -14164 6230 14799 34683 49818 45066 37906 45318 28423
8653B8423j6285M04j1820q910L021R447R374j784K999k3235k1454J6427J5427
8640B034p376J7509k964j4049O054L0327m084J7045j3192j9870P896K2326M561
8627D6217k2649j9895O823K0680p976Q030j842j3769k1274Q680K7688Q51J243
8614C2807j4932k6333j6043n789N672R545J7377J6519M806J6144K3812j4567k7788
8601B1230k213K1849P973j4212k1547k6238k000L607M716j6193j1104J7097J2060
8588d975K353J835l204N201O044k718Q799L369j7680n821P08r730q013K306J8655
8573b871Q244K1273J3551o409j7568J5929K611k0228p908J227J1794p658J1841
8560B3828O239k3003n415J7951K7205J8874j7630q301L721j4392j7319l597q79
$$ plain form
8653 28423 12138 12542 722 -8188 -5167 4280 13654 11870 14869 -8366 -29820 -13393 2034
8640 2034 -5342 12167 9203 -4846 1208 31535 27451 44496 31304 11434 19330 41656 46217
8627 46217 23568 3673 10496 31176 23200 31230 29388 15619 -5655 3025 30713 31564 32807
8614 32807 17875 -8458 -24501 -30290 -24618 -15073 2304 18823 23629 39773 63585 49018 21230
8601 21230 19017 40866 48839 34627 13080 -13158 -15158 -11551 -6835 -23028 -34132 -17035 -4975
8588 -4975 -2622 -787 -3991 1210 7254 4536 13335 16704 -976 -6797 -6089 -15819 -23832 -21526 -2871
8573 -2871 5373 26646 40197 33788 16220 32149 34760 14532 6624 7851 19645 11987 23828
8560 23828 30067 7064 1649 19600 46805 65679 48049 39748 43469 29077 11758 8161 7282
8547G282M716J2578r742k4355k4579K240K2416K1372J2097K005j453j015j1507
8534A2055r076j429l084N491K8102o603j2095j0487Q593p445Q397j8367j541J3767
8520F278j2326l95n931J8169J2246j6552j45l2761J5470J1815j0590j4121J2717
8507a6126L2838m829j9957p906J575j0811j3630j2104n271l40P243L3745J0116
8494e457r385l967j5163n363P489J4377M563o86k0154N746J8115J0741N873k916
8480C813j7568j1800j274q155l67n488J6722K8641J0710m509L054J2578N683n20
8466C1520m341l981p9k4199k3644J128J4404J3376J2760O902n65N239n353N203
8452B8370P147j6774k1389q713K199m1535J8359L8531q219q76P735K793n508j1754
$$ plain form
8547 7282 11998 24576 14834 -9521 -34100 -31860 -9444 11928 24025 26030 24577 23562 12055
8534 12055 2979 1550 -1534 3957 32059 25456 13361 2874 11467 4022 12419 -5948 -7489 6278
8520 6278 -6048 -6443 -12374 5795 18041 1489 1344 -31417 -15947 -4132 -14722 -28843 -16126
8507 -16126 16712 11883 -8074 -15980 -14405 -25216 -38846 -50950 -56221 -56561 -49318 -15573 -5457
8494 -5457 -14842 -18809 -33972 -39335 -31846 -17469 -12906 -13592 -33746 -28000 -9885 856 6729 3813
8480 3813 -13755 -25555 -26829 -34984 -35351 -40839 -24117 4524 15234 10725 13779 26357 32040 31520
8466 31520 27179 23198 23119 -1080 -24724 -23596 -9192 4184 16944 23846 23281 28520 23167 28370
8452 28370 35517 18743 -2646 -11359 -9160 -50695 -32336 6195 -2024 -2900 4835 7628 2120 -9634
8438i634M005K3661K9284J5572L056m2946k681K1989J7136K666o843m799J013
8425E1479k6839n333r333J7637R088j2190j3976R765K2853J0055k6963j0007p218
8412I018j7634P741Q939j4215n752M687j8476J49o850j1335L7253R302Q679J4390
8398B5896n788k0796j515J0990k7845l520J4480P902k171N099q21R990o305o966
8384a370N815J324j865J2345R228p838k4558r709M742J277Q904j1504j1972j2423
8370c7604P544L8587J7498r880M789j9805P086K901o262j3195L127r679l626J7127
8356a392J2476k312o238M531j308K783j658J669K3456j9255L952J3245K381l746
8342B8584q076l967j1692l64j1063j2965Q08K4278J3288J1665L043j0708p709
$$ plain form
8438 -9634 -5629 18032 47316 62888 65944 22998 20317 42306 59442 62108 55265 50466 51479
8425 51479 24640 19307 9974 27611 36699 24509 10533 20298 43151 53206 26243 16236 9018
8412 9018 -8616 -875 8064 -6151 -11903 -7216 -25692 -25543 -32393 -43728 -6475 2827 11506 25896
8398 25896 20108 -688 -2203 8787 -19058 -22578 -8098 -196 -2367 2732 1911 11901 5596 -1370
8384 -1370 4445 5769 3904 16249 25477 17639 -6919 -16628 -11886 -10609 -1705 -13209 -25181 -37604
8370 -37604 -30060 8527 26025 16145 20934 1129 8215 11116 4854 -8341 -5214 -14893 -18519 -1392
8356 -1392 11084 8772 2534 7065 5757 8540 6882 8551 32007 12752 16704 29949 32330 28584
8342 28584 20508 16541 4849 4485 -6578 -19543 -18735 5543 18831 30496 33539 22831 15122
8329A5122o871K081Q523k492J2970j3797j8747j6042J1720M206Q784p694k755
8316d992k735M131j906k6656J0035M091n076O233j228R954k582L0380K16m031
8302A5834K51L733j3443J1778O182k7987k0095K5231M3319o759k4083k2137R069
8289H93M658J7408m136n889L989P299J0111o540j9582J0R744o125p609l572r684
8274i025K4691P350j3659J4625J0256J4990k1551j6059o094j3707k6553k3054
8262e7790K2638J9815N395j5662j1520P659K0726K913O19k0123k3987Q56R257
8249c9204J0599j5550L221J9782L172J822J3281J7198J3461q814R042l0656k0382
8236b3028j563K0504J2818N916O819J6294R67L551K47m64J6553L071j6894j4627
$$ plain form
8329 15122 8251 10332 18855 16363 29333 15536 -3211 -19253 -7533 -3327 5457 -2237 -4992
8316 -4992 -7727 -3596 -5502 -32158 -22123 -18032 -23108 -16875 -18103 -8149 -10731 19649 19865 15834
8302 15834 16085 19818 6375 18153 24335 -3652 -23747 1484 44803 38044 13961 -8176 893
8289 893 5551 22959 18823 12934 16923 24222 34333 27793 8211 8221 17965 11840 4231 659 -9025
8274 -9025 15666 23016 9357 23982 34238 49228 27677 11618 5524 -8183 -34736 -57790
8262 -57790 -35152 -15337 -9942 -25604 -37124 -29465 -8739 -5826 -5207 -25330 -49317 -48461 -39204
8249 -39204 -28605 -44155 -40934 -21152 -17980 -16158 -2877 14321 27782 18968 28010 -2646 -23028
8236 -23028 -24591 -4087 8731 14647 21466 37760 38727 42278 42525 42061 58614 61685 44791 30164
8222C0164j2714k4256l600L650K4078J2489j7682j8852j7276r027R284L4114J6610
8209B6982k0701l8080J2962K7087M101j5340p24j5928M583J1817Q762K1561L267
8196C0349j3034r998K8538J4379k4449q770p180k046l296l0996P039J2935M982
8183a547k760J4538J7044j4467j7744p625O747L251k468k397R794j190N091O542
8169A2809N176n193L101k821r700P251j4023k0198J0558m624J076m737j0621Q187
8155b3759P950j3533P720J3816Q203j210O8M346l933K3628o73j8301j444j9808
8141a6930Q220K6184m056p648j4008k819j3204r28Q675K5187K73j2608k3042O53
8127b6051J2321J9136J5517o249m311o530o17n174K1144J3767j6581j9100J8022
$$ plain form
8222 30164 17450 -6806 -10406 -6756 17322 29811 12129 -6723 -23999 -33026 -23742 10372 26982
8209 26982 6281 -31799 -18837 8250 12351 -2989 -3713 -19641 -15058 -3241 5521 27082 30349
8196 30349 17315 7317 35855 50234 25785 17015 9835 7789 4493 -26503 -19464 -6529 -1547
8183 -1547 -4307 10231 27275 12808 -4936 -12561 -5814 -2563 -5031 -7428 2366 1176 6267 12809
8169 12809 17985 12792 15893 13072 3372 10623 -3400 -23598 -13040 -17664 -16588 -21325 -31946 -23759
8155 -23759 -15809 -29342 -21622 -7806 397 -813 -745 3601 -332 23296 22623 4322 2878 -16930
8141 -16930 -8710 17474 13418 5770 -8238 -11057 -24261 -25189 -16514 8673 8946 -3662 -26704 -26051
8127 -26051 -13730 5406 20923 14674 10363 3833 3216 -1958 19186 32953 16372 -2728 15294
8114A5294r09m373J2952L563j1731j0829k692k249R061O569q197P550n472p971
8100E66l961K9132J2934k5589J1466j1260q3j1545j1934J9065q606j0373r90J1685
8086E07O085o524j0620j2051K811M523J784Q649k683O878k852N834L149m064k5719
8071b4293L603K7759j309J050q412n800R382J047O9k3752J532J1507Q221K332
8057B936q477K1284L3188p942k4547j4516k0229k8508j008J7747K5227K7875R967
8044C2997j6673q699o359R685Q45m780J0113k0388O05q025j2291L608L9354K29
8030B0221j1271N579q95k0628J5685L021j6680K9349J8372j4418j2287k297l3178
8017a9427j2267R471P027O26j3223P827J7850j2270o722J4385K777m063l955p650
$$ plain form
8114 15294 14385 10012 22964 26527 14796 3967 1275 -974 8087 14656 6459 14009 8537 566
8100 566 -3395 25737 38671 13082 24548 13288 13205 1660 -10274 8791 185 -10188 -11178 507
8086 507 6592 68 -10552 -22603 -19792 -15269 -13485 -4836 -7519 -641 -3493 2341 5490 1426 -24293
8071 -24293 -20690 7069 5760 6810 -1602 -7402 1980 3027 3096 -20656 -19124 -7617 604 2936
8057 2936 -5541 15743 48931 40989 16442 1926 -18303 -46811 -47819 -30072 -4845 23030 32997
8044 32997 16324 7625 1266 10951 11796 7016 17129 -3259 -2654 -10679 -22970 -19362 19992 20221
8030 20221 8950 14529 13634 -6994 8691 11712 -4968 24381 42753 28335 16048 13751 -19427
8017 -19427 -31694 -22223 -15196 -14570 -27793 -19966 -2116 -14386 -21108 -6723 -3946 -8009 -11964 -19614
8003a9614q29N323J1462M460R733k1147j1317K759j5377l057M2412O61j3236m917
7989a2684K073J7218K61j8200J6025J0118l2731p431K538n99j5697M475J9796
7976a4838K1744Q217Q584N003M274j2296k1960o504j2244P191j327k007J5964
7963a99o815J0609J5204n658r707M578J7134n051P0K0223j5275j7052m402j6727
7949a3068J0261O793K131n09J8359o835j0662n404R659o956r244J3944o73j3965
7935f169q833J0674J0071j1179L483q074j391o433J4717K4825j429q95K8084r348
7921C8103j2780k9355L187J6217o920n813J2029j7200k575J1376J143N727m424
7908H715J379m379J0151L217r049j1224j572J6950O479q272l42j786J1586k7411
$$ plain form
8003 -19614 -20443 -15120 -3658 802 10535 -10612 -21929 -19170 -34547 -37604 4808 5469 -7767 -12684
7989 -12684 -10611 6607 6868 -11332 4693 14811 -17920 -25351 -22813 -23412 -39109 -34634 -14838
7976 -14838 6906 15123 23707 28710 32984 20688 -1272 -7776 -20020 -12829 -14156 -16163 -199
7963 -199 -7014 3595 18799 13141 3434 8012 25146 20095 20165 40388 25113 8061 3659 -13068
7949 -13068 -2807 3986 6117 5608 23967 17132 6470 1066 10725 3769 -5475 8469 7796 -6169
7935 -6169 -15002 -4328 5743 -5436 -1953 -10027 -11418 -17851 -3134 21691 20262 19367 47451 38103
7921 38103 25323 -4032 -845 15372 8452 2639 14668 -2532 -5107 6269 7412 13139 8715
7908 8715 10094 5715 15866 19083 10034 -1190 -2762 14188 20667 12395 12053 10267 21853 -5558
7894e558p118J3506L846n20j0685J4425j991J84p09J090p107k7757k808K1993
7880i209o923o829L549L5327J1189k844o041o321M532J3161q137j6635J1126j5797
7866A48j0783N164O32J044j4640o887J3157K361q510j3361K457J1117j76J5923
7852b354j837j6646j747p380J3660K964r1J0237j232j5219L247J5714N867j3806
7838h623q548J186P530m294L013L94K453p785Q653J2702J3355j1804l6182M153
7824b3797K8436J14J2922n512j5470o478K3474L523k1553k312o875J255j0100
7811b2373m690L906k39k389q274J5719L0492m467m830P856j221j3975j2967J8948
7797A496k933M5j5990L33Q049J1866o765j0795L134K5725J4409N584p015j0653
$$ plain form
7894 -5558 -12676 830 4676 4156 -6529 7896 5905 6089 5380 6470 -637 -28394 -31202 -9209
7880 -9209 -16132 -22961 -19412 15915 27104 24260 18219 11898 16430 29591 21454 4819 15945 148
7866 148 -10635 -5471 -4839 -3795 -18435 -25322 -12165 -9804 -18314 -31675 -29218 -18101 -18277 -2354
7852 -2354 -4191 -20837 -22584 -29964 -16304 -13340 -13431 -3194 -4426 -19645 -16398 -684 5183 -8623
7838 -8623 -17171 -15985 -8455 -12749 -9736 -9342 -6889 -14674 -6021 6681 20036 8232 -27950 -23797
7824 -23797 4639 4753 17675 12163 -3307 -9785 13689 17212 -4341 -6653 -13528 -12273 -22373
7811 -22373 -27063 -23157 -23396 -25785 -34059 -18340 12152 7685 2855 10711 9490 -4485 -17452 1496
7797 1496 -1437 -1392 -17382 -17049 -9000 2866 -3899 -14694 -11560 14165 28574 34158 27143 16490
7783A6490n195J7444R768N888l752k4892l206L763p890k981m172j6879k1529j1144
7769d8287J0667J9510J9644R799L708o756l94L357j6323k0804k987O805n317j514
7755b8892j3193L1243K3998J0961L369o496q613r516q803j0232m592K4076P730
7742A1040j2129j1374j264K984j0222R638J0941M975r267k508J6575m312j8846
7729a3769n142M530j2046q151m47J1637K1465j6918J4726M3383j0944k8342k1054
7716b1072J2688J8108j7732J1128K2494k3950k933R838l849N62J3936j0128k1176
7703a2086O075R244j6206R03K901K0164k250j4166j6551L046K5754K8459M342
7690C9629j2273k5402p942J4868J2190R802j5300o556q569k2626j7433N019J1688
$$ plain form
7783 16490 11295 28739 38507 44395 40643 15751 12545 16308 8418 5437 1265 -15614 -37143 -48287
7769 -48287 -37620 -18110 1534 11333 15041 8285 7891 11248 -5075 -25879 -28866 -22061 -27378 -28892
7755 -28892 -42085 -10842 13156 24117 27486 20990 12377 2861 -5942 -16174 -20766 3310 11040
7742 11040 -1089 -12463 -13727 -10743 -20965 -11327 -386 4589 -4678 -7186 9389 5077 -13769
7729 -13769 -18911 -14381 -26427 -34578 -35025 -23388 -1923 -18841 -4115 39268 28324 -18 -21072
7716 -21072 -8384 9724 -8008 3120 25614 1664 -1269 8569 4720 5282 19218 9090 -12086
7703 -12086 -6011 3233 -12973 -12070 -9169 10995 8745 -5421 -21972 -18926 6828 35287 39629
7690 39629 27356 1954 -5988 8880 21070 30872 15572 9016 447 -22179 -39612 -34593 -22905
7677b2905J3283R569Q073r808k3549j5740L179J5000R324P575k15J875K3811P200
7663B6672J262p670p429p04Q213K710j4700K202L348J1334j9775j6603m853O437
7649i556K0478j3890J93J1329J1042J2567J0135p456n4094j2686m236Q907J4192
7636a3075J0173K1801O003m574j7420n880K2635J4510m061j1483j369j2760m959
7623d59L676J2419J8305k4058r928m132n688p724M711j5300m534j4485M477L2864
7609i856J2502j225j2602q972k2031j8175J1709J9862J1021J5184P646J0756j324
7596A4495k5579n870J1854k4921q442J3432J2008N805Q766m078J0105K324q522
7583A377m962J9851m149j6721K837K894R82j0308K3170J2387j4197k9363k0735
$$ plain form
7677 -22905 -9622 -53 8020 -1788 -25337 -41077 -37898 -22898 -13574 -5999 -6214 -4339 19472 26672
7663 26672 27934 20264 12835 12131 20344 23054 8354 10556 13904 25238 5463 -11140 -15993 -9556
7649 -9556 10922 -2968 -2775 8554 19596 32163 42298 34842 -19252 -31938 -36174 -27267 -13075
7636 -13075 -2902 18899 24902 20328 2908 -2972 19663 34173 30112 18629 17260 4500 -459
7623 -459 3217 15636 33941 9883 -45 -4177 -9865 -17589 -12878 -28178 -32712 -47197 -42720 -9856
7609 -9856 2646 1421 -11181 -20153 -42184 -60359 -48650 -28788 -17767 -2583 5063 15819 14495
7596 14495 -11084 -16954 -5100 -30021 -38463 -25031 -13023 -7218 1548 -2530 7575 9899 1377
7583 1377 -3585 16266 12117 -4604 -1767 1127 2109 -8199 14971 27358 13161 -16202 -36937
7570c6937n074J3999J1586p112M817J4200j0761m809n873J4602J599n343L173
7557a1933j0142j725L950o783j3221j3989J7950K2565J7677k1144J549R038J1776
7544E568P250o716R408L790O240j7678l176P232P930K663J8927J573j8971j6068
7530G972o321j5754r900O826k057J4600O226P802M283j4881n240J522j451r594
7516a5967j623J0500J6774j0024j3749J469L370k0237r40K1581J0609L874J601
7503G238P745J3732K329k6390k2398k156J414l788m835r513l111J9081R965K219
7489h468J0286n523p390K824j8461k6639k884J3458K0020K1046m84O884J1008
7476A5677r264k6718k8665J0246K0195j9730J3652J0421q930O820J1170M242L317
$$ plain form
7570 -36937 -42011 -28012 -16426 -23538 -18721 -4521 -15282 -20091 -25964 -11362 -9763 -15106 -11933
7557 -11933 -22075 -23800 -19850 -26633 -39854 -53843 -35893 -13328 4349 -16795 -15246 -6208 5568
7544 5568 12818 6102 15510 19300 25540 7862 4686 11918 19848 22511 41438 43011 24040 7972
7530 7972 1651 -14103 -24003 -17177 -19234 -4634 1592 9394 13677 -1204 -6444 -4922 -6373 -15967
7516 -15967 -17590 -7090 9684 -340 -14089 -12620 -9250 -29487 -30427 -8846 1763 5637 7238
7503 7238 14983 28715 31044 4654 -17744 -19900 -18486 -22274 -27109 -36622 -39733 -20652 -10687 -8468
7489 -8468 1818 -3705 -11095 -8271 -26732 -53371 -56255 -42797 -22777 -1731 -2215 4669 15677
7476 15677 6413 -20305 -48970 -38724 -18529 -38259 -24607 -14186 -23116 -16296 -5126 -884 2433
7463B433k4385N806j378J4859O893J0775r106q911p224L735J4985J5822M301L943
7449C2548m672n830j2037n849j293n846l24l6873J5828J142q506o42K895Q127
7435b1332K2612K0290p185j8454J1101N270n837M005N8K944j128N366k3351k6438
7421c2079J3447K6554o010j7725N129N222q993J695J5784m760l213j1255o624
7408b2828Q908J3561l582J0108R870J743j7532k5763J4844K1290L875R725j6169
7395H050k1860N57J73o464P62K2455K6512j1717k722K5634o926k5772n346Q02
7381D138N366J4329r022n64J872p191j7414p32J6814J0804J4595l540j509k0517
7367G429j7190Q720M473J81o578P661q706j0111K776J6135J1759n684M476k102
$$ plain form
7463 2433 -21952 -16146 -17524 -2665 4228 15003 5897 -3014 -10238 -6503 8482 24304 28605 32548
7449 32548 27876 22046 10009 4160 2867 -2979 -3303 -40176 -24348 -23206 -31712 -32354 -29459 -21332
7435 -21332 1280 21570 14385 -4069 7032 12302 6465 10470 10528 13472 12344 17710 -5641 -32079
7421 -32079 -18632 7922 1912 -15813 -10684 -5462 -14455 -12760 3024 -1736 -4949 -16204 -22828
7408 -22828 -13920 -359 -3941 6167 16037 17780 248 -25515 -10671 10619 14494 24219 8050
7395 8050 -13810 -13253 -13080 -19544 -18782 3673 30185 18468 15746 41380 34454 8682 3336 4138
7381 4138 9504 23833 14811 14247 16119 8928 -8486 -9218 7596 18400 32995 29455 27946 7429
7367 7429 -9761 -1041 3432 3613 -2965 4696 -4010 -14121 -11345 4790 16549 10865 15341 13239
7353A3239l8925j436O350j4297j0704R867L33j9320k964K0124j331j2359O525
7340d4898K8144o980j0371J6345M708K2223Q879k1603p790k648Q869r282K689
7327a1715j0469J1670J6709m458j8282r444j0904J9396j464j6753J1745J9146
7315d823J1216M910k2609j7606L151J7N634N033K1199k3652k2811J2444M2554
7302A4657K8212k8307j6991L178J1267j6904J9311K5292k0197k6874k0111J194
7290b6273J1713p018j103J6026J1808p24j026p22o926R00K293O467Q179K2750
7276C6344j2491j6185N452j639j8701p960P5O064m683P462P447O420j1095j5486
7262a8976J4116J9430r815j6556m407K6565K1082r558l423J9302p822j8301j8798
$$ plain form
7353 13239 -25686 -27122 -20772 -35069 -45773 -35906 -35573 -54893 -57857 -37733 -39064 -51423 -44898
7340 -44898 -16754 -23734 -34105 -17760 -13052 9171 18050 -3553 -11343 -13991 -5122 -14404 -11715
7327 -11715 -22184 -10514 6195 1737 -16545 -25989 -36893 -17497 -18961 -35714 -23969 -4823
7315 -4823 6393 11303 -11306 -28912 -25761 -25744 -20110 -15077 6122 -17530 -40341 -27897 14657
7302 14657 42869 14562 -2429 749 12016 -4888 14423 39715 19518 -7356 -27467 -26273
7290 -26273 -14560 -21578 -22681 -6655 5153 4429 3403 2681 -4245 -3345 -1052 5415 13594 36344
7276 36344 23853 7668 13120 11481 -7220 -15180 -15105 -9041 -13724 -6262 1185 7605 -3490 -18976
7262 -18976 -4860 14570 4755 -11801 -16208 10357 31439 21881 18458 37760 29938 11637 -7161
7249g161N332J0408k369o520J8584j7811q575q714n06Q403J1927J0056j5963j3524
7235a6433M336O86j6174j468l396O507K24R294N637L454j6574L044l664J4741
7221i786R698n595j0837P864J1793q13J3844K4454Q823j9360k6505k4287O567
7208a4140N091J5910K388q277J0074J32M113p8k5653o518q568q401M008J9046
7194a0873Q643J6738J2415m00p818l016J1536P556k7035j2827k033K1992L2781
7181D7659O473j5995k5005k2624P921j3175r438j897J3712J9583m618j0565k2315
7168c0284p948J2819J4322J449k839j750l781j3593j3925N404J4333J74n699J397
7154b9921q494K052K4707L1396J3028j8704k2441j3744k477J6987L34r042P624
$$ plain form
7249 -7161 -1829 8579 6210 -310 18274 463 -8112 -16826 -17332 -8929 2998 13054 -2909 -16433
7235 -16433 -12097 -11411 -27585 -29053 -32449 -25942 -25718 -16424 -10787 -7333 -23907 -20863 -24527 -9786
7221 -9786 -88 -5683 -16520 -8656 3137 2324 16168 40622 49445 30085 3580 -20707 -14140
7208 -14140 -9049 6861 9249 972 11046 11178 15291 15213 -10440 -16958 -25526 -33927 -29919 -10873
7194 -10873 -2230 14508 26923 26523 18705 15689 27225 34781 7746 -5081 -7114 14878 47659
7181 47659 54132 38137 13132 -9492 -1571 -14746 -24184 -26081 -12369 7214 2596 -7969 -30284
7168 -30284 -38232 -25413 -11091 -9642 -12481 -14231 -18012 -31605 -45530 -40126 -25793 -25619 -31318 -29921
7154 -29921 -38415 -36363 -11656 19740 32768 14064 -8377 -22121 -24598 -7611 -7277 -16319 -8695
7141h695L707n620L07p917j258J5779j1155N675n002j0851p466o499J7615J6717
7127d663J0320O218k034K1242J1512j2650j4538j9796j5683k310j0608J2569J2923
7114g498k879o52k3414O694K9442j3634p015k776j2218j538J4713K3470K551k526
7100B720Q27o565j5822j5161K4522J1041q774n236k621k696J775k71K2470K2000
7086B8209p924q957p521k146K880p392Q887M464K145k445j3233J53R607J5490
7072B2217j3857j0517O206p830J4329O215M285k306j7030o185m26P355J2426k582
7058A2300j8893l712L146l166K246q922J6577J2551j4980L722O84j7094R711L274
7044b556l300Q857p88K4819K2951o172k8901p591k0264R867M831J2117j7477k5777
$$ plain form
7141 -8695 -4988 -10608 -10301 -18218 -19476 -3697 -14852 -9177 -14179 -25030 -32496 -38995 -21380 -4663
7127 -4663 5657 11875 9841 31083 42595 29945 15407 -4389 -20072 -22382 -32990 -20421 -7498
7114 -7498 -10377 -11029 -34443 -27749 1693 -11941 -18956 -21732 -33950 -35488 -20775 2695 5246 2720
7100 2720 3547 -3018 -18840 -34001 -9479 1562 -7212 -12448 -15069 -17765 -15990 -16261 6209 28209
7086 28209 20285 11328 3807 1661 4541 -2851 6036 10500 12645 10200 -3033 -2880 6727 22217
7072 22217 8360 -2157 4049 -3781 10548 16763 21048 18742 1712 -4473 -4899 2456 14882 12300
7058 12300 -6593 -10305 -7159 -10325 -8079 -17001 -424 12127 -2853 869 1553 -15541 -5830 -2556
7044 -2556 -5856 3001 2213 27032 49983 43811 14910 7319 -12945 -3078 1753 13870 -3607 -29384
7030b9384k262j0939N96O418l839r422J8151J8060j1490l705J4265M985l1565
7017d0131l44K534Q885J2828k6173k9951J0357K7100M409l618R457L851J2154
7004h642J672K023N97O944J0327K134L994q88m524j0274j474J2281J6118j4368
6990A5920k7924k6098J1766J5312l589j2025j2115q553N48J7775K379J722K226
6977b2656p271R211m7j1379P472J1664k726J041K193K735k552j3680j1937P459
6963c0473Q167r067J1116N396q596L1271M495k1930P192o515j1570J991r29J9218
6949b34J2735J958j6123n003l187j9113J3777J5066k631N004r734R62l658m861
6935a5042o967j1634j0473K2151L822J1119J6191j107J048j4305o391k489J1935
$$ plain form
7030 -29384 -31646 -42585 -41989 -35571 -39410 -48832 -30681 -12621 -24111 -27816 -13551 -8566 -40131
7017 -40131 -40475 -37941 -29056 -16228 -42401 -72352 -61995 -34895 -30486 -34104 -24647 -20796 -8642
7004 -8642 -6970 -4947 -4350 2594 12921 15055 19049 18161 13637 3363 1889 14170 30288 15920
6990 15920 -12004 -38102 -26336 -11024 -14613 -26638 -38753 -47306 -46758 -28983 -26604 -24882 -22656
6977 -22656 -29927 -20716 -20763 -32142 -24670 -13006 -15732 -14691 -12498 -9763 -12315 -25995 -37932 -30473
6963 -30473 -22306 -31373 -20257 -14861 -23457 7814 12309 -9621 -2429 -8944 -20514 -18523 -19452 -234
6949 -234 12501 14459 -1664 -6667 -9854 -28967 -15190 -124 -2755 2249 -7485 -6523 -10181 -15042
6935 -15042 -22009 -33643 -44116 -21965 -18143 -7024 9167 8060 9108 -5197 -11588 -14077 -2142
6922b142K4913j03J267J2913r129j1039j5597K311J249j3561o547N816n762k4539
6908c9950K007K805J3812Q043Q950Q164p053j4000j874P096J7987K7724P965j4130
6894B7546m717O428L498k58j7620Q110n556j9983m60J7563K617j4640l362K5751
6880B4917M428m931p335j1031J452j5972j1647O008q643j1378K091n88J1821J0959
6866i849j2285K403L834N014M658K201j743k37J3391M410k0132q730J9697J2924
6852A5556J5773R476l546j0310M872j3910J6324j1593j4622n939m388j0209k902
6839a5418J2714J1163J6636J201j0479P261o756o948j1543r874J4493j837M96
6826A109q439j367l90n290j484J2117K367R266M326q410j8523J451n860O330K9705
$$ plain form
6922 -2142 22771 22668 23935 36848 27719 16680 1083 3394 4643 -8918 -15465 -9649 -15411 -39950
6908 -39950 -37943 -35138 -21326 -13283 -4333 3831 -3222 -17222 -19096 -12000 5987 33711 41676 27546
6894 27546 22829 29257 32755 32497 14877 22987 17431 -2552 -3012 14551 17168 2528 -834 24917
6880 24917 29345 24414 17079 6048 7500 -8472 -20119 -14111 -22754 -34132 -32041 -32629 -20808 -9849
6866 -9849 -22134 -19731 -15897 -10883 -6225 -4024 -5767 -6004 7387 11797 -8335 -17065 2632 15556
6852 15556 31329 40805 37259 26949 31821 17911 34235 22642 8020 2081 -2307 -12516 -15418
6839 -15418 -2704 8459 25095 26296 15817 23078 16322 9374 -2169 -12043 2450 613 1109
6826 1109 -7330 -8697 -9087 -14377 -15861 -3744 -1377 7889 12215 3805 -14718 -13267 -19127 -12797 16908
6811A6908J4052M667K122j6979k1039o099j346P04J1896Q83k0896P452Q857J2281
6797A3463r050k3985j2726J4J9105R18j3896J8070J422L615J6529P255j1533N790
6783A4991j3916j3610j469J3641m385l978j9066m408J6782J7870q566N264J5689
6770A4839j2629j4631j4868O88j0346J1648J9472J0846P327K456M925l0333j8367
6757b8973K2079J9140L756Q54n73m411N637j7564k2129O678M828O177K8963l709
6743B0753j439o165j9367j7506p79K1697N637j0031j5690k2450K264J6749N499
6730b0828J155K3945J1709j5588q677R179M72m983j2664r103P116J1959l630O161
6716c777J3151n832j7372J3945r485j7792o121N562J0649J8537J8758P871K965
$$ plain form
6811 16908 30960 35627 37749 20770 -269 -6368 -7714 -7010 4886 5769 -15127 -7675 1182 13463
6797 13463 4413 -19572 -32298 -32284 -13179 -12261 -26157 -8087 -6665 -3050 13479 20734 9201 14991
6783 14991 1075 -12535 -14004 -363 -4748 -8726 -27792 -32200 -15418 2452 -6114 -850 14839
6770 14839 2210 -12421 -27289 -26601 -36947 -25299 -5827 5019 12346 14802 19727 -10606 -28973
6757 -28973 -6894 12246 16002 16856 16283 11872 17509 -55 -22184 -15506 -10678 -4501 24462 20753
6743 20753 19314 13149 -6218 -23724 -24503 -2806 2831 -7200 -22890 -45340 -43076 -26327 -20828
6730 -20828 -19673 4272 15981 393 -8284 895 1367 -3616 -16280 -25383 -18267 -6308 -9938 -3777
6716 -3777 9374 3542 -13830 115 -9370 -27162 -33283 -27721 -17072 1465 20223 28094 31059
6703C1059j1981k883J3490q113j1219j4590m440k2954j9155J1226P314O790R291
6690a6165K0491L790o077j3383M125J258j389r11q131l247j1524k0609k628l755
6676e8155M025K2014J7313P152k229q063O151N367J3735j4300Q800o595J7106
6663A2321K9452j0562l0732p391p905K95J2755N890j2452k5700J3454m10J0877
6650a0108O714M716R126L440j7635l087O23J0626L3141K865n700J5212k2691j9434
6636G808J4630p03R284k1553m296p589P830k77N595K416k3484j2672J049K681
6622a9281J2085M73j8851o902J252J8713l531M034O781k2308J6127J3384l523
6609a547J1307K249l1175R516M410J3834k392l6670R895J9347p017P066j0464
$$ plain form
6703 31059 19078 16195 29685 21572 10353 -4237 -8677 -31631 -50786 -39560 -32246 -25456 -16165
6690 -16165 4326 8116 2039 -11344 -7219 -5961 -7350 -8261 -16392 -19639 -31163 -51772 -54400 -58155
6676 -58155 -54130 -32116 -14803 -7651 -9880 -17943 -11792 -6425 7310 -6990 1810 -4785 12321
6663 12321 41773 31211 479 -6912 -14817 -14522 -1767 4123 -8329 -34029 -20575 -20985 -10108
6650 -10108 -3394 1322 10448 13888 -3747 -6834 -6211 4415 37556 40421 34721 49933 27242 7808
6636 7808 22438 21735 31019 9466 5170 -2419 5411 5134 10729 13145 -10339 -23011 -21962 -19281
6622 -19281 -7196 -6723 -25574 -32476 -31224 -12511 -16042 -12008 -5227 -27535 -11408 1976 -1547
6609 -1547 9760 12009 -19166 -9650 -5240 8594 6202 -30468 -20573 -1226 -8243 -1177 -11641
6596a1641M740j3572O648r03j6131J1316K0054N729q573Q94Q951k982l467j1249
6582a0186K506P035J3197r630k5060k4243M325J4073K1608J8075J3435o978p234
6569A0923j1258J0009j0795k5789l452l543J7110K5343n560n906j4512p433P242
6556a7621J4191o578m698J1628N54j1778j8964N825K1132n012j790l951J0058
6543g004K520R52K622p870p273M814R801J2598Q380Q352k2531P745M214j631K1832
6528C7521k495k9429k305J4504n522j858K134J1425O79k8056l416J2327J9571
6515B5080J718m289j2976M511P688l6761j4372L840K1794O886O86M621Q016K774
6501A9216Ok0463l0690m114J649K77j7589K1473J3863J430J3808J2583k62r035
$$ plain form
6596 -11641 -6901 -20473 -13825 -14728 -30859 -19543 511 6240 -2333 -1439 7512 4530 1063 -10186
6582 -10186 -7680 -645 12552 2922 -22138 -46381 -42056 -27983 -6375 11700 25135 18157 10923
6569 10923 -335 9674 -1121 -26910 -30362 -33905 -16795 8548 2988 -2918 -17430 -24863 -17621
6556 -17621 -3430 -10008 -14706 -3078 -2524 -14302 -33266 -27441 -6309 -11321 -13111 -17062 -7004
6543 -7004 -4484 -3532 -910 -8780 -16053 -11239 -1438 11160 19540 27892 5361 13106 17320 15689 37521
6528 37521 35026 5597 3292 17796 12274 10416 12550 23975 24654 -3402 -6818 5509 25080
6515 25080 26798 22509 9533 14044 21732 -15029 -29401 -25561 -3767 3119 3805 8426 16442 19216
6501 19216 19222 -1241 -31931 -36045 -34396 -34119 -51708 -30235 -16372 -14942 -1134 11449 11187 2152
6487B152M995r234k3568k9458j82m395r171K7704J5762K5371J680M357l309p851
6473e147k4707K2417J4915Q990Q225P773R027j9702Q11J1363l0447k1462N378
6460a2566j4756p293P534K9986R136j9510p431q320J5652K1316J31k7028J087
6447a2062k683l0599K467K032J649n49P345J9020k9627j8081N028J0811J6312
6434b8937K5428J8001j0678n884N265r572l041j2204o902M683J8924J5724j90
6421A0617l080o682j0718J661l37J1488n473Q418k0239q107P225O19K6054J8716
6407C0162k596k2953j0210o451P475O420O793o436O557L807J4952j579m314J980
6393B3607j129r444L215j3797m269P589J9666k08j9823o52L067l982k968K1306
$$ plain form
6487 2152 7147 -2087 -25655 -55113 -55295 -59690 -68861 -41157 -25395 -24 1656 6013 2704 -5147
6473 -5147 -29854 -7437 7478 16468 24693 32466 41493 21791 22602 33965 3518 -17944 -12566
6460 -12566 -27322 -34615 -27081 2905 12041 -7469 -14900 -23220 -7568 13748 13879 -13149 -12062
6447 -12062 -14745 -45344 -42877 -40845 -39196 -39745 -32400 -13380 -43007 -61088 -56060 -45249 -28937
6434 -28937 -3509 14492 3814 -2070 3195 -6377 -9418 -21622 -28524 -23841 -4917 10807 10617
6421 10617 7537 855 -9863 -8202 -8539 2949 -2524 5894 -14345 -22452 -15227 -14608 11446 30162
6407 30162 27566 4613 -5597 -12048 -4573 1847 8640 2204 8761 12568 27520 25941 21627 23607
6393 23607 22478 13034 16249 2452 -1817 5772 25438 25230 5407 4755 7822 3840 872 22178
6379B2178J5648n709n218j6055l0976J4223J1940k634O272M171k0591l2830J2806
6366b6775J5914Q225K5843J70j2510j7691J1644n52j2521j5580M645P121o892
6353a8959j4480J1738J0554j0184j3820N888J2003L3429J1708j6725j4962l999
6341g809J5834N078k620J1681J6520j8305k5551l866P314R028K209j2517J8086
6328A5082k9223j012J6309M387q81j0658j0345k7468n738N0538J3390O489n927
6315A4943J900j5905L307K1542p71j1689j4308j7208J211J1855k6908O295J7281
6302h455R035j6470m041J9443L8009Q531j6402l9351k5721J2812r73K597p028
6289b8014j777J8240o701k507K7149K6238n489q960r40n223k1765j8256J6642
$$ plain form
6379 22178 37826 32117 26899 10844 -20132 -5909 6031 3397 9669 13840 -6751 -39581 -26775
6366 -26775 -10861 -2636 23207 23377 10867 -6824 4820 4268 -8253 -23833 -19188 -12067 -18959
6353 -18959 -33439 -21701 -11147 -21331 -35151 -29263 -17260 16169 27877 11152 -3810 -7809
6341 -7809 8025 13103 10483 22164 38684 20379 -5172 -9038 -1724 7304 9513 -3004 15082
6328 15082 -14141 -15153 1156 5543 4662 -5996 -16341 -43809 -49547 991 14381 20870 14943
6315 14943 16843 938 4245 25787 25016 13327 -981 -18189 -16978 -5123 -32031 -25736 -8455
6302 -8455 580 -15890 -19931 -488 37521 46052 29650 -9701 -35422 -22610 -23583 -20986 -28014
6289 -28014 -29791 -11551 -18252 -20759 6390 32628 27139 18179 17239 12016 -9749 -28005 -11363
6276a1363K6977j3534p035k366J29L134j1747j7502Q636K3485K9840J2537l351
6263C7840Q266r295j4799j7190r026M832J984O230j3396k2283j4189Q266K5436
6250g324J6821q992n812j6990L933R722r709k876J0490j5468j6593N206J5834
6237b1758P309M354J1450L632l384k7420j0870p30J9510R033j0045J9226L6672
6224C6979j5382j8399P181j9092r436P03K0351l452j3500j2352O855k369q587
6211c0500K6810K654j3733k170j0069j813R507O581j5900o512R584J1110N458
6198h993r652j1384J6790J225l28R111q218n603l289Q822q9r486J5836K815l2582
6183c5025j4610J5101P26K7888l763j7080p483J2185J0124j547j434r803l2268
$$ plain form
6276 -11363 15614 2080 -4955 -7321 -7192 -4058 -15805 -33307 -24671 -1186 28654 41191 37840
6263 37840 46106 36811 22012 4822 -4204 628 2612 8842 -4554 -26837 -41026 -32760 -7324
6250 -7324 9497 505 -5307 -22297 -18364 -8642 -18351 -21227 -10737 -26205 -42798 -37592 -21758
6237 -21758 -14449 -10095 1355 4987 1603 -25817 -36687 -37417 -17907 -8874 -18919 307 36979
6224 36979 21597 3198 10379 -8713 -18149 -17446 2905 -547 -14047 -26399 -19544 -21913 -30500
6211 -30500 -3690 -1036 -14769 -16939 -27008 -28821 -19314 -12733 -28633 -35145 -25561 -14451 -8993
6198 -8993 -18645 -30029 -13239 -12014 -12342 -3231 -11449 -17052 -20341 -11519 -11608 -21094 -5258 -2443 -35025
6183 -35025 -49635 -34534 -33808 -5920 -9683 -26763 -34246 -22061 -11937 -13484 -14918 -24721 -56989
6170e6989J2783K9210J3821j4554p846j2667M709J8289J4493K5056J2234p271
6158C1268k4093j6716j1718J0636j4579O747L748j4533q792L0329J7156J9175
6146B8628j6055k9282l507j5295J0124J5329o06j4027p214J7285J4556M349J592
6133E877K0248J6887m386k1673J2406J2217o969O849k2942j1592k4763j7327N455
6120b9713j7612P076J3162O309J2770Q68k509k077J9436O155k0875j6666j1326
6107c5002K032N920L584J8659j109l0880p665J5686K3471J1098n516o483l915
6094a0120j0842J2551j2657o643J1185J1178O350N598j0914m773j2386K366K5365
6081F258k0226o47K820o522Q878M675L663Q208J0271j5242j3884J2166K2583K1185
$$ plain form
6170 -56989 -44206 -14996 -1175 -15729 -23575 -36242 -31533 -13244 1249 26305 38539 31268
6158 31268 7175 -9541 -21259 -10623 -25202 -18455 -14707 -29240 -38032 -7703 9453 28628
6146 28628 12573 -16709 -20216 -35511 -25387 -10058 -10664 -24691 -31905 -14620 -64 4285 5877
6133 5877 26125 43012 38626 16953 29359 41576 34607 41456 18514 6922 -17841 -35168 -29713
6120 -29713 -47325 -40249 -27087 -20778 -8008 -7140 -9649 -11726 7710 13865 -7010 -23676 -35002
6107 -35002 -32970 -27050 -23466 -4807 -5916 -36796 -44461 -28775 -5304 5794 278 -6205 -10120
6094 -10120 -20962 -8411 -21068 -27711 -16526 -5348 1002 6600 -4314 -9087 -21473 -19107 6258
6081 6258 -13968 -14615 -11795 -18317 -9439 -4764 -1101 7107 17378 2136 -11748 418 23001 44186
6067D4186P426o6m650p326k246j9693k8565M09m553J1206Q529J0415j172q771
6053E129k6235L636J6540J4106J5120J0587l157o791O83M430k1392k737J0317
6040B0236n783j0235j6082q021J2463J5380J3197k909j7014k8781j1959P972J3409
6027a8127J5066J4268L737j46j3782k8492j1474K3800L1723k0873p533R021J4475
6014A1663p435j7534n06N331M192J8513L726j1972n320m791j1857M48n784l145
6000b4471k4916L570K1030N424k110J51J1865k946R934J8467J130L810J9390k0069
5986B0259K1817j3554m1544O947J6360k749L634K01O748k1377q639N574J1654
5973E331O55l997K729P468K319L136R513q299j4772J4158J3837r979n104k2569
$$ plain form
6067 44186 51612 51546 46896 39570 37324 17631 -10934 -10525 -15078 -3872 4657 15072 13900 5129
6053 5129 -21106 -17470 -930 13176 28296 38883 35726 28935 29618 34048 12656 9919 20236
6040 20236 14453 4218 -11864 -19885 -7422 7958 21155 18246 1232 -27549 -39508 -31536 -18127
6027 -18127 -3061 11207 14944 14798 1016 -27476 -38950 -15150 16573 -4300 -11833 -2812 11663
6014 11663 4228 -13306 -13812 -8481 -4289 14224 17950 5978 658 -4133 -15990 -15542 -21326 -24471
6000 -24471 -49387 -45817 -24787 -19363 -21473 -21322 -9457 -12403 -2469 15998 17128 20938 40328 20259
5986 20259 42076 28522 -13022 -6075 10285 7536 11170 11371 18119 -3258 -11897 -6323 5331
5973 5331 5986 1989 4718 12186 14505 17641 27154 18855 4083 18241 32078 22099 16995 -5574
5959e574Q044R034l221q596M596J9597j190k2667k916J3653j6856j809m443P314
5945e034J1173K787M388P643J0489M444k5868k5179K0038J3824n401M060j3344
5932D020k883j8523K620J1392J2695j967O907m21j3457k893N725L497j1948J1053
5918E817J7413R912p224r992j0538j3666J7995J1185L1059j2305k9540o317J2471
5905A6270K6571J5922j6763r106j9262J6980n431l4441j3264l941P104K1822j1415
5892h954q680J2539K0306n3m818q055J356k133j1307N976N766o888m725J4481
5878D811J463J094k2792r959K759K1709O826j59N536j3122l513O723o837Q594
5864C133o840m79l750j1510k0583J5K2621j0967j2916K2522Q554J7639K2296j5699
$$ plain form
5959 -5574 2470 11504 8283 -313 4283 23880 22690 23 -2893 10760 -6096 -7905 -12348 -5034
5945 -5034 6139 8926 13314 20957 31446 35890 10022 -15157 4881 18705 13304 17364 4020
5932 4020 1137 -17386 -14766 -3374 9321 7354 14261 13840 383 -2510 3215 6712 -5236 5817
5918 5817 23230 33142 25918 15926 5388 -8278 9717 20902 51961 39656 10116 3799 16270
5905 16270 42841 58763 42000 32894 13632 30612 25181 -9260 -22524 -26465 -19361 2461 -8954
5892 -8954 -17634 -5095 15211 15158 10340 2285 3641 1508 -9799 -3823 1943 -4945 -9670 4811
5878 4811 6274 7368 -15424 -25383 -22624 -915 5911 5752 11288 -1834 -5347 1376 -5461 3133
5864 3133 -3707 -4186 -7936 -19446 -40029 -40014 -17393 -28360 -41276 -18754 -10200 7439 29735 14036
5850A4036l8140j6359J8630J0857j0901r406P917J3446K758L436J779R053J0680
5837A7786L577k2577r728Q37J702J9118J4708R196k6423n728m572j762J3580J8812
5823B8526P838j1821j8017j790R915j2521o983l166j3362P165P049j637l516J719
5809a0601p945j952j1003O655L2977K574r36n283r319K0740K5990J9739j6278
5796D5358k0339j7195j1026P614R232k6112l165R803J1832K7680j9496m7637k9171
5783f2622J707L1312L5394K955N433K3192j308j4055k7775j592M627J2899N834
5770A6001j2436J5119O051J5256N883q797K103r622j9540o971K2012J6082O073
5757D7214j3114m296j5677j4342P87N907p487j0093R537j3760J6706K1332J1653
$$ plain form
5850 14036 -24104 -40463 -21833 -10976 -21877 -31283 -23366 -9920 -7162 -3726 -1947 7106 17786
5837 17786 21363 -1214 -10942 -10105 -8403 10715 25423 34619 8196 2468 -2104 -3866 9714 28526
5823 28526 36364 24543 6526 4736 14651 2130 -4853 -8019 -21381 -14216 -7167 -8804 -12320 -10601
5809 -10601 -18546 -20498 -31501 -24846 8131 10705 9769 4486 -4833 15907 41897 61636 45358
5796 45358 25019 7824 -3202 4412 13644 -12468 -15633 -5830 6002 33682 14186 -33451 -62622
5783 -62622 -60915 -29603 5791 8746 14179 37371 36063 22008 -5767 -7359 -2732 10167 16001
5770 16001 3565 18684 24735 39991 45874 37077 39180 29558 10018 3047 25059 41141 47214
5757 47214 34100 29804 14127 -215 572 6479 -1008 -11101 -1564 -15324 1382 22714 34367
5744C4367L691N895j7106j3165J0191r460o506J1913N260n133J1519j4616l194
5731A3656R489L291o524j3757j1468o985o66J3417K7923J1292k7087j5854K3242
5718A9969j7876j1428J0438j3088j2340K1648J9323k940o119J3412k1608j5481
5706a6090M11q991K0576J4735n574j5955L683O737J9319J9135n802r114k1680
5693A390r325N469J3129J623j0578j5642p660k8369Q63K3171J9047N217n258l406
5679a0329l31o04m339L1363j3835j0706q084k758n95J0310j1794J0569Q517J3355
5665A0739j649j6385r180m949L287j5736j159J2245K3808k2714N64Q359p440r816
5651c0026K080N45J2763J7579J3020r762k3400j5570N836L8600O855L285o674
$$ plain form
5744 34367 38058 43953 26847 13682 23873 14413 7907 19820 25080 19947 31466 16850 13656
5731 13656 23145 26436 19912 6155 -5313 -12298 -12964 453 28376 39668 12581 -3273 19969
5718 19969 2093 -9335 1103 -11985 -24325 -2677 16646 13706 7587 20999 -609 -16090
5706 -16090 -15679 -24670 -4094 10641 5067 -10888 -7205 -468 18851 37986 32184 23070 1390
5693 1390 -7935 -2466 10663 12286 1708 -13934 -21594 -49963 -49100 -25929 -6882 -1665 -6923 -10329
5679 -10329 -10660 -11264 -15603 15760 1925 -8781 -16865 -19623 -20218 -9908 -21702 -11133 -2616 10739
5665 10739 9090 -7295 -16475 -21424 -18137 -33873 -35032 -22787 1021 -21693 -21129 -12770 -20210 -30026
5651 -30026 -27946 -27401 -14638 2941 15961 6199 -17201 -32771 -26935 11665 18520 21805 15131
5638A5131k341J4138q636j1307k57j6123K3211K0617k0395j1623r518j8292j545
5625b6940J1583J3502q275p392l285N385J479k1457j4271J0088m996M00j4226
5612e8405J171K0661L1872K587J2968q830k102k4558O40J2161q003J418j1675
5599c0095K610Q721R032J2714q34j6410k395q94R512K829k487J20j5867K764K3563
5584B883J6535q539L52N410p248j0396j4087n278n499l989P629j2983N238K7804
5570b168O83J0834J8619j4818k2285p811L191P906J4204j1161k9933o913R73L2605
5556f074K4106P008j5563j0923q849l15N069k884N506j1305J0436J9594l253k5911
5542a3358j1039K3712r595k4893J0938J0108J1537P90J4040l217j0635j4171j0685
$$ plain form
5638 15131 12790 26928 18292 6985 6728 -9395 13816 34433 14038 2415 -7103 -25395 -26940
5625 -26940 -15357 -1855 -10130 -17522 -20807 -15422 -13943 -35400 -49671 -39583 -44579 -44179 -58405
5612 -58405 -57234 -36573 -4701 -2114 10854 2024 -78 -24636 -23996 -11835 -19838 -18420 -30095
5599 -30095 -27485 -18764 -9732 2982 2148 -14262 -16657 -17551 -8039 -5210 -7697 -7577 -23444 -20680 2883
5584 2883 19418 10879 11231 16641 9393 -1003 -15090 -20368 -25867 -29856 -22227 -35210 -29972 -2168
5570 -2168 -1485 9349 27968 13150 -9135 -16946 -13755 -5849 8355 -2806 -32739 -39652 -38679 -6074
5556 -6074 18032 25040 9477 -1446 -10295 -10610 -5541 -8425 -2919 -14224 -3788 15806 12553 -13358
5542 -13358 -24397 -685 -10280 -35173 -24235 -14127 -2590 -1800 12240 9023 -1612 -15783 -26468
5529b6468j3242Q442K2711K5175L240l050j2367J4953J0063j3238n412p69l487
5516F551o192p891P999J0107j8468M221O173K3289R055j8082J004l211k855J3091
5502B4791O526j0877j1862o592j1171k804L055j34K982m088K6148J7559l355L079
5488C3257r81m447k5993N520k688l0497r769k683J5153L1919J318j9173j0480
5475a9544l148J4422K475j7080q851J6403K4p141O161J6424j6133N000n464L70
5461a6082J1583M247Q250l473k4005M479P012K9838j3712j9778j5501J9813J0929
5448C600j4797K912j4007J0377J0183k033k0824J817K9461p593m709j420m908
5435a1941j8914P359L796J6767j285l3239q140L091J4490P059l317m89J3308K5148
$$ plain form
5529 -26468 -39710 -31268 -8557 16618 19858 16808 4441 19394 29457 16219 10807 10038 6551
5516 6551 359 -7532 467 10574 -7894 -3673 2500 25789 34844 16762 17766 14555 11700 24791
5502 24791 31317 20440 8578 1986 -9185 -11989 -8934 -9068 -6086 -10174 15974 33533 30178 33257
5488 33257 32276 27829 1836 7356 4668 -25829 -35598 -38281 -23128 8791 10109 -9064 -19544
5475 -19544 -22692 -8270 -5795 -22875 -31726 -15323 -15299 -22440 -16279 145 -15988 -10988 -16452 -16082
5461 -16082 -4499 -252 7998 4525 -19480 -15001 -7989 21849 8137 -11641 -27142 -7329 3600
5448 3600 -11197 -8285 -22292 -11915 -1732 -3765 -24589 -22772 6689 -904 -5613 -7033 -11941
5435 -11941 -30855 -23496 -19700 -2933 -4218 -37457 -45597 -42506 -28016 -20957 -24274 -24763 -11455 13693
5421A3693j7615k582R678J6982M187j8684j1877k725r774k5412p93K3590J1293
5408a0039p715j6163m402J4608K1049R675q323J9464P766m697l653R223J3120
5395C9913l660p841j1905j0027Q100K715L317R071J0316o71k8509k7291r24r714
5381b7110J413Q43J5797P91N57k070N353j4240k4888K575L0516L0854O29n899
5367A5121j1478k0206R958J7250O916j3019l860J9550J464j4749P173n210r372
5354d62j0077l127P98J3577k0975p208J5646J5146j0338M049J3479k725k0452
5341a2669r849j505o343N278K4952R398j2671k3774J579o439J4990K8977q58K020
5327A3086k3347Q483P916J1912k2202M177K0081J1783K27Q091j4600k655r89p786
$$ plain form
5421 13693 -3922 -6504 3174 20156 24343 5659 -6218 -8943 -18717 -44129 -44922 -21332 -10039
5408 -10039 -17754 -33917 -38319 -23711 -2662 7013 -1310 18154 25920 21223 17570 26793 39913
5395 39913 36253 28412 16507 6480 14580 17295 20612 29683 39999 39328 10819 -16472 -17396 -27110
5381 -27110 -25697 -24854 -9057 -8266 -7709 -9779 -4426 -18666 -43554 -40979 -10463 20391 21020 15121
5367 15121 3643 -16563 -6605 10645 17561 4542 682 20232 21696 6947 14120 8910 -462
5354 -462 -10539 -13666 -12868 709 -20266 -27474 -11828 3318 -7020 -2971 10508 7783 -12669
5341 -12669 -22518 -24023 -30366 -25088 -136 9262 -3409 -27183 -25604 -32043 -17053 11924 11066 13086
5327 13086 -10261 -1778 6138 18050 -4152 25 20106 31889 32116 40207 25607 22952 21963 14177
5313A4177k0396m278j684J0342j286k58j6082l758J2465Q391K022l225Q821M452
5299I703k6551j6144J2614J5186J4807K661m0965n031J1029J851R382K273j969
5286a1154K785j0954j8849J1754K9823P346k561j4918k277J6740j3318j6192k957
5273b4732O124J1312p590k76J1496r874j0786p189o826M264J2969J8729Q825j1370
5259d924j9620q961p020R018K789M518J0372m231J2145J892l917j0714n491j9806
5245d3950j1929J8890K7304R104j1558j2396Q486j546l956j616K2355o410P899
5232F77j5842j45m575r485L4677Q641k1298O753O39J7811k0458L269L969l792
5218H41J272o966o697K831q377P217j2176R903J8147P416q355j9599n698Q65M040
$$ plain form
5313 14177 -6219 -10497 -12181 -1839 -3125 -3383 -19465 -23223 -10758 -2367 -345 -3570 5251 9703
5299 9703 -16848 -32992 -20378 -5192 9615 12276 -28689 -33720 -22691 -20840 -11458 -9185 -11154
5286 -11154 -8369 -19323 -38172 -26418 3405 10751 8190 -6728 -9005 7735 -5583 -21775 -24732
5273 -24732 -18608 -7296 -14886 -15162 -3666 -13540 -24326 -31515 -38341 -34077 -21108 -2379 6446 -4924
5259 -4924 -24544 -33505 -40525 -31507 -28718 -24200 -13828 -18059 -5914 -4022 -7939 -18653 -24144 -43950
5245 -43950 -55879 -36989 -9685 -581 -12139 -24535 -16049 -17595 -21551 -23167 -812 -7222 677
5232 677 -15165 -15310 -19885 -29370 5307 13948 -7350 -597 42 17853 -2605 664 4633 841
5218 841 2113 -4853 -11550 -8719 -17096 -9879 -22055 -12152 5995 13411 5056 -14543 -20241 -19376 -15336
5203a5336O217P182K371j2836r422J1193R185j2043j3682j7352J1462k229j990
5190c7280j1294J2569m393K2043K7044J287j2183l1927k9090K0355J2598J706
5178b8565N582j1704p30j259j1743Q657J5398K396Q086o876M616J1683R206k340
5164B407k6066J6180j4378q867k023j6094j5845K2755J3109J8875L725O94k4190
5151b9718mK3532J2355j9622q043n293r427n742K0812N486n978n354K1794R950
5137D748j4351l2059k1477o379J0954P047m185L114J5452J4331R227o056j8366
5124c8000j332J3086O208p663k151j1116P699M868L716Q744Q480J4907j1068P716
5110D094J3413O47L690j6162J8232j624j6667j2039P464r503N308M930j915J7516
$$ plain form
5203 -15336 -9119 -1937 434 -12402 -21824 -10631 -1446 -13489 -27171 -44523 -33061 -35290 -37280
5190 -37280 -48574 -36005 -40398 -18355 8689 9976 -2207 -34134 -63224 -42869 -30271 -28565
5178 -28565 -22983 -34687 -35417 -36676 -48419 -39762 -24364 -21968 -13882 -20758 -16142 -4459 4747 2407
5164 2407 -23659 -7479 -21857 -30724 -32747 -48841 -64686 -41931 -28822 -9947 -6222 -5528 -29718
5151 -29718 -29722 -6190 6165 -13457 -21500 -26793 -36220 -41962 -21150 -15664 -21642 -26996 -5202 4748
5137 4748 -9603 -41662 -63139 -69518 -58564 -51517 -55702 -52588 -37136 -22805 -13578 -19634 -38000
5124 -38000 -39332 -26246 -20038 -27701 -29852 -40968 -33269 -28401 -24685 -15941 -7461 7446 -3622 4094
5110 4094 17507 18154 21844 5682 23914 22290 5623 -6416 1048 -8455 -3147 1783 -132 17384
5096A7384n127j4742r219J2628K2866j7608m632j2947k2J7888J7398K8658l635
5083D8890l6129j8833M779J9629q400k2271J5651j1023n02K0023q261n378K7253
5070B5428k847j7058k0499M531j8226O385j2022J816J9711N797P125R151q968
5057C24j696J821l815k2779n519P04j5643j2371K67K6799O487M595J559r53N109
5042a5111r0j1o60P704j1750o639N393l085p620Q92K421j5098l494J4544J6385
5027a6219Q147l059k540N315O32L865J313k1975k4847n669J1816N627J6947l342
5013b3989l426j375o449Q365J3926R963J0347J0475j1395j1627m036j6111j4493
5000c9825l886O976Q428j587J3124N316k734r222q476R324k071j5458J680J1980
$$ plain form
5096 17384 12257 -2485 -11704 924 23790 6182 1550 -11397 -11419 6469 23867 52525 48890
5083 48890 12761 -6072 -1293 18336 9936 -12335 3316 -7707 -8209 11814 3553 -1825 25428
5070 25428 22581 5523 -14976 -10445 -28671 -22286 -34308 -32492 -12781 -6984 141 9292 324
5057 324 -1372 449 -3366 -26145 -31664 -30960 -46603 -58974 -58707 -31908 -25421 -20826 -19267 -20220 -15111
5042 -15111 -15201 -15212 -15872 -8168 -19918 -26557 -21164 -24249 -31869 -30977 -28556 -43654 -47148 -32604 -16219
5027 -16219 -8072 -11131 -13671 -8356 -7724 -3859 -2546 -24521 -49368 -55037 -43221 -37594 -20647 -23989
5013 -23989 -27415 -28790 -35239 -26874 -12948 -2985 7362 17837 6442 -5185 -9221 -25332 -39825
5000 -39825 -43711 -36735 -28307 -29894 -16770 -11454 -14188 -23410 -31886 -22562 -24633 -40091 -38411 -26431
4986b6431K8351R294j0973m408j1488j2514l477j8487R128M311J628J2829J7971
4973d266P734j8718j2730l047o252J3883j1225N308pJ3490P166P896J5655m704
4959A0183j0333K218L491R87R425j2655M788l90m330m485J0509M196L338N437
4945B2379j065K712n232K022J748M036j0765p056m271K315o070j9893J1745J5366
4931G971J2911j4369k736j2165N574j0002J261M917J2718P035R844j3659m83r646
4917h29k5929M214J2588N997r431J5222J4964l600j558J1171j7043m486J6016
4904A7296m633K543j4205k9594r445J4542K8296M465j01K521p469j7482N784p604
4890a5086j3320o047j780O966L961M689l532O729K941J8387l476J607J1925J0998
$$ plain form
4986 -26431 1920 11214 241 -4167 -15655 -28169 -31646 -50133 -41005 -36694 -35066 -22237 -4266
4973 -4266 3468 -15250 -27980 -31027 -37279 -23396 -34621 -29313 -29320 -15830 -8664 -768 14887 10183
4959 10183 -150 2068 5559 6546 15971 3316 8104 7714 3384 -1101 9408 13604 16942 22379
4945 22379 21314 24026 18794 20816 22564 26600 15835 8779 4508 6823 753 -19140 -7395 7971
4931 7971 20882 6513 3777 -8388 -2814 -12816 -11555 -6638 6080 13115 22959 9300 8817 -829
4917 -829 -26758 -22544 -9956 -3959 -13390 1832 16796 13196 11638 22809 5766 1280 17296
4904 17296 12663 15206 1001 -28593 -38038 -23496 4800 9265 9164 11685 4216 -13266 -7482 -15086
4890 -15086 -28406 -34453 -36233 -29267 -25306 -20617 -24149 -17420 -14479 3908 432 2039 13964 24962
4876B4962p489q590Q485p530p072J687J5207j7801M244j604J6646j5765j6884
4863a1504j427q729J2519P193j0426m779Q122R862J9429K2569m154l8565l3250
4850c3140J8161J4020R468J6126j2691q946r039R642j0350k0760K7407j4601k8384
4837d3087M630Q049K644j0331J2362J2992m941k1952N537K5242J016L881P131
4824C173R740j713j6049n325l698J4033J1044j6837n371j9377J8364J4331n220
4811b905j551j0752m266J0663K1486o259j5162p362m72j532j549Q488o567K2346
4797D606M0967k824k3200j1019n748K4860o263j7988j0684O832N242K330q748
4784a637k4587k433j3020m241l43J4226J1440J0120K593J291Q144p40j92n130
$$ plain form
4876 24962 17473 8883 17368 9838 2766 4453 19660 1859 6103 4499 21145 5380 -11504
4863 -11504 -12931 -21660 -9141 -1948 -12374 -17153 -9031 831 20260 42829 38675 110 -33140
4850 -33140 -14979 -959 8509 24635 11944 2998 -6041 3601 -6749 -27509 -102 -14703 -43087
4837 -43087 -38457 -30408 -27764 -38095 -25733 -12741 -17682 -39634 -34097 -8855 -7839 -3958 3173
4824 3173 12913 11200 -4849 -10174 -13872 161 11205 -5632 -11003 -30380 -12016 2315 -2905
4811 -2905 -4456 -15208 -19474 -8811 12675 6416 -8746 -16108 -16580 -18112 -19661 -11173 -17740 4606
4797 4606 45573 42749 19549 8530 2782 27642 21379 3391 -7293 -461 4781 7111 -1637
4784 -1637 -26224 -28657 -41677 -45918 -46261 -32035 -20595 -10475 -7882 -6591 1553 813 621 -4509
4770d509k0297j161R165k014j036R625K8543l888j100j0105J710K707J5662O432
4756B9734O360k0543N667L3744j5739l0741j3506K512J6980R753q61J1664k2490
4743A2534j1060q887o272N970k273j5929L851N476R668p559k1102L704j0204O453
4729c5630K0964N984J4815O485k0610j893J1640j643k057Q932Q6R823j264j351
4715A4281j1342r829R180Q219j1544K1088J5946r836k6175O006J6888K224m094
4702B1012M527r918j6440N748J8126o818N577k456j2863k9181k456q74j3045j0135
4688d9196K9863M8122J002k5006j6771j5358J9604J499j2440O275N809n684j0391
4675b2672K1282o750l3110P189L6722P048P717J4206j351J1643k3829j4142o475
$$ plain form
4770 -4509 -24806 -25967 -16802 -18816 -19852 -10227 18316 14428 13328 3223 4933 7640 23302 29734
4756 29734 36094 15551 21218 54962 39223 8482 -5024 -2512 14468 24221 23360 35024 12534
4743 12534 1474 -7413 -13685 -7715 -9988 -25917 -22066 -16590 -6922 -14481 -35583 -31879 -42083 -35630
4729 -35630 -14666 -8682 6133 12618 -7992 -9885 1755 112 -1945 6987 7073 16896 15632 14281
4715 14281 2939 -6890 2290 10509 -1035 20053 35999 26163 -12 5994 22882 25106 21012
4702 21012 25539 15621 -819 4929 23055 16237 21814 19358 6495 -22686 -25142 -26016 -39061 -49196
4688 -49196 -19333 28789 29791 4785 -11986 -27344 -7740 -6241 -18681 -12406 -6597 -12281 -22672
4675 -22672 -1390 -8140 -41250 -34061 2661 9709 17426 31632 30281 41924 18095 3953 -2522
4662b522k2636k5546L0936K2005P97K6096j3493k7789l608j081j7860m671L0567
4649h805M124p13J3342M333J2284q375n51q691j1939J0384m0114r474M1233N813
4635B851k741o21o928k528n711P502J1975J844j4813K40j0088j0701j5089P357
4621c7451J9591J2623r950R462Q505K0547P085m190p394j4454q939P669J638O729
4607A1471m225j2852r720r736n440J198K5465p345O883O277N627N490K04n737
4593G560o334m608L60j6408J5361J3626L87J303o009j8116j0888l015J1108J085
4579a4588J594J3264J780n12L080o959O903j551j47p653J317J505j589q22q549
4564a2927P069k06j9108o058J9018k216j841k331l825O716J0844o43j033k3686
$$ plain form
4662 -2522 -25158 -50704 -19768 2237 3034 29130 15637 -12152 -15760 -16841 -34701 -39372 -8805
4649 -8805 -4681 -5394 7948 12281 24565 16190 15639 6948 -4991 5393 -34721 -44195 -2962 2851
4635 2851 110 -511 -7439 -9967 -15678 -8176 3799 5643 -9170 -8930 -19018 -29719 -44808 -37451
4621 -37451 -17860 -5237 -15187 -5725 2780 23327 30412 26222 18828 4374 -4565 3104 4742 11471
4607 11471 7246 -5606 -15326 -25062 -30502 -29304 -3839 -11184 -4301 1976 7603 13093 13297 7560
4593 7560 1226 -3382 -3022 -19430 -4069 9557 9944 11247 5238 -12878 -23766 -26781 -15673 -14588
4579 -14588 -12994 270 2050 1538 4618 -2341 4562 3011 2864 -4789 -3472 -1967 -3556 -4378 -12927
4564 -12927 -5858 -6064 -25172 -31230 -12212 -14428 -16269 -18600 -22425 -15709 -4865 -5508 -6541 -30227
4550c0227j303j7246K6385L0950L103q095k0252M58J6957Q825j578l5900k362
4537c0285l029J9630j404k5430k947J5225R582j0823P058Q391K379P483p636N786
4523f020q635j1264m839r671L509J5367N311M197O298Q195j4713q855J4330P333
4509E43n627k4830M225Q159o30j4528q120J9658J519N019L5585k786l0363o675
4495a8851K1964J5556l425m49k817J3752k498J000K785j0575j1418J1282n30n145
4481A0631M103J0716j0010j7955R095L293r692j8283k1307J5561P455J7571j3355
4468a2177k924j218P97J0775j8403o771j9J1218J7191L679j6281n869K6717j554
4454E161q101n327K746J0643j4259M325j620j2655p233J9159J2442J5767K94j4141
$$ plain form
4550 -30227 -31530 -48776 -22391 8559 11662 3567 -16685 -16227 730 9555 7977 -27923 -30285
4537 -30285 -33314 -13684 -15088 -40518 -43465 -28240 -18658 -29481 -22423 -14032 -11653 -4170 -11806 -6020
4523 -6020 -14655 -25919 -30758 -40429 -36920 -21553 -16242 -12045 -5747 2448 -12265 -21120 -6790 543
4509 543 -5084 -29914 -25689 -17530 -18160 -32688 -40808 -21150 -19631 -14612 20973 18187 -12176 -18851
4495 -18851 3113 18669 15244 14795 11978 25730 23232 24232 27017 16442 5024 16306 15776 10631
4481 10631 14734 25450 15440 -2515 6580 9873 181 -18102 -39409 -23848 -16393 1178 -12177
4468 -12177 -15101 -16319 -15522 -4747 -23150 -29921 -29940 -18722 -1531 2148 -14133 -20002 6715 5161
4454 5161 -2940 -8267 -5521 5122 -9137 -4812 -6432 -19087 -26320 -7161 5281 21048 21342 7201
4440G201j5586o953o082q171L850J7544m387j6348K1474j02j3050J990P739l296
4426a4177Q228n397j991n251k8373r256q095J2332J5355J8346n963l926L313K0060
4412d795J6621J6109o51k9437R723J7598k5446k2348j395P084K983M43j2834o428
4398c2773P557Q68K1308l463r322J5349k4554p417J6295K0616Q594q394J0369
4385A5033N027k875n340k1487k4822O558K8636J9738j1228k734j680j7031k9418
4372d1623k1127L538K9194K6529J2364L0355L269o863j3901k751q173j4322j0264
4359a3775J3955k4607L446J3995l949k4r405K410J692R49L559J469p593J1403
4345f475J8655R818K0633J613k0365j1971j2099J6717j4141k0017k1759N646J6402
$$ plain form
4440 7201 -8385 -15338 -21420 -29591 -25741 -8197 -12584 -28932 -7458 -7560 -20610 -18620 -10881 -14177
4426 -14177 -5949 -11346 -13337 -18588 -46961 -56217 -64312 -51980 -36625 -18279 -24242 -28168 -24855 -4795
4412 -4795 11826 27935 27284 -2153 7570 25168 -278 -22626 -24021 -16937 -13954 -13511 -26345 -32773
4398 -32773 -25216 -24348 -3040 -6503 -15825 -476 -25030 -32447 -16152 4464 13058 4664 15033
4385 15033 20060 17185 11845 -9642 -34464 -27906 730 20468 9240 6506 4826 -12205 -41623
4372 -41623 -62750 -59212 -30018 -3489 8875 39230 42499 35636 21735 18984 10811 -3511 -13775
4359 -13775 180 -24427 -20981 -6986 -10935 -10959 -20364 -17954 -16262 -15313 -11754 -10285 -17878 -6475
4345 -6475 12180 21998 42631 44244 23879 11908 -191 16526 2385 -17632 -39391 -33745 -17343
4332a7343R64J6575J6225n518o20l1319o18P249j3653L568j918L5464M638j8466
4318d772J183n324J1245J0232r600j7926J4878N870k53m850J3106K3835j2669
4305B4955l707q02q077J5122M316j4134j4856J5089O955j1485p37P022J810l210
4291A8261J797K262k061j0284j0215k234L429j3599N380j29L788l886R558J9700
4277B1767K0927k1861k7857J709J8949K2273K650j5927j4391M585o539q926p388
4264a0029R822j382l1635j6408R913J5525K5037R61j4479n094J657J5480K0286
4251A9654j0782j1203j5405j249J1346M055l138j0823J1230k554p287K6855R516
4238B0215j5985m120k280N451K358k12J5224r754r352o638p748j0546l165M251
$$ plain form
4332 -17343 -16379 196 16421 10903 10283 -21036 -21654 -14405 -28058 -24490 -26408 9056 13694 -4772
4318 -4772 -3589 -8913 2332 12564 2964 -14962 -84 5786 5533 683 13789 37624 24955
4305 24955 21248 20446 12369 27491 31807 17673 2817 17906 24861 13376 12639 19661 21471 18261
4291 18261 20058 22320 20259 9975 -240 -2474 955 -12644 -7264 -7393 -3605 -7491 2067 21767
4277 21767 42694 20833 -7024 -5315 13634 35907 38557 22630 8239 12824 6285 -2641 -10029
4264 -10029 -207 -1589 -33224 -49632 -39719 -24194 843 1804 -12675 -17769 -16112 -632 19654
4251 19654 8872 -2331 -17736 -18985 -7639 -3584 -6722 -17545 -6315 -8869 -16156 10699 20215
4238 20215 4230 110 -2170 3281 5639 5427 20651 10897 1545 -5093 -12841 -23387 -26552 -22301
4224b2301M781J2163K96L695L612L667j268j2835j6588Q100J6436J4187q14k3481
4210a0350Q488K0742m761K168j9047r285M149m604k0359J1709K2948M09k373L679
4196C513Q379L568j2785l2310m684O563Q467N980k491J365J4983N259K141p450
4182D98n262J2980P635P336p733L000k3069l037P19j25k645l2284k4727K0922
4168d5792K7190K846j2101K948N645Q376j3494k906j701J2163J8094k460l2733
4155c3925P832L7500J6983n547J526j1721p926j515m1987k7431J2930L7167O642
4142i472P698K07m944J909j5017j3754Q155J8758O531K012l6094L984J0614r500
4128b8913J2306j1387j1004K1540K0844O103k2332j8548K5230N849r596J009R197
$$ plain form
4224 -22301 -17520 -5357 -5061 -1366 2246 5913 4645 -8190 -24778 -16678 -242 13945 13131 -10350
4210 -10350 -1862 18880 14119 16287 -2760 -12045 -7896 -12500 -32859 -21150 1798 2207 -166 3513
4196 3513 11892 15460 2675 -29635 -34319 -27756 -19289 -13309 -15800 -14435 548 5807 7948 498
4182 498 -4764 8216 15851 23187 15454 18454 -4615 -7652 -6933 -7058 -9703 -41987 -66714 -45792
4168 -45792 -18602 -15756 -27857 -24909 -19264 -10888 -24382 -27288 -28989 -16826 1268 -1192 -33925
4155 -33925 -26093 11407 28390 22843 24369 12648 4722 3207 -38780 -66211 -53281 -16114 -9472
4142 -9472 -1774 -1567 -6511 -4602 -19619 -33373 -25218 -6460 71 2083 -34011 -30027 -19413 -28913
4128 -28913 -16607 -27994 -38998 -17458 3386 9489 -12843 -31391 -6161 -312 -9908 -8899 298
4115B98j0976L352M510o977N638J9285p809J259k0210j1239K1265k848j641k320
4101h413R60l936j5224o067J9289p556o393N230J8154j1624J4015K604K012J679
4087D730k2133q477M873R282J0355K1429j0076k9597j6298O876J0640R166q438
4074a7668j028q137O755J1376j1175L325J0141o220J5230J0027q710L844j855
4061E905j9031P700K3291K601J2173L285j1602r998J6266J4270j4166j464J5964
4048D5194j5535j5913l6698j9478Q125K813l911O441J6924K138m109M316N634
4035d059l1389k1080P289j132j2730R571j2677N105M202J6505N891M32j0155J4363
4021b9864J8146j5769k702L4439K0909J399j5190j0758K65r593o719J164J0524
$$ plain form
4115 298 -10678 -7326 -2816 -9793 -4155 15130 7321 8580 -11630 -22869 -1604 -4452 -6093 -8413
4101 -8413 -7453 -11389 -26613 -32680 -13391 -20947 -27340 -22110 -3956 -15580 -1565 1039 3051 4730
4087 4730 -17403 -25880 -21007 -11725 -1370 20059 9983 -19614 -35912 -29036 -18396 -9230 -17668
4074 -17668 -18696 -26833 -20078 -8702 -19877 -16552 -6411 -12631 2599 12626 3916 7760 5905
4061 5905 -13126 -5426 17865 20466 32639 35924 24322 14324 30590 44860 30694 29230 45194
4048 45194 29659 13746 -22952 -42430 -34305 -31492 -35403 -28962 -12038 -9900 -14009 -9693 -4059
4035 -4059 -35448 -56528 -49239 -50371 -63101 -53530 -66207 -61102 -56900 -40395 -34504 -34072 -44227 -29864
4021 -29864 -11718 -27487 -30189 4250 25159 26558 11368 610 875 -8718 -15437 -14273 -3749
4008c749J972r884R072r968J376j6p288K0115Q690J412j4860n544J2851K6855
3994C1034L870j2535j9812j9140j3683J5899R825k8296n72J8522k531j5715K310
3981c0824K8654J9828m390l4534j8290l874L1257J6628n109r209r857j6758L3721
3968b757m386l028n9m190O029o82m126J4818K2254R369k0764k3199j2591k440
$$ plain form
4008 -3749 -1777 -11661 -2589 -12557 -11181 -11197 -18485 1630 10320 11732 -3128 -8672 4179 31034
3994 31034 34904 22369 2557 -16583 -30266 -14367 -4542 -32838 -33410 -14888 -17419 -33134 -30824
3981 -30824 -2170 17658 13268 -21266 -39556 -43430 -12173 4455 -654 -9863 -19720 -36478 -2757
3968 -2757 -7143 -10171 -10230 -14420 -8391 -9073 -13199 1619 23873 33242 12478 -10721 -23312 -25752
$$ [...]
##END NTUPLES=NMR SPECTRUM
##END=
