##TITLE=Analysis number 315613
Compound Code cc 01223
Project Code adrs
Chemist Name fudan
##JCAMPDX= 6.0         $$ Bruker NMR JCAMP-DX V2.0
##DATA TYPE= NMR SPECTRUM
##DATA CLASS= NTUPLES
##ORIGIN= Bruker BioSpin GmbH
##OWNER= NMR
$$ XWIN-NMR		Version 3.5
$$ Thu Nov 24 15:15:15 2005 GMT Standard Time (UT+0h)  MAYBRIDGE\NMR@NMR_250MHZ
##.OBSERVE FREQUENCY= 250.131544655141
##.OBSERVE NUCLEUS= ^1H
##.ACQUISITION MODE= SIMULTANEOUS (DQD)
##.ACQUISITION SCHEME= undefined
##.AVERAGES= 16
##.DIGITISER RES= 18
##SPECTROMETER/DATA SYSTEM= dpx250
##.PULSE SEQUENCE= zg30
##.SOLVENT NAME= CDCl3
##.SHIFT REFERENCE= (INTERNAL, CDCl3, 0, 16.522)
##AUDIT TRAIL= $$ (NUMBER, WHEN, WHO, WHERE, WHAT)
$$ ##TITLE= Audit trail, XWIN-NMR		Version 3.5
$$ ##JCAMPDX= 5.01
$$ ##ORIGIN= Bruker BioSpin GmbH
$$ ##OWNER= NMR
$$ C:\u/data/dgb/nmr/ADRS/12950/pdata/1/auditp.txt
$$ ##AUDIT TRAIL=  $$ (NUMBER, WHEN, WHO, WHERE, WHAT)
(   1,<2005-11-24 15:14:56.26 +000>,<MAYBRIDGE\NMR>,<NMR_250MHZ>,
      <created by zg, POWCHK disabled, PULCHK disabled
       configuration hash MD5:
       62 19 C7 07 E1 42 D1 B7 37 6C 3D D0 77 39 F9 E6
       data hash MD5: 64K
       B1 4D 9A C9 C4 8F 45 F6 18 68 1B 0B 89 0F 90 6A>)
(   2,<2005-11-24 15:15:07.20 +000>,<MAYBRIDGE\NMR>,<NMR_250MHZ>,
      <Start of raw data processing
       ef LB = 0.3 FT_mod = 6 PKNL = 1 SI = 32K 
       data hash MD5: 32K
       1C E8 7D 62 E1 C9 D6 DD 81 52 56 38 1A B4 48 88>)
(   3,<2005-11-24 15:15:09.01 +000>,<MAYBRIDGE\NMR>,<NMR_250MHZ>,
      <apk 
       data hash MD5: 32K
       97 C2 22 8B 7E 92 7A EC 1B 14 23 D1 C3 A5 EB 9F>)
(   4,<2005-11-24 15:15:09.79 +000>,<MAYBRIDGE\NMR>,<NMR_250MHZ>,
      <abs ABSG = 5 
       data hash MD5: 32K
       81 A3 4E FB D6 AA 42 CE 6B B5 4D F8 3C 12 72 87>)
$$ ##END=
$$ 
$$ hash MD5
$$ B6 60 B3 E8 B3 B6 37 EA F2 95 0E 2D 07 7A 29 4A
##$RELAX= 
##$RELAX= 
##$RELAX= 
##$RELAX= 
##$RELAX= 
##$RELAX= 
##$RELAX= 
$$ Bruker specific parameters
$$ --------------------------
##$DU= <C:\u>
##$EXPNO= 12950
##$NAME= <ADRS>
##$PROCNO= 1
##$TYPE= <nmr>
##$USER= <dgb>
##$AMP= (0..31)
100 100 100 100 100 100 100 100 100 100 100 100 100 100 100 100 100 100 
100 100 100 100 100 100 100 100 100 100 100 100 100 100 
##$AQSEQ= 0
##$AQ_mod= 3
##$AUNM= <au_zg>
##$AUTOPOS= <41 >
##$BF1= 250.13
##$BF2= 250.13
##$BF3= 250.13
##$BF4= 250.13
##$BF5= 500.13
##$BF6= 500.13
##$BF7= 500.13
##$BF8= 500.13
##$BYTORDA= 1
##$CFDGTYP= 0
##$CFRGTYP= 5
##$CHEMSTR= <none>
##$CNST= (0..31)
1 1 145 1 1 1 1 1 1 1 1 1 1 1 1 1 1 1 1 1 1 1 1 1 1 1 1 1 1 1 1 1 
##$CPDPRG= <>
##$CPDPRG1= <>
##$CPDPRG2= <>
##$CPDPRG3= <>
##$CPDPRG4= <mlev>
##$CPDPRG5= <mlev>
##$CPDPRG6= <mlev>
##$CPDPRG7= <mlev>
##$CPDPRG8= <mlev>
##$CPDPRGB= <>
##$CPDPRGT= <>
##$D= (0..31)
0 1 0 0 0 0 0 0 0 0.06 0 0 0 0 0 0 0.0002 0 0 0 0 0 0 0 0 0 0 0 0 0 0 
0 
##$DATE= 1132845295
##$DBL= (0..7)
120 120 120 120 120 120 120 120 
##$DBP= (0..7)
150 150 150 150 150 150 150 150 
##$DBP07= 0
##$DBPNAM0= <>
##$DBPNAM1= <>
##$DBPNAM2= <>
$$ [...]
##$SUBNAM7= <"">
##$SUBNAM8= <"">
##$SUBNAM9= <"">
##$SW= 20.6930455092707
##$SWIBOX= (0..15)
0 0 3 0 0 0 0 0 0 0 0 0 0 0 0 0 
##$SW_h= 5175.983436853
##$TD= 65536
##$TD0= 1
##$TE= 294.16
##$TE2= 300
##$TE3= 300
##$TEG= 300
##$TL= (0..7)
0 120 120 120 120 120 120 120 
##$TP= (0..7)
150 150 150 150 150 150 150 150 
##$TP07= 0
##$TPNAME0= <>
##$TPNAME1= <>
##$TPNAME2= <>
##$TPNAME3= <>
##$TPNAME4= <>
##$TPNAME5= <>
##$TPNAME6= <>
##$TPNAME7= <>
##$TPOAL= (0..7)
0.5 0.5 0.5 0.5 0.5 0.5 0.5 0.5 
##$TPOFFS= (0..7)
0 0 0 0 0 0 0 0 
##$TUNHIN= 0
##$TUNHOUT= 0
##$TUNXOUT= 0
##$USERA1= <user>
##$USERA2= <user>
##$USERA3= <user>
##$USERA4= <user>
##$USERA5= <user>
##$V9= 5
##$VALIST= <valist>
##$VCLIST= <CCCCCCCCCCCCCCC>
##$VD= 0
##$VDLIST= <DDDDDDDDDDDDDDD>
##$VPLIST= <PPPPPPPPPPPPPPP>
##$VTLIST= <TTTTTTTTTTTTTTT>
##$WBST= 1024
##$WBSW= 4
##$XGAIN= (0..3)
0 0 0 0 
##$XL= 0
##$YL= 0
##$YMAX_a= 575729
##$YMIN_a= -510851
##$ZGOPTNS= <>
##$ZL1= 120
##$ZL2= 120
##$ZL3= 120
##$ZL4= 120
##$ABSF1= 16.522
##$ABSF2= -4.171173
##$ABSG= 5
##$ABSL= 3
##$ALPHA= 0
##$AQORDER= 0
##$ASSFAC= 0
##$ASSFACI= 0
##$ASSFACX= 0
##$ASSWID= 0
##$AUNMP= <proc_1d>
##$AZFE= 0.1
##$AZFW= 0.1
##$BCFW= 0
##$BC_mod= 0
##$BYTORDP= 0
##$COROFFS= 0
##$CY= 12.5
##$DATMOD= 1
##$DC= 0
##$DFILT= <>
##$DTYPP= 0
##$F1P= 14.0000005364418
##$F2P= -0.99999901652339
##$FCOR= 0.5
##$FTSIZE= 32768
##$FT_mod= 6
##$GAMMA= 0
##$GB= 0
##$INTBC= 1
##$INTSCL= 1
##$ISEN= 128
##$LB= 0.3
##$LEV0= 0
##$LPBIN= 0
##$MAXI= 10000
##$MC2= 0
##$MEAN= 0
##$ME_mod= 0
##$MI= 0
##$NCOEF= 0
##$NC_proc= -2
##$NLEV= 6
##$NOISF1= 0
##$NOISF2= 0
##$NSP= 0
##$NTH_PI= 0
##$NZP= 0
##$OFFSET= 16.522
##$PC= 1
##$PHC0= 74.29275
##$PHC1= 15.28866
##$PH_mod= 1
##$PKNL= yes
##$PPARMOD= 0
##$PSCAL= 4
##$PSIGN= 0
##$REVERSE= no
##$SF= 250.13
##$SI= 32768
##$SIGF1= 0
##$SIGF2= 0
##$SINO= 400
##$SIOLD= 32768
##$SREGLST= <1H.CDCl3>
##$SSB= 0
##$STSI= 32768
##$STSR= 0
##$SW_p= 5175.98343685301
##$SYMM= 0
##$S_DEV= 0
##$TDeff= 65536
##$TDoff= 0
##$TI= <Analysis number 999999
Compound Code 99
Book Reference 9
Project Code 9>
##$TILT= no
##$TM1= 0
##$TM2= 0
##$TOPLEV= 0
##$USERP1= <user>
##$USERP2= <user>
##$USERP3= <user>
##$USERP4= <user>
##$USERP5= <user>
##$WDW= 1
##$XDIM= 32768
##$YMAX_p= 534193469
##$YMIN_p= -90555
$$ End of Bruker specific parameters
$$ ---------------------------------
##NTUPLES= NMR SPECTRUM
##VAR_NAME=  FREQUENCY,     SPECTRUM/REAL,   SPECTRUM/IMAG
##SYMBOL=    X,             R,               I
##VAR_TYPE=  INDEPENDENT,   DEPENDENT,       DEPENDENT
##VAR_FORM=  AFFN,          ASDF,            ASDF
##VAR_DIM=   32768,         32768,           32768
##UNITS=     HZ,            ARBITRARY UNITS, ARBITRARY UNITS
##FACTOR=    0.157963299565203, 1,           1
##FIRST=     4132.6476996994, 0,             0
##LAST=      -1043.33573715361, 0,           0
##MIN=       -1043.33573715361, -90555,      0
##MAX=       4132.6476996994, 534193469,     0
$$ Real data points
##PAGE= N=1
##DATA TABLE= (X++(R..R)), XYDATA
$$ [...]
$$ plain form
16872 5087 -2941 -32956 -44022 -44030 -35373 -23813 -14065 -13733 -21770 -22289 -16404 -5480 -12132 -17326 -29518
16857 -29518 -43647 -35103 -20051 -13453 -4971 4319 -3240 -7457 -662 22 -9596 -6063 -9933 -20912
16843 -20912 -16351 -9968 -10671 -6019 -2732 -2836 -11008 -25195 -30703 -20925 -4602 -2433 13162 10631
16829 10631 4426 -16929 -27878 -5432 661 2325 -9836 -21372 -13689 -14093 -7608 -3761 -18121
16816 -18121 -28366 -34313 -21467 -4568 5587 -6538 -19870 -27375 -27168 -19864 -1108 -1277 -20006
16803 -20006 -28782 -32068 -38584 -31612 -19130 -21497 -23425 -14369 -11161 -25883 -26857 -14878 -13565 -13038
16789 -13038 -8428 -4767 6805 402 -2526 5682 6346 -1721 -8868 -15375 -16252 -19753 -19890 -21877 -24607
16774 -24607 -22289 -17695 -16293 -14929 -11185 -9979 -8467 1816 -9366 -4411 -6679 -12821 -12094 -18087
$$ packed form
16872E087q028l0015j1066qQ657J1560R748L32q037n19N885J0924o652n194j2192
16857b9518j4129Q544J5052O598Q482R290p559m217O795O84r618L533l870j0979
16843b0912M561O383p03M652L287j04q172j4187n508R778J6323K169J5595k531
16829A0631o205k1355j0949K2446O093J664j2161j1536P683m04O485L847j4360
16816a8121j0245n947J2846J6899J0155j2125j3332p505K07P304J8756j69j8729
16803b0006q776l286o516O972J2482k367j928R056L208j4722r74J1979J313N27
16789a3038M610L661J1572o403k928Q208O64q067p147o507q77l501j37j987k730
16774b4607K318M594J402J364L744J206J512J0283j1182M955k268o142P27n993
$$ plain form
16760 -18087 -22423 -14929 3920 8887 9672 17509 23601 21247 20063 13756 2923 -12071 -13581 -6064
16746 -6064 -21642 -21632 -9957 -2081 -14637 -20602 -18217 -12263 -10777 -857 8076 8135 1133 -2023 -7042
16731 -7042 -643 -461 -739 -17210 -24459 -22677 -16738 -5600 -5303 -16142 -17885 -17335 -21896 -21647 -14791
16716 -14791 -9669 -13009 -4302 -1173 -9540 -25218 -34815 -34998 -11816 2958 3958 -3499 -5386 -11424
16702 -11424 -12510 -3516 -4234 -10370 -6721 -3306 -318 -12434 -22647 -28790 -15342 -17517 -23625 -28448
16688 -28448 -21905 -10587 -15534 -11108 -15713 -11117 -710 5337 -9312 -24707 -22512 -18100 -11038
16675 -11038 -1959 13642 461 1937 12723 5078 -5869 -19105 -32483 -38335 -39253 -38306 -40959
16662 -40959 -24482 -15294 -14557 -5025 -1305 -5755 -6488 -1592 8171 21228 17914 10101 18518 22918
$$ packed form
16760a8087m336P494J8849M967P85P837O092k354j184o307j0833j4994j510P517
16746f064j5578J0J1675P876j2556n965K385N954J486R920Q933N9p002l156n019
16731g042O399J82k78j6471p249J782N939J1138K97j0839j743N50m561K49O856
16716a4791N122l340Q707L129q367j5678r597j83K3182J4774J000p457j887o038
16702a1424j086Q994p18o136L649L415K988j2116j0213o143J3448k175o108m823
16688b8448O543J1318m947M426m605M596J0407O047j4649j5395K195M412P062
16675a1038R079J5601j3181J476J0786p645j0947j3236j3378n852r18R47k653
16662d0959J6477R188P37R532L720m450p33M896R763J3057l314p813Q417M400
$$ plain form
16648 22918 16296 3421 3336 24287 14943 -5104 -11502 2892 15563 15960 21656 11799 1033 -1250
16634 -1250 -6748 4110 9747 16330 12758 569 -923 16198 1374 -1648 -2875 -1385 -7993 -6532
16620 -6532 -14169 -12306 3437 -1945 4075 10305 4073 -13250 -14969 -13818 -27653 -30207 -28716 -18683
16606 -18683 -5811 -3434 78 3417 -4288 -5883 446 10622 1895 -3059 890 -5204 -2183 6654
16592 6654 -4423 -2380 3186 515 4921 3284 -11638 -8697 -14048 -22734 -20495 -3693 -4420 -8481
16578 -8481 -8237 -6562 -10225 -2444 -4171 -10448 -3181 -17078 -21562 -24808 -27146 -8387 13248 12781
16564 12781 14464 20888 8214 -2643 -10745 -25960 -22777 -22246 -27243 -37833 -30093 -22538 -11126
16551 -11126 -7913 -12969 -18513 -4606 1194 -1333 -1083 -281 -6097 -7306 -14592 -16083 3207 5714
$$ packed form
16648B2918o622j2875q5K0951r344k0047o398J4394J2671L97N696r857j0766k283
16634a250n498J0858N637O583l572j2189j492J7121j4824l022j227J490o608J461
16620f532p637J863J5743n382O020O230o232j7323j719J151j3835k554J491J0033
16606a8683J2872K377L512L339p705j595O329J0176q727m954L949o094L021Q837
16592F654j1077K043N566k671M406j637j4922K941n351q686K239J6802p27m061
16578h481K44J675l663P781j727o277P267j3897m484l246k338J8759K1635m67
16564A2781J683O424j2674j0857q102j5215L183N31m997j0590P740P555J1412
16551a1126L213n056n544J3907N800k527K50Q02n816j209p286j491J9290K507
$$ plain form
16537 5714 8632 12574 16125 14857 16622 8513 -9876 -5921 8759 5283 2007 -2580 -4550 5527
16523 5527 3997 4148 8926 8252 -1037 -6584 -15478 -20394 -3869 949 1725 -8384 -14051 -5930 5933
16508 5933 17581 5589 -19340 -20598 -13142 -7013 -24554 -42228 -27524 -11310 -16282 -25104 -13353
16495 -13353 -2489 6519 7351 2740 -5433 3852 14148 9067 230 -455 9863 7204 -12348 -12000
16481 -12000 -13620 -12219 -10413 -2215 -11821 -7661 -5267 -3303 4734 -10690 -15451 -17050 -8455 -4192
16467 -4192 -8294 -10535 -21354 -10872 -10433 -20045 -3000 9603 10638 4652 5842 -1255 -3123 -11772
16453 -11772 -23234 -19928 -4932 9937 5054 3978 -1407 -14531 -23087 -38530 -25346 -14195 -12388
16440 -12388 -12288 -3709 2056 -7329 -18131 -4742 10960 18671 15126 2007 -11119 -15600 -15933 -7828
$$ packed form
16537E714K918L942L551j268J765q109j8389L955J4680l476l276m587j970J0077
16523E527j530J51M778o74r289n547q894m916J6525M818P76j0109n667Q121J1863
16508E933J1648j1992k4929j258P456O129j7541j7674J4704J6214m972q822J1751
16495a3353J0864R008Q32m611q173R285J0296n081q837o85J0318k659j9552L48
16481a2000j620J401J806Q198r606M160K394J964Q037j5424m761j599Q595M263
16467d192m102k241j0819J0482M39r612J7045J2603J035n986J190p097j868q649
16453a1772j1462L306J4996J4869m883j076n385j3124q556j5443J3184J1151J807
16440a2388J00Q579N765r385j0802J3389J5702P711l545j3119j3126m481l33Q105
$$ plain form
16426 -7828 -23801 -24199 -15421 -18160 -5835 6958 12650 10274 11815 19777 21335 8964 18889 10846
16412 10846 7220 400 -9367 -22075 -32163 -18030 -6547 -16209 -18311 -9727 4265 8492 7347
16399 7347 1128 -18120 -10262 -8461 1084 -1951 -1429 -6078 -17154 -16234 -23067 -36168 -33692 -25975
16385 -25975 -13122 -6507 -19542 -25805 -9939 4919 12985 14348 6730 6729 15938 22422 15654 5025
16371 5025 3883 -5921 -19347 -18547 -12429 -7291 134 -1918 6667 10946 13155 12516 5231 -6931 -12576
16356 -12576 -5568 -1661 10202 793 -11217 -5797 -4193 -10776 -12648 4085 5996 -2902 -9279 -9492
16342 -9492 531 -1361 -16014 -15479 -4581 13578 20891 15379 2101 -14144 -21208 -25782 -14372
16329 -14372 -1131 9649 15027 3644 -4532 11867 -604 -17397 -24302 -30556 -38889 -33535 -32202
$$ packed form
16426g828j5973l98Q778k739J2325J2793N692k376J541P962J558j2371R925q043
16412A0846l626o820r767j2708j0088J4133J1483r662k102Q584J3992M227j145
16399G347o219j9248P858J801R545l035N22m649j1076R20o833j3101K476P717
16385b5975J2853O615j3035o263J5866J4858Q066J363p618jR209O484o768j0629
16371E025j142r804j3426Q00O118N138P425k052Q585M279K209o39p285j2162n645
16356a2576P008L907J1863r409j2010N420J604o583j872J6733J911q898o377k13
16342i492J0023j892j4653N35J0898J8159P313n512j3278j6245p064m574J1410
16329a4372J3241J0780N378j1383q176J6399j2471j6793o905o254q333N354J333
$$ plain form
16316 -32202 -22920 -24774 -32023 -19891 -24975 -23392 -13782 -2962 15499 19644 9168 5324 5291 6909
16302 6909 -431 -1452 -160 -9863 -20596 -19998 -22147 -24694 -16801 -8389 -5205 -6327 -4314 -20290
16288 -20290 -26628 -18192 -21369 -23184 -23896 -14903 -14086 -8069 -11139 -12605 -18024 -23092 -10956 -15672 -17423
16273 -17423 -3147 -348 -6941 -16386 -16550 -15066 -12870 -2161 257 5273 -8497 -22730 -33168
16260 -33168 -18510 2278 5277 8294 16747 14767 5340 421 6508 10369 5281 14442 15062 14248
16246 14248 15347 5288 -8509 -7030 -13507 -14571 -10866 -8289 -9161 2553 13968 13271 7444 4318
16232 4318 -4294 -3174 -2465 6913 9643 11094 3218 -8599 -16942 -12415 -6642 -5260 -8652 -17483 -6868
16217 -6868 -4308 -5009 -3009 -5532 -8938 -10356 -3740 5313 11580 3307 2350 17694 17552 1885 -2915
$$ packed form
16316c2202R282j854p249J2132n084J583R610J0820J8461M145j0476l844l3J618
16302F909p340j021J292r703j0733N98k149k547P893Q412L184j122K013j5976
16288b0290o338Q436l177j815p12Q993Q17O017l070j466n419n068J2136m716j751
16273a7423J4276K799o593r445j64J484K196J0709K418N016j3770j4233j0438
16260c3168J4658K0788K999L017Q453j980r427m919O087L861n088R161O20q14
16246A4248J099j0059j3797J479o477j064L705K577q72J1714J1415o97n827l126
16232D318q612J120P09R378K730J451p876j1817q343M527N773J382l392q831J0615
16217f868K560p01K000k523l406j418O616R053O267q273r57J5344j42j5667m800
$$ plain form
16202 -2915 5079 10591 10103 -1187 993 -8890 -7280 -5753 -24719 -20899 -14524 -5021 13548 11284
16188 11284 5018 13910 13385 21367 12357 -3531 -3828 8138 14864 25679 21996 7544 -4064 -12572
16174 -12572 -13797 -9878 -707 2343 6121 -11716 -27643 -21417 -30244 -22568 -8899 4189 10493
16161 10493 5857 -3542 4035 4213 13715 15733 -3182 -4060 -7737 -7712 -13391 -6028 -10948 -3548 4863
16146 4863 6404 3866 1332 -8575 -23188 -21158 -13369 -5090 -3797 -7032 -21157 -25998 -28287 -18770
16132 -18770 -1284 8857 6156 6240 5669 712 8485 11135 12822 13508 6947 1809 9070 18024 11757
16117 11757 -1304 5610 6585 -8050 -7788 4699 -1185 -1314 -8344 -6132 -1654 13376 21223 20158
16103 20158 19936 16754 9426 -1143 129 -12840 -6051 -2946 -8660 -14505 -22676 -24334 -15968 -13980
$$ packed form
16202b915P994N512m88j1290K180r883J610J527j8966L820O375R503J8569k264
16188A1284o266Q892n25P982r010j5888k97J1966O726J0815l683j4452j1608q508
16174a2572j225L919R171L050L778j7837j5927O226q827P676J3669J3088O304
16161A0493m636r399P577J78R502K018j8915q78l677K5n679P363m920P400Q411
16146D863J541k538k534r907j4613K030P789Q279J293l235j4125m841k289R517
16132a8770J7486J0141k701Q4n71m957P773K650J687O86o561n138P261Q954o267
16117A1757j3061O914R75j4635K62J2487n884j29p030K212M478J5030P847j065
16103B0158k22l182p328j0569J272j2969O789L105n714n845q171j658Q366J988
$$ plain form
16089 -13980 -5315 1148 435 -224 -8038 -9005 -4538 -2722 3783 -3942 -11152 -5451 1414 9313 11868
16074 11868 10427 4347 855 14858 27612 31303 25906 63 -8383 -6232 -5471 -9220 -12044 -7516
16060 -7516 -16714 -14802 -33691 -40946 -43277 -35639 -21476 -3096 3022 -4202 3808 -3322 -7979 -4675
16046 -4675 -10614 -25256 -12688 -11614 -5892 692 3774 8660 20447 16876 19876 11348 7780 -531
16032 -531 -1223 -4061 10295 11063 -4692 2215 12093 11533 2019 -3984 -4397 -5671 -1911 4311 1555
16017 1555 21225 27489 18632 115 -2089 6095 16235 24822 18137 4372 5248 -6383 -8504 12737
16003 12737 20080 10849 -1784 -7402 190 -3814 1257 14910 13307 11235 4506 -6153 -7931 -7803
15989 -7803 -15246 -8768 -2176 -1359 -7143 -18847 -27089 -8774 3189 8656 7514 4230 -7860 -13682
$$ packed form
16089a3980Q665O463p13o59p814r67M467J816O505p725p210N701O865P899K555
16074A1868j441o080l492J4003J2754L691n397k5843q446K151P61l749k824M528
16060g516r198J912j8889p255k331P638J4163J8380O118p224Q010p130m657L304
16046d675n939j4642J2568J074N722O584L082M886J1787l571L000q528l568q311
16032e31o92k838J4356P68j5755O907R878n60r514o003m13j274L760O222k756
16017A555J9670O264q857j8517k204Q184J0140Q587o685j3765Q76j1631k121K1241
16003A2737P343r231j2633n618P592m004N071J3653j603k072o729j0659j778J28
15989g803p443O478O592Q17n784j1704q242J8315J1963N467j142l284j2090n822
$$ plain form
15975 -13682 -14144 -15480 -794 -1716 1186 11768 -5545 -14184 -5803 879 -5303 -10578 -4481 -2765
15961 -2765 -1232 -5988 -270 13807 29087 15196 10625 10664 7729 18403 25578 15526 12527 11502
15947 11502 13353 10855 14152 30863 24391 16814 9691 11459 17017 9733 5508 7788 3433 8453
15933 8453 18793 26547 23725 20583 1696 2589 8743 10751 10540 7534 14432 17924 16444 13705 12097
15918 12097 11041 13270 3449 1865 -5873 -8595 -2474 9801 3656 8004 2992 1340 -1203 -17367
15904 -17367 -7868 10959 18336 10475 -14082 -20674 -10202 -12643 -9908 -3240 8163 14362 13682 14422
15890 14422 5377 -2974 -7905 -6156 8677 23932 12590 8485 5844 16105 24435 30393 26579
15877 26579 6744 -4807 -1134 7837 8257 7032 -1876 1149 2007 -659 -241 -953 -9799 -7175 -6302
$$ packed form
15975a3682m62j336J4686r22K902J0582j7313q639Q381O682o182n275O097J716
15961b765J533m756N718J4077J5280j3891m571L9k935J0674P175j0052k999j025
15947A1502J851k498L297J6711o472p577p123J768N558p284m225K280m355N020
15933H453J0340P754k822l142j8887Q93O154K008k11l006O898L492j480k739j608
15918A2097j056K229r821j584p738k722O121J2275o145M348n012j652k543j6164
15904a7367R499J8827P377p861k4557o592J0472k441K735O668J1403O199o80P40
15890A4422r045q351m931J749J4833J5255j1342m105k641J0261Q330N958l814
15877B6579j9835j1551L673Q971M20j225q908L025Q58k666M18p12q846K624Q73
$$ plain form
15862 -6302 -10062 -13653 -5040 -14309 -14903 -14390 -17828 -7537 5 -695 6832 13487 1853 -2419 3290
15847 3290 10259 7726 5744 -3504 -3214 5422 5987 -8933 -21093 -25748 -20529 -20240 -23511 -32108 -36624
15832 -36624 -24929 -12976 -19810 -21727 -10995 -8255 -9925 -6046 -7693 -1938 -11697 -11816 -563 18448
15818 18448 18507 12805 15350 11498 23539 24814 28340 26366 20847 19139 21847 11341 5808 12118
15804 12118 10422 -1674 -1064 -3863 33 4230 2478 4189 4756 10402 13636 6623 4796 -2774 -12982
15789 -12982 -9143 -1736 -213 10775 9509 7122 -8416 -9701 2571 1111 -11251 -8224 -8890 2689
15775 2689 6490 7329 16074 30700 19904 8214 1926 -6516 4872 25765 17827 10240 216
15762 216 -6768 -9090 -12146 -10105 -9512 -1008 1236 3473 -9527 -22177 -21791 -31788 -24651 -7489 1932
$$ packed form
15862f302l760l591Q613r269n94N13l438J0291P542p00P527O655j1634m272N709
15847C290O969k533j982r248K90Q636N65j4920j2160m655N219K89l271q597m516
15832c6624J1695J1953o834j917J0732K740j670L879j647N755r759j19J1253J9011
15818A8448N9n702K545l852J2041J275L526j974n519j708K708j0506n533O310
15804A2118j696j2096O10k799L896M197j752J711N67N646L234p013j827p570j0208
15789a2982L839P407J523J0988j266k387j5538j285J2272j460j2362L027o66J1579
15775B689L801Q39Q745J4626j0796j1690o288q442J1388K0893p938p587j0024
15762B16o984k322l056K041N93Q504K244K237j3000j2650L86r997P137J7162R421
$$ plain form
15747 1932 -17888 -12300 -759 -10340 -17124 -11253 -11282 -12808 3287 15269 25721 36456 32126 37669
15733 37669 40468 19506 1760 -7402 -26709 -17515 -18415 -33293 -24837 -16885 -14330 -8674 2099
15720 2099 -4986 -7366 10919 13413 -4035 -14526 -531 10853 5128 -5395 -4746 -5495 -7937 1218
15706 1218 12500 8726 -46 -6496 -12716 -5768 -2521 5448 12017 14555 4811 3031 4307 8144
15692 8144 14583 11522 -4014 -12584 -2313 11987 4087 -5213 1363 9750 1999 -692 1617 5547
15678 5547 19477 22540 22388 9941 -439 -6004 1339 5988 3156 3318 -4602 -11592 1354 -2699
15664 -2699 -2829 12987 10578 11540 9476 -8805 -4220 15748 25543 25841 14634 -2268 -4211 -13223
15650 -13223 -7222 -1640 5161 2293 6303 18201 19294 19550 21873 20636 9967 2068 -3118 10096
$$ packed form
15747A932j9820N588J1541r581o784N871k9j526J6095J1982J0452J0735m330N543
15733C7669K799k0962j7746r162j9307R194r00j4878Q456P952K555N656J0773
15720B099p085k380J8285K494j7448j0491J3995J1384n725j0523O49p49k442R155
15706A218J1282l774q772o450o220O948L247P969O569K538r744j780J276L837
15692H144O439l061j5536q570J0271J4300p900r300O576Q387p751k691K309L930
15678E547J3930L063j52j2447j0380n565P343M649k832J62p920o990J2946m053
15664b699j30J5816k409R62k064j8281M585J9968R795K98j1207j6902j943r012
15650a3223O001N582O801k868M010J1898J093K56K323j237j0669p899n186J3214
$$ plain form
15636 10096 14364 4384 222 2947 3783 -8558 -11920 -7335 -3217 -8015 -11713 -13540 -17004 -19179
15622 -19179 -9059 -4814 -2785 7370 13044 17629 7275 17407 30532 18345 8204 13821 25875
15609 25875 34040 28640 26413 26611 18637 6414 9168 6792 -1880 -8405 11198 16086 15346 2748
15595 2748 1452 13508 14807 7187 4155 -5505 -12426 -14468 -9624 -2745 -23270 -24684 -23852 -28538
15581 -28538 -30722 -14824 -5729 -3222 308 -553 3129 12168 17004 17876 9990 -6635 -536 6952
15567 6952 7624 5543 9452 7715 620 -7541 1125 2827 144 -7512 -13050 -8954 1858 4849 -525
15552 -525 4811 1314 -12448 -5940 2345 -5632 -13830 -8819 -7738 -14535 -27189 -16679 9668 22689
15538 22689 23728 15194 5742 9500 12023 3073 -15871 -11841 5650 9913 8202 6091 3095 -6655
$$ packed form
15636A0096M268r980m162K725Q36j2341l362M585M118m798l698j827l464k175
15622a9179J0120M245K029J0155N674M585j0354J0132J3125j2187j0141N617J2054
15609B5875Q165n400k227J98p974j2223K754k376q672o525J9603M888p40j2598
15595B748j296J2056J299p620l032r660o921k042M844O879k0525j414Q32m686
15581b8538k184J5898R095K507L530q61L682R039M836Q72p886j6625O099P488
15567F952O72k081L909j737p095q161Q666J702k683p656n538M096J0812K991n374
15552e25N336l497j3762O508Q285p977q198N011J081o797j2654J0510K6347J3021
15538B2689J039q534r452L758K523q950j8944M030J7491M263j711k111k996r750
$$ plain form
15524 -6655 -3674 3558 1251 -2017 -10853 -18056 -18369 -20195 -10594 13523 27422 21624 17850 15116
15510 15116 6212 9773 4496 -4036 546 5412 -5404 1073 4098 96 -2729 67 5095 18223
15496 18223 20306 9965 17903 31690 27000 16520 9241 8218 572 -7236 -11743 -11193 -12914 -19507
15482 -19507 -22672 -23190 -17978 -4876 -2528 -16759 -5981 8747 7560 -5831 -16280 -1848 19331
15469 19331 15645 12812 6600 2962 10534 764 3326 7819 2409 -1964 3383 12341 12249 1330 -4058
15454 -4058 -5364 -2669 2196 3185 -20385 -23555 -12917 -16460 -21776 -9055 7489 20208 16043 4276
15440 4276 1567 -4914 -6659 -7402 -1944 -10658 -3038 -2624 -7945 7885 13512 877 2934 -6241 -4788
15425 -4788 -11952 -3865 20898 26621 14909 14875 12930 23412 12957 3944 -5236 1116 3199 -1387
$$ packed form
15524f655K981P232k307l268q836p203l13j826R601K4117J3899n798l774k734
15510A5116q904L561n277q532M582M866j0816O477L025m002k825K796N028J3128
15496A8223K083j0341P938J3787m690j0480p279j023p646p808m507N50j721o593
15482a9507l165n18N212J3102K348j4231J0778J4728j187j3391j0449J4432K1179
15469A9331l686k833o212l638P572r770K562M493n410m373N347Q958r2j0919n388
15454d058j306K695M865R89k3570l170J0638l543n316J2721J6544J2719m165j1767
15440D276k709o481j745p43N458q714P620M14n321J5830N627j2635K057r175J453
15425d788p164Q087K4763N723j1712l4j945J0482j0455r013r180O352K083m586
$$ plain form
15411 -1387 -679 176 -5995 -10929 5599 18197 17821 21339 14958 6917 1135 -14 -4796 -949 2153
15396 2153 -1924 8219 10386 18268 17301 11536 2540 2608 8975 4446 7925 14496 15789 10978 -854
15381 -854 -4397 -2876 -2564 -2499 8707 15049 9252 -2772 5031 13705 14013 6639 13000 9149 2716
15366 2716 -4047 -8260 3527 8622 4724 14793 1670 -8390 -2308 16373 14302 2240 12086
15353 12086 11686 -3212 -9225 -2138 6483 -3058 -10620 5904 22830 23108 16717 9278 2469 1689
15339 1689 11666 9967 2150 -3957 357 4637 13796 10589 -6078 -2018 11782 13200 13831 11217
15325 11217 9582 13780 12831 14064 10962 15102 6250 579 -6111 8967 27070 20132 -15057 -23933
15311 -23933 -12614 -592 -149 1402 17257 -793 -437 8443 9291 15640 22694 14570 14247 22675
$$ packed form
15411a387P08Q55o171m934J6528J2598l76L518o381q041n782j149m782L847L102
15396B153m077J0143K167P882r67n765q996O8O367m529L479O571J293m811j1832
15381h54l543J521L12O5J1206O342n797j2024P803Q674L08p374O361l851o433
15366B716o763m213J1787N095l898J0069j3123j0060O082J8681k071j2062R846
15353A2086m00j4898o013P087Q621r541p562J6524J6926K78o391p439o809p80
15339A689R977j699p817o107M314M280R159l207j6667M060J3800J418O31k614
15325A1217j635M198r49J233l102M140q852n671o690J5078J8103o938l5189q876
15311b3933J1319J2022M43J551J5855j8050L56Q880Q48O349P054q124l23Q428
$$ plain form
15297 22675 23591 22434 21080 14370 13984 5729 12544 -1098 -8047 4726 10507 6601 10505 10282 12342
15282 12342 15285 15338 18046 28926 41625 36045 29943 21471 13441 26436 32288 39321 40733 33837
15268 33837 29239 7976 36 -2578 -13210 -19442 -4672 -1104 4940 3386 5401 20448 12679
15255 12679 -3403 -6178 -5838 73 -2432 -429 18448 26180 19043 2468 -11857 -15443 -22071 -14080
15241 -14080 -3465 -3082 223 -4238 -402 8248 12308 3959 3681 3235 5989 7045 -11465 -1593 14985
15226 14985 18577 17135 10710 -1484 -4749 -6478 2557 10212 19380 19370 15292 1354 -3860 3581
15212 3581 -7033 -8929 -14736 -14247 -8178 -3637 -18704 -17100 -7966 2324 18374 26887 21342 8302
15198 8302 8655 16259 2922 465 4268 -2331 3842 13135 7090 -12337 -17362 -11082 -13889 -15403
$$ packed form
15297B2675R16j157j354o710l86q255O815j3642o949J2773N781l906L904k23K060
15282A2342K943N3K708J0880J2699n580o102q472q030J2995N852P033J412o896
15268C3837m598k1263p940k614j0632o232J4770L568O044j554K015J5047p769
15255A2679j6082k775L40N911k505K003J8877P732p137j6575j4325l586o628P991
15241a4080J0615L83L305m461L836Q650M060q349k78m46K754J056j8510R872J6578
15226A4985L592j442o425j2194l265j729R035P655R168j0m078j3938n214P441
15212C581j0614j896n807M89O069M541j5067J604R134J0290J6050Q513n545j3040
15198H302L53P604j3337k457L803o599O173R293o045j9427n025O280k807j514
$$ plain form
15184 -15403 -4642 413 2666 14742 19448 7113 -1278 -2285 8580 1622 2277 11605 15952 4802
15170 4802 10528 21868 22733 20586 27690 42119 40969 18428 36 4140 3466 -4431 1212 25504
15156 25504 22066 6275 6128 8437 10119 16111 11386 8658 10910 9444 13838 8331 10056 5654
15142 5654 5598 -1274 -13822 -14109 2107 9203 12956 14753 6977 10062 17985 31480 31965 14735 -6976
15127 -6976 -11766 -4255 16827 22857 24805 16952 9867 2436 4584 9529 4396 10917 30887 24117
15113 24117 4560 -1700 2504 15315 9045 6129 9978 10678 18197 27076 21475 7819 3762 7934
15099 7934 348 210 3990 2154 -10582 -13084 -11834 -10113 3374 6639 14854 14058 8766 22298
15085 22298 27496 26922 28532 16246 1674 516 -4625 9228 23424 29599 25215 16078 8990 14088
$$ packed form
15184a5403J0761N055K253J2076M706j2335q391j007J0865o958O55R328M347j1150
15170D802N726J1340Q65k147P104J4429j150k2541j8392M104o74p897N643K4292
15156B5504l438j5791j47K309J682N992m725k728K252j466M394n507J725m402
15142E654n6o872j2548k87J6216P096L753J797p776L085P923J3495M85j7230k1711
15127f976m790P511K1082O030J948p853p085p431K148M945n133O521J9970o770
15113B4117j9557o260M204J2811o270k916L849P00P519Q879n601j3656m057M172
15099G934p586j38L780j836j2736k502J250J721J3487L265Q215p96n292J3532
15085B2298N198n74J610j2286j4572j158n141J3853J4196O175m384r137p088N098
$$ plain form
15071 14088 25295 25123 25468 21308 19807 14809 12573 8419 -1235 -3864 -1972 -10813 -3423 15489
15057 15489 23915 22809 10488 8595 12980 5664 -6006 -7167 -222 3787 409 23158 30554 11001
15043 11001 1041 -1323 -11965 -26191 -21045 -8447 4415 8383 12102 2755 555 9662 16751
15030 16751 2620 -4528 -1346 3128 -7882 -11447 -5210 -3379 -665 5480 8284 4240 7232 -590
15016 -590 2161 5467 608 9851 18904 16509 8115 18178 14729 12991 3822 5605 21422 17735
15002 17735 8998 236 11872 29113 32245 25039 29250 26263 22179 26813 33877 36235 26638 13573
14988 13573 18725 11740 13491 29309 39512 31113 20733 18776 30033 16512 6517 6503 12584 8318
14974 8318 13645 10874 7364 5028 9140 15008 11405 9539 -805 -11906 -22147 -2022 7106 5958
$$ packed form
15071A4088J1207j72L45m160j501m998k236m154r654k629J892q841P390J8912
15057A5489Q426j106j2321j893M385p316j1670j161O945M009l378K2749P396j9553
15043A1001r960k364j0642j4226N146J2598J2862L968L719r347k200R107P089
15030A6751j4131p148L182M474j1010l565O237J831K714O145K804m044K992p822
15016e90K751L306m859R243R053k395q394J0063l449j738r169J783J5817l687
15002A7735q737q762J1636J7241L132p206M211k987m084M634P064K358r597j3065
14988A3573N152o985J751J5818J0203q399j0380j957J1257j3521r995j4O081m266
14974H318N327k771l510k336M112N868l603j866j0344j1101j0241K0125R128j148
$$ plain form
14960 5958 3301 -1216 -8254 -7439 63 2790 27001 35332 16186 6377 6891 7728 22475 12038
14946 12038 5129 21410 25101 21665 18503 6098 13027 10753 4632 5632 20624 16484 11728 2823
14932 2823 12075 11620 2329 7483 17781 10278 4629 3687 13640 13938 7576 12747 7631 9110 14440
14917 14440 13037 13200 11734 13995 20990 15513 19150 16633 6339 -2495 6094 4485 852 4234
14903 4234 -11478 -18064 -6603 -2600 2658 6411 5318 6894 3822 -7449 -11246 -918 19015
14890 19015 38921 37856 36400 22963 22543 20409 16627 16081 11767 23931 31365 28923 13827 9916
14876 9916 14808 19030 29724 31813 33306 37646 46370 43869 38591 30388 30298 16975 12537 14451 16784
14861 16784 12474 9576 9286 14674 13718 13001 21688 21976 17044 10946 9744 19360 13376 8034 14493
$$ packed form
14960E958k657m517p038Q15P502K727K4211Q331j9146r809N14Q37J4747j0437
14946A2038o909J6281L691l436l162j2405O929k274o121J000J4992m140m756q905
14932B823R252m55r291N154J0298p503n649r42R953K98o362N171n116J479N330
14917A4440j403J63j466K261O995n477L637k517j0294q834Q589j609l633L382
14903D234j5712o586J1461M003N258L753j093J576l072j1271l797J0328J9933
14890A9015J9906j065j456j3437m20k134l782n46m314J2164P434k442j5096l911
14876I916M892M222J0694K089J493M340Q724k501n278q203r0j3323m438J914K333
14861A6784m310k898k90N388r56p17Q687K88m932o098j202R616n984n342O459
$$ plain form
14846 14493 15366 19546 28530 16783 -367 8945 14250 10927 27041 30333 15719 20705 29534 27308
14832 27308 27387 9013 771 2894 7187 17364 19181 17139 8259 14392 19146 17246 12046 3350
14818 3350 9578 16890 10708 5726 -2310 -7132 5180 10325 21366 32194 28627 21479 16518 14172
14804 14172 22075 31868 30288 13678 2598 15056 19063 17850 6018 2616 1107 1122 5110 13379
14790 13379 18460 14529 13098 17350 23228 22691 20806 10435 4462 16257 15881 5885 10963 19542
14776 19542 32409 32128 30124 19285 10654 18712 18164 12923 12344 16526 25130 39503 39662 41448 29904
14761 29904 22717 14189 16206 18029 16209 13070 9312 13783 15123 16049 2881 162 3226 11711
14747 11711 7085 7189 7564 11088 19935 11813 2163 -549 2349 5758 18640 16503 13595 15139 16711
$$ packed form
14846A4493Q73M180Q984j1747j7150R312N305l323J6114L292j4614M986Q829k226
14832B7308P9j8374q242K123M293J0177J817k042q880O133M754j900n200q696
14818C350O228P312o182m982q036m822J2312N145J1041J0828l567p148m961k346
14804A4172P903R793j580j6610j1080J2458M007j213j1832l402j509J5L988Q269
14790A3379N081l931j431M252N878n37j885j0371n973J1795l76r996N078Q579
14776A9542J2867k81k004j0839q631Q058n48n241n79M182Q604J4373J59J786j1544
14761B9904p187q528K017J823j820l139l758M471J340R26j3168k719L064Q485
14747A1711m626J04L75L524Q847q122r650k712K898L409J2882k137k908J544J572
$$ plain form
14732 16711 13762 10778 21510 26081 32828 38043 24852 13976 14579 18563 16959 7872 5427 14740
14718 14740 17545 13091 12310 26198 37801 20673 6135 -6993 -8169 -11340 -6090 -6447 -28783
14705 -28783 -28992 -23335 -15358 -8255 -1495 5595 1360 140 4185 172 5240 8614 4945 10257 15960
14690 15960 1244 9099 13471 12143 11633 7053 11289 21459 16480 25244 36873 37960 33060 36549
14676 36549 36228 27931 16165 7513 2599 -828 -3445 -10668 -16033 -2582 -10351 -6173 12823 24864
14662 24864 21819 12624 18172 27107 23865 18521 13575 4042 7949 19073 12209 1041 15161 23716
14648 23716 17190 12384 21681 15038 3244 3144 8166 31595 23183 2351 5374 23573 40991
14635 40991 46030 29616 11513 12332 31187 44052 38701 27143 21815 11575 -8391 1753 26769
$$ packed form
14732A6711k949k984J0732M571O747N215j3191j0876O03L984j604r087k445R313
14718A4740K805m454p81J3888J1603j7128j4538j3128j176l171N250l57k2336
14705b8783k09N657P977P103O760P090m235j220M045m013N068L374l669N312N703
14690A5960j4716P855M372j328n10m580M236J0170m979Q764J1629J087m900L489
14676C6549l21q297j1766q652m914l427k617p223n365J3451p769M178J8996J2041
14662B4864l045r195N548Q935l242n344m946r533L907J1124o864j1168J4120Q555
14648B3716o526m806R297o643j1794j00N022K3429q412k0832L023J8199J7418
14635D0991N039j6414j8103Q19J8855J2865n351j1558n328j0240j9966J0144K5016
$$ plain form
14622 26769 29526 41603 39999 39913 32834 29675 21657 16775 12868 15158 10628 13033 24819 29712
14608 29712 34962 50759 44535 24384 9568 11821 9966 9945 13524 28301 27640 21675 24716 17805
14594 17805 5337 -5758 -12231 -3583 -2959 10522 22961 16980 9833 9425 8132 13076 8559 53
14580 53 8283 14794 19103 20001 29466 17758 -3808 -4451 9697 11783 20581 37079 27583 13105
14566 13105 13960 19450 25660 16472 13401 7982 4562 3140 22005 30807 29241 33389 25848 14016
14552 14016 14126 8347 14198 14157 5149 -4213 -5513 -3428 14415 17789 4964 16606 36208 26552
14538 26552 19294 30649 43809 14694 -8423 1510 7409 28882 42809 38630 42169 34964 15570
14525 15570 18244 22729 28801 25509 12792 25592 26266 26371 26202 27380 20444 18417 26640 26773 17617
$$ packed form
14622B6769K757J2077j604q6p079l159q018m882l907K290m530K405J1786M893
14608B9712N250J5797o224k0151j4816K253j855k1L579J4777o61n965L041o911
14594A7805j2468j1095o473Q648O24J3481J2439n981p147m08j293M944m517q506
14580E3Q230O511M309Q98R465j1708k1566o43J4148K086Q798J6498r496j4478
14566A3105Q55N490O210r188l071n419l420j422J8865Q802j566M148p541j1832
14552A4016J10n779N851m1r008r362j300K085J7843L374j2825J1642J9602r656
14538B6552p258J1355J3160k9115k3117R933N899K1473J3927m179L539p205j9394
14525A5570K674M485O072l292j2717J2800O74J05j69J178o936k027Q223J33r156
$$ plain form
14510 17617 740 -1291 -6661 -4759 6433 16204 19588 23836 24290 17948 31187 47447 47832 37969
14496 37969 23063 41232 51569 47195 37597 26878 14804 12155 19903 19654 17354 15805 5397
14483 5397 -3578 10928 28703 31619 32279 13439 7236 6896 2065 10224 19180 20985 29375 32749
14469 32749 33720 26962 25227 33829 26104 17874 20291 17370 16697 36760 31910 21672 21290 32376
14455 32376 8791 10163 18667 30456 32491 41477 57930 51766 28079 7897 7189 17276 21912
14442 21912 25097 16362 3436 -1254 -1204 -5209 12495 23440 21750 14809 12587 19900 31763 17566
14428 17566 8372 18674 24137 12893 3265 6817 12105 1789 4693 4448 5128 11433 4777 7980
14414 7980 4987 13643 14243 4358 -3518 -5289 398 6622 1155 -668 9921 9816 6640 25510 31228
$$ packed form
14510A7617j6877k031n370J902J1192R771L384M248M54o342J3239J6260L85r863
14496C7969j4906J8169J0337m374r598j0719j2074k649P748k49k300j549j0408
14483E397q975J4506J7775K916O60j8840o203l40m831Q159Q956J805Q390L374
14469C2749R71o758j735Q602p725q230K417k921o73K0063m850j0238l82J1086
14455C2376k3585J372Q504J1789K035Q986J6453o164k3687k0182p08J0087M636
14442B1912L185q735j2926m690N0m005J7704J0945j690o941k222P313J1863j4197
14428A7566r194J0302N463j1244r628L552N288j0316K904k45O80O305o656L203
14414G980k993Q656O00r885p876j771N687O224n467j823J0589j05l176J8870N718
$$ plain form
14399 31228 25676 29165 38459 45035 33487 19493 29027 32576 21053 3491 1589 -1863 5018
14386 5018 11054 -1843 -3029 13616 23187 18552 15237 24724 32832 29247 20909 26756 25095 12681
14372 12681 8225 29181 40116 22836 14490 13033 11705 2433 885 2886 -431 8843 19830
14359 19830 33475 25945 25711 30702 25870 24685 29915 30110 17501 26559 35658 29671 41829 31285
14345 31285 11039 12883 20425 29281 23004 13844 4775 16003 24985 24339 10838 2792 5674 16280
14331 16280 21453 15127 8854 19161 18349 19640 18516 6705 3946 16156 35807 46643 50515
14318 50515 57548 59932 44352 27481 27588 26291 23979 24993 39947 41855 39665 41998 30335 39312
14304 39312 29155 20514 36536 51938 48990 42110 33916 18365 11344 15608 13171 20868 31424
$$ packed form
14399C1228n552L489R294O576j1548j3994R534L549j1523j7562j902l452O881
14386E018O036j2897j186J6645R571m635l315R487Q108l585q338N847j661j2414
14372A2681m456K0956J0935j7280q346j457j328r272j548K001l317R274J0987
14359A9830J3645p530k34M991m832j185N230J95j2609R058R099n987J2158j0544
14345C1285k0246J844P542Q856o277r160r069J1228Q982o46j3501q046K882J0606
14331A6280N173o326o273J0307q12J291j124j1811k759J2210J9651J0836L872
14318E0515P033K384j5580j6871J07j297k312J014J4954J908k190K333j1663Q977
14304C9312j0157q641J6022J5402k948o880q194j5551p021M264k437P697J0556
$$ plain form
14291 31424 39475 50014 33942 20592 19540 16700 4378 5601 21324 15107 23819 32507 29808
14278 29808 20344 25258 27999 19796 1878 -5325 6397 14561 28592 20258 21079 22112 33189 37543
14264 37543 21837 15985 23607 30288 16041 9274 25824 23825 19374 32821 38806 34685 30137
14251 30137 21569 14158 15482 27398 23327 26095 38980 35212 30452 28385 33019 26268 31879 30067
14237 30067 20570 13981 16298 24837 38197 42765 30736 18668 14548 20938 36206 39911 35747
14224 35747 23879 14228 22298 30879 38579 42083 38037 24557 9713 19899 21100 19709 25126
14211 25126 36255 40195 35157 26840 9636 8115 23106 16186 6315 17464 28802 38528 27773
14198 27773 22301 25464 27137 28352 29776 28365 20679 19226 28199 21295 27864 39139 35199 23793
$$ packed form
14291C1424Q051J0539j6072j3350j052k840j2322J223J5723o217Q712Q688k699
14278B9808r464M914K741q203j7918p203J1722Q164J4031q334Q21J033J1077M354
14264C7543j5706n852P622O681j4247o767J6550j999m451J3447N985m121m548
14251C0137q568p411J324J1916m071K768J2885l768m760k067M634o751N611j812
14237C0067r497o589K317Q539J3360M568j2029j2068m120O390J5268L705m164
14224C5747j1868r651Q070Q581P700L504m046j3480j4844J0186J201j391N417
14211B5126J1129L940n038q317j7204j521J4991o920r871J1149J1338R726j0755
14198B7773n472L163J673J215J424j411p686j453Q973o904O569J1275l940j1406
$$ plain form
14184 23793 16501 28781 42968 48076 45890 39403 43210 35464 25040 12083 8048 16118 15449 15873
14170 15873 19767 37606 39507 43010 40761 18756 15946 15278 19227 17065 13114 29470 38773 42131
14156 42131 31012 20850 22274 15601 10992 19967 29371 40560 48453 52364 48974 45894 56324
14143 56324 51989 53446 41062 35702 30445 13036 10466 18552 31810 27385 13886 25922 32728
14130 32728 16946 15373 7573 12882 18246 18234 16700 17171 21931 29843 26118 11523 14436 29298
14116 29298 46671 43077 36140 29573 32362 33431 25404 15515 11094 10923 9994 24859 30942 30041 29209
14101 29209 21394 23622 31580 37284 30470 18332 29899 42269 43113 35762 38615 51684 55030 45279
14087 45279 43392 60151 62162 60523 42335 24353 26233 26774 20990 28981 27020 19648 15843 24231
$$ packed form
14184B3793p292J2280J4187N108k186o487L807p746j0424j2957m035Q070o69M24
14170A5873L894J7839J901L503k249k2005k810o68L949k162l951J6356R303L358
14156D2131j1119j0162J424o673m609Q975R404J1189P893L911l390l080J0430
14143E6324m335J457j2384n360n257j7409k570Q086J3258m425j3499J2036O806
14130C2728j5782j573p800N309N364j2j534M71M760P912l725j4595K913J4862
14116B9298J7373l594o937o567K789J069q027r889m421j71r29J4865O083r01q32
14101B9209p815K228P958N704o814j2138J1567J2370Q44p351K853J3069L346r751
14087D5279j887J6759K011j639j8188j7982J880N41n784P991j961p372l805Q388
$$ plain form
14073 24231 16665 20129 15116 25557 43345 39472 27921 13337 24270 38693 39774 35780 24912
14060 24912 36097 52189 53372 44364 37830 22600 23277 27320 32892 44576 58582 47232 30164
14047 30164 27908 36207 44834 42638 35661 35714 40206 36291 31679 22528 30788 38652 39448 32977 38824
14032 38824 48940 40123 27539 31720 43337 44883 45506 29759 28369 45096 36638 34629 27939
14019 27939 24232 32863 43579 48249 34280 35004 36590 27015 29303 35427 36056 31845 33108 33148 28621
14004 28621 37698 48543 43787 33587 37239 46631 57902 58812 55310 50797 51891 49662 48275 53853
13990 53853 43564 37762 33023 41867 37491 31027 31991 40457 38025 35385 43803 40852 32365 33302 34503
13975 34503 30136 27246 26066 36103 51721 49381 43705 35060 36863 38887 45586 37443 31730 38819
$$ packed form
14073B4231p566L464n013J0441J7788l873j1551j4584J0933J4423J081l994j0868
14060B4912J1185J6092J183r008o534j5230O77M043N572J1684J4006j1350j7068
14047C0164k256Q299Q627k196o977N3M492l915m612r151Q260P864P96o471N847
14032C8824J0116q817j2584M181J1617J546O23j5747j390J6727q458k009o690
14019B7939l707Q631J0716M670j3969P24J586r575K288O124O29m211J263M0m527
14004B8621R077J0845m756j0200L652R392J1271R10l502m513J094k229j387N578
13990E3853j0289n802m739Q844m376o464R64Q466k432k640Q418k951q487R37J201
13975C4503m367k890j180J0037J5618k340n676q645J803K024O699q143n713P089
$$ plain form
13961 38819 37657 28709 23791 25660 31012 33445 38925 35452 32019 27569 29276 25652 31318 48073
13947 48073 59638 53406 52852 58642 54742 39408 29665 37558 48569 71407 97552 99353 98811 105253
13933 105253 114033 120372 135573 141243 138758 120834 103821 73840 70898 69942 60104 61111 61993 45820
13919 45820 46898 60138 54694 42365 47041 57236 62509 60050 57030 51041 58650 60252 61907 62718
13905 62718 72894 68529 69589 91051 85114 66346 64313 70169 78462 77558 82832 105334 124472
13892 124472 113833 118908 149796 203639 267892 331936 349104 323152 288290 246402 214172 173323
13880 173323 139617 121063 95981 94763 101802 102047 92840 83440 66846 70479 65651 54332 49696
13867 49696 55267 69985 80744 81750 83523 89218 90324 73491 61811 67363 68373 60318 62755
$$ packed form
13961C8819j162q948m918J869N352K433N480l473l433m450J707l624N666J6755
13947D8073J1565o232n54N790l900j5334r743P893J1011K2838K6145J801n42O442
13933A05253Q780O339J5201N670k485j7924j7013k9981k942r56r838J007Q82j6173
13919D5820J078J3240n444j2329M676J0195N273k459l020n989P609J602J655Q11
13905F2718J0176m365J060K1462n937j8768k033N856Q293r04N274K2502J9138
13892A24472j0639N075L0888N3843O4253O4044J7168k5952l4862m1888l2230m0849
13880A73323l3706j8554k5082j218P039K45r207r400j6594L633m828j1319m636
13867D9696N571J4718J0759J006J773N695J106j6833j1680N552J010q055K437
$$ plain form
13854 62755 62987 58535 59903 62858 79772 100062 128001 154147 170097 184665 219979 272622 345078
13841 345078 384306 370224 316382 274605 230468 184281 153676 122319 101263 103191 101227 97129
13829 97129 96414 85941 79093 69335 61316 64747 63959 58047 59431 57781 61133 69665 69217 71622 68472
13814 68472 66507 70727 68023 60240 63687 69816 70627 71656 78936 80607 82226 87334 92419 85112 93441
13799 93441 109620 140432 158737 163292 159817 150643 132836 109026 92598 88431 90210 91145 84979
13786 84979 65029 63672 61082 64571 70651 57827 46401 46782 56131 58035 58060 53701 50516 58858
13772 58858 76887 82586 77438 64359 44793 49781 62743 80848 74525 61099 57932 55771 59546
13759 59546 68776 55266 61603 67078 58043 63402 66370 70339 74841 66246 66359 73732 64311 67838
$$ packed form
13854F2755K32m452J368K955J6914K0290K7939K6146J5950J4568L5314N2643P2456
13841C45078L9228j4082n3842m1777m4137m6187l0605l1357k1056J928j964m098
13829I7129p15j0473o848r758q019L431p88n912J384j650L352Q532m48K405l150
13814F8472j965M220k704p783L447O129Q11J029P280J671J619N108N085p307Q329
13799I3441J6179L0812J8305M555l475r174j7807k3810j6428m167J779R35o166
13786H4979j9950j357k590L489O080j2824j1426L81R349J904K5m359l185Q342
13772E8858J8029N699n148j3079j9566M988J2962J8105o323j3426l167k161L775
13759E9546R230j3510O337N475r035N359K968L969M502q595J13P373r421L527
$$ plain form
13745 67838 73603 71678 69867 66335 71866 64221 60834 64785 64116 59668 64480 66413 55666 60047
13731 60047 66547 71544 62003 59944 60133 74222 75865 88196 91023 92817 91345 85672 81828 83270
13717 83270 85339 90614 85766 75153 86046 86378 88683 91738 92543 78027 68244 69064 78642 98777
13703 98777 99773 83586 72623 64108 59946 74160 80267 65885 59612 71717 82355 77422 74450
13690 74450 68135 69180 68757 86081 97494 97848 85171 89195 98296 108729 97738 93439 111830
13677 111830 118839 135335 133363 124160 115848 112073 95937 79612 83843 83281 76348 80518 86517 85680
13663 85680 86786 96125 100038 92410 86607 103154 108186 102951 92478 74975 67518 74808 71785 77050
13649 77050 87064 80698 78759 91991 96026 90060 81589 80141 92250 94023 104900 104496 102565 118574
$$ packed form
13745F7838N765j925j811l532N531p645l387L951o69m448M812J933j0747M381
13731F0047O500M997r541k059J89J4089J643J2331K827J794j472n673l844J442
13717H3270K069N275m848j0613J0893L32K305L055Q05j4516r783Q20R578K0135
13703I8777R96j6187j0963q515m162J4214O107j4382o273J2105J0638m933k972
13690G4450o315J045m23J7324J1413L54j2677M024R101J0433j0991m299J8391
13677A11830P009J6496j972r203q312l775j6136j6325M231n62o933M170N999q37
13663H5680J106R339L913p628n803J6547N032n235j0473j7503p457P290l023N265
13649G7050J0014o366j939J3232M035n966q471j448J2109J773J0877m04j931J6009
$$ plain form
13635 118574 119823 130803 139611 144438 163626 164319 147498 118114 107991 117254 132798 123903 123009
13622 123009 130606 118403 111904 101444 96074 91539 88509 87496 97238 100660 115094 129995 127560
13609 127560 112891 111197 107276 106073 103507 107862 109027 116741 120567 124463 129883 130948 139152 145670
13595 145670 139153 128830 134220 133773 131980 141870 142339 131306 123589 125961 119521 125917 140980 153040
13581 153040 146201 131586 127992 135393 138551 134267 147046 161671 168282 155248 149806 151354 156685
13568 156685 149415 150074 161164 181718 167826 162430 169759 161543 160957 165612 170230 171823 168504 173122
13554 173122 184985 193787 210010 211795 222986 224329 212970 213904 223798 214520 211102 202567 197386
13541 197386 200460 214501 226881 231142 232856 235445 233555 232743 231198 245987 252191 253063 263361 265453
$$ packed form
13635A18574J249J0980Q808M827J9188O93j6821k9384j0123R263J5544q895q94
13622A23009P597j2203o499j0460n370m535l030j013R742L422J4434J4901k435
13609A27560j4669j694l921j203k566M355J165P714L826L896N420J065Q204O518
13595A45670o517j0323N390m47j793R890M69j1033p717K372o440O396J5063J2060
13581A53040o839j4615l594P401L158m284J2779J4625O611j3034n442J548N331
13568A56685p270O59J1090K0554j3892n396P329q216n86M655M618J593l319M618
13554A73122J1863Q802J6223J785J1191J343j1359R34R894r278l418q535n181
13541A97386L074J4041J2380M261J714K589j890q12j545J4789O204Q72J0298K092
$$ plain form
13527 265453 265020 267167 264742 274585 280435 285047 287531 297381 316464 342130 343262 330991 331302 337092
13513 337092 340572 350101 363802 368822 378106 381174 382985 398070 415147 436336 450388 465196 479978
13500 479978 488226 495213 516995 546911 557331 574746 600688 638810 676351 721075 781684 842094
13488 842094 902087 979947 1074209 1198863 1318778 1466247 1649842 1887644 2179653 2548451
13478 2548451 2994562 3538971 4235308 5211958 6668168 8884510 12183714 16326097 19654212
13469 19654212 20127989 18236016 15453179 12307300 9307583 7007065 5445142 4441708
13461 4441708 3785424 3319088 2982507 2703015 2473723 2302750 2149531 2054665 1990688 1937011
13451 1937011 1919645 1921050 1923806 1946022 2004261 2088965 2181961 2296782 2450715 2642110 2877881
$$ packed form
13527B65453m33K147k425R843N850M612K484R850J9083K5666J132j2271L11N790
13513C37092L480R529J3701N020R284L068J811J5085J7077K1189J4052J4808J4782
13500D79978Q248O987K1782K9916J0420J7415K5942L8122L7541M4724O0609O0410
13488H42094N9993P7860R4262J24654J19915J47469J83595K37802K92009L68798
13478B548451M46111N44409O96337R76650J456210K216342L299204M142383L328115
13469A9654212M73777j891973k782837l145879k999717k300518j561923j003434
13461D441708o56284m66336l36581k79492k29292j70973j53219r4866o3977n3677
13451A937011j7366J405K756K2216N8239Q4704R2996J14821J53933J91395K35771
$$ plain form
13440 2877881 3139274 3454177 3853685 4354454 5018017 5886662 6960938 8236965 9794447
13431 9794447 11755622 14453894 18483388 24804899 34686508 48600878 62134633 65197798
13423 65197798 58171654 48723399 38133998 27705463 19803607 14714941 11561678 9563152
13415 9563152 8172702 7071361 6173898 5422182 4798333 4280637 3866572 3548067 3301770
13406 3301770 3120351 2990373 2906974 2840784 2803722 2801443 2830938 2905466 3001956 3128090 3317377
13395 3317377 3551895 3845781 4201514 4667042 5312608 6136362 7178263 8451852 9992679
13386 9992679 11913262 14520847 18386625 24399809 33848983 47469568 61867207 66749989
13378 66749989 60228582 50598391 39874691 28978133 20476015 14962638 11563039 9405203
$$ packed form
13440B877881K61393L14903L99508N00769O63563Q68645J074276J276027J557482
13431I794447J961175K698272M029494O321511R881609J3914370J3533755L063165
13423F5197798p026144r448255j0589401j0428535p901856n088666l153263j998526
13415I563152j390450j101341q97463p51716o23849n17696m14065l18505k46297
13406C301770j81419j29978q3399o6190l7062k279K9495P4528R6490J26134J89287
13395C317377K34518K93886L55733M65528O45566Q23754J041901J273589J540827
13386I992679J920583K607585L865778O013184R449174J3620585J4397639M882782
13378F6749989o521407r630191j0723700j0896558q502118n513377l399599k157836
$$ plain form
13370 9405203 7924937 6771719 5829709 5052888 4361202 3777797 3297953 2932560 2666527
13361 2666527 2444420 2254414 2107351 1979757 1860120 1773481 1715001 1667797 1644587 1654697
13351 1654697 1690616 1736603 1794061 1888165 2027694 2233856 2484547 2812942 3231580 3751213
13341 3751213 4393189 5264905 6529449 8473219 11424271 15482234 19558392 21197486
13333 21197486 19745890 16905063 13558774 10151726 7355614 5416995 4154111 3319944
13325 3319944 2741258 2310131 1974379 1678641 1428795 1225325 1045630 897482 786141
13316 786141 716709 640512 583651 524125 454721 396043 362247 320568 291156 266342 241467
13305 241467 211360 185126 168498 171855 167752 155968 146037 145061 129847 103704 82138 67830
$$ packed form
13370I405203j480266j153218r42010p76821o91686n83405m79844l65393k66033
13361B666527k22107j90006j47063j27594j19637q6639n8480m7204k3210J0110
13351A654697L5919M5987N7458R4104J39529K06162K50691L28395M18638N19633
13341C751213O41976Q71716J264544J943770K951052M057963M076158J639094
13333B1197486j451596k840827l346289l407048k796112j938619j262884q34167
13325C319944n78686m31127l35752k95738k49846k03470j79695j48148j11341
13316G86141o9432p6197n6861n9526o9404n8678l3796m1679k9412k4814k4875
13305B41467l0107k6234j6628L357m103j1784r931r76j5214k6143k1566j4308
$$ plain form
13293 67830 51224 49703 61318 54781 49848 38373 18637 12070 18364 6320 -7239 5857 2907
13280 2907 9393 19315 20277 5461 -15647 -28633 -19783 -10885 -8798 -1836 -26019 -41936 -30131
13267 -30131 -20690 -9453 -6941 -14445 -14531 -9551 -14210 -22372 -29428 -21037 -14086 -20006 -13952 -11671 -5682
13252 -5682 -11532 -3534 -14815 -23371 -35219 -49005 -67995 -70689 -46177 -28305 -12605 -1350 -9878
13239 -9878 -25527 -32813 -41784 -40279 -34073 -30316 -25614 -30087 -46383 -60451 -52406 -30351 -34188 -40552
13225 -40552 -35337 -25848 -27573 -40514 -37952 -28757 -17776 -36870 -38684 -35425 -37575 -27165 -26270 -35884
13211 -35884 -39472 -28566 -19866 -31171 -38113 -41856 -40124 -33151 -15639 -18544 -24014 -23968 -26348 -35120
13197 -35120 -39298 -17170 -2980 -10457 -21616 -33732 -29313 -9922 -3853 -1003 -10319 -21700 -28413
$$ packed form
13293F7830j6606j521J1615o537m933j1475j9736o567O294j2044j3559J3096k950
13280B907O486R922R62j4816k1108j2986Q850Q898K087O962k4183j5917J1805
13267c0131R441J1237K512p504q6M980m659q162p056Q391O951n920O054K281N989
13252e682n850P998j1281q556j1848j3786j8990k694K4512J7872J5700J1255q528
13239i878j5649p286q971J505O206L757M702m473j6296j4068Q045K2055l837o364
13225d0552N215R489j725j2941K562R195J0981j9094j814L259k150J0410Q95r614
13211c5884l588J0906Q700j1305o942l743J732O973J7512k905n470M6k380q772
13197c5120m178K2128J4190p477j1159j2116M419J9391O069K850r316j1381o713
$$ plain form
13184 -28413 -29021 -19965 -25474 -40335 -62326 -56640 -34869 -27243 -20099 -29780 -31798 -27643 -30183 -28125
13170 -28125 -27420 -24717 -16206 -23104 -23223 -33720 -45788 -32471 -29859 -27430 -28956 -35051 -22482 -27177
13156 -27177 -39930 -41927 -44394 -39783 -24734 -16476 -22511 -41707 -51884 -51106 -36646 -33485 -31756
13143 -31756 -25294 -19338 -27789 -25643 -28766 -40789 -26376 -27641 -39716 -27610 -25544 -24123 -22613
13130 -22613 -33313 -29508 -19241 -19393 -9120 -5578 -14740 -23049 -21018 -18660 -17154 -18555 -17370 -14813
13116 -14813 -18530 -17037 -26210 -21160 -19192 -21211 -19942 -29413 -22587 -18220 -16277 -10523 -5962 3738
13102 3738 -441 -7780 -12218 -29871 -43267 -39816 -45200 -41716 -33948 -23240 -19678 -23990 -28408 -37603
13088 -37603 -51429 -44990 -36475 -34231 -36364 -26238 -7767 -10588 -19136 -25305 -18883 -25703 -23748 -31263
$$ packed form
13184b8413o08R056n509j4861k1991N686K1771P626P144r681k018M155k540K058
13170b8125P05K703Q511o898j19j0497j2068J3317K612K429j526o095J2569m695
13156b7177j2753j997k467M611J5049Q258o035j9196j0177P78J4460L161J729
13143c1756O462N956q451K146l123j2023J4413j265j2075J2106K066J421J510
13130b2613j0700L805J0267j52J0273L542r162q309K031K358J506j401J185K557
13116a4813l717J493r173N050J968k019J269r471O826M367J943N754M561R700
13102C738m179p339m438j7653j3396L451n384L484P768J0708L562m312m418r195
13088c7603j3826O439Q515K244k133J0126J8471k821q548o169O422o820J955p515
$$ plain form
13074 -31263 -40914 -35195 -33121 -26127 -20296 -23389 -14638 -13539 -20635 -37634 -36813 -44482 -42805 -46874
13060 -46874 -40899 -37839 -43886 -48664 -46404 -40113 -39202 -35930 -37867 -39245 -26827 -23245 -34878 -34871 -56368
13045 -56368 -51696 -30872 -18425 -16709 -13098 -5713 -6741 -18233 -26367 -14903 -13752 -19881 -22921
13032 -22921 -20456 -17928 -17315 -24288 -18635 -22010 -12806 -17191 -6797 -8706 -8383 -13982 -10583 -20095 -32064
13017 -32064 -22759 -25014 -14148 -8859 -4024 5736 19745 24335 11455 7802 7170 10282 17712 34570
13003 34570 39027 37860 67752 92554 90406 78755 50206 19874 5387 -2040 -8376 -4064 -5068
12990 -5068 186 9676 7495 13373 17072 8808 18756 13877 -3459 -3634 -3199 -75 23846 21530 14854
12975 14854 6176 -2154 -15268 -30226 -23111 -9135 -3316 12272 6362 6626 1872 -3389 5632 26777
$$ packed form
13074c1263r651N719K074O994N831l093Q751J099p096j6999Q21p669J677m069
13060d6874N975L060o047m778K260O291R11L272j937j378J2418L582j1633Pk1497
13045e6368M672K0824J2447J716L611P385j028j1492q134J1464J151o129l040
13032b2921K465K528O13o973N653l375R204m385J0394j909L23n599L399r512j1969
13017c2064R305k255J0866N289M835R760J4009M590j2880l653o32L112P430J6858
13003C4570M457j167K9892K4802k148j1651k8549l0332j4487p427o336M312j004
12990e068N254R490k181N878L699q264R948m879j7336j75M35L124K3921k316o676
12975A4854q678q330j3114j4958P115J3976N819J5588n910K64m754n261R021K1145
$$ plain form
12961 26777 39661 51296 72438 110629 158265 209260 267822 279834 271776 223778 164417 114592
12949 114592 75245 51951 38718 31136 31528 24998 15228 6561 3223 -319 5758 11640 7865 21870
12935 21870 25071 18237 4850 5004 15024 12505 13237 15606 15609 14686 2448 5568 6436 15071 27935
12920 27935 29995 24246 36682 35271 45655 63859 79314 107658 155166 214632 266735 300592
12908 300592 286435 253599 208074 156402 108376 80397 75365 78734 63762 34909 15735 15935
12896 15935 10601 2184 14478 22006 22246 10577 1358 -4673 5071 9499 10175 10031 1826 7145 19
12881 19 -13056 -21690 -23025 -19811 -10438 5779 8912 88 -13734 -17808 -3121 -241 447 16871
12867 16871 37071 58504 69715 75775 70451 68256 44806 27705 22491 13764 19400 23435 18878
$$ packed form
12961B6777J2884J1635K1142L8191M7636N0995N8562J2012q058m7998n9361m9825
12949A14592l9347k3294j3233p582L92o530r770q667l338l542O077N882l775J4005
12935B1870L201o834j3387J54J0020k519P32K369Lr23j2238L120Q68Q635J2864
12920B7935K060n749J2436j411J0384J8204J5455K8344M7508N9466N2103L3857
12908C00592j4157l2836m5525n1672m8026k7979n032L369j4972k8853j9174K00
12896A5935n334q417J2294P528K40j1669r219o031R744M428O76j44q205N319p126
12881A9j3075q634j335L214R373J6217L133q824j3822m074J4687K880O88J6424
12867A6871K0200K1433J1211O060n324k195k3450j7101n214q727N636M035m557
$$ plain form
12854 18878 9556 3614 -8396 4568 7978 1150 -15412 -16404 -19004 -14744 -19342 -13517 -3651 -252
12840 -252 13202 11219 2726 -10487 -19355 -18097 -3906 -6264 -12085 -17458 -18758 -18988 -26559 -30834
12826 -30834 -27090 -20529 619 4190 -3534 -8516 -18454 -17966 1389 5079 4491 -8186 -10855 -18074
12812 -18074 -24972 -17536 -9215 -3593 -4373 -3736 -9536 -20498 -17327 -18402 -14761 -15726 -16396 -22912 -20565
12797 -20565 -17560 -13962 -20935 -17535 -6641 6588 12962 2497 1617 3466 2784 11478 1324 -8739
12783 -8739 -13700 -15804 -22220 -11764 -4024 -8417 -4799 -18900 -9982 -3220 -12524 -29211 -22688 -15247
12769 -15247 -11574 -9625 -2936 -1750 -12080 -18221 -15423 -19372 -28055 -32295 -17014 -6372 -14868 -7804
12755 -7804 1532 10947 24276 1600 -9812 312 9320 13014 24766 8566 -12221 -9835 6961
$$ packed form
12854A8878r322n942j2010J2964L410o828j6562r92k600M260m598N825R866L399
12840b52J3454j983q493j3213q868J258J4191k358n821n373j300k30p571m275
12826c0834L744O561K1148L571p724m982r938M88J9355L690n88j2677k669p219
12812a8074o898P436Q321N622p80O37n800j0962L171j075L641r65o70o516K347
12797b0565L005L598o973L400J0894J3229O374j0465q80J849o82Q694j0154j0063
12783h739m961k104o416J0456P740m393L618j4101Q918O762r304j6687O523P441
12769a5247L673J949O689J186j0330o141K798l949q683m240J5281J0642q496P064
12755g804R336R415J3329k2676j1412J0124R008L694J1752j6200k0787K386J6796
$$ plain form
12742 6961 12827 14141 12428 14050 -1741 -10966 -6922 -1424 -8688 -10039 3493 5648 -3899 2875
12728 2875 -49 5473 2913 -3474 -6765 -22621 -9739 -3281 -5560 -6648 -12708 -6931 -16601 -21418
12714 -21418 -11209 -11190 -14471 -23158 -20355 -12793 -5497 -5610 -1836 -10484 -1539 10021 3309 -3754 -12284
12699 -12284 -17224 -7522 -1813 18395 19562 9854 -11618 -11036 4930 5926 -2248 -1281 28 6311
12685 6311 -916 3181 -1160 -3789 -3505 -9536 -12785 -7544 3873 7318 -1882 -6187 10309 35505
12671 35505 76145 117760 142141 124040 104230 93519 69268 49335 27538 19598 21434 12219
12659 12219 7631 4725 -5554 -7958 -7043 -8175 -11128 -9653 -12074 -7517 8916 3214 -9976 -10673
12645 -10673 -14894 -14811 1860 12889 22602 10121 5721 -134 -4871 -5309 583 -2829 -13154 -21681
$$ packed form
12742F961N866J314j713J622j5791r225M044N498p264j351J3532K155r547O774
12728B875k924N522k560o387l291j5856J2882O458k279j088o060N777r670m817
12714b1418J0209J9l281q687K803P562P296j13L774q648Q945J1560o712p063q530
12699a2284m940R702N709K0208J167r708k1472N82J5966R96q174R67J309O283
12685F311p227M097m341k629K84o031l249N241J1417L445r200m305J6496K5196
12671C5505M0640M1615K4381j8101j9810j0711k4251j9933k1797p940J836r215
12659A2219m588k906j0279k404R15j132k953J475k421M557J6433n702j3190o97
12645a0673m221Q3J6671J1029R713j2481m400n855m737m38N892l412j0325q527
$$ plain form
12631 -21681 -14092 -6660 -1962 10850 8722 -2102 -947 -7299 -14574 -16626 -19803 -27718 -21875 -10334
12617 -10334 -5076 -14706 -8424 -13371 -12198 -12689 -18850 -17758 -17711 -14834 -4503 6403 9049 3173 -291
12602 -291 138 2314 -11420 -22975 -14534 2119 308 -2937 987 -1532 -4248 -839 122 4922 3503
12587 3503 5590 12599 4634 8791 775 8772 8112 1246 12044 9405 9046 722 -2727 296 932
12572 932 -640 9575 8193 -189 2150 3924 2080 1547 4702 3883 5505 458 -3199 -1309 -14864
12557 -14864 -29145 -22302 -12758 -4470 -10849 -16448 -10665 2258 13768 8142 9367 24462 19008
12544 19008 -245 -8048 -8548 -6744 1925 1063 298 662 -5145 -5967 -16795 -15123 11470 28159 24091
12529 24091 10528 -2391 -14104 -448 6644 13972 11906 10182 17518 13852 7661 -1463 -9970
$$ packed form
12631b1681P589P432M698J2812k128j0824J155o352p275k052l177p915N843J1541
12617a0334N258r630O282m947J173m91o161J092M7K877J0331J0906K646n876l464
12602b91M29K176j3734j1555Q441J6653j811l245L924k519k716L409R61M800j419
12587C503K087P009p965M157q016P997o60o866J0798k639l59q324l449L023O36
12572I32j572J0215j382q382K339J774j844n33L155q19J622n047l657J890j3555
12557a4864j4281O843R544Q288o379n599N783J2923J1510n626J225J5095n454
12544A9008j9253p803n00J804Q669q62p65L64n807q22j0828J672K6593J6689m068
12529B4091j3563j2919j1713J3656P092P328k066j724P336l666o191r124q507
$$ plain form
12516 -9970 -8404 -3261 -7154 -17265 -11580 -18986 -11289 -1878 -1545 -10604 -12818 -5033 -9010 -10773 -16379
12501 -16379 -13410 -10187 3113 21332 29914 20325 17453 1504 -13574 -24351 -15824 -3797 336
12488 336 -2155 5497 5125 13520 21022 18452 7554 2905 345 -535 6271 2883 11001 12864 1235
12473 1235 -3595 -12589 -15511 -7831 -10059 7724 20292 18312 15085 7727 5099 8689 13538 5659
12459 5659 -10067 -1691 2022 10516 14726 497 -13585 -15070 -20731 -27649 -13800 -11895 -31841
12446 -31841 -37643 -12502 -965 -2774 997 8214 10336 -3358 -11588 -13774 -16233 -2093 6158
12433 6158 -690 -5653 -5394 -2849 -3132 12050 15585 7115 14529 23001 25201 18293 11836 6117 -7262
12418 -7262 -11153 -16536 -22200 -23990 -23560 2796 14062 15265 13113 -1905 -5542 -13073 -7296 -648
$$ packed form
12516i970J566N143l893j0111N685p406P697R411L33r059k214P785l977j763n606
12501a6379K969L223J3300J8219Q582r589k872j5949j5078j0777Q527J2027M133
12488C36k491P652l72Q395P502k570j0898m649k560q80O806l388Q118J863j1629
12473A235m830q994k922P680k228J7783J2568j980l227p358k628L590M849p879
12459E659j5726Q376L713Q494M210j4229j4082j485n661o918J3849J905j9946
12446c1841n802K5141J1537j809L771P217K122j3694q230k186k459J4140Q251
12433F158o848m963K59K545k83J5182L535q470P414Q472K200o908o457n719j3379
12418g262l891n383n664j790M30K6356J1266J203k152j5018l637p531N777O648
$$ plain form
12404 -648 9 -6481 929 7320 -3208 -553 -1232 -6421 -8289 -8469 -3082 8646 2352 19930 21860
12389 21860 7802 7302 1292 10563 16619 20394 42886 41315 15319 18254 25640 14389 3072
12376 3072 725 7470 22183 16167 7602 5531 5054 7962 11897 25279 21895 1269 -11089 -14982
12362 -14982 -13464 -9128 -3297 3002 17848 23565 13203 11923 11572 13098 18624 10079 9580 4119
12348 4119 1383 289 5246 -1690 5944 678 -13314 -27009 -25424 -16790 11598 27978 -1956
12335 -1956 -7565 -2057 -3153 229 8434 20569 16969 2868 1766 4531 7911 -344 305 -2216
12321 -2216 -4756 -5715 -9555 -11390 -3842 1122 11874 12244 3379 14576 13158 8334 575 6862 6730
12306 6730 11435 21902 11974 6528 2658 -19339 -13841 -10622 -2532 -1394 -5902 -17284 -16305 1577
$$ packed form
12404f48O57o490P410O391j0528K655o79n189j868j80N387J1728o294J7578J930
12389B1860j4058n00o010R271O056L775K2492j571k5996K935P386j1251j1317
12376C072k347O745J4713o016q565k071m77K908L935J3382l384k0626j2358l893
12362a4982J518M336N831O299J4846N717j0362j280l51J526N526q545m99n461
12348D119k736j094M957o936P634n266j3992j3695J585Q634K8388J6380k9934
12335a956n609N508j096L382Q205J2135l600j4101j102K765L380q255O49k521
12321b216k540r59l840j835P548M964J0752L70q865J1197j418m824p759O287j32
12306F730M705J0467r928n446l870k1997N498L219Q090J138m508j1382R79J7882
$$ plain form
12292 1577 22286 14388 1357 693 6079 15224 22792 12629 4380 5286 10923 22128 26339 33223
12278 33223 17865 20474 14988 2004 -4432 14270 30168 14103 15821 25659 23730 21747 19610
12265 19610 17854 22682 16810 5175 16208 20444 16759 19294 25156 32999 16455 -277 -961 7095
12251 7095 11999 17592 31664 13872 6303 12182 5901 933 12350 10112 -199 -1703 17246
12238 17246 36526 39270 29283 10012 2489 13 -1191 -10431 -18392 -9168 -6925 -521 3575 5746
12224 5746 1611 8537 19562 18307 23853 9852 -1553 798 6504 4831 1751 9828 1873 -3715
12210 -3715 -1891 6505 18558 14606 1874 -1895 6717 10864 11706 18769 13143 4695 4760 -34 4596
12195 4596 15546 7687 -1861 -3794 -5827 -8758 -7929 -9659 -5271 2968 16195 -5122 -23029 -10931
$$ packed form
12292A577K0709p898j3031o64N386R145P568j0163q249R06N637J1205M211O884
12278C3223j5358K609n486j2984o436J8702J5898j6065J718R838j929j983k137
12265A9610j756M828n872j1635J1033M236l685K535N862P843j6544j6732o84Q056
12251G095M904N593J4072j7792p569N879o281m968J1417k238j0311j504J8949
12238A7246J9280K744r987j9271p523k476j204r240p961R224K243O404M096K171
12224E746m135O926J1025j255N546j4001j1405K351N706j673l080Q077p955n588
12210c715J824Q396J2053l952j2732l769Q612M147Q42P063n626q448O5m794M630
12195D596J0950p859r548j933k033k931Q29j730M388Q239J3227k1317j7907J2098
$$ plain form
12181 -10931 8551 2115 -6679 12555 25723 18049 2334 3314 10566 28948 40219 31167 25474
12168 25474 29288 21187 28790 27601 22702 26197 33501 47720 43655 38282 26469 -1376 -26408
12155 -26408 -24235 -14542 7771 22284 13017 5444 7248 1429 -3206 -16796 -15882 -11835 436 14782
12141 14782 8553 11267 22513 17379 11401 10559 15288 9185 9415 8161 1522 4223 3619 473 6871
12126 6871 -3750 -11701 -10757 974 9009 15890 17093 12307 -4293 -18033 4265 18527 20202
12113 20202 17454 18428 12362 21362 23623 15239 17652 15309 24992 18416 267 4828 20099 26548
12099 26548 32733 37513 31666 35378 35079 37869 34584 27195 21610 23199 13603 3575 14564 38401
12085 38401 44096 36506 21379 15895 8364 1805 4176 24198 36952 30745 2951 -2705 20341
$$ packed form
12181a0931J9482o436q794J9234J3168p674j5715R80P252J8382J1271r052n693
12168B5474L814q101P603j189m899L495P304J4219m065n373j1813k7845k5032
12155b6408K173R693K2313J4513r267p573J804n819m635j3590R14M047J2271J4346
12141A4782o229K714J1246n134n978q42M729o103K30j254o639K701o04l146O398
12126F871j0621p951R44J1731Q035O881J203m786j6600j3740K2298J4262J675
12113B0202k748R74o066R000K261q384K413k343R683o576j8149M561J5271O449
12099B6548O185M780n847L712k99K790l285p389n585J589r596j0028J0989K3837
12085C8401N695p590j5127n484p531o559K371K0022J2754o207k7794n656K3046
$$ plain form
12072 20341 30391 42196 42159 38525 29150 30341 42632 39880 31838 23493 18035 12107 10034 17201
12058 17201 24095 22106 13750 10791 22583 14431 -47 6254 12185 15241 18251 11868 1222 11914
12044 11914 12950 25466 31164 28217 26217 34738 31233 23313 33611 35108 12475 17786 34722
12031 34722 39761 16333 13158 18340 12776 6780 -4539 -4383 -4578 -4956 2448 14496 15309 17799 8076
12016 8076 23920 41404 37136 16216 30131 30574 27495 25232 16807 8952 7210 3511 8828 14403
12002 14403 2541 3860 18591 33068 25148 13433 14142 30116 37024 30937 24466 19576 7342
11989 7342 5787 18451 27472 14624 -5963 -11474 -4670 5210 17036 26495 31517 27084 26507 27851
11975 27851 39362 32874 26541 28417 19818 20798 17924 19620 20516 20146 18225 10475 14869 20476 7879
$$ packed form
12072B0341J0050J1805l7l634r375J191J2291k752q042q345n458n928k073P167
12058A7201O894j989q356k959J1792q152j4478O301N931L056L010o383j0646J0692
12044A1914J036J2516N698k947k000Q521l505p920J0298J497k2633N311J6936
12031C4722N039k3428l175N182n564n996j1319J56j95l78P404J2048Q13K490r723
12016H076J5844J7484m268k0920J3915M43l079k263q425p855j742l699N317N575
12002A4403j1862J319J4731J4477p920j1715P09J5974O908o087o471m890j2234
11989G342j555J2664R021j2848k0587n511O804R880J1826R459N022m433n77J344
11975B7851J1511o488o333J876q599R80k874J696Q96l70j921p750M394N607j2597
$$ plain form
11960 7879 11773 21182 19856 19730 26176 31507 43382 30402 28264 31136 11941 -5322 -1972 12395
11946 12395 7366 10439 1365 -10744 -12485 -924 13007 12851 13776 17427 15236 10856 9146 11027
11932 11027 22855 24352 23684 30976 29990 29460 29796 32918 27959 12503 7664 8566 9734 16824 16823 16443
11916 16443 19381 40430 30388 22213 13506 12468 19618 24509 22488 16746 20886 20761 15239 16954
11902 16954 25055 36112 26579 18496 12926 19066 28151 30417 31539 31146 26108 22749 30821 27177
11888 27177 16209 11709 20674 32526 25427 22651 26500 30253 14318 1038 -2869 7152 18341
11875 18341 13062 16200 28049 32513 24953 34778 48556 31017 15292 7208 13215 26125 26031 24668
11861 24668 37309 34407 23016 8626 10197 9214 23012 34056 28119 22640 23351 20146 11745 19223
$$ packed form
11960G879L894R409j326j26O446N331J1875j2980k138K872j9195j7263L350J4367
11946A2395n029L073r074j2109j741J1561J3931j56R25L651k191m380j710J881
11932A1027J1828J497o68P292r86n30L36L122m959j5456m839R02J168P090jl80
11916A6443K938K1049j0042q175q707j038P150M891k021n742M140j25n522J715
11902A6954Q101J1057r533q083n570O140R085K266J122l93n038l359Q072l644
11888B7177j0968m500Q965J1852p099k776L849L753j5935j3280l907J0021J1189
11875A8341n279L138J1849M464p560R825J3778j7539j5725q084O007J2910r4j363
11861B4668J2641k902j1391j4390J571r83J3798J1044n937n479P11l205q401P478
$$ plain form
11847 19223 25930 39817 26131 6811 4164 12880 20282 12085 3508 12631 29503 33326 30904
11834 30904 29380 24369 14537 4696 -11618 3294 18210 4882 -1938 3330 2896 -2772 -2841 9971
11820 9971 17276 10868 15061 20256 49548 62430 50201 28033 29327 35322 31580 32549 23002 25249
11806 25249 38231 55994 48763 44060 48403 54385 56505 41446 40060 37830 41947 40620 32835 32976
11792 32976 47320 38856 42429 49524 45866 32375 33913 36138 34091 30886 34683 46238 48542 36229
11778 36229 25577 17865 20612 14936 18290 23929 22974 17714 20318 35441 43460 32219 37061 36681
11764 36681 20902 18369 22620 16783 9252 8889 15819 15098 11212 7753 4272 8845 12819 14457 23876
11749 23876 22455 6701 8057 21404 40865 44074 31843 8148 7601 25238 24381 10569 3890
$$ packed form
11847A9223O707J3887j3686j9320k647Q716P402q197q577R123J6872L823k422
11834C0904j524n011r832r841j6314J4912J4916j3328o820N268m34n668o9J2812
11820I971P305o408M193N195K9292J2882j2229k2168J294N995l742R69r547K247
11806B5249J2982J7763p231m703M343N982K120j5059j386k230M117j327p785J41
11792C2976J4344q464L573P095l658j3491J538K225k047l205L797J1555K304j2313
11778C6229j0652p712K747n676L354N639r55n260K604J5123Q019j1241M842l80
11764C6681j5779k533M251n837p531l63O930p21l886l459l481M573L974J638R419
11749B3876j421j5754J356J3347J9461L209j2231k3695n47J7637q57j3812o679
$$ plain form
11736 3890 10828 19409 44287 46126 38354 25943 21108 23267 11437 6180 5096 7484 16506 18625
11722 18625 19877 31239 37210 39191 39277 36006 30661 28857 13132 8679 10115 19925 24933 43126
11708 43126 50972 53576 57306 40715 30477 14309 12187 18959 9217 4335 11177 7512 10366 16058
11694 16058 17682 15823 22818 45289 50339 50714 35860 40719 46806 38821 36655 36376 37446 43998
11680 43998 37168 32747 42068 43879 34533 25574 28655 43820 32229 29333 31512 34081 38450 49705
11666 49705 33783 31693 40953 49373 56454 45907 40585 45634 39753 48521 42981 34360 36747 33085
11652 33085 40715 38725 23557 26589 14958 16072 22936 26426 35778 35590 29050 34301 36478 33963
11638 33963 34312 29674 34227 29147 20362 25679 25286 22220 23274 23379 13576 19223 33427 35675 22348
$$ packed form
11736C890O938Q581K4878J839p772j2411m835K159j1830n257j084K388R022K119
11722A8625J252J1362N971J981Q6l271n345j804j5725m453J436R810N008J8193
11708D3126P846K604L730j6591j0238j6168k122O772r742m882O842l665K854N692
11694A6058J624j859O995K2471N050L75j4854M859O087p985k166k79J070O552
11680D3998o830m421R321J811r346q959L081J5165j1591k896K179K569M369J1255
11666D9705j5922k090R260Q420P081j0547n322N049n881Q768n540q621K387l662
11652C3085P630j990j5168L032j1631J114O864L490R352j88o540N251K177k515
11638C3963L49m638M553n080q785N317l93l066J054J05r803N647J4204K248j3327
$$ plain form
11623 22348 12164 3748 18072 41307 49599 48225 33967 33295 45562 50125 58809 55807 53938
11610 53938 55249 60963 53829 34428 24421 25587 23028 21013 37927 51994 55722 50592 45805
11597 45805 48190 47922 47508 26757 20444 29595 23307 14397 11453 35690 49821 41162 37647 32758
11583 32758 24001 24368 29910 21971 35327 34386 29775 40821 28211 13838 22182 41198 48738 48240
11569 48240 45848 42969 30982 24501 22164 24955 41301 44542 51131 54756 47241 44260 45647 34800
11555 34800 39927 38613 30796 32414 44076 32559 24567 29975 27771 35081 38119 22715 13567 13280
11541 13280 20988 23384 29857 38953 49195 51498 48042 41128 40487 29027 21059 20167 28531 38101
11527 38101 45114 44631 35342 29902 13272 21334 35378 26409 12008 11063 14276 1252 3152 23276
$$ packed form
11623B2348j0184q416J4324K3235Q292j374j4258o72J2267M563Q684l002j869
11610E3938J311N714p134j9401j0007J166k559k015J6914J4067L728n130m787
11597D5805K385k68m14k0751o313R151o288q910k944K4237J4131q659l515m889
11583C2758q757L67N542p939J3356r41m611J1046j2610j4373Q344J9016P540m98
11569D8240k392k879j1987o481k337K791J6346L241O589L625p515k981J387j0847
11555C4800N127j314p817J618J1662j1517p992N408k204P310L038j5404r148k87
11541A3280P708K396O473R096J0242K303l456o914o41j1460p968q92Q364R570
11527C8101P013m83r289n440j6630Q062J4044q969j4401r45L213j3024J900K0124
$$ plain form
11513 23276 20328 25477 27370 20080 21903 23747 27744 28168 29282 35201 47291 54093 52202 39449
11499 39449 28995 27640 47744 50775 45025 35768 27193 27941 31483 37131 40094 33010 23090 23115 26433
11484 26433 33658 42014 25619 21386 39528 39361 45849 32641 30610 32095 47915 41240 33463 26131
11470 26131 29558 30878 48739 61317 63165 54397 44997 50028 44107 44103 47125 43879 38177 35261 43446
11455 43446 48613 49920 45778 41095 42451 42262 43279 43618 50264 51155 41136 28262 20938 15283 16426
11440 16426 35500 49149 45926 37051 48315 45719 35095 32611 39999 50922 58862 48242 51622
11427 51622 47551 32259 31666 31812 37865 38116 20763 32824 53349 63063 57633 59285 50672 45138
11413 45138 34974 27366 37782 35827 42940 50833 48502 44266 40527 47717 44789 39978 37116 35275
$$ packed form
11513B3276k948N149J893p290J823J844L997M24J114N919J2090O802j891j2753
11499C9449j0454j355K0104L031n750r257q575P48L542N648K963p084r920K5L318
11484B6433P225Q356j6395m233J8142j67O488j3208k031J485J5820o675p777p332
11470B6131L427J320J7861J2578J848q768r400N031n921mL022l246n702k916Q185
11455D3446N167J307m142m683J356j89J017L39O646Q91j0019j2874p324n655J143
11440A6426J9074J3649l223q875J1264k596j0624k484P388J0923P940j0620L380
11427E1622m071j5292n93J46O053K51j7353J2061K0525R714n430J652q613n534
11413D5138j0164p608J0416j955P113P893k331m236l739P190k928m811k862j841
$$ plain form
11399 35275 23888 23674 15655 18992 35258 47657 50239 47734 38011 46519 56982 47256 43881 54073
11385 54073 57068 60236 67302 56233 49701 58114 48762 50167 39217 32196 48308 57869 55418 40945
11371 40945 25378 21594 28728 38405 36272 33879 31620 40262 33695 35875 28245 28400 41815 43167
11357 43167 39455 41498 35831 33178 40830 42451 41479 38058 28152 22776 32053 32827 21645 39932
11343 39932 66839 67039 55907 42915 40593 49267 54357 47170 51002 51653 52493 61847 57025 51606
11329 51606 61695 66239 53954 36304 36427 32047 31273 40643 29670 37562 48493 47975 39827 40230
11315 40230 57447 64261 61223 54952 54354 43301 39654 46493 38264 32013 20202 6079 -8652
11302 -8652 8445 24415 40001 50982 51457 44569 35566 32410 34437 35366 37464 39536 47369 34481
$$ packed form
11399C5275j1387k14q019L337J6266J2399K582k505r723Q508J0463r726l375J0192
11385E4073K995L168P066j1069o532Q413r352J405j0950p021J6112R561k451j4473
11371D0945j5567l784P134R677k133k393k259Q642o567K180p630J55J3415J352
11357D3167l712K043n667k653P652J621r72l421r906n376R277P74j1182J8287
11343C9932K6907K00j1132j2992k322Q674N090p187L832O51Q40R354m822n419
11329E1606J0089M544j2285j7650J23m380p74R370j0973P892J0931n18q148M03
11315D0230J7217O814l038o271n98j1053l647O839q229o251j1811j4123j4731
11302h652J7097J5970J5586J0981M75o888r003l156K027R29K098K072P833j2888
$$ plain form
11288 34481 42814 48621 37916 37933 50378 67170 58954 52940 57939 61738 67223 69333 70824 67108
11274 67108 69825 66691 52943 39658 30131 46796 64811 61720 59341 51472 47883 44033 52711
11261 52711 48386 42613 40031 43241 40120 46151 66941 66684 78708 79229 64384 74223 80942 60726
11247 60726 54165 61043 67911 72157 67289 61489 51438 53210 58624 63281 74887 71863 67790 69697
11233 69697 68238 63627 55796 58051 58589 63678 75010 89486 95675 95948 80521 67158 56948 39748
11219 39748 35244 41249 52689 55108 65335 75756 77678 80868 62963 50512 57941 73203 96435
11206 96435 85773 75506 79976 73532 86183 96060 85938 74641 57395 55963 66278 52832
11194 52832 49664 64555 67365 47675 36419 43817 68006 69728 68459 78721 74578 54809 48378
$$ packed form
11288C4481Q333N807j0705J7J2445J6792q216o014M999L799N485K110J491l716
11274F7108K717l134j3748j3285r527J6665J8015l091k379p869l589l850Q678
11261E2711m325n773k582L210l121O031K0790k57J2024N21j4845R839O719k0216
11247F0726o561O878O868M246m868n800j0051J772N414M657J1606l024m073J907
11233F9697j459m611p831K255N38N089J1332J4476O189K73j5427j3363j0210j7200
11219C9748m504O005J1440K419J0227J0421J922L190j7905j2451P429J5262K3232
11206I6435j0662j0267M470o444J2651R877j0122j1297j7246j432J0315j3446
11194E2832l168J4891K810j9690j1256P398K4189J722j269J0262m143j9769o431
$$ plain form
11181 48378 58040 66228 56021 58070 62497 59965 57390 59854 60565 65650 65015 53308 41766 49560
11167 49560 53207 47205 36471 45209 57023 63508 74784 88039 94063 107609 105229 89780 79646
11154 79646 79926 85027 90704 78336 72153 71086 74607 70920 59737 66138 75656 70409 61664 58526
11140 58526 67540 70737 56145 46898 52827 68348 93725 91702 76531 92604 93894 85995 93540
11127 93540 89478 82526 75598 71911 64370 62751 59001 51165 57950 63478 72422 77080 74512 64616
11113 64616 63525 54802 57565 72705 82028 74051 64227 59003 64882 86558 102452 101024 90487
11100 90487 76606 81309 85741 77370 75218 59565 61472 67915 69373 80249 84301 80846 84360 76698
11086 76698 70713 81115 75121 71024 80731 89093 91695 91772 83953 79662 74060 70852 80169 87693 99996
$$ packed form
11181D8378R662Q188j0207K049M427k532k575K464P11N085o35j1707j1542P794
11167D9560L647o002j0734Q738J1814O485J1276J3255O024J3546k380j5449j0134
11154G9646K80N101N677j2368o183j067L521l687j1183O401R518n247q745l138
11140E8526R014L197j4592r247N929J5521K5377k023j5171J6073J290p899P545
11127I3540m062o952o928l687p541j619l750p836O785N528Q944M658k568r896
11113F4616j091q723K763J5140R323p977r824n224N879K1676J5894j428j0537
11100I0487j3881M703M432q371k152j5653J907O443J458J0876M052l455L514p662
11086G6698n985J0402n994m097R707Q362K602P7p819m291n602l208R317P524J2303
$$ plain form
11071 99996 96122 80551 77815 75216 70547 73516 80977 86022 80397 71134 69281 71180 77455 70098
11057 70098 71873 79455 88792 92185 99313 88702 72821 70330 78045 90685 96372 102237 96687 86891
11043 86891 89039 96247 98968 88835 89554 98912 95568 93913 94552 82109 82239 84666 89589 103176
11029 103176 105606 98626 97181 101125 99142 101821 96530 92772 90208 91521 103671 126089 139742
11016 139742 140562 147729 146359 133778 121886 96977 78744 79901 86923 100177 107420 104264 96143
11003 96143 80328 74136 78868 85543 90534 91398 99960 90149 88305 95332 81389 70925 72658 79711
10989 79711 81956 93275 92150 78325 83995 93589 102682 117120 127324 129445 125811 123142 117380
10976 117380 128863 133338 130729 138281 163551 185182 194763 196335 199301 213462 225470 226999 243636
$$ packed form
11071I9996l874j5571k736k599m669K969P461N045n625r263j853J899O275p357
11057G0098J775P582R337L393P128j0611j5881k491P715J2640N687N865n550r796
11043H6891K148P208K721j0133P19R358l344j655O39j2443J30K427M923J3587
11029A03176K430o980j445L944j983K679n291l758k564J313J2150K2418J3653
11016A39742Q20P167j370j2581j1892k4909j8233J157P022J3254P243l156q121
11003I6143j5815o192M732O675M991Q64Q562r811j844P027j3943j0464J733P053
10989G9711K245J1319j125j3825N670R594R093J4438J0204K121l634k669n762
10976A17380J1483M475k609P552K5270K1631R581J572K966J4161J2008J529J6637
$$ plain form
10963 243636 275393 312897 357286 412001 478981 565791 682721 846362 1106131 1521819 2082136
10952 2082136 2619113 2798492 2595598 2221334 1778833 1350271 1014895 769713 609223
10943 609223 491846 418092 371857 323548 287683 258472 236432 224188 219421 212610 199282 192762
10931 192762 191300 184851 186356 184109 168548 164607 163109 172257 167967 159889 155395 153262 160635 157097
10917 157097 154867 150509 156857 150055 126267 98552 91427 110732 133968 137628 136555 137036 141207
10904 141207 153953 149226 125124 119631 128094 119928 116798 134148 136814 137966 136729 136560 132427 135848
10890 135848 132004 130478 135759 118964 107617 112667 122162 131541 131704 131388 128280 132636 144779 125755
10876 125755 124215 129530 137207 128216 142361 149874 156423 164066 161380 154607 146414 132725 132397 129744
$$ packed form
10963B43636L1757L7504M4389N4715O6980Q6810J16930J63641K59769M15688N60317
10952B082136N36977J79379k02894l74264m42501m28562l35376k45182j60490
10943F09223j17377p3754m6235m8309l5865k9211k2040j2244m767o811j3328o520
10931A92762j462o449J505k247j5561l941j498R148m290q078m494k133P373l538
10917A57097k230m358O348o802k3788k7715p125J9305K3236L660j073M81M171
10904A41207J2746m727k4102n493Q463q166l130J7350K666J152j237j69m133L421
10890A35848l844j526N281j6795j1347N050R495R379J63l16l108M356J2143j9024
10876A25755j540N315P677q991J4145P513O549P643k686o773q193j3689l28k653
$$ plain form
10862 129744 124699 119162 109361 105080 84259 63963 48569 44876 69522 121499 185969 231111
10850 231111 265198 258031 241040 230971 203631 183366 173319 168457 178798 179336 175205 171131 174288
10837 174288 164926 158197 162898 173957 188639 197747 197835 184690 180952 193199 194309 192387 197409 187150
10823 187150 180303 184555 183192 178233 168312 173655 174703 169920 175818 180839 185823 197076 217059 209228
10809 209228 198167 209971 251756 286223 298363 311199 350026 383737 397752 401704 422402 444830
10797 444830 439014 428098 403429 365086 339079 301631 257488 218885 203365 199278 188726 172610
10785 172610 173700 175480 180583 196313 199283 194919 179957 177473 175051 162574 156210 146082 151191
10772 151191 156014 162585 167657 174993 186299 208426 201764 201815 205240 210042 204206 202031 190560 181400
$$ packed form
10862A29744n045n537r801m281k0821k0296j5394l693K4646N1977O4470M5142
10850B31111L4087p167j6991j0069k7340k0265j0047m862J0341N38m131m074L157
10837A74288r362o729M701J1059J4682R108Q8j3145l738J2247J110j922N022j0259
10823A87150o847M252j363m959r921N343J048m783N898N021M984J1253J9983p831
10809B09228j1061J1804M1785L4467J2140J2836L8827L3711J4015L952K0698K2428
10797D44830n816j0916k4669l8343k6007l7448m4143l8603j5520m087j0552j6116
10785A72610J090J780N103J5730K970m364j4962k484k422j2477o364j0128N109
10772A51191M823O571N072P336J1306K2127o662N1L425M802n836k175j1471r160
$$ plain form
10758 181400 177734 182293 192118 199106 211056 227665 227479 238063 255845 247365 239982 242671 254549
10745 254549 258462 256141 260904 262143 260943 239845 232439 190395 166108 150552 139031 165523 192276
10732 192276 226721 258736 271653 256864 238014 237051 254254 269612 284794 291520 301482 296315
10720 296315 289287 292557 303014 292210 278910 270484 268316 263622 249113 251357 268797 289083 292831
10707 292831 302782 319462 334217 343836 361804 381681 396291 409156 410218 410696 416965 434700 447864
10694 447864 451522 470700 476506 469720 455276 449330 460709 454242 450220 446259 436797 412933 401187
10681 401187 402461 406323 411372 427148 444022 450267 461776 490786 527358 583544 646127 700870
10669 700870 701521 676789 634845 604814 572774 534452 523993 525624 526507 523051 512277 500400 497355
$$ packed form
10758A81400l666M559R825O988J1950J6609j86J0584J7782q480p383K689J1878
10745B54549L913k321M763J239j200k1098p406m2044k4287j5556j1521K6492K6753
10732A92276L4445L2015J2917j4789j8850r63J7203J5358J5182O726R962n167
10720B96315p028L270J0457j0804j3300q426k168m694j4509K244J7440K0286L748
10707B92831R951J6680J4755R619J7968J9877J4610J2865J062M78O269J7735J3164
10694D47864L658J9178N806o786j4444n946J1379o467m022l961r462k3864j1746
10681D01187J274L862N049J5776J6874O245J1509K9010L6572N6186O2583N4743
10669G00870O51k4732m1944l0031l2040l8322j0459J631Q83l456j0774j1877l045
$$ plain form
10656 497355 505996 512449 517281 535669 540160 548987 565165 578035 589418 606811 620156 627496 633431
10643 633431 645718 661536 683449 697599 728506 755729 768058 788967 790978 788781 791367 796561
10631 796561 814020 821993 829453 849167 861575 879971 907769 928584 951240 977844 997775 1017506
10619 1017506 1044173 1105078 1163814 1207096 1246939 1271583 1289318 1308768 1319861 1352163 1389378
10608 1389378 1430749 1476423 1526850 1571615 1615452 1652340 1677357 1729302 1803203 1877671 1927985
10597 1927985 1971418 2015571 2079612 2150773 2238042 2334769 2454235 2567520 2684159 2796432
10587 2796432 2904951 2984353 3071652 3166904 3303957 3459581 3631253 3836825 4087379 4376877
10577 4376877 4703187 5050724 5444676 5848754 6268914 6759975 7335176 8089956 9102250
$$ packed form
10656D97355Q641O453M832J8388M491Q827J6178J2870J1383J7393J3345P340N935
10643F33431J2287J5818K1913J4150L0907K7223J2329K0909K011k197K586N194
10631G96561J7459P973P460J9714J2408J8396K7798K0815K2656K6604J9931J9731
10619A017506K6667O0905N8736M3282L9843K4644J7735J9450J1093L2302L7215
10608A389378M1371M5674N0427M4765M3837L6888K5017N1945P3901P4468N0314
10597A927985M3433M4153O4041P1161Q7269R6727J19466J13285J16639J12273
10587B796432J08519P9402Q7299R5252J37053J55624J71672K05572K50554K89498
10577D376877L26310L47537L93952M04078M20160M91061N75201P54780J012294
$$ plain form
10568 9102250 10369688 11791554 12992756 13922913 14903541 16061187 17431635 19124070
10560 19124070 21223282 23926695 27503461 32281063 38524946 46385860 56012252 67497338
10552 67497338 81865088 101712327 131348066 178516628 255322200 372038260 498790876
10545 498790876 534193469 477617145 405419216 321207809 232339994 163567389 119226964
10538 119226964 91691561 73722242 60820586 51151988 43622299 37414632 32197817
10531 32197817 27946998 24469577 21615432 19330661 17554493 16244811 15367283 14784659
10523 14784659 14108299 13074102 11870264 10629666 9400144 8315891 7438533 6741104
10515 6741104 6152674 5644727 5216414 4868793 4560592 4256007 3964838 3700339 3428464
$$ packed form
10568I102250J267438J421866J201202R30157R80628J157646J370448J692435
10560A9124070K099212K703413L576766M777602O243883P860914R626392J1485086
10552F7497338J4367750J9847239K9635739M7168562P6805572J16716060J26752616
10545D98790876L5402593n6576324p2197929q4211407q8867815o8772605m4340425
10538A19226964k7535403j7969319j2901656r668598p529689o207667n216815
10531C2197817m250819l477421k854145k284771j776168j309682q77528n82624
10523A4784659o76360j034197j203838j240598j229522j084253q77358o97429
10515F741104n88430n07947m28313l47621l08201l04585k91169k64499k71875
$$ plain form
10506 3428464 3162869 2926965 2712754 2525821 2360486 2200126 2045123 1923624 1825868 1749373
10496 1749373 1662611 1568900 1473388 1373130 1287581 1218338 1170461 1113082 1050347 995200 950738
10485 950738 904725 858537 816995 788450 740484 703345 665277 645009 599414 539139 488977
10474 488977 469217 475130 476001 472935 473198 458431 432118 417816 407060 404517 414685 412890 394696
10461 394696 368308 340021 338912 337704 312581 303531 291668 270747 260273 258593 260161 252333 241973
10448 241973 239705 232669 233577 245994 245661 229333 215648 219886 221505 204541 206137 212732 227541
10435 227541 238576 245718 241096 232466 218673 208244 191852 178924 164530 143614 144064 157338
10423 157338 152500 149575 177909 202097 228892 247082 248539 236818 227687 202837 174990 173265
$$ packed form
10506C428464k65595k35904k14211j86933j65335j60360j55003j21499r7756p6495
10496A749373q6762r3711r5512j00258q5549o9243m7877n7379o2735n5147m4462
10485I50738m6013m6188m1542k8545m7966l7139l8068k0268m5595o0275n0162
10474D88977j9760N913Q71l066K63j4767k6313j4302j0756k543J0168j795j8194
10461C94696k6388k8287j109j208k5123r050j1863k0921j0474j680J568p828j0360
10448B41973k268p036R08J2417l33j6328j3685M238J619j6964J596O595J4809
10435B27541J1035P142m622q630j3793j0429j6392j2928j4394k0916M50J3274
10423A57338m838k925K8334K4188K6795J8190J457j1721r131k4850k7847j725
$$ plain form
10411 173265 175936 160099 138711 118905 104705 89413 75388 59156 56791 67189 49216 32476
10399 32476 9960 -9818 -19982 -30982 -17453 992 -2162 -14125 -12784 1159 24876 28171
10387 28171 32805 32827 28235 28934 35879 40112 42981 60658 68849 63122 54629 51116 47296 41379 43714
10372 43714 40286 34162 39851 39880 31554 24305 29434 36558 51504 64381 75758 73279 69351 62879
10358 62879 48049 72257 113340 161524 159450 116526 67822 43912 36508 19975 21197 48386
10346 48386 60871 55666 41184 30047 28253 13535 14838 22000 20863 17241 28882 46692 47386
10333 47386 36729 39598 47453 43742 32558 33789 24099 14337 10036 10356 15186 12251 14741 5637
10319 5637 5940 18237 32078 40283 54525 54120 33910 30911 46739 45197 36900 26257 27444 35745
$$ packed form
10411A73265K671j5837k1388j9806j4200j5292j4025j6232k365J0398j7973j6740
10399C2476k2516j9778j0164j1000J3529J8445l154j1963J341J3943K3717L295
10387B8171M634K2m592O99O945M233K869J7677Q191n727q493l513l820n917K335
10372D3714l428o124N689K9q326p249N129P124J4946J2877J1377k479l928o472
10358F2879j4830K4208M1083M8184k074m2924m8704k3910p404j6533J222K7189
10346D8386J2485n205j4482j1137j794j4718J303P162j137l622J1641J7810O94
10333D7386j0657K869P855l711j1184J231r690r762m301L20M830k935K490r104
10319E637L03J2297J3841Q205J4242m05k0210k999J5828j542q297j0643J187Q301
$$ plain form
10305 35745 33850 21987 26675 27873 33041 46236 36946 32191 8899 -7752 -3041 24583 45719
10292 45719 29087 14721 25241 24193 15692 14191 3974 -4801 -19593 -13533 -9172 -1685 3014
10279 3014 13517 20521 20842 17325 -1647 -10601 -10450 -927 -2822 -7055 -20123 -27031 -19059 -23135
10265 -23135 -35663 -47387 -34436 -16642 -28075 -24631 -36283 -39209 -28543 -20322 5910 17032
10253 17032 6805 -12922 -16685 -13167 -16279 -22325 -22142 -38657 -43598 -41767 -39309 -60690 -81424
10240 -81424 -90555 -87108 -40153 11756 30812 46368 64724 81744 84699 49213 41922 35175 25291
10227 25291 13163 15693 11353 5577 -16249 -29045 -21857 -16103 -16598 -21216 -24840 -24931 -17285 -3154
10213 -3154 830 -6309 -6932 -5958 -12981 2810 1495 -5228 -9205 1991 6395 5012 10455 17594 18455
$$ packed form
10305C5745j895j1863M688J198N168J3195r290m755k3292j6651M711K7624K1136
10292D5719j6632j4366J0520j048q501j501j0217q775j4792O060M361P487M699
10279C014J0503P004L21l517j8972q954J51R523j895m233j3068o908P972m076
10265b3135j2528j1724J2951J7794j1433L444j1652k926J0666Q221K6232J1122
10253A7032j0227j9727l763L518l112o046J83j6515m941J831K458k1381k0734
10240h1424r131L447M6955N1909J9056J5556J8356J7020K955l5486p291o747r884
10227B5291j2128K530m340n776k1826j2796P188N754m95m618l624r1P646J4131
10213c154L984p139o23R74p023J5791j315o723l977J1196M404j383N443P139Q61
$$ plain form
10198 18455 2180 286 7425 7542 5744 -2043 -11094 -6937 -5963 -5014 -6509 -7455 1495 -7634 -15172
10183 -15172 -11814 -3698 4738 6994 -2115 -9171 -8689 7150 14550 9522 5377 2770 -13982 -16336
10169 -16336 -1200 13477 19617 26020 33101 39325 35050 39625 36055 35000 44484 53484 79295 71204
10155 71204 71898 75456 93516 115741 134109 143860 150441 166965 184834 191106 202135 238094 292992
10142 292992 358188 432487 515988 630665 821910 1110306 1552751 2149226 2629464 2678932
10132 2678932 2394917 2014812 1580110 1164515 841513 632239 493331 382355 304270 259377
10122 259377 218911 179939 148975 135201 120574 118841 106557 88948 85612 88774 88307 74964
10110 74964 47868 43775 41647 38647 37565 45476 52088 46779 42396 44227 29455 21029 20971 15801
$$ packed form
10198A8455j6275j894P139J17j798p787r051M157R74R49j495r46Q950r129p538
10183a5172L358Q116Q436K256r109p056M82J5839P400n028m145k607j6752k354
10169a6336J5136J4677O140O403P081O224m275M575l570j055R484R000K5811q091
10155G1204O94L558J8060K2225J8368R751O581J6524J7869O272J1029L5959N4898
10142B92992O5196P4299Q3501J14677J91245K88396M42445N96475M80238M9468
10132B678932k84015l80105m34702m15595l23002k09274j38908j10976p8085m4893
10122B59377m0466l8972l0964j3774j4627j733j2284j7609l336L162m67j3343
10110G4964k7096m093k128l000j082P911O612n309m383J831j4772q426n8n170
$$ plain form
10096 15801 3812 -4406 -366 6125 597 -1498 295 -4106 -1373 2781 -5331 -1535 6358 4756
10082 4756 -12468 -18668 -10592 -22892 -43269 -53235 -63392 -78858 -75374 -59839 -43023 -27368 -18352
10069 -18352 -9955 -12604 -14911 -30566 -22495 -25707 -24516 -16324 -16898 -25277 -15575 -7133 -3874 -10894
10055 -10894 -19368 -18521 -23191 -19878 -18672 -29869 -28081 -37672 -32722 -24461 -8410 -1687 -1270 -629 3845
10040 3845 -4675 -5827 -4470 -5958 -9836 1740 5747 -5645 -2868 1043 -6492 -13978 -18574 -9783
10026 -9783 3338 542 -9118 -4358 -7109 1742 3903 8799 -4348 -20277 -19393 -12089 -4985 -1359
10012 -1359 -9900 4587 18145 15628 8146 -3722 -11942 -15238 -12616 -8290 887 7972 3428 -11711
9998 -11711 -5965 -2170 -1079 -5827 -185 3206 -17067 -21074 -25580 -32089 -32146 -28917 -20364 -12608 -12592
$$ packed form
10096A5801j1989q218M040O491n528k095J793m401K733M154q112L796P893j602
10082D756j7224o200Q076j2300k0377r966j0157j5466L484J5535J6816J5655R016
10069a8352Q397k649k307j5655Q071l212J191Q192n74q379R702Q442L259p020
10055a0894q474Q47m670L313J206j1197J788r591M950Q261J6051O723M17O41M474
10040C845q520j152J357j488l878J1576M007j1392K777L911p535p486m596Q791
10026i783J3121k796r660M760k751Q851K161M896j3147j5929Q84P304P104L626
10012a359q541J4487J3558k517p482j1868q220l296K622M326R177P085m544j5139
9998a1711N746L795J091m748N642L391k0273m007m506o509n7L229Q553P756J6
$$ plain form
9983 -12592 -25887 -20002 -12622 -14251 -24125 -17867 4646 8101 -5440 -17405 -22306 -31798 -32471 -22545
9969 -22545 -19687 -14633 -8635 -15966 -20831 -26351 -29359 -27934 -26174 -28287 -21957 -22028 -21142 -14057 -10697
9954 -10697 -12746 -18189 -26506 -10511 -9029 -18609 -11817 3809 11468 9353 1826 -1018 -378 1231
9940 1231 8632 18363 30329 34028 45020 71149 94256 91546 91680 84122 78750 71667 63081 27663
9926 27663 8612 13691 26272 23812 11453 22468 22516 13051 9904 8889 19175 27625 28036 26578
9912 26578 6287 -6141 9743 18791 13990 -3948 -8852 -10370 -8444 841 10209 11080 -2893 -7111
9898 -7111 -5685 -13420 -12840 -14553 -18134 -24100 -23065 -19172 -8141 -7694 -16336 -19549 -14373 -13244 -926
9883 -926 5155 -3043 6917 -2294 -5194 -18752 -26615 -17551 -10502 -11966 -18024 -13804 -8332 -8182 3304
$$ packed form
9983a2592j3295N885P380j629r874O258K2513L455j3541j1965m901r492o73R926
9969b2545K858N054N998p331m865n520l008J425J760k113O330p1Q86P085L360
9954a0697k049n443q317J5995J482r580O792J5626P659k115p527k844O40J609
9940A231P401R731J1966L699J0992K6129K3107k710J34p558n372p083q586l5418
9926B7663j9051N079J2581k460j2359J1015M8r465l147j015J0286Q450M11j458
9912B6578k0291j2428J5884R048m801j7938m904j518J926R285R368Q71j3973m218
9898g111J426p735N80j713l581n966J035L893J1031M47q642l213N176J129J2318
9883i26O081q198R960r211k900j3558p863R064P049j464o058M220N472J50J1486
$$ plain form
9868 3304 8866 3866 7155 6004 12529 9864 -8131 -17077 -19652 -16445 -5686 -8150 -5681 -5700 5373
9853 5373 4130 9256 10299 -6760 -11716 -7936 -11976 -3373 -6889 -1658 10471 -470 -16375 -184
9839 -184 14719 8107 10156 7639 4940 20629 24587 12222 12019 3163 1918 -12275 -20746 -23792
9825 -23792 -15356 -7154 -5115 -12842 -22839 -19977 -2200 2334 -6664 -17710 -18364 -20721 -21968 -10373
9811 -10373 -6072 -1783 -5320 -18640 -22459 -29476 -28347 -29982 -33093 -29300 -23135 -13652 -8090 -25247
9797 -25247 -26561 -22946 -23419 -21762 579 -3867 -24042 -28855 -4254 3644 -5713 1551 1144 857 7452
9782 7452 12114 18846 11767 6834 10902 12313 18833 23650 41918 44436 50327 46376 22622 12281
9768 12281 5135 -12461 -16689 -9816 10854 28020 19340 -4141 -14790 -10935 -8073 -402 11679
$$ packed form
9868C304N562n000L289j151O525k665j7995q946k575L207J0759k464K469j9J1073
9853E373j243N126J043j7059m956L780m040Q603l516N231J2129j0941j5905J6191
9839a84J4903o612K049k517k699J5689L958j2365k03q856j245j4193q471l046
9825b3792Q436Q202K039p727r997K862J7777M534q998j1046o54k357j247J1595
9811a0373M301M289l537j3320l819p017J129j635l111L793O165R483N562j7157
9797b5247j314L615m73J657K2341m446k0175m813K4601P898r357P264m07k87O595
9782G452M662O732p079m933M068J411O520M817J8268K518N891l951k3754j0341
9768A2281p146j7596m228O873K0670J7166q680k3481j0649L855K862P671J2081
$$ plain form
9755 11679 14638 13040 4897 -13245 -8483 -5310 -12137 -24522 -28084 -23017 -17678 -19581 -17899 -10983
9741 -10983 -6530 -3085 -17415 -15325 -6133 -1718 -9402 -12155 -17138 -11516 -4821 -2233 -3225 535 -4058
9726 -4058 -5226 -5977 6128 12409 4284 -6539 -13810 -6837 -13655 -14442 -6782 -11458 -6751 -3998 -14696
9711 -14696 -4193 11656 -8571 -16520 -15808 -14012 -16323 -19749 -15673 -11481 -6765 -472 -7558 2545
9697 2545 4426 12050 7844 1431 -1161 3427 1815 6108 5690 3931 -2633 -3269 5986 10709 9680
9682 9680 8353 11218 2893 -2544 4553 4237 -2051 3670 12212 11303 11296 -5362 -4350 -21040 -21562 -8986
9666 -8986 -17734 -16171 -11833 -14976 -12197 -1014 -5680 -13110 -14635 -27303 -35476 -33792 -25661 -20920
9652 -20920 -17687 -2634 9027 10839 8366 8097 17260 19961 9127 1872 -282 4875 -3640 -9911
$$ packed form
9755A1679K959j598q143j8142M762L173o827j2385l562N067N339j903J682O916
9741a0983M453L445j4330K090R192M415p684k753m983N622O695K588r92L760m593
9726d058j168p51J2105O281q125j0823p271O973o818p87P660m676M707K753j0698
9711a4696J0503J5849k0227p949P12J796k311l426M076M192M716O293p086J0103
9697B545J881P624m206o413k592M588j612M293m18j759o564o36R255M723j029
9682I680j327K865q325n437P097l16o288N721Q542r09pj6658J012j6690n22J2576
9666h986q748J563M338l143K779J1183m666p430j525j2668q173J684Q131M741
9652b0920L233J5053J1661J812k473k69R163K701j0834p255k154N157q515o271
$$ plain form
9638 -9911 -13679 -20159 -12719 -1473 -1256 -6062 -8150 -7309 -4537 9614 2896 -16985 -9581 7515
9624 7515 24850 14409 3958 8339 -6893 -14663 -6128 11021 -370 8645 9311 -7187 -2913
9611 -2913 4604 23700 27989 14359 11296 17225 12478 17256 13750 9815 4453 -631 -6423 -10577
9597 -10577 -14549 -19604 -3122 522 -9386 -8993 -6518 -6702 5838 -6523 -16277 -15247 -15967 -3614
9583 -3614 -2376 -10411 -8721 -1072 2487 432 1 1668 2684 -776 1430 -2517 -13113 -6679 17904
9568 17904 26859 30442 23667 16838 8047 4455 4117 -1440 -2774 1090 4199 -4768 -5265 -10521 -17208
9553 -17208 -13942 -11079 -9892 6025 9627 4723 -126 7047 10758 5517 9978 3725 4028 7462 7978
9538 7978 2759 -1322 3252 17661 14277 -8225 -3657 -1732 -1621 11971 11290 12751 3719 -7368
$$ packed form
9638i911l768o480P440J1246K17m806k088Q41K772J4151o718j9881P404J7096
9624G515J7335j0441j0451M381j5232p770Q535J7149j1391R015O66j6498M274
9611b913P517J9096M289j3630l063N929m747M778l506l935n362n084n792m154
9597a0577l972n055J6482L644r908L93K475j84J2540j2361r754J030p20J2353
9583c614J238q035J690P649L559k055m31J667J016l460K206l947j0596O434K4583
9568A7904Q955L583o775o829q791l592l38n557j334L864L109q967m97n256o687
9553a7208L266K863J187J5917L602m904m849P173L711n241M461o253L03L434N16
9538G978n219m081M574J4409l384k2502M568J925J11J3592o81J461r032j1087
$$ plain form
9524 -7368 -4894 -3800 -7089 -8161 -2828 -6378 -10158 -16924 -19663 -16047 -9028 -6368 3876 9078 -1907
9509 -1907 -4050 -6521 540 1188 -12431 -25338 -31658 -25739 -6223 -2218 2564 3262 2336 -7784 3408
9494 3408 -2108 -18491 -18691 158 3518 1312 -8362 -30535 -27852 -27320 -20949 -17274 -4006 -1037
9480 -1037 -4350 -776 -7538 -6176 -14165 8439 33479 27860 17011 17068 20786 10246 8213 7691 16155
9465 16155 21171 16970 -2475 -5826 14838 24642 14211 1932 9789 9898 8575 18438 7736 1113
9451 1113 -11537 -20046 -20035 -8045 -4470 8577 17127 14336 21827 23276 10572 -4058 -16186 -8077
9437 -8077 -677 -3760 3178 5114 -315 -6380 -1352 -8043 -11691 -7767 3627 4943 3484 9555 12092
9422 12092 14325 14273 12093 24340 35675 31104 20128 13693 19302 26289 20552 19137 24542 30008
$$ packed form
9524g368K474J094l289j072N333l550l780o766k739L616P019K660J0244N202j0985
9509a907k143k471P061O48j3619j2907o320N919J9516M005M782O98r26j0120J1192
9494C408n516j6383k00J8849L360k206r674k2173K683N32O371L675J3268K969
9480a037l313L574o762J362p989K2604K5040n619j0849N7L718j0540k033n22Q464
9465A6155N016m201j9445l351K0664R804j0431j2279P857J09j323R863j0702o623
9451A113j2650q509J1J1990L575J3047Q550k791P491J449j2704j4630j2128Q109
9437h077P400l083O938J936n429o065N028o691l648L924J1394J316j459O071K537
9422A2092K233n2k180J2247J1335m571j0976o435N609O987n737j415N405N466
$$ plain form
9408 30008 12803 -4174 -2225 -2572 948 5290 3019 1410 7394 17143 16357 2746 -11090 -15250
9394 -15250 -2515 682 -4689 -7021 -597 4099 -9379 -6801 3424 5005 2146 -4181 -14193 -33536
9380 -33536 -22597 5364 -1195 -2204 1556 -5080 172 3427 9991 5839 9968 7725 3580 -3495
9366 -3495 9548 21821 17747 9573 -2156 10501 20186 11314 15660 25665 23515 24328 21844 17964
9352 17964 7638 -7720 -11235 -5939 4126 9652 13085 16865 15013 15679 11578 8981 11824 6492
9338 6492 -1496 -8833 -12378 3164 6963 -2093 6772 178 13392 20878 34994 36304 33228 27090
9324 27090 20184 25166 28839 14362 8795 15346 29216 36429 8415 2991 4821 -4108 -14034 -10843
9310 -10843 -7496 6056 2957 -14428 -10453 815 -7247 -5572 4840 18644 20591 31637 27684
$$ packed form
9408C0008j7205j6977J949l47L520M342k271j609N984R749p86j3611j3836m160
9394a5250J2735L197n371k332O424M696j3478K578J0225J581k859o327j0012j9343
9380c3536J0939K7961o559j009L760o636N252L255O564m152M129k243m145p075
9366c495J3043J2273m074q174j1729J2657R685q872M346J0005k150Q13k484l880
9352A7964j0326j5358l515N296J0065N526L433L780j852O66m101k597K843n332
9338F492p988p337l545J5542L799r056Q865o594J3214P486J4116J310l076o138
9324B7090o906M982L673j4477n567O551J3870P213k8014n424J830q929r926L191
9310a0843L347J3552l099j7385L975J1268q062J675J0412J3804J947J1046l953
$$ plain form
9297 27684 3442 1601 6108 19605 16408 -116 3018 11566 6190 1794 6322 2227 -3517 8852
9283 8852 22817 18301 11164 8929 -4462 -4898 2645 2962 6360 5143 9638 16164 14119 18348 24669
9268 24669 19810 27938 41260 51280 41984 22590 7365 3480 6358 22466 29872 38238 46310
9255 46310 49273 48130 23424 14737 13130 18008 12378 3107 -2179 2254 15698 17384 14734 13725
9241 13725 9713 16854 -2798 -3267 15647 29285 25593 27809 26003 20549 20294 28599 25300 12245
9227 12245 11200 15271 18143 17855 13903 11569 8030 8175 17855 21350 27132 24992 14608 14630 24352
9212 24352 37357 42952 44047 33790 33371 47100 47365 35893 46937 68999 100758 144655 218303
9199 218303 304400 356078 361181 324176 264805 193566 154697 131310 107697 82987 64875 54654
$$ packed form
9297B7684k4242j841M507J3497l197j6524L134Q548n376m396M528m095n744J2369
9283H852J3965m516p137k235j3391m36P543L17L398j217M495O526k045M229O321
9268B4669m859Q128J3322J0020r296j9394j5225l885K878J6108P406Q366Q072
9255D6310K963j143k4706q687j607M878n630r271n286M433J3444J686k650j009
9241A3725m012P141j9652m69J8914J3638l692K216j806n454k55Q305l299j3055
9227A2245j045M071K872k88l952k334l539J45R680L495N782k140j0384K2R722
9212B4352J3005N595J095j0257m19J3729K65j1472J1044K2062L1759M3897P3648
9199B18303Q6097N1678N103l7005n9371p1239l8869k3387k3613k4710j8112j0221
$$ plain form
9187 54654 57709 57207 51997 53961 61213 64903 49384 39833 41641 47460 50031 42142 32134 31761 37392
9172 37392 38264 39045 47975 61577 58383 48871 63587 75769 81566 80184 88182 100987 128257 150072
9158 150072 182015 234205 310562 437577 613528 737117 736476 648270 538206 414881 295148
9147 295148 224192 184525 142235 113463 92143 77941 60078 46259 52891 47033 47427 40707 40032
9134 40032 26670 21677 35627 51182 59141 50219 41787 44332 50999 52981 69663 73482 73605 62172
9120 62172 48368 44376 38450 31851 46633 86457 106552 108751 115941 166186 224973 278350 337594
9107 337594 356742 330090 286056 232392 175495 125508 103902 90786 82337 72449 59053 47940
9095 47940 43379 46070 30755 39855 38146 33648 28080 34641 38149 48074 41742 40389 33552 44345
$$ packed form
9187E4654L055n02n210J964P252L690j5519r551J808N819K571p889j0008l73N631
9172C7392Q72P81Q930J3602l194r512J4716J2182N797j382P998J2805K7270K1815
9158A50072L1943N2190P6357J27015J75951J23589o41q8206j10064j23325j19733
9147B95148p0956l9667m2290k8772k1320j4202j7863j3819O632n858L94o720o75
9134D0032j3362m993J3950J5555P959q922q432K545O667J982J6682L819J23j1433
9120F2172j3804l992n926o599J4782L9824K0095K199P190N0245N8787N3377N9244
9107C37594J9148k6652m4034n3664n6897m9987k1606j3116q449r888j3396j1113
9095D7940m561K691j5315R100j709m498n568O561L508R925o332j353o837J0793
$$ plain form
9081 44345 47423 46274 38319 36627 44889 43721 31727 41809 50131 51681 46200 44327 32380 38538
9067 38538 24006 14077 7752 -12582 -14880 7199 26051 46582 78934 79738 75294 95609 91275
9054 91275 88648 82777 79131 78006 73256 65780 56605 56707 50566 48826 63005 75588 74880 70907 67272
9039 67272 71183 74736 72591 58592 44715 39460 44247 44561 40613 31046 30618 42777 53540 43211
9025 43211 45312 56500 50569 39760 38470 43472 39131 37531 46863 73068 99477 106705 86101
9012 86101 85868 107409 112755 107490 111580 119973 128564 116274 93319 87312 89800 90958 77946 65879
8998 65879 55015 58492 57760 54697 43177 42071 42364 52048 52277 30488 31764 41378 41716 40843 41288
8983 41288 50609 67021 72732 66298 65190 77206 70046 66178 84656 92826 94576 98222 101310 92731
$$ packed form
9081D4345L078j149p955j692Q262j168j1994J0082Q322J550n481j873j1947O158
9067C8538j4532r929o325k0334k298K2079J8852K0531L2352Q04m444K0315m334
9054I1275k627n871l646j125m750p476r175J02o141j740J4179J2583p08l973l635
9039F7272L911L553k145j3999j3877n255M787L14l948r567m28J2159J0763j0329
9025D3211K101J1188n931j0809j290N002m341j600R332K6205K6409P228k0604
9012H6101k33K1541N346n265M090Q393Q591j2290k2955o007K488J158j3012j2067
8998F5879j0864L477p32l063j1520j106K93R684K29k1789J276R614L38q73M45
8983D1288R321J6412N711o434j108J2016p160l868J8478Q170J750L646L088q579
$$ plain form
8969 92731 86233 67842 64485 59832 67573 75034 82265 87593 96811 85648 95015 102622 91576 75754
8955 75754 69941 76526 84851 88362 94992 83817 72014 74898 73174 70733 67398 60169 55325 69779
8941 69779 75264 79113 90782 81889 80435 69964 68917 77046 94558 104307 101148 114954 115827 105962
8927 105962 106241 116217 122496 130046 126543 124377 114625 111657 109788 118295 124701 114890 107301 94719
8913 94719 101417 114096 109495 126996 140070 129850 128895 128284 127560 124812 131330 142701 137161 131606
8899 131606 132519 135808 133292 127733 133144 123338 123396 130906 136728 153381 152856 140936 137763 143369 151525
8884 151525 151747 144081 155372 171919 201859 223396 225136 227147 221321 219755 217258 213826 203917 200969
8870 200969 197338 202844 211112 209247 209252 216940 232497 242145 255679 270900 272122 278795 289963 294653
$$ packed form
8969I2731o498j8391l357m653P741P461P231N328R218j1163R367P607j1046j5822
8955G5754n813O585Q325L511O630j1175j1803K884j724k441l335p229m844J4454
8941F9779N485L849J1669q893j454j0471j047Q129J7512R749l159J3806Q73r865
8927A05962K79R976O279P550l503k166r752k968j869Q507O406r811p589j2582
8913I4719O698J2679m601J7501J3074j0220r55o11p24k748O518J1371n540n555
8899A31606R13L289k516n559N411r806N8P510N822J6653n25j1920l173N606Q156
8884A51525K22p666J1291J6547K9940K1537J740K011n826j566k497l432r909k948
8870B00969l631N506Q268j865NP688J5557R648J3534J5221J222O673J1168M690
$$ plain form
8856 294653 291494 303907 313143 325001 323730 313646 334769 351893 354362 356581 369442 390042 406602
8843 406602 424879 434268 447333 476301 502329 514778 515910 512546 529646 579308 623819 653974
8831 653974 669260 729446 779771 811593 852053 899372 969039 1044633 1120010 1189662 1287410 1409611
8819 1409611 1539565 1690176 1885968 2131987 2428151 2739004 3138960 3604380 4126598 4740312
8809 4740312 5515729 6514714 7803469 9512631 11844908 15248891 20535774 29087071 42368199
8800 42368199 58797878 68551943 65419622 56696762 46284287 34881410 25103569 18345779
8792 18345779 14001966 11203576 9328124 7989447 7026543 6297419 5737144 5306881 4981448
8783 4981448 4695478 4435191 4214661 4029412 3906627 3817613 3781851 3800737 3878121 4020410
$$ packed form
8856B94653l159J2413R236J1858j271j0084K1123J7124K469K219J2861K0600J6560
8843D06602J8277R389J3065K8968K6028J2449J132l364J7100M9662M4511L0155
8831F53974J5286O0186N0325L1822M0460M7319O9667P5594P5377O9652R7748J22201
8819A409611J29954J50611J95792K46019K96164L10853L99956M65420N22218O13714
8809D740312P75417R98985J288755J709162K332277L403983N286883Q551297J3281128
8800D2368199J6429679R754065l132321q722860j0412475j1402877r777841o757790
8792A8345779m343813k798390j875452j338677r62904p29124n60275m30263l25433
8783D981448k85970k60287k20530j85249j22785q9014l5762J8886P7384J42289
$$ plain form
8773 4020410 4222308 4497684 4858121 5315908 5863178 6548658 7333240 8208001 9291034
8764 9291034 10679586 12463628 14801990 17859981 21972146 27947330 37363967 53158327
8756 53158327 79848729 117621147 142140465 134185355 115616922 94273493 69686373
8749 69686373 48691516 34594085 25797770 20202982 16460676 13836216 11955605 10534317
8741 10534317 9418443 8557802 7835785 7148786 6503585 5931288 5433720 5018112 4704751
8732 4704751 4434340 4215013 4072282 3982397 3935412 3937355 4004682 4126153 4305406 4550774
8722 4550774 4853882 5246959 5765249 6419135 7272645 8412879 9918692 11946166 14838379
8713 14838379 19275298 26421481 37759878 53082678 65056472 64596889 56538378 46661405
$$ packed form
8773D020410K01898K75376L60437M57787N47270O85480P84582Q74761J083033
8764I291034J388552J784042K338362L057991M112165N975184R416637J5794360
8756E3158327K6690402L7772418K4519318p955110j8568433k1343429k4587120
8749F9686373k0994857j4097431q796315n594788l742306k624460j880611j421288
8741A0534317j115874q60641p22017o86999o45201n72297m97568m15608l13361
8732D704751k70411k19327j42731q9885m6985J943O7327J21471J79253K45368
8722D550774L03108L93077N18290O53886Q53510J140234J505813K027474K892213
8713A4838379M436919P146183J1338397J5322800J1973794m59583q058511r876973
$$ plain form
8705 46661405 35563458 25416423 18125855 13416338 10410636 8426899 7020678 6000729
8697 6000729 5234456 4626791 4132626 3730580 3353364 2989756 2677121 2382661 2140080 1932710
8687 1932710 1759918 1619001 1473052 1347825 1242350 1144278 1055702 979379 929201 857290
8677 857290 787790 751779 723343 699428 677951 632968 598459 568517 534649 490018 455625 419558
8665 419558 388767 371559 354629 338562 335487 331600 326272 307587 291263 271040 251292 244488
8653 244488 238407 223380 201357 184637 184085 197934 205547 197409 195845 200326 198173 197317 192368 195309
8639 195309 178590 148038 145181 138151 127533 129281 139794 150453 144132 142152 156863 175124 190322
8626 190322 189824 177463 160027 152859 150753 142842 143351 143298 148086 142987 133811 122519 121198 116670 106711
$$ packed form
8705D6661405j1097947j0147035p290568m709517l005702j983737j406221j019949
8697F000729p66273o07665m94165m02046l77216l63608l12635k94460k42581k07370
8687A932710j72792j40917j45949j25227j05475r8072q8576p6323n0178p1911
8677H57290o9500l6011k8436k3915k1477m4983l4509k9942l3868m4631l4393l6067
8665D19558l0791j7208j6930j6067l075l887n328j8685j6324k0223j9748o804
8653B44488o081j5027k2023j6720n52J3849P613q138j564M481k153q56m949K941
8639A95309j6719l0552k857p030j0618J748J0513J0659o321j980J4711J8261J5198
8626A90322m98j2361j7436p168k106p911N09n3M788n099r176j1292j321m528r959
$$ plain form
8611 106711 95247 89810 89335 85966 75669 82223 88501 92793 95087 94002 91232 93190 98812 94995
8597 94995 90080 96732 108183 121825 125072 123204 113675 108696 105413 106493 106601 107415 104284 101286 108858
8582 108858 112774 108867 114409 100849 83178 76637 75674 75669 83655 80869 87585 90456 72023 66007 59771
8567 59771 59230 62263 71305 78979 81475 78041 65615 66597 61972 54121 52565 44479 46548 46141 50690
8552 50690 53070 44022 37878 37063 30995 24125 19356 18129 21235 38282 42410 55816 34591 23001
8538 23001 21377 1981 6053 5957 6672 27 13645 31888 34684 29807 31141 37293 41433 54240
8524 54240 56192 48065 42478 49839 60824 66116 57111 57729 57620 54702 47722 34225 28796 33216 45524
8509 45524 46350 40213 38669 45546 34119 29229 32523 31104 25668 31063 29354 27247 15854 1771
$$ packed form
8611A06711j1464n437m75l369j0297O554O278M292K294j085k770J958N622l817
8597I4995m915O652J1451J3642L247j868r529m979l283J080J08Q14l131k998P572
8582A08858L916l907N542j3560j7671o541r63nP986k786O716K871j8433o016o236
8567E9771n41L033R042P674K496l434j2426R82m625p851j556q086K069m07M549
8552E0690K380r048o144q15o068o870m769j227L106J7047M128J3406k1225j1590
8538B3001j624j9396M072r6P15o645J3618J8243K796m877J334O152M140J2807
8524E4240J952q127n587P361J0985N292r005O18j09k918o980j3497n429M420J2308
8509D5524Q26o137j544O877j1427m890L294j419n436N395j709k107j1393j4083
$$ plain form
8495 1771 1655 6423 -1553 759 1657 7839 21774 38407 39965 43128 43339 34134 23625 14631 18460
8480 18460 33862 35375 34659 22321 7342 -2496 10968 21484 28727 35314 42754 31310 26902
8467 26902 30074 26131 23343 26221 30684 27607 17240 6779 1086 4105 14288 15002 7084 2642
8453 2642 8075 19059 24902 13595 11986 10996 32664 51380 57627 55699 55460 47381 46816 39605 22576
8438 22576 29035 32064 35005 29080 35414 39949 35635 20991 20433 15296 3416 3227 10960 13664 13861
8423 13861 11820 10169 13074 20102 -3779 -16889 73 11391 16258 17757 19559 30912 31101 32064
8409 32064 29654 24613 30324 33976 31460 37702 46280 53720 61120 88764 120543 146069 205022 294174
8395 294174 358270 376979 342967 293604 235850 173277 121250 91561 69164 58642 47851 52340
$$ packed form
8495A771j16M768p976K312Q98O182J3935J6633J558L163K11r205j0509q994L829
8480A8460J5402J513p16j2338j4979r838J3464J0516P243O587P440j1444m408
8467B6902L172l943k788K878M463l077j0367j0461n693L019J0183P14p918m442
8453B642N433J0984N843j1307j609r90K1668J8716O247j928k39q079n65p211j7029
8438B2576O459L029K941n925O334M535m314j4644n58n137j1880j89P733K704J97
8423A3861k041j651K905P028k3881j3110J6962J1318M867J499J802J1353J89R63
8409C2064k410n041N711L652k516O242Q578P440P400K7644L1779K5526N8953Q9152
8395B94174O4096J8709l4012m9363n7754o2573n2027k9689k2397j0522j0791M489
$$ plain form
8383 52340 45459 42691 49269 48508 47960 51763 32508 26017 30670 40587 44704 49667 53509 39210 33515
8368 33515 34150 35388 32567 46339 56140 61118 65954 64948 70365 78220 92576 116874 134949 167024
8354 167024 224955 300753 403448 562716 718936 720140 636122 550929 444428 316359 216124
8343 216124 172926 150728 131451 112032 85865 82309 83235 73221 49626 38159 47200 34021
8331 34021 29463 25923 15257 11839 11885 11940 10241 19587 19596 30069 38803 41617 33433 44398 51694 47047
8315 47047 53538 65941 61929 67012 89318 107383 124543 143638 189773 253820 329386 351943
8303 351943 312135 255972 218141 182396 152086 119676 78905 59066 57462 62669 71296 53934
8291 53934 41714 28046 5002 4884 13893 17496 12855 1129 -16968 -16755 -8183 4867 22170
$$ packed form
8383E2340o881k768O578p61n48L803j9255o491M653R917M117M963L842j4299n695
8368C3515O35J238k821J3772R801M978M836j006N417P855J4356K4298J8075L2075
8354A67024N7931P5798J02695J59268J56220J204q4018q5193j06501j28069j00235
8343B16124m3198k2198j9277j9419k6167l556R26j0014k3595j1467R041j3179
8331C4021m558l540j0666l418M6N5j699R346RJ0473Q734K814q184J0965P296m647
8315D7047O491J2403m012N083K2306J8065J7160J9095M6135O4047P5566K2557
8303C51943l9808n6163l7831l5745l0310l2410m0771j9839j604N207Q627j7362
8291E3934j2220j3668k3044j18R009L603m641j1726j8097K13Q572J3050J7303
$$ plain form
8278 22170 22736 17952 16030 9668 18447 17655 10490 16289 5876 12747 25601 21835 18324 6922
8264 6922 192 -2464 -4435 -4083 -3183 -8836 -5981 -7717 -13747 -17171 -6052 -5088 -10875 -10286 -10682 -2139
8248 -2139 -642 2500 -7862 -15108 -15064 -13684 -2124 -5809 -15625 -12635 -7820 -6891 -8106 1165 -5766
8233 -5766 -10685 -7230 -2023 -6342 -8613 -14831 -20367 -15365 -1695 6126 4465 -8968 -14435 -14769 -6073
8218 -6073 5868 3756 -16277 -30822 -29060 -34854 -24872 -9542 -10317 -7050 -10949 -20912 -29709 -35787
8204 -35787 -23949 -5337 12758 25092 17246 -1316 -3926 -3987 2929 -6604 -9107 -6133 -17234 -23119
8190 -23119 -18946 -22857 -20782 -14065 -15678 -24758 -25851 -26494 -23762 -14485 -18161 -18351 -15248 -12486 -9469
8175 -9469 -9199 -7837 -3831 -10560 -7517 -6284 -8376 -6743 990 4255 -13843 -32030 -17267 2165
$$ packed form
8278B2170N66m784j922o362Q779p92p165N799j0413O871J2854l766l511j1402
8264F922o730k656j971L52R00n653K855j736o030l424J1119R64n787N89l96Q543
8248b139J497L142j0362p246M4J380J1560l685r816K990M815R29j215R271o931
8233e766m919L455N207m319k271o218n536N002J3670P821j661j3433n467l34Q696
8218f073J1941k112k0033j4545J762n794R982J5330p75L267l899r963q797o078
8204c5787J1838J8612J8095J2334p846j8562k610o1O916r533k503K974j1101n885
8190b3119M173l911K075O717j613r080j093o43K732R277l676j90L103K762L017
8175i469K70J362M006o729L043J233k092J633P733L265j8098j8187J4763J9432
$$ plain form
8161 2165 16571 5511 1690 11553 3271 -8189 1578 7759 8091 4126 402 -3805 -8183 -14332
8147 -14332 -8858 -3085 2792 -1585 823 -4757 -4704 5640 4622 -8131 -9183 8420 6136 -11988
8133 -11988 -10582 -8216 379 3063 -1148 5214 6788 12782 16449 6853 11633 7595 3410 10591 -1001
8118 -1001 -5960 5884 4153 -220 -9818 -9713 -7799 -5442 -18318 -34281 -27430 -4173 -6904 -10203
8104 -10203 -2374 4646 3085 -441 -5925 -21978 -20335 -16572 -10817 -9168 -917 -1515 -3593 -6824 -17225
8089 -17225 -30588 -27818 -21309 -15734 -11693 -16175 -4998 6797 1958 -2574 -4705 199 1933 -18488
8075 -18488 -22262 -18047 -5953 -10568 -20986 -21096 -21986 -9363 -17874 -7225 14045 17144 9455 9559
8061 9559 9987 3834 -9612 -9464 -10799 -9482 24 6952 7405 6159 -4668 -9957 -789 8669 15322
$$ packed form
8161B165J4406j1060l821R863q282j1460R767O181L32l965l724m207m378o149
8147a4332N474N773N877m377K408n580N3J0344j018j2753j052J7603k284j8124
8133a1988J406K366Q595K684m211O362J574N994L667r596M780m038m185P181j1592
8118a001m959J1844j731m373r598J05J914K357j2876j5963O851K3257k731l299
8104a0203P829P020j561l526n484j6053J643L763N755J649Q251n98k078l231j0401
8089a7225j3363K770O509N575M041m482J1177J1795m839m532k131M904J734k0421
8075a8488l774M215J2094m615j0418j10q90J2623q511J0649K1270L099p689J04
8061I559M28o153j3446J48j335J317R506O928M53j246j0827n289R168R458O653
$$ plain form
8046 15322 18380 14604 14726 13008 -2210 -4296 2553 5420 8997 -8973 -15479 13272 21747 13504
8032 13504 11743 9303 9011 11965 4509 6598 7564 2254 1419 524 -5803 -6072 -6094 -2579 -1708 -630 -2331
8015 -2331 2286 -4959 -11511 -3201 9432 2966 2100 1999 2438 -4466 -4279 12291 25941 17898 7789
8000 7789 1405 7196 23520 29343 34716 40233 45913 53817 50189 52584 60381 53207 50643 51217 53510
7985 53510 50991 60625 49875 55087 64962 70468 71163 70697 55322 48800 28432 27591 22718 23477 26938
7970 26938 38573 41626 19943 10378 15669 12818 4376 937 7779 15526 31894 48515 66600
7957 66600 77017 55287 47948 56595 46646 40292 43544 42294 46661 64248 68906 65111 64890 74074
7943 74074 70113 74844 95380 107140 99646 96492 87875 73937 62715 51069 44892 35850 25575
$$ packed form
8046A5322L058l776J22j718j5218k086O849K867L577j7970o506K8751Q475q243
8032A3504j761k440k92K954p456K089R66n310q35q95o327k69k2L515Q71J078j701
8015b331M617p245o552Q310J2633o466q66j01M39o904J87J6570J3650q043j0109
8000G789o384N791J6324N823N373N517N680P904l628K395P797p174k564N74K293
7985E3510k519R634j0750N212R875N506O95m66j5375o522k0368q41m873P59L461
7970B6938J1635L053k1683r565N291k851q442l439O842P747J6368J6621J8085
7957F6600J0417k1730p339Q647r949o354L252j250M367J7587M658l795k21R184
7943G4074l961M731K0536J1760p494l154q617j3938j1222j1646o177r042j0275
$$ plain form
7930 25575 27815 43269 53291 49130 44273 44210 34290 34588 33358 29657 25196 14894 11559 25389
7916 25389 34995 35538 21647 22001 31363 21000 15700 14053 27263 49963 61878 58292 48514 32086
7902 32086 30925 32218 36320 34628 30563 20312 18977 18324 18461 21463 23415 25038 6181 -9405
7888 -9405 -18215 -10303 -12030 -15125 -12237 -31519 -29801 -17280 -10479 3999 6680 12416 15684 8456
7874 8456 5608 5680 -2648 -11252 -6811 2230 14803 4323 2326 8969 13095 16511 7804 8427 7288
7859 7288 -540 -7888 -5493 -1605 -3037 -8280 -11704 -23722 -27926 -22106 -18576 -20996 -24993 -12372
7845 -12372 2086 -3035 -8991 -8288 -12350 -32610 -32777 -27179 -8922 -6066 -9889 -13540 -10246 1297
7831 1297 401 4221 -2397 -5860 -9432 -27872 -43212 -42039 -31607 -6068 3979 19930 23755 20663
$$ packed form
7930B5575K240J5454J0022m161m857o3r920K98j230l701m461j0302l335J3830
7916B5389R606N43j3891L54R362j0363n300j647J3210K2700J1915l586r778j6428
7902C2086j161J293M102j692m065j0251j335o53J37L002J952J623j8857j5586
7888i405q810P912j727l095K888j9282J718J2521O801J4478K681N736L268p228
7874H456k848P2q328q604M441R041J2573j0480j997O643M126L416q707O23j139
7859G288p828p348K395L888j432n243l424j2018m204N820L530k420l997J2621
7845a2372J4458n121n956P03m062k0260j67N598J8257K856l823l651L294J1543
7831A297q96L820o618l463l572j8440j5340J173J0432K5539J0047J5951L825l092
$$ plain form
7817 20663 -658 -2708 1767 2539 5271 2079 -7204 -9746 1513 8695 9598 -2340 -1607 5321 11326
7802 11326 10935 5742 1589 -5953 -6274 -4690 -347 3477 2367 -2651 -6615 -8431 -7758 -13661 -13523 -19634
7786 -19634 -29051 -34423 -33634 -22763 -10475 -10718 -16531 -13641 -9939 -7234 -7296 -9831 -7639 -17550 -19351
7771 -19351 -4709 -404 5315 -8083 -14507 -9180 -8400 -4659 -3619 -7517 -16106 -20272 -2666 14398
7757 14398 17198 17789 1416 -9622 -20369 -17155 -7641 -5829 -1819 -274 -1955 -11820 -17702 -24694
7743 -24694 -21479 -29251 -26652 -3217 4996 1077 4827 -2234 -9497 -15487 -12685 -1550 -5154 -16072
7729 -16072 -7165 -8393 -10315 -6127 -15274 -19974 -14242 -10831 -17592 -30324 -13636 3239 4911 -4418
7715 -4418 -1146 13961 10051 -5008 -7833 -9362 -19156 -29638 -12195 -12432 -22712 -17285 -17488 -23276
$$ packed form
7817B0663k1321k050M475P72K732l192r283k542J1259P182R03j1938P33O928O005
7802A1326l91n193m153p542l21J584M343L824j110n018l964j816O73n903J38o111
7786a9634r417n372P89J0871J2288k43n813K890L702K705o2k535K192r911j801
7771a9351J4642M305N719j3398o424N327P80L741J040l898q589m166J7606J7064
7757A4398K800N91j6373j1038j0747L214R514J812M010J545j681r865n882o992
7743b4694L215p772K599K3435Q213l919L750p061p263n990K802J1135l604j0918
7729a6072Q907j228j922M188r147m700N732L411o761j2732J6688J6875J672r329
7715d418L272J5107l910j5059k825j529r794j0482J7443k37j0280N427k03n788
$$ plain form
7701 -23276 -23595 -17798 -14252 -13522 -2782 5010 14901 -1643 -13877 -12755 -2361 4505 -5256 -18555
7687 -18555 -10854 11976 12849 6232 6848 11941 17453 12103 -3153 -1722 -367 -20510 -34774 -29267
7673 -29267 -33956 -29326 -25572 -11080 1257 9537 29236 9952 -19317 -25761 -19455 -6151 -26569
7660 -26569 -27013 -21523 -23747 -22223 -29035 -37155 -41068 -39070 -28563 -25360 -36909 -28835 -28200 -26175 -35012
7645 -35012 -26818 -4110 -537 -4307 -12122 -23203 -22297 -16267 -19170 -14925 -11015 -10456 -21836 -17621
7631 -17621 -20679 -9798 11877 -2939 -15423 -21559 -28033 -34619 -25680 -17384 -24419 -24787 -21084 -18318
7617 -18318 -21117 -6394 18294 6713 -9465 -17802 -16257 -8818 -12231 -10826 -9995 -16741 -15768 -15414
7603 -15414 -17645 -30174 -33205 -31568 -16455 -6889 -11441 -4744 -8935 -21946 -16984 -12023 -6500 3798
$$ packed form
7701b3276l19N797L546P30J0740P792R891j6544j2234J122J0394O866r761j3299
7687a8555P701K2830Q73o617O16N093N512n350j5256J431J355k0143j4264N507
7673b9267m689M630L754J4492J2337Q280J9699j9284k9269o444O306J3304k0418
7660b6569m44N490k224J524o812q120l913J998J0507L203j1549Q074O35K025q837
7645c5012Q194K2708L573l770p815j1081R06O030k903M245L910N59j1380M215
7631a7621l058J0881K1675j4816j2484o136o474o586Q939Q296p035l68L703K766
7617a8318k799J4723K4688j1581j6178q337J545P439l413J405Q31o746R73L54
7603a5414k231j2529l031J637J5113R566m552O697m191j3011M962M961N523J0298
$$ plain form
7589 3798 12222 13382 20893 23183 14026 1279 1063 -1038 -1845 7730 8918 -11028 -23504 -18069 -11344
7574 -11344 -15591 -25686 -18399 -4588 -790 -1151 -3815 3772 4423 6903 12833 15047 1943 -13618
7560 -13618 -12455 -15836 -12076 -476 6416 11 -2165 8821 6221 6219 14146 5804 2407 5810 3284
7545 3284 -4798 3027 2797 4292 359 -9037 -10473 -16934 -18097 -16375 -19107 -21520 -23891 -29940 -13006
7530 -13006 -13636 -19922 -16342 -9900 -16175 -10759 -6614 -6987 2463 2581 5831 -5826 -2507 -3717 6563
7515 6563 10227 1137 -9539 -13389 2472 13056 -2082 -6451 -4054 -7686 -17990 -15011 -15230 -22982
7501 -22982 -8665 11254 851 885 -7603 -26403 -14992 -7471 -1780 -814 -2775 -9527 -18351 -14508
7487 -14508 -13089 -17270 -4924 8575 7620 5552 8369 7504 265 -5665 -6953 4598 3975 -744 -2682
$$ packed form
7589C798Q424J160P511K290r157j2747k16k101q07R575J188j9946j2476N435O725
7574a1344m247j0095P287J3811L798l61k664P587O51K480N930K214j3104j5561
7560a3618J163l381L760J1600O892o405k176J0986k600kP927q342l397L403k526
7545C284q082P825k30J495l933r396j436o461j163J722k732k413k371o049J6934
7530a3006o30o286L580O442o275N416M145l73R450J18L250j1657L319j210J0280
7515F563L664r090j0676l850J5861J0584j5138m369K397l632j0304K979k19p752
7501b2982J4317J9919j0403L4q488j8800J1411P521N691R66j961o752q824L843
7487a4508J419m181J2346J3499r55k068K817q65p239n930j288J1551o23m719j938
$$ plain form
7472 -2682 -6574 -11767 -2665 -18166 -19775 -1470 5124 7322 12457 5941 -2133 -10646 -11165 -17075 -27904
7457 -27904 3023 18580 4119 -10136 -13591 -2900 8855 1108 -6073 -5371 -2297 8833 15523
7444 15523 7940 -3 -5130 -6548 1344 6994 -12266 -18411 -14415 -7918 175 858 750 -6510 -22241
7429 -22241 -20442 -25074 -29850 -32066 -27373 -19304 -10614 -786 6394 20329 9127 -3231 -8805 -8657
7415 -8657 -996 11536 19112 6103 -15947 -18645 -7902 -4470 -14712 -14477 -25374 -30685 -19630
7402 -19630 -3747 5489 6002 -3281 -7981 -3602 1477 -9428 -13959 -7910 -5832 -9901 -10320 -4978 -12295
7387 -12295 -23581 -15689 -2968 4269 9529 7921 10093 1770 4543 3313 -5073 -10014 -9290 -18460
7373 -18460 -5716 -6057 -17072 -29103 -30149 -30790 -23496 -22761 -30557 -34259 -44286 -30991 -18356 -23717
$$ packed form
7472b682l892n193R102j5501j609J8305O594K198N135o516q074q513n19n910j0829
7457b7904L0927J5557j4461j4255l455J0691J1755p747p181P02L074J1130O690
7444A5523p583p943n127j418P892N650j9260o145L996O497Q093O83j08p260j5731
7429b2241J799m632m776k216M693Q069Q690R828P180J3935j1202j2358n574J48
7415h657P661J2532P576j3009k2050k698J0743L432j0242K35j0897n311J1055
7402a9630J5883R236N13r283m700M379N079j0905m531O049K078m069m19N342p317
7387a2295j1286P892J2721P237N260j608K172q323K773j230q386m941P24r170
7373a8460J2744l41j1015j2031j046o41P294P35p796l702j0027J3295J2635n361
$$ plain form
7359 -23717 -19027 -12003 356 7867 -5795 -12245 -12078 4364 939 2789 13678 22844 15788 5381
7345 5381 5156 -7581 -12160 -1402 2014 -15843 -6392 232 -2368 -1014 -10275 -12659 -11848 -17612 -8325
7330 -8325 -10188 -14897 -12426 -11613 -10150 -4812 5015 10167 15895 24921 17183 1256 3564 12897 -713
7315 -713 2412 6036 7478 7680 10834 15736 8432 6726 -6169 -11769 -13782 -18253 -7689 -7237 -19210
7300 -19210 -22976 -22130 -29283 -20158 -9515 -2930 -4870 -13491 -14600 -15999 -29520 -50536 -41766 -25017
7286 -25017 -24724 -27632 -11744 -14679 -26800 -24541 -5296 3067 5796 -199 -7838 -4165 6500 3019
7272 3019 -14056 -36739 -32702 -28290 -21980 -21109 -12177 -3983 -3163 2536 -5559 -2178 12812 11536 9162
7257 9162 6315 -3164 -5341 -6520 -12905 -16583 -3157 -852 209 3752 -4704 5455 16751 11160
$$ packed form
7359b3717M690P024J2359P511j3662o450J67J6442l425J850J0889R166p056j0407
7345E381k25j2737m579J0758L416j7857R451O624k600J354r261k384Q11n764R287
7330h325j863m709K471Q13J463N338R827N152N728R026p738j5927K308R333j3610
7315g13L125L624J442K02L154M902p304j706j2895n600k013m471J0564M52j1973
7300a9210l766Q46p153R125J0643O585j940q621j109j399j3521k1016Q770J6749
7286b5017K93k908J5888k935j2121K259J9245Q363K729n995p639L673J0665l481
7272C019j7075k2683M037M412O310Q71Q932Q194Q20N699q095L381J4990j276k374
7257I162k847r479k177j179o385l678J3426K305J061L543q456J0159J1296n591
$$ plain form
7243 11160 11454 6117 -189 4959 2748 -5798 268 7316 4823 3278 -13418 -4131 16111 10202
7229 10202 11451 6407 -2778 3564 10324 3458 4111 9267 237 2105 14194 15401 15812 -1630 -25603
7214 -25603 -23981 -28817 -31099 -24326 -16842 -11867 -8065 -13078 -11926 -3130 1532 -1851 -5769 -6825 -2557
7199 -2557 -9324 -15471 -11677 -2878 172 4459 -2038 -10719 -7195 -3572 -12085 -19572 -19061 -16051 -23198
7184 -23198 -24304 -21119 -8483 -10864 -9146 -5743 -14616 -22276 -20118 -4596 -3031 -2929 -9662 -4349
7170 -4349 -14699 -20469 -18828 -19083 -8308 -1710 -2412 1476 8770 1117 -6665 -11595 -10604 9306 19240
7155 19240 11300 14711 22071 8557 7739 7311 7332 -441 5085 2299 8788 13702 10953 1710 -14984
7140 -14984 -18594 -12400 -13769 -6648 -5030 -18910 -28715 -28144 -15546 -4097 -7003 -17202 -10763 5799
$$ packed form
7243A1160K94n337o306N148k211q546O066P048k493j545j6696R287K0242n909
7229A0202J249n044r185O342O760o866O53N156r030J868J2089J207M11j7442k3973
7214b5603J622m836k282O773P484M975L802n013J152Q796M662l383l918j056M268
7199b557o767o147L794Q799L050M287o497q681L524L623q513p487N11L010p147
7184b3198j106L185J2636k381J718L403q873p660K158J5522J565J02o733N313
7170d349j0350n770J641k55J0775O598p02L888P294p653p782m930R91J9910R934
7155A9240p940L411P360j3514q18m28K1p773N526k786O489M914k749r243j6694
7140a4984l610O194j369P121J618j3880r805N71J2598J1449k906j0199O439J6562
$$ plain form
7126 5799 12503 13251 1058 -230 13494 7752 4261 12220 420 8724 17357 3258 -10097 10513
7112 10513 5452 -17281 -23239 -15935 -13482 -5535 2235 -9115 -14873 -7340 -6484 1141 -1664 1969
7098 1969 -2578 -6126 -13707 -8440 -7328 5615 16556 4113 2612 10450 -9811 -29062 -16249
7085 -16249 1241 7959 6351 9449 14545 12982 7080 2109 6157 827 -14772 -15165 -2298 6645
7071 6645 2286 -1352 -5264 -2797 1233 693 -6002 -12276 4164 -2682 -17036 -9127 -13385 -17812 -3130
7056 -3130 8629 13845 7793 2140 4190 -3195 -5276 -10856 -4414 -1326 -13671 -28583 -20965 -14697
7042 -14697 -22324 -17593 -6184 251 5369 -290 -5798 -17240 -17122 -20897 -18058 -24923 -13378 -15631
7028 -15631 -26713 -26020 -10801 -6897 -10246 -7318 -9680 1343 6059 -4489 -10268 -6127 -11198 -18392
$$ packed form
7126E799O704P48j2193j288J3724n742l491P959j1800Q304Q633j4099j3355K0610
7112A0513n061k2733n958P304K453P947P770j1350n758P533Q56P625k805L633
7098A969m547l548p581N267J112J2943J0941j2443j501P838k0261j9251J2813
7085a6249J7490O718j608L098N096j563n902m971M048n330j5599l93J2867Q943
7071F645m359l638l912K467M030n40o695o274J6440o846j4354P909m258m427J4682
7056c130J1759N216o052n653K050p385k081n580O442L088j2345j4912P618O268
7042a4697p627M731J1409O435N118n659n508j1442J18l775K839o865J1545k253
7028a5631j1082O93J5219L904l349K928k362J1023M716j0548n779M141n071p194
$$ plain form
7014 -18392 -12683 -6162 -16425 -19758 -28257 -18539 -1001 6116 -4533 -3665 14696 18993 26095 27741
7000 27741 30934 28988 15830 8032 12597 19422 19775 19524 19935 488 -13530 -14912 -21529 -27387 -27525
6985 -27525 -31399 -29016 -23572 -26068 -25526 -32902 -14639 -12379 -21416 -14092 -5805 -3187 -1922 -4315 -12360
6970 -12360 -2377 -6628 -4246 -11564 -16216 -11697 2447 9151 -6848 -19409 -20849 -16486 -11525 -10768
6956 -10768 -12767 -3327 7611 13889 3056 -11013 -20563 -25243 -9210 -6132 -10277 10747 5816
6943 5816 -11928 -10322 -8823 -10991 -17223 -17072 -10849 -15350 -13783 -7518 -15727 -25839 -27264 -22714 -16539
6928 -16539 -5527 8371 7753 6083 -535 -13453 -24711 -17139 -11073 -11031 -1125 4586 433 -19533
6914 -19533 -25177 -19608 -26113 -12526 -2313 10776 9895 11180 19618 6363 -8689 521 -10543
$$ packed form
7014a8392N709O521j0263l333q499R718J7538P117j0649Q68J8361M297P102J646
7000B7741L193j946j3158p798M565O825L53k51M11j9447j4018j382o617n858j38
6985b7525l874K383N444k496N42p376J8263K260r037P324Q287K618J265k393q045
6970a2360R983m251K382p318m652M519J4144O704j5999j2561j440M363M961P57
6956a0768j999R440J0938O278j0833j4069r550m680J6033L078m145K1024m931
6943E816j7744J606J499k168o232J51O223m501J567O265q209j0112j425M550O175
6928a6539J1012J3898o18j670o618j2918j1258P572O066M2R906N711m153j9966
6914a9533n644N569o505J3587J0213J3089q81J285Q438j3255j5052R210j1064
$$ plain form
6901 -10543 -23955 -24995 -17273 139 10804 -7594 -7072 3311 6046 11335 11899 12231 1820 25
6887 25 6827 8710 4009 -5435 -13804 -22326 -16152 -7066 5521 3985 -12567 -15566 -14969 -7659 -1258
6872 -1258 -9489 -14921 -19732 -12156 -1698 431 -2106 -11613 -13789 -12285 -20239 -18210 -11861 -4618 -5180
6857 -5180 -6505 2573 1860 -2340 -5919 -3934 -3673 -2022 -241 -8267 514 7494 -201 -3544 -784
6842 -784 12251 15197 -846 -4165 -1433 467 -8092 -17003 -12345 -13917 -15316 -24462 -37235 -37658 -9424
6827 -9424 1494 -12420 -4327 -2581 2003 11141 21820 20629 10153 -3710 -5954 -3870 553 11974
6813 11974 20605 8373 67 -2356 -4854 -3842 6807 13696 10857 18121 6072 -3421 -3265 4096
6799 4096 -2600 7021 4698 6816 8708 17483 7634 -1834 -2825 -4902 -5197 -12202 -11060 -1065 2031
$$ packed form
6901a0543j3412j040P722J7412J0665j8398N22J0383K735N289N64L32j0411j795
6887B5O802J883m701r444q369q522O174R086J2587j536j6552k999N97P310O401
6872a258q231n432m811P576J0458K129k537r507k176J504p954K029O349P243n62
6857e180j325R078p13m200l579J985K61J651J781q026Q781O980p695l343K760
6842g84J3035K946j6043l319K732J900q559q911M658j572j399r146j2773m23K8234
6827i424J0918j3914Q093J746M584R138J0679j191j0476j3863k244K084M423J1421
6813A1974Q631j2232q306k423k498J012J0649O889k839P264j2049r493J56P361
6799D096o696R621k323K118J892Q775r849r468r91k077k95p005J142R995L096
$$ plain form
6784 2031 -12205 -19142 -26094 -27943 -21662 -20845 -13319 -7528 -8858 -9619 -8766 -13208 -6901 -4028 -10367
6769 -10367 2012 5802 10459 11051 -1199 -17287 -15543 -6469 -10478 -10854 -10380 -23377 -21481 -6915
6755 -6915 8672 22947 19695 18526 4760 8308 253 -4329 -7775 -3059 -2336 -5941 -4308 -13339
6741 -13339 -7135 -433 -5333 -15282 -19160 -13794 -8127 -12244 -20610 -34116 -33972 -14524 -5774 -8332
6727 -8332 -7672 2651 4105 -3983 -18208 -20136 -13736 -10291 -5163 4703 21890 23484 12169 16806
6713 16806 28414 29901 20771 9944 9208 13583 23386 15682 8876 21197 22617 19993 20921 18331
6699 18331 2654 -9320 1295 -8472 -13785 -20248 -23736 -20425 -16106 -11565 -4468 -964 -785 672
6685 672 -2855 469 7782 11454 -46 -3520 -2117 -9389 -12864 -5770 16464 18035 5583 -14243
$$ packed form
6784B031j4236o937o952j849O281Q17P526N791j330p61Q53m442O307K873o339
6769a0367J2379L790M657N92j2250j6088J744R074m009l76M74j2997J896J4566
6755f915J5587J4275l252j169j3766L548q055m582l446M716P23l605J633r031
6741a3339O204O702m900r949l878N366N667m117q366j3506J44J9448Q750k558
6727h332O60J0323J454q088j4225j928O400L445N128R866J7187J594j1315M637
6713A6806J1608J487r130j0827p36M375R803p704o806J2321J420k624R28k590
6699A8331j5677j1974J0615r767n313o463l488L311M319M541P097L504J79J457
6685F72l527L324P313L672j1500l474J403p272l475P094K2234J571j2452j9826
$$ plain form
6671 -14243 -8186 5867 -2375 -187 365 -6644 -1049 240 10536 15625 7644 -5252 -19371 -12897
6657 -12897 2301 5620 -1640 -3081 -12856 -23136 -28200 -12593 -2232 2965 6071 4262 9640 -214
6643 -214 -1131 7637 10233 1487 -6442 -26103 -38309 -32440 -11844 -3773 9637 -7724 -18744 -11365
6629 -11365 5432 8897 16245 10357 437 7395 15955 8860 12936 10686 20859 20468 8570 14468
6615 14468 9202 1230 -8519 -18447 -22682 -29352 -31362 -9825 -6623 -21366 -37330 -28585 -21613 -18265
6601 -18265 -1352 -3852 -13231 -5574 -9204 -10298 -15019 -23013 -18376 -13746 -10021 -7473 -6060 2841
6587 2841 -4319 -15541 -19255 -18309 -9111 10223 15522 4440 -22223 -36974 -31068 -17594 -13164 -15280
6573 -15280 -20070 -9331 -516 379 8051 5100 4566 4334 3213 3623 22527 18054 6845 7004 6923 5667
$$ packed form
6671a4243O057J4053q242K188N52p009N595J289J0296N089p981j2896j4119O474
6657a2897J5198L319p260j441r775j0280n064J5607J0361N197L106j809N378r854
6643b14r17Q768K596q746p929j9661j2206N869K0596Q071J3410j7361j1020P379
6629a1365J6797L465P348n888r920O958Q560p095M076k250J0173l91j1898N898
6615A4468n266p972r749r928m235o670k010K1537L202j4743j5964Q745O972L348
6601a8265J6913k500r379P657l630j094m721p994M637M630L725K548J413Q901
6587B841p160j1222l714R46R198J9334N299j1082k6663j4751N906J3474M430k116
6573a5280m790J0739Q815Q95P672k951n34k32j121M10J8904m473j1209J59q1j256
$$ plain form
6557 5667 7416 -546 -4249 -1645 -10669 -6001 -8304 -10592 -14811 -8820 8610 17361 9268 6382 4465
6542 4465 5364 14333 3536 -657 -3232 -10336 -13797 -13764 -4078 3568 -6608 -9679 -10336 -5263 -7301
6527 -7301 -12153 -1518 -185 -512 5139 18052 11639 -14481 -24919 -34024 -43706 -31642 -11186 1046
6513 1046 1042 -10013 -9287 -4678 -12446 -2285 2053 2064 21 -2880 9560 7204 3071 -13769 -21511
6498 -21511 -9090 169 2415 -1971 -475 1802 -5806 -20963 -30785 -20305 -8528 2328 9218
6485 9218 8882 7200 -7921 -15966 -17047 -28888 -19725 -15673 -20216 -22531 -24715 -19249 -5281 1432
6471 1432 -13291 -19877 -21137 -23833 -21770 -24630 -20397 -22042 -19839 -13528 -12254 -20645 -24121 -26000 -26710
6456 -26710 -31300 -35063 -31380 -27491 -31942 -31762 -23931 -28915 -28775 -29624 -35497 -39932 -44012 -20315 -14280
$$ packed form
6557E667J749p962l703K604r024M668k303k288m219N991J7430Q751q093k886j917
6542D465Q99Q969j0797m193k575p104l461L3R686P646j0176l071o57N073k038
6527g301m852J0635J333l27N651J2913o413k6120j0438r105r682J2064K0456J2232
6513A046mj1055P26M609p768J0161M338J1k043k901J2440k356m133j6840p742
6498b1511J2421R259K246m386J496K277p608j5157r822J0480J1777J0856O890
6485I218l36j682j5121q045j081j1841R163M052m543k315k184N466J3968O713
6471A432j4723o586j260k696K063k860M233j645K203O311J274q391l476j879p10
6456b6710m590l763L683L889m451J80P831m984J40q49n873m435m080K3697O035
$$ plain form
6441 -14280 -8170 -2118 785 -9672 -18751 -19529 -18442 -11592 -14301 -12526 -13827 -9381 -10589 -8559 4587
6426 4587 2835 4079 -2786 -6731 -4875 -12053 -31217 -30808 -21735 -5144 5775 8810 7600 12369
6412 12369 -246 -2078 1079 -3241 603 3373 1064 -15184 -23017 -27069 -16177 -15214 -28985 -28998
6398 -28998 -31840 -21560 -16809 -15513 -17025 -26645 -17260 -10160 -13582 -17168 -21259 -12900 -7309 1600
6384 1600 2568 2763 8865 8332 -810 -2219 -18232 -19144 -19101 -18615 -5631 -11795 -20644 -7245 -12603 -20549
6368 -20549 2856 1112 -7259 -7232 -6830 -2162 -2232 -6275 -1537 -3146 -217 12018 17 1807 -3699
6353 -3699 -7613 -7617 5456 3318 4635 16132 5592 3320 4069 -7074 -6835 -5543 13161 21774 11800
6338 11800 2363 -3538 820 -3143 -7916 -2300 416 -3553 1746 9124 15285 8347 -237 -8361 275
$$ packed form
6441a4280O110O052K903j0457r079p78J087O850k709J775j301M446j208K030J3146
6426D587j752J244o865l945J856p178j9164M09R073J6591J0919L035j210M769
6412A2369j2615j832L157m320L844K770k309j6248p833m052J0892R63j3771j3
6398b8998k842J0280M751J296j512r620R385P100l422l586m091Q359N591Q909
6384A600R68J95O102n33r142j409j6013r12M3M86J2984o164q849J3399n358p946
6368b0549K3405j744q371K7M02M668p0m043M738j609K929J2235j2001J790n506
6353c699l914mJ3073k138J317J1497j0540k272P49j1143K39J292J8704Q613r974
6338A1800r437n901M358l963m773N616K716l969N299P378O161o938q584q124Q636
$$ plain form
6323 275 -15738 -13265 -14058 -19516 -9953 -1863 -3685 -8633 -23536 -29546 -15668 -5994 -16275 -15331 -15514
6308 -15514 -19553 -7600 -11806 -22846 -24227 -17448 -25216 -31338 -30533 -25135 -5779 2060 178 -8571
6294 -8571 -3242 -11194 -12204 -697 2146 -11257 5237 -1800 -18786 -20787 -13807 -18880 -16303 -18960
6280 -18960 -20352 -17169 -3097 4977 9670 17425 26011 16420 3101 -3217 -5510 -3226 4245 9663
6266 9663 -4249 -13421 -15418 -11420 -8805 -14788 -7119 15 16293 26799 32395 13768 -5969 -12346
6252 -12346 -8575 -8529 -9116 -1836 6846 7297 -1691 -7758 -19303 -12889 -14215 -160 1327 -7707 -5589
6237 -5589 2574 16478 6328 -4345 -11467 -14928 -8749 -13900 -13175 -10732 -8938 -9057 -10548 -9856 -1586
6222 -1586 -82 -5287 -98 -3505 -10015 -18851 -17027 -12066 -12889 -17183 -26329 -33028 -39658 -47880 -37328
$$ packed form
6323B75j6013K473p93n458R563Q090j822m948j4903o010J3878R674j0281R44j83
6308a5514m039J1953m206j1040j381O779p768o122Q05N398J9356P839j882q749
6294h571N329p952j010J1507K843j3403J6494p037j6986k001O980n073K577k657
6280a8960j392L183J4072Q074M693P755Q586r591j3319o318k293K284P471N418
6266I663j3912r172j997L998K615n983P669P134J6278J0506N596j8627j9737o377
6252a2346L771M6n87P280Q682M51q988o067j1545O414j326J4055J487r034K118
6237e589Q163J3904j0150j0673p122l461O179n151P25K443J794j19j491O92Q270
6222a586J504n205N189l407o510q836J824M961q23m294r146o699o630q222J0552
$$ plain form
6207 -37328 -29292 -16818 -8228 -1377 9294 -2891 5414 604 -5427 -8068 -12525 -8228 -3848 6573
6193 6573 2041 7640 4220 -15203 -20381 -12359 -2334 -3927 -20377 -16010 -3326 1249 6279 18651
6179 18651 13060 4058 -3648 -13102 -16531 -16573 -24225 -27770 -26728 -25754 -11620 -11893 -10160 -19173 -13096
6164 -13096 -4526 -8370 3262 -915 -7240 4570 1241 -5811 -3530 -6613 -24870 -14621 -12055 -15939
6150 -15939 -25873 -17300 -10942 -3773 15612 18915 11766 11470 1060 -5813 -13329 -19711 -13117 4549
6136 4549 13129 570 648 -11161 -1325 11481 3422 3742 17319 34735 31625 8321 841 5515
6122 5515 6160 7739 9853 17978 327 -12192 1029 12185 19173 17719 11273 13495 14864 6961
6108 6961 5621 9364 890 -9025 -12051 -12047 -5001 -16246 -14135 -17383 -20937 -14806 -5502 -3683 -5926
$$ packed form
6207c7328Q036J2474Q590O851J0671j2185Q305m810o031k641m457M297M380J0421
6193F573m532N599l420j9423n178Q022J0025j593j6450M367J2684M575N030J2372
6179A8651n591r002p706r454l429m2p652l545J042R74J4134k73J733r013O077
6164a3096Q570l844J1632m177o325J1810l329p052K281l083j8257J0249K566l884
6150a5939r934Q573O358P169J9385L303p149k96j0410o873p516o382O594J7666
6136D549Q580j2559P8j1809R836J2806q059L20J3577J7416l110k3304p480M674
6122E515O45J579K114Q125j7651j2519J3221J1156O988j454o446K222J369p903
6108F961j340L743q474r915l026MP046j1245K111l248l554O131R304J819k243
$$ plain form
6093 -5926 -17516 -988 14705 5839 -2030 -7719 -10915 5154 16339 22841 17350 19067 9329 -2029
6079 -2029 -16658 -15568 -24806 -24352 -28734 -23428 -13303 -4200 -7555 -7788 -19530 -14025 -7475 -7193 -7656
6064 -7656 -16567 -10850 -3177 -43 3660 -10534 -27432 -23218 -16008 -5345 9795 1535 -172 -3902
6050 -3902 -12287 -11876 -8329 -1199 2053 2205 17457 17935 20260 9618 -11740 -8722 -9831 -11577 -12444
6035 -12444 -1848 5112 -1136 -3677 -1029 2579 2784 -3965 -15018 -16282 -13942 -2324 8384 8287
6021 8287 8026 277 -5183 -4639 8563 9202 13800 4997 -1002 -4332 2529 5212 13696 7837 1797
6006 1797 -6302 -15543 -28666 -25533 -14046 -3116 4562 1185 8360 -7620 -13971 -16936 -12605 -28415
5992 -28415 -33936 -29715 -23266 -18974 -11299 -8851 -3512 -8591 9445 15439 1807 -10128 -5390 -10674
$$ packed form
6093e926j1590J6528J5693q866p869n689l196J6069J1185O502n491J717r738j1358
6079b029j4629J090r238M54m382N306J0125R103l355k33j1742N505O550K82m63
6064g656q911N717P673L134L703j4194j6898M214P210J0663J5140q260j707l730
6050c902q385M11L547P130L252J52J5252M78K325j0642k1358L018j109j746q67
6035a2444J0596O960o248k541K648L608K05o749j1053j264K340J1618J0708r7
6021H287k61p749n460N44J3202O39M598q803n999l330O861K683Q484n859o040
6006A797q099r241j3123L133J1487J0930P678l377P175j5980o351k965M331j5810
5992b8415n521M221O449M292P675K448N339n079J8036N994j3632j1935M738n284
$$ plain form
5978 -10674 -5909 -4755 -3474 2731 -9427 -11869 -15113 -20982 -9202 -12536 -14796 -1326 5924 276
5964 276 -2583 -7246 -12032 -8737 388 333 -11257 -22704 -12868 3680 17508 17742 21833 -4851 -9149
5949 -9149 -18161 -14552 8929 4633 -901 4338 5131 -1656 9037 -4109 -14744 -16625 -15782 -28991
5935 -28991 -45426 -32045 -12710 -15154 -8065 -583 -9798 1680 2224 -3243 -184 -4143 -19087 -14145
5921 -14145 1898 9074 -12684 -18986 -23980 -12920 -4146 -3369 -3571 -12467 -14986 -8275 -5009 -8249
5907 -8249 -560 3551 -7905 -1142 6894 6180 14626 28598 33118 34444 34673 21234 12432 4443 6843
5892 6843 6928 3261 3818 -9067 -14405 -2833 16609 13337 9207 1813 485 -4537 -3775 -4296 -22175
5877 -22175 -29783 -23972 -24840 -20340 -10635 -8049 -5416 7598 16147 14278 1104 -4887 -3021 -13602
$$ packed form
5978a0674M765J154J281O205j2158k442l244n869J1780l334k260J3470P250n648
5964B76k859m663m786L295R125n5j1590j1447R836J6548J3828K34M091k6684m298
5949i149r012L609K3481m296n534N239P93o787J0693j3146j0635j881Q43j3209
5935b8991j6435J3381J9335k444P089P482r215J1478N44n467L059l959j4944M942
5921a4145J6043P176k1758o302m994J1060Q774P77k02q896k519O711L266l240
5907h249P689M111j1456O763Q036p14Q446J3972M520J326K29j3439q802p989K400
5892F843Q5l667N57j2885n338J1572J9442l272m130p394j328n022P62n21j7879
5877b2175p608N811q68M500R705K586K633J3014Q549j869j3174n991J866j0581
$$ plain form
5863 -13602 -12036 -2144 -3495 -7663 -9897 -4757 2357 -3756 -13235 -12320 -13399 -18187 -4702 6392
5849 6392 8148 7239 -1362 -12323 -8357 -3152 1177 670 -5260 -7250 2346 2912 16575 25067 13203
5834 13203 -8641 -12724 -7482 -9218 -4837 -11567 -22692 -22678 -5509 1957 10669 967 -5794 5503
5820 5503 11611 6924 1560 -2346 -6124 -204 10379 -3621 -5426 -1981 3830 6113 10066 16759
5806 16759 9594 2216 -1712 2146 -4235 -8518 -3606 -339 -7197 -3847 -8120 -11805 -11000 -1871 8322
5791 8322 12160 -290 -7261 -3641 5332 17925 11789 -1051 6355 9867 6852 5808 12268 24513
5777 24513 9922 -10989 -12702 -5066 -2518 3247 133 7178 3827 5832 4124 4942 4795 -2355 -7838
5762 -7838 -3502 4971 4994 -7745 -14926 -10011 -8783 -502 -5306 -11008 -2335 2125 -2688 -11072 -9789
$$ packed form
5863a3602J566R892j351m168k234N140P114o113r479R15j079m788J3485J1094
5849F392J756r09q601j0961L966N205M329n07n930j990R596N66J3663Q492j1864
5834A3203k1844m083N242j736M381o730j1125J4J7169P466Q712r702o761J1297
5820E503O108m687n364l906l778N920J0583j4000j805L445N811K283L953O693
5806A6759p165p378l928L858o381m283M912L267o858L350m273l685Q05R129J0193
5791H322L838j2450o971L620Q973J2593o136j2840P406L512l015j044O460J2245
5777B4513j4591k0911j713P636K548N765l114P045l351K005j708Q18j47p150n483
5762g838M336Q473K3j2739p181M915J228Q281m804n702Q673M460m813q384J283
$$ plain form
5747 -9789 -5155 920 -1505 10659 13563 8386 -5678 -28360 -27143 -11721 -17599 -17494 -26599 -19865
5733 -19865 -12898 -21207 -21905 -7015 -7123 -11805 -10249 9127 1936 -21562 -17635 -21720 -28895 -24150
5719 -24150 -6226 6263 -2271 695 6755 1636 -8965 7102 13971 -5523 -3202 5955 5187 -2112
5705 -2112 6974 -3737 -4026 -222 4728 3993 2458 2423 -3545 -7085 -17965 -22649 -16938 2727 -350
5690 -350 -5309 -9477 -17253 -8460 5925 14300 -755 -7858 -6451 -3641 -4825 -8568 -16762 -3618
5676 -3618 3023 20210 22174 15581 20931 7396 687 -9383 5625 9668 13672 11104 6835 -1052
5662 -1052 -13323 -5221 6456 20887 13673 -895 -2700 3712 6932 -6475 -9004 -20281 -25928
5649 -25928 -11942 10717 9995 6264 9349 1399 -6595 -5830 -5091 -2219 4075 -4662 -6476 -21854 -24028
$$ packed form
5747i789M634O075k425J2164K904n177j4064k2682J217J5422n878J05r105O734
5733a9865O967q309o98J4890j08m682J556J9376p191k3498L927m085p175M745
5719b4150J7924J2489q534K966O060n119j0601J6067O869j9494K321R157p68p299
5705b112R086j0711k89L804M950p35j535l5n968l540j0880m684N711J9665l077
5690c50m959m168p776Q793J4385Q375j5055p103J407K810j184l743q194J3144
5676c618O641J7187J964o593N350j3535o709j0070J5008M043M004k568m269p887
5662a052j2271Q102J1677J4431p214j4568j805O412L220j3407k529j1277n647
5649b5928J3986K2659p22l731L085p950p994P65P39K872O294q737j814j5378k174
$$ plain form
5634 -24028 -23635 -25691 -23750 -29598 -25175 -12496 -10550 -10234 -11453 -10077 3159 3871 281 -4090 6270
5619 6270 16638 13887 19330 7083 3657 -6716 -21715 -2431 -961 -5031 7574 657 4073
5606 4073 -1436 -4694 6317 1034 -5106 -84 3904 4302 -9626 551 5125 2818 11319 18384
5592 18384 7424 -8679 -16766 -28697 -41183 -42339 -41053 -29051 -14641 -11701 -7396 -5135 -1162
5579 -1162 1655 10336 4349 -537 11177 14651 1094 4835 12844 10312 12556 6257 -12288 -8847
5565 -8847 -20239 -30844 -26373 -10414 -4806 10542 10317 5476 4024 -4717 -8582 -10409 -11775 -16101
5551 -16101 -15443 -5477 -2139 -7822 -25659 -30199 -19467 -15785 -16349 -14707 -14562 -9619 -2536 7831 -721
5536 -721 1133 -406 -4383 -1946 10177 8400 9578 10678 1869 4152 9576 5550 -1045 1135 6755
$$ packed form
5634b4028L93k056J941n848M423J2679J946L16j219J376J3236P12l590m371J0360
5619F270J0368k751N443j2247l426j0373j4999J9284J470m070J2605o917L416
5606D073n509l258J1011n283o140N022L988L98j3928J0177M574k307Q501P065
5592A8384j0960j6103q087j1931j2486j156J286J2002J4410K940M305K261L973
5579a162K817Q681n987m886J1714L474j3557L741Q009k532K244o299j8545L441
5565h847j1392j0605M471J5959N608J5348k25m841j452q741l865j827j366m326
5551a6101O58R966L338n683j7837m540J0732L682n64J642J45M943P083J0367q552
5536g21J854j539l977K437J2123j777J178J100q809K283N424m026o595K180N620
$$ plain form
5521 6755 6717 6184 3081 4445 14732 25883 23116 19954 19675 24678 38452 38363 31827 18256 5786
5506 5786 5400 4577 7107 -3971 -8115 -7185 4223 10194 19844 15412 840 4044 6879 9586 11395
5491 11395 -4920 -3579 -4356 -11244 -11798 -23187 -14232 -4841 -6212 14172 15683 -549 -9189 -13078
5477 -13078 -10244 167 3248 -3712 -4792 4322 1585 -5166 5832 1380 1677 5556 17231 11168
5463 11168 -1979 3871 -180 -4686 -8564 -4796 -315 2092 -962 -8642 1216 -8120 -17773 -25421
5449 -25421 -9496 3501 6988 6069 -9666 -12147 -21483 -30718 -24831 -20090 -24981 -13081 7194 7296
5435 7296 -8435 -19971 -20297 -9069 -9457 -15420 -25096 -28225 -17514 -17205 -9492 -10210 -14309 -10170 2062
5420 2062 5968 3384 10040 9407 21651 16081 8008 -812 -3677 1452 12217 16497 10203 15145 12012
$$ packed form
5521F755l8n33l103J364J0287J1151k767l162k79N003J3774q9o536j3571j2470
5506E786l86q23K530j1078m144R30J1408N971R650m432j4572L204K835K707J809
5491A1395j6315J341p77o888n54j1389Q955R391j371K0384J511j6232q640l889
5477a3078K834J0411L081o960j080R114k737o751J0998m452K97L879J1675o063
5463A1168j3147N850m051m506l878L768M481K407l054p680R858r336r653p648
5449b5421J5925J2997L487r19j5735k481r336r235N887M741m891J1900K0275J02
5435G296j5731j1536l26J1228l88n963r676l129J0711L09P713p18m099M139J2232
5420B062L906k584O656o33J2244n570q073q820k865N129J0765M280o294M942l133
$$ plain form
5405 12012 -4063 -2422 1628 7404 6282 -2153 -13950 -8603 -18134 -19036 -15795 -12127 -4718 2158
5391 2158 266 -243 -2958 -14422 -12537 3622 1442 5141 8175 3785 4641 365 -4188 -8421 -2379
5376 -2379 -8881 -6879 -243 2389 1108 7334 2148 1145 6666 1202 -16666 -23380 -7726 -5537
5362 -5537 -11122 -20767 -19179 -14338 -27839 -41048 -30446 -6899 1923 2866 19026 32630 36011 33757
5348 33757 10190 -7338 -5064 -2310 1485 12950 6100 5472 1018 2238 2247 18824 19488 13433 8961
5333 8961 4200 8821 13134 22423 15760 -2232 -15982 -13740 -9660 -4186 -7370 -13156 -18337 -22389
5319 -22389 -20975 -11385 -6791 -4229 749 403 36 1148 -3993 -7527 -6732 -13034 -15025 -25210 -23278
5304 -23278 -7000 -9364 -8327 -11923 -19395 -26020 -28376 -26231 -15380 -3609 3864 7810 13586 12368
$$ packed form
5405A2012j6075J641M050N776j122q435j1797N347r531r02L241L668P409O876
5391B158j892n09k715j1464J885J6159k180L699L034m390Q56m276m553m233O042
5376b379o502K002O636K632j281O226n186j003N521n464j7868o714J5654K189
5362e537n585r645J588M841j3501j3209J0602K3547Q822R43J6160J3604L381k254
5348C3757k3567j7528K274K754L795J1465o850o28m454J220RJ6577O64o055m472
5333H961m761M621M313R289o663j7992j3750K242M080N474l184n786n181m052
5319b2389J414R590M594K562M978l46l67J112n141l534P95o302j991j0185J932
5304b3278J6278k364J037l596p472o625k356K145J0851J1771P473L946N776j218
$$ plain form
5290 12368 21431 30823 40915 35300 26836 26171 20231 12727 10005 5307 -6947 -16399 -17126 -13347 1830
5275 1830 -6346 1634 1068 7549 11463 14687 14080 10169 18946 23002 24118 28677 14557 2057 3272
5260 3272 9539 -5832 -31370 -26030 -23191 -16987 -25480 -38267 -29812 -14968 3274 11511 1586 -7362
5246 -7362 -8245 2860 4017 -3710 -8856 -2570 -20181 -21539 -1960 -2815 5143 12842 20226 -1547
5232 -1547 -4516 1416 6237 2631 -10413 -2687 2557 7777 5269 -8821 -3662 -1886 -3151 -14420
5218 -14420 -10092 -10058 -11080 -14089 -13012 -8469 -18282 -21015 -4825 876 -565 2220 16665 16468 6584
5203 6584 4017 -6544 -20929 -27238 -9688 2383 -2348 -1277 -2739 -11484 -7650 9692 15355 6067
5189 6067 2405 8641 5767 5774 27277 50211 32150 21590 7251 6413 20195 20806 7691 4620
$$ packed form
5290A2368R063R392J0092n615q464o65n940p504k722m698j2254r452p27L779J5177
5275A830q176P980n66O481L914L224o07l911Q777M056J116M559j4120j2500J215
5260C272O267j5371k5538N340K839O204q493j2787Q455J4844J8242Q237r925q948
5246g362q83J1105J157p727n146O286j7611j358J9579q55P958P699P384k1773
5232a547k969N932M821l606j3044P726N244N220k508j4090N159J776j265j1269
5218a4420M328L4j022l009J077M543r813k733J6190N701j441K785J4445j97r884
5203F584k567j0561j4385o309J7550J2071m731J071j462q745L834J7342N663r288
5189F067l662O236k874PK1503K2934j8061j0560j4339q38J3782O11j3115l071
$$ plain form
5175 4620 2921 -3256 12079 17262 18099 10115 3779 13507 9177 -16 -13338 -11667 -15907 -20599 -17900
5160 -17900 -3478 -6658 -8201 -8169 -11788 -24681 -14673 -5204 5732 8450 -1923 2229 4315 -4334
5146 -4334 -2699 -3717 1917 8485 11323 -4086 -6939 -18803 -22579 -23438 -2145 -6826 -14207 -16381
5132 -16381 -3235 6344 7979 1178 2264 -1084 -10039 -14000 -6639 3486 16348 11131 -4601 -10904
5118 -10904 -8338 5572 1646 10108 10822 6353 8601 2029 -3043 -1572 4615 13505 4534 -2295 13084
5103 13084 18419 12826 17291 22262 17999 2548 -7977 -5893 -11392 -6698 -191 789 5463 -5230
5089 -5230 -5084 -6057 -2733 -8931 -18827 -20000 -16251 -14660 -17420 -17167 -19617 -23899 -19039 -9688 3631
5074 3631 7258 -5404 -6827 -7492 -4045 -1901 -3586 183 5577 311 -3940 1081 -9082 -16919 -22912
$$ packed form
5175D620j699o177J5335N183Q37p984o336R728m330r193j3322J671m240m692K699
5160a7900J4422l180j543L2l619j2893J0008R469J0936K718j0373M152K086q649
5146d334J635j018N634O568K838j5409k853j1864l776q59K1293m681p381k174
5132a6381J3146R579J635o801J086l348q955l961P361J0125J2862n217j5732o303
5118a0904K566J3910l926Q462P14m469K248o572n072J471O187Q890q971o829J5379
5103A3084N335n593M465M971m263j5451j0525K084n499M694O507R80M674j0693
5089e230J46r73L324o198r896j173L749J591k760K53k450m282M860R351J3319
5074C631L627j2662j423o65L447K144j685L769N394n266m251N021j0163p837n993
$$ plain form
5059 -22912 -20662 -12544 1496 5129 -4346 -14276 -15630 -2780 8495 3401 5505 19271 8589
5046 8589 1132 315 1320 -4150 -8368 -4483 -13535 -13028 -20784 -28879 -31656 -36271 -24512 -1566 -10877
5031 -10877 -15180 -11345 -16623 -10303 627 -4760 -9763 -6071 -2812 -1851 4549 -6263 6336 7333
5017 7333 17519 34019 25650 2469 2557 16157 15244 15945 13794 10304 12925 413 -15480 -22061
5003 -22061 -19973 -18251 -17736 -17109 -9396 -6901 -3676 3068 -4558 -6587 -736 -4519 802 5729 -6476
4988 -6476 -5021 -777 -829 -19211 -22498 -21664 -26885 -18139 4920 12204 11466 10038 -3511 -4502 4467
4973 4467 -1353 -6612 -13619 -12557 -4891 -6688 -8673 -9758 -2294 9616 14631 18888 7358 -4455
4959 -4455 -24621 -29414 -17949 -14466 -21765 -23952 -21364 -20506 -11921 -10363 -8382 -5612 -16327 -8863
$$ packed form
5059b2912K250Q118J4040L633r475r930j354J2850J1275n094K104J3766j0682
5046H589p457q17J005n470m218L885r052N07p756q095k777m615J1759K2946r311
5031a0877m303L835n278O320J0930n387n003L692L259R61O400j0812J2599R97
5017G333J0186J6500q369k3181Q8J3600r13P01k151l490K621j2512j5893o581
5003b2061K088J722N15O27P713K495L225O744p626k029N851l783N321M927j2205
4988f476J455M244n2j8382l287Q34n221Q746K3059P284p38j428j3549r91Q969
4973D467n820n259p007J062P666j797j985j085P464J1910N015M257j1530j1813
4959d455k0166m793J1465L483p299k187K588Q58Q585J558J981K770j0715P464
$$ plain form
4945 -8863 2183 -2878 -281 -3680 -8565 -3912 -5455 -6514 3472 7475 -2454 -3126 -218 -2417 -5332
4930 -5332 -14523 -34632 -31089 -18940 -10261 7196 21469 23614 8578 8827 7592 3703 -3879 -9217
4916 -9217 -6619 7805 -8275 -13093 -12206 -12032 -9218 -7271 -2268 -1138 3640 -8783 -11356 -27504
4902 -27504 -22876 -15033 -18031 -13699 -1681 12402 5387 1355 -7091 -7691 -143 3473 -2101 10230
4888 10230 12441 9982 6623 1411 1952 -6133 -3721 -4019 -1995 11627 6794 -4979 -20285 -9673
4874 -9673 9193 13346 10488 17421 5065 -7562 -14287 -1056 763 -1928 10179 8205 -3803
4861 -3803 -9810 -7493 -4306 -10064 5652 -1067 -20779 -17497 -13892 -11504 -10647 -2442 -17639 -23584
4847 -23584 -3873 -33 10942 11734 593 -3985 -17655 -15929 -10208 -4742 2427 8225 -2472 1414
$$ packed form
4945h863J1046n061K597l399m885M653j543j059R986M003r929o72K908k199k915
4930e332r191k0109L543J2149Q679J7457J4273K145j5036K49j235l889p582n338
4916i217K598J4424j6080m818Q87J74K814J947N003J130M778j2423k573j6148
4902b7504M628P843k998M332J2018J4083p015m032q446o00P548L616n574J2331
4888A0230K211k459l359n212N41q085K412k98K024J3622m833j1773j5306J0612
4874i673J8866M153k858O933j2356j2627o725J3231J819k691J2107j974j2008
4861c803o007K317L187n758J5716o719j9712L282L605K388Q57Q205j5197n945
4847b3584J9711L840J0975P92j1141m578j3670J726N721N466P169N798j0697L886
$$ plain form
4833 1414 303 -4955 5104 6443 7798 10369 -5558 -13046 -1605 1733 16731 14559 -6558 -18386
4819 -18386 -12565 7502 11384 11752 172 -8802 -631 -7866 -9843 -3643 2943 -1683 117 1088 8027
4804 8027 5458 9083 12646 6206 8806 1556 -6181 -1510 1879 4039 10159 8046 1457 18540 28632
4789 28632 16829 11810 13279 -2106 -8603 -7569 -5423 -413 -338 -7724 -22635 -7412 -4401 6604
4775 6604 15928 14382 9586 11557 11282 13819 8289 2553 844 9366 11824 5136 7834 2034 -3596
4760 -3596 -6534 -7679 -6541 -13543 -23726 -26290 -15582 -17721 -26380 -22628 -21806 -12761 -28187 -34981
4746 -34981 -18454 -5485 16948 26342 13603 -10121 -15415 -2403 13681 13862 -670 -12109 -20690
4733 -20690 -24699 -18321 -14546 -14047 -20901 -27476 -22558 -11785 -5167 -1757 -12667 -15255 4788 10636
$$ packed form
4833A414j111n258J0059J339J355K571j5927p488J1441L338J4998k172k1117j1828
4819a8386N821K0067L882L68j1580q974Q171p235j977O200O586m626J800R71O939
4804H027k569L625L563o440K600p250p737M671L389K160O120k113o589J7083J0092
4789B8632j1803n019J469j5385o497J034K146N010P5p386j4911J5223L011J1005
4775F604R324j546m796J971k75K537n530n736j709Q522K458o688K698n800n630
4760c596k938j145J138p002j0183k564J0708k139q659L752Q22R045j5426o794
4746c4981J6527J2969K2433R394j2739k3724n294J3012J6084J81j4532j1439q581
4733b0690m009O378L775M99o854o575M918J0773O618L410j0910k588K0043N848
$$ plain form
4719 10636 743 6996 8069 1246 8522 3358 -16939 -23098 -20257 -16869 -2432 -4311 705 -9932
4705 -9932 -19834 -10806 -16387 -13507 -760 4004 3829 2664 -4519 1263 -105 -7167 -19712 -20436 -7040
4690 -7040 -6604 -13401 -12292 -6800 -8736 -2313 -7810 -6006 -6314 -15223 -10750 -1906 -5957 -11218 -23178
4675 -23178 -16715 -5496 -18399 -30063 -34714 -30087 -17079 -15924 -3464 4653 -9042 -15670 -5318
4662 -5318 2344 -2137 -9277 -13077 -12414 -12012 -12432 -17990 -15208 -5976 -8147 -15646 -17502 -10602 -8171 7802
4646 7802 10534 9783 10602 8774 2436 -4268 -9395 -6975 9202 12718 -4393 -7179 3315 1478 -2937
4631 -2937 4777 16036 13004 6193 -7324 -7478 66 1548 -5792 -9874 -15545 -6416 1757 15194
4617 15194 14127 19093 -2833 -25431 -17996 -14317 -10841 -16051 -8961 -1981 -3011 -709 -2913 -5098
$$ packed form
4719A0636r893O253J073o823P276n164k0297o159K841L388J4437j879N016j0637
4705i932r902R028n581K880J2747M764j75j165p183N782j368p062j2545p24J3396
4690g040M36o797J109N492j936O423n497J804l08q909M473Q844m051n261j1960
4675b3178O463J1219j2903j1664m651M627J3008J155J2460Q117j3695o628J0352
4662e318P662m481p140l800O63M02m20n558K782R232k171p499j856O900K431J5973
4646G802K732p51Q19j828o338o704n127K420J6177L516j7111k786J0494j837m415
4631b937P714J1259l032o811j3517j54P544J482p340m082n671R129Q173J3437
4617A5194j067M966k1926k2598P435L679L476n210P090O980j030K302k204k185
$$ plain form
4603 -5098 -5431 1907 7042 7150 1263 -1413 18213 39756 45705 23676 9714 14450 -7524 -8402
4589 -8402 7996 4579 2835 -10773 -24946 -27879 -23751 -21787 -9203 1682 12960 18940 20030
4576 20030 8117 -5061 -7017 3748 17641 13289 11930 13533 14341 4555 5761 8894 20791 14667
4562 14667 4112 13455 15930 4732 3372 486 -6672 -12172 -20965 -10465 -1932 -14593 -19951 1804
4548 1804 8498 -2342 -2401 12577 30102 31791 11492 1573 6321 15501 23427 21147 17128 8157
4534 8157 -8929 -5381 -10004 -19103 -18247 -19932 -16916 -8489 -4335 -3860 -11794 -11854 -6025 -265 781 1309
4518 1309 7672 10724 1787 155 3881 14388 23073 12276 362 -6692 -3890 -2793 -4908 -14183
4504 -14183 -6874 13815 28843 27894 16967 12859 17175 6229 -4155 6419 5910 -20918 -8745
$$ packed form
4603e098l33P338N135J08n887k676J9626K1543N949k2029j3962M736k1974q78
4589h402J6398l417j744j3608j4173k933M128J964J2584J0885J1278N980J090
4576B0030j1913j3178j956J0765J3893m352j359J603Q08r786J206L133J1897o124
4562A4667j0555R343K475j1198j360k886p158n500q793J0500Q533j2661n358K1755
4548A804O694j0840n9J4978J7525J689k0299r919M748R180P926k280m019q971
4534H157j7086L548m623r099Q56j685L016Q427M154M75p934o0N829N760J046N28
4518A309O363L052q937j632L726J0507Q685j0797j1914p054K802J097k115r275
4504a4183P309K0689J5028r49j0927m108M316j0946j0384J0574n09k6828J2173
$$ plain form
4491 -8745 -4507 -3274 4773 4355 -7781 -7314 -4316 -4313 -10177 -9888 -5910 4387 7100 641 -8230 -5773
4475 -5773 100 1617 -3209 -2398 -2334 11042 20467 15340 8400 4208 11311 7391 -3949 -1260 4458
4460 4458 16387 -207 -12515 -16065 -19989 -19143 -17913 -5732 9810 10212 17417 1726 -13891 -12895
4446 -12895 -7 -5627 -20381 -22644 -22588 -9055 -8872 -15303 -10803 -9238 4998 -139 -10073 -3452
4432 -3452 2199 -998 -2713 4120 1010 -1807 -11329 -11496 -4878 9924 12063 7068 -2355 -11038 -19328
4417 -19328 -12906 -4723 -4861 -9210 -2735 6463 10655 11747 4084 -9635 -10910 -4867 -8056 9108
4403 9108 27829 31371 19270 -2750 -16557 -13872 -7678 -525 -9408 -29477 -12640 -8336 -13616
4390 -13616 -13746 -18060 -19339 -9296 -4649 -3293 -1623 -4080 -991 -7970 -9014 -4581 65 2928 13694
$$ packed form
4491h745M238J233Q047m18j2136M67K998Ln864K89L978J0297K713o459q871K457
4475e773N873J517m826Q11O4J3376R425n127o940m192P103l920j1340K689N718
4460D458J1929j6594j2308l550l924Q46J230J2181J5542M02P205j5691j5617R96
4446a2895J2888n620j4754k263N6J3533J83o431M500J565J4236n137r934O621
4432c452N651l197j715O833l110k817r522j67O618J4802K139m995r423q683q290
4417a9328O422Q183j38m349O475R198M192J092p663j3719j275O043l189J7164
4403I108J8721L542j2101k2020j3807K685O194P153q883k0069J6837M304n280
4390a3616j30m314j279J0043M647J356J670k457L089o979j044M433M646K863J0766
$$ plain form
4375 13694 10883 10395 12724 9167 2198 -11797 -11092 -7432 -9097 -7475 2129 -499 -1841 -4833 -4595
4360 -4595 -3757 5157 -2018 -15451 -7653 3333 -5921 -6576 2506 23491 25085 27353 26874 20714 18719
4345 18719 9705 10989 13787 12598 -1073 876 8612 10011 5251 2232 -4322 -7067 -10452 -9469 -4462
4330 -4462 -4315 -4805 -1068 5402 14247 5636 -1302 8661 12834 14442 12497 2698 6405 7597 5829
4315 5829 2545 2229 7500 278 -14904 -27876 -30461 -13291 6804 5356 -57 -1626 -6755 6167
4301 6167 15862 15069 2610 -11220 -11169 -3136 -5812 -14572 -26975 -28241 -14871 15 11823 13862
4287 13862 9024 2869 7136 12060 7091 9308 17714 12001 -3921 -1824 17844 13339 9709 1025
4273 1025 4691 8472 8770 -344 -20430 -14556 19435 33131 21858 10459 3976 -568 4659 12826
$$ packed form
4375A3694k811m88K329l557o969j3995P05L660j665J622R604k628j342k992K38
4360d595Q38Q914p175j3433P798J0986r254o55R082K0985J594K268m79o160j995
4345A8719r014J284K798j189j3671J949P736J399m760l019o554k745l385R83N007
4330d462J47m90L737O470Q845q611o938R963M173J608j945r799L707J192j768
4315E829l284l16N271p222j5182j2972k585J7170K0095j448n413j569n129J2922
4301F167R695p93j2459j3830N1Q033k676q760j2403j266J3370J4886J1808K039
4287A3862m838o155M267M924m969K217Q406n713j5922K097J9668m505l630q684
4273A025L666L781K98r114k0086N874L3991J3696j1273j1399o483m544N227Q167
$$ plain form
4259 12826 7503 886 4942 8270 14465 10999 10743 15258 3611 -8520 -1092 -6701 -59 7120
4245 7120 3630 -4174 -3582 12587 15596 320 -2456 7742 2070 -2941 -4422 -8521 -15640 -21774
4231 -21774 -15008 -6199 9579 29178 26678 12855 -1816 -2680 -9353 -21891 -18345 -23023 -15784 50
4217 50 -2518 -3434 183 -4649 -5225 -9561 -12885 -6314 -3 7860 30611 31447 28242 25212 23350 18114
4201 18114 15889 16752 2158 -1301 1809 -4818 -8508 -5799 194 10665 22621 15450 5972 3773
4187 3773 2133 -5920 -8645 1661 8950 7979 2119 6813 6257 -8041 -3763 3833 5157 1767 -4247
4172 -4247 -15503 -22743 -6581 -6061 -12111 -10369 -7892 -21075 -24598 -21734 -13702 -3641 15923 15854
4158 15854 16575 15786 14005 -2732 -2450 3101 5714 -8258 -16311 -14639 -11964 -133 14089 6373
$$ packed form
4259A2826n323o617M056L328O195l466k56M515j1647j2131P428n609O642P179
4245G120l490p804N92J6169L009j5276k776J0198n672n011j481m099p119o134
4231b1774O766Q809J5778J9599k500j3823j4671q64o673j2538L546m678P239J5834
4217E0k568r16L617m832n76m336l324O571O311P863K2751Q36l205l030j862n236
4201A8114k225Q63j4594l459L110o627l690K709N993J0471J1956p171r478k199
4187C773j640q053k725J0306P289r71n860M694n56j4298M278P596J324l390o014
4172d247j1256p240J6162N20o050J742K477j3183l523K864Q032J0061J9564o9
4158A5854P21p89j781j6737K82N551K613j3972q053J672K675J1831J4222p716
$$ plain form
4144 6373 -2391 4789 -1203 -1328 7914 5257 7441 21033 26326 9323 -8608 -7916 -1391 12651
4130 12651 18238 14081 11855 11161 14367 5410 2809 -11831 -14167 -9457 -12966 -5620 1746 9 -4530
4115 -4530 -498 -1370 -6861 -15740 -8637 -8810 -9399 -14066 -12573 3206 -4309 -20796 -6374 9951 590
4100 590 -9044 -16592 -10887 -12149 785 6166 2801 -3997 3922 4228 -3663 25 -11322 -17549 -19513
4085 -19513 -28423 -21823 -13682 -10727 -15471 -106 -4122 -11934 -6083 -3716 -16552 -8881 -9466 -9748 -4433
4070 -4433 3057 11251 10003 3512 -5759 -5589 -8468 -2865 1719 -9172 183 7844 2436 -6012 -9040
4055 -9040 2186 10197 12661 6262 262 5576 -4764 -7812 11126 -539 -22396 -21478 -12936 -6984
$$ packed form
4144F373q764P180n992j25R242k657K184J3592N293j7003j7931O92O525J4042
4130A2651N587m157k226o94L206q957k601j4640k336M710l509P346P366j737m539
4115d530M032q72n491q879P103j73n89m667J493J5779p515j6487J4422J6325r361
4100E90r634p548N705j262J2934N381l365o798P919L06p891L688j1347o227j964
4085a9513q910O600Q141K955m744J5365m016p812N851K367j2836P671n85k82N315
4070d433P490Q194j248o491r271J70k879N603M584j0891R355P661n408q448l028
4055i040J1226Q011K464o399o000N314j0340l048J8938j1665k1857R18Q542N952
$$ [...]
##END NTUPLES=NMR SPECTRUM
##END=
