##TITLE=Analysis number 317995
Compound Code cc 01309
Project Code adrs
Chemist Name fudan
##JCAMPDX= 6.0         $$ Bruker NMR JCAMP-DX V2.0
##DATA TYPE= NMR SPECTRUM
##DATA CLASS= NTUPLES
##ORIGIN= Bruker BioSpin GmbH
##OWNER= nmr
$$ XWIN-NMR		Version 3.5
$$ Fri Mar 10 09:08:13 2006 GMT Standard Time (UT+0h)  MAYBRIDGE\nmr@NMR_250MHZ
##.OBSERVE FREQUENCY= 250.131544655141
##.OBSERVE NUCLEUS= ^1H
##.ACQUISITION MODE= SIMULTANEOUS (DQD)
##.ACQUISITION SCHEME= undefined
##.AVERAGES= 16
##.DIGITISER RES= 18
##SPECTROMETER/DATA SYSTEM= dpx250
##.PULSE SEQUENCE= zg30
##.SOLVENT NAME= CDCl3
##.SHIFT REFERENCE= (INTERNAL, CDCl3, 0, 16.522)
##AUDIT TRAIL= $$ (NUMBER, WHEN, WHO, WHERE, WHAT)
$$ ##TITLE= Audit trail, XWIN-NMR		Version 3.5
$$ ##JCAMPDX= 5.01
$$ ##ORIGIN= Bruker BioSpin GmbH
$$ ##OWNER= nmr
$$ C:\u/data/dgb/nmr/ADRS/420/pdata/1/auditp.txt
$$ ##AUDIT TRAIL=  $$ (NUMBER, WHEN, WHO, WHERE, WHAT)
(   1,<2006-03-10 09:07:51.95 +000>,<MAYBRIDGE\nmr>,<NMR_250MHZ>,
      <created by zg, POWCHK disabled, PULCHK disabled
       configuration hash MD5:
       84 BC 41 DB A1 6E 1D 46 DA 25 12 A5 C1 ED C5 3A
       data hash MD5: 64K
       BE 66 69 70 C8 49 AE 81 ED 46 6C ED 57 D1 B0 B9>)
(   2,<2006-03-10 09:08:03.98 +000>,<MAYBRIDGE\nmr>,<NMR_250MHZ>,
      <Start of raw data processing
       ef LB = 0.3 FT_mod = 6 PKNL = 1 SI = 32K 
       data hash MD5: 32K
       AF 77 5C A1 19 31 F4 A4 D6 1E AB B9 9B 5C F0 1C>)
(   3,<2006-03-10 09:08:05.72 +000>,<MAYBRIDGE\nmr>,<NMR_250MHZ>,
      <apk 
       data hash MD5: 32K
       B4 00 FF F9 1F B7 09 A7 90 0B A8 18 3D 25 6E FE>)
(   4,<2006-03-10 09:08:06.63 +000>,<MAYBRIDGE\nmr>,<NMR_250MHZ>,
      <abs ABSG = 5 
       data hash MD5: 32K
       A0 4D 90 BD 31 DC 67 F5 D1 CB 79 3B 8A C6 42 58>)
$$ ##END=
$$ 
$$ hash MD5
$$ CE C6 8C D9 78 DB C3 66 98 3F DD 61 0B B5 7C 36
##$RELAX= 
##$RELAX= 
##$RELAX= 
##$RELAX= 
##$RELAX= 
##$RELAX= 
##$RELAX= 
$$ Bruker specific parameters
$$ --------------------------
##$DU= <C:\u>
##$EXPNO= 420
##$NAME= <ADRS>
##$PROCNO= 1
##$TYPE= <nmr>
##$USER= <dgb>
##$AMP= (0..31)
100 100 100 100 100 100 100 100 100 100 100 100 100 100 100 100 100 100 
100 100 100 100 100 100 100 100 100 100 100 100 100 100 
##$AQSEQ= 0
##$AQ_mod= 3
##$AUNM= <au_zg>
##$AUTOPOS= <2 >
##$BF1= 250.13
##$BF2= 250.13
##$BF3= 250.13
##$BF4= 250.13
##$BF5= 500.13
##$BF6= 500.13
##$BF7= 500.13
##$BF8= 500.13
##$BYTORDA= 1
##$CFDGTYP= 0
##$CFRGTYP= 5
##$CHEMSTR= <none>
##$CNST= (0..31)
1 1 145 1 1 1 1 1 1 1 1 1 1 1 1 1 1 1 1 1 1 1 1 1 1 1 1 1 1 1 1 1 
##$CPDPRG= <>
##$CPDPRG1= <>
##$CPDPRG2= <>
##$CPDPRG3= <>
##$CPDPRG4= <mlev>
##$CPDPRG5= <mlev>
##$CPDPRG6= <mlev>
##$CPDPRG7= <mlev>
##$CPDPRG8= <mlev>
##$CPDPRGB= <>
##$CPDPRGT= <>
##$D= (0..31)
0 1 0 0 0 0 0 0 0 0.06 0 0 0 0 0 0 0.0002 0 0 0 0 0 0 0 0 0 0 0 0 0 0 
0 
##$DATE= 1141981670
##$DBL= (0..7)
120 120 120 120 120 120 120 120 
##$DBP= (0..7)
150 150 150 150 150 150 150 150 
##$DBP07= 0
##$DBPNAM0= <>
##$DBPNAM1= <>
##$DBPNAM2= <>
##$DBPNAM3= <>
$$ [...]
##$SUBNAM7= <"">
##$SUBNAM8= <"">
##$SUBNAM9= <"">
##$SW= 20.6930455092707
##$SWIBOX= (0..15)
0 0 3 0 0 0 0 0 0 0 0 0 0 0 0 0 
##$SW_h= 5175.983436853
##$TD= 65536
##$TD0= 1
##$TE= 293.16
##$TE2= 300
##$TE3= 300
##$TEG= 300
##$TL= (0..7)
0 120 120 120 120 120 120 120 
##$TP= (0..7)
150 150 150 150 150 150 150 150 
##$TP07= 0
##$TPNAME0= <>
##$TPNAME1= <>
##$TPNAME2= <>
##$TPNAME3= <>
##$TPNAME4= <>
##$TPNAME5= <>
##$TPNAME6= <>
##$TPNAME7= <>
##$TPOAL= (0..7)
0.5 0.5 0.5 0.5 0.5 0.5 0.5 0.5 
##$TPOFFS= (0..7)
0 0 0 0 0 0 0 0 
##$TUNHIN= 0
##$TUNHOUT= 0
##$TUNXOUT= 0
##$USERA1= <user>
##$USERA2= <user>
##$USERA3= <user>
##$USERA4= <user>
##$USERA5= <user>
##$V9= 5
##$VALIST= <valist>
##$VCLIST= <CCCCCCCCCCCCCCC>
##$VD= 0
##$VDLIST= <DDDDDDDDDDDDDDD>
##$VPLIST= <PPPPPPPPPPPPPPP>
##$VTLIST= <TTTTTTTTTTTTTTT>
##$WBST= 1024
##$WBSW= 4
##$XGAIN= (0..3)
0 0 0 0 
##$XL= 0
##$YL= 0
##$YMAX_a= 444376
##$YMIN_a= -415839
##$ZGOPTNS= <>
##$ZL1= 120
##$ZL2= 120
##$ZL3= 120
##$ZL4= 120
##$ABSF1= 16.522
##$ABSF2= -4.171173
##$ABSG= 5
##$ABSL= 3
##$ALPHA= 0
##$AQORDER= 0
##$ASSFAC= 0
##$ASSFACI= 0
##$ASSFACX= 0
##$ASSWID= 0
##$AUNMP= <proc_1d>
##$AZFE= 0.1
##$AZFW= 0.1
##$BCFW= 0
##$BC_mod= 0
##$BYTORDP= 0
##$COROFFS= 0
##$CY= 12.5
##$DATMOD= 1
##$DC= 0
##$DFILT= <>
##$DTYPP= 0
##$F1P= 14.0000005364418
##$F2P= -0.99999901652339
##$FCOR= 0.5
##$FTSIZE= 32768
##$FT_mod= 6
##$GAMMA= 0
##$GB= 0
##$INTBC= 1
##$INTSCL= 1
##$ISEN= 128
##$LB= 0.3
##$LEV0= 0
##$LPBIN= 0
##$MAXI= 10000
##$MC2= 0
##$MEAN= 0
##$ME_mod= 0
##$MI= 0
##$NCOEF= 0
##$NC_proc= -2
##$NLEV= 6
##$NOISF1= 0
##$NOISF2= 0
##$NSP= 0
##$NTH_PI= 0
##$NZP= 0
##$OFFSET= 16.522
##$PC= 1
##$PHC0= 18.25607
##$PHC1= 5.968547
##$PH_mod= 1
##$PKNL= yes
##$PPARMOD= 0
##$PSCAL= 4
##$PSIGN= 0
##$REVERSE= no
##$SF= 250.13
##$SI= 32768
##$SIGF1= 0
##$SIGF2= 0
##$SINO= 400
##$SIOLD= 32768
##$SREGLST= <1H.CDCl3>
##$SSB= 0
##$STSI= 32768
##$STSR= 0
##$SW_p= 5175.98343685301
##$SYMM= 0
##$S_DEV= 0
##$TDeff= 65536
##$TDoff= 0
##$TI= <Analysis number 999999
Compound Code 99
Book Reference 9
Project Code 9>
##$TILT= no
##$TM1= 0
##$TM2= 0
##$TOPLEV= 0
##$USERP1= <user>
##$USERP2= <user>
##$USERP3= <user>
##$USERP4= <user>
##$USERP5= <user>
##$WDW= 1
##$XDIM= 32768
##$YMAX_p= 358087893
##$YMIN_p= -272308
$$ End of Bruker specific parameters
$$ ---------------------------------
##NTUPLES= NMR SPECTRUM
##VAR_NAME=  FREQUENCY,     SPECTRUM/REAL,   SPECTRUM/IMAG
##SYMBOL=    X,             R,               I
##VAR_TYPE=  INDEPENDENT,   DEPENDENT,       DEPENDENT
##VAR_FORM=  AFFN,          ASDF,            ASDF
##VAR_DIM=   32768,         32768,           32768
##UNITS=     HZ,            ARBITRARY UNITS, ARBITRARY UNITS
##FACTOR=    0.157963299565203, 1,           1
##FIRST=     4132.6476996994, 0,             0
##LAST=      -1043.33573715361, 0,           0
##MIN=       -1043.33573715361, -272308,     0
##MAX=       4132.6476996994, 358087893,     0
$$ Real data points
##PAGE= N=1
##DATA TABLE= (X++(R..R)), XYDATA
$$ [...]
##PAGE= N=2
##DATA TABLE= (X++(I..I)), XYDATA
21745 427203 425518 422049 421988 423580 423476 424011 424346 423620 425341 426634 429196 428716 426829 425850 425907 427182 429108
21728 429108 428896 425196 423063 423562 424857 424195 424470 426053 426841 426954 427953 429055 430666 433732 433219 432805
21712 432805 429693 427603 429390 431331 430067 428061 426757 425995 427154 428417 428734 428137 426534 425558 428248
21697 428248 429659 430758 429445 429845 430110 428545 428660 429394 430266 429828 429431 429989 429789 429179 429904 430131 430081 431826
21679 431826 430398 430453 432424 432523 433486 434908 432534 431246 430598 428997 431037 432668 430757 430379 428222 426806
21663 426806 429624 428711 426528 425582 424722 427558 431173 433998 431776 431830 434844 434867 434309 433760 434565 436961 435666
21646 435666 432182 433029 435030 435841 436531 433950 432844 433174 433502 432064 433305 432556 430765 432211 436405 437798
21630 437798 437726 435866 436628 438932 439982 440900 438268 436779 433639 431743 431735 432663 435655 437877 440461 439093
21614 439093 437953 436982 437097 436632 435824 435503 435339 432972 431750 431468 433355 434748 434964 435732 434641 433847 435306
21597 435306 436608 438040 438804 438276 438965 435903 433910 434867 435664 435129 434973 433347 433992 436106 436182 434328 435504
21580 435504 436844 437093 436313 434125 437221 435810 434387 434560 437981 440975 438211 438368 438662 439179 438385 438372
21564 438372 440058 439855 439023 441501 440821 440143 438545 441555 442587 442376 441054 441329 443156 440690 438902 434256
21548 434256 433848 438135 440592 442141 441336 441957 444006 444010 445200 446177 445289 442623 440307 439679 440911 440861 438846
21531 438846 439407 439706 438470 437198 435837 438986 440621 439218 437129 438241 442022 443397 443352 442827 443211 443824
21515 443824 444123 444535 442784 440938 438686 438663 439392 440853 444380 444770 444486 442605 440761 439826 440988 441201
21499 441201 440292 439766 440634 443899 443974 441590 442101 444123 445260 443774 443542 445606 444735 443083 443536 443182 442579
21482 442579 441183 439621 440858 442780 443586 441953 438469 440006 441087 440143 440328 442218 444957 442810 442677
21467 442677 442234 443762 444450 445543 446850 444735 443627 443729 444595 444636 446780 446126 447028 447888 447429 447419 448796
21450 448796 451160 451498 449308 446389 447304 446430 445952 446878 449151 450114 449290 447233 446047 445161 447617 448405
21434 448405 444920 443201 445695 447452 448854 448380 445941 448897 448009 449217 450191 449249 449036 449055 449562 451589
21418 451589 452685 452224 450938 451490 450791 448325 448272 447683 448150 447500 446731 445963 447219 446832 448048 446585 446072
21401 446072 447918 450454 450284 451682 451293 453750 455091 455203 456594 457777 455082 451101 450210 450011 448185
21386 448185 446900 448347 449671 450045 451174 453147 455549 456485 456108 456265 457181 456845 457174 454820 452495 451597
21370 451597 450367 450679 453832 454968 456184 454948 453779 454797 453655 453095 451119 451799 452384 450070 450335
21355 450335 452403 454275 457974 454618 454308 455965 456290 457951 457043 457572 457617 455376 456197 457671 458268 458615
21339 458615 458398 458338 456496 454615 454592 456077 456275 456532 459911 458517 456676 458517 458446 455137 456208 459015
21323 459015 461326 460058 459119 458830 456096 454499 453515 455920 457755 457980 458888 458017 458688 458985 457814 456476
21307 456476 459289 461698 459282 458986 459513 457128 453636 454393 454686 457575 458506 457406 456696 457746 459385 458594
21291 458594 456903 459979 462573 462530 461784 462608 463565 465809 464693 463782 463225 461949 461154 463380 466693 467250
21275 467250 466956 464511 462055 459816 459867 462280 463042 459950 455620 457811 460953 463147 465059 464569 461878
21260 461878 461120 462815 463551 462208 462136 462028 463181 463635 465969 465108 463971 461160 462464 464484 463639 464585
21244 464585 465432 464121 461475 461548 463847 465010 464268 464195 465497 467346 467365 467605 468460 467326 466881 467740 467208
21227 467208 466720 466624 468495 466988 465936 467665 467302 465339 464952 464851 466742 468734 467633 467611 468063 466926
21211 466926 466957 466927 467286 468635 470214 470792 470676 470717 468163 466873 465687 467855 469224 470494 470693 471736 470603
21194 470603 468043 467643 468928 467932 466829 465511 465411 466407 466422 466681 468658 471260 470707 470509 469547 471349 471246
21177 471246 467901 467249 468434 468369 468292 469041 469899 470500 473130 471076 468876 467932 470086 470965 470162 469215 470516
21160 470516 469860 467511 466632 468245 470976 471051 470190 470225 469163 469367 471274 473241 472674 472055 473192 474816 472043
21143 472043 472427 473780 475255 474809 473506 472733 472320 471572 469533 470118 469785 469487 469244 471926 471940 471056 473782
21126 473782 477727 477564 476783 474337 474299 475661 475189 474001 469553 468220 467731 470483 471128 470309 471161 474991
21110 474991 475883 477141 477921 477161 475740 475965 477350 478701 479013 480563 480670 480387 480241 479943 480635 480893 478578
21093 478578 477789 480021 481669 480942 480583 481391 481390 482068 481362 483129 484808 482709 479631 478059 480177 481207
21077 481207 480992 481298 481633 480749 479939 479336 481502 484385 485451 485700 483497 481996 481933 482255 482986 482347 483350
21060 483350 483873 483015 483430 481546 480685 481488 481923 483922 483239 482172 482971 484682 484111 481150 481246 479509 477273
21043 477273 480262 481023 480726 480154 481410 480637 482554 483376 482315 481030 481827 485003 487344 487396 486331 485505
21027 485505 485700 486250 483929 482029 481676 482509 482608 482109 482575 484839 485803 485843 486322 484926 485307 484950 485640 485549
21009 485549 485844 486687 487321 488930 489807 490785 489167 486234 485838 486091 485978 488738 488222 488549 487475 485710 483265
20992 483265 485400 485219 484894 486901 486937 487604 488913 491476 491410 490438 488894 489308 488598 488188 487856 487166 486960 488467
20974 488467 490432 490831 491219 491242 490141 486736 486094 487574 488240 489313 490210 491275 491273 493007 494562 494285 492834
20957 492834 489892 489866 488920 491798 493747 494307 493236 492594 494261 493596 492876 490965 492111 491317 490987 491090 490697
20940 490697 491775 491068 489485 489175 490683 490283 490745 492871 494295 495778 496495 495118 495117 493950 494352 494504 493034
20923 493034 496180 495714 494123 493887 495734 493854 492627 493011 492402 492482 494501 495232 495092 495058 494573 499329 499641
20906 499641 498679 498135 497273 495666 492630 493452 494741 495783 495796 495085 494328 494691 497026 501248 499935 497910
20890 497910 497832 496402 495676 496644 494853 494611 495636 495902 494592 494420 497562 497930 497961 500007 501398 501070 502235
20873 502235 502091 502213 502844 500726 496211 496034 497217 499044 499608 499698 500514 501467 503594 501933 500791 501555 501887
20856 501887 500218 497962 498558 497691 496559 497033 497794 499545 500763 500067 498660 500854 500964 503711 505947 504599
20840 504599 504978 506349 509101 507496 504367 503460 503994 504800 505416 504818 501037 499519 502109 503300 504782 505063
20824 505063 505731 505497 505307 503964 504661 503116 502078 502747 502867 501917 501490 503943 507842 507252 507652 509126 508695
20807 508695 506472 504398 503379 504785 501829 500349 501074 502584 504535 506666 506989 508667 508938 509737 510178
20792 510178 510497 509504 507860 507742 507906 504482 502511 501892 503912 507601 511422 514745 514894 512342 512642 512326
20776 512326 512151 510548 508348 510999 511455 509083 509273 511466 511468 508506 509270 510058 510215 510638 510971 511600 510714
20759 510714 509900 510223 511984 512940 511668 511110 510195 509840 510217 511548 512263 513686 513958 513072 512221 511348 511178
20742 511178 514269 516128 513560 511212 512861 513608 514387 510799 510469 512232 511455 510721 512854 514770 514020 514988
20726 514988 515368 515496 512638 512157 512502 513549 512346 514274 516211 520189 520589 518183 513975 513426 516932 516730
20710 516730 514928 514385 516425 519493 520111 518604 517947 518651 519921 519482 520380 519503 518138 519872 518994 520848
20694 520848 520148 517025 517202 516912 517284 520319 519908 517205 518314 522591 521385 521162 520410 519266 520564 524257
20678 524257 527664 527110 528101 526502 524719 523576 520918 521213 522426 520099 518936 518111 518720 519095 517975 516505
20662 516505 518264 519504 520629 521334 522540 522227 522931 524577 522928 522072 523750 528582 531179 526903 526916 528900
20646 528900 526945 528465 528650 527570 529035 529012 526565 526314 528761 529137 528431 527615 525207 524296 525216 525136 524371
20629 524371 524471 524514 526632 526557 524740 525216 527212 528194 529122 528198 525174 522495 521387 523456 521946 522703 526158
20612 526158 527236 527452 527180 526601 525304 525628 526230 527803 528113 525951 523751 525013 525577 527305 528436 531914
20596 531914 530750 529163 528853 530863 531708 528796 528778 530087 527373 526161 525949 528954 530562 529642 526871 526806
20580 526806 527230 528349 529617 528782 527545 530364 533156 536729 538372 534371 532917 530823 530550 531656 532151
20565 532151 533399 533882 533136 532585 531363 532520 531494 533656 536382 537051 535754 533273 533105 536540 537321 535412
20549 535412 534406 536259 536399 535867 534493 534759 535251 534090 536402 537710 536006 534554 534712 534219 535332 534538
20533 534538 533282 533215 534586 534403 534884 536769 537317 537890 537829 536320 535353 537739 538297 537616 539344 540453 541097
20516 541097 540260 538397 539277 540589 537746 540556 543826 543655 542006 541366 540306 539516 540371 540077 539154 539373
20500 539373 541669 543361 544121 544599 544525 544891 544090 543996 544872 546712 546574 544615 544574 543699 542448 540813 539653
20483 539653 537810 538615 540656 544489 546869 545979 547585 547654 546459 546277 546109 545543 546729 547043 545978 542751
20467 542751 542095 544410 545113 545389 545746 547748 547292 545267 545935 547227 546714 546233 548628 549607 549663 548787 549838
20450 549838 550976 549533 547991 546766 546722 548681 549960 548981 546845 545894 546214 547222 547882 547627 549070 550786
20434 550786 550497 547737 545883 548248 549495 549244 550337 551707 551119 550857 551772 552970 549191 546949 547350 549699
20418 549699 547691 548315 551870 553553 552577 551342 551409 552365 553431 553339 551524 551751 553022 554178 554048 554935 556675
20401 556675 556591 557507 556387 557340 557057 557098 555369 553433 552515 553217 556115 556800 555441 553816 552743 554721 557660
20384 557660 556659 556185 556750 559350 557994 556287 557213 557667 557379 555431 555964 556273 555145 556660 558234 560325
20368 560325 560253 558658 558112 557153 554005 554314 555787 556227 557940 561296 562410 562559 562344 561533 560137 559936 560655
20351 560655 562329 561949 562743 563324 562381 562539 560824 559625 558293 555952 556296 558982 559332 559708 563431 565041
20335 565041 564042 562400 564311 562920 563200 563485 563054 562578 564875 564918 562801 563432 563883 562679 558838 557965 559372
20318 559372 560690 563182 565721 565663 565273 564174 562479 561184 563890 567354 566795 564451 561680 564473 567403
20303 567403 567802 570142 568752 566594 565531 565174 568275 568545 568160 569471 571073 570358 570949 568155 565838 566970
20287 566970 566633 565854 568895 568576 568658 567557 569834 572456 572608 570999 568992 568611 570632 569265 569880 572784
20271 572784 572983 570443 571573 571506 572161 572098 572269 572086 572134 572751 571977 574871 577831 577236 573059 571128 569935
20254 569935 571096 571303 572932 572920 575027 578685 579926 579573 577686 575979 575298 578149 579741 579278 578464 579726
20238 579726 578607 578919 577537 576351 577302 577886 577742 577031 576438 576638 575773 575918 578011 578327 577974 576700 574901
20221 574901 575724 576654 576200 577575 579884 578694 577994 579062 580968 582443 583368 583909 582047 581885 581162 579064
20205 579064 578842 578990 582135 582953 581755 582468 585299 581727 579582 581013 580052 580899 581081 580633 584739 586910
20189 586910 586607 585871 584079 583509 582172 582843 583363 581381 580034 582717 584941 586862 587401 586355 584673 583765
20173 583765 581896 582340 585100 585484 581987 583488 584879 585614 584370 582437 583176 586408 583029 578838 580736
20158 580736 583715 585229 586165 587783 589846 592968 590761 588385 589802 587636 587578 589357 588326 585938 586756
20143 586756 587738 589817 590823 594046 593469 591951 591287 590996 589422 587072 587220 588923 588161 587345 586629 588158
20127 588158 591100 593882 592756 594357 593398 591596 593725 593307 591883 593379 593539 591988 594229 597208 598968
20112 598968 600162 596398 594063 591728 590880 593085 592390 590717 591252 595677 596884 595450 595996 594488 594459 594398
20096 594398 595748 595465 593947 594832 596631 599407 600344 599802 601160 600692 600833 599428 597026 596015 596445 596648
20080 596648 597014 599400 600406 600103 599836 599349 600938 600765 601436 600455 599866 599853 601001 600232 599888 600961 600751
20063 600751 600109 601827 602328 602437 599004 599760 603188 605674 607924 608073 605638 604242 604775 604527 605050 605212
20047 605212 604262 603593 605173 607478 605162 602078 599312 599743 602457 602251 602468 602284 604770 605550 607918 610902
20031 610902 610396 607559 607201 608221 607048 606003 606363 608134 607133 606802 609136 610677 610579 608537 608033 606586
20015 606586 605656 607662 608616 609393 609872 608903 607909 607219 605081 604230 605223 607256 609109 610295 610518 610200 611523
19998 611523 611762 609821 611509 613466 616470 617442 615523 614161 614913 616148 616580 616397 614673 612926 612987 614645
19982 614645 616695 619572 622137 618604 615518 614621 615090 613936 613242 615165 616060 616900 618701 619545 621417 622200
19966 622200 619671 620546 622291 619708 619602 621234 621802 620185 617113 617679 619022 619725 619852 622228 623074 625433
19950 625433 624216 621287 622325 621804 621093 623542 627566 629672 627320 625194 622428 620634 622032 624756 626303
19935 626303 626549 626588 625331 623961 625346 624949 625902 625383 624536 623042 622703 624590 624478 625000 626145 627544 629233
19918 629233 628369 626898 625540 625986 627069 628045 628989 628851 626840 627151 629471 628217 626563 628160 630208 632112
19902 632112 630946 627630 626411 628267 629989 628542 630686 630680 632664 633467 634493 634743 630941 627221 628210 628824
19886 628824 628759 628663 629605 632580 634065 636018 634986 633237 633624 635102 634589 636032 636796 634158 632186 632756
19870 632756 634922 633421 633066 631327 630944 632655 633514 633140 635594 638543 638794 637644 637636 636260 635881 636081 638426
19853 638426 638963 638597 641808 640313 638583 638384 639921 640672 638335 636456 636752 638252 637531 637802 637951 638739
19837 638739 640675 642071 643067 642832 644003 643442 644630 643386 642313 642359 642753 641753 643298 643388 644251 643461 645115
19820 645115 643970 641963 643802 643136 640169 641140 643694 644213 643803 643692 644498 645002 645456 643939 644534 645080 647089
19803 647089 645327 642326 644510 648577 648709 648098 646777 645555 645398 647866 649303 646222 645922 647054 647107 649418
19787 649418 650770 650055 646909 644337 644444 647905 651662 652961 653127 651628 647884 646581 645890 646305 647970
19772 647970 650093 652081 653971 655225 654796 653126 652178 652911 653533 654125 654598 654947 656329 659641 660339 659162
19756 659162 657901 659094 659112 658937 658261 660475 659637 658573 658684 659679 660096 660016 661447 661145 661097 662956 665440
19739 665440 662311 662103 662063 659621 659534 661795 662118 661418 660418 660726 660354 661943 664779 664767 664109 663656 664060 664892
19721 664892 664933 664086 666302 666529 664742 666481 667838 668577 665816 665063 665164 665158 665030 666636 666914 667773 668291 670011
19703 670011 672028 670784 668947 668238 666054 667413 668048 666586 667639 668353 666967 665666 666218 669054 669918
19688 669918 673351 674701 673428 674624 673604 671739 672690 672639 671932 672894 673220 675337 676229 678935 678395 676919
19672 676919 675687 673955 674967 673774 671874 674524 674388 673095 674271 676579 676975 674273 673262 673829 674187
19657 674187 674583 674959 676273 677791 680078 677460 673785 673967 674996 675405 675247 674271 674386 674507 672930 673596
19641 673596 674966 677618 678596 678017 678567 680647 683082 683363 685135 685162 682154 680732 681123 684215 683261 682146
19625 682146 682221 681969 682764 682796 684277 684385 685535 684769 683592 684712 684932 684178 686237 684739 682788 685627 686496
19608 686496 687413 687359 688249 689686 688926 688749 687724 686938 686039 685388 686101 687299 689072 693224 693610 690361 690025
19591 690025 690844 692379 694458 694683 692997 693166 693059 693982 692970 692425 694583 695102 694641 692301 692243 693699 693265
19574 693265 693923 692065 689032 689261 689838 690269 692549 695573 695986 697136 696329 694866 695951 698790 699670 699140
19558 699140 695923 696867 697214 698310 698969 699990 699268 699535 700376 703272 704115 701349 701234 701440 701224 701757 701621
19541 701621 702382 703023 705067 704022 702587 702505 701705 700533 700101 700735 701539 704346 705072 706158 706854 706630 707042
19524 707042 706310 704507 704393 707098 707510 706316 703711 704592 707050 708107 708697 708495 707259 709484 709449 710054
19508 710054 710193 709952 709802 707761 708766 711688 711028 709462 708980 709381 709065 710879 711158 709834 711591 712503
19492 712503 712192 712589 712046 711413 712188 711264 711929 712606 713840 713871 715632 719661 723132 721713 718179 718548 718863
19475 718863 718416 716763 717306 718829 719534 721009 719704 719074 719776 719490 721055 719996 719579 718650 721342 724319
19459 724319 723614 720855 721845 723099 723156 722644 722157 721840 721904 723574 725701 727485 725454 722985 723297 723751 725405
19442 725405 726524 728582 730173 731070 730716 731215 732284 733803 736302 735111 733441 734233 735529 734748 735834
19427 735834 735681 733609 735982 735383 734504 736600 735027 733011 735344 733635 731073 732413 732137 730977 730517
19412 730517 732402 734600 739349 741369 739896 739024 738989 740057 738899 734836 735113 736888 738646 740205 740594
19397 740594 741111 739313 735865 735927 737882 739207 739447 739886 739253 738016 739736 741598 740289 738015 736001 735735
19381 735735 736702 738012 742299 745317 741703 740713 742635 743165 744723 744186 742820 742074 740833 741251 741337 741493
19365 741493 740054 742611 744072 744028 743036 742701 742328 744889 744240 746419 748963 750250 749464 747537 745768 745103
19349 745103 743579 746597 750674 752448 752243 752190 753223 753487 755671 755832 757714 756037 754798 754577 756649 754201
19333 754201 750200 751305 752802 753448 752834 753947 753090 751807 752621 754744 753283 749743 750010 750944 750219 754062
19317 754062 760243 763125 760937 758657 760052 761016 759348 756916 759873 761999 763924 760666 759135 761113
19303 761113 761003 760161 759461 759359 760788 765316 767902 766845 763954 763636 765088 763900 764462 767328 767213 765884
19287 765884 766213 767140 770620 770072 769604 770103 767179 767274 767553 767976 769719 770916 770481 768002 766044 766543 768852
19270 768852 771011 771789 771220 771621 770955 769902 769334 770612 771874 774643 774848 776722 776334 776686 777728 777522
19254 777522 776985 775714 776334 779453 780548 780052 780620 779148 776714 778284 781162 780523 783263 784654 782380
19239 782380 780200 780054 779419 780178 783032 784985 785500 784491 786680 787860 788221 787841 783526 781219 782481 785931
19223 785931 788395 790225 789355 789466 790891 789345 787472 785624 789907 793902 794436 793957 793362 791261 791351 792940
19207 792940 790495 790949 792533 792045 790612 790845 791056 792635 790686 789650 790336 793652 792731 792902 794290 794181
19191 794181 792734 792063 793734 796570 796710 794252 794127 796737 796584 796384 796225 796148 800793 804762 804108 802743
19175 802743 802152 802355 803639 803720 801701 801987 801687 801165 803049 805574 804782 804864 805972 804631 805494 804514 803146
19158 803146 803557 806300 808891 809354 809722 811537 811178 811214 811209 812181 810550 809449 810226 811394 813335 814913 813958
19141 813958 814015 811398 811695 812392 814214 815072 814380 813442 813939 814899 816510 817652 817157 815197 815999 815120 816200
19124 816200 820089 821670 820213 820612 820299 821129 821795 820649 819558 819186 820042 822610 823421 823920 824869 827021
19108 827021 826613 825641 826133 827106 830432 832173 831458 829603 830388 829402 830764 831533 832305 831952 831227 829763 828197
19091 828197 827408 828838 829641 830459 835879 837061 836016 834573 833224 834316 831865 830599 831669 832083 830852
19076 830852 833849 835609 835517 835585 835715 835453 834965 837651 840571 841445 840661 840441 838621 839126 841135 841564 841845
19059 841845 843721 847481 847139 846384 845125 842622 842007 846520 847348 845231 842483 841670 844659 845796 846102 845188
19043 845188 843735 843714 843669 845184 845616 846494 847826 849421 850528 849922 847749 848366 849844 849135 850346 852644
19027 852644 855221 856579 856820 856130 853226 849929 848499 849670 853092 854028 856755 858641 859010 857026 856805
19012 856805 856434 857821 859621 860218 860943 860214 859089 858820 857331 857398 860034 860624 863534 863978 860238 861870
18996 861870 864977 864434 860946 862390 863831 864662 866697 867417 867582 869733 872029 875313 874308 871164 871610
18981 871610 873182 875131 875099 875709 875524 876087 875755 873001 871490 872053 876276 876697 877428 877466 875943 875588 876815
18964 876815 877838 877357 877739 877135 878983 879887 878619 881895 882640 880889 879696 879864 882995 883236 881364 880669
18948 880669 882404 885820 886278 885697 886918 886909 886505 886021 883747 883925 886961 887683 888873 889726 890765 891120 891520
18931 891520 892312 893365 894275 896618 897984 900073 897459 892918 890751 892969 896478 897181 899338 898330 900773
18916 900773 902937 902183 900473 900128 900073 899946 898494 900417 903505 904985 904926 902964 902353 902897 903732 904287 904150
18899 904150 904718 905880 907433 908693 907627 907854 905822 906137 905830 907544 910127 910475 910896 912997 912695 915101
18883 915101 915494 913266 912481 911118 911787 912907 913880 912784 912801 912687 912454 913978 915464 913041 913319 916022
18867 916022 919059 918226 919721 918538 919512 920817 918506 918779 920532 923073 923097 923277 922958 923062 924256 925478
18851 925478 927337 927027 928227 928878 932419 935440 935162 934525 934029 934597 936575 932431 932511 934976 935472 934152
18835 934152 933215 932122 933924 934724 936018 938398 937519 937466 938979 940540 940339 941032 942852 942951 943665 942120 944065
18818 944065 945526 945076 944643 942551 942187 942649 944939 945036 945058 944672 944804 948937 948785 947860 946740 947669 946987 949816
18800 949816 951573 952094 954936 956761 956838 955912 955568 955989 958202 956141 956750 960725 960138 960761 960290 959213 959402
18783 959402 961077 965231 965046 966461 968551 970035 969838 967805 967847 969835 972368 972273 973471 973014 972939 972670 974658
18766 974658 979464 982546 982589 978468 971578 966225 962780 961170 965149 969242 971515 971731 972789 974264 974374
18751 974374 974240 972320 970194 970826 973515 975490 977573 977114 976880 977789 978004 980114 981194 981588 981402 980729
18735 980729 980641 982696 982247 983474 984013 983135 985662 987528 989378 991212 989365 990778 991979 991243 989006 989004
18719 989004 989509 988826 989533 991836 993452 991321 992679 994586 997840 997820 998009 999967 1000606 1000206 998328 997573
18703 997573 1001871 1001080 1000872 1002832 1003762 1003264 1001677 1003083 1005627 1003946 1004471 1005105 1004913 1002985 1003861 1007903
18687 1007903 1010991 1011589 1013229 1014313 1013643 1013055 1012511 1012898 1016294 1017511 1015946 1015764 1016140 1015633 1016148 1016996
18671 1016996 1018553 1018763 1019103 1020343 1021605 1020709 1021248 1023827 1026350 1024417 1024856 1025319 1025765 1024922 1025791 1026180
18655 1026180 1031298 1033960 1035886 1034930 1036621 1036554 1037198 1039494 1037827 1037350 1036266 1038395 1038411 1037477 1036857 1037841
18639 1037841 1042904 1045040 1042621 1043925 1044322 1043656 1043592 1043387 1043399 1044697 1047200 1046156 1046363 1047290 1047218 1048818 1050880
18622 1050880 1054459 1055699 1053160 1050641 1050047 1050211 1051038 1055696 1056993 1055716 1056943 1059593 1062932 1063470 1064215
18607 1064215 1061592 1061257 1062352 1064698 1064084 1065199 1064762 1065736 1065717 1065550 1066983 1069591 1070478 1070456 1069974 1070704 1071145
18590 1071145 1071505 1073695 1073432 1076582 1079459 1079605 1078907 1078716 1080458 1081316 1079229 1078861 1080093 1082712 1086262 1088600
18574 1088600 1092598 1093273 1090825 1089508 1085561 1081738 1083218 1082831 1083923 1085575 1087270 1088597 1088788 1091510 1093821
18559 1093821 1094470 1093883 1091731 1091958 1095240 1099045 1099649 1099712 1100839 1100355 1098439 1098940 1102131 1106613 1107301 1107450
18543 1107450 1106538 1105365 1104790 1107090 1108191 1105738 1108612 1110876 1111721 1112623 1115142 1117739 1118820 1120025 1120966
18528 1120966 1119382 1119827 1121083 1122626 1120333 1118065 1119179 1120907 1120674 1121075 1122647 1123269 1123081 1123393 1126842
18513 1126842 1128534 1130440 1129610 1129579 1132284 1133208 1133653 1134169 1136497 1138957 1139985 1142166 1141946 1140435 1140740 1143669
18497 1143669 1142777 1140553 1140354 1140147 1139830 1141530 1143002 1143555 1145674 1145220 1148532 1149274 1149743 1151251 1152153 1153992
18481 1153992 1156295 1157901 1158487 1162473 1162402 1161689 1162826 1162106 1159981 1161371 1164701 1166187 1167659 1167319 1169093
18466 1169093 1170591 1168630 1166920 1168311 1170363 1173006 1174185 1176029 1176908 1176986 1177074 1179519 1179707 1178004 1177675 1178436
18450 1178436 1179600 1181271 1181857 1182919 1185956 1187009 1186042 1188345 1190766 1191793 1192248 1195204 1196194 1195819 1196132
18435 1196132 1196640 1198388 1197100 1197909 1198120 1199779 1203081 1203962 1202600 1201692 1202551 1204303 1203759 1203593 1204533 1208522
18419 1208522 1211426 1212574 1212723 1215234 1215181 1215225 1215101 1213074 1213211 1215506 1218459 1220495 1220540 1222742 1225903 1225531
18403 1225531 1223282 1225055 1224246 1225538 1226041 1228425 1230517 1233040 1233931 1234200 1235288 1233462 1237276 1240761 1240259
18388 1240259 1239653 1242209 1246671 1248531 1247248 1246256 1247865 1249543 1247241 1249732 1252716 1254364 1254428 1257284 1257986
18373 1257986 1256853 1260313 1263880 1264432 1263909 1263197 1263886 1268244 1270905 1272276 1271620 1273517 1274074 1275790 1277808
18358 1277808 1278090 1276892 1276847 1276158 1274796 1274530 1277551 1277111 1276632 1277411 1278777 1281517 1284716 1285116 1284821 1286432
18342 1286432 1287454 1287178 1289767 1291989 1293791 1295738 1295732 1298893 1301744 1304387 1304952 1306130 1305164 1304255 1303548 1306350
18326 1306350 1312111 1315425 1316389 1316315 1316235 1317494 1318821 1319045 1319835 1317733 1319272 1321138 1321360 1322274 1324087 1326502
18310 1326502 1328266 1330330 1333918 1335985 1335129 1335694 1337597 1338927 1341232 1342989 1343724 1344311 1344442 1345182 1344733 1343276
18294 1343276 1343958 1343968 1348335 1352961 1354631 1356253 1359570 1361934 1362144 1362165 1362185 1360134 1361932 1362503 1364924 1368593
18278 1368593 1372221 1375322 1377603 1377583 1374266 1376018 1381548 1384252 1384893 1387704 1387980 1389017 1390857 1390222 1390110
18263 1390110 1389389 1389682 1389603 1392798 1395487 1398010 1401646 1405320 1407742 1409145 1410980 1413710 1414636 1414719 1415307 1420621
18247 1420621 1422451 1422071 1422348 1424958 1429428 1433836 1437459 1435547 1432939 1433902 1435221 1433600 1434293 1438111 1443109
18232 1443109 1448042 1450347 1451165 1453964 1453810 1457814 1461425 1462647 1461976 1461573 1463737 1466236 1470050 1472821 1472412
18217 1472412 1475044 1478646 1481725 1481639 1483044 1484649 1487954 1491314 1494118 1495144 1494343 1498276 1502034 1504181 1506008
18202 1506008 1508058 1511322 1515558 1516483 1517701 1519085 1519837 1522871 1526461 1529460 1529737 1532961 1536707 1537731 1540577
18187 1540577 1544428 1547032 1545242 1547625 1551397 1551674 1551683 1556301 1561674 1566239 1569529 1573957 1580445 1583536 1584876
18172 1584876 1587737 1589319 1594961 1599172 1597237 1599584 1604373 1608690 1610486 1614624 1617413 1621190 1626357 1629774
18158 1629774 1637339 1641855 1645890 1651020 1656606 1661829 1665611 1670220 1676200 1681108 1686461 1691804 1696444 1701022
18144 1701022 1707996 1716614 1723857 1731785 1740345 1747227 1754395 1764850 1775254 1783610 1794617 1804737 1813715
18131 1813715 1825063 1835825 1849255 1863202 1878556 1894614 1908453 1926889 1948579 1972175 2000712
18120 2000712 2029563 2060006 2099361 2142242 2189285 2240131 2298837 2370570 2452947 2555258 2682851
18109 2682851 2850260 3078484 3379577 3726151 3907218 3357491 2002062 704410 -292812
18100 -292812 -568348 -349753 -59404 181819 367233 509739 626381 723909 801535 866262
18090 866262 919181 964445 1007470 1047036 1080565 1110594 1137953 1165842 1188152 1209346 1228985
18079 1228985 1248844 1268540 1286771 1304133 1319078 1331430 1340301 1349855 1361753 1372858 1381926 1388438
18067 1388438 1396267 1403529 1410633 1418708 1428668 1437969 1446054 1451850 1460080 1467495 1475125 1479876 1486238 1493252
18053 1493252 1497718 1503095 1508784 1515282 1524326 1531460 1538891 1543638 1546644 1551550 1555521 1561769 1566519 1569291
18039 1569291 1574555 1578038 1583772 1588192 1593714 1598568 1603853 1607597 1611810 1615748 1619951 1624063 1624040 1624840 1625233
18024 1625233 1632067 1641767 1645155 1647683 1652438 1656529 1661871 1665817 1668965 1670213 1675123 1680400 1679194 1681634
18010 1681634 1688710 1696155 1699290 1702421 1705749 1711242 1713084 1715023 1717765 1721532 1727638 1734890 1737493 1737465
17996 1737465 1741603 1746902 1752352 1754896 1760558 1765589 1770238 1772711 1774703 1775196 1779767 1787554 1793761 1797678
17982 1797678 1802655 1806721 1810855 1814447 1818645 1823792 1829525 1834755 1840913 1844145 1844860 1852661 1861126 1866935
17968 1866935 1871930 1877366 1882610 1887877 1898285 1907552 1918376 1925838 1930790 1940448 1951053 1962253 1973583
17955 1973583 1985710 1995684 2007018 2017564 2024570 2029301 2031409 2029366 2027385 2024688 2021815 2013559 2004449
17942 2004449 1992767 1976185 1958854 1944456 1931955 1926718 1927376 1935294 1943711 1941739 1926841 1897722
17930 1897722 1859242 1812090 1767346 1736574 1728059 1738055 1754470 1777497 1799434 1819385 1837059 1853707
17918 1853707 1870327 1880187 1889766 1900547 1914389 1926750 1937567 1949668 1961537 1974973 1989374 2000587
17906 2000587 2005539 2011195 2013726 2008693 2002236 1994028 1988385 1987986 1989799 1996862 2010044 2023590 2037183
17893 2037183 2045648 2055358 2061787 2062648 2056578 2053138 2050480 2053058 2061354 2075441 2095279 2114955 2128051
17880 2128051 2124586 2098483 2055612 2001144 1951595 1920131 1911165 1918805 1935151 1953211 1969805 1989742
17868 1989742 2007469 2021543 2034375 2048210 2063833 2079820 2094845 2106116 2116752 2128167 2139095
17857 2139095 2148247 2159887 2172608 2178528 2180970 2180961 2174327 2161986 2152376 2142490 2138672 2138262 2141974 2149671
17843 2149671 2161789 2178743 2185319 2192299 2197455 2192696 2179219 2165496 2153224 2143776 2140687 2142572 2146083
17830 2146083 2151150 2160035 2169501 2179921 2192697 2204419 2214265 2223936 2233174 2239850 2247198 2255926 2263773
17817 2263773 2268878 2272759 2276049 2284400 2290877 2298626 2306402 2314156 2319293 2324250 2330122 2336487 2342039 2347121
17803 2347121 2356587 2366344 2376228 2382597 2387378 2390850 2395365 2398595 2404734 2411389 2416143 2423860 2434021 2443057
17789 2443057 2450911 2456544 2462954 2469318 2475626 2482130 2488151 2495731 2502337 2508546 2513407 2520827 2527832 2531221
17775 2531221 2532128 2540068 2547017 2552554 2559453 2567076 2574651 2582724 2590991 2599396 2606750 2614194 2618202 2622870
17761 2622870 2628623 2635912 2640111 2647709 2656840 2663549 2669347 2677921 2685844 2694927 2702158 2709239 2715231 2718858
17747 2718858 2721082 2728694 2736644 2743532 2750306 2756272 2762986 2773356 2780545 2788121 2797515 2807941 2816061
17734 2816061 2823915 2832205 2839611 2848504 2857639 2866045 2874995 2882415 2892379 2900219 2908221 2915971 2925613 2935881
17720 2935881 2942674 2947800 2953762 2962933 2973132 2982156 2990424 2999766 3011800 3023120 3033575 3042317 3051802
17707 3051802 3059707 3069125 3078437 3087132 3100076 3109563 3116161 3121239 3129527 3139366 3147548 3154196 3162169 3171269
17693 3171269 3177835 3179082 3183976 3191724 3198542 3204138 3211462 3219958 3228993 3240506 3252347 3264805 3276377
17680 3276377 3288111 3301454 3314574 3326032 3337157 3350678 3367514 3381586 3390036 3399310 3410267 3423570
17668 3423570 3432402 3441023 3450902 3463914 3477943 3490058 3502939 3512748 3522311 3535014 3544417 3557697
17656 3557697 3569570 3582674 3598517 3613572 3627275 3641252 3656470 3667012 3676871 3690880 3707222
17645 3707222 3721103 3731954 3740180 3741509 3747268 3758565 3772981 3783429 3788926 3801102 3815522 3826780
17633 3826780 3842345 3856398 3869771 3889508 3908653 3929999 3953014 3978737 4011886 4041788 4064245
17622 4064245 4088903 4112621 4130071 4151587 4170781 4186960 4199848 4210004 4220548 4233193 4253260
17611 4253260 4273206 4288089 4301003 4315230 4327409 4344744 4366012 4386861 4405454 4424485 4442745
17600 4442745 4460536 4478866 4493734 4513170 4534031 4554900 4579124 4603336 4633326 4663069 4694045
17589 4694045 4722018 4746179 4768622 4786804 4803503 4819291 4835642 4851407 4871749 4900678 4936381
17578 4936381 4974877 5011339 5041319 5075927 5116413 5163059 5211505 5259280 5306000 5350003 5389459
17567 5389459 5430132 5468671 5504716 5542232 5573382 5597077 5618861 5642851 5670126 5699311 5730384
17556 5730384 5769390 5811864 5856923 5900032 5938297 5976703 6015974 6052969 6091991 6135039 6183301
17545 6183301 6234776 6289930 6338852 6386054 6438235 6490927 6550326 6608925 6667327 6728025 6789911
17534 6789911 6849882 6905600 6959054 7011120 7062119 7113611 7171005 7234055 7299769 7368992 7437694
17523 7437694 7511357 7584505 7659668 7739091 7817422 7891138 7966722 8047387 8129531 8212584 8296215
17512 8296215 8389030 8488800 8587456 8683033 8775454 8858951 8936488 9019556 9117708 9225726 9341107
17501 9341107 9462518 9587307 9712351 9843706 9977856 10114831 10256120 10403732 10556507
17492 10556507 10715472 10882799 11058252 11240640 11430460 11629261 11834295 12047707 12273549
17483 12273549 12513973 12764401 13025670 13297913 13578775 13868038 14163802 14467616 14783670
17474 14783670 15112093 15460379 15841576 16261564 16721928 17233539 17795060 18393939 19027782
17465 19027782 19709199 20449770 21285400 22238090 23339172 24630106 26151650 27850359 29445398
17456 29445398 30500158 31182654 31804534 31767442 30427894 28330805 25990925 23986844 22075804
17447 22075804 19891086 18043021 16657896 16477038 17497515 18254707 17482658 15668433
17439 15668433 13444802 9803852 2712359 -6334743 -14221598 -19222933 -20666210 -20227991
17431 -20227991 -19125728 -17596783 -15396779 -12895056 -10564746 -8565257 -6859038 -5370706
17423 -5370706 -4044732 -2830451 -1696511 -611020 443281 1489790 2527463 3549576
17415 3549576 4545211 5506708 6426983 7329661 8263438 9238375 10250206 11293305 12375798
17406 12375798 13557892 14883584 16355166 17986051 19796363 21824288 24113402 26677650
17398 26677650 29553472 32808193 36606683 41268553 47040883 53402258 57515866 53589196
17390 53589196 41567357 29712849 21518070 18518608 14517440 5187105 -6790667 -19954544
17382 -19954544 -30887095 -37975348 -42520291 -43124680 -40327661 -35447556 -29955466 -25759959
17374 -25759959 -23748197 -23947866 -27045825 -31689944 -35864934 -39291758 -40741867 -40368072
17366 -40368072 -38952741 -36790333 -34403870 -32203412 -30283887 -28585064 -27072829 -25724018
17358 -25724018 -24523440 -23456990 -22486593 -21601551 -20781522 -20024699 -19325634 -18665683 -18036615
17349 -18036615 -17441274 -16881106 -16346493 -15842948 -15362918 -14901074 -14453302 -14017668 -13585944
17340 -13585944 -13145428 -12694051 -12229076 -11740504 -11218578 -10677422 -10184879 -9864520 -9849194
17331 -9849194 -10238921 -10807626 -11362572 -11656890 -11567386 -11190654 -10626656 -10049537 -9633711 -9457596
17321 -9457596 -9620602 -10186320 -10832193 -11464972 -11921196 -12045406 -11944348 -11659668 -11289448
17312 -11289448 -10932235 -10608741 -10318971 -10066683 -9845219 -9641296 -9457400 -9289661 -9130962
17303 -9130962 -8979733 -8838446 -8707299 -8580064 -8455955 -8336153 -8219503 -8106948 -7999390
17294 -7999390 -7895991 -7795473 -7697369 -7604272 -7512830 -7421558 -7333697 -7242698 -7154135 -7071077 -6991112
17283 -6991112 -6912015 -6836427 -6763377 -6690696 -6619084 -6546663 -6475251 -6405993 -6334935 -6267368 -6202154
17272 -6202154 -6137313 -6073113 -6010274 -5949104 -5883588 -5823373 -5775486 -5727288 -5670036 -5610635 -5567053
17261 -5567053 -5529475 -5491570 -5448866 -5404695 -5366751 -5323041 -5277730 -5234608 -5191655 -5152391 -5116465
17250 -5116465 -5078854 -5040943 -5006986 -4979651 -4952659 -4919224 -4882024 -4844638 -4804501 -4761594 -4718052
17239 -4718052 -4674164 -4636302 -4598394 -4562186 -4537607 -4515146 -4491571 -4462148 -4429146 -4401116 -4380821
17228 -4380821 -4358146 -4333738 -4303706 -4273925 -4246568 -4214417 -4177374 -4140365 -4108137 -4076956 -4048130
17217 -4048130 -4024937 -4003840 -3982809 -3956413 -3925392 -3896651 -3865713 -3835854 -3805690 -3776667 -3752464
17206 -3752464 -3726770 -3701391 -3676533 -3656194 -3639550 -3633756 -3630623 -3621856 -3610044 -3593298 -3583789 -3576383
17194 -3576383 -3567636 -3557189 -3543132 -3527121 -3504536 -3475569 -3447054 -3418809 -3392443 -3369650 -3350348
17183 -3350348 -3333376 -3319429 -3304328 -3290247 -3272965 -3251052 -3226756 -3203322 -3183332 -3164560 -3145090
17172 -3145090 -3126357 -3109285 -3087892 -3065670 -3044934 -3026129 -3007925 -2991485 -2974646 -2956324 -2941717
17161 -2941717 -2926959 -2911925 -2894913 -2876507 -2859109 -2840630 -2820939 -2805669 -2793369 -2776766 -2760627
17150 -2760627 -2747927 -2733558 -2718361 -2702183 -2686863 -2673985 -2662932 -2653081 -2641582 -2627843 -2619094 -2605420
17138 -2605420 -2590124 -2575375 -2563416 -2552973 -2540209 -2526060 -2513195 -2500363 -2490553 -2482625 -2472089 -2457976
17126 -2457976 -2445008 -2435201 -2422933 -2407928 -2395257 -2383857 -2374516 -2365989 -2353308 -2340324 -2329652 -2318925
17114 -2318925 -2308921 -2296379 -2284876 -2276215 -2264577 -2253153 -2238111 -2222770 -2209804 -2196378 -2181049
17103 -2181049 -2168491 -2169869 -2178880 -2184463 -2186446 -2178850 -2166228 -2152266 -2140810 -2130896 -2124988 -2117117 -2107491
17090 -2107491 -2099917 -2091048 -2083117 -2075264 -2065073 -2054926 -2045981 -2032912 -2020878 -2014713 -2006403 -1995094 -1984871
17077 -1984871 -1969861 -1959484 -1952625 -1944536 -1938857 -1930307 -1919726 -1908489 -1899874 -1892097 -1884488 -1878821 -1874839
17064 -1874839 -1869089 -1863568 -1855571 -1847079 -1836547 -1826135 -1817094 -1811944 -1806042 -1800374 -1795141 -1789407 -1778943
17051 -1778943 -1769267 -1761292 -1755229 -1749772 -1740971 -1734127 -1728157 -1720326 -1712154 -1705837 -1698822 -1690113 -1684678 -1676346
17037 -1676346 -1670459 -1666492 -1659777 -1656081 -1651249 -1643868 -1637820 -1632370 -1625562 -1617235 -1611618 -1605598 -1600530 -1595463
17023 -1595463 -1586240 -1576537 -1571361 -1566506 -1561996 -1555757 -1548546 -1542437 -1539696 -1538570 -1533330 -1524311 -1515284 -1506733
17009 -1506733 -1497844 -1490748 -1487102 -1484436 -1479399 -1472969 -1464372 -1458255 -1452014 -1444639 -1440718 -1437496 -1432066 -1428086
16995 -1428086 -1422624 -1416696 -1409834 -1403509 -1394378 -1385281 -1382278 -1377354 -1373977 -1366278 -1359152 -1353648 -1346754 -1342227
16981 -1342227 -1337003 -1330822 -1321579 -1314018 -1310430 -1305563 -1300629 -1293962 -1284390 -1276412 -1269212 -1263676 -1258560 -1253318
16967 -1253318 -1247856 -1241876 -1233615 -1222445 -1213505 -1207698 -1200121 -1191315 -1181551 -1173832 -1163528 -1149949 -1132557
16954 -1132557 -1115250 -1098429 -1086307 -1078428 -1071909 -1073833 -1086488 -1102740 -1119657 -1142307 -1166287 -1180834
16942 -1180834 -1189294 -1185554 -1178419 -1170867 -1163731 -1158399 -1163148 -1173823 -1190436 -1210266 -1227305 -1237774 -1244508
16929 -1244508 -1241975 -1233159 -1219350 -1201461 -1181800 -1157231 -1129724 -1102650 -1076306 -1050379 -1032860 -1031276
16917 -1031276 -1051881 -1093086 -1149134 -1201533 -1241475 -1259864 -1258766 -1245380 -1225811 -1204732 -1186534
16906 -1186534 -1171373 -1158582 -1143571 -1131213 -1118843 -1105157 -1093430 -1083635 -1068750 -1053572 -1040409
16895 -1040409 -1027362 -1016029 -1012845 -1009970 -1009651 -1013948 -1024241 -1038640 -1048319 -1052181 -1052904 -1049605 -1038951
16882 -1038951 -1024878 -1011291 -1000119 -992906 -989487 -990800 -1000026 -1008543 -1015618 -1016003 -1011735 -1003284 -990942
16869 -990942 -971723 -951529 -936789 -935464 -953141 -986674 -1031130 -1071769 -1096916 -1107995 -1104901 -1092476
16857 -1092476 -1074283 -1057306 -1043231 -1032221 -1018561 -1008411 -997773 -991701 -980488 -971053 -961311 -951755
16845 -951755 -939922 -931420 -923204 -914965 -911427 -907600 -907158 -912830 -921896 -933834 -942945 -948151 -948324 -945068
16831 -945068 -937856 -928419 -920458 -914943 -909940 -910603 -913566 -922447 -933012 -942619 -948879 -951098 -949439 -945236
16817 -945236 -940699 -934863 -928487 -918626 -910508 -905000 -901016 -895233 -889526 -884453 -879412 -873667 -868027 -864913
16803 -864913 -864480 -864853 -860770 -854421 -848312 -843655 -840974 -840649 -838583 -836348 -832391 -827030 -823519 -818980 -814804
16788 -814804 -812245 -811372 -809723 -806699 -801257 -796168 -791564 -788539 -786791 -788399 -785725 -780430 -777368 -774273
16774 -774273 -776066 -773912 -769303 -766120 -763573 -760813 -757389 -754624 -752170 -746982 -743387 -740609 -738023 -735511
16760 -735511 -733734 -733547 -731710 -728508 -727433 -725574 -722714 -720667 -719108 -716436 -711142 -704992 -704213 -701972 -700813
16745 -700813 -697873 -694240 -692677 -689944 -690796 -691972 -689412 -687128 -686455 -684005 -679405 -672727 -670506 -668739 -667923
16730 -667923 -666042 -664167 -661910 -661602 -661193 -658737 -655668 -653183 -650614 -648903 -648506 -647824 -645317 -642105 -642615
16715 -642615 -642088 -640972 -638306 -635725 -633122 -629108 -624970 -622107 -622132 -622115 -619075 -615624 -611868 -609536 -610766
16700 -610766 -609418 -607207 -602827 -598987 -597919 -596730 -594058 -590669 -589110 -588669 -587916 -588236 -588085 -583995 -579382
16685 -579382 -579211 -575890 -573441 -572478 -570865 -567024 -566348 -566218 -563120 -559100 -558792 -559714 -557958 -556879 -553497 -551754
16669 -551754 -548622 -545791 -542850 -539005 -537704 -537655 -538177 -537989 -536304 -531961 -531816 -530076 -529204 -527626 -526394 -524960
16653 -524960 -521534 -517812 -515315 -513566 -510408 -508777 -506809 -506845 -506110 -506858 -504946 -504360 -505118 -503547 -500513 -497048
16637 -497048 -494736 -494716 -495228 -493672 -491981 -491091 -489177 -485444 -482666 -481317 -479272 -476883 -474791 -471185 -468312
16622 -468312 -464897 -462493 -462192 -464160 -464732 -462941 -459633 -458455 -457673 -457342 -456285 -452917 -449602 -446549 -445750
16607 -445750 -446412 -445814 -445109 -443718 -441499 -440348 -437936 -434037 -431585 -431180 -430010 -431456 -432246 -429115 -427858
16592 -427858 -427792 -422596 -419965 -417875 -415910 -418438 -419719 -416956 -414502 -412574 -408641 -406643 -404828 -404643 -405413
16577 -405413 -403975 -401481 -397575 -395748 -394331 -394943 -394740 -395273 -394398 -393541 -391608 -388804 -386619 -385926 -384269 -379626
16561 -379626 -377096 -378609 -379048 -376981 -373907 -370993 -372293 -374475 -372732 -368352 -366057 -364928 -363890 -363225 -363522
16546 -363522 -360114 -356968 -357889 -357040 -354822 -353146 -353185 -352802 -352299 -348736 -347148 -348019 -346971 -347771 -347158 -343562
16530 -343562 -339774 -336288 -335000 -334071 -332143 -331372 -331277 -329977 -328756 -326546 -323419 -324582 -324117 -320874 -321198 -319874
16514 -319874 -320712 -320462 -318002 -316569 -315408 -315410 -315078 -312865 -311472 -311365 -310491 -309156 -307552 -305569 -303064 -301002
16498 -301002 -298414 -296501 -294592 -294947 -295635 -297037 -292713 -288857 -282989 -282136 -281783 -284087 -281406 -278850 -278965
16483 -278965 -277974 -274248 -273322 -271872 -270192 -270438 -270917 -273121 -275297 -274989 -273412 -272727 -271141 -267322 -264919 -263201
16467 -263201 -262656 -260751 -258858 -259377 -257932 -254187 -255312 -256604 -255508 -252690 -249850 -248831 -248224 -245937 -244724
16452 -244724 -244073 -241604 -240241 -239501 -240362 -244386 -247334 -247456 -243479 -240431 -239410 -239024 -236268 -234711 -232678
16437 -232678 -229876 -230755 -230433 -229977 -229725 -227673 -225442 -225558 -222899 -219755 -217514 -218089 -218411 -216092 -212607 -212191
16421 -212191 -214064 -212573 -208994 -207967 -207078 -208798 -211696 -212630 -212322 -211051 -208566 -207384 -205071 -201411 -200748
16406 -200748 -201406 -201261 -198519 -194882 -194765 -196618 -194761 -192996 -192557 -192968 -192082 -190015 -184817 -184014 -184876 -182974
16390 -182974 -179780 -177439 -177482 -176771 -174614 -177239 -179345 -180674 -180807 -178347 -175577 -173059 -170820 -168595 -166812
16375 -166812 -164383 -162138 -162653 -163171 -164212 -163195 -162239 -163580 -161446 -161620 -158596 -157478 -156584 -153369 -152715 -153692
16359 -153692 -154484 -152685 -149334 -147231 -146713 -146975 -145227 -143835 -143785 -141968 -140081 -140560 -140301 -138096 -137234 -134740
16343 -134740 -135027 -135325 -137134 -134942 -131227 -129500 -129813 -130635 -131355 -130139 -129080 -126147 -123916 -122166 -117932
16328 -117932 -117300 -118593 -120138 -123637 -122347 -119304 -116038 -115341 -112880 -113141 -113461 -112602 -110027 -109116 -107160 -103549
16312 -103549 -103154 -104126 -105638 -108059 -106276 -106350 -104152 -102207 -100747 -99217 -98207 -96130 -93776 -92648 -93978
16297 -93978 -94407 -92505 -90165 -86925 -88465 -90363 -90296 -89096 -88362 -89190 -88385 -84150 -83104 -83641 -81698 -80044
16281 -80044 -79754 -79183 -78963 -78285 -76543 -75219 -73784 -73224 -75049 -75852 -73605 -71199 -70832 -67939 -66038 -66204
16265 -66204 -67197 -66182 -65471 -65284 -64929 -64131 -62020 -59552 -58139 -57510 -57919 -56095 -53702 -54753 -54546 -54396 -53574
16248 -53574 -51835 -51398 -49121 -49112 -51738 -49255 -45707 -44267 -45070 -45099 -43264 -40313 -41564 -40586 -42741 -43075 -41552
16231 -41552 -37556 -33950 -32145 -31034 -30657 -29769 -30119 -30096 -27557 -25505 -26866 -28185 -28796 -28333 -27407 -27202 -24883
16214 -24883 -23510 -23033 -20443 -20022 -22590 -20955 -20369 -18763 -16930 -15593 -14887 -13226 -12477 -13251 -15806 -16790
16198 -16790 -15231 -13488 -10355 -8146 -6625 -5853 -4772 -1438 758 1116 -354 260 2176 2806 3851
16183 3851 4932 6591 6803 5929 4835 3323 1704 2703 3058 6495 9595 11454 11584 14794 14138 11544
16167 11544 14307 14388 12876 12009 14590 16898 18654 20841 21567 23119 24534 25694 24167 25009 26944 25931
16151 25931 24434 25398 24360 25775 27103 28891 30533 30688 29254 29455 30505 34151 35734 33997 34561
16136 34561 36263 36223 37356 41324 42112 43381 41830 42881 44711 45446 45752 46220 47342 47861 48334 50220
16120 50220 50107 48849 48894 49453 53436 56906 57552 56023 55734 56682 59940 60087 60634 63090 63721 62736 61457
16103 61457 64701 66813 66084 64105 65293 66349 66515 69193 69801 71371 71370 69601 70868 72359 72905 73839
16087 73839 72053 73141 74874 74649 75951 77628 76274 76422 79482 81372 81517 84267 85706 86524 88663
16072 88663 88974 88749 88034 87341 87251 87817 89919 90519 90202 93483 94302 94948 94780 96606 98082 96392 93957
16055 93957 93986 97944 102120 103864 101553 100893 100381 100217 102926 102683 104603 106768 108234 109284 109250 111386
16039 111386 113198 111411 111051 110799 111018 111168 112261 113505 111752 110147 112839 116072 118182 115593 115393
16024 115393 118678 122368 122346 122537 124333 124730 124183 123580 124499 127378 129221 128489 128631 128283 129728 131135 132493
16007 132493 129156 127552 129769 132217 132548 133736 134877 135704 135599 134634 135105 134721 135555 136582 138561 139337
15991 139337 139880 143421 144717 146758 146852 146388 147231 147480 149724 149005 147979 147124 149568 148990 148754 150465 151852
15974 151852 154872 156420 156407 155784 155072 155625 155729 156684 158444 158257 158071 160009 159423 159477 159773 161377 164912
15957 164912 165860 165570 165454 166129 168024 170239 169389 169543 171039 171224 170565 171042 169940 169727 171609 171314 172139
15940 172139 174894 175153 175104 177244 176347 176490 180418 182736 182930 182077 181190 179847 180245 183626 186250 187569
15924 187569 188932 191983 189449 188885 189178 189459 191898 194015 193779 192527 194483 196147 195097 193097 194768
15909 194768 193343 191546 193238 197762 202895 204182 200569 200445 202935 203535 204064 205766 205097 204363 205367
15894 205367 204266 204083 206590 209475 210326 210219 210884 210755 210965 211268 211268 214350 213033 214481 216895 217096 216825
15877 216825 217493 218240 217921 217980 218242 218407 218611 221396 223661 224214 222226 224982 226853 228643 229207 230297 232080
15860 232080 233836 233496 231906 232347 232373 231315 233411 235378 235539 236200 237477 234643 233856 234061 236193 237619
15844 237619 237353 235898 236665 238347 240534 242796 244573 243671 242493 242956 245362 247985 247587 248420 248484 249504
15828 249504 248268 247812 246524 245579 247244 250242 251166 252988 252365 255096 257374 255751 256998 258061 257636
15813 257636 258302 258614 258522 259068 256725 257621 260442 263421 264641 264408 262764 263616 264599 264756 267358 269530 269944
15796 269944 271150 271139 269528 271855 274726 273922 274739 276475 277794 273956 274788 275433 274416 275820 278456 278588
15780 278588 280957 282337 283763 282318 280302 281987 284744 286957 286592 287012 286854 285513 286440 288290 288702
15765 288702 287897 289493 288453 288400 291248 293574 295064 294698 295647 294828 294266 291573 290772 293160 298599 302206
15749 302206 302617 301835 300421 300266 300548 300687 301919 303153 304286 303253 304210 305790 306634 307704 307791 306183
15733 306183 305788 307988 310024 309285 308520 307891 309787 313896 314465 313993 312544 313226 316736 318397 318175 318251 316515
15716 316515 314942 316138 317882 318114 317182 318568 321681 324314 324847 325738 324057 324493 326579 329084 331284
15701 331284 332053 332884 331438 332074 332332 331498 332931 334857 337172 337644 339083 340265 340520 337682 335766 335624
15685 335624 334366 335256 336278 336771 338160 342129 343412 343731 344139 345201 344961 347008 348159 350974 348996
15670 348996 346269 345363 346076 347596 348069 348187 349396 352767 354213 356065 355636 354417 355921 355509 353623 351937
15654 351937 353237 356451 358807 359112 360902 361649 363358 366441 365303 361673 362207 362464 362411 365417 367387 367685
15638 367685 368915 369449 369258 371049 372162 373371 374585 376042 377862 377684 376311 378150 377816 378132 376692
15623 376692 377698 380107 378441 376289 376694 378185 379875 378075 381841 385868 385944 384831 383473 382663 383589
15608 383589 383237 381829 381977 384543 386200 388961 391877 391240 391071 392382 393360 394967 395856 398230 397807 397293
15592 397293 394833 394526 394920 395330 398074 399506 399484 398778 399544 401759 400311 400446 400642 400593 400323 402817 405550
15575 405550 407224 408768 409877 411410 413304 412110 413623 415584 413556 413872 414595 416688 417330 418194 419477
15560 419477 418239 416119 415535 418387 421350 422048 420475 420931 421017 419910 423122 424617 423826 425856 425274 425850
15544 425850 428117 428812 428288 427373 429322 429337 429846 429638 431129 434463 437208 437486 435513 434159 435218 436632
15528 436632 437388 437103 434700 434729 434681 436261 437236 436601 438976 439524 440689 442494 443312 444830 445631 446600 447851
15511 447851 447969 447438 446439 445411 447575 452470 454245 456065 456071 457238 457811 457102 457044 458948 461073 459665 458463
15494 458463 460508 460996 459742 461460 464513 464735 463659 464073 464337 465418 466648 466875 469306 468874 468633 468389
15478 468389 467481 469228 470120 470364 468749 468041 470933 474399 477273 478853 478646 476882 475633 476987 477136 476249
15462 476249 476254 478614 482588 483111 483937 483430 480497 480758 481100 480015 482837 482881 483534 484518 487224 487001 488054
15445 488054 488329 487898 488991 492552 494667 493398 492609 492607 495497 496544 496064 496357 497438 499335 500062 500082 498439
15428 498439 498689 501089 504290 505260 504168 503697 504353 505945 508499 508799 509965 511416 511562 509322 509340 511055
15412 511055 514895 516504 517917 520441 519415 517904 518917 520052 518388 517839 516649 518626 520717 520026 522213
15397 522213 523969 524119 523107 523852 523506 523910 525430 526668 526217 525732 527874 529429 529843 529144 530864 532848
15381 532848 533801 534299 535670 535452 533743 535153 535476 535610 534630 535985 537676 540895 541468 541271 539225 539722
15365 539722 539864 541068 544401 547213 546797 544708 544206 546982 547926 547500 547254 547458 549627 552065 555184 554232
15349 554232 556025 557831 558568 558571 558040 560312 559750 559288 559444 561066 564057 565703 566137 567836 569400 570540
15333 570540 570343 569287 568653 567702 567786 568810 569945 570751 569433 569211 570202 573647 574856 573493 575049 577848
15317 577848 578578 579420 580818 581035 581014 576886 576031 577696 581581 581383 580077 580909 580551 580645 581659 585282 587302
15300 587302 588111 589657 589481 590885 592335 594128 594442 595536 595492 595037 598580 597305 598777 602324 601331 598946
15284 598946 598592 597377 598476 600102 602761 603473 602650 602631 606604 609427 609818 610980 612445 613364 616043 616155
15268 616155 614092 612981 614869 617003 618066 618778 618455 618627 618505 621337 622213 621680 619812 619779 619505 620013 623509
15251 623509 624041 622577 623022 625407 625191 624426 624806 624817 626382 626481 626863 626992 630833 633177 633568 631960 634256
15234 634256 637999 636987 638154 639949 642164 641662 639329 640775 641897 641691 642188 645035 648581 648635 648384 648591
15218 648591 647950 646464 645806 647185 648242 648169 649283 648738 650816 653306 654364 654934 655077 653600 653608 655502 658413
15201 658413 660054 659198 657417 657875 662238 663409 663727 664578 663936 663550 664962 667058 667739 666758 667747 667714 666822
15184 666822 669223 674374 676570 675748 672311 672409 673667 675342 678570 678504 678091 679729 683428 683948 681175 682518
15168 682518 683245 682086 679790 679705 679354 682658 685667 687309 688821 685807 687595 690282 692354 693245 693948 695787
15152 695787 695096 693701 697603 700957 701263 701467 699458 698613 700583 705280 706083 705795 706185 706557 706833 708292
15136 708292 711235 712689 712486 709304 711264 714008 711546 712007 712346 713930 715712 716710 716679 716462 720336 721512
15120 721512 721650 722427 722607 723015 722859 724087 723831 722758 722219 723301 726783 731290 730266 727455 728799 731088
15104 731088 731831 733102 734177 735005 736753 736374 734863 737623 739829 741078 740998 743825 746666 745876 743652 746423
15088 746423 748441 745388 746399 749838 751003 752239 752967 752836 753239 754458 756105 754144 753309 752185 752472
15073 752472 752695 754850 757925 758230 757972 759285 762415 765978 765777 764234 764128 763191 765268 768462 769026 770638
15057 770638 770066 771139 774201 774581 773297 776515 778735 779263 780478 780954 778765 779750 781175 782031 782941 782095
15041 782095 781350 785375 786569 785497 785723 786356 787119 789321 790533 792318 794731 795742 796484 793743 792473
15026 792473 796219 800032 800554 800490 802770 805324 806079 806558 808785 809809 811045 811617 809643 807149 807293 808352
15010 808352 809031 807625 809380 812059 813475 814759 814141 814869 818287 820911 821752 822006 823378 826029 825178 824340
14994 824340 824868 826070 828150 829110 829362 831169 832988 832275 831990 832196 834955 833320 834493 836770 839063 842828
14978 842828 844853 845673 844349 841919 841595 841668 841955 842261 841388 843979 847291 851023 851673 848887 848637 851757
14962 851757 852859 855855 859734 858160 858527 861859 864082 863041 864092 864817 864808 863783 864518 867162 867250 867740
14946 867740 868675 869307 870175 871269 873179 871301 870878 873142 874253 875195 877180 878179 879076 880496 882162 884272
14930 884272 887637 889562 889133 889156 890573 891006 891139 891197 892202 892547 893748 893743 893470 895168 896202 897745 899014
14913 899014 898848 897560 899708 905027 906432 902943 901727 903487 906830 908158 906399 906790 908544 911550 914598
14898 914598 913512 913246 915085 919481 922909 925761 924196 922221 922739 921574 923134 926500 928740 927224 928632
14883 928632 932062 933048 932835 935261 936480 935138 933754 932578 934611 935452 934973 936992 937801 938903 939639 940199
14867 940199 942371 945681 948625 949875 947878 947586 948712 948952 949355 949988 951982 952943 954296 954667 956850 958883
14851 958883 959841 962749 964062 965499 967154 966388 965562 970158 973548 975202 975768 977532 979881 980518 979609 979307
14835 979307 979046 978184 976726 978986 980419 981136 982515 980282 983530 986948 989781 989694 989910 991378 992662 994713
14819 994713 996042 996426 997356 998404 1000198 1002878 1005680 1005481 1005790 1005827 1005607 1006503 1009513 1013536 1016649 1017232
14803 1017232 1016669 1016086 1017151 1018285 1018691 1021801 1021953 1021808 1021720 1023251 1022853 1023143 1026897 1026585 1026258 1026501 1027107
14786 1027107 1029085 1031189 1034145 1035385 1035285 1036484 1037059 1039447 1042773 1043531 1045032 1047939 1047695 1045120 1044924
14771 1044924 1044676 1046365 1051382 1053678 1055650 1055638 1057120 1058532 1059570 1059619 1058190 1057348 1059535 1062344 1066295
14756 1066295 1069850 1072527 1073126 1072245 1072396 1073814 1076571 1074155 1072221 1073458 1077023 1079303 1080323 1083196 1084890
14741 1084890 1083649 1085935 1089999 1092540 1094631 1094876 1091656 1091006 1092042 1093814 1093992 1094332 1098474 1102277 1102218
14726 1102218 1103000 1105058 1106142 1107733 1109541 1111354 1110746 1110921 1111390 1112619 1115308 1118227 1118685 1120249 1124215
14711 1124215 1122918 1120946 1124440 1124066 1124405 1126846 1129218 1131115 1132624 1133693 1134301 1133562 1133766 1135201 1135943
14696 1135943 1139983 1141626 1142452 1144044 1146787 1148453 1146417 1145765 1150707 1153759 1152848 1152817 1155864 1159785 1160207
14681 1160207 1161680 1163709 1163540 1163518 1164908 1167901 1166733 1169012 1170785 1172312 1174190 1175291 1175632 1177246 1179345
14666 1179345 1182080 1180385 1177540 1177484 1179110 1184027 1188792 1189197 1189147 1189436 1189999 1193350 1192632 1191367 1194713 1197648
14650 1197648 1199716 1202503 1202955 1205758 1207402 1210957 1212136 1213220 1214770 1216103 1218913 1219896 1220610 1222197 1225916
14635 1225916 1228184 1228044 1226987 1228599 1227729 1228851 1231369 1233281 1234584 1235358 1236492 1240940 1245136 1247820 1247447
14620 1247447 1247055 1248522 1250567 1252087 1253353 1250691 1250507 1251125 1252160 1252777 1253464 1254077 1259086 1265607 1266132 1266122
14604 1266122 1266185 1267843 1270811 1271261 1269454 1270026 1271675 1270766 1272854 1276813 1279441 1279582 1281504 1284015 1284206 1283823
14588 1283823 1288058 1290401 1290814 1293617 1294461 1295883 1298698 1302167 1304660 1306664 1308713 1307863 1311860 1313087 1311617
14573 1311617 1312990 1319139 1322992 1322790 1325123 1324950 1324998 1328254 1330095 1333066 1332620 1330103 1330432 1332356 1334187
14558 1334187 1335864 1339662 1343286 1346087 1343362 1343950 1346429 1348404 1349645 1351633 1355037 1356657 1360144 1362194
14544 1362194 1361601 1361684 1363317 1365009 1369245 1372544 1372874 1371249 1375804 1377696 1377932 1379958 1382396 1384425 1383570
14529 1383570 1381953 1383811 1389065 1393111 1394283 1397312 1399713 1402810 1402186 1401080 1403402 1409688 1413871 1414408
14515 1414408 1414004 1412509 1413405 1414170 1416630 1419261 1423053 1423936 1426584 1428887 1430836 1433632 1434709 1435461 1437058
14500 1437058 1437812 1440801 1443579 1446319 1446938 1448423 1449725 1453138 1456137 1458098 1460771 1461476 1462239 1464655 1468289
14485 1468289 1471420 1474018 1475236 1476738 1478051 1481417 1482699 1484498 1483408 1484249 1487475 1490885 1493728 1495803
14471 1495803 1498655 1499812 1498616 1499796 1503666 1504720 1504366 1509462 1514489 1516521 1518862 1518031 1515571 1517235
14457 1517235 1518565 1520395 1521285 1523798 1527026 1529192 1532309 1535378 1537977 1541242 1539158 1539566 1543328 1544715
14443 1544715 1546363 1549257 1551416 1554428 1556731 1560431 1564059 1564043 1565386 1569055 1569615 1570072 1571012 1574160 1579389
14428 1579389 1581404 1583726 1587302 1587304 1588708 1590123 1592542 1596545 1600579 1603719 1603136 1605264 1605959 1609751 1609989
14413 1609989 1612365 1613185 1616825 1622895 1624709 1625428 1626125 1626739 1628495 1629584 1634678 1639048 1637391 1639749 1644382
14398 1644382 1647599 1651039 1651232 1652322 1652651 1657033 1661567 1665121 1668769 1669424 1671995 1674660 1677435 1679203 1682612
14383 1682612 1683127 1684042 1686657 1689684 1691564 1692826 1694594 1697432 1701757 1706521 1709851 1710751 1713113 1715803 1715774
14368 1715774 1715875 1719039 1721247 1723756 1726153 1730659 1733062 1734816 1737647 1742587 1745771 1748468 1751150 1754330
14354 1754330 1755307 1757019 1759667 1763665 1769069 1771932 1773108 1775313 1780224 1785349 1787397 1787836 1790439 1795198
14340 1795198 1796970 1798065 1801933 1803281 1805890 1809617 1811956 1812921 1814777 1819877 1823674 1827671 1828806 1829162
14326 1829162 1833078 1837162 1840018 1843475 1847177 1848866 1852753 1854943 1859748 1863079 1864514 1865645 1868820 1869314
14312 1869314 1873708 1877159 1881583 1883430 1885877 1888462 1888126 1892407 1895398 1898145 1902572 1907161 1910901 1911179
14298 1911179 1914889 1918510 1919292 1922904 1928602 1934074 1938258 1941246 1944867 1947670 1947984 1949938 1952563 1959966
14284 1959966 1964383 1966072 1970834 1974927 1976118 1978954 1983235 1985814 1990016 1994865 1998108 1999773 2003193 2006452
14270 2006452 2010437 2016474 2020709 2024804 2026429 2028602 2033959 2039151 2041589 2042764 2045812 2048602 2053758 2059392
14256 2059392 2064202 2067615 2074819 2077342 2079762 2085335 2090296 2096698 2100921 2104476 2110023 2114455 2116827 2120444
14242 2120444 2124418 2128817 2131839 2136181 2143237 2147573 2154007 2158924 2163391 2170801 2175212 2180771 2188222 2193724
14228 2193724 2198636 2206660 2213190 2216758 2220124 2225025 2229878 2236650 2240782 2249121 2258319 2265619 2272211 2279584
14214 2279584 2290636 2299156 2303678 2309015 2311933 2313909 2317864 2319510 2320648 2320753 2319423 2316314 2312519 2308500
14200 2308500 2301722 2291577 2283684 2280642 2277487 2277024 2275346 2273424 2272532 2271814 2273726 2273257 2273332 2273299 2274145 2279291
14184 2279291 2282462 2283135 2281450 2281999 2283587 2283926 2282802 2279959 2273977 2268578 2267457 2260979 2252868 2247345 2243396
14169 2243396 2239533 2235190 2234872 2237036 2239326 2242588 2248405 2251507 2257014 2265516 2275261 2281582 2289228 2295306
14155 2295306 2299382 2309574 2318344 2325326 2333103 2341914 2349148 2355878 2362511 2371141 2379314 2387700 2395197 2403918
14141 2403918 2408020 2412926 2423105 2432286 2435548 2440142 2445908 2453216 2461179 2469752 2476176 2482344 2488840 2493069
14127 2493069 2500039 2508374 2513907 2519894 2527654 2534603 2541967 2545601 2553434 2562807 2568262 2572092 2579533 2586997
14113 2586997 2592390 2599291 2605868 2609244 2613245 2620456 2628481 2637897 2647276 2652898 2655593 2661226 2666423 2668941
14099 2668941 2675747 2684573 2693164 2700747 2705376 2709796 2716702 2724440 2728888 2734944 2742359 2751355 2759389 2765830
14085 2765830 2772129 2778304 2784371 2789364 2794956 2799287 2806644 2813538 2820220 2828972 2838680 2848978 2855400 2861185
14071 2861185 2867687 2875025 2884045 2890973 2898269 2906092 2912790 2919570 2927197 2934867 2943899 2953425 2962122 2966426
14057 2966426 2970734 2978758 2984115 2989712 2998179 3006466 3012958 3021524 3029983 3038819 3044389 3051320 3059705 3069127
14043 3069127 3079682 3087941 3096437 3105024 3113314 3120637 3128129 3133614 3140180 3147570 3155925 3164948 3172039 3178519
14029 3178519 3184357 3194748 3206075 3215529 3227268 3238985 3243125 3249893 3260885 3273882 3283145 3292054
14017 3292054 3300707 3308940 3317824 3330339 3341457 3350710 3356587 3364607 3370932 3378871 3387598 3397292 3406013
14004 3406013 3414782 3423844 3433222 3441859 3450082 3458372 3465805 3476665 3486730 3496333 3507421 3518165 3530529
13991 3530529 3541867 3553778 3565030 3575170 3583374 3591304 3602156 3612210 3621310 3629887 3640442 3651632
13979 3651632 3660868 3674992 3687460 3694108 3703125 3711356 3723224 3735422 3747608 3757571 3767122 3778918
13967 3778918 3789949 3799629 3809878 3822100 3834892 3849212 3863235 3873153 3882360 3895206 3907185 3921121
13955 3921121 3934774 3944797 3955625 3968114 3981951 3998057 4014383 4026314 4038972 4053880 4068580
13944 4068580 4083910 4098584 4115708 4132513 4153046 4172793 4189280 4205468 4224506 4244082 4262899
13933 4262899 4278287 4294239 4314220 4333552 4354391 4375026 4391713 4407424 4424186 4442160 4459939
13922 4459939 4478802 4499649 4518504 4539535 4561197 4583222 4605775 4627561 4650733 4673288 4699055
13911 4699055 4724267 4745048 4765142 4788520 4815244 4842603 4870108 4897062 4922735 4951166 4979740
13900 4979740 5004082 5026760 5052432 5078558 5107043 5136302 5163513 5192203 5218947 5247420 5275355
13889 5275355 5306187 5337491 5367694 5395808 5425090 5455568 5485136 5517830 5549461 5583157 5618732
13878 5618732 5655103 5688766 5724664 5760761 5796756 5835114 5870733 5905880 5942027 5977434 6010193
13867 6010193 6048772 6088928 6126342 6164466 6203789 6243470 6286048 6331361 6375457 6417858 6461850
13856 6461850 6508359 6553358 6599738 6648144 6694187 6741494 6791496 6842763 6893336 6942919 6995678
13845 6995678 7051793 7107978 7161266 7215143 7270570 7328395 7390847 7452339 7512990 7577175 7644031
13834 7644031 7711746 7781050 7850291 7922245 7997239 8075048 8153702 8233562 8312266 8393947 8474263
13823 8474263 8560669 8651341 8744578 8839168 8934821 9037566 9141923 9246930 9353476 9461965
13813 9461965 9572941 9690892 9813800 9941590 10074468 10208350 10346815 10490525 10638798
13804 10638798 10791133 10948609 11112588 11283883 11461047 11645977 11841193 12043160 12252167
13795 12252167 12469485 12692910 12923192 13165650 13419218 13686156 13964968 14255435 14560986
13786 14560986 14883137 15225361 15589842 15972122 16369233 16782621 17219648 17682856 18170668
13777 18170668 18675263 19181558 19684022 20180417 20682173 21208524 21777841 22390695 23040491
13768 23040491 23707676 24370121 25014068 25612785 26142402 26572641 26867198 26977479 26856697
13759 26856697 26472018 25804104 24862315 23675688 22271180 20686727 18971266 17176622
13751 17176622 15360747 13573307 11863364 10272280 8837234 7581922 6523998 5651410
13743 5651410 4938671 4355930 3875136 3463098 3085012 2715769 2323452 1887028 1386253
13734 1386253 817841 174735 -562804 -1423944 -2435344 -3618859 -4980786 -6512898 -8195554
13725 -8195554 -10001054 -11893570 -13821151 -15714279 -17490842 -19065303 -20371221 -21373271
13717 -21373271 -22069326 -22476594 -22634732 -22584844 -22363283 -22001664 -21540435 -21007310 -20424635
13708 -20424635 -19812470 -19188783 -18562219 -17938798 -17320630 -16718172 -16134952 -15573670 -15034655
13699 -15034655 -14515706 -14016716 -13540111 -13083163 -12646439 -12228761 -11834036 -11458780 -11095143
13690 -11095143 -10748254 -10414939 -10100099 -9797317 -9503822 -9224239 -8954336 -8694146 -8447105
13681 -8447105 -8210267 -7983147 -7764481 -7554479 -7354060 -7156603 -6964521 -6780304 -6601487
13672 -6601487 -6429688 -6265177 -6107141 -5953816 -5804474 -5654671 -5511535 -5374981 -5239408
13663 -5239408 -5110396 -4985569 -4869140 -4758474 -4647956 -4535125 -4422919 -4316267 -4211645
13654 -4211645 -4108016 -4009493 -3912279 -3817667 -3721706 -3629165 -3536923 -3447471 -3362125 -3279391 -3198858
13643 -3198858 -3121114 -3045579 -2970035 -2898513 -2828221 -2758147 -2687751 -2613968 -2541522 -2470766 -2399490
13632 -2399490 -2330704 -2268381 -2208835 -2151209 -2094722 -2036753 -1979551 -1917906 -1860119 -1803972 -1746923
13621 -1746923 -1692536 -1643071 -1597092 -1553041 -1507052 -1458482 -1408184 -1358335 -1309352 -1261380 -1214943
13610 -1214943 -1170641 -1123953 -1078028 -1032499 -988262 -945430 -901404 -856982 -809179 -761853 -713582
13599 -713582 -664247 -616427 -570994 -524672 -485801 -461260 -439929 -414550 -388045 -364017 -336166
13588 -336166 -304772 -273938 -241610 -208859 -177825 -144316 -108727 -74474 -41708 -7428 30936
13577 30936 70192 109778 151819 196406 236094 269998 302196 330389 360361 390418 422971 452834
13565 452834 481695 509405 536184 562337 591146 623416 654725 686460 718667 751894 784926
13554 784926 813915 842503 875143 906461 937408 970122 1004235 1040459 1077296 1116327 1156738
13543 1156738 1198315 1241369 1270347 1289489 1335660 1364262 1376278 1408816 1387598 1319130 1312317
13532 1312317 1330105 1333837 1367251 1407257 1442540 1488988 1539066 1586753 1631581 1676406 1722312
13521 1722312 1768014 1807335 1840139 1870793 1898612 1925056 1951077 1978671 2007235 2041232 2074540
13510 2074540 2104776 2139135 2172938 2202147 2228795 2254488 2281049 2308077 2337688 2370287 2405080
13499 2405080 2439512 2472827 2501226 2523959 2548268 2576649 2609019 2645298 2684073 2720830 2757801
13488 2757801 2789145 2811064 2828312 2844807 2863465 2887054 2916157 2947568 2972187 2988737 2990251
13477 2990251 2983604 2973192 2961002 2958601 2996864 3095991 3227384 3375701 3507463 3597878 3665345
13466 3665345 3725380 3781837 3834742 3882749 3923269 3955583 3979927 4003843 4027106 4052902 4087337
13455 4087337 4127728 4164408 4205192 4247244 4287221 4331111 4377175 4424661 4474050 4519503 4557910
13444 4557910 4595748 4626579 4649765 4668600 4691541 4744386 4843556 4957774 5067126 5158918 5229758
13433 5229758 5286999 5330543 5375576 5423513 5474192 5531065 5590849 5656738 5726175 5795523 5862914
13422 5862914 5930028 5992919 6051678 6110572 6170769 6235591 6298964 6364876 6433852 6514946 6609726
13411 6609726 6708501 6787501 6849880 6911301 6971315 7017491 7066067 7139735 7229914 7318648 7402895
13400 7402895 7479495 7557053 7628548 7703983 7788703 7874155 7958935 8045534 8137590 8233642 8332660
13389 8332660 8436685 8544785 8650370 8747846 8838946 8927564 9022337 9126900 9244124 9369848
13379 9369848 9496887 9617899 9735106 9847394 9960737 10081353 10209561 10341158 10471985
13370 10471985 10606077 10746122 10899691 11060651 11225670 11390064 11549100 11708589 11874487
13361 11874487 12046095 12226812 12416440 12603603 12787305 12976667 13173720 13381921 13600148
13352 13600148 13819721 14042138 14267726 14494270 14731892 14979966 15235580 15492714 15756875
13343 15756875 16038813 16338019 16643096 16950349 17267671 17595307 17934973 18294250 18673457
13334 18673457 19061758 19461055 19880848 20324388 20794451 21277542 21766496 22277893 22822073
13325 22822073 23406395 24027047 24679374 25375116 26109532 26874419 27675456 28516230 29396446
13316 29396446 30313886 31258836 32224437 33205236 34221175 35323023 36543869 37891190 39359524
13307 39359524 40905340 42523714 44262336 46187271 48344110 50742006 53369336 56248180
13299 56248180 59458291 63141718 67393080 72268109 77833449 84199635 91509635 99957120
13291 99957120 109777634 121423860 135353735 152106924 172127150 193154958 204126847
13284 204126847 180182553 103151310 2366339 -90210672 -162105581 -190239501 -184677417
13277 -184677417 -168002134 -151006023 -136256722 -123625909 -112678568 -103225750 -95163955
13270 -95163955 -88267411 -82292297 -77071938 -72453006 -68332861 -64662443 -61412011 -58557066
13262 -58557066 -56023157 -53699390 -51505897 -49396435 -47376034 -45489524 -43748431 -42167189
13254 -42167189 -40730027 -39400955 -38174383 -37054125 -36048643 -35138776 -34277545 -33432795
13246 -33432795 -32597114 -31779570 -30991048 -30227101 -29493369 -28786099 -28097457 -27431179 -26790695
13237 -26790695 -26172415 -25584352 -25028746 -24506589 -24011384 -23531555 -23071633 -22639872 -22225210
13228 -22225210 -21824552 -21436544 -21048584 -20672570 -20317067 -19976137 -19647313 -19331985 -19022784
13219 -19022784 -18715210 -18420649 -18142961 -17874241 -17614728 -17357481 -17108690 -16873989 -16656187
13210 -16656187 -16448211 -16242477 -16036827 -15832840 -15634896 -15446030 -15267498 -15089936 -14905218
13201 -14905218 -14720297 -14538454 -14368388 -14210038 -14057694 -13906415 -13757488 -13607115 -13452119
13192 -13452119 -13301243 -13154566 -13012163 -12874214 -12735429 -12600260 -12469809 -12348959 -12231660
13183 -12231660 -12118046 -12002745 -11886036 -11766680 -11648463 -11537393 -11432954 -11334462 -11246754 -11160653
13173 -11160653 -11076796 -10995205 -10912009 -10821868 -10728309 -10629786 -10533188 -10434208 -10328672 -10230393 -10141449
13162 -10141449 -10050522 -9953955 -9863167 -9805840 -9783382 -9733385 -9619152 -9529712 -9497240 -9441927 -9380220
13151 -9380220 -9337251 -9291626 -9235613 -9172711 -9105788 -9035144 -8971767 -8907762 -8841249 -8778953 -8721227
13140 -8721227 -8667599 -8616324 -8566760 -8516497 -8465668 -8410481 -8350034 -8282550 -8219414 -8157222 -8102404
13129 -8102404 -8074563 -8071795 -8090187 -8106082 -8104621 -8075814 -8016422 -7947271 -7878054 -7809522 -7750942 -7699041
13117 -7699041 -7655943 -7615985 -7578826 -7541278 -7500371 -7455857 -7405756 -7354867 -7307456 -7264131 -7218266
13106 -7218266 -7169859 -7121491 -7072526 -7026246 -6983263 -6944500 -6912814 -6884413 -6857911 -6833718 -6817226
13095 -6817226 -6823164 -6870942 -6955047 -7030747 -7073086 -7066448 -7005348 -6929670 -6854007 -6779679 -6714020 -6662532
13083 -6662532 -6620977 -6586150 -6549103 -6507951 -6462342 -6413608 -6366361 -6324338 -6286467 -6259926 -6236959
13072 -6236959 -6214558 -6189869 -6159914 -6124322 -6088813 -6053159 -6020639 -5991793 -5969962 -5946040 -5923707
13061 -5923707 -5899535 -5876789 -5847009 -5816844 -5786720 -5756912 -5729256 -5704972 -5681074 -5653798 -5626195
13050 -5626195 -5596772 -5568968 -5538755 -5506783 -5476062 -5446019 -5423733 -5406782 -5391444 -5375183 -5358134
13039 -5358134 -5338890 -5319226 -5302983 -5288786 -5270147 -5258473 -5246507 -5225307 -5197044 -5171915 -5150753
13028 -5150753 -5140484 -5129992 -5113902 -5097284 -5082539 -5064867 -5049031 -5032992 -5016357 -4999492 -4981705
13017 -4981705 -4963902 -4942050 -4920421 -4902302 -4884850 -4868079 -4851589 -4833047 -4813579 -4795346 -4775368
13006 -4775368 -4756512 -4741570 -4726317 -4711206 -4696256 -4679951 -4659049 -4638153 -4623296 -4608998 -4596537
12995 -4596537 -4582423 -4565058 -4546598 -4531912 -4520802 -4512381 -4508128 -4503947 -4498695 -4492359 -4482120 -4470453
12983 -4470453 -4457772 -4445195 -4428319 -4408649 -4391744 -4373020 -4354363 -4336381 -4320215 -4302923 -4282473
12972 -4282473 -4257875 -4232191 -4205412 -4174439 -4158330 -4154983 -4152016 -4151627 -4150327 -4142066 -4132094 -4121379 -4110903
12959 -4110903 -4100412 -4091230 -4082524 -4073480 -4063646 -4052869 -4038012 -4023284 -4009958 -4002172 -3995520 -3985440
12947 -3985440 -3972550 -3957554 -3941832 -3927115 -3913082 -3899969 -3892874 -3884035 -3874992 -3868315 -3856210 -3842357
12935 -3842357 -3829833 -3816075 -3802322 -3791794 -3783825 -3779268 -3773721 -3766998 -3759060 -3747483 -3735539 -3724450
12923 -3724450 -3714405 -3703694 -3691808 -3679978 -3669660 -3659470 -3650599 -3642263 -3634200 -3625642 -3616084 -3606733
12911 -3606733 -3599783 -3592389 -3585125 -3574661 -3564684 -3554333 -3542909 -3531394 -3522279 -3509446 -3497659 -3488726
12899 -3488726 -3483131 -3475138 -3466444 -3456991 -3448117 -3440834 -3433568 -3424410 -3413470 -3404717 -3394647 -3387768 -3378169
12886 -3378169 -3365961 -3354307 -3342430 -3331692 -3327333 -3319613 -3312132 -3305449 -3299978 -3292387 -3285575 -3274259 -3264104
12873 -3264104 -3251600 -3241211 -3232869 -3220017 -3209789 -3200846 -3193931 -3184423 -3172699 -3161071 -3152244 -3144598
12861 -3144598 -3138603 -3130005 -3119997 -3111176 -3100505 -3085457 -3069241 -3053600 -3033771 -3017657 -3001405 -2987107
12849 -2987107 -2970859 -2951896 -2931695 -2909778 -2888239 -2868012 -2845190 -2820361 -2789438 -2757308 -2740672
12838 -2740672 -2755262 -2815680 -2912965 -3018602 -3103221 -3146958 -3150880 -3128457 -3093744 -3052089 -3008953
12827 -3008953 -2967088 -2928672 -2901441 -2895573 -2917179 -2958760 -3003872 -3027179 -3023098 -2993414 -2947789 -2901827
12815 -2901827 -2857945 -2816761 -2789190 -2788157 -2821341 -2880460 -2950813 -3013672 -3052102 -3065056 -3055476 -3027007
12803 -3027007 -2995890 -2968469 -2962784 -2980897 -3012838 -3045760 -3060612 -3054576 -3034850 -3005093 -2969666 -2933403
12791 -2933403 -2898589 -2861668 -2827556 -2800751 -2789536 -2810866 -2867705 -2950229 -3030133 -3092302 -3123640
12780 -3123640 -3123762 -3106757 -3080798 -3055524 -3029840 -3008042 -2987061 -2968759 -2951674 -2937147 -2922172 -2908150
12768 -2908150 -2896754 -2885724 -2873178 -2860987 -2846494 -2838277 -2830754 -2819535 -2811357 -2804392 -2796633 -2786913
12756 -2786913 -2778226 -2772035 -2763878 -2755913 -2748523 -2743105 -2740201 -2733723 -2727065 -2721173 -2714507 -2707214 -2701027 -2696337
12742 -2696337 -2689516 -2683131 -2675181 -2668578 -2662847 -2659149 -2655545 -2649540 -2643693 -2639703 -2636824 -2633683 -2627385 -2620506
12728 -2620506 -2613266 -2609680 -2603229 -2594447 -2585748 -2578539 -2571344 -2566507 -2562517 -2559388 -2556254 -2552174 -2546606 -2542376
12714 -2542376 -2538311 -2534122 -2527647 -2523588 -2518169 -2511919 -2507921 -2504461 -2501126 -2496003 -2490589 -2483199 -2480398 -2477573
12700 -2477573 -2473807 -2471693 -2467519 -2461976 -2458404 -2452367 -2448329 -2441970 -2436389 -2431591 -2428800 -2427461 -2423872 -2422559
12686 -2422559 -2418659 -2412651 -2406749 -2402460 -2396853 -2394151 -2394690 -2392990 -2387488 -2380512 -2374464 -2368605 -2365528 -2364496
12672 -2364496 -2360401 -2357013 -2354654 -2350085 -2347493 -2342577 -2341563 -2336034 -2328619 -2326869 -2326282 -2321685 -2316548 -2312827
12658 -2312827 -2310503 -2302852 -2295852 -2291485 -2289564 -2286763 -2281987 -2275861 -2273297 -2271849 -2268181 -2263596 -2260319 -2255076
12644 -2255076 -2249662 -2246542 -2243348 -2243404 -2242263 -2235728 -2233339 -2230423 -2226013 -2223171 -2220556 -2216070 -2212001 -2207733
12630 -2207733 -2201813 -2195558 -2193517 -2193329 -2191471 -2187349 -2185233 -2183117 -2179796 -2175021 -2170156 -2164714 -2161436 -2158496
12616 -2158496 -2157305 -2156005 -2151226 -2148302 -2144517 -2141432 -2139039 -2136396 -2133703 -2130984 -2126603 -2123359 -2121538 -2116359
12602 -2116359 -2113753 -2108474 -2104473 -2100463 -2099000 -2098924 -2096152 -2092766 -2088241 -2083788 -2080476 -2080077 -2080058 -2076055 -2071236
12587 -2071236 -2069079 -2066335 -2064499 -2062842 -2059243 -2054723 -2050734 -2045668 -2040462 -2036424 -2035385 -2032478 -2029334 -2029059
12573 -2029059 -2030425 -2028258 -2024487 -2020496 -2019094 -2016936 -2012391 -2008512 -2006608 -2003958 -2001343 -1995019 -1993370 -1991088
12559 -1991088 -1988070 -1986783 -1984905 -1982832 -1980184 -1978386 -1975629 -1974343 -1973000 -1972816 -1972952 -1968457 -1963367 -1958330
12545 -1958330 -1955141 -1954176 -1951425 -1950004 -1949782 -1943588 -1938469 -1938478 -1938167 -1938029 -1935837 -1930478 -1926487 -1921981 -1917813 -1914479
12529 -1914479 -1910410 -1907837 -1906694 -1904626 -1902388 -1897872 -1894582 -1895755 -1892866 -1888748 -1885026 -1881131 -1878282 -1876718
12515 -1876718 -1876082 -1874218 -1870649 -1868815 -1866112 -1862571 -1861529 -1860211 -1858492 -1857210 -1853453 -1850363 -1845604 -1841180
12501 -1841180 -1839160 -1836078 -1832461 -1828864 -1827000 -1824306 -1823142 -1818198 -1815953 -1812767 -1811568 -1807726 -1806724 -1806917
12487 -1806917 -1804001 -1799686 -1797836 -1795932 -1794579 -1791514 -1789351 -1787614 -1784296 -1779606 -1777170 -1778164 -1777200 -1773430
12473 -1773430 -1767086 -1762508 -1761120 -1758743 -1754819 -1750627 -1749256 -1747912 -1744698 -1739886 -1736533 -1735267 -1735674 -1734711
12459 -1734711 -1732560 -1730318 -1729986 -1726486 -1720769 -1717650 -1718099 -1716764 -1712881 -1710124 -1707615 -1703075 -1700286 -1699583 -1695869
12444 -1695869 -1693464 -1690657 -1686314 -1683178 -1681711 -1679598 -1679073 -1679239 -1676863 -1672988 -1669842 -1667235 -1667049 -1663655 -1659960
12429 -1659960 -1654194 -1651947 -1650485 -1648665 -1646432 -1643219 -1639901 -1639107 -1638396 -1633212 -1629698 -1625836 -1623633 -1622615
12415 -1622615 -1617563 -1615864 -1614574 -1610274 -1608800 -1608316 -1604828 -1601668 -1599196 -1593689 -1590149 -1588458 -1587842 -1585063
12401 -1585063 -1583556 -1579327 -1576911 -1570476 -1566365 -1562168 -1559017 -1557756 -1552737 -1548936 -1543880 -1540758 -1538842 -1534452
12387 -1534452 -1531127 -1525614 -1520584 -1518869 -1514619 -1508353 -1502505 -1499705 -1496861 -1493698 -1489906 -1482617 -1477389 -1475804
12373 -1475804 -1472765 -1466578 -1460238 -1454280 -1449189 -1444761 -1438504 -1433347 -1427468 -1424820 -1416307 -1406850 -1401832 -1394999
12359 -1394999 -1388010 -1380585 -1370687 -1362121 -1355933 -1348698 -1344806 -1340328 -1335222 -1331500 -1335052 -1345396 -1358889
12346 -1358889 -1372469 -1391668 -1413267 -1434853 -1455027 -1472996 -1484024 -1490024 -1493982 -1495729 -1493154 -1490119
12334 -1490119 -1486198 -1476417 -1468929 -1463931 -1457111 -1450767 -1446956 -1446139 -1443007 -1438941 -1434795 -1430504 -1426702 -1425950
12320 -1425950 -1427546 -1425177 -1419572 -1416518 -1412300 -1408882 -1403508 -1401713 -1401789 -1403932 -1407499 -1418504 -1432938 -1457069
12306 -1457069 -1486648 -1518681 -1550045 -1578425 -1604471 -1624678 -1638741 -1649311 -1654649 -1657671 -1657379 -1655203
12294 -1655203 -1649587 -1644701 -1641860 -1640924 -1643628 -1645906 -1644606 -1643268 -1642269 -1641412 -1638520 -1634834 -1632189 -1629510 -1626420
12279 -1626420 -1621525 -1617798 -1612899 -1608674 -1606338 -1601745 -1597209 -1599473 -1603490 -1613206 -1626366 -1636316 -1644808 -1653081
12265 -1653081 -1659009 -1664563 -1668955 -1669500 -1662935 -1656056 -1653391 -1647554 -1639463 -1632347 -1625835 -1621140 -1616633 -1608929
12251 -1608929 -1601693 -1594907 -1590612 -1588476 -1584258 -1581298 -1576209 -1569585 -1563546 -1560421 -1558188 -1555995 -1553203 -1550624
12237 -1550624 -1549245 -1545222 -1540081 -1534785 -1530461 -1527428 -1524780 -1519683 -1514965 -1512815 -1510032 -1505536 -1503096 -1503432
12223 -1503432 -1502113 -1498187 -1492759 -1489039 -1485178 -1484475 -1481016 -1479233 -1475990 -1471814 -1471501 -1471657 -1468226 -1465625 -1464331
12208 -1464331 -1460864 -1457767 -1455413 -1453672 -1451446 -1449826 -1445921 -1444483 -1442765 -1440426 -1440907 -1437049 -1434652 -1432380
12194 -1432380 -1427566 -1426498 -1426914 -1425762 -1423801 -1419665 -1416437 -1414725 -1412339 -1411468 -1411038 -1409704 -1406776 -1405264 -1406091
12179 -1406091 -1403234 -1400070 -1398644 -1399536 -1399057 -1394401 -1393815 -1394150 -1391267 -1388870 -1388238 -1385649 -1382051 -1378983 -1376326
12164 -1376326 -1373780 -1373094 -1373127 -1374654 -1370327 -1367117 -1366681 -1364879 -1362813 -1360976 -1360084 -1358573 -1355151 -1351615 -1351857
12149 -1351857 -1351067 -1349336 -1349209 -1349715 -1347079 -1345970 -1343837 -1343080 -1343272 -1341867 -1338341 -1335188 -1335594 -1336549 -1333553 -1330377
12133 -1330377 -1329824 -1328084 -1325828 -1324856 -1325591 -1326766 -1322460 -1319760 -1315686 -1314432 -1314829 -1314939 -1310121 -1307311 -1307620
12118 -1307620 -1308731 -1306476 -1303944 -1301818 -1299571 -1297630 -1296260 -1294303 -1294098 -1287751 -1286694 -1287383 -1288678 -1288799 -1288501
12103 -1288501 -1285344 -1283377 -1282447 -1280790 -1279014 -1277062 -1277225 -1275114 -1274955 -1274570 -1272973 -1271058 -1269835 -1265831 -1263020
12088 -1263020 -1262726 -1262722 -1261218 -1257702 -1257904 -1255604 -1254900 -1253739 -1250006 -1249742 -1252329 -1251556 -1247032 -1245992 -1245405 -1244329
12072 -1244329 -1242661 -1241306 -1241670 -1241319 -1239446 -1238116 -1237813 -1234214 -1233302 -1233923 -1234132 -1231452 -1229680 -1229385 -1227858 -1225183
12056 -1225183 -1224587 -1224220 -1220652 -1217427 -1219114 -1220310 -1220050 -1216135 -1213817 -1213779 -1213501 -1212453 -1210010 -1207860 -1206812
12041 -1206812 -1207021 -1205259 -1202557 -1200808 -1201737 -1202563 -1202864 -1203188 -1201820 -1198510 -1197194 -1196316 -1194063 -1192158 -1189864
12026 -1189864 -1190279 -1188140 -1186960 -1188182 -1186944 -1184721 -1182487 -1180678 -1180031 -1178505 -1176255 -1173915 -1170891 -1172475
12012 -1172475 -1175670 -1174495 -1173325 -1172298 -1171302 -1167558 -1167804 -1167229 -1166400 -1165021 -1162219 -1161635 -1159664 -1157855 -1159025
11997 -1159025 -1158665 -1157538 -1155665 -1155403 -1156736 -1156545 -1153123 -1152768 -1151929 -1151636 -1150760 -1148778 -1145149 -1143161 -1141508 -1143184
11981 -1143184 -1142141 -1140521 -1140616 -1139367 -1139048 -1137288 -1137515 -1137745 -1137344 -1133596 -1130968 -1130135 -1128767 -1128813 -1128797 -1126549 -1125240
11964 -1125240 -1127010 -1124720 -1122756 -1120206 -1118979 -1117278 -1116648 -1116855 -1117017 -1117632 -1115542 -1114019 -1112078 -1109654 -1108127
11949 -1108127 -1108808 -1106496 -1103124 -1103917 -1105840 -1104095 -1104189 -1102810 -1098886 -1097901 -1097410 -1095383 -1094253 -1091550 -1092293 -1092057
11933 -1092057 -1091785 -1093091 -1094816 -1094049 -1091771 -1089855 -1086934 -1083231 -1080380 -1078769 -1078816 -1079702 -1081141 -1080276 -1078457
11918 -1078457 -1075288 -1073965 -1074251 -1075558 -1074977 -1076191 -1074932 -1072103 -1068838 -1065800 -1066183 -1065218 -1063404 -1064010 -1062544
11903 -1062544 -1060970 -1060829 -1060534 -1059145 -1056841 -1054330 -1055722 -1057714 -1054960 -1054915 -1051898 -1051800 -1052563 -1052556 -1051122 -1049091
11887 -1049091 -1048216 -1046213 -1046576 -1045396 -1042232 -1041772 -1040447 -1039572 -1038055 -1037154 -1038672 -1039942 -1038082 -1037684 -1035053
11872 -1035053 -1034963 -1031773 -1028467 -1026883 -1024855 -1025709 -1025650 -1023020 -1020053 -1017833 -1019760 -1021872 -1023008 -1020739 -1018577
11857 -1018577 -1018090 -1015809 -1014809 -1014089 -1015741 -1015160 -1012632 -1010848 -1007745 -1005287 -1005642 -1007854 -1006833 -1006691 -1005233
11842 -1005233 -1005592 -1004253 -1000594 -999176 -997759 -996750 -994884 -993133 -993741 -992496 -989361 -988845 -990382 -990399 -990895
11827 -990895 -987665 -987019 -983454 -983379 -985532 -983076 -979713 -974835 -973701 -972107 -968746 -966814 -966342 -965184 -962351
11812 -962351 -963055 -963032 -962971 -963268 -964550 -970874 -976814 -984059 -987457 -991059 -995181 -997169 -998218 -998068 -995942 -993310
11796 -993310 -990649 -987170 -984770 -983323 -982095 -980211 -980722 -981469 -979920 -976883 -975939 -975042 -973360 -972346 -968002
11781 -968002 -963817 -963442 -963875 -964267 -962278 -959539 -958974 -959585 -958010 -956366 -954078 -953530 -953704 -954211 -952108 -949168
11765 -949168 -949211 -948791 -950843 -951107 -948075 -945128 -943910 -940750 -940274 -940438 -938631 -939196 -938545 -937759 -934121 -930886
11749 -930886 -929846 -930875 -931335 -931294 -931074 -927928 -928205 -928356 -926185 -925328 -925327 -924221 -924398 -923426 -924857 -923261 -921747
11732 -921747 -921671 -916893 -914868 -915980 -917021 -917400 -917609 -917829 -917362 -915696 -913580 -914437 -916315 -913439 -909054 -907493
11716 -907493 -908375 -905566 -901291 -902463 -905758 -906951 -904571 -902377 -901655 -897370 -894303 -895835 -897619 -896628 -894391
11701 -894391 -891939 -892934 -890586 -889388 -892082 -894110 -893082 -888442 -888417 -885520 -881866 -881012 -878316 -878833 -878416 -877283
11685 -877283 -877197 -875066 -874564 -874622 -873142 -872907 -875578 -875040 -874909 -875035 -874674 -870204 -866376 -867334 -867913 -865721 -864414
11668 -864414 -863161 -863668 -861396 -860409 -861835 -860944 -860151 -859479 -858585 -858862 -859596 -857206 -854905 -855351 -856814 -857917
11652 -857917 -857642 -856581 -856642 -854897 -850754 -848497 -849652 -849922 -848711 -848012 -847954 -846257 -848420 -848370 -844963 -842514
11636 -842514 -843317 -841413 -838525 -839825 -839865 -838411 -835809 -836640 -837107 -835714 -834796 -833259 -832903 -831267 -829596 -831720
11620 -831720 -834177 -833271 -830001 -827555 -825394 -824079 -823971 -823820 -824871 -824224 -821259 -821664 -822168 -821051 -820189 -819112
11604 -819112 -817106 -816119 -816514 -815428 -815761 -813632 -813867 -812596 -811204 -810370 -810885 -808366 -806480 -805159 -802505 -800307
11588 -800307 -799510 -799620 -800131 -801125 -799282 -799848 -798735 -798501 -798798 -796382 -796151 -797467 -797285 -796614 -796093 -793760 -790683
11571 -790683 -790148 -793165 -792903 -793722 -792790 -792917 -793954 -793001 -788574 -784547 -783676 -782938 -782019 -780214 -781376 -783936
11555 -783936 -783601 -781715 -782228 -781704 -779136 -777740 -779484 -777132 -774306 -775278 -774344 -775509 -772762 -772586 -771352 -771086
11539 -771086 -771758 -770907 -768881 -766458 -765354 -764484 -765468 -764762 -762709 -760963 -759463 -760584 -760526 -758626 -757065 -755101
11523 -755101 -755719 -755408 -755575 -754689 -753237 -750996 -749150 -751464 -751647 -753255 -752262 -748402 -748513 -747472 -744705 -741949
11507 -741949 -741467 -741082 -740582 -741609 -741773 -740871 -739341 -738835 -737615 -737620 -735493 -733321 -732318 -733425 -733373 -730437 -729478
11490 -729478 -728309 -727864 -728709 -730993 -730561 -728892 -726991 -724839 -724490 -724844 -723158 -719818 -718622 -719234 -718266 -717914
11474 -717914 -718261 -719118 -718961 -717602 -716331 -714657 -713639 -713865 -713537 -713689 -713244 -714377 -715305 -713732 -711352 -707776
11458 -707776 -706971 -708529 -707553 -707598 -708817 -709619 -709200 -708770 -706348 -706052 -705634 -705885 -703194 -703250 -701613 -699652 -698435
11441 -698435 -698283 -698275 -698870 -698338 -697430 -695356 -693452 -691115 -689082 -690303 -690245 -688890 -689669 -690467 -687163 -687421 -685448
11424 -685448 -683165 -682523 -682016 -681079 -680084 -680566 -682267 -682483 -680962 -678413 -673237 -672985 -672988 -672156 -671554 -671049 -673870
11407 -673870 -676618 -676056 -673772 -674142 -673437 -670973 -668330 -665527 -662297 -661911 -660989 -659068 -659213 -659870 -659984 -659391
11391 -659391 -657975 -657078 -656179 -656981 -655947 -654087 -654392 -656543 -655777 -655420 -652941 -650978 -649497 -652078 -654219 -652056
11375 -652056 -649821 -648429 -645180 -641676 -641238 -641349 -641613 -642125 -643518 -644880 -645703 -641513 -637617 -636803 -639922 -638265
11359 -638265 -635823 -636421 -635540 -633107 -630401 -629253 -628978 -629370 -627530 -626191 -626078 -625381 -625464 -623855 -623860 -623405 -623788
11342 -623788 -623884 -622135 -619980 -615278 -615945 -616349 -617456 -617319 -616094 -615202 -615101 -613903 -610704 -610088 -611151 -611301
11326 -611301 -611584 -610503 -608671 -608755 -607038 -606263 -606698 -607296 -605962 -603165 -600025 -598224 -597305 -596901 -596561 -595708 -597094
11309 -597094 -596558 -595615 -596142 -595459 -592644 -592645 -593449 -593725 -593961 -593909 -592110 -587473 -584150 -582071 -582457 -583829 -584501 -584029
11291 -584029 -580916 -580875 -582723 -581776 -576391 -575318 -575798 -574961 -575887 -576528 -574780 -572564 -569490 -566774 -566288 -564505
11275 -564505 -562257 -562151 -565085 -568361 -571156 -568490 -564397 -562253 -563544 -562008 -560038 -558180 -558360 -558623 -558475
11260 -558475 -558691 -555552 -551214 -551666 -553140 -551249 -550971 -549671 -548991 -547569 -547004 -546269 -546354 -548070 -546554 -543079
11244 -543079 -543525 -541231 -541165 -542294 -539570 -537867 -536516 -535290 -535581 -534568 -533123 -532608 -533814 -533052 -531335 -529384
11228 -529384 -527338 -526592 -526897 -524096 -524800 -527640 -527968 -527217 -526182 -522988 -519863 -516297 -516485 -515982 -514107 -512859
11212 -512859 -513724 -514646 -518052 -517772 -514752 -510199 -509940 -510439 -507225 -506119 -504921 -504795 -506335 -507033 -505684 -502732
11196 -502732 -503766 -505264 -503106 -500105 -497925 -495178 -491983 -489121 -488304 -489413 -489072 -489712 -491217 -490142 -487235
11181 -487235 -481130 -477900 -476362 -476048 -474856 -473450 -472336 -474640 -474067 -473100 -474869 -473317 -471041 -467855 -468096
11166 -468096 -467180 -465797 -466672 -464913 -464594 -464749 -462237 -461957 -462407 -462873 -463681 -460882 -459365 -457145 -455770 -454325
11150 -454325 -453136 -452754 -451836 -452907 -451010 -450776 -451708 -450796 -450423 -449795 -448681 -448141 -445084 -446629 -448018 -447057
11134 -447057 -444301 -445510 -443648 -441193 -439635 -441476 -443416 -442957 -440859 -440823 -440720 -438651 -437078 -434570 -436504
11119 -436504 -438246 -438253 -440960 -442804 -443593 -444070 -441378 -440793 -441747 -442336 -441655 -442654 -445757 -446609 -446771 -445692 -443780
11102 -443780 -442107 -440346 -443115 -443782 -446352 -445988 -443566 -444660 -446738 -447102 -448113 -447503 -448389 -448300 -445942 -443105
11086 -443105 -444656 -446762 -447564 -450200 -452456 -451309 -448132 -445418 -446425 -446689 -447230 -447950 -448618 -449503 -451507 -450970
11070 -450970 -449834 -447656 -445947 -442943 -442382 -442696 -441680 -441925 -442562 -441253 -443600 -443071 -441512 -440320 -439279
11055 -439279 -440210 -438543 -437685 -435998 -435356 -435793 -434604 -433325 -433741 -433761 -432691 -432655 -432844 -429795 -424588 -423978 -422924
11038 -422924 -423330 -424723 -423637 -423367 -423739 -423942 -420891 -417215 -414495 -415350 -416434 -414362 -412345 -410054 -408127
11023 -408127 -405794 -405545 -409153 -408691 -405978 -403067 -401048 -397988 -398018 -399813 -402013 -402158 -401534 -401185 -401640 -397041
11007 -397041 -393885 -393808 -392876 -391675 -390591 -390449 -389443 -390560 -387143 -383174 -383607 -383634 -382028 -379620 -380585 -379458
10991 -379458 -378101 -375956 -372986 -371989 -370519 -367919 -367504 -367365 -366472 -365308 -364157 -363359 -362685 -362858 -361288 -359226
10975 -359226 -356704 -355143 -352528 -354056 -354424 -350992 -347005 -342639 -341014 -343921 -346925 -346380 -345760 -343276 -340967
10960 -340967 -340140 -338174 -335701 -334423 -334295 -331067 -327290 -328479 -327924 -327609 -330165 -328338 -324002 -323358 -322682 -322043
10944 -322043 -321153 -320566 -316915 -317078 -318593 -317231 -313089 -311667 -309523 -308321 -307893 -306414 -303988 -300100 -298072
10929 -298072 -295551 -294296 -295906 -296005 -295443 -293073 -290663 -290477 -289574 -289614 -289235 -285956 -283375 -283820 -284833 -284338 -283015
10912 -283015 -282485 -282046 -279683 -277627 -274401 -273921 -273356 -272583 -271548 -272198 -269376 -266427 -266436 -264823 -264796 -264463 -260712
10895 -260712 -258068 -257111 -256447 -255855 -253695 -253386 -250714 -250951 -250041 -249694 -248280 -244908 -243104 -244916 -243040 -241805
10879 -241805 -239819 -240385 -240102 -238471 -235825 -236881 -237990 -234131 -231758 -230554 -229783 -228351 -223900 -224166 -223080
10864 -223080 -222179 -222880 -222152 -220581 -219916 -220293 -219362 -216046 -215782 -214272 -212796 -211783 -210482 -211350 -210794 -207568
10848 -207568 -208478 -204913 -202340 -201909 -198919 -196818 -196531 -193560 -191613 -190985 -190422 -188308 -187326 -186650 -185362 -185993
10832 -185993 -185834 -182509 -179531 -178824 -174889 -171200 -168331 -169146 -171442 -172436 -171031 -168465 -162879 -161606 -164241
10817 -164241 -165124 -164084 -159238 -153962 -150310 -150421 -152282 -153382 -152446 -150309 -147872 -144639 -144357 -141658 -140856
10802 -140856 -142797 -141185 -136289 -131587 -130461 -131031 -130308 -129096 -125801 -122096 -120431 -117894 -117183 -116733 -114033
10787 -114033 -111904 -109221 -108014 -106614 -105651 -103053 -100996 -100200 -99628 -96926 -93391 -91566 -90734 -90602 -88624
10772 -88624 -84915 -83440 -82386 -78893 -74795 -73710 -74149 -72694 -70604 -70147 -67637 -63238 -59163 -57253 -54635
10757 -54635 -52896 -54474 -56245 -52601 -48044 -42924 -41032 -39462 -37262 -36049 -36561 -34387 -32382 -31130 -25266
10742 -25266 -21587 -20115 -19964 -20068 -16116 -11957 -9245 -10108 -9269 -8110 -4466 -393 1575 4096 6408
10727 6408 7897 11524 15382 18320 20449 23115 25252 26318 29802 33684 34407 37165 40826 42277 43938
10712 43938 45606 47255 50118 53027 53685 55071 57299 57540 57912 61225 65310 69883 73951 77381 77455 78426
10696 78426 81184 81230 81689 84929 88930 91082 94841 101048 104214 106086 109871 113556 113490 114988 119028 122659
10680 122659 126153 127275 130901 133279 134193 136476 143195 146263 148939 152744 156264 161089 162791 165048
10666 165048 167348 168898 170808 174560 178047 182820 188299 190763 193311 195581 197301 200749 203914 205761
10652 205761 210548 217399 220955 223463 226607 232111 235173 238069 239853 243004 248587 254545 259391 262483
10638 262483 263371 266473 271765 276554 276559 277134 281133 285850 288380 288865 291751 297495 300770 304204 308906 312392
10622 312392 316954 322423 326158 328146 331935 335833 340677 345514 349472 352999 355854 359748 365079 368635
10608 368635 371675 372352 378288 385824 387741 390410 394845 397408 398510 402298 410012 415243 419190 424766
10594 424766 428862 433478 438431 442130 443108 448059 454758 461123 464330 468532 475617 480165 484570 491285
10580 491285 495140 501124 506916 512830 520741 528156 534095 539328 544602 549256 556457 565159 567882 572700
10566 572700 577838 583674 591284 597601 604251 609242 614078 620261 625544 630306 636702 643918 647192 651432
10552 651432 659812 668889 675800 683858 690679 696515 706682 716850 726676 734781 742164 747699 759781
10539 759781 768481 781228 792701 801886 812656 821703 827690 839279 852311 865379 878477 889307
10527 889307 898806 907755 918068 927193 937892 948755 962333 974299 984109 993016 1002719 1014856 1025224
10514 1025224 1034402 1044753 1054390 1065251 1075684 1088903 1103483 1115870 1124752 1134251 1146798 1162411
10502 1162411 1180223 1198690 1213989 1225128 1239871 1255449 1272223 1289282 1307363 1324417 1338179
10491 1338179 1354548 1371071 1388404 1405213 1420516 1438828 1455238 1471741 1488370 1504125 1523394
10480 1523394 1543972 1562784 1580561 1601619 1620479 1644029 1669297 1691172 1710468 1730498 1754726
10469 1754726 1777408 1799365 1825266 1852611 1876330 1898790 1919939 1942193 1966754 1993556 2021438
10458 2021438 2049349 2075945 2103114 2131138 2162970 2194296 2229791 2268400 2304655 2337734 2371890
10447 2371890 2406303 2443110 2483912 2522908 2559705 2599382 2643136 2688418 2734954 2781193 2828230
10436 2828230 2875495 2923710 2977089 3032275 3089367 3149808 3210906 3272352 3336799 3403359 3474227
10425 3474227 3542563 3614484 3688283 3765016 3844094 3926023 4011255 4101041 4192143 4285295 4383504
10414 4383504 4484235 4589758 4698310 4806517 4921429 5037762 5155980 5278500 5404737
10405 5404737 5530508 5657017 5781452 5906487 6025310 6138831 6243980 6338867 6421891 6489953
10395 6489953 6538521 6567914 6576762 6561545 6521617 6457304 6374219 6271589 6155488 6033346 5905018
10384 5905018 5776287 5652236 5540906 5443734 5359878 5294922 5253354 5231945 5229384 5245877 5280479
10373 5280479 5331531 5397598 5475506 5559723 5648517 5740597 5829082 5907750 5963958 5990888 5977104
10362 5977104 5908589 5769737 5543510 5213171 4760909 4172139 3447152 2584842 1601842 532262
10352 532262 -587433 -1712584 -2794692 -3794295 -4678292 -5431031 -6047797 -6530273 -6891900
10343 -6891900 -7146480 -7313272 -7406330 -7440096 -7429853 -7391116 -7326292 -7243889 -7154090 -7064932 -6976045
10332 -6976045 -6890027 -6811758 -6744086 -6691067 -6652968 -6628088 -6623258 -6639121 -6674055 -6725599 -6795369
10321 -6795369 -6879832 -6973223 -7075594 -7184509 -7295549 -7397155 -7489762 -7567917 -7632067 -7679735
10311 -7679735 -7705005 -7706488 -7687880 -7649942 -7594512 -7526414 -7443770 -7350405 -7247285 -7139525 -7028740
10300 -7028740 -6914969 -6799561 -6683115 -6565100 -6447615 -6330061 -6213256 -6098569 -5988080
10291 -5988080 -5881887 -5779038 -5678281 -5577934 -5482688 -5392364 -5302858 -5214955 -5130435 -5050579
10281 -5050579 -4969985 -4893429 -4821335 -4750956 -4682601 -4614550 -4551314 -4486695 -4424065 -4364963 -4309385
10270 -4309385 -4253331 -4198261 -4147659 -4096579 -4048576 -4001384 -3954804 -3909332 -3866002 -3823377 -3778004
10259 -3778004 -3735060 -3694890 -3653467 -3616029 -3578518 -3542897 -3508132 -3472559 -3438197 -3404092 -3372118
10248 -3372118 -3340455 -3311010 -3280120 -3249065 -3217893 -3189198 -3165233 -3140224 -3112471 -3087980 -3061478
10237 -3061478 -3036581 -3012678 -2989640 -2968261 -2945467 -2923958 -2903209 -2881056 -2859124 -2838285 -2816561
10226 -2816561 -2797349 -2777407 -2759053 -2738893 -2720527 -2701978 -2685165 -2669336 -2654212 -2638840 -2620125
10215 -2620125 -2602320 -2585093 -2568232 -2552702 -2538518 -2523673 -2507614 -2489331 -2475210 -2463399 -2450866
10204 -2450866 -2437546 -2424817 -2414069 -2404188 -2395312 -2384833 -2375734 -2366976 -2354710 -2342501 -2334632 -2324450
10192 -2324450 -2312649 -2302418 -2293980 -2284379 -2273527 -2263541 -2253777 -2241146 -2230728 -2218579 -2205964 -2195538
10180 -2195538 -2185164 -2176137 -2165334 -2152148 -2141843 -2131658 -2122760 -2115928 -2110123 -2100424 -2089687 -2080545
10168 -2080545 -2074031 -2066439 -2057393 -2049279 -2044102 -2037784 -2030938 -2024594 -2015932 -2006641 -1999496 -1993167 -1983575 -1973671
10154 -1973671 -1965524 -1956624 -1951489 -1944953 -1937461 -1928218 -1919579 -1913158 -1909614 -1905162 -1896300 -1887921 -1880109 -1872504
10140 -1872504 -1866635 -1860062 -1852939 -1846677 -1844271 -1838649 -1832524 -1825969 -1819517 -1813033 -1804277 -1795456 -1787425 -1781941
10126 -1781941 -1775291 -1769871 -1764931 -1760222 -1756160 -1751444 -1742497 -1732273 -1726655 -1722029 -1718255 -1709014 -1700021 -1693928
10112 -1693928 -1687442 -1680593 -1675003 -1671993 -1667026 -1658729 -1651807 -1645128 -1638120 -1632622 -1628739 -1626562 -1622693 -1619534
10098 -1619534 -1620632 -1620410 -1617934 -1615203 -1612207 -1606877 -1603749 -1595114 -1587422 -1581952 -1576010 -1571409 -1566986 -1562779
10084 -1562779 -1557301 -1553498 -1549826 -1541677 -1535400 -1530439 -1527086 -1519984 -1514089 -1511940 -1507294 -1503537 -1497940 -1494362
10070 -1494362 -1490065 -1483065 -1477196 -1473702 -1470040 -1467621 -1465460 -1460761 -1457072 -1456581 -1456168 -1455648 -1453931 -1453637 -1453585
10055 -1453585 -1447514 -1441154 -1436063 -1429708 -1424252 -1420627 -1415734 -1409991 -1406246 -1398940 -1390868 -1386763 -1384387 -1381708
10041 -1381708 -1377134 -1371343 -1364502 -1357725 -1352435 -1347396 -1344047 -1341307 -1336818 -1332238 -1326578 -1318863 -1313323 -1312761
10027 -1312761 -1314033 -1317813 -1321773 -1321969 -1319855 -1314060 -1304673 -1297163 -1292820 -1288395 -1286948 -1283498 -1277187 -1270059
10013 -1270059 -1260466 -1249665 -1238504 -1228129 -1216715 -1206848 -1207341 -1219918 -1244410 -1279913 -1314946 -1341167
10001 -1341167 -1353342 -1355801 -1350603 -1343450 -1337040 -1328023 -1319659 -1316000 -1309923 -1304290 -1299506 -1295052 -1291514 -1293198
9987 -1293198 -1292911 -1287314 -1284422 -1278778 -1272478 -1264768 -1259477 -1253342 -1248964 -1241776 -1236931 -1234070 -1228160 -1222090
9973 -1222090 -1219129 -1216073 -1210711 -1205701 -1202835 -1201046 -1198208 -1195002 -1192958 -1188867 -1181871 -1178651 -1176579 -1172416
9959 -1172416 -1170130 -1166236 -1163851 -1162731 -1163049 -1163223 -1162885 -1162041 -1161208 -1161537 -1158753 -1156653 -1155573 -1156081 -1155936 -1151905
9943 -1151905 -1151425 -1150220 -1152540 -1157612 -1160208 -1162138 -1165811 -1167992 -1169964 -1171451 -1173748 -1180399 -1186580 -1192859
9929 -1192859 -1197999 -1202350 -1207693 -1213275 -1219802 -1227866 -1234255 -1241751 -1247424 -1253514 -1257500 -1261248 -1268507 -1273072
9915 -1273072 -1276912 -1281667 -1284468 -1288626 -1290760 -1294215 -1300395 -1303698 -1303088 -1304811 -1308396 -1309546 -1310810 -1311141 -1309084
9900 -1309084 -1308038 -1306831 -1306052 -1305945 -1305501 -1302248 -1301666 -1297491 -1293032 -1290788 -1287325 -1283479 -1279775 -1279154 -1275414
9885 -1275414 -1273951 -1271135 -1266460 -1264252 -1263494 -1263117 -1259748 -1256237 -1250501 -1246319 -1243864 -1239907 -1237605 -1239192 -1243033
9870 -1243033 -1248514 -1248600 -1246333 -1243595 -1239876 -1236746 -1229717 -1223681 -1219765 -1218078 -1213725 -1209837 -1206333 -1202602 -1198698
9855 -1198698 -1200252 -1200365 -1199159 -1199542 -1195882 -1190975 -1187576 -1185561 -1182354 -1177431 -1174437 -1172942 -1170135 -1168356 -1166566
9840 -1166566 -1163357 -1161598 -1159657 -1159422 -1158130 -1154998 -1155840 -1155142 -1154190 -1151125 -1145106 -1142402 -1141354 -1138781 -1136894
9825 -1136894 -1134058 -1132347 -1129440 -1128819 -1127351 -1123126 -1120906 -1121418 -1124143 -1122473 -1118335 -1117645 -1114887 -1112954 -1113426
9810 -1113426 -1109570 -1108415 -1107536 -1105224 -1102656 -1099829 -1098641 -1095849 -1094615 -1093128 -1092432 -1090562 -1088191 -1085604 -1084390
9795 -1084390 -1080183 -1076947 -1074800 -1076288 -1075266 -1074547 -1074221 -1073767 -1073204 -1071353 -1068992 -1070567 -1071675 -1073066 -1070178
9780 -1070178 -1067349 -1066940 -1064612 -1064788 -1061058 -1058593 -1057345 -1054044 -1052383 -1051496 -1051687 -1051593 -1050838 -1047789 -1045395 -1044697
9764 -1044697 -1043989 -1041440 -1040023 -1039129 -1037726 -1037665 -1035741 -1030849 -1029243 -1028184 -1026859 -1027668 -1027371 -1026068 -1024459 -1024825
9748 -1024825 -1025265 -1025234 -1023893 -1023389 -1023861 -1022205 -1019079 -1016638 -1014916 -1014452 -1012791 -1010143 -1008815 -1007659 -1006162 -1004103
9732 -1004103 -1002677 -1003379 -1003548 -1004188 -1003240 -1001349 -1000227 -999706 -996128 -993266 -993347 -994073 -994925 -995089 -993903 -991701 -987545
9715 -987545 -986690 -985460 -980868 -980052 -983169 -983639 -981481 -980132 -975938 -973795 -975170 -974956 -973924 -972026 -972831 -971219
9699 -971219 -971513 -972267 -970381 -967023 -966084 -963580 -962526 -961634 -959344 -957511 -957854 -958446 -957752 -959111 -957983 -954678
9683 -954678 -950498 -950976 -952255 -951970 -951440 -949893 -950509 -948589 -947475 -946236 -945375 -944224 -942551 -941905 -941521 -941772
9667 -941772 -940907 -937708 -936823 -935922 -935644 -935704 -933438 -931886 -931929 -930833 -930563 -930889 -931589 -930319 -927610 -925526 -923716
9650 -923716 -921844 -921761 -924220 -923245 -920398 -918236 -917374 -918657 -919136 -919995 -918250 -915028 -914966 -914539 -915791 -915482 -912364
9633 -912364 -908303 -906239 -907565 -907384 -905456 -903963 -902329 -901140 -902100 -902757 -902428 -902174 -900947 -899734 -896521 -895928
9617 -895928 -896918 -895429 -892813 -893072 -896743 -897669 -896066 -893758 -892670 -892273 -891292 -889128 -886867 -884236 -883377 -883512
9601 -883512 -882014 -879652 -879757 -877679 -874649 -874172 -873975 -876121 -877083 -876384 -877262 -877931 -877576 -874510 -875037 -877081 -877010
9584 -877010 -875315 -873991 -871901 -869810 -871163 -871574 -869233 -868629 -870024 -870334 -870418 -869788 -868695 -865181 -867193 -867422
9568 -867422 -865770 -863391 -860135 -858642 -858509 -859566 -859732 -858333 -855962 -857386 -857429 -855095 -851482 -850273 -849206
9553 -849206 -850940 -850906 -848319 -847582 -847697 -848484 -848674 -848070 -846351 -844544 -842950 -842584 -843259 -843765 -844252 -844241 -841357 -839010
9535 -839010 -838862 -839296 -838668 -838486 -838137 -838348 -837373 -836001 -833036 -832939 -835447 -839508 -837424 -833559 -832955 -832393 -831448
9518 -831448 -828305 -828247 -830148 -831772 -831786 -829645 -825822 -823532 -823429 -822990 -822159 -822078 -823829 -824442 -823703 -822214 -823180
9501 -823180 -821092 -818525 -819436 -817847 -817248 -815920 -815976 -816691 -817538 -819156 -820263 -817452 -816560 -811296 -809514 -810577
9485 -810577 -811238 -810768 -809451 -808234 -808089 -805109 -804073 -803254 -802246 -804317 -802985 -801524 -801536 -803397 -802556 -800101
9469 -800101 -798586 -798618 -796272 -797000 -799648 -800513 -799795 -799897 -797343 -796504 -794582 -792939 -793367 -794097 -794519 -794500 -793306
9452 -793306 -793895 -792651 -789279 -787951 -787073 -783991 -781851 -782811 -783638 -782679 -785739 -788472 -785779 -782223 -778607 -776401
9436 -776401 -774875 -776229 -776424 -775620 -776076 -776517 -774555 -772455 -773746 -777784 -778612 -779112 -778170 -777624 -773366 -771261
9420 -771261 -772489 -770718 -769530 -768061 -765600 -765820 -766842 -763937 -761533 -760864 -759580 -759148 -759352 -761976 -762450 -763087
9404 -763087 -760149 -760163 -759487 -757352 -756903 -755115 -753253 -751435 -749850 -748643 -747281 -750117 -752572 -753942 -753586 -752357
9388 -752357 -751664 -752388 -751222 -748941 -748292 -747672 -745384 -744310 -744417 -744738 -744914 -744590 -743480 -743998 -745022 -744340 -745361
9371 -745361 -744745 -743802 -741211 -740950 -738969 -735709 -733961 -733927 -733820 -734489 -734190 -733264 -731745 -730201 -731111 -731010 -730587
9354 -730587 -731061 -736043 -736721 -733492 -731038 -731213 -731100 -730090 -730448 -731913 -731010 -728847 -726999 -724979 -724736 -724674 -725687
9337 -725687 -725126 -722634 -721281 -719924 -717563 -716489 -716466 -718221 -718652 -718456 -719259 -717074 -715645 -716854 -715778 -714789
9321 -714789 -713693 -711946 -709693 -708245 -708398 -709204 -707616 -707085 -705720 -706208 -704441 -702507 -700410 -698352 -697382 -699452
9305 -699452 -699361 -698950 -699148 -696738 -695835 -696279 -695821 -697021 -696599 -693058 -690081 -689898 -689039 -686898 -686913 -687763 -687404 -686675
9287 -686675 -684416 -680487 -679702 -678940 -677773 -680235 -683086 -684122 -680485 -675018 -675003 -672623 -670896 -670895 -669686 -668770
9271 -668770 -668919 -667583 -667449 -665529 -665257 -664760 -662295 -657184 -655683 -656674 -655689 -651860 -649035 -646843 -646407 -647793
9255 -647793 -649384 -647646 -646309 -641712 -636868 -633304 -633231 -640370 -649099 -656844 -660530 -660886 -657880 -655371 -651746
9240 -651746 -649112 -645264 -638936 -634343 -629207 -627329 -624925 -624160 -621357 -621723 -622178 -623289 -623710 -625827 -628448
9225 -628448 -626089 -623396 -618513 -611905 -607447 -602124 -596276 -593529 -597655 -602757 -607677 -609848 -607174 -603164
9211 -603164 -598824 -595994 -588215 -580782 -578393 -573104 -567871 -560187 -553917 -547436 -536209 -524616 -513343 -502551
9197 -502551 -488655 -473726 -457640 -440297 -427432 -421060 -427310 -451890 -496367 -557456 -621756 -659319
9185 -659319 -667485 -655480 -630613 -614580 -597343 -577041 -563053 -537019 -505443 -487441 -481818 -498801
9173 -498801 -524849 -544179 -567214 -585331 -599336 -612878 -619834 -621623 -621891 -613166 -601888 -589034 -568782
9160 -568782 -545383 -518731 -480614 -435888 -392659 -356810 -351624 -408679 -538406 -713459 -881874
9149 -881874 -998052 -1047728 -1043910 -1013605 -971576 -929201 -894727 -866037 -844774 -829996 -814475 -797494
9137 -797494 -788041 -788158 -789866 -793937 -805791 -825122 -850460 -881153 -909604 -931461 -939392 -929393 -910707
9124 -910707 -890007 -867723 -844873 -820908 -796042 -767632 -744889 -734837 -747812 -792332 -853014 -915548
9112 -915548 -965471 -990316 -993174 -981266 -965655 -953397 -937449 -918908 -903007 -892962 -884213 -876148
9100 -876148 -870021 -864133 -857799 -854420 -848957 -841121 -835301 -831100 -826533 -823509 -821486 -817917 -811640 -808381
9086 -808381 -807069 -805185 -802759 -799320 -795623 -792834 -786901 -782521 -780531 -777246 -778404 -780181 -782341 -783184 -782530
9071 -782530 -783418 -784719 -783657 -780598 -776895 -773530 -771607 -773139 -772477 -764713 -761206 -761937 -763767 -765039 -766194
9056 -766194 -766193 -764636 -760894 -756082 -752987 -750781 -751360 -750921 -749290 -748983 -750523 -750914 -749200 -745853 -742744 -742269
9040 -742269 -745157 -745253 -744934 -743326 -739041 -737693 -740077 -740440 -739409 -737529 -736620 -735386 -732992 -729242 -727889 -728524
9024 -728524 -730887 -731312 -730541 -729056 -724220 -722221 -723077 -721808 -722802 -722235 -723166 -722643 -720015 -718334 -718482 -717702 -714332
9007 -714332 -714925 -716803 -714851 -714176 -713660 -711865 -710243 -709964 -710917 -710626 -711793 -710900 -710006 -707032 -706668 -709504 -710126
8990 -710126 -711467 -711010 -710228 -708070 -708150 -708612 -704648 -701405 -702127 -701161 -699720 -698528 -698904 -701208 -700641 -699441 -698418
8973 -698418 -698979 -697401 -696205 -695188 -692645 -693520 -695132 -694456 -696358 -694907 -691505 -690392 -690560 -692010 -693022
8958 -693022 -692334 -693567 -693883 -692020 -687005 -687054 -685059 -684886 -683320 -682087 -680561 -681585 -681179 -679557 -678581 -679692
8942 -679692 -680685 -680047 -681136 -681358 -679037 -677076 -676936 -675824 -674186 -672351 -671599 -671807 -671875 -671804 -671504 -671957 -673531
8925 -673531 -673305 -672339 -670546 -667030 -667460 -667342 -667764 -665428 -666867 -669300 -668691 -664980 -661343 -659960 -661325 -661504
8909 -661504 -660784 -658584 -655392 -654038 -654163 -653748 -653486 -651833 -650680 -653908 -654869 -651940 -653668 -654091 -654465 -653908
8893 -653908 -650326 -649302 -650467 -648681 -647976 -645689 -641371 -642099 -640481 -636172 -631848 -630226 -630318 -629386 -626000 -621921
8877 -621921 -616723 -612049 -607610 -600076 -592258 -591444 -605251 -637193 -674430 -700540 -713356 -712351 -704695
8864 -704695 -699451 -694550 -689302 -683910 -681345 -676681 -673451 -671906 -672836 -673927 -674898 -675287 -674910 -672851 -669133
8849 -669133 -670700 -668376 -665820 -665468 -665208 -664418 -664525 -663916 -662350 -662878 -662831 -663289 -662954 -660709 -658733 -658579 -660501
8832 -660501 -659848 -656761 -656042 -655555 -654644 -653264 -650707 -650525 -648154 -646875 -644193 -644522 -643770 -643456 -643748 -645096 -643948
8815 -643948 -641051 -638861 -640875 -642469 -642952 -643450 -644588 -644088 -640632 -636793 -637541 -637707 -637503 -635674 -634172 -634437
8799 -634437 -638602 -638856 -638963 -635970 -635508 -637513 -638343 -638618 -637322 -635468 -635771 -633847 -629548 -628316 -629652 -630799
8783 -630799 -631560 -631206 -631658 -630551 -631492 -629437 -627488 -627667 -625042 -625327 -625455 -623182 -619922 -618477 -618316 -618234 -615259
8766 -615259 -612902 -612593 -612115 -608293 -602938 -600086 -598536 -598777 -602213 -605431 -615041 -626941 -637108 -644615 -645481
8751 -645481 -644327 -640817 -638839 -636536 -633570 -632444 -631899 -631435 -630566 -629090 -628306 -629228 -632153 -630451 -625358 -623399
8735 -623399 -621297 -618860 -617086 -616204 -617067 -617633 -617451 -617660 -615687 -612595 -611745 -608226 -602576 -600787 -598144 -601698
8719 -601698 -607403 -613037 -619516 -622348 -624163 -627419 -630189 -624772 -619500 -617715 -618010 -618014 -618492 -619352 -616376 -616322
8703 -616322 -616215 -617727 -620107 -621589 -622717 -621983 -618105 -615257 -614539 -614208 -615253 -616834 -617690 -618530 -616168 -615951
8687 -615951 -617233 -613805 -613785 -615082 -615101 -613389 -611440 -608253 -608299 -608721 -609079 -609975 -607843 -604900 -604560 -603833 -603745 -600624
8669 -600624 -599656 -600222 -602164 -601825 -599586 -601034 -600978 -602049 -602373 -602579 -600446 -598194 -599114 -599315 -599785 -600440 -600945
8652 -600945 -599532 -597969 -597573 -598108 -596752 -598266 -598698 -597985 -598266 -597611 -592284 -592657 -594575 -593801 -591546 -590244
8636 -590244 -587912 -588210 -589705 -589944 -589870 -588643 -587852 -587271 -589233 -588324 -586105 -582788 -582164 -585649 -585842 -582244 -580459
8619 -580459 -580747 -579882 -578437 -577620 -575662 -574283 -574498 -574651 -573276 -572353 -571230 -569069 -569307 -569609 -570361 -573661 -575133
8602 -575133 -580361 -582155 -583465 -588612 -593315 -600974 -613322 -624744 -631094 -636389 -639156 -641169 -639339 -637250
8588 -637250 -634805 -632263 -630542 -630780 -630975 -631023 -628515 -625188 -625756 -622107 -621562 -620921 -621600 -619754 -616017 -610752
8572 -610752 -608277 -607465 -608860 -610247 -611051 -609910 -609795 -611341 -609457 -606961 -606614 -605646 -605794 -606231 -606032 -606268 -608299
8555 -608299 -607905 -605941 -604342 -602964 -603523 -602725 -602914 -602114 -599674 -598750 -598201 -598975 -598147 -596610 -597840 -595656 -593370
8538 -593370 -594472 -595939 -594785 -594769 -594757 -591723 -590574 -591735 -592053 -590160 -590701 -592225 -590659 -592286 -591222 -588447
8522 -588447 -587772 -588570 -590002 -590973 -589883 -589834 -589723 -585708 -582457 -581080 -581707 -581932 -582614 -584525 -586720 -587925 -587908
8505 -587908 -589593 -591092 -591662 -590666 -592281 -592337 -590291 -586558 -584789 -584822 -582986 -581313 -579029 -579738 -579471 -577067
8489 -577067 -575413 -576038 -576787 -575072 -576395 -581596 -580162 -577351 -576100 -573606 -573870 -577039 -575001 -572453 -573252
8474 -573252 -575092 -579204 -579083 -577607 -576342 -577243 -577815 -579074 -578964 -579233 -578502 -577921 -579423 -584115 -587921 -586816
8458 -586816 -582106 -582889 -584469 -584658 -585655 -583683 -580975 -578209 -578027 -576855 -576423 -579869 -581475 -580750 -580839 -581458 -583463
8441 -583463 -583736 -581792 -578733 -577574 -578711 -579360 -578968 -578405 -578669 -577216 -575968 -577862 -577451 -577407 -577852 -581100 -583258
8424 -583258 -580504 -578400 -581472 -582275 -581375 -580416 -579244 -579631 -582791 -581716 -579531 -578317 -575169 -573477 -572320
8409 -572320 -574655 -577395 -579674 -581899 -581247 -580429 -577915 -575649 -578061 -577486 -574571 -575825 -576391 -577640 -577909 -575904
8393 -575904 -574662 -574430 -575567 -575179 -572850 -571012 -571948 -571764 -569978 -569674 -571924 -573752 -571426 -570292 -571098 -572419
8377 -572419 -571972 -570387 -568640 -570875 -571997 -573482 -573646 -572969 -572310 -574219 -573648 -574564 -575550 -573595 -572199 -570958
8361 -570958 -570871 -569279 -568019 -568797 -569269 -568597 -566415 -565811 -565510 -567884 -568034 -566087 -566585 -567920 -567668 -565774 -562532
8344 -562532 -564175 -562060 -561556 -560011 -554881 -554423 -558153 -558704 -559078 -557704 -557238 -556301 -555168 -554097 -555405 -556096
8328 -556096 -555696 -556192 -557303 -557868 -556094 -556448 -555867 -553920 -553685 -553449 -552707 -553442 -554216 -553599 -555437 -555080 -554335 -554059
8310 -554059 -554570 -555964 -555527 -555033 -552798 -549660 -549060 -548113 -548744 -549927 -549656 -549064 -550566 -550591 -547081 -545410 -546041
8293 -546041 -547222 -548311 -545807 -544279 -542525 -542594 -541323 -544907 -549338 -551335 -553023 -550923 -550532 -550030 -548562
8278 -548562 -547502 -547778 -549926 -548843 -546112 -546104 -546732 -545831 -545219 -545260 -546141 -543895 -541084 -541391 -544804 -545962 -545273
8261 -545273 -544016 -544097 -543538 -543054 -545401 -546951 -544758 -543843 -542201 -540846 -541344 -541267 -540833 -542001 -539972 -535570 -534295
8244 -534295 -535641 -536191 -534347 -536055 -539958 -539662 -537707 -538818 -540358 -541882 -539661 -535709 -534706 -534080 -534451
8229 -534451 -534774 -533882 -536204 -537416 -536175 -534738 -533705 -535895 -536639 -535391 -535607 -536786 -534316 -533978 -533446 -531347
8213 -531347 -528743 -530792 -533811 -530904 -529389 -528704 -529241 -528333 -527356 -523956 -524668 -528922 -529883 -527235 -525057 -525342
8197 -525342 -526164 -527438 -531279 -530433 -530394 -531902 -531853 -531779 -530858 -529900 -530880 -533030 -531342 -530563 -531300 -532289 -535342 -535307
8179 -535307 -533136 -529753 -527102 -525500 -526685 -526066 -525750 -528455 -527626 -527250 -526996 -527645 -527100 -525836 -524417 -524256
8163 -524256 -525871 -525387 -523568 -525422 -525215 -524939 -525380 -526943 -523429 -521558 -521443 -518939 -519790 -521026 -525728 -526151
8147 -526151 -523056 -525307 -528987 -529627 -528809 -527771 -527404 -528883 -528825 -527987 -528980 -527551 -525053 -522345 -520840 -520916 -522048
8130 -522048 -520184 -520367 -519597 -522785 -523168 -520756 -520249 -520250 -520379 -520865 -521133 -522682 -523020 -521710 -521922 -521406 -520593 -521279
8112 -521279 -522555 -522750 -522077 -523178 -525597 -525584 -523886 -523566 -523409 -522058 -520623 -522329 -522967 -520779 -520746 -520154 -520105
8095 -520105 -520909 -521750 -520637 -518984 -519634 -522444 -522403 -523572 -524885 -523425 -523434 -522983 -521477 -520038 -521375 -521364 -522368
8078 -522368 -522191 -521079 -519969 -522742 -524413 -524803 -523281 -524837 -523061 -522609 -522723 -520589 -518467 -518873 -521039 -521443
8062 -521443 -519901 -519982 -522565 -521034 -518770 -519255 -518812 -519746 -521770 -521022 -521786 -521628 -522402 -521222 -520194 -520578 -520369
8045 -520369 -524066 -528986 -528325 -526524 -525728 -526862 -527465 -529345 -529173 -528083 -528336 -531633 -531717 -529857 -529694 -533593
8029 -533593 -537194 -539092 -539361 -539075 -538510 -537886 -535704 -536398 -536969 -537426 -537287 -533445 -534664 -538668 -540086 -539185 -538326
8012 -538326 -537741 -536607 -538457 -538596 -536748 -536477 -538466 -539293 -541375 -543251 -547268 -551729 -555264 -555714 -555394 -557077
7996 -557077 -558320 -560479 -561077 -558313 -556742 -556244 -558167 -562062 -564378 -564608 -565661 -566640 -568450 -566949 -564686
7981 -564686 -563949 -562588 -561768 -563177 -563855 -564579 -565361 -568135 -566669 -563299 -565369 -566074 -564901 -564450 -568019 -570882
7965 -570882 -571141 -570942 -572752 -573197 -572705 -574736 -576255 -578856 -580933 -581382 -582559 -583478 -583864 -581264 -579998 -581862
7949 -581862 -585307 -586207 -584704 -584892 -583933 -584874 -586584 -585069 -583175 -578932 -577409 -581253 -581752 -584686 -585987 -583024
7933 -583024 -583468 -582659 -582556 -583149 -583592 -585730 -587844 -586368 -586462 -586518 -588785 -589722 -588097 -586554 -585427 -585378 -586101 -588204
7915 -588204 -586089 -585415 -585059 -586213 -586786 -583997 -581898 -582512 -583586 -586129 -588918 -588328 -587517 -588503 -587953 -588273 -586551
7898 -586551 -585090 -582147 -578569 -580118 -582330 -582300 -579389 -578842 -580778 -582146 -579902 -579645 -579330 -579675 -579611 -580695
7882 -580695 -579930 -578923 -577506 -578991 -579926 -579755 -577679 -575597 -575453 -574644 -574662 -576208 -574660 -572545 -572619 -573429 -575774
7865 -575774 -577808 -578258 -575132 -570795 -566869 -566578 -569053 -570620 -569330 -569499 -573696 -575416 -575205 -574905 -574985 -575333
7849 -575333 -574099 -573127 -573347 -574749 -574698 -572764 -572247 -570436 -569095 -567983 -569281 -569523 -567235 -568190 -566503 -566076
7833 -566076 -563393 -559818 -559950 -561584 -562329 -563364 -564588 -564685 -561608 -562437 -562537 -563121 -564004 -565240 -565143 -564886 -562408
7816 -562408 -561893 -563151 -562626 -563672 -560507 -558559 -558813 -561876 -561991 -560781 -559665 -561289 -562386 -563854 -564249 -563072
7800 -563072 -558349 -557329 -558324 -558532 -560212 -561290 -558695 -558503 -560138 -558836 -559046 -558437 -557118 -556997 -554765 -556062
7784 -556062 -558384 -559048 -557674 -555024 -553489 -553199 -554193 -553702 -553610 -553908 -553185 -555164 -556135 -552874 -550701 -552050 -552301
7767 -552301 -553091 -554785 -556473 -556164 -554102 -551999 -552288 -553738 -553966 -555499 -555238 -555393 -554634 -552420 -551858 -552430 -552320
7750 -552320 -551903 -551406 -551238 -549953 -547641 -547125 -547883 -546199 -545050 -546926 -547241 -548381 -549719 -548186 -545580 -544347
7734 -544347 -546453 -547302 -546613 -545516 -544725 -542686 -542919 -545520 -545767 -546314 -545339 -545909 -544429 -543718 -541317 -540943 -542517
7717 -542517 -541922 -543297 -542187 -543442 -542735 -540799 -538561 -537617 -535580 -537137 -540919 -541290 -538926 -538635 -540316 -540035
7701 -540035 -540442 -540473 -540605 -539973 -538136 -535529 -537018 -536758 -537252 -536072 -537613 -538131 -536668 -537047 -537761 -538921 -536522
7684 -536522 -535616 -534438 -532709 -529870 -529918 -532075 -532103 -532819 -532228 -532465 -533668 -533278 -530472 -527119 -524865 -525959 -529143
7667 -529143 -531038 -529896 -529846 -528356 -526022 -528275 -529483 -528671 -530318 -527748 -527755 -527222 -526863 -528194 -528765 -527907 -526250
7650 -526250 -528072 -529859 -527444 -523805 -524433 -525355 -523219 -522132 -524035 -525257 -524138 -522884 -522911 -524802 -527101
7635 -527101 -525526 -523048 -521864 -521969 -522402 -520974 -523562 -525864 -524904 -523568 -522923 -522446 -520365 -519000 -520146 -522101
7619 -522101 -523356 -520811 -519714 -521736 -520538 -518852 -522298 -524599 -521069 -518939 -519890 -519900 -518858 -516534 -516287
7604 -516287 -518861 -518783 -516774 -515773 -516267 -514865 -514022 -515756 -516593 -517333 -518352 -517553 -517886 -518565 -519305 -520429 -519299
7587 -519299 -516986 -513823 -511208 -510353 -512526 -514436 -511547 -510576 -510624 -510598 -509837 -508606 -507833 -511146 -512164 -514915
7571 -514915 -512863 -509422 -509842 -508880 -507478 -509363 -512726 -513699 -515686 -516387 -514611 -511896 -512161 -514240 -514133 -513406
7555 -513406 -513409 -512268 -509803 -510275 -513062 -510989 -510537 -509567 -509709 -511180 -510098 -507436 -506245 -508692 -508547 -506296
7539 -506296 -506857 -505468 -504720 -505984 -505547 -504855 -504186 -502640 -502221 -503755 -503867 -504847 -505171 -506172 -508333 -507018 -504917
7522 -504917 -502577 -499620 -498594 -495785 -497219 -499256 -502205 -504649 -505607 -506202 -507088 -507466 -507965 -506114 -503562 -501219
7506 -501219 -500379 -500914 -501467 -502685 -502158 -503897 -505569 -504617 -504816 -502307 -500037 -498119 -499244 -500754 -502967 -502877
7490 -502877 -502093 -502512 -504212 -501094 -498852 -497377 -497325 -498349 -496051 -496983 -497869 -496806 -494579 -497214 -498843 -497250
7474 -497250 -494995 -493982 -497062 -498454 -499408 -499788 -498484 -498232 -496787 -494484 -494103 -495654 -494798 -495304 -496268 -497279
7458 -497279 -497142 -497228 -497001 -497134 -497871 -496225 -494726 -493960 -494507 -493914 -494590 -495432 -493689 -492350 -492167 -490093 -492342
7441 -492342 -494182 -496066 -495833 -494370 -491793 -490059 -486840 -483991 -484801 -486974 -487893 -487697 -488463 -491347 -492333 -490158
7425 -490158 -488776 -486836 -487127 -490001 -489723 -486498 -485241 -487338 -487667 -488011 -490217 -490133 -486617 -485203 -483691 -484220
7409 -484220 -486062 -486853 -489185 -492873 -491752 -489182 -485226 -481636 -481865 -484311 -484762 -482966 -482305 -483194 -483171 -481100
7393 -481100 -482438 -484627 -486240 -488295 -489258 -488315 -485218 -483593 -484294 -484710 -483614 -484258 -485635 -484674 -484036 -484097 -484718
7376 -484718 -485622 -486080 -485160 -485509 -483209 -482989 -483527 -483517 -483541 -481007 -480763 -483414 -484162 -482717 -481211 -480457 -481084 -483694
7358 -483694 -486011 -487275 -487491 -485046 -484533 -485259 -482231 -479082 -479671 -479973 -477705 -476707 -477463 -477153 -476974 -475437 -475346
7341 -475346 -477931 -477983 -475978 -476648 -476187 -475885 -477259 -477384 -475458 -475235 -476089 -477003 -479292 -476691 -476284 -474809 -473059
7324 -473059 -472715 -471497 -473475 -475010 -475269 -477089 -477804 -475013 -473439 -475542 -477200 -478956 -478687 -476328 -477496
7309 -477496 -475877 -474833 -473711 -472490 -468952 -468953 -471992 -472603 -471445 -470614 -470185 -470879 -474148 -474712 -474391 -472527 -472526
7292 -472526 -474669 -474790 -476998 -476358 -474136 -473904 -471140 -470776 -472096 -473554 -472899 -473570 -472101 -469914 -470296 -469835
7276 -469835 -470690 -468526 -467050 -468214 -468437 -468552 -469121 -468354 -466379 -465909 -467273 -469032 -469113 -468547 -468145 -465661 -464708
7259 -464708 -465873 -465847 -462824 -462403 -463448 -464136 -466727 -467067 -467587 -468802 -469215 -470115 -469350 -466709 -467055 -467666 -465627
7242 -465627 -464540 -466154 -467322 -465697 -467260 -467318 -466170 -464042 -465112 -465415 -462111 -460217 -460395 -463512 -465483
7227 -465483 -465044 -463323 -463145 -462709 -461871 -462969 -465939 -465165 -465939 -467637 -467677 -466859 -465177 -464816 -465237 -464791 -464415 -462988
7209 -462988 -461502 -461451 -460941 -459658 -459201 -460258 -458782 -459615 -459525 -459751 -461059 -461302 -459693 -460374 -462755 -460598 -460511
7192 -460511 -461585 -460466 -460236 -460015 -461614 -463164 -463707 -461060 -459258 -461176 -464140 -463404 -459798 -456787 -455068
7177 -455068 -457047 -459764 -461610 -461618 -461334 -461256 -459735 -458059 -457846 -457642 -454904 -455153 -453438 -455306 -455743 -455198 -457327
7160 -457327 -460593 -461102 -461473 -462736 -459983 -456399 -459062 -460850 -459843 -457998 -456122 -457431 -458232 -459741 -457095
7145 -457095 -454666 -452964 -451162 -451002 -454349 -454379 -456168 -455375 -455447 -456647 -454913 -453197 -454357 -455435 -456622 -456882
7129 -456882 -455727 -452095 -449446 -452507 -453822 -455090 -454510 -455212 -453838 -452190 -451912 -450822 -452047 -453427 -453790
7114 -453790 -452409 -450728 -451479 -453348 -453071 -453189 -453848 -453783 -451973 -451740 -454553 -454250 -451547 -448193 -448668 -451242 -451857
7097 -451857 -452759 -453291 -454535 -452698 -449948 -450386 -451944 -453186 -451074 -449558 -450872 -450019 -450191 -450531 -451916 -453073
7081 -453073 -453071 -453249 -452286 -452295 -453489 -454497 -455360 -455541 -454762 -453204 -451036 -451604 -453273 -452478 -452313 -450464 -448699 -448661
7063 -448661 -449493 -449904 -451019 -449306 -448290 -448441 -449432 -449912 -446633 -444995 -444021 -445446 -446873 -443838 -439952 -440789
7047 -440789 -442358 -442131 -442372 -443475 -443326 -444772 -444899 -443076 -444171 -448201 -448935 -447721 -447795 -446991 -447790 -443328 -442842
7030 -442842 -443830 -446834 -447443 -446559 -446209 -446575 -447154 -445439 -445337 -446229 -446311 -442305 -439749 -439370 -440949 -442611 -446009
7013 -446009 -445388 -445062 -444776 -444334 -445584 -444337 -443813 -443163 -444052 -444594 -445584 -442044 -439476 -439056 -437653 -439984 -442407
6996 -442407 -441961 -441382 -442779 -445395 -446287 -443722 -441307 -442547 -443441 -444160 -445081 -442272 -441183 -440813 -440808 -440309 -437622
6979 -437622 -437764 -438106 -435731 -436539 -440700 -440610 -440624 -442622 -441642 -439136 -438614 -437464 -437093 -438242 -438847 -438799 -438961 -441619
6961 -441619 -441331 -438059 -438476 -439611 -437767 -436925 -439920 -442125 -440884 -440025 -440440 -440943 -440773 -439351 -440032 -441358
6945 -441358 -440759 -440590 -438878 -437743 -439348 -438104 -434560 -435151 -435553 -435521 -436524 -436432 -433436 -433621 -435690 -435453 -431588
6928 -431588 -430538 -431453 -434602 -435875 -434477 -435611 -434392 -433911 -436214 -435390 -433512 -432886 -433366 -433459 -436465 -436750
6912 -436750 -435723 -433719 -431956 -430208 -431500 -435572 -437209 -437769 -438924 -436095 -432523 -432893 -431764 -434037 -435678
6897 -435678 -437334 -438038 -438864 -435628 -433328 -432457 -429993 -431038 -432416 -431588 -430233 -429677 -430934 -431185 -429840 -430685
6881 -430685 -432525 -432958 -433332 -432877 -431062 -432807 -432446 -430042 -431444 -433100 -433948 -432943 -433201 -431080 -428076 -428108
6865 -428108 -429442 -430384 -431426 -432507 -431699 -432821 -431904 -428221 -427561 -425704 -424359 -426488 -428250 -428987 -429008 -429126
6849 -429126 -429378 -430189 -428249 -427586 -427016 -427440 -425648 -424857 -422569 -421973 -424404 -424711 -421989 -423642 -428182 -427088
6833 -427088 -427000 -427892 -428766 -430956 -431619 -432282 -429327 -426879 -426803 -426435 -426522 -426410 -427238 -428381 -429175 -427664 -428970 -430474
6815 -430474 -428780 -426463 -423665 -425258 -426701 -427666 -425926 -426071 -425486 -424933 -423923 -424042 -422737 -423683 -425129 -425397
6799 -425397 -425192 -423658 -423954 -424325 -421816 -418928 -419345 -421239 -420809 -422242 -424648 -425141 -424336 -421739 -419148 -420848
6783 -420848 -422010 -422993 -422992 -422205 -422400 -422399 -423760 -426129 -426068 -425144 -425305 -427268 -427344 -426473 -422809 -422977 -424150 -424834 -424230
6764 -424230 -423817 -424199 -425231 -428422 -427115 -424906 -424720 -423211 -419427 -418453 -419868 -419791 -420911 -422037 -422715 -421689
6748 -421689 -422174 -421918 -418345 -416719 -418070 -419457 -421200 -421940 -419681 -417219 -417934 -419880 -419865 -418431 -417428 -417959
6732 -417959 -418864 -420875 -421972 -422523 -425057 -426029 -422930 -418094 -417961 -417620 -416207 -417684 -418814 -419462 -419570 -420892
6716 -420892 -421758 -422090 -422333 -420128 -419700 -420560 -420194 -419160 -418669 -419049 -419179 -419429 -419028 -418758 -418437 -417455 -418409 -420698
6698 -420698 -420253 -418369 -418995 -417452 -416157 -415297 -416837 -416423 -416930 -416246 -414319 -413346 -415861 -418987 -417299 -416478
6682 -416478 -417920 -415794 -415559 -414069 -410566 -409440 -410792 -412661 -416308 -417867 -417532 -416009 -414891 -415312 -415808
6667 -415808 -413667 -412570 -411158 -413727 -413771 -412839 -415323 -417590 -417310 -416701 -417476 -418043 -416570 -414076 -414317 -414388 -414833
6650 -414833 -417029 -419176 -420803 -417664 -415089 -414871 -418158 -419258 -418553 -416584 -419282 -419389 -417114 -416258 -418331
6635 -418331 -417895 -416027 -414850 -412854 -410959 -408884 -407391 -406634 -407154 -406073 -406749 -408282 -407664 -407200 -408421 -409547
6619 -409547 -411037 -408758 -406478 -406230 -404421 -407167 -408768 -405477 -406387 -408941 -409276 -409474 -409091 -409180 -410181 -409462
6603 -409462 -407089 -406114 -406345 -406192 -408226 -410099 -410482 -410580 -411175 -412430 -414249 -412288 -410164 -410346 -410787 -411706 -409517
6586 -409517 -408631 -407415 -406879 -408369 -410038 -411442 -411500 -410050 -410746 -408900 -406476 -406893 -407854 -409025 -408948 -408503 -409031
6569 -409031 -408310 -406815 -408234 -408513 -406393 -404308 -404477 -404370 -406303 -409066 -410643 -412018 -412303 -410262 -407772 -405534
6553 -405534 -404109 -404632 -404977 -407693 -408280 -407146 -404737 -403467 -405616 -407626 -407519 -407431 -409259 -409630 -407961 -406969
6537 -406969 -408346 -410133 -408861 -408104 -409316 -410098 -407449 -405203 -404982 -405379 -405745 -404899 -404564 -403700 -402233 -402078 -403266
6520 -403266 -401854 -400418 -402968 -403905 -404476 -404353 -403709 -404076 -405136 -406745 -405309 -405446 -405253 -405665 -404019 -403051 -402274
6503 -402274 -401811 -400744 -401568 -403430 -403715 -402060 -402439 -404203 -405980 -404912 -403434 -403874 -404976 -406165 -405219 -402677
6487 -402677 -403867 -404610 -402287 -398451 -397838 -401610 -400939 -401435 -400255 -398892 -398595 -398354 -396790 -397238 -400302 -402469
6471 -402469 -401355 -400224 -398598 -398704 -398196 -398240 -401713 -402234 -400655 -400635 -400395 -402870 -403568 -404191 -403376 -401462 -399246
6454 -399246 -398338 -397683 -398656 -399969 -399358 -400130 -400729 -401643 -400477 -397636 -397704 -399739 -399884 -398572 -399926 -400654 -399988
6437 -399988 -399533 -398104 -396070 -396600 -398095 -395455 -394546 -396645 -396619 -396480 -396988 -399646 -398747 -399597 -399221 -400846 -401461
6420 -401461 -401025 -395720 -394438 -396517 -395979 -397128 -399369 -398867 -396869 -396829 -397168 -395433 -392801 -395676 -396818 -394820
6404 -394820 -395041 -395925 -396985 -396078 -393994 -394553 -397412 -397662 -395810 -395292 -397249 -397689 -397621 -395595 -393642 -394155 -395070
6387 -395070 -394878 -398071 -398392 -397699 -396485 -395877 -397545 -398566 -398502 -397140 -395578 -394262 -393657 -395370 -395082 -393475
6371 -393475 -394280 -394282 -393939 -392428 -392627 -393095 -393982 -393950 -395340 -393286 -393701 -393382 -392026 -393030 -392843 -393572 -394501 -391974
6353 -391974 -391283 -393900 -395661 -393644 -390475 -391067 -393294 -394451 -394018 -392414 -390857 -391840 -391031 -389131 -389919 -389685
6337 -389685 -390483 -390752 -392060 -390843 -390593 -388886 -389553 -389857 -389086 -387845 -388569 -387858 -388350 -389355 -391148 -392487 -393541
6320 -393541 -393319 -390831 -389664 -388711 -387797 -385454 -386923 -388468 -389726 -393325 -393911 -392844 -391922 -392319 -392210 -389427
6304 -389427 -388438 -386882 -385424 -385254 -385735 -387415 -386805 -386892 -388431 -389716 -389183 -389394 -389829 -388041 -389299 -390434 -389894
6287 -389894 -391587 -388664 -388098 -386720 -385779 -384681 -384498 -383469 -385604 -387074 -385149 -384724 -385820 -386968 -385197
6272 -385197 -383326 -384566 -384555 -385096 -385610 -384198 -384035 -386147 -386383 -386201 -384563 -386960 -391607 -392129 -389759 -384011
6256 -384011 -384018 -387205 -389097 -387697 -386243 -389114 -390670 -391834 -392506 -390611 -388010 -385544 -385914 -386543 -387949 -388694
6240 -388694 -387043 -386593 -385160 -385604 -385277 -385315 -382379 -380508 -381145 -381188 -380638 -380189 -378202 -377246 -381479 -386429 -384747
6223 -384747 -383637 -384055 -380664 -381991 -383352 -382992 -382093 -384439 -388328 -389777 -389960 -390852 -389414 -388223 -387169 -385623
6207 -385623 -384744 -383356 -380117 -378415 -380607 -382815 -385475 -385458 -384888 -383062 -382342 -381578 -381681 -381953 -381010 -382272 -382050
6190 -382050 -381190 -379483 -381336 -383319 -384545 -383364 -384443 -383293 -379418 -379097 -380114 -382135 -381837 -380506 -381417
6175 -381417 -383050 -384249 -383890 -381977 -378981 -378434 -381127 -381344 -380996 -381271 -377751 -375241 -376391 -377509 -377668 -378251
6159 -378251 -378804 -379399 -380940 -377453 -376141 -378482 -381631 -383080 -382195 -380671 -381955 -380612 -378950 -378292 -379643
6144 -379643 -381720 -382728 -380912 -376848 -378059 -380319 -378902 -380587 -379033 -378341 -377714 -378426 -378147 -378119 -379604 -378222
6128 -378222 -376955 -377245 -378818 -380104 -379614 -379904 -378323 -377353 -377466 -377325 -377319 -377398 -376945 -375705 -376939 -376793 -378018 -378513
6110 -378513 -374625 -372777 -372447 -373986 -375668 -375316 -377110 -378597 -378234 -378716 -378798 -377537 -377657 -377811 -377840 -377525 -375470
6093 -375470 -375231 -376983 -376441 -376189 -379756 -381849 -377576 -376988 -376534 -378502 -379284 -377004 -376183 -375812 -376036 -375182 -374923
6076 -374923 -375151 -375311 -375363 -375619 -375528 -373713 -373722 -375279 -375207 -374273 -373279 -373768 -375974 -376979 -377086 -376638 -373646 -373592 -373157
6057 -373157 -373779 -375600 -378555 -379050 -377580 -376018 -375693 -375976 -375461 -375338 -374400 -376185 -374137 -371179 -372155 -375510
6041 -375510 -377819 -378971 -376563 -374688 -372918 -373329 -373534 -374498 -375651 -373483 -371121 -370439 -371466 -372693 -373115 -372027
6025 -372027 -373849 -373122 -370037 -368391 -366442 -366252 -369693 -371911 -373135 -374777 -376841 -374594 -372708 -373123 -375340
6010 -375340 -376571 -373796 -372347 -371585 -369116 -368023 -369849 -372040 -372970 -372845 -371230 -371140 -372329 -373483 -373121 -374767
5994 -374767 -374987 -376956 -375845 -375203 -372581 -371494 -370978 -369886 -370252 -371176 -369830 -370968 -370632 -369146 -368775 -368765 -367331
5977 -367331 -370072 -371001 -369008 -368947 -369768 -368211 -367079 -369935 -371072 -372328 -372485 -373168 -368879 -366951 -367486 -366333
5961 -366333 -365056 -362373 -362403 -363674 -365065 -365795 -367072 -369849 -370975 -370521 -371217 -370483 -369765 -371240 -370073 -370136 -369717
5944 -369717 -370196 -369634 -368639 -369563 -369253 -368474 -366794 -366710 -367734 -368768 -367144 -365926 -364521 -367660 -367322 -366194 -370565
5927 -370565 -372689 -373901 -372940 -369539 -364995 -365558 -367721 -367285 -367820 -367781 -368001 -368769 -367611 -367100 -367628 -368781 -370295
5910 -370295 -371648 -370700 -370265 -369625 -366663 -365570 -366751 -366833 -366277 -365351 -364126 -363153 -362955 -364536 -366783 -366818 -367218
5893 -367218 -367621 -365740 -368278 -371708 -368652 -365361 -364426 -362852 -364501 -367830 -369450 -369833 -369512 -368841 -368379 -367388
5877 -367388 -363484 -361790 -361169 -361327 -360747 -361156 -362386 -362671 -363394 -365166 -367255 -367599 -366975 -365184 -363620 -363759 -363687
5860 -363687 -362702 -364054 -363176 -360997 -361059 -363014 -361389 -358217 -360183 -361914 -361481 -360698 -361619 -363135 -363171 -363151 -362162
5843 -362162 -362013 -360012 -357693 -356595 -357414 -358250 -359792 -361517 -363263 -362689 -362497 -365225 -364907 -364365 -363120 -360828
5827 -360828 -361267 -360400 -360121 -362000 -362865 -363046 -360049 -358701 -360397 -360512 -361799 -364607 -364223 -360840 -360262 -360162 -361326
5810 -361326 -361577 -362524 -363015 -362126 -362658 -362647 -362416 -362747 -361577 -359036 -359648 -360590 -360380 -360156 -360236 -359757 -357833 -358042 -360465
5791 -360465 -362006 -362763 -362246 -360558 -360044 -360508 -360592 -361420 -362903 -362328 -361746 -359765 -357385 -359779 -360585 -360322 -360733
5774 -360733 -360579 -359775 -359511 -359398 -361099 -362101 -359842 -360957 -361205 -360036 -358375 -358789 -358304 -358990 -358989 -356579 -355220
5757 -355220 -354295 -356229 -359547 -360817 -361642 -361920 -360645 -358934 -358787 -359420 -358270 -358597 -358410 -356882 -357398 -355947
5741 -355947 -355696 -355493 -354355 -352966 -353642 -356356 -354401 -354645 -355242 -354926 -354148 -354938 -355627 -352574 -352735 -357946 -359578
5724 -359578 -358577 -356055 -355371 -355424 -352265 -351518 -349464 -349569 -349922 -351069 -351446 -352628 -352649 -352802 -355921 -354445 -354834
5707 -354834 -356687 -356283 -354507 -355651 -357150 -354850 -355261 -353005 -353233 -355599 -357942 -356742 -356069 -353850 -353284 -354145
5691 -354145 -356409 -358527 -357231 -357301 -356283 -356039 -355645 -355858 -357117 -356852 -356066 -354920 -353696 -353954 -354012 -354362 -352398
5674 -352398 -351836 -352767 -351519 -352318 -352461 -353799 -352744 -353130 -352117 -351050 -352744 -352184 -351031 -353819 -353494 -351271
5658 -351271 -349994 -352762 -355222 -354792 -353080 -354587 -355911 -352307 -351717 -354801 -355625 -354450 -353047 -353042 -355071 -357007
5642 -357007 -355979 -355350 -355224 -354243 -351630 -350571 -351649 -352367 -354221 -350570 -349299 -347647 -349538 -351513 -353057
5627 -353057 -352357 -350538 -349896 -350658 -351838 -352146 -353535 -352763 -349864 -348238 -348755 -348519 -350086 -350465 -349030 -350138
5611 -350138 -351370 -350702 -349603 -350392 -352977 -354168 -354998 -355226 -355513 -354009 -350871 -351420 -352598 -349803 -349952 -352393
5595 -352393 -353971 -352699 -350765 -349359 -348750 -349436 -349707 -349167 -351093 -349618 -346675 -345151 -346165 -347245 -348697
5580 -348697 -350358 -350240 -348735 -347132 -346269 -344730 -344542 -347338 -347070 -347781 -349452 -350965 -351837 -351664 -350577 -350628 -352736
5563 -352736 -351832 -349789 -347983 -347800 -348395 -349600 -348836 -347059 -346959 -346634 -347155 -351610 -351538 -349605 -348099 -345493 -344770
5546 -344770 -347195 -347355 -344759 -346055 -345816 -344128 -344139 -343295 -344320 -344279 -346214 -347745 -346418 -346024 -346169 -344212 -340967
5529 -340967 -340115 -340583 -343705 -344706 -344329 -344173 -344308 -344565 -345397 -344970 -344054 -342405 -341089 -341403 -342513 -342315 -344552
5512 -344552 -346873 -347333 -344761 -342057 -342829 -341477 -341696 -342650 -342151 -341422 -340868 -341687 -345394 -343930 -342603 -342445 -344334
5495 -344334 -345621 -344562 -343737 -342525 -343106 -342449 -343182 -343324 -345989 -345447 -344971 -348198 -349794 -346468 -345312 -343757
5479 -343757 -344459 -342382 -341175 -341780 -343178 -345491 -347615 -346122 -345917 -342953 -342423 -342446 -342984 -340562 -340394 -343546
5463 -343546 -344300 -343095 -340070 -339264 -340963 -339825 -340632 -341136 -343937 -345644 -343635 -341615 -341049 -341650 -340079 -339840
5447 -339840 -340798 -341311 -341780 -342845 -342746 -343158 -342152 -339973 -341804 -343786 -344446 -343644 -343403 -343419 -347042 -346985 -344572 -344513
5429 -344513 -340682 -339740 -338312 -340037 -343799 -344230 -348269 -347981 -346782 -343337 -340950 -343390 -343854 -344474 -343357 -342100
5413 -342100 -340110 -339014 -338081 -337892 -338980 -340672 -342673 -343349 -342999 -341292 -343303 -344089 -342140 -341663 -340204 -338778
5397 -338778 -337945 -335585 -332499 -334268 -338954 -339113 -337100 -335059 -335986 -339773 -340533 -339503 -336797 -336014 -337412 -338054
5381 -338054 -339314 -339320 -337889 -339973 -338886 -339994 -341762 -340847 -340281 -339392 -339109 -340635 -342110 -344613 -342834 -339916
5365 -339916 -337917 -338366 -336061 -333341 -335233 -336879 -337443 -337973 -338925 -337005 -336837 -337369 -336333 -336548 -337985 -338295
5349 -338295 -338619 -338016 -337187 -336525 -332306 -332914 -333534 -333588 -335752 -336338 -335275 -335483 -336352 -337733 -337226 -337501 -339443 -339245
5331 -339245 -336819 -336038 -337162 -338677 -339243 -337329 -334983 -333138 -333432 -335836 -337491 -335277 -334239 -337042 -337713
5316 -337713 -335021 -334599 -335726 -335886 -336674 -336767 -335270 -335787 -336628 -335862 -334811 -334713 -334736 -332746 -332072 -334433 -335438 -336641
5298 -336641 -337238 -338469 -340321 -336546 -334772 -335905 -337122 -336918 -338045 -339601 -340618 -342024 -339757 -336427 -334671
5283 -334671 -336461 -338424 -337443 -334332 -332808 -332137 -331674 -332520 -333646 -336952 -339286 -338037 -335745 -334976 -334282 -333914
5267 -333914 -333942 -331800 -330992 -334105 -335176 -335374 -335680 -336696 -334706 -334657 -336257 -337023 -334779 -333223 -331444 -331291 -330110
5250 -330110 -329213 -331155 -331787 -332716 -332980 -334508 -336888 -337207 -337704 -337119 -335096 -332396 -328631 -329533 -332845 -333610 -334574
5233 -334574 -334122 -334100 -333417 -334581 -333062 -330537 -331777 -332462 -333146 -335703 -337177 -335582 -335997 -334644 -332111 -330531
5217 -330531 -330198 -331031 -332137 -331193 -329218 -327525 -330050 -331939 -332063 -332744 -333395 -333621 -334923 -336547 -335335 -333760
5201 -333760 -331597 -331796 -331036 -329020 -327528 -327472 -329090 -329893 -328178 -328510 -330032 -331890 -329886 -331489 -331467 -331321 -332770
5184 -332770 -333564 -332084 -329128 -325536 -326664 -327346 -326746 -329207 -329958 -328688 -328116 -330584 -332874 -331959 -331481 -331624
5168 -331624 -331096 -330891 -331447 -329476 -328555 -327121 -330184 -330882 -330054 -333304 -332683 -329951 -327831 -327744 -330047 -332107 -329560
5151 -329560 -329399 -330054 -330127 -330168 -333209 -333388 -332579 -330528 -332000 -334207 -330976 -331117 -331066 -329066 -328719 -329110 -329504 -329447
5133 -329447 -329277 -329062 -329209 -330651 -331837 -332196 -331647 -331218 -329658 -331623 -330089 -329365 -329066 -331445 -329574 -329578 -330704
5116 -330704 -328555 -327788 -328904 -327719 -327364 -325431 -323132 -320741 -322731 -325769 -325870 -325523 -326053 -329870 -330480 -328194
5100 -328194 -328736 -329637 -329398 -329744 -328072 -329114 -329102 -330299 -332360 -329840 -329036 -327821 -328162 -328326 -329478 -327722 -324600
5083 -324600 -323750 -321130 -323948 -326841 -325111 -323578 -324071 -326695 -326151 -324656 -322853 -320484 -321357 -324260 -324258 -322517
5067 -322517 -324663 -323777 -320188 -319353 -322253 -322973 -323779 -323560 -322884 -322793 -325664 -325411 -323014 -322049 -324138 -327764 -329454
5050 -329454 -327900 -324096 -323355 -325022 -324233 -322411 -322026 -322217 -323467 -325651 -325981 -323559 -324815 -326709 -328057 -327697
5034 -327697 -327837 -325851 -325821 -326966 -328344 -329124 -328311 -327013 -326252 -327234 -327342 -326723 -326868 -326571 -324062 -321600 -321112
5017 -321112 -320966 -321470 -323938 -323024 -321964 -322380 -322407 -323247 -321474 -321653 -320234 -318696 -321178 -324983 -323493 -321152
5001 -321152 -318376 -315655 -317274 -319220 -319119 -320519 -321670 -320958 -320592 -320202 -320495 -319007 -320848 -322801 -321698 -318945
4985 -318945 -317815 -321086 -321992 -323631 -326077 -326183 -323879 -320294 -320207 -320958 -321804 -322219 -323073 -323681 -321815 -322207 -326341
4968 -326341 -328731 -327979 -327781 -324614 -324715 -324003 -324454 -326023 -325252 -324664 -323536 -323429 -322174 -320556 -318895 -318665 -320223
4951 -320223 -320833 -320871 -319374 -317592 -318210 -317555 -317193 -317463 -320085 -321247 -322635 -322357 -319599 -316516 -318197 -319375
4935 -319375 -319601 -320306 -320557 -321766 -321910 -319416 -319321 -321636 -321277 -321709 -322246 -320882 -319356 -320466 -318433 -318207 -318933
4918 -318933 -320157 -320864 -319509 -320185 -321525 -320074 -318137 -318041 -319459 -322037 -322254 -320414 -320177 -319729 -318947 -319582 -318828
4901 -318828 -317427 -318259 -321039 -321905 -322095 -322565 -318739 -317563 -317088 -316615 -319173 -320169 -320568 -320028 -319374 -318293 -316938
4884 -316938 -318148 -320151 -319260 -317934 -318197 -318671 -318670 -319650 -319711 -319123 -317831 -317809 -319093 -318766 -320507 -323169 -322446 -322504
4866 -322504 -321278 -320006 -318457 -317953 -317505 -316788 -316619 -318353 -318616 -316956 -317095 -318444 -317678 -317880 -317854 -317612 -316164
4849 -316164 -316155 -316318 -318301 -317868 -317134 -316227 -317013 -317239 -319190 -320625 -320483 -317949 -315859 -317370 -318832 -317401 -316471
4832 -316471 -316274 -314956 -316977 -317296 -316760 -317012 -316601 -317593 -316849 -315856 -318134 -317600 -316722 -316249 -317198 -314240 -314079 -315089
4814 -315089 -313838 -312631 -314906 -315838 -312995 -313211 -315295 -313258 -310763 -312694 -313159 -313579 -315627 -316583 -315845 -313504
4798 -313504 -313422 -315994 -316271 -316121 -315438 -315787 -315241 -315599 -314240 -314305 -314259 -314590 -317018 -318069 -316676 -316201 -319108 -319717
4780 -319717 -318812 -317062 -313306 -313590 -316062 -317380 -319532 -318403 -317020 -316487 -315563 -312510 -312342 -311549 -311736 -311572
4764 -311572 -311075 -310648 -312213 -316139 -317467 -316143 -313068 -311949 -311792 -311970 -312329 -314584 -315352 -316373 -315613 -311748
4748 -311748 -310369 -310789 -310109 -311506 -311654 -312443 -314454 -315962 -316634 -315585 -315800 -316103 -314833 -313825 -313340 -312633 -313588
4731 -313588 -312375 -310208 -309463 -311454 -312695 -313675 -312352 -312780 -312050 -311885 -311351 -314590 -317315 -315264 -312464 -311499
4715 -311499 -312339 -309807 -308680 -311339 -313395 -313262 -312813 -312862 -313727 -311941 -312300 -313905 -314607 -313399 -313454 -312995 -309842
4698 -309842 -307428 -306571 -308086 -311850 -313091 -311839 -313034 -315542 -316015 -315563 -313739 -311554 -310108 -310051 -309790 -311949
4682 -311949 -311703 -312524 -314281 -313737 -311036 -309957 -307242 -309445 -312602 -312327 -310511 -311306 -310307 -307701 -307151 -307894
4666 -307894 -308170 -308833 -308206 -310580 -311748 -310436 -311003 -310025 -311698 -310882 -309085 -309179 -309237 -311856 -311341 -311509 -310295
4649 -310295 -310576 -311053 -308839 -308479 -310111 -310356 -311499 -311787 -310398 -308813 -307961 -304374 -303363 -306892 -308513 -310477
4633 -310477 -310509 -310832 -309377 -310595 -311652 -310427 -309645 -309019 -308278 -307672 -309816 -308313 -308913 -308655 -306273 -304788 -304944
4616 -304944 -304573 -305811 -307794 -306917 -308276 -309098 -305859 -304969 -305928 -307610 -307973 -307353 -306923 -305905 -304929 -306420 -308139
4599 -308139 -306535 -303854 -304542 -305630 -303508 -303308 -305367 -309178 -311207 -308265 -306796 -306618 -308738 -306928 -304614
4584 -304614 -305547 -305354 -305354 -306515 -308163 -308694 -308066 -306574 -307747 -307137 -306489 -305871 -306330 -305298 -309040 -311000 -310100
4567 -310100 -308998 -306844 -306807 -304705 -304895 -305663 -305777 -307436 -306927 -307565 -307229 -306878 -305825 -306355 -306991 -307340 -306570 -306537
4549 -306537 -307327 -306174 -305242 -305018 -305823 -304860 -306374 -308488 -307166 -308770 -305769 -304898 -306260 -305428 -304543 -306123
4533 -306123 -306403 -304311 -300992 -303325 -303062 -305563 -307666 -307502 -309084 -308256 -304506 -302822 -301443 -301367 -303806 -303267
4517 -303267 -303827 -305345 -305637 -305750 -306267 -305161 -305250 -307652 -307204 -307327 -307073 -303958 -305111 -305044 -301356 -302427 -303825
4500 -303825 -302643 -301842 -303661 -303562 -304179 -303215 -303600 -306071 -305506 -305598 -305945 -304489 -301972 -302822 -301513 -302790 -305449
4483 -305449 -304403 -306142 -303552 -302921 -303786 -304013 -302530 -302910 -303508 -303031 -305568 -307015 -307316 -305636 -303595 -305275
4467 -305275 -306081 -306949 -308728 -306058 -304066 -305914 -306479 -305174 -305549 -306913 -306078 -302828 -301084 -301746 -300306 -298332
4451 -298332 -299687 -302838 -303885 -302071 -300293 -299632 -299423 -301037 -303560 -303442 -302049 -301246 -302155 -301221 -301277 -300951 -300439
4434 -300439 -301120 -303934 -306797 -304922 -302866 -303754 -301770 -299898 -299237 -298279 -300286 -302930 -305256 -304709 -304666 -304063
4418 -304063 -302280 -301391 -300743 -302553 -304049 -303851 -304198 -304911 -303644 -303892 -303831 -304757 -304616 -303945 -301781 -301427 -301820 -299392
4400 -299392 -298691 -297085 -297235 -300116 -300878 -302151 -301980 -300423 -301728 -300886 -297776 -298645 -302707 -302897 -300474 -297246
4384 -297246 -299014 -300937 -300792 -300701 -300972 -301990 -299466 -298299 -300141 -300065 -299993 -299716 -298429 -299184 -299548 -301028 -299899
4367 -299899 -300425 -299504 -298567 -298872 -300486 -299650 -299076 -297617 -296469 -296385 -296097 -295722 -297084 -295832 -294093 -294848 -296409
4350 -296409 -294757 -296054 -299558 -298429 -295240 -297413 -298960 -298698 -299057 -299214 -301195 -299654 -298070 -297621 -296499
4335 -296499 -299495 -301034 -299678 -299786 -298877 -297484 -297959 -298047 -296821 -297512 -298506 -296563 -293868 -292751 -291177 -293255
4319 -293255 -293435 -293853 -295703 -295493 -295418 -296098 -298274 -299673 -298950 -298407 -298293 -297098 -295680 -296253 -294903 -295129 -295627
4302 -295627 -298139 -296678 -295669 -296490 -295308 -295056 -296978 -297712 -297279 -296790 -296813 -295091 -294744 -294022 -294042 -293795 -296340
$$ [...]
##END NTUPLES=NMR SPECTRUM
##END=
