##TITLE=Analysis number 315899
Compound Code cc 01646
Book Reference 440/116
Project Code adrs
Chemist Name craigr
##JCAMPDX= 6.0         $$ Bruker NMR JCAMP-DX V2.0
##DATA TYPE= NMR SPECTRUM
##DATA CLASS= NTUPLES
##ORIGIN= Bruker BioSpin GmbH
##OWNER= NMR
$$ XWIN-NMR		Version 3.5
$$ Wed Dec  7 12:22:25 2005 GMT Standard Time (UT+0h)  MAYBRIDGE\NMR@NMR_250MHZ
##.OBSERVE FREQUENCY= 250.131544655141
##.OBSERVE NUCLEUS= ^1H
##.ACQUISITION MODE= SIMULTANEOUS (DQD)
##.ACQUISITION SCHEME= undefined
##.AVERAGES= 16
##.DIGITISER RES= 18
##SPECTROMETER/DATA SYSTEM= dpx250
##.PULSE SEQUENCE= zg30
##.SOLVENT NAME= CDCl3
##.SHIFT REFERENCE= (INTERNAL, CDCl3, 0, 16.522)
##AUDIT TRAIL= $$ (NUMBER, WHEN, WHO, WHERE, WHAT)
$$ ##TITLE= Audit trail, XWIN-NMR		Version 3.5
$$ ##JCAMPDX= 5.01
$$ ##ORIGIN= Bruker BioSpin GmbH
$$ ##OWNER= NMR
$$ C:\u/data/dgb/nmr/ADRS/13540/pdata/1/auditp.txt
$$ ##AUDIT TRAIL=  $$ (NUMBER, WHEN, WHO, WHERE, WHAT)
(   1,<2005-12-07 12:22:03.27 +000>,<MAYBRIDGE\NMR>,<NMR_250MHZ>,
      <created by zg, POWCHK disabled, PULCHK disabled
       configuration hash MD5:
       62 19 C7 07 E1 42 D1 B7 37 6C 3D D0 77 39 F9 E6
       data hash MD5: 64K
       75 CB A5 BD 6C 5D 46 07 FB 29 40 29 83 82 B5 7A>)
(   2,<2005-12-07 12:22:15.85 +000>,<MAYBRIDGE\NMR>,<NMR_250MHZ>,
      <Start of raw data processing
       ef LB = 0.3 FT_mod = 6 PKNL = 1 SI = 32K 
       data hash MD5: 32K
       59 61 13 B4 58 6D 2D 36 12 C7 E3 D9 61 4D AB BF>)
(   3,<2005-12-07 12:22:17.58 +000>,<MAYBRIDGE\NMR>,<NMR_250MHZ>,
      <apk 
       data hash MD5: 32K
       18 08 AC 72 D5 5D 73 53 FA 74 28 7B F5 94 E4 B3>)
(   4,<2005-12-07 12:22:18.28 +000>,<MAYBRIDGE\NMR>,<NMR_250MHZ>,
      <abs ABSG = 5 
       data hash MD5: 32K
       22 DD EF 57 67 E0 29 1F FD D5 3A 5E 70 5C 10 94>)
$$ ##END=
$$ 
$$ hash MD5
$$ AC 5E 4D 6F 71 25 4D 61 7B 78 EA 8E E1 DD 72 DE
##$RELAX= 
##$RELAX= 
##$RELAX= 
##$RELAX= 
##$RELAX= 
##$RELAX= 
##$RELAX= 
$$ Bruker specific parameters
$$ --------------------------
##$DU= <C:\u>
##$EXPNO= 13540
##$NAME= <ADRS>
##$PROCNO= 1
##$TYPE= <nmr>
##$USER= <dgb>
##$AMP= (0..31)
100 100 100 100 100 100 100 100 100 100 100 100 100 100 100 100 100 100 
100 100 100 100 100 100 100 100 100 100 100 100 100 100 
##$AQSEQ= 0
##$AQ_mod= 3
##$AUNM= <au_zg>
##$AUTOPOS= <21 >
##$BF1= 250.13
##$BF2= 250.13
##$BF3= 250.13
##$BF4= 250.13
##$BF5= 500.13
##$BF6= 500.13
##$BF7= 500.13
##$BF8= 500.13
##$BYTORDA= 1
##$CFDGTYP= 0
##$CFRGTYP= 5
##$CHEMSTR= <none>
##$CNST= (0..31)
1 1 145 1 1 1 1 1 1 1 1 1 1 1 1 1 1 1 1 1 1 1 1 1 1 1 1 1 1 1 1 1 
##$CPDPRG= <>
##$CPDPRG1= <>
##$CPDPRG2= <>
##$CPDPRG3= <>
##$CPDPRG4= <mlev>
##$CPDPRG5= <mlev>
##$CPDPRG6= <mlev>
##$CPDPRG7= <mlev>
##$CPDPRG8= <mlev>
##$CPDPRGB= <>
##$CPDPRGT= <>
##$D= (0..31)
0 1 0 0 0 0 0 0 0 0.06 0 0 0 0 0 0 0.0002 0 0 0 0 0 0 0 0 0 0 0 0 0 0 
0 
##$DATE= 1133958121
##$DBL= (0..7)
120 120 120 120 120 120 120 120 
##$DBP= (0..7)
150 150 150 150 150 150 150 150 
##$DBP07= 0
##$DBPNAM0= <>
##$DBPNAM1= <>
$$ [...]
##$SUBNAM7= <"">
##$SUBNAM8= <"">
##$SUBNAM9= <"">
##$SW= 20.6930455092707
##$SWIBOX= (0..15)
0 0 3 0 0 0 0 0 0 0 0 0 0 0 0 0 
##$SW_h= 5175.983436853
##$TD= 65536
##$TD0= 1
##$TE= 294.16
##$TE2= 300
##$TE3= 300
##$TEG= 300
##$TL= (0..7)
0 120 120 120 120 120 120 120 
##$TP= (0..7)
150 150 150 150 150 150 150 150 
##$TP07= 0
##$TPNAME0= <>
##$TPNAME1= <>
##$TPNAME2= <>
##$TPNAME3= <>
##$TPNAME4= <>
##$TPNAME5= <>
##$TPNAME6= <>
##$TPNAME7= <>
##$TPOAL= (0..7)
0.5 0.5 0.5 0.5 0.5 0.5 0.5 0.5 
##$TPOFFS= (0..7)
0 0 0 0 0 0 0 0 
##$TUNHIN= 0
##$TUNHOUT= 0
##$TUNXOUT= 0
##$USERA1= <user>
##$USERA2= <user>
##$USERA3= <user>
##$USERA4= <user>
##$USERA5= <user>
##$V9= 5
##$VALIST= <valist>
##$VCLIST= <CCCCCCCCCCCCCCC>
##$VD= 0
##$VDLIST= <DDDDDDDDDDDDDDD>
##$VPLIST= <PPPPPPPPPPPPPPP>
##$VTLIST= <TTTTTTTTTTTTTTT>
##$WBST= 1024
##$WBSW= 4
##$XGAIN= (0..3)
0 0 0 0 
##$XL= 0
##$YL= 0
##$YMAX_a= 412580
##$YMIN_a= -464005
##$ZGOPTNS= <>
##$ZL1= 120
##$ZL2= 120
##$ZL3= 120
##$ZL4= 120
##$ABSF1= 16.522
##$ABSF2= -4.171173
##$ABSG= 5
##$ABSL= 3
##$ALPHA= 0
##$AQORDER= 0
##$ASSFAC= 0
##$ASSFACI= 0
##$ASSFACX= 0
##$ASSWID= 0
##$AUNMP= <proc_1d>
##$AZFE= 0.1
##$AZFW= 0.1
##$BCFW= 0
##$BC_mod= 0
##$BYTORDP= 0
##$COROFFS= 0
##$CY= 12.5
##$DATMOD= 1
##$DC= 0
##$DFILT= <>
##$DTYPP= 0
##$F1P= 14.0000005364418
##$F2P= -0.99999901652339
##$FCOR= 0.5
##$FTSIZE= 32768
##$FT_mod= 6
##$GAMMA= 0
##$GB= 0
##$INTBC= 1
##$INTSCL= 1
##$ISEN= 128
##$LB= 0.3
##$LEV0= 0
##$LPBIN= 0
##$MAXI= 10000
##$MC2= 0
##$MEAN= 0
##$ME_mod= 0
##$MI= 0
##$NCOEF= 0
##$NC_proc= -3
##$NLEV= 6
##$NOISF1= 0
##$NOISF2= 0
##$NSP= 0
##$NTH_PI= 0
##$NZP= 0
##$OFFSET= 16.522
##$PC= 1
##$PHC0= -69.45908
##$PHC1= 7.847008
##$PH_mod= 1
##$PKNL= yes
##$PPARMOD= 0
##$PSCAL= 4
##$PSIGN= 0
##$REVERSE= no
##$SF= 250.13
##$SI= 32768
##$SIGF1= 0
##$SIGF2= 0
##$SINO= 400
##$SIOLD= 32768
##$SREGLST= <1H.CDCl3>
##$SSB= 0
##$STSI= 32768
##$STSR= 0
##$SW_p= 5175.98343685301
##$SYMM= 0
##$S_DEV= 0
##$TDeff= 65536
##$TDoff= 0
##$TI= <Analysis number 999999
Compound Code 99
Book Reference 9
Project Code 9>
##$TILT= no
##$TM1= 0
##$TM2= 0
##$TOPLEV= 0
##$USERP1= <user>
##$USERP2= <user>
##$USERP3= <user>
##$USERP4= <user>
##$USERP5= <user>
##$WDW= 1
##$XDIM= 32768
##$YMAX_p= 413273566
##$YMIN_p= -106743
$$ End of Bruker specific parameters
$$ ---------------------------------
##NTUPLES= NMR SPECTRUM
##VAR_NAME=  FREQUENCY,     SPECTRUM/REAL,   SPECTRUM/IMAG
##SYMBOL=    X,             R,               I
##VAR_TYPE=  INDEPENDENT,   DEPENDENT,       DEPENDENT
##VAR_FORM=  AFFN,          ASDF,            ASDF
##VAR_DIM=   32768,         32768,           32768
##UNITS=     HZ,            ARBITRARY UNITS, ARBITRARY UNITS
##FACTOR=    0.157963299565203, 1,           1
##FIRST=     4132.6476996994, 0,             0
##LAST=      -1043.33573715361, 0,           0
##MIN=       -1043.33573715361, -106743,     0
##MAX=       4132.6476996994, 413273566,     0
$$ Real data points
##PAGE= N=1
##DATA TABLE= (X++(R..R)), XYDATA
$$ [...]
$$ plain form
16804 90304 104449 123218 143350 161587 188979 216064 232832 234657 226142 225029 233210 230543 238730
16791 238730 254130 267101 296327 348271 393334 446229 501042 546062 566468 550593 505945
16780 505945 443363 374271 310444 248994 200750 167385 142208 117248 106750 96084 84220
16769 84220 75885 71957 63365 61272 57165 53575 57265 53983 58648 55495 53765 58359 62409 69451
16755 69451 75465 89282 103246 114937 131047 155400 173545 185629 181743 171090 179048 194340
16743 194340 202279 207327 215487 228708 252740 293322 341966 383449 423787 454326 457924 440774
16731 440774 399940 344798 291278 240069 190254 154105 122604 97758 90215 84100 82197 81740
16719 81740 76072 63310 53880 52816 47537 43996 41053 42415 39747 35344 37147 39927 35382 35791
$$ packed form
16804I0304J4145J8769K0132J8237K7392K7085J6768J825q515j113Q181k667Q187
16791B38730J5400J2971K9226N1944M5063N2895N4813M5020K0406j5875m4648
16780E05945o2582o9092o3827o1450m8244l3365k5177k4960j0498j0666j1864
16769H4220q335l928q592k093m107l590L690l282M665l153j730M594M050P042
16755F9451O014J3817J3964J1691J6110K4353J8145J2084l886j0653P958J5292
16743A94340P939N048Q160J3221K4032M0582M8644M1483M0338L0539L598j7150
16731D40774m0834n5142n3520n1209m9815l6149l1501k4846p543o115j903m57
16719H1740n668j2762r430j064n279l541k943J362k668m403J803K780m545M09
$$ plain form
16705 35791 37054 37847 36131 30092 28728 25646 27504 25190 22249 27045 33751 35624 31631 29366 26210
16690 26210 24242 21766 24698 18368 20043 19761 13200 8422 9024 7441 6578 7442 7758 12512 12407 10622
16674 10622 5694 14028 17725 14726 13502 6247 4662 3020 1402 3588 965 7173 6907 6457 4655
16659 4655 13977 17858 12590 5484 669 2842 5426 -3855 -10535 -8190 6059 16344 21794 10794
16645 10794 3325 -628 2263 7865 8639 9903 7486 4810 14048 14063 6690 4988 3574 9176 15920
16630 15920 11901 10927 6744 3030 8734 14821 11961 7044 6719 6165 8234 12132 11160 6731 1564
16615 1564 893 3597 7656 18538 25421 19790 18167 17770 12339 5313 -1235 -1590 -7458 -4902 3655
16600 3655 3986 6047 10000 6645 4928 -365 -14 9174 13604 12497 15941 19944 15712 14609 11945
$$ packed form
16705C5791J263P93j716o039j364l082J858k314k941M796O706J873l993k265l156
16690B6210j968k476K932o330J675k82o561m778O02j583q63Q64L16M754j05j785
16674A0622m928Q334L697k999j224p255j585j642j618K186k623O208k66m50j802
16659D655R322L881n268p106m815K173K584r281o680K345J4249J0285N450j1000
16645A0794p469l953K891N602P74J264k417k676R238J5p373j702j414N602O744
16630A5920m019r74m183l714N704O087k860m917l25n54K069L898r72m429n167
16615A564o71K704M059J0882O883n631j623l97n431p026o548l55n868K556Q557
16600C655L31K061L953l355j717n293L51R188M430j107L444M003m232j103k664
$$ plain form
16585 11945 5206 6906 10649 13184 8795 -1070 -3217 -6850 797 6003 10254 14970 17373 15864
16571 15864 12055 7826 4618 3919 8206 8792 17382 21782 17031 22618 22974 20653 19053 18452 20109
16556 20109 20270 12199 10236 12945 9091 10721 12145 12989 14611 16990 17395 19117 12711 12208 14633
16541 14633 18546 19268 18368 19305 24290 29448 39467 39684 33886 42124 54453 50433 52221 68111 82280
16526 82280 95486 105610 118617 149776 192584 244535 322734 439407 618168 902833 1301280
16515 1301280 1642754 1713672 1567066 1345676 1116248 887382 671497 507639 397819 325418
16505 325418 270058 223889 192445 169831 144035 118005 101894 89617 78470 78706 70764 66659
16493 66659 63551 61978 57042 55072 51244 47487 45696 44017 43375 39658 35697 34033 33659 29731 24988
$$ packed form
16585A1945o739J700L743K535m389r865k147l633P647N206M251M716K403j509
16571A5864l809m229l208o99M287N86Q590M400m751N587L56k321j600o01J657
16556B0109J61q071j963K709l854J630J424Q44J622K379M05J722o406n03K425
16541A4633L913P22r00R37M985N158J0019K17n798Q238J2329m020J788J5890J4169
16526H2280J3206J0124J3007L1159M2808N1951P8199J16673J78761K84665L98447
16515A301280L41474P0918j46606k21390k29428k28866k15885j63858j09820p2401
16505C25418n5360m6169l1444k2614k5796k6030j6111j2277j1147K36p942m105
16493F6659l108j573m936j970l828l757j791j679o42l717l961j664l74l928m743
$$ plain form
16478 24988 22241 22481 22058 25797 26368 26158 24118 20968 20878 21911 19978 20505 16053 13222 15930 16643
16462 16643 12577 13153 15420 16915 9437 11478 11924 7510 8014 3734 4692 4468 8236 9029 9453 10094
16446 10094 12187 7041 6787 10463 14541 21206 28557 28167 22927 16689 8246 7601 12134 9883 10987
16431 10987 11142 14590 15526 13339 13357 8763 5974 4523 10699 10796 5910 -887 -8689 -3064 -692 -2538
16415 -2538 4099 7867 7581 6506 13066 15401 14014 17973 20322 21804 21392 19026 14505 18532 24548
16400 24548 15907 17516 21928 19656 13976 10759 16942 19813 20693 26659 22305 17642 10294 8927 15262
16385 15262 17804 17449 24060 25567 28244 26136 20265 19798 22230 19695 15331 20068 22850 24444 15481
16370 15481 7646 6063 8736 10594 14424 10189 9728 10616 11593 9554 6328 9335 15552 12770 13522
$$ packed form
16478B4988k747K40m23L739N71k10k040l150r0J033j933N27m452k831K708P13
16462A6643m066N76K267J495p478K041M46m414N04m280R58k24L768P93M24O41
16446A0094K093n146k54L676M078O665P351l90n240o238q443o45M533k251J104
16431A0987J55L448R36k187J8m594k789j451O176R7m886o797p802N625K372j846
16415b538O637L768k86j075O560K335j387L959K349J482m12k366m521M027O016
16400B4548q641J609M412k272n680l217O183K871Q80N966m354m663p348j367O335
16385A5262K542l55O611J507K677k108n871m67K432k535m364M737K782J594q963
16370A5481p835j583K673J858L830m235m61Q88R77k039l226L007O217k782P52
$$ plain form
16355 13522 18921 21648 15790 17821 23691 25350 27099 31117 16778 14863 14937 11989 16388 8958 7399
16340 7399 9304 13426 13096 19700 16476 9325 11464 9783 1948 4756 13946 21830 19484 20360 15833
16325 15833 16884 24917 24438 21251 23572 26921 27262 24150 26029 21352 21365 20737 19626 9635 10417 14855
16309 14855 10679 7935 10398 6169 11640 13753 5609 8694 7930 14678 21740 30313 30186 25509 25831
16294 25831 26345 24996 21442 23491 30099 22731 17322 12096 16435 26882 28410 30673 33753 31941
16280 31941 29801 29826 30365 29237 32171 29200 25363 24308 19266 18069 16527 20321 14504 16244 21115
16265 21115 17259 10119 7948 10069 11174 13657 12826 9564 8665 10825 11784 15072 21255 17769 11584
16250 11584 2525 8693 11868 5351 8354 8478 3186 -417 -2429 -2709 2411 7431 3286 4345 10224
$$ packed form
16355A3522N399K727n858K031N870J659J749M018j4339j915P4k948M399p430j559
16340G399J905M122l30O604l224p151K139j681p835K808R190P884k346Q76m527
16325A5833J051Q033m79l187K321L349L41l112J879m677J3o28j111r991P82M438
16309A4855m176k744K463m229N471K113q144L085p64O748P062Q573j27m677L22
16294B5831N14j349l554K049O608p368n409n226M339J0447J528K263L080j812
16280C1941k140K5N39j128K934k971l837j055n042j197j542L794n817J740M871
16265B1115l856p140k171K121J105K483q31l262q99K160R59L288O183l486o185
16250A1584r059O168L175o517L003J24n292l603k012k80N120N020m145J059N879
$$ plain form
16235 10224 13857 17262 30657 34851 34300 36468 44800 60123 83857 120350 150387 180095 194912
16222 194912 203009 236079 252481 240805 199487 143637 88203 51311 27201 16438 11891 7623
16210 7623 3350 5735 4052 5446 -1523 2932 6827 12581 12101 10065 6645 4461 5256 6762 7651
16195 7651 10921 16231 17459 18344 22079 21145 29332 33670 37236 42402 45888 47354 44670 37376 39798
16180 39798 51281 57812 54198 51975 39849 27726 22229 16792 5031 -1708 -2464 -13224 -23952
16167 -23952 -28461 -32039 -19521 -2399 17290 33764 37527 46910 59836 68613 68731 67038 85303
16154 85303 101317 107592 115143 114565 120388 124753 123345 120868 110468 101719 88205 71662 53644
16141 53644 39268 23114 322 -22725 -35278 -42945 -50703 -55814 -64983 -72473 -69290 -71741 -66367
$$ packed form
16235A0224L633L405J3395M194n51K168Q332J5323K3734L6493L0037K9708J4817
16222A94912Q097L3070J6402j1676m1318n5850n5434l6892k4110j0763m547m268
16210G623m273K385j683J394o969M455L895N754m80k036l420k184P95J506Q89
16195G651L270N310J228Q85L735r34Q187M338L566N166L486J466k684p294K422
16180C9798J1483O531l614k223j2126j2123n497n437j1761o739p56j0760j0728
16167b3952m509l578J2518J7122J9689J6474L763R383J2926Q777J18j693J8265
16154H5303J6014O275P551n78N823M365j408k477j0400q749j3514j6543j8018
16141E3644j4376j6154k2792k3047j2553p667p758n111r169p490L183k451N374
$$ plain form
16128 -66367 -27278 22417 60302 80630 79581 81342 87990 98509 110448 122577 128169 137122 142002
16115 142002 137739 137563 132668 124331 114553 103844 93688 101949 113357 119341 126405 150038 177693
16102 177693 205964 232680 248719 263867 255450 225162 206259 201320 189874 157994 134008 126252
16090 126252 109536 88855 79214 70400 70352 85060 96759 113765 124027 133745 142470 149989 164590
16077 164590 174386 178534 187551 205453 218889 225435 228600 237932 235453 232136 228990 213173 200240
16064 200240 185857 184377 197897 222109 267803 336208 383229 382014 358922 339758 317445 288331
16052 288331 264821 253812 250544 254250 255760 267403 291715 315807 331195 335966 337976 339214 349052
16039 349052 383515 413020 434405 449957 453310 457451 459938 460912 461840 458629 472801 512425 557901
$$ packed form
16128f6367L9089M9695L7885K0328j049J761O648J0519J1939J2129N592Q953M880
16115A42002m263j76m895q337r778j0709j0156Q261J1408N984P064K3633K7655
16102A77693K8271K6716J6039J5148q417l0288j8903m939j1446l1880k3986p756
16090A26252j6716k0681r641q814m8J4708J1699J7006J0262R718Q725P519J4601
16077A64590R796M148R017J7902J3436O546L165R332k479l317l146j5817j2933
16064B00240j4383j480J3520K4212M5694O8405M7021j215k3092j9164k2313k9114
16052B88331k3510j1009l268L706J510J1643K4312K4092J5388M771K010J238R838
16039C49052L4463K9505K1385J5552L353M141K487R74R28l211J4172L9624M5476
$$ plain form
16026 557901 599895 644565 681889 717576 751917 774401 791577 802248 825587 865960 904587
16015 904587 945142 975421 995010 1020232 1070997 1148333 1243198 1333134 1400352 1470462 1542845
16004 1542845 1636798 1747569 1863030 1978437 2123383 2316700 2527139 2753544 3029145 3371612
15994 3371612 3754418 4156929 4601382 5099044 5678071 6345609 7084643 7964976 9100578
15985 9100578 10636942 12748260 15533723 18806061 22729586 27929537 34872665 43901301
15977 43901301 56625984 76388801 108634855 162199801 240891097 308513379 318364750
15970 318364750 289336184 248476324 207219401 164252104 122745585 91689843 71213250
15963 71213250 57098865 46818060 39127462 33253759 28632552 24909727 21922333 19442017
$$ packed form
16026E57901M1994M4670L7324L5687L4341K2484J7176J0671K3339M0373L8627
16015I04587M0555L0279J9589K5222N0765P7336R4865Q9936O7218P0110P2383
16004A542845R3953J10771J15461J15407J44946J93317K10439K26405K75601L42467
15994C371612L82806M02511M44453M97662N79027O67538P39034Q80333J135602
15985I100578J536364K111318K785463L272338L923525N199951O943128R028636
15977D3901301J2724683J9762817L2246054N3564946P8691296O7622282R851371
15970C18364750k9028566m0859860m1256923m2967297m1506519l1055742k0476593
15963G1213250j4114385j0280805p690598n873703m621207l722825k987394k480316
$$ plain form
15955 19442017 17259090 15365408 13717562 12305472 11089770 10049230 9186230 8459437
15947 8459437 7818835 7240585 6744162 6306476 5883355 5470280 5102943 4793534 4509285
15938 4509285 4231458 3931001 3645232 3410572 3217110 3032957 2858221 2683718 2515306
15929 2515306 2363447 2224243 2103336 1988174 1875572 1753810 1639212 1547475 1471929 1406166
15919 1406166 1339447 1279313 1223057 1181456 1157632 1124482 1082853 1043328 1010341 973267 926764
15908 926764 876053 825302 792911 770148 748173 726075 703518 678064 653671 629784 616676
15897 616676 611465 600351 589708 577416 561819 542866 525714 513256 501905 492182 481679 466184
15885 466184 463315 462058 462999 452791 440809 432095 415771 391136 364084 350179 332250 306074
$$ packed form
15955A9442017k182927j893682j647846j412090j215702j040540q63000p26793
15947H459437o40602n78250m96423m37686m23121m13075l67337l09409k84249
15938D509285k77827l00457k85769k34660j93462j84153j74736j74503j68412
15929B515306j51859j39204j20907j15162j12602j21762j14598r1737p5546o5763
15919A406166o6719o0134n6256m1601k3824l3150m1629l9525l2987l7074m6503
15908I26764n0711n0751l2391k2763k1975k2098k2557k5454k4393k3887j3108
15897F16676n211j1114j0643j2292j5597j8953j7152j2458j1351r723j0503j5495
15885D66184k869j257R41j0208j1982q714j6324k4635k7052j3905j7929k6176
$$ plain form
15873 306074 272299 249461 248881 252182 248480 247041 248120 247128 253718 251485 246256 246070 240601 243675
15859 243675 255747 270546 289338 302593 313255 325869 327044 322642 316478 307439 309078 299855 296754
15846 296754 292566 275438 263790 248506 246648 243996 216600 185998 175797 174988 179918 185120 182960
15833 182960 177464 168412 153118 133983 116848 97714 84689 76201 73339 79674 87884 83292 83156
15820 83156 93110 112047 125605 135601 143072 147527 156449 179205 208269 234784 239376 231615 217732
15807 217732 208497 211340 209656 200580 179759 160286 142465 128156 117700 102720 83312 67255
15795 67255 58120 55267 47026 41579 32232 35025 40016 44239 50485 63043 78004 80149 72907 71170
15781 71170 84034 110752 133985 144507 153187 149037 147210 144148 139028 131107 134567 132477 118897
$$ packed form
15873C06074l3775k2838n80L301l702j439J079r92O590k233n229j86n469L074
15859B43675J2072J4799J8792J3255J0662J2614J175m402o164r039J639r223l101
15846B96754m188j7128j1648j5284j858k652k7396l0602j0201q09M930N202k160
15833A82960n496r052j5294j9135j7135j9134j3025q488k862O335Q210m592j36
15820H3156R954J8937J3558R996P471M455Q922K2756K9064K6515M592p761j3883
15807B17732r235K843j684r076k0821j9473j7821j4309j0456j4980j9408j6057
15795F7255r135k853q241n447r347K793M991M223O246J2558J4961K145p242j737
15781G1170J2864K6718K3233J0522Q680m150j827l062n120p921L460k090j3580
$$ plain form
15768 118897 103774 90299 76252 68875 68191 70773 70569 71134 71154 78309 77877 79283 81427 79578 85293
15753 85293 83143 87692 91273 95865 98245 97004 98578 99558 102621 104596 105013 105372 102500 101267 91586
15738 91586 90835 93149 93494 95244 95837 99730 101880 94199 87921 84629 81280 69719 69923 75400 75287
15723 75287 80176 80907 80644 81421 77316 67768 59237 59368 63569 67629 62744 63360 68345 69413 72252 73628
15707 73628 72613 72992 76105 72277 73759 75047 73756 65720 62799 63780 63543 61439 62003 61496 60226 57899
15691 57899 50690 55378 56796 58541 57102 53715 55836 57849 48906 40953 49265 49151 56121 64141 60244
15676 60244 57029 50057 41514 42273 41297 36479 33171 31452 32261 31659 33022 37090 35282 26056 14363
15661 14363 13993 17884 16901 18555 18430 20221 27404 24330 20060 15863 18645 21398 25012 29125 28114
$$ packed form
15768A18897j5123j3475j4047p377o84K582k04N65K0P155m32J406K144j849N715
15753H5293k150M549L581M592K380j241J574R80L063J975M17L59k872j233r681
15738I1586p51K314L45J750N93L893K150p681o278l292l349j1561K04N477j13
15723G5287M889P31k63P77m105r548q531J31M201M060m885O16M985J068K839J376
15707G3628j015L79L113l828J482J288j291q036k921R81k37k104N64n07j270k327
15691E7899p209M688J418J745j439l387K121K013q943p953Q312j14O970Q020l897
15676F0244l215o972q543P59r76m818l308j719Q09o02J363M068j808r226j1693
15661A4363l70L891r83J654j25J791P183l074m270m197K782K753L614M113j011
$$ plain form
15646 28114 26458 30997 31027 27896 23167 24269 29968 39088 45445 39327 28890 31502 34959 29300 21544
15631 21544 32899 43605 42889 34876 33341 27799 23589 25102 27014 24836 28284 29642 33911 32719
15617 32719 38122 33352 25264 23329 22652 17759 14264 23947 32052 28757 26986 26884 22291 23664 28389
15602 28389 32574 30870 26732 29244 31955 33603 27601 32306 34204 30463 30334 29648 24765 23727 23847
15587 23847 20921 20213 22069 16358 11197 13759 19969 27920 29558 26589 29739 28020 29266 27200 19904
15572 19904 11907 11572 14792 15797 14909 11103 15599 13015 10688 7698 15677 12821 12712 13079 3504
15557 3504 5321 4975 3650 5797 6766 2650 4077 10116 12709 14117 10949 10902 4045 4984 8576 20565
15541 20565 16758 11515 5527 3354 -1267 -76 2084 3222 7888 16828 22218 28331 24393 16873
$$ packed form
15646B8114j656M539L0l131m729J102N699R120O357o118j0437K612L457n659p756
15631B1544J1355J0706p16q013j535n542m210J513J912k178L448J358M269j192
15617C2719N403m770q088j935o77m893l495R683Q105l295j771j02m593J373M725
15602B8389M185j704m138K512K711J648o002M705J898l741j29o86m883j038J20
15587B3847k926p08J856n711n161K562O210P951J638k969L150j719J246k066p296
15572A9904p997l35L220J005q88l806M496k584k327k990P979k856j09L67r575
15557C504J817l46j325K147R69m116J427O039K593J408l168m7o857R39L592J1989
15541B0565l807n243n988k173m621J191K160J138M666Q940N390O113l938p520
$$ plain form
15527 16873 22421 23261 23908 23282 22154 26055 25831 24201 29375 30809 23454 18074 22099 15450 12156
15512 12156 13067 14228 23550 29060 27900 24956 25753 15856 12388 17358 19180 20056 14496 18566 20448
15497 20448 18365 17370 18364 23468 20614 10537 15315 21597 21758 17752 10803 11724 23657 23508 19765
15482 19765 12675 6048 4354 8300 10037 14769 17953 22245 19669 19859 22404 23769 14915 12675 13270
15467 13270 19138 25081 26023 33578 37749 34365 33913 30638 26700 26224 26366 23877 23877 22522 26308 31068
15451 31068 28638 28690 27605 20809 13678 11503 15796 16112 24127 34694 38020 43307 47346 46899 43336
15436 43336 39274 41424 51000 64936 76141 89932 112759 148444 185500 221899 273173 351796
15424 351796 468939 656114 964507 1378173 1689721 1713940 1552184 1325291 1092263 856199
$$ packed form
15527A6873N548Q40O47o26j128L901k24j630N174J434p355n380M025o649l294
15512A2156R11J161R322N510j160k944P97r897l468M970J822Q76n560M070J882
15497B0448k083r95R94N104k854j0077M778O282J61m006o949R21J1933j49l743
15482A9765p090o627j694L946J737M732L184M292k576J90K545J365q854k240N95
15467A3270N868N943R42P555M171l384m52l275l938m76J42k489%j355L786M760
15451C1068k430N2j085o796p131k175M293L16Q015J0567L326N287M039m47l563
15436D3336m062K150R576J3936J1205J3791K2827L5685L7056L6399N1274P8623
15424C51796J17143J87175L08393M13666L11548K4219j61756k26893k33028k36064
$$ plain form
15414 856199 651624 497535 386789 309246 261837 226700 194518 161652 138662 129694 116596
15403 116596 101578 92161 81197 73370 59765 54969 54681 56821 55966 55844 54676 45368 35615 30548
15389 30548 26839 26438 29462 33766 27622 20933 19819 22465 22556 22222 25041 22429 13722 12187 10847
15374 10847 10738 17439 22960 25253 23903 20817 21151 13152 9813 8737 14744 18369 24956 29387 20088
15359 20088 19208 18587 25784 28140 18191 7954 8820 12763 16133 14974 16124 16171 19088 15602 15428 19020
15343 19020 19283 14033 19733 26527 26793 21379 8326 578 1789 2642 2312 118 442 4166 7921
15328 7921 5675 7508 12332 12524 12291 6151 7089 8654 6787 8632 5767 7402 10519 14274 16023
15313 16023 12235 8550 10239 8493 8717 12081 16361 19299 18140 11826 6674 13100 23055 22788 20908
$$ packed form
15414H56199k04575j54089j10746p7543m7409l5137l2182l2866k2990q968j3098
15403A16596j5018r417j0964p827j3605m796k88K140q55j22j168r308r753n067
15389C0548l709m01L024M304o144o689j114K646R1l34K819k612q707j535j340
15374A0847j09O701N521K293j350l086L34p999l339j076O007L625O587M431r299
15359B0088q80o21P197K356r949j0237Q66L943L370j159J150M7K917l486j74L592
15343A9020K63n250N700O794K66n414j3053p748J211Q53l30k194L24L724L755
15328G921k246J833M824J92k33o140R38J565j867J845k865J635L117L755J749
15313A6023l788l685J689j746K24L364M280K938j159o314n152O426R955k67j880
$$ plain form
15298 20908 20295 15613 15660 14695 14835 11037 16150 18866 15247 10817 9656 5462 8513 6563 5927 6431
15282 6431 4267 7279 15711 10771 8217 10542 7338 5100 7556 6063 -1500 -3984 -1657 4844 4393
15267 4393 6218 3928 2398 4317 6327 6564 1044 -1390 3762 10522 7220 7764 10271 6096 2568
15252 2568 -2738 -4952 -3217 2908 4711 4549 2212 -494 1806 4887 -2682 -2949 5956 8136 7724
15237 7724 3760 -2331 -3511 -230 1870 -1021 499 6841 5954 907 4437 5823 5282 2183 -699
15222 -699 -5823 -3716 103 4304 5660 13267 14367 16003 13798 8871 62 -4073 -3630 -773 1183
15207 1183 2243 5473 8571 8437 -800 -7658 -8921 -4315 -1809 -40 1978 4197 1918 -606 8730
15192 8730 7144 4928 10000 10901 9140 4517 3325 11217 12315 10684 10519 15217 10008 600 -1727
$$ packed form
15298B0908o13m682M7r65J40l798N113K716l619m430j161m194L051j950o36N04
15282F431k164L012Q432m940k554K325l204k238K456j493p563k484K327O501m51
15267D393J825k290j530J919K010K37n520k434N152O760l302N44K507m175l528
15252B568n306k214J735O125J803j62k337k706K300L081p569k67Q905K180m12
15237G724l964o091j180L281K100k891J520O342q87n047L530J386n41l099k882
15222f99n124K107L819M201J356P607J100J636k205m927q809m135M43K857J956
15207A183J060L230L098j34r237o858j263M606K506J769K018K219k279k524R336
15192H730j586k216N072R01j761m623j192P892J098j631j65M698n209r408k327
$$ plain form
15177 -1727 -4069 -3064 -2224 3425 4333 4020 -246 1908 -777 -8265 -5932 -2696 -2838 -5040 -8329 -11220
15161 -11220 -9527 -13234 -17076 -13839 -10083 -15693 -9032 -3059 -3510 -2129 -290 1581 -2545 -432 3189
15146 3189 5145 6791 -1276 -10006 -9199 -6063 -6741 -828 -591 -6576 -8350 -7145 -1973 -322 3601
15131 3601 4521 3913 5871 9788 8083 1823 -9444 -14535 -11046 -10473 -12166 -14219 -16771 -5727 -4406
15116 -4406 -6941 -9085 -12739 -11497 -9811 -13723 -13491 -6328 -3063 -904 76 -1059 -230 2978 5756
15101 5756 3464 -2856 -8064 -2154 901 3941 3883 5744 5520 2924 4277 7036 3115 -3785 -5940
15086 -5940 -3961 -2345 -11939 -16877 -18606 -19857 -6431 7931 9217 -2213 -1489 36 624 2667
15072 2667 7247 1380 -8085 -6177 -5771 -6970 -6728 -8622 -8855 -6060 -8330 -7831 -10687 -14438 -18956 -17255
$$ packed form
15177a727k342J005Q40N649R08l13m266K154k685p488K333L236j42k202l289k891
15161a1220J693l707l842L237L756n610O661N973m51J381J839J871m126K113L621
15146C189J956J646q067q730Q07L136o78N913K37n985j774J205N172J651L923
15131C601R20o08J958L917j705o260j1267n091L489N73j693k053k552J1044J321
15116d406k535k144l654J242J686l912K32P163L265K159R80j135Q29L208K778
15101E756k292o320n208N910L055L040n8J861k24k596J353K759l921o900k155
15086e940J979J616r594m938j729j251J3426J4362J286j1430P24J525N88K043
15072B667M580n867r465J908M06j199K42j894k33K795k270M99k856l751m518J701
$$ plain form
15056 -17255 -11451 -10212 -13753 -20946 -10416 -5106 -7330 -4808 -206 1785 -2917 -5311 -3119 2693
15042 2693 56 -5828 -6596 -4139 -7819 -5539 -756 6672 11629 6425 3355 -451 2090 3015 -4655
15027 -4655 -4482 -4477 -11379 -7835 -4837 -7165 -5260 -5842 -4931 3312 14346 13198 10804 5192 7558 7773
15011 7773 7351 5624 106 -967 -5042 -7618 -7547 -9641 -11159 -97 3724 1058 -5293 -3872 -2173
14996 -2173 -5922 -9298 -3621 -4677 -9250 -7042 -2831 -9642 -6441 4217 9342 3253 -4129 -5514
14982 -5514 -2718 -5750 -265 -2160 -4015 1659 10178 11927 14039 14115 17204 18944 25978 27832 36615
14967 36615 54006 74098 127486 227247 384940 474316 433289 357050 287558 223496 156742
14956 156742 97448 66751 50972 41907 32898 24067 24550 22728 16270 9957 8370 957 -1075 7557
$$ packed form
15056a7255N804J239l541p193J0530N310k224K522M602J991m702k394K192N812
15042B693k637n884p68K457l680K280M783P428M957n204l070l806K541R25p670
15027d655J73No902L544K998k328J905n82R11Q243J1034j148k394n612K366K15
15011G773m22j727n518j073m075k576P1k094j518J1062L821k666o351J421J699
14996b173l749l376N677j056m573K208M211o811L201J0658N125o089p382j385
14982e514K796l032N485j895j855N674Q519J749K112P6L089J740P034J854Q783
14967C6615J7391K0092N3388R9761J57693Q9376m1027p6239o9492o4062o6754
14956A56742n9294l0697j5779r065r009q831M83j822o458o313j587p413k032Q632
$$ plain form
14942 7557 8019 1984 2666 8189 8990 6390 10707 8543 2386 5330 8409 5284 942 -1808 -3415
14927 -3415 -3922 -5894 -4132 -6776 620 2006 507 2730 9162 11417 7457 9927 6642 513 639
14912 639 4907 1683 -5777 -11279 -12498 -10023 -7821 -12578 -5653 5974 3653 -1690 -1440 -9910 -15790
14897 -15790 -13429 -13106 -17173 -19292 -14482 -13058 -9374 -9756 -12853 -7626 -5311 -7087 -719 10498 11136
14882 11136 4260 5201 9429 7088 3739 3693 1363 839 1868 5126 8978 7404 833 511 1513 380
14866 380 3503 2026 -2988 -4628 -1392 2021 2601 6368 11659 8272 -843 -1129 -3742 -7382 -7553 -2307
14850 -2307 4756 5288 561 2107 -3858 -7769 -6965 -5574 1086 7696 5431 7999 5826 5514 3951
14835 3951 -1756 697 175 -9361 -9997 -846 3092 1227 -32 1680 -4493 -5245 -8805 -4753 -6704
$$ packed form
14942G557M62o035O82N523Q01k600M317k164o157K944L079l125m342k750j607
14927c415n07j972J762k644P396J386j499K223O432K255l960K470l285o129J26
14912F39M268l224p460n502j219K475K202m757O925J1627k321n343K50q470n880
14897a5790K361L23m067k119M810J424L684l82l097N227K315j776O368J1217O38
14882A1136o876R41M228k341l349m6k330n24J029L258L852j574o571l22J002j133
14866C80L123j477n014j640L236L413N80L767N291l387r115k86k613l640j71N246
14850b307P063N32m727J546n965l911Q04J391O660O610k265K568k173l12j563
14835C951n707K453n22r536o36R151L938j865j259J712o173p52l560M052j951
$$ plain form
14820 -6704 -10289 -4192 5441 4574 -1173 -4022 -9026 -5245 -6561 -7192 -7160 -2427 3369 -5846 -13249 -10040
14804 -10040 141 -687 -11064 -11483 -17779 -12009 -4771 -3101 -12413 -15411 -9216 -10036 -7365 -1588 5093
14789 5093 -1336 -7941 -4785 3949 8558 1775 1280 185 -4527 -6008 -6585 -268 2774 -4683 -7105
14774 -7105 -5192 -605 -3836 -567 -2655 -6419 -5702 -1038 2472 -9478 -11884 -8690 -8801 -8627 -4884
14759 -4884 -4786 -12789 -14066 -11917 -9552 -355 8621 458 -3452 -3634 -8603 -4685 -9451 -11920 -3240
14744 -3240 1204 1031 -4835 -17820 -22941 -17856 -17749 -10225 626 6433 3791 1776 -5065 -10209 -10717
14729 -10717 -7487 555 4989 -197 -1594 548 3858 3427 754 -3270 -3618 1031 3536 2586 -4505
14714 -4505 -3860 -71 -2277 -8109 -1500 4470 4018 -6343 -12694 -16685 -18240 -15200 -7493 -5820 -6706
$$ packed form
14820f704l585O097R633q67n747k849n004L781j316o31L2M733N796r215p403L209
14804a0040J0181q28j0377m19o296N770P238J670r312k998O195q20K671N777O681
14789E093o429o605L156Q734M609o783m95j095m712j481n77O317L042p457k422
14774g105J913M587l231L269k088l764P17M664L510j1950k406L194j11J74L743
14759d884R8q003j277K149K365R197Q976q163l910j82m969L918m766k469Q680
14744c240M444j73n866j2985n121N085J07P524J0851N807k642k015o841n144n08
14729a0717L230Q042M434n186j397K142L310m31k673m024l48M649K505r50p091
14714d505O45L789k206n832O609N970m52j0361o351l991j555L040P707J673q86
$$ plain form
14699 -6706 -8078 -12244 -13683 -6136 3052 -306 -10110 -14975 -9668 -687 1295 -1309 -4947 -5008 -3218
14684 -3218 -4690 -626 1319 -894 -8760 -8277 -4214 -9486 -9335 -4438 -11747 -13732 -15587 -10097 -2984
14669 -2984 10050 13760 5500 -8069 -12659 -11618 -7847 -128 5511 3460 499 -4045 1733 5918
14655 5918 -116 -1261 4341 1126 -6203 -3310 -1164 -6279 -11203 -12344 -7322 -9429 -10515 -4765 -5003
14640 -5003 -9721 -18324 -19874 -11810 -557 -970 323 -1020 272 1829 -6135 -14607 -24408 -22412 -10153
14625 -10153 -3771 726 -1011 -9833 -11684 -8738 -9019 -19363 -16953 -11379 -3853 -6913 -9058 -2703
14611 -2703 -3633 -10957 -11569 -9279 -11822 -11647 -5899 -4388 -2794 -1957 -11 -1513 -6859 -11003 -10780 -15011
14595 -15011 -12212 -12254 -19440 -21869 -16860 -8468 -6730 -5422 -4677 -3077 -403 -6368 -10898 -6899 -6340
$$ packed form
14699f706j372m166j439P547R188l358r804m865N307Q981J982k604l638o1J790
14684c218j472M064J945k213p866M83M063n272J51M897p309j985j855N490P113
14669b984J3034L710q260j3569m590J041L771P719N639k051k961m544N778M185
14655E918o034j145N602l215p329K893K146n115m924j141N022k107j086N750k38
14640e003m718q603j550Q064J1253m13J293j343J292J557p964q472r801J996J2259
14625a0153O382M497j737q822j851K946k81j0344K410N574P526l060k145O355
14611b703r30p324o12K290k543J75N748J511J594Q37J946j502n346m144K23m231
14595a5011K799m2p186k429N009Q392J738J308P45J600K674n965m530L999N59
$$ plain form
14580 -6340 -9611 -9867 -13330 -14265 -8634 2871 3825 -1651 -4162 -2870 -2333 -6453 -6891 -4080 -3433 -4000
14564 -4000 -4847 3352 4231 -7772 -15757 -8596 360 1976 -2336 -3967 -10448 -13189 -12256 -2985 -4650
14549 -4650 -6283 -7944 -11232 -5902 -4465 -867 3737 8704 10829 9429 2829 -4757 -8090 -6806 -866
14534 -866 -197 949 3772 10840 3369 2538 3660 -4072 -15634 -25338 -20379 -11832 -8705 -10660 -13621
14519 -13621 -9616 -3149 -5617 -6894 -10633 -8457 -12086 -9648 -4590 -8985 -4738 -1535 -1497 -6541 -10534
14504 -10534 -10882 -12960 -15163 -14119 -14986 -11130 -8491 -6130 -12144 -14060 -10380 -6892 -11867 -9588 -9488
14489 -9488 -6800 -3529 -6640 -15371 -17177 -11634 -6737 -9565 -14401 -19138 -17158 -14844 -5399 -1002 -4094
14474 -4094 -9439 -15226 -12687 -7542 -1771 -10634 -13485 -10578 -14574 -17609 -21699 -20738 -18520 -20852 -20826
$$ packed form
14580f340l271k56l463r35N631J1505R54n476k511J292N37m120m38K811O47n67
14564d000q47Q199Q79j2003p985P161Q956J616m312j631o481k741R33R271j665
14549d650j633j661l288N330J437L598M604M967K125j400o600p586l333J284N940
14534h66O69J146K823P068p471q31J122p732j1562r704M959Q547L127j955k961
14519a3621M005O467k468j277l739K176l629K438N058m395M247L203L8n044l993
14504a0534l48k078k203J044q67L856K639K361o014j916L680L488m975K279J00
14489i488K688L271l111q731j806N543M897k828m836m737J980K314R445M397l092
14474d094n345n787K539N145N771q863k851K907l996l035m090R61K218k332K6
$$ plain form
14459 -20826 -17989 -11992 -101 -488 -5109 -4430 -11379 -13706 -10293 -7818 -4664 -5368 -1832 -2710 -5337
14444 -5337 -2538 -3204 -5264 1530 676 -1275 -10480 -13424 -10822 -6475 -4758 -766 -4061 -9157 -10886
14429 -10886 -9372 -10966 -14200 -13250 -11199 -18137 -18544 -10411 -3840 -6911 -11299 -12691 -17630 -18646 -14920
14414 -14920 -17382 -13892 -6297 -6434 -13533 -14974 -14246 -11152 -16811 -17670 -13975 -15638 -20541 -20613 -13273 -11820
14398 -11820 -6982 -1066 -1419 -4191 -7212 -8515 -5432 4176 774 4796 6330 -1396 -988 -4538 -2143
14383 -2143 -299 -6047 -3865 2135 1630 5083 -172 -6300 -10513 -17130 -14180 -6685 -9725 -11507 -4013
14368 -4013 2799 -247 -5856 -9752 -10338 -13162 -7553 -1532 -1027 -5579 -5288 -11835 -10180 -4614 -3447
14353 -3447 -7811 -11177 -11443 -9409 -7571 -8364 -8741 -7046 -10517 -12312 -13477 -8072 -10584 -12360 -10548
$$ packed form
14459b0826K837N997J1891l87m621O79o949k327L413K475L154p04L536q78k627
14444e337K799o66k060O794q54j951r205k944K602M347J717L992l295n096j729
14429a0886J514j594l234R50K051o938m07Q133O571l071m388j392m939j016L726
14414a4920k462L490P595j37p099j441P28L094n659q59L695j663m903p2P340J453
14398a1820M838N916l53k772l021j303L083R608l402M022J534p726M08l550K395
14383b143J844n748K182O000n05L453n255o128m213o617K950P495l040j782P494
14368d013O812l046n609l896n86k824N609O021N05m552K91o547J655N566J167
14353c447m364l366k66K034J838p93l77J695l471j795j165N405k512j776J812
$$ plain form
14338 -10548 -13562 -9537 -8932 -7934 -2381 -86 -336 -9075 -7515 -2484 -7633 -5261 -875 -4646 -6282
14323 -6282 -4221 -2809 2219 8118 3777 4862 2829 526 -727 -3609 -5556 -13312 -14445 -16337 -16946
14308 -16946 -14928 -14360 -18115 -12130 -8759 -8890 -8431 -9421 -9384 -10552 -14504 -14033 -6453 -5083 -8179 -13640
14292 -13640 -4537 8074 8026 2573 5965 5428 -5510 -10868 -4085 -7124 -7108 -7492 -3983 4690 5338 4759
14276 4759 2498 6445 5128 -5372 -4243 417 -466 -620 -7224 -11249 -7343 -6872 -9679 -2043 -2390
14261 -2390 -11643 -15592 -15609 -8518 -5693 -7860 -8646 -13110 -16544 -17814 -15798 -15007 -11252 -10685 -11875 -15600
14245 -15600 -9270 -5035 -2590 -2088 -3471 -12984 -20024 -21405 -17008 -13080 -15784 -19462 -21672 -19500 -17937
14230 -17937 -19552 -13115 -7327 -9649 -10498 -8303 -7588 -7543 -10124 -12036 -10818 -8250 -2064 -9308 -14542
$$ packed form
14338a0548l014M025O05R98N553K295k50q739J560N031n149K372M386l771j636
14323f282K061J412N028N899m341J085k033k303j253k882j947p756j133j892o09
14308a6946K018N68l755N985L371j31M59r90L7j168l952M71P580J370l096n461
14292a3640R103J2611m8n453L392n37j0938n358O783l039J6l84L509Q673O48n79
14276D759k261L947j317j0500J129M660q83j54o604m025L906M71k807P636l47
14261b390r253l949j7P091K825k167p86m464l434j270K016P91L755N67j190l725
14245a5600O330M235K445N02j383r513p040j381M397L928k704l678k210K172J563
14230a7937j615O437N788k322q49K195P15M5k581j912J218K568O186p244n234
$$ plain form
14215 -14542 -10328 -10761 -8234 -3795 -6858 -11566 -4060 -914 -1411 -3374 -5875 -2063 401 -4948 -9998
14200 -9998 -10300 -12338 -14340 -11886 -9547 -10943 -12800 -14879 -7274 -1341 -1484 -1763 346 -5514 -10427
14185 -10427 -8726 -10544 -11257 -8901 -15512 -11990 -7491 -9628 -8786 -5012 2202 2769 1845 1222 616 -3703
14169 -3703 -5908 -10121 -9957 -3514 -3853 -1418 -722 -12421 -20385 -18967 -10224 -6319 -16579 -18855 -16297
14154 -16297 -11631 -9891 -15255 -11902 -8842 -6871 -10295 -17431 -17440 -13751 -18289 -18316 -9087 -3620 -2024 -6158
14138 -6158 -13600 -12147 -11044 -11802 -7102 -1453 -3227 -7781 -5505 1987 3346 2594 -4549 -10068 -13812
14123 -13812 -13962 -11537 -10993 -7033 -1481 -2032 -11304 -11438 -9040 -11016 -9623 -11527 -13858 -14991 -10717
14108 -10717 -11561 -11421 -11454 -8834 -6345 -7786 -13420 -14721 -16181 -14751 -10224 -7405 -6474 -2841 3207 6134
$$ packed form
14215a4542M214m33K527M439l063m708P506L146m97j963k501L812K464n349n050
14200i998l02k038k002K454K339j396j857k079P605N933j43k79K109n860m913
14185a0427J701j818p13K356o611L522M499k137Q42L774P214N67r24o23o06m319
14169c703k205m213J64O443l39K435O96j1699p964J418Q743L905j0260k276K558
14154a6297M666J740n364L353L060J971l424p136rL689m538k7R229N467J596m134
14138f158p442J453J103p58M700N649j774m554K276P492J359p52p143n519l744
14123a3812j50K425N44L960N552n51r272j34K398j976J393j904k331j133M274
14108a0717q44J40l3K620K489j441n634j301j460J430M527K819R31L633O048K927
$$ plain form
14092 6134 7208 -3548 -7877 -8056 -13410 -13761 -13049 -15174 -10053 -9238 -11420 -18044 -16043 -13252 -13753 -19510
14076 -19510 -21322 -18986 -15988 -16628 -19453 -18358 -17221 -13226 -10926 -5079 -7239 -10506 -13039 -7767 -2637
14061 -2637 -7279 -12879 -9782 -8125 -8066 -8450 -11104 -12575 -13529 -11692 -13694 -14454 -18579 -18502 -21991 -24176
14045 -24176 -25542 -21367 -12063 -3759 7860 22801 36670 42721 31237 12530 650 -11135 -20756
14032 -20756 -27296 -29977 -28946 -20507 -14990 -11726 -11931 -15167 -16697 -14405 -7985 -16073 -24017 -23820 -20422
14017 -20422 -23845 -21854 -22296 -16275 -15117 -14385 -14382 -18527 -13690 -11018 -12800 -12487 -14024 -9707 -8513 -12406
14001 -12406 -12356 -16424 -15878 -12725 -10295 -15199 -21256 -17737 -13366 -18454 -22451 -21283 -18402 -16580 -9216
13986 -9216 -8142 -13196 -13063 -17593 -22601 -25327 -25462 -18524 -14284 -16416 -18104 -2798 2801 -3232 -9374
$$ packed form
14092F134J074j0756m329j79n354l51P12k125N121Q15k182o624K001K791n01n757
14076a9510j812K336K998o40k825J095J137L995K300N847k160l267k533N272N130
14061b637m642n600L097J657N9l84k654j471r54J837k002p60m125P7l489k185
14045b4176j366M175R304Q304J1619J4941J3869O051j1484j8707j1880j1785r621
14032b0756o540k681J031Q439N517L264k05l236j530K292O420q088p944J97L398
14017b0422l423J991m42O021J158P32Lm145M837K672j782L13j537M317J194l893
14001a2406N0m068N46L153K430m904o057L519M371n088l997J168K881J822P364
13986i216J074n054J33m530n008k726j35O938M240k132j688J5306N599o033o142
$$ plain form
13971 -9374 -16645 -20954 -23609 -28547 -26250 -26841 -28016 -23439 -15314 -9806 -9426 -502 71 -49 -2752 -6657
13955 -6657 -10286 -7312 -7151 -5193 -3898 -10854 -16100 -13719 -7541 -4972 -10831 -12510 -14543 -10615 -13048
13940 -13048 -12421 -8565 -4888 -5108 -7287 408 4504 3006 -1350 -5600 -9912 -8534 -13829 -15374 -16220
13925 -16220 -10817 -13414 -19551 -16646 -12301 -12935 -8522 -6456 -4744 -1109 3512 -1804 -7041 -8127 -13911
13910 -13911 -16630 -9380 -13273 -11695 -7834 -7187 -8516 -10757 -10267 -5752 -9066 -10879 -16599 -16627 -19415
13895 -19415 -20753 -23161 -25374 -27340 -27159 -25581 -21934 -22347 -21012 -19004 -18611 -18592 -20651 -16404 -16370 -13937
13879 -13937 -12315 -12617 -9613 -5004 4195 -1193 -8664 -14555 -21831 -17773 -13496 -17428 -20670 -15671 -13659
13864 -13659 -10098 -14278 -10997 -10078 -6233 -7941 -11287 -13203 -12223 -15577 -13203 -6902 -8541 -9395 -8087
$$ packed form
13971i374p271m309k655m938K297n91j175M577Q125N508L80Q924N73j20k703l905
13955f657l629K974J61J958J295o956n246K381O178K569n859j679k033L928k433
13940a3048O27L856L677k20k179P695M096j498m356m250m312J378n295j545q46
13925a6220N403k597o137K905M345o34M413K066J712L635M621n316n237j086n784
13910a3911k719P250l893J578L861O47j329k241M90M515l314j813n720k8k788
13895a9415j338k408k213j966J81J578L647m13J335K008L93J9k059M247L4K433
13879a3937J622l02L004M609R199n388p471n891p276M058M277l932l242M999K012
13864a3659L561m180L281R19L845j708l346j916R80l354K374O301j639q54J308
$$ plain form
13849 -8087 -7516 -4473 -8445 -12062 -11437 -5626 564 4859 3667 599 1235 -2628 -9337 -11115 -9955
13834 -9955 -5963 -3462 -3677 -4674 4632 4290 1094 623 -2287 -4891 -9618 -5741 -2681 -7647 -9644 -14719
13818 -14719 -16754 -13617 -6181 -7276 -7900 -13065 -13650 -14308 -11008 -4096 -5124 -8973 -7230 -5216 -11908
13803 -11908 -9418 -9822 -7630 -4463 -10266 -8560 -2800 -6712 -14560 -11219 -9753 -9142 -607 6970 9622
13788 9622 4030 661 2704 -5250 -3795 2928 12328 16236 14094 13199 17633 25502 34802 36346 42555
13773 42555 48811 64228 81084 95950 114574 142348 192183 258535 356255 485629 623388
13762 623388 764244 903966 998145 1018840 985622 919748 817727 688227 554340 431874
13752 431874 334931 264417 208189 170538 146320 138482 121371 101961 87917 83348 70657 54505
$$ packed form
13849h087N71L043l972l617O25N811O190M295j192l068O36l863o709j778J160
13834i955L992K501k15r97R306l42l196m71k910k604m727L877L060m966j997n075
13818a4719k035L137P436j095o24n165n85o58L300O912j028l849J743K014o692
13803a1908K490m04K192L167n803J706N760l912p848L341J466O11Q535P577K652
13788I622n592l369K043p954J455O723R400L908k142q95M434P869R300J544O209
13773D2555O256J5417J6856J4866J8624K7774M9835O6352R7720J29374J37759
13762F23388J40856J39722R4179K0695l3218o5874j02021j29500j33887j22466
13752D31874r6943p0514n6228l7651k4218p838j7111j9410j4044m569j2691j6152
$$ plain form
13740 54505 42340 33854 25203 29524 26602 21475 17972 17309 10640 10074 5819 3393 8050 10218 13221
13725 13221 15005 10857 6558 739 -7950 -9105 -7727 -5432 -1696 -7575 -9829 -3690 -4430 -5938 -7008
13710 -7008 -12427 -17425 -13407 -4665 -5480 -10487 -16244 -20325 -18436 -11370 -9371 -11051 -11637 -11904 -14051
13695 -14051 -11830 -15015 -12933 -18153 -19240 -19113 -18209 -11080 -2938 -2502 -762 -4388 -7258 -14845 -16119
13680 -16119 -12490 -9235 -5169 -1618 8450 5342 -236 368 1792 253 -842 -1541 -2202 -9944 -18836
13665 -18836 -19218 -18659 -14442 -7435 -7896 -13824 -9229 -8088 -5163 -2523 -10357 -14345 -13231 -11912 -11262
13650 -11262 -11091 -13357 -16503 -17058 -15268 -12798 -12423 -12052 -13316 -16849 -16464 -14699 -12254 -10082 -4899 -5637
13634 -5637 -6369 -4255 -7507 -8621 -8548 -8990 -6169 -4728 -5336 -4584 -5754 -4204 -2552 -6210 -5635 -6545 -7898
$$ packed form
13740E4505j2165q486q651M321k922n127l503o63o669n66m255k426M657K168L003
13725A3221J784m148m299n819q689j155J378K295L736n879k254O139p40j508j070
13710g008n419m998M018Q742q15n007n757m081J889P066J999j680n86k67k147
13695a4051K221l185K082n220j087J27R04P129Q142M36J740l626k870p587j274
13680a6119L629L255M066L551J0068l108n578O04J424j539j095o99o61p742q892
13665a8836l82N59M217P007m61n928M595J141K925K640p834l988J114J319O50
13650a1262J71k266l146n55J790K470L75L71j264l533L85J765K445K172N183p38
13634e637p32K114l252j114P3m42K821J441o08P52j170J550J652l658N75r10j353
$$ plain form
13617 -7898 -11187 -10470 -7043 -3334 -5845 -7632 -10886 -10206 -2429 -6684 -6045 -3051 -4392 -8518 -5794
13602 -5794 -1753 2964 -1009 -33 41 -1284 5307 4670 -2277 -2714 -1631 -679 -1365 152 2225 8639
13586 8639 10909 6461 663 -9148 -8095 -8063 -12140 -11484 -8878 -5193 -9165 -8313 -3964 -12495 -21207 -13837
13570 -13837 -7121 -2555 232 7595 5382 -965 -5031 -840 -276 -1163 -2545 397 -1685 -5574 -15627
13555 -15627 -22506 -18857 -9102 -6412 -3422 1681 5082 4816 4896 3151 1310 5660 3997 -491 -4049
13540 -4049 -4833 5689 5697 -1878 -2018 -6471 -3956 -850 -1948 -1519 979 4844 740 -535 365 -7097
13524 -7097 -9747 -8206 -2410 -2028 3042 3377 1927 -4431 -1680 -5706 -4385 -2148 -5649 -5439 2688
13509 2688 -2577 -7022 -8452 -2058 1261 7932 5857 168 2220 1668 -1919 -956 1964 2187 -2097
$$ packed form
13617g898l289P17L427L709k511j787l254O80P777m255O39K994j341m126K724
13602e794M041M717l973R76P4j325O591o37o947m37J083R52o86J517K073O414
13586H639K270m448n798r811J053L2m077O56K606L685l972Q52M349q531q712P370
13570a3837O716M566K787P363k213o347m066M191N64q87j382K942k082l889j0053
13555a5627o879L649R755K690K990N103L401k66Q0j745j841M350j663m488l558
13540d049p84J0522Qp575j40m453K515L106j098M29K498L865m104j275R00p462
13524g097k650J541N796L82N070L35j450o358K751m026J321K237l501K10Q127
13509B688n265m445j430O394L319O671k075n689K052n52l587R63K920K23m284
$$ plain form
13494 -2097 -3342 -3194 -7130 -1864 -4248 -11472 -14080 -7943 -7210 -10477 -13639 -14938 -6958 -1854 -9225
13479 -9225 -7884 -4451 -8038 -2625 511 2015 6754 4840 -5340 -6708 -6546 -4493 -3811 -1865 -4620
13464 -4620 -9769 -14129 -14920 -11657 -8569 -6567 -8836 -2577 -630 -2280 -8136 -12590 -11317 -9108 -6438
13449 -6438 -4682 -6319 -7317 -12324 -9793 -2810 2382 2526 -1606 -7836 -6935 -1827 181 -616 765 -3503
13433 -3503 -8856 -5724 -7683 -11325 -13792 -9336 -3545 -3466 235 1360 3666 -5764 -5659 -10306 -12190
13418 -12190 -10156 -12874 -6457 -4513 -5543 -12768 -18862 -19886 -21074 -20861 -14139 -12669 -13496 -16508 -18331
13403 -18331 -11678 -7811 -3931 -7521 -13092 -15157 -15116 -14383 -13744 -17095 -17682 -14569 -8439 -10723 -12762 -12061
13387 -12061 -7399 -6165 -4721 -9845 -14951 -12395 -6386 -2701 -7332 -12280 -9772 -16370 -23729 -22106
$$ packed form
13494b097j245J48l936N266k384p224k608O137P33l267l162j299P980N104p371
13479i225J341L433l587N413L136J504M739j914j0180j368J62K053O82J946k755
13464d620n149m360p91L263L088K002k269O259J947j650n856m454J273K209K670
13449f438J756j637r98n007K531O983N192J44m132o230R01N108K008p97J381m268
13433c503n353L132j959l642k467M456N791P9L701J125K306r430J05m647j884
13418a2190K034k718O417J944j030p225o094j024j188K13O722J470q27l012j823
13403a8331O653L867L880l590n571k065M1P33O39l351n87L113O130k284k039P01
13387a2061M662J234J444n124n106K556O009L685m631m948K508o598p359J623
$$ plain form
13373 -22106 -16787 -10596 -7061 -6039 -2787 -5552 -8222 -20326 -18343 -12006 -5190 -1341 1826 1085
13359 1085 -5164 -9436 -5076 -9466 -12799 -14131 -16892 -13250 -13015 -15909 -13651 -15099 -23334 -30652 -28058
13344 -28058 -16528 -4082 2515 2531 4470 6265 -1108 -8289 -12833 -10308 -5789 -1339 850 4789
13330 4789 7047 5225 3771 -3376 -10998 -9630 -9407 -7965 -2920 -4512 -5261 -2741 -7335 -14296 -9735
13315 -9735 -5536 -5733 -6288 -4889 -794 -223 -2689 -5527 -860 4256 2122 -8456 -11722 -4724 -4073
13300 -4073 -6349 -3736 -4262 -3983 -1227 7685 11078 8406 1960 2567 6536 3842 -4552 -15848 -13229
13285 -13229 -4454 -4428 -4620 -2764 -4999 -9012 -7583 -1869 663 4584 4606 -1920 -6339 -12229 -9837 -6226
13269 -6226 -4280 -2498 -10512 -20608 -18176 -13311 -7917 -8514 -11328 -11751 -18115 -23150 -18770 -16499 -16699
$$ packed form
13373b2106N319O191L535J022L252k765k670j2104J983O337O816L849L167p41
13359A085o249m272M360m390l333j332k761L642K35k894K258j448q235p318K594
13344b8058J1530J2446O597J6J939J795p373p181m544K525M519M450K189L939
13330D789K258j822j454p147p622J368K23J442N045j592p49K520m594o961M561
13315i735M199j97n55J399M095N71k466k838M667N116k134j0578l266O998O51
13300d073k276K613n26K79K756Q912L393k672o446O07L969k694q394j1296K619
13285a3229Q775K6j92J856k235m013J429N714K532L921K2o526m419n890K392L611
13269f226J946J782q014j0096K432M865N394n97k814m23o364n035M380K271k00
$$ plain form
13254 -16699 -8072 -8474 -10358 -7429 -2339 -4613 -6690 -8743 -10953 -7366 370 6054 2951 -3066 -5649
13239 -5649 -4228 -7723 -8348 -8484 -668 -3609 -5138 -1329 -6268 -4041 1798 898 2001 -593 -107 4371
13223 4371 4655 2463 7400 9791 11864 11695 11653 9321 2903 95 -2820 -2415 4338 9212 3576 -2075
13207 -2075 -7712 -7625 -6121 -3662 -5374 -8534 -2709 -1367 1558 -5645 367 -1501 -2125 3718 3222 6560
13191 6560 12571 15156 21418 16724 8825 14559 19759 18890 25057 31460 28985 26803 27146 26667 21907
13176 21907 19340 36316 62358 85977 98730 107847 99920 88803 79113 65661 51707 34395
13164 34395 25270 21844 19757 19444 24061 24820 22694 22218 21135 14856 20699 22500 13433 7896 6421
13149 6421 2008 1411 4694 1807 1926 3392 2527 5780 10039 10741 13596 17230 19622 21634 22575 25874
$$ packed form
13254a6699Q627m02j884K929N090k274k077k053k210L587P736N684l103o017k583
13239e649J421l495o25j36P816k941j529L809m939K227N839r00J103k594M86M478
13223D371K84k192M937K391K073j69m2k332o418k808k915M05O753M874n636n651
13207b075n637Q7J504K459j712l160N825J342K925p203O012j868o24N843m96L338
13191F560O011K585O262m694p899N734N200q69O167O403k475k182L43m79m760
13176B1907k567J6976K6042K3619J2753R117p927j1117r690j3452j3954j7312
13164C4395r125l426k087l13M617P59k126m76j083o279N843J801r067n537j475
13149F421m413n97L283k887J19J466q65L253M259P02K855L634K392K012R41L299
$$ plain form
13133 25874 35483 48714 62104 87740 130553 189885 244154 269329 256454 219715 177070 139999
13121 139999 108878 79811 54633 46317 42758 43837 40001 35798 34772 30306 29756 25892 17095 19295
13107 19295 23570 21460 22052 24038 24905 23677 25078 27714 39573 51631 52254 53702 45733 44734 47625
13092 47625 36456 32273 35518 39438 41104 50981 68538 91428 135626 199339 257585 292997 295081
13079 295081 264422 217332 174914 137393 101886 73094 64118 55756 40749 28888 21740 21277
13067 21277 29753 29514 23045 17573 13051 9711 5679 5518 14001 24925 32792 31524 25895 29117 33546
13052 33546 36396 32613 16248 6337 4477 2993 8296 18175 15486 6980 5290 9261 16899 25319
13038 25319 36703 65088 80659 86229 78209 60155 41997 36490 34241 29790 28006 23011 10665
$$ packed form
13133B5874R609J3231J3390K5636M2813N9332N4269K5175j2875l6739m2645l7071
13121A39999l1121k9067k5178q316l559J079l836m203j026m466n50l864q797K200
13107A9295M275k110N92J986Q67j228J401K636J1859J2058O23J448p969r99K891
13092D7625j1169m183L245L920J666R877J7557K2890M4198O3713N8246L5412K084
13079B95081l0659m7090m2418l7521l5507k8792q976q362j5007j1861p148m63
13067B1277Q476k39o469n472m522l340m032j61Q483J0924P867j268n629L222M429
13052C3546K850l783j6365r911j860j484N303R879k689q506j690L971P638Q420
13038B5319J1384K8385J5571N570q020j8054j8158n507k249m451j784m995j2346
$$ plain form
13025 10665 -51 -4481 -7128 -2367 -7666 -6357 -1108 237 10598 17633 18678 19491 18932 14918
13011 14918 9368 3315 -5141 -10499 -9604 -3610 840 439 2174 7304 8361 4729 4743 10135 8367
12996 8367 6381 4693 6131 -124 -11260 -11420 -9111 -13790 -14370 -7350 -7371 -11932 -16612 -15564 -17325
12981 -17325 -20403 -15394 -11982 -11254 -6926 -13661 -16565 -15131 -11994 -4019 -7003 -10142 -14616 -18076 -19248
12966 -19248 -18592 -14776 -9146 -8004 -5881 -6189 -9508 -15226 -19582 -17534 -9998 -4844 -7628 -9909 -7127
12951 -7127 -5658 -1219 3682 8607 -56 -2954 -9595 -19727 -12889 -4671 -3676 -8515 -12065 -12200 -16066
12936 -16066 -16062 -10677 -3995 -1430 -2293 -1184 2604 -16 -2497 -5707 -3641 -5807 -11679 -15218 -9296
12921 -9296 -6424 -8051 -4921 -2537 512 -4472 -9968 -12254 -14872 -13697 -12505 -3788 4679 1426 -1302
$$ packed form
13025A0665j0716m430k647M761n299J309N249J345J0361P035J045Q13n59m014
13011A4918n550o053q456n358Q95N994M450m01J735N130J057l632J4N392j768
12996H367j986j688J438o255j1136j60K309m679n80P020k1m561m680J048j761
12981a7325l078N009L412P28M328o735k904J434L137P975k984l139m474l460j172
12966a9248O56L816N630J142K123l08l319n718m356K048P536N154k784k281K782
12951g127J469M439M901M925q663k898o641j0132O838Q218R95m839l550j35l866
12936a6066MN385O682K565q63J109L788k620k481l210K066k166n872l539N922
12921i296K872j627L130K384L049m984n496k286k618J175J192Q717Q467l253k728
$$ plain form
12906 -1302 -1386 -2022 -9107 -14109 -11682 -11974 -7119 -6523 -8875 -12357 -8500 -16233 -18834 -10909 -5616 -5395
12890 -5395 -11070 -8390 -7292 -10594 -7302 -1091 1358 3174 5091 4412 4296 10166 9197 5767 1803
12875 1803 -3312 -7179 -9191 -10675 -4976 -924 4742 2784 -9002 -13290 -7497 617 1847 -2562
12861 -2562 -6984 -5955 385 3415 1579 1450 -221 -8366 -9980 -9674 -3738 705 -5100 -3739 -2424
12846 -2424 -7281 -9619 -3944 -4421 -544 832 -6452 -7802 623 -2570 -5334 -9839 -13432 -18568 -18995
12831 -18995 -13001 -8975 -13939 -15731 -16922 -18293 -16286 -14593 -8640 -7798 -4605 -8045 -8928 -9679 -8398
12816 -8398 -8879 -8579 -3784 -1255 -2947 -2026 -2811 3242 7209 6445 8595 11991 15536 18573 14432 19107
12800 19107 23886 32841 44597 61001 78483 83730 88386 97747 111457 131912 148667 175140 220776
$$ packed form
12906a302q4o36p085n002K427k92M855N96k352l482L857p733k601P925N293K21
12890e395n675K680J098l302L292O211K449J816J917o79j16N870r69l430l964
12875A803n115l867k012j484N699M052N666j958j1786m288N793Q114J230m409
12861b562m422J029O340L030j836j29j671q145j614L06N936M443n805J361J315
12846b424m857k338N675m77L877J376p284j350Q425l193k764m505l593n136m27
12831a8995N994M026m964j792j191j371K007J693N953Q42L193l440q83p51J281
12816h398m81L00M795K529j692R21p85O053L967p64K150L396L545L037m141M675
12800A9107M779Q955J1756J6404J7482N247M656R361J3710K0455J6755K6473M5636
$$ plain form
12787 220776 288150 375541 489957 635763 801582 959715 1091989 1172604 1184105 1131852
12777 1131852 1027707 891272 748874 615772 494366 393973 321678 268043 234270 205833
12767 205833 178825 156946 143645 127469 111902 99772 97767 89054 74075 70520 60957 51371
12755 51371 52836 51730 45884 46875 45858 42814 42068 45006 50518 61408 70018 76985 78352 66137
12741 66137 57079 43684 27911 19849 20124 14773 16865 15198 17249 15964 9520 6177 3252 1882
12727 1882 4064 6510 6753 14692 21406 22319 24312 22303 19616 19006 11941 8620 21878 38246 48493
12712 48493 61123 70554 73456 66980 61624 52003 41192 29771 27557 24434 9539 2104 5067
12699 5067 7547 4790 7626 4947 9025 10443 7396 8223 5676 4490 881 -2967 2105 -456 2041
$$ packed form
12787B20776O7374Q7391J14416J45806J65819J58133J32274Q0615J1501n2253
12777A131852j04145j36435j42398j33102j21406j00393p2295n3635l3773k8437
12767B05833k7008k1879j3301j6176j5567j2130k005q713j4979l555r563r586
12755E1371J465j106n846R91j017l044p46K938N512J0890Q610O967J367j2215
12741F6137r058j3395j5773q062K75n351K092j667K051j285o444l343k925j370
12727A882K182K446K43P939O714R13J993k009k687o10p065l321J3258J6368J0247
12712D8493J2630R431K902o476n356r621j0811j1421k214l123j4895p435K963
12699E067K480k757K836k679M078J418l047Q27k547j186l609l848N072k561K497
$$ plain form
12684 2041 9635 13291 12026 13308 17920 22442 22729 19123 17452 15000 14446 3485 2191 1208 757
12669 757 8384 14329 13760 15259 10655 8314 8027 10649 19891 16722 10475 6358 2738 7291 14545
12654 14545 11919 11740 9849 8602 8619 5313 2661 3775 -3605 -4587 4924 9870 5328 -587 -1582 -4896
12638 -4896 -12567 -18329 -12514 -7973 -5104 -4871 -3083 -3682 422 2330 -3991 -5928 -2897 -1160 -2610
12623 -2610 -4845 -1774 1319 11039 21889 34589 53847 71883 85739 104361 122933 141173 160222
12610 160222 175458 180640 175986 161866 137495 111333 85648 56469 32929 10485 856 -3110
12598 -3110 -8535 -7532 729 7510 25040 31354 19120 9726 8148 9218 7724 3684 3954 -351
12584 -351 -31 3229 7988 8798 8631 11811 20315 28113 28851 29122 31518 31976 31759 34387 37260 34743 43554
$$ packed form
12684B041P594L656j265J282M612M522K87l606j671k452n54j0961j294r83m51
12669G57P627N945n69J499m604k341k87K622R242l169o247m117l620M553P254
12654A4545k626j79j891j247J7l306k652J114p380r82R511M946m542n915r95l314
12638d896p671n762N815M541K869K33J788n99M104J908o321j937L031J737j450
12623b610k235L071L093R720J0850J2700J9258J8036J3856J8622J8572J8240J9049
12610A60222J5236N182m654j4120k4371k6162k5685k9179k3540k2444r629l966
12598c110n425J003Q261O781J7530O314j2234r394j578J070j494m040K70m305
12584c51L20L260M759Q10j67L180Q504P798P38K71K396M58k17K628K873k517Q811
$$ plain form
12567 43554 47492 35510 33643 28691 21582 12807 6704 1962 -4304 -19896 -24843 -25254 -22352 -11438
12553 -11438 -5976 5582 12915 18488 27282 35856 48522 60736 62370 61334 66208 72785 82154 83162
12539 83162 83070 82737 86490 97658 94437 85053 73427 64529 56572 48455 36378 22991 6404 -9659
12525 -9659 -15853 -23509 -35922 -42498 -43682 -43497 -42325 -36151 -21975 -3376 19550 39054 51772
12512 51772 62541 70823 77386 89359 102236 113680 117556 115437 114283 110923 103479 108961 110399
12499 110399 100345 99587 103208 102922 104174 119438 143858 161111 178150 193629 207136 213446 215452
12486 215452 211489 198051 188600 177061 171676 164447 151559 141060 129767 121758 117463 114128 114739
12473 114739 109175 111059 123235 133047 147530 159400 154242 161172 173242 183660 194635 199686 203598
$$ packed form
12567D3554L938j1982j867m952p109q775o103m742o266j5592m947m11K902J0914
12553a1438N462J1558P333N573Q794Q574J2666J2214J634j036M874O577R369J008
12539H3162r2l33L753J1168l221r384j1626q898p957q117j2077j3387j6587j6063
12525i659o194p656j2413o576j184J85J172O174J4176J8599K2926J9504J2718
12512E1772J0769Q282O563J1973J2877J1444L876k119j154l360p444N482J438
12499A10399j0054p58L621k86J252J5264K4420J7253J7039J5479J3507O310K006
12486B15452l963j3438r451j1539n385p229j2888j0499j1293q009m295l335O11
12473A14739n564J884J2176R812J4483J1870n158O930J2070J0418J0975N051L912
$$ plain form
12460 203598 207228 215672 218707 216690 216577 209295 200378 192812 187886 180256 181954 177729 176457 185867
12446 185867 199777 211538 218789 224661 224215 236918 250470 252618 264618 285195 301931 317828
12434 317828 336147 350999 371219 391982 409133 427661 453580 470905 481050 500094 519913
12423 519913 530958 547624 553584 567890 589668 617823 654310 699253 760132 818400 875551 938204
12411 938204 992479 1042178 1095119 1126000 1138485 1157778 1175924 1204789 1232157 1262703 1311914
12400 1311914 1375501 1443433 1521740 1611331 1706428 1810848 1923916 2048877 2188086 2342612
12390 2342612 2515024 2709417 2932292 3205372 3525271 3895206 4336042 4841608 5439907
12381 5439907 6164732 7044874 8109865 9367475 10809632 12398514 14077605 15841521
$$ packed form
12460B03598L630Q444L035k017j13p282q917p566m926p630J698m225j272R410
12446A85867J3910J1761P251N872m46J2703J3552K148J2000K0577J6736J5897
12434C17828J8319J4852K0220K0763J7151J8528K5919J7325J0145J9044J9819
12423E19913J1045J6666N960J4306K1778K8155L6487M4943O0879N8268N7151O2653
12411I38204N4275M9699N2941L0881J2485J9293J8146K8865K7368L0546M9211
12400A311914O3587O7932P8307Q9591R5097J04420J13068J24961J39209J54526
12390B342612J72412J94393K22875K73080L19899L69935M40836N05566N98299
12381E439907P24825Q80142J064991J257610J442157J588882J679091J763916
$$ plain form
12373 15841521 17743869 19898847 22503294 25850260 30428628 36915949 46294930 59955312
12365 59955312 79545683 105959015 137460348 169470296 197008166 216473806 225245614
12358 225245614 221240575 204826433 179931161 151773055 124305934 99727504 79251763
12351 79251763 63349785 51702313 43404958 37478942 33136553 29811130 27106379 24714327
12343 24714327 22463676 20303334 18239385 16300696 14541027 12989545 11652002 10518905
12335 10518905 9570858 8767220 8078805 7477388 6943276 6462956 6025264 5620721 5249817
12326 5249817 4909731 4593030 4294577 4022528 3782104 3564243 3365585 3181692 3009632
12317 3009632 2849960 2699879 2563419 2443547 2338649 2237708 2146601 2059498 1976252 1893626
$$ packed form
12373A5841521J902348K154978K604447L346966M578368O487321R378981J3660382
12365E9955312J9590371K6413332L1501333L2009948K7537870J9465640Q771808
12358B25245614m005039j6414142k4895272k8158106k7467121k4578430k0475741
12351G9251763j5901978j1647472q297355n926016m342389l325423k704751k392052
12343B4714327k250651k160342k063949j938689j759669j551482j337543j133097
12335A0518905r48047q03638o88415o01417n34112m80320m37692m04543l70904
12326E249817l40086l16701k98453k72049k40424k17861j98658j83893j72060
12317C009632j59672j50081j36460j19872j04898j00941r1107q7103q3246q2626
$$ plain form
12307 1893626 1806970 1726576 1648956 1564963 1491777 1425211 1366052 1311815 1252984 1199563 1149199
12296 1149199 1107711 1068138 1015464 976444 948959 916150 882528 856786 836240 813652 791103
12285 791103 773140 753558 736322 716932 695032 677196 662769 648052 631886 614853 602857
12274 602857 598838 591490 577909 563092 547096 537255 522957 504661 487009 471007 452393 431664
12262 431664 414613 392125 368675 359255 350006 346801 352799 351922 350067 350737 345617 335863 336808 341728
12248 341728 345136 351312 357490 362411 371855 381792 388803 385872 380129 376633 371855 361079 350866 341183
12234 341183 337093 328710 315275 301801 294160 284337 270958 265761 262194 255225 252754 255908 253031
12221 253031 238730 227388 219949 203861 185446 173737 164309 151184 150912 151227 154406 155415 158933
$$ packed form
12307A893626q6656q0394p7620q3993p3186o6566n9159n4237n8831n3421n0364
12296A149199m1488l9573n2674l9020k7485l2809l3622k5742k0546k2588k2549
12285G91103j7963j9582j7236j9390k1900j7836j4427j4717j6166j7033j1996
12274F02857m019p348j3581j4817j5996r841j4298j8296j7652j6002j8614k0729
12262D31664j7051k2488k3450r420r249l205N998q77j855O70n120r754R45M920
12248C41728L408O176O178M921R444R937P011k931n743l496m778j0776j0213r683
12234C41183m090q383j3435j3474p641r823j3379n197l567o969k471L154k877
12221B53031j4301j1342p439j6088j8415j1709r428j3125k72L15L179J009L518
$$ plain form
12208 158933 160696 169559 176060 179729 183745 192574 208593 225399 238807 254076 258689 256846 258903
12195 258903 253602 240048 240027 231187 222264 214107 199879 184977 169861 150617 139248 127638 122258
12182 122258 111355 102203 102289 103064 104088 113333 127855 136607 139037 154166 173896 189505 203933
12169 203933 217907 235017 256077 275886 293729 316441 337258 356005 380610 417634 468157
12158 468157 525204 599766 713134 874823 1094774 1361127 1644530 1925848 2160816 2326057
12148 2326057 2393245 2354419 2217173 1995133 1740341 1481506 1238498 1030261 862945 730446
12138 730446 622923 543957 494972 450897 417732 392988 370015 343476 322389 303101 286987
12127 286987 273361 261583 254302 234370 218543 202317 188676 180031 175228 172697 171729 165357 155482
$$ packed form
12208A58933J763Q863O501L669M016Q829J6019J6806J3408J5269M613j843K057
12195B58903n301j3554k1q840q923q157j4228j4902j5116j9244j1369j1610n380
12182A22258j0903r152Q6P75J024R245J4522Q752K430J5129J9730J5609J4428
12169B03933J3974J7110K1060J9809J7843K2712K0817J8747K4605L7024N0523
12158D68157N7047P4562J13368J61689K19951K66353K83403K81318K34968J65241
12148B326057O7188l8826j37246k22040k54792k58835k43008k08237j67316j32499
12138G30446j07523p8966m8985m4075l3165k4744k2973k6539k1087j9288j6114
12127B86987j3626j1778p281j9932j5827j6226j3641q645m803k531r68o372r875
$$ plain form
12114 155482 147960 147569 147919 137839 130184 122159 123002 116445 108037 100810 96525 91510 88861 96813 106964
12099 106964 110908 108600 100117 100936 102062 101345 100761 99048 100189 97314 93075 90488 91528 95724 91878
12084 91878 85267 81061 80405 84106 84632 83751 77089 72027 71485 78741 90100 84294 80285 78925 77328
12069 77328 76848 71844 65686 66217 69011 70261 69312 70135 62056 52773 43744 40010 42855 50389 50132 44779
12053 44779 42750 49148 50138 53827 52926 53338 54287 48344 38132 35335 34010 30550 27146 31972 35767
12038 35767 42479 38711 31743 31496 37519 42366 47931 50840 59289 63503 52043 50635 52800 49734
12024 49734 42902 42007 40246 37451 36114 34578 38518 44388 47586 45173 46965 46860 42537 40454 37289
12009 37289 36437 42787 49728 53436 55566 59578 53371 48613 45897 49910 56332 63495 65314 59175 55604
$$ packed form
12114A55482p522l91L50j0080p655q025Q43o557q408p227m285n015k649P952J0151
12099A06964L944k308q483Q19J126p17n84j713J141k875m239k587J040M196l846
12084I1878o611m206o56L701N26q81o662n062n42P256J1359n806m009j360j597
12069G7328m80n004o158N31K794J250r49Q23q079r283r029l734K845P534k57n353
12053D4779k029O398R90L689r01M12R49n943j0212k797j325l460l404M826L795
12038C5767O712l768o968k47O023M847N565K909Q449M214j1460j408K165l066
12024D9734o832q95j761k795j337j536L940N870L198k413J792j05m323k083l165
12009C7289q52O350O941L708K130M012o207m758k716M013O422P163J819o139l571
$$ plain form
11994 55604 54438 56303 56337 60588 59180 60197 59698 57769 56185 58492 62851 60837 66896 75217 81330
11979 81330 91176 108520 121172 149122 188446 223969 254828 289564 314481 324252 323690 312245
11967 312245 296369 276048 251676 227215 212457 206403 204902 199854 197499 204595 202431 196781 185334
11954 185334 170694 159461 146192 140283 135949 132603 130477 135227 144340 152454 162771 189149 223646
11941 223646 270326 328699 411176 531823 674523 822308 977175 1105412 1190245 1215160
11931 1215160 1177518 1080722 946954 796722 656253 527674 424401 344906 294494 257997
11921 257997 235608 217360 196620 176408 161002 153290 146156 134076 125675 128422 123206 111830
11909 111830 100036 90258 82841 73892 65038 65352 67431 63318 65174 59759 52581 50858 52921 49742
$$ packed form
11994E5604j166J865L4M251j408J017m99j929j584K307M359k014O059Q321O113
11979H1330R846J7344J2652K7950L9324L5523L0859L4736K4917R771n62j1445
11967C12245j5876k0321k4372k4461j4758o054j501n048k355P096k164n650j1447
11954A85334j4640j1233j3269n909m334l346k126M750R113Q114J0317K6378L4497
11941B23646M6680N8373Q2477J20647J42700J47785J54867J28237Q4833K4915
11931A215160l7642r6796j33768j50232j40469j28579j03273p9495n0412l6497
11921B57997k2389j8248k0740k0212j5406p712p134j2080q401K747n216j1376
11909A11830j1794r778p417q949q854L14K079m113J856n415p178j723K063l179
$$ plain form
11895 49742 44077 37694 42105 42146 40437 43302 32775 22644 28341 28290 23096 30604 32620 28043 23388
11880 23388 24009 27882 29648 28514 29952 33657 32539 30987 26126 26933 29043 31371 35826 35785 27266
11865 27266 25669 26639 24841 21266 23589 29231 29807 26708 26799 27149 24188 26661 36823 34843 31102
11850 31102 35468 34865 33192 40034 33844 30192 37572 38691 38490 39469 42409 47961 53292 59750 65022
11835 65022 72917 75712 74436 73135 64461 53828 46340 40429 33799 29576 31939 32739 32965 32867 32295
11820 32295 25489 22786 26972 23414 16848 21303 25038 23255 27762 30632 22613 16946 18582 16234
11806 16234 7737 8058 10086 4581 -1069 -3289 -2852 9020 19937 25393 22486 12560 14006 20571
11792 20571 20207 16674 21340 21224 16566 15687 14503 12105 10931 10462 3499 3426 6638 13612 15705 21846
$$ packed form
11895D9742n665o383M411M1j709K865j0527j0131N697n1n194P508K016m577m655
11880B3388O21L873J766j134J438L705j118j552m861Q07K110K328M455m1q519
11865B7266j597R70j798l575K323N642N76l099R1L50k961K473J0162j980l741
11850C1102M366o03j673O842o190l652P380J119k01R79K940N552N331O458N272
11835F5022P895K795j276j301q674j0633p488n911o630m223K363Q00K26r8n72
11820C2295o806k703M186l558o566M455L735j783M507K870q019n667J636k348
11806A6234q497L21K028n505n650k220M37J1872J0917N456k907r926J446O565
11792B0571l64l533M666j16m658q79j184k398j174m69o963p3L212O974K093O141
$$ plain form
11776 21846 28134 27356 29801 33119 33224 25039 21869 23820 13746 9820 10525 11384 12466 10470 8944
11761 8944 9298 6259 4847 6939 3683 5474 9320 8447 7234 4921 1739 4068 10368 12894 14174
11746 14174 14498 8773 9320 5182 -9490 -16081 2803 30795 48749 67640 62797 41299 18279
11733 18279 7589 15786 26145 38066 41918 35124 24948 20517 16256 3111 -7992 -5814 3211
11720 3211 8617 10317 6884 10786 14916 9736 7217 4336 1304 -3748 -6494 -7356 -2768 4098 7383
11705 7383 4739 2598 4485 10043 13234 18252 17172 19029 26485 28797 28053 18469 9173 6984 7874
11690 7874 8380 8531 15727 18078 19765 18539 18688 14190 8818 3185 5355 6898 10871 11924 1063
11675 1063 -1438 5115 5300 5628 296 -3060 615 187 422 -1132 -3532 -6353 -4894 -2422 -2507 688
$$ packed form
11776B1846O288p78K445L318J05q185l170J951j0074l926P05Q59J082j996j526
11761H944L54l039j412K092l256J791L846q73j213k313l182K329O300K526J280
11746A4174L24n725N47m138j4672o591J8884K7992J7954J8891m843k1498k3020
11733A8279j0690Q197J0359J1921L852o794j0176m431m261j3145j1103K178R025
11720C211N406J700l433L902M130n180k519k881l032n052k746q62M588O866L285
11705G383k644k141J887N558L191N018j080J857P456K312p44r584r296k189Q90
11690G874N06J51P196K351J687j226J49m498n372n633K170J543L973J053j0861
11675A063k501O553J85L28n332l356L675m28K35j554k400k821J459K472q5L195
$$ plain form
11659 688 1617 1686 2348 6324 3956 10651 8489 6766 8090 5634 6882 6273 -319 -230 -2193 -345 3604
11642 3604 5457 12877 9719 10814 5436 -456 -519 2537 423 -10157 -11860 -9465 -2519 -1316 -3720
11627 -3720 1564 4219 5917 8507 6694 -830 -12750 -15309 -12320 -8163 -9481 -8275 -9752 -6643
11613 -6643 -7007 -7773 -854 2759 4334 7219 -4889 -16276 -11398 -3537 -6107 -806 4617 1384 -689
11598 -689 -4446 -4937 -5138 -7239 -3937 388 3159 3332 3241 -1112 -2683 -5922 -4831 -1584 -4634 -5333
11582 -5333 -5804 -1021 2840 1251 2375 2817 9992 14199 12575 16066 10337 4393 -1906 -4741 -1305
11567 -1305 -4641 -9258 -14123 -13267 -10863 -2348 238 1245 3610 3368 -417 -646 -4004 -9017 -3619
11552 -3619 1138 -868 -3534 -6315 -9755 -15842 -14096 -7573 -3986 -2391 -1400 2802 177 -2492 -4451
$$ packed form
11659F88R29O9O62L976k368O695k162j723J324k456J248o09o592Q9j963J848L949
11642C604J853P420l158J095n378n892o3L056k114j0580j703K395O946J203k404
11627c720N284K655J698K590j813p524j1920k559K989M157j318J206j477L109
11613f643l64p66O919L613J575K885j2108j1387M878P861k570N301N423l233k073
11598f89l757m91k01k101L302M325K771J73r1m353j571l239J091L247l050o99
11582e333m71M783L861j589J124M42P175M207j624L491n729n944o299k835L436
11567a305l336m617m865Q56K404Q515K586J007K365k42l785k29l358n013N398
11552c619M757k006k666k781l440o087J746O523L587J595R91M202k625k669j959
$$ plain form
11537 -4451 -509 -1988 -3550 -2593 -3068 -8110 -6821 -6993 -2622 -397 -768 -6299 -6815 -3202 -3870 3444
11521 3444 6399 815 -2092 -4714 -10284 -12349 -11013 -2317 2494 -2981 -9430 -6714 -7118 -1934 -3933
11506 -3933 -82 -753 -7325 -17599 -18685 -22083 -19880 -13470 -11493 -11445 -12548 -8446 -7855 -8548 -7923 -14236
11490 -14236 -13797 -7282 -2610 -700 -4405 -5340 -4862 -408 1290 -7249 -14408 -12020 -9135 -8408 -2639
11475 -2639 -2601 -6653 -15547 -15444 -5013 -6397 -10877 -8164 -6386 -8043 -5853 -2894 -2062 -4267 -5533
11460 -5533 -8068 -6341 -5045 -5840 -3497 1949 -1611 -6290 -6316 -8595 -7866 -9069 -8490 -10988 -14587 -10483
11444 -10483 -6347 -5540 -3835 -2472 -2964 -3700 -4163 -8303 -13200 -12024 -13471 -8063 -4861 -3869 -2522 422
11428 422 -866 -6426 -3078 -285 -3394 -2056 4441 -584 -1269 -4257 -9444 -10162 -10570 -9610 -10332 -12839
$$ packed form
11537d451L942j479j562R57m75n042J289j72M371K225l71n531n16L613o68P314
11521C444K955n584k907k622n570k065J336Q696M811n475o449K716m04N184j999
11506c933L851o71o572j0274j086l398K203O410J977M8j103M102N91o93O25o313
11490a4236M39O515M672J910l705r35M78M454J698q539p159K388K885P27N769
11475b639L8m052q894J03J0431j384m480K713J778j657K190K959Q32k205j266
11460e533k535J727J296p95K343N446l560m679k6k279P29j203N79k498l599M104
11444a0483M136Q07J705J363m92p36m63m140m897J176j447N408L202R92J347K944
11428D22j288n560L348K793l109J338O497n025o85k988n187p18m08R60p22k507
$$ plain form
11412 -12839 -19608 -21921 -13412 -9350 -12365 -14747 -7225 -4547 -8044 -12064 -7250 -6932 -11936 -11948 -7742
11397 -7742 -1853 -6862 -9218 -16828 -15283 -12932 -6973 -9423 -15165 -22345 -18506 -12569 -6579 -4256 -10249
11382 -10249 -14630 -18117 -19393 -19229 -14777 -13167 -8490 -6841 -6123 -6625 -9285 -10731 -5704 -3263 -4686
11367 -4686 -1089 -4615 -4428 -6671 -6436 1015 -4536 -6005 161 976 -4929 -6288 -6666 -2015 580 -3469
11351 -3469 -377 362 -2146 -3870 6173 6243 -344 -3496 -1606 -1100 -4530 -4936 -3120 -1451 2772 9862
11335 9862 7110 7324 10006 12096 10409 8008 7672 7217 8832 8567 12865 18281 23610 35613 48241
11320 48241 48826 51385 55973 69726 87243 98439 106870 123330 146591 172267 200092 245343 314210
11307 314210 413021 548861 734723 964705 1190547 1339426 1362685 1287491 1146712 973483
$$ packed form
11412a2839o769k313Q509M062l015k382P522K678l497m020M814L18n004j2M206
11397g742N889n009k356p610J545K351N959k450n742p180L839N937N990K323n993
11382a0249m381l487j276J64M452J610M677J649P18n02k660j446N027K441j423
11367d686L597l526J87k243K35P451n551j469O166Q15n905j359l78M651K595m049
11351c469L092P39k508j724J0043P0o587l152J890N06l430m06J816J669M223P090
11335I862k752K14K682K090j687k401l36m55J615k65M298N416N329J2003J2628
11320D8241N85K559M588J3753J7517J1196Q431J6460K3261K5676K7825M5251O8867
11307C14210R8811J35840J85862K29982K25842J48879K3259p5194j40779j73229
$$ plain form
11297 973483 793544 634439 500385 394383 321999 269870 228606 203561 182911 162466 154566
11286 154566 137512 114992 99267 90528 84871 77160 65944 65657 59506 53410 49205 44722 47470
11273 47470 45606 40030 38450 40415 42360 45851 47204 51018 57862 63565 70402 82792 95904 98323
11259 98323 105273 120902 143545 169877 215727 294599 445702 702869 1062703 1420942 1672814
11248 1672814 1858180 1946317 1827284 1545939 1230775 945404 702508 507404 371590 293000
11238 293000 245327 203705 171424 148487 129243 112869 96155 88232 79558 70631 58133 45560
11226 45560 38747 36976 34743 30393 33786 36633 34695 31983 36362 33427 37928 33279 22319 25360
11212 25360 30083 20392 9732 6003 3573 3298 12179 11644 15073 14405 7589 8391 8546 8292 6153 973
$$ packed form
11297I73483j79939j59105j34054j06002p2384n2129m1264k5045k0650k0445p900
11286A54566j7054k2520j5725q739n657p711j1216k87o151o096m205m483K748
11273D7470j864n576j580J965J945L491J353L814O844N703O837J2390J3112K419
11259I8323O950J5629K2643K6332M5850P8872J51103K57167L59834L58239K51872
11248A672814J85366Q8137j19033k81345l15164k85371k42896j95104j35814p8590
11238B93000m7673m1622l2281k2937j9244j6374j6714p923q674q927j2498j2573
11226D5560o813j771k233m350L393K847j938k712M379k935M501m649j0960L041
11212B5360M723r691j0660l729k430k75Q881n35L429o68o816Q02J55k54k139n180
$$ plain form
11196 973 4490 5669 2827 -1536 248 1168 -7206 -6781 -7268 -423 5304 8926 13776 12794 7174 10584
11180 10584 16551 17952 25033 34705 40082 33299 27387 28210 25780 19083 11229 9658 5696 8318 15316
11165 15316 20321 19770 21343 23407 20304 14001 14470 14870 23097 30931 50393 68621 77017 96388
11151 96388 119588 145997 187309 243822 336861 509098 804681 1160871 1397453 1497628 1614236
11140 1614236 1750444 1745611 1539585 1264927 1023886 818930 626299 470384 351789 280214
11130 280214 238281 199130 161380 134131 120804 113304 103673 92695 83337 74471 64865 56631 50264
11117 50264 44578 43058 43947 37571 34558 30520 21941 21032 18088 20223 29469 34438 38382 35446 25188
11102 25188 18347 19140 24633 31522 37421 44624 43345 43686 45595 45111 41098 40010 40853 34827 26191
$$ packed form
11196I73L517J179k842m363J784R20q374M25m87O845N727L622M850r82n620L410
11180A0584N967J401P081R672N377o783n912Q23k430o697p854j571l962K622O998
11165A5316N005n51J573K064l103o303M69M00Q227P834J9462J8228Q396J9371
11151I6388K3200K6409M1312N6513R3039J72237K95583L56190K36582J00175J16608
11140A614236J36208m833k06026k74658k41041k04956j92631j55915j18595p1575
11130B80214m1933l9151l7750k7249j3327p500r631j0978r358q866r606q234o367
11117E0264n686j520Q89o376l013m038q579r09k944K135R246M969L944k936j0258
11102B5188o841P93N493O889N899P203j279L41J909m84m013j088Q43o026q636
$$ plain form
11087 26191 17870 16862 10948 9767 13155 10436 5899 10204 19435 17839 22953 26920 24408 19581
11073 19581 19328 19224 24578 25151 20260 14427 20977 24779 25785 26906 20006 16600 19641 23816 29002
11058 29002 30342 33363 40039 34601 34748 38132 36467 38406 43938 39630 31570 28531 21143 21207 19633
11043 19633 12816 7217 9135 7299 9137 10024 4824 2243 -661 -3101 -732 -5043 -9279 -7769 -8696
11028 -8696 -9355 -6659 -1326 3289 3805 -1860 -3835 -3143 2099 -604 -6862 -4946 6004 16378 8126
11013 8126 -1077 -1542 10686 9476 2688 827 5869 2173 -651 -7555 -11665 -11383 -10050 -15490 -17486
10998 -17486 -13976 -6225 -2848 -267 -184 -8941 -9009 -5796 -2166 -948 6030 3660 4778 1109 900 3010
10982 3010 6583 7329 1975 -12479 -6825 -248 -881 -4461 -855 -3112 -3805 -7701 -12218 -11034 -12706
$$ packed form
11087B6191q321j008n914j181L388k719m537M305R231j596N114L967k512m827
11073A9581k53j04N354N73m891n833O550L802J006J121o900l406L041M175N186
11058B9002J340L021O676n438J47L384j665J939N532m308q060l039p388O4j574
11043A9633o817n599J918j836J838Q87n200k581k904k440K369m311m236J510r27
11028h696o59K696N333M615N16n665j975O92N242k703o258J916J0950J0374q252
11013H126r203m65J2228j210o788j861N042l696k824o904m110K82J333n440j996
10998a7486L510P751L377K581Q3q757o8L213L630J218O978k370J118l669k09K110
10982C010L573P46n354j4454N654O577o33l580L606k257o93l896m517J184j672
$$ plain form
10967 -12706 -11531 -9651 -11351 -8712 -1829 488 -3755 -2533 -975 -3248 -3940 506 2219 713 -3684
10952 -3684 -6214 -7204 -7044 -7265 -1178 2568 -4361 -9359 -2506 -1094 -855 -599 -3127 -7169 -6775 -3143
10936 -3143 -1060 -6905 -15042 -18508 -15810 -11886 -6216 -7022 -7909 -6024 -9496 -7515 -2462 1610 3118
10921 3118 -2178 -9925 -12230 -9200 -5878 -6031 -7157 -11229 -16724 -20593 -22651 -23959 -16900 -7561 -2452
10906 -2452 -8925 -12907 -13295 -13555 -6262 1624 -849 -7319 -1094 1423 -84 -3221 -7831 -6175 -2049
10891 -2049 -4316 -9267 -16230 -13298 -11383 -12964 -11848 -8275 578 2732 5098 3661 -3257 -1251 -5845
10876 -5845 -10026 -13259 -17211 -11742 -9566 60 9143 9072 14288 28724 39405 49074 58700 65835 73980
10861 73980 84065 92713 100022 110538 130444 152503 177811 202081 237361 304523 394809 526453
$$ packed form
10967a2706J175J880j700K639O883K317m243J222J558k273o92M446J713j506m397
10952c684k530r90J60k21O087L746o929m998O853J412K39K56k528m042L94L632
10936c143K083n845q137l466K698L924N670q06q87J885l472J981N053M072J508
10921C118n296p747k305L030L322j53j126m072n495l869k058j308P059R339N109
10906b452o473l982l88k60P293P886k473o470O225K517j507l137m610J656M126
10891b049k267m951o963K932J915j581J116L573Q853K154K366j437o918K006m594
10876e845m181l233l952N469K176R626R083p1N216J4436J0681R669R626P135Q145
10861G3980J0085Q648P309J0516J9906K2059K5308K4270L5280O7162R0286J31644
$$ plain form
10849 526453 720082 1005600 1410802 1864306 2180865 2230596 2067476 1806416 1516008 1219079
10839 1219079 945967 728612 568526 454968 373153 313712 273248 243076 217180 198629
10829 198629 178310 162422 142160 132236 116139 94701 80156 69471 59319 48449 46701 49714
10817 49714 47291 46655 45595 40399 46117 50225 45224 41924 35568 26582 24677 32971 33825 34218 31712
10802 31712 32334 31584 21791 13094 13479 10127 11343 11029 9948 11679 17594 16558 13978 8708 7170
10787 7170 4622 12372 11848 13297 16518 17307 11543 16361 19285 18792 22347 28370 27641 17961 11498 9653
10771 9653 8902 3880 2315 2720 -1572 -1322 -9558 -14480 -13984 -9893 -7152 -4913 -11861 -14025 -6447 2616
10755 2616 1927 -3902 -257 -1358 4641 14660 16030 20326 18813 20332 25818 30005 28919 22525 14505
$$ packed form
10849E26453J93629K85518M05202M53504L16559M9731j63120k61060k90408k96929
10839A219079k73112k17355j60086j13558q1815n9441m0464l0172k5896j8551
10829A98629k0319j5888k0262r924j6097k1438j4545j0685j0152j0870j748L013
10817D9714k423o36j060n196N718M108n001l300o356q986j905Q294Q54L93k506
10802C1712O22p50r793q697L85l352J216l14j081J731N915j036k580n270j538
10787G170k548P750n24J449L221P89n764M818K924m93L555O023p29r680o463j845
10771I653p51n022j565M05m292K50q236m922M96M091K741K239o948k164P578R063
10755B616o89n829L645j101N999J0019J370M296j513J519N486M187j086o394q020
$$ plain form
10740 14505 16172 17653 19368 16846 16282 21381 19889 14988 11448 14650 19958 25963 21182 15158 11586
10725 11586 9065 6231 1473 2047 9480 10627 10329 7145 3403 6292 3137 3003 3631 -2108 -2872 -3619
10709 -3619 -5935 -2517 2756 3994 4462 4913 1118 -6606 -7240 -7366 -8475 -11308 -16513 -19095 -20768 -18855
10693 -18855 -20613 -19173 -21195 -15408 -5172 4204 9301 11899 17237 32979 60316 93781 135857
10680 135857 183210 224209 249906 273987 302329 310000 297106 251396 188863 123345 71717 35328
10668 35328 11863 -9051 -17897 -19005 -10124 -9767 -17516 -24872 -28930 -28140 -20416 -15279 -9729 -12524
10654 -12524 -9259 -8473 -9484 -11447 -13109 -10882 -1712 9013 5205 3474 15580 24066 32979 33922
10640 33922 33784 34102 33969 38763 47581 51742 56231 51493 45817 42134 26050 6363 -4816 -8007
$$ packed form
10740A4505J667J481J715k522n64N099j492m901l540L202N308O005m781o024l572
10725A1586k521k834m758N74P433J147k98l184l742K889l155j34O28n739p64p47
10709c619k316L418N273J238M68M51l795p724o34j26j109k833n205k582j673J913
10693a8855j758J440k022N787J0236R376N097K598N338J5742K7337L3465M2076
10680A35857M7353M0999K5697K4081K8342P671j2894m5710o2533o5518n1628l6389
10668C5328k3465k0914q846j108Q881L57p749p356m058P90P724N137N550k795
10654a2524L265P86j011j963j662K227R170J0725l808j731J2106Q486Q913R43
10640C3922j38L18j33M794Q818M161M489m738n676l683j6084j9687j1179l191
$$ plain form
10626 -8007 -13774 -24596 -38491 -47493 -54649 -55621 -51904 -35273 -16733 417 12467 30085 53636
10613 53636 66431 78975 86040 100299 110227 126082 140592 144959 140010 138081 130837 122541 111763
10600 111763 104134 94267 74314 53211 32936 10479 -8228 -22077 -37685 -52483 -67430 -77794
10588 -77794 -91995 -106743 -105863 -92171 -70267 -32338 24723 61795 81709 91529 97653 104821 121843
10575 121843 140551 157164 172735 182993 184593 173641 161263 160718 144167 128322 119307 122601
10563 122601 127139 132771 149715 176350 210247 246015 283231 320280 345648 362308 363380 334098
10551 334098 304769 288028 275176 251013 221537 199778 178965 156958 139471 128127 133926 153470
10539 153470 173689 191209 211369 228833 248033 271636 288788 300991 312139 330735 347855
$$ packed form
10626h007n767j0822j3895r002p156r72L717J6631J8540J7150J2050J7618K3551
10613E3636J2795J2544P065J4259R928J5855J4510M367m949j929p244q296j0778
10600A11763p629r867j9953k1103k0275k2457j8707j3849j5608j4798j4947j0364
10588g7794j4201j4748Q80J3692K1904L7929N7061L7072J9914R820O124P168J7022
10575A21843J8708J6613J5571J0258J600j0952j2378n45j6551j5845r015L294
10563A22601M538N632J6944K6635L3897L5768L7216L7049K5368J6660J072k9282
10551C34098k9329j6741j2852k4163k9476k1759k0813k2007j7487j1344N799J9544
10539A53470K0219J7520K0160J7464J9200K3603J7152J2203J1148J8596J7120
$$ plain form
10528 347855 366743 379344 381513 373074 365536 350049 335100 317169 295422 274420 261603 250448
10516 250448 250545 261189 277949 283880 292097 302416 322889 336263 346997 358958 371309 380056 393053
10503 393053 411567 444001 479008 517444 548396 572088 590607 609918 640118 679649 734007
10492 734007 782585 822943 853957 870384 884982 908404 922187 936858 967100 1022214 1088540
10481 1088540 1160928 1242709 1323281 1396417 1448308 1481850 1497744 1512520 1541344 1577300 1631702
10470 1631702 1683000 1724885 1782388 1854088 1944652 2069805 2216441 2366294 2508738 2643843
10460 2643843 2797100 2970023 3159710 3365480 3598770 3886775 4239300 4641175 5103320
10451 5103320 5647741 6302910 7055499 7925459 8970922 10219105 11631910 13032039 14301117
$$ packed form
10528C47855J8888J2601K169q439p538j5487j4949j7931k1747k1002j2817j1155
10516B50448R7J0644J6760N931Q217J0319K0473J3374J0734J1961J2351Q747J2997
10503C93053J8514L2434L5007L8436L0952K3692J8519J9311L0200L9531N4358
10492G34007M8578M0358L1014J6427J4598K3422J3783J4671L0242N5114O6326
10481A088540P2388Q1781Q0572P3136N1891L3542J5894J4776K8824L5956N4402
10470A631702N1298M1885N7503P1700R0564J25153J46636J49853J42444J35105
10460B643843J53257J72923J89687K05770K33290K88005L52525M01875M62145
10451E103320N44421O55169P52589Q69960J045463J248183J412805J400129J269078
$$ plain form
10442 14301117 15574992 17100083 19094784 21734385 25225739 29816230 35824856 43779736
10434 43779736 54554096 69616669 91387669 123670317 171949067 241316631 325440867
10427 325440867 393131624 413273566 390892595 347591211 297103589 243411223 190478098
10420 190478098 145666645 112422604 89038798 72527105 60598568 51779126 45072902
10413 45072902 39805220 35550028 32088370 29242268 26780623 24459731 22215073 20136828
10405 20136828 18264377 16612246 15154001 13877518 12775112 11831538 11007422 10260142
10397 10260142 9565436 8935672 8361926 7831577 7320634 6831010 6377018 5992433 5667115
10388 5667115 5368597 5081883 4794256 4522984 4268030 4036716 3819847 3627817 3439912
$$ packed form
10442A4301117J273875J525091J994701K639601L491354M590491O008626P954880
10434D3779736J0774360J5062573K1771000L2282648M8278750O9367564Q4124236
10427C25440867O7690757K0141942k2380971m3301384n0487622n3692366n2933125
10420A90478098m4811453l3244041k3383806j6511693j1928537q819442o706224
10413D5072902n267682m255192l461658k846102k461645k320892k244658k078245
10405B0136828j872451j652131j458245j276483j102406r43574q24116p47280
10397A0260142o94706o29764n73746n30349n10943m89624m53992l84585l25318
10388E667115k98518k86714k87627k71272k54954k31314k16869j92030j87905
$$ plain form
10379 3439912 3246294 3066831 2907491 2767842 2640544 2522018 2421172 2335325 2253929 2184594
10369 2184594 2125419 2066507 2000547 1935071 1866871 1793104 1722956 1659775 1603782 1559292 1524546
10358 1524546 1485628 1439427 1391497 1352725 1315899 1284581 1251405 1218505 1191699 1163569 1138449
10347 1138449 1110082 1083124 1051791 1022872 998355 981859 966302 942972 922380 911576 897937
10336 897937 882287 864139 839325 811209 788676 758741 727984 690681 657735 631156 618894
10325 618894 618095 619344 626010 629077 634682 631980 630093 618139 603625 590742 582001 586026 600855
10312 600855 611366 621762 628060 627888 622380 612660 607068 594619 584662 581242 570667 558651 539844
10299 539844 517886 504622 493548 491024 461472 427672 405524 392806 389000 396175 396459 387067 374400
$$ packed form
10379C439912j93618j79463j59340j39649j27298j18526j00846q5847q1396o9335
10369B184594n9175n8912o5960o5476o8200p3767p0148o3181n5993m4490l4746
10358A524546l8918m6201m7930l8772l6826l1318l3176l2900k6806k8130k5120
10347A138449k8367k6958l1333k8919k4517j6496j5557k3330k0592j0804j3639
10336H97937j5650j8148k4814k8116k2533k9935l0757l7303l2946k6579j2262
10325F18894p99J249O666L067N605k702j887j1954j4514j2883q741M025J4829
10312F00855J0511J0396O298j72n508r720n592j2449r957l420j0575j2016j8807
10299E39844k1958j3264j1074k524k9552l3800k2148j2718l806P175K84r392j2667
$$ plain form
10286 374400 364486 336836 305017 278915 261132 247253 245335 248581 254919 255736 257045 259599 268358
10273 268358 274318 285047 302898 319888 337842 363768 404331 436372 438437 438206 428629 420113 410148
10260 410148 396663 376916 359466 340187 313239 287067 259028 228721 210801 198533 185067
10249 185067 162986 150070 137407 135705 140432 142718 152977 168248 175605 186200 193687 197397 202567
10236 202567 212807 233200 256247 278471 288187 288048 283140 282331 280725 275982 265881 261181 250293
10223 250293 229359 211613 193850 181588 176372 174750 186211 187140 181450 177143 174619 177539 179481
10210 179481 182671 190996 196773 199910 203148 204913 208550 207944 212076 214918 219971 217732 211749 212072 209585
10195 209585 208617 203665 202474 210654 212762 210102 214952 215279 201982 184586 180264 180187 178849 174315 175117
$$ packed form
10286C74400r914k7650l1819k6102j7783j3879j918L246O338Q17J309K554Q759
10273B68358N960J0729J7851J6990J7954K5926M0563L2041K065k31r577q516r965
10260D10148j3485j9747j7450j9279k6948k6172k8039l0307j7920j2268j3466
10249A85067k2081j2916j2663j702M727K286J0259J5271P357J0595P487L710N170
10236B02567J0240K0393K3047K2224R716j39m908q09j606m743j0101m700j0888
10223B50293k0934j7746j7763j2262n216j622J1461R29n690m307k524K920J942
10210A79481L190Q325N777L137L238J765L637o06M132K842N053k239n983L23k487
10195B09585r68m952j191Q180K108k660M850L27j3297j7396m322p7j338m534Q02
$$ plain form
10180 175117 174898 176856 178021 180390 187092 186828 173413 158382 153095 151225 150086 153393 152734 161139
10166 161139 164186 155136 150229 157401 167426 171908 172581 171629 178867 174724 165800 159365 159421 159718 158767
10151 158767 162740 165252 157690 146643 132817 130954 138962 143348 140691 133464 135025 136193 131881 124281
10137 124281 123500 122706 127672 130763 128030 126318 126562 127331 123439 120108 122645 123641 117179 112883 110982
10122 110982 108645 107808 111919 114267 112621 111391 108491 102888 102429 106284 114955 128947 146339 157480
10108 157480 170168 183008 199390 203625 198560 193566 184478 182369 188785 191286 200894 214391 234449
10095 234449 273971 325676 379595 409810 408159 389286 360511 328681 303592 291401 288916 291689
10083 291689 302518 312937 323093 337855 361121 398272 445407 516626 612229 742763 921295
$$ packed form
10180A75117k19J958J165K369O702k64j3415j5031n287j870j139L307o59Q405
10166A61139L047r050m907P172J0025M482O73r52P238m143q924o435N6K97r51
10151A58767L973K512p562j1047j3826j863Q008M386k657p227J561J168m312p600
10137A24281p81p94M966L091k733j712K44P69l892l331K537R96o462m296j901
10122A10982k337q37M111K348j646j230k900n603m59L855Q671J3992J7392J1141
10108A57480J2688J2840J6382M235n065m994r088k109O416K501R608J3497K0058
10095B34449L9522N1705N3919L0215j651j8873k8775l1830k5089j2191k485K773
10083B91689J0829J0419J0156J4762K3266L7151M7135P1219R5603J30534J78532
$$ plain form
10072 921295 1171169 1527540 2006484 2615227 3286400 3856480 4155094 4127243 3834568 3385782
10062 3385782 2865059 2351106 1892192 1511249 1222793 1014697 859107 744593 660934 588385
10052 588385 527091 483675 445922 415349 383489 353230 322014 296669 271680 255691 241108
10041 241108 227367 223514 219206 210516 199567 195354 190662 186477 185981 186310 182159 178139 173323 170316
10027 170316 167565 170603 157342 154631 158238 158455 158998 166694 175347 174612 179381 195178 224276 244434
10013 244434 252805 277304 310998 353426 412455 498934 623916 807837 1094751 1501318 1950334
10002 1950334 2260838 2302252 2128479 1864798 1569714 1267850 992507 771949 611863 500586
9992 500586 425582 367042 326644 296788 268359 248255 235569 226089 224754 224385 211013 198119
$$ packed form
10072I21295K49874L56371M78944O08743O71173N70080K98614k7851k92675m48786
10062C385782n20723n13953m58914l80943k88456k08096j55590j14514q3659p2549
10052E88385o1294m3416l7753l0573l1860l0259l1216k5345k4989j5989j4583
10041B41108j3741l853m308q690j0949m213m692m185m96L29m151m020m816l007
10027A70316k751L038j3261k711L607K17N43P696Q653p35M769J5797K9098K0158
10013B44434Q371K4499L3694M2428N9029Q6479J24982J83921K86914M06567M49016
10002A950334L10504M1414j73773k63681k95084l01864k75343k20558j60086j11277
9992E00586p5004n8540m0398k9856k8429k0104j2686r480j335l69j3372j2894
$$ plain form
9980 198119 197351 191113 192610 198213 202479 216232 231609 233414 222444 207744 192470 188448 181299
9967 181299 169682 161530 157790 160289 161710 159474 165843 174493 190155 215149 262753 333579 419682
9954 419682 504636 575485 613423 598089 546171 480609 407494 341521 279296 230280 196243 171428
9942 171428 152984 139435 131135 127472 115559 104370 107762 109660 99392 93889 88307 86599 88039
9929 88039 83880 77626 79223 84878 84427 74640 70080 71071 74418 67108 70152 77168 80409 79398 72676
9914 72676 66664 67202 66048 56163 57731 60348 60576 58478 59344 60100 55947 58850 61828 65222 72223 65807
9898 65807 66417 73782 73435 66482 61380 55091 46236 40667 47574 55120 60688 59132 59161 57752 61937 66373
9882 66373 64631 62320 58582 61637 81827 93076 90261 82676 84031 83450 74927 69111 63564 62044
$$ packed form
9980A98119p68o238J497N603M266J3753J5377J805j0970j4700j5274m022p149
9967A81299j1617q152l740K499J421k236O369Q650J5662K4994M7604P0826Q6103
9954D19682Q4954P0849L7938j5334n1918o5562p3115o5973o2225m9016l4037k4815
9942A71428j8444j3549q300l663j1913j1189L392J898j0268n503n582j708J440
9929H8039m159o254J597N655m51r787m560R91L347p310L044P016L241j011o722
9914G2676o012N38j154r885J568K617K28k098Q66P56m153K903K978L394P001o416
9898F5807O10P365l47o953n102o289q855n569O907P546N568j556K9j409M185M436
9882F6373j742k311l738L055K0190J1249k815p585J355n81q523n816n547j520
$$ plain form
9868 62044 66005 65740 62201 59993 52683 50049 60007 67668 66919 73149 72924 63598 62965 67724 81073
9853 81073 98628 109392 114786 104078 93110 79604 69484 67134 60303 52415 53749 51317 51731
9840 51731 61550 67009 59876 56103 59877 50959 55733 67355 75930 80800 81192 84056 90044 105058
9826 105058 121049 135412 151751 189436 259757 389067 627924 944268 1196258 1244849 1123949
9815 1123949 948253 772507 600066 445808 327215 247682 198761 169368 147382 127161
9805 127161 109675 97318 86647 77863 71947 59922 58281 60886 61244 58846 61615 60750 54379 65121
9791 65121 59270 60498 64623 66549 60767 58007 56724 56648 52787 47287 42062 44286 47382 43541 46764
9776 46764 46989 44517 43140 36322 36802 37885 37744 36400 34878 32291 29024 31808 35710 41218 46814
$$ packed form
9868F2044L961k65l539k208p310k634R958P661p49O230k25r326o33M759J3349
9853H1073J7555J0764N394j0708j0968j3506j0120k350o831p888J334k432M14
9840E1731R819N459p133l773L774q918M774J1622Q575M870L92K864N988J5014
9826A05058J5991J4363J6339L7685P0321J29310K38857L16344K51990M8591j20900
9815A123949j75696j75746j72441j54258j18593p9533m8921k9393k1986k0221
9805A27161j7486j2357j0671q784n916j2025j641K605L58k398K769q65o371J0742
9791F5121n851J228M125J926n782k760j283p6l861n500n225K224L096l841L223
9776D6764K25k472j377o818M80J083j41j344j522k587l267K784L902N508N596
$$ plain form
9761 46814 42113 42020 41752 39404 39554 43870 36975 35429 29106 25090 31904 42523 39087 38519 37215 42405
9745 42405 43908 42774 46811 46393 43744 47939 50670 42536 37141 38919 39055 36261 31622 34773 37871
9730 37871 39424 36602 35070 32785 25686 28153 34274 36431 30220 28705 28910 28015 32507 35403 29636
9715 29636 30386 27315 24862 25030 24631 23942 26171 25756 27845 28343 27295 25254 23376 18877 23075 28747
9699 28747 26211 25883 26631 28180 29667 29986 25888 24673 20899 17731 19045 24933 25897 22104 20591 27959
9683 27959 28920 26135 26555 33811 39691 40411 43376 40529 34355 31643 29865 29253 32488 35772 42269 42013
9667 42013 32264 26508 27675 22595 22810 22594 24533 22161 22172 25539 20346 18839 18196 22674 22905 27386
9651 27386 31758 24893 27317 27961 28707 33901 39076 37914 43167 50473 53616 46073 39652 42160 43251
$$ packed form
9761D6814m701r3k68k348J50M316o895j546o323m016O814J0619l436n68j304N190
9745D2405J503j134M037m18k649M195K731q134n395J778J36k794m639L151L098
9730C7871J553k822j532k285p099K467O121K157o211j515K05q95M492K896n767
9715B9636P50l071k453J68l99o89K229m15K089M98j048k041j878m499M198N672
9699B8747k536l28P48J549J487L19m098j215l774l168J314N888R64l793j513P368
9683B7959R61k785M20P256N880P20K965k847o174k712j778o12L235L284O497k56
9667D2013r749n756J167n080K15k16J939k372J1L367n193j507o43M478K31M481
9651B7386M372o865K424O44P46N194N175j162N253P306L143p543o421K508J091
$$ plain form
9636 43251 50837 52173 44723 31930 23988 18671 23537 30172 29009 27481 36127 35097 32469 32591 34451
9621 34451 32619 25095 19645 22631 27585 27295 30013 28387 28963 29415 30897 34191 36426 39143 31610
9606 31610 30229 30171 28807 31768 31110 28759 23211 21082 18450 16421 13360 24329 30626 32168 29696
9591 29696 19402 20587 20391 18099 22663 20942 14052 14048 19167 20204 23098 20098 14468 11057 17085
9576 17085 30042 27021 20174 20937 20573 21975 25769 22546 19288 15037 19731 27439 31333 26695 23285
9561 23285 17348 20635 25818 28713 28862 30488 29772 22455 20445 18401 15217 19400 20199 20207 23183 28743
9545 28743 31194 26347 25077 25952 27876 26860 23723 25186 21158 19712 24214 23515 22092 18892 20489
9530 20489 29827 29715 30869 34052 28268 25680 29487 30613 30184 30108 28006 24677 28936 30213 24198 20359
$$ packed form
9636D3251P586J336p450j2793p942n317M866O635j163j528Q646j030k628J22J860
9621C4451j832p524n450K986M954k90K718j626N76M52J482L294K235K717p533
9606C1610j381n8j364K961o58k351n548k129k632k029l061J0969O297J542k472
9591B9696j0294J185j96k292M564j721o890mN119J037K894l000n630l411O028
9576A7085J2957l021o847P63l64J402L794l223l258m251M694P708L894m638l410
9561B3285n937L287N183K895J49J626p16p317k010k044l184M183P99QK976N560
9545B8743K451m847j270Q75J924j016l137J463m028j446M502o99j423l200J597
9530B0489R338j12J154L183n784k588L807J126m29p6k102l329M259J277o015l839
$$ plain form
9514 20359 28782 30321 23202 19504 20437 24701 29895 29420 30466 30103 28436 19986 15540 22314 31090
9499 31090 34370 36204 40190 40471 28912 16393 18102 21534 18828 14251 17726 15641 20306 23702
9485 23702 16472 16674 20324 22620 21966 14830 12404 13092 19543 21494 26202 33914 33169 36095 30595 25241
9469 25241 28964 31372 26775 25053 26903 31611 36519 38048 32701 28421 20335 20790 22362 22737 20043
9454 20043 11866 8513 17556 26913 31949 32503 33571 31031 32579 31645 31943 30830 28270 27922 25598 28364
9438 28364 27087 26762 30777 30355 29309 25238 20455 12472 13892 19287 15373 13990 15138 15591 22313
9423 22313 26601 27586 28750 30822 28626 24024 17809 14311 14103 26664 35051 36448 32449 29943 35442
9408 35442 35215 29068 24833 29631 29948 31528 33863 31399 27559 25000 21831 12649 15532 24511 33079
$$ packed form
9514B0359Q423J539p119l698R33M264N194m75J046l63j667q450m446O774Q776
9499C1090L280J834L986K81j1559j2519J709L432k706m577L475k085M665L396
9485B3702p230K02L650K296o54p136k426O88O451J951M708P712p45K926n500n354
9469B5241L723K408m597j722J850M708M908J529n347m280q086M55J572L75k694
9454B0043q177l353R043R357N036N54J068k540J548r34K98j113k560l48k324K766
9438B8364j277l25M015m22j046m071m783p983J420N395l914j383J148M53O722
9423B2313M288R85J164K072k196m602o215l498k08J2561Q387J397l999k506N499
9408C5442k27o147m235M798L17J580K335k464l840k559l169r182K883Q979Q568
$$ plain form
9393 33079 24409 23416 26796 32322 28594 27187 26646 25784 29418 30406 28512 27258 36381 31512 23490 26311
9377 26311 21719 17090 14222 10703 11628 20767 24494 18075 15806 24482 19126 16795 16955 24337 30922
9362 30922 23088 19752 29121 35091 33631 32739 27123 21823 18564 19220 15845 14875 21220 19859 23454
9347 23454 20351 16522 21969 25093 23791 18101 18647 16219 17328 23009 29803 32118 29426 34780 29432
9332 29432 20813 17736 21411 27664 23733 23240 23007 22349 19000 14885 18124 25890 20573 15863 13763
9317 13763 16839 23536 25718 29279 26834 27039 21402 21587 21652 21411 18493 23233 26665 23909 19753 17291
9301 17291 23316 29093 21593 17907 12456 11735 18656 19768 15476 17570 16958 21337 25424 22643 22265
9286 22265 21027 16895 16716 17661 19627 18732 14241 13013 18114 17568 16864 23177 28677 21735 17975 21367
$$ packed form
9393C3079q670r93L380N526l728j407n41q62L634R88j894j254R123m869q022K821
9377B6311m592m629k868l519R25R139L727o419k269Q676n356k331J60P382O585
9362C0922p834l336R369N970j460q92n616n300l259O56l375r70O345j361L595
9347B3454l103l829N447L124j302n690N46k428J109N681O794K315k692N354n348
9332B9432q619l077L675O253l931m93k33o58l349m115L239P766n317m710k100
9317A3763L076O697K182L561k445K05n637J85O5k41k918M740L432k756m156k462
9301A7291O025N777p500l686n451p21O921J112m292K094o12M379M087k781l78
9286B2265j238m132j79R45J966q95m491j228N101n46p04O313N500o942l760L392
$$ plain form
9270 21367 23659 21248 19789 19737 18472 15829 18861 21275 20007 20831 18931 25276 22391 14676 12419
9255 12419 18334 17151 21070 27142 24615 15330 16823 20946 16384 20099 29506 30585 31080 30356 28072
9240 28072 17009 14863 19155 21537 19153 23464 20057 21654 18028 15996 17570 15215 9803 6573
9226 6573 9927 8654 15054 19066 22812 24529 20898 21836 23407 27097 27528 25464 20222 12846 12561 15821
9210 15821 21153 26846 28316 23499 25290 24725 19729 21782 28754 25714 20524 21201 19779 19816 21589 15478
9194 15478 14740 27233 34185 33402 35164 33136 24468 22044 26917 32940 27635 24094 23427 26597 29307
9179 29307 35787 39319 38650 36470 35554 30333 30937 26034 30473 39525 31544 26680 26999 28800 30356 25289
9163 25289 24803 26038 25758 26775 26882 29541 31780 26707 29840 26420 21819 16712 14665 13230 17102
$$ packed form
9270B1367K292k411j459n2j265k643L032K414j268Q24j900O345k885p715k257
9255A2419N915j183L919O072k527r285J493M123m562L715R407J079M95p24k284
9240B8072j1063k146M292K382k384M311l407J597l626k032J574k355n412l230
9226F573L354j273O400M012L746J717l631R38J571L690M31k064n242p376k85L260
9210A5821N332N693J470m817J791n65m996K053O972l040n190O77j422L7J773o111
9194A5478p38J2493O952p83J762k028q668k424M873O023n305l541o67L170K710
9179B9307O480L532o69k180r16n221O04m903M439R052p981m864L19J801J556n067
9163B5289m86J235k80J017J07K659K239n073L133l420m601n107k047j435L872
$$ plain form
9148 17102 19075 18626 19787 14187 12550 18562 24805 28926 27886 26720 28950 29431 26993 30378 34179
9133 34179 36048 31367 24550 18256 8532 8116 25801 47380 52808 57996 56382 38761 19466 21383
9119 21383 38157 50020 65629 67892 61946 40468 25936 20430 17167 8507 5728 10339 18882
9106 18882 27643 25450 22666 21926 17460 17318 14126 17564 23494 20963 14850 20096 20768 23775 30972
9091 30972 35858 36370 24049 20505 27128 37105 43723 47723 47279 42216 37395 29930 28965 27943 29055
9076 29055 20507 24388 32470 30884 25017 24812 24342 22864 24809 26603 25794 21934 25651 30308 32944
9061 32944 35610 28789 18310 12790 15563 11915 12735 18818 21687 26716 30594 33237 25200 23283 27572
9046 27572 28535 26180 19453 18716 22029 25980 25641 24069 29819 36483 30010 25018 20249 19441 14482 20720
$$ packed form
9148A7102J973m49J161n600j637O012O243M121j040j166K230M81k438L385L801
9133C4179J869m681o817o294r724m16J7685K1579N428N188j614j7621j9295J917
9119B1383J6774J1863J5609K263n946k1478j4532n506l263q660k779M611Q543
9106A8882Q761k193k784p40m466j42l192L438N930k531o113N246O72L007P197
9091C0972M886N12j2321l544O623R977O618M000m44n063m821p465r65j022J112
9076B9055q548L881Q082j586n867k05m70j478J945J794q09l860L717M657K636
9061C2944K666o821j0479n520K773l648Q20O083K869N029L878K643q037j917M289
9046B7572R63k355o727p37L313L951l39j572N750O664o473m992m769q08m959O238
$$ plain form
9030 20720 26765 31992 34628 38036 30582 23173 17853 17805 19175 14847 14488 22229 24562 22873 17589
9015 17589 18473 17992 19244 27559 27288 22007 21919 24369 25303 24616 24520 27769 27207 26364 31980 28672 25961
8998 25961 30086 27894 17992 19443 25391 22606 19785 16466 15860 9695 8793 18013 23139 22877 26150
8983 26150 27282 29497 22111 22355 23352 17409 15152 18337 28066 27240 28311 22938 18368 19063 27841 29126
8967 29126 26776 25830 28189 26867 27301 27688 23754 23949 18002 18345 23036 20763 20678 18786 15771 22499
8951 22499 33870 34570 27669 22819 26499 29059 22166 17990 19506 22482 23090 23993 27702 28320 28194 22121
8935 22121 19577 17871 25292 27647 33519 32535 24707 29346 40105 44478 42665 40751 38205 35544 32322
8920 32322 31943 29611 25070 25184 27040 37132 35833 37929 36915 28953 31516 38749 41142 42038 41641
$$ packed form
9030B0720O045N227K636L408p454p409n320m8J370m328l59P741K333j689n284
9015A7589Q84m81J252Q315k71n281q8K450R34o87r6L249n62q43N616l308k711
8998B5961M125k192r902J451N948k785k821l319o06o165r02R220N126k62L273
8983B6150J132K215p386K44R97n943k257L185R729q26J071n373m570O95Q778J285
8967B9126k350r46K359j322M34L87l934J95n947L43M691k273q5j892l015O728
8951B2499J1371P00o901m850L680K560o893m176J516K976O08R03L709O18j26o073
8935B2121k544j706P421K355N872r84p828M639J0759M373j813j914k546k661l222
8920C2322l79k332m541J14J856J0092j299K096j014p962K563P233K393Q96l97
$$ plain form
8905 41641 42661 38831 39753 33779 33243 37336 34711 29633 30178 34431 32594 33920 35992 39777 46417
8890 46417 43196 39470 38230 37659 40071 42724 36687 36093 40199 42936 48170 42817 45200 47530 41487
8875 41487 32203 32879 33293 30383 33316 32287 38727 42858 47357 48288 43487 35340 33554 35998 34859
8860 34859 35106 40094 43336 44580 46828 46611 36748 38789 41640 40204 43593 42218 35166 36019 40553
8845 40553 46959 45859 47547 53777 56551 56891 55001 53604 51643 49061 52114 58989 58382 55454 56146
8830 56146 59512 66205 67686 71095 70038 66849 64797 60770 54843 56346 54401 52702 58791 69563
8816 69563 65937 61678 57453 60562 65001 67604 63889 62384 62523 66110 64088 67885 63897 69182 66388
8801 66388 67107 72845 73871 62978 58757 60061 59253 64604 67729 68842 73037 76175 82654 85586 80035
$$ packed form
8905D1641J020l830R22n974n36M093k625n078N45M253j837J326K072L785O640
8890D6417l221l726j240n71K412K653o037n94M106K737N234n353K383K330o043
8875D1487r284O76M14k910K933j029O440M131M499R31m801q147j786K444j139
8860C4859K47M988L242J244K248k17r863K041K851j436L389j375p052Q53M534
8845D0553O406j100J688O230K774L40j890j397j961k582L053O875o07k928O92
8830E6146L366O693J481L409j057l189k052m027n927J503j945j699O089J0772
8816F9563l626m259m225L109M439K603l715j505J39L587k022L797l988N285k794
8801F6388P19N738J026j0893m221J304q08N351L125J113M195L138O479K932n551
$$ plain form
8786 80035 73989 73266 78566 86501 80055 82960 85261 79292 76745 81229 80522 81512 81805 83698 89025 91535
8770 91535 95445 96566 96727 91568 93259 102345 113579 114335 108701 112764 116501 121322 122794 119933 126748
8755 126748 124983 122020 112362 107887 116020 114973 115977 111193 105947 106171 112800 111854 105907 102796 100643
8740 100643 104351 106717 104835 102849 108010 105683 102734 107463 106952 108318 104429 104797 106402 104495 97155
8725 97155 95663 96981 102093 106000 106586 103467 101765 109905 109919 111265 112924 111588 107782 118199 128536
8710 128536 124817 121784 125463 129018 126455 122810 114116 122095 140838 149992 147432 143204 144987 145680
8696 145680 147432 154287 160574 161385 162741 164193 164227 158486 154692 157864 162706 170377 170194 171536 176995
8681 176995 175504 169592 167403 164479 165308 163599 159193 168221 176216 177774 176248 174876 179974 182208 191578
$$ packed form
8786H0035o046p23N300P935o446K905K301n969k547M484p07R90K93J893N327K510
8770I1535L910J121J61n159J691R086J1234P56n634M063L737M821J472k861O815
8755A26748j765k963r658m475Q133j047J004m784n246K24O629r46n947l111k153
8740A00643L708K366j882j986N161k327k949M729n11J366l889L68J605j907p340
8725I7155j492J318N112L907N86l119j702Q140J4J346J659j336l806J0417J0337
8710A28536l719l033L679L555k563l645q694P979J8743R154k560m228J783O93
8696A45680J752O855O287Q11J356J452L4n741l794L172M842P671j83J342N459
8681A76995j491n912k189k924Q29j709m406R028P995J558j526j372N098K234R370
$$ plain form
8666 191578 190908 180591 178469 186633 199425 217255 225410 230770 230179 225020 229995 240152 241356 242800
8652 242800 246691 256262 253475 251222 262774 271737 274585 283007 292675 302754 308712 309671 310794 309927
8638 309927 314358 323893 333085 338501 344383 344278 344255 352890 358515 362492 372988 384393 391076 397507 412235
8623 412235 430050 459411 515489 600996 697401 725009 701851 666709 629512 598844 567118 542485
8611 542485 533812 527981 523804 529595 532300 536082 534849 540257 547844 557276 569845 579811 587375 600889
8597 600889 616804 628397 636382 650461 672080 692204 714151 734555 751738 770229 789171 808394
8585 808394 830888 861840 899361 928487 954330 995156 1037762 1090229 1172230 1288955 1466909
8574 1466909 1695833 1799358 1779034 1728425 1689151 1653489 1608150 1578467 1583779 1609659 1650379
$$ packed form
8666A91578o70j0317k122Q164J2792J7830Q155N360n91n159M975J0157J204J444
8652B42800L891R571k787k253J1552Q963K848Q422R668J0079N958R59J123q67
8638C09927M431R535R192N416N882j05k3Q635N625L977J0496J1405O683O431J4728
8623D12235J7815K9361N6078Q5507R6405K7608k3158l5142l7197l0668l1726k4633
8611E42485q673n831m177N791K705L782j233N408P587R432J2569R966P564J3514
8597F00889J5915J1593P985J4079K1619K0124K1947K0404J7183J8491J8942J9223
8585H08394K2494L0952L7521K9126K5843M0826M2606N2467Q2001J16725J77954
8574A466909K28924J03525k0324n0609l9274l5662m5339k9683N312K5880M0720
$$ plain form
8563 1650379 1693553 1736074 1781660 1843282 1914544 1987850 2062337 2135888 2223392 2315254 2406430
8552 2406430 2499988 2606447 2722274 2847973 2978512 3120862 3275947 3447309 3628440 3827260
8542 3827260 4038541 4275154 4526061 4793990 5092738 5408001 5756543 6142595 6570133 7040741
8532 7040741 7560532 8142297 8808976 9580552 10389017 11203381 12082486 13068841 14169789
8523 14169789 15405719 16781409 18330408 20081571 22015406 24144244 26472989 28992339
8515 28992339 31672860 34471026 37320488 40121263 42738579 45013440 46796111 47931665
8507 47931665 48342822 47991007 46925991 45243720 43079317 40594562 37945123 35245714
8499 35245714 32601229 30069628 27688794 25484432 23461681 21608066 19919613 18395767
$$ packed form
8563A650379M3174M2521M5586O1622P1262P3306P4487P3551Q7504R1862R1176
8552B406430R3558J06459J15827J25699J30539J42350J55085J71362J81131J98820
8542C827260K11281K36613K50907K67929K98748L15263L48542L86052M27538M70608
8532G040741N19791N81765O66679P71576Q08465Q14364Q79105R86355J100948
8523A4169789J235930J375690J548999J751163J933835K128838K328745K519350
8515B8992339K680521K798166K849462K800775K617316K274861J782671J135554
8507D7931665M11157l51815j065016j682271k164403k484755k649439k699409
8499C5245714k644485k531601k380834k204362k022751j853615j688453j523846
$$ plain form
8491 18395767 17016937 15763255 14623065 13577911 12634781 11779041 10997031 10282302 9633836
8482 9633836 9036162 8492468 7990608 7526953 7102882 6711320 6346460 6004685 5689615 5392592
8472 5392592 5115201 4866604 4630669 4419114 4219658 4022205 3837798 3673193 3513905 3357837
8462 3357837 3214425 3080288 2952309 2833311 2725532 2617004 2520807 2426119 2343949 2260924
8452 2260924 2185133 2117105 2049784 1986919 1909702 1844910 1781610 1720483 1657876 1605339 1560598
8441 1560598 1516835 1475373 1424627 1376667 1335374 1301131 1271901 1241207 1210204 1173003 1136600
8430 1136600 1114055 1091640 1070408 1055025 1029038 1005043 978744 950475 927783 908987 887922
8419 887922 867578 843681 830994 811010 796317 783835 763577 744650 724723 705951 687449 672494
$$ packed form
8491A8395767j378830j253682j140190j045154r43130q55740p82010p14729o48466
8482I633836n97674n43694n01860m63655m24071l91562l64860l41775l15070k97023
8472E392592k77391k48597k35935k11555j99456j97453j84407j64605j59288j56068
8462C357837j43412j34137j27979j18998j07779j08528r6197r4688q2170q3025
8452B260924p5791o8028o7321o2865p7217o4792o3300o1127o2607n2537m4741
8441A560598m3763m1462n0746m7960m1293l4243k9230l0694l1003l7201l6403
8430A136600k2545k2415k1232j5383k5987k3995k6299k8269k2692j8796k1065
8419H87922k0344k3897j2687j9984j4693j2482k0258j8927j9927j8772j8502j4955
$$ plain form
8407 672494 670527 661655 644744 629513 622633 621794 610440 594648 581380 569774 564486 556892 550761
8394 550761 544092 541038 533790 522381 516882 514966 507341 492936 479469 476011 476785 469365 464061 453903
8380 453903 444358 435486 433476 425612 411421 406430 399880 390016 381715 377270 372523 368475 368439 357531
8366 357531 356228 350676 335747 331957 324227 315831 310846 311076 306911 303098 309363 306846 306392 302750 303357
8351 303357 309628 304806 301423 298838 287159 280676 273703 271448 268807 276138 278056 278989 272791 265608
8337 265608 260308 257866 254735 247909 242686 238837 227643 226099 223121 216536 209650 203239 203526 207101
8323 207101 205717 206249 208459 204274 201319 193548 196979 205356 207399 207167 204243 206582 205819 199116 191825
8308 191825 197814 199085 195256 196981 192427 192101 190531 184690 177627 175952 177433 179918 183992 182558 181811
$$ packed form
8407F72494j967q872j6911j5231o880q39j1354j5792j3268j1606n288p594o131
8394E50761o669l054p248j1409n499j916p625j4405j3467l458P74p420n304j0158
8380D53903r545q872k010p864j4191m991o550r864q301m445m747m048l6j0908
8366C57531j303n552j4929l790p730q396m985K30m165l813O265k517m54l642O07
8351C03357O271m822l383k585j1679o483o973k255k641P331J918R33o198p183
8337B65608n300k442l131o826n223l849j1194j544k978o585o886o411K87L575
8323B07101j384N32K210m185k955p771L431Q377K043k32k924K339p63o703p291
8308A91825N989J271l829J725m554l26j570n841p063j675J481K485M074j434p47
$$ plain form
8293 181811 184491 178917 173739 177675 176592 175878 169526 172796 173812 172064 164123 162596 167787 174771 178527
8278 178527 180918 178878 177650 178607 183600 193418 209126 220625 238926 269059 323134 408428 530244
8265 530244 664729 740500 719238 647952 565766 495155 416574 348974 298656 262610 233577
8254 233577 209806 195737 188150 182846 180284 170191 166537 168980 162057 157158 157768 158486 158233 158908 154847
8239 154847 147224 144707 142984 142059 148408 156143 160291 164762 175218 186961 199478 223070 257648
8226 257648 309672 396431 527564 656370 701837 660965 589010 512809 431403 354395 291294
8215 291294 246460 207342 183417 176949 169384 160978 147281 138263 133588 127299 123290 118135 118859 120305
8201 120305 113822 107190 100946 96425 91418 98756 101170 98393 99797 102136 96962 92663 98818 104955
$$ packed form
8293A81811K680n574n178L936j083p14o352L270J016j748p941j527N191O984L756
8278A78527K391k040j228R57M993R818J5708J1499J8301L0133N4075Q5294J21816
8265E30244J34485P5771k1262p1286q2186p0611p8581o7600n0318l6046k9033
8254B33577k3771j4069p587n304k562j0093l654K443o923m899O10P18k53O75m061
8239A54847p623k517j723r25O349P735M148M471J0456J1743J2517K3592L4578
8226B57648N2024Q6759J31133J28806M5467m0872p1955p6201q1406p7008o3101
8215B91294m4834l9118k3925o468p565q406j3697r018m675o289m009n155P24J446
8201A20305o483o632o244m521n007P338K414k777J404K339n174m299O155O137
$$ plain form
8187 104955 104078 99863 96785 97511 100520 93330 86845 85489 79672 79008 87520 86243 81135 82016 86035
8172 86035 85397 86010 85344 88812 88811 89597 86382 70400 68449 75635 76254 77380 79544 79638 85333 82872 77504
8155 77504 71710 65162 64249 63229 66472 77294 83672 81590 74261 75012 81121 81076 75086 68539 70621
8140 70621 72348 67135 67500 64250 64902 65493 66360 67092 66313 76431 75954 73663 73011 70640 68070 69719
8124 69719 66888 68570 68833 61810 64745 69876 67740 66916 65660 66258 68800 67907 67668 70978 77885 82493
8108 82493 83904 87899 91033 94504 89608 92341 95998 88502 88558 82120 74977 71338 61753 53101 51618
8093 51618 49346 56677 61977 56192 47952 48855 52769 51710 56531 62914 66003 63238 64072 68347 62482
8078 62482 60015 56428 53174 58075 62328 60280 55866 55109 56697 60625 68534 72771 77471 75414 79969
$$ packed form
8187A04955q77m215l078P26L009p190o485j356n817o64Q512j277n108Q81M019
8172H6035o38O13o66L468jP86l215j5982j951P186O19J126K164R4N695k461n368
8155G7504n794o548r13j020L243J0822O378k082p329P51O109m5n990o547K082
8140G0621J727n213L65l250O52N91Q67P32p79J0118m77k291o52k371k570J649
8124F9719k831J682K63p023K935N131k136q24j256N98K542q93k39L310O907M608
8108H2493J411L995L134L471m896K733L657p496N6o438p143l639r585q652j483
8093E1618k272P331N300n785q240R03L914j059M821O383L089k765Q34M275n865
8078F2482k467l587l254M901M253k048m414p57J588L928P909M237M700k057M555
$$ plain form
8063 79969 76492 75818 79197 84990 93899 99546 106141 106194 110092 107729 101734 90421 86851 74837 66552
8048 66552 62285 64647 66698 65448 68668 67125 61505 58117 48282 49597 53073 48420 54191 53161 51417
8033 51417 50709 46655 49111 54861 54498 57733 55598 47136 46533 44535 48246 56041 54244 58092 59388
8018 59388 55330 59398 65523 62622 59549 59659 64388 68194 71181 65834 61979 67007 72407 68501 61638
8003 61638 62483 61620 55688 49417 52145 59228 55772 44176 39937 42669 45275 40820 44684 47605 37215
7988 37215 36512 35471 33328 31710 36076 37613 33058 32674 34706 34655 36153 42029 40727 40417 38354 38471
7972 38471 33337 31598 28336 32980 36631 27483 22707 34489 42035 41628 45105 48322 41508 35877 34590
7957 34590 35386 40716 43264 48807 47144 41068 39201 36898 33859 37992 34350 30890 40193 47959 49910
$$ packed form
8063G9969l477o74L379N793Q909N647O595N3L898k363n995j1313l570j2014q285
8048F6552m267K362K051j250L220j543n620l388r835J315L476m653N771j030j744
8033E1417p08m054K456N750l63L235k135q462o03j998L711P795j797L848J296
8018E9388m058M068O125k901l073J10M729L806K987n347l855N028N400l906o863
8003F1638Q45q63n932o271K728P083l456j1596m239K732K606m455L864K921j0390
7988C7215p03j041k143j618M366J537m555l84K032n1J498N876j302l10k063J17
7972C8471n134j739l262M644L651r148m776J1782P546m07L477L217o814n631j287
7957C4590P96N330K548N543j663o076j867k303l039M133l642l460R303P766J951
$$ plain form
7942 49910 48905 48157 45732 40890 29331 30040 39042 44987 42277 43974 45262 46909 48880 45656 43373
7927 43373 47829 50953 50275 47321 43018 40188 40557 37069 37793 35731 33632 37656 43420 41966 41016 35935
7911 35935 31578 32276 36974 34596 25826 25297 29925 34920 35894 35563 33388 25984 21183 20814 24685 30448
7895 30448 33070 31436 31829 26184 29394 33724 32130 36884 34650 31991 39262 36049 28115 23170 19006
7880 19006 19034 13794 12955 18842 21746 19857 20292 26831 33470 38717 37382 32428 32187 34714 29771 30505
7864 30505 29702 28880 31662 36914 39567 31053 19457 20627 29066 30299 33249 35709 32799 36472 41036
7849 41036 33455 27727 22500 17182 21411 23352 26095 26790 25223 25471 27559 25128 21725 16633 16628 16228
7833 16228 15476 14493 17127 17672 19159 17932 15071 18171 20323 19784 23690 22694 21588 23342 28735 30175
$$ packed form
7942D9910j005p48k425m842j1559P09R002N945k710J697J288J647J971l224k283
7927D3373M456L124o78k954m303k830L69l488P24k062k099M024N764j454r50n081
7911C5935m357O98M698k378q770n29M628M995R74l31k175p404m801l69L871N763
7895C0448K622j634L93n645L210M330j594M754k234k659P271l213p934m945m164
7880A9006K8n240q39N887K904j889M35O539O639N247j335m954k41K527m943P34
7864C0505q03q22K782N252K653q514j1596J170Q439J233K950K460k910L673M564
7849D1036p581n728n227n318M229J941K743O95j567K48K088k431l403n092nm00
7833A6228p52r83K634N45J487j227k861L100K152n39L906r96j106J754N393J440
$$ plain form
7817 30175 25730 22792 27561 29495 26295 17779 17468 16741 16275 16462 19204 21415 23107 25041 25377 22738
7801 22738 19545 20396 20930 24105 27646 33144 32221 29813 23113 22951 17830 20451 26451 29450 29746 28494
7785 28494 26970 22731 20341 25277 23917 20868 20127 20187 17575 16694 14100 6925 7146 12330 9823 9675
7769 9675 13910 20695 19715 23491 24894 23770 22811 20478 17303 10183 9769 14311 18839 20439 22354 23817
7753 23817 22423 23923 20600 21568 19467 18028 14335 11188 10908 19000 26207 24014 19837 15559 12164
7738 12164 15517 18374 24037 26207 18704 15678 14852 23750 23806 19370 22059 22790 21545 18697 12126 14999
7722 14999 18245 18735 16579 8293 10084 12233 6458 4706 12871 15114 13843 15900 16615 14206 17297
7707 17297 19518 19126 18017 22112 20639 13569 8767 9081 13591 18652 17297 16345 13352 12347 14649
$$ packed form
7817C0175m445k938M769J934l200q516l11p27m66J87K742K211J692J934L36k639
7801B2738l193Q51N34L175L541N498r23k408o700j62n121K621O000K999K96j252
7785B8494j524m239k390M936j360l049p41O0k612q81k594p175K21N184k507j48
7769I675M235O785r80L776J403j124r59k333l175p120m14M542M528J600J915J463
7753B3817j394J500l323R68k101j439l693l147k80Q092P207k193m177m278l395
7738A2164L353K857N663K170p503l026q26Q898N6m436K689P31j245k848o571K873
7722A4999L246M90k156q286J791K149n775j752Q165K243j271K057P15k409L091
7707A7297K221l92j109M095j473p070m802L14M510N061j355r52k993j005K302
$$ plain form
7692 14649 11161 11185 11090 15116 9429 321 4345 16814 20908 18059 12821 12187 13771 10826 13034 14314
7676 14314 10277 2193 5062 11128 10613 6769 8743 14457 11525 3452 -599 1857 9154 13546 13567
7661 13567 6277 15758 19278 13448 9589 9650 19199 21634 14679 12608 10020 4858 4831 9383 12145 9633
7645 9633 11074 11704 11382 16711 21049 23363 17954 19052 20284 22844 21650 16760 18072 24492 23685 17199
7629 17199 15234 19801 22448 19908 13859 16955 22945 21193 18545 17720 13815 9061 7445 5727 6908
7614 6908 7002 3474 3085 11754 18560 20575 12663 7382 11025 16839 11382 8032 5629 1410 5112 234
7598 234 -2339 6900 13009 16079 14408 10845 16037 17999 16174 17866 16868 12138 8882 8490 5062 9528
7582 9528 10199 9055 5932 3924 6985 4454 4239 5890 13973 12932 14544 14400 11217 10883 13960 16618
$$ packed form
7692A4649l488K4r5M026n687r108M024J2469M094k849n238o34J584k945K208J280
7676A4314m037q084K869O066n15l844J974N714k932q073m051K456P297M392K1
7661A3567p290R481L520n830l859O1R549K435o955k071k588n162k7M552K762k512
7645I633J441O30l22N329M338K314n409J098J232K560j194m890J312O420q07o486
7629A7199j965M567K647k540o049L096N990j752k648q25l905m754j616j718J181
7614F908R4l528l89Q669O806K015p912n281L643N814n457l350k403m219L702m878
7598B34k573R239O109L070j671l563N192J962j825J692r98m730l256l92l428M466
7582I528O71j144l123k008L061k531k15J651Q083j041J612j44l183l34L077K658
$$ plain form
7566 16618 19034 9862 1369 -4264 -706 4665 5937 3513 6741 7002 8711 11845 13999 14578 12395
7551 12395 9244 9172 4197 3678 2764 243 -6828 -6450 -1682 1842 7633 2546 -5161 -3383 -1524 9233
7535 9233 14528 12003 7936 15130 25080 25035 20114 16818 15806 16598 10641 9918 9299 12547 15380 7594
7519 7594 4397 8313 10657 14031 12497 5756 -2411 6 3585 4933 6433 5100 4665 2595 6042
7504 6042 5325 3761 2796 4058 3131 695 8894 15033 6906 2200 4335 15901 18512 13508 9726
7489 9726 7101 6419 9600 7765 13680 12002 9658 6117 2103 310 4366 8859 10031 12886 17553
7474 17553 18463 15955 16266 13036 5084 -1069 1471 5763 8596 8031 6182 3747 6686 9448 11731
7459 11731 11244 3170 2803 -318 -1392 4838 4578 10772 17737 17959 10778 10658 6433 6676 12208 11571
$$ packed form
7566A6618K416r172q493n633L558N371J272k424L228K61J709L134K154N79k183
7551A2395l151p2m975n19r14k521p071L78M768L524N791n087p707J778J859J0757
7535I233N295k525m067P194R950m5m921l296j012P92n957p23o19L248K833p786
7519G594l197L916K344L374j534o741q167K417L579J348J500j333m35k070L447
7504F042p17j564r65J262r27k436Q199O139q127m706K135J1566K611n004l782
7489I726k625o82L181j835N915j678k344l541m014j793M056M493J172K855M667
7474A7553R10k508L11l230p952o153K540M292K833n65j849k435K939K762K283
7459A1731m87q074l67l121j074O230k60O194O965K22p181j20m225K43N532o37
$$ plain form
7443 11571 10456 12280 11411 9437 4269 6851 8648 8149 7759 7552 14575 23401 15184 7124 3827 6237
7427 6237 11854 13564 6790 528 -2835 -223 32 -207 2122 -2237 711 2848 1138 6928 8838
7412 8838 8458 7591 9794 8128 2848 12520 22237 17795 17022 14683 8704 13809 17196 12241 6363 2845
7396 2845 -470 4271 11522 8955 7722 7547 2090 -1980 -3021 -1293 1779 5718 6867 7090 4640
7381 4640 1077 617 5239 7586 6867 9974 14903 17109 13967 9658 9053 12767 15962 16010 14524 15477
7365 15477 11050 -264 -1385 4694 8062 6794 -2782 -8176 -6890 -6592 -10384 -2908 9853 18024
7351 18024 13960 5254 1737 772 -5443 28 5589 4573 2597 1062 2490 7309 8208 5844 6242
7336 6242 5221 4070 4133 4517 10897 7773 1072 -5101 -9023 -6233 -7857 -4669 818 1352 4015 4763
$$ packed form
7443A1571j115J824q69j974n168K582J797m99l90k07P023Q826q217q060l297K410
7427F237N617J710o774o262l363K612K55k39K329m359K948K137j710N790J910
7412H838l80q67K203j666n280R672R717m442p73k339n979N105L387m955n878l518
7396B845l315M741P251k567j233j75n457m070j041J728L072L939J149K23k450
7381D640l563m60M622K347p19L107M929K206l142m309o05L714L195M8j486R53
7365A5477m427j1314j121O079L368j268r576n394J286K98l792P476J2761Q171
7351A8024m064q706l517r65o215N471N561j016j976j535J428M819Q99k364L98
7336F242j021j151O3L84O380l124o701o173l922K790j624L188N487N34K663P48
$$ plain form
7320 4763 10025 9771 5809 7099 11979 11053 7271 3497 4272 4987 2209 577 -1160 -2198 -8978 -11819
7304 -11819 -5078 -1688 -220 -4389 -4541 -2765 3677 8790 5698 10686 7099 7856 11068 6545 5735
7289 5735 13508 11324 10826 12081 8840 7882 960 5761 10461 5737 6149 9213 12862 4437 -1673 -6203
7273 -6203 -7149 -2958 1430 2203 2994 7186 8172 4276 3991 6343 8934 8825 3383 7145 10546 3963
7257 3963 941 6719 10310 3102 2519 5156 3579 -3601 -5027 1629 2643 2207 7379 6961 6162 3756
7241 3756 4470 10483 11701 15979 12843 10102 4192 -4791 -78 4206 377 99 1102 -4033 -7685
7226 -7685 -9076 -6054 -1078 2467 1368 -3521 -2661 5997 11249 5027 4370 4389 10849 10751 10926 8978 -2252
7209 -2252 -3869 2247 6044 7233 8221 4310 -945 -977 70 -311 380 -1876 -5611 -3234 -3171 -3343 -5581
$$ packed form
7320D763N262k54l962J290M880r26l782l774P75P15k778j632j737j038o780k841
7304a1819O741L390J468m169j52J776O442N113l092M988l587P57L212m523q10
7289E735P773k184m98J255l241r58o922M801M700m724M12L064L649q425o110m530
7273f203r46M191M388P73P91M192R86l896k85K352K591j09n442L762L401o583
7257C963l022N778L591p208n83K637j577p180j426O656J014m36N172m18p99k406
7241C756P14O013J218M278l136k741n910q983M713M284l829k78J003n135l652
7226g685j391L022M976L545j099m889Q60Q658N252o222o57J9O460r8J75j948j1230
7209b252j617O116L797J189R88l911n255l2J047l81O91k256l735K377O3j72k238
$$ plain form
7192 -5581 -1395 -686 3617 3463 -1761 -6254 -7560 -8789 -17378 -11752 -3178 669 959 4186 9091 13326
7176 13326 16225 11858 14864 17998 12832 7808 10461 11743 11086 7568 2946 6346 7913 7573 1859
7161 1859 -5134 -2105 4824 8714 2705 -7224 -4528 3114 919 2450 -1269 -7791 -7151 -2131 6125
7146 6125 16249 17600 16049 15096 6521 5971 9451 7695 2856 -701 -6123 -16937 -14091 -5873 -2629
7131 -2629 -5612 -2408 110 2034 2793 1957 6970 17131 13351 4491 3040 4589 1871 -2575 -1395
7116 -1395 5891 2756 4147 6604 4792 1522 1927 6045 12870 11471 7883 2895 5858 7309 3871
7101 3871 5337 -2326 -6808 -958 -336 -1671 2291 2698 4157 -3526 -35 5023 1520 3454 4182 6858
7085 6858 10261 6287 4212 1682 2734 -6417 -4305 5360 9821 9493 8604 2870 -7131 -9296 -5100
$$ packed form
7192e581M186P09M303j54n224m493j306j229q589N626Q574L847K90L227M905M235
7176A3326K899m367L006L134n166n024K653J282o57l518m622L400J567l40n714
7161A859o993L029O929L890o009r929K696P642k195J531l719o522O40N020Q256
7146F125J0124J351j551r53q575n50L480j756m839l557n422j0814K846Q218L244
7131b629k983L204K518J924P59q36N013J0161l780q860j451J549k718m446J180
7116a395P286l135J391K457j812l270M05M118O825j399l588m988K963J451l438
7101C871J466p663m482N850O22j335L962M07J459p683L491N058l503J934P28K676
7085F858L403l974k075k530J052r151K112R665M461l28q89n734j0001k165M196
$$ plain form
7070 -5100 1670 -642 -3231 -10405 -10939 -4185 -3440 -5519 -6770 -8927 -9854 -8441 -3427 -583 6410 6181
7054 6181 8038 10342 5772 7054 8904 8319 5834 6066 3640 4501 15733 18833 12495 6490 3554
7039 3554 -1613 949 7449 6247 -1312 -4433 -2806 1247 3849 4899 5807 3509 1804 4565 8516
7024 8516 6589 2505 9105 12890 7135 4074 9249 10805 5923 -1563 -2600 -2278 -1143 4522 11484
7009 11484 9920 8928 10242 5582 3799 5438 8927 4396 600 -1869 -366 -764 -1261 6540 5716 5714
6993 5714 430 -3316 -3606 -4013 -1755 -1109 -8 2208 2708 3254 2462 8521 8367 5397 9493 15917 11609
6976 11609 7886 9115 8459 8111 8645 9890 8014 -1988 1894 4471 4570 3371 3956 1145 7887 9699
6960 9699 11346 10279 4628 1941 1873 -1206 3395 7067 2621 -5674 -6305 -1551 2218 -136 5000 1193
$$ packed form
7070e100O770k312k589p174n34O754P45k079j251k157r27J413N014K844O993k29
7054F181J857K304m570J282J850n85k485K32k426Q61J1232L100o338o005k936
7039C554n167K562O500j202p559l121J627M053K602J050R08k298j705K761L951
7024H516j927m084O600L785n755l061N175J556m882p486j037L22J135N665O962
7009A1484j564r92J314m660j783J639L489m531l796k469J503l98m97P801q24k
6993E714n284l746k90m07K258O46J101K216N00N46p92O059j54k970M096O424m308
6976A1609l723J229o56l48N34J245j876j0002L882K577R9j199N85k811O742J812
6960I699J647j067n651k687o8l079M601L672m446q295o31M754L769k354N136l807
$$ plain form
6944 1193 2170 240 2255 4805 683 -5026 -4309 4349 9096 5175 1523 -1209 775 546 3743 1439
6928 1439 -178 -3803 1579 -296 -758 3630 -713 -7208 -13154 -10003 -3665 -2143 5421 10066 7399
6913 7399 2578 -1825 -1221 3749 4670 1573 1164 -306 3272 2780 4670 12550 6576 3986 4684 7630
6897 7630 1100 -4492 -2740 4764 76 -481 1661 -3320 -9814 -4734 -3992 -770 -471 -632 -1844 5511
6881 5511 4732 251 1605 -275 -4745 2549 12025 7217 2171 -9846 -10400 -1675 2612 2463 2771 716
6865 716 2325 6173 3271 7853 15758 18033 12745 5774 5812 6629 6190 6466 13893 16249 10376 9804 7964
6848 7964 4178 4698 2778 6161 2777 600 -2175 -4824 -6102 -5228 -1056 747 -2271 2099 7580
6833 7580 13669 12240 12788 14425 13864 6880 6616 1759 -3399 -3831 -12002 -22577 -25943 -18582 -3616
$$ packed form
6944A193R77j930K015K550m122n709P17Q658M747l921l652k732J984k29L197k304
6928A439j617l625N382j875m62M388m343o495n946L151O338J522P564M645k667
6913G399m821m403O04M970R21l097m09j470L578m92J890P880n974k590O98K946
6897G630o530n592J752P504m688n57K142m981o494N080P42L222K99j61j212P355
6881E511p79m481J354j880m470P294R476m808n046j2017n54Q725M287j49L08k055
6865G16J609L848k902M582P905K275n288o971L8Q17m39K76P427K356n873n72j840
6848G964l786N20j920L383l384k177k775k649j278Q74M172J803l018M370N481
6833G580O089j429N48J637n61o984k64m857n158m32q171j0575l366P361J4966
$$ plain form
6818 -3616 11199 28824 42068 52379 50156 42046 29921 13776 1351 -8284 -13508 -15264 -13166
6805 -13166 -4815 -1184 457 -3356 -4966 -4754 -7684 -14194 -21444 -20943 -9751 -8761 -5724 599 699
6790 699 1460 9185 6731 -5264 -8070 -8654 -9303 -6497 -3723 -2106 -8012 -5852 943 4025 313 4264
6774 4264 -466 -8985 -6339 267 -3332 -6316 -6502 3749 -7 -2684 -5090 -5826 9500 13819 9504
6759 9504 8460 14394 13424 4112 3544 -1491 -4864 -7407 -2520 -931 -5675 -5458 -1477 -527 -6145 -8966
6743 -8966 663 9 4197 6257 8794 11011 12635 8398 5508 3947 -1793 -2185 3316 -601 -2488
6728 -2488 -6809 -7515 -2595 2524 4825 7810 5019 362 6617 4268 2161 7367 7138 5274 1094
6713 1094 -6840 -6207 410 4126 9575 15102 14057 5288 2593 -4283 -5497 -2775 -2221 -4089 -682
$$ packed form
6818c616J4815J7625J3244J0311k223q110j2125j6145j2425r635n224j756K098
6805a3166Q351L631J641l813j610K12k930o510p250N01J1192R90L037O323J00
6790F99P61P725k454j1995k806n84o49K806K774J617n906K160O795L082l712L951
6774D264m730q519K646O606l599k984j86J0251l756k677k406p36J5326M319m315
6759I504j044N934r70r312n68n035l373k543M887J589m744K17L981R50n618k821
6743h966R629o54M188K060K537K217J624m237k890j561n740l92N501l917j887
6728b488m321p06M920N119K301K985k791m657O255k349k107N206k29j864m180
6713A094p934O33O617L716N449N527j045q769k695o876j214K722N54j868L407
$$ plain form
6698 -682 8127 5180 4224 10318 14006 8788 2561 -2011 -4637 -5843 -4533 -1082 4753 2456 104
6683 104 -3797 -5651 -2815 -1600 -2221 -2887 -5255 -878 1342 5766 8498 6966 -563 -3787 -9708 -14821
6667 -14821 -7726 -1216 -3890 -6809 -7043 -3210 857 8346 8329 2440 -2308 -6316 -13761 -15848 -15411 -9566
6651 -9566 -5171 5854 4589 -1774 -3131 6685 11573 7917 4760 2186 2857 -2299 27 830 -2316
6636 -2316 2443 1744 -489 239 198 -2928 691 -2872 -5724 -5731 -5209 -9635 -11456 -7953 -5740 -6283 -2178
6619 -2178 2956 8013 2392 -1469 -7460 -9015 -12204 -9282 -6170 -6195 4368 7207 -1961 -7448 -7796
6604 -7796 -4702 -2425 6003 3597 -3380 -4699 -2545 -1981 -2314 -2045 4591 6137 0 -7149 -8236 -6557
6588 -6557 -7430 -6117 -6258 -12761 -16004 -16206 -8198 -487 959 2572 2865 1118 2774 -614 2521 -1761
$$ packed form
6698f82Q809k947r56O094L688n218o227m572k626j206J310L451N835k297k352
6683A04l901j854K836J215o21o66k368M377K220M424K732j532p529l224n921n113
6667a4821P095O510k674k919k34L833M067P489j7n889m748m008p445k087M37N845
6651i566M395J1025j265o363j357R816M888l656l157k574O71n156K326Q03l146
6636b316M759o99k233P28m1l126L619l563k852pN22m426j821L503K213n43M105
6619b178N134N057n621l861n991j555l189K922L112k5J0563K839r168n487l48
6604g796L094K277Q428k406o977j319K154N64l33K69O636J546o137p149j087J679
6588f557q73J313j41o503l243k02Q008P711J446J613K93j747J656l388L135m282
$$ plain form
6572 -1761 -2547 2164 1604 -2503 -6675 -8895 -6263 -8588 -10672 137 5767 -2185 -316 9303 14051
6557 14051 5997 1856 6000 4807 63 -2536 -5756 994 -1990 -5905 -6078 -6478 -3338 -1845 5656
6542 5656 8466 3940 4169 -3884 -7535 -3568 688 235 -4163 -6624 -6382 -3425 3409 2707 2113 5634
6526 5634 4186 37 -4414 -5415 -3339 -694 1700 4131 7644 11392 9148 10148 9470 5442 3647
6511 3647 3308 3646 4177 2999 3958 -1643 -3299 -1252 7738 6274 1813 -469 -403 -4949 1396 -2272
6495 -2272 -10842 -4508 387 648 1017 3512 7528 2924 4076 2002 -755 -6855 -10137 -3903 4131
6480 4131 4821 4396 7656 320 -3381 -342 -532 -1757 -4029 -2883 4197 4050 1321 2678 -1793 1881
6464 1881 603 -3712 -3683 -696 -5160 -3372 349 988 -6741 -9802 -9946 -11806 -13077 -9137 -5918 -4590
$$ packed form
6572a761p86M711n60m107m172k220K632k325k084J0809N630p952J869R619M748
6557A4051q054m141M144j193m744k599l220O750k984l915j73m00L140J493P501
6542E656K810m526K29q053l651L967M256m53m398k461K42K957O834p02n94L521
6526E634j448m149m451j001K076K645K394K431L513L748k244J000o78m028j795
6511C647l39L38N31j178R59n601j656K047Q990j464m461k282O6m546O345l668
6495b272q570O334M895K61L69K495M016m604J152k074k757o100l282O234Q034
6480D131O90m25L260p336l701L039j90j225k272J146P080j47k729J357m471L674
6464A881j278m315K9K987m464J788L721O39p729l061j44j860j271L940L219J328
$$ plain form
6448 -4590 -7272 -3200 2400 2156 -247 1950 9379 5656 -767 -315 -78 1921 5112 4582 632 -1821
6432 -1821 -6514 -9790 -3045 -3774 -9491 -5607 1324 5533 6348 7213 -2637 -6276 -10687 -14452 -12943 -9209
6416 -9209 -15026 -14917 -9503 -5587 934 4402 6661 5809 1097 1434 3550 3287 3607 4110 6440 6985 3798
6399 3798 -4351 -7836 -11614 -2647 -136 -4349 -4312 -2212 -1139 -4695 -5544 -2071 4482 -2269 -9937 -8936
6383 -8936 -7503 -7157 -6479 -2630 2942 4735 4139 7212 1527 -1231 -2393 -4613 -2190 -1146 2905 11293
6367 11293 9225 2888 2398 -3086 -1948 730 526 3250 4064 8318 -965 -7319 -5886 -990 -433 -1064
6351 -1064 -2995 -5765 -3231 -3087 -7369 -3597 1985 -2171 243 -6337 -9007 -4696 -2192 -7524 -14183
6336 -14183 -13598 -7670 -8163 -4057 -3002 -2091 2498 -2169 -4640 -5373 1896 5842 2918 -131 -7930 -15083
$$ packed form
6448d590k682M072N600k44k403K197P429l723o423M52K37J999L191n30l950k453
6432a821m693l276O745p29n717L884O931M209Q15Q65r850l639m411l765J509L734
6416i209n817J09N414L916O521L468K259q52m712L37K116k63L20N03K330N45l187
6399C798q149l485l778Q967K511m213L7K100J073l556q49L473O553o751p668J001
6383h936J433L46O78L849N572J793n96L073n685k758j162k220K423J044M051Q388
6367A1293k068o337m90n484J138K678k04K724Q14M254r283o354J433M896N57o31
6351a064j931k770K534J44m282L772N582m156K414o580k670M311K504n332o659
6336a4183N85N928m93M106J055R11M589m667k471p33P269L946k924l049p799p153
$$ plain form
6320 -15083 -10245 -5916 542 -561 -1383 -2278 -5456 -1742 -2687 -7593 -5095 -3233 -2625 1335 -3474 -1363
6304 -1363 -3951 -6327 -1198 -2580 -12008 -15721 -16781 -14618 -13670 -11117 -10316 -8765 -8397 -9224 -144 -1211
6288 -1211 -5734 -5678 -834 -5568 -6941 -8390 -3469 2219 1160 3337 2454 -2745 -3414 -2616 2065 25
6272 25 -2951 -4651 8194 8833 6173 10859 11007 1139 -9759 -19993 -14234 -8920 -6400 -6779 1675
6257 1675 1715 -12600 -15809 -10904 -2733 71 -1172 4426 16339 13670 8842 4980 6530 5833 3345
6242 3345 2525 4040 4565 -2995 -9538 -14066 -10650 -2629 7927 8272 -479 -7946 -1721 564 6610
6227 6610 6585 5008 -559 -7169 -5566 -2601 -1268 -4493 -2356 991 -3907 -1536 8031 5796 -722
6212 -722 -2690 -2063 -5486 -2654 -6311 -4698 -9148 -7139 -184 6328 4889 -682 -1840 -939 1738 8497
$$ packed form
6320a5083M838M329O458j103q22q95l178L714r45m906K498J862O08L960m809K111
6304a363k588k376N129j382r428l713j060K163R48K553Q01J551L68q27R080j067
6288a211m523N6M844m734j373j449M921N688j059K177q83n199o69P98M681k040
6272B5k976j700J2845O39k660M686J48r868j0898j0234N759N314K520l79Q454
6257A675M0j4315l209M905Q171K804j243N598J1913k669m828l862J550o97k488
6242C345q20J515N25p560o543m528L416Q021J0556L45q751p467O225K285O046
6227F610k5j577n567o610J603K965J333l225K137L347m898K371R567k235o518
6212g22j968O27l423K832l657J613m450K009O955O512j439n571j158R01K677O759
$$ plain form
6196 8497 9337 2636 -5627 -10146 -7433 -2126 -1764 -4165 515 3144 -1164 -3056 -5342 -5054 -3134 -3529
6180 -3529 -2319 -2632 -8131 -8235 -6945 -5237 -1238 -433 -5224 -9003 -3380 -1092 3272 8870 8497 9210
6164 9210 2111 -295 2723 6118 1506 1118 454 -4685 -3821 -8479 -15366 -14759 -11896 -14679 -19535 -15262
6148 -15262 -14415 -12303 -6774 -5858 -6003 -4522 -3002 -2595 -5511 -4879 -6804 -9789 -6162 -3435 -4966 -9678
6132 -9678 -5296 4360 7389 9817 7111 3496 353 -817 -994 -6427 -5900 528 -1562 -8306 -7719 -12302
6116 -12302 -12217 -16587 -17934 -10713 -10296 -10191 -7568 1157 3638 -1738 -10602 -7309 -5237 1625 -1762 -15482
6100 -15482 -19225 -14040 -7100 1662 5131 3308 6811 3861 -4355 -3595 -2840 -3044 -5434 459 -1314
6085 -1314 66 -1924 -14430 -10052 -94 1896 3366 4637 8759 7871 -1902 1208 2851 4133 2635
$$ packed form
6196H497Q40o701q263m519K713N307L62k401M680K629m308j892k286K88J920l95
6180c529J210l13n499j04J290J708L999Q05m791l779N623K288M364N598l73P13
6164I210p099k406L018L395m612l88o64n139Q64m658o887O07K863k783m856M273
6148a5262Q47K112N529R16j45J481J520M07k916O32j925k985L627K727j531m712
6132i678M382R656L029K428k706l615l143j170j77n433N27O428k090o744N87m583
6116a2302Q5m370j347P221M17J05K623Q725K481n376q864L293K072O862l387j3720
6100a5482l743N185O940Q762L469j823L503k950q216P60P55k04k390N893j773
6085a314J380j990j2506M378R958J990J470J271M122q88r773L110J643J282j498
$$ plain form
6070 2635 -1424 1934 -3007 -9722 -10837 -12832 -11747 -12836 -4283 4397 2386 971 1625 2551 699
6055 699 1925 -5458 -7129 -3837 -2364 -152 3845 1358 2787 4177 4027 3095 3228 1786 3258 -2180
6039 -2180 -3533 -5548 -6443 2418 88 2393 2221 748 -826 -2875 -1414 3100 3515 -145 -5132 -6590
6023 -6590 -3005 7016 9752 3845 6772 7481 8756 13342 11031 10001 7754 7733 7426 3837 6981 5376
6007 5376 3559 -3077 -4089 -4207 -6134 -3707 -7100 -4477 -6878 1665 3075 2478 751 -4118 -6496
5992 -6496 -6524 -10332 -10006 -8172 -8783 -12272 -9925 -6351 -4147 185 8105 6311 6829 7812 4051 5243
5976 5243 4513 -2225 -4732 -3208 -2317 -5611 -8455 2440 12162 10229 4773 5365 -144 -2888 -651
5961 -651 -1160 -4244 -1190 -1658 833 2128 4847 -489 -2170 -4410 -63 2314 1888 -1360 -570 -3267
$$ packed form
6070B635m059L358m941o715j115j995J085j089Q553Q680k011j415O54R26j852
6055F99J226p383j671L292J473K212L997k487J429J390j50r32J33j442J472n438
6039b180j353k015q95Q861k330K305j72j473j574k049J461M514M15l660m987j458
6023f590L585J0021K736n907K927P09J275M586k311j030k247k1l07l589L144j605
6007E376j817o636j012j18j927K427l393K623k401Q543J410n97j727m869k378
5992f496k8l808L26J834o11l489K347L574K204M332P920j794N18R83l761J192
5976E243p30o738k507J524Q91l294k844J0895R722j933n456N92n509k744K237
5961f51n09l084L054m68K491J295K719n336j681k240M347K377m26l248P90k697
$$ plain form
5945 -3267 -4750 -8082 -11836 -13827 -14203 -2728 216 -4205 -4294 -9057 -9333 -6308 3674 4478 2897 -4000
5929 -4000 -3054 -5485 -8314 -7546 -4125 2981 2254 2921 4836 1891 677 -5609 -10101 -5029 -683 -5756
5913 -5756 -11848 -6618 -5945 -3759 -3049 2187 2603 -5679 -3557 -5997 -9165 -10373 -11196 -12594 -1246 5618
5897 5618 3907 6263 7035 3981 -1340 -1025 -592 5593 4803 -137 -2098 665 -1725 279 769 3640
5881 3640 9245 10028 10352 8851 1511 -2374 212 -2439 -4772 -7872 -9078 -8678 -9527 -6954 -5162 -6194
5865 -6194 -179 5960 8277 2690 -1578 -1559 -533 -619 -978 -4616 -4038 -2508 -1568 -5779 -5783 -9971 -7270
5848 -7270 -6822 -3732 -6120 -11277 -10481 -8514 -8397 1891 67 -845 -284 2269 -5606 -11502 -12347 -14554
5832 -14554 -13335 -16895 -15215 -15887 -18875 -14786 -6387 -4651 -2108 -3605 -1329 1237 5462 8438 4415
$$ packed form
5945c267j483l332l754j991l76J1475K944m421q9m763k76L025R982Q04j581o897
5929d000R46k431k829P68L421P106p27O67J915k945j214o286m492N072M346n073
5913e756o092N230O73K186P10N236M16q282K122k440l168j208q23j398J1348O864
5897E618j711K356P72l054n321L15M33O185p90m940j961K763k390K004M90K871
5881C640N605P83L24j501p340l885K586k651k333l100j206M00q49K573J792j032
5865f194O015O139K317n587m268J9J026q6l59l638N78J530R40m211mm188K701
5848g270M48L090k388n157P96J967J17J0288j824r12N61K553p875n896q45k207
5832a4554J219l560J680o72k988M089Q399J736K543j497K276K566M225K976m023
$$ plain form
5817 4415 -2993 -3542 -8464 -6454 -10429 -9464 -7017 -9997 -7884 -9331 -7298 -7712 341 2397 2815 4873
5801 4873 5965 127 -5341 -1412 2489 1624 -5121 -6228 -5790 -5878 -4904 -8661 -8266 -10719 -10376 -2001 -4277
5784 -4277 -9216 -9489 -6097 -4277 -2132 1433 5030 2746 -136 3221 -3502 336 6902 5488 3968
5769 3968 7556 11734 3927 3424 1543 -2939 2507 772 2025 2025 -614 4481 1158 -1726 2268 -4051
5753 -4051 -4602 -5856 -2179 2346 -2383 -7100 -6795 -4290 -4619 -4380 -1061 -1798 -1721 -6775 -6163 -7681 -8554
5736 -8554 -9787 -15086 -9335 -3354 1247 -1239 -239 6360 6840 4141 -660 2759 13919 18951 17514
5721 17514 10520 8234 6706 2574 -4795 -12218 -9328 -4419 -911 -75 -1473 -6089 -10131 -4013 437
5706 437 -2666 -574 4243 5917 1180 -6797 -8862 -11626 -6360 -6517 -6076 -2195 4307 5228 -1978 -6635
$$ packed form
5817D415p408n49m922K010l975R65K447k980K113j447K033m14Q053K056M18K058
5801D873J092n838n468L929L901q65o745j107M38q8R74l757L95k453L43Q375k276
5784d277m939k73L392J820K145L565L597k284k882L357o723L838O566j414j520
5769C968L588M178p807n03j881m482N446j735J253%k639N095l323k884L994o319
5753d051n51j254L677M525m729m717L05K505l29K39L319p37P7n054O12j518q73
5736h554j233n299N751N981M601k486J000O599M80k699m801L419J1160N032j437
5721A7514o994k286j528m132p369p423K890M909L508Q36j398m616m042O118M450
5706D37l103K092M817J674m737p977k065k764N266j57M41L881O502R21p206m657
$$ plain form
5690 -6635 -12098 -8826 4222 4133 -5934 -4529 -2775 -6329 -11925 -10018 -4432 -2866 454 1559 7437
5675 7437 7428 4771 5547 -2119 -8034 -12985 -15046 -16527 -11238 1069 -531 -2873 -130 2446 -439 552
5659 552 1162 -902 -3631 -503 -3245 -9959 -6783 -2192 -7606 -10409 -11132 -7737 2964 7443 -361
5644 -361 -2782 -4575 -9825 -7092 511 7791 6640 4001 -2160 -4004 251 309 -1544 7113 4003 -5642
5628 -5642 -8252 -14082 -8735 -10904 -13160 -11929 -6644 82 -1234 -3617 -7848 -6927 -5552 -5237 -2979
5613 -2979 -1175 -6911 -6978 -2439 -408 -2478 -13245 -17482 -18427 -17053 -12070 -9955 -5308 -3145 919
5598 919 2552 1950 3062 -890 -6411 -13253 -9389 670 1720 569 2328 -375 -3117 1517 5794
5583 5794 2122 -3871 -2384 3468 6125 2747 8605 2009 -8927 -4217 -4026 -6002 -4967 -3719 -3373
$$ packed form
5690f635n463L272J3048q9j0067J405J754l554n596J907N586J566L320J105N878
5675G437rk657P76p666n915m951k061j481N289J2307j600k342K743K576k885R91
5659E52O10k064k729L128k742o714L176M591n414k803p23L395J0701M479p804
5644c61k421j793n250K733P603P280j151k639o161j844M255N8j853Q657l110r645
5628e642k610n830N347k169k256J231N285O726j316k383m231R21J375L15K258
5613b979J804n736o7M539K031k070j0767m237r45J374M983K115M647K163M064
5598I19J633o02J112l952n521o842L864J0059J050j151J759k703k742M634M277
5583E794l672n993J487N852K657l378N858o596j0936M710J91j976J035J248L46
$$ plain form
5568 -3373 -4310 -5838 -1779 -2534 -7282 -11578 -14047 -19504 -15975 -13045 -11921 -6653 -6045 -8084 -9239 -12309
5552 -12309 -12823 -9027 -5444 -663 3203 807 -3926 -8132 -7310 -5052 -3895 -4127 680 5924 2214
5537 2214 1104 -483 1499 -3012 -8154 -9512 -13398 -14458 -15229 -11792 -8443 -3473 -4645 -11296 -12839
5522 -12839 -8157 -4181 575 -3928 -1484 -3491 -2455 1599 3158 6047 3638 4854 11290 12700 13528
5507 13528 11003 9416 5982 2531 436 -3971 -6319 -6048 -5566 -4585 -6183 -13955 -17809 -8540 -577
5492 -577 -841 1853 -692 -4818 -5484 -6735 -1093 -760 -1660 2574 2758 -1658 -9435 -7655 955 603 -800
5475 -800 1961 4150 5803 5919 7196 53 -839 3901 7166 2722 6651 10304 17690 13719 7679 2275
5459 2275 4604 7210 7546 -61 4531 2044 2070 2780 -343 -4411 -9395 -9155 -4435 -1739 -9438 -12092
$$ packed form
5568c373r37j528M059p55m748m296k469n457L529K930J124N268O08k039j155l070
5552a2309n14L796L583M781L866k396m733m206Q22K258J157k32M807N244l710
5537B214j110j587J982m511n142j358l886j060p71L437L349M970j172o651j543
5522a2839M682L976M756m503K444k007J036M054J559K889k409J216O436J410Q28
5507A3528k525j587l434l451k095m407k348K71M82R81j598p772l854R269P963
5492e77k64K694k545m126o66j251N642L33r00M234J84m416p777J780Q610l52j403
5475h00K761K189J653J16J277p143q92M740L265m444L929L653P386l971o040n404
5459B275K329K606L36p607M592k487K6P10l123m068m984K40M720K696p699k654
$$ plain form
5443 -12092 -9022 -1339 2665 6737 5693 2145 1158 6809 7273 6630 1754 -5626 -5723 -4166 -1008 -5360
5427 -5360 -3765 -1189 -5541 -8746 -784 8221 4923 3980 1718 -6383 -15094 -14269 -16444 -14829 -11881
5412 -11881 -3651 5486 3605 142 -3174 -2543 -6550 -6019 -1901 4796 5744 5265 3530 142 -1317 -1150
5396 -1150 -3838 -2722 -3216 -9125 -10687 -6655 -4812 -10433 -18283 -8644 -4161 -3281 -6396 -12312 -15457
5381 -15457 -13480 -4451 -4534 -2281 -6710 -12046 573 8567 7905 1234 -9520 -16065 -13199 -10862 -4399
5366 -4399 -8752 -13779 -11484 -13297 -20007 -17065 -12920 -8192 -1819 8044 8865 234 -362 -832 -3117 -7395
5350 -7395 -11531 -8289 -7250 -8981 -10796 -9652 1315 7785 2110 -4302 -8347 -15373 -20675 -22895 -26826
5335 -26826 -25647 -15354 -5220 -3401 -5679 -6091 1015 -1440 -2561 -2825 84 -1326 -6609 -10747 -15332
$$ packed form
5443a2092L070P683M004M072j044l548r87N651M64o43m876p380r7J557L158m352
5427e360J595K576m352l205P962R005l298r43k262q101q711Q25k175J615K948
5412a1881Q230R137j881l463l316O31m007N31M118O697R48m79j735l388j459J67
5396a150k688J116m94n909j562M032J843n621p850R639M483Q80l115n916l145
5381a5457J977R029q3K253m429n336J2619P994o62o671j0754o545K866K337O463
5366d399m353n027K295j813o710K942M145M728O373R863Q21q631n96m70k285m278
5350g395m136L242J039j731j815J144J0967O470n675o412m045p026n302k220l931
5335b6826J179J0293J0134J819k278m12P106k455j121k64K909j410n283m138m585
$$ plain form
5320 -15332 -11354 -6217 -2573 -6941 -6768 -5196 -1938 -3247 -3168 582 -52 249 -7307 -9281 -10856 -12092
5304 -12092 -7413 -1412 4289 -3898 -9812 -8098 -5142 -1583 -2164 -2794 -11003 -10697 -10512 -6564 -2364 3148
5288 3148 2935 -3350 -5861 -3710 -6061 -8458 -9759 -3723 -802 2440 773 -1937 -3881 -1560 685
5273 685 -3318 -9781 -5988 -516 3744 -3581 -17223 -15907 -8885 -4280 -1198 -7384 -13031 -16130 -18849
5258 -18849 -16100 -5666 -493 -292 6281 3662 -1196 2907 -511 -7778 -7107 -6901 -6681 -12314 -13493
5243 -13493 -7019 -9421 -7683 -1370 -1034 -953 -3796 -5821 -7478 -6563 -5520 -5651 -4133 2796 -1425 -8742
5227 -8742 -14676 -12208 -11450 -9165 -2321 2398 4301 -2132 -12609 -20869 -14202 -9955 -12057 -17383 -17223
5212 -17223 -12356 -13596 -11539 -8963 -4478 -3230 -117 -425 -4518 -6110 -8296 -13245 -8209 -9613 -11640
$$ packed form
5320a5332L978N137L644m368J73J572L258j309P9L750o34L01p556j974j575j236
5304a2092M679O001N701q187n914J714K956L559n81o30q209L06J85L948M200N512
5288C148k13o285k511K151k351k397j301O036K921L242j667k710j944K321K245
5273F85m003o463L793N472M260p325j3642J316P022M605L082o186n647l099k719
5258a8849K749J0434N173K01O573k619m858M103l418p267O71K06K20n633j179
5243a3493O474k402J738O313L36Q1k843k025j657R15J043j31J518O929m221p317
5227h742n934K468P58K285O844M719J903o433j0477q260O667M247k102n326J60
5212a7223M867j240K057K576M485J248L113l08m093j592k186m949N036j404k027
$$ plain form
5197 -11640 -4280 -396 -2810 543 5573 9183 7144 9270 10428 10064 2295 -1020 -1431 -1423 -4235 -5261
5181 -5261 42 713 -6392 -7412 1466 -6217 -8091 -3633 -11201 -15647 -8677 2437 3533 2879 -2013
5166 -2013 -7032 -2981 827 3271 5636 4626 -1911 -8169 -8054 -7351 -3539 -2087 -4023 -7298 -4728
5151 -4728 1455 3874 6368 6681 595 -5368 -3749 1490 6901 6257 2917 4139 1660 6643 -369
5136 -369 -4031 344 -5626 -10511 -11954 -6066 -6885 -8556 -10634 -6747 -2034 1389 1746 -774 -3941 -1772
5120 -1772 85 3641 -5888 -9036 -13858 -15801 -13748 -9387 -6909 -5679 2180 6856 979 -3254 -5080
5105 -5080 -4103 3141 6155 5670 836 -2087 -6427 -6834 -12359 -16739 -17440 -10981 -4233 -4563 -8631 -5116
5089 -5116 1474 2019 6100 6936 166 6672 -2013 -5676 -4398 -6033 -6990 -3006 -2122 -12345 -14692 -11832
$$ packed form
5197a1640P360L884k414L353N030L610k039K126J158l64p769l315m11Qk812j026
5181e261N303O71p105j020Q878p683j874M458p568m446O970J1114J096o54m892
5166b013n019M051L808K444K365j010o537o258J15P03L812J452j936l275K570
5151d728O183K419K494L13o086n963J619N239N411o44l340J222k479M983p012
5136c69l662M375n970m885j443N888q19j671k078L887M713L423L57k520l167K169
5120a772J857L556r529l148m822j943K053M361K478J230P859M676n877m233j826
5105e080R77P244L014m85m834k923m340m07n525m380p01O459O748l30m068L515
5089e116O590N45M081Q36o770O506q685l663J278j635r57L984Q84j0223k347K860
$$ plain form
5073 -11832 -7478 -3578 -9617 -17665 -21046 -25687 -18508 -17947 -11924 -9644 -9023 -10401 -10866 -13635 -11912
5058 -11912 -10085 -9925 -5653 -9132 -10843 -7849 -10093 -13503 -8860 -5707 -7704 -4972 -2456 -449 -3052
5043 -3052 -5634 -4489 -8146 -13067 -7912 -141 2324 -987 -3476 777 3054 96 1159 2194 -4423
5028 -4423 -6995 -7864 -4034 -5834 -4763 -2553 -2364 -291 -1590 -1089 -2756 -8191 -10093 -11283 -13754 -7913
5012 -7913 3 -3342 -8241 -9547 -9649 -10094 -8361 -8998 -4954 -3975 1604 2726 1965 532 -6150 -1958
4996 -1958 -1664 -70 -1507 -6564 -13127 -9566 -3285 -2722 -7433 -5118 -4198 -7640 -5762 -7306 -7993 -3997
4980 -3997 -9499 -15922 -16289 -16023 -11744 -11504 -11989 -9343 -7346 -9666 -9236 -5077 -2116 -6630 -7006 -4963
4964 -4963 -9061 -12366 -12800 -5429 -1482 3740 4689 -5753 -7063 -12576 -12428 -4720 7039 5884 689
$$ packed form
5073a1832M354L900o039q048l381m641P179N61O023K280O21j378m65k769J723
5058a1912J827J60M272l479j711K994k244l410M643L153j997K732K516K007k603
5043c052k582J145l657m921N155P771K465l311k489M253K277k958J063J035o617
5028d423k572q69L830j800J071K210J89K073j299N01j667n435j902j190k471N841
5012g913P916l345m899j306j02m45J733o37M044R79N579J122p61j433o682M192
4996a958K94J594j437n057o563L561O281N63m711K315R20l442J878j544o87L996
4980c997n502o423l67K66M279K40m85K646J997k320M30M159K961m514l76K043
4964d963m098l305m34P371L947N222R49j0442j310n513J48P708J1759j155n195
$$ plain form
4949 689 2856 4950 5483 -3729 -8649 -3596 -3671 -5804 -2342 -3802 -7851 -10154 -9093 -5872 -7838 -6153
4933 -6153 -173 -6290 -9511 -5920 -6414 -10047 -1600 3372 12333 7151 -1434 -946 588 -1492 -3167
4918 -3167 -4017 -3995 5709 11729 11516 8172 -3149 -9445 -11245 -2348 -4199 -9806 -12659 -8829 -4082 -8524
4902 -8524 -17395 -14127 -8254 -6452 -4068 -2803 1427 -893 -9848 -7039 -1425 -3888 -5650 -15592 -22115
4887 -22115 -33028 -35086 -22339 5771 20890 30251 38224 33987 11384 -12236 -16111 -21034 -27274
4874 -27274 -31557 -23981 -13919 1459 5806 -1736 -4467 -4007 -12204 -10140 -5500 -5992 -6838 -4866 -4791
4859 -4791 -8204 -9272 -6827 -5814 -1600 5463 3461 -1212 3081 4755 5294 4569 -2309 -5137 -2813
4844 -2813 -9596 -6165 161 -2699 -4739 -6442 -5025 -4269 -3758 -3909 -1146 1204 487 -3315 1235 6266
$$ packed form
4949F89K167K094N33r212m920N053p5k133L462j460m049k303J061L221j966J685
4933f153N980o117l221L591m94l633Q447M972Q961n182q585M88J534k080j675
4918c167q50K2R704O020k13l344j1321o296j800Q897j851n607k853L830M747m442
4902h524q871L268N873J802K384J265M230k320q955K809N614k463j762r942o523
4887b2115j0913k058J2747K8110J5119R361P973m237k2603k3620l875m923o240
4874b7274m283P576J0062J5378M347p542k731M60q197K064M640m92q46J972P5
4859d791l413j068K445J013M214P063k002m673M293J674N39p25o878k828K324
4844b813o783L431O326k860k040j703J417P56N11j51K763K350p17l802M550N031
$$ plain form
4828 6266 457 -2345 -4408 -10350 -10456 -7992 -8295 -4534 -6288 -11916 -12190 -17592 -17166 -12543 -11237 -8365
4812 -8365 -5411 -3733 1085 3060 2159 6404 4832 3830 -1815 -2341 1038 -3776 -2690 3701 1312
4797 1312 -1005 2035 3588 4498 7477 7475 2011 -4243 -645 2496 5369 1642 -904 -3087 -5558 -7677
4781 -7677 -6333 -1013 2859 1387 3542 7154 5504 2616 3897 4357 3618 2678 1830 -3946 -12364 -10478
4765 -10478 -1175 1158 1072 -3480 -10187 -9904 -5247 -4470 -10078 -9568 -337 -2943 -2855 1803 -3166 -6340
4749 -6340 -1277 -3066 -5356 -2259 -529 2513 3034 4401 -1453 -11349 -19449 -17252 -8243 -7759 -8377 -9514
4733 -9514 -15514 -15893 -7552 -7341 -9096 -7889 -2729 -3650 -11111 -16154 -16972 -12573 -12790 -7435 -8879 -8156
4717 -8156 -5048 -3658 -6702 -2004 -4495 -10396 -8772 -10299 -11312 -13195 -17297 -19718 -14582 -13511 -12233
$$ packed form
4828F266n809k802k063n942j06K464l03L761j754n628k74n402M26M623J306K872
4812h365K954J678M818J975r01M245j572j002n645n26L379m814J086O391k389
4797A312k317L040J553R10K979kn464o254L598L141K873l727k546k183k471k119
4781g677J344N320L872j472K155L612j650k888J281M60p39r40q48n776q418J886
4765a0478R303K333q6m552o707K83M657P77n608N10R231k606Q8M658m969l174
4749f340N063j789k290L097J730L042N21J367n854r896q100K197R009M84o18j137
4733i514o000l79Q341K11j755J207N160r21p461n043q18M399k17N355j444P23
4717h156L108J390l044M698k491n901J624j527j013j883m102k421N136J071J278
$$ plain form
4702 -12233 -8061 -4814 -5850 5057 1183 -8753 -14448 -10205 -303 2192 -3642 -12480 -15124 -7232
4688 -7232 776 1636 2006 -603 -6518 -13042 -9204 1386 -3478 2155 4317 -340 -564 -3089 -1267
4673 -1267 -6150 -1432 6470 -2262 -4451 -1883 -8876 -13310 -15135 -14044 -6455 -2034 -9909 -14391 -5474
4658 -5474 -2538 1361 -493 3736 2296 -1899 -6831 -4663 -3200 -6182 -4144 -3305 2225 -399 -406 -3192
4642 -3192 -7942 -13753 -13883 -8156 -8356 -2377 -3815 -4285 -4716 -2990 3484 3879 -553 -5173 -5574 -4229
4626 -4229 -1481 -5706 -9095 -7959 -7084 429 -4196 -4061 -4796 -8622 -9693 -12030 -7061 -4622 -5787 -3850
4610 -3850 -5693 -7841 -824 91 -6302 606 6442 2292 -2605 -687 297 -903 -1049 2551 3807 7964
4594 7964 238 -443 1363 -7332 -12921 -9568 -6737 -10441 -10357 -11227 -9073 -2837 1017 3425 2478 -2156
$$ packed form
4702a2233M172L247j036J0907l874r936n695M243R902K495n834q838k644P892
4688g232Q008Q60L70k609n915o524L838J0590m864N633K162m657k24k525J822
4673a267m883M718P902q732k189K568o993m434j825J091P589M421p875m482Q917
4658e474K936L899j854M229j440m195m932K168J463k982K038Q39N530k624pk786
4642c192m750n811j30N727k00N979j438m70m31J726O474L95m432m620m01J345
4626d229K748m225l389J136Q75P513m625J35p35l826j071k337M969K439j165J937
4610c850j843k148P017R15o393O908N836m150m897J918R84j200j46L600J256M157
4594G964p726o81J806q695n589L353K831l704Q4q70K154O236L854K408r47m634
$$ plain form
4578 -2156 -9199 -11508 -5848 -3949 -3878 -7248 -3328 3560 5537 -5815 -10526 -8402 -7355 -8094 -12899
4563 -12899 -13194 -12833 -10973 -6601 1000 -1325 -8671 -10410 -8864 -1523 -8429 -5226 1135 53 -3537
4548 -3537 -3254 -6669 -4730 -8912 -14618 -18080 -13275 -9606 -1995 -667 -7497 -10496 -10085 -13374 -14923
4533 -14923 -9945 -6201 -4434 -837 -1560 -5325 -13270 -14985 -16021 -11103 -4078 -2754 2737 6641 451
4518 451 -3409 4327 6286 4418 4326 1333 -1799 -4622 -7460 -16140 -19069 -8834 -626 4449 5647
4503 5647 5361 2114 1932 1917 -436 -2846 815 -3213 -9785 -14481 -16814 -12572 -12278 -7334 253 -51
4487 -51 1235 3668 4276 -1182 -431 4452 487 2425 -2064 -2287 -8255 -9945 -4207 -7788 -13173 -15738
4471 -15738 -13377 -12269 -11487 -11881 -11029 -6475 4790 1163 -1400 3296 -1599 -1768 -1411 -2048 -3987 -1108
$$ packed form
4578b156p043k309N660J899P1l370L920O888J977j1352m711K124J047p39m805
4563a2899k95L61J860M372P601k325p346j739J546P341o906L203O361j082l590
4548c537K83l415J939m182n706l462M805L669P611J328o830k999M11l289j549
4533a4923M978L744J767L597p23l765p945j715j036M918P025J324N491L904o190
4518D51l860P736J959j868r2k993l132k823k838q680k929J0235Q208N075J198
4503E647k86l247j82j5k353k410L661m028o572m696k333M242K94M944P587l04
4487e1J286K433O08n458P51M883l965J938m489k23n968j690N738l581n385k565
4471a5738K361J108P82l94Q52M554J1265l627k563M696m895j69L57o37j939K879
$$ plain form
4455 -1108 1651 -6003 -3780 -2481 2733 6184 426 221 -1295 -4546 -9189 -8712 -4902 312 9031
4440 9031 9139 9653 15038 9663 752 1526 104 -2365 -5140 -6717 1459 -4832 -16135 -23619 -11530
4425 -11530 -8158 -9600 -7739 -4065 -3245 -5406 -7020 -6930 -4459 -2590 -9550 -11648 -9221 -2572 4232
4410 4232 -2038 -2402 -2584 -2165 6073 12918 12576 6443 -972 -5421 -7663 -8927 -7211 -2864 -4842 -5710
4394 -5710 -7324 -12431 -7138 -9385 -5754 549 1932 -2155 -2625 -4574 -5929 -6810 -13206 -15958 -17396
4379 -17396 -9161 -4878 -3690 -8701 -13962 -9270 -905 6175 12316 10368 5185 -3937 -8244 -5820 -8164
4364 -8164 -12391 -11874 -12439 -15886 -11986 -7210 -7287 -13688 -17300 -11116 -11716 -8771 -2683 -5039 -4879 -2645
4348 -2645 2137 5358 5741 5325 7679 7053 13392 11581 -704 -4387 2001 -210 -2489 255 1378
$$ packed form
4455a108K759p654K223J299N214L451n758k05j516l251m643M77L810N214Q719
4440I031J08N14N385n375q911P74j422k469k775j577Q176o291j1303p484J2089
4425a1530L372j442J861L674Q20k161j614R0K471J869o960k098K427O649O804
4410D232o270l64j82M19Q238O845l42o133p415m449k242j264J716M347j978q68
4394e710j614n107N293k247L631O303J383m087m70j949j355q81o396k752j438
4379a7396Q235M283J188n011n261M692Q365P080O141j948n183r122m307K424k344
4364h164m227N17n65l447L900M776p7o401l612O184o00K945O088k356J60K234
4348b645M782L221L83m16K354o26O339j811j2285l683O388k211k279K744J123
$$ plain form
4333 1378 3341 2809 -2680 -3597 1661 1287 -535 3354 1104 -5395 -8988 -5265 -2141 2333 436 -786
4317 -786 -5364 -8249 -667 1033 4084 5338 5392 -1713 43 4270 3197 -2392 -7804 -2078 -1940 -3694
4301 -3694 -4512 -2492 1954 1036 -4651 -7707 -9631 -16326 -18222 -18338 -17106 -13580 -8938 -6902 3636
4286 3636 6669 9445 8006 844 -3057 -7643 -8204 -8919 -5536 -3671 2247 2597 5974 2071 1057 1545
4270 1545 2443 1219 -4770 -3314 -5984 -9620 -10521 -5589 -6222 -5376 350 -636 -822 -433 -2197 -2679 1627
4253 1627 2353 1950 5943 2019 4529 3893 2000 2219 3373 -5411 -14153 -5072 -7409 -4659 -6266 -3260
4237 -3260 11492 9174 4945 5135 2297 -1971 -6271 -8915 -4366 -10322 -13645 -11783 -6548 -11885 -16406
4222 -16406 -16744 -18162 -11419 -8159 -3386 -600 -4109 -6958 -4995 3023 -4110 -12601 -8229 -3902 -5581
$$ packed form
4333A378J963n32n489r17N258l74j822L889k250o499l593L723L124M474j897j222
4317g86m578k885P582J700L051J254N4p105J756M227j073n589n412N726J38j754
4301c694q18K020M446r18n687l056j924o695j896j16J232L526M642K036J0538
4286C636L033K776j439p162l901m586n61p15L383J865N918L50L377l903j014M88
4270A545Q98j224n989J456k670l636r01M932o33Q46N726r86j86L89j764m82M306
4253A627P26m03L993l924K510o36j893K19J154q784q742R081k337K750j607L006
4237c260J4752k318m229J90k838m268m300k644M549n956l323J862N235n337m521
4222a6406l38j418O743L260M773K786l509k849J963Q018p133q491M372M327j679
$$ plain form
4207 -5581 -8914 -9595 -10745 -13945 -10592 -7502 -7586 -1207 9177 9231 338 -1739 -8188 -11858 -9274 -8247
4191 -8247 -3549 -6317 -4194 -4081 -5891 -4076 -455 3215 3611 7656 8122 2620 -3088 -10693 -14109 -7524
4175 -7524 -2607 -3118 -12394 -18108 -10288 -12053 -12551 -12936 -13173 -4727 -7997 -11439 -10212 -12174 -15541 -16376
4159 -16376 -11987 -7939 -7128 -6597 -8497 -6728 -4045 -6268 -12093 -11342 -5166 2346 -2407 -7552 -5284
4144 -5284 1140 4260 -1825 -3168 -1210 -384 6989 -1160 -7550 -5380 -11259 -9905 -5687 -3889 -763
4129 -763 -1191 -2190 224 1609 1641 4058 2256 490 5119 7597 6955 1239 -3929 -2887 2344 -2624
4113 -2624 -6264 -3873 2511 618 -123 951 -444 3464 -2663 -2472 2519 3459 603 2693 5255 -1959
4097 -1959 -8170 -8300 -6156 -982 1693 689 916 -3865 -4973 -8463 -11080 -5688 -3250 -6221 -2995
$$ packed form
4207e581l333o81j150l200L353L090q4O379J0384N4q893k077o449l670K584J027
4191h247M698k768K123J13j810J815L621L670L96M045M66n502n708p605l416O585
4175g524M917n11r276n714P820j765m98l85k37Q446l270l442J227j962l367q35
4159a6376M389M048Q11N31j900J769K683k223n825P51O176P512m753n145K268
4144e284O424L120o085j343J958Q26P373q149o390K170n879J354M218J798L126
4129g63m28r99K414J385L2K417j802j766M629K478o42n716n168J042N231m968
4113b624l640K391O384j893p41J074j395L908o127J91M991R40k856K090K562p214
4097a959o211j30K144N174K675j004K27m781j108l490k617N392K438k971L226
$$ plain form
4082 -2995 3448 3855 1778 -5829 -3856 2442 3000 8790 6337 2632 4635 709 -3726 -4948 172
4067 172 295 6160 6000 -18 -3670 -6215 -2105 -1971 -3831 172 -7359 -5150 3221 1859 -3366 -3890
4051 -3890 -604 1496 -3994 -4680 -2394 -3080 -4740 -4675 -729 -5605 -13811 -10128 -4010 1744 2754 1664
4035 1664 -587 -501 -2451 -6179 -1673 -3293 219 5494 3673 -301 -6466 -7749 681 -290 -6292 -13003
4019 -13003 -15731 -14861 -9440 -6443 -3630 -1781 -1345 -4104 -3547 -2227 -2086 913 -1052 1478 4234 444
4003 444 -3149 -6814 -8391 -6356 -2136 -2327 -562 7022 2236 587 637 -2468 -6860 -3461 -6938 -2055
3987 -2055 11 -3195 -4707 -10683 -17566 -11540 -6749 -2798 -2852 -2080 817 -251 3983 -1297 -7422 -7621
3971 -7621 -6433 -4503 -2651 -2790 -5105 -3083 3066 4542 3158 4347 7541 13897 15806 10047 1280
$$ packed form
4082b995O443M07k077p607J973O298N58N790k453l705K003l926m435j222N120
4067A72J23N865j60o018l652k545M110J34j860M003p531K209Q371j362n225n24
4051c890L286K100n490o86K286o86j660O5L946m876q206L683O118N754J010j090
4035A664k251Q6j950l728M506j620L512N275j821l974o165j283Q430r71o002o711
4019a3003k728Q70N421K997K813J849M36k759N57J320J41K999j965K530K756l790
4003D44l593l665j577K035M220j91J765P584m786j649N0l105m392L399l477M883
3987b055K066l206j512n976o883O026M791L951n4P72K897j068M234n280o125j99
3971g621J188J930J852j39k315K022O149J476j384J189L194O356J909n759q767
$$ plain form
3956 1280 -461 882 -4301 -13041 -17348 -11020 -4020 -7730 -3235 -7932 -14533 -14751 -15049 -14073 -4601 -4904
3940 -4904 -5970 -10521 -9313 -6550 -8769 -10444 -4532 -1127 -3317 -3771 5371 11064 6860 -2206 -7149
3925 -7149 -7692 -9694 -7074 -3540 -4765 -6732 -7104 -10966 -16013 -15780 -12509 -20300 -24454 -19603 -7200
3910 -7200 -2159 -5802 -6536 -1091 -402 -4369 -11029 -16320 -13680 -13726 -9244 -3091 -3319 -6074 -6923 -10916
3894 -10916 -12011 -2724 8148 1204 -3403 -6345 -1712 1096 -919 1586 5420 8630 7918 10922 9652
3879 9652 64 -5479 -7164 -3279 -5204 -6818 -5437 -3647 -5303 -4106 -589 4077 -1028 -3815 -1793
3864 -1793 -2190 -2241 -662 6359 7579 1226 -1671 2419 -708 -3693 -2293 35 1979 5491 12283 7520
3848 7520 -1152 204 841 5564 3801 4372 1941 -4048 -3933 -1351 -13182 -15512 -10399 -5254 -436
$$ packed form
3956A280j741J343n183q740m307O328P000l710M495m697o601k18k98R76R472l03
3940d904j066m551J208K763k219j675N912L405k190m54R142N693m204r066m943
3925g149n43k002K620L534j225j967l72l862n047K33L271p791m154M851J2403
3910g200N041l643p34N445O89l967o660n291K640m6M482O153k28k755q49l993
3894a0916j095R287J0872o944m607k942M633K808k015K505L834L210p12L004j270
3879I652r588n543j685L885j925j614J381J790j656J197L517M666n105k787K022
3864a793l97n1J579P021J220o353k897M090l127k985J400K328J944L512O792m763
3848G520q672J356O37M723j763N71k431n989J15K582j1831k330N113N145M818
$$ plain form
3833 -436 -1812 3822 9927 10711 4478 -6824 -1749 4021 -1968 -2874 -4661 -5800 -3120 -2094 -567
3818 -567 3781 4253 1329 918 390 3756 7166 11941 13134 5271 -3350 5329 8101 -4617 -15248
3803 -15248 -13631 -12450 -10149 -4195 -2367 -911 -2906 -4937 719 -369 -1236 -3017 -2345 -7123 -7991
3788 -7991 -2265 -3478 -2146 -3064 -7496 -7368 -917 1049 1460 5752 5559 -773 1461 6778 5090 2796
3772 2796 4374 10038 8327 1748 -1900 -93 823 -1101 -1603 -7423 -497 6206 1716 -429 -7013
3757 -7013 -12616 -13013 -10271 -7500 -4429 -3674 -4408 251 7216 16106 12361 -1254 -5900 -7702 -15834
3742 -15834 -16108 -11974 -7832 490 14049 18075 11560 4090 8250 6422 -732 -2834 7976 9163
3728 9163 1436 -3480 -132 -39 -2460 -2543 -346 -3348 -2941 -6056 -4053 -1954 -2403 509 3258 5419
$$ packed form
3833d36j376N634O105P84o233j1302N075N770n989r06j787j139K680J026J527
3818e67M348M72k924m11n28L366L410M775J193p863q621Q679K772j2718j0631
3803a5248J617J181K301N954J828J456j995k031N656j088q67j781O72m778q68
3788g991N726j213J332r18m432J28O451J966M11M292j93o332K234N317j688k294
3772B796J578N664j711o579l648J807R16j924n02n820O926O703m490k145o584
3757g013n603l97K742K771L071P55p34M659O965Q890l745j3615m646j802q132
3742a5834k74M134M142Q322J3559M026o515p470M160j828p154k102J0810J187
3728I163p727m916L348R3k421q3K197l002M07l115K003K099m49K912K749K161
$$ plain form
3712 5419 6426 2590 -881 3032 4731 1623 733 8397 13817 13876 12939 9574 4440 3904 5724 1259
3696 1259 -312 -752 5148 6986 4875 4180 3546 4076 1061 1948 2958 -5392 -3152 -4691 -1857 -123
3680 -123 -6498 -4864 -4710 105 1095 -3221 -2560 2248 -2312 -3394 -6964 -10641 -5474 -6170 -7433 -13747
3664 -13747 -20531 -20996 -14470 -5314 -3483 -4472 -11617 -18353 -23805 -16927 -9503 -11690 -12481 -8081 -11177
3649 -11177 -8592 -7298 -8107 -6267 -10143 -13258 -5434 -6432 -9535 -4864 4578 10876 12275 6162 358
$$ packed form
3712E419J007l836l471L913J699l108q90P664N420N9r37l365n134n36J820m465
3696A259j571m40N900J838k111o95o34N30l015Q87J010q350K240j539K834J734
3680a23o375J634J54M815R90m316O61M808m560j082l570l677N167o96j263o314
3664a3747o784m65O526R156J831r89p145o736n452O878P424k187p91M400l096
3649a1177K585J294q09J840l876l115P824r98l103M671R442O298J399o113n804
$$ [...]
##END NTUPLES=NMR SPECTRUM
##END=
