##TITLE=Analysis number 314876
Compound Code cc 01701
Project Code adrs
Chemist Name stores
##JCAMPDX= 6.0         $$ Bruker NMR JCAMP-DX V2.0
##DATA TYPE= NMR SPECTRUM
##DATA CLASS= NTUPLES
##ORIGIN= Bruker BioSpin GmbH
##OWNER= NMR
$$ XWIN-NMR		Version 3.5
$$ Fri Oct 28 12:10:41 2005 GMT Daylight Time (UT+1h)  MAYBRIDGE\NMR@NMR_250MHZ
##.OBSERVE FREQUENCY= 250.131544655141
##.OBSERVE NUCLEUS= ^1H
##.ACQUISITION MODE= SIMULTANEOUS (DQD)
##.ACQUISITION SCHEME= undefined
##.AVERAGES= 16
##.DIGITISER RES= 18
##SPECTROMETER/DATA SYSTEM= dpx250
##.PULSE SEQUENCE= zg30
##.SOLVENT NAME= DMSO
##.SHIFT REFERENCE= (INTERNAL, DMSO, 0, 16.522)
##AUDIT TRAIL= $$ (NUMBER, WHEN, WHO, WHERE, WHAT)
$$ ##TITLE= Audit trail, XWIN-NMR		Version 3.5
$$ ##JCAMPDX= 5.01
$$ ##ORIGIN= Bruker BioSpin GmbH
$$ ##OWNER= NMR
$$ C:\u/data/dgb/nmr/ADRS/11540/pdata/1/auditp.txt
$$ ##AUDIT TRAIL=  $$ (NUMBER, WHEN, WHO, WHERE, WHAT)
(   1,<2005-10-28 12:10:21.00 +100>,<MAYBRIDGE\NMR>,<NMR_250MHZ>,
      <created by zg, POWCHK disabled, PULCHK disabled
       configuration hash MD5:
       62 19 C7 07 E1 42 D1 B7 37 6C 3D D0 77 39 F9 E6
       data hash MD5: 64K
       3E 5A CA 89 2C D1 83 4A 62 43 18 FA 46 1E 8B 0E>)
(   2,<2005-10-28 12:10:32.14 +100>,<MAYBRIDGE\NMR>,<NMR_250MHZ>,
      <Start of raw data processing
       ef LB = 0.3 FT_mod = 6 PKNL = 1 SI = 32K 
       data hash MD5: 32K
       62 98 F9 D8 DD C3 38 24 7C 16 1F 61 AB 27 BC E8>)
(   3,<2005-10-28 12:10:33.89 +100>,<MAYBRIDGE\NMR>,<NMR_250MHZ>,
      <apk 
       data hash MD5: 32K
       46 63 0C C8 37 1A A8 D0 0E C6 D5 F0 AF 86 8A DE>)
(   4,<2005-10-28 12:10:34.68 +100>,<MAYBRIDGE\NMR>,<NMR_250MHZ>,
      <abs ABSG = 5 
       data hash MD5: 32K
       CD 46 29 67 18 35 00 5F E6 86 03 E4 59 E1 7A 82>)
$$ ##END=
$$ 
$$ hash MD5
$$ 74 68 76 9C 50 E2 2A 53 D4 49 C2 FD 2B 44 4F 62
##$RELAX= 
##$RELAX= 
##$RELAX= 
##$RELAX= 
##$RELAX= 
##$RELAX= 
##$RELAX= 
$$ Bruker specific parameters
$$ --------------------------
##$DU= <C:\u>
##$EXPNO= 11540
##$NAME= <ADRS>
##$PROCNO= 1
##$TYPE= <nmr>
##$USER= <dgb>
##$AMP= (0..31)
100 100 100 100 100 100 100 100 100 100 100 100 100 100 100 100 100 100 
100 100 100 100 100 100 100 100 100 100 100 100 100 100 
##$AQSEQ= 0
##$AQ_mod= 3
##$AUNM= <au_zg>
##$AUTOPOS= <20 >
##$BF1= 250.13
##$BF2= 250.13
##$BF3= 250.13
##$BF4= 250.13
##$BF5= 500.13
##$BF6= 500.13
##$BF7= 500.13
##$BF8= 500.13
##$BYTORDA= 1
##$CFDGTYP= 0
##$CFRGTYP= 5
##$CHEMSTR= <none>
##$CNST= (0..31)
1 1 145 1 1 1 1 1 1 1 1 1 1 1 1 1 1 1 1 1 1 1 1 1 1 1 1 1 1 1 1 1 
##$CPDPRG= <>
##$CPDPRG1= <>
##$CPDPRG2= <>
##$CPDPRG3= <>
##$CPDPRG4= <mlev>
##$CPDPRG5= <mlev>
##$CPDPRG6= <mlev>
##$CPDPRG7= <mlev>
##$CPDPRG8= <mlev>
##$CPDPRGB= <>
##$CPDPRGT= <>
##$D= (0..31)
0 1 0 0 0 0 0 0 0 0.06 0 0 0 0 0 0 0.0002 0 0 0 0 0 0 0 0 0 0 0 0 0 0 
0 
##$DATE= 1130497820
##$DBL= (0..7)
120 120 120 120 120 120 120 120 
##$DBP= (0..7)
150 150 150 150 150 150 150 150 
##$DBP07= 0
##$DBPNAM0= <>
##$DBPNAM1= <>
##$DBPNAM2= <>
$$ [...]
##$SUBNAM7= <"">
##$SUBNAM8= <"">
##$SUBNAM9= <"">
##$SW= 20.6930455092707
##$SWIBOX= (0..15)
0 0 3 0 0 0 0 0 0 0 0 0 0 0 0 0 
##$SW_h= 5175.983436853
##$TD= 65536
##$TD0= 1
##$TE= 296.16
##$TE2= 300
##$TE3= 300
##$TEG= 300
##$TL= (0..7)
0 120 120 120 120 120 120 120 
##$TP= (0..7)
150 150 150 150 150 150 150 150 
##$TP07= 0
##$TPNAME0= <>
##$TPNAME1= <>
##$TPNAME2= <>
##$TPNAME3= <>
##$TPNAME4= <>
##$TPNAME5= <>
##$TPNAME6= <>
##$TPNAME7= <>
##$TPOAL= (0..7)
0.5 0.5 0.5 0.5 0.5 0.5 0.5 0.5 
##$TPOFFS= (0..7)
0 0 0 0 0 0 0 0 
##$TUNHIN= 0
##$TUNHOUT= 0
##$TUNXOUT= 0
##$USERA1= <user>
##$USERA2= <user>
##$USERA3= <user>
##$USERA4= <user>
##$USERA5= <user>
##$V9= 5
##$VALIST= <valist>
##$VCLIST= <CCCCCCCCCCCCCCC>
##$VD= 0
##$VDLIST= <DDDDDDDDDDDDDDD>
##$VPLIST= <PPPPPPPPPPPPPPP>
##$VTLIST= <TTTTTTTTTTTTTTT>
##$WBST= 1024
##$WBSW= 4
##$XGAIN= (0..3)
0 0 0 0 
##$XL= 0
##$YL= 0
##$YMAX_a= 481202
##$YMIN_a= -315048
##$ZGOPTNS= <>
##$ZL1= 120
##$ZL2= 120
##$ZL3= 120
##$ZL4= 120
##$ABSF1= 16.522
##$ABSF2= -4.171173
##$ABSG= 5
##$ABSL= 3
##$ALPHA= 0
##$AQORDER= 0
##$ASSFAC= 0
##$ASSFACI= 0
##$ASSFACX= 0
##$ASSWID= 0
##$AUNMP= <proc_1d>
##$AZFE= 0.1
##$AZFW= 0.1
##$BCFW= 0
##$BC_mod= 0
##$BYTORDP= 0
##$COROFFS= 0
##$CY= 12.5
##$DATMOD= 1
##$DC= 0
##$DFILT= <>
##$DTYPP= 0
##$F1P= 14.0000005364418
##$F2P= -0.99999901652339
##$FCOR= 0.5
##$FTSIZE= 32768
##$FT_mod= 6
##$GAMMA= 0
##$GB= 0
##$INTBC= 1
##$INTSCL= 1
##$ISEN= 128
##$LB= 0.3
##$LEV0= 0
##$LPBIN= 0
##$MAXI= 10000
##$MC2= 0
##$MEAN= 0
##$ME_mod= 0
##$MI= 0
##$NCOEF= 0
##$NC_proc= -3
##$NLEV= 6
##$NOISF1= 0
##$NOISF2= 0
##$NSP= 0
##$NTH_PI= 0
##$NZP= 0
##$OFFSET= 16.522
##$PC= 1
##$PHC0= 62.63598
##$PHC1= 15.87043
##$PH_mod= 1
##$PKNL= yes
##$PPARMOD= 0
##$PSCAL= 4
##$PSIGN= 0
##$REVERSE= no
##$SF= 250.13
##$SI= 32768
##$SIGF1= 0
##$SIGF2= 0
##$SINO= 400
##$SIOLD= 32768
##$SREGLST= <1H.DMSO>
##$SSB= 0
##$STSI= 32768
##$STSR= 0
##$SW_p= 5175.98343685301
##$SYMM= 0
##$S_DEV= 0
##$TDeff= 65536
##$TDoff= 0
##$TI= <Analysis number 999999
Compound Code 99
Book Reference 9
Project Code 9>
##$TILT= no
##$TM1= 0
##$TM2= 0
##$TOPLEV= 0
##$USERP1= <user>
##$USERP2= <user>
##$USERP3= <user>
##$USERP4= <user>
##$USERP5= <user>
##$WDW= 1
##$XDIM= 32768
##$YMAX_p= 476858859
##$YMIN_p= -797406
$$ End of Bruker specific parameters
$$ ---------------------------------
##NTUPLES= NMR SPECTRUM
##VAR_NAME=  FREQUENCY,     SPECTRUM/REAL,   SPECTRUM/IMAG
##SYMBOL=    X,             R,               I
##VAR_TYPE=  INDEPENDENT,   DEPENDENT,       DEPENDENT
##VAR_FORM=  AFFN,          ASDF,            ASDF
##VAR_DIM=   32768,         32768,           32768
##UNITS=     HZ,            ARBITRARY UNITS, ARBITRARY UNITS
##FACTOR=    0.157963299565203, 1,           1
##FIRST=     4132.6476996994, 0,             0
##LAST=      -1043.33573715361, 0,           0
##MIN=       -1043.33573715361, -797406,     0
##MAX=       4132.6476996994, 476858859,     0
$$ Real data points
##PAGE= N=1
##DATA TABLE= (X++(R..R)), XYDATA
$$ [...]
26295 40473 48795 46673 24851 8445 -7418 -15518 7874 -11126 3819 7517 44883 62575
26283 62575 91510 127961 82587 16002 32473 61330 52709 71876 131942 167132 147386 151903
26271 151903 149739 157915 141352 136045 134323 140410 132438 129418 72592 65173 83742 84721 42487
26258 42487 85417 96582 78937 71978 44967 57210 78501 43016 54431 89413 125578 95817
26246 95817 97684 98008 60359 48159 32696 36240 57614 10750 10977 -11140 -63675 -40657 15430
26233 15430 23390 85439 126718 106490 59463 60371 88214 91548 83611 89246 71626 57983 39097
26220 39097 36844 11045 22226 34982 42906 55706 29776 43180 38796 109448 110822 68663
26208 68663 116607 124694 83660 44389 32915 32821 26374 31838 -3701 -25981 4938 41319 37184
26195 37184 69119 78343 107518 105220 96400 65296 78629 45852 -21580 -539 19143 33762
26183 33762 84130 102696 66889 73989 101721 141323 121518 65416 63933 31572 30526 80248
26171 80248 83975 72547 114269 68642 59480 81804 64270 62380 55818 33251 34001 12754 8966
26158 8966 -5873 -13162 6677 29094 30158 80199 107833 113094 116782 94798 46060 29753 14096
26145 14096 22312 19999 48478 98234 100369 86095 74644 44684 23602 48723 103249 114966
26133 114966 66517 82453 52440 -3879 8037 63043 56206 23670 -12670 -28736 2209 6906
26121 6906 33468 26471 21776 16087 -22646 -30929 -17842 -17480 2663 5422 -28736 -36994 -19500
26108 -19500 -52025 -36084 -53447 -44352 -35468 -19222 3952 38724 89077 112434 86106 64468
26096 64468 92087 57319 -26343 5741 66628 127548 166815 178232 153946 129838 96593 44852
26084 44852 36113 73962 82952 36549 10768 -10460 -21634 -22039 14139 16086 22309 43045 65238
26071 65238 83849 62204 60935 51645 16861 50302 52141 54895 39199 -3339 23293 67201
26059 67201 75426 53100 13156 25685 58369 56382 43492 7160 8507 22138 14643 57743
26047 57743 93315 108974 100761 67255 44053 48880 16445 11260 53508 117605 148265 118788
26035 118788 114725 52343 19370 -11253 -15061 -27931 32841 66204 58359 38694 -43816 -43940
26023 -43940 -19870 -15576 17236 87627 104362 113817 123410 112820 107310 97430 95864 69387 41732
26010 41732 34957 22122 8411 -9683 -42421 -12701 52648 24522 5244 34894 51311 39454
25998 39454 77862 107481 95377 111777 128136 84325 48121 73633 87968 113194 91121 22616
25986 22616 -27952 -26978 17338 29357 8692 56351 71500 57776 21943 -2614 -26976 -36232
25974 -36232 -52052 -93399 -37491 3934 40084 68371 37975 59163 41755 75150 52726 10863
25962 10863 19680 24741 26681 8839 28503 97661 123936 96991 48446 53281 37644 63462
25950 63462 91511 116153 113465 93740 111458 84137 65708 102825 124697 108017 64251 81158
25938 81158 90097 114916 108186 49445 21697 11244 -21284 -37009 19050 14314 1953 25922
25926 25922 41780 20317 -21850 -68421 -27423 -5209 -12470 -11248 -1652 -24324 -5293 21886
25914 21886 53323 40264 73280 77127 44676 -23876 -29440 -26142 -18058 -4864 -2401 13455 46888
25901 46888 77041 111067 99895 67824 19063 -22899 4484 70050 70229 49227 -838 -33056
25889 -33056 -8850 35069 43443 71169 85104 72165 2305 -15587 43604 55879 42922 73997
25877 73997 108267 93906 78864 72141 92435 75860 58143 23976 39480 94235 100602 154525
25865 154525 141789 115035 85789 57167 29220 31504 47756 52435 14928 -1485 3587 18866
25853 18866 40497 23589 -9909 10482 -6924 -12568 -14847 20570 27709 3379 -13286 14701
25841 14701 25760 12021 -6539 39492 33443 45467 30367 18871 -1803 -22087 15201 19821
25829 19821 56410 48780 60084 54832 47167 29862 28502 -27688 2310 72135 92674 1672
25817 1672 -18927 -34938 -13660 -25158 -59243 -7668 41429 39699 31889 25483 51947 44637 54584
25804 54584 54024 48776 39247 26475 -6593 -44805 -53001 -73231 -83905 -54430 -47669 -3917 41886
25791 41886 8210 -24404 -14892 -24964 -12546 40214 70987 106409 71740 38614 37021 -10179
25779 -10179 -64645 -36915 -4900 -47140 -26036 -6644 -17016 -4229 -42301 -50040 -23425 -6870
25767 -6870 -26823 17283 43259 32709 -21879 43050 36671 33144 52237 64428 51346 48525
25755 48525 46499 -25032 -80824 -37746 -12181 -21259 -18390 -9184 -34197 -52369 -13776 9649
25743 9649 10430 19457 29790 16908 54376 21798 20347 16275 34788 35747 42914 32895 -7029
25730 -7029 7809 -9479 -608 38680 79507 73323 69596 47043 74218 94788 16196 -43338
25718 -43338 -38856 4466 60314 74408 54191 -18429 -47413 -7185 27193 60289 54113 22222
25706 22222 -14285 -1614 -164 -46933 -29516 -16339 3438 34945 29834 33341 48556 67936
25694 67936 24942 -17303 -7338 9606 -44156 -51233 17770 4496 -13418 -50850 -72633 -77321
25682 -77321 -60109 -13337 18349 41670 60643 77238 62973 56204 29663 -10780 -10678 44276
25670 44276 30699 16616 13391 37642 89799 126938 114032 46682 30246 17943 39618 31281
25658 31281 -31243 -53022 -16405 -19757 -10659 20010 26592 -12264 -47301 -68717 -53032 -49304
25646 -49304 -50929 -31677 -25455 -17373 -29482 -4027 -34401 -70270 -75807 -80961 -47707 -9034 13278
25633 13278 2940 21293 36550 27428 2514 12137 52936 83176 51857 -7552 -13168 -31445
25621 -31445 -15389 9732 9931 38148 41594 55106 59073 35825 -17397 -17802 -30365 -42201 -21389
25608 -21389 -44509 -56303 -44611 -19039 -25440 -41959 -79079 -68695 -55775 -47832 -48585 -66621
25596 -66621 -39321 -46606 -42695 11491 53713 87376 106909 105475 72463 28616 11597 -17217
25584 -17217 -25195 13907 48522 28762 -29884 -32488 -56446 -52297 -34971 -42390 -73303 -71025 -53166
25571 -53166 -75569 -80052 -14800 40219 63244 69270 46599 24637 -16962 -52810 -39373 -25046
25559 -25046 -16248 -4534 21275 6055 -12115 -45242 -70307 -61986 -70438 -48877 -30454 -14611
25547 -14611 43264 31373 -25361 -72099 -77289 -67429 -71460 -19977 334 -27320 -46882 -17106
25535 -17106 -29801 -22677 -31712 -30068 -25029 15623 35012 -2026 -72597 -63311 22219 39289 38190
25522 38190 39352 74784 40101 35313 39754 64156 46571 27292 -35569 -28023 21271 56090
25510 56090 28882 -7673 -54795 -13859 15972 -10143 -26777 -52680 -66089 -37944 23878 22985
25498 22985 -12722 -17425 3478 -11787 -78009 -93708 -34212 -23172 -54904 -51420 -31379 -9788
25486 -9788 61277 100263 113970 80312 57790 21602 -15838 1965 67203 108695 60914 10842
25474 10842 37567 -2912 -5905 2060 -7047 -24236 -41830 -23345 14326 -23786 -37034 -17880
25462 -17880 -10999 -1973 -16523 -55164 -71312 -85418 -82883 -55842 -22137 13426 39396 -9
25450 -9 37355 62971 -14852 -8316 -29334 -68914 -50017 -20357 27346 24335 82309 -4121 -53974
25437 -53974 -27186 -217 -19357 -20715 4474 34722 39680 26049 16155 6256 -20561 4007
25425 4007 16099 -91191 -108953 -9569 4145 -1317 9960 30299 70272 105179 98229 61512
25413 61512 49744 305 -29383 896 -8830 -24351 28556 9077 15377 17465 7564 -19850
25401 -19850 -11863 -10866 -32274 -669 50831 14523 -10634 -20621 -4727 17157 29226 29211 30309
25388 30309 10473 6428 6332 40296 51482 25098 4966 -12775 15266 49315 20360 3835
25376 3835 -61341 -47812 -8305 -10034 11638 864 -4355 41245 67450 50643 24066 23913 -2931
25363 -2931 -26311 -45694 -79649 -81469 7217 37671 82083 101400 96138 73201 22107 18907
25351 18907 17007 -5116 39000 32866 -11426 2608 31866 2761 -62507 -111560 -68070 -61386
25339 -61386 -79522 -4136 22629 -18758 -14216 -36118 -24142 12025 40363 15540 -38519 -59238
25327 -59238 -32887 -56362 -80445 -40161 36608 81120 67319 -19011 -27890 6488 24356 -33530
25315 -33530 -59839 -38132 -80911 -79044 -44125 -43349 -23119 -9176 -15483 -52451 3979 57715
25303 57715 13242 -34158 -25952 -18602 -68197 -132643 -117969 -21803 -38689 -28298 26124 42858
25291 42858 87371 94164 90556 54128 10455 3028 -5034 5921 30491 51648 45101 66908 41906
25278 41906 11189 -22866 -61193 -18422 -22055 -41829 -28898 -1292 -1860 18107 13685 -17298
25266 -17298 -63930 -101056 -68623 -8202 -11770 -29046 -15318 -39778 -53860 -46474 698 4906
25254 4906 -19129 1784 -25370 18039 -20108 -63348 -89176 -66001 -26506 -30133 8571 -6251
25242 -6251 -49363 -39353 -34934 -1577 -14128 -14489 -56575 -86280 -34941 43500 14477 -169
25230 -169 -49594 -29402 -17084 -10577 -44361 -69436 -56586 1730 -8689 -29148 -7230 22621
25218 22621 9742 7622 -9645 23261 43741 33942 16840 19914 -588 -576 -24511 -37408 -24957
25205 -24957 12446 29648 14334 -34127 10141 19673 -4551 -19732 -22366 -55569 -38267 -26493
25193 -26493 -23193 -53270 -30870 -25949 -67921 -77360 -71174 -70417 -30441 -25475 -17860 29989 41653
25180 41653 -14339 -15196 -26143 -3565 23573 36935 26220 28101 60505 39510 20766 16256
25168 16256 -20013 -16001 32076 22402 -22359 -39307 -53954 -52446 -38801 -39117 -12857 45824 37101
25155 37101 -29058 -87937 -83674 -35447 8888 2216 657 -31940 -7095 35904 23272 -8405
25143 -8405 -12376 5066 7847 8306 20641 39455 -40291 -46111 -39261 -65824 -71438 -71476 -86476 -79960
25129 -79960 -63244 -35286 25511 109677 103125 69033 96541 111181 72565 44422 32476 24357
25117 24357 -3396 -3303 18456 -3924 -61715 -29725 -3477 -19291 -65 -6815 -16093 30394 58686
25104 58686 6691 -26001 -17703 -14210 660 19728 16413 22557 26796 57868 62722 22989 -9191
25091 -9191 -37605 -3336 41397 41417 31450 26372 -10816 -44135 6911 38806 12353 3554 36466
25078 36466 34237 6374 32626 -27287 -40461 17086 55121 49673 72781 133671 127479 58875
25066 58875 35021 814 -9446 8707 14453 64882 73018 95074 83483 51102 -3755 -26104
25054 -26104 -58915 -55260 -50064 -15537 18940 16544 47110 66815 19335 53881 70538 30378
25042 30378 21796 15189 272 -12978 -40980 -35808 -94031 -92953 -52259 -73534 -75380 -33619 -12504
25029 -12504 -16649 3925 45620 49215 71209 49586 2927 -54340 -38759 -24448 -19634 -62014
25017 -62014 -62363 -33350 -31334 -49251 -27903 11068 -12991 -64081 -59550 -39661 3187 21020
25005 21020 30149 83038 94088 64347 54408 60749 21402 289 25991 59709 56161 58306 23111
24992 23111 8434 9632 37936 25812 22207 5679 -32111 -3750 37702 -5475 -78382 -81067
24980 -81067 -48775 -12739 -43815 -62573 -22109 38853 67827 83973 -8991 -23163 11082 30540
24968 30540 29213 61348 54349 58621 39433 -3496 -6429 5334 12652 58287 36107 -4906 -34079
24955 -34079 -51732 -15585 -29383 -27049 31496 56223 -9962 -11237 25653 40211 45087 -40482
24943 -40482 -25767 11949 -13627 4346 127 15990 35253 37240 2457 -18177 -18111 -28716 -70502
24930 -70502 -65969 -14381 22179 53618 21285 6979 42489 27894 -40215 -88532 -28673 32954
24918 32954 28955 5542 -10616 18190 -4025 -15439 -30525 -31138 -3481 -5889 -3077 66682 45627
24905 45627 3155 -20031 23450 54347 52415 43815 56988 1019 -53880 -68221 -82120 42478
24893 42478 100848 90752 50231 -2682 -11735 -35088 -54980 -17293 -53052 -97805 -69537 -52886
24881 -52886 -32878 5471 -12111 -20596 -37371 -19364 -16895 -19816 -14426 -45973 -35867 25989
24869 25989 -19843 -32015 14944 60265 86441 53881 43547 70090 131600 121723 120515 138582
24857 138582 86583 36858 33184 31255 34187 3140 -12975 -35694 -30499 -27872 -18449 12889 -3575
24844 -3575 -23873 -28985 196 15312 64641 90414 43299 -7096 -52056 -67516 -80857 -21348
24832 -21348 -17145 -22369 15842 -2609 8006 51634 22305 10448 -18644 -52507 -2382 38423
24820 38423 65264 26352 -23485 -36719 -2709 36358 31673 34024 -30427 -35545 9068 26900
24808 26900 -23529 -46348 -20547 11981 9790 38315 12977 -6064 13823 -14655 -14716 -27196
24796 -27196 -34020 -31276 -8029 6140 14430 40379 -33056 -63532 -22044 33339 67343 27494
24784 27494 27110 20831 41392 68850 48092 32129 -8785 -54518 -55116 -7922 38842 -3012 -56389
24771 -56389 -59170 -46872 -55012 -46355 -56673 -60960 -67438 -45730 -32057 -11195 1551 21526 39244
24758 39244 72270 99062 16622 -8724 -51867 -27291 14343 15955 -38238 -38899 -9045 7618
24746 7618 7981 -7409 -4241 -12037 334 1584 10689 5459 28148 -19694 -69694 -35219 -15241
24733 -15241 -12058 -17801 -2203 -34730 -26102 18444 53564 31289 11766 10096 23093 6435
24721 6435 192 -659 20522 -3275 -2962 -12326 -50856 -73109 -51067 11033 33012 12341 -21675
24708 -21675 -41302 -69556 -82620 -36372 -53530 -80631 -27853 -4862 -58921 -60648 -41685 -53322
24696 -53322 -54456 -35514 -49480 -46453 -16227 761 9380 37112 14518 -5921 10831 11492 51473
24683 51473 35176 -4553 -6987 -29059 -30843 -51807 -35525 -37488 -31539 -58822 -90316 -53580
24671 -53580 -28129 -45749 -89570 -54417 -9512 -15593 -4960 7881 34795 68905 37211 1462
24659 1462 -141 -17246 -38912 -32110 16947 39612 29714 18884 -10649 -15501 -51797 -4692 39174
24646 39174 25745 36350 44172 25445 -11627 -69610 -97677 -101804 -79378 -71951 -95954 -115163
24634 -115163 -73718 -76211 -119215 -112625 -41059 -34965 -75488 -63264 -61768 -76477 -69185 -62719 24661
24621 24661 37454 38499 3207 -21770 -20547 -48973 -37024 -46798 -32057 -9425 -19044 -43924
24609 -43924 -26852 -20314 27485 31759 -11953 -25391 -30347 -39919 -10874 5789 51468 84381
24597 84381 36865 -9511 -22410 -53407 -15293 36457 45271 56935 20735 -14003 -36286 -59711
24585 -59711 -48911 -5577 -19417 -24483 -53548 -20106 2736 -26869 -46347 -94035 -140867 -117693
24573 -117693 -69884 -38201 -65366 -95625 -85423 -59657 -97708 -108244 -42753 -66815 -70149 -42226
24561 -42226 -21727 -13816 -21237 -19791 -4255 13140 7991 30213 28086 7694 -32185 -68813 -70974
24548 -70974 -33434 17174 35887 3725 -34348 -58657 -33289 -30120 -29757 -38176 3085 46070
24536 46070 24884 15287 -203 -7431 12429 -23390 -75562 -91051 -77627 -29910 -34936 -90393
24524 -90393 -101155 -87350 -73257 -33461 -21395 -13979 -34202 -18275 10399 17902 11139 -36546
24512 -36546 -61317 -83674 -104099 -90328 -70376 -33003 -20927 -37275 -43501 -65434 -68956 -32224
24500 -32224 38384 17972 -31761 -59812 -56762 -63346 -29916 25498 13712 -25472 -44898 -29206
24488 -29206 -35663 -34488 -44533 -40049 22513 -21582 -36067 -26205 -46680 -94375 -102114 -94257 -36372
24475 -36372 -7617 -41830 -73286 -32081 32177 42821 33296 32270 22096 16022 34239 -46216
24463 -46216 -75048 -27306 2588 -10312 -33628 -37038 -59679 -81121 -7033 602 -16244 -18415
24451 -18415 -66316 -76866 -9684 15132 35626 72 6585 -1111 -11174 -22248 -13229 -1351
24439 -1351 -13591 2056 28841 23785 -19739 -11681 -7792 -9593 -23729 -36392 -64486 -36015 -38754
24426 -38754 -56838 -24437 18331 -2763 -27450 -23862 -48683 -77726 -90817 -47162 2189 37730
24414 37730 56231 -28805 -64121 -54642 28088 19947 -29401 -17399 5127 33549 56092 97466
24402 97466 152483 150192 115185 62526 22325 22362 -1425 25545 9631 -72081 -50518 -31225
24390 -31225 -5967 14267 8814 819 2331 -14304 -58666 -63039 -72362 -55582 -57967 -28942 -27753
24377 -27753 -21185 64517 88625 66146 44068 30105 30063 29180 -21039 -25810 -5185 -35858 -51254
24364 -51254 -24357 -8903 -6330 25727 32413 27145 59297 95187 92238 55424 9779 23297
24352 23297 33073 5030 32424 76737 74831 55584 21359 5597 1924 28010 44473 -14015
24340 -14015 -37903 -1325 22641 46797 14414 -5593 -5588 -4782 2655 -22385 -18859 -32591 -27490
24327 -27490 -39787 -39835 -32493 -15414 -43885 -46821 -90202 -63225 22312 -3986 -38550 -58343 -57829
24314 -57829 -6208 -9795 -42161 266 37709 -2012 -10380 -46416 -89576 -106451 -65875 -29096
24302 -29096 -58413 -97757 -81832 -97098 -92031 -83398 -80259 -62960 -51277 -28749 -15026 -31005
24290 -31005 -9545 -14625 -12155 6895 -5975 -35651 -74488 -78033 -47943 -47898 -69347 -71615 -103394
24277 -103394 -77734 -88766 -75599 -69562 -34970 -23470 -15153 13386 27507 8330 394 -23819
24265 -23819 -41642 -95482 -38749 15424 28650 20956 15734 19429 46263 17776 367 41572
24253 41572 14822 -36618 -32011 12895 -20037 -20255 251 -9753 -40734 -89365 -85055 -72148
24241 -72148 -35468 -20859 -51042 -115858 -119640 -112048 -67007 -47127 -21727 20371 979 -30684
24229 -30684 -23131 8772 31472 19809 -305 -32105 -8810 30118 19949 3030 9657 7853
24217 7853 12044 -8379 599 -14064 142 -18703 -30543 -30618 -56552 -72689 -31968 16266 10857
24204 10857 -53481 -59713 -94099 -109106 -69192 -39578 -67181 -32901 -8037 20874 29598 33003
24192 33003 36219 -3899 -13839 -33028 -27701 -71583 -47801 -30990 -49731 -19764 -29218 -5120
24180 -5120 24692 46262 79213 46690 49293 67001 40139 38947 -6343 -47374 -46751 -44693 -15431
24167 -15431 25898 3395 32806 -24014 -95293 -71336 -6101 12623 13699 29050 -12244 -47062
24155 -47062 -45545 -52467 -22106 -34111 -50569 -20224 -24445 -44855 -38037 36838 40345 -18276 -15807
24142 -15807 -28660 -13923 -1986 -21400 -44433 8538 -8144 -28283 -59748 -61238 -60963 -19282
24130 -19282 -32489 -33493 -13915 -1832 -29923 -37691 -24282 2170 46806 37653 20497 -43001
24118 -43001 -65460 -33857 -26932 -29941 -38859 -31742 -29334 18694 9224 22279 39902 66539 27528
24105 27528 -8745 -87371 -71059 -50950 -51665 25316 68945 45212 -6069 -8410 19334 -17907
24093 -17907 -20745 -63987 -39121 -32662 -38901 -8384 -47782 -29420 -13274 -33757 -1833 30358
24081 30358 31187 -36770 -29002 4182 31348 5983 -33564 -14124 29306 39495 40091 37193 -15048
24068 -15048 -38613 -38026 -18221 18896 56925 56797 22348 -61718 -88585 -83083 -47144 -35095 -81793
24055 -81793 -85155 -78866 -68857 -11764 -3369 -50931 -47553 -64053 -32836 -8636 -16713 -22511 -18951
24042 -18951 -22698 14334 13746 -21554 -51447 -37657 -22733 -37020 -37658 -35218 -52194 -32441 -36820
24029 -36820 4948 -3145 -24450 -31592 -28310 -16400 -11705 8411 8185 24964 20034 68453 61733
24016 61733 -39 -31784 -14771 -12497 -27280 -64307 -39671 -7186 46441 33400 -559 -12535
24004 -12535 -12911 -41720 -10302 -11848 27798 3920 -32256 -83196 -83938 -56016 -82363 -82704 -96892
23991 -96892 -120157 -127361 -105292 -54214 -25200 -34586 -60634 -103985 -66107 -31917 -42309 19463
23979 19463 8057 -7105 45304 19631 -20512 -45027 -57512 -56759 -47140 -38512 -47821 -77310 -66640
23966 -66640 -51003 -10185 -8064 -33572 -43343 -39302 -52306 -28226 -19248 -59467 -110028 -88739
23954 -88739 -55961 -49825 -87588 -41957 -22461 -12846 -642 4482 -16979 14870 48749 29400
23942 29400 13568 -8381 -19856 11494 16391 -17175 -28115 -60350 -60881 -7254 11143 80941
23930 80941 65002 64281 50053 26467 -5486 36332 62487 69229 67055 80078 51226 23136
23918 23136 25557 19255 -8474 -71435 -102640 -89458 -24253 27582 22273 9618 69033 72912
23906 72912 40134 58024 58421 46884 -834 37256 37913 -31171 -56141 -28962 3776 20728
23894 20728 15784 -22137 -32102 -13399 -9483 -10556 19008 42448 55259 13965 -36774 -60246
23882 -60246 -78114 -76988 -42601 27613 86053 96943 76606 -34039 -50477 -51927 -66382 -68525
23870 -68525 -71802 -12830 22143 48404 2197 2305 30345 14074 -31038 -71986 -55087 -33499
23858 -33499 -3020 10304 -23359 -57258 -23276 -49281 -142690 -164026 -32375 43875 9257
23847 9257 20819 62114 82021 82215 28180 34745 29543 17788 -21844 -39040 -5124 22152 16590
23834 16590 -28000 -4045 61237 76801 19796 -6803 13603 11468 1652 -1483 -39981 -47898
23822 -47898 -43830 -83273 -37662 -8123 21095 17732 39031 32364 25979 -3139 -32695 -41822 25393
23809 25393 44575 6097 14439 73185 85948 22776 12196 20088 34826 -1033 27050 37276
23797 37276 17277 -13064 -49731 -20038 20813 26828 -5832 -50445 -80659 -86654 -72731 -80998
23785 -80998 -111607 -61901 -26122 -40793 -95454 -135592 -95442 -43506 -49059 -69493 -46050 -28629
23773 -28629 19308 -13253 -37705 -11368 -58229 -101287 -55430 -50229 -100255 -141298 -122257 -76847
23761 -76847 -61900 -62673 -68294 -66396 -3377 -26055 -26342 -15580 -32785 -23941 -16198 34142 56336
23748 56336 77352 43898 -41807 -37946 -26746 30857 43963 -18077 -42987 -71844 -109493 -68344
23736 -68344 5838 16527 -18919 3157 27473 2804 -23101 -50294 -38083 -8736 -11665 15443
23724 15443 86497 124258 81898 50205 32813 23726 32851 759 -61033 -64747 -73851 -76270 -24668
23711 -24668 -13824 18356 46245 6001 -3334 4193 19997 -9113 -42442 -45824 8524 39170
23699 39170 13213 -12377 10702 12946 26930 24340 -1114 -20262 -41716 -35041 -55858 -41360
23687 -41360 2066 -8034 -65323 -113059 -127590 -75073 -29655 -49468 -27585 -2554 19279 -2295
23675 -2295 -9982 -64927 -94487 -80280 -58970 -79555 -86608 -81090 -63267 -73404 -54953 -58990 -82817
23662 -82817 -61529 -88423 -87664 -81690 -31842 -18734 -46302 -12858 10721 15365 38999 18947
23650 18947 -4611 -54065 -89827 -78097 -69238 -64165 -62125 -58997 -83543 -100284 -95381 -106827 -80568
23637 -80568 -52666 -49275 -16629 -21947 -53387 -64003 -42343 -33619 -27876 -12963 7255 15134 30429
23624 30429 47695 73973 67242 56493 510 -6719 -8429 -19596 -50010 -55095 -6340 44876
23612 44876 78147 53030 75001 71686 30453 -10904 -3484 11518 43298 28878 9171 25091
23600 25091 27824 6536 -21546 -6493 50637 45045 6626 -27164 -69607 -44034 -33852 -32641
23588 -32641 -16764 21531 54739 34272 22538 46285 23887 -25604 -17591 -28332 -13773 -2763
23576 -2763 -48845 -113036 -75011 -50040 -22083 26989 34350 -625 -18060 -12120 10465 15233
23564 15233 -24643 -32447 -14317 3687 14529 -5794 9969 12476 1646 -12341 -58147 -54777
23552 -54777 -46619 -28485 12586 -3737 13854 33009 17471 1051 -3175 -14321 -52204 -84012
23540 -84012 -7398 85753 118538 68619 14760 40411 46081 16840 -936 481 -3825 7072
23528 7072 23271 39161 -43137 -63163 -59657 -22637 17936 24015 -16910 -60736 -88591 -47684
23516 -47684 -16701 -4969 31009 44099 28555 -40967 -34097 -11588 -22910 -18524 -44186 -58341
23504 -58341 -88695 -137410 -141384 -138454 -93270 -48802 -78521 -115282 -99239 -33790 -13128 -3497
23492 -3497 -6373 -36230 -29091 -15281 5290 3993 -20233 -24617 16218 18627 -1277 51641 78497
23479 78497 54557 34084 820 -36532 -23429 -10822 -34548 -67100 -62780 -62820 -56859 -35406 -40920
23466 -40920 -82972 -45834 -22072 -16693 14029 -7788 10360 25294 -32271 -26715 19347 32243
23454 32243 62688 63021 66442 101089 70208 19093 -19541 -49205 -79686 -72107 -44824 -52072 -71985
23441 -71985 -45629 -27395 25776 28528 14999 -13155 -21336 -26493 -26103 -61376 -139039 -133979 -100885
23428 -100885 -66888 -35156 -28814 -26963 2551 7767 -17181 -63127 -55684 -44745 -41080 -23774
23416 -23774 -27150 -31361 -50959 -27925 -15391 3519 31741 38652 -17037 -42643 -71748 -90639
23404 -90639 -72377 -59634 -68175 -57756 -33655 -23617 46853 19119 -15392 -3818 3068 -6606
23392 -6606 -62690 -43477 -61175 -85531 -73349 -106697 -102944 -53489 -54805 -59565 -27521 29854
23380 29854 11452 -16814 31585 16342 -17222 -41901 -57581 -69537 -42364 36804 53825 20657
23368 20657 8290 -9228 1100 -14064 -10283 -48004 -56824 -31615 -11362 -60583 -69112 -95177
23356 -95177 -43970 574 -50387 -83195 -100772 -106621 -104547 -54061 -36805 -32129 -25676 -15868 -17999
23343 -17999 -60781 -77130 -80070 -78583 -52291 -78731 -89193 -86034 -95178 -68797 -52089 28730
23331 28730 62552 28496 -4915 -12653 -29789 -98531 -120914 -89237 -45353 -25559 -31184 -32235
23319 -32235 -50162 -73974 -38394 -27467 -4800 5482 -15194 -18012 59029 53106 7067 21569
23307 21569 99419 109228 77880 27531 25103 16323 -32943 -15168 -1154 20713 32391 14927
23295 14927 -10668 -20420 -42495 -92731 -84787 -84931 -58559 -2134 18016 -16340 -48947 -44560 -41325
23282 -41325 -97489 -59958 -8476 6650 30481 30868 -16452 -5545 -29564 -101032 -47587 279
23270 279 -14571 -26802 -7336 -28760 -52676 -95844 -119346 -128038 -74185 -51407 -35737 -15056
23258 -15056 2759 19685 51858 61605 76357 51983 7251 -22443 -41656 -42499 -33582 -50140
23246 -50140 -48887 -39234 -32339 -24279 -58162 -71834 -78248 -87030 -38603 36820 36664 19502 47586
23233 47586 45921 7336 -37024 -53821 -27855 -11542 4996 -14119 -14371 -8196 -49851 -87552
23221 -87552 -78794 -80407 -58784 -37403 -14858 -11787 -28128 -2792 20555 31867 16948 18782
23209 18782 21307 -31524 -80890 -63559 -66769 -50660 -19783 -39671 -87271 -87663 -96645 -145162 -138192
23196 -138192 -121292 -94362 -62407 -57345 -85758 -79872 -52860 -6706 31768 8560 -8875 -36481
23184 -36481 -43668 -45483 -25045 -40543 -32546 -24941 -76723 -91523 -51973 -19066 6396 -4681
23172 -4681 -17863 -19633 -39837 -93217 -79976 -116532 -135829 -109618 -74897 -34750 -7982 24487
23160 24487 -19610 -41786 -58434 -101591 -71510 1592 53793 49242 25324 37558 19728 780
23148 780 25496 22152 27773 39135 -7763 -38946 -56215 -130155 -135109 -59508 -48938 -26564 -13448
23135 -13448 11288 -3974 -3882 -1475 12728 -10950 15847 68304 49534 23787 44550 93546
23123 93546 89263 62660 30274 -6988 3963 -6939 -17833 10897 30757 2803 -34852 -40287
23111 -40287 -40813 -51697 3637 12729 -26201 11759 35141 27240 -10354 -36454 -50061 -55049 -51349
23098 -51349 -86703 -62888 -82981 -90891 -37392 -38332 -45296 -52007 -31976 -33508 -65389 -127910 -136568
23085 -136568 -86022 -6161 -19534 4086 -12245 -28845 -63463 -87542 -83338 -107796 -107143 -35077
23073 -35077 -22633 -41383 -76999 -52314 -23085 -44061 -33849 -32739 -69345 -84844 -69266 -86172
23061 -86172 -71811 -60526 -38393 -26182 -56864 -77298 -108455 -75628 -6462 -14333 -95061 -132742
23049 -132742 -70318 -4748 11914 13037 -12662 -65542 -33352 -36111 -42942 -8695 -33161 -105627
23037 -105627 -110962 -101301 -78575 -41049 -9515 -11705 -49996 -73797 -42071 52808 82306 77919
23025 77919 41428 -15050 -44439 -35719 -47759 -33691 -12063 -74630 -86393 -52089 -78519 -35988
23013 -35988 11122 -3055 -56519 -94564 -98952 -76846 -18647 43803 42718 -11320 -18207 -21590
23001 -21590 -20077 -10686 -30897 -21688 34819 18714 -25189 -43551 -38584 -39589 -65899 -76214 -48511
22988 -48511 -20568 -14692 4010 23591 -24643 -56620 4231 20480 -26517 -16530 -35609 -35467
22976 -35467 -22163 -19741 -21347 -22934 -19883 -35893 -48748 -73686 -115556 -109269 -85619 -96385 -79128
22963 -79128 -39163 -36278 -80741 -100110 -98007 -94783 -36250 -24071 -70256 -74395 -47338 -37746 -47579
22950 -47579 -2818 -10867 -38008 15365 29375 -38907 -85356 -63219 -61182 -65743 -47992 -12869
22938 -12869 -4343 38569 16572 7349 -17958 -37984 16272 95899 114411 78082 46382 35179
22926 35179 -7464 -42512 -9176 -9598 -47213 -42064 -54298 -41441 -61235 -66898 -78883 -62024
22914 -62024 -55783 -46536 -28165 18475 35030 34394 -4246 -51395 -56177 -63485 -24139 -1038 -8723
22901 -8723 -24702 -46957 -64171 -48186 -20504 -25899 -30511 -65694 -93114 -92770 -60422 -78750 -17172
22888 -17172 3266 -7150 -29132 -98707 -90711 -89329 -112169 -106274 -108854 -65972 -5013 29719
22876 29719 -19142 -19125 -28372 -40513 3553 32466 2893 -3399 -8783 -30225 -23879 17546 32422
22863 32422 23977 -31952 -47998 -2285 16524 -30940 -50594 -34849 854 -13603 -23949 -68390
22851 -68390 -71768 -79966 -45907 -42289 -42265 -51441 -89966 -73788 -82615 -44181 -57622 -53925 -57828 -81719
22837 -81719 -104788 -72729 -36426 -15524 -7675 50394 69496 70901 53110 15478 11615 39546
22825 39546 6697 42913 7447 -25458 -14428 11371 4909 -10787 36628 80098 20887 34716
22813 34716 62187 1374 -5315 10390 3854 -20036 -44827 -50803 -6869 -10950 -60727 -70436 -83157
22800 -83157 -64698 -18193 12176 8273 32601 62291 80115 69250 29443 2569 -16718 2747
22788 2747 -12884 -68685 -53993 -34831 1499 61576 -4939 -22867 -53603 -70605 -41833 -63256
22776 -63256 -83058 -56632 -30055 4669 -1183 20578 14179 -15695 -26174 -47845 -20984 51235
22764 51235 73673 95688 82252 -21558 -65525 -77830 -34382 -17077 -17926 -23890 11245 11508
22752 11508 46392 27042 22160 -28868 -42822 -48270 -55795 -89647 -54365 -12933 13636 21669
22740 21669 -25287 -43540 -59364 -61231 -42976 -28457 -44923 -20779 -10077 -29892 -57459 -62659
22728 -62659 -40890 -44038 807 22875 16942 -2578 8287 -30255 -43392 -56344 -62892 -74947
22716 -74947 -97964 -106659 -83513 -57956 -31291 -38000 -7172 29802 -1286 11551 -3286 -24647
22704 -24647 -33708 -43091 -95829 -119733 -143648 -85877 -54560 -24316 -189 -15055 -57434 -61775
22692 -61775 -61453 -62016 -9754 -27579 -53709 -95295 -71421 -7727 79236 64145 38179 58323
22680 58323 81125 988 -43368 -67120 -91221 -101477 -95620 -73820 -65351 -53982 -92090 -103986
22668 -103986 -78993 -5245 -19499 -68295 -95203 -76317 -40954 -4106 -14302 -12760 4686 -4743
22656 -4743 -61381 -120286 -104304 -93970 -59987 -68032 -83540 -81852 -55242 -10224 -58800 -110096
22644 -110096 -117812 -85954 -112559 -50946 -17203 -23275 28148 13504 -23181 -65066 -72337 -68311
22632 -68311 -75759 -49301 1045 68442 41512 -39657 -108899 -62246 10789 -33867 -74311 -97436
22620 -97436 -128856 -121484 -59741 -41399 -44960 -47071 -73518 -57273 -30007 -34410 -32352 11974 10742
22607 10742 -20414 -32955 -31468 -57284 -28895 -16212 17470 54590 28191 -47094 -76767 -61180
22595 -61180 -16653 36432 25433 -19722 -30134 -10641 -47100 -13759 18133 4208 -65774 -101194
22583 -101194 -56703 -41105 -39767 -31310 -60737 -35291 27319 10230 17095 45475 71184 95298
22571 95298 63312 14149 -4733 -9702 -3995 7606 73917 25327 -10409 23629 -12815 -37537
22559 -37537 -49742 -49795 -25681 -47436 -12739 35516 41686 -17194 -42755 -48297 -50230 -83422 -56429
22546 -56429 -17117 -13341 -61399 -90395 -110773 -108363 -119680 -137140 -85169 -24342 -29874 -45634
22534 -45634 -105704 -170093 -125698 -58602 -18045 3224 -7645 -39834 -47765 -57016 -26383 -47154
22522 -47154 -31113 4080 6306 63667 94471 74630 23695 -32795 -12753 26633 15636 -23153
22510 -23153 -26123 -59600 -62537 -29605 -59402 -121830 -153011 -85664 -63577 -111038 -140337 -104486
22498 -104486 -93172 -63722 -56314 -34214 13439 17378 12358 39360 50542 1250 -29619 -14882
22486 -14882 -57015 -62364 -5737 9282 -31359 -27746 -53154 -66467 -65184 -60326 -29863 -23688 -55573
22473 -55573 -50717 -22998 -45235 -73352 -69240 -75672 -103420 -72425 -6973 -15347 -34291 -68916
22461 -68916 -32934 15149 15056 -21637 -45566 -17380 19913 30088 82014 102838 58998 6099
22449 6099 12349 28596 37903 50013 28270 -4415 -50817 -64639 -63236 -51099 -16130 35756
22437 35756 -21378 -61158 -56314 -58930 -82124 -77670 -70337 -89907 -70845 -39292 -47453 -83331 -25016
22424 -25016 10917 -34444 -34332 -43994 20764 48844 54854 -19792 -78678 -76212 -86597 -78869 -45305
22411 -45305 -50561 -32995 -6807 -63460 -53313 -75990 -46263 -70008 -122655 -127114 -136574 -130118
22399 -130118 -101930 -64239 -1504 -1340 -17811 -7896 3312 -9088 -15139 17957 5396 -60183
22387 -60183 -69088 -15061 -31983 -109206 -87891 -85616 -71094 -31213 -20291 -15986 -81227 -81437 -20395
22374 -20395 7916 -27382 -14530 14103 -7580 -48400 -57461 -52943 -65241 -62830 -83395 -100236
22362 -100236 -123371 -79087 -44100 -83082 -93880 -111122 -101227 -65064 3918 -14687 -82189 -74270
22350 -74270 -43856 -30125 -13262 -24404 -31713 -10866 6478 -28831 -13873 32177 -10507 -26596
22338 -26596 -1906 36325 -6346 -40956 -5407 9186 -63169 -64345 -33757 -58306 -79011 -58489
22326 -58489 7322 21614 -4288 -50923 -85096 -107487 -110127 -89029 -51408 -66649 -68941 -94535
22314 -94535 -108044 -65193 -20037 -4522 16431 13800 -82285 -97679 -56210 -33395 -18975 11445
22302 11445 4311 -5451 9182 6671 -891 12693 -44103 -96671 -70573 -32316 -37819 -55521 -15936
22289 -15936 -35555 -49185 -17597 -38900 -78477 -32613 12963 -3366 -863 -14387 -5818 -3330
22277 -3330 3062 -47268 -75340 -85112 -115779 -89655 -40272 -49399 -49843 -14942 31187 -2907 -7453
22264 -7453 -33147 -44492 -50219 -47557 -7773 -11608 -44489 -65741 -89797 -55954 -24826 25407
22252 25407 90321 89744 50456 13779 15049 15803 43569 57108 5603 -33127 -29282 15177 29591
22239 29591 -10193 -14182 -49495 -8178 13346 -48620 -58131 -37985 -8002 5712 -1080 -16949
22227 -16949 -12854 -58437 -89211 -105621 -45908 -2264 -35588 -61291 -68871 -64018 -34170 17132
22215 17132 30015 18375 -7904 -34618 -46834 -76629 -91894 -71133 -40324 -27354 5312 51214
22203 51214 17217 51069 45658 35901 -40758 -49567 -80678 -90875 -101019 -62920 -51391 -71385
22191 -71385 -64547 -52148 -44462 -72684 -92245 -27844 4233 -38599 -46667 -33233 -9541 13324
22179 13324 29211 11237 20457 23163 -3952 -14419 -18325 -2396 1322 -10814 -23110 -45501
22167 -45501 -10987 21030 6420 52719 92492 67978 17443 34544 51988 26445 31201 20800
22155 20800 -35993 -38052 -40753 -27084 -29401 -5087 47957 58651 13478 34144 16405 -67619
22143 -67619 -75767 -27101 20652 17864 15864 20510 -11071 -43589 -31504 -43174 -8939 13441
22131 13441 -4014 2424 40995 20210 -14341 -35313 -8493 -48945 -93269 -76389 -6618 42378
22119 42378 26854 7556 -18423 -42005 -24941 -18467 23137 34646 16178 -36764 -27997 -11349
22107 -11349 18961 -36145 -46034 -50557 -73006 -54645 -31757 -8045 -15388 -35994 -31725 -86262
22095 -86262 -86305 -90520 -34158 13804 1287 -7437 -7566 -48895 -82729 -77394 -53857 16476 10686
22082 10686 -27028 -41372 -62513 -34910 -9554 -389 -79776 -119826 -105104 -47481 -6393 9951
22070 9951 14688 -38516 -34815 28683 4375 12223 28627 3924 -11611 3817 39608 25805
22058 25805 40608 50214 -10860 -5009 -21431 -30077 -31707 -8144 47315 100143 96946 96181 34918
22045 34918 -23415 -88268 -35202 6786 3281 5901 -3402 13509 -24848 -42148 34736 81731
22033 81731 113144 62612 31350 25653 -24394 -64106 -26867 -5849 -26068 -54217 -53640 -20319
22021 -20319 21948 5318 -5204 -9338 -10700 -18529 -25876 -30705 -11182 3092 15336 16658 9146
22008 9146 -39428 -11231 -959 7938 37849 80567 89876 28774 13156 30119 33667 32545 -8846
21995 -8846 -31287 -11011 -9886 -2866 6138 6056 30202 30873 51019 79970 27735 35043 42860 42784
21981 42784 27088 -23953 -23237 -12421 -19627 -41483 -49767 -52082 -68134 -69911 -40519 -25434 21390
21968 21390 9106 13832 44332 23737 20808 51942 72561 8194 -16514 -17106 -36447 -40330 -14225
21955 -14225 -4435 -46691 -36756 -15099 -7857 -39252 -67078 -109328 -120739 -84779 -54700 -80213
21943 -80213 -85302 -91968 -87730 -104709 -69989 2809 32439 7248 5723 24568 33853 27502 44445
21930 44445 19324 677 5230 3147 25784 11945 -69744 -59292 21134 34344 38219 18077
21918 18077 52123 38068 35394 7967 -19554 -21690 -12484 -29892 -5013 -6370 -7154 -2365 -15252
21905 -15252 -5253 10017 28914 12856 -24227 -1379 -13790 -31369 3021 -17402 -12972 26464
21893 26464 34138 24755 68006 27021 -52835 -75632 -52355 -76233 -20440 30603 50619 31668
21881 31668 25069 -20741 -42643 -1658 41445 56602 36087 21023 -62935 -57739 -19841 -32799
21869 -32799 -25767 -25505 -29180 -45117 -65211 -76924 -94750 -85023 -41504 1887 24743 26381 18204
21856 18204 33197 -4391 -66434 -81881 -55485 -67228 -78371 -46896 -20819 5211 -23614 -72688
21844 -72688 -95329 -113982 -117992 -118156 -127013 -124758 -133897 -77273 -59237 -121529 -159033 -127982 -87999
21831 -87999 -71333 -54393 -37581 3290 10746 5234 -52207 -59210 -43003 -29629 12672 11368
21819 11368 -18965 -12077 37913 31966 -9908 -16577 -46326 -56292 -60382 -48862 -45377 27915 63087
21806 63087 59764 42233 2331 -23777 -4366 3759 -28698 -44593 -30509 -4646 -16002 -17883
21794 -17883 -40358 -38029 -41368 -41906 -49831 -52241 -40624 -30877 -14989 5126 -12378 1840 -3766
21781 -3766 22145 39365 30848 10810 65346 42052 4715 -9940 -13923 -25193 -42644 -49544
21769 -49544 -67864 -52270 -33346 -60515 -53759 -42852 -19250 -4095 -5447 8120 39510 48372
21757 48372 45602 23019 -14636 23604 5626 -28588 -6830 28812 23917 -14897 14431 32750
21745 32750 40679 32576 27704 12635 39628 62006 -202 -24383 -31294 -21075 -45108 -69655
21733 -69655 -62289 -51910 -30197 -40756 -47543 -35960 -9821 -32373 -76811 -87436 -44383 -10896
21721 -10896 -21494 -40899 -31971 -52404 -57580 -33918 -7919 13968 -24653 -57033 -76947 -76683
21709 -76683 -56540 -77717 -86394 -52992 -3308 23750 32336 14530 20817 -29032 -54784 -65599
21697 -65599 -92840 -101217 -93909 -98752 -52904 -22061 -8376 -39139 -31866 -32870 -49381 -10872 -13788
21684 -13788 -12348 32036 62879 65007 48074 36751 8236 -18939 -62472 -77526 -74580 -91987
21672 -91987 -108298 -63666 -39977 -30385 -53363 -43764 12372 59542 35473 -26044 -24875 -26376
21660 -26376 -28660 -28342 -52080 -55423 -43860 -10957 5986 51287 93112 22996 -50426 -15137
21648 -15137 -8186 -26359 -32238 -65753 -25785 20676 -6649 -28765 -49977 -37498 3211 -44710
21636 -44710 -45279 -54841 -60890 -52891 -33823 -8127 -20325 19587 43160 57924 69477 51061 10247
21623 10247 25690 17815 34702 19304 24660 -723 -42252 -96242 -135189 -119684 -95082 -103314
21611 -103314 -128680 -105299 -81895 -74740 -78174 -57967 -34499 -11850 -24198 -51936 -87556 -67536
21599 -67536 -42770 -35743 -43752 -58148 11461 -15750 -31868 -53383 -85070 -80617 -18853 7011
21587 7011 -33961 -59342 -31002 -64764 -100183 -105891 -106606 -69521 -83384 -104607 -66044 -57808 -99589
21574 -99589 -71857 -20535 -46790 -49321 -52506 -72566 -30577 16389 -9905 -18114 -14585 -13350 4533
21561 4533 -33184 -116104 -132821 -138397 -134279 -48419 -14693 -6139 36276 -2213 -17076 -1547
21549 -1547 738 -42332 -70120 -58304 -70211 -96120 -72128 -51713 -43270 -45468 -26565 -24502 -31128
21536 -31128 -28318 -29009 -42151 -17512 6807 9202 27375 23152 31875 38585 80799 110567 79924
21523 79924 1167 -33125 -17541 -6987 43557 -2503 -52211 -40965 -61057 -32440 2073 -27036
21511 -27036 -26333 10159 47064 40819 2743 -83162 -101846 -120352 -92040 -66802 -44168 -20725
21499 -20725 339 -19871 -35736 41933 70701 70280 54775 33531 8779 -4908 11780 -25062
21487 -25062 -28984 -35623 -13039 -13405 5578 5078 35006 29722 26683 12752 -25803 -73686 -76854
21474 -76854 -47789 -4417 29322 -11163 -47970 -78057 -93617 -69728 -42209 -4734 9520 19735
21462 19735 3658 -21173 -5663 -4481 -60546 -98253 -46935 -44629 -3833 706 -6414 -17029
21450 -17029 14050 23080 -3716 -7242 -55468 -79046 -63370 -97755 -110545 -84256 -57587 -37555
21438 -37555 -19721 -8887 29297 -3873 -40921 -41219 -12639 23912 22889 -1918 -63000 -33098
21426 -33098 -10821 -42612 -39499 -62780 -56549 -15548 -49374 -78251 -50562 -40567 -37702 -80969
21414 -80969 -81573 -52983 -51115 -39613 -30928 -28381 -38809 -42455 -71887 -61797 7496 31564 54906
21401 54906 42027 -11968 -35532 -32839 -19698 32474 37744 -2354 -4386 -34279 -68751 -33784
21389 -33784 -41304 -58721 -37850 5410 -2534 -32867 -51096 -46405 7019 58450 19064 -24516
21377 -24516 -24474 -32364 -77980 -21973 9555 28317 -17866 -55044 -116277 -139656 -92379 -63689
21365 -63689 -87008 -97663 -91294 -102618 -70095 -12597 -32535 -54240 -79022 -75229 -23349 -16468
21353 -16468 -64084 -58293 -9502 -21741 -66016 -90977 -79241 11386 33953 27632 -20782 -72665
21341 -72665 -104879 -64556 -13568 -1332 -17799 -27562 -39654 -39067 -38574 -33971 -41663 -5135 -449
21328 -449 -25493 -50187 -459 24157 -7891 30138 449 -6434 -41248 -53979 16232 58329
21316 58329 16698 15460 -11335 -38562 -67826 -41680 -61254 -85427 -98939 -41865 2371 -26866
21304 -26866 -86607 -106602 -38753 -8071 -12748 -48777 -57383 -8709 10198 -11002 -38597 -14972
21292 -14972 -31250 -34151 -8397 -26706 -45222 -29611 -5459 19407 -4619 -2489 -35652 -74551
21280 -74551 -61504 -78987 -15093 28488 69323 32978 -7786 -4397 -14277 -9430 -14210 -34895
21268 -34895 -69157 1934 39951 75410 114387 62916 22708 27059 6141 -36760 1746 40725
21256 40725 11845 -11653 29987 28912 -6095 -36111 -9016 -8688 -22133 19498 84079 126201
21244 126201 107376 74542 36384 38972 54406 55188 68733 67124 65995 29263 -18360 -64337
21232 -64337 -78701 -26600 41777 81456 82629 61353 84652 91049 69145 43827 41311 66806
21220 66806 37381 -16110 -41950 -48397 3787 13594 44215 52652 3365 -62860 -80761 -121587
21208 -121587 -156157 -145054 -137200 -116411 -129966 -126131 -104742 -105039 -57245 20843 31220 -201
21196 -201 26896 86334 108618 91697 72564 28548 20493 57752 52485 37758 62079 87012
21184 87012 107331 62463 21768 57897 72686 65937 65782 84150 36805 -51721 -50418 -21923
21172 -21923 15964 50952 17168 11703 1831 -12898 36299 88331 77439 56329 52614 -36341
21160 -36341 -94556 -134788 -153766 -133811 -100050 -50197 -29049 -28290 -42279 -22536 -27527 -55817
21148 -55817 -54203 -15175 -16663 11493 -21958 -65413 -60009 -17898 26388 12406 -36874 -72365
21136 -72365 -88677 -71216 -50158 -57277 -58674 -3434 -37255 -13165 71776 21924 -15560 -14838
21124 -14838 -33354 -27508 -86682 -58864 -22256 -19984 -15906 -28186 -33324 -63732 -82855 -92157 -143744
21111 -143744 -113036 -84058 -77225 -36732 -6114 -18961 -35325 -23387 -15235 14034 73740 69288
21099 69288 25764 9006 3781 -38894 -43919 -32450 -9275 -37570 -66973 -40908 -51637 -64436
21087 -64436 -41290 7504 53037 65882 87361 100352 87560 27038 -1435 14507 -37897 -69694
21075 -69694 -60856 -16753 35899 25941 29689 38269 12712 -23061 -7015 45386 91912 16776
21063 16776 -41570 -15189 -11361 -6592 -16489 -8416 -41787 -89342 -79789 -58371 -44555 -22186 -39596
21050 -39596 -73204 -80934 -25459 7392 40930 52827 33616 51410 31128 15193 -27048 -79235
21038 -79235 -82170 -49468 -14061 56752 29714 -47246 -55728 -104154 -84155 -52164 -57420 -71932
21026 -71932 -68635 -41389 1289 -5980 -10820 34953 18175 21665 49722 31448 -27896 -60368
21014 -60368 -27467 -8499 -33020 -44251 -65265 -66176 -80230 -55148 -28514 -5368 61137 120952
21002 120952 70834 73885 61948 -6299 -18326 -74615 -82700 -77821 -106463 -156442 -141814 -123336
20990 -123336 -102797 -28915 -71240 -99487 -57740 -17207 12789 29953 8328 5433 -10447 -22822
20978 -22822 -27015 -47319 -33826 -16166 22986 23985 -15659 -33080 -12316 66 -36510 -40250
20966 -40250 -48992 -52609 -20938 -13460 -16458 6383 33718 89710 93480 22688 4130 39119 49823
20953 49823 68858 81155 47231 -11848 7781 18539 -31442 -5742 -47646 -52732 -19926 -20427
20941 -20427 -105390 -53075 -824 36610 26272 26128 30198 28432 -10915 -58171 -82477 -122204
20929 -122204 -87448 -61029 -40907 -25092 -65441 -60649 -46279 -123214 -150568 -124585 -95255 -81798
20917 -81798 -12273 -743 -24295 -31447 -2878 20426 33541 28377 34009 11773 -26119 -39887
20905 -39887 -74584 -80838 -11747 2464 -7733 16717 30567 22695 19314 11825 49815 81249
20893 81249 90059 66953 -17566 -36298 -38348 -73226 -67354 -40741 -42115 -95109 -97425 -101578 -46186
20880 -46186 -39743 -43845 -35490 -25622 -33985 -51906 -43630 -7658 -1990 -53866 -68298 -62274 -28962
20867 -28962 -31941 -21193 18316 -3270 -20973 -55200 -66474 -45891 -8620 -37693 -71443 -36118
20855 -36118 -22888 -38663 -1797 25239 21700 45746 4362 -13438 -37589 -89655 -76478 -51669
20843 -51669 -73749 -20400 -4955 5108 11863 31290 10318 -27541 -83760 -74653 -22166 -8760
20831 -8760 -1932 -38224 -13756 -18035 3853 2250 -3262 -4760 -28629 5103 54355 76495 92046
20818 92046 89445 40902 24045 9986 49463 89119 59985 25608 -33229 8209 63714 52995
20806 52995 34965 33503 -4132 -77796 -99802 -29840 14693 13461 -8063 -27976 -50432 -54706
20794 -54706 -11761 -3834 -55541 -69059 -46518 -53783 -74074 -63514 -41066 -23076 3405 -24289
20782 -24289 1995 4484 21440 3001 -22199 -19570 -25950 -67117 -103012 -114496 -102801 -85876
20770 -85876 -106143 -68934 -22441 31919 35017 -1181 58049 52143 15538 -37027 -69399 -31173
20758 -31173 -812 61237 20821 -2796 -1862 45595 78963 52800 68626 71940 40631 36206
20746 36206 12669 -2622 10932 7156 -13142 22739 17096 21817 30357 54336 64429 23108
20734 23108 -14973 -34915 -33459 -18861 -8663 -36662 -41387 -25139 -44438 -12127 -2278 11391
20722 11391 32883 -31321 -38828 -37784 -13609 -4218 41219 38978 30862 39136 -13784 -17708 11815
20709 11815 5838 10814 8128 -37829 -63843 -44795 -23046 883 18296 2378 21013 42098
20697 42098 89214 109903 82062 8408 -25983 -45451 -61759 3779 14840 10952 5418 5196
20685 5196 -53449 -83002 -69516 -26310 -24260 -35435 -6326 18548 -24763 -11565 75642 58938
20673 58938 -1482 -4971 -1358 -5608 -21457 -71062 -68929 -39570 -42851 -86812 -24990 25656 10619
20660 10619 6264 -12590 12271 37642 5424 28664 13818 20689 50515 73276 50664 15635
20648 15635 14552 6226 -37227 -67140 -32984 -15552 -52132 -78934 -24748 -7349 -43482 -59295
20636 -59295 -48995 -95919 -125088 -81018 -65611 -61749 -74261 -50613 -4879 -1825 -31395 -50955
20624 -50955 -82429 -84597 -73951 -29960 9442 1866 -36763 -26609 -30280 -30933 -57336 -72780 -77683
20611 -77683 -38374 -25841 -27108 -13768 -169 6979 -2376 -8821 -16771 -47951 -84704 -75593 -45195
20598 -45195 -10760 -25578 -32959 -21827 -21867 -35207 -73276 -67936 -43262 -39646 -71964 -85716 -83595
20585 -83595 -84391 -49002 -27098 11833 -13054 7372 68574 94358 70148 7363 -18685 -38440
20573 -38440 -58644 -81151 -50379 -68097 -7779 14698 29087 27322 10608 -31807 -3149 -28597
20561 -28597 -45392 -47075 -22892 11281 -16464 -9718 -19946 -10270 15967 -22756 -65918 -67165
20549 -67165 -91519 -120847 -95302 -29547 -17589 -25002 34376 -1378 -33117 28353 22521 63296
20537 63296 90359 34230 32195 30323 -26660 -22404 -16050 33128 -3900 20503 48307 -31823
20525 -31823 -62393 2402 16946 55075 48520 38309 49823 43750 -29653 -59274 -65936 -59119
20513 -59119 -48423 -39451 -29170 -29213 -6368 -11264 -80349 -131597 -90412 -42967 -5411 23864 18697
20500 18697 22757 22425 -30382 -79872 -69898 -82216 -61751 -66376 -66752 -50786 -39194 -19446 -7627
20487 -7627 -44459 -43005 -15472 -12102 -4597 20248 29052 -5335 -40868 -66306 -51420 -54318 -23390
20474 -23390 41929 37537 2185 -21418 -44122 -62736 -39464 -2428 -33601 8951 27757 16015
20462 16015 -5305 -23591 -8188 3601 -13371 -33762 -39824 -13101 589 -452 2838 -14848
20450 -14848 -60756 -67469 -36716 -43063 -58644 -52602 -109252 -108132 -89798 -72359 -97583 -99538 -56095
20437 -56095 -5797 -23826 -46988 -29681 11081 9861 16240 8161 -10097 25629 50440 30924
20425 30924 -23722 5886 15812 1177 -14437 -9284 -24401 -3918 -56334 -96884 -64321 -75184
20413 -75184 -62053 -70545 -66367 -40084 12053 -20755 -90686 -110832 -73985 -44905 1494 -14474
20401 -14474 -26960 -19846 -7673 -36642 -80845 -127282 -147097 -110064 -62813 18930 28759 27943
20389 27943 31994 12279 25863 66299 51126 39487 15873 17855 -21590 -12802 -29394 -72610
20377 -72610 -63990 -52849 -41216 -58109 -34268 -20387 -31450 -29352 -42407 -75010 -62140 -41670
20365 -41670 -18143 6397 -43723 -82921 -72243 -64231 -59113 -52859 -78752 -51813 -27747 -9133
20353 -9133 -54990 -80732 -43913 -62846 -82893 -50801 -13128 46680 30230 -14171 -1148 17717
20341 17717 -12026 -37646 -28817 4956 11614 -20167 -24514 -61555 -99367 -46058 -8798 38459
20329 38459 59350 38452 -14873 -10357 27763 25884 23722 -48142 -73148 -49289 -28120 12904
20317 12904 9598 -30201 -44662 -24180 -20656 -11306 -11539 -34124 -23138 -9875 14305 12730 982
20304 982 -2608 -22558 -28728 15518 31774 29304 5852 -14268 -13771 -33114 12481 9209 -29588
20291 -29588 -3780 11692 -7011 6349 -64625 -74281 -53930 -15786 27578 44396 53279 46649
20279 46649 34551 26247 37616 28902 -32699 -74473 -132960 -140148 -119119 -122303 -76126 -19529
20267 -19529 -36812 -5498 -7491 -3013 9979 20568 -24674 -38385 -59205 -3721 48305 47207
20255 47207 17934 22880 31039 33539 -3025 -18911 -20642 -15494 -64579 -73229 -11603 -9411 -58346
20242 -58346 -42554 -7232 -16806 -50898 -43361 -61834 -26465 -13701 -11829 -13562 -5170 -11642 -22772
20229 -22772 -40801 -15760 3440 -16773 -43374 -38457 -65477 -55967 -33916 924 -7836 -65378
20217 -65378 -94316 -104813 -64408 -42123 -16547 -52490 -75841 -32443 -46516 -44274 -37913 16162
20205 16162 68826 57710 106872 86829 59442 21160 -9214 -6534 40859 14143 9536 21154
20193 21154 -31348 -38123 -15955 58 -1007 -19096 4251 -8923 -25501 18218 18652 22784 12701
20180 12701 -24526 -18048 10236 16961 3523 651 6442 -18297 -23457 -25621 180 50391 45815
20167 45815 12914 899 -5403 17809 -6360 -15020 -15963 -13575 -13274 -12554 -45336 -52965 -86452 -72488
20153 -72488 -104236 -152174 -111568 -87846 -53566 -14317 -56690 -74712 -50105 -36700 -2279 -13248
20141 -13248 -74517 -105764 -78501 -42710 -33868 -20936 1820 -42429 -78401 -41589 -20057 -55145
20129 -55145 -73122 -52861 -41007 -47754 -12477 -31647 -66323 -53330 35287 89068 28332 17797
20117 17797 40896 19010 -30470 -21268 14358 22727 6483 -44539 -124936 -126553 -101615 -19286
20105 -19286 -9794 -19825 -10874 -17800 -28907 -70957 -94987 -86847 -45724 -70447 -78474 -30570 -19927
20092 -19927 9310 52387 44865 32969 28875 31663 1283 12081 19395 -25236 -53367 -53022 -73502
20079 -73502 -67323 -68643 -17121 -20675 -28501 -68916 -136140 -149844 -89354 -31087 8877 -5229
20067 -5229 -19266 -2755 7460 399 36162 55648 -1216 -34217 -22401 -51507 -13920 28535
20055 28535 63674 52117 36390 973 -22031 19402 8004 57079 58304 29118 -8121 -5077
20043 -5077 -9142 -30321 -61849 -52402 -47803 -49427 -40090 -19685 12437 37089 -8396 -1271 -9461
20030 -9461 -37910 -59327 -48573 -21904 -12705 -38519 -49725 -65212 -66509 -81698 -91228 -79476
20018 -79476 -58189 -51072 -54292 -53860 -10158 -28093 10264 41046 28339 40385 35931 85803 100458
20005 100458 99196 89531 35740 10085 -59120 -79308 -61395 -40026 -2017 -22632 34716 66757
19993 66757 43326 56384 67013 11491 40194 50728 43231 42718 58198 47001 59870 73939
19981 73939 49718 53069 45921 -865 -1304 16255 12107 -10868 -8054 29532 6951 8237 21634
19968 21634 6244 17779 35224 -10726 -57536 -58898 -45634 -53463 -39451 -43818 -92710 -46627
19956 -46627 24019 29457 41411 83647 101443 109582 35383 -7974 -26913 -26014 -19307 -69902 -76338
19943 -76338 -73313 -84812 -68690 -47123 -44415 -28840 -40266 -60796 -43185 -97211 -98406 -84546
19931 -84546 -74145 -95867 -86202 -66624 -61496 -52036 -39657 -47224 -77658 -50007 -18478 -15324 33937
19918 33937 86805 79319 31129 -350 -50524 -51279 7289 36241 14055 12184 38522 26851
19906 26851 35402 14388 -17973 -14359 -852 -29485 -24750 -34932 -35584 -31358 -18982 -12782 -13465
19893 -13465 19791 -27341 -84934 -92173 -34017 -44178 -101024 -64264 -23254 -19072 -7249 -1268
19881 -1268 -61003 -97998 -55817 -11551 -21776 17962 4390 -8768 -16836 -2162 -9012 -37020
19869 -37020 6677 14450 -35661 -44044 16735 26746 12550 26051 49419 17112 -21883 -21661
19857 -21661 135 25525 48953 38489 48283 39450 97370 105045 136713 137020 138323 120010 23893
19844 23893 -38645 -47411 -228 19924 -18419 -41659 53379 98097 119227 43958 12663 19601
19832 19601 -15516 -8236 -37391 -63179 -75496 -65806 -41479 -48657 -53573 -45410 -46061 -15997 -5474
19819 -5474 -18544 -32512 -23035 -29334 643 40982 93553 55489 14158 -1212 -42039 -59479
19807 -59479 -95757 -101733 -79575 -29087 11257 -10726 -22166 -4716 7012 16606 -7832 -31283
19795 -31283 -35784 -20234 -16551 9912 3843 26183 32614 31020 38614 17811 4706 52214 115114
19782 115114 120328 63443 57759 58974 26069 2092 8141 33511 62886 67779 49223 59062 80123
19769 80123 92597 146480 155967 87235 3019 4600 -685 -29166 -37805 -49128 -47908 -17980 23700
19756 23700 17849 -3092 -14330 -40272 -50677 -67151 -58314 -80894 -56451 -63731 -87961 -48748
19744 -48748 -9226 7144 6350 21758 36396 30096 13488 4719 -44731 -68089 -24756 22343
19732 22343 -33902 -83001 -91969 -14472 33659 25357 5313 -3998 -36020 -17042 -3970 -52889
19720 -52889 -55048 -42301 -65146 -53576 3867 55578 44216 13800 -28545 -22566 23844 27866
19708 27866 42133 78299 69783 72530 70024 69910 49142 -1548 -30433 -3812 -10179 8382 14974
19695 14974 17797 58898 51948 -23482 -11894 47392 56049 47256 56730 105790 119478 63793 32359
19682 32359 16471 -17109 5467 31666 2827 -21246 -5631 23812 -33483 -5496 78893 100588
19670 100588 62344 22029 -2717 -6118 36032 41970 25135 7091 30154 56550 94722 65154
19658 65154 34333 35332 23498 44865 -1222 10517 3102 -2094 63907 48093 -3537 9757
19646 9757 -9735 -33034 -35382 -21573 -22096 -30028 -38084 -52660 -33138 -49987 -68653 -14228 -35152
19633 -35152 -28843 8582 24547 24127 40889 634 -22307 -59410 -67370 -46224 3412 45919
19621 45919 10490 -29244 -38343 -39530 -78801 -64674 -80069 -69573 -67838 -73987 -68454 -27102 -38670
19608 -38670 -32051 23970 9305 -96119 -112637 -51516 -6637 3470 -3766 17670 30600 -9698
19596 -9698 -35780 -2805 -2849 -8115 -3993 -27660 -48113 -56392 -97836 -117242 -55302 -7045 7227
19583 7227 2856 10234 73 -18961 27494 79533 30544 -6162 491 8436 -20754 -21158 -63479
19570 -63479 -115164 -109631 -43392 -20687 -35075 -26297 20431 32245 -11240 -31240 -34811 -12812
19558 -12812 -1492 23353 5557 24692 33231 26037 32370 13226 -26666 -32249 -53192 -27438
19546 -27438 -11170 34181 56272 55504 -5814 -33076 -38110 -26315 1311 23506 37898 29040
19534 29040 54818 40309 53533 46087 2039 8244 51060 68245 -17035 -38337 -95108 -118113
19522 -118113 -69482 -34488 -28392 -11844 -26534 -22931 -36919 -33547 10897 47196 -13597 -39499
19510 -39499 -32564 12250 43972 72911 76554 31394 34433 -5066 -24361 -5123 -69799 -79055
19498 -79055 -14107 -8657 -33877 -78552 -45640 -23794 -64916 -83612 -97758 -66299 -26225 -26995
19486 -26995 -10412 -7457 8200 21437 -9031 -60700 -70550 -39262 19596 40344 52697 -17482
19474 -17482 -1121 42752 68288 77463 46052 30527 33196 16080 45138 66838 89335 112358
19462 112358 87719 52150 -2078 694 -27332 15110 40528 24286 6699 -3022 2674 7086
19450 7086 9287 54938 59418 136 -19098 -84939 -76357 -83159 -24481 9292 13695 56226 86238
19437 86238 102959 33785 -4426 23370 44217 57678 24591 13535 -46972 -76150 -54187 -55275
19425 -55275 -51162 -44013 -23577 -5896 -10885 -21164 -16831 -15206 -22776 -34659 -8163 17493 26994
19412 26994 52916 72382 39248 51083 7878 4535 33496 55424 51549 13969 -56368 -69756
19400 -69756 -78510 -59065 -101816 -90969 -67623 -75344 -45898 -57131 -16626 -6434 -27352 11896
19388 11896 40605 95761 143153 74219 -27958 -2329 43054 39493 17020 28381 47873 17631
19376 17631 -15778 -16208 -37055 -65165 -42197 36221 53939 37665 37769 59769 8784 -31448
19364 -31448 -39106 -83861 -77204 -21208 -11005 26508 47223 60686 56210 67851 88824 70865
19352 70865 72067 66846 64286 36431 25897 23786 29118 18084 10913 24994 7017 -4842 17771
19339 17771 30154 44362 69873 92642 90215 48661 -997 9032 2209 8647 -21711 -64140
19327 -64140 -69609 -50320 -21148 -38323 -22218 776 -25928 -14811 23750 -13820 -33983 4155
19315 4155 49888 -14204 -106124 -136822 -119134 -78332 -74303 -52856 -47935 -10690 -513 -25926
19303 -25926 -49484 -22758 -3691 -20711 16336 98869 80544 74321 57618 17101 -17896 -46049
19291 -46049 -83608 -81194 -72723 -86193 -70716 -76406 -80341 2718 48310 66197 83991 72864
19279 72864 42797 40595 16573 13857 21642 34303 2770 -6828 -12671 -4114 50758 -6169 -54560
19266 -54560 -39615 19547 28260 25467 45218 71283 77017 83487 51483 44837 27796 -10990 1476
19253 1476 75824 133250 144177 224567 279724 298700 263283 243306 220383 141603 98009 88777
19241 88777 79797 137274 234587 387392 403183 263706 204513 128990 75133 33494 -21135
19230 -21135 -49658 -33755 -22818 8349 39899 31984 -10876 -6096 -13449 26032 42401 93154
19218 93154 111457 94176 22152 -14421 7460 18998 -10439 5773 3968 1358 57171 90649
19206 90649 49558 5769 39073 64469 54658 77644 55928 38120 66163 107447 118545 97759
19194 97759 72028 59422 65536 43688 24451 -25379 7963 10702 55170 60985 25965 2284
19182 2284 -2985 -22737 -9998 16740 28668 9251 7354 48124 35286 23047 -7070 -1937
19170 -1937 22534 3051 6150 24207 -8815 24754 91139 106376 115437 109565 62501 26276
19158 26276 1874 15967 62743 84092 71791 70700 70919 28677 -34256 -12125 9527 -12997
19146 -12997 -11556 22126 59877 52105 33497 87863 103272 45405 19307 -11791 -50322 -44327
19134 -44327 38415 48614 24953 5429 38915 14176 8132 -6210 -794 -2780 -19275 -19404 -31158
19121 -31158 -78576 -75739 -51429 5894 56347 72284 29811 -4959 21869 52618 58307 43974
19109 43974 -11512 -48160 -70299 -90089 -75810 -60554 -31929 1030 -40661 -17168 14257 25240
19097 25240 -16711 21519 64335 70180 55778 74655 60760 75294 37259 14989 30491 69104
19085 69104 75042 94448 27986 -357 20150 41406 45535 24398 22689 24897 40809 45786 -17626
19072 -17626 -31690 23816 51901 17682 -18456 14716 24774 15834 27671 51915 102448 109068
19060 109068 88916 30546 328 -10300 -8538 4429 14054 16340 37658 40484 20024 -21475
19048 -21475 -67777 -18544 -15546 -30706 -39579 -44478 -22290 -34992 -42364 -26988 -70112 -81998
19036 -81998 -5238 -12606 -74686 -65990 -81836 -31653 20115 10732 -39010 -59135 -70735 -86173
19024 -86173 -103527 -75468 -76166 -76157 2995 28687 8414 -2874 -66100 -71285 -33923 11595 9556
19011 9556 -26535 25015 84333 43181 40757 -9970 -32063 -23696 -23096 6874 13252 27097 45622
18998 45622 79116 101021 71399 49683 64694 36564 23894 31050 44330 60655 74599 66143
18986 66143 7420 -945 68 25607 14676 -55591 -49695 -51728 -17105 -1886 -14107 -17508 -1569
18973 -1569 -71612 -59204 -47098 -27421 -8925 10340 -16348 -83606 -74953 -25156 4331 26229
18961 26229 31288 47185 44250 39474 -3946 15394 62702 46346 -3145 -52332 -23007 2351
18949 2351 23732 39021 22109 13014 -27928 -13819 70057 63714 14382 -49832 -62597 -12149
18937 -12149 27227 -15479 -32630 -39933 -37942 -4992 26679 3852 -1203 42518 11175 -15297
18925 -15297 -39324 -38362 7817 -3522 -9335 12629 29925 53919 38521 -21539 -30809 -18395
18913 -18395 -29708 -57155 -52438 866 -8240 11552 -12723 -14666 20400 6923 6192 2038 -10221
18900 -10221 6896 11100 9441 -2016 -21132 6557 10205 20872 10397 81323 107659 83001
18888 83001 33726 -21832 -48362 -15172 14757 10504 43597 80570 30116 -11828 -46528 -3315
18876 -3315 31983 50102 23980 2134 19123 41178 21501 -4901 12225 37201 17148 -11545
18864 -11545 6510 35235 57572 48960 17573 31307 37576 17948 21433 31091 6404 -39059
18852 -39059 -77315 -78427 -25544 3443 6541 15888 -47317 -49986 -79554 -58520 -13789 15959
18840 15959 -1180 6743 9304 -10450 21104 -1198 -5526 -33904 -81797 -48621 -27280 -8838
18828 -8838 5420 -22343 -19744 8218 -6882 -11416 23585 -13641 -37529 -4527 18985 45042
18816 45042 56802 55708 81071 56201 26435 41477 25123 24276 28552 -31593 -63965 -75598
18804 -75598 -110430 -60290 -7005 -6643 -32354 -50648 -33287 -37448 -28370 -21804 -27896 -41538 -39370
18791 -39370 -57696 -63571 -104248 -114099 -62524 -7460 -29239 -48224 -27684 -11963 9186 -26201
18779 -26201 -2530 -22078 -25977 45501 63924 2173 -49856 -43407 -48194 -40738 -19293 25008
18767 25008 36301 -24110 -76738 -77895 -65873 -67998 -75419 -97025 -80805 -47751 -16341 4861
18755 4861 33466 42080 39358 8014 1042 7102 -26646 -34125 -2138 59454 73367 58893 57874
18742 57874 44759 48645 116173 161432 118447 55134 62015 73325 58002 11331 -11909 -33382
18730 -33382 23313 46166 63255 -9961 -81978 -59339 1003 -7986 11771 -31426 -22449 5965
18718 5965 15497 79415 64468 32632 22263 7650 14002 5360 -8632 38648 74397 118385
18706 118385 166196 134045 63131 23691 32327 70101 80724 156374 220711 289806 333763 349592
18694 349592 386769 404845 387492 374562 368631 335685 359416 395581 408804 342726 297719 265762
18682 265762 233445 152176 86102 69600 37828 11527 -15708 -12508 -16785 -18092 -53624 -48517
18670 -48517 -25477 -2063 9316 44910 15978 1200 47698 14520 21896 27299 49014 40320
18658 40320 39012 30254 1549 -10259 2586 38266 -10182 -28181 779 46220 55823 57986
18646 57986 121749 198588 282328 344846 356628 344130 363300 330713 327891 329913 323262 318820
18634 318820 270301 263707 278670 267576 235541 164324 131031 79979 54285 38916 1629 24705
18622 24705 31396 49144 63533 18742 64433 109630 73565 41952 5447 42905 81029 70326
18610 70326 81327 116479 126650 117365 96728 109681 132554 111140 108442 78063 109288 102215
18598 102215 27091 -42786 -64510 -20798 14343 19786 42151 82962 109816 74398 50733 73540
18586 73540 102763 76428 87625 103275 86414 66245 62818 49638 53756 40063 47230 78418
18574 78418 57318 3137 29682 39157 87444 92751 54655 55813 25140 -16953 -2840 27714
18562 27714 1257 -49053 4463 48843 102785 79217 14938 -10346 33206 50520 38359 15166
18550 15166 38848 62818 100483 58367 10008 47354 69832 78744 43426 36800 106605 158261
18538 158261 167248 201235 140675 126220 96085 86431 89150 99247 123600 128855 96003 41290
18526 41290 -12248 20109 48866 47926 42057 55433 57599 66953 65322 33391 81877 78435 37347
18513 37347 50133 54583 54216 83101 72047 5884 13860 79571 97251 93771 96107 84112 81003
18500 81003 102219 116232 154496 217336 267284 261235 284502 270832 212112 186418 210164 223245
18488 223245 188931 185342 235008 325972 418546 363386 309404 273371 227250 161814 140755 153233
18476 153233 161436 136446 111726 81523 62728 75621 112974 126600 134146 83818 41568 30742
18464 30742 50669 63358 73468 60269 37822 32837 31810 58964 72116 52972 68718 78025
18452 78025 69662 58781 85209 110622 88749 108956 136467 166494 245883 290945 283469 283853
18440 283853 355872 394709 414126 384131 371553 356975 320448 319371 322143 332897 400124 423692
18428 423692 352595 319560 305825 274170 233033 185523 175040 144464 124200 85283 71305
18417 71305 138353 265073 278676 214085 186306 173543 191836 182953 176113 151291 117041 77215
18405 77215 86061 65893 56981 56878 105038 219478 268584 266609 265552 313001 268005 278194 335881
18392 335881 394394 458580 499295 480605 410407 406385 404021 416442 386477 388746 424300 416654
18380 416654 394253 345256 338787 313971 281242 239255 182731 142330 181268 211103 214262 185835
18368 185835 154027 144386 146415 164741 207155 214630 232178 235836 224604 222628 208764 164167
18356 164167 159438 191583 208241 225208 241304 261946 291562 289386 260995 168016 133649 133057
18344 133057 122767 98246 97074 141241 123604 110051 89915 103193 93524 72621 85153 123487
18332 123487 142766 139579 114089 67624 40795 42972 62249 82099 60419 56049 26703 5260
18320 5260 36808 84905 77951 84742 73537 26992 49605 41879 54646 37993 69753 61327 61249
18307 61249 49070 86766 77179 -1322 -51724 6502 73718 138351 170005 147293 122194 68414
18295 68414 -10536 18796 72706 114672 136781 133109 119070 157010 197375 217703 226471 246176
18283 246176 272450 294424 313341 293617 291763 309293 296712 257055 254386 233193 193584 197759
18271 197759 193859 244997 293931 274706 248169 215462 200426 227146 170548 71970 98329 159880
18259 159880 143433 140171 178488 228379 230487 216795 166961 161469 198230 164055 147677 208806
18247 208806 263902 293816 287851 206624 144206 200455 253482 297366 352040 404605 418919 406513
18235 406513 419483 409520 394213 384571 424132 467640 505065 524340 517596 521966 576125 630171
18223 630171 643488 598512 543100 592907 636313 638599 688677 678640 670521 724982 733123 792005
18211 792005 860016 908872 1021025 1201006 1378819 1456537 1416129 1362030 1367415 1361060 1452042
18200 1452042 1674471 1790643 1778110 1749778 1765483 1754383 1795198 1929054 2164047 2455193
18190 2455193 2867695 3339755 3825269 4276429 4732692 5314952 6129499 7404216 9400885
18181 9400885 12518815 17795463 27069587 42032812 58288396 64796495 60522589 52374893
18173 52374893 43173334 36770340 38584308 50023623 65607228 70936147 63454073 51383911
18165 51383911 37417178 23955133 15518406 10863569 8115440 6365788 5204811 4549385
18157 4549385 4237770 4050807 3847024 3556663 3243238 2998581 2838788 2777956 2897104 3148174
18147 3148174 3358237 3395035 3299732 3111127 3011075 3041364 3197886 3501272 3938104 4446317
18137 4446317 4943800 5458881 6039496 6676355 7393511 8416577 9995956 12586387 16984116
18128 16984116 24907271 39105051 59923089 76037187 76983746 68448531 57887941 46998193
18120 46998193 43173123 50319743 66591239 79950704 78727352 67055065 52308408
18113 52308408 35798775 22818216 15177341 10799708 8028675 6211102 4948993 4097711
18105 4097711 3559161 3162167 2834110 2601351 2373221 2114274 1973122 1954771 1978971 2124658
18095 2124658 2248134 2200237 2025075 1792460 1537134 1389162 1326469 1351437 1384108 1310830
18085 1310830 1205464 1051435 949394 774877 616399 559011 509657 476360 388455 364022
18075 364022 332282 334449 312295 293644 255002 256845 267803 203844 200693 219828 215605 244643
18063 244643 248847 242186 190130 133625 112314 110098 116122 160369 205708 196835 214164 282059
18051 282059 338246 491672 600866 645371 606964 527424 396158 315424 308231 320268 401111
18040 401111 417448 356700 227982 185195 218747 191267 179412 242578 318913 344936 360665
18029 360665 333787 265115 254857 285637 304132 298752 338944 351819 377775 340718 304162 324842
18017 324842 280270 218863 135680 138562 136682 155162 206133 155278 112683 103341 107751 102628
18005 102628 98509 106364 100756 114179 138752 205163 310264 429572 478556 393310 282893
17994 282893 276905 278046 339552 447167 492200 473483 483586 422937 359310 377828 428734 473006
17982 473006 530322 543521 520449 554008 516564 521453 485447 481796 549026 498674 476186 483276
17970 483276 478179 506743 536987 559757 609619 658949 619909 623452 600924 599064 560040 504807
17958 504807 519453 549519 541840 553326 628811 700297 670932 647656 684008 723709 748399 768059
17946 768059 810204 892930 977668 1114123 1246381 1423023 1524873 1550456 1568720 1578562 1712331
17935 1712331 1874326 2069933 2229261 2426832 2648462 2878841 3130708 3520009 4055002
17926 4055002 4814357 5888551 7430480 9871012 13960009 21209374 33697859 50375110
17918 50375110 61335130 60566103 53375696 44611869 36226356 34119876 41301861 55863329
17910 55863329 65616659 62262915 51719079 39431542 25765092 16045027 10737907 7872167
17902 7872167 6252899 5301351 4713296 4252358 3926307 3647326 3464518 3347576 3312007
17893 3312007 3294662 3332848 3320355 3290981 3286719 3267345 3243254 3343719 3524855 3738491 3969731
17882 3969731 4162958 4356351 4664065 5192950 5977974 7020903 8494246 10786625 14544028
17873 14544028 21042787 32848674 53127677 77194481 88193707 82620541 70919895
17866 70919895 57503606 46357242 45502240 56003204 71794760 78395995 71457184 58442437
17858 58442437 43086396 27837364 17714674 12024884 8740043 6752170 5527237 4707820
17850 4707820 4118739 3728959 3373089 2979555 2578024 2274875 1993144 1731721 1605112
17841 1605112 1543735 1549479 1540374 1546576 1433984 1203512 979285 876703 800527 712925 607282
17830 607282 542912 498568 429705 351756 291299 310270 317001 268554 206748 164919 190593 170648
17818 170648 180913 194626 215075 224548 236183 224224 186095 151856 171124 187964 163369 157153
17806 157153 170511 194183 173816 111165 30964 -13628 38088 93628 141610 119816 79308
17795 79308 71001 53943 55098 90228 167475 202788 221938 180081 111020 47167 97400 247543
17783 247543 325255 327566 288553 226148 169374 120904 178061 192089 138308 154406 194857 191079
17771 191079 131242 70460 70383 79544 129165 178253 135933 138798 165521 134870 65974 36816
17759 36816 35686 54306 45787 20232 51011 68049 20393 682 24869 44671 77874 115609
17747 115609 95400 30731 25900 74356 170875 230519 222149 151278 111989 110595 131554 224738
17735 224738 284578 309832 291380 245037 152029 93176 84837 61195 86733 102425 103172 92730
17723 92730 112257 120778 111891 93515 85124 78228 95867 133281 92772 64411 93856 107166
17711 107166 78780 93383 39786 292 -98571 -123112 -68103 28047 92642 96288 76583 131586
17699 131586 139712 146926 169926 155982 151190 120566 121819 110566 151439 196148 243272 199453
17687 199453 210883 261760 330413 441215 532887 629321 760782 832857 850385 902154 905914
17676 905914 821665 702256 664559 596984 481527 368831 264157 166454 165134 173183 152588
17665 152588 125417 168661 223147 274298 261824 234830 208264 163420 113929 92020 80346
17654 80346 88629 174047 240603 329713 430283 485431 490165 552388 520973 437986 414022 354156
17642 354156 341202 360991 337014 386881 375618 375751 386652 424927 423827 457923 505837 564879
17630 564879 669511 734742 755199 854180 941398 980375 973382 973132 970565 892330 839666 816603
17618 816603 832214 872893 896440 993931 1131932 1219371 1269540 1302681 1374291 1543556 1551011
17607 1551011 1402026 1267518 1190225 1130685 1092710 1146237 1247395 1367171 1544357 1752478
17597 1752478 1903073 2061911 2190277 2336624 2570659 2872858 3288477 3896986 4730845
17588 4730845 5859946 7452210 9789675 13371439 19181432 29413781 47015977 70194921
17580 70194921 84245490 80702643 67684545 51591239 34020969 21423128 14239713
17573 14239713 10075525 7523818 5860838 4808255 4117324 3701887 3519711 3475931 3429513
17564 3429513 3292111 3101920 2942646 2764449 2637419 2552188 2414407 2289877 2146799 2075198
17554 2075198 2114476 2188896 2350572 2462230 2480724 2580066 2724841 2916262 3147011 3387070
17544 3387070 3629339 3971327 4465843 5169368 6115332 7465259 9407141 12123869 16235744
17535 16235744 22891587 34140360 52658309 76014346 94151272 106388885 113983584
17528 113983584 106111865 85374852 64793200 45314774 29103471 19172807 13553422
17521 13553422 10195618 7967432 6441378 5328651 4549696 3943364 3504226 3199794 2914474
17512 2914474 2609393 2387397 2282563 2212547 2096774 1977701 1885940 1810923 1847486 1907804
17502 1907804 1935207 1967635 1995454 2004106 2055093 2093705 2131570 2186342 2164265 2184932 2215656
17491 2215656 2374626 2630399 3065665 3710128 4591402 5947621 7976465 11148816 16697582
17482 16697582 26797345 42121241 54659447 55054234 46975789 36795066 24764390
17475 24764390 15163170 9607886 6511587 4708165 3565437 2856575 2303940 1879043
17467 1879043 1636600 1424577 1232098 1052457 909423 784483 688535 592660 552741 537642
17457 537642 510161 462218 486623 593486 706305 784635 857757 769185 660511 615150 646083
17446 646083 648308 632268 578832 545375 459966 373576 285608 234686 206675 200939 199875 174571
17434 174571 126542 84430 2880 -32960 21851 27704 72943 75456 36427 24470 50944 37042
17422 37042 6442 18109 64400 73651 26537 -6237 -17341 -48580 -55879 -51992 -97385 -120529
17410 -120529 -80768 -58666 -46228 -31574 -2352 76104 154704 216889 245689 248273 262137 220061
17398 220061 200558 143117 121078 157692 192154 179905 128253 155783 202105 258421 366878
17387 366878 427756 422529 393949 367421 315282 292513 342125 409748 438863 448028 449674 414433
17375 414433 393177 292517 209438 183122 109886 60417 93123 93187 126254 152357 149372 77262
17363 77262 56548 97375 128641 163276 139894 48170 -19927 -11284 -991 -6394 55235 111089
17351 111089 102775 85343 39066 -13874 -28440 -9674 6359 30282 79703 136025 135714 119093
17339 119093 176303 238713 276525 197310 134930 156910 173835 123457 126395 166296 202958 218580
17327 218580 240493 180747 105719 79011 92690 50913 10047 16625 105134 132330 143979 153430
17315 153430 136161 108845 90783 68045 69569 79555 72358 31899 41778 52029 96617 71380
17303 71380 74291 48030 23519 1262 -178 20554 22949 47985 60158 44424 -11059 -60526
17291 -60526 -99058 -72260 -52876 -16249 34590 -11495 -5851 24335 30543 28578 57747 93682
17279 93682 74423 73618 75254 66266 25914 16604 -10344 -59275 -47406 -59202 -76009 -72777 -64043
17266 -64043 -67003 -78287 -40288 7212 -5449 -37705 -30552 -8875 55680 67613 29262 73922
17254 73922 115138 109841 101414 72454 56445 10068 -45360 -9059 19813 11030 23826 39064
17242 39064 -2492 -19701 -41607 -77935 -96071 -95721 -58731 -1960 12325 -1471 -23612 -65074
17230 -65074 -66371 -28192 2377 51651 39000 48658 43265 39274 30112 60980 75145 60430 74679
17217 74679 48355 -4049 -8176 -16454 -1948 -9831 -41140 30216 24816 11989 -693 43155
17205 43155 47682 20883 20901 -19586 -25336 30986 32087 21857 26463 15328 7283 -34252 -72349
17192 -72349 -50709 -15338 -25223 -27659 -18406 -26867 22390 58500 84928 36164 6737 -20627
17180 -20627 147 8936 23657 15896 2061 -5182 698 5298 29288 42180 5396 -4348 37958
17167 37958 91665 90953 48238 -16093 -33449 -22973 45677 78687 62252 -10620 -31732 39293
17155 39293 50100 13308 4677 -19148 -21816 16323 32699 16059 -24150 -818 27631 48311
17143 48311 69910 76548 55721 42793 89235 86346 56123 31211 11109 798 15959 18830
17131 18830 25007 40452 16804 8534 23728 35728 26459 -2790 -8980 17550 36603 4536
17119 4536 -54734 -64560 5423 478 12047 24720 31063 51095 48006 24215 -8922 -2376 4387
17106 4387 -42797 -20305 46214 81379 99843 95574 100801 55576 37664 42479 39146 -7852 -9236
17093 -9236 22300 29947 23793 31191 50966 61018 101908 79808 55348 24207 28328 45538 53799
17080 53799 60080 -6689 22269 78464 89188 58052 7505 32332 42965 63310 88371 82706
17068 82706 82436 111654 116032 66095 82538 175739 210560 237793 329553 347004 301712 246713
17056 246713 249181 253674 162872 112112 97948 88247 64669 30627 15993 -3948 -36083 -61920
17044 -61920 -56910 2886 62196 93034 39677 10144 5911 -2416 37972 53468 -7742 -22490
17032 -22490 26775 34037 53272 61544 60299 84161 72328 81173 58573 69925 126201 120162 116076
17019 116076 138051 154886 143009 129651 186936 241375 295474 309574 393253 464267 478992
17008 478992 501059 438512 332529 257219 220740 198058 154812 82613 59246 60287 44793
16997 44793 106871 120200 95195 37789 36460 21289 -8705 1603 36884 25147 -2628 37615
16985 37615 104131 131733 103320 69823 52554 42586 97136 100397 46669 85168 51823 8214
16973 8214 -34327 -67171 8211 62469 94074 125272 150638 150902 126542 103509 119414 146326
16961 146326 220371 241998 259125 263883 232165 189889 185581 138819 109031 92834 75772 42541
16949 42541 40301 11901 -31518 -33861 -16911 24266 29498 23037 64322 27834 5242 24344
16937 24344 15926 -1207 11870 6906 -24316 -37036 -24053 -31057 12391 9939 -11447 -53366
16925 -53366 -57501 -47892 -17658 29293 -17584 7679 -4494 -37538 -57721 -66145 -55390 13920
16913 13920 60401 75200 51890 22381 68479 68775 43891 37175 81002 143295 156220 133708
16901 133708 95901 52173 16888 11338 47216 87938 81487 75105 98057 45676 -36289 -32307
16889 -32307 32 -9966 4770 31523 59724 48314 37308 48472 118988 127763 134657 128474
16877 128474 118292 93788 132011 177741 185100 185449 230199 249802 232338 282981 365603 447979
16865 447979 560794 766142 976981 1215984 1515353 1813401 1908508 1784087 1592569 1318562
16855 1318562 995668 770769 578108 446462 347094 296462 240500 203771 155966 132419
16845 132419 152109 156188 144351 137241 129639 132416 136556 161659 135018 108666 95441 75528
16833 75528 73384 74892 84544 46651 37388 43130 20110 18491 6455 33212 80043 144210 123654
16820 123654 19140 -16626 -10667 5864 9114 -26116 -41839 4408 49139 47897 79420 73488
16808 73488 90918 90368 120009 114261 93205 44515 11411 -14008 1972 65531 84678 72925
16796 72925 49849 43751 54985 84534 66545 106612 92982 53182 18391 55267 73543 43648
16784 43648 -23721 -45944 15529 109656 114383 88744 97623 87830 68872 -49856 -61217 -18898
16772 -18898 4838 16991 -9943 -29860 -84486 -53683 -9232 -1221 36290 51677 4289 -31373
16760 -31373 -859 -9487 9008 -31201 -33021 -60567 -47464 -28023 -50747 -25357 10223 -12480
16748 -12480 -34953 -38169 -16869 -7295 -673 -7693 -15211 -10046 17073 41329 37289 34505 -10813
16735 -10813 -40021 -57319 -61816 -1885 18497 16665 19785 26119 18489 69025 50633 -2496 -6763
16722 -6763 -1606 43871 98683 155814 122925 71799 57969 52756 45471 10871 -1443 16832
16710 16832 15363 -18532 -52231 2401 75137 99244 89093 66182 111509 141379 157197 146734
16698 146734 89717 25293 6498 44031 92101 97216 95394 73035 66942 65859 80308 61623
16686 61623 12074 5516 -52434 -54052 -43436 -27440 5297 9511 11634 28811 13034 -19492
16674 -19492 20713 82167 62732 20949 52464 74918 90494 156116 125157 66047 45303 8980
16662 8980 35425 60354 67928 74133 57422 30570 47831 16248 28435 54440 25957 22517
16650 22517 27885 6821 11153 28133 -20002 -54891 -37142 31966 25575 -6909 -12532 40551
16638 40551 90709 90944 106951 104030 68794 64589 61613 52356 42072 -3709 -46227 -38557 -27272
16625 -27272 -27192 -18949 -52030 -4736 2537 69200 89531 85236 100618 140420 114718 75646 40632
16612 40632 61072 86360 97973 100549 43521 13180 49523 36894 25325 -24735 -23944 -13168
16600 -13168 9880 36554 3075 14815 81748 56786 -9301 -32529 -16094 -6022 -13173 50059
16588 50059 69216 63313 7069 3873 55083 67540 63389 74021 92171 83343 80403 59148 71122
16575 71122 163005 217902 200231 161764 122772 146961 154914 130826 157934 205892 241753 217203
16563 217203 176177 166025 135376 136800 182790 231996 264388 262573 265173 220129 201837 144741
16551 144741 62667 75290 98960 139723 138162 140502 117756 77227 54323 42356 101287 133712
16539 133712 155950 160814 134044 103168 127960 198924 213173 160617 96785 46102 60799 86862
16527 86862 137936 150864 220878 235293 208948 222304 250214 297413 413303 598213 764559
16516 764559 770124 825824 869921 835499 766538 662773 555529 499682 520884 490626 440516
16505 440516 406501 421225 466891 450468 385651 315041 230763 201603 143603 167711 189727
16494 189727 146226 114216 107596 88984 89635 86429 71677 -6950 468 45085 77365 62171
16482 62171 65097 61724 87016 133177 137970 139130 141539 154053 94896 84374 121412 117498 96689
16469 96689 85528 58477 45533 55083 112136 127333 155520 202735 166782 98063 62362 3370
16457 3370 -22703 12377 47002 104888 164156 146511 101958 73941 71747 -11170 -114892 -133412
16445 -133412 -83469 -102474 -130213 -97676 -52999 -10782 -30406 -79050 -219726 -479484 -707913
16434 -707913 -797406 -715500 -442696 -166005 98383 302943 449927 470484 471189 483096 519229
16423 519229 536222 496142 500171 493979 443411 440970 427240 455369 488123 493259 475753 449028
16411 449028 435213 438517 454223 486744 478331 486037 432845 445250 477711 504668 548105 520638
16399 520638 533679 601937 650080 635943 608919 585664 585066 572581 533821 567802 630299 682378
16387 682378 742143 726839 672649 610244 591448 572279 600185 640899 645313 636962 662429 697088
16375 697088 717805 789383 819582 807560 822320 849305 883066 865868 898154 1007845 1067392
16364 1067392 1123430 1195863 1235592 1283934 1366712 1441040 1518423 1586636 1651572 1741084 1814146
16353 1814146 1874186 1902847 1949032 1999746 2072645 2128563 2202148 2316468 2390246 2489363 2593932
16342 2593932 2691617 2847279 3034874 3162264 3316990 3462079 3669747 3952706 4247232 4509960
16332 4509960 4868442 5352992 5902385 6482603 7118337 7854028 8681392 9672782 10906042
16323 10906042 12404702 14129576 16323111 19160846 22846348 27673389 34010370 42413822
16315 42413822 53672451 68937601 90979904 125220955 180246805 265781713 375491198
16308 375491198 462119999 476858859 427808721 347207987 254330044 173993552 119823425
16301 119823425 85994156 64125094 49286558 38677528 30941533 25299704 21127010
16294 21127010 17995074 15555749 13621647 12085270 10830470 9721080 8749969 7921846
16286 7921846 7155860 6499934 6003256 5504818 5020207 4607091 4266165 3956410 3661856
16277 3661856 3434023 3171014 2978590 2805849 2643033 2462389 2375417 2337972 2246873 2140289
16267 2140289 1980302 1868066 1753044 1684805 1610198 1471488 1330342 1216283 1178383 1144128
16257 1144128 1161397 1111967 1071348 1076368 1028331 1009975 971468 989435 1019673 1024773 970572 932737
16245 932737 909265 899067 883608 826786 800267 732686 707502 672707 613082 601186 601552 606932
16233 606932 617318 613835 567355 535044 505593 459749 411357 370947 403373 458077 444418 415590
16221 415590 400403 403192 348867 343512 372484 436706 384967 403563 456258 474911 468191 461945
16209 461945 450339 407265 372035 312229 303638 308865 321402 332774 325465 317104 278419 233082
16197 233082 172733 108148 102380 123531 77717 48018 80870 78419 88952 38142 -12900 -4765
16185 -4765 -42892 -13210 151529 406687 749596 976998 1006447 883847 719500 615910
16175 615910 576856 576546 569749 527205 501102 458402 461171 469813 458154 468642 389022 317770
16163 317770 352247 392126 368441 363819 339878 297941 306168 289284 292256 297084 297529 284584 282712
16150 282712 312135 341221 316048 299976 329902 372134 311371 244010 241145 249143 247912 263939
16138 263939 215619 226283 250198 251504 271815 327406 319430 264458 222899 256455 219254 118329
16126 118329 95851 118910 116041 134351 119338 171971 215128 224454 158435 72444 5150 -39959
16114 -39959 -48715 3838 79670 150323 178135 115890 31742 -12133 2673 28670 36519 47299
16102 47299 16806 47710 41679 94824 127733 108517 117176 147140 143028 126095 145833 206219
16090 206219 212897 233936 201762 180401 157412 122174 88343 33521 33839 40944 16825 47996
16078 47996 71520 29262 -9383 -2350 -230 -28622 -15356 18864 29497 77397 61160 73280
16066 73280 95161 125207 129055 113959 119830 136536 175842 235928 205918 165259 145736 141612
16054 141612 142881 113842 109474 91972 72570 61028 62794 73055 71885 77581 82708 127180 124403
16041 124403 129270 81397 75561 44333 38931 28195 16421 -3518 -3824 -17116 24691 17743 23829
16028 23829 32563 56124 33698 67647 81622 113047 137067 104736 92161 76181 81569 103725
16016 103725 160606 168334 183801 140730 77431 43055 91240 139874 142148 106343 67467 34845
16004 34845 58114 72981 49876 1671 -39105 -43374 -43987 -19110 -35334 -85091 -55856 -41166
15992 -41166 -1246 12504 6293 22774 30694 27107 21271 28861 40540 46449 31613 6815 59728
15979 59728 49152 8264 -11589 -40476 -2420 23423 7774 -59108 -67337 -50571 -69980 -50040
15967 -50040 -49480 -89665 -58189 6585 41835 42967 -3486 -35918 -7627 54852 53247 46966 25814
15954 25814 23851 44373 67120 42856 17553 -16264 -62332 -36399 -4865 6379 47086 67732
15942 67732 16163 -33889 -62407 -17456 -8980 -37044 -20413 -4943 -40745 -31769 2611 -32481
15930 -32481 -83786 -49407 -38791 -69972 -131045 -167184 -121816 -54918 -2189 19005 24062 21890
15918 21890 18079 27171 49751 36626 -282 -31401 -11003 809 9979 18649 12629 -10099 12480
15905 12480 30340 9553 -12936 -22231 -4035 -6124 -31688 -4531 13522 -5986 -32370 -19015
15893 -19015 -49102 -54788 -22673 -38471 -64049 -60157 -64834 -29137 -39914 -37078 7667 22408
15881 22408 -7800 -60645 -39038 1571 6367 -30010 -31991 1387 -26597 -18275 44105 3866
15869 3866 -35632 -75842 -111451 -65697 -33570 11947 41984 35095 51137 43062 763 -2422
15857 -2422 478 3943 -59390 -81634 -82535 -91855 -52978 11304 31191 29088 49859 9134 6781
15844 6781 -5818 20118 64338 59609 15849 -16097 -24329 -2918 16349 18818 -45135 -56904
15832 -56904 -64660 -87912 -90163 -72354 -11852 5411 57933 97991 91012 99664 56720 18287
15820 18287 -19577 -14523 13059 27190 22415 24992 -27416 -65748 -50370 16305 18954 4697
15808 4697 -20468 -69559 -113632 -27533 22150 19800 12224 -13737 -48695 -25666 34078 10782
15796 10782 -52045 -53114 -45828 -81947 -98147 -57267 -35268 -15085 23528 26484 -175 -14904
15784 -14904 829 -22541 -20686 -33599 -78853 -80976 -34900 8534 37200 13190 -27606 7429
15772 7429 -5735 -2058 -30585 -65322 -66607 -27808 26463 51788 96310 88098 93497 78070 101710
15759 101710 148667 179962 182012 202885 278640 345149 463413 585469 782344 989030 1249928
15748 1249928 1520040 1785238 1847857 1699028 1505934 1229658 949051 708962 513099 400430
15738 400430 277204 180999 155512 126343 67489 77226 87953 62975 66364 63578 104216 56173
15726 56173 -13841 -93218 -102061 -74883 -73090 -36301 39913 102611 96748 63729 53584 47908
15714 47908 2348 -17907 -50605 -69680 -79005 -68342 -4009 59958 -18929 -95576 -106399 -101685
15702 -101685 -64587 -73202 -61244 -48505 -7582 -9328 -85109 -97066 -49102 -19321 -59269 -89390
15690 -89390 -28039 -16927 -16682 26312 34310 56071 63192 81832 79449 57513 41761 51182 22402
15677 22402 -2596 -26215 -48689 -42217 -44394 -39783 -49350 -88198 -82006 -40450 20356 70450 90920
15664 90920 32043 -35270 -21880 -10417 -435 14440 -7208 -5098 42509 62543 52140 1120
15652 1120 -3987 -40655 -66989 -10983 -7156 4869 -45038 -89402 -63141 -59651 -50326 -57997 -65836
15639 -65836 -98087 -95486 -63960 -66263 -116963 -110514 -46327 -38023 -15858 -50025 -94953 -120198
15627 -120198 -110491 -41891 -62204 -75031 -78204 -40053 -14485 25957 69223 92565 86114 28012
15615 28012 11610 6528 32900 48688 68843 49365 29495 -16020 -19280 -14819 -31088 -89648
15603 -89648 -87490 -40641 -28952 -40976 -27296 -36274 -13957 -24989 -18595 -35050 -80121 -86309
15591 -86309 -109068 -89203 -54185 -70790 -73953 -76063 -83277 -12587 30426 -3291 -9074 20103
15579 20103 53079 83217 42250 -43406 -42906 766 34998 41556 38764 14250 3713 -8365
15567 -8365 13904 26584 -1117 -32593 -22830 -61555 -43826 40073 36498 46295 82293 10315
15555 10315 -2 -27518 -8968 -12315 -18823 8087 -27091 -20285 -38721 -42367 -33787 -46057 -15632
15542 -15632 -6348 3555 -2688 -32968 -39559 -26516 -28416 -41424 -70976 -46473 -18507 25992 45917
15529 45917 56733 96874 106942 87138 14111 -45268 -59865 -44826 3844 -1919 -4564 -4401
15517 -4401 -19963 -44778 -44976 -50005 -42436 -18523 14621 2968 -44435 -8915 14564 -4203 -49558
15504 -49558 -98858 -139881 -91614 -77409 -64265 -50761 -51295 -47882 -39216 -67431 -69596 -59833 -92944
15491 -92944 -81910 -30917 -43160 -27550 -12296 -40409 -29658 -29222 -58488 -49414 -22225 -26229
15479 -26229 -50907 -32989 -84567 -106591 -85322 -74654 -58307 -40509 -29656 -94873 -117840 -54113
15467 -54113 -2961 -44683 -79467 -59730 -23213 -79284 -95899 -68650 -15411 -11017 -39664 -59346
15455 -59346 -45513 -62731 -73817 -3917 -25044 -119943 -151448 -180704 -101481 -72555 -106118 -133189
15443 -133189 -151629 -126714 -122690 -98282 -63011 -22339 -24877 -37699 -25529 -29315 -54283 -90078
15431 -90078 -50250 -42706 -46462 -22575 -41748 -783 -9602 6360 -14209 -21703 -91539 -55545
15419 -55545 3762 -22451 -28115 -3439 -10945 -50232 -5019 8537 -17311 16449 33933 29085
15407 29085 19037 1196 -6165 -43370 -95530 -66480 -9678 25046 30928 29845 74842 79955
15395 79955 65971 39063 -38025 -33203 -18216 -35067 -35958 -70052 -79167 -62329 -65858 -53311 -1223
15382 -1223 5937 16473 -57 -45818 -62973 -60079 -28524 -37003 -58218 -51255 -84344 -71293 -37596
15369 -37596 -99676 -144148 -143239 -92169 -101015 -80636 -79308 -81608 -38998 -40859 -72928 -92126 -86662
15356 -86662 -60544 -47327 -38472 -59367 -45138 -65711 -103489 -69121 -33721 -48525 -51713 -59781
15344 -59781 -63504 -104533 -96992 -74978 -38368 -23547 -42460 -69990 -91299 -93532 -126950 -55899
15332 -55899 -20720 -47650 -28235 -7102 -24090 -53444 -74044 -127353 -112280 -108859 -95333 -76247
15320 -76247 -46440 -7883 -4368 78577 62056 -1359 -76851 -179814 -193499 -159453 -93469 -109890
15308 -109890 -99908 -69464 -60940 -26553 -50288 -68269 -50741 -34696 -56925 -54175 -20727 -17192
15296 -17192 -73233 -82658 -54647 -57576 -64595 -87527 -103127 -75460 -56181 -59806 -32754 -12726
15284 -12726 7551 -12228 -54326 -39917 -57211 -46477 17923 36441 -20723 -52353 -78310 -72932
15272 -72932 -65758 -67879 -15654 -2829 -15983 24516 37298 -580 -20522 -24001 -25850 -12176
15260 -12176 -5787 -1877 -7949 -41946 -65643 -37818 11331 68797 53379 10785 -13114 -25265
15248 -25265 -3750 -12893 22642 44284 24901 -39137 -72514 -67846 -21717 -34600 -18582 2196
15236 2196 -17687 -32947 -51295 -41018 -43929 -60707 -88248 -100686 -110660 -112586 -85210 -60696
15224 -60696 -26633 -22270 -40306 -81006 -42932 -49848 -30995 -38035 -87294 -120256 -66839 -13970
15212 -13970 -44787 -53643 -48049 -43789 -42099 -54054 -54151 -51784 -79328 -58378 -62025 -80962 -72310 -47085
15198 -47085 -5133 -378 -25548 -86558 -109172 -83572 -61205 -69075 -89323 -82352 -74617 -43855
15186 -43855 -43642 -31802 5233 12550 40409 72777 32029 8048 155 4271 -5551 50976 55943
15173 55943 20678 -20160 -68969 -67974 -57277 -50679 -19878 2146 14193 22223 55347 17481
15161 17481 1529 1874 53043 76462 63082 23596 55428 67359 44799 39386 23633 30714
15149 30714 -34258 -41320 -61530 -112532 -47263 14126 23458 79846 128845 157804 59548 36318
15137 36318 30830 10311 28321 76121 89998 18920 -49108 -558 -14259 -14363 -2524 -4642
15125 -4642 47816 37087 7644 33677 31526 -31243 -14773 -16623 -14241 -35810 -15349 30812
15113 30812 58700 60566 45642 19235 -17776 -17108 -29191 -9704 25477 44849 27197 17235
15101 17235 12133 -3602 -48061 -69131 -27614 33435 -5763 -44931 -15276 -28373 -31102 -38887
15089 -38887 -60825 -69991 -2317 9166 52843 41364 -4578 -36182 -61757 -47972 -28148 -16474
15077 -16474 24095 70015 49949 -7353 -2837 42363 65843 94478 148006 140486 90583 56558
15065 56558 24194 1954 14742 4420 32019 31521 2435 21304 40446 60085 74650 78229
15053 78229 44315 44767 -30006 -24542 -13401 -15152 -1999 21419 24421 32444 20184 -9575 -11444
15040 -11444 26275 55163 90195 35639 -7420 1648 29235 42839 42940 -14733 -24601 -22781 -7096
15027 -7096 69975 71177 83219 58205 22726 -8336 34259 56187 28478 -29224 -5300 32144
15015 32144 11334 25168 30727 39111 24181 37803 81477 89022 85888 22021 -1986 22796
15003 22796 45500 24719 -24685 -48471 -55862 -31386 561 37758 42744 -533 -25852 -6979
14991 -6979 33557 46054 69133 69261 73196 44302 30511 82627 73710 91609 102965 115602 75967
14978 75967 50619 51687 61033 53822 17831 19763 25727 54036 90863 74990 24682 17066 63635
14965 63635 63754 -5516 37676 65988 109857 124981 94534 104368 104084 115049 130633 95784 67188
14952 67188 103958 113131 96787 73460 1367 -34516 -18823 -7684 -12342 30327 73449 59624
14940 59624 62030 41677 21291 22666 34916 50332 95023 37466 20541 5799 -4034 -2920
14928 -2920 59005 67060 20705 -16140 -42591 -18490 -35699 -32698 -32756 -32516 -34535 -47521 7334
14915 7334 -2252 8902 -11942 21835 41482 -9034 -19713 -6620 -45365 -3714 17895 -35764
14903 -35764 -36826 -7763 -6833 16646 -9578 -25289 23051 11922 -44259 -71304 -27626 -26686 -2407
14890 -2407 25936 23718 4295 -2497 -26730 -50170 -47747 -42698 -20090 27226 43489 47795 1596
14877 1596 -12095 10566 -10068 10069 -773 -14203 31384 39836 14800 62025 90498 35901
14865 35901 17334 -34 4688 -10858 -3537 7005 -4869 -37846 -43686 -34950 -29368 -8960 -9771
14852 -9771 -61855 -60688 -85564 -79084 -65878 -67827 -36226 -11307 26778 -12510 4824 -38544
14840 -38544 -93414 -72875 -34697 -9981 -35029 1299 48765 28282 -13095 27072 35985 37611
14828 37611 68996 25964 19821 50137 27145 -17082 -37349 -15255 -40861 -74425 -27856 13810
14816 13810 7099 32113 28178 7971 41845 57724 65749 17904 16673 41376 3600 -37843
14804 -37843 -31333 -20400 -2120 -67629 -61274 -65105 -46787 -26470 -47786 -25985 -6776 4569
14792 4569 -2271 -8685 15368 50133 83065 75844 67826 82783 162182 155829 96570 104588 104786
14779 104786 57669 9523 -3125 -9057 -35503 -22623 -57453 -34251 -43711 -11511 -655 31878
14767 31878 46301 42055 41628 22742 26336 38872 -2494 -67925 -94737 -110659 -44727 -8917
14755 -8917 -26956 -21951 30967 45793 -5392 -35977 -74385 -90448 -65735 -37054 -17946 -35776
14743 -35776 -20783 -24305 -27827 -34245 -21223 5266 -15486 -50058 -40615 -17567 -45453 -4341
14731 -4341 52348 74556 28257 648 16150 10686 49575 82201 87581 69620 67194 24386
14719 24386 71817 113410 111149 46311 -26982 -75244 -62786 -79551 -126399 -123429 -45179 50160
14707 50160 72380 53210 26637 18056 -25299 -11851 -14582 -15359 -26623 2700 -18943 -71345
14695 -71345 -74172 -23578 -54794 -69614 -70207 -60266 -28719 4927 39855 54808 -9769 -27543
14683 -27543 -18126 -60613 -57996 -60691 -43327 -19456 -17059 -12145 -10352 -44519 -18998 5391 -5102
14670 -5102 -30050 -21467 -34911 -68456 -59277 -88788 -124401 -88510 -67801 -66111 -20968 9653
14658 9653 -47122 -104710 -90871 -61722 -9064 35913 12538 13212 -22304 -49323 -64623 -73807
14646 -73807 -37884 -17222 1042 24205 35257 63734 63826 45244 -25723 8112 18547 564
14634 564 -3505 -34773 -27115 40273 14569 334 -17723 -55822 -41921 -18059 -20129 -7149 -24285
14621 -24285 117 -13191 -48972 -35326 -4445 9587 9318 34840 53732 44841 -18043 -6824
14609 -6824 -35886 -59505 -68518 -61608 -7892 -32769 -69578 -82712 -80729 -58349 -26377 -7658
14597 -7658 -40625 -17117 15764 35578 23109 1763 -24255 -7496 -84539 -94296 -98332 -42669
14585 -42669 -4148 -45982 -20657 -27944 -84764 -86407 -128527 -103891 -74944 -42634 -30564 -40842
14573 -40842 -24086 9476 -36835 -34085 20272 8080 31106 45102 16597 6642 6036 24802
14561 24802 -3311 -70867 -81262 -37527 -42951 -52661 -12861 33807 -1551 -11796 30372 21450
14549 21450 195 -68441 -79233 -38456 -28263 -12923 -24026 -15111 27740 -5653 -34603 -87862
14537 -87862 -62156 -2726 -33832 -81745 -88569 -79337 -71728 -70938 -67127 -82957 -48438 -25192 -33829
14524 -33829 -9997 -38202 -72139 -51952 -44904 -46528 -28656 -6361 -28436 -37173 -55225 -42616
14512 -42616 -26400 -38384 -66278 -88048 -82094 -66444 -65046 -70367 -35119 -15864 -30436 -34080
14500 -34080 -7155 30377 6130 -2564 8803 -5263 -43380 -38913 30326 16394 -16039 -17476
14488 -17476 -33250 7836 41294 -34523 -76644 -73135 -95645 -89254 -106497 -96677 -126608 -118636
14476 -118636 -4566 65150 39603 -27936 -37856 -39192 -15482 -16025 4655 18662 95415 90854
14464 90854 9637 -9453 17877 25909 40205 -202 -4069 -1893 5809 -9139 -22657 -18743 -23653
14451 -23653 -5181 30911 29876 25084 25565 397 -70679 -114467 -107566 -88578 -34856 20189 34892
14438 34892 4665 -42159 -94249 -118404 -74488 -84552 -82051 -15289 -5899 2491 -12201 7797
14426 7797 25218 -27178 -36278 -19495 14753 -35385 -102384 -106839 -46571 -69898 -66769 -59395 -64629
14413 -64629 -95435 -96216 -85591 9231 32559 10760 -28643 -67779 -80908 -82879 -100367 -72784
14401 -72784 -50282 -45934 -30775 -34818 -41524 45357 63634 55992 59220 95173 148701 139715 100461
14388 100461 54940 43109 38635 -3179 -32796 -4374 -14089 -8234 16526 -20026 -33484 2669
14376 2669 51038 26855 -12395 -80983 -107858 -55239 -1664 22150 66129 85268 77722 82985
14364 82985 47461 13035 41327 27246 -36500 -2776 18418 -27547 -48460 -67457 -74748 -76463
14352 -76463 -40057 -48078 14449 6610 -48546 -90921 -86734 -67998 -47002 -39312 -55948 -35086
14340 -35086 52396 40744 24331 1163 -84298 -85310 -138803 -154709 -120467 -100370 -106234 -63015
14328 -63015 -70744 -59251 -65134 -48212 -17854 54928 118537 165724 120272 41795 55484 72065
14316 72065 17230 -13624 -37726 -58184 -38664 -26029 -4573 20925 -19064 -15422 4843 15617
14304 15617 12099 20052 4226 -4064 31298 69047 23343 -27191 -36776 -47058 -53041 -44029 -12364
14291 -12364 13596 3428 49413 21789 5499 26979 6890 -27122 -14336 -23865 7279 6723
14279 6723 -252 -14100 6652 20864 38921 54604 8537 2240 19590 -17166 -28784 -51997
14267 -51997 -58718 -40339 5335 31668 30859 14755 7351 -44629 -53548 -49733 12719 61629 58959
14254 58959 52816 42195 29992 -28886 -33929 -28556 13359 40293 44270 956 -25713 -28557 -62438
14241 -62438 -32696 -6088 -29879 -22847 -35092 -50264 -39306 6307 -53376 -81452 -83740 -87060
14229 -87060 -48446 -10239 13987 67682 53084 70771 50998 4352 6792 -36115 -30362 -28702
14217 -28702 -91996 -88952 -29554 27554 56135 35207 13441 -50178 -6043 40682 9155 11225
14205 11225 53513 100467 49233 40602 81038 74775 58361 23778 -2322 11466 34047 28002
14193 28002 3225 -33418 -2986 19222 18830 23907 26161 4148 1390 -29298 -73103 -92761 -99390
14180 -99390 -88312 1895 54050 40034 49451 46258 3674 -21712 -26105 -32167 -27834 -60793 -54290
14167 -54290 -33899 -13754 40794 34914 -26337 -71989 -41988 -61069 -15530 -32788 -21319 36863
14155 36863 -39487 -56277 -29872 42722 13359 -6933 -3564 29482 47185 29587 27872 4969
14143 4969 -2276 -8425 -4078 -47136 -10552 27517 19542 7947 33206 32436 -12022 -19124 -115
14130 -115 32904 36539 76695 66884 41735 79581 78261 43545 28649 16305 -54173 -46131 -38838
14117 -38838 -6634 53095 51570 21626 63832 58269 32707 15525 14089 -1707 12885 -53808
14105 -53808 6956 29894 1043 -35634 -11966 -5775 5465 -13881 6731 25567 2588 -9072
14093 -9072 -28617 -32472 -23574 16777 80656 111861 43225 27936 55504 38964 4891 -11119
14081 -11119 -13133 13030 46916 46024 24575 6260 1838 30461 9863 -18284 -14764 6860 -23442
14068 -23442 -26223 28659 50259 35389 -1412 13744 41116 6779 -13831 31824 63389 44420
14056 44420 7712 39104 24459 50158 55553 -25275 -27542 -42272 -46095 -45747 -38613 -48418 -73500
14043 -73500 -40171 15579 23967 19 -36025 -57528 -83225 -74738 -94154 -57208 7504 -9607
14031 -9607 -16093 10105 -19054 -34370 -61346 -73635 -75833 -81530 -102713 -85180 -75510 -75751 -86964
14018 -86964 -73759 -40520 -18412 -49587 7879 34638 15274 2394 -34974 -71505 -48322 -15819
14006 -15819 -22581 -48617 -83899 -76901 -61661 -50857 -25388 -15471 -21520 10551 61137 28981
13994 28981 1087 -32887 -14246 -18078 -50104 -25561 -5362 -30691 -5868 19973 -23837 -42396
13982 -42396 -41272 -12966 -26814 -97117 -49675 -22960 -46313 -24050 12936 11291 -2820 -10779
13970 -10779 35718 52844 53301 73168 30616 44202 43263 8236 12998 59658 36849 -18638 -44359
13957 -44359 -38987 21552 26898 -26269 -67356 -19880 14231 17098 -26280 4819 67462 23857
13945 23857 1716 -3179 -3514 13331 30829 4546 19969 44745 53624 22812 36886 25021
13933 25021 -2837 32381 76553 19778 39834 80279 117860 88313 80636 84904 104023 104487
13921 104487 92515 23542 -45582 -72247 -28618 -36252 -41982 10410 18105 12057 10581 -7284
13909 -7284 -343 -8752 -55608 -22919 4399 5492 10797 -5147 -25232 -12116 55575 82565 113498
13896 113498 75419 61425 68777 55222 36513 -12390 -37900 -37960 -17922 -17745 -39581 -48093 -32979
13883 -32979 27342 84462 66519 62086 81249 77012 10874 -17123 -44010 -19410 23693 48656
13871 48656 90166 79667 83954 69442 96150 85526 35161 62531 95031 145783 145734 103129
13859 103129 89076 39396 54487 50852 48308 101899 118908 123761 151596 148389 131659 89029
13847 89029 74786 74679 35265 14552 -2807 42205 106840 91068 84172 13784 26397 61116
13835 61116 52163 59949 95019 29612 26573 87019 82166 13340 -53789 -31482 -369 -34613
13823 -34613 -61503 6970 73742 112725 134790 110378 146287 168538 147252 87910 52993 63509
13811 63509 101365 113578 124074 124409 85692 48656 11215 10201 17066 29885 24464 67850 126186
13798 126186 116036 67516 74417 125677 174613 185844 82658 39291 42934 6498 -3959 -2034
13786 -2034 9249 22211 56958 78636 83642 85255 118701 127479 86849 43486 76866 166809
13774 166809 180356 140484 100711 58105 43891 67715 64269 51611 46227 59148 74714 102575
13762 102575 103818 106438 69587 40782 19832 74325 90252 94716 84875 114399 154130 140798
13750 140798 92448 59596 24971 13932 81480 71875 63126 62798 92561 121324 83148 86969
13738 86969 121393 139614 204941 240634 241634 199438 240062 282323 298923 310342 306896 290153
13726 290153 355669 441144 496086 535587 628134 761168 876737 980842 1042188 1134534 1277925
13715 1277925 1381748 1523281 1637959 1706039 1718318 1623963 1530831 1414272 1262186 1139746
13705 1139746 1019912 909834 799133 697294 591636 501632 430157 411024 443306 386865
13695 386865 365581 381074 362857 354844 330965 229284 240116 266664 203924 193163 203394
13684 203394 195344 179090 129464 78540 98996 148806 159133 170840 170806 145934 95118 111196
13672 111196 133949 156875 191564 173858 126937 102054 77485 95233 110345 110024 155476 139783
13660 139783 150863 172369 169801 190448 217242 226904 232485 241710 187065 136931 154637 157652
13648 157652 149740 147406 188251 215266 222357 234508 312461 352869 330061 277887 218870 129940
13636 129940 89173 138548 183461 182591 224052 263941 226138 246528 278725 268324 288550 232552
13624 232552 207044 216918 239968 257518 253017 198136 141339 145947 110968 150961 177952 134002
13612 134002 91622 88161 95635 122659 190346 215207 228257 254894 239073 232571 286525 351252
13600 351252 382097 422718 441253 427518 419647 382862 369347 371422 366055 298253 282017 297204
13588 297204 260912 227372 235291 263175 278230 271968 262970 232189 225447 269497 282960 245251
13576 245251 211423 208093 211679 202751 218793 235255 217484 200977 217525 213126 186015 171149
13564 171149 139756 166596 182527 177173 190818 216014 235190 288751 277045 226137 155329 174388
13552 174388 213522 238413 228538 193548 169649 179634 166987 184740 241001 299653 275156 232057
13540 232057 186003 178781 149210 168780 203055 185124 183454 192457 191785 195730 195002 235842 253171
13527 253171 237023 179822 175476 212112 245127 198007 181042 173701 175587 173359 178727 218959
13515 218959 244928 222016 221890 218391 197169 149297 175236 159221 162828 168565 165937 135113 147631
13502 147631 173244 201472 228795 222986 187102 148397 158999 153654 146102 157539 213633 238437
13490 238437 206452 175948 174757 162293 179901 236257 232584 156274 164363 184677 204433 227532
13478 227532 244392 221881 206285 217761 216163 203712 202211 236121 254045 262745 241219 213036
13466 213036 235279 199501 181115 210236 214931 173998 190957 194558 158097 121128 90353 137097
13454 137097 132006 148118 176817 215940 232283 211408 195135 202830 178468 148099 158547 113608
13442 113608 90195 118401 92554 129289 221027 221803 249629 283707 247011 226271 225647 225410 175124
13429 175124 179881 201632 166465 135814 150743 159086 153905 154609 123370 79609 107195 103672 104149
13416 104149 137684 171065 206525 215629 161225 151125 145038 134237 162720 168523 154842 156117
13404 156117 165786 165389 200575 223556 238923 178532 149561 122486 135743 120096 97213 88085
13392 88085 127962 166767 174082 224521 161034 128130 160914 192003 180157 151492 121167 73644
13380 73644 103859 158367 115851 113133 117065 115336 149522 149015 150100 137371 149330 170002 87011
13367 87011 44034 79891 107193 53850 41085 85093 126782 117808 122799 156402 142852 113700
13355 113700 155190 190034 124093 77671 77997 80634 67713 52496 61676 91108 128621 155017
13343 155017 163697 164619 182728 127819 139673 146426 154725 120163 100326 107723 106763 79717 97216
13330 97216 141165 185285 146050 70090 77135 106423 95165 128163 143023 102615 93385 97381
13318 97381 94071 81658 86468 101432 111241 122000 105783 34528 12911 59023 91086 104722
13306 104722 107690 147303 196701 247092 259625 236616 226679 239250 212974 186989 158795 145673
13294 145673 163313 141718 138460 150152 142850 109756 141810 230221 245604 190238 186368 201746
13282 201746 172106 132311 159703 191127 188625 173837 162011 143987 169159 159089 150426 179909
13270 179909 137999 72272 60927 64115 79943 116536 109717 130325 174830 152271 139405 148912
13258 148912 177998 164195 187598 160037 133242 183468 228121 221528 176161 129228 91232 82832
13246 82832 116224 135627 181785 123035 127126 144219 85610 98251 90185 74017 81496 57740
13234 57740 55892 115441 166842 118615 113018 132597 92193 96410 111168 106170 108032 129760 123747
13221 123747 152896 145207 142485 126600 100168 121030 151171 136028 118360 132998 128784 104349
13209 104349 127406 129705 93646 81310 96162 96432 48490 53753 87404 37750 52750 54240
13197 54240 76440 97913 80094 90234 103439 150870 160643 201163 190645 154571 154396 143113
13185 143113 120923 115014 97621 89158 84205 104550 118145 124774 169547 181894 123975 122188
13173 122188 112386 104396 140506 98749 60212 39060 31398 34356 25267 34120 81413 66959 101898
13160 101898 123583 42836 17292 31264 4226 -2219 32712 72371 112375 95398 88102 108019
13148 108019 126888 131888 160917 146604 147356 159035 182080 186705 182194 181406 142105 116220 120035
13135 120035 111426 111874 91517 73010 82968 136400 172604 157581 104977 32636 67111 85246
13123 85246 88936 111159 61637 49889 31961 59985 31344 23356 31452 50422 82498 83134 116853
13110 116853 151656 143453 127364 142575 172649 181630 167188 136005 126291 152427 191073 202422
13098 202422 204528 179697 159358 160677 169142 141094 135414 92596 78355 85679 86144 87849 136048
13085 136048 141224 123757 107041 135848 157251 154541 140395 177341 215258 190238 153741 145409
13073 145409 134128 119703 108347 106613 154784 162548 168303 153762 204974 212597 209541 208830 165099
13060 165099 130191 109167 152589 160333 139674 128289 156725 138974 85358 131761 118830 82404
13048 82404 91334 122238 144960 146509 161850 138981 86852 117354 129880 138498 186936 219337
13036 219337 193534 145569 101714 82533 79438 77516 81624 92940 93442 119477 148132 188526
13024 188526 203430 186594 169286 155646 99374 34904 48086 74031 82212 70223 78349 65842
13012 65842 85197 108155 112186 123484 107933 134706 153794 108302 105860 171543 173648 203986
13000 203986 196375 183220 169981 173743 160647 197100 250482 255154 158610 96835 93529 57149
12988 57149 64882 96726 141113 148431 154525 120620 110724 66447 30844 60891 97936 114593
12976 114593 122911 140323 134107 116090 133105 124886 122666 122315 48011 -18545 -3408 36261 58154
12963 58154 64616 78484 135238 136633 91575 93848 121427 131437 140188 151103 156562 104488 89981
12950 89981 85862 129903 158368 121111 137887 100226 54287 102529 141326 132544 129891 104122
12938 104122 106352 142738 137371 123023 106727 111244 115405 66017 48765 97965 143773 150483
12926 150483 135211 152491 143613 104026 118893 143434 109505 107443 111081 88507 88996 49937
12914 49937 45344 68051 67653 69899 58635 29226 69649 121524 110402 118245 124695 88502 69736
12901 69736 80548 92788 112482 159711 160311 141319 157044 178416 216934 175948 109656 67027
12889 67027 91074 101069 171276 157667 136640 96520 101942 160844 202639 198313 168576 120353
12877 120353 87794 84103 100913 128824 142676 98408 120068 79729 47039 92211 69811 36577
12865 36577 35929 36614 83803 94737 82618 46181 70434 152775 184581 107384 45253 37740 85243
12852 85243 77146 72445 120227 106801 78973 62606 46776 85371 137896 98897 70113 61798
12840 61798 91387 129284 126736 116082 102646 82169 104064 144593 154904 196483 199461 156345
12828 156345 140989 174880 143846 98297 101086 113541 144276 125164 75974 42917 54379 125043
12816 125043 144378 131687 150608 142388 105943 117569 91648 71763 142501 184825 176951 138433
12804 138433 148935 175892 190467 170215 133682 126328 145833 145424 162976 202060 230080 194737
12792 194737 171406 185240 162160 133307 161310 208422 174041 122921 78438 142497 172944
12781 172944 195423 177233 176936 191179 187092 186431 195786 165876 98504 85334 153476 133927 150614
12768 150614 169811 110149 96284 88822 94740 108364 93565 108485 140217 150483 149772 174466
12756 174466 146097 87149 128992 197958 181767 185616 165006 133403 169385 197140 166258 125312
12744 125312 56713 50650 90184 97491 89467 85453 161377 217440 232309 211038 180019 131975
12732 131975 106091 122656 187661 209706 199651 194797 168356 148181 185962 194284 174046 189899
12720 189899 202173 217817 176385 142184 162101 222045 200435 172050 116674 116101 98038 60404
12708 60404 80570 167413 180427 258964 262185 200884 177932 106977 108318 122105 115879 165388
12696 165388 223295 186709 172037 144018 118272 166215 170674 131830 124256 115420 134670 186999
12684 186999 229683 243328 265498 233963 149080 73031 111031 120853 140040 148899 198784 217215
12672 217215 256716 289147 284055 300566 299199 282087 252769 225556 216563 193503 158135 185718
12660 185718 192426 195528 181913 209290 215787 177110 160702 141609 189459 193957 170240 179353
12648 179353 187024 201473 216713 221029 221782 208016 256926 303039 280998 268651 284231 306613
12636 306613 299954 276612 239616 217040 211437 227520 198101 194322 177798 178018 173896 179858 193885
12623 193885 201927 203737 219034 183354 210215 189861 147635 122049 132376 173301 172720 187994
12611 187994 242294 234759 221463 192360 168449 194646 211695 219521 252241 241999 244296 255693
12599 255693 259402 290712 301916 274477 196096 153184 178253 223085 173466 162350 214769 248054
12587 248054 254121 256345 255213 196528 202132 246076 251271 309556 315122 256515 251735 251300 227210
12574 227210 248968 286074 319325 292798 264933 256205 259546 272694 268873 185258 195480 232425
12562 232425 266013 276374 256983 242307 227351 225932 246828 271795 283868 293868 351268 424167
12550 424167 460437 460414 422652 401131 391921 378342 353230 354296 283773 264212 269206 258043 248201
12537 248201 248176 262562 307300 319245 297419 287439 306718 245864 218869 225226 235950 298443
12525 298443 352036 358764 310042 275287 240688 205076 199716 199604 211549 247909 298421 318544
12513 318544 301703 313016 327935 321140 326487 301589 245826 220499 235240 255375 254523 256256
12501 256256 227127 248765 267281 218437 232199 250211 260310 287517 271796 253578 205043
12490 205043 207524 257209 275323 262537 262905 261963 282213 248977 232665 244911 266177 257187 227474
12477 227474 240777 237202 243237 253222 273031 308610 299603 326510 300792 331975 342941 330771
12465 330771 312075 312305 351695 339918 298634 304656 300671 301361 313068 324053 327044 379288 433272
12452 433272 456795 412994 308213 312223 327179 329785 342568 355709 332445 345734 397529 415128
12440 415128 386150 391937 449125 467805 480090 469419 421030 373379 360601 348742 355785 331981
12428 331981 335475 308467 298355 307677 272599 303364 342929 377696 384685 340047 337014 374060
12416 374060 397298 380877 377525 361494 319844 291118 276303 302878 335260 317461 308478 325245
12404 325245 423091 471081 451092 446315 441854 378008 361130 347724 316081 326811 321502 349978
12392 349978 366978 397516 378684 357475 407811 459224 413712 401239 379446 384725 383146 360408
12380 360408 379375 395340 435481 433873 466963 449410 441177 473736 435479 440149 441812 436568
12368 436568 426319 448275 466287 472853 467364 466586 424335 383264 370637 365164 338239 333489 365583
12355 365583 404456 411351 414435 457057 435831 414306 447877 487943 467592 496614 516432 504254
12343 504254 451111 443907 433650 415971 401546 431591 473235 502754 493864 495324 496046 543797
12331 543797 529334 526480 458585 454723 526391 551030 552265 514152 478425 494443 493659 492459 460805
12318 460805 446282 476344 483440 470057 466950 531525 572278 525545 502821 536821 540108 560364
12306 560364 557479 582335 557422 502755 485089 464760 485955 572423 570829 510944 526111 527991
12294 527991 547923 559652 576408 572774 566138 560134 545780 508954 515316 543369 547436 551463 596001
12281 596001 559133 574706 566923 549870 497337 451054 481833 540717 583654 579900 557323 548741
12269 548741 556606 612006 608074 578602 583080 606167 577662 537866 564987 573297 589476 602812
12257 602812 600536 608809 603888 603629 670246 692505 661136 653167 689491 698747 699310 713186 738462
12244 738462 727574 722406 736020 676761 657900 697522 682862 703937 747962 772128 737394 768170
12232 768170 827372 779661 729631 692703 713318 774669 770427 719530 704534 763907 805653 814810
12220 814810 812974 783405 733209 743434 722700 767990 797620 805128 776947 820973 850998 866556
12208 866556 850127 817775 816632 848237 864796 882579 898577 848125 782866 763670 789676 837829
12196 837829 855689 831640 804928 815537 828562 791824 824990 903271 919599 881201 915636
12185 915636 941795 942412 947409 936819 917077 888983 869361 947381 945483 907749 947477 990287
12173 990287 997446 1034686 1084068 1136341 1148068 1086631 1065943 1044067 1013843 1002392 1022065 1071816
12161 1071816 1083447 1086729 1047054 1047569 1034801 1043203 1047142 1053201 1096593 1123524 1154468 1201130
12149 1201130 1222776 1138943 1146707 1208815 1225831 1289412 1377709 1407244 1487053 1594218 1690426
12138 1690426 1837905 2087477 2465778 2876784 3212558 3340485 3192721 2937869 2663163
12129 2663163 2353134 2056798 1832649 1760065 1703860 1648288 1542192 1459901 1465283 1485916 1455719
12118 1455719 1510682 1525283 1492544 1488137 1529270 1535417 1501275 1476143 1508893 1505018 1535410 1583300
12106 1583300 1643811 1693983 1716059 1705922 1742841 1838488 1983359 2114337 2186865 2388749 2589291
12095 2589291 2894557 3378953 4122514 5126402 6329819 7463846 8013795 7760915 6966758
12086 6966758 5917259 4817773 3948426 3362120 2990198 2750323 2548004 2428721 2320264
12077 2320264 2158165 2051731 2013516 2012158 2031609 1975885 1934407 1909808 1911701 1888236 1883130
12066 1883130 1895389 1953251 2059120 2078710 2088202 2102539 2102689 2151155 2156010 2170459 2245162 2393504
12054 2393504 2584334 2799685 2991514 3292092 3744334 4370262 5317239 6524629 7717877
12045 7717877 8455415 8470288 7728634 6636344 5533413 4587998 3867977 3399570 3046945
12036 3046945 2839718 2684910 2533556 2510966 2507368 2417240 2343082 2303359 2267726 2303197 2362058
12025 2362058 2335570 2289949 2286999 2332189 2364499 2326879 2309183 2293157 2341146 2321249 2298719
12014 2298719 2362494 2397421 2434993 2489385 2571932 2602511 2653880 2740253 2916630 3103950 3367960
12003 3367960 3779311 4282406 4542538 4494829 4345142 4035375 3693836 3383047 3115568 2936077
11993 2936077 2792691 2642655 2552437 2547819 2536430 2558082 2548553 2550394 2545119 2576186 2620435 2604413
11981 2604413 2583730 2602086 2652196 2656090 2641972 2619446 2582073 2549083 2542901 2581226 2661068 2672009
11969 2672009 2669356 2649265 2649388 2640319 2615539 2672541 2681826 2633700 2639491 2673725 2695534 2722075
11957 2722075 2743270 2657468 2661385 2689654 2701550 2737086 2755750 2763615 2749568 2778674 2723244 2709267
11945 2709267 2733534 2741838 2772701 2769076 2750000 2734509 2688669 2652040 2704594 2748907 2741507 2742045
11933 2742045 2738534 2723500 2750728 2785069 2760338 2740337 2782665 2801627 2780197 2773127 2759757 2734116
11921 2734116 2737205 2681432 2670874 2701599 2715082 2725520 2768843 2763767 2775441 2749315 2727451 2704339
11909 2704339 2712343 2725727 2727880 2741731 2744994 2717351 2693191 2686861 2668022 2685889 2718699 2740865
11897 2740865 2783382 2830824 2776363 2738567 2737836 2710818 2705861 2675525 2673684 2725611 2782735 2792805
11885 2792805 2753991 2681635 2672729 2685155 2689513 2673408 2618372 2559491 2509163 2537188 2608777 2629582
11873 2629582 2629783 2661477 2646698 2633279 2634777 2597140 2572799 2557114 2553310 2565599 2591251 2527992
11861 2527992 2476397 2456994 2471682 2481135 2550629 2513820 2421893 2435117 2407221 2399782 2389775 2366075
11849 2366075 2348530 2365441 2347660 2325469 2329253 2362185 2333650 2338957 2355257 2332982 2304560 2363341
11837 2363341 2350002 2329383 2312944 2274044 2252982 2271654 2268125 2240297 2187083 2194226 2209591 2225159
11825 2225159 2235942 2195100 2166823 2150066 2142976 2101135 2072286 2068147 1986740 2022326 2032352 2040650
11813 2040650 2047505 2038143 2033476 2014615 2051854 2013295 1963146 1909260 1931740 1941148 1924924 1918460
11801 1918460 1959113 1943386 1894715 1833783 1804523 1785280 1756274 1822952 1835475 1830293 1873331
11790 1873331 1882353 1874270 1858815 1845695 1854092 1823502 1818994 1763309 1740419 1716978 1682248 1704416
11778 1704416 1705914 1644438 1597504 1651292 1673949 1678048 1649028 1594973 1637255 1657044 1582201 1571382
11766 1571382 1580099 1558815 1538772 1564488 1598713 1588650 1567765 1566088 1590437 1544355 1530593 1531397
11754 1531397 1517037 1497835 1488903 1499463 1472385 1512109 1499448 1471290 1474893 1455849 1394766 1379530
11742 1379530 1410442 1408899 1335289 1326164 1338930 1377289 1434233 1440516 1422132 1413679 1421374 1394102
11730 1394102 1333873 1327361 1331561 1288727 1266977 1231849 1221297 1244366 1306176 1318728 1260022 1252888
11718 1252888 1283504 1288020 1248565 1227849 1221619 1199682 1201245 1212142 1181719 1150211 1135263 1180720
11706 1180720 1136938 1095203 1125548 1137488 1150293 1163059 1178244 1148058 1146227 1134867 1147236
11695 1147236 1160257 1132008 1083666 1039414 1025373 1030884 1019003 1015368 1015631 1081650 1127137 1130473
11683 1130473 1115348 1056716 1012548 978977 976358 981487 978115 995963 1028893 1013231 1040776 1020017
11671 1020017 966262 961324 957429 948537 998159 1022057 984834 962823 922565 884080 891226 906044
11659 906044 885715 811957 809047 859721 872152 880044 880604 885163 841785 814964 840163 846212 863310
11646 863310 876555 907558 867799 874890 873757 849024 838104 837152 869711 853026 892406 829162
11634 829162 749404 778813 822911 835595 770137 744810 766891 798678 783783 832983 824877 842719
11622 842719 868669 870992 818014 773940 824077 756857 729000 718671 697110 719130 768044 766252
11610 766252 769035 735960 703928 664913 672363 661411 681551 754639 731328 661757 685069 741346
11598 741346 738890 714389 700818 676224 643802 650458 694417 634369 564214 573415 590720 607576
11586 607576 605014 578783 563146 596003 570640 533021 530464 603008 610576 610747 607465 577190 548901
11573 548901 546323 593600 598766 600183 605945 601078 551163 550267 557689 572431 576709 560411 552799
11560 552799 555505 550763 529275 527044 542207 516291 488888 539228 554268 499620 445210 447979
11548 447979 466744 448073 444634 433483 400813 423653 436147 441725 499881 568037 626672 625549
11536 625549 565948 487270 443127 437930 461526 524524 543606 531528 493689 458957 450791 480527
11524 480527 446621 436142 403288 438396 443376 446922 449772 446037 423057 429564 412440 374665
11512 374665 374981 358441 339702 344240 353755 396754 449049 460173 422502 384754 397527 413386
11500 413386 397309 418224 440219 460201 411814 365900 378147 378314 347675 345806 355089 347808
11488 347808 366015 400429 429981 415074 384782 372924 392777 433257 435620 389352 428487 428820
11476 428820 403802 364571 366866 373129 374581 365561 391252 384523 397613 403074 416587 409178 401090
11463 401090 405486 399499 401047 368762 335264 308195 352840 394091 353449 345074 373863 374120 340276
11450 340276 311084 317889 332909 323621 317082 355888 362969 340177 330766 350333 385660 404078
11438 404078 379181 328215 296788 285548 269758 264889 305527 304317 335312 360975 343212 362022
11426 362022 414940 411839 442181 409537 348703 290472 348995 374534 355674 298693 333132 381501
11414 381501 319918 283911 286442 295466 268694 272786 278652 293175 296184 327050 316408 291920
11402 291920 331688 313644 283928 264327 279637 268762 230852 243308 293975 306354 279513
11391 279513 249658 248188 254061 255976 247790 242166 258540 238957 186202 175912 202071 184702
11379 184702 155038 143632 212426 212905 216941 206854 197429 233545 279288 265010 240980 255254
11367 255254 262098 216056 167625 192361 186056 170355 229196 257033 190223 123941 165865 180460
11355 180460 206192 225398 192938 174190 185125 206154 249480 269521 247055 204319 250738
11344 250738 218967 204219 249678 242888 232478 233797 141237 145125 168943 141287 184488 185366
11332 185366 172820 182094 143262 131356 198309 226757 220262 259694 226435 258463 256194 222285
11320 222285 197845 190245 199723 207906 192025 165768 141850 162339 195244 169339 191027 191046 206893
11307 206893 204049 200102 220090 224642 186220 137008 143176 77929 113189 183822 143158 134976
11295 134976 161483 181513 189651 141322 150070 188274 207205 199526 202484 159598 162700 128898
11283 128898 62084 74404 77980 97423 137288 143001 196027 189675 152309 157323 189240 228485
11271 228485 219497 191292 186200 189124 129753 134521 194227 135735 132719 170007 159112 166179 152407
11258 152407 121099 110129 89017 64805 104808 111138 93036 119214 155506 199002 236745 187550
11246 187550 113103 78669 82504 153537 145075 156071 153904 131802 121268 140728 154116 150914
11234 150914 119510 129397 134816 137686 164209 145958 112509 77592 66419 84655 124557 170676
11222 170676 181881 152512 137130 116335 87846 94426 58195 79150 115973 123859 93597 99981
11210 99981 125662 118455 88006 86172 74949 110526 149566 129965 124545 129432 112262 119151 146087
11197 146087 111102 78208 84939 101415 95051 145402 126820 90782 78324 55959 81694 81398
11185 81398 63480 69279 58553 15126 29555 112345 158232 126562 134261 120636 96126 151868
11173 151868 139395 132552 149712 176905 150980 132907 114365 78981 76693 80142 101933 111957
11161 111957 105024 100210 111988 134338 123839 105090 95411 87859 85184 59781 29826 28853 30885
11148 30885 32630 -9837 20522 38547 90374 63469 25322 46679 100967 116006 78735 75138
11136 75138 82148 135757 162650 168159 127306 98196 106254 102772 63929 60542 97872 112073 107643
11123 107643 125831 96862 53519 24128 1867 -1926 -52212 -50793 -775 23170 45562 84161
11111 84161 106510 137323 118804 94290 108668 170113 135820 58433 83796 85302 122276 134977
11099 134977 92056 64037 84232 98051 83856 74562 83658 99545 136464 112821 82393 60636
11087 60636 77645 97184 87858 47247 49383 90620 99293 106849 92054 69412 32696 36240 31287
11074 31287 7658 -8253 -14245 -41293 -45291 -31259 30471 50135 65813 38539 44249 104006
11062 104006 87155 20584 -33791 -21623 4094 40733 51403 62874 72596 94831 107964 103474
11050 103474 71271 51066 40240 43625 66615 26861 52415 64716 89676 113110 153308 148966
11038 148966 156957 140252 140550 126608 72415 60584 122365 107888 163211 173485 198520 275102
11026 275102 347117 344486 340148 358695 354415 283421 261666 229373 265457 335217 365092 455308
11014 455308 478122 459429 425396 377998 340476 306059 259507 217892 234394 294746 334327
11003 334327 363623 385183 348085 301539 201508 158971 168003 155784 174596 189327 137891
10992 137891 129289 149073 167048 174857 155370 124937 136325 119111 137258 86018 59161 99697
10980 99697 53679 4627 -5930 -11345 1406 17962 34017 30799 23171 41438 30369 57190
10968 57190 52127 57091 72751 73814 56544 42452 35790 44566 41814 54231 52240 38903 31437
10955 31437 27712 47104 35598 14584 25011 23720 34223 25164 8651 26348 37277 23549
10943 23549 21851 51841 99599 107077 76643 31096 -19639 -23429 -12364 1542 -11348 -22112
10931 -22112 3520 6167 -49390 -60690 -46815 25908 80016 21339 12949 17782 30865 36044
10919 36044 32115 70565 124477 141674 148242 106473 42476 74407 104109 96066 47425 20846
10907 20846 19884 42502 66871 65236 70892 24596 -25986 -13809 -13671 -2196 31303 3172 -32825
10894 -32825 -68598 -48305 -1796 -16008 -37973 -41791 -73782 -91263 -116207 -128079 -108397 -69435
10882 -69435 -65410 -20364 86 20968 25252 6455 -19097 -29736 -53243 -10643 56861 26005
10870 26005 -50877 -81840 -46151 4213 19479 -34590 -44875 -14448 32504 64527 20006 -5477
10858 -5477 -17867 -17603 -37816 -45528 -13436 27082 28243 88417 105894 65190 49766 31269 36458
10845 36458 -25459 -23988 -29020 -14068 22033 60235 58517 20226 41896 60644 30042 27433
10833 27433 31073 40878 35703 -22404 -63291 -64775 -19951 55398 40969 29890 49963 -1780
10821 -1780 -2961 -30902 -39561 -71438 -60391 -58644 -74529 -62263 -92726 -132854 -136322 -100227 -46817
10808 -46817 -59736 -56731 16608 -2376 -39203 -33211 -87633 -128466 -99042 -76414 -73081 -25394
10796 -25394 14794 5727 -31609 -19462 -1427 -49691 -45848 -28941 -11213 -4916 -43695 -95676
10784 -95676 -145553 -96696 -33821 -40864 -57523 -87297 -62576 21373 23127 9152 21283 68770
10772 68770 97682 71586 28807 -3742 -39327 -72695 -53023 -14379 -17967 -32923 -54707 -105174
10760 -105174 -134565 -85081 -36403 -66979 -59920 -69261 -72995 -40881 -38247 -27658 -35119 -27643 -37656
10747 -37656 -52371 -68361 -83878 -100516 -165246 -155231 -177334 -163569 -141507 -135218 -152668 -150056
10735 -150056 -190702 -182252 -154541 -115171 -98711 -39103 -45451 -52489 -33863 -34308 -56995 -84407
10723 -84407 -108612 -87375 -100025 -145802 -173021 -166018 -140119 -132395 -121534 -170377 -149530 -142471
10711 -142471 -131725 -153318 -161157 -180773 -177172 -176115 -99267 -117013 -148462 -161187 -128649 -98910
10699 -98910 -116298 -125657 -111702 -84100 865 17177 3006 39930 -1129 -26483 -7136 -51285
10687 -51285 -86774 -91042 -29216 -19183 -66175 -40397 -43 8469 6676 22833 26618 34973 38180
10674 38180 38113 1538 -6864 4644 2584 -60329 -69487 -50162 -96628 -71874 -26758 -56135 -39204
10661 -39204 -24061 26713 92274 71575 55379 18587 -20727 -24236 -28984 -42235 -12999 65535
10649 65535 23344 -27504 25538 52358 12040 -29620 -29340 30892 26531 34186 54489 110328
10637 110328 145460 121258 80879 117404 163026 224860 212386 250427 299838 380377 471633
10626 471633 558506 640379 743633 822158 893274 999498 1167025 1394635 1661442 1975265
10616 1975265 2387248 2974887 3845464 5128689 6879597 9215370 12337857 16105387 19733380
10607 19733380 22343720 23445866 23159831 21999586 20754668 20185154 20819220 22946598
10599 22946598 27000668 33158038 40865057 48106120 52369511 52667962 49776773 45227906
10591 45227906 40713987 37716586 37102631 39317587 44531867 52663942 62610935 71208674
10583 71208674 74905986 72630551 65944406 57165873 48660655 42300652 38742123 37988124
10575 37988124 39937053 44184506 49553402 53662103 54201854 50813570 44693623 37562706
10567 37562706 31027257 26101289 23121165 21866005 21982789 23120045 24571813 25301164
10559 25301164 24592821 22356007 19104087 15486035 12121601 9378600 7315324 5797183
10551 5797183 4727591 3984094 3449203 2983862 2639402 2403532 2246995 2109531 1942409
10542 1942409 1776327 1597398 1462609 1392286 1295659 1185503 1167369 1100769 1072914 1017270
10532 1017270 943824 924715 874265 804598 775859 765161 761198 698275 656924 646285 654076 632066
10520 632066 632977 627327 597354 540963 508747 500837 484162 473880 472514 462012 388536 389087 383232
10507 383232 359826 300159 341635 387530 399664 350257 295720 268608 273670 248944 242687 253448
10495 253448 202209 186835 214796 262560 295948 270218 239743 241213 215342 209134 216959 203155
10483 203155 248194 281258 262803 240827 239078 253989 291736 269446 267139 295030 270414 231784
10471 231784 216517 190144 201551 227576 256923 258459 242100 191265 167726 168836 178126 164327
10459 164327 161938 212602 223807 222746 254138 274943 258079 240813 205604 190598 183132 189989
10447 189989 203437 199480 215645 305775 337926 336435 295108 225888 153698 180340 228387 233270
10435 233270 256453 273506 299504 328884 307595 276285 237449 225128 213804 214357 248891 241695
10423 241695 191922 195355 191909 230034 261692 255263 203548 216079 229372 232744 246514 241470
10411 241470 217425 195359 236686 227148 161322 140747 131379 113204 135589 209967 247800 200465
10399 200465 169262 217399 216992 178821 113605 116951 137978 108947 120815 162720 155731 123276
10387 123276 102574 124508 133524 172270 175036 168917 178340 152445 139948 123550 99578 122388
10375 122388 128379 95138 53337 43080 69909 45095 41593 84383 117923 107770 133424 145458
10363 145458 154164 129763 80604 30415 30642 41876 29164 43731 73473 63224 96245 175762
10351 175762 202682 234765 177043 97887 99126 82561 84870 44703 60381 44712 11321 55450
10339 55450 114061 131648 147684 131141 112678 132111 127259 138045 149760 143053 145834 95163
10327 95163 37022 19258 697 22517 25727 67503 140800 175888 135417 147117 102240 89475
10315 89475 86060 89572 114397 176742 216323 193674 175128 150646 145711 208051 179501 109813
10303 109813 109271 140295 79248 45943 96174 147952 162934 155298 118961 115205 94787 80982
10291 80982 48023 114217 102719 70410 81729 120799 129386 161814 144166 115633 78288 59008
10279 59008 46556 56655 60152 69335 51469 54422 20848 80323 105678 36395 4218 -48441
10267 -48441 -16250 13458 51703 22853 41594 12695 -5254 13109 30678 76023 102625 108434
10255 108434 81953 67366 18199 -48712 56676 124524 131768 117811 81032 83554 69107 52019
10243 52019 61489 56115 45059 58707 58034 68949 78489 49612 85040 111663 100030 98715 90761
10230 90761 114571 143797 139521 101801 75350 84120 36872 32544 53714 41710 72176 43151
10218 43151 1514 12536 -13940 -27875 12086 18765 -17873 -27192 -1909 28149 -9538 1501
10206 1501 -16656 -19578 -9011 25582 18666 -9118 39469 7987 -20012 7914 76557 62794
10194 62794 73883 66186 30085 53424 35066 27311 17006 74 -9216 640 42441 61858
10182 61858 57726 39381 23181 35569 64041 67949 111217 114908 102097 99419 114794 132335
10170 132335 117514 101409 132190 135068 154233 174517 214169 222127 230351 276540 380413 405945
10158 405945 390573 342884 290894 288271 310096 330948 304571 333260 352124 392111 422471 395280
10146 395280 401965 425539 332791 295643 270116 250979 267395 275604 308482 342269 353446 347905
10134 347905 306787 257088 231294 179728 109159 48816 42812 90121 112825 126493 148057 148386
10122 148386 98306 89678 96180 108631 48107 13507 50314 75503 81937 62166 68789 22315
10110 22315 85279 116916 89130 30247 5955 20973 29272 52884 61785 58953 57632 -21113
10098 -21113 9912 61790 5627 13131 27186 53847 82445 47881 37450 84059 37953 69131
10086 69131 111329 99014 92104 76231 97012 66674 49395 16992 -1335 -17215 34523 69919
10074 69919 44827 37219 18680 -7479 3765 17856 51358 50542 26071 6173 -47715 -83209
10062 -83209 -35399 -43162 -31952 8728 -18218 -59575 -71187 -88256 -90237 -13664 68238 58347
10050 58347 8100 22395 40702 44035 42492 54140 32633 1042 -755 36191 85531 85003 29457
10037 29457 4673 26760 61348 99720 69406 72871 81770 93967 59946 50259 77639 62500
10025 62500 48563 47173 19442 30181 84712 84962 21380 13930 19627 14993 50320 105959 73351
10012 73351 55438 40811 38197 25201 24423 -8585 48945 31193 58786 101603 105346 110703 61390
9999 61390 57451 44604 11646 -23979 -5713 -23169 -11343 -1138 13635 -13259 -32904 -52947
9987 -52947 -12924 -31480 -29044 -33001 -70565 -103026 -57083 -4865 46062 3438 -21275 -29851
9975 -29851 -27815 -39056 -64470 -65582 7700 38136 67396 42698 32990 44445 55034 32382
9963 32382 26962 47590 81238 70871 31952 24666 42977 22274 15386 41985 65882 91327
9951 91327 97700 67894 63978 45251 -13389 -53083 -8268 28883 73727 75435 46162 15055
9939 15055 -2367 -21523 92 40433 46829 55802 41303 47278 26738 -39346 -36932 -54775 -76350
9926 -76350 -74277 -71750 -49729 -9782 47245 48512 44694 -11979 -27831 4889 2210 60943 69428
9913 69428 12371 12031 -41324 1150 39961 105931 143257 164947 121656 44248 -30669 -66452
9901 -66452 -56212 -2708 -30522 -45870 -6244 -10447 -10035 -4680 41611 56885 63210 39621 38178
9888 38178 -17438 -16381 25743 -6485 -6860 -33323 -31723 -7597 -7336 -2472 11779 2239 -5658 15841
9874 15841 30252 47728 76229 54589 33188 23990 33524 -12538 -70955 -79304 -66251 -14821
9862 -14821 -40612 -71639 -37925 -5024 -48994 -78567 -77175 -34412 15620 71511 30496 3253
9850 3253 50422 20470 7514 18948 56553 -7486 -3157 16339 -15842 -56318 -74474 -67312
9838 -67312 -45356 -6615 15589 20468 -1553 43004 22532 2411 -1471 3674 26433 37781
9826 37781 35927 84611 83086 85060 49988 48767 106186 91978 15269 -10019 -5429 28464 -37862
9813 -37862 -76389 -17502 2026 10446 -4387 -1608 -34004 -35883 -5487 -1405 29427 49822 55420
9800 55420 27109 33921 -29717 6161 47429 97819 111100 82723 1463 -15108 -21407 -31290
9788 -31290 -67978 -74480 -94001 -59797 -46470 9155 -4636 -15663 -23016 -49329 -83658 -52242
9776 -52242 46106 67522 35940 88259 94393 61088 59947 38374 15147 44264 51194 35059
9764 35059 2746 -27288 12591 14913 -5104 -3701 -3007 11729 17844 3318 54353 104696 127078
9751 127078 156902 185031 172568 144096 93575 25298 -41117 -38442 -24171 -998 6787 11225
9739 11225 4126 10936 45408 38915 58219 89993 30230 4988 -52334 -67709 -58188 -69722 -44973
9726 -44973 19907 51839 72010 44083 37313 22096 51852 53806 72937 112940 78157 68132
9714 68132 58283 20627 20520 3489 -42238 -34031 -2110 2686 -3221 16625 39936 15527 23278
9701 23278 4374 -12319 -6367 -9936 -3892 33188 34858 14125 32485 703 -4566 -54361 -101074
9688 -101074 -51909 16245 43389 35865 11096 -50398 -67232 -41351 10441 54708 33626 -19414
9676 -19414 -31555 -22154 -26896 -25513 -19794 7536 47095 22873 -25809 -14630 38527 69661 81262
9663 81262 35187 -20293 -36605 28389 80868 71150 70830 16357 -24578 -25823 -25883 22358 84525
9650 84525 55656 13693 20994 65518 84112 160031 205784 196571 139607 87728 63830 30153
9638 30153 4056 -31647 30852 52387 36102 8909 -23024 -41856 -16682 24435 -6148 -12499
9626 -12499 24018 22795 37644 -20897 13048 41393 -7444 -50182 -77370 -55487 10364 22616
9614 22616 42610 -4259 -86292 -68698 -13821 20023 20538 16242 -1807 -30729 -51283 -71612
9602 -71612 -58561 -32650 -21676 -18415 -40761 -36024 -23963 -16265 39174 31124 -10463 -34626 -89789
9589 -89789 -63506 37247 69869 -3459 -36790 -33305 -6781 -2891 -4580 -9884 46055 28626
9577 28626 43736 71194 79957 107986 87662 21136 33502 61587 103842 113859 73305 39840
9565 39840 7634 -33522 5876 56026 88392 86174 20558 -40915 -20540 8086 47193 74955
9553 74955 34319 -12138 -12717 14027 44990 60690 45603 12559 -19008 6647 72206 65761
9541 65761 44970 -9135 -74402 -78277 -78248 -55151 -29231 -36061 -9188 27073 -10356 -82738 -95391
9528 -95391 -24669 -33674 -79973 -62526 -27644 12112 11764 25743 65233 83133 12887 31824
9516 31824 7723 -31437 21726 32461 26164 6692 18584 47343 40386 34583 35235 -10847 -14435
9503 -14435 10457 32055 22827 -12404 4536 21588 5267 -9466 -7384 -20953 -19366 44385
9491 44385 23423 55953 55641 48424 -1189 -47590 -47749 -56771 -44203 -11909 14713 13599 2352
9478 2352 5507 24958 -15299 -69729 -50646 -51256 -102378 -76643 -10761 -3045 12928 -9463 -52696
9465 -52696 -48897 -6735 -12596 -22950 -55527 -78738 -38019 11812 -30465 -26390 -60777 -62336 -68956
9452 -68956 -36100 19399 18803 7419 -12708 -20514 -40016 -29577 -49945 -117788 -128092 -36326
9440 -36326 9661 32672 65834 63081 10174 -40483 -23662 -2451 -16524 10817 19324 -13520
9428 -13520 -57395 -85425 -89964 -73548 22732 36279 35035 19745 6542 1687 48782 45402 18839
9415 18839 16474 31491 18028 -47399 -32721 -24241 -36385 -1560 48171 14088 -25986 -22017
9403 -22017 4583 36682 15474 -46132 -50382 -93479 -97369 -56878 -40642 -34826 -66065 -48849
9391 -48849 -41746 -35252 401 16189 42330 10358 -8444 -14320 -30000 -23833 -33837 -38210 -33529
9378 -33529 -52514 2564 40133 6851 59699 29114 -41361 -53624 -26380 20110 -2174 11890
9366 11890 -31754 -32770 -54914 -56751 -50719 27297 20337 24924 13199 -22442 -57930 -50649 -10301
9353 -10301 17093 -29914 -98521 -45097 6436 9431 -23239 -83126 -128353 -142892 -94202 -42931
9341 -42931 29349 39050 36956 28813 47562 65526 31894 -21715 -21741 -29854 -42431 -85739 -51807
9328 -51807 -22395 -30080 -39051 -16084 -44533 -34925 -28180 -43286 -31904 -62391 -76768 -89423 -114592
9315 -114592 -95963 -48639 13332 -16794 -65348 -42881 -20628 5105 27733 -3913 -13390 -19510
9303 -19510 -43128 -50066 -70295 -81758 -76225 -60542 -72959 -47362 -42824 -67259 -32593 -46877
9291 -46877 -30307 -91548 -91200 -32623 -54351 -14999 24132 15488 -4149 34050 -1440 -44777
9279 -44777 -53906 -57671 -17379 -8309 36109 19002 19969 2348 -17335 -65343 -65876 -44874 7598
9266 7598 39050 41890 8628 -71845 -84048 -29348 17105 30602 49615 47662 58510 59573 52986
9253 52986 2027 -6072 29627 43412 32089 16152 21588 18683 -18611 -112467 -129441 -53619
9241 -53619 -51454 -21179 -1625 -10913 -70985 -51888 -16692 583 -148 12489 -12098 -3651 19014
9228 19014 27220 -37450 -26701 26653 11281 5991 6931 29614 28673 14761 4920 -17006 -43834
9215 -43834 -30890 -4842 -5954 34673 30408 13690 -23708 -20587 -30307 -62060 -79575 -21751 2288
9202 2288 -13307 -37653 18180 46224 -6863 -85863 -106453 -114724 -103982 -98199 -99684 -96218 -73841
9189 -73841 -40131 -10711 -29684 -26313 -48849 -54627 -65851 -72491 -81639 -32063 -1726 25499 51835
9176 51835 12576 -237 -16668 -49260 -12974 24410 -6521 -20667 19296 20939 1520 -1569
9164 -1569 22791 33839 -21157 -45360 -45542 -80274 -97900 -100557 -86708 -78449 -29163 40525 24823
9151 24823 -47982 -41637 -41868 6409 35212 40193 19465 36179 58289 47042 -24538 -49490 -31686
9138 -31686 19193 36278 8107 12758 31838 43823 30605 -17259 -40063 -29235 -875 -7588
9126 -7588 -64666 -79468 -47079 -844 -12434 36830 9152 -17684 -7011 -19578 -18320 -18511 -3652
9113 -3652 52526 35650 -11363 -42893 -81764 -85070 -58573 -80392 -99552 -61952 6722 -33790
9101 -33790 -76922 -60040 -79658 -60083 -36330 23134 41107 30921 68192 87966 33154 11313
9089 11313 18510 69925 80191 95239 92389 57991 34736 -13415 -33212 3351 -4205 -18927
9077 -18927 11126 5524 -13885 -5842 -38458 -23867 33815 59143 3363 -32515 -30083 -37131 -61856
9064 -61856 -75388 -45974 -63148 -52683 -51901 -48425 -21220 -42648 -71663 -102390 -92278 -33201
9052 -33201 1409 -26579 -70111 -64403 -117352 -108487 -69128 -46618 -14198 -42102 -78031 -71576
9040 -71576 -41461 26445 49095 30294 44114 -2341 -24431 -16951 -4640 26493 53882 60639
9028 60639 51249 35737 13338 -23621 -8400 -4572 -6392 9447 -15394 -2493 -2620 -32395 -21869
9015 -21869 25614 -33959 -42392 -45706 -35946 -86879 -87006 -52013 -30500 -33049 -27675 -20831 18097
9002 18097 42823 77053 112820 71731 56554 71868 87517 61453 54747 30929 2414 41594
8990 41594 10556 7778 -24218 -12868 39381 29984 10933 -23521 -11625 31441 14995 -11780
8978 -11780 -35331 -42846 -3386 32425 27457 -34438 -24705 -48307 -81767 -74258 -11978 23047 -11482
8965 -11482 -41192 -31895 -11507 56047 62108 94129 89882 39575 19336 652 10447 2875 1611
8952 1611 12416 -41495 -43445 -74159 -68108 -21200 38511 79213 63944 25660 48470 73813
8940 73813 32781 -37224 -85612 -91587 -91153 -78309 -63670 -28843 4886 -51526 -133183 -150871
8928 -150871 -77442 -28277 -15286 29350 74693 21718 -34283 14755 20207 -26719 4494 10934
8916 10934 -29269 6580 33359 11508 -11835 -11104 24129 13886 -30986 -69396 -88634 -102612
8904 -102612 -93150 -106124 -92524 -43483 -19970 -24400 4520 -34576 -75471 -46012 13812 -18254
8892 -18254 -126093 -120928 -60415 7456 25859 35741 57199 12830 -45540 -107738 -120929 -81604
8880 -81604 -63875 -62874 -29106 19017 89395 97481 52830 2080 -12072 15521 41831 7005
8868 7005 -22950 -29593 -29939 -70402 -88497 -53658 -3686 -49091 -49230 -9660 42243 12003 -12159
8855 -12159 4257 30174 -438 -9626 -46140 -36482 29664 39016 -2933 -42583 3319 54201
8843 54201 27911 39304 64391 28418 -25808 -56569 -44831 -34465 -40269 -24123 -48591 -26927
8831 -26927 -34251 -61924 -59853 -26236 -50277 -33302 -57926 -100421 -99110 -43139 -43847 -30219 10242
8818 10242 34910 -3805 -38875 -14126 26021 57886 95889 71105 75701 39455 -26609 -40630
8806 -40630 -14602 8671 -24589 -47588 -66231 -1513 9752 -48744 -44442 -40128 -41144 -46188 -31279
8793 -31279 -18491 -40086 -88835 -65084 -25057 10015 -12191 -29198 32577 40483 3921 -17141
8781 -17141 -31981 -42423 -41194 -37910 -60425 -43468 -11868 -3915 -44186 -42801 -90528 -115266 -103543
8768 -103543 -103867 -81377 -50180 -31350 -26987 -34079 -62955 -21123 -3428 -5256 -23286 -4189 22623
8755 22623 -4173 -1077 15289 29230 54590 58014 50947 21773 -19013 -6432 28867 -15187
8743 -15187 -6916 -9664 -5775 10240 -30759 -29338 -30859 9878 29411 51162 26730 28574 36695
8730 36695 67023 44106 28465 33517 75268 119371 84323 50196 61193 39659 26102 5062
8718 5062 -20135 -68228 -60991 -54428 -80714 -43053 -16275 29993 53312 32550 28549 72498 68842
8705 68842 33209 6379 28276 8415 15875 -1877 -48282 -4159 20209 25357 69522 60309
8693 60309 -10522 -25694 7821 -28415 -34312 28088 50907 28036 17228 90765 153833 192964
8681 192964 198532 130779 116419 72475 27036 26029 54510 43418 35695 -12700 -88816 -66922
8669 -66922 -3357 346 -9065 44720 120456 153219 156334 151719 121148 62702 22355 20893 10239
8656 10239 26578 12309 1436 16914 25875 21217 45657 37802 39829 -8237 -35564 -30788 -69287
8643 -69287 -56155 -29819 -27739 10053 30590 34867 -8669 415 13969 5604 53286 52990 17377
8630 17377 -50118 -64255 -3986 1507 33685 35067 44179 106002 148978 135431 94814 45029
8618 45029 16010 29137 47417 49525 38850 55351 41332 11138 -10408 26843 62069 56791
8606 56791 13546 24079 70482 75268 36080 12372 -6224 25337 64292 53861 58796 12226
8594 12226 -27120 51596 85238 96272 92415 109159 49171 11292 7638 -17291 -7067 -13911
8582 -13911 27264 35355 64393 96094 76919 79251 118587 93641 60864 88965 72619 103424
8570 103424 133381 70457 36421 25122 29135 72907 101648 52700 52172 37370 22048 43554
8558 43554 57434 54814 25428 306 10643 -26316 -40014 -38200 -11025 -3035 -4654 -8413 -40736
8545 -40736 -26223 -3129 -12850 20623 58818 55938 59581 33521 38286 74493 69771 25771 38908
8532 38908 76470 74502 30083 21104 18651 50924 54907 81214 77584 33804 -32788 -12124 -978
8519 -978 8542 39457 44176 39614 50627 -15426 -69170 -34465 -27411 -55033 -73031 -87385 -110415
8506 -110415 -79880 -46822 -24324 -7153 -27932 -13532 62872 88870 85010 81401 35779 -3940
8494 -3940 2487 27203 66646 29545 -57691 -85367 -52472 -49543 -67764 -52013 -53852 -50729 -51299
8481 -51299 -40285 -13000 19152 29997 11063 49907 118482 137485 115155 127235 90331 99134
8469 99134 56369 48836 72413 67599 49649 847 27979 73788 84124 107748 83880 47772
8457 47772 39847 45243 52383 48866 14852 7972 -13398 -15290 34190 66481 82747 116940 110447
8444 110447 60947 85355 116655 107197 131513 134699 131578 151177 130212 160722 182351 251394
8432 251394 299149 354978 411014 377294 291896 188914 129504 149973 141501 119057 109687 66039
8420 66039 76206 136449 174758 158437 117895 192915 218853 221236 136270 79501 77796 99507
8408 99507 84850 75078 78135 64612 25637 3262 -20930 -26452 22938 51562 61892 32340
8396 32340 19258 20537 4545 15052 34440 57705 85570 129656 173965 212056 274742 220029
8384 220029 137292 132743 114377 86262 51865 35918 22905 1969 1073 20739 59169 99941
8372 99941 144639 158906 128349 63624 10966 10508 34043 30706 78112 55478 11418 -16214
8360 -16214 -25614 -28771 -5360 20250 72300 82383 69586 88397 116131 201555 216385 212641
8348 212641 215816 180076 205778 293272 390846 492207 568868 686924 905294 1225744 1903183
8337 1903183 3322917 5827925 8585293 9628295 8744988 7103092 5092507 3183733
8329 3183733 2026087 1327225 973624 792430 652416 534254 448452 444929 427213 341472
8319 341472 316458 304765 278216 238174 199946 185380 165901 185115 168738 193889 285694 313465
8307 313465 331992 321985 390031 492928 557411 557782 557357 585472 662681 858249 1082896 1435884
8295 1435884 2040346 3231684 5572254 9971208 15945979 19179667 17975606 14894683
8287 14894683 11006350 6897211 4258043 2820707 2020753 1521736 1138252 919032 804792
8278 804792 672235 608091 569779 543298 603774 616039 579233 483972 371120 298091 238341
8267 238341 240879 224458 241152 237881 269302 290939 304099 305844 308267 330429 345787 395749
8255 395749 436988 547964 584291 721099 1008850 1520944 2467372 4224963 6924428 9036390
8245 9036390 9064801 7771470 5998054 3917124 2369712 1528788 1104492 885640 693373
8236 693373 527854 471996 412997 383650 352721 327542 359491 354192 297903 220766 162582 200089
8224 200089 240872 208243 157895 123922 156047 143762 100823 69978 110829 135362 153912 144357
8212 144357 152407 162817 201346 208068 185381 179583 133932 86016 129427 159967 149783 78351
8200 78351 45798 114410 85559 65205 65732 22078 35177 82272 120488 148000 139414 116549
8188 116549 78863 53673 39765 44462 57598 86102 83734 108430 154857 131061 73407 68752
8176 68752 78447 72482 118653 125054 122907 103912 69690 31288 46284 54261 73516 71684 61258
8163 61258 65132 101793 118927 132481 107469 49601 58934 88622 86969 98512 74801 23799
8151 23799 -11269 -18427 -88176 -72729 -32050 664 9584 44524 81618 88525 61261 22013
8139 22013 25281 76654 95259 44170 66411 58913 79971 41850 11716 -35226 -21642 298
8127 298 27425 11193 -8197 -20191 -52331 -48856 -46753 -1297 70443 71565 90234 111527 88901
8114 88901 18265 11675 -14394 -63002 -16 14465 5886 35002 13004 14351 33884 13453
8102 13453 -77622 -101671 -38733 46350 41237 25595 66674 64059 16125 -19132 -21485 10942
8090 10942 -14720 -40453 -15810 73921 94606 5318 -13084 -26552 -36789 -48854 -77650 -75716
8078 -75716 -48753 -16985 -218 7128 -4052 -72830 -86127 -63256 -37983 -19529 -33356 -42794
8066 -42794 -50890 -45864 -7496 -23649 -21061 28196 10168 11962 23271 30710 -26948 -40695 -49821
8053 -49821 -54479 -77380 -80371 -99503 -79895 -79037 -107984 -96670 -2437 33797 7344 -9082 -7911
8040 -7911 -7119 27386 52292 111179 115633 117148 120663 73494 44111 54658 32644 50988 54565
8027 54565 51053 80278 46346 11507 55317 48739 18145 27442 21905 31514 8005 -6596 -21845
8014 -21845 -19970 -22234 -33083 -35546 -21774 -38585 -27218 -36759 26491 70185 66913 40991 -4129
8001 -4129 -32856 -28837 -16137 -44085 -3616 23755 2558 -3568 -30279 -87787 -89365 -67449 -52213
7988 -52213 -10186 -49522 -39492 -46574 -61883 -55481 -50457 -28679 -16571 -29139 -70804 -71748 -85698
7975 -85698 -45156 -19748 -31394 -8610 -12343 -21210 347 -7041 40252 73774 51561 8070
7963 8070 11946 5288 22667 8761 -38418 -34489 -22591 5101 -39333 -74443 -97081 -66260 -9578
7950 -9578 7925 -26767 -54840 5316 69397 39947 -28004 -6462 29246 11321 16922 -7622
7938 -7622 15236 56192 65953 55763 -374 -50169 -29472 12568 53488 61058 63217 37866 10897
7925 10897 19402 77464 65157 71994 85074 78968 38270 43481 70323 43734 -4311 -1380 22051
7912 22051 19310 40308 22992 -33658 -71871 -8033 44495 10629 -3554 -24943 -52251 -55675
7900 -55675 -54979 -54107 -26883 -59579 -68984 -18524 40406 123773 145719 160740 138503 133245 161251
7887 161251 167455 113277 69459 70025 110507 99462 86335 70845 27655 -3955 -13982 33880
7875 33880 104989 56560 51800 5528 21947 35935 17323 34366 216 -55349 -57688 -39203
7863 -39203 -46618 -40322 -57748 -97039 -122740 -138936 -90149 -67562 -58890 -25481 25063 19758 -13394
7850 -13394 -7857 57130 90985 88180 59580 31509 59760 39546 29227 42234 2782 55836
7838 55836 51241 15911 -46233 -82326 -90871 -56525 -101242 -93954 -67244 -63683 -60700 -58388 -15367
7825 -15367 -35238 -88980 -50834 -72911 -12531 44609 57869 31845 17886 10848 -12824 -15438
7813 -15438 -22962 9173 63485 76911 54447 -12697 -72819 -84880 -84001 -86533 -91839 -107223 -58131
7800 -58131 -40350 -29057 -6942 -13832 -26293 6834 6637 -26590 -12629 18144 -17094 -61231
7788 -61231 -46425 -91086 -31388 -7264 -9667 -4059 -30220 -78924 -65026 -62569 -76677 -54401
7776 -54401 -63930 -75487 -51617 364 -4149 -16787 -18733 -42364 -66399 -13146 16011 13894 32674
7763 32674 -16865 -57039 -33023 -38531 -52621 -20452 20707 46637 40771 29582 76738 64740
7751 64740 79674 57878 28868 36679 23046 -40099 -19808 11470 45688 18622 41178 75176
7739 75176 63620 18003 -12557 -12516 -20394 5946 21000 9246 11442 -12555 6082 -4629 -49906
7726 -49906 -63532 -57325 -22479 -45055 -85833 -111526 -78339 -41248 -47891 -65678 -49710 -22307
7714 -22307 -24899 -49043 -63891 -27517 -7096 -24467 -41224 -42008 -31875 -42794 -70117 -53900
7702 -53900 -3663 -19732 -47772 4782 42357 14470 -49811 -48061 -30350 -73692 -100670 -76151
7690 -76151 -64034 -113530 -74945 -20970 -28675 -43374 -49283 -49809 -49454 -47881 -95080 -72443 -68391
7677 -68391 -42467 -34928 15849 -758 -12427 -12421 -21055 -46063 -48893 -86156 -45640 -50985 -8473
7664 -8473 20900 46057 45113 69271 39750 -5442 25323 652 2987 -29863 28454 51073 42045
7651 42045 4753 -28322 -17129 12660 -8619 -17492 -15960 -5467 -20817 744 -4391 10110
7639 10110 26336 19268 19716 59188 22279 18584 20070 -9383 -51358 -90076 -105288 -104316 -71715
7626 -71715 -26080 3297 3767 13347 -40883 -88085 -87806 -46002 -41681 -49187 -16533 -45085 -44096 -22661
7612 -22661 4482 -2668 -28104 -60056 -69478 -61916 -45703 -5434 35992 36093 -8748 -51110 -77602
7599 -77602 -47085 -62534 -17957 -13746 -10401 -10016 2319 -3343 -42856 -55378 -56124 -45267 -29271
7586 -29271 -13747 -32858 -19202 -913 2033 32921 25724 -22026 -51380 -37145 -36616 -45314 -12163
7573 -12163 61401 53176 -2627 10161 4868 -27341 -47252 -62064 -60135 1707 28362 40437
7561 40437 14803 -60980 -83312 -112310 -133604 -70674 12637 6735 10178 34075 9303 23369
7549 23369 -10117 28407 22999 -33321 -68651 -47596 -34299 -18599 -10286 -51203 -45547 -9176
7537 -9176 20817 -9218 -43262 -15514 5870 13498 30534 -26344 -9064 -12871 -17660 21561 -40814
7524 -40814 -81871 -81127 -97745 -13465 83776 19158 -6240 -34786 -41577 57612 93928 76145
7512 76145 36296 16980 18004 -10019 -29277 -42861 -8357 46672 41102 -13984 -59609 -86270
7500 -86270 -76250 -42464 -62843 -72802 -70306 -97462 -66589 -13486 -37171 -43039 4895 2590 -68130
7487 -68130 -53682 -33406 6067 35396 14563 -38575 -53961 -60158 -41593 -46361 -68474 -86137
7475 -86137 -69086 -15735 -8579 -42997 -36328 11438 57603 57847 20540 -17980 -37597 -50458 -69610
7462 -69610 -66073 -56968 -63957 -54388 -54254 -59975 -65984 -26597 13863 41444 50620 31145 -9491 -14687
7448 -14687 -297 -14825 -27618 -68462 -68648 -30414 -46897 -29075 -8690 46805 50519 50470 37776
7435 37776 17957 -46851 -86126 -135375 -161145 -99894 -45946 -9392 33728 6415 -33467 -52777
7423 -52777 -65125 -40743 -63241 -23303 18906 42387 55378 5711 -29064 -17847 -26914 -43867
7411 -43867 -100266 -85491 -119587 -117118 -118392 -92499 -87091 -76456 -80263 -19296 -9716 -85295 -65493
7398 -65493 -5223 -35366 -56731 -66798 -45270 -13258 -37884 -42756 -32464 -4126 -6983 2328
7386 2328 -33548 -55610 -57699 -76527 -68377 -61361 -40069 -31362 -108325 -67436 14410 43275 355
7373 355 -54964 -41173 -24196 -16056 2690 62796 25066 -16065 -22109 -40521 -67790 -84406 -64193
7360 -64193 -74340 -95730 -159725 -172567 -117519 -14866 -14574 -60826 -49116 -63063 -57451 -47162
7348 -47162 -56751 -56598 -49991 -34413 -52996 -34669 -51059 -61457 -49956 -28088 -34950 -18532 28421
7335 28421 21969 20382 -11312 8555 -13723 -51107 -75421 -78967 -33828 -134 1824 -24083 10836
7322 10836 59879 96658 75990 9712 -60328 -97146 -100418 -63118 -18096 -9499 -3784 20040
7310 20040 63021 24706 7703 43518 80942 63839 54317 32440 7147 -23560 5113 33357
7298 33357 24339 5038 -43018 -4817 19096 -12481 -54577 -64930 -31163 -16626 -24926 -53406
7286 -53406 -14390 -36391 -74747 -44903 -6178 14115 -46852 -47473 -14464 -14666 -61777 -55423 -2961
7273 -2961 -25948 -58543 -69865 -60230 -25042 15153 -4640 -43250 -68848 -65850 -44120 15513
7261 15513 60254 2132 -50577 -70439 -102139 -56869 -68912 -64306 -90233 -55505 -22460 -10656
7249 -10656 7517 46018 30148 26217 22018 -23961 -66267 -37799 -6595 13134 -3745 -56910
7237 -56910 -83174 -95280 -110649 -116659 -91862 -57365 -64921 -42371 -34724 -55674 -33616 -30364 -19209
7224 -19209 -7357 677 -44924 -84482 -96166 -77928 -54906 12149 32659 -6802 -12182 -28777
7212 -28777 -38078 -975 33890 16460 -54100 -85205 -47296 -93981 -95241 -79128 -9944 61294
7200 61294 33072 5923 -34882 -83990 -100284 -54920 -45689 -28885 5174 -29327 -2354 17463
7188 17463 11119 31134 -1404 -38172 -66301 -70377 -84857 -109975 -95364 -68968 -63810 -31231
7176 -31231 -35123 -44530 -18952 -21717 2842 37364 68794 47735 24753 48743 66432 58023 27687
7163 27687 80657 61118 -24765 -8969 -45563 -31729 -16395 -17382 -76792 -141822 -98570 -87883
7151 -87883 -112776 -120534 -75940 -26963 7361 12376 23185 141 -351 2311 -12183 -71007 -90302
7138 -90302 -43384 -3027 10080 13802 59101 81150 56384 17192 -20714 19189 10291 6061
7126 6061 28299 -16862 -24578 -11325 53058 78258 37447 5007 -6492 -5833 -13763 -17543 -52371
7113 -52371 -46121 -34920 14554 44532 -5346 -39704 -75088 -127621 -153446 -131297 -100627 -46133
7101 -46133 2916 -27468 -33953 -41940 -20248 -27450 -10309 -25575 -36948 -75060 -72786 -70684 -56494
7088 -56494 -64148 -113679 -122754 -88099 -93322 -48296 -26995 -10356 -13078 -16088 -38622 -13446 -22628
7075 -22628 -52215 -40348 2017 12950 -49847 -82223 -21590 -17826 -44769 -55664 -56520 -69784
7063 -69784 -53788 -62677 -52610 -35992 -19234 -27194 -27335 -14771 29125 43278 25917 -28402 -101057
7050 -101057 -73710 9420 48225 46826 9856 -62794 -103374 -85059 -47159 -40688 -8935 -12110
7038 -12110 -33523 -54294 -32007 8169 -10237 -80168 -79622 9882 41177 16523 -18506 -23784
7026 -23784 18036 29891 -21189 6882 14756 -31933 -58970 -69197 -48014 -27396 -62782 -79244
7014 -79244 -44467 -50063 -27984 -37659 -70652 -54846 -16151 22238 27847 -9546 -49856 -40671 -13673
7001 -13673 -860 -19289 -48678 -26177 32799 14966 -66078 -114914 -117147 -59977 -17206 -37737
6989 -37737 -47398 -17262 -39446 -42839 -75342 -112042 -105114 -66071 -43865 -25121 -18082 -20928 3680
6976 3680 15811 -21331 -60844 -63381 -64784 -30924 -39271 -45662 -54192 -15726 -15045 -42728 -94924
6963 -94924 -144169 -87880 -33183 -10369 -43180 -42732 -53889 -53420 -33600 12126 15522 -13600 7404
6950 7404 58263 36619 -17372 -42685 13125 53877 98651 100771 84498 68223 45920 30371
6938 30371 36686 76262 124221 83400 63158 60646 23274 23826 10986 -13665 -28491 -47358 -45830
6925 -45830 -30382 -69900 -63915 -37086 -24622 -44798 -50851 -62904 -27288 -22851 -14312 23153 57784
6912 57784 37513 -18560 -52845 -59254 -54215 3306 -18051 -52892 -28162 -24683 -10727 3110
6900 3110 -21148 -7206 -26318 -13450 11893 -28587 -36370 -14534 -50759 -33626 26115 50555
6888 50555 2450 -35653 -61255 -34065 -32563 -21957 819 10325 1702 8602 45842 36028 -18360
6875 -18360 -23818 -9940 -27361 -58109 -10779 36373 -22125 -43182 -17562 -29897 -30592 -360
6863 -360 -25013 -67607 -83465 -29520 31755 42951 15147 43211 34460 -4249 18872 54000
6851 54000 48314 60573 73466 21726 25786 -3779 -64638 -100028 -80684 -45463 4909 22187
6839 22187 -19820 23449 5903 11340 -5899 -33850 -53530 -44164 12152 35660 -15170 -12152
6827 -12152 -12605 34591 23337 9481 7271 -22973 -30192 -24182 -52790 -63108 -13523 21880 18487
6814 18487 11050 34935 58381 17429 -13948 -46927 -66904 -48775 -45177 5162 1843 16251
6802 16251 35745 25080 -15533 -4537 4777 -10730 -20172 -48715 -54936 -22366 30649 37509 59322
6789 59322 48475 36529 -25088 -62500 -113676 -61004 -32355 -47650 -19517 -6649 -7898 -16021
6777 -16021 -25033 -8320 17156 29631 32096 11277 -21538 -12261 9938 -1346 36962 -6684
6765 -6684 44505 23000 -10965 20501 42400 32106 13451 28449 -19397 -32442 -22663 -5442
6753 -5442 -2410 -40016 -86236 -31805 19355 62063 47025 32825 -14279 -30420 -54682 -64914
6741 -64914 -58236 -81696 -38168 6296 -2362 2722 59505 45425 17444 34784 67177 77708
6729 77708 96025 57176 -21674 -60402 -51838 -48693 -13747 -10971 3326 24750 -20327 -57924
6717 -57924 -86967 -69921 -35510 -14304 2282 -29441 -59618 -97418 -79816 -44362 -82263 -55399
6705 -55399 -10988 43988 73575 247 -31532 -79845 -114872 -68416 -26846 -81819 -91735 -44751
6693 -44751 -16970 -8588 -4544 -1545 36440 -24738 -50146 -71337 -64962 -59030 -27458 6708 25300
6680 25300 46927 -2474 -72191 -57665 -49324 -12519 33714 18893 8297 33676 45786 19522
6668 19522 52001 -14708 -7929 58716 52276 36913 16726 -5802 -38722 -37486 -54185 -76431
6656 -76431 -111776 -111308 -78971 -89861 -42723 33820 14837 -5649 21698 18900 -29297 -70903
6644 -70903 -109305 -107769 -169420 -176708 -73682 -11460 -13469 11438 58692 6234 -41419 -414
6632 -414 12445 -28104 -51112 -44043 -30832 -49265 -47159 -20844 -16299 9923 -24098 -60898 -26762
6619 -26762 9963 25091 -12502 -54892 -92777 -73635 -38223 -44663 -45252 -44436 -3121 -25776 -17214
6606 -17214 13860 35414 29777 30612 20355 35045 12718 20676 18589 17089 -8715 -27644 -25746
6593 -25746 -61272 -28616 -30306 22761 9173 -17312 -35365 -57346 -53840 -90829 -65063 -11492
6581 -11492 -53556 -109997 -160288 -171237 -136826 -79949 -74599 -87046 -79041 -54639 -27605 -42329
6569 -42329 -90171 -85777 -68657 -71610 -72421 -83489 -78387 -55586 -51989 -37933 -30405 -41099 -18527
6556 -18527 30802 15334 1350 -48837 -110958 -69617 -78784 -69756 -107397 -89372 -74851 -68641
6544 -68641 -53407 -778 43211 61014 60542 64707 36461 55639 46815 41070 9426 24802 16023
6531 16023 -23725 -53875 -69570 -8772 424 -32863 -63857 -49791 -17731 -1752 13500 36486
6519 36486 -15338 -108313 -130254 -129002 -120966 -85121 -57715 -63597 -30938 -58469 -68609 -61113 -74407
6506 -74407 -97907 -94100 -23018 10996 -3469 -15674 2486 36513 52020 25262 2586 -15164
6494 -15164 -30734 -15782 15752 5673 -49917 -16207 -18142 -44138 -12284 19969 31131 33171
6482 33171 7564 -52862 -62084 -64201 -70041 -54400 -53665 -116205 -97125 -9710 57115 94625 48880
6469 48880 35839 47848 3172 -28566 -67506 -70176 -82775 -23220 -6558 273 -43853 -62579
6457 -62579 -49509 -13717 -40780 -58281 -8580 7735 -1260 -17140 6152 16661 30872 -2968
6445 -2968 -1069 -27780 -39007 30659 51903 -27493 -112650 -112336 -58511 -31906 -3304 37332 26383
6432 26383 19239 -16846 -30909 -9908 -31570 -32960 -2156 37287 32387 51249 44716 13553 -18398
6419 -18398 11644 53857 19250 -6804 -31739 -56945 -71111 -42963 -44553 -48969 -16868 -23348
6407 -23348 -43436 -31275 -12431 -13532 -16443 -47969 -71603 -58111 -33174 19793 52943 54482
6395 54482 81762 50130 -15466 -26791 549 22029 26569 31967 -8821 -64629 -61935 10373
6383 10373 -24073 -60041 -79415 -64744 -5854 10345 -9373 -45114 -89275 -101607 -70336 -76225
6371 -76225 -111623 -108331 -103333 -88242 -55980 -38045 -70238 -66175 -24718 -46436 -85387 -60670
6359 -60670 -43183 -5894 30818 79719 67388 45824 -42217 -41078 12122 -15240 9994 -14071
6347 -14071 -42798 -46507 -53682 -28392 -21385 -99921 -102849 -60404 -14415 -56841 -80343 -71892 -92124
6334 -92124 -36209 -44798 -119684 -136973 -140380 -66329 -23310 3552 -40434 -81543 -65305 -42833
6322 -42833 -35305 -3124 -44238 -69219 -91389 -131709 -91040 -70576 -47303 -46158 -38985 -82515
6310 -82515 -89710 -64034 -52041 -32090 -40375 -68287 -87379 -83318 -116633 -135567 -108595 -28502
6298 -28502 -219 35947 54416 20404 -43345 -70472 -83759 -39444 -42632 -31637 -7767 24508
6286 24508 28473 19171 -33628 -104114 -148502 -109353 -21630 -16352 19578 25412 -7848 -72923 -90636
6273 -90636 -34526 -65648 -114039 -61802 -13717 -14091 -27985 -36627 -38066 -41086 -41343 -17549 -41255
6260 -41255 -44284 -19065 -60455 -77056 -49360 -7678 1840 21766 7566 -21620 15290 38562
6248 38562 17338 -46471 -63406 -36106 -30635 -38620 -611 2039 15768 -30417 -47203 -69826
6236 -69826 -83881 -47932 -41044 -58085 -18959 60994 64861 32865 31112 12833 -17765 -12208 3216
6223 3216 25531 56584 40819 41532 64477 94898 28028 -17293 19276 30229 18197 -34689
$$ [...]
##END NTUPLES=NMR SPECTRUM
##END=
