##TITLE=Analysis number 313591
Compound Code cc 01710
Project Code adrs
Chemist Name fudan
##JCAMPDX= 6.0         $$ Bruker NMR JCAMP-DX V2.0
##DATA TYPE= NMR SPECTRUM
##DATA CLASS= NTUPLES
##ORIGIN= Bruker BioSpin GmbH
##OWNER= NMR
$$ XWIN-NMR		Version 3.5
$$ Tue Sep 13 12:02:50 2005 GMT Daylight Time (UT+1h)  MAYBRIDGE\NMR@NMR_250MHZ
##.OBSERVE FREQUENCY= 250.131544655141
##.OBSERVE NUCLEUS= ^1H
##.ACQUISITION MODE= SIMULTANEOUS (DQD)
##.ACQUISITION SCHEME= undefined
##.AVERAGES= 16
##.DIGITISER RES= 18
##SPECTROMETER/DATA SYSTEM= dpx250
##.PULSE SEQUENCE= zg30
##.SOLVENT NAME= CDCl3
##.SHIFT REFERENCE= (INTERNAL, CDCl3, 0, 16.522)
##AUDIT TRAIL= $$ (NUMBER, WHEN, WHO, WHERE, WHAT)
$$ ##TITLE= Audit trail, XWIN-NMR		Version 3.5
$$ ##JCAMPDX= 5.01
$$ ##ORIGIN= Bruker BioSpin GmbH
$$ ##OWNER= NMR
$$ C:\u/data/dgb/nmr/ADRS/9430/pdata/1/auditp.txt
$$ ##AUDIT TRAIL=  $$ (NUMBER, WHEN, WHO, WHERE, WHAT)
(   1,<2005-09-13 12:02:30.86 +100>,<MAYBRIDGE\NMR>,<NMR_250MHZ>,
      <created by zg, POWCHK disabled, PULCHK disabled
       configuration hash MD5:
       62 19 C7 07 E1 42 D1 B7 37 6C 3D D0 77 39 F9 E6
       data hash MD5: 64K
       E1 D4 D6 2C 53 1A 3C A3 67 FB 7B 60 2A 1F 14 A4>)
(   2,<2005-09-13 12:02:42.88 +100>,<MAYBRIDGE\NMR>,<NMR_250MHZ>,
      <Start of raw data processing
       ef LB = 0.3 FT_mod = 6 PKNL = 1 SI = 32K 
       data hash MD5: 32K
       8C F6 DD 9F 47 B9 BB 62 6D 07 E6 4A 90 CF 0B A4>)
(   3,<2005-09-13 12:02:44.72 +100>,<MAYBRIDGE\NMR>,<NMR_250MHZ>,
      <apk 
       data hash MD5: 32K
       D9 B3 27 04 95 F6 C0 17 D3 01 19 89 90 F3 E1 F2>)
(   4,<2005-09-13 12:02:45.61 +100>,<MAYBRIDGE\NMR>,<NMR_250MHZ>,
      <abs ABSG = 5 
       data hash MD5: 32K
       11 F7 5F 97 35 ED 31 58 3F CB 62 B9 DB 45 A2 5D>)
$$ ##END=
$$ 
$$ hash MD5
$$ 42 8A F1 FB A3 FE DE D6 C1 84 71 55 0A 80 08 43
##$RELAX= 
##$RELAX= 
##$RELAX= 
##$RELAX= 
##$RELAX= 
##$RELAX= 
##$RELAX= 
$$ Bruker specific parameters
$$ --------------------------
##$DU= <C:\u>
##$EXPNO= 9430
##$NAME= <ADRS>
##$PROCNO= 1
##$TYPE= <nmr>
##$USER= <dgb>
##$AMP= (0..31)
100 100 100 100 100 100 100 100 100 100 100 100 100 100 100 100 100 100 
100 100 100 100 100 100 100 100 100 100 100 100 100 100 
##$AQSEQ= 0
##$AQ_mod= 3
##$AUNM= <au_zg>
##$AUTOPOS= <21 >
##$BF1= 250.13
##$BF2= 250.13
##$BF3= 250.13
##$BF4= 250.13
##$BF5= 500.13
##$BF6= 500.13
##$BF7= 500.13
##$BF8= 500.13
##$BYTORDA= 1
##$CFDGTYP= 0
##$CFRGTYP= 5
##$CHEMSTR= <none>
##$CNST= (0..31)
1 1 145 1 1 1 1 1 1 1 1 1 1 1 1 1 1 1 1 1 1 1 1 1 1 1 1 1 1 1 1 1 
##$CPDPRG= <>
##$CPDPRG1= <>
##$CPDPRG2= <>
##$CPDPRG3= <>
##$CPDPRG4= <mlev>
##$CPDPRG5= <mlev>
##$CPDPRG6= <mlev>
##$CPDPRG7= <mlev>
##$CPDPRG8= <mlev>
##$CPDPRGB= <>
##$CPDPRGT= <>
##$D= (0..31)
0 1 0 0 0 0 0 0 0 0.06 0 0 0 0 0 0 0.0002 0 0 0 0 0 0 0 0 0 0 0 0 0 0 
0 
##$DATE= 1126609349
##$DBL= (0..7)
120 120 120 120 120 120 120 120 
##$DBP= (0..7)
150 150 150 150 150 150 150 150 
##$DBP07= 0
##$DBPNAM0= <>
##$DBPNAM1= <>
##$DBPNAM2= <>
$$ [...]
##$SUBNAM7= <"">
##$SUBNAM8= <"">
##$SUBNAM9= <"">
##$SW= 20.6930455092707
##$SWIBOX= (0..15)
0 0 3 0 0 0 0 0 0 0 0 0 0 0 0 0 
##$SW_h= 5175.983436853
##$TD= 65536
##$TD0= 1
##$TE= 295.16
##$TE2= 300
##$TE3= 300
##$TEG= 300
##$TL= (0..7)
0 120 120 120 120 120 120 120 
##$TP= (0..7)
150 150 150 150 150 150 150 150 
##$TP07= 0
##$TPNAME0= <>
##$TPNAME1= <>
##$TPNAME2= <>
##$TPNAME3= <>
##$TPNAME4= <>
##$TPNAME5= <>
##$TPNAME6= <>
##$TPNAME7= <>
##$TPOAL= (0..7)
0.5 0.5 0.5 0.5 0.5 0.5 0.5 0.5 
##$TPOFFS= (0..7)
0 0 0 0 0 0 0 0 
##$TUNHIN= 0
##$TUNHOUT= 0
##$TUNXOUT= 0
##$USERA1= <user>
##$USERA2= <user>
##$USERA3= <user>
##$USERA4= <user>
##$USERA5= <user>
##$V9= 5
##$VALIST= <valist>
##$VCLIST= <CCCCCCCCCCCCCCC>
##$VD= 0
##$VDLIST= <DDDDDDDDDDDDDDD>
##$VPLIST= <PPPPPPPPPPPPPPP>
##$VTLIST= <TTTTTTTTTTTTTTT>
##$WBST= 1024
##$WBSW= 4
##$XGAIN= (0..3)
0 0 0 0 
##$XL= 0
##$YL= 0
##$YMAX_a= 386558
##$YMIN_a= -518631
##$ZGOPTNS= <>
##$ZL1= 120
##$ZL2= 120
##$ZL3= 120
##$ZL4= 120
##$ABSF1= 16.522
##$ABSF2= -4.171173
##$ABSG= 5
##$ABSL= 3
##$ALPHA= 0
##$AQORDER= 0
##$ASSFAC= 0
##$ASSFACI= 0
##$ASSFACX= 0
##$ASSWID= 0
##$AUNMP= <proc_1d>
##$AZFE= 0.1
##$AZFW= 0.1
##$BCFW= 0
##$BC_mod= 0
##$BYTORDP= 0
##$COROFFS= 0
##$CY= 12.5
##$DATMOD= 1
##$DC= 0
##$DFILT= <>
##$DTYPP= 0
##$F1P= 14.0000005364418
##$F2P= -0.99999901652339
##$FCOR= 0.5
##$FTSIZE= 32768
##$FT_mod= 6
##$GAMMA= 0
##$GB= 0
##$INTBC= 1
##$INTSCL= 1
##$ISEN= 128
##$LB= 0.3
##$LEV0= 0
##$LPBIN= 0
##$MAXI= 10000
##$MC2= 0
##$MEAN= 0
##$ME_mod= 0
##$MI= 0
##$NCOEF= 0
##$NC_proc= -2
##$NLEV= 6
##$NOISF1= 0
##$NOISF2= 0
##$NSP= 0
##$NTH_PI= 0
##$NZP= 0
##$OFFSET= 16.522
##$PC= 1
##$PHC0= 131.5523
##$PHC1= 1.398754
##$PH_mod= 1
##$PKNL= yes
##$PPARMOD= 0
##$PSCAL= 4
##$PSIGN= 0
##$REVERSE= no
##$SF= 250.13
##$SI= 32768
##$SIGF1= 0
##$SIGF2= 0
##$SINO= 400
##$SIOLD= 32768
##$SREGLST= <1H.CDCl3>
##$SSB= 0
##$STSI= 32768
##$STSR= 0
##$SW_p= 5175.98343685301
##$SYMM= 0
##$S_DEV= 0
##$TDeff= 65536
##$TDoff= 0
##$TI= <Analysis number 999999
Compound Code 99
Book Reference 9
Project Code 9>
##$TILT= no
##$TM1= 0
##$TM2= 0
##$TOPLEV= 0
##$USERP1= <user>
##$USERP2= <user>
##$USERP3= <user>
##$USERP4= <user>
##$USERP5= <user>
##$WDW= 1
##$XDIM= 32768
##$YMAX_p= 422035998
##$YMIN_p= -37886
$$ End of Bruker specific parameters
$$ ---------------------------------
##NTUPLES= NMR SPECTRUM
##VAR_NAME=  FREQUENCY,     SPECTRUM/REAL,   SPECTRUM/IMAG
##SYMBOL=    X,             R,               I
##VAR_TYPE=  INDEPENDENT,   DEPENDENT,       DEPENDENT
##VAR_FORM=  AFFN,          ASDF,            ASDF
##VAR_DIM=   32768,         32768,           32768
##UNITS=     HZ,            ARBITRARY UNITS, ARBITRARY UNITS
##FACTOR=    0.157963299565203, 1,           1
##FIRST=     4132.6476996994, 0,             0
##LAST=      -1043.33573715361, 0,           0
##MIN=       -1043.33573715361, -37886,      0
##MAX=       4132.6476996994, 422035998,     0
$$ Real data points
##PAGE= N=1
##DATA TABLE= (X++(R..R)), XYDATA
$$ [...]
##PAGE= N=2
##DATA TABLE= (X++(I..I)), XYDATA
$$ plain form
21283 620753 619632 620318 621365 620562 623153 624197 623240 620873 618678 622273 625866 626372 623397 621733 624564
21268 624564 628275 628547 626053 627186 628494 630536 627359 625811 625792 625365 622980 621764 623202 625184 625929
21253 625929 625048 624035 624389 626924 626064 628048 631982 631122 630141 632784 634117 631041 625966 626513 626501 626363
21237 626363 628566 631786 631040 627678 629021 629252 631523 631181 630612 627986 624797 625744 629732 632776 632518 630655
21221 630655 630841 632423 629911 629063 629748 628639 625579 625614 628528 630455 632449 634406 635593 635181 633859 632561
21205 632561 633688 631854 627979 626802 627388 629487 633323 636654 639035 636623 634529 633676 634387 635004 636337
21190 636337 636920 637876 634983 634510 635222 637553 636428 635526 637507 639101 638198 637332 633250 632839 632356 634357
21174 634357 637782 639599 639693 637572 636158 636457 637816 639053 638146 636597 635049 634198 635568 636483 636782 632640
$$ packed form
21283F20753j121O86J047q03K591J044r57k367k195L595L593N06k975j664K831
21268F24564L711K72k494J133J308K042l177j548j9m27k385j216J438J982P45
21253F25929q81j013L54K535q60J984L934q60r81K643J333l076n075N47j2j38
21237F26363K203L220p46l362J343K31K271l42n69k626l189R47L988L044k58j863
21221F30655J86J582k512q48O85j109l060L5K914J927J994J957J187m12j322j298
21205F32561J127j834l875j177N86K099L836L331K381k412k094q53P11O17J333
21190F36337N83R56k893m73P12K331j125r02J981J594r03q66m082m11m83K001
21174F34357L425J817R4k121j414K99J359J237r07j549j548q51J370R15K99m142
$$ plain form
21158 632640 631269 632215 633136 632805 634768 639352 642066 645102 644359 643893 646359 646624 645360 647576 648364 646269
21142 646269 642625 641608 642275 644405 643224 643809 648616 647735 648739 651883 649963 645538 640380 642962 645099
21127 645099 645342 647125 645287 643855 647434 644948 643574 644967 642420 640750 640750 642289 642907 644980 643463
21112 643463 638616 639722 644785 649024 650566 648467 644309 642110 643098 644153 643029 646875 648021 648675 648431
21097 648431 648018 647410 646903 648564 646265 648730 651851 652110 652893 654355 655316 653372 650189 648191 649687 652504
21081 652504 650194 649809 648574 649768 652208 652525 653645 657831 657503 654788 656156 658122 657915 658301 658483 656619
21065 656619 656638 658159 657143 658068 652532 649539 652056 659475 662850 658807 656116 659339 660473 660893 661782
21050 661782 660562 659426 657829 660885 657820 652803 652175 653104 654335 657782 658317 656885 652682 655706 657294
$$ packed form
21158F32640j371R46R21l31J963M584K714L036p43m66K466K65j264K216P88k095
21142F46269l644j017O67K130j181N85M807q81J004L144j920m425n158K582K137
21127F45099K43J783j838j432L579k486j374J393k547j670%J539O18K073j517
21112F43463m847J106N063M239J542k099m158k199R88J055j124L846J146O54k44
21097F48431m13o08n07J661k299K465L121K59P83J462R61j944l183j998J496K817
21081F52504k310l85j235J194K440L17J120M186l28k715J368J966k07L86J82j864
21065F56619J9J521j016R25n536k993K517P419L375m043k691L223J134M20Q89
21050F61782j220j136j597L056l065n017o28R29J231L447N35j432m203L024J588
$$ plain form
21035 657294 657822 658279 655698 652489 657170 658569 658079 657142 660886 663849 663032 663846 665508 664886 664686 665960
21019 665960 665806 666049 666017 663887 662281 662314 661528 662229 661682 660599 662619 665485 665602 666115 666140 664242 662707
21002 662707 659957 658075 655641 656361 661562 662854 663229 664175 666018 666091 662043 658704 660434 662370 663662
20987 663662 664490 666692 667340 665780 665841 664285 664576 664310 670278 672420 670862 669932 672499 671602 669818 667789
20971 667789 668490 668980 670514 672469 671705 671784 672766 670474 669177 671874 674762 677935 675057 673167 675120 670780
20955 670780 669316 669108 669758 672851 676424 676510 675719 673558 672623 674177 674388 674259 675285 676028 671732 670941 669517
20938 669517 669407 670585 670333 672447 675318 676159 675339 676253 677299 680512 680615 683136 680924 679113 677150 678663
20922 678663 679240 678581 679542 679524 678669 678600 681626 681057 682813 682399 680343 680119 680666 682807 682978 683432 684501 684638
$$ packed form
21035F57294N28M57k581l209M681J399m90r37L744K963q17Q14J662o22k00J274
21019F65960j54K43l2k130j606L3p86P01n47j083K020K866J17N13K5j898j535
21002F62707k750j882k434P20N201J292L75R46J843P3m048l339J730J936J292
20987F63662Q28K202O48j560O1j556K91k66N968K142j558r30K567q97j784k029
20971F67789P01M90J534J955p64P9R82k292j297K697K888L173k878j890J953m340
20955F70780j464k08O50L093L573Q6p91k161r35J554K11j29J026P43m296p91j424
20938F69517j10J178k52K114K871Q41q20R14J046L213J03K521k212j811j963J513
20922F78663N77o59R61j8q55o9L026n69J756m14k056k24N47K141J71M54J069J37
$$ plain form
20904 684638 688733 689539 689955 689668 686996 688052 684634 686602 690028 686988 683593 682106 684201 684969 681128
20889 681128 675710 680490 684630 685288 683167 683286 683937 686442 689869 690461 692482 692673 689497 689066 688095 684602
20873 684602 682070 683945 687791 690975 688939 686672 687274 688433 690684 687082 685099 687027 689360 690255 692647
20858 692647 693511 692442 688687 689361 691944 690170 688443 689245 691743 693471 690146 688775 690112 690979 688511
20843 688511 690130 689314 690803 695688 694663 692372 694005 692537 691045 694084 696254 696801 700614 702664 701986
20828 701986 699148 695912 695009 696717 696960 698528 699159 698689 698497 696856 695876 694030 691773 694690 693622 692473
20812 692473 697707 700845 701464 702046 701699 700057 698638 701919 702319 701749 700178 702295 705719 704521 704309 703252
20796 703252 698650 698900 700351 704164 707787 708622 708420 709272 707546 705435 704391 704552 702028 702762 705457 704946
$$ packed form
20904F84638M095Q06M16k87k672J056l418J968L426l040l395j487K095P68l841
20889F81128n418M780M140O58k121J19O51K505L427N92K021J91l176m31r71l493
20873F84602k532J875L846L184k036k267O02J159K251l602j983J928K333Q95K392
20858F92647Q64j069l755O74K583j774j727Q02K498J728l325j371J337Q67k468
20843F88511J619q16J489M885j025k291J633j468j492L039K170N47L813K050o78
20828G01986k838l236r03J708K43J568O31m70j92j641r80j846k257K917j068j149
20812F92473N234L138O19N82l47j642j419L281M00n70j571K117L424j198k12j057
20796G03252m602K50J451L813L623Q35k02Q52j726k111j044J61k524P34K695n11
$$ plain form
20780 704946 704067 703093 704337 706259 704803 704784 708747 710187 710360 710501 709854 707583 707438 708728 708731 712329 715169
20763 715169 712503 711245 711180 714141 716339 712287 711157 711921 710439 713398 715579 712527 709951 710241 710806
20748 710806 709061 709144 709326 711361 710690 711560 715286 716500 716137 714988 714451 713931 713343 713630 714016 714361 710970
20731 710970 710970 715198 714360 711068 712463 715501 714451 714953 713518 716159 719453 720425 719037 718952 716402 717265
20715 717265 718739 716556 715149 717162 717351 718061 718703 720108 719979 722222 721760 720222 717820 718502 719500 719571
20699 719571 721778 722847 720465 718527 720403 724418 728497 726416 725867 727868 725258 722900 722037 721957 721178
20684 721178 722616 723000 725403 725289 725076 726035 729491 727174 726494 727770 730241 731540 728499 722271 719393
20669 719393 720099 723291 726513 728115 728561 727450 722249 721509 721753 723204 728119 729673 730332 731151 731887 728130
$$ packed form
20780G04946q79r74J244J922j456j9L963J440J73J41o47k271j45J290LL598K840
20763G15169k666j258o5K961K198m052j130P64j482K959K181l052k576K90N65
20748G10806j745Q3J82K035o71Q70L726J214l63j149n37n20n88K87L86L45l391
20731G10970%M228q38l292J395L038j050N02j435K641L294R72j388q5k550Q63
20715G17265J474k183j407K013J89P10O42J405j29K243m62j538k402O82R98P1
20699G19571K207J069k382j938J876M015M079k081n49K001k610k358q63q0p79
20684G21178J438L84K403j14k13R59L456k317o80J276K471J299l041o228k878
20669G19393P06L192L222J602M46j111n201p40K44J451M915J554O59Q19P36l757
$$ plain form
20653 728130 727341 729244 730242 729290 728210 727212 728190 727046 726987 728654 731749 733768 735633 733661 729121 728631
20637 728631 728489 729881 729372 729205 730737 733339 737301 737371 737166 736224 737271 738307 738144 736745 734677 735432
20621 735432 733274 734696 733610 736956 740141 737572 736618 735131 733404 733412 734385 734156 736393 736440 737255 737860 739069
20604 739069 737932 740335 742597 740524 738717 736335 735378 735723 736444 738579 738535 741049 743525 742647 740704 742702
20588 742702 741924 740662 736710 735536 737986 740945 740963 742563 744106 740963 739188 740536 743556 742022 743984
20573 743984 745671 743319 742443 741920 743779 745303 745322 743716 746537 745676 745505 747727 746766 746600 750044 752871
20557 752871 755264 751752 749573 752090 753245 752273 752043 751465 748317 748682 751621 751300 749482 748264 749572
20542 749572 752936 754418 754887 751109 749606 748827 749589 752335 755153 756863 755335 754253 755539 757742 755042
$$ packed form
20653G28130p89J903R98r52j080r98R78j144n9J667L095K019J865j972m540m90
20637G28631j42J392n09j67J532K602L962P0k05r42J047J036j63j399k068P55
20621G35432k158J422j086L346L185k569r54j487j727QR73k29K237M7Q15O05J209
20604G39069j137K403K262k073j807k382r57L45P21K135m4K514K476q78j943J998
20588G42702p78j262l952j174K450K959J8J600J543l143j775J348L020j534J962
20573G43984J687k352q76n23J859J524J9j606K821q61j71K222r61j66L444K827
20557G52871K393l512k179K517J155r72k30n78l148L65K939l21j818j218J308
20542G49572L364J482M69l778j503p79P62K746K818J710j528j082J286K203k700
$$ plain form
20527 755042 754635 753867 753351 753925 753566 754051 755783 751753 752235 753456 753541 753657 753600 754839 755749 754755 754135 757883
20509 757883 765159 766792 767603 767821 765370 765615 762697 762735 762947 760225 761186 759505 762861 766649 767978 764867
20493 764867 763945 763617 764021 764089 763993 763879 766669 766947 766554 771407 769531 766946 764601 766072 764697 762548 762380
20476 762380 764579 762292 761933 764732 764900 765902 767220 768956 768795 766987 771289 774010 770819 769024 770804
20461 770804 771675 772073 771713 773047 772653 771514 772046 776998 777939 774388 769841 770008 769889 772426 773300 773506 770904
20444 770904 770444 773148 776903 779684 780368 782299 781917 781136 778635 775999 777328 777767 774581 773851 774816 775026
20428 775026 777020 776616 776473 779173 778959 775584 778596 782228 782457 782937 783190 780883 782466 784982 786166 788071
20412 788071 785178 783273 783104 781146 782516 783161 782150 780767 782393 784964 788007 785643 784690 783465 784742
$$ packed form
20527G55042m07p68n16N74l59M85J732m030M82J221Q5J16n7J239R10r94o20L748
20509G57883P276J633Q11K18k451K45k918L8K12k722R61j681L356L788J329l111
20493G64867r22l28M04O8r6j14K790K78l93M853j876k585k345J471j375k149j68
20476G62380K199k287l59K799J68J002J318J736j61j808M302K721l191j795J780
20461G70804Q71L98l60J334l94j139N32M952R41l551m547J67j19K537Q74K06k602
20444G70904m60K704L755K781O84J931l82p81k501k636J329M39l186p30R65K10
20428G75026J994m04j43K700k14l375L012L632K29M80K53k307J583K516J184J905
20412G88071k893j905j69j958J370O45j011j383J626K571L043k364r53j225J277
$$ plain form
20397 784742 786395 787740 786164 784436 781901 780964 782437 784054 785073 786832 785010 783041 786572 792392
20383 792392 792752 792295 791560 791598 791181 793035 793448 794413 792769 789044 787368 790054 789266 790001 791970 793292 797295
20366 797295 797253 796265 794430 791931 795223 797461 794342 796051 799638 796994 795221 792866 793093 795574 797549
20351 797549 796382 794457 795250 796401 794695 794593 796337 798150 799601 799376 799734 800966 802324 798350 799883
20336 799883 801204 799653 797838 799240 800069 800118 802839 804472 805604 805800 802466 798938 800816 803754 803555
20321 803555 805379 808548 809792 810002 807973 805441 805291 800483 799919 806424 807101 805373 803570 803978 804908 805877
20305 805877 805791 804011 806011 809588 809448 810581 810664 810004 808945 809257 810766 813503 812340 812389 814141 812942
20289 812942 813691 811885 807681 809788 814405 816702 814082 814935 815578 813060 812841 814914 821703 825384 822823
$$ packed form
20397G84742J653J345j576j728k535r37J473J617J019J759j822j969L531N820
20383G92392L60m57p35L8m17J854M13R65j644l725j676K686p88P35J969J322M003
20366G97295m2r88j835k499L292K238l119J709L587k644j773k355K27K481J975
20351G97549j167j925P93J151j706j02J744J813J451k25L58J232J358l974J533
20336G99883J321j551j815J402Q29M9K721J633J132J96l334l528J878K938j99
20321H03555J824L169J244K10k029k532j50m808n64O505O77j728j803M08R30R69
20305H05877q6j780K000L577j40J133Q3o60j059L12J509K737j163M9J752j199
20289H12942P49j806m204K107M617K297k620Q53O43k518k19K073O789L681k561
$$ plain form
20274 822823 818010 815150 819667 819975 820427 819981 819981 820235 818438 820774 820440 819755 817619 817646 817467 818030 818038 817965 817924
20255 817924 819795 821837 821372 823134 823687 824629 821950 819424 820097 819736 822521 823344 825019 824492 824059 824324
20239 824324 829286 827482 827624 827931 826602 825750 826000 829105 829445 827981 828907 827400 831367 832983 832961 831786
20223 831786 833717 834744 832700 828638 827591 828700 831193 836997 839819 835780 834828 833945 834148 834637 833319
20208 833319 830975 830016 832778 835311 836730 838146 841043 837228 832166 830590 831039 835064 838298 835586 839480
20193 839480 840375 838967 837302 836309 836934 838185 839261 840026 841148 842959 840888 838626 840648 843621 845138
20178 845138 845599 846493 846041 845048 845655 846979 847301 845299 843285 844670 845036 845805 847153 848728 848506 848292 850157
20161 850157 849745 850382 848222 847835 849351 851007 851168 849527 849220 848453 850299 850873 849395 847133 848335 848661
$$ packed form
20274H22823m813k860M517L08M52m46%K54j797K336l34o85k136K7j79N63Qp3m1
20255H17924J871K042m65J762N53R42k679k526O73l61K785Q23J675n27m33K65
20239H24324M962j804J42L07j329q52K50L105L40j464R26j507L967J616k2j175
20223H31786J931J027k044m062j047J109K493N804K822m039r52q83K03M89j318
20208H33319k344r59K762K533J419J416K897l815n062j576M49M025L234k712L894
20193H39480Q95j408j665r93O25J251J076P65J122J811k071k262K022K973J517
20178H45138M61Q94m52r93O07J324L22k002k014J385L66P69J348J575k22k14J865
20161H50157m12O37k160l87J516J656J61j641l07p67J846N74j478k262J202L26
$$ plain form
20145 848661 846854 847813 851483 852749 853456 851031 852180 854656 850300 848810 849610 851521 853046 850036 853242
20130 853242 855849 856800 856858 858548 859796 858640 860201 859480 858426 856751 858412 860929 860905 856740 855663 856094
20114 856094 856082 859448 864324 865186 863680 862729 862423 860753 858937 860449 862677 864627 867245 863262 859430
20099 859430 859028 859449 857359 858192 864153 865786 862906 863110 864697 864314 864586 864419 865201 863685 860665 863201
20083 863201 867774 869761 870713 873184 872031 869662 867671 870017 873916 872853 873317 870866 870091 867171 867784
20068 867784 868673 869649 870040 870063 871169 871792 873762 873985 874686 874124 871807 874377 875324 877526 876772 876238 875985
20051 875985 878441 880102 883546 883018 881662 880816 881780 881686 880809 877705 878399 880182 883341 882597 883118 883627 884933
20034 884933 882787 882243 883053 882952 883256 883029 882067 881927 881591 881706 880397 878715 878431 879038 879369 884350 883053
$$ packed form
20145H48661j807R59L670J266P07k425J149K476m356j490Q00J911J525l010L206
20130H53242K607R51N8J690J248j156J561p21j054j675J661K517k4m165j077M31
20114H56094j2L366M876Q62j506r51l06j670j816J512K228J950K618l983l832
20099H59430m02M21k090Q33N961J633k880K04J587l83K72j67P82j516l020K536
20083H63201M573J987R52K471j153k369j991K346L899j063M64k451p75k920O13
20068H67784Q89R76L91K3J106O23J970K23P01n62k317K570R47K202p54n34k53
20051H75985K456J661L444n28j356q46R64r4q77l104O94J783L159p44N21N09J306
20034H84933k146n44Q10j01L04k27r62j40l36J15j309j682k84O07L31M981j297
$$ plain form
20017 883053 883337 886768 888738 892072 890556 891090 890210 888015 889974 890655 890951 888926 890799 892242 891674 893122
20001 893122 895678 894336 893899 892139 892194 894319 894558 892691 892756 896723 897892 896305 893848 896469 898966 898463
19985 898463 896199 897961 901151 899317 896249 896076 900497 900957 899948 898180 897315 899683 901721 899020 898806
19970 898806 899146 897513 897667 902455 903245 899487 898371 896564 898375 901552 904096 907555 908196 907335 906219
19955 906219 907009 906965 908737 909496 905945 904025 908483 911807 912008 911440 912237 915331 916960 914612 913237 914428
19939 914428 911295 910067 915369 918805 917362 918946 921374 922535 924094 922559 924542 926744 924751 927900
19925 927900 925434 919425 917226 917965 917119 918059 920128 920834 920320 920301 921081 926235 925162 923793 924469 925663
19909 925663 923591 920853 921894 920664 917358 918584 913821 911427 917825 924749 926408 924767 922405 922988
$$ packed form
20017H83053K84L431J970L334j516N34q80k195J959O81K96k025J873J443n68J448
20001H93122K556j342m37j760N5K125K39j867O5L967J169j587k457K621K497n03
19985H98463k264J762L190j834l068j73M421M60j009j768q65K368K038k701k14
19970H98806L40j633J54M788P90l758j116j807J811L177K544L459O41q61j116
19955I06219P90m4J772P59l551j920M458L324K01n68P97L094J629k348j375J191
19939I14428l133j228N302L436j443J584K428J161J559j535J983K202j993L149
19925I27900k466o009k199P39q46R40K069P06n14j9P80N154j073j369O76J194
19909I25663k072k738J041j230l306J226m763k394O398O924J659j641k362N83
$$ plain form
19895 922988 926145 926984 930070 929452 929184 929716 929569 930449 931324 930843 930108 932110 931288 931904 936016 936243 933975
19878 933975 934300 933180 932428 932979 933183 932668 933632 935241 935210 937137 934852 936103 938478 939572 935965 938913
19862 938913 944049 944448 941893 942512 942552 944250 947002 947552 946683 947524 947533 946331 946397 946898 946692 948205 948126 949191
19844 949191 949659 948990 952430 954387 950659 948250 950216 951877 950394 952776 953186 955802 956245 953923 949801
19829 949801 951212 951160 948877 947506 950412 952544 952818 956962 958449 960103 962264 960997 958785 960020 961810
19814 961810 961638 959947 959953 960753 962627 962540 963288 963577 965270 965477 964397 963156 965548 965564 964332 962639 962795
19797 962795 965605 968670 970915 971578 968922 966948 969197 966865 965341 967131 966215 966395 971022 973768 974748
19782 974748 978994 981855 980442 977352 978395 979593 975434 973676 970330 969487 972579 975619 978326 976624
$$ packed form
19895I22988L157Q39L086o18k68N32j47Q80Q75m81p35K002q22O16M112K27k268
19878I33975L25j120p52N51K04n15R64J609l1J927k285J251K375J094l607K948
19862I38913N136L99k555O19M0J698K752N50q69Q41Rj202O6N01k06J513p9J065
19844I49191M68o69L440J957l728k409J966J661j483K382M10K616M43k322m122
19829I49801J411n2k283j371K906K132K74M144J487J654K161j267k212J235J790
19814I61810j72j691OQ00J874q7P48K89J693K07j080j241K392J6j232j693J56
19797I62795K810L065K245O63k656j974K249k332j524J790r16J80M627K746R80
19782I74748M246K861j413l090J043J198m159j758l346q43L092L040K707j702
$$ plain form
19768 976624 976244 978967 983230 983291 979573 977105 977172 975528 974975 978016 977725 978281 979367 979995 978570 980767
19752 980767 983420 986860 987918 984696 980873 981249 981803 982188 979594 980491 981506 980787 980237 983161 984183 983460
19736 983460 982099 983304 985366 987932 990494 992242 992521 992630 993795 993636 995459 992299 992641 997690 1002798
19721 1002798 1002253 997721 995747 996332 1001041 1002271 1000275 1001644 1000105 998144 998361 996298 998984 1000326 997787
19706 997787 996857 1000071 999699 1002647 1005097 1006395 1006853 1005549 1002480 1002519 1006880 1010876 1011193 1007859 1010502 1011688
19690 1011688 1011522 1013009 1012181 1008463 1009026 1008392 1012456 1015938 1017915 1018396 1016608 1016846 1017660 1016853 1017306 1017255 1015653
19673 1015653 1014576 1016526 1018027 1017662 1013899 1010927 1011546 1012806 1015310 1016170 1018272 1022371 1023615 1026033 1025091
19658 1025091 1022311 1019221 1022229 1025086 1024554 1025972 1027100 1028677 1027280 1025125 1026116 1027347 1026779 1026672 1030658
$$ packed form
19768I76624l80K723M263O1l718k468O7j644n53L041k91N56J086O28j425K197
19752I80767K653L440J058l222l823L76N54L85k594Q97J015p19n50K924J022p23
19736I83460j361J205K062K566K562J748K79J09J165j59J823l160L42N049N108
19721A002798n45m532j974N85M709J230j996J369j539j961K17k063K686J342k539
19706I97787r30L214l72K948K450J298M58j304l069L9M361L996L17l334K643J186
19690A011688j66J487q28l718N63o34M064L482J977M81j788K38Q14q07M53n1j602
19673A015653j077J950J501l65l763k972O19J260K504Q60K102M099J244K418r42
19658A025091k780l090L008K857n32J418J128J577j397k155R91J231n68j07L986
$$ plain form
19643 1030658 1035467 1034853 1028885 1026992 1028859 1032590 1033927 1034501 1036930 1039559 1040883 1042566 1040209 1039715 1039260
19628 1039260 1040581 1044753 1045171 1043200 1041344 1042433 1044117 1044402 1045564 1046226 1047714 1048268 1052125 1051182 1053026
19613 1053026 1052473 1050361 1047478 1047784 1048254 1051836 1053796 1054231 1052383 1052308 1053439 1053619 1054114 1051478 1051491 1049871
19597 1049871 1049023 1052442 1056497 1057307 1055345 1054813 1057006 1058686 1059452 1062433 1063560 1063605 1067722 1068450 1066502 1063359
19581 1063359 1063294 1063451 1062383 1064655 1068186 1070341 1070592 1071101 1071912 1072736 1071611 1068643 1066535 1065154 1070686 1072339
19565 1072339 1072737 1074671 1075523 1076710 1077867 1077935 1076325 1075358 1078977 1080057 1080026 1080539 1080123 1080239 1079592 1073240 1071504
19548 1071504 1074024 1076793 1078398 1081799 1081207 1081874 1084500 1085618 1083631 1084985 1088848 1089702 1091866 1095613 1096403
19533 1096403 1096421 1095990 1094611 1095116 1100062 1103508 1103793 1102904 1102987 1107436 1109939 1111257 1113736 1114191 1116848 1118306
$$ packed form
19643A030658M809o14n968j893J867L731J337N74K429K629J324J683k357m94m55
19628A039260J321M172M18j971j856J089J684K85J162O62J488N54L857r43J844
19613A053026n53k112k883L06M70L582J960M35j848p5J131J80M95k636J3j620
19597A049871q48L419M055Q10j962n32K193J680P66K981J127M5M117P28j948l143
19581A063359o5J57j068K272L531K155K51N09Q11Q24j125k968k108j381N532J653
19565A072339L98J934Q52J187J157O8j610r67L619J080l1N13m16J16o47o352j736
19548A071504K520K769J605L401n92O67K626J118j987J354L863Q54K164L747P90
19533A096403J8m31j379N05M946L446K85q89Q3M449K503J318K479M55K657J458
$$ plain form
19517 1118306 1117680 1117310 1115274 1114508 1114148 1109314 1106025 1104402 1103069 1099169 1093372 1091490 1089044 1084900 1080525
19502 1080525 1078738 1074938 1073354 1072120 1069056 1069224 1066594 1065160 1062135 1057991 1057561 1056716 1057694 1060403 1061910
19487 1061910 1061925 1064007 1064115 1064907 1067022 1070106 1070461 1070736 1072681 1073339 1074907 1078730 1083958 1081720 1079454 1081267
19471 1081267 1086626 1093218 1093686 1087911 1087580 1091522 1090495 1087201 1087385 1084822 1086140 1092271 1094807 1095414 1096592
19456 1096592 1097891 1099807 1100162 1101479 1104580 1106522 1105377 1105046 1108555 1109555 1112434 1115747 1115136 1114226 1113791
19441 1113791 1112376 1114588 1114348 1112895 1114989 1120293 1120331 1115320 1115311 1119269 1119636 1117125 1117193 1119743 1120494 1123935
19425 1123935 1124325 1122905 1119099 1115166 1118588 1123140 1123622 1125130 1126587 1129784 1133621 1137216 1138362 1136683
19411 1136683 1135015 1134467 1137532 1138214 1138263 1139513 1140276 1139750 1138056 1139152 1140496 1143082 1143418 1144701 1147133 1150271
$$ packed form
19517A118306o26l70k036p66l60m834l289j623j333l900n797j882k446m144m375
19502A080525j787l800j584j234l064J68k630j434l025m144m30q45R78K709J507
19487A061910J5K082J08P92K115L084L55K75J945O58J568L823N228k238k266J813
19471A081267N359O592M68n775l31L942j027l294J84k563J318O131K536O07J178
19456A096592J299J916L55J317L101J942j145l31L509J000K879L313o11r10m35
19441A113791j415K212k40j453K094N304L8n011rL958L67k511O8K550P51L441
19425A123935L90j420l806l933L422M552M82J508J457L197L837L595J146j679
19411A136683j668n48L065O82M9J250P63n26j694J096J344K586L36J283K432L138
$$ plain form
19395 1150271 1152789 1153284 1152237 1155480 1160413 1163701 1164053 1159640 1163427 1163649 1161389 1159833 1163730 1164181 1166430
19380 1166430 1169381 1169873 1169879 1171571 1171429 1172314 1171802 1174161 1175374 1174437 1173411 1176676 1180823 1182597 1181151 1180557
19364 1180557 1182329 1184301 1187677 1192611 1193968 1195809 1195556 1193659 1194967 1197972 1198787 1198554 1203773 1207017 1207649
19349 1207649 1208008 1210683 1212934 1211637 1211388 1214352 1216902 1218284 1221229 1224091 1227632 1229133 1230969 1233586
19335 1233586 1231067 1232760 1240777 1245465 1245032 1253056 1259640 1262152 1265291 1270067 1273748 1274684 1279354 1288113
19321 1288113 1295889 1301808 1309619 1316692 1321080 1326284 1331553 1339112 1347854 1357187 1365946 1370079 1373847 1376835
19307 1376835 1378668 1382474 1381228 1373603 1364042 1351785 1334002 1306007 1275256 1243973 1207941 1168273
19295 1168273 1130006 1090777 1055575 1025744 1001087 975680 959256 949447 942308 939690 940109 944055
$$ packed form
19395A150271K518M95j047L243M933L288L52m413L787K22k260j556L897M51K249
19380A166430K951M92OJ692j42Q85n12K359J213r37j026L265M147J774j446n94
19364A180557J772J972L376M934J357J841k53j897J308L005Q15k33N219L244O32
19349A207649L59K675K251j297k49K964K550J382K945K862L541J501J836K617
19335A233586k519J693Q017M688m33Q024O584K512L139M776L681R36M670Q759
19321A288113P776N919P811P073M388N204N269P559Q742R333Q759M133L768K988
19307A376835J833L806j246p625r561j2257j7783k7995l0751l1283l6032l9668
19295A168273l8267l9229l5202k9831k4657k5407j6424r809p139k618M19L946
$$ plain form
19283 944055 947344 951187 957541 969299 978238 985514 995614 1003336 1009841 1018068 1026525 1033464 1035001 1041989
19269 1041989 1050270 1054195 1054903 1058343 1061459 1065060 1069004 1072577 1073562 1080092 1082415 1083138 1083857 1087189 1093490
19254 1093490 1100953 1105316 1107299 1108892 1113704 1115659 1115518 1115558 1115735 1118685 1125634 1125970 1123480 1126072 1129317
19239 1129317 1132226 1135788 1137368 1137335 1142212 1143269 1144859 1147744 1148397 1150635 1151442 1147083 1145394 1146305 1146027
19224 1146027 1148184 1150640 1149892 1154290 1159941 1162669 1165890 1166883 1165393 1167625 1170985 1169712 1168867 1169610 1168483
19209 1168483 1171596 1176311 1178644 1180319 1182149 1181496 1178991 1177526 1177567 1181023 1185028 1186727 1187225 1188870 1190326
19194 1190326 1190140 1192883 1194468 1196294 1192093 1187609 1187716 1190949 1196279 1198303 1194675 1193232 1194979 1198686
19180 1198686 1204065 1201713 1201523 1201980 1200620 1201133 1203370 1206736 1209545 1208392 1208882 1211745 1214691 1215125 1217173
$$ packed form
19283I44055L289L843O354J1758Q939P276J0100P722O505Q227Q457O939J537O988
19269A041989Q281L925P08L440L116L601L944L573R85O530K323P23P19L332O301
19254A093490P463M363J983J593M812J955j41M0J77K950O949L36k490K592L245
19239A129317K909L562J580l3M877J057J590K885O53K238Q07m359j689R11k78
19224A146027K157K456p48M398N651K728L221R93j490K232L360j273q45P43j127
19209A168483L113M715K333J675J830o53k505j465M1L456M005J699M98J645J456
19194A190326j86K743J585J826m201m484J07L233N330K024l628j443J747L707
19180A198686N379k352j90M57j360N13K237L366K809j153M90K863K946M34K048
$$ plain form
19165 1217173 1216570 1219534 1219996 1225331 1231380 1232655 1230144 1229292 1228378 1225134 1222059 1223420 1225541 1225555 1227506
19150 1227506 1225385 1227388 1231627 1234590 1237405 1235717 1233898 1235097 1234770 1235701 1236477 1236317 1235867 1235990 1240018
19135 1240018 1243714 1242717 1239207 1239619 1242565 1246046 1244665 1243592 1244880 1246945 1248585 1250192 1250356 1251837 1253272
19120 1253272 1253127 1254520 1255389 1256562 1256266 1257890 1256757 1256156 1259401 1259145 1257996 1262067 1264938 1264929 1265340 1264528
19104 1264528 1265024 1266408 1267908 1268089 1267844 1267998 1270473 1268822 1268806 1269190 1270126 1275026 1279117 1278043 1277918 1279250
19088 1279250 1282304 1285398 1285034 1280979 1280131 1284109 1285118 1283651 1282833 1282903 1287000 1292106 1295507 1297402 1295404
19073 1295404 1293174 1294532 1295004 1293988 1293423 1294255 1294046 1294310 1293903 1294413 1292658 1291882 1294179 1293207 1293621 1294141 1295687
19056 1295687 1298604 1305186 1307783 1307757 1308977 1310800 1311040 1307118 1303932 1304483 1307377 1310100 1309796 1310082 1308369
$$ packed form
19165A217173o03K964M62N335O049J275k511q52r14l244l075J361K121J4J951
19150A227506k121K003M239K963K815j688j819J199l27R31P76j60m50J23M028
19135A240018L696r97l510M12K946L481j381j073J288K065J640J607J64J481J435
19120A253272j45J393Q69J173k96J624j133o01L245k56j149M071K871rM11q12
19104A264528M96J384J500J81k45J54K475j651j6L84R36M900M091j074j25J332
19088A279250L054L094l64m055q48L978J009j467q18P0M097N106L401J895j998
19073A295404k230J358M72j016n65Q32k09K64m07N10j755p76K297r72M14N20J546
19056A295687K917O582K597k6J220J823K40l922l186N51K894K723l04K86j713
$$ plain form
19041 1308369 1308340 1309739 1311057 1312479 1311063 1312503 1315177 1315227 1315251 1312726 1312026 1318535 1323497 1325637 1324712 1326810
19025 1326810 1324150 1324612 1326640 1325988 1327533 1327976 1329679 1331783 1333419 1334878 1334858 1336423 1339278 1341944 1341767
19010 1341767 1339559 1340361 1338184 1338903 1341368 1343581 1346230 1346650 1345976 1345603 1346085 1346218 1347894 1347572 1350534 1351865
18994 1351865 1355650 1358112 1357499 1356033 1355512 1355830 1357529 1358940 1359026 1356686 1353429 1352836 1356357 1363498 1366365
18979 1366365 1367842 1363730 1365321 1369379 1369309 1368374 1371848 1372759 1372931 1372854 1372590 1373789 1375326 1379191 1379858 1382783
18963 1382783 1384257 1383536 1380535 1379944 1380889 1380837 1382177 1386639 1388127 1391078 1393559 1394913 1393821 1394768 1394558 1391981
18947 1391981 1391842 1391603 1392450 1390655 1392013 1393643 1398356 1399512 1400009 1400024 1401376 1399768 1400766 1402537 1403686 1404243
18931 1404243 1405215 1405889 1406859 1408206 1411423 1412102 1414957 1416738 1415455 1416795 1416875 1415520 1416691 1417807 1416211
$$ packed form
19041A308369k9J399J318J422j416J440K674N0K4k525p00O509M962K140r25K098
19025A326810k660M62K028o52J545M43J703K104J636J459k0J565K855K666j77
19010A341767k208Q02k177P19K465K213K649M20o74l73M82J33J676l22K962J331
18994A351865L785K462o13j466n21L18J699J411Q6k340l257n93L521P141K867
18979A366365J477m112J591M058p0r35L474R11J72p7k64J199J537L865O67K925
18963A382783J474p21l001n91R45n2J340M462J488K951K481J354j092R47k10k577
18947A391981j39k39Q47j795J358J630M713J156M97J5J352j608R98J771J149N57
18931A404243R72O74R70J347L217O79K855J781j283J340Q0j355J171J116j596
$$ plain form
18916 1416211 1418183 1418566 1419324 1419723 1418526 1422247 1424373 1425108 1429418 1432664 1436881 1434822 1433046 1432157 1431280
18901 1431280 1430670 1429341 1429407 1428865 1426794 1431256 1432030 1434131 1438955 1442682 1442514 1442487 1446380 1450331 1447506 1442379
18885 1442379 1441968 1445447 1448581 1449938 1449669 1448181 1449061 1452713 1458782 1457657 1453227 1452873 1457442 1461196 1458925
18870 1458925 1457990 1458640 1458405 1457473 1460507 1463207 1464025 1466203 1464504 1463006 1466914 1466004 1464467 1466320 1470775
18855 1470775 1471343 1471236 1472272 1473579 1476731 1476075 1474197 1477301 1479679 1483280 1481147 1480305 1481388 1481250 1480196
18840 1480196 1480878 1482857 1486315 1489226 1490146 1493080 1497278 1499704 1501493 1500510 1498505 1497942 1500415 1502787 1502773
18825 1502773 1506893 1507473 1504569 1504811 1504165 1503491 1506535 1505453 1506668 1509466 1510927 1509645 1508694 1509542 1512811
18810 1512811 1515669 1518565 1524630 1525959 1522932 1516203 1518367 1520255 1523472 1526872 1528434 1526939 1526462 1530349
$$ packed form
18916A416211J972L83P58L99j197L721K126P35M310L246M217k059j776q89q77
18901A431280o10j329O6n42k071M462P74K101M824L727j68k7L893L951k825n127
18885A442379m11L479L134J357k69j488Q80L652O069j125m430l54M569L754k271
18870A458925r35O50k35r32L034K700Q18K178j699j498L908r10j537J853M455
18855A470775N68j07J036J307L152o56j878L104K378L601k133q42J083j38j054
18840A480196O82J979L458K911R20K934M198K426J789r83k005n63K473K372j4
18825A502773M120N80k904K42o46o74L044j082J215K798J461j282r51Q48L269
18810A512811K858K896O065J329l027o729K164J888L217L400J562j495m77L887
$$ plain form
18796 1530349 1531911 1528701 1525651 1529117 1532903 1537125 1542052 1545475 1544743 1540583 1536783 1537960 1539420 1541888
18782 1541888 1546601 1545504 1544753 1545396 1547402 1550412 1550350 1552680 1556978 1563989 1568581 1572809 1570594 1569050 1571865
18767 1571865 1575543 1570463 1556115 1545686 1544470 1552344 1555812 1563658 1568281 1566451 1564605 1564809 1563075 1565294
18753 1565294 1572159 1571927 1565851 1563317 1567669 1572506 1572226 1571990 1578473 1584381 1582358 1583674 1588661 1580736 1575170
18738 1575170 1579932 1586868 1589946 1590647 1590923 1590622 1589965 1593195 1597991 1599842 1601272 1601802 1600314 1601865 1606498
18723 1606498 1608809 1607307 1608645 1612164 1612988 1612419 1613112 1611707 1611855 1613918 1616857 1616598 1622132 1621970 1623425
18708 1623425 1624711 1627088 1629080 1630523 1629934 1630328 1629227 1631186 1632942 1635712 1636241 1636219 1637029 1639045 1642538
18693 1642538 1640422 1643863 1644589 1642841 1641785 1641206 1642183 1648642 1649744 1650005 1650054 1651164 1652835 1652042 1652770 1656398
$$ packed form
18796A530349J562l210l050L466L786M222M927L423p32m160l800J177J460K468
18782A541888M713j097p51O43K006L010o2K330M298P011M592M228k215j544K815
18767A571865L678n080j4348j0429j216P874L468P846M623j830j846K04j734K219
18753A565294O865k32o076k534M352M837k80k36O483N908k023J316M987p925n566
18738A575170M762O936L078P01K76l01o57L230M796J851J430N30j488J551M633
18723A606498K311j502J338L519Q24n69O93j405J48K063K939k59N534j62J455
18708A623425J286K377J992J443n89L94j101J959J756K770N29k2Q10K016L493
18693A642538k116L441P26j748j056n79R77O459J102K61M9J110J671p93P28L628
$$ plain form
18677 1656398 1657939 1661512 1662022 1662022 1662350 1665287 1667606 1665351 1663006 1663294 1666818 1670514 1674524 1676625 1677678
18662 1677678 1679919 1681728 1681315 1679328 1678705 1674522 1676105 1680480 1685194 1687059 1690832 1695393 1697463 1697976 1698912
18647 1698912 1700329 1704607 1705147 1704081 1704409 1701838 1701388 1705828 1708484 1708153 1708765 1713130 1714254 1713893 1716041
18632 1716041 1714947 1716050 1717105 1718525 1719491 1720093 1721244 1723907 1727269 1725150 1723880 1725902 1731065 1733429
18618 1733429 1732991 1732877 1734460 1738067 1739273 1741632 1741580 1741587 1744037 1746969 1745724 1746563 1748475 1750018 1751275 1750688
18602 1750688 1752026 1752956 1753392 1753733 1756308 1759521 1762885 1765887 1769158 1769025 1769077 1770632 1774087 1774613 1775327 1776302
18586 1776302 1778930 1781972 1783270 1782468 1784149 1785984 1787157 1786086 1790541 1792098 1792712 1793755 1793477 1794383 1792560
18571 1792560 1793966 1796251 1799362 1800220 1802260 1806823 1808447 1808870 1812074 1812986 1812650 1811718 1814405 1819113 1818704
$$ packed form
18677A656398J541L573N10%L28K937K319k255k345K88L524L696M010K101J053
18662A677678K241J809m13j987o23m183J583M375M714J865L773M561K070N13R36
18647A698912J417M278N40j066L28k571m50M440K656l31O12M365J124l61K148
18632A716041j094J103J055J420R66O02J151K663L362k119j270K022N163K364
18618A733429m38j14J583L607J206K359n2PK450K932j245Q39J912J543J257n87
18602A750688J338R30M36L41K575L213L364L002L271j33N2J555L455N26P14R75
18586A776302K628L042J298q02J681J835J173j071M455J557O14J043k78R06j823
18571A792560J406K285L111Q58K040M563J624M23L204R12l36r32K687M708m09
$$ plain form
18556 1818704 1819328 1819466 1822913 1826927 1830164 1829470 1830254 1831938 1834242 1835325 1835843 1838677 1840997 1843907 1847901
18541 1847901 1850506 1850579 1852279 1852829 1849639 1849073 1854892 1858258 1857896 1856254 1855747 1859482 1862675 1861560 1862907
18526 1862907 1863966 1863489 1868663 1871847 1869606 1867019 1870787 1875893 1878618 1880491 1880489 1882027 1886286 1890098 1888039
18511 1888039 1886212 1890363 1894495 1892092 1894647 1899751 1902460 1904586 1907212 1906533 1905235 1909079 1912035 1915185
18497 1915185 1916058 1915710 1912147 1912209 1919501 1925603 1923700 1923940 1925633 1926151 1929323 1930534 1933903 1935297 1936403
18482 1936403 1936618 1938390 1936002 1936696 1939040 1941689 1945738 1949651 1950449 1946028 1947323 1952615 1953439 1954833 1957850
18467 1957850 1961029 1962869 1963732 1967557 1970469 1973672 1976329 1974700 1976925 1977407 1977152 1981673 1986729 1986445 1984560
18452 1984560 1986628 1988547 1992488 1995673 1998846 2000134 2002078 2004331 2004383 2006604 2007616 2005342 2011121 2016426
$$ packed form
18556A818704O24J38L447M014L237o94P84J684K304J083N18K834K320K910L994
18541A847901K605P3J700N50l190n66N819L366l62j642n07L735L193j115J347
18526A862907J059m77N174L184k241k587L768N106K725J873kJ538M259L812k059
18511A888039j827M151M132k403K555N104K709K126K626o79j298L844K956L150
18497A915185Q73l48l563O2P292O102j903K40J693N18L172J211L369J394J106
18482A936403K15J772k388O94K344K649M049L913P98m421J295N292Q24J394L017
18467A957850L179J840Q63L825K912L203K657j629K225M82k55M521N056k84j885
18452A984560K068J919L941L185L173J288J944K253N2K221J012k274N779N305
$$ plain form
18438 2016426 2017473 2021808 2024116 2019987 2016164 2018019 2023395 2025526 2026348 2027030 2032121 2034912 2036904 2043461
18424 2043461 2044315 2041574 2041415 2044152 2046744 2048277 2051384 2052553 2050588 2055554 2058983 2062795 2065830 2067820
18410 2067820 2067484 2072016 2077420 2079014 2079944 2083858 2086811 2083104 2084155 2086582 2088057 2089987 2092538 2096074
18396 2096074 2099976 2104890 2105459 2106892 2108787 2109465 2113391 2116768 2118963 2118148 2118665 2122493 2129033 2134361 2138106
18381 2138106 2136659 2134632 2135793 2137887 2140631 2137434 2135633 2141133 2145628 2150505 2154249 2158946 2156803 2154056
18367 2154056 2158523 2165040 2166825 2167787 2169843 2170804 2171978 2174869 2174886 2175726 2181145 2185424 2185756 2190445 2193048
18352 2193048 2194394 2196737 2197394 2195830 2200926 2206870 2210409 2209852 2208286 2210790 2215691 2217655 2218042 2218713 2222228
18337 2222228 2226982 2232581 2233493 2235221 2235923 2236361 2240037 2246410 2255370 2257255 2256896 2256246 2258589 2262326 2265123
$$ packed form
18438B016426J047M335K308m129l823J855N376K131Q22O82N091K791J992O557
18424B043461Q54k741j59K737K592J533L107J169j965M966L429L812L035J990
18410B067820l36M532N404J594R30L914K953l707J051K427J475J930K551L536
18396B096074L902M914N69J433J895O78L926L377K195q15N17L828O540N328L745
18381B138106j447k027J161K094K744l197j801N500M495M877L744M697k143k747
18367B154056M467O517J785R62K056R61J174K891J7Q40N419M279L32M689K603
18352B193048J346K343O57j564N096N944L539n57j566K504M901J964L87O71L515
18337B222228M754N599R12J728P02M38L676O373Q960J885l59o50K343L737K797
$$ plain form
18322 2265123 2266257 2271038 2274087 2274803 2278838 2283773 2286514 2286707 2288219 2286874 2290197 2295373 2296829 2294450
18308 2294450 2296438 2299131 2303469 2306273 2310080 2316063 2319564 2323229 2327452 2329888 2332510 2335622 2338130 2338130 2339891
18293 2339891 2345421 2349943 2350362 2354577 2356877 2354395 2356213 2361438 2362696 2363690 2366050 2369665 2375780 2379084
18279 2379084 2382779 2388119 2390643 2394577 2399946 2404229 2406823 2409419 2409870 2412268 2416344 2417275 2420271 2425975
18265 2425975 2430560 2434863 2439309 2441509 2446401 2446811 2446908 2447649 2451475 2456590 2459664 2466304 2469654 2471760 2475589
18250 2475589 2476981 2482264 2488349 2491514 2494783 2497959 2501208 2507096 2512170 2517345 2519333 2522431 2527008 2531207
18236 2531207 2536685 2541296 2546062 2548920 2550822 2555896 2560154 2561163 2567514 2574276 2577918 2581925 2585600 2591878
18222 2591878 2598196 2599920 2601964 2607319 2610428 2613026 2617358 2628302 2635127 2640583 2646627 2650617 2656517 2659570
$$ packed form
18322B265123J134M781L049P16M035M935K741J93J512j345L323N176J456k379
18308B294450J988K693M338K804L807N983L501L665M223K436K622L112K508%J761
18293B339891N530M522M19M215K300k482J818N225J258R94K360L615O115L304
18279B379084L695N340K524L934N369M283K594K596M51K398M076R31K996N704
18265B425975M585M303M446K200M892M10R7P41L826N115L074O640L350K106L829
18250B475589J392N283O085L165L269L176L249N888N074N175J988L098M577M199
18236B531207N478M611M766K858J902N074M258J009O351O762L642M007L675O278
18222B591878O318J724K044N355L109K598M332J0944O825N456O044L990N900L053
$$ plain form
18208 2659570 2663440 2669803 2677423 2684676 2690326 2697671 2704136 2707862 2715915 2725190 2733553 2744742 2751004 2760562
18194 2760562 2773274 2785422 2793992 2802965 2813295 2827352 2847009 2870287 2899156 2925635 2941604 2902839
18182 2902839 2796307 2724789 2714854 2729101 2754796 2789001 2826675 2865075 2876221 2805467 2694712
18171 2694712 2650269 2651727 2666936 2689866 2714153 2734424 2756470 2779228 2801421 2817793 2831291
18160 2831291 2842985 2853845 2863749 2876325 2889491 2906883 2924951 2939163 2951648 2965785 2977563
18149 2977563 2989389 3002839 3019102 3035207 3051818 3071457 3093562 3115235 3135355 3164810 3195088
18138 3195088 3226913 3262280 3302675 3346252 3368828 3321918 3229349 3196126 3211931 3249355 3307543
18127 3307543 3372811 3441460 3506717 3529277 3460076 3396658 3411478 3462199 3529871 3613600 3708084
$$ packed form
18208B659570L870O363P620P253N650P345O465L726Q053R275Q363J1189O262R558
18194B760562J2712J2148Q570Q973J0330J4057J9657K3278K8869K6479J5969l8765
18182B902839j06532p1518r935J4247K5695L4205L7674L8400J1146p0754j10755
18171B694712m4443J458J5209K2930K4287K0271K2046K2758K2193J6372J3498
18160B831291J1694J0860R904J2576J3166J7392J8068J4212J2485J4137J1778
18149B977563J1826J3450J6263J6105J6611J9639K2105K1673K0120K9455L0278
18138C195088L1825L5367M0395M3577K2576m6910r2569l3223J5805L7424N8188
18127C307543O5268O8649O5257K2560o9201o3418J4820N0721O7672Q3729R4484
$$ plain form
18116 3708084 3820842 3960077 4128998 4335666 4602599 4960257 5435281 6006704 6172797
18107 6172797 4266533 1179353 -41329 -141507 43728 339228 641685 909162 1129244
18098 1129244 1305015 1448792 1575798 1686216 1780772 1862988 1939065 2005050 2061501 2113564
18088 2113564 2154863 2189885 2228777 2263358 2295470 2323302 2351050 2375080 2397476 2421841 2444601
18077 2444601 2465871 2486651 2506195 2523180 2538254 2550495 2566260 2583243 2598538 2611333 2625647
18066 2625647 2639333 2655756 2669631 2680466 2687724 2694207 2706503 2720539 2730668 2741565 2752530 2762168
18054 2762168 2772755 2782834 2794992 2803273 2806945 2814182 2824429 2836481 2843992 2847511 2858946 2872048
18042 2872048 2881035 2890594 2897795 2907427 2912538 2918438 2927844 2934664 2941667 2952157 2963847 2971781 2978717
$$ packed form
18116C708084J12758J39235J68921K06668K66933L57658M75024N71423J66093
18107F172797j906264l087180j220682j00178J85235K95500L02457K67477K20082
18098A129244J75771J43777J27006J10418R4556Q2216P6077O5985N6451N2063
18088B113564M1299L5022L8892L4581L2112K7832K7748K4030K2396K4365K2760
18077B444601K1270K0780J9544J6985J5074J2241J5765J6983J5295J2795J4314
18066B625647J3686J6423J3875J0835P258O483J2296J4036J0129J0897J0965R638
18054B762168J0587J0079J2158Q281L672P237J0247J2052P511L519J1435J3102
18042B872048Q987R559P201R632N111N900R406O820P003J0490J1690P934O936
$$ plain form
18029 2978717 2985251 2994912 2999922 3005020 3010270 3016319 3025640 3030687 3036549 3043724 3051379 3056125 3065972 3076165
18015 3076165 3083994 3090662 3098059 3106004 3111947 3118944 3126323 3131577 3139134 3147494 3156650 3164571 3173593 3181692
18001 3181692 3188403 3193418 3195123 3205274 3218083 3226857 3231178 3236737 3247621 3254468 3259160 3265165 3272831
17988 3272831 3279537 3288306 3294362 3303565 3312987 3323065 3333698 3339799 3345570 3352944 3357733 3362187 3370755
17975 3370755 3377170 3379618 3389698 3400774 3406860 3412152 3418149 3431080 3444530 3453218 3457102 3460852 3465940
17962 3465940 3472005 3479946 3493187 3502852 3511870 3520952 3530182 3537056 3545308 3553368 3558901 3566708 3576349 3586151
17948 3586151 3595238 3603339 3610591 3618062 3627466 3636274 3644561 3652662 3655150 3659912 3673931 3683451 3693687
17935 3693687 3703087 3707720 3714439 3726287 3736085 3746911 3758412 3769033 3777863 3782664 3792910 3801969 3813378
$$ packed form
18029B978717O534R661N010N098N250O049R321N047N862P175P655M746R847J0193
18015C076165P829O668P397P945N943O997P379N254P557Q360R156P921R022Q099
18001C181692O711N015J705J0151J2809Q774M321N559J0884O847M692O005P666
17988C272831O706Q769O056R203R422J0078J0633O101N771P374M789M454Q568
17975C370755O415K448J0080J1076O086N292N997J2931J3450Q688L884L750N088
17962C465940O065P941J3241R665R018R082R230O874Q252Q060N533P807R641R802
17948C586151R087Q101P252P471R404Q808Q287Q101K488M762J4019R520J0236
17935C693687R400M633O719J1848R798J0826J1501J0621Q830M801J0246R059J1409
$$ plain form
17922 3813378 3825662 3833146 3842655 3848336 3860651 3872465 3882123 3892449 3902249 3913096 3928105 3939416
17910 3939416 3949002 3960732 3973203 3975623 3981022 3987797 3999798 4012650 4027368 4046267 4056755 4062291
17898 4062291 4069870 4081791 4092416 4098260 4109280 4121227 4133105 4146318 4157689 4170525 4180544 4192801
17886 4192801 4202520 4211447 4218935 4232111 4249597 4265298 4281372 4297350 4313916 4328984 4344397 4357857
17874 4357857 4353396 4345910 4353880 4374653 4399833 4420729 4440424 4463016 4481011 4498157 4516957 4525145
17862 4525145 4530359 4549018 4576616 4608348 4641171 4679587 4717353 4745699 4709215 4621075 4580942
17851 4580942 4591753 4625421 4664233 4673634 4600769 4511649 4487611 4503701 4532410 4562464 4592376
17840 4592376 4624372 4649498 4674924 4694249 4714449 4741780 4769291 4794013 4815826 4835246 4855040
$$ packed form
17922C813378J2284P484R509N681J2315J1814R658J0326R800J0847J5009J1311
17910C939416R586J1730J2471K420N399O775J2001J2852J4718J8899J0488N536
17898D062291P579J1921J0625N844J1020J1947J1878J3213J1371J2836J0019J2257
17886D192801R719Q927P488J3176J7486J5701J6074J5978J6566J5068J5413J3460
17874D357857m461p486P970K0773K5180K0896J9695K2592J7995J7146J8800Q188
17862D525145N214J8659K7598L1732L2823L8416L7766K8346l6484q8140m0133
17851D580942J0811L3668L8812R401p2865q9120k4038J6090K8709L0054K9912
17840D592376L1996K5126K5426J9325K0200K7331K7511K4722K1813J9420J9794
$$ plain form
17829 4855040 4878613 4901908 4922391 4942310 4960961 4982926 5010547 5040621 5068370 5093074 5117620
17818 5117620 5145143 5169077 5194653 5223569 5256358 5292005 5335484 5389445 5445718 5493063 5494394
17807 5494394 5464498 5458893 5418583 5320229 5275871 5295742 5342134 5403175 5434743 5384814 5289646
17796 5289646 5260553 5280754 5323071 5370464 5416412 5456604 5490950 5524375 5558296 5594954 5634117
17785 5634117 5668382 5702801 5738914 5771494 5800671 5833026 5862643 5894304 5925680 5960681 6004539
17774 6004539 6050572 6087245 6115482 6151270 6187754 6224981 6262663 6296562 6336235 6382864 6442732
17763 6442732 6509709 6571782 6606800 6590760 6577725 6611816 6668656 6698455 6629359 6532068 6518661
17752 6518661 6560140 6614863 6677007 6738503 6800290 6854530 6909473 6966687 7025111 7083428 7141416
$$ packed form
17829D855040K3573K3295K0483J9919J8651K1965K7621L0074K7749K4704K4546
17818E117620K7523K3934K5576K8916L2789L5647M3479N3961N6273M7345J331
17807E494394k9896n605m0310r8354m4358J9871M6392O1041L1568m9929r5168
17796E289646k9093K0201M2317M7393M5948M0192L4346L3425L3921L6658L9163
17785E634117L4265L4419L6113L2580K9177L2355K9617L1661L1376L5001M3858
17774F004539M6033L6673K8237L5788L6484L7227L7682L3899L9673M6629N9868
17763F442732O6977O2073L5018j6040j3035L4091N6840K9799o9096r7291j3407
17752F518661M1479N4723O2144O1496O1787N4240N4943N7214N8424N8317N7988
$$ plain form
17741 7141416 7199173 7257456 7313261 7372035 7428508 7484024 7538227 7602505 7668967 7735809 7801222
17730 7801222 7867380 7936904 8007593 8083378 8162890 8240685 8322471 8413481 8502790 8597041 8696302
17719 8696302 8804340 8934918 9087238 9267592 9441543 9452369 9123893 8838647 8838451 8958451
17709 8958451 9105980 9178026 9130350 9137085 9247913 9395079 9552470 9709561 9872613 10031268
17699 10031268 10187747 10350939 10518533 10691031 10868055 11055902 11252820 11454712 11668318
17690 11668318 11895914 12135215 12387329 12637470 12800264 12846654 12984403 13255896 13588764
17681 13588764 13944802 14292301 14600204 14902246 15270142 15619299 15975809 16443535 16999758
17672 16999758 17608939 18254323 18942084 19677684 20485620 21368927 22332331 23552061 25137079
$$ packed form
17741G141416N7757N8283N5805N8774N6473N5516N4203O4278O6462O6842O5413
17730G801222O6158O9524P0689P5785P9512P7795Q1786R1010Q9309R4251R9261
17719H696302J08038J30578J52320J80354J73951J0826l28476k85246j96J20000
17709H958451J47529P2046m7676O735J10828J47166J57391J57091J63052J58655
17699A0031268J56479J63192J67594J72498J77024J87847J96918K01892K13606
17690A1668318K27596K39301K52114K50141J62794M6390J37749K71493L32868
17681A3588764L56038L47499L07903L02042L67896L49157L56510M67726N56223
17672A6999758O09181O45384O87761P35600Q07936Q83307R63404J219730J585018
$$ plain form
17663 25137079 27071935 29416626 32438257 36322857 40501916 40423229 25587192 5453886
17655 5453886 -1942338 -1936940 309008 3599311 7425215 11716475 16645601 22157378 26306271
17646 26306271 19221486 -3552092 -17744080 -19889512 -18603808 -16045716 -13094171 -10308862
17638 -10308862 -7873688 -5802442 -4029985 -2506113 -1102000 186607 1356827 2485044
17630 2485044 3503181 4419286 5249164 6074520 6833826 7566814 8421616 9390399 10420180
17621 10420180 11467036 12616736 13943117 15484545 17304715 19394040 21760055 24638689
17613 24638689 28334665 32907051 37519048 36662577 19102777 -3889060 -12907885 -13290217
17605 -13290217 -10493991 -6146990 -1198470 4170572 10157708 16546482 20587771 10308219
$$ packed form
17663B5137079J934856K344691L021631L884600M179059p8687j4836037k0133306
17655E453886p396224N398K245948L290303L825904M291260M929126N511777M148893
17646B6306271p084785k2773578j4191988k145432J285704K558092K951545K785309
17638a0308862K435174K071246J772457J523872J404113J288607J170220J128217
17630B485044J018137R16105Q29878Q25356P59306P32988Q54802R68783J029781
17621A0420180J046856J149700J326381J541428J820170K089325K366015K878634
17613B4638689L695976M572386M611997q56471j7559800k2991837r018825l82332
17605a3290217K796226M347001M948520N369042N987136O388774M041289j0279552
$$ plain form
17597 10308219 -17633789 -35118469 -38258797 -36861554 -33915135 -30600799 -27426093 -24658060
17589 -24658060 -22371524 -20395550 -18703065 -17330436 -16159248 -15089189 -14077310 -13140155
17581 -13140155 -12294243 -11535788 -10837296 -10185524 -9578505 -9064829 -8699793 -8346490 -7925056
17572 -7925056 -7491418 -7079916 -6766250 -6655808 -6598005 -6406894 -6125127 -5835241 -5566544 -5306204
17562 -5306204 -5038195 -4772545 -4524106 -4304269 -4108065 -3914882 -3713811 -3510454 -3309595
17553 -3309595 -3113876 -2921321 -2730003 -2545460 -2362324 -2161616 -1945228 -1706627 -1432496
17544 -1432496 -1116066 -824182 -898503 -1779218 -2627907 -2828191 -2747126 -2575554 -2375759 -2181098
17534 -2181098 -1996921 -1828980 -1692152 -1572276 -1446069 -1321594 -1197786 -1081208 -973684
$$ packed form
17597A0308219k7942008j7484680l140328J397243K946419L314336L174706K768033
17589b4658060K286536J975974J692485J372629J171188J070059J011879R37155
17581a3140155Q45912P58455O98492O51772O07019N13676L65036L53303M21434
17572g925056M33638M11502L13666J10442N7803J91111K81767K89886K68697K60340
17562e306204K68009K65650K48439K19837J96204J93183K01071K03357K00859
17553c309595J95719J92555J91318J84543J83136K00708K16388K38601K74131
17544a432496L16430K91884p4321q80715q48689k00284Q1065J71572J99795J94661
17534b181098J84177J67941J36828J19876J26207J24475J23808J16578J07524
$$ plain form
17525 -973684 -871263 -781470 -695679 -612412 -530178 -446771 -356864 -266742 -179198 -103286 -37267
17514 -37267 16313 66534 133529 212124 286798 353645 418701 488614 561165 642008 718341 774383
17502 774383 808227 846494 902281 968918 1037612 1101795 1169829 1238849 1304807 1369126 1434093
17491 1434093 1492985 1542772 1591846 1650115 1704912 1760522 1810992 1859521 1907571 1960226 2016854
17480 2016854 2075560 2132727 2185489 2234707 2278954 2329517 2383187 2432842 2490035 2548906 2609538
17469 2609538 2667555 2714867 2752168 2784087 2818535 2862456 2916585 2974094 3030250 3083773 3139655
17458 3139655 3197883 3252063 3299146 3342170 3392176 3439121 3494477 3554215 3610451 3668192 3732080
17447 3732080 3802344 3862665 3915270 3968700 4023881 4072094 4122730 4169035 4219480 4276499 4338933
$$ packed form
17525i73684J02421Q9793Q5791Q3267Q2234Q3407Q9907R0122Q7544P5912O6019
17514c7267N3580N0221O6995P8595P4674O6847O5056O9913P2551Q0843P6333N6042
17502G74383L3844L8267N5787O6637O8694O4183O8034O9020O5958O4319O4967
17491A434093N8892M9787M9074N8269N4797N5610N0470M8529M8050N2655N6628
17480B016854N8706N7167N2762M9218M4247N0563N3670M9655N7193N8871O0632
17469B609538N8017M7312L7301L1919L4448M3921N4129N7509N6156N3523N5882
17458C139655N8228N4180M7083M3024N0006M6945N5356N9738N6236N7741O3888
17447C732080P0264O0321N2605N3430N5181M8213N0636M6305N0445N7019O2434
$$ plain form
17436 4338933 4408946 4472677 4533279 4595190 4654889 4711635 4769259 4842890 4913631 4984230 5055479
17425 5055479 5122222 5188770 5257221 5325219 5396283 5457029 5506591 5558179 5613097 5681588 5754811
17414 5754811 5823313 5898178 5975497 6053229 6134108 6213790 6281273 6352014 6432838 6519028 6612567
17403 6612567 6700433 6786589 6877259 6974653 7071876 7165909 7251123 7333824 7419488 7505340 7603681
17392 7603681 7713033 7821635 7941506 8062641 8178417 8298439 8421033 8534091 8642025
17383 8642025 8761086 8894384 9042851 9195624 9341626 9490265 9635070 9781281 9937463
17374 9937463 10095525 10260502 10431164 10614742 10815743 11027720 11249906 11482124 11720868
17365 11720868 11945540 12138468 12362154 12607025 12826743 13084936 13400321 13746138 14114302
$$ packed form
17436D338933P0013O3731O0602O1911N9699N6746N7624P3631P0741P0599P1249
17425E055479O6743O6548O8451O7998P1064O0746M9562N1588N4918O8491P3223
17414E754811O8502P4865P7319P7732Q0879P9682O7483P0741Q0824Q6190R3539
17403F612567Q7866Q6156R0670R7394R7223R4033Q5214Q2701Q5664Q5852R8341
17392G603681J09352J08602J19871J21135J15776J20022J22594J13058J07934
17383H642025J19061J33298J48467J52773J46002J48639J44805J46211J56182
17374I937463J58062J64977J70662J83578K01001K11977K22186K32218K38744
17365A1720868K24672J92928K23686K44871K19718K58193L15385L45817L68164
$$ plain form
17356 14114302 14488135 14835243 15178260 15575542 15983805 16453379 17070147 17809352 18670943
17347 18670943 19687318 20898436 22324915 23843547 23908901 19361631 14049900 12763833
17339 12763833 13468316 14883613 16645452 18620247 20946905 23711888 26900365 28953205
17331 28953205 23115150 8600783 698887 -303791 761494 2643403 4629037 6405495
17323 6405495 8029664 9519565 10862719 12077676 13278152 14511891 15739515 16910334
17315 16910334 17959108 18969962 20045491 21066208 22125126 23348657 24730985 26250769
17307 26250769 27828834 29391633 30976660 32772887 34693265 36532572 38822091 42152006
17299 42152006 46412301 51446097 57384988 64816088 73278780 75512324 51307537 8785521
$$ packed form
17356A4114302L73833L47108L43017L97282M08263M69574O16768P39205Q61591
17347A8670943J016375J211118J426479J518632O5354m547270n311731j286067
17339A2763833P04483J415297J761839J974795K326658K764983L188477K052840
17331B8953205n838055j4514367p901896j002678J065285J881909J985634J776458
17323F405495J624169J489901J343154J214957J200476J233739J227624J170819
17315A6910334J048774J010854J075529J020717J058918J223531J382328J519784
17307B6250769J578065J562799J585027J796227J920378J839307K289519L329915
17299D2152006M260295N033796N938891P431100Q462692K233544k4204787m2522016
$$ plain form
17291 8785521 -11902763 -14063690 -9950097 -3085111 4782444 13333526 22581729 32517955
17283 32517955 41177247 36936382 9285001 -12516916 -13846750 -6069812 5434625 15687656
17275 15687656 8517993 -30191121 -63562724 -72537265 -71153875 -66103123 -59933853 -53873376
17267 -53873376 -48452033 -43846685 -39916884 -36570149 -33659291 -30991619 -28665478 -26711735
17259 -26711735 -25100411 -23720566 -22317111 -20883307 -19479478 -18127013 -16811677 -15549288
17251 -15549288 -14338132 -13163960 -12022007 -10916696 -9831520 -8729744 -7606375 -6457485
17243 -6457485 -5285451 -4159152 -3166094 -2137461 -1027426 120882 1348049 2708188
17235 2708188 4425311 6626358 9352436 12532836 16509319 21861378 28481694 34213272
$$ packed form
17291H785521k0688284k160927M113593O864986P867555Q551082R248203R936226
17283C2517955Q659292m240865k7651381k1801917j329834P776938J1504437J0253031
17275A5687656p169663l8709114l3371603q974541J383390N050752O169270O060477
17267e3873376N421343M605348L929801L346735K910858K667672K326141J953743
17259b6711735J611324J379845J403455J433804J403829J352465J315336J262389
17251a5549288J211156J174172J141953J105311J085176J101776J123369J148890
17243f457485J172034J126299R93058J028633J110035J148308J227167J360139
17235B708188J717123K201047K726078L180400L976483N352059O620316N731578
$$ plain form
17227 34213272 27669588 -2868877 -33326805 -47977248 -51180812 -49285983 -45552887 -41459828
17219 -41459828 -37722237 -34565123 -31912138 -29622883 -27631316 -25899973 -24358234 -22989281
17211 -22989281 -21777949 -20722422 -19804080 -18972508 -18200163 -17481280 -16795188 -16143771 -15529609
17202 -15529609 -14943084 -14383373 -13855234 -13351373 -12858909 -12367718 -11871006 -11357652 -10823239
17193 -10823239 -10304052 -9870272 -9528424 -9212764 -8784477 -8272410 -7800577 -7407787 -6917551
17184 -6917551 -6120306 -5095212 -3843675 -2181701 -94652 2062688 1657637 -7245355
17176 -7245355 -18333070 -22170891 -22397549 -21596245 -20341705 -19033366 -17863574 -16884958
17168 -16884958 -16072954 -15372033 -14752407 -14201085 -13701990 -13253406 -12867205 -12522298 -12213233
$$ packed form
17227C4213272o543684l0538465l0457928j4650443l203564J894829L733096M093059
17219d1459828L737591L157114K652985K289255J991567J731343J541739J368953
17211b2989281J211332J055527R18342Q31572P72345P18883O86092O51417O14162
17202a5529609N86525N59711N28139N03861M92464M91191M96712N13354N34413
17193a0823239N19187M33780L41848L15660M28287N12067M71833L92790M90236
17184f917551P97245J025094J251537J661974K087049K157340m05051q902992
17176g245355j1087715l837821k26658Q01304J254540J308339J169792R78616
17168a6884958Q12004P00921O19626N51322M99095M48584L86201L44907L09065
$$ plain form
17159 -12213233 -11931404 -11660888 -11410237 -11186683 -10996413 -10815646 -10632241 -10455618 -10288180
17150 -10288180 -10134640 -9991357 -9845292 -9697333 -9537240 -9375152 -9223550 -9084735 -8970089
17141 -8970089 -8924050 -8868711 -8757102 -8639914 -8583368 -8559210 -8491705 -8389161 -8284104 -8175387
17131 -8175387 -8068449 -7973230 -7883185 -7789407 -7698515 -7617320 -7534512 -7436420 -7336303 -7230242 -7123018
17120 -7123018 -7022413 -6974230 -7049761 -7156174 -7166966 -7121140 -7052681 -6973783 -6893602 -6806230 -6725691
17109 -6725691 -6653639 -6579436 -6503068 -6430059 -6350467 -6296670 -6345291 -6430248 -6435610 -6391262 -6331384
17098 -6331384 -6261256 -6192634 -6128850 -6073063 -6019733 -5968097 -5918108 -5866483 -5811380 -5759699 -5713148
17087 -5713148 -5664570 -5614305 -5573441 -5540235 -5497130 -5448276 -5397286 -5352651 -5304799 -5260478 -5218309
$$ packed form
17159a2213233K81829K70516K50651K23554J90270J80767J83405J76623J67438
17150a0288180J53540J43283J46065J47959J60093J62088J51602J38815J14646
17141h970089M6039N5339J11609J17188N6546K4158O7505J02544J05057J08717
17131h175387J06938R5219R0045R3778R0892Q1195Q2808R8092J00117J06061J07224
17120g123018J00605M8183p5531j06413j0792M5826O8459P8898Q0181Q7372Q0539
17109f725691P2052P4203P6368P3009P9592N3797m8621q4957n362M4348N9878
17098f331384P0128O8622O3784N5787N3330N1636M9989N1625N5103N1681M6551
17087e713148M8578N0265M0864L3206M3105M8854N0990M4635M7852M4321M2169
$$ plain form
17076 -5218309 -5171236 -5119418 -5080874 -5089718 -5132670 -5148708 -5132309 -5100071 -5066405 -5031661 -4991448
17065 -4991448 -4947392 -4900269 -4856554 -4814338 -4773052 -4735543 -4701051 -4704183 -4748250 -4766974 -4754453
17054 -4754453 -4721367 -4677310 -4637035 -4600799 -4567247 -4535869 -4502851 -4472679 -4444743 -4415735 -4390204
17043 -4390204 -4364741 -4334899 -4307191 -4278631 -4249128 -4215392 -4189031 -4170617 -4146789 -4119090 -4093029
17032 -4093029 -4066017 -4033526 -4003170 -3980635 -3960442 -3934440 -3914820 -3900570 -3879051 -3854731 -3832628
17021 -3832628 -3813847 -3793937 -3772871 -3754983 -3736235 -3715577 -3694736 -3671446 -3650074 -3633384 -3617107
17010 -3617107 -3600149 -3581550 -3560518 -3541846 -3524044 -3505740 -3487479 -3467595 -3446951 -3427933 -3410649
16999 -3410649 -3394903 -3376616 -3359782 -3343683 -3326056 -3307741 -3288233 -3273147 -3259065 -3244126 -3224915
$$ packed form
17076e218309M7073N1818L8544q844m2952j6038J6399L2238L3666L4744M0213
17065d991448M4056M7123M3715M2216M1286L7509L4492l132m4067j8724J2521
17054d754453L3086M4057M0275L6236L3552L1378L3018L0172K7936K9008K5531
17043d390204K5463K9842K7708K8560K9503L3736K6361J8414K3828K7699K6061
17032d093029K7012L2491L0356K2535K0193K6002J9620J4250K1519K4320K2103
17021c832628J8781J9910K1066J7888J8748K0658K0841K3290K1372J6690J6277
17010c617107J6958J8599K1032J8672J7802J8304J8261J9884K0644J9018J7284
16999c410649J5746J8287J6834J6099J7627J8315J9508J5086J4082J4939J9211
$$ plain form
16988 -3224915 -3209978 -3194691 -3176604 -3158075 -3136371 -3115685 -3097638 -3084489 -3075210 -3061969 -3049769
16977 -3049769 -3036851 -3017028 -2996025 -2979324 -2965658 -2949517 -2934167 -2923581 -2912026 -2893233 -2877827
16966 -2877827 -2863961 -2849021 -2827750 -2809259 -2799014 -2789930 -2775947 -2759601 -2743780 -2728064 -2716291
16955 -2716291 -2704510 -2693129 -2683089 -2673297 -2665782 -2654119 -2636294 -2614362 -2595150 -2581448 -2566863 -2549577
16943 -2549577 -2536843 -2525846 -2512108 -2498333 -2488327 -2475560 -2463139 -2449537 -2437607 -2426839 -2416686
16932 -2416686 -2408924 -2401474 -2389095 -2373578 -2357915 -2346043 -2334719 -2322042 -2309417 -2295864 -2285395 -2273235
16920 -2273235 -2261005 -2249016 -2235874 -2224098 -2213511 -2202190 -2191313 -2181075 -2170859 -2161649 -2151219
16909 -2151219 -2138796 -2125104 -2111558 -2102900 -2094736 -2087135 -2077773 -2065941 -2053987 -2042002 -2030270 -2017638
$$ packed form
16988c224915J4937J5287J8087J8529K1704K0686J8047J3149R279J3241J2200
16977c049769J2918J9823K1003J6701J3666J6141J5350J0586J1555J8793J5406
16966b877827J3866J4940K1271J8491J0245R084J3983J6346J5821J5716J1773
16955b716291J1781J1381J0040R792P515J1663J7825K1932J9212J3702J4585J7286
16943b549577J2734J0997J3738J3775J0006J2767J2421J3602J1930J0768J0153
16932b416686P762P450J2379J5517J5663J1872J1324J2677J2625J3553J0469J2160
16920b273235J2230J1989J3142J1776J0587J1321J0877J0238J0216R210J0430
16909b151219J2423J3692J3546Q658Q164P601R362J1832J1954J1985J1732J2632
$$ plain form
16897 -2017638 -2002420 -1990827 -1979352 -1972064 -1960289 -1946463 -1937804 -1931363 -1922833 -1908738 -1898135 -1889686
16885 -1889686 -1881032 -1872873 -1866571 -1857114 -1843895 -1835008 -1823100 -1813185 -1800477 -1787419 -1777560 -1772522 -1767868
16872 -1767868 -1757388 -1743698 -1730480 -1722068 -1715989 -1705394 -1693647 -1684141 -1669938 -1657904 -1650041 -1642675
16860 -1642675 -1632095 -1620827 -1612384 -1600142 -1587234 -1580588 -1577085 -1567438 -1552418 -1539110 -1529023 -1520453
16848 -1520453 -1511045 -1500472 -1489320 -1480283 -1470845 -1461928 -1450861 -1437532 -1425642 -1415167 -1407150 -1397310
16836 -1397310 -1387901 -1378573 -1369346 -1358847 -1346840 -1339440 -1330710 -1317199 -1302196 -1286531 -1278753 -1274355 -1264930
16823 -1264930 -1252807 -1243225 -1234292 -1223746 -1208882 -1195875 -1182366 -1162111 -1149912 -1137391 -1119671 -1101263
16811 -1101263 -1083849 -1065527 -1043682 -1020123 -993750 -962559 -925418 -899954 -952194 -1074677 -1137434
$$ packed form
16897b017638J5218J1593J1475P288J1775J3826Q659O441Q530J4095J0603Q449
16885a889686Q654Q159O302R457J3219Q887J1908R915J2708J3058R859N038M654
16872a767868J0480J3690J3218Q412O079J0595J1747R506J4203J2034P863P366
16860a642675J0580J1268Q443J2242J2908O646L503R647J5020J3308J0087Q570
16848a520453R408J0573J1152R037R438Q917J1067J3329J1890J0475Q017R840
16836a397310R409R328R227J0499J2007P400Q730J3511J5003J5665P778M398R425
16823a264930J2123R582Q933J0546J4864J3007J3509K0255J2199J2521J7720J8408
16811a101263J7414J8322K1845K3559K6373L1191L7141K5464n2240j22483o2757
$$ plain form
16800 -1137434 -1127262 -1090090 -1049844 -1036411 -1111217 -1224093 -1266118 -1263006 -1241318 -1215033 -1183167
16789 -1183167 -1152381 -1129149 -1105039 -1083745 -1064971 -1044491 -1028405 -1013509 -995555 -976224 -959583
16778 -959583 -947018 -932434 -915948 -897492 -881463 -862338 -839566 -816156 -794076 -769931 -735278
16767 -735278 -693014 -659285 -668770 -776230 -892640 -926021 -914915 -886411 -852660 -815565 -772731
16756 -772731 -729768 -695222 -708017 -796092 -858101 -859114 -831349 -797339 -771487 -804316 -890132 -928042
16744 -928042 -921308 -900859 -876080 -847759 -818041 -791081 -769056 -748833 -728403 -705951 -685409 -668643
16732 -668643 -650683 -634606 -621358 -608753 -589008 -565359 -544710 -524981 -505325 -487543 -464907
16721 -464907 -439521 -413111 -383159 -346446 -300132 -266275 -293254 -386024 -432443 -474068 -579105
$$ packed form
16800a137434J0172L7172M0246J3433p4806j12876m2025L112K1688K6285L1866
16789a183167L0786K3232K4110K1294J8774K0480J6086J4896J7954J9331J6641
16778i59583J2565J4584J6486J8456J6029J9125K2772K3410K2080K4145L4653
16767g35278M2264L3729r485j07460j16410l3381J1106K8504L3751L7095M2834
16756g72731M2963L4546j2795q8075o2009j013K7765L4010K5852l2829q5816l7910
16744i28042O734K0449K4779K8321K9718K6960K2025K0223K0430K2452K0542J6766
16732f68643J7960J6077J3248J2605J9745K3649K0649J9729J9656J7782K2636
16721d64907K5386K6410K9952L6713M6314L3857k6979r2770m6419m1625j05037
$$ plain form
16710 -579105 -653357 -660157 -639422 -603986 -566460 -532795 -501154 -467161 -439373 -413533 -385619 -360838
16698 -360838 -332432 -303449 -267009 -231676 -200559 -172655 -143119 -106810 -67263 -19241 38721
16687 38721 102894 174605 265895 389938 550216 727030 792578 332189 -661070 -1277098
16677 -1277098 -1420019 -1391479 -1294935 -1182926 -1081875 -999309 -922678 -852235 -792483 -733008 -674759
16666 -674759 -622570 -574330 -524141 -501246 -555766 -639343 -661296 -643646 -617679 -590170 -562113
16655 -562113 -536212 -512940 -489725 -465799 -446023 -427942 -405410 -383503 -367538 -354672 -339856
16644 -339856 -322145 -314266 -307380 -292069 -279501 -265322 -250710 -238940 -229844 -218526 -208316 -200019
16632 -200019 -189992 -175989 -159113 -149363 -135944 -121154 -111176 -101271 -92790 -86723 -77693 -68696 -65742
$$ packed form
16710e79105p4252o800K0735L5436L7526L3665L1641L3993K7788K5840K7914K4781
16698c60838K8406K8983L6440L5333L1117K7904K9536L6309L9547M8022N7962
16687C8721O4173P1711R1290J24043J60278J76814O5548m60389r93259o16028
16677a277098j42921K8540R6544J12009J01051Q2566P6631P0443N9752N9475N8249
16666f74759N2189M8240N0189K2895n4520q3577k1953J7650K5967K7509K8057
16655e62113K5901K3272K3215K3926J9776J8081K2532K1907J5965J2866J4816
16644c39856J7711P879O886J5311J2568J4179J4612J1770R096J1318J0210Q297
16632b00019J0027J4003J6876R750J3419J4790R978R905Q481O067R030Q997K954
$$ plain form
16619 -65742 -59664 -53455 -46160 -34023 -15260 652 10533 16558 20296 23424 26660 31161 39346 45182
16605 45182 49004 60598 74801 84711 93803 105048 119601 139771 149080 149698 154117 159439 168200
16592 168200 177525 185050 189839 196338 207541 218366 223367 227328 226743 230446 242783 257865 269397
16579 269397 282247 291737 301794 315631 326171 336642 347478 358210 365597 372332 377931 383375
16567 383375 389403 402238 412146 419120 424128 430382 438664 444325 451759 458748 468638 478860 488301 491908
16553 491908 496056 504754 515074 527866 541493 549955 557542 569384 579277 588576 600765 609021 615388
16540 615388 625195 634012 641910 648498 654254 665160 678991 691595 702085 709226 717451 725753 737705
16527 737705 747348 751482 764739 776926 783497 790174 799673 811934 826917 839957 851862 863150
$$ packed form
16619f5742O078O209P295J2137J8763J5912R881O025L738L128L236M501Q185N836
16605D5182L822J1594J4203R910R092J1245J4553K0170R309O18M419N322Q761
16592A68200R325P525M789O499J1203J0825N001L961n85L703J2337J5082J1532
16579B69397J2850R490J0057J3837J0540J0471J0836J0732P387O735N599N444
16567C83375O028J2835R908O974N008O254Q282N661P434O989R890J0222R441L607
16553D91908M148Q698J0320J2792J3627Q462P587J1842R893R299J2189Q256O367
16540F15388R807Q817P898O588N756J0906J3831J2604J0490P141Q225Q302J1952
16527G37705R643M134J3257J2187O571O677R499J2261J4983J3040J1905J1288
$$ plain form
16515 863150 867702 871415 878871 888578 898962 912079 926352 935001 945815 956969 964289 969819 976487
16502 976487 985605 1000235 1009991 1017456 1026042 1034196 1044226 1052596 1063539 1072232 1080354 1090032 1106713
16489 1106713 1118816 1127023 1134653 1142937 1148788 1156499 1170462 1185678 1198886 1212011 1224559 1234217
16477 1234217 1242083 1247667 1256742 1270189 1284526 1298135 1311558 1326385 1341230 1356445 1370720 1385638
16465 1385638 1398839 1407446 1415977 1425310 1430334 1436855 1448779 1459799 1472360 1482885 1491748 1503414
16453 1503414 1515485 1528199 1543216 1563362 1577358 1585515 1595641 1608150 1619149 1637801 1660874
16442 1660874 1669355 1676644 1686482 1695959 1704195 1714110 1722143 1730220 1745112 1759707 1776837 1788973 1794947
16429 1794947 1803447 1816847 1833820 1851875 1873522 1897854 1919570 1934691 1951354 1971913 1991695
$$ packed form
16515H63150M552L713P456R707J0384J3117J4273Q649J0814J1154P320N530O668
16502I76487R118J4630R756P465Q586Q154J0030Q370J0943Q693Q122R678J6681
16489A106713J2103Q207P630Q284N851P711J3963J5216J3208J3125J2548R658
16477A234217P866N584R075J3447J4337J3609J3423J4827J4845J5215J4275J4918
16465A385638J3201Q607Q531R333N024O521J1924J1020J2561J0525Q863J1666
16453A503414J2071J2714J5017K0146J3996Q157J0126J2509J0999J8652K3073
16442A660874Q481P289R838R477Q236R915Q033Q077J4892J4595J7130J2136N974
16429A794947Q500J3400J6973J8055K1647K4332K1716J5121J6663K0559J9782
$$ plain form
16418 1991695 2010542 2030380 2044269 2055815 2070930 2082874 2097183 2106931 2113961 2123284 2132228 2146246
16406 2146246 2161143 2176386 2195256 2212134 2226788 2240058 2259822 2282463 2306812 2333250 2353910
16395 2353910 2374050 2392874 2407595 2422674 2448668 2471816 2487846 2501947 2518620 2533866 2542505
16384 2542505 2559919 2587287 2603625 2621339 2634789 2643396 2668580 2711371 2737593 2741620 2727766 2716371
16372 2716371 2714862 2707855 2706632 2723613 2749155 2766639 2775798 2778432 2788137 2816698 2865412 2896682
16360 2896682 2903717 2907713 2932413 2964151 2998842 3029829 3060205 3087151 3106059 3116262 3141783 3173814
16348 3173814 3202773 3230569 3264573 3299994 3330096 3352339 3367344 3384213 3400247 3421897 3454634
16337 3454634 3493246 3531858 3565982 3592826 3621220 3657714 3694651 3734031 3777325 3811567 3838959
$$ packed form
16418A991695J8847J9838J3889J1546J5115J1944J4309R748P030R323Q944J4018
16406B146246J4897J5243J8870J6878J4654J3270J9764K2641K4349K6438K0660
16395B353910K0140J8824J4721J5079K5994K3148J6030J4101J6673J5246Q639
16384B542505J7414K7368J6338J7714J3450Q607K5184M2791K6222M027j3854j1395
16372B716371j509p007j223J6981K5542J7484R159K634R705K8561M8714L1270
16360B896682P035L996K4700L1738L4691L0987L0376K6946J8908J0203K5521L2031
16348C173814K8959K7796L4004L5421L0102K2243J5005J6869J6034K1650L2737
16337C454634L8612L8612L4124K6844K8394L6494L6937L9380M3294L4242K7392
$$ plain form
16326 3838959 3857803 3868216 3864818 3863648 3883080 3922198 3960424 3995519 4032257 4067703 4098474 4128626
16314 4128626 4157010 4184224 4215665 4247348 4284123 4328263 4366497 4401693 4435474 4463072 4492642
16303 4492642 4521982 4541142 4561862 4587344 4619108 4669545 4726085 4777032 4823792 4873283 4923673
16292 4923673 4971859 5014560 5059152 5101820 5134042 5193764 5264715 5315466 5370615 5429130 5475401
16281 5475401 5514690 5557471 5605204 5649465 5694009 5742643 5800011 5857617 5915610 5970923 6022908
16270 6022908 6071517 6122858 6180524 6235028 6289224 6336890 6383902 6433843 6506540 6586015 6659653
16259 6659653 6709110 6758619 6819507 6881539 6946827 7003135 7062900 7129391 7204444 7296390 7387782
16248 7387782 7467777 7542318 7605275 7668299 7755472 7837178 7900808 7982039 8086330 8197816 8305831
$$ packed form
16326C838959J8844J0413l398j170J9432L9118L8226L5095L6738L5446L0771L0152
16314D128626K8384K7214L1441L1683L6775M4140L8234L5196L3781K7598K9570
16303D492642K9340J9160K0720K5482L1764N0437N6540N0947M6760M9491N0390
16292D923673M8186M2701M4592M2668L2222N9722P0951N0751N5149N8515M6271
16281E475401L9289M2781M7733M4261M4544M8634N7368N7606N7993N5313N1985
16270F022908M8609N1341N7666N4504N4196M7666M7012M9941P2697P9475P3638
16259F659653M9457M9509O0888O2032O5288N6308N9765O6491P5053R1946R1392
16248G387782P9995P4541O2957O3024Q7173Q1706O3630Q1231J04291J11486J08015
$$ plain form
16237 8305831 8400952 8480536 8558821 8641600 8732448 8838503 8943698 9045432 9158569 9271982
16227 9271982 9391412 9515771 9631628 9749102 9864542 9978707 10107620 10255877 10409772
16218 10409772 10559548 10704750 10840371 10960014 11087414 11227030 11370136 11527249 11701831
16209 11701831 11878240 12058049 12253568 12458471 12668868 12879421 13080995 13290883 13507366
16200 13507366 13724237 13945907 14178940 14424443 14671721 14911022 15155787 15419622 15720786
16191 15720786 16048741 16394218 16733039 17062233 17392148 17719267 18054193 18410989 18795189
16182 18795189 19209718 19643194 20094570 20549217 21007064 21484799 21995420 22512729 23060660
16173 23060660 23647625 24252251 24889360 25558307 26263269 27003199 27799784 28688350 29643289
$$ packed form
16237H305831R5121P9584P8285Q2779R0848J06055J05195J01734J13137J13413
16227I271982J19430J24359J15857J17474J15440J14165J28913J48257J53895
16218A0409772J49776J45202J35621J19643J27400J39616J43106J57113J74582
16209A1701831J76409J79809J95519K04903K10397K10553K01574K09888K16483
16200A3507366K16871K21670K33033K45503K47278K39301K44765K63835L01164
16191A5720786L27955L45477L38821L29194L29915L27119L34926L56796L84200
16182A8795189M14529M33476M51376M54647M57847M77735N10621N17309N47931
16173B3060660N86965O04626O37109O68947P04962P39930P96585Q88566R54939
$$ plain form
16164 29643289 30622275 31639800 32720118 33870829 35083526 36442813 37967471 39611073
16156 39611073 41371485 43237276 45235140 47374808 49714299 52241130 54965076 57940505
16148 57940505 61149515 64558263 68194737 72048224 76287352 81206793 87137757 94538762
16140 94538762 103783198 114427218 126355731 143090055 166826012 196292206 223335449
16133 223335449 205673665 70380844 -100830642 -179408466 -195463980 -190029640 -174242963
16126 -174242963 -156525329 -141651513 -128923672 -117371137 -107014209 -97787564 -89653704
16119 -89653704 -82538473 -76374029 -71079316 -66494040 -62532583 -59106876 -56043829 -53274185
16111 -53274185 -50743527 -48430044 -46323778 -44398615 -42636550 -41047220 -39611022 -38285496
$$ packed form
16164B9643289R78986J017525J080318J150711J212697J359287J524658J643602
16156C9611073J760412J865791J997864K139668K339491K526831K723946K975429
16148E7940505L209010L408748L636474L853487M239128M919441N930964P401005
16140I4538762R244436J0644020J1928513J6734324K3735957K9466194K7043243
16133B23335449j7661784j35292821j71211486p8577824j6055514N434340J5786677
16126a74242963J7717634J4873816J2727841J1552535J0356928R226645Q133860
16119h9653704P115231O164444N294713M585276L961457L425707L063047K769644
16111e3274185K530658K313483K106266J925163J762065J589330J436198J325526
$$ plain form
16103 -38285496 -37041696 -35861345 -34717728 -33633315 -32642552 -31744986 -30902278 -30062495 -29256386
16094 -29256386 -28500302 -27770284 -27066616 -26393788 -25763877 -25163975 -24583342 -24043591 -23521097
16085 -23521097 -22998613 -22522372 -22101746 -21695124 -21302228 -20917535 -20526048 -20142457 -19774877
16076 -19774877 -19423489 -19095723 -18795886 -18523215 -18279750 -18032127 -17773258 -17499682 -17225309
16067 -17225309 -16966457 -16732393 -16506908 -16280448 -16057821 -15846844 -15638205 -15428163 -15227848
16058 -15227848 -15045660 -14878188 -14717957 -14551095 -14380317 -14219663 -14060006 -13890479 -13721433
16049 -13721433 -13550199 -13372528 -13197443 -13036491 -12882812 -12750225 -12648220 -12567287 -12467155
16040 -12467155 -12344062 -12212388 -12078436 -11960454 -11855263 -11745400 -11634998 -11520386 -11406963
$$ packed form
16103c8285496J243800J180351J143617J084413R90763Q97566Q42708Q39783Q06109
16094b9256386P56084P30018P03668O72828O29911N99902N80633N39751N22494
16085b3521097N22484M76241M20626M06622L92896L84693L91487L83591L67580
16076a9774877L51388L27766K99837K72671K43465K47623K58869K73576K74373
16067a7225309K58852K34064K25485K26460K22627K10977K08639K10042K00315
16058a5227848J82188J67472J60231J66862J70778J60654J59657J69527J69046
16049a3721433J71234J77671J75085J60952J53679J32587J02005Q0933J00132
16040a2467155J23093J31674J33952J17982J05191J09863J10402J14612J13423
$$ plain form
16031 -11406963 -11303803 -11198477 -11078845 -10959676 -10838466 -10732795 -10651621 -10578365 -10494864 -10405653
16021 -10405653 -10319063 -10240476 -10169154 -10079083 -9979161 -9896473 -9842756 -9774076 -9711490 -9658302 -9604804
16010 -9604804 -9555699 -9490225 -9419450 -9388748 -9356349 -9303798 -9229450 -9135571 -9054333 -9008547 -8969637
15999 -8969637 -8921386 -8862206 -8784947 -8711847 -8647751 -8590035 -8529335 -8462566 -8405993 -8359760 -8313897
15988 -8313897 -8265044 -8210666 -8152483 -8098862 -8046939 -7988504 -7931216 -7886345 -7850225 -7813996 -7766774
15977 -7766774 -7723461 -7703142 -7666007 -7622959 -7580063 -7540516 -7497624 -7465564 -7434837 -7401013 -7371656
15966 -7371656 -7349809 -7327260 -7294180 -7252249 -7201284 -7146468 -7098622 -7053027 -7008534 -6972284 -6934136
15955 -6934136 -6900509 -6869755 -6837546 -6803972 -6775637 -6739293 -6702337 -6668293 -6636348 -6606453 -6585274
$$ packed form
16031a1406963J03160J05326J19632J19169J21210J05671Q1174P3256Q3501Q9211
16021a0405653Q6590P8587P1322R0071R9922Q2688N3717O8680O2586N3188N3498
16010i604804M9105O5474P0775L0702L2399N2551P4348R3879Q1238M5786L8910
15999h969637M8251N9180P7259P3100O4096N7716O0700O6769N6573M6233M5863
15988h313897M8853N4378N8183N3621N1923N8435N7288M4871L6120L6229M7222
15977g766774M3313K0319L7135M3048M2896L9547M2892L2060L0727L3824K9357
15966g371656K1847K2549L3080M1931N0965N4816M7846M5595M4493L6250L8148
15955f934136L3627L0754L2209L3574K8335L6344L6956L4044L1945K9895K1179
$$ plain form
15944 -6585274 -6559703 -6537740 -6536029 -6500763 -6441630 -6378965 -6325330 -6281613 -6245259 -6209494 -6187490
15933 -6187490 -6168388 -6146900 -6136755 -6119214 -6094482 -6077762 -6064991 -6050382 -6032972 -6008280 -5977519
15922 -5977519 -5948984 -5916466 -5883583 -5858225 -5840906 -5825992 -5809852 -5790158 -5769640 -5748592 -5721495
15911 -5721495 -5696772 -5675677 -5654186 -5636635 -5625408 -5611572 -5590241 -5559744 -5529791 -5508540 -5499208
15900 -5499208 -5491098 -5477544 -5456598 -5428835 -5399326 -5375262 -5354062 -5329308 -5307303 -5288156 -5264994
15889 -5264994 -5233747 -5201639 -5185552 -5176736 -5164181 -5152928 -5143832 -5127304 -5103365 -5082899 -5061170 -5038594
15877 -5038594 -5017652 -5001096 -4990538 -4979296 -4968415 -4953947 -4938138 -4920049 -4902714 -4886301 -4865556
15866 -4865556 -4850624 -4845919 -4838030 -4825884 -4811927 -4798308 -4780185 -4765374 -4751590 -4736820 -4721526 -4703989
$$ packed form
15944f585274K5571K1963J711L5266N9133O2665N3635M3717L6354L5765K2004
15933f187490J9102K1488J0145J7541K4732J6720J2771J4609J7410K4692L0761
15922e977519K8535L2518L2883K5358J7319J4914J6140J9694K0518K1048K7097
15911e721495K4723K1095K1491J7551J1227J3836K1331L0497K9953K1251R332
15900e499208Q110J3554K0946K7763K9509K4064K1200K4754K2005J9147K3162
15889e264994L1247L2108J6087Q816J2555J1253R096J6528K3939K0466K1729K2576
15877e038594K0942J6556J0558J1242J0881J4468J5809J8089J7335J6413K0745
15866d865556J4932M705P889J2146J3957J3619J8123J4811J3784J4770J5294J7537
$$ plain form
15854 -4703989 -4685342 -4664963 -4643699 -4625761 -4610843 -4594309 -4574289 -4554855 -4542724 -4535807 -4525791
15843 -4525791 -4517277 -4515052 -4504005 -4491947 -4481768 -4475134 -4472151 -4467432 -4459606 -4449003 -4428386 -4406740
15831 -4406740 -4394098 -4380388 -4365432 -4353568 -4348832 -4339705 -4318400 -4303018 -4284745 -4266210 -4254984 -4246699
15819 -4246699 -4233705 -4215242 -4201877 -4198437 -4193634 -4179804 -4174479 -4171996 -4160624 -4149081 -4139855 -4130101
15807 -4130101 -4117999 -4104100 -4095565 -4086832 -4070956 -4050430 -4033384 -4020052 -4004327 -3996257 -3994188 -3988437
15795 -3988437 -3981898 -3974094 -3964741 -3958489 -3950849 -3943329 -3935546 -3929577 -3922068 -3909627 -3896864 -3885544 -3878157
15782 -3878157 -3867060 -3854487 -3846659 -3839867 -3830237 -3818596 -3805911 -3795045 -3787398 -3784846 -3773963 -3759775
15770 -3759775 -3744983 -3738041 -3737600 -3735419 -3726862 -3718417 -3708631 -3695943 -3680427 -3674828 -3669426 -3658269 -3647058
$$ packed form
15854d703989J8647K0379K1264J7938J4918J6534K0020J9434J2131O917J0016
15843d525791Q514K225J1047J2058J0179O634K983M719P826J0603K0617K1646
15831d406740J2642J3710J4956J1864M736R127K1305J5382J8273J8535J1226Q285
15819d246699J2994J8463J3365L440M803J3830N325K483J1372J1543R226R754
15807d130101J2102J3899Q535Q733J5876K0526J7046J3332J5725Q070K069N751
15795c988437O539P804R353O252P640P520P783N969P509J2441J2763J1320P387
15782c878157J1097J2573P828O792R630J1641J2685J0866P647K552J0883J4188
15770c759775J4792O942M41K181Q557Q445R786J2688J5516N599N402J1157J1211
$$ plain form
15757 -3647058 -3639347 -3630132 -3622701 -3615954 -3607978 -3600876 -3592215 -3581280 -3575786 -3568759 -3561234 -3553368 -3550312 -3546790
15743 -3546790 -3540491 -3526230 -3517441 -3514400 -3505668 -3494970 -3484553 -3474974 -3468763 -3464169 -3458530 -3458101 -3452280
15730 -3452280 -3444119 -3437702 -3435391 -3430781 -3421714 -3412812 -3404789 -3397911 -3391615 -3385838 -3379415 -3371143 -3368316 -3360175
15716 -3360175 -3353002 -3343076 -3333844 -3331558 -3333002 -3331929 -3326762 -3316241 -3303991 -3297203 -3287624 -3279742 -3272450
15703 -3272450 -3265033 -3260233 -3253617 -3246722 -3241677 -3238267 -3230546 -3222433 -3212827 -3203522 -3191506 -3180769 -3173382
15690 -3173382 -3167843 -3163026 -3160311 -3156520 -3151990 -3147790 -3148747 -3146242 -3140352 -3135912 -3133716 -3124821 -3110433 -3101553
15676 -3101553 -3095623 -3092501 -3081698 -3075490 -3068571 -3061385 -3058762 -3054265 -3043750 -3026368 -3011921 -3010695 -3010220
15663 -3010220 -3010925 -3010657 -3009094 -3008785 -3005113 -3000405 -2995407 -2986349 -2974631 -2967314 -2959729 -2947598 -2935758 -2926245
$$ packed form
15757c647058P711R215P431O747P976P102Q661J0935N494P027P525P866L056L522
15743c546790O299J4261Q789L041Q732J0698J0417R579O211M594N639M29N821
15730c452280Q161O417K311M610R067Q902Q023O878O296N777O423Q272K827Q141
15716c360175P173R926R232K286j444J073N167J0521J2250O788R579P882P292
15703c272450P417M800O616O895N045L410P721Q113R606R305J2016J0737P387
15690c173382N539M817K715L791M530M200r57K505N890M440K196Q895J4388Q880
15676c101553N930L122J0803O208O919P186K623M497J0515J7382J4447J226M75
15663c010220p05K68J563L09L672M708M998R058J1718P317P585J2131J1840R513
$$ plain form
15649 -2926245 -2924052 -2924511 -2920467 -2915649 -2911933 -2904341 -2893631 -2882810 -2871162 -2867177 -2864728 -2860146 -2852238
15636 -2852238 -2847840 -2844482 -2843601 -2838836 -2832882 -2823647 -2815115 -2803596 -2794092 -2787710 -2783088 -2780668 -2776468 -2773960
15622 -2773960 -2766364 -2758374 -2747669 -2735317 -2725720 -2720549 -2714161 -2707401 -2703715 -2698259 -2694062 -2690476 -2682084
15609 -2682084 -2671984 -2663749 -2655530 -2645697 -2633923 -2621444 -2610781 -2598734 -2585882 -2573166 -2560896 -2547405
15597 -2547405 -2531871 -2514764 -2497867 -2481461 -2461213 -2439928 -2419575 -2395758 -2371710 -2350370 -2322974
15586 -2322974 -2289445 -2248406 -2201003 -2143882 -2077685 -2000310 -1894492 -1753989 -1583361 -1461202
15576 -1461202 -1744456 -2691904 -3469741 -3704725 -3708654 -3631599 -3526949 -3430570 -3352773 -3283541
15566 -3283541 -3223367 -3170914 -3120001 -3072772 -3031382 -2999526 -2974099 -2947754 -2922314 -2905780 -2888706
$$ packed form
15649b926245K193m59M044M818L716P592J0710J0821J1648L985K449M582P908
15636b852238M398L358Q81M765N954R235Q532J1519R504O382M622K420M200K508
15622b773960P596P990J0705J2352R597N171O388O760L686N456M197L586Q392
15609b682084J0100Q235Q219R833J1774J2479J0663J2047J2852J2716J2270J3491
15597b547405J5534J7107J6897J6406K0248K1285K0353K3817K4048K1340K7396
15586b322974L3529M1039M7403N7121O6197P7375J05818J40503J70628J22159
15576a461202k83254r47448p77837k34984l929P7055J04650R6379P7797O9232
15566c283541O0174N2453N0913M7229M1390L1856K5427K6345K5440J6534J7074
$$ plain form
15555 -2888706 -2868446 -2850364 -2831900 -2813183 -2800219 -2790458 -2779392 -2769818 -2762622 -2757056 -2749103 -2742043
15543 -2742043 -2735572 -2724817 -2712606 -2703049 -2695590 -2688883 -2683507 -2673539 -2664123 -2657882 -2649435 -2643740 -2635257
15530 -2635257 -2627574 -2625252 -2620375 -2612018 -2605235 -2600830 -2597925 -2594936 -2592464 -2587155 -2580693 -2573081 -2570405 -2566228
15516 -2566228 -2562180 -2558202 -2553623 -2549320 -2544293 -2537169 -2531060 -2528831 -2528731 -2525768 -2523494 -2521027 -2520544 -2515970
15502 -2515970 -2510053 -2507196 -2503291 -2499705 -2493886 -2484817 -2481811 -2479551 -2477657 -2473784 -2469800 -2468161 -2462632 -2460024
15488 -2460024 -2459643 -2454997 -2452320 -2448125 -2443441 -2439918 -2431732 -2423165 -2418575 -2419361 -2417038 -2415150 -2410563 -2405878
15474 -2405878 -2405078 -2405549 -2405110 -2402177 -2397196 -2388711 -2384801 -2386517 -2382008 -2378631 -2374640 -2372107 -2370549 -2368525 -2364453
15459 -2364453 -2358984 -2354769 -2351323 -2349747 -2344345 -2338356 -2335880 -2336861 -2337561 -2334377 -2329205 -2325689 -2319772 -2316605
$$ packed form
15555b888706K0260J8082J8464J8717J2964R761J1066R574P196N566P953P060
15543b742043O471J0755J2211R557P459O707N376R968R416O241Q447N695Q483
15530b635257P683K322M877Q357O783M405K905K989K472N309O462P612K676M177
15516b566228M048L978M579M303N027P124O109K229J00K963K274K467M83M574
15502b515970N917K857L905L586N819R069L006K260J894L873L984J639N529K608
15488b460024L81M646K677M195M684L523Q186Q567M590p86K323J888M587M685
15474b405878Q00m71M39K933M981Q485L910j716M509L377L991K533J558K024M072
15459b364453N469M215L446J576N402N989K476r81p00L184N172L516N917L167
$$ plain form
15445 -2316605 -2315277 -2313116 -2305855 -2304734 -2305130 -2300978 -2299588 -2299679 -2299787 -2294481 -2289557 -2285494 -2278923 -2274567 -2274674
15430 -2274674 -2269212 -2265155 -2260959 -2261574 -2257248 -2251666 -2252974 -2250897 -2247180 -2247893 -2245760 -2241561 -2240290 -2237926
15416 -2237926 -2233921 -2227874 -2225578 -2223956 -2221341 -2218995 -2216321 -2213072 -2214171 -2211512 -2211501 -2207734 -2205204 -2204040
15402 -2204040 -2200503 -2197386 -2193041 -2188653 -2188632 -2186658 -2182663 -2182960 -2181649 -2180935 -2179108 -2172082 -2164605 -2160517 -2156128
15387 -2156128 -2153204 -2152391 -2147945 -2146386 -2147406 -2145325 -2142769 -2138593 -2139498 -2138684 -2134740 -2132352 -2131196 -2132984 -2132497
15372 -2132497 -2131525 -2129966 -2126876 -2126076 -2125452 -2125989 -2121392 -2114607 -2111509 -2111347 -2109576 -2105933 -2103304 -2102363 -2097605
15357 -2097605 -2095110 -2094639 -2096404 -2091764 -2086020 -2082524 -2084452 -2085651 -2083377 -2078662 -2075348 -2071479 -2071723 -2068906
15343 -2068906 -2065756 -2064522 -2056067 -2049083 -2046391 -2044568 -2043078 -2040624 -2038408 -2035986 -2036061 -2039900 -2035494 -2032046
$$ packed form
15445b316605J328K161P261J121l96M152J390r1j08N306M924M063O571M356j07
15430b274674N462M057M196o15M326N582j308K077L717p13K133M199J271K364
15416b237926M005O047K296J622K615K346K674L249j099K659J1L767K530J164
15402b204040L537L117M345M388K1J974L995k97J311P14J827P026P477M088M389
15387b156128K924Q13M446J559j020K081K556M176r05Q14L944K388J156j788M87
15372b132497R72J559L090Q00O24n37M597O785L098J62J771L643K629R41M758
15357b097605K495M71j765M640N744L496j928j199K274M715L314L869k44K817
15343b068906L150J234Q455O984K692J823J490K454K216K422p5l839M406L448
$$ plain form
15329 -2032046 -2030487 -2025552 -2022639 -2022121 -2024907 -2021702 -2017079 -2009304 -2004627 -2003939 -2004763 -2003763 -2000491 -1998008 -1997717
15314 -1997717 -1995345 -1995306 -1991355 -1991253 -1992430 -1992970 -1992943 -1988137 -1985785 -1983904 -1984981 -1982285 -1980104 -1978969 -1975619
15299 -1975619 -1972102 -1969917 -1965814 -1963379 -1959255 -1958267 -1957500 -1959043 -1958907 -1955630 -1954680 -1953040 -1952566 -1950276 -1949020
15284 -1949020 -1948275 -1948106 -1946971 -1945443 -1941373 -1939546 -1936252 -1931729 -1925518 -1924809 -1924730 -1924673 -1922883 -1920301 -1916631 -1917597
15268 -1917597 -1914202 -1910314 -1908293 -1908642 -1910757 -1909447 -1905638 -1903557 -1900697 -1895003 -1892590 -1893944 -1889666 -1887659
15254 -1887659 -1886444 -1885960 -1885809 -1886526 -1882648 -1877192 -1874580 -1871467 -1870236 -1873413 -1873265 -1868086 -1863281 -1863082 -1862961
15239 -1862961 -1865124 -1865259 -1861600 -1858356 -1855446 -1856777 -1855286 -1851867 -1854482 -1854273 -1854292 -1852571 -1850512 -1848558 -1846720
15224 -1846720 -1846250 -1842864 -1840204 -1836539 -1833430 -1832901 -1831963 -1828612 -1829899 -1831855 -1830081 -1830348 -1826413 -1824542 -1822541
$$ packed form
15329b032046J559M935K913N18k786L205M623P775M677O88q24J000L272K483K91
15314a997717K372L9L951J02j177n40K7M806K352J881j077K696K181J135L350
15299a975619L517K185M103K435M124R88P67j543J36L277R50J640M74K290J256
15284a949020P45J69J135J528M070J827L294M523O211P09P9N7J790K582L670r66
15268a917597L395L888K021l49k115J310L809K081K860N694K413j354M278K007
15254a887659J215M84J51p17L878N456K612L113J231l177J48N179M805J99J21
15239a862961k163j35L659L244K910j331J491L419k615K09j9J721K059J954J838
15224a846720M70L386K660L665L109N29R38L351j287j956J774k67L935J871K001
$$ plain form
15209 -1822541 -1820500 -1818093 -1819967 -1822809 -1825388 -1821772 -1817972 -1813094 -1807394 -1803534 -1801963 -1800548 -1800494 -1798529
15195 -1798529 -1795923 -1798468 -1799198 -1796613 -1792530 -1788746 -1786455 -1785077 -1784594 -1788456 -1787089 -1784353 -1782139 -1779399
15181 -1779399 -1774389 -1773677 -1772310 -1772526 -1773567 -1771697 -1770043 -1766952 -1766213 -1762739 -1760504 -1757041 -1753630 -1755270 -1751738
15166 -1751738 -1750067 -1749555 -1746406 -1744036 -1745790 -1746837 -1745542 -1741041 -1740567 -1742835 -1740075 -1736597 -1732000 -1728179
15152 -1728179 -1726807 -1729029 -1725915 -1724630 -1727644 -1728213 -1728720 -1727820 -1727634 -1728048 -1723247 -1716847 -1714069 -1711923 -1711015
15137 -1711015 -1709326 -1711337 -1709529 -1704857 -1704353 -1704391 -1705155 -1703779 -1702953 -1700782 -1700492 -1696894 -1692222 -1688099 -1685606
15122 -1685606 -1686622 -1691890 -1689191 -1686816 -1688720 -1685741 -1684680 -1682254 -1678002 -1675184 -1674131 -1674605 -1675296 -1680717
15108 -1680717 -1680056 -1679242 -1674217 -1671847 -1667135 -1663451 -1664158 -1664981 -1664558 -1660010 -1656621 -1657200 -1656261 -1655296 -1653362 -1650088
$$ packed form
15209a822541K041K407j874k842k579L616L800M878N700L860J571J415N4J965
15195a798529K606k545p30K585M083L784K291J378M83l862J367K736K214K740
15181a779399N010P12J367k16j041J870J654L091P39L474K235L463L411j640L532
15166a751738J671N12L149K370j754j047J295M501M74k268K760L478M597L821
15152a728179J372k222L114J285l014n69n07R00J86m14M801O400K778K146R08
15137a711015J689k011J808M672N04l8p64J376Q26K171K90L598M672M123K493
15122a685606j016n268K699K375j904K979J061K426M252K818J053m74o91n421
15108a680717O61Q14N025K370M712L684p07q23M23M548L389n79R39R65J934L274
$$ plain form
15092 -1650088 -1648435 -1648231 -1644914 -1642146 -1639292 -1639951 -1646616 -1645151 -1641985 -1640254 -1639973 -1642551 -1639067 -1635772 -1634730
15077 -1634730 -1633183 -1629223 -1629858 -1625865 -1620673 -1618048 -1618441 -1618108 -1620704 -1618140 -1614247 -1611574 -1611952 -1612984 -1611982
15062 -1611982 -1610078 -1610161 -1609918 -1612097 -1609527 -1608028 -1607459 -1606016 -1606929 -1605651 -1601038 -1599698 -1599443 -1597258 -1595650
15047 -1595650 -1596228 -1596189 -1592780 -1589277 -1589770 -1587625 -1585794 -1578715 -1572504 -1578783 -1593313 -1596911 -1590217 -1587643 -1589671
15032 -1589671 -1588045 -1583350 -1575100 -1570503 -1570608 -1567495 -1563602 -1562264 -1562278 -1564316 -1566485 -1566097 -1561965 -1558944 -1557999
15017 -1557999 -1559719 -1561202 -1558142 -1554054 -1553332 -1554989 -1557887 -1559538 -1555159 -1548911 -1543821 -1543632 -1542283 -1540736
15003 -1540736 -1542875 -1543522 -1541435 -1534904 -1534608 -1537275 -1532673 -1527508 -1524333 -1520397 -1518236 -1512184 -1505334 -1516280
14989 -1516280 -1539093 -1545445 -1538353 -1536089 -1531481 -1521695 -1527534 -1539532 -1541981 -1536241 -1531075 -1525349 -1521822
$$ packed form
15092a650088J653K04L317K768K854o59o665J465L166J731K81k578L484L295J042
15077a634730J547L960o35L993N192K625l93L33k596K564L893K673l78j032J002
15062a611982J904q3K43k179K570J499N69J443r13J278M613J340K55K185J608
15047a595650n78L9L409L503m93K145J831P079O211o279j4530l598O694K574k028
15032a589671J626M695Q250M597j05L113L893J338j4k038k169L88M132L021R45
15017a557999j720j483L060M088P22j657k898j651M379O248N090J89J349J547
15003a540736k139o47K087O531K96k667M602N165L175L936K161O052O850j0946
14989a516280k2813o352P092K264M608R786n839j1998k449N740N166N726L527
$$ plain form
14976 -1521822 -1520113 -1519464 -1510939 -1499178 -1496072 -1515215 -1528866 -1526123 -1522260 -1517994 -1518653 -1520965 -1519064 -1511283
14962 -1511283 -1506643 -1508213 -1505750 -1502776 -1502258 -1501476 -1500689 -1499468 -1495689 -1492690 -1494027 -1494003 -1493286 -1493873 -1494489 -1495988
14946 -1495988 -1493688 -1488765 -1484605 -1483061 -1483313 -1481311 -1478592 -1476008 -1473529 -1472494 -1469917 -1467200 -1469156 -1477673
14932 -1477673 -1481978 -1476389 -1474317 -1471853 -1468562 -1467876 -1470258 -1472916 -1469960 -1464182 -1459772 -1461821 -1461246 -1462351
14918 -1462351 -1464668 -1464690 -1463596 -1461343 -1461360 -1460791 -1458869 -1454890 -1448351 -1448918 -1452227 -1448856 -1450130 -1448681 -1446571
14903 -1446571 -1444216 -1439806 -1438046 -1435667 -1434566 -1433387 -1436127 -1437465 -1436640 -1436702 -1435839 -1435577 -1438406 -1437123 -1434689
14888 -1434689 -1434499 -1434947 -1434903 -1436845 -1436916 -1431136 -1428409 -1427878 -1429824 -1429748 -1425356 -1421437 -1418720 -1415823 -1412340 -1411076
14872 -1411076 -1411868 -1414307 -1417518 -1420908 -1419619 -1414875 -1412301 -1411383 -1412690 -1412722 -1411381 -1409439 -1409896 -1409482 -1408112
$$ packed form
14976a521822J709O49Q525J1761L106j9143j3651K743L863M266o59k312J901P781
14962a511283M640j570K463K974N18P82P87J221L779K999j337K4P17n87o16j499
14946a495988K300M923M160J544k52K002K719K584K479J035K577K717j956q517
14932a477673m305N589K072K464L291O86k382k658K956N778M410k049N75j105
14918a462351k317k2J094K253j7N69J922L979O539n67l309L371j274J449K110
14903a446571K355M410J760K379J101J179k740j338Q25o2Q63K62k829J283K434
14888a434689J90m48M4j942p1N780K727N31j946P6M392L919K717K897L483J264
14872a411076p92k439l211l390J289M744K574R18j307l2J341J942m57M14J370
$$ plain form
14857 -1408112 -1407340 -1405256 -1403472 -1404509 -1400611 -1395594 -1391577 -1392174 -1390868 -1389666 -1389280 -1390396 -1392743 -1392503 -1394248
14842 -1394248 -1395732 -1397948 -1394853 -1390690 -1390058 -1389978 -1389849 -1389478 -1386210 -1383997 -1382846 -1380586 -1379154 -1377742 -1378703
14827 -1378703 -1378800 -1377508 -1376481 -1372158 -1368988 -1369408 -1368724 -1367130 -1370959 -1374682 -1369960 -1368503 -1370827 -1367206 -1363390
14812 -1363390 -1363032 -1362175 -1364728 -1363525 -1362097 -1361976 -1359528 -1358344 -1358342 -1355267 -1351915 -1348982 -1347526 -1347860 -1349915 -1352219
14796 -1352219 -1352807 -1351212 -1351984 -1351504 -1348924 -1345459 -1340891 -1341740 -1342727 -1343983 -1343911 -1340137 -1338758 -1338420 -1336209 -1334345
14780 -1334345 -1334407 -1332950 -1330003 -1329800 -1324895 -1319577 -1319580 -1325002 -1330941 -1331184 -1329082 -1328895 -1328179 -1328873 -1329001 -1329601 -1329982
14763 -1329982 -1329364 -1331257 -1332638 -1329816 -1324551 -1324149 -1324514 -1322959 -1318435 -1316600 -1318570 -1318403 -1318505 -1315646 -1312449
14748 -1312449 -1310894 -1309837 -1308647 -1307239 -1306869 -1307447 -1305244 -1304552 -1306619 -1306777 -1305505 -1305046 -1306778 -1308327 -1306253
$$ packed form
14857a408112P72K084J784j037L898N017M017n97J306J202L86j116k347K40j745
14842a394248j484k216L095M163O32Q0J29L71L268K213J151K260J432J412r61
14827a378703r7J292J027M323L170m20O84J594l829l723M722J457k324L621L816
14812a363390L58Q57k553J203J428J21K448J184KL075L352K933J456l34k055k304
14796a352219n88J595p72M80K580L465M568q49r87j256P2L774J379L38K211J864
14780a334345o2J457K947K03M905N318ln422n939k43K102J87P16o94j28o00l81
14763a329982O18j893j381K822N265M02l65J555M524J835j970J67j02K859L197
14748a312449J555J057J190J408L70n78K203O92k067j58J272M59j732j549K074
$$ plain form
14733 -1306253 -1302173 -1299782 -1299664 -1301531 -1304746 -1299663 -1294544 -1294670 -1294988 -1295934 -1295653 -1290793 -1286965 -1287257 -1289722
14718 -1289722 -1291446 -1291942 -1294060 -1291590 -1287782 -1287862 -1288106 -1286070 -1281468 -1280957 -1281096 -1278439 -1277341 -1277638 -1277161 -1276828
14702 -1276828 -1276613 -1271516 -1270241 -1267057 -1265214 -1265397 -1265505 -1268112 -1270555 -1268863 -1267791 -1268805 -1268513 -1267036 -1265685
14687 -1265685 -1265286 -1266231 -1262865 -1260928 -1261850 -1261360 -1261881 -1263667 -1263896 -1260390 -1255817 -1256057 -1258725 -1253730 -1250495 -1248389
14671 -1248389 -1248907 -1251854 -1246640 -1241156 -1246433 -1256429 -1259930 -1257665 -1254280 -1252499 -1249042 -1249722 -1243463 -1236835
14657 -1236835 -1233152 -1232625 -1241422 -1250031 -1250537 -1245855 -1244263 -1245047 -1243760 -1244820 -1243021 -1241242 -1238529 -1235914 -1235281
14642 -1235281 -1234089 -1233902 -1234591 -1233989 -1235971 -1233715 -1230002 -1228193 -1228131 -1231035 -1233914 -1232718 -1227121 -1222777 -1222891
14627 -1222891 -1223931 -1222952 -1223265 -1222392 -1223599 -1222885 -1220252 -1211932 -1213227 -1223679 -1227276 -1224409 -1222183 -1218265 -1216936
$$ packed form
14733a306253M080K391J18j867l215N083N119j26l18r46K81M860L828k92k465
14718a289722j724m96k118K470L808q0k44K036M602N11j39K657J098k97M77L33
14702a276828K15N097J275L184J843j83j08k607k443J692J072j014K92J477J351
14687a265685L99r45L366J937r22M90n21j786k29L506M573k40k668M995L235K106
14671a248389n18k947N214N484n277r996l501K265L385J781L457o80O259O628
14657a236835L683N27q797q609n06M682J592p84J287j060J799J779K713K615O33
14642a235281J192J87o89O02j982K256L713J809O2k904k879J196N597M344j14
14627a222891j040R79l13Q73j207P14K633Q320j295j0452l597K867K226L918J329
$$ plain form
14612 -1216936 -1212903 -1211086 -1208689 -1204291 -1203020 -1207851 -1214165 -1209322 -1211451 -1215536 -1216045 -1218680 -1215822 -1211371
14598 -1211371 -1209920 -1204800 -1202222 -1200930 -1197608 -1196554 -1197581 -1201086 -1203048 -1199800 -1194811 -1195937 -1196224 -1193622
14584 -1193622 -1191710 -1192390 -1191413 -1189535 -1189511 -1193439 -1197799 -1198991 -1195952 -1192040 -1192381 -1194509 -1192997 -1192004 -1193897
14569 -1193897 -1188881 -1184956 -1184150 -1184620 -1187247 -1184733 -1182132 -1178430 -1180352 -1184490 -1183135 -1180275 -1177811 -1174844
14555 -1174844 -1175664 -1176214 -1174809 -1174959 -1173181 -1171669 -1172408 -1170750 -1168248 -1168455 -1171311 -1173192 -1172845 -1171724 -1167645
14540 -1167645 -1164344 -1163806 -1163523 -1160784 -1158339 -1159195 -1161066 -1160721 -1159397 -1157617 -1158461 -1159106 -1156977 -1157296 -1158730 -1156506
14524 -1156506 -1155993 -1155889 -1156975 -1155823 -1151995 -1150498 -1150698 -1152719 -1155899 -1159137 -1155901 -1149552 -1148723 -1149398 -1150696
14509 -1150696 -1149764 -1149539 -1148396 -1149727 -1151249 -1148142 -1145102 -1145760 -1145535 -1143178 -1140022 -1139439 -1140579 -1140605 -1139494 -1138635
$$ packed form
14612a216936M033J817K397M398J271m831o314M843k129m085n09k635K858M451
14598a211371J451N120K578J292L322J054j027l505j962L248M989j126k87K602
14584a193622J912o80R77J878K4l928m360j192L039L912l41k128J512R93j893
14569a193897N016L925Q06m70k627K514K601L702j922m138J355K860K464K967
14555a174844q20n50J405j50J778J512p39J658K502k07k856j881L47J121M079
14540a167645L301N38K83K739K445q56j871L45J324J780q44o45K129l19j434K224
14524a156506N13J04j086J152L828J497k00k021l180l238L236O349Q29o75j298
14509a150696R32K25J143j331j522L107L040o58K25K357L156N83j140k6J111Q59
$$ plain form
14493 -1138635 -1138738 -1137208 -1138406 -1140894 -1139533 -1140752 -1141182 -1140065 -1135650 -1135569 -1133115 -1128052 -1127310 -1130894 -1131772
14478 -1131772 -1130854 -1125568 -1121845 -1122632 -1126007 -1126008 -1126297 -1125737 -1124713 -1121678 -1119781 -1116582 -1119711 -1124658 -1125352 -1124914
14462 -1124914 -1127051 -1126423 -1126190 -1121879 -1120186 -1119779 -1119107 -1117725 -1119878 -1117189 -1115999 -1116075 -1117076 -1113086 -1108080
14447 -1108080 -1106122 -1106179 -1106949 -1107879 -1108292 -1107523 -1108554 -1109891 -1108218 -1106519 -1105106 -1107604 -1107892 -1106610 -1107149 -1105522
14431 -1105522 -1105002 -1099407 -1100611 -1099647 -1098743 -1100269 -1101901 -1102608 -1101891 -1098678 -1098951 -1103418 -1102542 -1101034 -1095548 -1093470
14415 -1093470 -1091290 -1092859 -1092788 -1090489 -1089942 -1092194 -1095624 -1097977 -1098088 -1092817 -1087304 -1090124 -1090288 -1090395 -1089807 -1084271
14399 -1084271 -1083492 -1088689 -1092685 -1091785 -1088979 -1087624 -1086294 -1081543 -1078424 -1074980 -1074510 -1078390 -1082541 -1083678 -1083408
14384 -1083408 -1084641 -1082871 -1080117 -1078557 -1076458 -1074083 -1071230 -1072523 -1072511 -1074561 -1074864 -1073305 -1070991 -1073307 -1072437
$$ packed form
14493a138635j03J530j198k488J361j219m30J117M415Q1K454N063P42l584q78
14478a131772R18N286L723p87l375jk89N60J024L035J897L199l129m947o94M38
14462a124914k137O28K33M311J693M07O72J382k153K689J190p6j001L990N006
14447a108080J958n7p70r30m13P69j031j337J673J699J413k498k88J282n39J627
14431a105522N20N595j204R64R04j526j632p07P17L213k73m467Q76J508N486K078
14415a093470K180j569P1K299N47k252l430k353j11N271N513k820j64j07N88N536
14399a084271P79n197l996R00K806J355J330M751L119L444M70l880m151j137K70
14384a083408j233J770K754J560K099K375K853j293J2k050l03J559K314k316Q70
$$ plain form
14369 -1072437 -1073266 -1075777 -1075613 -1071907 -1069603 -1069092 -1066793 -1066095 -1063835 -1062666 -1064852 -1063423 -1062276 -1065670 -1065771
14354 -1065771 -1065129 -1062101 -1059942 -1060579 -1058965 -1057413 -1057362 -1058622 -1056945 -1057032 -1053699 -1054375 -1057127 -1058796 -1058309 -1054844
14338 -1054844 -1052052 -1048434 -1047329 -1049100 -1050776 -1053919 -1053253 -1051305 -1052462 -1055268 -1057215 -1056546 -1050359 -1048998
14324 -1048998 -1051720 -1050368 -1050847 -1049880 -1044948 -1040528 -1038927 -1041736 -1041968 -1042335 -1042986 -1040630 -1039075 -1036468 -1036449 -1036557
14308 -1036557 -1038546 -1039633 -1040589 -1039212 -1041087 -1038860 -1036595 -1036806 -1034995 -1034052 -1036994 -1036133 -1032320 -1029830 -1027246
14293 -1027246 -1028592 -1031907 -1037615 -1037661 -1036605 -1033585 -1027028 -1027199 -1026553 -1027063 -1025284 -1022758 -1025041 -1027993 -1028223
14278 -1028223 -1028363 -1025955 -1024992 -1023631 -1021894 -1018721 -1015843 -1013833 -1015748 -1017223 -1017565 -1018061 -1020624 -1026448 -1027982
14263 -1027982 -1024792 -1024837 -1024586 -1022248 -1020233 -1020043 -1016021 -1012073 -1010177 -1011663 -1011427 -1007591 -1007370 -1008793 -1010481
$$ packed form
14369a072437q29k511J64L706K304N11K299O98K260J169k186J429J147l394j01
14354a065771O42L028K159o37J614J552N1j260J677q7L333o76k752j669M87L465
14338a054844K792L618J105j771j676l143O66J948j157k806j947O69O187J361
14324a048998k722J352m79R67M932M420J601k809k32l67o51K356J555K607J9j08
14308a036557j989j087r56J377j875K227K265k11J811R43k942Q61L813K490K584
14293a027246j346l315n708m6J056L020O557j71O46n10J779K526k283k952k30
14278a028223j40K408R63J361J737L173K878K010j915j475l42m96k563n824j534
14263a027982L190m5K51K338K015J90M022L948J896j486K36L836K21j423j688
$$ plain form
14248 -1010481 -1009752 -1010773 -1010546 -1012980 -1014725 -1011708 -1011857 -1016423 -1016821 -1016509 -1017684 -1017577 -1014805 -1011498 -1008549
14233 -1008549 -1008103 -1009018 -1007909 -1003900 -1002829 -1001599 -1001184 -1000484 -1000845 -1000949 -1002595 -1006985 -1008650 -1007755 -1005372 -1000635
14217 -1000635 -1000268 -1001865 -1002276 -1001521 -1000956 -1001594 -1003961 -1003969 -1000616 -995692 -992116 -992377 -991533 -992478 -992930 -994215 -993196
14200 -993196 -994212 -993925 -990320 -990657 -994649 -995547 -996103 -997776 -1000690 -998268 -996312 -993953 -992883 -996392 -997672
14185 -997672 -993521 -993505 -994361 -991293 -989760 -987182 -984248 -984508 -986135 -981414 -977685 -977280 -975193 -977556 -979234
14170 -979234 -981127 -981590 -980995 -979709 -978148 -975192 -974208 -973379 -973541 -973294 -973229 -970611 -967908 -970500 -972978 -974413
14154 -974413 -975307 -974986 -974736 -974241 -973405 -972993 -970720 -971747 -974052 -975347 -972923 -970853 -968086 -972811 -976135 -972980
14138 -972980 -972583 -965797 -959159 -960371 -959766 -958818 -958613 -959716 -961264 -963839 -963414 -960111 -962449 -965726 -964144
$$ packed form
14248a010481P29j021K27k434j745L017j49m566l98L12j175J07K772L307K949
14233a008549M46r15J109M009J071J230M15P00l61j04j646m390j665Q95K383M737
14217a000635L67j597m11P55N65o38k367qL353M924L576k61Q44r45m52j285J019
14200i93196j016K87L605l37l992q98n56j673k914K422J956K359J070l509j280
14185i97672M151J6q56L068J533K578K934k60j627M721L729M05K087k363j678
14170i79234j893m63N95J286J561K956R84Q29j62K47O5K618K703k592k478j435
14154i74413q94L21K50M95Q36M12K273j027k305j295K424K070K767m725l324L155
14138i72980L97O786O638j212O05R48K05j103j548k575M25L303k338l277J582
$$ plain form
14123 -964144 -960754 -961839 -962688 -961403 -959543 -956180 -955227 -953413 -954681 -953761 -954395 -954364 -951819 -951107 -949419 -949828
14107 -949828 -951424 -953364 -953605 -952876 -951095 -950084 -945911 -945658 -945355 -947671 -949391 -949361 -948046 -944261 -942964 -945584
14091 -945584 -946434 -945555 -949307 -950136 -946678 -946454 -946498 -942550 -939556 -940142 -942295 -943078 -939902 -941760 -944906 -942174
14075 -942174 -939260 -937021 -938720 -940535 -939077 -935797 -935560 -938310 -939581 -938240 -933609 -932102 -934663 -935834
14061 -935834 -935430 -936031 -938120 -935072 -932477 -933674 -932555 -932801 -933746 -932613 -931941 -934825 -937503 -937387 -936686 -932856
14045 -932856 -927927 -926736 -926949 -925857 -925515 -924839 -923980 -925444 -929159 -927566 -923703 -921692 -922395 -922662 -922050 -924976
14029 -924976 -925102 -924582 -920632 -920687 -920854 -919454 -918189 -917397 -914817 -916143 -916863 -917844 -917775 -915386 -913828 -914445 -912249
14012 -912249 -912082 -915310 -914999 -916937 -913220 -906815 -901157 -899614 -903740 -903291 -902919 -901653 -901710 -901763 -902097 -903058 -903413
$$ packed form
14123i64144L390j085q49J285J860L363R53J814j268R20o34L1K545P12J688m09
14107i49828j596j940k41P29J781J011M173K53L03k316j720L0J315L785J297k620
14091i45584q50Q79l752q29L458K24m4L948K994n86k153p83L176j858l146K732
14075i42174K914K239j699j815J458L280K37k750j271J341M631J507k561j171
14061i35834M04o01k089L048K595j197J119k46r45J133O72k884k678J16P01L830
14045i32856M929J191k13J092L42O76Q59j464l715J593L863K011p03k67O12k926
14029i24976j26N20L950n5j67J400J265P92K580j326p20r81O9K389J558o17K196
14012i12249J67l228L11j938L717O405N658J543m126M49L72J266n7n3l34r61l55
$$ plain form
13995 -903413 -903901 -906562 -905101 -902335 -900331 -902051 -900512 -901285 -903423 -902682 -899213 -891819 -889624 -888228 -888362
13980 -888362 -882375 -878274 -878373 -875344 -877351 -882897 -886317 -891147 -896612 -901989 -909941 -917642 -919509 -920703 -921909
13965 -921909 -927092 -931992 -930143 -925038 -920301 -915711 -913819 -915724 -912426 -911162 -911098 -910667 -909827 -907717 -904336
13950 -904336 -904453 -904819 -901746 -901588 -904266 -905264 -898738 -897049 -897880 -895391 -894352 -893834 -894105 -895357 -894690 -895316
13934 -895316 -897794 -897696 -898171 -902182 -901541 -898647 -896007 -893257 -889930 -889917 -890172 -888040 -887370 -884552 -883019 -883406
13918 -883406 -885584 -883064 -884478 -885709 -886430 -887564 -888281 -883554 -878721 -876912 -881228 -886766 -886899 -881687 -879935
13903 -879935 -882801 -882275 -882837 -881984 -880371 -878936 -879574 -876981 -872122 -869896 -872974 -879400 -879925 -874566 -872931
13888 -872931 -870795 -868694 -868280 -867026 -867639 -871603 -872824 -872150 -871932 -874155 -873328 -872457 -870051 -869583 -869151 -867728
$$ packed form
13995i03413m88k661J461K766K004j720J539p73k138P41L469P394K195J396j34
13980h88362N987M101r9L029k007n546l420m830n465n377p952p701j867j194j206
13965i21909n183m900J849N105M737M590J892j905L298J264O4M31Q40K110L381
13950i04336j17l66L073J58k678r98O526J689q31K489J039N18k71j252O67o26
13934h95316k478R8m75m011O41K894K640K750L327J3k55K132O70K818J533l87
13918h83406k178K520j414j231p21j134p17M727M833J809m316n538j33N212J752
13903h79935k866N26n62Q53J613J435o38K593M859K226l078o426n25N359J635
13888h72931K136K101M14J254o13l964j221O74K18k223Q27Q71K406M68M32J423
$$ plain form
13872 -867728 -863423 -859809 -859424 -862051 -863416 -860666 -863935 -867451 -868113 -864123 -860649 -859158 -858236 -857870 -859071
13857 -859071 -862407 -863089 -861688 -860572 -861309 -859177 -860517 -863413 -863564 -860342 -859265 -858556 -861834 -864539 -863300
13842 -863300 -866922 -866898 -863892 -858143 -854481 -855165 -857022 -859282 -857942 -856289 -857010 -858671 -860038 -859696 -855518
13827 -855518 -853062 -848927 -848708 -851199 -852122 -851157 -849711 -852853 -854053 -850518 -848989 -850815 -849602 -853463 -854265
13812 -854265 -852867 -849926 -848477 -844381 -842569 -842618 -841164 -839285 -840426 -845864 -846401 -845870 -844657 -844762 -842436
13797 -842436 -842744 -842626 -838861 -837600 -842864 -843001 -843714 -842929 -840068 -839285 -837082 -840028 -840795 -838883 -835785 -833710
13781 -833710 -834042 -835410 -837012 -836120 -832901 -831020 -834875 -834954 -836716 -833256 -828323 -829670 -828377 -829364 -829578 -825238
13765 -825238 -823562 -825307 -827672 -829550 -830843 -827658 -826471 -824298 -825227 -825299 -826366 -826522 -828411 -828496 -827866 -829479
$$ packed form
13872h67728M305L614L85k627j365K750l269l516o62L990L474J491R22L66j201
13857h59071l336o82J401J116p37K132j340k896j51L222J077P09l278k705J239
13842h63300l622K4L006N749L662o84j857k260J340J653p21j661j367L42M178
13827h55518K456M135K19k491r23R65J446l142j200L535J529j826J213l861q02
13812h54265J398K941J449M096J812m9J454J879j141n438n37N31J213j05K326
13797h42436l08J18L765J261n264j37p13P85K861P83K203k946p67J912L098K075
13781h33710l32j368j602Q92L219J881l855p9j762L460M933j347J293r87k14M340
13765h25238J676j745k365j878j293L185J187K173r29p2j067j56j889q5O30j613
$$ plain form
13749 -829479 -833273 -832589 -831257 -827951 -826466 -823663 -818696 -818604 -818519 -817055 -820216 -823055 -820359 -817146 -816711 -817013
13733 -817013 -815351 -817300 -818359 -818147 -818507 -819158 -820868 -817915 -815196 -816948 -820388 -820916 -818426 -816199 -814812
13718 -814812 -815959 -815306 -813213 -811877 -811626 -815742 -817691 -817916 -818338 -818328 -817040 -814787 -815055 -814308 -815098 -813715
13702 -813715 -809263 -809706 -809647 -811226 -814890 -816426 -815597 -812533 -813361 -815838 -818259 -814973 -811384 -805964 -807409
13687 -807409 -805596 -801769 -800761 -804149 -805890 -806852 -807962 -806767 -806597 -805056 -803575 -803951 -807495 -808515 -805906
13672 -805906 -804195 -801773 -802643 -800891 -801554 -803769 -803243 -801795 -802699 -802509 -800916 -801082 -799767 -797847 -797955 -798454
13656 -798454 -796225 -797075 -796778 -794914 -795501 -793365 -791843 -790892 -793841 -798611 -796319 -792509 -792187 -791841 -789384 -788861
13640 -788861 -791513 -792675 -789792 -788784 -789699 -784458 -781792 -783667 -786303 -788562 -789172 -788775 -787961 -789534 -788141
$$ packed form
13749h29479l794O84J332L306J485K803M967R2Q5J464l161k839K696L213M35l02
13733h17013J662j949j059K12l60o51j710K953K719j752l440n28K490K227J387
13718h14812j147O53K093J336K51m116j949k25m22J0J288K253k68P47p90J383
13702h13715M452m43N9j579l664j536Q29L064q28k477k421L286L589N420j445
13687h07409J813L827J008l388j741r62j110J195J70J541J481l76l544j020K609
13672h05906J711K422q70J752o63k215N26J448r04J90J593j66J315J920j08m99
13656g98454K229q50K97J864n87K136J522R51k949m770K292L810L22L46K457N23
13640g88861k652j162K883J008r15N241K666j875k636k259o10L97Q14j573J393
$$ plain form
13625 -788141 -786093 -784130 -783799 -786387 -788426 -787887 -785436 -780265 -783395 -782854 -779146 -778748 -781816 -782299 -780739
13610 -780739 -778479 -781009 -783619 -785937 -785078 -785030 -781275 -776680 -777902 -776003 -776568 -777388 -779824 -779409 -774507 -774609
13594 -774609 -779529 -781265 -781802 -780184 -782932 -784839 -780599 -775622 -770310 -768539 -772014 -772835 -772770 -770817 -770232
13579 -770232 -771700 -772141 -771992 -774058 -774369 -774351 -775642 -769644 -763882 -761687 -764694 -766467 -766419 -765461 -764822 -766388
13563 -766388 -768081 -767807 -764067 -759970 -754982 -751008 -748122 -747938 -750323 -753909 -753565 -752281 -752770 -751779 -751745 -750666
13547 -750666 -749302 -746916 -745995 -747722 -754576 -765203 -774009 -776766 -776608 -777264 -777873 -776201 -774294 -777682 -776098
13532 -776098 -775428 -772471 -772397 -775179 -772249 -772722 -774197 -771252 -769073 -764382 -759175 -757970 -758106 -758972 -760136 -757335
13516 -757335 -756238 -761375 -762695 -759072 -753962 -751867 -752745 -751401 -750989 -749402 -745102 -743357 -743646 -742114 -745624
$$ packed form
13625g88141K048J963L31k588k039N39K451N171l130N41L708L98l068m83J560
13610g80739K260k530k610k318Q59M8L755M595j222J899n65q20k436M15M902j02
13594g74609m920j736n37J618k748j907M240M977N312J771l475q21O5J953N85
13579g70232j468m41J49k066l11J8j291N998N762K195l007j773M8R58O39j566
13563g66388j693K74L740M097M988L974K886J84k385l586L44J284m89R91L4J079
13547g50666J364K386R21j727o854j0627q806k757J58o56o09J672J907l388J584
13532g76098O70K957P4k782K930m73j475K945K179M691N207J205j36q66j164K801
13516g57335J097n137j320L623N110K095q78J344M12J587M300J745k89J532l510
$$ plain form
13501 -745624 -751609 -760642 -765799 -771729 -777817 -781593 -783592 -785526 -779412 -774769 -774741 -772016 -768587 -767029 -768533
13486 -768533 -773259 -771573 -770830 -768952 -765867 -770931 -768661 -766792 -761388 -758008 -759101 -761459 -761948 -758240 -753438
13471 -753438 -751378 -754370 -753895 -750755 -751048 -751199 -750269 -749815 -750004 -753132 -752876 -753576 -752796 -751842 -747900 -744009 -746195
13454 -746195 -747173 -747710 -749173 -749148 -751501 -752151 -748090 -747374 -747094 -748277 -753212 -751972 -749726 -746906 -744750 -743816
13438 -743816 -743117 -740952 -737983 -738883 -741582 -742449 -741439 -738242 -738382 -734926 -736277 -737014 -741911 -744907 -744505 -741828
13422 -741828 -739480 -738889 -737430 -737293 -737476 -737248 -738411 -739928 -738076 -736218 -732873 -729945 -730529 -733302 -734517
13407 -734517 -737994 -737215 -734807 -734775 -735936 -733813 -732254 -733211 -729521 -727743 -730811 -729022 -728501 -727507 -727019 -725786
13391 -725786 -725390 -727511 -727646 -729291 -729851 -727460 -727585 -727047 -728134 -724946 -724881 -725317 -729595 -729132 -727209 -725354
$$ packed form
13501g45624n985r033n157n930o088l776j999j934O114M643K8K725L429J558j504
13486g68533m726J686P43J878L085n064K270J869N404L380j093k358m89L708M802
13471g53438K060k992M75L140k93j51R30M54j89l128K56p00P80R54L942L891k186
13454g46195r78n37j463K5k353o50M061P16K80j183m935J240K246K820K156R34
13438g43816O99K165K969r00k699q67J010L197j40L456j351p37m897k996M02K677
13422g41828K348N91J459J37j83K28j163j517J852J858L345K928n84k773j215
13407g34517l477P79K408L2j161K123J559r57L690J778l068J789N21R94M88J233
13391g25786L96k121j35j645n60K391j25N38j087L188O5m36m278M63J923J855
$$ plain form
13375 -725354 -721477 -720278 -720588 -719620 -720905 -721939 -723537 -722361 -723915 -723894 -720296 -717560 -716660 -718259 -718798 -719549
13359 -719549 -717866 -715199 -712559 -716163 -715176 -714462 -717015 -720069 -720513 -717916 -715286 -715680 -716663 -716227 -717924 -716758
13343 -716758 -717972 -720066 -718129 -717556 -716038 -716540 -715706 -716565 -715128 -711457 -707802 -708042 -709501 -712829 -712609 -711781
13327 -711781 -711271 -710977 -706911 -705308 -705269 -705836 -704524 -708849 -712970 -710578 -709922 -710879 -710056 -707182 -707018 -706450 -706221
13310 -706221 -704355 -704997 -706361 -709570 -710812 -710010 -708987 -704865 -706769 -703939 -703771 -703272 -698009 -694745 -695071
13295 -695071 -696065 -698450 -700149 -703742 -708362 -708511 -703042 -700480 -699214 -700552 -703446 -703047 -700498 -699629 -697450
13280 -697450 -699167 -701989 -705550 -706046 -702860 -696801 -693713 -692071 -694900 -698203 -697916 -695182 -693336 -692172 -691229
13265 -691229 -692907 -693095 -692540 -693147 -692285 -691957 -692403 -692730 -688766 -687509 -689657 -692708 -691425 -691555 -689594 -690761
$$ packed form
13375g25354L877J199l10R68j285j034j598J176j554K1L598K736R00j599n39p51
13359g19549J683K667K640l604R87P14k553l054m44K597K630l94r83M36j697J166
13343g16758j214k094J937N73J518n02Q34q59J437L671L655k40j459l328K20Q28
13327g11781N10K94M066J603L9n67J312m325m121K392O56r57Q23K874J64N68K29
13310g06221J866o42j364l209j242Q02J023M122j904K830J68M99N263L264l26
13295f95071r94k385j699l593m620j49N469K562J266j338k894L99K549Q69K179
13280f97450j717k822l561m96L186O059L088J642k829l303K87K734J846J164R43
13265f91229j678j88N55o07Q62L28m46l27L964J257k148l051J283j30J961j167
$$ plain form
13249 -690761 -690296 -689031 -688862 -686826 -685768 -687677 -687537 -685161 -684689 -684662 -682139 -683329 -684846 -684990 -682886 -684923
13233 -684923 -683417 -681259 -682668 -684411 -684376 -685544 -684877 -680722 -678789 -676883 -675819 -677409 -677275 -675891 -676934
13218 -676934 -679993 -676871 -672404 -670290 -671107 -671679 -669754 -666364 -666689 -665198 -667864 -668278 -664783 -657557 -656734
13203 -656734 -659121 -657414 -651831 -644593 -642213 -653018 -673394 -691621 -700200 -701764 -705689 -707991 -707681 -703098
13189 -703098 -699521 -695903 -693484 -692700 -688333 -687389 -686384 -684574 -685829 -686021 -684570 -682401 -679101 -678564 -681722
13174 -681722 -682242 -679493 -680581 -679541 -680425 -674413 -673931 -678373 -677028 -670892 -666306 -667681 -667884 -666268 -664869
13159 -664869 -664793 -664290 -662157 -661455 -659140 -661731 -658480 -649749 -642478 -644350 -647515 -661147 -683679 -696763
13145 -696763 -703415 -705620 -709774 -710587 -702049 -692914 -687908 -686462 -686681 -685312 -684667 -686254 -688146 -691144 -693644
$$ packed form
13249f90761M65J265J69K036J058j909J40K376M72K7K523j190j517j44K104k037
13233f84923J506K158j409j743L5j168O67M155J933J906J064j590J34J384j043
13218f76934l059L122M467K114q17n72J925L390l25J491k666m14L495P226Q23
13203f56734k387J707N583P238K380j0805k0376j8227q579j564l925k302L10M583
13189g03098L577L618K419P84M367R44J005J810j255j92J451K169L300N37l158
13174f81722n20K749j088J040q84O012M82m442J345O136M586j375k03J616J399
13159f64869P6N03K133P02K315k591L251Q731P271j872l165j3632k2532j3084
13145f96763o652k205m154q13Q538R135N006J446k19J369O45j587j892k998k500
$$ plain form
13130 -693644 -691510 -685719 -681633 -680255 -680872 -679121 -676782 -676240 -679212 -680800 -679692 -674439 -674031 -673052 -674735
13115 -674735 -675592 -675027 -675031 -673501 -674835 -675603 -676416 -677176 -676855 -672629 -667719 -669284 -672978 -672347 -669604 -666609 -666302
13098 -666302 -664266 -666113 -666230 -664709 -664747 -661801 -658611 -662872 -665680 -664214 -663487 -663413 -663583 -667409 -668733 -667159
13082 -667159 -666086 -667025 -665137 -662347 -661688 -662014 -660953 -658473 -657200 -660576 -660955 -663237 -661683 -659490 -661690
13067 -661690 -663228 -661419 -658799 -657742 -654751 -654675 -655225 -656606 -658509 -658996 -658226 -657740 -656679 -656053 -655807 -658293
13051 -658293 -656588 -654291 -652588 -651814 -653688 -654993 -652334 -653620 -655028 -656644 -654815 -654802 -654573 -654313 -655933
13036 -655933 -652905 -649587 -648678 -650508 -653878 -652156 -649838 -649225 -650190 -651194 -653532 -652088 -649777 -648475 -646603
13021 -646603 -648625 -646642 -646531 -649855 -650382 -652860 -650972 -646478 -643805 -644524 -644987 -648888 -647107 -647686 -648042 -651899
$$ packed form
13130f93644K134N791M086J378o17J751K339N42k972j588J108N253M08R79j683
13115f74735q57N65mJ530j334p68q13p60L21M226M910j565l694O31K743K995L07
13098f66302K036j847j17J521l8K946L190m261k808J466P27P4j70l826j324J574
13082f67159J073r39J888K790O59l26J061K480J273l376l79k282J554K193k200
13067f61690j538J809K620J057K991P6n50j381j903m87P70M86J061O26K46k486
13051f58293J705K297J703P74j874j305K659j286j408j616J829J3K29K60j620
13036f55933L028L318R09j830l370J722K318O13r65j004k338J444K311J302J872
13021f46603k022J983J11l324n27k478J888M494K673p19m63l901J781n79l56l857
$$ plain form
13005 -651899 -652221 -648340 -646078 -645991 -643547 -641359 -640625 -639838 -639867 -644783 -648505 -647364 -644736 -639275 -638083 -641162
12989 -641162 -641063 -639062 -640632 -638804 -638200 -639085 -639484 -638499 -639625 -643612 -643460 -641162 -641562 -639065 -633759 -631648
12973 -631648 -632956 -637229 -639318 -638550 -632993 -630959 -630933 -627721 -625829 -626099 -628713 -631699 -633718 -631586 -631092
12958 -631092 -629054 -629006 -631121 -630082 -629933 -628338 -630683 -636233 -635093 -633810 -633616 -634104 -632142 -631605 -633208 -632806
12942 -632806 -634212 -633596 -634903 -630961 -624672 -619132 -617818 -620116 -620534 -622437 -620111 -623384 -624717 -624755 -624817 -620735
12926 -620735 -620735 -619287 -621456 -622067 -620671 -621099 -621257 -621444 -618811 -620233 -618299 -618781 -622888 -624996 -624730 -625447 -624395
12909 -624395 -621704 -620236 -618582 -616120 -619125 -622983 -623072 -623841 -622741 -624432 -620811 -621218 -620408 -622101 -621356 -618641
12893 -618641 -616762 -613783 -612532 -611066 -612349 -612420 -609990 -612152 -611529 -611358 -610085 -609272 -608755 -606177 -606493 -606392
$$ packed form
13005f51899l22L881K262Q7K444K188P34P87k9m916l722J141K628N461J192l079
12989f41162R9K001j570J828O04q85l99R85j126l987J52K298m00K497N306K111
12973f31648j308m273k089P68N557K034K6L212J892k70k614k986k019K132M94
12958f31092K038M8k115J039J49J595k345n550J140J283J94m88J962N37j603M02
12942f32806j406O16j307L942O289N540J314k298m18j903K326l273j333l8o2M082
12926f20735%J448k169o11J396m28j58j87K633j422J934m82m107k108K66p17J052
12909f24395K691J468J654K462l005l858q9p69J100j691L621m07Q10j693P45K715
12893f18641J879K979J251J466j283p1K430k162O23J71J273Q13N17K578l16J01
$$ plain form
12877 -606392 -611057 -611268 -609927 -607318 -608733 -613032 -613261 -611077 -611841 -611551 -610117 -608111 -606617 -604398 -603166
12862 -603166 -604198 -607164 -611625 -612184 -610799 -607423 -605089 -607204 -608497 -607623 -607485 -606119 -605852 -605088 -607223
12847 -607223 -608163 -606627 -604957 -606693 -607295 -605485 -603379 -602352 -599129 -596922 -594429 -595548 -596833 -595171 -597129
12832 -597129 -599324 -597468 -593588 -592020 -592528 -594540 -595117 -591335 -589252 -587626 -588820 -591003 -592157 -591116 -592097
12817 -592097 -594943 -596569 -594510 -593812 -591940 -595759 -598872 -599709 -601220 -599781 -598343 -596598 -596481 -593169 -590665
12802 -590665 -590668 -590469 -591282 -589213 -586130 -589132 -589258 -588598 -591264 -592293 -591162 -588850 -585334 -583982 -581710 -579770
12786 -579770 -579691 -582201 -582841 -587655 -588703 -589056 -592642 -595649 -599701 -602395 -602825 -602668 -601984 -599918 -599941 -602733
12770 -602733 -601316 -599824 -599627 -598970 -597866 -594225 -590702 -587202 -587730 -586288 -588467 -585985 -582836 -581747 -581967
$$ packed form
12877f06392m665k11J341K609j415m299k29K184p64K90J434K006J494K219J232
12862f03166j032k966m461n59J385L376K334k115j293Q74J38J366K67P64k135
12847f07223r40J536J670j736o02J810K106J027L223K207K493j119j285J662j958
12832e97129k195J856L880J568n08k012n77L782K083J626j194k183j154J041r81
12817e92097k846j626K059O98J872l819l113q37j511J439J438J745J17L312K504
12802e90665lJ99q13K069L083l002j26O60k666j029J131K312L516J352K272J940
12786e79770P9k510o40m814j048l53l586l007m052k694m30J57O84K066k3k792
12770f02733J417J492J97O57J104L641L523L500n28J442k179K482L149J089k20
$$ plain form
12755 -581967 -584539 -584140 -582053 -580212 -581825 -580418 -579736 -577277 -580501 -587644 -590277 -595326 -599128 -603375 -608803
12740 -608803 -607947 -606155 -600541 -598772 -598829 -600924 -600448 -599765 -597160 -594972 -600173 -606821 -608823 -607016 -606392 -602288
12724 -602288 -600517 -599891 -597494 -595131 -594228 -592148 -593907 -598653 -601246 -600474 -597152 -594703 -596303 -595828 -592387
12709 -592387 -592860 -591386 -592555 -597052 -596774 -595070 -595102 -593878 -594083 -597162 -595549 -594919 -596420 -595335 -593944 -590764
12693 -590764 -585506 -588412 -592347 -590413 -586207 -586113 -586770 -588173 -589435 -589246 -587456 -588639 -584463 -584286 -583617 -585257
12677 -585257 -584747 -585813 -583337 -579354 -578195 -576215 -577954 -577061 -576210 -576208 -576434 -577104 -576062 -574814 -572954 -572444
12661 -572444 -572017 -573548 -577640 -578222 -579702 -578126 -577522 -579730 -581106 -579822 -578861 -576746 -573412 -572662 -571770 -571585
12645 -571585 -572816 -572272 -571540 -572243 -573739 -575334 -573403 -570591 -570430 -569646 -571957 -572836 -569442 -564707 -561767 -559634
$$ packed form
12755e81967k572L99K087J841j613J407O82K459l224p143k633n049l802m247n428
12740f08803Q56J792N614J769n7k095M76O83K605K188n201o648k002J807O24M104
12724f02288J771O26K397K363R03K080j759m746k593P72L322K449j600M75L441
12709e92387m73J474j169m497K78J704l2J224k05l079J613O30j501J085J391L180
12693e90764N258k906l935J934M206R4o57j403j262J89J790j183M176J77O69j640
12677e85257N10j066K476L983J159J980j739Q93Q51Kk26o70J042J248J860N10
12661e72444M27j531m092n82j480J576O04k208j376J284R61K115L334P50Q92J85
12645e71585j231N44P32p03j496j595J931K812J61P84k311q79L394M735K940K133
$$ plain form
12629 -559634 -560209 -563555 -566883 -567214 -566819 -568421 -566718 -565935 -564882 -563489 -558945 -560714 -561998 -563041 -567011
12614 -567011 -568430 -569558 -569031 -570212 -569555 -568339 -569607 -569417 -567509 -568090 -565453 -566702 -565903 -560754 -558428
12599 -558428 -558704 -564834 -564815 -562155 -561634 -560773 -561373 -562941 -563339 -562589 -560545 -558020 -558672 -560520 -562012 -564175
12583 -564175 -560863 -558475 -554163 -553666 -553966 -553515 -556040 -556897 -554713 -554178 -552321 -555199 -556962 -556096 -551214 -547566
12567 -547566 -547533 -551865 -552453 -550135 -548119 -551624 -554509 -548952 -546397 -548520 -548902 -545201 -542997 -543307 -547119
12552 -547119 -549525 -551863 -554874 -553120 -548129 -545285 -542297 -543215 -541723 -543058 -543686 -541238 -541350 -541176 -546142
12537 -546142 -544325 -541926 -542520 -543268 -542708 -540881 -538327 -537414 -539096 -540081 -538946 -539206 -538554 -536278 -538376 -540868
12521 -540868 -542984 -539421 -536927 -534219 -534377 -535321 -533546 -532341 -530754 -528609 -529785 -530488 -529285 -527587 -527127
$$ packed form
12629e59634n75l346l328l31L95j602J703P83J053J393M544j769j284j043l970
12614e67011j419j128N27j181O57J216j268J90J908n81K637j249P99N149K326
12599e58428k76o130J9K660N21Q61o00j568l98P50K044K525o52j848j492k163
12583e64175L312K388M312M97l00M51k525q57K184N35J857k878j763Q66M882L648
12567e47566L3m332n88K318K016l505k885N557K555k123l82L701K204l10l812
12552e47119k406k338l011J754M991K844K988r18J492j335o28K448j12J74m966
12537e46142J817K399n94p48N60J827K554R13j682r85J135k60O52K276k098k492
12521e40868k116L563K494K708j58r44J775J205J587K145j176p03J203J698M60
$$ plain form
12506 -527127 -526845 -527061 -527321 -530152 -529941 -531034 -530470 -526267 -523044 -524090 -524754 -525901 -526399 -525192 -524021 -523414
12490 -523414 -524396 -525932 -523938 -522140 -519376 -520320 -520280 -520305 -519980 -517331 -519118 -518066 -518334 -516146 -513313 -512853
12474 -512853 -514375 -515648 -514345 -512633 -514480 -512686 -509086 -507729 -506387 -506387 -503869 -504685 -504689 -501859 -502973 -503223
12458 -503223 -500494 -497018 -494287 -490067 -487789 -488042 -489809 -491509 -486933 -486401 -484657 -484246 -487365 -488550 -489376
12443 -489376 -489103 -485481 -485734 -484418 -477608 -471291 -469672 -467614 -464740 -459494 -457010 -456003 -456899 -456641 -454809
12428 -454809 -452332 -447241 -442656 -438502 -432554 -432983 -432295 -434150 -437174 -440247 -440702 -443382 -448502 -456448 -466953
12413 -466953 -477912 -487322 -497719 -511135 -517820 -519670 -521246 -523755 -524446 -522499 -520447 -515856 -516283 -516422
12399 -516422 -514997 -509987 -506249 -504230 -500383 -497870 -491423 -483804 -473945 -469024 -467901 -464789 -457882 -452281
$$ packed form
12506e27127K82k16k60k831K11j093N64M203L223j046o64j147m98J207J171O07
12490e23414r82j536J994J798K764r44M0k5L25K649j787J052k68K188K833M60
12474e12853j522j273J303J712j847J794L600J357J342%K518q16mK830j114k50
12458e03223K729L476K731M220K278k53j767j700M576N32J744M11l119j185q26
12443d89376K73L622k53J316O810O317J619K058K874N246K484J007q96K58J832
12428d54809K477N091M585M154N948m29O88j855l024l073m55k680n120p946j0505
12413d66953j0959r410j0397j3416o685j850j576k509o91J947K052M591m27j39
12399e16422J425N010L738K019L847K513O447P619R859M921J123L112O907N601
$$ plain form
12385 -452281 -445693 -438697 -433456 -432450 -430261 -429612 -428647 -426732 -429371 -439213 -451936 -463737 -481228 -502129
12371 -502129 -521835 -542050 -562969 -586322 -605800 -620997 -631440 -640234 -647187 -652916 -652708 -649497 -645101
12358 -645101 -639574 -633874 -628918 -626833 -623934 -619049 -615307 -608638 -599360 -592757 -589805 -587075 -579625 -573482
12344 -573482 -574360 -571271 -569611 -566349 -561710 -555447 -549622 -542700 -543453 -546691 -550643 -556254 -563627 -570837 -580787
12329 -580787 -591120 -603373 -619162 -629527 -636959 -641012 -644859 -647977 -644404 -641992 -642641 -641180 -637595
12316 -637595 -635206 -634563 -632268 -631170 -628543 -629166 -625908 -621348 -620495 -619347 -613194 -609580 -610179 -605514 -602208
12301 -602208 -599397 -596477 -596517 -598062 -598462 -600631 -598033 -595460 -594285 -591474 -588829 -589911 -586169 -584690 -582999
12286 -582999 -579677 -579018 -579927 -579785 -576934 -575897 -576404 -574870 -569663 -568909 -568409 -567794 -565253 -563545 -561826 -562186
$$ packed form
12385d52281O588O996N241J006K189O49R65J915k639r842j2723j1801j7491k0901
12371e02129j9706k0215k0919k3353j9478j5197j0443q794o953n729K08L211M396
12358f45101N527N700M956K085K899M885L742O669R278O603K952K730P450O143
12344e73482q78L089J660L262M639O263N825O922p53l238l952n611p373p210r950
12329e80787j0333j2253j5789j0365p432m053l847l118L573K412o49J461L585
12316f37595K389O43K295J098K627o23L258M560Q53J148O153L614n99M665L306
12301f02208K811K920m0j545m00k169K598K573J175K811K645j082L742J479J691
12286e82999L322O59r09J42K851J037n07J534N207P54N00O15K541J708J719l60
$$ plain form
12270 -562186 -560390 -560938 -561199 -564131 -564669 -559951 -558568 -558049 -558737 -555897 -554579 -555326 -558131 -556756 -551357 -551898
12254 -551898 -554811 -552331 -551175 -548532 -545618 -548097 -548569 -546698 -548483 -551080 -550229 -548628 -547918 -548790 -547765
12239 -547765 -546011 -545336 -545971 -547643 -547687 -545154 -540662 -540396 -544166 -542387 -539272 -539005 -538092 -535602 -531893 -531084
12223 -531084 -536813 -541823 -541680 -541721 -541036 -539682 -538217 -536679 -533612 -530445 -529556 -533534 -536975 -537335 -537669 -537253
12207 -537253 -535275 -534882 -536038 -537084 -538211 -534792 -535037 -535377 -534339 -532826 -526711 -523013 -524233 -527579 -528849
12192 -528849 -529336 -531726 -531137 -528531 -528964 -528258 -528318 -527168 -524949 -522303 -520765 -518308 -515276 -515802 -518196 -519019
12176 -519019 -518410 -518587 -518947 -523058 -522606 -518403 -518180 -523515 -526845 -525018 -520571 -518532 -517074 -515411 -519160
12161 -519160 -518020 -515930 -517239 -519336 -517888 -517477 -518655 -519701 -519505 -515753 -515971 -514258 -514990 -517774 -519776
$$ packed form
12270e62186J796n48k61k932n38M718J383N19o88K840J318p47k805J375N399n41
12254e51898k913K480J156K643K914k479m72J871j785k597Q51J601P10q72J025
12239e47765J754O75o35j672m4K533M492K66l770J779L115K67R13K490L709Q09
12223e31084n729n010J43m1O85J354J465J538L067L167Q89l978l441l60l34M16
12207e37253J978L93j156j046j127L419k45l40J038J513O115L698j220l346j270
12192e28849m87k390N89K606m33P06o0J150K219K646J538K457L032n26k394q23
12176e19019O09j77l60m111M52M203K23n335l330J827M447K039J458J663l749
12161e19160J140K090j309k097J448M11j178j046J96L752k18J713p32k784k002
$$ plain form
12146 -519776 -519703 -518169 -514706 -514240 -517541 -519287 -518914 -516885 -513415 -515022 -513224 -514654 -517323 -520879 -519407
12131 -519407 -515544 -512748 -510391 -508734 -508197 -506469 -506333 -507986 -507586 -507032 -504120 -505328 -506361 -506898 -508363
12116 -508363 -506965 -501546 -501354 -499094 -500992 -502690 -502289 -502803 -502539 -505909 -508183 -508475 -509668 -508796 -505574 -503980
12100 -503980 -503549 -503844 -501340 -500544 -502565 -502331 -500052 -497246 -500269 -504122 -504748 -504553 -502329 -501899 -501351 -499746
12084 -499746 -500816 -501681 -500680 -497371 -496376 -493800 -490951 -488474 -491091 -491276 -489160 -492264 -494939 -493465 -493500
12069 -493500 -493456 -491981 -491070 -490759 -490432 -490241 -491893 -491794 -493609 -495909 -495743 -491416 -492380 -493096 -494957 -493909 -489890
12052 -489890 -485631 -489599 -492053 -492579 -492195 -489044 -487603 -485584 -484163 -483716 -485985 -484772 -484947 -481903 -480169
12037 -480169 -479076 -482377 -482968 -483787 -486403 -487514 -483431 -479652 -480098 -478844 -479882 -480722 -480689 -479346 -475461 -471271
$$ packed form
12146e19776P3J534L463M66l301j746L73K029L470j607J798j430k669l556J472
12131e19407L863K796K357J657N37J728J36j653M00N54K912j208j033n37j465
12116e08363J398N419J92K260j898j698M01n14K64l370k274k92j193Q72L222J594
12100e03980M31k95K504P96k021K34K279K806l023l853o26J95K224M30N48J605
12084d99746j070q65J001L309R95K576K849K477k617j85K116l104k675J474l5
12069d93500M4J475R11L11L27J91j652R9j815k300J66M327r64p16j861J048M019
12052d89890M259l968k454n26L84L151J441K019J421M47k269J213j75L044J734
12037d80169J093l301n91q19k616j111M083L779m46J254j038q40L3J343L885M190
$$ plain form
12021 -471271 -470814 -471847 -474230 -477521 -479959 -481612 -484468 -485072 -482821 -479773 -481371 -482498 -479696 -476096 -474436
12006 -474436 -477309 -474255 -471670 -468659 -466327 -459998 -458069 -457211 -458888 -461627 -465078 -468366 -468744 -469789 -473484
11991 -473484 -478505 -483890 -483848 -483766 -482184 -479197 -478326 -474998 -473553 -470947 -470829 -468847 -466681 -467757 -466208 -462697
11975 -462697 -457237 -460053 -462372 -459424 -456711 -453484 -450087 -450044 -449888 -447292 -447120 -445729 -445676 -443126 -437626 -438266
11959 -438266 -440129 -440168 -436338 -438408 -440446 -441898 -436928 -434623 -442266 -457775 -467626 -467075 -469992 -482414
11945 -482414 -505048 -516819 -516929 -509127 -500053 -494976 -490569 -486537 -483073 -477543 -475251 -472231 -466091 -462849
11931 -462849 -461009 -459706 -458033 -453581 -448703 -448290 -445714 -446757 -445263 -439667 -438361 -432678 -425520 -422705
11917 -422705 -416655 -411647 -410674 -419395 -432542 -442316 -444419 -443986 -456847 -473174 -476712 -476453 -480604 -489706
$$ packed form
12021d71271M57j033k383l291k438j653k856o04K251L048j598j127K802L600J660
12006d74436k873L054K585L011K332O329J929Q58j677k739l451l288l78j045l695
11991d73484n021n385M2Q2J582K987Q71L328J445K606J18J982K166j076J549L511
11975d62697N460k816k319K948K713L227L397M3J56K596J72J391N3K550N500o40
11959d38266j863l9L830k070k038j452M970K305p643j5509r851N51k917j2422
11945d82414k2634j1771j10P802R074N077M407M032L464N530K292L020O140L242
11931d62849J840J303J673M452M878M13K576j043J494N596J306N683P158K815
11917d22705O050N008R73q721j3147r774k103M33j2861j6327l538K59m151r102
$$ plain form
11903 -489706 -496755 -496439 -493383 -501462 -521100 -535490 -535561 -526404 -518831 -513588 -506329 -500032 -494362 -488526
11889 -488526 -484756 -481578 -476691 -476247 -477959 -477615 -475126 -475453 -475947 -471797 -467826 -464707 -462610 -457648 -455855
11874 -455855 -454210 -452512 -450279 -447369 -446114 -443290 -448793 -467128 -481893 -485573 -485561 -491592 -504816 -515704
11860 -515704 -516844 -514562 -511646 -511822 -510996 -509762 -507483 -511002 -515448 -513642 -505954 -500456 -496677 -495745 -492455
11845 -492455 -487585 -485651 -487675 -486379 -484299 -484940 -486790 -486443 -482021 -479816 -480002 -478296 -471281 -469151 -470950
11830 -470950 -474294 -479234 -485469 -490171 -487235 -481731 -477231 -474379 -476766 -482098 -484911 -484329 -483241 -486205
11816 -486205 -492589 -493160 -491760 -491624 -491267 -489074 -486551 -486038 -488724 -489100 -487094 -483802 -479907 -477549 -474281
11801 -474281 -472032 -469024 -467103 -465206 -465351 -466660 -464526 -460042 -457959 -451893 -448540 -452261 -456397 -459633
$$ packed form
11903d89706p049L16L056q079j9638j4390p1R157P573N243P259O297N670N836
11889d88526L770L178M887M44j712L44K489l27m94M150L971L119K097M962J793
11874d55855J645J698K233K910J255K824n503j8335j4765l680J2o031j3224j0888
11860e15704j140K282K916j76Q26J234K279l519m446J806P688N498L779R32L290
11845d92455M870J934k024J296K080o41j850L47M422K205j86J706P015K130j799
11830d70950l344m940o235m702K936N504M500K852k387n332k813N82J088k964
11816d86205o384n71J400J36L57K193K523N13k686l76K006L292L895K358L268
11801d74281K249L008J921J897j45j309K134M484K083O066L353l721m136l236
$$ plain form
11787 -459633 -459684 -463756 -469811 -472274 -476554 -478142 -479976 -481165 -480568 -482559 -482232 -475046 -472750 -469963 -471976
11772 -471976 -471152 -469956 -470178 -472869 -468589 -464717 -459604 -454526 -456092 -459448 -457475 -459767 -458069 -455475 -456222
11757 -456222 -456511 -452886 -452370 -453560 -452317 -452468 -450530 -448474 -450688 -449036 -444437 -439956 -438889 -442364 -445467
11742 -445467 -446395 -448047 -451122 -453530 -455515 -459525 -459574 -455638 -450269 -453454 -454354 -454351 -456036 -449840 -443069 -443191
11726 -443191 -443097 -441238 -438717 -436620 -432541 -426846 -422967 -421645 -421217 -421355 -419112 -414937 -409151 -405955 -402765
11711 -402765 -395724 -388462 -382766 -370694 -356147 -341668 -333305 -361849 -446569 -519895 -539471 -535367
11699 -535367 -534729 -528167 -523943 -524543 -520719 -516748 -511169 -507496 -504609 -499708 -492513 -488242 -484984 -480907 -479164
11684 -479164 -476219 -472045 -469606 -465634 -463397 -462839 -464767 -466845 -469026 -467611 -469303 -467640 -465529 -462292
$$ packed form
11787d59633n1m072o055k463m280j588j834j189N97j991L27P186K296K787k013
11772d71976Q24J196k22k691M280L872N113N078j566l356J973k292J698K594p47
11757d56222k89L625N16j190J243j51J938K056k214J652M599M481J067l475l103
11742d45467r28j652l075k408j985m010m9L936N369l185r00Lj685O196O771j22
11726d43191R4J859K521K097M079N695L879J322M28j38K243M175N786L196L190
11711d02765P041P262N696J2072J4547J4479Q363k8544q4720p3326j9576M104
11699e35367O38O562M224o00L824L971N579L673K887M901P195M271L258M077J743
11684d79164K945M174K439L972K237N58j928k078k181J415j692J663K111L237
$$ plain form
11670 -462292 -458449 -457438 -457145 -451340 -450548 -455186 -456867 -456672 -456718 -452845 -449051 -450331 -447696 -447044 -447628 -448215
11654 -448215 -451624 -451905 -452184 -450900 -447027 -443798 -445382 -445891 -442777 -440653 -441389 -445983 -444993 -444501 -446293 -447686
11638 -447686 -451050 -452267 -447588 -445672 -448367 -444659 -438638 -436617 -437526 -438435 -437670 -438218 -435815 -434654 -432749
11623 -432749 -431120 -429342 -429679 -430351 -432366 -432473 -430525 -432204 -428594 -426358 -427048 -428464 -433037 -432756 -429739
11608 -429739 -428958 -427079 -422219 -417659 -417626 -420951 -423353 -428018 -430153 -429565 -432389 -432999 -434782 -435556 -434502 -434278
11592 -434278 -435077 -432641 -432726 -430766 -430275 -431335 -432138 -428002 -424624 -423208 -422738 -422370 -422575 -422567 -422444 -422102 -422650 -420803
11574 -420803 -416105 -415398 -417392 -417054 -417739 -420117 -419443 -416946 -415819 -416766 -415805 -414371 -412623 -412080 -412224 -409855
11558 -409855 -410516 -408402 -404257 -403569 -407946 -409342 -407888 -408854 -407798 -412050 -413296 -408639 -403653 -405324 -405839
$$ packed form
11670d62292L843J011K93N805P92m638j681J95m6L873L794j280K635O52n84n87
11654d48215l409k81k79J284L873L229j584n09L114K124p36m594R90M92j792j393
11638d47686l364j217M679J916k695L708O021K021r09r09P65n48K403J161J905
11623d32749J629J778l37o72k015j07J948j679L610K236o90j416m573K81L017
11608d29739P81J879M860M560L3l325k402m665k135N88k824o10j783p74J054K24
11592d34278p99K436q5J960M91j060q03M136L378J416M70L68k05QJ23L42n48J847
11574d20803M698P07j994L38o85k378O74K497J127r47R61J434J748N43j44K369
11558d09855o61K114M145O88m377j396J454r66J056m252j246M657M986j671n15
$$ plain form
11543 -405839 -406898 -404254 -401413 -397754 -398278 -400217 -404638 -403104 -404052 -402877 -400205 -400669 -399407 -397227 -399436
11528 -399436 -402204 -402260 -398805 -400211 -402633 -398796 -394714 -391991 -391832 -392792 -391105 -391698 -392395 -393161 -393897 -392031
11512 -392031 -393628 -392754 -388056 -388800 -389554 -392668 -395408 -395924 -393563 -390367 -387657 -384976 -389077 -388115 -384973
11497 -384973 -381083 -377360 -376273 -380419 -383312 -385305 -383393 -380770 -380565 -380047 -378833 -377868 -378977 -382661 -382471
11482 -382471 -378743 -377444 -377119 -375595 -373898 -377863 -376032 -369199 -368699 -373523 -377781 -378875 -377150 -377475 -377479 -376630
11466 -376630 -375100 -372475 -368365 -366083 -367663 -368376 -366276 -367318 -364451 -365534 -366956 -366981 -364028 -362239 -362105
11451 -362105 -362817 -364761 -363576 -363232 -358897 -354582 -355025 -354068 -350456 -347872 -346090 -346692 -351642 -352360 -346545 -345272
11435 -345272 -346297 -346169 -345008 -346667 -349330 -355007 -356343 -355266 -354421 -351468 -349984 -349042 -348218 -346696 -342366
$$ packed form
11543d05839j059K644K841L659n24j939m421J534r48J175K672m64J262K180k209
11528c99436k768n6L455j406k422L837M082K723J59r60J687n93o97p66p36J866
11512c92031j597Q74M698p44p54l114k740n16K361L196K710K681m101R62L142
11497c84973L890L723J087m146k893j993J912K623K05N18J214R65j109l684J90
11482c82471L728J299L25J524J697l965J831O833N00m824m258j094J725l25mQ49
11466c76630J530K625M110K282j580p13K100j042K867j083j422k5K953J789J34
11451c62105p12j944J185L44M335M315m43R57L612K584J782o02m950p18N815J273
11435c45272j025J28J161j659k663n677j336J077Q45K953J484R42Q24J522M330
$$ plain form
11420 -342366 -339043 -341316 -343301 -343332 -343243 -341790 -340539 -339087 -335536 -332465 -330912 -331639 -335448 -330620 -327926
11405 -327926 -328349 -328375 -325725 -325361 -328292 -327366 -323786 -319492 -319791 -316870 -313195 -312806 -313390 -312806 -309179 -307791
11389 -307791 -306941 -305193 -305722 -305868 -308075 -308880 -306424 -302706 -299812 -297614 -299432 -299962 -299090 -298064 -296892 -292851
11373 -292851 -290590 -290199 -288175 -288592 -285584 -282053 -281110 -280146 -281746 -280286 -276169 -269026 -265715 -263830 -263439
11358 -263439 -259716 -257150 -258159 -257993 -256627 -255792 -252476 -252680 -249970 -247662 -248492 -246390 -242014 -240079 -240907
11343 -240907 -235739 -230282 -228151 -226889 -222928 -217355 -212769 -211553 -210379 -209036 -207785 -203753 -201863 -196618
11329 -196618 -189999 -186747 -187821 -184823 -182778 -179156 -176289 -172185 -166436 -161994 -157421 -151624 -148793 -144189
11315 -144189 -139358 -131201 -122007 -113136 -105281 -97466 -91612 -90921 -90195 -86471 -85164 -81513 -72141 -62971 -52305
$$ packed form
11420c42366L323k273j985l1Q9J453J251J452L551L071J553p27l809M828K694
11405c27926m23k6K650L64k931R26L580M294k99K921L675L89n84N84L627J388
11389c07791Q50J748n29j46k207q05K456L718K894K198j818n30Q72J026J172M041
11373b92851K261L91K024m17L008L531R43R64j600J460M117P143L311J885L91
11358b63439L723K566j009J66J366Q35L316k04K710K308q30K102M376J935q28
11343b40907N168N457K131J262L961N573M586J216J174J343J251M032J890N245
11329a96618O619L252j074K998K045L622K867M104N749M442M573N797K831M604
11315a44189M831Q157R194Q871P855P815N854O91P26L724J307L651R372R170J0666
$$ plain form
11300 -52305 -40742 -26543 -14413 -5762 5057 22229 38068 53983 72570 90842 108699 128385
11288 128385 151678 177463 202224 232080 266235 303868 342088 377144 412782 451756 494809
11277 494809 541359 589373 654993 739659 846702 982787 1164133 1403187 1671304 1821259
11267 1821259 1559817 857119 103951 -640938 -1530987 -2216613 -2429168 -2350445 -2171083 -1973971
11257 -1973971 -1796653 -1642065 -1510028 -1398406 -1302472 -1225985 -1160998 -1102592 -1054757 -1014563
11247 -1014563 -971161 -929182 -892369 -858963 -827088 -798136 -768820 -741954 -721994 -705153 -687593
11236 -687593 -669058 -656276 -650996 -643531 -632065 -626659 -621866 -614441 -601560 -580501 -564497 -555009 -545774
11223 -545774 -536986 -526823 -513915 -500199 -491791 -484431 -476695 -468321 -455931 -443498 -432904 -420713
$$ packed form
11300e2305J1563J4199J2130Q651J0819J7172J5839J5915J8587J8272J7857J9686
11288A28385K3293K5785K4761K9856L4155L7633L8220L5056L5638L8974M3053
11277D94809M6550M8014O5620Q4666J07043J36085J81346K39054K68117J49955
11267A821259k61442p02698p53168p44889q90049o85626k12555P8723J79362J97112
11257a973971J77318J54588J32037J11622R5934P6487O4987N8406M7835M0194
11247a014563M3402M1979L6813L3406L1875K8952K9316K6866J9960J6841J7560
11236f87593J8535J2782N280P465J1466N406M793P425J2881K1059J6004R488R235
11223e45774Q788J0163J2908J3716Q408P360P736Q374J2390J2433J0594J2191
$$ plain form
11211 -420713 -411721 -403230 -389285 -376079 -368195 -361872 -357171 -348403 -335742 -321327 -307929 -298462 -289665
11198 -289665 -274077 -257941 -241338 -222519 -203462 -183971 -167737 -145983 -123297 -99907 -78089
11187 -78089 -53727 -25382 41 27808 61373 103920 145120 191583 237310 285776 342024 409619
11175 409619 495028 599715 735068 913084 1137487 1381954 1472554 1090676 334853 -210165
11165 -210165 -475566 -963610 -1780569 -2385481 -2533846 -2438288 -2268365 -2090465 -1929969 -1787820
11155 -1787820 -1669450 -1570466 -1486396 -1415688 -1353038 -1295853 -1243132 -1193241 -1151657 -1117206 -1084057
11144 -1084057 -1056116 -1026544 -998721 -974025 -950522 -933153 -930277 -926012 -909445 -892510 -882169 -880610
11132 -880610 -883138 -877877 -867795 -855279 -842317 -832267 -821192 -810798 -796832 -785260 -778802 -768937
$$ packed form
11211d20713Q992Q491J3945J3206P884O323M701Q768J2661J4415J3398R467Q797
11198b89665J5588J6136J6603J8819J9057J9491J6234K1754K2686K3390K1818
11187g8089K4362K8345K5423K7767L3565M2547M1200M6463M5727M8466N6248O7595
11175D09619Q5409J04687J35353J78016K24403K44467R0600l81878p55823n45018
11165b10165k65401m88044q16959o04912j48365R5558J69923J77900J60496J42149
11155a787820J18370R8984Q4070P0708O2650N7185N2721M9891M1584L4451L3149
11144a084057K7941K9572K7823K4696K3503J7369K876M265J6567J6935J0341J559
11132h80610k528N261J0082J2516J2962J0050J1075J0394J3966J1572O458R865
$$ plain form
11120 -768937 -764394 -759696 -752747 -746925 -739909 -733636 -725967 -719730 -710946 -703431 -695109 -689106 -681692 -680919
11106 -680919 -689791 -698852 -698307 -695354 -695984 -705293 -712575 -707092 -699428 -691107 -685956 -682446 -679290 -674031 -670044
11091 -670044 -666864 -662201 -662040 -657909 -654287 -652128 -649833 -647384 -642224 -639839 -636598 -636572 -633991 -630386 -627806
11076 -627806 -624706 -621084 -622048 -619418 -616692 -616963 -613985 -612087 -607992 -605637 -607965 -606323 -605604 -603493 -596586
11061 -596586 -593603 -592772 -589905 -586728 -588677 -591357 -589631 -587902 -584732 -579852 -578319 -581457 -579492 -576223
11047 -576223 -574008 -578028 -576772 -573534 -575088 -575752 -572670 -567926 -562907 -564037 -566723 -568255 -563938 -560124
11033 -560124 -559927 -561835 -562223 -560941 -561967 -561686 -557129 -551919 -549954 -549798 -548425 -545491 -543827 -542058 -542206
11018 -542206 -542950 -543983 -540880 -541028 -538541 -539805 -537477 -535300 -534420 -533376 -536776 -537678 -535671 -532158 -528189
$$ packed form
11120g68937M543M698O949N822P016O273P669O237Q784P515Q322O003P414P73
11106f80919q872r061N45K953o30r309p282N483P664Q321N151L510L156N259L987
11091f70044L180M663J61M131L622K159K295K449N160K385L241K6K581L605K580
11076f27806L100L622r64K630K726k71K978J898M095K355k328J642P19K111O907
11061e96586K983Q31K867L177j949k680J726J729L170M880J533l138J965L269
11047e76223K215m020J256L238j554o64L082M744N019j130k686j532M317L814
11033e60124J97j908l88J282j026K81M557N210J965J56J373K934J664J769j48
11018e42206p44j033L103j48K487j264K328K177Q80J044l400r02K007L513L969
$$ plain form
11003 -528189 -529295 -535067 -539189 -535441 -529801 -526597 -524750 -523725 -521704 -520715 -520368 -520258 -523890 -525797 -524437
10988 -524437 -524095 -522964 -520944 -519604 -518461 -515549 -514095 -512349 -512078 -510449 -505553 -503994 -504310 -503360 -505288
10973 -505288 -510825 -511875 -508023 -503237 -499862 -497677 -496428 -497752 -498489 -496598 -492987 -487835 -485738 -486315 -480872
10958 -480872 -474191 -466869 -458663 -453145 -472699 -523643 -554220 -554510 -548227 -542332 -537218 -532648 -529493 -527730
10944 -527730 -523588 -521551 -518404 -517608 -517608 -516984 -513559 -505099 -506108 -507043 -506985 -508234 -505447 -502565 -498850 -500513
10928 -500513 -500508 -498650 -498172 -498565 -499773 -502374 -505634 -504170 -501406 -502335 -500951 -498886 -497615 -494633 -494457 -495269
10912 -495269 -495611 -495170 -496448 -493601 -490134 -488424 -490025 -491550 -488844 -486725 -485831 -487649 -486652 -486154 -485955 -484439
10896 -484439 -480875 -483160 -483164 -483730 -483305 -484121 -484022 -482703 -479825 -480597 -480153 -477351 -478702 -480536 -481058 -479146 -476322
$$ packed form
11003e28189j106n772m122L748N640L204J847J025K021R89L47J10l632j907J360
10988e24437L42J131K020J340J143K912J454J746K71J629M896J559l16R50j928
10973e05288n537j050L852M786L375K185J249j324p37J891L611N152K097n77N443
10958d80872O681P322Q206N518j9554n0944l0577k90O283N895N114M570L155J763
10944e27730M142K037L147P96%O24L425Q460j009r35N8j249K787K882L715j663
10928e00513NJ858M78l93j208k601l260J464K764r29J384K065J271K982J76q12
10912d95269l42M41j278K847L467J710j601j525K706K119Q94j818R97M98J99J516
10896d84439L564k285mn66M25q16R9J319K878p72M44K802j351j834n22J912K824
$$ plain form
10879 -476322 -478925 -484570 -484139 -483164 -485059 -483828 -482981 -483066 -482391 -483462 -482518 -476585 -477106 -478336 -481112 -480177
10863 -480177 -478104 -475704 -478468 -475495 -475942 -475379 -472537 -469117 -469384 -468667 -469060 -467969 -465519 -463792 -463087 -462849
10847 -462849 -463066 -461583 -461821 -463043 -461896 -460832 -461161 -462394 -460950 -461938 -463857 -464961 -465464 -466603 -463218
10832 -463218 -460986 -460859 -458932 -457151 -460530 -464532 -469130 -472016 -474662 -472908 -475283 -473848 -472116 -470067
10818 -470067 -467322 -465108 -462880 -464402 -464951 -465072 -463524 -462994 -462995 -462585 -463879 -463364 -459438 -457740 -459230 -461201
10802 -461201 -459720 -455516 -454580 -454813 -453122 -453572 -455004 -455633 -458301 -460880 -457779 -457431 -456289 -456611 -457164 -454231
10786 -454231 -451186 -451540 -450502 -452069 -449805 -449118 -446383 -444199 -441623 -439349 -442075 -440023 -437027 -439902 -443011
10771 -443011 -443592 -442731 -442518 -438299 -431475 -426486 -423018 -425906 -442874 -460609 -467061 -469739 -466547 -458146
$$ packed form
10879d76322k603n645M31R75j895J231Q47q5O75j071R44N933n21j230k776R35
10863d80177K073K400k764K973m47N63K842L420k67P17l93J091K450J727P05K38
10847d62849k17J483k38j222J147J064l29j233J444r88j919j104n03j139L385
10832d63218K232J27J927J781l379m002m598k886k646J754k375J435J732K049
10818d70067K745K214K228j522n49j21J548N30jM10j294N15L926J698j490j971
10802d61201J481M204R36k33J691m50j432o29k668k579L101L48J142l22n53K933
10786d54231L045l54J038j567K264O87K735K184K576K274k726K052K996k875l109
10771d43011n81Q61K13M219O824M989L468k888j6968j7735o452k678L192Q401
$$ plain form
10757 -458146 -454268 -457600 -458558 -458069 -453888 -448917 -447704 -447392 -447772 -447942 -444399 -442423 -441612 -440148 -440037 -440133
10741 -440133 -435628 -431689 -428337 -430462 -431987 -434814 -432612 -427908 -424606 -420038 -413059 -410987 -407832 -403838
10727 -403838 -400695 -399020 -405908 -433462 -476058 -496890 -504019 -503655 -500912 -496452 -487175 -477808 -475258 -470934
10713 -470934 -467489 -466947 -464459 -462228 -458953 -455411 -454764 -453990 -453179 -456915 -459730 -458382 -456127 -454458 -452289
10698 -452289 -449682 -445074 -444735 -447103 -448131 -447042 -449362 -446274 -438399 -432702 -430894 -424371 -424984 -438392
10684 -438392 -456350 -468809 -472699 -470778 -468339 -465612 -461967 -459090 -457103 -454510 -452118 -451811 -452833 -450841
10670 -450841 -448801 -444189 -444250 -446041 -445848 -443970 -443549 -443831 -444856 -443015 -442708 -442883 -444734 -443148 -445619 -447734
10654 -447734 -446164 -443463 -441213 -439602 -436736 -435482 -433906 -432206 -435536 -438381 -439894 -439101 -435483 -437080
$$ packed form
10757d58146L878l332r58M89M181M971J213L12l80j70L543J976Q11J464J11r6
10741d40133M505L939L352k125j525k827K202M704L302M568O979K072L155L994
10727d03838L143J675o888k7554m2596k0832p129L64K743M460R277R367K550M324
10713d70934L445N42K488K231L275L542O47P74Q11l736k815J348K255J669K169
10698d52289K607M608L39k368j028J089k320L088P875N697J808O523o13j3408
10684d38392j7958j2459l890J921K439K727L645K877J987K593K392L07j022J992
10670d50841K040M612o1j791J93J878M21k82j025J841L07j75j851J586k471k115
10654d47734J570K701K250J611K866J254J576J700l330k845j513P93L618j597
$$ plain form
10640 -437080 -441155 -442525 -440917 -438335 -437472 -440228 -438672 -437115 -436775 -437008 -435999 -436253 -438417 -439564 -436040
10625 -436040 -435181 -434077 -432619 -437798 -434004 -434542 -437834 -433864 -433702 -432912 -434341 -436716 -437679 -432960 -429133
10610 -429133 -428634 -428446 -430109 -430185 -431734 -432376 -430265 -433183 -436102 -436011 -435733 -434913 -430407 -429217 -431520 -429564
10594 -429564 -428044 -428525 -430266 -430737 -430821 -426998 -425093 -425894 -425485 -423391 -424861 -422081 -419618 -418841 -421742 -421504
10578 -421504 -423107 -424012 -424104 -427154 -427681 -425596 -424004 -422406 -424398 -423450 -420539 -419753 -421317 -421864 -423999 -424792
10562 -424792 -422298 -423822 -427330 -427023 -423854 -424445 -425916 -423497 -421194 -422199 -421687 -422421 -422802 -419236 -416626
10547 -416626 -420990 -421655 -418632 -417436 -419852 -423232 -423321 -420245 -419340 -420433 -417856 -412755 -413333 -417045 -417655 -418838
10531 -418838 -418650 -419030 -415187 -414702 -414820 -415592 -416421 -415293 -415451 -418634 -419120 -418570 -418613 -418434 -417504 -417071 -416267 -413178
$$ packed form
10640d37080m075j370J608K582Q63k756J556J557L40k33J009k54k164j147L524
10625d36040Q59J104J458n179L794n38l292L970J62P90j429k375r63M719L827
10610d29133M99J88j663p6j549o42K111k918k919R1K78Q20M506J190k303J956
10594d29564J520m81j741m71q4L823J905q01M09K094j470K780K463P77k901K38
10578d21504j603r05r2l050n27K085J592J598j992R48K911P86j564n47k135p93
10562d24792K494j524l508L07L169n91j471K419K303j005N12p34l81L566K610
10547d16626m364o65L023J196k416l380q9L076R05j093K577N101n78l712o10j183
10531d18838J88l80L843M85j18p72q29J128j58l183m86N50m3J79R30M33Q04L089
$$ plain form
10513 -413178 -411921 -413762 -414555 -412808 -413475 -413840 -412162 -409413 -409319 -410041 -411698 -411870 -412728 -412034 -412008 -411478 -409845
10496 -409845 -409924 -410079 -408323 -406709 -406934 -410475 -410144 -407933 -404540 -406242 -408328 -410729 -410416 -408295 -408861 -408209
10480 -408209 -406216 -405304 -405864 -406453 -407284 -408502 -407599 -406248 -405589 -405568 -402779 -404166 -403604 -403047 -401891 -399563 -399551
10463 -399551 -398195 -398187 -401103 -405244 -408239 -410393 -410173 -409246 -406117 -406062 -405990 -403740 -404021 -403398 -401013 -399853 -400167
10446 -400167 -400653 -396564 -394273 -397052 -398196 -398906 -398600 -401064 -402503 -403034 -400172 -398562 -400860 -401762 -398153
10431 -398153 -397237 -397333 -397544 -399683 -398056 -393520 -394647 -398562 -401315 -400313 -399745 -398578 -401013 -403103 -403989 -401849
10415 -401849 -400033 -399026 -399758 -397641 -397209 -397216 -394870 -394850 -394290 -397213 -397689 -397108 -397107 -398222 -399523 -399061 -395272 -393886
10397 -393886 -395113 -396497 -394079 -392279 -392828 -394798 -396240 -395220 -394705 -396851 -395909 -396310 -395666 -397776 -398624 -397240
$$ packed form
10513d13178J257j841p93J747o67l65J678K749R4p22j657j72q58O94K6N30J633
10496d09845p9j55J756J614k25l541L31K211L393j702k086k401L13K121n66O52
10480d08209J993R12n60n89q31j218R03J351O59K1K789j387N62N57J156K328J2
10463c99551J356Qk916m141k995k154K20R27L129N5P2K250k81O23K385J160l14
10446d00167m86M089K291k779j144p10L06k464j439n31K862J610k298r02L609
10431c98153R16r6k11k139J627M536j127l915k753J002N68J167k435k090q86K140
10415d01849J816J007p32K117M32pK346K0N60k923m76N81Jj115j301M62L789J386
10397c93886j227j384K418J800n49j970j442J020N15k146R42m01O44k110q48J384
$$ plain form
10381 -397240 -394769 -392987 -391902 -391440 -391812 -393141 -394127 -393819 -394487 -393101 -389161 -390749 -394966 -395890 -393128 -393098
$$ packed form
10381c97240K471J782J085M62l72j329r86L08o68J386L940j588m217r24K762L0
$$ [...]
##END NTUPLES=NMR SPECTRUM
##END=
