##TITLE=Analysis number 315546
Compound Code cc 01810
Book Reference 350/198/3
Project Code adrs
Chemist Name chrisr
##JCAMPDX= 6.0         $$ Bruker NMR JCAMP-DX V2.0
##DATA TYPE= NMR SPECTRUM
##DATA CLASS= NTUPLES
##ORIGIN= Bruker BioSpin GmbH
##OWNER= NMR
$$ XWIN-NMR		Version 3.5
$$ Wed Nov 23 12:13:43 2005 GMT Standard Time (UT+0h)  MAYBRIDGE\NMR@NMR_250MHZ
##.OBSERVE FREQUENCY= 250.131544655141
##.OBSERVE NUCLEUS= ^1H
##.ACQUISITION MODE= SIMULTANEOUS (DQD)
##.ACQUISITION SCHEME= undefined
##.AVERAGES= 16
##.DIGITISER RES= 18
##SPECTROMETER/DATA SYSTEM= dpx250
##.PULSE SEQUENCE= zg30
##.SOLVENT NAME= CDCl3
##.SHIFT REFERENCE= (INTERNAL, CDCl3, 0, 16.4487)
##AUDIT TRAIL= $$ (NUMBER, WHEN, WHO, WHERE, WHAT)
$$ ##TITLE= Audit trail, XWIN-NMR		Version 3.5
$$ ##JCAMPDX= 5.01
$$ ##ORIGIN= Bruker BioSpin GmbH
$$ ##OWNER= NMR
$$ C:\u/data/dgb/nmr/ADRS/12900/pdata/1/auditp.txt
$$ ##AUDIT TRAIL=  $$ (NUMBER, WHEN, WHO, WHERE, WHAT)
(   1,<2005-11-23 12:13:14.26 +000>,<MAYBRIDGE\NMR>,<NMR_250MHZ>,
      <created by zg, POWCHK disabled, PULCHK disabled
       configuration hash MD5:
       62 19 C7 07 E1 42 D1 B7 37 6C 3D D0 77 39 F9 E6
       data hash MD5: 64K
       B3 66 B0 2F BE 5B 45 C0 4D 8E 01 70 17 BE 5D 52>)
(   2,<2005-11-23 12:13:32.42 +000>,<MAYBRIDGE\NMR>,<NMR_250MHZ>,
      <Start of raw data processing
       ef LB = 0.3 FT_mod = 6 PKNL = 1 SI = 32K 
       data hash MD5: 32K
       49 D3 E0 EE C7 2A 8C 5E F5 B1 3B 92 19 7D 5D B6>)
(   3,<2005-11-23 12:13:34.35 +000>,<MAYBRIDGE\NMR>,<NMR_250MHZ>,
      <apk 
       data hash MD5: 32K
       AB EF 08 5F 58 10 56 E0 01 60 83 00 8A 51 6C 9A>)
(   4,<2005-11-23 12:13:35.09 +000>,<MAYBRIDGE\NMR>,<NMR_250MHZ>,
      <abs ABSG = 5 
       data hash MD5: 32K
       F1 E2 F5 B4 73 CB 78 3D E9 E7 49 78 00 C6 BF 5D>)
$$ ##END=
$$ 
$$ hash MD5
$$ AA 89 74 1B C5 7A FE 8B CA 12 97 5C BA BF 35 65
##$RELAX= 
##$RELAX= 
##$RELAX= 
##$RELAX= 
##$RELAX= 
##$RELAX= 
##$RELAX= 
$$ Bruker specific parameters
$$ --------------------------
##$DU= <C:\u>
##$EXPNO= 12900
##$NAME= <ADRS>
##$PROCNO= 1
##$TYPE= <nmr>
##$USER= <dgb>
##$AMP= (0..31)
100 100 100 100 100 100 100 100 100 100 100 100 100 100 100 100 100 100 
100 100 100 100 100 100 100 100 100 100 100 100 100 100 
##$AQSEQ= 0
##$AQ_mod= 3
##$AUNM= <au_zg>
##$AUTOPOS= <19 >
##$BF1= 250.13
##$BF2= 250.13
##$BF3= 250.13
##$BF4= 250.13
##$BF5= 500.13
##$BF6= 500.13
##$BF7= 500.13
##$BF8= 500.13
##$BYTORDA= 1
##$CFDGTYP= 0
##$CFRGTYP= 5
##$CHEMSTR= <none>
##$CNST= (0..31)
1 1 145 1 1 1 1 1 1 1 1 1 1 1 1 1 1 1 1 1 1 1 1 1 1 1 1 1 1 1 1 1 
##$CPDPRG= <>
##$CPDPRG1= <>
##$CPDPRG2= <>
##$CPDPRG3= <>
##$CPDPRG4= <mlev>
##$CPDPRG5= <mlev>
##$CPDPRG6= <mlev>
##$CPDPRG7= <mlev>
##$CPDPRG8= <mlev>
##$CPDPRGB= <>
##$CPDPRGT= <>
##$D= (0..31)
0 1 0 0 0 0 0 0 0 0.06 0 0 0 0 0 0 0.0002 0 0 0 0 0 0 0 0 0 0 0 0 0 0 
0 
##$DATE= 1132747991
##$DBL= (0..7)
120 120 120 120 120 120 120 120 
##$DBP= (0..7)
150 150 150 150 150 150 150 150 
##$DBP07= 0
##$DBPNAM0= <>
##$DBPNAM1= <>
$$ [...]
##$SUBNAM7= <"">
##$SUBNAM8= <"">
##$SUBNAM9= <"">
##$SW= 20.6930455092707
##$SWIBOX= (0..15)
0 0 3 0 0 0 0 0 0 0 0 0 0 0 0 0 
##$SW_h= 5175.983436853
##$TD= 65536
##$TD0= 1
##$TE= 294.16
##$TE2= 300
##$TE3= 300
##$TEG= 300
##$TL= (0..7)
0 120 120 120 120 120 120 120 
##$TP= (0..7)
150 150 150 150 150 150 150 150 
##$TP07= 0
##$TPNAME0= <>
##$TPNAME1= <>
##$TPNAME2= <>
##$TPNAME3= <>
##$TPNAME4= <>
##$TPNAME5= <>
##$TPNAME6= <>
##$TPNAME7= <>
##$TPOAL= (0..7)
0.5 0.5 0.5 0.5 0.5 0.5 0.5 0.5 
##$TPOFFS= (0..7)
0 0 0 0 0 0 0 0 
##$TUNHIN= 0
##$TUNHOUT= 0
##$TUNXOUT= 0
##$USERA1= <user>
##$USERA2= <user>
##$USERA3= <user>
##$USERA4= <user>
##$USERA5= <user>
##$V9= 5
##$VALIST= <valist>
##$VCLIST= <CCCCCCCCCCCCCCC>
##$VD= 0
##$VDLIST= <DDDDDDDDDDDDDDD>
##$VPLIST= <PPPPPPPPPPPPPPP>
##$VTLIST= <TTTTTTTTTTTTTTT>
##$WBST= 1024
##$WBSW= 4
##$XGAIN= (0..3)
0 0 0 0 
##$XL= 0
##$YL= 0
##$YMAX_a= 528229
##$YMIN_a= -427906
##$ZGOPTNS= <>
##$ZL1= 120
##$ZL2= 120
##$ZL3= 120
##$ZL4= 120
##$ABSF1= 16.44872
##$ABSF2= -4.244452
##$ABSG= 5
##$ABSL= 3
##$ALPHA= 0
##$AQORDER= 0
##$ASSFAC= 0
##$ASSFACI= 0
##$ASSFACX= 0
##$ASSWID= 0
##$AUNMP= <proc_1d>
##$AZFE= 0.1
##$AZFW= 0.1
##$BCFW= 0
##$BC_mod= 0
##$BYTORDP= 0
##$COROFFS= 0
##$CY= 12.5
##$DATMOD= 1
##$DC= 0
##$DFILT= <>
##$DTYPP= 0
##$F1P= 14.0000005364418
##$F2P= -0.99999901652339
##$FCOR= 0.5
##$FTSIZE= 32768
##$FT_mod= 6
##$GAMMA= 0
##$GB= 0
##$INTBC= 1
##$INTSCL= 1
##$ISEN= 128
##$LB= 0.3
##$LEV0= 0
##$LPBIN= 0
##$MAXI= 10000
##$MC2= 0
##$MEAN= 0
##$ME_mod= 0
##$MI= 0
##$NCOEF= 0
##$NC_proc= -3
##$NLEV= 6
##$NOISF1= 0
##$NOISF2= 0
##$NSP= 0
##$NTH_PI= 0
##$NZP= 0
##$OFFSET= 16.44872
##$PC= 1
##$PHC0= 85.07165
##$PHC1= 1.903916
##$PH_mod= 1
##$PKNL= yes
##$PPARMOD= 0
##$PSCAL= 4
##$PSIGN= 0
##$REVERSE= no
##$SF= 250.130018329395
##$SI= 32768
##$SIGF1= 0
##$SIGF2= 0
##$SINO= 400
##$SIOLD= 32768
##$SREGLST= <1H.CDCl3>
##$SSB= 0
##$STSI= 32768
##$STSR= 0
##$SW_p= 5175.98343685301
##$SYMM= 0
##$S_DEV= 0
##$TDeff= 65536
##$TDoff= 0
##$TI= <Analysis number 999999
Compound Code 99
Book Reference 9
Project Code 9>
##$TILT= no
##$TM1= 0
##$TM2= 0
##$TOPLEV= 0
##$USERP1= <user>
##$USERP2= <user>
##$USERP3= <user>
##$USERP4= <user>
##$USERP5= <user>
##$WDW= 1
##$XDIM= 32768
##$YMAX_p= 498678018
##$YMIN_p= -575047
$$ End of Bruker specific parameters
$$ ---------------------------------
##NTUPLES= NMR SPECTRUM
##VAR_NAME=  FREQUENCY,     SPECTRUM/REAL,   SPECTRUM/IMAG
##SYMBOL=    X,             R,               I
##VAR_TYPE=  INDEPENDENT,   DEPENDENT,       DEPENDENT
##VAR_FORM=  AFFN,          ASDF,            ASDF
##VAR_DIM=   32768,         32768,           32768
##UNITS=     HZ,            ARBITRARY UNITS, ARBITRARY UNITS
##FACTOR=    0.157963299565203, 1,           1
##FIRST=     4114.31886821797, 0,            0
##LAST=      -1061.66456863504, 0,           0
##MIN=       -1061.66456863504, -575047,     0
##MAX=       4114.31886821797, 498678018,    0
$$ Real data points
##PAGE= N=1
##DATA TABLE= (X++(R..R)), XYDATA
$$ [...]
##PAGE= N=2
##DATA TABLE= (X++(I..I)), XYDATA
22946 846890 845944 822802 812927 829117 837481 858503 856839 849088 841900 854212 889203 877875 892913
22933 892913 913967 891759 857408 850776 871787 859543 844384 850854 893144 894419 889980 898372
22921 898372 896148 895425 904633 881358 883172 850199 859039 891301 889628 895487 892378 894850 922695
22908 922695 911967 896040 869436 874401 869113 872769 880973 867937 818743 829751 864496 882450
22896 882450 875696 858750 853096 868769 863123 848415 842968 868742 889922 895342 897229 882758 891473
22883 891473 890467 905220 904289 890874 881959 876697 871838 870333 868387 905559 940902 945018 945806 930952
22869 930952 905436 872481 878319 889313 884789 878745 873191 876376 888148 893123 851601 827492 798970
22856 798970 774180 780997 818508 848228 837327 848103 890496 903540 868833 869849 883924 879668
22844 879668 889092 917962 916686 909535 918579 901046 886812 892572 872913 842657 866143 884271
22832 884271 923772 966352 963109 952034 937977 934986 931557 910809 904253 913453 894547 870919
22820 870919 842007 831668 835861 842930 830003 813016 832454 858692 881968 885427 868476 865006
22808 865006 882271 871566 877924 909381 910973 898616 902408 892723 882180 878648 881228 843679 837591
22795 837591 876010 865117 872482 900080 921575 914648 848263 841517 871822 873642 882509 865908
22783 865908 865204 854031 838387 861704 887746 866346 863301 880954 902991 890546 876820 893117
22771 893117 902903 881027 878062 873939 881926 861433 888261 909977 881690 857599 844039 868768
22759 868768 898691 866723 829398 829174 838459 856533 875035 903114 920139 929907 916959 921105
22747 921105 911741 903506 875803 886276 874633 888792 912078 873430 856434 890408 930222 912845
22735 912845 904897 894451 902354 878287 843222 823001 842737 850733 877079 881973 880049 883023 851500
22722 851500 836809 835725 861172 850539 860294 897593 902600 901075 877457 901553 912937 860496
22710 860496 867810 875732 856751 862439 850711 849714 878408 882953 866833 881137 881331 860502 864120
22697 864120 874719 869290 862362 906998 927975 920703 915066 912970 892427 905420 871527 838835
22685 838835 869033 910669 892226 868017 869125 877605 900181 919042 917600 909245 893943 901140
22673 901140 901285 889955 903140 903816 912543 931108 917997 898108 909921 904947 900329 897018 880853
22660 880853 887320 863831 847740 830764 846097 880432 903291 920069 916341 907781 917368 922825
22648 922825 896504 891702 888876 924172 944920 928004 917502 932117 921420 874888 860221 913176
22636 913176 939569 932621 945267 959273 970815 948450 925425 908565 905563 914602 928572 936697
22624 936697 924710 936987 948734 925829 943598 936470 915382 909417 907256 916374 910666 932095
22612 932095 914840 862407 860790 901625 934109 928149 905825 919895 906604 896937 891348 897156
22600 897156 910593 938012 948224 943721 992477 989609 940317 896722 900075 929324 935491 921848
22588 921848 943630 965622 952411 938002 912343 941168 953561 948056 952353 962306 959246 934386
22576 934386 930124 924452 930496 934192 912094 903133 901763 908218 900684 881477 911553 925154 896505
22563 896505 864040 862562 891129 891213 891356 901454 889348 870235 893187 941190 940423 923307 908406
22550 908406 930110 913907 900096 931979 938650 926139 917584 898910 893855 923148 942381 911245
22538 911245 901293 904228 905880 927748 928546 925374 918929 907702 892895 886040 872106 845524 864159
22525 864159 877316 894833 902588 912366 919934 916213 918557 927356 938528 910265 905615 912123 932422
22512 932422 949956 928606 932731 949342 960989 959350 946495 899439 888380 896188 919823 920420
22500 920420 901783 931161 952554 942516 930556 946123 941115 933048 919891 914356 925751 919645
22488 919645 896233 878789 857852 860781 881250 892309 905170 908737 898061 908683 917228 923360
22476 923360 937699 949474 928788 926353 924149 901831 895717 915848 947483 950311 940268 955771
22464 955771 973729 976087 930377 921747 919071 914824 933293 925007 902291 879950 890977 927448
22452 927448 937760 929889 929437 942213 956586 980619 986670 981999 961305 926922 929708 942529 979704
22439 979704 955609 923231 915782 895707 879592 865744 858805 849200 888190 927579 929378 967127
22427 967127 979379 966940 950832 952859 927148 905745 910034 946042 945017 908671 913269 928868
22415 928868 935058 925500 903162 912924 917053 940498 937087 948473 947603 940809 918303 921207 916760
22402 916760 897091 889848 890786 868571 894170 900787 916101 911465 941245 947585 955774 955464 965243
22389 965243 955735 913390 903076 905383 913669 916676 908568 913823 906801 918668 920345 898508 918340
22376 918340 920088 905378 901163 888941 889108 917274 949885 956319 933585 940293 919606 897185 920758
22363 920758 928528 931952 914389 904643 923576 932815 934284 938137 959508 981583 972147 968780 931982
22350 931982 906141 889801 885333 921219 941603 939274 938276 933493 923824 920531 904134 917829 914537
22337 914537 926327 939171 974148 1002130 976892 946886 918848 938797 933724 952107 962766 958508
22325 958508 915849 913233 937280 939397 928462 936084 968324 1011673 997819 974169 975844 959269
22313 959269 971234 978013 980356 981259 966704 935130 964714 963302 935611 934797 895901 887638 911896
22300 911896 906781 903007 910455 938998 937011 938930 936828 908520 896767 904979 912603 931907 950448
22287 950448 970475 971821 989947 992242 995361 989342 995331 999923 1003898 987002 983122 992757 1016365
22274 1016365 995385 999928 1014666 1023661 1027872 995993 967469 968738 968449 964000 967293 971010 978581
22261 978581 975550 974995 956066 943412 978540 971618 928358 912911 936019 961617 957261 975592
22249 975592 974561 983422 1010877 1008725 1013798 977419 945693 908697 913412 934835 973875 977213 986214
22236 986214 966199 967783 947415 961018 960032 973765 977930 959528 943811 926370 944961 937348
22224 937348 924564 922157 933529 933837 917456 907819 917351 931424 931445 945168 968556 973183 955732
22211 955732 967962 962153 954914 975008 975234 949757 947526 944462 964389 989603 1023646 989989 944344
22198 944344 947268 975273 980840 979819 997273 987896 987119 1016464 1023717 996481 981618 983965 950808
22185 950808 946796 966435 948472 950215 971497 961859 954741 958922 968700 957109 950861 950288 940475
22172 940475 955334 954377 947303 958632 981586 976059 973382 980103 969590 962799 971084 961061 967733
22159 967733 980234 1017326 1003187 995698 981003 979328 973593 957701 941754 941992 938922 941462 933813
22146 933813 953094 951486 937043 960186 949084 907842 913745 947883 974703 1003434 1023151 1036169
22134 1036169 1019972 999449 987836 966695 997960 1035496 1019204 1006541 1006969 992385 985357 1016631
22122 1016631 1029762 1004933 991601 980492 1005277 995528 973740 957867 968994 990582 1001587
22111 1001587 968845 972427 985637 981040 991959 972158 951503 944382 922340 925136 931378 926076
22099 926076 957882 974716 981776 993482 987553 970298 970058 968713 954486 946759 918915 921169 934999
22086 934999 1001091 1046335 1052298 1060413 1047436 1020057 988750 959166 965697 1000826 1002675 995679
22074 995679 1009100 1049748 1029110 995496 997632 998570 1008450 1026893 1013193 987176 973077 993512
22062 993512 1028920 1023609 1013446 1001160 1005861 1002528 1003276 998726 1016977 1005665 990863 989443 980277
22049 980277 982412 1017873 1028630 1022378 978576 956677 959641 966628 971722 977598 954708 948329 959091
22036 959091 937444 945525 966001 946020 936953 956862 986497 1009003 990736 953761 941083 949262
22024 949262 978592 984774 990200 977973 970763 988005 979858 947790 973675 1002560 994412 997190 985476
22011 985476 977732 997275 1000989 960887 938837 976704 986364 980444 1002024 1009026 1003278 982469 989984
21998 989984 1020424 1017748 1008523 999114 974247 963787 950602 979713 998971 1018172 1018107 1025284 1051868
21985 1051868 1053424 1025172 994549 1004241 1020917 1036387 1024275 1007798 994618 997250 1003422 985962
21973 985962 1010726 1001815 1019017 1033288 1013305 987878 1006209 1022162 1047211 1060828 1055386 1054779
21961 1054779 1052192 1026305 995689 1005216 1048493 1048233 1017575 1030152 1062577 1063515 1053776 1034204 1025693
21948 1025693 1020351 1022004 1021505 1007855 996921 984854 1003648 976963 976571 1013594 1033339 1028548 1020193
21935 1020193 1004076 1035863 1049982 1025181 1005848 1024235 1022154 1043265 1046106 1024746 1038841 1056371
21923 1056371 1038083 997029 955557 940377 951989 978314 976976 1013861 1023077 1068741 1045961 1033569
21911 1033569 1038471 1042419 1034047 1047795 1058677 1050901 1021752 1015001 1015342 1024400 1048813 1043865 1027498
21898 1027498 1039719 1044827 1028607 1010644 1017514 995071 942272 954790 1011209 1019810 1018644 1019672
21886 1019672 1020007 998217 1003111 988145 1012661 1002556 976551 1004906 1028104 1001129 999172 1011231
21874 1011231 1008549 1016527 999779 992080 971461 981283 1015728 1073854 1070205 1059964 1065435 1041051
21862 1041051 1022956 997143 995989 992643 1007813 1008795 1006200 1004436 1034489 1027905 1019245 1003178 1001158
21849 1001158 1003586 1013948 1006154 995135 1013046 1021215 1038323 1051167 1023807 1005087 1020977 1047728
21837 1047728 1061400 1064824 1085682 1064783 1034739 1032362 1045012 1074154 1088768 1098074 1075109 1064576
21825 1064576 1050783 1035570 1036623 1031526 1049245 1061357 1081104 1066859 1023051 1010723 1042905 1037878
21813 1037878 1019456 1043319 1061369 1063944 1071497 1067649 1071948 1078638 1074331 1087815 1097716 1115213 1113844
21800 1113844 1139143 1127816 1109720 1075451 1058689 1079539 1079635 1058236 1056005 1064001 1040575 1006676
21788 1006676 1021843 1056714 1069306 1092641 1099942 1086617 1062178 1031291 1032732 1057223 1051273 1049769
21776 1049769 1047436 1044328 1028608 1014265 1047779 1077229 1077553 1078867 1075547 1053205 1054585 1087802 1086100
21763 1086100 1055043 1036470 1032549 1046251 1047421 1010872 980122 973914 993455 1012960 1020894 1056433
21751 1056433 1081318 1062629 1056749 1099513 1097622 1069516 1072879 1072524 1069955 1079344 1084629 1068322 1067359
21738 1067359 1057252 1049839 1061533 1078554 1092547 1078608 1055042 993540 1003567 1039442 1067487
21727 1067487 1049913 1046148 1053853 1048733 1065600 1085672 1086098 1082131 1068717 1056262 1051301 1046670 1063579
21714 1063579 1061411 1059919 1063351 1029072 1026473 1021026 1027842 1046065 1084224 1071624 1057646 1066774 1090167
21701 1090167 1078294 1053858 1062828 1071562 1047940 1064323 1074881 1074603 1068060 1065944 1066937 1059670 1053152
21688 1053152 1021156 1018739 1042246 1039317 1071331 1090039 1068575 1049014 1059382 1102050 1088713 1070692
21676 1070692 1058179 1040361 1017007 1042569 1059647 1066282 1053316 1065459 1095831 1072795 1062106
21665 1062106 1080600 1092759 1069529 1067084 1056237 1054685 1077568 1090990 1070827 1092489 1099879 1090873
21653 1090873 1074588 1071415 1097830 1115298 1103341 1116676 1096587 1054683 1045199 1061936 1062015 1055837
21641 1055837 1041130 1071224 1095275 1063296 1045389 1053008 1042694 1054686 1033234 1038276 1064357 1062265
21629 1062265 1066591 1068085 1058453 1083697 1095527 1084971 1071572 1044762 1041974 1038809 1017663 1042624
21617 1042624 1079944 1094600 1101324 1091893 1091699 1087658 1071028 1068436 1077261 1085948 1090643 1079072 1068742
21604 1068742 1082214 1076007 1063432 1071934 1063707 1060223 1053744 1072309 1093848 1071499 1040711 1071801
21592 1071801 1110450 1122750 1115488 1085978 1101279 1105223 1077251 1087776 1100021 1101975 1119731 1127603
21580 1127603 1096817 1071801 1055687 1075955 1096190 1100720 1105939 1111852 1097303 1102003 1091960 1091719
21568 1091719 1102865 1094396 1092751 1081416 1087395 1121884 1132674 1134825 1145050 1122829 1094459 1065951
21556 1065951 1074753 1085088 1078629 1071512 1063047 1055722 1062524 1062418 1053445 1054443 1075639 1078216 1073369 1077931
21542 1077931 1122260 1111636 1079417 1070571 1081765 1069749 1079264 1126233 1119232 1110697 1141731 1147709
21530 1147709 1143223 1115644 1074701 1093129 1141846 1139132 1113418 1076912 1068902 1099134 1117327 1136088
21518 1136088 1154287 1175029 1188722 1179838 1148478 1141329 1132240 1137668 1129941 1115033 1090771 1092356
21506 1092356 1099956 1084333 1091359 1087005 1100186 1110082 1117145 1106576 1087678 1110426 1099329 1097144
21494 1097144 1121755 1135577 1141807 1183174 1165008 1112712 1082874 1087197 1116212 1116282 1095941 1083269
21482 1083269 1085164 1096039 1105996 1117019 1115120 1105334 1096886 1103560 1111177 1099384 1102753 1098572 1084360
21469 1084360 1100350 1125349 1116680 1111931 1088844 1061815 1058136 1062321 1075777 1071282 1074945 1115475
21457 1115475 1124209 1110027 1136249 1142877 1135659 1151223 1159640 1151038 1127288 1133358 1137774 1122853 1129222
21444 1129222 1128400 1166036 1156210 1113172 1122503 1110834 1101720 1113564 1129754 1102398 1081657 1100009
21432 1100009 1135486 1161496 1133996 1089803 1084267 1088306 1110307 1106837 1107844 1103820 1120757 1154717
21420 1154717 1152072 1149775 1142226 1111645 1093725 1105591 1096356 1106139 1102167 1109764 1101979 1101572 1099053
21407 1099053 1143512 1152310 1136997 1135784 1122559 1116005 1138204 1130687 1108063 1118815 1132536 1141960
21395 1141960 1167875 1174237 1144291 1128976 1131292 1145207 1140011 1135216 1139939 1156564 1124792 1111406
21383 1111406 1079715 1053718 1090434 1100712 1108247 1135311 1123894 1104382 1118054 1130933 1169118
21372 1169118 1170788 1152305 1145101 1144756 1138131 1145116 1131919 1111741 1103926 1116236 1112721 1100710 1113017
21359 1113017 1144060 1148454 1121515 1096298 1098588 1137086 1159399 1154972 1147427 1161142 1163410 1158506
21347 1158506 1138484 1139076 1125923 1149108 1148894 1162694 1210799 1218084 1182834 1156624 1154111 1176284
21335 1176284 1186970 1202848 1215189 1198786 1161435 1147941 1129252 1139293 1142385 1142616 1154738 1184981
21323 1184981 1168314 1166035 1158206 1163832 1139809 1137444 1157342 1149100 1153258 1136891 1135687 1160281 1150603
21310 1150603 1142324 1149988 1166614 1137325 1093491 1115305 1174102 1157561 1121359 1128933 1170139 1190850
21298 1190850 1159895 1147012 1149136 1149011 1119973 1085995 1082163 1086313 1097113 1080666 1079819 1120201 1165360
21285 1165360 1177538 1167857 1168116 1160630 1157001 1142414 1149390 1146587 1168687 1183726 1199523 1209734 1223433
21272 1223433 1227118 1211488 1188794 1195566 1173224 1163547 1140598 1146124 1178122 1189809 1193205 1215057
21260 1215057 1191327 1174706 1155378 1159023 1164251 1150836 1155865 1147965 1152447 1175800 1163546 1136810
21248 1136810 1146687 1182722 1193174 1198814 1218159 1215440 1191465 1191693 1172820 1162627 1191604 1197095
21236 1197095 1194758 1183464 1167818 1159470 1157172 1179250 1187743 1155937 1122254 1115015 1146144 1154772
21224 1154772 1160572 1176873 1174009 1198109 1209236 1180022 1194027 1204533 1200485 1199041 1221528 1218831
21212 1218831 1187746 1171676 1155611 1182072 1203026 1226904 1218335 1182792 1181905 1192982 1235306 1214639
21200 1214639 1179626 1179555 1177999 1184921 1183296 1165979 1157700 1160256 1182696 1205893 1223627 1235903 1203931
21187 1203931 1180788 1161182 1149433 1135899 1139485 1152965 1171567 1165129 1168406 1134982 1164003 1192922
21175 1192922 1162749 1145870 1147591 1165052 1186567 1172581 1178190 1199188 1173769 1168248 1195923 1211723
21163 1211723 1186357 1195445 1172329 1137996 1143892 1179412 1174047 1146013 1139786 1172635 1208948 1235457
21151 1235457 1209289 1204490 1224455 1210928 1187278 1177708 1191896 1202735 1211918 1192493 1201112 1216017
21139 1216017 1220258 1210647 1231710 1232173 1194016 1190368 1208047 1211892 1231477 1237215 1204210 1199589 1193074
21126 1193074 1186452 1216510 1212906 1205402 1197473 1162015 1159852 1169715 1203383 1239066 1237066 1219262 1222325
21113 1222325 1176397 1165582 1177911 1199216 1180069 1173277 1189855 1208197 1216353 1203240 1172534 1208675
21101 1208675 1241179 1235883 1216591 1200928 1216437 1241791 1234050 1232718 1248974 1238011 1199240 1163281
21089 1163281 1155749 1164790 1142995 1157309 1160479 1156193 1167385 1191750 1219743 1238432 1247717 1244640
21077 1244640 1237761 1230439 1192284 1188439 1219677 1224642 1205411 1178125 1127870 1143054 1158382 1156272
21065 1156272 1166971 1180275 1168496 1175430 1173444 1178848 1226216 1227064 1203912 1202098 1203309 1228539 1232143
21052 1232143 1196975 1185186 1184704 1199066 1208636 1178553 1199713 1219299 1189209 1172938 1178863 1163097
21040 1163097 1171210 1203623 1210119 1226701 1228176 1241582 1240768 1267582 1281115 1263318 1266264 1237448
21028 1237448 1251901 1261349 1219410 1203824 1230675 1273064 1258974 1226955 1188466 1191221 1193024 1185205
21016 1185205 1213971 1226882 1232281 1246073 1258122 1273871 1257862 1235934 1258634 1258652 1225100 1185038
21004 1185038 1203448 1209303 1201670 1200041 1203763 1197760 1214343 1247374 1248997 1227360 1213609 1229641
20992 1229641 1265918 1279992 1258663 1258276 1261378 1251613 1258729 1277439 1281439 1291532 1275167 1283947 1289389
20979 1289389 1265119 1268782 1246142 1265294 1268373 1251539 1244150 1244736 1235138 1224585 1216314 1218381 1233417
20966 1233417 1245164 1236399 1250878 1260465 1254232 1267484 1236873 1225867 1223386 1240777 1272708 1280221
20954 1280221 1280792 1283169 1284839 1270838 1262200 1261622 1252439 1232738 1221979 1243845 1273920 1320882 1325606
20941 1325606 1315893 1307353 1290565 1286225 1289154 1256550 1228569 1244956 1290040 1285183 1266927 1298975
20929 1298975 1317344 1317878 1295742 1268295 1266851 1262803 1259863 1291074 1304303 1291913 1273794 1270764
20917 1270764 1252084 1217247 1213443 1196426 1221146 1268628 1249639 1228493 1218337 1226748 1229951 1254346
20905 1254346 1258741 1238458 1254721 1263669 1252672 1247394 1237647 1228382 1194820 1179943 1213708 1253527
20893 1253527 1245844 1236333 1243685 1270721 1294239 1298201 1302019 1290309 1271856 1282914 1324193 1352224
20881 1352224 1367908 1321508 1271049 1271307 1271065 1261519 1262427 1245271 1262038 1300156 1347590 1356281 1341542
20868 1341542 1321934 1315318 1314005 1323946 1322852 1323868 1302516 1278980 1276534 1273555 1267210 1237370 1221423
20855 1221423 1237958 1259456 1254707 1269356 1288060 1254297 1250895 1268351 1245473 1284457 1325855 1324250
20843 1324250 1306757 1285091 1276930 1286597 1275386 1286963 1315451 1290262 1285949 1307546 1315629 1300422
20831 1300422 1276152 1284810 1272729 1246095 1247297 1267580 1291412 1288715 1280630 1301301 1272059 1283838
20819 1283838 1321243 1289158 1311582 1328053 1297672 1269852 1301245 1335598 1360490 1341899 1308208
20808 1308208 1331920 1337320 1296504 1282169 1284502 1291481 1302616 1308938 1305790 1284212 1290808 1280466
20796 1280466 1274563 1293471 1321294 1279228 1273402 1291502 1299944 1270778 1257708 1253256 1282588 1306989
20784 1306989 1307182 1318393 1302292 1294313 1294106 1267533 1270163 1305434 1323705 1307241 1296798 1302279 1281022
20771 1281022 1287752 1310579 1342937 1352677 1344128 1350141 1315170 1323922 1340406 1319197 1312275 1302692 1290891
20758 1290891 1292269 1278478 1262661 1303376 1329418 1342010 1338393 1318473 1306191 1301717 1307381 1332089
20746 1332089 1335591 1334431 1343042 1332539 1328857 1317999 1288845 1298489 1313119 1304620 1292358 1316639
20734 1316639 1345486 1341142 1331118 1348328 1334285 1308181 1296840 1294777 1305476 1301843 1286543 1269730
20722 1269730 1290582 1310316 1325990 1335835 1320038 1330322 1362109 1377959 1376069 1373064 1350754 1373635
20710 1373635 1387314 1380446 1380714 1335723 1293021 1312487 1363103 1364623 1355804 1374312 1376673 1341604
20698 1341604 1347642 1338217 1332320 1346005 1369769 1360679 1343574 1340139 1360163 1336473 1321329 1311589
20686 1311589 1310326 1292749 1287789 1316928 1358504 1355636 1311576 1316889 1335324 1322937 1306774 1295897
20674 1295897 1271662 1302463 1330396 1332229 1323381 1301245 1294738 1293556 1312263 1358238 1334534 1335507
20662 1335507 1340724 1323523 1306498 1306116 1291589 1298033 1361088 1369565 1364444 1363942 1344110 1331498 1315734
20649 1315734 1296381 1315272 1338496 1352156 1358258 1347684 1381871 1372152 1336372 1357974 1387140 1403857
20637 1403857 1420753 1401324 1382151 1358603 1343493 1325744 1335844 1339890 1327674 1358398 1372175
20626 1372175 1370094 1351635 1353988 1368942 1394650 1407922 1375324 1335001 1358447 1374794 1385426 1354210
20614 1354210 1341897 1345908 1351636 1367075 1359718 1343520 1339547 1343498 1345255 1357849 1361319 1357396 1327267
20601 1327267 1307817 1313261 1358791 1379599 1377911 1390420 1370346 1388935 1390419 1393410 1378560 1387366
20589 1387366 1403419 1373517 1345829 1362072 1367662 1387598 1351881 1354771 1377261 1381613 1357873 1387757
20577 1387757 1387082 1363639 1359581 1368692 1359814 1357201 1351940 1355459 1366813 1368656 1387767 1376053 1351700
20564 1351700 1367016 1378610 1399897 1391886 1396306 1412278 1394647 1351031 1346692 1375926 1388622 1379186
20552 1379186 1372190 1368446 1362768 1374688 1369225 1394395 1407404 1392597 1398646 1397924 1375345 1352878 1366454
20539 1366454 1389219 1404529 1410351 1424641 1429508 1414847 1405508 1374636 1342617 1345436 1359765 1382851
20527 1382851 1371328 1368630 1374787 1383082 1374266 1364580 1345825 1365372 1385069 1388041 1380209 1382969 1405577
20514 1405577 1407470 1415801 1416814 1413238 1439179 1440629 1427889 1420861 1413574 1372968 1381850 1394326 1383398
20501 1383398 1389367 1381765 1385462 1402973 1412516 1398541 1382985 1402740 1404016 1400082 1425481 1471194
20489 1471194 1435422 1401816 1390031 1382317 1368594 1378728 1392712 1412414 1374508 1361464 1380241
20478 1380241 1385120 1415406 1451160 1449609 1426729 1423138 1402453 1404592 1437737 1443268 1401511 1400987 1392106
20465 1392106 1386006 1390574 1385255 1404331 1441326 1418921 1430586 1452964 1482460 1474755 1430666 1398856
20453 1398856 1387928 1397491 1404582 1411450 1415950 1382836 1367084 1356416 1342023 1368125 1377441 1370444
20441 1370444 1339864 1354002 1390260 1433648 1426642 1430920 1426939 1425595 1423993 1414874 1424108 1410152 1414375
20428 1414375 1421757 1434244 1432276 1442958 1425964 1430676 1459587 1497710 1498976 1473052 1463687 1463478 1455997
20415 1455997 1444455 1421359 1421503 1414692 1419425 1437653 1468749 1439300 1388582 1404287 1424077 1444428
20403 1444428 1484821 1478507 1471204 1455662 1438942 1420782 1407696 1432560 1470549 1490599 1477818 1458992
20391 1458992 1501906 1502017 1479858 1494624 1514245 1489482 1494497 1487934 1497823 1528597 1529399 1474241 1440997
20378 1440997 1465284 1458945 1451658 1503124 1551792 1561403 1546466 1538279 1514448 1472915 1448635 1499956
20366 1499956 1511613 1478924 1455757 1439508 1447026 1439215 1458727 1462312 1448404 1464707 1496525 1521523
20354 1521523 1516417 1512850 1486663 1462701 1482634 1500390 1489863 1494681 1494195 1498893 1496005 1486583 1483771
20341 1483771 1474509 1457666 1441854 1435583 1450601 1460545 1479930 1489297 1492648 1496381 1487760 1477576 1482418
20328 1482418 1487765 1463658 1447580 1443422 1431950 1438927 1439044 1435814 1425427 1446867 1452336 1451940 1447745
20315 1447745 1490263 1480675 1447457 1443188 1466150 1480801 1493976 1493240 1498339 1511106 1546026 1530906
20303 1530906 1513960 1523432 1523654 1515138 1519348 1482660 1451610 1460927 1473353 1491251 1516352 1514317 1494615
20290 1494615 1513458 1528401 1523863 1523508 1513103 1497411 1477539 1464364 1501263 1539093 1533697 1502188
20278 1502188 1495800 1502888 1519198 1530974 1529801 1515499 1516353 1544306 1514844 1532420 1532099 1502126 1496199
20265 1496199 1473741 1495108 1481317 1461632 1461847 1469899 1482245 1490887 1494912 1485415 1474897 1459144
20253 1459144 1448814 1470358 1498970 1509752 1494830 1501030 1485372 1487683 1501314 1502222 1481475 1478729
20241 1478729 1496196 1525814 1536052 1515899 1499550 1483851 1476682 1469427 1459143 1471714 1498244 1493574
20229 1493574 1501611 1510402 1552024 1564986 1539512 1505846 1500577 1523974 1500244 1466024 1452125 1475035
20217 1475035 1528705 1561522 1560920 1572094 1552986 1547206 1534157 1569325 1574066 1560377 1556097 1548279
20205 1548279 1563778 1557497 1555746 1546250 1550676 1568797 1558133 1547032 1567814 1593010 1588362 1569942
20193 1569942 1551527 1561793 1547072 1535267 1504287 1545678 1599613 1590260 1569083 1544582 1513611
20182 1513611 1492212 1511543 1557430 1570718 1529917 1474991 1451548 1440590 1464602 1498489 1524973
20171 1524973 1557423 1577075 1589324 1563477 1534319 1531986 1553958 1557955 1539437 1562019 1591135 1557902
20159 1557902 1532524 1552483 1567779 1554192 1548987 1549438 1554666 1548171 1528053 1521799 1512365 1511548 1534914
20146 1534914 1545726 1552394 1548687 1549985 1562433 1560279 1579420 1567233 1554163 1582986 1593993 1580233
20134 1580233 1543360 1516245 1503297 1531117 1558886 1579761 1599398 1623337 1596360 1560137 1579584
20123 1579584 1592770 1572496 1552281 1568309 1587541 1599939 1615003 1627251 1622650 1604945 1601595 1605812
20111 1605812 1623974 1601226 1587770 1576710 1552738 1510056 1515917 1525175 1546040 1531038 1538845 1576600
20099 1576600 1603431 1621326 1604311 1596826 1595128 1606116 1604315 1576470 1557263 1566800 1585659 1587129
20087 1587129 1571064 1578157 1589510 1603956 1625948 1633805 1635278 1586756 1577167 1609724 1629755 1622717
20075 1622717 1629687 1614335 1571840 1575359 1611009 1644094 1637108 1641891 1596941 1580910 1597440 1602269
20063 1602269 1595807 1597844 1588658 1599164 1625250 1631808 1642316 1638139 1614199 1610310 1598719 1569348
20051 1569348 1571055 1596509 1615922 1634229 1634977 1607188 1623799 1618291 1596840 1591927 1585848 1610954
20039 1610954 1601098 1594062 1614900 1628785 1625971 1606635 1615967 1624343 1607269 1593637 1623010 1604300
20027 1604300 1624281 1598054 1578014 1613455 1641125 1650779 1663404 1656760 1660521 1631156 1603919 1611812
20015 1611812 1622302 1631236 1634267 1589352 1575579 1578379 1576245 1590410 1605087 1627007 1599098 1583878
20003 1583878 1614118 1621059 1625433 1624814 1604413 1609913 1622001 1618635 1616247 1595195 1604443 1613863 1652150
19990 1652150 1637806 1656870 1670404 1696336 1684425 1684753 1673432 1652447 1644779 1649747 1676076 1686902
19978 1686902 1667930 1636231 1660280 1674334 1659431 1653925 1656834 1624973 1610639 1615491 1611104 1588511
19966 1588511 1600616 1615378 1609507 1601711 1620390 1619123 1642409 1657099 1610676 1602889 1601207 1603524
19954 1603524 1600776 1602865 1618980 1634246 1657689 1672433 1680814 1660639 1677067 1712263 1714557 1703306
19942 1703306 1717447 1712670 1670171 1650310 1673914 1656618 1664224 1690822 1692760 1677913 1662421 1642822
19930 1642822 1628687 1606403 1634519 1675925 1674433 1646934 1631229 1630536 1620518 1645114 1678255 1651338
19918 1651338 1672181 1685721 1701517 1689845 1671874 1665083 1667206 1645849 1660695 1662415 1660091 1651662
19906 1651662 1669350 1690684 1709688 1697226 1680919 1675583 1670790 1671636 1705710 1758654 1780096 1764054
19894 1764054 1740982 1705487 1677653 1676456 1696075 1705213 1701999 1702865 1703813 1715485 1733260 1740541 1734200
19881 1734200 1703716 1683810 1687893 1693139 1661691 1632359 1642787 1633410 1626138 1656018 1665508 1665924 1661153
19868 1661153 1696491 1724246 1731442 1721544 1691302 1681387 1687462 1689620 1687407 1704568 1734101 1758616
19856 1758616 1752283 1718013 1694811 1708753 1702420 1716831 1749460 1782920 1760701 1740914 1750945 1752748
19844 1752748 1753642 1726117 1756085 1794623 1789792 1786668 1757020 1741078 1749449 1732680 1716789 1724277
19832 1724277 1706038 1704526 1703021 1702276 1716717 1741942 1702598 1691924 1712296 1737018 1757346 1744490
19820 1744490 1724106 1741332 1757099 1759453 1714828 1701838 1719299 1740831 1765573 1761926 1723140 1713105
19808 1713105 1711088 1710089 1715833 1714625 1718351 1755323 1759628 1762499 1792468 1797207 1787028 1778360 1768189
19795 1768189 1767482 1762623 1769605 1797126 1806394 1796937 1793287 1798938 1805347 1783377 1763416 1767057 1770735
19782 1770735 1767788 1760043 1766510 1760551 1779113 1792248 1788376 1779894 1789497 1767789 1773815 1790756 1775488
19769 1775488 1756175 1734258 1725903 1747318 1772616 1792331 1772487 1780864 1799261 1817359 1805651 1798983
19757 1798983 1786976 1763689 1767443 1781079 1805934 1818091 1839851 1825836 1813452 1818828 1834298 1828410
19745 1828410 1852463 1837792 1827945 1796225 1771577 1788527 1802688 1796145 1780549 1765480 1781840 1768172
19733 1768172 1764844 1777128 1798988 1814389 1814128 1827410 1854652 1842967 1843488 1843924 1842181 1829734 1805859
19720 1805859 1809336 1841024 1837083 1830516 1785072 1755449 1768996 1791898 1789342 1818155 1839990 1836948
19708 1836948 1834241 1840877 1826585 1809525 1816118 1814186 1815810 1784812 1775971 1809258 1830245 1810106
19696 1810106 1803280 1831733 1843765 1855561 1855734 1845889 1848421 1860113 1837273 1840936 1860681 1886908
19684 1886908 1881869 1851304 1858238 1872457 1890965 1884095 1877646 1877988 1899272 1870355 1860414 1878651 1871584
19671 1871584 1877089 1836850 1847713 1850056 1855364 1883318 1907282 1907990 1911496 1861894 1821471 1792345
19659 1792345 1814569 1841311 1841525 1840020 1824796 1828855 1830608 1849993 1844394 1827368 1831307 1840578 1866770
19646 1866770 1882487 1894815 1880653 1893601 1895214 1886421 1862956 1854357 1879173 1879623 1845064 1850931
19634 1850931 1840217 1849595 1857071 1849855 1869312 1876316 1865064 1859203 1865617 1886926 1871822 1871148 1879737
19621 1879737 1870567 1847112 1836084 1868033 1873704 1847811 1860724 1881016 1887887 1889920 1873913 1850829
19609 1850829 1837130 1854011 1891500 1849981 1835526 1844065 1837280 1866191 1906347 1926751 1889717 1867596
19597 1867596 1909647 1904515 1893633 1873607 1889755 1884232 1884402 1903417 1908079 1911609 1920365 1889520 1881547
19584 1881547 1872659 1888357 1897163 1906351 1895724 1904425 1916043 1932634 1933827 1925258 1929108 1943196 1967465
19571 1967465 1959369 1925744 1924185 1917886 1931082 1930054 1911715 1893947 1889122 1902745 1872770 1873458 1887462
19558 1887462 1896617 1910615 1918112 1933429 1940454 1934220 1939962 1939742 1942949 1957330 1964723 1947912 1959801
19545 1959801 1989729 2004467 2011598 1988222 1968384 1950268 1940634 1936457 1927161 1929534 1950441 1950240 1928571
19532 1928571 1897623 1889868 1878059 1919724 1954187 1958829 1955977 1969262 1994918 2005481 1995157 1971283
19520 1971283 1925985 1942743 1946006 1927714 1924737 1924472 1958104 1973776 1971148 1972818 1967323 1988179 2000723
19507 2000723 2014113 2026867 2023158 1991214 1969999 1969746 1991179 1988634 2000700 1967051 1940568 1948834
19495 1948834 1966829 1974844 1962065 1996529 1982736 2006300 2009199 1971691 1947693 1952921 1943622 1934421
19483 1934421 1945060 1934921 1954045 1978836 2004376 2006520 1998526 1999624 2024477 2044302 2026189 2024023
19471 2024023 2030800 2035321 2016176 2000181 2011927 2035974 2047022 2035026 2026786 2007068 2003389 1989177
19459 1989177 1990767 1992604 2008361 2035641 2054342 2087867 2092948 2076832 2043231 2037279 2034480 2031513
19447 2031513 2046431 2079721 2087005 2086428 2069405 2076879 2055976 2028554 2046147 2060051 2081197 2080105
19435 2080105 2057367 2073806 2041398 2021966 2008267 2015751 2033854 2018945 2052849 2052576 2063539 2065371
19423 2065371 2075022 2076496 2086452 2060302 2060285 2075143 2039960 2010181 2015789 2010641 2001327 2003978 2025632
19410 2025632 2050032 2061209 2093291 2094883 2091004 2066372 2059354 2051078 2071981 2066119 2065776 2072423 2081698
19397 2081698 2065015 2075968 2094593 2083996 2083583 2065091 2066113 2065730 2061206 2065098 2078894 2094044 2100674
19384 2100674 2065361 2056850 2079269 2079986 2081546 2085348 2076430 2064107 2070094 2066122 2073326 2076998 2074415
19371 2074415 2060885 2086242 2112967 2091522 2079483 2094293 2095035 2078529 2075340 2119541 2136950 2122488
19359 2122488 2105289 2098352 2098244 2090192 2068437 2088539 2111113 2099286 2100065 2112865 2117981 2102843 2119805
19346 2119805 2113284 2101157 2110894 2091506 2089769 2090769 2083157 2063751 2047394 2034528 2046123 2097765
19334 2097765 2119285 2136875 2157518 2125378 2094117 2105482 2130474 2139680 2118348 2112232 2127082 2141606
19322 2141606 2127134 2125334 2147094 2173552 2183925 2192804 2182516 2182601 2177263 2163352 2167159 2170355 2171787
19309 2171787 2162756 2160060 2193634 2200982 2187277 2186753 2164267 2174683 2175772 2178048 2152703 2140623 2146329
19296 2146329 2169202 2153634 2149223 2126797 2145386 2165899 2164163 2168954 2165503 2143077 2149940 2169104
19284 2169104 2185934 2203912 2196509 2181054 2213240 2206172 2188429 2180707 2189178 2162660 2150703 2164937
19272 2164937 2183732 2189044 2188497 2164942 2140518 2124141 2130805 2122218 2127122 2139811 2190092 2221354
19260 2221354 2219521 2233914 2227052 2232690 2225082 2232908 2252096 2216762 2215187 2207650 2196151 2210523 2230800
19247 2230800 2236891 2250667 2256021 2240005 2206660 2204334 2203893 2219602 2247800 2255240 2235086 2223862
19235 2223862 2238742 2231339 2232529 2220946 2222249 2222387 2170842 2165502 2208542 2201268 2211230 2210589 2225993
19222 2225993 2252480 2275659 2282014 2314656 2291616 2246545 2226728 2247473 2263585 2301265 2303909 2299962
19210 2299962 2301227 2312843 2325199 2305551 2288033 2290300 2275729 2268162 2272972 2276831 2281897 2280815 2274006
19197 2274006 2260961 2273443 2305653 2297900 2296049 2290081 2261845 2243003 2244310 2294548 2301399 2329814
19185 2329814 2388080 2362096 2340885 2358622 2352830 2344835 2317353 2293288 2313786 2292638 2287698 2314203
19173 2314203 2317729 2330024 2332954 2318481 2290948 2306350 2341019 2345008 2352717 2360848 2328240 2323084
19161 2323084 2294178 2305205 2303119 2329634 2341787 2384199 2375821 2347534 2366912 2348873 2310951 2309798
19149 2309798 2308841 2343346 2335197 2326311 2327589 2317896 2336973 2357877 2356786 2351276 2356361 2373461 2398251
19136 2398251 2408288 2369984 2360341 2402334 2392664 2355062 2328456 2326607 2315105 2297403 2311209 2353001
19124 2353001 2384076 2423738 2459263 2420642 2404285 2409630 2400386 2400494 2423614 2428249 2444257 2444747 2446109
19111 2446109 2434836 2408872 2382779 2364613 2391634 2453771 2466860 2439589 2437810 2427662 2428511 2437250
19099 2437250 2445070 2453766 2444152 2461868 2461520 2447589 2415914 2435678 2464598 2461688 2443221 2444531 2445730
19086 2445730 2445455 2446243 2463136 2455901 2428489 2424458 2441071 2458030 2474369 2482861 2454617 2438503 2450686
19073 2450686 2458580 2476245 2467274 2458315 2462171 2462972 2456207 2454130 2471597 2489799 2474622 2453215 2448440
19060 2448440 2453716 2473007 2475951 2483905 2519252 2526067 2524736 2526934 2530350 2503995 2482400 2483745 2481042
19047 2481042 2488809 2494068 2505840 2498933 2479181 2484071 2487377 2473697 2509534 2511546 2491814 2493038 2517949
19034 2517949 2563152 2564022 2521632 2502242 2500083 2505167 2544965 2578779 2556624 2554156 2593617 2621327
19022 2621327 2615191 2599873 2555225 2561554 2571290 2551651 2534417 2564909 2585990 2556196 2528915 2533549
19010 2533549 2574003 2609701 2586897 2587017 2622732 2613515 2598782 2608322 2570214 2580336 2596619 2579316
18998 2579316 2582959 2582888 2585952 2592060 2588626 2586003 2572498 2543149 2533686 2525148 2534100 2567734 2580371
18985 2580371 2601188 2594084 2607239 2628830 2636687 2653991 2667809 2695308 2681708 2661230 2622684 2619900
18973 2619900 2622999 2612149 2636988 2647157 2665543 2689171 2656094 2641662 2651878 2680235 2690226 2685084
18961 2685084 2664857 2660126 2667987 2655781 2617718 2606112 2592428 2607460 2615715 2586616 2596454 2635067
18949 2635067 2664979 2705874 2711063 2705882 2692088 2641367 2635938 2653366 2641579 2656360 2689509 2714330
18937 2714330 2687627 2696175 2693546 2674145 2680867 2699634 2693427 2663818 2637152 2627147 2643265 2685627
18925 2685627 2708987 2669848 2666505 2658928 2654294 2675152 2672742 2674034 2670281 2697301 2714174 2693034
18913 2693034 2693998 2698445 2711092 2741719 2731037 2734143 2731932 2729979 2702724 2680655 2653811 2630783
18901 2630783 2649847 2680701 2699347 2716211 2730615 2726774 2739068 2738349 2745424 2742234 2732337 2740343 2762514
18888 2762514 2784399 2777054 2771189 2789231 2782150 2756234 2763605 2779767 2777545 2770967 2763179 2759085 2762507
18875 2762507 2765919 2772222 2751219 2755637 2748481 2773505 2790105 2799833 2795979 2798835 2816352 2843516 2860968
18862 2860968 2843531 2845268 2881983 2883997 2880929 2861869 2847398 2868010 2883543 2867512 2875809 2873827
18850 2873827 2878309 2861482 2861805 2870353 2861146 2859773 2860084 2834688 2849939 2870146 2867637 2872228 2883316
18837 2883316 2876298 2888498 2879287 2887365 2916203 2952067 2977871 2956847 2959106 2966542 2954917 2959824
18825 2959824 2978852 2995662 2990349 2949431 2926413 2945022 2955862 2925539 2928133 2967026 2948964 2945870
18813 2945870 2939827 2934091 2931836 2917149 2942230 2973259 2984224 2963333 2942530 2940588 2946882 2965344
18801 2965344 2958849 2988214 2984551 2926060 2918957 2933802 2970190 2994518 2995612 2989151 2989147 3028351 3044045
18788 3044045 3025371 3028178 3033611 3025694 3030474 3038404 3040938 3025422 3042605 3035341 3037217 3044601 3087221
18775 3087221 3098711 3080912 3060195 3104377 3105201 3091172 3109058 3136080 3131129 3155903 3176127 3144713
18763 3144713 3020013 2940255 2939549 2935630 2920491 2905492 2905020 2977306 3013610 3007310 3022195 3026167
18751 3026167 3024865 2995978 2988264 2993593 3021999 3054020 3065845 3059029 3050281 3022841 3038747 3055134
18739 3055134 3058880 3054390 3057593 3062230 3064346 3068784 3090040 3092188 3090089 3127753 3140446 3144708 3149285
18726 3149285 3147147 3146516 3162799 3178186 3173124 3173779 3173688 3152203 3130119 3144826 3136030 3119074 3134335
18713 3134335 3161876 3204174 3214521 3185411 3179135 3209566 3203380 3196261 3190172 3191978 3166562 3172683
18701 3172683 3182904 3191940 3200478 3195829 3204362 3207650 3186454 3180489 3179945 3189303 3178040 3192241 3195244
18688 3195244 3197269 3183557 3197929 3231499 3241068 3254633 3250080 3253703 3272960 3272964 3262592 3282233 3280176
18675 3280176 3278293 3263093 3239369 3211705 3209113 3241501 3269315 3290390 3304538 3307515 3308258 3324078
18663 3324078 3293250 3250208 3261842 3273449 3265646 3248069 3254365 3273680 3270341 3277510 3286321 3303167
18651 3303167 3316596 3341611 3375107 3363999 3357647 3378142 3388138 3374213 3401298 3396334 3371863 3371327
18639 3371327 3400093 3402452 3384874 3404198 3424963 3415996 3398977 3399474 3385891 3372593 3400651 3411802
18627 3411802 3419231 3427303 3421285 3405772 3425353 3456963 3482304 3484572 3492718 3475783 3469057 3477621 3460861
18614 3460861 3498714 3510754 3515682 3495464 3489391 3486829 3488484 3504739 3532357 3531786 3521120 3489774
18602 3489774 3475537 3485417 3503425 3508924 3495984 3495823 3492951 3491572 3512146 3514273 3507501 3513355 3519996
18589 3519996 3502868 3502357 3535124 3574121 3592005 3606092 3609882 3606077 3593461 3583548 3582416 3600186
18577 3600186 3597682 3569577 3587182 3628550 3627134 3609728 3637538 3648267 3668394 3668354 3648467 3623600
18565 3623600 3655632 3694972 3696088 3699013 3690458 3706214 3738499 3730860 3702992 3657255 3626348 3642832
18553 3642832 3658678 3680375 3707640 3697818 3701512 3702707 3711663 3744549 3749186 3721046 3750236 3751158 3757843
18540 3757843 3752799 3733820 3728390 3711966 3725576 3768338 3802768 3811466 3791257 3768622 3783211 3795677
18528 3795677 3793094 3779678 3815562 3809850 3806151 3823385 3866131 3886318 3877123 3887753 3888366 3895157 3889065
18515 3889065 3899873 3916703 3904111 3896573 3901797 3899017 3888480 3914481 3903260 3899457 3887146 3884247
18503 3884247 3884228 3892598 3915955 3920623 3932029 3944186 3937702 3911223 3915201 3953649 3974688 3994367 3985516
18490 3985516 3999447 4022547 4007013 4007396 4011800 4045110 4067070 4066776 4049066 4041627 4068048 4080914
18478 4080914 4076506 4073759 4071083 4052538 4041912 4035175 4045044 4042889 4039448 4053574 4059184 4029628 4039699
18465 4039699 4053294 4101218 4132740 4116549 4115678 4116758 4095108 4102776 4135259 4145753 4158451 4173840
18453 4173840 4163015 4155795 4165500 4188667 4193866 4191046 4193405 4177450 4191498 4217715 4244808 4266662
18441 4266662 4264607 4249226 4245280 4269008 4288574 4285382 4312432 4348715 4353467 4346223 4367266 4377327
18429 4377327 4347274 4351475 4354580 4325007 4332854 4347353 4364317 4398360 4382779 4342548 4331746 4359734
18417 4359734 4368299 4372328 4373165 4394930 4421312 4431941 4440975 4444493 4468843 4488894 4501868 4521733
18405 4521733 4514069 4475600 4478935 4501978 4542726 4560873 4595889 4611718 4604871 4606336 4612450 4595795
18393 4595795 4622562 4634536 4641281 4654455 4630663 4619017 4632950 4668992 4665471 4655310 4642151 4636517
18381 4636517 4637478 4653473 4662325 4675081 4679500 4681501 4693479 4722443 4750031 4756168 4738285 4733170 4763752
18368 4763752 4762129 4738228 4776977 4815959 4848665 4832733 4841303 4877301 4926295 4941668 4961123 4975669
18356 4975669 4978512 5006833 5034196 5054953 5045944 4975835 4929824 4866137 4843112 4845452 4901198 4948268
18344 4948268 5005252 5056348 5071499 5090645 5070775 4986730 4928000 4911731 4918009 4889248 4875617
18333 4875617 4905327 4966375 4983105 5004066 5039638 5046976 5057557 5080173 5109470 5110758 5130540 5188522
18321 5188522 5279445 5304037 5306120 5314487 5352765 5416802 5461503 5483491 5523095 5554324 5599223 5633953
18309 5633953 5636838 5604771 5548010 5480886 5410622 5371112 5369411 5353044 5353697 5364023 5329063 5275625
18297 5275625 5226672 5159157 5084069 5067717 5042264 5039211 5042036 5030350 5008031 5023538 4992410 4955233
18285 4955233 4929022 4949944 4986786 5042148 5085454 5131400 5181097 5203099 5237132 5238350 5260912
18274 5260912 5303897 5346419 5361469 5374680 5402883 5429313 5457287 5473313 5499141 5535334 5581284
18263 5581284 5572749 5566922 5587358 5617419 5628353 5620736 5635479 5651047 5674087 5705384 5747643 5775421
18251 5775421 5771932 5801234 5832436 5850634 5863868 5897426 5913291 5915388 5898318 5911148 5941373 5981303
18239 5981303 5998658 6000840 6026480 6004946 6005676 6050178 6087053 6117324 6141173 6128186 6172900 6235660
18227 6235660 6258204 6246365 6264853 6261929 6252130 6254338 6304946 6354352 6382520 6409110 6429985 6451101
18215 6451101 6477658 6497619 6537630 6582051 6629879 6648042 6638860 6663776 6682629 6697479 6715677
18204 6715677 6742113 6774291 6818326 6868244 6906353 6908839 6895620 6924166 6987239 7013617 7027447
18193 7027447 7064276 7104490 7147820 7195665 7231027 7265522 7305977 7337922 7342385 7328834 7351221
18182 7351221 7384300 7433011 7511090 7568905 7577054 7610583 7657207 7631756 7658923 7690588 7768123
18171 7768123 7839089 7914756 7995945 8045143 8085437 8137978 8209520 8277637 8338895 8375431 8420167
18160 8420167 8524553 8609962 8657153 8716175 8776702 8857103 8951225 9022545 9078866 9144981 9213877
18149 9213877 9303816 9373218 9441561 9569711 9688488 9791270 9907487 10053937 10206002 10335160
18139 10335160 10466616 10617074 10744260 10884691 11072740 11249484 11424745 11618144 11836240
18130 11836240 12074573 12329247 12607422 12883365 13215531 13572517 13969168 14397432 14838801
18121 14838801 15315180 15864950 16460907 17145453 17923805 18850097 19898081 21050978 22459390
18112 22459390 24164231 26331127 29271714 33203559 38043367 41917940 37634919 16018915
18104 16018915 -3968330 -11832259 -17028015 -20571442 -19473358 -16047419 -12801846 -10203407
18096 -10203407 -8209373 -6766045 -5783820 -5155237 -4751719 -4450060 -4107000 -3703826 -3227089
18087 -3227089 -2690742 -2156332 -1618065 -1098445 -640421 -274323 82530 406930 727295
18078 727295 1016816 1312608 1539178 1737441 1937261 2133680 2323378 2511447 2706962 2914528
18068 2914528 3116125 3283323 3448058 3619638 3800165 3979459 4141804 4308025 4473206
18059 4473206 4668575 4861841 5060591 5249567 5433448 5515541 5549814 5575374 5564107 5428402
18049 5428402 5141099 4811688 4508371 4365306 4269686 4118409 4041697 4049383 4116401 4216135
18039 4216135 4304065 4412925 4531605 4682641 4824288 4946141 5052430 5146606 5182473 5243955
18029 5243955 5311943 5384984 5451802 5535589 5595622 5610266 5643731 5679299 5729441 5809419 5878040
18018 5878040 5906343 5954136 6036084 6121379 6217977 6292255 6356796 6448813 6542514 6616632 6704530
18007 6704530 6799831 6867955 6918737 6964897 7025946 7112029 7203917 7325265 7413372 7474329 7533381
17996 7533381 7558783 7562071 7551269 7550674 7572784 7616732 7712343 7798471 7887267 7970396 8059056 8123877
17984 8123877 8184635 8256689 8335293 8438694 8549728 8647147 8712473 8768041 8774311 8829583 8913855
17973 8913855 8983279 9058407 9166938 9269790 9389188 9526731 9642947 9794675 9931283 10032639
17963 10032639 10144088 10274687 10400397 10583540 10799119 11078103 11370486 11559639 11581894
17954 11581894 11458139 11251996 11088459 10913263 10726224 10610892 10440068 10143228 9795094
17945 9795094 9568379 9453372 9431864 9461201 9492269 9472527 9334717 9181855 9115762 9111808 9179916
17934 9179916 9294476 9523176 9790408 10014070 10195528 10336600 10429037 10459579 10507151 10670717
17924 10670717 10875257 11096303 11306124 11495616 11693968 11876864 12000962 12115390 12274122
17915 12274122 12467312 12676481 12902279 13215051 13573035 13965076 14413883 14920193 15369760
17906 15369760 15544037 15293480 14571168 13815895 13336558 13176493 13206393 13332812 13378689 13073259
17896 13073259 12350313 11647218 11164391 10893578 10946996 11204082 11543611 11855284 12086532
17887 12086532 12241905 12429682 12635779 12853530 13113817 13420339 13754982 14047872 14307935
17878 14307935 14571911 14833042 15098804 15352646 15627022 15915060 16216600 16554801 16899590
17869 16899590 17201890 17388423 17537383 17758867 18052035 18350548 18687511 19084586 19517256
17860 19517256 19953084 20356161 20760736 21121527 21442371 21709408 21862270 21908374 21930220 21980572
17850 21980572 22094321 22306153 22646909 23103457 23633356 24264120 24994119 25776099 26553112
17841 26553112 27383355 28238201 29116362 30021624 30904772 31727211 32663689 33818702 35110094
17832 35110094 36338312 37595191 39345522 41653789 44340099 46898966 48120437 47133008
17824 47133008 43579638 37040159 31230379 27115833 25357042 26222271 29143232 33534787
17816 33534787 38983700 44440615 47606014 46115838 39728513 27128165 14162055 4006051
17808 4006051 -2560683 -4701840 -3491583 -440346 3600982 7869811 11831678 15372094
17800 15372094 18572949 21579650 24453648 27263521 30110708 33024028 36062433 39280925
17792 39280925 42729299 46543210 50729735 55421201 60894363 66946178 72676321 76613158
17784 76613158 77088029 74737223 69492966 58175866 47831948 42679223 40086874 42922203
17776 42922203 52077365 63887206 73733249 79372043 79543740 65834545 40012610 8005308
17768 8005308 -32788559 -73129580 -101265186 -119391854 -125806011 -122204672 -113453268 -102678694
17760 -102678694 -91517828 -81556619 -73972501 -68872937 -65933772 -65018625 -64309577 -63498654
17752 -63498654 -62212762 -60178586 -57634336 -54899365 -52101838 -49437406 -47039526 -44899752
17744 -44899752 -43034923 -41369267 -39842539 -38412911 -37059953 -35787170 -34553741 -33379300
17736 -33379300 -32294517 -31361564 -30495149 -29590904 -28727655 -28036031 -27610702 -27242382 -26703490
17727 -26703490 -26106011 -25555299 -25095669 -24600076 -24029128 -23480076 -22937793 -22364412 -21802012
17718 -21802012 -21256582 -20773339 -20334813 -19912457 -19489569 -19078754 -18677079 -18295697 -17934315
17709 -17934315 -17584553 -17240123 -16923742 -16577954 -16244946 -15959368 -15705906 -15417712 -15103786
17700 -15103786 -14836782 -14566782 -14299615 -14055373 -13808110 -13591063 -13358780 -13161544 -13021437
17691 -13021437 -12847649 -12610687 -12386497 -12202062 -12026710 -11815520 -11625203 -11445807 -11260731
17682 -11260731 -11061743 -10854390 -10692586 -10496154 -10301020 -10213451 -10104096 -9980238 -9832089
17673 -9832089 -9660563 -9516859 -9403668 -9247384 -9058269 -8903326 -8756806 -8624728 -8515277
17664 -8515277 -8443096 -8385421 -8313617 -8236681 -8133417 -8026239 -7944113 -7857627 -7738865 -7601466
17654 -7601466 -7496897 -7370047 -7257783 -7162359 -7067332 -7004667 -6901238 -6788315 -6652124 -6546730
17644 -6546730 -6454723 -6410690 -6366575 -6353181 -6344680 -6310633 -6225726 -6136524 -6061746 -5981873 -5904535
17633 -5904535 -5828740 -5765430 -5682631 -5605561 -5514802 -5395620 -5295721 -5192839 -5114958 -5071999 -5049784
17622 -5049784 -4994717 -4926825 -4801062 -4698988 -4599469 -4530057 -4455813 -4339414 -4229778 -4140949
17612 -4140949 -4036225 -3946401 -3860219 -3786551 -3714939 -3633556 -3566757 -3464104 -3389809 -3340461 -3285094
17601 -3285094 -3256914 -3211208 -3150359 -3112855 -3057209 -2991286 -2938335 -2874751 -2826081 -2794754 -2780857
17590 -2780857 -2706049 -2646501 -2581561 -2530819 -2493167 -2455467 -2411799 -2382416 -2382015 -2423994 -2409237 -2376782
17578 -2376782 -2292558 -2193641 -2115118 -2039298 -1940595 -1807886 -1700512 -1584650 -1489705 -1375538
17568 -1375538 -1285367 -1218750 -1125363 -1011875 -914676 -813410 -707036 -617904 -533174 -463004 -402566
17557 -402566 -344808 -268432 -172263 -104196 -26187 17024 78848 174859 283201 368573 421111
17546 421111 472348 521161 602769 653560 700872 790094 882476 963202 1030640 1122639 1210464
17535 1210464 1303783 1407756 1478292 1579964 1680883 1766432 1836714 1894414 2039049 2132134
17525 2132134 2234597 2353047 2444537 2532992 2639640 2724934 2831137 2899586 2968956 3067140
17515 3067140 3182671 3322850 3465644 3583399 3700265 3836360 3980677 4129148 4300617
17506 4300617 4425228 4539637 4707179 4885211 5064463 5246836 5434738 5657182 5865048
17497 5865048 6062229 6289054 6550739 6800528 7056374 7364234 7696109 8062492 8460500
17488 8460500 8794529 8985289 9095950 9091574 8807989 8570010 8523418 8518974 8608807 8793866
17478 8793866 8993357 9118300 8972024 8830940 8887003 9008273 9244911 9597572 10074110 10656394
17468 10656394 11313062 11996021 12711446 13399224 14116960 14890584 15720098 16622876 17622798
17459 17622798 18691452 19890242 21215422 22677809 24335832 26229920 28477624 31116975
17451 31116975 34188721 37464167 39839716 39808814 37974363 34660844 32074422 32339435
17443 32339435 32542696 28082537 19386456 7444535 -3450549 -8103367 -9894173 -12189707
17435 -12189707 -15301922 -19602766 -24297630 -26567216 -26611623 -25256804 -22686899 -19939986
17427 -19939986 -18840207 -19476199 -19842687 -19445419 -18693939 -17678777 -16616736 -16033583 -15661766
17418 -15661766 -14915977 -13952620 -12848136 -11512018 -9973073 -8400693 -6873297 -5402955
17410 -5402955 -3951906 -2477072 -958854 466099 1392856 1554835 1879184 2856025 4075774
17401 4075774 4873589 4270226 2926225 3058940 4342474 6012592 7848604 9283388 9638093
17392 9638093 7887123 5610268 3956166 3654525 4550741 3290454 -3687309 -12166682
17384 -12166682 -19817662 -25006408 -27183984 -28660306 -31505521 -34427265 -36675843 -37700519
17376 -37700519 -37390496 -36168258 -34332519 -32141228 -30029485 -28166012 -26610438 -25301549
17368 -25301549 -24188343 -23205209 -22306461 -21456246 -20709032 -20050342 -19447193 -18914977 -18426952
17359 -18426952 -17925470 -17433956 -16988221 -16599185 -16285746 -15996203 -15662999 -15360583 -15109040
17350 -15109040 -14871168 -14632590 -14411283 -14199570 -13997564 -13836340 -13658464 -13464308 -13243465
17341 -13243465 -13049605 -12887022 -12692402 -12521192 -12322312 -12134303 -11930729 -11726347 -11550171
17332 -11550171 -11410037 -11268124 -11141304 -11000813 -10804393 -10660114 -10553001 -10434888 -10309747
17323 -10309747 -10163731 -10027866 -9893564 -9780209 -9683158 -9572561 -9460628 -9363520 -9269023 -9176441
17313 -9176441 -9099069 -9009760 -8901594 -8822297 -8738579 -8670142 -8622308 -8558289 -8482534 -8390488 -8309479
17302 -8309479 -8238749 -8163177 -8058025 -7986543 -7931405 -7845902 -7790169 -7741333 -7686120 -7599031 -7509452
17291 -7509452 -7448608 -7406049 -7316155 -7212369 -7148978 -7052530 -6975558 -6926404 -6876288 -6833920 -6876021
17280 -6876021 -6880605 -6880754 -6855840 -6839528 -6812327 -6742971 -6678034 -6583323 -6477095 -6390742 -6362954 -6393552
17268 -6393552 -6444065 -6474094 -6462301 -6455748 -6399483 -6332763 -6281842 -6205896 -6137404 -6109024 -6055836
17257 -6055836 -5999531 -5946881 -5853325 -5797975 -5759243 -5740430 -5789063 -5832140 -5866126 -5944255 -5967823
17246 -5967823 -5962650 -5919773 -5857837 -5765108 -5668447 -5601393 -5560324 -5574686 -5626517 -5689863 -5748632
17235 -5748632 -5762782 -5727248 -5665847 -5603513 -5573299 -5543619 -5517585 -5507642 -5512361 -5487688 -5449660 -5393823
17223 -5393823 -5362121 -5299431 -5227248 -5172399 -5143303 -5173681 -5197628 -5200074 -5167229 -5139278 -5167916
17212 -5167916 -5169326 -5143421 -5108652 -5089771 -5057109 -5009602 -4965900 -4954507 -4941232 -4935723 -4938568 -4935520
17200 -4935520 -4899275 -4872790 -4854489 -4841627 -4829030 -4779961 -4726377 -4685386 -4661570 -4644962 -4633752
17189 -4633752 -4577721 -4552940 -4514245 -4525696 -4502802 -4465957 -4440412 -4391264 -4377249 -4405808 -4388497
17178 -4388497 -4326434 -4273534 -4250103 -4253576 -4278722 -4251758 -4223577 -4182876 -4143329 -4075537 -4062806
17167 -4062806 -4093455 -4075227 -4034661 -4055603 -4034819 -4015010 -4007790 -3987213 -3985502 -3975891 -3946297 -3936691
17155 -3936691 -3919359 -3893184 -3870731 -3866674 -3861515 -3810329 -3795193 -3814086 -3826402 -3809339 -3779431 -3744725
17143 -3744725 -3733629 -3702064 -3718587 -3730071 -3706908 -3680458 -3662548 -3634474 -3622404 -3595763 -3580681
17132 -3580681 -3573335 -3559749 -3582172 -3576553 -3584537 -3589116 -3554805 -3511338 -3498685 -3467008 -3463137 -3472032
17120 -3472032 -3460382 -3434020 -3409427 -3390616 -3374358 -3360160 -3354844 -3344449 -3335941 -3309080 -3287825 -3264209
17108 -3264209 -3240120 -3231602 -3246398 -3252279 -3192403 -3168303 -3190511 -3209378 -3177925 -3147867 -3132254 -3124213
17096 -3124213 -3118579 -3113566 -3114435 -3097446 -3052604 -3032366 -3038877 -3031596 -3018791 -2995417 -2974507 -2977702 -2972281
17083 -2972281 -2984922 -2960083 -2981534 -2976912 -2973969 -2979021 -2962212 -2976756 -2930033 -2904160 -2902036 -2882256
17071 -2882256 -2862971 -2874481 -2878316 -2851668 -2832530 -2826040 -2836214 -2797484 -2764832 -2758659 -2760902 -2756901
17059 -2756901 -2743948 -2731708 -2715002 -2706006 -2709655 -2702638 -2713876 -2706469 -2680975 -2671074 -2675545 -2696501
17047 -2696501 -2699160 -2698374 -2665071 -2639565 -2646379 -2636061 -2625200 -2615659 -2610182 -2618564 -2600906 -2585758 -2576950
17034 -2576950 -2576949 -2578641 -2559755 -2551109 -2555514 -2538525 -2534082 -2540345 -2500708 -2454442 -2464925 -2450999 -2428731
17021 -2428731 -2383373 -2354799 -2365818 -2384083 -2376394 -2371952 -2374949 -2385581 -2373909 -2377843 -2391765 -2393277
17009 -2393277 -2369249 -2360310 -2362503 -2360121 -2359115 -2317616 -2294428 -2305475 -2300944 -2283582 -2277198 -2270728 -2272030
16996 -2272030 -2253191 -2229920 -2231938 -2207450 -2182120 -2176684 -2203137 -2196898 -2163520 -2162697 -2175367 -2166609
16984 -2166609 -2143762 -2143087 -2144364 -2130067 -2123052 -2116921 -2098129 -2088541 -2078785 -2080746 -2102704 -2061202 -2039694
16971 -2039694 -2023693 -2031752 -2049053 -2015295 -1986659 -1980756 -1993660 -1957557 -1948052 -1958486 -1975818 -1986905
16959 -1986905 -1970528 -1965731 -1946170 -1951076 -1940226 -1926591 -1888911 -1851576 -1858240 -1859285 -1843255 -1830447
16947 -1830447 -1821645 -1781047 -1738249 -1737884 -1722328 -1722061 -1738586 -1734046 -1726045 -1717163 -1715779 -1732146 -1757699
16934 -1757699 -1847917 -1920110 -1936140 -1947359 -1960685 -1960638 -1951277 -1975114 -1976502 -1979147 -1946157 -1901992
16922 -1901992 -1850119 -1842188 -1850511 -1862597 -1841632 -1842077 -1833577 -1817400 -1802692 -1788233 -1780859 -1784602 -1777082
16909 -1777082 -1820769 -1821263 -1775682 -1748480 -1750060 -1763865 -1739257 -1748561 -1742408 -1717833 -1711006 -1721267
16897 -1721267 -1708939 -1689989 -1706449 -1717674 -1701805 -1696824 -1694457 -1641083 -1589589 -1593549 -1577871 -1566158
16885 -1566158 -1579446 -1604927 -1626105 -1580794 -1548339 -1569821 -1636203 -1707812 -1760970 -1781656 -1779960
16874 -1779960 -1766067 -1753613 -1769141 -1792907 -1793438 -1785518 -1753797 -1744138 -1717367 -1694980 -1678844 -1664968
16862 -1664968 -1627174 -1624738 -1608975 -1640336 -1628128 -1574924 -1531746 -1547023 -1546445 -1536059 -1554387 -1545296
16850 -1545296 -1550617 -1555989 -1537741 -1557909 -1550279 -1526557 -1512313 -1493652 -1467257 -1483460 -1507071 -1497616
16838 -1497616 -1510483 -1489504 -1477782 -1459490 -1444232 -1421966 -1437739 -1464599 -1473107 -1451796 -1473881
16827 -1473881 -1498480 -1483339 -1466853 -1427258 -1397160 -1398662 -1389856 -1363490 -1345077 -1346611 -1353993 -1333050
16815 -1333050 -1338664 -1338768 -1333437 -1339671 -1318959 -1308440 -1306613 -1314457 -1312292 -1321655 -1319070 -1322624 -1306842
16802 -1306842 -1273164 -1258339 -1259027 -1255210 -1252536 -1256839 -1249899 -1253135 -1239013 -1242110 -1258056 -1288063 -1314184
16789 -1314184 -1284067 -1239681 -1192726 -1190970 -1203262 -1188709 -1177261 -1202610 -1193528 -1194575 -1192341 -1178334
16777 -1178334 -1171222 -1166570 -1166099 -1180345 -1195904 -1208555 -1212255 -1206859 -1208852 -1198020 -1193328 -1180578 -1172163
16764 -1172163 -1148669 -1116058 -1117659 -1130830 -1106435 -1096608 -1091178 -1074185 -1042753 -1057953 -1069067 -1063327
16752 -1063327 -1050754 -1071263 -1110938 -1119190 -1100484 -1124896 -1130018 -1085981 -1033730 -1015304 -1060066 -1094435
16740 -1094435 -1074587 -1067607 -1049060 -1050775 -1039350 -1043268 -1055817 -1043282 -1019599 -975481 -960077 -948006
16728 -948006 -966584 -977825 -988378 -1003666 -1002425 -983584 -985332 -1007575 -1009441 -990369 -972437 -979912
16716 -979912 -993489 -964059 -952943 -949847 -936732 -910596 -887239 -871049 -874527 -879023 -896343 -887698
16704 -887698 -869370 -865786 -876244 -880163 -896221 -891325 -823047 -807867 -841705 -869658 -889231 -906962
16692 -906962 -889032 -867447 -886045 -899846 -888913 -858508 -828562 -835896 -853867 -858063 -824720 -825895
16680 -825895 -834585 -813847 -803819 -816796 -832749 -814568 -800669 -807458 -779275 -767137 -783088 -779069
16668 -779069 -766830 -766244 -771720 -805207 -801209 -767444 -794927 -808527 -783881 -784149 -763675 -739038 -720934
16655 -720934 -747237 -780858 -778257 -770779 -768226 -757310 -732266 -712363 -699701 -702379 -747964 -740738
16643 -740738 -695782 -681379 -700744 -713821 -716790 -713388 -726621 -745171 -746766 -729347 -733344 -711656
16631 -711656 -698617 -683283 -682130 -707885 -692480 -689661 -667677 -676584 -678618 -664775 -679811 -667532
16619 -667532 -649592 -624157 -623189 -589316 -555554 -589670 -590498 -579404 -556247 -549641 -582565 -630843
16607 -630843 -632464 -615405 -613078 -592223 -557096 -546532 -583147 -607981 -606646 -614761 -588572 -569692
16595 -569692 -547148 -538210 -547791 -585612 -554379 -528212 -532361 -518467 -536478 -503246 -501899 -508293
16583 -508293 -518615 -531399 -522183 -504124 -503828 -520454 -524572 -519840 -543698 -547698 -540865 -504692 -470280
16570 -470280 -499849 -512093 -507823 -517513 -512784 -493310 -497938 -504518 -479310 -477136 -480965 -469742 -486126
16557 -486126 -488013 -459007 -430515 -408202 -404248 -403895 -412844 -408604 -423054 -424484 -420748 -419507 -429544
16544 -429544 -400103 -402116 -419972 -425429 -430771 -416014 -403399 -404903 -389063 -398755 -391835 -369511 -379286
16531 -379286 -398215 -385067 -348291 -353444 -372393 -396767 -405489 -363935 -306389 -292919 -302831 -320151
16519 -320151 -334362 -356663 -354539 -336072 -322216 -313409 -290824 -303700 -302490 -306536 -355232 -400571
16507 -400571 -404261 -345683 -309129 -331369 -344332 -332015 -294172 -275540 -276070 -259109 -267842 -255023
16495 -255023 -256816 -257876 -255952 -270044 -280287 -296957 -298149 -294704 -297619 -299925 -328962 -322729 -308057
16482 -308057 -311880 -310253 -290424 -278606 -269423 -239980 -208145 -210401 -229920 -219208 -227748 -242648
16470 -242648 -248899 -232261 -217480 -192787 -184277 -192318 -197668 -188644 -189402 -205142 -238366 -242056 -223713
16457 -223713 -208611 -179467 -183975 -204519 -193638 -189650 -169562 -161315 -152006 -141311 -141918 -142666 -131154
16444 -131154 -143802 -134890 -142203 -126816 -128576 -142527 -158674 -150770 -172365 -174182 -203851 -201091 -154592
16431 -154592 -171622 -188496 -173413 -164727 -160729 -165988 -156356 -167879 -162517 -131009 -108098 -115356 -135765
16418 -135765 -119684 -80738 -65854 -71020 -28563 -19076 -21545 -15664 -15456 -21377 -57533 -62812 -43972
16405 -43972 -42222 -54704 -73533 -83975 -71004 -58081 -25380 480 33077 48545 27141 2030
16393 2030 -7885 -5823 -6691 21977 3282 -19238 109 14636 14976 2793 -675 -7252 8070
16380 8070 4944 2368 23125 3379 -5864 4249 35080 35256 25219 39548 60047 60550 55370
16367 55370 52359 54704 63211 47603 38469 57108 73769 48843 47211 73838 89656 58449 52021
16354 52021 83832 84298 71342 62844 33784 50598 84373 121257 128206 118827 119057 130091 155348
16341 155348 156441 122452 93738 100702 105594 106057 113207 124906 135480 157491 159812 143783 135710
16328 135710 125921 132466 159780 163149 138933 120938 116058 117054 123376 161266 189060 191701 197675
16315 197675 201090 194331 183514 188614 222994 226126 230830 207596 191364 219560 222119 195746 195585
16302 195585 177657 160532 176715 230249 255299 247319 251885 281304 282351 276264 274547 235642
16290 235642 234729 248566 230583 248541 275792 271349 276460 276266 257925 237505 234672 238328 259948
16277 259948 278282 303300 294688 298788 299961 268759 238361 246666 286176 296813 261023 263578
16265 263578 296650 296865 287739 274911 267047 285210 313498 323803 321220 329932 330027 320865 319029 308229
16251 308229 323642 349071 345006 350442 359387 369682 354843 329873 316188 311514 319145 322363 316817
16238 316817 317382 341639 345417 345408 348604 351493 371949 383087 409820 418209 423216 427005 402377 369877
16224 369877 365068 365012 408766 426637 394958 367163 359969 383400 401537 415026 400711 399069 395837
16211 395837 403705 413916 404449 396089 405243 431700 456668 453305 431130 425580 417674 404749 375996
16198 375996 402446 412071 455691 492833 454430 420589 432925 446252 451222 450333 449243 482105
16186 482105 500319 500336 477497 462454 469884 447042 455392 478600 480311 510632 509739 515972 490137
16173 490137 497307 509796 497184 502351 527585 536624 549176 565113 534304 514632 513234 507158
16161 507158 494564 521686 544102 535381 535172 560349 547938 530770 549015 554106 582041 568298
16149 568298 566611 554106 563389 610685 598808 588439 616313 605281 605956 632828 624998 611938
16137 611938 602691 601432 596608 564268 555491 583006 606448 641380 634625 628816 610328 607515 629408
16124 629408 634340 653655 659480 644002 641171 640319 623520 586986 588298 588606 595762 604949 636689
16111 636689 660570 680061 709957 721641 708402 732640 745209 746865 699644 673231 676284 691595
16099 691595 674983 681818 684249 708517 719577 707569 705550 716411 716255 715647 716616 726826 714910
16086 714910 704557 709168 702345 687877 692957 722377 722562 709483 728393 725052 744821 774785 746895
16073 746895 744492 725936 725809 769932 779239 792624 830106 832590 817480 817425 808722 807297 815696 793742
16059 793742 804960 821132 806133 786355 781858 780200 807955 827894 818579 829286 825767 821608
16047 821608 840851 810732 787732 807945 806543 805829 788748 789816 789777 768004 758376 802524 797781
16034 797781 743911 735415 787938 825041 826506 805211 838441 873995 885003 889804 879548 839306
16022 839306 844884 882560 912033 930695 936356 933505 916982 920097 913181 905389 922680 919857 916940
16009 916940 900040 899352 898240 899149 934977 932810 894188 891978 897393 878383 868011 888547 909414
15996 909414 934675 944037 930958 949585 944128 945351 986407 985879 971121 993621 1020966 1003658
15984 1003658 984741 979839 986177 970142 963299 973504 976986 984171 1001739 997866 991977 1021193 1039256
15971 1039256 1040601 1020115 1021594 1031258 1027926 1024634 1022477 1020327 1016345 1019293 1036359 1030005 1016129
15958 1016129 1025831 1024462 1041798 1064288 1061121 1029479 1022166 1036684 1042530 1030650 1029783 1031596 1031392
15945 1031392 1051194 1053015 1083083 1111907 1113366 1088074 1073700 1107570 1110099 1086102 1056323 1061120
15933 1061120 1067872 1063655 1087675 1112973 1117649 1118699 1136339 1132780 1141446 1157359 1156501 1151902 1118884
15920 1118884 1105908 1119420 1110988 1109714 1103761 1117583 1150230 1162742 1168060 1199040 1216781 1202987
15908 1202987 1197950 1201271 1178066 1179573 1185269 1169352 1169606 1211915 1224625 1226681 1241302 1225213 1209209
15895 1209209 1208303 1214789 1213195 1216757 1225866 1215866 1209831 1199586 1205683 1242184 1246743 1241772 1247942
15882 1247942 1226701 1222301 1234394 1235378 1260730 1274056 1269950 1271908 1301438 1315665 1281686 1291531
15870 1291531 1293871 1270241 1251173 1268961 1267673 1296021 1298193 1300498 1296022 1266747 1274648 1270611 1258075
15857 1258075 1274705 1320358 1327978 1321958 1332801 1329077 1336794 1329097 1288886 1292058 1319574 1316111 1321749
15844 1321749 1356800 1384920 1373599 1340672 1321693 1328977 1372189 1345666 1352692 1361042 1362664 1392498
15832 1392498 1396307 1395036 1404516 1382094 1392144 1383728 1374528 1381589 1375159 1349988 1339869 1344291 1368327
15819 1368327 1403228 1426789 1435143 1435682 1427975 1419386 1421367 1414167 1432979 1446053 1470929 1462100 1447186
15806 1447186 1472350 1480594 1460449 1464925 1454159 1448652 1496799 1487407 1462081 1456348 1460466 1445137
15794 1445137 1448418 1460527 1485697 1516783 1506791 1514468 1527662 1532013 1533082 1527620 1516456 1546258
15782 1546258 1564289 1566388 1580677 1582858 1564976 1541648 1535059 1542846 1522801 1529908 1577513 1585989
15770 1585989 1573834 1559171 1536260 1520771 1532062 1571556 1581380 1561924 1572146 1595915 1607820
15759 1607820 1600133 1592216 1601811 1605775 1608173 1629949 1622947 1630929 1591621 1607001 1628983 1627362 1645570
15746 1645570 1674808 1684860 1707335 1711811 1701882 1702507 1704413 1699189 1666751 1652590 1692785 1717106
15734 1717106 1688372 1696735 1716760 1718884 1719161 1740003 1727902 1718062 1727325 1715970 1700423 1708221 1749323
15721 1749323 1744751 1759532 1767569 1718265 1746925 1754219 1728648 1732361 1758911 1778222 1808379 1814788
15709 1814788 1834528 1835308 1825665 1804408 1821349 1793759 1806966 1835680 1848317 1845160 1830622 1834448
15697 1834448 1862261 1858418 1838989 1816830 1818201 1801357 1789104 1822751 1866201 1870732 1863338 1888783
15685 1888783 1889238 1872485 1877453 1905285 1866425 1838028 1857206 1873345 1874757 1894081 1926625 1947720
15673 1947720 1965368 1967404 1953887 1948605 1927476 1923000 1944381 1932293 1929328 1970784 2008348 2003510
15661 2003510 1995803 1995450 2005671 2007308 1997381 1963646 1987546 2034508 2028097 2016292 2041280 2033879 2031671
15648 2031671 2040015 2006637 2020405 2055762 2061001 2039821 2052443 2044174 2025980 2014204 2034222 2048407
15636 2048407 2055551 2041740 2062959 2080737 2050430 2033489 2060890 2090763 2135250 2136361 2142604 2107333
15624 2107333 2097039 2113778 2131160 2129081 2145883 2170919 2180433 2159283 2157049 2154585 2165228 2188903
15612 2188903 2206526 2192527 2215514 2229706 2191388 2156305 2126853 2135145 2177226 2201716 2222146
15601 2222146 2212877 2217120 2234334 2250127 2248715 2269204 2297251 2284304 2282785 2301826 2294175 2286692
15589 2286692 2279470 2272800 2281470 2295358 2295685 2298055 2281340 2297241 2308156 2310210 2315905 2337872 2350092
15576 2350092 2341073 2308443 2294523 2293978 2327427 2363644 2354351 2348305 2374117 2358789 2378707 2372043
15564 2372043 2348308 2345928 2382471 2418145 2429799 2420148 2410228 2417264 2409390 2401370 2437835 2448341
15552 2448341 2457800 2484460 2492991 2467149 2457775 2462211 2456968 2442192 2430441 2424273 2457704 2499749
15540 2499749 2517776 2525422 2512360 2503633 2523636 2524420 2529262 2543009 2537301 2581317 2623935 2636885
15528 2636885 2605722 2589492 2598325 2602844 2611236 2575179 2571833 2609929 2613099 2599699 2604233 2609830 2620261
15515 2620261 2634279 2668866 2696437 2679360 2642282 2648223 2651316 2689353 2720963 2761618 2781349 2792355
15503 2792355 2816991 2797412 2748611 2727914 2729830 2747465 2761290 2778748 2795213 2786684 2783507 2797061
15491 2797061 2789975 2773899 2793213 2814814 2852175 2867447 2864279 2846299 2856686 2889842 2900710 2888471
15479 2888471 2879949 2854848 2861681 2873540 2898792 2894601 2909492 2916852 2909464 2939216 2977880 2993464
15467 2993464 3028509 3036744 3037378 3061605 3057725 3044237 3060499 3051923 3044224 3045103 3070549 3092231 3107560
15454 3107560 3123157 3157000 3163216 3142958 3169755 3186958 3230597 3220560 3208946 3217282 3218594 3229295
15442 3229295 3223053 3243696 3266816 3285568 3310829 3326720 3320078 3338788 3357458 3404260 3433645 3448005
15430 3448005 3486153 3521116 3559338 3585303 3667860 3726870 3762736 3845466 3917709 4026617 4147616
15419 4147616 4321286 4533727 4696923 4610663 3981188 3060277 2482193 2166626 1985001 1970529
15409 1970529 2121606 2262565 2363554 2466024 2571487 2654952 2708160 2751654 2813360 2855916
15399 2855916 2908022 2928261 2926783 2994553 3041627 3062938 3055711 3072840 3082064 3084520 3072957 3098748
15387 3098748 3113740 3100249 3097573 3139056 3188020 3193219 3216348 3204327 3198496 3240137 3271996 3277385
15375 3277385 3281259 3289493 3303417 3291605 3315096 3348812 3330667 3341335 3381108 3401142 3420992 3416249
15363 3416249 3410106 3414979 3421288 3451039 3477539 3472777 3474197 3517801 3521362 3547666 3538678 3534574 3542473
15350 3542473 3536467 3532199 3538456 3540327 3562150 3587385 3604699 3640485 3640418 3651083 3645769 3654993 3669275
15337 3669275 3665733 3670681 3668460 3680670 3704675 3725958 3718747 3714049 3716084 3728717 3760717 3753462 3745728
15324 3745728 3740500 3744642 3772721 3809294 3844445 3881347 3888461 3909927 3944014 3946306 3948053 3927549
15312 3927549 3892407 3892273 3903269 3920758 3940517 3959343 3974053 3975482 3968108 3992467 4008019 4016381
15300 4016381 4048820 4125466 4164919 4190707 4166834 4138308 4145750 4170869 4182559 4177732 4168503 4189830
15288 4189830 4225615 4267750 4276454 4270206 4253903 4233287 4222947 4279730 4329392 4279199 4258423 4274128
15276 4274128 4299296 4327967 4334972 4346142 4364495 4393537 4405014 4408731 4407264 4411164 4426869 4449326
15264 4449326 4462604 4499001 4505543 4472909 4470501 4476632 4484657 4517026 4549388 4553428 4533812 4544814
15252 4544814 4558280 4587350 4615264 4661762 4699951 4705445 4710464 4706574 4694574 4731403 4775452 4805698
15240 4805698 4820221 4844089 4839041 4849454 4851387 4851632 4853463 4864512 4877876 4908465 4913975 4917489 4952578
15227 4952578 5010739 5057714 5063836 5045712 5015388 5033208 5048372 5098061 5103553 5120509 5150686 5200535
15215 5200535 5238283 5243804 5215894 5220880 5243506 5260372 5279790 5316960 5302729 5263040 5296754 5343756
15203 5343756 5360485 5408364 5439811 5437264 5445849 5456180 5457754 5492661 5518938 5530465 5556768 5600222
15191 5600222 5606836 5625212 5672136 5691074 5713300 5739997 5740158 5749974 5741482 5744337 5768340 5815634
15179 5815634 5819516 5819898 5851154 5885120 5899011 5921361 5936125 5985563 6027534 6049058 6077977 6066618
15167 6066618 6048401 6041322 6088547 6169629 6231434 6195642 6221459 6270760 6316659 6346803 6385471
15156 6385471 6398435 6447488 6487630 6492418 6497341 6530027 6597622 6681488 6764209 6811819 6853215 6890929
15144 6890929 6877823 6793600 6710395 6634565 6521261 6419514 6399678 6378692 6354904 6381661 6408168
15133 6408168 6446309 6478971 6530792 6568126 6599984 6637092 6676221 6704598 6757178 6788211 6826125
15122 6826125 6857246 6898276 6946899 6999558 7042089 7076447 7115052 7139380 7162799 7209281 7254047
15111 7254047 7279664 7305639 7344115 7400757 7448015 7465801 7525015 7537650 7547138 7611472 7647612
15100 7647612 7668661 7717076 7741505 7777450 7839537 7880070 7931985 7987744 8012874 8028162 8037334
15089 8037334 8023755 8037606 8038017 8033688 8052436 8096666 8151747 8187231 8189993 8137691 8006053 7744793
15077 7744793 7504802 7592376 7832189 8038395 8279426 8536670 8701700 8820092 8925701 9004205
15067 9004205 9061834 9134174 9212722 9285067 9361254 9388211 9413811 9475256 9532555 9562491 9562027 9618088
15055 9618088 9672677 9697820 9740546 9823040 9924658 10035357 10108030 10183458 10258693 10329279 10394583
15044 10394583 10434188 10501830 10563841 10607536 10609646 10648503 10741664 10807315 10856194 10913922 10971298
15033 10971298 11047267 11146696 11231146 11280247 11335885 11411374 11508287 11587786 11694754 11805608 11906547
15022 11906547 11991934 12080739 12145497 12189328 12195817 12166121 12178525 12361242 12584228 12674434 12585057
15011 12585057 12666423 12914835 13107230 13213571 13313336 13442304 13602129 13813771 14010981 14154335
15001 14154335 14152899 13999852 13942453 14002913 14053099 14106768 14236518 14415163 14556665 14756270
14991 14756270 14963283 15126357 15319199 15531123 15737122 15931910 16130596 16390104 16637132
14982 16637132 16904421 17199224 17475213 17574670 17238110 16690534 16417298 16359516 16383529 16584546
14972 16584546 16846663 17125928 17388053 17653159 17927095 18175714 18443619 18739974 19024773
14963 19024773 19313479 19579166 19841244 20111051 20421442 20742821 21085904 21414554 21675541
14954 21675541 21969657 22268836 22589327 22872866 23210103 23596791 23931636 24303909 24700967
14945 24700967 25106361 25513573 25898644 26315757 26797137 27300944 27836643 28410745 28966864
14936 28966864 29527144 30050545 30579891 31150586 31758847 32387350 33070494 33791508 34582557
14927 34582557 35422018 36298534 37202520 38157927 39136701 40200146 41351223 42515872 43757168
14918 43757168 45096593 46578063 48177993 49864293 51636023 53525747 55554434 57758929
14910 57758929 60244989 62881304 65525815 68061524 70330161 72918806 76368720 80585077
14902 80585077 85453891 90995426 96940849 102824194 109201553 117174450 126789114 138139326
14894 138139326 152049390 169576240 192394913 222454691 259852842 295220257 289337795
14887 289337795 165082247 -31642312 -142760457 -196865310 -236322461 -244723959 -220980591
14880 -220980591 -189930245 -163169331 -141871388 -125591957 -114003321 -105280334 -98169503
14873 -98169503 -92182894 -86537987 -80936060 -75404059 -69989388 -64825428 -60318475 -56246878
14865 -56246878 -51909261 -47935350 -46842434 -51642543 -57229482 -58701189 -58731368 -58208394
14857 -58208394 -56280642 -53459760 -50608133 -48044383 -45819915 -43827496 -42047411 -40423107
14849 -40423107 -38985616 -37687104 -36446810 -35235677 -34083396 -32973898 -31896497 -30893258
14841 -30893258 -29897528 -28878568 -27919740 -27028430 -26220066 -25362893 -24464210 -23570547 -22736720
14832 -22736720 -21852155 -20882921 -19799828 -18892537 -18976894 -20639542 -23145927 -25147738 -26111925
14823 -26111925 -26437328 -26228974 -25559520 -24701870 -23853246 -23054284 -22347216 -21764855 -21214187
14814 -21214187 -20683328 -20170449 -19733040 -19355737 -18998647 -18657003 -18310926 -17976035 -17651295
14805 -17651295 -17357183 -17070848 -16775815 -16478518 -16158622 -15867184 -15609126 -15387350 -15143904
14796 -15143904 -14905425 -14676936 -14403635 -14155399 -13931580 -13710029 -13471621 -13304219 -13110256
14787 -13110256 -12883981 -12655780 -12412950 -12158539 -11942420 -11736647 -11527357 -11340890 -11115146
14778 -11115146 -10848255 -10535560 -10204244 -10013019 -10271356 -10901909 -11262536 -11316129 -11318371 -11221882
14768 -11221882 -11049725 -10850730 -10665083 -10529591 -10395506 -10239353 -10121568 -10026711 -9834714
14759 -9834714 -9673897 -9576070 -9504854 -9348056 -9170772 -9006451 -8855537 -8686060 -8527112 -8396666
14749 -8396666 -8244318 -8089416 -7931091 -7779681 -7621614 -7474527 -7382332 -7375565 -7405617 -7492721
14739 -7492721 -7593513 -7659367 -7714097 -7743692 -7804540 -7938805 -8050575 -8114528 -8088356 -7925844
14729 -7925844 -7781879 -7665469 -7568854 -7490516 -7392380 -7289428 -7201021 -7116715 -7036925 -6955684 -6891802
14718 -6891802 -6812063 -6718893 -6618557 -6515709 -6457177 -6397136 -6255405 -6155476 -6066171 -5966507 -5858912
14707 -5858912 -5802824 -5789160 -5777262 -5766941 -5778401 -5736361 -5720802 -5753283 -5859608 -6081063 -6369614
14696 -6369614 -6371318 -6156012 -5988665 -5837151 -5628656 -5400550 -5261655 -5151143 -5098511 -5039796
14686 -5039796 -4964196 -4891453 -4808623 -4740782 -4660161 -4559849 -4480662 -4441567 -4397831 -4373963 -4360170
14675 -4360170 -4335811 -4276603 -4211033 -4168584 -4097292 -4038110 -3994272 -3977549 -3921891 -3843454 -3815352
14664 -3815352 -3796445 -3738343 -3688452 -3667107 -3642371 -3612968 -3554335 -3526327 -3478391 -3436680 -3402371
14653 -3402371 -3354577 -3318882 -3274750 -3250305 -3203192 -3155340 -3127152 -3085774 -3021993 -2981947 -2944526
14642 -2944526 -2932964 -2935544 -2882908 -2818234 -2756027 -2716134 -2716067 -2694624 -2649191 -2648335 -2609558 -2559172
14630 -2559172 -2510112 -2437207 -2424891 -2395400 -2369245 -2335049 -2296154 -2257145 -2199456 -2166506 -2139059
14619 -2139059 -2074947 -2060440 -2064108 -2004377 -1969911 -1936741 -1888718 -1823275 -1778298 -1759216 -1761983 -1740250
14607 -1740250 -1722889 -1670258 -1605460 -1542862 -1528410 -1501880 -1458495 -1424389 -1396139 -1363855 -1314603
14596 -1314603 -1287617 -1262246 -1215399 -1163100 -1158202 -1137655 -1087688 -1052538 -1014903 -1003909 -993480
14585 -993480 -952630 -889554 -851933 -844680 -830229 -769829 -728493 -693387 -669463 -638949 -591766 -578641
14573 -578641 -557263 -529305 -483567 -426459 -384158 -350734 -315815 -281427 -235418 -177137 -123350
14562 -123350 -107438 -69024 -38674 -18275 29031 91977 98608 72833 39586 44694 41055 28400
14550 28400 53822 110298 141150 197690 230853 258507 286788 330419 358494 417443 448231 503619
14538 503619 564389 634744 711037 753191 761027 815325 837862 824287 827737 821593 819864 843685
14526 843685 871292 910271 922406 900908 915863 959451 1005549 999216 1024416 1070114 1089022 1125474
14514 1125474 1164841 1197547 1267042 1319152 1367082 1387098 1407966 1457156 1519663 1563752 1646402
14503 1646402 1706531 1727121 1767093 1797369 1838874 1885596 1934891 1983411 2013910 2082778 2171862
14492 2171862 2208224 2236894 2285442 2338428 2377809 2426508 2453951 2482831 2531389 2581569 2612362
14481 2612362 2654665 2667985 2661232 2662538 2713476 2752211 2774189 2761554 2716978 2680907 2652281 2618935
14469 2618935 2586879 2592991 2654678 2713842 2796344 2856392 2916117 3051197 3194564 3280874 3436092
14458 3436092 3590191 3688862 3752477 3854406 3954722 4031981 4081347 4123503 4161259 4227726 4300389
14447 4300389 4374067 4426361 4481294 4544854 4594619 4646481 4694503 4764613 4856515 4944143 5031251
14436 5031251 5091553 5137970 5214846 5293042 5340520 5429630 5508047 5578828 5632260 5718961 5798606
14425 5798606 5832742 5869691 5910145 5998142 6053222 6141113 6227601 6307009 6371883 6454970 6522955
14414 6522955 6614045 6693640 6754282 6811970 6887878 6970083 7072514 7159161 7238607 7314518 7365863
14403 7365863 7403506 7489565 7570049 7636779 7769101 7895844 8010400 8118199 8217077 8352424
14393 8352424 8492700 8622718 8718896 8819077 8901012 9040228 9174978 9287401 9415285 9577916
14383 9577916 9729408 9873604 10019133 10154361 10275149 10423065 10589044 10755966 10923052
14374 10923052 11072731 11238041 11390943 11517968 11695732 11899835 12084361 12257083 12468047
14365 12468047 12692806 12927107 13136872 13375933 13630032 13898366 14151091 14422646 14618522
14356 14618522 14830504 15137034 15491883 15839408 16017066 15726578 15114486 14781511 14745745
14347 14745745 14862613 15108336 15511656 15981436 16385260 16799624 17244605 17651801 18071811
14338 18071811 18455240 18824303 19244275 19635899 20038060 20446869 20895790 21336528 21802040
14329 21802040 22310348 22837832 23334598 23825741 24337129 24917602 25507603 26138200 26749263
14320 26749263 27422384 28171449 28950002 29761180 30599527 31496256 32439773 33431541 34425874
14311 34425874 35506150 36667327 37907966 39219827 40617563 42120775 43731158 45437969
14303 45437969 47239807 49239692 51386294 53715175 56227759 58969448 61964307 65268926
14295 65268926 68882507 72807060 77063149 81674960 86575334 91929256 97872590 104519505
14287 104519505 112143113 121240852 132209422 145316060 159238107 168602278 166116133
14280 166116133 154556700 131334666 96299027 66355156 36546791 3335224 -25162051
14273 -25162051 -56333444 -94331181 -124843207 -149659059 -165869586 -168038796 -161748232
14266 -161748232 -151868655 -139813776 -127612977 -116836729 -107861017 -100324221 -93831008
14259 -93831008 -88287203 -83515814 -79230010 -75376912 -71820569 -68463284 -65316559 -62420577
14251 -62420577 -59725677 -57217838 -54900047 -52781301 -50787423 -48915095 -47145962 -45453139
14243 -45453139 -43837445 -42372635 -40964932 -39571241 -38224247 -36916252 -35656542 -34364188
14235 -34364188 -33082063 -31819450 -30453350 -29041755 -27551907 -26069394 -24927333 -24543799
14227 -24543799 -24812079 -25541670 -26552333 -27945429 -29574790 -31032040 -32440243 -33660542
14219 -33660542 -34586603 -34943535 -34609146 -33839055 -32912870 -31950601 -30980066 -30073821 -29250525
14210 -29250525 -28540494 -27881947 -27292047 -26768207 -26255606 -25757330 -25293426 -24868254 -24477377
14201 -24477377 -24101870 -23744307 -23404218 -23075853 -22761089 -22467358 -22140163 -21824300 -21549420
14192 -21549420 -21286461 -21014136 -20745570 -20447862 -20186403 -19932209 -19713398 -19499477 -19275090
14183 -19275090 -19042928 -18812910 -18592986 -18373105 -18188557 -18000972 -17800794 -17630897 -17453346
14174 -17453346 -17237666 -17072832 -16903048 -16771770 -16658611 -16531792 -16393796 -16203557 -16048623
14165 -16048623 -15912842 -15777243 -15639340 -15477586 -15330585 -15191779 -15039948 -14908932 -14802861
14156 -14802861 -14694768 -14581674 -14458921 -14352876 -14261864 -14193515 -14141592 -14091163 -13961616 -13863515
14146 -13863515 -13803068 -13727757 -13666524 -13549960 -13437019 -13317187 -13215150 -13106827 -12979429 -12871894
14136 -12871894 -12789945 -12716664 -12632626 -12524027 -12471511 -12394254 -12298418 -12199589 -12128689 -12013438 -11925307
14125 -11925307 -11862536 -11770542 -11718543 -11683935 -11594730 -11468948 -11383077 -11280221 -11239412 -11278314 -11318068
14114 -11318068 -11325089 -11335985 -11295818 -11226930 -11174470 -11105147 -11039303 -10986074 -10937586 -10874679 -10805790
14103 -10805790 -10725486 -10648437 -10567121 -10490776 -10455080 -10435904 -10346713 -10284165 -10249689 -10227080 -10235506
14092 -10235506 -10272948 -10328518 -10359298 -10357777 -10368983 -10325209 -10272948 -10204262 -10167481 -10212540 -10322738
14081 -10322738 -10423216 -10423347 -10345671 -10216397 -10088280 -9949256 -9811672 -9708589 -9639458 -9556924
14071 -9556924 -9471412 -9405190 -9316081 -9291173 -9279900 -9224952 -9162240 -9129645 -9097782 -9079952 -9052680
14060 -9052680 -9007196 -8978188 -8952571 -8917435 -8844597 -8799866 -8779854 -8739737 -8714345 -8685611 -8639463
14049 -8639463 -8593046 -8595752 -8565043 -8503032 -8442085 -8408530 -8412330 -8424692 -8386866 -8350470 -8318307 -8289507
14037 -8289507 -8226034 -8181124 -8136345 -8114835 -8079249 -8063835 -8023543 -7972635 -7945073 -7939164 -7917369
14026 -7917369 -7871778 -7859323 -7809843 -7770679 -7740857 -7692090 -7656565 -7647221 -7618790 -7577045 -7547208
14015 -7547208 -7514438 -7469439 -7478328 -7464682 -7410411 -7381580 -7360084 -7337156 -7283196 -7224031 -7191650
14004 -7191650 -7178062 -7179063 -7187960 -7289598 -7350891 -7412101 -7452012 -7415827 -7356160 -7295013 -7281023
13993 -7281023 -7262610 -7188776 -7143934 -7136470 -7107833 -7066999 -7025817 -6963495 -6947545 -6950440 -6942640 -6930427
13981 -6930427 -6882372 -6855066 -6839793 -6790443 -6751685 -6714310 -6701346 -6707237 -6684842 -6662594 -6638484
13970 -6638484 -6611088 -6569853 -6546240 -6513781 -6488550 -6479887 -6467632 -6453466 -6422124 -6398454 -6387568
13959 -6387568 -6379806 -6388672 -6391250 -6327995 -6276691 -6258169 -6209646 -6200823 -6196690 -6192420 -6170355 -6132390
13947 -6132390 -6107719 -6081515 -6069571 -6074894 -6062622 -6030385 -5999141 -6001620 -5976619 -5936050 -5928846 -5910086
13935 -5910086 -5875546 -5858517 -5857337 -5830881 -5838519 -5809552 -5771773 -5762999 -5727225 -5684678 -5672502 -5625174
13923 -5625174 -5598058 -5601892 -5584577 -5569099 -5550804 -5536679 -5495939 -5463398 -5437753 -5387980 -5348977
13912 -5348977 -5309810 -5251306 -5226926 -5144941 -5059417 -4948928 -4798074 -4686110 -4626072 -4710547 -4976167
13901 -4976167 -5357062 -5784828 -6109613 -6267933 -6330862 -6330715 -6249025 -6155421 -6045441 -5927480
13891 -5927480 -5839700 -5769975 -5724486 -5720900 -5689341 -5628749 -5595308 -5569102 -5545311 -5554682 -5573461 -5586997
13879 -5586997 -5638566 -5685403 -5705216 -5728428 -5715599 -5667779 -5604787 -5577527 -5544709 -5531842 -5490172
13868 -5490172 -5447384 -5456028 -5432845 -5411991 -5415168 -5370769 -5323291 -5317660 -5277267 -5293524 -5266116 -5242491
13856 -5242491 -5237281 -5210057 -5181711 -5178794 -5159581 -5122995 -5105832 -5088169 -5106039 -5081265 -5020499 -4981930
13844 -4981930 -4981846 -4996882 -4965079 -4928926 -4924916 -4918210 -4896586 -4875081 -4886558 -4866352 -4831716 -4809628
13832 -4809628 -4802009 -4760179 -4695863 -4694345 -4703598 -4658315 -4605770 -4565206 -4504878 -4407259 -4347212 -4328281
13820 -4328281 -4293108 -4248574 -4194642 -4153447 -4085522 -4022665 -3971727 -3913323 -3930699 -3978615 -4077288
13809 -4077288 -4227053 -4357350 -4515273 -4710534 -4873848 -5036855 -5185321 -5340151 -5444797
13800 -5444797 -5480461 -5465419 -5435486 -5370915 -5305721 -5233030 -5158539 -5091151 -5023883 -4999238 -4944453
13789 -4944453 -4898550 -4875875 -4836118 -4827657 -4804113 -4767758 -4756625 -4727140 -4681759 -4618016 -4602981
13778 -4602981 -4599326 -4633552 -4605387 -4575766 -4552174 -4535394 -4509174 -4484563 -4482628 -4503833 -4527422 -4524924
13766 -4524924 -4493324 -4444107 -4385452 -4372325 -4371820 -4344370 -4298325 -4276657 -4267047 -4240434 -4208273 -4168116
13754 -4168116 -4181418 -4196068 -4202014 -4198812 -4147774 -4104999 -4096317 -4105933 -4080745 -4078198 -4074272 -4051020
13742 -4051020 -4063509 -4084506 -4079239 -4082645 -4072785 -4062389 -4031886 -4002217 -3969826 -3926900 -3946784 -3957747
13730 -3957747 -3920897 -3892433 -3845881 -3839149 -3807479 -3731212 -3718139 -3749690 -3768111 -3769581 -3733823 -3699317
13718 -3699317 -3668998 -3636691 -3628832 -3597045 -3589673 -3604103 -3563543 -3530915 -3485073 -3447832 -3394574 -3349185
13706 -3349185 -3294016 -3237101 -3179994 -3135465 -3108234 -3107174 -3098835 -3069378 -3035270 -3010461 -2973154 -2921138
13694 -2921138 -2881345 -2853323 -2867517 -2876597 -2862125 -2870948 -2887746 -2889651 -2878131 -2833632 -2764406 -2680737
13682 -2680737 -2599354 -2514705 -2408268 -2304168 -2178932 -2021563 -1895823 -1754296 -1610672 -1464914
13672 -1464914 -1309239 -1138414 -917312 -623171 -253984 148408 424649 463968 124815 -525738
13662 -525738 -1358113 -2306835 -3339484 -4425753 -5502777 -6362846 -6852667 -6951191 -6798577
13653 -6798577 -6489139 -6116175 -5724312 -5321980 -4923031 -4542721 -4168331 -3858189 -3642575
13644 -3642575 -3584748 -3738041 -4084463 -4493090 -4974646 -5514112 -6116183 -6639258 -7016606 -7232660
13634 -7232660 -7260325 -7151057 -6956134 -6726474 -6509056 -6325207 -6173072 -6033092 -5882335 -5775794
13624 -5775794 -5682341 -5628902 -5623801 -5621081 -5667989 -5658256 -5603296 -5537399 -5465060 -5431809 -5392938 -5339018
13612 -5339018 -5268218 -5248123 -5203582 -5135205 -5047437 -5011109 -4985044 -4985733 -4955561 -4893827 -4852971 -4820185
13600 -4820185 -4805659 -4804579 -4779082 -4733593 -4697926 -4697270 -4688746 -4691005 -4681992 -4648802 -4588793 -4556679
13588 -4556679 -4550288 -4532772 -4524764 -4525353 -4475577 -4457467 -4451105 -4461711 -4431834 -4374806 -4345924 -4309959
13576 -4309959 -4292408 -4306465 -4291897 -4287029 -4284248 -4290860 -4300940 -4301082 -4289071 -4262911 -4254868 -4249609 -4227439
13563 -4227439 -4209434 -4184789 -4150115 -4166443 -4146722 -4129459 -4140830 -4107361 -4064212 -4055143 -4058005 -4043627
13551 -4043627 -4026623 -4030335 -4041943 -4047961 -4048334 -4030434 -4011188 -3956236 -3943360 -3978366 -3992084 -3971363
13539 -3971363 -3940387 -3926964 -3925983 -3934283 -3939845 -3914977 -3903155 -3920289 -3938933 -3908048 -3883763 -3862416
13527 -3862416 -3871294 -3876520 -3835787 -3811352 -3804915 -3804969 -3817619 -3842752 -3828790 -3818821 -3842092 -3869037 -3843511
13514 -3843511 -3827459 -3824547 -3816306 -3791253 -3774369 -3745062 -3715582 -3728008 -3747402 -3727373 -3712282 -3726332
13502 -3726332 -3718906 -3690995 -3664934 -3640724 -3646401 -3676335 -3690748 -3677832 -3706021 -3712598 -3669912 -3645770
13490 -3645770 -3632331 -3611947 -3622648 -3623118 -3599294 -3574562 -3585876 -3582697 -3591600 -3600460 -3628252 -3615658
13478 -3615658 -3598842 -3585048 -3570004 -3592350 -3580834 -3539639 -3544151 -3565512 -3565421 -3537965 -3518828 -3529095
13466 -3529095 -3526474 -3512409 -3518663 -3506412 -3524321 -3554886 -3546360 -3506636 -3509355 -3495808 -3464255 -3477496
13454 -3477496 -3474664 -3436050 -3439421 -3475922 -3469821 -3474791 -3479328 -3456624 -3467060 -3464968 -3466755 -3476228 -3461204
13441 -3461204 -3447349 -3404525 -3364043 -3375292 -3401966 -3402282 -3398247 -3374394 -3357277 -3355728 -3360848 -3369487
13429 -3369487 -3359365 -3333763 -3342318 -3371466 -3364137 -3338815 -3316408 -3294415 -3296584 -3307620 -3332690 -3372739
13417 -3372739 -3361253 -3370244 -3320266 -3290629 -3272614 -3262735 -3241456 -3267467 -3283089 -3276059 -3268434 -3275676
13405 -3275676 -3273776 -3270985 -3288136 -3285744 -3264062 -3237463 -3197224 -3200002 -3206413 -3219074 -3221430 -3247203
13393 -3247203 -3224369 -3223895 -3240750 -3255569 -3279821 -3256458 -3239239 -3215025 -3182857 -3147343 -3138144 -3164515
13381 -3164515 -3196500 -3194449 -3196348 -3215170 -3206275 -3195048 -3193152 -3189971 -3161417 -3187078 -3163444 -3117657
13369 -3117657 -3128817 -3114036 -3124400 -3139358 -3159166 -3175567 -3167919 -3165407 -3187045 -3158316 -3134445 -3132854
13357 -3132854 -3128817 -3091242 -3065163 -3087665 -3088682 -3074414 -3059753 -3053440 -3069452 -3071792 -3092150 -3131242
13345 -3131242 -3122832 -3140575 -3140614 -3132497 -3100153 -3071433 -3058750 -3078047 -3111676 -3127115 -3101737 -3097430
13333 -3097430 -3084370 -3039942 -3022708 -3036952 -3013159 -3015933 -3023179 -3035040 -3046747 -3018787 -2978790 -2950274
13321 -2950274 -2935988 -2958925 -2964029 -2975897 -2951839 -2933556 -2938620 -2955782 -2961198 -2972060 -2985068 -2973297
13309 -2973297 -2983097 -2965724 -2954725 -2991588 -2985285 -2975730 -2951381 -2957157 -2924897 -2905194 -2907794 -2917292
13297 -2917292 -2939119 -2931057 -2934473 -2919809 -2917289 -2904442 -2857644 -2851271 -2830743 -2827778 -2865405 -2879092
13285 -2879092 -2870331 -2865928 -2852266 -2842568 -2861865 -2900045 -2917605 -2916989 -2930267 -2927878 -2902333 -2918777
13273 -2918777 -2913719 -2889918 -2882650 -2873326 -2830571 -2825596 -2833158 -2833476 -2833361 -2823393 -2792727 -2778138 -2791295
13260 -2791295 -2811085 -2823779 -2860336 -2859603 -2833205 -2836424 -2839194 -2833222 -2808114 -2778715 -2766923 -2790269
13248 -2790269 -2814431 -2814056 -2773596 -2771346 -2796426 -2806852 -2818865 -2801517 -2766214 -2757945 -2748777 -2751802
13236 -2751802 -2773403 -2777895 -2756120 -2755444 -2740370 -2706593 -2696418 -2693135 -2745493 -2763297 -2742647 -2733023
13224 -2733023 -2743635 -2730059 -2724051 -2738765 -2755036 -2754808 -2725713 -2765023 -2787865 -2741250 -2733179 -2703762
13212 -2703762 -2683257 -2681203 -2688016 -2700883 -2712730 -2684522 -2660274 -2660495 -2667821 -2672602 -2678626 -2698482 -2708108
13199 -2708108 -2673098 -2641161 -2626608 -2628275 -2669276 -2681930 -2672587 -2669833 -2665620 -2695233 -2680985 -2637249
13187 -2637249 -2629174 -2656634 -2636339 -2626704 -2637170 -2623302 -2635060 -2631371 -2643849 -2652158 -2627239 -2623177
13175 -2623177 -2644061 -2615277 -2604385 -2579380 -2583395 -2614422 -2632634 -2616133 -2603069 -2610813 -2626411 -2610813
13163 -2610813 -2612400 -2563135 -2555128 -2573529 -2563835 -2572300 -2599426 -2615534 -2631052 -2664620 -2659765 -2628076
13151 -2628076 -2629264 -2622052 -2588978 -2600149 -2614281 -2621138 -2609142 -2594087 -2561931 -2573461 -2561516 -2524683
13139 -2524683 -2512455 -2515480 -2547005 -2544422 -2529952 -2550071 -2535754 -2533543 -2513037 -2520680 -2513732 -2516928
13127 -2516928 -2525348 -2527642 -2543751 -2555582 -2567183 -2502446 -2464244 -2474046 -2493154 -2512758 -2562532 -2572186
13115 -2572186 -2554016 -2519876 -2517986 -2511614 -2510073 -2533941 -2537007 -2522274 -2491402 -2465577 -2460178 -2467501
13103 -2467501 -2478864 -2480058 -2456754 -2449891 -2459084 -2472472 -2472356 -2449884 -2442448 -2486182 -2509260 -2481122
13091 -2481122 -2481669 -2469160 -2430096 -2445793 -2470509 -2461701 -2445604 -2428080 -2441510 -2477664 -2475922 -2470971
13079 -2470971 -2482974 -2480458 -2444736 -2414276 -2405016 -2431807 -2474539 -2478138 -2472523 -2448320 -2439652 -2442206
13067 -2442206 -2429790 -2450044 -2475027 -2468828 -2471101 -2473337 -2444356 -2384946 -2364487 -2377360 -2373656 -2386680
13055 -2386680 -2389898 -2355281 -2322991 -2335660 -2363993 -2365896 -2360617 -2375437 -2388545 -2381440 -2371312 -2369178
13043 -2369178 -2365702 -2359853 -2347826 -2340048 -2343419 -2384048 -2386855 -2400180 -2398225 -2397455 -2357231 -2328714 -2362269
13030 -2362269 -2382488 -2381920 -2389457 -2395717 -2354324 -2330029 -2281363 -2289097 -2312107 -2323999 -2312671 -2304926
13018 -2304926 -2296794 -2310686 -2307774 -2284251 -2265767 -2286162 -2300632 -2297624 -2286561 -2305270 -2298261 -2285434
13006 -2285434 -2302669 -2313453 -2324099 -2289436 -2291982 -2306454 -2298559 -2310158 -2308188 -2285371 -2289054 -2238277
12994 -2238277 -2223927 -2243830 -2259396 -2281777 -2291677 -2278194 -2271434 -2294055 -2310877 -2298857 -2284997 -2283654
12982 -2283654 -2275286 -2219027 -2201449 -2206001 -2213629 -2222602 -2224739 -2239966 -2255812 -2263377 -2263449 -2233159 -2236559
12969 -2236559 -2248636 -2247098 -2222571 -2194593 -2211663 -2219200 -2215147 -2224721 -2229225 -2240139 -2244474 -2216281
12957 -2216281 -2193217 -2198483 -2188461 -2185782 -2176529 -2168894 -2165025 -2176453 -2205077 -2184726 -2195494 -2195617 -2178579
12944 -2178579 -2201896 -2205885 -2184494 -2197136 -2178607 -2162110 -2168298 -2179635 -2158371 -2171118 -2175369 -2188110
12932 -2188110 -2193552 -2188821 -2191089 -2166260 -2134943 -2116533 -2107675 -2116295 -2121013 -2122112 -2165887 -2197151 -2157840
12919 -2157840 -2123406 -2108002 -2128699 -2156532 -2154176 -2138865 -2119612 -2118250 -2146134 -2159663 -2151940 -2134177
12907 -2134177 -2125009 -2132179 -2140529 -2152873 -2141822 -2123571 -2112647 -2121894 -2136704 -2148976 -2146611 -2138820
12895 -2138820 -2118899 -2084514 -2098765 -2106728 -2107559 -2110062 -2117576 -2119941 -2124870 -2109697 -2081774 -2065135 -2066646
12882 -2066646 -2088945 -2074611 -2073693 -2075536 -2083010 -2077026 -2070197 -2062300 -2039275 -2027495 -2048428 -2065438 -2065644
12869 -2065644 -2066970 -2067846 -2053306 -2050506 -2063962 -2096714 -2097170 -2095717 -2085953 -2107761 -2107567 -2093776 -2058147
12856 -2058147 -2063926 -2046807 -2044015 -2046515 -2021195 -2014200 -2015559 -2002313 -2017961 -2028331 -2025303 -1993827
12844 -1993827 -1993045 -2010082 -2012496 -2017398 -2037498 -2055472 -2023973 -1962013 -1982858 -2025725 -2042038 -2024270
12832 -2024270 -2007381 -2010756 -2022010 -2021104 -1998380 -2000488 -2000169 -2021610 -2021368 -2002308 -1978617 -1962359 -1961951
12819 -1961951 -1951772 -1962401 -1984174 -1986263 -1976739 -1982509 -1951455 -1934374 -1936635 -1948093 -1931867 -1943379
12807 -1943379 -1943673 -1932932 -1933291 -1947317 -1965107 -1992570 -1978456 -1982038 -1999896 -1995966 -1997668 -1999694 -2014898
12794 -2014898 -1998659 -1956236 -1913927 -1902107 -1922238 -1966250 -1990879 -1968616 -1919571 -1896276 -1913011
12783 -1913011 -1921153 -1897651 -1850846 -1873470 -1857754 -1842308 -1883120 -1893174 -1905536 -1912096 -1922057 -1930091
12771 -1930091 -1956403 -1938207 -1904796 -1899203 -1906045 -1926217 -1923895 -1895368 -1877264 -1900975 -1910239 -1901646
12759 -1901646 -1892000 -1879722 -1885873 -1873525 -1867243 -1848613 -1849606 -1861005 -1856176 -1894252 -1897743 -1882630 -1891653
12746 -1891653 -1905347 -1892031 -1902337 -1897316 -1881361 -1873730 -1878299 -1883514 -1895115 -1915239 -1871143 -1875272
12734 -1875272 -1873401 -1884185 -1882033 -1888269 -1906672 -1892560 -1883578 -1872909 -1851852 -1856280 -1865814 -1875266 -1861226
12721 -1861226 -1873972 -1872196 -1814501 -1801538 -1805939 -1818195 -1815662 -1781819 -1786139 -1810592 -1827929 -1836789
12709 -1836789 -1838377 -1805330 -1818983 -1816751 -1820659 -1830704 -1827608 -1826455 -1798169 -1757716 -1780648 -1802312
12697 -1802312 -1799894 -1799258 -1784474 -1776285 -1782354 -1796197 -1803423 -1821455 -1825678 -1794652 -1796231 -1766576 -1745408
12684 -1745408 -1727217 -1764137 -1785270 -1750665 -1735068 -1766962 -1779147 -1791174 -1795401 -1765826 -1758183 -1760519
12672 -1760519 -1741838 -1722266 -1714844 -1728038 -1746846 -1749070 -1762092 -1775484 -1782730 -1779630 -1768382 -1769279
12660 -1769279 -1793217 -1804034 -1781849 -1768365 -1769480 -1715218 -1722693 -1727451 -1722960 -1738968 -1753820 -1751533
12648 -1751533 -1736001 -1733158 -1736545 -1737337 -1736131 -1706843 -1702453 -1711311 -1696632 -1676139 -1688448 -1671470 -1690149
12635 -1690149 -1700724 -1698968 -1714353 -1714753 -1717062 -1704598 -1700283 -1690636 -1684721 -1667056 -1659117 -1672747 -1676595
12622 -1676595 -1676195 -1644629 -1627104 -1648778 -1683497 -1696593 -1696825 -1722616 -1727752 -1691808 -1660987 -1621083
12610 -1621083 -1603477 -1632201 -1612286 -1625167 -1625399 -1615938 -1621181 -1662352 -1678418 -1678967 -1680149 -1664283 -1609394
12597 -1609394 -1595227 -1600418 -1625012 -1632091 -1642137 -1648055 -1634016 -1647112 -1645101 -1628348 -1611268 -1606894
12585 -1606894 -1617640 -1615534 -1585147 -1584994 -1606919 -1593742 -1567704 -1593014 -1609205 -1590600 -1613397 -1620460
12573 -1620460 -1580499 -1558981 -1566203 -1546627 -1509258 -1482236 -1509151 -1534962 -1547515 -1561938 -1591207
12562 -1591207 -1600697 -1620245 -1642945 -1647396 -1653764 -1652267 -1624518 -1632642 -1627435 -1631203 -1610467 -1620072 -1613121
12549 -1613121 -1585672 -1580193 -1578202 -1586590 -1574233 -1558975 -1599032 -1608841 -1583843 -1573507 -1561049 -1547799
12537 -1547799 -1559115 -1551392 -1553332 -1551377 -1542861 -1544287 -1568826 -1582163 -1570083 -1511721 -1465468 -1469717
12525 -1469717 -1494894 -1515805 -1535386 -1556141 -1544987 -1513714 -1499564 -1523098 -1538556 -1547397 -1525261
12514 -1525261 -1523889 -1519103 -1503076 -1489896 -1455772 -1458589 -1481758 -1489189 -1488045 -1509152 -1487100 -1472501
12502 -1472501 -1455391 -1469778 -1485447 -1492699 -1491359 -1438485 -1438408 -1421195 -1453320 -1480072 -1488962 -1508614
12490 -1508614 -1494083 -1477303 -1471009 -1479621 -1491736 -1485432 -1496962 -1509853 -1476956 -1439329 -1454203 -1457948
12478 -1457948 -1469616 -1487860 -1480678 -1511568 -1522420 -1506790 -1498638 -1495740 -1506150 -1494884 -1444002 -1421335
12466 -1421335 -1432800 -1422098 -1429483 -1417198 -1413907 -1422004 -1428616 -1401107 -1400849 -1421253 -1394244 -1402613 -1452196
12453 -1452196 -1468403 -1479790 -1472266 -1497800 -1501567 -1461243 -1478288 -1506608 -1486262 -1448667 -1441218 -1442218
12441 -1442218 -1444168 -1444182 -1410162 -1399902 -1405971 -1417076 -1429001 -1425523 -1437712 -1419973 -1413561 -1416663 -1413882
12428 -1413882 -1409461 -1400373 -1404883 -1401612 -1373864 -1367162 -1386254 -1401475 -1402735 -1383379 -1359426 -1371527
12416 -1371527 -1360611 -1365896 -1368898 -1360608 -1349292 -1365870 -1404584 -1425840 -1422414 -1400599 -1378874 -1370691
12404 -1370691 -1348858 -1332241 -1289963 -1292201 -1316420 -1292173 -1270171 -1260473 -1278736 -1302557 -1312650 -1307224
12392 -1307224 -1321904 -1316137 -1294910 -1268199 -1277541 -1269418 -1259057 -1241293 -1210318 -1223878 -1227575 -1220100
12380 -1220100 -1222043 -1229421 -1227314 -1220514 -1215501 -1237435 -1222462 -1215479 -1207520 -1215615 -1211041 -1177584 -1166481
12367 -1166481 -1167333 -1236801 -1253786 -1264727 -1262503 -1203041 -1201879 -1210923 -1205035 -1194820 -1183896 -1208230
12355 -1208230 -1208325 -1189055 -1171199 -1171576 -1173908 -1164183 -1156127 -1145034 -1158144 -1156125 -1150763 -1134959 -1124515
12342 -1124515 -1159752 -1183529 -1197733 -1192664 -1190578 -1157641 -1107210 -1066483 -1059769 -1075069 -1072996 -1076210
12330 -1076210 -1075626 -1058263 -1057776 -1052030 -1050326 -1047846 -1050415 -1073044 -1088755 -1065452 -1050942 -1047614 -1045753
12317 -1045753 -1026021 -1021760 -1044007 -1034274 -1032474 -1026268 -1021503 -992556 -978113 -1014473 -1050707 -1074961
12305 -1074961 -1056740 -1032423 -1023519 -994815 -994291 -983039 -950370 -943269 -921610 -911992 -941949 -958861
12293 -958861 -950402 -953655 -950750 -956032 -935222 -948667 -938838 -920393 -883570 -872963 -855915 -853799 -821855
12280 -821855 -789582 -790615 -786314 -792222 -781900 -788120 -770458 -708658 -669437 -634924 -622417 -633351
12268 -633351 -631601 -609149 -550063 -514828 -504468 -487249 -472525 -367131 -281789 -208047 -137068
12257 -137068 -30146 133387 298699 432378 298322 -383414 -1151423 -1519817 -1747587 -1899297
12247 -1899297 -1836528 -1720289 -1617977 -1506767 -1429239 -1344110 -1339091 -1343365 -1320979 -1298085 -1246100
12236 -1246100 -1194411 -1134241 -1084437 -1029617 -1004561 -1015799 -1019533 -976251 -935848 -949985 -943001 -885486
12224 -885486 -889182 -894863 -890533 -858139 -818903 -807068 -769757 -763411 -754348 -744393 -725908 -715456 -723197
12211 -723197 -716823 -680397 -658463 -625529 -613515 -636862 -637361 -609138 -610759 -585044 -587997 -544997
12199 -544997 -519347 -494683 -457849 -431390 -403600 -401201 -419860 -408796 -386255 -366476 -338030 -285331
12187 -285331 -244509 -208817 -200676 -199637 -181532 -150310 -114896 -170265 -243693 -260734 -261566 -258675
12175 -258675 -244916 -217039 -187564 -152306 -121322 -105624 -81943 -29341 -14483 5331 34654
12164 34654 109808 150907 180382 233160 241787 266542 299883 331921 355010 407222 465745 530441
12152 530441 606387 614626 648286 702734 782543 867687 974324 1081476 1123278 1171864 1259321
12141 1259321 1352395 1452917 1582580 1744386 1903171 2027613 2173449 2347237 2565200 2809970
12131 2809970 3020326 3074782 2981407 3057518 3271858 3540653 3874722 4344512 4909298 5560775
12121 5560775 6370220 7491737 8889689 10184256 10013055 5568249 -896749 -4015983
12113 -4015983 -5603569 -6921147 -7080567 -6736573 -7065748 -7129333 -6794676 -6531554 -6229315
12104 -6229315 -5725276 -5180461 -4694795 -4315877 -4060363 -3903700 -3713316 -3498378 -3294748
12095 -3294748 -3093134 -2927772 -2778986 -2626527 -2483039 -2329301 -2186167 -2036309 -1899487
12086 -1899487 -1737178 -1581125 -1427662 -1273832 -1108766 -943794 -769090 -628588 -511644
12077 -511644 -375763 -180532 39741 231704 447779 769724 1162304 1634378 2211286 2932147
12067 2932147 3646506 3686946 1825819 -1532055 -3920230 -5058214 -5777504 -5989771 -5570171
12058 -5570171 -4958650 -4397393 -3907914 -3536171 -3231753 -2922439 -2651994 -2413117 -2180689
12049 -2180689 -1943371 -1731920 -1541991 -1378505 -1224423 -1174749 -1185900 -1129097 -1018040 -885827
12039 -885827 -774152 -638508 -495964 -374513 -272226 -126186 31820 110550 303526 625959
12029 625959 907110 917124 305461 -576386 -921824 -961771 -904583 -604209 -78847 570916
12019 570916 1245540 1964272 2837052 3936333 5274498 6525956 6373088 2603499 -3483425
12010 -3483425 -7385802 -9248487 -10410116 -10760458 -10404664 -9776680 -9203728 -8744451 -8277790
12001 -8277790 -7811590 -7370502 -6930900 -6554354 -6195397 -5894902 -5646983 -5450561 -5287134
11992 -5287134 -5116957 -4937053 -4823229 -4884918 -5029295 -5100302 -5085518 -5007123 -4924930 -4812150
11982 -4812150 -4685994 -4611242 -4496468 -4376854 -4276996 -4200733 -4134908 -4050495 -3955321 -3874348 -3799332
11971 -3799332 -3778218 -3794293 -3780485 -3731541 -3651374 -3582875 -3546833 -3511823 -3456595 -3398481 -3372077
11960 -3372077 -3381083 -3404130 -3425107 -3402578 -3391112 -3382087 -3343950 -3305125 -3265724 -3211838 -3130526 -3089568
11948 -3089568 -3088693 -3093125 -3054115 -3014273 -3002756 -2967102 -2968977 -2980694 -2998368 -3003829 -2988091 -2945410
11936 -2945410 -2917048 -2910405 -2895786 -2906006 -2912888 -2889320 -2884280 -2882715 -2891116 -2881002 -2871096 -2872104 -2834970
11923 -2834970 -2783893 -2755093 -2748798 -2778199 -2775997 -2754943 -2753320 -2789113 -2789484 -2775713 -2754352 -2731035
11911 -2731035 -2694206 -2674335 -2656907 -2641996 -2639186 -2649377 -2644573 -2649456 -2675157 -2669151 -2652814 -2610791
11899 -2610791 -2558184 -2497558 -2487388 -2472775 -2460692 -2461901 -2486720 -2484450 -2483257 -2502329 -2545852 -2541337
11887 -2541337 -2526218 -2505763 -2496354 -2494828 -2467997 -2458974 -2485877 -2492170 -2481814 -2504800 -2485029 -2439308
11875 -2439308 -2421208 -2424535 -2433894 -2436023 -2445042 -2447503 -2452433 -2448456 -2429964 -2398867 -2383161 -2388911 -2388158
11862 -2388158 -2382487 -2375417 -2386420 -2419501 -2389562 -2346752 -2292640 -2275803 -2294271 -2306135 -2292400 -2287271
11850 -2287271 -2288023 -2326961 -2346787 -2350671 -2362236 -2346457 -2344311 -2367034 -2355670 -2338054 -2315249 -2265556
11838 -2265556 -2249311 -2210196 -2164465 -2181524 -2218226 -2286456 -2326271 -2329937 -2350158 -2349911 -2324981 -2320516
11826 -2320516 -2318337 -2302839 -2299406 -2286407 -2275523 -2241554 -2236173 -2238110 -2205211 -2202156 -2206578 -2220337
11814 -2220337 -2210266 -2178141 -2146246 -2130975 -2126595 -2172020 -2183646 -2165036 -2152259 -2154238 -2130548 -2138886
11802 -2138886 -2155701 -2157361 -2116761 -2093586 -2080838 -2082309 -2076742 -2108783 -2135739 -2123575 -2120473 -2123707
11790 -2123707 -2133054 -2125581 -2119370 -2127589 -2114635 -2105975 -2088869 -2075328 -2043286 -2023736 -2041236 -2053626
11778 -2053626 -2029666 -2025150 -2027343 -2025645 -2013423 -2017616 -2048376 -2037168 -1995094 -1991585 -1994707 -2014678
11766 -2014678 -1987688 -1978400 -2007231 -2022207 -2027682 -2016708 -2014133 -2002800 -1999172 -1997526 -1985573 -1991240
11754 -1991240 -1995889 -1962184 -1957441 -1989279 -1994648 -1999410 -2024862 -2032056 -1998022 -1958981 -1927285 -1931791
11742 -1931791 -1954368 -1930819 -1941193 -1949846 -1966884 -1958236 -1930310 -1931469 -1949322 -1981449 -1987180 -1969525
11730 -1969525 -1982799 -1967147 -1949318 -1943442 -1945138 -1923174 -1933102 -1946574 -1920974 -1935818 -1933768 -1921836
11718 -1921836 -1898487 -1907443 -1937831 -1919171 -1909586 -1913675 -1913936 -1898100 -1899557 -1884844 -1850419 -1866646
11706 -1866646 -1877938 -1903124 -1891965 -1862214 -1875856 -1887090 -1896874 -1896890 -1885049 -1889006 -1881532 -1907202
11694 -1907202 -1910949 -1901643 -1898179 -1894033 -1921145 -1914482 -1915313 -1932887 -1912097 -1881889 -1865716 -1857712 -1895377
11681 -1895377 -1907969 -1897974 -1875568 -1832887 -1816647 -1844171 -1857092 -1845151 -1828352 -1806695 -1747023
11670 -1747023 -1707015 -1726559 -1769720 -1786761 -1784830 -1764561 -1740555 -1725265 -1736997 -1759669 -1785645
11659 -1785645 -1807563 -1813606 -1827763 -1826365 -1807920 -1793560 -1805020 -1793868 -1777648 -1784805 -1785564 -1782955
11647 -1782955 -1809956 -1794361 -1783121 -1776372 -1774867 -1784336 -1799269 -1808569 -1792731 -1796526 -1779419 -1777734
11635 -1777734 -1765235 -1742889 -1756154 -1774851 -1765472 -1788785 -1782399 -1770092 -1751483 -1734296 -1738641 -1757831
11623 -1757831 -1775948 -1803173 -1764630 -1743711 -1757101 -1771296 -1751079 -1745018 -1728295 -1730455 -1723558 -1712175
11611 -1712175 -1714668 -1704407 -1683219 -1711686 -1713313 -1699876 -1730049 -1744887 -1763203 -1756847 -1740880 -1738445
11599 -1738445 -1731192 -1716336 -1717293 -1724457 -1724155 -1743131 -1743175 -1737371 -1740309 -1720049 -1732533 -1707653 -1704392 -1725051
11585 -1725051 -1690868 -1671543 -1695273 -1700957 -1691830 -1684192 -1654916 -1645267 -1635955 -1628836 -1652836 -1666057
11573 -1666057 -1658175 -1680809 -1708984 -1677438 -1650918 -1642206 -1623256 -1595495 -1588952 -1571853 -1572635 -1659607
11561 -1659607 -1701335 -1694848 -1736386 -1760306 -1748938 -1757487 -1757380 -1731073 -1711117 -1692521 -1681543 -1686093
11549 -1686093 -1686426 -1679871 -1681898 -1659770 -1681757 -1681552 -1659123 -1654747 -1653061 -1658504 -1647219 -1626291 -1606285
11536 -1606285 -1621776 -1665319 -1688251 -1692262 -1700486 -1691608 -1671677 -1660913 -1640721 -1643748 -1652355 -1648165
11524 -1648165 -1655452 -1651548 -1624880 -1609851 -1596567 -1587831 -1581031 -1577660 -1611198 -1633144 -1648753 -1654805
11512 -1654805 -1663274 -1659719 -1647412 -1632097 -1661182 -1670660 -1670368 -1658386 -1640313 -1628954 -1630988 -1599988
11500 -1599988 -1625893 -1656049 -1651889 -1631566 -1615285 -1607940 -1626111 -1652225 -1658952 -1643084 -1651995 -1670168
11488 -1670168 -1636565 -1614610 -1596690 -1616055 -1604763 -1593715 -1587639 -1596869 -1619155 -1605565 -1597156 -1594631
11476 -1594631 -1600517 -1592845 -1592001 -1578024 -1591282 -1611707 -1585305 -1585320 -1609271 -1621839 -1616498 -1610054 -1612509
11463 -1612509 -1604416 -1595132 -1584138 -1583475 -1586821 -1590875 -1584138 -1595553 -1580297 -1563499 -1559901 -1555113 -1553761
11450 -1553761 -1570168 -1580251 -1579924 -1573078 -1575479 -1556762 -1561623 -1568733 -1563778 -1568762 -1609050 -1635678 -1616866
11437 -1616866 -1582394 -1564771 -1561600 -1582379 -1585991 -1595559 -1594762 -1587599 -1557340 -1517974 -1499640 -1483340
11425 -1483340 -1474801 -1508493 -1543034 -1551139 -1528601 -1530272 -1531031 -1547558 -1557416 -1560554 -1536178 -1543165 -1560673
11412 -1560673 -1579755 -1558990 -1534186 -1524553 -1509459 -1496495 -1509029 -1515076 -1537590 -1545385 -1558448 -1566416
11400 -1566416 -1550316 -1522315 -1520537 -1534204 -1532862 -1531002 -1527606 -1509013 -1510271 -1508940 -1501462 -1521858 -1539351
11387 -1539351 -1533749 -1523323 -1524112 -1493766 -1493690 -1504727 -1508816 -1522669 -1550550 -1556116 -1549627 -1539525 -1515863
11374 -1515863 -1506251 -1503687 -1488680 -1477164 -1499507 -1490016 -1475206 -1486387 -1465761 -1443545 -1426855 -1462283
11362 -1462283 -1510120 -1517770 -1509906 -1500845 -1474861 -1478455 -1473014 -1475156 -1465417 -1506257 -1522484 -1503436 -1479480
11349 -1479480 -1489988 -1509565 -1517516 -1510300 -1484915 -1483856 -1489997 -1482983 -1489768 -1450849 -1447547 -1505765 -1513103
11336 -1513103 -1511786 -1501384 -1533392 -1541266 -1493501 -1464296 -1467775 -1450395 -1434086 -1442207 -1475381 -1499581
11324 -1499581 -1459001 -1419798 -1434002 -1437066 -1420075 -1468344 -1481538 -1468937 -1463061 -1433839 -1444978 -1437294
11312 -1437294 -1417257 -1427809 -1441196 -1414611 -1411465 -1435235 -1454766 -1478514 -1470199 -1447529 -1421021 -1402699
11300 -1402699 -1382107 -1363010 -1404906 -1416989 -1392643 -1369338 -1339575 -1307319 -1280001 -1298021 -1350555
11289 -1350555 -1393314 -1455382 -1512072 -1544017 -1538482 -1521378 -1490951 -1470792 -1468167 -1502050 -1489718 -1485373
11277 -1485373 -1512606 -1511405 -1536934 -1550205 -1524025 -1524750 -1493884 -1451611 -1418404 -1426722 -1439167 -1433310
11265 -1433310 -1455358 -1469882 -1471297 -1464716 -1456185 -1425522 -1422971 -1440270 -1434997 -1464454 -1465058 -1440473 -1429628
11252 -1429628 -1414487 -1404098 -1427314 -1467359 -1465831 -1450584 -1430091 -1442773 -1437269 -1418060 -1425704 -1457620
11240 -1457620 -1456680 -1455176 -1440193 -1427603 -1436045 -1432159 -1411117 -1404588 -1393386 -1386992 -1395122 -1392751 -1400420
11227 -1400420 -1420733 -1414553 -1403243 -1415369 -1427165 -1458122 -1466846 -1441169 -1430227 -1438623 -1463496 -1491977
11215 -1491977 -1452782 -1417293 -1388996 -1347745 -1350916 -1405186 -1417297 -1397508 -1380000 -1340349 -1310806
11204 -1310806 -1310836 -1327606 -1369092 -1382270 -1386717 -1389657 -1393802 -1413350 -1405384 -1404402 -1390366 -1406536 -1408924
11191 -1408924 -1376550 -1364059 -1380429 -1378455 -1338364 -1342757 -1334147 -1328303 -1344286 -1333721 -1309540 -1301846
11179 -1301846 -1290117 -1281444 -1332915 -1379002 -1407039 -1434850 -1416634 -1445007 -1449058 -1466043 -1487525 -1507794
11167 -1507794 -1521500 -1531938 -1533943 -1539056 -1513890 -1473754 -1444284 -1452887 -1452237 -1415043 -1402173 -1415569
11155 -1415569 -1443090 -1446550 -1456711 -1430064 -1443236 -1436792 -1426202 -1411307 -1416813 -1411361 -1416934 -1388239
11143 -1388239 -1398817 -1408776 -1410527 -1441726 -1429647 -1402754 -1380012 -1386278 -1384623 -1394657 -1409890 -1388417
11131 -1388417 -1402925 -1440196 -1436861 -1414306 -1392026 -1356272 -1305395 -1314498 -1355966 -1371811 -1366085 -1389851
11119 -1389851 -1429556 -1407475 -1386097 -1375012 -1387424 -1441780 -1447545 -1402008 -1373290 -1354613 -1360628 -1391383
11107 -1391383 -1413236 -1401614 -1378273 -1360310 -1377099 -1391318 -1396747 -1410927 -1398177 -1392641 -1386762 -1405591
11095 -1405591 -1394656 -1388519 -1395821 -1400686 -1417039 -1419725 -1398307 -1391263 -1412261 -1393111 -1338589 -1308256
11083 -1308256 -1317893 -1342728 -1347974 -1331407 -1334882 -1305724 -1305565 -1307994 -1318529 -1313951 -1308301 -1307720 -1311845
11070 -1311845 -1305989 -1335025 -1366270 -1370250 -1352803 -1373469 -1371761 -1388484 -1377324 -1385248 -1386270 -1368762
11058 -1368762 -1365601 -1362236 -1351790 -1356944 -1343788 -1358457 -1384314 -1371065 -1354148 -1357429 -1368067 -1328118
11046 -1328118 -1325270 -1337157 -1332344 -1334112 -1329601 -1319408 -1304262 -1295430 -1316253 -1316653 -1307510 -1316933 -1298391
11033 -1298391 -1293078 -1307356 -1342571 -1357580 -1333797 -1325531 -1312392 -1311418 -1287948 -1302590 -1317199 -1320351
11021 -1320351 -1322169 -1297606 -1272812 -1272519 -1283244 -1316705 -1313301 -1287037 -1262714 -1290434 -1316152 -1324745
11009 -1324745 -1345936 -1372770 -1358524 -1342133 -1341836 -1328837 -1311763 -1312679 -1326289 -1291948 -1310234 -1297100
10997 -1297100 -1278196 -1274378 -1301014 -1313731 -1337677 -1332569 -1312987 -1306593 -1330909 -1339954 -1301036 -1287973
10985 -1287973 -1316604 -1317690 -1326645 -1343238 -1347627 -1327590 -1291488 -1270493 -1268220 -1308469 -1323833 -1313343
10973 -1313343 -1301464 -1314125 -1301172 -1305419 -1317186 -1325497 -1313633 -1293054 -1308500 -1317932 -1293238 -1293890
10961 -1293890 -1284297 -1338012 -1327723 -1306459 -1292520 -1274861 -1287710 -1295517 -1308990 -1319159 -1291414 -1273022
10949 -1273022 -1261201 -1267442 -1280647 -1266378 -1269960 -1284293 -1299949 -1298027 -1314672 -1297054 -1267306 -1270955
10937 -1270955 -1274981 -1290402 -1277248 -1281295 -1277573 -1284713 -1307299 -1294016 -1284605 -1279711 -1254085 -1259809 -1265631
10924 -1265631 -1267004 -1272629 -1247916 -1239308 -1263911 -1293443 -1289643 -1284951 -1274654 -1261956 -1266508 -1279722
10912 -1279722 -1286295 -1303219 -1327999 -1334842 -1309689 -1265968 -1216035 -1214855 -1248687 -1238659 -1243549 -1264084
10900 -1264084 -1263051 -1239356 -1261244 -1278852 -1297247 -1307589 -1306112 -1278351 -1259930 -1245390 -1213898 -1209411
10888 -1209411 -1229290 -1258513 -1265356 -1279452 -1268191 -1276774 -1274221 -1256369 -1257920 -1262628 -1250757 -1247044
10876 -1247044 -1248154 -1217168 -1216803 -1248833 -1252976 -1242731 -1233593 -1225786 -1229954 -1229522 -1257176 -1257364 -1253316 -1287904
10862 -1287904 -1309347 -1295991 -1293693 -1268494 -1259884 -1240895 -1215508 -1232956 -1259442 -1266436 -1279595 -1244356
10850 -1244356 -1212834 -1200544 -1196348 -1223287 -1265219 -1279574 -1289986 -1307569 -1298963 -1271005 -1243582 -1240436
10838 -1240436 -1210532 -1177208 -1193300 -1234257 -1260636 -1252021 -1261368 -1239866 -1228436 -1242855 -1239461 -1238441
10826 -1238441 -1260615 -1232533 -1215125 -1229363 -1210741 -1212520 -1218159 -1194217 -1197092 -1209753 -1199350 -1199699
10814 -1199699 -1224462 -1279701 -1247549 -1220117 -1214706 -1198188 -1217067 -1249697 -1252679 -1233866 -1249996 -1240541
10802 -1240541 -1221368 -1190403 -1199888 -1212704 -1244975 -1260902 -1242037 -1202646 -1161602 -1153077 -1191717 -1204526
10790 -1204526 -1257333 -1294924 -1316963 -1325589 -1296130 -1268647 -1236731 -1225800 -1239903 -1238883 -1223530 -1191361
10778 -1191361 -1151653 -1167618 -1162672 -1187666 -1210778 -1227609 -1212582 -1206675 -1206409 -1204744 -1211142 -1219719 -1198013
10765 -1198013 -1179246 -1172080 -1169010 -1190208 -1200448 -1206198 -1197471 -1210215 -1222640 -1212841 -1203630 -1178470
10753 -1178470 -1173626 -1213051 -1214970 -1204351 -1170002 -1179562 -1210254 -1213402 -1185419 -1168393 -1173045 -1179608
10741 -1179608 -1187193 -1185986 -1160867 -1156444 -1185782 -1191844 -1200016 -1214139 -1182743 -1164417 -1150745 -1159386
10729 -1159386 -1189649 -1175289 -1160762 -1170608 -1173941 -1166144 -1170176 -1176795 -1201305 -1190894 -1173994 -1167220
10717 -1167220 -1172611 -1183822 -1174193 -1154892 -1160771 -1149713 -1152299 -1159701 -1187408 -1179307 -1169518 -1186065 -1199225
10704 -1199225 -1189471 -1177392 -1140077 -1139213 -1168706 -1191044 -1202006 -1193791 -1162626 -1189271 -1227071 -1227138 -1210457
10691 -1210457 -1181208 -1162073 -1187585 -1197066 -1210336 -1197080 -1186797 -1198048 -1196876 -1193490 -1205231 -1204359
10679 -1204359 -1213741 -1217726 -1204067 -1183834 -1153768 -1143298 -1150770 -1167012 -1167806 -1167566 -1185774 -1154541 -1144510
10666 -1144510 -1154838 -1148800 -1146588 -1151710 -1158267 -1187904 -1171902 -1136040 -1114444 -1125601 -1132423 -1142534
10654 -1142534 -1147829 -1152416 -1144105 -1125645 -1142177 -1149010 -1156967 -1164124 -1174103 -1161833 -1150265 -1137292 -1135693
10641 -1135693 -1134966 -1135178 -1138303 -1150089 -1152430 -1161944 -1167001 -1162647 -1160649 -1158948 -1143169 -1116414 -1124539 -1128198
10627 -1128198 -1120991 -1099003 -1115149 -1137610 -1130783 -1115837 -1141211 -1158115 -1162075 -1172074 -1184822 -1185545
10615 -1185545 -1200748 -1211160 -1204905 -1165439 -1155857 -1153913 -1142911 -1165592 -1180844 -1202432 -1172745 -1155865
10603 -1155865 -1154633 -1145034 -1136049 -1142952 -1145342 -1159313 -1174126 -1146836 -1133042 -1146402 -1171140 -1185984
10591 -1185984 -1186540 -1178005 -1165087 -1149910 -1134933 -1153494 -1148748 -1113714 -1102632 -1156283 -1159824 -1153507
10579 -1153507 -1162378 -1142481 -1122628 -1156415 -1161543 -1160342 -1146958 -1146885 -1162651 -1171911 -1162682 -1147200 -1149333
10566 -1149333 -1157723 -1141136 -1152369 -1142631 -1140452 -1144589 -1150980 -1150266 -1145262 -1139639 -1135756 -1141900 -1141175 -1133110
10552 -1133110 -1147500 -1150974 -1152330 -1150730 -1124567 -1114275 -1104199 -1124053 -1147340 -1159023 -1170107 -1177350
10540 -1177350 -1142191 -1147002 -1144508 -1150073 -1176187 -1160469 -1136021 -1109060 -1107380 -1111727 -1131883 -1132911
10528 -1132911 -1110961 -1101912 -1107051 -1139863 -1138097 -1112220 -1102362 -1084991 -1073676 -1094935 -1124565 -1134878
10516 -1134878 -1111586 -1078518 -1084414 -1091991 -1088906 -1091758 -1108784 -1102547 -1091400 -1100789 -1140073 -1136389 -1117829
10503 -1117829 -1103515 -1106483 -1127983 -1101588 -1085667 -1089503 -1087825 -1088252 -1084646 -1084904 -1091086 -1069194 -1088068
10490 -1088068 -1104549 -1119167 -1122945 -1091339 -1111088 -1110140 -1093297 -1111838 -1110941 -1090823 -1093283 -1073941
10478 -1073941 -1080491 -1087231 -1084595 -1068402 -1044725 -1021647 -1045057 -1113423 -1123607 -1102558 -1097703 -1113051
10466 -1113051 -1119091 -1137278 -1138734 -1120237 -1123371 -1132077 -1125247 -1102770 -1082433 -1052807 -1084234 -1120767
10454 -1120767 -1127305 -1143111 -1141618 -1139213 -1136101 -1120262 -1142767 -1142689 -1116314 -1120760 -1114164 -1136476 -1127516
10441 -1127516 -1118651 -1090250 -1092249 -1098637 -1084263 -1064409 -1072953 -1097273 -1068248 -1074748 -1107420 -1096153
10429 -1096153 -1075983 -1090036 -1107917 -1116637 -1109887 -1124499 -1138745 -1123596 -1130559 -1128113 -1128137 -1128560 -1126803
10416 -1126803 -1129735 -1121906 -1071398 -1044447 -1042099 -1051432 -1052651 -1038244 -1039706 -1033429 -1039564 -1045997 -1064744
10403 -1064744 -1051178 -1036636 -1041820 -1073370 -1085714 -1099833 -1073169 -1036622 -1053726 -1062686 -1040252 -1044782
10391 -1044782 -1026134 -1013623 -1032344 -1045830 -1041325 -1067504 -1065310 -1074577 -1075241 -1081926 -1094381 -1073701
10379 -1073701 -1063966 -1083704 -1094369 -1099434 -1106610 -1101031 -1084742 -1077719 -1087049 -1084416 -1048479 -1032127 -1045528
10366 -1045528 -1045953 -1031948 -1055328 -1037773 -1014671 -1005157 -1003226 -1014684 -1032918 -1050154 -1050169 -1075855 -1086651
10353 -1086651 -1066949 -1035539 -1027292 -1044800 -1046515 -1018547 -1012282 -1004853 -1015441 -1004345 -1019316 -1024095
10341 -1024095 -1034386 -1041692 -1010821 -1009273 -1010052 -1021487 -1024483 -1044929 -1042686 -1056308 -1062754 -1021925 -1001321
10328 -1001321 -988103 -987867 -993204 -995634 -957325 -957073 -985916 -1030569 -1052018 -1027867 -995380 -1001589 -1004753
10315 -1004753 -1003453 -1011986 -1020135 -1035432 -1032241 -1034740 -1029239 -1007656 -1017094 -1013929 -990884 -1002112 -990868
10302 -990868 -992128 -990552 -1000724 -998734 -1011155 -995184 -978319 -1005505 -1030231 -1037761 -1023797 -1030225
10290 -1030225 -1039659 -1015883 -1015192 -1015475 -1031731 -1039412 -1009300 -968722 -948856 -975818 -1002036 -993107 -967749
10277 -967749 -994242 -1022362 -1049017 -1051156 -1053308 -1059213 -1029356 -997076 -999997 -1003341 -1020555 -1024006 -968970
10264 -968970 -949391 -952862 -949287 -949562 -946026 -966787 -979578 -959299 -967841 -974914 -964339 -972177 -958325
10251 -958325 -960935 -953052 -968421 -997010 -1012308 -960324 -936754 -925390 -939853 -952144 -965501 -982159
10239 -982159 -990055 -975315 -983595 -965255 -938804 -917906 -897534 -897445 -910693 -928451 -958160 -957400 -913355
10226 -913355 -904066 -913527 -900193 -900231 -894142 -874652 -864134 -864401 -854521 -794949 -762587 -739798 -736606
10213 -736606 -722258 -738036 -752170 -758310 -812778 -920627 -1050660 -1136683 -1182497 -1260637 -1317825
10202 -1317825 -1362628 -1374808 -1372279 -1349825 -1326919 -1335282 -1300709 -1241782 -1209418 -1174477 -1188150 -1174581
10190 -1174581 -1174612 -1182438 -1178239 -1145090 -1097044 -1086332 -1097113 -1120565 -1132542 -1120556 -1132254 -1131986 -1114114
10177 -1114114 -1109081 -1076629 -1058120 -1070190 -1116840 -1134894 -1109681 -1085278 -1074462 -1074630 -1090965 -1082823
10165 -1082823 -1098698 -1095446 -1077401 -1077379 -1111231 -1106282 -1095022 -1100594 -1102875 -1102041 -1110270 -1115806 -1086396
10152 -1086396 -1070281 -1068726 -1077041 -1052600 -1062699 -1074594 -1068184 -1037677 -1000105 -1015347 -1032053 -1018431
10140 -1018431 -1011230 -1019433 -1057933 -1075744 -1081423 -1072441 -1081370 -1089287 -1062703 -1052615 -1065446 -1081403
10128 -1081403 -1081089 -1065368 -1048253 -998886 -977965 -1011667 -1054819 -1067047 -1046447 -1022137 -1033870 -1040891
10116 -1040891 -1039629 -1033288 -1016654 -1021317 -1013116 -1017574 -1000674 -970621 -985484 -1002753 -1016193 -1025579
10104 -1025579 -978124 -966270 -989186 -1021826 -1028373 -1005985 -1004587 -1004369 -1007575 -1014607 -1041182 -1025771
10092 -1025771 -1047880 -1053527 -1066591 -1061072 -1038810 -1022459 -1043752 -1044386 -1017833 -1006023 -1001082 -980755
10080 -980755 -986027 -1013770 -1054637 -1046931 -1050544 -1046590 -1008753 -1016234 -1030386 -1011336 -1004676 -974055 -950697
10067 -950697 -981859 -981600 -955312 -937697 -949742 -958332 -970379 -992041 -1019453 -998295 -988070 -1029307
10055 -1029307 -1037290 -1030063 -1048118 -1009162 -959442 -979332 -1009565 -994647 -1015354 -1033576 -1037530 -1031616
10043 -1031616 -1013979 -995648 -998482 -1003008 -1010583 -1009047 -1014062 -1005512 -1026958 -1072133 -1060703 -1022131
10031 -1022131 -1006622 -998260 -1004406 -1030437 -1038145 -1025637 -1005908 -1001154 -990172 -983572 -1002988 -1000898
10019 -1000898 -958181 -947247 -961542 -985967 -1002153 -1000104 -993856 -990378 -1008942 -1031075 -1036580 -1014676
10007 -1014676 -1014358 -998892 -997751 -1000451 -996933 -1010994 -1000885 -981624 -987492 -1013705 -1009502 -1008364 -995549
9994 -995549 -1010268 -994816 -951608 -926913 -948791 -948007 -931261 -927234 -957596 -965830 -929726 -925054 -971498
9981 -971498 -1006745 -996669 -983878 -979326 -977109 -1007256 -976233 -969557 -981599 -1006453 -1015095 -994368
9969 -994368 -970976 -944898 -950897 -952810 -988906 -998052 -993511 -981138 -967460 -955594 -940439 -943292 -924719
9956 -924719 -910804 -946730 -974373 -970664 -963955 -949944 -932164 -944039 -959060 -973884 -968053 -967301 -971498
9943 -971498 -953219 -928094 -909652 -929078 -930477 -901238 -932838 -943609 -938747 -951304 -939124 -963960
9931 -963960 -969859 -973110 -970888 -973033 -978238 -953617 -942754 -985388 -987100 -961460 -949808 -946938 -933113
9918 -933113 -948806 -933899 -967517 -964489 -948358 -943941 -981102 -991021 -965957 -933800 -916127 -938435
9906 -938435 -931274 -934542 -949609 -942841 -922071 -938800 -954554 -964690 -973377 -961986 -928840 -941961
9894 -941961 -980893 -1001482 -992959 -963745 -970098 -954834 -938669 -952358 -961971 -983557 -1024698 -1060495
9882 -1060495 -1017962 -977108 -979022 -1005977 -1008598 -972282 -944535 -948125 -934198 -948276 -975853 -986409
9870 -986409 -962890 -938662 -949730 -953018 -966534 -962777 -972583 -959823 -968778 -973933 -963657 -941738 -919494
9857 -919494 -899108 -904541 -910794 -940690 -942822 -943460 -951959 -935153 -928972 -939667 -959486 -959707 -939045
9844 -939045 -950972 -964309 -972101 -982892 -951816 -928442 -936251 -955544 -925587 -936454 -939711 -913339
9832 -913339 -921265 -906481 -940566 -939848 -931174 -955423 -966729 -945275 -883839 -866699 -881453 -881787 -911712
9819 -911712 -935152 -928931 -904016 -915697 -942075 -943144 -931081 -918849 -903019 -893669 -875863 -875863 -886789
9806 -886789 -911123 -923034 -902498 -895734 -902630 -898762 -900773 -907566 -921032 -946968 -960304 -976842 -963033
9793 -963033 -930953 -896809 -861285 -870928 -874307 -892187 -906820 -950000 -967366 -965539 -950396 -926094
9781 -926094 -905910 -896453 -922662 -961222 -940912 -897313 -892839 -891620 -904628 -920374 -937469 -948702
9769 -948702 -937588 -905726 -873508 -873099 -891325 -903733 -895262 -906629 -914714 -933050 -931805 -907713 -899885
9756 -899885 -901469 -885396 -885059 -920057 -934464 -933229 -935225 -950096 -952416 -938818 -940392 -887535 -840785
9743 -840785 -886763 -931349 -902923 -899901 -893038 -893917 -876028 -865132 -907143 -923585 -924900 -925935 -897731
9730 -897731 -875454 -867961 -882021 -922262 -921114 -895580 -908269 -954450 -981669 -979192 -969711 -955884
9718 -955884 -955218 -946743 -940967 -921889 -882645 -874264 -904503 -916031 -907932 -884403 -870545 -864961 -863711
9705 -863711 -857286 -895520 -910308 -921519 -928691 -904556 -898895 -870106 -857136 -881996 -895379 -890082
9693 -890082 -881543 -905192 -908390 -850129 -818380 -839601 -840483 -829236 -830029 -821016 -847435 -860616 -872149
9680 -872149 -906785 -904366 -911589 -885627 -855919 -843976 -810208 -809164 -826361 -840536 -863817 -845414
9668 -845414 -819447 -855638 -868682 -846214 -873120 -874136 -868352 -854976 -868409 -860971 -843377 -832638
9656 -832638 -846443 -851472 -830903 -837484 -854795 -894972 -892656 -882168 -862231 -850736 -866458 -882268
9644 -882268 -859060 -858564 -858570 -843632 -827288 -827090 -869950 -883420 -843821 -838043 -820011 -815835 -823690 -856245
9630 -856245 -886176 -890882 -895892 -882115 -856311 -870219 -878580 -872609 -873804 -863759 -860458 -874326 -861827
9617 -861827 -866691 -889056 -901231 -877678 -860147 -868765 -882569 -849815 -845799 -855682 -858952 -851641 -887632
9604 -887632 -903473 -890839 -882856 -883995 -882813 -848134 -847270 -841553 -854356 -853191 -852072 -856844 -847047 -814137
9590 -814137 -822694 -807051 -774413 -786517 -817208 -819503 -846555 -844316 -858344 -858518 -864134 -848908 -851357
9577 -851357 -846141 -864455 -876618 -861437 -855380 -877572 -898919 -896490 -897406 -916913 -905925 -872040 -853100
9564 -853100 -832684 -802246 -778500 -774255 -801814 -801200 -816833 -833895 -853573 -870945 -875517 -859451
9552 -859451 -855944 -870822 -888261 -878844 -871291 -877181 -870961 -839965 -839521 -848637 -848093 -844937 -823113 -813238
9538 -813238 -811999 -830175 -827803 -796274 -803989 -781334 -793098 -835092 -820852 -824391 -832477 -855113 -859411
9525 -859411 -868525 -880331 -878697 -845973 -825665 -818653 -820579 -822345 -829746 -838923 -842360 -849487 -870880
9512 -870880 -830860 -811185 -794492 -811958 -799119 -817220 -819086 -821287 -809273 -819243 -823306 -794650
9500 -794650 -766198 -783625 -783547 -804978 -820064 -800695 -798425 -813922 -818558 -792804 -774479 -802103 -797536
9487 -797536 -802593 -813149 -841816 -870293 -859815 -824701 -805839 -806804 -824304 -817282 -820798 -804093 -804226
9474 -804226 -775879 -741914 -757575 -776905 -794462 -786170 -795365 -798225 -799951 -794736 -815305 -831841 -818025
9461 -818025 -774767 -762222 -754513 -770843 -776340 -782762 -795904 -792348 -783715 -829065 -797564 -795588 -793042
9448 -793042 -794384 -808159 -800785 -794054 -800776 -805964 -784269 -794632 -779187 -792809 -809363 -824089 -804579
9435 -804579 -764661 -752887 -783391 -790869 -808431 -803866 -777740 -743139 -750153 -744458 -751973 -759280 -724500
9422 -724500 -725337 -740300 -755202 -784707 -768364 -766866 -768745 -753723 -763702 -781732 -788143 -777179 -774789
9409 -774789 -773227 -781994 -795756 -797233 -791666 -733544 -689712 -676391 -703382 -704415 -700401 -723809 -729721
9396 -729721 -733920 -737945 -764342 -790739 -783458 -755504 -734172 -732556 -765831 -802461 -813083 -790128
9384 -790128 -761354 -753076 -743863 -692732 -648563 -692591 -737479 -744710 -740673 -743430 -723447 -732763 -767293
9371 -767293 -768294 -755165 -751896 -758014 -779580 -758846 -760083 -759402 -734082 -700275 -706127 -724121 -722305
9358 -722305 -717684 -713124 -693053 -690279 -700081 -720214 -726996 -703300 -698514 -711606 -727113 -714148 -710860
9345 -710860 -703511 -683353 -709891 -704961 -702968 -687201 -672754 -698794 -704497 -718733 -710812 -705590 -707029
9332 -707029 -706663 -698749 -722513 -735866 -728704 -703313 -698218 -707433 -711748 -704502 -710697 -685573 -680569 -658921
9318 -658921 -680156 -695498 -693690 -689281 -671005 -681703 -713798 -712946 -679350 -674616 -665490 -645739 -642575
9305 -642575 -681069 -697852 -688797 -675353 -678625 -699407 -698839 -709316 -696854 -715286 -724630 -697515 -660946
9292 -660946 -672283 -677888 -695082 -705121 -665082 -636385 -613579 -614080 -624630 -634031 -623384 -630080 -635482
9279 -635482 -641532 -653215 -658077 -683015 -694688 -656721 -646732 -655293 -637931 -635621 -650796 -676397 -681024
9266 -681024 -662433 -649749 -652866 -644632 -638418 -624731 -634940 -649553 -653231 -634993 -630845 -601534 -598618
9253 -598618 -611161 -628082 -633137 -638453 -660653 -659831 -637180 -613467 -632066 -646320 -611953 -600338
9241 -600338 -618480 -630005 -638495 -634190 -643731 -640552 -634303 -636400 -646288 -637410 -625458 -591522 -574646
9228 -574646 -597116 -613375 -609824 -595636 -570938 -563843 -580424 -605668 -626396 -603817 -579061 -609389
9216 -609389 -613915 -602547 -590686 -570771 -541304 -569141 -612157 -589662 -576615 -561899 -577724 -567484
9204 -567484 -540697 -530418 -541387 -536183 -539486 -528570 -505992 -502577 -487224 -472978 -487102 -519152
9192 -519152 -539921 -532709 -533171 -569699 -591638 -574153 -511085 -476571 -473168 -478627 -500263 -514563 -494509
9179 -494509 -476278 -468212 -462706 -488896 -479456 -430577 -399817 -394833 -385519 -377601 -384616 -413170 -453502
9166 -453502 -435266 -422683 -425210 -389437 -372561 -346867 -352951 -370169 -385366 -379647 -345261 -321755
9154 -321755 -338267 -352716 -355267 -355979 -363016 -335701 -346507 -351805 -328899 -318185 -316359 -311398 -295912
9141 -295912 -273387 -266467 -247057 -221962 -232612 -236406 -227593 -220994 -182483 -123448 -76664 -53717
9129 -53717 -28912 -37912 -49663 -44094 -38287 -18622 983 -9418 -18824 13103 40910 82779 121362
9116 121362 111711 130935 173656 230489 297369 334713 363082 387623 419426 474829 526504 608139
9104 608139 693595 781427 882744 993585 1062497 1152750 1239187 1363065 1547179 1782319 1982011
9093 1982011 2247903 2578105 3013765 3587140 4297413 5155470 5749275 4563423 166807
9084 166807 -3491391 -4971540 -5930826 -6412879 -6007713 -5299031 -4710200 -4233854 -3836582
9075 -3836582 -3543735 -3315322 -3119399 -2943571 -2754252 -2607156 -2507509 -2433501 -2355337 -2250959
9065 -2250959 -2190136 -2128951 -2049755 -1985405 -1939183 -1916265 -1917789 -1908553 -1861728 -1846576 -1819732 -1750133
9053 -1750133 -1678152 -1667675 -1649934 -1610086 -1587900 -1554377 -1521567 -1504887 -1499332 -1496982 -1448889 -1420643
9041 -1420643 -1405282 -1405127 -1402641 -1383782 -1370366 -1350594 -1335302 -1308413 -1286198 -1278829 -1289098 -1291077
9029 -1291077 -1285114 -1264013 -1266674 -1256828 -1221611 -1220777 -1218862 -1193443 -1182136 -1174930 -1174128 -1178073 -1194149
9016 -1194149 -1207857 -1184760 -1147179 -1131000 -1104458 -1095767 -1099124 -1078028 -1079903 -1081117 -1089742 -1092620 -1068125
9003 -1068125 -1038423 -1030433 -1029641 -1055218 -1055627 -1066606 -1063031 -1059928 -1030515 -1043412 -1046971 -1025273 -1002018
8990 -1002018 -976118 -982777 -1023113 -1041069 -1043542 -1000677 -964764 -944916 -977473 -999383 -990905 -988468
8978 -988468 -977427 -967956 -989813 -977662 -952277 -936306 -944345 -970558 -955398 -923635 -902009 -901383
8966 -901383 -904869 -929373 -926668 -946204 -936632 -893272 -857429 -841244 -820069 -818088 -856461 -854445 -838009
8953 -838009 -827816 -829780 -880902 -881732 -883919 -880449 -853627 -845187 -845621 -846128 -830736 -831496 -809414 -793232
8939 -793232 -795365 -803769 -794368 -772445 -752830 -729157 -732004 -756139 -763546 -766077 -764551 -737362 -720534
8926 -720534 -714722 -750935 -734496 -718032 -713088 -692026 -695603 -698508 -682069 -681165 -710017 -681483 -647043
8913 -647043 -625968 -639752 -655263 -639769 -632759 -611447 -600660 -587588 -550894 -579948 -556648 -516918
8901 -516918 -515185 -515515 -510385 -472369 -413935 -381424 -360315 -330091 -314778 -291888 -219253 -193778
8889 -193778 -142355 -79281 -22242 33166 93888 184627 314974 437193 611307 809102 1026283
8878 1026283 1125196 860761 -74540 -1219290 -1959412 -2381698 -2640182 -2712447 -2585981 -2380432
8868 -2380432 -2186864 -1994504 -1869558 -1779206 -1715175 -1678989 -1674584 -1644542 -1616809 -1568878 -1539406
8857 -1539406 -1503672 -1498194 -1486885 -1447289 -1409751 -1388953 -1352467 -1312947 -1306725 -1301376 -1291837 -1260578
8845 -1260578 -1265983 -1266968 -1250199 -1210205 -1174695 -1165445 -1156650 -1167698 -1177627 -1165020 -1158755 -1143270 -1125278
8832 -1125278 -1106618 -1089089 -1056005 -1036265 -1052439 -1085863 -1104831 -1138809 -1138921 -1120588 -1113084 -1091794
8820 -1091794 -1090321 -1078477 -1050547 -1030580 -1023418 -1044957 -1070272 -1071408 -1077705 -1079655 -1108013 -1094885
8808 -1094885 -1064579 -1043697 -1022940 -1013351 -1037377 -1027564 -1004503 -980466 -975108 -973366 -955027 -965457
8796 -965457 -979036 -1014193 -1009854 -988734 -975941 -989246 -1006330 -1006831 -992605 -979967 -977270 -1002332
8784 -1002332 -1032463 -1029150 -1015372 -1030558 -997121 -989449 -967419 -953655 -956341 -946991 -922231 -946584
8772 -946584 -933869 -922594 -912491 -920206 -917239 -932557 -928640 -904483 -892039 -867871 -888652 -904794
8760 -904794 -904131 -898812 -862841 -881832 -884448 -860873 -865131 -882043 -870928 -860425 -868599 -841195 -818755
8747 -818755 -819966 -841584 -865567 -855467 -853885 -868051 -890310 -887678 -855891 -834236 -823097 -848934
8735 -848934 -859489 -871926 -866693 -834692 -828726 -829565 -866957 -876872 -860870 -867564 -877033 -860561 -857719
8722 -857719 -858799 -853983 -841926 -825950 -797033 -817799 -849898 -875279 -889713 -842678 -811625 -816856
8710 -816856 -818981 -814933 -826958 -826166 -806668 -806229 -825329 -836739 -830367 -819494 -843291 -838802 -830478
8697 -830478 -834866 -833558 -829274 -847016 -843104 -824864 -805753 -859878 -906620 -866907 -826114 -815867
8685 -815867 -829964 -848787 -855787 -823124 -810673 -800258 -821489 -833832 -811733 -817129 -844391 -844394 -827078
8672 -827078 -813567 -827839 -832353 -838316 -816220 -816500 -798057 -801018 -815731 -828922 -830535 -815505 -818259
8659 -818259 -811430 -781752 -782029 -806181 -802541 -794592 -784690 -786027 -777788 -759056 -730253 -737265 -769570
8646 -769570 -749001 -727265 -737824 -721832 -752813 -777769 -767210 -761606 -777241 -783435 -782109 -763225
8634 -763225 -751800 -766619 -794041 -772073 -733588 -722151 -734105 -736608 -730432 -710532 -718846 -703713
8622 -703713 -722540 -699784 -689622 -685340 -678919 -667154 -661386 -692919 -674090 -651472 -646724 -650412 -645404
8609 -645404 -660667 -633476 -621200 -616658 -597897 -580148 -597975 -622722 -609073 -644514 -689682 -714772
8597 -714772 -747044 -801259 -888488 -980171 -1070376 -1153551 -1209769 -1265380 -1303336 -1320219 -1322887 -1342556
8585 -1342556 -1341796 -1317085 -1277685 -1273451 -1260225 -1206621 -1176993 -1187493 -1181509 -1148013 -1138515 -1148758
8573 -1148758 -1145228 -1156372 -1124700 -1118061 -1115264 -1084544 -1093943 -1101791 -1101441 -1138611 -1130448 -1128948 -1120958
8560 -1120958 -1130226 -1135684 -1144953 -1126414 -1120711 -1085587 -1067116 -1042785 -1026356 -1035897 -1014074 -998234
8548 -998234 -1020091 -1052425 -1028235 -1027628 -1011573 -1001530 -994675 -973057 -965742 -990644 -1003065 -1007831 -984803
8535 -984803 -971458 -996982 -1002451 -1008754 -986621 -989692 -975672 -954833 -1001829 -1036730 -997259 -996053
8523 -996053 -1013369 -1050865 -1035786 -1020471 -1004071 -992027 -981956 -987590 -983028 -1002342 -1023453 -1018647
8511 -1018647 -998723 -963848 -965991 -995633 -970302 -968258 -987358 -984167 -983900 -976459 -977359 -994399 -994666
8498 -994666 -970897 -958238 -957407 -965529 -952221 -935075 -949974 -966985 -975334 -973050 -968841 -971996 -971051
8485 -971051 -958772 -928091 -927819 -908741 -907507 -919956 -922789 -934559 -954780 -945600 -900670 -860455 -879225
8472 -879225 -900438 -915302 -950587 -946775 -922508 -905946 -890638 -878399 -899247 -909485 -927799 -928410
8460 -928410 -927793 -918908 -922828 -927465 -907163 -893747 -903399 -900020 -902847 -910837 -924286 -941568 -917144
8447 -917144 -899144 -865078 -865131 -875830 -877583 -841465 -859630 -860190 -879303 -880283 -876299 -872023 -904767 -930955
8433 -930955 -920906 -893262 -880223 -881761 -896118 -885270 -899358 -912468 -904347 -908789 -925226 -942415
8421 -942415 -921528 -923842 -938086 -924954 -929753 -926756 -900269 -914316 -946530 -922310 -887515 -877605
8409 -877605 -872824 -868302 -854539 -869291 -879141 -886602 -897029 -905470 -906705 -923600 -936708 -916458 -918536
8396 -918536 -895892 -872511 -863214 -891409 -878231 -882557 -846176 -825455 -839142 -867843 -894525 -870635
8384 -870635 -870355 -882103 -879712 -873267 -867082 -847366 -848188 -851559 -855043 -864937 -865630 -881638 -892673 -879401
8370 -879401 -873396 -875433 -882129 -879251 -868825 -864542 -839348 -834933 -839740 -878051 -878440 -866281 -853696
8357 -853696 -827342 -829070 -830616 -835587 -860970 -866978 -881782 -902056 -912296 -888722 -873762 -867271 -866469
8344 -866469 -842182 -828548 -848992 -864411 -861199 -833527 -834543 -867343 -890643 -899827 -882276 -872271
8332 -872271 -878075 -895440 -889820 -865789 -837475 -839460 -838880 -848031 -881941 -880632 -851789 -789522 -800774
8319 -800774 -830410 -814086 -831457 -858474 -856841 -858062 -868095 -861120 -844721 -851010 -837871 -844157 -843297
8306 -843297 -825105 -817619 -817187 -864000 -890722 -884372 -858609 -832071 -802492 -829410 -834777 -848685 -844849
8293 -844849 -861254 -843715 -830689 -830782 -833295 -852529 -813061 -820452 -837687 -835081 -816798 -807938 -854525
8280 -854525 -871449 -843287 -829814 -835409 -841861 -820544 -821235 -836839 -831933 -823329 -839577 -831445 -821127
8267 -821127 -787586 -743595 -778753 -782287 -765342 -764103 -752673 -773678 -769960 -779895 -788612 -801254 -843547
8254 -843547 -838496 -820848 -801029 -789179 -776202 -782803 -795470 -798269 -781135 -755270 -739976 -750440
8242 -750440 -763579 -756568 -779623 -810050 -816278 -839776 -828817 -819733 -831240 -847342 -853461 -818360
8230 -818360 -779562 -793093 -817905 -808169 -837986 -848507 -822815 -816078 -807204 -808404 -790269 -795269 -773503
8217 -773503 -765340 -794450 -802473 -786332 -790550 -802631 -786099 -781290 -790872 -786502 -788398 -820246 -831169
8204 -831169 -812658 -805566 -819534 -819665 -821867 -828403 -825795 -791439 -801652 -805660 -822678 -832322 -789529
8191 -789529 -757620 -760451 -737898 -729924 -767180 -775926 -797821 -824402 -832451 -833770 -816815 -773870 -789350
8178 -789350 -802673 -784408 -786023 -790435 -792968 -790592 -789596 -767257 -733033 -717249 -723124 -733705 -736705
8165 -736705 -736221 -757661 -747351 -743825 -767588 -776883 -773642 -775393 -787847 -788820 -775498 -784152 -774524 -804772
8151 -804772 -822547 -834622 -849617 -811016 -769816 -761896 -764019 -768159 -759843 -750015 -721536 -703953 -730748
8138 -730748 -750090 -752352 -712168 -692216 -698525 -691243 -736927 -746838 -746406 -723417 -750833 -743667 -718494
8125 -718494 -711835 -736763 -759646 -775404 -760182 -711024 -704041 -724864 -716114 -677089 -687890 -705239
8113 -705239 -699844 -714069 -714110 -724970 -710007 -711482 -710355 -714674 -716253 -718386 -689294 -670766 -684991
8100 -684991 -676552 -686735 -716155 -754167 -765654 -737309 -743888 -764892 -737040 -729565 -730307 -727204 -716268
8087 -716268 -696126 -696674 -700207 -734924 -738852 -716311 -728338 -733374 -723313 -683884 -665511 -654102 -615185
8074 -615185 -586133 -607348 -587888 -570070 -589482 -617209 -621190 -632313 -665188 -671192 -681005 -709127
8062 -709127 -711173 -713777 -713322 -709689 -700200 -724778 -724467 -684352 -683263 -655020 -628511 -632871 -633308 -609271
8048 -609271 -606896 -624569 -629900 -605133 -594822 -611798 -626092 -666719 -669718 -669839 -656890 -653392 -643846
8035 -643846 -678027 -694745 -690225 -676389 -659051 -629881 -650977 -661424 -655259 -617745 -600888 -635106
8023 -635106 -681758 -671798 -667367 -673749 -664317 -628672 -624409 -657330 -684834 -686366 -696126 -692818 -705154
8010 -705154 -695191 -671215 -656691 -655060 -654694 -668649 -654944 -673206 -745878 -790586 -790730 -789978 -786366
7997 -786366 -780172 -789450 -807612 -796379 -812970 -802682 -791482 -778555 -756808 -769214 -785601 -740280
7985 -740280 -743128 -739605 -710257 -712518 -708854 -715421 -721984 -683690 -670339 -658893 -644916 -641191 -620087
7972 -620087 -633468 -642883 -648676 -656272 -662187 -661527 -684767 -686049 -679827 -654671 -672277 -702674 -713511
7959 -713511 -748349 -794224 -778835 -776414 -815171 -838038 -853023 -847219 -884430 -910326 -942268 -932732
7947 -932732 -953092 -979929 -968632 -950130 -920444 -902809 -908760 -890419 -877182 -874750 -879041 -895718
7935 -895718 -899729 -869895 -846891 -811508 -801801 -817619 -810863 -756072 -713813 -736528 -774873 -799964
7923 -799964 -829120 -882024 -927574 -952891 -949304 -943539 -964857 -993532 -994295 -1000399 -1013467 -1042636 -1084117
7910 -1084117 -1088713 -1086407 -1064501 -1023001 -994072 -974944 -984269 -983647 -1002775 -1030294 -1038719 -1011455 -1011139
7897 -1011139 -1015493 -1009770 -1027724 -1074756 -1077378 -1053496 -1048658 -1031872 -1013545 -997803 -1028068 -996899
7885 -996899 -998171 -1023634 -1027985 -1015177 -1024559 -1026387 -1039594 -1050343 -1055555 -1045533 -1037230 -1036621 -1024988
7872 -1024988 -1003745 -1017315 -1016361 -1038123 -1068662 -1038997 -1005496 -1028475 -1027480 -1036396 -1055282 -1023567
7860 -1023567 -1016443 -1029376 -1015422 -1032487 -1020639 -993380 -995569 -1027916 -1030672 -1019031 -1013269 -1009607
7848 -1009607 -994507 -983350 -987875 -1007140 -995851 -1005843 -1015648 -1000980 -981077 -982222 -984772 -1003038
7836 -1003038 -999697 -990203 -983943 -973452 -982122 -1007712 -986309 -943106 -964371 -984995 -983854 -962433
7824 -962433 -942056 -913153 -943017 -936469 -958136 -972294 -931671 -937231 -969219 -957276 -932240 -909564
7812 -909564 -918651 -903520 -909423 -899142 -901147 -886719 -884086 -886549 -908428 -926195 -942347 -950967 -938615
7799 -938615 -916814 -926794 -942588 -923836 -891422 -862040 -870547 -880182 -890635 -895465 -899073 -882347 -866984
7786 -866984 -871953 -888785 -895889 -927580 -954918 -958834 -944906 -954806 -939835 -914362 -888313 -892503 -895215
7773 -895215 -859574 -844096 -866079 -881282 -892377 -897639 -900073 -901338 -907435 -890990 -855793 -859934 -876347
7760 -876347 -867465 -871790 -900907 -930977 -935873 -904512 -898008 -908525 -898031 -876962 -868555 -890772 -887766
7747 -887766 -875738 -844666 -850116 -901708 -914428 -884861 -857067 -860500 -883762 -888782 -884939 -860600
7735 -860600 -836661 -833825 -875595 -879504 -862857 -857165 -857882 -848024 -839967 -831232 -836386 -843014 -850006 -857917
7721 -857917 -860624 -842469 -822065 -818523 -834899 -866972 -915392 -906243 -861837 -845241 -825215 -805464
7709 -805464 -833695 -845151 -854391 -840508 -874807 -884830 -833004 -849450 -884748 -870110 -867053 -840484
7697 -840484 -830029 -828433 -807890 -805439 -839163 -865025 -832674 -816559 -822297 -821382 -807378 -800358 -819196
7684 -819196 -810515 -820958 -829134 -834804 -815198 -804266 -771835 -782543 -809892 -824135 -828553 -821814 -821633
7671 -821633 -825021 -806652 -797618 -780902 -790889 -807655 -815490 -820413 -809448 -813662 -809047 -797896 -796608
7658 -796608 -802135 -793830 -835531 -833423 -838118 -827370 -811388 -794167 -810288 -816497 -818151 -803838 -794280
7645 -794280 -782379 -790975 -796263 -768564 -748476 -732127 -766847 -812228 -817699 -800183 -800399 -776866 -787688
7632 -787688 -778320 -809233 -837778 -834252 -833800 -849207 -830496 -822585 -821633 -823990 -829028 -820374 -808692 -788683
7618 -788683 -778040 -787513 -809229 -804484 -785328 -769430 -773578 -777434 -769075 -754859 -741223 -774624 -799241
7605 -799241 -795792 -817596 -845592 -856233 -835235 -814423 -806904 -809552 -808192 -809939 -794112 -778983 -776360
7592 -776360 -777392 -770411 -773310 -743815 -760486 -776915 -771866 -785721 -791727 -786800 -793416 -781665 -795441
7579 -795441 -810137 -807360 -809510 -826102 -808290 -781184 -757045 -762298 -785017 -795031 -812071 -806430
7567 -806430 -777769 -755632 -742884 -740005 -757557 -807602 -821921 -795154 -791539 -784017 -794386 -794574 -794198
7554 -794198 -783430 -782745 -787218 -809163 -788949 -743763 -738174 -721285 -746276 -767776 -744018 -736484 -748212
7541 -748212 -797182 -799430 -778836 -765016 -752926 -747238 -748686 -781140 -820320 -853017 -828839 -834066
7529 -834066 -822455 -811551 -806154 -795579 -758945 -767066 -758742 -750397 -769466 -785439 -758436 -752996 -775874
7516 -775874 -778287 -772687 -765325 -768541 -777236 -780830 -785059 -805880 -783927 -754688 -795113 -796006 -796581 -781925
7502 -781925 -787241 -795437 -811819 -807865 -821161 -794867 -749416 -757783 -803079 -814249 -794429 -787849 -774665
7489 -774665 -752526 -760523 -766694 -779143 -790748 -776397 -767051 -766467 -781509 -766916 -773648 -778721 -764227
7476 -764227 -758814 -801336 -799681 -785120 -780938 -781563 -768209 -762522 -788860 -772104 -751811 -760510 -761493
7463 -761493 -764920 -752748 -768688 -779304 -770697 -775926 -796480 -765597 -756079 -739478 -766036 -758105 -733619
7450 -733619 -737086 -750945 -767966 -770358 -764219 -758061 -762602 -795283 -783522 -756733 -753839 -755110 -748656
7437 -748656 -750104 -733006 -748923 -759220 -763596 -758999 -753140 -766370 -775133 -790062 -779730 -743568 -722411
7424 -722411 -741891 -777249 -792556 -789665 -779830 -754828 -737944 -763716 -798562 -800315 -769030 -744589
7412 -744589 -767303 -757923 -748953 -750237 -737503 -780938 -785434 -752363 -764478 -771703 -782611 -791277 -791065
7399 -791065 -795305 -806715 -804127 -785164 -771386 -772831 -768173 -772925 -748992 -734860 -719406 -735897 -734965
7386 -734965 -752344 -745974 -733467 -738275 -760963 -772076 -760412 -754419 -736493 -741780 -743889 -765060 -787302
7373 -787302 -767845 -735819 -750821 -734239 -759167 -744746 -746238 -752113 -764345 -756262 -750693 -724452
7361 -724452 -752514 -754186 -732655 -731856 -724392 -734279 -746301 -764625 -766201 -732458 -731472 -749354 -716151
7348 -716151 -701239 -727551 -743145 -739210 -744604 -749027 -792578 -797699 -764514 -725054 -700599 -721355
7336 -721355 -745860 -708021 -699563 -688646 -696138 -699379 -705082 -721373 -696432 -678610 -669686 -683907 -702527
7323 -702527 -732384 -733787 -766339 -759408 -753637 -732075 -738702 -754228 -749292 -750258 -737246 -723311 -710376
7310 -710376 -703934 -724156 -733486 -737377 -727543 -726135 -758890 -768631 -764823 -746441 -727012 -711499 -696280
7297 -696280 -687359 -680744 -702526 -682691 -675452 -689998 -707115 -703883 -703665 -727121 -752451 -801706 -804586
7284 -804586 -787728 -774307 -779117 -776559 -768990 -746854 -708212 -696285 -714674 -735092 -756146 -732183
7272 -732183 -724196 -717593 -734257 -732861 -707252 -703652 -743893 -777548 -784074 -763824 -743288 -750469 -756933
7259 -756933 -746211 -744460 -765954 -744572 -721528 -698184 -731496 -706322 -699941 -704246 -734739 -773427
7247 -773427 -787724 -777862 -759156 -740477 -732663 -713225 -700650 -690260 -724567 -751423 -740315 -716934
7235 -716934 -701876 -709887 -755537 -806884 -788405 -746293 -739499 -748353 -751547 -737641 -694767 -670545
7223 -670545 -668065 -685915 -718866 -743772 -724417 -724121 -726958 -706854 -692457 -705549 -693479 -673437
7211 -673437 -689410 -711121 -711476 -694759 -711956 -718558 -729062 -721378 -683125 -698051 -708126 -711143 -720946
7198 -720946 -727804 -763285 -733414 -728533 -731902 -740489 -711393 -666722 -661283 -705239 -692556 -692927 -701944
7185 -701944 -723677 -756768 -759878 -740100 -725547 -720772 -731411 -699346 -662846 -640055 -652428 -651467
7173 -651467 -660301 -677113 -667241 -656682 -696282 -703411 -677744 -679697 -686872 -672040 -674933 -711238 -709969
7160 -709969 -708264 -714463 -726499 -756133 -728330 -706484 -718291 -708516 -694060 -699703 -711451 -741097
7148 -741097 -761194 -732356 -687887 -685104 -695698 -712189 -702347 -709073 -723989 -723762 -705238 -667108 -669794
7135 -669794 -668768 -674470 -677310 -676325 -668277 -670687 -684572 -694393 -708615 -737240 -727085 -698149 -678306
7122 -678306 -668717 -690747 -695486 -678685 -663360 -670432 -657070 -664562 -651243 -655193 -621427 -629703 -647675
7109 -647675 -655639 -664136 -659833 -670407 -673384 -672603 -657599 -643865 -654849 -674448 -676777 -664938 -658802
7096 -658802 -660842 -673398 -698630 -718709 -732067 -702559 -680833 -660855 -654426 -683786 -709972 -722103
7084 -722103 -731676 -710066 -690519 -680748 -653231 -631384 -626763 -649660 -654041 -647854 -629752 -641896 -653587
7071 -653587 -664387 -650140 -646634 -637973 -614836 -599126 -603406 -629168 -625870 -658771 -683621 -650583
7059 -650583 -627456 -663327 -666531 -671391 -663101 -645376 -639582 -639462 -652222 -629521 -611921 -624603 -638700
7046 -638700 -634281 -652719 -647007 -632206 -637130 -678337 -687285 -661066 -640642 -634030 -643164 -659563 -663944
7033 -663944 -633774 -628727 -657704 -662638 -641201 -630792 -670970 -693659 -684425 -691787 -701310 -667113 -654128
7020 -654128 -684107 -691266 -673438 -674702 -655468 -625031 -658396 -704910 -710513 -689992 -671172 -659446
7008 -659446 -675584 -656670 -641960 -643423 -643364 -653624 -692156 -688830 -663003 -637446 -638698 -628649 -649177
6995 -649177 -635109 -609155 -610350 -592646 -604951 -594653 -582921 -596312 -614872 -645338 -629156 -605034
6983 -605034 -608099 -615178 -618596 -626713 -600156 -605131 -622287 -631919 -622799 -625757 -628550 -613294 -604199 -609724
6969 -609724 -595431 -581246 -595553 -588152 -577379 -580990 -590033 -601010 -588628 -621532 -630139 -626900 -630463
6956 -630463 -593943 -582772 -616620 -603302 -602002 -614583 -598171 -577950 -573487 -591521 -589530 -541576
6944 -541576 -508914 -514954 -490068 -478529 -469299 -451795 -508278 -627506 -722319 -774952 -793318 -774172
6932 -774172 -749698 -754720 -754317 -744155 -732151 -716967 -691237 -667347 -662812 -662560 -656418 -659612 -663143
6919 -663143 -664499 -669469 -649886 -651908 -643365 -629574 -643069 -642629 -619439 -608919 -571758 -542073 -550475
6906 -550475 -563949 -547814 -535304 -516517 -516056 -515102 -512338 -535331 -645287 -760792 -786370 -775345
6894 -775345 -761870 -774101 -764145 -727428 -746088 -771575 -753858 -736846 -706389 -680166 -693663 -688888
6882 -688888 -671028 -680561 -694196 -675681 -645966 -664679 -668764 -661886 -634219 -621458 -604869 -589250
6870 -589250 -594232 -611659 -631269 -635514 -628914 -630261 -628858 -620876 -647368 -639352 -633410 -627753 -627605 -638874
6856 -638874 -698267 -729603 -679404 -622026 -621646 -599152 -590402 -565810 -551839 -551112 -558137 -557024 -552495
6843 -552495 -602760 -609585 -618259 -621255 -593253 -573669 -556575 -553913 -520501 -498924 -492371 -502084 -548496
6830 -548496 -550345 -553404 -546089 -549865 -556631 -553976 -568438 -599679 -596867 -557617 -521951 -494931 -500814
6817 -500814 -503305 -520498 -529416 -504129 -485456 -504325 -488297 -464202 -499002 -504123 -491376 -491837 -467721
6804 -467721 -440640 -443127 -435948 -425710 -407251 -418506 -387182 -339014 -319636 -297492 -286389 -272548
6792 -272548 -234771 -203188 -186997 -231714 -350428 -548168 -664603 -706797 -731515 -733641 -705274
6781 -705274 -670786 -686186 -672517 -606923 -583085 -563864 -527299 -518508 -529321 -522563 -493820 -485228
6769 -485228 -510458 -521170 -503423 -461879 -414003 -393641 -414560 -404430 -393759 -398055 -379915 -371866
6757 -371866 -403400 -389826 -348384 -319826 -299145 -237987 -224775 -189501 -140293 -117666 -101688 -98532
6745 -98532 -111421 -171175 -228854 -352293 -442405 -471368 -420834 -377458 -401507 -340996 -304525 -294118
$$ [...]
##END NTUPLES=NMR SPECTRUM
##END=
