##TITLE=Analysis number 318943
Compound Code cc 02003
Project Code adrs
Chemist Name endeavour
##JCAMPDX= 6.0         $$ Bruker NMR JCAMP-DX V2.0
##DATA TYPE= NMR SPECTRUM
##DATA CLASS= NTUPLES
##ORIGIN= Bruker BioSpin GmbH
##OWNER= nmr
$$ XWIN-NMR		Version 3.5
$$ Tue Apr 25 13:42:58 2006 GMT Daylight Time (UT+1h)  MAYBRIDGE\nmr@NMR_250MHZ
##.OBSERVE FREQUENCY= 250.131544655141
##.OBSERVE NUCLEUS= ^1H
##.ACQUISITION MODE= SIMULTANEOUS (DQD)
##.ACQUISITION SCHEME= undefined
##.AVERAGES= 16
##.DIGITISER RES= 18
##SPECTROMETER/DATA SYSTEM= dpx250
##.PULSE SEQUENCE= zg30
##.SOLVENT NAME= CDCl3
##.SHIFT REFERENCE= (INTERNAL, CDCl3, 0, 16.522)
##AUDIT TRAIL= $$ (NUMBER, WHEN, WHO, WHERE, WHAT)
$$ ##TITLE= Audit trail, XWIN-NMR		Version 3.5
$$ ##JCAMPDX= 5.01
$$ ##ORIGIN= Bruker BioSpin GmbH
$$ ##OWNER= nmr
$$ C:\u/data/dgb/nmr/ADRS/3060/pdata/1/auditp.txt
$$ ##AUDIT TRAIL=  $$ (NUMBER, WHEN, WHO, WHERE, WHAT)
(   1,<2006-04-25 13:41:56.84 +100>,<MAYBRIDGE\nmr>,<NMR_250MHZ>,
      <created by zg, POWCHK disabled, PULCHK disabled
       configuration hash MD5:
       84 BC 41 DB A1 6E 1D 46 DA 25 12 A5 C1 ED C5 3A
       data hash MD5: 64K
       A9 DD FB C2 B6 91 33 0C 6C 99 B1 6D D8 DB E9 90>)
(   2,<2006-04-25 13:42:27.47 +100>,<MAYBRIDGE\nmr>,<NMR_250MHZ>,
      <Start of raw data processing
       ef LB = 0.3 FT_mod = 6 PKNL = 1 SI = 32K 
       data hash MD5: 32K
       FD DA 50 22 D3 05 9C 52 36 9C 86 53 84 0E E6 74>)
(   3,<2006-04-25 13:42:32.01 +100>,<MAYBRIDGE\nmr>,<NMR_250MHZ>,
      <apk 
       data hash MD5: 32K
       4C BA 48 68 F5 77 E9 1E FF 21 10 24 C8 88 C3 7E>)
(   4,<2006-04-25 13:42:34.45 +100>,<MAYBRIDGE\nmr>,<NMR_250MHZ>,
      <abs ABSG = 5 
       data hash MD5: 32K
       46 54 E0 5F 56 DC 79 4A 1D 8D BB 4C D9 1F D0 27>)
$$ ##END=
$$ 
$$ hash MD5
$$ EB 71 BA F9 DB DC 15 32 4A BF CF 7E 91 C7 E9 3B
##$RELAX= 
##$RELAX= 
##$RELAX= 
##$RELAX= 
##$RELAX= 
##$RELAX= 
##$RELAX= 
$$ Bruker specific parameters
$$ --------------------------
##$DU= <C:\u>
##$EXPNO= 3060
##$NAME= <ADRS>
##$PROCNO= 1
##$TYPE= <nmr>
##$USER= <dgb>
##$AMP= (0..31)
100 100 100 100 100 100 100 100 100 100 100 100 100 100 100 100 100 100 
100 100 100 100 100 100 100 100 100 100 100 100 100 100 
##$AQSEQ= 0
##$AQ_mod= 3
##$AUNM= <au_zg>
##$AUTOPOS= <37 >
##$BF1= 250.13
##$BF2= 250.13
##$BF3= 250.13
##$BF4= 250.13
##$BF5= 500.13
##$BF6= 500.13
##$BF7= 500.13
##$BF8= 500.13
##$BYTORDA= 1
##$CFDGTYP= 0
##$CFRGTYP= 5
##$CHEMSTR= <none>
##$CNST= (0..31)
1 1 145 1 1 1 1 1 1 1 1 1 1 1 1 1 1 1 1 1 1 1 1 1 1 1 1 1 1 1 1 1 
##$CPDPRG= <>
##$CPDPRG1= <>
##$CPDPRG2= <>
##$CPDPRG3= <>
##$CPDPRG4= <mlev>
##$CPDPRG5= <mlev>
##$CPDPRG6= <mlev>
##$CPDPRG7= <mlev>
##$CPDPRG8= <mlev>
##$CPDPRGB= <>
##$CPDPRGT= <>
##$D= (0..31)
0 1 0 0 0 0 0 0 0 0.06 0 0 0 0 0 0 0.0002 0 0 0 0 0 0 0 0 0 0 0 0 0 0 
0 
##$DATE= 1145968914
##$DBL= (0..7)
120 120 120 120 120 120 120 120 
##$DBP= (0..7)
150 150 150 150 150 150 150 150 
##$DBP07= 0
##$DBPNAM0= <>
##$DBPNAM1= <>
##$DBPNAM2= <>
$$ [...]
##$SUBNAM7= <"">
##$SUBNAM8= <"">
##$SUBNAM9= <"">
##$SW= 20.6930455092707
##$SWIBOX= (0..15)
0 0 3 0 0 0 0 0 0 0 0 0 0 0 0 0 
##$SW_h= 5175.983436853
##$TD= 65536
##$TD0= 1
##$TE= 295.16
##$TE2= 300
##$TE3= 300
##$TEG= 300
##$TL= (0..7)
0 120 120 120 120 120 120 120 
##$TP= (0..7)
150 150 150 150 150 150 150 150 
##$TP07= 0
##$TPNAME0= <>
##$TPNAME1= <>
##$TPNAME2= <>
##$TPNAME3= <>
##$TPNAME4= <>
##$TPNAME5= <>
##$TPNAME6= <>
##$TPNAME7= <>
##$TPOAL= (0..7)
0.5 0.5 0.5 0.5 0.5 0.5 0.5 0.5 
##$TPOFFS= (0..7)
0 0 0 0 0 0 0 0 
##$TUNHIN= 0
##$TUNHOUT= 0
##$TUNXOUT= 0
##$USERA1= <user>
##$USERA2= <user>
##$USERA3= <user>
##$USERA4= <user>
##$USERA5= <user>
##$V9= 5
##$VALIST= <valist>
##$VCLIST= <CCCCCCCCCCCCCCC>
##$VD= 0
##$VDLIST= <DDDDDDDDDDDDDDD>
##$VPLIST= <PPPPPPPPPPPPPPP>
##$VTLIST= <TTTTTTTTTTTTTTT>
##$WBST= 1024
##$WBSW= 4
##$XGAIN= (0..3)
0 0 0 0 
##$XL= 0
##$YL= 0
##$YMAX_a= 404723
##$YMIN_a= -536017
##$ZGOPTNS= <>
##$ZL1= 120
##$ZL2= 120
##$ZL3= 120
##$ZL4= 120
##$ABSF1= 16.522
##$ABSF2= -4.171173
##$ABSG= 5
##$ABSL= 3
##$ALPHA= 0
##$AQORDER= 0
##$ASSFAC= 0
##$ASSFACI= 0
##$ASSFACX= 0
##$ASSWID= 0
##$AUNMP= <proc_1d>
##$AZFE= 0.1
##$AZFW= 0.1
##$BCFW= 0
##$BC_mod= 0
##$BYTORDP= 0
##$COROFFS= 0
##$CY= 12.5
##$DATMOD= 1
##$DC= 0
##$DFILT= <>
##$DTYPP= 0
##$F1P= 14.0000005364418
##$F2P= -0.99999901652339
##$FCOR= 0.5
##$FTSIZE= 32768
##$FT_mod= 6
##$GAMMA= 0
##$GB= 0
##$INTBC= 1
##$INTSCL= 1
##$ISEN= 128
##$LB= 0.3
##$LEV0= 0
##$LPBIN= 0
##$MAXI= 10000
##$MC2= 0
##$MEAN= 0
##$ME_mod= 0
##$MI= 0
##$NCOEF= 0
##$NC_proc= -4
##$NLEV= 6
##$NOISF1= 0
##$NOISF2= 0
##$NSP= 0
##$NTH_PI= 0
##$NZP= 0
##$OFFSET= 16.522
##$PC= 1
##$PHC0= 167.3642
##$PHC1= -0.1693975
##$PH_mod= 1
##$PKNL= yes
##$PPARMOD= 0
##$PSCAL= 4
##$PSIGN= 0
##$REVERSE= no
##$SF= 250.13
##$SI= 32768
##$SIGF1= 0
##$SIGF2= 0
##$SINO= 400
##$SIOLD= 32768
##$SREGLST= <1H.CDCl3>
##$SSB= 0
##$STSI= 32768
##$STSR= 0
##$SW_p= 5175.98343685301
##$SYMM= 0
##$S_DEV= 0
##$TDeff= 65536
##$TDoff= 0
##$TI= <Analysis number 999999
Compound Code 99
Book Reference 9
Project Code 9>
##$TILT= no
##$TM1= 0
##$TM2= 0
##$TOPLEV= 0
##$USERP1= <user>
##$USERP2= <user>
##$USERP3= <user>
##$USERP4= <user>
##$USERP5= <user>
##$WDW= 1
##$XDIM= 32768
##$YMAX_p= 365347059
##$YMIN_p= -419638
$$ End of Bruker specific parameters
$$ ---------------------------------
##NTUPLES= NMR SPECTRUM
##VAR_NAME=  FREQUENCY,     SPECTRUM/REAL,   SPECTRUM/IMAG
##SYMBOL=    X,             R,               I
##VAR_TYPE=  INDEPENDENT,   DEPENDENT,       DEPENDENT
##VAR_FORM=  AFFN,          ASDF,            ASDF
##VAR_DIM=   32768,         32768,           32768
##UNITS=     HZ,            ARBITRARY UNITS, ARBITRARY UNITS
##FACTOR=    0.157963299565203, 1,           1
##FIRST=     4132.6476996994, 0,             0
##LAST=      -1043.33573715361, 0,           0
##MIN=       -1043.33573715361, -419638,     0
##MAX=       4132.6476996994, 365347059,     0
$$ Real data points
##PAGE= N=1
##DATA TABLE= (X++(R..R)), XYDATA
$$ [...]
28997 -15996 -8293 48702 131435 139703 43808 -17614 -42708 -42363 33719 78477 75231 32874 30064
28984 30064 25124 28074 -26515 -12971 52852 48572 15128 13516 45711 31159 7557 5557 -2049
28971 -2049 4576 17845 18180 11766 -3190 -39553 -8485 53073 51592 53056 55575 63601 55142 75731
28957 75731 57215 100889 133478 170884 132825 104353 90721 65579 101648 102898 148270 106906
28945 106906 57898 66546 49079 11829 27081 3369 -28847 -28154 -17765 -16743 4143 1827
28933 1827 -89269 -126631 -89162 -73573 -39435 -20735 51716 56925 101428 112140 69356 50987
28921 50987 13174 -33425 -725 6918 -11590 -58658 -102659 -80231 -20515 44734 32830 6254
28909 6254 1503 10271 3057 33817 49932 40094 -19867 -17782 34264 -4357 16322 38210 48051
28896 48051 36166 7701 16917 46338 10952 -12520 -51366 -39966 -28961 -22906 -7816 -18981
28884 -18981 -1712 29976 47649 82764 77664 52215 67606 83162 74921 94083 52431 42815
28872 42815 91106 92055 57289 28983 -7051 -6258 -42728 -53695 -72716 -100543 -43452 -31632
28860 -31632 -41041 -89558 -67920 -43222 -13620 2443 -5585 -25353 -69332 -48465 272 88
28848 88 -109158 -108692 13856 11010 -26132 21105 54445 -23985 -50604 28593 78657 32906
28836 32906 1793 29643 24386 -45370 -93717 -32649 -16630 -20787 -24886 25051 29022 -27415
28824 -27415 -48312 -39811 -51105 -48912 -57685 -60507 -6073 -8295 -39142 -13075 33988 101732 104946
28811 104946 76585 83301 67335 81380 73394 49340 3112 -32551 -47046 -65120 -64826 -26688
28799 -26688 18922 -3344 -45748 -56328 -20682 -30171 -30193 -56845 -129311 -120387 -100093 -72286 -82993
28786 -82993 -80226 -58597 -19718 18640 120438 112050 128904 147046 98810 24445 36598 39648
28774 39648 13818 -21612 -26170 -837 40800 68192 66100 108249 94901 87140 73414 60478
28762 60478 67612 -21139 -51227 -47674 60955 101682 123907 67769 33836 47338 72899 71119
28750 71119 65314 72140 24926 50398 23819 39937 82537 95479 59306 5748 24100 58504
28738 58504 73917 51995 39077 10946 17609 24912 50194 80158 90564 63545 75890 91707
28726 91707 14267 -5620 43287 81508 95526 88035 109121 67427 33895 3082 -39630 -46101
28714 -46101 -62754 -21827 -13307 28674 84494 91486 87327 48194 8241 -32592 -92488 -153375
28702 -153375 -142061 -123775 -106951 -59279 -88429 -83345 -6397 38467 74437 101470 104671 64308
28690 64308 30126 -40441 -43605 -55781 -43694 -62793 -75780 -90781 -115947 -122630 -127381 -75018
28678 -75018 -50455 32433 55405 64782 41860 39621 77406 87740 -33216 -69593 -69506 -2771
28666 -2771 43893 42111 58869 23019 14103 46216 62977 102793 164641 119314 49365 51590
28654 51590 105625 48965 35115 76076 58791 -48512 -62743 -40372 -50726 17990 39710
28643 39710 15086 31820 71380 62878 57879 33631 -2298 -37093 -75675 397 47199 36609
28631 36609 12917 38324 99192 67386 58121 62454 49480 91525 45627 28873 6490 36131
28619 36131 -14295 -31106 -17223 -6279 23820 39083 16670 -19417 -39178 -21290 -46897 -78179
28607 -78179 -61603 18725 66520 552 -28918 12181 31898 56020 30945 -4063 -16117 -33765
28595 -33765 -64817 -60520 -61042 -20377 13243 39285 -12298 -64027 -43224 6719 38847 41215
28583 41215 17498 -8386 861 85879 122634 54075 -51974 -52452 -53523 -41067 -20580 -39317
28571 -39317 -47591 -38477 -33835 -15526 4390 42620 23326 -48334 -17732 -6521 -16389 -23799 -32471
28558 -32471 2337 83385 115742 85940 6830 26807 99191 75697 81352 121447 73635 76816
28546 76816 61311 111048 110812 83269 37806 36840 59971 70157 19700 -33276 17962 32748
28534 32748 55749 113020 150669 85276 53254 -340 25850 58164 52984 52800 61492 54848 69473
28521 69473 86264 43397 36927 61245 86468 109500 113793 29102 9747 -7227 44000 59273
28509 59273 75065 68415 90041 84182 70585 55871 75950 79525 65394 43033 53854 46179
28497 46179 -21957 -48366 -96613 -89911 -78255 -47492 -17016 -3308 -60605 -82544 -100382 -34765
28485 -34765 8830 7121 -54155 -62516 -25643 -34278 -13563 19091 74506 38418 30506 26113 59184
28472 59184 10822 -7162 -13413 -2055 -10354 37424 34167 41124 -14009 -84205 -85804 -11035 68796
28459 68796 87504 42094 -7002 16285 30720 16618 35712 75507 42704 -2802 8850 22814
28447 22814 -384 6095 43253 36867 56499 89255 55128 38313 97233 147436 81570 49206
28435 49206 41226 40700 44506 45198 39599 26468 -19959 -47689 -17012 -36784 -33964 -54936 -44672
28422 -44672 -29452 47866 86729 75182 18556 8085 48330 111982 163717 114860 74261 73865
28410 73865 89179 80886 106540 71538 130912 164829 117093 57968 29855 31392 -6247 -47577
28398 -47577 -39873 76098 119406 58312 133983 144743 85913 64173 50479 53964 14296 2069
28386 2069 -14454 -67886 -68563 -52255 -13980 11922 -27967 -30402 -15458 -46620 -54855 12388 35141
28373 35141 -16346 -59271 -90353 -90237 -73125 -49198 -52536 -60028 -10575 46011 87601 85248 99628
28360 99628 101771 44997 54680 48036 -39424 -5421 22522 92969 90726 55163 30255 -6189
28348 -6189 7034 58430 8776 -12378 10565 16345 -21167 44087 80203 87880 58774 45336
28336 45336 46780 20352 13515 -12841 48842 69679 72816 29662 8123 -2300 -14644 -183
28324 -183 -35132 -8835 -24712 -77452 -37605 -3880 -12166 -55453 -59220 -40582 -27146 -59995
28312 -59995 -123603 -118839 -64862 -39028 -48913 -15874 8694 2871 26136 52193 58411 77185
28300 77185 32358 1354 -6068 12925 -4192 -17215 -14954 -11099 1564 11334 -11739 -51420
28288 -51420 -66136 -1624 -36187 -69956 -59770 -26671 19963 130730 190946 134198 74720
28277 74720 21478 -14673 -36363 -33548 18148 -3971 -82918 -61096 -21552 38780 8608 10340
28265 10340 595 13178 19075 -9236 -20954 18044 29503 -17471 -15404 56575 50445 76302
28253 76302 29926 26145 71237 51701 52113 36140 34187 20228 -7117 29005 65514 29863
28241 29863 21928 12414 7298 25720 2976 -31077 -309 46724 15997 -31828 -1433 26437
28229 26437 16070 -20811 -52237 -37333 -37682 -31634 21456 47113 67418 91340 43598 19645
28217 19645 36624 86076 96769 66183 39089 21151 16686 -28585 -31996 52673 126591 147649
28205 147649 90722 66237 18591 11521 637 38105 67343 10973 -51125 -15274 10736 -8478
28193 -8478 -1413 66203 111120 33399 -50387 -129375 -152978 -129454 -78221 -16036 -27427 -15058
28181 -15058 -11287 -21463 -79344 -61473 -84176 -47464 -33091 -55834 -62216 -46818 -8588 59347
28169 59347 89612 103909 73263 57827 56272 42519 36520 44563 56072 39839 48793 60616
28157 60616 45306 67802 89142 63789 30109 52819 62693 47795 75339 99891 109010 101953
28145 101953 42926 -1186 -4698 49397 58118 104418 123489 65667 67144 85689 71595 55895
28133 55895 2906 -51065 -41595 -39851 12599 41155 47274 89707 86173 117631 133847 109499
28121 109499 113926 127324 100115 66629 42247 2453 -32935 -72359 -110899 -68916 52292
28110 52292 66887 39703 38162 46426 52499 28875 -13519 -92582 -90014 -64170 -38998 -2950
28098 -2950 7056 -41225 -1912 66229 117733 82303 104209 86899 21981 3620 -16491 6493
28086 6493 -144 -2458 34049 110993 143101 141206 120030 45357 10568 13211 7339 46936 95306
28073 95306 103143 46264 -12015 -13937 -28820 -74859 -41176 -46680 -40721 -70480 -50400 -69577
28061 -69577 -81244 -21841 19301 -634 27224 110901 45085 -49774 -112615 -100272 -101630 -56036
28049 -56036 26703 51680 71053 80512 62430 7655 4470 75673 81315 31481 18358 32260
28037 32260 39894 14954 9179 24112 -8408 -15563 -35180 -104989 -93275 -125780 -97215 -59838
28025 -59838 -27626 30233 55124 30133 17620 79262 129056 131931 93142 34871 4761 -37890
28013 -37890 -78175 -36362 51442 8359 28002 32950 -22753 -60072 -789 88488 147715 79711
28001 79711 84092 112446 64396 48193 55532 58810 19660 41882 -7670 -40186 -7825 29390
27989 29390 70060 101992 55857 -19283 -36445 -62136 -80080 -83342 -40210 -7963 32481 32156
27977 32156 19671 37320 21245 85678 139964 84258 22648 -40075 -81606 -49852 -3494 4301
27965 4301 -6153 23513 -29162 -73814 -70140 -28409 -45914 -18176 18302 5109 -31614 -45954
27953 -45954 -64004 -91546 -41949 -65561 -97278 -86300 -30774 898 16000 -6855 -26583 19606
27941 19606 -17317 -1688 30208 72751 68545 38670 -1186 -26637 -2113 -36496 -54904 -18950
27929 -18950 30060 -1927 -34455 -96957 -94736 -69335 -26259 19683 69151 117187 111943 142929
27917 142929 82929 63720 79322 70090 43355 46312 32113 -1347 -49149 1636 83684 64270
27905 64270 36382 -66228 -78108 -50508 -65544 -31788 -54721 -41707 -22321 -33287 -20551
27894 -20551 38533 49290 -34606 -96880 -86753 -52244 -50033 -55424 -32695 -119912 -117103 -109493
27882 -109493 -68281 -39256 14070 13519 56179 68416 73950 44671 31343 -2253 -38726 -57293
27870 -57293 -51481 -62654 12366 33578 46589 35450 -21525 -15735 22081 135 32950 91582
27858 91582 114719 145506 117761 60119 3207 28899 -26677 -32889 -17278 -36176 -58323 -13338
27846 -13338 -3166 26290 9592 40691 48267 49833 89664 70218 88388 147966 29584 -8727
27834 -8727 73492 17959 7705 14873 38133 39607 -788 -41086 -9585 9147 50294 61534
27822 61534 37620 -12094 8937 35145 60525 81049 93221 144899 133666 51391 45845 31499
27810 31499 27163 40961 -44299 -54347 46133 90818 80339 61700 75181 76424 90177 38414
27798 38414 -2489 -40301 -27964 37950 64399 9228 -473 -6920 22002 -14506 -55117 1960
27786 1960 21116 30011 33972 55141 86352 47162 53169 25843 -25360 -5525 -28922 -75702
27774 -75702 -45339 -82625 -63083 -16285 -8873 35982 35617 27969 28680 -869 -5812 -10216 -15335
27761 -15335 -30991 1584 -13809 -7732 42616 88662 149961 129856 73041 19762 -1395 15779
27749 15779 -7042 -55010 -14371 2079 -8605 -7581 -4935 5531 69910 92599 87330 50226
27737 50226 47053 67961 90277 109808 39514 -20536 625 -1506 -6075 -45969 13476 4126
27725 4126 -20524 15488 46479 82373 98355 80999 88052 88980 52405 55866 42705 37879 43067
27712 43067 50881 81414 85025 94991 77360 42495 24091 26733 -48566 -81051 -62835 -54212 -89458
27699 -89458 -98481 -31432 -12795 -80752 -80096 -101484 -87548 -111512 -140296 -121047 -65575 -48838
27687 -48838 -37721 -57199 -22177 13531 -12870 -33038 -29391 -51563 -19119 -37619 -49652 -25767
27675 -25767 52615 77427 106180 18404 -21646 17528 39880 3608 -42190 23385 34761 40608
27663 40608 16113 18156 -17587 -48982 25146 9898 2671 -34646 3847 28504 56943 24295
27651 24295 -68264 -65355 -61505 -17737 18719 26014 18521 11405 16870 -159 46702 39995 28265
27638 28265 42094 50875 6700 -7307 25009 -10256 -76306 -31116 17842 -22878 -27857 -70766
27626 -70766 -88360 -95950 -51641 19088 43214 -14175 -40207 -21239 56015 53617 26837 -31643
27614 -31643 20024 74349 96942 74511 30758 42095 56820 65904 -476 -21251 -25723 17109
27602 17109 49473 44819 2080 32880 98985 72212 57146 43966 -7735 -12039 -62945 -66365
27590 -66365 -62901 -71062 -32464 -51730 -92401 -87538 -98399 -105433 -121352 -107838 -61896 -65704 -47673
27577 -47673 -15793 -30376 -10493 2137 -25485 -32509 -46880 890 104940 128297 125747 75223
27565 75223 37564 51712 55463 102313 52796 -2462 390 12313 12154 43398 134178 75895
27553 75895 6512 9309 8490 33572 -2325 53239 83128 78742 70083 54183 114752 136197 95810
27540 95810 42610 27983 5302 -40737 -30790 18177 46756 14843 16690 -29226 -57654 -876
27528 -876 33301 40680 27359 77997 175043 170017 115856 44581 -13940 -43792 -60393 -76199
27516 -76199 -73304 -36420 2509 -26698 -8336 -33838 -37495 -44142 -16870 6673 25563 27316
27504 27316 659 13715 96179 93980 48504 14202 -3149 -37942 -55747 -48218 -67304 -79264
27492 -79264 -19172 -23359 -62103 18314 59878 13624 18324 34053 47055 93164 108643 137420
27480 137420 91421 133390 141854 155296 204671 236112 163057 42380 -38396 -64596 -20715
27469 -20715 15488 10761 -7056 -35435 -56234 -51500 -36325 -45675 -208 8731 -17184 22804
27457 22804 29062 40543 32778 13346 5708 6762 8267 63804 53635 21389 4230 -26714 -48044
27444 -48044 -63411 -34799 14028 46582 72405 41224 79438 104897 66828 54443 26259 30438
27432 30438 17104 -5382 52884 80657 42285 54377 29097 7480 7575 63722 67276 4957
27420 4957 -23698 -84247 -98815 -60185 -269 -38849 -110447 -89135 -88697 -65939 -10556 52945
27408 52945 71345 54487 -21047 -65234 -64345 -47114 -61810 -115436 -97056 -121009 -19877 57250
27396 57250 31661 -30488 31482 44508 49094 37575 2848 -10147 -5013 24972 24894 46279 93615
27383 93615 105815 27336 37297 70662 78309 46659 56048 21877 -16168 -2127 23213 22838 20432
27370 20432 547 -20452 -33324 -35062 26434 21221 26565 65395 112127 106951 81206 34812
27358 34812 24907 84046 75345 56226 83520 41364 283 -30429 -50725 -16817 -44183 -81433
27346 -81433 -125212 -135975 -66257 13997 88107 73885 62886 76303 118992 87252 25987 23491
27334 23491 37978 67821 40033 30150 140625 128445 91586 87911 44589 21663 -5512 -2856
27322 -2856 8475 33717 32128 39708 13223 3332 26947 809 22322 2748 -43316 21875
27310 21875 33937 80254 53411 11954 -14184 -70928 -67824 -78136 -120598 -101183 -71900 -42432
27298 -42432 -14110 -17245 -6944 9485 -22911 -50228 -56030 -3142 77227 50947 11620 -28662
27286 -28662 -46789 -8430 -47635 -49149 28871 71360 27866 3044 14642 -28849 -107894 -78833
27274 -78833 17426 37663 37004 31891 -3580 -80694 -80356 -50549 -23580 -14798 13616 43666 51647
27261 51647 62263 63258 -4148 -60714 -95953 -63458 -28837 6055 10062 -34546 -1371 39052
27249 39052 73472 82982 62287 -13989 -17244 -37123 -7493 -62109 -89276 -64862 -47205 -59035
27237 -59035 33391 61526 67741 77485 117028 79621 -13427 -42172 -40643 -16439 49556 67604
27225 67604 1610 4506 15681 63895 58148 47279 131538 136990 123288 124670 187744 140646
27213 140646 24572 5409 56998 60321 40864 21886 60041 88713 102028 76759 33542
27202 33542 -40936 -38405 6133 44716 43062 19370 39347 -36459 -63027 -38792 -20242 -20837
27190 -20837 -52043 -54325 -64237 -88597 -89827 1108 112063 99603 56040 57509 50670 -4746
27178 -4746 2527 6061 13192 23344 2869 1924 26745 24758 69487 122904 149232 100702 64574
27165 64574 79968 41842 -28503 -81818 -135974 -111277 -83660 -7532 21582 35384 -12366 -94491
27153 -94491 -70786 -50017 -20374 -3018 22163 15283 43655 37888 -10404 -13099 3036 9660
27141 9660 -1810 31881 109937 73519 -4102 -49475 -68687 1244 -19985 -37406 -16856 -34599
27129 -34599 -12822 27996 -11500 -47491 -43764 -12688 55854 52285 32894 111886 85232 58236
27117 58236 -115 27716 50277 41138 -15608 30667 74799 89560 93181 77762 53265 56376
27105 56376 95767 112751 52118 -8826 -32027 -24807 51414 36769 41988 115724 98740 40562
27093 40562 -23470 -13754 2095 26041 31103 -15043 42199 47527 55564 8091 32035 39486 -31
27080 -31 -58895 -49612 -10558 29288 -2717 -7579 36316 3586 -42612 9837 72126 75026 67057
27067 67057 44118 23782 7083 34719 76903 63447 7749 -52308 -26669 41532 90965 112306
27055 112306 113937 69133 12539 7581 35713 29897 76979 80414 45040 72148 75683 37931
27043 37931 -45150 -6178 23834 49728 91757 99109 80442 41721 -7708 -77127 -37618 35850
27031 35850 45656 46022 24329 41461 11833 -34245 -34524 -29185 17242 19856 -28947 -57813 16707
27018 16707 42424 49051 37907 -5562 -46886 -68750 -64079 -50541 11838 -40240 -74471 -19276
27006 -19276 29236 -855 99023 102910 41176 23716 2722 24284 69140 38874 23830 111235
26994 111235 133090 71896 -1083 43094 51021 24411 28710 69967 48758 55348 1213 -13716
26982 -13716 17516 31065 51377 66242 41660 54975 72559 55278 16255 -13673 -4938 14145
26970 14145 -19874 -6058 42887 51329 73857 66056 6757 -11246 29253 58298 66229 74522
26958 74522 51804 60720 72205 74078 51486 16635 33728 33365 17496 6244 15732 3919 34142
26945 34142 73601 71545 15232 39475 62526 117249 137427 88757 81127 113165 85197 23274
26933 23274 1998 28574 98446 155732 100917 31441 22568 23965 5497 -26249 31112 57429
26921 57429 1073 -55770 -76384 -18841 20304 83103 43486 16775 10570 -23345 -89679 -109242
26909 -109242 -100049 -78659 -4322 32639 27455 58242 6251 -13199 14146 40029 21610 -31421
26897 -31421 -25037 -12471 -9210 13248 -7178 15908 84941 134854 64256 72815 54186 90048
26885 90048 84572 28896 15673 29580 63098 113844 66149 55570 26435 -80992 -103157 -83584
26873 -83584 -33856 53398 63071 48729 -70364 -64193 -11105 44535 77357 63741 37582 696
26861 696 -20254 53563 118125 146382 78555 37301 43691 35719 -8298 34502 -2138 13075
26849 13075 62293 86683 87232 80486 98226 65647 37714 13200 69690 70098 -26025 -31424 -49445
26836 -49445 -25619 -16603 -24944 -36309 -44685 -56751 -60725 -35982 8213 -10242 -9116 8985 19443
26823 19443 -21889 -78928 -88453 -44912 10135 -16698 -56299 -46928 -23754 72337 76960 54165
26811 54165 85607 138787 113350 67979 -15150 -74033 -58259 -59026 -14309 63289 81942 53328
26799 53328 20883 -44762 -18133 -8260 -29396 -54413 -64385 -96704 -98269 -64886 -23485 -115
26787 -115 -19516 8457 -32337 14772 97195 92276 113497 75896 12083 30863 18394 -6707
26775 -6707 2767 8754 39079 12027 -18447 -16419 25420 11154 -9759 16388 -26816 3581
26763 3581 3301 43342 47207 23174 2570 -6063 -37906 -15645 -16147 -39691 -100323 -120882 -100299
26750 -100299 -113880 -109838 -114435 -93245 -83347 -46713 -33691 -12794 -1586 35863 25866 17137
26738 17137 68459 78863 173 -101553 -108786 -90501 -90068 -10924 40655 42879 29691 14776
26726 14776 -80368 -159093 -113165 -53861 -17462 -8498 -43406 -37976 -38158 -58387 -60566 -55988 -80609
26713 -80609 8866 16218 -17170 -76200 -73720 -35214 40145 56193 -5328 18390 102458 109116
26701 109116 58004 99357 123451 51947 26311 -8003 -44075 -142492 -167004 -94875 -54837
26690 -54837 17314 63722 44033 -31907 -47436 -38408 -41117 -35205 -71271 -27026 19037 17585
26678 17585 -10474 856 -8817 -16145 26754 39639 29336 30458 -19236 -66972 -99400 -84531
26666 -84531 -43593 -81131 -64084 -18911 -22127 -32367 -38973 -48488 -13605 -21885 -46497 -48561 -14883
26653 -14883 -23212 -26314 -62394 -80002 -74799 -84398 -100229 -155554 -163820 -149391 -139938 -146892 -150208
26640 -150208 -108121 -19847 -36762 -31003 33534 49193 3322 -72523 -67644 -33257 -88984 -6439
26628 -6439 91790 118238 97297 82137 105244 71361 31594 -7535 -8449 12246 -16156 10439
26616 10439 41822 53390 32406 73451 100638 65789 27317 -62749 -95631 -44950 -24402 -7373
26604 -7373 1456 2576 20788 87593 102454 44821 49165 101107 128479 97289 -6097 -36142
26592 -36142 -55968 -20218 90189 98729 74855 48097 -2007 12266 48509 65886 37982 4490
26580 4490 -16457 -45648 -128538 -98641 -24222 -20076 -24655 8523 43583 80764 51773 87802
26568 87802 107554 85548 86814 62193 62045 59163 -11218 -59336 -38123 48431 72310 45831
26556 45831 34103 -18710 -33481 -16644 -44907 -68913 -33379 -33801 -9267 23934 12154 -15903
26544 -15903 -5048 50552 159031 170804 159786 86636 49545 61323 82282 52235 57942 25332
26532 25332 35361 17942 -31364 14050 19475 -14048 5181 22229 88712 74460 18592 65590
26520 65590 35953 26149 68144 38473 -73525 -98185 -38441 15214 22800 30311 -2336 -61918
26508 -61918 -91593 -105979 -12779 101081 141823 108714 11490 20126 64495 51704 14829 81843
26496 81843 89002 76618 37611 -9753 20203 8528 53364 59325 86752 84885 48797 24131
26484 24131 -12689 -66419 -85792 -10559 41652 70069 60514 13298 -41466 -56022 -55161 -1170
26472 -1170 9998 -59569 -25421 33902 59711 47302 1218 -47956 -2778 6084 38763 59577
26460 59577 -11647 -92734 -109368 -66953 -64063 -51950 30713 -8787 -98650 -120906 -68116 -70890
26448 -70890 -76973 -93672 -86650 -64600 -110060 -104003 -81944 -145983 -172259 -139777 -111767 -45266
26436 -45266 -29370 6046 400 -23665 -28840 9911 33009 -21495 -26881 5427 -16080 466
26424 466 24183 -14401 -53365 26200 46638 23220 -57241 -44003 -19261 -49351 -56358 -39382
26412 -39382 5822 28078 1992 23761 -21220 -5447 14614 -21247 -11004 13660 -17994 -86607
26400 -86607 -100451 -93630 -74431 -81829 -61266 -14381 -12212 -2094 82353 99385 68677 75695
26388 75695 89792 86845 83219 87215 91439 97185 80431 85992 129062 138056 128918 120217 98228
26375 98228 38450 -56859 -39645 -23944 55104 22713 13641 -1645 -12053 48991 74582 40354
26363 40354 -10377 -46626 -33799 -58193 -53379 -14710 70809 164302 190588 129752 126407 126708
26351 126708 103435 99166 78171 61122 94374 99889 67421 63588 122882 108019 94786 28918
26339 28918 -19277 11590 29346 40521 25079 38165 48598 13532 -1806 10535 -24753 -37875
26327 -37875 -35186 -50536 -75425 -72885 -88081 -94278 -34923 57748 40235 12888 26857 24440
26315 24440 -32524 -1297 38681 17014 -42079 -69639 -93331 -45066 -36211 1227 68745 65101
26303 65101 13097 12887 43352 70077 77367 98022 79862 24215 -341 4769 16134 72294
26291 72294 115552 172199 111900 24075 3486 -3587 -59490 -38233 -44498 -86607 -90482 -79192
26279 -79192 5525 11886 -45867 -35738 17842 37797 25223 -46104 -39997 1284 26362 11742
26267 11742 -5280 -45494 -74599 -58133 -35750 -59178 -73170 -32855 -10809 -31662 -57494 -68809
26255 -68809 -39857 43765 98499 143808 94061 9063 -11057 10397 -52839 -77687 -37649 17437
26243 17437 52928 62602 118318 145305 58642 15583 -6816 -6445 -31330 -24626 487 75852
26231 75852 66472 48954 38391 8585 -78436 -74356 6438 -2317 21975 100686 101224 102743 100947
26218 100947 74620 11191 19579 15234 13824 54160 17675 -50343 41548 114901 116386 129687
26206 129687 152073 120522 70295 71568 75789 44699 44561 58825 76369 61166 38993 27772
26194 27772 39679 43637 -12425 -66097 -57496 -28224 16941 -11218 -27068 -57058 -53792 -73741
26182 -73741 -74836 -79803 -51465 4363 -24390 -54395 -22563 -234 -8007 -2228 -68919 -109329
26170 -109329 -77268 -81697 -49785 11 48343 69677 23403 42739 -19531 -16661 62050 88924
26158 88924 76439 32191 -38154 5483 17933 38592 94406 70348 23001 31 26767 72741
26146 72741 33619 76797 5649 -61888 -74524 -112933 -41827 -6656 18431 44464 37267 50000
26134 50000 67140 71085 94608 79649 73615 80531 25366 -11016 -31230 -65104 -108860 -59372
26122 -59372 -24917 10680 14466 39854 43613 27655 -19191 -54079 -88008 -79516 -49263 -36512
26110 -36512 -43593 -33652 -16361 2950 -19741 24741 17559 -12702 -41338 -43137 8111 -11542
26098 -11542 -26487 38731 49755 72889 90595 88308 72679 33240 -31244 -77381 -81395 -66258
26086 -66258 -74243 -26023 17817 -3554 -12268 12318 43258 62466 59747 41371 68023 58286
26074 58286 40131 48818 12243 62829 148604 121417 101480 93585 108225 69455 45957 52644
26062 52644 58411 23970 -25361 -38500 -78699 -85887 -35802 28075 22764 26106 70107 18600
26050 18600 -30455 -220 8176 -11719 31180 21648 86375 77127 31134 -32593 -67901 -92079
26038 -92079 -61593 -31608 -44859 -49261 -17371 24926 52310 113632 112239 42176 1558 18541
26026 18541 108600 82950 7495 -28490 -51898 -45837 -83779 -64148 -30982 8989 27368 -31493
26014 -31493 10189 4038 879 -29717 -75296 -44763 -5092 34283 44082 -34375 -75824 -55967
26002 -55967 -92874 -148045 -92762 -44495 -18808 -8870 49087 193 -84373 -110570 -117960 -128594
25990 -128594 -40641 -18359 33773 74081 51464 61610 86541 76587 44852 -36463 -22592 50074
25978 50074 95594 74964 24681 25049 45725 33060 -5484 -39668 -44176 -16387 6184 -27279
25966 -27279 -27449 -2787 49390 29840 -20843 -47199 -71772 -114931 -97300 7726 55549 40802
25954 40802 10783 36368 -16191 -69087 -120192 -91610 -14746 34346 52725 69552 62832 -14431
25942 -14431 -10060 -22165 -97335 -98817 -55016 -55725 -138684 -86232 -9028 -5094 -7196 36053 1030
25929 1030 1529 10279 31856 55144 3825 -24452 -7412 13452 -10260 -4544 -10578 -26843 15102
25916 15102 44196 24283 31896 100569 192300 159326 122672 68651 89098 79752 72241 101975
25904 101975 104634 105871 133732 144819 52755 -44347 -135776 -112789 -13442 49852 107963 116490
25892 116490 73611 25562 4003 39788 12690 -30015 -50274 -6234 20697 -31321 -45218
25881 -45218 23117 42399 -39679 -64391 -54053 16945 50285 125980 45735 28474 24097 27308
25869 27308 -32245 -80413 -56793 5926 34819 78455 52616 8990 11028 -4819 19031 49922
25857 49922 75922 112235 98649 56697 41942 15599 -16841 -29844 -15276 23430 31784 31154
25845 31154 57608 -17743 -45085 -40956 27235 17000 -25577 -23973 38123 59924 83945 110642
25833 110642 102165 77549 46959 30820 22936 3666 17482 71916 72337 36736 49127 20327
25821 20327 22694 17840 -2269 39340 115370 68646 49104 100569 43932 -50380 -72177 -55729
25809 -55729 -553 9498 73945 103236 113655 23484 4938 31137 45814 28865 7204 3193
25797 3193 33448 20746 26313 41917 32743 20259 23831 42544 65180 68479 -23000 -90903 -138625
25784 -138625 -134110 -67312 -76299 594 70401 52145 7536 -1682 19824 16828 31369 14530
25772 14530 18513 35901 50482 -16322 -3585 40876 61127 39845 32262 -30680 -42032 -15596
25760 -15596 49 39457 55362 66353 87499 99102 49894 3182 41846 21824 -16585 -2684
25748 -2684 -9425 14 -233 -35622 7671 50963 26716 70801 110198 55741 93528 64631 61081
25735 61081 48490 -29253 -62559 -42658 -35615 -10072 -32064 -37684 -3915 10824 39424 19886
25723 19886 -18105 10915 -11374 -34040 -12720 -10813 39273 47942 47767 52540 39433 51094 75705
25710 75705 38409 -8997 -43171 -43199 2931 15690 -44969 -93673 -88128 -73679 -114187 -78221
25698 -78221 -48499 -66025 -9587 -48186 -97996 -41177 63316 91883 50057 40531 67091 123569
25686 123569 143833 64267 48241 43463 -38050 -65253 -62273 -56077 -47481 -42809 -73198 -34979
25674 -34979 34550 -14577 -59006 -91155 -125495 -22957 58176 65528 72378 53089 93791 93036
25662 93036 80552 45985 55699 68896 5089 -104541 -105543 -66234 -45224 -15535 -15822 -26321
25650 -26321 22731 48787 30907 65315 25435 -15805 -31260 4622 22303 40297 56139 -2181
25638 -2181 -38032 28673 -13219 -109602 -69366 -51754 35304 110539 113344 93555 40700 40363
25626 40363 80476 48930 30459 15085 -27350 -72871 -55918 -19731 -19342 -85027 -57289 -50379
25614 -50379 78287 139263 86101 874 -41729 -37329 -20359 -49280 -3376 77758 30599 52528
25602 52528 27557 -12817 -14243 47745 87465 53671 -16528 4246 88568 105044 121593 67801
25590 67801 30332 19250 -21286 -19666 -46631 -99557 -84129 -28445 32878 -36232 -75104 -86777
25578 -86777 -65251 -32191 -35654 9379 67520 72024 28689 11246 33435 79020 85755 118138
25566 118138 68831 15248 -30474 -101 -25017 -49931 -42975 -63872 -88282 -56770 -15491 -21608
25554 -21608 31738 68906 66315 64793 70489 51133 -8393 -1038 43398 68110 109615 118513 83775
25541 83775 56590 55382 103073 85930 61748 87943 86422 66011 52560 46387 34396 -31743
25529 -31743 -47007 -36848 13732 -3610 -71202 -108210 -67638 -33391 53338 37603 15726 -15029
25517 -15029 38973 9527 -28216 -25213 -12303 43214 -21340 -74930 -13571 -2896 -45922 -70883
25505 -70883 -70562 -32452 4871 24081 25439 16625 34513 83055 50938 16322 36554 43411 69651
25492 69651 -2987 -17036 -17024 -17095 -62179 -67009 -79145 -54430 -64359 -31190 30551 52653 28802
25479 28802 -70273 -74189 -46402 -54540 -28927 -7553 8110 -14957 -15026 40033 17933 40877 102193
25466 102193 97090 5558 -6183 40586 60102 65498 24609 -1512 29458 -13445 -72837 -121219
25454 -121219 -80342 -102399 -101266 -50414 12009 34940 75884 134596 73906 3488 -17856 8005
25442 8005 20136 45241 59200 36810 23913 32548 39694 75895 70707 -7333 -29794 3343
25430 3343 -8680 2186 27107 19158 -20204 -206 17265 -537 -9978 -35961 13001 77135
25418 77135 50737 42980 4035 -7383 29305 20924 -19991 -66594 -34647 -59353 -57760 -26402
25406 -26402 -25748 -8326 19412 -4120 -8821 -3568 -45536 -21036 50848 57754 6975 6802 -27725
25393 -27725 -9554 60605 57947 27367 -2532 -32753 -7573 5646 31213 71762 57479 -11353
25381 -11353 -38200 -11537 -24835 -90491 -97680 -71894 -52376 5759 -17345 5615 46257 12845
25369 12845 -15342 34784 51224 54114 18421 4760 27029 -1169 -55979 -1712 13223 -8938
25357 -8938 -14154 -8998 39217 41257 11019 1581 20645 -20936 4742 9144 -32474 -83755 -18451
25344 -18451 13034 -44872 -114563 -67835 -25690 444 24872 -19025 -10139 12374 62679 68876
25332 68876 27083 16841 17183 973 17352 21717 16215 19193 -23705 -70527 -72653 -81075 -85423
25319 -85423 -69257 -66754 -85466 -79058 -55859 -5396 -1292 -20947 -13593 50767 74594 32719
25307 32719 -7625 -4175 1865 17301 55653 77578 62479 33360 15555 34366 48668 118261
25295 118261 51159 -80846 -167968 -155662 -107710 -47225 6333 -18209 -37065 -55978 -68088
25284 -68088 -37721 -86088 -96494 -112075 -60399 -6310 20008 -7306 85727 144135 74157 36589
25272 36589 46046 12631 -17701 -46879 -59769 -42588 -41055 -59141 -16559 32325 8621 -20193
25260 -20193 -20557 13222 43861 -5038 -17540 5326 19617 41383 68831 88423 84783 101339
25248 101339 60423 9308 -7636 -14997 66481 83503 56986 13834 40799 57451 35884 50353
25236 50353 14037 -31713 -67079 -119596 -124648 -130252 -114387 -127785 -87841 -1948 4079 -15377
25224 -15377 -28771 -86810 -101842 -120145 -49315 -18941 -36507 -29629 -22443 -3225 38116 47256
25212 47256 61133 55055 45585 24700 -9023 12819 51549 76792 62571 -25021 -127319 -120622
25200 -120622 -127856 -77068 4165 56346 28986 43718 11695 -44022 -32676 46877 65954 48797
25188 48797 53800 44579 58175 24813 3564 14236 30391 -22862 -84872 -42423 9575 -55229
25176 -55229 -66512 -50538 -44695 37235 9816 -10669 87386 91632 51286 14858 12450 33859
25164 33859 41277 36050 6996 -83244 -52272 -57621 -97724 -45672 -38050 -30557 -7527 56652 99021
25151 99021 92242 102457 51786 4658 -21118 -62205 -82305 -52591 -65208 -67285 -28491 -17270
25139 -17270 -76003 -2451 25467 2343 -34189 -10576 59302 113411 130037 92980 52621 -17307
25127 -17307 -26681 5226 53802 44589 5079 -51399 -88967 -76646 -116491 -85641 -102322 -122736
25115 -122736 -87674 10543 49462 10905 7269 -48301 -80007 -54341 -17131 -843 -29055 -24316
25103 -24316 33010 73318 4290 -47276 -8208 20342 -1090 -64533 -44762 39099 38946 26520
25091 26520 19550 16644 101826 75332 11639 31354 84015 89175 81728 105277 82544 31104
25079 31104 28055 -24269 -92122 -94331 -79018 -48461 -59642 -68847 -90752 -138806 -122635 -109005
25067 -109005 -155415 -146966 -56416 -10295 31263 6137 9904 -63521 -107861 -105191 -96424 4572
25055 4572 44050 -38347 -37882 12558 32475 17710 -26879 -51494 -46152 -28219 26766 30315 50254
25042 50254 -10287 52531 49762 16830 59293 84815 22606 20774 24830 -6082 -31638 -21585
25030 -21585 -895 -16948 -2264 34811 59607 44013 19538 -17954 -503 -14154 -13225 -16405
25018 -16405 2442 -41963 -53259 -38756 33079 37535 52385 72108 72386 102315 113334 108235
25006 108235 107965 79616 49484 57863 70857 36311 65872 53874 -30190 -92226 -36881 56797
24994 56797 54291 50440 -27868 -28352 13686 18102 13309 125393 159372 124091 92982 111408 53824
24981 53824 -26730 -24694 -1349 -30190 -26668 1217 13903 12809 -24529 -3987 -8811 -9166 -16521
24968 -16521 -26323 6047 7124 32896 17943 -40779 -4737 45715 14725 -44598 -25379 -52360
24956 -52360 -73495 -67347 -63682 -30616 -5469 -17510 -15518 1776 20804 18370 -56483 -41816
24944 -41816 -45942 -40071 -9082 7071 29112 5341 -55743 -32672 -1400 12563 -30491 20255
24932 20255 73129 38229 77284 28707 -79842 -46691 -17053 -6881 -17063 13579 5970 -16881
24920 -16881 16108 51153 52764 11547 -38601 -45451 -11192 19839 17591 3476 -42974 -34603
24908 -34603 -2162 -3037 -6488 -5139 -19963 9916 13623 10781 20027 -1080 41578 56079 33600
24895 33600 9635 10066 40158 13424 32885 78039 73180 72809 89851 64740 12626 26871 43397
24882 43397 45361 29713 15885 20877 4650 6962 -48721 -38392 16219 27322 -26772 10023
24870 10023 13853 -23321 16487 90130 40831 -10322 -72809 -1700 79818 131475 85655 56664
24858 56664 86621 32267 -48068 -57906 -46611 -40610 -11330 44708 101264 90386 22842 45022
24846 45022 17639 -924 34819 6614 -12462 -26672 28817 -6899 -62515 -81748 -26212 -15981
24834 -15981 -6015 -26359 -95231 -63438 29266 4026 -33038 -57752 -57963 -41222 28707 84753
24822 84753 78765 10008 -14036 25583 -4274 -15413 39274 23888 -23396 -64653 -122706 -109015
24810 -109015 -74131 -94556 -127520 -74994 -54375 -56392 -101363 -147190 -143657 -134509 -133368 -38575
24798 -38575 -31091 -72244 -253 54444 51441 38858 10286 -26285 -36776 -6398 11413 45019
24786 45019 60483 54024 21529 14215 -12329 -31765 -26268 -3860 41620 8819 -28170 28101
24774 28101 76096 56522 29496 32037 25879 45885 -9779 -15751 -1590 10530 6749 -6956
24762 -6956 2339 -24830 -29065 35940 45351 14971 56554 42457 20716 233 -46250 -19514
24750 -19514 -78382 -89113 -93988 -88914 -78058 -85144 -65417 -52995 -102641 -98712 -30999 -18126
24738 -18126 36031 32479 40141 48765 72947 49214 61424 52733 32883 122939 92832 -8086
24726 -8086 -49002 -58083 -54737 -49271 -45159 -92201 -99936 -109484 -96834 -60707 31347 64579 53386
24713 53386 71162 84147 102628 98340 69871 -30013 -69468 -25749 -25724 -28309 -14751 24384 -22079
24700 -22079 -53624 -67652 -87680 -56613 -35050 52088 38769 16670 43439 14978 34057 9043
24688 9043 -22212 -28231 23761 145 -50248 -20709 -33265 20677 52253 57752 38940 -46819
24676 -46819 -25212 12472 29397 34975 46304 77875 127566 56601 -3603 -27790 -8500 -33470
24664 -33470 -39450 -62210 -78138 -46499 14651 14222 -59814 -79752 -31948 38138 63250 32236
24652 32236 43351 4138 -16429 -7089 -10089 59156 125368 101070 2279 -45022 -69653 -37705
24640 -37705 -32997 -56166 -82060 -112275 -79964 -59242 -59711 -46322 -73133 -84828 -43349 -31606
24628 -31606 -91616 -127864 -120576 -38306 -16935 -17934 17773 23725 15851 -18787 -48904 -26290 -8376
24615 -8376 18147 20721 -52152 -67446 30135 38981 22704 88074 95443 86799 93350 98925 78607
24602 78607 40807 -22113 -51542 -52836 -17683 27810 55902 36533 4753 21682 -5952 -24419
24590 -24419 -22036 -20112 15224 -45823 -10692 40196 17664 -8347 -28566 7673 22257 -14022
24578 -14022 -41445 -33247 -21497 -9160 -12587 -16802 27883 -43299 -43935 21821 43352 37079 54164
24565 54164 19096 -10447 14083 95346 46941 -13758 -89915 -122452 -107302 -65751 -21199 -11988
24553 -11988 -47730 -75073 -13224 39271 75935 84232 3998 -80761 -38848 -34174 -1726 -11897
24541 -11897 -15762 26504 14753 -20352 5305 -55531 -119553 -133464 -91497 -54303 -44769 -45938
24529 -45938 -98649 -83988 -70336 -89652 -49409 -6003 -6440 -66295 -114555 -62829 -13388 11471
24517 11471 -2646 -14930 -20194 -9418 4166 -11639 -28671 -57368 -67846 -62021 -2005 7120
24505 7120 17985 27591 2640 -80041 -75458 -21902 -25755 -45536 -29235 -55546 10794 28630
24493 28630 46367 74078 104188 72982 67021 28724 32161 -73417 -110080 -76708 10648 57526
24481 57526 44014 12835 954 -10746 -29009 9784 28100 -53923 -65586 -92565 -130275 -140082
24469 -140082 -76961 -31778 19879 104752 96148 36329 -15338 -57675 -32381 -10223 12107 6542
24457 6542 25515 6457 28350 88242 93544 39994 -544 -49335 6503 41440 49593 63135
24445 63135 7109 -42665 -28795 35553 39653 -22326 -74251 -50650 -35850 -25681 -26659 -26069 -39580
24432 -39580 -34896 -17731 -10668 -32492 21426 26032 -21425 -378 1006 11580 31276 -12057
24420 -12057 -71218 -11174 15629 -16460 -61053 -49396 13308 24156 28167 -31287 -62052 -94223
24408 -94223 -128779 -68290 -55981 -39356 3252 41086 -39681 -109436 -104953 -91463 -70298 -95255
24396 -95255 -90411 -51020 -63554 -66472 -61982 -488 42820 22522 -6008 4909 -4932 -47510
24384 -47510 -61120 -1143 -12248 -40389 -55600 -51356 -7673 -48859 -11390 -40340 -64074 1783
24372 1783 50436 2958 -18523 33703 53233 32306 -46134 -59142 -69595 -56158 -56512 375
24360 375 14210 -4733 25436 47610 9059 -49191 11203 83229 101549 95286 67323 23003
24348 23003 -25826 -9891 26991 79236 130054 71231 36220 37360 67090 58458 2554 -36254
24336 -36254 12569 -9726 -3124 16241 36125 59040 39540 2288 3451 36476 10578 -32328
24324 -32328 -42883 -16570 29382 22841 24152 49085 52944 -23530 -41201 -51247 -125661 -115518
24312 -115518 -62304 -48011 -2259 -36384 -96254 -36633 33860 83393 27476 7281 91021
24301 91021 50735 26032 57756 37003 35303 -7952 -54049 -19445 25504 3509 -36085 -40806
24289 -40806 -51396 -67149 -67776 -96662 -66470 -50023 -3994 38505 33961 15755 16384 -34688 -74882
24276 -74882 -54718 -82622 -87501 -107641 -72252 -113396 -121485 -73419 -39250 -50735 -60451 -37941
24264 -37941 -25884 18328 43279 35558 -693 20398 49523 27512 -59384 -83106 -55645 -61177
24252 -61177 -78397 -22790 17248 35398 -3206 -99546 -115674 -63024 -24474 26147 21785 7743
24240 7743 5782 -17453 -31144 -21524 -5978 6145 -25269 -27273 6042 20678 -15145 -98370
24228 -98370 -99691 -52629 -27033 -65176 -27874 12826 -32426 -93566 -118326 -106902 -87195 -9862
24216 -9862 -24126 -10749 -9924 -23766 -48548 -49155 -9976 -9757 -9120 30693 81620 52176 83665
24203 83665 77583 -1943 -76740 -71747 -7616 -30602 -96150 -28821 -25075 -43557 -65560 -104772
24191 -104772 -117834 -138949 -80987 -68137 -50434 -57120 -15229 -6478 16328 49625 41549 8323
24179 8323 -14741 26587 61046 11564 -53512 -35718 20961 37450 25935 11579 80537 147410
24167 147410 78671 36459 3979 -3387 47636 35614 1889 2701 40051 33122 49616 115476
24155 115476 102768 43807 -5375 83975 136721 108029 74312 36030 35030 28922 30367 38854
24143 38854 15502 40743 23135 22709 72954 104740 118346 108387 28486 -24109 -37283 -108192
24131 -108192 -71048 40650 110149 106556 72921 84077 99321 139728 170495 104884 37966
24120 37966 -51293 -32543 -20587 -54246 -27614 4784 -40003 -29567 2922 -16209 -55314 -19239
24108 -19239 -14934 -60500 -67688 -58901 -55733 -68668 -51159 55898 77721 70459 87897 77748
24096 77748 82327 109325 112948 79845 103344 2855 -107143 -113837 -59254 -50407 -13078 20213
24084 20213 -33864 -517 -29610 -82944 -69153 -72875 -53164 -100051 -116967 -55942 49710 41960
24072 41960 53498 85421 78334 84400 82816 95908 117447 82091 1117 24900 64216 57068
24060 57068 55830 68472 67334 17077 6754 5140 9639 -18024 6432 18632 20463 -12325 -66524
24047 -66524 -65227 9926 22079 -1310 18843 49472 1832 -32917 -38768 -35632 24936 46117
24035 46117 -13018 -25633 -406 -7343 25846 17741 43757 95032 80816 95477 91157 54814
24023 54814 67205 24522 -15692 -41755 -41767 -30048 -24225 -32076 -36255 -38547 -56295 -90763 -81254
24010 -81254 -56310 -5578 -25624 -45820 -44865 -57638 -24383 13724 23190 -13575 -36798 -48463
23998 -48463 -50227 -4612 25994 42198 115028 98166 59286 22649 18861 -15921 -9593 24357
23986 24357 -8754 -40209 -34635 -20798 -44608 -3086 58610 77416 105086 52593 24716 82969
23974 82969 115323 52946 9058 46214 36615 -6073 -26904 -59353 -20886 -48372 -14940 -26245
23962 -26245 -7868 -16660 -84584 -49784 15580 24275 42869 -49895 -88270 -26267 -70246 -77056
23950 -77056 -45807 -85097 -109170 -54704 -48595 -5881 33618 -35099 -49673 -56430 -67484 -67587
23938 -67587 -40326 -32164 -50077 -48411 5257 32678 54735 113502 102581 64022 -23246 -29171
23926 -29171 42426 59049 70239 73744 49529 67871 99319 101744 74636 70797 62542 -6132
23914 -6132 -59493 -42768 -2561 -54247 -42905 -29519 -32585 -49360 -62634 -47427 2782 42366
23902 42366 40715 62465 89529 84455 14129 -21294 -28456 4654 29638 -17332 -18924 -1082
23890 -1082 -22389 -54299 -59529 -45778 -49311 -45462 -73330 -85116 -88373 -26763 -47109 -68514 -38928
23877 -38928 21808 27944 51862 60869 45052 37734 69144 75380 33615 20419 36396 35704 42465
23864 42465 21676 980 22125 34928 17037 9087 69644 63788 62857 -1531 -58938 11732
23852 11732 82200 76287 12060 -58074 -85761 -108132 -95116 -131846 -117631 -54519 -37348 -67652
23840 -67652 -14117 -4260 -35157 -24154 -48607 -154561 -210368 -219573 -187322 -170559 -109598 -35112
23828 -35112 -33911 -56140 -65830 -47159 -57576 -69608 -39761 -86897 -160660 -112366 -52973 -5175
23816 -5175 -29307 -38838 -13339 14090 -15486 -56446 -50795 -20508 -8138 -30719 -27737 -2004
23804 -2004 -27762 -88459 -84462 -65901 -34062 -51947 -33372 -57718 -64212 -29823 -27968 -24141 -5901
23791 -5901 9315 -10889 -28776 -26116 -32672 -53147 -54704 -99119 -81479 -3470 13179 3107
23779 3107 -13233 -9744 -23059 -52084 -42129 -20096 -140 32697 37656 15380 -3779 -48725
23767 -48725 -83907 -74700 -73703 -99612 -100312 -81288 -41127 19330 48508 -8264 -21743 -15077 -24115
23754 -24115 -25433 -88383 -106328 -17316 58557 61211 20223 11059 -4789 -7413 -18652 -1511
23742 -1511 30852 92167 125744 129382 57204 37104 12551 -35051 -13309 -13810 -53432 -72714
23730 -72714 -89847 -117475 -67821 -27870 16438 8198 5045 22771 42098 27754 16780 -9601
23718 -9601 -25877 18310 17008 -6265 -55802 -82624 -117298 -71770 -53293 -56419 -54643 -44786 -13534
23705 -13534 -31167 -26261 20131 73060 87309 59577 53905 17945 4592 38461 74339 77230
23693 77230 98655 69254 -7013 -18953 19399 4851 -77258 -71602 -68437 -62676 -41413 -18664
23681 -18664 5617 86427 123203 91455 79110 66007 80227 43717 -24284 -17876 30704 66678
23669 66678 79749 101387 39583 13657 19093 -19884 24718 90932 88204 61016 21821 -25949
23657 -25949 -49626 -31837 -75804 -18443 -2484 25579 61340 58984 19271 5652 8009 68183
23645 68183 57446 51408 48210 16458 -11676 27457 15383 -13106 -62960 -57841 -40277 -13303
23633 -13303 34248 21539 -4659 26960 55994 10852 -9681 -5876 -89628 -51076 38216 20022
23621 20022 56070 48929 33712 22721 42255 35984 944 8997 -23346 44550 28107 3830
23609 3830 -25380 -21884 -31854 -17545 -18326 -34565 -19640 -55608 -40681 23213 19482 12253 619
23596 619 -13254 32028 15834 -14058 28131 2770 -8288 4210 12043 -10455 30692 10591
23584 10591 47166 38215 45377 -2747 63310 125266 74992 3456 888 42390 110263 79774
23572 79774 32874 16502 62742 55899 51683 102948 82775 73210 43570 6985 47190 58384
23560 58384 79190 61545 -19629 -18955 14355 74175 79160 91472 69513 24073 -15343 -5552
23548 -5552 -31191 -22798 -4721 -1821 63669 128810 72286 33747 46969 46535 -25499 -56199 -56966
23535 -56966 -23622 -31698 -76108 -83363 -57664 -40351 -40351 -57407 -22209 5721 -64742 -112618 -28343
23522 -28343 -14678 25389 52209 56386 109553 132665 83143 66306 61788 52448 27431 7867
23510 7867 33648 7202 -75718 -72268 -55945 -16574 26023 -3159 -28072 -37007 -46265 -2213
23498 -2213 -5301 16159 -123 -21731 -20275 -86899 -88058 -66373 -51963 -51816 2114 61081 79645
23485 79645 87552 47575 23318 -40062 -18228 36811 52823 1538 -15650 2568 27718 27647
23473 27647 -9860 -27589 -38106 -38664 -42494 3146 23319 31805 15637 -42049 -41762 -58035 -62909
23460 -62909 -65324 7875 18277 9396 6237 -13295 -60778 -28025 1081 -48364 -61951 -51583
23448 -51583 9490 -45218 -83601 -4489 68807 98406 72327 54963 48282 18112 13847 5951
23436 5951 80582 154476 127211 85968 54616 29135 30197 -2054 -2210 -30401 -63426 -46546
23424 -46546 -80572 -113293 -56583 -10897 8436 8228 -23578 -45226 -74827 -24712 -2606 -3838
23412 -3838 16047 -4671 -10528 -10937 4299 57226 114724 140816 95619 43119 60694 74742
23400 74742 92726 60362 56828 -18698 -66200 -70627 -96872 -135383 -116875 -96338 -67271 -55898
23388 -55898 -117398 -158697 -147662 -68524 11929 24812 864 -57818 -130272 -130815 -81922 -89928
23376 -89928 -114849 -89941 -32001 -23547 20802 52822 25746 1095 23619 67117 84174 107962
23364 107962 77342 133431 157098 89317 21860 15318 18393 -483 -32802 -43468 -71569 -46439
23352 -46439 -52399 -58172 -110315 -82566 -37900 -4753 47433 77789 37354 18172 36111 50181
23340 50181 89126 59698 -7063 -22126 -13941 -45733 -50958 -36679 -35185 -56731 -19074 6195
23328 6195 12845 -20499 347 52983 89036 34016 -9273 -34163 -76979 -72472 -44087 -91806
23316 -91806 -123745 -41161 20102 42691 98622 105124 17698 -68860 -94487 -73532 -50867 -51711
23304 -51711 -38528 -31247 -43555 -60105 -69787 -4562 -26324 -97058 -105960 -61851 -15255 3435
23292 3435 8896 -14971 -92445 -83365 -7926 52943 82844 90256 124434 115552 124793 95172 55589
23279 55589 43109 59696 32606 33501 42566 1253 4708 80616 118125 102098 85792 24674
23267 24674 -39986 -58969 -75331 -74460 -62976 -41837 -49646 -87889 -69270 -67398 -52180 -32729
23255 -32729 -2797 82989 94839 69036 38325 79777 77325 70841 30900 -15188 -88736 -135934
23243 -135934 -41268 -20077 -16057 -11905 10079 -10693 -20543 7251 53701 23377 -9814 -63896
23231 -63896 -56668 -8473 55683 18732 -4183 8542 -21571 -59027 -104250 -55858 -42931 -52251
23219 -52251 -46212 -16473 45435 73262 51753 36333 3649 -3966 13339 -59794 -114857 -109907
23207 -109907 -111010 -112643 -69696 -51876 -62692 -5307 22285 14123 813 -28904 12743 11849
23195 11849 -5733 -22969 7959 28499 37609 32434 41061 27019 32796 13552 -40194 -28171
23183 -28171 29569 -37261 -49517 8955 49130 48264 33237 17926 28394 90972 118927 86958
23171 86958 56154 -48614 -71515 -86693 -78077 -73981 -52441 -78530 -68747 -84655 -134310 -87291
23159 -87291 -10156 22491 -2437 -17988 -29483 3813 21625 16695 -4575 -26720 -13021 -14454
23147 -14454 -11130 -79394 -78894 -55872 -40376 -14732 -20704 -50105 -64017 -19891 10196 -11495
23135 -11495 53760 63163 11046 23123 73512 142378 140105 66153 -34750 -74960 -66061 -44147
23123 -44147 -11036 -61283 -97289 -35806 61034 77973 57642 39690 22960 14620 -35727 -21300
23111 -21300 -48292 -97611 -45950 -5991 -72657 -82535 37150 110607 85624 -25275 -30030 -18558
23099 -18558 -51284 -52537 6859 23445 -39588 -88583 -89913 -50678 -1418 41553 49529 36841
23087 36841 -3389 -22447 -43493 -53538 -45489 -41957 -31429 52263 100041 165377 168824 101357
23075 101357 55482 8659 -35639 -92310 -77452 -20225 19618 2829 71929 104102 66986
23064 66986 -5500 7751 21788 -16065 -33041 -12613 -40223 -78146 -76500 -78805 -84195 -63974
23052 -63974 -15405 33093 59748 78685 31704 19973 -21448 -54317 -87120 -77620 44075 57860
23040 57860 10804 33859 29967 35494 52815 76718 87529 60808 36217 4861 -59493 -85152
23028 -85152 -57166 -41607 -26210 -10794 -41276 -41013 -41956 -38656 -31168 -66266 6387 41763 -1553
23015 -1553 -5731 -39433 -58763 -119252 -157290 -113141 -42886 -24195 -38694 -64054 -13005 49091
23003 49091 64231 -28357 -104101 -68707 -30839 -28533 -49422 -27026 32798 1741 -6123 3583
22991 3583 47669 127309 142840 60503 22614 21241 -70544 -130679 -56591 -43081 -108667 -110820
22979 -110820 -50276 -33480 -46413 -109115 -79585 -66828 -110819 -14347 83532 80914 6845 19013
22967 19013 42340 27266 10380 55091 51216 37853 31410 36838 65917 20708 -35798 -48748
22955 -48748 -8880 50032 102142 90339 25950 22062 -9350 -44509 -41465 -23664 -38055 -72950
22943 -72950 -40821 -26828 -41768 1487 35163 24715 32312 38959 53304 65675 40198 9167
22931 9167 30647 21072 28147 54311 44352 -5303 -12987 13511 19816 -47857 -38467 -48107 -41799
22918 -41799 -52177 -88748 -128617 -50998 -31431 -62312 -14625 -20630 -67368 -85948 -77518 -78138
22906 -78138 -68589 -65567 -85178 -25266 -38809 -75730 -108116 -87985 -71764 -5613 27591 24241
22894 24241 -38280 -78769 -69453 -50803 -48558 -70600 -49180 -9854 13228 18982 -17072 -72117
22882 -72117 -83377 -50147 -38232 -21769 -452 -2063 -35448 -36958 -85615 -70998 -63312 -9497
22870 -9497 -5763 -38690 -69301 -60075 -39902 17590 26630 34378 51867 66676 43464 6702 -11525
22857 -11525 -6382 -58165 -43425 -101253 -71630 3334 10675 9700 29067 -38778 -63759 -8749
22845 -8749 -18126 -32574 -113635 -101588 -56103 -58301 -17996 46131 44312 -6138 -31536 -18476
22833 -18476 298 41024 2914 6755 -25009 -31594 -25138 30165 57464 18749 41097 111958
22821 111958 103726 65829 -25321 -35643 -62465 -63298 -34006 -6931 20258 -13225 -43262 -86273
22809 -86273 -78016 -83519 -68406 -138935 -136284 -197610 -190375 -129630 -138973 -138921 -145378 -131206 -122288 -125298
22795 -125298 -90959 -87754 -40512 -59419 -17860 -15809 -39691 -48159 9863 5804 -50145 -58543
22783 -58543 -31191 18758 27825 49021 847 -117409 -162551 -109849 -61168 -61412 -60864 -77424
22771 -77424 -54831 -58522 -22031 -19911 -9533 116466 122087 68600 41541 12532 25588 51821
22759 51821 38503 1817 35778 32187 -6191 -21231 -26488 -72618 -28984 4732 -16171 -80807
22747 -80807 -97781 -30471 -5455 31329 29254 43456 36204 3955 -39883 -64289 -78053 9681
22735 9681 69778 68183 56593 53910 121804 136554 110460 109600 29846 -18797 -33603 -11462 -56101
22722 -56101 -123572 -92193 -7993 39729 40732 14857 -14221 -66827 -113933 -67828 -36369 4135
22710 4135 -28429 10089 58795 30505 -2119 7005 -25009 -34073 -30148 -20234 -5771 -42547 -30487
22697 -30487 -843 -59089 -59000 -65746 -14253 4147 6830 -35648 -5214 48593 91519 104053 97202
22684 97202 54955 -25730 -58016 -59641 -75080 -90213 -52750 -53362 -62347 -16836 9596 9902 -55488
22671 -55488 -51125 -53023 -69716 6379 37653 5032 -25422 4959 33625 -34136 -67328 -22414
22659 -22414 9768 -4390 -27139 -21165 -18629 -25664 -18593 -2151 -34186 -69883 -93952 -76910
22647 -76910 -87253 -13916 31318 22711 -24627 -11013 10639 -25215 -18870 -18616 -17064 -54365 -47454
22634 -47454 -1661 -50417 -24327 49480 52084 -10402 -42043 -78272 -71369 -79320 -76155 -42288
22622 -42288 -47082 -54080 -58239 -43911 -40165 -65300 -89675 -166988 -141368 -67422 30695 22626 -31125
22609 -31125 -55726 -158023 -167211 -104583 -72386 -52617 -1590 -11577 52775 55339 11195 -19362
22597 -19362 -66234 -130612 -162977 -136512 -35127 42929 39975 -25528 -13652 26661 11139 -54757
22585 -54757 -36295 19187 86783 61765 21533 -28568 21827 32157 39523 59650 7415 39454
22573 39454 23026 -6331 -5024 -28158 -64654 -81750 -50257 -4479 6534 39586 98932 27871
22561 27871 -80168 -134971 -109316 -36950 21108 56702 107074 107854 36320 9668 -4483 -8998
22549 -8998 -1210 21349 12387 -54024 -94568 -103554 -128074 -154250 -136640 -105563 -69701 -62250 -58081
22536 -58081 -33574 -33478 -2835 22298 -4243 -83207 -105400 -100001 -65865 -45312 -23824 1579
22524 1579 1612 -50574 -116054 -160649 -117169 -78183 -50685 -108789 -141677 -109124 -128653 -113028
22512 -113028 -72319 -65504 -110246 -85974 -75155 -93953 -77583 -36133 -12183 -63354 -56688 -39665
22500 -39665 -78859 -47958 11086 23306 -4270 -12012 -2821 -21953 -91183 -90762 -57427 -26397
22488 -26397 -19001 -19460 -25590 31111 65186 41999 17938 -16097 -49808 -30022 -29852 9898 68873
22475 68873 141 -21452 -37320 -66044 -53979 -49784 -4186 57535 72952 51292 127662 112273
22463 112273 111806 132638 90005 76796 -21130 -32491 -13911 -2943 -64191 -103008 -73026 -30815
22451 -30815 -38780 -70805 -65083 -3664 7960 -22047 -48176 -61557 -26934 1503 -35313 -24320
22439 -24320 -30011 -58077 -101438 -80242 -21850 -8264 -37568 21796 50185 40812 24143 -6957
22427 -6957 -2625 24722 58546 69657 91261 94566 79792 6668 35804 81581 54058 -18788
22415 -18788 -46769 2671 -45330 -108681 -113788 -106115 -72402 -75051 -74195 -76057 -52172 -91235 -33924
22402 -33924 -25887 -64453 -72637 -109189 -116748 -67778 -57733 -55845 -70621 -47120 -14135 41791
22390 41791 19517 -1619 -16717 37748 56599 80765 99854 -26948 -123393 -151195 -103101
22379 -103101 -33158 -24931 3274 -15392 -55950 -34653 -5625 41703 44568 69302 45113 22985
22367 22985 25480 30244 53080 48118 57092 -1413 -34034 -53987 -61013 -30783 -62769 -47979 -6495
22354 -6495 -11230 -9650 -59723 -92707 -82938 -81621 -52911 -938 232 -63064 -80324 -91280 -85622
22341 -85622 -119988 -95062 -34685 -9389 -11360 10311 8277 -37188 -97734 -100498 -53463 16935
22329 16935 -2696 -9303 19034 37364 3033 -41164 4407 20693 -41359 -75697 -57990 -75457
22317 -75457 -38481 -6909 12944 -15344 -14546 -6194 3028 4836 37027 31824 -26184 -68223 -72391
22304 -72391 -48154 -7944 9205 -33105 -64980 -85383 -23486 -7946 -20508 -19272 -14636 -12097
22292 -12097 14025 55955 11443 9003 56860 36292 61282 120286 113264 109021 97941 85828
22280 85828 70497 23672 18193 35950 47874 -16348 11438 30079 -47891 -93535 -54752 -20500
22268 -20500 -35688 -19206 -7903 -14967 -39522 -75624 -20827 -9268 -64506 -97633 -71348 -68161
22256 -68161 -57337 -48337 18999 5323 -4590 -46049 -111740 -141389 -101917 -52487 -30832 -16510
22244 -16510 -15876 -12483 -10370 -18883 -16146 -22553 -53800 -52923 -31406 6229 81352 64495 -6622
22231 -6622 -50033 -59564 -41302 -46734 -55315 -19544 -12661 -22945 6186 -128 -12873 12079 13748
22218 13748 6890 -17036 -7034 4904 19118 2297 -308 -33941 -60502 -22067 24155 3268
22206 3268 -13882 -2235 11938 -38123 -113700 -138931 -122096 -88610 -30198 39457 58764 -1880
22194 -1880 -29865 14484 -6286 -43622 -19610 -54052 -79035 -12524 -19278 -67415 -79801 -74103
22182 -74103 -106548 -112654 -39757 -56700 -24958 23848 71043 113758 106865 62852 13662 21087
22170 21087 31760 28462 4364 -40116 -42773 -100954 -23013 79502 90565 75167 -12372 -2620
22158 -2620 32579 56484 89093 60476 56747 18956 -12764 2375 20295 52780 61801 24555
22146 24555 33691 35535 34350 49584 65709 15693 -47259 -76935 -77641 -45900 -45856 -49356 -72
22133 -72 -14467 38772 14371 -38980 -66557 2205 49998 60380 17907 908 -24248 -37442
22121 -37442 -82045 -71609 -7649 34766 82064 20034 17775 73035 74828 44714 24546 -1002
22109 -1002 3754 -27483 -20764 -47167 -60000 15472 -16443 -42458 16639 -55534 -121892 -157017
22097 -157017 -115635 -105726 -120646 -56918 -21170 -33631 7379 17101 -8507 -30123 49763 38760
22085 38760 42447 49200 79538 72893 67465 66517 49424 -11727 131 26934 10955 21687 36131
22072 36131 40764 33397 1202 -14383 -14714 12660 19723 4261 9748 98182 114347 18173 -38759
22059 -38759 -27311 -7934 -68354 -131244 -140680 -88368 -69682 -30717 -23862 -39924 -23115 -17397
22047 -17397 23687 5792 -43516 -46359 -46548 -28887 -49233 -57396 -76955 -119533 -93919 -71865
22035 -71865 -49804 -67325 -82814 -69421 -42754 -41219 -71563 -51030 -2142 45596 59302 16766
22023 16766 -5666 60085 90972 12803 -51777 -58226 -53693 -98368 -72469 -60706 -26325 -61968
22011 -61968 -41400 49153 16623 1298 -26237 -36431 5130 45828 62370 97752 98020 87057
21999 87057 36267 -48100 -117686 -77835 -81988 -36972 -903 22659 49569 22600 -10566 -44430
21987 -44430 -37603 -250 -8389 9269 36068 86603 90812 118378 101821 47490 64508 68512
21975 68512 56438 -4703 -13728 -47038 -53552 -48064 -20312 -24388 -32919 -81462 -86699 -59476 -36956
21962 -36956 16175 28588 -15920 21815 50288 51545 53676 126318 192332 147541 94587 22122
21950 22122 -47294 -134121 -120404 -89127 -102813 -90306 -94548 -138918 -163797 -122452 -46577 21559
21938 21559 52827 51493 47038 30381 53217 52273 24667 -8804 -8770 -25059 -11410 -43392 -72136
21925 -72136 -93308 -61797 -27387 -38061 -114225 -54812 -4056 -16284 -12010 18344 -31126 -88141
21913 -88141 -75284 -21792 3036 16000 39880 28371 4106 12346 -54196 -65774 -50865 -30937
21901 -30937 48174 72611 6176 41736 26488 25135 -30960 -52959 -51805 -69107 -90875 -13766
21889 -13766 -15577 -23812 -6933 -9335 17840 37388 26868 53132 137081 101057 21143 -96894
21877 -96894 -85988 -55963 -18994 37788 18827 -58168 -107907 -88126 -27553 528 1972 -58031
21865 -58031 -36024 -18202 -14372 27864 44542 46144 27377 -8503 -82485 -79165 -71743 -44873
21853 -44873 -55746 -45292 -42413 -56392 -100909 -89236 -98543 -46432 -1903 38862 87793 90082
21841 90082 65580 20858 98531 87871 11543 -41286 8418 12489 8156 -6980 1157 14149
21829 14149 20424 5984 14871 70512 80445 20842 40505 20987 -25378 -19894 -47380 -17019
21817 -17019 -9959 22652 21816 53973 107657 66325 -1025 -36096 -82679 -65896 -14091 57539
21805 57539 28953 -3299 -103793 -150458 -71390 30304 78927 84562 35868 -25203 -90150
21794 -90150 -96408 -87718 -44946 9879 -17581 -34743 -113732 -91042 -42337 -36201 8359 6770
21782 6770 -15370 -19222 -31916 -36131 -44991 -52708 -190 43860 80217 12321 -10219 49858 97066
21769 97066 81843 65766 50416 56984 22347 12099 10914 18203 38010 34552 -23752 -57134
21757 -57134 -56996 -59631 2882 -14306 -37433 -57612 -85284 -39052 24770 68002 87668 72440
21745 72440 46874 51421 82737 81993 49068 9525 25758 25630 40995 90362 53922 -21902 -38760
21732 -38760 38891 60413 37534 37312 35538 22237 -11539 -37922 -67555 -27326 26372 35578
21720 35578 63052 19933 37546 -28892 -75006 -34357 43348 26210 -3719 -8061 -8364 -41220
21708 -41220 -80947 -69956 -45779 -63944 -78194 -81535 -53948 -102361 -92339 -22106 -13711 25332
21696 25332 73110 41156 -5272 -9387 -72220 -100296 -132890 -107103 -74959 -1865 64606 78261
21684 78261 35141 -40467 -85889 -72410 -65211 -23125 -21176 -35038 -78465 -39049 32141 52240
21672 52240 -13970 -92440 -148888 -148831 -125462 -112958 -87530 -59704 -92908 -68197 -35463 -17560
21660 -17560 8548 -80347 -93520 -60301 -6022 6196 -20454 -22707 -94508 -104378 -113027 -136122
21648 -136122 -85629 -39146 -7050 -30024 -89469 -79588 -86926 -53346 -17208 -9872 -13499 -7171
21636 -7171 -6755 4034 -16935 -20085 -37542 -16450 1382 -1215 -48695 -84133 -61101 -55476 -30672
21623 -30672 -84005 -79978 -59991 -40666 -81745 -83818 -42267 -34826 640 900 4280 34536 41783
21610 41783 23028 -78172 -87511 -68052 -21042 -43638 -67428 -67991 -98326 -152233 -148470 -85090
21598 -85090 -53962 -61013 -12954 9844 -23024 -78202 -90005 2462 24520 -25326 1144 6633
21586 6633 -12055 -35980 -12391 28632 -11669 -43922 -4431 14624 -59294 -74394 -66156 -73884
21574 -73884 54160 124722 149656 87161 -17849 -42906 -81281 -99712 -101566 -74350 -37006
21563 -37006 -13109 51938 59946 24453 15277 38186 107897 130031 134863 151607 86567 -22259
21551 -22259 -57232 -45127 -17957 38062 86864 148431 102315 21698 -47295 -61418 -62451 -38240
21539 -38240 505 -58014 -61385 -1873 -6103 -11557 -12854 -4804 -14514 -78424 -81216 -47521 -55018
21526 -55018 -45152 -24611 5666 17697 -6586 -41563 -36969 -15835 -48482 -24072 22912 31770
21514 31770 12745 -28312 -38579 -56629 -77988 -147596 -164621 -97403 -67434 -57926 3863 -8982
21502 -8982 -60135 -121010 -110708 -48399 22201 35066 -20597 -47671 -39591 -1658 64661 36856
21490 36856 -5405 -68904 -60335 -40787 -49808 11049 18739 4704 13192 -19245 -17363 21432 62811
21477 62811 44394 90242 97277 52851 45579 23784 -10520 -36971 -71137 -59782 -60000 -41974
21465 -41974 -38657 5250 17630 37191 -8736 -2630 54535 21246 -8073 -603 9696 8527
21453 8527 -35021 -10752 -9380 -10089 -17767 -53931 -16653 -44816 -66544 -15467 3989 62680 48390
21440 48390 -23350 -15207 -10616 -50171 -58060 7475 48279 49063 41263 17383 -56458 -77651 -114066
21427 -114066 -127971 -147735 -149606 -143551 -100481 -48264 -98705 -66906 -22780 -86877 -144207 -110673
21415 -110673 -95646 -69742 -34404 -61254 -27165 36099 23542 20103 6997 18164 46934 92565
21403 92565 87250 28288 -22924 -63013 -78656 -36307 29832 55450 26338 3430 -25838 -22743
21391 -22743 -17364 -86645 -81715 -84645 -87911 -113793 -95782 -76384 -150257 -133673 -49301 -6864
21379 -6864 -11820 -21798 -44799 -56409 -31936 -21202 -45543 -111792 -80807 -63671 -71539 -82711
21367 -82711 -57692 2069 36994 23256 -21334 3059 -1747 12215 31393 56503 1171 -60355
21355 -60355 -71237 -82504 -35539 -38450 -39101 -18582 32436 43957 16140 17124 -20516 29937 43941
21342 43941 9822 -55389 -27745 22046 -12350 -31572 -66761 -73033 -54074 -7375 -11135 -34537
21330 -34537 -10751 -8756 -53111 -122378 -139591 -98595 -74770 -10067 42379 59185 51445 67682
21318 67682 76244 28336 23430 38207 59866 44231 -57612 8765 50945 54938 31509 -42764
21306 -42764 -25438 -7734 25541 -197 -36468 -91348 -127461 -115844 -59302 -17557 22694 -29857
21294 -29857 -20757 4367 69837 53166 25247 90826 90602 82431 70430 37390 7074 -9539
21282 -9539 -15726 52580 44002 2553 23939 102160 134716 95606 70175 45264 30161 -21270
21270 -21270 -49689 -67405 -66556 -77986 -104849 -75922 -90999 -88971 2635 25889 36740 66155
21258 66155 8653 10990 -27887 -46279 -16922 -33788 -55190 -19782 -2080 5215 -24279 -75049
21246 -75049 -68011 -31871 -10054 12543 35847 1966 -31565 -96749 -112139 -114680 -129615 -75453
21234 -75453 22171 25843 9085 -17219 846 3011 -61175 -114730 -65577 24057 76285 57033
21222 57033 29045 3077 -31588 46803 85884 84352 96475 117433 73512 -7290 -72575 -29098
21210 -29098 -18122 -55830 -26646 24697 2626 -58161 -101193 -97455 -88199 -72723 -105386 -123621
21198 -123621 -178042 -170837 -95682 -32855 8270 -11109 -23121 7139 88 -28987 -51291 -42716
21186 -42716 23357 63539 65903 35020 170 -59002 -38694 -73049 -73064 -71011 -51532 -55013 -55114
21173 -55114 -27387 19508 72050 49477 13738 31694 107670 89516 114009 50258 49079 85869
21161 85869 64800 12192 -44053 -40433 -44363 -935 19724 -2143 -18390 -25028 -21068 48539
21149 48539 32043 -31588 -30902 15260 36013 13734 18530 84547 6122 -75886 -123634 -104286
21137 -104286 -126330 -106054 -126446 -111959 -39853 -2185 2923 -21055 18316 37863 5180 -36698
21125 -36698 -65496 -127692 -79972 -83281 -56546 -12904 28779 91631 14389 7056 11288 25721
21113 25721 23513 23555 57946 30389 -12834 -22509 51249 58128 15674 48715 56448 65030 64157 69489
21099 69489 66874 2755 7135 12739 88 29564 29259 24796 24209 26406 12359 -19635 -69557
21086 -69557 -65317 -100802 -115978 -50228 3966 24767 -8695 -27966 -52972 -66983 -119551 -131456
21074 -131456 -119000 -89461 -90728 -58501 -36125 -9576 -82038 -107058 6785 73170 35237
21063 35237 6523 -6625 23912 50384 26099 -10969 -75446 -82212 -35203 -35521 -50815 -47050
21051 -47050 -3550 -27209 -86539 -74607 -42746 -50203 -35302 -62989 -60619 -52375 -24146 -41984
21039 -41984 -36223 3543 -12421 -53071 -36087 -62851 -79900 -14999 40198 67685 101676 79954
21027 79954 16984 -25815 -52460 -49420 -19371 31347 -8465 -49566 -38568 -63360 -94058 -30971
21015 -30971 27594 25008 4142 -74875 -51705 -88384 -141659 -115686 -66883 -5999 -8871 9690
21003 9690 26250 37116 13972 48263 15676 -40366 -101931 -80027 -67607 -55274 -721 2164
20991 2164 -94568 -119916 -147362 -121913 -77796 -39125 -40786 -40125 -54086 -27809 -6481 19559
20979 19559 51481 85245 56302 -72289 -103055 -87822 -5289 -6037 -92051 -140753 -56776 18779
20967 18779 140543 104583 39160 -48766 -23693 7724 27729 67048 74997 49531 -8486 -75553
20955 -75553 -105862 -111567 13803 11407 -105 -34987 -16299 15332 -65607 -106775 -80696 -53027
20943 -53027 -80555 -90185 -53109 -43936 -25082 -60085 -124002 -112962 -52758 -25476 19568 21398
20931 21398 16582 28427 31927 10227 14610 -70249 -96768 -32933 -36965 -34075 8489 -8151 -5067
20918 -5067 31687 29633 26522 58024 79147 50403 60040 33560 10213 37670 30458 -12839 -42229
20905 -42229 -63884 -101227 -62122 -46216 -48470 -28143 59616 78765 1826 -42104 -64787 -62789
20893 -62789 -9239 21187 62121 18432 -14510 24380 -1187 -6060 27365 83720 19718 -163
20881 -163 965 -17341 -29188 -3920 -25331 -32561 -25359 -34569 -65262 -41899 2238 -51389 -68316
20868 -68316 -14524 -15786 -27873 5975 44265 79414 79545 55006 31383 -6521 -11358 -37793
20856 -37793 -41936 -34491 -51119 -20431 -41487 -67243 -61806 -103512 -80481 -51995 -54910 -78903
20844 -78903 -45312 -77546 -113339 -88329 -57868 -11052 -18518 -172 8433 27991 43723 36342
20832 36342 22989 10834 4638 42983 53252 9892 -21977 -40608 -58318 -36681 -61628 -7553
20820 -7553 569 -31502 -64166 -56948 -80482 -90867 -63099 -55005 -49517 -32996 361 27792 16706
20807 16706 37630 33771 -62233 -83548 -73772 -32302 29964 56443 101902 80083 59706 59556
20795 59556 58588 42579 33144 33675 21106 -8958 -21484 -57211 -83731 -66944 -76067 -4761 38383
20782 38383 41050 -16009 -57706 -52795 -72437 -66159 -4925 29398 2412 -61240 -89694 -52006
20770 -52006 -45457 -74568 -104258 -71717 -22353 -12633 -78442 -109679 -131080 -23054 72580 76469
20758 76469 78340 57046 65933 24207 -13838 8677 -9531 -21799 -27198 -92427 -101035 -46721
20746 -46721 6446 -11764 -41814 7783 16371 65196 42704 -38483 -10879 65216 10955 -51986
20734 -51986 -16237 8681 18696 -39059 -39827 47736 94200 29910 -34532 -72075 -56870 -53907
20722 -53907 -55276 12566 53665 52316 26583 21170 -8444 -35605 7835 -20996 -7130 1496
20710 1496 -26223 -52262 -39379 9484 47596 -29296 -81612 -96737 -60650 -16395 -67586 -104911
20698 -104911 -53704 5885 18842 2544 -24513 10763 -26673 -101942 -196731 -169968 -126194
20687 -126194 -115107 -122652 -158278 -161458 -123633 -75955 -22070 -49690 -97373 -102374 -85243 -21302
20675 -21302 37356 -571 0 9537 16081 -28597 -67737 -81271 -62348 -13372 -68138 -63113 -59816
20662 -59816 -77189 -88840 -106815 -84688 -5754 25050 2546 -21131 -17470 38996 21054 -27615
20650 -27615 -39611 21933 60270 53568 60386 26719 -9648 -59357 -57120 -54199 -90072 -93638 -59912
20637 -59912 -35197 -10697 -11239 -32965 -12252 6354 35098 -10780 -43576 7135 32360 59665
20625 59665 11206 -35064 -2572 9337 -15585 -21414 4368 -19252 -13382 -23917 -5812 25586
20613 25586 -45935 -72783 -39521 -13109 16009 53305 27378 -42346 -35132 -26776 -27471 -35804 -30361
20600 -30361 -25102 -39337 -77010 -61749 -32575 15861 19604 6377 25113 47684 54056 37676
20588 37676 34598 56604 85279 57818 80686 121339 118062 55839 74310 98973 80701 -14060
20576 -14060 -41684 -2088 -38748 -52333 -19517 -28586 42628 6681 -68178 -67097 -23598 39022
20564 39022 95637 141751 106741 77951 101087 112124 92687 106261 90935 100878 142180 96165
20552 96165 116587 76615 8972 -56153 -95666 -54342 -16053 -72092 -90571 -34222 -36429 -16240
20540 -16240 27760 -6365 56979 36850 -13789 -7133 -11633 -29544 -50535 -50211 -7229 68596
20528 68596 105823 56604 17722 4928 -12669 -22530 27799 30016 25795 33745 44498 -25624
20516 -25624 -82166 -45907 -36613 -29440 -30979 -40400 -17123 32464 35213 16205 -30850 -68092 -74371
20503 -74371 -94436 -88525 -51355 -21206 -53876 -39695 -15882 -31799 10363 -22034 -75071 -66643
20491 -66643 -34965 -72608 -113364 -122481 -110372 -39559 44724 40610 -20235 16278 27421 60903
20479 60903 45151 78704 32284 -15594 -60855 -46215 -74623 -74091 -58818 7347 55021 4271
20467 4271 -30432 -63753 -98780 -71159 -27508 24608 52446 -38199 -110474 -68660 -51187 -19648
20455 -19648 13952 3894 23620 6087 15057 65983 45822 37249 -11847 -44375 -23870 -63685
20443 -63685 -56004 -66788 -104776 -64554 -21415 -39670 -33500 -38489 25698 75027 51656 32399
20431 32399 4581 -59870 -82668 -66692 -74398 -33507 -74178 -59409 -6134 -12395 6315 -22352
20419 -22352 -51534 -50197 -42237 -53587 -63937 -89858 -94919 -93550 -79354 -12600 30351 78217
20407 78217 89374 72033 49170 22089 17839 48504 6168 -78925 -91368 -41404 -40158 -38648
20395 -38648 3884 -11438 -8773 27893 15639 16992 -2255 -31094 -58146 -42387 -75496 -81724
20383 -81724 -66122 2594 -24485 -78153 -76405 -16467 72265 60463 37896 -62169 -106599 -99791
20371 -99791 -137159 -153789 -156406 -135978 -94493 -92660 -38859 15254 -2316 -17467 -9239 -25228
20359 -25228 -9727 22306 32719 -18750 -27143 -22757 -71221 -91393 -66070 -57745 -24790 -70574
20347 -70574 -26719 -45172 -88416 -54782 -9484 -3051 20528 56077 58886 72549 23004 -7876
20335 -7876 -12632 -31464 -51195 4762 57752 102853 57215 -34821 -45579 19545 31953 14418
20323 14418 -51222 -78112 -95325 -99156 -82938 -96264 -103967 -73200 -32582 -33666 -16102 57209
20311 57209 49999 90937 86219 31768 12071 9948 42815 63743 24567 -38327 -57616 -110055
20299 -110055 -90874 -22794 39856 36217 37561 64480 56477 74958 87753 67612 63614 25320
20287 25320 27660 -28427 -13935 33304 7935 58750 87660 52654 -6616 -48689 -42922 -38345
20275 -38345 10276 19481 7932 -22850 -38473 25395 25261 3675 71843 26544 -7911 48170
20263 48170 11273 27641 43366 53795 69654 79355 83786 2913 -20895 -1610 -33933 -118942
20251 -118942 -135555 -102503 -96268 -51522 5820 28998 18804 63482 80920 46793 42111 7309
20239 7309 -15863 38748 2930 -50942 -12902 -12725 -2108 -24509 -2472 8924 -2604 -2868 5701
20226 5701 3823 -5067 21058 -42554 -59937 -4799 15716 35669 35408 2296 -32901 -12969 -21517
20213 -21517 -86877 -90062 -25587 11210 6075 13895 -1984 -47359 -3214 46733 5246 -49331
20201 -49331 -33353 -17068 -32614 -40207 -27252 27116 43504 87934 62713 45524 2529 -19094
20189 -19094 -7845 32947 -2191 -53254 -58499 -3046 15020 -23337 -83963 -83723 -21910 -28788
20177 -28788 3438 -1031 24421 10927 -26713 -38965 -11835 -16782 -38459 -43023 -43125 -28631 17968
20164 17968 21107 21671 -12772 5538 -291 -19290 -28453 -10521 75884 140362 135676 124214 106961
20151 106961 40223 -470 14635 759 -15955 -12636 38225 43064 16988 16089 80259 158185
20139 158185 140839 96908 63835 -1356 -41408 -86212 -69303 -12222 904 -4715 -10717 -11941
20127 -11941 14230 53239 21419 968 -67694 -28148 27111 30085 49729 27786 -83328 -118802
20115 -118802 -56364 -1322 33744 59729 71137 140459 110776 19933 -29281 -45611 5517
20104 5517 52753 3860 -19377 -7463 -36883 -43898 -15617 -61744 -42247 -34071 -87272 -68555
20092 -68555 -43606 12370 50629 31909 -24687 -29606 85114 84260 32223 -18132 -51754 -26433
20080 -26433 12658 14079 -12682 56641 24681 46772 96829 47334 29408 -12086 -7072 -17596
20068 -17596 -16860 17847 8294 -29214 -53900 -36111 -41111 -43728 -68634 -89174 -80267 -37011 938
20055 938 -16254 -43993 -63889 -57924 -70515 -55160 -60668 -46267 -6701 -54637 -90349 -61864
20043 -61864 -84943 -72721 -75588 -56430 -33550 -12934 37229 115164 135086 42024 36989 126432
20031 126432 93051 1946 -21297 -37011 -15710 17725 -67544 -162101 -198364 -217069 -177659
20020 -177659 -132882 -124827 -163443 -131890 -111774 -47868 1078 -34879 -40196 -6931 -34121 -63919
20008 -63919 -74131 -79976 -57627 -71429 -31584 -43063 -5574 7958 56465 77450 63568 107093
19996 107093 89579 74309 80424 39785 39259 73639 88045 85875 41911 2667 6503 41674
19984 41674 35863 21946 -24986 4290 55090 75832 87403 134934 106921 81668 12153 -81449
19972 -81449 -139703 -107742 -21927 36142 10549 -26085 -4397 18808 12687 32735 7361 -40749
19960 -40749 -104779 -90837 -42021 -42014 -18976 -39234 -34503 -12528 -35343 -21228 -54459 -58448 -65507
19947 -65507 -60253 -59143 -49481 -7464 83042 61449 25445 -6178 -27975 -43350 -73513 -88416
19935 -88416 -56028 11906 39163 360 -2172 42103 -16866 -60934 -108992 -62716 -69496 -125237
19923 -125237 -106840 -80568 -88208 -87922 -76797 -42113 -32534 -40029 -48130 -22337 7388 2598 -64131
19910 -64131 -48794 -67100 -30396 14663 38514 45968 46635 6997 888 18188 91285 35062
19898 35062 -46869 -66653 -61274 -39212 20613 2033 -23617 -25363 -37190 -29730 7761 10517
19886 10517 1399 50569 28540 9079 18122 19826 -27226 -25364 -10202 -25735 85642 72696
19874 72696 8550 -46017 -76706 -81776 -44130 -6761 -10037 29621 83602 74082 35875 462
19862 462 -6271 -11960 5935 13287 31722 54565 37533 -438 -61013 -74166 -22759 13217 60800
19849 60800 41177 -9258 -17608 -45846 -65136 -19904 -23018 -19841 -40369 -35330 -33338 -15633 277
19836 277 -29778 -46002 -30038 -9715 -7027 45403 11722 -69256 -72482 -75314 -21854 8206 53460
19823 53460 103544 44698 52881 21545 -12091 -68784 -130700 -121380 -67297 13412 5151 26858
19811 26858 -31909 -80827 -56708 -75179 -77113 -62510 -45867 -42764 -23124 -1345 3044 -6098
19799 -6098 -43044 -8308 -10157 -21550 -79016 -66158 -62847 -84466 -127701 -133727 -103588 -69088
19787 -69088 -35794 -25999 -45793 -53213 -41432 4716 14095 56837 83705 31898 7490 14449
19775 14449 -29158 -110457 -44037 -6858 -65944 -127633 -171647 -136777 -27526 40151 44834 9962
19763 9962 29468 41558 66542 95091 86792 26290 -47453 -61493 30905 80215 77170 59497
19751 59497 67402 11678 -44684 -62734 -45584 -40050 26549 4023 -15565 14632 62341 60849
19739 60849 24157 42854 7802 -19238 7364 30715 65430 72078 64732 64099 52536 50157 55494
19726 55494 1145 -22520 -27856 -76676 -58121 -64623 -68541 -44863 -26961 -26395 -155 -45006 -53606
19713 -53606 -24277 -55549 -114318 -178308 -181473 -110402 -53180 -76165 -86896 -82186 -58890 -38967
19701 -38967 -38863 -81769 -60790 -13772 7128 -40174 -61351 -46345 58732 77736 -28816 -53062
19689 -53062 -45595 -21304 23937 85024 72086 61871 128945 87251 35929 -9410 -10625 -43695
19677 -43695 -41696 -30515 -42640 -39402 -14922 -58145 -81851 -105785 -99475 -134576 -85511 -17534
19665 -17534 8038 -8325 19448 113673 166853 127320 65223 -18359 -69699 -42230 23716 -13861
19653 -13861 -51441 -6977 12476 7410 25195 51381 38767 -7057 -21285 -8493 50106 60404
19641 60404 91853 93044 72702 59398 21051 -25932 -57515 -32730 -8779 -13117 11899 32755
19629 32755 58502 -31190 -30276 -43812 -44554 19449 -16604 -59452 -56498 -24550 -28308 -46803 -25876
19616 -25876 -55171 -28978 60705 74500 86758 63661 6024 -8284 25742 37576 36004 -25212
19604 -25212 -45070 -42775 -47360 -37418 -9426 37584 65344 39801 94892 121276 131251 130494 101511
19591 101511 124743 123576 99682 146335 145681 126381 158445 194810 220044 149680 69784 50846
19579 50846 64644 69256 44508 48562 17403 360 20356 79031 131859 97432 65133 33547
19567 33547 38135 23273 41169 54540 15769 2490 27193 10257 13117 4114 41979 131765
19555 131765 167669 113029 75315 11684 -25583 -15777 35222 50159 79620 54147 29592 51586
19543 51586 59426 93468 145089 113929 99802 144849 192730 151306 148361 188137 214094 161037
19531 161037 144171 155504 110671 73261 86058 132055 142510 262907 268726 235222 226848 230243
19519 230243 234501 189540 203985 255764 278833 322892 395644 603935 859249 1173346 1525330
19508 1525330 1750336 1678806 1530289 1621012 1854271 2059885 2085445 1916650 1762724 1786121
19498 1786121 2022418 2171402 2054373 1874214 1785278 1832147 1918803 1871460 1668201 1350069
19488 1350069 1071920 821901 690864 621610 620848 611311 565053 528819 524848 482743 463073
19477 463073 435828 384406 327801 301827 308972 324599 344355 338143 284772 262323 237279 186234
19465 186234 160498 183000 165925 131790 157428 110985 18554 11240 78343 159222 154098 194782
19453 194782 226950 159170 101880 93229 152494 145262 143707 145970 191519 203925 181503 158007
19441 158007 163061 113594 113765 138319 91279 74538 115206 174474 175099 124623 107483 171868
19429 171868 197427 177390 107740 100605 90537 99342 80787 39774 91905 130681 116287 122885
19417 122885 151735 146166 195816 223346 188094 132973 76629 93816 124657 145784 92993 43744
19405 43744 82111 165511 153625 89830 29208 21296 74173 51935 44895 24910 -295 6843
19393 6843 6576 17897 -28871 10806 88705 99934 89756 83984 45940 41234 19732 51342 61878
19380 61878 108128 103745 75207 89897 140627 125450 137529 145334 190339 210007 176848 192436
19368 192436 179787 121352 117655 169262 189738 132015 70830 14578 -30926 -25199 27744 8931
19356 8931 -2141 -10763 27314 37798 81889 156828 112258 112592 162960 161630 107880 102869 78043
19343 78043 25373 55473 129240 122982 117007 92875 59507 69791 65296 93752 74612 67163
19331 67163 70697 64159 94658 97530 79278 26004 -944 79335 148105 193385 143778 134781
19319 134781 101686 113502 129269 59300 -10268 8932 96985 175834 167825 166046 158846 90804
19307 90804 64664 45510 19908 16425 51297 110724 114345 81687 88445 137436 102753 -2856
19295 -2856 -16969 29960 70017 88031 120203 93307 86895 63637 99834 142906 146507 128686
19283 128686 86874 74785 93587 49998 70329 65686 15740 30356 64838 38587 -14353 -20416
19271 -20416 -30782 -28525 -37002 -66303 -10440 7446 -30787 -40969 -27200 9372 57033 2204
19259 2204 -7647 78085 96355 115363 105551 102598 51617 35690 10837 36798 89520 90117 74894
19246 74894 54860 46138 100683 142864 116282 163217 167836 125337 123750 136699 160095 146496
19234 146496 145204 133168 123341 100721 134949 137430 67458 14779 11530 28600 60297 27454
19222 27454 12968 26202 27871 42347 79737 179995 184894 170735 80589 101137 127651 127983
19210 127983 145056 168332 195374 225356 203322 210771 156262 96337 101589 110945 117643 109998
19198 109998 24836 -13505 2545 20092 43050 30168 110392 103035 10428 -18308 30735 95758
19186 95758 119567 69155 75408 89586 34498 27640 58650 28886 -3721 36272 59804 29900
19174 29900 -43362 -69170 26934 100821 36717 40846 115892 130265 166525 177010 176303 171093
19162 171093 137840 158465 179605 167470 141730 119942 78011 95830 146659 153957 181107 187113
19150 187113 151289 140307 153200 124137 79664 60069 79605 144166 166856 184235 227985
19139 227985 160524 117586 109738 71058 118080 115203 90716 38582 50967 76261 74096 121834
19127 121834 99127 110214 122629 54161 -29003 29748 109798 123292 133891 188766 235592
19116 235592 220825 227122 245650 231316 250684 310432 319888 290302 331322 400372 394946 357376
19104 357376 326817 321713 367387 447075 486366 494512 519493 487714 488063 483583 336748 287869
19092 287869 308914 286246 247822 245219 227087 180876 180410 200608 174221 179035 209308 208992 251574
19079 251574 304688 245819 256955 261028 236150 168056 106062 71081 103077 117871 123740 213606
19067 213606 258533 243436 201484 189539 207742 229981 300537 316036 240570 232984 214906 249505
19055 249505 310801 316128 284553 299404 354203 382737 403190 405647 375530 366270 465606 523047
19043 523047 489104 461375 487795 490840 473856 445548 404520 477402 482695 466189 384989 347420
19031 347420 412390 456173 454222 420020 435701 466819 469520 477766 430941 452981 496858 490714
19019 490714 446965 399403 415943 476494 511596 476926 530284 592467 629417 633756 564014 563243
19007 563243 529132 466023 470260 505807 532191 506700 536881 570822 618524 605379 499288
18996 499288 502479 599759 638664 623577 653764 678211 711383 716181 701629 712919 806069 1047342
18984 1047342 1343970 1451090 1405773 1381355 1506697 1748171 1956904 2139034 2290358 2348060
18974 2348060 2466196 2510764 2614713 2727120 2807824 2850738 2879940 2899709 3010269 3148378
18964 3148378 3162805 3109080 2854124 2579519 2540479 2693052 2746739 2673230 2521373 2345823
18954 2345823 2187001 2148285 2106560 2079311 2075822 2095733 2068308 2032595 2020507 2067435 2036334
18943 2036334 2032920 2091304 2126643 2105187 2046090 2031888 2094087 2047676 1991321 1945496 1954504 2004249
18931 2004249 2081013 2049890 1977416 1989182 2038162 2015436 2034225 1982224 1919316 1942548 1991262
18920 1991262 2022623 2005255 2011351 1979456 1962368 1972824 2066193 2066366 2035117 2085069 2140095 2209580
18908 2209580 2255781 2279087 2234941 2295068 2378861 2423152 2520963 2668757 2764763 2874123 3108252
18897 3108252 3429690 3780674 4128872 4492792 4701099 4719615 4772625 4969756 5247129 5508030
18887 5508030 5704729 5780242 5910735 6191289 6630146 7132103 7500936 7889194 8443869 9001320
18877 9001320 9446283 9885509 10333319 10896258 11627691 12354420 12946134 13666339 14706794
18868 14706794 16050753 17522939 19083989 20738296 22630169 25182238 28759671 33521405
18860 33521405 39570279 47750524 60153778 80449360 113479491 162073482 222842356
18853 222842356 280171739 298828312 271748357 251918540 265033749 304038027 344391809
18846 344391809 345824531 310509362 292192001 308420448 344841738 365347059 336711297
18839 336711297 296804275 286268146 306444970 337346821 339846506 285701213 216788942
18832 216788942 166333023 135249929 115885397 103029594 93690984 86251188 80006475
18825 80006475 74770097 70436430 66798783 63667706 60788387 58159619 55716170 53506724
18817 53506724 51691660 50076487 48386660 46671168 44923406 43491723 42418144 41557349
18809 41557349 40667811 39343926 37757581 36352052 35362602 34666658 33960847 33034075 32048123
18800 32048123 31315612 30864577 30559705 30082359 29549578 29017129 28377615 27759437 27230381
18791 27230381 26574374 25795329 25049909 24228658 23344722 22498383 21806578 21235838 20706888
18782 20706888 20195920 19705922 19348235 18958689 18589496 18294461 18023133 17880839 17808273
18773 17808273 17716726 17604611 17332482 16874587 16429205 16127924 15926984 15697457 15330160
18764 15330160 14782981 14182806 13773265 13381967 12959288 12558916 12253718 11981337 11677893
18755 11677893 11375297 11075581 10850509 10632871 10378433 10178145 9954949 9765227 9638767
18746 9638767 9439239 9267004 9080220 8923337 8808865 8728206 8608481 8441802 8350282 8251735
18736 8251735 8100584 8031436 7987845 7885255 7817564 7777552 7745746 7687331 7552769 7446878
18726 7446878 7439397 7486345 7564170 7645743 7661518 7631610 7542250 7503951 7428243 7491796 7544217
18715 7544217 7592877 7610857 7560635 7481320 7416629 7376870 7329652 7249210 7182243 7113518 7039984
18704 7039984 6921932 6725156 6529607 6276357 6075207 5991485 5904046 5858695 5796897 5718071
18694 5718071 5634860 5522277 5440038 5310436 5183973 5057544 4990275 4928611 4794119 4600602
18684 4600602 4490091 4379495 4280183 4248384 4206190 4124486 4015721 3967019 3973669 3920374 3775217
18673 3775217 3673296 3590772 3553937 3513572 3435646 3361045 3239778 3126288 3110802 3092307 3060966
18662 3060966 2991045 2944323 2898049 2816392 2756577 2716963 2622979 2530378 2468368 2407695 2427968
18651 2427968 2401156 2333800 2229342 2151779 2123839 2089380 2072724 2087792 2148506 2091014 1938547
18640 1938547 1872190 1852830 1869073 1861801 1867680 1865745 1892319 1873048 1805651 1708988 1611740 1610229
18628 1610229 1638158 1610820 1623015 1631490 1582632 1618736 1631498 1605884 1561850 1528475 1535462 1539329
18616 1539329 1535866 1477337 1442620 1442281 1482882 1453992 1357943 1331888 1298594 1341187 1365859 1419088
18604 1419088 1382697 1343944 1349468 1321251 1340040 1351890 1338568 1312903 1268350 1224311 1282203
18593 1282203 1244113 1184150 1087442 1067332 1043913 1047638 1023623 1017831 1056639 1067406 1054759 1021051
18581 1021051 987523 975607 1021265 1079665 1105600 1119388 1033367 982467 1020073 1080419 1084943
18570 1084943 1008912 951772 937066 936678 957538 948294 1001716 995479 1003051 1012511 926625 866234
18558 866234 892497 903975 885385 822982 776952 801605 818793 786303 798084 779671 812051
18547 812051 845015 814286 713086 653985 597178 592443 631186 638769 641014 671105 596027 548588
18535 548588 565323 553874 472008 471552 553543 561921 547146 544305 552852 570323 599706 583637
18523 583637 598121 546503 568308 596581 593205 588936 564746 597015 604659 551498 487893 486570
18511 486570 473691 432385 487700 532456 516963 456205 431693 489972 513172 545594 574750
18500 574750 579301 532265 478093 467610 490040 530174 453742 453819 479221 494062 536052 583663
18488 583663 591355 581495 500585 472655 498871 512820 527933 470772 469819 519708 511427 546254
18476 546254 619436 639025 678245 716764 682954 672771 631737 582409 551205 548900 581782 591751
18464 591751 557477 541026 538434 571114 532084 498984 541091 555872 529487 475338 448088 444603
18452 444603 474983 515370 550535 503082 498664 544965 551402 518768 457114 440723 455106 434717
18440 434717 444094 487421 508124 514353 509112 496253 495318 513760 440912 418071 436270 415995
18428 415995 388846 366622 314957 304977 261469 246102 304948 356887 442477 444957 448511 487857
18416 487857 538684 613984 556041 501560 486728 482931 463418 362090 370408 403696 449415 442190
18404 442190 394763 445509 504238 470354 406007 461799 521294 558089 539274 475885 482952 605027
18392 605027 760271 763842 683767 672256 710864 737845 697707 619538 553382 573329 586274
18381 586274 612064 609129 581001 532023 530792 514536 472969 537759 606623 636278 599806 597519
18369 597519 643396 655494 629780 625003 638524 612929 615159 599344 594939 595474 591016 567176 536707
18356 536707 457766 442763 457467 501003 518311 584267 646309 622709 641082 760940 1025099
18345 1025099 1354091 1622010 1680045 1638319 1625238 1659734 1799364 1999931 2206700 2228813
18335 2228813 2195228 1997917 1754587 1729339 1839917 1975237 2067342 1960752 1749017 1587476
18325 1587476 1506377 1553665 1732056 1950191 2227445 2325463 2242221 2202609 2325228 2445540
18315 2445540 2593306 2845010 2973629 2976252 2863025 2710483 2575858 2601772 2645896 2647357
18305 2647357 2603793 2449776 2337062 2284715 2249312 2178441 2138854 2100300 2079329 2099235 2050584
18294 2050584 2008927 2021480 2033251 2021473 2021603 2005930 1984590 1986535 2035851 2012573 2039813 2048406
18282 2048406 2023048 2051578 2061235 2070188 2105500 2086507 1986401 1983419 2047529 2100845 2125555 2115963
18270 2115963 2104215 2231750 2296060 2363693 2346724 2346186 2374485 2368109 2415527 2497904 2545445 2558701
18258 2558701 2564270 2685693 2805324 2853377 2904950 2971051 3039873 3121427 3242222 3332614 3447201
18247 3447201 3653574 3835220 4018007 4236169 4533929 4940591 5438343 6187267 7081657
18238 7081657 7874514 8504780 9006052 9335666 9793476 10466845 11201179 11843623 12344603
18229 12344603 12772097 13440247 14586529 16008253 17747697 19926032 22797982 26356283
18221 26356283 31033120 37495700 47138268 62247983 86804826 125305840 178457822
18214 178457822 239675834 285344506 279633619 245150616 231875453 249909995 284143398
18207 284143398 301355274 264241189 199877888 149562256 119399475 102108799 91847620
18200 91847620 85545324 82051781 81084721 82967027 88521964 99214283 118465173 151202370
18192 151202370 200038307 260642872 314586755 323391361 288327411 265327883 275464628
18185 275464628 307455763 331821867 306331979 238924905 178691558 139758598 116014309
18178 116014309 100790867 89969322 81584202 74966981 69943798 66172770 63024728 59706154
18170 59706154 56197469 53061616 50613151 48790655 47490411 46613441 45718021 44244791
18162 44244791 42201509 40353264 39070258 38109188 37205222 36018805 34443335 32944678
18154 32944678 31682415 30659761 29791440 28983092 28269533 27577845 26951814 26382454 25693202
18145 25693202 24961927 24304003 23686242 23111693 22601868 22100843 21650199 21194634 20686643
18136 20686643 20199475 19718290 19239263 18860897 18529850 18190439 17800245 17463023 17175640
18127 17175640 17007689 16829350 16585054 16258943 16016538 15779140 15582905 15425994 15324346
18118 15324346 15258241 15206582 15239613 15416398 15724643 16232161 17023222 18290831 20445338
18109 20445338 24127531 30526363 40901297 55078512 70564735 78734301 69041901 51305907
18101 51305907 37659658 29525459 24762193 21757609 19683612 18176045 16966696 15983548
18093 15983548 15229166 14559921 13977308 13516621 13042841 12561106 12193369 12005068 11826912
18084 11826912 11717378 11588331 11444156 11248091 11008833 10673087 10426166 10343261 10209957
18075 10209957 10034217 9756199 9498674 9272338 9163411 9020415 8946612 8887125 8755786 8655259
18065 8655259 8547358 8465294 8410434 8397604 8344730 8324562 8223924 8020148 7826813 7676042
18055 7676042 7597867 7551912 7566246 7457956 7223387 6954739 6759845 6631329 6523288 6423255
18045 6423255 6354859 6251904 6130601 6028095 5856126 5701031 5540049 5446818 5335582 5249396
18035 5249396 5091191 4896656 4795198 4716064 4689588 4606210 4499808 4471093 4402916 4333841
18025 4333841 4235401 4162488 4158324 4077182 3925555 3859442 3751345 3663440 3646599 3515531 3428046
18014 3428046 3331473 3172887 3034588 2970000 2886808 2853294 2777838 2759563 2751672 2769183 2749595
18003 2749595 2695640 2554086 2490601 2469974 2510464 2530530 2535869 2505481 2456076 2395608 2349908
17992 2349908 2375277 2369448 2304216 2286006 2216323 2083982 2082954 2062931 1960035 1997358 2026200
17981 2026200 2021395 2041034 2049152 1976732 1915522 1958068 1988042 2089672 2119801 2083771 2003859
17970 2003859 1944624 1873479 1839956 1813084 1817671 1813282 1689354 1626071 1679803 1662712 1613966
17959 1613966 1554399 1582289 1571405 1485341 1441051 1402136 1461854 1455356 1427651 1462476 1515157
17948 1515157 1477119 1475839 1468797 1413014 1422989 1421423 1398721 1414450 1415625 1394464 1418069 1388368
17936 1388368 1325157 1280134 1278411 1262507 1208563 1140515 1105151 1070858 1074984 1120262 1158521 1090231
17924 1090231 1031586 1022864 1013139 1023826 1080478 1037004 984240 943181 980106 982283 963502 1014798
17912 1014798 997853 954871 939424 894895 824250 812010 894171 910000 855646 830571 776382
17901 776382 724152 735594 750613 756602 770194 743830 756347 806665 801795 793343 780986 763523
17889 763523 789166 803076 827908 839474 794142 693105 672487 631086 637843 631181 669244 644984
17877 644984 608174 636723 543455 543922 578970 560499 536973 502223 495177 540047 602039 586473
17865 586473 605411 515839 529139 528120 504372 493966 443705 397007 389235 450183 522591 548249
17853 548249 532279 515750 462305 429842 466470 533749 572039 541948 513196 533842 521727
17842 521727 452383 459141 453715 479086 480420 462681 406142 426668 418790 309685 269325 261694
17830 261694 298880 374190 379089 449659 456631 373971 346564 300854 277389 327146 369065 374952
17818 374952 315319 237369 223442 244047 325428 372637 370813 334986 317841 302663 305035 368005
17806 368005 359112 283346 324270 377204 356985 302644 232980 255041 316234 358242 312162 290126
17794 290126 328911 287521 309406 341768 376569 379842 409688 396628 404784 335519 279464 271530
17782 271530 260755 240350 229257 195073 186823 176167 188454 186417 246314 244454 305105 362400
17770 362400 382151 331551 270028 231989 218088 183420 162034 179724 226296 274216 262714
17759 262714 286111 326641 282093 226114 190238 164256 158005 176547 185273 251659 322442 374986
17747 374986 255431 189565 239984 273758 276838 271441 274953 305625 344527 409182 498492 696330
17735 696330 946001 1201279 1486384 1708141 1585399 1251739 988128 832997 717195 705940
17725 705940 807709 1039644 1296935 1529630 1738131 1689216 1451989 1184402 1004025 922684
17715 922684 850998 853195 952958 1076222 1296565 1551875 1843977 1818979 1518860 1188924
17705 1188924 1007716 951115 968136 1030521 1137215 1321125 1578192 1795718 1797050 1448486
17695 1448486 1123208 926295 774142 702710 653802 575953 555477 610142 595175 571789 592260
17684 592260 547284 503877 512836 449458 453878 488980 538493 499658 439141 440469 451655 407276
17672 407276 389594 417782 402241 354921 339222 340022 319055 335541 316246 289248 335681 319186
17660 319186 284082 311113 286447 271888 287056 261186 206284 205679 287415 337295 340659 308076
17648 308076 226668 198077 222004 233969 247164 256894 280995 276937 296145 311200 227881 230348
17636 230348 238709 306002 354574 354834 408881 456491 502969 634841 823923 1045038 1378086
17625 1378086 1713061 1754126 1617101 1468946 1502354 1651697 1825626 1721251 1329011 1021980
17615 1021980 844508 733446 613011 630326 643187 583259 537318 534519 541765 691646 857528
17604 857528 1024001 1367330 1805643 1955153 1858212 1711080 1657485 1765688 1960494 1911265
17594 1911265 1581126 1284478 1062088 907639 799667 784478 751278 768625 787750 758501
17584 758501 670769 618691 555920 520156 574636 624105 568598 487685 463482 452402 409107
17573 409107 368768 403099 422750 495755 527068 419264 321627 371010 481869 466135 485748
17562 485748 532195 560084 559620 516764 507515 526786 568585 479775 370452 345043 295107 282486
17550 282486 252678 282881 274603 239861 319404 341326 346673 314402 282862 194552 148200 168473
17538 168473 206081 222337 212231 135727 78853 115624 212796 220861 223908 241004 271428 298363
17526 298363 273028 235481 240192 230727 201833 204288 191025 226703 227745 163807 206964 239321
17514 239321 193086 136177 117199 113325 103258 126386 145984 108491 139586 178640 165375 145940
17502 145940 139572 168237 165452 156233 180370 170828 169407 170128 179645 225114 264484 269907 175410
17489 175410 126524 129948 192580 243321 227160 204669 209358 256589 249348 217636 140517 63329
17477 63329 57286 81887 101180 117146 167653 171586 97694 54669 53618 7649 -18444 -19802
17465 -19802 29921 91090 113706 131212 171930 229018 263813 189289 133121 170943 204655 188190
17453 188190 197532 226138 222601 192760 204279 246939 172681 113663 172257 205356 212793 178894
17441 178894 190704 302013 403241 476590 514939 424955 334110 304599 263970 203314 159000
17430 159000 182364 223326 245539 271149 341145 366375 354607 322621 281913 289641 324847 304022
17418 304022 325719 319905 303668 334245 278302 221069 223388 201510 285165 352542 357679 357620 380067
17405 380067 375678 374498 370970 304095 247088 204495 299363 377728 390170 387123 393885 417022
17393 417022 369963 317938 344048 446066 484220 470591 418244 443940 446221 459848 379248
17382 379248 380122 374767 321580 288978 228277 167849 142715 154481 208863 227816 227575 267120
17370 267120 352114 423656 437524 419878 310831 317857 266591 220346 169911 174986 163764 189878
17358 189878 217075 273916 307496 360014 322558 316043 323524 374900 443537 415140 349594 328370
17346 328370 387650 468139 496580 436221 406014 361076 359279 453725 590645 553191 470767
17335 470767 461146 431076 425776 515774 547640 543489 561465 528646 437701 452523 538246 554765
17323 554765 511122 501561 486663 454778 447566 474743 526901 597347 693800 712586 652599 638567
17311 638567 654279 600469 518841 517723 570859 627644 679615 710821 734105 773279 772974 732851
17299 732851 700493 654086 663455 648900 650712 758237 1081975 1353165 1535877 1560411 1524507
17288 1524507 1511967 1417680 1280358 1328194 1505810 1765550 2096436 2253097 2291873 2184561
17278 2184561 2082358 2036264 1875468 1809317 1793308 1896458 2048055 2197221 2272649 2342743
17268 2342743 2469217 2458938 2390016 2245871 2092658 1977088 2035551 2130520 2299778 2452757
17258 2452757 2618014 2685057 2717679 2657900 2612730 2509514 2348507 2269393 2437846 2596202
17248 2596202 2602972 2524202 2487639 2437825 2418587 2387459 2306362 2248492 2190566 2123927 2076777
17237 2076777 2040972 2028367 2026844 1999704 2040147 2047658 2025397 2052419 2053538 2080492 2074756 2007012
17225 2007012 2020833 2012359 2085354 2171327 2193140 2243534 2223707 2138392 2175949 2289047 2334683
17214 2334683 2305202 2289732 2302539 2337449 2376022 2501437 2582721 2652184 2702592 2769486 2822187
17203 2822187 2827725 2854397 2915816 3020623 3167170 3314746 3543392 3823344 4175805 4684713
17193 4684713 5219630 5491152 5516656 5525295 5674388 6015251 6523830 6859686 6998086 7312432
17183 7312432 7861716 8507213 9058775 9364059 9680749 10297677 11285496 12633071 14122427
17174 14122427 15550963 16959195 18486779 20510410 23313854 27167753 32248414 39621234
17166 39621234 51201226 70144785 101236617 147190336 204401785 257642158 269560570
17159 269560570 222515630 165693271 128307359 109784632 104441823 110348269 129401549
17152 129401549 164050875 212660773 265431879 293271993 261072501 199743828 152492480
17145 152492480 125773786 113231996 110696232 117959775 137697741 172762211 221281138
17138 221281138 272437702 295584041 259961721 201511512 158025584 133750372 123161459
17131 123161459 123557865 135885954 162744729 204148909 253562257 288954910 272264960
17124 272264960 212864550 158574279 123260833 101374570 87179954 77558439 70741587
17117 70741587 65431693 61151647 57777003 55243659 53185972 51373649 49489316 47048696
17109 47048696 44310738 42042353 40299598 39037018 37998114 37134525 36375704 35544206
17101 35544206 34724981 33820338 32756056 31511701 30267762 29174893 28265278 27568850 26964649
17092 26964649 26523349 26144373 25735682 25111123 24295447 23457216 22725179 22095635 21525423
17083 21525423 20958178 20413697 19897988 19397417 18955711 18500463 18079682 17715957 17317268
17074 17317268 16904696 16511122 16033542 15649220 15363316 15030266 14678909 14414987 14151779
17065 14151779 13854087 13486733 13198372 12877347 12688129 12477144 12162198 11840607 11620433
17056 11620433 11423139 11141269 10924411 10771640 10591910 10327505 10065578 9813922 9604913
17047 9604913 9378804 9119953 8925951 8816991 8791976 8758754 8641726 8548088 8476609 8349182
17037 8349182 8167199 7978043 7834961 7686658 7590231 7585868 7695602 7791249 7785207 7693011 7512470
17026 7512470 7280800 7150469 7071723 6922444 6889617 6891436 6969214 7093861 7136455 7021045
17016 7021045 6841148 6763994 6697608 6470994 6298404 6250246 6209287 6170364 6236177 6344370
17006 6344370 6399808 6365485 6284065 6155422 5989707 5852726 5751513 5650879 5510418 5463866
16996 5463866 5558866 5637563 5589333 5506730 5382108 5186687 4983864 4844991 4725403 4619218
16986 4619218 4529485 4488771 4441498 4322778 4199180 4203557 4148142 4106662 4047574 3920669 3806924
16975 3806924 3706794 3634328 3502494 3423370 3406242 3339075 3274925 3234830 3189243 3149185 3054789
16964 3054789 2947121 2878723 2777761 2783079 2719078 2684805 2762533 2728513 2610871 2493875 2376778
16953 2376778 2392479 2442710 2429565 2386850 2307399 2236902 2283582 2342323 2320022 2254384 2091487
16942 2091487 1997913 2019918 2005975 1937272 1888578 1876164 1937815 2006067 1945905 1835059 1756611
16931 1756611 1688232 1704508 1742071 1759680 1793251 1800796 1703982 1681207 1695226 1627705 1554077
16920 1554077 1472743 1423933 1416128 1442754 1450661 1395226 1331307 1312361 1304342 1249094 1264607 1259613
16908 1259613 1236278 1157989 1164662 1094526 1108317 1076599 1054282 1047382 1042951 1092226 1104573 1100370
16896 1100370 1057919 1020454 1060995 1061509 1034810 1014385 983267 943308 930758 944318 948368 978855
16884 978855 984143 995245 976401 900951 888191 870679 782936 773170 823249 833288 827315 832087
16872 832087 884342 876590 871937 838325 820860 820538 835132 844937 857873 816645 827198 779056
16860 779056 804273 800042 717631 640711 635283 629218 626274 582529 608361 628734 608748 611759
16848 611759 659126 643475 596274 567357 515686 461203 483221 530103 501730 430456 402323
16837 402323 454694 520120 544058 456767 390069 399204 367787 293614 312459 332308 387028 432613
16825 432613 432603 392989 348899 401297 426475 468547 433254 377788 331029 288486 242569 233203
16813 233203 331178 399067 425512 397810 407775 358755 347550 331721 327007 338749 332706 372018
16801 372018 324571 309849 261795 257219 270521 237068 220423 224191 222108 220359 251763 286562
16789 286562 214147 201739 229370 245702 246715 244136 228704 160314 208473 280282 277076 291362
16777 291362 301992 288757 258908 249451 240063 258577 252839 182764 169039 173624 204494 184733
16765 184733 210158 279063 282810 320157 306589 280402 303880 270308 274635 236287 234753 214958
16753 214958 156285 155366 135949 126695 86085 79709 112248 156728 144108 151679 210099 253886
16741 253886 314613 355699 340490 266428 224270 186739 178870 174073 117169 82460 68148 19223
16729 19223 46283 89555 97018 128474 103007 67317 142019 172133 108232 73122 82434 59300
16717 59300 106144 188052 201063 164100 195910 234538 214452 157381 148417 163416 163559 169987
16705 169987 156174 142463 98571 119937 131913 153583 200485 183452 143374 155487 197828
16694 197828 204330 165958 162755 241472 189880 156911 139006 145309 161431 161992 164031 149670 211112
16681 211112 231947 202924 201019 182164 110814 97977 82746 148165 176570 163408 138601 117344
16669 117344 116849 70220 65654 68498 -5634 1901 31944 28963 47986 91706 124190 129714 117538
16656 117538 148404 141801 133077 98088 138280 104560 79311 103478 58060 62438 68450 45603
16644 45603 71559 69708 39834 9974 10858 72289 101617 34402 25741 46047 53574 79991 117447
16631 117447 59361 -2556 -38447 13204 122478 119103 99908 72034 45802 55579 84148 172334
16619 172334 166199 158677 146426 64452 41595 94675 111939 87736 48572 70152 53957 -59656
16607 -59656 -70194 -21999 -25845 -49926 1808 43923 57660 36099 69535 101823 119629 123728
16595 123728 129808 178064 190639 183676 183678 241533 284241 252935 323770 458170 654338 919387
16583 919387 1222080 1447175 1399994 1116306 830557 641176 564324 638548 740076 815355
16573 815355 1021310 1257019 1502439 1537278 1203197 895017 753621 656291 558018 564594
16563 564594 672185 853565 1142904 1436584 1676918 1660717 1396946 1119812 902507 753781
16553 753781 723125 770109 898475 1084709 1355499 1596119 1612092 1442827 1134977 801595
16543 801595 579031 524975 487699 424973 396436 379922 369321 327467 278459 271478 311118
16532 311118 271912 223212 234710 275723 296399 288832 315880 328591 293117 194483 108376 45071
16520 45071 57687 146942 245933 244425 173321 223470 201299 209148 201737 105862 120221 193104
16508 193104 131487 130182 153950 156479 182731 206055 200266 187982 191541 235633 235695 220186 233017
16495 233017 170887 162911 205238 169724 123442 132064 129578 93607 92771 96063 87535 40909 35532
16482 35532 96996 117320 92722 83402 20383 -42326 -67 50277 73257 73637 80937 74398 78569
16469 78569 68217 100004 179048 130460 110346 80618 75891 47958 68212 124661 121940 99720
16457 99720 61882 64329 66355 45773 61883 50859 31010 54742 100406 99480 31370 -10117
16445 -10117 11849 38082 46624 39781 74239 96214 67044 19584 -11364 7908 48897 39076
16433 39076 53102 115706 125864 101467 55126 70931 131574 139777 112837 80551 11912 49031
16421 49031 72568 89318 17991 8017 126278 166771 83097 78547 50419 30911 -3846 -21137
16409 -21137 -33344 22942 17501 -55739 -36656 28925 25309 12507 -3515 -21325 -79023 -70217
16397 -70217 -56021 -4907 36098 54845 77262 69567 61572 88437 144860 115226 26965 43023
16385 43023 -1290 -18919 1568 -26463 -38585 -38558 -15841 -19462 -36658 -30610 15864 -35012 -12176
16372 -12176 56064 118595 58080 -16898 -48377 -26520 42194 7061 -55303 -34083 -9339 -21470
16360 -21470 -40687 -60360 -60598 -34064 -40959 -90682 -100048 -3604 74485 54825 44557 18925
16348 18925 -10711 -59902 -48339 -66230 -144482 -121381 -59676 11114 26192 48212 3754 493
16336 493 36745 32452 11243 -10356 31470 32793 -23499 -33584 -62618 -17600 19190 26509 24759
16323 24759 74515 80753 -1455 -58758 -78728 -142178 -94022 -62761 -12548 -7157 -29735 -57111
16311 -57111 -13136 44077 73164 62043 13470 -68701 -132666 -161159 -128326 -92148 -60767 -12778
16299 -12778 -15467 -39937 -41122 29666 18718 -19888 -73837 -105096 -69485 -8127 27752 40906
16287 40906 -52356 -112119 -76437 -43242 9318 -4282 10798 20784 -27449 -32853 3646 17595
16275 17595 22329 45996 76981 97252 99322 58109 50507 95484 94785 89812 96701 46939 -93195
16262 -93195 -101981 -39825 11735 61530 44965 18566 33115 39386 120835 149313 130885 88607
16250 88607 -33538 -60518 -61578 -487 71546 37511 -31657 8521 14121 -10533 -9486 14500
16238 14500 41025 20617 7678 -15168 -2386 -19575 -6660 -34498 -21980 -26228 -7885 -9342
16226 -9342 -52392 -36876 -48947 -65512 -36699 -36933 -23221 16345 -18606 -43973 -31255 33156
16214 33156 9226 -20375 42842 50898 28721 17647 35534 -22106 -59591 -22967 13303 60465
16202 60465 64049 16381 11571 -11385 -4646 -21547 -31582 -32322 -33515 18319 36161 46403 90131
16189 90131 101123 102269 58742 91693 42459 19704 14407 4095 -42054 -60384 -51602 25143
16177 25143 65329 98242 91720 26419 39036 12877 15664 21234 44929 57901 28213 12
16165 12 32610 52645 59256 76483 1816 -47867 -47916 8260 21627 -13938 -49219 -73533 -10521
16152 -10521 2810 -80590 -81674 -74713 -19170 43865 44942 -23393 -28453 -20496 -41398 -67841 -74898
16139 -74898 -23567 -7150 7502 27869 -28098 -41744 -36503 -8040 11386 38757 8381 -24933
16127 -24933 25284 140270 128936 74220 49824 19826 36840 10052 4994 12575 55340 26896
16115 26896 -13691 28342 73764 33057 33004 16160 2439 -63158 -85099 -34713 -33966 -61826 -52113
16102 -52113 -123958 -161052 -65006 34217 9470 42311 27129 -51047 -68571 -57095 -2888 24755
16090 24755 42481 25220 13547 40266 63704 18794 15399 9583 -10258 -41210 -69679 -57562
16078 -57562 8085 26655 28014 82654 100439 65985 50320 6609 -10699 -41385 -68914 -131966
16066 -131966 -124575 -99977 -95620 -29515 44667 14723 -7607 -31001 -56897 -44354 20561 13286
16054 13286 -11779 15904 40446 23581 -3823 43500 74931 86545 37577 11198 -5623 -6781
16042 -6781 -21446 -15671 -45727 -84757 -138974 -119791 -132040 -129873 -104717 -37532 -1347 -28575
16030 -28575 -45837 1467 31954 2472 -21007 -35980 -43237 -35759 -25564 -26483 -43076 -37454 -80782
16017 -80782 -77568 -21178 -19146 -15774 24575 -11004 -53725 -91611 -117617 -121733 -92275 -66886
16005 -66886 -47703 -26693 40104 30455 18056 -12639 -1800 -27967 -54375 -99340 -39275 29263
15993 29263 33831 13852 -8045 -56912 -113333 -122610 -131849 -84007 -29418 -33251 -3875 -16308
15981 -16308 -39039 -48305 -16152 41530 50073 40994 22806 38395 65467 46362 -8419 -36286
15969 -36286 -83943 -105409 -3091 25266 46603 42469 71978 66182 69496 54097 46504 36574
15957 36574 15438 11722 -49515 -50698 -12515 91242 115767 101406 65709 12645 -51879 -80766
15945 -80766 -67832 -61411 -47274 -27111 -5362 14907 72144 105400 61861 7637 1872 -23570
15933 -23570 -13744 3956 -35196 -70994 -79637 -133435 -156286 -198675 -192818 -147584 -87481 -16086
15921 -16086 -82983 -92329 -88453 -53436 5236 8908 -6229 14463 61512 -3739 -40038 -34758
15909 -34758 8846 47676 24795 961 -48610 -52518 -16637 -102854 -125221 -78546 -97972 -153880
15897 -153880 -148422 -58090 -7781 -11626 -55726 -63455 -84350 -105754 -64368 -30761 -32456 -21582
15885 -21582 33815 16756 -10466 27435 25900 -50030 -62793 -20196 4369 -5178 -6508 16139
15873 16139 1845 -34210 -77240 -61085 17119 59807 58252 16599 -55849 -129309 -67207 -42673
15861 -42673 -11588 -27396 -21029 -81903 -87342 -88587 -45320 11536 6415 19887 44332 22903
15849 22903 -25500 15675 74311 45782 14474 -37347 -102686 -62367 16858 73694 71053 69850
15837 69850 52881 40354 -30527 -50446 -63754 3857 42498 46011 46112 41847 -20683 5862
15825 5862 72514 18645 -18130 -57024 -144518 -162062 -74159 -33891 -36690 -22379 -20574 -33383
15813 -33383 3998 47226 36928 19687 -7824 -38513 -42556 28269 -20158 -89803 -102261 -68036
15801 -68036 -20902 -30583 -48814 -61432 6530 36057 31178 16545 2513 -3719 -7995 -3319 15952
15788 15952 32687 9974 30198 13857 -45931 -42837 -38740 -84472 -104385 -99191 -153170 -57363
15776 -57363 10517 36525 63952 18753 -14345 8362 -26323 -26940 28039 81991 86556 44257
15764 44257 28645 25869 7550 23344 4733 -1503 18235 27419 54637 68796 110576 65290
15752 65290 92510 59409 7969 55578 90229 65566 13697 64770 114970 90736 10540 8725
15740 8725 73863 48750 -8139 -54573 -67340 -24097 -1200 16343 -19057 285 40360 130579
15728 130579 114846 33979 21523 4067 67743 66550 51671 15208 40557 -12756 -72188 -76287
15716 -76287 -55567 -18733 6984 7385 23213 78088 109625 96410 79035 -17757 -56514 -3251
15704 -3251 9346 13233 259 -29072 -69127 -59725 -10553 8007 -196 -1355 32546 10207 45641
15691 45641 94974 69269 66585 69844 38120 20584 23177 49420 67044 51068 22399 -34270
15679 -34270 -49412 -9779 11711 21202 -5627 -45799 -54585 -49640 -43797 -27764 2978 17156
15667 17156 74099 108170 55269 25223 14918 47625 113765 79911 89689 32435 -10586 -13785
15655 -13785 -31660 -61745 -75537 -67451 -97594 -89644 -76460 -23972 1427 8135 30973 60159
15643 60159 22568 -47163 -37920 -26449 32362 52216 -6197 -89973 -130415 -93569 -108141 -72366
15631 -72366 -3826 -9710 27448 -20823 -27104 -53471 -70988 -107788 -92888 -42988 -83097 -74882
15619 -74882 7813 63733 63908 1423 -55559 -73902 -90820 -11291 58526 18259 -66226 -113910
15607 -113910 -146479 -60644 29317 84991 72606 88486 82015 67889 53720 54492 33051 12459
15595 12459 35152 47799 18287 16226 28454 -1354 16384 24151 15257 54274 101110 63123
15583 63123 17594 -382 -23758 -17023 -31409 -60849 -96553 -61827 -62662 -3351 5242 -2217 -63109
15570 -63109 -45418 41852 41178 -5309 -18949 -60282 -40377 28351 76533 2192 -17956 -5263
15558 -5263 -28241 -40211 -5534 17487 22548 21602 -1945 44646 42618 50361 14032 -55723 -100143
15545 -100143 -35171 -26163 21425 13028 -34610 -54658 -86414 -92793 -67161 7048 59682 47127
15533 47127 6978 -4259 26448 21057 40241 -1699 19601 71234 33209 4106 6567 -3402
15521 -3402 -51266 -866 34781 18479 47493 130828 77253 2297 32755 42969 -23756 -51060
15509 -51060 -28339 17505 36045 27251 36788 16908 -8633 17 -5859 6430 26951 -6090
15497 -6090 -28357 -44969 -46800 -49586 -7183 13968 -13159 18957 58730 49979 1387 -76615
15485 -76615 -82146 -27329 -7734 -41926 -39038 41857 22391 36364 91133 66574 71701 18941
15473 18941 -60387 -99387 -92226 -75532 -103334 -52891 -22055 -33280 -26575 -55259 -97254 -69134
15461 -69134 -25274 8251 -38739 -21863 724 -25550 -12123 -18548 43223 73969 44652 31884
15449 31884 21854 -15529 -8676 37829 11788 -4170 41047 85322 78118 75939 62613 71713
15437 71713 73299 89367 58604 43195 31999 -27419 -45144 -27054 21950 48952 47980 73090
15425 73090 117449 132329 81560 90181 136354 123872 88039 -38109 -92467 -75193 -61099 -31941
15413 -31941 8725 -6141 -19093 -4748 -6617 -54939 -39815 13268 71715 12999 -78533 -87469
15401 -87469 -81288 -55024 -30156 -30293 -29764 -24067 14287 32990 33548 62969 12606 42979 41506
15388 41506 32898 -454 3408 56116 61241 51812 45958 56585 36525 -73805 -112926 -67362
15376 -67362 -67209 -49742 -26254 -46232 6804 70790 56774 1802 3691 20779 -7959 -27948
15364 -27948 -13240 31320 -2989 -58780 -96573 -85055 -52772 -23324 -30363 40994 54725 1493
15352 1493 -42618 -104172 -103262 -35032 45258 65713 59199 90568 114075 53294 13540 -47219
15340 -47219 -43309 11907 30888 12768 -38143 -56703 -49881 -18988 -23616 9767 44534 -28180
15328 -28180 -39135 2388 20870 -53672 -167826 -181875 -92439 -10692 7235 10294 41597 -5421
15316 -5421 19277 -81692 -108188 -87825 -56415 -29684 -36040 -6636 19542 34050 25502 -60297
15304 -60297 -22731 9456 2120 15288 43877 34594 -199 2633 -16003 -51531 -59392 -48767
15292 -48767 4411 -10241 -42718 -41993 -12979 26622 73304 128392 133916 133285 76891 31719 55064
15279 55064 51036 47247 71306 57033 48638 17255 3298 6589 57521 42175 697 8946 6249
15266 6249 7162 8043 -22120 7880 58078 33665 -43917 -90580 -91952 -94380 -115013 -86728 -103062
15253 -103062 -111451 -63242 48991 53250 46378 36500 58211 57992 22944 -40144 -133459 -122350
15241 -122350 -16375 41630 41258 30005 -25350 7829 11328 -33625 -54984 -30399 -66025 -36140
15229 -36140 -69069 -39781 3281 37185 38018 12301 -28926 -4980 23034 -24341 -84872 -186021
15217 -186021 -144903 -116931 -19163 29254 57031 43946 15752 39002 38535 -11251 -18930 -46610
15205 -46610 -31496 -49901 -34473 -65350 -59628 -58539 -8601 26001 24841 -5659 -49267 -65273
15193 -65273 -73205 -49448 -11774 21926 86935 45165 -28113 -46609 -55923 -74236 -41314 -33930
15181 -33930 38704 28221 66846 92872 62251 30323 -16429 -63957 19109 155507 168144
15170 168144 84422 108875 61535 47766 72492 90519 138797 114796 44817 29189 32445 -23578
15158 -23578 -6074 80726 137934 170708 143513 52518 58469 166541 131132 40189 11799 -13284
15146 -13284 -19843 -49736 2654 48554 37182 22168 35866 47876 18106 -36058 -25630 14707
15134 14707 42045 20346 77813 25789 17833 2918 -36715 -41350 -26746 -44643 -31525 -12152
15122 -12152 -30402 -42813 -96292 -58821 16630 49802 84136 93210 42226 9527 -18290 -1609
15110 -1609 27711 25432 -24983 -55989 -8373 -1530 -6005 -725 55240 54373 46672 1712 3639
15097 3639 -2029 -6997 -60880 -133093 -108944 -21225 27958 19996 22428 -36190 -75219 -73455 -45187
15084 -45187 -7931 -40470 -72640 -81836 -81970 -25222 55190 17886 27740 51891 22749 -12500
15072 -12500 -72402 -89183 -62284 2440 3091 27890 63497 96756 120805 42655 18517 50292
15060 50292 80992 80880 37647 64775 45735 -11950 4284 16576 -39135 -70021 -2761 17838
15048 17838 22738 9411 26340 107542 112232 66649 23769 -17359 -56235 -32942 22744 23841
15036 23841 -10713 -44062 -41053 -43407 -66241 -97078 -129680 -105378 -57734 -86062 -66641 30201
15024 30201 78981 87841 86227 92318 20091 63259 97700 40234 -39961 -74506 -38158 -11394
15012 -11394 -38944 -82000 -117371 -48679 -30367 -1063 61084 80169 45271 14073 -78898 -100940
15000 -100940 -125028 -108002 -157912 -123864 -97729 -19080 -11404 -32595 -36862 -22914 -75161 -100870
14988 -100870 -77460 -139700 -138860 -59771 -1427 11248 19601 25238 21718 37077 54020 9344
14976 9344 30045 30796 -12780 24153 50556 31835 17463 13051 1613 -28452 -64659 -87652
14964 -87652 -87452 -43731 -16157 2240 -12085 -1213 16778 -54895 -39258 -4669 49146 29032
14952 29032 24580 6931 32805 45765 34149 58720 80547 84970 71151 66974 42990 14353
14940 14353 39792 59137 19914 53296 66474 35196 53087 145710 114396 105475 48157 -48484
14928 -48484 -62646 -59869 -33624 47574 122254 132641 74003 19465 35992 17148 -19531 -75911
14916 -75911 -64317 1253 25421 -9285 49766 72354 54456 69886 61999 19351 -4442 -22479
14904 -22479 3061 90829 92989 105795 84810 16159 -43222 -58874 -1116 23568 49483 26891
14892 26891 18001 -8105 -42203 -27990 26970 35344 28997 43546 86886 87682 76384 67045 87002
14879 87002 102815 69891 30494 -1312 -43036 -63648 -83193 -102729 -79772 8563 18118 -61343
14867 -61343 -113428 -102088 -46599 3364 -34870 -54887 -87039 -88161 -75499 -106329 -66757 -31470
14855 -31470 -17033 -15328 -42590 -62824 -52546 -39242 -34708 14117 54012 36335 -9442 -28867
14843 -28867 -64334 -71656 -17050 -6701 12155 30433 -21424 -25389 -11057 27270 -2113 -69050
14831 -69050 -142998 -127768 -19008 -3336 -68484 -99805 -38877 -52082 -64720 -14570 -4199
14820 -4199 -47313 3059 -15684 -55237 -53453 -2943 20748 16655 15090 -48843 -91656 -90292 -80440
14807 -80440 -85482 -31020 -24694 8991 4431 -28880 2887 -29484 -28792 17832 14303 17643 1850
14794 1850 19554 32997 70423 75229 21423 644 4788 17704 49640 38168 6547 -21963
14782 -21963 -21924 -50554 -65358 -25827 -40618 -102904 -123146 -138464 -104426 -38662 -7402 -44571
14770 -44571 -108916 -115832 -74807 -98482 -80929 -107664 -53760 5686 -31362 -81216 -71775 -72211
14758 -72211 -83251 -70854 -49918 -22669 -29702 -106349 -118616 -64391 27297 70290 45389 9599
14746 9599 5406 -66977 -102012 -79174 -91366 -73190 -7982 -38289 -9298 45973 55801 791
14734 791 -45766 -31463 4968 12709 44966 49147 68478 67107 1560 -38010 -19228 24636 -13386
14721 -13386 -40078 -28181 16898 28805 51831 44425 -18358 -7175 55417 120872 126128 47655
14709 47655 17040 -41230 -57387 -30946 11999 -21117 -27871 21498 70005 83819 26816 -25522
14697 -25522 -32840 8261 36426 -10890 -20829 -15728 1518 40069 80398 80598 76687 106185 101520
14684 101520 68583 69715 2950 3717 7330 73224 128141 93745 25453 71770 67551 41662
14672 41662 30924 38470 87030 28905 19101 53868 83925 104318 93248 118335 78263 24370
14660 24370 -806 85742 65464 23906 45316 47419 4774 -574 -16410 -26928 -5077 -7226
14648 -7226 -18352 -51817 -52594 14189 49641 16093 -1798 44231 14230 53332 55963 44118
14636 44118 51464 84823 44746 29313 45775 21945 65297 72688 43625 -1019 28706 13662
14624 13662 -19672 1154 62337 42944 -12681 -115997 -145027 -113766 -76443 -73998 -76954 -133354
14612 -133354 -181842 -131599 -56026 -13114 -30583 -45308 -36929 -94198 -125024 -95857 -111961 -95645
14600 -95645 -115221 -68746 6266 36462 16143 20988 8988 55719 51031 -46297 -87960 -51494
14588 -51494 -33111 35285 69074 23315 -31149 -25932 9981 -10897 -35026 -29878 17061 31654
14576 31654 55828 38675 35661 -16265 4046 76791 100723 87950 31565 30729 89772 110484
14564 110484 78288 20151 22471 -17238 -40764 7640 25696 -14453 -29925 -59335 -119017 -51220
14552 -51220 -4882 41971 49420 15986 -28006 38861 40117 117622 158006 85582 22361 -16831
14540 -16831 -39047 -15634 30998 34819 31589 41431 22244 8316 -12671 -22808 -58071 -63982
14528 -63982 -70211 -17193 80731 119149 133903 83859 27702 30690 27291 23120 -22335 -36794
14516 -36794 16029 27978 65577 28971 324 13845 14475 -22469 -1071 -19191 -23913 -32236
14504 -32236 1130 68121 89004 87854 37650 22202 -8529 -3359 -18431 -58485 -62247 16582
14492 16582 38918 -5479 11620 40348 53428 63937 35934 18975 18650 24918 32297 92239
14480 92239 92392 93182 69788 -17163 -11712 19643 -19582 -1128 31797 28779 8645 -63923 -89656
14467 -89656 -68424 -22062 6458 -3313 -65241 -95099 -51369 -17863 -44962 -48466 -43081 -42471 -15040
14454 -15040 -3878 -55273 -35505 16124 -3845 -13015 -38635 -77297 -62480 6697 19024 -10023
14442 -10023 1206 -7604 -6645 -11973 26069 38146 9038 12704 17043 29851 44838 85388 93294
14429 93294 87386 19087 -47759 -83396 -54770 12335 7929 -2850 6634 65159 61964 -8295
14417 -8295 -69515 -103422 -40096 -1087 -57797 -138659 -154618 -37080 19184 -18507 -44165 -105279
14405 -105279 -97920 -96249 14812 57800 53803 62942 56766 37990 2796 -8878 -25507 -51536
14393 -51536 -48335 6059 69747 79928 111697 114584 51018 76045 60345 93336 79746 70764
14381 70764 37758 -22415 -41439 10749 36185 20630 74231 166527 188449 193061 131233 60153
14369 60153 54898 60581 53200 65155 44618 7391 41892 61293 60624 73493 26961 6491 47803
14356 47803 55692 34345 -3054 -7800 -68559 -132577 -87892 -73161 -73589 -78152 -96904 -76932 8093
14343 8093 1672 -34998 2629 -13402 -27958 -40704 -40945 -9274 6575 -32427 -30800 -1461 -8244
14330 -8244 27034 15670 -35529 -51695 -62716 -47805 -12120 81839 103329 73608 33318 11163
14318 11163 35004 49928 -6259 -10120 -3970 17711 59636 89422 62519 38646 -23924 -7513
14306 -7513 -17142 -32135 -59320 -78180 -84969 -77301 -60278 -14976 -15881 -679 -44885 -42196 -36395
14293 -36395 8029 39875 65907 81515 85024 124236 98619 87161 69299 -26677 -64460 -14284
14281 -14284 19543 29646 21221 8505 -19934 -40265 -11369 8620 64704 54659 -22584 6662
14269 6662 12871 1265 25231 19945 -19387 -1894 -43427 -59983 -21634 -29446 -322 -13998
14257 -13998 -68232 -71555 -74361 -6980 3146 -16936 -21163 -46595 -94522 -99500 -78080 -74694 -25651
14244 -25651 -32204 -34033 -16673 -43901 -13123 78884 146142 103976 657 8188 55342 48764
14232 48764 23541 30505 64334 63986 40173 19376 4468 10343 -9814 -27037 27846 30467 62301
14219 62301 47358 54006 -34132 -95834 -169621 -127681 -25129 -34672 -77812 -53706 -68131 -95036
14207 -95036 -109980 -88963 -164808 -175934 -95207 -65652 -75490 -41141 -37322 -41843 -61940 -51675
14195 -51675 -57356 -49431 -115050 -129297 -58692 4607 15496 -6908 -18030 20783 82802 86325
14183 86325 107539 72189 236 -38038 -17270 -39438 -57234 -24142 -13571 21668 63745 59504
14171 59504 53302 36678 15231 47963 52976 44840 18534 -56956 -90397 -128501 -107915 -122091
14159 -122091 -120689 -33443 -36206 -24242 9723 41222 31584 41221 52215 34551 48321 9481
14147 9481 -31186 -32810 28917 76683 27044 -45453 -19049 -34650 -29095 23136 -23614 -96602
14135 -96602 -69385 -75073 -49739 -46899 -34679 25101 12925 -2337 -4910 2558 -1688 2207 -44803
14122 -44803 3242 -9180 -15250 -2274 2279 56196 80429 6945 -41029 -45462 -76320 -39011
14110 -39011 43736 -683 -91169 -117768 -100373 -54473 3564 61611 101653 105814 120256 31485
14098 31485 -47140 -31379 -71721 -121741 -90250 -86418 -1494 31409 50517 4062 96777 127021
14086 127021 102272 98454 121641 97472 77471 102278 77381 -16338 -76534 -29906 -15463 -4416
14074 -4416 -52028 -81150 -81088 -40454 -4461 -43070 -48661 -14903 36013 18003 10054 54768 37982
14061 37982 1211 -5449 56148 7094 -101967 -48749 36429 50246 22346 -49495 -129831 -126017
14049 -126017 -110129 -87411 -23856 -41895 -53901 -9411 -31907 -52797 44385 85068 76791 89259
14037 89259 108252 60115 538 -36622 -16208 -46671 -51708 -38360 21421 100675 63825 69938
14025 69938 88617 80760 52321 53734 100999 55029 -22507 -19195 -44000 -74612 -71668 -63494 -42912
14012 -42912 -44528 -55029 -5440 122727 100096 72848 67597 -31549 -41741 -27506 -37403 -16793
14000 -16793 -2935 -3609 33014 32376 -17965 -16282 -15603 -43982 -86198 -101094 -24733 8710 -21876
13987 -21876 639 45909 35490 15351 -17480 -84463 -89396 -53773 -35433 -22042 -15735 24863
13975 24863 83785 64302 69081 644 -31199 34641 109613 87928 83309 57744 31022 -28372
13963 -28372 -29333 -17660 -2846 7218 21526 20668 26129 60885 50201 1420 567 -18741 -35771
13950 -35771 -48601 -34244 -20859 -7409 -16297 -14513 -30808 2018 2904 -38311 -5627 -15557 13949
13937 13949 43259 39518 -6496 -44650 -49489 10209 8773 -16463 -26075 20678 -21010 -59293
13925 -59293 -43025 -41675 -46060 -102266 -52160 -21180 -66962 -91722 -56466 4527 4989 13635 25214
13912 25214 -29688 -67287 7708 4076 4490 32899 27266 16162 -17076 -2789 50149 32498
13900 32498 10053 72171 68736 35733 12555 -77740 -90297 -86913 -125123 -106317 -83290 -54261
13888 -54261 -61777 -61198 -76257 -84898 -49215 -28830 -10312 -24757 -23326 -48681 -21566 9710 -7766
13875 -7766 -49080 -67743 22731 67822 31645 54491 25107 62381 47739 79719 102261 76344
13863 76344 18822 19139 37820 48 -43862 -47354 -3374 55344 -1775 -49408 -94375 -106096
13851 -106096 -47288 -8923 -21943 11964 67070 48654 4172 -60898 -102809 -65381 -49306
13840 -49306 -43993 -78866 -77844 -38085 -67777 -48290 38595 58277 23135 50891 12835 -4610
13828 -4610 36576 6735 -60876 -70004 -96472 -65659 25763 55534 -6440 -20 20097 61042
13816 61042 43059 15613 33431 35504 18461 15359 -9057 -19970 -11853 -29992 -86225 -66872
13804 -66872 -20113 -33830 -50090 -32863 -35474 -10405 30908 47577 81776 100223 108987 69856
13792 69856 42358 32530 18096 -33143 22880 35386 -12843 25056 84278 78804 16168 -53823
13780 -53823 -47155 -12654 -68078 -73807 -43338 28234 38391 39887 33500 26707 83838 56972 26293
13767 26293 51232 39347 6331 45114 48188 10774 -15062 -17150 -12795 -40936 -56115 -94326
13755 -94326 -57294 -21948 -79510 -114572 -147750 -155381 -58947 -18665 35287 -6805 -46408 -47425
13743 -47425 -38210 -41047 -64299 -65144 -84974 -71013 -64368 -60018 -62066 -11473 -11126 -43169 -2954
13730 -2954 115230 65511 -24806 13278 34503 6366 20367 -57224 -84318 -47567 -68015 -91401
13718 -91401 3374 44474 69988 42231 14487 -34425 -53956 -44373 -96933 -124274 -92653 -94204
13706 -94204 -74874 -96097 -94961 -129041 -146132 -118329 -36866 -68004 -72043 -25679 -34836 -53717
13694 -53717 -22290 32185 2268 -54659 -83793 12368 54352 36565 -3182 12505 63462 55064
13682 55064 -6806 -19779 -18727 -23742 -2783 3906 11875 1429 -18198 47163 63453 17453
13670 17453 -2189 19322 34786 17646 18125 80894 61442 32495 55329 93774 77523 -16949
13658 -16949 -41794 -88210 -76815 -15649 14904 19214 -13731 -39322 6750 25072 36961 53511
13646 53511 69129 36542 36357 -323 6128 73546 93878 10410 -42097 206 -39527 -28216
13634 -28216 -32147 -55708 -57843 -24166 -59185 -85096 -73758 16623 74203 55365 5788 29635
13622 29635 26585 -540 -38785 -94589 -67788 -30505 -5844 30772 -39228 -42312 -38230 -30630
13610 -30630 -85765 -102150 -104320 -65963 -66423 -98791 -47384 -12330 -24870 28291 -7060 -24299
13598 -24299 2322 17709 21915 -3759 14292 -772 28295 24307 -12729 2389 4209 11924
13586 11924 9738 -41703 -95986 -69093 -80857 -98734 -67751 -31590 -16292 25008 -9616 -67226
13574 -67226 -101406 -106849 -104925 -78187 -65852 17342 48897 2174 -7684 -11440 -28206 -29004 -100497
13561 -100497 -147811 -152297 -171259 -133165 -19943 14514 -8866 -43751 -44790 -9332 -38663 17324
13549 17324 65794 96755 64763 76973 61826 63514 89242 128970 171530 119161 33543 63658
13537 63658 30004 54925 32821 -32411 -98406 -49284 -31056 -25607 12079 19860 -38050 -50992
13525 -50992 -36774 -18235 -28121 -10888 -18387 -30241 -26939 -24017 -1201 28094 13568 -63541
13513 -63541 -68477 -15441 -9217 -27754 -73779 -32318 23988 -16336 -53559 222 11443 2795
13501 2795 12467 7609 -7267 -40218 -45213 -28050 11766 -8344 -96162 -139667 -100178 -35230
13489 -35230 -10750 -35429 -49400 -80093 -40502 -20996 38384 60095 35084 30594 -35933 -81651
13477 -81651 -57693 -6578 -17368 -49501 -37999 -35344 13980 -10608 -18157 -43803 -85293 -81427
13465 -81427 -41036 -32032 -53747 -71404 -80860 -56682 27645 13626 3592 -29629 -4534 -5014
13453 -5014 -71082 -70852 -37795 40076 2533 -42230 -61070 -24605 19690 29801 23977 -19646
13441 -19646 -64786 -46941 -24818 29351 39005 17897 1472 29450 42906 -5043 33606 73905
13429 73905 54248 19311 8118 -2456 34329 49946 21842 -13336 -18011 -15851 9493 -7237
13417 -7237 -38970 -27055 -14224 -32405 -1711 1633 -46162 -36201 -14313 -29160 53046 76634
13405 76634 83500 88913 89052 62194 45557 45804 1755 -17391 9398 -10935 -12281 9018 -30149
13392 -30149 -29429 9308 -28321 -66722 -81568 -61049 1356 37818 -2350 49849 24205 7720
13380 7720 37067 51826 49880 19991 -34862 -106357 -91868 -82049 -66364 -50486 -15216 -30343
13368 -30343 1189 11520 43763 33685 11860 4357 -7064 9158 -25813 -17036 -31469 -45955
13356 -45955 -32109 -29720 -58539 -40691 -8626 10880 41639 64694 29017 27818 51461 -27266
13344 -27266 -57975 -45641 21347 -25081 -54818 17088 42828 20144 -1755 -19436 -48074 -51626
13332 -51626 -10543 15741 -28268 -48261 -44416 -47828 -10971 -5065 -33272 -63259 -101680 -38615
13320 -38615 10242 -345 -4618 -38105 -60774 -86710 -55367 12806 -57944 -94567 -54900 33172
13308 33172 86865 100546 82323 64123 44822 18108 25154 -3365 -12454 -16336 -97541 -85692
13296 -85692 -13417 47130 35599 -3662 9733 19151 23820 -25506 -42688 -64340 13673 19331
13284 19331 -29226 -33748 -4320 126547 175207 135049 64007 29798 35906 20215 -59563 -58267
13272 -58267 -40462 -36899 -37148 -16285 -8659 -54172 -37045 1253 82249 104906 68603 62451 115005
13259 115005 76450 25222 7985 43174 46323 41861 63133 29715 36697 33575 75621 65511
13247 65511 69716 43541 97104 95575 38457 14488 20191 -38917 -51198 -15560 -11197 -1276 55272
13234 55272 59780 66277 99320 70922 29789 26503 -3019 -34932 9991 31724 -22891 -77858
13222 -77858 -51955 -54249 -25700 -4479 45619 58490 44023 57773 74630 84127 43614 65829
13210 65829 48772 53014 48459 26562 21959 -15971 -40890 -33114 -9112 36741 34839 20966 -39824
13197 -39824 -65084 -48079 -31894 -9203 10609 68376 71786 13756 -40896 -55365 -40879 -34519
13185 -34519 -67009 -60039 -36488 5690 72959 66513 61158 70923 63717 -48228 -110382 -84994
13173 -84994 -87351 -36403 16797 24728 36288 85328 68668 53656 44751 88387 48940 38266
13161 38266 70842 67487 24326 4705 28766 30612 15373 27508 77931 110753 92715 115462
13149 115462 115259 84466 48488 32666 75150 54135 35435 91900 114030 49615 15450 -33109
13137 -33109 -66487 -73657 -59604 19442 75908 72673 53351 17833 -17993 -10283 -8728 -6576 45466
13124 45466 58537 54538 68044 83743 103318 75070 4451 -23366 -45962 -19169 -18644 -11956
13112 -11956 -74189 -61206 -18844 -12575 -9722 -30639 -50293 -61395 -87083 -59152 -28426 -18771
13100 -18771 10824 36659 58142 24468 -33590 -33266 -462 19358 68080 44755 -10688 -29075
13088 -29075 13866 32512 15549 -1288 17717 -19187 -55583 -66299 -57429 -62211 2492 66547
13076 66547 74966 97254 36861 48585 57878 20626 -59014 -82190 -100944 -87253 6245 26153
13064 26153 -25357 573 24342 35218 29392 10597 -34969 -33343 -16678 -31926 -41063 -38990
13052 -38990 -61878 -12636 18408 -22170 -20622 23602 36346 -19913 -32197 12309 -8762 -21673
13040 -21673 -29323 -44835 -18203 40300 24157 41011 28816 8225 -22296 -32426 -73771 -103534
13028 -103534 -131177 -85277 -24811 10216 6384 -399 -55461 -68922 14773 72282 18698 -22121
13016 -22121 -44261 -66243 -20513 58681 39890 49461 61810 51634 36390 28720 -17450 -61261
13004 -61261 15449 44837 8069 8923 -6409 -40990 -29796 -5871 -25878 -48644 -52267 24512
12992 24512 63812 61301 99617 82889 75965 71011 6177 -2844 49127 121044 119986 94749 72026
12979 72026 -10306 1958 31761 -6031 -74542 -77607 4128 19376 48076 53443 -5611 -19102
12967 -19102 14299 -23976 -54612 -55575 -60153 -10444 26481 9375 12154 83124 70303 67403 83993
12954 83993 -4345 -67722 -127835 -112372 -100966 -86800 -52297 1702 78205 62884 49745 71121
12942 71121 63621 -17869 -32699 -27754 -58140 -88039 -51966 -15357 -54608 11146 -6373 -55799
12930 -55799 -27794 22687 37796 729 -9434 -21018 -18145 -776 -14280 15025 82079 48528
12918 48528 7808 43295 62786 2948 -123142 -196061 -174216 -65994 -14149 -30245 -62944
12907 -62944 -90822 -52884 73640 144183 79817 63373 19675 4053 742 19803 5552 21853
12895 21853 51620 -17469 -67239 -58822 -29472 -19689 -11768 -60747 -45098 38927 51610 15862
12883 15862 16605 14858 44881 53153 9812 2745 8444 12484 10655 -16414 -59769 -37084 2209
12870 2209 24420 -78517 -112596 -52933 -44839 -29607 -63622 -57107 -45383 -16899 -37554 -27036
12858 -27036 -34118 -29102 17531 23100 -35884 -76469 -67599 -27677 -59388 -92210 -82177 -76243 -48399
12845 -48399 -28049 -21220 -1082 -2508 -4398 -527 -23263 -810 -652 -29748 7384 -9943 -57469
12832 -57469 -60466 -49889 2826 3911 -44023 15922 67145 -6357 -2883 -12141 -6011 -4112 54216
12819 54216 86698 56426 76161 73345 70932 64595 16210 -16930 -14609 -5346 33088 80276 52158
12806 52158 3876 -13447 -43940 -28329 40460 64831 55491 2007 -52686 -97776 -57374 13568
12794 13568 6147 -22506 -37825 10967 4083 -87194 -45180 24128 90666 86189 27576 50429
12782 50429 47275 -18959 -40152 -48769 -86901 -102154 -119045 -108022 -119253 -99661 -46643 -23803
12770 -23803 -7962 -48608 -4928 -1382 29523 -1207 -68323 -113240 -112558 -111174 -92731 -133655
12758 -133655 -156300 -115169 -23087 -30970 -15220 -13150 -21686 -34763 -85597 -101637 -172517 -152482
12746 -152482 -104513 -156839 -166790 -167260 -184541 -149735 -115910 -78706 -27087 -19330 -27866 -22442 -53060
12733 -53060 -65650 -16127 1318 -2502 -5479 -8027 -17031 27947 46406 51826 1056 -25916 -32335
12720 -32335 40062 -37522 -108677 -37477 -21044 -56117 -34017 -31893 -14280 15509 -16991 -48622
12708 -48622 -18422 17302 14747 1868 -47217 -47607 -8511 34335 34355 40885 32125 11089 12568
12695 12568 42160 56197 40863 31076 17239 6994 -506 -23228 -15624 -21185 -38654 -38309 -29
12682 -29 -5277 -16348 -60204 1037 19525 3525 10683 -8766 -15917 23315 26116 6580 -24055
12669 -24055 -19283 -17244 -4213 -55434 -83787 -45326 9107 12251 21400 -1732 -2573 -3502 21287
12656 21287 12968 7655 -6537 -27824 -6965 78517 166864 200194 93146 28635 3429 149
12644 149 -31386 -7118 53274 70962 106271 70051 43857 11959 -5191 -21438 -23463 -67249
12632 -67249 -76279 -36862 -24488 -4738 -6522 -37960 -35176 -6889 -11668 -42385 -79197 -69117
12620 -69117 -41472 -50593 -67407 8959 8580 -27488 17095 4615 7521 278 761 -27718 -38680
12607 -38680 -9011 9347 -40549 3549 -14422 -67480 -67155 -9050 26144 37661 21867 2892
12595 2892 43017 4085 -26684 -21766 7915 -41458 -57084 -95803 -86875 8386 18851 -4724
12583 -4724 1639 17392 12119 36257 27217 -9358 19950 -15956 -72395 -65535 -60098 2128 4226
12570 4226 37717 71725 58727 47031 -24888 -37803 -24801 18101 79827 85746 34874 34881 59780
12557 59780 46113 5443 7701 3884 16268 27791 50309 34467 72756 47086 43795 24587
12545 24587 35439 70346 43978 30568 -5573 3505 -440 11664 18807 17393 -20589 1225
12533 1225 4298 -19031 -6087 -53359 -39416 -13065 -20238 -53119 -37028 22986 70930 75043
12521 75043 71972 88675 83004 50592 16085 7598 -57393 -129085 -99847 -52169 -60247 -60665 -60639
12508 -60639 -57242 -100503 -36826 11968 -20674 -31746 15826 21711 55246 53316 62293 51565
12496 51565 22757 -27494 -29369 -27029 15141 34294 35262 63134 78067 110388 72339 5572
12484 5572 28062 54906 5471 17834 86754 92992 96836 92699 98754 127322 207058 367482
12472 367482 453240 454511 415985 406963 347263 225838 139007 103940 68904 -4226 35733 54602
12460 54602 125994 109037 59080 6409 -6539 -33128 -16859 43353 2745 -55624 -33831 -42942
12448 -42942 -26468 26990 28337 15170 32659 99271 135862 120116 109500 64219 82034 115259
12436 115259 88496 120999 194542 197030 173545 231565 222934 216131 192237 201835 237549 320179
12424 320179 386870 419389 438680 430669 389922 351778 311337 303888 315432 294133 296780 270312
12412 270312 309545 381795 356714 350007 336143 292668 268949 249698 239122 241974 267944 204345
12400 204345 124424 172729 214617 232175 165746 112534 40993 47493 63200 54375 87146 130724
12388 130724 136677 125152 133801 135920 141472 123752 186162 212567 138333 122701 180151 213532
12376 213532 261256 294825 343713 411935 493752 530162 467164 373035 247442 221905 190626
12365 190626 198112 219035 204213 183886 131199 169417 156277 169978 180152 212708 191125 134170
12353 134170 91180 66980 71309 31271 29260 15047 -2036 -35294 -76709 -64012 -37148 52213
12341 52213 84827 96366 99502 96551 114984 96062 83264 51160 53764 56112 44191 29304
12329 29304 31577 46404 90638 65710 7214 22093 38635 40188 42681 60550 37537 -48191
12317 -48191 -72887 -67900 -89742 -159309 -97666 -81634 -83272 -39441 -3066 -42596 -18988 5223
12305 5223 -25051 -29518 -5624 38760 36117 49754 66940 132897 141795 83271 92713 42840 -25210
12292 -25210 -45754 -43938 -45177 -13909 17540 50568 98300 156401 158945 102634 35770 15845
12280 15845 25014 58732 44844 30077 61230 25306 -7054 53276 50901 58029 56259 45086
12268 45086 98471 134010 112836 8504 -28379 -40860 -20337 13959 -1942 -15968 8476
12257 8476 78046 103324 107593 139768 127903 68653 59130 58533 18859 30831 50801 16471 43820
12244 43820 23476 51962 3915 8257 14429 23629 -24726 -3789 -3114 1335 -23749 -41482 -15546
12231 -15546 -5760 -12683 53157 38421 -28468 -66487 -12121 16845 35408 58933 46470 65248
12219 65248 97420 78865 26498 1548 13455 77419 71638 96645 99905 66490 -197 -63902
12207 -63902 -24093 45057 62084 90111 68323 55936 24580 22508 45349 102788 157593 231448
12195 231448 256652 185785 153112 163592 181606 195077 144599 124560 123864 117685 56531 38068
12183 38068 38096 94330 115449 102293 96494 60654 2520 32580 50169 52442 20883 -20265 -30953
12170 -30953 -75935 19913 38917 29514 67327 25370 36091 84652 114930 103656 132559 81680
12158 81680 125447 170737 206385 217586 232654 188934 150979 213459 249374 272264 253318 220149
12146 220149 271661 308443 284816 202890 171022 127008 78874 24462 11236 64816 97708
12135 97708 139675 101256 100406 71774 68197 51408 48447 -4881 -1122 15850 56345 31880 65070
12122 65070 104546 173551 197097 120638 122386 142985 49192 61642 22892 43930 93056 44449
12110 44449 40338 74560 90009 88193 93010 104480 165834 229428 282755 290705 242901 218865
12098 218865 216303 218321 193031 100957 128824 103144 36880 9120 935 -11629 -37605 -9502
12086 -9502 10110 54534 95644 118125 68237 18408 18806 34212 61931 11534 30730 69588
12074 69588 81402 132387 96399 76020 81046 43985 12592 20814 65203 105724 115926 114208
12062 114208 146299 131754 62114 8312 -38690 -24859 14081 -12493 -25577 3738 12144 42550
12050 42550 42105 15976 67051 64602 22849 7341 -13872 -35887 -22285 -54293 -83723 -36785
12038 -36785 12139 -1914 48490 99123 -2166 -48569 -32632 -29803 -12075 34907 35146 19160
12026 19160 -56040 -110659 -32617 -21490 -16537 19905 -43278 -72015 39060 54307 26603 3333
12014 3333 -42978 -65185 -962 36013 61229 58396 -1807 -36433 -35746 20515 92781 83824 49962
12001 49962 -30620 -17998 17190 24889 -7799 -472 25008 -1669 4406 -3292 -18272 46591
11989 46591 13206 -7714 37941 53932 2070 20839 116057 172333 86143 -30702 -9829
11978 -9829 -3124 -7780 52399 65570 44833 18741 43499 64881 -19289 -15233 -9968 33867 9769
11965 9769 -35601 -21948 -45126 -23277 -13839 -32437 14695 7962 -36522 -49605 -68394 -148984
11953 -148984 -164647 -106659 -38709 -65084 -95097 -93644 -50288 -46589 -40062 -27126 -273 -22696
11941 -22696 -51405 -44340 -61900 -115335 -123801 -55439 -27663 -49063 -52214 -84968 -85796 -2360 -56434
11928 -56434 -157921 -185655 -132363 -49634 -684 -14841 17083 -42480 -33166 -17897 -12822 -25257
11916 -25257 -1574 13189 16085 -358 -4879 -35038 -64801 -51474 13842 16846 58661 93780
11904 93780 34483 4685 18745 -3782 -49920 -66519 -11512 -22697 -21583 -13930 -3573 7819
11892 7819 -58235 -93217 -67818 -34306 -51786 -55051 -74436 -45801 -55813 -47206 -37413 11741
11880 11741 35359 -5442 -56600 -60367 -73880 -54359 -62541 -56741 -129075 -140501 -91715 -41554
11868 -41554 15625 -9460 -15284 -16609 -65858 -92967 -37491 -8986 -27609 1732 5774 24862
11856 24862 -17796 -18094 50104 75883 57410 75925 103797 30691 19830 26535 -848 11595
11844 11595 -13960 -67453 -74616 -50908 5545 8929 62961 74945 18622 -15750 -9160 16661
11832 16661 34677 42729 44393 35097 -26538 -29688 -13499 1154 -14594 -59619 -17569 46236
11820 46236 86416 105906 65903 29866 9031 41904 46889 -12794 -116143 -143164 -162064 -162217
11808 -162217 -111898 -47287 -34271 -81346 -99459 -87555 -138175 -67645 1457 8107 94908 116979
11796 116979 45718 -15100 6519 -2942 22315 49588 36519 7568 -62722 -109977 -103519 -68540
11784 -68540 -49269 -72318 -63224 -70128 -75485 -55346 -51621 -39862 -12447 -7775 -5761 4679 21289
11771 21289 -13625 -25865 850 45790 34953 34745 41979 23154 -22843 -62185 -27692 66157
11759 66157 -805 -9735 -23945 -31635 -66597 -80756 -111789 -114785 -102048 -55388 -30699 -60273
11747 -60273 -8815 -42879 -50067 -14550 -85615 -121953 -80996 2225 7937 -5766 -58928 -100629
11735 -100629 -109214 -101511 -99645 -93855 -77501 -99863 -69440 -58992 -78138 -68327 -41247 -76778
11723 -76778 -46378 -3465 -20329 -91225 -123517 -103866 -72420 -43386 -50975 -14393 9068 -21800
11711 -21800 -29334 -6825 4825 -9673 -27204 -10194 -26 -5724 -7080 5176 -30663 -92341
11699 -92341 -68179 -52975 -14337 -55944 -67491 3837 566 12000 38090 17095 -75017 -109023
11687 -109023 -45735 -19559 -36231 -12367 5720 -42074 -21212 -16228 -58777 -43779 -47309 -86002
11675 -86002 -52488 -96808 -116298 -61667 -86205 -128127 -129611 -85565 -68547 -73180 -63047 -43116
11663 -43116 -13795 -20564 -40520 -103314 -110099 -99215 -54373 21077 88380 58646 -1209 -40281
11651 -40281 -8593 -25318 -20617 6967 31691 33783 -24208 -15907 49914 62654 51919 89628
11639 89628 75984 66579 33561 -27253 -32873 -36834 -41917 -61313 -51257 28823 55134 39575
11627 39575 37950 -4234 -5764 -12064 16824 -33519 -62228 -42071 8513 5111 -8537 -17203 -13882
11614 -13882 9880 40087 62510 123946 85304 118131 105745 36015 -35331 -122657 -70103 -15629
11602 -15629 -15924 -2304 -7431 9695 13622 -1813 24448 44016 37381 30298 -2871 -30714 -22773
11589 -22773 29869 22504 37726 50002 37411 -1371 -29863 -30058 -36151 -23012 -27800 -11097 -21526
11576 -21526 21181 14217 24398 52439 33700 39320 60065 77084 59268 15540 17015 46346
11564 46346 70297 38021 23010 -21334 4494 35030 85778 45866 39698 -33250 -30311 37425
11552 37425 39660 -15335 -90771 -54743 -36562 -37738 -9016 42351 71256 24509 -17404 -29007
11540 -29007 -12960 -31868 -39328 25300 73710 111457 99257 1453 -35771 -35860 -31005 -10345 14067
11527 14067 -8131 -60703 -45723 -10807 -13521 -40580 -69122 -74429 -41630 -17640 -55246 -99370
11515 -99370 -40854 -24135 25289 24973 36095 88069 46692 18682 25658 42317 91339 115467
11503 115467 39057 -5642 -39054 -18430 38582 -28936 -84662 -72810 -41536 -26780 -39227
11492 -39227 -41195 -24662 -39449 14046 53742 81233 61484 50088 30107 68465 19942 -12571
11480 -12571 -56569 -72396 5341 36501 86179 50319 64492 29705 2083 54260 123149 115060
11468 115060 96666 111245 142636 86116 68136 106436 89062 119465 84008 46012 15227
11457 15227 -20547 -17888 -22020 -7916 -19369 -51982 -59593 -31819 -27013 -10736 59740 98545
11445 98545 50783 60575 109649 123286 158646 154716 135426 126494 75377 39301 47235 49500 -10785
11432 -10785 47073 76391 66825 32402 82801 151384 146263 92634 21514 18895 67859 56728
11420 56728 59957 95411 113186 76424 25437 -24380 1769 -5805 -15037 -51489 -24680 -21105
11408 -21105 -6801 33787 98198 100063 100318 109512 105225 110162 106181 121047 96648 126873 158347
11395 158347 168426 181420 216643 257901 301916 330055 306466 323202 352535 432980 547133
11384 547133 645336 746922 887252 1134763 1618410 2399298 3537208 5139039 7061997
11375 7061997 8470508 7831369 5706464 3997131 2935658 2243473 1779547 1459028 1261142
11366 1261142 1092037 950131 855403 786240 716895 680453 673069 600700 595060 563076 537573
11355 537573 558256 575003 524153 475712 482356 516278 533981 501048 414219 401618 377283 372042
11343 372042 385483 337954 308387 268349 272673 271056 264491 252270 263050 267889 239029 201643
11331 201643 175489 179096 209547 222831 239703 180696 136887 90567 124864 159163 156996 178654
11319 178654 247482 234830 197692 159117 105883 73231 91662 168314 147007 182172 161608
11308 161608 89247 82667 150945 182615 186727 133394 77269 57914 50915 -757 -45025 13366
11296 13366 125709 191315 207251 183522 186531 199099 211703 183926 86765 22910 88893 112087
11284 112087 64507 64187 102953 120433 86963 84180 104159 27801 78142 137827 234145 233921
11272 233921 153146 113612 117386 43214 -41293 -9178 22315 -49173 -78618 -51952 34174 71211
11260 71211 93661 102641 115383 152604 145757 116744 63938 32763 18062 31117 39472 47682
11248 47682 43216 2855 -11620 -17586 1948 33459 59298 17896 -8957 -54458 -47193 9417
11236 9417 60687 43049 -16861 -15140 10573 -6541 -1107 10422 -9348 -15725 -3985 -19660
11224 -19660 -38150 -14576 -34011 18633 88721 47498 71265 37723 12620 41476 51606 62681
11212 62681 86523 77699 25432 -848 51992 103933 162462 159304 160809 116736 59484 44486
11200 44486 45014 84395 88914 37762 -43938 -44847 13530 52091 40254 34498 319 18342 78478
11187 78478 74936 7299 -3017 -9120 -44235 -81978 -75022 -58726 -27667 24585 88344 112087
11175 112087 72134 36591 -49927 -121730 -128013 -120556 -81342 -55982 -27327 -24404 -13434 4037
11163 4037 11814 -7774 17014 51134 50366 -52985 -28557 53882 56389 55784 94150 117067 128575
11150 128575 125463 65515 47876 77931 52387 25154 30489 21451 -28507 -31625 14993 53977
11138 53977 2284 -33483 -10111 32276 47309 32478 46317 88440 81780 123195 205166 247926
11126 247926 164441 94581 41654 12706 33698 52762 74528 102757 98850 110440 76549 75170
11114 75170 115687 94602 61404 77697 2995 -28183 -385 25156 17430 72261 74069 87175
11102 87175 7627 -8740 -9746 41198 93797 85617 113129 147249 102537 18403 19160 47932
11090 47932 68852 78623 108685 107576 58456 59830 5278 -50029 -39240 -49598 -54495 29018
11078 29018 37202 35226 52430 26883 68056 85659 72820 113444 117312 179412 161554 110526
11066 110526 114664 68081 91185 51116 68104 51239 68591 106451 132053 164838 159198 127839
11054 127839 127929 34068 37884 150160 167682 174766 268736 324903 271757 234138 169748 153423
11042 153423 145619 136524 151825 163895 153847 138671 141828 177208 174438 192392 177323 208734
11030 208734 238817 247093 279148 238926 267913 281251 310031 427481 449208 468878 505465
11019 505465 514098 562778 588956 617155 658104 751649 901979 1090766 1236018 1423056 1609232
11008 1609232 1849123 2309599 2980872 3939537 5410401 7806690 11695273 16893438 22369118
10999 22369118 25195176 21828406 15589837 10749617 7811175 6038434 5016519 4303242
10991 4303242 3807413 3372928 2971257 2687526 2495803 2302519 2128553 2041216 1954633 1840802
10981 1840802 1759835 1583362 1512232 1469195 1426866 1363381 1322735 1321164 1245814 1169057 1128203
10970 1128203 1056047 1002371 960832 912150 903575 942664 993559 970771 899449 871996 860248
10959 860248 845917 823056 758413 665355 639382 674890 659280 684503 739431 748809 760052 669935
10947 669935 683898 688626 685995 649256 578882 530694 547881 571741 578507 594111 617731 622131
10935 622131 590784 559558 540469 447960 433179 397664 393529 424984 418387 496387 553412 440776
10923 440776 372516 346446 314669 285712 284370 279510 282472 279747 317385 292205 241113 201747
10911 201747 183908 210976 243386 221195 229972 245628 177045 138825 158278 195494 166576 161158
10899 161158 175927 198199 276652 312471 338547 370067 311306 272284 282192 331939 321034 315569
10887 315569 382578 442724 453397 443996 462653 597293 815395 1044541 1456721 1931511 2409588
10876 2409588 2644612 2534855 2125624 1696831 1328882 1085061 907937 806819 789347 733438
10866 733438 654644 592213 521734 496141 504958 479203 410002 374966 312171 288605 300849 311681
10854 311681 275455 292106 269706 237184 247306 240830 186823 112723 160483 225632 212446 180194
10842 180194 161861 225973 200126 161411 196335 182348 220158 271921 262989 216991 249465 204850
10830 204850 136703 156534 168345 135941 84835 87092 108954 105054 117012 132704 174668 173355
10818 173355 170812 181730 186568 206095 169307 122453 68430 69764 94318 115058 109726 84666
10806 84666 85601 117059 151159 72661 81367 67484 10524 18081 49189 105051 130366 115941
10794 115941 90320 83846 110876 84590 30015 32003 29991 72875 129859 148447 120688 137903
10782 137903 175652 171226 80875 25515 67540 127813 71563 -765 -14280 39955 47671 24811
10770 24811 35173 89561 96910 98873 73217 34358 3985 -2202 76117 133085 100064 89914
10758 89914 68909 15851 3836 14685 41990 17743 15659 15219 31534 -43157 -31901 17894
10746 17894 37416 80062 33524 49300 46440 -20423 7782 17992 49118 85450 67449 -8099
10734 -8099 18342 19801 31450 48495 47469 31288 58491 125379 113313 70713 41179 -6847
10722 -6847 -25327 -5173 46385 81164 81429 107043 58700 40795 8235 -44401 -91632 -89964
10710 -89964 -36347 46294 25279 105637 154692 107150 31130 -19687 -88995 -73555 -3452 28876
10698 28876 10186 5508 -34448 21969 15120 15990 40534 23183 40325 59302 69084 58882 57841
10685 57841 82995 12159 -46604 33844 43813 -41574 -23816 -47121 -45984 -21590 1737 20045
10673 20045 13790 30890 23962 24128 41747 15500 24601 8646 17641 -28743 -28053 -33067 -29499 -43834
10659 -43834 -76132 -128557 -115624 -51973 -17448 -70013 -58170 -54330 -72539 22956 58656 111578
10647 111578 123967 106163 50701 -3936 -3296 6039 -35048 -60656 -83747 -100551 -146869 -177381
10635 -177381 -124376 -60381 6111 36196 11643 26723 39899 -35799 -101937 -69269 -15942
10624 -15942 -13567 13579 30124 -4181 -3642 38748 49370 105931 128630 66846 14949 -10793
10612 -10793 -36528 1074 16052 33340 93708 86407 119394 71273 27278 28161 22957 27817 -7899
10599 -7899 -43909 -34623 -61811 -18501 1802 20644 2029 -41165 -34551 -40873 -65693 -69770 -2877
10586 -2877 36071 -8371 -25951 -63607 -101125 -101162 -99380 -103866 -58065 -27961 -6320 -50006 -81517
10573 -81517 -96854 -33759 -13387 -86628 -64640 -41421 -58331 -28883 -52146 -138385 -78284 -34299
10561 -34299 3081 -6105 25396 37656 98360 56813 59133 73957 58196 58536 71758 -10256
10549 -10256 -4824 13886 24309 -13883 42591 112517 102361 120437 113213 110360 119105 34558
10537 34558 -29075 -39659 -5862 -10038 21689 33832 43844 -28528 -51829 -28471 10726 63902
10525 63902 135054 135140 59803 -25846 -67946 -72561 -47827 -19078 -55171 8163 5870 -5070 54077
10512 54077 86497 87414 80635 26155 24705 45781 11445 23402 32245 9485 -17447 -8496 38082
10499 38082 90795 84248 5048 -1995 30009 -3753 10853 33061 42038 32539 12955 -21570
10487 -21570 -10754 20861 6416 -9314 42645 52950 35913 14721 13210 19091 17078 63073
10475 63073 70841 15800 -26860 5381 37478 39686 64051 4437 23909 41101 535 76019
10463 76019 109319 163824 165164 106818 117376 89515 99800 149144 59968 5124 -7456 70914
10451 70914 20792 -15143 9210 20474 10838 47930 70746 17143 10884 55682 29404 33720
10439 33720 28091 55320 108426 149750 104691 7854 -27399 6142 61376 99941 106440 142109
10427 142109 74929 18805 -8765 15555 65757 69122 98154 158511 193630 160121 159666 165682
10415 165682 136745 131669 149911 218569 250007 221192 161736 149472 227758 250814 194789 167887
10403 167887 210193 227099 179418 159745 158412 212788 196266 141420 122862 132957 129257 124231
10391 124231 132971 33946 11031 -2141 49998 116032 180675 138267 -6094 -16717 7074
10380 7074 28019 10653 -20481 -64660 21342 127698 174217 143582 136728 129415 122649 78494
10368 78494 69359 111552 125780 182557 166086 122828 128440 156981 207762 196280 177074 180378
10356 180378 187265 215479 205258 144107 125099 104150 65207 49293 62852 25980 18273 57123
10344 57123 72425 73701 73442 21338 -1677 -11210 26007 76860 74216 90688 106630 91405 80602
10331 80602 4782 41714 91136 95950 110207 98280 53721 51297 103875 126399 98943 120392
10319 120392 102092 128661 195052 168276 127076 58598 7144 8669 2665 64447 101687 57504
10307 57504 -4976 -14448 -33615 14565 92307 105257 111965 66379 43318 45569 63734 61266
10295 61266 -62904 -69153 2625 73534 53797 42708 24716 13209 49959 89429 92812 49190
10283 49190 27573 65181 47712 697 -26123 -17906 31360 32159 -21421 -10494 4810 48019
10271 48019 63806 100436 125860 43440 95017 104212 43037 81458 26278 -29981 36991 98131
10259 98131 122769 92412 72198 81335 115162 126601 120705 155316 200665 150810 63545 61823
10247 61823 71687 83734 82365 71716 76975 10568 42953 43770 32262 37699 29412 118494 184513
10234 184513 156213 102472 85006 80619 35319 50836 72162 50931 86215 108338 58583 51576
10222 51576 85079 112143 86918 69771 66874 17282 -17460 18162 -22996 9957 65922 89193
10210 89193 51480 50291 24088 98265 93386 49840 85107 58972 55236 128222 181666 167765
10198 167765 183150 203176 149567 135182 144353 168998 210836 244229 190420 89189 130561
10187 130561 168588 114959 69533 70913 50334 37006 84028 56856 -7552 96968 171781
10176 171781 126512 102279 55390 69528 58177 51533 36722 -5095 -8298 -34913 31882 77701
10164 77701 42067 6155 -4926 13670 -12601 -38367 -14402 51252 43371 8410 -40958 -25659
10152 -25659 38136 68068 56710 76430 80083 79454 69190 89531 57220 20149 51119 108667
10140 108667 72123 77955 118313 102156 87272 44827 69284 76048 45644 88523 77898 26472
10128 26472 32656 5588 -2307 8872 15153 15699 70341 95407 66970 59158 49294 -23885 -12020
10115 -12020 24194 13535 18769 21190 20553 35853 114711 81087 109890 120113 117684 98433 89410
10102 89410 69601 26397 6334 -35833 -59279 -65439 -16700 40238 8373 25413 3780 20234
10090 20234 40091 16436 -12430 -18841 19910 39950 84521 53779 31618 37008 -7805 -13144
10078 -13144 -38611 11400 69140 41655 30277 12541 19823 71581 41760 71602 84891 41855
10066 41855 17590 56642 78004 93823 130524 174490 123440 24465 -19763 -13548 8635 26365
10054 26365 31575 96680 111807 166558 149754 96568 103501 130885 173896 161086 131588 136651
10042 136651 130116 103207 76847 92957 142631 165752 149412 143216 161926 168058 139772 172157
10030 172157 124972 129061 168585 78944 28701 -20783 -30920 39007 106336 128409 110671 131704
10018 131704 154822 150311 170157 173577 155844 134249 134845 143458 123813 110367 70624 120883
10006 120883 145547 113537 59317 89203 107015 130830 133969 85945 65696 108275 101826 43048
9994 43048 46803 33178 55828 36004 60174 70833 118904 126831 50530 17047 40533 23460
9982 23460 27737 42173 41387 58334 69281 63851 88884 61311 74682 83481 128801 144581 95411
9969 95411 45451 53383 65409 95038 88676 117027 175114 189920 133974 101286 117760 126398
9957 126398 124809 131347 104807 69505 75373 70924 122762 128556 91065 79023 88901 75077 77314
9944 77314 64945 49193 46276 83720 56387 33293 23387 8314 10599 31463 34432 49322 77003
9931 77003 129334 147578 123395 87965 55884 77562 72042 47500 69945 121402 109006 101667
9919 101667 127266 187340 159028 89172 45148 60781 59444 106777 110355 93943 -18509 -75021
9907 -75021 -46382 4754 112486 190749 176413 93713 13327 6092 64654 56590 98017 117131
9895 117131 81087 78014 138911 211364 237435 249204 219919 204623 207493 185626 199869 207871
9883 207871 204886 150515 62979 77410 134771 160478 197056 217476 223933 243288 273213 319974
9871 319974 295666 223703 228524 257530 174329 138191 109907 125535 141053 193993 221220 192332
9859 192332 179190 205052 226740 173342 141157 134297 126197 159855 149131 80509 102845 100147
9847 100147 89825 117942 211035 240651 202173 196077 186607 167161 202953 249364 162331 127942
9835 127942 143018 77946 72998 97683 145892 208929 224746 290867 296553 252505 282309 369873
9823 369873 386265 307861 344376 363676 342367 337479 241139 228697 255592 288314 267235 209850
9811 209850 214082 244269 294808 290426 207870 177106 144529 173043 273855 321297 305071 262966
9799 262966 236631 188358 159839 157343 163348 248211 256446 198110 200358 148787 126048 131237 146748
9786 146748 145317 140358 176863 224225 230128 171999 121128 109939 170573 238988 266304 274825
9774 274825 278822 304770 230168 240141 258639 197433 173320 168222 155555 128493 99686 75574
9762 75574 108291 125652 118909 176451 170046 205943 264828 251172 182601 205595 205834 229907 175633
9749 175633 149194 145372 162578 153723 114161 120383 146973 162486 139073 101976 71897 105884
9737 105884 159893 158764 152440 179008 180786 176743 96891 88998 86822 92828 87257 154219 171789
9724 171789 180783 237057 263956 234589 236704 246630 201734 142600 119103 124319 160992 140393
9712 140393 157464 174457 224775 185752 155590 155972 142945 123909 144262 142197 189792 195663
9700 195663 191414 171986 184048 187682 141355 113395 137286 112142 108699 121481 115356 127884
9688 127884 172728 173339 168482 162333 142362 190829 121673 84140 101987 112094 120605 139566 99463
9675 99463 94663 97025 94716 85707 100856 86043 43627 70779 126689 207346 253307 261968 257766
9662 257766 269212 267067 194513 150840 165127 165988 194844 200963 202823 130726 103224 159483 219750
9649 219750 201314 153497 145528 190118 210217 211441 192601 162591 144486 172964 244188 269150
9637 269150 233574 196872 172075 101592 64369 67824 88559 94634 107351 117495 155142 191280
9625 191280 184173 189773 153629 163567 117609 66752 76885 145291 114482 103532 177538 226943
9613 226943 211509 188924 90118 53618 60757 70831 85390 115735 170285 160243 134408 114927
9601 114927 132770 212213 172724 155212 136000 143878 154051 140556 116258 104775 65764 79645
9589 79645 114969 133339 111385 91208 104921 107995 63508 28766 114243 141878 69346 -3686
9577 -3686 4489 42114 60675 77219 24110 -26265 9354 25970 22595 53219 78869 13539
9565 13539 -37019 -44003 -43203 -23333 -6629 61264 78040 84328 143631 96245 35044 113364 153313
9552 153313 93576 2968 -25184 36808 31511 36547 69163 80788 57576 -15659 -31780 -1483
9540 -1483 -23200 19587 72925 110396 115945 148283 159823 148382 93122 73361 54440 44727
9528 44727 31758 68662 104303 130044 119104 86170 105758 162557 181271 165475 119874 66480
9516 66480 84233 100922 85151 99546 120169 113122 83175 45349 56659 112858 87249 53645
9504 53645 84982 63061 67400 109579 122570 136748 86025 64930 148368 226745 180097 144897
9492 144897 122396 95085 65258 65166 78498 53988 67251 103506 101574 40030 37657 34350 85718
9479 85718 120365 56722 116977 133604 149030 163005 65584 5856 -49445 -105268 -16688 57156
9467 57156 144508 79898 33292 -13174 -14993 74937 164733 176273 98336 62193 40754 40835 -22279
9454 -22279 11141 -6428 -7229 61288 66882 74888 110181 85583 47811 -35484 -56670 -43696 -68064
9441 -68064 10381 63826 18338 -69204 -31449 46268 56560 75038 106148 130567 129733 138077
9429 138077 79158 56032 -11918 -90342 -38502 95900 111894 62950 111628 173300 158656
9418 158656 47916 27091 -492 4121 78802 81306 50047 52153 79994 74810 69253 62002 49097
9405 49097 51596 92305 81441 64999 32713 40253 62925 54599 107156 142343 213502 179755
9393 179755 127068 84858 63423 42449 73468 82005 43549 7776 35293 42427 81780 81060
9381 81060 105682 54281 37276 19818 14391 18666 22856 79943 65057 57218 91177 73719 57053
9368 57053 101082 112841 120492 165181 183392 120151 100932 109694 118891 122114 115935 102069 175249
9355 175249 146600 176032 224400 174913 114750 102191 171878 222731 260383 200661 132713 91604
9343 91604 135989 224306 214350 195517 133683 137879 185347 217197 206507 277172 326737 333911
9331 333911 318717 266102 273466 282882 213674 198473 241093 220635 199554 182730 137049 162579
9319 162579 199212 147919 132204 155581 177213 170331 194363 199980 258294 269217 230823 232384
9307 232384 186956 185872 176767 170451 183340 222841 237573 226110 164397 116870 110672 130798
9295 130798 126144 148521 177099 184891 194393 204281 283889 328239 330175 290892 288333 229465 242287
9282 242287 227267 180215 166991 227155 295106 295623 331150 341419 344168 396498 444128 434344
9270 434344 407071 314563 271129 261174 260752 271805 245562 222338 244974 270794 308286 313513
9258 313513 279820 298106 368372 344904 287629 261000 253854 266720 230433 207906 221067 274513
9246 274513 309924 351696 358439 348240 382213 399704 381412 361435 285128 261736 269122 306121
9234 306121 408179 448606 410524 367904 337247 323567 371513 389262 378899 385085 412190 449490
9222 449490 439172 398745 388738 407018 395392 346173 300977 342644 368216 328650 346933 340580
9210 340580 382398 393307 373393 344123 353138 336917 310703 328564 326296 291522 257121 236740
9198 236740 233338 248457 354623 437715 416437 350185 334588 401310 368753 304722 290344 305102
9186 305102 391348 440233 422716 483303 517144 451824 433307 401933 350918 404881 458644 425829
9174 425829 418116 432922 484271 500259 496844 490263 503355 503492 549417 525821 508302 499071 533410
9161 533410 576301 604893 559713 572729 537022 483482 516932 644947 677273 660404 648910
9150 648910 660842 636498 743137 801161 842077 876882 856098 821207 841824 870877 923098
9139 923098 952551 1006764 1037339 1122929 1208996 1249034 1244251 1323968 1425603 1511582 1557906 1595858
9127 1595858 1658312 1829579 1993037 2155224 2393929 2633476 2856214 3087061 3408102 3867480
9117 3867480 4403230 5095072 5932820 6917383 8183328 9856448 12018175 14892023 18448226
9108 18448226 22634101 26866574 30067012 31129696 29494714 26023513 21958347 18295705
9100 18295705 15374353 13169704 11362789 9955983 8861521 7965265 7190086 6539982 6071272
9091 6071272 5661376 5295483 4939067 4650243 4388821 4160247 3984649 3854934 3682836 3463397
9081 3463397 3318709 3235499 3084046 2948302 2859335 2815710 2745931 2657899 2590893 2552447 2469333
9070 2469333 2440430 2423197 2445472 2372655 2301476 2344358 2270838 2215955 2189387 2115791 2008433
9059 2008433 1969451 1989765 1960569 1902275 1894495 1810023 1809576 1809870 1789652 1725849 1674362 1685072
9047 1685072 1670817 1579706 1496760 1440149 1390300 1317176 1291163 1223787 1186940 1220788 1278103
9036 1278103 1184829 1111647 1147023 1150598 1172920 1212464 1157366 1092641 1128088 1167222 1167853 1194457
9024 1194457 1262367 1254749 1230033 1255576 1176500 1188904 1210848 1239740 1178474 1110670 1058138 1020668
$$ [...]
##END NTUPLES=NMR SPECTRUM
##END=
