##TITLE=Analysis number 314283
Compound Code cc 02012
Project Code qc-cat
Chemist Name cuschem
##JCAMPDX= 6.0         $$ Bruker NMR JCAMP-DX V2.0
##DATA TYPE= NMR SPECTRUM
##DATA CLASS= NTUPLES
##ORIGIN= Bruker BioSpin GmbH
##OWNER= NMR
$$ XWIN-NMR		Version 3.5
$$ Wed Oct 12 11:10:13 2005 GMT Daylight Time (UT+1h)  MAYBRIDGE\NMR@NMR_250MHZ
##.OBSERVE FREQUENCY= 250.131544655141
##.OBSERVE NUCLEUS= ^1H
##.ACQUISITION MODE= SIMULTANEOUS (DQD)
##.ACQUISITION SCHEME= undefined
##.AVERAGES= 16
##.DIGITISER RES= 18
##SPECTROMETER/DATA SYSTEM= dpx250
##.PULSE SEQUENCE= zg30
##.SOLVENT NAME= DMSO
##.SHIFT REFERENCE= (INTERNAL, DMSO, 0, 16.522)
##AUDIT TRAIL= $$ (NUMBER, WHEN, WHO, WHERE, WHAT)
$$ ##TITLE= Audit trail, XWIN-NMR		Version 3.5
$$ ##JCAMPDX= 5.01
$$ ##ORIGIN= Bruker BioSpin GmbH
$$ ##OWNER= NMR
$$ C:\u/data/dgb/nmr/ADRS/10730/pdata/1/auditp.txt
$$ ##AUDIT TRAIL=  $$ (NUMBER, WHEN, WHO, WHERE, WHAT)
(   1,<2005-10-12 11:09:54.14 +100>,<MAYBRIDGE\NMR>,<NMR_250MHZ>,
      <created by zg, POWCHK disabled, PULCHK disabled
       configuration hash MD5:
       62 19 C7 07 E1 42 D1 B7 37 6C 3D D0 77 39 F9 E6
       data hash MD5: 64K
       26 10 FC 0D EF 71 A1 F3 7A B9 F8 CC FA 80 F2 E6>)
(   2,<2005-10-12 11:10:05.16 +100>,<MAYBRIDGE\NMR>,<NMR_250MHZ>,
      <Start of raw data processing
       ef LB = 0.3 FT_mod = 6 PKNL = 1 SI = 32K 
       data hash MD5: 32K
       38 9A BE 6A BD E3 70 FC 99 D9 9C B0 32 A3 35 4C>)
(   3,<2005-10-12 11:10:07.49 +100>,<MAYBRIDGE\NMR>,<NMR_250MHZ>,
      <apk 
       data hash MD5: 32K
       D8 F4 DE B5 04 82 BA AD 76 01 AF A1 E3 E5 46 70>)
(   4,<2005-10-12 11:10:08.19 +100>,<MAYBRIDGE\NMR>,<NMR_250MHZ>,
      <abs ABSG = 5 
       data hash MD5: 32K
       D0 5B F4 0E 98 07 3C 42 FB 50 15 82 E4 C1 4C 4F>)
$$ ##END=
$$ 
$$ hash MD5
$$ 40 03 F4 ED AE 31 79 33 D9 5D E7 39 BE 72 BA BC
##$RELAX= 
##$RELAX= 
##$RELAX= 
##$RELAX= 
##$RELAX= 
##$RELAX= 
##$RELAX= 
$$ Bruker specific parameters
$$ --------------------------
##$DU= <C:\u>
##$EXPNO= 10730
##$NAME= <ADRS>
##$PROCNO= 1
##$TYPE= <nmr>
##$USER= <dgb>
##$AMP= (0..31)
100 100 100 100 100 100 100 100 100 100 100 100 100 100 100 100 100 100 
100 100 100 100 100 100 100 100 100 100 100 100 100 100 
##$AQSEQ= 0
##$AQ_mod= 3
##$AUNM= <au_zg>
##$AUTOPOS= <8 >
##$BF1= 250.13
##$BF2= 250.13
##$BF3= 250.13
##$BF4= 250.13
##$BF5= 500.13
##$BF6= 500.13
##$BF7= 500.13
##$BF8= 500.13
##$BYTORDA= 1
##$CFDGTYP= 0
##$CFRGTYP= 5
##$CHEMSTR= <none>
##$CNST= (0..31)
1 1 145 1 1 1 1 1 1 1 1 1 1 1 1 1 1 1 1 1 1 1 1 1 1 1 1 1 1 1 1 1 
##$CPDPRG= <>
##$CPDPRG1= <>
##$CPDPRG2= <>
##$CPDPRG3= <>
##$CPDPRG4= <mlev>
##$CPDPRG5= <mlev>
##$CPDPRG6= <mlev>
##$CPDPRG7= <mlev>
##$CPDPRG8= <mlev>
##$CPDPRGB= <>
##$CPDPRGT= <>
##$D= (0..31)
0 1 0 0 0 0 0 0 0 0.06 0 0 0 0 0 0 0.0002 0 0 0 0 0 0 0 0 0 0 0 0 0 0 
0 
##$DATE= 1129111793
##$DBL= (0..7)
120 120 120 120 120 120 120 120 
##$DBP= (0..7)
150 150 150 150 150 150 150 150 
##$DBP07= 0
##$DBPNAM0= <>
##$DBPNAM1= <>
##$DBPNAM2= <>
$$ [...]
##$SUBNAM7= <"">
##$SUBNAM8= <"">
##$SUBNAM9= <"">
##$SW= 20.6930455092707
##$SWIBOX= (0..15)
0 0 3 0 0 0 0 0 0 0 0 0 0 0 0 0 
##$SW_h= 5175.983436853
##$TD= 65536
##$TD0= 1
##$TE= 294.16
##$TE2= 300
##$TE3= 300
##$TEG= 300
##$TL= (0..7)
0 120 120 120 120 120 120 120 
##$TP= (0..7)
150 150 150 150 150 150 150 150 
##$TP07= 0
##$TPNAME0= <>
##$TPNAME1= <>
##$TPNAME2= <>
##$TPNAME3= <>
##$TPNAME4= <>
##$TPNAME5= <>
##$TPNAME6= <>
##$TPNAME7= <>
##$TPOAL= (0..7)
0.5 0.5 0.5 0.5 0.5 0.5 0.5 0.5 
##$TPOFFS= (0..7)
0 0 0 0 0 0 0 0 
##$TUNHIN= 0
##$TUNHOUT= 0
##$TUNXOUT= 0
##$USERA1= <user>
##$USERA2= <user>
##$USERA3= <user>
##$USERA4= <user>
##$USERA5= <user>
##$V9= 5
##$VALIST= <valist>
##$VCLIST= <CCCCCCCCCCCCCCC>
##$VD= 0
##$VDLIST= <DDDDDDDDDDDDDDD>
##$VPLIST= <PPPPPPPPPPPPPPP>
##$VTLIST= <TTTTTTTTTTTTTTT>
##$WBST= 1024
##$WBSW= 4
##$XGAIN= (0..3)
0 0 0 0 
##$XL= 0
##$YL= 0
##$YMAX_a= 354448
##$YMIN_a= -291010
##$ZGOPTNS= <>
##$ZL1= 120
##$ZL2= 120
##$ZL3= 120
##$ZL4= 120
##$ABSF1= 16.522
##$ABSF2= -4.171173
##$ABSG= 5
##$ABSL= 3
##$ALPHA= 0
##$AQORDER= 0
##$ASSFAC= 0
##$ASSFACI= 0
##$ASSFACX= 0
##$ASSWID= 0
##$AUNMP= <proc_1d>
##$AZFE= 0.1
##$AZFW= 0.1
##$BCFW= 0
##$BC_mod= 0
##$BYTORDP= 0
##$COROFFS= 0
##$CY= 12.5
##$DATMOD= 1
##$DC= 0
##$DFILT= <>
##$DTYPP= 0
##$F1P= 14.0000005364418
##$F2P= -0.99999901652339
##$FCOR= 0.5
##$FTSIZE= 32768
##$FT_mod= 6
##$GAMMA= 0
##$GB= 0
##$INTBC= 1
##$INTSCL= 1
##$ISEN= 128
##$LB= 0.3
##$LEV0= 0
##$LPBIN= 0
##$MAXI= 10000
##$MC2= 0
##$MEAN= 0
##$ME_mod= 0
##$MI= 0
##$NCOEF= 0
##$NC_proc= -5
##$NLEV= 6
##$NOISF1= 0
##$NOISF2= 0
##$NSP= 0
##$NTH_PI= 0
##$NZP= 0
##$OFFSET= 16.522
##$PC= 1
##$PHC0= -89.08122
##$PHC1= 28.9997
##$PH_mod= 1
##$PKNL= yes
##$PPARMOD= 0
##$PSCAL= 4
##$PSIGN= 0
##$REVERSE= no
##$SF= 250.13
##$SI= 32768
##$SIGF1= 0
##$SIGF2= 0
##$SINO= 400
##$SIOLD= 32768
##$SREGLST= <1H.DMSO>
##$SSB= 0
##$STSI= 32768
##$STSR= 0
##$SW_p= 5175.98343685301
##$SYMM= 0
##$S_DEV= 0
##$TDeff= 65536
##$TDoff= 0
##$TI= <Analysis number 999999
Compound Code 99
Book Reference 9
Project Code 9>
##$TILT= no
##$TM1= 0
##$TM2= 0
##$TOPLEV= 0
##$USERP1= <user>
##$USERP2= <user>
##$USERP3= <user>
##$USERP4= <user>
##$USERP5= <user>
##$WDW= 1
##$XDIM= 32768
##$YMAX_p= 410874443
##$YMIN_p= -953141
$$ End of Bruker specific parameters
$$ ---------------------------------
##NTUPLES= NMR SPECTRUM
##VAR_NAME=  FREQUENCY,     SPECTRUM/REAL,   SPECTRUM/IMAG
##SYMBOL=    X,             R,               I
##VAR_TYPE=  INDEPENDENT,   DEPENDENT,       DEPENDENT
##VAR_FORM=  AFFN,          ASDF,            ASDF
##VAR_DIM=   32768,         32768,           32768
##UNITS=     HZ,            ARBITRARY UNITS, ARBITRARY UNITS
##FACTOR=    0.157963299565203, 1,           1
##FIRST=     4132.6476996994, 0,             0
##LAST=      -1043.33573715361, 0,           0
##MIN=       -1043.33573715361, -953141,     0
##MAX=       4132.6476996994, 410874443,     0
$$ Real data points
##PAGE= N=1
##DATA TABLE= (X++(R..R)), XYDATA
$$ [...]
28756 88990 53646 85474 114391 53793 -13165 4385 -21273 -96935 -66629 -53751 -60080 -4401
28744 -4401 15016 -18905 -46767 -36335 -11105 43363 58446 30142 315 -13707 -16919 -20808
28732 -20808 -52828 -11318 3523 -31993 -56896 -63407 -26213 -18998 -31370 -56632 -17615 -34142
28720 -34142 -78720 -73874 -68845 -49591 -6132 53458 76930 81347 75438 61827 72885 45139
28708 45139 1828 -31088 -28192 8744 20492 56268 113415 116107 8311 -76238 -96461 -42278
28696 -42278 -63343 -47126 1551 5839 -2418 2717 -54302 -63799 -40849 -30174 -72100 -89074
28684 -89074 -114270 -134642 -85053 -10616 -7563 -28043 -28038 -661 7566 -19102 -58237 -60249 -4081
28671 -4081 10982 13384 77552 28147 15654 32536 27990 1584 11147 55205 63267 38688 35210
28658 35210 42464 35865 -624 -16084 -13846 -21111 -5713 6548 -338 31910 1876 11589 6874
28645 6874 28752 13129 -20140 18703 60119 -3046 -16878 6105 12642 11612 61436 77589
28633 77589 46755 63706 51550 45519 33756 57558 4244 -19661 -14792 -10600 15626 23821
28621 23821 3379 -47031 -50411 -15776 40239 63101 69004 53082 -516 -17438 2730 7471
28609 7471 52974 65800 37857 34746 26117 15129 -6410 -8438 29852 57138 21160 21567 48308
28596 48308 63855 34261 11552 58041 90200 41406 -44777 -66741 -49194 -67250 -96651 -98152
28584 -98152 -48859 -3691 51188 44617 66160 109113 82218 63670 15389 -11331 -7225 -17127
28572 -17127 11174 -3568 15663 26705 36392 35501 7669 -23388 -49436 -109049 -92981 -54251
28560 -54251 -86714 -61709 -38557 -21218 4590 44293 81161 85548 62223 164 -53949 -25658
28548 -25658 42189 40214 -18234 -45967 -55538 -32554 -1692 -8186 -50351 -42157 -11706 -23834
28536 -23834 -51950 -32363 -58414 6619 38532 26459 -17277 -41583 -44606 -38310 -43213 -73446
28524 -73446 -62774 -61665 -27547 38204 34339 39613 20521 25283 18011 8684 -10169 -21016 73797
28511 73797 55042 38948 36814 23418 35529 17202 -38628 -60989 -76799 -50927 -8451 5123
28499 5123 -70534 -132874 -119524 -114138 -124582 -116294 -70656 -48691 -20639 50707 13493 -78267
28487 -78267 -69645 -62614 7778 40747 37962 10230 -12854 21020 23247 -4149 13849 4197 -4601
28474 -4601 3084 27582 23321 -5468 -51326 -58832 -16312 20219 39794 30099 -24753 -4932 54593
28461 54593 59809 18997 -29513 -39437 -32763 -26742 -11655 -42752 -32414 -8745 -10026 50739 55630
28448 55630 -51188 -102073 -77255 -9610 43960 45357 90134 83693 40541 -65889 -96851 -119790
28436 -119790 -119631 -15093 38788 81946 85095 62345 56235 19572 -52489 -64582 -6412 13958
28424 13958 21675 32287 46781 46512 -20111 -44269 -74482 -44577 -41309 -40984 -20522 -24950 -45895
28411 -45895 -14698 -36825 -3856 2208 8128 13921 10168 -13129 28134 21625 13747 21631 61558
28398 61558 62242 6633 -16189 10500 15051 27933 59101 94282 113137 93823 88000 100446
28386 100446 78922 69326 80881 85706 35227 35028 30481 14 8258 2210 4571 11050 -30247
28373 -30247 -62992 -34222 -28664 -19016 -22400 11303 8503 30936 12920 -17592 -42765 8016
28361 8016 10077 6970 26192 9027 -35733 -16511 -11253 40873 47922 32290 10797 699 19006
28348 19006 70107 86704 56076 198 7938 64886 44981 18746 14690 -16516 -33560 -18684
28336 -18684 -35378 -29845 -6934 18922 14826 29873 -5903 -13422 11995 -1443 -1276 29668 80445
28323 80445 114423 90986 43447 -955 -30852 -32532 -25512 -90761 -101801 -59793 -78276 -61947
28311 -61947 -55316 -63737 -92916 -127563 -124017 -32792 -7163 -4493 33899 61908 52084 31453 -12201
28298 -12201 -17291 42428 7457 35601 51514 78523 71994 18199 20224 29540 45324 65438
28286 65438 92272 114684 87098 18670 -17146 38929 56819 15663 -13148 42848 57305 32444
28274 32444 43666 36700 -385 48680 55950 -15890 -10380 -11903 -28673 -51669 -50575 -16748 -15582
28261 -15582 -23389 -56737 -92979 -67889 -8622 -31341 -51914 -73873 -64885 -43482 28121 20375
28249 20375 -7950 -20664 -17418 -1994 2532 -14119 -28732 -39212 -40388 -41794 -73391 -64308 -82670
28236 -82670 -89664 -25889 13093 19622 -1991 32665 57386 48989 8931 -18152 66248 151161
28224 151161 118087 84343 62276 78608 82152 98354 129149 84928 77876 71009 32173 -6332
28212 -6332 34589 84882 60225 4988 14739 38853 55112 35051 71203 110080 98608 89481
28200 89481 100754 82498 68477 95455 130533 99996 61290 34332 45202 80340 35508 -40877
28188 -40877 -37755 6651 32122 51307 65055 42323 46411 54418 12051 7200 12393 13746 12750
28175 12750 2862 4328 -45993 -10956 25607 9752 -4103 12890 7784 -5477 -39467 -48995
28163 -48995 -71254 -28419 9265 14800 432 35334 93979 112961 136873 71041 60784 73864
28151 73864 63382 66143 78340 57096 14686 38642 81984 84015 39509 67845 84080 33618
28139 33618 25520 3513 -688 15693 36234 31182 -20378 -50264 -29260 -18082 -623 6867
28127 6867 59316 62525 82271 101128 59241 -848 -67100 -90091 -97412 -40001 25504 32942
28115 32942 43330 19235 41068 69152 68878 64486 68720 37940 -9072 -68763 -65043 -16855 8244
28102 8244 -8032 -9130 -26491 -35920 -25586 -40694 -51798 -58119 -54375 -50831 -18505 -21975 -33401
28089 -33401 -68289 -64257 -39111 -39446 12369 51286 24726 17349 44983 70371 68730 92930 81044
28076 81044 83024 75240 72452 25909 31294 -1709 4875 49135 6076 -26220 -11556 38579 51431
28063 51431 101419 68757 -10340 -13053 32623 64526 53729 15065 19054 52255 66866 77734
28051 77734 74189 18582 -5358 4704 7304 7899 17820 9505 27438 39022 30827 35325 31036
28038 31036 11845 -2219 40429 4534 6390 33829 59444 84668 86063 76405 18716 -5089
28026 -5089 -9105 -15259 -20374 6155 5278 -59821 -60664 -1859 61301 40316 24711 -9610 -32244
28013 -32244 -25337 -44475 2076 -7236 -28861 2530 21719 12260 -38189 -57739 -65430 5072
28001 5072 29339 -24657 -20770 -12848 -7900 23040 44088 12154 -50572 -107834 -145081 -103498
27989 -103498 -45050 -13381 32556 27444 71874 35853 51307 43436 13128 -43488 -8813 -9560
27977 -9560 -115288 -118541 -64374 -47448 -15430 8941 18196 -8057 -1977 -19734 6161 25174
27965 25174 -5038 -29250 12387 39238 16914 5858 -16423 -15858 -826 7996 -23386 -5216
27953 -5216 51816 82302 83223 23819 36938 100116 93116 27774 -20031 -73355 -66780 -57043 13053
27940 13053 60929 76254 80084 126203 144576 107598 40384 3556 44205 -15558 -107180 -86826
27928 -86826 -55271 -71615 -84579 -37187 -32611 25000 99667 67712 33687 24890 9895 43055
27916 43055 73724 81062 34464 42425 83460 50316 50488 -27163 -48381 -47793 -29743 7601 -18004
27903 -18004 -49771 -77585 -50842 -2071 46696 37012 55905 71496 -12953 -20891 69035 78585
27891 78585 47772 8327 -22065 -94447 -60454 -53157 -94787 -38801 -39614 -85079 -47389 675
27879 675 13811 42951 25014 3542 34493 18358 22993 60699 62841 40240 20514 2769
27867 2769 -8138 4483 2319 40831 -10155 8061 -26990 -12389 33219 67337 58399 14337
27855 14337 23595 6916 -39134 -27522 -2803 -16784 -5514 32732 54573 65046 128388 144989
27843 144989 40062 -3160 7668 -10835 54462 34799 -27436 -37924 -42954 8319 73853
27832 73853 57978 83880 90248 59853 50189 96813 52676 57250 80003 46843 -29199 -38392
27820 -38392 5680 1559 -11836 15786 -6305 -17535 779 30660 -5723 -34893 -52515 -37467
27808 -37467 -43876 -23267 -8052 -29765 -38234 -23378 -34461 -51903 -56671 -73411 -37852 -69803
27796 -69803 -98768 -78045 -40900 -51823 -57188 -36291 -50961 -80780 -12285 41094 33758 -21052
27784 -21052 -42184 -80264 -73259 -949 -5748 -30758 -38741 -4769 57695 65777 34236 78144
27772 78144 63783 52081 34154 34276 55616 49773 58315 20639 35389 15056 1259 7370 -12847
27759 -12847 -15602 2267 -40053 -49861 -96297 -53425 -54313 14670 52027 41137 10442 -6644
27747 -6644 36006 5579 -4625 -53643 -64541 -99053 -112006 -79602 -52818 -69690 -54093 -30025
27735 -30025 -16992 -69273 -103051 -75874 -84843 -97297 -75747 -65574 -89064 -84162 -14204 26704
27723 26704 -17441 11213 26451 32472 30868 18442 -17275 4437 11083 28802 23146 55647
27711 55647 44180 -4358 -20764 -15376 -64298 -100066 -65762 26844 36644 73713 49584 16299
27699 16299 4625 -32172 -39710 -70114 -41190 8324 3045 -98548 -101736 -34885 24370 -24987
27687 -24987 -37849 -2880 -8195 -42202 -42012 -7821 13052 23564 18984 47892 63870 54240 6154
27674 6154 7023 27138 22142 31152 -477 -30659 -28285 -40848 -43724 -22296 -31563 12763 1715
27661 1715 -83 39061 40476 105565 121405 39169 -57529 -90111 -28012 -31329 -60455 11427
27649 11427 72530 75090 24953 49957 49129 33840 77459 68327 25359 23370 1287 27732 54787
27636 54787 30772 12344 -7850 -33402 3837 -881 -24178 -32264 -80227 -54076 -17085 -29631
27624 -29631 -6899 -17530 15390 -12812 -94687 -37347 -48854 -63860 -85004 -66555 5721 4710
27612 4710 27205 46906 14445 -40919 -45313 4192 47482 32106 9074 -82333 -77986 -80609
27600 -80609 -77201 -73457 -43858 -32145 -46660 -71774 -37240 1488 -2871 41369 40887 57172 77819
27587 77819 5235 -7512 -13037 -11614 39837 26088 13271 57855 60747 20333 -37637 -55090
27575 -55090 -96431 -99127 -75090 -19456 258 33009 45573 69884 77752 93246 27437 -43259
27563 -43259 -7419 20060 38788 80778 75162 45216 56061 11713 -61015 -46980 -15472 62638
27551 62638 57974 5249 -26745 -10932 -20187 -57684 -37643 -22824 42654 66412 30804 33250
27539 33250 45314 -3431 -18290 -13034 -36634 -25618 -22863 -9344 -12429 11616 26830 8303
27527 8303 352 65520 97320 122393 106595 69370 53770 74320 60372 39465 -21968 -11136
27515 -11136 -14121 -42901 -31529 -33557 -27381 -2304 -22904 -46688 -31143 3455 41044 24464
27503 24464 35438 22891 20789 -13843 -801 -19348 -8827 -26185 -14590 3508 40762 82945
27491 82945 79065 65740 -8016 -1648 -7566 -8589 -19497 34675 60409 32990 46967 41326 21634
27478 21634 8857 35164 51151 53669 47268 50345 17314 32301 77167 -9940 -55210 -58080
27466 -58080 2108 29996 86695 69698 39726 13265 3104 1129 -9330 10856 31232 30709
27454 30709 14581 9591 4419 -9171 -1285 1979 20291 -22602 -52777 -682 -44923 -47446 29318
27441 29318 38081 13557 -13832 -7341 -17209 -66126 -92531 -88122 -58505 -51920 -41088 -17606 -29458
27428 -29458 -8883 -16938 -14932 -16561 21802 60000 50949 26513 -21758 -15268 20996 65882 79011
27415 79011 17639 -36090 18220 2173 -10682 -26939 -21653 -23994 -47424 -42371 -37970 16089
27403 16089 32002 40207 20189 17692 40575 40446 10149 13588 27821 62938 42492 2145 2783
27390 2783 -20927 11240 9229 10784 -10709 -41045 -31982 -81921 -28236 23926 64225 49839
27378 49839 76896 59634 56455 57252 48512 40165 16699 36996 96087 136551 155786 99898 38769
27365 38769 37338 77431 28497 -19837 -26934 -15169 -69937 -106948 -35896 -8486 -28419 1887
27353 1887 -15076 -49286 -35993 -42502 -71774 -80484 -31441 -63556 -76649 -3565 41412 18265
27341 18265 11917 -19075 -993 36970 46169 -20432 -34922 11086 35678 14471 11706 16123
27329 16123 27827 75795 76864 57753 19980 -50957 -76449 -45437 -9402 -2393 -675 14816
27317 14816 36208 45839 7532 7327 -34502 -43639 17212 55727 10509 27326 21555 -54579 -33099
27304 -33099 -13689 -4883 -208 40589 32989 -11058 -60602 -29308 19402 -11718 12455 -11382
27292 -11382 41687 40562 26274 3559 -23009 -12085 31003 -14501 -9214 51787 58717 49223
27280 49223 20272 50090 16553 -3180 -45550 -46152 -17902 9440 100147 117123 59936 38105
27268 38105 48536 70875 35157 -23623 -35702 -42730 -44843 -50554 -21615 -26703 -31491 -2512 -34210
27255 -34210 -29849 -42242 -27858 -29898 -32736 -50232 -20044 32395 9013 10835 3183 -5913 -8817
27242 -8817 9706 9090 -14343 4174 83143 24064 -40039 -43591 -3402 -13625 4352 -14651
27230 -14651 3777 54812 104943 96549 60255 47247 37393 7074 12725 17533 23895 79019 85841
27217 85841 38993 -1375 -39047 -15193 52051 36402 -31773 -30025 4986 26190 -23169 -65922
27205 -65922 -73151 -30191 16678 10371 -12203 -45374 -49624 -35587 35236 16309 -47011 -31628
27193 -31628 -24022 -24215 -36433 -3667 11698 24038 28018 973 -2080 -67271 -69291 1948 51969
27180 51969 41489 63533 110370 106065 105166 87626 44402 -1742 2712 -8956 -18651 -38614 -27079
27167 -27079 -14483 -7468 18407 63640 52912 23517 -7738 -3673 2360 -3363 -48330 -87669
27155 -87669 10983 28422 1031 -40788 -71992 -30254 -31717 9406 33934 30948 36684 51871
27143 51871 114741 107242 46426 19972 1063 -1732 -31009 -11594 -24131 -47960 -56902 -50462
27131 -50462 -18771 -15978 -59311 -50375 -15097 40513 -20635 -26968 -12598 -34913 -48093 -45756
27119 -45756 -62255 -79974 -83192 -79779 -1327 44631 33037 15704 -14678 -43887 -45737 -51285
27107 -51285 -19298 2424 -24753 -47311 -48777 -44800 -39507 -40679 20098 94128 36374 27902 19567
27094 19567 -12372 -15930 -17323 10188 30577 4285 -27623 -41504 -66331 -42947 -51081 -55478
27082 -55478 -47363 17006 31421 8936 -1734 -13346 17181 -6921 -55817 -53998 11870 14127
27070 14127 -18980 -46800 -91437 -10582 61845 -25643 -26361 -64029 -34906 -30856 -37553 -36220 -61396
27057 -61396 -53858 -24831 -26416 -32573 -18746 31362 54168 43105 44376 60861 28949 9966
27045 9966 -16807 -21358 -48932 -21507 9544 -5774 28854 13651 19386 4597 15916 60265
27033 60265 53313 83530 82286 -12321 7592 12828 18365 33669 -19306 -48824 -3523 19305
27021 19305 -6273 41407 20552 11270 9088 33969 31813 11653 42894 52623 24650 -7924
27009 -7924 -45127 -101439 -99942 -102325 -69297 -19950 22847 -15364 -42098 -33622 -13903 1454
26997 1454 -15318 -71332 -68535 -52693 -15954 35417 91079 70249 5195 -65200 -39883 40456
26985 40456 70021 31834 8277 14729 19941 -20566 -12942 -32194 -50510 -35903 -20326 5051
26973 5051 -1728 -58246 -71409 -53926 -73563 -36793 13528 -24144 -55449 -41566 -14677 -22010
26961 -22010 -14207 630 -40805 -42511 -22731 9293 14255 32107 78453 85442 43020 -25680
26949 -25680 -71706 -68056 -26631 -71316 -95958 -72185 -99723 -84275 -37066 -77183 -63855 -36348
26937 -36348 -18376 -71264 -102879 -113089 -89241 -5504 43347 31563 68075 75020 8234 -26377
26925 -26377 -56885 -80799 -60212 -21597 -16572 -26503 11637 49005 61435 31135 31525 -23848
26913 -23848 -105328 -69901 -57596 -59021 -10872 30354 62941 89821 60218 51913 39687 11731
26901 11731 45457 69081 111856 139152 95006 117891 121949 79357 72239 39455 47756 39740
26889 39740 46472 8873 -28179 -48881 -47032 3068 22992 -37449 -67051 -12829 20487 362
26877 362 -27373 -36487 -61405 -44986 -30736 -34491 -60676 -11852 23560 9452 37797 60696
26865 60696 64302 60478 56666 25766 35356 42379 41717 21352 17263 30085 -10416 -39055 4025
26852 4025 35268 -21514 5003 60813 69963 41731 -10991 -43197 -80522 -57829 -23571 -10580
26840 -10580 -22669 -35212 9999 37831 44578 57959 21820 -10397 13822 52622 78082 65734
26828 65734 31218 58980 67733 33045 22552 58084 29314 -27492 -73846 -51500 -23764 63110
26816 63110 25870 21522 22790 49448 53560 46433 19829 39950 43821 43036 7002 -3435 -23856
26803 -23856 -18766 10722 -6117 -14576 -261 38399 24112 9884 19938 20658 -34829 -48425
26791 -48425 -17298 -23740 -18420 27215 72653 51436 76650 92670 95235 128361 82057 9337
26779 9337 -27158 -165 33069 48239 49853 87658 96398 68021 17933 -63734 -36017 3319
26767 3319 -6159 1259 -10899 -32564 -58223 -28925 -10705 -19062 -20362 -10571 -26019 -20587 -24592
26754 -24592 -7452 26664 3062 -63758 -56834 -26245 -336 -37456 -56686 -25266 -26926 -33964
26742 -33964 -34824 7400 -27214 -24040 34007 13224 -61481 -117804 -96456 -57455 -56128 -61146 -42957
26729 -42957 -35883 -7489 26443 -6665 -30798 -51544 -25157 47333 31646 1861 -31535 -70349
26717 -70349 -99692 -66096 -46269 22354 55887 32602 26881 2692 -22053 -52071 -81670 -46156
26705 -46156 -17587 -69646 -62362 -35095 -22550 494 38570 -12026 -87424 -134784 -142047 -85634
26693 -85634 -65002 -61182 -68010 -101209 -70854 -21513 -22272 11824 -2330 -31382 -35594 21662 17753
26680 17753 26265 57528 14865 4810 -29196 -74530 -42614 13569 31609 -6556 -44924 -50957
26668 -50957 -76074 -36706 -6968 -14967 -34391 -87160 -74348 -84435 -126865 -113367 -74725 -28814
26656 -28814 -31085 -58324 -13683 34335 25875 10214 -5707 -8642 -3814 11010 -31744 -76180
26644 -76180 -55090 -39865 -23067 -72160 -105826 -91892 -85061 -45451 -35490 7849 -32720 -74435
26632 -74435 -70573 -95740 -89922 -31988 4670 -9473 -41256 -42472 -43423 -9484 32617 54586 39605
26619 39605 43770 20381 16586 -1975 -57373 -19412 -17171 14636 31220 -5967 -23971 -34983
26607 -34983 -57394 -13908 34714 12281 2762 13249 60750 68892 64080 57652 57371 63075 96404
26594 96404 163138 116818 92570 44608 7363 9829 39060 235 13475 25143 35933 113933
26582 113933 126814 59702 30795 7111 1842 24335 63681 58675 21443 7988 32961 18166
26570 18166 19205 71801 19947 -26597 -69689 -50807 5995 -18337 -47532 7148 38639 43519
26558 43519 -1245 -56319 -6899 -5857 -60822 4203 64356 66301 75229 63015 4871 -13703
26546 -13703 -43499 -6322 17486 -6603 -57365 -43997 -96632 -132877 -117261 -72945 -31142 27467
26534 27467 15910 -14982 -48079 -94561 -103352 -90175 -75772 -21813 31734 36224 47159 46136
26522 46136 37761 2074 -75917 -133628 -153585 -125513 -124805 -59881 -6409 2564 21730 57742
26510 57742 51576 -4480 8640 48903 14993 767 12622 33313 12696 7638 9244 1473
26498 1473 -39878 -69250 -28439 32941 28810 59164 47304 -13125 15028 63847 75047 83881
26486 83881 60935 82234 74870 -4468 -9453 -34982 -34564 20431 49414 69763 69433 36991 14133
26473 14133 50042 39175 25208 29420 23072 13149 28431 32116 -9555 -68263 -91743 -56942
26461 -56942 7336 63756 73581 58674 52181 45328 5267 -77704 -85163 -45814 17731 -2436
26449 -2436 -40796 1799 21225 -32662 -37739 8683 -5742 -9238 -52358 -61695 -58287 -44687 -30089
26436 -30089 -33044 -17454 -31864 -20198 -38648 -59073 -58052 -98811 -92549 -50119 -47442 -58579
26424 -58579 -46972 -13570 -34507 -102556 -26365 14844 -14709 -14917 16123 5280 7690 10316
26412 10316 -15049 -15825 -51277 -45661 -51569 -48708 -29831 -41056 -27379 -28391 -30978 -28786 -51266
26399 -51266 -35765 -30658 -23721 -18561 -41022 -14502 19349 23894 -1744 12981 54920 57963 61151
26386 61151 53431 87923 84545 32376 -8597 -4406 272 40458 43359 4118 -3619 -28703 -35021
26373 -35021 -87983 -125806 -92608 -68078 -41177 -6138 37080 20001 992 -18059 -23450 -35145
26361 -35145 33586 28556 -215 -39117 -14595 -13558 -74862 -64848 -92281 -87358 -62014 -27670
26349 -27670 -18726 -48895 -58446 -10110 39505 55049 31426 38425 59298 44242 -3706 -14262
26337 -14262 20956 21812 63481 76319 62476 56383 24330 -1403 -16275 -36838 -70255 -99530
26325 -99530 -55617 -2267 -18222 -47273 3992 16343 -46368 -98904 -111063 -16912 -14599 -32735
26313 -32735 9169 -7489 -59013 -57140 -45997 -58766 -77798 -86 37995 41822 35114 -11367
26301 -11367 -28242 -16806 25965 17371 -40997 -72370 -63775 -71356 -22156 -39418 -83377 -70140
26289 -70140 -30122 -31043 -11928 46003 68192 60558 -3483 -10185 -35134 -9364 -7796 -13167 -1044
26276 -1044 36814 63084 61681 69521 78918 81073 62121 39483 1327 -22077 22402 44371 37176
26263 37176 4743 -18627 -12045 -10708 -42864 -40811 21736 43913 -191 -14007 -46589 -63883
26251 -63883 -57258 -58727 -81787 -95594 -58831 -719 9568 -23723 -44147 -36511 -31532 13863
26239 13863 12483 30532 47531 74752 116740 113188 85361 60740 79295 81907 54436 30540
26227 30540 49948 91491 97519 59042 -17390 -125 40758 14644 -14245 -29104 -53100 -51848
26215 -51848 -16061 -11458 -33616 -13430 5874 40353 34687 15817 -8048 17324 33621 8745
26203 8745 -17998 -6656 1589 -20963 -18152 -17919 -2638 -91 -23040 -21169 16335 13772 16445
26190 16445 -16334 15612 64253 23474 -25079 773 14875 9897 -19268 -55438 -117898 -112275
26178 -112275 3325 52037 4594 35812 80254 59438 46811 52490 33852 -6246 -38948
26167 -38948 40494 72134 69488 10130 -3780 -12826 -5107 -15725 29301 46576 11546 47309
26155 47309 83333 95995 59461 64647 44224 29229 5901 -7096 -38371 -5225 38505 23376
26143 23376 42955 75620 36879 -12614 -24503 -1288 24915 31095 7616 86002 101357 58032
26131 58032 51580 67453 78968 51972 30981 2142 2750 17328 33682 26211 -27486 -56628
26119 -56628 3836 58836 24192 12051 -766 -3927 -21811 -52545 -27185 15657 -15450 -47161
26107 -47161 -57054 -11735 30102 56702 76950 70395 3904 -46265 -73657 6816 9528 -15167
26095 -15167 -36129 -50391 -60807 -31331 36230 62158 37113 -1683 -43558 1312 -5477 -34038
26083 -34038 -46082 4972 29658 49464 26400 19876 -8488 -1469 49354 43241 23513 16020
26071 16020 37898 43764 15502 -53370 -49623 -7762 -16947 -11033 1276 11147 -10927 -24073 -11044
26058 -11044 -3494 -39088 -11434 2729 -15383 -40140 -21325 28803 45307 29426 59375 50995
26046 50995 30296 6169 -4462 -24771 -58925 -83227 -53226 -7656 -9152 24858 17948 19103
26034 19103 -7505 13898 -28433 2399 49550 15392 74730 130348 110841 100289 62066 -31963
26022 -31963 -100584 -82988 -45916 -34727 -12850 24922 36934 35022 23968 41095 -17783 -20511
26010 -20511 -35134 -47203 -92352 -69401 -12270 17307 2411 -26763 -1365 32028 58780 79085
25998 79085 -5232 -74553 -62352 -22451 -34498 -14803 16209 14260 5663 8815 -31876 -60976
25986 -60976 -106123 -69537 -4649 10656 10033 -753 -19505 -5556 -20104 -34247 -52040 -72665
25974 -72665 -51898 887 19133 8700 -13736 -39999 -54902 -53870 -16020 -4188 -40368 -81790
25962 -81790 -100042 -92580 -113232 -138988 -119893 -83668 -59859 -8639 -12604 1586 -12480 -16975
25950 -16975 -16809 -1752 6280 -18247 -56031 -95082 -65705 13386 34574 4979 18710 5729
25938 5729 -4717 -31707 20374 57817 -7364 -29721 11351 42495 20724 -6769 -699 -11996
25926 -11996 -25082 -70622 -120696 -92007 -33345 43636 34623 7233 28171 8190 13302 46555
25914 46555 40014 -7366 -36137 -54838 -40366 -78033 -97195 -97458 -91677 -99222 -85959 -70658 -60116
25901 -60116 -110847 -114091 -53767 -3595 252 -28081 -32828 -11480 -28639 -16448 -47946 -52010
25889 -52010 -16695 28525 -7686 -85704 -70698 12717 57902 104114 72239 46420 105762 114664
25877 114664 65739 693 -3116 19268 -3910 -45412 -49978 -50990 -77163 -65696 -44522 -37823
25865 -37823 -11331 26417 4443 -20448 -9681 23603 -21855 -31333 -36754 -80615 -66046 -22716
25853 -22716 17718 22540 21461 37486 28873 22125 -3592 -11164 -12352 -20717 -17268 7043 8852
25840 8852 -47096 -75168 -38363 -16481 25213 1858 -78546 -86392 -92600 -51249 -10316 19441
25828 19441 -3547 -15826 -29483 -35297 -42065 -10740 7691 -14837 -762 11232 26488 41146
25816 41146 30801 15099 -4228 32986 8805 -43820 -82164 -45783 -5295 -55413 -45134 -6789
25804 -6789 2419 1044 15082 -23136 -57174 -62491 2334 -9013 -30112 -27525 -10285 46912 6489
25791 6489 17425 25982 -79478 -31581 20406 43353 29547 23387 48179 61088 43071 25919
25779 25919 24664 -20265 -29360 -51293 -46697 -42432 -2155 -15503 -40977 -71567 -38932 31722
25767 31722 33073 -21016 -52091 -13159 -363 -28553 -50730 -48922 -3656 26544 2146 3455
25755 3455 -24693 -93671 -111772 -57388 23463 82646 81915 90143 40989 -39710 -62469 -19660
25743 -19660 23494 38659 35595 47855 -19522 -15457 33213 41283 42682 -29635 -55061 1111
25731 1111 26371 35681 5320 -52944 -83395 -127436 -99918 -71869 -50135 -15841 -26809 -51527
25719 -51527 -48058 -52271 -25557 -6988 -5094 18492 7025 11840 -11891 -25950 14449 44451
25707 44451 65128 36239 22550 39605 26758 -42880 -57086 -24196 13068 2919 -2869 -16366
25695 -16366 -24115 -38928 9677 83929 126081 79181 25903 2642 -32563 -70295 -67784 -34120
25683 -34120 -14824 -56370 -104961 -64723 7655 -32407 -20929 15394 73619 72808 23798 44842
25671 44842 22578 -5243 -15113 3293 20183 12314 9096 -3013 -67200 -87519 -70776 -52093
25659 -52093 -38381 -7809 -18552 -53358 -60740 -20813 -24182 -655 20125 22460 69599 116447
25647 116447 168316 107974 61426 54481 23377 2496 30222 -1433 -7740 -9227 1950 -13837
25635 -13837 -17677 -45974 -20320 4894 57111 43797 -7147 -16939 -37973 -59211 -51540 -73978
25623 -73978 -56728 -17493 -23318 -43609 -37523 -15704 13083 40307 49942 28629 -8579 7960
25611 7960 -11890 -61508 -49307 -63832 -43581 -33525 -28887 -36099 -28316 -64287 -123970 -113516
25599 -113516 -104092 -45812 -39006 -18159 17468 15564 18060 19700 13965 -32103 -74621 -47239 -33783
25586 -33783 -37730 -29907 -23817 -40468 -59201 -30009 -41096 -32244 -52403 -72464 -51261 -26699
25574 -26699 16785 57349 13920 -39987 -68687 -54629 -27745 3326 -5647 -31576 -50971 -18078
25562 -18078 24061 -8013 -1851 -4926 5191 11984 -10149 1049 51300 33426 -11709 -25993
25550 -25993 -59242 -67658 -28228 15456 -2760 -35349 -3567 -25487 -19180 28540 64106 22472
25538 22472 1782 37782 65574 62462 35359 9251 1903 -3120 -35933 -59815 -70844 -83991
25526 -83991 -18522 1229 10987 38224 -9163 -67316 -66905 -5379 12304 40870 41600 -5196 -61183
25513 -61183 -82074 -87655 -38415 -15952 -10411 11616 -31623 -27988 -894 -3503 -6017 -20568 -26504
25500 -26504 40528 16662 -30955 -71969 -83748 -24082 -23416 -33614 25035 5490 33289 20766
25488 20766 31946 46167 55400 78706 67572 22199 -32529 -25063 -21846 -363 30564 8490
25476 8490 -40011 -47035 -22017 3065 8027 -4401 13710 -3662 -77823 -80532 -46551 -3784
25464 -3784 42013 40657 13042 7188 -40350 -46915 -8694 32701 5292 9009 5115 13130 -35612
25451 -35612 -38055 20549 38009 77996 80843 76985 59465 70113 52549 31871 6077 27708
25439 27708 9563 37309 59228 5344 -8458 -69735 -34094 -13089 -2441 10633 -40660 -53627
25427 -53627 -12681 -42141 -57431 -46598 -38924 -16843 42727 120222 73651 27435 27789 20119
25415 20119 35863 18715 7661 -6972 35782 32654 71097 110689 81576 39392 -14617 -41907
25403 -41907 -10900 34400 39783 -650 -35336 -9056 -33692 -41008 46275 48268 26583 22404
25391 22404 -30882 -63154 -55191 -43730 -13274 31939 76627 42690 15146 -15328 -46457 42975
25379 42975 43286 30399 1194 37835 89174 93015 25738 484 22579 48908 95885 119007
25367 119007 65697 54987 62060 83292 55936 78868 107208 88532 57552 103334 93558 37528
25355 37528 -33664 -15899 11299 4760 4412 21906 -13451 -32494 -19880 -2555 6770 9679 32722
25342 32722 68577 48938 38838 90385 113834 58059 -17493 -19952 -8133 -20804 -18549 -5322
25330 -5322 -33474 -45834 -46793 -37923 -56544 -32657 20297 -18582 25969 80369 119154 68053
25318 68053 31178 67945 52308 6881 9388 -6722 -57478 -72726 -15263 7846 9409 63788
25306 63788 132420 111376 54132 28239 25443 18784 6279 -44369 -39977 -47690 11565 52719
25294 52719 29536 20512 -15026 -24842 42571 85587 23804 -22526 -44820 -36173 5382 19453
25282 19453 28417 -7845 -10649 -6623 -2445 31361 69947 89450 82491 61521 21053 -1087 -51388
25269 -51388 -20942 15379 -4396 -59473 -22203 74857 67531 31568 12677 -21838 -36566 -47131
25257 -47131 -61309 -136531 -168187 -131399 -110353 -92947 -44023 -17791 35997 34088 -12402 -26757
25245 -26757 -21796 -7674 1858 -28371 -46685 -52502 -69003 -63120 -26651 -24237 -29158 -20479 -18146
25232 -18146 -33530 -48177 -35091 -27741 27952 48344 8311 17406 43708 80001 89924 70795
25220 70795 85585 50904 16866 -2076 -19244 24002 40890 -5032 10513 64161 40903 42851
25208 42851 78248 50590 16532 26067 74934 50394 -24053 -29199 2255 23417 20212 -26008
25196 -26008 -80392 -64020 -13382 65008 88140 26692 -61283 -49686 -41147 -68873 -35876 -7723
25184 -7723 2283 6235 -29897 -81501 -27640 -8969 -601 19432 14790 -17493 -37459 -15033
25172 -15033 -14145 -4696 20857 -14858 -18897 -40133 -19299 18013 -32081 -6257 13026 63708
25160 63708 91930 41182 62808 105030 121225 70679 14019 44873 102462 107375 58835 -3527
25148 -3527 14853 -8369 -50964 31421 99255 87597 33529 55887 62339 20324 23448 20538
25136 20538 16916 -22348 -52852 -97793 -80280 -26211 9358 -15239 981 25617 29321 25060
25124 25060 -5771 32451 62608 38381 -12893 -36597 -22808 -23356 -8243 -14260 -37655 -18237
25112 -18237 -5931 -3690 -66656 -58734 -85366 -60570 41403 92311 83207 49641 16689 -25169
25100 -25169 -30230 -42033 -45668 -27680 -23485 38746 23549 -34801 -36502 -54440 -71633 -47137
25088 -47137 240 22036 25443 -848 -43695 -113250 -110434 -123211 -96308 -58271 -43381 -25489
25076 -25489 1858 41823 45835 66590 60960 40446 -16626 -14483 -35366 -34794 -57231 -114637 -52205
25063 -52205 -8398 71216 81031 48143 31140 52141 72155 68066 40057 39032 57871 30765
25051 30765 -3679 -16780 -42845 -26267 30453 78103 86332 72876 64790 74897 86966 88058
25039 88058 58843 15271 -1494 26978 22192 -22051 -17206 -30251 -68095 -50414 -43036 -64393
25027 -64393 -129175 -119445 -28729 -6408 -8412 -11940 4919 30629 42179 24678 53614 78336
25015 78336 151666 135320 38219 -17240 83 31068 -11207 21757 66425 39529 9923 -19436
25003 -19436 10831 -11056 -43698 -90886 -153007 -131311 -60475 -13374 3152 3282 48112 36356
24991 36356 3708 -9620 -27079 -33350 -48736 -99365 -107300 -60465 10517 47425 41223 17524
24979 17524 22956 -8322 -18165 45367 11840 -33011 -9932 4464 -35840 -10037 3429 -22514
24967 -22514 -42076 -101510 -58142 -8583 -6814 -41285 -44656 20331 18151 -31832 -59824 -42955
24955 -42955 -60676 -3045 45286 53180 16584 2540 -1490 -11730 -4199 -6052 -7131 -5917 -8030
24942 -8030 10471 33120 49543 27030 11168 -13673 -9335 -10013 -43510 -67998 -44694 -963
24930 -963 -2549 41136 14820 -21813 -59263 -28399 -1786 7905 44581 21453 39462 31007 32317
24917 32317 -614 -16184 -7947 2422 21130 76886 135082 78089 51100 69026 103248 49263
24905 49263 31371 10793 4426 -31783 -39584 -37527 -49464 -65596 -68133 -71423 -82558 -60375 -66060
24892 -66060 -16066 -5673 -17810 -43039 -31427 -5439 -31011 -34371 -19534 11946 20936 -51041
24880 -51041 -45928 41856 43201 11236 2112 -31565 -27719 -44124 -23411 18002 92155 118325
24868 118325 65571 3541 -22822 6528 -25502 -56252 -36692 -26016 20706 -20364 -11109 -42740
24856 -42740 -72543 -35651 14302 61222 2151 -73845 -61815 -41375 -50768 -44189 -18704 49607
24844 49607 89176 59036 48534 9767 -103805 -104335 -53754 -53742 -61537 -50160 -18299 42728 37984
24831 37984 65921 63981 30405 56998 27211 -10773 -34097 -27384 -45444 -20808 21238 31895
24819 31895 -395 -22466 -12983 -19445 -20183 -46329 -42542 -32301 6070 -27433 -50132 -56928 -34788
24806 -34788 -54703 -62108 -103342 -119749 -58143 12770 9648 12596 18260 78929 69463 57849 75004
24793 75004 57047 3177 -43290 -53280 -51539 -44013 -46358 -35520 -10201 43166 38729 -24042 -37701
24780 -37701 -48955 -17166 17702 -12190 -8410 -36255 -95020 -91252 -72610 -59215 -35102 17073
24768 17073 38902 28660 -51990 -93858 -50138 -10985 28620 104794 54140 11047 -6606 -21005
24756 -21005 -23210 -19704 21925 6177 5355 33787 37674 2610 -36997 -73806 -80685 -77366 -50667
24743 -50667 -7148 1776 15361 -10000 9612 10530 -8245 -1898 -24834 -38333 -7632 49399
24731 49399 22221 23002 6667 11716 -9344 -4993 33737 15046 12874 20099 31389 24716 11872
24718 11872 -7310 19259 146 -39142 -16815 24628 4407 -31002 -8639 -9876 -11154 -19218
24706 -19218 18548 -17180 -42862 -67308 -33796 -35091 -74221 -29192 19741 28065 25448 32015
24694 32015 63197 45375 48401 -19204 -34120 -55770 -65075 -33714 -21594 -40550 -11743 21716
24682 21716 19368 23778 36111 60217 57976 5499 26138 40753 69198 78838 73071 85798 81635
24669 81635 14335 7465 16719 4614 33761 25362 11442 44026 55800 65971 22177 2730
24657 2730 24154 34007 64146 18350 6730 28296 57711 40114 19682 16507 70429 47905
24645 47905 -26584 -73079 -74674 -72300 -38628 -35117 -42154 -91444 -99798 -97203 -111725 -96935 -42286
24632 -42286 -72845 -47496 -27505 -45286 -58283 -52507 -30480 -5164 27009 -12142 -48438 -90584
24620 -90584 -47404 -25832 -53413 -78921 -78729 -74790 -36295 -29307 -9777 -23783 -79261 -81004 -43284
24607 -43284 -31863 -21154 -18682 10964 24614 -26001 -38358 -38405 -9588 49970 55270 47601 38900
24594 38900 35103 22904 18302 6312 -53917 -144896 -117662 -55590 -38593 -24373 23883 27845
24582 27845 -24628 -83110 -92719 -38275 -51914 -17850 18272 -29092 -27241 18993 28901 13301
24570 13301 698 -24165 -17880 -14029 -57464 -95286 -69413 -60326 -98922 -123241 -75776 -30554
24558 -30554 -27729 -55792 -65493 22741 45119 31093 23106 50898 59154 58256 24008 9288 22370
24545 22370 52305 37318 18527 -33242 -45448 -61192 -69013 -100393 -49657 -11491 15674 49180
24533 49180 69828 20720 -11066 -3887 -20471 -57509 -74388 -60164 -11693 35241 32849 11789
24521 11789 10473 -52291 -69247 -59925 -62828 -49314 -30785 -41193 -60477 -31378 -28413 -20088 -36823
24508 -36823 -19579 -34187 -54167 -66585 -44810 -27653 -48296 -26916 8288 20807 -317 -1837
24496 -1837 -27898 -37736 10644 -18372 -35265 -23368 -9792 -76851 -28495 -16349 -2498 2911
24484 2911 13882 -26040 -76510 -98846 -57116 -19574 9816 -9124 -21765 18237 21946 62110
24472 62110 66013 28232 69758 21452 -36033 -106196 -115913 -124450 -75656 -69424 -59175 -36872
24460 -36872 -41830 -50483 -29724 -28984 -12664 11339 -7541 -25397 -5850 -9946 -11274 -23865 -50733
24447 -50733 -50029 -77218 -71950 -43931 -61181 -83740 -61189 -5043 15394 2262 -13205 -11137
24435 -11137 -66815 -64148 -20384 12760 1643 -1843 66246 116633 77346 5500 -53533 -55447
24423 -55447 -40680 -58961 -64974 -54794 -108447 -151778 -140000 -83357 -108385 -102595 -64028 -69744
24411 -69744 -42822 -32631 -20484 -15276 26652 -11518 -46571 -68979 -98570 -84550 -54144 -69081
24399 -69081 -80039 -37689 -36842 -84798 -87640 -97077 -75003 -56502 -26060 14955 5546 -3771 16720
24386 16720 -10265 -6885 -22698 -59582 -83223 -43122 -15479 -36113 -58938 -56725 -72481 -73052
24374 -73052 -35465 21912 74532 25022 7563 18894 19518 22248 -30232 -41494 -20684 -32627
24362 -32627 -59728 -49323 -30531 -26290 -8214 -61723 -56762 -2828 17220 -7168 -21458 -35756
24350 -35756 6223 57074 59452 103997 103279 101260 74158 37262 -20747 -41010 3025 38209
24338 38209 30403 68506 76507 39357 -21627 -49504 -37913 9954 31647 41853 50574 5651
24326 5651 -40907 -52197 -8218 -36727 -89684 -84953 -51135 -49228 -19694 -33130 -75321 -56821
24314 -56821 -55473 -70466 -100598 -116958 -113262 -54987 -65880 -63770 -10527 -4780 -55261 -93226
24302 -93226 -10746 16246 4226 23562 -15145 2923 -13077 -46576 -19101 -17067 -45476 -16067
24290 -16067 9522 -15901 24928 -5776 -28719 -1007 -6390 -27594 -41265 -47658 -56023 -32824
24278 -32824 -73638 -24012 34775 -4742 -12226 23078 -372 -47759 -27112 -20361 -4049 -46362
24266 -46362 -54229 -13291 5292 -9362 -8504 -19302 -70100 -59010 -41344 -45968 -27684 -20243 -74680
24253 -74680 -103544 -67447 35561 37589 17006 16385 3115 -39001 -46012 -24767 8094 -32264
24241 -32264 9185 64276 21879 -63167 -100187 -88089 -57324 -46784 5552 -4695 -21326 -41448
24229 -41448 -30803 -1118 -6366 -13898 3909 18465 4438 16720 -21078 -37145 -80125 -71091
24217 -71091 -29623 -9936 18925 22042 7546 -8418 -9962 21894 16958 11761 9066 -21343 5722
24204 5722 -27796 -42580 -79036 -46952 -89953 -105791 -136040 -69813 -33734 -43139 -41283 -1694
24192 -1694 9524 -35678 -26707 -4790 11450 77333 57723 32410 24244 -12638 -41350 -57841
24180 -57841 -48500 -69137 -66303 -88804 -69071 -47905 -28628 -70665 -64409 -60937 -76315 11302
24168 11302 55476 20467 -28817 -3560 4657 -21744 4355 19385 33223 39681 3219 29669
24156 29669 40486 -5475 798 28496 28988 26565 -31514 -51659 -58617 -108433 -92292 -51476 -26185
24143 -26185 -41475 -37207 -68337 -94447 -82288 -59914 -87724 -18384 2460 -8696 -19482 -12782
24131 -12782 -52275 -53904 -57523 -20589 3516 -15127 -42310 -26864 -6515 -17953 -53830 -87991
24119 -87991 -87847 -6835 7602 -20603 9084 55638 67154 58347 82542 36674 8549 18317
24107 18317 22479 -23560 -40274 -60076 -19026 471 1720 -27551 -59963 -85168 -79764 -48978
24095 -48978 -20827 -50820 -55570 9451 67214 80515 93404 88562 56754 36528 50995 36824
24083 36824 16612 18028 -17857 -46458 17349 48260 89834 119967 99013 1910 -27169 31218
24071 31218 35760 -2336 -12568 15656 -33417 -41069 -37127 -47195 -24217 -15796 11056 2719 -24480
24058 -24480 -11772 -17359 -89497 -71036 -87428 -116169 -128269 -95723 -64077 -55958 -54340 -83294
24046 -83294 -38203 62785 55603 -36857 -31313 -20151 -46073 -60817 -77278 -74485 -57222 -50923
24034 -50923 -54158 -55123 -46159 -35926 -3444 -644 5851 -658 -54180 -25256 -45119 -101231 -93536
24021 -93536 -20034 -56084 -107423 -64443 -52611 -42950 -57853 -115040 -115219 -95310 -116216 -86338
24009 -86338 -66526 -51788 -60419 -47769 -30191 -37410 -17546 -26604 -91083 -113174 -122989 -108207
23997 -108207 -43660 -60478 -91413 -20605 -2946 -9411 -7870 28041 51367 24858 -33976 -17443
23985 -17443 37402 31192 56602 73820 103553 65980 3767 -26328 -35967 -17336 -33508 -33736
23973 -33736 -29660 -23547 -57682 -108777 -106234 -60073 1535 59520 88898 20852 8781 2509
23961 2509 -23858 -19507 -98635 -88899 -86570 -92297 -82368 -104696 -103599 -84945 -21256 40675 35734
23948 35734 21774 9948 22726 -3050 -43406 -57118 -69612 -58494 -62393 -45901 -44183 -51996
23936 -51996 -15365 6994 19564 -22235 -14479 19324 18505 30878 62374 82311 15749 -80013
23924 -80013 -115976 -81797 -98472 -134196 -114607 -87262 -86784 -110233 -68751 -80315 -32720 -30491
23912 -30491 -80199 -30038 2260 -37693 -28752 -11461 68418 89718 14085 -33214 -24668 -51376
23900 -51376 -40151 8188 88566 133391 85310 59634 50694 26679 7588 -15627 -26830 -61462
23888 -61462 -46463 -9991 49390 54607 60516 56388 -7015 -49054 -75073 -49404 -41141 688
23876 688 43340 28328 5171 16994 22917 28389 1997 11443 68207 77882 48073 25917 -27442
23863 -27442 -59072 -61232 -15227 -22642 -56231 -75038 -66375 -41877 -11770 27331 63498 53992
23851 53992 16484 -40866 -35998 -22157 3798 77688 90293 73517 42643 6332 27536 38160
23839 38160 43931 63168 66740 18407 -46849 -38133 -14654 12622 21610 -5374 -35319 -33125 -16160
23826 -16160 -10260 20405 67682 100134 8786 -64980 -90913 -40473 -34915 -78106 -52833 -55637
23814 -55637 -60637 -99578 -59221 -40394 -48702 -21555 33566 16547 -35661 -48045 -54368 -72166
23802 -72166 -81112 -84435 -70631 -81489 -111529 -109169 -84259 -60583 -26322 19486 45460 26052
23790 26052 1275 22666 48904 30002 12113 9249 -27381 -45323 -86927 -94617 -83255 -38321
23778 -38321 45810 14623 30521 69712 -4983 -11048 -333 -30908 -140263 -131593 -92092 -107902
23766 -107902 -110375 -104642 -109481 -85854 -57725 -20363 -53866 -82677 -88620 -64141 -20491 77633
23754 77633 107220 67648 -70 -32800 -39896 -46378 -96283 -105949 -66784 -50706 -63670 -109035
23742 -109035 -157662 -120930 -93454 -71643 -70009 -22731 -17580 35750 41986 56723 30933 35912
23730 35912 34980 41221 14088 30674 39776 2105 -40707 -121017 -71278 -32859 -64338 -74017 14267
23717 14267 31211 19961 -27508 -16183 23853 18223 8291 18038 17649 32955 18880 -15991 -60063
23704 -60063 -82291 -73586 -66057 -45728 -9909 -12815 25937 43362 13478 52286 44653 49654 76801
23691 76801 114460 107349 77711 -19158 -89613 -54037 -41022 -30053 -44485 -81160 -101328 -83899
23679 -83899 -64994 -41815 21824 29008 -14104 -43771 -1976 4143 29047 -1694 -6499 -10415
23667 -10415 -42508 -67183 -69099 -69001 -17271 -15132 -23633 -38852 -24631 23534 92250 92536 63873
23654 63873 72435 94343 81523 93448 96455 90592 66876 37686 93017 103264 63950 15242
23642 15242 3415 -43652 -44073 -55193 -28606 19202 52093 97898 77355 3581 -64176 -22675
23630 -22675 -18352 -16852 8501 5853 40773 36037 -3555 23150 46664 60866 42777 56792
23618 56792 48568 117569 124778 118187 64217 33013 1212 8125 14052 -17130 -16641 18161 41069
23605 41069 -4422 -16836 50723 16044 -75962 -58505 -54446 -31129 29322 -5107 -34241 -3900
23593 -3900 41994 49817 3466 -34835 -40542 -28458 -48879 -2982 34724 11594 -27603 -69182
23581 -69182 -72865 -67872 -50347 -88548 -95947 -67911 -57816 -53223 -52763 -80077 -78848 -36330 -93935
23568 -93935 -112807 -92323 -45214 -12032 -22953 18974 25295 -774 -53015 -81799 -37016 -19886
23556 -19886 -51831 -46720 -37885 6274 22013 48271 20716 21970 496 21068 5673 -61891
23544 -61891 -72306 -66912 -60197 -64419 -46567 -18171 -39174 -59414 -70424 -27482 12409 34106
23532 34106 24896 20431 34579 8130 28298 -43821 -34002 -2641 42652 24293 786 -1018
23520 -1018 -68240 -101545 -33943 -4183 -45719 -59844 -36256 -6001 -6021 -4732 -33015 -78230 -67539
23507 -67539 -18264 23045 19525 -22438 -70433 -39034 -46197 -47730 -76809 -99501 -71049 -63280
23495 -63280 -22146 -8883 -24302 -28512 -5452 25571 -10737 -29710 10508 -25603 -14671 -16267
23483 -16267 -23898 -42599 -140237 -104178 -57917 -900 26571 19245 24914 56608 25422 20336
23471 20336 66644 102471 102219 122661 106425 69379 39989 30273 30265 27987 26193 10837 -3878
23458 -3878 -16339 16169 9773 16024 -17670 -24446 2543 32081 33872 -8876 -22606 -35805 -77705
23445 -77705 -103006 -143196 -81686 -52204 -53568 -77038 -51311 -60240 -70581 -100439 -104963 -123817
23433 -123817 -139818 -133227 -120635 -62747 -5307 22771 72974 115062 92242 62614 15778 23959
23421 23959 34677 45096 61427 23767 -14459 -55052 -27734 -6554 22451 2 -25606 -8424
23409 -8424 19824 40559 22844 966 14333 49600 40902 53683 49331 69120 57818 30191
23397 30191 -14013 -8924 -1037 54120 33822 5523 -13176 -82822 -116349 -94304 -48848 -66404
23385 -66404 -27122 8012 -9862 -7704 2500 -62021 -103124 -82680 -72401 -84023 -85377 -71840
23373 -71840 -61850 -44980 -29771 7044 -23746 -24875 19879 44616 34413 18725 8575 -38378
23361 -38378 -116157 -110073 -93874 -76033 -88600 -104798 -105311 -108547 -117225 -49848 23555 12822 -10637
23348 -10637 -29920 -67805 -19984 -56886 -63210 -31375 -53800 -101219 -55841 12440 -10822 -24295
23336 -24295 -45941 -44614 -39367 -23125 -33648 -65025 -63094 -59505 -81596 -57356 -13284 -13985 -37038
23323 -37038 14594 -3766 -27640 -43934 -74245 -47925 -13859 28659 60660 42625 42927 7959
23311 7959 10325 86971 85732 57224 11809 28672 83941 44440 -26158 -24671 19757 38306
23299 38306 59710 47968 26943 -26215 -42237 -62286 27066 58385 36492 -11929 12467 17902
23287 17902 8914 23583 -5696 -15023 59674 64177 14681 19931 36081 71532 19120 -8474
23275 -8474 -17264 -16545 -72845 -37773 -684 15827 32268 46185 10459 -6623 -24598 11343
23263 11343 77130 41127 -57140 -81862 -40692 -46829 -86068 -107106 -39487 -30071 -56281 -56623
23251 -56623 -49247 -32394 1021 -26444 -25481 -8709 34950 49812 -15933 -36402 -5624 29059
23239 29059 58882 115400 152106 101067 34135 20862 6131 16156 48876 49550 72648 34904
23227 34904 22202 -17818 -23251 -26816 -36159 -65198 -71061 -4106 -34357 5043 85306 86746 51589
23214 51589 42819 44741 43843 35824 -28547 -45654 -56995 -78493 -55020 12250 28820 -5347 -35660
23201 -35660 -18398 18127 -55096 -89801 -76475 -59494 -39830 -36386 -47587 -62422 -56807 -41697
23189 -41697 -42500 -20087 -36045 -87000 -110241 -53644 -63525 -44797 -35705 -38279 -14851 19836 48892
23176 48892 65921 70712 30491 -39038 -59452 -32783 -65149 -45988 -29799 -76324 -31689 33899
23164 33899 -35007 -49536 -39096 81016 109485 95388 63757 -7648 19028 53450 22435
23153 22435 50974 41109 4960 -41921 -60622 -11843 36481 37525 -13943 6755 18444 -2589
23141 -2589 -25400 -71713 -80250 -76414 -83352 -21977 34619 53645 65188 107165 57946 23802
23129 23802 9673 16474 43265 81080 99114 86931 77295 -6607 -47196 -25032 6725 -12010
23117 -12010 -62615 -39406 -42711 -77091 -48511 -15713 -15705 25184 26921 -31514 -43717 -31585 -10623
23104 -10623 -33909 12674 29189 274 6913 26687 22818 34369 -8623 -20227 -46552 -98396
23092 -98396 -73988 -41050 -70006 -14874 -70923 -127220 -76686 -52099 -26727 29723 72022 36230
23080 36230 16983 29737 2223 -33688 -85914 -90299 -78814 -32149 -17234 -35185 -50144 -7519
23068 -7519 71312 91457 120883 40247 -4790 -31162 -43619 -29726 -1289 11019 25000 82124
23056 82124 40040 -13625 -27873 -34971 -41425 -35594 -4818 27725 7668 -38160 -29000 -48868
23044 -48868 -113583 -103971 -89148 -99695 -100663 -36655 15773 -14507 -46417 -16896 3641 -38049
23032 -38049 -45853 -58140 -43636 -6941 39712 51756 100876 75988 25369 -14737 2987 -18433
23020 -18433 -73384 -71772 -28680 -23562 5246 41653 73658 81089 44554 63158 18123 -1878
23008 -1878 -38061 -25804 9229 -11262 32611 70118 96753 108647 18355 -74181 -61358 -23588
22996 -23588 -1844 -9133 25890 -14623 20931 22673 -18741 -7152 -3824 -4237 521 9908 -10799
22983 -10799 -50918 -44088 -32341 -38619 -28313 -13051 -4049 -8362 -28950 -40438 -62219 -74972
22971 -74972 -55023 -53030 -48529 -57969 -56774 6534 24963 -2660 -28917 -12762 9787 32503
22959 32503 61722 112254 125548 109458 103863 83210 19061 -38140 -33674 1625 12064 50043
22947 50043 45784 -4185 -102239 -62750 -20215 13870 -25351 -36680 -41417 -6925 29720 -1806
22935 -1806 -14932 -56596 -45424 21536 15822 12657 2076 -43393 -33576 -98074 -111580 -117520 -49671
22922 -49671 -21265 18623 47444 39079 12710 -10805 -976 1505 30548 -18954 -57073 -71518
22910 -71518 -36590 -235 1555 -46455 -84480 -106015 -66695 -30748 19098 48937 73127 67320
22898 67320 65830 12283 -27707 -90234 -104328 -79155 -108771 -43802 9197 6890 23343 -39773
22886 -39773 -88851 -37746 -52009 -55744 -6523 -5285 -14293 13286 -45714 -94037 -120785 -48334
22874 -48334 -30918 -62842 -14515 -12683 -5367 -78421 -97285 -77388 -69008 -47728 -59685 -118531
22862 -118531 -108506 -99367 -26615 -13851 -49554 -16634 -18113 -45548 -28050 -52336 -50509 -15516
22850 -15516 35461 76509 58609 106748 77590 95714 87213 48778 36781 29339 33468 29526
22838 29526 -9767 -37060 -23474 -60897 -46579 22125 35642 -8435 -30379 7185 29416 44564
22826 44564 59620 15568 43552 82656 96907 53293 -5337 21217 -1094 57017 81356 104534
22814 104534 74147 13473 48221 -17342 -79020 -45820 -66136 -65127 -50715 -26160 -18353 -42104
22802 -42104 -5197 46249 75460 66467 31236 39354 47246 9572 -4050 -13252 -29620 -77433
22790 -77433 -35371 -32499 -67511 -47383 -34855 -78910 -88258 -68084 -64914 -38933 -48683 -20438
22778 -20438 12867 15758 30767 71613 70778 84154 72550 59233 37613 10233 945 -16207
22766 -16207 -70477 -110507 -85874 -66347 -18762 45733 92469 33965 17968 -31789 -72252 -141672
22754 -141672 -79502 -34266 11878 71046 -1772 -22292 -3278 35994 45553 21395 -18264 -86814
22742 -86814 -61664 -32714 -8314 -27371 -13734 -19170 -38650 -12024 2441 -49522 -58864 -1853
22730 -1853 23298 -9372 -21113 40096 64228 34713 -12811 -26633 -5117 -80643 -87203 -41503
22718 -41503 -1101 31483 65783 25977 18875 6905 -19138 -14977 6248 47504 96340 109201
22706 109201 106165 54684 -37010 -50384 -5256 19520 32323 38533 35957 8792 -13803 -47903
22694 -47903 -74119 -42497 3442 21205 -16532 -56367 -59929 -67091 -21996 -40000 -78226 -67806
22682 -67806 -58813 1242 46918 30241 78876 55374 31320 10431 27034 83158 123319 114428
22670 114428 68359 30572 -162 -8939 31328 67959 69549 35891 16698 38124 69168 110319
22658 110319 70745 -17952 -15875 -2865 -21542 -17920 -8988 -12291 -18750 20088 50492 57182 39630
22645 39630 36662 28000 72880 118016 63596 29504 21148 -1436 -52371 -34391 39819 92307
22633 92307 45743 40055 49801 65347 9787 20467 5304 -25030 -49371 -44358 -65517 -55442
22621 -55442 -65593 -87239 -63420 -50675 -94660 -112164 -72445 -101728 -78520 -72158 -102888 -109611
22609 -109611 -17712 -2618 -10239 -44401 -45471 -54320 -55502 -34009 -19300 12007 27243 95696
22597 95696 90620 75147 39882 -1614 21129 23861 8975 42864 22731 20551 20158 1322 15735
22584 15735 47271 40366 16697 28559 32130 25975 -31890 -42797 -8315 16039 -17052 -6889
22572 -6889 -36166 -16826 3791 16451 35919 48198 34270 22391 4779 13533 -11940 -37030
22560 -37030 -48703 -53023 -33836 -21428 -25177 1848 10034 27193 8917 31589 53863 31280
22548 31280 2409 5951 15721 20229 10138 31988 41225 46987 -21910 -48926 1657 33808 14058
22535 14058 25789 22285 20741 27249 -28363 -66580 -55250 -46385 -49688 -4517 49783 52399 22869
22522 22869 -31372 -16117 -8325 6924 9068 24735 47599 22986 7031 19274 51527 86976
22510 86976 47129 35097 27953 -8493 8617 41232 22215 48330 27566 -16604 30306 31939
22498 31939 7599 1688 21100 39199 -5025 -14044 -46368 -72261 -35227 20108 26165 4405
22486 4405 -22708 10039 53206 29604 -35657 -69340 -11649 3172 -7008 -8578 47520 34451
22474 34451 3183 27181 85205 69353 -1284 -18326 -7859 -20467 -22198 -5903 411 -24553
22462 -24553 -26429 -39663 -32953 -37637 -12785 14898 -55239 -107017 -97576 -60454 -33766 -37539 -3785
22449 -3785 2750 25565 -986 57501 11641 -20470 -43462 -68097 -11207 72920 70592 36065
22437 36065 23778 36750 -5472 -45971 -89479 -53244 -35844 -25457 18360 68181 76385 99391
22425 99391 116185 63388 -27030 -45637 -91429 -64390 -42048 -50361 -40401 -10404 -2031 -441
22413 -441 27579 43530 53574 19702 18111 22654 68868 70318 -1552 -12904 -67364 -86301 -46689
22400 -46689 8940 62332 40575 22162 357 39816 74519 54319 53539 34899 -42602 -81461
22388 -81461 -52326 -39643 -14634 -53607 -60694 -69180 -45956 -34651 -15904 25441 45010 54661
22376 54661 62779 101516 64938 -424 -3176 19522 -21326 -32555 -7169 -26391 -26407 -28992 -18211
22363 -18211 -28359 -70089 -51981 -9682 -3607 -43148 -117266 -120851 -57123 -55886 -108384 -122306
22351 -122306 -121151 -88882 -37155 -13026 1346 -24952 -11312 3216 8200 -22344 -27073 -40657
22339 -40657 -32300 36510 -3368 -24276 -20582 -43639 -42552 50053 44791 72205 100797 77669
22327 77669 54668 20770 11477 -22512 -1134 18957 -24997 -57792 -44590 -43338 40209 101077
22315 101077 93694 65237 39688 47431 46162 22889 -19470 9596 14380 -12503 -30126 14130
22303 14130 45114 114170 149655 65360 43171 10988 -30324 -32284 -51038 -16192 -21975 -43823
22291 -43823 -26187 -27034 37111 49261 22780 16563 24686 9900 27024 50092 20167 29872 -31705
22278 -31705 -69899 -106759 -70575 -54673 -23045 -26909 -37866 10312 15127 -26375 -36017 -43128
22266 -43128 -30498 4204 -11264 -4514 -26777 24202 48918 39653 57092 45541 -10079 3637
22254 3637 24739 11041 5444 -54557 -103338 -44575 27545 19961 68003 158550 151969 135619
22242 135619 74708 -9411 -33206 46409 85252 88386 98149 117810 152897 145080 139919 115750
22230 115750 57891 46402 55836 -11966 21332 80042 56494 49368 39738 22304 23199 -17081
22218 -17081 -25337 -35927 -12354 27177 36012 38048 45271 36607 48584 80581 59278 44234 31528
22205 31528 -3497 1055 64131 66216 23136 -4428 24972 57067 57474 22575 83069 124106
22193 124106 102281 111773 98152 71810 86874 72087 36027 51798 34312 16576 -34092 -30393
22181 -30393 13419 -19859 -49794 -57441 -53908 -17391 -65070 -33612 45825 67737 77082 73728
22169 73728 111786 100699 57719 30603 42900 69229 98020 66519 38262 20123 23132 38300
22157 38300 56351 48490 -11996 10586 37288 -9185 -27293 28048 46272 31025 24703 -17778
22145 -17778 18935 32587 26864 79163 95053 54103 40525 51811 57755 38520 -223 -32784
22133 -32784 -28415 -26587 -27095 -71542 -28105 5325 -3963 3558 -19486 7528 43273 47893 66681
22120 66681 52045 26259 41949 56663 46393 74135 57936 93852 126713 84965 74387 28244
22108 28244 -60000 19723 3343 -18354 -4715 -29456 -26985 -8474 11678 20980 2159 -12174
22096 -12174 -29457 -35179 -61092 -37531 -26297 -46369 -36407 3488 26365 20157 10404 8901 -27370
22083 -27370 -53845 -32269 -19487 -64771 -113579 -131823 -89605 -86088 -62142 19265 22230 20877
22071 20877 52198 77090 60619 12704 -37387 -56338 -20066 7415 42689 46126 47299 62466
22059 62466 102007 102198 51885 -8044 -83485 -120656 -33860 49476 30084 16894 13754 9861
22047 9861 -14632 -47800 -51932 -9984 -10566 -28093 -66711 -54448 -42701 -32055 -16613 31335
22035 31335 40044 66931 88221 91529 81832 71242 -3791 -10609 19421 41531 73987 76837 31457
22022 31457 44239 5149 -23759 -58063 -70297 -37463 46368 45639 3725 -20312 -10461 68582
22010 68582 132257 108308 49955 38983 38720 32101 -5404 -21734 -5232 -10830 2465 9012 39209
21997 39209 51808 -974 -234 61005 65097 6202 -24085 -16350 14628 46575 46034 -5992 -54944
21984 -54944 -36809 8590 -16664 -69276 -73765 -24155 43908 61412 51931 73524 58143 6458
21972 6458 291 14785 -26169 -21478 11561 31918 9613 -49414 -22399 24414 63815 100243
21960 100243 88748 82732 32865 -16642 4065 -6030 -43631 1669 39029 16787 -14646 18666
21948 18666 25289 -6865 3586 -4985 -47747 -32248 -31384 5140 19331 77680 109725 117918 86953
21935 86953 23940 39607 71627 25924 -10661 8594 16539 -10811 -37475 -10462 -27064 -115790
21923 -115790 -79378 22826 53272 38089 -16699 -32456 28978 10701 20166 79360 53511
21912 53511 -5779 -28377 -16444 44190 58756 70215 70876 60622 22937 -34010 -15501 14556
21900 14556 32966 52421 25376 22612 -13050 32703 89906 90991 93079 132024 126433 70562
21888 70562 55066 62472 18117 61716 109607 113833 51266 32884 66586 60904 40697 30811
21876 30811 -19018 -12533 -23689 -37601 -29831 -23774 -45180 -51625 -36696 -47057 -60849 9959
21864 9959 61695 52762 28571 24934 21892 14410 34671 18115 11835 -23186 -13589 -12313 13275
21851 13275 81515 32148 -34362 -66022 -31985 23156 19398 1057 -9177 -22494 -52442 -9460
21839 -9460 -16063 -54087 -55418 -33977 -9477 2613 59117 54615 23374 4416 26123 26650 4376
21826 4376 27803 3826 1233 -9280 -9552 -31136 -9687 13085 -28913 -22075 -4879 27512 -361
21813 -361 12721 85368 25128 22464 44212 11928 -30970 -17836 12594 -903 -58099 -67360
21801 -67360 381 9790 22487 48820 44317 68498 49991 -26869 -38716 -10372 -20527 -35905
21789 -35905 25340 -3269 -19792 46686 49292 79141 78408 57825 19007 -51672 -51696 -2463 15880
21776 15880 23062 40353 33601 23911 14607 19235 -4456 -3480 29295 27928 42058 25895 15025
21763 15025 5866 27042 33594 54307 75368 32970 35208 -9026 3999 4637 -36251 4733 62813
21750 62813 145330 140236 45961 -23095 -27562 -43855 16941 5277 15739 16123 59595 32382
21738 32382 -2568 43124 15940 7901 11624 -9624 8147 -27884 -27615 -28985 -71415 -60734 -19167
21725 -19167 29255 50776 38846 -17734 -11227 -6429 42505 80968 106719 74031 76159 60133
21713 60133 108197 75459 48163 57134 68787 63732 61535 31913 13365 25481 37835 59014
21701 59014 79450 127836 150661 158844 107150 51243 86297 57695 38400 47560 53513 19806
21689 19806 -36530 -34964 -16636 35803 63888 59063 75443 48203 62555 13581 12222 20844
21677 20844 48281 77494 46531 96183 101379 60305 63959 27262 4768 23227 9362 -40309
21665 -40309 -74501 -97684 -91790 -79156 -77080 -37953 -18742 38884 54034 93307 79941 85276
21653 85276 87592 39429 63489 32517 24224 32298 44602 26437 -12220 20245 32536 17856
21641 17856 3574 57918 96330 68567 102252 156979 165659 86771 90286 98588 80807 65045
21629 65045 -17402 -14268 6561 36206 47444 63571 49488 -1997 -50427 -5217 6267 4478
21617 4478 -9042 -60438 -113274 -127379 -64735 -18217 3423 31785 257 -26152 4957 5650
21605 5650 21401 103445 135459 90000 53025 25850 44537 53126 46266 -10164 14008 57803
21593 57803 35774 13217 25072 258 -42788 -21822 -30888 3193 23220 51660 26072 -9580
21581 -9580 -30928 25358 67575 94782 29082 851 -35294 -50180 -14092 -1927 -14254 24583
21569 24583 27954 42407 60598 41987 19065 46966 79694 78898 62741 68974 71674 25113 16784
21556 16784 30536 27121 48585 73035 54427 1271 11900 27550 46624 34568 14714 57263
21544 57263 21855 -48823 -44944 -12128 -6190 12129 27125 36912 5063 1013 10224 51494 70569
21531 70569 63371 138043 123294 129528 114817 124161 123349 88391 51687 92372 86895 88201 96284
21518 96284 82908 59736 62213 79875 76797 26629 11434 -2525 3036 28407 51472 96694
21506 96694 128648 123649 78894 88492 113512 88975 72397 52577 53375 60869 66032 91836 102243
21493 102243 78956 62073 108717 79056 8843 32847 26521 13496 -5525 5480 38179 59528
21481 59528 63998 49480 8395 6895 -16919 -29551 13759 23327 86501 110658 85402 6718
21469 6718 28970 18126 -29194 12014 21942 26813 77350 54097 58527 22129 21734 46804 42462
21456 42462 2677 29330 101937 77143 87118 94754 98380 54229 64241 58140 58487 63090 45432
21443 45432 71170 25733 1428 -15710 -35747 -2208 18365 60102 49274 30928 30177 21239
21431 21239 -438 44434 102003 108199 117841 87275 70519 85770 101374 123902 57215 30389
21419 30389 23277 22798 58652 52465 48162 54523 16117 -4326 4061 43978 16420 40697 54118
21406 54118 101453 126719 124183 164863 180344 191854 148716 130385 153298 101580 57395 52935
21394 52935 62439 85905 88426 118162 108783 48929 20157 46152 72913 90805 72729 78180
21382 78180 74538 29546 22238 50015 59574 133109 179212 133295 112761 115480 153668 151906 73112
21369 73112 54455 73354 90175 81530 94923 92628 67460 42455 54651 93108 97491 115366
21357 115366 110879 55119 11754 51468 94787 92621 72801 36219 18862 57877 27009 -6487
21345 -6487 -29763 -67146 18171 40917 32178 49677 86192 98152 89600 98788 86535 105937
21333 105937 109308 116888 134621 163537 125688 171488 190653 197095 161103 87868 75883 85321
21321 85321 45305 66878 110103 104513 97981 78633 109280 125517 129895 162758 120737 102918
21309 102918 127328 94883 63385 30595 -8932 44922 122091 136740 93676 121508 135251
21298 135251 71133 28989 8547 36822 95128 102471 89778 97986 91705 69207 119099 165458
21286 165458 124581 89161 96770 167471 193532 127497 34815 2465 20828 41330 29736 -17587
21274 -17587 5389 53897 45797 52774 81347 109842 106008 75352 82091 65999 40396 56628
21262 56628 46922 29276 -15500 -4143 36647 73186 69285 79192 71109 26792 12450 72085
21250 72085 106993 121614 102142 78329 99540 110051 97212 113344 93057 108438 104537 98526
21238 98526 60931 132443 135432 60832 58643 71690 66549 64737 96680 137509 160357 139908
21226 139908 70005 49347 49118 49456 104513 125238 123405 164456 188475 218465 172230 164501 119379
21213 119379 129063 121208 152648 168836 159157 69225 32399 17699 57844 84635 122424 166727
21201 166727 141835 137711 42097 -12231 25901 102095 167443 161715 99556 69175 76071 105152
21189 105152 115205 110183 124258 115046 86801 109610 124911 109323 90471 97059 186876 212095
21177 212095 198420 131447 88868 48112 81120 96049 95226 116420 120168 103543 87587 86965
21165 86965 38363 17435 19348 -22211 -55976 -49053 -22449 6913 11115 44189 62840 114843
21153 114843 148150 135250 151231 123683 117420 91654 74937 51715 58653 55904 108745 165339
21141 165339 191834 220651 263954 255334 245724 164875 120156 80962 103123 146140 135700 128914
21129 128914 78975 -7516 -35665 40650 118804 128823 111333 85223 67901 86728 41050
21118 41050 73778 144537 147835 94490 109194 113900 148750 154809 195730 205009 130605 68375
21106 68375 17062 26437 60583 124667 106136 19508 52861 80991 156079 171477 224456 230361
21094 230361 197402 221243 212069 197954 160101 173939 210067 265516 272628 263508 249892 250315
21082 250315 256869 247368 148901 124007 187961 229566 224030 211753 164038 59132 54391 81014
21070 81014 114263 95339 56011 80405 102260 134517 115572 108073 179544 232865 283871 266608
21058 266608 196214 164750 175852 220375 204107 157367 197041 207196 181692 215277 230553
21047 230553 236782 274144 254755 212108 262574 308213 351026 403797 446555 461553 466099 455970
21035 455970 424823 404877 412452 452087 502431 567505 577390 568897 604384 643042 706569 761224
21023 761224 846770 900921 926977 902439 901880 922325 963469 1008891 1063236 1098670 1140525 1160403
21011 1160403 1127845 1113801 1142281 1093411 1052563 967623 937391 953578 965245 958777 898026
21000 898026 847935 839725 822811 794869 796436 715353 625883 629652 569927 547303 520299 525444
20988 525444 471327 448138 412377 368726 339053 305808 330965 330451 354838 336649 279365 260164
20976 260164 259248 288582 361223 333124 294167 300588 242789 237061 246820 220034 248049 282777
20964 282777 244705 233593 240758 235873 171200 108723 96173 136611 157938 148011 157875 166090
20952 166090 191976 210404 193578 157806 148116 151664 161061 215456 243822 232088 206553 179277
20940 179277 232245 224264 217827 198719 193581 196793 193382 161557 123732 103386 127963 150522
20928 150522 173270 161427 156466 181247 216281 181339 184071 214301 235091 197799 208332 238250
20916 238250 232157 225245 225085 222892 214669 197074 195059 177524 143218 132143 191930 248616 219395
20903 219395 176069 134734 131408 124632 162377 212622 226462 206765 174126 106892 135263 154599
20891 154599 152174 139288 100712 79414 111843 145026 93437 144532 197154 190343 199239 212982
20879 212982 195276 164442 125461 76005 72971 79713 113227 131785 134639 146565 146679 151957 160918
20866 160918 143545 135827 133974 120879 90547 93157 126467 150698 167500 156051 164554 137594
20854 137594 146347 209350 253401 167375 141163 170058 121070 108635 126131 117759 170153 179368
20842 179368 175924 186675 135959 124282 182995 163823 109448 87780 119388 128099 148042 174650
20830 174650 145229 135235 154561 180501 185219 196618 176067 158723 137373 177320 156942 167180
20818 167180 116082 145694 150093 148326 132524 99222 92594 101253 83681 105503 134085 151983
20806 151983 186319 175397 156229 174804 199025 194854 194471 171015 143362 155914 119100 106399
20794 106399 154384 190405 149283 114056 82180 79725 97303 96326 137038 194494 143177 124477
20782 124477 101663 78225 105242 142741 161461 174125 201219 217808 213742 190185 177053 168248
20770 168248 170441 195978 254263 258282 252457 221689 180268 171952 197397 240687 246166 211750
20758 211750 168085 169614 165137 179562 184295 152157 151980 165498 185932 211182 221037 204714 238020
20745 238020 205588 155089 153660 128190 160277 212868 266899 280918 256929 182288 119001 117485
20733 117485 141085 124679 137948 119252 79824 94909 93844 88092 88677 142986 140265 128143
20721 128143 151152 152771 177469 160401 134738 159714 201288 212579 192853 238650 260402 255160
20709 255160 224083 183864 166514 211600 235061 249336 248224 268664 233785 198411 202163 196883
20697 196883 204859 171096 218700 259690 259106 197925 123381 133583 188092 196287 189765 195636 224108
20684 224108 285893 285459 255938 276002 276922 250246 225281 228998 229252 239066 276128 296075 229366
20671 229366 143670 140668 184629 188643 265000 315352 246461 215456 176390 206934 266298 211971
20659 211971 69028 69396 145244 211929 220628 206629 257884 226883 210911 207366 168780 190432
20647 190432 192969 186638 202321 259443 297767 299082 262645 222800 188416 176151 182511 170536
20635 170536 193906 186660 192279 211314 192414 160651 229852 241024 284712 301369 298801 315613
20623 315613 316857 249645 226259 255235 252612 208678 158600 214101 253405 261046 195223 181072
20611 181072 212021 196406 187589 189451 147309 140146 166068 170418 163120 141291 155990 176847
20599 176847 168760 165110 204399 238695 263717 228745 226494 202379 184408 176290 177489 194674
20587 194674 205616 246191 294248 346442 309344 230123 202580 189049 190012 141958 144911 149017
20575 149017 143120 165084 206157 221594 254031 301228 318662 275458 261548 262653 245361 259772
20563 259772 305471 285042 227120 219082 195729 241954 267155 232147 236361 249953 241345 276755
20551 276755 295781 254728 294495 333015 325594 315570 288408 276250 244580 230151 267125 284302
20539 284302 253966 236514 276459 283634 288455 295865 281071 241372 236832 235393 234100 267753 298987
20526 298987 327374 291727 263051 224108 192924 216116 266261 281140 256685 269890 209005
20515 209005 214512 253826 272547 234855 284451 291466 346195 385421 302085 245890 208819 238091
20503 238091 247771 290507 315990 282235 244393 281618 305037 286263 269049 320239 346058 327958
20491 327958 359472 354956 335855 344159 326566 371913 366422 286286 263102 292907 294470 300524
20479 300524 296161 262314 261047 296068 270178 229546 253838 275659 281310 259387 273061 331211
20467 331211 372485 392613 328732 268680 291668 276651 261637 301476 281107 261886 315051
20456 315051 303267 257289 295041 344996 311926 276586 264001 251133 283500 340887 318973
20445 318973 243029 275270 338033 335100 285641 319745 286563 306961 332410 325165 307546 347542
20433 347542 333307 306598 262688 247108 292166 298443 269428 257864 267467 271718 323666 333835
20421 333835 348830 343347 305799 289024 275425 302523 330662 385729 434615 411700 411693 382393
20409 382393 355843 327727 325097 294475 291253 274706 315289 402221 446636 362296 331026 326498
20397 326498 301855 307697 391568 416533 409069 350942 346003 382055 415409 415019 368840 341732
20385 341732 358585 352889 316552 330615 308822 301797 297825 358063 371277 418544 401768 409372
20373 409372 416411 396750 380797 429135 436812 382299 368486 370571 309524 329751 419409 424584
20361 424584 344592 316737 313341 317977 347631 331406 345757 358560 318641 344624 400230 419598
20349 419598 405943 353907 319279 352804 439238 442079 401995 382510 440055 438769 431472 419183
20337 419183 475343 447416 421149 427326 437076 478513 480264 445145 423905 385948 396700 404571
20325 404571 372650 478150 511759 477060 479453 480919 453859 417875 379817 382002 454149 467285
20313 467285 433702 507672 539152 541020 555584 540031 533565 596115 608545 555925 567896 615679
20301 615679 617796 557061 522717 522817 531849 520076 467039 474972 455812 470234 498828 467693
20289 467693 494766 466414 464163 529896 521716 528433 511391 520337 523991 513029 514748 484281 523812
20276 523812 557935 560059 514327 501079 475956 466680 502084 542951 606454 594385 553106 526195
20264 526195 505252 463571 455577 478060 517084 491230 480683 509811 521594 569896 552212 478926
20252 478926 489252 480436 512858 570092 566092 553061 587993 583760 536801 573410 530690 510577
20240 510577 515176 575461 591164 593666 611300 639999 619199 574821 569250 571698 583226 587682
20228 587682 576986 550838 582397 570175 575110 587073 638923 628003 643494 611946 594063 569877
20216 569877 574444 605893 612227 606040 626725 666201 699191 645237 572239 635868 708571 623621
20204 623621 533148 516665 530693 563856 612137 611671 622012 630110 605234 554922 496251 525760
20192 525760 603816 625966 583706 579908 642047 652016 656190 613489 659507 733214 743661 744255
20180 744255 696850 679803 699086 664835 652477 649928 644002 679906 682052 697858 724508 749243
20168 749243 769267 743935 740520 774633 783686 793448 788182 729959 694063 681228 718524 716375
20156 716375 715548 698414 668006 666034 671317 720610 717337 713218 767972 818514 835340 825583 815610
20143 815610 787995 754739 733696 702340 695721 711060 776845 757185 772259 749570 775810 759299
20131 759299 736728 742888 774811 737761 698482 757359 772668 763167 721750 738624 779702 751804
20119 751804 771252 789529 802108 802634 781956 784838 784065 802394 817421 804838 798580 854471 867622
20106 867622 871380 860567 875456 874790 928864 919097 843982 852161 867860 879795 894977 884819
20094 884819 869778 866544 890481 867973 891538 878676 873990 969790 948678 923023 917635 941328
20082 941328 956296 932039 948102 971960 1011314 1030629 1005169 989926 967707 945313 948372 960085
20070 960085 946812 936950 968269 1014712 1000208 1015967 997582 1055898 1044322 1091270 1124316 1098422
20058 1098422 1055562 1068426 1045063 962151 945011 945901 1009674 1078453 1070121 1057787 1018451 1035437
20046 1035437 1101322 1121891 1112861 1084344 1071750 1085299 1112005 1116451 1149119 1105073 1087466 1103838
20034 1103838 1146333 1179094 1184432 1187599 1230091 1239855 1166117 1191508 1200337 1226907 1266762 1230994
20022 1230994 1212191 1223942 1240605 1217743 1229708 1210183 1230956 1256332 1291563 1313609 1313147 1267681
20010 1267681 1261288 1301894 1290586 1286795 1289316 1276093 1294006 1321288 1317585 1314730 1300218 1272638
19998 1272638 1236776 1229118 1263670 1296212 1330736 1364145 1357545 1353692 1331821 1289804 1331762 1359717
19986 1359717 1388293 1406780 1360650 1350678 1369088 1436670 1470895 1453839 1460147 1446701 1427331 1411873
19974 1411873 1401248 1414550 1462413 1469929 1492831 1483680 1440430 1412708 1376967 1387358 1443276 1530603
19962 1530603 1507138 1498421 1516717 1541854 1566257 1558231 1513860 1552064 1545825 1526332 1450877 1427959
19950 1427959 1430994 1494462 1569389 1633481 1630235 1605494 1624930 1658106 1698860 1725968 1723699 1709136
19938 1709136 1695706 1731987 1756361 1788000 1765690 1744824 1763562 1778390 1801592 1828824 1846959
19927 1846959 1829453 1861669 1902961 1876045 1862354 1893333 1953068 1969113 1947727 1893072 1913392
19916 1913392 1985313 2013158 2081444 2028484 1964888 2057169 2147937 2128240 2112487 2139942 2107345
19905 2107345 2016451 2025168 2008911 1991155 2057168 2086589 2176552 2228204 2225892 2249197 2253375 2238272
19893 2238272 2206052 2169950 2170552 2192486 2214859 2225698 2285434 2302232 2296520 2326582 2369349 2429473
19881 2429473 2428932 2426287 2471672 2472941 2498309 2489982 2468439 2476665 2499491 2524008 2546473 2585442
19869 2585442 2588672 2552698 2517517 2540255 2543301 2570719 2610457 2665018 2727119 2724612 2750315 2801149
19857 2801149 2736237 2751767 2794576 2828502 2860390 2910009 2975019 3065779 3087641 3047602 3042236
19846 3042236 3023671 3013644 3047785 3101717 3164905 3199119 3248749 3249675 3219843 3214957 3193329 3196613
19834 3196613 3240865 3297454 3343272 3411903 3450599 3417537 3475631 3546991 3511646 3516402 3541915
19823 3541915 3558155 3590347 3607737 3626917 3700804 3772922 3782345 3846316 3857302 3825492 3860161
19812 3860161 3854599 3874137 3906768 3939270 4003859 4085837 4136126 4132139 4152599 4159308 4147524 4186276
19800 4186276 4233922 4284328 4301639 4299922 4353813 4388764 4413456 4438286 4503750 4489899 4519773
19789 4519773 4554505 4591958 4663148 4740269 4792059 4768331 4754056 4785325 4872913 4925714 4969342
19778 4969342 5029493 5043767 5137088 5188642 5146488 5267559 5381025 5409523 5470499 5514990 5549232
19767 5549232 5618955 5677879 5655363 5672011 5730802 5777656 5847182 5905790 5942401 5992995 6053276
19756 6053276 6084683 6178054 6290532 6386668 6447831 6450063 6511773 6642998 6706708 6760751 6840210
19745 6840210 6910281 6996757 7101732 7178003 7194542 7275395 7334906 7435379 7605780 7681521 7741799
19734 7741799 7796792 7891666 8005434 8127247 8271673 8330743 8361488 8425977 8574277 8681328
19724 8681328 8775435 8883129 9002556 9163890 9297046 9466875 9562228 9612891 9723158 9818784
19714 9818784 9941363 10105917 10257572 10405438 10514957 10691184 10867832 10945145 11043918 11231871
19704 11231871 11381298 11593373 11762906 11901137 12074134 12281946 12439323 12623594 12863253
19695 12863253 13036322 13224370 13371327 13533884 13754868 13957641 14122629 14286490 14525596
19686 14525596 14771742 15008078 15261259 15515671 15806188 16061538 16273987 16536994 16816500
19677 16816500 17116163 17409762 17694416 17995700 18328103 18675759 19032798 19343455 19656289
19668 19656289 19995095 20326094 20755588 21164193 21515577 21812734 22200708 22647059 23123708
19659 23123708 23609761 24086792 24621892 25161840 25647605 26139434 26668809 27230911 27839357
19650 27839357 28482830 29060493 29664544 30281704 30952001 31675787 32412624 33148470 33913111
19641 33913111 34709837 35465401 36258463 37109257 37985396 38927743 39897655 40938695 42002436
19632 42002436 43102887 44210962 45338928 46527855 47714368 48981011 50278268 51663974
19624 51663974 53098951 54552829 56071931 57622181 59292430 61036514 62909481 64891308
19616 64891308 66897450 69013370 71283681 73584864 75980380 78363566 80755982 83212357
19608 83212357 85691648 88197700 90758918 93399062 96217240 99225942 102346456 105446237
19600 105446237 108540696 111705212 114909395 118170534 121414992 124621892 127874245 131189114
19592 131189114 134606832 138122923 141667999 145190545 148653276 152131290 155535162 158826747
19584 158826747 162005194 165030623 167968887 170772675 173320844 175670372 177857379 179767180
19576 179767180 181415930 182667781 183595690 184278313 184710330 184771835 184513067 183933016 183089774
19567 183089774 181968263 180526931 178850408 176953703 174816493 172408297 169784464 167061782
19559 167061782 164216610 161247071 158141769 154897339 151598976 148233848 144845333 141423761
19551 141423761 137968738 134539060 131117541 127719895 124337322 121029856 117722329 114471913
19543 114471913 111310743 108239004 105115327 102100238 99243293 96385294 93533666 90824011
19535 90824011 88212414 85634229 83172472 80836319 78520450 76285784 74175956 72091414
19527 72091414 70075876 68130595 66166051 64221931 62344198 60577506 58973253 57405533
19519 57405533 55810821 54250307 52819365 51436546 50072062 48743776 47468460 46210316
19511 46210316 45016614 43882926 42823086 41746830 40696524 39703827 38722227 37789808
19503 37789808 36877821 35991232 35165169 34407302 33535012 32709275 31952101 31304015 30679312
19494 30679312 29984294 29290144 28631040 28043313 27502703 26922171 26380027 25796773 25225685
19485 25225685 24676157 24152939 23680041 23210195 22843424 22407842 21967622 21571755 21169510
19476 21169510 20771152 20373398 19966356 19551997 19198868 18880448 18535455 18224159 17941185
19467 17941185 17664315 17351970 16991189 16666009 16417548 16178728 15910146 15669639 15396411
19458 15396411 15106700 14869711 14612536 14395798 14140285 13956569 13784031 13573212 13307380
19449 13307380 13112774 12982376 12772342 12615853 12438596 12248204 12087673 11923522 11704690
19440 11704690 11480636 11298937 11150273 10952883 10803518 10694095 10557816 10407770 10239773
19431 10239773 10108399 10050470 9965686 9817922 9651778 9540002 9434843 9283807 9097582 8953222
19421 8953222 8873809 8778915 8677921 8615816 8537584 8426290 8261993 8088021 8011071 7921485
19411 7921485 7806290 7724086 7636825 7501065 7430501 7344991 7337510 7266294 7162974 7054897 6974423
19400 6974423 6872028 6757451 6673777 6586078 6525416 6404204 6365699 6299981 6217547 6139443 6087393
19389 6087393 6039934 5941099 5865077 5820948 5734962 5649179 5677462 5646833 5552849 5465790 5414347
19378 5414347 5403294 5313796 5251163 5250132 5201903 5199420 5181580 5107573 5038423 4950574 4837345
19367 4837345 4758729 4745835 4699746 4718278 4701598 4600908 4519018 4453812 4433892 4412876 4382358
19356 4382358 4341883 4251199 4153877 4104385 4104738 4073215 4053280 4027942 3974236 3937782 3859411 3832145
19344 3832145 3815872 3744093 3648118 3564602 3522607 3529738 3550888 3540060 3506071 3511585 3501912 3439512
19332 3439512 3404772 3356466 3263761 3267319 3288790 3262126 3230529 3226331 3257651 3246899 3235003 3201767
19320 3201767 3148763 3080412 2981521 2981661 3038046 3099491 3062062 3045005 3009596 2961530 2897561 2869154
19308 2869154 2881827 2869646 2892693 2843815 2805899 2795373 2794890 2798792 2726601 2686302 2689297 2705670
19296 2705670 2685666 2620402 2556076 2500611 2458610 2455796 2438123 2408821 2395329 2363236 2341172
19285 2341172 2357333 2359548 2318538 2250693 2184682 2190721 2198786 2270582 2252356 2176242 2169399 2239226
19273 2239226 2319613 2288760 2228508 2234974 2236832 2192236 2185497 2221503 2301885 2390567 2427275 2415775
19261 2415775 2414094 2416661 2424886 2357996 2311368 2311165 2314091 2369603 2391622 2405803 2362855 2273006
19249 2273006 2203610 2152868 2087101 1995184 1890975 1867836 1899745 1963349 2000447 2001598 1990895
19238 1990895 1977337 1955675 1998659 2055938 2000520 1935027 1938235 1942530 1976901 1979150 2018799 1989209
19226 1989209 1973001 2015180 2054975 1967615 1918094 1866337 1843605 1861666 1833075 1812300 1812633 1804990
19214 1804990 1772441 1711622 1651411 1660244 1674069 1696049 1667600 1634802 1607770 1622840 1569578
19203 1569578 1566581 1528192 1514434 1565231 1596730 1670174 1671776 1566785 1575861 1559651 1533803 1531701
19191 1531701 1541155 1498418 1464828 1483231 1515012 1533613 1521847 1513836 1467863 1443616 1407059 1402061
19179 1402061 1398289 1446127 1479103 1405760 1400754 1392441 1377064 1371366 1418432 1441488 1413321 1345485
19167 1345485 1315228 1303960 1293977 1333407 1384088 1402377 1365581 1389525 1390006 1296996 1199146 1177314
19155 1177314 1181973 1234933 1293966 1266867 1242203 1177628 1193960 1206212 1146089 1099074 1116950
19144 1116950 1190683 1234758 1199908 1191286 1172943 1115926 1152046 1128170 1173647 1231134 1287786
19133 1287786 1250180 1225797 1181790 1189102 1217186 1182941 1179743 1241938 1257458 1303707 1342228 1364245
19121 1364245 1392322 1398454 1438668 1447811 1418976 1376198 1430739 1498035 1518860 1534212 1569414 1611664
19109 1611664 1657491 1593084 1574175 1605048 1583180 1488659 1461467 1494849 1509546 1550364 1537384
19098 1537384 1518629 1523318 1505025 1446850 1420766 1323717 1338959 1357051 1309148 1250880 1228538
19087 1228538 1231767 1226155 1244549 1287082 1355953 1400406 1431849 1456208 1523963 1587400 1585780 1545668
19075 1545668 1554434 1573090 1566830 1553786 1572517 1602157 1603949 1674300 1740716 1732703 1721708 1728142
19063 1728142 1702796 1637883 1597130 1654213 1691472 1720096 1717215 1674596 1674283 1690627 1750636 1754317
19051 1754317 1698481 1706481 1769995 1812898 1817696 1818680 1779524 1800636 1851577 1861676 1874570 1922161
19039 1922161 1974632 2057604 2122290 2123875 2161160 2249565 2350479 2390343 2443736 2617602 2773896
19028 2773896 2996269 3319436 3644909 3985712 4348875 4582158 4717031 4873150 5005642
19019 5005642 5093625 5242778 5378204 5564553 5853938 6202752 6446788 6671546 6813641 6970553
19009 6970553 7074852 7122491 7271692 7520518 7853574 8339363 9094954 10102878 11412350
19000 11412350 12880070 14234997 15306456 16306606 17451498 18645817 19826795 21184043
18992 21184043 23134582 26252845 30730498 36615632 44421281 55708044 73537059 102460174
18984 102460174 148081813 213752553 287941766 338238945 350621430 354063129 374775080
18977 374775080 385878146 357510116 308739509 285265239 303324363 353005111 399914802
18970 399914802 410874443 396529767 394819093 399044105 370607858 303482901 232684592
18963 232684592 181455566 147377132 124074538 107667788 96051263 87294659 79608851
18956 79608851 72536305 66580114 61678449 57185200 52504441 47738245 43236833 39253020
18948 39253020 35703870 32302240 29015094 26028358 23410921 21136542 19197326 17537653
18940 17537653 16136621 14962126 14072985 13398654 12798956 12127669 11430572 10764758 10212653
18931 10212653 9593516 8863996 8127589 7575885 7232176 6917740 6614414 6288084 5968178
18922 5968178 5720341 5466043 5032139 4594103 4196541 3857650 3547300 3258989 3045587
18913 3045587 2847680 2726796 2566034 2426113 2298983 2216233 2133334 2051752 2003984 1947389
18903 1947389 1828330 1667561 1564832 1498647 1481336 1416028 1362825 1265971 1226413 1265004 1313128
18892 1313128 1279192 1255003 1204885 1165132 1151447 1133404 1099700 994655 1003333 1004805 926460
18881 926460 940693 949067 937141 918961 887732 834884 818743 881543 863500 816689 768733 774564
18869 774564 762720 814331 848350 855934 875262 883845 874336 872190 887796 931255 999378 1066643
18857 1066643 1078876 1111063 1139527 1147043 1131724 1075726 1032477 1039372 1043191 964657 948830 963631
18845 963631 955659 901877 875329 804669 737339 630927 575924 529262 465560 437718 458829
18834 458829 454234 436186 438804 385693 345636 347478 351250 331495 336430 350375 365453 377226
18822 377226 435845 484938 490942 544814 525962 515992 500316 554722 565555 519385 473877 485898
18810 485898 538708 520087 507245 531773 566710 582351 611486 603683 583049 557309 554503 546599
18798 546599 533010 541738 537881 489636 502526 517891 480952 453373 448953 479334 434385 410134
18786 410134 407190 460075 461124 400304 327922 270484 275785 291208 247662 215054 226224 213122
18774 213122 188731 190564 216148 235489 226139 249038 261391 210544 176095 174948 191814 175786
18762 175786 149056 146583 187244 172744 164272 212506 221985 193982 183003 139650 168559 194862
18750 194862 221285 200766 142277 106627 137945 182972 163848 74984 23526 -4580 36228
18739 36228 66517 54967 81059 117811 149842 70940 76184 81201 97111 153198 154628 116743
18727 116743 109241 119443 136667 162626 150812 186521 233048 220219 265974 319161 252569 204910
18715 204910 218111 200537 255790 235924 192034 196626 205154 166294 127769 179158 197710 190253
18703 190253 151597 125355 73601 10657 -29141 -4507 -4826 -19639 -4315 53933 64386 73494
18691 73494 94221 98399 77884 75811 89129 123223 149197 146088 74207 13565 56251 115247
18679 115247 149979 156247 156962 133480 84995 108742 103069 94868 101210 121835 98477 100853 109657
18666 109657 82537 124379 181785 218231 218981 211200 203682 162869 123379 94673 131475 160136
18654 160136 134742 92170 125056 119666 105748 58776 36360 19711 -3754 -38638 7444 3647
18642 3647 31365 39561 49074 89681 57664 -13819 -8124 66343 80646 134450 196317 132876
18630 132876 82481 78747 102431 124257 121626 12244 -27916 40381 86984 85043 56362 88046
18618 88046 106674 76289 34625 4098 95079 90678 12272 14103 30076 12094 18958 29838
18606 29838 36329 85584 109668 75239 48865 12517 40508 5150 -17371 543 24221 13673
18594 13673 6232 28199 44611 65356 45809 -4173 -20423 64877 89944 102812 81095 80317
18582 80317 96956 109599 146156 126885 111478 89480 85553 81334 150634 190105 178254 152567
18570 152567 176171 163921 83018 38950 76705 73096 95700 87995 102078 94706 19146 65382
18558 65382 133890 205408 142285 85732 101188 109364 102972 97741 87490 53162 51872 88129
18546 88129 56972 20300 23751 60484 65445 96854 132250 142769 145171 141817 148101 117826 39251
18533 39251 20934 88407 88183 50037 7069 26327 42310 42623 26941 -12043 -25056 -5670
18521 -5670 -7984 -42107 -59186 -28412 -21313 -43025 -75234 -49616 -28505 -41899 32069 84035
18509 84035 98167 91095 87784 13223 -39747 -6542 60495 61009 58030 96099 90285 95023 106505
18496 106505 98313 100517 131192 152659 154855 134932 57606 41116 40804 18298 -35917 51483
18484 51483 124513 140027 170215 113638 29012 10222 100665 120772 65789 114305 128611 140478
18472 140478 164431 210058 228240 160656 117960 99257 62423 77856 165055 124036 95298
18461 95298 68532 40779 28272 31160 51914 105397 124445 104372 129059 177284 189837 144421
18449 144421 91686 115737 143028 80996 116413 158933 139138 119504 152258 109391 76881
18438 76881 72947 72163 73625 51113 22585 55446 49167 65287 81605 76945 81572 77937 98189
18425 98189 107249 94642 76669 81731 67657 47885 50177 -25188 -48702 47021 32815 16491
18413 16491 32785 40587 126550 161711 169136 156191 171266 122453 87465 92809 60171 74931
18401 74931 85024 69767 102932 107721 67505 73864 73711 73026 114457 104243 96333 89292 126580
18388 126580 138351 164606 187245 292216 345380 369156 442719 472564 427989 405008 429223
18377 429223 429639 351708 266089 290126 297973 252495 231499 261302 298668 309758 343425 354973
18365 354973 355609 333833 353858 471622 607841 641905 628879 593819 632456 697863 704311 663560
18353 663560 713202 742221 843220 1004219 1207799 1561348 1945319 2189981 2427616 2729120
18343 2729120 3041579 3294558 3367759 3230778 3077491 2959361 2805153 2660793 2519640 2518662
18333 2518662 2615604 2755283 2888962 2976024 3099898 3261216 3391465 3419118 3313147 3101797
18323 3101797 2958442 2772059 2596402 2345737 2063283 1742474 1443825 1202787 1058216
18314 1058216 959617 910106 858757 763980 667640 624351 625082 574029 493413 492402 434185 380754
18302 380754 305016 293877 271757 266652 298917 343308 338853 310087 284539 316528 314150 298185
18290 298185 249521 285396 273597 259638 249431 282258 282194 292057 306961 319148 295906 186723
18278 186723 152254 116333 135262 175637 231643 222092 212916 204334 158221 137237 140426 204161
18266 204161 240248 243881 227509 213006 174103 148804 135665 126753 113746 133305 158292 142535
18254 142535 112103 100429 88881 125351 128394 110355 141193 196308 225175 217057 197849 137113
18242 137113 93325 91612 97569 119407 178414 198211 215246 205170 177009 121192 86877 111261
18230 111261 138630 74939 79058 117775 87780 67382 83655 89255 94440 41489 34130 28556
18218 28556 88712 144336 79347 38657 67421 56242 64739 72378 92520 101753 111940 102154
18206 102154 61263 8409 8826 2887 43410 62961 2438 -27240 -60603 -68558 -44914 -9987
18194 -9987 23067 53886 39275 30878 51716 42088 76936 93817 88660 96689 64103 50357 57822
18181 57822 31318 31903 69583 88228 96114 87682 59789 27542 6681 -1499 10002 67082 57741
18168 57741 88019 117421 76254 60379 41269 33870 37932 15967 41345 52071 6340 -23502
18156 -23502 -14961 -10661 -13510 -51238 -22483 23660 26347 23906 23685 65358 66810 52603 26700
18143 26700 4216 -23008 -25546 22559 52647 33118 47911 104938 119054 91117 83308 70562
18131 70562 44377 27128 85500 56535 42554 60440 72172 86586 47090 9139 29239 83032
18119 83032 102230 77908 99867 97774 109115 106684 96065 80844 50664 53166 19133 -7778
18107 -7778 -29337 18152 27962 55142 25976 -56382 -96252 -103565 -119915 -106366 -24272 97194
18095 97194 110671 95933 28363 19923 56225 60388 108033 44380 -17203 -49504 -9684 1929
18083 1929 33888 62768 13008 -54985 -60304 -49526 -24823 18713 61692 84561 74828 56783
18071 56783 23294 51369 96318 140354 99946 64483 71417 60193 91245 163089 137779 87947
18059 87947 110294 128881 146383 217491 231940 253322 253414 213940 194077 164613 103985 80830
18047 80830 91457 62330 125457 137577 131141 104717 142959 196823 214309 172425 157359 180611
18035 180611 173808 210529 257054 291419 328588 350665 318473 254819 223343 230370 180646 127796
18023 127796 132699 153579 199258 213443 200971 189756 170876 172196 89746 59365 116409 181215
18011 181215 148469 133006 101768 54617 -1069 37721 17258 -20730 -36045 6201 42732
18000 42732 30195 46352 84784 116307 183462 203565 195931 157668 87062 26470 543 21085
17988 21085 2109 -16235 15193 8331 9210 -11742 -57104 -48055 14636 -10317 -27158 40568
17976 40568 90076 97834 70069 24246 22635 35125 9414 -39352 -46798 -60635 -69964 -62822 -107415
17963 -107415 -57057 -43170 -61257 -62168 -9420 -10820 35189 81716 97045 96199 125580 134239 87964
17950 87964 91777 117045 163186 171603 136872 105425 35590 26507 49144 101471 180903 203262
17938 203262 221708 299324 310937 372455 446370 464816 479007 489421 508391 468333 455927
17927 455927 474348 442932 331923 250649 185848 178581 202436 208919 235727 214294 251313 248987
17915 248987 272553 342784 434845 480830 531386 574491 592143 537925 469522 455231 424377
17904 424377 342178 274837 190491 181989 235316 286921 309351 342691 395624 350857 382314 428853
17892 428853 493966 516464 466782 471986 507034 553754 581122 587977 590338 568158 499287 492664
17880 492664 515128 509485 488816 573449 615905 624696 675194 694869 649408 633494 657902 676998
17868 676998 642641 604709 561486 560894 561250 615001 655115 751018 830913 809970 802378 839976
17856 839976 916558 949229 966621 1041997 1112034 1132992 1210239 1244364 1299684 1410470 1560905
17845 1560905 1760514 2004413 2322043 2710686 3169655 3457220 3545975 3716393 3880160 3921674
17835 3921674 3836710 3701610 3637439 3665037 3777642 3985284 4282497 4636389 5157518 5832863
17825 5832863 6513783 7176755 7876447 8722568 9784554 10715451 11426185 12130037 13106469
17816 13106469 14336782 15678408 17237228 19245168 22058624 25975529 31600900 39927252
17808 39927252 52868768 73465259 106391876 156731067 224052732 289595256 323808116
17801 323808116 325804724 328672194 343294909 336792932 288753943 222590289 170139983
17794 170139983 136181632 115011428 102191902 95103941 92191976 92777969 97241676 107647210
17786 107647210 127532560 161830747 215307474 285121941 346105611 368471378 360503074
17779 360503074 359994657 368335240 349435437 290778173 221590444 168804433 133859012
17772 133859012 110960267 95520316 84981509 77455763 71353177 65868537 61096264
17765 61096264 56972108 52876171 48508343 44194428 40253099 36666079 33388992 30371501
17757 30371501 27671443 25207658 22763094 20465510 18494150 16847919 15504877 14529381
17749 14529381 13767750 13061774 12315320 11587791 10969294 10492589 10034578 9569157 9124172
17740 9124172 8708836 8205085 7707210 7336585 6984172 6546992 5944565 5335948 4899231
17731 4899231 4548072 4207335 3955097 3738356 3526847 3333828 3162358 3004613 2813997
17722 2813997 2591261 2440253 2360322 2364352 2330088 2248815 2173774 2119567 2026389 1917685 1824954
17711 1824954 1783499 1699861 1650468 1570654 1505330 1507415 1478431 1476415 1454870 1435036 1351021 1313026
17699 1313026 1274105 1260434 1231599 1233103 1255137 1287577 1249192 1226653 1246319 1250236 1253288 1156849
17687 1156849 1130218 1126735 1196220 1201076 1173358 1223326 1285692 1359799 1334452 1377622 1385407 1364282
17675 1364282 1366012 1305655 1152133 1047187 958013 899313 788304 719111 744799 781164 799400
17664 799400 800090 877925 927155 963409 1051456 1104817 1097292 1078943 1074859 1107935 1122121 1045663
17652 1045663 884466 797705 766797 717503 636894 614939 583636 523156 481703 528869 568468
17641 568468 592319 617635 598904 616224 553550 526105 563657 565434 545617 521595 502284 451808
17629 451808 472145 457878 490647 476166 470965 492440 559446 589375 592948 581727 608797 646501
17617 646501 664535 618131 602523 648210 643547 659280 639456 594509 518459 440587 402641 389409
17605 389409 385067 362595 376542 371046 333908 326817 330947 385797 448604 431898 401659 446156
17593 446156 391032 357415 352618 342260 270526 270695 332038 379589 351312 326877 298612 236225
17581 236225 205693 185797 195277 169360 168541 180028 160809 178438 190026 240840 252302 248783
17569 248783 277907 271365 249584 172114 161431 196464 203910 161512 170866 142119 143480 153128
17557 153128 160074 146804 155206 182940 193862 185401 227017 287002 297642 357977 355401 394299
17545 394299 364001 313629 335663 343894 367728 337007 264849 317031 410379 405479 408154 363844
17533 363844 388995 396211 389455 410564 391782 405152 434277 457459 470857 419467 394344 448184
17521 448184 524150 564674 589452 615920 602142 575095 590760 616728 653750 738122 768128
17510 768128 755777 817090 895667 919466 941860 971870 1003600 1048636 1025520 1056970 1094142
17499 1094142 1149089 1236179 1245343 1285622 1374864 1391241 1394373 1419152 1430463 1405355 1388671 1406677
17487 1406677 1468153 1498855 1553932 1588683 1566255 1521328 1530091 1587523 1650774 1686677 1748285
17476 1748285 1708015 1599843 1574598 1601600 1551011 1495596 1465221 1426771 1411061 1364311 1338230
17465 1338230 1332328 1263853 1255649 1230621 1216592 1157070 1132417 1150141 1101840 1047772 980020 933315
17453 933315 914222 879656 835293 764882 732597 701485 674684 743609 751218 699989 692369 698432
17441 698432 685062 692858 661376 623788 576520 554693 621025 601313 556469 611407 605783 597089
17429 597089 629844 665816 728830 792902 916715 1120214 1309308 1454543 1470269 1414488 1336622
17418 1336622 1206132 1070168 1075978 1097473 1168739 1327191 1442752 1513338 1486247 1365163
17408 1365163 1280033 1216438 1185673 1184131 1246621 1370884 1525378 1588077 1558172 1431885 1256637
17397 1256637 1117820 1052995 1078395 1112022 1149487 1237601 1296367 1282959 1223148 1115435 992303
17386 992303 824160 708336 609350 534218 471064 435658 459985 427752 380333 351047 363598
17375 363598 335495 298563 284056 267258 248379 289336 233367 153630 162619 150301 180849 242047
17363 242047 245693 266907 179226 111201 88544 45773 63690 71701 105900 97008 49383 -14543
17351 -14543 -14946 25799 38481 42951 40453 19302 56437 74443 50715 24113 -5723 -41740
17339 -41740 -61368 -59821 -54547 -17335 6701 26372 24259 -13215 5624 -5114 9189 64842
17327 64842 85106 83440 63756 74168 61750 24829 41692 33569 33303 57763 114455 107216 106218
17314 106218 39125 -16743 8229 25657 40921 16706 -8665 -8925 -51217 24223 33768 44348
17302 44348 36886 75573 50696 -18907 -71635 -94813 -50531 29760 84992 81336 97379 104931
17290 104931 56709 43094 37387 67895 46747 22271 24537 -58533 -75932 -83635 -31140 -42200
17278 -42200 -34730 -42706 -70763 -76708 -29762 -57248 -68073 -65705 -54951 3360 46550 80902
17266 80902 73229 82450 116117 196873 267109 255983 203277 228483 287010 413437 616279 819572
17254 819572 1039648 1254147 1418452 1501620 1515548 1519243 1510654 1351779 1146211 1028776 910983
17243 910983 739712 621757 614569 608872 564280 564572 619663 732113 919704 1106201 1340928
17232 1340928 1551021 1679486 1769330 1828352 1798261 1720714 1547054 1338426 1092380 829849
17222 829849 646923 531504 474615 442166 404921 360543 316748 282784 260869 217125 206191
17211 206191 239892 239552 222924 233540 204915 195071 162304 132633 112653 98486 66403 55017
17199 55017 27867 29710 104937 173882 161213 125121 112087 96021 52876 11903 -19803 -25336
17187 -25336 26910 20136 71618 136902 147518 98198 23817 -2269 -40500 -69948 -52354 -22927
17175 -22927 -36467 -40026 -71355 -68151 -41574 -21217 48051 52132 24619 -29803 1377 52287
17163 52287 40227 24141 -50159 -83031 -87854 -70663 -37579 36297 60343 46823 16983 36356
17151 36356 70525 79675 69457 44536 7934 21231 237 -13267 -62356 -68776 -42754 -29894
17139 -29894 9287 17263 39704 61435 125917 138616 128052 184774 207203 236837 187546 181741
17127 181741 261603 279458 252983 193939 196223 161208 108199 96384 39893 65235 98276 188262
17115 188262 218785 218450 215015 272403 341435 330927 280337 295528 265663 254094 252103 273208
17103 273208 278371 286167 253636 243304 275102 194987 188765 291089 341163 377658 383449 358824
17091 358824 271812 236310 216604 258587 306981 331307 339759 345649 365273 375776 311970 262013
17079 262013 255970 284190 272056 234829 238480 294630 320722 315869 258159 259152 251248 259246 272013
17066 272013 244913 268615 233801 265307 327249 284462 277434 250985 242977 245827 215987 180973
17054 180973 136827 193727 249904 260970 207888 181001 193297 160479 130246 124122 120012 80778
17042 80778 67950 38564 16494 34469 23291 18804 29476 -31962 -55312 -5493 -13053 -30703
17030 -30703 8988 48502 58866 71332 89118 36000 1047 5307 42761 54226 51054 34804
17018 34804 44072 87577 100470 125075 156337 180295 238110 291951 239477 235148 226849 194830
17006 194830 197534 211924 263410 306456 383394 441293 441622 381211 343139 332086 256951 279703
16994 279703 330269 348446 368736 397856 400872 345859 315723 341572 323158 270663 250967 337066
16982 337066 413696 440418 489948 499947 460305 422120 400568 377144 413012 423657 447000 486813
16970 486813 469329 407603 320432 299898 325750 291637 232199 279305 249772 218750 203872
16959 203872 266924 291645 344027 355505 372295 371424 368747 419117 466050 480116 506828 454068
16947 454068 396038 327744 317344 302260 302555 345330 379537 431372 409076 357322 293420 280598
16935 280598 295016 303906 354125 428536 434291 442081 494216 422355 356419 340449 459174 462220
16923 462220 520857 605373 671917 716007 708904 758294 830611 897933 1013291 1138696 1223201
16912 1223201 1272462 1411799 1639076 1924560 2225956 2575145 2830891 2966083 3097846 3239043
16902 3239043 3467235 3854877 4307052 4613333 4814262 5102021 5446698 5712437 5952259
16893 5952259 6412397 7199325 8036108 8622720 9045134 9550560 10385965 11520059 12833367
16884 12833367 14345664 16406808 19296949 23280628 28821077 36949791 49996585 71909418
16876 71909418 108241122 163704620 232520311 281415728 274497799 221988629 169649155
16869 169649155 137563164 123483536 124946377 143241547 181513932 238502525 293301553
16862 293301553 307228390 269508083 214224672 173152687 150086462 142608809 151001588
16855 151001588 178044286 225043471 280640816 310166239 288300323 234003186 186056616
16848 186056616 156354716 142487817 143384230 161278081 199621285 255175100 301247817
16841 301247817 299045998 247252731 186964201 143272542 114449793 94975656 81339673
16834 81339673 71372554 63654290 57522275 52755318 49195401 46418223 43450761 40038180
16826 40038180 36621516 33541372 30806250 28213509 25530903 22926013 20675260 18823525
16818 18823525 17259705 15882811 14791219 13916179 13185011 12368165 11489149 10651574 9793866
16809 9793866 9040921 8463936 8045478 7692560 7467176 7271607 6959883 6549960 6087236
16800 6087236 5647080 5224942 4820876 4495990 4272587 4086326 3911873 3749430 3557212
16791 3557212 3427345 3311456 3153627 3037322 2928546 2789062 2649503 2595154 2532082 2444329
16781 2444329 2400726 2431840 2383689 2344528 2233337 2072668 2039368 2065067 1959910 1901926 1926346
16770 1926346 1936356 1907364 1852024 1791047 1773301 1724360 1651555 1619042 1617001 1615486 1600131 1606817
16758 1606817 1603352 1549385 1552540 1565626 1546187 1533398 1500752 1521862 1586539 1648010 1702953 1670541
16746 1670541 1628494 1573312 1468801 1396988 1394865 1458073 1455192 1443848 1468407 1492416 1491791 1499653
16734 1499653 1453724 1349217 1282773 1279206 1298738 1315536 1329000 1314224 1268910 1249580 1186690
16723 1186690 1135081 1077582 1047550 1097002 1156570 1198085 1217625 1190245 1105850 1145840 1108744
16712 1108744 998186 916283 890676 901952 913486 914204 916834 835247 753944 750977 766520 756279
16700 756279 771158 820054 788672 780652 864551 885990 818174 828275 805377 773086 805127 754890
16688 754890 688755 668370 706418 704551 674895 688336 735059 729739 679970 643943 633833 614376
16676 614376 643182 632361 570965 519489 465522 479297 502742 490323 529424 559237 539239
16665 539239 499641 494483 482260 474716 512690 442515 392752 387167 385259 413704 427613 380022
16653 380022 333328 305655 337364 339829 320957 322557 343958 348085 331795 308482 307940 318012
16641 318012 363149 341254 326954 365612 373361 368518 341815 304032 324795 336362 316036 266097
16629 266097 255104 252326 282890 329128 329671 311100 311602 283277 270405 330561 339642 313311 327263
16616 327263 339920 404268 413345 366259 347091 397779 379998 321355 260614 286745 306049 319169
16604 319169 304291 295359 259278 276314 293586 291828 306143 315716 303226 236592 209177 188827
16592 188827 160501 184457 216838 251390 235443 258839 237250 235562 256861 262622 255445 243338
16580 243338 257549 292570 245769 191259 202290 241435 251234 220450 195900 126501 100906 152510
16568 152510 256655 339464 376463 313616 318925 340727 335152 321353 332859 339882 357123 288443
16556 288443 285069 271475 222631 220493 192947 144482 154895 175979 157369 199396 254172 260681
16544 260681 233883 226393 218202 224300 243532 268022 284282 316597 228840 261161 295042 219607
16532 219607 165851 135671 125634 215507 284255 294644 255180 183163 192575 129616 97515 118768
16520 118768 158791 164130 179703 211298 226861 211045 202564 166103 140547 131697 109322 47837
16508 47837 85260 51370 -2198 -50584 -7144 17952 115986 189854 115760 107535 105510 78530
16496 78530 53661 35928 93306 103819 41269 51507 131565 185856 191797 175222 147092 163363
16484 163363 148525 150601 197302 186360 139567 130244 104224 112290 135179 152287 142104 145441
16472 145441 209885 207666 208440 156997 130326 128717 179461 152663 162650 127664 95356 117450
16460 117450 150233 163729 153010 130145 181248 195089 139779 154447 208409 185430 163153
16449 163153 208186 265358 222890 140703 105849 71191 99512 110166 93858 154871 171903
16438 171903 103537 110827 187056 198691 124475 113906 164439 188155 145165 101238 130100 114126
16426 114126 102729 110566 102236 79003 97628 20823 -25827 -47903 30245 55904 61755 47329
16414 47329 70969 74870 76445 78822 77426 56861 36697 22333 60554 118932 104534 98868 51927
16401 51927 38206 86159 108274 94233 84045 122215 180312 194840 181560 141592 169682 198590
16389 198590 130721 58472 -24220 7305 63779 81182 129120 150116 178811 183766 183980 142672
16377 142672 100517 76049 72722 113013 172915 112526 71936 48786 106484 150325 143611 143991
16365 143991 167492 130546 114429 69330 49764 78054 132858 173602 161939 125356 156605
16354 156605 143914 96361 101958 98817 98060 154991 171225 217088 240447 209521 148199 120183
16342 120183 122174 174754 178900 134566 75555 128875 175332 165496 142260 131220 147048 188336
16330 188336 268016 285334 263248 270113 282952 320361 369984 441546 558887 743304 917133
16319 917133 1087488 1205661 1239989 1193402 1093257 988072 912665 908242 975467 1096042 1269343
16308 1269343 1400022 1441632 1385289 1278133 1187968 1105248 1058822 1050418 1098342 1186785 1307175
16297 1307175 1384109 1345154 1256914 1171853 1100781 1022978 965792 963882 1070153 1200408 1258222
16286 1258222 1328971 1285838 1137966 943170 813591 741193 676183 597968 510757 489063 470476
16275 470476 392373 367091 365164 346132 304319 219975 173457 191381 139512 83984 103236 113939
16263 113939 114478 133508 143930 110334 97280 86057 90312 34580 6972 55 -36623 1393
16251 1393 130138 161923 165803 121505 70023 70350 75330 82272 105007 127352 161682 173617 135175
16238 135175 112864 101386 126008 103083 57976 28654 31644 14409 -9399 -11819 1477 10354
16226 10354 48143 73955 58013 25607 46147 20715 38353 83972 91507 117902 114613 94919
16214 94919 86403 78980 73654 101890 83989 58435 -46441 -66876 18382 77006 28380 -32447
16202 -32447 -60174 -67770 -22589 -6373 29622 -8032 -25050 67287 121710 125516 95076 33599
16190 33599 -14657 -8118 50332 41877 54322 31903 30537 77412 72264 79343 80923 109205 129438
16177 129438 133669 205233 212790 205674 189470 131316 102804 116333 63271 20121 -4066 -15903
16165 -15903 53 33994 59715 59196 130257 143846 87688 44177 62508 77625 106587 173827
16153 173827 197057 127916 67735 41324 28292 87177 81476 65126 68259 24864 55269 62318
16141 62318 27804 49977 -25005 -42416 -12997 26880 -20880 -62719 -44456 -49445 -52602 -37406
16129 -37406 -20414 -40363 -32754 -23434 -1849 38076 27221 -124 39653 49048 44558 57478
16117 57478 -8112 -28822 25618 78751 64571 10844 -622 14646 16909 4101 24023 19310
16105 19310 37698 22609 16231 59997 92194 79911 84230 69473 38087 21767 24749 20961
16093 20961 43778 37055 18740 24159 10505 5755 -14296 -25261 -73024 -37335 21345 56731
16081 56731 20827 26019 71792 36723 -34881 -23020 -34857 -9757 -4517 7878 18611 48889
16069 48889 59386 47912 102660 129316 96742 54646 18238 -4442 16545 16283 65862 78137
16057 78137 69652 32591 8118 -16587 -51843 -12344 10345 21325 22901 33156 13720 4475
16045 4475 24418 34915 22955 17360 53593 86859 109098 120871 82872 111059 24926 -57244
16033 -57244 -62595 -48017 -69346 -115537 -90590 -13938 29029 103449 91647 50979 11281 -1964
16021 -1964 -36139 5487 40222 108131 104933 33108 -6021 -14194 -41805 -4278 14034 79168
16009 79168 83038 41402 62756 20323 50818 86847 48087 49110 10803 17000 67158 103722
15997 103722 119669 90793 51935 114187 141024 141211 110689 100097 113417 112371 85627 61772
15985 61772 49528 75736 103508 73036 7662 5491 10402 -9745 -62778 -142384 -152693 -102607
15973 -102607 -42119 -34719 -13801 -2178 24880 48554 37405 29909 54268 34458 43451 30353
15961 30353 10266 -11115 -10141 -52269 -62679 -19607 25381 54011 76936 -8737 -46956 -9052
15949 -9052 32928 99989 67368 20660 26787 -23691 -19532 -52113 -106566 -82787 -57206 -2795
15937 -2795 30961 -1281 27762 82357 44560 -64077 -65300 -76637 -50548 6796 35909 24393
15925 24393 -15084 15777 -6491 -15490 3135 -11551 -73731 -84129 -77057 2122 24206 21941
15913 21941 -2947 -41701 -2894 75511 143710 90501 10531 -21404 -17200 -14664 6433 20305
15901 20305 -11241 23034 76722 82413 31797 -45405 -54772 7524 20508 15736 47238 60875
15889 60875 13338 3740 16205 58810 40272 44933 12135 -27989 -57654 -32421 26624 85212
15877 85212 40178 20397 -8850 -38096 -39813 -53657 -17762 56647 25207 -19303 -65514 -68901
15865 -68901 -45125 -55893 -78656 -50782 -8081 -40313 -40002 -37119 -10300 -9569 -53360 -17450 20991
15852 20991 34737 14504 -2401 27212 17055 -48315 -14463 3417 34509 -3503 -42998 -59338
15840 -59338 -103957 -99170 -34010 5437 -32751 -69481 -70259 -41672 -43529 -31513 51770 79203
15828 79203 66647 44643 11342 2471 26969 23467 45135 77563 99657 93850 57883 75513
15816 75513 51677 -34090 -22685 -30347 -64822 -76 37464 15139 -10620 -25515 -13206 -31401
15804 -31401 -61393 -63078 -43960 -61783 -59061 -15614 767 -51990 -76933 -54405 -38945 -68826
15792 -68826 -76159 -59395 -47331 -35975 -26026 -74023 -44224 16954 20900 -13664 -53168 -96289
15780 -96289 -92222 -75003 -40123 -55139 -34092 -27360 -18897 21768 17410 39584 5499 -34448
15768 -34448 -34202 8413 8659 -20569 -96191 -54861 -9022 4869 14178 31946 12583 -46517 -3417
15755 -3417 44437 52630 33301 17632 -11612 -29370 -13729 3301 -21294 -14805 20304 19504 9708
15742 9708 21229 4095 10846 1828 19760 19294 -34557 534 44523 32892 79288 140953 121285
15729 121285 64113 38824 53848 58662 28112 29603 -9200 -26601 -95748 -100909 -69314 -40625
15717 -40625 -40280 -45744 -41105 -68020 -73044 -66630 -64855 -68874 -78271 -110915 -108932 -48956 -32027 -25074
15703 -25074 -4165 -32872 -21130 -39740 -88952 -98609 -80298 -116837 -77573 -16715 -22962 -95956
15691 -95956 -96835 -37084 -31718 26602 66250 119916 131296 103143 85114 37489 -19424 -68552
15679 -68552 -104912 -73026 42333 89602 82345 150643 193357 146473 82788 67208 10225 -12022
15667 -12022 -27059 -12068 9128 42442 13570 -75071 -102998 -100445 -118546 -78970 -91809 -78022
15655 -78022 -35436 -5430 3479 -10613 -39512 -43751 -39945 -50796 -98544 -128040 -95042 -46886
15643 -46886 -27566 -48847 -64786 -89667 -130738 -58754 -10405 -23847 -63873 -56148 -35282 -52291
15631 -52291 -65551 -58594 -67771 -75519 -96960 -66773 -23820 -38990 -45124 -21011 -27844 -51234 -45734
15618 -45734 -46854 -61617 -87821 -64432 -48912 9490 54164 -19368 -2046 36202 -10989 -52419
15606 -52419 -52259 -70174 -70315 -63339 -75131 -60051 -26620 -60071 -107215 -121819 -94713 -68788 -33566
15593 -33566 -55319 -104802 -97052 -65360 -76491 -69888 -72340 -61537 -29555 5188 -12248 -6650
15581 -6650 -54446 -95674 -81058 -34531 -41151 -54254 -39257 -64991 -65899 -59082 -86521 -49719 -51669
15568 -51669 -45626 -23865 -31668 -26328 -17595 1966 -55403 -90705 -111106 -48131 -37462 -8318
15556 -8318 10630 -25441 -28933 -32029 -109400 -107817 -79476 -92363 -100179 -114734 -117283 -106909 -65048
15543 -65048 -20161 -8655 -15263 -39027 -45136 -102120 -86059 -38901 -12985 -46803 -89285 -59066
15531 -59066 -35602 -15772 -13321 -2678 -33510 -22320 53854 18218 -20902 19896 70435 55982
15519 55982 44374 -13982 -72943 -96656 -84560 -50769 10037 28288 527 -21327 -29001 -59210
15507 -59210 -94291 -85203 -38205 -21640 -44255 -17668 14868 21293 48790 11261 -44752 -72269
15495 -72269 18724 106111 119403 77256 14728 -29438 -75879 -86496 -83459 -56908 -53453 -33404
15483 -33404 -10776 -3923 -21511 -5250 -56449 -62534 -58284 -74123 -75265 -11955 -20770 -58496 -53792
15470 -53792 -57342 -46654 -46146 -35602 -32590 -32635 -48828 -41149 -5671 22292 23672 72329 87729
15457 87729 100429 78792 68646 100820 97242 34205 -86446 -105752 -81279 -59056 -24829 -18951
15445 -18951 -1502 -40200 -107538 -91807 -62541 -61574 -29598 4595 46428 39095 57734 66199
15433 66199 83931 55242 82423 86398 52577 13327 -34543 -32107 -33117 -15160 -19613 -46454
15421 -46454 -55114 -48477 -71553 -61040 -20950 -4820 -17618 -42716 -38134 -32206 -17562 -14632 -12774
15408 -12774 13578 15749 21355 34455 34701 -8059 -16395 -23018 -3175 -34822 -90937 -89989 -63004
15395 -63004 -58054 -29090 -13735 -6270 -18476 -59151 -38862 574 45078 70376 53567 -189
15383 -189 -66097 -99507 -109902 -63322 -32375 -59095 -34384 -11898 44778 4731 -22518 -5699
15371 -5699 26513 20592 -16967 -41223 -44461 -80788 -135048 -116217 -65824 -107818 -155587 -124591
15359 -124591 -104072 -89253 -24933 -4185 -4371 14391 3853 -16222 -55146 -113713 -111536 -111408
15347 -111408 -100574 -87344 -63575 -121201 -114720 -56113 -42772 -94362 -125533 -97370 -114710 -128348
15335 -128348 -66277 489 -7964 -12137 -42023 2251 77111 49524 -17045 -38704 -47661 -39350
15323 -39350 -68829 -95669 -116878 -136109 -92933 -49674 -53908 -65183 17036 42990 17096 -34879
15311 -34879 -77510 -114948 -118199 -99841 -113997 -85484 -66493 -65411 -65523 -104737 -82036 -73795 -93673
15298 -93673 -71359 -56826 -60442 -69698 4168 41713 26323 23347 -9939 -38829 -10233 34382
15286 34382 450 -49219 -98069 -87166 -72038 -73505 -87183 -70606 -69127 -46834 -39021 -4830
15274 -4830 30376 -7754 -40649 16678 24077 -177 -57727 -46949 -18942 -46617 -64129 4597
15262 4597 58122 62594 18482 14347 21452 -17178 1143 -2363 24561 37972 75582 84468 75488
15249 75488 49267 10437 -14940 -52573 -61309 -24816 -21333 -22125 -17006 -49234 4529 12187 38193
15236 38193 38043 56714 65484 17812 -11467 -16878 -26850 23015 11569 -15425 -17358 -1002 6419
15223 6419 13436 26855 -42613 -65804 -60423 -67000 -71271 -44455 25998 9205 -41915 -31367 -48325
15210 -48325 -71917 -63432 -54335 -79385 -104269 -85565 -30248 37265 80985 -34279 -86144 -104821
15198 -104821 -81052 7798 64275 51963 45039 18953 -28024 -90591 -114603 -50105 -13377 3858
15186 3858 7333 -28460 9846 17624 -9886 5275 -18421 -37103 -56594 -21916 -18060 -49222
15174 -49222 -21994 3249 2179 28593 40294 880 -64259 -77693 -75424 -64047 -28576 -49408
15162 -49408 -64662 -17581 -34428 -40957 -36204 -19247 -61925 -81441 -64807 -52126 -35388 23842
15150 23842 20847 -23714 -77551 -54520 21376 6605 -61662 -53232 3293 10623 1091 52144
15138 52144 45120 55894 65679 35739 -34203 -88835 -91002 -87400 -97518 -67095 25439 97343
15126 97343 39393 -55665 -103529 -57744 -89681 -38466 -8821 -32791 -63566 -78437 -75165 -45872
15114 -45872 -5157 -18791 -21205 -55557 -120534 -88176 -29898 -30226 -41432 -108849 -98169 -1372
15102 -1372 30841 -26576 -24192 -9682 44492 39816 51637 103603 120910 112745 89661 55441
15090 55441 42985 66701 30602 11807 66782 86249 140081 184402 186621 169026 53265 -5672
15078 -5672 12772 -40937 -77074 -34592 -19238 13026 43902 -40517 -80675 -53272 -27918 35982
15066 35982 61176 77084 67250 41243 24556 7233 23810 58200 45791 34814 27728 -34634
15054 -34634 -52654 -59137 -19932 -15127 -16984 -25964 -33771 33238 75309 80898 84528 51280 39463
15041 39463 66858 71252 49880 18496 -4692 6032 5383 6919 -3630 -6290 -52115 -84135 -44364
15028 -44364 35867 68441 77448 55897 33909 27202 -1457 2976 10590 22251 12451 -27011 -32408
15015 -32408 -46823 -51338 -3019 6656 -20357 -64744 -52349 14478 -19105 -38841 -29252 -57163
15003 -57163 -122634 -185448 -150101 -65508 -62421 -94039 -130325 -113393 -98650 -76043 -95241 -93683
14991 -93683 -65954 -56200 -62909 -55115 -28513 -36360 2365 82694 77805 40960 22919 66043 16377
14978 16377 19822 13344 23688 20324 59198 37163 65448 123962 107058 66394 43744 47582
14966 47582 7984 -19907 -56850 -71947 -52909 4840 69299 66652 -14396 -48720 -62913 19867
14954 19867 85861 61060 25748 -35453 -70743 -42847 -52431 -63051 -35905 -26203 -25715 13911
14942 13911 -1996 -11176 23597 27548 25171 36064 45215 7001 -66872 -117820 -117625 -103215 -23003
14929 -23003 13051 1027 -5960 34623 59711 35217 18589 12098 9444 37033 5238 -15369
14917 -15369 -30630 -16784 -10060 -6524 37925 39122 -66054 -85787 -75174 -107133 -79236 -34156
14905 -34156 -65154 -45774 32352 73746 45517 11378 -24410 -53864 -67756 -74565 -32368 -56804
14893 -56804 -129422 -119791 -104725 -71994 -38444 -17390 -31605 -39715 -71958 -89951 -48368 -9448
14881 -9448 15950 -22611 -25452 -1844 -55782 -93647 -126884 -115757 -108547 -58137 -82127 -88618
14869 -88618 -41982 3023 27744 16802 -17911 -41776 -64621 -69673 -68956 -89343 -66673 -38086
14857 -38086 -19896 -15075 -11528 -73042 -52106 -13669 -821 9231 23686 -26 -82639 -61328
14845 -61328 -39964 -13534 14014 -14485 -43162 -20920 -29761 -95533 -65515 -14878 6190 11664
14833 11664 -28979 -38497 -10905 29952 8492 28900 19762 -18876 -20082 -62593 -28779 28337
14821 28337 37071 49280 12392 -25735 -56395 -68874 -133356 -164262 -138220 -126976 -143635 -101081
14809 -101081 -41258 -47143 -71180 -56813 -72543 -75347 -56916 -65128 -81936 -79401 -40136 -33953
14797 -33953 -10102 -28628 -82498 -100548 -70404 -77487 -111432 -78163 -91428 -79872 -55773 -65632
14785 -65632 -43337 -56795 -37664 -50379 -41723 -32756 -66644 -58124 -71287 -105533 -95534 -45973
14773 -45973 -63832 -52047 -80214 -86417 -40973 9310 66886 98926 98695 15866 -22720 6585
14761 6585 1885 -42965 -39134 -43956 -42030 44181 30857 -7495 -77411 -143931 -139183 -85249 -52518
14748 -52518 -18271 60395 111053 68062 -18186 -30145 -9174 -59123 -123186 -142173 -83403 -9791
14736 -9791 64838 41923 6563 -18100 -27531 -126 -46145 -119697 -83780 -6772 23310 -17993
14724 -17993 -24297 -38256 1593 41742 -6908 -108260 -106283 -123618 -95996 -80616 -82578 -90348
14712 -90348 -107389 -99689 -71834 -32917 35035 -3495 -13523 -45721 -82652 9326 32073 43498
14700 43498 88611 91687 86151 52918 -7343 -56369 -89288 -11073 -41367 -63348 -20054 -16592
14688 -16592 -20772 -32905 -42630 -69289 -134312 -111521 -35355 52229 73054 46140 19183 -43819
14676 -43819 -101702 -66033 -50854 -54153 -87012 -37343 -31133 -70200 -75945 -28308 -11148 -15630
14664 -15630 -52790 -37165 -60815 -22968 -79518 -119927 -108416 -134444 -168259 -140932 -75076 -63104
14652 -63104 -39702 -22850 -4405 -17304 -49531 -48219 -78403 -115542 -136992 -104733 -74892 -33317
14640 -33317 18407 24448 11898 28498 32204 -22025 -38904 -57172 -66926 -81776 -82733 -56335 -32210
14627 -32210 -26447 -19197 30155 -22730 -57121 -56595 -38271 1356 46722 64073 46914 -3065
14615 -3065 -8104 -32332 -67199 -63291 -89157 -128127 -86672 -71316 -97291 -113050 -62912 -10555
14603 -10555 46849 48865 43991 -14704 -33968 -62852 -28323 30531 -12716 -29966 -31943 -57280
14591 -57280 -69848 -38701 -57947 -60073 -41160 -20436 34085 60815 63255 39117 -3443 4947
14579 4947 16544 -17789 -22887 -16023 -6372 42539 71355 41032 7559 14714 17657 -5317 -64787
14566 -64787 -30558 -13232 -48094 -69268 -28477 35765 69266 53617 79376 69518 61286 47645
14554 47645 -5966 -22671 -72196 -70910 -55825 -47237 -21111 8804 -25718 -53434 -96637 -114307
14542 -114307 -104136 -92573 -69485 -68467 -16618 -25660 -34798 -42876 -40149 -55147 -41607 -26453
14530 -26453 -9773 26454 41470 16403 -20530 -50736 -32036 -61160 -37045 28066 81382 88522
14518 88522 38696 -33740 -56766 -73519 -40041 -1640 23878 -20308 -53339 -60449 -82850 -117745
14506 -117745 -127998 -98238 -109006 -127351 -138236 -133263 -93856 -64543 -72227 -87576 -123219 -148769
14494 -148769 -129575 -138551 -94581 -54094 -4348 -65359 -166288 -133258 -76704 -23142 -22066 -28214
14482 -28214 -127554 -97731 -48739 -29304 -47194 -54779 -109718 -166827 -95361 15336 29107 108
14470 108 -31078 -3061 -21104 -33100 -39790 -72997 -115561 -86496 -18485 -7733 -84567 -126615
14458 -126615 -100065 -91415 -98588 -89740 -76750 -49224 -16036 -21239 -47831 -116731 -157380 -125665
14446 -125665 -92110 -74938 -68584 -22272 -16674 1034 25750 41288 21466 -3876 -24220 -67889
14434 -67889 -64036 -34963 -34393 -27135 2912 -11550 -36009 -19150 16632 -11264 -4163 -17246 -35101
14421 -35101 -78313 -96349 -107668 -85795 -50212 -62564 -83398 -85813 -39562 -52110 -86750 -91204
14409 -91204 -78324 -6428 -50940 -60145 -69848 -76957 -90679 -101797 -90545 -11901 -1814 -33841
14397 -33841 -20009 -28491 -5795 23749 20176 26377 34550 -11853 -37081 -39458 17657 24663 -10559
14384 -10559 -42894 -74451 -57885 -10859 54625 -28181 -49060 -69385 -52752 -30844 -23802 -62690
14372 -62690 -59589 -52996 -51090 -56743 -68021 -92824 -105701 -100793 -121722 -101987 -83158 -59981 -83747
14359 -83747 -102554 -77900 -56882 -49229 -92713 -152672 -118815 -108145 -81722 -51219 -7553 -12092
14347 -12092 -59920 -86555 -66340 -53400 -62326 -41696 -19079 -5779 -21354 -20164 -7974 -52763
14335 -52763 -39344 -31978 -19646 -45467 -68437 -60099 -51521 -81846 -97909 -121989 -122695 -94535 -57788
14322 -57788 8442 30638 -1171 -44309 -29545 18501 3457 -9840 -77396 -115356 -73262 -153276
14310 -153276 -192107 -148710 -65477 -3060 -17673 -28148 -32595 -27187 -40603 -47141 -59418 -40212
14298 -40212 -34525 -78511 -81590 -12878 14583 -33397 -59798 -2953 10833 -23243 1754 22354
14286 22354 32119 -25062 -16705 37875 12069 -32288 -69245 -15442 34250 40297 -4164 -5331
14274 -5331 6486 -3280 -21407 -51698 -86255 -55201 -26851 -31802 -45719 6142 32242 21027
14262 21027 13789 9655 -38130 -75519 -50088 -12776 -52874 -92943 -109128 -124727 -130521 -115220
14250 -115220 -79870 -28296 12078 29594 -8144 6877 -14819 -4053 -30773 -39300 -24728 10354
14238 10354 -16997 15072 31246 22447 32350 3560 -28496 34236 96978 36162 -18351 -68228
14226 -68228 -75933 -71841 -108046 -125328 -113463 -74679 -59301 -44791 -34002 -89627 -81003 -51293
14214 -51293 -45868 10778 49183 -2614 -18986 5921 11938 -33422 -6795 -11489 -24886 6859
14202 6859 -17258 -68315 -96232 -77263 -16389 -21789 -28272 -61883 -100790 -79466 -83835 -65941
14190 -65941 -27381 5351 -2099 -47274 -72926 -81224 -43469 -83572 -103468 -103805 -98130 -83154 -61204
14177 -61204 -84774 -120653 -127435 -104081 -112854 -87236 -36023 -55764 -44212 -21707 -17420 -25730
14165 -25730 -65090 -149336 -114163 -55227 -78239 -44500 15227 -15466 -88380 -85523 -86133 -9184
14153 -9184 -17170 -91992 -91402 -5108 -10435 35969 46423 -20658 -33881 -74004 -70452 -16108 -16911
14140 -16911 -19981 18753 -11056 -55015 -112938 -86293 -43759 -71108 -73853 -106512 -150717 -109121
14128 -109121 -61645 -36150 -49900 -68188 -47120 31297 62983 74650 111978 41405 -25027
14117 -25027 -52725 -74321 -79502 -27896 34960 -15031 -21164 2424 -53764 -134662 -102021 -76129
14105 -76129 -105927 -101443 -135094 -142864 -123719 -97662 -20518 -17808 -21940 -52725 -803 49177
14093 49177 34025 27842 44211 5583 -60950 -84252 -39404 12638 10698 -61604 -75700 -96717
14081 -96717 -136559 -76465 -27635 -17225 -22506 -37607 -63078 -92577 -73906 -56249 -74519 -48198
14069 -48198 -21132 -30054 -77790 -53883 -58054 -15099 6805 23738 43122 3757 14649 -5211
14057 -5211 -53569 -135611 -81502 -47263 5285 55572 39914 -60694 -92680 -31815 -35238 -7206
14045 -7206 42407 20265 -100298 -103987 -53794 -84543 -85143 -67933 -24398 -35411 -31691 -19033
14033 -19033 -65678 -124656 -170342 -170120 -146764 -122019 -58742 -38231 20009 28048 -21139 -68134
14021 -68134 -14897 -25852 -40503 -75108 -102326 -85345 -29010 -46903 -62811 -103295 -33640 24182
14009 24182 -24947 -108043 -96667 -87394 -86578 -74345 -47499 19580 72958 36541 -48382 -60239
13997 -60239 -55891 -61051 -101874 -132170 -87193 -69291 -46486 -6965 25252 41762 65427 117614
13985 117614 123592 110696 39045 36678 84677 57005 -6911 -51604 -69261 -74081 13354 80193
13973 80193 35830 -42476 -33037 -2766 19912 15968 -258 -33507 -26247 -8050 18932 67286
13961 67286 22725 -26670 -26702 -32570 -41493 -91375 -108658 -64690 -9047 -23787 1663 74820 67203
13948 67203 543 -78964 -92957 -20858 1698 -26114 -5730 57023 41299 2545 14316 33729
13936 33729 41600 9440 -709 -29731 -45748 -55189 -49093 -31271 15034 24043 -26509 -19362 -39867
13923 -39867 -30195 -12202 -11589 20952 -20172 -82495 -59759 -27988 -17060 -30757 -7910 -5178
13911 -5178 -19041 -5380 -52869 -37642 -33557 23965 51771 32166 40143 27570 35654 -12580
13899 -12580 -32606 4268 2566 -19308 -22146 27408 44369 63351 73071 23684 -85325 -174807
13887 -174807 -163465 -121766 -114847 -140963 -106476 -51944 -44136 -36608 17253 19383 -29232 -52977
13875 -52977 -67291 -123806 -131419 -97021 -111221 -75229 -61929 -80213 -56816 -34075 45100 24342
13863 24342 52298 5162 -18246 5031 -22031 7013 9302 13645 -23239 -25867 -18075 -37816
13851 -37816 -42866 -5259 8088 44618 20031 -12321 -50800 -34324 -33173 -84749 -53898 -11290
13839 -11290 7871 172 -21144 -17341 -43894 -27094 31189 24188 -42096 -27246 -11453 -50975
13827 -50975 -62757 -64248 -12547 -14102 -34122 -19489 -76549 -103857 -79926 -74891 -99433 -101837
13815 -101837 -126475 -103122 -75501 -39461 -18 20655 14976 -58627 -135269 -121639 -139761 -117113
13803 -117113 -114988 -103648 -87742 -72796 -108048 -78599 -37506 361 -19863 -6154 -38232 -28957
13791 -28957 18882 -15690 -41330 -7878 -292 -44918 -76283 -57963 -27243 9480 14712 28317
13779 28317 -5156 -18070 20321 43627 -2244 -27336 -15461 -40329 9310 57708 25204 -7386
13767 -7386 -53369 -78465 -106470 -75394 -10843 4211 -9932 -46845 -88896 -131661 -139879 -146508
13755 -146508 -151534 -88095 -38346 -52589 -75976 -91063 -93360 -77285 -68183 -49397 -84321 -119147
13743 -119147 -111823 -40759 28096 95639 4023 -62317 -63118 -19200 -29174 -49449 -100541 -97611
13731 -97611 -82159 -99645 -128853 -75417 -57946 -54942 -45397 -17235 -4292 -36061 -65450 -70841
13719 -70841 -20688 18891 72241 87089 9744 -73493 -73998 -23595 4609 -77306 -84824 -59886
13707 -59886 -66628 -97147 -66327 -125391 -183457 -186120 -157056 -135396 -94637 -13315 2068 -3668
13695 -3668 -1316 -34871 -22717 -123700 -158791 -142271 -68214 -71829 -92227 -75547 -71457 -32503
13683 -32503 14297 -11892 -39676 -66434 -67415 -96019 -130448 -81362 -64898 -108508 -82377 5482
13671 5482 783 -65533 -120437 -60961 -48993 -70058 11541 22041 -28611 -27738 -9250 -26040
13659 -26040 -57959 -97524 -119927 -36640 30447 36707 14487 -50371 -41971 -55217 -91107 -71853
13647 -71853 -34506 81 52836 7776 -48499 -30249 -34353 -35368 -64110 -54969 -77519 -71543
13635 -71543 -86363 -39213 -207 13533 -7374 -18719 -59417 -98441 -90895 -48725 -35190 -23226
13623 -23226 -6991 -35093 -47423 -35626 -7958 24485 73877 74592 84592 31885 -31499 -45042
13611 -45042 -12060 -30595 -66053 -77410 -58158 -15871 23217 27814 -56713 -57559 -54577 -58886 -47824
13598 -47824 -37231 -59903 -64079 -30876 -18646 -58386 -128297 -160272 -104447 -92619 -86224 -68980
13586 -68980 -85609 -48747 -23618 -44004 -59727 -77119 -75641 -85885 -116150 -64135 -32537 -28863
13574 -28863 10805 11686 28005 71815 72483 -4792 -84076 -57066 -41504 -84314 -71287 -89874
13562 -89874 -131049 -96418 -52428 -33597 -34300 -43997 -21377 -10945 -59093 -67368 -114350 -103166
13550 -103166 -76151 -83333 -52971 -27676 -43807 -671 9492 -1447 -36382 -51181 -11542 -2972
13538 -2972 41800 6833 -57036 -70126 -18553 -15650 -30538 -58095 -65657 -34410 -2453 -8809
13526 -8809 -5691 -99894 -90688 -55907 -56317 -51592 -63154 -39629 17754 37484 -1575 -30829 -5635
13513 -5635 -4636 -8770 -18202 -12313 8735 7945 -18734 -58062 -18060 -13180 -12906 -11298 -32144 -38070
13499 -38070 -81548 -136519 -138850 -113702 -69050 -66468 -58763 -29536 -45592 -40094 -33193 -14873 -14262
13486 -14262 -37288 -30050 -10858 -31793 -59924 -61005 -88504 -50476 -18750 7605 21564 63261
13474 63261 39081 9648 49322 88550 87885 92211 56146 32726 45798 41676 48866 22155 -9796
13461 -9796 -26459 -1663 15304 9057 2618 6113 -43370 -50068 -26111 -19258 -1284 -36746 -89828
13448 -89828 -95373 -61140 -63171 -104269 -137801 -160618 -76441 -68039 -63188 -67685 -92535 -81047 -44727
13435 -44727 -37444 -49046 -58140 -46789 -4848 -2594 -22755 -46977 -74396 -43114 -31993 -49160
13423 -49160 8951 25546 17338 5188 -7049 -47856 -2534 12951 35508 -11864 -61779 -47687
13411 -47687 -57611 -4459 37563 60364 82076 103345 97396 42646 -27262 1650 18340 -26916
13399 -26916 -29706 -25005 -62742 -98461 -99086 -50103 -43436 -17455 29046 3378 -39839 -68175 -94814
13386 -94814 -63855 -64557 -58993 -70581 -90980 -83617 -63347 -33372 16931 -12137 -62582 -39771
13374 -39771 -40104 628 33238 -40029 -59938 -65924 -66104 -9691 -15292 -17388 9669 -16743 -25206
13361 -25206 -973 36419 65079 24889 -19810 -30256 -32408 1065 67517 -6037 -12110 7253
13349 7253 13285 64002 51060 23243 7575 37471 44124 25219 -25751 -61018 -71190 -27816
13337 -27816 -1278 -55426 -73288 -32280 -50591 -25949 11485 12794 9411 5643 64551 107396
13325 107396 66713 -9109 -39721 -44579 -40347 -40099 -37041 60630 102889 76241 117024 141269
13313 141269 99657 85708 29352 62617 47710 29084 -8966 -41827 -60261 -63133 -57605 -65596
13301 -65596 19577 27473 11728 27163 31545 -20352 -58147 -90206 -104698 -81576 -53240 -39195
13289 -39195 -59545 -21951 -44408 -61151 -23685 31320 28255 39502 58502 29573 -17384 -27735
13277 -27735 -20357 -14508 58115 139746 139905 80582 11914 -31553 -14316 47050 44037 37593 91401
13264 91401 106519 51697 13836 -8008 -2084 -15166 21680 9783 725 -5828 24747 -207
13252 -207 15646 81061 123289 75750 88063 69053 63896 44936 -606 9620 9233 60988 77441
13239 77441 100402 56960 22586 10031 16792 23496 12266 10593 24190 28570 -17742 -36220
13227 -36220 -529 28390 53321 64569 88462 68501 11189 64844 24909 -36571 7866 66709
13215 66709 57831 -9192 -33760 -69929 -77766 -50108 50647 67725 15745 -2736 -7368 17381
13203 17381 31977 53821 102837 123799 61420 16980 26565 -28648 -77123 -55455 -52559 -22942
13191 -22942 -54546 -60887 -51598 -36046 -12342 31656 54359 -4852 -25642 3183 41169 97069
13179 97069 121695 106706 61683 -21040 -14428 26112 -16189 -15449 -6686 30508 65023 62889 15382
13166 15382 -2768 -19026 -17809 22534 10174 -56958 -46273 -63320 -70467 -81285 -55332 -36592
13154 -36592 29948 19280 14464 -6516 -28068 -31160 -68550 -12601 45290 62441 51894 -8709
13142 -8709 -43685 27879 74787 105457 106270 96048 95620 108012 29932 3215 -7111 -8886 -29034
13129 -29034 -48316 -58120 -83424 -58725 -22399 -38126 -43835 -1128 44361 39552 -18363 9939
13117 9939 59667 77878 58377 58796 42737 9276 18328 -15286 -51806 -3006 -8739 -26710 -78378
13104 -78378 -73881 -20643 52970 80381 48415 21946 1832 -25085 20356 37896 48619 95153
13092 95153 110405 85501 80734 99393 95429 52866 44822 65276 33944 34711 45509 7560 -3119
13079 -3119 -63005 -65204 4983 42144 71748 66311 40836 5613 32238 73802 109107 60334
13067 60334 25842 -5238 11967 53581 40093 28368 75649 94350 152168 188162 216814 262336
13055 262336 233464 135567 69165 51811 101482 95368 31437 56313 44042 32435 50124 101148
13043 101148 102289 83591 51057 14131 30916 28445 40207 9629 -8935 11395 48565 23979
13031 23979 50947 78313 65613 54121 39581 52205 51553 67551 94583 44936 17171 74612
13019 74612 80265 103112 190859 313085 450809 587053 729351 749710 745224 622452 503525
13008 503525 403785 299607 246195 181390 174773 106809 103899 173820 167236 127592 69117 68206
12996 68206 69040 95955 127162 108835 90452 87708 65100 94717 112585 28657 -1671 26150
12984 26150 34636 82811 81228 66936 61985 71171 104218 122880 165901 179429 189579 198567 226261
12971 226261 290899 354419 483949 631885 718903 708449 598478 494304 373503 269925
12961 269925 226783 262786 223214 199919 202793 188584 183864 195030 228409 179807 205204 210751
12949 210751 201987 216816 242836 239045 168176 128808 103276 107591 86538 64876 46959 58574
12937 58574 118648 134487 123870 97352 61300 1263 35411 90632 150121 159119 187508 175320
12925 175320 177421 251412 306110 246255 270881 285679 229540 194050 167073 122633 152314 186346
12913 186346 193098 183514 183777 175255 142091 138129 181017 186577 128535 91790 144179 149828 127148
12900 127148 150813 83649 26317 50008 87431 101243 94213 108060 140790 140935 101846 63203
12888 63203 108225 134043 72186 66068 33248 86774 76445 62506 65355 52145 60579 116647
12876 116647 144482 139486 135517 143999 152915 155166 74569 47547 104024 132365 145916 100911
12864 100911 54527 70176 49107 72652 130429 89835 117812 187563 197006 174547 165826 154681
12852 154681 144444 165864 125974 91994 40100 41953 100390 139065 176852 178863 184327 205948
12840 205948 226238 215215 129068 48024 49643 80206 88584 94214 86009 25397 2878 12157
12828 12157 52086 38775 12274 33715 58328 38516 78406 137632 153408 105893 48261 38602
12816 38602 56152 117992 203944 211367 195787 147579 157436 149631 150130 120031 77054 49005 53890
12803 53890 12388 -2285 28978 46402 77637 119819 119614 77211 68395 94768 97714 133245
12791 133245 199853 183631 187994 206281 185062 153645 136950 150915 219062 212428 195435 130965
12779 130965 146576 164552 110478 78072 113460 122900 104084 93764 96827 146592 179253 100811
12767 100811 122529 157467 150851 79832 71963 82470 126639 109531 84102 73355 30469 63111
12755 63111 87493 126637 130467 95406 138409 215081 232598 216976 233615 220689 221709 252630
12743 252630 231762 206539 192825 174381 180859 206038 182281 194054 151152 173827 173918 195031
12731 195031 208873 170298 124038 96599 137948 190975 195331 207147 228033 241955 203769 146623
12719 146623 174148 211729 224771 228742 248246 241078 214771 202550 186507 178324 201228 186847
12707 186847 110944 85642 113495 124167 117347 164167 171279 183635 210360 268757 217863 175342
12695 175342 136287 170922 160450 148836 205016 282342 311085 308579 264100 225007 210237 244780
12683 244780 274661 246864 136372 137639 185791 230208 257784 225584 160772 181943 184337 195894
12671 195894 220166 217957 188568 192960 191814 191569 174218 213577 237819 252703 273383 263175
12659 263175 268363 306849 336462 299668 242793 173122 221519 288101 287551 273489 268930 290376
12647 290376 343376 307589 249541 300818 340926 315881 317472 370818 399669 356260 395676 345660
12635 345660 321449 339947 257022 256424 245865 202036 218993 288115 323687 313644 296508 335950
12623 335950 303390 248951 250114 260464 230446 196813 196603 216187 253152 258972 292014 302731
12611 302731 278208 247200 209804 221680 256129 268083 291761 310095 345781 405534 398323 342540
12599 342540 345805 344412 287902 265726 309687 273950 278209 304084 340462 336184 348058 360171
12587 360171 342144 313119 306200 320052 344295 362694 393415 426571 407644 401778 379836 392374
12575 392374 387871 395504 430403 478410 475190 422995 418715 418202 406246 399571 411642 423360 424129
12562 424129 377144 418260 462465 430174 409926 447153 454985 452257 543995 540315 493870 491162
12550 491162 469225 486496 486840 535534 583878 588948 586055 553583 523355 534110 537599 528672 541474
12537 541474 601942 589615 537289 539994 536464 481128 478505 465705 442303 449879 465381 450161
12525 450161 402541 434323 474650 440389 432654 431065 479139 516914 518604 518609 453370 405963 429903
12512 429903 429175 476250 498750 569552 506306 495239 508634 539839 558964 559287 542834 541254
12500 541254 504883 507709 544380 572437 556093 515251 460954 446680 467688 460483 459853 477459
12488 477459 485177 535123 593210 598518 601954 622281 606258 627667 656875 605249 624638 681943
12476 681943 672004 632273 620991 629505 608536 605866 590932 634629 665631 681266 652670 630517
12464 630517 622815 582509 593262 606780 679767 659807 640542 639268 704044 701911 683138 669824
12452 669824 690005 713937 715047 742686 765549 744238 754046 781306 782619 748776 723557 719101
12440 719101 737451 734708 738454 756523 743739 727493 792048 893334 879479 824633 811020 815166
12428 815166 792453 719261 746506 761300 761592 777425 805220 811972 786930 805742 792745 789729
12416 789729 842221 898925 892921 902271 891350 894146 851672 813335 857250 854034 827568 894816
12404 894816 898418 892273 880798 884678 893380 912400 923075 871070 868161 862033 872739 935678 952764
12391 952764 973442 967771 945385 937432 963393 984146 1003720 1035990 1069435 1087944 1073999 995568
12379 995568 939115 967191 985344 1020207 1051086 1066260 1081764 1110332 1126584 1154065 1130691
12368 1130691 1077559 1111544 1168027 1159676 1093117 1081300 1120946 1160881 1154721 1161592 1178374 1201691
12356 1201691 1236579 1246755 1205134 1274965 1253215 1220632 1251049 1317487 1309337 1274467 1275475 1258487
12344 1258487 1258498 1271387 1286553 1270999 1250575 1268255 1324897 1388338 1375099 1341191 1338165 1376609
12332 1376609 1399895 1388778 1363194 1372995 1436499 1407834 1400397 1450426 1534925 1528421 1501932 1504124
12320 1504124 1496087 1450091 1440214 1467853 1463590 1481317 1503364 1540946 1550137 1565579 1597167 1571681
12308 1571681 1565279 1570307 1605692 1597714 1623671 1591209 1600006 1638408 1676116 1723174 1724091 1724893 1713260
12295 1713260 1731548 1771906 1807048 1786678 1801141 1851451 1879882 1883704 1887004 1885673 1891402 1895701
12283 1895701 1892689 1933329 1940244 1920016 1927299 1950433 1976223 1926827 1968288 2051428 2097210 2089868
12271 2089868 2129340 2165004 2137993 2147776 2140064 2086958 2084260 2124592 2157780 2224953 2260630 2327693
12259 2327693 2324448 2328282 2334673 2320630 2336418 2391172 2374178 2360084 2392037 2409739 2486073 2524645
12247 2524645 2475785 2413578 2445672 2519489 2557720 2553361 2524083 2570482 2629213 2612727 2605230 2671031
12235 2671031 2704126 2752601 2729936 2786550 2849417 2893469 2883567 2857593 2822899 2852839 2875389
12224 2875389 2947665 2995868 3028077 3072678 3030306 3073060 3103190 3131353 3154523 3167182 3208513
12213 3208513 3264034 3339558 3317219 3297571 3328593 3342758 3366861 3438725 3537458 3593762 3620794
12202 3620794 3601105 3582886 3603447 3673358 3752799 3805838 3831714 3882672 3899560 3923989 3958095
12191 3958095 3950029 3907112 3908078 3990324 4096527 4158087 4164889 4121700 4128563 4172168 4150497 4235098
12179 4235098 4370454 4411289 4486742 4513145 4585483 4660923 4735703 4769481 4814360 4791881 4799698
12168 4799698 4884646 4965511 5018672 5105931 5121461 5138343 5161073 5251060 5357661 5399442 5455843
12157 5455843 5530879 5553225 5548768 5597430 5733911 5795772 5848849 5869733 5929654 6025084 6025813 6011952
12145 6011952 6075165 6167684 6243424 6275585 6360752 6471753 6533357 6588173 6649667 6708325 6713772
12134 6713772 6788478 6865616 6927534 6991255 7054961 7135689 7265735 7360069 7343612 7409261 7442933
12123 7442933 7507094 7615848 7678791 7773188 7874628 7985670 8119063 8227152 8287240 8401331
12113 8401331 8548286 8599912 8662116 8760106 8845654 8944295 9067919 9127690 9149501 9243260 9373689
12102 9373689 9489817 9561455 9642216 9744113 9842939 9943135 10077463 10246236 10356020 10438880
12092 10438880 10515355 10598387 10659475 10759857 10904931 11065681 11195226 11299608 11453648 11597465
12082 11597465 11735387 11839342 11949164 12080783 12173834 12263726 12400738 12557157 12661039 12796067
12072 12796067 12918190 12986495 13039599 13176028 13346655 13514766 13659666 13787173 13856318 13966453
12062 13966453 14168742 14296854 14426310 14586801 14752771 14842682 14927848 15067433 15190656 15314934
12052 15314934 15404857 15530632 15636621 15731934 15852434 15978796 16085436 16188622 16307915 16475006
12042 16475006 16545157 16612423 16726712 16841631 16993969 17114546 17287436 17392279 17501870 17588385
12032 17588385 17682847 17846278 17915098 17994957 18026323 18082602 18173550 18268512 18316565 18429836 18492508
12021 18492508 18531412 18575174 18621774 18657604 18618695 18643395 18786148 18858624 18888901 18929634 18981941
12010 18981941 18964448 19061091 19089173 19120298 19165164 19189459 19168454 19129801 19124083 19165736 19187910
11999 19187910 19162178 19110965 19073214 19000146 18948329 18868449 18892346 18896675 18849099 18771492 18746780
11988 18746780 18712521 18670398 18617180 18564941 18516597 18422364 18341316 18324296 18284587 18232325 18091786
11977 18091786 17997096 17918854 17824701 17707759 17590905 17478976 17395019 17308610 17220444 17144069
11967 17144069 17081483 17054378 16940525 16770882 16649543 16539599 16442481 16342447 16264481 16154602
11957 16154602 16041641 15920404 15790985 15647975 15563585 15504745 15391716 15254417 15105552 14984485
11947 14984485 14841578 14709699 14591907 14452163 14353317 14273281 14103257 14003201 13967554 13870102
11937 13870102 13719264 13569748 13432681 13339413 13212364 13065190 12937806 12799738 12715578 12602390
11927 12602390 12464530 12320315 12230760 12205986 12112977 11981504 11889906 11808126 11680710 11563440
11917 11563440 11424061 11296551 11247056 11207440 11134541 11023741 10898613 10772992 10644402 10575465
11907 10575465 10503623 10417298 10277279 10103871 9996423 9925795 9819873 9709652 9633749 9636889
11897 9636889 9545632 9498324 9386536 9258758 9106950 9037791 8945444 8868513 8828291 8760627 8675628
11886 8675628 8588740 8492268 8370682 8314015 8220938 8157969 8063633 7960602 7878167 7820261 7738925
11875 7738925 7673366 7664446 7612379 7531521 7435960 7401292 7355920 7231230 7136953 7038135 6948055
11864 6948055 6865950 6827837 6810344 6818245 6796982 6736960 6657372 6616088 6548527 6468821 6464529 6412749
11852 6412749 6330948 6279887 6217365 6166713 6074842 6020496 6026443 6006188 5892356 5808950 5745673
11841 5745673 5680826 5635271 5599505 5527785 5527341 5534739 5442087 5331847 5300665 5276017 5294780 5267897
11829 5267897 5211047 5148799 5122249 5090792 5034251 4964146 4908686 4858974 4827528 4804080 4758756
11818 4758756 4683380 4708922 4730995 4649599 4614721 4593611 4595698 4576451 4530059 4431657 4358108
11807 4358108 4290185 4217298 4214153 4195395 4205992 4193889 4150242 4117031 4074208 4035642 3995747
11796 3995747 3951348 3941285 3860264 3806722 3801008 3746103 3722809 3723555 3784055 3814479 3742677 3731061
11784 3731061 3726656 3692309 3645840 3629092 3611863 3557010 3533482 3617901 3640137 3595078 3541839
11773 3541839 3483020 3429555 3336215 3236390 3196651 3164635 3157984 3144115 3076960 3064258 3071889 3069561
11761 3069561 3056443 3088409 3072886 3013509 3009273 2982693 2920416 2952264 2984139 2964531 2918131
11750 2918131 2933022 2947314 2958962 2896850 2850003 2812611 2750415 2747134 2705005 2671219 2648894
11739 2648894 2699646 2717910 2685138 2683614 2636803 2600027 2581064 2563969 2553528 2496806 2470873
11728 2470873 2415438 2397248 2411074 2436613 2404761 2413177 2415556 2383175 2386290 2417211 2380261 2335741
11716 2335741 2309069 2292561 2254618 2188664 2129042 2113609 2172181 2195397 2185173 2157226 2160923
11705 2160923 2172303 2140592 2163323 2162358 2125033 2105757 2122541 2166987 2131809 2083129 2078044 2077724
11693 2077724 2093065 2059489 2038384 2019507 2018665 2037795 2097476 2082754 2032455 1980031 1904891 1851731
11681 1851731 1853485 1942440 1956303 1912036 1878782 1852364 1825102 1834689 1814986 1809362 1813364 1790071
11669 1790071 1784768 1751980 1764304 1790790 1782785 1745007 1703313 1704707 1708202 1708843 1702717 1721710 1752445
11656 1752445 1691180 1696541 1650764 1615142 1603227 1589515 1604864 1574568 1537173 1506348 1601152
11645 1601152 1622921 1540092 1488584 1460600 1468069 1480610 1498170 1486505 1468226 1473334 1467299 1532693
11633 1532693 1497058 1412439 1419592 1462550 1489795 1478893 1452732 1426722 1431418 1429157 1395272 1385341
11621 1385341 1393301 1400337 1431581 1381820 1324828 1305348 1357925 1395756 1403628 1398929 1385923 1410594
11609 1410594 1365984 1339403 1361430 1322604 1299815 1324350 1312606 1297616 1306848 1294084 1269782
11598 1269782 1247854 1202935 1145377 1127659 1133423 1120320 1130466 1153756 1222108 1208087 1199590 1210646
11586 1210646 1266987 1251266 1204851 1199412 1215064 1190075 1197335 1207602 1201019 1130874 1113858 1042675
11574 1042675 1074385 1092966 1086915 1075416 1112565 1176162 1176558 1172224 1101454 1108286 1101859 1116422
11562 1116422 1099687 1075244 1050248 1053417 1020226 990046 987877 1033223 1080449 1085206 1066107 1068218
11550 1068218 1058842 1039559 1023253 974737 991782 1021296 1011102 973873 973550 1027498 1011029 983339
11538 983339 942496 971528 951911 945171 915897 887882 894041 914495 882945 851322 821129 829301
11526 829301 883079 947960 975804 958903 920977 894737 895029 846923 823548 839286 852178 797101
11514 797101 803493 771616 730283 774872 811561 841702 826381 805293 785200 785504 789282 766163
11502 766163 793167 829582 846812 870005 870383 836781 808852 816364 819578 815532 782393 733555
11490 733555 768653 822785 782964 722620 769894 793824 797847 789357 821088 810581 786913 733066
11478 733066 736592 716347 686329 670492 712201 694975 621857 658106 685433 738565 776115 783628
11466 783628 808619 795567 795556 783304 748508 697639 690437 665736 719605 776885 790565 739943
11454 739943 666474 628009 630132 675384 722239 765872 742945 691435 679851 716114 737274 672835
11442 672835 623424 612771 632598 621315 590168 582351 603771 612918 603486 573979 583928 642292
11430 642292 656997 614153 605482 614920 643525 633734 635191 638517 669932 673557 578517 528393 560125
11417 560125 585732 564883 571304 506080 503849 511438 525756 518421 514600 507641 537207 599136 637738
11404 637738 660636 650855 586307 495173 509526 517287 555253 556818 595237 533606 472709 498117
11392 498117 509526 498439 549162 599551 553067 563509 578267 604914 595761 513177 468908 510630
11380 510630 499001 473059 471845 484529 464618 430097 436653 471726 478027 493663 475732 455689
11368 455689 516706 564385 543640 538014 560304 519523 486409 491955 486336 524073 540156 572847
11356 572847 563190 523857 514587 481191 476585 468169 459968 453803 444275 449678 431101 425901 451377
11343 451377 457670 480793 507807 479389 484908 479718 492242 434368 387531 412141 444434 437996
11331 437996 424351 452729 419059 408157 376307 347912 371922 359882 333159 312833 313844 333231
11319 333231 330255 363224 426538 432877 401186 419038 439517 448673 428979 440475 443357 430302
11307 430302 395005 389322 380771 370629 443323 468690 453879 432799 396462 420659 408468 396785
11295 396785 396709 397117 350755 395104 400740 393445 350734 349806 358862 418972 433293 389982 345064
11282 345064 246050 253008 260251 285443 302963 284833 330312 413346 364016 358799 356889 357513 318944
11269 318944 342150 378026 353493 348356 334291 344846 373349 419767 439685 388653 357896 297566
11257 297566 271981 274000 309885 328478 328468 280049 292655 329243 310122 334961 348810 391058
11245 391058 359359 333229 325664 307766 311068 332087 299183 311444 316527 279387 267709 327727
11233 327727 358523 351334 368843 429136 368517 359981 363412 358165 359399 329298 321521 348313 327361
11220 327361 290995 256646 207315 201046 204112 212261 244915 284222 300454 250784 205308 266558
11208 266558 275643 236791 295702 344918 322558 254993 197220 209754 247429 274593 264939 280871
11196 280871 307251 272235 246453 251684 261690 239800 261499 252727 286571 250403 219663 228179
11184 228179 266870 302632 293945 276698 266287 291912 300131 263243 278810 326059 312678 299446
11172 299446 280278 278985 272582 306840 350200 340057 286072 278126 269560 221916 196674 178704
11160 178704 210725 157245 105064 122684 179003 211057 194872 121775 128550 187497 208076 206994
11148 206994 162819 142638 169159 183099 180121 213002 212349 183543 185309 190338 211451 212076 189102
11135 189102 166918 224140 215753 134576 119212 128844 130236 198740 250049 314040 294533 263698
11123 263698 266346 240410 225722 218570 186675 163884 161035 106128 164279 135277 117899 170824
11111 170824 239312 273725 209245 195545 218256 206837 200442 201927 186847 190334 179478 188516
11099 188516 188620 169001 144640 142989 134885 146836 175001 214662 221538 220202 189834 136343 140723
11086 140723 171147 134911 122367 181537 184014 132277 92409 82006 81563 124505 98422 106810
11074 106810 173351 223327 206161 170090 127360 84616 49525 20898 45951 95543 120299
11063 120299 165773 237778 186756 187093 239660 222914 181404 134573 108241 73233 73669 49849
11051 49849 8994 9750 129132 167692 106436 121606 167649 138244 110106 156317 178899 172285
11039 172285 203517 185743 162703 153683 186726 208656 263376 258468 234172 248732 282142 288901
11027 288901 327970 368926 383541 393304 394481 370137 361303 356012 398728 424196 467488 491821
11015 491821 510708 543163 577093 567142 532997 495268 427732 371318 346046 376153 374082 355184
11003 355184 359529 346715 338638 253424 250586 301906 283876 255254 232875 230142 266576 299284
10991 299284 371744 381280 289633 212517 165473 155914 129462 152540 109132 106968 120584 108750
10979 108750 123206 146317 160675 123866 112707 33029 68357 96076 75998 86403 81713 35409
10967 35409 83517 68701 49502 70344 118876 107028 82767 96655 102823 75359 47495 40692
10955 40692 74200 149358 162156 132216 162249 170444 108443 88718 64838 19682 18135 11668
10943 11668 12611 31266 92059 134617 124206 138870 135474 57814 27980 32902 53052 44202 392
10930 392 -2643 -40361 -52033 -25150 1748 46540 34789 47832 26770 -19743 21778 50803
10918 50803 48109 48537 37629 -35755 -58488 -48241 -36478 -46968 -58048 -17857 -18343 -20219 -2252
10905 -2252 641 8173 47959 70763 26164 67187 88513 67171 40449 70211 76874 22204
10893 22204 11930 -56768 -15879 33001 -20684 -45439 -25929 -15693 -78257 -98652 -74939 -58533
10881 -58533 -24060 -72391 -73603 -85380 -116070 -116638 -66970 -50216 -41359 -54677 -68596 -81012
10869 -81012 -83516 -27189 -6162 -44215 -35360 -54700 -33720 -25892 -43394 -26930 -28645 -70949
10857 -70949 -52382 -46747 -45826 -38219 -48494 -39799 -35481 -77567 -55500 -66382 -16757 24043 -14676
10844 -14676 -74335 -61545 -33223 -68591 -54735 -67041 -78262 -67393 -87553 -41895 -27703 -24980
10832 -24980 -11717 39482 30004 2318 -54767 -78702 -40124 -25582 -81548 -131452 -114861 -85484
10820 -85484 -45756 -43839 -58131 -65395 -29353 -90356 -115011 -63533 -77145 -94034 -95782 -98799
10808 -98799 -109685 -94147 -111046 -63664 -53335 -108770 -129950 -160653 -191152 -187421 -176179 -158900
10796 -158900 -177379 -181459 -237825 -238317 -226980 -183448 -150988 -139653 -134146 -152149 -183968 -203861
10784 -203861 -226473 -205679 -200165 -191897 -162891 -183967 -198632 -189189 -213510 -193274 -175655 -214898
10772 -214898 -239854 -211130 -190387 -161939 -160121 -153651 -131585 -83678 -38482 11890 36372 4717
10760 4717 -30679 -39063 -71925 -110822 -190002 -234825 -216816 -174551 -109296 -138392 -211027 -201240
10748 -201240 -215472 -243508 -213821 -193693 -178030 -179908 -130536 -107460 -144997 -194372 -223955 -243754
10736 -243754 -241808 -288311 -306923 -214466 -168249 -201916 -270364 -265216 -243163 -237202 -223809 -216675
10724 -216675 -208565 -203471 -204914 -258178 -286260 -292910 -314831 -334498 -355546 -376882 -398584 -341575
10712 -341575 -285916 -336904 -348767 -299623 -311343 -365586 -357502 -304685 -307164 -362912 -344796 -359872
10700 -359872 -399363 -407056 -372542 -399293 -422284 -447443 -465005 -438542 -429223 -381498 -387938 -412599
10688 -412599 -403208 -379771 -394610 -391870 -439524 -467406 -467179 -499916 -489240 -546830 -577445 -526168
10676 -526168 -493718 -489508 -458744 -433456 -427014 -504047 -505428 -520726 -544917 -579709 -539745 -553307
10664 -553307 -579287 -625306 -624980 -605461 -663935 -703183 -699428 -686696 -675945 -693236 -685041 -661467
10652 -661467 -686622 -700319 -694694 -709783 -762251 -761728 -720627 -713454 -696991 -696430 -725423 -726302 -761048
10639 -761048 -737835 -773670 -806244 -848990 -929711 -953141 -896778 -902452 -945784 -900677 -797547
10628 -797547 -753537 -696587 -627063 -538215 -426532 -343218 -350290 -361105 -280173 -124412 88577
10617 88577 376781 767247 1309410 2105286 3255488 4801426 6899650 9578488 12638828
10608 12638828 15634039 17921809 18942011 18882687 18366113 17957946 18156926 19279491 21698764
10599 21698764 25506958 30857279 37256883 43316533 47117403 47602499 45479590 42408863
10591 42408863 39875333 38634146 39168867 41770594 46629017 53585576 61623573 68603010
10583 68603010 71809520 70016652 64561630 57999565 52248381 48252680 46151914 45973778
10575 45973778 47677528 50986808 54941726 57899885 58113995 54969299 49607929 43833659
10567 43833659 38873113 35184870 32787705 31535785 31175594 31509751 32082604 32141773 31065774
10558 31065774 28743794 25625698 22409605 19465885 17012976 15049360 13417927 12102083
10550 12102083 10971052 10000712 9191684 8506064 7899079 7371059 6876665 6413449 5942846
10541 5942846 5509228 5103108 4738198 4442910 4212227 4001257 3768580 3539286 3347295
10532 3347295 3166027 3022207 2945019 2828192 2708577 2603962 2471706 2298444 2204193 2151392
10522 2151392 2084867 2025739 1953928 1903356 1848900 1804965 1764603 1753774 1712101 1716601 1686761
10511 1686761 1657086 1582440 1544429 1524834 1475131 1478980 1469440 1402046 1425384 1402423 1381649 1330397
10499 1330397 1295114 1276894 1219859 1181070 1155907 1160967 1154972 1083628 1035318 1070847 1095198 1041683
10487 1041683 1014710 1014860 1081513 1141622 1146868 1145757 1119826 1057320 1048388 1070291 1061567 1036063
10475 1036063 983469 915015 918789 935936 969624 966296 981372 944326 906432 912191 858961 877780
10463 877780 848539 830057 822149 849282 859051 847191 833424 770702 763380 772059 806117 844890
10451 844890 828874 786804 758731 756997 761893 764892 738330 727703 769796 806111 770837 790469
10439 790469 784305 737177 716884 744773 695850 675290 665205 628816 597427 615614 634529 630274
10427 630274 655482 719864 723048 686188 661657 576713 561877 604945 622705 650851 656254 639257
10415 639257 686239 693530 642277 595267 571612 538848 516612 524799 523393 511993 502381 509799
10403 509799 495369 468280 510882 503556 561764 648906 637020 606905 617695 599553 549935 606943
10391 606943 668958 627204 567088 608283 641313 623130 578794 527787 522086 521990 460615 433662
10379 433662 466651 541496 615159 642790 595572 512293 468921 450236 457165 450850 442911 447180
10367 447180 432378 470137 454004 391909 369991 419267 480461 459018 468790 445534 455839 459602
10355 459602 463102 429785 417738 448058 484666 516211 465545 470921 466352 469218 386870 323478
10343 323478 373802 426177 432448 390565 349409 325693 358077 386873 416102 409222 457736 435108
10331 435108 392876 418585 420437 397580 435291 436744 425740 431196 409744 412054 412484 386011 359278
10318 359278 380967 426643 454783 471141 422370 370502 332716 313482 284928 313764 324582
10307 324582 328758 336080 357996 402755 422458 417643 406108 355348 363774 420197 467524 466938 407765
10294 407765 402476 398127 419269 370664 318540 281482 317420 340913 351874 353347 362690 339044
10282 339044 301299 362077 390603 381490 377644 379891 339241 303209 290747 298074 365678 399847
10270 399847 348720 288489 230008 259711 325077 321526 283600 274857 314468 363783 365672 333495
10258 333495 316739 328794 281029 303466 303900 288840 335813 342757 333416 326127 308714 296417
10246 296417 372281 419671 354716 294384 295868 368956 313310 280201 278343 277942 320620 398329
10234 398329 338301 312258 323308 304753 300787 299395 263796 282913 333110 373201 363213 361493
10222 361493 283955 213162 224401 228078 242234 262926 247544 277232 310970 322381 301174 268050
10210 268050 209869 156832 134088 118549 155506 189586 243785 238715 213474 241783 214321 237625
10198 237625 278928 255255 228617 258176 276418 243335 215774 191289 204980 212763 230856 254761
10186 254761 202581 195837 224799 267265 247151 209896 191291 181149 186054 168900 158428 207283
10174 207283 262776 279192 312193 349268 336785 344487 377557 386418 369230 368205 384542 367387
10162 367387 381954 415403 529981 600145 582655 534179 518375 469139 456002 449086 424695
10151 424695 468088 514134 529321 541212 584235 618220 633399 688915 614697 500722 474864
10140 474864 489939 513258 505143 493332 501980 544529 585858 511619 413203 340650 368532 410938
10128 410938 426476 426574 397396 389694 430754 439286 388227 391240 395596 372990 291674 221589 283759
10115 283759 343861 398229 405097 338980 265493 237777 247750 275416 273750 287617 255955 247479
10103 247479 251842 234039 228131 221856 264046 280009 250267 216928 170902 161036 179541 169186
10091 169186 149917 234391 265399 269723 303102 287255 267077 292846 320622 321897 347189 341451
10079 341451 316848 280989 236656 197205 228271 269960 245707 237468 230625 218887 212628 220013
10067 220013 205542 171128 179518 204613 219894 280792 267903 227546 191638 192474 257131 256724
10055 256724 248796 232250 221568 289244 311938 306259 293386 216162 201356 232493 257069 249200
10043 249200 226906 242610 179315 183712 178522 114221 83940 88400 119421 130833 127088 165008
10031 165008 235707 240008 206455 220555 214589 218543 159819 106495 105452 122828 117155 183451
10019 183451 222277 182030 146900 186390 206969 197062 189214 211169 195620 214904 285777 257175
10007 257175 207128 243517 243761 228910 246113 201069 169700 209239 215354 209004 206117 247441
9995 247441 285931 271922 272013 292843 272132 233433 216179 243238 240152 220480 181360 158615
9983 158615 179433 158721 112740 79587 107784 185199 246414 262534 232547 197853 178340 193428
9971 193428 180907 178835 153262 149150 147131 142581 186544 215781 194948 235434 237897 220385 279543
9958 279543 273157 217720 193651 166228 229758 271920 312783 354812 326499 252982 216668 226648
9946 226648 272002 323064 308418 268968 243757 222653 225222 250530 260311 293926 266115 245602
9934 245602 223926 204887 216176 192713 177670 214116 225467 225442 256890 214669 233576 208853
9922 208853 172760 160769 175362 233438 277094 289516 273058 208378 208792 275835 303717 299266
9910 299266 267464 251299 273908 279960 293653 326630 283675 309642 314815 341660 360103 374944
9898 374944 305027 260151 277742 261734 288959 235754 225263 281120 245494 195465 192621 138085
9886 138085 114071 122593 150270 209419 262636 281369 210420 156342 204489 193399 168343 178900
9874 178900 197601 184337 185342 253771 288658 229508 193564 205576 251398 271855 249102 222975
9862 222975 191056 218300 293187 302056 254089 226381 220414 197630 152383 263978 317478 308523
9850 308523 219183 220646 244292 172173 159423 147765 107162 193652 230311 166887 169377 175643
9838 175643 138631 109405 60438 24690 23073 40457 72679 117297 129112 117460 148693 150366
9826 150366 135602 109465 123849 183555 225529 186973 113154 165940 178936 156497 148993 163879
9814 163879 198004 188462 165806 169800 188793 191886 162961 142004 162630 170644 207308 181491
9802 181491 144965 184649 212083 229239 215385 194400 199072 191862 183199 173013 124693 65671
9790 65671 93129 59248 58951 127109 193820 221001 176954 194026 164207 133568 114445 116308
9778 116308 132118 174244 195380 184980 171524 192682 244494 238253 280267 376418 483118 609073
9766 609073 882358 1405045 2082588 2750853 3069667 2857358 2283750 1719208 1314098 1025629
9756 1025629 843095 745064 684400 678555 638563 586548 536572 535876 508209 470184 405163 355636
9744 355636 335064 371200 414388 376944 331773 347451 327019 273636 243889 233149 229335 230919
9732 230919 235733 250428 254493 282839 253280 181958 104574 117768 132622 162264 195946 217883
9720 217883 208791 183607 174436 191953 211453 144749 123200 155851 148710 158279 180583 218207
9708 218207 184698 172130 179374 161259 175286 171710 234492 204385 209888 226515 181872 150512
9696 150512 155026 162835 227152 235628 228986 215215 217749 218594 214938 208880 179736 130874 121447 124894
9682 124894 190288 217259 252868 249519 213638 125702 110153 59101 42961 71577 113244 155322
9670 155322 173277 180743 233349 206037 141246 145002 203567 169945 70222 80833 101997 121765
9658 121765 170308 172940 148095 147611 136473 139287 118929 102189 126161 226931 333368 398188
9646 398188 466085 499572 536425 511445 440958 396849 342418 282127 216855 211338 200699 216184
9634 216184 234851 232643 237290 239410 182501 147793 132263 170770 193035 146498 107553 107677 75966
9621 75966 69133 92035 125356 151050 151477 112815 136763 182139 180387 105472 54382 58413 80472
9608 80472 87146 48448 19743 47706 100386 125850 158542 178666 129308 113525 88312 85248
9596 85248 53673 32878 54664 95322 76029 87391 123877 129744 219339 282337 263102 204111
9584 204111 170310 192981 165064 147417 102114 99742 89410 99571 132997 81318 51416 32059
9572 32059 16628 59688 109112 84288 92003 126522 104715 103083 157166 139698 125090 108380
9560 108380 87862 127224 133306 121568 84206 61444 45988 8869 20733 73037 98819 87596
9548 87596 47242 25109 6602 -10950 -15418 36922 56532 84033 113808 119777 137128 131193
9536 131193 103777 86647 59969 127267 138544 170597 193568 149760 123785 99109 96273 137880
9524 137880 119363 79953 90736 85777 159134 123645 32844 88935 169491 156493 144906 140768
9512 140768 146675 170683 236668 287326 259037 235177 188226 171488 156276 140374 112132 130159
9500 130159 117892 85966 84844 55737 17705 11453 57180 54282 42330 21951 26770 -10285
9488 -10285 12717 41116 63266 115720 145450 142738 109947 130286 149478 104662 122684 108442
9476 108442 57753 52863 -10708 26281 115590 125748 129263 143253 129224 137864 127097 100119
9464 100119 71259 69456 63320 49312 67966 117486 139927 139464 140650 93029 42162 68413 86248
9451 86248 69599 32506 56017 85397 24790 33725 95387 109098 119628 114780 161215 97965
9439 97965 9881 21571 43501 66283 74657 89136 76054 70478 84350 86583 37766 43021 75737
9426 75737 106958 101876 81666 67783 73663 102026 93228 45494 24086 28676 24275 29647 78110
9413 78110 115694 105778 113332 100461 81461 64529 21434 15957 32373 73951 53305 59383 78704
9400 78704 93972 111765 167363 116225 79638 20486 60923 117431 119287 125681 110066 92051
9388 92051 77077 54374 119591 169349 161366 164314 136730 113713 117257 101397 132483 110572
9376 110572 69837 77238 57194 101399 187964 167976 76839 3223 -20840 -9118 35753 52180
9364 52180 101029 82775 35714 17726 56390 118534 100722 94834 70084 23775 37983 46226
9352 46226 74162 146179 148105 114794 138024 179699 161301 177307 177582 121077 25837 -6747
$$ [...]
##END NTUPLES=NMR SPECTRUM
##END=
