##TITLE=Analysis number 315069
Compound Code cc 02101
Project Code adrs
Chemist Name tau-chem
##JCAMPDX= 6.0         $$ Bruker NMR JCAMP-DX V2.0
##DATA TYPE= NMR SPECTRUM
##DATA CLASS= NTUPLES
##ORIGIN= Bruker BioSpin GmbH
##OWNER= NMR
$$ XWIN-NMR		Version 3.5
$$ Mon Nov  7 08:09:29 2005 GMT Standard Time (UT+0h)  MAYBRIDGE\NMR@NMR_250MHZ
##.OBSERVE FREQUENCY= 250.131544655141
##.OBSERVE NUCLEUS= ^1H
##.ACQUISITION MODE= SIMULTANEOUS (DQD)
##.ACQUISITION SCHEME= undefined
##.AVERAGES= 16
##.DIGITISER RES= 18
##SPECTROMETER/DATA SYSTEM= dpx250
##.PULSE SEQUENCE= zg30
##.SOLVENT NAME= DMSO
##.SHIFT REFERENCE= (INTERNAL, DMSO, 0, 16.522)
##AUDIT TRAIL= $$ (NUMBER, WHEN, WHO, WHERE, WHAT)
$$ ##TITLE= Audit trail, XWIN-NMR		Version 3.5
$$ ##JCAMPDX= 5.01
$$ ##ORIGIN= Bruker BioSpin GmbH
$$ ##OWNER= NMR
$$ C:\u/data/dgb/nmr/ADRS/11960/pdata/1/auditp.txt
$$ ##AUDIT TRAIL=  $$ (NUMBER, WHEN, WHO, WHERE, WHAT)
(   1,<2005-11-07 08:08:49.22 +000>,<MAYBRIDGE\NMR>,<NMR_250MHZ>,
      <created by zg, POWCHK disabled, PULCHK disabled
       configuration hash MD5:
       62 19 C7 07 E1 42 D1 B7 37 6C 3D D0 77 39 F9 E6
       data hash MD5: 64K
       AE 4D 35 4E 7B EA CE 5E 2B B0 21 74 10 24 8B 64>)
(   2,<2005-11-07 08:09:11.22 +000>,<MAYBRIDGE\NMR>,<NMR_250MHZ>,
      <Start of raw data processing
       ef LB = 0.3 FT_mod = 6 PKNL = 1 SI = 32K 
       data hash MD5: 32K
       72 31 43 01 FF EB 9E 14 C9 81 8E F9 59 20 45 8A>)
(   3,<2005-11-07 08:09:13.28 +000>,<MAYBRIDGE\NMR>,<NMR_250MHZ>,
      <apk 
       data hash MD5: 32K
       42 53 24 7F 94 CD A8 F5 85 64 09 B9 2F 8C 68 CD>)
(   4,<2005-11-07 08:09:14.61 +000>,<MAYBRIDGE\NMR>,<NMR_250MHZ>,
      <abs ABSG = 5 
       data hash MD5: 32K
       38 13 C5 6E 62 82 5B 80 63 F9 FF 36 8F 81 27 36>)
$$ ##END=
$$ 
$$ hash MD5
$$ E1 C4 07 58 87 41 25 05 4E 74 55 5A 2D CB A1 D5
##$RELAX= 
##$RELAX= 
##$RELAX= 
##$RELAX= 
##$RELAX= 
##$RELAX= 
##$RELAX= 
$$ Bruker specific parameters
$$ --------------------------
##$DU= <C:\u>
##$EXPNO= 11960
##$NAME= <ADRS>
##$PROCNO= 1
##$TYPE= <nmr>
##$USER= <dgb>
##$AMP= (0..31)
100 100 100 100 100 100 100 100 100 100 100 100 100 100 100 100 100 100 
100 100 100 100 100 100 100 100 100 100 100 100 100 100 
##$AQSEQ= 0
##$AQ_mod= 3
##$AUNM= <au_zg>
##$AUTOPOS= <1 >
##$BF1= 250.13
##$BF2= 250.13
##$BF3= 250.13
##$BF4= 250.13
##$BF5= 500.13
##$BF6= 500.13
##$BF7= 500.13
##$BF8= 500.13
##$BYTORDA= 1
##$CFDGTYP= 0
##$CFRGTYP= 5
##$CHEMSTR= <none>
##$CNST= (0..31)
1 1 145 1 1 1 1 1 1 1 1 1 1 1 1 1 1 1 1 1 1 1 1 1 1 1 1 1 1 1 1 1 
##$CPDPRG= <>
##$CPDPRG1= <>
##$CPDPRG2= <>
##$CPDPRG3= <>
##$CPDPRG4= <mlev>
##$CPDPRG5= <mlev>
##$CPDPRG6= <mlev>
##$CPDPRG7= <mlev>
##$CPDPRG8= <mlev>
##$CPDPRGB= <>
##$CPDPRGT= <>
##$D= (0..31)
0 1 0 0 0 0 0 0 0 0.06 0 0 0 0 0 0 0.0002 0 0 0 0 0 0 0 0 0 0 0 0 0 0 
0 
##$DATE= 1131350928
##$DBL= (0..7)
120 120 120 120 120 120 120 120 
##$DBP= (0..7)
150 150 150 150 150 150 150 150 
##$DBP07= 0
##$DBPNAM0= <>
##$DBPNAM1= <>
##$DBPNAM2= <>
$$ [...]
##$SUBNAM6= <"">
##$SUBNAM7= <"">
##$SUBNAM8= <"">
##$SUBNAM9= <"">
##$SW= 20.6930455092707
##$SWIBOX= (0..15)
0 0 3 0 0 0 0 0 0 0 0 0 0 0 0 0 
##$SW_h= 5175.983436853
##$TD= 65536
##$TD0= 1
##$TE= 294.16
##$TE2= 300
##$TE3= 300
##$TEG= 300
##$TL= (0..7)
0 120 120 120 120 120 120 120 
##$TP= (0..7)
150 150 150 150 150 150 150 150 
##$TP07= 0
##$TPNAME0= <>
##$TPNAME1= <>
##$TPNAME2= <>
##$TPNAME3= <>
##$TPNAME4= <>
##$TPNAME5= <>
##$TPNAME6= <>
##$TPNAME7= <>
##$TPOAL= (0..7)
0.5 0.5 0.5 0.5 0.5 0.5 0.5 0.5 
##$TPOFFS= (0..7)
0 0 0 0 0 0 0 0 
##$TUNHIN= 0
##$TUNHOUT= 0
##$TUNXOUT= 0
##$USERA1= <user>
##$USERA2= <user>
##$USERA3= <user>
##$USERA4= <user>
##$USERA5= <user>
##$V9= 5
##$VALIST= <valist>
##$VCLIST= <CCCCCCCCCCCCCCC>
##$VD= 0
##$VDLIST= <DDDDDDDDDDDDDDD>
##$VPLIST= <PPPPPPPPPPPPPPP>
##$VTLIST= <TTTTTTTTTTTTTTT>
##$WBST= 1024
##$WBSW= 4
##$XGAIN= (0..3)
0 0 0 0 
##$XL= 0
##$YL= 0
##$YMAX_a= 430363
##$YMIN_a= -411438
##$ZGOPTNS= <>
##$ZL1= 120
##$ZL2= 120
##$ZL3= 120
##$ZL4= 120
##$ABSF1= 16.522
##$ABSF2= -4.171173
##$ABSG= 5
##$ABSL= 3
##$ALPHA= 0
##$AQORDER= 0
##$ASSFAC= 0
##$ASSFACI= 0
##$ASSFACX= 0
##$ASSWID= 0
##$AUNMP= <proc_1d>
##$AZFE= 0.1
##$AZFW= 0.1
##$BCFW= 0
##$BC_mod= 0
##$BYTORDP= 0
##$COROFFS= 0
##$CY= 12.5
##$DATMOD= 1
##$DC= 0
##$DFILT= <>
##$DTYPP= 0
##$F1P= 14.0000005364418
##$F2P= -0.99999901652339
##$FCOR= 0.5
##$FTSIZE= 32768
##$FT_mod= 6
##$GAMMA= 0
##$GB= 0
##$INTBC= 1
##$INTSCL= 1
##$ISEN= 128
##$LB= 0.3
##$LEV0= 0
##$LPBIN= 0
##$MAXI= 10000
##$MC2= 0
##$MEAN= 0
##$ME_mod= 0
##$MI= 0
##$NCOEF= 0
##$NC_proc= -4
##$NLEV= 6
##$NOISF1= 0
##$NOISF2= 0
##$NSP= 0
##$NTH_PI= 0
##$NZP= 0
##$OFFSET= 16.522
##$PC= 1
##$PHC0= 68.9186
##$PHC1= 7.670103
##$PH_mod= 1
##$PKNL= yes
##$PPARMOD= 0
##$PSCAL= 4
##$PSIGN= 0
##$REVERSE= no
##$SF= 250.13
##$SI= 32768
##$SIGF1= 0
##$SIGF2= 0
##$SINO= 400
##$SIOLD= 32768
##$SREGLST= <1H.DMSO>
##$SSB= 0
##$STSI= 32768
##$STSR= 0
##$SW_p= 5175.98343685301
##$SYMM= 0
##$S_DEV= 0
##$TDeff= 65536
##$TDoff= 0
##$TI= <Analysis number 999999
Compound Code 99
Book Reference 9
Project Code 9>
##$TILT= no
##$TM1= 0
##$TM2= 0
##$TOPLEV= 0
##$USERP1= <user>
##$USERP2= <user>
##$USERP3= <user>
##$USERP4= <user>
##$USERP5= <user>
##$WDW= 1
##$XDIM= 32768
##$YMAX_p= 486857127
##$YMIN_p= -429917
$$ End of Bruker specific parameters
$$ ---------------------------------
##NTUPLES= NMR SPECTRUM
##VAR_NAME=  FREQUENCY,     SPECTRUM/REAL,   SPECTRUM/IMAG
##SYMBOL=    X,             R,               I
##VAR_TYPE=  INDEPENDENT,   DEPENDENT,       DEPENDENT
##VAR_FORM=  AFFN,          ASDF,            ASDF
##VAR_DIM=   32768,         32768,           32768
##UNITS=     HZ,            ARBITRARY UNITS, ARBITRARY UNITS
##FACTOR=    0.157963299565203, 1,           1
##FIRST=     4132.6476996994, 0,             0
##LAST=      -1043.33573715361, 0,           0
##MIN=       -1043.33573715361, -429917,     0
##MAX=       4132.6476996994, 486857127,     0
$$ Real data points
##PAGE= N=1
##DATA TABLE= (X++(R..R)), XYDATA
$$ [...]
29716 -9606 -94675 -67369 -9083 42379 44896 10338 4898 -22269 -48298 -17260 3729 -6374
29704 -6374 -56737 -32433 -6729 -25683 -45474 -89976 -81188 -4721 10765 5841 -42800 -49821
29692 -49821 -28964 32711 31381 24342 47737 61087 61067 47609 17846 30619 1907 29205 -7089
29679 -7089 -16273 -50419 -77691 -67607 -80390 -9397 22017 5929 33871 27072 38787 79958
29667 79958 52090 1042 -25726 -8346 -69904 -133613 -74298 -30117 -46198 -40173 25033 55992
29655 55992 5797 -14679 -51579 -73662 10356 61043 99591 63613 12222 -14605 -49517 -44614
29643 -44614 -20 56810 74246 54351 82501 34405 23651 10598 -19850 40567 30809 50410
29631 50410 82950 49971 71413 18957 -5705 14577 -30754 -71320 -43250 38929 84789 88028
29619 88028 -3946 -42573 -101343 -128655 -143647 -125290 -114755 -118517 -79318 -62754 -40711 -59788
29607 -59788 -29593 1622 17083 2603 85143 40708 -6138 -6110 -8014 15339 24995 -16553 -60357
29594 -60357 -39341 -9434 -45707 -50045 -42348 74452 89869 84205 106328 90068 7645 -27169
29582 -27169 -59975 -35114 -21214 -41550 -12755 -42044 -74041 -73332 -57623 -65128 -53532 -55974
29570 -55974 -75601 -74788 -80171 -73773 -28991 8983 -40975 -26263 -27724 -52385 -89429 -74100 -79637
29557 -79637 11522 70129 -26562 -85292 -54168 -25422 2294 44474 50628 78520 73147 63648
29545 63648 55538 108714 117250 9467 -48710 -12740 8172 -45212 -57650 -69716 -69357 -64124
29533 -64124 -73187 -76787 -68640 -50098 -15763 -75618 -111094 -91564 580 -34509 -48179 -21550
29521 -21550 47580 88289 82286 36173 25012 47749 25856 -5385 -23537 26834 -3282 -20459
29509 -20459 -11214 53248 92416 88857 23362 -11137 36891 92546 62924 46331 39589 52393
29497 52393 36172 35041 32118 41673 10698 67113 63703 37511 49899 55798 34198 -23626 -28536
29484 -28536 -53083 -166618 -126374 -54835 -5409 42349 70346 27582 -14266 -38900 -35528 -73740
29472 -73740 -75127 -12620 -3871 -56219 -44748 -51593 -91834 -30486 -11993 -47465 -31008 29884
29460 29884 51611 56387 59685 -16586 -52632 -41777 -44841 1667 36543 28194 -39386 -34647 -14130
29447 -14130 -28542 -80357 -38788 -30407 -33757 -26566 -68794 -70634 -90737 -68235 -45524 -63280
29435 -63280 -81768 -31372 24668 -28382 -122228 -83666 -52749 -56513 -14080 40227 23718 -40590
29423 -40590 -35769 -34029 -103942 -89367 -63679 -53398 -76462 -42907 -27967 -9547 -41634 -73051
29411 -73051 -69607 -81651 -38989 -41891 -25586 -48691 259 85658 82666 52004 60425 69877 17795
29398 17795 -38785 -16295 28626 41094 101629 106871 41271 39582 31040 41313 83690 72089
29386 72089 19120 -42135 -1760 88251 113599 71974 6869 34828 59062 -8701 -75992 -133415
29374 -133415 -132530 -94268 -39313 -74678 -96090 -54398 -19313 -38158 -40464 -10923 46779 3524
29362 3524 -34548 -67305 -142093 -203762 -180920 -108711 -73792 -90352 -65609 4342 7909 2162
29350 2162 1115 -25816 -56378 -10647 -21991 -12118 61824 69726 -23685 -26633 -52389 -32712 -31905
29337 -31905 2467 -14586 29083 -11274 -105897 -108522 -43708 33098 24784 -53082 -61819 -89655
29325 -89655 -50936 -16669 2793 32481 9516 616 -31445 -29129 35544 45723 93007 88543
29313 88543 75067 68913 31275 9889 -25919 -35182 -30806 -21197 -14035 -2601 39059 29706 36543
29300 36543 37094 10964 -12908 -20658 -20608 5069 54260 28370 42869 25394 17085 -26226 -24328
29287 -24328 11848 22252 12345 50484 50649 44247 -34772 -105445 -67571 -43328 -54777 -35822
29275 -35822 9684 13081 -41289 -65762 -79575 -37690 40649 47183 32804 -11970 -51219 -5673
29263 -5673 32887 23598 -8425 24177 14831 -28848 -58277 -83495 -98966 -116883 -126054 -65747
29251 -65747 6361 -15582 -56800 -11706 53354 95976 34795 -3548 -6051 38346 71927 104695
29239 104695 109826 46136 -18074 -72334 -98886 -23655 26351 -8982 -37597 31435 33133 19505
29227 19505 40107 12503 -34641 -26329 10823 -31954 -77901 -67758 -9507 -31372 -62296 -94381
29215 -94381 -77799 -29981 -74104 -102372 -95853 -57809 -6660 -6380 -10493 -71235 -126527 -99549
29203 -99549 -20789 -1235 -18214 -51335 -41668 -28602 -58160 -85559 -26554 50910 71145 40526
29191 40526 6952 -40472 -54503 -38141 -32148 -25046 -20071 47311 37057 -38938 -32440 -35260 -28546
29178 -28546 16448 19017 14755 45277 37047 56459 59178 23447 -25702 -57478 -23768 -26551 -49241
29165 -49241 -47750 -57702 -16396 14109 -72327 -92254 -62286 1214 5030 -54412 -59648 -71092
29153 -71092 -101212 -89861 -51276 -40360 -64846 -89765 -62368 -45299 -11093 -2571 19894 77690
29141 77690 98925 89054 105180 52136 2949 -25526 -23914 -29700 -88789 -71312 -28861 -6519
29129 -6519 51995 34354 -19921 -43701 -25579 5959 -39564 -36135 -67746 -53421 -59309 -37770
29117 -37770 -23145 30759 74273 63779 -2629 -15169 16675 28770 -18076 -49943 -63102 -5598
29105 -5598 44175 33116 28413 14413 43310 55294 12096 -32541 -17505 -24388 -17595 -37093
29093 -37093 -53484 -88847 -67406 -12232 -13575 -18710 -120486 -177500 -149913 -45493 -17485 29247
29081 29247 40995 28608 1520 -64754 -118620 -106193 -39966 -20432 -20606 -62341 -38601 35398
29069 35398 10659 -17409 -6571 -40797 -606 19633 2725 -9646 -23825 -6127 -16319 -59037
29057 -59037 -63377 -47584 -2240 25979 44741 76134 50263 14748 46448 -23883 -133685 -123567
29045 -123567 -101708 -71314 -2622 6787 24897 62164 52929 46433 27408 6992 -44509 -65668
29033 -65668 -52657 -30071 -4919 9449 -28950 -43981 13608 -8269 -35070 -24749 9074 55205
29021 55205 -47161 -73606 -57212 -94274 -57236 -28729 -29547 13217 47251 30284 53073 25799
29009 25799 11023 -6095 48632 64669 47884 -9390 -70329 -98206 -94170 -93790 -52430 -56055
28997 -56055 -11896 61818 104331 120298 137986 90517 44534 44738 7733 49147 70514 22590
28985 22590 7247 -23946 -39999 -1743 -14620 25809 43825 46179 39133 -16096 17664 51677
28973 51677 30584 20573 40162 44998 -14375 -17674 -7863 -25169 -38030 -7910 9646 23246
28961 23246 -40951 -46556 -39860 -35469 -2537 39878 27003 45523 42282 25298 13143 40721
28949 40721 24474 17403 42909 45472 -1985 -30491 951 13487 14510 46505 49658 30772
28937 30772 60084 84863 87305 47187 28882 3630 34941 62 -75352 -79574 -86452 -68352
28925 -68352 -48594 -44128 -50385 -80109 -80698 -24360 15763 -12332 -54115 -70134 -63309 -89117 -135299
28912 -135299 -113699 -64779 -12143 17334 15994 15950 -12094 -19607 -11952 -4926 27980 68792 76172
28899 76172 85264 64385 43003 17756 -23717 -53195 -39215 -5567 -6064 43881 62696 69491
28887 69491 83799 129955 109797 78377 20177 30694 25920 63971 86058 64338 46161 119845
28875 119845 89851 51697 25367 35863 52427 52395 -15495 -47982 -36416 -38662 -14323 7730
28863 7730 35499 52197 99085 123982 53942 -40345 -51500 32444 79748 56722 19257 -20776
28851 -20776 -33109 804 -11481 -3487 790 -81228 -69950 -51193 -68037 -81458 3201 60364
28839 60364 72821 22051 706 -49998 -37261 -22514 -47247 -64762 -4434 7291 -29007 -395
28827 -395 -933 11674 40952 12471 -20220 -15303 -23824 -8772 18637 6852 -34469 -38580 -35550
28814 -35550 -66246 -37911 -10473 44320 34289 8516 20007 28136 74667 44882 74165 75916
28802 75916 46460 29500 -20054 -21623 -18829 2329 -40008 -127679 -154868 -84535 51767 18361
28790 18361 -29244 3938 -11455 -84904 -127780 -116623 -62941 -13770 -51916 -90239 -47141 -51933
28778 -51933 -90298 -65878 -47343 -44245 -49780 -81453 -85471 -117207 -103540 -60669 -55172 -18080
28766 -18080 8293 26152 40015 48442 20353 -47369 -18683 -38256 -51571 -53557 -69653 -96150
28754 -96150 -49218 28127 63024 85284 78913 52832 -10691 17091 43616 41731 47758 79045
28742 79045 83391 5701 -51240 -45802 32043 67025 87535 64019 51162 59523 51439 77035
28730 77035 80208 27139 51100 63460 53794 91327 106433 127987 139855 150251 102813 63411
28718 63411 30156 82511 75226 71109 66866 90751 94065 88019 50795 54002 56874 46439 22796
28705 22796 60597 54469 18995 -12756 -42608 -43938 7473 13069 14677 6948 12872 -19516 -65976
28692 -65976 -837 12697 -4712 -88069 -42968 5805 -27724 -27081 1516 39251 61599 59447
28680 59447 -35233 -73570 -66217 -4410 -31466 -51658 -44232 -73284 -94003 -103722 -65286 13206
28668 13206 25072 -11035 -15181 78922 100509 71703 35856 40667 102789 102142 78738 92148
28656 92148 70002 29346 19550 46572 118252 103792 82037 4692 -35587 -55463 -37715 -18781
28644 -18781 -17323 -10864 -53745 -33776 10150 -850 -1559 19206 2784 48895 112220 145662
28632 145662 97904 28320 -12356 -13276 -21293 -78484 -14370 73982 90799 58534 42330 33901
28620 33901 -6343 62017 102654 105839 94640 79088 17945 -21497 -20898 6058 82412 84362
28608 84362 25293 35339 20730 4673 4471 6444 22889 -8472 -32816 -74606 -33304 32769
28596 32769 60621 45004 46029 86965 49945 57599 87400 36094 7584 18560 19815 69531
28584 69531 106770 93192 61235 53269 41575 -20644 -10698 -35128 -82920 -35926 -53892 -47774
28572 -47774 -91478 -120505 -142074 -109339 -95634 -65781 -57723 -47121 -24175 -23439 -9977 -13746
28560 -13746 51423 44626 78617 74511 -31920 -30869 31024 32818 -42076 -38865 11149 22564
28548 22564 -12567 -12406 19179 -7518 -21617 -50213 -115543 -65847 -30707 227 12863 15368
28536 15368 -579 -3468 71522 96581 28222 -8539 -30873 -10183 -1441 27311 -28824 -53424
28524 -53424 -68070 -77965 -82731 -30193 -21250 16052 25599 65028 76270 84093 90437 111195 141645
28511 141645 101024 59506 41157 76117 95483 74974 98072 65926 2248 -54633 -41221
28500 -41221 26925 44470 33829 101924 89315 119167 104894 98405 61847 13359 42651 34009
28488 34009 -6687 -58630 6276 21910 26260 3153 -10560 -20117 -2845 15520 47409 51440
28476 51440 1685 -56428 -36162 4448 -10059 -30144 -2914 40104 34527 -19789 24639 36667
28464 36667 9865 -375 -15203 9664 44164 35571 18535 51159 56088 -9482 -3759 -1721
28452 -1721 -20183 -19773 -37823 -15455 -4538 -25516 -16435 25465 83652 94535 89314 67643 70319
28439 70319 39000 752 -16812 4665 -44716 -68653 -68232 -315 46757 32662 31941 29762 12807
28426 12807 22015 -6856 -27797 10384 22671 19462 13446 13977 60863 82172 9199 12867 17415
28413 17415 145 22084 -22061 -41313 -70873 -87849 -22019 -31483 -31 9658 56507 77788
28401 77788 36772 79844 111679 73803 54991 22880 24002 43580 84448 94752 84557 70432
28389 70432 48434 50081 19752 -3207 31977 63664 71789 26752 -32772 -15850 48809 96700
28377 96700 120206 120336 90769 48219 18343 33313 13732 19464 51936 86536 63219 49837
28365 49837 30634 22849 -12528 -28849 -13662 -22421 -23857 -3615 30765 73615 104483 39750
28353 39750 9573 60776 96916 71602 61520 105097 91106 122286 62665 900 24349 9769
28341 9769 -610 -14706 -22295 -6304 16564 29319 42824 42933 108977 73208 70983 69608 39366
28328 39366 53473 36246 72944 96034 61518 31155 57542 27538 25904 53851 37240 34173
28316 34173 422 3487 36501 3850 -9356 -13819 -2518 -11152 -22363 -8333 -65823 -92944
28304 -92944 -69836 -14337 -26400 -53050 -68484 -40107 46256 82467 36425 -61132 -83313 -93170
28292 -93170 -100983 -106280 -62992 4617 27782 6429 7913 21707 29407 6848 25712 27665 44808
28279 44808 41496 67429 57111 71313 53815 61175 74050 45219 66003 46557 20692 2775
28267 2775 -38770 -111396 -91247 -59386 -8276 12391 26260 18953 -10566 -40457 32080 86011
28255 86011 73442 11202 11287 13551 11276 44311 15584 19635 55064 67490 96836 134458 102205
28242 102205 45266 -59391 -54028 -12462 54629 51117 44587 33825 -2955 -67251 -97752 -18759
28230 -18759 98690 164682 85155 15888 43236 17828 -26530 -72103 -138720 -117865 -67832
28219 -67832 -26163 -19455 -38471 -20467 -6028 -8537 -31731 3046 -5790 -18371 10676 29267
28207 29267 -17725 2087 -36 47715 57604 42791 29107 -19317 -112271 -83156 -66344 12893
28195 12893 79234 60169 33750 2941 -17542 612 2838 -3168 28140 67965 60125 30540
28183 30540 5945 6682 20286 45931 24107 68922 86886 87001 73653 75354 55729 11346 -7892
28170 -7892 -15107 -29609 -8031 -5941 28533 41236 77138 94447 79758 27047 -59587 -80241
28158 -80241 -48761 -20364 -60392 -71528 -45101 30540 42487 24759 -21461 -32917 -27135 -24274
28146 -24274 24432 3802 -53065 -9969 38628 72928 70484 41109 39828 76897 128158 115162
28134 115162 99820 96177 60844 13251 3165 22370 46697 -827 19630 37384 -21590 -59051
28122 -59051 -37812 -30280 -12455 -57499 -38158 497 4120 29504 645 3162 -9103 22663
28110 22663 -5457 -10559 3581 65737 105169 101901 71685 46733 93360 119581 56257 25409
28098 25409 36495 92442 135946 111871 105380 78362 120704 98468 77089 101605 67057 39998
28086 39998 7090 -16763 -6364 29261 52453 83100 41089 4644 -35733 -24338 17686 25034
28074 25034 12352 16365 14699 19328 29545 34573 41444 55734 81984 84005 82954 109733 128109
28061 128109 120306 172987 145493 49203 43710 56378 72878 88829 70569 17962 11641 -21297
28049 -21297 -36494 -2316 17602 -9057 -13502 18024 -3686 -39263 -27408 21548 17528 -18181
28037 -18181 2922 2210 7104 4973 46174 60325 -1462 21880 5397 -1166 -15685 -12180 61600
28024 61600 111562 78552 29619 3025 11178 47367 65855 39202 71253 80969 126461 79641
28012 79641 14058 -4393 30384 87970 97304 60798 9807 -40671 -11986 24563 -69577 -89661
28000 -89661 -66856 -17455 -443 19908 24866 -32900 -28153 43784 104552 153367 161127 53663
27988 53663 3940 26285 56585 41485 9615 34933 61425 45023 3612 68575 91333 109738
27976 109738 79470 18404 32470 -20980 -2495 -20898 -26021 -31460 -7302 46220 14086 -3225
27964 -3225 -28927 -51143 -82615 -112903 -92283 -38182 14194 75931 11561 41004 66069 76157
27952 76157 84336 59066 95902 140207 136282 114770 115206 106807 80032 38956 49902 44686 30050
27939 30050 33840 32688 55259 32539 3903 -4807 13844 24724 15234 29636 68945 46170
27927 46170 32357 57963 42448 22944 12358 -11241 15560 46787 47365 51600 40749 44155
27915 44155 27434 37180 97887 52720 13484 10597 17435 -283 -12560 19450 56281 52548
27903 52548 101684 120172 96441 78329 79471 51743 21435 -19573 -11352 20558 14880 -1933
27891 -1933 50560 67323 54525 72104 59135 14284 72840 129898 147650 118715 90048 94381
27879 94381 83277 88768 51980 42927 23716 17071 30476 47027 81362 116040 88570 94568
27867 94568 73298 74661 62609 33314 15469 -24450 -33059 -12242 -19936 1518 82555 143711
27855 143711 92814 64994 64596 77475 101134 40857 47902 41547 33688 -21790 -34283 -2885
27843 -2885 -9123 49884 69559 17543 56957 77834 92084 49139 6409 25353 33857 26169
27831 26169 61607 16131 25453 60415 28741 248 9837 10042 47694 29164 12125 1898
27819 1898 -9871 -11820 18208 45355 77625 86403 93064 20625 3368 12771 5136 21057 -2783
27806 -2783 -32597 40062 70005 -5587 -78613 -61148 -16235 1639 -17729 43810 101442 122958
27794 122958 83880 65436 63854 71270 70072 71664 69638 89117 71403 52714 27940 35944 55294
27781 55294 78580 70300 68110 87881 64975 59595 92854 130545 146363 124128 105753 92284
27769 92284 18704 23040 63727 70329 63427 113313 148503 114936 73174 73909 75240 17647 -57010
27756 -57010 -117310 -133609 -99444 -59469 -50469 -28404 -17509 -20748 38847 69287 70287 148135
27744 148135 176512 177760 96643 79201 112116 118315 79510 123581 111614 75790 29286 49854
27732 49854 83339 62023 52940 109959 155043 158889 109241 144016 137274 103502 115618 94571
27720 94571 123757 78652 17522 -23944 -30989 14524 66841 74493 107879 80333 2049 -6822
27708 -6822 30540 68337 43494 42308 21877 6925 -10968 28132 5537 -26084 -30641 -13496
27696 -13496 31712 116838 200046 179791 98211 112945 122943 107110 95717 73208 47737 34520
27684 34520 29363 60293 95809 126534 110425 87116 135222 113720 114101 146293 152090 131568
27672 131568 92992 52044 25264 45281 53906 89098 90719 98886 91755 92124 99376 57775 58982
27659 58982 109774 145485 147377 118602 114395 115843 116723 137987 142045 112889 91295 84825 133239
27646 133239 163822 152009 131160 110490 80191 124448 120520 125666 142074 139495 190957 195167
27634 195167 192366 171122 105294 79691 73889 64906 89352 70943 50496 14037 50372 77890
27622 77890 87859 160216 197300 141255 102690 66361 93290 136636 115115 79149 59555 63157
27610 63157 115258 121781 105612 74338 94841 106188 110711 105021 71758 29191 48463 97851
27598 97851 101753 54147 32242 34351 -15748 -11121 96886 149451 180153 133877 42761 -2195
27586 -2195 36521 73768 101016 95371 57717 112452 171978 130130 90049 182124 224370 155390
27574 155390 92197 99411 133087 146975 133389 161651 116142 90168 126032 115539 118745 115828
27562 115828 132913 148296 134712 142404 180250 185146 218760 231091 195052 145392 112080 71918
27550 71918 76995 64550 68925 77049 71625 66002 41697 82492 137247 97176 43980 34834 52677
27537 52677 59736 65782 80663 67951 101025 177584 135137 119351 127700 146171 141875 185987
27525 185987 153411 172427 223113 214239 143744 91135 172561 174916 164315 142643 146967 117812
27513 117812 140210 172431 222997 196977 207456 246449 229078 199685 151943 136156 92063
27502 92063 38960 61963 96546 153419 147824 161352 162972 108018 134155 171267 145032 122459
27490 122459 93866 94198 102957 91106 105516 155706 125834 110994 59900 96737 129870 94809
27478 94809 74673 104067 148265 128918 112469 101590 99825 98744 118078 117027 169012 191565
27466 191565 188195 144468 128174 106193 133368 138535 80940 29878 34383 50942 112098 134412
27454 134412 155171 166871 181082 160595 186024 157658 146881 159610 186915 211738 233944
27443 233944 197985 179086 173581 153090 124258 94906 97247 84328 86172 82712 87616 67786
27431 67786 120675 188457 143990 80202 62213 69677 78727 70520 99361 56817 -23867 34019
27419 34019 141854 111551 78075 94099 144690 208530 189627 131020 164386 199878 217468
27408 217468 207134 158921 238625 305410 292931 235727 185290 178179 247989 285639 201519 146206
27396 146206 183143 194147 197415 255776 239803 225521 192240 209521 202881 164892 118105 101569
27384 101569 130419 146960 167351 185368 183566 191190 179988 165987 138314 90569 153314 241244
27372 241244 274964 255556 276750 249641 220831 260546 252300 271179 271916 293712 288281 257641
27360 257641 238513 236606 227558 197967 152636 56764 88302 164268 273988 304299 343302 339952
27348 339952 359553 310426 251501 191175 128205 122244 100765 115904 138729 165563 184221 206097
27336 206097 249435 284883 272222 184343 180759 245783 286046 280137 191183 146434 184594 263600
27324 263600 242928 301217 346004 360146 314838 219755 184335 178138 197353 221218 187244 153041
27312 153041 108679 142140 145260 139937 158260 143312 161849 175127 221665 237490 235533 244283
27300 244283 204863 154387 162378 226085 256764 228524 207251 213952 160660 139027 153677 177976
27288 177976 211260 210891 181819 161112 178051 185929 191012 189449 244125 226324 248195 240204 253529
27275 253529 255726 204921 147653 116999 129454 176315 210290 227437 196986 202734 267122 319582
27263 319582 362857 334849 276385 283229 316345 332413 322053 274879 252290 244933 294980 284571
27251 284571 355301 322182 251766 215808 148258 129040 147612 101276 180962 270321 304179
27240 304179 295829 299590 293011 303444 332692 379636 356150 333294 374550 409802 402719 372376
27228 372376 341084 316129 264686 216815 239243 257605 244358 243840 235552 255926 296778 302318
27216 302318 294168 339478 416922 447181 428835 433966 468588 417317 367668 324249 351423 417540
27204 417540 390136 325351 318508 341483 354905 356240 349547 410839 386676 367729 366789 429175
27192 429175 451261 427492 411591 403972 370448 399227 388588 375294 367377 344351 420929 359929
27180 359929 261541 295844 341350 382517 387175 384796 301711 336713 414418 451945 446254 404297
27168 404297 457580 458713 387614 354792 371220 306611 255815 321097 412545 432247 424318 446492
27156 446492 443854 463753 451263 454976 482720 490743 484978 507329 472175 447844 490874 540331
27144 540331 484508 485265 541737 534735 495965 462780 498680 528627 485938 413967 405315 418997
27132 418997 441960 455173 470386 495644 506167 533590 518262 496477 516469 573800 616508
27121 616508 553287 480281 496272 534269 508752 553266 540983 496701 495518 489217 533788 505236
27109 505236 479765 537390 604194 562521 558571 575260 561337 561579 559964 578976 572535 588752
27097 588752 565326 565938 563704 498808 562593 582584 550409 541416 551739 551945 593639 597901 602038
27084 602038 613940 617121 598661 572624 575537 592935 670611 711693 706058 671075 630200 589733
27072 589733 608632 647441 652354 712082 697761 662237 642935 664226 620197 552023 567076 665508
27060 665508 659244 614613 628846 639222 693215 732594 781350 720428 725574 731629 738762 745656
27048 745656 712356 694695 717988 712741 752011 734261 733799 712169 643717 630671 618632 634787
27036 634787 671264 651639 642448 654697 712137 724487 712102 743635 741418 760249 827814 833240
27024 833240 819505 809149 829660 802289 783699 842820 868775 922814 921415 846209 804973 772425
27012 772425 765813 841498 850926 859571 859193 873149 916972 918460 906961 910701 917701 966107 979665
26999 979665 980314 1007404 959297 936696 942865 1025249 1117579 1140005 1140360 1132072 1130084 1139088 1059229
26986 1059229 1014779 1021257 1047596 1103712 1153013 1213385 1236600 1234359 1220490 1231543 1284083 1296913
26974 1296913 1279746 1200213 1142089 1204312 1204010 1212046 1245185 1280619 1204822 1216496 1290351 1292702
26962 1292702 1315790 1299932 1310073 1340085 1346810 1354684 1394062 1350502 1338510 1398047 1448780 1500479
26950 1500479 1530489 1485497 1428351 1461905 1438343 1441443 1518630 1561657 1591927 1620043 1669320
26939 1669320 1695071 1725735 1667655 1651804 1686335 1669169 1635152 1593834 1604376 1587223 1615538
26928 1615538 1647957 1679006 1649968 1618545 1700153 1807541 1856286 1797126 1832106 1871712 1879040
26917 1879040 1865986 1820230 1836722 1898378 1897566 1886111 1940992 2001293 2061965 2077929 2069991 2044026
26905 2044026 2097628 2160629 2198068 2190758 2251645 2303861 2339248 2399898 2421768 2359673 2379149
26894 2379149 2430923 2350016 2288089 2289021 2355499 2411723 2423059 2412912 2451899 2490806 2549103 2608597
26882 2608597 2632219 2616571 2591852 2618232 2674127 2732475 2758884 2710965 2694491 2742844 2843486
26871 2843486 2885481 2962130 3051465 3086502 3146371 3236917 3271624 3256038 3264344 3237515 3271544
26860 3271544 3286495 3287600 3312520 3317393 3335580 3334672 3389721 3507032 3600557 3699681 3733131 3777955
26848 3777955 3861672 3923193 3962787 3985899 3979678 3992031 4018698 4072499 4173940 4269193 4379863
26837 4379863 4451662 4518405 4536690 4513928 4574483 4712033 4768563 4825632 4910342 5021217 5087466
26826 5087466 5177292 5252392 5271698 5274089 5377106 5535009 5666768 5770812 5858319 5954084 5980099
26815 5980099 6066149 6215010 6375377 6567325 6665767 6781847 6829972 6898225 6991545 7103821
26805 7103821 7222734 7344848 7472530 7581878 7731218 7864850 8036743 8165214 8295500
26796 8295500 8447295 8601189 8800874 8982926 9159402 9311542 9469586 9685435 9887452
26787 9887452 10086850 10285736 10474094 10700020 10978887 11215326 11448938 11725649 11941669
26778 11941669 12173435 12474654 12763930 13079534 13396796 13689057 14048650 14400747 14740595
26769 14740595 15099033 15480587 15852456 16254033 16663982 17083718 17541667 18029663 18518038
26760 18518038 18974269 19453484 20001863 20491316 21074200 21702959 22332651 22992011 23675852
26751 23675852 24383378 25063536 25825729 26666900 27491480 28314882 29176673 30054732 30960063
26742 30960063 31932749 32923687 33963156 35069394 36212935 37454495 38670525 39857569
26734 39857569 41191728 42636150 44043315 45436237 46891567 48385340 49919184 51453681
26726 51453681 53093528 54758761 56492520 58260793 60035300 61816242 63600242 65420948
26718 65420948 67193613 68943642 70692955 72401616 73990733 75511285 77071292 78486287
26710 78486287 79829280 81003733 82041780 82944781 83768986 84370252 84846522 85216024 85355435
26701 85355435 85227267 84915116 84437309 83872991 83171011 82253657 81135627 79960653 78658972
26692 78658972 77318870 75849576 74255525 72657124 70953680 69251765 67560846 65791523
26684 65791523 63940039 62105969 60337741 58597255 56868243 55176088 53437650 51795975
26676 51795975 50258691 48683081 47103324 45612748 44168217 42766228 41368008 40066717
26668 40066717 38808747 37585550 36356164 35169954 34017212 32947231 31918610 30963882
26660 30963882 30060781 29158744 28243243 27402704 26658339 25884267 25124956 24328984 23626421
26651 23626421 23017134 22369912 21672488 21045719 20385821 19774125 19241951 18735997 18301754
26642 18301754 17859196 17395306 16975812 16593707 16161792 15723589 15350491 14976125 14621957
26633 14621957 14227792 13905373 13593544 13231093 12967228 12668335 12370379 12123768 11848231
26624 11848231 11528336 11292927 11059521 10804823 10553879 10321711 10061121 9893394 9693293
26615 9693293 9569373 9375670 9180959 9007427 8847888 8631879 8404599 8175405 8036624
26606 8036624 7913658 7751089 7588256 7479911 7387896 7246451 7050369 6926567 6808657 6652641
26596 6652641 6540662 6456943 6368410 6250854 6174706 6139151 5980084 5834987 5737495 5632507
26586 5632507 5564368 5490294 5386002 5318602 5218804 5141245 5044277 4962389 4867244 4797415 4729793
26575 4729793 4681421 4571115 4499096 4419916 4368441 4347237 4277168 4262507 4149073 4053943 3961391
26564 3961391 3949464 3925916 3934727 3903847 3818729 3706373 3630267 3559035 3493082 3436296 3321691
26553 3321691 3254367 3215119 3220463 3182900 3132596 3101351 3071283 2997105 2936573 2950453 2995811
26542 2995811 3004508 2930474 2852899 2818225 2793481 2749579 2713313 2645763 2568716 2513038 2535769
26531 2535769 2589170 2641386 2591510 2554995 2527816 2476081 2391876 2367487 2346932 2337724 2271214
26520 2271214 2214351 2204944 2223931 2194880 2139699 2071960 2065722 2062532 2039402 2013973 1949695 1884782
26508 1884782 1846925 1843700 1859368 1857590 1832047 1830925 1834548 1839045 1792537 1759682 1772969 1681081
26496 1681081 1668211 1670601 1653076 1649516 1615740 1620514 1575467 1571839 1606468 1588126 1555985 1596070
26484 1596070 1640814 1653441 1561802 1509818 1496671 1467980 1529464 1539860 1470156 1399855 1379674
26473 1379674 1358913 1335170 1360007 1354691 1387187 1366504 1381219 1359070 1305751 1371645 1426475
26462 1426475 1395789 1284329 1244416 1270457 1221658 1176841 1164067 1190819 1216049 1187840 1191132
26451 1191132 1145553 1136045 1141490 1161008 1231586 1239543 1185212 1193976 1168755 1146176 1143683 1160079
26439 1160079 1181829 1182210 1052763 1036654 929837 978061 1033939 1049335 1040623 1058312 1077596
26428 1077596 1074420 1051035 1035697 1018857 978314 918157 918679 942596 957516 943743 958849 955561
26416 955561 1004281 972063 948244 889080 834344 857664 872065 866368 795572 771022 753876 726179
26404 726179 762345 781930 769755 829816 900059 895705 875889 918464 923030 915242 880952 856097
26392 856097 876156 829259 818813 876307 845545 775750 737479 744656 726105 738046 806803 806168
26380 806168 739793 715321 779954 752328 647222 593285 575139 610592 616980 604911 619378
26369 619378 628163 603291 655049 675248 603863 598466 681096 727080 672651 676628 674843 704043
26357 704043 741387 756095 730855 676630 643644 642103 604016 608919 661580 688112 714616 704737
26345 704737 689894 615035 512505 484542 525303 548067 572870 589123 638653 619778 591232
26334 591232 567718 584710 588435 628206 608290 530024 510226 468980 443146 435196 462059 491103
26322 491103 535341 575838 587459 542329 538245 539439 549122 475500 324498 324584 335354 383418
26310 383418 439197 469074 447143 374052 397792 399338 378100 385473 420371 430753 443802 437928
26298 437928 417769 386561 382464 373130 348411 389782 387354 355672 359708 407814 426898 409227
26286 409227 378275 309565 293174 341106 433108 429742 364258 310940 343957 378445 386919 412700
26274 412700 429169 408848 420929 375897 409235 401502 406603 398056 373802 371854 390607 348567
26262 348567 356697 361271 299590 296420 352472 355908 379833 396027 393291 328147 328920 384314 359749
26249 359749 296398 288612 245167 220299 244243 291121 274155 249565 293669 276539 274634 296097
26237 296097 305971 236227 169750 205859 244059 233238 284655 269074 303264 333059 321474 287427
26225 287427 328321 318230 307922 304732 296431 303948 356566 317273 306400 286991 226645 279292
26213 279292 309896 300519 264980 263155 263208 247352 244587 226336 263274 254040 276168 235465 224449
26200 224449 241615 246350 234367 188352 201736 240702 247757 217640 269413 320945 375404 390125
26188 390125 322079 241065 248254 282902 282576 265597 249949 248193 302064 295313 232251 189813
26176 189813 183334 186230 241198 232888 220390 212498 245465 268600 290835 280643 271259 226854
26164 226854 275376 258023 205527 180640 167665 215368 174437 182838 227682 278864 257696 229809
26152 229809 232251 238035 251105 221293 203453 153429 130186 206389 265425 262263 274994 217387
26140 217387 183686 199007 258884 304718 287688 260884 258973 221340 192007 238717 226847 239915
26128 239915 208541 240244 231918 213106 169876 179850 205063 169283 136841 97471 41851 120830
26116 120830 161379 124538 123645 93151 60302 96942 99640 147283 168590 141754 94518 93296
26104 93296 61019 68144 100128 145754 129707 68743 61382 62800 107907 101692 133437 164152
26092 164152 149281 158308 139325 178813 152215 122159 105071 149997 189142 216495 207383 192012
26080 192012 183008 198740 161302 139318 143634 111939 47685 39284 69634 80381 126299 138477
26068 138477 134845 121361 195941 225603 235662 213987 238274 241345 222459 149538 39612 -796
26056 -796 60224 101617 125145 69316 -13878 13018 71071 117071 148418 141417 161409 166194
26044 166194 201965 203445 177783 155360 104758 104893 131971 157502 184518 198944 181622 187951
26032 187951 202026 169304 137973 118215 120553 116464 86779 82000 76287 106022 103490 126054
26020 126054 138112 156222 182058 137690 129318 106107 114561 149986 211485 207845 205254 214698
26008 214698 180017 245494 172439 94882 94933 91650 107448 122051 132042 44824 28991 75462
25996 75462 70339 56132 33759 47919 99064 141143 146896 114123 96093 102756 111778 153984
25984 153984 206266 183620 138521 144534 147208 217719 216200 154178 180515 193611 143276 127937
25972 127937 148700 179647 247361 276962 280610 309104 293172 242354 150278 104845 159453 152892
25960 152892 75230 11649 65079 102041 89532 107952 143788 180097 185546 174364 152886 150332
25948 150332 181847 210681 153894 155815 176727 137372 120850 135573 124228 108747 99862 41346
25936 41346 71816 82532 85079 94826 85872 107304 83472 64442 61037 133736 108031 111500 132141
25923 132141 163344 155575 117243 108380 72689 77886 47053 16894 -35521 -55072 -30424 -31857
25911 -31857 -7673 85767 127274 163810 171389 186208 138063 112527 77125 67137 67988 54646
25899 54646 41363 42587 6474 31463 45942 58026 161163 122067 93800 90129 111044 86969
25887 86969 52400 18039 46755 6767 32104 77668 127305 163878 148586 83871 66237 100249
25875 100249 79863 63050 44352 22884 -26078 -53627 13080 10693 10037 52433 85149 34198
25863 34198 42635 55399 9973 -27067 -44209 -9860 62818 84418 117929 127118 80975 166523
25851 166523 175809 110137 87577 107837 95382 65219 63006 94742 95815 82448 53014 56783
25839 56783 -975 -31352 -19716 37516 76867 73329 99922 61352 21607 54557 100922 107647
25827 107647 106022 79021 87923 115197 80295 8785 16621 61969 58443 60683 100414 77590
25815 77590 39203 75887 75633 57638 57967 52917 36986 44549 101996 85213 12048 41823 41993
25802 41993 49420 74907 51335 45783 12154 5600 -18646 -14711 33145 84911 103552 36797
25790 36797 34754 119034 124075 128295 64163 52844 69870 9326 -33633 -12423 35366 77615
25778 77615 96052 130041 138021 181522 179714 142401 132344 170069 178543 184706 151872 109340
25766 109340 87430 75273 94631 133664 127021 96517 94020 35018 18709 4006 28637 63716
25754 63716 49355 41023 80162 124657 137335 70867 68453 123739 95146 66463 125066 156310
25742 156310 119945 77724 59993 51600 67659 105694 92563 45083 31654 80327 134671 94598
25730 94598 75144 106518 115653 111884 110344 97304 107283 118769 127480 87088 52158 73924 63091
25717 63091 51588 54259 61986 56696 81166 54684 53786 103229 76809 59773 68896 93386 35008
25704 35008 10624 7703 19951 48775 12633 -18787 24631 47380 -12552 -63882 -65650 -19669
25692 -19669 6421 62715 43239 69045 122493 76276 6379 -51666 -43805 -409 6313 -20370
25680 -20370 -20777 279 22017 16379 42442 1416 -65633 -35698 -11302 -23553 -2226 50008
25668 50008 60572 80350 95288 120683 97779 88198 81594 44146 43234 87072 103576 79790
25656 79790 62941 52556 48056 24486 15903 -9415 13992 48046 27054 13569 23679 43395
25644 43395 62957 34755 9549 -12161 -10936 -11452 16326 33923 42961 70609 80596 37136 85425
25631 85425 110034 134770 118652 95046 130261 123235 96080 117231 132899 91870 90558 108230
25619 108230 42457 45276 96158 92405 96170 113636 70998 69962 28357 52863 98207 74878
25607 74878 62383 107701 136939 63132 29134 76392 98104 71903 60392 60491 107416 80624
25595 80624 39822 35805 -4019 -14998 -33155 -45765 -44383 -16889 16894 29907 17603 -3854
25583 -3854 69954 111911 76002 78062 114925 81133 47640 137768 157517 155835 124637 82747
25571 82747 133213 173624 110088 94317 78720 -11341 -20233 9829 12866 -3650 -642 -3057
25559 -3057 24376 40787 73965 64300 72170 77880 74033 71056 62872 -1416 -60547 -61636 -6535
25546 -6535 19404 -8282 -26529 -9337 40201 76402 -10291 2970 40823 49266 11818 9569
25534 9569 -4264 14951 30498 46197 106847 102230 79486 90057 84388 73876 82774 -1315
25522 -1315 -31381 27657 70459 59672 5098 -8799 354 39530 41427 39378 20751 50418
25510 50418 70002 -7879 -51556 -6757 53812 50229 -43195 -53811 -10695 -7453 3925 23882
25498 23882 117995 120229 -20850 -49556 -24794 -45578 -12636 39455 56204 52819 63318 41922
25486 41922 -16753 1080 14266 44765 66590 42530 3721 19111 37618 68160 31441 19243
25474 19243 58071 -15656 -46304 -54904 -48868 -4947 5341 4234 42672 22830 -38849 -50422
25462 -50422 683 6228 -2809 18007 3307 -8782 52557 107880 70912 26879 56097 102321
25450 102321 101772 70033 20405 17728 21172 -12008 -54274 -43506 -44048 8000 68940 84067 65531
25437 65531 18984 19299 68521 100899 78102 11562 -24501 -31003 22519 34087 56075 68949
25425 68949 71743 90270 72829 51019 76033 106691 107102 125564 158630 111336 53330 71719
25413 71719 106404 70224 58191 77467 140445 152175 70223 34820 21414 40133 -1865 4500
25401 4500 4800 50536 42248 75074 28615 36813 31198 9764 -26853 -41539 10864 7731 73267
25388 73267 59210 -18023 -55954 -52487 -26040 6519 -13794 -6340 -8399 -44351 48737 80820
25376 80820 11312 18462 8206 -17834 -34036 1184 45350 39577 -11266 8008 70908 56210
25364 56210 30920 -12646 -2029 60255 65376 37835 61412 126448 122127 95152 60101 32182
25352 32182 -577 39556 25080 49778 50638 53305 50267 90338 86998 87962 122092 122053 68650 13018
25338 13018 26624 61118 45890 60058 45479 58174 42221 -5152 -33699 -19181 -11958 -21368
25326 -21368 -18179 -362 -20067 -8354 -6267 -10799 -68436 -39052 -77105 -147150 -101629 -58365
25314 -58365 -85599 -74724 -105399 -57236 -20854 9996 30757 19309 -63030 -70676 -42039 70396
25302 70396 63727 -10762 -38174 -17932 -18512 -41406 -47460 -31068 -64794 -84369 -68159 -27772
25290 -27772 -68762 -88690 -11991 -23196 8701 38703 34095 65332 116544 100111 28850 -58675
25278 -58675 -40542 -44068 -22602 24645 19514 -18073 -67281 -48206 -1851 46727 56808 30843
25266 30843 -2593 3516 7347 -18840 -42473 -10263 29533 29424 47346 17781 -12661 33517
25254 33517 74880 54055 64624 105548 28688 -62460 -89886 -46036 -11359 17717 56183 -6851
25242 -6851 -92554 -89854 -58939 -33873 -2148 -22529 -2743 442 -17261 -19340 -7861 -18581
25230 -18581 -25818 -57361 -32389 12637 -27347 -8012 45784 4442 -50140 -55815 -24434 -39991
25218 -39991 -17929 -13778 -66 -42771 -65673 -83823 -119554 -96254 -75874 -75481 -69132 -64374 -74553
25205 -74553 -59515 -21820 8737 45482 58208 74002 58513 65926 100477 57774 10648 54598
25193 54598 80061 77562 32289 1123 -8685 -12914 13142 -30627 -23728 129 65236 85277
25181 85277 58484 67468 44305 30916 -1484 4272 7755 4660 2048 -33567 -36868 256 -6126
25168 -6126 -45041 -63379 -92672 -84526 7493 59490 76568 49850 5484 37923 56646 -71639
25156 -71639 -70002 -22039 -34518 -45882 -76731 -54939 -56866 -9054 7267 14379 44793 51793
25144 51793 21757 -33871 -15040 -22887 -35595 25964 53782 74797 45272 -3003 -108871 -159921
25132 -159921 -118233 -76999 -51656 -56496 -90160 -77952 -58819 -18141 48746 6379 -65193 -38758
25120 -38758 -11614 -30890 -77070 -121783 -120076 -71260 -11348 884 38462 101511 -5025 -108694
25108 -108694 -111419 -56509 29375 33401 14944 26702 22587 18799 -1913 42249 125834 128414
25096 128414 39395 27754 73363 68505 32413 -26398 4795 25887 15181 -35423 -54256 -26498
25084 -26498 -21934 25574 -30769 -85968 -41940 -67710 -89 4281 -34430 9243 6024 -17492
25072 -17492 -34920 -62788 -122668 -146041 -79035 -6411 -27637 -37730 -61084 -31302 41021 49477
25060 49477 105498 53755 -9114 50013 42061 15182 17434 -28588 -40643 -35854 -30473 -23947 -44939
25047 -44939 -14775 -44895 -42071 -11351 -25131 -92487 -56786 4281 13021 -29645 -12897 50164
25035 50164 73357 47797 1952 -1669 103464 134984 110705 146236 168079 125879 105593 71803
25023 71803 60873 70063 64848 85208 62086 21768 14985 48355 66109 32788 -8718 -12879
25011 -12879 -66621 -60013 -61460 -90791 -103219 -59093 -21150 -31181 -74299 -72125 -70417 -75716 -52490
24998 -52490 48807 83584 72800 73265 110643 109225 84562 28071 -19425 17644 -11531 -19107
24986 -19107 -47438 -38135 -20525 -12091 -2837 34504 -16380 -86291 -90219 -87538 -54337 -17233 -43730
24973 -43730 -72515 -69694 -59803 34750 54360 51057 9277 -32750 -41076 1805 22067 -17497
24961 -17497 -44832 -71145 -57925 -41835 -25557 -8 -8657 -69558 -52757 -29847 -11038 -17791
24949 -17791 6880 63135 54584 42933 41048 59843 83727 45975 35576 70046 89976 101920
24937 101920 87706 83871 28585 -11598 -30400 -41112 -36134 -13654 20221 336 -23527 -2964
24925 -2964 40849 6798 -51199 -126174 -116384 -68643 -62156 -92573 -104467 -5297 23548 -39717
24913 -39717 -20691 -8183 -3840 -11573 -14018 20414 -7315 -14344 -38522 -61184 -56609 -62986 -42298
24900 -42298 14230 -4018 -53384 -89397 -47193 29769 26532 -9965 -35119 3853 5640 -36664
24888 -36664 -51222 -76079 -101803 -96516 -67708 -44261 -54378 -5240 3428 -31737 20301 4310
24876 4310 -24919 -30703 -10503 3205 19529 96854 118964 102073 53423 49013 33980 5493
24864 5493 -7538 -45450 3403 -49960 -111665 -126894 -158681 -101225 -20794 -29124 -29384 19474
24852 19474 38056 45673 48688 -16703 -30417 -5499 1729 9056 -28317 -82048 -16389 2817
24840 2817 -11221 7296 4196 24706 51825 50490 2007 11745 10529 5830 -52550 -86639 -78818
24827 -78818 -52480 -63075 -33576 -61755 -79032 14711 42995 12016 -21597 -21628 -33628 -91864
24815 -91864 -98853 -80306 -60659 -32136 -41217 -39355 -22979 -52434 -11643 6178 -25267 -5659
24803 -5659 64501 116498 108810 78036 69339 50051 1640 -48114 -37582 -67236 -101498 -44691
24791 -44691 -35915 -6196 19922 11939 -30129 -24604 -42047 30098 60643 32328 42174 57863
24779 57863 85377 8272 -28329 -13983 -7438 -24080 -46990 -62528 -79194 -25843 -27779 -42309
24767 -42309 -27693 -34390 -19978 45490 16561 -10771 -26518 -42779 -63798 -119472 -163501 -226109
24755 -226109 -267921 -243757 -161608 -80092 -72503 15013 16851 2748 -2828 10018 -15694 24227
24743 24227 25869 -1274 39974 60087 8805 4573 -35564 -61113 -109983 -136837 -83252 -45526
24731 -45526 -72961 -98615 -70577 -53951 -49808 -61771 -61509 -22993 -3741 42079 62476 -10707
24719 -10707 -36966 -14856 37513 96533 114114 47109 -15163 -14198 -50073 -31504 36967 58923
24707 58923 87289 65552 71653 29278 29992 56579 42945 -7300 -90699 -141282 -125914 -83007
24695 -83007 -77048 -61626 6463 28029 -34529 -76938 -31387 -15101 -34840 226 -5878 -71528
24683 -71528 -59991 6683 14594 -9987 6044 -48447 -92795 -134999 -121488 -108452 -69946 -31767
24671 -31767 20894 73621 54320 11932 -3237 41711 41053 8179 -2785 -25916 8478 -1544
24659 -1544 -41896 -43627 -48004 -69604 -64978 -60176 -63594 -43033 -23755 -91255 -96467 -32948 -9553
24646 -9553 -27422 -31772 22210 22585 -2967 -56669 -69334 -74038 -53215 -105451 -54499 42489 72584
24633 72584 51046 -24527 -21033 7025 -17665 -10381 22685 -9722 -57760 -76387 -11793 -12040
24621 -12040 -17945 -16812 -15610 -41187 12313 13194 41124 9860 -72925 -25793 31604 6983 -41040
24608 -41040 -48387 10371 38955 60053 -4699 -22896 -14576 -89821 -114150 -39455 16311 -21756
24596 -21756 -2050 6001 3541 12759 18775 18566 19442 9874 -37877 -57340 -52606 -60876 4 37481
24582 37481 22564 50669 89068 126288 100801 58242 -31264 -95287 -68610 -11568 -869 -6583
24570 -6583 -35340 -66481 -83934 -51603 -60778 -71100 -55272 -17084 -34516 -16100 -26357 -44272
24558 -44272 -45344 -96942 -126569 -165522 -103908 -81268 -122134 -76448 13915 35865 -27151 -43588
24546 -43588 -72352 -86275 -23684 10237 -23157 -21048 15690 83606 81672 54434 28589 -22037
24534 -22037 -60150 1116 76601 52349 26799 30955 -25912 -15984 14925 27361 -9607 -19268
24522 -19268 -5376 21201 10942 13617 -41127 -99605 -134795 -116816 -170925 -193595 -126155 -154110
24510 -154110 -141240 -81180 -83904 -42632 3717 -38233 -43741 -69652 -30148 17293 37032 2012
24498 2012 18255 -11047 -23779 27214 -1655 -51510 -43780 -53989 -60627 -62463 -21485 -52794
24486 -52794 -55390 -62563 -52129 -67933 -44028 6287 41304 50506 15550 17626 -41037 -100580
24474 -100580 -77393 1218 44198 3922 -20336 -31956 4545 -3899 -37453 -101123 -116193 -120315
24462 -120315 -118008 -108406 -43379 -44299 -34862 -38674 -77490 -42410 -47274 -35600 -61051 -25449 -1881
24449 -1881 -30004 -92819 -53915 -70306 -28996 -16616 -57055 -77725 -38203 -92518 -130737 -129419
24437 -129419 -84945 -27737 -60827 -34054 -17737 -53735 3127 105050 99367 13727 -6614
24426 -6614 18880 43475 24206 17870 11122 39102 27213 -20405 -34350 -77766 -55684 11094
24414 11094 59032 14047 -59657 -62279 -76309 -88610 -53181 -45499 -51214 -21244 1107 8864
24402 8864 134 7016 -4853 -69828 -73926 -49521 -23472 -19875 -70967 -61253 -16796 -29724 -31314
24389 -31314 -16238 -10409 -35703 -77175 -96745 -43178 -22685 -2629 -56769 -69062 -102625 -108070
24377 -108070 -93898 -95797 -47762 -54043 -89876 -71567 -70726 -54128 -46693 -45599 -52381 -68714 -17484
24364 -17484 -22212 -58985 -63879 -41901 -43699 -56265 -42702 -8914 7905 12580 -93995 -164650
24352 -164650 -137028 -66910 8423 -9196 -17080 17488 6973 -14 -37605 -42680 -17275 -29817
24340 -29817 -48546 8329 -7154 -69599 -88300 -57518 -45504 -70826 -45772 -48433 -16408 86481
24328 86481 43605 -15512 -28864 -66362 -76681 -89901 -46598 -39432 -65924 -94745 -149833 -78760
24316 -78760 -22763 -97667 -158157 -97243 -6429 -63430 -80124 -60020 -32479 8322 3855 -18430
24304 -18430 -761 -13051 -18184 20957 37810 4836 -4339 -5199 -3294 -24547 -28750 314 -1536
24291 -1536 44938 20047 4551 -1876 -19588 12975 40608 -1699 -103 60700 53847 33787
24279 33787 27532 -18162 -49880 -55609 -69407 -98101 -99455 -90531 -67176 -46592 -81757 -61962
24267 -61962 -14646 -9911 -10633 -28933 -41992 -77113 -58600 -31515 -30194 -11787 -71980 -132665
24255 -132665 -116571 -62432 -32034 12008 -9396 -58130 -36493 2277 33508 -1064 -24134
24244 -24134 -51003 -31937 -37537 -15041 -12307 -50456 -53529 -13769 -31717 -73804 -105073 -75897
24232 -75897 -2682 39372 -3737 -6447 57545 102427 44361 6314 7025 -11474 -18633 -14878 -83676
24219 -83676 -52220 -19576 -36456 -13765 35478 104848 19489 -62715 -42285 -14206 -7235 -2921
24207 -2921 -7140 -66137 -46733 -10326 63533 116351 97566 43762 545 -39212 -60879 -34535
24195 -34535 -36416 -27422 37036 56679 47658 -15616 -101414 -130951 -100786 -86978 -84950 -92267 -77030
24182 -77030 -111143 -104964 -52727 -6754 4228 -39858 -81692 -80886 -23435 29054 49385 18570
24170 18570 649 -38431 -27744 -18612 785 45050 30609 22551 26242 38954 77242 91971
24158 91971 103862 79850 7344 -12508 -22803 -35376 -9114 21908 35373 17652 -10286 9530
24146 9530 -10848 -59829 -86568 -94047 -39779 -16000 -25222 -61407 -48783 31689 -25286 -36919
24134 -36919 31453 81488 39002 -12374 -20473 -66532 -57665 -88941 -97332 -34658 22262 53741
24122 53741 17538 -16772 1446 37796 23889 13531 7033 14369 37542 88238 24874 -29771
24110 -29771 -8694 -4370 -41139 6041 38011 15742 9662 -67455 -97915 -36092 -35903 -12208
24098 -12208 -2763 -68 -14372 -46397 7193 4735 -19138 7107 1930 40495 51513 79325
24086 79325 62950 7254 -65412 -47956 -123854 -180435 -168082 -122339 -93621 -84927 -90044 -43361
24074 -43361 -20051 26693 27594 23057 -12897 -20846 -20322 -24395 14849 26602 8461 -3165 14554
24061 14554 35262 51799 30299 -39780 -133459 -148494 -96484 13373 65697 -7365 -36026
24050 -36026 -48211 -97030 -110393 -70948 -68748 -79301 -31898 17716 35038 25568 35057 -1568
24038 -1568 -14015 -11795 9269 -11821 -18421 -20641 -45910 -80893 -67703 -43425 -51364 -45423 -53100
24025 -53100 -48973 -11627 9363 -29863 -3803 60473 96149 98207 41302 -1084 -4581 -14995
24013 -14995 -13035 -34550 9491 32079 -6304 -24698 4533 67312 30263 -18065 -69019 -86389
24001 -86389 -37066 22841 -11166 -87146 -126655 -91623 -61897 -65897 -95256 -109628 -96828 -81364
23989 -81364 -102059 -74058 -43134 -48847 -60439 -41544 -47708 -34898 -7985 6830 15004 -34693
23977 -34693 -50569 -63618 -97936 -48670 -38473 -35085 -38897 -16419 11417 7406 21676 -9019
23965 -9019 -15270 31687 11173 -1653 -32329 -25721 15367 -11945 -3201 4938 -15251 -23084 -65757
23952 -65757 -75617 -53794 -80066 -73729 -93418 -80062 -70477 -25300 -63997 -38042 -32779 -120536
23940 -120536 -121687 -71289 -91290 -153311 -141425 -118407 -53250 -4824 5662 39989 101422 78576
23928 78576 -16801 -35553 -17475 -24422 -23623 -41490 -69959 -71109 -46357 -26538 -5668 27665
23916 27665 9244 -20580 -88328 -131451 -85385 -33529 -25063 -12600 32226 291 33829 67247
23904 67247 22376 39768 33713 -9696 -32845 -53224 27490 41425 -18251 -30940 -69961 -90683
23892 -90683 -56607 -1588 2060 23900 31996 -31066 -96653 -125694 -139846 -192683 -154860 -109549
23880 -109549 -77970 -67218 -43957 -3995 41600 -91152 -76523 -7926 -14501 -18023 15336 -33815
23868 -33815 -67518 -74734 -51155 -43226 -89968 -65819 -10552 52220 72721 10013 -40697 -11070
23856 -11070 92961 112746 85588 88564 57850 -5070 -86767 -109357 -123739 -143930 -103273 -98069
23844 -98069 -122013 -140066 -115930 -72278 -42385 -52626 -63350 -90305 -91478 -21053 -22456 -8176
23832 -8176 3431 3155 -30097 2535 9210 -13860 13267 -28472 -57313 -24893 -46387 -74865
23820 -74865 -32568 -3029 -17963 -48502 -33581 -43405 -6497 -25828 3151 60000 82440 38380
23808 38380 39829 54064 54763 3151 -35063 -25044 -15073 -52788 -54306 228 14913 13928 -11284
23795 -11284 51784 56796 -25794 -47430 -82260 -53373 -23337 -18271 -10882 -75797 -121052 -121844 -101039
23782 -101039 -70547 -105166 -117553 -99654 -89110 -46796 7293 -10019 -9454 -3848 13443 47198
23770 47198 61321 60729 -24225 -12 11939 32593 2350 -10940 2332 -15251 43320 26999
23758 26999 -4706 28341 -2752 15549 27506 81794 20180 -68566 -99734 -77925 -9218 -3377
23746 -3377 -16311 -39291 -68422 -89766 -52074 -16690 -36995 -11970 -74173 -92017 -67834 -14015
23734 -14015 8263 -18474 -42500 -75445 -61489 -66954 -47971 -25874 -33233 -45623 -93142 -104275
23722 -104275 -114007 -77855 -61569 -75294 -53257 -18124 -18228 43815 92954 14162 28141 30300
23710 30300 -5590 -66855 -92243 -90671 -87761 -99692 -47612 8325 -53336 -99812 -72835 -21414
23698 -21414 14396 39927 40751 4214 40976 2244 -44354 -3873 -2930 11579 85692 53296
23686 53296 18583 -15121 -27905 -21184 -9993 -3416 -5357 56753 71671 50870 -69819 -60952
23674 -60952 6969 24717 39446 42171 8136 -16343 -8080 -16866 13103 -31926 -57965 -64472
23662 -64472 -37022 -27106 -49186 -28437 -44748 -15810 21287 -14646 -62051 -8567 24168 41149
23650 41149 3720 22343 -2785 -10776 35721 75366 43775 -40944 -68292 8336 -9702 -39759
23638 -39759 -59164 -53781 19760 40813 -50054 -88956 -78824 -25647 -16187 -5608 14912 -60795
23626 -60795 -46430 42275 19655 -20537 -72757 -137082 -100311 -49569 -46291 -9147 6461 -46412
23614 -46412 -36637 -57191 -52293 20165 11217 62749 61340 26150 87089 25766 40650 57184
23602 57184 8042 -36612 -65539 -94842 -44162 -56487 -21895 -17035 -11279 17366 27424 5548
23590 5548 2355 9527 12978 7066 -2394 -60145 -72034 -97774 -101320 -54705 -79429 -88570 -65432
23577 -65432 -18116 -31981 -50694 -42721 -27929 -77270 -89965 -52326 26660 29428 4751 4074
23565 4074 3213 -35894 -60341 -73820 -12947 53164 22396 24130 32953 20073 30197 35694 29653
23552 29653 -20005 -12207 -293 6330 -32718 -43661 -71570 -74173 -101412 -57158 -51196 -75902
23540 -75902 -38888 -6571 15616 -20430 -1075 -2302 -50060 -77102 -91589 -91261 -103240 -98398
23528 -98398 -77553 -54207 -23513 -26870 -11821 76305 59298 -48217 -94818 -42184 6828 -16009
23516 -16009 -33738 14266 16062 21701 -40988 -48246 -56236 -55926 -79437 -98974 -125784 -68629 -39316
23503 -39316 19025 55805 -37979 -41371 7488 -17918 -56602 -87212 6621 95653 88624 45098
23491 45098 67887 42017 25448 -8452 -35090 -56704 -85483 -85199 -55119 -38440 5035 35408
23479 35408 82867 37527 20871 8536 -28560 -30002 -42866 -55170 -72635 -73333 -82506 -109452
23467 -109452 -70841 -104177 -90760 -64811 -58698 -75979 -85898 -41066 255 12518 -25318 -5174
23455 -5174 32204 12340 6238 33144 -23775 -57243 -31339 -29614 -8264 25775 9990 3604
23443 3604 -14598 -1289 -33157 -79332 -55873 -52615 -797 18932 29079 51356 55771 -29283
23431 -29283 -88568 -72069 -59030 -70486 -60977 -69887 -28592 5496 -11243 -69835 -109791 -60024
23419 -60024 14237 18664 46740 3483 -6237 58408 50308 -3291 -19018 -36761 5032 53381
23407 53381 12394 2839 -24233 -72052 -75062 -99979 -39561 -22086 -6923 -41154 -129464 -131478
23395 -131478 -70082 -19950 -25972 -33742 -31930 427 -2377 -7610 -21148 -45614 -84213 -112831
23383 -112831 -18372 -105 -23861 16535 -34735 -54032 -1911 9311 -7849 -15588 -4823 2444
23371 2444 17162 4565 7025 1170 -22820 -36773 -62894 -68562 -58706 13033 42896 -24888 -67941
23358 -67941 -28642 14204 -29362 -41769 37001 58455 66493 32598 26291 -52912 -103782 -97578
23346 -97578 -74760 -72686 -87904 -48782 -32451 -5169 3396 -12459 -69385 -52521 -30775 -45447
23334 -45447 -49641 -47468 -25191 -43977 -81034 -18753 25523 52888 17711 -26198 -34337 -12511
23322 -12511 8517 19836 -57162 -71272 -73438 -89610 -60067 -83287 -67619 -54616 -100576 -23207
23310 -23207 51720 13679 -50798 -33360 -23711 -6365 28776 -40077 -84980 -96165 -85894 -77562
23298 -77562 -23502 31362 88193 90347 45405 -23119 -101036 -137140 -78087 -72727 -108536 -45711
23286 -45711 1338 73482 94233 46223 -56922 -117017 -113784 -55774 -15322 -3243 5780 -12391
23274 -12391 -24387 -63520 -29205 -19827 -14594 29603 59808 11394 -36413 -52469 -41294 -19577
23262 -19577 -14971 -23910 -22552 -78051 -82900 -48523 2757 20992 -14803 -22754 -10206 3189 1357
23249 1357 3121 17863 -13219 -56466 -63286 6498 81132 61684 23371 62567 104353 73051
23237 73051 28877 30460 56558 25668 19770 6083 31953 27410 467 -101456 -143170 -128414
23225 -128414 -108339 -87041 -60694 -66607 -72930 -80031 -95796 -91291 -67590 -66194 -31348 -5856
23213 -5856 -9540 -40298 -88027 -161871 -159041 -116622 -67804 -53030 6 29389 -46246 -71833
23201 -71833 -92550 -89813 -82002 -151767 -161455 -65834 4564 -5693 -22451 -63983 -98226 -136616
23189 -136616 -74754 -4398 -20835 -62861 -82565 -75635 -73006 -77542 -40758 -89736 -183888 -188749
23177 -188749 -124002 -104227 -105577 -81730 -103603 -173158 -159474 -120794 -113054 -91196 -16165 -191
23165 -191 -22982 -35138 -26104 7353 -59622 -90561 -112289 -124153 -142590 -141172 -92166 -62405
23153 -62405 -76542 -110504 -61458 -19491 -58399 -104757 -92341 -44841 -35706 -51723 -46095 12089
23141 12089 -8425 -47780 -55066 -81529 -83344 -45904 -23395 -92110 -94947 -29058 -31521 -76868
23129 -76868 -78560 -63440 -57746 -1232 53143 71790 77252 41455 -36462 -55595 -35791 -3632
23117 -3632 -31120 -47686 -101724 -108501 -83357 -46449 17763 71489 47144 -20753 -85083 -80977
23105 -80977 -63307 3783 -10759 4310 -42176 -39763 -45285 -84316 -100063 -85050 -14518 3158
23093 3158 -19904 -58765 -105581 -97026 -47994 6331 -10960 -109740 -194262 -160931 -82551 -38967
23081 -38967 -1572 23294 -79 -41328 -10920 58792 113336 137590 27159 -77292 -75787
23070 -75787 -60784 -275 53150 64796 24421 -4532 13078 4209 55390 47157 -2648 -3615
23058 -3615 38193 75395 -16708 -15743 -33289 -80933 -71360 4378 15279 -37746 -94628 -85806 -41486
23045 -41486 16731 41072 40333 22928 -11548 -32814 -54222 -82476 -76384 -67779 -111540 -122645
23033 -122645 -69811 -7471 -42591 -49129 -73546 -61414 -70073 -82662 -35466 890 -23921 -9507
23021 -9507 -69284 -76070 -62236 -18939 -60227 -5064 7347 -27274 -39755 -50299 -42064 5028
23009 5028 79692 85513 29981 238 24722 -31962 -116233 -82264 -42297 -44834 -70055 -68569
22997 -68569 1634 41085 53793 61633 81366 48028 -21141 31761 40499 -8133 -45733 -92679
22985 -92679 -21441 -22130 -14965 43518 -4739 -39202 -15454 37303 61069 45818 10413 -7362
22973 -7362 18734 -6391 10 -10882 10636 45053 7870 4639 -17549 -24565 7478 15653 43357
22960 43357 -44684 -64249 -14914 10236 49557 72811 123155 181092 154587 158822 116461 70197
22948 70197 -10330 -45452 -37330 -76873 -168059 -118324 -59662 -60657 -103236 -55303 -7567 -9777
22936 -9777 -51372 -78073 -21970 17974 18059 198 9321 -7918 -44264 -77215 -118094 -71032 -15527
22923 -15527 43730 36772 12686 10150 -32117 -59245 -42637 -48024 -97787 -117339 -58535 -54359
22911 -54359 -12628 57246 17456 -53302 -88678 -65471 -56468 -18679 33407 28157 10780 32650
22899 32650 53151 60131 52561 37942 778 -67135 -79995 -76311 -149718 -158554 -119722 -111279 -63107
22886 -63107 -49547 -74826 -106050 -82006 -89319 -65549 -79926 -39775 21803 5648 -16861 -22322
22874 -22322 -29212 25741 14221 -20360 -2454 2544 39818 -3089 -12835 -16123 -9732 17514 65616
22861 65616 48969 -36433 -55540 1316 -9929 -21382 -49119 -56820 3356 -60190 -88370 -21043
22849 -21043 59582 102199 105490 90159 44922 -30021 -91209 -58129 -11273 -6645 -7525 -45841
22837 -45841 -40988 28830 42758 -29936 -21265 -9580 -28558 -15677 -26521 -13943 -62614 -131815
22825 -131815 -85233 -88960 -9349 58954 18921 -22995 -48682 -39110 22157 73050 64944 86185
22813 86185 40036 -46343 -74019 -109067 -165823 -94284 -67433 -35097 -36540 -73069 -79307 -53893
22801 -53893 -25102 -14800 28663 83841 4544 -91341 -131681 -99629 2083 44137 79266
22790 79266 62842 -25848 -56678 -26511 -68392 -29052 -4112 -25454 -35124 29046 -22773 -82296
22778 -82296 -80610 -1826 18408 10660 -8840 -15413 -40723 -54895 -82970 -139273 -157975 -121713
22766 -121713 -90877 -100851 -114256 -15387 68325 71194 72341 82213 44049 -6430 -23677 -20937
22754 -20937 -34435 -232 19553 -30910 -105918 -101637 -91058 -73144 -57885 -6334 -43764 -23290
22742 -23290 -625 -6787 17646 -6692 -67920 -90412 -86816 -50337 -33565 -47510 -23350 -64329
22730 -64329 -51923 -86481 -119566 -141353 -175882 -96133 9417 45570 10673 24209 -3795
22719 -3795 -11923 -28652 -102303 -115242 -56781 9146 -5405 297 -622 -1251 -22965 32664 36262
22706 36262 -5555 -51617 -30863 2329 -21461 5008 -5492 -5951 -22398 -48150 -36005 -29160
22694 -29160 -4771 26511 53633 30557 27878 39908 -41518 -33816 -3654 44740 38967 23705
22682 23705 -35704 -72537 -64218 -31117 20830 -14561 -36386 -51563 -82868 -68828 -67808 -24784
22670 -24784 -30360 -39908 -83387 -101635 -56534 5831 -9508 -113089 -127410 -108554 -84180 -94420
22658 -94420 -51642 -6071 45983 97940 22254 -38914 -30818 -19825 2356 4578 -862 14795
22646 14795 19299 -38625 -47492 -40365 -20493 -717 -3321 -7831 -12222 10189 27927 -624 -52504
22633 -52504 -60231 -70433 -74250 -68448 -41008 -44197 -4532 16706 21522 1952 6827 57541 87175
22620 87175 45847 9993 22349 7831 -52085 -29860 15832 -3856 -49847 -89758 -107485 2971
22608 2971 -23273 -76965 -57349 -23181 -56553 -78635 -68291 -76082 -35323 8774 14460 20877
22596 20877 18636 -3157 -5839 -9844 28867 93403 76596 -2699 -45754 -71133 -8287 29992
22584 29992 -15563 -10977 -14251 -2052 -46160 -106601 -94021 -20628 15730 16202 8308 -24354 -101848
22571 -101848 -78179 69235 106132 -25946 -103253 -69876 -46395 -103651 -102039 -48042 5217
22560 5217 52441 83931 2437 -92015 -57880 -33243 -86887 -148944 -141040 -63886 -15519 23240
22548 23240 46347 22550 26220 -1992 -16434 -20564 -9323 24551 25463 23430 -33273 -79945 -47917
22535 -47917 -60817 -57501 -78005 -28294 62533 100724 89522 45079 -19463 -109127 -106834 -53868
22523 -53868 -64242 -36334 16719 -9455 -45945 -22949 7144 -52661 -83025 -72030 -33335 -10448
22511 -10448 21439 25414 40241 26832 31878 27653 -30661 -33953 2003 -37255 -63474 10268
22499 10268 11115 14398 -14437 -26129 -21839 -20148 -22059 -39634 -72613 -103707 -101112 -39223 -16511
22486 -16511 1457 -13103 -42708 -48139 3480 60505 108632 115648 88445 30162 10547 -22571
22474 -22571 -65244 -33354 -75660 -118778 -96785 -87968 -67555 -12363 13586 5342 13751 25179
22462 25179 51444 97015 82068 -8791 1078 45395 76190 55993 31098 35729 79344 39855
22450 39855 41960 11750 28962 -2450 -25260 -30751 -83846 -151363 -100546 -73582 -65673 -17286
22438 -17286 47123 40409 22029 -50343 -91054 -106237 -72708 -50455 4689 60095 -5816 -45763
22426 -45763 -5436 35217 28353 1967 15804 37860 -262 -53819 -100035 -95016 -44182 -25616
22414 -25616 -43681 -9393 3138 47149 32355 -7391 -15316 -46330 -52976 -64317 -94723 -75294
22402 -75294 -88506 -95983 -39898 -46772 -68303 -47453 -4446 6856 -11401 -7190 2139 10161 36275
22389 36275 36132 54618 16899 -38347 -28639 15671 -58752 -100094 -73647 -29759 2607 17531
22377 17531 64538 3128 -118262 -137441 -41768 -34327 -22440 -6591 -15714 -52003 -89199 -96606
22365 -96606 -100607 -53492 -34484 -98132 -85531 -51464 -50219 -19328 4724 -9650 -40299 -55210
22353 -55210 -53314 -25651 -14055 -1727 20837 -2400 -35599 -49746 -99230 -86161 -63531 -19485
22341 -19485 -9022 -17417 -52715 -88337 -21831 3730 -44126 -70355 -20897 -3993 -8736 -44881
22329 -44881 -65602 -74950 -72094 -74590 -76834 -60487 -28396 10491 25047 35248 8700 -15010
22317 -15010 -40008 -44620 -47582 -65617 -90432 -72272 -13244 -43392 -127802 -94940 -20000 28233
22305 28233 -12353 -32979 -35172 -29997 -2838 2921 7658 7961 -11994 -41904 -22538 6746 15037
22292 15037 -26065 -31565 19285 83710 83727 47074 43439 31837 -21149 -839 -6426 -1999 -726
22279 -726 -79288 -89987 -20819 8453 25942 -701 40206 52429 -6966 29347 19405 -13855
22267 -13855 -1577 -4219 39068 62575 22361 -50679 -96481 -114108 -10906 39194 25043 49115
22255 49115 42780 -18159 1011 -6624 43192 64320 55906 45612 57323 53660 -41484 -88081
22243 -88081 -96112 -65763 -22663 11185 1791 -3418 -77328 -157155 -138828 -97814 -35401 12825
22231 12825 6336 -26182 40078 128233 114714 112678 78096 45139 37538 69298 21049 -10833
22219 -10833 -27643 -68624 -8510 6944 20387 13185 2376 19858 21529 3801 -4613 10993
22207 10993 11408 26680 39848 49717 56218 16240 12435 86647 119484 139233 110087 69319 -30355
22194 -30355 -33750 -24833 -26317 -49846 -52156 -45926 -31556 -23003 -51888 -61410 -55351 -23015 -25395
22181 -25395 -33460 -32356 -41398 -53753 -52258 12622 43174 40646 56660 70518 31939 50293 49592
22168 49592 19589 -26051 4136 34295 41232 8615 -15985 7057 14218 -13006 -43151 -35523
22156 -35523 16299 11155 73795 55308 65878 39902 5960 17763 34523 67682 3771 -9354
22144 -9354 573 -3878 14201 47800 50969 -15483 -34226 -72433 -92317 -89212 -90918 -132078 -102412
22131 -102412 -63511 -39681 -4003 -27373 -64450 -123331 -116429 -101361 -82304 -54433 -84969 -88613
22119 -88613 -113368 -65869 -19838 7414 52153 25447 -31182 -59365 -81404 4087 65616 -23338
22107 -23338 -26911 -25154 6975 -15048 -6390 -36732 -46170 -37847 -62511 -15505 34051 40216 -18040
22094 -18040 -37824 -44209 -66749 -105893 -64790 -60729 -48922 -37884 -1909 -528 2907 -16661
22082 -16661 -44160 -31091 -9046 3503 -40282 -72151 -64478 -45353 -20991 -66741 -52267 -67913
22070 -67913 -44164 -31351 -44788 -55080 -60757 -34166 -3309 -24823 -56169 -61826 -72555 -51976
22058 -51976 -32597 -49722 -38015 -31313 -48919 -36189 27850 56452 33838 -1941 -21682 -39168
22046 -39168 -1951 -18693 -111179 -99592 -89647 -84375 -65928 -53409 -54387 -81216 -71131 -53041
22034 -53041 -63229 -39982 26652 56740 21863 11859 -26423 -70974 -100344 -84099 -105924 -134121
22022 -134121 -63568 -57771 -85846 -18183 13233 20287 10111 -3202 22949 -29884 -41850 -38754
22010 -38754 -77948 -92888 -115379 -124824 -103668 -94882 -59747 -80896 -103273 -45522 20304 30018
21998 30018 -2504 2957 13241 -3304 6949 58651 56095 8042 -31207 -70170 12248 114980
21986 114980 84447 20320 -14467 -15148 -48356 -52656 -28582 -47004 -87446 -64998 -40430 -65104
21974 -65104 -37071 -24165 -18643 -10903 48889 51647 -2686 6241 7222 -57524 30065 109994 63241
21961 63241 81850 56632 20895 19116 16924 -16897 -59463 -77987 -117439 -153753 -86594 -89397
21949 -89397 -96020 -97519 -85998 -48922 -67850 -42514 -8816 8973 64579 38055 32297 51919
21937 51919 -1289 -68902 -100894 -147793 -128705 -69945 -35172 -43729 -43472 -42244 44834 47155 -28206
21924 -28206 -50868 -27014 350 24757 13067 -7347 -39846 -43880 -1948 -11825 -30202 -1301
21912 -1301 -25035 -105512 -81041 -25471 25713 29205 -10765 27171 15152 -59129 -6525 -37166
21900 -37166 -76168 -83848 -74663 -34442 -24844 -13829 9830 68011 55943 -11681 -13690 -50666
21888 -50666 -112019 -126377 -105779 -58946 -35923 -54075 -55774 -69528 -65752 -62623 -67199 -71492 -87833
21875 -87833 -105931 -115117 -108007 -26345 372 -25328 -51825 -48696 -14554 5788 19012 30911
21863 30911 -13117 13500 15523 -48862 -50593 -35914 -67743 -75912 -63528 -30077 -35673 -21581
21851 -21581 -1089 32338 31260 16940 20743 14181 18582 28271 -48807 -95153 -72729 -3784 71333
21838 71333 20770 -56768 -40565 21433 21020 -41779 -50563 30267 49526 10992 58345 70386
21826 70386 17124 -18354 -91296 -134642 -127322 -101314 -75529 -67006 -97995 -147982 -155339 -131863
21814 -131863 -147105 -129853 -117251 -81785 -49488 -41057 -14746 36502 66956 57148 60076 61235
21802 61235 44963 -15297 -56654 -39043 -9768 -34929 -21651 65980 85174 59150 17990 -103
21790 -103 46097 -2607 24145 34113 42586 54160 37569 29040 14812 -18664 -62926 32903 84611
21777 84611 -11313 -43538 -57011 -50730 -31227 -45897 -43420 10258 22564 34968 50781 64049
21765 64049 -10835 -98524 -160947 -130599 -82656 -77151 -96729 -113629 -98583 -53236 -58210 -77600
21753 -77600 8540 64212 59144 42185 8412 23498 22009 -35100 -19906 6390 -27880 -102519
21741 -102519 -129369 -106723 -90980 -37970 12961 -19460 -42282 -67445 26599 65372 78101
21730 78101 39870 72104 52247 14368 36528 -382 4589 -15509 -90672 -108720 -118560 -144166
21718 -144166 -137034 -125092 -102584 -122518 -89657 -55368 -80688 -24349 13830 35065 27430 21400
21706 21400 56938 11664 -58778 -23004 18897 7919 8398 23816 33546 9983 -2434 20848
21694 20848 32727 46095 9073 18595 51688 47382 13777 -13557 -44405 -69219 -92377 -95943
21682 -95943 -100597 -82328 -59282 -18906 75943 67573 14821 4997 -32165 9850 37511 78735
21670 78735 69290 4264 -37476 -51843 -24078 18413 41897 15601 35328 67622 10485 -6971
21658 -6971 451 -948 -31450 -8611 -16937 -19696 -27740 -14638 44967 79515 88107 79559 30242
21645 30242 33915 95597 108624 78308 -24427 -98784 -106191 -72372 -61009 -20548 18770 -7273
21633 -7273 -32376 -52729 2789 48873 11687 2603 41288 73164 40846 -34377 -101631 -131277
21621 -131277 -88114 -80484 -54450 -65704 -127700 -100029 -69852 -81448 -71138 -31665 2859 21000
21609 21000 50848 89465 78502 47108 -34117 -80943 -51744 -20118 -44303 -41999 -52157 -35186
21597 -35186 -63293 -53158 -22251 4118 -3530 -48505 -47174 -49364 -104257 -73540 -55864 -97330
21585 -97330 -57028 15025 17912 -30737 -63450 -93399 -66390 -89669 -91863 -173515 -150434 -63886
21573 -63886 -35499 -72348 -91945 -129474 -199537 -145844 -56535 -62557 -73892 -71591 -61417 -28076
21561 -28076 -33327 -40832 -56694 -51922 -35976 -2808 -20997 -29919 65820 95521 33760 -13380
21549 -13380 -50313 -17772 -12391 -2406 48797 51026 24964 -342 -49032 -53178 -32846 -46507
21537 -46507 -76064 -34567 59661 34339 15034 27895 66698 114731 53296 -13950 7861 12341
21525 12341 35860 47556 82531 80677 59435 -25616 -73508 -59636 -29601 -6808 7684 -31501
21513 -31501 -31340 14945 46740 33359 37638 66006 10515 18111 78835 97699 122882 106856
21501 106856 38968 10602 23479 54088 33295 64375 -4244 -24910 3627 9740 -16995 -32308
21489 -32308 -26557 -25803 -30915 -31339 -52724 -53305 -93178 -102064 -95869 -91278 -93110 -49280 -49125 -85527
21475 -85527 -44670 -8552 -20692 -32523 -51386 -66222 -81422 -53350 -81577 -51476 -22525 -57127
21463 -57127 -80703 -43381 33216 82881 14938 1121 14298 -2542 -53608 -6803 2974 -24941
21451 -24941 -36047 3840 33821 23207 -45451 -63646 -38797 -34678 -50677 -61321 -91824 -97481
21439 -97481 -69811 -21309 -34697 -48207 -76906 -63426 -72009 -61309 -29471 -1558 9229 18709
21427 18709 10003 48641 56470 -31139 -102433 -98777 -54856 -3648 -71419 -95022 -54191 -33085
21415 -33085 -12765 60028 114897 81838 74350 72858 -20898 -45535 -38168 27566 60568 17502
21403 17502 34577 36355 61690 26362 15078 -6008 -35642 -51041 -24988 26427 67324 -11580
21391 -11580 -54428 -33391 23062 54440 10015 1522 -18969 -75425 -37345 19982 27579 -45892
21379 -45892 -91455 -102213 -36865 23486 26870 -11053 -29292 -44809 -54497 16056 -50774 -69203
21367 -69203 -52621 -21846 62724 48704 -6388 -54536 -44766 -11828 -22286 5896 -23047 -38389
21355 -38389 47047 23357 -46020 -55036 -31386 -64556 -48180 -80285 -154254 -170966 -195158 -175254
21343 -175254 -162826 -208931 -168955 -49968 -17435 -70570 -91381 -94459 -82438 -103521 -99741 -74806
21331 -74806 -56081 -71893 -72247 -87642 -90451 -71465 -10171 24088 25097 -9006 -28400 -28218 -18226
21318 -18226 28320 -3234 -54684 -43317 3698 33162 48943 56012 84904 87643 76011 71127
21306 71127 13838 -41891 -59280 -54040 -7838 -22990 -25284 -25199 -88846 -62524 -56042 -147475 -160007
21293 -160007 -111273 -45673 -6718 -4463 3532 -35808 -1342 18530 77228 64635 -2269 -52215
21281 -52215 -41207 -46601 -69138 1078 15022 -10289 -48705 -110254 -110410 -134003 -186463 -194722
21269 -194722 -167283 -76271 -83100 -82819 -55789 -42492 -21171 -5948 -3050 -49361 -37933 16888
21257 16888 -11505 -77874 -141396 -92395 -84515 -70940 -56714 -120632 -68861 -7005 54100 48006
21245 48006 15129 50680 45825 -34231 -46975 -23642 -6510 -47979 -78617 -48636 35493 75557
21233 75557 49419 87382 134322 144272 130059 86209 31687 31687 -3313 8353 -8084 -8059 -46179
21220 -46179 -48052 -955 103294 61256 -12663 -93217 -93562 -57363 -45215 -25802 9295 24934
21208 24934 2790 9430 -32404 -75588 -40439 52680 17152 -16752 -19578 -32145 -81632 -79672
21196 -79672 -47636 -85037 -120009 -105196 -121016 -172630 -156523 -110280 -107397 -69728 -63588 -35918
21184 -35918 -2037 -24150 -72688 -77294 -68074 -50775 2755 55210 -13599 -59457 -69434 -73808
21172 -73808 -35371 -70160 -128306 -161631 -139949 -132785 -147762 -173797 -167378 -115117 -74189 -28661
21160 -28661 -52989 -52626 -27999 -21334 -6342 65602 30709 -1893 -25644 -24112 -94 12544
21148 12544 561 -9127 -45868 -57447 -17735 29542 52168 10923 -27165 -42135 -48377 -3049
21136 -3049 30813 22070 40818 16812 -77239 -90046 -53024 -64961 -105586 -28556 14301 60202
21124 60202 82597 73233 68231 54332 47327 47120 6108 52864 76616 25639 -4861 -22522 -40273
21111 -40273 -27100 -985 31857 49067 94938 108111 58643 -3183 -34889 -77525 -95241 -123598
21099 -123598 -115439 -46785 -9527 42503 37260 -24342 -39093 -30148 -48754 -52629 -20016 1232
21087 1232 57497 93828 53998 65904 33781 15931 -2888 -24829 23931 10078 -17685 -35480
21075 -35480 -19907 -44280 -12920 40667 25568 41015 60788 50090 26232 -12953 -100220 -136677
21063 -136677 -109953 -35026 -10508 21980 -32478 -16579 10246 35801 -16507 -54050 -33326
21052 -33326 -26152 -73262 -120345 -100733 -122046 -149490 -65319 -62307 -74601 -158000 -203245 -122016
21040 -122016 -90525 -51527 -1751 8496 -36527 -53048 -24103 -35622 -44271 -26342 37226 50972
21028 50972 -3677 -59488 -29348 16697 31940 -8209 30054 83404 55999 67272 66790 6239
21016 6239 -13057 -17569 -10494 3323 2196 -52883 -60954 -69248 -67295 -46244 -51288 -51749 -60000 -78589
21002 -78589 -64993 11462 17214 -37401 -66300 -74452 -2760 -13737 -28587 -47214 -53786 -52407
20990 -52407 -44951 20404 46393 23866 -83521 -107729 -122724 -128010 -123031 -106493 -60247 -32817
20978 -32817 -36544 -51313 -67851 -16155 29065 68114 38740 48762 49277 26835 4770 -57748
20966 -57748 -16091 9465 -45186 -65939 -104653 -81998 -27434 -50894 -75429 -58583 -12755 -16189
20954 -16189 30384 55708 67580 67938 50300 -5050 -10702 -29246 -898 -5780 -10006 -5642 -11769
20941 -11769 -45138 -48979 -23228 -24910 489 10385 -16312 -39794 28644 77899 85505 30324
20929 30324 -568 -62583 -105362 -41544 41494 41544 42849 15920 825 -18328 5162 55120
20917 55120 49801 -49309 -103271 -82682 -59808 -43020 -64895 -12005 47974 48220 42226 10711
20905 10711 -15768 22382 14560 -20619 10194 23354 -6719 11469 26171 -24226 -27643 3920
20893 3920 23249 7680 22745 69600 72321 32552 24584 26717 17573 4946 11792 5080 17537
20880 17537 46532 92971 77742 4960 15470 -16510 -16941 -5698 12196 31483 -31238 -77649
20868 -77649 -94984 -86409 -51589 -27400 7899 26021 72930 112123 133929 54457 7908 33892
20856 33892 14485 -16213 -59043 -14695 -32420 -53461 -69008 -40624 -26682 -20667 -26418 -65566
20844 -65566 -52056 -24072 -43915 -53409 18120 30235 32547 110781 116470 74305 74056 9223 -51076
20831 -51076 -8603 63122 27876 -25536 -9998 60753 7967 -108234 -97353 -59605 -34880
20820 -34880 -59700 -87213 -91135 -91776 -133344 -115038 -100821 -91583 -61617 -6344 -48182 -105068
20808 -105068 -96116 -34013 -36137 -83229 -92123 -82988 -97976 -63128 -64951 -17695 33651 72744
20796 72744 60377 34703 9245 6974 -1019 -36972 -38197 -44768 -71867 -51359 -39971 3830
20784 3830 -9273 17360 22582 20744 -28352 -91258 -91710 -92656 -7424 45889 63075 66936 2983
20771 2983 -6889 23387 37054 35618 45385 29040 -29698 -70372 -25469 62522 125732 123003 -8992
20758 -8992 -61511 31726 39429 52822 53594 64532 52241 47512 15488 4088 51712 8834 -11367
20745 -11367 394 -9017 -35106 -31026 3061 49620 68128 41985 56085 40397 32763 -24065
20733 -24065 -10312 -42090 -49393 -49874 -28688 17155 62719 69064 5984 -36094 -59543 -31576
20721 -31576 -11740 -29314 -13473 13280 5839 -38033 -1032 9838 -4438 14756 45222 70882
20709 70882 18161 15863 17146 7326 16913 12391 -265 -13160 -7935 50316 46992 -2342 42909
20696 42909 48816 30807 74926 69116 28837 34423 31600 35578 40481 644 -5388 10755 16832
20683 16832 3435 -30880 -83818 -121159 -155521 -157200 -81924 -57903 4280 19061 18222 4317
20671 4317 36832 -4059 6616 4991 -42847 -89868 -86401 -76796 -81176 -93743 -133495 -83764 10811
20658 10811 8287 31934 47163 -9946 -2173 -9604 34548 71869 51899 45577 41109 44303 48372
20645 48372 45320 60883 114922 76431 -90 -75023 -65767 -83086 -95003 -45767 -12073 8272
20633 8272 13295 -11737 -48110 -65484 -58564 -37107 -67676 -34440 6876 -2015 25029 6715
20621 6715 3924 61566 54038 -47078 -74578 -18598 -4156 -5879 2824 25920 25555 -14234 -37932
20608 -37932 -52399 -53828 -28309 -45477 -47032 -24942 -6441 -23525 -14265 -27481 -29507 1221
20596 1221 -2490 37240 46658 73429 66795 32078 42241 37099 73641 40429 -4852 1843 -14365
20583 -14365 -14448 -3972 -14004 16474 11116 -9503 -9782 77163 73617 52800 -2776 -58992 -74227
20570 -74227 -27084 18063 18563 -13317 5592 58042 60133 -6059 -15672 10944 -1902 -17017
20558 -17017 -15675 4423 -46689 -30821 -14798 -34859 -44761 -91720 -60977 -49677 -113873 -105477
20546 -105477 -92927 -73488 -18928 -19894 -86128 -27803 41919 80410 64510 -22197 -94345 -90711
20534 -90711 -76930 -52774 -71961 -80568 5455 24313 28047 -15376 -11671 -12797 -59506 -47405
20522 -47405 -76256 -81874 -17599 32811 -3088 -8324 -15539 -27980 -34355 -29013 -89428 -167558 -122832
20509 -122832 -60905 -83764 -109274 -47230 -36525 -66282 -43214 -37861 -58112 -23290 484 87428
20497 87428 111347 65422 51699 13322 14798 -5863 30815 92646 86161 31494 20218 46566
20485 46566 61151 73304 112907 99477 70882 91046 87551 24608 -59985 -54943 8871 43433
20473 43433 -22490 -63565 -42203 -57392 -75323 -62557 -50196 -50065 -8590 8374 26062 -18369
20461 -18369 -23507 -54108 -90095 -64319 -36010 -76256 -17036 -2595 -50160 -33053 -55838 -62758
20449 -62758 -66782 -87359 -55379 -6074 11817 -25406 21704 -21705 -50516 -59436 -48332 -37489
20437 -37489 -12376 50432 75231 85775 41557 39873 76774 64678 8547 20822 72631 52186
20425 52186 80800 95477 51268 57091 34903 57930 116129 158958 240891 341607 359332 518230
20413 518230 735605 1009050 1366305 1656269 1772166 1777516 1772145 1925480 2081445 2032903
20403 2032903 2000624 1979201 2018406 2074820 2008302 1843269 1806531 1845762 1822041 1611878 1289971
20392 1289971 968137 690204 433053 284151 222831 283790 261185 200717 159474 138476
20382 138476 161207 131410 90678 108350 111634 68949 98611 79546 57944 12864 -17073 9677
20370 9677 5769 56199 105517 103262 141568 108681 49282 23606 18140 27110 78549 85560 51960
20357 51960 33941 27508 54888 34418 44785 -322 -43966 -20868 -15595 -33722 3109 91766
20345 91766 91074 81405 54857 54015 79641 51145 66990 60915 19641 65735 153048 111490 104361
20332 104361 92028 14890 -68666 -80155 -114841 -60774 -54766 -22587 43089 75699 44547 33170
20320 33170 51315 40865 11859 -18674 -17370 -7931 17085 -52669 -84830 -15408 19366 43132
20308 43132 37852 62567 36059 2306 574 72428 102088 89709 69605 83490 176568 148202
20296 148202 56618 23317 24546 51342 23342 85689 82164 11763 -6953 7597 29677 43220
20284 43220 60150 41439 -18929 -61463 -32848 7567 -23288 31282 88960 59330 68897 64178
20272 64178 83272 118162 104543 51402 12343 43680 38876 23958 89153 46356 28536 46610
20260 46610 29662 -6380 -25725 -38122 -11893 -22803 -27202 -5491 15855 3853 -508 -16993
20248 -16993 34209 20379 -55155 -74168 -19473 18604 41382 33571 -346 1842 70237 91573
20236 91573 96015 26153 8115 21074 -25697 -34433 -25908 20748 28466 12299 14811 -19847 -52679
20223 -52679 -22114 -34411 -28436 80036 133203 114145 89212 72510 114021 118781 103920 35726
20211 35726 -32882 45553 58888 66361 69392 73719 55556 81764 114420 166015 144517 35072
20199 35072 37826 82158 109647 102977 43018 -1066 36536 58760 104069 73631 -5767 -8634
20187 -8634 18762 12271 39493 37678 -7854 11929 47263 40953 60643 44961 35104 8319 -31772
20174 -31772 -17407 19318 38639 16817 21717 57605 78276 61673 -11628 8497 64204 40505
20162 40505 21903 47792 -12840 -27916 -7518 -5731 -51760 5841 50926 21070 46403 103755
20150 103755 106670 83424 70022 -4076 -35659 -41252 23511 30184 30614 74749 41405 20222
20138 20222 49650 20386 17315 -9997 -41564 -12959 22544 75885 114063 112687 80173 105868
20126 105868 83933 70155 21891 26545 57720 41785 53984 39714 15221 -36989 -33002 -31320
20114 -31320 -16846 -5127 62682 103441 60655 -4925 29742 3204 61672 117031 119565 94255
20102 94255 143562 106935 85192 74039 60936 30252 54061 71196 64689 120438 155309 135374
20090 135374 101388 45019 24315 67782 90155 62865 54739 15346 -38121 -6674 53272 28425
20078 28425 11149 45375 71263 73511 47870 61142 87660 124666 97775 66711 126 -36288
20066 -36288 9146 5742 -45689 -69066 -33719 -27587 -31798 -22227 -3149 -36306 -44442 -62726 -128951
20053 -128951 -150665 -112668 -101610 -49784 -25150 -6080 55006 112366 69925 3851 6895 36211
20041 36211 71106 65844 83544 68041 77254 111865 105068 69169 38510 5311 8367 97869
20029 97869 140892 132402 103110 164367 168448 119497 80558 48043 12299 7449 61694 86555
20017 86555 88441 115389 147437 186110 128446 107975 127162 248427 237792 204526 240672 262215
20005 262215 223585 204542 243327 246081 241886 297776 266485 241736 264307 321014 325598 292008
19993 292008 218128 224237 243161 154455 80185 63042 87348 107411 30030 90162 128422 137914
19981 137914 142950 128607 140602 129141 121385 120787 96493 78816 53525 30450 38093 50569
19969 50569 90719 117207 98604 152874 195537 208468 266860 314906 290996 249787 238217 293559
19957 293559 292593 284252 338385 341263 293151 292674 285385 325041 435693 608127 618735 482968
19945 482968 434720 438308 575409 616659 514793 465081 471209 433889 425603 358401 386050 453526
19933 453526 456233 433568 358484 285830 210983 144551 161700 128851 110465 52678 20716 26302
19921 26302 56997 87197 110129 106474 94339 80841 51930 14777 -12971 3696 68705 102050
19909 102050 121188 161160 173744 135381 58841 62351 72942 97221 127534 145111 149988 136233
19897 136233 110939 154273 170329 146588 140170 206947 238665 249297 182646 167172 202331 185411
19885 185411 259080 296269 281396 291777 316695 387187 482527 523527 492092 439621 411136
19874 411136 430284 398857 382860 403559 381939 425996 416231 393587 368188 324917 322411 373512
19862 373512 423622 460374 456781 459582 388053 373512 338345 355571 345999 330212 343261 355614
19850 355614 353383 363679 327386 331451 294245 307876 399318 420177 439021 445252 462423 467883
19838 467883 442978 440351 483869 530193 565601 551837 603860 580665 499493 533916 564773 601118
19826 601118 593340 587912 565908 566564 626753 604994 574942 563282 580456 675735 740060 803477
19814 803477 868377 919455 952653 981175 1006171 1082024 1083045 1112629 1169730 1161962 1202798 1257647
19802 1257647 1311527 1334814 1382149 1436955 1586489 1772568 2074791 2513615 3092727 3502949
19792 3502949 3581358 3656856 3860636 4216988 4480107 4545494 4653296 4950316 5458152 5913459
19782 5913459 6086270 6332541 6706079 7114041 7496540 7839753 8221918 8589805 9015592
19773 9015592 9733028 10556384 11502892 12679425 13926332 15449256 17322587 19759915 23156380
19764 23156380 27817775 34553295 45146314 62914364 93900139 145728101 219825406
19757 219825406 288160744 302036567 290159037 296608665 320652180 353332330 350505574
19750 350505574 325365424 325930843 346894164 368048128 348292079 315335736 307336855
19743 307336855 317104360 332158417 305507550 245706241 190798593 134392325 87085057
19736 87085057 58479181 42594180 33167770 27151946 22983118 19840823 17371949 15472677
19728 15472677 14016308 12778543 11661751 10606676 9722994 9015151 8313655 7761062 7510104
19719 7510104 7427191 7160071 6630375 6196167 5858831 5539833 5207873 4750664 4467759 4369641
19709 4369641 4310123 4098104 3773339 3610509 3562470 3529475 3346377 2897029 2512778 2193577
19699 2193577 1898886 1612406 1476017 1381585 1310660 1181642 1127642 1078871 1063589 1088814
19689 1088814 1065856 991895 902972 861367 852197 802012 762001 736441 726764 687093 688886 727688
19677 727688 753058 732268 710698 670051 694142 684891 690153 642938 663150 634982 601900 597454
19665 597454 566899 601908 543042 484358 478487 487123 516825 526396 537031 466357 387052 372143
19653 372143 336188 315150 374213 393832 355307 312720 342720 354316 323400 324742 339633 326806
19641 326806 269292 256497 269527 318573 320021 276093 266054 250659 282286 323869 369943 344331
19629 344331 327636 357749 391759 346710 179575 191003 313996 360938 362925 277007 238873
19618 238873 189032 199671 209695 123915 190639 162280 141056 141107 150563 139371 186113 199578
19606 199578 104779 66629 55474 50817 113410 135989 189946 213035 163723 173421 236437 346641
19594 346641 370979 314873 353745 391005 412625 480680 596266 789920 1051185 1277007 1399441
19583 1399441 1416119 1301467 1155763 994872 994293 1077410 1228745 1475123 1794160 2112458
19573 2112458 2314088 2348034 2072847 1705983 1301825 969010 762696 689607 738278 879989
19563 879989 1017573 998975 889620 703588 493631 231114 85700 76577 7411 -82954
19553 -82954 -142838 -197487 -113471 -52334 -47876 -81004 -34847 -19602 98775 158503 186479 166358
19541 166358 180861 140869 11199 24050 38944 66213 50594 23510 -9754 -14811 30673
19530 30673 81831 84748 60045 83557 87993 177513 227551 211086 182106 174245 125327 128492
19518 128492 176454 217083 181912 80135 73544 77039 36735 14191 -9569 47656 123675 152006
19506 152006 149796 126174 91702 61437 26823 27854 -44 37222 52556 90193 105172 73631
19494 73631 71242 52815 23318 68651 77936 59008 36798 33882 33106 27463 75233 24865 -8551
19481 -8551 34031 97454 163091 158685 82899 57528 84331 -4766 -63584 -11219 57820 35959
19469 35959 15122 36150 59885 16485 -21704 -9751 17206 3397 -23266 -74329 -94843 -34309
19457 -34309 17309 62565 74476 103677 91060 83828 128293 129571 98033 116498 113724 93067
19445 93067 107627 134279 139385 166260 174655 179654 178677 113495 103217 154023 192687 201383 157838
19432 157838 182416 185037 116984 65398 50460 25704 72229 74383 33331 5723 -11577 -10189
19420 -10189 -2096 34216 45931 8948 -29393 -35478 -30377 -37642 -61790 -59584 -64223 -43735 -16189
19407 -16189 -66675 -95245 -76856 -6827 29624 12027 -2598 50587 68246 106055 98333 100286
19395 100286 71531 28851 19211 57557 50578 37110 9838 -43012 -59285 8505 47258 14173
19383 14173 -6927 2899 47541 62249 100215 100403 61361 57154 59156 89251 147045 130173 113660
19370 113660 102765 86686 25298 33792 38198 88749 64646 41590 40992 16899 18984 13279 19424
19357 19424 31160 14487 -9997 -19798 -14233 -64511 -91755 7118 40351 -11379 -20894 -14168
19345 -14168 -31050 -45509 -38580 -88525 -83506 -13003 31188 -3927 -24213 -43032 -3317 50456
19333 50456 82509 74493 77593 69091 42714 8523 -24623 13723 16547 16247 -9536 -49835 -18719
19320 -18719 38938 54973 29416 2441 -21497 5485 80955 90257 43111 49189 60956 116495
19308 116495 38707 -18842 -54686 -60393 -34253 -30381 -20827 -26077 -65222 -75200 -17419 2300
19296 2300 -49318 -89101 -118275 -125972 -93172 -86016 -83952 -66890 -24394 -55271 -57196 -38298 -7343
19283 -7343 -30899 -95139 -75749 -2586 70055 73459 50453 55312 -4955 -3132 57500 96019
19271 96019 88344 50390 47978 59593 57248 9492 35769 113972 98341 66999 15311 39504
19259 39504 48822 55407 72404 6490 -30556 -19178 -17534 -52862 -42495 -17503 -47281 -47780 -18723
19246 -18723 -4192 -39825 -11422 14333 -25612 -46675 -8202 19467 -27703 -75203 -46065 5473
19234 5473 -40457 -27819 29608 52987 -3892 -4776 -1667 -24003 -108398 -121012 -113656 -105936 -27932
19221 -27932 27720 582 32125 89019 92290 53664 22085 16442 63406 82288 81832 90354 84556
19208 84556 95198 145267 126931 36393 3865 -14942 52272 101865 83036 44835 71193 118067
19196 118067 141219 163077 111784 106492 125099 135997 153299 178562 206266 246979 226660 118543
19184 118543 144248 247006 284654 265816 255777 181624 257774 298609 236257 220656 276484
19173 276484 283384 221979 196800 181190 147286 118327 101122 101003 130488 161380 129273 105469
19161 105469 132993 176497 179749 162131 123468 151571 164572 193860 184013 156131 138813 125571
19149 125571 152315 157700 158602 155412 120140 42398 2367 43411 114689 198351 239912 239332 273535
19136 273535 314147 281492 226047 257747 253851 230282 205183 240448 367012 414281 467626
19125 467626 582440 617276 545065 464972 457995 452776 431712 443302 501360 525178 660697
19114 660697 760927 731952 599355 533072 458168 335764 303763 301259 405409 463415 543803
19103 543803 607676 619264 633910 681219 759363 867367 1091527 1441569 1673730 1653933 1655140
19092 1655140 1783291 1925055 2035072 1993059 1995336 2086370 2178788 2259563 2164465 2029293 1951408
19081 1951408 1966263 1898993 1724430 1439851 1183101 925352 704394 538977 498789 461480
19071 461480 400700 316969 291069 264962 197084 197781 284979 317987 352063 441475 541345 499806
19059 499806 390251 333567 296370 287641 323570 409934 500905 535053 651017 670258 579124
19048 579124 500368 470213 443000 381718 401467 374806 347948 353672 353337 423096 420786 375760
19036 375760 324016 285078 302491 314421 321987 284183 267274 265676 358157 403806 408654 381711
19024 381711 419557 422923 356991 395750 340836 277511 330233 425811 506022 513394 464473 473509
19012 473509 492307 510079 522204 554328 566931 602498 602844 545230 543090 558357 556132 533708
19000 533708 603746 628665 653233 664921 709120 749418 789042 803490 790340 756494 760523 772940
18988 772940 787749 862450 1027558 1170604 1193228 1215053 1258172 1313720 1473549 1675848 1923260
18977 1923260 2263872 2523287 2577401 2561091 2427916 2313516 2343447 2465313 2656340 2992132
18967 2992132 3592958 4195873 4661985 4886046 4792034 4454960 4180058 4013977 4027568 4244507
18957 4244507 4647352 5499498 6710429 7954331 8622602 8625603 8537083 8394750 8385330 8795219
18947 8795219 9664314 11031259 13055508 15766976 18908133 22389265 26579741 32180729
18939 32180729 41298265 57314334 86175802 135682400 208089740 275019863 278846539
18932 278846539 240475553 203418627 162520275 130233666 123359152 145456203 200999180
18925 200999180 294042289 401318264 468073843 486857127 441517638 350525458 265990489
18918 265990489 193965416 142990921 122770791 131564632 168722901 230785783 284791150
18911 284791150 274200637 225546967 178960082 127497192 82232969 54532068 39825207
18904 39825207 31677885 26512805 22794747 19554241 16585769 14041671 11944403 10336820
18896 10336820 9134931 8400927 8161177 8245348 8401644 8217499 7843230 7399120 6669927
18887 6669927 5847151 5063815 4412485 3877834 3622978 3567154 3712748 4045201 4475759 4602963
18877 4602963 4478941 4128070 3604360 3105623 2715808 2424303 2290801 2319332 2444818 2676160
18867 2676160 2792050 2617048 2307842 2011020 1699111 1510693 1403932 1287580 1265081 1240978
18857 1240978 1147557 1086629 1014622 1022735 1002003 953593 889499 856884 792952 731486 742853
18846 742853 787141 750000 686677 762150 767598 691354 674715 653806 647141 604574 457348 422838
18834 422838 533915 590309 506226 444211 436913 466650 426829 378644 362490 375418 409797
18823 409797 473937 498913 433035 412917 438580 507052 471920 458046 482640 451752 418219
18812 418219 365454 324721 321915 387822 417343 313728 280655 279732 319219 349600 301313 278251
18800 278251 311977 434052 490487 417612 377840 285282 247935 292121 292290 297917 234070 285430
18788 285430 317187 351431 288907 141820 169016 183471 139090 150988 188935 161423 173585
18777 173585 175001 153343 107015 87552 67606 106423 158247 185153 229467 258009 320704 251276
18765 251276 245222 225714 207811 246037 202606 108274 91848 136829 142068 121297 158064 189281
18753 189281 174056 178337 201017 215479 249478 238166 157870 126301 59132 -48731 -98496
18742 -98496 -143522 -122838 -91342 -41457 -63018 -100537 -118704 -180187 -298968 -386861 -429700
18731 -429700 -429917 -419238 -407807 -320985 -179092 -86559 -115444 -144135 -206933 -214315 -175598 -194584
18719 -194584 -206447 -211918 -186978 -136815 -101021 -31322 -7918 68225 138236 123673 109101 69304
18707 69304 27848 -56214 -119050 -100270 -57578 -16925 -26253 17820 74558 31346 19291 41679
18695 41679 67562 42113 51457 101143 123307 177981 152255 116733 74052 25636 18876 48371
18683 48371 38057 38513 54169 89773 105783 79155 121361 155999 102038 87669 65216 118204
18671 118204 126802 101362 87023 49214 17874 -6960 -15675 8989 45521 75419 77122 16830
18659 16830 52635 75625 69110 67332 105766 152637 143199 114371 105327 17723 -49472 -50174 24021
18646 24021 27296 23117 77806 143614 101233 39490 -2040 -12395 19090 2109 -43143 -15682
18634 -15682 28964 32030 -7725 -104 24874 52027 92045 74752 54702 29734 18616 63319
18622 63319 85480 78327 67737 80257 108555 87014 110509 155120 202424 224433 184932 167408
18610 167408 112621 87359 150259 197947 185416 176747 218783 177268 104645 6267 17901 30476
18598 30476 29987 66655 68725 47632 12353 -16 -16116 -10367 14763 36898 32081 33757 41506
18585 41506 48219 36493 62474 58334 4007 14756 27828 59033 79047 39477 89857 107522
18573 107522 96525 41873 65197 112564 80013 114007 164770 122510 106648 118978 80797
18562 80797 -1810 -18260 -22831 -39352 -65023 -55482 -25701 -6644 21145 4524 14892 20988
18550 20988 5354 14583 38934 21962 -8595 26918 27626 27120 128 -67794 -85485 -83756 -64878
18537 -64878 -37069 -7639 -33281 -67878 -21215 16130 -10019 -26753 -2 2848 20057 18412
18525 18412 41448 43425 44163 -11182 -47126 -66037 -96490 -66677 -27051 13277 1397 -7224
18513 -7224 -32138 -97135 -123813 -101669 -53203 -46120 -66882 -43647 -27931 -29819 -16175 -66898
18501 -66898 -55861 -8807 -62719 31789 116181 81930 25994 3725 6480 32509 23381 21740
18489 21740 33970 80554 21620 -12087 -31883 -55012 -5775 16808 2941 30122 3764 -46432
18477 -46432 -26023 -22742 -18114 -24111 -16534 -31230 -38773 -57660 -53450 35201 -5678 -44865 -85543
18464 -85543 -70546 -40620 -61115 -116475 -185708 -169524 -105755 -95536 -34998 -44183 -4103 63447
18452 63447 103456 94150 15971 -82601 -89482 -106047 -58442 -50527 -53792 -72572 -54297 -20703
18440 -20703 74539 120025 30540 -8932 -12077 4410 15570 58327 88666 13314 -5435 -41625
18428 -41625 -25545 12775 1641 30575 39652 -6500 47606 58481 36797 35821 44742 21428
18416 21428 88243 125254 44623 -23503 -16067 -41687 -14063 -17814 24437 12683 13997 -32898
18404 -32898 -40518 4085 -2261 13563 77208 98133 54045 35717 41776 61870 8683 -4440
18392 -4440 -34646 -60245 -38390 9653 1896 54977 97187 136275 88060 29532 -17695 -63360
18380 -63360 -71625 -42842 -60625 -88286 -46644 30973 30576 -8653 -38427 -96328 -152443 -130281
18368 -130281 -143996 -101499 -56229 2207 -7438 -51861 -23878 13706 -21102 -15305 -29048 -11790
18356 -11790 -60065 -39311 37164 32064 6766 48007 9994 3724 37156 45695 14371 64518
18344 64518 84682 44711 -21771 -7782 -49020 -69884 7553 50124 -35768 -81833 -36021 -15057
18332 -15057 4416 -12807 32287 113416 176517 180290 150434 68145 92761 144379 162706 201742
18320 201742 199708 227610 183005 138053 159945 210748 141573 104000 80331 99872 91544 33327
18308 33327 -43906 -30469 17617 3497 19326 64193 116308 87658 29542 -29968 -53628 -21089
18296 -21089 -27973 -35321 -8835 12993 18148 43301 40862 41882 99975 97240 76974 126986 150325
18283 150325 165209 111862 94600 163238 305495 489497 682758 915016 1200963 1335718
18273 1335718 1347136 1234029 1061836 922385 899623 899474 1081895 1374509 1744495 2040518
18263 2040518 2236612 2245848 2111024 1830561 1474380 1200091 1051651 914091 869442 991888
18253 991888 1131309 1296530 1257097 1113287 912716 780896 607089 465227 459747 411316
18243 411316 332803 253208 175191 73446 19558 -30121 569 63575 7971 -14375 -16985
18232 -16985 43263 62456 93433 115676 78327 62949 -12734 -69338 -39214 -1137 -8364 -2577
18220 -2577 -14253 -60612 -63612 -41090 19932 1888 13461 -630 -28229 -64460 -32022 37292
18208 37292 24233 5873 53456 69540 33738 3474 50911 -3674 -23872 -43962 -48683 39973
18196 39973 101795 70540 66966 92260 58436 53477 25936 -46849 -40342 -45837 -43887 -45703 -61981
18183 -61981 -130670 -116617 -66272 -24619 -27628 -98131 -159406 -155222 -91568 -43801 3804 32743
18171 32743 61565 23034 -21126 -18048 16621 -22945 53402 55021 40748 56330 48647 39995
18159 39995 61249 101094 70718 21941 -24898 -26193 -35354 -51603 -95049 -144335 -72708 11651
18147 11651 25549 18430 13568 -50969 -55791 -5301 -12457 3158 21853 62631 68847 -12482 -73301
18134 -73301 -46990 9767 24251 -21799 -28185 -2112 32753 -25154 -1502 71504 -3192 -55817
18122 -55817 -48122 -5513 -52008 -52317 -16442 -1333 -3117 -22289 -68658 -71235 -6632 -39383 -41250
18109 -41250 10800 31985 84779 86926 33093 -369 18376 -26377 -17029 31088 81021 73348
18097 73348 34587 -2349 77918 81423 105340 69653 18783 30422 40827 48272 1110 -43422
18085 -43422 -27156 -36784 -38480 -106345 -119928 -63345 -50269 -31751 -57875 -16826 -15807 -26783
18073 -26783 -63805 -64783 -42636 5651 16883 5215 -24630 -18082 -76242 -96903 -75181 -8583
18061 -8583 43201 3548 -35897 -10763 -37101 -15183 12512 11729 -18352 23196 38436 18652
18049 18652 -4155 31808 91168 112639 114517 85653 63516 124239 150996 155959 177074 84081
18037 84081 -39966 -90053 -60271 -37523 -48509 -74410 -74735 -35143 -20543 -26757 -33091 31306
18025 31306 28072 -10305 -26258 14891 5280 -5537 -38345 -28853 -23021 -96146 -120888 -97478
18013 -97478 -73110 -13799 -14332 -28863 -42411 -66942 -43573 19028 25867 52557 32095 20161
18001 20161 -60471 -38858 7574 -24640 38 -17444 2447 50691 63412 38093 37799 9063
17989 9063 -21964 -639 25011 60019 84500 64182 19466 54689 69556 109861 93977 20672
17977 20672 -27399 363 16168 -4912 -7262 15012 -45048 -56020 -17211 18166 -11313 -37960
17965 -37960 -28253 -15591 -12638 -26788 -27552 -58249 -31404 -1807 -8143 -44216 7776 63087 41372
17952 41372 60943 58971 59836 47677 59800 45209 3983 -3068 -12364 -36329 -76347 -79138 -5001
17939 -5001 45429 -16171 -59931 -75808 -11439 -8176 -37936 -83949 -46010 22172 8448 -12132
17927 -12132 -67168 -89470 -150215 -114586 -120098 -120494 -104396 -28368 -5631 -23362 -41704 -46020
17915 -46020 15763 44120 29879 39504 17094 25002 17692 -4795 -23696 -18527 -1863 3747 27394
17902 27394 51915 -19978 -69044 -11976 6200 -29674 -45932 -42826 -1083 -36223 -55443 -27156
17890 -27156 -1842 38015 39988 -44790 -62929 -63954 -5667 49810 46928 13797 22230 23161 12292
17877 12292 -57367 -103847 -68065 -26201 18475 -4533 8635 25102 74251 43628 80362 128348
17865 128348 93344 52445 63278 81199 96313 98781 151484 137934 89135 78005 46927 122832
17853 122832 172011 146292 201875 324372 447443 583784 835682 1195979 1552472 1755558
17843 1755558 1781388 1732173 1826624 1930279 1972560 1842533 1664440 1464976 1380248 1512044
17833 1512044 1735678 1828835 1751396 1678578 1665678 1730879 1674190 1453114 1205178 923681
17823 923681 659969 454569 298838 210880 177927 119872 105109 124364 123348 129226 133561
17812 133561 144582 111041 74161 29046 5094 -20548 -50244 -68632 -48471 10695 25929
17801 25929 14877 20933 23169 26210 64745 99731 70967 93954 52086 525 -999 19437
17789 19437 -1083 21615 43698 49307 15651 39151 53515 59958 19518 35639 44943 21765
17777 21765 6888 6017 48919 100360 115892 51168 35266 73291 123132 207508 177835 75023
17765 75023 -11069 -10715 49532 47595 24810 43211 85485 33751 13988 7611 -3817 1550 30153
17752 30153 21667 74526 79565 6871 -29 1021 -14210 1154 -2484 471 51633 32756 9282
17739 9282 22162 53430 56672 73377 110030 113618 60810 8577 36881 39508 -1080 14409
17727 14409 30685 15968 20437 23810 11296 37815 100085 77676 22598 -11756 -13375 44194
17715 44194 69807 31852 20815 49430 44579 19086 29641 30188 23118 34886 34084 41641 35619
17702 35619 483 83065 134680 24092 -9101 10254 -6000 -66268 -66872 -4391 13652 -24683
17690 -24683 -42692 -594 27298 58943 19269 -39907 -14704 -10595 -7836 3946 -59317 -29464
17678 -29464 36977 78910 72781 52458 18824 97488 59536 14808 2993 -30715 8715 31823
17666 31823 28876 9758 13581 50290 87232 103914 84287 87361 70663 76546 51765 1132
17654 1132 -42218 -46854 -36910 33810 57780 64546 -8997 -27397 -52673 -48463 -23050 25640 36949
17641 36949 -26855 -57595 -26151 54227 96913 170715 190646 166036 86535 40533 -14170 -40690
17629 -40690 -47510 2409 15267 -50304 331 27086 -4935 -550 -6090 -36106 -39885 -37472 6117
17616 6117 -16340 -22176 924 -10961 13755 5674 53360 105180 112981 80766 66481 82013
17604 82013 61332 72919 87038 99517 43061 -15327 -84197 -67983 -93365 -87483 -74407 -67010
17592 -67010 -107248 -202226 -227230 -214978 -182917 -125595 -52472 -41984 -102668 -128061 -139800 -142775
17580 -142775 -160883 -118491 -61161 -51410 2930 40898 -4723 -46150 -16886 -2562 -21139 -45555
17568 -45555 -46707 14418 69425 84251 67157 22372 -18373 59886 91137 151195 149764 155292
17556 155292 137738 75336 50157 4950 -133 -5117 14829 40760 50263 17533 38493 35951
17544 35951 -12371 13646 85296 122814 153034 159463 153296 121543 143372 213613 251265 200460
17532 200460 183872 246301 301287 284418 181448 132790 160243 162020 180396 242455 300899
17521 300899 276202 199343 187316 222731 259250 255585 200142 162956 120275 160162 157876 85100
17509 85100 59582 69956 32045 18001 2448 -38293 -38861 -29272 -92915 -72306 -33912 19192
17497 19192 125705 202493 202603 139118 75324 32674 33455 73151 77887 41162 41589 124978 130448
17484 130448 122765 168027 203961 167510 194047 210862 167697 219070 300924 371062 431907 522187
17472 522187 529500 446793 382600 451390 505583 482112 349299 250584 289968 317053 425885
17461 425885 503671 481750 350105 284731 276606 322328 403701 348136 232125 175002 130697
17450 130697 145508 60058 22343 28295 24860 15480 33477 -1208 -33705 -10962 7226 27736
17438 27736 40999 115313 61407 -24885 28951 128115 137835 108915 101277 174434 78156 78829
17426 78829 141067 156903 177689 131856 52729 71279 78112 110121 156514 210877 200189 186778
17414 186778 225384 242552 213951 265497 295835 361850 426582 421808 366230 362497 430951 435197
17402 435197 339626 335690 253000 278784 378548 474283 477068 418432 367259 378502 436697 452866
17390 452866 397481 359039 347976 288884 254312 241593 209138 264247 303989 299710 300344 307832
17378 307832 297989 332466 326556 327375 333100 323788 338672 338786 378775 376324 344720 347399 327318
17365 327318 318834 336648 344339 353855 387757 403373 407676 416084 464265 497580 445752 434710
17353 434710 509185 492110 479065 493983 491623 481725 511842 549296 594934 596919 637707 674284
17341 674284 725291 756413 785913 764286 772670 845117 882305 896128 978660 1050712 1153869
17330 1153869 1244799 1375668 1472947 1497422 1535193 1611349 1689494 1761693 1901088 2002674 2010091
17319 2010091 2064502 2226795 2468041 2758361 3073438 3438935 3668590 3886852 4060544 4274882
17309 4274882 4467434 4647125 4745284 4807300 5045850 5374186 5946452 6702127 7361512 8044034
17299 8044034 8794529 9491721 10289770 11185614 12237025 13382629 14634059 16456570 19128155
17290 19128155 22741021 27509503 34342641 44902446 62044292 91084486 139545104
17283 139545104 212976825 293998671 327005544 311488906 307047502 320590344 348646570
17276 348646570 351653354 307575342 266207203 236821403 230904256 268045443 326192082
17269 326192082 343139027 318363956 307398904 314775624 336150217 328944727 272276237
17262 272276237 213498240 155042078 102015581 68158038 49060639 37553156 30134323
17255 30134323 25025342 21161651 18314748 16237320 14372338 12718327 11490666 10614907
17247 10614907 10036748 9596147 9101550 8573966 7867234 7102287 6666173 6344294 6061779
17238 6061779 5701189 5182104 4799725 4481033 4303683 4270373 4235269 4148933 4008890 3905318
17228 3905318 3832106 3695445 3446425 3086077 2690102 2359740 2091091 1890661 1798036 1710828
17218 1710828 1652345 1581172 1466493 1391179 1306610 1319203 1316270 1297202 1248593 1149075 1059480
17207 1059480 1030398 970298 903782 899208 897045 922499 910035 846432 789277 734379 686964 692179
17195 692179 753382 804854 767040 707343 677571 606554 626452 586132 598007 642329 604749
17184 604749 547031 500358 504416 532672 500008 448971 408617 412979 451503 472971 445283 453667
17172 453667 458548 440942 459757 406580 364096 374089 463831 478816 441908 448069 435191 355367
17160 355367 342636 358816 373182 438980 477640 373573 387557 457217 480695 481021 387497 299008
17148 299008 259720 232979 234207 350504 477774 365356 270659 279067 339135 402115 250164
17137 250164 120666 149188 128980 177101 252200 210708 153358 136081 132550 174604 108424
17126 108424 88919 132091 143813 148484 171046 182122 100349 106703 136929 148578 136243 145463
17114 145463 104756 93971 116873 132710 204442 266498 265197 220186 188331 195424 146526 185768
17102 185768 238421 200426 152121 130674 153156 156570 114487 132984 92826 -4190 -152147
17091 -152147 -171351 -108703 -104322 -162289 -217597 -260020 -237388 -238807 -170075 -162262 -172899 -225783
17079 -225783 -243980 -222917 -231846 -307618 -398541 -409737 -358607 -293381 -258627 -250482 -165116 -90943
17067 -90943 -55041 -17465 -74451 -80958 -37983 -23698 -5451 718 -60457 -87593 -29838 -5606
17055 -5606 5692 -13282 3496 10015 2387 12657 58563 82173 55207 47013 -10998 -1061 33420
17042 33420 35258 84680 38588 71565 88102 50129 99394 122470 100166 52956 59987 49316
17030 49316 -1556 33651 124245 141880 135475 136078 145930 155176 77407 23733 39201 92377 96813
17017 96813 50242 -16676 39500 99963 85446 87642 91567 93534 126381 116276 78100 -25499
17005 -25499 22052 95185 76296 100842 61816 23839 7902 20955 104047 119643 135226 187662
16993 187662 179578 144413 86948 53424 7898 7793 -7609 -14746 -28559 -46524 6077 59858
16981 59858 66710 108664 160715 198189 143086 123351 117774 107565 67526 97244 126942 175804
16969 175804 129338 84190 111283 178410 190579 152355 125785 141938 183638 189801 199555 215106
16957 215106 199202 117144 115831 123210 97952 72937 109856 127203 72150 27495 39223 61360
16945 61360 68887 62927 14801 -11130 7963 50418 20553 -13672 2243 9662 45995 65063
16933 65063 62008 44272 33314 10669 -14225 -73838 -109390 -80291 -27953 32982 56369 83933
16921 83933 97224 74276 70056 70451 36610 11632 -11482 -36746 -62996 -53759 -35950 -37909 -48945
16908 -48945 -83976 -50469 -23628 -29684 -33015 -12805 -24936 -58390 -98526 -107216 -83573 -39360
16896 -39360 -23972 16167 15886 12216 32495 21833 54310 86218 65096 -2034 -47089 -40819
16884 -40819 -18505 -29194 -4746 15654 13923 48816 37545 27203 -11267 22184 38126 28751
16872 28751 -2978 -22431 -26761 -19463 7656 -8135 416 -16115 -8691 29295 69724 71655 79640
16859 79640 28124 44023 -5137 -35726 13719 27991 -55601 -33409 -19466 12467 34529 -12126
16847 -12126 -28191 3080 -11371 -38074 -12728 -44006 -64503 -48923 26939 70725 63772 61475
16835 61475 2366 17634 66314 90164 80583 55055 37994 44407 4146 -27833 -47859 -16251
16823 -16251 -25437 -47015 -97119 -97858 -100586 -121701 -100862 -103150 -67240 -39301 -32942 -62344 -75253
16810 -75253 -73367 -10167 55997 23015 -13671 -31178 23046 1270 -906 -4654 86352 98830
16798 98830 74518 87667 48142 -34097 -52613 -45967 -48979 -15832 52429 4758 -45596 -94653
16786 -94653 -52032 75440 112498 124769 105961 41412 38418 25947 72680 68637 32692 2803
16774 2803 -22289 17529 5189 3744 52835 27398 35034 13538 -54479 -71821 -94739 -42829
16762 -42829 -486 -35035 -30708 -9100 -7083 14610 13358 -34348 -34956 25730 54714 10970 -32521
16749 -32521 -21295 -29627 -45186 13298 -17306 -4034 28645 85976 106145 74564 62851 97865
16737 97865 128608 82725 79824 99397 13940 -6299 55375 155809 193685 207065 135911 70762
16725 70762 44132 56396 106781 115816 100480 132732 203280 255906 408444 605003 812725
16714 812725 1092556 1421199 1658104 1726382 1692752 1718506 1831029 1903045 1780974 1574210
16704 1574210 1388550 1238523 1313380 1539903 1793728 1847486 1787766 1737667 1751892 1781121
16694 1781121 1625127 1282773 967270 686843 495983 406330 363507 208731 82334 71980
16684 71980 78106 -1778 -40663 -80614 -91382 -75229 55722 119027 94189 111374 125089 56301
16672 56301 47104 32895 -34643 -30399 53446 95935 113558 97749 128253 94840 59871 35394
16660 35394 -16424 -47111 -20540 -15493 -37184 -56850 -73964 1893 11969 13252 10694 82223
16648 82223 119886 33240 35538 50281 43639 27930 36668 27107 28384 93814 15275 -27699 -15451
16635 -15451 9972 -24260 -48409 -24917 -8374 -13569 12001 -40582 -97432 -70710 -41667 -37367
16623 -37367 -60438 -97602 -64388 -17850 32385 20449 51922 71669 34819 12279 24277 32458
16611 32458 52054 3493 -38327 -70874 -13765 9568 -8565 -32136 -9806 3984 -2786 18935
16599 18935 32050 66712 60094 28727 -36122 -51776 -43126 -11157 15286 34154 -2271 -33789
16587 -33789 -37110 -49855 -14387 -270 -34472 24852 58789 48907 39429 26048 -16630 -91344
16575 -91344 -104058 -59913 -67597 -68601 -122323 -74976 11225 79419 86688 -3250 -27446 508
16563 508 4361 -15828 -42189 -9415 -60820 -76599 -62401 -35435 -80120 -88888 4511 21094
16551 21094 29597 44987 100256 69068 42285 28788 -1027 -70034 -55470 -15318 -15296 -100362
16539 -100362 -150303 -131916 -35323 -3556 -59106 -62956 -59397 -37259 18328 75012 35507 34340
16527 34340 48989 32634 27320 31254 35066 44214 33001 -3160 -30293 -12974 -30890 -73823
16515 -73823 -66932 26981 68358 6110 -60553 -69328 -45548 -108856 -143562 -115987 -47907 12662
16503 12662 46672 79902 109815 61495 1500 -62814 -79439 -61285 -35274 -47069 -64218 -98856
16491 -98856 -50433 -61107 -56309 -19335 16530 15674 6313 68920 122248 140427 82469 70737
16479 70737 74317 6858 -42242 -49891 -85947 -64979 -6800 3617 -41289 -47402 -52512 -136104
16467 -136104 -105681 -55516 -63732 -66568 -104130 -87580 -44648 6371 -12355 -39718 -7096 9900
16455 9900 50134 8050 -14742 11761 40664 49117 73315 42085 -21459 -27299 7278 4529
16443 4529 13903 45348 106348 49462 -12465 49041 50891 96106 148617 127885 72972 -8996
16431 -8996 -12901 -23542 -24734 -27283 -52582 11322 29274 -59978 -118496 -94928 -53079 -31378
16419 -31378 19515 29964 -4131 -24357 -71559 -90979 -92425 -65062 -45173 -21535 -8571 -35229
16407 -35229 -83712 -95385 -101150 -71810 -33395 -54015 -34650 -12757 -20037 -30307 -9861 -13801
16395 -13801 21614 34099 62825 61539 57700 68196 25982 3717 4726 25450 67487 67639 65203
16382 65203 35825 57014 43477 16991 -22872 -16749 -9759 -29571 -56510 -99360 -85726 23980
16370 23980 83462 65315 53863 25509 14872 4437 -61458 -53625 -60848 -31304 -42898 -86993
16358 -86993 -134309 -118780 -88270 -103964 -108020 -104919 -135583 -163248 -190750 -195286 -137251 -109092
16346 -109092 -82833 -37635 33056 45473 19421 -31117 -104547 -89516 -61964 -24922 1593
16335 1593 -26912 -93577 -139261 -91959 -1526 66625 42213 -40018 -47088 -29858 -33210 -24683
16323 -24683 -15355 -70452 -66063 -42450 -51714 -45449 -13846 31151 -43445 -124449 -147882 -102080
16311 -102080 -109181 -137765 -94546 -48651 -84850 -75857 -69972 -6451 33818 27248 -16126 -27506
16299 -27506 -37912 -17193 28769 41882 58237 -8601 -61305 -17377 -19871 -45431 7877 -16366
16287 -16366 -55424 -53828 -71164 -88945 -90279 -37099 4236 -56457 -125794 -29549 25383 12962
16275 12962 -43315 -81577 -76839 -68126 -67459 -73696 -32417 14340 10307 -34728 -23170 16334 56912
16262 56912 -19590 -78181 -93864 -61563 16742 15450 -60552 -120566 -88273 -713 8949 -2376
16250 -2376 51024 71730 30054 14991 10925 18243 -15347 -44608 2445 -82 2337 53306 21076
16237 21076 -27149 -19156 848 11255 -9233 15993 47285 34934 60809 33240 12171 65489
16225 65489 108759 138651 101268 52230 -3064 -14785 10194 24889 27603 32963 -12553 -9857
16213 -9857 38755 42587 -5450 16149 13519 -10424 -75209 -42398 16560 65983 29551 -23623
16201 -23623 -75987 -101182 -100223 -61550 -110587 -222326 -199727 -95192 -55214 -64010 -41568 -39419
16189 -39419 -4428 -32938 -28689 56262 64659 12585 9332 -50969 -76871 -93226 -123020 -66855
16177 -66855 -30035 -25867 -69070 -64328 -63874 -65715 -79894 -63186 -68683 -63660 771 -229 -36584
16164 -36584 -82947 -84357 -32594 23803 32157 29806 5793 -38463 -56957 -42740 -37898 -58854
16152 -58854 -71972 2387 38345 -40522 -75479 -53484 -88814 -127847 -139214 -147018 -129377 -83061
16140 -83061 -60619 -37080 -39755 20843 -36868 -84291 -44956 3071 39018 6643 31221 55207
16128 55207 25751 -24860 -23585 28039 67126 44867 19810 9068 28484 18738 -51410 -111077
16116 -111077 -107253 -59895 20835 31120 12074 -12645 5394 -6388 -58381 -56686 -50856 -58302
16104 -58302 21179 86914 55465 119657 109107 31422 -65692 -8292 -43404 -96091 -94620 -66846
16092 -66846 -6742 26287 53277 -25800 -111674 -78444 -21014 -44258 -21687 -22385 -27783 -24509
16080 -24509 726 46555 -15291 -39289 -63582 -46833 -22342 -23726 -68436 -97584 -124393 -160945
16068 -160945 -108740 -63714 -24318 -19222 20674 25871 9101 -22678 -64991 -70366 -39489 -5752
16056 -5752 11890 -29732 -110846 -69551 13546 32225 33842 19521 27630 40485 22690 28097
16044 28097 18484 8705 -4961 -20138 -9047 27232 34809 19525 -52850 -47533 -7256 -81487
16032 -81487 -56390 -70726 -96369 -1802 52570 100577 134090 76834 67203 69082 75805 46366
16020 46366 10891 10154 -4153 6426 -12951 -58054 -57785 -36607 -38289 -93370 -113814 -126361 -152281
16007 -152281 -118692 -41736 -12447 -58100 -45790 -40937 -27550 -69554 -188339 -178410 -112800 -73351
15995 -73351 -53555 -73324 -64144 -57624 -42118 -57768 -48592 -48377 -3864 27896 37825 3983 -47814
15982 -47814 -110004 -169329 -131149 -72992 -93987 -25588 6130 -71096 -54012 -52040 -50674 -36272
15970 -36272 -104223 -53455 -2173 27719 38279 2154 -6450 1908 37593 61204 44637 42463
15958 42463 -12811 -65209 -47685 -66952 -74016 -77367 -100969 -85057 -32794 -52896 -62278 -42050
15946 -42050 -13783 10201 3535 -34694 -50222 -68077 -67664 -50337 -84953 -109499 -102210 -103892 -85838
15933 -85838 -55551 -69270 -149165 -153026 -135028 -92084 -83076 -120782 -154561 -177874 -118007 -97237
15921 -97237 -96667 -36318 56061 15788 -70333 -64120 -55662 -74909 -53579 -21004 82182 112853
15909 112853 40174 39590 -26979 -92215 -58251 -86434 -115416 -100883 -91931 -80670 -48756 -93660
15897 -93660 -114409 -47592 -370 -99212 -140799 -84339 -57569 -59257 -21670 -49796 -84760 -95226
15885 -95226 -77177 -43041 -33125 23561 -1662 -49634 -85616 -22625 1094 -26335 -36967 -33066
15873 -33066 -45087 -57080 -71500 -76217 -68713 -86876 -76280 -47782 5163 16768 920 -44073
15861 -44073 -40564 16928 10534 480 -29056 25351 59938 83925 62236 57163 -633 -11046
15849 -11046 32273 52537 -10941 6413 -37269 -39995 -31 -67227 -99710 -67970 -82480 -89575
15837 -89575 -74174 -7961 -28548 -15455 -16891 -7022 -43694 -35067 -36634 -75936 -107467 -96476
15825 -96476 -53064 36255 68387 25612 -37018 -50146 -49004 -101596 -81106 -89177 -101861 -115281
15813 -115281 -81303 -36022 -15106 -2720 -77489 -104025 -95147 -132180 -148077 -136076 -100560 -35320
15801 -35320 -61982 -80112 -68790 -69275 3727 33876 -26440 -13774 -23987 -7221 -4525 -40526
15789 -40526 -46436 -43175 -28462 -14317 12333 37072 31811 43852 47367 33383 -2377 -12141 28598
15776 28598 13125 -70766 -105047 -54603 -5949 19894 29304 6505 -12286 -44168 -51447 10832
15764 10832 24907 -12888 -35363 -48250 -90470 -91080 -114796 -134521 -97796 -47875 -67170 -48749
15752 -48749 -32760 -18131 -38363 -64311 -42088 -5549 5849 -12382 -71061 -72142 -3646 4391
15740 4391 -13438 6090 29667 13231 36659 55712 112066 120192 46273 -21843 -14123 37121
15728 37121 -29548 -27441 -11818 -103094 -120806 -78375 -35754 -12105 5370 -1325 -4623 -29502
15716 -29502 -41993 -3249 20699 -25644 -10273 18498 -1197 -1745 -15763 -75429 -100500 -89366
15704 -89366 -45987 -1504 390 2983 -37160 -41239 -33685 8457 50793 107046 87616 71141
15692 71141 73933 85027 42605 37471 34495 -37336 -86719 -37403 -52309 -39794 -39775 -15118 -5380
15679 -5380 19181 -47548 -70113 -26439 -49142 -36448 -54668 -71459 -47709 -26912 19915 41467
15667 41467 51836 431 -4413 18461 33163 -33079 -70045 -95619 -105302 -101899 7468 95738
15655 95738 72407 -42068 -33012 24306 18156 -22562 60783 126518 63516 -15684 -18928 33544
15643 33544 15434 9390 16095 -32980 -43126 -33643 -20779 -2284 45031 42481 20457 43479
15631 43479 -3801 -16079 6380 3745 3808 -27862 -32859 32134 95166 54468 -15175 -71546 -93736
15618 -93736 -35849 5484 43616 -7457 -22062 -33513 -84038 -55062 12244 51850 54717 -10866
15606 -10866 -16027 -32615 -40873 -29552 32113 22146 59755 44872 2024 36657 63344 24172
15594 24172 -11957 -4981 45608 8228 -18909 -34881 -3266 -15815 8575 60762 38361 -1110
15582 -1110 17158 -2999 -55544 -111520 -43019 10241 30592 30898 30694 47703 64029 20171 60257
15569 60257 54537 -19752 -64747 -64749 -64309 -42336 -19986 9636 48644 8372 -13058 38052 26113
15556 26113 -21471 10562 42350 75936 45462 52564 20825 -17281 -26657 -39403 -55235 -38610
15544 -38610 -62073 -72370 -55097 -42931 29978 50615 10674 44686 15557 -933 47491 48900
15532 48900 5426 7799 13737 -21384 -89522 -58879 44192 94436 52700 -1907 21589 57229
15520 57229 63611 31030 -30405 -74726 -74649 -70505 -58589 -56730 -72531 -72540 15669 41555 6843 11611
15506 11611 23805 37309 5400 -36350 -8154 23560 -2073 -51889 -52959 -40513 -360 8169
15494 8169 14277 51590 21632 38300 90190 44361 -41849 -36091 -6941 -32362 -52263 -277
15482 -277 -47223 -82181 -45286 -2903 4178 30429 3963 -58109 -71386 -68204 -71538 -64849 -48552
15469 -48552 -85405 -152841 -142209 -75500 -60318 -50646 -22097 -46795 -44979 -23414 -72027 -132834
15457 -132834 -156978 -82070 -45671 -86036 -64105 -8183 4486 -20768 45512 61414 -3841
15446 -3841 -57371 -71649 -64809 -103242 -103670 -88551 -105364 -113377 -118468 -100769 -42716 -67056 -66709
15433 -66709 -12527 -2484 -17691 11519 22018 20169 25362 15634 -1829 -13868 16446 -21519
15421 -21519 -63557 -8860 25273 -23889 7434 51105 102166 70803 8915 16273 14098 32605
15409 32605 1812 -35669 -36165 -68798 -86702 -59397 -55648 -118813 -66027 -8245 -10708 -7616 22070
15396 22070 36788 60272 72454 10620 -25073 -48777 -72403 -50583 109 -576 -47659 -42290
15384 -42290 -44651 -44527 -32389 -41556 -7624 29025 19412 -44431 -42292 32532 41958 8495 5354
15371 5354 -10938 -4127 3432 -30671 -26478 -46398 -72946 -98706 -97470 -85364 -63979 -87355 -114888
15358 -114888 -117665 -95914 -52768 -26502 -12594 -62834 -83497 -54040 -98273 -49321 21519 40926
15346 40926 -14716 -18134 34907 63468 81409 34866 -20805 -36492 -41199 -104642 -164651 -148976
15334 -148976 -88627 -11038 4030 39135 41930 37678 56206 61630 -2438 -87695 -93183 -55675
15322 -55675 -20425 -22247 -54939 30402 66388 88106 101426 83632 5797 -4351 -15583 -14893
15310 -14893 -89806 -57808 13524 9119 -13770 3901 83538 58274 23005 -32402 -63441 -48560
15298 -48560 -53732 41254 50798 74039 16057 -38575 -29764 2022 30422 2539 -76560 -98407
15286 -98407 -84857 -118977 -158757 -96970 -467 -11092 -9631 -25019 -19235 19519 -37943 -57370
15274 -57370 -67175 -32581 -35086 -67808 -51319 -56852 -41222 8554 10317 -36907 14923 56565
15262 56565 70745 71879 -43710 -36806 33943 68906 34938 -12238 -35972 -44304 -33520 -39480
15250 -39480 -45876 -14015 29505 47324 42811 38810 46604 70366 49915 67390 77975 47946
15238 47946 64125 67858 50586 1085 -1582 17632 57442 82118 33513 -43843 -27735 49358
15226 49358 73765 101121 55897 16344 12432 5744 12530 -32608 -77341 -97691 -40590 -10213
15214 -10213 -35285 -22307 -68396 -113339 -121344 -95582 -59915 -36882 -47488 1055 -16442 -59784
15202 -59784 -2972 84642 47540 7701 -49373 -18845 19168 45553 12364 18344 -11743 13863
15190 13863 55387 28032 -26432 -31196 -55589 -13631 7207 42276 65606 75789 37815 44797
15178 44797 37548 -22332 -11024 -26101 -5057 25112 -15016 -49959 -24102 -30333 -51871 -80420
15166 -80420 -79988 -120113 -43046 30728 21207 -7821 -35748 -60566 -49446 19606 20898 38115
15154 38115 51496 77911 72898 19428 -60704 -69873 -48429 29438 55812 33698 4450 -87411
15142 -87411 -106096 -81512 -52590 -42008 -73537 -62971 -94934 -136215 -131210 -146644 -121441 -43482
15130 -43482 -18784 -18617 -63571 -65732 -48732 8321 55114 31872 -14892 3631 25421 -5646
15118 -5646 13843 -7562 9418 15258 -18631 -92276 -102088 -67079 -2370 239 9422 30307 81299
15105 81299 76954 67927 30333 11744 1871 12664 -7036 -29353 -2741 14675 40544 10349
15093 10349 -14238 2675 -16759 18125 16215 -47647 -48120 -17244 4204 35428 16850 1823
15081 1823 -13315 -40833 -14839 6949 8848 49477 76373 75412 40760 36709 46121 5988 9308
15068 9308 7666 10490 -12739 -21921 -66563 -129989 -125509 -109384 -62377 -6554 -15194 -25828 -19490
15055 -19490 -20996 9228 22391 22002 5326 -36642 -63710 -78657 -74077 -6490 66762 88995
15043 88995 17908 4855 -39664 -35137 23998 60171 65097 77983 49503 -20316 -23159 1094
15031 1094 -11964 -30012 -41835 -47913 -45540 -27491 -91101 -41093 -95307 -127076 -61301 34472
15019 34472 -9241 -19886 -20989 -42863 -52849 -17416 -55777 -83835 -62993 3179 39630 81588
15007 81588 69698 14739 -30417 -60986 -18007 -1418 -5213 3953 9547 28255 -4309 -71677
14995 -71677 -78773 -63506 -65440 -40227 -50767 -59456 -28627 -940 -19713 12660 58309 18981
14983 18981 1686 12974 -42454 -14505 -41293 -68358 -68320 -31285 2029 -38807 -76005 -73115
14971 -73115 -36893 -10756 -32927 -53478 -5521 -5508 -1943 -1347 24391 74753 86736 78808 75262
14958 75262 -16726 -90930 -42322 -23243 -23575 -33315 -52743 -40535 -13356 -23347 -54849 -40474
14946 -40474 -17327 42585 53898 46934 74696 59039 74711 28957 -10742 -17775 17775 11912
14934 11912 44779 60353 39467 30569 117577 75982 40083 25125 13357 12908 -10983 -41485
14922 -41485 -22477 3757 84142 83147 43883 -20420 -48060 10016 -16979 6400 34904 40846
14910 40846 66494 93178 66150 41393 15971 27950 78574 75703 51146 -12483 -40003 -43373
14898 -43373 -95510 -106578 -63583 -25072 -23633 -14090 16374 19778 -30240 -42809 -71677 -43161
14886 -43161 -32987 -73713 -108703 -77399 -69569 -37120 -48913 15012 11467 40016 5763 -9505
14874 -9505 -2894 19147 9184 -24361 -54301 9367 44613 30430 25140 56909 112588 124970
14862 124970 97950 57654 16957 -9442 -45358 -39048 -29364 -14060 -21382 -35583 -61645 -120045
14850 -120045 -130068 -87477 -71144 -65526 -76614 -104517 -139972 -100154 -99300 -94372 -67432 -59043
14838 -59043 -4103 18654 -8960 -75384 -123897 -150822 -97132 -37226 -78070 -103767 -118420 -68741
14826 -68741 -33077 -24822 -14247 -37752 -80347 -83444 1236 1598 -12287 -25676 -9218 25858
14814 25858 -12313 -44294 8464 45097 40104 -1198 24830 53503 78392 74442 64032 28704
14802 28704 -5990 -16852 17301 52099 84821 62944 15118 36299 17408 23392 8518 7858
14790 7858 809 -34460 -50688 -18961 -21621 -49225 -31029 32121 39482 29899 42126 -6323 -72893
14777 -72893 -74466 -57889 -20216 -164 9187 -57099 -38054 32606 -8296 -48002 -55797 -94629
14765 -94629 -88255 -59059 15201 55128 -41483 -104969 -61700 -57421 -54422 -32968 -14226 18591
14753 18591 64501 56045 -12262 -96567 -116293 -154687 -156805 -94466 -57287 -123077 -104201 -57635
14741 -57635 -25777 -35605 -53631 19943 77376 65979 41915 68349 14840 -10643 -2417 -20921
14729 -20921 -61738 17020 30630 -25966 -40088 1391 42556 33762 -57738 -58893 -41027 -9826
14717 -9826 18096 -8769 -16987 -33270 -76314 -67386 -52937 -62512 -24773 -48968 -60292 2893
14705 2893 -24101 -70730 -27345 -6935 -102636 -140840 -112685 -23855 14062 -52191 -109363 -66926
14693 -66926 3091 18592 13420 6 -27378 33113 16102 77615 110864 105996 74330 95838
14681 95838 139695 107800 80375 32125 27450 50366 35318 4903 -5953 -3464 -57132 -32654
14669 -32654 35749 88738 56192 115645 56277 -65604 -103574 -101149 -71168 -45987 -17661 -40842
14657 -40842 -103341 -71539 -3400 19351 -54794 -126308 -139819 -124680 -94547 4631 57706 84
14645 84 -34070 -81430 -128060 -77535 -26952 -3833 12981 -17262 -37783 -31426 8465 34581
14633 34581 23299 45015 -13103 -60805 -102486 -126784 -76164 6772 10301 -27446 38477 68807
14621 68807 39762 -17994 -33347 -6739 39059 23097 7393 40543 25088 -6547 -23278 -38523
14609 -38523 -34568 -73756 -71062 -94025 -138439 -124326 -64580 -4881 -29691 -122152 -174496 -94155
14597 -94155 -50991 -55724 -22894 14825 -27308 -33964 -41139 -54299 -51355 3878 -25718 -36555
14585 -36555 -9746 -33723 -29523 -18693 -52174 -116431 -114199 -71484 -49699 -36126 -29180 -78559
14573 -78559 -96800 -93097 -51401 -10244 17359 104299 85993 53943 13433 -57602 -73839 -50628
14561 -50628 -22819 -41974 -4972 -8820 -45720 -31205 -32577 -38556 -42856 -23238 -38525 1230
14549 1230 24050 -54768 -107138 -131121 -64004 -9148 31950 16041 23106 50334 102063 109018
14537 109018 61905 52660 58400 57523 74679 -7505 -48181 -35947 10239 50229 4123 33614
14525 33614 55029 66383 566 17578 11297 -83985 -88687 -24482 -57984 -66699 -20544 -50058
14513 -50058 -74660 -32044 -12836 -72503 -93103 -79535 -30516 -48101 -77722 -69515 -64071 -47877
14501 -47877 -19514 -17449 51618 94850 53607 5669 8157 47883 39298 8813 831 -19698
14489 -19698 -33278 -31241 -78560 -65139 -30984 -20627 -19928 42356 48000 32514 21901 -36929
14477 -36929 -19232 -7588 43321 70775 -50089 -102987 -111589 -148331 -126919 -120732 -79454 -73481
14465 -73481 -69817 -96658 -97608 -58791 -102784 -93158 -77878 -32177 -9314 -45769 -8479 -26711
14453 -26711 -58190 -94312 -103355 -83361 -77798 -57461 -47988 -118922 -195775 -180766 -116445 -110147
14441 -110147 -97003 -82506 -83753 -46793 -9045 -52644 -86347 -91157 -41314 42824 93344 58429
14429 58429 6323 -23005 -32064 -23159 -24786 -31237 -27297 -35067 -54753 -77177 -59870 -23762 19540
14416 19540 -19312 -61140 -37121 -41953 -9297 -942 -19799 -18725 -18331 15509 101067 79370 30457
14403 30457 29279 24580 25218 30081 -13101 -45856 -40281 -51116 -34183 11627 11415 -17805 35016
14390 35016 28412 3602 -8548 -32963 -85090 -42853 28968 19076 -37451 -50089 -99623 -135634
14378 -135634 -99540 -14270 -36035 -58635 -62904 -52630 -65178 -68321 -89948 -59053 -79485 -51976
14366 -51976 60959 86007 41070 38388 12301 -60212 -125896 -131672 -92451 -59291 -6215 -37796
14354 -37796 -50376 -37748 -34538 -46725 -69078 2482 35853 6999 -3529 -59694 -58911 -3487
14342 -3487 43962 23826 29505 18804 14292 -38271 -102567 -58620 -14825 13297 41077 35433
14330 35433 71104 60457 12023 -66482 -98656 -10390 20496 6162 68257 50627 34288 81075
14318 81075 61641 46320 34834 27086 52670 61553 30965 33953 81392 61868 24657 -25514
14306 -25514 -30589 -39836 -53300 -38816 1017 14489 -14351 3099 48208 35881 48064 61214
14294 61214 48708 -30890 -80365 -67256 -42913 -24607 -53459 -22052 53093 82364 88037 41324
14282 41324 29400 7086 48709 35896 -34102 -75604 -84204 -109237 -63538 -97007 -82389 -76865
14270 -76865 -117772 -126403 -90829 -73661 -67292 -98913 -122277 -77539 -44189 13659 78800 15734
14258 15734 -6811 -6295 -45909 -33025 25249 66720 172978 130013 33936 8170 9653 -40196
14246 -40196 -58495 -27630 78557 74268 77782 37146 -10867 7374 15172 -2167 -45308 -13753
14234 -13753 7127 -49377 -53734 -110618 -98903 -62267 -47072 -87764 -138748 -107030 -116752 -110395
14222 -110395 -121842 -87002 -14945 -13114 -42836 -32664 72859 127251 118128 116817 112589 52766
14210 52766 45533 16150 -8636 -10394 -8314 -16846 45188 37564 5648 15723 5232 -14653 -35914
14197 -35914 -28374 -28437 5235 28319 3395 -12765 -11452 -34907 3873 -39818 -45127 -82576 -32393
14184 -32393 -12288 -29712 -8237 -4641 -17781 -42602 -17164 6204 -27410 -95069 -108794 -103554
14172 -103554 -80355 -41898 -30092 -59210 -22734 -65641 -98729 -50539 -22663 -14167 -20450 2035
14160 2035 33436 57300 3343 -50041 -32714 -39582 -35655 21464 29115 23275 11936 -31892 -41173
14147 -41173 -33669 -36478 -101391 -137999 -95652 -68670 -41807 -41608 -53147 -17438 -15838 -47487 -121718
14134 -121718 -127757 -67374 -21405 -24464 -82869 -117673 -134845 -79700 15352 46428 48365 74072
14122 74072 128929 124574 45280 16211 18670 -35293 -32173 -13997 27781 44126 32371 -6777
14110 -6777 -35969 -17031 45825 17995 -27452 -32184 3028 49685 66623 51671 27968 -33588
14098 -33588 -30682 4854 28383 34933 -8260 3681 -5741 15434 14153 69418 144067 133975
14086 133975 5038 -48597 -41988 -73825 -111412 -90194 -2209 16329 28696 32604 28293 69630
14074 69630 56717 36403 9192 -48448 -51895 -85546 -119824 -119247 -162806 -173941 -182043 -166022
14062 -166022 -142021 -130647 -56786 -45537 -80213 -64710 -20379 62964 88568 114327 109476 77582
14050 77582 42912 -2419 12055 -9528 -9166 12968 -39144 -27389 -14063 22045 3145 -5241
14038 -5241 45850 34258 25218 10163 -26105 -26232 -15751 -17331 -15119 -26586 -25422 -8153 -33556
14025 -33556 -16768 -17196 -34725 -47617 -354 27830 9439 29481 85822 93765 67271 7742
14013 7742 -23754 -71449 -82991 -36067 -48765 -60818 -737 46788 94045 91787 106561 100448
14001 100448 19753 -38203 -61653 7218 20361 25421 38781 -16490 12865 15272 -31847 7111
13989 7111 26739 46522 78059 55066 69369 124625 131775 79019 94240 110625 66859 9986
13977 9986 -8203 11840 30719 19667 -3186 -321 -26052 -12050 -9898 -27065 31452 77450
13965 77450 22837 9989 28102 30442 32755 36440 48730 54679 16467 17954 -26087 -32730 -8160
13952 -8160 -5604 3745 79051 47736 61545 68450 24092 -6374 22292 -44103 -83523 -74456 -66444
13939 -66444 -101276 -105152 -73697 -63651 -75461 -133099 -57170 -18303 -10325 -41535 -67967 -63024
13927 -63024 -85513 -61517 33963 110282 126690 71049 -10611 -34427 9901 32098 -29002 -119071
13915 -119071 -78391 -15247 10676 45220 35323 31824 -37780 -24992 -5614 -60955 -121835 -55664
13903 -55664 4983 37265 105508 110244 100000 28034 -70891 -146107 -147413 -63494 -25004 35604
13891 35604 8508 -30385 14366 8181 7384 190 -16066 -5893 -590 -9075 -46726 -96573 -94530
13878 -94530 -41351 34398 104556 151146 74692 32301 28888 14586 -31962 -94037 -53152 43200
13866 43200 26385 -13510 -11434 21551 97647 103041 119400 88149 44690 18093 36600 14520
13854 14520 40401 18083 -26585 -25727 -42649 6583 29851 66692 64057 53101 -12607 -47820
13842 -47820 16524 41497 45546 63039 47026 -542 17507 -1680 21702 42663 49499 130073
13830 130073 183443 123821 57786 49286 66644 63931 13221 52928 20386 -55701 -60481 -53343
13818 -53343 -81826 -91543 -27471 -1330 -48928 -15374 46060 113297 93032 7750 -552 -1146
13806 -1146 -26577 -4179 727 -952 -21130 -40267 -47386 -51524 -51408 -38476 -11219 15253 -8639
13793 -8639 -21116 -10022 -68648 -118435 -87764 -73052 -41271 -35338 -63666 -17147 -12658 26485
13781 26485 2013 -49510 -53805 -55455 -21964 12606 73089 84364 65638 8640 15587 62322
13769 62322 67542 34173 36345 73682 9634 -77130 -72474 -42712 -46468 -35819 -64243 -76014
13757 -76014 -51963 -96374 -116916 -69263 -61545 -72967 -28039 71577 112318 120446 79331 59724
13745 59724 3202 12539 24356 83503 121151 75822 -6821 -2793 69546 73514 29989 63197
13733 63197 27831 729 -6113 40878 133993 50362 40671 14602 48385 30017 18407 36213
13721 36213 12024 -18075 32831 14641 -4354 40334 34781 20461 18434 -41138 -16376 -12449
13709 -12449 -27061 3702 45703 23003 37077 74768 38921 19098 -6692 -45164 -53141 -50863
13697 -50863 -57269 18346 68825 69435 -4082 30033 47104 27654 -1785 4462 8396 -22823 -8735
13684 -8735 64466 75247 28798 -4298 -18812 -5671 -16971 -20825 -26375 -36524 -71153 -63487
13672 -63487 -41463 -1849 4031 -16041 -22795 -26306 -29607 -4457 -27598 -39292 -54253 -31076
13660 -31076 -4580 -2725 -23656 -60520 -49956 -28718 -12002 27209 54949 44515 93922 73783
13648 73783 24161 3850 53786 4715 -33737 -3614 20883 18885 63855 97607 119448 142345
13636 142345 139649 50220 -2276 -25145 -64766 -31017 41646 68377 36427 -17599 -68461 -77900
13624 -77900 -91258 -31966 -14604 4070 -33836 -27626 5667 -49517 -61423 -74883 -111892 -119351
13612 -119351 -108716 -49430 -14904 -45991 -56000 -28911 -6185 -6973 -38557 -73076 -70201 -51109
13600 -51109 -30084 -20836 21062 36886 40292 29742 38809 5562 -55938 -35389 -10227 -6864
13588 -6864 -12772 -18588 -22414 -45172 -40551 -10060 15851 14090 -1605 -8229 -3763 29159 33302
13575 33302 -12924 -4020 53158 14563 -19431 12238 28772 -760 4964 -11792 2898 1985
13563 1985 20728 62346 100009 29250 -58723 -32085 28918 36762 19118 14787 40849 31210
13551 31210 48826 71484 98479 116753 60706 72809 67549 49615 -1759 -51460 -58576 -87338
13539 -87338 -65725 -32655 -22533 -3121 -146 -27230 19481 40169 16958 30334 -9618 -26818
13527 -26818 9166 46571 15672 27282 77710 65373 25058 -41689 -73222 -50200 -55235 -51397
13515 -51397 -80960 -14784 41965 93315 90468 69109 54347 44655 62207 41390 13751 10972
13503 10972 -30644 347 64487 83041 48284 85135 33162 36550 -13302 -66248 -75804 -44187
13491 -44187 7060 -46160 -67801 18085 59801 -5375 -10220 46297 80000 142232 159860 123521
13479 123521 139863 166392 175194 93312 40528 57580 64312 44004 14292 32853 22336 -19950
13467 -19950 -46637 38760 110258 74677 46525 41028 -20106 -21385 -39138 -48858 -18012 41897
13455 41897 58546 55561 76394 86141 68920 40137 30284 26147 10540 -10460 -50033 -49173 -17503
13442 -17503 -7082 -14354 -23881 -10694 76310 81544 52860 38091 33186 60095 89607 45088
13430 45088 -9476 -16302 5364 21198 90603 82019 20783 -3532 -9281 10333 55700 87919
13418 87919 122374 120856 121838 80100 46871 46524 20507 2724 33443 47117 21482 -3773 -11784
13405 -11784 -12907 -22135 -1587 21998 -32296 -52222 -79188 -89585 -76060 3900 -984 -31285
13393 -31285 -26497 -52203 -100733 -29032 2066 -40972 -44972 -15394 38780 13272 26617 61002
13381 61002 47215 24849 49153 75658 52626 -5138 2440 37608 30239 44871 71771 61380
13369 61380 24436 37242 51676 85925 104593 89736 16761 -15493 34530 7772 3316 76322
13357 76322 88115 76034 152983 111532 72143 21988 7541 -32914 -12787 8515 95179 98056
13345 98056 16551 19878 68984 63140 21096 52119 119012 113227 94036 59668 85327 68951
13333 68951 12085 36735 49923 24396 7760 27007 32332 -42844 -21115 17763 70560 49120
13321 49120 42878 26064 45419 12470 -49254 -101859 -25563 53961 49129 82333 115423 122574
13309 122574 88172 61990 71170 120432 77552 10864 18585 75202 9418 -85956 -66817 -39754
13297 -39754 5313 26663 19948 3909 31967 68840 110149 74857 39235 45032 54147 70143
13285 70143 70179 82029 51096 -39104 -35092 36729 108553 142758 115096 85083 49202 -6941
13273 -6941 -79027 -102885 -64052 -14289 43335 70216 88349 55418 29228 34962 24084 5760
13261 5760 34732 61731 36196 13219 47976 58913 44565 25416 33881 37888 62264 123368
13249 123368 72189 40723 38432 24885 46380 64366 49472 81808 75812 63864 73925 58688
13237 58688 109805 173019 194229 132107 61514 20956 55955 -2645 9622 57179 72024 63624
13225 63624 30976 24903 22059 -523 -23001 -19935 678 -23251 -48970 -32027 813 3572
13213 3572 10841 54915 71551 25881 70281 89397 99801 57759 62543 65664 37759 61810
13201 61810 68406 60104 49991 -443 2361 -29584 -14604 39461 32506 77350 50890 -27463
13189 -27463 24033 -23124 -48534 -13626 7071 -55524 -90668 -56261 -31842 -6204 46024 36728
13177 36728 35688 104830 96854 50197 -24847 -69119 -8749 28924 -1115 -51287 -54150 27057
13165 27057 74266 78670 55200 44000 75743 45997 -39217 -75438 -47040 36357 97015 91910
13153 91910 81135 82733 7678 -44911 35323 125685 146141 55048 99691 143634 115750 74353
13141 74353 48709 49387 44669 91276 88741 14616 -14007 -18841 21296 47063 2466 -24801 6634
13128 6634 -14422 30160 57491 28335 4407 4158 15327 13919 46433 -3823 9444 45811
13116 45811 62079 61046 31212 -15985 15235 84437 72568 69519 21709 -5633 -25532 -6457
13104 -6457 19753 10390 -43919 -68589 -4681 84516 90198 42349 -30796 4556 4389 45533 49216
13091 49216 43266 34814 -17295 -78469 -64565 -70572 -61194 -48245 -15370 90430 144992 105190
13079 105190 110334 71819 107723 136793 92677 71273 59973 13675 27113 32987 -5260 -20012
13067 -20012 29148 84912 136872 111995 86736 91192 64672 42091 14891 9052 19576 45131
13055 45131 113849 139013 110274 104306 84765 100599 104996 94518 77234 21629 8605 13258
13043 13258 56500 60160 7990 14181 69986 70282 102197 86414 108913 125259 107892 89930
13031 89930 54411 61504 128193 163906 161088 87892 23401 40761 98837 98211 31401 9188
13019 9188 -1157 -43615 22269 46510 12280 30686 36830 43148 46828 2193 -25131 20966
13007 20966 59365 15432 -10211 61978 77766 27583 2490 -47566 -78202 -66086 -16304 54445
12995 54445 57574 -20 20463 44180 61825 91685 148226 122658 127269 127565 154401 165268
12983 165268 113132 78234 3859 2037 37159 57139 33820 -14869 38523 73500 64726 89554
12971 89554 104373 87466 45076 60877 35323 -378 2947 69686 53200 77829 27562 12515
12959 12515 47157 151082 150761 80879 56796 57795 50940 64485 16265 -34879 -109387 -103246 11096
12946 11096 120233 161739 133860 124162 154997 129933 92197 104927 140371 184569 148723 101745
12934 101745 154461 162511 110546 93662 63026 76684 37927 -5557 18494 51877 36996 -19221
12922 -19221 -6574 35711 81454 160303 191506 123332 88414 89909 65970 29627 27903 -10676
12910 -10676 -32590 -9028 6191 23401 55558 25206 22103 44519 61466 71197 37072 -4884
12898 -4884 -13068 3823 8377 -8283 18796 50377 34514 17686 -27429 -41249 -34757 -83081
12886 -83081 -78101 -80169 -76673 41881 128527 169791 152809 93948 63741 86816 155478 163089
12874 163089 145237 91957 54059 9994 -31961 49636 76970 73775 86514 38668 34064 -2432
12862 -2432 -26944 21074 66862 21880 -18738 4400 63125 113579 106189 37587 28923 83714
12850 83714 75731 108177 104509 44095 -5037 15847 -11707 13740 48887 66324 78780 128821
12838 128821 190502 127374 79882 110198 143883 93291 61537 100055 140090 80906 71021 80353
12826 80353 42685 63174 129016 204424 219778 189922 138225 89451 50949 44698 79695 129548
12814 129548 135685 172157 184472 194089 170342 223834 230475 208514 200101 231902 202487 185338
12802 185338 171863 125523 115132 134663 143958 153675 124187 70968 70424 81262 102519 85103
12790 85103 133273 131111 94671 121757 112175 90930 74939 99614 97820 144644 153543 93678
12778 93678 100146 118318 169486 174804 179236 167680 117108 46849 -6387 -4678 36538 20742
12766 20742 12413 62770 49802 10686 72781 111361 138740 139231 135579 88172 95988 116061 124759
12753 124759 137982 185250 169864 177693 167034 203114 195094 183796 109692 90535 145470 186665
12741 186665 197151 151289 120746 76490 100249 86414 104789 89215 99648 125388 140685
12730 140685 102482 81990 85797 121190 131174 127903 152757 134856 159607 196609 193323 252839
12718 252839 236363 178884 186602 144018 136943 159946 206818 205346 182094 175688 203820 161310
12706 161310 103806 70602 23628 -766 97847 174601 208613 182267 120308 127765 142971 128598
12694 128598 202332 211680 166480 151257 124447 80020 74853 60546 53315 42647 63663 32398
12682 32398 56720 60299 29583 40939 94982 129186 183869 158423 136801 111737 119765 107831
12670 107831 169041 222912 226799 222399 253180 264373 178128 126510 163551 189076 148520 159838
12658 159838 203041 210177 191515 137644 168782 144823 88955 130929 132665 136668 112227 168140
12646 168140 144275 138843 159543 154282 134448 153436 150577 145531 175711 149526 76616 70472
12634 70472 136256 166419 153817 102359 51508 77702 189326 220954 175351 102476 145854
12623 145854 185149 217426 231892 190189 182284 154679 160033 157918 129471 96489 116515 103968
12611 103968 88602 146022 149608 184604 211041 193840 164862 169562 87514 63545 58360 78270
12599 78270 132017 182445 180516 232026 284104 321323 327438 275400 257632 209888 177595 156683
12587 156683 145882 136594 137433 119448 72166 67954 54232 83311 161738 267049 278728 272828
12575 272828 264870 201429 202482 219468 233023 212984 173986 217792 206082 176433 148347 171956
12563 171956 198015 177646 178261 222309 242177 223923 170494 155912 207908 219845 214665 198697
12551 198697 152528 55542 99886 167685 145625 179489 179360 183779 165136 154142 156884 180082
12539 180082 165085 199730 145104 162826 180394 177347 186061 258034 230613 167440 131227 137624
12527 137624 164106 168852 177213 157435 192284 205146 271056 253936 244617 235389 201326 245434
12515 245434 262538 221841 241247 227724 182425 197337 217276 188317 213316 220572 276698 292111
12503 292111 353171 304202 187117 213117 250424 284554 269879 234314 268795 310827 332058
12492 332058 310536 286570 278869 273621 252558 278836 237620 147194 218714 248316 254240 218584
12480 218584 222943 261896 261904 294962 316034 279634 273587 274322 294132 305319 295343 334856 339956
12467 339956 281267 223528 224866 344454 359147 305246 320360 363316 311576 325581 331819 366898
12455 366898 371863 336746 317835 277079 223275 272340 355194 350628 377379 317805 290645 320759
12443 320759 352485 354631 335999 321546 324994 332267 348089 358479 341292 335875 361634 355245
12431 355245 335095 239463 229460 237365 276269 296198 360022 410521 415258 385165 368598 404213
12419 404213 421924 384630 417587 387114 382533 409647 413584 395875 405328 339893 338184 345479
12407 345479 326356 305052 342758 350236 344629 342922 394811 371209 347428 345031 321703 279417
12395 279417 298738 324047 365418 326743 387938 377401 376589 417725 438195 419775 389857 403217
12383 403217 436766 445111 436743 398858 414494 422083 420806 386971 382257 360414 403288 450330
12371 450330 479067 466432 446341 456519 502692 511390 532909 534741 505129 464956 433179 429303
12359 429303 379275 333536 368775 457878 486395 523033 499679 493763 484986 479895 483502 506725
12347 506725 527108 523129 528742 544412 557656 535824 549825 517400 515417 553145 576865 544992
12335 544992 533092 540357 547975 546086 566679 565887 524452 495861 508175 502162 538230 545431 520206
12322 520206 488487 524210 572335 517034 462797 435709 513431 625459 647847 621448 610543
12311 610543 583291 589886 565121 519176 498182 509334 567096 569109 588688 644095 611746 587785
12299 587785 589482 607665 611723 610270 620159 640525 641646 665743 642784 671802 690592 652323
12287 652323 659278 644459 649658 655594 701775 667132 675752 723462 761473 790991 804907 762609
12275 762609 742506 779026 776186 728772 731902 768784 819352 804327 769511 773142 761703 686575
12263 686575 661119 704814 714766 774298 806133 816161 808970 807337 865461 874277 878130 863877
12251 863877 866021 874232 891812 834589 843884 896029 907011 868696 893221 935413 1008210 1041458
12239 1041458 1045577 1044066 1067866 1019681 1047924 1080643 1095545 1125158 1164931 1102886 1080632 1043375
12227 1043375 1058182 1076035 1036889 1002933 1006023 1031181 1047428 1018551 1016695 1034509 1050645 1119585
12215 1119585 1216637 1251045 1243911 1203830 1180982 1159243 1147763 1110757 1105729 1131150 1169711 1178172
12203 1178172 1203144 1220212 1201041 1205142 1216119 1198538 1180677 1234298 1283455 1308899 1354053
12192 1354053 1399834 1463043 1410396 1416067 1489405 1491357 1518664 1495967 1450247 1405175 1431082 1532639
12180 1532639 1547937 1528047 1574703 1565526 1576845 1596091 1567598 1650702 1703671 1617173 1595599
12169 1595599 1615838 1649917 1655886 1675580 1694391 1722629 1756796 1770044 1759343 1716881 1738028
12158 1738028 1812050 1747120 1722570 1778722 1803055 1811737 1789950 1891596 1929365 1933273 1892349
12147 1892349 1885121 1946909 2012134 2013369 1966333 1999313 2037041 2114644 2125706 2133474 2086491 2112562
12135 2112562 2207805 2225995 2218266 2240657 2222987 2183222 2190586 2219638 2300424 2363815 2371899 2386196
12123 2386196 2419138 2462914 2528965 2549095 2585887 2574233 2595432 2654566 2673032 2731017 2724735
12112 2724735 2674806 2722321 2812453 2822538 2769392 2786106 2907952 2965825 3044491 3086115 3133129
12101 3133129 3119813 3100735 3102268 3192212 3277565 3270524 3296993 3310556 3304235 3385701 3381119 3408373
12089 3408373 3468124 3507036 3540675 3577894 3625357 3640901 3662209 3699133 3756913 3790891 3863490
12078 3863490 3894464 3944656 3993535 4077433 4104954 4142638 4145367 4170564 4287060 4355136 4453323
12067 4453323 4490899 4514536 4542041 4655296 4720665 4780868 4823505 4860124 4945412 5018338 5056768
12056 5056768 5137160 5202915 5185718 5198644 5275685 5434681 5508770 5557776 5603232 5670758 5696651
12045 5696651 5752856 5905749 6037483 6044661 6123962 6209755 6283594 6356276 6438068 6530051 6620435
12034 6620435 6679953 6723386 6782783 6839737 6960169 7098784 7200743 7299852 7417507 7468383
12024 7468383 7543361 7721081 7852520 7845367 7938363 8067299 8212430 8321917 8395054 8474683
12014 8474683 8595750 8675541 8768842 8902311 9025520 9163784 9305452 9410016 9475205 9558496
12004 9558496 9691418 9747507 9786839 9871039 10000895 10082321 10154739 10315874 10429583 10499954
11994 10499954 10571242 10630794 10679146 10774149 10896863 10951928 11008319 11119352 11224114 11356765
11984 11356765 11410683 11446025 11477035 11579672 11698501 11792246 11825943 11887793 11951609 12005357 12012983
11973 12012983 12030497 12078680 12085959 12110249 12156021 12210084 12312557 12379984 12335413 12275981 12317809
11962 12317809 12345954 12368702 12365164 12378914 12383991 12368479 12291664 12240894 12207884 12134325 12101711
11951 12101711 12062048 12075874 12024962 12000099 11958924 11823873 11733549 11684151 11641388 11590806 11560261
11940 11560261 11496993 11450969 11404799 11340338 11220647 11137962 11028552 10955442 10892782 10806195 10745273
11929 10745273 10566930 10516463 10481456 10400128 10232199 10155691 10125665 10051655 9893910 9735747
11919 9735747 9563611 9441151 9285507 9200941 9190408 9133217 9030078 8941942 8846338 8786057
11909 8786057 8724876 8616730 8480015 8389483 8298374 8140012 8067798 8005038 7888820 7778568
11899 7778568 7705389 7640556 7572295 7501647 7432048 7321713 7233426 7175427 7096663 6994977 6930551
11888 6930551 6826776 6723744 6681933 6533386 6414547 6309033 6257508 6156383 6101173 6061897
11878 6061897 6003880 5894960 5780948 5715718 5665769 5645939 5517757 5399517 5326188 5308113
11868 5308113 5266521 5213179 5146629 5098307 4996535 4868663 4765290 4754660 4700575 4639411 4565045
11857 4565045 4479407 4412804 4327656 4278653 4290138 4286702 4217087 4147697 4120906 4128312 4063948 4032125
11845 4032125 3975880 3888933 3830843 3738085 3687121 3620760 3618001 3594337 3515891 3470940 3528656
11834 3528656 3517977 3445302 3391226 3381011 3340471 3294452 3223356 3190785 3162066 3142836 3122439
11823 3122439 3103004 3045445 2915052 2921672 2935749 2870827 2882057 2962350 2933100 2897512 2841414
11812 2841414 2832104 2812462 2761291 2683478 2669124 2584214 2500485 2483270 2503915 2478183 2437937
11801 2437937 2417934 2361767 2302952 2240572 2237270 2217040 2216906 2197433 2118965 2114207 2161586 2201003
11789 2201003 2266812 2250286 2196636 2186030 2094086 2029983 1967365 1908979 1931077 1967665 1921549
11778 1921549 1906044 1885156 1874694 1896159 1860074 1812452 1771602 1719789 1753557 1747750 1743778 1736786
11766 1736786 1733130 1748431 1753112 1725062 1675388 1665330 1652455 1593732 1536275 1553316 1597030 1570628
11754 1570628 1596080 1602116 1552566 1550215 1501982 1543633 1518331 1446992 1392571 1398518 1426137 1378459
11742 1378459 1336734 1349964 1381996 1373109 1345738 1354015 1287547 1253873 1320747 1343856 1288018 1356304
11730 1356304 1364921 1336793 1278562 1266354 1259868 1237711 1269727 1242440 1190416 1141966 1183676 1171601
11718 1171601 1150391 1162279 1174838 1139897 1141743 1130962 1132478 1175373 1122529 1158494 1180735 1139011
11706 1139011 1070177 1047701 1109026 1096833 1025977 1008135 1021157 1036367 1010071 1051073 1098305
11695 1098305 1137247 1053040 1000844 987441 986121 1000626 1039339 1009102 932052 892246 889828 892698
11683 892698 860357 814094 772650 792584 786938 786343 796788 793464 806569 838653 852361 851785 861737
11670 861737 810797 805344 830208 817634 853305 860141 788145 756441 728212 741468 788049 779311
11658 779311 720335 758351 779614 741095 717421 758070 786051 725850 719067 717221 747533 758926
11646 758926 709567 682165 662333 643640 640343 684614 724629 699854 640730 591188 634901 673165
11634 673165 698242 693629 701717 686424 639288 631249 658500 685102 677598 651153 615624 655061
11622 655061 669019 603114 616759 621982 592823 580943 587828 558453 541234 561267 611117 572892
11610 572892 560215 613380 568387 531205 537526 557198 593987 579827 555456 576534 608951 569360
11598 569360 564987 616174 634190 610914 585270 602761 558389 501513 447510 435762 449932 468995
11586 468995 480977 462462 470445 486957 511115 461727 465472 513816 480961 454887 468972 467119
11574 467119 452647 481660 509336 539372 586397 538562 502807 510727 475605 480190 483909 476467
11562 476467 457446 465212 462901 437176 398890 368327 411843 480083 458479 406247 346633 374300
11550 374300 394787 407752 453229 437765 418004 425214 467036 446232 400179 391730 349317 393062
11538 393062 404053 385171 365671 368672 378196 376059 347567 314317 380783 398578 349216 338454
11526 338454 408448 450865 437485 407112 369601 347364 371535 430669 368120 331946 340793 387381
11514 387381 414631 430295 410629 389584 401366 344123 320398 340338 355145 342152 282690
11503 282690 307665 352405 380682 343200 308925 342837 320217 305749 286483 288802 333682 337091
11491 337091 322361 265426 315899 369401 371434 317469 367282 437082 478532 456519 409799 351749
11479 351749 353972 364850 327945 302387 321239 314329 242888 181147 203755 263617 245321 170472
11467 170472 175331 240040 277260 258144 207917 233956 267193 260606 219685 226108 230193 225189
11455 225189 271777 248358 184942 157497 252809 295460 271331 244424 150788 146427 226306 247333
11443 247333 256859 280514 248718 234535 237442 213419 208439 180357 190704 211954 184865 195610
11431 195610 223241 230258 233220 310253 316189 257860 209482 214149 176507 189046 191577 189273 208230
11418 208230 177426 151354 179472 246723 260858 214024 192540 203685 215402 223401 205376 178816
11406 178816 218327 235205 232681 212880 174556 175941 242815 307394 311400 303764 292104 284241
11394 284241 236538 172049 138602 140089 189475 183779 161633 165084 146884 127441 110746 166278
11382 166278 220359 258520 277281 215888 125508 49095 75803 82893 121934 115059 65295 94685
11370 94685 118081 128612 139942 119360 104465 130224 160017 162728 188104 198930 202539 221365
11358 221365 176775 146748 161309 194472 209596 263182 209724 192892 186352 148874 205823 244082
11346 244082 170739 149646 143356 156799 221383 291384 297684 210769 110474 133088 175361 181417
11334 181417 180718 199044 202789 167025 132566 120582 137405 178124 180021 135740 152719 181219
11322 181219 156394 170191 154740 138022 184474 228045 263545 276358 236893 167815 161491 243393
11310 243393 245671 189871 166412 172417 180354 137298 134182 182406 130564 146303 175067 113139
11298 113139 58693 58194 87645 84907 129155 111610 151589 116458 83593 81190 95780 141880
11286 141880 130428 106974 89588 161517 202638 208274 195397 144474 188590 190849 189245 189958
11274 189958 164614 144468 144517 185067 232146 215342 154177 164907 167135 119138 132031 169145
11262 169145 215373 183772 88215 62530 100383 156148 107342 43625 6612 3250 32796 34020
11250 34020 73613 91446 61777 44204 72345 99444 143317 143787 108618 106961 78534 143435
11238 143435 177606 140428 120379 108972 114736 107886 104337 156852 194072 199157 175884 137245
11226 137245 126276 70857 69743 141521 101342 68534 77047 86700 76551 95798 83515 78951
11214 78951 118668 221131 174071 108422 80737 18433 29576 103282 123624 144772 156218
11203 156218 144301 133102 98328 62220 130468 210363 215291 166243 126518 150371 172796 91622
11191 91622 71289 117669 70519 70843 97951 87087 46886 4803 939 20372 32795 56713
11179 56713 113183 117183 155725 119251 71294 76856 133291 104245 129576 132695 127871 110975
11167 110975 129328 133835 149585 157931 133063 133637 197241 168448 128435 49044 32873 42604
11155 42604 40605 50535 39185 100608 107056 78631 80995 44511 36584 16146 16806 -10044 -5037
11142 -5037 -2270 30752 50620 63040 88456 122911 150020 187862 165755 106421 99077 148572
11130 148572 130366 110579 50073 40267 72551 69100 56161 16826 -4734 -7185 65870 130500
11118 130500 75234 35190 66639 67344 14217 -15699 -26681 2715 72271 137455 108152 100968
11106 100968 153973 151143 110995 108506 106831 111310 51111 39094 121657 132580 131589 152363 117106
11093 117106 72833 15159 -31678 -1688 73427 76305 79312 126646 159481 114334 96449 111061
11081 111061 113285 158444 154421 121764 124027 121541 132711 150665 131260 81210 63200 82868
11069 82868 57886 73361 87367 42471 20995 4367 -15263 26999 41332 14624 -27691 -46597
11057 -46597 -46779 6411 22317 70768 69383 26764 -64854 -38494 51820 90081 110017 95879
11045 95879 93721 60262 104152 160411 172309 117780 100411 155977 178062 239840 216243 217260
11033 217260 199974 180623 226723 281217 322973 375907 340869 340741 406569 398566 345854 362867
11021 362867 388079 402196 352258 342021 409389 424844 416557 427761 483127 519343 492303 454545
11009 454545 430767 365499 348652 366716 369726 384611 385596 418173 473011 436315 358842 294838
10997 294838 239480 176223 111470 87942 77828 63305 60292 87090 109579 85014 58874 83006
10985 83006 99964 62508 84280 51730 73032 83159 64072 -682 975 49430 50288 58699
10973 58699 33086 -27037 -60549 -45296 9228 37274 25699 69627 54992 37373 14773 32050
10961 32050 41847 81413 98009 131729 111427 42274 27746 67297 77714 -35812 -73816 -23840
10949 -23840 19776 66487 83433 103707 -6769 -41594 -45658 -36743 -7716 2173 5262 11978
10937 11978 -6405 -58067 -65909 12243 44105 65617 133724 120923 94003 65492 35985 44465
10925 44465 80458 62296 47492 -1641 -16786 1637 -10200 33060 19267 19609 -12179 21027
10913 21027 48440 42980 25642 35665 14186 -54465 -68602 -8068 29282 -13044 8105 -19955
10901 -19955 11429 -23547 -54472 -72440 -46951 -29726 -6722 13575 32081 69175 54735 -18053
10889 -18053 -11998 20643 -5864 55679 90681 31327 -22981 5180 75825 28738 -14875 9064
10877 9064 62730 94850 91998 35772 -3420 27035 24253 4236 10586 53907 106070 73708
10865 73708 38409 2361 31617 115232 80874 51177 36049 3190 -23531 -32997 12456 12276
10853 12276 34174 119893 178053 168765 163787 95318 53470 -4529 -26050 -1121 -3419 7584
10841 7584 21552 15031 -919 65292 104151 88119 79694 85361 37665 21099 22684 30827 50734
10828 50734 51683 86832 40018 25552 79345 40860 -13816 22192 46606 120207 113778 96923
10816 96923 56308 49824 37915 -1457 -27436 -40330 30462 133084 57107 19395 -3083 53015
10804 53015 78824 59323 54363 47135 36825 24033 30174 14112 38764 75401 91190 86531
10792 86531 67940 68476 101586 89395 96326 89563 87388 46145 67485 98750 101968 73412 120741
10779 120741 127478 105632 84478 59509 15574 25075 2570 35490 24750 41136 62299 87054
10767 87054 109325 124599 101313 135896 132556 101909 57334 60733 72105 58422 40926 18544
10755 18544 -46367 -84099 -88018 -80736 -51807 -12952 -31839 -70623 -28052 55506 86823 40812
10743 40812 23810 -3689 -23491 -64893 -38431 -25964 43267 79949 65238 60694 51873 66759
10731 66759 94565 95235 75159 37067 42850 88029 145307 186145 171687 68872 7702 59388
10719 59388 47721 27197 53469 33119 38066 26391 22023 55088 25795 -7016 44177 10896
10707 10896 -8655 36639 23101 49580 72878 132185 171988 195633 192541 157867 87724 67072
10695 67072 109145 85747 -11752 -33506 -15418 -3250 35242 62523 71792 83101 104131 65512
10683 65512 12711 26850 32185 64456 25934 4061 38742 96547 91477 58775 81254 79306
10671 79306 50635 4153 19285 40449 52756 52314 67484 131537 193634 217473 208684 228767
10659 228767 280419 299589 247900 201628 215074 230899 209767 162672 146190 145384 215118 235712
10647 235712 246070 224847 248497 234010 239227 281248 414098 468684 429043 426527 436556 447298
10635 447298 449043 444476 536841 637193 700896 736483 765633 837662 955860 1024157 1095019
10624 1095019 1261725 1468643 1639968 1773994 1972636 2192813 2501147 2851913 3418111
10615 3418111 4173882 5084632 6375317 8168185 10561147 13664610 17406807 21399902
10607 21399902 24796049 26794344 27255538 26701955 25774694 25216004 25567040 27378251 31044164
10598 31044164 36725992 44172284 52143985 58300122 60603039 59102575 55273409 50764251
10590 50764251 47154468 45625798 46839955 51130297 58369263 67920840 77506538 83648436
10582 83648436 83905079 78690257 70292213 61259035 53503963 48323341 46144221 46839502
10574 46839502 50094398 54887359 59461946 61430206 59347664 53854562 46653161 39367857
10566 39367857 33250763 28982866 26545858 25785518 26276009 27327711 28148284 27867916 25960969
10557 25960969 22730248 18953371 15155743 11822384 9190412 7246726 5849519 4789671
10549 4789671 4022918 3412818 2981922 2645211 2362270 2041713 1794158 1634594 1544598 1430208
10539 1430208 1319110 1184013 1129585 1016645 927024 863224 767416 717879 664815 628925 647527
10528 647527 629729 587324 597971 581654 569449 550302 540156 560471 492291 448429 466524
10517 466524 401450 369185 392262 393806 375756 372472 367328 351161 388875 427759 385749 367705
10505 367705 396430 397948 377469 397449 427213 383411 299336 229726 252166 217156 218845 269441
10493 269441 290998 300984 315589 347521 331373 249173 226254 257170 217518 172753 207645 265641
10481 265641 272600 186327 161273 170337 148729 132159 164306 139156 133008 195965 181719 152600
10469 152600 162357 177455 200311 176980 151958 178013 157462 122665 94044 150812 275432
10458 275432 239110 142625 138496 174852 209042 231489 219054 177616 127291 75830 45320 81880
10446 81880 65956 76984 108089 95005 83893 128704 136446 148357 146693 114015 65986 103685
10434 103685 86376 69802 44707 50043 100752 127859 107067 131161 103744 58115 53119 42591
10422 42591 46536 62064 48945 66395 82968 109757 108916 5816 58567 110091 165671 193344
10410 193344 107826 71330 15233 -12835 -28500 -96444 -114107 -72763 -49015 -56696 -30140 -47133
10398 -47133 -64264 -31863 -48494 -28031 26389 66072 25492 -17833 -51971 -99230 -76144 12039
10386 12039 81023 26471 -63257 -108138 -53195 -50350 -92209 -99003 -97312 -38577 -34819 -51831
10374 -51831 -39774 -9556 19991 29759 47880 46858 69453 67340 49601 96039 90522 40536
10362 40536 31175 64768 61648 -18820 -31361 -34239 -27382 -36643 -12978 57465 67952 70528 90613
10349 90613 48458 69451 47016 -14052 -23683 75126 117904 146434 116801 77566 128141 134203
10337 134203 119127 91841 86299 104045 104821 96203 32433 -52625 -53275 -19512 26270 79867 88275
10324 88275 69166 97896 34333 22503 48504 55036 96507 91732 98454 70968 61507 29173
10312 29173 33334 32226 44890 91842 118656 92888 42173 55789 30034 9636 -7798 -50632
10300 -50632 -18115 -37647 -26807 35170 71693 34636 -18239 -56884 -12757 -1101 -5944 -3811
10288 -3811 11883 40267 73461 100663 90563 45769 21879 46374 54698 61106 99050 102265
10276 102265 149812 105688 56220 45852 71604 93021 68397 82080 21899 18392 -19113 22370
10264 22370 38605 218 -22880 -28352 39110 116330 139127 88289 30256 79691 162686 171069
10252 171069 141620 145938 107166 53336 59300 73396 73424 75110 102335 161553 169221 138690 99977
10239 99977 55447 77355 123406 87586 85577 85742 105387 144116 146907 40636 24674 61412
10227 61412 101164 119975 54343 63203 77239 84578 19804 -51844 -48538 52558 102665 68967
10215 68967 51639 103323 93269 32251 28364 32472 -28789 -66165 -56737 -34976 -6082 -9662
10203 -9662 -51715 -104028 -98531 -41646 33658 59378 42561 41784 80857 127467 125455 36840 -3237
10190 -3237 -7844 10007 57804 57753 57792 172648 148860 130638 150896 162714 75389 47545 85706
10177 85706 39552 11783 16266 31375 102922 136731 132738 142275 166229 181192 258818 236021
10165 236021 175782 183570 186384 173912 208938 283979 319643 305849 297597 256789 225297 279964
10153 279964 283719 236582 237614 301374 307468 364705 460829 585409 575614 508390 446056 393810
10141 393810 372838 259613 236266 299927 346481 328611 312094 286200 266475 271246 255684
10130 255684 224291 181806 161756 95420 96491 150712 257079 230861 166592 168816 148341 79284
10118 79284 74121 84017 91406 59131 66269 67334 72632 82416 28404 24597 -22131 36450 83809
10105 83809 65512 27590 17711 -6803 -24988 6288 24053 54458 66372 30429 -3391 -5645
10093 -5645 -10810 -57830 -67324 -91095 -69762 -61965 -3792 23505 28194 48410 80696 95867 107557
10080 107557 93072 44773 64217 75227 122045 110517 96448 73645 20909 -19736 12475
10069 12475 22313 33649 76793 79859 37771 74253 20618 -4597 -10902 -55293 -87556 -12500
10057 -12500 32036 55378 78972 34938 14061 12722 31619 38535 24923 53855 97224 110687
10045 110687 133571 165788 219411 117861 130234 109926 85250 83616 63748 121933 85327
10034 85327 68777 87978 60276 25850 22150 -14595 -7222 12524 71050 148693 151993 127979
10022 127979 142027 73902 8999 -9811 -17826 -28389 -8431 17792 10783 50327 57742 39862
10010 39862 -24414 -19351 -14836 -98302 -112057 -75636 -44118 53163 79683 60966 92505 127725
9998 127725 129393 90533 90875 97338 104052 152287 157669 46583 -10441 -9495 -7765 -38935 -35294
9985 -35294 18244 71401 41116 -9130 -43389 -18066 12249 53947 116092 112802 64300 -20553
9973 -20553 -19911 68205 92290 33390 -33847 -57312 -40567 16813 27832 -11171 -5499 62554
9961 62554 109666 46241 10050 10631 19180 876 44316 48945 31532 -30292 -55568 -23357 -41289
9948 -41289 -95930 -63438 -80511 -101729 -61610 28053 81076 67744 43304 29012 -53730 -39096
9936 -39096 -32937 -65663 -69533 -54453 -14142 11476 18408 21083 20800 29826 16200 28407 25067
9923 25067 -4684 -9885 21348 54257 13133 14826 2256 47522 22627 10434 35395 29166
$$ [...]
##END NTUPLES=NMR SPECTRUM
##END=
