##TITLE=Analysis number 315473
Compound Code cc 02113
Book Reference 440/106
Project Code adrs
Chemist Name craigr
##JCAMPDX= 6.0         $$ Bruker NMR JCAMP-DX V2.0
##DATA TYPE= NMR SPECTRUM
##DATA CLASS= NTUPLES
##ORIGIN= Bruker BioSpin GmbH
##OWNER= NMR
$$ XWIN-NMR		Version 3.5
$$ Mon Nov 21 11:33:53 2005 GMT Standard Time (UT+0h)  MAYBRIDGE\NMR@NMR_250MHZ
##.OBSERVE FREQUENCY= 250.131544655141
##.OBSERVE NUCLEUS= ^1H
##.ACQUISITION MODE= SIMULTANEOUS (DQD)
##.ACQUISITION SCHEME= undefined
##.AVERAGES= 16
##.DIGITISER RES= 18
##SPECTROMETER/DATA SYSTEM= dpx250
##.PULSE SEQUENCE= zg30
##.SOLVENT NAME= CDCl3
##.SHIFT REFERENCE= (INTERNAL, CDCl3, 0, 16.522)
##AUDIT TRAIL= $$ (NUMBER, WHEN, WHO, WHERE, WHAT)
$$ ##TITLE= Audit trail, XWIN-NMR		Version 3.5
$$ ##JCAMPDX= 5.01
$$ ##ORIGIN= Bruker BioSpin GmbH
$$ ##OWNER= NMR
$$ C:\u/data/dgb/nmr/ADRS/12700/pdata/1/auditp.txt
$$ ##AUDIT TRAIL=  $$ (NUMBER, WHEN, WHO, WHERE, WHAT)
(   1,<2005-11-21 11:33:20.53 +000>,<MAYBRIDGE\NMR>,<NMR_250MHZ>,
      <created by zg, POWCHK disabled, PULCHK disabled
       configuration hash MD5:
       62 19 C7 07 E1 42 D1 B7 37 6C 3D D0 77 39 F9 E6
       data hash MD5: 64K
       9B 07 0E DC 31 AB 49 D2 A9 15 D9 85 E4 BD 63 A3>)
(   2,<2005-11-21 11:33:38.42 +000>,<MAYBRIDGE\NMR>,<NMR_250MHZ>,
      <Start of raw data processing
       ef LB = 0.3 FT_mod = 6 PKNL = 1 SI = 32K 
       data hash MD5: 32K
       46 0A 5D DC 14 62 9B B6 0D F4 66 A2 18 32 BC 9E>)
(   3,<2005-11-21 11:33:40.60 +000>,<MAYBRIDGE\NMR>,<NMR_250MHZ>,
      <apk 
       data hash MD5: 32K
       D1 B9 53 76 DA AE D8 11 14 6A 9D EC B4 86 90 9B>)
(   4,<2005-11-21 11:33:41.40 +000>,<MAYBRIDGE\NMR>,<NMR_250MHZ>,
      <abs ABSG = 5 
       data hash MD5: 32K
       E5 6B A4 45 DC 12 A9 77 F1 79 6D 55 BC 86 F7 FC>)
$$ ##END=
$$ 
$$ hash MD5
$$ 03 60 DA 3F 43 A6 79 C1 D1 78 A7 65 CA 85 20 7A
##$RELAX= 
##$RELAX= 
##$RELAX= 
##$RELAX= 
##$RELAX= 
##$RELAX= 
##$RELAX= 
$$ Bruker specific parameters
$$ --------------------------
##$DU= <C:\u>
##$EXPNO= 12700
##$NAME= <ADRS>
##$PROCNO= 1
##$TYPE= <nmr>
##$USER= <dgb>
##$AMP= (0..31)
100 100 100 100 100 100 100 100 100 100 100 100 100 100 100 100 100 100 
100 100 100 100 100 100 100 100 100 100 100 100 100 100 
##$AQSEQ= 0
##$AQ_mod= 3
##$AUNM= <au_zg>
##$AUTOPOS= <18 >
##$BF1= 250.13
##$BF2= 250.13
##$BF3= 250.13
##$BF4= 250.13
##$BF5= 500.13
##$BF6= 500.13
##$BF7= 500.13
##$BF8= 500.13
##$BYTORDA= 1
##$CFDGTYP= 0
##$CFRGTYP= 5
##$CHEMSTR= <none>
##$CNST= (0..31)
1 1 145 1 1 1 1 1 1 1 1 1 1 1 1 1 1 1 1 1 1 1 1 1 1 1 1 1 1 1 1 1 
##$CPDPRG= <>
##$CPDPRG1= <>
##$CPDPRG2= <>
##$CPDPRG3= <>
##$CPDPRG4= <mlev>
##$CPDPRG5= <mlev>
##$CPDPRG6= <mlev>
##$CPDPRG7= <mlev>
##$CPDPRG8= <mlev>
##$CPDPRGB= <>
##$CPDPRGT= <>
##$D= (0..31)
0 1 0 0 0 0 0 0 0 0.06 0 0 0 0 0 0 0.0002 0 0 0 0 0 0 0 0 0 0 0 0 0 0 
0 
##$DATE= 1132572798
##$DBL= (0..7)
120 120 120 120 120 120 120 120 
##$DBP= (0..7)
150 150 150 150 150 150 150 150 
##$DBP07= 0
##$DBPNAM0= <>
##$DBPNAM1= <>
$$ [...]
##$SUBNAM7= <"">
##$SUBNAM8= <"">
##$SUBNAM9= <"">
##$SW= 20.6930455092707
##$SWIBOX= (0..15)
0 0 3 0 0 0 0 0 0 0 0 0 0 0 0 0 
##$SW_h= 5175.983436853
##$TD= 65536
##$TD0= 1
##$TE= 294.16
##$TE2= 300
##$TE3= 300
##$TEG= 300
##$TL= (0..7)
0 120 120 120 120 120 120 120 
##$TP= (0..7)
150 150 150 150 150 150 150 150 
##$TP07= 0
##$TPNAME0= <>
##$TPNAME1= <>
##$TPNAME2= <>
##$TPNAME3= <>
##$TPNAME4= <>
##$TPNAME5= <>
##$TPNAME6= <>
##$TPNAME7= <>
##$TPOAL= (0..7)
0.5 0.5 0.5 0.5 0.5 0.5 0.5 0.5 
##$TPOFFS= (0..7)
0 0 0 0 0 0 0 0 
##$TUNHIN= 0
##$TUNHOUT= 0
##$TUNXOUT= 0
##$USERA1= <user>
##$USERA2= <user>
##$USERA3= <user>
##$USERA4= <user>
##$USERA5= <user>
##$V9= 5
##$VALIST= <valist>
##$VCLIST= <CCCCCCCCCCCCCCC>
##$VD= 0
##$VDLIST= <DDDDDDDDDDDDDDD>
##$VPLIST= <PPPPPPPPPPPPPPP>
##$VTLIST= <TTTTTTTTTTTTTTT>
##$WBST= 1024
##$WBSW= 4
##$XGAIN= (0..3)
0 0 0 0 
##$XL= 0
##$YL= 0
##$YMAX_a= 450703
##$YMIN_a= -454857
##$ZGOPTNS= <>
##$ZL1= 120
##$ZL2= 120
##$ZL3= 120
##$ZL4= 120
##$ABSF1= 16.522
##$ABSF2= -4.171173
##$ABSG= 5
##$ABSL= 3
##$ALPHA= 0
##$AQORDER= 0
##$ASSFAC= 0
##$ASSFACI= 0
##$ASSFACX= 0
##$ASSWID= 0
##$AUNMP= <proc_1d>
##$AZFE= 0.1
##$AZFW= 0.1
##$BCFW= 0
##$BC_mod= 0
##$BYTORDP= 0
##$COROFFS= 0
##$CY= 12.5
##$DATMOD= 1
##$DC= 0
##$DFILT= <>
##$DTYPP= 0
##$F1P= 14.0000005364418
##$F2P= -0.99999901652339
##$FCOR= 0.5
##$FTSIZE= 32768
##$FT_mod= 6
##$GAMMA= 0
##$GB= 0
##$INTBC= 1
##$INTSCL= 1
##$ISEN= 128
##$LB= 0.3
##$LEV0= 0
##$LPBIN= 0
##$MAXI= 10000
##$MC2= 0
##$MEAN= 0
##$ME_mod= 0
##$MI= 0
##$NCOEF= 0
##$NC_proc= -3
##$NLEV= 6
##$NOISF1= 0
##$NOISF2= 0
##$NSP= 0
##$NTH_PI= 0
##$NZP= 0
##$OFFSET= 16.522
##$PC= 1
##$PHC0= -70.81065
##$PHC1= 8.251043
##$PH_mod= 1
##$PKNL= yes
##$PPARMOD= 0
##$PSCAL= 4
##$PSIGN= 0
##$REVERSE= no
##$SF= 250.13
##$SI= 32768
##$SIGF1= 0
##$SIGF2= 0
##$SINO= 400
##$SIOLD= 32768
##$SREGLST= <1H.CDCl3>
##$SSB= 0
##$STSI= 32768
##$STSR= 0
##$SW_p= 5175.98343685301
##$SYMM= 0
##$S_DEV= 0
##$TDeff= 65536
##$TDoff= 0
##$TI= <Analysis number 999999
Compound Code 99
Book Reference 9
Project Code 9>
##$TILT= no
##$TM1= 0
##$TM2= 0
##$TOPLEV= 0
##$USERP1= <user>
##$USERP2= <user>
##$USERP3= <user>
##$USERP4= <user>
##$USERP5= <user>
##$WDW= 1
##$XDIM= 32768
##$YMAX_p= 281696642
##$YMIN_p= -36472
$$ End of Bruker specific parameters
$$ ---------------------------------
##NTUPLES= NMR SPECTRUM
##VAR_NAME=  FREQUENCY,     SPECTRUM/REAL,   SPECTRUM/IMAG
##SYMBOL=    X,             R,               I
##VAR_TYPE=  INDEPENDENT,   DEPENDENT,       DEPENDENT
##VAR_FORM=  AFFN,          ASDF,            ASDF
##VAR_DIM=   32768,         32768,           32768
##UNITS=     HZ,            ARBITRARY UNITS, ARBITRARY UNITS
##FACTOR=    0.157963299565203, 1,           1
##FIRST=     4132.6476996994, 0,             0
##LAST=      -1043.33573715361, 0,           0
##MIN=       -1043.33573715361, -36472,      0
##MAX=       4132.6476996994, 281696642,     0
$$ Real data points
##PAGE= N=1
##DATA TABLE= (X++(R..R)), XYDATA
$$ [...]
18869A9114J603P441j404r08l004j579J578L485O480L356J1229J1499K4857K7724
18855A11471M0542N2121N7622L5331K5804J4376o896j6130o967O012L4734N6671
18843D04691O6957O7774N6540K6525o311m1573o0439o3590n8115l2667r597J5943
18831C66138J8079M163m860k2126l7444m7874m6369l6407l7414l5803j7937j4825
18819H7321j3317q061J650r78j69l967p351o432P45Q88k584j362p85m332J072
18804D2338L479j867m859j697J348L001p16P625N321M220J2415K6931K5569J9500
18790A42608J7995K0775K2701L6144M3987L8106L0296L9634L4473K4049K1698
18779D72466J8196J7545L1266K8647L242j0846j8884j8139j1369j0193j6615k2042
$$ y = [19114, 20717, 28158, 26754, 25846, 22842, 21263, 22841, 26326, 32806, 36162, 47391, 58890, 83747, 111471, 152013, 204134, 261756, 297087, 322891, 337267, 330371, 314241, 307274, 313286, 348020, 404691, 471648, 539422, 595962, 622487, 616176, 574603, 514164, 450574, 392459, 359792, 350195, 366138, 384217, 388380, 383520, 361394, 323950, 276076, 229707, 193300, 155886, 120083, 102146, 87321, 74004, 65943, 67593, 66615, 66446, 62479, 55128, 48696, 49441, 50329, 47745, 46383, 45598, 41266, 42338, 45817, 43950, 39091, 37394, 38742, 41743, 41027, 48652, 53973, 58193, 70608, 97539, 123108, 142608, 160603, 181378, 204079, 240223, 284210, 322316, 352612, 392246, 426719, 450768, 472466, 490662, 508207, 539473, 568120, 571362, 560516, 541632, 523493, 512124, 501931, 485316, 463274]
18767D63274k0322k6980l9100l7900m6205m1571l1162k2063k4894k6495k1300
18756A25282j8924j9424r187j0974m784r238m384L002M78m70kl166m589l720m879
18741C5021j162k776m088m085j614K504M030J84l798k033J630O20n281K52J945
18726B1349m396L68J154L762K427k97k488j797K031m622J624L379L076m687p592
18711A3291J657J603n75k632K91L180m860n47K521R09l557k221O512Q234k65o812
18695A6729j194j172k314l559l72j813Q915M040k943m377p39k786m396j282l319
18680e82J402J191L058L184K166p61o30j856j577O962k22l424K962r21m943k370
18664C639j696J827M336R51j395J265J691k762j893L125J99m534k97J281k20L606
$$ y = [463274, 442952, 415972, 376872, 338972, 292767, 251196, 220034, 197971, 173077, 146582, 125282, 106358, 86934, 77747, 66773, 61989, 52751, 48367, 51369, 51847, 51377, 51375, 48209, 43620, 39900, 35021, 33859, 31083, 26995, 22910, 21296, 23800, 27830, 28014, 24216, 22183, 23813, 24433, 19152, 19404, 21349, 16953, 17321, 18475, 22237, 24664, 24367, 21879, 20082, 22113, 17491, 19115, 22494, 25570, 20883, 13291, 14948, 16551, 15976, 13344, 13635, 16815, 11955, 11408, 13929, 14838, 11281, 9060, 15572, 23806, 23541, 16729, 15535, 14363, 12049, 8490, 8118, 6305, 15220, 19260, 16317, 11940, 11201, 8415, 4019, 2737, -582, 820, 2011, 5069, 8253, 10419, 9658, 9028, 7172, 5595, 12557, 12335, 8911, 11873, 10952, 6009, 3639, 1943, 3770, 8106, 9057, 7662, 8927, 10618, 7856, 5963, 9088, 9287, 4753, 4456, 5737, 5517, 9123]
18648I123k113K873J965j508k71j032q538k725N338J100j818l08J273P322N588
18633A6269K79P09J951j146J879k477j245k021J116k77K358Q2p19n080L460L428
18617A8566l308n132m486n62Q65M869K772K01j541k250j723P953O911j544k448
18602A9143n074l562k562m192l958J461m67L307L500L995M562M515o68M82k629
18587A7853j201M395J80J793N705P01n25J161Q15j105L697L868j941m929n130
18572B5337j156J303K25m019l39M111j587l213K119O587N055J824p642m148l833
18557B0624J095J762M300q30j250J52Q680k998K179k95K495q390m341O113J322
18542C0618j513M839M671L897M032N52p827L67j544P28j96J872K409M061J470
$$ y = [9123, 7010, 9883, 11848, 10340, 10069, 9037, 499, -2226, 3112, 4212, 2394, 2086, 3359, 10681, 16269, 16548, 17257, 19208, 18062, 19941, 17464, 16219, 14198, 15314, 15037, 17395, 17477, 16758, 11678, 15138, 18566, 15258, 10126, 5640, 5078, 5943, 10812, 13584, 13785, 12244, 9994, 8271, 16224, 23135, 21591, 19143, 14069, 10507, 7945, 3753, -205, 1256, 789, 4096, 7596, 11591, 16153, 20668, 20000, 20482, 17853, 16652, 21047, 21227, 23020, 28725, 29426, 28901, 30062, 30877, 29772, 33469, 37337, 35396, 30467, 25337, 24181, 25484, 25709, 21690, 21351, 25462, 23875, 20662, 22781, 29368, 34423, 36247, 28605, 24457, 20624, 21719, 23481, 27781, 26951, 25701, 25853, 34533, 31535, 33714, 33419, 35914, 27524, 23183, 29296, 30618, 29105, 33944, 38615, 42512, 46544, 47096, 39269, 39636, 38092, 38820, 38624, 40496, 42905, 46966, 48436]
18527D8436Q57O2j936K092j713K472R33K536L94J042J23m011k094K225J380o999
18511D5799j401O4L96L70M14l296l152J74j766o144l803m096L242O674JN99k706
18494C1369Q4L334M594J306J357L313K692j591k62J89K86l043J630L616Q583K632
18478F0089J499O358J673m04j036N16P886Q635P918O669M566l536L21L444K517
18463A07115n66P374N016Q104J0338N069q752j1253j3028r833q334Q0K125N296
18449I8751J008k327j673j6769j0978j952o590p881K709J662k40j736J52k807
18435E1329j913J115Q19J244N932M103M298P27P81n65m979K487P339L444P37q70
18419G6028L953R955M382N763M315O561K707N542K856k352P226R275Q952Q782
$$ y = [48436, 49293, 49355, 47419, 49511, 47798, 50270, 51203, 53739, 54133, 55175, 55298, 51287, 49193, 51418, 52798, 45799, 44398, 44462, 44858, 45228, 45642, 42346, 39194, 39368, 37602, 31458, 27655, 23559, 26801, 33475, 33476, 34075, 31369, 31453, 34787, 39381, 40687, 42044, 45357, 48049, 46458, 46196, 46385, 46671, 43628, 45258, 48874, 57457, 60089, 61588, 67946, 69619, 69215, 68179, 68695, 76581, 85216, 93134, 99803, 104369, 100833, 101154, 104598, 107115, 106549, 113923, 118939, 127043, 137381, 142450, 133698, 122445, 109417, 99584, 91250, 91330, 93455, 98751, 99759, 97432, 95759, 78990, 68012, 66060, 59470, 51589, 54298, 55960, 55720, 53984, 54136, 51329, 49416, 50531, 51350, 52594, 58526, 62629, 66927, 67654, 68435, 67870, 62891, 65378, 72717, 76161, 76898, 76028, 79981, 89936, 94318, 100081, 104396, 110957, 113664, 119206, 122062, 119710, 126936, 136211, 145163, 153945]
18405A53945N092J447j457m098K440N703l664m597j0175j0760l252j233l387J997
18391A28001m351l712l941n145q493p235p834L32O269L42L31j87L377n21P66K204
18375A00203R703O986J47M156N239R52J99O719M278M330l777n339q178p788p291
18360A10539n029k832L777K403O400O135P179L418k5n33q146q223P95p99O312
18345A21371N26R805J4347Q504L156L330l791p152n41N251N038J0105N009m61
18331A74497p9M544K796J622R60k462L941K569M084R285R110L579J959M163k091
18316B18477q5J935M562P188O88o71M4L060r19m183l530K787K508M146L717m23
18300B39301m712M02L596N949O226N751O241o95j419m385l057N449R625J1167
$$ y = [153945, 159037, 160484, 159027, 154929, 157369, 163072, 159408, 154811, 144636, 133876, 130624, 129391, 126004, 128001, 123650, 119938, 115997, 110852, 102359, 95124, 87290, 87622, 93891, 94233, 94564, 94377, 97754, 97233, 97999, 100203, 109906, 116892, 117039, 121195, 126434, 127386, 127585, 134304, 138582, 142912, 139135, 133796, 125618, 117830, 110539, 105510, 102678, 106455, 108858, 115258, 121393, 128572, 131990, 131965, 131432, 123286, 115063, 115858, 115059, 121371, 121897, 131702, 146049, 154553, 157709, 161039, 157248, 150096, 149555, 154806, 159844, 169949, 174958, 174497, 174418, 178962, 181758, 183380, 184340, 181878, 185819, 188388, 192472, 201757, 210867, 214446, 216405, 220568, 218477, 218392, 220327, 224889, 232077, 232765, 232094, 232138, 235198, 234279, 230096, 226566, 229353, 231861, 236007, 239724, 239301, 234589, 234991, 238587, 244536, 250762, 256513, 262754, 262059, 260640, 256255, 253198, 258647, 268272, 279439]
18286B79439J2823J1107P587R117J3398J4948R412J449j957J8545K2624J4115
18274D12607R361K1471J9098K2962K2764J2114J0783K0490L1159M6179N7980N3678
18262G40646N9460O8343N4203M1028K8364J8813K6833L2888N3631Q3727J06194
18251A314130J15777J13397R1041N7492L5614J5068M314L4851R1628J35529J73290
18240B182131K13995K22483J97375J77351J41057J24960J42788K10817L18582
18231C931539M45898O06180P79339R51974J197177J585814K309650L670644N494286
18222B0972501O436776P738218Q134569N443479M064677J241147j086121j549254
18214E1395992n21203L291350P129536J1443109J3685647J1997241Q751004K375280
$$ y = [279439, 292262, 303369, 310956, 320073, 333471, 348419, 357831, 359280, 357323, 375868, 398492, 412607, 421968, 443439, 462537, 485499, 508263, 520377, 531160, 551650, 582809, 628988, 686968, 740646, 800106, 868449, 922652, 963680, 992044, 1010857, 1037690, 1070578, 1124209, 1207936, 1314130, 1429907, 1543304, 1634345, 1691837, 1727451, 1742519, 1746833, 1781684, 1873312, 2008841, 2182131, 2396126, 2618609, 2815984, 2993335, 3134392, 3259352, 3402140, 3612957, 3931539, 4377437, 4983617, 5762956, 6714930, 7912107, 9497921, 11807571, 15478215, 20972501, 27409277, 35147495, 43282064, 48725543, 52790220, 54031367, 52945246, 51395992, 50874789, 54166139, 61295675, 72738784, 86424431, 98421672, 107172676, 109547956]
18206A09547956l245517q682250j1768068j1524801q453349l756859K76118M854522
18198F7247752M686985K343188K61727m594138p454239r660629j0238046q936714
18190C3655886p332362n267247l465265k337843j688463j309355j081159q91435
18182A0282757p15963n40764l83383k86750k18430j68366j24354q5462p7971n1951
18172G629363J8132J33023L01499N05149P26434J095183J706329K764580M393564
18163A9273256N107203L810420L553505M071117N349811Q137899R936884O980505
18155F6220600N110114N616412M925086M036470M069251J853837J157385L200106
18147I6189261L024852j024259m328915m976648m808985k937295k118437m138513
$$ y = [109547956, 106302439, 97620189, 85852121, 74327320, 65873971, 62117112, 62393230, 67247752, 71934737, 74277925, 74539652, 69945514, 62491275, 52830646, 42592600, 33655886, 26323524, 21056277, 17591012, 15253169, 13564706, 12255351, 11174192, 10282757, 9566794, 9026030, 8642647, 8355897, 8137467, 7969101, 7844747, 7759285, 7681314, 7629363, 7647495, 7780518, 8082017, 8587166, 9313600, 10408783, 12115112, 14879692, 19273256, 24380459, 28190879, 31744384, 35815501, 41165312, 49303211, 59240095, 66220600, 71330714, 76947126, 81872212, 85908682, 89977933, 91831770, 92989155, 96189261, 99214113, 98189854, 93860939, 88884291, 84075306, 81138011, 79019574, 74881061]
18139G4881061n864499n673324n613605n854147o281979o167715n267145l773892
18131C0384755l239334l334891l687611l595807k759035j895507j351075j025486
18123I496009q33889p05851o14423n18978m43114l74730l35283k92545k58238
18114E118958k21601j68226j13245k5490J28413M06336J009403J722951J029199
18105H886698K05894k12535o08984p65874j223054j435642j048436o43836m11535
18096B742696k99732k28093j86025j59966j35782j10061r9895r1026q2819o7100
18086A282197o1718n9069n3176m7915m5183m4910l8130l0218l4805k9036l4764
18075H03273k6024k7350k4844k8458l2347k2050j9823k0451j9758k1829k1966
$$ y = [74881061, 69016562, 63343238, 57729633, 51875486, 45593507, 39425792, 34158647, 30384755, 27145421, 23810530, 20122919, 16527112, 13768077, 11872570, 10521495, 9496009, 8662120, 7956269, 7341846, 6822868, 6379754, 6005024, 5669741, 5377196, 5118958, 4897357, 4729131, 4615886, 4590396, 4718809, 5125145, 6134548, 7857499, 8886698, 9092592, 8880057, 8271073, 7505199, 6282145, 4846503, 3798067, 3154231, 2742696, 2442964, 2214871, 2028846, 1868880, 1733098, 1623037, 1523142, 1432116, 1349297, 1282197, 1220479, 1161410, 1108234, 1060319, 1015136, 970226, 932096, 901878, 867073, 838037, 803273, 777249, 749899, 725055, 696597, 664250, 642200, 622377, 601926, 582168, 560339, 538373]
18064E38373k4010k5470k0884j4190j5538j2104j0398m575n067j1068j1354j0871
18052C72844j1566j1621p497N115J0858j980k978k906j0312j7523j6952j1800
18040B93682j1198o851j985N779Q509J3481K741m967j809k477r331j5161r655
18027B60758j0374L042J0997J152o096k607m691k63l596o880m337o866m669q090
18013B17480o337l03j420k893L133J786n326q730l120l612p673j1475q482l750
17999A59278m236M7R29o672r663K294O202n674q103n875r465q635K251K795j0607
17984A04866l411L553K005L922J965k014K471M18l445n391N17O682O433L382L778
17969A25731J884p85j678N48m06O491J0060J0736O484p297p07L424Q092J4028
$$ y = [538373, 514363, 488893, 468009, 453819, 438281, 426177, 415779, 411204, 406137, 395069, 383715, 372844, 361278, 349657, 342160, 347275, 358133, 356153, 353175, 350269, 339957, 322434, 305482, 293682, 282484, 275633, 273648, 279427, 287936, 301417, 304158, 299191, 297382, 294905, 285574, 270413, 260758, 250384, 253426, 264423, 265575, 259479, 256872, 252181, 251918, 248322, 241442, 237105, 230239, 225570, 217480, 211143, 210840, 209420, 206527, 209660, 211446, 206120, 197390, 194270, 190658, 182985, 171510, 163028, 159278, 155042, 155089, 156018, 149346, 139683, 141977, 148179, 142505, 134402, 128527, 119062, 110427, 112678, 115473, 104866, 101455, 105008, 107013, 110935, 112900, 110886, 113357, 113775, 110330, 104939, 105456, 112138, 118571, 121953, 125731, 127615, 126830, 125152, 125700, 125294, 131785, 141845, 152581, 159065, 151768, 151061, 154485, 162577, 176605]
17955A76605J2986M430l214m871m943r292J481O54j711J996l760j5504j6230j0695
17941A27932n704q248k373n769p552m132j898j821p48l317J993K250P43l443n836
17926H2077l69p20K308k077m913k103m21O583O015j425r26j277J07j228n125o80
17910G5826j054k035k314j605l718m468L293L930k4Ol307p21k560o427m590l857
17894D6375M635O127l113j352J83J691j823m74K612n669l787L232J385l175r6
17879D6751j287l062J628M077J556j541j981K311N398M90o18j292j875J206j74
17864E1587N862J093q243l673J185J909l132l136l516L104L128k66M33k870n045
17849C8420q59j403q17Q92j396l824m770q25N550N53r8K274k461m624p601l407
$$ y = [176605, 189591, 194021, 190807, 185936, 180993, 171701, 173182, 173836, 172125, 174121, 170361, 154857, 138627, 127932, 122228, 113980, 111607, 105838, 98286, 94154, 92256, 90435, 89687, 86370, 88363, 90613, 91356, 87913, 82077, 81708, 80988, 83296, 81219, 76306, 74203, 73782, 80365, 86380, 84955, 84029, 82752, 82859, 81631, 76506, 75826, 74772, 72737, 70423, 68818, 65100, 60632, 63925, 67855, 67831, 67837, 64530, 63809, 61249, 54822, 50232, 46375, 51010, 57137, 54024, 52672, 52855, 54546, 52723, 52249, 54861, 49192, 45405, 48637, 50022, 46847, 46751, 45464, 42402, 44030, 48107, 49663, 48122, 46141, 48452, 53850, 54340, 53722, 52430, 50555, 51761, 51587, 57449, 58542, 50299, 46626, 47811, 49720, 46588, 43452, 39936, 43040, 46168, 45902, 46335, 43465, 38420, 37561, 36158, 35341, 36233, 34837, 31013, 26243, 25418, 30968, 31521, 31423, 33697, 31236, 26612, 19011, 15604]
17833A5604n328O7P776M086j0J092k18j81L661N330k524n599L784K388L311j967
17817C1272R01J140J736L901k68k620l745l229M61j504p38N17o590m490K681N689
17801B5114L164k479j550k795r50l39j885M957M545j689n626N94M205J144q64
17786B5546l037j932n82L062L13J62r46k558L973K138R62K490m010m106l06J275
17770B2444M384r74k997M30J441K757Q48M235K034j064j076k168l855J04J444
17755B7987k501n776j675L970N951j970j100N967j299n980P476L353n811j02m161
17740B4329q49K442k709N86k002M71L194j627K041J713m707j1j253K286j9J999
17724B5884k908j4K336n978l582J001M100q9J939O100Rl899j46O81l241K148o78
$$ y = [15604, 10276, 10343, 18119, 22205, 22195, 23287, 23069, 22888, 26549, 31879, 29355, 23756, 27540, 29928, 33239, 31272, 32173, 33313, 35049, 38950, 38682, 36062, 32317, 29088, 29549, 28045, 27307, 27824, 21234, 16744, 19425, 25114, 28278, 25799, 24249, 21454, 20504, 20165, 18280, 23237, 27782, 26093, 20467, 21061, 25266, 26410, 25546, 22509, 20577, 19995, 23057, 23370, 23532, 22586, 20028, 24001, 26139, 27101, 29591, 25581, 21475, 21169, 22444, 26828, 25854, 22857, 23287, 24728, 27485, 28333, 32568, 34602, 33538, 32462, 30294, 26439, 26543, 27987, 25486, 19710, 18035, 22005, 27956, 25986, 24886, 30853, 29554, 23574, 31050, 34403, 28592, 28490, 24329, 23480, 25922, 23213, 23799, 21797, 22268, 25462, 23835, 25876, 27589, 22882, 22871, 21618, 23904, 23885, 25884, 22976, 22962, 25298, 19320, 15738, 16739, 20839, 20750, 22689, 28789, 28798, 24899, 24753, 25434, 22193, 24341, 23663]
17707B3663j865k155j634J468L453k013K586L789l048k95M785N525J525n196k785
17692B7803l92l871k238J474O566L192l228j830k244o9N356J280k604k347m825
17677B2023l513P486N359L388n399K864K169L321K950j114k088m326k948m259
17663B5913l430L895M306o891m112k223K974N262J166l346l750r23m156j227J838
17648A5296k248k021j144K746L230N034m658l676k757j276K12J987M019K006J847
17633A8597m175k270l179m244P999P340P097R1p038k509J150j833J413N416J970
17618B5825M10k33l436R93m131n23j476L622K026M09j950q210k295J129N143Q14
17602A8117k421q16K352J552m96J676Q6j450J735o9O207J382m533Q157J387r54
$$ y = [23663, 21798, 19643, 18009, 19477, 22930, 20917, 23503, 27292, 24244, 23949, 28734, 34259, 35784, 30588, 27803, 27411, 23540, 21302, 22776, 29342, 32534, 29306, 27476, 25232, 25163, 30519, 31799, 29195, 26848, 22023, 18510, 25996, 31355, 34743, 29344, 32208, 34377, 37698, 40648, 39534, 37446, 33120, 30172, 25913, 22483, 26378, 30684, 23793, 19681, 17458, 20432, 25694, 26860, 23514, 19764, 18841, 14685, 13458, 15296, 13048, 11027, 9883, 12629, 15859, 20893, 16235, 12559, 9802, 8526, 8738, 10725, 14744, 16750, 18597, 14422, 12152, 8973, 4729, 12728, 20068, 27165, 27256, 20218, 17709, 18859, 17026, 18439, 23855, 25825, 26235, 26002, 22566, 23559, 19428, 18905, 17429, 21051, 23077, 23486, 21536, 13326, 11031, 12160, 17303, 18117, 15696, 14880, 17232, 18784, 18288, 19964, 20050, 18600, 20335, 20266, 26473, 27855, 23322, 31479, 32866, 31912]
17586C1912L883P047J1116J3164J9286K7818L7456M7057M6859M5600L4341K5206
17574C50745K140j1152j2093J54J4827L5891O4096O8454N9131M1411L791k2532
17562E94863n0055n7354o3382m8089k4499j073J9459O875L115o084l2214l7507
17550C04055m7244n0745m5478l4950k0342r499o219q782m319n310o296k12l175
17537F1484l951n768J586O53J451L499L844N623R624P223J4754K3856J5895K3285
17523A63058K4112K6136L7615L9860L7535K9636L4262L2704K4883K9003J8831
17512D97635J7892K5506J6476K347r474k1709k9148j4529m274j5178l6177l4822
17500C94545l2391l7949l8588l3755k7724k1649k0675k2104k4942k3301j6007
$$ y = [31912, 35795, 42842, 53958, 67122, 86408, 114226, 151682, 198739, 245598, 291198, 325539, 350745, 352885, 341733, 329640, 329794, 344621, 380512, 444608, 513062, 572193, 613604, 617395, 594863, 544808, 487454, 424072, 375983, 351484, 350411, 369870, 376745, 379860, 373776, 341562, 304055, 256811, 206066, 160588, 125638, 105296, 95797, 89578, 80796, 76477, 71167, 64871, 64659, 61484, 57533, 51765, 53351, 54004, 55455, 58954, 62798, 68421, 78045, 85268, 100022, 123878, 139773, 163058, 187170, 213306, 250921, 290781, 328316, 357952, 392214, 424918, 449801, 478804, 497635, 515527, 541033, 557509, 559856, 550382, 528673, 499525, 484996, 480722, 465544, 429367, 394545, 362154, 324205, 285617, 251862, 224138, 202489, 181814, 159710, 134768, 111467, 95460]
17489I5460j8981j3088m893o215q342q24J661m747K031n590p27M664k933m391
17475C3085l487k67k034o092m103N624K171n821j582K43o14K703J559J956J868
17460B5209J093K98o889j020M569J089l396j203K984l348r96L762P389n6l332
17445B6153m60j859p7M637O00M427Q082K019J721K08k773l77k895p461o370m908
17429B0667o31k781J147l07l879q80k508k414Q98m32k834j926L499M569k260J367
17413A1295r61k899j57L63p04k965o96L14Q49N90l663j27p92o75J053M052m756
17396A21K655J543J352M293j632k028r96o186L66L498M975O381l230o750j775
17381B587j583N188M201r243j717K184N82J287J477M955J95l156k652o276m490
$$ y = [95460, 76479, 63391, 58498, 52283, 43941, 43117, 44778, 40031, 42062, 36472, 35745, 40409, 37476, 33085, 29598, 29331, 27297, 21205, 17102, 22726, 24897, 19076, 17494, 17737, 17123, 19826, 21385, 23341, 25209, 26302, 26600, 19711, 18691, 23260, 24349, 20953, 19750, 22734, 19386, 18390, 22152, 29541, 29485, 26153, 25693, 23834, 23757, 28394, 28994, 33421, 41503, 43522, 45243, 45451, 42678, 42301, 39406, 31945, 25575, 20667, 20036, 17255, 18402, 18095, 14216, 13336, 10828, 8414, 9312, 8880, 6046, 4120, 7619, 12188, 9928, 11295, 10334, 7435, 7278, 7641, 6937, 3972, 3276, 3590, 4439, 5029, 1366, 1239, 447, -228, 825, 4877, 121, 2776, 4319, 5671, 9964, 8332, 6304, 5308, -878, -512, 2986, 7961, 14342, 11112, 4362, 2587, 1004, 6192, 10393, 1150, -567, 1617, 2199, 3486, 4963, 9918, 10113, 6957, 4305, -1971, -6461]
17366f461L24k3L541N968M27n15L530J791r94j934j634N00J450j503O37J928R71
17349H003k224N943K584k593K090j663l513j878L069m077m056j685j534j182K68
17334b448J366l98N053K882j995K677p90m533L328j40n301K781L310M37q13n28
17318D888P52P46N30n055K837J127o21k033j532N107M225j876J229j655m719N21
17302D471K703K899K030k799P938j040j225M443k837r9Q021R51m88l894j130m42
17286A9502L87j409K61k320R13m015j601K377K193l835l020o35j199k751n032
17271a84k923j395q16L154j991J04O37L284j763n356L80K618M377M585j297k478
17255I36M53K654l66k750l824l45L433J123Q047J135k863l195K555J089o118j691
$$ y = [-6461, -6137, -6160, -2619, 3349, 3776, 3261, 6791, 8582, 7588, 5654, 4020, 4520, 5970, 4467, 5104, 7032, 8003, 5779, 11722, 14306, 11713, 13803, 12140, 8627, 6749, 9818, 5741, 1685, 0, -1534, -2716, -2448, -1082, -1480, 3573, 6455, 4460, 7137, 6347, 1814, 5142, 5002, -299, 2482, 5792, 6229, 5416, 4888, 5640, 6386, 6916, 1861, 4698, 5825, 5204, 3171, 1639, 6746, 10971, 9095, 10324, 8669, 3950, 4471, 7174, 10073, 12103, 9304, 17242, 16202, 14977, 19420, 16583, 16484, 24505, 25456, 24968, 21074, 19944, 19502, 19889, 18480, 18741, 16421, 17334, 13319, 11718, 14095, 16288, 12453, 9433, 8798, 7599, 4848, -184, -3107, -4502, -5318, -2164, -4155, -4051, -3414, -130, -1893, -7249, -6869, -4251, 126, 4711, 3414, 936, 1389, 4043, 3677, 927, -2897, -3242, 191, 1314, 9361, 10496, 7633, 4438, 6993, 8082, 1964, 273]
17239B73J633L677J051k712j21j544J098p86N4L518j01K254J138n188j903K487
17223D828j128K193N546K556j73j760k067K670J863j901o989k751J374K119k34
17208F146M89M162N564L465k315j361k690J680O044k167k816J631L346L432j250
17193B3360M28j484o03M69M266P156Q795J0195M791J0355R182J7532K7936L9028
17179A61406M9476O0071O3080N0549M1917K5716J8937K3676J3101O164O097o144
17167E14046J986J937J863R053N119m571m060j3314k8119k5687l9546n1786m9820
17154C17101n4864m6902m0283l2244k2300j3427q834l799L691J599n495p033k837
17141H4373K638J388m382N173M744M478P498J6195K0269K2548L3493N0095O4834
$$ y = [273, 1906, 5583, 6634, 3922, 3801, 2257, 3355, 2569, 2623, 6141, 6040, 8294, 9432, 4244, 2341, 4828, 3700, 5893, 11439, 13995, 13822, 12062, 9995, 12665, 14528, 12627, 5638, 2887, 4261, 6380, 6146, 6635, 10797, 16361, 19826, 17511, 16150, 13460, 15140, 21184, 19017, 16201, 17832, 21178, 24610, 23360, 23788, 22304, 21701, 22170, 26436, 33592, 42387, 52582, 57373, 67728, 76910, 94442, 122378, 161406, 210882, 270953, 334033, 384582, 426499, 452215, 471152, 494828, 507929, 514093, 520190, 514046, 516032, 517969, 519832, 528885, 534004, 529433, 525373, 512059, 483940, 458253, 418707, 366921, 317101, 262237, 215335, 175052, 142808, 120508, 107081, 98247, 94448, 98139, 99738, 94243, 87210, 84373, 87011, 88399, 84017, 89190, 93934, 98412, 105910, 122105, 142374, 164922, 198415, 248510, 313344]
17128C13344P5544P5940O3719L7216J0458j2193l1105l8131l3657j7151R341M3669
17116D96994P7986J12893J37497J45100J55887J38220R7134N4471r712p0726j11378
17105A224366j34151j35990j10720o0684j771N6304J12047J46039J53991J42195
17095A391626R2967L8110l0455r0007j31966j54170j62093j46820j18362r2142
17085E96688n9137k5852P866L5702N1855N2181L0665k133l4269o5074q4620q4970
17073D18902p5005o4023m7473l4240k6620j7820j4806j3175j0962j1654o339p505
17061H9280n082J143n252j0589n374k971L88m141n553l149n388l384J493L246
17047D4667k877m324n376j161M24K048p95o159n390k593k549k304J836R86J793
$$ y = [313344, 388888, 464828, 528547, 565763, 576221, 564028, 532923, 494792, 461135, 443984, 453325, 496994, 574980, 687873, 825370, 970470, 1126357, 1264577, 1361711, 1416182, 1406470, 1335744, 1224366, 1090215, 954225, 843505, 782821, 781050, 837354, 949401, 1095440, 1249431, 1391626, 1484593, 1522703, 1492248, 1402241, 1270275, 1116105, 954012, 807192, 688830, 596688, 537551, 511699, 519565, 555267, 607122, 659303, 689968, 687835, 653566, 588492, 503872, 418902, 343897, 279874, 232401, 198161, 171541, 153721, 138915, 125740, 114778, 103124, 96785, 89280, 84198, 85341, 80089, 69500, 64126, 61155, 61543, 57402, 51849, 48700, 43312, 39928, 41421, 44667, 41790, 37466, 32090, 30929, 31353, 33401, 32606, 26447, 21057, 18464, 15915, 13611, 15447, 16433, 18226]
17032A8226m31J596J961L851q559J380M760k81j088j969k454K75r73K441r44k681
17016A5110n312Q87M203J774M232j023K223M192m511l468l960p14L15O497K382
17001B2827n197J144m82j860K95m66j7M0k743o02K340k560k12k725q85L53j481
16984G769m466J663P853P58m480j67K894J408J181J280j433n566n23Q91l392L09
16968E979R82L785J795P288K777m668r57K303K582k62o46j67j126j465K164j106
16952A9258K062J147L025P72K17K771K418J599l686J860O493k94q96j205N850
16937D1391j01k011m49K522j20J40L661q10M002J251L205l568j888J802N583J407
16921E6017m10K664j35N397L001K723R074J5059J0726J5049J9279J9804K0632
$$ y = [18226, 17795, 19391, 21352, 25203, 16644, 18024, 22784, 22503, 21415, 19446, 16992, 17267, 16294, 18735, 17791, 15110, 9798, 10685, 14888, 16662, 20894, 19871, 22094, 26286, 21775, 18307, 14347, 13633, 13948, 20445, 22827, 17630, 18774, 18292, 16432, 16727, 16261, 16244, 16284, 13541, 12939, 15279, 12719, 12507, 9782, 8897, 9250, 7769, 3303, 4966, 12819, 13577, 9097, 8930, 11824, 13232, 14413, 15693, 14260, 8694, 8171, 9062, 5670, 5979, 6961, 10746, 12541, 19829, 22606, 17938, 16981, 19284, 21866, 21604, 20958, 20791, 19665, 18200, 20364, 19258, 21320, 22467, 25492, 26264, 26481, 29252, 31670, 33269, 29583, 31443, 37936, 37642, 36746, 35541, 41391, 41290, 39279, 38830, 41352, 41232, 41372, 45033, 44223, 48225, 49476, 52681, 49113, 47225, 49027, 54610, 56017, 55607, 58271, 58136, 63533, 66534, 69257, 78331, 93390, 104116, 119165, 138444, 158248, 178880]
16908A78880K1276K4589L2533M3029M6481M1018M1628M4768M0917M6954N0493
16897F12566M8549N1487N6844O0921O3962M8674N0392N2771N4854N5865M4575
16886A201460M3147M1247L0175K5140K0914J4895R799P240l371j2920r801k4466
16874A343459l3357k1571k7567l8147m7993n6127n5822m6251m3540n5091o5677
16863H52316o2482o0451n3250m9341n0249n0830m0368l9642m2843m6404l8715
16852C17741k7962k0298k0931k3214k5477k2648k0416j1734j2364j2325p304l826
16840A09242o274q949m621o984j810l46k432L099P364n17m561j289K004J166n46
16825H4546Q94j6m512o600o702j0306j755K910J700O15j117l259n504n642O44
$$ y = [178880, 200156, 224745, 257278, 300307, 346788, 387806, 429434, 474202, 515119, 562073, 612566, 661115, 712602, 769446, 830367, 894329, 943003, 993395, 1046166, 1101020, 1156885, 1201460, 1244607, 1285854, 1316029, 1341169, 1362083, 1376978, 1386777, 1394017, 1390646, 1377726, 1367925, 1343459, 1310102, 1288531, 1260964, 1222817, 1174824, 1118697, 1062875, 1016624, 973084, 917993, 852316, 789834, 729383, 676133, 626792, 576543, 525713, 485345, 445703, 402860, 356456, 317741, 289779, 269481, 248550, 225336, 199859, 177211, 156795, 145061, 132697, 120372, 113068, 109242, 102968, 94019, 89398, 82414, 80604, 80258, 77826, 80925, 88289, 87772, 83211, 81922, 83926, 85092, 84546, 85440, 85424, 80912, 74312, 67610, 57304, 55549, 58459, 60159, 60774, 59657, 56398, 50894, 45252, 45896]
16810D5896q3L61J335J847l347o258l257o517J035J09P251J0520K659K599O425
16795F0575N074N364M023Q045P179M09j476K73l702m813P39m366q938m646m86
16780F3254k942o123m340L499K255o276l164l437r194q931K563L867j563k503
16766B6965J319K191L253N602O881J0235J0316J323M596N039J609J442O387M667
16752I1825Q753J0799M526Q463R369K869J2023J0699O48J0194J8124J2282M358
16739B04932J09j0598j6279j1869j5766m057J610K378M331Q804J1555J3237O881
16726A95268j622n516j0223p762o029p357l140m741Q057J809l489l641j254L269
16712A53629L621K689J3291M904l79N025K857k768J403l249q31j31n221R07O171
$$ y = [45896, 45813, 46174, 47509, 49356, 46009, 39751, 36494, 29977, 31012, 31121, 38372, 48892, 51551, 54150, 60575, 65649, 71013, 75036, 83081, 90260, 90669, 89193, 89466, 85764, 80951, 81690, 77324, 68386, 63740, 63254, 60312, 54189, 49849, 53348, 55603, 49327, 46163, 42726, 33532, 24601, 27164, 31031, 29468, 26965, 28284, 30475, 33728, 39330, 46211, 56446, 66762, 68085, 72681, 77720, 79329, 80771, 87158, 91825, 100578, 111377, 115903, 124366, 133735, 136604, 148627, 159326, 159974, 170168, 188292, 200574, 204932, 205041, 194443, 178164, 166295, 150529, 146472, 148082, 150460, 154791, 163595, 175150, 188387, 195268, 193646, 188130, 177907, 170145, 164116, 156759, 153619, 148878, 156935, 158744, 155255, 151614, 150360, 153629, 157250, 159939, 173230, 178134, 177755, 182780, 185637, 182869, 184272, 181023, 180192, 180061, 174840, 175747, 181918]
16697A81918O876M182O073R909J757K105Q453P908R254N166J2582J1745R565J6241
16683B93734K0828K1490K2282K3025K0127K6711K1947K6513K8172K7388K9360
16672E61577L1164L5272M4844N2447O2367P4866Q5231J01761R5257R1005R7613
16661A333404R2372Q4661R5196R9237J18307J43262J52819J78946J89580J88908
16651B676692K10414K31436K53234L00623L44159M04763N00240N97577P45216
16642F264354R60027J264704J767124K601463M079695O364558P981322R322737
16634D0605984J1194033R141173Q294704P530441M406693L696568K809453L63635
16626H8042684J167749R11473k79886R60906M87110r87832M28696l46948j247731
$$ y = [181918, 188794, 192976, 199049, 208958, 210715, 212820, 221273, 229181, 238435, 243601, 256183, 267928, 277493, 293734, 314562, 336052, 358334, 381359, 401486, 428197, 450144, 476657, 504829, 532217, 561577, 592741, 628013, 672857, 725304, 787671, 862537, 947768, 1049529, 1144786, 1235791, 1333404, 1425776, 1510437, 1605633, 1704870, 1823177, 1966439, 2119258, 2298204, 2487784, 2676692, 2887106, 3118542, 3371776, 3672399, 4016558, 4421321, 4921561, 5519138, 6264354, 7224381, 8489085, 10256209, 12857672, 16937367, 23301925, 31283247, 40605984, 51800017, 60941190, 69235894, 76766335, 81173028, 84869596, 87679049, 88042684, 89210433, 90121906, 89842020, 90802926, 91290036, 90302204, 90730900, 90383952, 89136221]
16617H9136221l89466k419133m415774n071745p805614q846963r641303r757954
16609D0788269q371352o920611n152638l501093k416207j774816j374330j089129
16601A0188093r02636p60749o53787n65181n01721m59790m25269l88067l69579
16592E161314l56184l41406l05241k82128k53682k28020k12954j78614j62848
16583B840237j58509j40100j31687j39762j38473j34302j35504j32249j29337
16574A600314j22837j08673r4360q3688o8646o2135m9571m2430m0239l9657l4875
16563H53203k6307l0541l5216k9090k6349k7940k7720k4609k3425k2248k4167
16552E55591k1613j7797j8190j9914k0669j9516j6759j9396j6827j4853j5227
$$ y = [89136221, 88746755, 86327622, 81911848, 76840103, 69034489, 60187526, 50546223, 40788269, 32416917, 25496306, 20343668, 16842575, 14426368, 12651552, 11277222, 10188093, 9285457, 8524708, 7870921, 7305740, 6804019, 6344229, 5918960, 5530893, 5161314, 4805130, 4463724, 4158483, 3876355, 3622673, 3394653, 3181699, 3003085, 2840237, 2681728, 2541628, 2409941, 2270179, 2131706, 1997404, 1861900, 1729651, 1600314, 1477477, 1368804, 1274444, 1190756, 1122110, 1059975, 1010404, 967974, 927735, 888078, 853203, 826896, 796355, 761139, 732049, 705700, 677760, 650040, 625431, 602006, 579758, 555591, 533978, 516181, 497991, 478077, 457408, 437892, 421133, 401737, 384910, 370057, 354830]
16541C54830j1201j1653j2977r007p944j2571j2021l320k265j568p343m171N7
16528B58846n870N88O211K496q454q648o311j2185o689k738l86J742P71q61M373
16513B22885q66j678m48k299k41K566K472Q0J966l440q217m005j658k945K407
16498B06579J119M718N538R104N803p904m977m259r703o876l351l285n046m240
16484A83220K957L172K717L93n972o803j2007p991q793j0112m543m469p870q733
16470A15166j2239j1351l475j257l828m408m444j312k572q152n594l022r947l227
16456D0338L414m396j527N089L944N513L931N010r20J264M249j478J963L467K827
16441G2688L396J478k113p734p321l674K77M83p84N68k045o784m881n445m82r47
$$ y = [354830, 343629, 331976, 318999, 309992, 302048, 289477, 277456, 274136, 271871, 270303, 262960, 258789, 258846, 252976, 253564, 259775, 262271, 253817, 245169, 238858, 226673, 219984, 217246, 216860, 218602, 219373, 218512, 222885, 222019, 220341, 219893, 217594, 217353, 219919, 222391, 222471, 224437, 220997, 212780, 208775, 207117, 204172, 206579, 207698, 212416, 217954, 227058, 232861, 224957, 219980, 215721, 206018, 199142, 195791, 192506, 187460, 183220, 186177, 189349, 192066, 192459, 186487, 179684, 167677, 159686, 150893, 140781, 136238, 131769, 123899, 115166, 102927, 91576, 88101, 86844, 83016, 78608, 74164, 72852, 70280, 62128, 56534, 53512, 43565, 40338, 43752, 39356, 37829, 42918, 46862, 52375, 56306, 61316, 60396, 61660, 65909, 64431, 66394, 69861, 72688, 76084, 77562, 75449, 67715, 60394, 56720, 56997, 57480, 56696, 57264, 55219, 48435, 43554, 38109, 37627, 36680]
16425C6680k507J207k594r352l463Q54K047j27K037O902M337L670Q38K132J808
16410D4469J252P875j976J967l067K01n89R62J408N488p60p67M172k590M175M925
16394F7145j481q51k486p190n082n37J541L188K736M62j751k490l991K971L101
16379E5285j590j193N14M013K111Q4l744m576J955J105l897k897R91L896m076
16364D7981L60M344k432q448l612L002J483j313K090l675k259o13P74l268m48
16349C3966M786r42P61k763M50j452p06m91L404m530j30K047l16L799L172r76
16333D0079J446r2q52N15j40r38l546k694l127p288r43M609j306r21J680p75m644
16316B1063l653K463O60j354R4J4J381k614n114j85J737k239J538O261n40l216
$$ y = [36680, 34173, 35380, 32786, 23434, 19971, 20825, 22872, 22745, 24782, 31684, 36021, 39691, 40529, 42661, 44469, 45721, 53596, 51620, 53587, 50520, 50721, 50132, 51094, 52502, 57990, 57230, 56463, 60635, 58045, 62220, 67145, 65664, 64813, 62327, 55137, 50055, 49518, 51059, 54247, 56983, 57445, 55694, 53204, 49213, 52184, 55285, 53695, 52502, 53016, 57029, 59140, 59224, 55480, 50904, 52859, 53964, 50067, 47170, 48161, 52057, 47981, 48341, 52685, 50253, 41805, 38193, 41195, 42678, 41365, 43455, 39780, 37521, 36908, 37682, 34414, 33966, 38752, 37810, 38571, 35808, 36258, 34806, 34100, 33609, 37013, 32483, 32353, 34400, 34084, 37883, 41055, 40079, 41525, 41433, 40581, 41096, 40956, 40018, 36472, 33778, 30651, 23363, 22420, 27029, 25723, 24802, 26482, 25707, 21063, 17410, 19873, 20533, 19179, 19273, 19287, 20668, 18054, 12940, 12755, 14492, 12253, 13791, 20052, 19512, 16296]
16300A6296J366J867K751j576K357K023L478J578k331j544l853k030Q358P903
16286C6643m96N864J4079J6214J4492J4919J3619J0697J3312l88M23N410R20J692
16272A47400k344Q90l113j4289j2864k1340j4048j0551q230q058o710l850j168
16259D1725p82l528k621j782P44M212n358p410j530P61K500Q435P338j539k989
16244C8176K815N559L792M496q18L130N110R365K428n590l152l542k595k22n590
16229E3362n157m123j874j15j590L748K315K474L058Q85J389M188K993M569l276
16214F2846q884m886N801O45n651p236p266l378q219m51K338k118j250n337m179
16199A2775K619M893L413k980l175m022n149N813K490l891j906J214R26O81L90
$$ y = [16296, 17662, 19529, 22280, 20704, 23061, 25084, 28562, 30140, 27809, 26265, 22412, 20382, 28740, 36643, 36147, 42011, 56090, 72304, 86796, 101715, 115334, 126031, 139343, 138955, 139378, 144788, 145708, 147400, 145056, 145946, 142833, 128544, 115680, 94340, 80292, 69741, 61511, 53453, 46743, 42893, 41725, 40943, 37415, 34794, 33012, 33756, 37968, 32610, 25200, 23670, 24431, 26931, 35366, 42704, 41165, 38176, 40991, 46550, 50342, 54838, 54020, 57150, 62260, 71625, 74053, 68463, 65311, 61769, 59174, 58952, 53362, 48205, 44082, 42208, 42093, 40503, 44251, 46566, 49040, 52098, 52983, 54372, 58560, 61553, 66122, 62846, 53962, 49076, 54877, 55522, 49871, 42635, 35369, 31991, 23772, 23321, 25659, 23541, 22291, 16954, 12775, 15394, 20287, 23700, 20720, 17545, 13523, 8374, 14187, 16677, 12786, 10880, 12094, 13020, 13701, 14091]
16184A4091K589O35J66k104J595M78J077K201L529P581j228q52N30l07Q12K055
16168C2848M446J369k902J036j746m54L506j772J101O707R522P02K603J047J316
16153E9329J527L026K78J438P433R388P460J1657J7649K2063K6735L4586M4356
16140B46925M9516O0209O0099N5849M8582M4483K8032J9606J4007N003J5723K0586
16128F68620K9800M6984O3806O6057O5673P2951P9005O5960M3697L4343J5367
16117A252263j0612j9343k1097j7393r680O514J6658K5096K8046J3696o598k5131
16105A232419m0159m7924n1495o1090o5363o9524o5234n2005m2067k5942j7422
16094F94194j3399k178o421k2064k8098l0161l8005l5703j5063o317J0917J9971
$$ y = [14091, 16680, 17315, 17481, 15377, 16972, 17450, 18527, 20728, 24257, 31838, 30610, 29758, 30288, 29981, 30793, 32848, 37294, 38663, 35761, 36797, 35051, 34597, 38103, 36331, 37432, 44139, 53661, 54363, 56966, 58013, 59329, 60856, 63882, 64160, 65598, 73031, 82419, 89879, 101536, 119185, 141248, 167983, 202569, 246925, 296441, 356650, 416749, 472598, 521180, 565663, 593695, 613301, 627308, 632311, 648034, 668620, 698420, 745404, 809210, 875267, 940940, 1013891, 1092896, 1158856, 1202553, 1236896, 1252263, 1241651, 1222308, 1201211, 1183818, 1174138, 1180652, 1197310, 1222406, 1250452, 1264148, 1257550, 1232419, 1192260, 1144336, 1092841, 1031751, 966388, 896864, 831630, 779625, 737558, 711616, 694194, 680795, 678617, 672196, 650132, 622034, 591873, 553868, 518165, 503102, 496785, 507702, 527673]
16082E27673K1927K3779J3800K802N458M007N580P897q339n678J646j0731j1462
16069E78359m400j6794q396n299k5869k7800l9354n3225n1322n8750n7402m5067
16057A84681l2526k0025j9197j2742p502r317j0025o182j023O16l696n454q957
16044D8651j2695o498P38K056j376J530j824o450l008Q30r5k306R58l230O55M377
16028B2313K514k947p758o329l532l624J632J715L840J057K135j292N981N640
16014B1345J435N52o86l289l69j791o229j772q69l165o783p23R11N961R662J95
15998A4385l770p76J084J198Q51o603o249m137J654J676N8k858P480J0401P164
15983B1558M681q94K364R172O86K628M471o72j631k025k566o755q430q207n444
$$ y = [527673, 549600, 573379, 587179, 589981, 595439, 599446, 605026, 612923, 604584, 598906, 600552, 589821, 578359, 573959, 557165, 548769, 543470, 517601, 489801, 450447, 397222, 345900, 287150, 229748, 184681, 152155, 132130, 112933, 100191, 92689, 83372, 73347, 67165, 66142, 66758, 63062, 57608, 48651, 35956, 29458, 30196, 32252, 30876, 32406, 30582, 24132, 21124, 21954, 21859, 19553, 20511, 17281, 17936, 22313, 24827, 21880, 14122, 7793, 4261, 637, 2269, 3984, 7824, 8881, 11016, 9724, 15705, 21345, 22780, 23332, 22646, 19357, 18988, 17197, 10968, 9196, 8327, 5162, -1621, -2344, -1433, 4528, 14190, 14385, 10615, 9839, 10923, 12121, 12972, 6369, 120, -4017, -2363, -687, -629, -3487, 3993, 14394, 21558, 26239, 25345, 27709, 36881, 37567, 40195, 44666, 43994, 42363, 40338, 37772, 31017, 22587, 14380, 8936]
15968H936m118n84m358k505K476o77l832K623K731L403M085j409J262L472L74
15953A1879m111m498M47pk560K01o74k942j871L337N252K773m82M51l760j685
15937A750P743M656j005j759j461j962m400k274K915K09l619L83n73p240K180
15922d457N539k298N84M819M83o792k757K60q86J867L626K992M081K367j200m414
15906C814n106m347j167K670K725n668j516Q80P188l37K015J088Q8k822N76p53
15890f72nK811M20K653K540m617j173K272p76k134j843J866J367j998n07m808
15874d604m311N547M006m968l737K610P33K192L195N254L193o051p934N716K299
15859C140k631K143L195l329q201J368K060o04J241M966N956k961k800j717m050
$$ y = [8936, 4818, 4234, -124, -2629, -153, -830, -4662, -2039, 692, 4095, 8180, 6771, 8033, 11505, 11879, 7768, 3270, 3717, 3710, 1150, 1351, 677, -2265, -4136, -799, 4453, 7226, 6744, 7195, 3435, 1750, 9493, 14149, 13144, 11385, 9924, 7962, 3562, 1288, 4203, 4412, 793, 1176, 603, -6637, -4457, 1082, -1216, -632, 4187, 4670, -2122, -4879, -4619, -5505, -3638, -12, 2980, 7061, 9428, 8228, 3814, -1292, -5639, -6806, -4136, -1411, -7079, -8595, -7715, -527, -864, 1151, 2239, 2327, -495, 81, -672, -677, 2134, 2554, 5207, 7747, 3130, 1957, 4229, 3453, 1319, -524, 1342, 2709, 711, 204, -4604, -8915, -3368, 638, -4330, -8067, -5457, -4724, -2532, 663, 5917, 9110, 3059, -4875, 841, 3140, 509, 2652, 5847, 2518, -5683, -4315, -2255, -2859, -1618, 3348, 9304, 6343, 3543, 1826, -2224]
15844b224J928L419n08j156p876J198m46K819M469L844j403K348k386o973K558
15829c89j519K843p09m811L3K180l494k918M143PM554J232l396l440m380K151
15813g913L313m266J658L064L47j37l48M178l548n0l106%m54l448m578L428L178
15796h682J041k385M10O364R68q93N73J829k367l454K081N112L94l098o477l900
15780a2484m26K391J876J40K187M928k334l494k469o76K607Q149J839o257j677
15765e700M145K769J957k481j077m412j472l400K067O809j791k69K42j2O8j791
15749d348j869P01Q69L043J489J152p2o81K838j577n721l632K955R21M032P48
15733H48K859L935k221o028k228L043J060j343j841l069k731K38K685J32l319
$$ y = [-2224, -296, 3123, 2615, 1459, -6417, -5219, -5665, -2846, 1623, 5467, 4064, 6412, 4026, -2947, -389, -1908, 935, 226, -4585, -4552, -2372, -5866, -8784, -4641, -4634, -80, 1152, -2244, -5684, -10064, -7913, -4600, -8866, -7208, -4144, -3797, -3934, -4282, -104, -3652, -3702, -6808, -6808, -7262, -10710, -15288, -11860, -8682, -7641, -10026, -9616, -3252, -2284, -3177, -2604, -775, -3142, -6596, -4515, 597, 991, -2107, -8584, -12484, -12910, -10519, -8643, -8503, -6316, -1388, -3722, -7216, -9685, -10361, -7754, 395, 2234, -4023, -5700, -1555, 1214, 3171, 690, -387, -4799, -6271, -9671, -7604, -795, -2586, -2855, -2613, -2625, -2557, -4348, -6217, -5516, -4647, -1604, -115, 1037, 965, 284, 3122, 1545, -4176, -7808, -4853, -3932, 100, 848, 3707, 7642, 5421, -607, -2835, 208, 1268, -75, -1916, -4985, -7716, -7478, -4793, -4661, -7980]
15718g980K86L951J707q149k272M16L087K531L744j142k284Q28j412L029K025
15703a635l2l34j866L1K58k060n252M128J802J220J225K165q5m183k743k97k65
15686g923L147J401L245k108M737J199n097m471j712L890r38p343K106P30m142
15671a3279j819K494J774J800K255k850K24K796J019m112l616N7L879K813M874
15656a691K187m523j731J092j956P5J921L369l83m690k830j026M949K746j318
15641c809m710K146L28K444K582J333J100n330o853o59m27K44J270k542n26L625
15625i784J62P03J670L152N321n201o052R15M51M36J504m94M965L319j568k01
15609g02j034M815l535J770K239K059m903j855q18m481L797j629L191M700M08
$$ y = [-7980, -7694, -3743, -2036, -10185, -12457, -12041, -8954, -6423, -2679, -3821, -6105, -5277, -6689, -3660, -1635, -1667, -2001, -3867, -3836, -3578, -5638, -10890, -6762, -4960, -3740, -2515, -350, -435, -4618, -7361, -7658, -7923, -4776, -3375, -130, -2238, 2499, 3698, -1399, -5870, -7582, -3692, -4630, -11973, -9867, -9137, -13279, -15098, -12604, -10830, -9030, -6775, -9625, -9401, -6605, -5586, -9698, -13314, -13257, -9378, -6565, -1691, 496, -4027, -5758, -4666, -6622, -6547, -4626, -1257, -1640, -6330, -9160, -10186, -5237, -2491, -3809, -8519, -6373, -6045, -3601, -1019, 314, 1414, -3916, -10769, -11428, -11855, -11611, -10341, -12883, -13409, -9784, -9622, -8919, -7249, -4097, 1224, -3977, -10029, -9114, -8663, -8227, -6723, -7217, -2252, 1067, -501, -702, -1736, 3079, -456, 1314, 3553, 5612, 709, -1146, -1964, -6445, -2648, -4277, -1086, 3614, 4022]
15594D022p165l358K86l006J52L691N669p15K302M912l905l321m940k731K919
15579e188O232M579O96k688R23r083n59J805J142K59K307O099M913l098j1022
15564b683o78P270J159l206J88K482M469m44k981J59n203k454p68k40k41J382
15548a789N04J305m643J397P88P52P15j838n135R35J45r12m153L404P52J526M063
15531b184r84R95L131j883O30J515l703m038M090N9M273j271m209l156K190j098
15515e643j192m35Q84j699J264j48m363j306o44K266K616L59P84K253R9k375K694
15498d586l575m61R59J307q46K151J433o97K126k151j58k261l531l946j465J021
15482a4680K03J684k806J740K08O39J278Q139M368m61k871k428R61r41O12M439
$$ y = [4022, -3143, -6501, -6215, -9221, -9069, -5378, 291, -424, 1878, 6790, 2885, -436, -5376, -8107, -5188, 1044, 5623, 6319, 3631, 4554, -4529, -5088, -3283, -2141, -1882, 425, 6524, 11437, 8339, -2683, -3361, 3909, 5068, 1862, 2050, 4532, 9001, 8557, 5576, 5735, 532, -1922, -2690, -2930, -3171, -1789, -1285, 20, -4623, -3226, -2438, -1686, -971, -2809, -7944, -7009, -6864, -7776, -11929, -8525, -7773, -6247, -2184, -3168, -2173, 958, -925, -295, 1220, -2483, -6521, -2431, -2372, 1901, 630, -3579, -6735, -4545, -5643, -6835, -7270, -6386, -8085, -6821, -6969, -11332, -12638, -13282, -11016, -8400, -8041, -7257, -5004, -4905, -7280, -4586, -8161, -8622, -7663, -6356, -7202, -5051, -3618, -4315, -2189, -4340, -4498, -6759, -10290, -14236, -15701, -14680, -14477, -12793, -15599, -13859, -13651, -13012, -11734, -3595, 773, 312, -2559, -4987, -4026, -4967, -4355, 84]
15466H4j479m59j100p27j356J713K893k62k351K454l773l950m92N309J987l431
15450d940k563O17j532j179J734N965M135k163o48L655k282l604r63M751p67l585
15434c369n451p43R17r85J991K670L607k391K668j523o082l344M502J266m001
15419a0268L602J566K296k865L641j291o354J152k226L317L034k17k298L42Q81
15404e688k195k084o24j361R77L531K564Q42l504l430m642n90M335J830J81J98
15388i660j410k100J085k692m644J731N414K125K474k446J480M043k353p833j639
15373a6425ML415K350M383o58l125k142O41M341N47J278M814J447k359k088m281
15357g858m198K485J59j924l58l740n473j853m17K203L660K064J507P966j683
$$ y = [84, -1395, -1854, -2954, -3681, -5037, -3324, -431, -693, -3044, -590, -4363, -8313, -8805, -3496, -1509, -4940, -7503, -6886, -8418, -9597, -7863, -1898, 2237, 74, -574, 3081, 799, -2805, -3768, 983, 216, -3369, -8820, -9563, -8646, -9631, -7640, -4970, -1363, -3754, -1086, -2609, -8691, -12035, -7533, -6267, -10268, -6666, -5100, -2804, -5669, -2028, -3319, -9673, -8521, -10747, -7430, -4396, -4613, -6911, -6569, -5688, -7883, -9967, -10591, -11952, -10975, -7444, -4880, -4038, -7542, -10972, -15614, -16204, -11869, -10039, -9858, -9660, -11070, -13170, -12085, -14777, -19421, -17690, -12276, -10151, -7677, -10123, -8643, -4600, -6953, -14786, -16425, -16421, -13006, -10656, -6273, -6931, -10056, -12198, -11557, -7216, -6669, -5391, -577, 870, -1489, -3577, -7858, -12056, -9571, -9412, -11336, -11694, -15434, -20907, -22760, -23177, -20974, -17314, -15250, -13743, -5777, -7460]
15342g460l379K196m10j103k437j727q33O090N289m877K95L058M938M267O40p376
15326b829m918j200q40l860K933M062P0J285o49l49M682n57r66R13N80K461l25
15309D93L63j480j609K614K251n70Q37j383k05J131l372j14K08L175M326K008
15293H673m571q225p55N41J187k381N6J050rm282j604n220l05K689k84M392L202
15276e846N136n004K286K094m178k270l666k200L050N393n48k690j117J126O63
15261g771O485L218m67m244j348J115m573j970M801J718j011K951m490l393K358
15246f621N49K398Q04M242j971n14R85j071l384j643R54j973k658j576M375q92
15230g996k372K923j297Q37J298j789k603K00J216n46j245O890N525J36l291n397
$$ y = [-7460, -10839, -8643, -9053, -10156, -12593, -14320, -15153, -9063, -3774, -8651, -8356, -5298, -360, 3907, 4547, -2829, -7747, -8947, -9787, -13647, -10714, -6652, -6582, -5297, -5946, -6295, -1613, -2170, -3136, -2223, -1643, 818, 493, 856, -624, -2233, 381, 2632, 2062, 2899, 1516, 1311, 2442, -930, -1044, -836, 2339, 6665, 8673, 4102, -4123, -4878, -4337, -3150, -5531, -5475, -4425, -4434, -8716, -10320, -15540, -15845, -13156, -13440, -9048, -5846, -710, -5714, -3428, -1334, -5512, -7782, -11448, -13648, -10598, -5205, -5753, -8443, -9560, -8434, -7771, -1286, 1932, 1465, -2779, -4127, -3012, -7585, -9555, -4754, -3036, -4047, -1096, -5586, -8979, -6621, -6072, -3674, -2870, 1372, -599, -1113, -128, -1199, -4583, -6226, -5272, -7245, -9903, -11479, -7104, -7996, -10368, -7445, -8742, -7905, -6607, -8396, -10999, -10799, -9583, -10129, -11374, -4484, 1041, 1177, -2114, -7511]
15214g511l424K652K049J614N018j962k64k51n84L519K493K080m345n825j280
15199f021L435m464j565k393m831k032Q845M926o00r938j393K156j657p58J471
15184a4819K529j140N2k036k233L683J615R97L074r73j012o248m73K161o157q17
15168b1797K548j128M195K475l665J949p1l112M431P182K343l947o098k03L298
15153a1600O817L646P98j29j61j04m437j442M47L7M8j878l643m135j887L833J412
15136a2378L638K124q73L219j159j175l265j054J860K401l132j435M618O013K968
15121B370k888l557J80N72q08l99o540J331J899M186k510J566L100J413L52j801
15105a534L366K151o65J382K165k204n018l668J951K511M077k155l320n405m749
$$ y = [-7511, -10935, -8283, -6234, -4620, 398, -1564, -1828, -2079, -2663, 856, 3349, 5429, 1084, -4741, -6021, -2586, -7050, -8615, -11008, -15839, -17871, -9026, -4100, -4700, -14638, -16031, -13875, -15532, -16290, -14819, -12290, -13430, -13378, -15414, -17647, -13964, -12349, -11352, -8278, -9251, -10263, -16511, -16984, -14823, -20980, -21797, -19249, -20377, -16182, -13707, -17372, -15423, -15494, -18606, -14175, -6993, -4650, -8597, -14695, -14898, -11600, -4783, -1137, -339, -468, -629, -733, -5170, -6612, -6165, -6128, -6080, -7958, -11601, -15736, -17623, -13790, -12378, -8740, -6616, -7489, -4270, -5429, -6604, -9869, -10923, -9063, -6662, -9794, -11229, -6611, -598, 2370, -518, -4075, -3895, -3323, -4131, -4530, -11070, -9739, -7840, -3654, -6164, -4598, -1498, -85, 267, -1534, 1832, 3983, 3318, 4700, 6865, 4661, -357, -4025, -2074, 437, 4514, 2359, -961, -6366, -11115]
15090a1115k849Q62M210L24K812j140l912J800l858l932M836L115k821k123L335
15075a0456L583m62J445J757k214K037K079K355J706m118n181K501p84O70j779
15060f861o54LJ680J130j941M685p66K947K280j801n764m789m248k165l05j290
15044a7859l105M084q81P709O286j316J967K256l443m66l153m731N762L209o259
15029i940p4n21J689J960L543J255r01j957m686q56M986J514m11K080j04n501
15013g924K010K60m104k402K390L246K556k511N75L270J779K277o468m870l210
14998a3126k306Q93J859M827L045J410L802K09o014n97j937k506j377J850K532
14983g436J11m231j666K9P53L02k705j568n15O014L864k583j592O346j198j754
$$ y = [-11115, -13964, -13102, -8892, -8568, -5756, -6896, -10808, -9008, -12866, -16798, -11962, -8847, -11668, -13791, -10456, -6873, -7335, -5890, -4133, -6347, -4310, -2231, 124, 1830, -2288, -7469, -4968, -5752, -5082, -6861, -7515, -7512, -5832, -4702, -6643, -1958, -2724, 223, 2503, 702, -5062, -9851, -14099, -16264, -16569, -17859, -20964, -16880, -17761, -10052, -3766, -5082, -3115, -859, -4302, -4768, -7921, -12652, -6890, -3681, -9940, -10014, -10535, -8846, -6886, -3343, -2088, -2989, -4946, -9632, -10488, -5502, -3988, -4399, -2319, -2423, -7924, -5914, -5654, -9758, -12160, -9770, -6524, -3968, -6479, -5904, -2634, -855, 1422, -5046, -9916, -13126, -15432, -14539, -12680, -7853, -4808, -3398, 404, 613, -5401, -5998, -7935, -10441, -11818, -9968, -7436, -7325, -11556, -13222, -13193, -12440, -12138, -14843, -16411, -16926, -10912, -7048, -9631, -11223, -4877, -6075, -7829]
14967g829K372M033M27l852k449n8M774M296m811q752k544J457K389N379l720
14952h888N23K273l082k593k573L433j315m81J274k681L122O104J007o073l392
14937a3342P08K796K841j674m193m391q06N193Q3l116K359q98K11Jk39Q63p15
14920a4319r7M514L05K701L179r41j237k134o882n208L253P146K065k058J048
14905h665J787K335l127j072k371o78L205j827M337R22L686k30k378j584j969
14890g629K209O98P15M536J656j633k183l310o343j081P22p96K359J443j554l250
14874a3441J948k409l61J011l323k951m69O47K180J887K101L660J306k25J146
14859g293k227M605J601q76j368N008J302n352o754k120l12m34M269M348N45m81
$$ y = [-7829, -5457, -1424, -997, -4849, -7298, -7356, -2582, 1714, -3097, -11849, -14393, -12936, -10547, -5168, -8888, -8365, -6092, -9174, -11767, -14340, -10907, -12222, -12703, -11429, -14110, -10988, -4884, -3877, -9950, -13342, -12634, -9838, -6997, -8671, -12864, -17255, -18061, -12868, -12785, -15901, -13542, -14440, -14229, -14228, -14467, -13604, -14319, -14416, -9902, -9597, -6896, -3717, -4658, -5895, -8029, -14911, -20119, -16866, -9720, -7655, -9713, -8665, -6878, -4543, -7670, -8742, -11113, -11791, -8586, -10413, -6076, -5154, -1468, -1698, -4076, -5660, -7629, -5420, -4722, -4007, 529, 2185, 552, -1631, -4941, -11284, -12365, -11643, -12439, -10080, -8637, -10191, -13441, -11493, -13902, -14263, -13252, -16575, -19526, -19995, -19348, -17168, -15281, -13180, -9520, -8214, -8439, -7293, -9520, -4915, -3314, -4190, -5558, -550, 752, -4600, -11354, -13474, -13786, -14220, -9951, -5603, -5058, -5539]
14843e539m538o106K681O065m482j985J50Q64J861j922k020R30P098m733n397
14828a7073L600N385m497n479J725L095j868M803N905l140n630p28K376K0m173
14813a5679K456N108l34j6J348r74m805l208O01K551l68k206j942L695L605K105
14797h063m433J918J45J700j604M419J564m283j352j216P24k070l493L72M201
14782a1471r91N488K753n845P82k644k79K081j214k222M08L579j447j471L095
14767i398j946P26k237p59k408m46L056P24r36N848O305j839p49r79k254L792
14751c500R84k153L15o43l834O35k964R37k128K075n7k413o56J724L057K020N004
14734a597l031n58K756L401l769l335j69j777j946K39n972m174J294O73K14N776
$$ y = [-5539, -10077, -16183, -13502, -7437, -11919, -13904, -13754, -12890, -11029, -12951, -14971, -14041, -6943, -11676, -17073, -13473, -8088, -12585, -18064, -16339, -13244, -15112, -10309, -4404, -7544, -13174, -13902, -11526, -11506, -15679, -13223, -8115, -8449, -8465, -7117, -8091, -12896, -16104, -15503, -12952, -13320, -15526, -17468, -13773, -10168, -8063, -12496, -10578, -10433, -8733, -10337, -5918, -4354, -8637, -9989, -11205, -10481, -12551, -16044, -15672, -11471, -12462, -6974, -4221, -10066, -9284, -11928, -12207, -10126, -11340, -13562, -13154, -9575, -11022, -12493, -9398, -11344, -10618, -12855, -13614, -16022, -16468, -13412, -12688, -13624, -7776, -1471, -3310, -4059, -5038, -7292, -3500, -2516, -4669, -4354, -4997, -8831, -8196, -11160, -10223, -12351, -10276, -10333, -12746, -13402, -11678, -8621, -6601, -1597, -4628, -5186, -2430, 971, -2798, -6133, -6302, -8079, -10025, -9786, -15758, -19932, -18638, -17965, -17751, -11975]
14718a1975M365O625K915j682k205p770n796M103Q01j170N46J457K925J564M75
14703d822k665k745l41L990j650m492K270L592N944J111n260j552j696O189O24
14688a503j400n657k206K432m69o518m995K239J788n568J33R375K599K137m003
14673a1616m832j45k12K040k299k655R646L614J482N90j403l192m950L498J670
14658h764K393m65n708k861O853L978P42l047m920K356O852L108k794l891M45
14643e723k543j597j319K85J456J063K287k214J577K859k12J254k996l41j735
14628g899k733j560j23l649j614n11O280O995j926K494K890q14N919K530r246
14613b967n739k731J354J483l4k344q32j820L350L167j96o0K251L158k72l887
$$ y = [-11975, -7610, -985, 1930, 248, -1957, -9727, -15523, -11420, -10619, -11789, -11243, -9786, -6861, -5297, -4822, -7487, -10232, -10573, -6583, -8233, -12725, -10455, -6863, -919, 192, -5068, -6620, -8316, -2127, -1503, -2903, -8560, -10766, -8334, -8803, -15321, -20316, -18077, -16289, -21857, -21724, -12349, -9750, -7613, -11616, -16448, -16593, -16805, -14765, -17064, -19719, -10073, -6459, -4977, -4387, -5790, -8982, -13932, -10434, -8764, -6371, -6836, -12544, -15405, -8552, -4574, -3832, -6879, -11799, -9443, -2591, 517, -2277, -6168, -5723, -8266, -9863, -11182, -10897, -9441, -8378, -6091, -8305, -6728, -3869, -4081, -2827, -5823, -6164, -7899, -10632, -12192, -12315, -15964, -17578, -18089, -11809, -4814, -6740, -4246, -1356, -2170, 3749, 6279, -2967, -8706, -11437, -10083, -8600, -8634, -10978, -11810, -13630, -10280, -7113, -7309, -7369, -5118, -1960, -2232, -6119]
14597f119l870K045L82J774O223L436n810j915K548Q068J512m036j505m02n11
14582A820j47P600j394l305n085n847p275N034J276k03l308M506p77k203k983
14567a2291O74N35K007K17j168l943j362k537L75K388P502K857l517l866j166
14552a3295L872J388j645j216M838L427l176J284l52n202k32J210K392K679j72
14537d200n680m472O961J054p868m169n516K680L378N028l60L911K463l443L081
14522g152L067j741p541j944q76m851J252O980K101N58R81N119n406m764N37k85
14506a3965j903n160J548J849R71K503K698j274r4M322J310K548j322m297Qn88
14490a0846L021N752k331J488l374j216k842l524N198l15O9J24j760O776N27k414
$$ y = [-6119, -9989, -7944, -7562, -5788, 435, 3871, -1939, -3854, -1306, 6762, 8274, 4238, 2733, 2331, 1820, 1673, 9273, 7879, 4574, -511, -6358, -13633, -8599, -7323, -7526, -10834, -6328, -7105, -9308, -12291, -11617, -11082, -9075, -8858, -10026, -13969, -15331, -17868, -17493, -15105, -7603, -4746, -8263, -12129, -13295, -9423, -8035, -9680, -10896, -6058, -2631, -5807, -4523, -4875, -10077, -10309, -9099, -6707, -4028, -4200, -9880, -14352, -7391, -6337, -14205, -18374, -23890, -21210, -17832, -12804, -13164, -9253, -6790, -10233, -7152, -4085, -5826, -13367, -15311, -16187, -21038, -19786, -12806, -10705, -10147, -9166, -4047, -9453, -14217, -13680, -13965, -15868, -21028, -19480, -17631, -16660, -14157, -11459, -12733, -12827, -8505, -7195, -4647, -5969, -10266, -10258, -10846, -7825, -2073, -4404, -2916, -6290, -7506, -10348, -13872, -8674, -8989, -8920, -8796, -10556, -3780, -3253, -5667]
14474e667j014K213k32j029K579l283k260n25k438l648j592J987p52L353K237
14459a0071j617k596l880l500K085M244k807k347M356J634J261j50M606J693j206
14444h295k45P03o58J275m26J156lm383n43L50J297j521O16k420n55L167J215
14427i270K456L492J476L398k61p607J326O11l034K137j88j045k944r72L05K792
14411g328L878J233R07k801p943j951l487O022N444o14m511j899o4N677k261l576
14395a3274J954J388L594K396k649L172j862j705j533k536Q0j93M338R524O428
14380I122p21P81m161l135J394O44q05P01k477M886J391j097M520j499j582K527
14364A0489j474r069n661K933P40K028M562k15k034n18J242J262n9J348j352j039
$$ y = [-5667, -6681, -4468, -4700, -5729, -3150, -6433, -8693, -9218, -11656, -15304, -16896, -14909, -15661, -12308, -10071, -11688, -14284, -18164, -21664, -19579, -15335, -18142, -20489, -16133, -14499, -13238, -13388, -8782, -7089, -8295, -8540, -7837, -8495, -7220, -7646, -6490, -6493, -10876, -11419, -11069, -9772, -11293, -10677, -13097, -13652, -10485, -9270, -6814, -3322, -1846, 1552, 1291, -6316, -4990, -4379, -7413, -5276, -5464, -6509, -9453, -10425, -10120, -7328, -3450, -2217, -1310, -4111, -12054, -14005, -17492, -11470, -6026, -6640, -11151, -13050, -13114, -7437, -9698, -13274, -11320, -9932, -6338, -3942, -6591, -3419, -5281, -6986, -8519, -11055, -10975, -11168, -6830, 2694, 9122, 8401, 9182, 5021, 1886, 3280, 3924, 3119, 3820, 1343, 6229, 7620, 6523, 11043, 9544, 7962, 10489, 9015, -54, -5715, -2782, -2042, -14, 4548, 4333, 2299, 1781, 3023, 4285, 4226, 5574, 4222, 3183]
14348C183p25K97K717k575j255J716L139n89J678k220R09l139m101k290n448j086
14332i789J491J161O131M710l404j565M837Q68k211l076L73J752J495o52M103
14317F224l46J241M913N51o334r707K036J822K190K225m243J333k46R86J653J422
14301E720l83l472O7L754n165o061m683j134L435l53N06J417M681r18o816L34
14285i071m138m916O913Q822m503k749O469n161o560r21j892j692m478K025N662
14270a6190Q834L449k655l224K279L714k149J202J743j752o965j555N211J456
14256f602k480P75q44j156j154J369L51l261l726j26K908K238K76j184K978J971
14240g667L2j383r47j278J87j515m950o25M883P850n40j126J63l592m135K011
$$ y = [3183, 2458, 2755, 5472, 2897, 1642, 3358, 6497, 5908, 7586, 5366, 6275, 3136, -965, -3255, -8703, -9789, -8298, -7137, -1006, 3704, 300, -1265, 3572, 4440, 2229, -847, -474, 1278, 2773, 2121, 6224, 5878, 7119, 12032, 12583, 6249, -3458, -1422, 400, 2590, 4815, 572, 1905, 1659, 2645, 4298, 5720, 5337, 1865, 1932, 5686, 521, -5540, -10223, -11357, -7922, -8275, -7769, -6352, -1671, -2589, -9405, -9071, -13209, -18125, -11212, -2390, -6893, -9642, -3173, -8334, -14894, -15815, -17707, -19399, -23877, -21852, -16190, -7356, -3907, -6562, -9786, -7507, -3793, -5942, -4740, -2997, -4749, -11714, -13269, -8058, -6602, -9082, -8307, -9151, -10307, -11461, -10092, -9741, -13002, -16728, -16854, -13946, -11708, -11432, -12616, -9638, -7667, -7635, -9018, -9965, -11243, -11056, -12571, -17521, -18146, -13263, -5413, -5953, -7079, -6916, -10508, -14643, -12632]
14224a2632Q042J600m806o541k09M130l97K17j939m942m253l491N94M306k310
14209b2631R12M782k528P72j053j427L702J567m06n241p50R6p97Q58L95J687k19
14192b0281J11K95j477J524L083M834O829l48l49m687k794K681K723J171K6j205
14176g864p936m462O386K583K388J821n076r68K194j265j177n689K386P555J103
14161h021l811L393J289m588L877o66j393N04Q994N493l976N575Q162M085j279
14146A7638m35k475m1m451k067j742m066r97l55l187o238k714J315J67O182N233
14130A767J053p369o070J826O03K142l189l658J615Q087K381L60n433o456k727
14115a5068k500k235L39L077L308J597N66j508k236k737q94J353M946Q364J711
$$ y = [-12632, -4590, -2990, -7796, -14337, -14546, -10416, -10813, -10596, -12535, -17477, -21730, -25221, -24627, -20321, -22631, -21719, -16937, -19465, -18693, -19746, -21173, -17471, -15904, -16310, -21551, -22301, -22205, -23002, -22144, -21749, -20062, -20281, -20170, -19875, -21352, -19828, -16745, -11911, -5082, -5430, -5779, -10466, -13260, -10579, -7856, -6685, -6659, -7864, -15800, -20262, -13876, -11293, -8905, -7084, -12160, -13128, -10934, -12199, -13376, -19065, -16679, -9124, -8021, -11832, -8439, -7150, -11738, -7861, -8527, -9920, -9416, -422, 5071, 1095, 6670, 14832, 18917, 17638, 17203, 14728, 14687, 10236, 8169, 6427, 2361, 1364, 1009, -2178, -8416, -11130, -9815, -9648, -3466, 1767, 2820, -4549, -10619, -8793, -8190, -6048, -9237, -12895, -11280, -3193, -812, -452, -5885, -12341, -15068, -17568, -19803, -19464, -16387, -13079, -11482, -10916, -12424, -14660, -17397, -18291, -16938, -11992, -3628, -1917]
14100a917k075k037m487J497J690l428l371k24k297k81L764J989O59l120k570
14085a6208K776K055M67J202Q9j040j560j05l017L79J224j734K205M194K373m263
14069a0963J55N617r26m112N60k281K783K585m922l052R64l425J799L749L31l93
14053a1531m929n463J474O039L580l403o76r70n424L65P173J257n97M006L084
14038f015j719n244n953q35J88L59K061O73N07M660L550L750l564p578l017J16
14022a8061j995o04l224k658L476J871K611P271j844K17j205L53L618q09M51l690
14006a4222n823n34l6j496K877J960l82O041L155J467m18m789L245j01j536m196
13990a4788m16N460J226M36l881j351O55L835l261q604l458O358L738j074j798
$$ y = [-1917, -3992, -6029, -10516, -9019, -7329, -10757, -14128, -14352, -16649, -16930, -13166, -11177, -10518, -13638, -16208, -13432, -11377, -10910, -9708, -9619, -10659, -12219, -12324, -15341, -14962, -13738, -15472, -13267, -9073, -6700, -10963, -10808, -5191, -6117, -10229, -9669, -11950, -9167, -6582, -11504, -14556, -13592, -17017, -15218, -11469, -11138, -11531, -16460, -21923, -20449, -14410, -10830, -14233, -14909, -15879, -21303, -20938, -13765, -12508, -13105, -9099, -6015, -7734, -12978, -18931, -19766, -19578, -19219, -17158, -16485, -15978, -11318, -7768, -4018, -7582, -15160, -18177, -18061, -20056, -20660, -23884, -26542, -23066, -21195, -18584, -11313, -13157, -12940, -14145, -13792, -10174, -10983, -10532, -14222, -20045, -20579, -20615, -22111, -19234, -17274, -17656, -11615, -8460, -6993, -7411, -12200, -8955, -9056, -10592, -14788, -15204, -9744, -8518, -8082, -11963, -13314, -12659, -8824, -12085, -20689, -24147, -17789, -14051, -15125, -16923]
13975a6923J961l768l090K056J538L072n61m05O934k295j47k462m806j077J484
13960a8489L612R51k156p23L647L146M5j553p90J00J261k793j56O90L25k862M143
13943a1602k928q960L392N758L787j154l37K850k878j715k840m48p88o55N000
13928a3518M54j53m687o301q71L451L973k762j093J840P667M794k494Q38m02j816
13912a1080j099k65K65k270r40l439L271Q169J223m060o815n08n13p92j361k065
13896b2279m49P077M728k073o139r06J888J244j537l72q79L371M029j134l21K223
13880a1529K64m369m086P90K558J51K931Kl310m646k535P074K595J580j102m785
13864a8417p62K479m071j251N215o251l122M216K323J288m228J48J921m76M792
$$ y = [-16923, -14962, -18730, -21820, -19764, -18226, -15154, -15715, -16120, -9186, -11481, -11628, -14090, -18896, -19973, -18489, -14877, -13926, -16082, -16805, -13158, -10012, -9967, -11520, -12310, -12210, -10949, -13742, -13898, -13208, -12883, -15745, -11602, -14530, -23490, -20098, -14340, -10553, -11707, -12044, -9194, -12072, -13787, -16627, -17075, -17863, -18518, -13518, -13064, -13217, -17904, -24205, -25076, -21625, -17652, -20414, -21507, -19667, -12000, -7206, -9700, -8862, -9264, -11080, -12179, -12444, -12179, -14449, -15389, -18828, -15557, -7388, -6165, -10225, -17040, -17548, -18061, -18853, -20214, -22279, -22728, -15651, -10923, -12996, -19135, -20041, -18153, -16909, -18446, -18818, -19697, -16326, -12297, -13431, -13752, -11529, -11265, -15634, -19720, -18930, -16372, -16221, -13290, -13288, -16598, -21244, -23779, -16705, -14110, -12530, -13632, -18417, -19179, -16700, -20771, -22022, -16807, -23058, -26180, -21964, -19641, -18353, -22581, -22433, -20512, -20988, -16196]
13849a6196q57j1K94l198m30N705K378k195j892o1L33M229J613M429K299o267
13833i827n377l894j424K409j221l635n060K334M409L96K011O390p4n85J220k906
13817a4834p688K954J711j8k626R77N368N873R58o71L8J697K689q75o232m789
13801a5468K479J832p73N22J282J429p79J149o78m091J331J606K718M857k241
13786d825j639J29J685M096M254L17j170J575j404j389k48m057J280R80l628r463
13770a3507K604L255L912k597l529j428Q93L162k738m011r87K961m76j324k753
13755a6563m756j841J95J084q14L443J510J060K526k63m298k964K149J114j633
13740b0051j13k507r08K833J556l904j643K79p9K957J734K62k940K421P355j858
$$ y = [-16196, -17053, -17064, -16770, -19968, -20398, -14693, -12315, -14510, -16402, -16463, -16130, -11901, -10288, -5859, -3560, -9827, -15204, -19098, -20522, -18113, -19334, -22969, -28029, -25695, -21286, -20890, -18879, -12489, -12563, -13148, -11928, -14834, -22522, -19568, -17857, -17875, -20501, -19524, -14156, -8283, -7325, -7996, -7958, -6261, -3572, -4447, -10679, -15468, -12989, -11157, -11930, -11408, -10126, -8697, -9476, -8327, -9005, -13096, -11765, -10159, -7441, -2584, -4825, -6464, -6335, -4650, -554, 3700, 4017, 2847, 4422, 3018, 1629, 1381, -2676, -1396, -416, -4044, -13507, -10903, -7648, -3736, -6333, -9862, -11290, -10397, -7235, -9973, -13984, -14971, -12010, -12486, -13810, -16563, -21319, -23160, -22965, -21881, -22695, -19252, -17742, -16682, -14156, -14419, -18717, -21681, -19532, -18418, -20051, -20164, -22671, -23579, -20746, -19190, -23094, -24737, -24458, -24537, -21580, -19846, -19584, -22524, -20103, -12748, -14606]
13724a4606l869J767l492l290R2K523M244q57l149L445J657l50M15q49l42l037
13708a9698L33J414M520K001j851m241O3J1948K508p980m769m27K633J487j28
13693a2187q41M7j656l872K438P001K917j470k796k943l58l558L073j466j097
13678a6768m434K026Q41L968M736m771m127m288K257K663J241n489m090K107Q083
13663a6045Q7j697J023k675q33J791O5l5N544J111K859j003o527k064J207M382
13647a2810m184m248J330L101j41N08j126m137K865J232L341J578j603m611j287
13632b0192J65J610M619M61j01J656l24l30J986k09J241K034J32P83L75l162n188
13615a4444j805K37q31j505k464j973J049L221K648J493O15l132K904j633n75
$$ y = [-14606, -18475, -16708, -20200, -23490, -23398, -20875, -16631, -17488, -20637, -17192, -15535, -15885, -15470, -16319, -16661, -19698, -19365, -17951, -13431, -11430, -13281, -17522, -17459, -5511, -3003, -10983, -15752, -16179, -13546, -12059, -12187, -13028, -12981, -14637, -18509, -16071, -9070, -6153, -7623, -10419, -13362, -13720, -17278, -14205, -15671, -16768, -21202, -19176, -18335, -14367, -9631, -14402, -18529, -22817, -20560, -17897, -16656, -22145, -26235, -24128, -16045, -15958, -17655, -16632, -19307, -20140, -18349, -18284, -18319, -12775, -11664, -8805, -9808, -16335, -18399, -17192, -12810, -16994, -21242, -19912, -16811, -16952, -16444, -17570, -21707, -18842, -17610, -14269, -12691, -14294, -18905, -20192, -20027, -18417, -13798, -13337, -13438, -11782, -12106, -12436, -10450, -10659, -9418, -7384, -7252, -6469, -6094, -9256, -14444, -16249, -16012, -16843, -18348, -20812, -22785, -21736, -18515, -15867, -14374, -13759, -16891, -13987, -15620, -16195]
13600a6195k506j819j745J536O73M616L774L301K143J496j825m248O27m38m167
13585a4777n419J212N361l018P83K509N77o14K495M35k854n104J939j376k545
13570b0396k154l156K800O482N791l854p648m767j940j109l07M340L521N599M609
13555a2189q81L50l549J042L386k164M586J054l379q418l014N849K041l311o49
13540a9246k184l1k809N57K676Q58P91L453K034n323K683K19k214L177K835m27
13524a2951l405K723O62m329j226j559n90J594M740K032m700n060K653L809J120
13509a4487M090L79L18J778l093o286J203P155l47k469k597O54j071j584L440
13494a2917r65M50j817K591J451o76K049L39K302J87l090q57j848n114l201p07
$$ y = [-16195, -18701, -20520, -22265, -20729, -20056, -15440, -11666, -8365, -6222, -4726, -6551, -10799, -10172, -10610, -14777, -20196, -18984, -13623, -16641, -15858, -13349, -12772, -13386, -10891, -10456, -13310, -18414, -16475, -17851, -20396, -22550, -25706, -22906, -16424, -10633, -14487, -22135, -26902, -28842, -29951, -30258, -25918, -22397, -16798, -12189, -13070, -12720, -16269, -15227, -11841, -14005, -9419, -8365, -11744, -20162, -23176, -17327, -15286, -18597, -19246, -21430, -21461, -24270, -23713, -21037, -20179, -19388, -15935, -13901, -19224, -16541, -16322, -18536, -15359, -12524, -12951, -16356, -13633, -12971, -17300, -18526, -20085, -20675, -19081, -14341, -12309, -17009, -22069, -19416, -15607, -14487, -10397, -10018, -9700, -7922, -11015, -17301, -16098, -8943, -9290, -11759, -14356, -13702, -14773, -16357, -12917, -13882, -13432, -15249, -12658, -11207, -11883, -9834, -9495, -7193, -7006, -10096, -10953, -12801, -17915, -21116, -21823]
13478b1823N13j162Q434M842m484k047K213K825l479m654j539J89M871P530k507
13463a0278p04j092j280m264L896N606M164j400k702n776m071p735k844J378P166
13448a9936K078L563j024l663l492K053K542k678j343j102k10M64q6K362m29j02
13432b1003N577P321l552o062J319k226m27j591K088K248O07j068J491L213J415
13417a0650l110k466K147J340j405k949N155o19n098J743M57r72O09J227K101
13402a2490M14N67O04m149q045P66P851j571L786M181l188m804k796j073Q78K31
13386a8838M332l688L65j18r92j831L941M286J556l782l052O031N422M791l456
13371e033K064q93k501l072n329k909M216L315J059j146j718j386j592j583N924
$$ y = [-21823, -21310, -22472, -14038, -9196, -13680, -15727, -13514, -10689, -14168, -18822, -20361, -20172, -15301, -7771, -10278, -10982, -12074, -13354, -17618, -13722, -8116, -3952, -5352, -8054, -13830, -17901, -25636, -28480, -27102, -19936, -17858, -14295, -15319, -18982, -22474, -20421, -17879, -20557, -21900, -23002, -23212, -22748, -22834, -20472, -20901, -21003, -15426, -8105, -11657, -17719, -16400, -18626, -19053, -20644, -18556, -16308, -15701, -16769, -15278, -12065, -10650, -13760, -16226, -14079, -12739, -14144, -17093, -11938, -12557, -17655, -15912, -15455, -16427, -15818, -14591, -12490, -12076, -11509, -10905, -15054, -23099, -22333, -14482, -16053, -12267, -8086, -11274, -16078, -18874, -19947, -19069, -18838, -14506, -18194, -17829, -17947, -18939, -20770, -16829, -12543, -10987, -14769, -17821, -11790, -6368, -1577, -5033, -2969, -3862, -6363, -9435, -14764, -17673, -13457, -10142, -9083, -10229, -11947, -13333, -14925, -16508, -10584]
13356a0584P04l144n299k472J664R73k594J066M41K553K025Q69j09k35l478q8
13340a7708J478k149J33J178p04M820L091J094k191j522m19n358l297K391L452
13325a5711l344L10O09L951J163J522l880j302P00K087M32K641n5n17m43n91O050
13308f378J529K399K337j274J554j166R91l53j543L117K239M067o79k543J201
13293E498l197k61L369k852j432M17j366j817k78j806k695J575N747O399L540
13278A0841o4r25m446N7l781k895k968M719L332o413p409l065P43K08J271l794
13262a4589j884J794l86k673N140M8j859O749M248l956j845K23k744o36M616N127
13246b627L48j254P97M79j804O201N017m24k025o14j066k402j25l842n985j839
$$ y = [-10584, -9880, -13024, -18323, -20795, -19131, -18158, -20752, -19686, -19245, -16692, -14667, -13798, -13907, -14142, -17620, -17708, -16230, -18379, -18246, -17068, -17772, -12952, -9861, -8767, -10958, -12480, -12899, -18257, -21554, -19163, -15711, -19055, -18745, -18136, -14185, -13022, -11500, -15380, -16682, -15982, -13895, -13463, -10822, -10877, -11394, -11837, -12428, -6378, -4849, -2450, -113, -1387, 167, -999, -8, -361, -1904, 1213, 3452, 7519, 6840, 4297, 5498, 2301, 2040, 5409, 2557, 1125, 1542, 176, -1641, -1919, -3725, -6420, -4845, 902, 7301, 10841, 10777, 9852, 5406, 5463, 1682, -1213, -4181, 538, 3870, -2543, -9952, -13017, -12274, -12066, -10795, -14589, -16473, -14679, -15065, -17738, -12598, -12550, -14409, -7660, -3412, -7368, -9213, -8990, -11734, -12370, -7754, -2627, -2279, -3533, -2736, -2257, -4061, 2140, 7157, 6733, 4708, 4094, 3028, 626, 501, -3341, -9326, -11165]
13230a1165M23K347L917JL737l064r548n355K137L133J746J551j490m153m402
13215b0185R7M608L120j377k753j056L381L479j258p209J792K532J769p78m920
13200a8758K311J071m309l301k14N013O716L188o59l915j054l42P946L666R51
13185a690O38O23J579j792o422k939N10L262R35j864m797J616N965j457k57k955
13169i045K761k613j814O320l900k204J299K233K879K973K084n38O33J637J793
13154D498n49j493l958n928J030M659l65m567o904m342K72J874M999O268J68j399
13138e737jk840L633L508J488k086o199J231R62N93l832r40J069K56J54L369J852
13121c520k56K812O13J058N394k055j330Q18L559J1667J1538P025K317K366j317
$$ y = [-11165, -10742, -8395, -4478, -4477, -740, -3804, -13352, -18707, -16570, -13437, -11691, -10140, -11630, -15783, -20185, -20088, -15480, -12360, -13737, -16490, -17546, -14165, -10686, -11944, -19153, -17361, -14829, -13060, -13838, -18758, -16447, -15376, -19685, -22986, -23200, -18187, -11471, -8283, -8942, -12857, -13911, -14253, -6307, -2641, -1690, -1052, -429, 1150, -642, -7064, -10003, -9493, -6231, -5296, -7160, -11957, -10341, -4376, -5833, -6090, -9045, -6284, -8897, -10711, -4391, -8291, -10495, -9196, -6963, -4084, -1111, 973, 435, 1068, 2705, 4498, 3949, 2456, -1502, -7430, -6400, -1741, -2106, -6673, -13577, -17919, -17647, -15773, -10774, -4506, -4338, -5737, -5738, -8578, -4945, -1437, 51, -2035, -8234, -7003, -6041, -5448, -9280, -10220, -9151, -8895, -8741, -5372, -3520, -3776, -964, -351, 707, 6101, 4046, 2716, 3534, 7093, 18760, 30298, 37323, 39640, 42006, 40689]
13106D0689n440n371p272k971k87j501l944k456k769p218l50M89j480P34J034
13091A887l32P86j135m918m209k677K428K630J482L783M159K480p467m241n26
13076e870M692M336J23J311O833Q677R953N510P350J5334L0168K4596J3415O755
13062A33183J881m367j7375k5977k2576j7507j0002j0241j0734p350m178m090
13050F67n61k846m427M22L883K175m36n858J479M549N026l29j928n101o520N75
13034i230J2593R38m960l18M685J035l442j236N876P686Q673P990J1555K3068
13020F4913K7830K1770J4614M086k411j6659k7326k6986j8174j4021j9293p690
13008F53K596L613l55p045m037m876M659K429L971j90n192k858M096j348J829
$$ y = [40689, 35249, 29878, 22606, 19635, 19348, 17847, 13903, 11447, 8678, 1460, 1110, 1599, 119, 853, 1887, 1555, 2341, 1206, -3712, -7921, -10598, -8170, -5540, -4058, -275, 3884, 6364, -1103, -5344, -5870, -1178, 3158, 3281, 4592, 11425, 20102, 30055, 35565, 42915, 58249, 88417, 113013, 126428, 133183, 135064, 130697, 113322, 87345, 64769, 47262, 37260, 27019, 16285, 8935, 4757, 667, 106, -2740, -7167, -6745, -2862, -687, -1123, -6981, -5502, -953, 4073, 3744, 1816, -3285, -9805, -9230, 3363, 4301, -659, -977, 3708, 4743, 1301, 65, 5941, 13627, 22300, 30290, 41845, 64913, 92743, 114513, 129127, 133213, 130802, 114143, 86817, 59831, 41657, 27636, 8343, 653, 3249, 6862, 6507, -538, -4575, -9451, -4792, -2363, 1608, 1418, -3774, -6632, -2536, -3884, -2055]
12993b055r6j030N72L104k275k752n724j002M026N154J770K130m931O40q37N285
12977A979J2536O273Q163M622J861N504K762m557r031q813q026q138r559j523
12963e947l57J838M65j236P44N12j081R08l288o586M017M422O36L675j508j826
12947d612o904k444j40l14j288j150j898L59N570N33j405L435k608j175K145j157
12931a3053M254p28M44K945j596K858L140p197l721l672p93K640k218K082O033
12916h582M960l563m793m287l870K493L97P56k468L42j82J125k688l583k448L820
12900b2571m496k666O342J563k789j152o50L79N483L245j156l712M98J284K742
12885a7656K215m54j709o69j786l854L930k6K748j230J796M69N202N58j708j053
$$ y = [-2055, -2151, -3181, -2609, 495, -1780, -4532, -10256, -11258, -7232, -2078, -308, 1822, -3109, -2469, -3306, 1979, 14515, 20788, 28951, 33573, 35434, 40938, 43700, 39143, 30112, 21299, 13273, 5135, -4424, -5947, -6304, -4466, -4001, -5237, -4493, -3981, -5062, -4154, -7442, -14028, -10011, -5589, -4953, -1278, -2786, -4612, -11516, -13960, -14100, -14414, -15702, -16852, -18750, -18391, -12821, -12288, -13693, -10258, -12866, -14041, -11896, -13053, -8799, -9527, -9083, -6138, -7734, -4876, -1736, -8933, -12654, -16326, -17119, -14479, -16697, -14615, -8582, -3622, -7185, -11978, -16265, -20135, -17642, -17245, -16489, -18957, -18615, -18797, -17672, -20360, -23943, -26391, -22571, -27067, -29733, -23391, -21828, -24617, -25769, -26419, -26040, -20557, -17312, -18468, -22180, -21682, -20398, -17656, -15441, -15895, -17604, -18273, -20059, -23913, -19983, -20009, -17261, -18491, -16695, -16226, -11024, -10466, -12174, -13227]
12869a3227K437K249K053M528N254L874M572J1980J1776J4126J2983R102J9733
12856I1440L0470L3253M6079P5913J22404J60724J84037K19371J93508J50338
12846A307537J38259Q4765L8110K0253P725l8184o2181j09041j55850j81904k05668
12835H43821j80737j52760j21054p7625n6044l9998k8729j8261j4609j8583j0983
12824A24438m129q620j1335j8010j3801k598l882m086n010n232J734k802m367
12811D2300r739r151o85L440J11q441l020k384n087L796N534m056m7n81K558o27
12795A3921L81O183O90j44j150j696k115J054j054k453l074p965o974o348O90
12780a0054L973K483K741k362M1k340K64k342J235m819j988K539K945K044K78
$$ y = [-13227, -10790, -8541, -6488, -1960, 3294, 7168, 11740, 23720, 35496, 49622, 62605, 71707, 91440, 121910, 155163, 201242, 277155, 399559, 560283, 744320, 963691, 1157199, 1307537, 1445796, 1530561, 1568671, 1588924, 1596649, 1558465, 1496284, 1387243, 1231393, 1049489, 843821, 663084, 510324, 389270, 311645, 255601, 215603, 186874, 168613, 154004, 135421, 124438, 120309, 111689, 100354, 82344, 68543, 65945, 62063, 57977, 52967, 47735, 49469, 46667, 42300, 32561, 23410, 22725, 26165, 26276, 17835, 14815, 12431, 7344, 11140, 16674, 12618, 12571, 11990, 14548, 13921, 14302, 20485, 21175, 21031, 19881, 18185, 16070, 17124, 16070, 13617, 10543, 2578, -4396, -10744, -10054, -6081, -3598, -857, -3219, -3178, -5518, -5254, -7596, -6361, -11180, -13168, -10629, -7684, -5640, -5362]
12765e362M779N91K786Q60N02k931p445N88J192j691j668J195M181r09R13n37
12749b956L50J658K087M214N710J291j661K262K976L984N187r48N465P467Q183
12734D5269K308K451o03j357L494M96m862n382j492p153n623n260k057j684k834
12719A5711q341n301m720n388J203m158p339n113J601M118K709N01P07M593J262
12704g955N21L853R84J704j278o96N591m5N460K621j881l363k378J194K32p78
12688C786L40J284K105N592K076N615O035N777J5350J2404R247K3786L0840L0969
12674A55206L1289J6337R151K354p569q588o701j2561j2158j3774k7009l0703
12662I5274l1863k5191j6617q044n870k713M849L458l606J03K679O349N25l109
$$ y = [-5362, -583, 8, 2794, 3654, 4156, 1225, -6220, -5632, -4440, -6131, -7799, -6604, -2423, -3332, -2419, -2956, -2606, -948, 1139, 5353, 11063, 12354, 10693, 12955, 15931, 19915, 25102, 24154, 29619, 37086, 45269, 47577, 50028, 49425, 48068, 51562, 52058, 47196, 41814, 40322, 33169, 27546, 22286, 20229, 18545, 15711, 7370, 2069, -2651, -8039, -6836, -10994, -18333, -23446, -21845, -17727, -15018, -14517, -13810, -9217, -7955, -7434, -3581, -2597, -893, -2171, -2867, 2724, 2679, 8139, 10760, 8879, 5516, 3138, 4332, 4564, 3786, 4126, 5410, 7515, 13107, 15183, 20798, 26833, 32610, 47960, 60364, 69611, 93397, 124237, 155206, 186495, 202832, 211983, 214337, 206768, 198180, 191479, 178918, 166760, 152986, 125977, 95274, 63411, 38220, 21603, 13559, 7689, 4976, 9825, 13283, 9677, 9780, 12459, 18808, 19333, 16224]
12648A6224q31j072J072j094k209Q12r289n763L913N861L049M146L17J131J0207
12633B6474M323M655P144Q855J1864R75K006k395j491N54Q645P050j538J486M071
12618H2678N121P243Q396N524q29l006m889j689o858p119j1133j8206k1100j8810
12604A5323j8305j3727q784r009j970O906R229J2515O224J0240R389Q300J0208
12591C6539J5113J2780J1867J4182J7750J2841J4116J1164J3750J3712O870K877
12579A83561m064m831j0905j9282k5802k3382k3621k1877j3204j4148j5701p774
12567a030M540J5214K6706L4142L6295M1804L6544K8072K5209R861K042q029n216
12554B46154j3158k8104k3909k4516j2878J3182J4049J6459J4832P367k590K0936
$$ y = [16224, 15393, 14321, 15393, 14299, 12090, 12902, 3613, -2150, 1763, 7624, 10673, 14819, 15136, 16267, 26474, 30797, 35452, 42596, 51451, 63315, 64290, 66296, 63901, 62410, 62964, 71609, 78659, 77121, 78607, 82678, 87799, 95042, 103438, 108962, 108133, 105127, 100238, 98549, 91691, 84572, 73439, 55233, 34133, 15323, -2982, -16709, -25493, -34502, -36472, -29566, -20337, -7822, -1598, 8642, 18031, 26331, 36539, 51652, 64432, 76299, 90481, 108231, 121072, 135188, 146352, 160102, 173814, 180684, 183561, 179497, 174666, 163761, 144479, 118677, 95295, 71674, 49797, 36593, 22445, 6744, -1030, 3510, 18724, 45430, 79572, 115867, 157671, 194215, 222287, 247496, 257357, 259399, 251370, 246154, 232996, 204892, 180983, 156467, 143589, 156771, 170820, 187279, 202111, 209478, 206888, 227824]
12542B27824J7592J2875O212m338m232l821r238j7151r005j6302j5289j2110j3030
12529A59987q667r528p097k163k776K604N235N945Q259R344J1019J1695Q502R705
12515B02064P236M526J1817J5738Q828P719O991R203O166K646M016p36n419K424
12501B83219L777Q443N317L847N128l789n868k16M775J088Q539J2326J4417Q163
12487C49166R410O998J1141J3516K5804K5492K2193K5094K6330L0270L3142L6319
12475F14875L5829L3880M7289N3736O5204O7767N8792N8030O1212O4116O9997
12464A230727P1932O8954O4250P0035O6663O2045P2146Q3798R0203R9342J13482
12453B093577J28215J43379J65894J99114K32200K69170L08850L49794M09282
$$ y = [227824, 245416, 258291, 264503, 260165, 255933, 252112, 242874, 225723, 216718, 200416, 185127, 173017, 159987, 151320, 141792, 134695, 132532, 129756, 132360, 137595, 143540, 151799, 161143, 172162, 183857, 192359, 202064, 209300, 213826, 225643, 241381, 250209, 257928, 264919, 274122, 280288, 282934, 286950, 286214, 280795, 283219, 286996, 295439, 300756, 304603, 309731, 305942, 300074, 299858, 304633, 305721, 314260, 326586, 341003, 349166, 358576, 365574, 376715, 390231, 416035, 441527, 463720, 488814, 515144, 545414, 578556, 614875, 650704, 684584, 731873, 785609, 850813, 918580, 977372, 1035402, 1096614, 1160730, 1230727, 1302659, 1371613, 1435863, 1505898, 1572561, 1634606, 1706752, 1790550, 1880753, 1980095, 2093577, 2221792, 2365171, 2531065, 2730179, 2962379, 3231549, 3540399, 3890193, 4299475]
12444D299475M99047O25223P80938R09025J070699J233893J300484J453794J623156
12435A3795734J844592K129944K613241L252667M106011N542660P867314J1985230
12427E3137393J9084976K7549224L1239486L6907822L6524801K5816384K2911932
12420B53172018J5106435P360766L001314L056109l772927r090975j3149620k3260766
12412B32422354k8137656l3177342l3381207k9233441k4307618j7521689j1654469
12405E5008932q011008n840817m489888l656233l085497k639193k365882k126507
12397B2793907j945567j824889j690217j578886j434732j268743j114592r60938
12389A0975343q26432p27377o53200n85182n33986m95710m42797l94004l59154
$$ y = [4299475, 4798522, 5423745, 6204683, 7113708, 8184407, 9418300, 10718784, 12172578, 13795734, 15640326, 17770270, 20383511, 23636178, 27742189, 33284849, 41152163, 53137393, 72222369, 99771593, 131011079, 167918901, 204443702, 230260086, 253172018, 268278453, 275639219, 278640533, 281696642, 277923715, 268832740, 255683120, 232422354, 204284698, 171107356, 137726149, 108492708, 84185090, 66663401, 55008932, 46997924, 41157107, 36667219, 33010986, 29925489, 27286296, 24920414, 22793907, 20848340, 19023451, 17333234, 15754348, 14319616, 13050873, 11936281, 10975343, 10148911, 9421534, 8768334, 8183152, 7649166, 7153456, 6710659, 6316655, 5957501]
12380E957501l35086l22352l15895l07306k98425k91449k61888k35114k06430
12371C383556j84437j65490j48555j30085j17005j06162r0243q3148q3951p8792
12361B195688p5199p8819p0551o5685o7461o1584n9778n7487n5408n1550m9747
12350A502419n7485n5162m4291m1076m0702l4165l4445k9287k8579l0827j5642
12339A090758M617K6750O5307R2811M9788J5555p263l9141o8297q5852p0172m4161
12327A030700l3380k6176j8678r846j4782j0111m463k2081k6034l6810m4031m1849
12315G42459l5296k2594j8066j8004j8986j9347j8029j6731j6790j8052j2928
12304E27636j0842m912J229J5542L0581M7483M7600O1319P7024O5573P9380J05108
$$ y = [5957501, 5622415, 5300063, 4984168, 4676862, 4378437, 4086988, 3825100, 3589986, 3383556, 3199119, 3033629, 2885074, 2754989, 2637984, 2531822, 2441579, 2358431, 2274480, 2195688, 2120489, 2041670, 1971119, 1905434, 1837973, 1776389, 1716611, 1659124, 1603716, 1552166, 1502419, 1444934, 1389772, 1345481, 1304405, 1263703, 1229538, 1195093, 1165806, 1137227, 1106400, 1090758, 1095375, 1122125, 1187432, 1280243, 1330031, 1345586, 1338323, 1299182, 1230885, 1145033, 1074861, 1030700, 997320, 971144, 952466, 942620, 927838, 917727, 913264, 891183, 865149, 828339, 784308, 742459, 707163, 684569, 666503, 648499, 629513, 610166, 592137, 575406, 558616, 540564, 527636, 516794, 511882, 513111, 528653, 559234, 606717, 654317, 715636, 792660, 858233, 937613, 1042721]
12292A042721J17227O1904m124l6621p1285j07338j31927j19686q1792n2678m0411
12281E75990k6995k5734k2074j7935j5521j5093q250k27M607J740l628p88o568
12268D39524j5089k1370j3876k0257k0492k2532l4171l2946k3837k9245l0519
12257A75190j9513j2921q796K824J1179J0034J6571K0581L1724M4944M5857K7734
12245C45408J3537P721o521k2749k5794j7447j3349n401o06j07m707J241l819
12232B67407r976j1836j5697j1250o964j0882j3431j1426q098o544N10m89p30
12219A60594m612L892n231q218j393J857K996m073n117l695n887p104j392L004
12205A25621L024M622N331P223P728J0135L060Q41P850J864m89j531N03l834k476
$$ y = [1042721, 1159948, 1221852, 1217728, 1181107, 1109822, 1002484, 870557, 750871, 669079, 616401, 575990, 548995, 523261, 501187, 483252, 467731, 452638, 444388, 444161, 448768, 450508, 446880, 446092, 439524, 424435, 403065, 389189, 368932, 348440, 325908, 291737, 258791, 234954, 205709, 175190, 155677, 142756, 133960, 136784, 147963, 157997, 174568, 195149, 226873, 271817, 317674, 345408, 358945, 366666, 360145, 337396, 311602, 294155, 280806, 275405, 274799, 274692, 269985, 271226, 267407, 257431, 245595, 229898, 218648, 211684, 200802, 187371, 175945, 167847, 161303, 161813, 161324, 160594, 155982, 159874, 154643, 146425, 145032, 146889, 149885, 145812, 140695, 137000, 131113, 124009, 122617, 125621, 128645, 133267, 138598, 145821, 153549, 163684, 166744, 167585, 175435, 177299, 176810, 175279, 175782, 171948, 169472]
12190A69472k93o538o722p05J744J96l183n620K594R149N037J851J042K970k332
12175A68662l58p104k072m440l864k222p209o141p87r82r68j140N25R84N937L25
12159A39146m546L643J862L17l672j513Q4j103k845m798l474j658p582k042K694
12144A14513K557K684j743j265j419M662q48m190l488j02j950M15K337m736J892
12129A09319L138k227K177j800k797k252r55k402j116L365J267j274k764n103
12115I6576k742p661o573n629r831k044M467m300p591n567l126l036o840n874
12101C0229j970j18L566M886J0949P151K941O375N899O05k465J297J173j368R58
12086G0108L151J696p291j934k46l495l38O282N076k313l030J772l73J06n384
$$ y = [169472, 169179, 162641, 155919, 155214, 156958, 157154, 153971, 148351, 150945, 160094, 165131, 166982, 168024, 170994, 168662, 168304, 161200, 159128, 154688, 150824, 148602, 141393, 135252, 134465, 133483, 132515, 131375, 131900, 132884, 138821, 139146, 134600, 138243, 140105, 140422, 136750, 135237, 135321, 134218, 131373, 126575, 123101, 121443, 113861, 111819, 114513, 117070, 119754, 118011, 116746, 115327, 119989, 119141, 114951, 111463, 111361, 109411, 109826, 112163, 107427, 109319, 112457, 110230, 112407, 110607, 107810, 105558, 104603, 102201, 101085, 104450, 105717, 104443, 101679, 96576, 93834, 86173, 79600, 73971, 64140, 62096, 66563, 62263, 54672, 49105, 45979, 42943, 36103, 30229, 28259, 28141, 31707, 36593, 47542, 54693, 57634, 64009, 69908, 70513, 68048, 69345, 70518, 69150, 70108, 73259, 74955, 67664, 65730, 65484, 61989, 61651, 67933, 73009, 70696, 67666, 69438, 69065, 69171, 63787]
12071F3787k539J454K147N409o3M055j543J143k603l011j310L675J119J126J994
12056G4840j389J906k95o544o906o487O60Q96j336O60m381m01P21K581J289J196
12040E7010O085K95l822n64M066L838j268j346O805N069j374j508J914K919L268
12025H1387m225J211j70m685jJ520o29M205J794K214K807NL580N678J936N87M580
12008A01794N959P313P630N634R754J3161Q684J0821J5414K1096L6302M2283O6644
11995C52489J06509J48838J69876K12667K05341J60297J39271Q9291L9979K2102
11985A646660J8042l0068o0096r6341j45478j71885j95320j78539j57893j29977
11975D99105r3385n8168m0544l0436k3751j8922j5092k0206j6386o536n285j0057
$$ y = [63787, 61248, 62702, 64849, 70258, 70195, 74250, 72707, 73850, 71247, 68236, 66926, 70601, 71720, 72846, 74840, 73451, 75357, 75062, 68518, 61612, 55125, 55785, 56681, 55345, 56005, 51624, 51223, 51944, 54525, 55814, 57010, 63095, 63390, 59568, 59004, 63070, 66908, 65640, 64294, 71099, 76168, 74794, 73286, 75200, 78119, 81387, 77162, 78373, 78203, 73518, 73517, 75037, 74408, 78613, 80407, 82621, 85428, 85433, 89013, 94691, 96627, 97214, 101794, 107753, 115066, 122696, 128330, 138084, 151245, 159929, 170750, 186164, 207260, 243562, 285845, 352489, 458998, 607836, 777712, 990379, 1195720, 1356017, 1495288, 1584579, 1624558, 1646660, 1664702, 1634634, 1574538, 1478197, 1332719, 1160834, 965514, 786975, 629082, 499105, 405720, 347552, 307008, 276572, 252821, 233899, 218807, 198601, 182215, 175679, 170394, 160337]
11963A60337j0112j1904p698n741r766n225p044p367j691k152l172o70K114l501
11949H6408n69l994L139l540m674l361l979j817K1o473K600M055O9k094L721K724
11933G2236j386m244m640k762J210M707J843n386P90j715l663j117K848m81P14
11918E8954l479p36K32j771j771r52k303k077r44q92l615M90l272j992N907M393
11902D6172M457L310P203N899n735k556m943p756n02K525J017l338j071j612r37
11887D2133l485k005J810K302j452J97p70p88j619j753n242K402m78m560K57q83
11871B6066k090K180j07k523o7J813K342L202M038J635n784K075j617m830J88
11856B6521J040m434k300K582k339l59O197M588n334m186o60J189j483K921q83
$$ y = [160337, 150225, 138321, 130623, 124882, 115116, 109891, 102847, 95480, 93789, 91637, 88465, 87795, 89909, 86408, 85839, 81845, 84984, 81444, 76770, 73409, 69430, 67613, 67634, 61161, 63761, 67816, 67885, 65791, 69512, 72236, 70850, 66606, 61966, 59204, 60414, 65121, 66964, 61578, 62368, 60653, 56990, 55873, 58721, 58240, 58954, 55475, 54739, 54971, 53200, 51429, 50477, 48174, 46097, 45153, 44261, 40646, 41136, 37864, 35872, 41779, 46172, 50629, 53939, 61142, 67041, 61306, 58750, 53807, 46051, 45549, 48074, 49091, 45753, 44682, 43070, 42133, 38648, 36643, 38453, 40755, 39303, 39500, 38730, 37942, 36323, 34570, 29328, 31730, 31252, 26692, 26949, 26066, 23976, 26156, 26049, 23526, 23459, 25272, 27614, 30816, 34854, 36489, 30705, 32780, 31163, 26333, 26521, 27561, 23127, 20827, 23409, 21070, 20711, 26908, 31496, 26162, 21976, 21316, 22505, 21022, 23943, 23060]
11841B3060k918j994L397M319k009p309K535N21l837k876J558J935J026J686L528
11826B2622L999j035l656p415N329K358O02k481M111o7p110l584O811J498k482
11811A9500l181o755J685R40K415L025L068j14k857m060L85K949M516r9m436l883
11795A3098Q22O868K942J427l535l497K249k142l342J362J46K550K886J496J389
11780B4719k74m094k218m892L791K764k138K287j21n013q035NK644N160N283m19
11764A9449j614M816k182o68K804L37m790n88K247k52l108K267j098l441J640
11749A5819N137l475k18J381k677L35j755K759O84P88P618M846L57l089o167o533
11733A5810n787J100J867L787K12J676j754k536L509j998O92K374j786o65J31
$$ y = [23060, 20142, 18148, 21545, 25864, 23855, 16546, 19081, 19602, 15765, 12889, 14447, 16382, 17408, 19094, 22622, 26621, 25586, 21930, 14515, 19844, 22202, 22804, 20323, 24434, 24367, 17257, 13673, 20484, 21982, 19500, 16319, 9564, 11249, 12189, 14604, 17629, 20697, 20583, 17726, 13666, 14051, 17000, 21516, 21417, 16981, 13098, 13920, 20788, 23730, 25157, 21622, 18125, 20374, 18232, 14890, 16252, 16398, 18948, 21834, 23330, 24719, 24445, 20351, 18133, 13241, 17032, 19796, 17658, 19945, 19824, 14811, 6776, 6781, 9425, 14585, 19868, 19449, 17835, 22651, 20469, 19801, 22605, 22942, 18152, 17564, 19811, 19559, 16451, 18718, 17620, 14179, 15819, 20956, 17481, 17263, 18644, 15967, 16302, 14547, 17306, 17990, 18778, 26396, 31242, 31599, 28510, 22343, 15810, 10023, 11123, 12990, 16777, 16989, 18665, 16911, 14375, 17884, 15886, 16578, 18952, 17166, 16501, 16632]
11718A6632J684L635j648k684j372L432P596K931k12l895N61K440M85O443j874
11703C4154m88p956k811l508L222J437n929n421K026O81j072k070j066L430r80
11688A3649n763K591O207J468M499q97p358m87j604r85J393r29K397J148j686
11673A3643J804j92j649J738k40k298j136k230K23o570o37J0612m28q384j174
11658C082L987p89o499l976j319N578O785n888n036K993L327J945O921Q09j70
11643A1750K142l372k301j213k640K103O485K15n396n964j241M24J619L921M009
11628A0541N19m345l455J425M184l521q36Q29J98M455J936J467L686k204k662
11613A2217l3J719K79j620K658n59M13q47r05l362J54l026o085k2j338k484K300
$$ y = [16632, 18316, 21951, 20303, 17619, 16247, 19679, 27275, 30206, 29994, 26099, 26660, 29100, 29585, 36028, 34154, 33666, 25710, 22899, 19391, 22613, 24050, 18121, 12700, 14726, 15407, 14335, 12265, 11199, 14629, 13649, 7886, 10477, 16684, 18152, 22651, 21754, 14396, 13909, 12305, 11320, 12713, 11784, 14181, 15329, 13643, 15447, 15255, 13606, 15344, 15104, 12806, 11670, 9440, 9663, 3093, 2456, 13068, 12640, 4256, 3082, 7069, 6280, -219, -4195, -5514, 64, 6849, 961, -4075, -1082, 2245, 4190, 11111, 11920, 11750, 13892, 10520, 8219, 7006, 4366, 6469, 12954, 13169, 7773, 1809, 568, 992, 2611, 6532, 10541, 11060, 6715, 3260, 4685, 8869, 5348, 4512, 5341, 5539, 9994, 11930, 13397, 17083, 14879, 12217, 12184, 13903, 14182, 12562, 15220, 14661, 15074, 14227, 13322, 9960, 10114, 7088, 1003, 981, -357, -2841, -541]
11596e41L595M917k441m896M93L531L008k674k127N31j061k523J831R66N349M732
11580A2690N76O02j694O77l994k567K382O770M799m648km60j097K356j722m561
11564A0107j489j523k071J831o42p41l608k198K55M500L261K716k202N45J219
11549I960l125L378J062p804j922l25o598P777r99l191k7j795J102j322l876N295
11533b410O266k955l88L852N78J677J314m146q05J538K800N381k799k223k15j009
11517F456j952j344L31L299J742j339J465q42J320K490k53M87K125k44K458K17
11501A6416j217j900n151j625k819j850N58M439k121R83J779Q2K469j13l221l289
11485C420K405J975m462l008k204l224q35L555L072m000j38K246k262k509J305
$$ y = [-541, 3054, 7971, 5530, 634, 1127, 4658, 7666, 4992, 2865, 3396, 2335, -188, 1643, 2609, 7958, 12690, 13266, 13868, 12174, 12851, 8857, 6290, 8672, 15442, 20241, 15593, 15591, 15131, 14034, 16390, 14668, 10107, 8618, 7095, 5024, 6855, 6213, 5472, 1864, -334, -79, 4421, 7682, 10398, 8196, 8741, 9960, 6835, 10213, 11275, 3471, 1549, 1224, -5374, 2403, 1404, -1787, -1814, -3609, -2507, -3829, -7705, -2410, 3856, 901, 513, 4365, 4943, 6620, 7934, 3788, 2983, 4521, 7321, 12702, 9903, 7680, 7465, 6456, 4504, 3160, 3491, 6790, 8532, 7193, 8658, 7816, 9136, 11626, 11373, 11860, 13985, 13741, 16199, 16416, 15199, 13299, 8148, 6523, 3704, 1854, 2412, 6851, 4730, 5713, 7492, 7574, 10043, 9930, 6709, 3420, 5825, 7800, 3338, 330, -1874, -5098, -5933, -2378, 694, -3306, -3444, -1198, -3460, -5969, -4664]
11470d664j139r86k21O68K133J39L687K907j958r46n13L924L734P80m190j250
11454B105K000N829L310p309K82k230l733K506J70j615L159M213r6o01Q80m391
11438D479O69J818j515l261P57O60N27k122J769K641q1M232L634m488p394n79
11422A746K909k866l636j882L812q22N19K179j102M518M917k130l21j268k199
11407D374k001n362J728j55J69M340m24m279k324l297J949K355L95M085Q066k671
11391F948j637J677J014m5Q56j68n550q21j52r37J130M619l1J407k771p879R01
11374a439N368K951q41k324k887j646K210L376K749j497n632q470k758K455M249
11359d136M381K311m058j326J315O525j90l720L31N53j561R92r01o501P88L965
$$ y = [-4664, -5803, -6789, -7010, -6342, -4209, -4070, -383, 2524, 566, -380, -893, 3031, 6765, 7545, 3355, 2105, 4105, 9934, 13244, 5935, 6217, 3987, 254, 2760, 2930, 1315, 4474, 8687, 8591, 7990, 8870, 4479, 5148, 6966, 5451, 2190, 2947, 3607, 4134, 2012, 3781, 6422, 6341, 10573, 14207, 9719, 2325, 1746, 4655, 1789, -1847, -3729, 83, -739, -220, 1959, 857, 5375, 10292, 8162, 7841, 6573, 4374, 2373, -2989, -1261, -1416, -1247, 3093, 2669, -1610, -3934, -7231, -5282, -2927, -2532, 1553, 9619, 6948, 5311, 6988, 8002, 7957, 8813, 8645, 3095, 2274, 2122, 1185, 2315, 6934, 6903, 8310, 5539, -2340, -1439, 3929, 6880, 6039, 3715, 828, -818, 1392, 4768, 7517, 6020, 388, -8082, -10840, -8385, -4136, 245, 2556, -1502, -2828, -1513, 5012, 4822, 1102, 1433, 1986, 425, 1417, 516, -5985, -5197, -1232]
11343a232M667M815K830q00J75n081l664j59n135l977j862j549P250L081L97J514
11327A270l827j938k26J710K133L828O488L085J496K086M307M64j96k415j333
11312A6932k419l508q374J172j072l356m199O677K250j366L602n296m891K763
11298a085%J75j584J025O142J417M145K508J031m111n743r59l716j882m020O151
11282e06L868k96N352K123P23M197Q097N435K73O532L596m507l311j600n511p422
11266A7043o048p49j309l919K96M215K383j905l256l242l293K49o6j772J629L446
11250C702J157m963j329J153K414M244k517R26L943j494p42L000r187P55P094
11235H156L598j467l010K692P403K527K600N205k322k253o522n697l378J809l450
$$ y = [-1232, 3435, 8250, 11080, 10280, 10455, 5374, 1710, 1551, -3584, -7561, -9423, -10972, -3722, -641, -244, 1270, -2557, -4495, -4721, -3011, -878, 2950, 9438, 12523, 14019, 16105, 20412, 20876, 20680, 18265, 16932, 14513, 11005, 2631, 3803, 2731, -625, -4824, 1853, 4103, 2737, 6339, 1043, -3848, -1085, -1085, -910, -2494, -1469, 4673, 6090, 10235, 12743, 13774, 9663, 3920, 2961, -755, -2637, -6657, -506, 3362, 3066, 8418, 10541, 11264, 15461, 23558, 28993, 29266, 35798, 39394, 34887, 31576, 29976, 24465, 17043, 10995, 10246, 8937, 5018, 5314, 9529, 11912, 10007, 6751, 3509, 216, 465, 399, -1373, 256, 3702, 4859, -104, -1433, -280, 2134, 6378, 3861, 4787, 8730, 7236, 6494, 9494, 307, 1062, 8156, 11754, 10287, 7277, 9969, 17372, 19899, 22499, 27704, 25382, 23129, 16607, 10910, 7532, 9341, 5891]
11220E891l420l300L695J948k497J770r54l27m54m423p97N429N232K929k65J669
11204A2126j554q24k084O469N909k797p1N017k62K861M702k354L09Q659J4136
11189E0242J4071R324J3628K0681K7621L8783N7467R1678J48923K29907K72314
11178I74639K48594K45783J94215M7438r3055j85643k29048k47607k51799j99336
11168E04181j30707q1703n0569l8255k6573j8621j9906j6316p624j1475j1754
11157I0678j1296j0075p103p617l806j860j195On154j217o459m823K829K034o201
11142B8741p754j949j248p704k065J363J345q92m147J317j448o72q61L914Q67
11127H807P3P02K432J839J507m263m331j10p0O18n15k853m046M570L937K739K973
$$ y = [5891, 2471, -829, 2866, 4814, 2317, 4087, 3133, 2806, 2352, -2071, -2868, 2561, 7793, 10722, 10457, 12126, 10572, 9748, 7664, 14133, 20042, 17245, 17174, 22191, 21929, 24790, 29492, 27138, 27447, 36106, 50242, 64313, 73637, 87265, 107946, 135567, 174350, 231817, 323495, 472418, 702325, 974639, 1223233, 1469016, 1663231, 1710669, 1617614, 1431971, 1202923, 955316, 703517, 504181, 373474, 291771, 241202, 202947, 176374, 157753, 137847, 121531, 113907, 102432, 90678, 79382, 69307, 62204, 54587, 50781, 48921, 47726, 47732, 42578, 41361, 34902, 30079, 32908, 34942, 28741, 20987, 19038, 17790, 10086, 8021, 9384, 10729, 9837, 5690, 7007, 5559, 4887, 4026, 7940, 8807, 8880, 9582, 12014, 13853, 15360, 11097, 6766, 6656, 6586, 7204, 6689, 3836, -210, 4360, 8297, 11036, 14009]
11110A4009r14l016k667L983J937J512p42k21k812j39k500J30O228L256N295M528
11094B7867j262j376M611K832K767P07L109K146K494R821Q502J5592J9891J9668
11080A17369K8959M1261O0819J16223J88766K42120K10684J70629J82024J68928
11070A527782M7632r5827j49818j65028j93082k16362k05521j49317q9584n5796
11060B55079m2254l0534k6511k2304j7669r654j4265j4482o412m026n936k367
11048E8665l656q004k403L290q149n475j294m312l788j402o585n829j417K502
11034A2143L196J137m882N43L596K392n547k865n318m232M890J383P9j269l017
11019B229k926K016k121J586K631O159M074l547n480l308j243J649K356l428M58
$$ y = [14009, 13095, 10079, 7412, 11395, 13332, 14844, 14102, 13881, 11069, 10930, 8430, 8560, 14788, 18044, 23339, 27867, 26605, 25229, 29840, 32672, 35439, 36146, 39255, 41401, 43895, 53716, 62218, 77810, 97701, 117369, 146328, 187589, 248408, 364631, 553397, 795517, 1006201, 1176830, 1358854, 1527782, 1575414, 1479587, 1329769, 1164741, 971659, 755297, 549776, 400459, 310875, 255079, 212825, 182291, 155780, 133476, 115807, 106153, 91888, 77406, 70994, 66968, 61032, 58665, 55009, 47005, 44602, 47892, 39743, 34268, 32974, 28662, 24874, 23472, 16887, 11058, 9641, 12143, 15339, 16476, 11594, 12137, 15733, 18125, 12578, 9713, 4395, 163, 5053, 6436, 6515, 5246, 2229, -697, 1319, -802, 784, 3415, 9574, 13648, 10101, 4621, 1313, 70, 1719, 4075, 647, 1105]
11004A105J613L394L193l311P82o804n494N86J845L922L761p95j796j109O42J810
10988C344K275k438n60M77l333q119K72N049n508o40q62l37M282O727K483n957
10972b845m866J109J757m847r82L381L527R41l187J394M609J435k721o15M587
10957B677p44l691k13N108j261m037K495O32j90O92J416K190O90l56j747j554
10941B107l001n764K322L073J203j187m703P96K714p75q36o47n241l706K68j187
10925a4564N09j076O617N984k529J076k55j904p34J929M230m61n282j861M607
10910c714J549p72k067J972O61p00j754J275o251k304N042J236k45J007N173j760
10894a652J282k050k688M314P5l023j915J644N24M80k803m233l760P38N755j204
$$ y = [1105, 2718, 6112, 9305, 5994, 6776, -28, -5522, -4936, -3091, 831, 4592, 3797, 2001, 892, 1534, 3344, 5619, 3181, 2621, 3098, -235, -8354, -8082, -3033, -8541, -9181, -10043, -10380, -6098, 629, 3112, -2845, -7711, -6602, -4845, -9692, -10674, -7293, -3766, -2825, -6012, -4618, -9, 1426, -1295, -1910, 2677, 1933, -1758, -1971, 3137, 1876, -2161, 334, 966, 776, 1468, 2884, 5074, 5764, 5408, 3661, 2107, -894, -6658, -4336, -1263, -60, -1247, -5950, -5154, -2440, -3215, -4051, -4698, -9939, -13645, -13377, -14564, -14055, -15131, -8514, -2530, -5059, -3983, -4238, -6142, -6876, -4947, -717, -1178, -6460, -8321, -3714, -2165, -2937, -5004, -3032, -2371, -3071, -4825, -3550, -9801, -12105, -7063, -5827, -6072, -5065, 108, -1652, -370, -2420, -5108, -794, -719, -3742, -5657, -4013, -3489, -3009, -5812, -10045, -13805, -13067, -7312, -8516]
10878h516L752O519J320k258r580J495O471J853l858j417m290m076m921j563J135
10863a7934k209j223O679P607q62M6j484L640K021L955P8M45l602k309K95L79
10847d478K458K27O57K02K99j101L74o95K932K638k710m126n615j862K753N841
10831b206J465k85k195N086N011l32m01o348p377j05l03j257r32L3J89k95Q86
10814i366r30L370j050P07J070m288j355K755L005j187l057m501j823L729O749
10799f172L677N499j898k68L178L501J453r09o864k054R24k130j847k54n854q644
10783a8662l148M017L892L097K850Q745J694O04J132l060m469K444K52k459m612
10768g683M47K973L419J766M374l29o566J770K977n76o574l583j10M80J293M203
$$ y = [-8516, -4764, 1755, 3075, 817, -8763, -7268, -797, 1056, -2802, -4219, -8509, -12585, -17506, -19069, -17934, -20143, -21366, -14687, -7080, -7942, -7896, -9380, -5740, -3719, 236, 314, 759, -2843, -5152, -4857, -4478, -2020, -1793, -1136, -934, -635, -1736, -1362, -2057, 875, 3513, 803, -3323, -8938, -10800, -8047, -2206, -741, -1026, -3221, 1865, 6876, 6544, 6143, -205, -7582, -7687, -7990, -9247, -10179, -10146, -9957, -10252, -9366, -10296, -6926, -7976, -7269, -6199, -10487, -11842, -9087, -6082, -7269, -10326, -14827, -16650, -12921, -6172, -2495, 3004, 1106, 838, 4016, 7517, 8970, 8061, 1197, -857, 67, -2063, -3910, -4164, -10018, -18662, -21810, -17793, -13901, -10804, -7954, 791, 2485, 3089, 4221, 1161, -3308, -864, -612, -3071, -7683, -7236, -4263, -844, 922, 5296, 4967, -1599, 171, 3148, 2572, -4002, -7585, -7695, -7215, -5922, -1719]
10752a719L974K172k240J368K98Q87n152K068M66n218K538L947l666LJ40J22M961
10735D949m767n154J409P82k23L935j128n179k356q70m736n24K79K267P307M498
10719D89L40K303p26n070p08J243k92m318m930N065L397n05j708j251k10K8M448
10702b405N782j018l751K048m078k70k142k168n293j628M305K719j043k313m95
10687a1750K27k068k63K565K371k76l239k653L363M810R74O145J867n386m133
10672g446m10J716n383k06L069J550m26k566j322J237K430J643J412o189M86K023
10656h382J775k343j62M302j08K71K252K186K627J200k451m282l683M107O163
10641C472K076L397l242m775R02j725L896n28J371J055k838J67j362l224k875
$$ y = [-1719, 2255, 4427, 2187, 3555, 3853, 4740, -412, 1656, 2122, -3096, -558, 3389, -277, -274, -134, -12, 4949, 182, -4972, -3563, -2781, -3004, 931, -197, -5376, -7732, -8602, -13338, -13862, -13583, -11316, -4009, 489, 829, 3132, 2406, -2664, -3372, -2129, -2421, -6739, -11669, -6604, -3207, -3712, -5420, -6671, -6881, -6853, -2405, 3377, 2359, -1392, 656, -3422, -3692, -5834, -8002, -13295, -14923, -10618, -7899, -8942, -11255, -11750, -11523, -13591, -13854, -11289, -8918, -9194, -12433, -15086, -11723, -6913, -5939, 206, 2073, -3313, -7446, -7856, -6140, -11523, -11729, -8660, -7110, -7536, -10102, -11424, -10187, -7757, -6114, -4702, -10891, -10405, -8382, -6607, -8950, -9112, -4810, -4918, -4647, -2395, -209, 2418, 3618, 1167, -3115, -6798, -2691, 3472, 5548, 8945, 5703, 928, 1830, 105, 4001, 3473, 4844, 5899, 3061, 3228, 1866, -1358, -4233]
10626d233k128R25j983l979J255K799L622O22n053j451q77P180M771l582k795
10611d907J989q168K9j71K939L043j544l666M85J437k728o74m318k499L392N13
10595a4848n68n07p12J389o57j027K749r46J641L286M444K311k78J637k273j592
10579e951r67k806K57J15R44P62o53O18k214k072J372K946o31K488K684j015J318
10562b805k068J2l533j921o72j289K471Q30k204j096l11K098K687L82J044l033
10546i408j379J720k580J732J551J382L30N038j861l658o881j995K038M59N379
10531h133M461J522l490l058M018J539j391j571l191q22L252o08K878L729m545
10516e410K4n073j971O393P788j794n275K23n174n04J361O09M81N613K6k672m492
$$ y = [-4233, -6361, -5436, -7419, -11398, -10143, -7344, -3722, -3100, -8153, -9604, -10481, -3301, 1470, -2112, -4907, -2918, -11086, -11057, -11228, -8289, -5246, -6790, -10456, -9971, -8534, -11262, -11936, -16254, -18753, -15361, -14848, -15416, -15923, -16635, -15246, -15903, -16930, -14181, -15127, -13486, -10200, -5756, -3445, -3723, -2086, -4359, -5951, -6918, -9724, -9467, -9352, -8408, -7646, -8299, -7681, -9895, -11967, -10595, -7649, -8280, -5792, -3108, -4123, -2805, -4873, -4861, -8394, -10315, -10987, -12276, -9805, -8975, -11179, -12275, -12586, -10488, -7801, -7419, -6375, -9408, -10787, -9067, -11647, -9915, -8364, -6982, -6652, -1614, -3475, -7133, -14014, -16009, -13971, -13512, -8133, -3672, -2150, -5640, -8698, -4680, -3141, -4532, -6103, -9294, -10116, -6864, -7472, -4594, -865, -5410, -5386, -10459, -12430, -6037, 1751, -43, -5318, -5095, -10269, -10773, -9412, -8803, -8322, -2709, -2683, -5355, -9847]
10499i847j743K54O58M249J357j737R611O959q4p196q024j796k72L175J757j778
10483d457J219j046L646J540o223l597L244k382j325N377J176k38j324l901J901
10468f390K414m135p11P724N406k296p381k81M068K754l456j282L166P00q920
10453h620l284J626j655J157l895k500K155J649k920j36M808J235K51L056q49
10438g922K18K149j118j695j528J020j798l364M840L507k010K8K841J369k022
10423e485j810J943M451j249k214J119K510l106l072R45J041J932K287j537l890
10408f135n45K481N261K020K218J249J352Q771J4397J4737K9481N0254O3225N2395
10394B41161L0046J0567r616k9827n2246n3556l9997k7235j8815j3280q000n174
$$ y = [-9847, -11590, -11336, -10678, -6429, -5072, -6809, 2802, 9761, 9677, 2481, -5543, -7339, -7611, -4436, -2679, -4457, -3238, -4284, -638, 902, -5321, -8918, -5674, -8056, -9381, -4004, -2828, -3066, -4390, -8291, -6390, -3976, -8111, -8822, -1098, 4308, 2012, -5369, -5650, -1582, 1172, -2284, -3566, -400, 300, -8620, -11904, -10278, -11933, -10776, -14671, -17171, -15016, -13367, -16287, -16423, -11615, -10380, -10129, -7073, -7922, -7704, -5555, -6673, -8368, -9896, -8876, -10674, -14038, -9198, -5691, -7701, -7673, -4832, -3463, -5485, -7295, -5352, -901, -2150, -4364, -3245, -735, -3841, -6913, -5968, -4927, -2995, -708, -2245, -6135, -6680, -4199, 1062, 3082, 5300, 6549, 7901, 16672, 31069, 45806, 75287, 125541, 188766, 241161, 271207, 281774, 272158, 242331, 190085, 136529, 96532, 69297, 50482, 37202, 29202, 24028]
10382B4028k487j337k40l999l262o517J739N454k309m530l856M370N81K131M096
10367A3862P38k137o260M653J489p034k787m466P30L122M345j435r96N159J919
10352A0902j473q74k826k893j461K251K07j375K750M833L628L78K28q08p128n309
10336A030j363J701p04L981l637K932J326p269q10N099L906J311L98l083m36j619
10320B763j727K089M327q1J184k008j449K932n340K52j72J526J795m70k406N428
10304H643Q625J901P058O637N651N694L363K270k66j612q06o199j0607j880j702
10289B6770j640m403m960j683k171l404L12Q47r08k527p46k39m68M15L042k676
10273E561q62K360K205j220k052N11K379k521j190O08K673m63m38o85j653n929
$$ y = [24028, 21541, 20204, 19964, 15965, 12703, 6186, 7925, 13379, 11070, 6540, 2684, 7054, 7635, 9766, 13862, 14600, 12463, 6203, 10856, 12345, 5311, 2524, -1942, -1212, 1910, 6255, 4820, 3824, 8983, 10902, 9429, 8555, 5729, 2836, 1375, 3626, 3833, 2458, 5208, 10041, 13669, 14047, 14275, 13467, 6339, 1030, -333, 1368, 664, 4645, 1008, 3940, 5266, -2003, -2813, 2286, 6192, 7503, 7901, 4818, 4382, 2763, 1036, 3125, 7452, 7371, 8555, 6547, 5098, 8030, 2690, 2942, 2770, 4296, 6091, 5621, 3215, 8643, 17268, 19169, 26227, 32864, 38515, 44209, 47572, 49842, 49576, 47964, 47158, 40959, 30352, 28472, 26770, 25130, 20727, 15767, 14084, 11913, 8509, 8821, 9668, 8760, 6233, 5487, 5248, 4780, 5195, 8237, 5561, 4699, 7059, 9264, 8044, 5992, 6503, 8882, 6361, 5171, 5779, 8452, 7989, 7551, 6866, 5213, -716]
10257g16m55L29K21K83k521l972n418J210j637M22L468L930k968n837p231J850
10241a9042M609M916R50K018K89k484K418P01o40K577Q57Q86j722l8J107j517
10225d115m624l102j086L297J879k583J700k225J726K35K123K438L188J945L157
10210C953J185K251P64n434n517K173L702j696L2N21K40k243l637k653L44k201
10194h216Q84l410k848l815j13j510L987J623l878O24O233K983m497J354L162
10179g437K315L318J817m64m188l065j822q27K71K154L614j335L320K469R55R69
10163B064P73k541l154K384K008L160k544n35J128m430j992l19k53j219L510J119
10147h41L56J15j462j332l216n122o62L12K47L299K451N823M662N372K589N584
$$ y = [-716, -1171, -842, -621, -338, -2859, -6831, -12249, -11039, -12676, -12254, -8786, -4856, -7824, -13661, -20892, -19042, -14433, -9517, -8567, -6549, -6260, -8744, -6326, -5625, -6265, -3688, -2831, -1945, -3667, -3705, -2598, -4115, -8739, -11841, -12927, -9630, -7751, -10334, -8634, -10859, -9133, -8898, -6775, -4337, -1149, 796, 3953, 5138, 7389, 8153, 2719, -2798, -625, 3077, 1381, 1413, 1934, 2174, -69, -3706, -6359, -6015, -8216, -7332, -10742, -13590, -17405, -17518, -19028, -15041, -13418, -17296, -16672, -10439, -7456, -11953, -10599, -7437, -5122, -1804, 13, -451, -4639, -7704, -9526, -10353, -10082, -7928, -4314, -5649, -2329, 140, 1095, 2064, 2837, 296, -2858, -474, 1534, 4694, 2150, 1615, 2743, -1687, -3679, -3998, -4251, -5470, -1960, -841, -485, -370, -1832, -3164, -6380, -11502, -12164, -11852, -11605, -8306, -5855, -32, 4630, 10002, 12591, 18175]
10131A8175R284Q620J2586P582M666M342O255j371p624J34k393r810n054r122
10117C6270l020j828n767p777k049J508O604M420N933L861n431j2227n985n378
10103I134n608J52j346k31J013N29J574K046l060o7m794n402M71M623J724m987
10087d229l680J720J811N916M30k889N03P193M574o76K339l933m422k816k966
10072a125J715l372R83r10q5M246p90m367l661n315q90L188P014k008k954l693
10056a2024N94k119k644J66J885K016J34j600J92J646J830J251j336j086K227
10041h868J031k027o74M686L203j750p878N87M901N031J616k510k81k349k138
10026g420j73R31Q058P43o622J055J573j740m055J562j594n98j816p20j812j019
$$ y = [18175, 27459, 36079, 48665, 56247, 60913, 65255, 71510, 70139, 62515, 62649, 60256, 50446, 45392, 36270, 33250, 31422, 25655, 17878, 15829, 17337, 23941, 28361, 34294, 38155, 32724, 20497, 14512, 9134, 3526, 3678, 2332, 2101, 3114, 3643, 5217, 7263, 4203, 4136, -658, -6060, -5589, -966, 758, -4229, -7909, -6189, -4378, 1538, 1968, -921, -418, 6775, 11349, 10673, 13012, 9079, 4657, 1841, -1125, 590, -2782, -1799, -2709, -2794, 1452, 662, -3705, -7366, -12681, -13571, -10383, -3369, -5377, -8331, -12024, -11430, -13549, -16193, -16027, -14142, -12126, -11992, -13592, -13400, -11754, -9924, -8673, -10009, -11095, -8868, -7837, -9864, -10538, -5852, -2649, -4399, -12277, -11690, -6789, -1758, -142, -2652, -2933, -5282, -7420, -7593, -6662, 1396, 2139, -4483, -3428, -1855, -3595, -7650, -6088, -7682, -8280, -10096, -10816, -12628, -13647]
10010a3647J257L004L295j437j828R44K71J465o78k421m892J683L996J155J449
9995f384N496L86M820J998m82k775l328m251j739p72j12K535J658K313m29k08
9979a274K244j05p29k059r30K46K726M22M199l771k663L936L21K025m801p236
9963g449K878N926l53J298k591L27P490P44j439n10K246O5M085Q77O440J755j739
9946B0050K684J30N421L392K410J956R7L323L258K745j020J400N637L818O136
9931F1437R393P756J1253J5455J8725J8273K0709K1866K4649L2211L3315L3514
9919C08556M5718M5807N0075N0460P0305R3840J25245J64457K47145M01912O68903
9908B272423R45219J065163J201056J153481J024830R16338O07842L12694J82271
$$ y = [-13647, -12390, -9386, -6091, -7528, -9356, -8412, -8141, -6676, -7354, -9775, -14667, -12984, -8988, -7833, -6384, -888, -502, 4318, 6316, 5834, 3059, -269, -4520, -6259, -7031, -7143, -4608, -2950, -637, -1066, -1274, 970, 865, 136, -1923, -2853, -2607, 119, 541, 4740, 969, -1694, 2242, 2563, 4588, -213, -7449, -4571, 1355, 1002, 2300, -291, 36, 7526, 8270, 6831, 6321, 8567, 8632, 12717, 13594, 20034, 21789, 20050, 22734, 22864, 28285, 31677, 34087, 36043, 36140, 39463, 42721, 45466, 44446, 45846, 51483, 55301, 61437, 70830, 78586, 89839, 105294, 124019, 142292, 163001, 184867, 209516, 241727, 275042, 308556, 354274, 400081, 450156, 500616, 570921, 664761, 790006, 954463, 1201608, 1603520, 2272423, 3217642, 4282805, 5483861, 6637342, 7662172, 8578510, 9186352, 9499046, 9681317]
9899I681317m4646k87998n23890q66017j042603j115323j134922j022226q68323
9890B775369o45904m17559k77526j91067j36697j08195q9536p4151o0319n5888
9880G18527n9276n7004n3666n0057m3997l7973l8442l5186k8358k5176k2450j3696
9868B53246j4865k6393k0479j4059j3359r862p763p033r543j1014j1162l625k581
9855A01508J063n709m511k001n582r713k758k465j284k063m090k922j278j726
9841E6469o417m04n35J999M25k371j024j603N198Q079K235O456O938L73m90K375
9825G7703j070m853l604o080j422n897o021p073l300k746p313p099l702O246K419
9810B6188m508j005l046j133l874l147r6M951M242K35K739L288l024K82K441K31
$$ y = [9681317, 9636671, 9348673, 8824783, 7958766, 6916163, 5800840, 4665918, 3643692, 2775369, 2129465, 1711906, 1434380, 1243313, 1106616, 998421, 908885, 834734, 774415, 718527, 659251, 602247, 548581, 498524, 454527, 416554, 378112, 342926, 314568, 289392, 266942, 253246, 238381, 211988, 191509, 177450, 164091, 154229, 146466, 139433, 129890, 118876, 107714, 104089, 101508, 102571, 96862, 92351, 90350, 84768, 75055, 72297, 69832, 68548, 66485, 62395, 59473, 58195, 56469, 50052, 49648, 49113, 51112, 51537, 49166, 48142, 46539, 51737, 59816, 62051, 68507, 75445, 75818, 75328, 77703, 76633, 71780, 68176, 62096, 60674, 54777, 48756, 41683, 38383, 35637, 28324, 21225, 17523, 23769, 26188, 21680, 20675, 17629, 16496, 12622, 9475, 9379, 14330, 18572, 18807, 21546, 24834, 21810, 22092, 24533, 24764]
9794B4764j441M855P229K104J080M23N06N64o715r98L892l615R4M484R0p384l631
9777B6301K805L043R61q56j767l052m543J995J248r08k854q24J767N613L820J497
9761C4246N328L330N378J6689K1011K9840M2658P3599J22997J38109R5231M9167
9749F37583N216m3088r0330j19939j13003q3197m8146l3655j9785j2213j0342
9738F9101q446r734o947q208m067k238k254L070l72K15p87l888n991l045j901
9723A4508j098N48j01m944J108L623l244Q74R19K916Q30m582m287n016j497Q23
9707A380J062J945J47k931M947O263o73n030l580j589j177M550N929p70j468k55
9691H750K127L145m026K117J984J406J239j146J698j348n499k001O54j834K926
$$ y = [24764, 23323, 28178, 35407, 37511, 38591, 39014, 39520, 40084, 33369, 32371, 36263, 32648, 32742, 37226, 37316, 29932, 26301, 29106, 32149, 33110, 32254, 30487, 27435, 22892, 24887, 26135, 25227, 22373, 21549, 23316, 28929, 32749, 34246, 39574, 42904, 48282, 64971, 85982, 115822, 158480, 232079, 355076, 493185, 588416, 637583, 642799, 599711, 509381, 389442, 276439, 193242, 145096, 111441, 91656, 79443, 69101, 60655, 50921, 43974, 35766, 31699, 29461, 27207, 30277, 29905, 30120, 29333, 25445, 19454, 16409, 14508, 13410, 13958, 13857, 8913, 10021, 13644, 10400, 11274, 12193, 15109, 15939, 11357, 7070, 2054, 557, 1380, 2442, 4387, 4534, 1603, 6550, 12813, 12140, 7110, 3530, 1941, 764, 5314, 11243, 10473, 9005, 8750, 10877, 14022, 9996, 12113, 14097, 15503, 16742, 15596, 17294, 15946, 10447, 8446, 9100, 7266, 10192]
9676A0192J640k20j273k256j870l0M986K672n836o478J020L53J411P250K949k96
9660A4214l582k431J589K427M744L576O373P982O318J8246J7413M230r57q901
9646G1241j2290q184r571q561q326r869p066r1M386R42o45k662j395J043L604
9631A2556R45k502l869k768K774K126k949l51J391R04k865q57M084J810J37k626
9615G940K501m49l999M29q03k441J011M424L057k087o163L385J680J353j986N32
9599H384j654m586K610J713j623L06m170M10J721l490j361n80K004M267o549k473
9583e071M893n34N894M602k519p61m582j856m820k180P389P457M157j636n77p513
9567B343o423L201P462M201K690l792k443J355k949k160j874k00j886K382j603
$$ y = [10192, 11832, 11612, 10339, 8083, 6213, 6183, 11169, 13841, 8005, 1527, 2547, 2900, 4311, 11561, 14510, 14214, 10632, 8201, 9790, 12217, 16961, 20537, 26910, 34892, 41210, 59456, 76869, 81099, 80142, 71241, 58951, 50767, 41196, 32635, 24309, 14440, 7374, 7283, 11669, 12611, 11966, 9304, 7909, 8952, 12556, 13501, 10999, 7130, 4362, 7136, 9262, 6313, 5962, 7353, 8257, 5392, 4535, 8619, 10429, 10566, 7940, 10441, 9992, 5993, 6422, 5619, 3178, 4189, 8613, 11670, 9583, 3420, 6805, 8485, 9838, 7852, 8384, 6730, 2144, 4754, 6467, 4844, 5150, 980, 1390, 3111, -379, -1740, -2320, -316, 3951, -2598, -5071, -178, -712, 5182, 9784, 7265, 6504, 1922, 66, -4754, -6934, 455, 7912, 12069, 10433, 9856, 2343, -4080, -879, 6583, 10784, 13474, 9682, 7239, 8594, 5645, 3485, 1611, 1411, -475, 1907, 304]
9552C04J757M885o20k566J875J0479R529J82j472J729O801N009K009l270l910
9537C2721m348k157n183l472O87L80m016j727q00J125Q47m300l305n341l543K225
9521b07l71j26M639M430J14p973k522P94K243J849k395J349M630L952R170L767
9505B3343M929O279J0771M385M578K386O782L002n308j733m66l90q685j0768r025
9490C0080m437J859m434k437k922L665l19j658L56P99k930l944J724O702K324
9475B4428o111M69O852K822N80k743n316m154j60N50K963m331n6J851p1L653o549
9458A4677o063o61J040J308L843K500L050m346K379q72n077J864j791J721R3j467
9442A2198N092l34j023N218K596M153j600q905k596P258K929l364l741k721J699
$$ y = [304, 2061, 6946, 6326, 3760, 5635, 16114, 25643, 25825, 24353, 26082, 32883, 37892, 39901, 36631, 32721, 28373, 26216, 21033, 17561, 18248, 18628, 14612, 12885, 12085, 13210, 14057, 9757, 6452, 1111, -2432, -207, -578, -704, 3935, 8365, 8479, 506, -2016, -1222, 1021, 2870, 475, 1824, 6454, 10406, 19576, 23343, 28272, 34551, 45322, 49707, 54285, 56671, 63453, 66455, 61147, 59414, 58948, 58558, 49873, 39105, 30080, 25643, 27502, 23068, 20631, 17709, 21374, 21055, 19397, 19753, 20552, 17622, 13678, 15402, 22104, 24428, 18317, 18786, 25638, 28460, 29040, 26297, 20981, 16827, 16667, 17217, 20180, 15849, 15793, 17644, 17573, 21226, 14677, 8614, 7953, 8993, 10301, 14144, 16644, 19694, 15348, 17727, 16855, 11778, 13642, 11851, 13572, 13665, 12198, 17290, 16956, 15933, 21151, 23747, 27900, 26300, 17395, 14799, 22057, 24986, 21622, 17881, 15160, 16859]
9427A6859J643K255L326j315k086L216n557j818j353k685N816m392n957M395P114
9412A9461L302J686J302k657l167M492K534L713l158j636n573k457M31K565M780
9397B5618l088l498l229J737O05J438L953J809M58k26n848j330O18k070J205J116
9381A9268K248L108N049j256k474j446j521m99l054j086N298P62j772j769J848
9366B2704L403J968J639O998k835k836J20K08o127m149O026O166j205l120l011
9351B5949k466J164m21j922k358n64L403N882j003m345p58J054L302L101l661
9336B6357r54j695k857N45Q31j888L889n33N94N89J107p99L73O66o473O9j212
9319A8609l967N882N079M192J71p345m387J318J354K172L749M938J876J117j707
$$ y = [16859, 18502, 20757, 24083, 22768, 20682, 23898, 18341, 16523, 15170, 12485, 18301, 13909, 7952, 12347, 19461, 22763, 24449, 25751, 23094, 19927, 24419, 26953, 30666, 27508, 25872, 20299, 17842, 18273, 20838, 25618, 22530, 19032, 15803, 17540, 18145, 19583, 23536, 25345, 25803, 25577, 19729, 18399, 19017, 16947, 18152, 19268, 21516, 24624, 29673, 28417, 25943, 24497, 22976, 22477, 19423, 18337, 23635, 24397, 22625, 20856, 22704, 26107, 28075, 29714, 36712, 33877, 31041, 31161, 31369, 25242, 21093, 27119, 33285, 32080, 28960, 25949, 23483, 24647, 24226, 22304, 19946, 19382, 22785, 28667, 27664, 23319, 22561, 23615, 26917, 30018, 26357, 25403, 23708, 20851, 21396, 22227, 20339, 24228, 23695, 24289, 24878, 25985, 25186, 25559, 26225, 19752, 19821, 18609, 14642, 20524, 25603, 29795, 29966, 22621, 18234, 19552, 20906, 23078, 26827, 31765, 33641, 34758, 33051]
9304C3051P72N522L785l364k388L232L269M244j425K058J992k917k917j026K236
9289D6124P79K238K472j483k260K208k034M04o49K6K048L239j185L432L451k067
9273E6743k462L496j230L587O674L177J28l850j159N767N235R48o720m167R19
9258F7086k534J099j92j499j255J077L885k619q07J38J684K558J368k751k581
9243F4657q016L527K261J171J635k931O673L385l116K148M448L637J333M61m629
9228G6644l554K70P23J516M967n354j05M111R8K225j197M54K852k820l194M287
9212H1923J160J019k805P21L768K217l61q98M336J202J037p84L906J003L147L993
9196A04584L684K055m14J630k22O269N224M545M861K971N20k886P02N93L658N301
$$ y = [33051, 33823, 39345, 43130, 39766, 37378, 40610, 43879, 48123, 46698, 48756, 50748, 47831, 44914, 43888, 46124, 46903, 49141, 51613, 50130, 47870, 50078, 48044, 48448, 47799, 47825, 49873, 53112, 51927, 55359, 58810, 56743, 54281, 57777, 56547, 60134, 66808, 69985, 70113, 66263, 65104, 70871, 76106, 77054, 70334, 66167, 67086, 64552, 65651, 65459, 63960, 62705, 63782, 67667, 65048, 64241, 64379, 66063, 68621, 69989, 67238, 64657, 56641, 60168, 62429, 63600, 65235, 62304, 68977, 72362, 69246, 71394, 75842, 79479, 80812, 81273, 76644, 73090, 73360, 74083, 75599, 80566, 75212, 75107, 79218, 79316, 81541, 80344, 80798, 83650, 80830, 77636, 81923, 83083, 84102, 81297, 82018, 85786, 88003, 87642, 86744, 91080, 92282, 93319, 92535, 96441, 97444, 100591, 104584, 108268, 110323, 109909, 111539, 111317, 117586, 122810, 127355, 132216, 135187, 135707, 132821, 133523, 134116, 137774, 143075]
9180A43075K229J399l006L897P180L386o43n894k62j091J600L355l119m009n729
9165A42368j872J663Q010j65K70k154j775k631j823j421l751K259K979J988J916
9150A45861L150m052o848k979M102O734L362m308L865N587M468M653M508o05k719
9135A64779R09L620N736Q90l95q29J493M423M601L523L428P208J2185J2004J1863
9120B35438J7987J1781M670R098M095L567Q884Q705P496J437o014M415m526j1483
9106B95550j0023j0106j2556r642l923o361p483k18L467m174p46L827K733Q82
9092B41227k016L505J819k894l939L314R227J82K820L567N03l57J720j10K428
9077B60996N422J2663N569L137N377O239Q337P240O045k27K842N961M676k77j9
$$ y = [143075, 145304, 146703, 143697, 147594, 154774, 158160, 157517, 151623, 151361, 150270, 151870, 155225, 152106, 148097, 142368, 140496, 142159, 150169, 150004, 150274, 148120, 146345, 143714, 141891, 140470, 136719, 138978, 141957, 143945, 145861, 149011, 144959, 138111, 135132, 139234, 145968, 149330, 145022, 148887, 154474, 158942, 163595, 168103, 167498, 164779, 165688, 169308, 175044, 175934, 175539, 174710, 176203, 180626, 185227, 188750, 192178, 199386, 211571, 223575, 235438, 253425, 265206, 269876, 278974, 283069, 286636, 295520, 304225, 311721, 313158, 307144, 311559, 307033, 295550, 285527, 275421, 262865, 253223, 249300, 242939, 235456, 235238, 238705, 234531, 233785, 237612, 240345, 241227, 239211, 242716, 244535, 241641, 237702, 241016, 250243, 250425, 253245, 256812, 257315, 256958, 258678, 258568, 260996, 266418, 279081, 284650, 287787, 293164, 299403, 307740, 314980, 321025, 320798, 323640, 329601, 334277, 334000, 333981]
9062C33981O966J3033M405K797P13j505P837K982P360K406m13r50J626m592k246
9047C74400p97M293K51j507l086L231O695O940P927O070L446P776J0932J5204
9033D41775J5621O918P295Q627Q179Q312J2136J2644R293Q824Q739R051P717M946
9019E70077P35m516p169r43N404j604q18Q35l50k002M395P892N520N476R964J1533
9003F04429J5712J0902J0777J2492J1425J3948J1135J3347J9310J8267J9896K2655
8991G84295J8587J9275J8434J9998J9979K4473J9762K2738J7216J7676J8141J6551
8979A017125J3777J4871J7807J0176P139M301J6082J5568J2674J3005J7206K4251
8967A183982K2078J7693J5247K3810K9444K4690L0030L2995K8817L1696L1031
$$ y = [333981, 340947, 353980, 358385, 361182, 361895, 360390, 368227, 371209, 378569, 380975, 380562, 379612, 381238, 376646, 374400, 373603, 377896, 378147, 376640, 373554, 376785, 383480, 390420, 398347, 404417, 407863, 415639, 426571, 441775, 457396, 464314, 471609, 480236, 488415, 496727, 508863, 521507, 530800, 539624, 548363, 557414, 565131, 570077, 570812, 566296, 559127, 558184, 563588, 561984, 561166, 562001, 561651, 559649, 564044, 571936, 577456, 582932, 592896, 604429, 620141, 631043, 641820, 654312, 665737, 679685, 690820, 704167, 723477, 741744, 761640, 784295, 802882, 822157, 840591, 860589, 880568, 905041, 924803, 947541, 964757, 982433, 1000574, 1017125, 1030902, 1045773, 1063580, 1073756, 1080895, 1085196, 1101278, 1116846, 1129520, 1142525, 1159731, 1183982, 1206060, 1223753, 1239000, 1262810, 1292254, 1316944, 1346974, 1379969, 1408786, 1440482, 1471513]
8956A471513L5083L2603L5187L8599L7138L2567L9222M4096M1692L8691M5936
8945A892327M6900M1197M1702M6391M4838M8554N7895N4517N0720N4816O3549
8934B443406O7227P3186O7896P2726Q3197P9643Q5881R3732J01512J02856J01690
8923C372952J06943J16806J23158J29554J38166J45325J55750J64782J75788J84823
8913D814047J95966K02770K17538K26750K33769K49241K61690K78969K91165L15020
8903G286925L36531L51395L74957M01535M30592M63948M95795N40224N84944O28570
8893A1895416O86035P45940Q10637Q83580R68365J063912J161960J286846J420387
8884B0923078J569643J746972J934410K150596K397039K696641L034813L414326
$$ y = [1471513, 1506596, 1539199, 1574386, 1612985, 1650123, 1682690, 1721912, 1766008, 1807700, 1846391, 1892327, 1939227, 1980424, 2022126, 2068517, 2113355, 2161909, 2219804, 2274321, 2325041, 2379857, 2443406, 2510633, 2583819, 2651715, 2724441, 2807638, 2887281, 2973162, 3066894, 3168406, 3271262, 3372952, 3479895, 3596701, 3719859, 3849413, 3987579, 4132904, 4288654, 4453436, 4629224, 4814047, 5010013, 5212783, 5430321, 5657071, 5890840, 6140081, 6401771, 6680740, 6971905, 7286925, 7623456, 7974851, 8349808, 8751343, 9181935, 9645883, 10141678, 10681902, 11266846, 11895416, 12581451, 13327391, 14138028, 15021608, 15989973, 17053885, 18215845, 19502691, 20923078, 22492721, 24239693, 26174103, 28324699, 30721738, 33418379, 36453192, 39867518]
8876C9867518L860228M367875M949709N617763O368508P203848Q110605R076165
8868H9422219J0032691J0916173J1614410J1984896J1846370J1049450R520945
8861A66387154P272755M453136J314921j866956m807759p279264r148373j0347006
8853A45978608j0915934j0947734j0587102r950630r174686q347624p533724o755675
8845G1765499o037865n398679m823762m321997l879419l481456l136920k835145
8837C7850256k570856k337566k131520j940357j777700j628327j499170j382457
8829B2582303j277441j181565j090914j004853r43590q77431q19914p65027p14379
8820A3907189o68303o26164n86697n46793n10059m81152m49712m24985l94953
$$ y = [39867518, 43727746, 48095621, 53045330, 58663093, 65031601, 72235449, 80346054, 89422219, 99454910, 110371083, 121985493, 133970389, 145816759, 156866209, 166387154, 173659909, 178113045, 179427966, 177561010, 172753251, 165473987, 156325614, 145978608, 135062674, 124114940, 113527838, 103577208, 94402522, 86054898, 78521174, 71765499, 65727634, 60328955, 55505193, 51183196, 47303777, 43822321, 40685401, 37850256, 35279400, 32941834, 30810314, 28869957, 27092257, 25463930, 23964760, 22582303, 21304862, 20123297, 19032383, 18027530, 17083940, 16206509, 15386595, 14621568, 13907189, 13238886, 12612722, 12026025, 11479232, 10969173, 10488021, 10038309, 9613324, 9218371]
8811I218371l68141l43557l24419l09486k92836k69999k54753k51722k29429k19238
8801F354791k08212k01657j98025j76373j69936j68609j57827j50751j48541j44202
8791D630658j31250j22605j22105j23979j22027j16176j07263j04121j02524r4794
8781C483814r0428q7842q9219q4671q0271p7075p1616p3978o5246o4096o5739
8770B633633o0511o0410n5245n2170n1213m4715m8510m0362m1174l8567l9082
8759B101674m5471m1712l0761l1488k9949l0318l0265l1379k5779l1760l4124
8748A738668l2842k7100k5972k7566k5460k0660k0455k0350j8597j5127j3735
8737A490804j7814j6622j3558j1446j3653j7180j5336j7347j8724j8462j8714
$$ y = [9218371, 8850230, 8506673, 8182254, 7872768, 7579932, 7309933, 7055180, 6803458, 6574029, 6354791, 6146579, 5944922, 5746897, 5570524, 5400588, 5231979, 5074152, 4923401, 4774860, 4630658, 4499408, 4376803, 4254698, 4130719, 4008692, 3892516, 3785253, 3681132, 3578608, 3483814, 3393386, 3305544, 3216325, 3131654, 3051383, 2974308, 2902692, 2828714, 2763468, 2699372, 2633633, 2573122, 2512712, 2457467, 2405297, 2354084, 2309369, 2260859, 2220497, 2179323, 2140756, 2101674, 2056203, 2014491, 1983730, 1952242, 1922293, 1891975, 1861710, 1830331, 1804552, 1772792, 1738668, 1705826, 1678726, 1652754, 1625188, 1599728, 1579068, 1558613, 1538263, 1519666, 1504539, 1490804, 1472990, 1456368, 1442810, 1431364, 1417711, 1400531, 1385195, 1367848, 1349124, 1330662, 1311948]
8726A311948j2364j3984k0443j4991k0995j9209j8589j2618j4848j4859j3426
8715A135622j7478j6056j4042j4875j5485j7080j6069j8160j8667j3474j9468
8704I54768k2619k8134k5893j9800k1050j9272j8069j3145j7573j2373j453q80
8692G54507r573l075j926j911j776q019p065l273n91l148j390J886j491o695m601
8677G01859m665p399p202l842j5059q844r237j1945j3251j2634p782j4301q374
8664E77324p153J325k957m296p106o867o601o787l636j278n398l915j73o593l757
8649E12132j524m434l745J164K455k155p295k788J742j756j034p125m934J809
8635D82512n082m006J811k990L01m738n016m956K555j309m920l765m352n28M438
$$ y = [1311948, 1299584, 1285600, 1265157, 1250166, 1229171, 1209962, 1191373, 1178755, 1163907, 1149048, 1135622, 1118144, 1102088, 1088046, 1073171, 1057686, 1040606, 1024537, 1006377, 987710, 974236, 954768, 932149, 904015, 878122, 858322, 837272, 818000, 799931, 786786, 769213, 756840, 755387, 754507, 744934, 741859, 739933, 738022, 736246, 728227, 721162, 717889, 717298, 714150, 712760, 714646, 713155, 706460, 701859, 697194, 689795, 682593, 678751, 663692, 654848, 645611, 633666, 620415, 607781, 599999, 585698, 577324, 570171, 571496, 568539, 564243, 557137, 550270, 543669, 536882, 533246, 531968, 526570, 522655, 522482, 515889, 512132, 510608, 506174, 502429, 503593, 506048, 503893, 496598, 493810, 495552, 493796, 492762, 485637, 480703, 482512, 477430, 473424, 475235, 472245, 472546, 467808, 462792, 457836, 460391, 459082, 454162, 450397, 446045, 445517, 449955]
8620D49955R26k254o463o836K938l404o403l025l728j38o115l837n788J732n633
8605D01927l494j697k071l135o089J35J23l452l647l275n497R3n464o562n043
8590C52852p40K66j743n461k245j946l975n504m885p48L479O144l568n141l270
8575C23515o79m072l18J855j68j258k640k244k592P10M922K247J502J203L154
8560C25137M732J5842K8989L2371J3677L103l762j0977l1062l8105k0968j5122
8548C03855j9463j3833n510o374k147m480j434J34n593n903j685L942O795j291
8534B47013k256m8K752O563O672q71j925j059j145J785K125Q725P733N667m70
8519B81261K238N504R814Q459J4624L2759O3434P7472M5206J5590k620j9295m2552
$$ y = [449955, 450881, 448627, 442164, 435328, 438266, 434862, 428459, 425434, 421706, 421568, 415453, 411616, 405828, 407560, 401927, 398433, 396736, 394665, 391530, 385441, 385576, 385699, 382247, 378600, 375325, 369828, 369921, 364457, 357895, 352852, 352112, 352378, 350635, 345174, 342929, 340983, 337008, 331504, 326619, 325871, 329350, 335494, 331926, 326785, 323515, 322836, 318764, 318446, 320301, 320133, 318875, 316235, 313991, 311399, 312109, 317031, 319278, 320780, 321983, 325137, 329869, 345711, 374700, 407071, 420748, 423851, 420089, 409112, 378050, 339945, 318977, 303855, 284392, 270559, 265049, 258675, 256528, 252048, 250614, 250748, 245155, 239252, 237567, 241509, 248304, 247013, 244757, 244709, 247461, 254024, 260696, 259825, 257900, 256841, 255696, 257481, 259606, 268331, 276064, 281731, 281261, 283499, 289003, 298817, 307276, 321900, 354659, 418093, 495565, 540771, 556361, 553741, 534446, 491894]
8506D91894o7702o0781m1735k3759j7092j6751q708n887K36J127r6k804m4k975
8492B44923j131J562M456J1643J5576K0026K8118N7936J05327J26473P1156L0910
8480G16975M240l0422p6249j09330r1267n9978l5971k4826j5729n823J872J1604
8468B85096K0567K9483K2518P874M058j1703k1740k8573l2923k4200j7008o794
8456B26655l888q268r075L72O561L464O088O461M666M444J0650J6739K6111L2013
8442C22993N0260R3039J72157K60576J85368P1896L7432l9150j23148k03992k09671
8431F17760j43388q4909n0234l2922k2492j6778j1036j2010o749l151r940j0733
8419B13418k269l917M547m858n324k052n427l094J921N746n937K248P54n22j963
$$ y = [491894, 424192, 363411, 321676, 297917, 280825, 264074, 255366, 249479, 249715, 250842, 250746, 247942, 247898, 244923, 243792, 245354, 249810, 261453, 277029, 297055, 325173, 383109, 488436, 614909, 686065, 716975, 721215, 690793, 614544, 505214, 413947, 353969, 317998, 293172, 277443, 271620, 273492, 285096, 305663, 335146, 357664, 365538, 369596, 357893, 336153, 307580, 274657, 250457, 233449, 226655, 222767, 214499, 205424, 205796, 212357, 215821, 221909, 228370, 233036, 237480, 248130, 264869, 290980, 322993, 373253, 466292, 638449, 899025, 1084393, 1156289, 1193721, 1154571, 1031423, 827431, 617760, 474372, 389463, 339229, 306307, 283815, 267037, 256001, 243991, 237242, 234091, 224151, 213418, 211149, 207232, 211779, 206921, 201597, 199545, 194118, 191024, 192945, 198691, 192754, 195002, 195756, 195234, 193271]
8404A93271Q37L711K529N472Q979J2811K4564L4151N7423J05999J17523O4038
8392F31308K7797p733m5341q1298j02471q7764n2838l4736k0687j0680j3698j1943
8380A89916r637k315K18j703o035q507k537m537Q69k166j904K188N280R39j501
8365A58568J160k7l902p603m97n00j636l558l649l11L416K171n329L94Q49n360
8349A34186p342M69j414j254j137j213m050O718q42k584k63O77J753J008N19j771
8333A23460o367k089l024M354K12L09L407k542k285N34p27k405p144m361j18J532
8317A02746j825N26L046l444j329L500K898j594M594J341O270N845p424n333k654
8302A07163o632n464J253J630j458m52j194O780L228k652o73k384m76P99J198
$$ y = [193271, 194108, 197819, 200348, 205820, 214799, 227610, 252174, 286325, 343748, 449747, 567270, 631308, 659105, 651372, 606031, 524733, 422262, 334498, 281660, 246924, 226237, 215557, 201859, 189916, 180279, 177964, 178182, 176479, 170444, 161937, 159400, 154863, 155732, 153566, 151662, 153850, 159130, 160069, 158568, 159728, 159701, 155799, 148196, 147699, 147199, 145563, 142005, 138356, 138045, 141461, 143632, 138303, 138697, 139546, 134186, 126844, 127313, 125899, 124645, 123508, 122295, 118245, 124963, 124121, 121537, 121274, 121951, 123704, 124712, 125231, 123460, 117093, 115004, 111980, 116334, 116546, 116855, 120262, 117720, 115435, 115969, 115242, 112837, 105693, 101332, 101214, 102746, 100921, 101447, 104493, 101049, 99720, 103220, 106118, 104524, 109118, 110459, 116729, 122574, 115150, 109817, 107163, 100531, 95067, 96320, 97950, 96492, 96040, 94846, 101626, 104854, 102202, 101529, 99145, 98669, 99468, 100666]
8287A00666k082M53k733N72K216K126O89k329o276j400N783M044L065O35K334
8272A07763L990n0m142L32q55l232l667L550l748l631k201J608j92m46J617R08
8256I7604l92m019j976j325j202l178k54K807m946m572K892M375k025k376J639
8241H3052Q84m566o312M740k695k280M378N323j216k255J993p31R50O63m024O606
8225H4510Q118M924r81n699K045k231l291n002M43L867j436o281q86N624k558
8210H1166m720M384M875m08L959O526n657o719j660m969n338j673j232k589m16
8195F5529K875k960K92J312P060m60j567K068k855n18m85j100J77j872K212O47
8179G0355L178l150l210l146L518J743L190K926k689J273J278L73n385j107j221
$$ y = [100666, 98584, 99037, 96304, 96876, 99092, 101218, 101907, 99578, 93302, 91902, 97685, 101729, 104794, 105429, 107763, 111753, 111703, 107561, 107893, 107038, 103806, 100139, 103689, 99941, 96310, 94109, 95717, 95525, 95079, 96696, 97604, 97212, 93193, 91217, 89892, 88690, 85512, 85258, 88065, 83119, 78547, 81439, 85814, 83789, 81413, 83052, 83936, 79370, 73058, 77798, 75103, 72823, 77201, 82524, 81308, 79053, 81046, 80315, 81265, 81928, 77904, 84510, 92628, 97552, 96571, 90872, 92917, 90686, 87395, 82393, 82836, 86703, 85267, 78986, 78100, 83724, 81166, 76446, 80830, 85705, 85297, 89256, 95782, 90125, 83406, 81746, 76777, 71439, 69766, 68534, 65945, 65529, 68404, 65444, 65736, 67048, 74108, 73648, 72081, 74149, 71294, 70776, 70291, 69191, 69368, 67496, 69708, 70355, 73533, 70383, 67173, 64027, 67545, 69288, 72478, 75404, 72715, 73988, 75266, 75639, 70254, 69147, 67926]
8164F7926L929L664K8j026m731l487m814O279Q18J847M594J484m086m226k723
8149F5476O325R37k977K412j066j178k37K700L382n44p56K541L9m809N38N29J40
8132G3452k733m529J10J059N040K315p308l663L111J245k553k281k428l767m833
8117E2237m027J147P078j12J16k40J235K334J891L457J708l808J691k970o71j619
8101E9447J663J05l73L371N857J087l851k742L463O59n637j0312m95N786J970
8086E9998J758r21n14j061J58n064K104N283J42j624j690K034L180r36j204j868
8070E9775j494l212j239L428l688o690k987M313N596n200m808M625j010K702K702
8055E2813K254j31j062m557l608l45M259j962l719l993L254K220M342N57L057
$$ y = [67926, 71855, 75519, 75547, 74521, 69790, 66303, 61489, 67768, 68586, 70433, 75027, 76511, 72425, 68199, 65476, 71801, 72738, 69761, 72173, 71107, 69929, 69692, 72392, 75774, 75230, 74474, 77015, 77054, 72245, 72783, 73312, 73452, 70719, 66190, 66300, 67359, 72399, 74714, 67406, 63743, 66854, 68099, 65546, 63265, 60837, 57070, 52237, 48210, 49357, 56435, 56323, 56439, 56199, 57434, 59768, 61659, 65116, 66824, 63016, 64707, 61737, 61066, 59447, 61110, 61215, 60842, 64213, 70070, 71157, 67306, 64564, 68027, 68686, 63049, 52737, 52242, 58028, 59998, 61756, 60835, 60321, 59260, 59418, 54354, 56458, 61741, 61883, 60259, 58569, 60603, 63783, 62847, 61643, 59775, 58281, 55069, 53830, 57258, 53570, 46880, 43893, 48206, 53802, 48602, 43794, 48419, 47409, 50111, 52813, 55067, 54936, 53874, 49317, 45709, 45364, 49623, 47661, 43942, 39949, 43203, 45423, 49765, 50322, 53379]
8040E3379J644K046K437K50j249J147M26L943J171J623k966o700l025p3P6o383
8024D7746j524J790R43j069K166j63j932m76k039l343l417M540L803J386M46K582
8008E1439m250J484K895K305l74j261m133J267o21k25k046K550J390j518M481
7993E3383P543N4J464j743l16n20o37l83l913k745K106p74J02j679n354J66M943
7976E1697O80k035k483J024J42n10m077J698r98N871O040m867m390n532k410R08
7960D0758J067N014N3R94K472K91m096j251p06N635r37o243J816o21n460p059
7944C1727j240O772L572j43L480R09K733K228L107K518k760o29l537l024k189
7929D3524R60P45j809r50J091k090p79N517L795J96o149k221J60n24l042M457
$$ y = [53379, 55023, 57069, 59506, 59756, 58507, 59654, 60080, 64023, 65194, 66817, 63851, 57151, 54126, 54053, 54129, 47746, 46222, 48012, 48955, 47886, 50052, 49889, 47957, 47481, 45442, 42099, 38682, 43222, 47025, 48411, 48857, 51439, 47189, 48673, 51568, 53873, 53499, 52238, 48105, 49372, 48751, 48526, 46480, 49030, 50420, 48902, 53383, 60926, 60980, 62444, 60701, 60385, 59865, 59228, 58845, 54932, 52187, 54293, 53519, 53621, 51942, 46588, 46754, 51697, 52377, 50342, 47859, 48883, 49025, 48515, 44438, 46136, 45138, 51009, 57049, 52182, 47792, 42260, 39850, 40758, 41825, 46839, 46892, 47886, 50358, 50649, 46553, 45302, 44596, 50231, 49294, 43051, 44867, 44246, 38786, 31727, 30487, 37259, 40831, 40688, 44168, 45077, 47810, 50038, 53145, 55663, 52903, 52274, 48737, 45713, 43524, 44484, 45229, 43420, 42470, 43561, 41471, 40692, 46209, 50004, 50200, 44051, 41830, 41990, 41466, 38424, 42881]
7913D2881n197k496J543O300p76l466j89l577o83J161K944L341K254J192j381
7898D3851J005j848k350N072j758k913m57j195K063M310Q87k635J436p19k686
7883D2063K77K364O94n63j542k093l589n40k964M997K480L670J733k410n990m66
7867C8121J515j611J924j057o191Q95P71J59j896Q51K427m35J934O91j667Q54
7851C7285L68l6M641j001j170J920j400l794j808m07l20r43K147L777j134J697
7835C9822l867m579P05J125j299j432J926j874J7J524M696N940K03m830m253j626
7819C2198k277j142Q98K121N933j487o44R69K986J386R97K422l278n582l353j
7803C2146r84J406K094L833K742m832J79l318k430K576J833j832k804L261M158
$$ y = [42881, 37684, 35188, 36731, 43031, 42255, 38789, 38600, 35023, 34340, 35501, 38445, 41786, 44040, 45232, 43851, 44856, 43008, 40658, 45730, 43972, 41059, 40602, 39407, 41470, 45780, 46667, 44032, 45468, 44749, 42063, 42340, 44704, 45398, 44835, 43293, 41200, 37611, 37071, 34107, 39104, 41584, 45254, 46987, 44577, 38587, 38121, 39636, 38025, 39949, 38892, 32701, 33596, 34367, 34526, 32630, 33481, 35908, 35473, 37407, 38098, 36431, 37285, 37653, 37617, 42258, 41257, 40087, 42007, 40607, 36813, 35005, 34598, 34278, 33335, 35482, 39259, 38125, 39822, 35955, 31376, 32081, 33206, 31907, 30475, 32401, 30527, 30544, 32068, 36764, 42704, 42907, 38077, 33824, 32198, 29921, 28779, 29677, 31798, 37731, 36244, 35600, 36569, 39555, 40941, 41938, 44360, 41082, 35500, 32147, 32146, 31162, 32568, 34662, 38495, 41237, 36405, 36584, 33266, 30836, 33412, 35245, 33413, 30609, 33870, 38028]
7788C8028J070k493r1j881j61m990m244j467P22O710J201k56m223l438l030K062
7772B3519P603K111m198q69M054m083m660j505j406K070q63o077k921J481N871
7757B0127M837J711j783j29J883l02j296k820J227M821J417O13k713j339l522
7742B2732r28o1J526N496j508K011L65k159k825l775n73K777O333K537J670K160
7726C5778k856o085k262P320L004j429o528J843M765N41q85l81k686p27o9l774
7710B5569k546J001q38N263J899o164j213N208j629k639J878L173M566l603n196
7695B4729n793n22K381p52L596J499J503j645j601k830M035R46L681K227O06l066
7679B8994m886k317k967P07j046o47N201l05Q39L198j154k684n65K407L166j066
$$ y = [38028, 39098, 36605, 36514, 34633, 34472, 29482, 25238, 23771, 24493, 31203, 32404, 32148, 27925, 24487, 21457, 23519, 31122, 33233, 29035, 28166, 32220, 28137, 23477, 21972, 20566, 22636, 21773, 15696, 12775, 14256, 20127, 24964, 26675, 24892, 24763, 26646, 26344, 25048, 22228, 23455, 28276, 29693, 30306, 27593, 26254, 22732, 21804, 21743, 23269, 28765, 27257, 29268, 29633, 27474, 24649, 20874, 20301, 23078, 29411, 31948, 33618, 35778, 32922, 26837, 24575, 31895, 34899, 33470, 26942, 28785, 33550, 34091, 33206, 32825, 30139, 29412, 29343, 25569, 23023, 24024, 23186, 28449, 30348, 24184, 22971, 28179, 26550, 23911, 25789, 28962, 33528, 29925, 24729, 18936, 18414, 20795, 20043, 23639, 25138, 26641, 24996, 23395, 20565, 24600, 25546, 29227, 31454, 32060, 28994, 24108, 21791, 18824, 19531, 18485, 17838, 23039, 22734, 23573, 26771, 25617, 22933, 22368, 24775, 27941, 26875]
7663B6875l231n456j829j140J549j92N005m79Q60p70j016l100j952K082M851L979
7647B6036J99k18J139m464n403M129L453k499j861J022m278M97j696j911k736
7632A1409O299P273J61k172Q77n069k079M661L753j466K130R7p72l564j29L677
7616B5086J50k949l212P62L449O01J098j796L378J313n042o531k119j404K663
7601A5447J923k00r36k691L508L355J953m117J908j69o37P417K722o353j319m757
7585A7054R80Q93K332O44K449K215J09o05k922o311K146N516K207L283N84Q91
7569C1465L265k165k067j55j776o633l363J434p06l779o58J544k522K825o06l229
7553A2874K79J617K571L95l4k305l72k04K589m706J076k686M052K344j998j21
$$ y = [26875, 23644, 18188, 16359, 15219, 16768, 16576, 21581, 21102, 21962, 21192, 20176, 17076, 15124, 17206, 22057, 26036, 26235, 26017, 27156, 22692, 17289, 21418, 24871, 22372, 20511, 21533, 17255, 17752, 16056, 14145, 11409, 17708, 24981, 25142, 22970, 23847, 18778, 16699, 21360, 25113, 23647, 25777, 25874, 25102, 21538, 21409, 25086, 25236, 22287, 19075, 19837, 23286, 23887, 24985, 23189, 26567, 27880, 22838, 16307, 14188, 12784, 15447, 17370, 17170, 16234, 13543, 17051, 20406, 22359, 18242, 20150, 19981, 19344, 26761, 29483, 23130, 21811, 17054, 18034, 18927, 21259, 21903, 24352, 26567, 26676, 26071, 23149, 16838, 18984, 24500, 26707, 29990, 30574, 31465, 34730, 32565, 30498, 30343, 28567, 21934, 18571, 20005, 19299, 15520, 14862, 16406, 13884, 16709, 16103, 12874, 13153, 14770, 17341, 17736, 17702, 15397, 15025, 14821, 17410, 12704, 13780, 11094, 15146, 17490, 15492, 15371]
7537A5371J742L984K165Q87K397M10K075k497j374R31n66J753k228r689j667N044
7521A8738N613K408k055R44k802o284n070M332K842R89m046k292L622k336k093
7506A2510K370M813q47j176j585n394qQ023Q09N05K640j614k951K569L539K523
7490B6726P66l7m08k280m479m437L491L423j540m347m337r62Q29O537M987K301
7474B6233m626n871n03K652k098m6j047p90j641l147M000N311N940P2o597l692
7458A4150k63j088jQ47P3k899P66N394k076J46K5J583r16K113m158k888K192N516
7440A8516j286l653k412o37O903k175N098N267L20l585m225O75m67j143l96m200
7424A2600j722n92O54K395J661M355N15J15r14l362j09m20J386j109k519N75O61
$$ y = [15371, 17113, 21097, 23262, 24149, 26546, 26956, 29031, 26534, 25160, 26091, 25525, 27278, 25050, 15361, 13694, 18738, 24351, 26759, 24704, 25648, 22846, 16562, 11492, 15824, 18666, 19655, 15609, 13317, 16939, 14603, 12510, 14880, 19693, 18846, 17670, 16085, 10691, 10683, 18706, 19515, 20020, 22660, 21046, 18095, 20664, 24203, 26726, 27492, 27455, 27047, 24767, 20288, 15851, 19342, 22765, 21225, 16878, 12541, 11579, 12408, 18945, 23932, 26233, 21607, 15736, 15233, 17885, 15787, 15741, 14694, 13904, 12263, 9116, 13116, 18427, 24367, 24439, 17842, 14150, 13887, 12799, 12798, 13645, 13718, 10819, 11585, 16979, 14903, 15049, 15074, 16657, 15741, 17854, 13696, 10808, 13000, 18516, 17230, 13577, 11165, 10528, 17431, 15256, 20354, 25621, 25941, 22356, 18131, 18806, 18339, 17196, 16800, 12600, 10878, 10286, 10940, 13335, 14996, 19351, 19866, 19981, 19067, 15705, 15596, 15176, 16562, 15453, 12934, 13509, 14170]
7407A4170J64j885j846j063j966K324M315L351N402L031m365m8J844K820p484
7392A8764m617P43L765k80l952k507k125J469J558r32K619j520l794M888O00N55
7376A5234o307j224K958P40P9O171O792k452n291m071L228k346l972O02R187R25
7360B0253j481k053J653L986o7J029M6m605l025k468k94r24k133o09L269K483
7344A5060J069J773k7n19n36j908m621p91r33P22J632K414M057k13k168o71l390
7327A0950J771J184J519P56K538J780l000k867j186J21j278K979N010L094k435
7312B0936K477M160k406o465k580K488k547m899j591O232j233o37M422k529MK630
7296A8462K36J057O00J312j817Q87K1n70j374n569Q13l244K52L330l582p55k52
$$ y = [14170, 14334, 12449, 10603, 9540, 7574, 9898, 14213, 17564, 22966, 25997, 21632, 21584, 23428, 26248, 18764, 14147, 14890, 18655, 18375, 14423, 11916, 9791, 11260, 12818, 11886, 14505, 12985, 9191, 14079, 14679, 15234, 8927, 7703, 10661, 11401, 11480, 17651, 24443, 21991, 16700, 12629, 15857, 13511, 9539, 10141, 19328, 20253, 18772, 16719, 18372, 22358, 22291, 23320, 23366, 18761, 15736, 13268, 12974, 12050, 9917, 9308, 12577, 15060, 16129, 17902, 17875, 17356, 16820, 14912, 10291, 9500, 8567, 9289, 10921, 13335, 17392, 17179, 15011, 14340, 10950, 12721, 13905, 15424, 16180, 18718, 20498, 17498, 14631, 13445, 13566, 12288, 15267, 20277, 23371, 20936, 23413, 27573, 25167, 18702, 16122, 18610, 16063, 11164, 9573, 15805, 14572, 13935, 18357, 15828, 15832, 18462, 18698, 19755, 20355, 21667, 19850, 20737, 20758, 20188, 18814, 13245, 14058, 10814, 11066, 14396, 10814, 10059, 9807]
7279I807n07l40K227o19K327L038k36l928l881k858L468L116O37m34j244q7K322
7262A2808k29N7J200J364l8M899K347l981m10R36k128J24Q80l117J976N39o517
7245A0710j711N078K338M904J471O22m044l163j78l378J985O191k415m741K590
7230A6259l92L555k86o951n272k132M662L799j279J643L40P33l420j011j281J695
7214A0662L569M430P58N33O37J50l87j057m437R20q76o853m223K078j349Q87K379
7197G821L965k74l822j139M712Q34K95j141n051k246L3K818L62O339k92k850j623
7180H741l033J530M924K345j622n372L475J723p79m577n971K577J050j019M64
7165D456j818M021M187L000J322j985M99K017n85k082k671L493k298J506J171
$$ y = [9807, 9300, 8960, 11187, 10568, 12895, 15933, 15697, 11769, 7888, 5030, 8498, 11614, 12251, 11817, 10573, 10486, 12808, 12579, 12636, 13836, 15200, 15162, 20061, 22408, 18427, 18017, 18953, 16825, 16949, 17829, 14712, 16688, 17227, 10710, 8999, 14077, 16415, 21319, 22790, 23412, 19368, 16205, 16027, 12649, 14634, 20825, 18410, 13669, 16259, 15867, 19422, 19136, 12185, 6913, 4781, 9443, 13242, 11963, 13606, 13946, 14679, 11259, 10248, 8967, 10662, 14231, 18661, 19419, 19952, 20589, 20739, 20352, 19295, 14858, 15778, 14902, 8049, 3826, 5904, 4555, 5442, 7821, 11786, 11512, 7690, 6551, 11263, 12097, 12392, 11251, 6200, 3954, 3987, 6805, 7167, 13506, 13214, 10364, 8741, 5708, 7238, 12162, 14507, 12885, 7513, 10988, 12711, 11932, 7355, 1384, 3961, 5011, 3992, 4456, 2638, 6659, 10846, 13846, 15168, 13183, 13682, 15699, 15114, 13032, 10361, 13854, 11556, 13062, 14233]
7150A4233n76p550o326q73M073P573M225M23p87m356m14l16L675k501k494L35
7134H344L791N155m352n82r25K588K315J296j416p238r857J523P454J286K564
7119A1946q2r16n433k953M864L284q9L881J48P81J958j889L274p84l68k367m163
7102A1092k682j634K711n81l312J97m405K33L761p69M102j396J466P92m21n680
7086C474k634L238K60k633K503N223J596L473n29l949k059L54j761j937M473j921
7070G171k525o65L550j586k624J618J699J821j363L196k511k526K312N37J791
7055I895J810p9M15m55o12K818J822n01m184l2Q33o104l418q81L696K33N123O531
7037A6910N70m273r473r64K372m526o39L042N52K92o25m191j15K219L016K552
$$ y = [14233, 13657, 6107, -219, -1092, 2981, 10554, 14779, 15202, 14415, 10059, 9645, 9329, 13004, 10503, 8009, 8344, 12135, 17290, 12938, 12356, 11431, 14019, 16334, 17630, 16214, 8976, -881, 642, 8096, 9382, 11946, 11864, 10948, 5515, 2562, 7426, 10710, 10621, 14502, 14650, 15431, 17389, 15500, 18774, 17990, 17622, 15255, 11092, 8410, 6776, 9487, 8906, 5594, 5791, 1386, 1619, 5380, 4611, 8713, 7317, 8783, 9575, 9154, 3474, 840, 4078, 4338, 1705, 4208, 9431, 11027, 14500, 13971, 10022, 7963, 8317, 6556, 4619, 9092, 7171, 4646, 3981, 7531, 5945, 3321, 4939, 6638, 8459, 7096, 10292, 7781, 5255, 7567, 8104, 9895, 11705, 11626, 12041, 11586, 10974, 13792, 15614, 15113, 10929, 10897, 11730, 5626, 2208, 1327, 5023, 5256, 10379, 16910, 17480, 13207, 3734, 2770, 5142, 616, -23, 3019, 3571, 3863, 3238, -953, -1068, 1151, 4167, 6719]
7021F719PJ308K608J568m772L36J706j5k26j429l154L80K4l024K690J185K89O718
7003A2918J33J937J586l147l044k728J119M520m008m1K682l442O14M815j563n5
6987A2296J486L103j747k753m611J98N303N18o789n625K319K070j930K590N549
6972A1977O658L313l247l310m499m970j118M374L374k116n13M41j876k987O009
6957A1510O826k46m347l706j132l914p97q1r15J003J847L158K468L728k322m522
6941H558K528L528l41j578l817m093n17J549L952J838k142k787K002K180l11l78
6925A0171K045J293l690J305J526k425k548o589L666K152R50l61K598m24l745
6910E924j718N791q56m646r56O091O670L095l038m666k158j410j500P03J879k195
$$ y = [6719, 6726, 8034, 10642, 12210, 7438, 7774, 9480, 9465, 9239, 7810, 4656, 5036, 5060, 2036, 4726, 5911, 6200, 12918, 13051, 14988, 16574, 13427, 10383, 7655, 8774, 13294, 9286, 9245, 11927, 8485, 9099, 13914, 12351, 12296, 13782, 16885, 15138, 12385, 7774, 7972, 13275, 13793, 7004, 1379, 3698, 5768, 3838, 6428, 11977, 18635, 21948, 18701, 15391, 10892, 5922, 4804, 9178, 12552, 10436, 9923, 10364, 8488, 5501, 11510, 18336, 18090, 13743, 10037, 8905, 4991, 4194, 4113, 3198, 4201, 6048, 9206, 11674, 15402, 13080, 8558, 11086, 14614, 14273, 12695, 8878, 4785, 4268, 5817, 9769, 11607, 9465, 6678, 8680, 10860, 10549, 10171, 12216, 13509, 9819, 11124, 12650, 10225, 7677, 1088, 4754, 6906, 7856, 7495, 10093, 9669, 5924, 4206, 9997, 9141, 4495, 3539, 9630, 16300, 19395, 16357, 11691, 9533, 8123, 6623, 7326, 9205, 7010]
6894G010k848j696J920n39k4J008J688M28k41M849K335k444k247k550l625k93
6878B731O665L272k52k866m604j222L581J609j464k681m095K228K157J81j809
6863C431J75K559j878M87M635J332l400k264J836P23q0j279q17J025M150P52r51
6846A0436j694r06j421m624L576L314l920R1J657l398j319j67J03n94K346J472
6830D952l477j341Q7O035N319J18Q54l115o085N41L049k317L660L368j488j031
6814I129J429O37L310o705k48k863j88l389J328O485j500k086j994L749K7l734
6798C387J863L086K730N049k059k667O30j758m555M538N937L699P50m724l026
6783A2880m650l152K082N6m467m802l251k128N223K496K173L470N133L050m44
$$ y = [7010, 4162, 2466, 4386, 3847, 3823, 4831, 6519, 6947, 6706, 11555, 13890, 11446, 9199, 6649, 3024, 2731, 9396, 12668, 12416, 9550, 4946, 3724, 7305, 8914, 7450, 4769, 674, 2902, 5059, 5240, 3431, 3606, 6165, 4287, 4774, 9409, 10741, 7341, 5077, 6913, 7636, 7556, 6277, 5460, 6485, 10635, 11387, 10436, 8742, 7836, 6415, 1791, 5367, 8681, 4761, 4852, 6509, 3111, 1792, 1625, 1728, 1134, 3480, 4952, 1475, 134, 221, 6256, 11575, 11693, 12547, 9432, 3347, 3888, 6937, 4620, 8280, 11648, 10160, 9129, 10558, 11195, 14505, 7800, 7552, 4689, 4501, 1112, 2440, 8925, 7425, 5339, 3345, 7094, 7121, 3387, 5250, 8336, 11066, 16115, 14056, 11389, 12019, 10261, 5706, 10244, 16181, 19880, 20630, 15906, 12880, 8230, 5078, 7160, 7216, 2749, -2053, -5304, -7432, -2209, 287, 2460, 5930, 11063, 14113, 13669]
6768A3669n16l03k525k851o6L109j159J452j993l694J74K812K44J5k773l541k613
6751e59O222K942l090n73k598k261p27J435L030L390R87j105k166L908p52o03
6735G480m476L16l83j534j483J329M342j109j940O14J557j291l518r84K919K296
6719D135O643O082m616r105J717O543n87L709L114k383n464J674M38m106r46N088
6703A1936M918K925k359o222l734l893o714K702Q534Q446l30j496p30k978L001
6688A4006M884k792r57M051l650m192j139k708p49l547j550J143J570n156k263
6673c049j850j933K991J785J00p395n149L254J1304O045Q09R007L517N38m829
6658A5145l767n906n094J158K174k03K211K76m226l093l007l011P92P430R510
$$ y = [13669, 13153, 12850, 10325, 7474, 7408, 10517, 9358, 10810, 8817, 5123, 5297, 8109, 8353, 8368, 5595, 2054, -559, 5663, 8605, 5515, 4942, 2344, 83, -644, 791, 3821, 7211, 8198, 7093, 4927, 8835, 8083, 7480, 3004, 3320, 2937, 1403, -80, 1249, 5591, 4482, 2542, 3156, 4713, 3422, -96, -1080, 1839, 4135, 10778, 16860, 12244, 3139, 4856, 11399, 10812, 14521, 17635, 15252, 9788, 11462, 11900, 7794, 6848, 11936, 16854, 19779, 17420, 11198, 7464, 3571, -3143, -441, 8093, 16539, 16209, 14713, 13983, 11005, 14006, 18890, 16098, 15141, 19192, 15542, 11350, 10211, 7503, 6754, 3207, 1657, 2800, 4370, -786, -3049, -4899, -6832, -3841, -2056, -1956, -9351, -14500, -11246, 58, 6103, 6912, 15919, 19436, 19974, 15145, 11378, 5472, 378, 1536, 3710, 3507, 5718, 5994, 1768, -1325, -4332, -7343, -6551, 879, 10389]
6643A0389L065m876j363K784m79L12j847o30k025P56N198M714L000p75K979L699
6627B4901J871o184l457k945l243m527n728J807L335k941J960K665j568l559o756
6612d369p625q4K145M786N906J260l392j956Q54L960m70m008K093M070L224N657
6596A2051n791m123J904N005J356o718n226N551J0587L70o800q102n008L397L938
6581B391m885j040j264M743P478M302K713l796n187j245L423L426j621n4k626
6566F758k491k268M13K466j346n34o53J199P13K092J186J343N37l631m300K866
6550D350m58k391n260o40O982N275R87J00K26l399j135o19M07J082K3L46K706
6533H582j926l165k749l91n63k323M833j205k629K136J736k409K769k436m3R38
$$ y = [10389, 13454, 8578, 7215, 9999, 9520, 9832, 7985, 7355, 5330, 6086, 11284, 15998, 18998, 18223, 21202, 24901, 26772, 20588, 17131, 14186, 10943, 6416, 688, 2495, 5830, 2889, 4849, 7514, 5946, 2387, -4369, -11994, -12078, -9933, -5147, 759, 2019, -1373, -3329, -2475, 1485, 1015, -2993, -900, 3170, 6394, 12051, 6260, 2137, 4041, 9046, 10402, 3684, -1542, 4009, 14596, 14966, 8166, 64, -4944, -1547, 2391, -2494, -3534, -4798, -55, 7423, 11725, 14438, 10642, 5455, 4210, 7633, 11059, 9438, 9384, 6758, 4267, 1999, 2412, 4878, 3532, 2998, 2345, 3544, 4257, 6349, 7535, 8878, 9415, 5784, 1484, 4350, 3892, 1501, -3759, -4399, 2583, 7858, 8845, 8945, 9171, 5772, 4637, 4018, 4425, 5507, 5530, 5876, 8582, 6656, 3491, 742, 351, -212, -2535, 2298, 1093, -1536, 600, 2336, -73, 2696, 260, 217, 1155]
6517A155K010l002N79L932o51o62k891m21M470m5J77L026K837K81l558k560m813
6500a36j46N346K491n151m665L631K321m071k195J658p98Q43J367L145N697j695
6484G642m352J297J248m070j576K272k519j777n358M344M813O045j830n507k550
6469a878K384K043J353p41L372k61j988J202j258J192k699q64j662J240N909J098
6453H442k795J90J063o185k208J213J355j832K148L160L623k009L316j916m244
6438C321j388K105L602l743j83M82L958l904N16n84J05j819K152L616L829J063
6422A3128j311l56n640m465k539O08L944l130j437J659J086K090J219P83M69N82
6406F690j833l714l735k554n09j505J682L596P091M332l333J079r53m48k776j943
$$ y = [1155, 3165, 163, 742, 4674, 4023, 3361, 470, 49, 4519, 4474, 4651, 7677, 10514, 10795, 7237, 4677, -136, -282, 5064, 7555, 2404, -2261, 1370, 3691, -380, -2575, -917, -1715, -872, 495, 3640, 9337, 7642, 3290, 4587, 5835, 1765, 189, 2461, -58, -1835, -7193, -2849, 1964, 8009, 6179, 672, -1878, 506, 2549, 3902, 3161, 6533, 6272, 4284, 5486, 4228, 5420, 2721, 1857, 195, 1435, 7344, 8442, 5647, 5837, 6900, 715, -1493, -280, 1075, -757, 1391, 4551, 8174, 6165, 9481, 7565, 3321, 1933, 4038, 7640, 3897, 3714, 4196, 8154, 4250, 4766, 4182, 4287, 2468, 4620, 8236, 12065, 13128, 11817, 11461, 5821, 1356, -1183, -575, 3369, 239, -1198, 461, 1547, 3637, 4856, 5639, 6108, 6690, 4857, 1143, -2592, -5146, -5655, -7160, -5478, -1882, 5209, 9541, 6208, 7287, 6334, 5886, 3110, 1167]
6390A167m301R29q99K062P372L064m452R71k450l924L426j166J427M030j840m833
6374E83J360l908k659J541Q94j596J163J254O078L678n492j765L658J226J354
6359G369j333k539l362L6l061k268j64j101j78J983K950k599L661K827p59j104
6343C58j261k950L354K419n756k573J542L381J258L925L036m216l757r68J693
6328e15J071j251n0L673L392j111l424L286n88n446L83R81n24O17M239O279M42
6311A1454j066r53j46j066l169k147m91K897M020n6o08j059k610j432N21K524
6295F613j133l51n854j889K121l184K074N320J799j911l372K492J47k076m744
6280c948j855L746M597o7k039K148j100M19r9j095O138J890m199k981K656L570
$$ y = [1167, -3134, -2205, -3104, -1042, 6330, 9394, 4942, 5913, 3463, -461, 2965, 1799, 3226, 7256, 5416, 583, 1943, -1965, -4624, -3083, -2189, -3785, -2622, -1368, 4710, 8388, 2896, 1131, 4789, 6015, 7369, 6036, 3497, 135, 171, -2890, -5158, -5322, -6423, -6601, -4618, -1668, -4267, -606, 2221, 1462, 358, -903, -3853, -499, 1920, -3836, -6409, -4867, -1486, -228, 3697, 6733, 2517, -1240, -2208, -515, 556, -695, -745, 2928, 6320, 5209, 1785, 5071, 4483, -963, -580, 401, -123, 494, 4733, 11012, 11454, 10388, 9435, 9289, 8223, 5054, 2907, 2416, 5313, 9333, 9277, 8669, 7610, 5000, 3568, 4089, 6613, 5480, 5129, -725, -2614, -493, -3677, -1603, 3717, 5516, 3605, 233, 2725, 2872, 796, -3948, -5803, -2057, 2540, 2473, 434, 2582, 1482, 1901, 1802, 707, 6845, 8735, 4536, 1555, 4211, 7781]
6264G781J159K300m428l586l986k098P056m646p725k449M054M990M257l80j19
6249B180K829J537n33N68n69k092L023k528o442K058P165L109n736l84J577N50
6233F312p47l508l121N417j85k769k731K251O41k852K410R61o166j438J988q27
6217d364l93L461N184k168n830k453J399L70j833L297N167n21p71M647r93m216
6201a7k673L711M13J224J605J751n369J07l385L455K367M23k869j545M028k835
6185C91o962k97M086k216l022K803Q040j101m423j397J266j883k829O530P045
6170F031P73j246k230q073j904L963L426m65N19Q95j049k5M986L510M11k944k471
6153D107m093j459k23j892J457L520M035j110o215l619N164P303L917j607k278
$$ y = [7781, 8940, 11240, 6812, 3226, -760, -2858, 4198, -448, -8173, -10622, -6568, -1578, 2679, 2299, 2180, 5009, 6546, 6013, 6581, 6012, 3920, 6943, 4415, -2027, 31, 7196, 10305, 4569, 4185, 5762, 6312, 5565, 2057, -1064, 4353, 4168, 1399, -1332, 919, 1560, -1292, 1118, 2079, -4087, -5525, -3537, -4364, -4757, -1296, 3888, 1720, -4110, -6563, -5164, -4794, -6627, -3330, 1837, 1316, 545, 5192, 4199, -17, -2690, 1021, 1434, 2658, 4263, 6014, 645, 752, -2633, 822, 3189, 3612, 743, -802, 3226, 391, -6571, -6868, -2782, -4998, -8020, -5217, 2823, 1722, -2701, -4098, -2832, -4715, -7544, -1014, 6031, 6804, 5558, 3328, -4745, -6649, -2686, 740, 275, 794, 1689, 640, 615, 5601, 9111, 9522, 6578, 4107, 14, -1445, -1668, -3560, -2103, 1417, 5452, 4342, -1873, -5492, -328, 6975, 10892, 9285, 7007]
6138G007L8o221l124Q02m99J744J046J418L223l582r69l528j782L841J384L291
6122D089m701k278j076j171L97N459M337k835K918Q153j287o576o42M302L225
6107A2314l272n254j093R28K246j914K386j100j489N63m288l246K619M767l144
6092A023k334J842J87j535N896J055j648k512q94L528J576m525n40o99l660L975
6076G35J549N37k320K864j230n339o69l701m690O356M064J001k781M843N708o83
6060F244k335m109k625J38J951J727L731J207j856l56J903O929k249n704l548
6045A048k28J022j446n67K200K541J43P47l435j433P61o56l620j714J677m4m42
6028c446l466n323L026K203jK138J824K939k405k908K565J034q39L285L173k492
$$ y = [7007, 7045, 824, -2300, -1498, -1997, -253, 793, 2211, 5434, 1852, 883, -2645, -4427, -586, 798, 4089, -612, -2890, -3966, -5137, -4740, 719, 5056, 2221, 5139, 13292, 12005, 5429, 4787, 9089, 12314, 9042, 3788, 2695, 3623, 5869, 3955, 6341, 5241, 3752, 4315, 27, -3219, -600, 4167, 1023, -1311, 531, 718, -817, 5079, 6134, 4486, 1974, 1080, 4608, 6184, 1659, 1119, 420, -3240, 735, 2284, 2821, 501, 3365, 2135, -3204, -3873, -7574, -12264, -5908, -1844, -843, -3624, 1219, 6927, 6244, 3909, -200, -2825, -2687, -736, 991, 4722, 5929, 4073, 3717, 5620, 12549, 10300, 4596, 1048, 820, 1842, 396, -171, 2029, 4570, 4713, 5460, 2025, 592, 1353, 697, -2923, -4637, -2960, -3004, -3446, -6912, -12235, -9209, -7006, -7007, -4869, -3045, -106, -2511, -5419, -2854, -1820, -2659, 626, 3799, 1307]
6012A307q29J916J816m809l213k391n697L315L303L650K831l799l475k94L772
5997b597J298K144j892K006O03j432l880L80P3M713O122J127k129l13l980p19
5981A524O601J264k261m312M65P58J046j827j424j700m238K049J407L50M575K302
5965F579q50M47l716l729K884l161J398K900k889N838K739o106m992J345L206
5950A893J520K418K465m019o313J448K617k499m447j879j835L374K055L17J092
5935a793K490L325O444L277j178j051m430j522Q4k336Q63M544j549n345K601J567
5919E991j229m919q76m94p80K687K258l853J814Q31L138j548k27o31o238l416
5903g492L152N511O64j725J619r81J263r07m05k239j623l750l597J464M163K073
$$ y = [1307, 478, 2394, 4210, -599, -3812, -6203, -11900, -8585, -5282, -1632, 1199, -2600, -6075, -6369, -2597, -1299, 845, -1047, 959, 1562, 130, -3750, -3370, -3297, 1416, 7538, 8665, 6536, 6223, 2243, 1524, 8125, 9389, 7128, 2816, 3281, 4039, 5085, 3258, 1834, 134, -4104, -2055, -648, -298, 4277, 6579, 5729, 6176, 2460, -1269, 1615, -1546, -148, 2752, -137, 5701, 8440, 2334, -2658, -1313, 1893, 3413, 5831, 8296, 4277, -2036, -588, 2029, -470, -4917, -6796, -8631, -5257, -3202, -2885, -1793, 697, 4022, 10466, 13743, 12565, 11514, 7084, 5562, 5646, 3310, 4173, 8717, 7168, 1823, 4424, 5991, 4762, -157, -1033, -1527, -2307, 380, 2638, -1215, 599, 1430, 4568, 3020, 2793, 2162, -4076, -7492, -4340, 1171, 1835, 110, 1729, 748, 2011, 1104, 699, -1540, -3163, -6913, -10510, -9046, -4883, -2810]
5887b810k236J233N353O667l164j235M94L147K551k287k278o953n946j399k169
5872a1032j133K798J0033M506j814m056J103M79K395m332k671K390r69n141j059
5857h503k77N174O90l054O377K685j836L056k105k033Q25N16m204m378R68p22
5841f821l054K921O83j870N208L405L119l200rJ21o496K988j634K217K515r68
5825h75m163M294O125k188p26L134J942l969N14o4l50M13k662l464k382L548l687
5808d560k898Q10k6J706K675p72l875n68J09m36N041j120N94J160p47L97k362
5791d872Q13k50j728j345j509J42L408k323O27P309k366j903K188M300K887l898
$$ y = [-2810, -5046, -3813, 1540, 8207, 5043, 3808, 4302, 7449, 10000, 7713, 5435, -1518, -7464, -8863, -11032, -12165, -9367, 666, 5172, 3358, -698, 405, 884, 3279, -1053, -3724, -1334, -2303, -7444, -8503, -8780, -3606, -2916, -5970, 407, 3092, 1256, 4312, 2207, 174, 999, 1515, -2689, -7067, -6099, -6821, -9875, -6954, -6271, -8141, -2933, 472, 3591, 391, 382, 503, -5993, -3005, -4639, -2422, 93, -875, -5038, -744, 5381, 3193, 2467, 5601, 7543, 3574, 4088, 4024, 3674, 4087, 1425, -2039, -4421, -873, -4560, -7458, -6648, -6674, -4968, -2293, -3065, -6940, -7508, -7399, -7835, -2794, -3914, -3320, -2160, -2907, -2510, -4872, -4059, -4309, -6037, -7382, -8891, -8749, -5341, -7664, -7037, 272, -2094, -3997, -1809, 2491, 5378, 1480]
$$ [...]
##END NTUPLES=NMR SPECTRUM
##END=
