##TITLE=Analysis number 319411
Compound Code cc 02201
Project Code adrs
Chemist Name andys
##JCAMPDX= 6.0         $$ Bruker NMR JCAMP-DX V2.0
##DATA TYPE= NMR SPECTRUM
##DATA CLASS= NTUPLES
##ORIGIN= Bruker BioSpin GmbH
##OWNER= nmr
$$ XWIN-NMR		Version 3.5
$$ Mon May 15 08:40:38 2006 GMT Daylight Time (UT+1h)  MAYBRIDGE\nmr@NMR_250MHZ
##.OBSERVE FREQUENCY= 250.131544655141
##.OBSERVE NUCLEUS= ^1H
##.ACQUISITION MODE= SIMULTANEOUS (DQD)
##.ACQUISITION SCHEME= undefined
##.AVERAGES= 16
##.DIGITISER RES= 18
##SPECTROMETER/DATA SYSTEM= dpx250
##.PULSE SEQUENCE= zg30
##.SOLVENT NAME= DMSO
##.SHIFT REFERENCE= (INTERNAL, DMSO, 0, 16.522)
##AUDIT TRAIL= $$ (NUMBER, WHEN, WHO, WHERE, WHAT)
$$ ##TITLE= Audit trail, XWIN-NMR		Version 3.5
$$ ##JCAMPDX= 5.01
$$ ##ORIGIN= Bruker BioSpin GmbH
$$ ##OWNER= nmr
$$ C:\u/data/dgb/nmr/ADRS/4260/pdata/1/auditp.txt
$$ ##AUDIT TRAIL=  $$ (NUMBER, WHEN, WHO, WHERE, WHAT)
(   1,<2006-05-15 08:40:05.25 +100>,<MAYBRIDGE\nmr>,<NMR_250MHZ>,
      <created by zg, POWCHK disabled, PULCHK disabled
       configuration hash MD5:
       84 BC 41 DB A1 6E 1D 46 DA 25 12 A5 C1 ED C5 3A
       data hash MD5: 64K
       19 CF 66 A2 C7 FC 98 0B 05 72 B4 D6 60 73 DC F9>)
(   2,<2006-05-15 08:40:20.77 +100>,<MAYBRIDGE\nmr>,<NMR_250MHZ>,
      <Start of raw data processing
       ef LB = 0.3 FT_mod = 6 PKNL = 1 SI = 32K 
       data hash MD5: 32K
       4E 7E AD 00 98 82 58 D8 14 B6 B4 CE 88 62 2E 8F>)
(   3,<2006-05-15 08:40:25.50 +100>,<MAYBRIDGE\nmr>,<NMR_250MHZ>,
      <apk 
       data hash MD5: 32K
       A1 56 1E 44 7A A8 98 E0 96 D9 B2 D7 3E 48 7C DE>)
(   4,<2006-05-15 08:40:26.99 +100>,<MAYBRIDGE\nmr>,<NMR_250MHZ>,
      <abs ABSG = 5 
       data hash MD5: 32K
       A9 0C 8C 6A 58 4A 2A A9 00 30 61 9B D5 B4 23 73>)
$$ ##END=
$$ 
$$ hash MD5
$$ 97 EE 0C BA 97 33 3E 06 C5 BF 5A 41 75 BD 15 32
##$RELAX= 
##$RELAX= 
##$RELAX= 
##$RELAX= 
##$RELAX= 
##$RELAX= 
##$RELAX= 
$$ Bruker specific parameters
$$ --------------------------
##$DU= <C:\u>
##$EXPNO= 4260
##$NAME= <ADRS>
##$PROCNO= 1
##$TYPE= <nmr>
##$USER= <dgb>
##$AMP= (0..31)
100 100 100 100 100 100 100 100 100 100 100 100 100 100 100 100 100 100 
100 100 100 100 100 100 100 100 100 100 100 100 100 100 
##$AQSEQ= 0
##$AQ_mod= 3
##$AUNM= <au_zg>
##$AUTOPOS= <3 >
##$BF1= 250.13
##$BF2= 250.13
##$BF3= 250.13
##$BF4= 250.13
##$BF5= 500.13
##$BF6= 500.13
##$BF7= 500.13
##$BF8= 500.13
##$BYTORDA= 1
##$CFDGTYP= 0
##$CFRGTYP= 5
##$CHEMSTR= <none>
##$CNST= (0..31)
1 1 145 1 1 1 1 1 1 1 1 1 1 1 1 1 1 1 1 1 1 1 1 1 1 1 1 1 1 1 1 1 
##$CPDPRG= <>
##$CPDPRG1= <>
##$CPDPRG2= <>
##$CPDPRG3= <>
##$CPDPRG4= <mlev>
##$CPDPRG5= <mlev>
##$CPDPRG6= <mlev>
##$CPDPRG7= <mlev>
##$CPDPRG8= <mlev>
##$CPDPRGB= <>
##$CPDPRGT= <>
##$D= (0..31)
0 1 0 0 0 0 0 0 0 0.06 0 0 0 0 0 0 0.0002 0 0 0 0 0 0 0 0 0 0 0 0 0 0 
0 
##$DATE= 1147678803
##$DBL= (0..7)
120 120 120 120 120 120 120 120 
##$DBP= (0..7)
150 150 150 150 150 150 150 150 
##$DBP07= 0
##$DBPNAM0= <>
##$DBPNAM1= <>
##$DBPNAM2= <>
##$DBPNAM3= <>
$$ [...]
##$SUBNAM7= <"">
##$SUBNAM8= <"">
##$SUBNAM9= <"">
##$SW= 20.6930455092707
##$SWIBOX= (0..15)
0 0 3 0 0 0 0 0 0 0 0 0 0 0 0 0 
##$SW_h= 5175.983436853
##$TD= 65536
##$TD0= 1
##$TE= 295.16
##$TE2= 300
##$TE3= 300
##$TEG= 300
##$TL= (0..7)
0 120 120 120 120 120 120 120 
##$TP= (0..7)
150 150 150 150 150 150 150 150 
##$TP07= 0
##$TPNAME0= <>
##$TPNAME1= <>
##$TPNAME2= <>
##$TPNAME3= <>
##$TPNAME4= <>
##$TPNAME5= <>
##$TPNAME6= <>
##$TPNAME7= <>
##$TPOAL= (0..7)
0.5 0.5 0.5 0.5 0.5 0.5 0.5 0.5 
##$TPOFFS= (0..7)
0 0 0 0 0 0 0 0 
##$TUNHIN= 0
##$TUNHOUT= 0
##$TUNXOUT= 0
##$USERA1= <user>
##$USERA2= <user>
##$USERA3= <user>
##$USERA4= <user>
##$USERA5= <user>
##$V9= 5
##$VALIST= <valist>
##$VCLIST= <CCCCCCCCCCCCCCC>
##$VD= 0
##$VDLIST= <DDDDDDDDDDDDDDD>
##$VPLIST= <PPPPPPPPPPPPPPP>
##$VTLIST= <TTTTTTTTTTTTTTT>
##$WBST= 1024
##$WBSW= 4
##$XGAIN= (0..3)
0 0 0 0 
##$XL= 0
##$YL= 0
##$YMAX_a= 396161
##$YMIN_a= -491610
##$ZGOPTNS= <>
##$ZL1= 120
##$ZL2= 120
##$ZL3= 120
##$ZL4= 120
##$ABSF1= 16.522
##$ABSF2= -4.171173
##$ABSG= 5
##$ABSL= 3
##$ALPHA= 0
##$AQORDER= 0
##$ASSFAC= 0
##$ASSFACI= 0
##$ASSFACX= 0
##$ASSWID= 0
##$AUNMP= <proc_1d>
##$AZFE= 0.1
##$AZFW= 0.1
##$BCFW= 0
##$BC_mod= 0
##$BYTORDP= 0
##$COROFFS= 0
##$CY= 12.5
##$DATMOD= 1
##$DC= 0
##$DFILT= <>
##$DTYPP= 0
##$F1P= 14.0000005364418
##$F2P= -0.99999901652339
##$FCOR= 0.5
##$FTSIZE= 32768
##$FT_mod= 6
##$GAMMA= 0
##$GB= 0
##$INTBC= 1
##$INTSCL= 1
##$ISEN= 128
##$LB= 0.3
##$LEV0= 0
##$LPBIN= 0
##$MAXI= 10000
##$MC2= 0
##$MEAN= 0
##$ME_mod= 0
##$MI= 0
##$NCOEF= 0
##$NC_proc= -5
##$NLEV= 6
##$NOISF1= 0
##$NOISF2= 0
##$NSP= 0
##$NTH_PI= 0
##$NZP= 0
##$OFFSET= 16.522
##$PC= 1
##$PHC0= 156.2434
##$PHC1= 7.782537
##$PH_mod= 1
##$PKNL= yes
##$PPARMOD= 0
##$PSCAL= 4
##$PSIGN= 0
##$REVERSE= no
##$SF= 250.13
##$SI= 32768
##$SIGF1= 0
##$SIGF2= 0
##$SINO= 400
##$SIOLD= 32768
##$SREGLST= <1H.DMSO>
##$SSB= 0
##$STSI= 32768
##$STSR= 0
##$SW_p= 5175.98343685301
##$SYMM= 0
##$S_DEV= 0
##$TDeff= 65536
##$TDoff= 0
##$TI= <Analysis number 999999
Compound Code 99
Book Reference 9
Project Code 9>
##$TILT= no
##$TM1= 0
##$TM2= 0
##$TOPLEV= 0
##$USERP1= <user>
##$USERP2= <user>
##$USERP3= <user>
##$USERP4= <user>
##$USERP5= <user>
##$WDW= 1
##$XDIM= 32768
##$YMAX_p= 406320884
##$YMIN_p= -488310
$$ End of Bruker specific parameters
$$ ---------------------------------
##NTUPLES= NMR SPECTRUM
##VAR_NAME=  FREQUENCY,     SPECTRUM/REAL,   SPECTRUM/IMAG
##SYMBOL=    X,             R,               I
##VAR_TYPE=  INDEPENDENT,   DEPENDENT,       DEPENDENT
##VAR_FORM=  AFFN,          ASDF,            ASDF
##VAR_DIM=   32768,         32768,           32768
##UNITS=     HZ,            ARBITRARY UNITS, ARBITRARY UNITS
##FACTOR=    0.157963299565203, 1,           1
##FIRST=     4132.6476996994, 0,             0
##LAST=      -1043.33573715361, 0,           0
##MIN=       -1043.33573715361, -488310,     0
##MAX=       4132.6476996994, 406320884,     0
$$ Real data points
##PAGE= N=1
##DATA TABLE= (X++(R..R)), XYDATA
$$ [...]
24252a51155n9153m9692J16230O4728j2597o9325m7476R3533N1701R7835K16926
24241B51555q2747j57219j33376l254K1986k3654Q7033J37811Q6072M4071j8483
24230B09795J5776k62j14854o0242M8121L939J8232N2513J30305K3309j86285
24219A40347m1774o6500j65552p0128L9868P7328R2237O2451p299l3280K7382
24208E5080L9881L2604r0236J958P9945m7314k4059L7098M2456K8393l8046q3163
24196C4597R2143k5635P7798j7790p34N3405J6483l9356l5560n189m2163J191
24184A09190o9653j2975O3419P678k3517N485q2687j24880n9113P3756J49740
24173C6443P327q372j13921K8659l096m1018k704m1930l0241l0406J95964K05566
$$ plain form
24252 -151155 -210308 -260000 -143770 -79042 -91639 -160964 -208440 -114907 -63206 34629 251555
24241 251555 168808 11589 -121787 -125041 -103055 -126709 -39676 98135 184207 228278 209795
24230 209795 225571 225309 110455 50213 98334 102273 120505 173018 303323 326632 140347
24219 140347 98573 32073 -133479 -203607 -163739 -86411 5826 68277 60978 27698 55080
24208 55080 94961 127565 37329 39287 119232 71918 47859 84957 127413 155806 117760 34597
24196 34597 126740 101105 178903 161113 160379 213784 230267 190911 155351 150162 107999 109190
24184 109190 39537 26562 89981 97659 74142 79627 -3060 -127940 -187053 -113297 36443
24173 36443 43770 35398 -78523 -49864 -52960 -93978 -96682 -138612 -168853 -199259 -3295 202271
24161B02271j20953q1504o5372q9587M8413Q4794O6259m6472l9170O5135P4473
24150I8287j17615j39632J7479M4979K9516Q7818J19156r8653K3291L7187n156
24139I6657R697j22827l5790k409o2449P9544K8769j8321p5338j727P20R1016
24127a2458J7806L3372m3607p1362r752k7776J824L0501k098l2704J3865P7393
24115b4996m9091Q8276k2154k3395k4515J1353K2794Q796l206J29168q3507j01170
24103g1647L065L3529N6140K9896M8340P0345N4675r3518j20601j0363P7247J57214
24091B34322m9981j45221j37907j19186J09658R1239Q6529L0644j14238r9360
24081a13501m1112l6981J1192N1489P5054j5550M1783J5593n5935J5713o9288
$$ plain form
24161 202271 81318 -186 -65558 -155145 -106732 -21938 44321 -2151 -41321 23814 98287
24150 98287 -19328 -158960 -141481 -96502 -66986 20832 139988 41335 64626 101813 96657
24139 96657 106354 -16473 -52263 -54672 -117121 -37577 -8808 -27129 -102467 -104194 -103474 -12458
24127 -12458 5348 38720 -4887 -76249 -86001 -113777 -111953 -81452 -83550 -116254 -102389 -24996
24115 -24996 -74087 14189 -7965 -31360 -55875 -44522 -21728 -12932 -16138 113030 29523 -71647
24103 -71647 -68582 -35053 21087 50983 99323 169668 224343 130825 10224 -139 77108 234322
24091 234322 184341 39120 -98787 -217973 -108315 -17076 69453 100097 -14141 -113501
24081 -113501 -154613 -191594 -180402 -128913 -53859 -69409 -27626 -12033 -67968 -52255 -121543
24070a21543n4148L8462J50164l098j98501o8514L2659k5902N8783J54395K1494
24059a5749J02175J12285j7701r5386j02551q5830K8028J04057K0900J09394q0358
24048G9264r0768k120m4096N128J52450r5789j14438P125O1328N1277o7523Q2887
24036B4725Q8978j2980n3444j13167J5934L8086O88p0688k8467J06553L8521j56487
24024a21748n7777N5023J21715K3910l5292p1990j27085o5758J21429J68992m3855
24013c2436j24563J5802L905O1288M3657L5834N8537L5809L2618k2023j3163k6034
24001F9231l0106j10272r6294o0840J18762L5181K7363J32385L4580O5101j7273
23990A67818j01543o4385o2457n4414O4506j4589l7151n5771M573P3406J3735
$$ plain form
24070 -121543 -175691 -137229 12935 9837 -188664 -257178 -224519 -250421 -191638 -37243 -15749
24059 -15749 86426 198711 181010 85624 -16927 -102757 -74729 29328 50228 159622 79264
24048 79264 -11504 -13624 -57720 -52592 99858 4069 -110369 -103244 -41916 9361 -58162 24725
24036 24725 113703 100723 47279 -65888 -49954 -11868 -11180 -81868 -110335 -3782 34739 -121748
24024 -121748 -179525 -124502 -2787 21123 -14169 -86159 -213244 -279002 -157573 11419 -32436
24013 -32436 -156999 -141197 -137292 -76004 -32347 3487 62024 97833 130451 108428 95265 69231
24001 69231 39125 -71147 -167441 -228281 -109519 -74338 -46975 85410 119990 185091 167818
23990 167818 66275 1890 -60567 -114981 -50475 -65064 -102215 -157986 -153413 -80007 -66272
23979f6272l4447p2174k6106O5930P9942L5915r121p206p218O3785J4376L1186
23967F8590o6332j6875P5722k080o9324k8620n7857l999J1661K8567O4663J2878
23955A6994m7380m9679K06R124l2928J0097J5171l6767j66721n5099J81515J62009
23943F542J29486r0893n5501k6860P5606N000K1682J3372q9265l4735L3956J8666
23931G056j2165O6827P9880k6833o8953j06915M3152O6054K6203L977j1669p3273
23919f659q5759M0572J18389L194j0227p610l7871q9386n4149K2834J69120J00205
23907A62653j04962Q6577J71330j2040j08109j48411k3687l8905M867R2609j08811
23896b6889l0146M0204R9387l6355p8941P6375k745l4576o7258j3406L2012j55673
$$ plain form
23979 -66272 -100719 -172893 -198999 -133069 -53127 -17212 -26333 -33539 -40757 23028 37404 68590
23967 68590 2258 -14617 61105 59025 -10299 -38919 -96776 -100775 -89114 -60547 4116 16994
23955 16994 -30386 -80065 -79859 -70735 -103663 -93566 -78395 -115162 -281883 -336982 -155467 6542
23943 6542 136028 45135 -10366 -37226 38380 43380 65062 78434 -10831 -45566 -11610 7056
23931 7056 -5109 61718 141598 114765 45812 -61103 -17951 48103 74306 78283 66614 -6659
23919 -6659 -92418 -51846 66543 69737 59510 51900 14029 -75357 -129506 -106672 62448 162653
23907 162653 57691 144268 315598 303558 195449 47038 23351 -15554 -10687 81922 -26889
23896 -26889 -57035 -16831 82556 46201 -32740 43635 40890 6314 -60944 -74350 -42338 -198011
23884a98011k346J03747N145o4998k7043P2141J3606J51915R9721R7036j20130
23873A30783j37393p9952j24979j6751J5087J1027O0627n6631L8036J10631Q0661
23862C1146J5551o5924r5441L1961P270j2048M1548J60244O8511o5000j49222
23851c1404n058m6392N7657J14382R4115k0075j26516j5894J4935j9936J9753
23840C5567k7580o4194k9202k2980J05865P2764n0107r4303J0946J18988P3897
23829A29661k8217q6868j77914N0709R7847M8576j13775m1842K2403J32421l4959
23818a958m3088J12942k0814j85112j03906p390J13036J7088j19099p1287P3084
23807b36504J40796l3031P6357J41164m3994P799P2716J57052p8264j48104j48401
$$ plain form
23884 -198011 -200357 -96610 -91465 -156463 -183506 -111365 -97759 54156 153877 250913 130783
23873 130783 -6610 -86562 -211541 -228292 -213205 -202178 -141551 -198182 -160146 -49515 31146
23862 31146 46697 -19227 -114668 -82707 -75437 -87485 -45937 114307 182818 117818 -31404
23851 -31404 -36462 -82854 -25197 89185 183300 163225 36709 20815 35750 15814 35567
23840 35567 7987 -56207 -85409 -108389 -2524 70240 20133 -74170 -63224 55764 129661
23829 129661 101444 14576 -163338 -112629 -14782 33794 -79981 -121823 -99420 33001 -1958
23818 -1958 -45046 67896 47082 -138030 -241936 -249326 -136290 -119202 -238301 -309588 -236504
23807 -236504 -95708 -128739 -52382 88782 44788 52587 125303 282355 204091 55987 -92414
23796i2414J3493J19219k9790m8134j44625P7648J53461L3819l3239n4055K5961
23785B1344r0906n2045P1333J02156m1885p1154L1564K3948J2667q33l6771J08292
23773G7710J0338p2401q6902N944M1127j0655j2577N2630j4280J2963Q8829M8374
23761A41100M4586r0679n8256P9670j9457j09376O3869K5018o7870O6795J4588
23750H9988M0226k8791R873L3747q2632k6856l9936r1556k6129K6299J46344K1739
23738G2316l9227M4907R452K5709N5752k6106N9519n0178p4917L6798M961j25759
23726f773l1455k7619j9429L3323J14049j07513r6176p3L4394N2993O0150J3605
23714A9476M3306O622n0699o6229j2973P4060l8307n0087P0144l1027J4811P0860
$$ plain form
23796 -92414 -78921 40298 10508 -37626 -182251 -104603 48858 82677 49438 -4617 21344
23785 21344 -69562 -121607 -50274 51882 9997 -61157 -29593 -5645 7022 6189 -30582 77710
23773 77710 88048 15647 -71255 -65311 -24184 -34839 -47416 5214 -9066 3897 92726 141100
23761 141100 185686 95007 36751 116421 96964 -12412 51457 76475 8605 75400 89988
23750 89988 130214 101423 111296 145043 62411 35555 -4381 -95937 -122066 -95767 50577 72316
23738 72316 33089 77996 87448 113157 168909 142803 202322 152144 77227 114025 118986 -6773
23726 -6773 -38228 -65847 -85276 -51953 62096 -45417 -141593 -141666 -107272 -54279 5871 19476
23714 19476 62782 69404 18705 -47524 -60497 13563 -24744 -74831 -4687 -35714 -20903 49957
23702D9957k2635m667P5963k5537K0780m1498k1115L6422O1600j03321n1449n9844
23690h5344L3635N4688n3532n7290k7807j6772J5210O33k9146P1895o797j21107
23678b21734Q4882M9710o7866N1151J2332K5203m5596l4227p822R1341K234p1830
23666a32222k0785K8031K0587m6412N3043l0098N838N1216N8328l5516n0730R243
23654h9477K1925J6480L4894j03270j20543P4580R9196O322M8587J01913N461
23643I6068q4753n803R813K8628p7695r2558p6075k6800J03976J03713M9635j3124
23631A5025m4943j22857L6044M0988M7439p2405j7206O2261J4272j8752l8707
23620i8841O7309n309J520p8658l4051q5370m9010Q9523K8814J00603j5589j7892
$$ plain form
23702 49957 27322 22655 98618 73081 93861 52363 31248 67670 129270 25949 -25500 -85344
23690 -85344 -51709 2979 -50553 -107843 -135650 -152422 -137212 -136579 -165725 -93830 -100627 -221734
23678 -221734 -136852 -87142 -155008 -103857 -91525 -66322 -111918 -146145 -153967 -62626 -60392 -132222
23666 -132222 -153007 -124976 -104389 -150801 -97758 -127856 -122018 -70802 -12474 -47990 -98720 -89477
23654 -89477 -67552 -51072 -16178 -119448 -239991 -165411 -66215 -59893 -11306 90607 96068
23643 96068 11315 5512 15325 43953 -33742 -126300 -202375 -229175 -125199 -21486 28149 15025
23631 15025 -29918 -152775 -116731 -75743 -28304 -100709 -117915 -55654 -41382 -60134 -98841
23620 -98841 -31532 -36841 -35321 -113979 -148030 -233400 -282410 -192887 -164073 -63470 -79059 -96951
23608i6951N6571L3513P5236k0619J4922O0777o2233j95193q655J18623L2371
23597H362p6809m1458n7064L5635J27708M8936n2763o2087j34433j5236R7996
23586a21213J51399R0460n4503r8401j4710m6455N3446N0283j1125r3207j0670
23575a04696k8969n313Q0339M3122R7049n4232m6535N9268r7105r987J91511J03608
23563B28060k1829j21863j00684k5105L7124M5921L3876k1826M407j51759j32038
23552b25716J13799J41483o1873O9146R3134j01103o0350N4444P3829k5773j8904
23541E2116N0830p8019M1939J17417l2766l6463K9724j01916p5196r839J6816
23530b5357K273M5473Q5748N5813r1284j07381J30761N7144m9719L7099Q3420
$$ plain form
23608 -96951 -40380 -6867 68369 47750 62672 123449 61216 -133977 -142632 -24009 8362
23597 8362 -68447 -109905 -166969 -131334 -3626 45310 -7453 -69540 -203973 -219209 -121213
23586 -121213 30186 120646 66143 -32258 -46968 -93423 -39977 10306 -819 -94026 -104696
23575 -104696 -133665 -138978 -58639 -15517 81532 27300 -19235 40033 -57072 -67059 124452 228060
23563 228060 206231 84368 -16316 -41421 -4297 41624 75500 53674 58081 -93678 -225716
23552 -225716 -111917 29566 -32307 36839 129973 28870 -31480 22964 96793 71020 52116
23541 52116 102946 24927 66866 184283 151517 115054 144778 42862 -32334 -42173 -25357
23530 -25357 -23084 22389 108137 163950 72666 -34715 96046 153190 103471 140570 223990
23519B23990L1765j29765m9221j13561M5131l379r0220l5736j2867k2458p3895
23508b30216K4642J05986M8139K6344J9191n2527p1851P2288J1332m3551o4751
23497a54974L1259N6762J39652K1920j26829l6877K0436l472P3915J07684q5898
23486D3578j4870K6711n3222j8576P881Q3782O2618j5883j15205l2501k3583Q6233
23474C6963n420L7252J2764M9661j5693o2923j37667n6693J484J64266L2396k2465
23462C3925j5975l6685M764o8223R175J19486j0041j6541N1959m1289p2317o0029
23450a01791l986K4835L3323M1538L3835N0743n5543k1210k5102q7327j6253K0937
23438a06001j64523o3694M3223J34501n8040o7736J25353J04988K7665n7834J1860
$$ plain form
23519 223990 255755 125990 76769 -36792 8339 4960 -85260 -120996 -133863 -156321 -230216
23508 -230216 -205574 -99588 -51449 -25105 -5914 -58441 -130292 -58004 -46672 -90223 -154974
23497 -154974 -123715 -66953 72699 94619 -32210 -69087 -48651 -52123 21792 129476 43578
23486 43578 28708 55419 2197 -16379 -8498 75284 137902 122019 6814 -25687 -49270 36963
23474 36963 31543 68795 81559 131220 115527 52604 -85063 -141756 -140272 23994 56390 33925
23462 33925 17950 -18735 -13971 -82194 -73019 46467 36426 19885 71844 30555 -41762 -101791
23450 -101791 -105777 -80942 -47619 -6081 27754 78497 22954 1744 -23358 -110685 -126938 -106001
23438 -106001 -270524 -334218 -290995 -156494 -214534 -282270 -156917 -51929 -24264 -82098 -70238
23427g0238J0865J15047j00152k41522K7722J35596J73783J4273j14011n0048
23417i8685O8204R4420r799j3514J7746j246Q01l6245l5313J3704j41853j68151
23405c09931N888L1993J8994l3647L4759Q9522J14271K1387N885M202n2972k1283
23393i0932j0194J02686P9831j35207o8713J9777N6313j11428M8969J9356k6180
23382a15722Q323k0289j05020j982P2438K16797J12348o6702j09109o680l5984
23371e1582R8453J34526j2313j85277m8581O9886Q7313L6151k2200j58496j18778
23360a70898O4008M450m4226J7968r3234j2284O9372J28608J28702l9398j04563
23349e1495N3536l0292Q5092r164R475q2233j17634Q590M7103q4460L5279N3232
$$ plain form
23427 -70238 -59373 55674 -44478 -286000 -258278 -122682 51101 65374 -48637 -98685
23417 -98685 -30481 63939 54140 40626 58372 57126 57927 21682 -13631 73 -141780 -309931
23405 -309931 -304043 -272050 -253056 -286703 -251944 -162422 -48151 -26764 -20879 -16677 -69649 -90932
23393 -90932 -101126 1560 81391 -53816 -122529 -102752 -46439 -157867 -108898 -89542 -115722
23382 -115722 -107399 -127688 -232708 -234690 -162252 54545 166893 100191 -8918 -15598 -51582
23371 -51582 46871 181397 169084 -16193 -64774 5112 92425 128576 106376 -52120 -170898
23360 -170898 -106890 -102440 -146666 -128698 -221932 -234216 -164844 -36236 92466 53068 -51495
23349 -51495 2041 -28251 56841 47677 57152 -25081 -142715 -134125 -87022 -171482 -136203 -82971
23337h2971O4008M5431J5905l3089n4493O3576M9637M6160j7059m0944j67778
23326a11617j17224L0316N3775L7857N6363M0389L0984M6278J420o2614m4263
23315c8336N4594j00047j955l3899j54560l81Q7258J13270J34529j3773o8866
23304b2166J1603M7017p7500n3223M8007P4486l3298l9820q8992q815R2658J41224
23292I1181m9207m9859L0677j7224j66203m2056R4790O608K9351j3352L7258o1958
23280a09994M0850O8828k7909j45094M664N0480m5185j1271J44193K3823L8746
23269C2131j912j03053l4883k6359j01314o8385K5706J40373K2460o0926m6088
23258b22250J6224j11085N0802K16292J55320q6147m6816J12339L4267k8157J0376
$$ plain form
23337 -82971 -18963 26468 42373 9284 -45209 18367 68004 114164 97105 56161 -111617
23326 -111617 -228841 -198525 -144750 -106893 -50530 -10141 20843 67121 68541 5927 -38336
23315 -38336 16258 -83789 -85744 -119643 -274203 -274584 -187326 -74056 60473 46700 -22166
23304 -22166 -10563 36454 -41046 -94269 -46262 28224 -5074 -44894 -133886 -142701 -50043 91181
23292 91181 41974 -7885 22792 5568 -160635 -202691 -107901 -101293 -71942 -85294 -48036 -109994
23280 -109994 -69144 -316 -28225 -173319 -168655 -118175 -163360 -174631 -30438 -6615 32131
23269 32131 30219 -72834 -107717 -134076 -235390 -303775 -278069 -137696 -115236 -176162 -222250
23258 -222250 -206026 -317111 -266309 -50017 105303 19156 -27660 84679 118946 90789 101165
23247A01165r8822P8069n3554r3535R9038J17720j1741P6923j463n7323k4069
23236A32408j18994n4800P706O1832J9261l9928P1631M7304P246n6361q7499m7827
23224e8021J17941k4205j13627p813N9736l6702r0255K2403k6874m3902q4465
23213b85784M9092O7776O1236K2170k6264O4490Q7512r0127j16158m3558R3088
23202a16527J0774M9791J23490P0534M4927r3228p0303N9685m5268o621N6069
23191H3323j0687j04843l3936J24461L8172m6700q5473p2190M7726N9289k7050
23180b7908R139j23980j7999Q990n1326J10194J41036O1658l5059K6246o2517
23169C8474j38894l6473O6351l4594n0490Q2161K046k9349k9298N0525M9195q458
$$ plain form
23247 101165 2343 80412 26858 -66677 32361 150081 138340 215263 213800 156477 132408
23236 132408 13414 -41386 -33680 28152 47413 7485 79116 126420 133666 77305 -10194 -58021
23224 -58021 59920 35715 -77912 -85725 -25989 -62691 -152946 -130543 -157417 -201319 -285784
23213 -285784 -236692 -168916 -107680 -85510 -111774 -47284 40228 -49899 -166057 -209615 -116527
23202 -116527 -105753 -55962 67528 138062 182989 89761 19458 79143 33875 27254 83323
23191 83323 72636 -32207 -66143 58318 96490 49790 -35683 -107873 -60147 -858 -27908
23180 -27908 -18769 -142749 -160748 -151758 -203084 -92890 48146 109804 74745 100991 38474
23169 38474 -100420 -136893 -70542 -105136 -155626 -73465 -71419 -100768 -130066 -79541 -30346 -38804
23157c8804j1321J25547l2820j03753q2000N3631Q7898o8583P120N0031Q7037
23146G3983L6219n3835j09711q7406j02285l1044P6474K7092k0012j27865J9596
23135b98794Q7825O7401Q2521K45316l2505j55541o4894n9188R1279j816n4441
23124i2837L3698l4351p4965k9740o5125O8619K2127O5920J09656m2700J9196
23113b0502O8319R9278m7825j24448m9730J964K493o2699n94j3201L5959P3733
23101c7253m4581m6108Q8637J19776J25187j3711j67513q3249O574k7132L9129
23090d0244J991M6586l7515m2455j3960J8294l7615m8752R0030R4043k8995k05
23078A203j6253J8557J2283m0672M0194k5042J3880P3299j06222K1381J04199
$$ plain form
23157 -38804 -50125 75422 42602 -61151 -143151 -89520 -1622 -70205 -63085 -13054 73983
23146 73983 110202 56367 -53344 -140750 -243035 -274079 -197605 -170513 -190525 -318390 -298794
23135 -298794 -210969 -143568 -61047 184269 151764 -3777 -68671 -127859 -36580 -38396 -92837
23124 -92837 -59139 -93490 -168455 -198195 -263320 -194701 -172574 -106654 3002 -39698 -20502
23113 -20502 47817 147095 99270 -25178 -74908 -72944 -70451 -133150 -133744 -146945 -110986 -37253
23101 -37253 -81834 -127942 -39305 80471 205658 191947 24434 -58815 -52241 -79373 -40244
23090 -40244 -38253 8333 -29182 -71637 -85597 -67303 -104918 -153670 -63640 30403 1408 1203
23078 1203 -15050 3507 15790 -24882 15312 -9730 4150 77449 -28773 -7392 96807
23067I6807q9474p2660J4075L9242J26699N1123J1072N251m0257o4408J8794l3595
23055F2669r0261j8786M8535m6777K7046q8993L3194Q8750M9882n060l305m2308
23043A4586M8338O1568L0915j8389J0589l7304j56144N0316o398l2551j9784P6509
23031B2251N2367o637o0122l7470J6292l7418r0329m9993Q790P0320L9126J26793
23019E3970p2158j12222R992O0991k6288Q1720M4863l9749K8913j36198O16J52683
23007D7133M4451m2469n8255M4471l0455q3471n2691q2678J6766J30845J44672
22996G8319N6613n6058o4157o0141p3234l0872J25801M4472p033R1410O9042R2072
22984B66234n9603r7785k8950J1216n0278m3912q3546j372R3238J1539m9282q8495
$$ plain form
23067 96807 7333 -65327 -51252 -12010 114689 165812 176884 182135 141878 77470 96264 62669
23055 62669 -27592 -46378 2157 -44620 -17574 -106567 -73373 15377 65259 60199 56894 14586
23043 14586 62924 124492 155407 137018 147607 110303 -45841 4475 -1923 -34474 -54258 22251
23031 22251 74618 67981 7859 -29611 -13319 -50737 -141066 -191059 -182269 -111949 -72823 53970
23019 53970 -18188 -130410 -120418 -59427 -85715 -3995 40868 1119 30032 -106166 -105550 47133
23007 47133 91584 49115 -9140 35331 4876 -78595 -131286 -213964 -197198 -66353 78319
22996 78319 134932 78874 14717 -45424 -118658 -149530 -23729 20743 13710 105120 174162 266234
22984 266234 206631 108846 79896 91112 40834 -3078 -86624 -87996 5242 16781 -32501 -120996
22972a20996R3901M3756j6220R0442p1742r8532n4991J4944P2024M4299K3359
22961B0244N6305M4888M8923l6978j31691R5498M6045j48052j04611N2448J12528
22950E5547L1012j00348p6012P4802l7152j09718R2638M940j02092o0727M847
22939b22263L9425K4003N6317O2060M3225q1224j6350n2653j03620L6767J58874
22928e5439J3469q620Q07K0896M9861o9770l4690N8853R2139J20637n1218j03373
22916C3552j15573m2097R3767M308Q1832K11032J7750j42374j38753q7407J7219
22905f6744k9558K3135Q0852J38459l032k8594P4874k220r2498r0263j87694L2470
22893a50813J00025o992r7379Q4961n154o5087j322j3800r7313k3642N7339L4390
$$ plain form
22972 -120996 -27095 16661 441 90883 19141 -79391 -134382 -119438 -47414 -3115 20244
22961 20244 76549 121437 170360 133382 1691 97189 143234 -4818 -109429 -56981 55547
22950 55547 86559 -13789 -89801 -14999 -52151 -161869 -69231 -64291 -166383 -227110 -222263
22939 -222263 -182838 -158835 -102518 -40458 2767 -78457 -94807 -147460 -251080 -214313 -55439
22928 -55439 -41970 -50590 -49783 -28887 20974 -48796 -83486 -24633 67506 188143 136925 33552
22916 33552 -82021 -124118 -30351 -26043 55789 266821 284571 142197 3444 -83963 -66744
22905 -66744 -96302 -73167 7685 146144 143112 114518 189392 187172 94674 4411 -183283 -150813
22893 -150813 -50788 -57780 -155159 -70198 -75352 -140439 -141761 -155561 -252874 -276516 -219177 -184787
22881a84787R4640O5407j8612L2019K6463j40479o5082P0047n8128K1383P8797
22870g8332n6858j25515J11187J65380R4039L547j40865o9003n2682l037l8030
22859a90169K2957R4110o7274J05229N8513J914L2184j5767k6056M13j5433r5085
22847i4464n2557n629P3853J35132M0939j184O4250m6320r5384r2303L4072J64615
22835A25020L9812j37244j27802k6700K5952N4125p267J06682J5635J0775l240
22824G5748k4893r0203m9443N2085J01952o8563K324r3066n0969L9849M7304k8098
22812h5973k2881P0599m7068k545J3007l137K945P028N0495q816L5969j4574M4723
22799C9772j51299K402R655Q7535K5186L4094o8675N3227J13799q8793j13746
$$ plain form
22881 -184787 -90147 -24740 -43352 -11333 15130 -125349 -190431 -120384 -178512 -157129 -78332
22870 -78332 -135190 -260705 -149518 15862 109901 113448 -27417 -96420 -149102 -152139 -190169
22859 -190169 -167212 -73102 -140376 -35147 23366 25280 57464 41697 15641 16054 621 -94464
22847 -94464 -147021 -152650 -78797 56335 97274 96090 160340 114020 18636 -73667 -39595 125020
22835 125020 164832 27588 -100214 -126914 -100962 -46837 -54104 52578 68213 78988 75748
22824 75748 50855 -39348 -88791 -36706 65246 -3317 -993 -94059 -145028 -105179 -57875 -85973
22812 -85973 -108854 -38255 -85323 -87868 -74861 -77998 -75053 -68025 -17530 -26346 9623 -4951 39772
22799 39772 -111527 -109125 -99470 -11935 13251 47345 -21330 31897 145696 56903 -56843
22788e6843l5454k9408J3112M8318K6040J50767L4680m6888j4149J2529r6584
22777F120o8828p85M5344M5259L9768j7913m7305l4617o7570j49699J7790J43671
22765h8765N6833N4364j20234m4533O7173J42545J03835p8326j05127j53725K1991
22754a43969P5070J0939j0578N7101R1141p1515j12188N6092n0208n5928m2345
22743a96388j69627M7122K57232J74352M4063O1020j68415j44383n8889J04025
22733d9888Q3564K9676M3128n0333j01873p2414L867R7928m1699K4971Q1486L0251
22721G8664k512J6369r154J0813l7113k1737n0164j03O099J0822j00547O7541
22709c1022P6576j0912K9999k4589j04361K9583P5569o4652k8097j6686J4391
$$ plain form
22788 -56843 -92297 -121705 -108593 -60275 -34235 116532 151212 104324 90175 102704 6120
22777 6120 -62708 -63493 -18149 27110 66878 48965 1660 -32957 -100527 -250226 -232436 -88765
22765 -88765 -31932 22432 -97802 -142335 -75162 67383 171218 92892 -12235 -165960 -143969
22754 -143969 -68899 -57960 -68538 -11437 79704 8189 -103999 -47907 -98115 -154043 -196388
22743 -196388 -366015 -318893 -61661 112691 156754 217774 49359 -95024 -153913 -49888
22733 -49888 33676 63352 106480 56147 -45726 -118140 -114273 -16345 -58044 -33073 48413 78664
22721 78664 76152 92521 83367 94180 57067 35330 -14834 -14937 -8838 1984 -98563 -31022
22709 -31022 45554 34642 64641 40052 -64309 -34726 40843 -23809 -51906 -68592 -54201
22698e4201Q6715q6838r289j3544p0167K9749N1520o9540k2086l7982k5838o503
22686b28004n6343j6847J2768P5885J18275R4365J7416N8602Q866j01385r5536
22675a11938J56380Q6374M3707L0961k22434l5864N0472L6887N6096l3983l7905
22664A8753M9984l0194p512m080J39343M5358n6755o7258q1229P741k0666j25228
22652a31743l6068J07973N1617j6362J5979P6638R1608M1271r0145j83129n9395
22641a31756J27918J7735L56P0152j51787n0608q2123j860M3424R1689O8091Q8352
22629H9583r3105l9082O8615j6411K1822L1257m1098k551m0162m5481M4712J23447
22617A01546N2487r4223N0794n5966m4797l8173r5929n8734J7793N1727N6308
$$ plain form
22698 -54201 32514 -54324 -63613 -77157 -147324 -117575 -66055 -135595 -157681 -195663 -221501 -228004
22686 -228004 -284347 -301194 -288426 -212541 -94266 99 17515 76117 84983 -16402 -111938
22675 -111938 44442 130816 174523 205484 -16950 -52814 -2342 34545 90641 56658 18753
22664 18753 68737 38543 31031 26951 166294 211652 154897 87639 6410 14151 -6515 -131743
22652 -131743 -167811 -59838 -8221 -24583 -8604 68034 159642 200913 110768 -72361 -131756
22641 -131756 -3838 13897 14253 84405 -67382 -117990 -200113 -201973 -158549 -66860 1231 89583
22629 89583 -3522 -42604 26011 9600 31422 62679 21581 19030 -21132 -66613 -21901 101546
22617 101546 154033 59810 110604 54638 9841 -28332 -124261 -182995 -165202 -113475 -57167
22606e7167K4067M059M450n1415P009P6572M0691l9458j30624o4883p0322J2116
22594b44905J08972J14794N4467r9359j67026L9933Q7205J05354n5137m7215j8978
22583a21895m9608m8232l2684l6274j1471J03504L6752k366K258O6382j4249Q190
22571i9693J14286k4520j64416k2357j5519J91024L8949N0115j5566l1678R4398
22560A15023l3026l2721M6452j5382L6528n7537j08638N2381J43533j40495j18823
22549a12705m5898l940o5793J0063M0473N7244R4454l6203j431O8940M338j1284
22537a742k2036Q04j64146M4910O8354R7625K2k0853M4449q5505n6756N9561j38770
22524a74083J09636J1595j29710j43800R5882J57776J8453j1651Q9251N5156o8872
$$ plain form
22606 -57167 -33100 -29041 -24591 -76006 -68997 7575 48266 8808 -121816 -186699 -257021 -244905
22594 -244905 -135933 -21139 33328 -66031 -233057 -193124 -105919 -565 -55702 -102917 -121895
22583 -121895 -171503 -219735 -252419 -288693 -300164 -196660 -159908 -162274 -160016 -93634 -107883 -99693
22571 -99693 14593 -9927 -174343 -196700 -212219 -21195 17754 67869 52303 20625 115023
22560 115023 81997 49276 95728 80346 116874 59337 -49301 3080 146613 6118 -112705
22549 -112705 -158603 -162543 -228336 -218273 -177800 -120556 -26102 -62305 -63736 5204 9542 -1742
22537 -1742 -23778 -22974 -187120 -142210 -73856 23769 23791 2938 47387 -38118 -94874 -35313 -174083
22524 -174083 -64447 -52852 -182562 -326362 -230480 -72704 -54251 -65902 23349 78505 9633
22513I633j42098k6604M0530J3972R024j67336p4091J12679J06422j497O7670
22502e1696K3966K6522r438o721k4107J56987N2684r9586j27788j84582J8689
22491b25070Q6904N2642J4854L1920K0823l4440r4060J08150J20010l3345n5812
22480g424l5693p1375o8508K01003R5644m1611r4433k2064p0342m9540l2049P9245
22468a17147O4362N3367J0967j02468j8573l6901M1144n1304j65541M7232J05852
22457a69010J36940K8020N0960Q745J08522k3659q4612N8269l6068j13134j35822
22446a70849J7406O6073O7175k6487l0620R7016J3458k6145n2718K6980p6153
22435i4864K5003n7040o6454L2137J13248L3585o5086p5849J4493J9265L5237
$$ plain form
22513 9633 -132465 -159069 -118539 -104567 -95543 -262879 -336970 -224291 -117869 -119366 -51696
22502 -51696 -27730 -1208 -10646 -17367 -41474 115513 168197 68611 -59177 -243759 -225070
22491 -225070 -138166 -85524 -70670 -38750 -17927 -52367 -146427 -38277 81733 48388 -7424
22480 -7424 -43117 -114492 -183000 18003 113647 72036 -22397 -44461 -114803 -164343 -196392 -117147
22468 -117147 -52785 582 11549 -90919 -109492 -146393 -105249 -156553 -322094 -274862 -169010
22457 -169010 -32070 -4050 46910 55655 164177 140518 55906 114175 78107 -35027 -170849
22446 -170849 -153443 -87370 -20195 -46682 -77302 19714 33172 7027 -45691 -18711 -94864
22435 -94864 -69861 -126901 -193355 -161218 -47970 -14385 -79471 -155320 -140827 -121562 -86325
22424h6325k0005M1083Q543M0552J5184k9005k051J45108M0187l5087p45m3880
22412G3559m4045P4456N2852o8038m7701m241N0891q2920j724M4442o5843J9649
22400A337O7200N3483o7181j39543p7559Q6587Q2132P7960J41344j05632j43202
22389b3074M674p2046o8807P4980J6496r9027M2949l3449j09595O7531P0168o4638
22377a93838N7202P1069J6307k6263J5979k6261m222J21486O8616L748l7531p9948
22365a3656q7092l954o36K2937O4620j27993L1655k568O8597P2502o2516P8697
22353D0593n776m846J297o8907p7633N655n6578J5961Q6288O5185N1434L4775
22341H7448j21401n8606J3392N1703J13059r4456j02250N3080r6237L6125N5768
$$ plain form
22424 -86325 -106330 -65247 -56704 -16152 -968 -29973 -32024 113084 153271 118184 117439 73559
22412 73559 29514 103970 156822 88784 41083 36842 87733 4813 3089 47531 -18312 1337
22400 1337 68537 122020 54839 -84704 -162263 -75676 6456 84416 225760 120128 -23074
22389 -23074 -18400 -90446 -159253 -84273 -67777 -166804 -123855 -157304 -266899 -199368 -129200 -193838
22377 -193838 -136636 -65567 -49260 -75523 -59544 -85805 -90027 31459 100075 103823 66292 -13656
22365 -13656 -100748 -104702 -105338 -82401 -17781 -145774 -114119 -116687 -48090 24412 -38104 40593
22353 40593 34817 29971 31268 -37639 -115272 -109617 -166195 -150234 -63946 1239 52673 87448
22341 87448 -33953 -92559 -79167 -27464 85595 -8861 -111111 -58031 -154268 -118143 -62375
22330f2375k2229k3449k9139N7614R2995k6196k369p2017n5081m7035n268o502
22318b01051P1532O0736O9740j02406j26459J05799N0450N1400J422j7709L7306
22307G60j01433r8058O901k901l830P0968J11954m7751k03571k1654J40395J06234
22295d1986P1554K2874m7102j7921j1076P6479K5060k8087N2360p7037m0133J03892
22283H8877j62659l3370M2502O4231j11015j5186J5151k2922q48L7899P6464N1077
22271C0201J770N4774o4072l5457r3101m1644q817R3184l026m1467J43669m5333
22259i319r145J3088k6005r0938J1825J05278M7747j28723N9993R1114q7623j6260
22247c8968p5094J7772j977l4869P8892o9393Q1156n4218j25154k9916J45544
$$ plain form
22330 -62375 -84604 -108053 -137192 -79578 13417 -12779 -15148 -87165 -142246 -189281 -194549 -201051
22318 -201051 -129519 -68783 957 -101449 -227908 -122109 -71659 -20259 -18837 -36546 760
22307 760 -100673 -198731 -191830 -194731 -198561 -127593 -15639 -63390 -266961 -288615 -148220 -41986
22295 -41986 29568 52442 5340 -12581 -23657 52822 77882 49795 102155 25118 -15015 88877
22283 88877 -73782 -107152 -64650 -419 -111434 -126620 -111469 -134391 -135239 -97340 -20876 30201
22271 30201 31971 86745 22673 -12784 -105885 -147529 -156346 -63162 -66188 -107655 36014 -9319
22259 -9319 -18464 -5376 -31381 -122319 -110494 -5216 42531 -86192 -26199 64915 -22708 -38968
22247 -38968 -114062 -96290 -98267 -133136 -54244 -123637 -42481 -96699 -221853 -251769 -106225
22236a06225J33993K6050q7236l3972N2293L9013n2169j3659m4436k4925M7675
22225f3598M534k8023m1028K2113P5022M4406J6506j17671p8956n198N405P4896
22213i1592r6604J6064M8586l0299Q0799l5931r5482m5259O8067K2783J03964
22202e4904M1202m2928N859j02049o2491K2890J49588N8284o3096o9489Q5231
22191c1903N505J69M5059l060j10193m0396L9206j6345r4301L8181m2590J21149
22179h9519P9302q4235M493N8842j06540P2180Q639Q5457M133p1907o6752n112
22167a11019J04861Q330p0985j24038j55174J42905P6715K9654M6165J2514n7231
22156i7303n1077M7995L4622J09110l70l3034k2991j13685K0189L8590j5418l6067
$$ plain form
22236 -106225 27768 53818 -33418 -67390 -15097 23916 -28253 -41912 -86348 -111273 -63598
22225 -63598 -59064 -87087 -128115 -106002 -30980 13426 29932 -87739 -166695 -171893 -166488 -91592
22213 -91592 -188196 -172132 -123546 -153845 -73046 -108977 -204459 -249718 -181651 -158868 -54904
22202 -54904 -13702 -56630 -50771 -152820 -215311 -192421 -42833 15451 -47645 -117134 -31903
22191 -31903 -26398 -26229 18830 15770 -94423 -134819 -95613 -111958 -206259 -168078 -210668 -89519
22179 -89519 -10217 -94452 -89959 -31117 -137657 -65477 -56838 28619 32752 -39155 -105907 -111019
22167 -111019 -6158 2172 -68813 -192851 -348025 -205120 -128405 -98751 -52586 -40072 -97303
22156 -97303 -148380 -100385 -65763 43347 42977 9943 -13048 -126733 -106544 -67954 -83372 -119439
22144a19439m64L4361J5067n529J1472N7161j842O511j07110M3381r7798j02783
22132b67012J14924J7356j5838P0879l8919L7272J44612M7761l0464k1042n6639
22121B890l9281k6500R4016O2620k4014k9813j82544l9129L6305N3010Q7087J48800
22109A43447J16468j43243Q9716J07527m0483j37485k0363n2745K7157r2166j06660
22098a08830m4697o415M5014Q35n4039L3033K13558J00042p5915j81599k1925
22087a00938J01310k0191R859J08760J03288n2254j81854j78132L6188Q7583l936
22076i0317L0054p0842j2890l951N7382J3104J7792J88045j4416j84863j06565
22065a77467j8871J7428N3911J39785J46833j2085r6296o5872j463k1851L2748
$$ plain form
22144 -119439 -119903 -85542 -70475 -76004 -64532 -7371 -9213 -2702 -109812 -66431 -164229 -267012
22132 -267012 -152088 -134732 -150570 -79691 -118610 -81338 63274 111035 80571 59529 2890
22121 2890 -36391 -62891 31125 93745 69731 39918 -142626 -181755 -145450 -92440 -5353 143447
22109 143447 259915 116672 206388 313915 273432 135947 115584 62839 89996 -2170 -108830
22098 -108830 -153527 -159942 -114928 -114093 -168132 -135099 78459 178501 102586 -79013 -100938
22087 -100938 372 -19819 -9960 98800 202088 149834 -32020 -210152 -173964 -86381 -90317
22076 -90317 -60263 -131105 -143995 -147946 -90564 -77460 -59668 128377 113961 -70902 -177467
22065 -177467 -196338 -178910 -124999 14786 161619 149534 53238 -12634 -14097 -35948 -3200
22054c200Q1017K2001J3626j49079j30756l0116K692R6373O6773j2711K2021K216
22042a9143K5996J0753k114q3419l7731Q2667Q8977R939l7287q1367j08693k6235
22030a77657M0718L3064Q3044J08004P0439L0196L4572q5206k07238j86951q160
22019b65175M322K5900k6809J52436J18383M1016p8842k7955l7399P6134n552
22008b3541J30046L1203j21708j15760O1238P2909J17086O272k09700m8989o1161
21997a62105p4412j6877L3508R939n6699O0304J36018P2542O5290N4389l5499
21986H6398p3682p2606j46320j094j02151q0361O2024J09557J38324j4027j669
21975i5607Q7089k1013k3008p1664K49741J66885j92574j36241k4677N7700j7641
$$ plain form
22054 -3200 77817 99818 113444 -35635 -166391 -196507 -193815 -97442 -30669 -43380 -21359 -19143
22042 -19143 6853 17606 15492 -67927 -105658 -22991 65986 75925 38638 -42729 -151422 -177657
22030 -177657 -136939 -103875 -20831 87173 157612 187808 222380 137174 -70064 -257015 -265175
22019 -265175 -260853 -234953 -261762 -109326 9057 50073 -28769 -56724 -94123 -17989 -23541
22008 -23541 106505 137708 16000 -99760 -38522 34387 151473 157745 -51955 -100944 -162105
21997 -162105 -236517 -253394 -219886 -209947 -266646 -206342 -70324 2218 67508 121897 86398
21986 86398 12716 -59890 -206210 -207304 -309455 -389816 -327792 -218235 -79911 -93938 -95607
21975 -95607 -8518 -29531 -52539 -124203 125538 292423 99849 -36392 -61069 -3369 -21010
21964b1010L1755J0865j7438L95j25196q7361n1157J61878q4342j04916M5341
21953b41186J7515j32272m0010k8316J32564J14275O2041J13522N5910M8294J9617
21942A21954m8385j47752r8632Q1418O354o8498J00870K2301l0039M0354K9631
21931I576O3844K5931N6064L88j0732j65317m1690O6782L0840j093p6632J1189
21919c0850K0598M2758k8467J8224k6988k3874Q8207M5881N8796O2530j58206
21908F8609q1476m9166m8186p3911P3697J01238q1562q5611N3356N1296O9244
21897b472j9671l0917K2594m8902m2613K1540o0865M9714J7810l0553n2858J57961
21885a9232Q2503N9142m0965p6056l0710o882j1894K2071m1893k1435l646p1426
$$ plain form
21964 -21010 10745 21610 4172 4567 -120629 -207990 -259147 -97269 -181611 -286527 -241186
21953 -241186 -223671 -355943 -395953 -424269 -291705 -177430 -115389 -1867 54043 102337 121954
21942 121954 73569 -74183 -172815 -91397 -85043 -153541 -52671 -30370 -60409 -20055 9576
21931 9576 73420 99351 155415 155803 145071 -20246 -61936 4846 35686 34593 -42039 -30850
21919 -30850 -10252 32506 4039 22263 -4725 -28599 59608 105489 164285 226815 68609
21908 68609 -12867 -62033 -110219 -184130 -110433 -9195 -90757 -176368 -123012 -71716 -2472
21897 -2472 -22143 -53060 -30466 -79368 -121981 -100441 -161306 -111592 -93782 -124335 -177193 -19232
21885 -19232 63271 122413 81448 5392 -25318 -32200 -44094 -22023 -63916 -85351 -88997 -160423
21873a60423M2255l0712N5748N8152K1179j5207J4413o9890q0534o3108l0620
21862b58747N1753j5840K5551K5057J52248j8485k5363J00831Q6598p38j6426
21851A06439m341j12786m3709r6402p3107J96928Q362p6409M4344k8900n6660
21840a36241P9098R605J7039P4190j14758L1523K7066O30n6277J9418j083k3767
21828g3557k7407k4087M1310M384p1348J7638L8756j7316n5521R9172M6529j4297
21816c5744o3251r4921k8359o8955K6484O7951J171K9432J82556J7709j52058
21805a17985k8447K7802P3591P7569j3932R0160J71958l5086p1009p1728M382
21794A07275M5455O339r3706k7354r4086J7986J58455n4092j24859n0304L1022
$$ plain form
21873 -160423 -118168 -148880 -93132 -34980 -13801 -29008 -14595 -84485 -165019 -228127 -258747
21862 -258747 -206994 -222834 -197283 -172226 -19978 -38463 -63826 37005 123603 122865 106439
21851 106439 102098 -10688 -54397 -150799 -223906 -26978 -18616 -95025 -50681 -79581 -136241
21840 -136241 -57143 -47538 -30499 43691 -71067 -39544 -12478 -11848 -68125 -48707 -49790 -73557
21828 -73557 -100964 -125051 -83741 -79357 -150705 -133067 -94311 -111627 -167148 -67976 -21447 -35744
21816 -35744 -98995 -193916 -222275 -291230 -264746 -196795 -195624 -166192 16364 34073 -117985
21805 -117985 -146432 -118630 -45039 32530 18598 108758 280716 245630 174621 102893 107275
21794 107275 152730 159069 65363 38009 -56077 -38091 120364 66272 -58587 -108891 -77869
21783g7869j6429K7460k7169p730M9229p9581n3325j21070O7052J81892K10010
21772A52470j3109k1155J9234k1893k7185Q68m9231o9250L4275P9252k4132o9763
21760i619N5795M5897j08911N8240N3276K5253j38683O850j7602n264m7925j0136
21748i2829p0317k5652L7224J16609N9133j11666N0016l9740n3633Q0140m7724
21737i8439n3733j03997K1290l1973J02891j1452P1538O5287M554j2635O1618
21726A4949n0109j1742K4409j06970m1083l0326p696j6368O4236N6564L4769k3045
21714i2412L4805N8456L0729k2157o2126p1218l0839n2733N9551O7816p6072q8600
21702b44800P8897j4817n1931k6615P5643k9600p8161L7266R9828J68874m5384
$$ plain form
21783 -77869 -94298 -66838 -94007 -101737 -52508 -132089 -185414 -306484 -239432 -57540 152470
21772 152470 139361 118206 137440 115547 88362 89230 39999 -29251 5024 84276 60144 -9619
21760 -9619 46176 92073 -16838 41402 94678 119931 -18752 -11902 -29504 -34768 -82693 -92829
21748 -92829 -163146 -188798 -151574 -34965 24168 -87498 -37482 -77222 -130855 -50715 -98439
21737 -98439 -152172 -256169 -234879 -266852 -163961 -175413 -103875 -38588 -34034 -46669 14949
21726 14949 -35160 -46902 -22493 -129463 -170546 -200872 -208568 -224936 -160700 -104136 -69367 -92412
21714 -92412 -57607 849 31578 9421 -52705 -123923 -154762 -207495 -147944 -80128 -156200 -244800
21702 -244800 -165903 -180720 -232651 -259266 -183623 -213223 -291384 -254118 -154290 14584 -30800
21691c0800q1646j5739K3773L5870M8202K3889j23206k28011J4548n974J03434
21680b35660Q4375Q7003n4103J05398K3916k9251J4681k800j70380K8572P1154
21669g7095j0013l4831L9495L2326J16117p8271j06448m9417Q7744J70820k2840
21658F7587p7925k322O6188n0510m6941M6640O213j41407L7462O2411p5445k2071
21646a30120J14228K0172j08545j25486m1270n8812M4993J66666j8427m589K5375
21635a15815J4127J2164k7568n184p3597L7831o1886P5711l5284Q7220m4083j51246
21623b87610j9824N3320P9313q2806o7008O3874j2693L3275O3678m9098m8837
21612b74416N7229k4681q3810j04885O6566P9250J46732m5292q8385R1885J0990
$$ plain form
21691 -30800 -112446 -128185 -104412 -68542 -20340 3549 -119657 -347668 -333120 -339094 -235660
21680 -235660 -151285 -64282 -118385 -12987 10929 -18322 -3641 -6441 -176821 -148249 -77095
21669 -77095 -87108 -121939 -82444 -50118 65999 -12272 -118720 -168137 -80393 90427 67587
21658 67587 -10338 -12660 53528 3018 -43923 2717 8930 -132477 -95015 -32604 -108049 -130120
21646 -130120 -15892 4280 -104265 -229751 -271021 -329833 -284840 -118174 -136601 -141190 -115815
21635 -115815 -101688 -89524 -117092 -122276 -195873 -158042 -219928 -144217 -179501 -92281 -136364 -287610
21623 -287610 -307434 -254114 -174801 -257607 -324615 -260741 -273434 -240159 -176481 -225579 -274416
21612 -274416 -217187 -241868 -325678 -430563 -363997 -284747 -138015 -183307 -271692 -179807 -168817
21601a68817o098k9962p299P679Q04k6004J12852O4605j11237l3954J03856p7730
21589a71305Q3397L7819L214j5094J7668o8696J0463L480j2466j0785l1421k2474
21577a76200J08060m0348J627R5513O3470j13472j44010L4558R2776L2202N8755
21566A2931O0372j9824n8191M8262R3125q8117r5161r106p2705j04811r024J20433
21554a21816Q0354p5716J07809l995j9119l14O322J2306r8753q4486j5838j897
21542b15143j7547P6723J34241N9319j22711m7381Q2953p8453L4470J02436m0513
21531c1606p7036p464o3077O7051m277O1071R8060l1340R2454j2665M4975n4781
21519H1365O247N5190j0285o5316q8700J3526O5917j6877q2824L0450o9933l8853
$$ plain form
21601 -168817 -174915 -204877 -212176 -204497 -203693 -229697 -116845 -52240 -163477 -197431 -93575 -171305
21589 -171305 -87908 -50089 -46875 -61969 -44301 -112997 -102534 -99054 -111520 -122305 -153726 -176200
21577 -176200 -68140 -108488 -106861 -11348 52122 -61350 -205360 -170802 -78026 -45824 12931
21566 12931 73303 53479 -4712 43550 136675 48558 -46603 -55709 -128414 -233225 -242249 -121816
21554 -121816 -41462 -117178 -9369 -13364 -32483 -32797 -26475 -14169 -112922 -197408 -213246 -215143
21542 -215143 -232690 -155967 -21726 37593 -85118 -132499 -49546 -127999 -93529 8907 -31606
21531 -31606 -108642 -116106 -179183 -112132 -116409 -55338 42722 11382 103836 91171 136146 81365
21519 81365 87612 142802 132517 67201 -21499 -7973 57944 41067 -41757 -11307 -81240 -120093
21507a20093j4404L8241K1150n4894r6874O2468P5425J08660m2444q0608O6630
21496c6743n6867L1010J30461K6107j47915p3164J47546k6591j30928l4947Q6143
21485h5888M2818K3644k3302o6848R1863p4761l7590n6432J2399j16675k6862
21474c17634J69407J31635J3641N4305j5742j97442j36551J9842j9612J12156
21464a85995J40959L0272J8419l9134Q8252O7756l1946l6025j82313J2422R2661
21453b4672l2623Q595N4711l8240q3508N7137M5671J8491m9085q9001l9655J31339
21441d0840M3136N163j0842k5892M9498J09905l7569j77311q6760J78881J13608
21430A20977K7365j11391j6496l7780p1021o7475L2605L559o8347N157l863M224
$$ plain form
21507 -120093 -134497 -96256 -75106 -130000 -226874 -164406 -88981 19679 -22765 -103373 -36743
21496 -36743 -93610 -62600 67861 93968 -53947 -127111 20435 -6156 -137084 -172031 -85888
21485 -85888 -43070 -19426 -42728 -109576 -17713 -92474 -130064 -186496 -174097 -290772 -317634
21474 -317634 -148227 -16592 -2951 51354 35612 -161830 -298381 -278539 -298151 -185995
21464 -185995 -45036 -14764 3655 -35479 52773 120529 88583 52558 -129755 -117333 -24672
21453 -24672 -57295 -48700 6011 -32229 -115737 -58600 -12929 5562 -43523 -132524 -172179 -40840
21441 -40840 2296 7459 -3383 -29275 20223 130128 92559 -84752 -171512 7369 120977
21430 120977 148342 36951 20455 -17325 -88346 -155821 -123216 -119657 -188004 -182847 -186710 -182486
21418a82486j0969Q4388L5018p6063K5692L4130O4462k995J3734P74K9387L0563
21406D5635J1189k0939m2924j17758p8704p1336J3480J18007j10162q3700J51482
21395a85730N1571l0832L0588N4280m5101l0242k4219K7560l5474K5157M7877
21384a14565k1250r1009o6473M8947N2964Q113l440L8473J51736j6794P3203Q355
21372F8260O6927L6111J23380K782j19361j28947j37989l8385R114r095K8840
21361i8363O1048R7517N8514j24585j07602j440O6729o8649k6974L1475M7924
21350f4406j4145R6669L5909j636j09285L1209L7496l0742N0779n7421j36278
21339a61851N5189L7885k1494Q1311Q2737q879j05734r4704k5303J8344k4398
$$ plain form
21418 -182486 -193455 -109067 -74049 -150112 -124420 -90290 -25828 -28823 -15089 -14315 15072 45635
21406 45635 56824 35885 -7039 -124797 -203501 -274837 -261357 -143350 -253512 -337212 -185730
21395 -185730 -134159 -164991 -134403 -80123 -125224 -155466 -179685 -152125 -187599 -162442 -114565
21384 -114565 -135815 -226824 -293297 -244350 -191386 -183273 -186713 -148240 3496 -13298 59905 68260
21372 68260 135187 171298 294678 297460 178099 49152 -88837 -127222 -118108 -127203 -98363
21361 -98363 -37315 60202 118716 -5869 -113471 -114911 -48182 -116831 -143805 -112330 -64406
21350 -64406 -78551 18118 54027 52391 -56894 -25685 11811 -18931 31848 -25573 -161851
21339 -161851 -106662 -68777 -90271 -8960 73777 64898 -40836 -135540 -160843 -142499 -166897
21328a66897J9341k4275J16099K4116m7326j3953J6404J07438q5024J2108M9160
21317G191m8952O8388K6254o813j57331m3801Q8064R1291J21402J3285n3009M7141
21305A53110J2502j99320j01759j4105O4854N1422k5766q1714L5260J13737o3490
21294e5269o733r502l2408Q7020O0124j21636Q2280R2866J120R9209j04057K6611
21282A19625j19963n9118j40329j7882J21938J12360N2162j4147l0067k4681R596
21271I494l9130m3331r2672m2921M8643O6437R7973M9045k9600m0727k7872K9087
21259a5574J29815m5146k6480J788K983r0964N1890J70925N0913j22536j85297
21248g7683l8587L7425R7593j2947k9165j9429o9781K2940J4135m7412L6727m8348
$$ plain form
21328 -166897 -147556 -171831 -55732 -31616 -78942 -92895 -76491 30947 -54077 -41969 7191
21317 7191 -41761 26627 52881 46068 -111263 -155064 -67000 24291 145693 158978 105969 153110
21305 153110 165612 -33708 -135467 -149572 -84718 -33296 -59062 -140776 -105516 8221 -55269
21294 -55269 -62002 -71504 -103912 -16892 43232 -78404 3876 96742 97862 197071 93014 119625
21282 119625 -338 -59456 -199785 -217667 -95729 16631 68793 54646 24579 -102 9494
21271 9494 -29636 -72967 -165639 -208560 -159917 -93480 4493 53538 23938 -16789 -44661 -15574
21259 -15574 114241 69095 42615 44403 47386 -43578 8312 179237 230150 107614 -77683
21248 -77683 -116270 -78845 18748 5801 -23364 -42793 -112574 -89634 -75499 -122911 -86184 -134532
21236a34532K4731K5682l9056k3066J23888J46951N7444L2282p9034j21652p9651
21225f6013N2149J3058l0793j03841k889Q5512j4281Q7389k5617j33143r7030
21214b35499r573R8601R6822J8250j7953j2783j9590K4322O3831r418o8277k337
21202g3604J04527k7203l9880k2117p0465J43257R1387K5377J40108l3667o1437
21191A76283q7595n58K9122M338N3459j16748j53143J46178R4113n495r0960n8622
21179i628l1632j1791o6971j6892P8299Q1998o0476Q7618m930p3001L6787q9247
21167g9866m0744P6589O6564n5051N0840k9096m7635l0893J4437m6480j00159
21156b21494j5670P3995j1046j8091N832J21189Q2886j4437J122n4606k02081
$$ plain form
21236 -134532 -109801 -84119 -123175 -146241 -22353 124598 182042 214324 135290 13638 -66013
21225 -66013 -13864 -806 -31599 -135440 -138329 -52817 -67098 20291 -5326 -138469 -235499
21214 -235499 -245072 -146471 -49649 -31399 -49352 -62135 -81725 -57403 6428 -2990 -71267 -73604
21202 -73604 30923 3720 -36160 -58277 -128742 14515 105902 131279 271387 237720 176283
21191 176283 88688 88130 117252 121590 175049 58301 -94842 51336 145449 139954 48994 -9628
21179 -9628 -41260 -53051 -120022 -136914 -58615 23383 -37093 50525 45595 -27406 9381 -79866
21167 -79866 -120610 -44021 22543 -32508 18332 -10764 -58399 -89292 -74855 -121335 -221494
21156 -221494 -237164 -163169 -174215 -192306 -186474 -65285 17601 3164 4286 -50320 -252401
21145b52401K4987P8017J09713o4415O3351l2337n2425m0323N0401J1601j2453
21134a16284M9476k7629M6724J8038l7889J2963J24791L4275p0212k7907l2605
21123b6259J8221P2582L9647j38570j17116J5419J7166o8963j6384K8754n7134
21112b32637o4921J01383J42340r860p0368j2080L8051J08028l5982q8786j4764
21101a39596L2222j5776M3671M0114J11840r8824P9891J1092k109j06802q5437
21090a29714J41812J22429M857j12447L6063N4734o7432l6753J06641l669N1179
21079A67700j05655j37154o6434L5140n0053j9338K2622p226j5419J06169O2988
21068f660N0574N5407L2411r1066m5906J976M5209j5338m3773R3281L1081j11556
$$ plain form
21145 -252401 -227414 -149397 -39684 -104099 -40748 -73085 -125510 -165833 -115432 -103831 -116284
21134 -116284 -66808 -94437 -47713 -29675 -67564 -54601 70190 104465 34253 6346 -26259
21123 -26259 -8038 64544 104191 -34379 -151495 -136076 -118910 -187873 -204257 -175503 -232637
21112 -232637 -297558 -196175 -53835 -63695 -134063 -146143 -108092 -64 -36046 -124832 -139596
21101 -139596 -107374 -123150 -79479 -39365 72475 -26349 53542 64634 62525 -44277 -129714
21090 -129714 12098 134527 139384 26937 63000 117734 50302 13549 120190 116521 167700
21079 167700 62045 -75109 -141543 -106403 -156456 -175794 -153172 -160398 -175817 -69648 -6660
21068 -6660 43914 99321 131732 40666 -5240 -3264 41945 26607 -17166 76115 107196 -4360
21056d360j92891l0851O8506l9806m1942J3394L0110K7339J09014k4575n2147
21045a38209L7807J59855l0036j44615P5319O8376l2022l3944n4695k5885M4372
21034g3677N2899p8907O8569R9145q3689K6116J7862J8121m8312O245M5412k7291
21022B2493p8459m0629k3751n9834k3066N4001j05255m4848J07133P4237J95569
21011G7591J75050q6395j78574r1716J9758O4312N9840P8668Q3135l5050N0890
21000B17509j00184j17427q7390Q9202j6890m8297Q4552k0224n446q9085k1413
20989a15093l4126L6348l8724L1728l2377j4276P8471R6781o696r7265M2567J20657
20977F7995q3012n286Q0330O1898O0836J02315n9904k0503j03379J5328n7741
$$ plain form
21056 -4360 -197251 -228102 -159596 -199402 -241344 -227950 -197840 -170501 -61487 -86062 -138209
21045 -138209 -100402 59453 29417 -115198 -39879 28497 -3525 -37469 -92164 -118049 -73677
21034 -73677 -20778 -99685 -31116 68029 -15660 10456 28318 46439 -1873 4372 49784 22493
21022 22493 -55966 -96595 -120346 -180180 -203246 -149245 -254500 -299348 -192215 -117978 77591
21011 77591 252641 166246 -12328 -104044 -84286 -19974 39866 118534 201669 166619 217509
21000 217509 117325 -102 -87492 1710 -15180 -63477 21075 851 -4595 -93680 -115093
20989 -115093 -149219 -112871 -151595 -119867 -152244 -166520 -88049 8732 2036 -95229 -52662 67995
20977 67995 -15017 -20303 60027 121925 182761 285076 225172 204669 101290 116618 58877
20966E8877K215k5702o6336l2231l4317n260N8469m4725o1837N2905m4465K5271
20954a17136J11113J0079j29891P7207L5410j4544k7595l8318j5156o9552Q93
20943a77490N5418M7576q2494J8475P5996N1632P4413l9129j79753o0852j9182
20932b35390R0785R6781Q579M3340p5587P0013L8393K1221q329p9315P8845P9030
20920A28366m2372L2727L1737m34l7760L0739M9065n8231j69522K980n0106M325
20908g8486j0512N4099Q3098O659l4648j73937p7462r1394M020K63311J688l5625
20896h9189k4616N7295J6922Q070j01699K9434M4760Q0925L2061J05034q9707
20885F9290n2472l7839J171K0500l9043p4263K3164J18685M9581K2606M0134j9318
$$ plain form
20966 58877 61092 35390 -30946 -63177 -97494 -102754 -44285 -89010 -150847 -97942 -142407 -117136
20954 -117136 -6023 4056 -125835 -48628 -13218 -27762 -55357 -93675 -108831 -178383 -177490
20943 -177490 -122072 -74496 -156990 -138515 -62519 -10887 63526 24397 -155356 -216208 -235390
20932 -235390 -144605 -47824 -39245 4095 -71492 -1479 36914 58135 49806 -29509 49336 128366
20920 128366 85994 118721 150458 150024 112264 143003 192068 133837 -35685 -32705 -82811 -78486
20908 -78486 -88998 -34899 48199 54858 20210 -153727 -231189 -322583 -318563 -55252 -53564 -89189
20896 -89189 -113805 -56510 -39588 -31518 -133217 -103783 -59023 21902 53963 158997 69290
20885 69290 16818 -21021 -19850 650 -38393 -112656 -89492 29193 78774 101380 141514 122196
20873A22196O1477l0722j08574j93k2978m3220k0324J34368O2516m1233n0973
20862F2340l2368N672J0109M6813m2016j4464o001j5678L6222l8756p0879L6352
20850b2654R7242K8184L2835n5698l2618p2410q5514R455K12957J03221m2919
20839A72081L1241n6293N816m458L600L8711J6498r9956j41539j9795Q7492K789
20827C6187L7674k5741m0514m5031j06504o1330K30482R6314j27926r8356R4191
20816a0554m2733L3965R9581P118K3950L4904N8819k0467l6369l9234P7309J55034
20804C41323J36759P2972Q3700p8416L6135O1420j1732P2254N8031J5877J07476
20793H95799l2673m813K9313o3315r708o5560o5098M7913O3075j2347r9721j18002
$$ plain form
20873 122196 183673 152951 44377 44184 21206 -22014 -42338 92030 154546 113313 62340
20862 62340 29972 35644 45753 92566 50550 36086 30085 14407 50629 11873 -59006 -22654
20850 -22654 74588 102772 135607 79909 47291 -25119 -110633 -101178 111779 215000 172081
20839 172081 203322 147029 152845 148387 151987 190698 207196 107240 -34299 -54094 33398 36187
20827 36187 73861 48120 7606 -37425 -143929 -205259 25223 121537 -6389 -104745 -10554
20816 -10554 -53287 -19322 80259 87377 111327 146231 205050 184583 148214 108980 186289 341323
20804 341323 478082 551054 634754 556338 592473 653893 642161 714415 772446 788323 895799
20793 895799 863126 858313 887626 824311 814603 749043 683945 731858 794933 782586 682865 564863
20781E64863m8060j33275o2110j6124O4825k1082r4341k4967J51828O4609n844
20770D40322J07042K32464o14q1561J60144M3694Q1932N5206O4993k9096J1674
20759A086200K5992m6840r4519m9139o4961j05849M6232j22218j92155J7999N9412
20748E60154j6530j16386r2343j37852p1778N1613M8871k1652J09583J02543P6926
20737D93149k9971j07556n0621j10732k1626O9247o3650q5903P5470j1496o0939
20726I5372Q509M931m0001l9562m6567k0757J5545p480l9227n2572N4899J6130
20714e0780O4438J09191L9962m4692O5089J30326M9170j5642j17067j32563Q479
20703A05911J13946m5199j04585j168J0623N345j02461R1619R5690r9869j33837
$$ plain form
20781 564863 516803 383528 321418 305294 370119 349037 254696 229729 381557 446166 440322
20770 440322 547364 779828 779214 697653 857797 901491 983423 1038629 1103622 1074526 1086200
20759 1086200 1112192 1065352 970833 921694 856733 750884 797116 674898 482743 500742 560154
20748 560154 543624 427238 334895 197043 125265 176878 225749 204097 313680 416223 493149
20737 493149 463178 355622 305001 194269 172643 241890 178240 92337 167807 156311 95372
20726 95372 103881 108812 68811 29249 -17318 -38075 -22530 -30010 -69237 -121809 -66910 -50780
20714 -50780 13658 122849 162811 118119 183208 313534 362704 347062 229995 97432 105911
20703 105911 219857 174658 70073 68905 79528 84873 -17588 74031 169721 69852 -63985
20692f3985q5247n082J0501Q2912M7243J06833L271p0403l9908M0269M3813j1000
20680E9217l4439M7648K7683K0114n1840o1516j2703k720K142m4294n4841m7636
20668a53185m657m565L4135L9607M7026J6299M9666J09595P2504l3317j25277
20657D7831j25697j2635J4105o8617q9967K2660P8372N6154J03364N2596o1724
20646A6442l5498J83176J4894j31633j58391Q1898J15080k3026m1752j1559M4438
20635E4069O2166N1598L1347r3297r4663n2123j4994k6211L4680O796j4107m411
20623e9150K5996j2140m5478R819M236J43709J04284j13100j26613l4611M7381
20612e5667O9314k3191k315l3620J13821K3891j42143k3796J11714n0086l8740
$$ plain form
20692 -63985 -149232 -154314 -143813 -60901 -13658 93175 96446 26043 -13865 26404 70217 59217
20680 59217 24778 72426 100109 120223 68383 6867 -5836 -8556 -6414 -50708 -105549 -153185
20668 -153185 -157842 -162407 -128272 -88665 -41639 -25340 24326 133921 206425 173108 47831
20657 47831 -77866 -90501 -76396 -145013 -234980 -212320 -133948 -77794 25570 78166 16442
20646 16442 -19056 164120 179014 47381 -111010 -29112 85968 62942 21190 9631 54069
20635 54069 116235 167833 199180 105883 11220 -40903 -55897 -82108 -47428 -40632 -54739 -59150
20623 -59150 -33154 -45294 -90772 -80953 -76717 66992 171276 58176 -68437 -103048 -55667
20612 -55667 13647 -9544 -11859 -45479 68342 92233 -49910 -73706 38008 -12078 -50818
20601e0818l1710q5636J74911P1221M7398J54897m5639r8935j29988q6383j5801
20590i6483q8953J11014J20081J330j02053r4280p437K1466o6395N421J08374
20579h7915l69J3806Q2698R4582R179j3457q771j12482l1096L6438o6169m2557
20567a26113k4786J9593N309R2296L7625L3328N4573M7879p896L8693o7662k170
20555A00669n7225j18695k048r8343K2330J11302J9746M3906N2361l0606k13959
20544a70562m8680R177K3266m392L3799l525m2873k3392m5387J32643J06407n672
20532c9191J836l2272N6160Q2552j02334n2369J9374M2305N825j29494J46024
20521a584N7416l98M0438J33076K4705j13935o7602n2682p1932L2038L8714Q1901
$$ plain form
20601 -50818 -82528 -168164 6747 77968 125366 280263 234624 135689 5701 -80682 -96483
20590 -96483 -185436 -74422 45659 46989 -55064 -149344 -156781 -135315 -201710 -196289 -87915
20579 -87915 -88284 -74478 8220 102802 111981 98524 89753 -22729 -53825 -17387 -83556 -126113
20567 -126113 -150899 -131306 -125997 -33701 3924 37252 91825 139704 131808 170501 102839 100669
20555 100669 43444 -75251 -77299 -175642 -153312 -42010 -22264 21642 74003 43397 -170562
20544 -170562 -219242 -210065 -186799 -191191 -157392 -160917 -203790 -227182 -272569 -139926 -33519 -39191
20532 -39191 -37355 -69627 -13467 69085 -33249 -85618 -66244 -23939 -18114 -147608 -1584
20521 -1584 55832 55434 95872 228948 253653 139718 72116 19434 -52498 -20460 18254 100155
20509A00155o331n1496p7852n404P7249L5368o5666J6159O7707j19962Q0192L2539
20497H2658j3822J3534q8293K4869N118K819P3170r9659j47811l328J38677Q8835
20485G6767l6939o943l8050P3410M3402k8158k96J30960J127m1732q672Q9751
20473B54627J17133j5791q6763j58238n2775p6226r2423M1467J01002J22449l8903
20462A15559L8219L2368k5027r2391j4951Q3918p7542j1606Q2291J7203o5465
20451H2576k2152P7082r4728q047l8216q7367m9701J15735j9341n7959J6251J4030
20439g1837O9366J9810N7684m2770o1914j3672J16733j2365J9092j31791r7773
20428a49437M5291k03471l8774R6686K8208J5728n5476n3957J9893Q403J73550
$$ plain form
20509 100155 93824 42328 -35524 -40928 36321 71689 6023 22182 89889 -30073 50119 82658
20497 82658 68836 82370 -5923 18946 24064 26883 100053 394 -147417 -150745 -12068 76767
20485 76767 39828 32885 -5165 68245 111647 83489 83193 214153 215280 173548 164876 254627
20473 254627 371760 355969 269206 110968 58193 -18033 -110456 -68989 32013 154462 115559
20462 115559 153778 186146 161119 68728 53777 137695 60153 48547 130838 148041 82576
20451 82576 60424 137506 42778 34731 -3485 -90852 -140553 -24818 -44159 -102118 -85867 -71837
20439 -71837 -2471 17339 75023 32253 -29661 -43333 73400 61035 80127 -51664 -149437
20428 -149437 -104146 -307617 -346391 -249705 -221497 -205769 -261245 -315202 -295309 -286906 -113356
20417a13356N2342J6446P7634n4422j64947m6241R4148R3692K10968m5522r8138
20406B2604l4724q3765O1020O2048Q6138r2299j41393P7435K6948o1351L7192
20395d0147M7937M091K4399j07030m0420Q2957K2034L1055M8818m4396q877Q3274
20383A03695Q4965M265J6538J9239Q5189J6824j7459l0066p6734r3268j9738O1749
20371A55199J7932M7524n954J07241q1604m8549j9732R2385O5341p5668j10930
20360A43185L9131J5618k4743J29390J63537M2573j708j13444j21147j2604N1422
20349C11210o3346q6773r871P2297k4490N3670P760J8228j2356L2833J03534P3965
20337D76661l814l143m7835n7654L1581J39079R1210Q595Q344N1335P2392n7885
$$ plain form
20417 -113356 -61014 -44568 33066 -21356 -186303 -232544 -138396 -44704 166264 120742 22604
20406 22604 -12120 -95885 -34865 27183 113321 21022 -120371 -42936 -15988 -77339 -40147
20395 -40147 7790 11881 36280 -70750 -111170 -28213 -6179 24876 73694 29298 20421 103695
20383 103695 188660 192925 209463 228702 313891 330715 313256 283190 206456 113188 93450 155199
20371 155199 173131 220655 214701 321942 240338 191789 172057 264442 329783 254115 143185
20360 143185 182316 197934 173191 302581 466118 508691 506983 393539 272392 259788 311210
20349 311210 247864 161091 151220 223517 199027 252697 260457 278685 266329 299162 402696 476661
20337 476661 472847 469704 421869 364215 395796 534875 626085 634680 643024 694359 766751 708866
20325G08866l5381P4353L6330o4001q6323P2927J8482p9049N2610J52342J14596
20314I65752J77649J88043n5710j21090m7496l5716Q2143K01344K23728J22029
20304A700676j0871q9708p6566k23888q1673N0813j1943m1542O6726K7924k5854
20293A284094n7695l0189r8065P5418J06553P5063N2919J62041M1534n139P7878
20282A684412M5631K634J4405L9434P6036R0018K02763J27407K02212J16186J89196
20271B790334R6363J14823J69533K20354J31209R8914K62038J43600Q953R0176
20261D126297J60801J84288L08095J77091J44838K15975K80553K64251L98360
20252F260549L39124M27857N00548N45304P25689J066192J198786J615136K269091
$$ plain form
20325 708866 673485 747838 784168 720167 633844 706771 725253 646204 698814 851156 965752
20314 965752 1143401 1331444 1275734 1154644 1107148 1071432 1153575 1354919 1578647 1700676
20304 1700676 1689805 1600097 1523531 1299643 1217970 1268783 1256840 1215298 1282024 1309948 1284094
20293 1284094 1226399 1196210 1098145 1173563 1280116 1355179 1408098 1570139 1611673 1606534 1684412
20282 1684412 1730043 1732677 1747082 1786516 1862552 1952570 2155333 2282740 2484952 2601138 2790334
20271 2790334 2886697 3001520 3171053 3391407 3522616 3621530 3883568 4027168 4036121 4126297
20261 4126297 4287098 4471386 4779481 4956572 5101410 5317385 5597938 5862189 6260549
20252 6260549 6599673 7027530 7528078 8073382 8799071 9865263 11064049 12679185 14948276
20243A4948276L212354M745236P218680J0936948J5222326J6415008J3099556
20236H5798384J0734851J1844966J1974960Q583951N334395K580783K324012P197786
20228A46374088J1293887P424731k296386o346302j820344K413011K37652l798501
20220A53481836o304505p803581o527511n338087r538410j5508614j6073755j1570150
20212G4817223o044811j269698L549351Q958073J3894488J4140454J0636022R749123
20204A28430225J1461636J0924491Q008160M956778Q56118J806435P755620R870562
20196A84070025J695042p762051q009298j792076J697811o56677m123862p266343
20188A57852571q555271o903171p112676j3189849j9038091j8412972j3718812
$$ plain form
20243 14948276 18160630 22905866 30124546 41061494 56283820 72698828 85798384
20236 85798384 96533235 108378201 120353161 128937112 134271507 136852290 139176302 146374088
20228 146374088 157667975 165092706 162796320 156450018 154629674 157042685 157280337 153481836
20220 153481836 147177331 139373750 132846239 127508152 117969742 102461128 86387373 74817223
20212 74817223 68772412 67502714 71052065 80010138 93904626 108045080 118681102 128430225
20204 128430225 139891861 150816352 158824512 163781290 164637408 166443843 174199463 184070025
20196 184070025 185765067 178003016 169993718 168201642 169899453 169242776 165118914 157852571
20188 157852571 149297300 142394129 135281453 122091604 103053513 84640541 70921729
20181G0921729r369475o627434m923122l889787k988882k406540k113935j781446
20173C6821108j270098j217613j214581j106452j006651r14183p26405q23751
20165B8541374r00329q31952q31190q51187q77501p29859n59924o14280o74971
20156B1670181n65409n69654o84302n47950o39991n87068o22357o17577n53553
20147A6282320o61742n29039n49074m27068m27007k96332m04657l74353l57972
20138A2255076l39331j92655j57424j47756l14531k87730l93771k71202j29395
20129A0021281j02579j09935k04599j44800j74455l30859k95165k61553j55524
20120H241812k21581k56598j89215m2893l9253j16808k14019l03536j40602j15398
$$ plain form
20181 70921729 61552254 54924820 50001698 46111911 43123029 40716489 38602554 36821108
20173 36821108 35551010 34333397 33118816 32012364 31005713 30091530 29365125 28541374
20165 28541374 27641045 26809093 25977903 25126716 24249215 23519356 22959432 22345152 21670181
20156 21670181 21104772 20535118 19850816 19302866 18662875 18075807 17453450 16835873 16282320
20147 16282320 15620578 15091539 14542465 14115397 13688390 13392058 12987401 12613048 12255076
20138 12255076 11915745 11723090 11565666 11417910 11103379 10815649 10421878 10150676 10021281
20129 10021281 9918702 9808767 9604168 9459368 9284913 8954054 8658889 8397336 8241812
20120 8241812 8020231 7763633 7574418 7531525 7492272 7375464 7161445 6857909 6717307 6601909
20110F601909k55486k91479k32095k23427j35405p8356k0856o6274Q021n3555
20100E252997j1849n9905q3333r6252k12132j72097k8025j19730j53378q0195
20090D236101j12044o3822N4291k0323j24548q7944j62338j04643j13739l7465
20080C463526j43589r6866m6759n8294j63268l4418j34507q0743q8927j35718
20070B480437l9338n1011l1615R9779m1278q5897m4674l2199j35864k15953N6263
20059A958650J4791j3252k8985o3851m9972J4318q6014o0902k6270j18674l7644
20048A502195r1461j11912j8128O9875N9374P9948L4358m5392j34494O7064j02003
20037A309424N017M7031K1850j36234m0712N6916l6589k00630o5872q9342j3648
$$ plain form
20110 6601909 6346423 6054944 5822849 5599422 5464017 5385661 5364805 5298531 5306552 5252997
20100 5252997 5241148 5181243 5097910 5001658 4789526 4617429 4589404 4469674 4316296 4236101
20090 4236101 4124057 4060235 4114526 4094203 3969655 3881711 3719373 3614730 3500991 3463526
20080 3463526 3319937 3223071 3176312 3118018 2954750 2920332 2785825 2705082 2616155 2480437
20070 2480437 2441099 2390088 2358473 2458252 2416974 2331077 2286403 2254204 2118340 1902387 1958650
20059 1958650 1973441 1960189 1931204 1867353 1817381 1831699 1745685 1684783 1658513 1539839 1502195
20048 1502195 1410734 1298822 1280694 1350569 1409943 1489891 1524249 1478857 1344363 1411427 1309424
20037 1309424 1314441 1361472 1383322 1247088 1206376 1263292 1226703 1026073 960201 870859 857211
20026H57211P0323n4685j22178o8723k8698J61860n395r1529l0673j00623j19192
20015D67698J0358J4598k009J30068L3798r819M2173k7077j2253j1493m0812Q946
20003F04176j38720K0738Q5622Q5933P9609P650m7773J53992k7880j29470j6137
19992F77740j17079O1200O1483l3347k9476M9130j24837j62298j0015J36517P9961
19981E88979j8216P698j3218P085M8119o6912n5562O6686J9936j27142j00581
19970C56872k9987K4650P8089Q2130p7361j9746l1110j6089L0466m1044j5463
19959C41407O2894n9800j3272p9591P0837L3429k4108m863M6459m1385L6253L3518
19947D01778Q9072p3031p2822N2414N3371l3306j8120j11209p4867o7091K1841
$$ plain form
20026 857211 927534 872849 750671 681948 653250 815110 809715 718186 687513 586890 467698
20015 467698 478056 492654 490645 620713 654511 644692 686865 659788 647535 636042 595230 604176
20003 604176 465456 486194 571816 657749 737358 745008 697235 851227 823347 693877 677740
19992 677740 560661 621861 683344 649997 620521 669651 544814 382516 372501 509018 588979
19981 588979 570763 578461 565243 572328 620447 553535 497973 564659 584595 457453 356872
19970 356872 326885 351535 429624 511754 434393 414647 383537 367448 397914 356870 341407
19959 341407 404301 344501 331229 251638 322475 355904 331796 326933 373392 332007 368260 401778
19947 401778 490850 417819 344997 397411 450782 417476 399356 288147 213280 146189 168030
19936A68030P4860M5691N3559N366J11714O8426j35243j10232J0842P0967p7034
19925B86946p4859p1015l0266r9796J8809J17608J06592N9494l1766k2695m8321
19914B10731P2965R3080m0755n2347L4355O6169j73030j57390r6425j9235j3203
19903g5085M3119M7909Q2632J56460O2550q2802M7646k0115J23475N6075o3257
19892C78607k7820j16442j18997J243j07099R6107J10266m0148P215L3116P2393
19881B88441O947N0537N1458K379l2565p3838K3236M4682J92255J22519J13605
19870G89656J9941q657j1121J63825Q5262K3431J5143J00983J6024j32876k28875
19859H32736k45464o8245j34644N3957J9061m6774m8061p7844K7155R2196K9394
$$ plain form
19936 168030 242890 288581 342140 347506 459220 527646 392403 282171 293013 363980 286946
19925 286946 212087 141072 110806 11010 29819 147427 254019 313513 281747 259052 210731
19914 210731 283696 376776 336021 283674 318029 384198 211168 53778 -42647 -61882 -75085
19903 -75085 -31966 15943 98575 255035 317585 234783 282429 262314 385789 441864 378607
19892 378607 350787 234345 115348 116591 9492 105599 215865 175717 182932 216048 288441
19881 288441 295388 345925 397383 399762 367197 293359 316595 361277 553532 676051 789656
19870 789656 809597 800940 789819 953644 1038906 1062337 1077480 1178463 1194487 1061611 832736
19859 832736 587272 519027 384383 438340 457401 410627 362566 284722 311877 404073 433467
19848D33467r7778m4497J01994o929m3151l5063p996j6942l3629l7327k7788M0858
19836B25219R4879P2255j18937M4156J9872l9455l3843o2965J48461J41527L5690
19825E26859q53L6658k0708J34558K79125Q2836n03J28435R4556m6413n7441J08942
19813A266051j2512j16250j22908r8492k7475M8732J6557M2726n4839j22105q5737
19802G33748q1762p4182k1676P364j33495m1557P0626j3310l9281j4040M8690
19791D41125o3432O5426l5785j32838r5906p3770m0528M564M9119j5865J25897
19780B28007k4281L5538P6903n5608J4184K8145k0697o0198M9447j39841n7211
19769G4388L6668L7897N1476J03572k5616j03827q7442q1991P7734Q8172J42803
$$ plain form
19848 433467 335689 291192 393186 386257 343106 308043 300047 283105 249476 212149 184361 225219
19836 225219 320098 392353 273416 317572 337444 297989 264146 201181 349642 491169 526859
19825 526859 526006 562664 541956 676514 955639 1038475 1037972 1166407 1260963 1214550 1157109 1266051
19813 1266051 1253539 1137289 1014381 915889 888414 937146 953703 996429 941590 819485 733748
19802 733748 651986 577804 556128 563492 429997 388440 459066 445756 406475 392435 441125
19791 441125 377693 443119 407334 274496 178590 104820 64292 68856 117975 102110 228007
19780 228007 203726 239264 316167 260559 274743 302888 282191 221993 271440 131599 74388
19769 74388 111056 148953 200429 304001 278385 174558 87116 5125 82859 171031 313834
19758C13834L1002j01250j3155K2910k6838p5140M2440j0242j60028j17437N2376
19747d1528k2006L9457O6244Q3525l0567m1614m3804P5367J29785p9590P6538
19736B11807q6755R385P2175L6257r2719O3140J9330L435j39007p8991P7093P8012
19724A73162j469K7932n0128j01220j24350K3688J19370O4198J25124l4900J4522
19713B35929r2302r369P8864j61840L5686K801L6130O1398M6037J8348k9519j6210
19701B05953j58559p9262j4767J60694k7177j05095J29456P5813J2408j11175
19691H8289M3226J09586J0978J19849P5746k8579Q4363O2446Q0712l3048N911
19680F19479j09602p312m9783p0276k7991J838Q3739P3978R5434J12091n8825
$$ plain form
19758 313834 344836 243586 230431 253341 226503 151363 193803 183561 23533 -93904 -41528
19747 -41528 -63534 -24077 42167 125692 95125 53511 9707 85074 214859 135269 211807
19736 211807 125052 134437 206612 242869 150150 213290 232620 236055 97048 18057 95150 173162
19724 173162 171693 199625 149497 48277 -76073 -52385 66985 131183 256307 221407 235929
19713 235929 143627 134258 213122 51282 86968 89769 125899 187297 233334 251682 222163 205953
19701 205953 47394 -31868 -46635 114059 86882 -18213 111243 187056 199464 88289
19691 88289 131515 241101 252079 371928 447674 419095 503458 565904 646616 613568 619479
19680 619479 509877 502565 452782 382506 354515 356353 440092 514070 609504 721595 662770
19669F62770m0825K8601J16388P6298N8414P2425M9713j3561K2793K7056m1308
19658A018764N7054J34980q895o7664j55617L690M5455k5212j9788K5440J7468
19647A025675K8598M2991j11504j11445R532j14282r3189J36136K40017J56709
19637A209238J31473K8309K1040N704L1287J40713O362l7159J01777J03244m8949
19626A693039l794O4205K23729K4648q7571n008l6229j09589j48638j40046o4732
19615A410014q4031j49074n9232K740N1955n4979j70060j4666r1209j48418p1187
19604F21853j1155j54834k5402N4263J13165J37127L1758l0446l8790M6748R4299
19593H38586Q383R4442P8744K3611R1683J49208R1277J49235J42695K15460J35029
$$ plain form
19669 662770 621945 650546 766934 843232 901646 974071 1023784 1010223 1033016 1060072 1018764
19658 1018764 1075818 1210798 1201903 1134239 978622 982312 1027767 1002555 982767 1008207 1025675
19647 1025675 1054273 1097264 985760 874315 883847 769565 676376 812512 1052529 1209238
19637 1209238 1340711 1369020 1390060 1395764 1427051 1567764 1574126 1536967 1638744 1741988 1693039
19626 1693039 1689245 1753450 1977179 2001827 1914256 1909248 1873019 1763430 1614792 1474746 1410014
19615 1410014 1325983 1176909 1117677 1120417 1172372 1117393 947333 932667 841458 693040 621853
19604 621853 610698 455864 430462 484725 597890 735017 766775 736329 697539 744287 838586
19593 838586 846969 941411 1020155 1043766 1135449 1284657 1375934 1525169 1667864 1883324 2018353
19582B018353Q0941L9800l1550k17264k75707k18863j76484j8437m1247k2459
19572A137083R189j16030l1764l9233r0475L7621K2452n1901n1256J35214K55201
19561A216101Q2597K15989J53247J20086P1206K5461P2129N453k85540k42420
19551A434309j11725j62293l3158j17438m4034m870q5683m2205j6197l880p7518
19540G35308K2054Q296l9835j35243O7260P4440m8329m978L1934n6531L2932j0112
19528F77196m6103m5295J1652J2194j00367o9093n4777p7090m8225j9509O7776
19517C08359P3457k6521M651j3503j19618O5400J27878N2595r4245j78016k7390
19506A73047J828Q4318J32837M0145k492o6029P0807N9515o3010j24440O6647
$$ plain form
19582 2018353 2099294 2139094 2107544 1890280 1614573 1395710 1219226 1200789 1159542 1137083
19572 1137083 1146272 1030242 998478 959245 868770 906391 928843 876942 825686 960900 1216101
19561 1216101 1298698 1514687 1667934 1788020 1859226 1884687 1956816 1962269 1676729 1434309
19551 1434309 1322584 1160291 1127133 1009695 965661 960791 875108 832903 816706 812826 735308
19540 735308 757362 765658 725823 590580 657840 732280 683951 678973 710907 654376 687308 677196
19528 677196 631093 585798 597450 609644 509277 440184 385407 308317 260092 240583 308359
19517 308359 381816 355295 359946 346443 226825 292225 420103 472698 378453 200437 173047
19506 173047 174875 259193 392030 432175 429683 363654 434461 493976 430966 306526 373173
19495C73173J24086j41615O4515N9092J5390P0029l8202j36190l3933L9468l5934
19484C59879k2425O5243K4925m5430o691J28762j23861Q1136J67413L5314P788
19473F72053o3460J34367l6150q988k6374r1959P7039J1104j399q7009j1957K7667
19461E94934M4745j3225J5998J1163j40742j74393J80699J48503J31006L7063
19451H35751m3933l7237k1703k3108j48928j34696p4188k2900J27513j7671O7684
19440E06584J73970K01634J18155N3480K7317J00240J12293K59569K24747J53623
19430A931612J05927R4766J10642N3980j8134k88960j54526j29229j15483l2584
19420A558011j13880o3853k814R7709P7416J0339J9208J07168J48398m2670n5266
$$ plain form
19495 373173 497259 355644 420159 479251 494641 564670 526468 390278 356345 395813 359879
19484 359879 337454 402697 427622 382192 375501 504263 380402 461538 628951 664265 672053
19473 672053 608593 742960 706810 697822 671448 579489 656528 667632 666233 579224 567267 594934
19461 594934 639679 626454 642452 653615 512873 338480 519179 667682 798688 835751
19451 835751 791818 754581 732878 709770 560842 426146 351958 329058 456571 438900 506584
19440 506584 680554 882188 1000343 1053823 1081140 1181380 1293673 1553242 1777989 1931612
19430 1931612 2037539 2132305 2242947 2296927 2278793 1989833 1835307 1706078 1590595 1558011
19420 1558011 1444131 1380278 1377464 1475173 1552589 1562928 1582136 1689304 1837702 1795032 1739766
19409A739766J49228K04579K86711K37133J88568K45098N0580m2072j11419k37549
19399B710623j36830j29937j12533q1821J46992J12974j00996m5449J30859J520
19389B495402q5846Q4721J38143M6568J06991R4028Q5927J20688K06622J97079
19379C490323K34590K86173J40006K59442L03405M78678M30695M50732O47928
19370F721972P44668P58890P16972R75078J298308J552708K125886L026605M440464
19361B2361551O439593R421619J2256921J2644985J0238450R251442J0786185
19354I3400746J1557559J1516833J2595240J1987815P985576N237427M343646
19347A58624842l40831p777539j1595149j1397254r940914p532103o425588r085221
$$ plain form
19409 1739766 1888994 2093573 2380284 2617417 2805985 3051083 3101663 3059591 2948172 2710623
19399 2710623 2573793 2443856 2331323 2249502 2396494 2509468 2408472 2363023 2493882 2495402
19389 2495402 2409556 2494277 2632420 2678988 2785979 2880007 2965934 3086622 3293244 3490323
19379 3490323 3724913 4011086 4151092 4410534 4713939 5192617 5623312 6074044 6721972
19370 6721972 7466640 8225530 8942502 9917580 11215888 12768596 14894482 17921087 22361551
19361 22361551 28801144 38222763 50479684 63124669 73363119 82614561 93400746
19354 93400746 104958305 116475138 129070378 141058193 149043769 154281196 158624842
19347 158624842 158284011 150506472 138911323 127514069 117573155 110041052 103615464 94530243
19339I4530243j3291231j4000431j1236777p873430n527283m110387l113083k477076
19331C2900545k021853j642721j279187r80273p65461n04205l62518k31404j64893
19322B4948030K8485J46334J37700N38328Q87814R96560J323491J884223K533736
19313C3424701L515018N232343P807165J1493228J6587527K0664320K0024400
19306A18748702J6188520J5438176J7834110J8742563J8336168J8605075J4992080
19299B38885394R212375O474631L372600o846882j7259840j9525706j7272472
19292A97040100j4743157j1509536j0663419j5294073k0944271k1014286j6568870
19285H6302488j1825121q449362o294645m931971m148155l298420k692311k332383
$$ plain form
19339 94530243 81239012 67238581 56001804 48128374 42601091 38490704 35377621 32900545
19331 32900545 30878692 29235971 27956784 26976511 26211050 25706845 25344327 25112923 24948030
19322 24948030 24976515 25122849 25260549 25798877 26686691 27683251 29006742 30890965 33424701
19313 33424701 36939719 42172062 49979227 61472455 78059982 98724302 118748702
19306 118748702 134937222 150375398 168209508 186952071 205288239 223893314 238885394
19299 238885394 248097769 254572400 257945000 251098118 233838278 214312572 197040100
19292 197040100 182296943 170787407 160123988 144829915 123885644 102871358 86302488
19285 86302488 74477367 66028005 59733360 54801389 50653234 47354814 44662503 42330120
19277D2330120k165780j850238j587795j486851j307380j259082j223237j201536
19269C0248221j093407r54716r84022j062645q16466q13550p29609p77880o76891
19260B2339035p34168p82282o21394n79595o66237n57899n38977m04568l86764
19251A7067151n18667n21756n50336l49618l70514l24424l72680l59873l15124
19242A3384159k95936k53864l31209l43936k57061k57837l65520l03626j91984
19233A0783186l1441j93616l35782l18914r7016p2767p3855n5870Q872Q5941n1905
19222I646833k31126j52170q8919j21677k15024k78522k64126L6294J32867p8074
19212H386356p7506j0514k14243k39780k78936k50364j17461p1430o2456r6212
$$ plain form
19277 42330120 40164340 38314102 36726307 35239456 33932076 32672994 31449757 30248221
19269 30248221 29154814 28200098 27216076 26153431 25336965 24523415 23793806 23015926 22339035
19260 22339035 21604867 20822585 20201191 19621596 18955359 18397460 17858483 17453915 17067151
19251 17067151 16548484 16026728 15476392 15126774 14756260 14431836 14059156 13699283 13384159
19242 13384159 13088223 12834359 12503150 12159214 11902153 11644316 11278796 10975170 10783186
19233 10783186 10751745 10558129 10222347 9903433 9806417 9733650 9659795 9603925 9612797 9698738 9646833
19222 9646833 9415707 9263537 9174618 9052941 8837917 8559395 8295269 8331563 8464430 8386356
19212 8386356 8308850 8298336 8084093 7844313 7565377 7315013 7197552 7126122 7063666 6967454
19202F967454j57922p1586N5540N7569l4592J4459K617k69697j94124P8263J71273
19191F619254J17559O9505P3235J66285K14291J26170J543K4001K11347J65128
19181G788318L6883M3152J65275K33621L73703N28278O09991P06277P78491Q20009
19171A2083998J165473J792299K355915L255216M912935P796262J2042292J7127375
19163F2531765J8668698J2775905P053053N682178K125678p457132j4447254j2422436
19155G4510455n600483K360617J0136616J4373181J0827354M464296K659507M53203
19147A14184746q281198j7632524j8556169j3831049r148533n982392m257412
19140C6495469k863227k209941j659779j337422j112088r97386p36608n18914
$$ plain form
19202 6967454 6809532 6737946 6793486 6851055 6816463 6830922 6833539 6563842 6369718 6447981 6619254
19191 6619254 6736813 6806318 6879553 7045838 7260129 7386299 7387842 7411843 7623190 7788318
19181 7788318 7825201 7868353 8033628 8267249 8640952 9169230 9779221 10485498 11263989 12083998
19171 12083998 13249471 15041770 17397685 20652901 25565836 33362098 45404390 62531765
19163 62531765 81200463 93976368 101029421 106711599 108837277 101380145 86932891 74510455
19155 74510455 68909972 71270589 81407205 95780386 106607740 111072036 113731543 114184746
19147 114184746 105903548 88271024 69714855 55883806 46735273 40752881 36495469
19140 36495469 33632242 31422301 29762522 28425100 27313012 26315626 25579018 25060104
19132B5060104m91892m09079j16954K62874M26433P03174Q31855J141238J379321
19123B8787074J915823K559776L796107N688658Q560896J3300349J9505691K3067679
19115A07182053J9963903J5755924J5796015J2546439N4112j0849595j1525690
19108A48923161q210392n576735m98994O515185R499927Q707003R596669Q494100
19100A77449924j544297j3169079j6691161j6162010j7846076j8739559j5703891
19093G7593851j1169012p556187n395403m198857l248610k485828k132827j885263
19085C9521864j406453j104993r12844p18637o02818l83086k68426l48181l19682
19076C3456744k45396k37514J31583L52912Q05259J515584K444218L710104N903495
$$ plain form
19132 25060104 24568212 24159133 24042179 24305053 24731486 25434660 26266515 27407753 28787074
19123 28787074 30702897 33262673 37058780 42747438 51308334 64608683 84114374 107182053
19115 107182053 127145956 142901880 158697895 171244334 171298446 160448851 148923161
19108 148923161 140712769 135136034 134637040 141152225 150652152 159359155 168955824 177449924
19100 177449924 175905627 162736548 146045387 129883377 112037301 93297742 77593851
19093 77593851 66424839 58868652 53473249 49274392 46025782 43539954 41407127 39521864
19085 39521864 38115411 37010418 36097574 35378937 34776119 34393033 34124607 33776426 33456744
19076 33456744 33211348 32973834 33105417 33458329 34263588 35779172 38223390 41933494 47836989
19067D7836989R376137J3525473J4420837R233312N022343M876207K521925m689806
19059A02123417r027136n758609R21897Q574249J7447030K6143119L2625465M1682090
19051B14731522N3708817M8503013K1219814J780765k735341j6880311m4459962
19044B75868317n7292542m8170149l3007097k1539075j4145215r583057o748152
19037H5383030m741705l004973j162470O73738K486279M258394O951060J1254904
19029A02098257J8307388L0002619M7758334O5970296O6648093M2143384K0215013
19022C93143384J3177500m934353m4172946p1144632o6306975m7318331l1243457
19015A41200190k0933520j4889391j1229794q725649o873918n459000m459309
$$ plain form
19067 47836989 57213126 70738599 85159436 94392748 99415091 104291298 106813223 102123417
19059 102123417 93096281 87337672 88259569 96833818 114280848 140423967 173049432 214731522
19051 214731522 268440339 316943352 338163166 339943931 337208590 320328279 275868317
19044 275868317 218575775 170405626 137398529 115859454 101714239 92131182 85383030
19037 85383030 80641325 77636352 76473882 77147620 79633899 83892293 90843353 102098257
19029 102098257 120405645 150408264 198166598 264136894 330784987 372928371 393143384
19022 393143384 406320884 401386531 357213585 286068953 219761978 172443647 141200190
19015 141200190 120266670 105377279 94147485 85421836 78547918 73088918 68629609
19008F8629609l749796l125714k558571k147148j970594k135252k129407j916058
19000D8897069j861735j807517j603724j545506j259248q50412o37575n88709
18992C8742643p91494r59249r35561j061982j340654j381325j413253j195213
18984B9663912r73362r89332q28963p06177o25880o96697n81223o45282o93223
18975B2923773n26368m38025m31250l97957l81295m73489n33831n38213m95389
18966A8707956n52052n49767l22745m26453m49883l77890l51288k92765j32599
18957A5252514k10188j93429k21144j93993k93483l44349k85296j58078l11183
18948A3041371l77733k37060j59090j75650k55909l09488l15536l59772l44914
$$ plain form
19008 68629609 64879813 61754099 59195528 57048380 55077786 52942534 50813127 48897069
19000 48897069 47035334 45227817 43624093 42078587 40819339 39968927 39331352 38742643
18992 38742643 37951149 36991900 36056339 34994357 33653703 32272378 30859125 29663912
18984 29663912 28690550 27701218 26872255 26166078 25540198 24843501 24262278 23616996 22923773
18975 22923773 22397405 21959380 21528130 21130173 20748878 20275389 19741558 19203345 18707956
18966 18707956 18155904 17606137 17283392 16856939 16407056 16029166 15677878 15385113 15252514
18957 15252514 15042326 14848897 14627753 14433760 14140277 13795928 13510632 13352554 13041371
18948 13041371 12663638 12426578 12267488 12091838 11835929 11526441 11210905 10851133 10506219
18939A0506219j58954p2902k52629k07637j46160k61343j71669j2166Q8932q3628
18929I228063j32205j0487J96118J06826K23695M07053M33132K05802L3576J17504
18919A0809077j5298k30783j97951n0360L0874K79317J82859L53201N91599P06718
18909A2459253R64676J427540J421944J343718J289500J667796K302494K693807
18901B5570728L273291M309231O001478Q731397J3294719K1374903L5729185N8757038
18893A77041970Q1923527P2025300L2515526J8478849K0302194r615779o4613600
18886C28057987q3226218o3941239m0453548k5051148j6184519j1074929p738889
18879H0387497n465133l911248k246342p22437N58540J882322M012219P402289
$$ plain form
18939 10506219 10347265 10274363 10021734 9814097 9667937 9406594 9234925 9222759 9311691 9228063
18929 9228063 9095858 9085371 9281489 9388315 9612010 10019063 10452195 10657997 10691573 10809077
18919 10809077 10793779 10562996 10365045 10314685 10345559 10624876 10807735 11160936 11752535 12459253
18909 12459253 13423929 14851469 16273413 17617131 18906631 20574427 22876921 25570728
18901 25570728 28844019 33153250 39154728 47886125 61180844 82555747 118284932 177041970
18893 177041970 258965497 330990797 363506323 381985172 402287366 392671587 328057987
18886 328057987 244831769 180890530 140436982 115385834 99201315 88126386 80387497
18879 80387497 74922364 71011116 68764774 68042337 68600877 70483199 74495418 81897707
18871H1897707J2683372K2187219L8569612N7358650N4464339K4350206J0606212
18864C02117317J3405164l982001m5941315o3971445n0573539l2248041k0132803
18857I8673337j3365251r507218p349700n685298m581560l569284k725196k258031
18849D9631799k204981j979627j709498j805729j924444j922452j699622j494203
18841C4891243j203542r51448n86472l80055n45767l25645l84107o18805p40813
18832B9154589r14253r63195j179100j097422r07573p61146o16461o50680o48618
18823B1416141m80516m83454m17917m69321n10145m93184m25245l09327l86005
18814A7441027m17742l68430l71392m76272l93004m35539l27071k41175j85152
$$ plain form
18871 81897707 94581079 116768298 155337910 212696560 267160899 291511105 302117317
18864 302117317 315522481 311540480 265599165 201627720 151054181 118806140 98673337
18857 98673337 85308086 75800868 68451168 62765870 58184310 54615026 51889830 49631799
18849 49631799 47426818 45447191 43737693 41931964 40007520 38085068 36385446 34891243
18841 34891243 33687701 32736253 32149781 31769726 31223959 30898314 30514207 29895402 29154589
18832 29154589 28240336 27277141 26098041 25000619 24093046 23331900 22715439 22064759 21416141
18823 21416141 20935625 20452171 20034254 19564933 19054788 18561604 18136359 17827032 17441027
18814 17441027 17023285 16654855 16283463 15807191 15414187 14978648 14651577 14410402 14225250
18805A4225250O6106R9451j59619k41743k74905m02843p91612p05338m31745l83330
18795A0999672l50601m16004j75177q8290k69418j70492j94432k77294k10890
18786H847074j54583k80335k07049j41644k51953l47803j24410j56437j2904J86599
18776G356555k5843j38786P3693K02282L27740K77814J72121Q3069q125l1636
18766H288884m45383o32175o00133l66867j09779j32401j81326j81131j46734
18757E492955q6095j72721k23331l02526p9881p5977q2484k2800K29473L09551
18747D986164M27921K19615q098N8211M1068k07066n22686n84476m06789k49649
18737C754215j82428n1526q823P8578j2862j68361k08427p4177j4960j18958j18744
$$ plain form
18805 14225250 14291356 14390807 14231188 13989445 13714540 13311697 12520085 11814747 11383002 10999672
18795 10999672 10649071 10233067 10057890 9969600 9700182 9529690 9335258 9057964 8847074
18786 8847074 8692491 8412156 8205107 8063463 7811510 7463707 7339297 7182860 7169956 7356555
18776 7356555 7330712 7191926 7265619 7467901 7795641 8073455 8245576 8328645 8320520 8288884
18766 8288884 7843501 7211326 6611193 6244326 6134547 6002146 5820820 5639689 5492955
18757 5492955 5406860 5234139 5010808 4708282 4628401 4552424 4469940 4447140 4676613 4986164
18747 4986164 5414085 5633700 5625602 5683813 5724881 5517815 4995129 4410653 4003864 3754215
18737 3754215 3571787 3520261 3511438 3590016 3577154 3408793 3200366 3126189 3111229 2992271 2873527
18726B873527k2627j8299j680N2260Q6324L8361J36861K29234J60579l9719K8400
18715C523221O0115o5505M0220Q2618j12721l9521K6632p2899l75755l69915k68478
18704B428012j27605r1204l5063j12373q353n9016p1835j70860j31024Q6498M7036
18693A754213l2873R7287R0774J3566J47548M46245L84679J06082j4668J812k9290
18682B965375m8186o6923N5964Q7304J69156M0724o1450k91534m44168l00682
18672B105580l41142l22561r0009K8083L8177L4433j02460m8259k5887j88147
18662A087808r3835o9735j02389j0098J32754N5191P6679N1864J04394Q695r8600
18651A142728k3184M6268m2751n7111m1100l749P1010N6844q087n6365j09020
$$ plain form
18726 2873527 2850900 2832601 2830921 2883181 2969505 3007866 3144727 3373961 3534540 3494821 3523221
18715 3523221 3583336 3517831 3558051 3640669 3527948 3488427 3515059 3442160 3066405 2696490 2428012
18704 2428012 2300407 2209203 2174140 2061767 2053414 1994398 1922563 1751703 1620679 1707177 1754213
18693 1754213 1721340 1818627 1909401 1922967 2070515 2516760 2901439 3007521 2992853 2994665 2965375
18682 2965375 2917189 2850266 2906230 2993534 3162690 3203414 3141964 2850430 2406262 2105580
18672 2105580 1764438 1441877 1351868 1379951 1418128 1452561 1350101 1301842 1275955 1087808
18662 1087808 993973 924238 821849 811751 944505 999696 1076375 1128239 1232633 1241328 1142728
18651 1142728 1119544 1165812 1123061 1065950 1024850 1021101 1092111 1148955 1140868 1084503 975483
18640I75483O9N0574M0692n726J18821N4359L2945M8653n3780l9580r788L015
18628A215737j34461k7946K8325k9636r810p5395j26277l7354L2629l2793l2996
18617G70023M9739O6295J10889j05423p8245L238j25454q8057J28754J57582N4799
18606I44140m7551m5451r0395N7456l1970j34821L6303O3084J77893o9760O4799
18595I23727J29425J23851J38611N2952j2862L1608k5467K9127j23599p4234n9992
18584A133147P021m9164j1416J50468O6142p93p8830k1068j89941q2077p201J5586
18572I31874K0641j7549P4099m4971q9197m1174p7162N3595Q7247Q4866j75745
18561H06524p2992j5304o5118r3896j09249O4295P6197J05077M385Q9199q1373
$$ plain form
18640 975483 975552 1026126 1066818 1061092 1179913 1234272 1267217 1315870 1262090 1222510 1212722 1215737
18628 1215737 1081276 1053330 1081655 1052019 1042209 966814 840537 803183 835812 803019 770023
18617 770023 819762 886057 996946 891523 813278 816516 691062 603005 731759 889341 944140
18606 944140 896589 851138 760743 818199 786229 651408 687711 750795 928688 858928 923727
18595 923727 1053152 1177003 1315614 1368566 1355704 1387312 1361845 1390972 1267373 1193139 1133147
18584 1133147 1140168 1091004 1079588 1230056 1296198 1295405 1216575 1195507 1005566 923489 916288 931874
18572 931874 952515 934966 1009065 964094 874897 833723 756561 810156 897403 982269 806524
18561 806524 733532 718228 653110 559214 449965 514260 590457 695534 699919 789118 707745
18550G07745k6437m2872K9828J72344P0144L9083J29256R0796N419P0365n3207
18539A192464k05536r9638K02892J25304j30893o1613M0587P4398P0120o9112
18529A138973q2321Q6014l7185n9026J4992j02827k5222K9171j32348r5636J9414
18518G53999J6633M2244J30646N4893n5004K14671j6205K318K01291K50774K23858
18507A820118L05362K04175L30912M09026j02637k58763k6899o9056l97243m41394
18497A773601l30357o471o6683j53651k69116j18082R8849J80421K97889J76893
18487A583293J76047L00641L03889K48825J77655K11059o662l5809N4601n5860
18477B957679k96156j77646j08480o0805r0917j9811K07074M3439r6347J81513
$$ plain form
18550 707745 681308 638436 668264 840608 910752 949835 1079091 1169887 1175306 1245671 1192464
18539 1192464 986928 887290 1090182 1215486 1084593 1022980 1063567 1137965 1208085 1138973
18529 1138973 1056652 1142666 1105481 1046455 1061447 958620 933398 962569 830221 734585 753999
18518 753999 770632 812876 943522 998415 943411 1158082 1141877 1144195 1345486 1596260 1820118
18507 1820118 2125480 2329655 2660567 3069593 2966956 2708193 2681294 2612238 2214995 1773601
18497 1773601 1443244 1436773 1370090 1216439 947323 829241 928090 1108511 1406400 1583293
18487 1583293 1759340 2059981 2363870 2612695 2790350 3001409 2994747 2958938 3013539 2957679
18477 2957679 2661523 2483877 2375397 2314592 2223675 2203864 2410938 2454377 2358030 2539543
18467B539543L9952j25589j08481n4830k3976M3734j03398j1965M4567p3432Q4115
18456B250240J66628o3646l7776o4182p4608j58659l17738j93789j18580r8720
18446A289170k2512n2867j09644p5047j57270M1722J4453K3813J6718R6772k2879
18435A042429n9146P2095j6768M2727r605K1754j8016j9170L6731J66584J01119
18424A360734P8222Q7500J00867O2647r0269j38041n5622j01691j27135q6583
18414A090629L3407J09001j04910n3621J4075J14799N7435l0899O2896R7228l457
18403A386583J39601Q5592p8541j47547q8841N8105o3420j09058R4485N6548p7298
18392A256209p3922o9851m2738n7401J24317J58766K367o8902o2899k1668m7627
$$ plain form
18467 2539543 2579495 2453906 2345425 2290595 2266619 2310353 2206955 2194990 2239557 2166125 2250240
18456 2250240 2416868 2353222 2315446 2251264 2176656 2017997 1700259 1506470 1387890 1289170
18446 1289170 1266658 1213791 1104147 1029100 871830 913552 928005 951818 968536 1065308 1042429
18435 1042429 983283 1055378 1038610 1081337 1071732 1093486 1075470 1056300 1093031 1259615 1360734
18424 1360734 1438956 1526456 1627323 1689970 1599701 1461660 1406038 1304347 1177212 1090629
18414 1090629 1124036 1233037 1128127 1074506 1088581 1203380 1260815 1229916 1292812 1390040 1386583
18403 1386583 1526184 1611776 1533235 1385688 1296847 1354952 1291532 1182474 1276959 1333507 1256209
18392 1256209 1182287 1112436 1069698 1012297 1136614 1295380 1297747 1228845 1165946 1144278 1096651
18381A096651M7975K0562j1033n0845j108J15074m5699N1558J05795R9855J21715
18370A550500J30736M5540N24k0395k1738p5343j15343r731J79386J07697L0203
18359A802036M4867q984k7614J12839J88731J95911K10580J90471K94514M22645
18349C425996L60685J12905K80724L38941J94193Q1138m3953J6063K77760L34103
18339E378555K99811K86115M50018N21647Q23918J221662J517850K056645K875138
18330A5431359M106770O354091R909987J4529194J8153220J6365705J1114697
18323I5965023Q922856Q555081M756582J47376O74882J994284q62421k249607
18315A17904056j972130o180145j4973597j9141851j5964108j0918742p027662
$$ plain form
18381 1096651 1144626 1165188 1154155 1103310 1102202 1217276 1171577 1223135 1328930 1428785 1550500
18370 1550500 1681236 1726776 1727300 1706905 1685167 1609824 1494481 1484750 1664136 1771833 1802036
18359 1802036 1846903 1837919 1810305 1923144 2111875 2307786 2518366 2708837 3003351 3425996
18349 3425996 3786681 3899586 4180310 4519251 4713444 4794582 4750629 4766692 5044452 5378555
18339 5378555 5678366 5964481 6414499 6936146 7760064 8981726 10499576 12556221 15431359
18330 15431359 19538129 25892220 35802207 50331401 68484621 84850326 95965023
18323 95965023 104887879 113442960 118199542 118346918 119021800 121016084 120153663 117904056
18315 117904056 115931926 109751781 94778184 75636333 59672225 48753483 41725821
18308D1725821m584212l207504k182554j233576n00937j2300N81657J336628K380426
18299C4303449L864042O249805R849458J3916803J5908515J3281878R213982P952896
18291A14540828P154013L501045R82657K210138K044715n61033p88728p46063
18283A28337572n322981j0879728r725480k105759N689844P987214N622278M622510
18275A24225470M780674K338611j589662j966260n60446j472331k571716k763270
18267A20421070n749959j1936474j5762384j4477113j0863049p511714n249423
18260D8870954l804563k831605k002704j300926p51092k39111L14635J234892
18252C9490480K684913M510276P676258J2229287J5207602J3277385Q768052P234981
$$ plain form
18308 41725821 37141609 33934105 31751551 30517975 30017038 30004738 30586395 31923023 34303449
18299 34303449 38167491 44417296 54266754 68183557 84092072 97373950 106587932 114540828
18291 114540828 121694841 125195886 126178543 128388681 130433396 129872363 129083635 128337572
18283 128337572 123014591 112134863 102409383 100303624 105993468 113980682 119602960 124225470
18275 124225470 129006144 131344755 129755093 127788833 127228387 125756056 123184340 120421070
18267 120421070 114671111 102734637 86972253 72495140 61632091 54120377 48870954
18260 48870954 45066391 42234786 40232082 38931156 38180064 37940953 38255588 39490480
18252 39490480 42175393 46685669 54361927 66591214 81798816 95076201 103844253 111079234
18244A11079234O838353K828797j386459o11872K59906k167975k879399k585810
18236A11374775o710704j4076558j6793897j3928684r711368o530254m734041
18229C8889269l542514k635446j946113j783361j565762j278313j230157j031267
18221B3876336r21174q10640p81247p59432p11713o27678o42159n12597o62098
18212A7447598n53709n01736m75698m36551m58804n82046m10209k86052l71532
18203A3371261m25353l58700j86649k01594m06437l78755k80088l27762l06103
18194A0499820l17160l40837l64700k07880k51770k21980j37793j17523k13931
18185H326246k15272j11413j98987l35635k64100k38018k01572k18845j54512
$$ plain form
18244 111079234 117917587 120746384 119359925 118748053 119007959 116839984 113960585 111374775
18236 111374775 104664071 90587513 73793616 59864932 50153564 43623310 38889269
18229 38889269 35346755 32711309 30765196 28981835 27416073 26137760 24907603 23876336
18221 23876336 22955162 22144522 21363275 20603843 19892130 19264452 18622293 18109696 17447598
18212 17447598 16893889 16392153 15916455 15479904 15021100 14439054 14028845 13742793 13371261
18203 13371261 12945908 12587208 12400559 12198965 11792528 11413773 11133685 10805923 10499820
18194 10499820 10182660 9841823 9477123 9269243 9017473 8795493 8657700 8540177 8326246
18185 8326246 8110974 7999561 7800574 7464939 7200839 6962821 6761249 6542404 6387892
18176F387892k4287q0664j51934k04369l1861q8702j45480j77291Q103J8600j65425
18165E344582r9078j53486j15943l0930l9184j35843p0244j31602k8453p4664
18155D465155k26877q305j1750l1779l9308q8752j80749l05138j75871j65220
18145C231406l6754l4762q8372m2101K6606r6611j08647r9246o7228p662L9152
18134B715781O1321J14089m9204n4232l5476j7724p0425N171M9554P3207j13051
18123B679011k21404l3616L3650p0230k00037p9153J82794K2121o8773n9070m9269
18112B136024K3147J5965n7650j37636j35988j05337K2452Q044k33542j32060
18102A403419M116J0131j23835R7418J01098j93826j69215L2972J8252L2697O3907
$$ plain form
18176 6387892 6363605 6282941 6131007 5926638 5894777 5806075 5660595 5483304 5491407 5510007 5344582
18165 5344582 5245504 5092018 4976075 4945145 4905961 4770118 4699874 4568272 4539819 4465155
18155 4465155 4238278 4229973 4218223 4186444 4147136 4058384 3877635 3572497 3396626 3231406
18145 3231406 3194652 3159890 3071518 3029417 3056023 2959412 2850765 2751519 2684291 2676629 2715781
18134 2715781 2777102 2891191 2841987 2787755 2752279 2734555 2664130 2669301 2718855 2792062 2679011
18123 2679011 2457607 2423991 2457641 2387411 2187374 2108221 2291015 2313136 2244363 2185293 2136024
18112 2136024 2159171 2175136 2117486 1979850 1843862 1738525 1760977 1769021 1535479 1403419
18102 1403419 1407535 1417666 1293831 1391249 1492347 1298521 1129306 1162278 1180530 1213227 1277134
18091A277134n1568M3166J6997J84434J09732Q2475o5280p9540l4085j17124l6462
18080A329879J06597m4132L6999M6116N9634j19918p9877l2513j10197o1162r6740
18069A034686q0451N901m7320j44035p0205j40399j4909O8465J01576L2652P7579
18058H23540N5233l6215j08882j5589K2451k4584Q707r9024k1251J9790J2724
18047F36900J44063j6120P2338J3230k8601j04470j20978P779Q8283N3006O064
18036G51494K6207j4623r4567o243K1527n7802o3521j34316k0216K5202O7526
18025E00668O3345o6284p1617j3959o660P6039l433P5917M6913l0588J17443k953
18013F84831r8723r3493p5707M0586k8341m6805M6826j8157P7833O3447r9975
$$ plain form
18091 1277134 1225566 1268732 1285729 1470163 1579895 1662370 1597090 1517550 1483465 1366341 1329879
18080 1329879 1436476 1392344 1429343 1475459 1535093 1415175 1335298 1302785 1192588 1131426 1034686
18069 1034686 954235 960136 912816 768781 698576 558177 543268 611733 713309 745961 823540
18058 823540 878773 842558 733676 718087 740538 715954 724661 625637 604386 624176 636900
18047 636900 780963 764843 837181 850411 821810 717340 596362 604141 692424 745430 751494
18036 751494 777701 763078 668511 662268 683795 625993 562472 428156 407940 433142 500668
18025 500668 564013 497729 426112 412153 405493 481532 478099 554016 600929 570341 687784 684831
18013 684831 586108 492615 416908 457494 429153 382348 429174 411017 488850 552297 452322
18002D52322o4567o8787K8780J3929N1724Q6851J08194p3768j02552R2786J15691
17991F40603N5389J4398O9980J18119P1313O9492J05270j7541j91746l39766p767
17980E87744o3344J810l4443n5649j5073J9730o4419J19305J61487q1519K577
17969E78206R0809K3419M0356J19066J32272O0926N9012O1867p240j43001l9149
17958I76543N7575J24810O5915O6466J09344J49102L7308Q262P9700j11798j12850
17947A450377r3620o3462k87702k06327m686m3808j33703o2723n9311P0447O8401
17936F33883P8759K2959J15772N4978N4574J18053K09994J63994J47413o2319
17926A538060j26538p1796j9798J6223j84741j66315l358q1293K25457K13891
$$ plain form
18002 452322 387755 318968 347748 361677 413401 500252 608446 534678 432126 524912 640603
17991 640603 695992 710390 780370 898489 969802 1039294 1144564 1127023 935277 595511 587744
17980 587744 524400 526210 491767 436118 421045 440775 376356 495661 657148 575629 578206
17969 578206 669015 692434 732790 851856 984128 1045054 1104066 1165933 1158693 1015692 976543
17958 976543 1034118 1158928 1224843 1291309 1400653 1549755 1587063 1595325 1675025 1563227 1450377
17947 1450377 1356757 1293295 1005593 799266 794580 750772 617069 554346 495035 565482 633883
17936 633883 712642 735601 851373 906351 960925 1078978 1288972 1452966 1600379 1538060
17926 1538060 1411522 1339726 1319928 1336151 1151410 985095 981737 900444 1125901 1339792
17916A339792J76639l4106q8779j91727k48435j83480k3194R509j92265j6602
17906E47352J16643r1082L8935n189j30986Q3475J39893L0724L825J60479J41342
17895A035411J49866J53886N7159P9268j3133k37044k28300k83008j81988r6402
17885D35715j3999M0305j10692j8548M0708r192O9342K2211M2390m9754l6701
17874D11785j34550j9175K8452N4227J3419p1467l9168P8886p4028n6617r0734
17863A01030o211O0599K8149n4081P6389K872j4425J34390J13333j84514j04048
17852A53483P9766J73412J1265j44402m7001o935q73L3739J05845J40517J22412
17841F21228J525j01636j35718q6184o3444p264N8395K2277P5781J3401r1018
$$ plain form
17916 1339792 1516431 1482325 1393546 1201819 953384 769904 746710 756219 563954 547352
17906 547352 663995 572913 611848 606659 475673 559148 699041 729765 733590 894069 1035411
17895 1035411 1185277 1339163 1396322 1475590 1462457 1225413 997113 714105 532117 435715
17885 435715 421716 462021 351329 332781 373489 364297 433639 455850 498240 448486 411785
17874 411785 277235 258060 286512 340739 354158 282691 243523 322409 248381 191764 101030
17863 101030 94819 155418 183567 129486 205875 208747 194322 328712 442045 257531 153483
17852 153483 233249 406661 417926 273524 226523 219588 218715 252454 358299 498816 621228
17841 621228 622753 521117 385399 299215 235771 228507 286902 309179 384960 398361 307343
17830C07343j8123k5339L724M5956R2754j05369k40701q2074R4422K15697J19004
17819D07294q9145j44434K069P693l4293p1718O3088l382m4998J36727o2400k9425
17807A37076m1188J05127R5896J1538j4710l1820o012k2715L0168O0511k9668
17796B94203J21691L1023L2167k372j44231j0828J8424Q3836j9454j4002R0216
17785D80673L8820L4838j74322o6560j9888q475K1646l1008r7807p265J42243
17774C12895J8621R903L4247J09490J06508n5249p3250L8657J0553k9947R1794
17763E74222Q7391K8245N8094q9143R5723J10347N8222k4898j37133o6548l1719
17752F62803o2562j267M5648O5769O7169Q3081J65049N9231r6311q0599j06598
$$ plain form
17830 307343 289220 263881 267605 313561 406315 300946 60245 -21829 72593 288290 407294
17819 407294 318149 173715 175784 183477 149184 77466 140554 137172 92174 228901 166501 137076
17807 137076 95888 201015 296911 308449 293739 261919 255907 233192 263360 323871 294203
17796 294203 415894 446917 479084 476712 332481 321653 340077 423913 404459 390457 480673
17785 480673 519493 554331 380009 313449 293561 285086 306732 275724 177917 170652 312895
17774 312895 331516 341419 375666 485156 591664 536415 463165 501822 512375 482428 574222
17763 574222 661613 689858 747952 658809 754532 864879 923101 898203 761070 694522 662803
17752 662803 600241 598974 644622 710391 777560 860641 1025690 1084921 988610 908011 801413
17741H01413n0181k2703k2213p8435p9361l3025p0763k5899M449j08154k4706
17730B90422j0234J43124O117L6037j588m862M2044Q9304n5574N1196J11691O1951
17718G59628k33669L0640J07172q4228K9489J43212o3813l2633L8285l7729m8126
17707F08228o8222O653J7683j33481j68810Q8025J00450j43433j33025P0574M6668
17696B91310P6441M2038q4986j43381r5717N692J4881J52550N9127j025m021N507
17684C18416M0145O9731j15894j20815J21882Q0563o5963n5787J12234J5340j14844
17673B85008j09842j0852K3588O2135j4014r6991r6799O1027r1862J48871J35380
17662B95649K7246q2023j43110O8335J44980q0077r5276q5651M4174J20935j12633
$$ plain form
17741 801413 751232 728529 706316 627881 548520 515495 444732 418833 423282 315128 290422
17730 290422 280188 423312 429429 465466 463878 459016 501060 590364 534790 585986 697677 759628
17718 759628 525959 556599 663771 579543 609032 752244 688431 655798 694083 656354 608228
17707 608228 540006 546659 564342 430861 262051 350076 450526 307093 174068 244642 291310
17696 291310 367751 409789 324803 181422 85705 91397 106278 258828 317955 316930 312909 318416
17684 318416 358561 428292 312398 191583 313465 394028 328065 272278 384512 399852 285008
17673 285008 175166 164314 187902 250037 236023 139032 42233 103260 11398 160269 295649
17662 295649 322895 240872 97762 166097 311077 231000 135724 50073 94247 215182 102549
17651A02549r2237P7293Q3176M999m7512O7418L8067p4008j13911k4412K2953
17640D4375J24423P183o8771l0459m4567P116q892l6025l2324O3559P0592M9616
17628A45826j3216r5384Q8082j3584J7653K7770m0336N7320l6564q1785Q5180
17617A40962J6957R047r2539p3610R2249l4048n7174P0217J28133J03578j5786
17606B87986k12276j01586j723J553j7795k1103O5119K46151J39078m3509j06009
17595B35886n9149o6119j17948Q0984J52070p2866j33085j21424j682N0893n069
17584e7509J61342N6035k8048l5500n7184M0699P0399P5611j00115l3211o164
17573H6355m6187n452N5187L652m8720n0334p4891O3319J05386L7551n6744K1352
$$ plain form
17651 102549 10312 87605 170781 175780 128268 195686 233753 159745 45834 21422 44375
17640 44375 168798 175981 107210 76751 32184 39300 30408 -5617 -37941 25618 96210 145826
17628 145826 132610 37226 125308 111724 129377 157147 116811 174131 137567 55782 140962
17617 140962 157919 166966 74427 817 93066 59018 1844 72061 200194 303772 287986
17606 287986 75710 -25876 -27599 -26046 -43841 -64944 175 246326 385404 341895 235886
17595 235886 176737 110618 -7330 73654 225724 152858 19773 -101651 -103333 -52440 -57509
17584 -57509 103833 159868 131820 96320 39136 79835 150234 225845 125730 92519 86355
17573 86355 40168 34716 89903 93555 44835 -5499 -80390 -17071 88315 125866 69122 90474
17561I0474J06773Q698p5657n7362j36O1213k2029n7554O4700J6213Q90j7693
17549A18530j06887q8083j1946K5055K2675J34066j3839J18691N9038m7182r5534
17538A14584n7149m1050J6709K2423O1811j51640m1250L974J9879M1280k1720
17527c2149k7086K7259m5439L1406L5787P4516J10400r263j03767j15825n2772
17516a06933J36934L3719j29116n2325L6396R7670J27231m0223R418j48300K2357
17505a3172J9594J118K7269o4741M3951k231j41796l7240J94815J11583j082p6477
17493F1591q2278n2847K4526M1171j03012M4408P0448p5239k426N1779j3410k2694
17481e7983Q398o1889n7393l1542j2413N4755L7017l8608L0998P3845P2672N9830
$$ plain form
17561 90474 197247 205945 130288 72926 72790 134003 111974 54420 119120 135333 136223 118530
17549 118530 11643 -76440 -88386 -63331 -40656 93410 79571 198262 257300 210118 114584
17538 114584 57435 16385 33094 55517 117328 -34312 -75562 -71588 -51709 -10429 -32149
17527 -32149 -59235 -31976 -77415 -46009 -10222 64294 174694 165431 61664 -54161 -106933
17516 -106933 30001 63720 -65396 -117721 -81325 16345 143576 103353 112771 -35529 -13172
17505 -13172 6422 7540 34809 -29932 14019 11788 -130008 -167248 27567 139150 138068 61591
17493 61591 -20687 -73534 -49008 -7837 -110849 -66441 4007 -71232 -73658 -21879 -35289 -57983
17481 -57983 -49585 -111474 -168867 -200409 -212822 -158067 -121050 -159658 -128660 -54815 17857 77687
17469G7687j5501j60792J57375J90493K3816r8543r3540n0560o4725m965r2822
17458a32077r9181L4749J01184O4248Q8729N9413l8819L5256j4169o4984K8460
17447F2809o7942M602L441K0822o1795j02803k0098K2548O0918Q9150L1725k8128
17435A5249K9018k8448J5570m8054J47352J06602j762l8350N06p1837r2424j3117
17423B0305p5008j19350Q916O3255J16562K0878J936P7342N2793O6182O9472o5432
17411B37851o7142r1376K3468l1584n077K06513j02172j9457m895o4266J32443
17400B14306K2470k0558k8716q0042r5087Q1915J8040l7398l3075q5089o6769
17389a10003P0375J9204N1640J0340Q489j4351j3042l2064M6593p0350k9521l2988
$$ plain form
17469 77687 62186 -98606 58769 249262 273078 174535 80995 30435 -34290 -39255 -132077
17458 -132077 -231258 -196509 -95325 -31077 57652 117065 78246 113502 99333 34349 62809
17447 62809 -5133 -531 2910 23732 -38063 -140866 -160964 -138416 -77498 11652 43377 15249
17435 15249 44267 15819 31389 -16665 130687 237289 235527 197177 197683 125846 33422 20305
17423 20305 -54703 -174053 -165137 -101882 14680 35558 37494 114836 167629 233811 303283 237851
17411 237851 170709 79333 102801 71217 66140 272653 170481 151024 146129 81863 214306
17400 214306 236776 216218 187502 107460 12373 94288 112328 74930 41855 -43234 -110003
17389 -110003 -39628 -20424 31216 41556 50045 35694 22652 -9412 37181 -33169 -62690 -95678
17377i5678l050j9472J26120J26932O601q0118p555l1431l0264K5252P1369l145
17365H5561q3408k2426N4275M6080J06895n5514l3810r6725J0555J20267q9491
17354D2259j51032n9976J42024J19964L5408o6345l8113M0343J06831n4523m8551
17343F8289p4849J6227M2719q0798j52087j6645J16036J87848R6153K2768N2042
17332B77703r9505P72k2269k5192r122l2830J03455P4072j02262j34407K1126
17321E1541j5288p7957j181o8989j0573J65889j01408p8396R8877J43315J68497
17310B74327n1124j38490p592k4251N061P9419o7103o1429J2715j5789j5586j6986
17298b6828o2968j4950m278M7970n3955L6001K01975N7610k5902P9739n6326q0702
$$ plain form
17377 -95678 -98728 -118200 7920 134852 141453 61335 53780 22349 -7915 17337 88706 85561
17365 85561 2153 -20273 34002 80082 186977 131463 97653 928 11483 131750 42259
17354 42259 -108773 -168749 -26725 93239 128647 62302 24189 64532 171363 116840 68289
17343 68289 -6560 9667 52386 -28412 -180499 -197144 -81108 106740 202893 225661 277703
17332 277703 178198 178970 156701 131509 122387 89557 193012 267084 164822 30415 51541
17321 51541 36253 -41704 -42885 -111874 -122447 43442 -57966 -136362 -37485 105830 274327
17310 274327 223203 84713 77121 52870 57931 137350 70247 8818 21533 5744 -9842 -26828
17298 -26828 -89796 -104746 -109024 -61054 -115009 -79008 122967 180577 154675 234414 178088 97386
17286I7386l3096k7730m2077J2603l7915Q405j2071j371j0100j5265Q909k6661
17274g8983J12479J74954N3649n2680L4801n9237O747j33872r8813J0262J521
17263b9172j0790J0770l3123Q781L3958Q8564Q9777j03797L7316N5097o7788L569
17251H3162m5172R642J23350n9235n5199M7588m6630p6414r0066Q7830o0848n8116
17239a40108L8468P4577J77872L2104p0083k7912l3730r7276o2203J5993j6277
17228a08575o2284o7342Q8573R8975j20750M5161J03711J50061l0444p3518j16140
17217i2572O0876J582n062o6482k5141l3459l9892N2351J06127Q0611J9626j08326
17205d9761r321J3216p8587K0984j3210R6480k0772J5926j0325o4433O0458K5983
$$ plain form
17286 97386 64290 36560 -5517 7086 -30829 -22424 -34495 -35866 -45966 -61231 -52322 -78983
17274 -78983 33496 208450 262099 209419 244220 184983 191730 57858 -40955 -30693 -29172
17263 -29172 -39962 -29192 -62315 -53534 -19576 68988 158765 54968 92284 147381 79593 83162
17251 83162 37990 47632 170982 111747 56548 104136 57506 -18908 -108974 -21144 -81992 -140108
17239 -140108 -101640 -27063 150809 182913 112830 84918 51188 -46088 -108291 -92298 -108575
17228 -108575 -170859 -238201 -149628 -50653 -171403 -126242 -22531 127530 97086 23568 -92572
17217 -92572 -31696 -30114 -35176 -101658 -126799 -160258 -200150 -147799 -41672 38939 58565 -49761
17205 -49761 -59082 -45866 -124453 -103469 -116679 -20199 -40971 -25045 -35370 -99803 -39345 -13362
17193a3362n0224j14495N6575R5356j0123J7458L6299k9737j15241o4941R2334
17182a00101O2693J24635M0792p7903r1223Q671Q0540P0624j1897r259k7591Q4767
17170A54748O5236q1821j83573n8708K9463P3324k0480n7321L6703J9230J2777
17159a0422k0220M656m560k7575L2524P443l2779L374J10627J06783n5618Q4880
17147A99113J00537q2507k08018j04114p7235J02375m416K7212K6422k3453k8526
17136g2610K8500P7749N739r2891k150O1656K8761r9862M9349K6248k6191j2756
17124b8458r0961k614O3233J12043k9883r9629K9538J92736N5571n2235j56920
17113g579J3463K084m0737n1122Q8208N0449m4136p9758L966R9853L639k3190
$$ plain form
17193 -13362 -63586 -178081 -121506 -26150 -36273 -18815 17484 -12253 -127494 -192435 -100101
17182 -100101 -37408 87227 128019 50116 -41107 -32436 48104 118728 106831 97572 69981 154748
17170 154748 219984 138163 -45410 -104118 -74655 -1331 -21811 -79132 -42429 -23199 -10422
17159 -10422 -30642 -25986 -30546 -58121 -25597 -18154 -50933 -47559 63068 169851 114233 199113
17147 199113 299650 217143 9125 -94989 -172224 -69849 -74265 -47053 -20631 -44084 -72610
17136 -72610 -44110 33639 39378 -53513 -55663 5993 34754 -65108 -15759 10489 -15702 -28458
17124 -28458 -119419 -122033 -58800 53243 23360 -76269 -46731 146005 201576 149341 -7579
17113 -7579 5884 7968 -32769 -83891 4317 54766 10630 -69128 -65162 34691 38330 15140
17101A5140J0092j23375r5042P1960J26036P7344m3262L8506o1975n2518J20494
17090H3400J79449j0792j18407n0565J536q3172j53271p591J0964P3440Q5049
17079A0040O5127p5211m3974j5205Q5814J0991N1299j69689j30411Q3977J17992
17068i250l7478K899J24581j3092o6208p782J19122J5533j00452j49887J09306
17057a2708J1357P6798R4659m9757L66p834q2171n9313n1315k0762N4561Q7072
17045D0953L3482K2545J1270n5125q2521J9313J3848n6974J6457K5634r5836j1587
17033a18541O3539K02890O7606l5498o8050N5760J8053l679n0478l4126q0751
17022A6725M2613N7619k2204l446j5294N167j82982m4205M2439J10659M9628p4397
$$ plain form
17101 15140 25232 -98143 -193185 -121225 4811 82155 38893 77399 15424 -37094 83400
17090 83400 262849 252057 133650 83085 84621 1449 -151822 -159413 -148449 -75009 10040
17079 10040 75167 -44 -44018 -59223 26591 37582 88881 -80808 -211219 -127242 -9250
17068 -9250 -46728 -43829 80752 67660 1452 -6330 112792 128325 27873 -122014 -12708
17057 -12708 -1351 75447 170106 120349 120715 112881 30710 -28603 -79918 -100680 -46119 40953
17045 40953 74435 96980 108250 53125 -29396 -10083 3765 -53209 -36752 -11118 -106954 -118541
17033 -118541 -55002 147888 215494 179996 111946 167706 185759 182080 131602 97476 16725
17022 16725 59338 116957 94753 91307 76013 81180 -101802 -146007 -103568 7091 56719 -17678
17010a7678J7986O0836J50850p680n3675P7952j33673j33515O6373J12126Q4894
16999B24796J2019j89391Q0172J94218r2703j17735o0275O9871P7456Q7250O188
16988B91866m5608j64670p9165p8009n6568l0665p29M9347M5533P3433Q516m7336
16976c4055r2532r9757L3858J62955m741l8207J5870m1761j05497j70253J07518
16965b66602J77169J59357J33694l3873n3362l692m6987k5839n4295n551m4451
16954f4432J1817l3940k6961J6885K7702P7851n6499r1097k7604O8301J01227
16943C250Q7396p1360j7609k6937p9500O6404j9549P5366j4767l2060L7125L073
16931A0832k2270j4420P8291M1316r8659o8966m3624l091R0043O1474O4458O4139
$$ plain form
17010 -17678 308 61144 211994 204314 150639 228591 94918 -38597 27776 139902 224796
16999 224796 236815 47424 127596 321814 229111 111376 51101 120972 198428 285678 291866
16988 291866 246258 81588 2423 -75586 -132154 -162819 -163548 -114201 -68668 4765 13281 -34055
16976 -34055 -126587 -226344 -192486 -29531 -34272 -72479 -56609 -98370 -203867 -374120 -266602
16965 -266602 -89433 69924 203618 169745 116383 112691 65704 39865 -14430 -19981 -64432
16954 -64432 -52615 -86555 -113516 -96631 -68929 8922 -47577 -138674 -166278 -97977 3250
16943 3250 90646 19286 1677 -25260 -104760 -38356 -57905 17461 2694 -29366 7759 10832
16931 10832 -11438 -25858 52433 93749 -4910 -73876 -117500 -120591 -30548 30926 95384 159523
16919A59523K1141p6584m0543o5074q290l4707K0448J35778J6258j47314P1595
16908E2231m2060p6255J6790P623J13113Q2309j161J19434n17j24813q2940o6190
16896b436k014N9750l032l2858o1869M6879P2088N4413r0588K5189J7132k0118
16884F2536R045N3530r3737m8636J10270J44815l6372q5179L4430J5277o9177
16873I6802o8700r0481k9339M6955j9328m7190n053q35j5805l8222j9081J18679
16861g1598J36582J47824q620k3271K1521r072o4679j78076j17076J3571O1123
16850i1771m7018J18299K1152J3683K8010n9947o6491k3875J15293R3906q5520
16839A5721q5698p0520O0566J12506k1765N2095R1194O5031K4315l5818j58307
$$ plain form
16919 159523 180664 104080 63537 -1537 -9827 -44534 -24086 111692 127950 -19364 52231
16908 52231 10171 -66084 -49294 -41671 71442 153751 152590 272024 271507 146694 63754 -2436
16896 -2436 -4450 55300 52268 19410 -42459 4420 76508 130921 40333 65522 82654 62536
16884 62536 71581 125111 31374 -17262 93008 237823 201451 116272 150702 165979 96802
16873 96802 28102 -62379 -91718 -44763 -64091 -111281 -116334 -117169 -132974 -171196 -190277 -71598
16861 -71598 64984 212808 204188 180917 202438 193366 128687 -49389 -166465 -152894 -91771
16850 -91771 -138789 -20490 662 14345 42355 -17592 -84083 -107958 7335 101241 15721
16839 15721 -69977 -140497 -79931 32575 10810 62905 154099 219130 243445 207627 49320
16828D9320O3797j21192j12739K8807j745M7251K1492p3226j7111L5518J06424
16817B6596n6046l0748L1275O4794P446P3526J0901P4995L8888o3503k05085p9567
16805a06528J6327R7202j9412R1703m7897j23606J3597P4291p999O4599O9193
16794A21470P3276P694r8012r1826J17273P1616l4647r3497q7111p69P0168m1482
16782A4153l6719m6712m471M6175N1560N6242O9186K489m2657p8296N7274J01982
16770A90206j29545m8020m0365N2565l4149K9511J2478N8145L9806k0833j6059
16759I3740j02797o819O1739j7714r5626Q0926R8613J19139j8354n8147n2407
16748A02293R9705J1182k2148l9525m8211n8455p5562P6186o019n0944P4862K4709
$$ plain form
16828 49320 113117 -8075 -120814 -92007 -93752 -46501 -25009 -98235 -115346 -79828 26596
16817 26596 -29450 -60198 -28923 35871 43317 116843 127744 202739 241627 178124 -26961 -106528
16805 -106528 -90201 7001 -12411 79292 31395 -92211 -78614 -4323 -12322 52277 121470
16794 121470 194746 202440 104428 12602 129875 201491 166844 73347 -13764 -14533 55635 14153
16782 14153 -22566 -69278 -73749 -27574 23986 80228 149414 151903 109246 30950 88224 190206
16770 190206 60661 12641 -27724 24841 -9308 20203 32681 90826 130632 109799 93740
16759 93740 -9057 -15876 45863 28149 -67477 13449 112062 231201 212847 154700 102293
16748 102293 201998 213180 191032 151507 103296 44841 -30721 45465 39446 -11498 63364 88073
16736H8073r2223k5610P2580m0480l827N1748M6466J4729o8574M426m3446p0089
16724f6227j09237k857J30321l6030l285N7090r8812j08729m763L2938K6392P450
16712a75749N3010O0343J23531p900Q0035K9250l0659o5189R2557J26708q9333
16701A96604r9900M6915m3646l9002M1516K4355j09548j02459k256o3435k6119
16690a76975O4265J23265q439K0652m174p7043J01854k3837n2499m9380O1062
16679b1249M2126J1100R3091K3816k40786j64813J1672Q9472q7243Q4543K3220
16668a35051N3384P7632J45708p3749j06546k4085K5684P9709p1157r1122L6122
16657h3471J25279M2777n863n2433p0184P2473L3859l3220M742J40242j60647
$$ plain form
16736 88073 -4150 -29760 42820 2340 -1487 50261 96727 111456 42882 47308 3862 -66227
16724 -66227 -175464 -178321 -48000 -84030 -87315 -30225 -129037 -237766 -242529 -209591 -183199 -175749
16712 -175749 -122739 -62396 61135 53235 133270 162520 131861 66672 159229 285937 196604
16701 196604 96704 143619 99973 60971 102487 126842 17294 -85165 -87421 -150856 -176975
16690 -176975 -112710 10555 2116 22768 18594 -58449 43405 19568 -32931 -82311 -21249
16679 -21249 20877 31977 125068 148884 -91902 -256715 -245043 -155571 -242814 -158271 -135051
16668 -135051 -81667 -4035 141673 67924 -38622 -62707 -37023 42686 -28471 -119593 -83471
16657 -83471 41808 84585 78722 26289 -43895 28578 62437 29217 33959 174201 13554
16646A3554j90289N9989r7275K3335J16796K7422M3981Q8757j9507O8041J0210
16635A45014k5669J4093j14310J2516M6223o2982o3582l892p7857l2295O5448
16624i7293J08400J33110k3645q2019p2723l0518o1009J8323J11703P0697j4623
16613F0403q5943j3864j7453O0962M2581J600M650J16684J38j6398j2026M1360
16601A82694l0047o0127q0247j3400Q938j3887m7709N2870J8243r0305l9119l583
16589a15679K8209l9694m10N3611J13844k5559j57768m8785R2524n9142o1480
16578b20329L296Q7273j0202m2521J12310J41635n0764J0364j42140k8259N4548
16567h4789J66478L5208M440o1255q836K2659l1414l1933k8843O4894O2864j8586
$$ plain form
16646 13554 -176735 -116746 -214021 -190686 -73890 -46468 -2487 86270 66763 134804 145014
16635 145014 119345 133438 19128 31644 77867 14885 -48697 -52589 -130446 -162741 -97293
16624 -97293 11107 144217 120572 38553 -34170 -64688 -125697 -107374 4329 75026 60403
16613 60403 -25540 -39404 -56857 4105 46686 48286 52936 169620 169758 153360 141334 182694
16601 182694 152647 92520 12273 -1127 7811 -6076 -53785 -915 17328 -72977 -112096 -115679
16589 -115679 -87470 -127164 -127574 -73963 39881 14322 -143446 -192231 -99707 -158849 -220329
16578 -220329 -217033 -129760 -139962 -182483 -70173 71462 20698 31062 -111078 -139337 -84789
16567 -84789 81689 116897 121337 60082 51246 73905 42491 10558 -18285 46609 109473 90887
16555I0887k4889L0528k1390N3570p0261r5323m1109n9321k1263K5188J26017
16544g366J70519m0331Q2227m9560j34364j05463j00562L5252m1463j4131Q3312
16533a21930O5259l7069K9541n5415K6569J5063p0687M649J91084P3377r0568
16522B9873R956r823m2899L9060q5564N2713J04760L9017m7975m220K4523r233
16510A00188p3954l7739N1231n6288L0440m2571j12658l4725M2824Q3355J13977
16499F4080l7256m4993K6738J01256l0776Q3926K9236j95864j18873J17226R6427
16488I1127R8023j25372j96203J9529J48498l427n6440Q93J28065M8783l8913
16477A14563k0879n1415K8191k9470p9498L2110J31509l8581l8276l9742o8443
$$ plain form
16555 90887 65998 96526 75136 128706 58445 -36878 -77987 -137308 -158571 -133383 -7366
16544 -7366 163153 122822 205049 155489 21125 -84338 -184900 -149648 -191111 -205242 -121930
16533 -121930 -56671 -93740 -64199 -119614 -93045 -77982 -148669 -144020 47064 120441 29873
16522 29873 39829 30006 -12893 26167 -59397 -6684 98076 137093 89118 84898 109421 100188
16510 100188 26234 -11505 39726 -16562 13878 -28693 -141351 -176076 -133252 -49897 64080
16499 64080 26824 -18169 8569 109825 79049 162975 192211 -3653 -122526 -5300 91127
16488 91127 189150 63778 -132425 -112896 35602 32175 -24265 -23372 104693 153476 114563
16477 114563 93684 42269 70460 40990 -38508 -6398 125111 86530 48254 8512 -59931
16466e9931L3016J40028m8567m6613Q170M2921p5756n9668J62695M8786k0016
16455A25065P0887r3231j40022N4726L2613r8613O4271J7266k6208j06138N8831
16444d0553M0593J08142J28258K0525j69075L5909J10582p7052k6150Q1236j41004
16433G1411j76495N1680L1839O8471k0195n566N2410l9816K2347K0957j02987
16422b5944R0331P2027K8446j27995M1300j4129p7341P4675N5171L026o4990p8625
16410b4048R251J07426o2051l0350N4419R988o4984P685P6028k7260o2248m4298
16398e0442j978K4973O8825N2731R4556m9469j47008o8084L024m6495j5247R919
16386a24695K7743l249J36785n4459r4375N6133M5473R749J4169l3953M2353j5236
$$ plain form
16466 -59931 -26915 113113 64546 17933 26103 69024 -6732 -66400 96295 145081 125065
16455 125065 195952 102721 -37301 17425 50038 -48575 15696 32962 6754 -99384 -40553
16444 -40553 40 108182 236440 256965 87890 123799 234381 157329 131179 212415 71411
16433 71411 -105084 -53404 -21565 46906 26711 21145 73555 33739 56086 77043 -25944
16422 -25944 64387 136414 164860 36865 78165 64036 -13305 61370 116541 119567 54577 -24048
16410 -24048 -14797 92629 30578 228 54647 64635 -349 7336 83364 56104 -6144 -50442
16398 -50442 -52420 -27447 41378 94109 188665 139196 -7812 -75896 -72872 -119367 -134614 -124695
16386 -124695 -96952 -100201 36584 -17875 -112250 -56117 -10644 -895 13274 -20679 21674 6438
16374F438l7873k1571K0475K1370j18511o9019J19477M1661r450n8243k7653N0013
16362h2886J37783j8224o5121Q56P09M450j10219j49694o6933J44501J73155l4381
16350f6004L0704P4202M6549o3289j50637O2075J36419K3263n8938R0549L1013
16339A55906j38303j25961M870M1720K4683r8013L8086J94383q1449j0560q599
16328c237K3135N4336q1179k8219m8157J364k5638r3955j59320L3315J09634J5529
16316b02392j05677l5748O6992P6204P2579m6781m3114Q2807J01309j4295N5599
16305G483Q5751m1733n2859o7298m0936O8951k7277j9591Q9411L3989l0479j09589
16293a04177L1417P932l9183L3639k1164j7961p6348j6758o2548J9748p2448P585
$$ plain form
16374 6438 -31435 -53006 -32531 -11161 -129672 -198691 -79214 -37553 -47003 -105246 -132899 -82886
16362 -82886 54897 36673 -28448 -27592 -26883 -22433 -132652 -282346 -349279 -204778 -31623 -66004
16350 -66004 -35300 38902 85451 22162 -128475 -66400 70019 93282 34344 124893 155906
16339 155906 17603 -108358 -103488 -61768 -37085 -135098 -97012 97371 15922 5362 -3237
16328 -3237 19898 74234 -6945 -35164 -83321 -81957 -107595 -201550 -360870 -327555 -217921 -202392
16316 -202392 -308069 -343817 -276825 -200621 -128042 -174823 -217937 -135130 -33821 -48116 7483
16305 7483 93234 51501 -1358 -68656 -109592 -40641 -67918 -87509 1902 35891 5412 -104177
16293 -104177 -72760 -64828 -104011 -70372 -91536 -109497 -185845 -202603 -265151 -245403 -317851 -310266
16281c10266J28021J78616p246j24932N5624O5119J14353N6173L366j18242l5198
16270E388M5669K6167K441r6737p842J25611R7746J3393j01477o6195P9842k8006
16258I6000k32836m5816K4863K1711J50347j5695p2604j19374J24741O5093m2557
16247d6127R008m054K4293P9259J04111J24754p8023p8270M050N2902J6045j20946
16235H7002q9579N623J32075J25478r5852q3966j5883q2725R08n2657j5053J00431
16223A5802l9511k6029J26258m7240n9056k0746K3075j7048K2175k6055o590K6987
16211b7978J360j9703j76558l6168O2097M2482Q8103J6846N9533J4811o707J8854
16199C6972p8572m3369J01783j8214O770M2510p8674k0395j7161N9601K3607J005
$$ plain form
16281 -310266 -182245 -3629 -10875 -135807 -80183 -15064 99289 155462 158828 40586 5388
16270 5388 51057 77224 79665 -17072 -24914 100697 198443 211836 110359 44164 124006 96000
16258 96000 -136836 -182652 -157789 -136078 14269 -1426 -74030 -193404 -68663 -3570 -46127
16247 -46127 -37119 -41173 -16880 62379 166490 291244 213221 134951 139001 191903 207948 87002
16235 87002 -2577 3046 135121 260599 164747 80781 64898 -17827 -16919 -69576 -84629 15802
16223 15802 -23709 -49738 76520 29280 -29776 -50522 -27447 -44495 -22320 -48375 -54965 -27978
16211 -27978 -26618 -46321 -222879 -259047 -196950 -154468 -66365 -49519 10014 24825 18118 36972
16199 36972 -41600 -84969 16814 -1400 5370 47880 -30794 -51189 -68350 -8749 14858 15863
16187A5863K1287N6976O0153Q1452M9839j10882n3523L0139q9006M9865n8625
16176E3538R2061o8117l1482L8368p1673m0724J51961N0611j20843j32449l722
16165h2471J522K3441O6976L8351O1650P9220J3024K6141J3678j51992j52266
16154f2726J17259J27768L7262r6655k1613k8758K8309n6969o3287Q7285n3759
16143A4116k4809N1969P4109n555r7125K5078n6855j108J47739J5158o3126N4231
16131A33822o6205L0896K6747q7560l6431o6469L083L9056l303j68491J1171J7717
16119a65967M7169J50720J6153P5037l8572N747m7816l7135q7351m7766k8401
16108a58182r615R5252R9279n7996J9249j236o6757L2027K4870n0883O5934P7176
$$ plain form
16187 15863 37150 94126 154279 235731 285570 174688 121165 151304 62298 112163 53538
16176 53538 145599 77482 46000 84368 12695 -28029 123932 174543 53700 -78749 -82471
16165 -82471 -80949 -57508 9468 47819 109469 188689 201713 227854 241532 89540 -62726
16154 -62726 54533 182301 219563 122908 101295 72537 100846 43877 -19410 67875 14116
16143 14116 -10693 41276 115385 109830 12705 37783 -19072 -20180 127559 142717 79591 133822
16131 133822 67617 98513 125260 37700 1269 -65200 -62117 -23061 -26364 -194855 -183684 -165967
16119 -165967 -118798 31922 48075 123112 84540 90287 42471 5336 -82015 -129781 -158182
16108 -158182 -167797 -72545 26734 -31262 -12013 -13249 -80006 -47979 -23109 -73992 -8058 69118
16096F9118m3461M3594M2439J8648M6336L2867p9899r3253o2248j6387J48897
16085A06651p0813j6354K4613J33904j2498l2043P834m6372k9033L7698M2183
16074A45770L8991j19814p2678l0L8222P3874J09584n496j41970j12529o5856
16063a11932N9920J67340J0474n278n9830k4210J5663L210L3234m5280p9016K1605
16051a4100Q6068p3004j22135j04347m1497Q1961Q6401K04591J06464l1702j04952
16040G3748l7545M245q8141j8322P3k735O4806O0226j7493j42130n1454J30636
16028b4086J9292j0712L3090P8909o2098l3354R0755L9938j15002n9929j06500
16017a49697j14894J43105J26877j7047J8074M5680Q7973l499q5620J1556r7768
$$ plain form
16096 69118 25657 69251 111690 130338 176674 209541 129642 36389 -25859 -42246 106651
16085 106651 35838 19484 44097 178001 165503 133460 141294 94922 65889 103587 145770
16074 145770 184761 64947 -7731 -7761 30461 104335 213919 208423 66453 -46076 -111932
16063 -111932 -52012 115328 125802 120524 60694 36484 52147 55357 88591 43311 -35705 -14100
16051 -14100 71968 -1036 -123171 -227518 -269015 -187054 -100653 103938 210402 178700 73748
16040 73748 36203 40448 -47693 -66015 -65942 -68677 -3871 56355 38862 -103268 -154722 -24086
16028 -24086 -4794 -15506 17584 96493 34395 1041 91796 131734 16732 -43197 -149697
16017 -149697 -264591 -121486 5391 -11656 6418 52098 140071 136572 50952 62508 -35260
16006c5260q8106o5684K2548J02480J04048L6100m3897K342R063k673j45709J7647
15994h7101J08624P6054n0433l5615l1929j25625p0250o5770J1171J40133M9834
15983h0907k4843J29706L9101P3762J8101k0780l0125j22945O1906J10742q0895
15972G2823J9563P3350j07218l2189l2825P3011m2259J1752j40281j9348O3362
15961f0259N0911l9926j2443L0707n6903j08231J27137J21049L8523j41094M6213
15950d316L6876l3294k0721o0290o5444L6230j477L8975N7838L1388K5704j06256
15938f4787j00416J77820Q2304j01429r8783J05001k5935Q9376M4662l9318j05549
15927c7054M2642O3450L2495j16661J5554j011k7615R6984k2523n7868r758q4449
$$ plain form
16006 -35260 -123366 -189050 -166502 -64022 40026 76126 32229 34571 43634 40961 -104748 -87101
15994 -87101 21523 97577 47144 11529 -20400 -146025 -216275 -282045 -270874 -130741 -80907
15983 -80907 -105750 23956 63057 136819 154920 134140 104015 -18930 42976 153718 72823
15972 72823 92386 165736 58518 26329 -6496 66515 24256 36008 -104273 -123621 -60259
15961 -60259 -9348 -49274 -61717 -31010 -87913 -196144 -69007 52042 90565 -50529 -4316
15950 -4316 32560 -734 -21455 -81745 -147189 -110959 -112436 -73461 -15623 15765 41469 -64787
15938 -64787 -165203 12617 94921 -6508 -105291 -290 -26225 63151 107813 68495 -37054
15927 -37054 5588 69038 101533 -15128 426 -585 -28200 68784 46261 -11607 -21365 -105814
15915a05814O2734J26818J21150R0587j05177r2921j16606q6620J0072K3780J4320
15904e7677o3724J5812J0772K6905j07621J15251J02524j3049Q7388n6642n0643
15893I296j7339l6836n7660J6147J2841m808M5010K0634P0501L4842j405j09037
15881a7814r9677j02388L4813R0660J09369R5178j06459r4920M6113J40026N0693
15870A45594o8595l7442j15351L002Q6423P5407M7519N3625l4195j80554j14991
15859a39558L5432k0477N1419O644J9901m1283J0668k3114l3995k2807M3785J12653
15847g32O4572K958p3726q9561K3944l4162O2165K1373P9957l7894q3961j43044
15835b08111Q0710R3041L9752j16733N1647o9180J7264N9234L5434O6621K9128
$$ plain form
15915 -105814 -43080 83738 204888 295475 190298 97377 -19229 -105849 -95777 -71997 -57677
15904 -57677 -121401 -105589 -94817 -67912 -175533 -60282 42242 29193 116581 59939 9296
15893 9296 -8043 -44879 -102539 -86392 -73551 -78359 -33349 -12715 57786 92628 91223 -17814
15881 -17814 -117491 -219879 -185066 -94406 14963 110141 3682 -91238 -45125 94901 145594
15870 145594 76999 39557 -75794 -72792 13631 89038 136557 190182 155987 -24567 -139558
15859 -139558 -104126 -124603 -73184 -66540 -46639 -87922 -77254 -100368 -134363 -157170 -113385 -732
15847 -732 63840 66798 -6928 -96489 -72545 -106707 -44542 -23169 56788 18894 -65067 -208111
15835 -208111 -127401 -34360 5392 -111341 -59694 -128874 -111610 -52376 -16942 49679 78807
15824G8807l4220L2264j7475l0682j0680m305K2556m5884M138P8219J4183l0069
15812E6852L8504J7911j07640r0998k4739l8506q2824j9352J18955M29L6194o1260
15800a56474k4825K2289J10554M7520k8301Q9316K1355p3062M0376L6186Q522
15789I3456k6866j8283j661M2903J5497l0966j37850n3296L474J5422k8755n4209
15777a81134l709J02295K59601N9744l7616o165k8941j71455j24285J0333O1871
15766e9461Q1605J4161Q911l756p9846q4731R1707J01722k8753j38372l4399P6856
15754e4356P9269R3079n6853q7973l8060j3311k0686J937O4229o1345n542L3870
15742f5742J7139j31272j30473m7896K16680J06139J02731J23406o7259q7529
$$ plain form
15824 78807 44587 76851 59376 28694 18014 13709 36265 -9619 -5481 72738 86921 56852
15812 56852 95356 113267 5627 -85371 -110110 -148616 -231440 -250792 -131837 -131408 -95214 -156474
15800 -156474 -181299 -159010 -48456 -936 -29237 60079 81434 8372 48748 84934 93456
15789 93456 66590 48307 46646 89549 105046 74080 -63770 -117066 -113592 -98170 -126925 -181134
15777 -181134 -184843 -82548 177053 236797 199181 193016 164075 -7380 -131665 -121332 -59461
15766 -59461 22144 36305 45216 41460 -38386 -123117 -31410 70312 41559 -96813 -131212 -54356
15754 -54356 24913 117992 61139 -26834 -64894 -78205 -98891 -96954 -32725 -94070 -99612 -65742
15742 -65742 -48603 -179875 -310348 -358244 -141564 -35425 67306 190712 123453 35924
15732C5924l7416l9909J7749O1448J0528k2730N5743o4462j48899q8288K447P3879
15720a43986R5835O8992L5342o5343j09076l2820J2363J08007O3042R1588j98
15709A23746j05981j12573J07656P960J3331J4625j75497j03857Q7925K1237m6336
15698a67764J7271Q72K8208O7148R7680l9244j5819J38276n97Q642M1674L3199
15686B09546j15000p4835L0092J41571J22208q8688j00585n5340n7932o3817p609
15675f0389M444Q8040N1809o900q3462K1623n0663j02823K9409L1991r5090R9520
15663g2491N1723J10683L6954J4330K4802j02670j34046r765O0325r102J11001
15652H1744j0841m5655J21005k1514q6061k4985M8683n9852k0036k3851r7048
$$ plain form
15732 35924 -1492 -41401 -23652 37796 48324 25594 81337 16875 -132024 -220312 -217865 -143986
15720 -143986 -48151 20841 56183 -9160 -118236 -151056 -138693 -30686 32356 123944 123746
15709 123746 17765 -94808 12848 20808 34139 48764 -126733 -230590 -142665 -121428 -167764
15698 -167764 -150493 -149621 -121413 -54265 43415 4171 -11648 126628 126031 134673 176347 209546
15686 209546 94546 19711 49803 191374 313582 224894 124309 68969 11037 -52780 -60389
15675 -60389 -55945 32095 83904 77004 -6458 15165 -35498 -138321 -108912 -76921 -172011 -72491
15663 -72491 -20768 89915 126869 141199 166001 63331 -70715 -80480 -20155 -29257 81744
15652 81744 70903 25248 146253 124739 38678 13693 62376 2524 -17512 -41363 -138411
15641a38411n9946L0253k4692j6307J35886J01254k1258n8183r2094J35005J10465
15630A01972n4830n0360M9232J26134r1010j48661r4921j33469K23292j6767J7192
15619g2196o3085P8082J08210P7954o1016n2226Q7801o3396j14529K4477J09345
15608E9421j0955o5037p4038P5156J4507j33774K3361R6833l2756J0511l1032
15597f7803O6592J43181j03003j59375m8147J7368Q0081O4250J67320L3453p3496
15586A20421o1334q7700J4259J01888J31553j12698p6338p3627j43306q4585N8112
15575b13355j4515L3433l3339J2720J36788J8720j6810J5785R3129l5710j44231
15564a47385j8242J41780j3867P5380J070K8753o4067r1412n4724J24048K3215
$$ plain form
15641 -138411 -198357 -168104 -192796 -209103 -73217 28037 6779 -51404 -143498 -8493 101972
15630 101972 47142 -3218 46014 172148 81138 -67523 -162444 -295913 -72621 -89388 -72196
15619 -72196 -135281 -57199 51011 128965 67949 15723 103524 40128 -74401 -49924 59421
15608 59421 48466 -16571 -90609 -15453 -946 -134720 -111359 -14526 -47282 -36771 -67803
15597 -67803 -1211 141970 38967 -120408 -168555 -151187 -71106 -6856 160464 193917 120421
15586 120421 59087 -28613 -14354 87534 219087 106389 30051 -43576 -186882 -271467 -213355
15575 -213355 -227870 -194437 -227776 -215056 -78268 -59548 -76358 -60573 32556 -3154 -147385
15564 -147385 -165627 -23847 -37714 37666 38736 67489 3422 -87990 -142714 -18666 4549
15553D549L668N9650l235j61388j35858q2383L5168K31558J11143o0782l6835
15542c4745M2099o1646m4971m8706K9597J1063N5419R1535K1578R478K700r4515
15530b1114p2123m3146n3948m1020m0883N7488J20896p234j6621M540O2843O9472
15518A9150p9947L5040P8850J4292k5185j70106l6845o137P4361J48706r7073
15507d4894r6620J12059J78092j9328j17676o4735O0305J41077r728n6836K7127
15496A08843m2727n1324j22651q3465N1143J3463j4389o131N3792O0143N1573
15485A8270J24183n6654q1503Q2416O7677p5583m3676r918J8984k8290j44724
15474a28818M6290J0093q8236K6262J09009M7296r4947j13187P2805Q9032M6951
$$ plain form
15553 4549 8217 67867 64632 -96756 -232614 -314997 -279829 -48271 62872 2090 -34745
15542 -34745 7354 -54292 -99263 -147969 -118372 -107309 -51890 39645 61223 70701 73401 -21114
15530 -21114 -93237 -136383 -190331 -231351 -272234 -214746 -93850 -101084 -117705 -113165 -50322 19150
15518 19150 -60797 -25757 53093 67385 42200 -127906 -164751 -170888 -96527 52179 -44894
15507 -44894 -141514 -29455 148637 129309 11633 -53102 7203 148280 138552 81716 108843
15496 108843 66116 14792 -107859 -191324 -140181 -126718 -141107 -147238 -93446 -33303 18270
15485 18270 142453 85799 4296 86712 154389 78806 35130 25212 44196 15906 -128818
15474 -128818 -82528 -72435 -160671 -134409 -25400 21896 -73051 -186238 -113433 -24401 22550
15463B2550j3257k5889K8473K7063q8410J6792j0687n960N1154k6983L6414R8452
15451A09712j500l536o0484j21932m1575J23761M5927M2923J1724p2528N3364
15440H5856j9153K1852N878k9164J8838o705j26768L7128l9027j15229n9147Q0710
15428a44931J41598R7207J9145l4386K6676n4402j4931O9844M999l6676j118M2582
15416A15607o782j08574l0901M8056k6520r6226l7688O9577P2003O6392J3785
15405G8729q3903n3882J2238L0147k8826n2444k383O2920J55670n1896n4884J6841
15393B8327L5231m6196J8526L3169j9850j0613l5675k9031N1373j01353p1508
15382a47600M1827K8826j16909j8556R2221K7942l8326J4412J83428O3854j57342
$$ plain form
15463 22550 9293 -16596 11877 38940 -49470 -32678 -43365 -49325 1829 -25154 11260 109712
15451 109712 108212 104676 44192 -77740 -119315 4446 50373 93296 105020 32492 85856
15440 85856 66703 88555 94433 65269 84107 77402 -49366 -12238 -51265 -166494 -225641 -144931
15428 -144931 -3333 93874 113019 78633 105309 50907 35976 105820 110819 74143 73025 115607
15416 115607 108825 251 -30650 17406 -9114 -105340 -143028 -73451 -1448 64944 78729
15405 78729 -5174 -59056 -46818 -16671 -45497 -97941 -100324 -37404 118266 66370 11486 28327
15393 28327 63558 17362 35888 69057 49207 38594 2919 -26112 25261 -76092 -147600
15382 -147600 -105773 -76947 -193856 -212412 -120191 -92249 -130575 -116163 67265 131119 -26223
15371b6223j60909q9614J30149N7378k4014Q1825Q2830n5880j61804J8593Q1108
15360f6561Q3734n3056l4149R8046j5458j25458j60770j16335J8250J12895J54521
15349a04341m909n1397j9558L8541J07181R7718P04l5401l049P5803K407j08269
15337d570P0004N2392j12203j25548J7325J05989Q7856n0870l8852N1968j1940
15326D1551j351j06742j3200R6508N4855n3730j272l4700j7555L7047R9808q501
15314I2718L3842p0595j24890K2250J28648L0410j55444L025L8399o826M6275
15303C7812L0774Q636L6309K6017r8807k9192J2607K3024r6855j22455j2329O7397
15291a17062m0036j7437J19301J92341O3393J7677l126j10709l1276j48838L0844
$$ plain form
15371 -26223 -187132 -276746 -146597 -89219 -113233 -31408 51422 -4458 -166262 -147669 -66561
15360 -66561 17173 -35883 -70032 28014 12556 -112902 -273672 -390007 -371757 -258862 -104341
15349 -104341 -109250 -160647 -180205 -141664 -34483 63235 63939 28538 25489 101292 103699 -4570
15337 -4570 65434 117826 5623 -119925 -102600 3389 91245 40375 1523 53491 41551
15326 41551 40200 -66542 -79742 16766 71621 17891 16619 -18081 -35636 1411 101219 92718
15314 92718 126560 55965 -68925 -46675 81973 112383 -43061 -40036 -1637 -8463 37812
15303 37812 68586 77222 113531 139548 40741 11549 24156 47180 -49675 -172130 -184459 -117062
15291 -117062 -157098 -174535 -55234 137107 200500 218177 215051 104342 73066 -75772 -44928
15280d4928O9658J09461j5616p1022L7533J00361j43261n3773k9262Q091O4310
15269C1552Q455K5315n6121p0797k7455p835M237Q1408J21357P5154k9082J9836
15257A76024k8857j14670j29942k9672L4466J02844M0250r6437o9001l0603m8646
15246a94244J80202R0988K0898L6504k167R626q5768k4712j01220O2373m0676
15235d8196L3044m0631k8713J04537L3748P369J16726j92712j92027Q4059N2902
15224f9894k1949l6196L8141K487P6907R5119j7121o0778L6466l6453o7161r1547
15212a51979l7411L1165j9403p5230j0192J69797M5681j0946p6879J0567J04816
15201b0014M2320m5454O696j769l3626R6565Q7422m3007k1928q4123k4030P9816
$$ plain form
15280 -44928 24730 134191 118575 47553 85086 185447 42186 -11587 -40849 -32758 31552
15269 31552 40007 65322 9201 -61596 -89051 -96886 -92649 -11241 110116 185270 156188 176024
15257 176024 147167 32497 -97445 -127117 -92651 10193 50443 -45994 -114995 -145598 -194244
15246 -194244 -14042 76946 97844 134348 132181 141807 56039 31327 -69893 -7520 -48196
15235 -48196 -15152 -55783 -84496 20041 53789 61158 177884 -14828 -206855 -122796 -69894
15224 -69894 -91843 -128039 -89898 -87411 -10504 84615 67494 6716 43182 6729 -60432 -151979
15212 -151979 -189390 -158225 -177628 -252858 -263050 -93253 -47572 -58518 -135397 -124830 -20014
15201 -20014 22306 -23148 -16452 -18221 -51847 44718 132140 89133 67205 -16918 -40948 38868
15189C8868m2065q1059O5475m1461J07423n8239r5822n1851k6414K187O7720k1167
15177a36405q7123Q1808J32284J71983L5754n5481m8685n08j223l8413M650k9839
15165B8802o4069J0875j3538l3988N7359Q0847j04507M0672p044M3749q8834j4732
15153f4408J50707R9812j3666n9875j29402Q522Q9263K8708K7697k3163P577l4814
15141H6958J1757P7834L4328n3476j17809k6560O002O1043j31453j09652R9300
15130f1728q209J32357J01879P2142n9352q2719o3670N5310k121j12116k543M8827
15118A8057P6457m8241o1925J4353P3281K3607k9412M6193q7910j11350j5815
15107a02705n619k2063J21032J5095J5680N1760L3326k6348n1316p8448l3718
$$ plain form
15189 38868 -3197 -84256 -18781 -60242 47181 -11058 -106880 -158731 -185145 -182958 -115238 -136405
15177 -136405 -223528 -141720 -9436 162547 198301 142820 94135 93627 92404 53991 58641 28802
15165 28802 -35267 -24392 -37930 -71918 -14559 66288 -38219 2453 -4591 39158 -49676 -64408
15153 -64408 86299 186111 172445 112570 -16832 -8310 80953 109661 137358 114195 121772 86958
15141 86958 98715 176549 210877 157401 39592 13032 19034 80077 -51376 -161028 -61728
15130 -61728 -69937 62420 164299 236441 177089 94370 30700 86010 83889 -28227 -30770 18057
15118 18057 94514 46273 -15652 -1299 71982 95589 66177 112370 24460 -86890 -102705
15107 -102705 -108324 -130387 -9355 5740 21420 73180 106506 80158 28842 -49606 -83324
15096h3324P4875n604j7714o841j9409q9033p9089O5842J37764M494j24478O1138
15084h1379J21118j15381q5699j2771N2569J50528j1037j42451q4402o607J55405
15073f0107J13292O1145q5696j16705l2199j9652j03738M8526J16323M9764k757
15062c1804l6371M1758j7845j0667k3586m8140K27K7466J58121R8585o6443m9932
15050D1369j02658l2823P1320n7189M9057r476o5488j3557L0942p31p5672K9439
15038a35467J84432K4780n5911j13914k752O9496M5422J8800P190m4908j1777
15027a4609k1691O0280K6906j4355J9895k7677l9053q296J5141k7002o5454M4207
15015e1708N9439q4906l7174P9880j3221J2528J14117J3192k02991L5858R4334
$$ plain form
15096 -83324 -8449 -14053 -31767 -38608 -58017 -147050 -226139 -160297 -22533 -18039 -142517 -81379
15084 -81379 39739 -75642 -161341 -174112 -121543 28985 17948 -124503 -208905 -215512 -60107
15073 -60107 53185 114330 28634 -88071 -120270 -139922 -243660 -195134 -78811 -29047 -31804
15062 -31804 -68175 -26417 -44262 -54929 -78515 -126655 -126428 -98962 59159 157744 91301 41369
15050 41369 -61289 -94112 -22792 -79981 -30924 -40400 -105888 -119445 -88503 -89234 -164906 -135467
15038 -135467 48965 73745 17834 -96080 -98832 -29336 16086 34886 42076 -2832 -14609
15027 -14609 -36300 23980 50886 36531 56426 28749 -10304 -18600 -3459 -30461 -95915 -51708
15015 -51708 7731 -77175 -114349 -34469 -47690 -35162 78955 92147 -110844 -74986 19348
15004A9348L7286l5503o202J3741N3784m8522J10758J0973j7853q1743O4410J00747
14992B21224o5640p8364k4547J08533j21440m7789M0380J70262R458j01103j10804
14981A70j08391o2921n006P0974Q9098N741L82n4412r0012N622J71223J04472
14969A26940j47564r2860P0545Q6985K693p8409k9374N3192O1735K4053j6294
14958F1642q244j4104j81034j5407o2138j6089J8987P5496J03366P2022N162j22174
14946h2515K0790J9305N2666m4996j00278m9468k0387J15200N2885N1720M3046
14935E7968N8103r7796r455L1511q1471j44212j5803J16349J6062J03963j5551
14924A9668K851R414J38663J5458j03626L2039O1843o5419m0863l7973o1229r38
$$ plain form
15004 19348 56634 21131 14929 28670 82454 33932 144690 155663 137810 56067 120477 221224
14992 221224 155584 77220 52673 161206 39766 -8023 32357 202619 212077 110974 170
14981 170 -108221 -171142 -176148 -105174 -16076 -10335 -9953 -64365 -154377 -148755 22468 126940
14969 126940 -20624 -113484 -42939 44046 46739 -31670 -61044 -7852 53883 77936 61642
14958 61642 53398 39294 -141740 -157147 -219285 -235374 -216387 -140891 -37525 34497 39659 -82515
14946 -82515 -61725 -42420 10246 -34750 -135028 -184496 -204883 -89683 -36798 14922 57968
14935 57968 116071 18275 8820 40331 -41140 -185352 -201155 -84806 -68744 35219 19668
14924 19668 22519 31933 170596 186054 82428 114467 176310 110891 70028 32055 -29174 -30112
14912c0112J3901N3833J11519q4224j21948J70985M7807j44841m2684J8201L6871
14901B9308J9915m2563n7673J3198L8725j17355n2952J28079J21484l0022p7232
14890b7088P6004j6908j0035q6855L6467N2452J7991L6660l1121j07205K055k2600
14878h0183K4070J15624L2471l9237O0532M828p1269J3160p5536j31021J09676
14867c6885Q8390j03759N6354M496P5686M3586l6838j47941N9021Q5269J26110
14856B13489L0015o1504j41186r3356q192j8995o2158Q3638L6760l8435L2127
14845b7797p2257L9447o828N2867J1219r8285L2305P8555N4767J22380l9297p6118
14833G0958p6022l6741R0937J1610M4082l9171m5821k2646M3710j7346P4296k0702
$$ plain form
14912 -30112 -16211 37622 149141 64917 -57031 113954 161761 16920 -25764 -7563 29308
14901 29308 49223 6660 -51013 -37815 910 -116445 -169397 -41318 80166 50144 -27088
14890 -27088 48916 32008 21973 -64882 -28415 24037 42028 78688 47567 -59638 -57583 -80183
14878 -80183 -56113 59511 91982 52745 113277 118105 46836 59996 -15540 -146561 -36885
14867 -36885 51505 -52254 4100 8596 84282 127868 91030 -56911 2110 87379 213489
14856 213489 243504 182000 40814 -52542 -60734 -79729 -141887 -58249 -21489 -59924 -27797
14845 -27797 -100054 -60607 -67435 -14568 -3349 -101634 -69329 9226 63993 186373 147076 70958
14833 70958 -5064 -41805 49132 60742 104824 65653 19832 -2814 40896 23550 97846 77144
14821G7144K895R6459J1785j15937j34192J0479N7203n3858p176N8424K769n245
14809G50l5272q4686l50O4722N3894P0125o2293J6055o8383Q8013O8708j17040
14797e757o1528j13222j14438j4572j4566P1172J85130J22455Q8596n2385j79420
14786h8535j4591L6049p3972L6694K7703k1450N1264N5025m9905k343m0915m1751
14774a26727J31357L4844n3978n1034O4012k0886j06506l2012p7929J30902J65292
14763E7335j27320j55068P8034J05300l695K2374j1418l2023q500K3395J3425
14752c8161l122m9020j3305Q8166o843L9461Q2426O1664j21783j68064m1920N2635
14740a17866O6836K6420m6240o9709N1720L1111m6345j0892K3307p268L9083m3665
$$ plain form
14821 77144 80039 176498 188283 72346 -61846 -51367 5836 -48022 -55198 3226 5995 750
14809 750 -34522 -119208 -119558 -54836 -942 69183 6890 22945 -45438 42575 111283 -5757
14797 -5757 -67285 -180507 -294945 -309517 -324083 -252911 -67781 54674 143270 90885 -88535
14786 -88535 -103126 -67077 -141049 -104355 -76652 -98102 -46838 8187 -41718 -44061 -84976 -126727
14774 -126727 4630 39474 -14504 -65538 -1526 -22412 -128918 -160930 -238859 -107957 57335
14763 57335 -69985 -225053 -147019 -41719 -45414 -23040 -34458 -66481 -74981 -51586 -38161
14752 -38161 -41283 -90303 -103608 -15442 -22285 17176 99602 161266 39483 -128581 -170501 -117866
14740 -117866 -51030 -24610 -70850 -140559 -88839 -57728 -104073 -114965 -91658 -98926 -59843 -103508
14728a03508q7597L37j3024j1139j4323O1412K08947J1707l3834n80j3055O957
14716A2300j7618k7934P0548J0584j14755r544R0086l7370N7291J5515M334J0503
14704F3940M0349K2655q172J893K6476q228m0158k0847k1919n6230j03095K716
14692a00620Q3031R2674O2148Q8449l9669j3373k9945m3237j02341L5361K3860
14681E6338J9945j2762l0504K1865O2390J23041R9138l3388n3551j70365j47100
14670f4953l1904J731M2237M6777l6524l9146o8264R468k2306k0915J1650m6111
14658b18260L1247O2230J28984Q3594l4737j41714j44793J92N8186o6955M0501
14647b01525P0639J54139j3531q0325l1985n3874n6853m109k2628J68307J29104
$$ plain form
14728 -103508 -191105 -190768 -203792 -214931 -229254 -167842 41105 52812 18978 18398 5343 12300
14716 12300 -5318 -33252 37296 47880 -66875 -76419 13667 -23703 33588 49103 53437 63940
14704 63940 104289 126944 118772 120665 147141 138913 98755 77908 55989 -241 -103336 -100620
14692 -100620 -17589 75085 137233 225682 186013 172640 142695 99458 -2883 32478 56338
14681 56338 76283 63521 33017 54882 117272 240313 339451 306063 252512 82147 -64953
14670 -64953 -96857 -95126 -52889 -6112 -42636 -81782 -150046 -140578 -162884 -183799 -172149 -218260
14658 -218260 -187013 -124783 4201 87795 53058 -88656 -233449 -233257 -175071 -242026 -201525
14647 -201525 -130886 23253 9722 -70603 -102588 -156462 -213315 -217424 -240052 -71745 57359
14636E7359m962J07528J12316n4130j08828J4974N3845K6101m9330l8243J464
14625A18094k8709q6078N1587r1893o4110j26262j26428J06192J24552o3702k7356
14614b14113P4004J42473J13900l663l2630J6817J4571M0810m9415J2389l1473
14603H3670j8955M2253l0314o7363N3329K6057J8232k0143p5861j564q3107O1076
14591a2690O92N3557M1573M3330j00789m6811J7441N0033n5764n113j01994N883
14579a10652R7388n9130L3162L0898Q5261j04811K4553K3707q7880P9536q2748
14568g0716Q061J02138m6165j01814J21647J58391l3607j09726m0922o0324L0029
14557d3008O4280K3807m0992K5418n7918J3798m1318k5276R8396l1424o9921k2716
$$ plain form
14636 57359 52397 159925 272241 218111 109283 124257 178102 204203 154873 116630 118094
14625 118094 89385 3307 54894 -36999 -101109 -227371 -353799 -247607 -123055 -186757 -214113
14614 -214113 -140109 2364 116264 112601 79971 96788 111359 152169 102754 115143 83670
14603 83670 64715 106968 76654 9291 62620 88677 106909 86766 10905 9341 -73766 -12690
14591 -12690 -11998 41559 83132 126462 25673 -21138 -3697 46336 -9428 -14541 -116535 -110652
14579 -110652 -13264 -72394 -39232 -8334 76927 -27884 -3331 20376 -67504 12032 -70716
14568 -70716 -62655 39483 -6682 -108496 13151 171542 137935 28209 -12713 -73037 -43008
14557 -43008 21272 45079 4087 29505 -28413 -14615 -55933 -81209 17187 -14237 -84158 -106874
14545a06874N3548J00650l9974L8623k0992k7048l4938l0583j21542m0469n3806
14534b83405p0740P9508P1523O2227J81135J61142l5003j28372r3954m2694r65
14523i9598j1028n4061M330R8954l7722O3492o6851K828J33829j8302J3290j08457
14511g9296q9748N6137O6802N9829j72117j4889N8349J5270J4820J02591J6819
14500C4567r5735J1243k119O2246P6317j66312M4060L5376l7915m3167k751N0784
14488c3406r3032N8779J42286n6966r8069k8724p31J0742l4541R0065P0778j24302
14476i7121o1544l4975J0155J06982J01247n5123j3027l8901O3771l9702o8659
14465a26897J2572L3893J59591l7811k14008J27796J42676J11799r8404r9658
$$ plain form
14545 -106874 -53326 47324 7350 45973 24981 -2067 -37005 -67588 -189130 -229599 -283405
14534 -283405 -354145 -274637 -203114 -140887 40248 201390 166387 38015 -55939 -98633 -99598
14523 -99598 -110626 -164687 -160357 -61403 -99125 -35633 -102484 -99656 34173 15871 29161 -79296
14511 -79296 -169044 -112907 -46105 13724 -158393 -173282 -114933 -99663 -84843 17748 34567
14500 34567 -61168 -49925 -52044 10202 86519 -79793 -35733 -357 -38272 -81439 -84190 -33406
14488 -33406 -126438 -67659 74627 17661 -80408 -109132 -109863 -99121 -133662 -43597 27181 -97121
14476 -97121 -158665 -193640 -183485 -76503 24744 -30379 -43406 -82307 -18536 -58238 -126897
14465 -126897 -114325 -80432 79159 41348 -172660 -44864 97812 209611 111207 11549
14455A1549R969M5276O1626O1833j9088K0557p6116j00476N951j4667j17176m0145
14443a50907R5631J14717L6072m1821N0675l7269j51740J6112N5266J1719L0775
14432B9230j9688j6570R184K3999l775j57434l2844N1069J87203P6629p6670k5673
14420D4660r7914m1547Q1416J72648q9774p4023M0387o0401n1449q1790L8380
14409a19407k560l3346j7777J42021Q1074M5219N5847p6530j04574N531r4893
14398a19395q1500R8158Q9172R386O1478k7975l2997L6778L5918k7283l479o4237
14386b5976k530J13429q8656P3763O0420O136j38979q0754m4244O5019Q3571L6994
14374E8193p4372p138P2889J3821Q488Q6519L6666j51832n2955J5482N359p6299
$$ plain form
14455 11549 21518 66794 128420 190253 171165 191722 115606 15130 21081 6414 -110762 -150907
14443 -150907 -55276 59441 95513 53692 104367 67098 -84642 -68530 -13264 -1545 29230
14432 29230 9542 -7028 2156 26155 22380 -135054 -167898 -116829 70374 147003 70333 44660
14420 44660 -53254 -94801 -13385 159263 69489 -4534 35853 -24548 -75997 -157787 -119407
14409 -119407 -121967 -155313 -173090 -31069 50005 95224 151071 74541 -30033 -24502 -119395
14398 -119395 -200895 -102737 -13565 -4179 57299 29324 -3673 33105 69023 41740 38261 -25976
14386 -25976 -28506 84923 -3733 70030 130450 136586 -2393 -83147 -127391 -62372 21199 58193
14374 58193 -16179 -23317 49572 63393 71881 158400 195066 43234 -9721 5761 11120 -65179
14362f5179j61049r3035M2805J6105J04689J34356K0665l1238q0896J37471L9162
14351F3856j21441n3356O7408L7484R623m8310J7797J329j3121m3223l6692k2483
14339a41129m0380M0400R1340J21065k4609O0189R5696o1038M0439j23333k53517
14328a94877N0363J51792N0673p7742K2714l3479j9564J8244o1129j6870O2020
14317d7855L8298L131j22474n8359J25490M9734J14345k1279j02081n2361l5920
14306a09331o6929j3381J21893Q8454K6751o5735r0309L4117Q9919k3376q5232
14295i3159J6363J66250K0101j23914n0199N0063Q9885j06830R589L4712m1939
14284b9078J9062k5889J9154K8963R3389M0116n1564j53374r3317M9613J35778
$$ plain form
14362 -65179 -226228 -319263 -276458 -260353 -155664 -21308 -643 -31881 -112777 24694 63856
14351 63856 -57585 -110941 -43533 -6049 3574 -44736 -26939 -25610 -38731 -81954 -118646 -141129
14339 -141129 -181509 -141109 -49769 71296 46687 106876 202572 141534 181973 58640 -194877
14328 -194877 -144514 7278 57951 -19791 2923 -30556 -50120 -31876 -93005 -109875 -47855
14317 -47855 -9557 -6426 -128900 -187259 -61769 -12035 102310 81031 -21050 -73411 -109331
14306 -109331 -176260 -189641 -67748 20706 47457 -18278 -108587 -74470 15449 -7927 -93159
14295 -93159 -76796 89454 109555 -14359 -64558 -14495 75390 -31440 -21851 12861 -29078
14284 -29078 -10016 -35905 -16751 12212 105601 145717 94153 -59221 -152538 -102925 32853
14273C2853p107M5273q036J1040n3035j6858o4159Q1201M6279N1524N5964j02648
14261G2291O5485l8558n8901n05M4882N5290r3176j74715p541Q2737J21545J263
14249G0097k2757j8977n6364j74171p4996Q3069M2806J21978n248J47366J1959
14238A24762o1153j3432q7425J6749j2307J2983P6725N8160j32288r9287J04773
14227a1740J86754M9826r0937j03232n8941j19196l4461J12876K7772p1836P3075
14216d0040R987o4913P5160n5252r6815R105P8039O0977k9175R8228m2056j8142
14204a4897J04924J317J2146l5250K4005l8283O5302Q5048L6990j5249j56571
14193F9482o9762M1765P6536K8511J3755l8285k0226l6791n6975M179N994m8259
$$ plain form
14273 32853 25746 71019 62983 74023 20988 4130 -60029 21172 67451 118975 174939 72291
14261 72291 137776 99218 40317 39812 84694 139984 46808 -127907 -135448 -52711 68834 70097
14249 70097 47340 28363 -28001 -202172 -277168 -194099 -151293 -29315 -34563 112803 124762
14238 124762 63609 50177 -37248 -20499 -32806 -19823 56902 115062 -17226 -116513 -11740
14227 -11740 175014 224840 133903 30671 -28270 -147466 -181927 -69051 -41279 -113115 -40040
14216 -40040 -30053 -94966 -19806 -75058 -171873 -162768 -84729 -23752 -52927 45301 3245 -14897
14204 -14897 90027 91344 103490 68240 92245 53962 119264 204312 241302 226053 69482
14193 69482 -280 41485 118021 146532 160287 122002 101776 64985 8010 12189 18183 -30076
14181c0076m6084k4342p0292K1964J01974J3596l666K6158n0016k5169l7323L2378
14169i0898n2313L0195Q8180j7317k3857P13k3537k9889K8579m1762P7184M7408
14157g314L9660O2653L5694p2800k8289N6734M9267P3016J8472r2371j24867j14941
14145a05086J16639J95202N118j0793r4696q66m1655j32466k5734K4039k640p99
14133g3737J7147k5038k8788m7460l6794P9362r825J14125N865j2130p5437n4997
14121a47707Q4301k7706J29584j0997j61070n2831O6287J99351L3426j05228n805
14110A605Q1652J766j31130j07639m3705L7763K5407j1958J7729r2571M1990Q9217
14098h9874O0809J54207r6425r9604l6035J64803P9866n3644M4279k5035o7969
$$ plain form
14181 -30076 -76160 -100502 -170794 -148830 -46856 -33260 -36926 -10768 -60784 -85953 -123276 -90898
14169 -90898 -143211 -113016 -24836 -42153 -66010 -65297 -88834 -118723 -90144 -131906 -54722 -7314
14157 -7314 32346 94999 130693 57893 29604 86338 135605 208621 227093 134722 9855 -105086
14145 -105086 11553 206755 211873 201080 106384 105518 63863 -68603 -94337 -70298 -72938 -73737
14133 -73737 -56590 -81628 -110416 -157876 -194670 -115308 -125133 -11008 -5143 -17273 -92710 -147707
14121 -147707 -63406 -91112 38472 27475 -133595 -186426 -120139 79212 112638 7410 1605
14110 1605 83257 85023 -46107 -153746 -197451 -159688 -134281 -146239 -128510 -221081 -179091 -89874
14098 -89874 -29065 125142 28717 -70887 -106922 57881 137747 84103 128382 103347 35378
14087C5378m2239n5078r5403n8742m1125J48939m067J1883J38943L9651q3789
14076e649m0429k17M6480J40275j52507m5764M6860P5603o1373J571k0223K6229
14064A0856J23719m6702j11795l6385r264l6271P9778J08534l0676p4281l4105
14053e6592j0265Q8225l1857J1631L3544J00403L496j35223K0981l3247q1334
14042i0238N5072j14276K7264J67448J43578j58307j19269j48173K6564J47574
14032f2763M5975j31320O296O1898j36579K3023L2702M5447J00957J15200j3408
14021H7428o3590j24644l6973j9391J6772j2241J55055M5221j55270P424J65810
14010F5601J7767n8598j6063N1223K6247o6356J50294M6824r3655l0565j04774
$$ plain form
14087 35378 -6861 -61939 -157342 -216084 -257209 -108270 -112337 -100454 38489 78140 -5649
14076 -5649 -46078 -46295 185 140460 -12047 -57811 -10951 64652 3279 4850 -15373 10856
14064 10856 134575 87873 -23922 -60307 -69571 -105842 -26064 82470 51794 -22487 -56592
14053 -56592 -66857 21368 -10489 1142 34686 135089 138585 3362 24343 -8904 -90238
14042 -90238 -35166 -149442 -122178 45270 188848 30541 -88728 -236901 -210337 -62763
14032 -62763 -16788 -148108 -141812 -79914 -216493 -193470 -160768 -115321 -14364 100836 87428
14021 87428 23838 -100806 -137779 -157170 -140398 -152639 2416 47637 -107633 -100209 65601
14010 65601 83368 24770 8707 59930 86177 19821 170115 216939 123284 92719 -12055
13999a2055L6886J11902O9735R782j66937q8195L7868K6890K592o1387P1909J6007
13987E4997j5968M5207n7517j40541j41490J21773M8962j41736J8352j6376Q7058
13976a37279M6819j6535L1931K5932L7718n4476k1337o1217L9873Q3091J96652
13965A71172p8102n0690j3380n1960Q00P463J947p8814m8601P6690l6106o9949
13953a69530M7697J80256P5749p0715j5949k176n7712l7365j35387j12396L272
13942b94256J60569P7148N3492J07761q148J052j12686k2968r147J07660j53471
13931i2994m9711M5874J42199O3315J1353j70052N835O8915Q1734k6971m1668
13920C7829n9850p4404L5860R8257Q3412j04395m3948N4448Q8264l2708o5292
$$ plain form
13999 -12055 24831 136733 206468 216250 49313 -38882 -1014 25876 28468 -32919 38990 54997
13987 54997 39029 84236 26719 -113822 -255312 -133539 -84577 -226313 -207961 -224337 -137279
13976 -137279 -90460 -106995 -75064 -49132 -11414 -65890 -87227 -148444 -108571 -25480 171172
13965 171172 93070 42380 29000 -22960 -22160 -14697 -12750 -91564 -140165 -63475 -99581 -169530
13953 -169530 -121833 58423 134172 63457 47508 45332 -12380 -49745 -185132 -297528 -294256
13942 -294256 -133687 -56539 -3047 104714 96566 97618 -15068 -38036 -47183 60477 -92994
13931 -92994 -142705 -96831 45368 108683 120036 -50016 -44181 24734 106468 79497 37829
13920 37829 -22021 -96425 -60565 37692 121104 16709 -27239 27209 115473 82765 17473
13909A7473o5352j065Q8341j4765P3060o9827j06630O942q9130j47434M9440K5976
13897b32971k3390p6667J2433R8257K3215K4389J54846j3623o8500l6942L8663
13886a00290m2327n9338k0462Q1949N5249K8806j308J24381L3874n2071q4032
13875c5569r8338Q4027k7416M5331J42638K0547J9675o4530k5303j8883j26763
13864h4584p215J10807M1714o2673L5913K4268j69094j9935l6521J07002J8094
13853d2224p8173k2276J1658O7270J8621p1773m5908J16117M6924L181J6289K6281
13841D5987m7103r1915P0041P1915k5592m9575q5239J8752Q8653l0922j18600
13830a53598J23533N9852k6451J8173n2728o6440j5825J2256Q746Q1466P3517
$$ plain form
13909 17473 -47879 -48944 39397 24632 97692 27865 -78765 -71823 -160953 -308387 -258947 -232971
13897 -232971 -256361 -333028 -320595 -222338 -199123 -174734 -19888 -33511 -102011 -138953 -100290
13886 -100290 -142617 -201955 -222417 -140468 -85219 -56413 -57721 66660 100534 48463 -35569
13875 -35569 -133907 -49880 -77296 -31965 110673 131220 150895 86365 61062 42179 -84584
13864 -84584 -91799 19008 60722 -1951 33962 58230 -110864 -130799 -167320 -60318 -42224
13853 -42224 -120397 -142673 -131015 -63745 -45124 -116897 -162805 -46688 236 3417 19706 45987
13841 45987 -1116 -93031 -22990 48925 23333 -26242 -111481 -92729 -4076 -34998 -153598
13830 -153598 -30065 29787 3336 21509 -31219 -97659 -113484 -101228 -92482 -11016 62501
13819F2501j6220m7177L0513j969n3574Q694J06243j2517j71127o9445J4575J25633
13807b3870J745l7325k0058m5042r3982k0520Q4330O0213k8472R0811M5200N9391
13795G2421M6585J3408n8805k2035j3646m9627r791N2835n192L5037o3235J0118
13783H073J3911K9984J13584n6753j00659l386k8085J23496N7475p7644O836j9677
13771F7155l0854j15760j65503R759J57427J12356o6886j05183N4035N8719L1377
13760F642J23099n8198k02211l3256N7565k516J20605r0511L3170m5925q1635
$$ plain form
13819 62501 46281 -896 29617 27648 -25926 -17232 89011 76494 -94633 -164078 -149503 -23870
13807 -23870 -22125 -59450 -79508 -124550 -218532 -239052 -154722 -94509 -122981 -32170 13030 72421
13795 72421 119006 132414 73609 51574 37928 -11699 -21490 31345 26153 61190 -2045 8073
13783 8073 21984 51968 165552 108799 8140 4754 -23331 100165 157640 79996 86832 67155
13771 67155 36301 -79459 -244962 -235203 -77776 34580 -32306 -137489 -83454 -24735 6642
13760 6642 129741 71543 -130668 -163924 -106359 -108875 11730 -78781 -45611 -91536 -173171
$$ [...]
##END NTUPLES=NMR SPECTRUM
##END=
