##TITLE=Analysis number 317605
Compound Code cc 02247
Book Reference 446/190
Project Code adrs
Chemist Name roba
##JCAMPDX= 6.0         $$ Bruker NMR JCAMP-DX V2.0
##DATA TYPE= NMR SPECTRUM
##DATA CLASS= NTUPLES
##ORIGIN= Bruker BioSpin GmbH
##OWNER= nmr
$$ XWIN-NMR		Version 3.5
$$ Mon Feb 27 10:02:09 2006 GMT Standard Time (UT+0h)  MAYBRIDGE\nmr@NMR_250MHZ
##.OBSERVE FREQUENCY= 250.131544655141
##.OBSERVE NUCLEUS= ^1H
##.ACQUISITION MODE= SIMULTANEOUS (DQD)
##.ACQUISITION SCHEME= undefined
##.AVERAGES= 16
##.DIGITISER RES= 18
##SPECTROMETER/DATA SYSTEM= dpx250
##.PULSE SEQUENCE= zg30
##.SOLVENT NAME= CDCl3
##.SHIFT REFERENCE= (INTERNAL, CDCl3, 0, 16.2729)
##AUDIT TRAIL= $$ (NUMBER, WHEN, WHO, WHERE, WHAT)
$$ ##TITLE= Audit trail, XWIN-NMR		Version 3.5
$$ ##JCAMPDX= 5.01
$$ ##ORIGIN= Bruker BioSpin GmbH
$$ ##OWNER= nmr
$$ C:\u/data/dgb/nmr/ADRS/16880/pdata/1/auditp.txt
$$ ##AUDIT TRAIL=  $$ (NUMBER, WHEN, WHO, WHERE, WHAT)
(   1,<2006-02-27 10:01:30.07 +000>,<MAYBRIDGE\nmr>,<NMR_250MHZ>,
      <created by zg, POWCHK disabled, PULCHK disabled
       configuration hash MD5:
       84 BC 41 DB A1 6E 1D 46 DA 25 12 A5 C1 ED C5 3A
       data hash MD5: 64K
       32 EB 20 3E 1B AB 92 FF 00 4C 89 0B FB 01 F5 25>)
(   2,<2006-02-27 10:01:56.00 +000>,<MAYBRIDGE\nmr>,<NMR_250MHZ>,
      <Start of raw data processing
       ef LB = 0.3 FT_mod = 6 PKNL = 1 SI = 32K 
       data hash MD5: 32K
       52 93 DC A8 93 59 8B 5F 18 03 9D 35 33 E9 EE A3>)
(   3,<2006-02-27 10:01:58.42 +000>,<MAYBRIDGE\nmr>,<NMR_250MHZ>,
      <apk 
       data hash MD5: 32K
       9F F7 23 28 DA 8D 63 07 3F 49 9A C0 5B B4 4A AE>)
(   4,<2006-02-27 10:01:59.15 +000>,<MAYBRIDGE\nmr>,<NMR_250MHZ>,
      <abs ABSG = 5 
       data hash MD5: 32K
       7D 5E 1D E6 81 5A A4 07 D1 F1 E6 A6 51 5E 43 4F>)
$$ ##END=
$$ 
$$ hash MD5
$$ D3 D1 B6 EE 0A F9 52 E7 14 8A 55 A9 1C 71 BC 99
##$RELAX= 
##$RELAX= 
##$RELAX= 
##$RELAX= 
##$RELAX= 
##$RELAX= 
##$RELAX= 
$$ Bruker specific parameters
$$ --------------------------
##$DU= <C:\u>
##$EXPNO= 16880
##$NAME= <ADRS>
##$PROCNO= 1
##$TYPE= <nmr>
##$USER= <dgb>
##$AMP= (0..31)
100 100 100 100 100 100 100 100 100 100 100 100 100 100 100 100 100 100 
100 100 100 100 100 100 100 100 100 100 100 100 100 100 
##$AQSEQ= 0
##$AQ_mod= 3
##$AUNM= <au_zg>
##$AUTOPOS= <5 >
##$BF1= 250.13
##$BF2= 250.13
##$BF3= 250.13
##$BF4= 250.13
##$BF5= 500.13
##$BF6= 500.13
##$BF7= 500.13
##$BF8= 500.13
##$BYTORDA= 1
##$CFDGTYP= 0
##$CFRGTYP= 5
##$CHEMSTR= <none>
##$CNST= (0..31)
1 1 145 1 1 1 1 1 1 1 1 1 1 1 1 1 1 1 1 1 1 1 1 1 1 1 1 1 1 1 1 1 
##$CPDPRG= <>
##$CPDPRG1= <>
##$CPDPRG2= <>
##$CPDPRG3= <>
##$CPDPRG4= <mlev>
##$CPDPRG5= <mlev>
##$CPDPRG6= <mlev>
##$CPDPRG7= <mlev>
##$CPDPRG8= <mlev>
##$CPDPRGB= <>
##$CPDPRGT= <>
##$D= (0..31)
0 1 0 0 0 0 0 0 0 0.06 0 0 0 0 0 0 0.0002 0 0 0 0 0 0 0 0 0 0 0 0 0 0 
0 
##$DATE= 1141034487
##$DBL= (0..7)
120 120 120 120 120 120 120 120 
##$DBP= (0..7)
150 150 150 150 150 150 150 150 
##$DBP07= 0
##$DBPNAM0= <>
##$DBPNAM1= <>
$$ [...]
##$SUBNAM7= <"">
##$SUBNAM8= <"">
##$SUBNAM9= <"">
##$SW= 20.6930455092707
##$SWIBOX= (0..15)
0 0 3 0 0 0 0 0 0 0 0 0 0 0 0 0 
##$SW_h= 5175.983436853
##$TD= 65536
##$TD0= 1
##$TE= 293.16
##$TE2= 300
##$TE3= 300
##$TEG= 300
##$TL= (0..7)
0 120 120 120 120 120 120 120 
##$TP= (0..7)
150 150 150 150 150 150 150 150 
##$TP07= 0
##$TPNAME0= <>
##$TPNAME1= <>
##$TPNAME2= <>
##$TPNAME3= <>
##$TPNAME4= <>
##$TPNAME5= <>
##$TPNAME6= <>
##$TPNAME7= <>
##$TPOAL= (0..7)
0.5 0.5 0.5 0.5 0.5 0.5 0.5 0.5 
##$TPOFFS= (0..7)
0 0 0 0 0 0 0 0 
##$TUNHIN= 0
##$TUNHOUT= 0
##$TUNXOUT= 0
##$USERA1= <user>
##$USERA2= <user>
##$USERA3= <user>
##$USERA4= <user>
##$USERA5= <user>
##$V9= 5
##$VALIST= <valist>
##$VCLIST= <CCCCCCCCCCCCCCC>
##$VD= 0
##$VDLIST= <DDDDDDDDDDDDDDD>
##$VPLIST= <PPPPPPPPPPPPPPP>
##$VTLIST= <TTTTTTTTTTTTTTT>
##$WBST= 1024
##$WBSW= 4
##$XGAIN= (0..3)
0 0 0 0 
##$XL= 0
##$YL= 0
##$YMAX_a= 335455
##$YMIN_a= -466958
##$ZGOPTNS= <>
##$ZL1= 120
##$ZL2= 120
##$ZL3= 120
##$ZL4= 120
##$ABSF1= 16.27291
##$ABSF2= -4.420259
##$ABSG= 5
##$ABSL= 3
##$ALPHA= 0
##$AQORDER= 0
##$ASSFAC= 0
##$ASSFACI= 0
##$ASSFACX= 0
##$ASSWID= 0
##$AUNMP= <proc_1d>
##$AZFE= 0.1
##$AZFW= 0.1
##$BCFW= 0
##$BC_mod= 0
##$BYTORDP= 0
##$COROFFS= 0
##$CY= 12.5
##$DATMOD= 1
##$DC= 0
##$DFILT= <>
##$DTYPP= 0
##$F1P= 14.0000005364418
##$F2P= -0.99999901652339
##$FCOR= 0.5
##$FTSIZE= 32768
##$FT_mod= 6
##$GAMMA= 0
##$GB= 0
##$INTBC= 1
##$INTSCL= 1
##$ISEN= 128
##$LB= 0.3
##$LEV0= 0
##$LPBIN= 0
##$MAXI= 10000
##$MC2= 0
##$MEAN= 0
##$ME_mod= 0
##$MI= 0
##$NCOEF= 0
##$NC_proc= -4
##$NLEV= 6
##$NOISF1= 0
##$NOISF2= 0
##$NSP= 0
##$NTH_PI= 0
##$NZP= 0
##$OFFSET= 16.27291
##$PC= 1
##$PHC0= -108.4194
##$PHC1= 7.166212
##$PH_mod= 1
##$PKNL= yes
##$PPARMOD= 0
##$PSCAL= 4
##$PSIGN= 0
##$REVERSE= no
##$SF= 250.130062302629
##$SI= 32768
##$SIGF1= 0
##$SIGF2= 0
##$SINO= 400
##$SIOLD= 32768
##$SREGLST= <1H.CDCl3>
##$SSB= 0
##$STSI= 32768
##$STSR= 0
##$SW_p= 5175.98343685301
##$SYMM= 0
##$S_DEV= 0
##$TDeff= 65536
##$TDoff= 0
##$TI= <Analysis number 999999
Compound Code 99
Book Reference 9
Project Code 9>
##$TILT= no
##$TM1= 0
##$TM2= 0
##$TOPLEV= 0
##$USERP1= <user>
##$USERP2= <user>
##$USERP3= <user>
##$USERP4= <user>
##$USERP5= <user>
##$WDW= 1
##$XDIM= 32768
##$YMAX_p= 457707669
##$YMIN_p= -491818
$$ End of Bruker specific parameters
$$ ---------------------------------
##NTUPLES= NMR SPECTRUM
##VAR_NAME=  FREQUENCY,     SPECTRUM/REAL,   SPECTRUM/IMAG
##SYMBOL=    X,             R,               I
##VAR_TYPE=  INDEPENDENT,   DEPENDENT,       DEPENDENT
##VAR_FORM=  AFFN,          ASDF,            ASDF
##VAR_DIM=   32768,         32768,           32768
##UNITS=     HZ,            ARBITRARY UNITS, ARBITRARY UNITS
##FACTOR=    0.157963299565203, 1,           1
##FIRST=     4070.34378314358, 0,            0
##LAST=      -1105.63965370943, 0,           0
##MIN=       -1105.63965370943, -491818,     0
##MAX=       4070.34378314358, 457707669,    0
$$ Real data points
##PAGE= N=1
##DATA TABLE= (X++(R..R)), XYDATA
$$ [...]
21372 44696 -12577 -77166 -90460 -44713 -54681 -149827 -163252 -187865 -309588 -314033 -177005 -153689
21360 -153689 -116157 -113533 -121890 -306415 -367565 -306797 -277633 -193271 -79606 -50070 -128234
21349 -128234 -135342 -56533 -35857 -141316 -189970 -101361 42042 149632 194634 172318 132764
21338 132764 22468 -24177 -112150 -92098 -61454 -27410 -150017 -174742 -168185 -116187 33601
21327 33601 78977 -60585 -228538 -263312 -201950 -146312 -128652 -174251 -48185 68162 -110212
21316 -110212 -204776 -117103 -16453 94722 7664 -53282 -56720 -57695 -117169 -27864 -15397 -9090
21304 -9090 -48873 -112069 -150988 -208459 -72493 75064 101538 104179 147655 80750 47655 2745
21292 2745 41249 197750 184129 87543 176944 158072 69287 117747 69893 200273 207089 59716
21280 59716 23088 136774 203010 207055 126494 67922 -116449 -96810 59490 85754 -42419
21269 -42419 -73874 -40494 -38621 -29526 -211632 -273445 -221565 -97091 -16517 13988 -53706 -106570
21257 -106570 -6851 106691 97108 149580 15833 -139802 -132302 -71246 -155942 -88456 -126934
21246 -126934 -157253 -75700 -81329 -127604 -108824 3023 27242 -38658 -166701 -111484 -3274
21235 -3274 173790 84343 66902 85158 48973 -33520 -164851 -256018 -174393 -18403 -53631
21224 -53631 -6742 -67167 -88057 -131445 -286841 -282724 -276529 -75419 36578 32143 -17399 -41425
21212 -41425 -87287 -162523 -110163 -58351 -53584 -140382 -216602 -179141 -51640 40374 99138 91763
21200 91763 64822 -71850 -272655 -277515 -269293 -294999 -348161 -251075 -119459 -2862 77144
21189 77144 43054 -37554 -66044 -4324 36941 36971 -45436 -45507 455 -6097 -32653 -51557 -13979
21176 -13979 -91651 -176299 -206929 -173925 -110482 -110072 -141742 -106486 -145928 -196004 -255354 -125332
21164 -125332 -258679 -387046 -295531 -143690 -101346 -136239 -106200 -84347 -44381 -117 -77994
21153 -77994 -51317 -27526 -26216 -111561 -156107 -89498 25190 4786 27348 -54562 -110681 -40830
21141 -40830 162229 303839 215358 103286 -40754 -86590 -60358 -257977 -331070 -360947 -306177
21130 -306177 -243498 -90425 26782 122707 73840 54429 -15198 11603 29411 -25570 -107802
21119 -107802 -170150 -205572 -50714 16617 -20247 19798 46836 96132 60196 -13730 49127
21108 49127 70800 89420 101316 -38561 -147862 -205119 -289160 -220924 -163430 -97980 -65971
21097 -65971 10161 66052 171163 236940 250221 260602 290573 192620 35567 -119892 -179716
21086 -179716 -67589 -115978 -151398 -131603 -67677 -95769 -139376 -201440 -328945 -249539 -209589
21075 -209589 -157610 -142441 -192070 -106887 -89060 14155 37352 -34268 -67522 -23178 -7446
21064 -7446 -53088 -75253 -52265 28930 144123 109593 182567 199928 77361 48170 -119265
21053 -119265 -211427 -157277 -101925 -137516 -300805 -381366 -376272 -252791 -139552 76556 54026
21042 54026 -82860 -158109 -168855 -220804 -249465 -220209 -225247 -281456 -282969 -114531 -26680 -14512
21030 -14512 3202 -70126 -106419 -73465 17252 12405 95595 71293 6825 -59545 -38337 36212
21018 36212 44531 -74971 15678 17293 3780 91032 79523 92385 39123 70231 9415 -136757
21006 -136757 -212275 -217046 -220605 -269061 -217013 -50549 11958 -61653 -82436 28201 101827
20995 101827 30463 60391 156210 130102 -22755 -152397 -159631 -138258 -203270 -150046 -25960
20984 -25960 142134 89998 46016 99731 46495 -43243 -178275 -203111 -115833 55286 -26002
20973 -26002 -102943 -51441 31350 151149 165913 233265 138484 -42891 -16094 -31348 13695
20962 13695 -51447 23596 21195 51269 118129 132605 173455 188766 141037 29367 26041 -85184
20950 -85184 -143011 -134782 -142874 -155166 -113764 -35889 -113409 -85961 -109999 -43507 -270462 -279228
20938 -279228 -187612 -74991 40038 116402 118480 62880 12786 30523 64492 71514 -29069
20927 -29069 59772 16281 -80582 1264 148938 131689 24133 -37957 -185166 -92947 7576
20916 7576 54159 58552 -10856 -185140 -106717 -122923 -54585 -60194 -6878 32662 -17307 -8017
20904 -8017 -162520 -112110 -61843 -98318 90668 33259 -272951 -355343 -232561 -122200 -63914
20893 -63914 -47730 -186210 -240660 -249356 -243975 -194084 -39905 -45959 -144685 -72020 -16578 -5230
20881 -5230 45118 -72043 -66569 314 21085 -27439 -37435 -1731 -34345 -27915 -75093 -205730
20869 -205730 -169585 -83985 -36799 26299 65138 42310 54321 43622 2022 20212 70291
20858 70291 104560 117445 169893 118250 66664 55078 44759 -70803 -59335 -34927 -130707
20847 -130707 -83797 -122596 -241596 -136075 -99505 -84420 -35792 -19189 -40745 -107661 -117538
20836 -117538 -77889 -49086 71943 110064 137022 183028 213338 119117 4601 -67930 -141780
20825 -141780 -150275 -77896 -103359 -21415 90865 169120 43802 -129918 -102683 -26673 50441
20814 50441 6203 -123188 -40109 -38263 -116979 -88386 64876 60146 -1389 -33066 -15157 493
20802 493 -33385 -77021 -44947 -85469 -67253 -90540 -205874 -146109 -88874 -186061 -179371 9276
20790 9276 83640 128880 -4212 -117062 -111989 -185819 -316437 -395221 -239022 -38890 57588
20779 57588 -38313 -131450 -68155 180168 262959 143342 146138 44595 -127102 -68437 107679
20768 107679 110683 141933 129815 -38385 3317 101969 118213 202189 180458 21990 -76163
20757 -76163 -93314 -40572 101202 125960 193097 282243 316083 331718 355405 362387 472608
20746 472608 357108 297128 347151 330278 364465 354551 424085 632381 664378 431750 244719
20735 244719 249823 288580 344459 391844 451304 370346 247286 253697 194442 119919 152153 189922
20723 189922 107925 68961 92323 75507 157285 211813 274217 474218 576023 540484 437479
20712 437479 283014 217290 285576 377840 362527 415536 492615 426212 399803 458455 530478
20701 530478 436621 287303 259437 228558 213428 67754 -34687 -7259 -914 -54649 -92744
20690 -92744 -71427 -100706 -138543 -217921 -159056 -102733 -186734 -65508 38164 5095 14870
20679 14870 114529 119564 148804 151051 187538 141670 48947 -29314 20640 -37253 -22615 94254
20667 94254 62549 -92277 -107115 63971 106642 104567 -21908 -95908 -46547 64745 120431
20656 120431 79872 -23470 -84183 -71184 -18540 -44026 4598 14819 39644 -2430 -254476
20645 -254476 -232660 -114748 -19507 76346 -114390 -199832 -259466 -305323 -262497 -250837 -213849
20634 -213849 -136794 -84358 1430 34398 40129 55538 121003 88364 -42351 -11652 28423
20623 28423 69158 91190 38395 48326 44090 103861 136185 -25674 -173691 -123155 -72962 -123123
20611 -123123 -89913 -56071 50596 18969 -4083 -44950 22666 69278 77239 41604 47686 38359
20599 38359 -93031 -172281 -185932 -111334 -46079 -25630 -124236 -116590 17002 61691 8420
20588 8420 -7310 -66666 83412 143693 47933 180578 242954 244263 238718 119600 53761 8924
20576 8924 4057 -74285 -13869 30488 73924 -33949 -141834 -213532 -87187 8680 -74301
20565 -74301 -124224 -164879 -212092 -130206 22639 31938 11071 -35288 -3458 -100889 32477
20554 32477 98928 -81988 -199739 -263722 -271267 -175857 -113307 -131791 -67823 23343 55374
20543 55374 140195 274394 287676 172276 165931 135230 187605 118425 -18415 -125160 -113516
20532 -113516 9941 149548 122209 21524 -16829 -52747 -8497 28429 71809 37222 27160
20521 27160 10901 42037 127105 174444 159238 -10074 -8163 -39942 -91856 -165409 -175592 -197849
20509 -197849 -148702 -117281 -145999 -189374 -14307 171252 56491 -57317 -76585 -39508 56212
20498 56212 111685 86737 -37566 -215432 -161616 -116270 -143280 -102301 -81558 7717 53605
20487 53605 -57227 -200093 -244165 -163227 -118357 -45285 178095 248625 155228 90889 -16351
20476 -16351 98592 175620 136832 120489 226861 244080 131202 84418 91338 -33346 4500
20465 4500 33515 120773 44071 62018 141281 197828 183138 154214 243027 223127 184070 164485
20453 164485 200509 138270 -68709 -151811 -30162 19616 -67993 -188821 -173521 -15454 130304
20442 130304 41178 13708 9540 21662 17277 -15932 28378 118260 108929 181582 196112 42294
20430 42294 -54240 -5344 -14831 -62432 -167 32601 -36421 -127702 -99949 -31092 -881 31812
20418 31812 24253 92527 101186 69164 146942 211978 126127 97820 92587 11185 -28165 -858
20406 -858 -3132 99705 157713 87995 72779 100548 54456 90752 71935 73818 85650 57801
20394 57801 -53125 -58985 -20351 -28153 -52861 76904 78759 56757 126983 137614 33781 17973
20382 17973 9325 25269 -25809 -18860 -44306 -128247 -170539 -160105 -102414 -200025 -313231 -284990
20370 -284990 -141523 -34973 114890 120906 130814 16475 -35169 -16714 84731 231259 281830
20359 281830 219128 133149 16681 -110251 -65867 48257 120351 20899 36552 89108 50148
20348 50148 -24618 -69262 -56322 -77177 -45789 60900 -97299 -164618 -41521 -4146 -150968
20337 -150968 -64825 82651 206175 213067 78685 -57974 36034 185732 141335 61722 62366
20326 62366 130096 162861 85538 84748 166084 97928 174332 268256 318033 240816 125192 114020
20314 114020 150125 133981 105702 112430 180607 295695 308454 308023 293226 259217 294466 198928
20302 198928 99268 100019 89405 102889 68399 174540 179431 233353 253196 132661 143192 36974
20290 36974 3784 45657 59164 -6014 16377 138761 175861 179386 195165 198820 263943 292594
20278 292594 128989 93129 156499 145880 31276 69660 224180 426260 428194 321350 391312
20267 391312 194412 104974 121033 179999 207119 264832 256769 265690 259911 316356 152812 146751
20255 146751 289789 274879 339605 465551 390851 326816 323802 359130 398525 376914 433418
20244 433418 623794 509421 491848 550876 628547 725979 606567 417971 417847 527787 748758
20233 748758 782334 753328 596966 623829 786014 802665 807561 993319 1178730 1348828 1410397
20222 1410397 1480517 1396433 1415520 1623069 1777263 1771713 1859756 2026206 2300386 2483658
20212 2483658 2600680 2705566 2833410 3085889 3442240 3669171 4027363 4353810 4584517
20203 4584517 4776246 4912268 5126207 5550201 6223172 7128028 8200048 9653555 11532009
20194 11532009 14002345 17473514 22943458 32079084 45684768 60150615 67188292 65905038
20186 65905038 61354771 58995097 63185739 73185837 80711500 81219890 79031338 80026173
20178 80026173 85674056 87595413 81949991 73071544 65818518 65246844 71568992 77016542
20170 77016542 73614960 63393940 50830702 39989786 32779529 28803936 27022752 26836192
20162 26836192 28513664 32909421 41180910 54238787 68194424 74407877 72314242 66769938
20154 66769938 63254030 66536416 76449096 85382189 87481393 86691570 88162620 92179392
20146 92179392 90756466 82325426 71614384 63916385 63719840 70228687 75235332 71117122
20138 71117122 60026431 46440679 34420173 25962181 20380613 16603572 13978895 12085808
20130 12085808 10643541 9419671 8388715 7536133 6816602 6380964 6051237 5807185 5533538
20121 5533538 5315756 5018307 4568562 4182379 3861056 3639445 3494673 3492441 3310839 2965214
20111 2965214 2775204 2701795 2486948 2234164 2068635 1896350 1836545 1858288 1844916 1680893
20101 1680893 1652959 1467187 1348735 1237338 1021360 967280 968453 912935 803088 613970
20091 613970 554899 584961 562078 540725 582986 604263 716764 729710 645543 579162 545373
20080 545373 438086 487547 590578 622356 478285 369625 372813 396365 460092 508234 462059
20069 462059 320722 336311 252180 128521 57961 54296 82156 296066 449623 469577 470516
20058 470516 401091 309117 265242 137108 166937 156183 146661 140962 206863 180245 205118 364195
20046 364195 461574 390108 341722 296890 301343 256098 265946 185998 183169 167058 238726 412866
20034 412866 304553 291498 399731 358712 278428 172717 138975 98641 36121 90928 219953
20023 219953 146792 86922 101764 128044 140722 85293 75583 108029 233393 102285 -17722
20012 -17722 -10942 -2931 1350 17526 139926 219732 212029 192691 184795 44964 189650 263824
20000 263824 275975 264421 235327 172010 119839 120431 123505 217298 265461 236913 117580 48113
19988 48113 55632 103484 175715 213705 139080 182205 43924 2584 39013 7861 68058 24968
19976 24968 -133665 -60952 129811 162943 117653 143680 51212 26137 95025 288524 407170
19965 407170 225285 171654 161983 155880 88399 94177 107593 136608 162279 158639 246033 293319
19953 293319 251147 218178 58381 81637 250417 285621 230889 181379 78643 97357 35834
19942 35834 39177 37882 -6418 77274 114646 109895 153186 110364 161286 134124 107435 139350
19930 139350 125007 73454 99977 86227 68190 148124 73812 11825 5434 86484 174291 193832
19918 193832 292390 310483 252757 117758 51567 94553 79806 104957 188964 149073 79431
19907 79431 57719 114678 125814 198321 248572 173330 90944 20091 -8000 -129117 -211948
19896 -211948 -249307 -238289 -142932 -15395 87160 -38584 -178330 -92174 46487 -47169
19886 -47169 -259954 -280955 -146009 -16129 64359 -50458 -93094 37880 143775 197544
19876 197544 155535 83679 12853 -38190 -135039 -159662 -59478 81548 91878 -4939 -35703
19865 -35703 -46772 -128273 -47312 86314 109498 126065 135059 121994 98602 122853 85140 41513
19853 41513 53297 93573 102153 21480 -26864 11134 52638 -24848 -33986 23976 82654 63591
19841 63591 118507 194002 230216 116672 2020 42874 76779 38754 -13098 -92450 -182507
19830 -182507 -167092 -76934 -27166 49891 81069 85121 -23955 -26268 -94128 -184651 -162770 -147085
19818 -147085 -140811 70940 181193 76014 4664 -6408 -30136 4425 22012 59402 94924
19807 94924 41556 54885 -24475 54992 142610 97377 49295 30591 -28537 -105133 -181034 -149091
19795 -149091 -119848 -66319 -38581 -1741 129879 159133 178531 185689 200194 68390 -130088
19784 -130088 -200307 -119243 80300 169510 200402 190386 161959 66840 90836 63167 73587
19773 73587 18160 95968 194616 208863 256348 371099 357785 338327 329115 298391 197422
19762 197422 156824 81168 -203967 -356008 -178751 -76814 -60017 -92916 -49970 -26779 48785
19751 48785 16259 79021 154119 141175 94125 9968 44741 -111592 -249997 -233532 -218923
19740 -218923 -91932 -25306 -13440 75257 149877 98641 -18036 40500 -23041 -149309 -164481
19729 -164481 -82712 -39899 -25183 -69674 -25044 46633 59033 -53802 36987 213227 187708
19718 187708 148648 138477 184761 142424 65868 36572 165968 180948 92723 -73382 25184
19707 25184 48674 30294 46196 62410 22223 61258 93112 100118 24008 -65205 66684 192756
19695 192756 214909 164157 100522 88733 124341 56161 -49066 -1182 174 6517 -71434 -184057
19683 -184057 -25377 -49691 56690 158096 89329 -25577 -124726 -155470 -46204 -42123 23015
19672 23015 99395 163880 190433 234183 257431 82191 -95965 -194019 -141949 -31605 -48832
19661 -48832 -171949 -226041 -121251 43780 32593 -24295 -58985 14193 75507 -2320 851
19650 851 -7188 52927 75885 28170 -25942 22943 72258 -41355 -33852 2531 -50024 -50234 101256
19637 101256 192288 120348 126355 -43417 -45607 -67764 -77244 -88475 -19373 -13454 -62916 4990
19625 4990 -26941 11745 -80683 -105262 3581 211374 322855 404849 517035 481109 387257
19614 387257 366616 449203 460387 390201 325199 403860 436802 419328 447732 514486 618430
19603 618430 573149 454197 296083 224171 118284 183646 215738 174699 159921 163644 228076
19592 228076 345317 271258 238403 425266 492962 532940 451281 375193 391269 367205 393770
19581 393770 535084 610113 592671 590366 565293 502304 318948 206814 270850 324356 458231
19570 458231 566165 479622 436208 325901 183523 113227 77075 36622 50965 -34140 -100385
19559 -100385 -86862 -41676 1632 75408 63044 -39861 -54659 56533 2802 6009 -16499
19548 -16499 -64832 -96640 -70402 -4624 44154 51998 122216 252189 267316 144528 920
19537 920 -130674 -65252 16293 25599 51848 10029 114485 151246 62887 104597 112946 -40350
19525 -40350 -12573 66493 48379 -125329 -177111 -134786 -166169 -132132 -141235 -219266 -256824 -143753
19513 -143753 17976 100012 100142 29045 14967 1587 -25574 21312 70751 111821 -100995
19502 -100995 -168631 -96870 -93588 -77727 -69197 -86752 -35955 -7982 -113239 -145240 -91077 -156434
19490 -156434 -138780 7822 52607 13957 -22879 -67483 -130804 -27776 -14536 56603 111796
19479 111796 110921 88425 185928 231697 173029 78906 22975 85790 210775 219098 230913 126549
19467 126549 76388 190178 141526 55606 58719 77766 26977 -46179 -19255 -54690 -118702
19456 -118702 -122378 -181656 -127426 -24414 19806 -794 56769 93037 140904 78448 -11740
19445 -11740 -32063 -21577 -222 103844 69747 35553 57244 113213 96442 43837 36096 81135
19433 81135 55421 -104125 -39369 -73552 -74560 -37401 99537 107609 113708 64565 34927 33452
19421 33452 -105356 -40115 -102896 -146777 -8954 140629 101516 70360 128503 94292 47366
19410 47366 -13713 23579 48077 40523 143103 173961 94044 127105 86771 -21702 -9136
19399 -9136 -59749 -128005 -61461 106209 64168 -11599 -69571 -123634 -27511 29072 891 -70605
19387 -70605 3808 -4038 38484 59037 -34177 -17409 -3602 -72753 -101491 -68115 -2552 -46823
19375 -46823 -91795 -8597 172861 210307 207784 230663 230733 8834 -125862 -89416 76064 168958
19363 168958 255809 301182 342434 401895 439889 442827 316950 278560 264920 274007 199954 112972
19351 112972 57679 88486 227263 310007 286101 189266 173419 244295 200675 27044 -56036
19340 -56036 -73790 -33719 -1543 64066 89029 25534 -36349 -110058 -163052 -140059 -77532 -55726
19328 -55726 -60715 -178490 -221813 -43724 98069 160373 177738 142315 77291 17192 -41819
19317 -41819 32700 157729 204603 237933 304016 391314 415027 502940 559446 585284 598668
19306 598668 565168 476935 260525 185577 120031 135261 191877 240365 219565 263026 270815
19295 270815 367831 370836 109832 -16831 2066 -73130 -87643 8876 171523 324981 251811
19284 251811 200274 164930 162970 149751 151907 94269 74646 128525 146575 160901 175671 -75781
19272 -75781 -265609 -221654 -125457 -84755 -67089 -92495 -93877 -42739 156294 202417 176558
19261 176558 200343 365714 470380 264273 179771 249557 147629 120731 184622 98260 119171
19250 119171 125433 226106 330989 343451 177173 243510 282295 250800 142395 109264 13926
19239 13926 65132 -43358 4334 -786 -63417 131537 148036 138393 189838 285612 270424 335898
19227 335898 334012 435540 561033 674041 654273 584117 460556 462169 347544 317052 340498
19216 340498 176188 45575 113243 227473 274307 147252 34894 76966 -8976 1129
19206 1129 58108 38234 -39409 -63149 -80285 -192327 -274609 -384136 -369055 -260774 -97154
19195 -97154 101732 178029 199669 140979 191848 274882 193248 151956 172944 134402 145258
19184 145258 231437 242736 240989 386371 511049 492288 370533 328293 428419 659281 791815
19173 791815 851970 842479 683920 650600 483315 442506 546834 641378 567890 338292 250303
19162 250303 289591 300064 244107 234702 97189 -21100 4201 -11565 -6156 34338 -8966
19151 -8966 22363 78647 -23293 -75526 5369 -2282 -91355 -103636 28545 22993 -147937 -204487
19139 -204487 -124096 -12416 -6148 -89905 -339 96835 71525 147740 163672 102504 41840
19128 41840 -21544 -21857 -110061 -85023 5727 606 -89453 -53438 -58963 -55919 12692 -60009 -155338
19115 -155338 -238010 -259742 -237427 26038 -23312 -105 58714 91522 121506 168451 184646
19104 184646 94089 80716 10556 13100 -101646 -162197 -31339 -70139 -70098 -45446 53169 -74471
19092 -74471 -192222 -171011 -172419 -128419 -164722 -178984 -174736 -149572 -158719 -120592 -98585 -142115
19080 -142115 -166943 -273101 -299198 -217674 -218206 -176696 -20983 46397 76115 -13749 -75832
19069 -75832 -57965 85984 156466 84188 -36387 31707 49250 46644 35699 153917 287122
19058 287122 232272 209211 242432 182641 93742 110806 -23601 11650 109261 60040 -53525
19047 -53525 -93916 -20520 35575 74522 114991 119260 62945 20948 191060 237320 260121 153267
19035 153267 120853 128491 94986 73165 121278 30048 12843 -80212 -52503 -67681 -47956 -156756
19023 -156756 -260696 -259141 -244121 -78335 -9930 38674 106237 22941 -58655 -41006 51004
19012 51004 24770 9678 174957 185076 203507 202580 91575 48222 25954 -16304 91632
19001 91632 122583 206083 216812 162893 173597 213163 271812 301367 202817 127906 80964 112893
18989 112893 163447 179247 124059 93851 -51074 -20490 22184 -130430 -154574 -69549 55506
18978 55506 42628 62944 150600 127027 161581 133051 205542 296043 357516 436546 401931 292568
18966 292568 202321 168198 121666 267559 363763 270902 160813 251193 309427 388774 323707
18955 323707 277237 293636 338585 378445 343312 281970 343358 354372 332816 98422 -59884
18944 -59884 -12040 106423 38448 -28466 -9806 113153 217943 238922 256336 343652 313502
18933 313502 280841 230000 290661 289515 288596 216317 150871 132661 188216 270928 384649 401433
18921 401433 432148 436078 442116 408267 319991 385074 515510 534035 593681 897253 1155496
18910 1155496 1348425 1558847 1480511 1223986 882946 653171 623640 496171 359821 379671
18900 379671 409653 416373 275109 258550 320654 339622 336144 492127 532610 582029 620021
18889 620021 690667 872283 1183456 1605551 1956807 1977190 1805201 1363989 1017880 924197
18879 924197 991865 772957 731675 851734 974746 1103985 1309453 1338820 1342586 1350736 1309360
18868 1309360 1180188 1218297 1255756 1229260 1270129 1494149 1773631 2011641 2315152 2743853
18858 2743853 3050693 3617574 4489536 6009025 8584548 12967640 20959231 32914971
18850 32914971 40153853 38052150 31458284 23137178 16902817 13655433 12616447 13374076
18842 13374076 16153086 22119571 32291142 40731032 39467975 32756546 24033610 16787402
18834 16787402 12288140 9517674 7774232 6795723 6234528 5954595 5763924 5405820 5111425
18825 5111425 4704095 4441684 4483211 4607404 4583799 4572542 4603868 4736313 4925458 5080206
18815 5080206 5262161 5569087 6181464 7047924 8259548 9852819 12097793 15539512 21666922
18806 21666922 32274284 45070456 51332908 53277222 57373092 70337906 90849406
18799 90849406 98716109 90555580 76034035 62779191 58753118 62206368 63007527 61261703
18791 61261703 62017753 70976494 89787408 99922169 90895507 73042196 52774841 37318646
18783 37318646 27713673 21960696 18508965 16322815 14832188 13607288 12464732 11367413
18775 11367413 10387141 9515187 8763353 8331509 7961759 7837548 7788301 8044146 8711114
18766 8711114 9683126 10719153 11775405 12470876 13009217 13848691 15680622 19275347 25208160
18757 25208160 35181936 52828743 81548888 106831941 107586687 92710873 71493702
18750 71493702 53338024 43124099 39053463 39632303 45455664 59932999 86104489 110530680
18742 110530680 110911400 94641594 71105630 49479934 35335828 26694525 21308175
18735 21308175 18181625 16227701 14791778 13494969 12270080 11246485 10536873 10202233
18727 10202233 10136646 10180216 10540386 11265864 12200343 13333782 14768127 16798352 19919623
18718 19919623 24718288 32871179 47164729 70991758 97190310 106690640 101790261 92491464
18710 92491464 88345569 99219880 125211889 149713352 167075123 177941903 166231836
18703 166231836 141155889 115750677 98788830 98677436 114542515 126820053 118084825
18696 118084825 96907541 71599646 50505059 36897971 28653901 23448334 19895648
18689 19895648 17301834 15360804 13822829 12530729 11345448 10313359 9600352 9042865
18681 9042865 8506540 7937277 7417088 7110425 6834777 6653813 6563244 6609117 6730726 6995433
18671 6995433 7531424 8092881 9019211 10605033 13150065 17527722 25535421 38354706
18663 38354706 49950669 51969645 48092364 42555934 40814470 46841192 58593495 66199845
18655 66199845 69289979 68004168 58900510 47818715 38313986 32910374 33692611 38930884
18647 38930884 40887443 36428605 29020311 21133266 15370679 11782519 9602055 8468542
18639 8468542 7770531 7326987 6903009 6450703 5822540 5205893 4707465 4507788 4555123 4641164
18629 4641164 4582765 4204124 3730876 3283651 3237746 3421015 3528539 3559982 3325498 2866036
18619 2866036 2361258 2088403 1953292 1835362 1862397 1818635 1858747 1843833 1687905 1653861
18609 1653861 1918848 2280515 2714531 2917353 2768507 2455533 2158667 2062800 2225924 2554661
18599 2554661 2748038 2740913 2378884 1953035 1494218 1165723 1014989 898794 854887 852494
18589 852494 796183 682009 640156 661600 673702 667480 663469 678447 589108 552490 515627 389397
18577 389397 449961 487696 560413 577954 537393 556207 516104 430943 482604 475817 471488 455920
18565 455920 368208 406204 612122 667445 599534 530873 458721 442009 422790 508282 694062
18554 694062 732195 679750 644487 593059 544214 481374 337254 280118 248575 289303 251790
18543 251790 270961 387549 596296 557843 514915 527085 569487 497928 392117 464575 567237
18532 567237 612378 675056 825670 934892 810794 749604 851739 845025 843257 802722 647272
18521 647272 629014 657677 681328 649816 632979 596748 453933 500925 533764 560090 547921
18510 547921 452955 318567 258953 289173 307842 361542 557433 520787 484439 564284 566052
18499 566052 738267 756611 668488 667711 635721 774725 805970 695991 815746 727110 790530
18488 790530 841700 796064 890929 999316 896939 779982 713844 817757 796363 773706 843379
18477 843379 820558 900951 1074530 1050385 886266 813277 787989 584523 527737 523615 642742
18466 642742 683521 712730 682098 733053 749496 679499 584955 599443 612436 734367 839120
18455 839120 885142 825737 767926 637987 684154 676497 599329 602307 755616 884007 955721
18444 955721 887402 968860 883542 808244 904373 1081086 1069103 999936 1050156 961877 889392
18433 889392 869683 760677 753506 900073 929086 843847 804368 868837 1037402 1116274 1338299
18422 1338299 1762167 2215488 2386793 2251995 1978047 1640190 1530596 1487134 1518412 1571735
18412 1571735 1630994 1629494 1610206 1695513 1705795 1834043 1997436 2244483 2417966 2718812
18402 2718812 3304900 4078043 4976102 5742753 6627441 7706252 8703691 9339320 9821391
18393 9821391 10570233 11877259 14055879 17210484 21820636 29461780 42598597 67000137
18385 67000137 112266916 179822311 234257514 236819225 198105317 143773292 95452118
18378 95452118 63893079 46104399 36211241 30534954 26880833 24277907 22178251 20559200
18370 20559200 19714177 19628909 20611588 22834616 26127073 30487739 36997128 47687408
18362 47687408 67115373 104504879 170549858 251452098 292564631 270620127 212376401
18355 212376401 146450658 95194783 64133834 46651804 36350902 29791760 25340647
18348 25340647 22074446 19626913 17628577 16065499 14950104 14072992 13308040 12491526
18340 12491526 11623857 10599468 9692328 8845856 8067109 7217222 6378954 5683993 5098879
18331 5098879 4701097 4398417 4088508 3840952 3687876 3487978 3279293 3041798 3125570 3358691
18321 3358691 3723847 3844047 3663389 3288068 2880224 2672241 2657059 2722247 3017456 3365933
18311 3365933 3456813 3282825 2947961 2571796 2255409 2015491 2277954 2697574 2859690 2554357
18301 2554357 2181422 1766388 1451786 1272163 1174411 1141462 1064419 1015441 899918 842611
18291 842611 746352 754125 819541 796314 758089 741364 842980 945840 872716 826783 913961
18280 913961 1128096 1306661 1442439 1496894 1438978 1385568 1275921 1176342 975054 1036197
18270 1036197 844544 969520 1179841 1220019 1203234 1084261 1017586 836369 692783 730764
18260 730764 770757 739079 795834 863618 833158 832701 671766 645514 698017 789059 850279 777205
18248 777205 744587 762915 748309 798530 854271 682488 576468 593228 567407 481050 474137
18237 474137 499986 462383 537249 606289 689732 801315 765303 895427 1001682 1019197 938742
18226 938742 877609 743758 704446 545585 557205 707737 749932 759552 833214 1085721 1251535
18215 1251535 1107286 1052189 975595 818536 711916 610820 538377 506429 418866 453372
18205 453372 492648 489687 470960 456769 626742 734914 834612 853249 904906 1036258 1125331
18194 1125331 1276074 1411183 1351627 1248641 1041537 920007 1041446 1007604 959698 835048
18184 835048 762073 793844 718927 713548 646114 630127 711040 806212 882763 880319 982250 1144063
18172 1144063 1189739 1035352 997151 1091464 1157937 1177758 1259259 1236079 1037432 1071132 1144230
18161 1144230 1228159 1278758 1467000 1737855 2050360 2543026 2870620 3092372 3123629 2819776
18151 2819776 2846787 2897928 2796011 2783249 2964198 3228171 3509805 3940216 4618730 5409003
18141 5409003 6314374 7087661 7842098 8819683 9667380 10328889 11244017 12316500 13756613
18132 13756613 16168381 19800372 25641102 34821893 50268387 78434942 128681834 188427622
18124 188427622 223991336 248870574 242602782 199360774 150667809 104871458 72361593
18117 72361593 54056535 44222783 38986295 36552750 36224835 37484281 40920500 47523368
18109 47523368 59726848 84092929 134262975 220219610 276673212 263244403 228989357
18102 228989357 197732433 201394113 219146980 229141875 234785597 207596931 163676350
18095 163676350 120052636 82985486 58925297 44807948 35882976 29886123 25653249
18088 25653249 22321035 19771164 17800595 16104175 14821482 13961074 13246737 12239978
18080 12239978 11130645 10001748 8906111 8020270 7218283 6704075 6371538 5914059 5666142
18071 5666142 5568590 5548438 5539259 5601309 5609675 5115856 4446942 3918162 3473135 3172869 3022895
18060 3022895 2835601 2641218 2516180 2419144 2237051 2131251 2156749 2099645 1969936 1951326
18050 1951326 1861243 1705481 1847678 1964051 1882608 1946583 1907859 1809597 1838685 1914579 1863282
18039 1863282 1879411 2089750 2264743 2383496 2367304 2411112 2422343 2323617 2363073 2511727
18029 2511727 2630488 2641292 2941396 3183470 3507270 3673682 3976124 4637797 5340393 6188694
18019 6188694 7498411 9421699 12466472 17624441 26379707 41233717 60661924 72711662
18011 72711662 70431536 59765584 47228646 38291957 35386313 38825379 49383035 64562516
18003 64562516 73313688 69175186 56920453 42278477 30146260 22265969 17511686 14568925
17995 14568925 12637733 11418659 10750817 10412922 10430482 10782846 11263066 12181000 13794171
17986 13794171 16493372 21370193 29834932 44171073 62489247 73600955 71211762 60870988
17978 60870988 48712943 40260721 37486105 40602111 50629411 66522267 78664120
17971 78664120 79547077 73929481 70009476 74264742 82544428 81973126 71814130 57952425
17963 57952425 45398014 38195492 37224899 42698545 54859334 67480558 69816390 61595564
17955 61595564 48364801 35328538 25945379 20230464 16628959 14010201 12284953 11176266
17947 11176266 10441866 10109388 10048188 10201804 10725154 11820807 13778074 17030503 22821731
17938 22821731 33598867 50608553 65140264 66615378 57960862 45728884 35436718
17931 35436718 30361699 30756682 37171832 50049914 62942562 64928402 56449468 43293452
17923 43293452 30532102 21583753 16075421 12733843 10581271 9061477 7802336 6897503
17915 6897503 6232389 5886435 5625193 5401937 4971159 4490413 4027336 3650603 3472065
17906 3472065 3465476 3567824 3939664 4322423 4216615 3908024 3464418 3142908 2975034 2747573
17896 2747573 2504274 2109419 1791813 1659581 1495664 1377499 1271958 1215794 1124127 1205914
17886 1205914 1254311 1382117 1370765 1594877 2107481 2631129 3059184 3078781 2816361 2446510
17876 2446510 2070381 1803246 1804972 1922706 2251509 2749723 2775964 2347431 1856667 1577808
17866 1577808 1420078 1265381 1079952 901313 837149 868545 840371 828457 919301 1057581
17856 1057581 1060413 1055358 1206291 1325834 1494351 1864619 2225541 2847712 3438983 3532521
17846 3532521 3110533 2493014 1836969 1436874 1226938 1024112 857804 855403 803100 773103
17836 773103 754361 644053 637565 667654 602203 616843 624886 648877 644711 854751 1084226
17825 1084226 1374945 1670810 1663822 1385825 978283 708484 594312 463786 357433 267713
17815 267713 215660 311515 217398 202051 194165 150357 119743 213103 123145 132471 157540 172520
17803 172520 147391 151134 233478 194578 161247 305578 336820 304935 342260 284383 239310
17792 239310 328503 347831 216442 312807 252600 231823 336127 329776 350045 299072 126728
17781 126728 243497 186789 110098 90006 111685 171380 167265 127896 59804 208853 360125
17770 360125 296146 306967 232546 180351 172987 239276 237833 161159 104102 326408 427982
17759 427982 306062 201008 162125 143352 159025 98239 144732 175314 187284 102191 116593
17748 116593 263514 392630 342582 251806 175098 54839 -829 17336 65120 124257 234361
17737 234361 322205 244308 129360 99088 115121 212918 426257 441508 314349 177865 148830
17726 148830 231492 289027 347576 205766 226030 294427 242001 192647 191851 221738 194360 170841
17714 170841 228180 248742 179278 208306 286320 266927 138555 45084 167559 241606 223899
17703 223899 107818 25089 9468 24569 51316 180135 158901 150828 76957 111790 192348
17692 192348 147767 20993 47081 -5789 -17020 32684 6621 62644 128501 164527 100875
17681 100875 55171 151785 -8682 123 108782 74632 91058 165147 297793 456617 523444
17670 523444 318788 161950 134245 233675 270790 220345 255301 197137 122808 115448 236829
17659 236829 270291 321511 284565 118447 109645 50702 41299 150176 211549 213864 130621 27903
17647 27903 20102 133214 209745 239207 330916 252848 110858 57901 113624 133509 144735
17636 144735 131153 41459 -22872 112057 155364 126141 103480 161297 181405 75783 182255
17625 182255 256894 282189 228723 204094 135562 173529 119883 35745 16841 -92931 -24783
17614 -24783 48945 147012 109797 141046 34705 -107913 -84144 42228 124265 48561 -19151
17603 -19151 16481 136273 156146 150267 160903 186633 269612 216089 290704 290073 308769 272020
17591 272020 259282 284133 288134 284753 122623 160305 347683 483777 571135 833921 1098472
17580 1098472 1292117 1450547 1327318 1061153 840224 575874 470579 569205 642073 580346
17570 580346 384497 284535 192420 177075 72901 -12227 8968 147793 316985 376110 453373
17559 453373 438346 542137 751816 1012187 1144931 1129233 1162725 1074222 871793 561560
17549 561560 439468 352723 357956 387746 303251 120258 71336 166224 197055 238208 349956
17538 349956 273546 207152 264911 348024 244212 70880 -23587 66404 38296 53085 -47146
17527 -47146 -66601 64093 162554 53189 -18803 73443 75297 -6932 -103044 -186868 -57581
17516 -57581 57739 44233 20049 -12160 -56058 2784 173017 252690 98466 155222 154848
17505 154848 70280 -29101 19280 111257 174515 148314 151445 260458 222520 34123 -21520
17494 -21520 -24349 -123245 -100226 -8921 182024 253495 390550 496165 618944 401052 283606
17483 283606 233658 286914 395598 528842 616402 456548 219509 -19483 87620 249951
17473 249951 206297 270089 254633 227302 82938 26852 86624 190932 127648 90580 81760
17462 81760 82203 113207 195863 154935 171844 267417 407340 351786 177779 178037 304810 260100
17450 260100 354923 444169 553308 683902 563941 388336 366297 384979 484371 799465
17440 799465 1140858 1450150 1377412 1112821 896014 736660 679359 500087 377076 483947
17430 483947 523919 423002 374147 283703 196110 215168 43153 -9131 161893 192299 118973
17419 118973 255824 315191 168440 199296 172632 105107 109357 237798 403529 441094 320404
17408 320404 309604 267806 214445 97404 128487 145430 298177 414903 410960 328627 325399
17397 325399 210238 273888 250054 81045 114537 76311 25693 45190 143248 129255 61869
17386 61869 54110 51749 265568 274631 183192 175426 155004 33108 -45669 46781 57840 39156
17374 39156 53694 59003 -52501 53453 -82885 -135366 -66687 23215 45563 67278 53847
17363 53847 -34338 -105306 -62029 -4678 39509 157280 177631 49310 -70364 -114298 -206339
17352 -206339 -162102 -131592 -103064 -153981 -63322 96027 39071 -83462 -148149 27933 13961
17341 13961 -17415 29024 59022 40536 1875 -35713 119859 98599 84275 99693 26392
17330 26392 -30606 -90592 -46429 -27472 67626 74078 7674 -42833 32128 129391 206352 193166
17318 193166 79729 78636 71641 -65491 -148924 -171561 -154192 -69844 86679 31493 -150015
17307 -150015 -134463 -124242 -65402 -45044 15105 143024 128380 97078 50687 -30012 8277
17296 8277 65154 107954 35441 -65906 -33897 -164814 -134109 98405 25167 -46452 160510
17285 160510 248823 219479 115335 131933 164014 169809 63258 113585 70622 1292 -11774
17274 -11774 -40277 66957 31799 -36661 -72747 -86332 -83358 -83871 59520 26461 -55697 42620
17262 42620 45231 -110860 -255985 -221814 -102741 -31755 -21184 -72211 -89855 -82603 -104559
17251 -104559 -138013 -27011 115725 146979 132868 145904 170992 131827 76874 64424 98269
17240 98269 160671 103926 -107795 -152794 -77214 -4840 41920 -23229 -303 85380 107323
17229 107323 154890 -14220 -8785 44473 -48828 -92379 -50049 20493 50296 29407 84354
17218 84354 107564 85775 107176 82426 106491 114062 140743 94013 81717 104063 68576 84827
17206 84827 87206 -5822 62221 211678 220088 143964 151715 152783 99380 21337 98272 114563
17194 114563 156675 146889 185054 152723 33689 -114760 -206448 -140502 -109119 -173639 -85142
17183 -85142 7938 -24756 -71747 -73761 -111547 -118586 -140946 -111253 -26884 130078 138238 -33857
17171 -33857 -48611 -58390 -33210 -12887 121462 155090 144316 93460 -70125 -40172 -19427
17160 -19427 89244 64111 62593 150109 159509 119230 -1731 34277 293062 262519 86078
17149 86078 23267 -50633 71672 45092 95004 118193 76302 108501 80697 126299 73722
17138 73722 106777 60142 319 49283 73036 -47952 -131428 -141191 -154752 -48468 -15407
17127 -15407 13349 104094 288099 289520 169838 96380 36426 17525 65598 22821 54654
17116 54654 25459 -123067 -186658 -132697 -114210 -84112 18762 2304 -46300 -63275 -44437
17105 -44437 -175075 -258537 -231286 -230194 -285295 -278090 -189902 -73847 -3422 90605 138499 233092
17093 233092 110267 36946 58021 82994 114011 84642 -175482 -294262 -106297 -56947 11387
17082 11387 32291 -7761 -18338 12367 174570 225726 101250 91995 109318 109877 122339 97049
17070 97049 172344 231137 165601 73620 38558 -59227 -133260 -109100 -41655 138673 196220
17059 196220 117985 60267 119408 160135 37933 64878 144157 153375 145507 -17286 -143281
17048 -143281 -153548 -92720 -32577 -30147 71573 170579 115978 133971 97425 104639 118239 213527
17036 213527 211357 144304 -56202 -131475 -26514 -68019 10626 7535 -15416 -75939 -145780
17025 -145780 -136379 -81737 -26604 -49050 -14875 -36342 -20292 21770 -3666 -31744 -82027 -52145
17013 -52145 -63534 -62028 -1234 51402 164738 162126 153110 165347 53788 60478 96654 58716
17001 58716 25409 60376 70905 94015 31055 88526 143404 36594 -11213 -24325 -123334
16990 -123334 -61717 38424 13165 79235 18443 78692 166670 124696 -68516 -106869 -71810
16979 -71810 -105225 -34904 73902 61236 78 -16440 -18242 30914 17782 -33988 60698 92045
16967 92045 23311 -23512 -33192 16413 122921 92703 -24687 -32203 -19645 -102574 -9038 78506
16955 78506 63432 91924 -45211 -65335 56365 29179 -100562 -151187 -114404 -66293 -2557
16944 -2557 7225 -14758 52736 47996 -54127 -160325 -15805 24219 71859 72322 35237 27723
16932 27723 77698 228066 282039 293854 99726 -20967 24592 -11320 50455 69608 78338
16921 78338 -16480 -103909 3550 144338 106942 3882 -17675 -27049 -113916 -159243 -78681
16910 -78681 6636 -24610 -59623 -35101 14328 -86516 -115874 -209980 -103575 -68058 -149820
16899 -149820 -44304 -47280 -97986 -115655 -56691 -23999 -99806 15320 205 -23911 93970
16888 93970 165681 242596 276418 202852 71894 -12182 13135 90082 89593 8843 27416 69318
16876 69318 37429 -5744 -5463 -54726 -7594 66138 48877 12152 -12853 25232 458 10629
16864 10629 -24214 -33366 -68248 -46638 -11575 -24785 -103842 -90879 12909 78971 88351 127263
16852 127263 238109 294944 182267 186738 139143 59698 43316 17067 25484 20083 110130 159693
16840 159693 71707 -17504 7236 78578 3393 101702 136723 46100 -30145 -102023 -85106
16829 -85106 -8328 -6889 -37306 -8658 -61073 -88563 29265 80481 23984 59518 51614 -22713
16817 -22713 -141014 -124104 -86505 -155145 -115920 -125253 139 77089 139974 192080 206398
16806 206398 233004 196129 221171 141505 59944 24087 -21123 69305 130916 195853 110934
16795 110934 117127 100570 100848 127774 101094 90993 18373 -5115 108240 54505 -36739 -40925
16783 -40925 99 91813 72113 10827 22771 -63608 -140275 -87156 27833 -12830 -101969
16772 -101969 -70118 -70037 -98306 -3713 54836 94322 154328 165760 29459 -61946 -37887 -48449
16760 -48449 -19217 16638 97674 131177 32173 -63069 -44695 86473 131634 106100 41044
16749 41044 -128947 -152030 -142723 -51747 12365 88484 36458 -65702 -82275 -72414 -81028 -17067
16737 -17067 10317 -7980 -3399 -8180 16061 54464 23160 146245 137032 85804 49741 31417
16725 31417 -5310 -60819 -26312 84310 72134 103592 41752 59080 225874 253844 178769
16714 178769 87899 15477 9522 26476 -82959 12373 -29765 -72594 -124242 -254869 -214381
16703 -214381 -14615 57522 85518 -5451 5794 61810 65579 -63300 -154589 -137412 -38374
16692 -38374 7392 -49661 6319 41304 -38217 -36549 -6401 -94326 -101973 -209341 -144559 -160152
16680 -160152 -179129 -166488 -139568 -206112 -56693 57421 -56229 -13974 34046 68002 -6611
16669 -6611 -50811 -95244 88621 88758 27736 60134 129185 152724 71605 -23471 -10529 -20681
16657 -20681 -58226 -115498 -153176 -289161 -210256 -113850 -18 -6650 -32766 -14868 -43491
16646 -43491 -96903 -104305 25768 56696 -6485 -19796 57206 121233 -6198 -161993 -252115
16635 -252115 -178154 -192499 -157624 -41661 -9447 -25912 -102627 24219 114175 71917 68540
16624 68540 27281 88090 60820 -49681 10215 148192 101395 70800 -110149 -16957 39455
16613 39455 116197 242220 67148 3397 24796 48825 -8132 -80436 -93781 -44230 38846
16602 38846 189507 221320 168062 115532 91508 -13507 43271 -33885 48250 -9531 -67839
16591 -67839 -20943 -109664 -118744 -114934 -103491 14766 62304 -80922 -87537 -110350 -41525 -2888
16579 -2888 -56091 -122828 -221711 -270355 -82260 -26583 -89039 -90142 73896 -8925 -44931 4104
16567 4104 91326 115263 189106 231964 134556 -4828 161558 255874 108064 -51526 -84941
16556 -84941 -31462 -57854 4624 135188 85991 -43065 6717 142047 88119 -26779 -87708
16545 -87708 54758 90219 -33617 -21261 59570 83117 234135 252650 162289 55635 -96543
16534 -96543 -55758 -87238 47625 33948 -72142 -92862 10289 125434 308810 369723 443543
16523 443543 389454 322406 250404 69200 -56431 -101105 -54280 38342 188236 231646 219484
16512 219484 34290 18299 92558 51481 86227 58713 -76831 -187586 -228215 -124836 -151871
16501 -151871 -149401 -163498 -200262 -103831 37303 93911 130001 162244 241139 216955 202097
16490 202097 118714 19336 -33095 4604 32673 -11941 -61459 79029 49302 18949 -48025
16479 -48025 -194598 -123707 -61216 -191758 -72523 70288 152422 179813 193488 72738 49616
16468 49616 -10805 -121896 3846 16700 -16438 -41446 -73093 -105412 -29038 41305 11882
16457 11882 -28607 11968 -71111 -143305 -75195 -134601 -271219 -224718 -156231 -133508 15436
16446 15436 85197 19367 112419 11323 478 14177 49768 94823 7352 -73701 -5559
16435 -5559 8467 -49194 -90269 -65030 -81261 -204467 -138776 24244 156150 51390 -21265
16424 -21265 156319 264703 302763 295672 166214 85843 155534 276591 246416 59324 15196
16413 15196 52982 115628 99250 73920 88934 64345 -42067 2440 60259 8745 -26525
16402 -26525 -26960 -19900 -131435 -146681 -124840 -119053 -58018 -61148 -1064 148618 239370 237405
16390 237405 126617 1835 -71804 -140426 -134713 -142153 -31648 11112 12661 -54867 -33599
16379 -33599 -92346 8146 45620 -91945 -29488 69860 99265 205188 193974 71628 8521
16368 8521 51519 169554 278845 289401 162125 174237 146625 -32820 -100897 25724 -5318
16357 -5318 -124065 -49928 -68051 -80336 -85066 -132716 -136142 -10387 5579 -16544 42994 83113
16345 83113 36595 104150 89242 73667 39980 -28025 -62318 -59140 -43027 -32912 -83679 -34835
16333 -34835 -37375 -131714 -108606 -112623 -215560 32579 210694 192640 197845 240165 69608
16322 69608 -3337 -22123 -158883 -160211 -50365 -55759 -72278 -58586 -41057 47593 80743 137917
16310 137917 112309 -9002 -103187 -157904 -157362 71989 86094 64264 81559 63439 5162
16299 5162 -5098 -7248 -75633 -66171 -50855 18926 113968 71017 21794 68835 -32963 -38761
16287 -38761 194267 233571 230452 250842 185246 238314 185718 32743 -79938 -159786 -93172
16276 -93172 -19480 65866 70008 -31987 -119890 -264470 -305402 -112381 118311 123806 73035
16265 73035 58629 36664 -41310 -173176 -241483 -81433 -31435 -1409 -15546 -34861 102807
16254 102807 35474 -43822 -110365 -100212 -113839 -50656 -99494 -101998 -58178 -37876 -54895 -55031
16242 -55031 -31731 -24148 137786 296677 269248 220684 129685 149079 124114 14041 32043
16231 32043 138467 147040 100584 -49506 -49085 110259 24974 118967 147541 177985 120815 161224
16219 161224 138311 63832 77808 -37214 -41230 58371 -58266 -156376 -15391 17131 39076
16208 39076 -13169 -75238 -211296 -160428 -95599 21796 20141 -55939 14836 38725 59701
16197 59701 26273 -4944 25970 87464 36510 -172394 -208375 -66180 87379 122495 108208
16186 108208 28308 -12352 -30033 32322 8558 102934 165672 114293 -15797 -176367 -116443
16175 -116443 27791 -4172 -111781 -150514 -265694 -303150 -293187 -59710 45845 -64331
16165 -64331 -108815 -95726 -79743 -62035 30475 -126912 -84830 3120 -35854 12609 36804
16154 36804 -18901 -31016 -135406 -71155 21400 727 -29544 96139 -42608 -183280 -131524
16143 -131524 -94095 -54739 -116821 -53646 -72722 -138108 -155855 -106541 -43484 -42833 -63677 -13581
16131 -13581 29097 -8147 -167234 -192727 -57086 -83008 -150989 -155012 -81836 78188 104524
16120 104524 150930 79729 36561 115761 204032 208646 100727 67017 -72039 34569 138881
16109 138881 66727 33526 -72336 -203787 -36431 105109 134387 168821 119783 93057 117977
16098 117977 82878 28381 134605 72712 67488 150808 140246 85045 58227 47936 64747
16087 64747 -28799 -143278 -130439 -109105 9677 48177 -21207 -45827 -4877 6785 -112087
16076 -112087 -73045 -36907 16563 117054 112865 79728 3961 -31942 -66123 -29383 -28489 26265
16064 26265 54781 35878 22656 -96262 -95935 -35238 48522 26522 77701 95458 69670 64351
16052 64351 126918 46656 37776 -27051 -6427 -34172 -97160 -50951 -41273 -73615 53135 48202
16040 48202 -16082 17315 109448 120071 226 -20237 -78797 -92460 -30708 64371 69269 94796
16028 94796 -4549 -62114 23582 100637 162026 173447 130495 -16022 -37260 19678 13399 -25861
16016 -25861 -32522 -62737 -31945 5420 -46569 -97910 -121306 -235976 -164837 -3033 -1046 111209
16004 111209 183328 110536 110789 175766 193530 60267 -122978 -201432 -163965 -127121 -42809
15993 -42809 28509 -95544 -131864 -19168 82524 60243 47819 88023 28943 17671 69472
15982 69472 14854 -67075 -100746 26307 100142 51628 40407 124127 79613 62164 30646
15971 30646 159682 221710 209114 201914 191522 90599 130941 75755 33147 112514 133917
15960 133917 -17178 -147916 -158340 -235523 -347904 -213665 -43892 -1291 -39058 15391
15950 15391 -83915 -93803 -159855 -107912 -68045 -49885 132718 13733 -256502 -233854 -123439
15939 -123439 1030 97834 135154 20435 -3290 8202 33339 -30223 -113517 -26176 57176
15928 57176 117479 177857 85761 -64191 -81212 -14784 63661 100920 104789 -1058 -17415
15917 -17415 -12158 60361 151417 138017 125239 168001 95654 25135 164110 111085 8105
15906 8105 37390 23847 39844 -33653 -108299 16449 85633 -16196 -200889 -215894 -113051
15895 -113051 -23043 11783 228122 238540 99919 -70800 -149549 -211752 -121741 -170207 -149163
15884 -149163 -134855 -82732 -163440 -169060 -147318 -35237 -43761 -121482 -42087 11319 -9864 -96221
15872 -96221 -42324 -86288 -72886 -82971 -88031 90140 37272 -30876 25590 51979 121731 13160
15860 13160 -105681 -132495 -31044 97284 50932 16784 27218 -5367 -95311 -133864 -181832
15849 -181832 -123067 -99424 -41666 -36470 -107922 -36614 -12826 28755 75051 -24075 1534 -14
15837 -14 -54639 -92172 -89036 -63130 -101164 26499 121550 -106908 -223072 -160966 -151955 -227927
15825 -227927 -205936 -125652 -70349 -38335 35551 134881 155618 -30876 -81708 -62291 -52934
15814 -52934 -73513 -101067 -200739 -239292 -91323 -138223 -167032 -111876 36299 129728 179549
15803 179549 105112 -2215 91444 263381 305921 280433 231556 266913 250765 100625 -35247
15792 -35247 32197 23602 66550 42576 60406 135366 157631 116528 41866 137005 304863 226601
15780 226601 28418 -53403 -84201 9390 27140 57276 123181 40883 -81856 -155388 -69727
15769 -69727 16501 -164053 -219961 -70330 36739 131115 156127 180053 121829 159935 245369
15758 245369 132092 88455 64355 131494 130332 92901 119127 71981 46996 85579 53873
15747 53873 83127 70956 60020 -26397 -263988 -174299 -80582 35636 87968 84267 -31568
15736 -31568 -165093 -258632 -189275 -25172 -60319 -108561 -214251 -164760 -56770 -118606 -147202
15725 -147202 -106703 -96773 -156160 -122591 -120023 -171190 -152869 -60240 -15749 50043 76797 104551
15713 104551 28094 10469 -50640 -137037 -228550 -193139 -121414 33513 13083 -37091 9603
15702 9603 -73645 12275 -14132 -41821 -17712 -27226 -69957 110820 182903 203038 191869 183330
15690 183330 98776 -78602 -77448 118110 206176 151781 98574 13856 10602 32571 104450
15679 104450 87893 22983 -5858 -21504 51379 62040 14627 -24218 -39927 -99483 -182437
15668 -182437 -172737 -234214 -248734 -68905 85700 101964 31779 61901 66940 255339 299014
15657 299014 272586 260168 118728 41652 -5013 -59048 -117386 -244737 -255209 -239652 -229936
15646 -229936 -150127 -98494 -167082 -73490 -21013 -41300 -5759 -62303 -98887 -20897 -62634
15635 -62634 -60763 -19189 -3179 25969 -102299 -108027 -135380 -111556 -147491 -163053 -150046 -105833
15623 -105833 -131192 -53878 -9703 -64638 -128845 -164639 -228487 -193140 -113892 -84855 -55357
15612 -55357 11741 108515 96455 73399 -8241 -82177 7750 72857 -3737 -14813 -89849 -103282
15600 -103282 -129684 -161949 -105592 -9342 40490 87411 74710 -22809 44677 146060 41551
15589 41551 -2566 -13297 116899 83569 76405 62863 -79859 -156366 -160063 -163768 -163302 -84759
15577 -84759 -155781 -236080 -215551 -102603 -21824 110434 102402 90771 -3495 -49200 -136628
15566 -136628 -139483 -94470 -63790 -101428 -41708 -54928 -93150 -87058 -85466 -70978 -58405 137115
15554 137115 217225 68837 -18378 -58387 77674 205623 322475 255705 143274 95044
15544 95044 9122 53596 -10902 -81540 -179763 -137377 -68028 -152820 -222660 -253887 -149349
15533 -149349 -95747 -85994 -76925 -124397 -115571 -53846 -11046 30350 11099 12056 -15114 -23561 34204
15520 34204 7069 -31906 28467 82693 2557 -75163 -38236 -17715 -33802 11317 -83843 -200558
15508 -200558 -218558 -314988 -288991 -183365 -124325 25865 -22553 17606 37367 65761 123524
15497 123524 109565 18232 -23581 65679 80590 68639 69043 164750 284181 263692 266206 210187
15485 210187 66261 30497 8942 -43539 32871 -12053 -69652 -87179 -187712 -203324 -139820
15474 -139820 -164700 -191732 -173045 -191475 -269050 -162615 -59183 -123431 -8336 -66743 -77611
15463 -77611 -106158 -60175 -5280 10221 -86975 -86220 -29125 2773 -55142 -81307 5444 73697
15451 73697 144647 179758 -52376 -25332 119395 162416 177688 116433 10632 1884 18051
15440 18051 -34727 -69381 -9317 100318 174674 209680 100261 -41905 -82780 68007 103410
15429 103410 -44153 -169126 -183153 -152140 -149911 -11049 -4980 -131 -31461 -115965 -19711
15418 -19711 142206 201944 91388 4111 6757 111822 77752 -34243 -35170 -86831 -46387
15407 -46387 37406 125720 137354 27036 -166434 -254574 -174603 -200351 -103315 4039 11985
15396 11985 50089 92866 55694 -76699 -18343 -35505 -52348 -111104 -76916 12046 -47383
15385 -47383 -21348 89280 149395 64605 131797 79037 30390 63952 168513 110088 -13859
15374 -13859 -126734 -228084 -204381 -168586 -78443 -41214 -25729 14084 32969 -79889 9900
15363 9900 -123486 -129971 -68159 -107226 -111189 -181204 -233928 -168145 -153817 -167775 -135807 -41101
15351 -41101 26382 -20308 -11191 9697 85556 151461 90583 103286 190914 148369 60863 -10669
15339 -10669 -11619 94452 61959 54467 41346 -82391 -62208 93017 190547 237945 118117
15328 118117 46102 20916 19749 -7018 -9954 70436 14745 7039 28172 -113291 -104386 -125454
15316 -125454 -71027 -71290 -82245 25583 52638 41701 -9311 -170346 -270700 -309498 -326048
15305 -326048 -64592 98074 48568 -26378 -134331 -45145 -57450 -110363 -116838 -121429 -189534
15294 -189534 -236205 -225796 -140024 -65607 -89106 -70488 -4982 109915 198467 249878 84945
15283 84945 46743 122121 99014 56529 3377 -63138 -79166 27042 73489 38592 -33583
15272 -33583 12392 33958 -8457 -148433 -61024 50126 97817 131400 61016 -171444 -157553
15261 -157553 -115138 -218460 -274993 -268738 -144436 -114675 -31904 -63191 -52241 -38656 2510
15250 2510 29058 32450 -2901 -76050 -127134 -159449 -35220 28256 -154349 -264332 -313129
15239 -313129 -327850 -196279 -109101 -104875 -132677 -77839 -72518 -59388 11825 -73423 -123744 -117816
15227 -117816 -174763 -230597 -169984 -200194 -217569 -173964 -131450 -117555 -6811 162889 118822
15216 118822 60451 119378 74445 47774 111001 -28212 -109227 -22014 28153 -77828 -173746
15205 -173746 -165243 6302 -77842 -323645 -291569 -276160 -154942 -72011 22699 9738 6397
15194 6397 38885 39722 93832 167331 68779 40649 -16309 -126674 -153445 -73981 -3860 76691
15182 76691 142416 124070 209011 150774 34008 -105327 -208428 -219024 -204806 -224754 -187548
15171 -187548 -127099 -131132 -29537 -6719 -13455 -160713 -203836 -119382 -216414 -263011 -283624
15160 -283624 -165540 -47380 -84011 -127772 -49024 19208 -19390 -15622 -61892 -46130 45134
15149 45134 54990 151609 -4795 -115766 -88038 -36961 -15618 -111923 -113152 -138827 -41016 113367
15137 113367 184648 87511 -46511 -67649 44554 82549 -35539 -123373 -168259 -178718 -110889
15126 -110889 -7090 31013 -3883 23961 1229 45379 106437 160281 146172 124495 24019
15115 24019 -51223 14005 50580 211166 336771 256651 54208 51683 161310 177703 -35893
15104 -35893 -60379 13104 123379 45846 -104145 -37794 44802 49738 49748 14233 42049 77230
15092 77230 -8859 -55144 -45891 24646 25308 11786 26382 -5013 58935 291342 265692 144136
15080 144136 29959 -66631 -5993 -24924 -71240 -92578 -122758 34206 168513 148886 46515
15069 46515 -102253 -51759 40790 -55317 -120024 -92830 155141 292950 35759 -181571 -101840
15058 -101840 16543 63791 65362 19550 29514 -27353 21903 104202 80098 150060 289085
15047 289085 306214 207033 157633 32397 -70620 -158891 -133791 -63769 -28897 155534 175590
15036 175590 74426 -33652 -109189 -85512 -96179 32994 160778 199796 144007 135638 98170
15025 98170 173892 125384 24494 -2477 -39075 -8457 138027 114731 54104 89875 177860
15014 177860 125206 -66736 -182861 -17515 87330 198002 275432 269797 174622 227317 237969
15003 237969 55070 -123774 -16119 -75402 -45320 3426 171151 282638 347276 232981
14993 232981 120026 -21291 -33567 -29288 -61258 -42576 98145 109287 74449 42304 -30584
14982 -30584 -83884 -40713 -71683 -11730 170552 409075 345783 190772 60619 8502 63152
14971 63152 18976 -63795 -109009 -147140 -62645 -73040 27202 57224 -84952 -76169 -11889
14960 -11889 -3057 51631 201307 103154 97663 83177 -25983 -99865 -145560 -148748 -112972 -71675
14948 -71675 -56755 -43815 73131 93685 7918 -44751 -76514 16849 -63908 -66596 -98311 -47877
14936 -47877 72973 42991 -163495 -241670 -218139 -83949 -38133 -104026 -63454 -42923 70494
14925 70494 29541 -59383 -83228 46384 89670 176646 189439 -10681 -21352 -36335 7587
14914 7587 45057 141834 165114 99073 77897 -63412 -93279 -65145 -5414 -58983 -30483 64094
14902 64094 43932 117436 121525 47459 77757 156002 119643 85522 188679 175909 115083 50478
14890 50478 -290 -6132 10409 86451 -23932 -59073 -47402 -145059 -31562 -22621 -9535 -10163
14878 -10163 54983 36772 65738 89917 74371 81334 83626 21254 59303 -9071 -56345 -80955
14866 -80955 -104406 -158916 -36890 55282 39050 9284 -40137 -88135 -65311 -77088 3266
14855 3266 33090 -44758 -64469 49037 60548 15064 -33467 -36914 -87534 -49491 -82931 -110225
14843 -110225 -37245 -96164 -179897 -205301 -115496 38828 70979 51307 -43863 -123371 -234134
14832 -234134 -232403 -36048 17909 29807 -6881 -3231 -57381 -31726 56300 105988 33508 105173
14820 105173 193170 198417 101266 4989 -96499 -113235 -283656 -268781 -193268 -135131 -81753
14809 -81753 -127266 -68651 -67909 -2941 76106 32797 -38368 -103635 -39636 -11660 -5633 75159
14797 75159 180643 172595 -17389 -183378 -240264 -180676 -122264 -65775 37961 126715 116463
14786 116463 68967 135017 141478 134603 35498 -62237 -31019 6404 -62675 -79203 -46817 -134850
14774 -134850 -110162 21860 89029 49459 120217 142071 61536 119933 106575 23923 92080
14763 92080 213671 290400 343333 311514 186580 180208 132760 102274 30019 -31063 -55041
14752 -55041 -54004 -33065 -38706 -2289 -107509 -184065 -166627 -85684 -25873 -154197 -94111 -16766
14740 -16766 -64179 -37957 7609 -20664 -765 106474 121109 173036 199073 51191 -114523
14729 -114523 -45000 36597 98129 85230 -46708 -134017 -108699 -104824 -153803 -83468 35741
14718 35741 24242 -108342 -208993 -131880 -5349 218370 237199 100799 -19159 -68766
14708 -68766 38960 67137 -4190 -80059 -73473 56105 28965 70038 70617 50595 44041 -2290
14696 -2290 635 10042 58972 36797 7584 -27290 -21705 2764 -52631 -55757 -10942 22202 149966
14683 149966 220757 164380 142989 54863 71075 42765 105963 144635 91967 9351 96126
14672 96126 77247 -60381 -110101 -131814 -65009 56800 132547 81056 22452 132910 49380
14661 49380 -33862 26040 -5631 -159879 -272749 -236156 -159404 2719 -56479 -30283 -4718
14650 -4718 -4206 -75255 -50283 -62944 -87056 -118392 -97590 -88524 -24720 -91689 -58104 -71649
14638 -71649 13510 34070 -5610 -11896 -95742 -101871 -14305 33069 -49234 -126029 -43039 -24343
14626 -24343 -80969 -75824 -96150 -33075 8903 -48540 -31716 -68961 -56253 -65506 -11768 -68958
14614 -68958 -102836 43923 110916 43953 49255 -86080 -116892 -151843 -101988 -3510 144595
14603 144595 117750 48038 -98533 -79065 19399 47626 58696 195937 203489 164308 69202
14592 69202 49680 45678 47296 -61588 -181644 -158646 -73778 -9372 20662 39193 37709 -25746
14580 -25746 20779 88810 -78910 -194083 -154996 -100057 20727 30977 68400 79714 75806
14569 75806 -1013 34270 102569 33944 165137 281586 220422 124560 88252 3479 -240225
14558 -240225 -324022 -198999 -50828 10246 -28747 98 29761 -11182 -108385 -75899 13606
14547 13606 158539 164037 3091 12669 69123 55201 86442 191996 138051 19802 -65972
14536 -65972 -66456 -30314 -37936 -188184 -161080 -186539 -204911 -176204 -226711 -122342 -83239 -43779
14524 -43779 -86388 -31168 7548 42785 75232 115327 40831 60303 119332 43801 -26194 14106
14512 14106 63736 -17059 26379 34554 -91953 -177819 -167218 -70214 -1898 -33811 -174196
14501 -174196 -132809 -109663 9625 49918 21615 -42790 -55858 -20234 -27612 -3640 55827
14490 55827 67224 48121 14706 -52602 -123931 -106996 -88617 -78933 -54782 -112225 -196096 -126588
14478 -126588 -94441 46449 117163 227724 149016 15167 -141201 -162971 -102800 -90038 -84392
14467 -84392 36050 20728 -119468 -102215 -162553 -196073 -72108 -50203 -147525 -133200 -116500
14456 -116500 31189 48265 72359 832 15372 -83072 -162538 -51629 4801 31544 -56899
14445 -56899 -53855 4743 102683 198964 165758 31098 -61735 19432 193942 234220 191065
14434 191065 120859 34031 8052 69442 103707 48155 26431 154429 60351 94244 54871
14423 54871 52905 218493 321265 177678 147636 179107 147695 15099 -25013 33553 71106
14412 71106 98029 156305 111614 98776 94010 75405 58564 25242 70337 73066 128259 119961
14400 119961 -24040 19645 -10721 -79620 -184673 -109965 -91076 -65182 19294 -53376 -57861
14389 -57861 -100875 -152160 -118305 -81756 17521 81965 52652 140219 79559 44271 -12836 -40815
14377 -40815 -77846 27239 46858 58810 77439 73277 150483 113445 -83161 -198727 -205581
14366 -205581 -113937 -86956 -19031 -19536 21548 136107 86631 80987 91973 120737 119638 -2437
14354 -2437 -101507 44595 96866 9136 -73223 -48571 39512 146933 66658 -83619 -98028
14343 -98028 -157622 -145118 -72222 44707 73733 118671 58475 24489 108285 145603 69305
14332 69305 -63620 -81773 -39946 -2821 52910 67793 14337 -14320 -169322 -202468 -195568
14321 -195568 -128783 24710 43222 -82221 -111392 -129486 -163133 -181167 -224990 -174983 -107126
14310 -107126 -34260 82315 147065 179820 255421 249085 63317 -89479 -113818 -102362 -26431
14299 -26431 47255 153527 245158 324109 319838 253824 216058 82863 61477 -4525 -21804
14288 -21804 6808 -23317 -27601 -41031 -55178 -21963 -111854 -281379 -147910 94970 171612
14277 171612 141995 110308 15400 27810 -78516 -110111 -51538 -57209 -38272 49138 -29205
14266 -29205 -136207 -72225 -20570 -149896 -154216 33879 101848 -3385 -42838 23204 203795
14255 203795 131993 114752 11392 -103703 -147613 -120039 -94067 -174956 -104799 15756 -82000
14244 -82000 -82522 -40789 -3026 89531 189000 162985 136150 22635 -27270 -122597 -203896 -202867
14232 -202867 -119913 27856 107853 98080 75757 190510 135636 142119 65846 -18429 8739
14221 8739 -10557 -57078 -137305 -102475 23586 46448 13880 126864 143978 106284 235404
14210 235404 183602 132164 89653 6695 -59161 45456 91875 12936 -1815 254 41309
14199 41309 -94207 -163453 -156870 -18588 109412 179540 101148 -6108 -34293 -29193 12644
14188 12644 19699 -25024 -36342 3957 24429 901 -134258 -222460 -90471 -13221 -81351
14177 -81351 -163845 -153986 -9997 104472 105046 17419 42782 152022 100394 -4486 -44568
14166 -44568 -6642 74322 127360 167168 106765 42085 -134954 -251616 -198991 -16029 58791
14155 58791 116743 142265 78645 1639 -141101 -144237 -147498 -157254 52485 149606 138848 116858
14143 116858 89506 93182 58654 6637 -109674 -115604 -140521 -78083 -57224 -199137 -156668
14132 -156668 -8064 -22848 -159877 -137230 -93160 -29545 -7656 -56330 43934 255607 186772
14121 186772 100521 148276 45736 -60424 -10351 -40952 34225 130502 147408 121640 44743
14110 44743 -15714 101413 111711 27508 67534 51015 -11623 -111542 -298382 -324051 -248448
14099 -248448 -341247 -325955 -276910 -236769 -156009 -94383 -171494 -253403 -105374 36203 10711
14088 10711 38677 140529 167196 220861 130297 81239 94604 85111 -41485 -44077 -14006 -51504
14076 -51504 -78143 3113 -80551 -55577 -17697 -34942 -44771 34791 -70892 -101515 -44272 4171
14064 4171 2798 -91357 -74311 -48284 -112178 -146236 -154891 -209728 -133962 -56769 -129885 -76467
14052 -76467 -25694 -10947 46667 174641 211230 202473 81196 -129082 -208597 -142329 -115959
14041 -115959 -79122 -57979 -77257 -42221 -133093 -78589 16233 13184 -27535 -62468 82830
14030 82830 90737 32339 12043 55537 98824 14754 -55361 -90949 -15323 66077 2921 -68610
14018 -68610 12797 23559 16015 161015 165460 116394 134862 134978 58300 -210263 -230846 -218671
14006 -218671 -11069 157088 162581 68021 66309 102112 135599 126456 182036 265283 235994 103597
13994 103597 102780 12824 -8147 -21644 10184 52058 43921 43865 109673 66569 138751 159783 65533
13981 65533 2934 -58067 45073 34233 33066 59630 -29218 -161304 -51187 -49651 -45235 4751
13969 4751 8415 114654 -66171 -206037 33821 252819 254226 188426 249438 192361 44474
13958 44474 -12765 -152542 -129119 -40697 31772 -11057 -67715 31319 44255 -25159 -242679
13947 -242679 -221804 -43963 198616 314419 140760 74353 222996 160427 114637 62802
13937 62802 11950 38553 -4723 -32418 -72870 -125128 -66872 -71123 -73507 -50793 -71409 -148412
13925 -148412 -121758 31353 33214 9723 37729 40485 123533 136386 146057 68928 -6013 -48745
13913 -48745 -32414 32456 7258 94618 263760 216524 202201 109836 57563 95617 109347
13902 109347 183052 39756 40897 76121 -47456 -191576 -202578 -285281 -134260 -43866 -73710
13891 -73710 -122233 -151872 -157247 -71274 97452 109315 -251 25711 -6300 -112012 -74026
13880 -74026 96387 183738 101936 40666 42109 -37420 -81870 -88134 -118375 -144999 -120347 -87944
13868 -87944 18222 120149 122913 64278 -29440 -32177 2845 -99670 -76182 -51195 -30619
13857 -30619 -10988 -20274 74436 73727 85331 141628 194938 170867 33227 -94387 -81588 -30169
13845 -30169 -23885 -20900 -56453 -108538 -110972 -39115 59012 90286 128553 289466 251315 63127
13833 63127 48648 58088 76653 137802 13781 -210684 -208125 -134275 -133260 -83286 -43436 -34646
13821 -34646 106295 130125 107623 56749 -42684 -186991 -96164 -33648 -65768 -57275 -149568
13810 -149568 -154714 -217398 -220426 -130007 -65104 5755 142066 101432 -62224 -57891 30879 124583
13798 124583 66284 81927 43961 70452 41977 -34686 -144171 -101155 -10091 38 2586
13787 2586 -36674 3590 -8616 -55125 -151750 -108202 -75846 -118861 -118660 -58438 117017 44426
13775 44426 33788 -35553 -54492 -37174 -122557 -177983 -168697 -28722 -52822 -29127 -64783 5204
13763 5204 79836 -69850 -148261 -161365 -176681 -763 75882 85436 1559 28957 -68835 -148191
13751 -148191 -157276 -54868 -39772 -117535 -50339 88087 198960 232201 139132 17359 130229
13740 130229 174174 171127 218486 160761 105858 15470 39186 -1812 2634 -45416 -90492 -9741
13728 -9741 -1260 53022 160015 207917 152647 87854 -55024 -32911 -16450 108122 60787
13717 60787 -87801 -8879 -7527 18586 22090 61413 87949 63381 30960 -23531 60861 139719
13705 139719 127074 -52360 -78046 -1058 -50424 -78650 -110688 16846 -50377 -118948 42019
13694 42019 41737 -52604 -80338 -139525 -161637 -202468 -234190 -141146 -119747 -104029 -68655 -188762
13682 -188762 -136785 -38418 -41278 72034 121185 118533 57379 163023 217075 192557 258283
13671 258283 224054 200714 174354 111153 -82032 -70712 -71974 -44233 -3192 -23938 39255
13660 39255 -30370 -64499 -45214 -4110 -40702 -80089 -170849 -98454 -57440 -4928 30383 -48265
13648 -48265 -56470 17453 153731 167178 88339 77552 79783 97369 168539 79688 167518 260614
13636 260614 226315 235601 145265 141899 188866 170075 160980 112758 173660 161042 92148 144635
13624 144635 75761 16397 43957 125219 208829 70215 -13348 -5702 -3885 15865 85232 2939
13612 2939 44871 132553 109346 163961 65075 -16174 -77179 -2871 -42876 25386 -40110 3880
13600 3880 117473 75065 118424 202250 173147 80405 59823 81486 152990 55267 -9847 -39895
13588 -39895 -23591 10077 80039 103083 56440 -3013 99018 100906 18426 14302 16894 2946
13576 2946 21510 -14718 -23365 -15222 -31143 19742 59373 121426 130340 126408 85594 -8510 -57681
13563 -57681 -27758 -48450 -58572 -47761 73007 122859 92330 38455 20029 579 -44120
13552 -44120 -87435 -88866 -145459 -226458 -173672 -165937 -146974 -211091 -159136 -49012 -18894 17706
13540 17706 84759 76145 126769 79416 137311 54111 -107900 -185971 -115962 -8567 -30429
13529 -30429 -12772 -48023 -53942 -115363 -127399 -42299 -174 -41491 -80831 13821 -60855 -73581
13517 -73581 -145614 -140536 -41247 -146263 -210383 -208165 -28940 -14672 -103765 -58209 -26292 -8593
13505 -8593 65850 123968 238331 255200 324605 180545 113909 97938 99192 111458 91216 84640
13493 84640 32856 -2185 21216 66506 3284 -37968 -75885 -50889 -70898 -18534 134252
13482 134252 108636 92346 70822 67778 10026 -24480 87530 84308 58383 40397 87434 173953
13470 173953 121896 55408 -26517 75736 158624 85641 -43347 -99045 -77231 -73449 -47988
13459 -47988 -61891 -106801 -127389 -138739 -190266 -94319 -60462 -102549 -32789 57107 -4830 96511
13447 96511 103404 -138407 -112940 20096 70137 -41802 -180338 -245812 -256554 -294476 -329118
13436 -329118 -331357 -216804 -172029 -152597 -169749 -225329 -100670 13044 111444 146242 53940
13425 53940 -347 -46985 -73231 -90773 -76887 -64876 -106406 -118211 -57155 -63081 -86185 -94912
13413 -94912 -79440 35100 37822 -3232 -145658 -188155 -97738 -99792 -151863 -198180 -251670 -255465
13401 -255465 -170901 -121124 -104111 -80364 -123934 -163779 -86276 -68692 -12623 -55542 -61182 -38370
13389 -38370 -79803 1233 -55508 8276 -85833 -19696 59208 -64951 -202805 -184552 -161103
13378 -161103 -83455 -66677 79043 94434 53429 -21129 -69806 -159998 -241411 -328927 -296416
13367 -296416 -257080 -298062 -247155 -97518 -58363 -54019 26459 48754 90374 19606 69691
13356 69691 44935 -53966 30344 9050 43412 60093 114341 133380 179717 163237 133168 161848
13344 161848 187498 152300 125904 68172 -37362 -210417 -220076 -214450 -177268 -77087 19599
13333 19599 -22248 -40184 -49529 -72643 -87666 -126331 -116638 -143919 -231311 -343807 -345787 -167339
13321 -167339 -83381 -71061 -145758 -135297 -117654 2242 -10996 -160534 -126231 -115510 -43526
13310 -43526 34513 98146 111461 174447 202698 231537 74867 -49218 -149080 -144077 -14106
13299 -14106 106606 153767 190094 80994 6133 54276 111498 51803 22689 38553 25874
13288 25874 -115052 -117094 -47153 -47200 -34113 -57112 -131503 -124111 -111443 -62410 11913 30991
13276 30991 -54103 -91087 -70094 39687 29817 -68658 -136162 -154004 -221456 -323190 -304313
13265 -304313 -243896 -137416 -159080 -198561 -147500 -169381 -138828 -148237 -211263 -199685 -188538
13254 -188538 -213782 -121285 -190118 -136311 10446 119871 70993 16346 40923 71456 21735
13243 21735 -68439 -77592 -180950 -235435 -142390 -60919 -92445 -91429 48083 111620 72983 23979
13231 23979 6995 -49384 -103574 -113715 -154699 -122326 -78710 -60877 -80619 -15561 54337 29298
13219 29298 -113808 -31199 -53691 -64030 -112475 -130574 -108329 11978 144938 171552 125784
13208 125784 -42629 -77168 42930 53422 56161 -34963 -102721 567 236787 302631 323901
13197 323901 287713 219858 159651 203151 201799 211613 257469 193626 105555 -110336 -122653 -97103
13185 -97103 -55569 18438 -144751 -336016 -242719 -134185 -182269 -171342 -105876 -63264 -89793
13174 -89793 -124678 14527 -72684 -87411 8894 103275 81859 116747 95820 -1609 -106687
13163 -106687 -78240 -75943 -40695 52675 121975 262675 440435 639029 902469 1144332 1087624
13152 1087624 905102 746000 371677 152983 41910 77851 180861 167758 21410 -15513
13142 -15513 -31650 -35383 17043 33233 82974 82375 5368 -210151 -162084 100284 238697 163615
13130 163615 142841 185375 202279 113811 157754 192938 267432 167183 47008 58151 22552
13119 22552 9905 -36124 115450 250270 171128 137306 254195 432411 698529 978243
13109 978243 1223792 1228383 1100036 1006053 609223 314177 225053 229526 145057 192917 146085
13098 146085 127267 186867 158058 107580 37313 -30959 -29385 66957 121393 140441 103932 100847
13086 100847 49419 -11512 71204 82841 41521 -99134 -165569 -72186 96927 101450 71295
13075 71295 57671 90191 74390 80230 76254 -9650 78813 266309 364072 283280 258315 131528
13063 131528 77964 187815 147164 16506 21267 81486 25419 -177487 -225680 -138791 -146693
13052 -146693 -185680 -255781 -224147 -165081 -42426 98200 23780 -42816 -100283 -253145 -255886
13041 -255886 -124690 -131904 -174521 -85686 107929 142073 69932 109546 31634 -11933 -55533
13030 -55533 -28383 38749 90355 100941 6435 -62379 -105292 -94132 -8408 46823 173417
13019 173417 140676 52746 -6395 -42687 120079 160814 8412 -75537 -108346 -23742 -93809
13008 -93809 -159650 -54182 -13517 -106 65815 -6447 90221 210902 129592 96994 4458
12997 4458 -103799 -136164 -99738 41865 218022 199481 109839 230633 135870 -87622 -230489
12986 -230489 -229846 -140127 -104856 -52385 -29443 31206 14568 -4183 -81855 -176900 -21252 -1273
12974 -1273 35952 -66107 -119783 -43194 111713 31090 49146 27976 -11955 -196042 -47227
12963 -47227 47873 -63820 -109803 -25137 -37445 -105799 -75658 -698 152898 124245 -50207
12952 -50207 -119525 -30571 9669 -57987 -87576 -66104 58855 108548 133878 24302 -71758
12941 -71758 -18563 139066 217764 203478 31597 -208333 -260734 -187858 -20303 -47901 -166551
12930 -166551 -134475 -56960 -77155 -68944 50736 137168 184959 96743 3241 -141957 -216059
12919 -216059 -126819 -96181 9579 101556 80529 127672 -2066 -160525 -250615 -188720 -171634
12908 -171634 -124938 -3576 156248 216642 62184 9346 -29990 -24505 -52752 -4752 41133
12897 41133 -10735 8804 75941 33095 -33716 31058 139230 171764 106222 77768 199611
12886 199611 358460 289998 132143 -30082 -60354 -12222 -64445 -61426 -15888 -43806 -125722
12875 -125722 -134322 -166054 -173674 -56259 62618 63459 -39973 -147732 -220543 -130462 -75208
12864 -75208 -24732 115 -20184 -59152 -29065 -178939 -177079 -128927 -101329 -89471 -18008 111752
12852 111752 76323 -10897 -50387 67084 153894 92312 102234 149573 -22538 -43909 186472
12841 186472 263570 237023 284425 550476 923847 1289403 1822205 2251625 2374947 2213502
12831 2213502 1756067 1337570 874380 606466 405375 322264 261397 206277 228438 223400
12821 223400 159623 12786 69050 90870 48242 -43410 111237 225829 255686 413788 411854
12810 411854 258380 165609 56701 77266 109000 -19492 27241 56213 -7814 17977 165153
12799 165153 153267 7807 -59420 -127686 -192620 -70569 44243 57953 -66057 -50045 -95605
12788 -95605 -157814 -118014 -71324 29430 41264 71558 -13610 -886 -122210 -223447 -280564
12777 -280564 -223979 16849 37336 47927 46823 -46166 -152170 -142968 -18458 21872 78013
12766 78013 133478 118442 75563 117577 80050 68827 25726 71526 133418 194144 147465 158650
12754 158650 150313 134728 128392 29070 -1161 -18634 -110712 -73210 -12794 -10607 36780 73575
12742 73575 11830 -12301 -8986 14003 60542 -26088 -133302 -3046 -32461 -143307 -213189
12731 -213189 -252992 -241492 -112607 -12892 -6147 22531 81939 78971 54152 93041 154646 223986
12719 223986 344698 487064 458028 481052 610858 502286 282263 193692 147036 126328
12709 126328 84243 -85079 -80654 26058 62072 114260 125440 112410 133293 154721 163439
12698 163439 165101 51713 65517 -19065 -64225 -21113 111985 148702 70401 16736 88397
12687 88397 67363 -2832 -32046 36558 65261 29618 -45350 -147584 -125814 -2380 153196
12676 153196 54518 14211 38786 57963 93404 88088 107161 133056 154923 35022 47668
12665 47668 107305 -22436 -183514 -215116 -167570 -156926 -171265 -178781 -105658 -63953 -81264
12654 -81264 39031 45585 -57645 -192343 -255000 -249225 -203231 -148219 -14767 23962 -19583
12643 -19583 36984 -22465 5007 71543 29594 22595 12517 9923 -10085 33226 122842 155881
12631 155881 85078 87871 73952 -92161 -28164 114630 28457 -11493 126520 176947 157468
12620 157468 208949 143944 119274 43941 -75041 -63162 31012 121014 132308 87815 50310
12609 50310 18874 38967 -48671 -41115 11046 -61667 -71234 -117938 -202510 -254027 -184122 -52570
12597 -52570 -103340 31179 81853 17486 -21478 -64957 -42462 97363 104810 113062 106203 61162
12585 61162 28838 -142302 -220626 -158005 -249588 -308602 -196179 -85010 -22925 -31429 -202865
12574 -202865 -273421 -253587 -218151 -256422 -158527 -33494 -10931 -96355 -49093 -94256 -121092
12563 -121092 -72112 -88034 -124771 -52528 -83919 -226037 -241402 -155335 -65974 -122144 -154052
12552 -154052 -133104 -63582 -9918 96192 133688 85021 -34260 -45571 56965 46378 52202
12541 52202 -21525 -200891 -180851 -68629 78138 346322 685398 899849 971397 914459
12531 914459 760838 533238 343841 136212 56764 109969 169083 163302 144690 157815 179826
12520 179826 21925 -167208 -110668 -123955 -129706 22521 41495 885 37317 15508 150165
12509 150165 124517 -112376 -268999 -329363 -242447 -166609 -134477 -22709 41179 45078 50813
12498 50813 20563 23972 9760 -48409 -177987 -273930 -258988 -189260 -81396 -18673 49732
12487 49732 108670 114262 8375 21001 -19900 56611 39174 103035 144900 39570 60377
12476 60377 89799 60156 12531 -7779 82629 144232 97943 97648 6683 -24197 -51495 -108999
12464 -108999 -20380 51116 73753 150759 276267 332279 293219 132891 17789 118693 78898
12453 78898 65923 139984 224866 145052 54942 74017 73850 116155 112152 79975 24559 48556
12441 48556 62642 77402 -11367 -62234 -130843 -8080 49308 -49793 36794 206701 190321
12430 190321 119865 77171 -33236 -275121 -199071 14362 134365 294329 617755 906922
12420 906922 942775 857120 592676 442907 370570 314854 330201 235543 233831 212941 47714
12409 47714 12196 -4953 -207460 -141252 -116799 -57425 -91205 -158466 -139891 26219 104470
12398 104470 106094 -33443 -117232 713 23013 48674 117662 157791 101484 -16728 -54436
12387 -54436 57934 97816 26798 -127964 -200933 -117193 -93183 -96838 -119150 -74134 -49868
12376 -49868 -69288 17896 55470 161090 189276 130973 47261 35025 45113 -39445 -108072
12365 -108072 -46159 -43703 34124 88361 58081 116683 93474 -15243 39121 22517 -135022
12354 -135022 -153109 10673 92684 181282 179608 211970 113439 26183 -601 38278 -34000
12343 -34000 -115162 -110985 -1679 -23969 -165412 -191875 -103387 42995 120665 104180 170332
12332 170332 189429 107624 127547 17797 -144240 -210161 -121662 -8936 55896 75241 -50766
12321 -50766 77507 179209 92925 95367 288559 322032 167824 24362 190768 204499 74941
12310 74941 1339 39948 41277 -27399 30958 43192 35615 81101 53507 59876 -51445 -83176
12298 -83176 2906 -19204 -62467 -14765 136404 107403 33391 -70876 -76600 107297 146353
12287 146353 18783 17317 15400 120535 125204 22854 -84667 -53097 -65651 -51112 59627
12276 59627 11233 -98985 -188387 -148480 1124 70126 -32065 -58710 45172 22528 10361
12265 10361 70940 115500 103946 65019 78603 -17377 -131905 -221807 -230375 -86556 -87014 -151827
12253 -151827 -190809 -76494 -68040 60213 73229 -82193 -45092 104627 5518 -79357 -1738
12242 -1738 73551 102132 94599 148379 214206 210761 83371 34418 25065 33087 -74563 1073
12230 1073 76122 126429 151918 184241 102461 30569 32521 -21868 -128317 -22757 74469 63819
12218 63819 -122016 -183498 -74656 -4843 -51625 -90491 -37206 66403 82064 51152 77024
12207 77024 162540 208624 160922 115234 294369 304799 217357 263788 362681 331095 307641
12196 307641 455174 682367 1145121 1694117 2184846 2590407 2699578 2305169 1672252 1120558
12186 1120558 768505 615679 505181 441772 340508 223666 144443 128613 147490 146506 82856
12175 82856 42879 6967 1674 -74309 -129273 -80711 108551 249357 266272 246409 292402
12164 292402 287991 186989 117642 148350 121345 136075 -4184 18130 105188 123929 56893
12153 56893 -24049 33676 66733 40551 -26809 -47646 97484 195110 103287 27015 -55739
12142 -55739 -99452 -102762 74697 76901 -104168 -123709 -119010 -59730 19407 29752 62768 35337
12130 35337 71853 51779 -4684 83276 223745 247811 212090 302333 378327 323661 183917
12119 183917 156568 242755 116049 62970 44334 182612 190662 201966 344237 380411 404226
12108 404226 344853 265764 145984 80362 106015 158810 104262 17775 120533 245644 218135
12097 218135 192243 165513 80818 56631 119350 283474 210586 103678 184208 258083 319920
12086 319920 372917 352501 357584 353208 351037 197379 121599 176710 257825 266491 255737 416700
12074 416700 598781 642092 569967 514705 527681 732248 904554 960666 1036359 1185099 1316542
12063 1316542 1292664 1379953 1542957 1581664 1762889 1814403 1974179 2360834 2541758 2683337
12053 2683337 3058048 3575575 4115723 4764234 5719243 6966667 8412788 9914737 11492478
12044 11492478 13177750 15140364 17769291 22021383 28736631 38951096 54964513 82927037
12036 82927037 136005903 229881756 339090601 412859379 457707669 445024465 365985190
12029 365985190 270685534 182968465 119857750 82880492 61896580 48640529 39416059
12022 39416059 32767352 27777863 24035022 21274343 19337134 17849322 16435501 15094793
12014 15094793 13660132 11976278 10401749 9209254 8246585 7538976 6993385 6494582 5936754
12005 5936754 5411525 5050860 4688747 4361765 4107542 3862833 3531330 3227761 2888632
11996 2888632 2718140 2616377 2499747 2333168 2135832 2172207 2080931 1996158 1872332 1732599
11986 1732599 1585847 1394407 1066696 957146 1086418 1278962 1378053 1143275 1101141 1216259
11976 1216259 1240645 1046149 979849 1048884 966779 935117 919711 854814 747403 659920 593655
11965 593655 506833 465492 411657 304011 352304 545344 522559 422098 427371 576415 475919
11954 475919 436150 357617 373517 507737 547330 485566 508847 538167 555039 508215 420381
11943 420381 416178 534417 527681 547821 432017 318474 207532 235155 228090 162792 131790
11932 131790 132511 211040 231231 210804 254571 272595 273178 343146 261718 196260 199015 274646
11920 274646 397861 473466 494352 414820 315060 199919 196496 222668 244555 337543 332251
11909 332251 384347 479969 478638 398873 379522 333081 319484 487375 578051 657817 621886
11898 621886 446737 423911 399476 295583 258388 315032 175186 127632 220976 223158 199483
11887 199483 240902 186309 195487 215520 330724 324000 312424 342805 239037 196515 84622
11876 84622 58266 422592 977420 1738237 2280934 2539732 2483004 2129273 1609872 1168846
11866 1168846 790303 598247 427085 358309 314713 263165 88444 73974 118847 134356
11856 134356 162616 86754 70487 41389 38105 95010 216549 298661 314081 421610 440703
11845 440703 470784 504211 412842 317561 272264 322556 340586 341727 335002 469329 411014 399916
11833 399916 373693 317814 251392 184376 260690 136409 7968 -53652 -121115 3436 36992
11822 36992 -13935 106915 136878 -32582 -56838 -66987 -20291 -48092 -24257 36397 8274
11811 8274 38903 98069 125980 73406 100237 90843 102624 104910 32805 51228 -9233 -588
11799 -588 34232 164487 189806 76427 7765 24641 -79854 12322 78450 87794 197567
11788 197567 256053 239004 155362 117432 80563 87313 43338 27066 137116 187740 212791
11777 212791 212459 183282 135460 112270 165146 196475 169490 142758 172827 173871 145717 114375
11765 114375 51205 98752 225744 70130 15684 131726 213953 247864 169695 101582 85248
11754 85248 25770 -29809 77373 5811 23796 27765 -68399 -84224 -138019 -106957 -220956
11743 -220956 -477175 -404983 -197581 -193688 -178812 -87270 -123825 -224843 -121688 103903 59830
11732 59830 97774 72794 103056 75783 -14459 -121992 -120122 -48531 46027 188691 166078
11721 166078 -9789 -82349 -20433 44040 71110 121382 139743 50924 -146913 -107044 -103138
11710 -103138 -105174 68407 7790 -99915 -44939 -43479 -21148 -71587 -71682 -47004 -14735 60502
11698 60502 66082 51664 -6887 -29644 3540 -93147 -12773 39611 82644 -25796 -106961 -108493
11686 -108493 -124547 -191676 -173016 -162254 -47580 113673 298903 239932 135125 11764
11676 11764 29537 11838 -59142 -63618 -80373 -106296 -199758 -255914 -267011 -216997 -209584 -67258
11664 -67258 -32426 -44492 -16926 -41854 -88107 -41366 -94147 -230826 -250987 -86698 -3353
11653 -3353 -82249 -209935 -123508 -11884 17869 88644 108777 1603 -31327 -44764 -24307
11642 -24307 -17567 41885 63031 -17409 -26162 21918 59853 139632 194493 236642 309637 314238
11630 314238 171225 302608 300997 132834 87529 41895 -26090 -79810 -81397 -101622 -557
11619 -557 11349 -14304 -42100 -15608 121239 215143 180780 127645 66113 -13761 -37129 -20087
11607 -20087 -50722 48939 1965 -960 -6458 -48816 -23967 24739 -56140 47246 58619 143778
11595 143778 141853 111753 110854 133975 112277 65560 -44172 -103381 -122293 -173692 -107362 54474
11583 54474 4846 20878 -26623 -78772 -124823 -19097 253453 353254 330633 331845 231829
11572 231829 39081 -114815 -44552 -4581 -156461 -113347 -64289 -53107 -142335 -197778 -127180
11561 -127180 -108448 -48344 -115813 -159251 -64996 -62194 -23328 -65203 1561 -19456 23829 89784
11549 89784 62092 47858 114573 32029 -49432 -137375 -78853 7855 131132 84464 92047 44992
11537 44992 -9177 11176 43220 -46838 27241 -401 73380 83863 61340 61988 -58089 -65586
11525 -65586 14559 101258 2586 -78668 -86227 -193776 -133315 -27685 -115437 -90210 -65975
11514 -65975 -81288 27974 72293 19810 -33984 -7072 55945 111097 182868 298695 251153
11503 251153 83163 117487 187282 203895 95344 -8339 -25613 58605 52240 4590 21215
11492 21215 95681 -26381 -144475 -232885 -184891 -51404 52081 127711 93449 149314 81941
11481 81941 -13158 24819 104339 243138 241340 247871 241499 311435 266363 82184 -108811 -164726
11469 -164726 -126036 -146224 -78471 5973 120436 76018 -24013 24556 31843 80661 132042
11458 132042 108340 90315 128901 134407 78009 61261 44539 79962 121237 105248 -9264
11447 -9264 -34491 -103211 -109387 -85936 -180624 -279425 -366612 -378087 -267646 -217400 -254292 -205440
11435 -205440 -47387 91801 -21047 -83159 -80515 -141376 -128407 -98585 -49272 74712 115696
11424 115696 70763 -3153 -36432 -193216 -114521 12765 -15393 -36581 -56634 -79892 -5786
11413 -5786 -68112 -30818 46123 -21287 -89567 -16772 -940 -61337 -126272 -34606 57199 -60546
11401 -60546 -150392 -134511 -192030 -114936 57060 4687 -42516 -28435 -39780 3049 85544
11390 85544 -38343 -52818 30419 -20327 -88192 -85331 -31182 -7904 -40960 98692 57518
11379 57518 -12223 38919 -54190 -123177 -232064 -269745 -112248 46907 -51582 -13490 92547
11368 92547 94428 -6901 -5583 -55635 -146313 -137555 -62784 19840 96492 57045 -92595 -217204
11356 -217204 -237972 -229255 -191828 -97908 -39189 36419 -17027 -14170 -27997 8826 1813 -5258
11344 -5258 -35487 16160 33419 -12183 25645 69701 -32419 -78150 26662 9478 -41650
11333 -41650 -60407 -121091 -67521 11850 -171052 -206666 -169724 -81940 -63922 -79828 -65127
11322 -65127 112757 147263 101308 91736 54322 31984 65064 131007 112491 36225 58811 86088
11310 86088 76508 13339 -10258 -135534 -121236 40214 83503 32307 50285 50100 70064 161740
11298 161740 -5590 -119058 -197557 -77211 -7406 -27346 888 109329 158073 68008 -39493
11287 -39493 -29634 -92443 -148893 -46764 -27965 -56061 53995 136933 173202 153054 79749
11276 79749 46689 -57797 -101025 -61619 49090 14917 23016 6045 76153 50883 -42171
11265 -42171 -9560 17660 21683 87128 59400 -9449 -111363 -18044 98476 142079 113348
11254 113348 7350 -80478 -124650 -157491 -6810 116756 106864 121510 118145 158717 72450
11243 72450 98069 151232 159241 164502 136678 73548 -58011 -126698 -94692 62194 178660
11232 178660 151343 214437 248504 484074 788317 1271282 1824337 2266247 2438825 2272827
11222 2272827 1913696 1383441 896079 694988 502497 230123 115184 -10495 78416 147172
11212 147172 152488 90773 196717 157845 79969 143374 211071 311995 231184 93311 102465
11201 102465 108859 104439 100501 -40706 -47991 62628 18006 -53863 -28730 -11719 43592 35163
11189 35163 -42319 -131130 -56878 81844 132914 21650 -16068 80893 38361 -146821 -218735
11178 -218735 -217621 -146625 -75650 -110999 -80603 39655 63645 -3552 3932 30615 11769 -73430
11166 -73430 -125629 -170627 -161144 -43186 -112029 -75525 7782 -88115 -71810 -84036 -52100 -14514
11154 -14514 41744 -3242 -33822 -42353 -50015 -162735 -163722 -218629 -93327 -65997 -100408 -145165
11142 -145165 -227261 -221126 -198802 -349039 -342521 -266811 -156728 16361 54518 -81550 -170435
11131 -170435 -267138 -167085 15254 43703 42405 -18953 -65505 -112973 -185393 -211116 -167987
11120 -167987 -124786 -127591 -74098 2195 56001 49199 -50891 -40922 114002 104204 19111 -28406
11108 -28406 -10835 -8026 -112833 -143001 -158893 -32959 -41864 -85500 -155504 -225448 -196881 -31885
11096 -31885 39265 -44785 -93505 -55439 -2648 30018 94803 69412 -47253 -190524 -254922
11085 -254922 -111682 51898 -71513 -66392 -72002 89816 86953 113673 68483 -38361 -59216
11074 -59216 -59931 -5239 102313 134717 92662 6444 -63632 -39182 -60479 -70844 -67313 13692
11062 13692 -48072 -82443 -3244 36902 72907 119 9865 89946 97637 30467 -16010 -14719
11050 -14719 -103217 -65082 -53616 -71379 -20054 11869 11781 39829 -35271 -26378 -12079 -41533
11038 -41533 -12581 -71690 -79606 23225 34998 -53215 -173403 -190506 -169792 -72018 -11474
11027 -11474 18212 59122 -133 -17350 -120212 -188016 -142141 -42313 8347 -35924 -42118 -65291
11015 -65291 -42122 -32238 -42291 -18776 59990 156893 163211 185963 17196 -195563 -109234 25932
11003 25932 -56816 -77937 -58986 -59255 -99415 -197940 -250266 -218747 -23474 54803 48887 65178
10991 65178 -10999 -81244 -92537 8094 102871 -54890 -141914 -169500 -148312 -156877 -191555
10980 -191555 -74341 27283 -107815 -150782 12219 -67596 -218023 -201896 -47883 91509
10970 91509 196000 172395 121356 18567 -103273 -155526 -171254 -206208 -261475 -292107 -247634
10959 -247634 -70238 -9956 -89053 -219249 -66433 -92025 -153031 -47403 -16474 -60625 -22044
10948 -22044 -43435 -6693 1914 6611 15701 77841 172325 219752 139044 67401 -97895 -201145
10936 -201145 -226330 -170881 -245823 -253636 -180210 -174880 -122816 -143917 -58466 99832 124444 75367
10924 75367 32347 -15282 -18903 -122813 -163725 -57739 22879 125728 153622 83353 -44204
10913 -44204 -21872 52677 16658 -13925 -85583 -113596 -92411 -77588 -2124 -3885 31467 72102
10901 72102 -2116 0 54174 -41363 4180 20257 -31218 -72178 -139663 -207980 -178350 -149906
10889 -149906 -121356 -153024 -95790 -107657 -184396 -213892 -132730 -5115 23834 -28322 -3310
10878 -3310 100198 152094 89799 104359 -19129 19307 -3556 -184841 -92264 23415 75785
10867 75785 89664 10214 -26076 -64173 -87518 -71501 -47322 52373 52058 -154269 -232153 -342018
10855 -342018 -298612 -188815 -188744 -242974 -253516 -104920 35771 29659 -132985 -172669 -125713
10844 -125713 -131104 -114071 -13104 -12146 -27207 -41531 -77363 -234920 -233278 -126155 -131751 -173120
10832 -173120 -149185 -195172 -124844 -184651 -73200 188781 251957 241310 61291 -38001 -134662
10821 -134662 -147761 -198952 -338552 -317186 -162273 -102436 -30522 16586 46655 -2942 58608
10810 58608 136935 70002 -21992 21579 29261 83917 82850 84176 58632 -27575 -191886 -213274
10798 -213274 -237235 -179670 -98189 34888 103683 108 -80275 -116250 -76087 -17842 53102
10787 53102 103900 164885 157759 79103 98135 89857 77571 -91249 -150996 -84976 10532 77336
10775 77336 35491 18230 125478 117519 94391 93380 167349 83402 106654 159961 76868 103112
10763 103112 136456 81708 -54953 -220289 -232801 -98791 64050 143481 94722 -84059
10753 -84059 -83189 -51730 -92345 -95893 -122736 -65520 66478 61767 -24742 -57237 -41240 3844
10741 3844 -49603 -77121 -54226 -25689 -48497 -48032 -27239 -81478 -202415 -255684 -207546 -89627
10729 -89627 8964 14664 -212111 -270780 -138351 -150686 -117450 -15398 6224 -22137 -41519
10718 -41519 -157311 -122634 -2491 83844 166451 -68448 -174242 -148312 -74136 -927 -15695
10707 -15695 119811 213712 257240 160077 94084 102804 34320 -124699 -246054 -172124 -88473
10696 -88473 35636 -3506 -11948 58001 -14106 -6710 41713 46198 -36702 -48998 -98344 -76453
10684 -76453 -91074 -59284 33728 18289 -14079 -12724 -76778 -59770 -6972 30326 -85420 -110144
10672 -110144 -187955 -241407 -377676 -337327 -328407 -219996 -83256 -93829 -111669 -249255 -321273
10661 -321273 -298815 -157305 -96863 -509 -11596 56340 -5875 -132180 -190769 -180258 -21757
10650 -21757 48372 14855 -35017 -102123 -107528 -51688 20856 -108563 -54617 100779 154285
10639 154285 141796 111227 168332 225405 131726 96768 73780 74423 124937 114549 138245 64325
10627 64325 61263 72693 130978 40568 -60246 -65509 -32897 1896 165505 166466 101236 165844
10615 165844 176558 107223 88097 84824 18819 9880 -19247 -116516 3798 150787 144045 -59068
10603 -59068 -85253 -3724 43678 61508 62161 -56660 -40377 -9771 947 41597 -49235 -56716
10591 -56716 -40460 -6609 -24663 -81905 -120082 -207018 -176307 -158592 -115875 -12310 -34408
10580 -34408 25861 -63216 -139283 -178394 -204816 -62393 -49507 -75460 -79012 -231208 -263688
10569 -263688 -284239 -229872 -99861 35773 95795 57288 71456 -37850 -66077 16331 -2472
10558 -2472 -51749 -67762 -165103 -95970 -94951 -95722 -43325 -87235 -119945 -130978 -200507 -223936
10546 -223936 -163782 -23338 16154 -44288 -7623 64599 149309 82911 -179492 -203329 -139419
10535 -139419 -127292 -107696 -66522 3397 -71914 -97924 -179199 -228362 -304671 -278121 -115459
10524 -115459 53521 -53599 -134544 -128181 -221691 -152203 21734 -18750 -172867 -227777 -306559
10513 -306559 -93602 76421 -25406 -92190 -131747 -23596 5895 40226 64824 -56639
10503 -56639 -73238 -44035 -24355 91 -157905 -232000 -27405 146384 156057 39378 -24359
10492 -24359 -20165 -55511 -132157 -248189 -126066 42090 -4298 -103317 -112504 -199996 -128312
10481 -128312 -42453 58950 161967 202194 228376 135992 42036 48102 -74658 -10687 86611
10470 86611 35993 104630 16262 -16668 31662 73939 68744 44193 -70004 -72133 -110295 -90358
10458 -90358 546 -32755 -21854 -125330 -135529 -131214 -79279 25689 32167 -18909 -97484 -212801
10446 -212801 -203168 -72131 13402 14129 -67664 11602 -29154 -164240 -133744 -193770 -149217 -125215
10434 -125215 -93909 -67209 -46988 -8849 -2647 22142 -27803 -161373 -92297 -47568 -120697
10423 -120697 -187229 -176165 -183154 -185045 -169976 -211588 -189511 -148947 14839 18163 -6663 9914
10411 9914 -80502 -60391 -97401 -150707 -130480 -126732 -205788 -273712 -134379 -62126 -33857 -163199
10399 -163199 -167627 64697 91745 132181 209076 123144 -82983 -110628 -249715 -293243 -198936
10388 -198936 -120607 -55167 -24438 31745 117101 31320 -34393 3035 78536 131319 120985
10377 120985 -66 -35431 22562 -13194 -59311 12103 -2005 -48154 -138607 -188464 -57301
10366 -57301 55971 39987 -47521 -146204 -148879 -176679 -200466 -276272 -236285 -143565 -170250 -118125
10354 -118125 -130178 -221552 -92510 15888 -16876 84001 28395 36116 99826 -10784 -117793
10343 -117793 -152343 -90759 -40569 -29896 -164219 -180485 -154887 -97533 -34922 4329 6075
10332 6075 22387 44063 524 -2714 -139669 -110015 -98039 -22837 -67957 42899 -20000 -55101
10320 -55101 32325 -180564 -192766 -103399 -91753 -13100 6814 29373 37492 -45781 -87329 -1778
10308 -1778 78150 119779 59102 -87889 -87864 -109529 -129852 -72096 -2281 183577 188830 44573
10296 44573 29571 117868 88864 -18852 71799 168301 121412 35841 -53407 -88016 -95778 -82436
10284 -82436 -5708 -69261 -99336 -157515 -133533 -156578 -113766 -25874 14632 68447 183664
10273 183664 263469 194669 118745 10973 -124 22446 17688 -8490 76822 129029 165793
10262 165793 58690 -77335 -232268 -211229 -139578 -45322 15126 84014 140268 88158 -58263
10251 -58263 -97190 -105490 -148668 -97075 -67855 -124906 -281135 -163927 -125587 -146566 -135619
10240 -135619 -93708 -28693 -97633 -248379 -300576 -155720 43881 123142 150201 115184 47365
10229 47365 -12089 -137878 -110377 -70302 -40888 117825 158002 89539 -13628 -73569 -52528
10218 -52528 -76675 -140740 -24701 7436 -89978 -242387 -282680 -140922 -61438 -50675 -36448
10207 -36448 51316 250533 320383 242024 52085 -43331 56744 89194 67808 -7422 -36346
10196 -36346 15742 143196 209912 340453 375683 362746 321873 213934 80740 75784 -6313
10185 -6313 -155040 -51845 -45486 -129041 -77872 -45661 67183 100205 -150203 -153462 6578
10174 6578 135825 189813 290689 211158 117594 89383 -69751 -143254 -173861 -70232 9407
10163 9407 10703 -100673 -118980 -60495 63484 68974 95091 165322 112319 85647 52120 11630
10151 11630 -147060 -167487 -105571 -38099 115930 136496 122350 150176 81816 52272 86993
10140 86993 234129 350072 265996 205353 65531 -47172 -91915 -164960 -113454 65089 62171
10129 62171 39618 5916 -76215 -112670 -37028 -59238 -78534 -72287 -92814 38056 12118 -123139
10117 -123139 -198691 -282150 -305987 -299226 -181797 -110400 8713 14657 -85021 -74978 -2443
10106 -2443 -7266 -64835 -3317 -39292 87079 120799 48864 23624 24540 9324 -66005 -140669
10094 -140669 -84916 -31962 -8333 -6959 39766 96644 9106 -167917 -204274 41754 16979
10083 16979 -37986 -25281 59415 113976 -131867 -251021 -249118 -176503 -164321 -130756 -12549
10072 -12549 -88189 -145471 -163905 -100905 -32190 5013 101613 123441 -105779 -229462 -130123
10061 -130123 -97482 -40393 18866 74114 249703 330487 170984 152151 239090 240510 256409
10050 256409 225529 438153 643020 614419 524773 392170 235231 116593 64261 -10077
10040 -10077 46290 199412 152399 56788 131431 212497 169055 160755 169005 150246 11208 -87197
10028 -87197 -162034 -57728 -1445 88861 52965 -23020 -84239 -8222 145589 75507 -48377
10017 -48377 -80268 -87318 -29076 -19521 90747 14578 -93073 -105938 -82310 -8709 -28169 -72764
10005 -72764 -45899 -151617 -266534 -214135 -164050 -177331 29351 114829 104237 66653 49629
9994 49629 1682 -5634 18384 -50093 -72462 6477 -51940 24778 102913 33500 -8616 290
9982 290 -1274 46153 -51312 31544 139382 48829 71564 44552 7361 -70275 -119798 -136115
9970 -136115 -187810 -130223 -74521 35087 4996 -35034 16472 99356 162200 79802 66000
9959 66000 -57785 -126168 -93209 -22350 22096 -28595 95777 57707 -75248 -32049 106490
9948 106490 59414 -139273 -132848 3084 125625 161952 130495 38502 271 74511 104075
9937 104075 59531 -31261 -62209 22025 55230 9099 9734 -5047 -44498 -140993 -124686 -110318
9925 -110318 -18725 81012 186200 205155 -81482 -227096 -123142 -39164 52078 -12450 71525
9914 71525 139429 141651 129513 166625 50844 45507 45602 -41611 -36436 -39818 -174439 -212705 -96715
9901 -96715 -163743 -22571 163930 99633 89832 136875 187003 87274 136167 111052 -45265
9890 -45265 -94614 -118198 -6575 -43733 -17476 -3910 -28949 46964 -35035 23847 -2918 -86416
9878 -86416 -88993 -70851 16688 50455 57433 148399 105523 -29910 -6585 132788 134574 55191
9866 55191 125484 114330 40933 50262 420 9995 83802 40806 103626 184069 209501 298901
9854 298901 441615 558676 890183 1592033 2760600 4237334 5352302 5437982 4568804
9845 4568804 3288208 2105620 1383805 1129920 885387 643079 443295 239751 196872
9836 196872 159138 239306 250787 236964 170376 141814 108652 66445 19495 104561 100727 47367
9824 47367 63833 137054 94029 114440 58448 48261 49344 63529 116099 43714 207807 120346
9812 120346 -69312 -123161 -123279 -137572 -107972 -91025 -4019 38625 26544 107961 132181 9465
9800 9465 22973 -41086 -141238 -217687 -149236 -122672 -76892 2898 37915 54388 46480 -2581
9788 -2581 -68613 -61278 -99654 -137239 -173340 -121901 -131889 -63690 -6868 -54154 4398 123781
9776 123781 185703 241021 157252 114301 -34529 -151153 -49380 -42513 -103835 -153601 -60155
9765 -60155 -3600 -51841 -36991 -103490 -82800 -124573 -82067 41903 25295 3504 -2727 54761
9753 54761 -61368 -28235 -47198 -9107 108530 86859 45928 -5515 -77559 -40545 -18107
9742 -18107 30037 -60029 77677 92275 53304 69436 75456 24145 46126 54725 -103349 -55637
9730 -55637 -104308 -101762 -7948 60168 78195 51827 -31994 -51695 -98966 -203292 -216513 -188236
9718 -188236 -155966 -127457 -125188 -38935 3438 -43740 -79646 -73718 12010 56383 84694 135066
9706 135066 -10395 -104852 -285994 -290254 -271266 -248177 -289958 -197124 -85919 -69950 -29342
9695 -29342 79199 128687 84699 114577 204402 292867 129927 -40778 -117436 -43765 95410
9684 95410 114627 129348 222056 267707 216237 109266 -64549 -105850 -51267 82543 94406
9673 94406 5679 -157967 -287087 -209086 -175281 -73444 19547 -3628 -65083 -111127 -64930
9662 -64930 -17383 -51114 -145037 -176054 -110411 -39001 -17553 122226 124724 120095 156061 151151
9650 151151 154354 166434 99152 68605 81175 14792 77695 156081 44759 36946 70979 -11565
9638 -11565 -47502 -22277 -35742 -40609 17803 57631 53549 -55686 -65469 -119163 -55644 -66626
9626 -66626 -191314 -344094 -255882 -228043 -210352 -223555 -138719 -123892 -210659 -246097 -257995
9615 -257995 -209113 -201102 -243181 -340682 -472042 -375194 -234072 -180774 -121891 -39560 36256
9604 36256 40751 65356 52801 -60899 -68516 80724 120354 -84691 -115542 12562 10392 -15381
9592 -15381 82203 153519 89048 56523 59889 47568 94759 118324 146671 230697 110245 -27946
9580 -27946 -7563 52415 21791 36190 20947 -83978 -8653 58484 -3977 -58488 -114716 -133724
9568 -133724 -126710 -34269 80724 148983 -7602 -155518 -96364 -72143 -98973 -13349 -22558
9557 -22558 -73964 -123187 -225079 -198135 -156871 -121225 -80396 -54199 -134472 -266222 -114399
9546 -114399 -72993 -90347 -50203 -12347 23738 -63484 -136868 -86392 -135407 -234386 -221899 -243714
9534 -243714 -158689 -18094 -57937 -100066 -94200 101645 49859 102902 95213 5414 -102770
9523 -102770 -238121 -343077 -200637 -91807 -119033 -66078 34957 -80301 -191694 -192587 -201914
9512 -201914 -205623 -274353 -178364 -75148 -60794 -5825 49042 -15296 -184559 -192654 -204403 -171701
9500 -171701 -78219 -123443 -93114 -107634 13601 110329 58460 -90027 -206492 -219206 -177734
9489 -177734 -166192 -35334 79360 -16713 12316 32521 133725 120328 203927 152432 112306
9478 112306 12071 -70913 -37947 123578 199008 156176 104154 29346 -41054 -2950 -58874
9467 -58874 28561 114180 145951 125158 51647 62545 -13115 -101003 -76685 -50055 -34060 -14973
9455 -14973 -11573 21630 -70119 -74369 -73268 -116884 -117732 -69855 -63020 -49029 32473 46488 -31985
9442 -31985 -73033 52126 -14722 50366 -9236 -108114 -111622 -176828 -160846 -178533 -98895 8101
9430 8101 10592 -27069 21350 -32497 -152127 -163046 -120660 -102601 -27881 64740 39999 -5025
9418 -5025 65710 89631 -2490 36219 132527 202147 136297 101075 7132 -8648 -40511 -29193
9406 -29193 39372 86928 123140 174107 180236 3173 -18396 -85730 -129350 -27538 28240 114126
9394 114126 165530 303549 208574 16894 -31887 -101518 -114735 -1295 15835 -61726 55819
9383 55819 1035 37471 41155 -36891 -152692 -13769 97640 123492 116194 144224 61516 -13842
9371 -13842 147068 173299 219022 60602 12830 -10958 -31838 12640 52578 -53556 -75505
9360 -75505 -50034 12105 52653 161636 186220 128747 -10483 -104312 -112335 -136937 -104617 -5239
9348 -5239 -2175 -106670 -214420 -230101 -165796 -159483 -251471 -322920 -216209 -137389 -13772 74541
9336 74541 81252 76114 103334 43771 -171369 -147325 -76251 -35404 -24962 -31346 -28346 -35372 -65330
9323 -65330 -4012 -91923 -119388 -46403 -73345 -64386 21466 62222 40138 -39903 -112821 32105
9311 32105 55658 -41456 -103311 -72610 -54484 34667 99382 -79066 -106624 -62179 -54413 -129132
9299 -129132 -291129 -397585 -281362 -143185 -64118 -19118 -33623 -155455 -121386 2498
9289 2498 76534 32977 -21609 -22728 1298 50479 38513 -25518 63798 65228 9325 -23952
9277 -23952 -87609 -81585 -22137 -3120 -1819 24812 -35435 -27747 -24394 -91054 -72558 -72162 7161
9264 7161 -12658 -77690 -89520 -101505 -130175 -58659 65747 31347 -117718 -249182 -261692
9253 -261692 -273441 -232797 -67643 4528 -39269 88 3415 61831 148961 84111 -66828
9242 -66828 -111948 -67146 -34729 -36166 -66161 -17699 -80314 15954 129927 19831 -9891 90855
9230 90855 142651 -7974 -24032 94959 -7753 9741 112825 123595 64648 103338 14858
9219 14858 38145 70587 107055 134004 75901 50307 52902 -20886 -51616 -195125 -285502 -152283
9207 -152283 -59839 -73516 -131729 -127885 -111598 -80542 1749 55349 54486 78099 13906 60923
9195 60923 126413 116466 78699 145713 244741 360107 317745 214687 233523 278128 277462 209063
9183 209063 50779 68037 324096 482933 389799 324639 428313 423837 496588 515340 489957
9172 489957 477691 520147 610162 618087 628684 615944 643651 763736 791941 933596 1182458
9161 1182458 1388267 1577936 1903259 2285372 2566289 3170469 3977847 4957752 6148977
9152 6148977 7763262 9754047 11729583 13298636 14164300 13914258 12715681 10965082 9149096
9143 9149096 7545266 6222586 5145065 4299835 3597891 3065931 2632499 2235297 2040988
9134 2040988 1829960 1588318 1421666 1340122 1195250 997738 899254 1003805 925765 746524
9124 746524 584560 563004 594709 566687 493555 409037 322853 208822 65626 144222 269703
9113 269703 281203 264930 264067 290317 236216 128691 169261 194989 242865 97297 -130313
9102 -130313 -128725 65877 38685 -50387 32489 105871 143422 128558 147969 147555 156887 135392
9090 135392 1476 -42884 153140 203231 185194 63476 88258 66897 24412 43696 21328
9079 21328 -23491 -2969 72777 156415 127328 161090 183831 130701 31319 6945 -29949 -66063
9067 -66063 54883 122374 115764 5641 -74248 -114083 -53201 32441 84693 45271 32603 -93259
9055 -93259 -167836 -211431 -158599 -25290 210043 342556 276079 139064 85048 137987 220315
9044 220315 253312 210844 192733 134368 124279 124889 41612 -25096 117687 261229 277019 158408
9032 158408 119638 152335 131465 61246 -64268 -101894 202 54315 -41697 -219745 -293733
9021 -293733 -240112 -272852 -282619 -212417 -143117 -120206 -111864 -159118 38179 189389 137007 36651
9009 36651 -99854 -79016 -95289 41021 192169 156072 85421 160622 85336 136361 165742
8998 165742 25922 -87468 -107829 13212 68310 -55816 -179168 -139049 25148 149081
8988 149081 259568 178626 47592 -92311 -296839 -172767 44147 110881 59024 89941
8978 89941 54410 74158 78823 169403 194808 109355 65310 -50028 -150389 -18972 7578
8967 7578 -63788 -82345 -98565 -20817 -54246 4452 -34093 78026 156240 191274 166304 219652
8955 219652 143352 99802 -25805 -66767 -18575 -30652 -9967 -48421 -145762 -184744 -240702
8944 -240702 -274994 -190008 -149112 -104197 -44278 -112734 -71935 9092 18151 28279 -26891 -75240
8932 -75240 -98885 -68503 -26023 -53060 -81224 2780 28522 40117 123049 101306 100045 86364
8920 86364 -41893 -127108 -177344 -114073 -10591 -28857 -5972 7981 87690 93182 -15576
8909 -15576 -78214 -70214 -76534 91935 115322 -52089 -78429 -133908 -179286 -67892 -17961 -42433
8897 -42433 -38677 -72811 11944 107267 111440 4160 -104101 -184773 -136573 -98739 28097 -11533
8885 -11533 -10067 24688 59555 19554 -59316 -1018 145482 127571 78083 74931 95416 99750
8873 99750 175683 237482 168748 155740 70429 18057 131201 139215 100064 15439 73599 3492
8861 3492 92132 108686 30383 110169 178785 152022 95824 80790 191013 219867 231198 286214
8849 286214 76128 -54553 -40808 125259 199334 117715 179353 277420 294519 212493 18407
8838 18407 -42160 -25366 -59932 -17032 -36683 -94165 -82610 -89123 -101819 -129860 -146117 -11
8826 -11 81323 99520 123085 -104822 -228921 -122687 -141619 -133219 -15598 29147 -36658 -109579
8814 -109579 -92574 -79714 -54165 11635 -1780 49876 124816 152279 127501 74608 -23095 45755
8802 45755 52017 -120642 -10245 82513 13923 -18969 73166 40512 82698 156901 165311 37740
8790 37740 -125403 -44103 87088 82992 23174 51992 24554 30147 77550 148059 53562 -66821
8778 -66821 -5327 -11019 21267 70155 -56585 80815 122003 60083 17424 -5441 -38434 -21151
8766 -21151 3261 -61533 -99230 15988 -30726 -143804 -31001 121005 44309 -56628 -147486
8755 -147486 -229460 -153665 -25910 7511 8831 53907 31568 33985 -114968 -175777 -9479
8744 -9479 148870 19702 -2292 -80450 -212274 -261859 -290675 -110282 33759 -30751 -14509
8733 -14509 -31193 33213 113290 108654 -14185 -129353 -16471 115612 79114 44415 21202
8722 21202 69381 76792 132786 70496 68678 210123 224326 157206 -7574 -23036 -89383 -139773
8710 -139773 -107831 -78322 25500 87253 173109 310213 228719 212443 53944 99303 139492
8699 139492 141015 231507 321015 222236 112001 -11410 23843 1476 80222 50970 67574
8688 67574 90187 29865 41511 29846 1163 64549 -78452 -175591 -95014 111176 191351
8677 191351 158561 129618 140207 38846 -94821 -60842 53512 120611 186238 101946 148451
8666 148451 201119 99534 89977 142305 74514 88274 40049 52478 102249 78843 17046 -33999
8654 -33999 54464 209231 295104 265737 230606 259066 340007 713029 1226816 1525690 1365620
8643 1365620 1074469 842148 578842 460560 424159 338424 162966 156863 196899 280319 337077
8632 337077 203591 89118 129350 53269 -53340 -32475 112773 136070 116625 157819 65572
8621 65572 -167883 -65230 81662 213203 217725 63117 27899 95874 148903 133130 124770
8610 124770 125731 204001 246544 332762 394171 431476 469093 738940 1330884 2334056 3114732
8599 3114732 2990878 2543496 2092036 1562883 1061476 862113 854841 923690 696725 656129
8589 656129 672838 636439 634858 562153 495762 563026 555102 443191 349409 435273 431155 363060
8577 363060 277180 103494 39101 153299 184212 169808 73030 32458 133704 130927 80330
8566 80330 80634 9048 -65572 67394 115469 10373 -116256 38424 294675 496274 991940
8555 991940 1404337 1384565 1176252 838946 494184 312101 257601 190137 30587 -54113
8545 -54113 -161068 -120325 -12985 98249 119231 41060 81907 97404 48017 -78000 -183329
8534 -183329 -55566 28462 -24517 4255 180772 217098 281753 362491 262080 149360 102999
8523 102999 49376 78170 26044 -16417 -99968 -6841 1447 46908 108183 158866 232269 207461
8511 207461 135236 166995 180934 146363 43519 64585 88893 109715 174062 225569 210397
8500 210397 190826 57008 3104 -116652 -28298 55070 30876 89654 74829 -27186 -44549
8489 -44549 18590 38608 21834 -34935 -117378 -234258 -282939 -147074 -111877 -111071 43769 121741
8477 121741 146248 -50055 -178393 -121579 -28606 109231 23652 -15931 -56825 -33906 2567
8466 2567 23815 17474 63586 26037 20632 -9128 -29949 -8247 22997 177428 191562 125761
8454 125761 130695 127583 29512 -81290 -108012 -84615 -49037 -28235 -2986 -41372 -118588 -74511
8442 -74511 34008 84460 86539 94999 2112 -4673 7193 -3071 106957 73519 92284 130929
8430 130929 8191 -107523 -57085 -66897 -70259 5468 -17822 -108333 -47709 36966 59635 34656
8418 34656 -71207 -137386 -200268 -153016 -53053 -100140 -40872 -831 -84995 -102540 105362
8407 105362 61203 62779 90118 133596 156249 27963 -7803 112895 155941 84153 -6585
8396 -6585 -122813 -129867 -158461 14114 48290 -1216 61306 167293 85825 -21053 -103948
8385 -103948 -121630 -89237 -153473 -148864 -89260 -67526 -94683 -15939 22088 53427 -18386 -50771
8373 -50771 -65915 -87801 -80745 -168789 -95962 -177356 -243555 -127680 -21879 138171 212644
8362 212644 -7232 -29438 41026 -4042 -90547 -54281 9759 91788 5649 -29620 -7735
8351 -7735 -43962 -51555 -42124 -53407 48222 104919 80906 -35197 -48977 15173 -14667 33293
8339 33293 -20507 61644 102058 88599 59381 70720 130503 49919 -1456 -26911 -40374 -23181
8327 -23181 -4915 -26228 -42587 85658 84359 -4928 25068 -15671 62842 75884 38835 161567
8315 161567 106489 81844 105439 175045 158945 120430 173588 215294 212007 202983 84189 57750
8303 57750 80822 125592 76478 76654 40601 -34481 20573 75175 -45902 -25576 -44379 -100385
8291 -100385 -80019 -269716 -289307 -232650 -224270 -174740 -52180 -438 96070 138634 75421
8280 75421 67912 42831 -62705 -117264 -75166 62696 103517 -70609 -179319 -226361 -246214
8269 -246214 -242130 -235004 -164191 -112268 -108504 -132076 -132959 -158661 -144367 -122897 -18494 9794
8257 9794 98683 63039 32135 62012 92017 125551 244924 233691 166031 108864 47398 -38948
8245 -38948 -99443 -114269 -3540 21610 35626 45096 99388 44906 -6271 -8991 83161 8598
8233 8598 -84917 8501 135521 66935 94396 42806 13665 -43850 -91927 -1542 112281 215678
8221 215678 128794 116952 -12893 -40080 43449 120632 116473 30450 7985 95607 92588 -78101
8209 -78101 -94034 27073 -3778 -82832 -141954 -85876 -27450 37682 30510 30640 106422 262175
8197 262175 189470 166943 136183 135724 222328 218197 91550 -78838 -47411 22454 28140 7314
8185 7314 -30307 -78822 -50552 -62317 -31307 64626 183363 161019 92340 205332 227721 75940
8173 75940 -154069 -55489 53526 -68935 -138393 -57940 -61613 -50561 32186 -48905 -89297
8162 -89297 -58773 -71525 -52458 75483 180153 200876 183876 47387 66378 114077 41411
8151 41411 -58004 -92052 -54778 -62730 -74349 -46979 -31341 -66608 -22424 92383 53772 36432
8139 36432 78506 780 -31542 87915 71549 77555 -11998 -80566 -10253 51014 71344 73032
8127 73032 -8720 -30253 73052 33019 38442 41560 -35095 -68982 -75978 -147646 -159192 -133961
8115 -133961 -21136 -33390 -23548 32449 54011 39614 11561 64960 10372 -47627 -64250 -135997
8103 -135997 9857 32647 -34983 -232192 -227833 -175704 -120155 -211679 -222505 -244704 -352284
8092 -352284 -288364 -250825 -161081 -51517 -45471 -51677 -138391 -100898 -163439 -109552 -75278 -40516
8080 -40516 -39513 -25144 13244 -30614 -173648 -247409 -258615 -300736 -236417 -139125 -11780 -111886
8068 -111886 -174981 -235985 -188309 -98898 7896 -17226 -13199 -9485 14953 132213 287325
8057 287325 239443 158764 172519 249438 312963 134503 65631 164897 140521 146000 57443 -27172
8045 -27172 -112355 -158455 -33833 24667 -3336 26696 153389 156482 219104 319146 265550
8034 265550 113786 121801 86941 147433 231846 107665 9217 62099 94002 36816 -88337
8023 -88337 -150432 72574 33680 -81189 -66346 -34588 -42869 -2153 61439 14618 13915 196070
8011 196070 256880 229372 191987 46963 8142 87013 60869 -30328 81717 108928 -8503
8000 -8503 -27637 30501 109159 118657 133081 81716 -33468 -115468 -31655 2816 44013 51561
7988 51561 -88363 -171389 -269757 -193286 -153990 -125363 -85355 53279 35712 89904 84545 -93775
7976 -93775 -199657 -126204 -160672 -73846 66069 89624 -7820 73161 135230 128364 47781 28151
7964 28151 -39702 -73811 -13375 117345 229502 216830 189462 189187 232837 292397 249478 54554
7952 54554 55641 114880 34512 71466 187385 73529 34516 90329 80871 68171 89883 122837
7940 122837 128342 131437 160628 190276 238453 351413 414249 320447 203297 101157 137645
7929 137645 96507 7508 -117604 -153640 42049 168848 242859 304857 423560 405776 229871
7918 229871 243669 219321 173500 175148 211547 183188 220474 169171 165417 92327 67422 99314
7906 99314 29570 -29148 -46316 -101273 408 184155 89606 -46794 -12961 57056 67225
7895 67225 7431 -50847 -15052 91413 46138 -39251 -34559 -10162 28129 -70409 -81574 -91578
7883 -91578 -102763 21394 55606 61774 148993 231542 228692 253334 156548 183570 271031 230307
7871 230307 290265 264262 157508 267160 272887 208346 183057 187564 274605 124610 122911 98630
7859 98630 10747 21670 -3722 -120284 -131417 -79623 -85113 106 -17689 -145977 -40889
7848 -40889 5132 76995 72670 50235 35964 75042 98154 34855 17057 15933 -23022 71049
7836 71049 73664 2941 -67776 60814 93532 58211 5270 -30067 -106989 235 16410 -71125
7824 -71125 -179631 -101792 -35325 -46689 -105852 -142946 -151489 -64735 -79223 74251 198310
7813 198310 155107 124995 69398 -86345 -189823 -102198 -172137 -237430 -213840 -40764 38171
7802 38171 53377 -15035 47522 30863 -131952 -244850 -209875 -168083 -149794 -138018 -144194 -139973
7790 -139973 -108036 -125631 -91596 21279 -46266 -78785 27120 49624 142083 217607 202204
7779 202204 74596 177695 248602 232043 204349 205520 153348 59746 123545 221135 176321
7768 176321 168965 46567 28926 -189441 -197004 -38185 150803 202612 95435 26271 70402
7757 70402 44867 -9094 66349 181847 199307 25908 -93791 -150270 -267082 -179999 -68013
7746 -68013 -42692 29927 114791 -7640 23724 126100 83456 -3669 24172 -44470 -103292
7735 -103292 -25385 93037 141299 116378 103943 101505 47823 33893 -645 -97139 -140007 -238844
7723 -238844 -159452 -12112 136449 150771 40161 -7131 -34682 23859 92979 82144 27305
7712 27305 10441 61190 100170 -75423 -50210 62640 16503 21805 -163 -51180 -63391 -10384
7700 -10384 7632 -79323 -28068 202423 178649 -15518 -31722 24616 116538 215906 255456
7689 255456 116490 20247 109597 168004 137520 96614 90303 29837 136123 204438 106321
7678 106321 157262 211725 205896 31900 -86402 -104192 -130418 -96577 -79643 -7909 17242
7667 17242 -45075 -35634 -131446 -222896 -156955 -163832 -181334 -78105 -63379 -131537 -171109 -122578
7655 -122578 -66307 -83656 -5830 10438 -50639 -11517 -7661 -168215 -153382 -219947 -164771 -103432
7643 -103432 -10519 8993 1395 -75373 -198107 -245640 -179383 -209378 -167272 -50412 51699
7632 51699 62217 -41274 17667 28989 -16904 -50999 197 -47769 -34873 20743 -11704 -26851
7620 -26851 22992 15697 -18829 -35418 34605 111285 272228 306854 209328 253580 383154 395702
7608 395702 226624 150019 97632 147340 127642 230401 90609 35305 116350 115377 97378
7597 97378 81153 217679 254001 92424 19272 -13175 -818 3838 -10114 72796 107317 126608
7585 126608 185143 110067 6785 105761 66954 -21599 -3993 26307 55026 146711 193487
7574 193487 117537 106758 200450 237384 156690 14266 -22655 18007 75646 104954 87731
7563 87731 115589 21264 2690 125248 163188 -2144 14591 130948 77875 8359 26404
7552 26404 185443 156901 -26248 9662 261 -151861 -141223 -7305 36426 -77251 -119634
7541 -119634 -34391 -13452 -82003 -195223 -217923 -142463 -20963 97912 208875 188005 227865
7530 227865 112520 52764 -58104 -104279 -73252 3096 -14827 -23728 24610 -19367 9552
7519 9552 11241 -112290 -149310 -42948 161633 87687 -20683 84398 138812 162612 260344
7508 260344 240501 95389 -63688 -86414 100118 159301 68101 78805 50859 -27980 -4674
7497 -4674 123340 113637 135231 99677 8110 -84702 -4495 28265 -83521 -30523 -20376 -13476
7485 -13476 -89409 -114715 9578 125004 215152 158319 87804 -64961 -25927 -63767 58468
7474 58468 105561 60720 75266 34843 -19385 -39938 21798 38255 65962 9444 -83199 -96790
7462 -96790 -22844 -147360 -105903 -75049 -92667 -153279 -256725 -245257 -76750 50460 11848
7451 11848 45976 104934 119617 117010 38020 40927 85441 149644 113260 139802 260138 212617
7439 212617 130381 77658 -35872 -34980 -94026 -164004 -106880 -25023 109458 82714 131310 308344
7427 308344 283032 278780 175149 54260 -25346 -25956 -45040 -38850 17962 -57312 -90259 -49664
7415 -49664 5596 74006 100110 26763 -116029 -131383 -116879 -179428 -157510 -157863 8442 79579
7403 79579 -11953 -54745 -75547 -4932 -101090 -110992 -149828 -181413 -182030 -152535 -158640 -112974 -9996
7390 -9996 129553 290296 379872 185434 98902 124560 103286 195920 199800 285918 226874 20129
7378 20129 64902 83301 95666 211388 134944 158564 176204 170159 176880 91623 60211 -75845
7366 -75845 -103747 -53704 60675 176559 151520 90560 26972 36847 119093 150095 119076 11180
7354 11180 75084 75526 -12961 -33309 91241 147775 125753 53828 54355 55659 87972 32649 19301
7341 19301 30024 50102 -20259 -32168 -44777 -59029 -131286 -185975 -142398 -64442 -107201 -25294
7329 -25294 10206 58399 68455 114094 155834 78506 71452 3571 -57314 -42985 11869 96299
7317 96299 287974 289629 215587 59679 -117531 -112266 -87384 -109468 -178369 -234314 -204778 -111631
7305 -111631 -24549 57140 70249 105240 229884 194911 48598 -28828 2017 50543 -48438
7294 -48438 -4292 165443 172854 162965 151315 124849 70093 134294 189649 158034 50142 24403
7282 24403 -91427 -144479 -13861 -44928 -29317 -33346 -88213 -61020 -104769 -180445 -70501
7271 -70501 -44438 48940 118298 119468 64405 -58472 -54198 32010 180490 214956 85229 -2934
7259 -2934 -57776 -93070 -92709 -21002 64153 80726 75116 44878 136297 70937 42138 12080 -528
7246 -528 184334 196517 257687 176359 -2184 -117098 -136434 -190123 -239822 -275955 -281473 -181187
7234 -181187 -52935 -77830 -131293 -131135 -123368 -156968 -186059 -81184 89017 196788 251161
7223 251161 202462 117594 -47839 -196620 -179065 -197708 -54470 73556 95396 209633 129990
7212 129990 37918 42822 11175 -21579 39226 71097 81386 124638 -15942 -87590 -8970 21254
7200 21254 62139 -94764 -88761 -121450 -140068 -158027 -69053 3140 47403 35027 -33107 -13203
7188 -13203 86430 43661 17800 -5145 -8879 -72473 -140002 -134995 97995 229094 186201 78809
7176 78809 114985 43612 56934 -58593 -35224 61912 76123 106480 89784 135864 237688
7165 237688 205720 24059 14957 125356 110881 44321 -57846 -79986 -125571 -74919 58087
7154 58087 172954 140863 80521 147925 165720 152721 136572 118633 55386 -56549 -116435
7143 -116435 69275 146879 104414 90351 165703 188002 191336 177758 163744 179461 213609 249064
7131 249064 288001 366975 275852 130542 129316 162301 214958 263406 292136 228457 136459 139304
7119 139304 148388 75080 162325 101125 49987 172527 219771 159689 -13950 -11681 146897
7108 146897 196713 228966 322068 326979 360707 292182 140835 50241 67203 162975 170472 166113
7096 166113 136271 92120 70544 22794 64626 86586 287377 295811 250313 295057 350885 308326
7084 308326 313384 329648 171380 -6186 -34075 -105438 -187774 -83688 -8546 98682 126919
7073 126919 106569 173632 146154 142800 234531 260630 252087 176117 63552 61786 205129 142913
7061 142913 275234 388925 292117 172160 139246 234248 265121 155080 152518 250914 272119
7050 272119 290161 260031 225495 188600 164290 148348 79798 131709 180715 260559 446056
7039 446056 875360 1104325 1236705 1216215 1090405 782105 583279 398402 272901 275854
7029 275854 263739 189041 309359 438892 513001 511976 812783 1263205 1396553 1251278 1153689
7018 1153689 945377 727039 605324 516968 430581 308106 165777 109368 139638 133752 191567
7007 191567 299621 209599 192972 239448 409835 851224 1431631 1784304 1763250 1614102
6997 1614102 1116253 655482 530904 549633 488377 400880 369977 362688 345180 279226 220712
6986 220712 200223 146455 229908 319232 330393 259590 241311 233241 342364 357400 315417 316447
6974 316447 154932 113331 167674 199152 198216 91192 61778 141058 133856 97266 204956 242032
6962 242032 264333 304095 287596 149168 143333 142153 36289 116432 251372 214889 259247
6951 259247 423962 419895 324765 217095 216893 176601 105230 73949 108002 262441 303253 231249
6939 231249 167458 71349 48385 81060 192795 116921 96766 80063 -19100 56326 200994
6928 200994 274732 226803 72085 15894 36888 73264 174563 326383 248920 159655 184871
6917 184871 131731 150911 197967 80041 76076 127896 114261 75829 76293 55094 -403 -992
6905 -992 21430 -110958 -92932 -18878 -27423 -18607 124471 96971 -23361 25256 49942 44837
6893 44837 13740 6102 218549 256299 312633 346879 365807 263786 282436 192892 107770 73972
6881 73972 227929 219082 175756 262380 282288 153775 129588 130474 14090 -89131 -126490 -6009
6869 -6009 161773 260729 223785 68977 -33284 -25444 11549 -3456 -23094 56773 195461
6858 195461 182509 76763 14434 149886 300245 166471 191529 213363 256215 258113 292940
6847 292940 252920 204706 163626 194448 295490 232959 83650 151777 215999 267531 271923
6836 271923 251990 111017 118036 169896 259623 461006 547933 501916 549763 396247 424312
6825 424312 412779 197084 180560 199642 163203 30868 -159887 -96810 58824 123738 141879
6814 141879 162414 133610 129014 115333 197738 244810 229213 244417 31114 -21344 150180
6803 150180 271664 243523 255405 289514 200851 143205 204735 207629 44242 -50035 -57356 -87755
6791 -87755 -21146 107104 52041 126406 239055 190379 180823 110369 7910 -40234 -17128
6780 -17128 131648 97367 -90743 -119692 -32094 -55045 -200724 -332710 -247628 -84703 152646
6769 152646 259662 122170 9899 6172 52933 317658 329033 179584 228381 287188 347447
6758 347447 250657 224528 241587 272474 360523 343263 201386 134558 59363 15049 69396
6747 69396 285242 361539 367770 464707 434113 307071 232215 309158 177038 161611 92461
6736 92461 91214 129915 205663 105416 162976 243317 218029 174467 145203 109151 8041 59455
6724 59455 155236 259735 329010 482673 718999 1088230 1478166 1739131 1568676 1233630
6714 1233630 886325 630430 481222 497793 481975 288682 309782 187873 86742 45108
6704 45108 26223 162769 238926 195444 195445 130941 292389 369246 261315 208736 136096 82564
6692 82564 38809 -38608 -85109 -146678 -142929 -66582 -10675 56448 68778 65918 -40364 27841
6680 27841 106108 75427 46970 99031 128021 144672 80863 -20793 -50406 -6197 -15202 29580
6668 29580 58804 17230 -80462 -125350 -45405 -88980 -56433 85361 198554 168382 121853
6657 121853 280511 327458 328974 196928 -3005 -61392 -187299 -92903 -49890 -119157 67621
6646 67621 86664 80416 67389 51852 46812 46433 168586 264015 174821 126093 66904 -175436
6634 -175436 -303989 -162141 -127650 -157968 -99733 -90447 56499 138506 90882 158090 171769
6623 171769 147520 137722 100075 22284 20047 -43970 3970 108111 194078 244037 319151 290754
6611 290754 225795 134558 54004 -33634 5300 40845 173448 259547 217400 140860 198062
6600 198062 85373 39379 12568 -73333 -157094 -130549 -90128 -70263 -5164 14503 38529
6589 38529 27211 -54966 -3915 85016 159761 164027 -9405 -79577 -38219 78412 133354 125924
6577 125924 220298 186183 120999 106213 19326 -9811 -31817 -61975 -41747 3271 -30115 -149979
6565 -149979 -113982 -46482 -33399 95625 146065 209416 173502 112202 280775 243614 133550
6554 133550 116485 72805 -28275 -52096 36272 146777 151579 21179 -101042 -169735 -66737
6543 -66737 -80089 -54297 71958 39467 209739 304020 207202 103014 64852 87182 66576
6532 66576 -37339 -223711 -197099 -150157 -146314 -84449 -85353 1698 85930 -12458 -99407 -23520
6520 -23520 -44720 97217 187942 79554 -604 9744 218595 211332 117115 23536 -82337
6509 -82337 -106029 -97524 -94465 -108199 -80478 -88664 -136864 -79307 22851 88862 -9234 -147704
6497 -147704 -238315 -187097 -94129 11602 -13698 -7363 23016 81956 177226 272192 197862 112141
6485 112141 -18025 -22543 38497 -60141 -113890 -81637 -14563 -41869 -145585 -188131 -58065
6474 -58065 -44677 -113429 -153974 -64456 15147 -31098 -78310 39369 134726 132523 150595 185119
6462 185119 108467 139866 116721 -25513 926 13565 81470 114900 -37495 -109858 12078
6451 12078 42658 -60092 -57631 14166 85394 63202 171967 61716 -127236 -117970 -31606
6440 -31606 21546 92267 202871 190325 61237 -163312 -154336 -26969 -41616 -39899 -74057
6429 -74057 -14156 -40237 -17834 17180 -10223 6190 12114 -86512 -117281 -81990 -104976 -124873
6417 -124873 -192771 -191713 -198677 -178694 -177768 -95212 -47857 -52851 -104215 -28724 -80688 -155749 -4105
6404 -4105 16179 -14583 -19295 -66720 103878 185098 212393 34739 -135334 -219816 -288544 -169312
6392 -169312 -121184 -146559 -215805 -135376 -33097 53847 113370 94892 22081 -122630 -96220
6381 -96220 -172489 -77874 -18623 40687 70524 137207 122215 78082 148273 31774 -30561 20886
6369 20886 76691 119457 28182 -78025 -144467 -78037 -189284 -233622 -155342 -151515 -172244 -166969
6357 -166969 -61552 163382 225750 76745 13914 -66369 32922 152363 109049 25538 -25075
6346 -25075 -92040 -85407 -91474 -51359 -16471 -68695 -46198 -90160 -126598 -53283 -113928 -12171
6334 -12171 27992 16961 84408 37560 -118194 -144839 -100532 16216 -8361 -15415 28222 50552
6322 50552 -69070 -59714 39598 106646 70414 -144994 -252364 -124314 -94898 -128821 -222051
6311 -222051 -227834 -186671 -6069 -38517 -60018 -137239 -182230 -124853 -123440 -101961 24797 160963
6299 160963 189676 144782 47831 12851 17246 -13129 -46796 -42783 -45831 -70171 -99697 -53012
6287 -53012 65763 86394 144067 154127 131591 124821 129668 134841 -40974 24823 25590 -77694
6275 -77694 -63317 -108750 -76243 85061 89218 -77257 -154375 -76203 5532 39816 9368 -26153
6263 -26153 -4044 -65168 -207291 -157446 -55469 -137924 -89476 41123 132799 186205 84873
6252 84873 312 93878 47178 -108328 -73533 -76367 -33772 123400 186178 268198 248388 192861
6240 192861 213741 117866 -952 -109836 -248099 -72333 -133923 -217403 -62629 39706
6230 39706 97476 99004 100284 105125 18270 -18279 -94930 17354 189862 207176 92685 -39517
6218 -39517 -62422 -147468 -185032 -158193 -165519 -165510 -114688 -72623 -13952 -22740 -181822 -290394 -348342
6205 -348342 -212748 -55620 27453 -7354 45032 51698 138880 89805 -32326 39703 73499
6194 73499 56287 5608 -9565 -72909 -40978 1084 16095 32183 43109 31366 2482 -28556
6182 -28556 -99494 -62343 -17704 10933 -144988 -103391 -49296 32041 -10447 36554 -13130 -41118
6170 -41118 -14777 31511 131570 272363 214498 -30441 -101298 -140731 -43242 43456 382
6159 382 13669 -33360 38096 -8151 -42642 124 66300 39148 -36235 31135 9780 -20515
6147 -20515 -75361 127142 92479 -12557 -92089 -234469 -234566 -204146 12263 143972 103603
6136 103603 12417 -46089 -46986 -9220 89309 32433 23387 68140 33172 61229 171517 229339
6124 229339 204136 191137 253115 239303 160765 75911 133281 123259 -51742 -203779 -271493
6113 -271493 -255423 -166225 -17075 47466 72012 28373 -5492 52056 38925 125114 155053
6102 155053 47764 -27621 4632 9944 160609 185792 128152 -4205 -131023 -117469 -34764
6091 -34764 -1191 18041 167545 146650 82546 45930 -36113 -87050 -198006 -256269 -157750
6080 -157750 -169796 -134876 -19959 -16239 56896 -17818 7607 125830 200393 93289 13726
6069 13726 1781 14274 -14103 -32921 -46903 -51770 -89981 -34885 -10632 -19244 -92256 -17860
6057 -17860 80392 601 -142265 -78978 -151390 -125277 -76465 -2763 128317 106090 63424
6046 63424 74988 49285 -6041 41468 -19990 -115154 -50009 -22785 12461 50507 -31254 -176114
6034 -176114 -282376 -240574 -121700 -15781 1915 -9934 -52886 -14433 -126922 -113840 -90772
6023 -90772 -111997 -187898 -58775 56356 57284 -13277 45422 14152 -46233 36758 192326 275955
6011 275955 293006 195305 26256 115681 71334 -44068 -9625 -82549 -158503 -128878 23824
6000 23824 135121 36748 -138941 -69643 -16745 11517 -96401 -133560 -207885 -243990 -137786
5989 -137786 -72819 -50280 53248 -9873 -31821 114273 235627 270831 66777 -20747 -103069
5978 -103069 -91780 -160967 -155389 -89571 -35083 -124912 -220014 -274889 -212130 -188209 -292133 -314874
5966 -314874 -255101 -228757 -157608 -56439 -12821 -73742 -142207 -105258 -72816 69043 -5569
5955 -5569 -31245 68400 17001 -71289 -68635 -148260 -142635 -119327 -97397 -51568 -62416 -50527
5943 -50527 81232 147692 183301 259172 155626 14560 3862 7854 -26311 -62776 -192361
5932 -192361 -43549 132155 164812 237687 111350 3055 11809 10439 9910 -66206 -48958 18794
5920 18794 51995 -23577 -104708 -160732 -110676 -60791 -21077 -62994 -160382 -153116 -167261 -183449
5908 -183449 -191053 -59961 22788 -22689 -87121 -148444 -101026 -166135 -207503 -137704 -82498 -197226
5896 -197226 -286828 -323391 -275213 -223590 -200118 -221910 -136337 -70689 -42160 -89803 -267120
5885 -267120 -305652 -174011 -105270 -4365 46301 90662 182867 159028 54773 -30769 -90178
5874 -90178 -77586 -54681 -89689 -155595 -121789 -87275 -123817 -130182 -143242 -76557 -14475 -39627
5862 -39627 -19217 155245 135056 103208 95385 33261 -1212 -96883 -209331 -184181 -126739 -52833
5850 -52833 5086 -87419 -65949 -52933 -83186 -74204 -224529 -337927 -297165 -142589 -50485
5839 -50485 -19839 20275 -53887 -106959 -46930 -33895 -148782 -205619 -32142 79695 114946
5828 114946 47259 47677 84321 93099 195019 134817 -118712 -184637 -63451 9705 55964 83253
5816 83253 155635 131732 11300 -76252 -392 12728 -8314 13558 80790 143366 134333 43957
5804 43957 -44670 -146056 -115682 21316 -1331 -59759 -129337 -166414 3508 35398 16490
5793 16490 -72122 -179127 -223838 -105612 -1162 53 -33150 -13989 -135246 -213946 -203564
5782 -203564 -164576 -99356 -43264 32402 115566 110441 42540 200 -11738 -80091 -46477 115753
5770 115753 282681 345938 421899 364628 111292 128625 25002 19889 18289 -65948 -30720
5759 -30720 -39842 -42142 -113537 -189428 -119616 -29673 57519 3250 -133301 -16114 100168 68593
5747 68593 -94115 -81385 -167896 -219590 -140894 -83982 -48134 -78538 -105442 -46653 -131821 -122163
5735 -122163 -99402 9493 -21357 -366 -43351 -146895 -22492 82054 53754 -28019 52271
5724 52271 170876 80467 18408 35884 -16769 34294 -98008 -112758 -87403 -65581 -41663
5713 -41663 -7608 -14787 -65030 -102710 -178388 -117122 -36241 -36644 -158865 -192713 -66909 -78651
5701 -78651 -194459 -153167 41498 41909 -102467 -140181 -134853 -85014 -35838 -61257 -87803 -215819
5689 -215819 -264014 -342225 -491818 -481954 -412795 -285408 -211838 -179178 -123283 -143285 23195
5678 23195 21964 22095 -82073 -78026 -145097 -207050 -169948 -111675 -8728 46312 58896 130889
5666 130889 104971 66017 78194 19109 -7174 16507 -48074 -63480 9082 -7712 -71431 -46687
5654 -46687 32564 200934 151518 32696 -21683 -77121 -5404 2951 10258 87118 54533 18406
5642 18406 7897 25677 77413 20401 -12264 -10182 -105077 -80270 -33945 -122547 -85065 91334
5630 91334 -13187 -110454 -25164 25030 202949 232515 86300 -28036 -35399 56003 68718
5619 68718 -62857 -71721 -107621 -356267 -274579 -122415 -125456 -182177 -217868 -225556 -189875 -218906
5607 -218906 -130077 -91615 -183876 -220494 -196629 -29518 -16522 -85734 -216633 -288678 -264225
5596 -264225 -267584 -244518 -142372 -19984 -8667 -50274 -57540 -59708 -99586 -145599 -224003 -334993
5584 -334993 -285068 -191373 -45954 -3939 3173 -20929 -99909 -134441 -49670 40215 55608 -68182
5572 -68182 -220939 -197580 -124043 -151449 -157116 -45931 20830 -35331 -165738 -119941 -145652
5561 -145652 -159936 -139299 -136704 -84441 16337 47966 28520 15350 -43754 -62557 3132 -70418
5549 -70418 -186824 -199014 -111797 36528 13324 -58870 -7845 74429 86255 148254 109841
5538 109841 24453 47826 77374 86529 31893 -132407 -279995 -261863 -167669 -14087 -129723
5527 -129723 -126481 -42420 -104682 -205809 -195586 -34847 138375 144723 50833 95259 74737
5516 74737 128059 121111 -11467 60677 215937 198709 143882 47313 51830 36831 102641 -61962
5504 -61962 -48396 69876 152581 -6801 -50006 -156597 -216277 -261955 -272814 -163015 -105351
5493 -105351 -60097 13464 -15865 -149391 -239072 -204658 -167679 -118652 -119761 -83562 -42372 71940
5481 71940 161242 222073 254018 217106 121193 34217 -10169 -97645 -32551 155025 158600 201290
5469 201290 235614 255007 369671 307019 200055 201835 157574 178741 124791 434 -72633
5458 -72633 20028 109703 35317 91348 95123 62255 25163 13677 -87938 -103545 -50115 -53765
5446 -53765 -162197 -96084 -53074 -39658 -29076 25320 112422 128663 -29867 -52474 80596
5435 80596 161534 91925 121476 63578 79427 86330 89844 30716 34863 -30715 -227946 -233253
5423 -233253 -66606 -54644 -19078 -30011 -27621 -11044 -43785 -82075 -72565 50867 35259 53801
5411 53801 1080 -103922 -118267 -135076 -219062 -189441 -136589 -98336 -289613 -222687 -146112
5400 -146112 -64316 50778 146421 174553 118953 154376 228254 244790 118562 -50702 36133
5389 36133 78247 60590 -18599 4731 -60152 -274329 -217584 -106302 54972 -2748 -3346 81201
5377 81201 82862 -45201 -105780 -963 111151 159566 79224 12970 -39243 -57227 -59107 -49931
5365 -49931 -228602 -219227 -16162 148437 234151 225272 224752 215489 124227 126859 82995 -21060
5353 -21060 20041 184352 168827 89844 122879 113241 72602 -12064 50641 23383 -99001 -199811
5341 -199811 -164250 -2909 25369 4628 26779 -18908 -100769 -120994 -109700 -91673 -55010
5330 -55010 -17475 98589 116154 47250 -71177 -170322 -137113 65923 255755 311017 182314
5319 182314 172566 157970 45199 97920 111155 175721 255955 187703 19732 -32525 -25350 42825
5307 42825 138301 84449 38373 167152 114414 146465 205391 105563 -27008 -121806 -191605
5296 -191605 -171179 -99098 12300 70969 -94456 -143281 -86023 -8762 4863 -16040 11017
5285 11017 -45049 -105887 -92711 -121340 -96529 -156439 -163789 -114620 -68651 129 14740 59327
5273 59327 24358 -33105 -89345 -144016 -140855 -155517 -128485 12276 62521 116258 165359 66301
5261 66301 -39400 -93653 -215697 -167071 -110209 -64486 -167476 -171833 -153368 -185200 -97100
5250 -97100 -132831 -62178 -94966 -82493 -43590 40337 15663 -72147 -55369 -76487 -181884 -287024
5238 -287024 -320204 -168476 -128292 -102558 -93757 48500 128516 107390 70387 17903 -38138
5227 -38138 12126 -22461 -58518 -14678 199972 124192 96308 13021 -77298 -89617 -158991 -207213
5215 -207213 -156324 -156223 -165886 -135197 -185587 -203392 -170870 -60673 17313 -40472 31335 87901
5203 87901 117421 108978 64100 51117 -18058 25577 103402 104367 14873 -45807 -80462 -57779
5191 -57779 -32528 126398 122043 22400 -62010 -61450 -83529 -47244 18175 58203 72619 -21027
5179 -21027 -186022 -125798 -89552 -138011 -262887 -181667 -13234 74946 90046 37603 -88955
5168 -88955 -129449 14715 114 -49714 32964 55140 22346 12857 33361 -80741 -123247 -82621
5156 -82621 -65637 -117550 -95278 13257 20575 -53194 -119394 -123070 -87848 -17582 -35571 -39190
5144 -39190 -47365 -27973 21681 7866 -2504 22448 -68332 -146954 -106178 -39308 -36822 -21839
5132 -21839 46020 35109 106572 -79545 -83564 53572 120425 152752 115748 91138 -3143 122008
5120 122008 292111 203148 -4689 30975 34684 30986 -11394 24034 -53248 -171424 -12787
5109 -12787 -12622 -16402 61436 92706 97240 72772 117987 85947 42082 48846 37806 11394 59749
5096 59749 90132 90772 70482 5709 -50611 71124 76413 -83841 -141134 -25635 130405 206361
5084 206361 254578 210783 184746 156394 106341 198413 199977 195643 66376 -39811 -29433 -49408
5072 -49408 -18577 34698 95939 -20429 -98422 -157751 -215815 -108407 -48047 -65214 -89345
5061 -89345 -144714 -23122 -20134 -124512 -20809 81451 99420 116506 54783 -22022 -23289
5050 -23289 -120708 -217968 -232898 -42724 -75108 -134669 -227501 -208127 -180750 -99878 -113383 -72017
5038 -72017 88597 122629 56825 -18957 6434 31797 -1383 -31718 20165 157757 65736
5027 65736 -82681 -125654 12986 -11943 -50051 -132245 -100424 -21713 -11362 73784 99246
5016 99246 146323 97779 -86822 -71846 -25558 2922 87003 -26524 -135836 -48352 33957
5005 33957 69789 153706 174713 117793 -18239 -45947 -13059 -13472 10212 45396 98434 -38207
4993 -38207 -88134 -176630 -116138 -4258 -23376 -28682 -76006 -12032 64223 112230 -9713 -48325
4981 -48325 8859 -56739 -94630 5622 -32128 90139 66835 -62134 -79572 -72418 -117918
4970 -117918 -69077 41122 14602 -119253 -181326 -103725 7561 86461 58863 164943 223584
4959 223584 181275 271926 167334 -11658 -37926 93729 108081 102474 209029 198514 107606
4948 107606 33154 -3560 -16219 -45719 -52159 -4889 4145 12173 87211 43751 24913 -51563
4936 -51563 -27702 -17646 -61332 -25658 -14855 -53889 -144182 -44743 18970 597 40240 135276
4924 135276 163788 11286 -103445 -141141 -140394 -200885 -181831 -161238 -88127 -78577 -84383 -85311
4912 -85311 -147850 -104815 -5316 43722 46697 60565 -94211 -248889 -230919 -222274 -290709 -280606
4900 -280606 -170920 -92613 -50042 -121795 6966 -27478 -40898 18715 75160 25552 -11629
4889 -11629 17151 87366 146468 113296 138476 146463 113805 89777 18936 -32989 -200382 -248714
4877 -248714 -290361 -229247 -239250 -225525 -193713 -81487 -22445 -101407 -98937 -13679 -87765 -140438
4865 -140438 -29887 -1670 -15982 -112496 -133118 -64810 -49584 -24117 -24591 -46837 -10622 -32347
4853 -32347 -65876 -5017 -63883 -126312 -233052 -230675 -98448 37255 177 49163 -90511
4842 -90511 -145447 -116907 -67712 -2449 110033 27940 38373 14979 -59965 -60023 -4311 89592
4830 89592 14094 -21340 -38220 -141705 -96453 -155608 -304382 -260020 -45221 75419 120219
4819 120219 90009 5286 -25104 4062 13803 25406 2508 -43802 -3215 104433 68328 133494
4807 133494 41430 43278 33440 43835 2490 -29543 101385 109878 34913 5184 -102183 -127757
4795 -127757 -128035 -146845 -87351 9697 25942 -50731 -138600 -187392 -173273 -160038 -56560 -28936
4783 -28936 25277 45869 38877 -146830 -42665 -26082 -116193 -131264 -131731 -51597 -81469 -41575
4771 -41575 -22572 -29762 -32106 -76524 16328 85885 122960 126872 73426 83516 47573 53361 123095
4758 123095 228443 75882 -88865 -86639 -43234 6279 69490 130333 57964 -54466 -80946
4747 -80946 -167484 -239735 -175836 -174653 -180969 -149093 -53270 16141 -76006 -270752 -265622 -115024
4735 -115024 -82611 -77591 -53349 -92194 -154639 -212020 -242339 -186959 -116353 -153526 -172268 -175656
4723 -175656 -86090 -96975 -122881 -27241 43676 -12675 -100775 -183486 -218959 -121338 -65186 -47017
4711 -47017 -71628 -51832 55948 -53422 -154126 -224086 -225307 -182454 49437 204083 159178
4700 159178 85815 93451 219820 229216 132091 -56595 -169111 -205748 -55839 49896 111857
4689 111857 127275 160803 138133 78708 106762 202555 301837 223130 126670 30066 -13591 -19701
4677 -19701 41565 42052 -77227 -239899 -215282 -240088 -147773 -54800 -4502 43148 10752 93748
4665 93748 94199 -13228 -141 56195 121248 79546 33626 2279 -44072 -113543 -113939 -148552
4653 -148552 -131539 -159119 -194495 -145251 -109596 -174274 -109433 30945 121642 73782 14354
4642 14354 -16286 -16079 -21396 36053 -7008 -34409 14769 96514 -24800 -18797 26873 158595
4630 158595 135452 18404 -130738 -154253 -77065 -35823 -41010 -116545 -125488 -5458 7829
4619 7829 130179 231118 210986 289324 154277 76888 8637 -12278 12866 -74619 -169782
4608 -169782 -111734 -74867 -27246 -87331 -68944 18979 69024 77240 19687 -32434 15926 55857
4596 55857 26208 -63814 -147995 -12152 69459 154979 194161 151899 119966 128890 33134 -22121
4584 -22121 -7318 -48942 -161144 -245755 -179958 -115367 -36213 8924 4801 69206 72514 35028
4572 35028 16375 -47192 -61781 -51927 -7880 20222 79000 94560 125331 132274 234234 174930
4560 174930 76800 -2623 -11814 -23376 -145863 -126666 -194567 -189748 -53320 -15578 29350 49197
4548 49197 -63254 1502 -25569 -74762 -60635 -2432 65577 113062 199361 183389 93885 193624
4536 193624 251535 122766 -6013 -28627 -73025 -46687 -6495 -84766 -99697 -29145 89065
4525 89065 79960 -148850 -182600 -150532 -140412 -118012 -76069 -78003 -167475 -142099 4686 170842
4513 170842 132638 71473 -60175 -38832 -18399 -53080 -108467 -137625 -123770 -8434 40754
4502 40754 129315 130851 128117 138826 83785 58453 62995 24348 85408 4482 -88173 -69530
4490 -69530 -142644 -239022 -168854 -124499 -26742 24520 41181 -64343 -51421 21779 55932 184584
4478 184584 172473 112415 40912 -59042 -90677 -89076 -94665 -27603 119046 103256 -56958 -110828
4466 -110828 -43694 -8493 87278 169000 20462 -61219 34925 69059 101341 -36174 -117088
4455 -117088 -102204 -106108 -58223 -31477 339 60471 103808 70635 139292 140142 -45796 -161023
4443 -161023 -24963 12181 -27364 -2014 33370 172267 192518 64206 173016 308148 223892
4432 223892 77075 29768 29335 -142191 -144581 22817 -20068 -53707 -55784 -152744 -21101 141208
4420 141208 155561 170412 217336 169985 104340 -3707 -93409 141780 284531 232240 66059
4409 66059 -131740 -97790 -9803 95327 192972 240776 109520 -834 -57218 -106441 -92707
4398 -92707 -81681 28549 -25463 23389 -10112 20791 86997 36733 -17035 -19166 -119671 -135581
4386 -135581 3992 13219 -33240 -72634 -20149 -119697 -162924 -174628 -227727 -285190 -230578 -111054
4374 -111054 22522 57850 -3389 -41689 -86506 -30392 18927 39720 69806 21719 -37633
4363 -37633 -12467 2117 46925 -14981 -32573 -95282 -252354 -222619 -194893 -108889 -86095 -101431
4351 -101431 -96731 -188844 -194583 -122167 -91439 -63338 -17712 -10444 19620 4210 -27086 -63996
4339 -63996 14503 43386 -51541 -67143 69316 70365 -45394 -58105 10908 -35147 -136811
4328 -136811 -141423 -129589 -191389 -151380 -127624 -50086 99556 117069 -65185 -77343 -69673 -49352
4316 -49352 23060 142110 22768 -121760 -61450 -23412 -38909 -22913 -9389 43971 -60375
4305 -60375 -55429 -28031 -125137 -241470 -152778 2653 54453 137156 39554 24083 97878 1787
4293 1787 33298 66384 33581 -46372 -83655 -62608 -27136 -53626 -60892 21306 132909 69151
4281 69151 122262 114427 -2486 -18667 -177784 -153870 5077 -13217 -84326 -30622 -68196
4270 -68196 -150806 -211557 -157292 -114826 -63171 -55587 -57416 -2923 25759 8559 -2628 14947
4258 14947 -30516 -63599 -87133 -7110 121094 56057 -36356 -36879 -48338 -25051 1 -96767
4246 -96767 -147405 -91664 -60785 -44438 -134754 -122084 -110609 -39205 -96029 -140743 -14198 3503
4234 3503 5723 -9978 19901 150138 32898 23634 69695 21021 6146 -12362 4128 -36552
4222 -36552 -127088 -91816 -70242 38449 24240 -114868 -69826 -96330 -150558 -121821 7521
4211 7521 46695 72909 95262 189595 295815 210486 85306 -22590 -162160 -235980 -177856
4200 -177856 -7940 27263 117571 162369 80492 15160 -101293 -70282 -27060 -39656 -50591
4189 -50591 8774 -142995 -182228 -5295 98662 81220 4663 -12796 -31631 -60652 -91068
4178 -91068 17933 198938 293964 312896 161779 108349 27756 -39198 -78446 -70777 -7796
4167 -7796 12983 5324 -66194 -211617 -278726 -246942 -219520 -143349 -86880 -123231 -75932 10277
4155 10277 -26173 -50235 -224984 -229340 -281922 -236957 -113937 -68417 -21572 -43843 -80263 -73455
4143 -73455 -71223 -96834 -11029 36899 -2259 -19049 91291 63999 -7206 -2820 -17545 -16706
4131 -16706 24623 29855 98387 23051 -75493 -95413 -27095 -54158 -136319 -116661 -127749 -179229
4119 -179229 -53381 37187 60227 69953 -53358 -69390 -74326 -56084 -18234 110111 14472
4108 14472 -200936 -239069 -112415 -17312 -22066 -27744 10164 78830 -3047 -115621 -102714 63843
4096 63843 73186 141947 166422 80229 40188 -88610 -197880 -221034 -181624 -167922 -161167 -149039
4084 -149039 -67477 23758 9719 -967 1272 73943 46802 154589 79505 -6503 -61939 -96970
4072 -96970 -119937 -40109 -111703 -145335 -183826 -16507 106978 102188 -42031 -114485 -47706
4061 -47706 -30005 -135946 -181576 -44943 50622 -2613 -77917 31643 86152 117702 37137
4050 37137 -65600 65723 -3329 -110801 -241894 -233267 -142261 -41854 -130017 -64651 -11527
4039 -11527 -47878 -45686 -94261 -59254 10157 5416 -55451 -119002 -22123 -27559 -62809 -100221
4027 -100221 -120191 -157421 -15899 -11941 -92468 -192326 -230998 -147145 -92416 -89040 4036 -19696
4015 -19696 -67528 40615 67745 -23547 -55439 -170175 -267328 -141344 -76234 -104390 -229543
4004 -229543 -267668 -143635 -45047 24919 171796 170135 73328 -50633 -65784 -31720 -52911
3993 -52911 -125180 -148939 -80953 -37948 -95144 27096 116503 177757 196049 140750 -26749
3982 -26749 -60697 35080 48995 137209 116945 56202 34613 1943 -40779 50862 8637 -69142
3970 -69142 9834 45448 69154 232180 85407 -113612 -83767 8051 136120 85914 -7292
3959 -7292 -136244 -202373 -24118 -10836 -52852 79569 21621 21847 -87480 -19688 94884
3948 94884 98214 -11758 -179260 -146040 -58565 27501 -91856 -46586 63399 66020 -37634
3937 -37634 -48299 46787 193837 151629 -10587 -31262 20861 88720 23738 -116012 17283
3926 17283 146263 59591 -20511 -57087 -4725 68331 -2963 77922 126898 76114 157500 160814
3914 160814 65866 59210 -10120 43439 145847 91485 -62162 -118693 -96432 -113319 -116606 -122927
3902 -122927 -182321 -147043 -109959 -123708 -20386 -102236 -115538 3122 -38482 -79157 -57793
3891 -57793 -63977 -43027 25189 21474 13891 24059 -114493 -277932 -325941 -307481 -256429 -209869
3879 -209869 -269995 -244956 -144691 -50407 -60277 -96565 -29074 139906 157205 181184 38348
3868 38348 -17567 -45400 -28554 2704 56957 45263 -2604 33659 51574 -46923 -180777 -138693
3856 -138693 -76122 -115436 -110852 -99923 35077 659 -49031 -61973 34728 65146 100393 175116
3844 175116 197726 100803 -14988 -26804 -89879 -150222 -21160 15685 -1521 100626 79823
3833 79823 -79264 -56247 -107894 -220784 -157362 -78882 -140703 -192851 -195579 -92833 51636
3822 51636 1493 -26728 -44359 44662 -67837 -115477 -171232 -109522 -98965 -154611 -173830 -134708
3810 -134708 -90036 -48967 -48383 -45747 -62471 -26098 -14581 36619 14440 -90943 -124985 -70794
3798 -70794 -17296 -45863 -119154 -104551 -16555 -60448 -61293 6549 15219 28002 -740 17340
3786 17340 -6090 42430 129635 -2483 -158397 -103449 -99294 -77728 -97605 -136959 -139767 -202582
3774 -202582 -231615 -131132 -81174 -2215 -55402 -142932 -112814 -7948 -45062 -91230 -100578
3763 -100578 -30628 112609 125987 56666 40091 17888 69826 166581 28480 -31897 89230
3752 89230 165584 81172 70306 66401 -19517 46122 85369 30001 55877 17720 -29740 120405
3740 120405 80959 18666 89026 113983 13505 -113054 -38627 -88860 -156030 -94557 43995
3729 43995 117367 205669 189658 149720 83517 114234 97271 13548 -14681 -42434 -63915 -6299
3717 -6299 132274 125593 112105 94308 56766 41590 -11298 -63111 -14767 32360 -61529 -163197
3705 -163197 -273705 -228779 -238098 -296533 -181579 -30280 34000 -38997 -171349 -64801 5994
3694 5994 80208 31689 -58799 -81142 -123425 23974 147200 22207 57468 78134 -86586
3683 -86586 -143841 -119473 -73584 -21114 -21168 -107027 74060 189695 82300 -70157 -118006 66246
3671 66246 271566 275058 195363 192063 170773 -10623 -11171 21880 24817 52947 -7834 -129812
3659 -129812 -66400 -234899 -198211 -140942 -58275 -206318 -208083 -19270 143526 91391 62227
3648 62227 87684 -6235 44026 46322 -13742 -77642 -216801 -145839 65778 171701 159814
3637 159814 239955 224980 220188 77112 8676 147679 185130 69796 22104 -6064 15253
3626 15253 -1072 -16485 42455 -20910 -60487 -13239 56804 35661 14918 14421 -93309 -74486
3614 -74486 37820 122948 40645 63081 109784 96736 -4226 -71495 -17381 95841 164578
3603 164578 78713 -66729 -147408 -169907 -39821 -8320 -72711 -56106 -40820 -136620 71884
3592 71884 285833 304801 180986 71295 7106 -63538 -52063 -14762 -28904 40218 116326
3581 116326 128817 96551 19754 -78758 -52114 -89891 -124002 -133680 -135789 -38592 82304 138341
3569 138341 179117 181329 75437 -76180 -86611 -168182 -153298 -66184 37151 48665 -30372
3558 -30372 7955 -23843 -131801 -159001 -70741 -165209 -170545 -47680 102835 76655 -15322
3547 -15322 -47789 24798 45159 30140 26270 47845 221781 266129 169614 96919 94503 -47587
3535 -47587 -118883 -43867 34446 68274 67395 -49945 -27794 -68754 -60323 2250 -20225 -141226
3523 -141226 -44366 61242 -37015 -242857 -247604 -188716 -157553 -30733 -102634 -40973 32999
3512 32999 -27600 -68503 -62002 -41762 24352 112931 73655 49573 -30314 59143 137442 57052
3500 57052 12917 44801 57580 -40283 -184685 -237952 -126186 -71398 -53851 37049 110598
3489 110598 131491 87285 176509 77229 -59931 40392 28472 -46447 -71481 -27150 6875
3478 6875 114447 198356 152506 76020 114444 7137 -13299 58093 175962 66384 20746
3467 20746 138159 177836 254954 161095 52521 -14455 -2665 183136 122695 118889 77935
3456 77935 115036 77130 109080 60680 99287 213296 223942 118461 -53436 -22999 132763
3445 132763 69684 95946 139238 60300 20400 -1225 92992 128912 91799 250430 230089
3434 230089 209867 179262 123258 64933 23898 -81326 -3942 104058 94755 162718 112464
3423 112464 64276 28621 66116 43169 -49065 49763 106139 -2012 -51401 37060 25769
3412 25769 -12082 -126729 -165247 -121788 -67143 -19170 -37127 28809 -61051 -84797 64094
3401 64094 101940 134141 227512 63110 -59131 -947 -3527 30706 32834 63456 90107 102923
3389 102923 -66223 -123091 -153962 -160231 -118791 -84368 -179284 -261821 -140335 112280 144696
3378 144696 -12110 -35077 -5247 35644 -874 -2509 218823 172655 94440 46326 -126585
3367 -126585 -86213 8083 44768 -23909 27764 65012 9574 24764 -9270 -22663 -145752
3356 -145752 -118248 -96000 -61822 12015 -80490 -69514 -49390 71858 117231 -62833 -134805
3345 -134805 -205039 15497 134544 71295 40606 26654 -39470 -127107 -97818 -75737 -123929
3334 -123929 -40524 56177 94260 38561 -6495 -44072 -19295 -99553 -76750 -66955 -158083 -112554
3322 -112554 -20213 65113 78754 -8106 34566 54795 122826 114426 6339 27468 107548 -24370
3310 -24370 -150040 -225871 -135046 -36402 -88298 -64276 72460 211954 159938 144566 113657
3299 113657 64677 21397 48309 41539 42078 13030 144434 198124 188856 102984 -22010 70802
3287 70802 98416 66084 12810 -15072 71517 226558 253579 142700 57422 47458 45113 23349
3275 23349 90291 -10375 -67768 115799 158095 179881 109772 15106 -1346 14903 44451
3264 44451 63710 163925 89427 -4253 -80356 -119448 22683 98552 137022 265309 234664
3253 234664 201812 240387 225890 139704 103876 76981 25751 15643 88572 119518 119217 206068
3241 206068 324716 362356 240751 166942 112529 146914 59470 7345 -12391 -64547 8276
3230 8276 27956 95836 48963 3756 -4707 -95166 -27140 87803 133735 94960 83462 154463
3218 154463 221509 208206 111123 104277 93855 23019 -44662 -27665 -83717 -188932 -128901 -35563
3206 -35563 -51139 -120522 -93109 -149073 -229813 -288957 -315328 -231824 -162224 -143206 -176872 -202132
3194 -202132 -121189 -58928 1830 -50696 58853 106490 15315 -80913 -209660 -53782 -24818
3183 -24818 -36456 -85678 -34386 -44906 -7584 -79380 53541 -4290 -95354 -71146 -121042 -45013
3171 -45013 21694 -14835 -19077 -129667 -173281 -78124 -43300 -45913 18548 30471 44072 96302
3159 96302 -58857 -13464 -75722 -99681 -132174 -152491 -187819 -139038 -173477 -172200 -28804 79487
3147 79487 109326 68371 3960 19663 105400 31895 -16387 -47901 -108116 -91161 -152543 -20777
3135 -20777 55588 -130455 -357763 -355831 -313880 -248396 -181636 -1904 -2332 -123450 -188350 -182726
3123 -182726 -105908 -50783 -72830 -110603 -113858 -27012 6037 8029 -37707 -206606 -208535 -195582
3111 -195582 -191849 -46066 165475 226397 237641 243646 173045 48028 8117 -90516 -163602
3100 -163602 -158571 -83689 -110062 -111224 -7090 110947 68720 -18128 -77202 -89778 3687 -154112
3088 -154112 -161029 5003 75052 134965 9646 -128609 -194864 -191960 -186908 -74240 -38204
3077 -38204 -38094 113598 43405 5526 187642 153404 63325 6620 -51406 -17231 -34563 16187
3065 16187 89637 221350 245820 253832 68635 -141544 -167020 -103665 17263 21064 39213
3054 39213 47048 33155 -17327 35234 22668 12748 -52949 -107126 -110452 1930 63827 26919
3042 26919 -80151 -99661 -144865 -188901 -159470 -194997 -113921 6392 -27589 -91249 -55838
3031 -55838 -90547 11906 143125 133402 49171 -26245 -112184 -119087 47519 137567 145156 32950
3019 32950 -44633 28480 105284 26836 -61743 9069 45061 36472 43033 111849 26684 -51687
3007 -51687 -147122 -237202 -143303 -172909 -218913 -173868 -193993 -98450 50394 28892 75041 18336
2995 18336 58039 108419 71919 16944 16582 26829 12002 13732 -10099 41310 72562 45938
2983 45938 -14462 -70213 -151950 -119881 -20671 46041 116276 157042 176406 165354 70983 -21905
2971 -21905 63854 84426 -37993 -105518 -82355 101622 144724 89071 -8107 -27269 -85698
2960 -85698 -150312 -87779 40459 53975 -37370 -3497 69368 89605 -26286 -61694 -115348
2949 -115348 -123814 20514 87001 135834 83451 83096 48125 54982 84711 -19702 -109862 -11378
2937 -11378 64219 11513 -8644 -52539 -28858 -47481 34401 78972 66273 -36924 -203612
2926 -203612 -353846 -276885 -7968 45729 14110 -9174 -40906 4081 5874 -112948 -59657
2915 -59657 -45212 -30423 90606 127224 56439 12652 9676 -72146 -26969 45009 60610 36453
2903 36453 39092 -52054 -50893 -65898 -5939 35836 81999 154380 142319 86228 56784 81032
2891 81032 101160 118395 14674 -79782 3981 108611 91225 68156 104093 250649 252921
2880 252921 228235 119790 22817 -21622 -124818 -158141 -234130 -238544 -267757 -199800 -62934
2869 -62934 -90813 -254685 -255350 -200497 -140618 -89836 -72458 -105557 6832 -67001 -86860 -71819
2857 -71819 -160966 -29982 162559 82624 110300 90533 75838 22392 -151496 -164302 -64564
2846 -64564 -184562 -236483 -52763 -107590 -191400 -96869 37928 148365 55289 148422 201506
2835 201506 146492 89938 62418 -73491 -111678 -153849 -114242 7900 -23213 -32563 47647
2824 47647 60541 -10454 -521 -209213 -282829 -255034 -262080 -338333 -252661 -200133 -99060 -65110
2812 -65110 -55612 -51381 15347 4038 -18294 142278 209107 216365 135474 18647 -3584 51600
2800 51600 68110 37120 25671 -64356 -26144 -11354 14156 -23101 9691 52527 -14295 69370
2788 69370 176928 108552 -52548 -248602 -227549 -10823 50206 41179 95724 20330 -76223
2777 -76223 -100801 -121166 -75570 -14811 19515 81699 32546 27647 86335 -43049 -124953 -160037
2765 -160037 -81910 64612 26833 36533 -73782 -147961 -120899 -37971 -71873 -28424 11343
2754 11343 -7717 29588 65810 126071 141509 54407 33605 -50384 -190661 -144138 36738
2743 36738 58466 76306 127896 197266 180121 119430 72199 14064 -49076 -75317 -9343 19167
2731 19167 -121504 -62911 88930 32050 -47309 -54364 -21317 -35070 -77065 63276 89283
2720 89283 6749 114386 226852 127951 40811 -73132 -152917 -266616 -79417 -20901 -14403
2709 -14403 -25189 20476 24502 -33882 -154218 -75847 31916 -92865 -279497 -320486 -193732
2698 -193732 -117110 -86526 -37354 5665 26759 80717 22350 -149477 -31859 97647 122286
2687 122286 129366 248112 322479 236899 232947 147985 170719 91064 56531 136719 72297 139555
2675 139555 138768 68704 7473 -41005 -2597 65352 53265 144555 45872 107477 65908 -61655
2663 -61655 -136487 -160607 -349978 -317136 -177272 -107977 -67408 83584 144264 73104 -85589
2652 -85589 -73537 -124165 -74561 -5548 -70438 91126 93692 129444 236858 88570 16623
2641 16623 -105282 -141101 -173316 -10705 100500 -40456 -53014 51727 -1777 14506 10893
2630 10893 7192 -34323 22056 22925 43027 83360 18640 59116 80265 41220 92843 67597
2618 67597 60194 13066 -37331 -105651 -9739 -34109 -192685 -359149 -308385 -178546 -119577
2607 -119577 21522 143453 136786 27760 -155366 -140285 28142 132186 209727 338887
2597 338887 340882 277483 211614 153958 175227 136858 118092 193866 225499 153641 149424 87644
2585 87644 26748 22355 119353 102394 63935 82503 103131 60267 111637 -14242 -86224 -11889
2573 -11889 30596 11789 39239 -47515 -90695 -8017 117379 48943 -52625 21329 -41552
2562 -41552 -14244 -27463 -104892 -160810 -109744 28332 34453 -29016 -107140 -86746 -239 66175
2550 66175 -117 28887 54346 -24608 -114887 2803 16717 23775 -19684 -6126 94092 148309
2538 148309 176679 80992 33081 164939 188457 185059 173352 129138 82421 89585 25776 -11617
2526 -11617 71377 170125 187520 168806 183805 72604 1687 -44313 -34336 95477 184245 172712
2514 172712 5843 -103527 -31299 42953 26645 -20475 -75868 -98475 -79702 -94850 -120944
2503 -120944 -110414 -102697 93499 219185 205896 202596 74229 73250 51050 -29489 -87131 -43308
2491 -43308 47981 -9563 -140779 -146927 -154306 -90139 -42363 -17948 -23078 20140 12277 54507
2479 54507 84478 -15847 -154163 -140951 -68300 -23834 -742 127394 236707 279991 184038
2468 184038 8853 -127163 -79042 10823 -102557 -148 -50890 -85029 -70800 -44520 -79455
2457 -79455 -98108 -93905 -137052 -53349 21833 15544 -5801 -39068 -106899 -137219 -33529 4482
2445 4482 12802 -86285 -141435 -160642 -189214 -178184 -131536 -93325 -124616 -145043 -119919 -150934
2433 -150934 -107836 -87597 -53226 -33682 -85115 6726 50783 -13880 11057 53192 87573 116119
2421 116119 85026 43491 33940 139450 180009 210648 103765 100336 166601 133093 114082 88609
2409 88609 38132 107242 178239 102461 69042 25236 36506 24144 76348 35289 -22699 -38354
2397 -38354 -71918 -73035 40928 100938 75234 65080 105982 -41341 -42055 -72695 -218359 -294774
2385 -294774 -244375 -142771 -81392 -72754 -122983 -241308 -268496 -197029 -79622 9629 81796
2374 81796 44903 -81740 28945 39521 -19694 388 17778 50504 40169 -58462 -127622
2363 -127622 -95330 -82523 21398 121018 93108 103604 -22124 -147028 -232357 -148937 -180169
2352 -180169 -266218 -201600 -210841 -207882 -180570 -77111 8151 -23618 13122 19315 -133279 -136490
2340 -136490 -78221 25809 63258 30135 33056 60077 34862 8431 55491 -103872 -44489
2329 -44489 71293 80008 -49890 -130974 -226569 -279117 -166467 -11830 122502 211723 185803
2318 185803 188320 57703 -72918 -80067 -40456 -91425 -23080 -35779 -28640 -98278 -141125 -21608
2306 -21608 102304 74127 -92906 -77420 47391 -77059 -196798 -117144 -18440 -19365 -70754
2295 -70754 -175308 -213621 -117576 -1898 51799 74026 -2760 -84848 -87077 -46283 6095 22370
2283 22370 -4686 -49613 -124123 -120527 -151001 -175341 -133570 -93824 -11905 20496 -9482 -147838
2271 -147838 -125810 -103411 17370 -9450 19120 62083 132076 35485 -44297 -134921 -131220 -55305
$$ [...]
##END NTUPLES=NMR SPECTRUM
##END=
