##TITLE=Analysis number 316586
Compound Code cc 03603
Project Code adrs
Chemist Name prosynth
##JCAMPDX= 6.0         $$ Bruker NMR JCAMP-DX V2.0
##DATA TYPE= NMR SPECTRUM
##DATA CLASS= NTUPLES
##ORIGIN= Bruker BioSpin GmbH
##OWNER= nmr
$$ XWIN-NMR		Version 3.5
$$ Thu Jan 19 16:27:41 2006 GMT Standard Time (UT+0h)  MAYBRIDGE\nmr@NMR_250MHZ
##.OBSERVE FREQUENCY= 250.131544655141
##.OBSERVE NUCLEUS= ^1H
##.ACQUISITION MODE= SIMULTANEOUS (DQD)
##.ACQUISITION SCHEME= undefined
##.AVERAGES= 16
##.DIGITISER RES= 18
##SPECTROMETER/DATA SYSTEM= dpx250
##.PULSE SEQUENCE= zg30
##.SOLVENT NAME= CDCl3
##.SHIFT REFERENCE= (INTERNAL, CDCl3, 0, 16.522)
##AUDIT TRAIL= $$ (NUMBER, WHEN, WHO, WHERE, WHAT)
$$ ##TITLE= Audit trail, XWIN-NMR		Version 3.5
$$ ##JCAMPDX= 5.01
$$ ##ORIGIN= Bruker BioSpin GmbH
$$ ##OWNER= nmr
$$ C:\u/data/dgb/nmr/ADRS/14990/pdata/1/auditp.txt
$$ ##AUDIT TRAIL=  $$ (NUMBER, WHEN, WHO, WHERE, WHAT)
(   1,<2006-01-19 16:27:16.31 +000>,<MAYBRIDGE\nmr>,<NMR_250MHZ>,
      <created by zg, POWCHK disabled, PULCHK disabled
       configuration hash MD5:
       62 19 C7 07 E1 42 D1 B7 37 6C 3D D0 77 39 F9 E6
       data hash MD5: 64K
       7E 69 64 C6 33 9B C6 A1 1D 5E 19 A8 7A E5 C1 F6>)
(   2,<2006-01-19 16:27:31.15 +000>,<MAYBRIDGE\nmr>,<NMR_250MHZ>,
      <Start of raw data processing
       ef LB = 0.3 FT_mod = 6 PKNL = 1 SI = 32K 
       data hash MD5: 32K
       9B D7 99 25 A8 67 63 B4 F7 B2 B5 0B 71 F8 78 F5>)
(   3,<2006-01-19 16:27:33.06 +000>,<MAYBRIDGE\nmr>,<NMR_250MHZ>,
      <apk 
       data hash MD5: 32K
       96 5B F1 C2 79 8F 77 96 00 2D F8 47 FD A1 17 A9>)
(   4,<2006-01-19 16:27:33.90 +000>,<MAYBRIDGE\nmr>,<NMR_250MHZ>,
      <abs ABSG = 5 
       data hash MD5: 32K
       0C 21 74 C5 E0 FB A3 DB 13 A8 A0 E8 A3 B3 F2 65>)
$$ ##END=
$$ 
$$ hash MD5
$$ 44 1A 09 32 B9 D3 F4 B4 99 C8 87 26 1B 25 C1 23
##$RELAX= 
##$RELAX= 
##$RELAX= 
##$RELAX= 
##$RELAX= 
##$RELAX= 
##$RELAX= 
$$ Bruker specific parameters
$$ --------------------------
##$DU= <C:\u>
##$EXPNO= 14990
##$NAME= <ADRS>
##$PROCNO= 1
##$TYPE= <nmr>
##$USER= <dgb>
##$AMP= (0..31)
100 100 100 100 100 100 100 100 100 100 100 100 100 100 100 100 100 100 
100 100 100 100 100 100 100 100 100 100 100 100 100 100 
##$AQSEQ= 0
##$AQ_mod= 3
##$AUNM= <au_zg>
##$AUTOPOS= <7 >
##$BF1= 250.13
##$BF2= 250.13
##$BF3= 250.13
##$BF4= 250.13
##$BF5= 500.13
##$BF6= 500.13
##$BF7= 500.13
##$BF8= 500.13
##$BYTORDA= 1
##$CFDGTYP= 0
##$CFRGTYP= 5
##$CHEMSTR= <none>
##$CNST= (0..31)
1 1 145 1 1 1 1 1 1 1 1 1 1 1 1 1 1 1 1 1 1 1 1 1 1 1 1 1 1 1 1 1 
##$CPDPRG= <>
##$CPDPRG1= <>
##$CPDPRG2= <>
##$CPDPRG3= <>
##$CPDPRG4= <mlev>
##$CPDPRG5= <mlev>
##$CPDPRG6= <mlev>
##$CPDPRG7= <mlev>
##$CPDPRG8= <mlev>
##$CPDPRGB= <>
##$CPDPRGT= <>
##$D= (0..31)
0 1 0 0 0 0 0 0 0 0.06 0 0 0 0 0 0 0.0002 0 0 0 0 0 0 0 0 0 0 0 0 0 0 
0 
##$DATE= 1137688035
##$DBL= (0..7)
120 120 120 120 120 120 120 120 
##$DBP= (0..7)
150 150 150 150 150 150 150 150 
##$DBP07= 0
##$DBPNAM0= <>
##$DBPNAM1= <>
##$DBPNAM2= <>
$$ [...]
##$SUBNAM7= <"">
##$SUBNAM8= <"">
##$SUBNAM9= <"">
##$SW= 20.6930455092707
##$SWIBOX= (0..15)
0 0 3 0 0 0 0 0 0 0 0 0 0 0 0 0 
##$SW_h= 5175.983436853
##$TD= 65536
##$TD0= 1
##$TE= 294.16
##$TE2= 300
##$TE3= 300
##$TEG= 300
##$TL= (0..7)
0 120 120 120 120 120 120 120 
##$TP= (0..7)
150 150 150 150 150 150 150 150 
##$TP07= 0
##$TPNAME0= <>
##$TPNAME1= <>
##$TPNAME2= <>
##$TPNAME3= <>
##$TPNAME4= <>
##$TPNAME5= <>
##$TPNAME6= <>
##$TPNAME7= <>
##$TPOAL= (0..7)
0.5 0.5 0.5 0.5 0.5 0.5 0.5 0.5 
##$TPOFFS= (0..7)
0 0 0 0 0 0 0 0 
##$TUNHIN= 0
##$TUNHOUT= 0
##$TUNXOUT= 0
##$USERA1= <user>
##$USERA2= <user>
##$USERA3= <user>
##$USERA4= <user>
##$USERA5= <user>
##$V9= 5
##$VALIST= <valist>
##$VCLIST= <CCCCCCCCCCCCCCC>
##$VD= 0
##$VDLIST= <DDDDDDDDDDDDDDD>
##$VPLIST= <PPPPPPPPPPPPPPP>
##$VTLIST= <TTTTTTTTTTTTTTT>
##$WBST= 1024
##$WBSW= 4
##$XGAIN= (0..3)
0 0 0 0 
##$XL= 0
##$YL= 0
##$YMAX_a= 363726
##$YMIN_a= -446065
##$ZGOPTNS= <>
##$ZL1= 120
##$ZL2= 120
##$ZL3= 120
##$ZL4= 120
##$ABSF1= 16.522
##$ABSF2= -4.171173
##$ABSG= 5
##$ABSL= 3
##$ALPHA= 0
##$AQORDER= 0
##$ASSFAC= 0
##$ASSFACI= 0
##$ASSFACX= 0
##$ASSWID= 0
##$AUNMP= <proc_1d>
##$AZFE= 0.1
##$AZFW= 0.1
##$BCFW= 0
##$BC_mod= 0
##$BYTORDP= 0
##$COROFFS= 0
##$CY= 12.5
##$DATMOD= 1
##$DC= 0
##$DFILT= <>
##$DTYPP= 0
##$F1P= 14.0000005364418
##$F2P= -0.99999901652339
##$FCOR= 0.5
##$FTSIZE= 32768
##$FT_mod= 6
##$GAMMA= 0
##$GB= 0
##$INTBC= 1
##$INTSCL= 1
##$ISEN= 128
##$LB= 0.3
##$LEV0= 0
##$LPBIN= 0
##$MAXI= 10000
##$MC2= 0
##$MEAN= 0
##$ME_mod= 0
##$MI= 0
##$NCOEF= 0
##$NC_proc= -2
##$NLEV= 6
##$NOISF1= 0
##$NOISF2= 0
##$NSP= 0
##$NTH_PI= 0
##$NZP= 0
##$OFFSET= 16.522
##$PC= 1
##$PHC0= -117.3218
##$PHC1= 4.430295
##$PH_mod= 1
##$PKNL= yes
##$PPARMOD= 0
##$PSCAL= 4
##$PSIGN= 0
##$REVERSE= no
##$SF= 250.13
##$SI= 32768
##$SIGF1= 0
##$SIGF2= 0
##$SINO= 400
##$SIOLD= 32768
##$SREGLST= <1H.CDCl3>
##$SSB= 0
##$STSI= 32768
##$STSR= 0
##$SW_p= 5175.98343685301
##$SYMM= 0
##$S_DEV= 0
##$TDeff= 65536
##$TDoff= 0
##$TI= <Analysis number 999999
Compound Code 99
Book Reference 9
Project Code 9>
##$TILT= no
##$TM1= 0
##$TM2= 0
##$TOPLEV= 0
##$USERP1= <user>
##$USERP2= <user>
##$USERP3= <user>
##$USERP4= <user>
##$USERP5= <user>
##$WDW= 1
##$XDIM= 32768
##$YMAX_p= 360748366
##$YMIN_p= -130401
$$ End of Bruker specific parameters
$$ ---------------------------------
##NTUPLES= NMR SPECTRUM
##VAR_NAME=  FREQUENCY,     SPECTRUM/REAL,   SPECTRUM/IMAG
##SYMBOL=    X,             R,               I
##VAR_TYPE=  INDEPENDENT,   DEPENDENT,       DEPENDENT
##VAR_FORM=  AFFN,          ASDF,            ASDF
##VAR_DIM=   32768,         32768,           32768
##UNITS=     HZ,            ARBITRARY UNITS, ARBITRARY UNITS
##FACTOR=    0.157963299565203, 1,           1
##FIRST=     4132.6476996994, 0,             0
##LAST=      -1043.33573715361, 0,           0
##MIN=       -1043.33573715361, -130401,     0
##MAX=       4132.6476996994, 360748366,     0
$$ Real data points
##PAGE= N=1
##DATA TABLE= (X++(R..R)), XYDATA
$$ [...]
18619C1792259m422442m225489l814800l234094k670215k111604j664748j329117
$$ 31792259 27369817 23144328 19329528 16095434 13425219 11313615 9648867 8319750
18611H319750j116612q68245o97075n79414n37003m54960l40924l12290k46570
$$ 8319750 7203138 6334893 5637818 5058404 4521401 4066441 3725517 3413227 3166657
18602C166657j99769j56337j76448j81237j45504j16098m7857q5501j06569r9414
$$ 3166657 2966888 2810551 2634103 2452866 2307362 2191264 2143407 2057906 1951337 1851923
18592A851923q6018p3415p8002p7608l4642q2546p5868k9377o3592o3395o3001
$$ 1851923 1765905 1692490 1614488 1536880 1502238 1419692 1343824 1314447 1250855 1187460 1124459
18581A124459o8375m3558l4754q0257p0083p9407p9346l3736l3045j9351l514
$$ 1124459 1056084 1012526 977772 897515 827432 748025 668679 634943 601898 582547 579033
18570E79033j7597m1244J0614k0880j0032j214J5512k5293k6840l5052j8354l3078
$$ 579033 561436 520192 530806 509926 499894 498680 514192 488899 462059 427007 408653 375575
18558C75575n154j1288l1413M588Q512k7545m5311j0494J3351J3463R894L412
$$ 375575 370421 359133 327720 332308 340820 313275 267964 257470 270821 284284 294178 297590
18546B97590q960l3436j4672j6944p625K3008l6590j8092L3143r259J3793M389
$$ 297590 288630 255194 240522 223578 215953 238961 202371 184279 217422 208163 221956 226345
18534B26345r332K8462k7878m6561j9460k0131K096L3972L1129m95j6934l6899
$$ 226345 217013 245475 217597 171036 151576 131445 133541 167513 198642 198147 181213 144314
18522A44314J6954r592n188k1905m363K8963Q161J132m2787p313M2050j1484q011
$$ 144314 161268 151676 146488 124583 120220 149183 157344 158476 115689 108376 150426 138942 130931
18509A30931j8349j3315J3115K1551k7177l3659L3754K8772j9301j3962K1593
$$ 130931 112582 99267 112382 133933 106756 73097 106851 135623 116322 102360 123953
18498A23953K60n7176l0313l8514N4313K8605j2735J2133M525L3153K89m2003
$$ 123953 124213 67037 36724 -1790 52523 81128 68393 80526 85051 118204 118493 76490
18486G6490k3172m2011k8673K6212L2670k0470K875K1628k6457k5934J1242L6223
$$ 76490 53318 11307 -17366 8846 41516 21046 23921 45549 19092 -6842 4400 40623
18474D0623J3534O722L1607K2218R698l1113p263q566L95m6939j693J9782J3742
$$ 40623 54157 60879 92486 114704 124402 93289 86026 77460 77855 30916 29223 49005 62747
18461F2747K1726L618j9831o863J3042j910K7915j551l5941K3035n608l9329j8926
$$ 62747 84473 88091 68260 61397 74439 72529 100444 98893 62952 85987 80379 41050 22124
18448B2124O034J4423J3293J3984j7639M587j146r198K6170L0646K1229l0097
$$ 22124 28158 42581 55874 69858 52219 56806 55660 46462 72632 103278 124507 94410
18436I4410o2560O024J8242Q201j9295m7311j0733M2023j9074p104K9496K6074
$$ 94410 31850 37874 56116 64317 45022 -2289 -13022 29001 9927 2823 32319 58393
18424E8393m6834n8L8865K2046Q602l1562l9831n612k0171l1958L0936J7518K3447
$$ 58393 11559 11501 50366 72412 81014 49452 9621 4009 -16162 -48120 -17184 334 23781
18411B3781O178j6437K0000r451J4754j9052j4686q435Q783R830J0983L2689j194
$$ 23781 29959 13522 33522 24071 38825 19773 5087 -3348 5435 15265 26248 58937 57743
18398E7743m7225J729J3547n225L588Q789k4177j526J8520j9004j2234k4173p637
$$ 57743 10518 12247 25794 20569 24157 32946 8769 7243 25763 6759 -5475 -29648 -37285
18385c7285K5946L2616J9245P138J6315k6697k0707M27L7838L1880k5328m367
$$ -37285 -11339 21277 40522 47660 63975 37278 16571 16998 54836 86716 61388 57021
18373E7021j2525m2002j1888n368K1630J5369L2358q325k5932l230J0914J1052
$$ 57021 44496 2494 -9394 -14762 6868 22237 54595 46270 20338 17108 28022 39074
18361C9074K5788J0427k2691k6964r996L0395J3424l157n9861j3635L698k8493
$$ 39074 64862 75289 52598 25634 15638 46033 59457 56300 -3561 -17196 -13498 -41991
18349d1991N120N3081J3339J1611j7442j9607K2415j0970k2269K1770L973M307
$$ -41991 -36871 16210 29549 41160 23718 4111 26526 15556 -6713 15057 19030 23337
18337B3337N095j8791J5970l970J1809P840J8148K6673j7346j5102l7278j9039
$$ 23337 28432 9641 25611 21641 33450 41290 59438 86111 68765 53663 16385 -2654
18325b654k3299k6732K9602K1975K7094L4774n072k7216l2817k0440L4131L5559
$$ -2654 -25953 -52685 -23083 -1108 25986 60760 55688 28472 -4345 -24785 9346 44905
18313D4905J0516n873j5952k7343K0556O059o081q402j1985p745J4709J015Q117
$$ 44905 55421 49548 33596 6253 26809 32868 26787 18385 6400 -1345 13364 14379 22496
18300B2496p970M330R420P988j601k2025j6772j4816Q367L9173L139K9975J2284
$$ 22496 14526 18856 28276 36264 34663 12638 -4134 -18950 -10583 28590 31729 61704 73988
18287G3988j2818k0833P864k2314N187k282k0248l3072J2924L7629P007K0986
$$ 73988 61170 40337 48201 25887 31074 28792 8544 -24528 -11604 26025 33032 54018
18275E4018K1547r353l3474K695J3534o19m367J9136K2665j652R905J3301k6193
$$ 54018 75565 66212 32738 35433 48967 48348 43981 63117 85782 84130 94035 107336 81143
18262H1143o542k8427k1717M5284M393j5537l1694m9437M322K5833J6630K860
$$ 81143 74601 46174 24457 69741 74134 58597 26903 -22534 -18212 7621 24251 27111
18250B7111J6547k305K5835k8294j8854J7619N824O10K1183N9938K849n1270n2536
$$ 27111 43658 41353 67188 38894 20040 37659 43483 44093 65276 125214 128063 76793 24257
18237B4257l6649n5564j8840L8205N2423K5242O869j8858j3227K8169j7383j3628
$$ 24257 -12392 -67956 -86796 -48591 3832 29074 35943 17085 3858 32027 14644 1016
18225A016R856L4k1637L3478J4721j1786j7495J7747J396r577o862r79P231O212
$$ 1016 10872 10906 -10731 22747 37468 25682 8187 25934 27330 17753 10891 9912 17143 23355
18211B3355N6788j1321m4238j7747j72k40J9463J3810N973J5224J1781L3584j4217
$$ 23355 80143 68822 24584 6837 6665 6425 25888 39698 45671 60895 72676 106260 92043
18198I2043j067j3926m090k4881n6470m8856O39J4534P374L703M3065k916j0209
$$ 92043 90976 77050 72960 48079 -8391 -57247 -56608 -42074 -34700 -30997 12068 9152 -1057
18185a057o568q943j2138N525M5128P6919L2621m2892o0111n924j8268J9716K4126
$$ -1057 -7625 -16568 -28706 -23181 21947 98866 131487 88595 28484 22560 4292 24008 48134
18172D8134Q841K0819j9234l015k1184k382K1018P024l230J2406K744m8132k9087
$$ 48134 56975 77794 58560 55545 34361 31979 52997 60021 56791 69197 71941 23809 -5278
18159e278M6898K5590j784j3519L344K4231L2603P574K8274K8520L268K2017K4794
$$ -5278 41620 67210 65426 51907 55251 79482 112085 119659 147933 176453 179721 201738 226532
18146B26532L7081P4589O5834K1862J8089M2617K441J4998R587l8291R77Q463
$$ 226532 263613 338202 404036 425898 443987 486604 489045 504043 513630 475339 476316 484779
18134D84779Q626N4061P6759J1972m0081j9460O335N56n202K3642K9470N4421
$$ 484779 493405 547466 624225 636197 596116 576656 582991 583547 578345 601987 631457 685878
18122F85878P4891P9865J20673J49119J99397K39145L00603L59016M60144N79645
$$ 685878 760769 840634 961307 1110426 1309823 1548968 1849571 2208587 2668731 3248376
18112C248376Q12703J208021J728812K918447N844478J2455553K2184597J6902093
$$ 3248376 4061079 5269100 6997912 9916359 15760837 28216390 50400987 67303080
18104F7303080n504421r306006j0702955j4665702j1294225o171025l292155j858716
$$ 67303080 61798659 52492653 41789698 27123996 15829771 9658746 6366591 4507875
18096D507875j101305o73549n30784m17724k64841k12735j70594j34961r9624
$$ 4507875 3406570 2733021 2202237 1784513 1519672 1306937 1136343 1001382 901758
18087I01758r7764n9277l8951l7051m4199p8117n6174n2159o5288m7690k0247
$$ 901758 803994 744717 705766 668715 624516 546399 490225 438066 372778 325088 304841
18076C04841j2426j4340o006k9906l3923k0636M44J5891k0965j9384q214k4251
$$ 304841 292415 278075 272069 242163 208240 187604 188048 203939 182974 163590 155376 131125
18064A31125J9976m2901m7785k3569L672k2203J7925L6854K4611M131J3383M1819
$$ 131125 151101 108200 60415 36846 40518 18315 36240 73094 97705 101836 115219 157038
18052A57038L3106m608K929j0227k7320j6561J0491k7371n962L17k0245j4358
$$ 157038 190144 185536 188465 178238 150918 134357 144848 117477 111515 111832 91587 77229
18040G7229M731j158n783n960k3782J2727J8514j4609m3547k0966K6249l857l0853
$$ 77229 81960 80802 75019 69059 45277 58004 76518 61909 18362 -2604 23645 19788 -11065
18027a1065L881N1420K5349j770k0250K718k861j2791J7239O713M858l9750n78
$$ -11065 -7184 44236 69585 67815 47565 50283 47422 34631 51870 58583 63441 23691 23113
18014B3113J2467l153q603k2210m1944j533L471J8347L6323J2286n196j4518n5060
$$ 23113 35580 32427 23824 1614 -40330 -41863 -38392 -20045 16278 28564 23368 8850 -46210
18001d6210r743M9098L5506L7557M8568K758j3017k9500N11P231K5142L116L1255
$$ -46210 -55953 -6855 28651 66208 114776 117534 104517 75017 75528 82759 107901 111017 142272
17988A42272O463k5620J2110K9778J204K9998J0090k2527m4997j403K1926Q607
$$ 142272 148735 123115 135225 165003 166207 196205 206295 183768 138771 137368 159294 167901
17976A67901L3355N879J247k2509l6938m2334n7176k2994K1485J4781J7618j5410
$$ 167901 201256 207135 208382 185873 148935 106601 49425 26431 47916 62697 80315 64905
17964F4905j7809r74K2652K944L7244O491L0937K3769K4192M1214J6585R33l2
$$ 64905 47096 46122 68774 71718 108962 115453 146390 170159 194351 235565 252150 253083 253051
17951B53051K2699J1281N307j8139j2392j7825L5813j1106P766K8435l1174n5230
$$ 253051 275750 287031 292338 274199 261807 243982 279795 268689 276455 304890 273716 218486
17939B18486j6529p306k2731k5098o966l8338j3979J1279J2342j845L5579l7097
$$ 218486 201957 194651 171920 146822 139856 101518 87539 98818 111160 109315 144894 107797
17927A07797l7197K646j5017j923j5774J3566Q599k6665n7151J0589R513q876
$$ 107797 70600 73246 58229 56306 40532 54098 62697 36032 -21119 -10530 -1017 -9893
17915i893K0512J0118r742j2153j8551p120K7140K261J6401P495o983K163J2225
$$ -9893 10619 20737 10995 -1158 -19709 -26829 311 2572 18973 26468 19485 21648 33873
17902C3873k4022k2248k0505o707m466L6111L5306M628j8377n267k736L450L3412
$$ 33873 9851 -12397 -32902 -39609 -44075 -7964 27342 31970 13593 8326 5590 9040 42452
17889D2452K5030l543j8387k9311m3393K2186J4407j721j1881R078j9427k6693
$$ 42452 67482 63939 45552 16241 -27152 -4966 9441 7720 -4161 4917 -14510 -41203
17877d1203K7554L0826k0455P283K9005K2514K108l1767l3277R584Q975k2883
$$ -41203 -13649 17177 -3278 4005 33010 55524 57632 25865 -7412 2172 11147 -11736
17865a1736l8419J5556J4978K3766K1523q943p1953k8048L4322L3914o11J7508
$$ -11736 -50155 -34599 -19621 4145 25668 16725 -55228 -83276 -48954 -15040 -15651 1857
17853A857J7202r684k97k9476j3282L1689p122j4092k1904k7164K9300J1212j1164
$$ 1857 19059 9375 9078 -20398 -33680 -1991 -9113 -23205 -45109 -72273 -42973 -31761 -42925
17840d2925M660l13p837K2539K7840J2310k6159p995J8648J0763j3385k5180O5885
$$ -42925 -38265 -38578 -46415 -23876 3964 16274 -9885 -17880 768 11531 -1854 -27034 38851
17827C8851M2158J0478l0641j8944l4875J1630J38o347j0550K3048m812k6574
$$ 38851 81009 91487 60846 41902 7027 18657 18795 12448 1898 24946 20134 -6440
17815f440k1782L0177L2914j9719k2413j3339n120M7301M647k6423j0246r152
$$ -6440 -28222 1955 34869 15150 -7263 -20602 -25722 21579 26226 -197 -10443 -19595
17803a9595k1297j1327M451O566J5287L0778J7033j731k4955k484m158J5908K236
$$ -19595 -40892 -52219 -47768 -41202 -25915 4863 21896 20165 -4790 -7274 -11432 4476 6712
17790F712l8221o2024J2736N0414J9141j5726k8713M449L8830J3979l669j804
$$ 6712 -31509 -93533 -80797 -30383 -11242 -26968 -55681 -51232 -12402 1577 -2092 -3896
17778c896M206M620P082j560j1641P941m47k0085K017J0994K9837k5777K050L7614
$$ -3896 310 4930 12012 10452 -1189 6752 6305 -13780 -11763 -769 29068 3291 5341 42955
17764D2955M325l582j0447k7866l155j8990j4360j5618J4190j6367q79L2048P350
$$ 42955 47280 43698 33251 5385 2230 -16760 -31120 -46738 -32548 -48915 -49794 -17746 -10396
17751a0396K9596L1311l3699k6819L1593K2114l3489k6603j8789J0805O302L7450
$$ -10396 19200 50511 16812 -10007 21586 43700 10211 -16392 -35181 -24376 -18074 19376
17739A9376K7573q276o1311m1069k1223j4990K5475J0289K1295J8404K3195j6712
$$ 19376 46949 38673 -22638 -63707 -84930 -99920 -74445 -64156 -42861 -24457 -1262 -17974
17727a7974j2725Q253K108L1739O635j9693k4164L0237J5620n243J0151j6913
$$ -17974 -30699 -22446 -20338 11401 18036 -1657 -25821 4416 20036 14793 24944 8031
17715H031k8626k7381J7423l4360Q17O5914J9290j0706J4647p898K2517K2101
$$ 8031 -20595 -47976 -30553 -64913 -64096 1818 21108 10402 25049 17151 39668 61769
17703F1769j0752l1485l8658l3688J3925L7804l444j3461J5321J5881J5724N870
$$ 61769 51017 19532 -19126 -52814 -38889 -1085 -4529 -17990 -2669 13212 28936 34806
17691C4806J4406N879n7239m8985j5850R578J2922j4357m1721J9145K7566L6732
$$ 34806 49212 55091 -2148 -51133 -66983 -57405 -44483 -58840 -100561 -81416 -53850 -17118
17679a7118Q515L88m057k4003J5050J6815J6830j0464l4368P418K2426J9685m251
$$ -17118 -8603 -8215 -12272 -36275 -21225 -4410 12420 1956 -32412 -24994 -2568 17117 12866
17666A2866M322L7297K1865j9517k8180k9177l7306J3580N2010K5463J7363k4431
$$ 12866 17188 54485 76350 56833 28653 -524 -37830 -24250 27760 53223 70586 46155
17654D6155l3995j418k2777k9889N964K9036J1574K9592M2414k5615o1577j598
$$ 46155 12160 10742 -12035 -41924 -35960 -6924 4650 34242 76656 51041 -10536 -12134
17642a2134l3967j2318P672L2893j2175p52O556n020K69k5341l3599J4930M8894
$$ -12134 -46101 -58419 -50747 -17854 -30029 -30781 -24225 -29245 -28976 -54317 -87916 -72986 -24092
17629b4092K0500J1088l521l6095J3604L6372q970l3688j9741j251m600L9343
$$ -24092 -3592 7496 3975 -32120 -18516 17856 8886 -24802 -44543 -45794 -50394 -11051
17617a1051J2014r708m188j679l048L069k1005K1200Q044l5689k3999K2672J7705
$$ -11051 963 -8745 -12933 -14612 -17660 -14591 -35596 -14396 -6352 -42041 -66040 -43368 -25663
17604b5663k5637K111M7422l0476k1113K2456q786J532l226k1162j8674K3603
$$ -25663 -51300 -49189 -1767 -32243 -53356 -30900 -39686 -38154 -41380 -62542 -81216 -57613
17592e7613J7593o296K7283k257k528L3059J4089o581K3549j9715k6671j2461
$$ -57613 -40020 -46316 -19033 -21290 -23818 9241 23330 16749 40298 20583 -6088 -18549
17580a8549k1149j6580J0280J6220J2928k2640q435L2162M8467j3444q005j945
$$ -18549 -39698 -56278 -45998 -29778 -16850 -39490 -47925 -15763 32704 19260 11255 9310
17568I310k5264j0895K0265J1407N667k8397M004M147N867k9473k0858k1215L8486
$$ 9310 -15954 -26849 -6584 4823 10490 -17907 -13903 -9756 -3889 -33362 -54220 -75435 -36949
17555c6949M0499Q897o319j0396M935n026N467k8083p232o97J5198L0981L2002
$$ -36949 3550 12447 6128 -4268 667 -4359 1108 -26975 -34207 -34904 -19706 11275 43277
17542D3277k6447j1042j378j309K135k5523n255M608J4852J9854K0834J8162m7167
$$ 43277 16830 5788 4410 3101 5236 -20287 -25542 -20934 -6082 13772 34606 52768 5601
17529E601k2143j4458k294K0907K6806M946p507j4813k0158k7107K1104J485j2235
$$ 5601 -16542 -31000 -33294 -12387 14419 19365 11858 -2955 -23113 -50220 -29116 -27631 -39866
17516c9866K1064M3265J4717r485l5540k2210J7797L0503J5763J8450p286j0087
$$ -39866 -18802 24463 39180 29695 -5845 -28055 -10258 20245 36008 54458 47172 37085
17504C7085o551m614J9315K1643l1714l914j4134j8704j1265n895L1846L6671
$$ 37085 30534 25920 45235 66878 35164 31250 17116 -1588 -12853 -18748 13098 49769
17492D9769j6827k5863k5890k9155j254J051j6970N512o890M2146J8406n848K7649
$$ 49769 32942 7079 -18811 -47966 -49220 -48169 -65139 -59627 -66517 -24371 -5965 -11813 15836
17479A5836j3946k2834k0338l203K2714M2588j5374j802j7309p261J0296O132
$$ 15836 1890 -20944 -41282 -44485 -21771 20817 5443 3641 -13668 -20929 -10633 -4501
17467d501J838J5260o039l6390J5988l117N905M919R677p559o709J8132J7992
$$ -4501 -2663 12597 6558 -29832 -13844 -16961 -11056 -6137 3540 -4019 -10728 7404 25396
17454B5396r022Q193M50k5118J176L707j5134K294K0836M1790K6920N780K1054
$$ 25396 16374 24567 25017 -101 1075 4782 -10352 -8058 12778 54568 81488 87268 108322
17441A08322J3261J02313J54390Q963o6302m3302p6957o9355n1453k3157p240
$$ 108322 121583 223896 378286 387249 320947 277645 200688 131333 79880 56723 49483
17430D9483j6598m9200l9753k5244K9814N2291N2870R917j7471l8368L964j6857
$$ 49483 32885 -16315 -56068 -81312 -51498 793 53663 63580 46109 7741 11705 -5152
17418e152k0949n933j5383R446J5190J6236j4435J990N682N156K596k8764J1347
$$ -5152 -26101 -32034 -47417 -37971 -22781 -6545 -20980 -18990 -13308 -8152 -5556 -34320 -22973
17405b2973L0836k044R53J8472k7144k2116J5972O233M4689j1153L697Q219o0677
$$ -22973 7863 5819 6772 25244 -1900 -24016 -8044 -1811 42878 31725 35422 43641 -17036
17392a7036l2330q100L5992L6373L3065l997q76k4901l7895P486K877o710N716
$$ -17036 -49366 -57466 -21474 14899 47964 43967 43091 18190 -19705 -12219 -9342 -16052 -10336
17379a0336j2866L332K0639j1146l1870p450J9099J8428J7114l896k1891l3871
$$ -10336 -23202 -19870 769 -10377 -42247 -49697 -30598 -12170 4944 1048 -20843 -54714
17367e4714j7933Q147L3668j2690K4984L8716J2774J5685o867J8788k865k1722
$$ -54714 -72647 -64500 -30832 -43522 -18538 20178 32952 48637 41770 60558 57693 35971
17355C5971j9798k267J5447l9903k2834k7618p902N0621O893l1863k213L6150
$$ 35971 16173 13906 29353 -10550 -33384 -61002 -68904 -18283 -11390 -43253 -45466 -9316
17343i316J8587k3011n483K3266r006l9830k3515N798J6837J6110K0233L2463
$$ -9316 9271 -13740 -19223 4043 -4963 -44793 -68308 -62510 -45673 -29563 -9330 23133
17331B3133K3447j358J6138K7925n3678l2691R398j1554k6391J0463l2792j838
$$ 23133 46580 45222 61360 89285 35607 2916 12314 760 -25631 -15168 -47960 -49798
17319d9798M6224j1872m6487L2147m390K8419l038l3378k1004k6851J4120L7912
$$ -49798 -3574 -15446 -61933 -29786 -34176 -5757 -8795 -42173 -63177 -90028 -75908 -37996
17307c7996J0611K5766o914j4076j4080K3067M1190r88k5595k1675j3975K3720
$$ -37996 -27385 -1619 -8533 -22609 -36689 -13622 27568 26580 985 -20690 -34665 -10945
17295a0945K4732J2016r932l8278P639m142j641l966R372r076K4104J4556J6081
$$ -10945 13787 25803 15871 -22407 -14768 -18910 -20551 -24517 -15145 -24221 -117 14439 30520
17282C0520m917n2566M907J7245J3520k8098j5120R970L473M7856J0422k886J3651
$$ 30520 25603 -26963 -22056 -4811 8709 -19389 -34509 -24539 -21066 26790 37212 34326 47977
17269D7977j0962n0536j6708J0419K0358l041J8286m810J4703J0221j3587j3781
$$ 47977 37015 -13521 -30229 -19810 548 -2493 15793 10983 25686 35907 22320 8539
17257H539n196l4442k4021J2247L0880L7198K4177k0576k4503k4158M3326J2159
$$ 8539 3343 -31099 -55120 -42873 -11993 25205 49382 28806 4303 -19855 23471 35630
17245C5630k6536k4153J5693k979l1652j5104K5728R855L0368J7198k1454j3185
$$ 35630 9094 -15059 634 -2345 -33997 -49101 -23373 -13518 16850 34048 12594 -591
17233e91o452j7662J8113l2476j1872J9863J3763n343J9858k0490o443k2669l635
$$ -591 -7043 -24705 -6592 -39068 -50940 -31077 -17314 -22657 -2799 -23289 -29732 -52401 -56036
17220e6036Q007O399J0935J3179L3190K113j6381j2581J8105q6N90k0205l4948
$$ -56036 -48029 -41630 -30695 -17516 15674 17787 1406 -11175 6930 6844 7434 -12771 -47719
17207d7719m2759M0608L9485M6827j2116j09m7429l6120L8045K6999J9097L5793
$$ -47719 -90478 -49870 -10385 36442 24326 24217 -23212 -59332 -21287 5712 24809 60602
17195F0602j0468j5439J1814N339J6964o029j4185k6441m5728k7743m527J5018
$$ 60602 50134 34695 46509 51848 68812 62783 48598 22157 -23571 -51314 -55841 -40823
17183d0823M1254J2619k5712j62R94k5058j9566O0383J4304j1749j5446J1793
$$ -40823 431 13050 -12662 -12824 -11830 -36888 -56454 3929 18233 6484 -8962 2831
17171B831J923J5354q046j0445L572K9514l52R520o987n122q988p824J6735J1139
$$ 2831 4754 20108 12062 1617 5189 34703 34351 43871 36884 31762 22774 14950 31685 42824
17157D2824k2385j8J5816j1705l858j1250l4848m3509k0017K1079K5260M7481
$$ 42824 20439 20421 36237 24532 20674 9424 -25424 -68933 -88950 -67871 -42611 4870
17145D870q112k5162o607N5901m513j8527j0427l7466o910J076q35j1644L6044
$$ 4870 -3242 -28404 -35011 20890 16377 -2150 -12577 -50043 -56953 -55877 -56712 -68356 -32312
17132c2312M2348J4597m4512J572J6436L168o008K4291j9686K636j1927J1697
$$ -32312 10036 24633 -19879 -18307 -1871 1297 -4711 19580 -106 2530 -9397 2300
17120B300O309k3709j2323j3709j0819j0520J8076q297M8478L3770l2145n0892
$$ 2300 8609 -15100 -27423 -41132 -51951 -62471 -44395 -52692 -4214 29556 -2589 -53481
17108e3481K3246M0210J5608j4846O08k1491P205J0558k9679O611R184M9692n337
$$ -53481 -30235 9975 25583 10737 11345 -10146 -2941 7617 -22062 -15451 -6267 43425 38088
17095C8088j6472K4078l8915l6669j7994J0963K5574Q234k2864l0895L164J0309
$$ 38088 21616 45694 6779 -29890 -47884 -36921 -11347 -3113 -25977 -56872 -53708 -43399
17083d3399L6977J8626K2798n758j1874L020J2366k6287l3006j65J6862J1003
$$ -43399 -6422 12204 35002 29244 17370 20390 32756 6469 -26537 -26702 -9840 1163
17071A163K18n102k3730k6633L7160J1967L7020j2397P864J7697J0569j1787l34
$$ 1163 1381 -3721 -27451 -54084 -16924 -4957 32063 19666 27530 45227 55796 44009 43675
17058D3675J4960j8015j5150J516j5199j2279K88J7047o261j7349k4953n683J3867
$$ 43675 58635 40620 25470 26986 11787 -492 -204 16843 10582 -6767 -31720 -37403 -23536
17045b3536l8155k2688K9115L4205K7914j2684R652K6844J2676j6582p834j3730
$$ -23536 -61691 -84379 -55264 -21059 6855 -5829 3823 30667 43343 26761 18927 5197
17033E197p270N290j3O946j7282r177K7320j2474j7893m247l075L1592M0133K5140
$$ 5197 -2073 3217 3204 10150 -7132 -16309 11011 -1463 -19356 -23603 -26678 4914 45047 70187
17019G0187r981k4291k2327J2916j1927k7853j7864J13J087k2585J7099K0833
$$ 70187 60206 35915 13588 26504 14577 -13276 -31140 -31027 -29940 -52525 -35426 -14593
17007a4593K9376J3225J6980l3735m1762j5205O1865k4023m5719j467J152N4439
$$ -14593 14783 28008 44988 11253 -30509 -45714 16151 -7872 -53591 -55058 -53906 533
16995E33K1846Q162k16l1328j0758J1151L3453j5236l4272p35Q129L2630P008
$$ 533 22379 30541 30325 -1003 -11761 -610 32843 17607 -16665 -17400 -9271 23359 30367
16982C0367r524r06j5713j4946M327Q92k2717j5922L439K7465j0551q724p302
$$ 30367 20843 19937 4224 -10722 -6395 -5503 -28220 -44142 -40703 -13238 -23789 -32513 -39815
16969c9815k1610J8333j2936r573K3445P011k738J5092j7248r295J2923L6384
$$ -39815 -61425 -43092 -56028 -65601 -42156 -35145 -37883 -22791 -40039 -49334 -36411 -27
16957b7j2526k7814J635J4595K6298K3981J2156p578l9760J3028j4206R004L7310
$$ -27 -12553 -40367 -38732 -24137 2161 26142 38298 30720 -9040 3988 -10218 -1214 36096
16944C6096j0417k9507j2535J840m760l5712L2925N7543o792q7l2851p107M041
$$ 36096 25679 -3828 -16363 -14523 -19283 -54995 -22070 35473 28681 28594 -4257 -11364 -7323
16931g323N193M86j7567J1804J4444l837K158k8439k3667j2130K4752Q346P431
$$ -7323 -2130 -1644 -19211 -7407 7037 3200 5358 -23081 -46748 -58878 -34126 -25780 -18349
16918a8349K1270o855l918K6486n538J393N589R334M155m3961k147K0242J721
$$ -18349 2921 -3934 -7852 18634 13096 14489 20078 29412 33567 -10394 -12541 7701 9422
16905I422K9938L389l6141o610L8249p81r368j5851m5321r012k1866N978N5131
$$ 9422 39360 42749 6608 -2 38247 37466 28098 12247 -33074 -42086 -63952 -57974 -2843
16892b843N5786Q852J062k6272J0855L8288P711l8903k8495k1855K4495O419O78
$$ -2843 52943 61795 62857 36585 47440 85728 93439 54536 26041 4186 28681 35100 35778
16879C5778j8136J8472J0843R864j6884j4512k4422m8402o967J5558J6424P623
$$ 35778 17642 36114 46957 56821 39937 25425 1003 -47399 -54366 -38808 -22384 -14761
16867a4761K2093o168j8835J1547j2633L51J9007j8656N48j3476j6685J8750M381
$$ -14761 7332 1164 -17671 -6124 -18757 -18406 601 -18055 -17507 -30983 -47668 -28918 -24537
16854b4537l3765j7727K4846R432K2699l730P528J0401J0403K292k3465l9937
$$ -24537 -58302 -76029 -51183 -41751 -19052 -22782 -15254 -4853 5550 7842 -15623 -55560
16842e5560j3871m410K5561L0164q821r659J7514J0884q993K0378J9230K5677
$$ -55560 -69431 -73841 -48280 -18116 -26937 -36596 -19082 -8198 -17191 3187 22417 48094
16830D8094j5528o331k5425J123J867Q067m514K7296Q436j8105j8390l281K3235
$$ 48094 32566 26235 810 1933 3800 11867 7353 34649 43085 24980 6590 3309 26544
16817B6544Q362k3372j6199j9663m7067j6864J7138N4002j4496l3624J3333K8376
$$ 26544 34906 11534 -4665 -24328 -71395 -88259 -71121 -17119 -31615 -65239 -51906 -23530
16805b3530J5687L563j193j0505j4444K5803K2935j9590l62M831r037l0628Q614
$$ -23530 -7843 -4280 -5473 -15978 -30422 -4619 18316 -1274 -1636 3195 -5842 -36470 -27856
16792b7856Q287m1048j635j0924n789J8511J9393j293j1248K0844N3524Q652j7196
$$ -27856 -19569 -60617 -62252 -73176 -78965 -60454 -41061 -42354 -53602 -32758 20766 29418 12222
16779A2222m515j4021q107m1834m890L0135K1096O003m020M726l559m9715n744
$$ 12222 7707 -6314 -14421 -56255 -61145 -31010 -9914 -3911 -7931 -3205 -6764 -56479 -62223
16766f2223J2778K8791J4071k6340K1982J4184k8376k201o560j657j1797r904
$$ -62223 -49445 -20654 -6583 -32923 -10941 3243 -25133 -27334 -33894 -35551 -47348 -57252
16754e7252K6461J4852K087j823k397J2981K4666L7698r579k895j4739j6549j6004
$$ -57252 -30791 -15939 -13852 -15675 -18072 -5091 19575 57273 47694 44799 30060 13511 -2493
16741b493J8134l0452q602M43j4607m83L0001q622n768P539J369O375L8948k5580
$$ -2493 15641 -14811 -23413 -22970 -37577 -38060 -8059 -16681 -22449 -14910 -13541 -7166 31782 6202
16727F202j2879K2045J212l5074k6551K5R295J1181k5595j1520j8833k7305M8030
$$ 6202 -6677 15368 16580 -18494 -45045 -45020 -35725 -24544 -50139 -61659 -80492 -107797 -59767
16714e9767M6438J5845p289K087J0226L448O737J1722j3676m7014r157o866J3544
$$ -59767 -13329 2516 -4773 -2686 7540 10988 17725 29447 15771 -31243 -40400 -47266 -33722
16701c3722J8136N2936m789k8973p430K6557K3404k3119j5449J6405J0981o266
$$ -33722 -15586 37350 32561 3588 -3842 22715 46119 23000 7551 23956 34937 28671
16689B8671m5743l8207N5854L0193j9569k6327j7215L1747O915k0503k5566J61
$$ 28671 -17072 -55279 575 30768 11199 -15128 -32343 -596 6319 -14184 -39750 -39589
16677c9589j4124K8125K9083M0202j3444k1953N04r581j3560l1224L661J1320
$$ -39589 -53713 -25588 3495 43697 30253 8300 8804 -777 -14337 -45561 -41900 -30580
16665c0580m880k514K891J8365N855l3055n93r242j5974J0508K8242J0028q606
$$ -30580 -35460 -37974 -35083 -16718 -10863 -43918 -44511 -53753 -69727 -59219 -30977 -20949 -29555
16652b9555J1077O093K8187J5212M512j2734k41o116M429k4014k2815l4332j2483
$$ -29555 -18478 -12385 15802 31014 35526 22792 22551 16435 20864 -3150 -25965 -60297 -72780
16639g2780J7237K9799J5089k7246m926J5280J3821N244J2855J9784K7470k195
$$ -72780 -55543 -25744 -10655 -37901 -42827 -27547 -13726 -8482 4373 24157 51627 49432
16627D9432k7307k6491k0098N5767N138k2900k4192k8238K763j3806j380R029
$$ 49432 22125 -4366 -24464 31303 36441 13541 -10651 -38889 -36126 -49932 -51312 -42283
16615d2283k695N081j0928J9467n203J8012L7933r750m2524q961K7409Q473J9903
$$ -42283 -44978 -39897 -50825 -31358 -36561 -18549 19384 9634 -32890 -41851 -14442 -5969 13934
16602A3934K9901j8835k0478J3476j4139m1232R906J3281p084K142J6851Q912
$$ 13934 43835 25000 4522 17998 3859 -37373 -27467 -14186 -21270 -19128 -2277 6635
16590F635m31L3476j990K802O351j2769M357l6655m367j0536j8023J1055J1308
$$ 6635 6204 39680 37690 40492 46843 34074 38431 1776 -2591 -13127 -31150 -20095 -8787
16577h787K2521n040l3868l2742K0768J5448O326R060k401J0065J7913k5510k8038
$$ -8787 13734 8694 -25174 -57916 -37148 -21700 -15374 -6314 -8715 1350 19263 -6247 -34285
16564c4285q256J5160n576q94J8008K9901l2115k7668J5587J7113K5257J9070
$$ -34285 -42541 -27381 -32957 -33851 -15843 14058 -18057 -45725 -30138 -13025 12232 31302
16552C1302J4425P69o961k8233j8037q337j0144J8885q019j2034K3267K6677k7944
$$ 31302 45727 46496 39535 11302 -6735 -15072 -25216 -6331 -14350 -26384 -3117 23560 -4384
16539d384l7817j1377K8255L3481M9469O109m0791q671J1730p697r602l789J3523
$$ -4384 -42201 -53578 -25323 8158 57627 63736 22945 14274 26004 18307 8705 4916 18439
16526A8439L1649N213o70M836k2931k3129L2534K8317j4467m3982l315P893J3325
$$ 18439 50088 55301 54631 59467 36536 13407 45941 74258 59791 15809 12494 20387 33712
16513C3712k3158k7293N629l017K5405L5107m2232n8983R693r002J2408N0263
$$ 33712 10554 -16739 -11110 -14127 11278 46385 4153 -54830 -45137 -54139 -41731 8532
16501H532L7806j2950j9489k4661m9650M757M7591J9647J4761k843O474N712r888
$$ 8532 46338 33388 13899 -10762 -60412 -55655 -8064 11583 26344 23501 29975 35687 25799
16488B5799j2611J7000K268l3233j7488L745K6515J6999j0350l3694P124j3817
$$ 25799 13188 30188 32456 -777 -18265 -14520 11995 28994 18644 -15050 -7926 -21743
16476b1743p345m1618L2863J0310l0741m337L026m709K1482L5344J7769M76J6681
$$ -21743 -29088 -70706 -37843 -27533 -58274 -62611 -59585 -64294 -42812 -7468 10301 10777 27458
16463B7458j5460o2588k228N232K78J5911K5204N082k666r075N420O026k7927
$$ 27458 11998 -50590 -52818 -47586 -47308 -31397 -6193 -1111 -3777 -12852 -7432 -1406 -29333
16450b9333k2122J2432L7042L4024l2889o5547j3696P605K3684J3559j196N918
$$ -29333 -51455 -39023 -1981 32043 -846 -66393 -80089 -72484 -48800 -35241 -36437 -30519
16438c0519M6527L3272j3927o2910L15J5126K0689K2194k0887k6628L41k3303
$$ -30519 16008 49280 35353 -27557 -27242 -12116 8573 30767 9880 -16748 -16407 -39710
16426c9710J3971L0637l5435j9321j1601J4493k0674j0317Q902O442J5968K2093
$$ -39710 -25739 4898 -30537 -49858 -61459 -46966 -67640 -77957 -69055 -62613 -46645 -24552
16414b4552q053k6596k5340J0820P1275J0095k6681n013r372J0571j8529o155
$$ -24552 -32605 -59201 -84541 -73721 -2446 7649 -19032 -24045 -33417 -22846 -41375 -47530
16402d7530l6220J3898M401J3619O736j9414j7166J259J6982R230j02J0700P757
$$ -47530 -83750 -69852 -65451 -51832 -45096 -64510 -81676 -80417 -63435 -54205 -54307 -43607 -35850
16389c5850j0068J5244N814J8752p289j8566K5560K9267K32j2351o375R400K6803
$$ -35850 -45918 -30674 -24860 -6108 -13397 -31963 -6403 22864 23096 10745 4370 13770 40573
16376D0573n26k401j6513m1485Q99J0262O913j3086K657K2265j0851k7038j1143
$$ 40573 40047 37646 21133 -20352 -19453 -9191 -2278 -15364 -12707 9558 -1293 -28331 -39474
16363c9474r28J3686J7592M3788n338J0949k0919l1443k855J3904j6184J856j1436
$$ -39474 -40402 -26716 -9124 34664 29326 40275 19356 -12087 -14942 -1038 -17222 -15366 -26802
16350b6802l323J176Q236Q219J231J8744K4185q915j266l5492j0363O29j5236
$$ -26802 -30125 -28949 -20713 -12494 -11263 7481 31666 22751 21485 -14007 -24370 -23741 -38977
16337c8977L4491M486k1470l073n829O993j9743j4331K8756L0182J4516K4463
$$ -38977 -4486 0 -21470 -24543 -30372 -23379 -43122 -57453 -28697 1485 16001 40464
16325D0464l0734p375j3615k1390k0141N083L6906k0212m761j0141r025L1777
$$ 40464 9730 2355 -11260 -32650 -52791 -47708 -10802 -31014 -35775 -45916 -54941 -23164
16313b3164J0239k42m060R130K82O332j2371J3423M245M253J838j8722Q973J1317
$$ -23164 -12925 -13167 -17227 -8097 -7815 -1483 -13854 -431 3814 8067 9905 -8817 156 11473
16299A1473p348L705k9788r518j1338K2525K981j6213o659M0465K5539J4457j2619
$$ 11473 4125 7830 -21958 -31476 -42814 -20289 -17308 -33521 -40180 285 25824 40281 27662
16286B7662j7221J4181k8106j1225J3018J1950J5111l7714k8070p701P953J2944
$$ 27662 10441 24622 -3484 -14709 -1691 10259 25370 -12344 -40414 -48115 -40162 -27218
16274b7218n918J8757N3129l4202o015J9516j9908p945K4980J8673j4250k6462
$$ -27218 -33136 -14379 38750 4548 -1467 18049 -1859 -9804 15176 33849 19599 -6863
16262f863j1912j7319J8779R409j700J7508J6673j496j4650M235r349J0755k4293
$$ -6863 -18775 -36094 -17315 -7906 -9606 7902 24575 23079 8429 12664 3315 14070 -10223
16249a0223j2277J7874j1161o997J461m21j9224j4295j1712L2610M1796N6410
$$ -10223 -22500 -4626 -15787 -22784 -21323 -21744 -40968 -55263 -66975 -34365 7431 63841
16237F3841m6718o6685l9066K9596L4659L19M39P915n915o342k812K9515l480
$$ 63841 17123 -49562 -88628 -59032 -24373 -24054 -23615 -15700 -21615 -27957 -30769 -1254 -4734
16224d734n3639o081j4284m889J8654J5640o736l2631L0625L3035j4203k0337
$$ -4734 -58373 -64454 -78738 -83627 -64973 -49333 -56069 -88700 -58075 -25040 -39243 -59580
16212e9580P450J5124J6364J4616L6890j5529k8405l5864J8341k311J3992K2216
$$ -59580 -52130 -37006 -20642 -6026 30864 15335 -13070 -48934 -30593 -32904 -18912 3304
16200C304k037k3418n117M0362K7563m4925l6638j3849J5080Q63K330n216j4737
$$ 3304 1267 -22151 -27268 13094 40657 -4268 -40906 -54755 -39675 -38812 -36482 -41698 -56435
16187e6435Q523L6772M8748k5069l7183N095J6053J1154P758P981l3118l6237
$$ -56435 -47912 -11140 37608 12539 -24644 -19549 -3496 7658 15416 23397 -9721 -45958
16175d5958j8224J2351q10k6532K3375K4813L5896j2868l0820J2205Q421j3471
$$ -45958 -64182 -51831 -52641 -79173 -55798 -30985 4911 -7957 -38777 -26572 -18151 -31622
16163c1622m14J9841L154J8236k9739l3162j4101N3057M577l1561j2243J1590
$$ -31622 -32036 -12195 -9041 9195 -20544 -53706 -67807 -14750 -10173 -41734 -53977 -42387
16151d2387J6222K9981K698k6486k2969J9966j8232k6259Q329N5566j0206k0716
$$ -42387 -26165 3816 6514 -19972 -42941 -22975 -41207 -67466 -59137 -3571 -13777 -34493
16139c4493j3011J4979J121k129k673Q057o811m472O798l949J6503J4159n098
$$ -34493 -47504 -32525 -31404 -33533 -36206 -28149 -34960 -39432 -32634 -36583 -20080 -5921 -11019
16126a1019J3792r754L9008j9412l3463J6810K69j9892K3376J32M422J5840J0917
$$ -11019 2773 -6981 32027 12615 -20848 -4038 -3769 -23661 -285 -153 4269 20109 31026
16113C1026L4894l0078j2608J6900k3448p804K0877j1668k9595j5817J468J9157
$$ 31026 65920 35842 23234 40134 16686 8882 29759 18091 -11504 -27321 -25853 -6696
16101f696L1852q059q47J4953O452m5389K9991J2467k044j9992K1587J6683J1520
$$ -6696 25156 17097 16250 31203 37655 -7734 22257 34724 32680 12688 34275 50958 62478
16088F2478q465l4921j1152K3863J4271l4225k3437q058n43r442l0366K5271M5775
$$ 62478 54013 19092 7940 31803 46074 11849 -11588 -19646 -20189 -29631 -59997 -34726 11049
16075A1049j539L0797n829n391K5636r906j3150J1051j259O084m1970n4816j7115
$$ 11049 9510 40307 34478 29087 54723 44817 31667 42718 41459 47543 5573 -49243 -66358
16062f6358K352k107M2132J4208L845o813J1056r742J4002R152k1380J2648k333
$$ -66358 -64006 -66113 -23981 -9773 -5928 -12741 -1685 -11427 2575 11727 -9653 2995 662
16049F62r82j9947O286j9793R273K8146M7373O331l1233j4767K7518K5928q032
$$ 662 -320 -20267 -13981 -33774 -24501 3645 51018 57349 26116 11349 38867 64795 56763
16036E6763j622O966n717j6501k0086J9040j0653k2087m1959k2524K0553K9046
$$ 56763 55141 62107 56390 39889 19803 38843 28190 6103 -35856 -58380 -37827 -8781
16024h781m79K2373N860k4324j0916j8856J2854J1228K0735L530L648K8992J400
$$ -8781 -9260 13113 18973 -5351 -16267 -35123 -22269 -11041 9694 13224 16872 45864 47264
16011D7264j8766r10J4073N926l530k5689K2587j9154p877j3399r30j1353j350
$$ 47264 28498 27588 41661 47587 44057 18368 40955 21801 13924 525 -405 -11758 -13108
15998a3108l1270M41j3179J5334k2846J5372L9696p591J7952O727M60k9433j3779
$$ -13108 -44378 -43937 -57116 -41782 -64628 -49256 -9560 -17151 801 7528 7988 -21445 -35224
15985c5224L8399L6616j179l3315L0685O625J0241j6059l355k3491j8798K5753
$$ -35224 3175 39791 38612 5297 35982 42607 52848 36789 33434 9943 -8855 16898
15973A6898K2202k1405m8590R322Q836j6647J1485k1026J6462Q187j3783r262
$$ 16898 39100 17695 -30895 -21573 -12737 -29384 -17899 -38925 -22463 -14276 -28059 -37321
15961c7321K2711L3404J9808j1754j6824l429j0027o818J2560O1205K5741N87
$$ -37321 -14610 18794 38602 26848 10024 6595 -3432 -10250 2310 63515 89256 89843
15949H9843j5981m1166l0352Q729K2145q12j5672m4427k0257N960j8860j805K809
$$ 89843 73862 32696 2344 11073 33218 32406 16734 -27693 -47950 -41990 -60850 -62655 -59846
15936e9846r444K1820J1497K3093k353k086J9522M141O744K8561L842m3339j466
$$ -59846 -69290 -47470 -35973 -12880 -15233 -17319 2203 6344 13088 41649 45491 2152 686
15923F86J0898m938j7253n287j1292j8421k0750N986N8413O992J4819K1624l2335
$$ 686 11584 6646 -10607 -15894 -27186 -45607 -66357 -60371 -1958 5034 19853 41477 9142
15910I142j1889J075K4964J0048j9498m7774k4906j3206K4880n75j321J792q445
$$ 9142 -2747 -1672 23292 33340 13842 -33932 -58838 -72044 -47164 -47739 -49060 -47268 -55713
15897e5713J4956N0953J7813k0211K069M170K4245r245j9369r669K2376k9816
$$ -55713 -40757 10196 28009 7798 9867 14037 38282 29037 9668 -1 22375 -7441
15885g441k7429K4927j9403j1331J7560L2753L5042L4893J0654l1820k5339k7220
$$ -7441 -34870 -9943 -29346 -40677 -23117 9636 44678 79571 90225 58405 33066 5846
15873E846k9082j2574J9197J8612l277R384J3211l61k7539K769l2901K2986o020
$$ 5846 -23236 -35810 -16613 1999 -1278 8106 21317 20956 -6583 -3814 -36715 -13729 -19749
15860a9749k5119k0709L321K5661L5131J7195p231j4475j9481j1047L5250J5249
$$ -19749 -44868 -65577 -62256 -36595 -1464 15731 8500 -5975 -25456 -36503 -1253 13996
15848A3996j0530l6049M74p14O970j927K3140k6062j8672M3857P301L812j5206
$$ 13996 3466 -32583 -32109 -32823 -25853 -27780 -4640 -30702 -49374 -5517 1784 5596 -9610
15835i610m0506j5292K0540K3265j0384K1495J7955K2285k0546J3997o832P26
$$ -9610 -50116 -65408 -44868 -21603 -31987 -10492 7463 29748 9202 23199 16367 17093
15823A7093j9654m747k253M101n129n93J3352P035M211J4280q077j7714l901J6553
$$ 17093 -2561 -7308 -9561 -5460 -10589 -11182 2170 9205 13416 27696 19619 1905 -1996 14557
15809A4557j2086n0758l3040L2368L7175K9719o218J0199k5962k8868j6271J4783
$$ 14557 2471 -48287 -81327 -48959 -11784 17935 11717 21916 -4046 -32914 -49185 -34402
15797c4402J7149K6131J4985j4355n084r284n417K4956P082L2087J4233j0062
$$ -34402 -17253 8878 23863 9508 4424 -4860 -10277 14679 21761 53848 68081 58019
15785E8019k8504k9031j6863M057K4447k3565L401l023k1685l768O047j5493K3898
$$ 58019 29515 484 -16379 -12322 12125 -11440 -8039 -11062 -32747 -36515 -30468 -45961 -22063
15772b2063N235j5062m429j0504J1171L597l9537m750L2790M2694j6685o32l1809
$$ -22063 -16828 -31890 -36319 -46823 -35652 -32055 -71592 -76342 -43552 -858 -17543 -18175 -49984
15759d9984K4420K1967o473J1190K0367k3017l3781j4538M6201n030l5003Q385
$$ -49984 -25564 -3597 -10070 1120 21487 -1530 -35311 -49849 -3648 -8678 -43681 -35296
15747c5296P592K1734K9240k2142j4208j5420l3276k850J6572l465j1737L366
$$ -35296 -27704 -5970 23270 1128 -13080 -28500 -61776 -64626 -48054 -51519 -63256 -59890
15735e9890R210m1954j9196M7459O1330k419l9772L6995K3217j3425L694j0492
$$ -59890 -50680 -92634 -111830 -64371 -3041 -5460 -45232 -8237 14980 1555 5249 -5243
15723e243j2237J0914K495J8281J553p748J6352J6653l0325q678J8369j3138o848
$$ -5243 -17480 -6566 -4071 14210 15763 8015 24367 41020 10695 2017 20386 7248 400
15710D00j0595J0551J8758L0947J9869J6825L2032J2120j1061n8329m2538l3101
$$ 400 -10195 356 19114 50061 69930 86755 118787 130907 119846 61517 18979 -14122
15698a4122j632J6606M880J4811j1401M707m115k8654k1139J5428K1323L8888
$$ -14122 -15754 852 5732 20543 9142 13849 9734 -18920 -40059 -24631 -3308 35580
15686C5580J5190p681m3396j1389j4664K7176L169k7984k3082m591m477K2097
$$ 35580 50770 43089 -307 -11696 -26360 816 3985 -23999 -47081 -51672 -56149 -34052
15674c4052J2399j0226j4833m325M384M585J2644R278o883o5037k3494j3071J481
$$ -34052 -21653 -31879 -46712 -51037 -46653 -42068 -29424 -20146 -27029 -92066 -115560 -128631 -127150
15661a27150l251N2408K4418M3615K0645j0495j6979o42k827K2330J959k2144
$$ -127150 -130401 -77993 -53575 -9960 10685 190 -16789 -17431 -20258 2072 4031 -18113
15649a8113N3168O777m4025j7174J0671P869M5196K5274j3401j6101O046j524
$$ -18113 35055 41832 -2193 -19367 -8696 -827 44369 69643 56242 40141 46187 44663
15637D4663k5181K222K0208J8358k0557k1331p786J9939k139j1310K7380Q109
$$ 44663 19482 21704 41912 60270 39713 18382 10596 30535 28396 17086 44466 52575
15625E2575l7934q002n0946O317J0751L8162J1211l4790n379P09o300K6185J6352
$$ 52575 14641 6639 -44307 -37990 -27239 10923 22134 -12656 -18035 -17326 -23626 2559 18911
15612A8911P990J2185k7219l0089Q539J2462o819o337q591l567q441j9210q084
$$ 18911 26901 39086 11867 -18222 -9683 2779 -4040 -10377 -18968 -22535 -30976 -50186 -58270
15599e8270j709L3920L543l4173N242Q776K3558L2303K9454L941j8966r358j0055
$$ -58270 -59979 -26059 -22516 -56689 -51447 -42671 -19113 13190 42644 46585 27619 18261 8206
15586H206k7810p866k597Q556r556K1965N086o501k822j1107n812J4504J0198
$$ 8206 -19604 -27470 -30067 -21511 -31067 -9102 -4016 -10517 -13339 -24446 -30258 -15754 -5556
15573e556Q690J4432M498J486N262j0965K6633K255n0339k7929J9137J6678l2427
$$ -5556 3134 17566 22064 23550 28812 17847 44480 46735 -3604 -31533 -12396 4282 -28145
15560b8145j8983J0277J9541L4868K787j5455l4129j2009r09Q132K5040N3544
$$ -28145 -47128 -36851 -17310 17558 20345 4890 -29239 -41248 -42157 -34025 -8985 44559
15548D4559Q973L868k1407m1327K2124N85j1959j3799l2809j3086M1575M7020
$$ 44559 53532 57400 35993 -5334 16790 17375 5416 -8383 -41192 -54278 -12703 34317
15536C4317j5600j7055k0542k435K3525j9008k8177j7432N863j0421J4232k8022
$$ 34317 18717 1662 -18880 -21315 2210 -16798 -44975 -62407 -56544 -66965 -52733 -80755
15524h0755k7437K2719J9451Q813J9942j8669K7L5331J6894K5430J5065K487j4667
$$ -80755 -108192 -85473 -66022 -57209 -37267 -55936 -55909 -20578 -3684 21746 36811 39298 24631
15511B4631j8683l830K166j5028l0170k8750J1915K5193l612K3731P151q270j6224
$$ 24631 5948 2118 4284 -10744 -40914 -69664 -57749 -32556 -36168 -12437 -5286 -13556 -29780
15498b9780K7921p874k7486J5219m523L4973j0134j1099J5535j5691j6065K4585
$$ -29780 -1859 -9733 -37219 -22000 -26523 8450 -1684 -12783 2752 -12939 -29004 -4419
15486d419J3242k775O378K4076l3528R789K2362J4924j1385j1308k7979K018K0228
$$ -4419 8823 6048 12426 36502 2974 12763 35125 50049 38664 27356 -623 1395 21623
15473B1623m3950O594K5560J1885j8018L698K6575J7133P997j4240l4267j2210
$$ 21623 -22327 -15733 9827 21712 3694 7392 33967 51100 59097 44857 10590 -1620
15461a620K3782K1149J5898n8911k7838L0855J1974j0104j1115L431J649q132
$$ -1620 22162 43311 59209 298 -27540 3315 15289 5185 -5930 -2499 -850 -8982
15449h982j658k7749n775M962O179Q844M666m724M195n179j0409J7618l2723k028
$$ -8982 -10640 -38389 -44164 -39202 -33023 -24179 -19513 -24237 -20042 -25221 -35630 -18012 -50735 -52763
15435e2763R826K5077L7260Q561J0530J1829k8495j2408m081l027J948j6935m272
$$ -52763 -42937 -17860 19400 27961 38491 50320 21825 9417 5336 2309 4257 -12678 -16950
15422a6950L5118j2519j9419J3119j9779j9242k5391j0005k3576L0291M5039J0907
$$ -16950 18168 5649 -13770 -651 -20430 -39672 -65063 -75068 -98644 -68353 -23314 -12407
15410a2407J498K003J3238N142k972m971m421j1291m8065k7109O01M5893J9666
$$ -12407 -10909 -8906 4332 9474 6502 1531 -2890 -14181 -62246 -89355 -88754 -42861 -23195
15397b3195j3239L4368j1879k3575o467M9582M801o015k4498K0223J8996K499
$$ -23195 -36434 -2066 -13945 -37520 -43987 5595 10396 4381 -20117 106 19102 21601
15385B1601j5542L3867J2221j2980r179q089m6802p384M946Q520J1547P314l1638
$$ 21601 6059 39926 52147 39167 29988 21899 -24903 -32287 -27341 -18821 -7274 40 -31598
15372c1598P630O9799k921l0507j2855R289j5923j5909J8629l971j7250M347M674
$$ -31598 -23968 45831 42910 12403 -452 8837 -7086 -22995 -4366 -8337 -25587 -21240 -16566
15359a6566k6795L3163L0416r790k745j0937Q866N578L7692P877m770m327j356
$$ -16566 -43361 -10198 20218 10428 7683 -3254 5612 11190 48882 56759 51989 47662 46306
15346D6306j6321n163k666J4916J5003r929J4716k409K406L18J1732j2800M579
$$ 46306 29985 24822 22156 37072 52075 42146 56862 54453 56859 57177 68909 56109 60688
15333F0688K0005l6680n6076r610J1372K1758l96q563m057O048J7182P499l68
$$ 60688 80693 44013 -12063 -21673 -10301 11457 11061 2498 -1559 4489 21671 29170 28802
15320B8802n647J1819N071j3309j7932J770M38k5850K348M3363j554o9974k8526
$$ 28802 23155 34974 40045 26736 8804 10574 11012 -14838 -12490 30873 29319 -40655 -69181
15307f9181O30K0895L6037n333q578m049M097J5711J8311J0805J7990q103K8126
$$ -69181 -68551 -47656 -11619 -16952 -25530 -29579 -25482 -9771 8540 19345 37335 29232 57358
15294E7358p823m7783k2777P257k2658l889M7308K5004l7605K3958K7346j1094
$$ 57358 49535 1752 -21025 -13768 -36426 -40315 6993 31997 -5608 18350 45696 34602
15282C4602l6046J7477J2988k1646J1590k8742k0686K8679J733k0800L767L4230
$$ 34602 -1444 16033 29021 7375 18965 -9777 -30463 -1784 -51 -20851 -17084 17146
15270A7146K590j109K7638j5193k4984J4395k89j2154q719r751l5312j6086L5557
$$ 17146 19736 18627 46265 31072 6088 20483 20194 8040 -679 -10430 -45742 -61828 -26271
15257b6271J0700J4090q965N8558J1849M236n264k2271P2p801K7319K9925j7024
$$ -26271 -15571 -1481 -10446 48112 59961 64197 58933 36662 36734 28933 56252 86177 69153
15244F9153j6220k9557j9888m5360r317L7080j100R943p725r604j0307j0644l0364
$$ 69153 52933 23376 3488 -41872 -51189 -14109 -15209 -5266 -12991 -22595 -32902 -43546 -73910
15231g3910J4691K3987J160O444O4218N9844m1500l9618o473q327L0791o902k1552
$$ -73910 -59219 -35232 -34072 -27628 36590 96434 54934 15316 8843 516 31307 24405 2853
15218B853m648o770p583J2596k1542k2234N000j830J7348n262J4684O866J9126
$$ 2853 -1795 -8565 -16148 -3552 -25094 -47328 -42328 -44158 -26810 -32072 -17388 -10522 8604
15205H604q425J4997Q088j0869k3025r246k778k3635J4177M4574L0774p305m4828
$$ 8604 179 15176 23264 12395 -10630 -19876 -22654 -46289 -32112 12462 43236 35931 -8897
15192h897p179k2396R465K9309K9264J8162j5754m3116J2386p017J0812N451n136
$$ -8897 -16076 -38472 -29007 302 29566 47728 31974 -11142 1244 -5773 5039 10490 5354
15179E354k390k5993Q323N2955p42m3921l7169K4292K0385j9256J1730R490J0418
$$ 5354 2964 -23029 -14706 38249 37507 -6414 -43583 -19291 1094 -18162 -6432 3058 13476
15166A3476j9492j578J7187Q533j6490O121J0794k5484J7793J699J3215M1720
$$ 13476 -6016 -7594 9593 18126 1636 7757 18551 -6933 10860 12559 25774 67494
15154F7494L724j9854j6235j0135j1595r536P188O106N191j3707l9199j3649r63
$$ 67494 71218 51364 35129 24994 13399 3863 11051 17157 22348 8641 -30558 -44207 -45170
15141d5170n3O514K3000K5977j1074J261p195q994k770K3748r750m145J6929j471
$$ -45170 -45223 -38709 -15709 10268 -806 455 -6740 -15734 -18504 5244 -4506 -8651 8278 6807
15127F807k8765r537N0060k0168l1961J267K0692j420l071K3393K2745k783k4422
$$ 6807 -21958 -31495 18565 -1603 -33564 -32297 -11605 -13025 -16096 7297 30042 27259 2837
15114B837r641n067j1553n33J0784L5867Q386j4120k3654K1128Q443q993j6922
$$ 2837 -6804 -11871 -23424 -23957 -13173 22694 31080 16960 -6694 14434 22877 13884 -3038
15101c038l1285k9784L435L5158J5033j8015J4659K2027L990j8466j1509k4071
$$ -3038 -34323 -64107 -60672 -25514 -10481 -28496 -13837 8190 12180 -6286 -17795 -41866
15089d1866o712j1007Q83P167J4253J0769O058J8671J5712j3340l8210K9525J7026
$$ -41866 -48578 -59585 -58702 -51535 -37282 -26513 -20455 -1784 13928 588 -37622 -8097 8929
15076H929Q463q057K5435R975J7295R490j579j4487k6738j3205O6418k0049o3891
$$ 8929 17392 9335 34770 44745 62040 71530 69951 55464 28726 15521 81939 61890 -2001
15063b001j1393m205Q752J055j276j3881K0411K270o57R967R318l5245r738K2800
$$ -2001 -13394 -17599 -8847 -7792 -9068 -22949 -2538 -268 -925 9042 18360 -16885 -26623 -3823
15049c823L7168n068m4925j4609O555M0494L6067o76p29j3431j2478k5066p012
$$ -3823 33345 28277 -16648 -31257 -24702 15792 51859 51183 50454 37023 24545 -521 -7533
15036g533O277k1523J1882J2539L0488k1844o725q708k87k807j1969j4122J4638
$$ -7533 -1256 -22779 -10897 1642 32130 10286 3561 -5147 -5434 -8241 -20210 -34332 -19694
15023a9694J8074p078l6236m438Q348J2329M7673K0064M641k6318J441k7147n4676
$$ -19694 -1620 -8698 -44934 -49372 -41024 -28695 18978 39042 43683 17365 18806 -8341 -63017
15010f3017J2308J1087L3891J1886J3029K6798j5303k5945k5730k8581L9844M8650
$$ -63017 -50709 -39622 -5731 6155 19184 45982 30679 4734 -20996 -49577 -9733 38917
14998C8917K9509m963q389k6124j2674J2975J2085k8401j1241j2755M2322r035
$$ 38917 68426 63463 55074 28950 16276 29251 41336 12935 1694 -11061 31261 22226
14986B2226K376J3332l5733j7905o202L3278J7074q947j866j5303K110J0540o785
$$ 22226 24602 37934 2201 -15704 -21906 11372 28446 19499 17633 2330 4440 14980 8195
14973H195j6297J6934L5156J6086P09k8422m9790K4768L8283l2038k1900j1453
$$ 8195 -8102 8832 43988 60074 60783 32361 -17429 7339 45622 13584 -8316 -19769
14961a9769k2903j597J7401K002j7748K8848J9799J19J6754N351p231k1659J0840
$$ -19769 -42672 -44269 -26868 -24866 -42614 -13766 6033 6152 22906 28257 21026 -633 10207
14948A0207j8108l1980r462K471K788L8971M5890k8215l7741p313J9194j2725
$$ 10207 -7901 -39881 -49343 -46872 -44084 -5113 40777 12562 -25179 -32492 -13298 -26023
14936b6023J5487J6164K6079N860j9957m02k8224N756K0346L5257j4765n448J865
$$ -26023 -10536 5628 31707 37567 17610 17208 -11016 -5260 15086 50343 35578 30130 31995
14923C1995j4579K0791Q679J1901l163m0660k1910L3963J5880j2945l5039k6764
$$ 31995 17416 38207 46886 58787 55624 14964 -6946 27017 42897 29952 -5087 -31851
14911c1851J2365n398j4830K6021L1813J2043J1410L131M095m1949m7704m898
$$ -31851 -19486 -24884 -39714 -13693 18120 30163 41573 44704 48799 6850 -40854 -45752
14899d5752J7553p561j5699k317m857J4639j929j927L6138J8971m9L0495m983
$$ -45752 -28199 -35760 -51459 -53776 -58633 -43994 -45923 -47850 -11712 7259 7210 37705 32722
14886C2722l7295n965J8812r108J8189m487l9279j8462m973J8879J337P365K6286
$$ 32722 -4573 -10538 8274 -834 17355 12868 -26411 -44873 -49846 -30967 -29630 -22265 4021
14873D021Q495R920J4807n393m527o501k8073L533M2670j7807K006j776J1373
$$ 4021 12516 22436 37243 31850 27323 20822 -7251 -3718 38952 21145 23151 21375 32748
14860C2748j0743J2254j5109l9219n687k238j3836R099j0660J237J2125K2872
$$ 32748 22005 34259 19150 -20069 -25756 -27994 -41830 -32731 -43391 -42154 -30029 -7157
14848g157K7399q434l2956j802L740J295q893l1777j1902L273J9592k0646r345
$$ -7157 20242 11808 -21148 -22950 -19210 -17915 -26808 -58585 -70487 -67214 -47622 -68268 -77613
14835g7613K5961L5396K0735P593J9961N298k1621j8481K7306n403n468q954k7033
$$ -77613 -51652 -16256 4479 12072 32033 37331 15710 -2771 24535 19132 13664 4710 -22323
14822b2323l819J4495P691J199K7394K7377j2976j7668j0287k7559j4691l4440
$$ -22323 -26142 -11647 -3956 -2757 24637 52014 39038 21370 11083 -16476 -31167 -65607
14810f5607J1809L4323K9857q49m4296o57N4213j9282j3445l1979j0721K9494
$$ -65607 -53798 -19475 10382 9533 -34763 -35420 18793 -489 -13934 -45913 -56634 -27140
14798b7140r656j2337K6811q289n895k3123J6723J7377J3198M724K9814L5165
$$ -27140 -36796 -49133 -22322 -30611 -36506 -59629 -42906 -25529 -12331 -7607 22207 57372
14786E7372k4142k8587k728J452r999n31j3532k1038P805J1535j260P420K9190
$$ 57372 33230 4643 1915 3367 -6632 -7163 -20695 -41733 -33928 -22393 -23653 -16233 12957
14773A2957K2328l1461k384l584r73q309k155N782k193m835J951j0629j2330j1131
$$ 12957 35285 3824 1440 -2144 -3117 -11426 -13581 -7799 -9992 -14827 -12876 -23505 -35835 -46966
14759d6966J8682j202O432k1667l1080P564L6311J924O053K5320L037K0122k0603
$$ -46966 -28284 -29486 -23054 -44721 -75801 -68237 -31926 -30002 -23949 1371 4408 24530 3927
14746C927l1984J9940M1456k1042j9624o345J8515K7384j09k3285j2203J1505
$$ 3927 -28057 -8117 33339 12297 -7327 -13672 4843 32227 32118 8833 -3370 8135
14734H135J5309k131r745N099L3867o550o0404k113k9099K0159N5922j2341j8811
$$ 8135 23444 21313 11568 16667 50534 43984 -16420 -18533 -47632 -27473 28449 16108 -2703
14721b703K8759K3262L840Ll5556j1208r977o991L824M1791L4285j2266k5519
$$ -2703 26056 49318 53158 53161 17605 6397 -3580 -10571 -6747 35044 69329 57063 31544
14708C1544J4978q047j8965l5831j3499j049j2680K8593P305k894J2884P78J8723
$$ 31544 46522 38475 19510 -16321 -29820 -30869 -43549 -14956 -7651 -10545 2339 3117 21840
14695B1840J9718j6108p0637M46J827L794o894k4636J6948K0039j473K1465J8622
$$ 21840 41558 25450 -45187 -44741 -42914 -39120 -46014 -70650 -53702 -33663 -35136 -13671 4951
14682D951l4073k4445J6557J5952J5653k8549j5240p348l2635K476J7540N4895
$$ 4951 -29122 -53567 -37010 -21058 -5405 -33954 -49194 -56542 -89177 -86701 -69161 -14266
14670a4266N0842n966j6949p273o080r397j3542L068j4857J5904P272J316j5598
$$ -14266 36576 30610 13661 6388 308 -9089 -22631 -19563 -34420 -18516 -11244 -9928 -25526
14657b5526J578N290K1958r378o886k0487j1715J2724k472L674J6104K6686k80
$$ -25526 -23948 -18658 3300 -6078 -12964 -33451 -45166 -32442 -34914 -31240 -15136 11550 11270
14644A1270M193K5075K1460j4179k0304k6747J415K6441R905K3716j7471j7468
$$ 11270 15463 40538 61998 47819 27515 768 2183 28624 38529 62245 44774 27306
14632B7306m3628l3007k4685P350K4202J5051L4704q068k0602j1102j8477J453
$$ 27306 -16322 -49329 -74014 -66664 -42462 -27411 7293 -775 -21377 -32479 -50956 -49503
14620d9503J3125J9900n095L2411m076J250J0214J2653o49M951J0309l5635n0943
$$ -49503 -36378 -16478 -21573 10838 6762 8012 18226 30879 30230 35181 45490 9855 -41088
14607d1088m116K6699n331L5102J1863m761Q15l9173j0780M830j749l163L2144
$$ -41088 -45204 -18505 -23836 11266 23129 18368 19183 -19990 -30770 -25940 -27689 -30852 1292
14594A292L3469r744m0983j6221n638L4309N8431l2258m2038k8438L4632M055
$$ 1292 34761 25017 -15966 -32187 -37825 -3516 54915 22657 -19381 -47819 -13187 -9132
14582i132L162O177K3098R844k3589j1519p776j7879J1634L3833L0449K654r50
$$ -9132 -5970 207 23305 33149 9560 -1959 -9735 -27614 -15980 17853 48302 50956 50006
14569E0006l902j3126J3276m866q76l2012j8813J5471L16j1162m214J1058Q696
$$ 50006 46104 32978 46254 41388 40512 8500 -10313 5158 5474 -5688 -9902 1156 9852
14556I852m062l5097L855L6002J5340j9878n6175j0646J7985J7687K539M9517
$$ 9852 5790 -29307 -25452 10550 25890 6012 -50163 -60809 -42824 -25137 -22598 26919
14544B6919j3328l347k4128j0420j3267J0969J3798L0097L7719j7328l9900k1857
$$ 26919 13591 10244 -13884 -24304 -37571 -26602 -12804 17293 55012 37684 -2216 -24073
14532b4073K8690o412N99j8861K9588L6528j9798l252l936K2578K3992j217l5071
$$ -24073 4617 -1795 -1196 -20057 9531 46059 26261 23009 19073 41651 65643 64426 29355
14519B9355l2697J842k653m808K2573J7453k1762k3851J4755r634L7552L0718
$$ 29355 -3342 -1500 -4153 -8961 13612 31065 9303 -14548 207 -9427 28125 58843
14507E8843j3558l6583Q667R990J362J8486p507k7511l2514j5217Q309J8702N599
$$ 58843 45285 8702 17369 27359 28721 47207 39700 12189 -20325 -35542 -27233 -8531 -2932
14494b932J1553K4984j7702n7936k0378L612J0246L5143J5379k5458Q382K8782
$$ -2932 8621 33605 15903 -42033 -62411 -58799 -48553 -13410 1969 -23489 -15107 13675
14482A3675j7900l7393L5635K7084k3879J9822l8236l4963K1984J2439k9959K8118
$$ 13675 -4225 -41618 -5983 21101 -2778 17044 -21192 -56155 -34171 -21732 -51691 -23573
14470b3573K6415J8941l794L4557O268r846l3669J0535m268j1816n715K457j2317
$$ -23573 2842 21783 17989 52546 58814 48968 15299 25834 21566 9750 4035 6492 -5825
14457e825k6242q983J502J0954J2504J2024J5572l30k856j312j4821j5880k7184
$$ -5825 -32067 -41050 -39548 -28594 -16090 -4066 11506 11176 8320 7008 -7813 -23693 -50877
14444e0877J9933M3535J7460k7448J0795Q339L6819l624k9519j8519p246k3168
$$ -50877 -30944 12591 30051 2603 13398 21737 58556 54932 25413 6894 -352 -23520
14432b3520k4019J0350J6702l6551J1436K7557K3839L8557j5378j9026J914k0442
$$ -23520 -47539 -37189 -20487 -57038 -45602 -18045 5794 44351 28973 9947 11861 -8581
14420h581j241P730L8073J0941k0634o444m2023j9577J9588K4279m361j0938J0247
$$ -8581 -9822 -2092 35981 46922 26288 19844 -22179 -41756 -22168 2111 -2250 -13188 -2941
14407b941j7619r668J7677o587Q3K5679R629J3652r106n737O697R770k2343J7197
$$ -2941 -20560 -30228 -12551 -19138 -19055 6624 16253 29905 20799 15062 21759 31529 9186 26383
14393B6383o681m7037j2563K0609j8105l8586J7304J1348L6526J0401l09J1930
$$ 26383 19702 -27335 -39898 -19289 -37394 -75980 -58676 -47328 -10802 -401 -710 11220
14381A1220k6284K204L5638J0822k46m9860l0388J754L208Q335j3538L3262K712
$$ 11220 -15064 -12860 22778 33600 33354 -16506 -46894 -45140 -41932 -33597 -47135 -13873 -11161
14368a1161j9857k0457J4005K5434n20K657P802K3318k216M035l35k7097o693
$$ -11161 -31018 -51475 -37470 -12036 -12556 -9899 -2097 21221 19005 23040 22705 -4392 -11085
14355a1085J9176P53j2131j7342k3089K2690K7543L372k1208p342j7001M533J0562
$$ -11085 8091 8844 -3287 -20629 -43718 -21028 6515 9887 -11321 -18663 -35664 -31131 -20569
14342b0569J7267L5014J3807k0455m198P192l5239j316K5246l8451k5629J6679
$$ -20569 -3302 31712 45519 25064 20866 28058 -7181 -8497 16749 -21702 -47331 -30652
14330c0652n088J7534J6214K1591J9169K054J1133l2379k3963r33L833R693j1188
$$ -30652 -35740 -18206 -1992 19599 38768 40822 51955 19576 -4387 -5320 -1487 8206 -2982
14317b982k6546l297L242K1848K7325j7692k4253j4854l8250j7019M826J2392
$$ -2982 -29528 -32825 -29583 -7735 19590 1898 -22355 -37209 -75459 -92478 -87652 -75260
14305g5260R181L9659M4478J6533j6866j5969j7393L8995j7439N371L0341k2690
$$ -75260 -66079 -26420 18058 34591 17725 1756 -15637 23358 5919 11290 41631 18941
14293A8941q571j7541J5196J4097P754O02j2994k7080p31P79L5675J4495R347
$$ 18941 10370 -7171 8025 22122 29876 30478 17484 -9596 -10327 -9548 26127 40622 49969
14280D9969k9591m6857j1973J8861K7170O765Q478L8406P0042j8981q0357j7475
$$ 49969 20378 -26479 -38452 -19591 7579 14344 22822 61228 131270 112289 31932 14457
14268A4457M2209L2017j4568k0981j9175K1307j4958k6391j6573l322L659J3085
$$ 14457 56666 88683 74115 53134 33959 55266 40308 13917 -2656 -5978 -2319 10766
14256A0766k5799m9933j6953N666K6132J8779K8291K3549K1695R841l9050N642
$$ 10766 -15033 -64966 -81919 -76253 -50121 -31342 -3051 20498 42193 52034 12984 18626
14244A8626K4348l584k0966J6694j7317K851J9401k6825k9802o392L0160K3260
$$ 18626 42974 39390 18424 35118 17801 20652 40053 13228 -16574 -22966 7194 30454
14232C0454j1100m2543k9098q879J6609J062l311J4806K4072L7567J7076R919
$$ 30454 19354 -23189 -52287 -61166 -44557 -43495 -46806 -32000 -7928 29639 46715 56634
14220E6634k8592l8168l6156L1560N1268L388k3330k3248N384K2801K8194p260
$$ 56634 28042 -10126 -46282 -14722 36546 39934 16604 -6644 -1260 21541 49735 42475
14208D2475n2565K4269L8790M1321k4456r013k0171m8745o937j9854j3074K0117
$$ 42475 -10090 14179 52969 94290 69834 60821 40650 -8095 -15032 -34886 -47960 -27843
14196b7843J6167K6390K1469M508M40k2235n0322l0570M968J6052J1733K1345
$$ -27843 -11676 14714 36183 40691 41131 18896 -31426 -61996 -57028 -40976 -29243 -7898
14184g898m156J4109M3201J4634k5482k2884m5583k9383L3505K4805R093J8533
$$ -7898 -12054 2055 45256 59890 34408 11524 -34059 -63442 -29937 -5132 3961 22494
14172B2494j2209L5060J5520j4736p907j9010J6090m9492j2650K0936J757K7447
$$ 22494 10285 45345 60865 46129 38222 19212 35302 -14190 -26840 -5904 -4147 23300
14160B3300k6223l2091J5682j4272k9768L6388K8653k1228O372K8743J3495j3196
$$ 23300 -2923 -35014 -19332 -33604 -63372 -26984 1669 -19559 -13187 15556 29051 15855
14148A5855k3143m158J4128L0413k5623l2695j4016L2346J8965j5547J7115j8174
$$ 15855 -7288 -11446 2682 33095 7472 -25223 -39239 -6893 12072 -3475 13640 -4534
14136d534j1226n620K178k4702J8500P233M9072N086k9951J902k2043j0537J3294
$$ -4534 -15760 -21380 -19202 -43904 -25404 -18171 30901 35987 6036 7938 -14105 -24642 -11348
14123a1348L5473m670l3891j9703J6503l8960P541J0898N484K6915Q95R405j3296
$$ -11348 24125 19455 -14436 -34139 -17636 -56596 -49055 -38157 -32673 -5758 -4863 4542 -8754
14110h754j5156L145j4003R48L2315k0072k0002J7704K3751M0410j6853l5678
$$ -8754 -23910 -20765 -34768 -33820 -1505 -21577 -41579 -23875 -124 40286 23433 -12245
14098a2245K6481K4097j3296j5578L0079O000k6840J1040J1126j8806k2846J7664
$$ -12245 14236 38333 25037 9459 39538 45538 18698 29738 40864 22058 -788 16876
14086A6876J1585N0408Q507L288j2961o421j995N037j1046J6402N0070l0317m5593
$$ 16876 28461 78869 87376 90664 77703 71282 69287 74324 63278 79680 129750 99433 53840
14073E3840j2621j1980j2053n503j2692R941o330j8060N30J9826L2984K128j7320
$$ 53840 41219 29239 17186 11683 -1009 8932 2602 -15458 -14928 4898 37882 40010 22690
14060B2690j8768j0406l279J4845j316l7359p605K7084k2746k5463R118p317L1387
$$ 22690 3922 -6484 -9763 5082 3766 -33593 -41198 -14114 -36860 -62323 -53205 -60522 -29135
14047b9135L9061K2653M649P265N560k6765k3882K2229m7837j9884K1581J788
$$ -29135 9926 32579 37228 44493 50053 23288 -594 21635 -26202 -46086 -24505 -22717
14035b2717L973J0269J2773j5117K6088O334k7938n839R562k904N334J3776Q051
$$ -22717 -18744 -8475 4298 -10819 15269 21603 -6335 -12174 -2612 -5516 -182 13594 21645
14022B1645j6378l042k6400J4503J1092j9193J6307j886k4031K723J2298N981
$$ 21645 5267 2225 -24175 -9672 1420 -17773 -1466 -3352 -27383 -24660 -12362 -6381
14010f381L7116P699p2586o1388r897P8486L7058J5300L0637N862K3991j1385
$$ -6381 30735 38434 -34152 -95540 -105437 -26951 10107 25407 56044 61906 85897 74512
13998G4512k6269k5240j6223k1846J0961O119k4266M018K9237j520K5045N61k2732
$$ 74512 48243 23003 6780 -15066 -4105 2014 -22252 -18234 11003 9483 34528 35089 12357
13985A2357j1775l367J7252l733m711J9149J1896R661K133j8664j5990j5186J2189
$$ 12357 582 -2785 14467 10734 6023 25172 37068 46729 48862 30198 14208 -978 11211
13972A1211K568j2768J4324L9918J1091l9748m5108j5457j9355J398K6455K659
$$ 11211 13779 1011 15335 55253 66344 26596 -18512 -33969 -53324 -51926 -25471 -22812
13960b2812L0174N0808j2467l6273p983j4269K340J8055K1766l3217k8724j0705
$$ -22812 7362 58170 45703 9430 1447 -12822 -10482 7573 29339 -3878 -32602 -43307
13948d3307K5277J7152l51L1783K5188k8957k1479J6426O487k3755k6037r419
$$ -43307 -18030 -878 -1229 30554 55742 26785 5306 21732 28219 4464 -21573 -30992
13936c0992J4828N699N488K7877j0462l4597m6781P464J1697R843R562L5160M4097
$$ -30992 -16164 -10465 -4977 22900 12438 -22159 -68940 -61476 -49779 -39936 -30374 4786 48883
13923D8883M035o1060j301J1163k4312J3413J3384K882L0998L3976j4998l3290
$$ 48883 52918 -8142 -9443 1720 -22592 -9179 4205 7087 38085 72061 57063 23773
13911B3773j0432q566k5299R205L5509l3442K512j713k7165N638K6147Q115J6761
$$ 23773 13341 4775 -20524 -11319 24190 -9252 -6740 -8453 -35618 -29980 -3833 4282 21043
13898B1043Q015k4289J9608R536o872M739J888j5531L376J1574j4986l4255O341
$$ 21043 29058 4769 24377 33913 27041 31780 33668 18137 21513 33087 18101 -16154 -9813
13885i813K7091Q458n453o390r936J5317P158L5402N8536k3845l8817m4016k8486
$$ -9813 17278 25736 20283 13893 3957 19274 26432 61834 120370 96525 57708 13692 -14794
13872a4794k4701K2755N1470K4281j9210k4533j3911q892N541O841q085P728N976
$$ -14794 -39495 -16740 34730 59011 39801 15268 1357 -7535 -1994 4847 -3238 4490 10466
13859A0466K9505K1274r583j8024o938k8320J2252N558N609L377J0544m695O689
$$ 10466 39971 61245 51662 33638 26700 -1620 10632 16190 21799 25176 35720 31025 37714
13846C7714L2178K632k4949l3415k6918k1140k928K464K0287J885K5260k1492
$$ 37714 69892 72524 47575 14160 -12758 -33898 -36826 -34362 -14075 -12190 13070 -8422
13834h422k7744j6077K5202L5161n930j2516L5239N3082p575k2339k2734j9230
$$ -8422 -36166 -52243 -27041 8120 2190 -10326 24913 77995 70420 48081 25347 6117
13822F117p760j4348Q009K4038r550k9353j0676K132J673j2207J1165L0005M2297
$$ 6117 -1643 -15991 -7982 16056 6506 -22847 -33523 -31391 -29718 -41925 -30760 -755 41542
13809D1542l029q645J9439Q791m3315m3802O364K9791k960K236j4130J2680k0933
$$ 41542 38513 29868 49307 58098 14783 -29019 -22655 7136 4176 6412 -7718 4962 -15971
13796a5971J8503N666L2307j5917J821l22J7832l2777r686J0332j960J3130J2541
$$ -15971 2532 8198 40505 24588 26409 26087 43919 11142 1456 11788 9828 22958 35499
13783C5499j5608j8142j1762m2496l489J7504R736l0270j5066P405L2069K8528
$$ 35499 19891 1749 -10013 -52509 -55998 -38494 -28758 -59028 -74094 -66689 -34620 -6092
13771f092k5552K1302J5540k7888m0024J0332K1125O694J9087J2471N190N1089
$$ -6092 -31644 -10342 5198 -22690 -62714 -52382 -31257 -24563 -5476 6995 12185 63274
13759F3274j4047j9883P045k3198j9398N008J0044j2470k3809J5876k986o102
$$ 63274 49227 29344 36389 13191 -6207 -1199 8845 -3625 -27434 -11558 -14544 -20646
13747b0646R904r460O532L634J6567R492K6107P4131k7569n5289J5960K8036o492
$$ -20646 -10742 -20202 -13670 -10036 6531 16023 42130 116261 88692 33403 49363 77399 70907
13734G0907j1666J053l2600l1503Q808j9986M996M4499K064o418k3043q430q591
$$ 70907 59241 60294 27694 -3809 4999 -14987 -9991 34508 36572 30154 7111 -1319 -9910
13721i910J8880k5603n295J6444l9016J4069L2157N2204L2959k3442J2004j9838
$$ -9910 8970 -16633 -21928 -5484 -44500 -30431 1726 53930 86889 63447 75451 55613
13709E5613J4698l0733n1254k9533K119L0064L8917Q649j0571L573k9134m4795
$$ 55613 70311 39578 -11676 -41209 -39090 -9026 29891 38540 27969 31542 2408 -42387
13697d2387L3033J1684k3635k3147j2148J5619K2210M2221r608r367o58K4381
$$ -42387 -9354 2330 -21305 -44452 -56600 -40981 -18771 23450 13842 4475 3817 28198
13685B8198L2069J0121l1603l9455j2517K0857L8901J5462K093q684l3634k0717
$$ 28198 60267 70388 38785 -670 -13187 7670 46571 62033 64126 55442 21808 1091
13673A091K8147j120k5457j6356J0947O107j5381J1487K1162K8905k1647r268
$$ 1091 29238 28118 2661 -13695 -2748 3359 -12022 -535 20627 49532 27885 18617
13661A8617n472k2912k2044J5976J9560p286J8024j6733p745k805J0079L0404
$$ 18617 13145 -9767 -31811 -15835 3725 -3561 14463 -2270 -10015 -12820 -2741 27663
13649B7663J1871r687r274J2631m742l6522K0327K9646j6715l1580J241J8438
$$ 27663 39534 29847 20573 33204 28462 -8060 12267 41913 25198 -6382 -5141 13297
13637A3297l354J2773l8547j565J1896K5052k4212j4462q312l3818P89J840M1563
$$ 13297 9943 22716 -15831 -17396 -5500 19552 -4660 -19122 -27434 -61252 -60463 -58623 -17060
13624a7060M8070o597j3572J8339j3962j1319o340l582j3512M0734L0455k0943
$$ -17060 31010 24413 10841 29180 15218 3899 -2441 -6023 -19535 21199 51654 30711
13612C0711r148k647j0774N686K276k8999j865Q214M385R448k7383j8056Q287
$$ 30711 21563 18916 8142 13828 16104 -12895 -14760 -6546 -2161 7287 -20096 -38152 -29865
13599b9865L580K0932K4112M773L346R108j8610o1995k0453L8516J91m350K0324
$$ -29865 -26285 -5353 18759 23532 26878 35986 17376 -44619 -65072 -26556 -26365 -30715 -10391
13586a0391J1842K7750P273j1326J5264m3236n274J1516J8864N451J2622r657
$$ -10391 1451 29201 36474 25148 40412 -2824 -8098 3418 22282 27733 40355 30698
13574C0698k1592j8615j7909m853J3978K6892J6534j0543m5488k6426q018J2906
$$ 30698 9106 -9509 -27418 -32271 -18293 8599 25133 14590 -30898 -57324 -65342 -52436
13562e2436N8786K0579j8538l677l633k9185j8596L365M1310n242L1943j8093
$$ -52436 6350 26929 8391 4714 1081 -28104 -46700 -43335 -2025 -7267 24676 6583
13550F583p055K2086j9224J094L1899k4350o155k0262l34L6367k8484q488o197
$$ 6583 -472 21614 2390 3484 35383 11033 4878 -15384 -15718 20649 -7835 -16323 -22520
13537b2520Q329Q612J0585p099Q649J8860p709M104l1495M790M7136J0388J0273
$$ -22520 -14191 -5579 5006 -2093 6556 25416 17707 21811 -9684 -4894 42242 52630 62903
13524F2903j5010k4260k3240k7100j255n255J2951k0819K7581O471r438J5987
$$ 62903 47893 23633 393 -26707 -27962 -33217 -20266 -41085 -13504 -7033 -16471 -484
13512d84J3187J5398J9358j9646l3225J9K0106L6903J1874r207k1258j6088K1758
$$ -484 12703 28101 47459 27813 -5412 -5393 14713 51616 63490 54283 33025 16937 38695
13499C8695J3499J5465l2351m1693q225K172l882j1543j1288K385L0985K0137
$$ 38695 52194 67659 35308 -6385 -14610 -12438 -16320 -27863 -39151 -36766 -5781 14356
13487A4356L160J4669O060o8771l5271J2746J2074K8972P895Q136j5235L468J7009
$$ 14356 17516 32185 38245 -30526 -65797 -53051 -40977 -12005 -4110 4026 -11209 -7741 9268
13474I268L0889P294k213J8111o874J7583k4712k6241r518J3278J7301j3215O295
$$ 9268 40157 47451 45238 63349 56475 74058 49346 23105 13587 26865 44166 30951 37246
13461C7246J7394P157k705j0839O764J5247N851l6123j0853K9247N320l0242J0048
$$ 37246 54640 61797 59092 48253 55017 70264 76115 39992 29139 58386 63706 33464 43512
13448D3512m446k002M99j1291Q878l1733j5678J1258M085K8326N081j3040N266
$$ 43512 39066 37064 37563 26272 35150 3417 -12261 -1003 3082 31408 36489 23449 28715
13435B8715J3759K5634O0402k8158k2197l0135R359K575j0358j2183J2815k215
$$ 28715 42474 68108 128510 100352 78155 48020 57379 59954 49596 37413 50228 48013
13423D8013J0836J4905o991K3880j4754m4339P003n010n008J6831J5717m2014
$$ 48013 58849 73754 66763 90643 75889 31550 38553 33543 28535 45366 61083 19069
13411A9069m6361l011M251K7503M7684L6026j0013l7178J153O760m038l879m629
$$ 19069 -27292 -30303 -26052 1451 49135 85161 75148 37970 39123 45883 41845 37966 33337
13398C3337n2230l4012K1703O0262J5626k5497K692Q92n669J8590p83o862J6883
$$ 33337 -18893 -52905 -31202 29060 44686 19189 21881 22773 17104 35694 34911 28049 44932
13385D4932k847K9320j0964m1048m665J2820m7653j0408J7843K9585J4254L8353
$$ 44932 42085 71405 60441 19393 14728 27548 -20105 -30513 -12670 16915 31169 69522
13373F9522j4180l0817j0707L590J4980K0543P098j7673K2152k0032L7940l7460
$$ 69522 55342 24525 13818 17408 32388 52931 60029 42356 64508 44476 82416 44956
13361D4956K2383k0417l2789J1695J9467l3026J1009K2622K9763j0479k2566l7428
$$ 44956 67339 46922 14133 25828 45295 12269 23278 45900 75663 65184 42618 5190
13349E190k3633J7330M6397j862J3317L898j0482n5272j7521L3686J5410n414
$$ 5190 -18443 -1113 45284 43422 56739 60637 50155 -5117 -22638 11048 26458 21044
13337B1044j8984J857J433J6330L4124l6637R512L1523J9777P516L42J5050m2850
$$ 21044 2060 3917 5350 21680 55804 19167 28679 60202 79979 87495 87837 102887 60037
13324F0037o0499Q77K2412M383K3056J351P872J8209m5554k4348K8166L8282p423
$$ 60037 -462 415 22827 27210 50266 51617 59489 77698 32144 7796 35962 74244 66821
13311F6821j2280j8895l6928K5172K0915k2519j0752O296l3489q625K9582j4615
$$ 66821 54541 35646 -1282 23890 44805 22286 11534 17830 -15659 -24284 5298 -9317
13299i317l3553R020N3845M5172M770r602j6113j8725k1760m767O566K1373L3912
$$ -9317 -42870 -33850 19995 65167 69937 60335 44222 25497 3737 -1030 5536 26909 60821
13286F0821J6245l4945r222k082K5078J645M8755L0915l5087m8366r471K231p055
$$ 60821 77066 42121 32899 30817 55895 57540 106295 137210 102123 53757 44286 46517 39462
13273C9462l3955j0425p882N2619K8502J6309K5207m0298j2853L9603J5004L930
$$ 39462 5507 -4918 -12800 39819 68321 84630 109837 69539 56686 96289 111293 115223
13261A15223j4245O632J1612k9440j0862K908o034q393j5971j1798k489K5530
$$ 115223 100978 107610 119222 89782 78920 81828 75794 67401 51430 39632 37143 62673
13249F2673J3089J4420m1019k7459n34K4564K1646K1843m776K5434j2207l3612
$$ 62673 75762 90182 49163 21704 21170 45734 67380 89223 84447 109881 97674 64062
13237F4062n6875K9425J0133j1743k1787J2836J4938J9572P301k054K0977R825
$$ 64062 7187 36612 46745 35002 13215 26051 40989 60561 67862 65808 86785 96610
13225I6610J6546k2571j7371n265K1308j5944m586M944j2873J7953k0286p523
$$ 96610 113156 90585 73214 67949 89257 73313 68727 73671 60798 78751 58465 50942
13213E0942K3530m7224k5195L2540N1044K125J645j0489K4899N251o6423n6665
$$ 50942 74472 27248 2053 34593 85637 87762 89407 78918 103817 109068 42645 -14020
13201a4020K0546N9000J2226J2414j5463j0070J0645l2029m071K8289l8401R273
$$ -14020 6526 65526 77752 90166 74703 64633 75278 43249 39178 67467 29066 38339
13189C8339L9k1790l2877K6775N0115j6986l2031K4215r38k2017j4033J5479j2107
$$ 38339 38378 16588 -16289 10486 60601 43615 11584 35799 34861 12844 -1189 14290 2183
13176B183r823K0J3262M6151J6616j5209j5072k1625p39r02j1153J9854K7419
$$ 2183 -7640 -7620 5642 51793 68409 53200 38128 16503 15764 14862 3709 23563 50982
13163E0982K4621m957p006j937N242j7807r3554K8311M7634r168J0046j146J2610
$$ 50982 75603 70646 63640 61703 66945 49138 -44416 -16105 31529 22361 32407 31261 43871
13150D3871O307k9925j3703k290M631K4779M9641K2342K1812J4434J4421j5593
$$ 43871 50178 20253 6550 4260 8891 33670 83311 105653 127465 141899 156320 140727
13138A40727m0751j7673q923K3673L2108P117j013o554J6654K4388M5981M2138
$$ 140727 99976 82303 73380 97053 129161 136278 135265 128711 145365 169753 215734 257872
13126B57872K8296J00152J52106K55404L12338L25655K83022J62855p628j89156
$$ 257872 286168 386320 538426 793830 1106168 1431823 1714845 1877700 1870072 1680916
13116A680916l06059l27947k94447k25928j41582j04085o6893k8300k4476j0946
$$ 1680916 1374857 1046910 752463 526535 384953 280868 213975 185675 161199 150253
13106A50253J1352O708q060j7168m8370k0423Q255j0914k3026K508N473j1091
$$ 150253 161605 168313 160253 143085 94715 74292 82547 71633 48607 51115 56588 45497
13094D5497L6348J7524l3289l5590k1730r355J0752M8342j8887k0755K3716J9254
$$ 45497 81845 99369 66080 30490 8760 -595 10157 58499 39612 18857 42573 61827
13082F1827J280O264K87j783m998l8637q751J6495o396k1150R229j415j8350L7428
$$ 61827 63107 69371 69658 67875 62877 24240 15489 31984 25588 4438 13667 12252 -6098 31330
13068C1330L4874n520q972j7370k9679J3867l054K0069N849l206J2798J0454k9782
$$ 31330 66204 60684 51712 34342 4663 18530 15476 35545 41394 38188 50986 61440 31658
13055C1658J8101M5008J5132k0250o889M879K3437n4675l2659j4619L984M2175
$$ 31658 49759 94767 109899 89649 82760 87639 111076 56401 23742 9123 13107 55282
13043E5282J3280J1974K1427J7375J0691j294j1170J1161l9944l0012L0685J9831
$$ 55282 68562 80536 101963 119338 130029 128735 117565 128726 88782 58770 89455 109286
13031A09286k4043k7963O143J6254J2709j9494q338j7794K3053J6966J9363l4096
$$ 109286 85243 57280 63423 79677 92386 72892 64554 46760 69813 86779 106142 72046
13019G2046N69k5102j9001J6580L1353R311O744J1746N284J608N41J9542J4381
$$ 72046 72615 47513 28512 45092 76445 85756 92500 104246 109530 111138 111679 131221 145602
13006A45602j302j434L3760K993j0657L6381P4591N7975L0626L0643P1304O3892
$$ 145602 144300 142866 176626 179619 168962 205343 279934 337909 368535 399178 470482 534374
12994E34374L7901P9679M2197N134J0118k807m3800o2941l3713p1815n8191l9065
$$ 534374 572275 651954 694151 699285 709403 706596 662796 599855 566142 494327 436136 397071
12982C97071m3677q317L9921j3619K3500l554m9639k3047k086K8045l88n0715
$$ 397071 353394 345077 384998 371379 394879 391325 341686 318639 316553 344598 344210 293495
12970B93495k4867j9966P397j9531k3891o919K560q029k9157L6480K4894j3503
$$ 293495 268628 248662 256059 236528 212637 205718 208278 200249 171092 207572 232466 218963
12958B18963n1405j944J2408J123J750K7102J7370J3028r325r325J2874K0085
$$ 218963 167558 165614 178022 179145 180895 207997 225367 238395 229070 219745 232619 252704
12946B52704Q404Q453j0887K1813J9034l0214k8619J3466J9037k8337k0479j4024
$$ 252704 261108 269561 258674 280487 299521 269307 240688 254154 273191 244854 224375 210351
12934B10351m7294l4349M2490J0460j0770k9771l5794m1753K7205R715j0465L977
$$ 210351 163057 128708 171198 181658 170888 141117 105323 63570 90775 100490 90025 94002
12922I4002Q414M3415K7355Q73j9173M079K0284k3736n793j487p292m095l1602
$$ 94002 102416 145831 173186 174059 154886 158965 179249 155513 149720 148233 140941 136846 105244
12909A05244j1649o791K9686K9115O733R436q76J3543j9561j9464R406K1537M1104
$$ 105244 93595 86804 116490 145605 152338 161774 160898 174441 154880 135416 144822 166359 207463
12896B07463J2811N0125L1237M2986O5730J04054J38249J12508L3973L8623O3985
$$ 207463 220274 270399 301636 344622 410352 514406 652655 765163 799136 837759 901744
12885I01744k8698j19273j23425j34790j15846q3871o3954p8022j8216J4055J6609
$$ 901744 873046 753773 630348 495558 379712 295841 231887 153865 135649 149704 166313
12874A66313P827m6323k1911K9639L1578J5717K3058J1690l131J4224j3032n2069
$$ 166313 174140 127817 105906 135545 167123 182840 205898 217588 214457 228681 215649 163580
12862A63580l7308l7971R918M1913M6529M5852j6218j397k4068m5041k2734m7543
$$ 163580 126272 88301 98219 140132 186661 232513 216295 214898 190830 145789 123055 75512
12850G5512m8166P648J7265L238m939J5201M5787K558j6706k3835Q942M6029K9377
$$ 75512 27346 34994 52259 55497 50558 65759 111546 114104 97398 73563 82505 128534 157911
12837A57911k4221j9584N0464N5822j721m7260l1600m890l0125j6188q298J028
$$ 157911 133690 114106 164570 220392 218671 171411 139811 134921 104796 88608 80310 81338
12825H1338K2103j4166k3913J144j3862R626J4076J9139M6513Q4405Q8149J55704
$$ 81338 103441 89275 65362 66506 52644 62270 76346 95485 141998 226403 314552 470256
12813D70256J24750M5551M7696M4863J6315n5779j06022j79337j51390q7821j0683
$$ 470256 595006 640557 688253 733116 749431 693652 587630 408293 256903 169082 158399
12802A58399K8148J08501N9201J4638l3709j9629J6740k636k1987m2034J8731
$$ 158399 186547 295048 354249 368887 335178 315549 332289 329653 307666 265632 284363
12791B84363J188m537P273J5774K5623M1877k456j0967R61j1049K663N2901l233
$$ 284363 285551 281014 288287 304061 329684 371561 369105 358138 359099 348050 350713 403614 400381
12778D00381L3177N1315J5516k6914k8942R19l9203k2485R460L568J5198n498
$$ 400381 433558 484873 500389 473475 444533 445452 406249 383764 393224 396792 411990 406492
12766D06492j679M029j3555l0831m6905J8416L2180k046l1933q144K4106N5716
$$ 406492 404813 408842 395287 364456 317551 335967 368147 366101 334168 326024 350130 405846
12754D05846N4837L2040l019P291L2717O854K8257n126j5716k1067J2466L0257
$$ 405846 460683 492723 489704 496995 529712 536566 564823 559697 543981 522914 535380 565637
12742E65637J0944J2603J0244K1632K4242o446l445J7676K7878O2519O4407J6132
$$ 565637 576581 589184 599428 621060 645302 638856 635411 653087 680965 743484 807891 824023
12730H24023M3476N1049q260k6788j0682K1339L9137K8079O1540Q9391R3799J13531
$$ 824023 867499 918548 910288 883500 872818 894157 933294 961373 1022913 1112304 1206103 1319634
12718A319634N5846O6869M3413P8628J15154R7587Q9102N7550L7888Q4948J12765
$$ 1319634 1375480 1442349 1485762 1564390 1679544 1777131 1866233 1923783 1961671 2046619 2159384
12707B159384R3733J25000J95980J76944J62973J76064J75330J96951K17895K44997
$$ 2159384 2253117 2378117 2574097 2751041 2914014 3090078 3265408 3462359 3680254 3925251
12697C925251L19566M05641M91886N46378O32518P35075R43916J195382J518019
$$ 3925251 4244817 4650458 5142344 5688722 6321240 7056315 8000231 9195613 10713632
12688A0713632J940441K418698K885476L335015L809191M570065N952296Q331447
$$ 10713632 12654073 15072771 17958247 21293262 25102453 29672518 35624814 43956261
12680D3956261J2883264K1486244L6607300N5446908O4248714O3370764N0586905
$$ 43956261 56839525 78325769 114933069 170379977 234628691 297999455 348586360
12673C48586360J2162006j8723578m4896628o4164895o1207438n0557404l8245646
$$ 348586360 360748366 342024788 297128160 232963265 171755827 121198423 82952777
12666H2952777k4989047j5183618r325189o070436m418641l427361k856070k575233
$$ 82952777 57963730 42780112 33454923 27384487 22965846 19538485 16682415 14107182
12658A4107182k196454j756958j439558j130074q82495p20950o05272n40297m39539
$$ 14107182 11910728 10153770 8714212 7584138 6701643 5980693 5375421 4835124 4395585
12649D395585l72245l68385l44299l04301k61790j78523j70875j36173j68395
$$ 4395585 4023340 3654955 3310656 3006355 2744565 2566042 2395167 2258994 2090599
12640B090599j33063p8446q5498j31874j28150j26661j34477j09267l0585m8429
$$ 2090599 1957536 1879090 1793592 1661718 1533568 1406907 1272430 1163163 1132578 1084149
12630A084149o4810j5984j608l5448L746J9474J7645l0907l3036l5123r0897n6216
$$ 1084149 1019339 1003355 1001747 966299 970045 989519 1007164 976257 943221 908098 817201 760985
12618G60985l1810l9333m1140l2859k5904J7030K3343j7222o5752k9218l8511
$$ 760985 729175 689842 648702 615843 589939 606969 630312 613090 547338 518120 479609
12607D79609o911n637j3622j8294n6054j4675R003k8525m5869l7213k7637J134
$$ 479609 472698 467061 453439 435145 379091 364416 373419 344894 299025 261812 234175 235309
12595B35309J9563o804k5927p87L5844M775L4385l819L6382J5937k2705j345n4977
$$ 235309 254872 248068 222141 221354 257198 261973 296358 292539 328921 344858 322153 320808 265831
12582B65831m2229k7290k5079p966J7286n431Q189k0350l923J4597P064K3118
$$ 265831 223602 196312 171233 163267 180553 175122 183311 162961 159038 173635 180699 203817
12570B03817q800N6161J05305J38242J44679P6831P5401P849o2223j12270j68707
$$ 203817 195017 251178 356483 494725 639404 716235 791636 799485 737262 624992 456285
12559D56285j08731o9470o2057k641j5328m0233k8265k7946K9850L4775k1971
$$ 456285 347554 278084 216027 213386 198058 157825 129560 101614 131464 166239 144268
12548A44268m6878q793L0771R7412R2180J0061j5157o1084p9463r4184q6664J6352
$$ 144268 97390 88597 119368 216780 308960 319021 303864 242780 163317 69133 -17531 -1179
12536a179L4333L2411J05385J08373J30680J16863J47618K06886K36897L33944
$$ -1179 33154 65565 170950 279323 410003 526866 674484 881370 1118267 1452211
12526A452211N44069R35017J611813J954436J361157Q83722L2344j331811j613230
$$ 1452211 1996280 2931297 4543110 6497546 7858703 8742425 8774769 7442958 5829728
12517E829728j503623j355383j002104o09750l65608j80455j17363j00014o9287
$$ 5829728 4326105 2970722 1968618 1358868 993260 812805 695442 595428 526141
12508E26141n0519q1376n6852j4552j0381l7975m5370K093Q501j3339j9105j1870
$$ 526141 475622 394246 337394 322842 312461 274486 229116 231209 239710 226371 207266 195396
12496A95396p099P220K2778j3972m1774j00788o3934j2384L2067N0257O731J4736
$$ 195396 188297 195517 218295 204323 162549 61761 -2173 -14557 17510 67767 74498 89234
12484H9234J9866o3695o7188k1299K3913L4929J1141J7084J0434J1781k4091K897
$$ 89234 109100 45405 -21783 -43082 -19169 15760 26901 43985 54419 66200 42109 45006
12472D5006K3567k930J8721J5232K1286k0432R027k3452l7139J4986j873J0768
$$ 45006 68573 65643 84364 99596 120882 100450 109477 86025 48886 63872 61999 72767
12460G2767K5799M732j3443k0081k0844l1001l3852K1382N5034K5200k3495J780
$$ 72767 98566 103298 89855 69774 48930 17929 -15923 5459 60493 85693 62198 63978
12448F3978j2313k8363l5863j7250N034j4152Q057R779K1618J8909O840K80L44
$$ 63978 51665 23302 -12561 -29811 -24777 -38929 -30872 -21093 525 19434 26274 26554 26898
12435B6898j1531m5606R666J7655O722j5292m001K142J8392M2930j9516k0831
$$ 26898 15367 -30239 -20573 -2918 3804 -11488 -15489 -13347 5045 47975 28459 7628
12423G628l4968J7959O9144k7609j6431K195k6482m269j510J558K5458J5048J2189
$$ 7628 -27340 -9381 59763 32154 15723 17918 -8564 -12833 -14343 -12785 12673 27721 39910
12410C9910q534j2518k2362Q171R737r389p209l6479k212J8367K5188J8162j8773
$$ 39910 31376 18858 -3504 4667 14404 5015 -2194 -38673 -40885 -22518 2670 20832 2059
12397B059l1774J3200l827o08P686O242j0954l7001j4466Q390n96K7132J6706
$$ 2059 -29715 -16515 -20342 -20950 -13264 -7022 -17976 -54977 -69443 -61053 -61649 -34517 -17811
12384a7811P889K0749M768P467K3173j7048k3744m063j5411k6323l628K3066k2957
$$ -17811 -9922 10827 15595 23062 46235 29187 5443 1380 -14031 -40354 -43982 -20916 -43873
12371d3873j5643m7024p129J657n848L5168L9704M671K8613N6031Q600Q368N132
$$ -43873 -59516 -106540 -113669 -112012 -117860 -82692 -42988 -38317 -9704 46327 54927 63295 68427
12358F8427k519l062k3849q652M907l0758n32L3330q175l117m1258l6335K808
$$ 68427 65908 62846 38997 30345 35252 4494 3962 37292 29117 26000 -15258 -51593 -48785
12345d8785M5740o347L780L1865P995n3041k1161Q670O594L7328L3963O397M436
$$ -48785 -3045 -9392 -5612 26253 34248 -18793 -39954 -31284 -24690 12638 46601 52998 57434
12332E7434k8718j0486J7821l801K6141J2756k8021r761L723l044O800L574n15
$$ 57434 28716 18230 36051 32250 58391 71147 43126 33365 37088 34044 40844 44418 43903
12319D3903k1857j9962R545K3305J0323J119j1192m7496k011p307m308K0460K0946
$$ 43903 22046 2084 11629 34934 45257 46376 35184 -12312 -14323 -21630 -25938 -5478 15468
12306A5468m8989o0299K3190O2931N0261k7821l2139j2104M9967P845L261k1835
$$ 15468 -33521 -93820 -70630 -7699 42562 14741 -17398 -29502 20465 28310 31571 9736
12294I736k8749r286M5557O326l6590M895L1825l951k8134k159K5252R035r143
$$ 9736 -19013 -28299 17258 23584 -13006 -8111 23714 19763 -8371 -10530 14722 23757 14614
12281A4614j933K483J9698Q700l5151O903L3044J6453j5491O210K888Q406l646
$$ 14614 12681 15164 34862 43562 8411 15314 48358 64811 49320 55530 58418 66824 63178
12268F3178n5730m5947J817J0171N095K0754K7159L6171m6774M3118J5051n4450
$$ 63178 7448 -38499 -36682 -26511 -21416 -662 26497 62668 15894 59012 74063 19613
12256A9613k9324k1142L1302J2232P742K0388K3955j4693K9025K2750M508m3210
$$ 19613 -9711 -30853 449 12681 20423 40811 64766 50073 79098 101848 106356 63146
12244F3146j6166j4245j8359p739p056J1115L246L3814K1442M011O911K0442J7171
$$ 63146 46980 32735 14376 6637 -419 10696 13942 47756 69198 73209 80120 100562 117733
12231A17733J7576K0321O4264P5176R8020J57688K24865K69396L04899L31242
$$ 117733 135309 155630 219894 295070 393090 550778 775643 1045039 1349938 1681180
12221A681180J73682j3658j40520k99436l51036l14554k44017j48573o7748o3019
$$ 1681180 1854862 1841204 1700684 1401248 1050212 735658 491641 343068 275320 212301
12211B12301j3427k9719m1795j9420Q932j0399n2431P266J4677L6933K9398o028
$$ 212301 198874 169155 127360 107940 116872 106473 54042 61308 75985 112918 142316 136288
12199A36288j5178o973n8508m8887J2868k3835j9425l103j0246K2910J2207k5604
$$ 136288 121110 114137 55629 6742 19610 -4225 -23650 -26753 -36999 -14089 -1882 -27486
12187b7486r834L295j838r3J7919L0867J5213m1822j2231P281j8438K677K4560
$$ -27486 -37320 -34025 -35863 -35956 -18037 12830 28043 -13779 -26010 -18729 -37167 -34490 -9930
12174i930J1332J5131m4354k8330L0127k068m0140J980M069J7335j425N731j2296
$$ -9930 1402 16533 -27821 -56151 -26024 -28092 -68232 -66252 -62183 -44848 -46273 -40542 -52838
12161e2838J3859R497K009J9412J215n0601K354M0271M0917m555K2707l299l934
$$ -52838 -38979 -29482 -27473 -8061 -6846 -57447 -55093 -14822 26095 21540 44247 40948 37014
12148C7014k0164k9070k3511K8945J3313j0370O183k354L520k9332j6175n409
$$ 37014 16850 -12220 -35731 -6786 6527 -3843 2340 -14 3506 -25826 -42001 -47410
12136d7410K4925K9765j594j9885K5393K9709q913l4436j1841O717j0459J2487
$$ -47410 -22485 7280 5686 -14199 11194 40903 31990 -2446 -14287 -7570 -18029 -5542
12124e542o536K3766k347J5861L1941l1819l804Q237K1091J2258k0455k1203j2869
$$ -5542 -12078 11688 9341 25202 57143 25324 21520 29757 50848 63106 42651 21448 8579
12111H579O086J1072K6467k115o553n3475J5228J5458j9623k9895j8438j4389
$$ 8579 14665 25737 52204 50089 43536 -9939 5289 20747 1124 -28771 -47209 -61598
12099f1598J9931k2046k325K8865Q718j4869l071L124j2410K0474J339J5595m359
$$ -61598 -41667 -63713 -66038 -37173 -28455 -43324 -46395 -43271 -55681 -35207 -33868 -18273 -22632
12086b2632k9894k09Q483j52J3673k2055j0891K5793j1174n919j1281K1451M3690
$$ -22632 -52526 -52735 -44252 -44404 -30731 -52786 -63677 -37884 -49058 -54977 -66258 -44807 -1117
12073a117K57j8355j0953k356K5678J0654J5241o656J1475M3019M737j5217j7180
$$ -1117 -860 -19215 -30168 -32524 -6846 3808 19049 12393 23868 66887 71624 56407 39227
12060C9227k4408k3674j5492k5648J2372r306M985n107J9479J4482K5701k417
$$ 39227 14819 -8855 -24347 -49995 -37623 -46929 -41944 -47051 -27572 -13090 12611 10194
12048A0194J7150p278j3707l754k3161K4566J5612P800j389o194j0637K582J9509
$$ 10194 27344 20066 6359 2605 -20556 4010 19622 27422 26033 19839 9202 11784 31293
12035C1293m355r506j8041n551r58M4464o726k9906R812K1644k2684l1346L7919
$$ 31293 26938 17432 -609 -6160 -7118 37346 30620 714 10526 32170 9486 -21860 16059
12022A6059L8735j8039m136K0427n655l0733j7738K6059j8583j0300J5537L851
$$ 16059 54794 36755 32619 53046 47391 16658 -1080 24979 6396 -3904 11633 15484
12010A5484l3319j3603k476J9896K533l823L7132n753l5832J2702K7626j1142
$$ 15484 -17835 -31438 -33914 -14018 -11485 -15308 21824 16071 -19761 -7059 20567 9425
11998I425j9108l7646J1991o105J1227N2851P227J2903j2779j9608J2345j4019
$$ 9425 -9683 -47329 -35338 -41443 -30216 22635 29862 42765 29986 10378 22723 8704
11986H704P95K8203M1315r157K087l1419p856k5380R28J4876L639K376J9887n031
$$ 8704 9499 37702 79017 69860 71947 40528 32672 7292 8220 23096 26735 29111 48998 43967
11972D3967o820K0781j4017k5678j3812p352l0431m1427O59K2218l817K8343k1171
$$ 43967 37147 57928 43911 18233 4421 -2931 -33362 -74789 -74130 -51912 -55729 -27386 -48557
11959d8557k2711M8719L1422J8597K2587K768k6331k4477j3992j5642L626R819
$$ -48557 -71268 -22549 8873 27470 50057 52825 26494 2017 -11975 -27617 -23991 -14172
11947a4172L3719l3339k3493M917L5611J362K2021J0706j3062j0637q967Q281
$$ -14172 19547 -13792 -37285 -32368 3243 4605 26626 37332 24270 13633 4666 12947
11935A2947J142p138l2112k966j3625K5579O871M924J6486j4073M893L9813j6168
$$ 12947 14089 6951 -25161 -28127 -41752 -16173 -9302 -4378 12108 -1965 2928 42741 26573
11922B6573j6404j2773K6250p274J2524J3852K9999j894n8764q555M0555k4202
$$ 26573 10169 -2604 23646 16372 28896 42748 72747 70853 12089 3534 44089 19887
11910A9887k1240j1265L4318P485l3507k8504J4262J6275o470J2569l9117o728
$$ 19887 -1353 -12618 21700 29185 -4322 -32826 -18564 -2289 -8759 3810 -35307 -42035
11898d2035J2845K68N283o91R206J7176N416l9617j1027k9567k849M629N730L4469
$$ -42035 -29190 -28922 -23639 -24330 -15124 2052 7468 -32149 -43176 -72743 -75592 -70963 -65233 -30764
11884c0764M4402J3863N106J210j4687P866J5425M1835P922l9252o2656j4938
$$ -30764 13638 27501 32607 33817 19130 26996 42421 84256 92178 52926 -9730 -24668
11872b4668N486K7242L4752k0132k9182r598l2203m394K2296j6584l011k06J2501
$$ -24668 -19182 8060 42812 22680 -6502 -16100 -48303 -52697 -30401 -46985 -49996 -50202 -37701
11859c7701J6733j1686K2830k631J0173J8795J3811k530l3711j5946J9939R895
$$ -37701 -20968 -32654 -9824 -12455 -2282 16513 30324 27794 -5917 -21863 -1924 7971
11847G971l2502j8388K5756L9033k376j5678J5572R18L295j1664M430j5439K458
$$ 7971 -24531 -42919 -17163 21870 19494 3816 19388 20306 23601 11937 16367 928 3386
11834C386j9647O818N5198N3970j3886m3109M517l2023k1141p587j8371l0091
$$ 3386 -16261 -9443 45755 99725 85839 42730 47247 15224 -5917 -13504 -31875 -61966
11822f1966J0377L9022j2640J5259j306J8374J8519J1876j2062k0302k4437J5502
$$ -61966 -51589 -12567 -25207 -9948 -11254 7120 25639 37515 25453 5151 -19286 -3784
11810c784J1511k1049j2923K548K2305O586Q568Q070O114J6146k6086l2130k049
$$ -3784 7727 -13322 -26245 -23697 -1392 5194 13762 21832 27946 44092 18006 -14124 -16173
11797a6173K0480k0771K57K2105j2067K7204k7565k2935p084J4664L2350K9814
$$ -16173 4307 -16464 -16207 5898 -6169 21035 -6530 -29465 -36549 -21885 10465 40279
11785D0279j5664m195j3121l6875L920L1829J5353l247K1135Q854l4003o963J4743
$$ 40279 24615 20420 7299 -29576 -25656 6173 21526 18279 39414 48268 14265 7302 22045
11772B2045p104M728N200J3428l8508j1733K9529k0988p506j5620K2314M2995
$$ 22045 14941 19669 24869 38297 -211 -11944 17585 -3403 -10909 -26529 -4215 38780
11760C8780j7172m806l1278J5700j1717n67L0788L918j8652j3993j3313J4266
$$ 38780 21608 16802 -14476 1224 -10493 -11060 19728 23646 4994 -8999 -22312 -8046
11748h046j5036k689K4607j6816j9603P833Q614J7350L6704L972k577j1397r962
$$ -8046 -23082 -25771 -1164 -17980 -37583 -29750 -21136 -3786 32918 36890 34313 22916 12954
11735A2954L303k7643k7156j2465o179k1586J2766L2970m322P157J1915o008k4868
$$ 12954 16257 -11386 -38542 -51007 -57186 -78772 -66006 -33036 -37358 -30201 -18286 -24294 -49162
11722d9162P556N7286J2721l4366Q625M412l4954J8304K6986j0980j4177j6966
$$ -49162 -41606 15680 28401 -5965 2660 7072 -27882 -9578 17408 6428 -7749 -24715
11710b4715N786J2290J2193p909n744K5690K646j531J1519j8016J444K5598J3586
$$ -24715 -18929 -6639 5554 -2355 -8099 17591 20237 18706 30225 12209 13653 39251 52837
11697E2837J9844J6339L474l5860j0564J9264k6448j6148m0960m3098j9018L3400
$$ 52837 72681 89020 92494 56634 46070 65334 38886 22738 -18222 -61320 -80338 -46938
11685d6938j6127j869K3441J0234k9650N1574K0270l318j2236k4350J8264K1308
$$ -46938 -63065 -64934 -41493 -31259 -60909 -9335 10935 7617 -4619 -28969 -10705 10603
11673A0603L0332K5026l4402K0337k6919l0723L7422K7613J8243K5220J527N1584
$$ 10603 40935 65961 31559 51896 24977 -5746 31676 59289 77532 102752 104279 155863
11661A55863J23680J53802J15304m0285j13254j16323r3016q4508l2060m0578
$$ 155863 279543 433345 548649 508364 395110 278787 185771 101263 69203 28625
11651B8625m6522K5318K824l4969J2824J6596l04r813J086q967J7380k278j3332
$$ 28625 -17897 7421 10245 -24724 -11900 4696 4392 -5421 -4335 -13302 4078 1800 -11532
11638a1532o325K1185k0220M558L0361P736P567K3791k6912j6938k9593L369K1661
$$ -11532 -17857 3328 -16892 -12334 18027 25763 33330 57121 30209 13271 -16322 -12953 8708
11625H708m002j6994N765P752j7384q674j5858J0125J5978J3135n150l996M3334
$$ 8708 4706 -12288 -6523 1229 -16155 -24829 -40687 -30562 -14584 -1449 -6599 -10595 32739
11612C2739o211k3732Q316j6483J7226M2780J0480N44k5493k7017J2213k3539
$$ 32739 26528 2796 11112 -5371 11855 54635 65115 65659 40166 13149 25362 1823
11600A823j8328p258L732K3700j6869O1L5762Q919k308J314M274n8059m2939P08
$$ 1823 -16505 -23763 -20031 3669 -13200 -13139 22623 31542 29234 30548 34822 -23237 -66176 -65468
11586f5468l787j2070K6088p662K4825K2260K6069n408o791j1501j0058n2797
$$ -65468 -69255 -81325 -55237 -62899 -38074 -15814 10255 4847 -1944 -13445 -23503 -76300
11574g6300J3178L0599K4055R762M153j8299J2918J2522J2331K5212J3968j4138
$$ -76300 -63122 -32523 -8468 1294 5447 -12852 66 12588 24919 50131 64099 49961
11562D9961k2370j4904l1503j1091J7958J7674j0788k9650m785J0068J1207L8703
$$ 49961 27591 12687 -18816 -29907 -11949 5725 -5063 -34713 -39498 -29430 -18223 20480
11550B0480K5846k0016l168O695N679j3873O1600M320j7325j5912o834p678O61
$$ 20480 46326 26310 23142 29837 35516 21643 83243 87563 70238 54326 47492 39814 40475
11537D0475O2594j8121j7531l2457o4681p221O8295O161k3530j4517J368M646
$$ 40475 103069 84948 67417 34960 -29721 -36942 31353 37514 13984 -533 835 5481
11525E481K2140q646j5855j4489L7265j288j3497M8038J3000k1763M38k294L2443
$$ 5481 27621 18975 3120 -11369 25896 24608 11111 59149 72149 50386 50824 48530 80973
11512H0973J6330n8960m3948l0191j4703J6343K8217K1069o027j8251j164j3212
$$ 80973 97303 38343 -5605 -35796 -50499 -34156 -5939 15130 9103 -9148 -10312 -23524
11500b3524J167K4276J4524j3940L493M774P703k5794j1233L1193J8315J1271
$$ -23524 -22357 1919 16443 2503 5996 10770 18473 -7321 -18554 12639 30954 42225
11488D2225K3463O653k8379m0324l2221J9295k781p612M2812J8195k3031m0614
$$ 42225 65688 72341 43962 3638 -28583 -9288 -12069 -19681 23131 41326 18295 -22319
11476b2319o910J6807M224k1105l793R738r81o542k932J6649K795j2659J8990
$$ -22319 -29229 -12422 -8198 -29303 -33096 -23358 -24339 -30881 -33813 -17164 -14369 -27028 -8038
11463h038Q460K8418Q383j1573K4174R182l6278k3764l6687j6350P794j0933j7008
$$ -8038 422 28840 37223 25650 49824 59006 22728 -1036 -37723 -54073 -46279 -57212 -74220
11450g4220P405M0078L9063L0345k1213k1828P767p288K3034L7484k4838k0362
$$ -74220 -66815 -26737 12326 42671 21458 -370 7397 109 23143 60627 35789 15427
11438A5427p138p30k7091Q65n25N5825Q90j6132j547j4313k3302K4584l1406L098
$$ 15427 8289 7559 -19532 -18667 -19192 36633 37523 21391 19844 5531 -17771 6813 -24593 -21495
11424b1495l502K0061n086j729k6609R440j7011J0722L434K9992O440N858k6220
$$ -21495 -24997 -4936 -10022 -11751 -38360 -28920 -45931 -35209 -31775 -1783 4657 10515 -15705
11411a5705k4402L252j6813K6476L7615p176J1417J5306L075n208L819m0504r473
$$ -15705 -40107 -36855 -53668 -27192 10423 3247 14664 29970 33045 27837 31656 -8848 -18321
11398a8321R726l0778J675K9515j3790K3626P378o576J6127J6646j1099j5311
$$ -18321 -8595 -39373 -37698 -8183 -21973 1653 9031 2455 18582 35228 24129 8818
11386H818P80j8182O931k6181k6139P090K3082K7307j8919O789Q313j0106J3182
$$ 8818 9598 -8584 -1653 -27834 -53973 -46883 -23801 3506 -15413 -8624 -311 -10417 2765
11373B765k987k418j4641j026J9358K8080l2605j2136K1925K3547n525P393J6735
$$ 2765 -222 -2640 -17281 -18307 1051 29131 -3474 -15610 6315 29862 24337 31730 48465
11360D8465O781Q116j189l1841n351J5600L928m1915n8830N424L3567O617O904
$$ 48465 55246 63362 62173 30332 24981 40581 44509 2594 -56236 -50812 -17245 -10628 -3724
11347c724J523k0188J2837j371m263L1435k5382k2051M289L428J3396l0840R302
$$ -3724 -2201 -22389 -9552 -10923 -15186 16249 -9133 -31184 -26895 -23467 -10071 -40911 -31609
11334c1609j738P90K5569l394q904J710j8245p801J7543J6965K5520k043J5562
$$ -31609 -33347 -32557 -6988 -10382 -19286 -17576 -35821 -43622 -26079 -9114 16406 14363 29925
11321B9925k1132p555j9773j3067J1061j3371j0985j5637P2713J9178j6598k1142
$$ 29925 8793 1238 -18535 -31602 -20541 -33912 -44897 -60534 12179 31357 14759 -6383
11309f383K4620J2508n052r78m837j0279J6893J2741J898j3338r160P274L415
$$ -6383 18237 30745 25693 24715 19878 9599 26492 39233 41131 27793 18633 25907 29322
11296B9322r201m062Q125k1905J528j9198l2503p572P875M0401K918J2911K784
$$ 29322 20121 16059 24184 2279 3807 -15391 -47894 -55466 -47591 -7190 -4272 8639 11423
11283A1423m1020k9571J3668j4042Q265K7306j819J3127K4738J9711j6597l9227
$$ 11423 -29597 -59168 -45500 -59542 -51277 -23971 -25790 -12663 12075 31786 15189 -24038
11271b4038N888M539N3938O52k0167j4919k7732j3047M635N977l0705K9678M4090
$$ -24038 -18150 -13611 40327 40979 20812 5893 -21839 -34886 -30251 -24274 -54979 -25301 18789
11258A8789N424p836j0579K6990o180r486j8058n4635J853J6284K7160K7077j1961
$$ 18789 24213 16377 5798 32788 26608 17122 -936 -55571 -53718 -37434 -10274 16803 4842
11245D842m3389n898K5069J1904J9502J5078O357J7788j17j8779j6264l0318k3605
$$ 4842 -38547 -44445 -19376 -7472 12030 27108 33465 51253 51136 32357 16093 -14225 -37830
11232c7830J0198o958j7530K2998N9638M693j2346l3630k5125j7467K4768K2896
$$ -37830 -27632 -34590 -52120 -29122 30516 35209 22863 -10767 -35892 -53359 -28591 -5695
11220e695m963M986n370j9409K9501J4643M001j2065j1493l0615J6558K2436l1101
$$ -5695 -10658 -5672 -11042 -30451 -950 13693 17694 5629 -5864 -36479 -19921 2515 -28586
11207b8586r307L2304J6044j290K2740L47k8131J2520n0574l5824J3700J5619
$$ -28586 -37893 -5589 10455 9165 31905 32252 4121 16641 -33933 -69757 -56057 -40438
11195d0438j8747R804L3663J3511j8240J737o719q536k133L1371K6754n412l5482
$$ -40438 -59185 -49381 -15718 -2207 -20447 -18710 -25429 -33965 -36098 -4727 22027 16615 -18867
11182a8867M624M8473L2398l443k0437J4802M194j6799n158K195j2176k4136p48
$$ -18867 -14243 34230 66628 63185 42748 57550 61744 44945 39787 41982 29806 5670 4922
11169D922p21J2987j5932J7961K8589j2462k2591M2732L0452k4111M079p726o746
$$ 4922 4201 17188 1256 19217 47806 35344 12753 55485 85937 61826 65905 58179 51433
11156E1433k3912j0564J8744l1171k9445l31M7494J9720j3260k8997j85n910K6464
$$ 51433 27521 16957 35701 4530 -24915 -25246 22248 41968 28708 -289 -474 -6384 20080
11143B0080L868N362P480j9521j5096J432k5820l9628k8973O365K6780J6912J5448
$$ 20080 23948 29310 36790 17269 2173 3605 -22215 -61843 -90816 -84451 -57671 -40759 -25311
11130b5311L7879k1416j0599j1094M137K0647L5719j3573l7201Q866M174K2164
$$ -25311 12568 -8848 -19447 -30541 -26404 -5757 29962 16389 -20812 -11946 -7772 14392
11118A4392n985M123j7824k5389L6109J1905j8659j4525J6196M7913l418K5277
$$ 14392 8407 12530 -5294 -30683 5426 17331 -1328 -15853 343 48256 44838 70115
11106G0115n486k8347j2811J747N83j8422k872M4838n367k3422k0118n406j9122
$$ 70115 64629 36282 23471 25218 25801 7379 4507 49345 43978 20556 438 -4968 -24090
11093b4090j2048L975K8591K4766J6446R712J2601k9104j2538Q207K075j4298
$$ -24090 -36138 -32163 -3572 21194 37640 47352 59953 30849 18311 26518 28593 14295
11081A4295K3848L2788k5189j26M2161l3186l0612J251J2168k4053J77J8586p181
$$ 14295 38143 70931 45742 45616 87777 54591 23979 25230 37398 13345 13522 32108 24927
11068B4927j6917m1608k801J4931L8024r740m6583k6017j5932L3938L6219n369
$$ 24927 8010 -33598 -36399 -21468 16556 6816 -39767 -65784 -81716 -47778 -11559 -16928
11056a6928o766k3403j812O360q403J998K5947N348J4711j446M090k8957r88j811
$$ -16928 -23694 -47097 -48909 -42549 -50952 -48954 -23007 -17659 -2948 -4394 -304 -29261 -30249 -32060
11042c2060k912L5177k1952n8175j3989L7861J8649J9144M7430Q29k5670J774
$$ -32060 -34972 205 -21747 -79922 -93911 -56050 -37401 -18257 29173 30002 4332 6106
11030F106k6315K368l039K34K5800J8511J2679J372l7474j0029j0772l2922j0951
$$ 6106 -20209 -17841 -20880 -20646 5154 23665 36344 37716 242 -9787 -20559 -53481 -64432
11017f4432R755M060j7035K4443R862j4748K56M254j8900J0220J9546J3989p485
$$ -64432 -54677 -50617 -67652 -43209 -33347 -48095 -47839 -43585 -62485 -52265 -32719 -18730 -26215
11004b6215J7394K3035j5523j7054N331K9488N766P999j778N462l1210o3014j3254
$$ -26215 -8821 14214 -1309 -18363 -13032 16456 22222 30221 28443 33905 2695 -60319 -73573
10991g3573K5724M5029j2662j5J202J6127K3672r320l4083j1201O532L5668J786
$$ -73573 -47849 -2820 -15482 -15497 -14295 1832 25504 16184 -17899 -29100 -22568 13100 14886
10978A4886K6630K3333m0021l8923j8989J7246j9456J93K7654J5463K226j8044
$$ 14886 41516 64849 24828 -14095 -33084 -15838 -35294 -35101 -7447 8016 10242 -7802
10966g802J0893P426m1871M2692N7686k137j9680o561l4497o729J636k76k356
$$ -7802 3091 10517 -31354 11338 69024 66887 47207 40646 6149 -580 1056 780 -1576
10953a576J4970j0971l6248J3636J7559J4781k0179l871j7151J6657j035p095
$$ -1576 13394 2423 -33825 -20189 -2630 12151 -8028 -11899 -29050 -12393 -13428 -20523
10941b0523J4444l4414k9153J7961m089L1990K4122r635p495n497K1571K9962
$$ -20523 -6079 -40493 -69646 -51685 -55774 -23784 338 -9297 -16792 -22289 -718 29244
10929B9244l7386l6464M5929K2900k0017o147j111k306P421p290l9641J5187J2614
$$ 29244 -8142 -44606 1323 24223 4206 -1941 -3052 -5358 2063 -5227 -44868 -29681 -17067
10916a7067P641K2302K7270j6314L5726K9544K291k9014l4494J2607K895l042
$$ -17067 -9426 12876 40146 23832 59558 89102 91393 62379 27885 40492 43387 40345
10904D0345J993M543J3391j0668l0805l9900l7535K6691K9509R936q195K0919
$$ 40345 42338 46881 60272 49604 18799 -21101 -58636 -31945 -2436 7500 -695 20224
10892B0224k0729K4133M2744l7524r721j68j4262j0085P863L5223K7900j3418
$$ 20224 -505 23628 66372 28848 19127 18959 4697 -5388 2475 37698 65598 52180
10880E2180k3114R38r86L595j6828l8727j6513K7701j1484j2851k0467P284P739
$$ 52180 29066 30004 29018 32613 15785 -22942 -39455 -11754 -23238 -36089 -56556 -49272 -41533
10867d1533J2630J3100k7239m740J548J6171K2334L5839j3587m6696l2817Q276
$$ -41533 -28903 -15803 -43042 -47782 -46234 -30063 -7729 28110 14523 -32173 -64990 -56714
10855e6714J7487k74j6131J4109L963M3683j6535k4138K577L8742L5517l1520
$$ -56714 -39227 -39501 -55632 -41523 -37560 6123 -10412 -34550 -31973 6769 42286 10766
10843A0766m656R756N927J9405m0455L0067M0777k1245m4141r641K1464j210K948
$$ 10766 6110 15866 21793 41198 743 30810 71587 50342 6201 -3440 18024 16814 19762
10830A9762J1032l796l5080J810K2441L711j0117j5887J0858M3548O236j2530
$$ 19762 30794 26998 -8082 -6272 16169 19880 9763 -6124 4734 48282 54518 41988
10818D1988k8501m0578j065j1477j3427j3155M2844K4508K056n501j6750k8505
$$ 41988 13487 -27091 -28156 -39633 -53060 -66215 -23371 1137 3193 -2308 -19058 -47563
10806d7563j2723J2147l226M220j3877r237J5386K9902N422O447J1462k2021K8109
$$ -47563 -60286 -48139 -51365 -47145 -61022 -70259 -54873 -24971 -19549 -13102 -1640 -23661 4448
10793D448M3088r102m6500j1709l92j7152j1179J4673J8585K4931j724m5409l4934
$$ 4448 47536 38434 -8066 -19775 -20167 -37319 -48498 -33825 -15240 9691 7967 -37442 -72376
10780g2376m749p161P445j2162j3889J1916L6394K2523L0528J8248L4170j0558
$$ -72376 -77125 -84286 -76841 -89003 -102892 -90976 -54582 -32059 -1531 16717 50887 40329
10768D0329k5306k5520O009k0692k0792o70N4190J1441k888k4451k7345j1374
$$ 40329 15023 -10497 -4488 -25180 -45972 -46642 7548 18989 16101 -8350 -35695 -47069
10756d7069p126R44L7837N4862m0164J795j5328L896l4186k2450j3383j8218J0168
$$ -47069 -54195 -53251 -15414 39448 -716 1079 -14249 -10353 -44539 -66989 -80372 -98590 -88422
10743h8422J0765L6423K6080J1322p225J0487K4009k5769l0556J0151M750K6947
$$ -88422 -77657 -41234 -15154 -3832 -11057 -570 23439 -2330 -32886 -22735 -17985 8962
10731H962j3242j2262L624P601K1344l1730j1341L1380J959l0799j3472Q591L4359
$$ 8962 -4280 -16542 -12918 -5317 16027 -15703 -27044 4336 6295 -24504 -37976 -29385 4974
10718D974k0085l6118K4270M2796J2280L4492Q493m392K5680j6307j3592m0968
$$ 4974 -15111 -51229 -26959 15837 28117 62609 71102 66710 92390 76083 62491 21523
10706B1523k0192l9544J7045J1378o400P407k117J3997p004p609P909K2307j4993
$$ 21523 1331 -38213 -21168 -9790 -16190 -8783 -10900 3097 -3907 -11516 -3607 18700 3707
10693C707j1955K899q508K6452r359q943K0110L7287k3752m2078l8011M7442K7295
$$ 3707 -8248 -5349 -13857 12595 3236 -5707 14403 51690 27938 -14140 -52151 -4709 22586
10680B2586J3072j872m69p111r085J0795j2487l109k2548R562M0717k8831m9370
$$ 22586 35658 33786 33317 26206 17121 27916 15429 12320 -10228 -666 40051 11220 -38150
10667c8150O401K0301k8765k4154R117L0435L7635L581L4797j3490k0490K556
$$ -38150 -31749 -11448 -40213 -64367 -55250 -24815 12820 16401 51198 37708 17218 19774
10655A9774k1693q552j1781L7614L5765n930m2308r311j0334m654k2478L6501
$$ 19774 -1919 -10471 -22252 15362 51127 45197 2889 -6422 -16756 -21410 -43888 -7387
10643g387K0153j7193j6118k3258J9315J0562P800k3601L2627L2382j1192j6556
$$ -7387 12766 -4427 -20545 -43803 -24488 -13926 -6126 -29727 2900 35282 24090 7534
10631G534j4152r886K8476L6116q543j2085q569J0927L2597Q404n0247m1680n524
$$ 7534 -6618 -16504 11972 48088 39545 27460 18891 29818 62415 70819 20572 -21108 -26632
10618b6632J0980Q848l820l278J6292J3486n259l412K8351K3548Q451o021k8907
$$ -26632 -15652 -6804 -10624 -13902 2390 15876 10617 7205 35556 59104 67555 61534 32627
10605C2627j4931K0788J215k3111J4450k1951k637k4726K0279J2606j1564q421
$$ 32627 17696 38484 39699 16588 31038 9087 6450 -18276 2003 14609 3045 -5376
10593e376r001l17K8959J1133k1135K0221K6149k8292o896J5537J9871k4126o8518
$$ -5376 -14377 -14694 14265 25398 4263 24484 50633 22341 15445 30982 50853 26727 -41791
10580d1791J5003J8219j3074L7988J4095j0652l1557k7385k5158q896J2233L0239
$$ -41791 -26788 -8569 -21643 16345 30440 19788 -11769 -39154 -64312 -73208 -60975 -30736
10568c0736L8860K7093n363n3957M198L1526J4615o984k607l3520l5228j6464
$$ -30736 8124 35217 29854 -24103 -19905 11621 26236 19252 16645 -16875 -52103 -68567
10556f8567J2345L9105r214n927K7969j5375m1181M018l253q188K5303J931m048
$$ -68567 -56222 -17117 -26331 -32258 -4289 -19664 -60845 -56827 -60080 -68268 -42965 -41034 -45082
10543d5082J0346K0505J5500O010J8854P47k1202j4115n1664j8857K7758J1124
$$ -45082 -34736 -14231 1269 7279 26133 26880 5678 -8437 -60101 -78958 -51200 -40076
10531d0076M494j1743J1701j0304r269K8364L4023k9166r826p751k495j0818l04
$$ -40076 -35582 -47325 -35624 -45928 -55197 -26833 7190 -21976 -31802 -39553 -42048 -52866 -53170
10518e3170N300q078L896M1813K8630J459J2018L040K7834J9938o0044k1638m750
$$ -53170 -47870 -55948 -52052 -10239 18391 19850 31868 34908 62742 82680 22636 998 -3752
10505c752k1942k1941K0543J7201J0683J5059J9186j6913k3619K1333Q865k533
$$ -3752 -25694 -47635 -27092 -9891 792 15851 35037 18124 -5495 15838 24703 22170
10493B2170m605j4665L1419j5699l5005J2490j472l497J7626j3348q923J9490
$$ 22170 17565 2900 34319 18620 -16385 -3895 -5367 -8864 8762 -4586 -13509 5981
10481E981j8979K3869K9434J7922j7047j8873P120J6544K0921j716j8473k4500
$$ 5981 -12998 10871 40305 58227 41180 22307 29427 45971 66892 65176 46703 22203
10469B2203k2876R085n2288K9103N0742n900q477L264J2839k6422k1683K7643
$$ 22203 -673 8412 -43876 -14773 35969 30069 21592 24856 37695 11273 -10410 17233
10457A7233N6741n618l5979k6605p011K9528j3970m2127J7210P701j2506r175
$$ 17233 73974 68356 32377 5772 -1239 28289 14319 -27808 -10598 -2897 -15403 -24578
10445b4578K1709J2436m573M976Q502l452k2382L786m043n130K017M9845M8524
$$ -24578 -2869 9567 4994 9970 18472 15020 -7362 -3576 -7619 -12749 -10732 39113 87637
10432H7637k4166o0746n0111j4418K0193K9403L2316p406k4341q022N671L430
$$ 87637 63471 2725 -47386 -61804 -41611 -12208 20108 12702 -11639 -19661 -13990 -10560
10420a0560K0591K854j4520q876j9977k4749n762J1905L2255K6103K6278l435
$$ -10560 10031 12885 -1635 -10511 -30488 -55237 -60999 -49094 -16839 9264 35542 32107
10408C2107l9032m161L1479J1668l3150j1142n56Q137K5269P948R668j6558j0534
$$ 32107 -6925 -11086 20393 32061 -1089 -12231 -12787 -4650 20619 28567 38235 21677 11143
10395A1143M145J1858q80r280K2573j5679m6603l4370M386K0344N7829K3447n225
$$ 11143 15288 27146 26266 16986 39559 23880 -22723 -57093 -52707 -32363 25466 48913 43688
10382D3688j1289j6836j441j0124m261m663O896O960K0782o355l4464j3629R218
$$ 43688 32399 15563 14122 3998 -263 -4926 1970 8930 29712 23357 -11107 -24736 -15518
10369a5518J7051K9115P48J5959P793n3572l4110L399m125j4421J8454K3010L0180
$$ -15518 1533 30648 31396 47355 55148 1576 -32534 -29135 -33260 -47681 -29227 -6217 23963
10356B3963K9478j1183j1787K5177J015J4131j9186j650K724j3325j7291L888
$$ 23963 53441 42258 30471 55648 56663 70794 51608 49958 52682 39357 22066 25954
10344B5954j0720n687J611k4184L0133N4754L7049J3311M7127N6220O2265L8711
$$ 25954 15234 9547 11158 -13026 17107 71861 108910 122221 169348 225568 287833 326544
10332C26544O9172N6207N764k2418J5838k0969o2241l1680o3714l4694o2355l4991
$$ 326544 395716 451923 457687 435269 451107 430138 367897 336217 272503 237809 175454 140463
10320A40463j4179r344l9907k3859r7k829j0065m3095k6956L972K0524L3249k9410
$$ 140463 126284 116940 77033 53174 53077 50248 40183 -2912 -29868 -25896 -5372 27877 -1533
10307a533k9518P941q473m399R860K2806j2475j3865q378N985K0319j6315J6961
$$ -1533 -31051 -23110 -31583 -35982 -26122 -3316 -15791 -29656 -38034 -32049 -11730 -28045 -11084
10294a1084P407R604L3901j2635j1896l91k1581r181j15M936p311j0929j0830
$$ -11084 -3677 5927 39828 27193 15297 14906 -6675 -15856 -15971 -11035 -18346 -29275 -40105
10281d0105L4383k173J2650N392J5698o812j0544J8265k3103L7527J63p807k7573
$$ -40105 -5722 -7895 4755 10147 25845 19033 8489 26754 3651 41178 41341 33534 5961
10268E961k9178k6532J7058L3063p229n361J0608K2376k3655k9278K1121J8441
$$ 5961 -23217 -49749 -32691 372 -6857 -12218 -1610 20766 -2889 -32167 -11046 7395
10256G395R699N612J5250R287j1816l095p987n087J1885K4735J9124j5292k4812
$$ 7395 17094 22706 37956 47243 35427 32332 24345 19258 31143 55878 75002 59710 34898
10243C4898J504K106L840P048K746n411J523k9920q100J3598K6234j8147J3823
$$ 34898 36402 38508 42348 49396 52142 46731 48254 18334 10234 23832 50066 31919 45742
10230D5742l2559P914J5638j0647l309k3279M8586L472j7085j6797r631J8326
$$ 45742 13183 21097 36735 26088 22779 -500 48086 51558 34473 17676 8045 26371
10218B6371j634M256j7521k9950m341K2904K5782m4265j9339J2911K5145j8768
$$ 26371 24737 28993 11472 -18478 -22819 85 25867 -18398 -37737 -24826 319 -18449
10206a8449N1992K8553l6404j1535J6005j1732J0464J6986j533q623k2068j5241
$$ -18449 33543 62096 25692 14157 30162 18430 28894 45880 44347 35724 13656 -1585
10194a585j0321J3363K6854k9762n6204j2006L7665R423L384J4p026J8405J565
$$ -1585 -11906 1457 28311 -1451 -57655 -69661 -31996 -22573 -19189 -19175 -26201 -7796 -6231
10181f231K639j3389j9960K2377J117q197L0637K9343M770l5851J0498J2060Q253
$$ -6231 -3592 -16981 -36941 -14564 -13447 -21644 8993 38336 43106 7255 17753 29813 38066
10168C8066l4074j6443k2229Q705L2410j2511J028N937O352J5070n601q912l1708
$$ 38066 3992 -12451 -34680 -25975 6435 -6076 -5048 889 7241 22311 16710 7798 -23910
10155b3910M057R839L8519J0522j1778P404J1859k226q456k9140j3587k8978j2580
$$ -23910 -19853 -10014 28505 39027 27249 34653 46512 44286 35830 6690 -6897 -35875 -48455
10142d8455L3610L0421M0601k1314k5614R582j0658l205J0118n066m0181J9215
$$ -48455 -14845 15576 56177 34863 9249 18831 8173 4968 15086 10020 -30161 -10946
10130a0946K5609j8042p050L1419l0688k3404J6939J4308N381Q221k916j5835
$$ -10946 14663 -3379 -10429 20990 -9698 -33102 -16163 -1855 3526 11747 8831 -7004
10118g004l1948q284P814L8805L0089m362l4640m188M146q627k257r879J7149
$$ -7004 -38952 -47236 -39422 -617 29472 25110 -9530 -13718 -9572 -18199 -20456 -30335 -13186
10105a3186K827l493J2580k0608J170N2616J8301R641k3644q150j5600o599J4217
$$ -13186 -10359 -13852 -1272 -21880 -20710 31906 50207 59848 36204 28054 12454 5855 20072
10092B0072K197P279k0953J591j10Q980k5198k6601j1664k8359p307j1716K7989
$$ 20072 22269 29548 8595 10186 10076 19056 -6142 -32743 -44407 -72766 -80073 -91789 -63800
10079f3800K1795R432J1966K707o910P576M162lK7779q851Q396j9274J0943j00
$$ -63800 -42005 -32573 -20607 -17900 -24810 -17234 -13072 -13075 14704 5853 14249 -5025 5918 5818
10065E818j0386k7236k0303O747j532K8757L857r111k9444m900K1103p705j6891
$$ 5818 -4568 -31804 -52107 -45360 -46892 -18135 -14278 -23389 -52833 -57733 -36630 -44335 -61226
10052f1226L6767K7758q699k4044L8858K5022J2848P15j4534M461q151K5954L0852
$$ -61226 -24459 3299 -5400 -29444 9414 34436 47284 47999 33465 37926 29775 55729 86581
10039H6581n87n8908j5165J4672m287j6092Q170K735J3221j356j6274Q557L6733
$$ 86581 85994 27086 11921 26593 22306 6214 14384 17119 30340 28984 12710 21267 58000
10026E8000R437m5142j7155o369J9011K4518j1509l7592j3168J4854J2614J8349
$$ 58000 67437 22295 5140 -1229 17782 42300 30791 -6801 -19969 -5115 7499 25848
10014B5848j669l1141k1863J1615p913j149R528L197K0172J7719j1188j5165K0944
$$ 25848 24179 -6962 -28825 -17210 -25123 -26272 -16744 -13547 6625 24344 13156 -2009 18935
10001A8935J0581Q1398j1879K16l085n3114k6764l9251m598K5279j2790P189R165
$$ 18935 29516 110914 99035 99251 96166 43052 16288 -22963 -27561 -2282 -15072 -7883 1282
9988A282J2695Q984L875k4592k5927m265R164M5911J9500j9118l2609j8675P372
$$ 1282 13977 22961 26836 2244 -23683 -27948 -18784 27127 46627 27509 -5100 -23775 -16403
9975a6403j0761J2437Q670j027K9109K3256j2526j4516K2091J2199o7599J0951
$$ -16403 -27164 -14727 -6057 -7084 22025 45281 32755 18239 40330 52529 -15070 -4119
9963d119K6548Q45k5962O47k1778k1253J5963J0256J8180J6035R968k8009j2905
$$ -4119 22429 23274 -2688 -2041 -23819 -45072 -29109 -18853 -673 15362 25330 -2679 -15584
9950a5584k0995O075M8130L3078k0181n862J542j9752k2750M08J4468j6348q811
$$ -15584 -36579 -30504 17626 50704 30523 24661 26203 6451 -16299 -15891 -1423 -17771 -26582
9937b6582P759N8452R454m806k0280L1301J9609K466j249K0809J242l5631J4314
$$ -26582 -18823 39629 49083 44277 23997 55298 74907 77373 76124 96933 98175 62544 76858
9924G6858k9173q124k0517j5253j6257J3926Q68r895k3463j8818o045N7740J7589
$$ 76858 47685 39561 19044 3791 -12466 1460 2328 -7567 -31030 -49848 -55893 1847 19436
9911A9436k897q377N281K0570k1683k1079J3275Q889L0391M748l2117J3021j5315
$$ 19436 16539 8162 13443 34013 12330 -8749 4526 13415 43806 48554 16437 29458 14143
9898A4143k6616J5892J7386j0334n076j7558J807K1496K2808l312J5581K00k4324
$$ 14143 -12473 3419 20805 10471 5395 -12163 -10356 11140 33948 30636 46217 46417 22093
9885B2093j5708l95L5234j2874m5406M361M4k8260M96j2882K8208M4850K1395
$$ 22093 6385 5990 41224 28350 -17056 -12695 -12651 -40911 -40415 -53297 -25089 19761 41156
9872D1156K610N485k8001j208J747P092L2956R944j2405j5477j4865O652L6621
$$ 41156 43766 49251 21250 20042 21789 28881 61837 71781 59376 43899 29034 35686 72307
9859G2307J9656m95j3679j0869l4764p028K5370J0598p93P740k4915k2983j0328
$$ 72307 91963 91468 77789 66920 32156 25128 50498 61096 60303 68043 43128 20145 9817
9846I817J6272n1r527j0076J1398N376j5272r947o143L351J7101K5153J131R7
$$ 9817 26089 26038 16511 6435 17833 23209 7937 -2010 -8153 -4802 12299 37452 38583 38680
9832C8680L6829K838j0890k8110l7857k2840K7786J9740J2154J6099j7540K757
$$ 38680 75509 78347 67457 39347 1490 -21350 6436 26176 38330 54429 36889 39646
9820C9646J9274K301o935O406K97J8403j5600l4178j9866J5036J5904m45m635
$$ 39646 58920 61221 54286 60692 60989 79392 63792 29614 9748 24784 40688 40243 35608
9807C5608J7810L491j4981K5339k458J0003K0911P087o1294k6739j3089P482j9197
$$ 35608 53418 56909 41928 67267 64809 74812 95723 102810 41516 14777 1688 9170 -10027
9794a0027k137J5568O169O826r658N149K1605K5103K3310J4172m2864l5953k842
$$ -10027 -12164 3404 9573 16399 6741 11890 33495 58598 81908 96080 53216 17263 14421
9781A4421J2070j2801n02k6962j006L5197M247Q662k9978l3961L7831L5015M424
$$ 14421 26491 13690 13188 -13774 -14780 20417 24664 33326 3348 -30613 7218 42233 46657
9768D6657L9l0542K0133p59J0098N2423j6401m1868K9842J6336j5360J8324k868
$$ 46657 46696 16154 36287 35528 45626 98049 81648 39780 69622 85958 70598 88922 86054
9755H6054j9447k4072R022o864j9296K131J0544K2018J3644j5634l3887j2663
$$ 86054 66607 42535 51557 44693 25397 27528 38072 60090 73734 58100 24213 11550
9743A1550L3795N995J8520M4387p203l2992J7636m602J1757k9269j1485N2443
$$ 11550 45345 51340 69860 114247 107044 74052 91688 87086 98843 69574 58089 110532
9731A10532K0066P8m8904m5563j1560n071K634k4791N212L2642K6879Q334J9081
$$ 110532 130598 130676 81772 36209 24649 19578 22212 -2579 2633 35275 62154 70488 89569
9718H9569j627l3673j2422J6580P837k2926r709K3195k7114L959J8242N631p669
$$ 89569 87942 54269 41847 58427 66264 43338 33629 56824 29710 33669 51911 57542 49873
9705D9873j1277j7889o241N2278L3940k6427j2328K7910J5647p506k502K048j7132
$$ 49873 38596 20707 14466 66744 100684 74257 61929 89839 105486 97980 95478 97526 80394
9692H0394m1565k227K5769J7914M679l0209j4486L0403O0610k372l5163M467K3006
$$ 80394 38829 36602 62371 80285 84964 54755 40269 70672 131282 128910 93747 98214 121220
9679A21220J869k2500k2899P245O70j2000N324k4377r147J824J6605N5861K6912
$$ 121220 123089 100589 77690 84935 85605 73605 78929 54552 45405 47229 63834 119695 146607
9666A46607J0098m6719R281L434R114k4107m5265l2641j3191J6844J6212M6027
$$ 146607 156705 109986 119267 122701 131815 107708 62443 29802 16611 33455 49667 95694
9654I5694K9610K6517k2721m6788l0224J7881L9129j7431K7813j0885m0704n280
$$ 95694 125304 151821 129100 82312 52088 69969 109098 91667 119480 108595 67891 62611
9642F2611O375L2474J0235o6756K6690M8055J8196J351k1354m2913k7192J2772
$$ 62611 68986 101460 111695 44939 71629 119684 137880 139231 117877 74964 47772 60544
9630F0544O859J3908Q219K3158j9469O56p957p749q724J6196J9951K9704J33j1603
$$ 60544 67403 81311 89530 112688 93219 93875 85918 78169 69445 85641 105592 135296 135429 123826
9616A23826O517J0222q951k844n409k0020K7661o263j1739j0810j2710L2314K2713
$$ 123826 130343 140565 131614 128770 123361 103341 131002 124739 113000 102190 89480 121794 144507
9603A44507r761J1603k4272j3552J6978l1067R439L018K5345K4841Q11j6354r322
$$ 144507 134746 146349 122077 108525 125503 94436 103875 106893 132238 157079 157890 141536 132214
9590A32214L1037j0079k3446l8884J3467M9660j1840j0215J7888j1888m661J9914
$$ 132214 163251 153172 129726 90842 104309 153969 142129 131914 149802 137914 133253 153167
9578A53167K832K2404j7811j1491J089j3962L255J7172r812R250j8697L2845K2568
$$ 153167 155999 178403 160592 149101 150190 136228 139483 156655 146843 156093 137396 170241 192809
9565A92809k6567O602K2451J0078k7908o1002K5307K1467J0894L355m964J8389
$$ 192809 166242 172844 195295 205373 177465 116463 141770 163237 174131 177486 172522 190911
9553A90911L031K5140o62r348K349p584l195j818o661l764N1480J9785L361J741
$$ 190911 193942 219082 218420 209072 211421 203837 200642 198824 192163 188399 239879 259664 263025 264766
9539B64766m402J6068k337j0908l4366j5906K4155Q161J20J6429J393j4056j3344
$$ 264766 260364 276432 274095 263187 228821 212915 237070 245231 245351 261780 263173 249117 235773
9526B35773J2465k5210k0158k0345j2881J1272L3085L2978J7261p028m069N638
$$ 235773 248238 223028 202870 182525 169644 180916 214001 246979 264240 257212 253143 258781
9514B58781L5255L2645j5927l2302k704J1358J2064L1320J7363K6609J4854J7250
$$ 258781 294036 326681 310754 278452 275748 287106 299170 330490 347853 374462 389316 406566
9502D06566o02k7309l0206J614N199p044R57L0165L917q825k5123j4353K1991
$$ 406566 405964 378655 348449 350063 355262 348218 349175 379340 383257 374432 349309 334956 356947
9489C56947q740j4381J5809J8996O119K3275K730k4130j2790K8576J7267J1341
$$ 356947 348207 333826 349635 368631 374750 398025 400755 376625 363835 392411 409678 421019
9477D21019P572K169k3226J963k6245o510O9377L7594l6272j6826J8929K705k0668
$$ 421019 428591 430760 407534 409497 383252 376742 446119 483713 447441 430615 449544 452249 431581
9464D31581L5939j6478J7421j4280q453R438K1177O1500J3986J219n819l5905
$$ 431581 467520 451042 468463 454183 445730 455168 476345 537845 551831 553050 547231 511326
9452E11326R38O2721K9325J1767j710j041k5404k1412q799L9715k2109j9485J0406
$$ 511326 512264 574985 604310 616077 614367 613326 587922 566510 557711 597426 575317 555832 566238
9439E66238M794L669O3902K8324l242N026l0600r709P292J3863l2942L4982K0536
$$ 566238 571032 574701 638603 666927 663685 668711 638111 628402 635694 649557 616615 651597 672133
9426F72133J1126k5847k4851L949j2294M4141K5795j001J5311K746J8429L5775
$$ 672133 683259 657412 632561 636510 624216 668357 694152 693151 708462 711208 729637 765412
9414G65412j9715l0659K1939J3385j2032L760k5396J3048L6777p896R857M9209
$$ 765412 745697 715038 736977 750362 738330 742090 716694 729742 766519 758623 768480 817689
9402H17689l7012k0561J8746m0031j2743J2294K4651n469J0478J0868J7853l0314
$$ 817689 780677 760116 778862 738831 726088 738382 763033 757564 768042 778910 796763 766449
9390G66449l6983O829j5254k289J3322L1963l584k2524o142O855M0065L2606L2000
$$ 766449 729466 736295 721041 718752 732074 764037 760453 737929 731787 738642 778707 811313 843313
9377H43313q989m303j8544l2260j685J3068j5529o854l3100j5878k2457J5535
$$ 843313 834324 830021 811477 779217 777532 790600 775071 768217 735117 719239 696782 712317
9365G12317j1426k0112J3158N8415J8387l0092n560o848l886r44L1977p372o3427
$$ 712317 700891 680779 693937 752352 770739 740647 735087 728239 724353 723409 755386 748014 684587
9352F84587o9286j6390K0334L0471P683R979j7860J5743j86k8568l2824j5929
$$ 684587 615301 598911 619245 649716 657399 667378 649518 665261 665075 636507 603683 587754
9340E87754k503j889K2984j0355m5435m7023k294K351k968K9077O908K60k8509
$$ 587754 585251 583362 606346 595991 550556 503533 501239 503590 500622 529699 536607 536867 508358
9327E08358J8897K288l689J2990l334k5768n6143M2671L5955Q191j2974n4898
$$ 508358 527255 529543 525854 538844 535510 509742 453599 496270 532225 540416 527442 472544
9315D72544k7638J775J8571j8841p56J4639J545M773j7571j793J5656R259k5583
$$ 472544 444906 446681 465252 446411 445655 460294 461839 466612 449041 447248 462904 472163 446580
9302D46580l9858l1347L8807J8179n337k7190N32L7878k1605n5480J457L8847
$$ 446580 406722 375375 414182 432361 427024 399834 400366 438244 416639 361159 362616 401463
9290D01463L9328K092N153j6636N110n5868m4588j7783K2788N212M0396k0413
$$ 401463 440791 442883 448036 431400 436510 380642 336054 318271 341059 346271 386667 366254
9278C66254L957m04K7239k0907j038j9224r386L3517J9891o331j4674j5114l8793
$$ 366254 370211 369807 397046 376139 375101 355877 346491 380008 399899 393568 378894 363780 324987
9265C24987l4688j1517q969J0810l0830j8005j9801J6252M9558J0138l1201L126
$$ 324987 290299 278782 269813 280623 249793 231788 211987 228239 277797 287935 256734 259860
9253B59860R11L3310J7149l6641k2294R840O054j0323l3425k3j3583n021N882
$$ 259860 260771 294081 311230 274589 252295 262135 268189 257866 224441 224418 210835 205814 211696
9240B11696m254k9029K4433K2326L7755K1990m0840m2301q719M247l2164K0198
$$ 211696 207442 178413 202846 225172 262927 284917 244077 201776 193057 197304 165140 185338
9228A85338K9098l6303j4606n886l0576j2763J8866K1927k9211m2069k899M5530
$$ 185338 214436 178133 163527 157641 127065 114302 133168 155095 125884 83815 80916 126446
9216A26446K1641J4974J8369K566J3450l5804l9664J4750q09J0512j5375J1751
$$ 126446 148087 163061 181430 183996 197446 161642 121978 136728 135919 146431 131056 142807
9204A42807J174k8057p889M5809m117p043L804J8909m3313O818m044q99O604L0776
$$ 142807 143981 115924 108035 153844 149727 142684 146488 165397 122084 128902 124858 123959 130563 161339
9190A61339k2639j6674j3528M98M1010J5311l556k205K205l5891n2756M6674K0618
$$ 161339 138700 122026 108498 108996 150006 165317 161761 159556 161761 125870 73114 119788 140406
9177A40406l6339q284r375J334J0778J997l9931r574K0076Q109j8959L4516P774
$$ 140406 104067 95783 86408 87742 98520 100517 60586 51012 71088 79197 60238 94754 102528
9164A02528L27K0500k239R91m6889J86P056j2957k869Q773J8316J0652L839N232
$$ 102528 102855 123355 121116 122107 75218 75404 82460 69503 66634 75407 93723 104375 108214 113446
9150A13446o342k8907J6212k796K4387K4096r249J1721j3467m1348l8295K8175
$$ 113446 107104 78197 94409 91613 116000 140096 130847 142568 129101 87753 49458 77633
9138G7633P394k2218o960J4628m841J9859p378Q40J2901K243j3065K102j6102
$$ 77633 85027 62809 55849 70477 65636 85495 78117 78957 91858 94101 81036 83138 67036
9125F7036m90K8749J3997l3233k6138m4024l9022L0437K6379O985l669N7575P9674
$$ 67036 66546 95295 109292 76059 49921 5897 -33125 -2688 23691 30676 27007 84582 164256
9112A64256L2808o5773o1691j2268J7212k952p772p574j2985N1473J9583M036
$$ 164256 197064 131291 69600 57332 74544 71592 63820 56246 43261 94734 114317 118353
9100A18353p339j6629o7089j3599q50L4309Q169m459k902J2109K8183L226j3756
$$ 118353 111014 94385 27296 13697 12847 47156 55325 50866 47964 60073 88256 91482 77726
9087G7726M217K5169m1102k1786r398l1965N961P025J4925K5257K5328J1153N857
$$ 77726 81943 107112 66010 44224 34826 2861 8822 15847 30772 56029 81357 92510 98367
9074I8367j2116l9860k5255r738L6495j898r887n9j5163J2112M5607k4604l8662
$$ 98367 86251 46391 21136 11398 47893 45995 36108 36049 20886 32998 78605 54001 15339
9061A5339J1254J1356L781K2486o404Q057J7820j5124m5008Q004J2227o153J3366
$$ 15339 26593 37949 41730 64216 57812 65869 83689 68565 23557 31561 43788 37635 51001
9048E1001K201l1811l3659k0179R701j4765K651K8858K6320L6387o328k2681l3900
$$ 51001 53202 21391 -12268 -32447 -22746 -37511 -34860 -6002 20318 56705 50377 27696 -6204
9035f204P12M2847K1528p447j4898P77J1042K4347J2393j2360j8997n514l7662
$$ -6204 -5492 37355 58883 51436 36538 37315 48357 72704 85097 72737 53740 48226 10564
9022A0564k0032J8953R629J1089m1518n259M5136n945J6154J3744J0708O516J7563
$$ 10564 -9468 9485 19114 30203 -11315 -16574 28562 22617 38771 52515 63223 69739 87302
9009H7302J4329j5016k7083J4227J4053k092k2378P131J7307m937k0618Q445J0620
$$ 87302 101631 86615 59532 73759 87812 85720 63342 70473 87780 82843 62225 70670 81290
8996H1290n757K4852j6105O217K6004J0681n268k4062m6594J7242L250k6938j0921
$$ 81290 75533 100385 84280 90497 116501 127182 121914 97852 51258 68500 71750 44812 33891
8983C3891k572k8473j1108N7749J8568j8477k1941l349J2622R354M806k381o401
$$ 33891 31319 2846 -8262 49487 68055 49578 27637 24288 36910 46264 51070 48689 42288
8970D2288J898l6800n3417n072q3M3295K5569J9513O131N598J3236j1944J5836
$$ 42288 44186 7386 -46031 -51103 -51186 -7891 17678 37191 43322 48920 62156 50212 66048
8957F6048M739j2355J2520J7735N285l5272j2445J3365k4283l4380j9140J6926
$$ 66048 70787 58432 70952 88687 93972 58700 46255 59620 35337 957 -18183 -1257
8945a257P11j7846K3509K3971Q443N0973j4469l7436J3488O240P273J6348J7422
$$ -1257 -546 -18392 5117 29088 37531 88504 74035 36599 50087 56327 63600 79948 97370
8932I7370j9855j4907o04l0945R754M0149J8691m915n181k3883j5024K9799N670
$$ 97370 77515 62608 62004 31059 40813 80962 99653 94738 89557 65674 50650 80449 86119
8919H6119k5753k2494J4154j9103k4106j7842P351K0177q986k9578j7727K1061
$$ 86119 60366 37872 52026 32923 8817 -9025 -1674 18503 9517 -20061 -37788 -16727
8907a6727J7123l3765n244L9410l491M532M928k5269O616M4502M5255k6449r043
$$ -16727 396 -33369 -38613 797 -2694 1838 6766 -18503 -11887 32615 77870 51421 42378
8894D2378q154l2452O144O51K673K0624K2686o164O666K7622j8125l1065k5261
$$ 42378 34224 1772 7916 8567 11240 31864 54550 48386 55052 82674 64549 33484 8223
8881H223j4799k6077k1676J1580J7092P091j689J6050P915P281j1137l113J8363
$$ 8223 -6576 -32653 -54329 -42749 -25657 -18566 -20255 -4205 3710 10991 -146 -3259 15104
8868A5104J8498n5974J1828L2903P413k5170j9407P728Q047k8469j5039K6919
$$ 15104 33602 -22372 -10544 22359 29772 4602 -14805 -7077 970 -27499 -42538 -15619
8856a5619M9592n799k6495K3351n457K1444r32l322l8348k0842J8099L9662q256
$$ -15619 33973 28174 1679 25030 19573 41017 40085 36763 -1585 -22427 -4328 35334 27078
8843B7078l1361J6590L7432R840j059q177J830k9203J1314P003J7659j7554j2564
$$ 27078 -4283 12307 49739 59579 58520 50343 52173 22970 34284 41287 58946 41392 28828
8830B8828k6860n6686j1848K6230K7515K8016m230J3974K0982P582J584j2278
$$ 28828 1968 -54718 -66566 -40336 -12821 15195 10965 24939 45921 53503 55087 42809
8818D2809k0434P270J9889l8093l2573K8864O6203K2831k9713m4247m3728k3168
$$ 42809 22375 29645 49534 11441 -21132 7732 73935 96766 67053 22806 -20922 -44090
8806d4090o690O6934K4850o1513j5631O234J8935j1632J377J242R409N516P831
$$ -44090 -50780 16154 41004 -20509 -36140 -29906 -10971 -22603 -21226 -19984 -10575 -5059 2772
8793B772J7536K83m208L5193J0131j4168N720k8449n235j9231o803N18M072K2301
$$ 2772 20308 20591 16383 51576 61707 47539 53259 24810 19575 344 -6459 -5941 -1869 20432
8779B0432m7860k0748R907J5347K7151m422n394J542K6796J2898j0016N4j4413
$$ 20432 -27428 -48176 -38269 -22922 4229 -193 -5587 -4045 22751 35649 25633 25687 11274
8766A1274j2519J6865Q551l0022j608o38P541q646K6402K7668k846j0630k1044
$$ 11274 -1245 15620 24171 -5851 -7459 -8097 -556 -9202 17200 44868 42022 31392 10348
8753A0348j3377j6592K9085J8590J1690k2588k4170Q471r705R028k2753j6446
$$ 10348 -3029 -19621 9464 28054 39744 17156 -7014 1457 -8248 780 -21973 -38419
8741c8419N3786P110l7318k5772k8136R958p023M104q78J1122J4256K9337J4653
$$ -38419 15367 22477 -14841 -40613 -68749 -58791 -65814 -61710 -62588 -51466 -37210 -7873 6780
8728F780j0332N245J1838K5308K685k1977P864L399J5351l659J925J5641j6018
$$ 6780 -3552 1693 13531 38839 41524 19547 27411 30810 46161 42502 44427 60068 44050
8715D4050p829L8631L911k6063k5216J6653k5108M384K1276Q411L439k3581l7295
$$ 44050 36221 74852 78763 52700 27484 44137 19029 23413 44689 53100 56539 32958 -4337
8702d337k9680J1806K4434n134J0221m0479k0632N2809N0852J1881k5988k3234
$$ -4337 -34017 -22211 2223 -2911 7310 -33169 -53801 -992 49860 61741 35753 12519
8690A2519l9553j9362L1934Q754K5035k829j2105J3825J7945k0984k0177J9065
$$ 12519 -27034 -46396 -14462 -5708 19327 16498 4393 18218 36163 15179 -4998 14067
8678A4067J6271l1332K3437n583k4336M707K8491J8747K3535J8083M543n446j5723
$$ 14067 30338 -994 22443 16860 -7476 -2769 25722 44469 68004 86087 90630 85184 69461
8665F9461l3730l5132L332k5288J0715m39o244K3549J7311k4068l1103P626K8925
$$ 69461 35731 599 3931 -21357 -10642 -11081 -17325 6224 23535 -533 -31636 -24010 4915
8652D915K4404j0115k3470R305J4071L4642R978k0239l3044k9682j9079N956M3488
$$ 4915 29319 19204 -4266 5039 19110 53752 63730 43491 10447 -19235 -38314 -32358 11130
8639A1130M1244L4986n630O321J0035k1070j6090j2218j4980j4709k1017l7625
$$ 11130 52374 87360 81730 88051 98086 77016 60926 48708 33728 19019 -1998 -39623
8627c9623j1995l277N2852L9247J3806j5165j6823L720J7350J3522o89j0136K2501
$$ -39623 -51618 -54895 -2043 37204 51010 35845 19022 22742 40092 53614 52925 42789 65290
8614F5290j2330K6069L9277J1334l3141l6835R700j085K1149L0763q850l0204
$$ 65290 52960 79029 118306 129640 96499 59664 69364 68279 89428 120191 111341 81137
8602H1137j1897M075J9818l659j912o581k7935j161L0917k6043J0299J4033m976
$$ 81137 69240 73315 93133 89474 87562 80981 53046 51885 82802 56759 67058 81091 76115
8589G6115l3908o500J1723P838L3957k0234J7890j113l9905J9269K3594R474Q955
$$ 76115 42207 35707 47430 55268 89225 68991 86881 85768 45863 65132 88726 98200 107155
8576A07155P869J10K102J2890m7788o0718m7816J2708L1068K5135l634j7371N613
$$ 107155 115024 115134 117236 130126 82338 21620 -26196 -13488 17580 42715 39081 21710 27323
8563B7323M478k0997m748l9274j6287K2527P7L7816M1832J690k2230o2128K0855
$$ 27323 31801 10804 6056 -33218 -49505 -26978 -26901 10915 52747 54437 32207 -29921 -9066
8550i066J1885l4109K26Q867M422J1264n705J4656k5918r637N260o635O855M2374
$$ -9066 2819 -31290 -31064 -22197 -17775 -6511 -12216 2440 -23478 -33115 -27855 -34490 -27635 14739
8536A4739L8197N468K7924q759m7884l6034k2615r936N328J1786Q345r888J7873
$$ 14739 52936 58404 86328 77569 29685 -6349 -28964 -38900 -33572 -21786 -13441 -23329 -5456
8523e456K4187j7975k0296k270K2211j710K542Q2304j5592k4591J4724L1426j2384
$$ -5456 18731 756 -19540 -21810 401 -1309 1233 83537 67945 43354 58078 89504 77120
8510G7120j1136j3900j0200n546L931j6327j5382J8953J7374j0723l922p406j5341
$$ 77120 65984 52084 41884 36338 40269 23942 8560 27513 44887 34164 30242 22836 7495
8497G495K1916l495K0571j2262l648O93k2547k0389j9899J9382K1290l881Q979
$$ 7495 29411 25916 46487 34225 30577 31270 8723 -11666 -31565 -12183 9107 5226 14205
8484A4205L4790L3010J0480j3354R437l1165r130k5759m82P9m091j0887Q325j9340
$$ 14205 48995 82005 92485 79131 88568 57403 48273 22514 22032 22111 18020 7133 15458 -3882
8470c882j2406N65l7228L5830L3666j41k7029j8128O665L451O894K7412J6002
$$ -3882 -16288 -15723 -52951 -17121 16545 16404 -10625 -28753 -22088 -18637 -11743 15669 31671
8457C1671L951n4967n9311K5542K9692j4632J6340L8158L6414Q039m4821n484
$$ 31671 35622 -19345 -78656 -53114 -23422 -38054 -21714 16444 52858 60897 16076 10592
8445A0592k4286M109J138R150L3370L1319J0487K3008J3040k5247n4140M88Q15
$$ 10592 -13694 -9585 -8447 703 34073 65392 75879 98887 111927 86680 32540 33028 33843
8432C3843k0606r26o9470l3869J7211R035M2753K3168r461K2961r71J5219N532
$$ 33843 13237 12311 -57159 -91028 -73817 -64782 -22029 1139 -8322 14639 13668 28887 34419
8419C4419k3783K9622P172k0183K122j3915q534k6599J0508J3799J9357k3678
$$ 34419 10636 40258 47430 27247 29369 15454 6920 -19679 -9171 4628 23985 307
8407C07k3923J4937K3271q935j3671j6578K5514M8168l655l4441l7912k4740L5056
$$ 307 -23616 -8679 14592 5657 -8014 -24592 922 49090 45435 10994 -26918 -51658 -16602
8394a6602J3332K3629L2631k483l2716k4718k2864n318J6780q594P928K8325K4979
$$ -16602 -3270 20359 52990 50507 17791 -6927 -29791 -35109 -18329 -26923 -18995 9330 34309
8381C4309m260j7438K1277L4274L483l4619j6376o023L7925O585k8695n8172j9821
$$ 34309 30049 12611 33888 68162 71645 37026 20650 14627 52552 59137 30442 -27730 -47551
8368d7551l486M053K8231J6150K2988l1315k6947m824k4413p096n551J6698K6464
$$ -47551 -51037 -46984 -18753 -2603 20385 -10930 -37877 -42701 -67114 -74210 -79761 -63063 -36599
8355c6599P101K9880q533l7587m436O1186K9479j3142R667j2423l389k7236p414
$$ -36599 -29498 382 -8151 -45738 -50174 11012 40491 27349 37016 24593 21204 -6032 -13446
8342a3446j8923j571J1749n464M830j5168L959K5734N365j3076K0423J2044O822
$$ -13446 -32369 -33940 -22191 -27655 -22825 -37993 -34034 -8300 -2935 -16011 4412 16456 23278
8329B3278n777j4895K8322J5964J4273m542m1394m6349n1031k2584J1441J8476
$$ 23278 17501 2606 30928 46892 61165 56623 15229 -31120 -82151 -104735 -93294 -74818
8317g4818k201J1664L1985M32j0144J604K7396K3393L580j6225j9j4506K639J1419
$$ -74818 -77019 -65355 -33370 -32938 -43082 -41478 -14082 9311 12891 -3334 -3353 -17859 -15220 -3801
8303c801o632m121J8661L0942l4559j3910L9222K6035K4689j6888k6175j695K5997
$$ -3801 -10433 -14554 4107 35049 490 -13420 25802 51837 76526 59638 33463 31768 57765
8290E7765K7957K345k2068k4827k2222j9449l4841K763J6232J4208k7413j1988
$$ 57765 85722 88067 65999 41172 18950 -499 -35340 -32577 -16345 -2137 -29550 -41538
8278d1538J5562J8883J0351K1036P246k5659k4211j018J9318j0613K3502l5799
$$ -41538 -25976 -7093 3258 24294 31540 5881 -18330 -19348 -30 -10643 12859 -22940
8266b2940k8561K2267J3121j848N0364m344K030j0227o494k3228l8507J6965j2139
$$ -22940 -51501 -29234 -16113 -17961 32403 28059 30089 19862 13368 -9860 -48367 -31402 -43541
8253d3541K4173L0187J4490n269j446r566j6119o260Q613j6184p963N1733J9043
$$ -43541 -19368 10819 25309 20040 18594 9028 -7091 -13351 -4738 -20922 -28885 22848 41891
8240D1891l7379l447o010L511L4643l2448q309k2087R252K7078L8361l60J0p297
$$ 41891 4512 1065 -4945 -1434 33209 761 -7548 -29635 -20383 6695 45056 44696 44706 37409
8226C7409J3314m1466j8664k4574J1665K2774K4948K2466p350k2326P258j6436
$$ 37409 50723 9257 -9407 -33981 -22316 458 25406 47872 40522 18196 25454 9018
8214I018l1316L5681K3l2405l25q138n751Q321K0535P601l5140j3364L0603j946
$$ 9018 -22298 13383 13406 -18999 -19324 -27462 -33213 -24892 -4357 3244 -31896 -45260 -14657 -16603
8200a6603j3007l9517K8322O3376J9043J2713n351j1396j1726r252m1959K8498
$$ -16603 -29610 -69127 -40805 22571 41614 54327 48976 37580 25854 16602 -25357 3141
8188C141K4837J08Q541l789K508J0021p769j187j8813j9334J8586k533j6470J8823
$$ 3141 27978 28086 36627 32838 35346 45367 37598 36411 17598 -1736 16850 14317 -2153 16670
8174A6670L609j9594J7752j5510k9994R297J3121k0380j2410m573j689m513J8698
$$ 16670 20279 685 18437 2927 -27067 -17770 -4649 -25029 -37439 -42012 -43701 -48214 -29516
8161b9516k6712l2905J4186J5633L9357K2897M54m916q39J1243P529l4831M189
$$ -29516 -56228 -89133 -74947 -59314 -19957 2940 3394 -1522 -2361 8882 16411 -18420 -14231
8148a4231J6549J4570k510j2301j5936M531j3708p392j2239J3117k4125J0186
$$ -14231 2318 16888 14378 2077 -13859 -9328 -23036 -30428 -42667 -29550 -53675 -43489
8136d3489n913K0229J0311k7668l0137J2673O675K4790J5772j130J7470O953P402
$$ -43489 -49402 -29173 -18862 -46530 -76667 -63994 -57319 -32529 -16757 -17887 -417 6536 13938
8123A3938Q019J6311r793k0448m518K1782j6324M6404j0943k3098j8682k391j303
$$ 13938 21957 38268 28475 8027 3509 25291 8967 55371 44428 21330 2648 257 -1046
8110a046l0783J3193L5419J1024j5310l0797J0897j4696j5545J4108L6100j0175
$$ -1046 -31829 -18636 16783 27807 12497 -18300 -7403 -22099 -37644 -23536 12564 2389
8098B389m593K5447K1994O560j1815k3623j9931N33k7853L1574K4054k1425j2302
$$ 2389 -2204 23243 45237 51797 39982 16359 -3572 -3039 -30892 682 24736 3311 -8991
8085h991K0128r815N9j1077K4062K0666p569n2496j9824J9866N4548N0790J3421
$$ -8991 11137 1322 1381 -9696 14366 35032 27463 -25033 -44857 -24991 29557 80347 93768
8072I3768j9240m9934n5917k5359J5480K3782q068J5636j8808N3651K0188m2271
$$ 93768 74528 24594 -31323 -56682 -41202 -17420 -25488 -9852 -28660 24991 45179 2908
8060B908l2617J7420J3975j9470K9118J1144k8429j609J4833m122L1881N026k4368
$$ 2908 -29709 -12289 1686 -17784 11334 22478 -5951 -7560 7273 3151 35032 40058 15690
8047A5690k3210j8621j6728J9321J0834P940K9941k3j8306r659n564M698m226
$$ 15690 -7520 -26141 -42869 -23548 -12714 -4774 25167 25144 6838 -2821 -8385 -3687 -7913
8034g913j834K5728m2012j358J6729L6762K1860J7070o9002N341m413j3626J9164
$$ -7913 -9747 15981 -26031 -27389 -10660 26102 47962 65032 -3970 1371 -3042 -16668 2496
8021B496N5802Q557o130p650j9993k7063l0994j1072K4183K0996J5886j2136q055
$$ 2496 58298 66855 60725 53075 33082 6019 -24975 -36047 -11864 9132 25018 12882 4827
8008D827J239k7334N561L1513p261O997K4548N1096J1307m5230l7151K7871J3922
$$ 4827 6066 -21268 -15707 15806 8545 15542 40090 91186 102493 57263 20112 47983 61905
7995F1905K224j7916l6187L344N415L0322J7171k3840p076L1734K5705J7965j0861
$$ 61905 64129 46213 10026 13370 18785 49107 66278 42438 35362 67096 92801 110766 99905
7982I9905n228l2191l1671r015K244L20p452L855K833k6680j5806L0540L1957
$$ 99905 94677 62486 30815 21800 24044 24364 16912 20767 23600 -3080 -18886 11654 43611
7969D3611k1756J1403J4748K612J54j3736m2395J512J2300J766K5056J7278J1413
$$ 43611 21855 33258 48006 50618 50772 37036 -5359 -3847 8453 10219 35275 52553 63966
7956F3966k49j2503L272n992k1403l9876K2159r227K1387J6211k2293o873l211
$$ 63966 63717 51214 54486 48494 27091 -12785 9374 147 21534 37745 15452 8579 5368
7943E368J6929N8185M6083J316l0753n3111k3967j9773n358L5095k9574r909o199
$$ 5368 22297 80482 126565 127881 97128 44017 20050 277 -5081 30014 440 -9469 -15668
7930a5668j6536k0691M2994M8608J3307n110k2036N486N909j0970O735J0931P005
$$ -15668 -32204 -52895 -9901 38707 52014 46904 24868 30354 36263 25293 32028 42959 49964
7917D9964Q213o4147k3821K3390J9362J195j6647j4809J8525K9345J4013J9928
$$ 49964 58177 -5970 -29791 -6401 12961 14156 -2491 -17300 1225 30570 44583 64511
7905F4511J0879k7062n1229M306k798L961J3953K7699M0474Q571l8691j1927L609
$$ 64511 75390 48328 -2901 1405 -1393 2568 16521 44220 84694 93265 54574 42647 46256
7892D6256R978j0469N301J8641r813k2739Q317n891n190j331j5037J2143J9993
$$ 46256 56234 45765 51066 69707 59894 37155 45472 39581 34391 33060 18023 30166 50159
7879E0159l0599k5263K0311Q902r014J6168j4841Q031n965k882J308K2723j4244
$$ 50159 19560 -5703 14608 23510 14496 30664 15823 23854 17889 15007 16315 39038 24794
7866B4794l5106J099o730O557P61Q137j5608p555K3310M481j3506j297k886k2315
$$ 24794 -10312 -9213 -15943 -9386 -8625 -488 -16096 -23651 -341 4140 -9366 -10663 -13549 -35864
7852c5864J0097L870j2596j373k010K9341K0273R961K9786L8110J4689L091k4245
$$ -35864 -25767 -21897 -34493 -35866 -37876 -8535 11738 21699 51485 89595 104284 107375 83130
7839H3130r335l906l6508j6079j4183N614o087j8891m4719p319J6796p030K5621
$$ 83130 73795 69889 33381 17302 3119 8733 2646 -16245 -60964 -68283 -51487 -58517 -32896
7826c2896K8917J4595o2620j7620K0996P364J635k1692j7221L0915j6000j5566
$$ -32896 -3979 10616 -52004 -69624 -48628 -41264 -39629 -61321 -78542 -47627 -63627 -79193
7814g9193J9032K721J6093Q459J5064j6376k4385K2268L2293O520J2567l5293
$$ -79193 -60161 -57440 -41347 -32888 -17824 -34200 -58585 -36317 -4024 2496 15063 -20230
7802b0230R991P821J1403l0474L501M004l8614n535M2250O269j7703M502L7394
$$ -20230 -10239 -2418 8985 -21489 -17988 -13984 -52598 -58133 -15883 -9614 -27317 -22815 14579
7789A4579M0902j042j5798k0221l883R764l418j1181j1695J2129M493K167j5730
$$ 14579 55481 54439 38641 18420 14537 24301 20883 9702 -1993 10136 14629 16796 1066
7776A066R818r774Q888J2097j4732q551o101j0549l2542K3375J5788q68j4145
$$ 1066 10884 1110 9998 22095 7363 -1188 -7289 -17838 -50380 -27005 -11217 -12085 -26230
7763b6230k191j8524J7639K2086k0970k8101j8280n780j016K8457L4112k934j0781
$$ -26230 -28421 -46945 -29306 -7220 -28190 -56291 -74571 -80351 -81367 -52910 -18798 -21732 -32513
7750c2513O724L6912Q933j2892n1069k5461N8221O2551L1776k4212k5322N207
$$ -32513 -25789 11123 20056 7164 -43905 -69366 -11145 51406 83182 58970 33648 38855
7738C8855k954j9673K7551l0477m6579K0168L8601J8443k0549k9190j2163J4172
$$ 38855 35901 16228 43779 13302 -33277 -13109 25492 43935 23386 -5804 -17967 -3795
7726c795j8029p517N358r897J1113N3231R286n6621k9355j2443L580J6862L3227
$$ -3795 -21824 -29341 -23983 -33880 -22767 30464 39750 -16871 -46226 -58669 -55089 -38227 -5000
7713e000J034l045M837j3084J8850N275j3717N608L6402k73m1947j8433q818J3377
$$ -5000 -3966 -7011 -2174 -15258 3592 8867 -4850 758 37160 36887 -5060 -23493 -32311 -18934
7699a8934J3563N2534J2724o3741o5407J3452l186R222k1454j5125J2966M1262
$$ -18934 -5371 47163 59887 -3854 -69261 -55809 -58995 -49773 -71227 -86352 -73386 -32124
7687c2124J1749q142l9532l3496k5008K0467K3734K5393K9777M0117L1320L1047
$$ -32124 -20375 -28517 -68049 -101545 -126553 -106086 -82352 -56959 -27182 12935 44255 75302
7675G5302N395m3380j4421q887l006K1668R489J0273m2351k2512k1011j1725K385
$$ 75302 80697 37317 22896 14009 11003 32671 42160 52433 10082 -12430 -33441 -45166 -42781
7662d2781J1249M3030k545k1231J1447R219j1610m95j3432R500q787j8729j732
$$ -42781 -31532 11498 8953 -12278 -831 8388 -3222 -3717 -17149 -7649 -16436 -35165 -36897
7649c6897k7075j721j116K8444K7395m50J0637K978K757K4216j8025k4283L0241
$$ -36897 -63972 -65693 -66809 -38365 -10970 -11420 -783 2195 4952 29168 11143 -13140 17101
7636A7101j343j9083k9018J9930j2823p977K0984K3131j6418o501N492k9481k2839
$$ 17101 15758 -3325 -32343 -12413 -25236 -33213 -12229 10902 -5516 -12017 -6525 -36006 -58845
7623e8845M641J5829J047j2961O661M3198M4677j4099j0013J3505J095l5101k4709
$$ -58845 -54204 -38375 -37328 -50289 -43628 -430 44247 30148 20135 33640 34735 -366 -25075
7610b5075K2273K0508J1109p980K2465j5404j6938J8168j3784k0985j638j5732
$$ -25075 -2802 17706 28815 20835 43300 27896 10958 29126 15342 -5643 -7281 -23013
7598b3013J4731J6794O377K2174l4926n1255J8348J7401m619k1693J1406L731
$$ -23013 -8282 8512 14889 37063 2137 -49118 -30770 -13369 -17988 -39681 -28275 -24544
7586b4544J689N4078R042o639R127k4730m6203q873P078Q928O209j4656j2510
$$ -24544 -22855 31223 40265 33626 42753 18023 -28180 -37053 -29975 -21047 -14838 -29494 -42004
7573d2004J44J282K1838l1344p561o616O561m701n704Q635m642J2718K3990j0877
$$ -42004 -41860 -40578 -18740 -50084 -57645 -64261 -57700 -62401 -68105 -59470 -64112 -51394 -27404 -38281
7559c8281R891r53J9500L3299k0446l2748J0505L0873K1595l957q684j9199o822
$$ -38281 -28390 -29343 -9843 23456 3010 -29738 -19233 11640 33235 29278 20594 1395 -5427
7546e427j6884k1679L0589L2542L8264L5361j7790n2856l4039l3137J343K9098
$$ -5427 -22311 -43990 -13401 19141 57405 92766 74976 22120 -11919 -45056 -43713 -14615
7534a4615J3349J7919J2466m3438o56L975P588L6249K2075j5364l3986j933N844
$$ -14615 -1266 16653 29119 -14319 -14975 -11000 -3412 32837 54912 39548 5562 3629 9473
7521I473N620P084J6755K5419J0326j5608m1671k2055m744K5925k6948j94P194
$$ 9473 15093 22177 38932 64351 74677 59069 17398 -4657 -9401 16524 -10424 -10618 -3424
7508c424q936M307k3615O532J9734Q832r893Q981J4192k6477j5663j8697m203
$$ -3424 -12360 -8053 -31668 -25136 -5402 3430 -6463 2518 16710 -9767 -25430 -44127 -48330
7495d8330J0864M2134K1300L414l0976J6130J786j5495j8444j2226m011K4870
$$ -48330 -37466 4668 25968 29382 -1594 14536 16322 827 -17617 -29843 -33854 -8984
7483h984O367r985K3506q7l52J8920k6320m4895p043J892J2359J3126j0740J3836
$$ -8984 -2617 -12602 10904 10817 10465 29385 3065 -41830 -48873 -46981 -34622 -21496 -32236 -18400
7469a8400J3942K3798N599k0066j3382j1230N234M141K8140M213k989J0801m1211
$$ -18400 -4458 19340 24939 4873 -8509 -19739 -14505 -10364 17776 21989 19000 29801 -11410
7456a1410Q845k43j4529J8490L3224J3225j3596j3181R92M812J607Q113K1114
$$ -11410 -2565 -2808 -17337 1153 34377 47602 34006 20825 21817 26629 28236 36349 57463
7443E7463N77n6944O816J8401L1333N749J0223k0404k7259j7o359p010O399k5365
$$ 57463 58040 1096 7912 26313 57646 63395 73618 53214 25955 25938 19579 12569 18968 -6397
7429f397j6380j3844K7398M4808L1129o284j3381k4242j8247p029K458k2507J3386
$$ -6397 -22777 -36621 -9223 35585 66714 60430 47049 22807 4560 -2469 -11 -22518 -9132
7416i132J8331p422K1400K1651K2009l3268j1658p995j3323K732j3857O764N125
$$ -9132 9199 1777 23177 44828 66837 33569 21911 13916 593 3325 -10532 -3768 1357
7403A357j6763K3115J4661J7925K1125J6882l5768m7221k9598K9689K4502j0035
$$ 1357 -15406 7709 22370 40295 61420 78302 42534 -4687 -34285 -4596 19906 9871
7391I871j7525J9614l460k0723l6535j9510N6123L6700j4746j203j3399k7247
$$ 9871 -7654 11960 8500 -12223 -48758 -68268 -12145 24555 9809 8606 -4793 -32040
7379c2040J4178M2250j9555l9264o787p793J0760K0603J2597K6119j6496k6078
$$ -32040 -17862 24388 4833 -34431 -41218 -49011 -38251 -17648 -5051 21068 4572 -21506
7367b1506k513K2974m162L310R878K4516j7964l0438k7111J3190J1659R449j9238
$$ -21506 -24019 -1045 -5207 -1897 7981 32497 14533 -15905 -43016 -29826 -18167 -8718 -27956
7354b7956J7549K3957j6251k2691k3199j195J7823J2587j2019l3270j9137O535
$$ -27956 -10407 13550 -2701 -25392 -48591 -49786 -31963 -19376 -31395 -64665 -83802 -77267
7342g7267j8878j4807N4589K0459M3903O800l3898j0289K8332L457J0534P972
$$ -77267 -96145 -110952 -56363 -35904 7999 14799 -19099 -29388 -1056 2401 12935 20907
7330B0907k0802k9106n944L3226K1176j1055N019m182l3317K130l2750P510q715
$$ 20907 105 -29001 -34945 -1719 19457 8402 13421 9239 -24078 -21948 -54698 -47188 -55903
7317e5903L214o430K0245L512l222P035J6958K1804k393K971j9840k6576K8096
$$ -55903 -52689 -59119 -38874 -35362 -38584 -31549 -14591 7213 4820 7791 -12049 -38625 -10529
7304a0529n492J73l1830o307L3262L7081q773o895m3810j0756K7735M5755J103
$$ -10529 -16021 -15848 -47678 -53985 -20723 16358 7585 690 -43120 -53876 -26141 19614 20717
7291B0717k3266j1590J0784m0145j4283J6726J0621R551m439J2096L6926k3293
$$ 20717 -2549 -14139 -3355 -43500 -57783 -41057 -30436 -20885 -25324 -13228 23698 405
7279D05m1785K4384m106J0056O451q477p45J3658M372j9446k7508j0357R049L5369
$$ 405 -41380 -16996 -21102 -11046 -4595 -13072 -13817 -159 4213 -15233 -42741 -53098 -44049 -8680
7265h680L3014m5152j1520L8601J485j1342J7238Q33j3110k1943j4589J3195j52
$$ -8680 24334 -20818 -32338 6263 7748 -3594 13644 14477 1367 -20576 -35165 -21970 -22122
7252b2122o221j5534j7788K083J3386J4571L0958J3991k0866k2460J2117P307
$$ -22122 -28343 -43877 -61665 -59582 -46196 -31625 -667 13324 -7542 -30002 -17885 -10578
7240a0578M108J2113k1044K9902j7559k9417K1243N9891j8196k6933Q062o084
$$ -10578 -6470 5643 -15401 14501 -3058 -32475 -11232 48659 30463 3530 11592 5508
7228E508l1943j1727J780K2752L0479K3829j8334m6583K241N2397p830l0099Q671
$$ 5508 -26435 -38162 -36382 -13630 16849 40678 22344 -24239 -21998 30399 22569 -7530 1141
7215A141k0354J6396J5457m142n1034j3576K9142O8312J5346K173k4315J452O981
$$ 1141 -19213 -2817 12640 8498 -42536 -56112 -26970 41342 56688 58861 34546 35998 42979
7202D2979m4846j5394k5774N294L973k432l610l4907Q112k045K6181J9074K7683
$$ 42979 -1867 -17261 -43035 -37741 -33768 -36200 -39810 -74717 -66605 -68650 -42469 -23395 4288
7189D288L359k7305l1956J6880J1798J3251K886j0755L423l9470j8724J6269M958
$$ 4288 7647 -19658 -51614 -34734 -22936 -9685 -6799 -17554 -14131 -53601 -72325 -56056 -51098
7176e1098P621K8532J3881l1179Q502j0012q120M718K3913P0102k7566m0701j0639
$$ -51098 -43477 -14945 -1064 -32243 -23741 -33753 -41873 -37155 -13242 56860 29294 -11407 -22046
7163b2046K0755m220l9254L025K0085M4420m129o331r848k0038P065j9088k6238
$$ -22046 -1291 -5511 -44765 -41740 -21655 22765 18636 12305 2457 -17581 -10516 -29604 -55842
7150e5842r046O663k5345j0447l202L3035L4902n569K174J3031L1626j6076j6344
$$ -55842 -64888 -58225 -83570 -94017 -97219 -64184 -29282 -34851 -32677 -19646 11980 -4096 -20440
7137b0440K7858J3178O227j0092J1094R321J1686k3836k1402K4946O928j1275
$$ -20440 7418 20596 26823 16731 27825 37146 48832 24996 3594 28540 35468 24193
7125B4193q073k5263J0070k5552l0624J0703L146K5090K4939j4312r084R399j4994
$$ 24193 16120 -9143 927 -24625 -55249 -44546 -41400 -16310 8629 -5683 -14767 -5368 -20362
7112b0362K6643K1260K087n14J1352J0178j3494o3234K5020o393r437k283j5183
$$ -20362 6281 27541 29628 29114 40466 50644 37150 -26084 -1064 -7457 -16894 -19177 -34360
7099c4360P967P555j4266J1364r714P812K0601L0487P20K3785L3727j904q257
$$ -34360 -26393 -18838 -33104 -21740 -31454 -23642 -3041 27446 28166 51951 85678 83774 75517
7086G5517m419m7219k9258j1876Q036K4025m3840J9660m431J1722n462j114N50
$$ 75517 71098 23879 -5379 -17255 -9219 14806 -29034 -9374 -13805 -2083 -7545 -8659 -8109
7073h109O535P530J2568J0443J3840J4831O694n0346k9868l276j4391L8224P690
$$ -8109 -1574 5956 18524 28967 42807 57638 64332 13986 -15882 -19158 -33549 4675 12365
7060A2365j1174k6266j5413K9448J839n442o937j7091Q908M686L48J5991j2537
$$ 12365 1191 -25075 -40488 -11040 -9201 -14643 -21580 -38671 -29763 -25077 -24729 -8738 -21275
7047b1275j1644L9327L6126l6041k0858R291l9471k7960J2295J4834J8126k451
$$ -21275 -32919 6408 42534 6493 -14365 -5074 -44545 -72505 -60210 -45376 -27250 -29701
7035b9701r263P8590K3852l9250p915l1816m4471q175Q422l996k7919M1797L8622
$$ -29701 -38964 39626 63478 24228 16313 -15503 -59974 -68149 -59727 -63723 -91642 -49845 -11223
7022a1223K5402J6176j136k0901J4573L2673J968k0165k7375R813K8522k1141
$$ -11223 14179 30355 29219 8318 22891 55564 57532 37367 9992 19805 48327 27186
7010B7186n656j0813j042J9146L521J1465j4516k8674o0710n928K9001K1241J6228
$$ 27186 21530 10717 9675 28821 32342 43807 29291 617 -60093 -66021 -37020 -15779 449
6997D49M732O875n742n195p605j4410R430L661j7120J2220k991j0506L4112M832
$$ 449 5181 12056 6314 1119 -6486 -20896 -11466 -7805 -24925 -12705 -15696 -26202 7910 12742
6983A2742l5948l0920M036K3165J6799Q245M204R211Q529L186l6540j669M0617
$$ 12742 -23206 -54126 -50090 -26925 -10126 -1881 2323 11534 20063 23249 -13291 -14960 25657
6970B5657P194p858K3970Q058l680j0829k0191k9341K218j275L03k6390N618k8818
$$ 25657 32851 24993 48963 57021 53341 42512 22321 -7020 -4802 -6077 -5774 -32164 -26546 -55364
6956e5364j2913m520j318N73P391P499l470L6399K1672K6112L430K7166K584l8705
$$ -55364 -68277 -72797 -74115 -73542 -66151 -58652 -62122 -25723 -4051 22061 25491 52657 55241 16536
6942A6536m3861k4212j3164j1229J9337R886j0207K7150J5217j7894N235R232
$$ 16536 -27325 -51537 -64701 -75930 -56593 -46707 -56914 -29764 -14547 -32441 -27206 -17974
6930a7974l0q486L3908N231k5980L8983M968l2702j3669m9432J9014M0829j7547
$$ -17974 -18004 -26490 7418 12649 -13331 25652 30620 -2082 -15751 -65183 -46169 -5340 -22887
6917b2887Q318M0144J5574Q342l234o4132m4141j9299J0851N1552K2488K3097
$$ -22887 -14569 25575 41149 49491 46257 -17875 -62016 -81315 -70464 -18912 3576 26673
6905B6673j1669l9858j2757L9410J4207K8299K363k6228j1626l4543j0329J0215
$$ 26673 15004 -24854 -37611 1799 16006 44305 46668 20440 8814 -25729 -36058 -25843
6893b5843K2030M864L5401L1058K268K3992k6488j8958k2441o2993k5299l924
$$ -25843 -3813 1051 36452 67510 69778 93770 67282 48324 25883 -37110 -62409 -66333
6881f6333j299J3793O261K6602r371p408j5983o02r051Q749L9089q303m4526j86
$$ -66333 -67632 -53839 -47578 -20976 -30347 -37755 -53738 -54340 -63391 -54642 -15553 -23856 -68382 -68568
6867f8568K0510K8762O42J2523J0470q496k3099M845j335l181m54K1823N5178
$$ -68568 -48058 -19296 -18654 -6131 4339 -4157 -27256 -22411 -23746 -26927 -27381 -5558 49620
6854D9620K2118l1512k2421M1390k7910m4837L372M6468L9065l2232m9084l131
$$ 49620 71738 40226 17805 59195 31285 -13552 -10180 36288 75353 43121 -5963 -9094
6842i094j6825l3208J3473M2039J256J2450k0067q970K6347M233m280j2798k1519
$$ -9094 -25919 -59127 -45654 -3615 -2359 10091 -9976 -18946 7401 11634 7354 -5444 -26963
6829b6963L743K915K5745j9589j1965N1282L2059k1957J3049J9441k7406k3350
$$ -26963 -23220 -20305 5440 -14149 -26114 25168 57227 35270 48319 67760 40354 17004
6817A7004J3463j7169n9692K0295o82K2141j1481P789N200J4341m364l8357p546
$$ 17004 30467 13298 -46394 -26099 -26781 -4640 -16121 -8332 -3132 11209 6845 -31512 -39058
6804c9058l4780M637N4687L2544J6218q629l087l1875K7041j6013J4140J2855
$$ -39058 -73838 -69201 -14514 18030 34248 25619 22532 -9343 17698 1685 15825 28680
6792B8680j0889r841j2981J731j2816J118Q440o589P703J49l3110k0850j2150
$$ 28680 17791 7950 -5031 -3300 -16116 -14998 -6558 -13147 -5444 -5295 -38405 -59255 -71405
6779g1405J1453R170j7968J4085J7784J4680N0600J3611k2202r27k7793l3278
$$ -71405 -59952 -50782 -68750 -54665 -36881 -22201 28399 42010 19808 18881 -8912 -42190
6767d2190J4822j6180L681O901o824O472j0768L8501K002n642Q564k2470r027
$$ -42190 -27368 -43548 -39867 -32966 -39790 -33318 -44086 -5585 -3583 -9225 -661 -23131 -32158
6754c2158m999M196L2670K843Q060o66N709k3845j4520j7808j6852J0649K3951
$$ -32158 -37157 -32961 -291 2552 10612 9946 15655 -8190 -22710 -40518 -57370 -46721 -22770
6741b2770J547L6472N870k4097m0225P091M9955j2619k1761j09q136J4304M3348
$$ -22770 -21223 15249 21119 -2978 -43203 -36112 13843 1224 -20537 -20646 -28782 -14478 28870
6728B8870N615j4864j754o415J1706J0227l3583k6102n817Q970q399L0142J2894
$$ 28870 34485 19621 17867 11452 23158 33385 -198 -26300 -32117 -23147 -31546 -1404 11490
6715A1490l5419K405J3372J8706L560p87k231k8775j1858J6676P244J3581L9155
$$ 11490 -23929 -21524 -8152 10554 14114 13327 11096 -17679 -29537 -12861 -5617 7964 47119
6702D7119L259k3620l0986J693J1564K651j6875J3488J165l3466m153J3623Q904
$$ 47119 50378 26758 -4228 -2535 9029 11680 -5195 8293 9458 -24008 -28161 -14538 -5634
6689e634j1618j0319J0219J552q964K3787j6378J3341M97L1413K629l614j5292
$$ -5634 -17252 -27571 -17352 -15800 -24764 -977 -17355 -4014 -3517 27896 30525 26911 11619
6676A1619P048K646r619J2334J0508l9340j1403L9348J3735l2488m0155n1839
$$ 11619 18667 21313 11694 24028 34536 -4804 -16207 23141 36876 4388 -35767 -87606
6664h7606K6135N6447L4292P986m239j8265j5620j5879J86m235J3566l329j2132
$$ -87606 -61471 -5024 29268 37254 33015 14750 -870 -16749 -16563 -20798 -7232 -10561 -22693
6651b2693J1382L8280O772j0835k3076k8697Q97j270k6402J155M553J6111K0942
$$ -22693 -11311 26969 33741 22906 -170 -28867 -27970 -29240 -55642 -54487 -49934 -33823 -12881
6638a2881K6043k8514j2715K0293K1729n069k4622J5060l838R475k1146n2709
$$ -12881 13162 -15352 -28067 -7774 13955 8886 -15736 -676 -4514 4961 -16185 -68894
6626f8894J0070K024r524O959J698K0017L3504J6785k3377l753j7536k0368O078
$$ -68894 -58824 -56800 -66324 -59365 -57667 -37650 -4146 12639 -10738 -14491 -32027 -52395 -46317
$$ [...]
##END NTUPLES=NMR SPECTRUM
##END=
