##TITLE=Analysis number 315745
Compound Code cc 03616
Book Reference 461/11
Project Code adrs
Chemist Name toml
##JCAMPDX= 6.0         $$ Bruker NMR JCAMP-DX V2.0
##DATA TYPE= NMR SPECTRUM
##DATA CLASS= NTUPLES
##ORIGIN= Bruker BioSpin GmbH
##OWNER= NMR
$$ XWIN-NMR		Version 3.5
$$ Wed Nov 30 11:48:07 2005 GMT Standard Time (UT+0h)  MAYBRIDGE\NMR@NMR_250MHZ
##.OBSERVE FREQUENCY= 250.131544655141
##.OBSERVE NUCLEUS= ^1H
##.ACQUISITION MODE= SIMULTANEOUS (DQD)
##.ACQUISITION SCHEME= undefined
##.AVERAGES= 16
##.DIGITISER RES= 18
##SPECTROMETER/DATA SYSTEM= dpx250
##.PULSE SEQUENCE= zg30
##.SOLVENT NAME= CDCl3
##.SHIFT REFERENCE= (INTERNAL, CDCl3, 0, 16.522)
##AUDIT TRAIL= $$ (NUMBER, WHEN, WHO, WHERE, WHAT)
$$ ##TITLE= Audit trail, XWIN-NMR		Version 3.5
$$ ##JCAMPDX= 5.01
$$ ##ORIGIN= Bruker BioSpin GmbH
$$ ##OWNER= NMR
$$ C:\u/data/dgb/nmr/ADRS/13210/pdata/1/auditp.txt
$$ ##AUDIT TRAIL=  $$ (NUMBER, WHEN, WHO, WHERE, WHAT)
(   1,<2005-11-30 11:47:23.80 +000>,<MAYBRIDGE\NMR>,<NMR_250MHZ>,
      <created by zg, POWCHK disabled, PULCHK disabled
       configuration hash MD5:
       62 19 C7 07 E1 42 D1 B7 37 6C 3D D0 77 39 F9 E6
       data hash MD5: 64K
       F5 83 DA CC 3A BF DD 5B 5D 7D D9 22 12 5F CF 19>)
(   2,<2005-11-30 11:47:43.88 +000>,<MAYBRIDGE\NMR>,<NMR_250MHZ>,
      <Start of raw data processing
       ef LB = 0.3 FT_mod = 6 PKNL = 1 SI = 32K 
       data hash MD5: 32K
       1D E3 34 D5 B3 A2 3F 1F A1 3E 74 B3 B3 FB 5B B5>)
(   3,<2005-11-30 11:47:49.33 +000>,<MAYBRIDGE\NMR>,<NMR_250MHZ>,
      <apk 
       data hash MD5: 32K
       C9 98 6B 4C 0F 92 4C 41 7E 09 46 4F A2 BB 18 2C>)
(   4,<2005-11-30 11:47:50.86 +000>,<MAYBRIDGE\NMR>,<NMR_250MHZ>,
      <abs ABSG = 5 
       data hash MD5: 32K
       40 E8 B4 E8 92 93 FA 89 A2 18 03 BB 42 ED 62 8A>)
$$ ##END=
$$ 
$$ hash MD5
$$ 5A 71 28 D8 94 D4 E8 35 93 46 97 6E D3 17 AB EE
##$RELAX= 
##$RELAX= 
##$RELAX= 
##$RELAX= 
##$RELAX= 
##$RELAX= 
##$RELAX= 
$$ Bruker specific parameters
$$ --------------------------
##$DU= <C:\u>
##$EXPNO= 13210
##$NAME= <ADRS>
##$PROCNO= 1
##$TYPE= <nmr>
##$USER= <dgb>
##$AMP= (0..31)
100 100 100 100 100 100 100 100 100 100 100 100 100 100 100 100 100 100 
100 100 100 100 100 100 100 100 100 100 100 100 100 100 
##$AQSEQ= 0
##$AQ_mod= 3
##$AUNM= <au_zg>
##$AUTOPOS= <17 >
##$BF1= 250.13
##$BF2= 250.13
##$BF3= 250.13
##$BF4= 250.13
##$BF5= 500.13
##$BF6= 500.13
##$BF7= 500.13
##$BF8= 500.13
##$BYTORDA= 1
##$CFDGTYP= 0
##$CFRGTYP= 5
##$CHEMSTR= <none>
##$CNST= (0..31)
1 1 145 1 1 1 1 1 1 1 1 1 1 1 1 1 1 1 1 1 1 1 1 1 1 1 1 1 1 1 1 1 
##$CPDPRG= <>
##$CPDPRG1= <>
##$CPDPRG2= <>
##$CPDPRG3= <>
##$CPDPRG4= <mlev>
##$CPDPRG5= <mlev>
##$CPDPRG6= <mlev>
##$CPDPRG7= <mlev>
##$CPDPRG8= <mlev>
##$CPDPRGB= <>
##$CPDPRGT= <>
##$D= (0..31)
0 1 0 0 0 0 0 0 0 0.06 0 0 0 0 0 0 0.0002 0 0 0 0 0 0 0 0 0 0 0 0 0 0 
0 
##$DATE= 1133351241
##$DBL= (0..7)
120 120 120 120 120 120 120 120 
##$DBP= (0..7)
150 150 150 150 150 150 150 150 
##$DBP07= 0
##$DBPNAM0= <>
##$DBPNAM1= <>
$$ [...]
##$SUBNAM7= <"">
##$SUBNAM8= <"">
##$SUBNAM9= <"">
##$SW= 20.6930455092707
##$SWIBOX= (0..15)
0 0 3 0 0 0 0 0 0 0 0 0 0 0 0 0 
##$SW_h= 5175.983436853
##$TD= 65536
##$TD0= 1
##$TE= 294.16
##$TE2= 300
##$TE3= 300
##$TEG= 300
##$TL= (0..7)
0 120 120 120 120 120 120 120 
##$TP= (0..7)
150 150 150 150 150 150 150 150 
##$TP07= 0
##$TPNAME0= <>
##$TPNAME1= <>
##$TPNAME2= <>
##$TPNAME3= <>
##$TPNAME4= <>
##$TPNAME5= <>
##$TPNAME6= <>
##$TPNAME7= <>
##$TPOAL= (0..7)
0.5 0.5 0.5 0.5 0.5 0.5 0.5 0.5 
##$TPOFFS= (0..7)
0 0 0 0 0 0 0 0 
##$TUNHIN= 0
##$TUNHOUT= 0
##$TUNXOUT= 0
##$USERA1= <user>
##$USERA2= <user>
##$USERA3= <user>
##$USERA4= <user>
##$USERA5= <user>
##$V9= 5
##$VALIST= <valist>
##$VCLIST= <CCCCCCCCCCCCCCC>
##$VD= 0
##$VDLIST= <DDDDDDDDDDDDDDD>
##$VPLIST= <PPPPPPPPPPPPPPP>
##$VTLIST= <TTTTTTTTTTTTTTT>
##$WBST= 1024
##$WBSW= 4
##$XGAIN= (0..3)
0 0 0 0 
##$XL= 0
##$YL= 0
##$YMAX_a= 434709
##$YMIN_a= -388226
##$ZGOPTNS= <>
##$ZL1= 120
##$ZL2= 120
##$ZL3= 120
##$ZL4= 120
##$ABSF1= 16.522
##$ABSF2= -4.171173
##$ABSG= 5
##$ABSL= 3
##$ALPHA= 0
##$AQORDER= 0
##$ASSFAC= 0
##$ASSFACI= 0
##$ASSFACX= 0
##$ASSWID= 0
##$AUNMP= <proc_1d>
##$AZFE= 0.1
##$AZFW= 0.1
##$BCFW= 0
##$BC_mod= 0
##$BYTORDP= 0
##$COROFFS= 0
##$CY= 12.5
##$DATMOD= 1
##$DC= 0
##$DFILT= <>
##$DTYPP= 0
##$F1P= 14.0000005364418
##$F2P= -0.99999901652339
##$FCOR= 0.5
##$FTSIZE= 32768
##$FT_mod= 6
##$GAMMA= 0
##$GB= 0
##$INTBC= 1
##$INTSCL= 1
##$ISEN= 128
##$LB= 0.3
##$LEV0= 0
##$LPBIN= 0
##$MAXI= 10000
##$MC2= 0
##$MEAN= 0
##$ME_mod= 0
##$MI= 0
##$NCOEF= 0
##$NC_proc= -2
##$NLEV= 6
##$NOISF1= 0
##$NOISF2= 0
##$NSP= 0
##$NTH_PI= 0
##$NZP= 0
##$OFFSET= 16.522
##$PC= 1
##$PHC0= 84.37077
##$PHC1= 8.826881
##$PH_mod= 1
##$PKNL= yes
##$PPARMOD= 0
##$PSCAL= 4
##$PSIGN= 0
##$REVERSE= no
##$SF= 250.13
##$SI= 32768
##$SIGF1= 0
##$SIGF2= 0
##$SINO= 400
##$SIOLD= 32768
##$SREGLST= <1H.CDCl3>
##$SSB= 0
##$STSI= 32768
##$STSR= 0
##$SW_p= 5175.98343685301
##$SYMM= 0
##$S_DEV= 0
##$TDeff= 65536
##$TDoff= 0
##$TI= <Analysis number 999999
Compound Code 99
Book Reference 9
Project Code 9>
##$TILT= no
##$TM1= 0
##$TM2= 0
##$TOPLEV= 0
##$USERP1= <user>
##$USERP2= <user>
##$USERP3= <user>
##$USERP4= <user>
##$USERP5= <user>
##$WDW= 1
##$XDIM= 32768
##$YMAX_p= 300602026
##$YMIN_p= -150749
$$ End of Bruker specific parameters
$$ ---------------------------------
##NTUPLES= NMR SPECTRUM
##VAR_NAME=  FREQUENCY,     SPECTRUM/REAL,   SPECTRUM/IMAG
##SYMBOL=    X,             R,               I
##VAR_TYPE=  INDEPENDENT,   DEPENDENT,       DEPENDENT
##VAR_FORM=  AFFN,          ASDF,            ASDF
##VAR_DIM=   32768,         32768,           32768
##UNITS=     HZ,            ARBITRARY UNITS, ARBITRARY UNITS
##FACTOR=    0.157963299565203, 1,           1
##FIRST=     4132.6476996994, 0,             0
##LAST=      -1043.33573715361, 0,           0
##MIN=       -1043.33573715361, -150749,     0
##MAX=       4132.6476996994, 300602026,     0
$$ Real data points
##PAGE= N=1
##DATA TABLE= (X++(R..R)), XYDATA
$$ [...]
18671A87563J9645L223o696j01M890K399J4352K1123n178j4792N015K2120p707
18658B45856j2404L447K5149o277j2077M371J5454o271m542o649r634J7623L1944
18645B85990m688k4022j6042l039k5749k5861k0j1210o092O515J0280J9759j913
18632B03908j6171j0376O993r805p284o517K1312R049Q816Q982J2532R464r363
18619B21540o409J4648N03Q526K6227l23M891j9141J877M262J4402J5861o344
18606B80520n062k566J0598N215J4356J0808k550k2312j6601j3554j8981j448
18594B38423J588l089M498J5680j1520j7566o995L728J2499Q291J3320Q677N22
18581B68056M065k288J1330K1825J3104K098j234k4473O771J9998P874M172O61
$$ plain form
18671 187563 207208 210431 203735 203634 208524 210923 225275 246398 241220 226428 231443 253563 245856
18658 245856 233452 236899 262048 255771 243694 248065 263519 257248 252706 246057 236423 254046 285990
18645 285990 281302 257280 241238 238199 212450 186589 186569 175359 169267 175782 186062 205821 203908
18632 203908 187737 177361 184354 174549 167265 160748 182060 191109 199925 208907 221439 230903 221540
18619 221540 215131 229779 230282 238808 265035 264712 269603 250462 252339 256601 271003 286864 280520
18606 280520 275458 272892 283490 288705 303061 313869 311319 289007 272406 258852 239871 238423
18594 238423 240011 236922 241420 257100 245580 228014 221019 224747 237246 245537 258857 267534 268056
18581 268056 272121 269833 281163 302988 316092 318190 316956 292483 299254 319252 327126 331298 331959
18568C31959j7P5J2874r226o042J881Q911j0202K22K7261L3276K7397K675J119
18554D22163J4578j1833k5920J0465M9998M4851J061J3241J265Q661J9496K3117
18542E71143N1539R1609J03890J23099J34765J19920R4760K0400P704j4160k7021
18531A277648J1576N8375R4572Q1918J9884l6722n8687j14485j38001j16933o4118
18520A015027n4822l1810k2903l7797n652K414O995J596k433J7476L1441N572
18508I25104J6636J4441K1280Q191K7475L9555K8337L5525L6575L2415M1160Q0094
18496A306788O8337M3187N8853N1523N1893N8235R0929R3195P9810P2936O3468
18485B039154Q7618P2746O8969Q0549J03686J15176J03577J16799J49855J50185
$$ plain form
18568 331959 331942 332017 344891 335665 329623 331504 340415 330213 330435 357696 390972 418369 421044 422163
18554 422163 436741 424908 398988 409453 459451 504302 505363 518604 519869 528530 548026 571143
18542 571143 622682 714291 818181 941280 1076045 1195965 1290725 1311125 1318829 1304669 1277648
18531 1277648 1289224 1347599 1442171 1524089 1543973 1507251 1448564 1334079 1196078 1079145 1015027
18520 1015027 960205 928395 905492 867695 862043 864457 871452 873048 870615 888091 919532 925104
18508 925104 941740 956181 977461 985652 1013127 1052682 1081019 1116544 1153119 1185534 1226694 1306788
18496 1306788 1375125 1418312 1477165 1528688 1580581 1638816 1729745 1822940 1902750 1975686 2039154
18485 2039154 2126772 2199518 2268487 2349036 2452722 2567898 2671475 2788274 2938129 3088314
18475C088314J63071K12578K23331K49414K98236L22139L63888M25595M89854
18466E836420N99126P05231Q29271R94766J202506J409014J714872K030133K361402
18457A7682741K702778K907549K975086K929796K709978K409432K104586J820747
18449C8242693J635794J484477J281896R71665N14913j42159r05400j685366k366137
18440C9032376k863948l139491l181172l049826k791696k479942k155175j834592
18432A7536534j598222j375300j147852r76905q09449o58399n18463l93784l07388
18423I750772k28267j27474L933J49401L20678N34027Q91721J357888J982688
18414A4635367K968297M456770O336448Q196578R210575Q438723O149239K483456
$$ plain form
18475 3088314 3251385 3463963 3687294 3936708 4234944 4557083 4920971 5346566 5836420
18466 5836420 6435546 7140777 7970048 8964814 10167320 11576334 13291206 15321339 17682741
18457 17682741 20385519 23293068 26268154 29197950 31907928 34317360 36421946 38242693
18449 38242693 39878487 41362964 42644860 43616525 44131438 43989279 43083879 41398513 39032376
18440 39032376 36168428 33028937 29847765 26797939 24006243 21526301 19371126 17536534
18432 17536534 15938312 14563012 13415160 12438255 11628806 10970407 10451944 10058160 9750772
18423 9750772 9522505 9395031 9398964 9548365 9869043 10403070 11294791 12652679 14635367
18414 14635367 17603664 22060434 28396882 36593460 45804035 54242758 60391997 62875453
18406F2875453p93026k815236l024235j829495j81073O41279L08975j267760l398962
18397E0515920n104224o062923o046913n439542m612328l778376l039141k371815
18389A4060658j856979j470346j186660r46431p76230o57845n70955n03537m25871
18380E665804l86062l32294l13961k85023k52776k57111k76803k32707k18977
18371C110090j84323j94664k06573j80825j56011j50304j30311j23752j14609
18362A668718j04722q7894r0031p0119o6284r0057o1117l9622l2672k5522l0552
18351I70126m8226n2190n2057o0525m5484j8907n320J6246k1727l2366m3508k3737
18339E82325k1999j6586k0431j5467l937j7353j6958j7272l35l7058k7989N450
$$ plain form
18406 62875453 62082427 59267191 56242956 54413461 54232388 54873667 55182642 53914882 50515920
18397 50515920 45411696 39348773 33301860 27862318 23249990 19471614 16432473 14060658
18389 14060658 12203679 10733333 9546673 8600242 7824012 7166167 6595212 6091675 5665804
18380 5665804 5279742 4947448 4633487 4348464 4095688 3838577 3561774 3329067 3110090
18371 3110090 2925767 2731103 2524530 2343705 2187694 2037390 1907079 1783327 1668718
18362 1668718 1563996 1476102 1386071 1315952 1249668 1159611 1098494 1058872 1026200 1000678 970126
18351 970126 921900 869710 817653 757128 711644 692737 687417 703663 681936 649570 606062 582325
18339 582325 560326 543740 523309 507842 503905 486552 469594 452322 451987 414929 386940 392390
18327C92390J1749j4290j8083j4418o881K626j486m169N362O981J031r340j8197
18314C33275m664m872l762K075J6180J0100m2573k6044N656p508P338J8263K146
18301C05610M063M33J4117J0739J4191K7571K5176K2683L2243O4717P6624O2524
18289F60691N0527N3904L2184K9526K2839J6589j5316l1740K370K132o0l2246
18277G91400j2785k1574n1953n1986n3269o2021n5348l0139l4324m1790k8847
18266C47364k3754k5464J200n659k1062Q131j5569j7061q652k6182k0243J413
18254A94462K270m288Q566o836k2607K569k269k6112j6307l868J1228J0936L591
18241A51335P87M162M091j3453j5662j2483K988K1016J9064o715j5445j747l823
$$ plain form
18327 392390 404139 389849 371766 357348 350467 353093 351607 347438 352800 359781 360812 351472 333275
18314 333275 328611 323739 319977 322052 338232 348332 305759 279715 285371 277863 285201 303464 305610
18301 305610 309673 310106 324223 334962 349153 376724 401900 424583 456826 521543 598167 660691
18289 660691 711218 765122 797306 826832 849671 866260 850944 819204 821574 823706 823646 791400
18277 791400 778615 757041 705088 653102 599833 537812 482464 452325 418001 376211 347364
18266 347364 323610 298146 299346 293687 272625 280756 265187 248126 239474 213292 193049 194462
18254 194462 196732 192444 201010 194174 171567 174136 171867 145755 129448 125580 136808 147744 151335
18241 151335 152122 156284 160375 146922 131260 118777 121765 142781 161845 155130 139685 137938 134115
18228A34115J9464L4896R63j3639O76M059J8885j4127M394J6668j3841j6731k5633
18215A50149l9079k9110l692l601J476Q888K47k8622R604o314q143k5324J92O483
18201C3154k8422L534P356L235j7281M583P626J7030M697K906j3591k6135O83
18188f25J8938J01K09P815Q471Q183J4485m171K143j537j0279J2160K0282k731
18174G3444l4836j5627K513J4615J7167J331j2118n244P739N698R672N756l837
18161F6273L29J0167J4633K1734K4734K0481q040q870r074k696m226P720L4336
18148A67501J7158o086k4338M951J3083j3545j3052l886J1695J1395K2763J2441
18136B00080J7675J3388J8336J84k399K3926M5237L0182L6443L5454J6211R055
$$ plain form
18228 134115 153579 188475 189438 175799 176475 180534 199419 185292 189686 206354 192513 175782 150149
18215 150149 111070 81960 78268 74667 76143 85031 85278 56656 66260 59946 51803 26479 26671 33154
18201 33154 4732 8266 15622 18857 1576 6159 13785 30815 35512 38418 24827 -1308 -625
18188 -625 18313 18414 18623 26438 34909 43092 57577 53406 55549 54012 43733 55893 76175 73444
18174 73444 38608 22981 25494 40109 57276 58607 46489 41245 48984 54682 64354 70110 66273
18161 66273 66602 76769 91402 113136 137870 158351 150311 141441 132367 129671 125445 133165 167501
18148 167501 184659 178573 154235 159186 172269 158724 145672 141786 153481 164876 187639 200080
18136 200080 217755 231143 249479 249663 247264 271190 316427 346609 383052 418506 434717 443772
18124D43772M8238N3463N7527O4409Q3729R1973Q7582J49284J88103K38928L37081
18113A844089M71183O31537R17116J447901K434100M397250P250391O688347K415742
18104B8497656j430665m745069m881491l532129k917627k507319j829835j290937
18096E362584r60614p15019n54295m28096l47643k64979k13165k09148j75296
18087A494329j41059j22537j01032q2806o8329r6437n8885o6976n3004l2190l4040
18076F37034o5351m8934l1157m6698r710j6652k6803l8674m3917l9882k5829k3735
18064B19692k1673P506J2906j8679l4270j4246o97k423n830p211M29q342L113
18051A30275j2931m327M218k664j6266k667J585m0P370J3644J9709M921k0212
$$ plain form
18124 443772 492010 545473 603000 667409 751138 843111 930693 1079977 1268080 1507008 1844089
18113 1844089 2315272 2946809 3863925 5311826 7745926 12143176 19393567 26081914 28497656
18104 28497656 27066991 22321922 17440431 13908302 10990675 8483356 6653521 5362584
18096 5362584 4401970 3686951 3132656 2704560 2356917 2091938 1878773 1669625 1494329
18087 1494329 1353270 1230733 1129701 1046895 978566 882129 823244 756268 703264 671074 637034
18076 637034 571683 522749 491592 444894 435184 418532 391729 353055 309138 269256 243427 219692
18064 219692 198019 205525 218431 199752 165482 151236 150539 148116 142286 135075 135504 127162 130275
18051 130275 117344 113017 117235 114571 98305 95638 97223 97183 104553 118197 137906 142827 122615
18038A22615k683P403K4613k5409j9076M03L1184j1462j8593k3061k9915k0976
18026C5043J1208q99L002P481l188j3858j9852r787J7527m135m420k9093o060
18013a7031K9920K8735P038o070J517q871N38l8922k7032N409R63O326J7463K3980
17999B3963Q013J975j9460j4551J516J3087j3365J7422J8937j3745k1730q512
17987f450N806j078p277L643P249n233K3096J2963J1037J8727p659J6968J8933
17974I0725O520k3865k164o605j5805p959R607k162j0264k1575j1850M324n739
17961C188j8840p389L2010P002L161q148o274Q210k6873j8795J3404J2010j62
17948g496M888l149n45p888j2657r77Q566M202Q369p691M276K4750J5388j0141
$$ plain form
18038 122615 119932 127335 151948 126539 107463 107866 139050 127588 108995 85934 56019 35043
18026 35043 46251 45352 48354 55835 52647 38789 18937 9150 26677 22542 18122 -10971 -17031
18013 -17031 12889 41624 48662 42592 44109 35238 35776 -3146 -30178 -24769 -23806 -17480 -17 23963
17999 23963 31976 33951 14491 -60 1456 14543 1178 18600 37537 23792 2062 -6450
17987 -6450 -644 -1722 -8999 -5356 1893 -3340 19756 32719 43756 62483 54824 71792 90725
17974 90725 97245 73380 71216 64611 48806 40847 50454 48292 38028 16453 4603 8927 3188
17961 3188 -15652 -23041 8969 15971 19132 10984 4710 12920 -13953 -32748 -19344 -7334 -7496
17948 -7496 -2608 -5757 -6302 -14190 -26847 -27824 -19258 -15056 -6687 -14378 -10102 14648 30036 19895
17934A9895j2853j788O186Q054J4814M633j3899R885j0546r602R328j2046K878
17921A4939m474J3992J4212J6510p72j1608j205N451q949j3828p465j3190j4089
17908a0476j5065R060J353j108J9175J7882j6618Q573J8154k2763j3931q364N98
17895a3530K032j8185J9239J1596r644Q459K979k912k0343j8844o660N571J648
17882c8594O97M751j8362M969J5927q306K837L2643P249j3674l857M347j095j747
17868a2215j6481K292J8096j5955l211n98l90K8959K1486k710m13L57l315n510
17854A0392n928m091R799l17L181R458K333L646j1414j5133j7243j0545L3844
17841G982L761m08M344p439n581n613l305J0709Q876J8110O789J632j3926l0139
$$ plain form
17934 19895 7042 5254 11440 19494 34308 38941 25042 34927 24381 14779 24107 12061 14939
17921 14939 10465 24457 38669 55179 54407 42799 41594 47045 38096 24268 16803 3613 -10476
17908 -10476 -25541 -16481 -15128 -16236 2939 20821 4203 12776 30930 8167 -5764 -14128 -13530
17895 -13530 -11498 -29683 -10444 1152 -8492 -33 2946 34 -20309 -39153 -45813 -40242 -38594
17882 -38594 -37897 -33146 -51508 -46539 -30612 -38918 -36081 -3438 3811 -9863 -13720 -9373 -10468 -12215
17868 -12215 -28696 -26404 -8308 -24263 -27474 -28072 -28462 497 21983 19273 18860 19217 15902 10392
17854 10392 4464 373 10172 9855 13036 22494 24827 28473 17059 1926 -15317 -25862 7982
17841 7982 11743 11335 15679 8240 2659 -2954 -6259 4450 13326 31436 38225 39857 25931 -4208
17827d208j7171J136l658k915j1202J4325p911m528J5692K7606k71j3374K524
17814c955P87J8613K5310M095l564k074j1315J9928R997k8423k6796j4985R154
17801c228j132R165K2049L337j6373K0299L8800M1689J5979L9520M5973M1840
17789B57918L9925K4839J5594j44O686K7850L7064K9766K4605J8967M675K503
17777D90248j7048m0219k4483l7083n1125o504j5731k9147Q690j4244m3319n7026
17765A63009M40K1418k9773l7141r810J62k679K745J0109j1389j7386l1632k0007
17752C8066J0021J1341l559l736k1707l985k1511P375J2194j804K7359J5349k2554
17739D2849m633K3989j4427j3714M405O01j7018j2841N678r694J194r83r046r059
$$ plain form
17827 -4208 -21379 -20243 -23901 -26816 -38018 -23693 -31604 -36132 -20440 7166 6895 -6479 -3955
17814 -3955 -3168 15445 40755 44850 41286 39212 27897 47825 57822 29399 2603 -12382 -3228
17801 -3228 -4360 4805 26854 30191 13818 34117 72917 114606 130585 170105 216078 257918
17789 257918 297843 322682 338276 338132 344818 372668 409732 439498 464103 483070 487745 490248
17777 490248 473200 432981 408498 371415 320290 313786 298055 268908 277598 263354 220035 163009
17765 163009 163449 184867 155094 117953 108143 108305 105626 108371 118480 107091 89705 58073 38066
17752 38066 48087 59428 55869 52133 30426 26441 4930 12305 24499 22695 50054 65403 42849
17739 42849 38216 62205 47778 34064 38469 39070 22052 9211 14889 5195 6389 5406 -3640 -12699
17725a2699J8783K1248J6747J7070j5906k3860j4269o453J6528l553r26M234J4740
17712C1684J0139J4683j6160k8967j8018J7397K932j6055j0745K847J8964L5443
17700D4144R667l8279j6370j8109o123L453N43m480N074M423R487K617O072K9053
17686C1172P239j8656j207J2485J063l010j1067j630j1651k629J7587Q413J8043
17673D6152J0411j2983j9601j6118o386q558K8428J3076m4570k1679J7817J1002
17661c009l486j5854O177R099O665P065J0053P612j0451j8181N428q487q552K8184
17647A2263O731J175l023k3554M629P037j685J956L254o699M225J7745n242N851
17633B4663Q74j7635k645N028m930j0456q49J1517L0783m673k2819j0604K217
$$ plain form
17725 -12699 6084 27332 44079 61149 45243 21383 7114 661 17189 13636 12710 16944 31684
17712 31684 41823 56506 40346 11379 -6639 10758 13690 -2365 -13110 -10263 8701 44144
17700 44144 53811 15532 -838 -18947 -25070 -21617 -21074 -25554 -20480 -16057 -6570 -3953 2119 31172
17686 31172 38411 19755 18548 31033 32096 29086 18019 16389 4738 2109 19696 28109 46152
17673 46152 56563 43580 23979 7861 1475 -7083 21345 34421 -10149 -31828 -14011 -3009
17661 -3009 -6495 -22349 -16172 -7073 -408 6657 16710 24322 13871 -4310 1118 -7369 -15921 12263
17647 12263 18994 20169 17146 -6408 -1779 5258 3573 5529 8783 2084 6309 24054 18812 24663
17633 24663 25537 7902 5257 10285 5355 -5101 -5950 5567 36350 31677 8858 -1746 471
17620D71J7751J2665J456L543M015J946O565k901j046m220j4125p095m658l87
17606A3980Q239N68M421P010l461O802k3934j5496J3226j679L611K0307J9621
17593E3215P725P240j1611L080j235M796O005o476j071r076k3583j0652n646K1623
17579C4334n288j345K770q030M846L708P582N572j0424P477K1578j0615Q41N658
17565E8664k0456o262o163Q643M309Q78K2457J0209o659j3392n331Q178l295M387
17551E6167L2392o264M453j2291j8414j1976o142k0099L977K0763J39n001K1231
17538E8935j0043j3303Q316K59K1383j497n110K1153J3177j7914K649J0847j785
17525H7067N55l242j3017k06j1181P665r132k7700k035J2003J2054l895q200j2218
$$ plain form
17620 471 18222 30887 32343 35886 39901 41847 48412 45511 44465 40245 26120 19025 14367 13980
17606 13980 22219 22787 27208 34218 30757 37559 13625 -1871 11355 9676 13287 33594 53215
17593 53215 60940 68180 56569 59649 58414 63210 69215 62739 61668 52592 29009 18357 12711 34334
17579 34334 29046 27701 30471 22441 27287 30995 38577 44149 33725 41202 62780 52165 53006 58664
17565 58664 38208 31946 25783 34426 38735 39613 62070 72279 65620 52228 46897 55075 51780 56167
17551 56167 88559 82295 86748 74457 56043 44067 37925 17826 21803 42566 42705 37704 58935
17538 58935 48892 35589 43905 44164 65547 64050 58940 80093 93270 75356 78005 88852 87067
17525 87067 87622 84380 71363 71157 59976 67641 58509 30809 28774 40777 52831 48936 40736 28518
17511B8518o292M087K2792K0523R002j3785j719M484l1746n490J4324k4204j3270
17498G224J6624K1592k88j705j0153n266J1638Q755j2011j6800J3784R164O518
17485D9076M31O184J59M180j0185N70O469N104k953o299j2857O162R269M454L757
17470F3521J0407M603p221l1391j9392l177j3077k2424m109J9133n564P800J7245
17457A6354n674j4608K628m39K470J6374J8726J9353O965J7958m95k8417j9777
17444C1418J2198J2005L6347J3969K5886K7186l481j1780l3329l1447j0411k1794
17432D6767j7035R464j4633j8649Q780J8473L68j1105j5627o284O390J0361j0955
17419F315L539o852M537M747r904l2038j3056K3527K0706K0741K755Q0n450l676
$$ plain form
17511 28518 22226 26313 49105 69628 78630 64845 63126 67610 35864 30374 44698 20494 7224
17498 7224 23848 45440 45152 43447 33294 28028 39666 48421 36410 19610 33394 42558 49076
17485 49076 49507 55691 55850 60030 49845 50415 56884 61988 59035 52736 39879 46041 55310 59764 63521
17470 63521 73928 78531 71310 39919 20527 17350 4273 -18151 -22260 -3127 -8691 -891 16354
17457 16354 10680 -3928 -1300 -1739 731 17105 35831 55184 62149 80107 79612 51195 31418
17444 31418 43616 55621 91968 105937 131823 159009 155528 143748 110419 78972 68561 46767
17432 46767 29732 39196 24563 5914 14694 33167 33535 22430 6803 519 6909 17270 6315
17419 6315 9854 3002 7539 12286 2382 -29656 -42712 -19185 1521 22262 25017 25097 19647 15971
17405A5971L379L026P420r528j4217Q940K670r598k122J1788J0943K114j3069
17392A7717M159j6033j1239m990j272J053R602J5693k1634Q29K1944P288R991
17379C3108K334j9389j395j1891k802m690o865m01P777K4838o26M570O095j0335
17365B0328m289q341q012j3401J0249P699J550j1468J093p199j1100J0748p448
17352a9591M233o748M927j8614j5613J2218J3283J628L550m497J2299M311j5357
17339b3971j2391M948O813j3565N261K4404o466K2105J640j3212J2666J3418j3861
17326G789r255k5272K662M489N524j2748K679J0458P642l695J3514O492N525J2160
17312B7964j8110j1572k3156l671M106L230j1776q81K946J1648L341r251Q486
$$ plain form
17405 15971 19350 22376 29796 20268 6051 14991 17661 8063 5941 17729 28672 30786 17717
17392 17717 21876 5843 -5396 -10386 -11658 -10605 -1003 14690 -6944 -6115 15829 23117 33108
17379 33108 35442 16053 14658 2767 -35 -4725 -11590 -11991 -4214 20624 19998 24568 30663 20328
17365 20328 16039 7698 -314 -13715 -3466 4233 5783 -5685 -4592 -11791 -22891 -12143 -19591
17352 -19591 -15358 -22106 -17179 -35793 -51406 -39188 -25905 -24277 -20727 -25224 -12925 -8614 -23971
17339 -23971 -36362 -31414 -24601 -38166 -32905 -8501 -14967 7138 8778 -4434 8232 21650 7789
17326 7789 -1466 -26738 -24076 -19587 -14063 -26811 -24132 -13674 -6032 -9727 3787 10279 15804 27964
17312 27964 9854 -1718 -24874 -28545 -24439 -21209 -32985 -33866 -30920 -19272 -15931 -25182 -16696
17299a6696O57j669Q169J7066j6141j1447n89p831P396N87Q084M996j2818J3712
17285f524J1021j8875m605J0821K837j0706K979k003J1987J1941o411j5448n824
17272a8810L214N432Q225J926l707j6042k7085q849J1700J8919l301j0822O495
17259c2705K3605J8100p195j5790K88J3410M118m436j4094j301j9306J7129J3829
17246d348J92m378j6681k088J9623j2641j0928O426J0683j5717l625l520l482
17233d0484M337O976n392M806M479l805j8933j735l265m667J1050k4055L52K6691
17219d3645J3737o322J519K1653K0846j1095k0638K950j1361J610l214J3177K2098
17206A315N910R10r6P242l47j1640k4410j8948p522P505L0502K3274N168M714
$$ plain form
17299 -16696 -16039 -17708 -9539 7527 -8614 -20061 -20650 -28481 -21085 -20498 -12414 -7418 -20236 -6524
17285 -6524 4497 -14378 -18983 -8162 -5325 -16031 -13052 -15055 -3068 8873 2462 -12986 -18810
17272 -18810 -15596 -10164 -1939 -13 -3720 -19762 -46847 -55696 -43996 -25077 -28378 -39200 -32705
17259 -32705 -9100 9000 1805 -13985 -13697 -287 3831 -605 -14699 -16000 -35306 -18177 -4348
17246 -4348 -4156 -8534 -25215 -27303 -7680 -20321 -31249 -24823 -14140 -29857 -33482 -37002 -40484
17233 -40484 -36147 -29171 -34563 -29757 -25278 -29083 -48016 -49751 -53016 -57683 -46633 -70688 -70336 -43645
17219 -43645 -29908 -36230 -34711 -13058 7788 -3307 -23945 -20995 -32356 -30746 -33960 -20783 1315
17206 1315 7225 8135 8039 15281 14934 3294 -21116 -40064 -47586 -40081 -9579 13695 18863 23577
17192B3577o818k8773k9710k1663l877J4141K3944P945K3495J0133m459j4895
17180f960j3920J3546j3326k6756J805L3704J8142k0480j6941Q675J0926r498
17168b1083l176P968j0080K110k398q5K8643j1201k796j4236r109M811J2655J3653
17154d324J3291k150k437O742j7325k0794J4564J4638K5278J7176j4421j9588
17142A0650M96j740j6162N820q245q479j7464O241P879J838J0133j0631J7591
17129b073J1386j1599p902J6842K1843p526k6834j4561j131O663J614n686K132
17116a6832k532k8322J9132J0134n06l223K0672J1758L464K219k1832q266J976
17103a2158p353m837O786K379n546l693j850q848k35r853J0468K5852K0705j42
$$ plain form
17192 23577 16759 -12014 -41724 -63387 -67264 -53123 -29179 -21234 2261 12394 7935 -6960
17180 -6960 -20880 -7334 -20660 -47416 -45611 -11907 6235 -14245 -31186 -22511 -11585 -21083
17168 -21083 -24259 -16291 -26371 -24261 -26659 -26744 1899 -9302 -12098 -26334 -35443 -30632 -17977 -4324
17154 -4324 8967 6817 4380 11122 -6203 -26997 -12433 2205 27483 44659 30238 10650
17142 10650 11146 9406 -6756 -936 -9181 -17660 -35124 -28883 -21004 -19166 -9033 -19664 -2073
17129 -2073 9313 -2286 -10188 6654 28497 20971 -5863 -20424 -21555 -14892 -13278 -18964 -16832
17116 -16832 -19364 -47686 -28554 -18420 -18926 -22149 -1477 10281 13745 15964 -5868 -14134 -12158
17103 -12158 -19511 -24348 -17562 -15183 -20729 -24422 -26272 -35120 -35355 -45208 -34740 -8888 11817 11675
17089A1675m838J399J0606j3190k047K6197j0026k3436L993L707J8236L00p931
17076A4645j2696J3673J1080j0986L109M251P851L157l859j2092l2730n506J2028
17063h075n6R632J1393j1460J9765J0360K289j118P47k0525j0378m687Q669q011
17049a455k3158j8919J4501k853r61J5481j0037j78J4055l8715k644R461O072
17036c9350J9593K3378j8387r817j2547P555J2785k723j3825M376J0567k429J805
17023a9019K1385P026J689j820j0702k1034j2606K787n289N207J1200P239J953
17010a1984J3114K762n553L360j516k689P037L162J3931j9396j7675J884J2972
16997e91O823q333k5388p720L875n330P474M191Q838j0328j8057J1133L3963K6143
$$ plain form
17089 11675 6837 8236 18842 5652 3605 29802 19776 -3660 333 4040 22276 22576 14645
17076 14645 1949 15622 26702 15716 18825 23076 30927 34084 30225 18133 -14597 -20103 -8075
17063 -8075 -8131 1501 12894 1434 21199 31559 33848 32730 33477 12952 2574 -2113 6556 -1455
17049 -1455 -24613 -43532 -29031 -31884 -32845 -17364 -27401 -27579 -13524 -52239 -54883 -45422 -39350
17036 -39350 -19757 3621 -14766 -24583 -37130 -29575 -16790 -19513 -33338 -28962 -18395 -20824 -19019
17023 -19019 2366 9392 11081 9261 -1441 -22475 -35081 -32294 -37583 -32376 -21176 -13937 -11984
17010 -11984 1130 3892 -1661 1699 183 -2506 4531 7693 21624 2228 -15447 -13563 -591
16997 -591 6232 -2101 -27489 -35209 -31334 -36664 -29190 -24999 -16161 -26489 -44546 -33413 550 26693
16983B6693P235j2835Q07j2129K842j1721j2799m937K077j5427l0255j1368R512
16970f2305Q697R272K1457K223R573Q731N649P4k7782J3160J643J2178k0543O666
16956a1307Q108k0209o89J317J2400m956p504J8819R380L658P207k0491j2833
16943a7100l090J9022J4471k1858p280J4537k905L993J5666m844j6162r83k1038
16930b7571l643K604j0852l209q616l1268J2522K4355J9398J4703Q425q161M146
16917g167J73p247r556N69J5531M867R219J270q567M647L305J79j7953o631k292
16902a9653k1327j3454k498J6393K9908J1419L828l623Q06j2811L17R156j7783
16889a9322R69K0707J6099q217k3715q090J3500O713K970o972q110q531k8903
$$ plain form
16983 26693 33928 21093 21900 9771 12613 892 -11907 -16844 -14767 -30194 -60449 -71817 -62305
16970 -62305 -53608 -44336 -22879 -20656 -11083 -2352 3297 3371 -24411 -11251 -9608 2570 -17973 -11307
16956 -11307 -3199 -23408 -24097 -22780 -10380 -15336 -22840 -4021 5359 9017 16224 -4267 -17100
16943 -17100 -20190 -1168 13303 -8555 -15835 -1298 -4203 -210 15456 10612 -5550 -6533 -27571
16930 -27571 -31214 -28610 -39462 -42671 -51287 -82555 -70033 -45678 -26280 -11577 -3152 -11313 -7167
16917 -7167 -6994 -14241 -23797 -23228 -7697 -2830 6389 7659 -908 3739 7044 7223 -10730 -17361 -19653
16902 -19653 -40980 -54434 -56932 -40539 -10631 788 4616 993 1799 -11012 -10695 -1539 -19322
16889 -19322 -18353 2354 18453 10236 -13479 -21569 -8069 -1356 1614 -5358 -13468 -21999 -50902
16876e0902K000L725p145K7303l130K830Q110j8178j0790P454L713J2547j1201
16863c3664r49k295j2816K1281J7310l406L0371J1832M568j561l0581l1689M710
16850b6889L453m523J2636N049p250k22j4443J3202j112q822j4781J3921M520
16837b5261q213J342l676J5119J2832R344n271j1502J1634P40j0903k9924o87
16824d4426P896L707J1662p29k2312q129K6378O621J700J5758r594j4028L741
16811b1755Q955n826k31K707Q283j9328j3099R367P059j588O126R753l75Q150
16797a802j5123j2840j589K1431p636n411l46K5672J3308k2811n632J6776J1515
16784A5512Q038J4554k4645j8464O73M988K649n029n01p440J1777J717l8143j0353
$$ plain form
16876 -50902 -48902 -45177 -52322 -25019 -28149 -25319 -17209 -35387 -46177 -38723 -35010 -22463 -33664
16863 -33664 -34613 -36908 -49724 -28443 -11133 -14539 15832 27664 32232 30671 90 -31599 -26889
16850 -26889 -23436 -27959 -15323 -10274 -17524 -17746 -32189 -18987 -20099 -28921 -43702 -29781 -25261
16837 -25261 -33474 -32132 -35808 -20689 -7857 1487 -3784 -15286 -3652 -2912 -13815 -43739 -44426
16824 -44426 -36530 -32823 -21161 -21890 -44202 -52331 -25953 -19332 -17632 -1874 -11468 -25496 -21755
16811 -21755 -12800 -18626 -18857 -16150 -7867 -27195 -40294 -30927 -23868 -25456 -19330 -9577 -9952 -1802
16797 -1802 -16925 -29765 -31354 -9923 -17559 -22970 -23316 2356 15664 -7147 -12779 3997 15512
16784 15512 23550 38104 13459 -5005 -4332 656 3305 -1724 -2225 -9665 2112 3829 -34314 -44667
16770d4667J2590O241j592J0281J8594P819j4689r984l601P06n00r355L605j5371
16756c9923O036M968Q189l806K1375M398k671J230N872J974m05J163k4327p010
16742b2937O515R213Q87J1163Q967k5518k1212j8254K5328Q208j7860k105j492
16729c9097P937K1190K0802k68M035k696k3601j5236O727J6182j1815k2330J1649
16716b6521p055q861N615J0385K6100J7596M382p927k1462l0787N231m772n290
16703d3366J8167J9304K5792J2498j8775j7638j5576J2208J2787P734j5806r220
16691a1891J0492j651n743q514Q144J2431o787p048j0026j0845l616R880R573
16678a5601J2310N980N845K3499Q717k2048j5419o913k1608n125J2985J1153l256
$$ plain form
16770 -44667 -32077 -25836 -27428 -17147 1447 9266 -5423 -15407 -19008 -18302 -18802 -28157 -24552 -39923
16756 -39923 -33887 -28919 -20730 -24536 -3161 1237 -1434 -204 5668 7642 7237 8400 -15927 -22937
16742 -22937 -16422 -7209 -6322 4841 13808 -11710 -32922 -51176 -25848 -17640 -35500 -37605 -39097
16729 -39097 -31160 -9970 10832 10564 14599 11903 -11698 -26934 -20207 -4025 -15840 -38170 -26521
16716 -26521 -33576 -42437 -36822 -26437 -337 17259 21641 13714 -7748 -38535 -33304 -38076 -43366
16703 -43366 -25199 -5895 19897 32395 13620 -4018 -19594 -7386 5401 13135 -2671 -11891
16691 -11891 -1399 -3050 -8793 -17307 -9163 3268 -3519 -10567 -20593 -31438 -35054 -25174 -15601
16678 -15601 -3291 2689 8534 32033 40750 18702 3283 -3630 -25238 -30363 -17378 -6225 -9481
16665i481J4070N188q655J3843k3910k1480P945j153J1554M537K484r235k2520
16652c6813j122J9975P962k946O470J208N346L247j4843o714M690n197l469P446
16638a4760j0596j2394j2691R68N138J6532J821N466R336J9720p4j0030L095p231
16624e700N561N706M461J9607o49k195k3500k5569m481j0614j390J2004r443k7271
16610f3473J579J3K8209J5784O78k84j6594j0754K0590L3559j9211p591j9279
16597c6774j1519N900K1142P166L554J4179L526j2997K7037q165l402n889k863
16584H95K90j5352q883o869j0930j2252n452J7047J9516k699P65J142q263j3430
16570d4475J5332N852R707Q557j3878l160N525R316q472n497l247K721p611j7858
$$ plain form
16665 -9481 4589 9777 1122 14965 -8945 -30425 -22480 -23633 -12079 -7542 -5058 -14293 -36813
16652 -36813 -37935 -17960 -9998 -12944 -6474 -5266 80 3327 -11516 -18230 -13540 -18737 -22206 -14760
16638 -14760 -25356 -37750 -50441 -49473 -44335 -27803 -25982 -20516 -11180 8540 8466 -1564 1531 -5700
16624 -5700 -139 5567 10028 29635 28986 26791 3291 -22278 -26759 -37373 -38763 -26759 -36202 -63473
16610 -63473 -61894 -61881 -33672 -17888 -17210 -17494 -34088 -44842 -24252 9307 -9904 -17495 -36774
16597 -36774 -48293 -42393 -21251 -14085 -10531 3648 7174 -5823 21214 13049 9647 3758 895
16584 895 1185 -14167 -23050 -29919 -40849 -53101 -58553 -41506 -21990 -24689 -23924 -22782 -31045 -44475
16570 -44475 -29143 -23291 -13584 -5027 -18905 -22065 -16540 -7224 -15696 -21193 -24440 -21719 -29330 -47188
16556d7188K673R765O199m072o022L815N937N091l390o834J9053J4103j8199j5859
16542c4928J4475J0421r562O300O758l888O676n78k22j8038k562J1478J2393m705
16528e982J2652L7965l264j2889J08K293j6663j7342L522N312j772j9449n121
16515b0630j479N330P93k5235j3093M243R084p38N687J6437L0434N817J1102N462
16501C3214J3426O808j4074j3780J799m558j8456O729J052J23j6338P187j3879
16488a0747p281L5080K658k1787J4424j8969j6129j766K1886K3446k5655k486
16476g326J174l978p153p619Q492r854o051M072r352M924M31J330K8082J794p816
16461h850k927l096l310q80j1498O19l407M479K1637J2047j3784O896R900j3662
$$ plain form
16556 -47188 -44515 -34750 -28551 -32623 -38645 -34830 -28893 -23802 -27192 -34026 -14973 -870 -19069 -34928
16542 -34928 -20453 -10032 -19594 -13294 -6536 -10424 -3748 -4326 -4548 -22586 -25148 -13670 -1277 -5982
16528 -5982 6670 44635 41371 28482 28590 30883 14220 -3122 400 5712 3940 -15509 -20630
16515 -20630 -22109 -16779 -15986 -41221 -54314 -50071 -40987 -41725 -36038 -19601 10833 16650 27752 33214
16501 33214 46640 53448 39374 25594 27393 22835 4379 11108 12160 12283 -4055 3132 -10747
16488 -10747 -18028 17052 19710 -2077 12347 -6622 -22751 -24517 -2631 20815 -4840 -7326
16476 -7326 -6152 -10130 -17283 -24902 -16410 -26264 -32315 -28243 -37595 -32671 -32240 -30910 -2828 -1034 -8850
16461 -8850 -11777 -14873 -18183 -19063 -30561 -29942 -33349 -28870 -7233 4814 -8970 -2074 7826 -5836
16447e836o425j4995O496J5286l295q524J110M327n35m492n376q98J7784m524
16433i897K539L064K6329J0452J31k2299r799J9384l001k1309j5897J1086o515
16420a5732j1048K6101J0050Q900j059k982r547L135p364M090l028K4356J6657
16407D2529k1723k9189o607q324m531J7238J2001P754L133p430p745J1570R081
16394A7757j837l0152k285M726j0375m780j5889J0933J792M86R704J6608J286
16381b026k3185j6006p336J0648J5526J0342J0920o705N454k327j2120o838r68
16368b4621p003N568R125j3533m845o684R92P811l876j461j3314r03L1907N036
16354a5801K571K018J5215K1305r166Q919P08r562k6297L278K2265m005j1545
$$ plain form
16447 -5836 -12261 -27256 -20760 -5474 -8769 -17293 -16183 -11856 -12391 -16883 -22259 -23157 -5373 -9897
16433 -9897 -7358 -4294 22035 32487 32618 10319 520 19904 16903 -4406 -20303 -9217 -15732
16420 -15732 -26780 -679 9371 18271 17212 14230 4683 7818 454 4544 1516 25872 42529
16407 42529 20806 -8383 -14990 -23314 -27845 -10607 1394 9148 12281 4851 -2894 8676 17757
16394 17757 15920 -14232 -16517 -11791 -22166 -26946 -42835 -31902 -30110 -29624 -19920 -3312 -2026
16381 -2026 -25211 -41217 -48553 -37905 -22379 -12037 -1117 -7822 -2368 -4695 -16815 -23653 -24621
16368 -24621 -31624 -26056 -16931 -30464 -35309 -41993 -41001 -33190 -37066 -38527 -51841 -52744 -20837 -15801
16354 -15801 -13230 -11212 4003 25308 16142 25061 25769 16207 -10090 -6812 15453 11448 -97
16341i7K2763p363k7046R46j3454l287l315j0985J8516K0564R048k284p36J9648
16327B2918k797j5021j9412q214j0982R050J8133k460K418J8512j2950k1507l099
16314b5411J6626K3990r086j1212j4r619M366q315J5262J0476M069N823j6059
16301H96o917o875L701J4259r096J0387J2109J893j5662j7970r719n213n876K1820
16287a2263J3111n209J546P338O849j742j2198R974J172j3904N81n894L809J0573
16273C743R178K6170M328l2549l7314Q036l705L971r489l122r397O638j372Q465
16259b6419J8661J0275L36p972l5995J0002L6560k80k3051j0341N775L0153J8564
16246B6268P508k1837n687J4899J5523p861q862M921j0080j9645j7365J3707r81
$$ plain form
16341 -97 22666 15303 -11743 -10797 -24251 -27538 -30853 -41838 -23322 -2758 6290 4006 3270 22918
16327 22918 20121 5100 -14312 -22526 -33508 -24458 -6325 -8785 -6367 12145 -805 -22312 -25411
16314 -25411 -8785 15205 6119 -5093 -5107 -14726 -10360 -18675 -3413 7063 11132 16955 896
16301 896 -6021 -12896 -9195 5064 -4032 6355 18464 20357 4695 -13275 -22994 -28207 -34083 -12263
16287 -12263 848 -4361 -2815 4523 11372 9630 -2568 7406 8578 -5326 -4745 -10639 -6830 3743
16273 3743 12921 39091 43419 10870 -26444 -18408 -22113 -18142 -27631 -30753 -40150 -33512 -34884 -26419
16259 -26419 -7758 2517 2853 -5119 -41114 -31112 5448 5168 -17883 -28224 -22449 7704 26268
16246 26268 33776 11939 6252 21151 36674 28813 19951 24872 14792 -4853 -22218 -8511 -9492
16233i492Q306m446n598O127R354R372q026j5981k8860J5744Q880O515J8016k7004
16219a7093j9170j3075J6706K2982K454k1587l024Q70L817l01j2069j0175J4170
16206c5495J0423n241k5756n007N418j1294J8109J8393J1753P934o30K521j37
16193i009q344q282O828J123J686L57j234J853q342K725K4415O82p302j4287j577
16178a8708J7464j5222q603K4005l523k122p157J1555j527o949n386p055l930
16165b7158j4763j869L739q7K61Q752k652J5575n931o768R568L611P91J459m514
16150a9986P752l92J0113j750j708J7392o798j4141l795K6760K0767k6924j0593
16137c303o235K271k2225j3705J4974K7614j6682j6400Q619J3845P736l2278k2443
$$ plain form
16233 -9492 -1186 -5632 -11230 -5103 4251 13623 5597 -10384 -39244 -23500 -14620 -8105 9911 -17093
16219 -17093 -36263 -49338 -32632 -9650 -7196 -28783 -31807 -30937 -27120 -27421 -39490 -49665 -35495
16206 -35495 -25072 -30313 -56069 -61076 -55658 -66952 -48843 -30450 -18697 -10763 -11393 -8872 -9009
16193 -9009 -17353 -25635 -18807 -17684 -15998 -15641 -16875 -15022 -23364 -20639 3776 4458 -2844 -17131 -18708
16178 -18708 -1244 -16466 -25069 -1064 -4587 -6709 -13866 -2311 -3838 -10787 -16173 -23228 -27158
16165 -27158 -41921 -43790 -40051 -40138 -39877 -31125 -33777 -18202 -24133 -30901 -21333 -17722 -16931 -15472 -19986
16150 -19986 -12234 -12626 -2513 -4263 -5971 11421 4623 -9518 -13313 13447 34214 7290 -3303
16137 -3303 -9538 -7267 -29492 -43197 -28223 -609 -17291 -33691 -25072 -11227 -3491 -35769 -58212
16124e8212J5866J1974P636J706J5742Q755O412k9900L304J0268J6095p178k0025
16111a7557K789j0316j0557P523L178j965M255J801j2746N005M688k096L4374
16098H376L216j9084r749j1910j2562j2664K5496J7892m327j0366Q590K3975j603
16085E280k8412L074L417K439P999l213k160M003p183J848K539j562P067o427
16071a1291k7854J0409R956j3896p178j7450M363K3121o808J4058m967r855R367
16058b8025j851O104J2036K748j4964J0387l156J884K282j8805o735L007M147
16045c0941J2736j305j7704o495O305J2816r819R445J0542J5597j7592j3836j3876
16032d4127Q913l257j468J9507j6711P650Q960j0196j9658M360M803J3217R854
$$ plain form
16124 -58212 -42346 -30372 -22736 -21030 -5288 3467 9879 -20021 -16717 -6449 9646 2468 -17557
16111 -17557 -14768 -25084 -35641 -28118 -24940 -26905 -22650 -20849 -33595 -28590 -23902 -25998 8376
16098 8376 11592 -7492 -17241 -29151 -41713 -54377 -28881 -10989 -15316 -25682 -17092 6883 5280
16085 5280 -23132 -20058 -16641 -14202 -6203 -9416 -11576 -7573 -14756 -12908 -10369 -11931 -4864 -11291
16071 -11291 -39145 -28736 -18780 -32676 -39854 -57304 -52941 -29820 -36628 -22570 -27537 -37392 -28025
16058 -28025 -29876 -23772 -11736 -8988 -23952 -13565 -16721 -14837 -12555 -31360 -38095 -35088 -30941
16045 -30941 -18205 -19510 -37214 -43709 -37404 -24588 -34407 -24962 -14420 1177 -16415 -30251 -44127
16032 -44127 -35214 -38471 -39939 -20432 -37143 -29493 -20533 -30729 -50387 -46027 -41224 -28007 -18153
16019a8153J0249k056O19o24J568J1560K61k5041Q26m330k5563j764L1228J4717
16005f503k0234p529O393Q139J6759o39m097o454j6052r82J3656k835J8358p161
15991i181j2614j3805j4577K158K8957L6169k7488k0425j1026J690J6496J3692
15979i954P669J2417L271j8962o691K8589l322j0888n929l533m385n496Q610q035
15965a6639q422j3770K1903R214k0664q059K8822J2613p540j9797n173K0613j446
15952h345j3986n866j092O091j8946Q97J7664L169J1881j5054j8431J3243N127
15939b3648k3579O564O471J4873Q368j2091j4713o07J1514J7674N516J784k2459
15926b4333j8780m008Q503O251J0923J2199N761J8523P245J0070r571j8318K750
$$ plain form
16019 -18153 -7904 -9960 -9341 -9965 -8397 3163 3424 -21617 -20791 -25121 -50684 -52448 -21220 -6503
16005 -6503 -26737 -34266 -27873 -19734 -2975 -3614 -7711 -14165 -30217 -31199 -17543 -20378 -2020 -9181
15991 -9181 -21795 -35600 -50177 -48019 -19062 17107 -10381 -30806 -41832 -40142 -23646 -9954
15979 -9954 -2285 10132 13403 -5559 -12250 16339 13017 2129 -3800 -7333 -11718 -17214 -8604 -16639
15965 -16639 -25061 -38831 -16928 -7714 -28378 -36437 -7615 4998 -2542 -22339 -27512 -6899 -8345
15952 -8345 -22331 -28197 -29289 -23198 -42144 -41247 -23583 -20414 -8533 -23587 -42018 -28775 -23648
15939 -23648 -47227 -40663 -34192 -19319 -10951 -23042 -37755 -38362 -26848 -9174 -3658 -1874 -24333
15926 -24333 -43113 -47121 -38618 -32367 -21444 -9245 -3484 15039 22284 32354 22783 4465 7215
15913G215J310L062j2481j0342j052Q93P197k68R268n222j2415J1547K414M564
15899E690J5988R895j4097p789l3018P680J0496j659m40j5886l071q788j2498
15886d7497J7835K4658j1078J0043J3132J0194j526J6796L030m1998k3539P000
15874b2950J0094j3562p177p287o492R051R172L176J0226q608R353K1038J9431
15861B5465j0334o848q756m587r787J8935j7899J222P440j6297k20J1578L677
15848f411p099J371K257M500L461M676p28r796j5718j1653N886J0911K329j0876
15834b6890p7j1703K514J959j6434R223K0371j0689N762L7088J8364J3608j415
15821D1681q528q353k395l2290j8031m45R285O018L829M667j7246J1756K8283
$$ plain form
15913 7215 8525 11587 -894 -11236 -12288 -11395 -4198 -4466 4802 -420 -12835 -1288 1126 5690
15899 5690 21678 31573 17476 9687 -23331 -15651 -5155 -6814 -7254 -23140 -26211 -34999 -47497
15886 -47497 -29662 -5004 -16082 -6039 7093 17287 15761 32557 35587 -6411 -29950 -22950
15874 -22950 -12856 -26418 -33595 -40882 -47374 -38323 -29151 -25975 -15749 -24357 -15004 6034 25465
15861 25465 15131 8283 -473 -5060 -14847 4088 -13811 -12589 -5149 -21446 -21666 -10088 -6411
15848 -6411 -13510 -12139 -9882 -5382 -1921 2755 2027 -7769 -23487 -35140 -29254 -18343 -16014 -26890
15834 -26890 -26967 -38670 -36156 -34197 -50631 -41408 -21037 -31726 -25964 11124 29488 43096 41681
15821 41681 33153 24800 22405 -9885 -27916 -28361 -19076 -13058 -9229 -4562 -21808 -10052 18231
15808A8231L754l7780j0936r925L115K602j6292J3168L7316J1480j2068p216j693
15795f244R94J708P40J1266P326K120o258k1291j1301r296J1169K3834n743j0023
15781a0999J4299N276j8971j1275N094M102N815o21j38j9742J365J8155K2058
15768A4418j6462j4970k2564M424J5671K2162M783j4463J2881K4078j0064k1388
15756a494l0231r155R863J640J2362J7397j9338N647M844N928j0365j7624j759
15743c2285R663j181Q644K5887l372j1573j4981J4350j803m204J5821P055O884
15730A8905j5699j5292j2129J0286K1079m26p980m293j1122l538J2008K0388j9047
15717f860Q627L401j0922Q8J1991J1032L163k4230j4545k665O61j3453k170Q148
$$ plain form
15808 18231 21985 -15795 -26731 -36656 -33541 -30939 -47231 -34063 3253 14733 2665 -4551 -6244
15795 -6244 -5250 -3542 -2802 8464 15790 17910 11652 -9639 -20940 -30236 -19067 4767 -976 -10999
15781 -10999 3300 8576 -10395 -21670 -16576 -12474 -6659 -7280 -7418 -27160 -25795 -7640 14418
15768 14418 -2044 -17014 -39578 -35154 -19483 2679 7462 -7001 5880 29958 19894 -1494
15756 -1494 -31725 -40880 -31017 -29377 -17015 382 -18956 -13309 -8465 -2537 -12902 -30526 -32285
15743 -32285 -22622 -23803 -15159 10728 7356 -4217 -19198 -4848 -6651 -10855 4966 12021 18905
15730 18905 3206 -12086 -24215 -13929 7150 6724 -1256 -5549 -16671 -20209 -8201 12187 -6860
15717 -6860 1767 5168 -5754 -5666 6325 17357 20520 -3710 -18255 -20920 -20259 -33712 -35882 -27734
15703b7734j2483J8035K5583J6155j597n878m242n277r34l947k8904m841J5583
15690b0481J2707L177l72k7239j5052J2225J9988K0979r03K2669o69q97J4687
15677D0819j152j0787k393K5078M908p084k1162n093p146k951p446j3154R683
15664B120o681j8908L287L126P413l923J4970l798j4311j7442J7544K1118J3565
15651A8080o924j1958j0314N737J3550K675R85J0275m660m612l636r239L988L030
15637F977q341R198K2275m383J4482q828k0900j9431r433j2917J1650L053j1592
15624b8190r996R049K3560K035K3253o398K108J0081m445l417p614j6134l027
15611i135J7331K8582J6072k4477k1733k3158j1761J0570M254K6262k933J0320
$$ plain form
15703 -27734 -40217 -22182 3401 19556 17959 12081 7839 2562 1628 -2319 -31223 -36064 -20481
15690 -20481 -7774 -4597 -4969 -32208 -47260 -35035 -15047 5932 5029 27698 27029 26132 40819
15677 40819 39667 28880 26487 51565 56473 49389 28227 23134 15988 13037 5591 -7563 2120
15664 2120 -4561 -23469 -20182 -17056 -9643 -13566 1404 -2394 -16705 -34147 -16603 4515 18080
15651 18080 11156 -802 -11116 -5379 8171 10846 11831 22106 17446 12834 9198 -41 3947 6977
15637 6977 -1364 7834 30109 25726 40208 31380 10480 -8951 -18384 -31301 -19651 -16598 -28190
15624 -28190 -38186 -29137 -5577 -3542 19711 13313 15421 25502 21057 17640 10026 -6108 -9135
15611 -9135 8196 36778 52850 28373 6640 -16518 -28279 -17709 -13455 12807 9874 20194
15599B0194P233o548P66n660k4432j8573k441J744J0834L734J6469O361R987K029
15585B1697L369j5355l759R907j8890o14J3423J83K689J0793O812j0896k5154
15572e795p584L517Q327M017J756j236J6048j1205m975p791j0689j0538j7557
15559d3705J3063J2532J3320K322j75j482q499J4671K2096r526j1150m857M57
15546i33K292J481M516P020j2845p797J877r021J138J0863L559J1215J5454N631
15532C4450j9040J129R48k4416O824K3961J005o935k325k14L874J4871j1228k6917
15518d013l5061j3225J363K0933K773o539m049q191K3740K1210j989m572J4422
15505F802K0224k4623N548P60k720k0864M641j962q234P571K1906J4466K320j7642
$$ plain form
15599 20194 27427 20879 21645 15985 -8447 -27020 -29461 -27717 -16883 -13149 3320 9681 19668 21697
15585 21697 25066 9711 5952 15859 -3031 -3645 9778 9961 12650 23443 30255 19359 -5795
15572 -5795 -13379 -9862 -1535 2482 4238 3002 19050 7845 2870 -4921 -15610 -26148 -43705
15559 -43705 -30642 -18110 -4790 -2468 -2643 -4125 -12624 2047 24143 14617 3467 -1390 -933
15546 -933 1359 2840 7356 14376 1531 -6266 -4389 -13410 -12272 -1409 2150 13365 28819 34450
15532 34450 15410 16539 17487 -6929 -105 23856 24861 17926 15601 15387 19261 34132 22904 -4013
15518 -4013 -39074 -52299 -50936 -30003 -27230 -33769 -37818 -46009 -22269 -1059 -3048 -7620 6802
15505 6802 27026 2403 7951 8711 5991 -14873 -10232 -12194 -20428 -12857 9049 23515 25835 8193
15491H193j7220n509j845l918J152O901Q747j5569N948K0058j0429P347q596k1201
15477b5941R83J5155R156M701j829n411J64j714K0006M259J1292j7483l9764j552
15463b7978R872k37m770j3635o220J7435M066m501J5452k558j7401L572p941P301
15449b7543J6197J2748J2245j3639j6107o40J5828Q902L106K147q191q109k096
15436e152J360M2j8024L432o089j4939K120J6033J5911r228l0502P950L6918J4009
15422A3841J1262p9l77M551n907p372o132n720R421j123k0049p849J9130Q76j1791
15407g318p350l08J3220L0322J7144l3426n869Q170J0162O120r026j8159p195
15394c513l366p691M556K2182K2325J9989L160j5755j1035k343N385k909j2265
$$ plain form
15491 8193 -9027 -14536 -16381 -20299 -19147 -12246 -3499 -19068 -13120 6938 -3491 3856 -4740 -25941
15477 -25941 -24958 -9803 -647 4054 2225 -3186 -3022 -4736 15270 19529 30821 13338 -26426 -27978
15463 -27978 -18106 -18343 -23113 -36748 -42968 -25533 -21467 -25968 -10516 -13074 -30475 -26903 -34844 -27543
15449 -27543 -11346 1402 13647 8 -16099 -16739 -911 7991 11097 13244 5053 -3056 -5152
15436 -5152 -3792 -3750 -21774 -18342 -24431 -39370 -37250 -21217 -5306 -14534 -45036 -37086 -168 13841
15422 13841 25103 25024 24647 29198 23291 15919 9787 4067 13488 12365 -7684 -15533 3597 4473 -7318
15407 -7318 -14668 -14976 -1756 28566 45710 12284 6415 14585 24747 30867 21841 3682 -3513
15394 -3513 -6879 -14570 -10014 12168 34493 54482 57642 41887 30852 28509 33894 30985 18720
15381A8720N958J7381j3029k4291j622j2612j6571L786n490R966P604P173k6376
15368b9403O582M460p985R941J0711K0149J5573p440J1662Q18q310M740J1474
15355D2972k116m7308k2482J171O084K901R907K1327o690j2307j2270J2023R485
15342B697P136j194o636r003q336j0165m908J4044J327K2287J5492k6314j9396
15329b2969K5731o482k4752p293m964J090Q040K2184M010j0239J3934M694J7244
15316B0228K9176k4097k3355j3723j73q883l949L633k301Q521l138n131R411J999
15302a1782K1310J3822p578K937j3659p582J8201K0187R708l970j2032j0738N422
15289B4246J5529j9874k5582j1593J9814j1670k1289j2604L4730L735j0158J014
$$ plain form
15381 18720 24678 42059 29030 4739 3117 -9495 -26066 -22280 -27770 -17804 -10200 -3027 -29403
15368 -29403 -22821 -18361 -26346 -16405 -5694 14455 30028 22588 34250 35068 26758 31498 42972
15355 42972 40856 -6452 -28934 -27763 -21679 -18778 -8871 12456 5766 -6541 -18811 -6788 2697
15342 2697 9833 8639 2003 -7000 -15336 -25501 -30409 -16365 -15038 7249 22741 -3573 -22969
15329 -22969 2762 -3720 -28472 -35765 -40729 -39639 -31599 -9415 -5405 -15644 -1710 2984 20228
15316 20228 49404 25307 1952 -11771 -11944 -20827 -24776 -21143 -23444 -14923 -18061 -23192 -13781 -11782
15302 -11782 9528 23350 15772 18709 5050 -2532 15669 35856 45564 41594 29562 18824 24246
15289 24246 39775 19901 -5681 -17274 2540 -9130 -30419 -43023 -8293 -4558 -14716 -13702
15277a3702j8391J9332J0188r775L365j354J3567K2024M557O586l2304j5770r57
15264a2634J3561j1484J3071J414k2656K294O247O259R995J4022N520o453J757
15251B0913k9188j1674N403K0424q197J0643J0455q978j3840r210J0060N050j9733
15238a7872q34N686J2042K6112k146m909J0008p582P227k2690J1011R375r45l501
15224B0982j2695k1654M009J3404P027Q591j56j9490Q241J561j3551N647K4306
15211B6222j1467j6396L456m558j3371p4j022J1220q777P862K0735M918o118j88
15197A2442N533O074j2403J423k824j9983J583J408J3782q7j9980ML1157J3366
15183C1495M326o777q594K476R166j9578p862Q105J7586Q345q53M007p019r427
$$ plain form
15277 -13702 -32093 -12761 -2573 -12348 -8983 -10337 3230 25254 29811 36397 4093 -11677 -12634
15264 -12634 927 -10557 2514 3928 -18728 -16434 -10187 -3928 6067 20089 25609 19156 20913
15251 20913 -8275 -19949 -14546 5878 -2319 8324 18779 9801 -4039 -13249 -3189 1861 -17872
15238 -17872 -18706 -13020 -978 25134 22988 18079 28087 20505 27732 5042 16053 25428 24483 20982
15224 20982 8287 -13367 -9358 4046 11073 19664 19508 18 8259 9820 -3731 1916 26222
15211 26222 14755 -1641 1815 -2743 -16114 -16188 -17210 -5990 -14767 -6905 13830 18748 12630 12442
15197 12442 17975 24049 11646 13069 10245 -9738 -8155 -6747 7035 6948 -13032 -13028 18129 31495
15183 31495 35821 29044 20450 22926 32092 12514 4652 12757 30343 38688 37835 41842 34823 25396
15169B5396n551J0705J908J4748j0924q396j3965M075j158j7694J8553J4344l205
15156B8836N275J5679j1541k1239j9832j1092K1254J7831k853k1140k78n695o768
15143a1563k641K1283N732J8426J9401J3501k3992l326j0226n605J454J970K6914
15130E1328j174j201J2666J2000Q650q684j5409J6415J0434k2488r141j6255j372
15117C5769K2314p153j95k672k2108r769K5781J6753k591J677j1097k3761P06
15104B3654J7032K5155J5858j1998k1048k268J0165o782J769j1108R795N067O843
15091F2134L802r475M273j1700j6662P548l627j1105j776j0322l266K8612J9861
15078E8297J0234j2349R834J3911j7343k0551m935M991K835K2662J6985K871M747
$$ plain form
15169 25396 19845 30550 32458 47206 36282 27886 13921 17996 16838 -856 17697 32041 28836
15156 28836 34111 49790 38249 17010 -2822 -13914 7340 25171 22318 1178 900 -4795 -11563
15143 -11563 -14204 7079 12811 31237 50638 64139 40147 36821 26595 20990 22444 24414 51328
15130 51328 50154 48953 61619 73619 82269 73585 58176 74591 85025 62537 53396 37141 35769
15117 35769 58083 50930 50735 48063 25955 16186 41967 58720 56129 57806 46709 22948 23654
15104 23654 40686 65841 81699 69701 48653 46385 56550 49768 51537 40429 50224 55291 62134
15091 62134 65936 56461 60734 49034 32372 39920 36293 25188 23412 13090 9824 38436 58297
15078 58297 68531 56182 66016 79927 62584 42033 37098 42089 44924 67586 84571 87442 92189
15065I2189j1241j2704j0191O573j4434q403R258J1657N890r167K068J2475J7635
15052I1605j4126r967Q305n82l6221J409M066J936k596j2334o246J0789q971J4336
15038D1403L6148K0528o027p803o033M907j308m875l965j8478J703K571p085J282
15024E2968J829M77J573K1827J1319j5453k1568j1402j5708N752J3904J5517J2428
15011G3463P950k670R915j4407k1933j7588o870K2687n04K0315N482r077k7290
14998C9473j7493j0739k258J7934L1461R432L683m72J1235l749k7652j1744J3117
14985E2228J4420J2955Q639j8761j1442k5676k458K5099Q328M737j1422k7102
14973B9545r381o81r665P574J1729J0191Q408N758m768k446j0245O444J7977j6648
$$ plain form
15065 92189 80948 68244 58053 64626 50192 41789 51047 62704 68594 59427 61495 73970 91605
15052 91605 77479 67512 75817 75235 39014 40423 44489 46425 43829 31495 25249 36038 27067 41403
15038 41403 77551 98079 92052 84249 78216 83123 81815 76940 72975 54497 56200 58771 51686 52968
15024 52968 54797 55274 56847 78674 89993 74540 52972 41570 25862 31614 45518 61035 73463
15011 73463 81413 78743 88658 74251 52318 34730 27860 50547 50043 70358 75840 66763 39473
14998 39473 21980 11241 8983 26917 58378 67810 71493 71021 82256 78507 50855 39111 52228
14985 52228 66648 79603 88242 69481 58039 32363 29905 55004 63332 68069 56647 29545
14973 29545 20164 19483 9818 17392 29121 39312 47720 53478 48710 46264 36019 42463 60440 43792
14959D3792J6833J607j0058O323j1825P304K965m6167k7858K7064q684q367Q438
14946A367J1165q631P725K493N72J1047j3328j7612J0552L9728K444j9105k3869
14933D548j6552K4780J1668p432r898L484Q654j8835R070K0195m9K669m31R723
14919D1594k7352j8187l91m105J0506Q918L338J1922p825L006J8301L874j1070
14906C2529j6675j3872J932j401J2931q449R302K0337q405k1619J0294K1433J033
14893C9370j2146j2038k1231J6670N023j0125o384J9824P180K174l1445q398j769
14880a3295P7L986K498k689J7623J4668j1364j2415J465R715N064Q187M339j8849
14866I010L316J1989o859K492j9765J589J31L4357R267j9210l326j9722J734q724
$$ plain form
14959 43792 60625 62232 52174 58497 46672 53976 56941 10774 -17084 9980 1296 -7071 1367
14946 1367 12532 3901 11626 14119 14691 25738 12410 -5202 5350 45078 47522 28417 4548
14933 4548 -12004 12776 24444 17012 7114 10598 19252 417 9487 29682 29633 32302 31871 41594
14919 41594 14242 -3945 -4336 -8441 2065 10983 14321 26243 18418 21424 39725 43599 32529
14906 32529 15854 1982 3914 2513 15444 6995 16297 36634 28229 6610 16904 38337 39370
14893 39370 27224 15186 -6045 10625 15648 5523 -861 18963 26143 28317 -3128 -11526 -13295
14880 -13295 -13218 -9232 -6734 -9423 8200 22868 11504 -911 554 10269 15333 23520 27859 9010
14866 9010 12326 24315 17456 19948 183 1772 1903 36260 45527 26317 22991 3269 5003 -3721
14852c721N714K3895J702M722r451j198K4668j1839j0013J5331j453m739o878
14839B6740m283l884j2576j8409j0418O002O011L013K5999O685r899L242o985
14826A1238J128k129o986J0955l923k6077N977K0606n354L686n34k279r197j0001
14812a2890J7010j0866R61m309J959Q037J5499R63j5683L676o943L550M354j441
14798C877J2782o557M156K2520N659L599k041J34j5411p528p387J0918N608J2765
14784D3094P662j8995q538o537J921o694j9271k1536K095K2153O300j1674K644
14771g376K928N898j6113K880q766N215O984j4564J2366J6972J2574r409n043
14758D546O765j3973q582J1946J0981p312j911n524o968r008M070j665J1150J7940
$$ plain form
14852 -3721 1993 25888 27590 32312 22861 21663 46331 34492 24479 39810 38357 33618 26740
14839 26740 22457 18573 5997 -12412 -22830 -16828 -10817 -7804 18195 24880 14981 18223 11238
14826 11238 12366 10237 3251 14206 10283 -15794 -9817 10789 5435 9121 8587 6308 -2889 -12890
14812 -12890 4120 -6746 -5785 -10094 -8135 -98 15401 16364 681 4357 -2586 964 5318 3877
14798 3877 16659 10102 14258 36778 42437 46036 43995 44129 28718 21190 13803 24721 30329 43094
14784 43094 50756 31761 23223 16686 18607 11913 -7358 -28894 -26799 -4646 1654 -10020 -7376
14771 -7376 -4448 1450 -14663 -11783 -20549 -15334 -8350 -22914 -10548 6424 18998 9589 4546
14758 4546 11311 -2662 -11244 702 11683 4371 2460 -3064 -10032 -19040 -14970 -16635 -5485 12455
14744A2455m393k4704L190k34P393J5723r40k276Q646N057j645o008k6188j4069
14730b7993J304J9979r280j4454R794J6744Q061o920o05R285j4684q816J9222
14717A637K168j1833j5366J1601J9748J3847j5249j5427r129J7566j1945j2682
14705b5064J3390J0793J4492p273M173J0412N055j4362J064K3421J5752P650j1614
14692D7889P308j8638j9243O720o896k3701J1414K0736J4604k683j1431p83N876
14679C1172K458k988m913r265p283K915o565k009j0842m395J2264K505J8646j489
14665B0211j4556P210J0129m401L300k0657N425J0120K0867m062l602j6545j0022
14652C417N616k353k8767k693J6351K057n214j0415m603L204K189p214O471J8272
$$ plain form
14744 12455 8062 -16642 -13452 -13686 -6293 9430 8490 6214 14860 19917 18272 12264 -13924 -27993
14730 -27993 -26689 -6710 -15990 -30444 -20650 -3906 4155 -2765 -3370 5915 -8769 -17585 1637
14717 1637 3805 -8028 -23394 -11793 7955 21802 6553 -8874 -18003 -437 -12382 -25064
14705 -25064 -11674 -881 13611 6338 10511 20923 25978 11616 12680 36101 51853 59503 47889
14692 47889 55197 36559 17316 24036 17140 -6561 4853 25589 40193 37510 26079 25296 31172
14679 31172 33630 30642 25729 16464 9181 12096 5531 3522 -7320 -11715 549 3054 21700 20211
14665 20211 5655 12865 22994 18593 21893 1236 6661 16781 37648 33586 29984 13439 3417
14652 3417 9033 6680 -22087 -24780 -8429 -6372 -11586 -22001 -26604 -23400 -21211 -28425 -21954 -3682
14638c682O999k998J7044n69l970J3472j877j1161r919Q56K0912J786j9840N370
14624A2423o210o673O084r482N746P366k4070j1737P997J0013P949k084L828P546
14610H696J5399j0631k3082M14J6869J73K447l922m469n43r95j2681j7864J4437
14596a5752K924J2352J5182j3695R283m142j095l145J0438j2748J6073K1728k0779
14583A6624j7828K028j1432n946M594k2884j857J0337J125J6939O154j4749p634
14570b4529K0846Q960j7276J528J0013L171L999J1602L023r171j2236R873L538
14557A3341L4800n397j1523j1096j1753O12j512n347p087J4969J0271k4581k3009
14544b7312n92J2569o774M653J0657L599Q215k827m644j1047j0600N031J1429
$$ plain form
14638 -3682 3317 319 17363 16794 12824 26296 24419 13258 3339 4195 25107 26893 7053 12423
14624 12423 6213 -460 5624 -3858 1888 9254 -14816 -26553 -18556 -8543 -594 -2678 1150 8696
14610 8696 24095 13464 -9618 -9204 7665 7838 10285 6363 1894 1351 356 -12325 -30189 -15752
14596 -15752 -12828 -476 14706 1011 10294 6152 5057 1912 12350 -398 15675 37403 16624
14583 16624 -1204 824 -10608 -16554 -11960 -34844 -36701 -26364 -25239 -8300 -2146 -16895 -24529
14570 -24529 -3683 5277 -11999 -10471 -458 2713 6712 18314 21337 12166 -70 9803 13341
14557 13341 48141 42744 31221 20125 8372 8984 7472 2125 -4962 10007 20278 -4303 -27312
14544 -27312 -27904 -15335 -22109 -17456 -6799 -3200 5015 2188 -2456 -13503 -24103 -19072 -7643
14531g643J5303k765R148o554r559k0670o39J1854K008J2987j1009q292R789N40
14517e502J3222J3760Q039R909k3916k0193k082o609o061K4060O734Q14J410q430
14503E155j8836J2135J2535k1539O951R654J4327L392q325j6970P844m82J3938
14490A9779J9341o556k3112j6750p317Q603K3113R735j007j1328M529j0372j1570
14477b912J4047r968k0041R310n229q181L4934J7388j8435r41M383M319K185m611
14463A6248j7972o858J0420J1234K680j1317M306L513P871J596J232O21j4609
14450H965k8031n811Q550J962O045M741R794k2692m157n325p017L9220L0949J0326
14436D7519j5138j0548j3632q825J83p352M159J2838m845j1970p672R628R830
$$ plain form
14531 -7643 7660 4895 14043 7489 -2070 -22740 -23379 -11525 -9517 3470 -7539 -15831 -6042 -5502
14517 -5502 7720 21480 29519 39428 15512 -4681 -6763 -13372 -19433 4627 11361 12175 13585 5155
14503 5155 -13681 -1546 10989 -10550 -3599 6055 20382 23774 15449 -1521 6323 5841 19779
14490 19779 39120 32564 9452 -7298 -14615 -6012 17101 26836 25829 14501 19030 8658 -2912
14477 -2912 11135 1167 -18874 -9564 -14793 -22974 11960 29348 10913 9972 14355 18674 20859 16248
14463 16248 -1724 -8582 1838 13072 15752 4435 8741 12254 20125 21721 22953 23574 8965
14450 8965 -19066 -24877 -16327 -14365 -8320 -3579 6215 -16477 -20634 -25959 -32976 6244 37193 47519
14436 47519 32381 21833 8201 -624 -441 -7793 -3634 9204 4359 -7611 -15283 -5655 4175
14423D175K0322j81l1311j7847q046J2524j687K938J537q600R842j4077J2119
14410a8292K8497l041J149N911l0979J2434J394j881n053N218K73n102N552J4062
14396A0142O004k2159q654M251O003k143L943L481j0962Q80K895K842k2256r597
14382c5330J9683J5786M079m846k1779m586j1183J3547N355R594J9346J8417n297
14369B2786M33p984j7423J672J1407M920j4657M072M772P345J3813k7044j6897
14356a2785J2211J9004L508j0933l418J2074j2570j4768K2780P49j114J7409J3538
14343D5685m336M75L779k246j1042k8045k341l669p524K2525O88o536j7710o10
14329a0907Q332P963k700O62j6422n849r75J3480R880j2233j1914J432J8634m268
$$ plain form
14423 4175 24497 24316 -6995 -24842 -32888 -20364 -22051 -19113 -17576 -26176 -16334 -30411 -18292
14410 -18292 10205 7164 8313 14224 -16755 -4321 -2927 -4808 -9861 -4643 -4370 -9472 -3920 10142
14396 10142 16146 -6013 -14667 -10416 -4413 -6556 -2613 868 -10094 -9214 -6319 -3477 -25733 -35330
14382 -35330 -15647 139 4218 -628 -22407 -26993 -38176 -24629 -19274 -9680 9666 28083 22786
14369 22786 23219 15235 -2188 -516 10891 15811 1154 5226 9998 17343 31156 4112 -12785
14356 -12785 -574 18430 21938 11005 7587 19661 7091 -7677 15103 15852 14738 32147 45685
14343 45685 41349 41824 45603 43357 32315 4270 1929 -1740 -9264 13261 13949 7413 -10297 -10907
14329 -10907 -2575 5388 2688 3350 -13072 -18921 -19896 -6416 3464 -8769 -20683 -19251 -617 -4885
14315d885p504p913l488p264k6603K8522K5903K3492K229p442j2361j0866j4610
14302b2790J2303R281p737K0550R114j4255L755k4161j2945j2181J1379j211k312
14289c1210K0571J1696J011n244r293r470j6030J3127R360M837M252k385J728
14276g050J5237j5320m04q262M672r355j5790K1263K3199k343n654n86j3536R471
14262d458J8047P387r555l122J0239q358J1975J2244M32r405j2496n06j607n109
14248E708o722k3091K1904J2835j421o105O226M445K44j5247r223J042Q756l702
14234d351j4255J4098N061J9331o692q473m014M756J8297l013k3048k1906J3399
14221a0810j559k4892j0896L9464K1075J5292j4227p590O647oj9956J0012m856
$$ plain form
14315 -4885 -12389 -20302 -23790 -31054 -57657 -29135 -3232 20260 22489 15047 2686 -8180 -22790
14302 -22790 -10487 -1206 -8943 11607 20721 6466 10221 -13940 -26885 -39066 -27687 -28898 -31210
14289 -31210 -10639 1057 2068 -3176 -12469 -21939 -37969 -24842 -15482 -10645 -6393 -8778 -7050
14276 -7050 8187 -7133 -7537 -15799 -11127 -20482 -36272 -15009 8190 5847 193 -393 -13929 -4458
14262 -4458 13589 20976 11421 8299 18538 10180 22155 34399 34831 25426 12930 12424 10817 5708
14248 5708 -1014 -24105 -2201 10634 9213 3108 9334 13779 14023 -1224 -10447 -9405 -649 -4351
14234 -4351 -18606 -4508 553 19884 13192 4719 705 5461 23758 20745 -2303 -24209 -10810
14221 -10810 -12369 -37261 -48157 -8693 12382 27674 13447 5857 12504 12498 -7458 2554 -2302
14208b302M195p154n313L618J878j4457j1231n700L442K4213J0378j2698N070
14195f061M325p468J218K710M224j1703L350K9641l679j4989J4033J5045M792
14182C5438j0184Q375J1565K144j4070j802p955j3625j0855j0377r174j1220j23
14169c1863m255P582J1822l305j0653L546Q843O42J5074J0301p894m177R474j2095
14155f958j0670K756j1294q168q55J5186K8566n921L65J333j3304M486L219k7811
14141b9070k0047j3478K2995L0138J540p478n126J8326o62j712P995J0872J1921
14128B6214J455j1986k005k3027L646J1545n39j0260k3991Q416N205K272N722
14115g333O383O281K7749j5747l875J0530P082j6940k0529O156K506k291j0825
$$ plain form
14208 -2302 1893 -5261 -10574 -6956 -5078 -19535 -30766 -36466 -33024 -8811 1567 -11131 -6061
14195 -6061 -1736 -9204 -7986 -5276 -1052 -12755 -9405 20236 16557 1568 15601 30646 35438
14182 35438 25254 33629 45194 47338 33268 31466 23511 9886 -969 -11346 -20520 -31740 -31863
14169 -31863 -36118 -28536 -16714 -20019 -30672 -27126 -18283 -17641 -2567 7734 -160 -4337 5137 -6958
14155 -6958 -17628 -14872 -26166 -34334 -35189 -20003 8563 2642 3007 4340 -8964 -4478 -1259 -29070
14141 -29070 -49117 -62595 -39600 -9462 -7922 -15400 -20526 -2200 -2862 -4574 3421 14293 26214
14128 26214 27669 15683 13678 -9349 -5703 5842 5303 -4957 -28948 -20532 -15327 -13055 -7333
14115 -7333 -950 5331 33080 17333 13458 23988 31070 14130 -6399 -243 2263 -28 -10853
14102a0853m852J117K587Q155J1157p077j1815m793J0386n652l468j568K3265
14089F589J4913p535K1744k3364j2162Q804r336J550J906o363j5298j2952j4513
14076d6017j024K8963J8838j1007R370M659j2210n812J660K526J0907L937J4051
14063A8841J518j8726j0420J3276p611J113J4160M866j0107J2555k7166q449J5258
14050h92k1951r368J6203M987P313J0002j0854J5928R011o234l935n333p09J9260
14036B3428k286j0347J017j0978k64J2860J6996m499k2439j1688J9468K831n904
14023H195o282L460k0781J366J640j0241J3513J0720n655k952j9710j0840K235
14010c5332J3529K8921J4494K378j4558p87l72o571k083J4489R567q019j9462
$$ plain form
14102 -10853 -15705 -14588 -12001 -3846 7311 234 -11581 -16374 -5988 -11640 -15108 -16676 6589
14089 6589 21502 13967 35711 12347 185 8989 -347 1203 3109 -3254 -18552 -31504 -46017
14076 -46017 -47041 -18078 760 -10247 -877 3782 -8428 -14240 -12580 -10054 853 4790 18841
14063 18841 20359 1633 -8787 4489 -3122 -2009 12151 17017 6910 19465 -7701 -16150 -892
14050 -892 -22843 -32211 -16008 -11021 -3708 6294 -4560 11368 20379 14145 10210 4877 4168 23428
14036 23428 21142 10795 11812 834 570 13430 30426 25927 3488 -8200 11268 14099 8195
14023 8195 1913 5373 -15408 -14042 -12402 -22643 -9130 1590 -4065 -7017 -26727 -37567 -35332
14010 -35332 -21803 7118 21612 23990 9432 8645 8273 1702 -381 14108 23675 15656 -3806
13997c806k2563J0961J1393R68m966r817q75K2412q366j5517K3969P218o182R2
13983D921N099k271j0314k3667k0889L602J7605K4061J208J830J4656k2763k7524
13970c4446o253L2553J4855q04J3890q520q076j9634j0149R466j2412k365J2476
13957a9419k046L960J4497M096J534j5184r90R634R562n797j5053N689J9402M639
13943A4524j0758O054l072j157n547j4135j0786j6681L2140K4227n991k7027j1237
13930b9446J8304j5677j387J6396J5706L910o600n973J726n799N707J1276L972
13917A2115p061K20m773J068R099J6744j61o622j4342J140r881j5424l245j082
13903b2205J6500j2345r902K7602o215j3079J918K0020J3448j5322P73p036j4984
$$ plain form
13997 -3806 -26369 -15408 -4015 -3047 -8013 -17830 -18705 3707 -4659 -20176 3793 11011 4829 4921
13983 4921 10020 7749 -2565 -26232 -47121 -43519 -25914 -1853 -645 1185 15841 -6922 -34446
13970 -34446 -40699 -8146 6709 5905 19795 11275 3199 -16435 -26584 -17118 -29530 -31895 -19419
13957 -19419 -21465 -17505 -3008 1088 2622 -12562 -13552 -3918 5644 -153 -15206 -9517 9885 14524
13943 14524 3766 9820 6748 5591 44 -14091 -24877 -41558 -9418 14809 8818 -18209 -29446
13930 -29446 -11142 -26819 -28206 -11810 3896 7806 1206 -4767 -3041 -8840 -3133 8143 12115
13917 12115 5054 5274 501 1569 10668 27412 27251 20629 6287 7427 -2454 -17878 -21123 -22205
13903 -22205 -5705 -18050 -27952 -350 -6565 -19644 -17726 2294 15742 420 1193 -5843 -20827
13890b0827k3694J7137P643L0586L532j6843j0789J068j0479K1000J1917l793
13878F458N088j1790L947J1430k345O53J8280L052j5034r106k4833o592M909m774
13864b0657q270k5607j5060j2409K663K9344J6695L725J4598k946m880K1302J2596
13851A1094n953L006R636L204k052j463J2701j0118j3984n538k5901m671J5511
13838a4528Q575j2739j1426K1670J1861N267N25L781p439k589K6072j1930l0246
13825a3146o737K8790K2703j1889l889l461o670K8376J4999M913j480q219k1191
13812B3099o762N441m509P667q970l3517r447O626J2721n466O795j818L804R518
13798E182j2018k45K3797N264p628P082P87L528N839l121r692p221J2936J2397
$$ plain form
13890 -20827 -44521 -27384 -19741 10845 14377 -2466 -13255 -12187 -22666 -1666 10251 6458
13878 6458 11546 -244 3703 15133 12788 13441 31721 34773 19739 10633 -14200 -20792 -15883 -20657
13864 -20657 -28927 -54534 -69594 -82003 -79340 -49996 -33301 -29576 -14978 -17924 -22804 -1502 11094
13851 11094 5141 8147 17783 20987 18935 17472 30173 20055 6071 533 -25368 -30039 -14528
13838 -14528 -5953 -18692 -30118 -8448 3413 8680 9205 12986 5547 2958 29030 17100 -13146
13825 -13146 -19883 8907 31610 19721 15832 12371 5701 34077 49076 53989 52509 44290 23099
13812 23099 16337 21778 17269 24936 15966 -17551 -26998 -20372 -7651 -13117 -6322 -8140 -4336 5182
13798 5182 -6836 -7081 16716 21980 14352 21434 22221 25749 31588 28467 18775 11554 24490 36887
13784C6887j5942P780N745q963j1468j9873p675N168J7228j0740j2907R633j283
13771f410J2586n148K807j175J1850N738o941K573n913j2625O251j3819j1276
13758b1502k870J1018J8202K2089M654j5965r645K06j3594l02K5597p349j5893
13745e354k109J4154J6468J3460j3747l0696l3207p796J0069K9912J9645L695
13733A4494O602K592J4942k4875k8568o418J5613J382J1955n370m378J3213m774
13720F410k0265J1734O443p638m930j304M652K5414j145j0539k1657M884j6314
13707b4255P724Q579N169j148J3974N162j2011o509N60j0975n114J3310Q671l625
13693d88j373m283J946P369n550L719J7776p4j8469Q075j5329p933M684J0602
$$ plain form
13784 36887 20945 28725 34470 25507 14039 -5834 -13509 -8341 8887 -1853 -14760 -5127 -6410
13771 -6410 6176 1028 3835 2660 14510 20248 13307 15880 9967 -2658 3593 -10226 -21502
13758 -21502 -24372 -13354 4848 26937 31591 15626 5981 6187 -7407 -7709 17888 10539 -5354
13745 -5354 -7463 6691 23159 36619 22872 -7824 -41031 -48827 -38758 -8846 10799 14494
13733 14494 21096 23688 38630 13755 -14813 -21231 -5618 -4236 7719 2349 -2029 11184 6410
13720 6410 -13855 -2121 4322 -3316 -8246 -9550 -4898 20516 19371 8832 -12825 -7941 -24255
13707 -24255 -16531 -7952 -2783 -3931 10043 15205 3194 -3315 -2755 -13730 -18844 -5534 3137 -488
13693 -488 -1861 -6144 -4198 3171 -2379 1340 19116 19042 573 8648 -6681 -14614 -9930 672
13679F72J0209l067j9726j9054m091n65K122J1011N724p385L0547J0061j0024
13666F434j4907N748k390j534J2178J3782k1005N215K2073O839J3102p868j4340
13653B3327P372j0409k085J618p038r552O644J3483k5905k893K8434o549o566
13640I881k571N134J3095j874q354k9062J4595K5760K9360J992j5819q364k3743
13627A0030k9054M318L287r472J8700K5916p556J7902Q880j8053J5802J0686j1544
13614C9842K62k4973j3341j199j783m501j3957m972r845J1897j363k2952j2275
13601e9160J5943K0169J2765K3968M120n76k707o668m790r800L996o983j0327
13588b0050j6280j5084p656J0971k665J6767J1019J4402M931J0832M943J6981
$$ plain form
13679 672 10881 7814 -11912 -30966 -35057 -35622 -33500 -22489 -16765 -24150 6397 16458 6434
13666 6434 -8473 -2725 -5115 -6649 5529 19311 -1694 3521 25594 32433 45535 37667 23327
13653 23327 30699 20290 18205 19823 12785 3233 9877 23360 -2545 -5438 22996 16447 9881
13640 9881 7310 12444 25539 23665 15311 -13751 844 26604 55964 57956 42137 33773 10030
13627 10030 -19024 -14706 -11419 -20891 -2191 23725 16169 34071 42951 24898 40700 51386 39842
13614 39842 40104 15131 1790 591 -1192 -5693 -19650 -24622 -34467 -22570 -23933 -46885 -59160
13601 -59160 -43217 -23048 -10283 13685 17805 17229 14522 7854 3064 -6736 -2740 -9723 -20050
13588 -20050 -36330 -51414 -59070 -48099 -50764 -33997 -22978 -8576 -3645 7187 12130 29111
13576B9111J1719l0323j5374m982J7361K8448J7034o125j2392l1116J4023J4071
13564C1455l2678l978l370l773R090K860n917k523K1443l64m925N039L883J1804
13550B8046m463J1492K561j903k6153p981k606o759N302q509k227K5692o109j1243
13536d860p345p674J796K5720K5548j784j1012n670J1052m244l848K094J2580
13523C2353J2822j5805k1878k961P12J1740l707j0671l6838j9118J8625M303K1758
13510h665J8280K0452J2476k3172p439l0460j3897K168K3K044J2124J9827J8719
13497B2480m658J2066O89j4405k790P213j5213j3964O789J0230k8885n247L9366
13484A3671l199k7791L369j1138J4389J8717O361j6547J710M890R434P257J0971
$$ plain form
13576 29111 40830 10507 -4867 -9849 7512 35960 52994 46869 34477 3361 17384 31455
13564 31455 -1223 -5201 -8571 -12344 -3254 -394 -6311 -8834 12609 12245 7320 12359 16242 28046
13550 28046 23583 35075 37636 35733 9580 1599 -1007 -7766 -2464 -10973 -13200 12492 6383 -4860
13536 -4860 -12205 -19879 -18083 7637 33185 31401 20389 14719 25771 21527 17679 19773 32353
13523 32353 45175 29370 7492 4531 5243 16983 13276 2605 -34233 -53351 -34726 -30423 -8665
13510 -8665 9615 30067 42543 19371 11932 -18528 -32425 -30257 -30234 -28190 -16066 3761 22480
13497 22480 17822 29888 30577 16172 13382 20595 5382 -8582 -1793 8437 -20448 -25695 13671
13484 13671 10472 -17319 -13950 -25088 -10699 8018 14379 -2168 -458 4432 13866 21123 32094
13471C2094J5534j4787k7593N596J4937J925j4563j611J8270J900q25p076j1003
13458A2798j78q012o957j379n278J6821j044n908N827j4281j3096Q944N421k756
13444i078m329M564M0424L4210k176j9571n652J0903O617k7125o88R622J2306
13431E0027O372Q419J1316L491J7127j1393l0533n886P710N359p061l0224k0158
13418D566j2931K7746K5962j795L713n962j3198J2924J9471M470j5773r53M345
13405E2585P29m647j4265m117k722p300k4292k680l567J3604R348m818j1960J4267
13391A0165P345N314J6066k2835k3285r004o045K3355J3575j164N774J297j5953
13378D605Q377K0247l866J0281k151j4295j8852m273K4792P353P710n379K786
$$ plain form
13471 32094 47628 32841 5248 10844 25781 27706 13143 11532 29802 31702 30877 23801 12798
13458 12798 12620 4608 -2349 -3728 -9006 7815 6771 863 6690 -7591 -20687 -11743 -6322 -9078
13444 -9078 -13407 -8843 31581 65791 63615 44044 38392 49295 55912 28787 28099 37721 50027
13431 50027 56399 64818 76134 79625 96752 85359 54826 48940 56650 62009 54948 24724 4566
13418 4566 -8365 19381 45343 43548 47261 41299 28101 41025 60496 64966 49193 48240 52585
13405 52585 53314 48667 34402 30285 27563 20263 -4029 -6709 -10276 3328 12676 7858 -4102 10165
13391 10165 17510 22824 38890 16055 -7230 -16234 -22279 1076 14651 13487 19261 20558 4605
13378 4605 12982 33229 29363 39644 37493 23198 4346 73 24865 32218 39928 34549 37335
13365C7335J3555r63k665l2787j1541n479P260K5304J4316k4351j1801j3030R406
13352D559K8441J1162k229j0380j8222j2579l840L744J4315K2749j2362M137l815
13339B5680p669r32j9259j6303j8868K3152K4880J5359R55k830N616j583m450
13326B3748j3262J0792n343j2052j1012J0332K1874J6333j4188j567m635p899
13314A3121j139j3557j0609K0424o545j574j6857J929K2187K0268Q432o962r841
13301A9277J3829J526j2827p567j0568n734j3631M276J0680M966j9424k394J7701
13288A10K6369Q768J047O708J0362j9875j8512P482J2572p485r416o819J651K24
13274A3186n00K5920o052j4741j5510m910K3589J6360k8336l920J701j2596o87
$$ plain form
13365 37335 50890 49927 47262 14475 2934 -2545 4715 30019 44335 19984 8183 -4847 4559
13352 4559 33000 44162 41933 31553 13331 752 -3088 656 14971 37720 25358 29495 25680
13339 25680 18011 17079 -2180 -18483 -37351 -14199 10681 26040 26995 24165 29781 28198 23748
13326 23748 10486 21278 15935 3883 -7129 3203 25077 41410 27222 25655 21020 13121
13314 13121 11982 -1575 -12184 8240 1695 121 -16736 -14807 7380 27648 36080 29118 19277
13301 19277 33106 34632 21805 14238 3670 -2064 -15695 -11419 -739 4227 -15197 -17591 110
13288 110 26479 35247 36294 43002 53364 33489 14977 22459 35031 27546 18130 11311 12962 13186
13274 13186 12686 38606 32554 17813 2303 -2607 20982 37342 9006 5086 6787 -5809 -6496
13261f496J1106l024j0426J5748Q103J4583j291j2566J5576J9373k0679r235n786
13248A4986R262m82j4164k0825Q646R226R45j0487O081J3500J708m871j4760o756
13234g991j3984J3498L125l527J6085N057j2093L623K1639K4750k97P61M193m516
13220E0323n49l13l473L342j4887o218L37L434j5550r017O024K6611p846l87j465
13205C0366M402j750q042N06j0925j3813K2505K6210j418j4307M899J321M040
13192D3994k3070p973O346P522P759l216K45J8080J4773j0608m863k4067j9254
13179E668m263J8842Q394j4191n838M349k3321O159L0754J0048L573L356J0443
13166E3973j6215j5941j286N846M174J1063j543J524P917p20j4271j3986o294
$$ plain form
13261 -6496 4610 1586 -8840 6908 15011 29594 28303 15737 31313 50686 30007 20772 14986
13248 14986 24248 23766 9602 -11223 -2577 6649 7594 -2893 3188 16688 18396 13525 -1235 -7991
13234 -7991 -21975 -8477 -5352 -8879 7206 12263 170 3793 25432 50182 49885 50646 54839 50323
13220 50323 49774 49461 45988 49330 34443 28225 28562 31996 16446 7429 13453 40064 32218 31831 30366
13205 30366 34768 33018 24976 25482 14557 744 23249 49459 48041 33734 38633 39954 43994
13192 43994 20924 12951 19297 26819 34578 31362 31607 49687 64460 53852 48989 24922 5668
13179 5668 1405 20247 28641 14450 8612 12961 -10360 -4201 26553 36601 40174 43530 53973
13166 53973 37758 21817 20531 26377 30551 41614 40071 41595 49512 48792 34521 20535 14241
13153A4241J6958J1381o829J4207L356m918k985o275q077J1166J7378o505m912
13140D8186m733J3579l584j193p337j0952j7103J1702r72R988J5763P765R21P500
13126F9530k1111R91k7508k9457P503M0442J2557j0186J1743K0228j4469m4311
13114A5952m909R835j3049O101P589J013P044J7115o013K033Q786J8810J7493
13101H7800j1084j5270l1429P954K280k9112J1838O387O418l205R006J952N249
13088D8784J38L016J3173r259k1822j8399l151K0063J8687N605j2662n864q433
13075B9876k3068r51R269K6969K1025M545j2806k4942j8509P454K3854J2374j9424
13062C5666j9154j5402j6820M866J5057J4791N278O498r087R498J6221l25N235
$$ plain form
13153 14241 31199 42580 35751 49958 53314 48396 45411 39136 31059 42225 59603 53098 48186
13140 48186 43453 57032 53448 52255 44918 33966 16863 28565 27593 37581 53344 61109 62030 69530
13126 69530 48419 49410 21902 -7555 -52 40390 52947 42761 54504 74732 60263 15952
13114 15952 11043 20878 7829 13930 21519 22532 29576 46691 40678 42711 51497 70307 87800
13101 87800 76716 61446 30017 37971 40251 11139 22977 29364 35782 32577 41583 43535 48784
13088 48784 48922 51938 65111 55852 34030 15631 12480 32543 51230 56835 44173 38309 29876
13075 29876 6808 5857 15126 42095 63120 67665 54859 29917 11408 18862 42716 55090 35666
13062 35666 16512 1110 -15710 -10844 4213 19004 24282 30780 21693 31191 47412 47087 52322
13049E2322o524M716J5749m112r068K7914J2986j5770j8010J2976K3096K890k8569
13036G0596k738m780J4219J2915p074p177O68P734j338j752J4214J0564q396N365
13022A03020L1634L641n230J4495K6904L8351N4360P1963J05672J79779K33999
13011H58588K37566K46782J49689O2791k9570j57156j89954j71139j68803j52980
13001F85814j34165q3591o4391n7502l5441l7569j6088j2946l5267k6266q070
12990A74518k6184l337L674J937p927o567j0292q762L409j0849j6441k3219M818
12977G4778J4951R19R61j6189j1386J7101O274J038l3901q152J7830J7471q8Q012
12963H9619j1054l953j4310P399J6935J4647j581j6303q342j0221j9642j7602
$$ plain form
13049 52322 45798 50514 66263 62151 53083 80997 93983 78213 60203 73179 96275 99165 70596
13036 70596 67858 63078 77297 90212 83138 75961 76629 84363 83025 81273 95487 106051 97655 103020
13022 103020 134654 138295 133065 147560 174464 212815 267175 339138 444810 624589 858588
13011 858588 1096154 1342936 1492625 1555416 1525846 1368690 1178736 1007597 838794 685814
13001 685814 551649 468058 403667 346165 310724 273155 257067 244121 208854 182588 174518
12990 174518 148334 144997 148671 150608 142681 136114 125822 117060 120469 109620 93179 69960 74778
12977 74778 89729 90648 91609 75420 64034 81135 87409 88447 54546 46394 64224 81695 81607 89619
12963 89619 78565 74612 60302 67701 84636 99283 97702 81399 73057 62836 43194 25592
12951B5592J3394L4226l980m124J1740K0643N319r13k3417k8645j8458J3201R357
12938E3935M726M501j2230P852M228J7306j359M236p588m213m4j1453p159R043
12924F1781J7671j8695p928M707l246K231J3400k158o123J3577k4445j7243J9005
12911E2534K4538K72M611L881o418k025O209j1732j2277M32K6635o669l7189J3085
12897E5887K5451K942o619K5657j0185j5309k0460r871J0694M20O492M421j1302
12884E8218j010K5385l540l912J1827P402R733J1528q213K055K881J3264J0191
12871A35809P901l035J4608J065j3821q424j1648Q58q11J0597J8957r100m2268
12858A00688j3096J3027p121L563J4727M076j271M578Q369p896r119O705P371
$$ plain form
12951 25592 38986 73212 69232 65108 76848 97491 102810 101897 78480 49835 31377 44578 53935
12938 53935 58661 63162 50932 58784 63012 80318 78959 83195 75607 71394 71350 59897 52738 61781
12924 61781 79452 60757 52829 57536 54290 56521 69921 67763 61640 75217 50772 33529 52534
12911 52534 77072 77344 81955 85836 79418 77393 83602 71870 59593 60025 86660 79991 42802 55887
12897 55887 81338 84280 77661 103318 93133 77824 57364 47493 58187 58607 65099 69520 58218
12884 58218 57208 82593 79053 75141 86968 94370 104103 115631 107418 109473 112354 125618 135809
12871 135809 143710 140675 155283 156348 142527 134103 122455 123313 122502 133099 152056 142956 100688
12858 100688 87592 100619 93498 97061 111788 115864 114593 119171 127540 119644 110525 117230 124601
12845A24601O45j0799J8666J1933j8892k6346m555K5650K9686K0929j349j3655
12833A56514k031j8070k046L0238N515Q110k599L091J4551K710L0438J9623p656
12820B38388K3762J8643m62j6291n390j3643J150J3465J2706r982k1984p974m2339
12807A90049r512L450m983j7726k2695M230J0172l414Q284j647k1234j2222N0
12794A22802J1551j4492J0215K1835j0479N174M390j1397R217l16n005J3603R104
12781A66202L1737K2042o275N532R926J3468L715J1558m130j2739r895J4480n743
12768B39878j5943k886j3920Q777K4297J9088J4378J6271L719j1437n4733q0590
12756A46899r5948r5628p6906k4775m391Q805K3002K4546M5321K0538L120l498
$$ plain form
12845 124601 125246 114447 133113 145046 126154 99808 95253 120903 150589 171518 170169 156514
12833 156514 154483 136413 134367 164605 170120 178230 175631 178722 193273 195983 226421 246044 238388
12820 238388 262150 280793 280331 264040 258650 245007 246157 259622 272328 262346 240362 232388 190049
12807 190049 180537 183987 179004 161278 138583 142813 152985 149571 157855 156208 134974 122752 122802
12794 122802 134353 119861 130076 151911 141432 146606 150996 139599 148816 148500 143495 157098 166202
12781 166202 197939 219981 213706 219238 229164 242632 246347 257905 253775 241036 231141 245621 239878
12768 239878 223935 221049 207129 215906 240203 259291 273669 289940 293659 282222 227489 146899
12756 146899 50951 -44677 -121583 -146358 -150749 -141944 -118942 -94396 -49075 -28537 -25417 -28915
12744b8915K8650J9838N283J373n2J4755K0987k4427j952J8040P77j9355J0340
12731D5342L754J5745L4262L1023K0071m034K352J9186Q245n288o317k1045j7917
12718A25379J0675P608r098r834O253R550J97J8978K6570L0496J3409j1556J0392
12705B29019J7603J3058k063p49j168K0941J0532K763J2142L8024M9214L5296
12693D24612K6113L2007J3636k648N041q595M117l21r025q581L320O79m834k69
12679D75252Q878K7622j147j8038j7060l1202k922l152K2972K4540n272j1832
12667D68639L233k554J7242J3157K219L1190K8161Q394o03j8393j8038j3591J9078
12654E38134K0490j3312R625l9J4680J4717N891m578J3855K4481K2942J5345P577
$$ plain form
12744 -28915 -265 19573 24856 26229 26177 40932 61919 37492 35540 53580 54357 35002 45342
12731 45342 49096 64841 99103 130126 150197 146163 148515 167701 175946 170658 164341 143296 125379
12718 125379 136054 143662 134564 124730 130983 140533 140730 159708 186278 216774 230183 218627 229019
12705 229019 246622 259680 257617 256868 255700 276641 287173 289936 302078 340102 389316 424612
12693 424612 450725 482732 496368 493720 498761 490166 494283 493962 484937 476356 479676 480355 475521 475252
12679 475252 484130 511752 510605 492567 475507 444305 441383 438231 461203 485743 480471 468639
12667 468639 471872 469318 486560 499717 501936 533126 561287 569681 569078 550685 532647 519056 538134
12654 538134 558624 545312 554937 554898 569578 584295 590186 585608 599463 623944 646886 662231 669808
12641F69808J4706J8087N847J4900L0006J6035O056J269R051K3558J6059L239
12629H28621l568J5827N0226N1767K6676J2277L3843N4159K9497K1195M2010O4826
12617A227356P4119M8808O2690N9984O6802N4981Q1736Q6843N3888R7284Q6141
12606B000632J01190J25174J18376J23741J30210J34274J44421J09630J38350
12597C125998J57793J50483J56418J79269K39311K49080K79971L27036L47267
12588E212626L70238M30651N20140N96493O75336P79488Q83536J064989J348176
12579A1881673J750569K179648K693944L283522M053766N195514O972308J0096650
12571D8107594J5605969K5087139L8286503M7192661N1137234M4728649K4917516
$$ plain form
12641 669808 684514 702601 708448 723348 753354 769389 775445 776714 785765 809323 825382 828621
12629 828621 825053 840880 891106 942873 969549 981826 1015669 1069828 1099325 1120520 1162530 1227356
12617 1227356 1301475 1350283 1412973 1472957 1539759 1594740 1676476 1763319 1817207 1914491 2000632
12606 2000632 2101822 2226996 2345372 2469113 2599323 2733597 2878018 2987648 3125998
12597 3125998 3283791 3434274 3590692 3769961 4009272 4258352 4538323 4865359 5212626
12588 5212626 5582864 6013515 6533655 7130148 7805484 8584972 9468508 10533497 11881673
12579 11881673 13632242 15811890 18505834 21789356 25843122 31038636 38010944 48107594
12571 48107594 63713563 88800702 127087205 174279866 225417100 270145749 295063265
12564B95063265N538761j7878195l3206588l8848939l8220310l2795443k6047235
12557A13605316k0788718j6158408j2239030r472459p568522o204100n156822
12550C6017257m305701l650133l052316k569092k219858j877818j608982j420040
12542A5313317j253956j118196j019987r14382p96873p06669o31657n57560m95706
12533G818331m28383l79413l09055k43263j65789m0548J63667L86857N05867N12618
12523G820889K86165j5835l70451o61889p75773q07068p18030n37259m42600l80554
12513C397595k72318k23678k02689j62672j64027j42985r9370r4276r5201q2218
12503A858161o8346p3761l9539j6951L873K8083Q260j3608n1851o2258j10164
$$ plain form
12564 295063265 300602026 282723831 249517243 210668304 172447994 139652551 113605316
12557 113605316 92816598 76658190 64419160 54946701 47378179 41174079 36017257
12550 36017257 31711556 28061423 25009107 22440015 20220157 18342339 16733357 15313317
12542 15313317 14059361 12941165 11921178 11006796 10209923 9503254 8871597 8314037 7818331
12533 7818331 7389948 7010535 6701480 6458217 6292428 6251880 6415547 6802404 7308271 7820889
12523 7820889 8107054 8091219 7720768 7058879 6283106 5476038 4758008 4220749 3778149 3397595
12513 3397595 3125277 2901599 2698910 2536238 2372211 2229226 2129856 2035580 1940379 1858161
12503 1858161 1789815 1716054 1676515 1659564 1663437 1691520 1699780 1686172 1634321 1572063 1461899
12492A461899j24782j11625q0342p2558l9398l6991o5843o2566k4707j7679l5364
12481G90044r175R652j1517q072r496k2889l5338l1900l2604P400l045j8129k6399
12468E98532l9011k3429k7900P371l824l1355l7158j7676Q451j3510j8996J5166
12456D16661N573j9520j2753n52J1374j4006l0837k6763Q957N131k0771j2370
12444C10124r394J1260L014N00J2104K4480K9309J5274K768l816J1704l290l1609
12431C72428l0889j6541p763J9187J1247Q307k9501k1451m190q548M42j3043P015
12418B86700n507j813L293n120K67R005m62K991M291l6179j1061K040j2647k6963
12404B08835J1539j6322l3511J432P166K0100J7146N787O941P781r341k223J4386
$$ plain form
12492 1461899 1337117 1225492 1145150 1072592 1033194 996203 930360 867794 843087 825408 790044
12481 790044 780869 790521 779004 770932 761436 738547 703209 671309 638705 646105 643060 624931 598532
12468 598532 559521 536092 508192 515563 511739 480384 443226 425550 434001 420491 401495 416661
12456 416661 422234 402714 389961 389409 400783 386777 355940 329177 338134 343265 322494 310124
12444 310124 300730 311990 315004 315504 327608 352088 381397 396671 399439 395623 407327 404037 372428
12431 372428 341539 324998 317235 336422 347669 355976 326475 305024 300834 292286 292728 279685 286700
12418 286700 281193 279380 282673 277553 277820 286825 286363 289354 293645 257466 246405 248445 235798 208835
12404 208835 220374 204052 170541 171973 179139 199239 216385 222172 229113 236894 227553 225330 239716
12391B39716J0665n435j3803m226J6681K0844J1006J8496J7901M3080O1131M3630
12379D59686M2009J3393M0284m312m2284m8619q5620r2925n4897l660K7026J5988
12367B66069Q06r772k1773j0605l8095k7214l2895k0748k1825j9308o897Q96j7209
12354D1430k6536j8260q034j3414j986J766O409J6700M176J1043j1998m823P931
12341D404J0789K845K924J0511R246M102O521j222J0386o911p765Q144j6921o965
12327C0088K4697j5303j6962J6373k0413j3356j5883j1329J2359K5529j3257O836
12315I379J114j0210O541L2666O915j893J1640J729K5826p264k1810N277r736
12302E0174l2705R645l196j8430K702J8247Q126K0023J9963J8685J3125r133k1214
$$ plain form
12391 239716 250381 244946 231143 226917 243598 264442 275448 293944 311845 354925 416056 459686
12379 459686 501695 515088 555372 551060 508776 460157 374537 281612 226715 223055 250081 266069
12367 266069 266875 257103 235330 224725 186630 159416 126521 105773 83948 64640 57743 58639 41430
12354 41430 14894 -3366 -11400 -24814 -26800 -25034 -18625 -1925 2251 13294 1296 -3527 4404
12341 4404 15193 18038 20962 31473 40719 44821 51342 50120 60506 53595 45830 53974 37053 30088
12327 30088 54785 39482 22520 38893 18480 5124 -10759 -22088 -9729 15800 2543 9379
12315 9379 10493 283 6824 39490 46405 44512 56152 57881 83707 76443 54633 59910 50174
12302 50174 17469 27114 23918 5488 8190 26437 34563 54586 74549 93234 106359 97226 76012
12289G6012o718j8709M564N913j6323K872J7468J56j9739J2640Q390j2150m885
12276D9491J0603L980j526m352R675j379o978l630l4983J406K379j7814L143O40
12262A0655j5691j3248L002K3084N864j3570J3139k011n766k210l985J4594j88
12249A3669j1311j5075q786J1936J5223n388N063j2693N312R20l597J4986J3973
12236B4232R022J9326r475K207K1058L063l869j1378qJ063L584j1075j2617j747
12222C3386J8345J801k1458j1691L876J3297J7000j5026q960o033n800Q901Q188
12209C5826q364p437p392n982j9497O627K1743J0308k949O198n760j5435j984
12196E902j1451K9217J6741j2709Q000R824M505P237j3046r427J547l317o972
$$ plain form
12289 76012 69294 50585 55149 61062 44739 47611 65079 65235 45496 58136 66526 54376 49491
12276 49491 60094 64074 62548 58196 67871 66492 59514 55884 20901 22307 24686 6872 10015 10655
12262 10655 -5036 -18284 -15282 7802 13666 96 13235 11224 5458 3248 -737 13857 13669
12249 13669 2358 -12717 -21503 -9567 5656 268 5331 -7362 -2050 -1130 -4727 10259 24232
12236 24232 33254 52580 43105 45312 66370 69433 65564 54186 54178 55241 58825 47750 35133 33386
12222 33386 51731 53532 32074 20383 24259 37556 54556 39530 30570 24537 18737 27638 35826
12209 35826 27462 20025 12633 6651 -12846 -6219 15524 25832 22883 29081 23321 7886 5902
12196 5902 -5549 23668 40409 27700 35700 45524 50029 57266 44220 34793 36340 33023 26051
12183B6051J807q176j4924P710M913j2911J6899J7610j0738j8612J0698J4173
12171C4500j6298m278j0421o169J1r613L71K2780J2593R617M957J3351N090j5248
12157D1243k3424j5159J1677N541M76M186r637p09O258J2691k079j3667J4018
12144C1415J0832j5599q534J3686q68k759J0361k440J2960K4743J4727J588m166
12131H5946p328L296J8002L555K946J4371K7223M3416L9753J7356L8547J00260
12119C87343J43449K11339K54219K50791K22484J06581j0644j21894j94364j85920
12109A063384j85937j54151j11961r7372m7145l7468l9877l3986k1447n8090n9794
12098B16156m9999R464K497k2376k5667j6504O769r184o968j204k4844l3489q322
$$ plain form
12183 26051 27858 19682 4758 12468 17381 4470 21369 38979 28241 9629 20327 34500
12171 34500 18202 13924 3503 -2666 -2655 -12268 -11897 10883 23476 33093 38050 51401 56491 41243
12157 41243 17819 2660 14337 19878 20354 24540 14903 14194 20452 33143 31064 17397 31415
12144 31415 42247 26648 18114 31800 30932 28173 38534 36094 49054 73797 88524 90112 85946
12131 85946 78618 81914 99916 103471 106417 120788 148011 191427 231180 248536 287083 387343
12119 387343 530792 742131 996350 1247141 1469625 1576206 1565562 1443668 1249304 1063384
12109 1063384 877447 723296 611335 513963 466818 429350 389473 355487 334040 275950 216156
12098 216156 166157 175621 178118 155742 130075 113571 120340 111156 104188 102984 78140 44651 36329
12085C6329J2400k567n722m266n384N062J3897O011q96J618m352j7846j3396K0380
12071D1268P704N469O64j8544n221m292j4405R135K0073n040k1956O835J8024
12058C9714j125k6666j5960J6152K0541j0889j2333P69j6238L004J1012J61j6226
12045h084M426K0123M937q510J1514J3405l979M474n464j8790r330k290N764p294
12031I02K204J3104P809K850j732j0365j7844J696Q855j1091K4246J4629k4586
12018A0677r918J6005K2432m41j4310o671j8329m369P837j948k073r467n859J113
12004a5321J6928K217N502O848N966Q273j417p903k3569r724l417P446N559R992
11990G380J4544k906L152p412j7571Q55J993N474M974J1230N363j076J2183j2453
$$ plain form
12085 36329 48729 46162 40440 36174 30790 35852 49749 55760 54864 56482 52130 34284 20888 41268
12071 41268 48972 54441 55105 36561 31340 27048 12643 21778 41851 36811 14855 21690 39714
12058 39714 38589 11923 -4037 12115 32656 21767 9434 10203 -6035 -3031 7981 8142 -8084
12045 -8084 -3658 16465 21402 12892 24406 37811 33832 38306 32842 14052 4722 2432 8196 902
12031 902 3106 16210 24019 26869 25137 14772 -3072 -1376 7479 -3612 20634 35263 10677
12018 10677 759 16764 39196 38755 24445 17774 -555 -4924 2913 965 -1108 -10575 -16434 -15321
12004 -15321 1607 3824 9326 16174 22140 30413 28996 21093 -2476 -12200 -15617 -8171 -2612 7380
11990 7380 21924 19018 22170 14758 -2813 -1958 35 5509 10483 21713 27076 26000 38183 25730
11976B5730j4450j0464m041J9324J7330J6107q249j5666l55m661q313J149K928
11963A6369j3463j3448O921q315k2559r454o007P424J1478J1414R187r451j3158
11950c3062q436N879J7242J3385k040N891Q365j556Q342k391j6793q470K0628
11937F984K5327O816j6320j6942o752j1373M423J9717j1182j081n599p577j4827
11924b8386N922J2872O837O98K381N887j5951M656K3367K524k1618m135j3828
11911a8774m97J7704j897J9458J3904J7321m822k1407R35J8768o251j5657l396
11898A5389o650o190k4656Q62M080R449j1390M812K967N998J2237K3541J2364
11885D2813k8328k4658M8K0434J6050J246k166M03k1069l977M676j1376j9627
$$ plain form
11976 25730 11280 816 -3225 16099 33429 49536 41287 25621 25266 20605 12292 13441 16369
11963 16369 2906 -10542 -3621 -11936 -34495 -43949 -49956 -42532 -31054 -19640 -10453 -19904 -33062
11950 -33062 -41498 -35619 -18377 -4992 -7032 -1141 7224 5668 14010 11619 -5174 -13644 6984
11937 6984 32311 39127 22807 5865 -887 -12260 -7837 11880 698 -383 -5982 -13559 -28386
11924 -28386 -22464 -9592 -2755 -2057 324 6211 -9740 -5084 18283 20807 -811 -4946 -18774
11911 -18774 -19271 -1567 -3464 15994 29898 47219 42397 20990 21925 40693 34442 18785 15389
11898 15389 8739 2549 -22107 -21245 -17165 -7716 -19106 -14294 -11327 -5329 6908 30449 42813
11885 42813 14485 -10173 -10125 10309 26359 27605 25439 25842 4773 796 5472 -5904 -25531
11872b5531K344J4940J6591j335j7863L750o111J469K348L3036J3967m188j5426
11859A7991J850K3325P710j1413o636p740j4139k1811j0790L3072K4727J2515
11847D8661j3893l632l694j656j2112j3365N417K375K502j2571j0536o606Q132
11834a0978J3303m085j1846J087J0407M533J1198j1935n163q442O137j1466k398
11821a9648L842j375o542N231n12j638J7880N198o922N953J2577k772J7997J3708
11807D2977j3214j4324n458k2762n043L0586K632k3195M02J1332J5491K851J436
11794B3711p271J379N375j1882k1777K436n78j0666m274O807k25n362j021J2044
11780a1304l427o425J1180J3015q456j4446K328q824J850K0738K4050P034j4369
$$ plain form
11872 -25531 -23187 -8247 8344 7009 -10854 -7104 -13215 -11746 -9398 23638 37605 33417 17991
11859 17991 19841 43166 50876 39463 32827 25087 10948 -10863 -21653 11419 36146 48661
11847 48661 34768 31136 27442 25786 13674 309 5726 8101 10603 -1968 -12504 -19110 -10978
11834 -10978 2325 -1760 -13606 -12519 -2112 2421 13619 1684 -3479 -11921 -5784 -17250 -19648
11821 -19648 -15806 -17181 -23723 -18492 -19004 -20642 -2762 2436 -4486 1467 14044 11272 29269 42977
11807 42977 29763 15439 9981 -12781 -17824 12762 15394 -7801 -7399 3933 19424 22275 23711
11794 23711 16440 17819 23194 11312 -10465 -8029 -8607 -19273 -23547 -16740 -16965 -22327 -23348 -11304
11780 -11304 -14731 -21156 -9976 3039 -5417 -19863 -17535 -26359 -24509 -3771 20279 27313 12944
11767A2944l2884j8969O843J4601J8505J4423o783M909K5855k022o598N951j0101
11754B6674l2751P479J140jK765K3128M645j8961l081J2417j2999j1668p299J8233
11740I721M065k955O732N88j8628L93l005L286j0952j0313l59M894J2884K2082
11726A8433R373r282k2262r612l561N528R159j1731j899P976M81j280L528Q905
11712C756j037j071J3664o818j7655j9958O362M410L812K1863j055k2768p869
11699b4364K0697J6003j3451j3017J2025K733k2269j8196j256M432K1473Q366
11687f824J4070J7030J1731m798k0889l254K7789O798j9797q502J126J3591J2078
11674D0149j4619k9359N557J0936O618J292p317j5938j0381j115Q750m798j2205
$$ plain form
11767 12944 -19940 -38909 -32066 -17465 1040 15463 8680 13589 39444 37422 30824 36775 26674
11754 26674 -6077 1402 2542 2541 5306 28434 33079 14118 11037 23454 10455 -1213 -8512 9721
11740 9721 13786 10831 17563 18151 -477 -84 -3089 197 -10755 -21068 -21427 -16533 -3649 18433
11726 18433 27806 18524 -3738 -13350 -16911 -11383 -2224 -13955 -15854 -7878 -7397 -8677 -5149 3756
11712 3756 2719 1648 15312 8494 -9161 -29119 -22757 -18347 -14535 7328 6273 -16495 -24364
11699 -24364 -3667 12336 -1115 -14132 -2107 626 -21643 -39839 -41095 -36663 -15190 -6824
11687 -6824 7246 24276 36007 31209 10320 7066 34855 41653 21856 13354 14480 28071 40149
11674 40149 25530 -3829 1728 12664 19282 20574 13257 -2681 -13062 -14177 -5427 -10225 -22430
11661b2430n989M2072K1550j717M00j0166k6095j0106k29J7744K070j16j4566
11648g578N051R59j8670Q279J458P017J2057O925j515k3212J014K007q20k374
11634i402J2189K864q030r440j2720K675J1131J3539P552M834j3574m300O675
11621C993M765L351j2407j4803j8973j1898N035L1704J0232k679j873k196j18
11608e867r344q046M3P595K4333J4520J107L714o506O780r882K447J8336j2008
11594B7222p287l450p914j1941O639j0009J1460k804j7547r07J9009n285J3029
11581A0215j968j4289k0089O635J165J409K3167m00J4214J2627N283j4701L363
11568B6631O659r736l9036L368M241k7293j887K7152J0329j8555j4230n87P987
$$ plain form
11661 -22430 -28419 13653 35203 33486 33886 23720 -2375 -12481 -12710 5034 7104 6988 -7578
11648 -7578 -2527 -1568 -20238 -11959 -10501 -3484 8573 15498 13983 -9229 -8215 -6208 -7028 -9402
11634 -9402 2787 5651 -2379 -11819 -24539 -21864 -10733 2806 10358 15192 1618 -2682 3993
11621 3993 8758 12109 -298 -15101 -34074 -45972 -40937 -9233 999 -1680 -3553 -5749 -5867
11608 -5867 -15211 -23257 -23214 -15619 8714 23234 24341 28055 21549 28329 18447 20894 39230 27222
11594 27222 19935 16485 8571 -3370 3269 -6740 4720 1916 -15631 -16538 2471 -2814 10215
11581 10215 8247 -6042 -26131 -19496 -18331 -16922 6245 5845 20059 32686 37969 23268 26631
11568 26631 33290 23554 -15482 -12114 -7873 -35166 -37053 -9901 428 -18127 -32357 -32944 -24957
11555b4957O176m858J1532K575K430j9449j3598K8012m07N478k19o586p275O088
11541a5058j004j9915r571P738J3603J4332M676L380J317K4750L546k0253j3852
11528f311J1688j05j691j9284K034m531J351J6038P399P404j9228l508J1933J0689
11514A3878K72o057p695J1457Q691r929m94q406J3462J630j3446R358Q943j2613
11500I051k5785Q043O373J4338J8977R364J5556k6303l163J8173p876j1063k6155
11487d70k991J2132J839J206j1432J5915J438k4504r03L227L104Q573r587J0177
11473G724K842m187j1326K5536L53o96J1152L073N192j3362M7J4504j4264j4789
11459A1799p416K2446J668l0942j0622j048L560M971P006p608M383J0290m417
$$ plain form
11555 -24957 -18781 -23639 -12107 -9532 -7102 -26551 -40149 -12137 -12544 -7066 -7285 -13871 -21146 -15058
11541 -15058 -16062 -35977 -45548 -37810 -24207 -9875 -5199 -1819 -502 24248 27794 7541 -6311
11528 -6311 5377 5272 3581 -15703 -13669 -18200 -16849 -811 6588 13992 -5236 -8744 3189 13878
11514 13878 14150 8093 398 11855 20546 10617 10123 1717 15179 16809 3363 12721 21664 9051
11500 9051 -16734 -8691 -2318 12020 30997 40361 55917 29614 26451 44624 36748 25685 -470
11487 -470 -3461 8671 10510 11716 284 16199 17637 -6867 -7770 -4543 -1439 7134 -2453 7724
11473 7724 10566 6379 -4947 20589 20942 20246 31398 34471 39663 26301 26348 40852 26588 11799
11459 11799 4383 26829 28497 -2445 -13067 -14115 -10555 -5584 1422 -6186 -1803 8487 4070
11446D070O884J0953j1456n92q181R83K3634j50j1749j6820j1012j3012q006M135
11432c0319K5854K2620O717R334j1973k9760p087j6309j6241j514J0006K1809
11420a6863J0261J7349J3396l912r742K208K0491K486j2827n562k0827j2222j865
11407a7629N646o956N838J6845N094j2606R607n530j5582P92K0656O773O958j8557
11393A349O348N982j1817J022K4334K375j457j660p10j4481j4128j1745j2749
11380b7337K4617N745O985L701J8462l318r000j6461k3422q594J5260n78q745
11367b2685L59Q481J4549N454J0289n309j8390j3348K2651J5705l2116j9028J0985
11354b2403R80N509p068J7953K3570k057k366j6781j4199q832J6881J7310J1111
$$ plain form
11446 4070 10954 21907 10451 9859 1678 2661 26295 26145 14396 -2424 -13436 -26448 -34454 -30319
11432 -30319 -4465 18155 24872 34206 22233 -7527 -14614 -30923 -47164 -48678 -38672 -16863
11420 -16863 -6602 10747 24143 20231 10489 12697 33188 35674 22847 17285 -3542 -15764 -17629
11407 -17629 -11983 -18939 -13101 3744 8838 -3768 5839 309 -15273 -14481 6175 12948 19906 1349
11393 1349 7697 13679 1862 2884 27218 29593 28136 26476 25766 11285 -2843 -14588 -27337
11380 -27337 -2720 3025 10010 13711 32173 28855 19855 3394 -20028 -28622 -13362 -13940 -22685
11367 -22685 -22326 -13845 704 6158 16447 11138 -7252 -20600 2051 17756 -14360 -33388 -22403
11354 -22403 -21423 -15914 -22982 -5029 18541 16484 14118 -2663 -16862 -25694 -8813 8497 19608
11341A9608k3275j89j872j1753J2892J0423k0401q076Q502J8948J513k0106m417
11328a8203j9792J6113J8330j054l683O36P957j8719k4486J5839K6020j2272p066
11315b0380j5525J0037K4475l636J2725K1420k243K067m689q884R09J2940q910
11302B0306l5245o552K7218J9446j274j3531K6962K0060J4814J6887M1064P1332
11290B01487N4402J1354j2273k8982k7508n5802m1182o340j5452r998k6234j3782
11278B9690J2258j642j7694R9J9005j6073k7070K227p95N656n92J993J0060P495
11264B4617k877J9657K1697L0845N5627N4952M9524L1544n233l8224n0519j9408
11252A72202k5750l0223l0014o042L901k8174r825m885n84k526Q496k147Q270
$$ plain form
11341 19608 -3667 -3856 -5728 -17481 -4589 5834 -14567 -22643 -14141 4807 6320 -13786 -18203
11328 -18203 -37995 -21882 -3552 -4606 -8289 -7653 304 -18415 -42901 -27062 -1042 -13314 -20380
11315 -20380 -35905 -25868 -1393 -5029 7696 29116 26873 28940 24251 15367 16276 29216 20306
11302 20306 -14939 -21491 5727 25173 23899 10368 37330 57390 72204 89091 130155 201487
11290 201487 255889 267243 254970 225988 198480 142678 101496 95156 79704 69706 43472 29690
11278 29690 41948 40306 22612 22711 41716 25643 -1427 800 5 5661 5069 7062 17122 24617
11264 24617 21740 41397 63094 93939 149566 204518 254042 285586 280353 242129 191610 172202
11252 172202 146452 116229 86215 80173 84074 55900 46075 41190 40606 38080 46576 44429 52699
11239E2699P830L88j0667J2636j3410m6395j3266J9656k4979j5774K2473j4362
11227b3171J3535N753o304K2455K1161n826l2814p754j0680j156J2915r621o372
11214b7879J5331N337Q663P795O367K106Q572j8556j1676K099M928l690r114J2202
11200B485l075p109p539J6971K3291j2854k4508j6134J1312R402L891K236P163
11187E532j305p66j2387J9302j787j0291Q116J794j7819j2245l718P312J1903
11174f359P098J3431k2041o498L448q727K8312O049q500j3980j686L622r203K2002
11160F968J790P41q486N390j856k0700j5486J7439L3408K3537j9492j0441j9017
11147f205J0953K327j3710r880Q068j914J1543o971k859Q810o258j5110q620p044
$$ plain form
11239 52699 60529 60917 50250 62886 49476 3081 -10185 9471 -15508 -31282 -8809 -23171
11227 -23171 -9636 -3883 -10187 12268 33429 27603 -5211 -12965 -23645 -24801 -11886 -21507 -27879
11214 -27879 -12548 -7211 1452 9247 15614 17720 26292 7736 -3940 -1841 3087 -603 -9717 2485
11200 2485 -590 -7699 -15238 1733 25024 12170 -12338 -28472 -17160 -7758 -3867 -1631 5532
11187 5532 4227 3461 -8926 10376 8589 -1702 6414 8208 -9611 -21856 -25574 -18262 -6359
11174 -6359 739 14170 -7871 -14369 -10921 -19648 8664 14713 6213 -7767 -9453 -5831 -15034 6968
11160 6968 8758 9499 1013 6403 4547 -16153 -31639 -14200 19208 42745 23253 12812 -6205
11147 -6205 4748 7075 -6635 -16515 -8447 -10361 1182 -5789 -8648 162 -6096 -21206 -29826 -36870
11133c6870J3057r237K484L391J3589O753j0467j3500M404L089O935J5796Q786
11120H210K390r838J8086k090n227p428M69O73K746J4138r859K071N569n322q844
11105E744j0440R887p323r828J5144j0676r269K320L501L098p847L063K1703M754
11091A3831J1063J4285O369K317k1752l2309k1609j0586J3522L9479J1823j7253
11079I180j4595j1596j184K6510K0880N561n055j6720Q324j0513o980j7177k0181
11066c3546P968K3443J8143k421k1469q425q218J0226P158k4033n320L1240j383
11053f637k599j1218J5353R098j5001J820J4483N067l150n804o423L882J1580
11040A0451j355q15J2492j4245k0477j4736j478r46K7525J9264j13Q481j0961
$$ plain form
11133 -36870 -23813 -33050 -30566 -27175 -13586 -6833 -17300 -30800 -26396 -23307 -16372 -576 8210
11120 8210 10600 762 18848 16758 11531 4103 4572 5245 7991 22129 12270 14341 19910 14588 5744
11105 5744 -4696 5191 -2132 -11960 3184 -7492 -16761 -14441 -10940 -7842 -15689 -12626 9077 13831
11091 13831 24894 39179 45548 47865 26113 -6196 -27805 -38391 -24869 14610 26433 9180
11079 9180 -5415 -17011 -18195 8315 29195 34756 29701 12981 21305 10792 3812 -13365 -33546
11066 -33546 -25578 -2135 16008 13587 -7882 -16307 -24525 -14299 -7141 -31174 -36494 -5254 -6637
11053 -6637 -9236 -20454 -5101 3997 -11004 -9184 5299 10366 7216 1412 -5011 -1129 10451
11040 10451 9096 8281 20773 6528 -13949 -28685 -30163 -31109 -3584 15680 15567 24048 13087
11027A3087k0840M775K4017j2621l3154l475K809L8806P128n651l954j5586j2475
11014a7134r357r926R861L937O165k869j3149J0666J0313O786p756n773j319R754
11000i801J1140P692n158p444o525K8216q35j322J2107k753k6456q862J7683j3035
10986e353j0246j2708N098K8948j2805l0937N5L1563J5828Q57j1457q725J8676
10973H794j1803o162l465R693J6755q15o039q60r008K862q423m311L1450N115
10959B3783j7266M811K769p914l804J0335P178j3452k5963J0991K2852N551P993
10946B7864M75j9568k1254k738r815J9145M874m488Q532m903p177K794o209k307
10932a4775R73J2157K0454r270j1936j4211j229o552j9341N190m120J3860M976
$$ plain form
11027 13087 -7753 -2978 21039 8418 -24736 -28211 -25402 13404 20532 14881 10927 -4659 -17134
11014 -17134 -26491 -36417 -26556 -22619 -16454 -19323 -32472 -21806 -11493 -4707 -12463 -18236 -19555 -9801
11000 -9801 1339 9031 3873 -3571 -10096 18120 17285 15963 28070 25317 -1139 -10001 7682 -5353
10986 -5353 -15599 -28307 -23209 5739 -7066 -38003 -37948 -6385 9443 10300 -1157 -9882 8794
10973 8794 -3009 -9171 -12636 -2943 13812 12997 6958 6098 -2910 -48 -8471 -12782 18668 23783
10959 23783 6517 11328 14097 6183 2379 12714 19892 6440 -19523 -8532 14320 19871 27864
10946 27864 28339 8771 -12483 -15221 -25036 -5891 -1017 -5505 3027 -1876 -9053 -6259 -12468 -14775
10932 -14775 -13802 -1645 18809 9539 -2397 -16608 -17837 -24389 -43730 -38540 -42660 -28800 -23824
10919b3824J4234o23m692j45N740Q886k4672j0198K5884J3000q596j4465m785
10906b4256K078J8130K1285Q95m508O01p755o046j5582o653M649q137L530J7071
10892d698Q359O110k335k314n712J611o102j5553N46J0597O196q339k5681J8664
10878a8651M1739q301K963J2092j5355r138m793k775r560o418R220M099M766L812
10864C700j6391o555J757J245O397O377j2841p61r50k469N050P090k100K059m506
10849a2898K3206k5627j2961J4049Q432J1889q856j6377l539O321J1686l531j5970
10836b4176k719j504j0148N016j0800J5676Q235k257M409j1980j4893J8056J47
10823b6938n334o009K6366J7535k1282m435L151J0281j2384r104r915J951L690
$$ plain form
10919 -23824 -9590 -10213 -14905 -15050 -9310 -424 -25096 -35294 -9410 3590 -5006 -19471 -24256
10906 -24256 -22178 -4048 17237 18132 13624 14225 6470 424 -15158 -21811 -17162 -25299 -21769 -4698
10892 -4698 3661 9771 7436 5122 -590 1021 -5081 -20634 -20088 -9491 -3295 -11634 -37315 -18651
10878 -18651 23088 14787 17750 29842 14487 5349 556 -2219 -11779 -18197 -8977 -4878 -112 3700
10864 3700 -12691 -19246 -17489 -16244 -9847 -3470 -16311 -17072 -18022 -20491 -15441 -8351 -10451 -8392 -12898
10849 -12898 10308 -15319 -28280 -14231 -5799 6090 -2766 -19143 -22682 -16361 -4675 -8206 -24176
10836 -24176 -26895 -28399 -38547 -33531 -44331 -28655 -20420 -22677 -18268 -30248 -45141 -27085 -26938
10823 -26938 -32272 -38281 -11915 5620 -15662 -20097 -16946 -6665 -19049 -28153 -38068 -36117 -32427
10810c2427p369j7122L600K1003J1138M931o636J3556M700J4712P966l471j2388
10797B193L298M2n107j0415m49l77J9402o014j5375J753k107J1309j7749k291
10783b1887J4799j0007m7J7801K712o781r461j8231J6068K1111l913j834K0592
10770B0922j17q211j0269Q760O560j6046j8344p222N087J2371J3921R024J0119
10757B6555q717j0917k7798J2171K1550J5867k031n887j6677M113J0933j0423
10745H739k6745J19K1894L3316j405k5813o610P647K346j0763j1710j8981r083
10732c7049k415Q849J4322k529k5315M919L8220R236j7214j2907l080j971O368
10719b0566J0762j0778k4585p172L2186L6392m158k8307J0250o199K8489K0993
$$ plain form
10810 -32427 -39796 -56918 -53318 -32315 -21177 -16246 -22882 -9326 -4626 10086 18052 14581 2193
10797 2193 5491 5533 426 -9989 -10438 -10815 8587 2573 -12802 -11049 -13156 -1847 -19596 -21887
10783 -21887 -7088 -17095 -17142 659 3371 -3410 -12871 -31102 -15034 6077 2164 330 20922
10770 20922 20805 12594 2325 11085 17645 1599 -16745 -23967 -18880 -6509 7412 16436 26555
10757 26555 17838 6921 -20877 -8706 12844 28711 26680 20793 4116 8229 19162 8739
10745 8739 -18006 -17887 4007 37323 35918 10105 3495 11142 13488 2725 -8985 -27966 -37049
10732 -37049 -39464 -30615 -16293 -18822 -44137 -39218 -998 8238 -8976 -21883 -24963 -26934 -20566
10719 -20566 -9804 -20582 -45167 -52339 -20153 16239 12081 -16226 -5976 -12175 16314 37307
10707C7307k8240l5185j6045J1796j6585r899J327J5338L6205J5892R361l720
10695A7552p045J577J343n636k0618o338J552K0228K6021O20j6270m831k1422
10682a3267j7632M725P896K2950J2807p598j0587Q316m700o421j720J5963P79
10669A1511k1199j2723K637J7783o37M071K4997j835k2138L844P136k4426k859
10656a3838j1313j583J2513O75K4352K2760o427p222j1222R919n084o673k572
10643D285k984n278l3795o801J4229K8708K730j6286K8308j600j0504O201k729
10630D484j4740K080J1698K8727p35o189k2094K201J7216N344j8620m0905R917
10617b1616J5617j0465P468M833q806j8902P684L910J7114K830n562q075O065
$$ plain form
10707 37307 9067 -26118 -42163 -30367 -46952 -56851 -55524 -40186 -3981 11911 21272 17552
10695 17552 10507 12084 13427 7791 -12827 -19165 -17613 2615 28636 29256 12986 8155 -13267
10682 -13267 -30899 -26174 -18278 4672 17479 9881 -706 7610 2910 -3511 -5231 10732 11511
10669 11511 -9688 -22411 -19774 -1991 -2628 1443 26440 24605 2467 6311 13447 -10979 -13838
10656 -13838 -25151 -26734 -14221 -13546 10806 33566 27139 19917 8695 18614 13530 6857 4285
10643 4285 1301 -3977 -37772 -44573 -30344 -1636 1094 -15192 13116 11516 1012 7213 4484
10630 4484 -10256 -8176 3522 32249 31514 25325 3231 5432 22648 27992 9372 -31533 -21616
10617 -21616 -5999 -16464 -8996 -4163 -12969 -31871 -24187 -20277 -3163 -333 -5895 -13970 -7905
10604g905J8106J361J4289o42l746r455n893n994M571J1205l468j1152j5533L660
10590a0596J2345N831J9233j2112k4414r258K084j3737k142l089K3046J5297k6065
10577b3577m573K1542p761K344K2897J2542j3193J0398J6517P851N156k0745M538
10564C3936n850k1883j0953k5016m440K6458R201J5249k647n421p107j047J2556
10551A3036m893Q217l724k0237j4187j0700o310J5749m828j1051K3014J6725K2700
10538B3511R224Q454p17o785j925l1905l0992q069L0450p181O547J6104J668O422
10524A4806l075k1366j2388R22R307n766p88m854M858j581k0541j473K188K0591
10510a9160J119J4604r160p653J6274J8521J584j8807M521O608j8269N240J8017
$$ plain form
10604 -7905 10201 11562 25851 25209 21463 12008 6115 121 4692 15897 12429 1277 -14256 -10596
10590 -10596 1749 7580 26813 14701 -9713 -18971 -16887 -30624 -32766 -35855 -12809 2488 -23577
10577 -23577 -28150 -6608 -14369 -12025 10872 23414 10221 20619 37136 44987 50143 29398 33936
10564 33936 28086 6203 -4750 -29766 -34206 -7748 1453 16702 14055 8634 1527 480 13036
10551 13036 8143 16360 12636 -7601 -21788 -32488 -38798 -23049 -27877 -38928 -15914 811 23511
10538 23511 32735 41189 40472 33687 31762 -143 -31135 -39204 -8754 -15935 -9388 6716 8384 14806
10524 14806 11731 -9635 -22023 -21101 -11794 -17560 -18348 -23202 -18344 -19925 -40466 -41939 -39751 -19160
10510 -19160 -18041 -3437 -12597 -20250 -3976 14545 16129 -2678 1843 8451 -9818 -4578 13439
10497A3439m903J611M543J9827J0115j0712k9558o588n220L923J151k0791J7217
10484e946K84j1337j4707k3344N024K8048J2408J1682K6181q262k2192m413l157
10471i731K410J3245p22j8478j4066J8063o620J0643K094q083j797N964k2423
10458b9501k734P99j7035J1093M801J0997K328J0565j8514k0931J1004J1121J3943
10445a2064J2695q245J1858P540j6028O9J8619o065l909J5236P011r482J590n046
10431A3779j6109K747j0498j8980L072L689J969K360R674K0743m01r339j1072
10418h366k1902J502m084j3022L710K4008j2474j5485J8609j9034o372J6269R632
10405b7009O677J6025k288n160p480k243M462K048r267J6411Q099j1191N823j1431
$$ plain form
10497 13439 8536 10147 14690 34517 44632 33920 4362 -2226 -7446 -3523 -2372 -23163 -5946
10484 -5946 -5662 -16999 -31706 -55050 -50026 -21978 -9570 2112 28293 20031 -2161 -6574 -9731
10471 -9731 -7321 5924 5202 -13276 -27342 -9279 -15899 -5256 -3162 -11245 -13042 -7078 -29501
10458 -29501 -32235 -31436 -48471 -37378 -32577 -21580 -19252 -8687 -27201 -48132 -37128 -26007 -12064
10445 -12064 631 -7614 4244 11784 -4244 -4175 14444 8379 4470 19706 26717 17235 18825 13779
10431 13779 -2330 417 -10081 -29061 -25989 -22300 -20331 -17971 -8297 12446 12045 2706 -8366
10418 -8366 -30268 -28766 -32850 -45872 -42162 -18154 -30628 -46113 -27504 -46538 -52910 -36641 -27009
10405 -27009 -20332 -4307 -6595 -11755 -19235 -21478 -17016 -14968 -24235 -7824 275 -10916 -5093 -16524
10391a6524O10J6153o614j1453j8315L484M588P166k726q281K617n524j569j712
10377c8100k1J7508n35m075O872J6926J6892N370M5P684q947j1885L015k199l19
10362H231J7749K691k4000r103q731R136J1819M167k790n021m067j5797J623j2868
10348b6961J9678J0333p482l292j7216j2518M363J28K260J2587m586O921J5116
10335f69q290j7386o001J6042L2541m922j7909N483J6000O83K3984M1709J5243
10322I6508M157J4857P564L276J4452M434j5399k1849j8964l1609j8954P28J6603
10309E5804j8336j3649q05k0618j4762q047n125J3292K0712p233r309j9867p210
10296c5153P098Q931K2R152k543j9735o019j1762J2006J6122L30K446O879L4037
$$ plain form
10391 -16524 -15914 239 -6375 -17828 -36143 -32659 -28071 -20905 -23631 -31912 -29295 -34819 -36388 -38100
10377 -38100 -38121 -20613 -21148 -25223 -18351 -1425 15467 20837 20882 28566 19619 7734 10749 8550 8231
10362 8231 25980 28671 4671 -4432 -13163 -4027 7792 11959 9169 4148 81 -15716 -14093 -26961
10348 -26961 -7283 3050 -4432 -7724 -24940 -37458 -33095 -32967 -30707 -18120 -22706 -15785 -669
10335 -669 -8959 -26345 -32346 -16304 16237 11315 -6594 -1111 14889 15572 39556 81265 96508
10322 96508 100665 115522 123086 126362 140814 145248 129849 108000 89036 57427 38473 39201 55804
10309 55804 37468 23819 23014 2396 -12366 -20413 -25538 -12246 8466 1233 -8076 -27943 -35153
10296 -35153 -28055 -19124 -19102 -9950 -12493 -32228 -38247 -50009 -38003 -21881 -21551 -19105 -12226 21811
10282B1811J0125j3593l0779j6324J7410J3805l275p865j6533r137p998q124J6730
10269c3747R883j2963q21J1488J0535j7167j2691J2729J5388R55j1906l489P103
10256b4703N382J627K104j3642J1417J8930J1376n173j5697l505K962J3739L360
10243H177k2739j8802O969L849j1456j1120o343L0116K0928L172J237j2052q435
10230a6499l888q220J0372j5382K663N554j6161n747M543o018o057J4536J2494
10217b7810K3163J4241M771J2797j1777k2404o527k0838r194K5051Q088N363m148
10204i224P4j3127j3007R773J8263j0884j2154l788J3743J9332P722J6108L744
10191B6575q926n420J0678p78P469p629R432M58q756Q005j6414j0355k307L423
$$ plain form
10282 21811 31936 18343 -12436 -28760 -11350 2455 -820 -8685 -25218 -34355 -42353 -50477 -33747
10269 -33747 -23864 -36827 -37648 -26160 -15625 -32792 -45483 -32754 -17366 -16411 -28317 -31806 -24703
10256 -24703 -19321 -17694 -15590 -29232 -17815 1115 12491 7318 -8379 -11884 -8922 4817 8177
10243 8177 -14562 -33364 -26395 -22546 -34002 -45122 -51465 -21349 -421 2751 3988 -8064 -16499
10230 -16499 -20387 -28607 -18235 -33617 -30954 -25400 -41561 -47308 -42765 -48783 -54840 -40304 -27810
10217 -27810 -4647 9594 14365 27162 15385 -7019 -13546 -34384 -43578 -18527 -10439 -5076 -9224
10204 -9224 -9150 -22277 -35284 -25511 -7248 -18132 -30286 -34074 -20331 -999 6723 22831 26575
10191 26575 17649 12229 22907 22129 29598 21969 31401 31859 23103 31108 14694 4339 2032 5455
10177E455N571J4414r714o196j4816q348K748M994L917m431k1174j8127n2K0118
10163b5641J2204j742j2561o718J0346J3052j7925J5733J5598q628K0957j3224
10151A451j341M031n316M702J8454n836j8386r540l414k3210l035P384K7973O210
10137A27P757L480r361j9055K3760j884q842j0157j0918o84Q547k3160N412J1577
10123b3401N055j6435j98j445m747N099J3673K4992Q564Q766J536j8955j5644
10110a3140q961j0428O761Q11O836O746J1410R757r975J3183l512k034J320Q628
10096A7402l580l845n399r687J434j846o927J7591J4075q12l271L662o22J3858
10082C2033k5924r161J8912M997J3816j4603j7310k7725K2735K5768k126j3924
$$ plain form
10177 5455 11026 25440 15726 9530 -5286 -13634 -10886 -5892 -1975 -6406 -27580 -45707 -45759 -25641
10163 -25641 -13437 -15179 -27740 -34458 -24112 -11060 -28985 -13252 2346 -6282 14675 1451
10151 1451 110 4141 -1175 3527 21981 16145 -2241 -11781 -15195 -38405 -41440 -34056 -6083 127
10137 127 7884 11364 2003 -17052 6708 4824 -4018 -14175 -25093 -25777 -17230 -40390 -34978 -23401
10123 -23401 -18346 -34781 -34979 -36424 -41171 -36072 -22399 2593 11157 19923 21459 2504 -13140
10110 -13140 -22101 -32529 -25768 -24957 -18121 -11375 35 9792 -183 13000 9488 7454 8774 17402
10096 17402 13822 9977 4578 -5109 -3675 -5521 -12448 5143 19218 18406 15135 18797 18175 32033
10082 32033 6109 -3052 15860 20857 34673 20070 2760 -24965 -2230 23538 21412 7488
10070G488j0434N792M061k9224j0395l148K2512K1781J0186K710P6j2848q274
10057B83J2775n593p587J1303j0536l477N139O068r075j6944J256M303M505N04
10043g076J4009J6914j62j4577m887j3504M08J8740l955m168k6828J1635R367
10030d084J1880j5245R749J3754J4055j2315k6964l469o42M111M577j3130n566
10017b3289M173J2548J4831j5105j1174M209l254m719O163Q561J0222N648j8353
10004i539k262J113j8833J13J3788K616l158j7871j3586J9782k981j5043J362
9991d4499K4613K0511K2713J920n484J4438q208l3595N620J5948j0308k365K2409
9978B3713J1181J2180R015k2195k4744n027j1526N77k888J4583j6780o388R604
$$ plain form
10070 7488 -2946 2846 6907 -22317 -32712 -35860 -13348 8433 18619 21329 21405 8557 283
10057 283 13058 7465 -122 11181 645 -2832 2307 8375 -700 -17644 -16388 -12085 -7580 -7076
10043 -7076 6933 23847 23685 9108 4221 -9283 -8875 9865 5910 1742 -25086 -13451 -4084
10030 -4084 7796 -7449 2300 16054 30109 17794 -9170 -12639 -13281 -9170 -4593 -17723 -23289
10017 -23289 -19116 -6568 8263 -6842 -18016 -13807 -17061 -21780 -15617 -7056 3166 8814 -9539
10004 -9539 -11801 -10688 -29521 -29408 -15620 -13004 -16162 -34033 -47619 -27837 -30818 -45861 -44499
9991 -44499 -19886 625 23338 25258 19774 34212 26004 -7591 -1971 13977 3669 1304 23713
9978 23713 34894 47074 56089 33894 9150 4123 -7403 -6826 -9714 4869 -11911 -18299 -8695
9965h695J0111m860k4917k481J8639l97J917J8388O097k2227r712L568Q271P170
9951H72M025l849J4949P268k0890k1515R95J0039M852K213k07l412J7724K3974
9937C7038m313l2055j7565J5941J2377J9783j4420j828n745j9744j0685K0805
9925d11Q339q346K043O515q625k5395l924J8698J1452R315j7401n480Q923J2243
9911G946K847j1713j2059r531N803P742P752p883L991R67k4572N262K9270l035
9897B787k3554o709L767R12n085k761J4581J3333j4406n055J3332J2350j7199
9884a3707M282R281Q251M620j1591L179J3777n299R442k199j5675j8042j4007
9871b7688m892Q755n288J4111K0467N919j7406j4992M759R323k587N640J3226
$$ plain form
9965 -8695 1416 -3444 -28361 -30842 -12203 -12600 -10683 7705 13802 -8425 -18137 -14569 -6298 872
9951 872 4897 1048 15997 23265 2375 -19140 -18145 -8106 -3254 -1041 -1248 -4660 13064 37038
9937 37038 32725 670 -16895 -954 11423 31206 16786 14958 9213 -10531 -21216 -411
9925 -411 7928 -418 1625 8140 -485 -25880 -29804 -11106 346 9661 -7740 -13220 -4297 7946
9911 7946 10793 -920 -12979 -22510 -16707 -8965 -1213 -9096 -5105 -4138 -28710 -23448 5822 2787
9897 2787 -20767 -27476 -23709 -22797 -27882 -30643 -16062 -2729 -17135 -22190 -8858 3492 -13707
9884 -13707 -9425 -144 8107 12727 1136 4315 18092 12793 22235 20036 4361 -13681 -27688
9871 -27688 -32580 -23825 -29113 -15002 5465 11384 -6022 -21014 -16255 -6932 -9519 -3879 9347
9858I347K6276n244o442j1860o658j0461k2685m409J3464P777K2817J0898j7620
9845E200j914K263Q788J630Q934K662K959k359o289k4717j7923J418K6667M02
9831G721j3092l084L242k020P635L633M294L2303k0057l9038j0337j0568K5191
9818a4177J4507N788n473m37K152N820j6751l00Q853J3495J8269j5349j4744P284
9804H937N374R072J565o943O986j305Q717K999o981j1972k5065j3486k304J212
9790b3194N032J2327Q245J3926J1453K636q716O363r153J383J0500N442k2j0817
9776B5405m9q782j5490j2791j3443k8106P584L2698K7566P088k983o327k4664
9763a2294L591o429j1759O180J0833r3J0283M031j05k369j2412j1598J9496K5574
$$ plain form
9858 9347 35623 30379 23937 12077 5419 -5042 -27727 -32136 -18672 -10895 11922 22820 5200
9845 5200 3286 5549 14337 15967 24901 27563 30522 28163 21874 -2843 -20766 -19348 7319 7721
9831 7721 -5371 -8455 -5213 -7233 402 4035 8329 40632 20575 -18463 -28800 -39368 -14177
9818 -14177 330 6118 645 208 2360 8180 -8571 -8871 -18 13477 31746 16397 1653 8937
9804 8937 14311 23383 24948 18005 24991 23686 32403 35402 28421 16449 -8616 -22102 -24406 -23194
9790 -23194 -18162 -5835 2410 16336 27789 30425 21709 28072 18919 20302 30802 36244 36222 25405
9776 25405 25356 16574 1084 -11707 -25150 -53256 -45672 -12974 14592 21680 18697 12370 -12294
9763 -12294 -8703 -15132 -26891 -20711 -9878 -9971 312 4343 4238 1869 -10543 -22141 -2645 22929
9749B2929l220m970J5640k6022k0637R833R596j1248l713J5513J3303R453j0904
9736A5553j9410J5361K494k957j1381j0267R729q250K4930M338l1509J7304o413
9723d78K576K910j3620j2173J6837j8100K0601J2940q125j6743l988J4238Q88
9710b237l013j639m310R313N966L100j931R759N27j2868O166j3955m0740R44K2660
9695b2258K5445L171j5035K768N020K094K621m336r933J4247l706J233j8584m068
9681b1321L963J745j574M98l641O04J5439P804k981K027n685k705J10m511j0124
9666b0352R941K866o380J6417J1358j803m96k158l720k3488q973N828J6910K0005
9652A5955l264Q50n440l7803q16K5782J2166M006j4638j2750N083K2397j323R575
$$ plain form
9749 22929 19709 14739 30379 4357 -16280 -6447 3149 -8099 -11812 3701 17004 26457 15553
9736 15553 -3857 11504 13998 11041 -340 -10607 -878 -9128 15802 20140 -11369 5935 -478
9723 -478 2098 5008 -8612 -20785 -3948 -22048 -1447 11493 3368 -13375 -17363 -3125 -2237
9710 -2237 -5250 -6889 -11199 -1886 4080 7180 5249 15008 15535 2667 8833 -5122 -45862 -44918 -22258
9695 -22258 3187 6358 -8677 -5909 -889 1205 3826 -510 -10443 3804 98 1331 -17253 -21321
9681 -21321 -17358 -15613 -17187 -16689 -20330 -19726 -4287 3517 536 2563 -3122 -5827 -5717 -10228 -20352
9666 -20352 -10411 -7545 -13925 2492 13850 12047 11551 9393 5673 -17815 -26788 -20960 -4050 15955
9652 15955 12691 13541 8101 -29702 -30518 -4736 7430 11436 -3202 -15952 -10869 11528 10205 19780
9638A9780N956j6514n802p092K0241m163k1194L84K3415m07j0958q021J0339M363
9624A0327J5716R338j928r777k121n083l487p937l496J3249j4502q263Q010K4118
9610B4164l372K3869J02k3892j8989l746j0104j1132K0942K0956j393j5507j2011
9597a0113K728O406j0839j0739O937O741J0656M680p166J2756K2261j8986j542
9584A3780L092L18k5721j9062k0588K4406L0376J8433P077n368M036j1497l1095
9571a1813Q407K4899K1497j1931k1475o110P100j5652k8530P066K8857m551j5435
9558a7671N020K0462J2446k424j6619Q696R018J366M62K1076j819j2708l0940
9545c635J137K4418J2976j5266L028R199J399J4609J3230P596j7230m420N233
$$ plain form
9638 19780 25736 9222 3420 -3672 16569 12406 -8788 -8404 15011 14604 3646 -4375 5964 10327
9624 10327 26043 35381 33453 23676 21555 16472 12985 5048 1552 14801 299 -7964 46 24164
9610 24164 20792 44661 44763 20871 1882 -1864 -11968 -23100 -2158 18798 17405 1898 -10113
9597 -10113 -7385 -979 -11818 -22557 -15620 -8879 1777 6457 -709 12047 34308 15322 13780
9584 13780 16872 17190 -8531 -27593 -48181 -23775 6601 25034 32111 26743 30779 19282 -11813
9571 -11813 -3406 21493 42990 31059 9584 3474 10574 -5078 -33608 -26542 2315 -2236 -17671
9558 -17671 -12651 7811 20257 17833 1214 9910 18928 20294 20756 41832 40013 27305 -3635
9545 -3635 -2498 21920 34896 19630 22658 31857 33256 47865 61095 68691 51461 47041 52274
9532E2274j9917K8n344J9860l245j2816K563j2490o550L446m007L344O732R599
9518C3477K418j7132j2008J0750q05k0498O95Q351M3263J1803j8924j3825K130
9505B9695N85J5687N195K1416k196J2333n415m5605j415J5978J2429j7959j6844
9492B3884J9635r283k2469L057J9715q00q528J8377j8521k1599K0538R500J5165
9479D8671J5076N832k5019j1887J2195K0188O151l850j2389j0034J7057J0505
9467G2496K827O96K0005K233n309j6166k0898m24O087O084J1893M902P737K1595
9453A13758n682r566j2623j5055J9213J9780J3141L130q168M525M840M1809K2458
9440A91560j7539l678J444n580j7258r285Q810J0935K1962J1892N924j1289M268
$$ plain form
9532 52274 32357 32385 27041 46901 43656 30840 33403 20913 14363 17809 13802 17146 23878 33477
9518 33477 35895 18763 6755 17505 16700 -3798 -3103 5248 48511 60314 41390 27565 29695
9505 29695 30280 45967 51162 72578 70382 82715 77300 31695 30280 46258 58687 40728 23884
9492 23884 43519 34236 11767 14824 34539 33739 25211 43588 25067 3468 24006 33506 48671
9479 48671 63747 69579 44560 32673 44868 65056 71207 67357 54968 44934 61991 72496
9467 72496 75323 76019 96024 98257 92948 76782 55884 55460 61547 67631 79524 84426 92163 113758
9453 113758 108076 98510 85887 70832 90045 109825 122966 126096 117928 122453 127293 169102 191560
9440 191560 174021 170343 171787 166207 148949 139664 148474 159409 181371 193263 199187 187898 192166
9427A92166K0541rj250L5889K8053J6537J6764P654k714Q841J4604J7576Q336
9414C62988J3283K0224K2153L1701L6041K8801J6598L8383L4263L9140N7205J6261
9402G17041J1237K0237N8419M0298K9350O5512O4794O6164O3046N9879P0527R1341
9390A357845R4174J08631J02682R5790R6359Q8257P6700Q1820P2651O5530N3856
9379B294295L5648K9085M9496K2515l0753m3932k9852m1916m7691o5483r4178
9368B077234j16478j12131q9676r1746p9311o8777q7132q7198m9469n8381n9517
9357A177418p9366n6037o3849m4228l8600o8733m2215l5659m8688m7761k5606
9346F26676J91j3735p523M630k4829m2404n8461k2476j5016k0699m0367n043j8674
$$ plain form
9427 192166 212707 212698 211448 247337 275390 291927 308691 316345 313631 322472 337076 354652 362988
9414 362988 376271 396495 418648 450349 486390 515191 531789 570172 604435 643575 700780 717041
9402 717041 728278 748515 806934 847232 876582 942094 1006888 1073052 1136098 1195977 1266504 1357845
9390 1357845 1452019 1560650 1663332 1759122 1855481 1943738 2020438 2102258 2174909 2240439 2294295
9379 2294295 2329943 2359028 2408524 2431039 2400286 2356354 2326502 2284586 2236895 2171412 2077234
9368 2077234 1960756 1848625 1758949 1667203 1587892 1519115 1431983 1344785 1295316 1236935 1177418
9357 1177418 1098052 1042015 978166 933938 895338 826605 784390 748731 700043 652282 626676
9346 626676 626867 613132 605609 610239 585410 543006 484545 462069 447053 426354 385987 380944 362270
9333C62270k9732q704R760j9932j412R992k1810j5094j7206k0850l803k296o292
9320B34891j2409j2505j0962r175K182l724J3288R905j4979l1444j8935j7960
9308A28173N798J1784j7110K188J7413j562l1218m991K789l729p494J151O028
9295A09220L178j5324J878j1602j4108P948J2070J753k2189j2044R862K2872Q76
9282I4390j4822p790q095j7846o477l125j397R719J4166M037N590l198L045j001
9268F7196j5625J0233P358M126j6218j0639l773K360j683P913p237P508k653j5800
9254C3066K884J2412K903K792q181j6017k133Q181J5655r969M494J1978m487k9682
9240B3896J2738L8889n658k0502p444O272M462j2180M534j5279o631m995q028
$$ plain form
9333 362270 332538 323834 333594 313662 312250 322242 300432 285338 268132 247282 243479 241183 234891
9320 234891 222482 209977 199015 189840 192022 188298 201586 211491 196512 165068 146133 128173
9308 128173 133971 145755 128645 130833 148246 146684 115466 110475 113264 109535 102041 103192 109220
9295 109220 112398 97074 98952 87350 73242 81190 93260 95013 72824 60780 70642 93514 94390
9282 94390 79568 71778 63683 45837 39360 36235 34838 44557 58723 62760 68350 65152 68197 67196
9268 67196 51571 61804 69162 73288 57070 46431 42658 45018 43335 51248 44011 51519 48866 33066
9254 33066 35950 48362 51265 54057 45876 29859 27726 35907 51562 41593 46087 58065 53578 23896
9240 23896 36634 75523 69865 49363 41919 48191 52653 40473 45007 29728 23097 18102 10074
9227A0074O212L4j195J4430k3504N307J3545p628J5345O220N218k661k598J812
9213D0611Q20L29j2966j1455q847j5598j1782J2773Q886J3467M698n856j5334
9200b54k1701J4737J8218j2180J959k311j3182j1883J2396J4405K1947J3182l4381
9187I52k6908J1560R191J5589P168r775j9500L399K7148J9390J7558k4756j8736
9174A2280n413r171p490k5648q432L1119J8415J9526J3282m010j0111k7865k0250
9161b3768Q76M594J1685J5869L210J9540J1162p808j5023j5321J5841N826j2175
9148A4508r833o461J1429J1740J9434J1630j399q792k4890k7693k9556L203J2839
9135b3841J7674j3754r865N722J3872M790J6068J4121M127Q047J027j2423j6117
$$ plain form
9227 10074 16286 16320 15125 29555 6051 11358 24903 17275 32620 38840 44058 41397 38799 40611
9213 40611 41431 41760 28794 17339 8492 -7106 -18888 -6115 2771 16238 20936 15080 -254
9200 -254 -21955 -7218 11000 -1180 779 -1532 -14714 -26597 -14201 204 22151 35333 952
9187 952 -25956 -14396 -5205 10384 17552 7777 -11723 -8324 18824 38214 55772 31016 12280
9174 12280 6867 -2304 -9794 -35442 -43874 -12755 5660 25186 38468 34458 24347 -3518 -23768
9161 -23768 -22892 -18298 -6613 9256 12466 32006 43168 35360 20337 5016 20857 26683 14508
9148 14508 4675 -1786 9643 21383 40817 52447 51048 42256 17366 -10327 -39883 -36680 -23841
9135 -23841 -6167 -19921 -29786 -24064 -10192 -5402 10666 24787 28914 36961 37988 25565 9448
9122I448L565m015l594k4998j8630J5767K9453J584J386j3194Q242j2270m144
9109a1400L2490J8512m646k3196j1390M86J1667j177O395J1068M128j553j0697
9096B0687j1795P34l781r569J1840J634N708J174k2345M818R971k153j6844k919
9082a2840N293Q461n574q135J155J4252K11j4048Q281j6829q853o681o137Q462
9068c2982J0509k874R891J4969L193j2505O845J962j2844j0825J278j1877J0901
9055b4359O142J3490R093J2322J5225k138j4553q854Q79O144Q341j139j4796l764
9041B033j1396j684k092O439K451O665j2264q642j7498j0346J4375J7505R047
9028e407q011Q472o47J8481N524N771m603j0247o391J3598K739J3438j2892m412
$$ plain form
9122 9448 13013 8998 5404 -19594 -38224 -22457 6996 8580 9966 -3228 5014 -7256 -11400
9109 -11400 21090 39602 34956 11760 370 856 12523 11346 17741 28809 32937 31384 20687
9096 20687 8892 9626 5845 -3724 8116 9750 15458 16632 -5713 -895 9076 6923 -9921 -12840
9082 -12840 -7547 914 -4660 -12795 -11640 2612 2823 -11225 -2944 -19773 -28626 -35307 -41444 -32982
9068 -32982 -22473 -25347 -15456 -487 2706 -9799 -2954 -992 -13836 -24661 -23383 -35260 -24359
9055 -24359 -18217 -4727 4366 16688 31913 29775 15222 6368 7247 13391 21732 20593 5797 2033
9041 2033 -9363 -11047 -13139 -6700 -4249 2416 -9848 -18490 -35988 -46334 -31959 -14454 -5407
9028 -5407 -13418 -4946 -5593 12888 18412 24183 19580 9333 2942 16540 19279 32717 19825 15413
9014A5413j47M549k865J1715j1024k1966N424J8535J388N277j5645K0260J7696
9001D8610l776k1636R520j986N215j3877j8149q893J3378M731M462J2809R774
8988D0182k958L392m930j2121j873m321J2174Q652J1481q864l468j2496n307j198
8974A8345l495o874R58l791k908M136J3635p654j637R278m076k4095J568j5552
8960b2162L895P637L3353j9787p538k805L20n925J5446J8392N249j155Q70j4686
8946A1104l801O158n693j1561J0665K4624j152p794N85J9692J7058n441Q18j1546
8932D3716j0453R735N596J904r339k7095L30o237o908Q637J2969j0626J829R317
8918B3375K880r184j8874k788j9935q366J3090m351R858J7864l063o324p971r839
$$ plain form
9014 15413 15266 19815 16950 28665 17641 -4325 1099 19634 21022 26299 10654 30914 48610
9001 48610 44834 23198 32718 30732 35947 22070 3921 -4972 8406 13137 17599 30408 40182
8988 40182 37224 40616 35686 23565 21692 17371 29545 38197 49678 40814 37346 24850 19543 18345
8974 18345 14850 7976 8934 5143 2235 6371 20006 12352 10715 19993 15917 -8178 -6610 -22162
8960 -22162 -18267 -10630 22723 2936 -4602 -7407 -7087 -13012 2434 20826 26075 24920 25790 11104
8946 11104 7303 13461 7768 -3793 6872 31496 30344 22550 23135 42827 59885 54444 55262 43716
8932 43716 33263 42998 48594 50498 41159 14064 14394 8157 1249 9886 22855 12229 14058 23375
8918 23375 26255 17071 -1803 -4591 -24526 -32892 -19802 -24153 -14295 3569 506 -5818 -13789 -23628
8904b3628q437Q067Q464l226K428O345o264k2213K014O136l313n171J5684L985
8890a9129R525r801J0545O504j6699j1010o59K348K5587J5070j0262j5373O862
8877f492P036K213K27K495j2187k4200j3141j3762K4688R323k7768J0032J6851
8864b4685p250J3190K7183P626K2197J4075l6731l457R126k8215m463O307m396
8851i493Q831q800j425M697K702K2821J880j4305J3207m21n970O555k1744R92
8837d73J7649K845r355q695r122k873r373p141j4331j606R561K0288j0623J7P211
8822a6021J5714K2505r91l3202k0719J3739l672R814J4860K7857J0321q179j1116
8809B0910m417J2634k772n000N756J0378J1489j3658l0377j0802K247m226l481
$$ plain form
8904 -23628 -32065 -23998 -15534 -18760 -16332 -9987 -16251 -38464 -36450 -30314 -33627 -38798 -23114 -19129
8890 -19129 -9604 -19405 -8860 -2356 -19055 -30065 -30724 -28376 -2789 12281 2019 -13354 -6492
8877 -6492 544 2757 2984 5479 -6708 -30908 -44049 -57811 -33123 -23800 -51568 -41536 -24685
8864 -24685 -31935 -18745 8438 16064 38261 52336 15605 12148 21274 -6941 -11404 -5097 -9493
8851 -9493 -662 -9462 -10887 -6190 -3488 19333 21213 6908 20115 19694 13724 20279 -1465 -473
8837 -473 17176 20021 10666 1971 -7151 -10024 -19397 -26538 -40869 -42475 -32914 -12626 -23249 -23232 -16021
8822 -16021 -307 22198 21207 -11995 -32714 -18975 -22647 -12833 2027 29884 40205 32026 20910
8809 20910 16493 29127 26355 21355 27111 37489 48978 35320 4943 -5859 -3612 -7838 -11319
8796a1319j6451J0714K6003j3781j9499j068J8384J1548j859Q948K243l632K577
8783A2808l338j442j9837Rk468M773P838M928M775j8975q773R860R985Q33L671
8768D647O783p625k3284m765M398l535k084J1833J6605Q759J9116k969l8298L591
8754f828K877N77j3550j3712K5048M132P739J1737k1555k0910P68M526j1601M987
8740b5765r44K2636J2792J4320l222k9359k6807l715K8022o802O10R563j14j0557
8726a9342J8822J5844R426P82O113j2583n250J0647L891k227J1604k1345J199
8713A7581Q780k269o661j7501j9613P510J4056K2466m556k5422Q18k679J2180
8700D690j2110r136J75J655o42L2465J4119m6758l1757j451J0535M593l677R017
$$ plain form
8796 -11319 -27770 -17056 8947 -4834 -24333 -25401 -7017 4531 2672 11620 13863 10231 12808
8783 12808 9470 8028 -11809 -11800 -14268 -9495 -1657 3271 8046 -10929 -19702 -9842 143 976 4647
8768 4647 11430 3805 -19479 -24244 -19846 -23381 -25465 -13632 2973 11732 30848 27879 -10419 -6828
8754 -6828 -3951 -3374 -16924 -30636 -5588 -1456 6283 18020 -3535 -24445 -23677 -19151 -30752 -25765
8740 -25765 -26709 -4073 8719 23039 19817 -9542 -36349 -40064 -12042 -18844 -18234 -8671 -8785 -19342
8726 -19342 -520 15324 24750 25532 31645 19062 13812 24459 28350 26123 37727 16382 17581
8713 17581 26361 24092 17431 -70 -19683 -12173 1883 24349 19793 -5629 -4811 -7490 4690
8700 4690 -7420 -16556 -16381 -14726 -15368 17097 31216 -15542 -47299 -48750 -38215 -33622 -37299 -28282
8686b8282J9600K6394m411k8038j8728K0606P892J042m645J0534j3689K564o830
8673a5991M153K2887k5655m105P732O009j0669Q931P255J0736l9M190j0883N172
8659I723K0224j0591j0989j773q760J0691n833n933n45o056M59o898p342K1761
8645a862K5818O234j5703r833o743k78J3680k0945j3257L832o951N93R397J4765
8631a253M904j9075j8780k310p50P196J2111J7115J9455j3457j9574m594J1382
8618g630Q44n903j722n703J5888J8490J7797j6809o008j0983k4869n784M701p243
8604c4934J1771J0393k553J3427l267k261M424O049J0081J777R408p815M29j5121
8590A808k3010q180M03J1105l355K2420J8327l862j6217m094J5427O433P441K7157
$$ plain form
8686 -28282 -8682 17712 13301 -14737 -33465 -12859 -4967 -3925 -8570 1964 -11725 -9161 -15991
8673 -15991 -11838 11049 -14606 -18711 -10979 -4970 -15639 -6708 547 11283 11244 15434 4551 9723
8659 9723 29947 19356 8367 6594 -2166 8525 2692 -3241 -3786 -9842 -9383 -16281 -23623 -1862
8645 -1862 23956 30190 14487 4654 -2089 -2367 11313 -9632 -22889 -19057 -26008 -25415 -16018 -1253
8631 -1253 3651 -15424 -34204 -36514 -37264 -30068 -17957 -842 18613 5156 -14418 -19012 -7630
8618 -7630 -6786 -12689 -14411 -20114 -4226 14264 32061 15252 9244 -1739 -26608 -32392 -27691 -34934
8604 -34934 -23163 -12770 -15323 -1896 -5163 -7424 -3000 3049 13130 14907 24315 16500 16929 1808
8590 1808 -21202 -29382 -28979 -17874 -21229 1191 19518 15656 -561 -4655 10772 17205 24646 51803
8576E1803p6n264p652k4112j435j900O940J6251m1071j3707O127M948O201K4240
8562B1293J4216R266j2767j126J3709j5751j7265j0490J0590K5220K6724j9241
8550D4378j2997m001o580O527j2388k073q12r073M666J8686n687k0121L48r190
8536h317J4041J5440J8372J0577J2624k476k5584j3427M786j0757K952N567k6582
8523b784l178l034K500J6472J4818R755j0137j2472j339j475k421q690J2104N998
8509A6117p745J0003J1318n781J469k6758k5096J7274L923J7872J4838k1122k2468
8496a6156p273l066p573J2062Q997K5338j1827j4946J2758K5191j66J1536j0500
8483B4375k0510q404L010N434j0459J73J6586M874M852k2751r490K3019N595l4506
$$ plain form
8576 51803 51727 46463 38811 14699 13264 11364 18304 34555 -6516 -20223 -14096 -9148 -2947 21293
8562 21293 35509 44775 32008 30882 44591 28840 11575 1085 11675 36895 63619 44378
8550 44378 31381 27380 20800 27327 14939 12866 12054 2981 7647 26333 20646 525 873 -8317
8536 -8317 5724 21164 39536 50113 62737 60261 34677 21250 26036 15279 18231 23798 -2784
8523 -2784 -5962 -8996 -6496 9976 24794 34549 24412 11940 10601 9126 6705 -1985 10119 16117
8509 16117 8372 18375 29693 23912 25381 -1377 -26473 -9199 -5276 12596 27434 6312 -16156
8496 -16156 -23429 -26495 -34068 -22006 -13009 12329 502 -14444 -1686 23505 23339 34875 24375
8483 24375 3865 -4539 -1529 3905 -6554 -6381 10205 15079 19931 -2820 -12310 10709 16304 -18202
8469a8202m51K4091n303l4035m244Q794O568K4887L2087r490k2646J2164K859
8456A7079J53j0725r008R166P07n264l110J604P20p186J8918M858K304N332M651
8441C0199j2312j9017p703K1046k093k3533k6219L476k585N538J0097K566K2791
8428B251P510k9880j0034J2945O876K843j1740j138K275J0567j0624J0417L7584
8415B9852K1977j4389j1481P515J8898n479k6973j5150k2714j6964K1213K4426
8403A0731K020l2332m2305p954J8976L0527L915m904J8644m930j3256M854j335
8390a7349j142r956Q043N418q375r119J4327J3867O136J5708j0462m806O33O119
8376I042P285O664O279r294J469k151j436K023J887M522j819j7417j0391R278
$$ plain form
8469 -18202 -18653 5438 135 -33900 -38144 -29350 -22782 2105 34192 24702 2056 14220 17079
8456 17079 17232 6507 -2501 6665 7372 2108 -1002 602 1322 -5864 13054 17912 20216 25548 30199
8441 30199 17887 -1130 -8833 12213 10120 -13413 -39632 -36156 -38741 -33203 -23106 -20540 2251
8428 2251 9761 -20119 -30153 -17208 -10332 -7489 -19229 -20367 -18092 -7525 -18149 -7732 29852
8415 29852 51829 37440 25959 33474 52372 46893 19920 4770 -17944 -34908 -13695 10731
8403 10731 12751 -19581 -61886 -69840 -50864 -20337 -16422 -21326 -2682 -7612 -20868 -16014 -17349
8390 -17349 -18491 -28447 -20404 -14986 -23361 -32480 -18153 -4286 1850 17558 7096 2290 2923 9042
8376 9042 16327 22991 29270 19976 21445 19294 17858 19881 21768 26290 24471 7054 -3337 5941
8362E941J5297j1585j8853p879O192J6318K9023j0241j5547r499k475j9581k366
8349b5255M566K2444J2473l2649j7597J6870O945N528R160R054j694o395J6469
8336A9919J8475j8962J3073r833j6450Q667k166k1685J302L78N517p947j295J1823
8322H16J6232m932l737K0262L617m150k3409r363j7151r351P556l843m188J6028
8308a5613J8172q60j0218j3446K481K2454P871J1501k0290j3668j648K9144M234
8295B0114j7759j8328q825K5584Q284p207k6603M062J5255L904o56q352j4507
8282b5034K7445K2278m993k0888j1945K2337M886k0555O343Q670K0010j7228m834
8269F492j5412q800l686J1970j0014m760j4932J4841n741J7341K1125R205J3236
$$ plain form
8362 5941 21238 9653 -9200 -17079 -10887 5431 34454 24213 8666 -833 -3308 -22889 -25255
8349 -25255 -20689 1755 14228 -18421 -36018 -19148 -12203 -6675 2485 11539 9845 3450 19919
8336 19919 38394 19432 32505 22672 6222 14889 12723 -8962 -7660 -7282 -1765 -9712 -11007 816
8322 816 17048 12116 8379 28641 32258 28108 4699 -4664 -21815 -31166 -23610 -27453 -31641 -15613
8308 -15613 2559 1699 -8519 -21965 -19484 2970 10841 22342 2052 -11616 -13264 15880 20114
8295 20114 2355 -15973 -24798 786 9070 1863 -24740 -20678 -5423 -1519 -2175 -10527 -25034
8282 -25034 2411 24689 19696 -1192 -13137 9200 14086 -6469 -126 8544 28554 11326 6492
8269 6492 -8920 -17720 -21406 -9436 -19450 -24210 -39142 -24301 -30042 -12701 8424 17629 30865
8256C0865j5983l7032j4517L762J7152J3219j0371j1046j2773P368L2618J1381
8244A4643j515j0981M669R701P781j4735j73k806R285k4653k1679K458J7170j645
8230a2480J3677j1425j4995M997K5128J120L026r009L406n273j8199p636N31P504
8216a9628J3940N745Q309o695m05M990r615j2968N117K4809Q782J2475L317o34
8202C7539j9165q485M069o796P200J644j7385j1782N900j1935q975M584P700m05
8188a6292N330j518M821J1548J8021l822j7246j1834J844N825P431r661q613R712
8174d454P179P362J5612p009j1220p57L833j016p44p467j7762j9382r418K7535
8160a7708J7853K4515J4530J836n913o357j204K852k8971j0673O314m587O692
$$ plain form
8256 30865 14882 -22150 -36667 -32905 -15753 -2534 -12905 -23951 -36724 -29356 3262 14643
8244 14643 13128 2147 6816 16517 24298 9563 9390 6584 15869 -8784 -30463 -28005 -10835 -12480
8230 -12480 1197 -10228 -25223 -20226 4902 6022 9048 39 3445 -1828 -20027 -27663 -27132 -19628
8216 -19628 -5688 57 8366 1671 1266 6256 -3359 -16327 -11210 13599 22381 34856 38173 37539
8202 37539 18374 9889 13958 7162 14362 16006 -1379 -13161 -7261 -19196 -28171 -23587 -15887 -16292
8188 -16292 -10962 -12480 -7659 3889 21910 18088 842 -10992 -9148 -3323 4108 -5553 -14166 -4454
8174 -4454 2725 10087 25699 18690 7470 6713 10546 9530 8786 1319 -16443 -35825 -45243 -17708
8160 -17708 145 24660 39190 41026 35113 28756 27552 30404 1433 -9240 -2926 -7513 -821
8147h21L057P358m331k188q643l436o744m291J7635Q744M349j903j4890K312m024
8132g816p817l556r179P527K5139M993J297k0651M999L0500O575m989l273p460
8118A6289R337m498n4l210O137j388j6777m0282m377Q233K2771K2249Q095N979
8104B8504j1399l064j441J0039m715n505J7025M162j1236j9090R6N213K296O296
8090A7181o779k744J0243J2258J3476J359l1896k2202j0771K562R509J47n04J1582
8076C421J078j7388j8586K8477K8243j4042r794L70m834Q37j5504Q192O78K0536
8062A1684J1230j4137j2075J347j1188P166M646J3929L422L259R924J3484j870
8049D0821l910r115j7938K806j606k3860Q856n467Q299p896j7042p583K729P942
$$ plain form
8147 -821 2236 9594 5263 3075 -5568 -9004 -15748 -20039 -2404 6340 10689 8786 -6104 -3792 -7816
8132 -7816 -15633 -19189 -28368 -20841 4298 9291 10588 -10063 -5064 25436 32011 27022 23749 16289
8118 16289 25626 21128 21074 17864 24001 22613 5836 -34446 -38823 -30590 -7819 14430 22525 28504
8104 28504 17105 14041 12600 22639 17924 12419 29444 33606 22370 3280 3376 8589 10885 17181
8090 17181 10402 7658 17901 30159 43635 44994 13098 -9104 -19875 -17313 -7804 -7657 -8161 3421
8076 3421 4499 -12889 -31475 -2998 25245 11203 1409 1779 -3055 -2218 -17722 -9530 -8852 11684
8062 11684 22914 8777 -3298 -1951 -13139 -5973 -1327 12602 16024 19283 29207 42691 40821
8049 40821 36911 27796 9858 12664 11058 -12802 -3946 -9413 -1114 -9010 -26052 -33635 -30906 -22964
8035b2964K361J0021J818J5254o105K2137P1j5671j9609q285O70J1395L6979j3784
8021A4288k5507K1799N457L140N51j151k2204p531N635m500j3866p893R646q692
8007c0828J9300L5405J6891j3640j7480M573Q252j3595o081O420j189j3216j7026
7994b2214J938J1286J748j0609J6834j0974J1492J0718K593K918k565J7739k278
7981B8626j0861j6226n565j364K010n792o024p162J8328J3133Q898J532P103k5409
7967A227k0503J1455j963k2929J0435J6452J234j75K650J2087N81R294Q33J7490
7953C8168L625o569J464k021k9374j2666J6806J4331M710r662R140K529L527L74
7939C4382P642j055j0432j8000J4491m959k2298O790J1899K746m932j8411p946
$$ plain form
8035 -22964 -20603 -10582 -8764 6490 385 22522 22593 6922 -12687 -20972 -20302 -8907 28072 14288
8021 14288 -11219 10580 16037 19177 19728 18577 -3627 -11158 -5523 -10023 -23889 -31782 -22136 -30828
8007 -30828 -11528 23877 40768 27128 9648 14221 22473 8878 2797 9217 8028 -5188 -22214
7994 -22214 -20276 -8990 -7242 -17851 -1017 -11991 -499 10219 12812 15730 13165 30904 28626
7981 28626 17765 1539 -4026 -5390 -3380 -9172 -15196 -22358 -4030 9103 18001 19533 26636 1227
7967 1227 -19276 -7821 -9784 -32713 -22278 -5826 -4592 -4767 -2117 9970 10551 19845 20678 38168
7953 38168 41793 35224 36688 34667 5293 -7373 9433 23764 28474 18812 27952 30481 34008 34382
7939 34382 42024 40969 30537 12537 27028 22069 -229 6561 18460 21206 16274 -2137 -10083
7926a0083K586K0238L4477m48P288r557k9008k178q842o198J3627J5327j3378
7913A3851r077N487j1175L415K450K1284K0318j8221j1502O783K255M435j2801
7900A7502j5509n133K678r511O576j1546j5453K6287K3453r804q266R154J194
7887A1622M168k1235n196J3201p330k4119O38O217q37P58L904j1458k86L1264
7873A311J1364p634j310J2988K2126j7535k7121l905q796j4132M134K5623k655
7860e542j4p43M028J1376r840m606p64R479J3386k1535j8434N422K1903R699M904
7845A8719j5516O436L608j3077J0949J6175J0513q288j5753j0384J3892M375j2475
7832I174j0166L58m441k822K0758K4287R17j6728j2162o524N554o005l1711P046
$$ plain form
7926 -10083 -7497 12741 47218 46770 54058 44501 15493 13315 4473 -1725 11902 27229 13851
7913 13851 4774 10261 -914 2501 4951 26235 46553 28332 16830 23613 25868 30303 17502
7900 17502 1993 -3140 -462 -9973 -3397 -14943 -30396 -4109 19344 9540 1274 10428 11622
7887 11622 15790 -5445 -10641 2560 -4770 -28889 -28251 -22034 -22871 -22113 -18209 -29667 -29953 1311
7873 1311 12675 5041 3731 16719 38845 21310 -5811 -9716 -18512 -32644 -28510 -2887 -5542
7860 -5542 -5556 -6299 -2271 9105 -735 -5341 -6105 3374 16760 -4775 -23209 -17787 4116 13815 18719
7845 18719 3203 9639 13247 170 11119 27294 37807 29519 13766 3382 17274 21649 9174
7832 9174 -992 -634 -5075 -7897 12861 37148 38065 21337 9175 2651 8205 2200 -29511 -22465
7818b2465P232j3965Q084O545j2674j0288j6314R90M774K1984J2669K6238l488
7805I322j8127J560j2736m89J1284M945q519j4479j5344R989L391K1783P342j9356
7791a9434n877J4390J2151K4272o852j0670o287m437j2658j5723R285J5262K4671
7778A8093J2095l1275j8168j1615K2956L5318R787q186k4393l9441P511J2816
7766a4502N510k588Q829q288m604L014J2636L506q300j3600J4503J3444K2386
7753C1946l341q445R743j3829r716N5l644k6422K185K3981N329M179j8720J4039
7739G340J4531J144r750k0723r979J9885Q675J9831j483l5768r118M857J392K157
7725g009L256p104j3731n189J7390k965k7548O059L2627k713j4114K719K554J7062
$$ plain form
7818 -22465 -15233 -29198 -21114 -14569 -27243 -37531 -53845 -52855 -48081 -26097 -13428 12810 9322
7805 9322 -8805 -7245 -19981 -20470 -9186 -4241 -12760 -27239 -42583 -32594 -29203 -7420 -78 -19434
7791 -19434 -25311 -10921 1230 25502 18650 7980 1693 -2744 -15402 -31125 -21840 -6578 18093
7778 18093 30188 -1087 -19255 -30870 -7914 27404 37191 29005 4612 -34829 -27318 -14502
7766 -14502 -8992 -11580 -2751 -11039 -15643 -12629 7 3513 -4787 -18387 -3884 9560 31946
7753 31946 28605 20160 29903 16074 6358 6413 2769 -23653 -21468 2513 7842 12021 -6699 7340
7739 7340 21871 23015 13265 -7458 -17437 2448 11123 30954 29471 -6297 -15415 -10558 -9166 -7009
7725 -7009 -3753 -10857 -24588 -29777 -12387 -15352 -42900 -36841 -4214 -6927 -21041 -18322 -15768 1294
7711A294J0043K1908j4434j8361n745L509k82q63L514j3963K612j70j064k580
7697a4582J1253K1896R984j0958n592J2932q807l0812K2743K0076j843j6535q331
7684A424J592k863O725K0313j6099j005o817j1240j0786J892K4965M39p581K969
7670C928l839q114K473L8702J3598L479j3686j5240m553j6533O769o696J8641
7657A8929P021m742J5259o817k0276j702J6592P478j1543j6523j8727j1K0143
7644E081J7721M555l771j8426p119l448p083J0019R973O724M378j4110k2461n101
7630b3068J6795K1666J1636L35j5573m841p177j7428o943J6375O456J032j5263
7617a5998j978k485J1080Q605j9267j9062J3950p387m782j0638M362J0950M845
$$ plain form
7711 1294 11337 33245 18811 450 -5295 -1786 -2068 -2931 583 -13380 -10768 -10938 -12002 -14582
7697 -14582 -3329 18567 28551 17593 12001 24933 16126 -14686 8057 28133 26290 9755 1424
7684 1424 3016 153 6878 27191 11092 10087 3270 -7970 -18756 -16864 8101 8540 959 3928
7670 3928 89 -8025 -5552 33150 46748 50227 36541 21301 16748 215 6984 288 18929
7657 18929 25950 21208 36467 29650 9374 7672 24264 31742 20199 3676 -15051 -15062 5081
7644 5081 22802 27357 23586 5160 -1959 -5407 -12490 -2471 7502 14226 18604 4494 -17967 -23068
7630 -23068 -6273 15393 27029 27364 11791 6950 -227 -17655 -24598 -8223 -1767 -735 -15998
7617 -15998 -17976 -20461 -9381 -776 -20043 -39105 -25155 -32542 -37324 -47962 -43600 -32650 -27805
7604b7805J0473J7786p048n261Q51k1096p252K5897K3684Q081n463n620R422l878
7590A2771J235Q481L728K605J2262j2416k5801L558M140k9502L582J3530m545
7577f372k6929o415K4078O411k27P618J6691J275o1J535j1991j7886n404N644
7563a2033M902R716k6747q9P367k206J6461n65o988j1245Q585n664k029m128J1936
7548a2727O960j066j6625J2215N828J287L5539J0315L517k2699k896j4440k4580
7535a9372j2792K2942R235k925j1936J0824K4551k037j0605k4427j8261L1120
7523c683J1753J5728m111k7952j5737K6871K014k65q781j725Q730L703P979j1073
7509C451r260J4907J9920R718n799k5758j1321N013R538O297j785k0868L72O542
$$ plain form
7604 -27805 -17332 454 -6594 -11855 -11004 -32100 -39352 -13455 10229 18310 12847 7227 16649 12771
7590 12771 14006 22487 26215 28820 41082 28666 2865 6423 10563 -18939 -15357 -1827 -6372
7577 -6372 -33301 -39716 -15638 -9227 -9454 -1836 14855 16130 16069 17604 5613 -12273 -17677 -12033
7563 -12033 -7131 2585 -24162 -24251 -16884 -19090 -2629 -3194 -10182 -21427 -12842 -18506 -20535 -24663 -12727
7548 -12727 -5767 -6833 -23458 -11243 -5415 -4128 31411 41726 45243 22544 19648 5208 -19372
7535 -19372 -32164 -9222 13 -2912 -14848 -4024 20527 18490 7885 -16542 -34803 -3683
7523 -3683 8070 23798 19687 -8265 -24002 2869 4883 4618 -4163 -5888 2842 6545 14524 3451
7509 3451 -5809 9098 29018 38736 32937 7179 -4142 871 10409 16706 14921 -5947 -5575 967
7495I67K532K707j7480j6031J0690Q224J0566J3856L121J0440r421j2662P228
7482A4737J2598m887j7443j1222n036K2878k660k2824J0493K078J3385M761R356
7469B6214M438L052j2256k0133K772K3330q966k3415j3898o484j8131N213q634
7456d6898k203M9778O331J460K0369j3231k1707L882J2979j4789n206k051J765
7443i521K0671N089l04R172j0844k1084m425j3743N682M224J8471R293O120J7305
7429C6106O291k4775j6004J1943j0905j836J2885k7180k5147j511J2096M0271
7417A2234N682k6015j4591M769K5826k36k3993K188L006j3427j077m354O478N713
7403a7797l675K079J0783J8038k36l690P04Q227P446L90l1601k0762n285K3527
$$ plain form
7495 967 3499 6206 -11274 -27305 -16615 -8391 2175 16031 19152 29592 20171 7509 14737
7482 14737 27335 22448 5005 -6217 -11253 11625 8965 -13859 -3366 -1288 12097 16858 26214
7469 26214 30652 33704 21448 1315 4087 27417 18451 -4964 -18862 -25346 -43477 -38264 -46898
7456 -46898 -49101 677 7008 8468 28837 15606 -6101 -2219 10760 -4029 -9235 -11286 -9521
7443 -9521 11150 16239 15935 25107 14263 -6821 -11246 -24989 -19307 -15083 3388 12681 18801 36106
7429 36106 42397 17622 1618 13561 2656 820 13705 -13475 -38622 -40133 -28037 12234
7417 12234 17916 -8099 -22690 -17921 7905 7669 -16324 -14136 -11130 -24557 -25634 -29988 -23510 -17797
7403 -17797 -21472 -19393 -8610 9428 9192 5502 6206 14433 21879 22269 -9332 -30094 -35379 -11852
7389a1852K1263J2456j5713j2307p127k3186j2594j2245K108K5877O609l386K2296
7376g801J6714o319o050K947J2760m28k4506M921J7327j4354K532q844J7525N665
7362A2089j6859m5j1051J939J198J6804K0365l1297j3388j818p568m415K93l256
7348c7009R156Q101J0103p163l372L99R238p915Q072P547j7993M2J6606J2464
7334H276O737j3135o599k9213m85L559J22O990J7278N279l769j7278j3063j6175
7320e1476J0973K1235O509J8345J0820m508j7377l381j0295P811R466Q500J3032
7307A9654K2798K783K20p408j2535l8651N043M876m791j4747J7169Q134j3042
7294a0497o300J5226p879j0961L048K6614L594k7866j8066m063P088j993N825
$$ plain form
7389 -11852 9411 21867 6154 -6153 -13280 -36466 -49060 -61305 -59197 -33320 -26711 -30097 -7801
7376 -7801 8913 2594 -3456 -509 12251 11823 -12683 -7762 9565 -4789 -2257 -11101 6424 12089
7362 12089 -4770 -4815 -15866 -13927 -12729 4075 24440 -6857 -20245 -22063 -29631 -34046 -33753 -37009
7348 -37009 -27853 -19752 -9649 -16812 -20184 -19785 -10547 -18462 -10390 -2843 -20836 -20794 -4188 8276
7334 8276 15013 1878 -4721 -33934 -34419 -30860 -30738 -23748 -6470 -1191 -4960 -22238 -35301 -51476
7320 -51476 -40503 -19268 -12759 5586 16406 11898 -5479 -8860 -19155 -11344 -1878 6622 19654
7307 19654 42452 45235 45455 38047 25512 -13139 -8096 -3220 -8011 -22758 -5589 2545 -10497
7294 -10497 -16797 -1571 -9450 -20411 -17363 9251 12845 -15021 -33087 -37150 -30062 -32055 -26230
7281b6230J141J6333J1916L54k3362m342q331q638K909k565Q555J5302l964p255
7267b8177R760J0175K1777J297K517j2737q317l377j2973o312q269M353Q649K899
7253a8735J1991J0268o296j985o456p284j2090P111J4929m986K180J1544p735
7240g544j3138J4517K7383J311j0068k4429L744j997o999J2978J9120N571j0723
7227I726N460J4240K086j7255k5354k437q37k302R282J3143M945k8307j1783k687
7213c2080j157K2521O992Q49Q139L619M84r952L699k669O240o511r803k8007P226
7198c0410J2176q802k634K190p469J9060Q033r384N254k659j4615l824m668J5875
7184b1877L4207j344J714O050l558r752j9323N298p338j6496p053N160J2619p241
$$ plain form
7281 -26230 -25089 -8756 3160 3514 -19848 -24190 -32521 -41159 -38250 -40815 -32260 -16958 -20922 -28177
7267 -28177 -18417 -8242 13535 14832 17349 4612 -3705 -7082 -20055 -26367 -34636 -30283 -21634 -18735
7253 -18735 -6744 3524 -2772 -4757 -11213 -18497 -30587 -23476 -8547 -13533 -11353 191 -7544
7240 -7544 -20682 -6165 21218 22529 12461 -11968 -8224 -10221 -17220 -4242 14878 20449 9726
7227 9726 15186 29426 31512 14257 -11097 -13534 -14371 -16673 -7391 5752 10697 -17610 -29393 -32080
7213 -32080 -33237 -10716 -3724 -2875 5264 8883 9367 -585 3114 445 6685 174 -9629 -37636 -30410
7198 -30410 -18234 -27036 -29670 -27480 -34949 -15889 -7856 -17240 -11986 -14645 -29260 -33084 -37752 -21877
7184 -21877 12330 10986 12700 18750 15192 5440 -13883 -8585 -15923 -32419 -39472 -34312 -21693 -28934
7170b8934Q618J1462J7505N648J0246l436Q925k0742l7062M416O579j3910N928
7157b4757J242J3985L3643J1395j7518p400J4272m498j2276j2567m214l270R581
7144b382k590P826J6060J0274j058j6919j3022n035j3832N881J6171Q553o78j5266
7130f017N177j952j3074p749j5902j2327P778K8638l111k3542j053J9464R109
7117a4561P736J3623J4851j5726r983K743l413k023J4016Q769p831k2375j3859
7104b8033J8643J3303J7224O992n762j1155K910j872J2435j9569k7402l605J9317
7091f574J2644m740j3506O21M33J2762K5125m554q199j9379k1352K302M472M523
7077a5422K7687p87j479k191J588P601n7J4588J7276k5158p043J153P468k21j1508
$$ plain form
7170 -28934 -20316 -8854 8651 14299 24545 21109 30034 9292 -27770 -23354 -16775 -30685 -24757
7157 -24757 -23515 -9530 24113 35508 17990 10590 24862 20364 8088 -4479 -8693 -11963 -2382
7144 -2382 -4972 2854 18914 29188 28130 11211 -1811 -6846 -20678 -14797 1374 9927 9249 -6017
7130 -6017 -840 -2792 -15866 -23615 -39517 -51844 -44066 -15428 -18539 -42081 -43134 -23670 -14561
7117 -14561 -6825 6798 21649 5923 -4060 -1317 -4730 -6753 7263 16032 8201 -14174 -28033
7104 -28033 -9390 3913 21137 28129 22367 11212 14122 12250 24685 5116 -22286 -25891 -6574
7091 -6574 6070 1330 -12176 -11555 -11122 1640 26765 22211 14012 -5367 -26719 -24417 -19945 -15422
7077 -15422 12265 11478 9999 7808 9396 16997 16940 31528 48804 23646 16603 17756 25224 25003 13495
7062A3495k0538R120l802j830Q497o810j1792q018J617J0968j3522N198M73P65
7048a6179L83J6943k688j2887J454J0831L5627J3402j4330j4962M456k1379q591
7035g920p623J5872K2173l839k39j7345j3600j1n031J2650J2391O636J3645n749
7021B2010j244k071j7762r457R794j1687j0499J1061M062j44J0215j439P364J4507
7007B4710K753k8529m132J5279l394Q044j3391N661j1213j9099J5495J1285n973
6994b504j4504p695o169j0868K4931J1997P902n784j3167j0522P191m928J6260
6981g860J8401K439j4771n176j4280J7207j4693R29l975N771j3038J1121J4034
6968c891O512n190k906p720j8276m023R014J9524K1936p399p422k693p343j2182
$$ plain form
7062 13495 -7043 2077 -1725 -3555 4942 -1868 -13660 -21678 -20061 -9093 -22615 -17417 -16944 -16179
7048 -16179 -15796 1147 -1541 -14428 -12974 -2143 33484 46886 32556 17594 22050 671 -7920
7035 -7920 -15543 329 22502 18663 18424 1079 -12521 -12532 -17563 -4913 7478 14114 27759 22010
7021 22010 20766 18695 933 -8524 1270 -10417 -20916 -9855 -5793 -5937 4278 2839 10203 24710
7007 24710 27463 -1066 -5198 10081 6687 14731 1340 7001 -4212 -23311 -7816 3469 -2504
6994 -2504 -17008 -24703 -30872 -41740 -16809 -4812 3090 -2694 -15861 -26383 -19192 -24120 -7860
6981 -7860 10541 12980 -1791 -6967 -21247 -4040 -18733 -17804 -21779 -16008 -29046 -17925 -3891
6968 -3891 2621 -2569 -5475 -13195 -31471 -35494 -26480 -6956 14980 7581 159 -2534 -9877 -22059
6954b2059j6570k687R209R684K3520M872k2376L782R548r480k1709j1836k413
6941d8515m581o940J7412J4433J7283J3614J2414j987j5912k421o604R758J0175
6928H129j0590L42O398J1339K3703J151k2347j4732J1807Q600j4564k3797o859
6915b1420l497J6522J296j3537k0060p664R124K7609J1604P3J1654N294k9552
6902a2554j1881K140J2179r458M281L896J664l776J5117j972Q319J4643M419k689
6888B4328o612P023Q013J963l1604k3590j5340J1722K5066J1479l139J2498j4715
6875G092k2853J4951j9371l098K0200R310q970j115P989K241j2766M666J614j1982
6861a2092n123M417J1815j766O852J1358o425r151m35J6687J125j5865J474L502
$$ plain form
6954 -22059 -38629 -41316 -32107 -22423 1097 5969 -16407 -12625 -3077 -12557 -34266 -46102 -48515
6941 -48515 -53096 -60036 -42624 -28191 -10908 2706 15120 13133 -2779 -5200 -11804 -2046 8129
6928 8129 -2461 -2119 4279 15618 39321 40472 18125 3393 15200 23800 9236 -14561 -21420
6915 -21420 -24917 -8395 -7099 -20636 -40696 -48360 -39236 -11627 -23 50 11704 16998 -12554
6902 -12554 -24435 -22295 -10116 -19574 -15293 -11397 -9733 -13509 1608 -364 7955 22598 27017 24328
6888 24328 17716 24739 32752 34715 3111 -20479 -35819 -24097 969 12448 9309 21807 7092
6875 7092 -15761 -810 -20181 -23279 -3079 6231 -2739 -3854 4135 6376 -6390 -1724 -110 -12092
6861 -12092 -17215 -12798 -983 -2749 4103 15461 9036 -115 -550 16137 17262 1397 2871 6373
6847F373K600o168k5188q146N208k415K108K069R106J7216k1032k6050k615m6
6833d6980R978q500j1266J0322J1491J472J1308Q779L2255J1752p495l006J1394
6820C1504J6896m511n503r283k5j3433k977L894k6619l1576Q836J0321R747J1969
6806g60o740J3481K56j9235J8956K990q475J416K402n189j9677K3884P019M713
6792A5041l087k9731k8729j664K6109L1841Q896j2152j750R575l083k6595j22
6779a5451K2446Q534j9183j8886m831J3381Q676J8079r849J5245J9434r362j8052
6766A0181r640K853r570O901j1729m934J134Q295J0022K310m559k7235j80K8854
6752B703J0929j1201q525j1590R369M417J4535j5207l5K722J1749k944k0255L249
$$ plain form
6847 6373 8973 2805 -22383 -30529 -25321 -27736 -25628 -23559 -14453 2763 -18269 -44319 -46934 -46980
6833 -46980 -37002 -45502 -56768 -46446 -34955 -33483 -22175 -13396 18859 30611 23116 20110 31504
6820 31504 48400 43889 38386 29103 29078 15645 12668 16562 -10057 -41633 -32797 -22476 -12729 -760
6806 -760 -7500 5981 6237 -12998 5958 8948 473 1889 4291 -898 -20575 3309 10328 15041
6792 15041 11954 -17777 -46506 -48170 -22061 9780 18676 6524 4774 14349 11266 -15329 -15451
6779 -15451 6995 15529 -3654 -22540 -27371 -13990 -5314 12765 2916 18161 37595 28233 10181
6766 10181 541 3394 -6176 725 -11004 -15938 -14804 -6509 3513 5823 1264 -25971 -26151 2703
6752 2703 13632 2431 -6094 -17684 -8315 -3898 10637 -4570 -4605 -1883 9866 6922 -13333 -10084
6738a0084J9320j6019r738r599K0824P95J0977J231m655P132j313j1070O197J4561
6724A8559j7471j0318J5830l691j3871j0403P415j32k0286j3940J8764K1807J7031
6711I294j5680Q000o126j9008J7734J0709J5587k599l789n780L809P567m735R838
6697B4821J5713j84k6628j8825j7782J6221J6456K45J1316K054k2809n675l672
6684h749k344n404o364q92J8203K299L186J5968k5604j9249p379j1899j1595R609
6670e0214K4586J364K2692M348J909L2402Q653k2853j2796M997o563k3631L370
6657a1736l058p431K5661J022m335j2366m857J2704J2842L49n180o253K933p006
6643f711J4181j6340k0714Q969O282q99K890j8706N015P695l912j0509j538k874
$$ plain form
6738 -10084 9236 -6783 -16521 -26120 -5296 -4501 6476 7707 3052 10184 8871 -2199 3998 18559
6724 18559 1088 -9230 6600 2909 -10962 -21365 -13950 -14082 -34368 -48308 -29544 -7737 9294
6711 9294 -6386 1614 -4512 -23520 -5786 4923 20510 17911 14122 8342 12151 19718 14983 24821
6697 24821 40534 40350 13722 -5103 -22885 -6664 9792 10037 21353 23407 598 -5077 -8749
6684 -8749 -11093 -16497 -22861 -23753 -5550 -3251 -65 15903 -9701 -28950 -36329 -48228 -59823 -50214
6670 -50214 -25628 -24264 -1572 2776 4685 37087 45740 22887 10091 15088 8525 -15106 -11736
6657 -11736 -14794 -22225 3436 4458 123 -12243 -17100 -4396 8446 8795 3615 -2638 295 -6711
6643 -6711 7470 -8870 -29584 -20615 -14333 -15232 -12342 -31048 -26033 -18338 -22250 -32759 -34297 -37171
6629c7171l325k984m985K6066O556J544J1018k1020L548J1315p647p086J3424
6616a0747J330J164P971J782m778j7254M997O980N443Q207r978J0047J8535j5841
6602G858m168R125K801J146j8777p244O137p6N266r123j7378J6256l591j5098
6588b6866K197P691j1191q743P272J3019O871j4457R712J0661P377j754n175M37
6574b949J2007J1688j0699q382j2852j0246p253l07l1835n235J1957K0361J283
6561c2462l738k347K2566J246j498Q747N898R529L827m103J9203j1885k0767k0940
6547b6724M349M68N518N930q866J6024l158p542J7110j3935j0306L867J4557R688
6533F980m6Q079J480N348j7104j5830J6026Q520k6854l601J8917J4616j367j0812
$$ plain form
6629 -37171 -40496 -43480 -48465 -22399 -15843 -14299 -3281 -24301 -20753 -9438 -17085 -24171 -10747
6616 -10747 -9417 -8253 -282 1500 -3278 -20532 -15535 -8555 -3112 5095 -4883 5164 23699 7858
6602 7858 3690 12815 15616 16762 -2015 -9259 -3122 -3198 2068 -7055 -24433 -8177 -11768 -26866
6588 -26866 -24669 -16978 -28169 -36912 -29640 -16621 -9750 -24207 -14495 -3834 3543 1789 -3386 -2949
6574 -2949 9058 20746 10047 1665 -11187 -21433 -28686 -28993 -60828 -66063 -54106 -33745 -32462
6561 -32462 -36200 -38547 -15981 -14735 -16233 -7486 -1588 7941 11768 7665 26868 14983 -5784 -26724
6547 -26724 -22375 -21907 -16389 -10459 -19325 -3301 -6459 -14001 3109 -10826 -21132 -17265 -2708 6980
6533 6980 6934 15013 16493 21841 4737 -11093 4933 13453 -13401 -17002 1915 16531 15164 4352
6519D352j9122K830L3499R729m960k375J183J5345r448j6626j5294J499Q883j3295
6505c800J1705K3874o261k936Q037K4467r2k5230k2483j9746o786J6824K959j5436
6491a4904J4407J4378O572J024j3128p78j0968m507j0893N479p603K127r024j381
6477b9199Q039O849Q590J6608J1138k3890K597J896J3879r496k7578N523j908
6464a6952K0502O977j0387O203K600j3493m027j5365O621q169N203k331k061J6684
6450g995L46j1912o442M626n881q377K1972L4480j0474k0597j67j2478R278J3499
6436a22n813j2349Q877L43N712k952Q428N3R301L102k7434K74j1436L466L0008
6421I458K2777m720p230m307l2004j204K800Q498J5513j0348q227k763K4391O782
$$ plain form
6519 4352 -14770 -11940 21559 31288 26328 23953 25136 40481 31033 14407 -887 612 9495 -3800
6505 -3800 7905 31779 25518 22582 30619 55086 54994 29764 7281 -12465 -19251 -2427 532 -14904
6491 -14904 -497 13881 20453 21477 8349 7571 -3397 -7904 -18797 -13318 -20921 -18794 -27818 -29199
6477 -29199 -21160 -14311 -5721 10887 22025 -1865 732 2628 16507 7011 -20567 -15044 -16952
6464 -16952 3550 10527 140 6343 8943 -4550 -8577 -23942 -17321 -25490 -20287 -22618 -24679 -7995
6450 -7995 -7649 -19561 -26003 -21377 -27258 -35635 -13663 20817 10343 -10254 -10421 -22899 -13621 -122
6436 -122 -5935 -18284 -9407 -9064 -3352 -6304 2124 2177 11478 14580 -12854 -12580 -24016 -20550 9458
6421 9458 32235 27515 20285 15978 -16026 -17230 -14430 -5932 9581 -767 -8994 -11757 12634 19416
6407A9416q345O992J5456j2993k6231q864o122m653j5266j774J5861J4061K1630
6394I168J0314j3488q548r826o319O579k267K451l936n725o80J2863J6201q126
6380a339r350j1616J0555N44q0p986Q706J8695r387L950n309o773J5821m315m371
6365b255J7294N204k143k5563j0007l11k043k04M972o231N738O577j3999o513
6351b9484K1123K5725j6244j2614l45J2304j925p592J1972p49j0854p758Q955
6338g486K887J162J4978q630j4587q500r345j986J5257K2518J6233o37K209l613
6324B0460p845J720m574p742j7079j0853L070K336Q668L930Q946J3764Q034Q68
6310B3703j6702k7834k2472o624P496J3666n102j0039l838N17O271L7110L1945
$$ plain form
6407 19416 11071 18063 33519 20526 -5705 -14569 -20691 -25344 -40610 -42384 -26523 -12462 9168
6394 9168 19482 5994 -2554 -12380 -18699 -12120 -14387 -11936 -15872 -21597 -22277 -9414 6787 -1339
6380 -1339 -10689 -22305 -11750 -11206 -11286 -19272 -10566 8129 -1258 2692 -2617 -9390 6431 2116 -2255
6365 -2255 15039 20243 18100 -7463 -17470 -17781 -19824 -20028 -15056 -21287 -15549 -8972 -22971 -29484
6351 -29484 -8361 17364 1120 -11494 -11839 465 -1460 -9052 2920 2171 -8683 -16441 -7486
6338 -7486 -4599 -3437 11541 2911 -11676 -20176 -29521 -31507 -16250 6268 22501 21864 24073 20460
6324 20460 12615 14335 9761 2019 -15060 -25913 -22843 -20507 -11839 -7909 1037 14801 22835 23703
6310 23703 7001 -20833 -43305 -49929 -42433 -28767 -33869 -43908 -47746 -47229 -40958 -3848 28097
6297B8097j1300j3426J814k71J4007n561j1211j5589j4435J1234l270j4633j0768
6284d5312K6157K8420K265J0140n616l121j7011J438M10j7918p645J5250K5786
$$ plain form
6297 28097 16797 3371 5185 4914 18921 13360 2149 -13440 -27875 -16641 -19911 -34544 -45312
6284 -45312 -19155 9265 11530 21670 16054 12933 -4078 -2640 -2230 -20148 -27793 -12543 13243
$$ [...]
##END NTUPLES=NMR SPECTRUM
##END=
