##TITLE=Analysis number 318039
Compound Code cc 03813
Book Reference 444/94
Project Code adrs
Chemist Name howarde
##JCAMPDX= 6.0         $$ Bruker NMR JCAMP-DX V2.0
##DATA TYPE= NMR SPECTRUM
##DATA CLASS= NTUPLES
##ORIGIN= Bruker BioSpin GmbH
##OWNER= nmr
$$ XWIN-NMR		Version 3.5
$$ Mon Mar 13 14:14:16 2006 GMT Standard Time (UT+0h)  MAYBRIDGE\nmr@NMR_250MHZ
##.OBSERVE FREQUENCY= 250.131544655141
##.OBSERVE NUCLEUS= ^1H
##.ACQUISITION MODE= SIMULTANEOUS (DQD)
##.ACQUISITION SCHEME= undefined
##.AVERAGES= 16
##.DIGITISER RES= 18
##SPECTROMETER/DATA SYSTEM= dpx250
##.PULSE SEQUENCE= zg30
##.SOLVENT NAME= CDCl3
##.SHIFT REFERENCE= (INTERNAL, CDCl3, 0, 16.522)
##AUDIT TRAIL= $$ (NUMBER, WHEN, WHO, WHERE, WHAT)
$$ ##TITLE= Audit trail, XWIN-NMR		Version 3.5
$$ ##JCAMPDX= 5.01
$$ ##ORIGIN= Bruker BioSpin GmbH
$$ ##OWNER= nmr
$$ C:\u/data/dgb/nmr/ADRS/610/pdata/1/auditp.txt
$$ ##AUDIT TRAIL=  $$ (NUMBER, WHEN, WHO, WHERE, WHAT)
(   1,<2006-03-13 14:13:56.59 +000>,<MAYBRIDGE\nmr>,<NMR_250MHZ>,
      <created by zg, POWCHK disabled, PULCHK disabled
       configuration hash MD5:
       84 BC 41 DB A1 6E 1D 46 DA 25 12 A5 C1 ED C5 3A
       data hash MD5: 64K
       6F B6 16 F7 50 D0 44 6C 3E FF 4F 3E BD CB 71 04>)
(   2,<2006-03-13 14:14:08.13 +000>,<MAYBRIDGE\nmr>,<NMR_250MHZ>,
      <Start of raw data processing
       ef LB = 0.3 FT_mod = 6 PKNL = 1 SI = 32K 
       data hash MD5: 32K
       EF 28 B3 FC A0 CB FF BC 3F E2 74 25 90 DD EB CA>)
(   3,<2006-03-13 14:14:09.66 +000>,<MAYBRIDGE\nmr>,<NMR_250MHZ>,
      <apk 
       data hash MD5: 32K
       36 2D 62 93 13 2C A8 E3 6A D4 71 A1 A9 E0 D2 22>)
(   4,<2006-03-13 14:14:10.52 +000>,<MAYBRIDGE\nmr>,<NMR_250MHZ>,
      <abs ABSG = 5 
       data hash MD5: 32K
       31 90 19 66 F5 58 2D 5D 65 EA CE D1 06 3F 59 B7>)
$$ ##END=
$$ 
$$ hash MD5
$$ 88 9F 61 D4 F8 C0 D7 24 82 91 8B 47 1B 2F 4F 96
##$RELAX= 
##$RELAX= 
##$RELAX= 
##$RELAX= 
##$RELAX= 
##$RELAX= 
##$RELAX= 
$$ Bruker specific parameters
$$ --------------------------
##$DU= <C:\u>
##$EXPNO= 610
##$NAME= <ADRS>
##$PROCNO= 1
##$TYPE= <nmr>
##$USER= <dgb>
##$AMP= (0..31)
100 100 100 100 100 100 100 100 100 100 100 100 100 100 100 100 100 100 
100 100 100 100 100 100 100 100 100 100 100 100 100 100 
##$AQSEQ= 0
##$AQ_mod= 3
##$AUNM= <au_zg>
##$AUTOPOS= <41 >
##$BF1= 250.13
##$BF2= 250.13
##$BF3= 250.13
##$BF4= 250.13
##$BF5= 500.13
##$BF6= 500.13
##$BF7= 500.13
##$BF8= 500.13
##$BYTORDA= 1
##$CFDGTYP= 0
##$CFRGTYP= 5
##$CHEMSTR= <none>
##$CNST= (0..31)
1 1 145 1 1 1 1 1 1 1 1 1 1 1 1 1 1 1 1 1 1 1 1 1 1 1 1 1 1 1 1 1 
##$CPDPRG= <>
##$CPDPRG1= <>
##$CPDPRG2= <>
##$CPDPRG3= <>
##$CPDPRG4= <mlev>
##$CPDPRG5= <mlev>
##$CPDPRG6= <mlev>
##$CPDPRG7= <mlev>
##$CPDPRG8= <mlev>
##$CPDPRGB= <>
##$CPDPRGT= <>
##$D= (0..31)
0 1 0 0 0 0 0 0 0 0.06 0 0 0 0 0 0 0.0002 0 0 0 0 0 0 0 0 0 0 0 0 0 0 
0 
##$DATE= 1142259235
##$DBL= (0..7)
120 120 120 120 120 120 120 120 
##$DBP= (0..7)
150 150 150 150 150 150 150 150 
##$DBP07= 0
##$DBPNAM0= <>
##$DBPNAM1= <>
$$ [...]
##$SUBNAM7= <"">
##$SUBNAM8= <"">
##$SUBNAM9= <"">
##$SW= 20.6930455092707
##$SWIBOX= (0..15)
0 0 3 0 0 0 0 0 0 0 0 0 0 0 0 0 
##$SW_h= 5175.983436853
##$TD= 65536
##$TD0= 1
##$TE= 294.16
##$TE2= 300
##$TE3= 300
##$TEG= 300
##$TL= (0..7)
0 120 120 120 120 120 120 120 
##$TP= (0..7)
150 150 150 150 150 150 150 150 
##$TP07= 0
##$TPNAME0= <>
##$TPNAME1= <>
##$TPNAME2= <>
##$TPNAME3= <>
##$TPNAME4= <>
##$TPNAME5= <>
##$TPNAME6= <>
##$TPNAME7= <>
##$TPOAL= (0..7)
0.5 0.5 0.5 0.5 0.5 0.5 0.5 0.5 
##$TPOFFS= (0..7)
0 0 0 0 0 0 0 0 
##$TUNHIN= 0
##$TUNHOUT= 0
##$TUNXOUT= 0
##$USERA1= <user>
##$USERA2= <user>
##$USERA3= <user>
##$USERA4= <user>
##$USERA5= <user>
##$V9= 5
##$VALIST= <valist>
##$VCLIST= <CCCCCCCCCCCCCCC>
##$VD= 0
##$VDLIST= <DDDDDDDDDDDDDDD>
##$VPLIST= <PPPPPPPPPPPPPPP>
##$VTLIST= <TTTTTTTTTTTTTTT>
##$WBST= 1024
##$WBSW= 4
##$XGAIN= (0..3)
0 0 0 0 
##$XL= 0
##$YL= 0
##$YMAX_a= 344460
##$YMIN_a= -467399
##$ZGOPTNS= <>
##$ZL1= 120
##$ZL2= 120
##$ZL3= 120
##$ZL4= 120
##$ABSF1= 16.522
##$ABSF2= -4.171173
##$ABSG= 5
##$ABSL= 3
##$ALPHA= 0
##$AQORDER= 0
##$ASSFAC= 0
##$ASSFACI= 0
##$ASSFACX= 0
##$ASSWID= 0
##$AUNMP= <proc_1d>
##$AZFE= 0.1
##$AZFW= 0.1
##$BCFW= 0
##$BC_mod= 0
##$BYTORDP= 0
##$COROFFS= 0
##$CY= 12.5
##$DATMOD= 1
##$DC= 0
##$DFILT= <>
##$DTYPP= 0
##$F1P= 14.0000005364418
##$F2P= -0.99999901652339
##$FCOR= 0.5
##$FTSIZE= 32768
##$FT_mod= 6
##$GAMMA= 0
##$GB= 0
##$INTBC= 1
##$INTSCL= 1
##$ISEN= 128
##$LB= 0.3
##$LEV0= 0
##$LPBIN= 0
##$MAXI= 10000
##$MC2= 0
##$MEAN= 0
##$ME_mod= 0
##$MI= 0
##$NCOEF= 0
##$NC_proc= -3
##$NLEV= 6
##$NOISF1= 0
##$NOISF2= 0
##$NSP= 0
##$NTH_PI= 0
##$NZP= 0
##$OFFSET= 16.522
##$PC= 1
##$PHC0= 173.0403
##$PHC1= 5.773979
##$PH_mod= 1
##$PKNL= yes
##$PPARMOD= 0
##$PSCAL= 4
##$PSIGN= 0
##$REVERSE= no
##$SF= 250.13
##$SI= 32768
##$SIGF1= 0
##$SIGF2= 0
##$SINO= 400
##$SIOLD= 32768
##$SREGLST= <1H.CDCl3>
##$SSB= 0
##$STSI= 32768
##$STSR= 0
##$SW_p= 5175.98343685301
##$SYMM= 0
##$S_DEV= 0
##$TDeff= 65536
##$TDoff= 0
##$TI= <Analysis number 999999
Compound Code 99
Book Reference 9
Project Code 9>
##$TILT= no
##$TM1= 0
##$TM2= 0
##$TOPLEV= 0
##$USERP1= <user>
##$USERP2= <user>
##$USERP3= <user>
##$USERP4= <user>
##$USERP5= <user>
##$WDW= 1
##$XDIM= 32768
##$YMAX_p= 508283974
##$YMIN_p= -125769
$$ End of Bruker specific parameters
$$ ---------------------------------
##NTUPLES= NMR SPECTRUM
##VAR_NAME=  FREQUENCY,     SPECTRUM/REAL,   SPECTRUM/IMAG
##SYMBOL=    X,             R,               I
##VAR_TYPE=  INDEPENDENT,   DEPENDENT,       DEPENDENT
##VAR_FORM=  AFFN,          ASDF,            ASDF
##VAR_DIM=   32768,         32768,           32768
##UNITS=     HZ,            ARBITRARY UNITS, ARBITRARY UNITS
##FACTOR=    0.157963299565203, 1,           1
##FIRST=     4132.6476996994, 0,             0
##LAST=      -1043.33573715361, 0,           0
##MIN=       -1043.33573715361, -125769,     0
##MAX=       4132.6476996994, 508283974,     0
$$ Real data points
##PAGE= N=1
##DATA TABLE= (X++(R..R)), XYDATA
$$ [...]
18370A60371K1628K733l3583L1426J3775J1483j4103p54j3741j4775j5908n934
$$ 160371 181999 184732 151149 182575 196350 207833 193730 192976 179235 164460 148552 142618
18358A42618j2994l0043l8606L1106L3923J8519L277p955p639M2229M412O612
$$ 142618 129624 99581 60975 92081 126004 144523 147800 139845 132206 174435 178847 185459
18346A85459K9347K0117l4195k0022j282L0713M0329J4669K0122j3431j8823J5889
$$ 185459 214806 234923 200728 180706 179424 210137 250466 265135 285257 271826 253003 268892
18334B68892O462Q565J0769k431L0158K0652j6969j5812L9310k4157q2866k0458
$$ 268892 275354 283919 294688 292257 322415 343067 326098 310286 349596 325439 242573 222115
18322B22115L5067L4109k2265k0222L215j8650j3105J8231J6011J8719K9475K985
$$ 222115 257182 291291 269026 248804 252019 233369 220264 238495 254506 273225 302700 305685
18310C05685M4399K1263O279k1729q290k390J7846j2971m0539k135l76p021l899
$$ 305685 350084 371347 377626 355897 347607 345217 363063 350092 309553 307418 307042 300021 296122
18297B96122p385L0212J4401J544n0187p3761j7111K9654J2083K5910J7217L0482
$$ 296122 288737 318949 333350 334894 284707 210946 193835 223489 235572 261482 278699 309181
18285C09181L1787K1872M7834m349k4314j0366k0653n042K1608k8760l6774L4409
$$ 309181 340968 362840 410674 406325 382011 371645 350992 345950 367558 338798 302024 336433
18273C36433P3278L5388J9671N657K0103J926j390J3373J8553N9336N2032O3068
$$ 336433 409711 445099 464770 470427 490530 492456 491066 504439 522992 582328 634360 697428
18261F97428J02598K03490K79753K36413J20728q8927k27741j67621m5920l4202
$$ 697428 800026 1003516 1283269 1519682 1640410 1551483 1323742 1156121 1110201 1075999
18251A075999l3164J2312M0286O2467J34145J87354L54731N96454J024200J632178
$$ 1075999 1042835 1055147 1095433 1157900 1292045 1479399 1834130 2430584 3454784 5086962
18241E086962J895120J226289K03302l56429K3091O86890M31889n80286j458387
$$ 5086962 6982082 8208371 8411673 8055244 8078335 8765225 9197114 8616828 7158441
18232G158441j585176j125913p07697m09015k12340k5269J46111K49955N29786
$$ 7158441 5573265 4447352 3739655 3330640 3118300 3093031 3239142 3489097 4018883
18223D018883J063014J762938K371739K108382Q14236o94109j416881q79399K56909
$$ 4018883 5081897 6844835 9216574 11324956 12139192 11445083 10028202 9148803 9405712
18214I405712J503565K080392J434897K18170m25438K53095J445811J241772m71289
$$ 9405712 10909277 12989669 14424566 14642736 14217298 14470393 15916204 17157976 16686687
18205A6686687k363761l093843k503860j557913q71962n19369l35235j63915P1632
$$ 16686687 14322926 11229083 8725223 7167310 6295348 5775979 5440744 5276829 5348461
18196E348461K96917N14485Q70015J542055K792490M723482O238484M885486Q78805
$$ 5348461 5645378 6159863 7029878 8571933 11364423 16087905 22326389 27211875 28090680
18187B8090680l035323m405007k870291l51746K266841N237167P753242Q820052
$$ 28090680 25055357 20650350 17780059 17428313 19695154 24932321 32685563 41505615
18179D1505615O470735J425941k562133k937064K76702K268549l3020m142711
$$ 41505615 47976350 49402291 46840158 43903094 44179796 46448345 46415325 42272614
18171D2272614o421196m862413r35647J632063M57287k333551m300663l436328
$$ 42272614 35851418 30989005 30053358 31685421 32142708 29809157 25508494 22072166
18163B2072166q98112O61663K6540j707151l088972l256695k393327j458330q79050
$$ 22072166 21174054 21835717 21862257 20155106 17066134 13809439 11416112 9957782 9078732
18154I078732m75014j38365J15615L90870Q88150J788440K148539J093706r8123
$$ 9078732 8603718 8465353 8580968 8971838 9859988 11648428 13796967 14890673 14792550
18145A4792550q47158o5990J586871L776072P270695J2312739J5268295R994713
$$ 14792550 13945392 13879402 15466273 19242345 26513040 38825779 54094074 64088787
18137F4088787j39106q955846j0657719o001938k32745N652872J0568334Q368786
$$ 64088787 63949681 54993835 44336116 38334178 38101433 43754305 54322639 62691425
18129F2691425R68431n237065n041556J305120L409374j348657p661042j1063099
$$ 62691425 63659856 58422791 53381235 54686355 58095729 56747072 49086030 38022931
18121C8022931r296114o113116l987733k720759j974050j414877r07821m24934
$$ 38022931 28726817 22613701 18625968 15905209 13931159 12516282 11608461 11183527
18113A1183527J36536O93516J396357K524103M683990R122065J8096134K8308478
$$ 11183527 11320063 12013579 13409936 15934039 20618029 29740094 47836228 76144706
18105G6144706J9192104K771406j3715968j8184156j3492410j1484603j0223763
$$ 76144706 95336810 98108216 84392248 66208092 52715682 41231079 31007316
18098C1007316p193752m543652k854174j834289j215332o99160j57245N31790
$$ 31007316 23813564 19269912 16415738 14581449 13366117 12666957 12509712 13041502
18090A3041502J662027L487794O306504Q780225O566129L19040n410563p405221
$$ 13041502 14703529 18191323 24497827 33278052 39844181 40163221 34752658 27347437
18082B7347437m426371n85921K760976L853407J257127k343269m794019l941681
$$ 27347437 22921066 22335145 25096121 28949528 30206655 27863386 23069367 19127686
18074A9127686j247675J609444M726202N499155J413312l352849o852770n911654
$$ 19127686 17880011 19489455 24215657 29714812 31128124 27775275 20922505 15010851
18066A5010851l663504k286663j481655j007879p61167n71195n11202m61924m02180
$$ 15010851 11347347 9060684 7579029 6571150 5809983 5238788 4727586 4265662 3863482
18057C863482l85528l47160k67098j61860p0492P270O4953R0322J10773K44181
$$ 3863482 3477954 3130794 2863696 2701836 2631344 2638614 2703567 2793889 2904662 3148843
18047C148843N67508J042213J834145K255534J127212m93676j886679k037474
$$ 3148843 3716351 4758564 6592709 8848243 9975455 9481779 7595100 5557626
18039E557626j360478q06332n40118l39151k11169j25306l5087P0662K70035N85704
$$ 5557626 4197148 3390816 2850698 2511547 2300378 2175072 2139985 2210647 2480682 3066386
18029C066386J017168Q41795J9290p67103j067548p24008m65777l16424k01515
$$ 3066386 4083554 4925349 4944639 4177536 3109988 2385980 1920203 1603779 1402264
18020A402264j38119j39118p4372n0227m5044o5978o2699r3750n8905n7957o596
$$ 1402264 1264145 1125027 1050655 1000428 955384 889406 826707 732957 674052 616095 609499
18009F09499j6205r051j0172j3659L0308j1311j0043L4340L9954l7722p4355n1022
$$ 609499 593294 584243 574071 560412 590720 579409 569366 603706 643660 605938 531583 480561
17997D80561l8727j5617k2610k4074j1684J248J9497K8167j6842m2753p357L366
$$ 480561 441834 426217 403607 379533 367849 369097 388594 416761 399919 357166 349809 353175
17985C53175L8268L3056L8921k8152m8539j7840o208k4912l98k6627m9869n321
$$ 353175 391443 424499 463420 435268 386729 368889 362681 337769 337371 310744 260875 255554
17973B55554k9147J8923L630j3458K1973O4888M0181L1136N2923l4952n1832n2872
$$ 255554 226407 245330 248960 235502 257475 322363 362544 393680 446603 411651 359819 306947
17961C06947o4308l9026k7679J6150L5528N046k5326j099K873j5764N962M164
$$ 306947 242639 203613 175934 192084 227612 232658 207332 206233 209106 193342 199304 203468
17949B03468J5507M596J0917n523j1364p487N222k9206J5061L2111Q603k6022
$$ 203468 218975 223571 234488 228965 217601 210114 215336 186130 201191 233302 241905 215883
17937B15883r453K0325J9525J4467l826Q224j1275J1153k3540j8991k3585l4630
$$ 215883 206430 226755 246280 260747 256921 265145 253870 265023 241483 222492 198907 164277
17925A64277j4206J9580M217j4616K7277n565j6751M448J9666J817L2599L2362
$$ 164277 150071 169651 173868 159252 186529 180964 164213 168661 188327 190144 222743 255105
17913B55105Q313l8048k2493M5049K0020m113j4604l6189k5574J5992O436m1906
$$ 255105 263418 225370 202877 247926 267946 263833 249229 213040 187466 203458 209894 167988
17901A67988k6108K9086P689j1496L0342L2846m417J8352j2385l6630m8536k8368
$$ 167988 141880 170966 178655 167159 197501 230347 225930 244282 231897 195267 146731 118363
17889A18363Q875M1775L0704k3972r765k7299j3424r864k0192O538j4565j3606
$$ 118363 127238 169013 199717 175745 165980 138681 125257 115393 95201 101739 87174 73568
17877G3568j7788J2439L8967l099l0287k2548J6131k32L0096M8490K455j9503
$$ 73568 55780 68219 107186 104087 73800 51252 67383 67151 97247 145737 148192 128689
17865A28689M78J1750J342j8018j797L016K5235m247k231L1297N2492L0454n6990
$$ 128689 129167 140917 142259 124241 122444 125460 150695 146448 144217 175514 228006 258460 201470
17852B01470m2524r439K9385j9870m782j5456j1389k4549Q70R432M8141N8439
$$ 201470 158946 149507 178892 159022 154240 138784 127395 102846 103716 113148 161289 219728
17840B19728j1311k1788o0527n1761l2240J951K9407O2777K5783j0615j5774j7347
$$ 219728 208417 186629 126102 74341 42101 44052 73459 136236 162019 151404 135630 118283
17828A18283K2593K7427n1717j8665l2941P785j043k0206M935o223p285J1865
$$ 118283 140876 168303 116586 97921 64980 72765 71722 51516 56451 50228 42943 54808
17816E4808o22K1084J3602j0441j0963p580J7748m4358l2455P596J9638L2445
$$ 54808 54186 75270 88872 78431 67468 59888 77636 33278 823 8419 28057 60502
17804F0502K7118q81K3879Q456j8122m2883k786o364K844O792M006L1726M681
$$ 60502 87620 86739 110618 119074 100952 58069 55283 48919 51763 58555 62561 94287 98968
17791I8968J2423m8485j0694P967L843K4695K6383k1749K7358L8799M9173l308
$$ 98968 111391 62906 52212 60179 64022 88717 115100 93351 120709 159508 208681 205373
17779B05373q0628l0419k0919k7354l2q982J7712L0704K1486l250K8281J9643
$$ 205373 124745 94326 73407 46053 46021 37039 54751 85455 106941 103691 131972 151615
17767A51615l1403l2879J2245j9914P366J9433O213N002j8693k9596l0710j5474
$$ 151615 120212 87333 99578 79664 87030 106463 112676 117678 98985 69389 38679 23205
17755B3205j3334L7038M4799K4848j0965j8270J6563K5997J5939J7558j6170n5198
$$ 23205 9871 46909 91708 116556 105591 87321 103884 129881 145820 163378 147208 92010
17743I2010n243L725k3029L548k60o341j79M672l383R163j0098n319r514M576
$$ 92010 86767 90492 67463 71011 70751 64410 64231 68903 65520 74683 64585 59266 49752 54328
17729E4328j052N038J0145l64j2980L2831L4355k237n360P750M3948L0795Q900
$$ 54328 53276 58314 68459 68095 55115 87946 122301 120064 114704 122454 166402 197197 206097
17716B06097o388L0405j4891j4531k3702l1960m451l6287R156j0965J700J554
$$ 206097 199709 230114 215223 200692 176990 145030 140579 104292 113448 102483 104183 105737
17704A05737m11L7491Q1660M5140J6624L815k4621j5004j5008l7047M685k8559
$$ 105737 105326 142817 224477 269617 286241 290056 265435 250431 235423 198376 203061 174502
17692A74502l1253r908j2989K2128m525l3672m6302K1294L7271l227R567j2312
$$ 174502 143249 133341 120352 142480 137955 104283 57981 79275 116546 113319 122886 110574
17680A10574K3738L7658j5921j6926Q019m97k4314l288L8157L1868M901p563J4087
$$ 110574 134312 171970 156049 139123 147142 146645 122331 119043 157200 189068 193969 186406 200493
17667B00493M3522k329J9395Q052J0141K2775K3621O335L5612j5409j6861k662
$$ 200493 244015 241686 261081 269133 279274 302049 325670 332005 367617 352208 335347 332685
17655C32685O549k9681j5467k4488k5191m8652l1041k1548k5462j3707o689J6328
$$ 332685 339234 309553 294086 269598 244407 195755 164714 143166 117704 103997 97308 113636
17643A13636J2418O81j2216K5669L8423J3354J0390p252m892k4531k1237k4652
$$ 113636 126054 126735 114519 140188 178611 191965 202355 195103 190211 165680 144443 119791
17631A19791o36j208k6321j1282K4243M9005K3567K0550L4907N4718m828j9232
$$ 119791 119155 117947 91626 80344 104587 153592 177159 197709 232616 287334 282506 263274
17619B63274l0856l5390L619Q3900N7335m7152m2367q534n304O341q518l9059
$$ 263274 232418 197028 200647 284547 341882 294730 252363 243829 238525 244866 236348 197289
17607A97289m8734l0872j1659K6046J336j8365l1498O181L3441K0935J3458K6703
$$ 197289 148555 117683 106024 132070 133406 115041 83543 89724 123165 144100 157558 184261
17595A84261j2091l4163k9446j369j8789j453O922K0142K7771M9070P8689J8359
$$ 184261 172170 138007 108561 107192 88403 86950 93872 114014 141785 190855 269544 287903
17583B87903n4430n5630l3373k436p911k4249J9684P988j1296j789K7148N0119
$$ 287903 233473 177843 144470 142034 134123 109874 129558 137546 126250 124461 151609 201728
17571B01728K8984p665k4097l5456l5377k8031n005M0636K0905l5375k1137n290
$$ 201728 230712 223047 198950 163494 128117 100086 95081 135717 156622 121247 100110 94820
17559I4820o119n302m59j1406P450k2053k4521N975l259P3048Q011l4094k2833
$$ 94820 88701 83399 82940 71534 78984 56931 32410 38385 35126 108174 116185 82091 59258
17546E9258L4203K7602Q58j104K8m2709l1800j243K000l1637K99L0887J8525j5582
$$ 59258 93461 121063 121921 120817 120845 78136 46336 45093 47093 15456 15755 46642 65167 49585
17532D9585L1982l0362l9255J230J022K457L552J5427j5683m592N581j4939o763
$$ 49585 81567 51205 11950 13180 14202 16659 20211 35638 19955 15363 20944 6005 -758
17519g58N131R51N4568L0733M568N701k4902q865o554k184K9416r361O652l657
$$ -758 4373 5324 59892 90625 95193 100894 75992 67127 60573 58389 87805 78444 85096 81439
17505H1439K1593M6752p378J4644J9511j5695n827l276j2317l5242j7446J6933
$$ 81439 103032 149784 142406 157050 176561 160866 155039 151763 139446 104204 86758 103691
17493A03691J041J922J8539k0345m4470k1955j7676j4403j884j0449J2003K7063
$$ 103691 104732 106654 125193 104848 60378 38423 20747 6344 4460 -5989 6014 33077
17481C3077J6877K108m1061l499J1823J2439Q233p143M0269J8788q275k6076m15
$$ 33077 49954 52062 11001 7502 19325 31764 39997 32854 73123 91911 83636 57560 57145
17468E7145j0971O733J8482l8668k7381N7228J1125M866k275K4193Q512k2791
$$ 57145 46174 52907 71389 32721 5340 62568 73693 78559 76284 100477 108989 86198
17456H6198k3411J153j8423r802K3832M791J4359J8301M101m1963m8084j4983
$$ 86198 62787 63940 45517 35715 59547 64338 78697 96998 101099 59136 11052 -3931
17444c931K6085q002J8398P4908J34006R3337j6677p1416q2262l0584l8001l5393
$$ -3931 22154 14152 32550 107458 241464 334801 318124 246708 164446 133862 95861 60468
17432F0468L659J0101r076m7755J7581N0186m0230n6545l4684N6926P2J596j8359
$$ 60468 64127 74228 65152 17397 34978 85164 44934 -11611 -46295 10631 10703 12299 -6060
17419f060m4339L9801N6205O093O067q153R727j9906R921J5167j0596N512R622
$$ -6060 -50399 -10598 45607 51700 57767 49614 59341 39435 49356 64523 53927 59439 69061
17406F9061K1650J0466j4462m6644l2823k0955k597R251k220J075L960o751J0324
$$ 69061 90711 101177 86715 40071 7248 -13707 -16304 -7053 -9273 -8198 -4238 -10989 -665
17393f65J9746J630k7091j6348l7242k0584p910L2675J2858L3521J4084J4651
$$ -665 19081 20711 -6380 -22728 -59970 -80554 -88464 -55789 -42931 -9410 4674 19325
17381A9325N1263k0573m9729k6368q383l2703M576l7182K6970L9162L9811L5462
$$ 19325 70588 50015 286 -26082 -34465 -67168 -62592 -99774 -72804 -33642 6169 41631
17369D1631R523m879k8363j4422j6315K9845n290j6447p941K950J100j1471j652
$$ 41631 51154 46275 17912 3490 -12825 17020 11730 -4717 -12658 -9708 -8608 -20079 -21731
17356b1731q106L771K3135k9235j6612j781J0314J9316q800q821Q386J7564R004
$$ -21731 -29837 -26066 -2931 -32166 -48778 -50559 -40245 -20929 -29729 -38550 -30164 -12600 -3596
17343c596K2362M045j6822n427K2577K1917l2134O079r028J67p835j4328P318
$$ -3596 18766 22811 5989 562 23139 45056 12922 19001 9973 10140 2305 -12023 -4705
17330d705J0962l2665j4372M9024O185k0999K0586K0842k2514l9783J480J7462
$$ -4705 6257 -26408 -40780 8244 14429 -6570 14016 34858 12344 -27439 -25959 -8497
17318h497j6746L966J5981o987j9270j4997Q833j6781p627J1566K5826J5215K0382
$$ -8497 -25243 -21277 -5296 -12283 -31553 -46550 -37717 -54498 -62125 -50559 -24733 -9518 10864
17305A0864o975l2883J8651J7992K9156K5014j5290l0491K835J6152j6036J8688
$$ 10864 3889 -28994 -10343 7649 36805 61819 46529 16038 18873 35025 18989 37677
17293C7677P174p492l8965J574K4971J0426l819o967J601n100o52j6709N492M870
$$ 37677 44851 37359 -1606 -32 24939 35365 31546 24579 26180 21080 20428 3719 9211 14081
17279A4081K3868k5285k5179k2718j415j2504M8378K1481j5510k2542P563L2151
$$ 14081 37949 12664 -12515 -35233 -36648 -49152 -774 20707 5197 -17345 -9782 22369
17267B2369L2589J4925k6126m8903l80k3554j5195K671J7349L4368Q408J8302
$$ 22369 54958 69883 43757 -5146 -5526 -29080 -44275 -41604 -24255 10113 18521 36823
17255C6823q162k4448L553J5879l0447j6184K854K9569K8598k4160k1438K1781
$$ 36823 28661 4213 7766 23645 -6802 -22986 -20132 9437 38035 13875 -7563 14218
17243A4218J9743r938k1647o431J948j29l0268Q928N0657J0194l3784m0786N884
$$ 14218 33961 24023 2376 -4055 -2107 -2236 -32504 -23576 27081 37275 3491 -37295 -31411
17230c1411M3337R21j3956J2815n703O652J7884K1407k0947m2236n4191j5060
$$ -31411 11926 12847 -1109 11706 6003 12655 30539 51946 30999 -11237 -65428 -80488
17218h0488N197K2092q968m253R411P018K5549L8035K7713k0407m6029l3930l738
$$ -80488 -75291 -53199 -62167 -66420 -57009 -49991 -24442 13593 41306 20899 -25130 -59060 -62798
17205f2798M462L0243k8578o986j6766J1664K0484k4742p565K031J4504L0685
$$ -62798 -58336 -28093 -56671 -63657 -80423 -68759 -48275 -73017 -80582 -78551 -64047 -33362
17193c3362N6952L4834M506j6619J2114L331r348j4006k7915n342R297n320j8347
$$ -33362 23590 58424 62930 46311 58425 61756 52408 38402 10487 5145 14442 9122 -9225
17180i225J486K8276J9196M301k0666j9318n188J6886k8151l7566K0904M5120
$$ -9225 -7739 20537 39733 44034 23368 4050 -1138 15748 -12403 -49969 -29065 16055
17168A6055m025j2014M1924k2695O660J5187k8823j6303q840l741p797J1779L845
$$ 16055 12030 16 41940 19245 25905 41092 12269 -4034 -12874 -16615 -24412 -12633 -8788
17155h788j0031j5198J610n1L535J2766L2738q205m6302j6934m132K071J8581
$$ -8788 -18819 -34017 -32407 -32458 -28923 -16157 16581 8376 -37926 -54860 -58992 -56921 -38340
17142c8340J8167J9322l2J4171M2309M9911j8798k9610m7634k1066Q375J6352
$$ -38340 -20173 -851 -883 13288 55597 105508 86710 57100 9466 -11600 -3225 13127
17130A3127k4111l272l7030r218J6829J5653m86J2655J0042P76l520M324K3026
$$ 13127 -10984 -14256 -51286 -60504 -43675 -28022 -28508 -15853 -5811 -5035 -8555 -4231 18795
17117A8795j3698k5828r959k488J1557J6392k151j2785m4000M740L8889K0626
$$ 18795 5097 -20731 -30690 -33178 -21621 -5229 -7380 -20165 -64165 -59425 -20536 90
17105I0p155m686J6560J6511l4535o36J0227P74O385m8740j5540j0118k619k7993
$$ 90 -7065 -11751 4809 21320 -13215 -13851 -3624 -2850 3535 -45205 -60745 -70863 -73482 -101475
17091a01475L9058J1832P706N2308K3369j0544m2976P304j6448r681J190p482
$$ -101475 -62417 -50585 -42879 9429 32798 22254 -20722 -13418 -29866 -39547 -38357 -45839
17079d5839K6831L7500j0288l962M4327k069k1829r718N408k5400n207j4306J9440
$$ -45839 -19008 18492 8204 4242 48569 46500 24671 14953 20361 -5039 -10246 -24552 -5112
17066e112L379j2944n148j9521j9054K8995M1594q268o356L9105K3570k8459k9666
$$ -5112 -1733 -14677 -19825 -39346 -58400 -29405 12189 3921 -2435 36670 60240 31781 2115
17053B115m196L7732q231l8768J0321K6770R845n594k8345p688k3567L14j0351
$$ 2115 -2081 35651 27420 -11348 -1027 25743 35588 29994 1649 -6039 -29606 -29292 -39643
17040c9643k825K5186N169J4471j1340j906j8324k9218N321K295M4991Q056P998
$$ -39643 -42468 -17282 -12113 2358 -8982 -10888 -29212 -58430 -53109 -50814 -5823 2233 10231
17027A0231L1363k5839K780pk2710l2869j8040J0797K6758P492m452j252J5380
$$ 10231 41594 15755 18535 18528 -4182 -37051 -55091 -44294 -17536 -10044 -14496 -15748 -368
17014c68M360J1520Q221k2665j6096r81j1914n324k986M5252K2267M918n5515
$$ -368 3992 15512 23733 1068 -15028 -16009 -27923 -33247 -36233 9019 31286 36204 -19311
17001a9311n3797R548K2898J1673M1340l74r148j8386K9649j1523j0014k1628
$$ -19311 -73108 -63560 -40662 -28989 12351 11977 2829 -15557 14092 2569 -7445 -29073
16989b9073J359l083R159M0271J5574n363P346k6241p838k3392j3956r969M1541
$$ -29073 -27714 -30797 -21638 18633 34207 28844 36190 9949 2111 -21281 -35237 -45206 -3665
16976c665k881J0737M1768m798m4517K858m139L4446r21j7029j2423j5108k8189
$$ -3665 -6546 4191 45959 41161 -3356 -498 -4637 29809 28888 11859 -564 -15672 -43861
16963d3861K4955L6654O395k8646j1102J3036M48j7487j6337K7360j7453J5021
$$ -43861 -18906 17748 24143 -4503 -15605 -2569 -2121 -19608 -35945 -8585 -26038 -11017
16951a1017J8011N893N593m4505q675j7264n391P7938K0258k5671l8632L717n786
$$ -11017 6994 12887 18480 -26025 -34700 -51964 -57355 20583 40841 15170 -23462 -19745 -25531
16938b5531j8039r861P111K3378J6287R128K8799L2278M934k0666l5478j0399
$$ -25531 -43570 -53431 -46320 -22942 -6655 2473 31272 63550 68484 47818 12340 1941
16926A941J0627Q006k2437L3115k366m1648J2316O0366L4230n038o16l6561k3379
$$ 1941 12568 20574 -1863 31252 28886 -12762 -446 59920 94150 89112 88496 51935 28556
16913B8556j7169j8146N196J4170J0191K8787k2294l4380m1321k2921J5813q682
$$ 28556 11387 -6759 -1563 12607 22798 51585 29291 -5089 -46410 -69331 -53518 -62200
16901f2200L5242M8083j0153l9246J9759K6060p198j3654M016Q807j1527o964
$$ -62200 -26958 21125 10972 -28274 -8515 17545 10347 -3307 709 9516 -2011 -8975
16889h975J0647p610j3841K1510M925O090J1033j9139k6060l9486L740J7037L790
$$ -8975 1672 -5938 -19779 1731 6656 12746 23779 4640 -21420 -60906 -57166 -40129 -36339
16876c6339N4726K6246l9733k1883L3214L4393K8703P767O064k000M893K0516
$$ -36339 18387 44633 4900 -16983 16231 50624 79327 87094 93158 91158 96051 116567
16864A16567j0124n2997j3032l197r042L1727q463k4972n542j0876j544P504k582
$$ 116567 106443 53446 40414 37217 28175 59902 51439 26467 20925 10049 8505 16009 13427
16851A3427j595J8367J4781j423k0088k0851j5931J7831p697j1877J9857K6184
$$ 13427 11832 30199 44980 43557 23469 2618 -13313 4518 -3179 -15056 4801 30985
16839C0985J0597k2246k8354j4993J331M0870L1782K1828J1779l7054j4500l3734
$$ 30985 41582 19336 -9018 -24011 -22680 18190 49972 71800 83579 46525 32025 -1709
16827a709j4923J1673K2211p782P528k4899R929P144M1888j36l1839k3848q883
$$ -1709 -16632 -4959 17252 9470 16998 -7901 2028 9172 51060 50924 19085 -4763 -13646
16814a3646o179M8537l078j698j3822l1320J96N7581K7053l5720o627j8692l0119
$$ -13646 -19825 28712 25634 23936 10114 -21206 -21010 36571 63624 27904 21277 2585 -27534
16801b7534n156k3481L1844J2190j3656q681L4541M5072J6067p552j1772p787
$$ -27534 -32690 -56171 -24327 -12137 -25793 -34474 67 45139 61206 53654 41882 34095
16789C4095j5403n5135j3805O1982L1455n6121J4739R986P756J884J1556o479
$$ 34095 18692 -36443 -50248 11734 43189 -12932 1807 11793 19549 21433 32989 26510
16777B6510j5820o290m7890j4082K3757O817K1892J4320n483J8831J0044j8125
$$ 26510 10690 4400 -43490 -57572 -33815 -26998 -5106 9214 3731 22562 32606 14481
16765A4481K0476L926j9102K1167k4470j3730P75J2580j3013K7502L778k1390
$$ 14481 34957 38883 19781 40948 16478 2748 3523 16103 3090 30592 34370 12980
16753A2980k3027o909M727j2368K372J1484O942j4795K4212M3579j2357j2227
$$ 12980 -10047 -16956 -12229 -24597 -22225 -10741 -3799 -18594 5618 49197 36840 24613
16741B4613k4333P428l252m8711Q343j7313L4653L2005J2107k9594k5547j7418
$$ 24613 280 7708 4456 -44255 -35912 -53225 -18572 13433 25540 -4054 -29601 -47019
16729d7019k069L5687N0482L8052k3349m2150o644L368O55j4598J5884J9881K1469
$$ -47019 -49088 -13401 37081 75133 51784 9634 2990 6358 7013 -7585 8299 28180 49649
16716D9649J8110J906l3619k1860j6471J0548J7261j2798k5767j1306K876m65
$$ 49649 67759 69665 36046 14186 -2285 8263 25524 12726 -13041 -24347 -21471 -21936
16704b1936K8455L6479K2955j1086J7655N885l5071k0362l0542J248l1574J6022
$$ -21936 6519 42998 65953 54867 72522 78407 43336 22974 -7568 -6320 -37894 -21872
16692b1872n58K831k6205m0126J1735K5576K6238L5960J4564n247j4324P886O491
$$ -21872 -22430 -19599 -45804 -85930 -74195 -48619 -22381 13579 28143 22896 8572 16458 22949
16679B2949L838l4158j2994O907r780j7999R498K093Q33n127j6953L0792K8657
$$ 22949 26787 -7371 -20365 -13458 -23238 -41237 -31739 -29646 -28813 -33940 -50893 -20101 8556
16666H556K8066L288k2532k1368j2019j3912m762J815J4502K712N52M1344k4245
$$ 8556 36622 39910 17378 -3990 -16009 -29921 -34683 -32868 -18366 -15654 -15102 26242 1997
16653A997k215n569j8333k1315N063N3R549M175Q961M1054o146m672M449m93j5636
$$ 1997 -218 -5787 -24120 -45435 -40372 -40319 -30770 -26595 -17634 23420 17274 12602 17051 16558 922
16638I22j7838q23L6569k0731k2900L3397j859l0094J1369k7295l2751j9174K7128
$$ 922 -16916 -17739 18830 -1901 -24801 8596 6737 -23357 -11988 -39283 -72034 -91208 -64080
16625f4080L7886J7785J0794J4505o352L8141Q461n809K4396j7147Q544k0290
$$ -64080 -26194 -8409 2385 16890 10538 48679 57140 51331 75727 58580 67124 46834
16613D6834j3826m732L693k9635k4392K216N3188q844j9320j4154N2533j296m1656
$$ 46834 33008 28276 31969 2334 -22058 -19842 33346 24502 5182 -8972 43561 42265 609
16600F09j4962M7104J545j285j7471L242p038p888L4939j94k4602p926O829J842
$$ 609 -14353 32751 34296 33011 15540 18782 11744 3856 38795 38601 13999 6073 12902 14744
16586A4744J831k9679k9334M9602M1750L066N200J596j865m968J6277l3364n8504
$$ 14744 16575 -13104 -42438 7164 48914 51980 57180 58776 56911 51943 68220 34856 -23648
16573b3648J1985M8578q001k7373j9638m1333J3258J9431L5352K4775o75J0549
$$ -23648 -11663 36915 28914 1541 -18097 -59430 -46172 -26741 8611 33386 32711 43260
16561D3260p501L6779Q168o5276J009j1288M23J9372k9457j5390j3508J699K6181
$$ 43260 35759 72538 80706 15430 16439 5151 5574 24946 -4511 -19901 -33409 -31710 -5529
16548e529j382R959J0116m5566K98J9484j0614N0224K1221r986k5096k1678j196
$$ -5529 -6911 3048 13164 -32402 -32104 -12620 -23234 26990 48211 38225 13129 -8549 -9745
16535i745j7753k5850O143K1856K1676j0763k1611J3574N777J5878O981J6406
$$ -9745 -27498 -53348 -47205 -25349 -3673 -14436 -36047 -22473 -16696 -818 6163 22569
16523B2569J3238k3665k3899j0173P977j3410j0196J011k3392q486n897Q996N2497
$$ 22569 35807 12142 -11757 -21930 -13953 -27363 -37559 -36548 -59940 -68426 -74323 -65327 -12830
16510a2830L763k1807K62K8733j7861n3924p02K6227k2988K908L3434M4210l1302
$$ -12830 -9067 -30874 -30612 -1879 -19740 -73664 -74366 -48139 -71127 -68219 -34785 9425 -21877
16497b1877j4540M6611K0927j6945L630m738k8471l5725j1305P591M3019J5364
$$ -21877 -36417 10194 31121 14176 17806 13068 -15403 -51128 -62433 -54842 -11823 3541
16485C541J0918r447m85R922m4752L287P236O845q580j6015j1931K8691k806M271
$$ 3541 14459 5012 4527 14449 -30303 -27016 -19780 -12935 -21515 -37530 -49461 -20770 -23576 -19305
16471a9305J0045J0942J014k2182J6282M910K3910J3617j7856k4773k3197J538
$$ -19305 -9260 1682 2696 -19486 -3204 1706 25616 39233 21377 -3396 -26593 -25055
16459b5055M1850J1300J9409J129p517m5869j9911L1172K6950J478l7978k6947
$$ -25055 16795 28095 47504 48633 41116 -4753 -24664 6508 33458 34936 -3042 -29989
16447b9989O636L3864J5391j6543J2441j9306L717J0074K959K5992K7773k6063
$$ -29989 -23353 10511 25902 9359 21800 2494 6211 16285 19244 45236 73009 46946
16435D6946J44o445J369K223J1965j4653j3225j483M4009L910m8648n4589K0104
$$ 46946 47090 40645 42014 44237 56202 41549 28324 26841 70850 74760 26112 -28477 -8373
16422h373J3390j9912N872J0186M9n792L6522O702j6336l234l0424q210K4335
$$ -8373 5017 -14895 -9023 1163 1212 -4580 31942 38644 22308 19074 -11350 -19560 4775
16409D775j0209r219J4565R33K1271k1367k8101j6841j2458M4043q574m7494j1481
$$ 4775 -5434 -14653 -88 845 22116 749 -27352 -44193 -56651 -12608 -21182 -68676 -80157
16396h0157K273N2366M2287N123j8548j2296q417J1754P6680J8995m2712o5817
$$ -80157 -77884 -25518 16769 21892 3344 -8952 -17369 -5615 71065 90060 47348 -18469
16384a8469j6200R581M973o851k6735K4518P809K0920K7854k439Q834O734K6408
$$ -18469 -34669 -25088 -20115 -26966 -53701 -29183 -21374 -454 27400 24961 33795 40529 66937
16371F6937k3972k4518j2218j9861L8884K5881Q828K0303p980l3623l4351j851
$$ 66937 42965 18447 6229 -13632 25252 51133 59961 80264 72284 38661 4310 2459
16359B459m9769M5L0875K5505o354j4341Q744n314R988k185R747L3177O327k1328
$$ 2459 -47310 -47265 -16390 9115 2761 -11580 -2836 -8150 1838 -347 9400 42577 48904 27576
16345B7576l1205l7809P138J8774J4881K7553k749l622J3026j1002k0886l757
$$ 27576 -3629 -41438 -34300 -15526 -645 26908 24159 20537 33563 22561 1675 -2082
16333b082j8599k2166p661O511K6304M815j454m240m188k694O494M5563L0945
$$ -2082 -20681 -42847 -50508 -43997 -17693 -12878 -14332 -18572 -22760 -25454 -18960 26603 57548
16320E7548J5796l2935l7283l3285p211K834K7240L3R019O063r096o196j7902
$$ 57548 73344 40409 3126 -30159 -37370 -34536 -7296 -7263 1756 7819 -1277 -7473 -25375
16307b5375p609O136k3664L008K2664k8723P161M3509n171k023K1090J0698Q043
$$ -25375 -32984 -26848 -50512 -47504 -24840 -53563 -46402 -2893 -8064 -10087 11003 21701 29744
16294B9744k9494o026P449J0606L4963K6720j6924k3484P522n990k9428k5691
$$ 29744 250 -5776 1673 12279 47242 73962 57038 33554 41076 35086 5658 -20033
16282b0033k0756j5222M6085O184k1877n503N296k3725k3238M8202L2757R539
$$ -20033 -40789 -56011 -9926 -3742 -25619 -31122 -25826 -49551 -72789 -24587 8170 17709
16270A7709l929l4465l5671M0142L1820J835R950j8320k6697l2683K418M153O620
$$ 17709 13780 -20685 -56356 -16214 15606 17441 27391 9071 -17626 -50309 -47891 -43738 -37118
16257c7118M178Q763N768o054N700M0128q193J0370m191k7233j7044K3836o534
$$ -37118 -32940 -24177 -18409 -24463 -18763 21365 13172 23542 19351 -7882 -24926 -1090 -7624
16244g624o372L3202L96N238j7046k1627j5270N035J709L747K100O613j267q415
$$ -7624 -13996 19206 19602 24840 7794 -13833 -29103 -24068 -22359 -18612 -16512 -9899 -11166 -19581
16230a9581j93O768K8621M374l754m3559j041l358J2635p374m58o641l2163k8603
$$ -19581 -19774 -13006 15615 19989 16235 -27324 -28365 -31723 -19088 -26462 -26920 -33561 -65724 -94327
16216i4327K8001K7488M5047N314j3429J2559K6320j5595j2086l9175M146P270
$$ -94327 -66326 -38838 6209 11523 -1906 10653 36973 21378 9292 -29883 -25737 -18467
16204a8467j850j2716J2134K0385n306j5114K769p639J5072l083j943q021O534
$$ -18467 -20317 -33033 -20899 -514 -5820 -20934 -18165 -25804 -10732 -13815 -15758 -23779 -17245
16191a7245O50j8591l4652O815J6148j9061j9106K3254K0908M4899J8463k2321
$$ -17245 -16595 -35186 -69838 -63023 -46875 -65936 -85042 -61788 -40880 4019 22482 161
16179A61m0812J613q30R092N3220J4739j0607j1715k922j0283n521J6183J127
$$ 161 -40651 -39038 -39868 -30776 22444 37183 26576 14861 11939 1656 -3865 12318 13445
16166A3445k043n821j2581l2489K2907R675m6148J7793J2788M2748K2518l0958
$$ 13445 11402 5581 -7000 -39489 -16582 -6907 -53055 -35262 -22474 20274 42792 11834
16154A1834j2304j8891j2476q564K1782K3553j1518J0583J7073l106R572l2882
$$ 11834 -470 -19361 -31837 -40401 -18619 4934 -6584 3999 21072 17966 27538 -5344
16142e344l697l427k1902j0923j0466J073Q911j1228L2776N071j8428N692j4159
$$ -5344 -9041 -12468 -34370 -45293 -55759 -54686 -45775 -57003 -24227 -19156 -37584 -31892 -46051
16129d6051p823K553K2600K7792L9904K1301j3588r068L331N184j6796l0226L104
$$ -46051 -53874 -51321 -28721 -929 38975 60276 46688 37620 40951 46135 29339 -887 2217
16116B217P694l755k0689q456q702m376J5055M342j4264j8356J2083q009l1134
$$ 2217 9911 6156 -14533 -22989 -31691 -36067 -21012 -16670 -30934 -49290 -37207 -45216 -76350
16103g6350M3929M6197r193L5349K3377j9225k1113k173j2747l1397r150J8940
$$ -76350 -32421 13776 4583 39932 63309 44084 22971 20798 8051 -23346 -32496 -13556
16091a3556J0261j4028K1924J6445o956K4034j0939k1536j7042N169K0514j617
$$ -13556 -3295 -17323 4601 21046 14090 38124 27185 5649 -11393 -6224 14290 12673
16079A2673m1951q700K8803K8659O802l944K5331R132r728j7311j644j9653Q651
$$ 12673 -29278 -37978 -9175 19484 26286 22342 47673 56805 47077 29766 28122 8469 17120
16066A7120P599m799q02J3795j5492P843L487j8165p871K2431m968l6954j0163
$$ 17120 24719 19920 19118 32913 17421 25264 28751 10586 2715 25146 20178 -16776 -26939
16053b6939p354O551k0730j577M2047K2848j7270k8523J6463l2034K3395j4498
$$ -26939 -34293 -27742 -48472 -50049 -8002 14846 -2424 -30947 -14484 -46518 -23123 -37621
16041c7621L370p358k0395k6099J629N3352O03J0136k3613L2330Q478k962k6291
$$ -37621 -34251 -41609 -62004 -88103 -86474 -33122 -32519 -22383 -45996 -13666 -5188 -8150 -34441
16028c4441J450K0939k0178L73L968j7988K629o202J3020M057j8460J0645K3041
$$ -34441 -32991 -12052 -32230 -31857 -27889 -45877 -43248 -49450 -36430 -32373 -50833 -40188 -17147
16015a7147M455j8976N160M759Q006j4087j2013j4876J841J4J7213M8166M1354
$$ -17147 -12692 -31668 -26508 -21749 -13743 -27830 -39843 -54719 -52878 -52864 -35651 12515 53869
16002E3869k9104j407K4422l03j5354j9479m5065j5207j3673P58j3549j0190l362
$$ 53869 24765 23358 47780 47477 32123 12644 -32421 -47628 -61301 -60543 -74092 -84282 -87644
15989h7644q736J154J6269N5806O5484R645k7717q638Q487o458L171n197k3108
$$ -87644 -96380 -95226 -78957 -23151 42333 51978 24261 15623 24110 17652 20823 15626 -7482
15976g482p741Q887J6238K46l118L096J2049L3960k912j3227j1322r215k9534
$$ -7482 -15223 -6336 9902 10148 7030 10126 22175 56135 53223 39996 28674 19459 -10075
15963a0075k3871j7900N877q960K2791J653k0102O647K407j0642r099j0398P135
$$ -10075 -33946 -51846 -45969 -54929 -32138 -30485 -50587 -43940 -41533 -52175 -61274 -71672 -64537
15950f4537L4312M0738J4196n6439J6928L2113J3675N556k8291n1139m2288j832
$$ -64537 -30225 10513 24709 -31730 -14802 17311 30986 36542 8251 -42888 -85176 -87008
15938h7008N2003M0105J0808q774O281o083J0332k3050J3173Q821j7999k5731
$$ -87008 -35005 5100 15908 7134 13415 7332 17664 -5386 7787 16608 -1391 -27122
15926b7122J1344j5758K152p96J6748K1441J5960r452k0296k8808J0321k2055
$$ -27122 -15778 -31536 -29384 -30180 -13432 8009 23969 14517 -5779 -34587 -24266 -46321
15914d6321J0040J8115l80P716K4459Q161R716L6503J5067j0167m7352K480L3882
$$ -46321 -36281 -18166 -18546 -10830 13629 21790 31506 68009 83076 72909 25557 28037 61919
15901F1919j5837m094M0633J7497m1801j9641M2498K1223o961j5611l3347l9888
$$ 61919 46082 41988 82621 100118 58317 38676 81174 102397 95436 79825 46478 6590
15889F590K794K1066J7751j3638k6995J4718o656n716J6028J6160k1087j7365
$$ 6590 9384 30450 48201 34563 7568 22286 15630 9914 25942 42102 21015 3650
15877C650o481K0560K6584R235k2492J0601j949m4090k7253j1351K0062J1639
$$ 3650 -2831 17729 44313 53548 31056 41657 39708 -4382 -31635 -42986 -22924 -11285
15865a1285J3376J3553k496l4262k5974J7349L5278q054k2120J6698P602n3713
$$ -11285 2091 15644 13148 -21114 -47088 -29739 5539 -2515 -24635 -7937 -335 -54048
15853e4048k2967K4674j934p408K2986K4686K9906J3561J9753r064m1139l854
$$ -54048 -77015 -52341 -54275 -61683 -38697 -14011 15895 29456 49209 40145 -994 -4848
15841d848K9589m934K0420Q061m6916m281P842Q136J8265J097j2161L873J5442
$$ -4848 24741 19807 40227 48288 1372 -2909 4933 13069 31334 32431 20270 24143 39585
15828C9585K5835o754j9154p907j149L803j4317n754O694l987P28l340j3056q102
$$ 39585 65420 58666 39512 31605 30456 34259 19942 14188 20882 16895 17623 14283 1227 -6875
15814f875j4551k2308J9416L4919J9657q615k031J5270P770J87l2456k7567j595
$$ -6875 -21426 -43734 -24318 10601 30258 21643 19612 34882 42652 42839 10383 -17184 -18779
15801a8779J0804M1135q547k2987n277k406q742j27q391j2487J4338J5359J2411
$$ -18779 -7975 33160 24613 1626 -3651 -6057 -14799 -14926 -23317 -35804 -21466 -6107 6304
15788F304J390K369k007q400K2577k3188K1623J7703k4681j1083r508J2157K251
$$ 6304 7694 10063 8056 -344 22233 -955 20668 38371 13690 2607 -6901 5256 7507
15775G507n409j6644l1902o973N119j4657L0701K5669l0906l2099L8143O272k8574
$$ 7507 2098 -14546 -46448 -53421 -48302 -62959 -32258 -6589 -37495 -69594 -31451 -25179 -53753
15762e3753N850J3952Q522l41J8285M2316j2539Q55L0464j5989l2746k8136L5380
$$ -53753 -47903 -33951 -25429 -25770 -7485 34831 22292 23147 53611 37622 4876 -23260 12120
15749A2120O410j8964J7794l7243j0113K5434J2811j2580R289Q964R219J854k610
$$ 12120 18530 -434 17360 -19883 -29996 -4562 8249 -4331 4958 13922 23141 24995 22385
15736B2385j4779l720m574k95J4805l0575k0901O988j6251j5139K268L5079K7781
$$ 22385 7606 3886 -688 -983 13822 -16753 -37654 -30666 -46917 -62056 -59788 -24709 3072
15723C072J5071n417N16o700n730l3886j4176Q868L5152l538r357J4356j6699
$$ 3072 18143 12726 13242 6542 812 -33074 -47250 -38382 -3230 -6768 -16125 -1769 -18468
15710a8468L966J941J5943M596k9891M629R365L6645J8400L494k1932k657Q704
$$ -18468 -14502 -12561 3382 7978 -21913 -17284 -7919 28726 47126 50620 28688 26031 34735
15697C4735j0751q023p214R810r226j3199k8713m3731J9396L4359L0261j7483
$$ 34735 23984 15961 8747 18557 9331 -3868 -32581 -76312 -56916 -22557 7704 -9779
15685i779j3913K5649K8760O803j632J5634N384k6517k4229J5033P056j6790k0081
$$ -9779 -23692 1957 30717 37520 35888 51522 56906 30389 6160 21193 28249 11459 -8622
15672h622J18Q358J2013k0635J1806j2469k3106j4891m035j0656L83K6295L3206
$$ -8622 -8504 -146 11867 -8768 3038 -9431 -32537 -47428 -51463 -62119 -61736 -35441 -2235
15659b235K1579J0826k3744m8264L312j3984j5141l6063J6175Q2773K0120k4499
$$ -2235 19344 30170 6426 -41838 -38526 -52510 -67651 -103714 -87539 -4766 15354 -9145
15647i145O242j929n577K1183j0905k552J7620j5805k1389L402j4223J5818J7859
$$ -9145 -2903 -4832 -10409 10774 -131 -2683 14937 -868 -22257 -18855 -33078 -17260 599
15634E99K1130o190l0484j3635j2304j4565K3790M9309J9010l8221J1064N297
$$ 599 21729 15539 -14945 -28580 -40884 -55449 -31659 17650 36660 -1561 9503 14800
15622A4800j4470k896N093P96M883n423n113J7188m169j2768J1455l1807k2761
$$ 14800 330 -2566 2527 3323 8206 2783 -2330 14858 10689 -2079 9376 -22431 -45192
15609d5192R588J8330J2925k9030k1985P78j5731l895K503j1441J7197n832K4998
$$ -45192 -35604 -17274 -4349 -33379 -55364 -54586 -70317 -74212 -71709 -83150 -65953 -71785 -46787
15596d6787M0260J2739J865J3129N010J3520n0981N064j286p356n956L1249p044
$$ -46787 -6527 6212 8077 21206 26216 39736 -11245 -6181 -7467 -14823 -20779 10470 3426
15583C426k5094j1419j661J0298K886L3997J602j0092N678N302j064K7828k4216
$$ 3426 -21668 -33087 -34748 -24450 -21564 12433 14035 3943 9621 14923 13859 41687 17471
15570A7471J3978M0828j9177m8796j6856N6522p497l1665J5933l1131m3149N751
$$ 17471 31449 72277 53100 4304 -12552 43970 36473 4808 20741 -10390 -53539 -47788
15558d7788K4599l4632R800M4758J996j4712j970j5469J3412K642o055j3208k7066
$$ -47788 -23189 -57821 -48021 -3263 -1267 -15979 -17949 -33418 -20006 -17364 -23419 -36627 -63693
15545f3693P570M920L4602J4980K421J9459k3541j0107R281k8068j9887n513l7938
$$ -63693 -56123 -51203 -16601 -1621 800 20259 -3282 -13389 -4108 -32176 -52063 -57576 -95514
15532i5514J7680N7223M2459K3452j0167j1516k6817m99K9822n71l835k7980K1672
$$ -95514 -77834 -20611 21848 45300 35133 23617 -3200 -3699 26123 25552 21717 -6263 15409
15519A5409J3134n128j8183K7223K6567J0263j0840m8955k8888j6642j359J8473
$$ 15409 28543 23415 5232 32455 59022 69285 58445 9490 -19398 -36040 -37399 -18926
15507a8926L3648j4742m3118k5601k6172K5044K8538P893K0480J6052L1718J0342
$$ -18926 14722 -20 -43138 -68739 -94911 -69867 -41329 -33436 -12956 3096 34814 45156
15495D5156r59j8974K0198l5787k1163P777K095k3618j8336j71K8901k868m9687
$$ 45156 44197 25223 45421 9634 -11529 -3752 -1657 -25275 -43611 -43782 -14881 -17749 -67436
15482f7436K547O8853K6951l5163m239k3969K6702J4419k4901l546K0791K766
$$ -67436 -64889 3964 30915 -4248 -8487 -32456 -5754 8665 -16236 -19782 1009 3775
15470C775j9351N633K6453j7091j3110K7825L9554j8229J9285K5551N608J7231
$$ 3775 -15576 -9943 16510 -581 -13691 14134 53688 35459 54744 80295 85903 103134
15458A03134k7590m4904k3764J7279J3829K5201j5712p360N899j6695q885m232
$$ 103134 75544 30640 6876 24155 37984 63185 47473 40113 46012 29317 20432 16200
15446A6200o630P431r780P705Q403j5026p387J628p191k474o348L1921J3653q614
$$ 16200 9570 17001 7221 14926 23329 8303 916 2544 -4647 -7121 -13469 18452 32105 23491
15432B3491k2807j4471l732L7173L4448K630M09n9054k6341O019p455k2616L770
$$ 23491 684 -13787 -17519 19654 54102 56732 57141 -1913 -28254 -22235 -29690 -52306 -48536
15419d8536J8611q003p923o758J3817k2835j3004n066N9032L7056j0394m414K4152
$$ -48536 -29925 -37928 -45851 -52609 -38792 -61627 -74631 -79697 -20665 16391 5997 1583 25735
15406B5735k4479n183L2929J745o022j9804m2236l3165Q901L653N667K485J1233
$$ 25735 1256 -3927 29002 30747 24725 4921 -37315 -70480 -61579 -57926 -52259 -49774 -38541
15393c8541K6299L779k5932j2890L9817L1511J8642R951l8661m341o214k7910
$$ -38541 -12242 -8463 -34395 -47285 -7468 24043 42685 52636 13975 9634 3420 -24490
15381b4490K166K0807p860L9993o341k3032j3691k4637m234J3317m814J3912R320
$$ -24490 -22324 -1517 -9377 30616 24275 1243 -12448 -37085 -41319 -28002 -32816 -18904 -9584
15368i584M091n171j9465l3691o467J4619j015j0753J3312o824K7141L2957r462
$$ -9584 -5493 -10664 -30129 -63820 -70287 -55668 -56683 -67436 -54124 -60948 -33807 -850 -10312
15355a0312k478n01M133L9717R023m948J589L5984L438J556j9976m8758k1851
$$ -10312 -12790 -13291 -9158 30559 39582 34634 36223 72207 75645 77201 57225 8467 -13384
15342a3384p082p484N832K1139j0571k3940j1242J2570K1131P033q391k6814k4579
$$ -13384 -20466 -27950 -22118 -979 -11550 -35490 -46732 -34162 -13031 -5998 -14389 -41203 -65782
15329f5782J1074L033k4842K4249M0349K3677m115q859l560J1112j3028l2782
$$ -65782 -54708 -51675 -76517 -52268 -11919 11758 7643 -1216 -4776 6336 -6692 -39474
15317c9474L801J3206K403K5839K226l0305k903L0692K5266l0052n0740m772J2573
$$ -39474 -35673 -22467 -20064 5775 8001 -22304 -25207 5485 30751 699 -50041 -54813 -42240
15304d2240K5457j6531J5682R473N769k4650l1141k366l338p779K6211o16J1068
$$ -42240 -16783 -33314 -17632 -8159 -2390 -27040 -58181 -60547 -63885 -71664 -45453 -46069 -35001
15291c5001M2938K5789J2545m6129j4595k854K2791k556L861J6120j0102j3476
$$ -35001 7937 33726 46271 142 -14453 -17307 5484 2928 6789 22909 12807 -669
15279f69k83j9131j2901R191m161j1401j4072k5746J69N6293N5639J3482n2974
$$ -669 -952 -20083 -32984 -23793 -27954 -39355 -53427 -79173 -79004 -22711 32928 46410 -6564
15266f564j554L779k0425j5110j8473J3212J5468M161k0370K088N7434K2090k9640
$$ -6564 -8118 -4339 -24764 -39874 -58347 -45135 -29667 -25506 -45876 -43788 13646 35736 6096
15253F096R335M2708J7835m0797l9473j1898J7645J1888k873R4L670j6462J5875
$$ 6096 15431 58139 75974 35177 -4296 -16194 1451 13339 10466 10560 14230 -2232 13643
15240A3643N5503o194j4498j5211m5282j8777K1390K2561J2334r767R273J8776
$$ 13643 69146 62952 48454 33243 -12039 -30816 -9426 13135 25469 15702 24975 43751
15228D3751k7742j700K0981l350k5637J1812R103l3982l6988p536K5532K0324
$$ 43751 16009 14309 35290 31940 6303 18115 27218 -6764 -43752 -51288 -25756 -5432
15216e432p451l4316J2410L6679p914n339m935j1542l553K361K9510O902k0756
$$ -5432 -12883 -47199 -34789 1890 -6024 -11363 -16298 -27840 -31393 -29032 478 7380 -13376
15203a3376P949o821L2888M875J0496M507j3434K640j1554k8722j4889K1781K2145
$$ -13376 -5427 -12248 20640 25515 36011 40518 27084 29724 18170 -10552 -25441 -3660 18485
15190A8485L8802k1759m3863j4286n114l8459l1765M1641J8679L1378J2796R773
$$ 18485 57287 35528 -8335 -22621 -27735 -66194 -97959 -56318 -37639 -6261 6535 16308
15178A6308j5636j4854R699k8125m0795K429K5343K644K9643K7592L5235J1982
$$ 16308 672 -14182 -4483 -32608 -73403 -70974 -45631 -42987 -13344 14248 49483 61465
15166F1465m5333R253K86J0189J2620k1919k293j234j6315J1887J428l478j1317
$$ 61465 16132 25385 25671 35860 48480 26561 24268 23034 6719 18606 20034 16556 5239
15153E239m996K5833J9172N014l7268n428K4334M938m671j2412j1235k781l9184
$$ 5239 243 26076 45248 50262 12994 7566 31900 36838 32167 19755 8520 5739 -33445
15140c3445j7436J7845j5799q31P321O506P626L5690K8461j3205J1261k5511j5277
$$ -33445 -50881 -33036 -48835 -49666 -42345 -35839 -28213 7477 35938 22733 33994 8483 -6794
15127f794O765O490j2668j5277k974l6973j7664l215L1350M8287K4870j228K433
$$ -6794 -29 6461 -6207 -21484 -24458 -61431 -79095 -82310 -50960 -2673 22197 20969 23402
15114B3402n951p739j567J1823J1037j0950n543J3983n719m4561j038k1154q74
$$ 23402 17451 9712 8145 19968 31005 20055 14512 28495 22776 -21785 -22823 -43977 -44851
15101d4851K3336J2029j5806J1077m392L7701K1469k4069k5191K7138N300k115
$$ -44851 -21515 -9486 -25292 -14215 -18607 19094 40563 16494 -8697 18441 23741 21626
15089B1626k1714j0444m634R129K245K1614J9891l6200k6433o937k673M3883K0397
$$ 21626 -88 -10532 -15166 -6037 -3792 17822 37713 1513 -24920 -31857 -34530 9353 29750
15076B9750k03l3871j5054K7947p800k4282J0355J5375J5826K6669R028j9182
$$ 29750 29547 -4324 -19378 8569 769 -23513 -13158 2217 18043 44712 53740 34558
15064C4558r530K2243L6935k4642m1060m2524J2477J1021J3260j2460q076r89
$$ 34558 25028 47271 84206 59564 18504 -24020 -11543 -522 12738 278 -7798 -8787
15052h787j1475j9249l877N582K4646l195L030j5978J3039m261j7893J0575J4357
$$ -8787 -20262 -39511 -43388 -37806 -13160 -16355 -13325 -29303 -16264 -20525 -38418 -27843 -13486
15039a3486J3978K1194j663k18J6753K3442L553k8878P407j1560j9022l6655l7787
$$ -13486 492 21686 20023 19805 36558 60000 63553 34675 42082 30522 11500 -25155 -62942
15026f2942K4154N7005J1773j0850n549P010R17J7341j4935j7474J1014L0097
$$ -62942 -38788 18217 29990 19140 13591 20601 21518 38859 23924 6450 17464 47561
15014D7561L0784N783l2524o6285r131J5833K8421K314r919L0336K694l3755k9627
$$ 47561 78345 84128 51604 -14681 -23812 -7979 20442 22756 12837 43173 45867 12112 -17515
15001a7515O092M5594j0593j9101J1730P152Q034j1256n073j7583R677R466p898
$$ -17515 -11423 34171 23578 4477 16207 23359 31393 20137 15064 -2519 7158 16624 8726
14988H726J02m9822J1975K9982J8452l0699l6793l0820j549L997L0076K5630K9010
$$ 8726 8828 -40994 -29019 963 19415 -11284 -48077 -78897 -80446 -76449 -46373 -20743 8267
14975H267m222J8898q153j868q176l7230K3256L2884J7514q174j7099k7247K462
$$ 8267 4045 22943 14790 12922 4746 -32484 -9228 23656 41170 32996 15897 -11350 -8888
14962h888N0706m217j0273k3098k4720r062J4670M7078N91k2225k7487M0996l5301
$$ -8888 41818 37601 27328 4230 -20490 -29552 -14882 32196 32787 10562 -16925 24071 -11230
14949a1230j3813L826k0236K0714K409L055L8214J0317l995m0983j9431L7367
$$ -11230 -25043 -21217 -41453 -20739 -18330 -15275 22939 33256 29261 -11722 -31153 6214
14937F214k4256q279j3529k4094M062m273o142L5668L3159j7566k8132l9143j0309
$$ 6214 -18042 -26321 -39850 -63944 -59882 -64155 -70297 -34629 -1470 -19036 -47168 -86311 -96620
14924i6620L1922L9136j0935j4086K1176k6107M2432M4304K02J0568j3126j3660
$$ -96620 -64698 -25562 -36497 -50583 -29407 -55514 -13082 31222 31424 41992 28866 15206
14912A5206n958L1163K741k0657k1055j993J5270J2002L1628J833l4892l2765
$$ 15206 9248 40411 43152 22495 1440 -553 14717 26719 58347 60180 25288 -7477
14900g477j6630K1425j4643J9311o733N678J0396N570K1200Q998N886r175j9616
$$ -7477 -24107 -2682 -17325 1986 -4747 931 11327 16897 38097 47095 52981 43806 24190
14887B4190k0478m7563P723J9694J6588P627J675j4292k0308K7875J31l3833J69
$$ 24190 3712 -43851 -36128 -16434 154 7781 9456 -4836 -25144 2731 2862 -30971 -30802
14874c0802j6491J9241K4130j3484m3735J5258K2721L2193K8299p292k113j4892
$$ -30802 -47293 -28052 -3922 -17406 -61141 -45883 -23162 9031 37330 30038 27925 13033
14862A3033K7318j4283l6679J5259j4601m133J5771o642j100P390J8355R241J5966
$$ 13033 40351 26068 -10611 4648 -9953 -14086 1685 -4957 -6057 1333 19688 28929 44895
14849D4895q090k656j1076l0300j6271J2096J4995J7564L151N0238J0313L980
$$ 44895 36805 34149 23073 -7227 -23498 -11402 3593 21157 24308 74546 84859 88839
14837H8839j5810m5537m5581K1221M1440K3732L2438P4475K2837m570p319K989
$$ 88839 73029 27492 -18089 3132 44572 68304 100742 175217 198054 193484 186165 189154
14825A89154j9502n5290m592j5640J1634L5661J2436J2163j9825l9435K0937l641
$$ 189154 169652 114362 109770 94130 105764 141425 153861 166024 146199 106764 127701 124060
14813A24060k7451l2776m6965l2717P138K8933l4693k3340j7513k2519L1866N3999
$$ 124060 96609 63833 16868 -15849 -8711 20222 -14471 -37811 -55324 -77843 -45977 8022
14801H022K6994l942q379K0947k2874k9838k5603R120J4277o445k2209j964N4324
$$ 8022 35016 31074 22695 43642 20768 -9070 -34673 -25553 -11276 -17721 -39930 -41894 12430
14788A2430K8989o937l5845k7497J6582L0404n687J2113j8016k2185l1338L648
$$ 12430 41419 34482 -1363 -28860 -12278 18126 12439 24552 6536 -15649 -46987 -43339
14776d3339L4557O756k1901o775J5964O746j2631L212N457J9478M220k7703j6953
$$ -43339 -8782 -2026 -23927 -30702 -14738 -7992 -20623 -17411 -11954 7524 11744 -15959 -32912
14763c2912j4417K0619q815j5117K3422l897R676J2842l384l1562J2623J2964
$$ -32912 -47329 -26710 -35525 -50642 -27220 -31117 -21441 -8599 -11983 -43545 -30922 -17958
14751a7958k9534L360J5129p725j6580P197O610M5017L4809R724q70J6948N972
$$ -17958 -47492 -44132 -29003 -36728 -53308 -46111 -39501 5516 40325 50049 49179 66127 72099
14738G2099m2746j3510J1832j8985l5271J3371L7898J5117l4662k8953L4316m262
$$ 72099 29353 15843 27675 8690 -26581 -13210 24688 39805 5143 -23810 10506 6244
14726F244o532j3679J8201K4546j7018P028J6k8781j1852K2490O1432K3319k110
$$ 6244 -288 -13967 4234 28780 11762 18790 18806 -9975 -21827 663 62095 85414 83304
14713H3304l7019j9755j6335j7521j3071J8019J6889j5000l7134K4135j2981o059
$$ 83304 46285 26530 10195 -7326 -20397 -2378 14511 -489 -37623 -13488 -26469 -32528
14701c2528J7558n412J5756K2874J4685j7997n3505l6632K0190M2911R358p764
$$ -32528 -14970 -20382 -4626 18248 32933 14936 -38569 -75201 -55011 -12100 -2742 -10506
14689a0506O080r191m2756j0581K2228j6477K5367L8884K249K47P764O612N141
$$ -10506 -4426 -13617 -56373 -66954 -44726 -61203 -35836 3048 5297 5544 13308 19920 25061
14676B5061j0937j8326L754j5422J8896K1160k3008O3K8332J9453m5947l2429
$$ 25061 14124 -4202 -448 -15870 3026 24186 1178 1241 29573 49026 3079 -29350
14664b9350N353l235J0902L199K1961K4130l1028j3739O41j560q429J3116j1091
$$ -29350 -23997 -27232 -16330 -13131 8830 32960 1932 -11807 -11166 -12726 -21155 -8039 -19130
14651a9130k642J2257N239L1505J1443o837k1016l4046J2403K1937j4503r454
$$ -19130 -21772 -9515 -4276 27229 38672 31835 10819 -23227 -10824 11113 -3390 -12844
14639a2844K654J5409J8924n864k7194j9398J8635n050j9704k2913L9196j4433
$$ -12844 -10190 5219 24143 18279 -8915 -28313 -9678 -14728 -34432 -57345 -18149 -32582
14627c2582l5066J8152K8935p11r101O04l192j981j0360Q255L0603j9579j4972
$$ -32582 -67648 -49496 -20561 -21272 -30373 -29769 -32961 -34942 -45302 -37047 -6444 -26023 -40995
14614d0995k0400J0561J583J0976M1737L7354J3849k0535k2926j7031Q194j5023
$$ -40995 -61395 -50834 -49251 -38275 3462 40816 54665 34130 11204 -5827 2367 -12656
14602a2656m247m094j0140J687K0942J8704J2468p056J4744J182j3648L6337P857
$$ -12656 -16903 -20997 -31137 -29450 -8508 10196 22664 15608 30352 31534 17886 54223 62080
14589F2080k7252p94j265m3029J7495J2234L229O477K7401K701l5123k7676k5800
$$ 62080 34828 34034 32769 -10260 7235 19469 22698 29175 56576 59277 24154 -3522 -29322
14576b9322l2989j0107L7452N5239R597n670k1323k5575M145J0413Q964K2144
$$ -29322 -62311 -72418 -34966 20273 29870 24200 2877 -22698 -18553 -8140 824 22968
14564B2968J3014j0286j0233k3294j7147L3616O712l882j2896r346L069M652K387
$$ 22968 35982 25696 15463 -7831 -24978 8638 15350 11468 -1428 -10774 -7705 -3053 -666
14551f66j0001J2261K9752J759j7467l4613l3909R290J3834M844N706l12n161
$$ -666 -10667 1594 31346 33105 15638 -18975 -52884 -43594 -29760 -24916 -19210 -19522 -24683
14538b4683j5945q896L917r90K3596J4655J0228j3731J5493R793j0873m222J0421
$$ -24683 -40628 -49524 -45607 -46597 -23001 -8346 1882 -11849 3644 13437 2564 -1658 8763
14525H763J0406j7322Q181l421k2363j1959p044J470J4656L5810K8106l8645j9455
$$ 8763 19169 1847 10028 6607 -15756 -27715 -34759 -33289 -18633 17177 45283 6638 -12817
14512a2817M797j489j9666J7042K8068k027r167J1129N191J7615K607j7981k5619
$$ -12817 -8020 -9509 -29175 -12133 15935 13908 4741 15870 21061 38676 41283 23302 -2317
14499b317j4302m209K9068j8781n514J5100J7102K760L0714N947K7874R448k1152
$$ -2317 -16619 -20828 8240 -10541 -16055 -955 16147 18907 49621 55568 83442 92890 71738
14486G1738k1338J8691J8348J96l7281l3628M602L0092J4763r473j142j9661P11
$$ 71738 50400 69091 87439 87635 50354 16726 21328 51420 66183 56710 55568 35907 36618
14473C6618j9578l6081k8679L171O838j2106J3777M2896J3031K5730K965k6155
$$ 36618 17040 -19041 -47720 -44549 -37711 -49817 -36040 6856 19887 45617 48582 22427
14461B2427J7325K9491j0329J3771j0188j4272k2324k1418k6606j3128l4550r241
$$ 22427 39752 69243 58914 72685 62497 48225 25901 4483 -22123 -35251 -69801 -79042
14449g9042K5888M8569K6465k016k5619o937j4503m130j30k073k836J8786j2599
$$ -79042 -53154 -4585 21880 19864 -5755 -12692 -27195 -31325 -31455 -33528 -36364 -17578 -30177
14436c0177R482L3516J4078q269l9484j6248K1977L9099P381K3098J8847l524
$$ -30177 -20695 12821 26899 18630 -20854 -37102 -15125 23974 31355 54453 73300 69776
14424F9776j6901j9740j8254J2114k0290k8088J7129J6688L185n298n4856j6855
$$ 69776 52875 33135 14881 26995 6705 -21383 -4254 12434 15619 10321 -44535 -61390
14412f1390M8715O60K494n897r366j8067J1382K7322M178k431j7139j899j0471
$$ -61390 -12675 -12015 -9521 -15418 -24784 -42851 -31469 -4147 31 -2400 -19539 -21438 -31909
14399c1909p574L637L9623j0402k1750J6121J7594n064j7101j9889J8919J1179
$$ -31909 -39483 -35846 3777 -6625 -28375 -12254 5340 276 -16825 -36714 -17795 -6616
14387f616K2492j4916j4103q361n782K5776L5784J5402J3138l521j1109J653l3757
$$ -6616 15876 960 -13143 -21504 -27286 -1510 34274 49676 62814 59293 48184 49837 16080
14374A6080j0978j0308K0211J5771k2020j6193M915N010o135r604J2345k226q007
$$ 16080 5102 -5206 15005 30776 8756 -7437 -2522 2488 -3647 -13251 -906 -3132 -11139
14361a1139m5613k4619k7903K2640P735m126j6607L9584M9549m320K356j4623
$$ -11139 -56752 -81371 -109274 -86634 -78899 -83025 -99632 -60048 -10499 -14819 -12463 -27086
14349b7086L780j7302k0201J9156J3381N3272K2712k2356l4373j0656J0223j6758
$$ -27086 -23306 -40608 -60809 -41653 -28272 25000 47712 25356 -9017 -19673 -9450 -26208
14337b6208o872K8125K3235M2035j9518k2211k5858O910o24J5702J6100l7627
$$ -26208 -33080 -4955 18280 60315 40797 18586 -7272 -362 -986 14716 30816 -6811
14325f811q511q124j7036O309L1115J4871j1622O787J8596Q553l599m3681l09
$$ -6811 -15322 -23446 -40482 -34173 -3058 11813 191 6978 25574 34127 30528 -13153 -13462
14312a3462j341n36l3024K9459k218r893K2366J1711J5796p9m545P199j052l168
$$ -13462 -14803 -15339 -48363 -18904 -21122 -31015 -8649 3062 18858 18779 14234 21433 20381 17213
14298A7213k9662k6594M493K6195L1615l4411j5566L8604K2683N285N04j6607
$$ 17213 -12449 -39043 -34550 -8355 23260 -11151 -26717 11887 34570 39855 40359 23752
14286B3752k3033j6459L4706K2731q634k7621K1112K345m1062k1819K6994K2414
$$ 23752 719 -15740 18966 41697 33063 5442 26554 28899 -12163 -33982 -6988 15426
14274A5426K0528K3745k5982m2073j8943o688J6262K0820K8453j0308k4037J5711
$$ 15426 35954 59699 33717 -8356 -27299 -33987 -17725 3095 31548 21240 -2797 12914
14262A2914J3612k821J2885j1730K914l5916n7197j8498K4611J7145J2865r29
$$ 12914 26526 23705 36590 24860 27774 -8142 -65339 -83837 -59226 -42081 -29216 -30145
14250c0145J304J7214J7529J0210r215R682L7084j0720n3834k3417N234J2801
$$ -30145 -28841 -11627 5902 16112 6897 16579 53663 42943 -10891 -34308 -29074 -16273
14238a6273K0443l8536l4842Q436J6469K2348L7098R396o031j2576l5551m421
$$ -16273 4170 -34366 -69208 -60772 -44303 -21955 15143 24539 18508 5932 -29619 -34040
14226c4040K4482r761K5770q574n1900m2543J9122M6257M5480M295M4387K0354
$$ -34040 -9558 -19319 6451 -2123 -54023 -96566 -77444 -31187 14293 18588 62975 83329
14214H3329j6054j8342o507K7387K6610l5640m8441j7616K4931J4218n462O227
$$ 83329 67275 48933 42426 69813 96423 60783 12342 -5274 19657 33875 28413 34640
14202C4640R734q30l6978P17J5440K1779k9611j7288L2241L1241j6913j3202q518
$$ 34640 44374 43544 6566 7283 22723 44502 14891 -2397 29844 61085 44172 30970 22452
14189B2452j4501Q740K302k1521K705M371L614j724J0991j1200J2594N744J2191
$$ 22452 7951 16691 18993 -2528 177 4548 8162 6438 17429 6229 18823 24567 36758
14176C6758M996k0516m0593P570L0228k0623k9201M866n417R774r62J6198L6259
$$ 36758 41754 21238 -19355 -11785 18443 -2180 -31381 -26515 -31932 -22158 -23120 -6922 29337
14163B9337j0344j0946L4156N150j787k3561o892L58J5211K7790J0964l6284l4950
$$ 29337 18993 8047 42203 47353 45566 22005 15113 15471 30682 58472 69436 33152 -1798
14150a798q216J7578L1933J6947k400m745l9323k4140P374Q533J6035K1468k2104
$$ -1798 -10014 7564 39497 56444 54044 49299 9976 -14164 -6790 1743 17778 39246 17142
14137A7142j2317j290r241n280k0694j8773o586L7184L0869P625l0269L015j0740
$$ 17142 4825 3535 -5706 -10986 -31680 -50453 -57039 -19855 11014 18639 -11630 -8615 -19355
14124a9355k0608M1965L8028J5162j4293m4546M329K0367m725K4205M237M608
$$ -19355 -39963 2002 40030 55192 40899 -3647 682 21049 16324 40529 44766 49374
14112D9374M471J3772o803J3675p615j4620q875k2567J0874P906j0342j429O3970
$$ 49374 53845 67617 60814 74489 66874 52254 43379 20812 31686 39592 29250 27821 91791
14099I1791L5714j2688k2094k7753l5236J3271J2004k5565k4144J0536l1584k6639
$$ 91791 127505 114817 92723 64970 29734 43005 55009 29444 5300 15836 -15748 -42387
14087d2387K4708J7761M2727L9249l561l5604J887n8304O414R0K7149L5906J2617
$$ -42387 -17679 82 42809 82058 78497 42893 44780 -13524 -7110 -7020 20129 56035 68652
14074F8652l439k0519l828j8743r436n897j7744O651j5649j2036J1361K4973K5316
$$ 68652 65213 44694 40866 22123 12687 6790 -10954 -4303 -19952 -31988 -20627 4346 29662
14061B9662K776r090J3718j731k9713J4113K2618k0845L2939L6194k491j0329
$$ 29662 32438 23348 37066 35335 5622 19735 42353 21508 54447 90641 88150 77821
14049G7821J0196k7120n455K7268j8082j8862K0373K4827K3569L8462L944l1520
$$ 77821 88017 60897 55442 82710 64628 45766 66139 90966 114535 152997 156941 125421
14037A25421j4663m382P688Q22k2614j5761p216l8908o0367L546K7772L1864N299
$$ 125421 110758 106376 114064 114886 92272 76511 69295 30387 -29980 -26434 1338 33202 38501
14024C8501n2242m1273j2125K3189L5283J5939k4550j6709J8095M6400L3613k6290
$$ 38501 -13741 -55014 -67139 -43950 -8667 7272 -17278 -33987 -15892 30508 64121 37831
14012C7831l2833j4057M696K8424K8838p134p370K98k3271j9483m6194l43J8299
$$ 37831 4998 -9059 -4363 24061 52899 45765 38395 38693 15422 -4061 -50255 -50598 -32299
13999c2299m476J3303L4458J356k7765k0183J674J7619L0977K6215l1923l3583
$$ -32299 -36775 -23472 10986 12342 -15423 -35606 -33932 -16313 14664 40879 8956 -24627
13987b4627Q112K280M0550k4512m0014j7138J4980l109K9580J784o927Q981j269
$$ -24627 -16515 -14235 26315 1803 -38211 -55349 -40369 -43478 -13898 -12114 -19041 -10060 -11329
13974a1329l4286l783L1307j9763o085J9274J612j3276P2M48R370j0936j1168
$$ -11329 -45615 -49398 -18091 -37854 -43939 -24665 -23053 -36329 -36257 -35809 -26439 -37375 -48543
13961d8543j6425M371j1813k1157L1140J9585K0415K2240j5459L225K716k1824
$$ -48543 -64968 -60597 -72410 -93567 -62427 -42842 -22427 -187 -15646 -12421 -9705 -31529
13949c1529L792J7560j0874j0396L4798J8655r403J7128J835N747j2622k1764
$$ -31529 -27737 -10177 -21051 -31447 3351 22006 12603 29731 31566 37313 24691 2927
13937B927m28q355L4615J8277k9557j8386m661J8490J0662j7976l764M614J9167
$$ 2927 2499 -5856 28759 47036 17479 -907 -5568 12922 23584 5608 1844 6458 25625
13924B5625n0634j806J9931K6444J1252L4511q782n35l1041l0456q84K450p478
$$ 25625 -25009 -26815 -6884 19560 30812 65323 56541 56006 24965 -5491 -6375 -3925 -11403
13911a1403N727J6308N337q384r837m328k1288K5540J9236j3297m0061M175j012
$$ -11403 -5676 10632 15969 7585 -2252 -6580 -27868 -2328 16908 3611 -36450 -32275 -33287
13898c3287J3860M7311J38J4022k3603j5370r443j1209j0290N2855O8400q349
$$ -33287 -19427 27884 28022 42044 18441 3071 -6372 -17581 -27871 24984 93384 85035
13886H5035k0772k4049j4802j8632L262p48k461J792n360J4383K2785K3672L4112
$$ 85035 64263 40214 25412 6780 10042 9294 6833 8625 3265 17648 40433 64105 98217
13873I8217K3296j2518j1744k4090m4021j6066K3349J8930j3974j1498M0472L7422
$$ 98217 121513 108995 97251 73161 29140 13074 36423 55353 41379 29881 70353 107775
13861A07775J3662p828J0231k2844J1558J8541j0691l7867n502N21J2028Q763
$$ 107775 121437 113609 123840 100996 112554 131095 120404 82537 77035 77556 89584 98347
13849I8347m078k6598j5061k6246k8141k3403l747P419J8823R211j4022k6821
$$ 98347 94269 67671 52610 26364 -1777 -25180 -28927 -21508 -2685 6526 -7496 -34317
13837c4317n8107j662O7991K3539L5692M8008k4526L43k1486j6407j049l8382
$$ -34317 -92424 -94086 -26095 -2556 33136 81144 56618 56961 35475 19068 18019 -20363
13825b0363o2653M5941O187J7522O240R864M1059M8406K2441o0009m3806n572
$$ -20363 -83016 -37075 -30888 -13366 -7126 2738 43797 92203 114644 54635 10829 5257
13813E257L1466j3311l6685K0677M9707n561k0967J2889N1093K832l7746m3088
$$ 5257 36723 23412 -13273 7404 57111 51550 30583 43472 94565 97397 59651 16563
13801A6563J053K3765k216J2854J6556N268J6376p861l9655l7357j7005q347p601
$$ 16563 17616 41381 39165 52019 68575 73843 90219 82358 42703 5346 -11659 -20006 -27607
13788b7607K5681M4064n172k1629k8055J507j763o75N234n369k6147l56K2406
$$ -27607 -1926 42138 36966 15337 -12718 -11211 -12974 -13649 -8415 -13784 -39931 -40287 -17881
13775a7881J4519M472n716k7920k8351j2073P396J0040J3108R733J3104K1333
$$ -17881 -3362 1110 -4606 -32526 -60877 -72950 -65554 -55514 -42406 -32673 -19569 1764
13763A764k2110j8953j1689J6959J7091j1407r595J0101r277P786K6338L719J0360
$$ 1764 -20346 -39299 -50988 -34029 -16938 -28345 -37940 -27839 -37116 -29330 -2992 727 11087
13750A1087L830l925m623j526n252L1795k3139l3370r205L503K9446j1606j6700
$$ 11087 14917 10992 6369 4843 -409 31386 8247 -25123 -34328 -30825 -1379 -12985 -29685
13737b9685k287N781Q701J0852J4947k2251J3198j3265j9719K3105K0061R10p0103
$$ -29685 -31972 -26191 -17490 -6638 8309 -13942 -744 -14009 -33728 -10623 9438 10348 -59755
13724e9755l6196L0792M9409l8599K9071K8578M034R374J5535l3095j814Q381
$$ -59755 -95951 -65159 -15750 -54349 -25278 3300 7334 16708 32243 -852 -2666 5715
13712E715n408j8269J56j3550k1935K0323J9300o363J7519J8389k3041j7224j2756
$$ 5715 307 -17962 -17806 -31356 -53291 -32968 -13668 -20031 -2512 15877 -7164 -24388 -37144
13699c7144j4322L062L5120N4211J7070j5814J396J4110O113M947j4187k5025
$$ -37144 -51466 -48404 -13284 40927 57997 42183 43579 57689 63802 68749 54562 29537
13687B9537l8776M4379K6362k269l1884l985O37M62k2907N778L4746J1269o92
$$ 29537 -9239 35140 61502 59233 27349 23364 24001 24463 1556 7334 42080 53349 52657
13674E2657J803Q593r158m965k4136l4885J4830n688J099j2042j0528Q128k3548
$$ 52657 54460 63053 53895 48930 24794 -10091 4739 -949 150 -11892 -22420 -14292 -37840
13661c7840m383M3223n345l1869K3389K5930J4746K5981p30l0289R483J1359J8726
$$ -37840 -42223 1000 -4345 -36214 -12825 13105 27851 53832 53102 22813 32296 43655 62381
13648F2381O18l9868j2228n141o795J7778m796j8464J6206j6586M2070J9481n376
$$ 62381 62999 23131 10903 5762 -1033 16745 11949 -6515 9691 -6895 35175 54656 49280
13635D9280k949j4696k5936j4191O134n48M7861K9349q241j7543j7027l0598k1663
$$ 49280 46331 31635 5699 -8492 -2358 -2906 44955 74304 66063 48520 31493 895 -20768
13622b0768l760M285r607j0516Q22M788J4434K6882J4014J8217k5200n7340l659
$$ -20768 -24528 -20243 -29850 -40366 -39544 -34756 -20322 6560 20574 38791 13591 -43749 -47408
13609d7408k248K6618J8497q172R791N157k5650j460J6534K2006l262O825l1470
$$ -47408 -49656 -23038 -4541 -12713 -2922 2235 -23415 -24875 -8341 13665 10403 17228 -14242
13596a4242k1109N4911K4710l4201k5305J5545J5870m581K803J8570k136k320
$$ -14242 -35351 19560 44270 10069 -15236 309 16179 11598 14401 32971 30835 28515
13584B8515K5311J968j795L3708j0484k1104n361L0017L1790Q655K6463M8344
$$ 28515 53826 55794 53999 87707 77223 56119 50758 80775 112565 121220 147683 196027
13572A96027M6282K1678K8590K3345J25634K14014K70570L41910K39968L6j58139
$$ 196027 242309 263987 292577 315922 441556 655570 926140 1268050 1508018 1508054 1349915
13561A349915k42664k49189k46061j74314p6025o5546o1595k6172k3531J4165
$$ 1349915 1107251 858062 612001 437687 361662 296116 234521 208349 184818 198983
13551A98983J1163o675n3711l0085p353l2270q971J4681L4973p975j2112L406
$$ 198983 210146 203471 149760 119675 112322 80052 71081 85762 120735 112760 100648 104054
13539A04054n369j4582L1179k1009r3211n5366p22L3167K5721R739L0218p580
$$ 104054 98685 84103 115282 94273 1062 -54304 -55026 -21859 3862 13601 43819 36239
13527C6239N247k8516k1189Q33J9186L924N721N150K8186o853Q1k0400j1001K1697
$$ 36239 41486 12970 -8219 -7386 11800 15724 21445 26595 54781 47928 48009 27609 16608 38305
13513C8305p847J8043n968l0577J2794j5689J3366j2806j1433L4944J392K4024
$$ 38305 30458 48501 42533 11956 24750 9061 22427 9621 -1812 33132 34524 58548
13501E8548l814k3759j3572o457j2909J8381P84k4045l1344K3682K1735k3111
$$ 58548 54734 30975 17403 10946 -1963 16418 17202 -6843 -38187 -14505 7230 -15881
13489a5881j1086l459K4349k1176j1691o126J5262M6548J0851L0773k775k7630
$$ -15881 -26967 -30426 -6077 -27253 -38944 -45070 -29808 16740 27591 58364 55589 27959
13477B7959L4004m461j9437L084l936j5368k1402K4059P728J5847j417K728J2678
$$ 27959 61963 57502 38065 41149 37213 21845 443 24502 32230 48077 46660 49388 62066
13464F2066J903k6015l0991K68L3629L6762r338m1528m647L3519m2825n529N243
$$ 62066 63969 37954 6963 7231 40860 77622 68284 26756 22109 55628 12803 7274 12517
13451A2517P0526P204m426P117j8807k957j6051l7391J101q149j2155k7160Q395
$$ 12517 83043 90247 85821 92938 74131 71174 55123 17732 18833 10684 -1471 -28631 -20236
13438b0236P27J3791j9620j87o548J8940K1512J9583l147j0159p591K3731J5349
$$ -20236 -19509 -5718 -25338 -25525 -32073 -13133 8379 27962 24815 14656 7065 30796 46145
13425D6145p403L230K2923k3225j4802k2391K0671L0572q001n4090k53K1658J0849
$$ 46145 38742 41972 64895 41670 26868 4477 25148 55720 47719 -6371 -6624 15034 25883
13412B5883O921J6893j6007J8212M295J3324J4355j0086l5150k4952j162l312
$$ 25883 32804 49697 33690 51902 56197 69521 83876 73790 38640 13688 12526 9214
13400I214j4762N1383L1986J6091K2445K0974M8003r385j6862J5677n818J1216
$$ 9214 -5548 45835 77821 93912 116357 137331 185334 175949 159087 174764 168946 180162
13388A80162n655n518J7592r05k7894j4274j3094Q789k2449p7317j6781l171j1957
$$ 180162 174507 168989 186581 185676 157782 143508 130414 139203 116754 39437 22656 19485 7528
13375G528J0182M2435j398j1179K1470Q403R228L853J1860n663r345k1427j4494
$$ 7528 17710 60145 58747 47568 69038 77441 86669 90522 102382 96719 87374 65947 51453
13362E1453j4298P600j5412l091J9964j2587k4038k9924k8816J5091Q0390l321
$$ 51453 37155 44755 29343 26252 46216 33629 9591 -20333 -49149 -34058 46332 43011
13350D3011j4399l11k2172K101L88K481o780j899M7115L2944k1118j6177J111
$$ 43011 28612 28301 6129 8230 8618 11099 4319 2420 49535 82479 61361 45184 46295
13337D6295K0043q765l0040j2104j1053r300J353K2155K8282K71l3250o0445K6520
$$ 46295 66338 57573 27533 15429 4376 -4924 -3571 18584 46866 47137 13887 -46558 -20038
13324b0038O8832J873k522L877N761j9952m7658l12K9501L4566j611j8288m295
$$ -20038 48794 50667 48145 52022 57783 37831 -9827 -10139 19362 53928 52317 34029 29734
13311B9734k536L8866M7118p467j4645r132r967n69J8999J0419j5960J7678M9009
$$ 29734 27198 66064 113182 105715 91070 81938 71971 71402 90401 100820 84860 102538 151547
13298A51547J2652l5500J523L917j2085M1317N5291J3942M5757Q7953R9537O9150
$$ 151547 164199 128699 130222 134139 122054 163371 218662 232604 278361 366314 465851 535001
13286E35001l1570p9586j05445q3791j0270J5719M819J5746K8938l0819n6051
$$ 535001 503431 423845 318400 234609 224339 240058 244877 260623 289561 258742 202691
13275B02691J5504k722p785j4236j5035K485K9438K351K1408M2027M2066M0504
$$ 202691 218195 215473 207688 193452 178417 180902 210340 212691 234099 276126 318192 358696
13263C58696J5191R762j4804n8186n3278k7793l7828n2645j7191J4362m552l877
$$ 358696 373887 383649 368845 310659 257381 229588 191760 139115 121924 136286 131734 127857
13251A27857o02J1040J7541J4552k7511l6187j7588K1281M0410j2815j5636L9195
$$ 127857 127255 138295 155836 170388 142877 106690 89102 110383 150793 137978 122342 161537
13239A61537Q747m978J6968l2670j2098J1320O647P684K5376M6283m558m6394
$$ 161537 170284 165306 182274 149604 137506 148826 155473 163157 188533 234816 230258 183864
13227A83864l9737n15J3996L69M76l386J3406m2343K0979P9753P6012k5583l8061
$$ 183864 144127 143612 157608 157977 158453 155067 168473 126130 147109 226862 302874 277291 239230
13214B39230R754J9507r674k3966J203M2251M6211k599J5895K4360k1390K2484
$$ 239230 248984 268491 258817 234851 236054 278305 324516 321917 337812 362172 340782 363266
13202C63266K2519K613q644J1561K8982K5368L1145L1132L4190K4485K8064L3522
$$ 363266 385785 388398 379754 391315 420297 445665 476810 507942 542132 566617 594681 628203
13190F28203o814k326M5153K8378M6206K2967m1333o324M5079J5555J6362R4964
$$ 628203 621389 619063 664216 692594 738800 761767 720434 714110 759189 774744 791106 886070
13178H86070N4687M6355N0040N1522N6997P1960O1084N7586O8955J22602J20044
$$ 886070 940757 987112 1037152 1088674 1145671 1217631 1278715 1336301 1405256 1527858 1647902
13167A647902J07526J11231J36037J86743J95137J88220K27817K44495L38803
$$ 1647902 1755428 1866659 2002696 2189439 2384576 2572796 2800613 3045108 3383911
13158C383911M18026N44324P10253Q83471Q71005P44264O56024P21368Q93001
$$ 3383911 3801937 4346261 5056514 5939985 6810990 7555254 8211278 8932646 9825647
13149I825647J170228J538576K176584L084407M319021O169807Q885797J3215578
$$ 9825647 10995875 12534451 14711035 17795442 22114463 28284270 37170067 50385645
13141E0385645K0560873L2936302N1051661O5642057N4173525J3386082l2072592
$$ 50385645 70946518 103882820 154934481 220576538 274750063 288136145 256063553
13134B56063553n7727670n3709514l7844479k5303718j7673483j2852146r591797
$$ 256063553 198335883 144626369 106781890 81478172 63804689 50952543 41360746
13127D1360746p257361n603367m388795l468631k741598k137536j672940j192612
$$ 41360746 34103385 28500018 24111223 20642592 17900994 15763458 14090518 12897906
13119A2897906q79525q55708r27413j027512r72486q97401p17874n84350n02241
$$ 12897906 12018381 11162673 10235260 9207748 8235262 7337861 6619987 6035637 5533396
13110E533396m33833l23456k83550k78295k35910k15997k83391k33389j73122
$$ 5533396 5099563 4776107 4492557 4214262 3978352 3762355 3478964 3245575 3072453
13101C072453j29379j18753j39792j67852j62350j41552q9740o7015q0122o7041
$$ 3072453 2943074 2824321 2684529 2516677 2354327 2212775 2123035 2056020 1975898 1908857
13091A908857r1925j38790j49265r3707q9567n9585q9619o3350l4214m1975o5606
$$ 1908857 1816932 1678142 1528877 1435170 1345603 1286018 1196399 1133049 1098835 1056860 991254
13080I91254o0364q1027m9019n9516m2810o433j5662K3061J527j1471j2116k2423
$$ 991254 930890 849863 800844 741328 698518 692085 676423 699484 701011 689540 677424 655001
13068F55001j5526P522J412j4289l219m3523r7174j6438J7493p091K2108Q510
$$ 655001 639475 646997 648409 634120 630901 587378 490204 473766 491259 484168 506276 514786
13056E14786j4259j1486L2672j9789j3337O418j6240n3833j322P177k7930k5018
$$ 514786 500527 489041 521713 501924 488587 495005 478765 424932 423610 430787 402857 377839
13044C77839n148J5626M0119J8552J0212k4349n3724q617l682j1441l0850j842
$$ 377839 372691 388317 428436 446988 457200 432851 379127 370510 366828 355387 324537 322695
13032C22695m74n405m798K1183J4381J9839K6216J2257M343K9607M5484L1531
$$ 322695 322221 316816 312018 333201 347582 367421 393637 405894 410237 439844 485328 516859
13020E16859L0667P5491J74428K55703M35301O56789N84212J17449l74270o78855
$$ 516859 547526 623017 797445 1053148 1488449 2145238 2729450 2846899 2472629 1793774
13010A793774n44918l24216j78414j25793j16577o9876p9813k9292m0136J2570
$$ 1793774 1248856 924640 746226 620433 503856 433980 354167 324875 284739 297309
13000B97309L454p588j0814k4881m5158k0740J7761j5577j8063K8520j2533l2188
$$ 297309 300763 293175 282361 257480 212322 191582 209343 193766 175703 204223 191690 159502
12988A59502k3267j8963J8965J5322K154k342K7852l0215l2281J1133N950k7072
$$ 159502 136235 117272 136237 151559 153713 151371 179223 149008 116727 127860 133810 106738
12976A06738j5461J3825K0228M661R944K809j139j4139j201l550k7915k117M3825
$$ 106738 91277 105102 125330 129991 139935 142744 141605 127466 126265 122715 94800 92683 136508
12963A36508N74J438j429L1185k2444m1294J7591R906J8133L4915J9886N410J5381
$$ 136508 137082 138520 137091 168276 145832 104538 122129 132035 150168 185083 204969 210379 225760
12950B25760K8540k6246J7519p644k3747l2168j3743O792j9842q768L4640N1000
$$ 225760 254300 228054 245573 237929 214182 182014 168271 175063 155221 146453 181093 232093
12938B32093L277l4522p1583k7862p210l078J5754k594K2245L5357K2488k8878
$$ 232093 235370 200848 129265 101403 94193 91115 106869 104275 126520 161877 184365 155487
12926A55487q063K0121L4085m0807k2979m349J0099J5402p436l3774l8193J2716
$$ 155487 147424 167545 201630 160823 137844 133495 143594 158996 151560 117786 79593 92309
12914I2309N6033k8106k9149n965k668K1544r683K3122j3097Q031k8589k6298
$$ 92309 148342 120236 91087 85122 82454 103998 94315 117437 104340 112371 83782 57484
12902E7484J964J3673K335J7433L3695J848j0600o255K1348j609J507J1150r156
$$ 57484 59448 73121 75456 92889 126584 128432 117832 111577 132925 131316 132823 143973 134817
12889A34817P123J8986M9892l557k7402M4638J2332o479l1379p5905k0055l906
$$ 134817 141940 160926 210818 207261 179859 224497 236829 230350 198971 123066 103011 99105
12877I9105j1272j1088P247L8507M514q464J6673j834m0028j5449m159J4993J0646
$$ 99105 87833 76745 83992 122499 127013 118549 135222 133388 93360 77911 73752 88745 99391
12864I9391k1108l0831m786J75L2799J5972J3222L0126k4502j0907J3309K2165
$$ 99391 78283 47452 42666 42841 75640 91612 104834 134960 110458 99551 112860 135025
12852A35025P041q792J7659K9771P063J0027K478j9692r004J4808k2712j3291
$$ 135025 142066 133274 150933 180704 187767 197794 200272 180580 171576 186384 163672 150381
12840A50381p025K6920L3414N4788M0557O8058N3891J8292k0477N393k4038k9364
$$ 150381 143356 170276 203690 258478 299035 367093 420984 439276 418799 424192 400154 370790
12828C70790k7684M3350P4616R7196J67197J38127K0816j07657j69071j17274
$$ 370790 343106 386456 461072 558268 725465 863592 884408 776751 607680 490406
12818D90406q6435m8727n5833n1885m0654k2323L201M5470L0330m6435M537K4050
$$ 490406 403971 355244 299411 247526 206872 184549 187750 233220 263550 217115 221652 245702
12806B45702J7400l4538k6490J5726P527L0223L4935J3722M0431K7045K6240l4071
$$ 245702 263102 228564 202074 217800 225327 255550 290485 304207 344638 371683 397923 363852
12794C63852l6739r670K7873L2977K5023O6932R4731R8658J59965J32573N9768
$$ 363852 327113 317443 345316 378293 403316 470248 564979 663637 823602 956175 1015943
12783A015943r7628j65175j24833p3493q3460n3144n6184n0036n2531p6374n5460
$$ 1015943 918315 753140 628307 554814 471354 418210 362026 311990 259459 183085 127625
12772A27625m8470J380K4875J818L2197R466m5294p2520j7482Q248Q656j127j4244
$$ 127625 79155 80535 105410 107228 139425 148891 103597 31077 13595 21843 30499 29372 15128
12759A5128j2259J2347K3679K5994J9487L0676R397j9725p4058o3337J7570L9698
$$ 15128 2869 15216 38895 64889 84376 115052 124449 104724 30666 -32671 -15101 24597
12747B4597M6882L6757K6925K0635k1554K5462j2026l1208L422Q8k8271L6032
$$ 24597 71479 108236 135161 155796 134242 159704 147678 116470 119892 119980 91709 127741
12735A27741L4589K8150K6619O0388J8915m9870J7003R3600M9012r6652m2214
$$ 127741 162330 190480 217099 277487 296402 246532 263535 357135 406147 309495 267281
12724B67281k6909k3918J8205J0641M415r418N685K3812k4050k3337M454L683
$$ 267281 240372 216454 234659 245300 249715 240297 245982 269794 245744 222407 226861 230544
12712B30544O2004Q0482N3622K0433Q7522J23810K46141M37871M20189K09093
$$ 230544 292548 373030 426652 447085 534607 658417 904558 1342429 1762618 1971711
12702A971711j6865k41588l46284l05947k12869j46567j15855n1931j9479j5331
$$ 1971711 1954846 1713258 1366974 1061027 848158 701591 585736 533805 514326 498995
12692D98995K921j1742l7155j9689K334l359R811r081J7889L812K5837j9023n1404
$$ 498995 501916 490174 453019 433330 435664 432305 442116 433035 450924 454736 480573 461550 410146
12679D10146k7924k7916j0618k0358R372k858k0949l8855n0654k6290L404j2480
$$ 410146 382222 354306 343688 323330 332702 329844 308895 270040 219386 193096 196500 184020
12667A84020j0614K4724K0917J6519k6971j5445n366p60R751K4560J0168K0723
$$ 184020 173406 198130 219047 235566 208595 193150 187784 187024 196775 221335 231503 252226
12655B52226L7120J7471J1655j2031R988M5671J2316n667R488j0648j7668K594
$$ 252226 289346 306817 318472 306441 316429 362100 374416 368749 378237 367589 349921 352515
12643C52515J3827J719L6449L6968K8318L2398L3357K0279N7983K6699J5819J3221
$$ 352515 366342 368061 404510 441478 469796 502194 535551 555830 613813 640512 656331 669552
12631F69552M548k115M0526K0192P2919M1556K8857L8115O2503Q6417P9937O4194
$$ 669552 674100 671985 712511 732703 805622 847178 876035 914150 976653 1063070 1143007 1207201
12619A207201K9775J8957K2781L7672J5995j2762K6492M6192R3366Q5184P3214
$$ 1207201 1236976 1255933 1278714 1316386 1332381 1319619 1346111 1392303 1485669 1570853 1644067
12608A644067J18019J16421K16088K78776L75129M10348L21257K01473J46405
$$ 1644067 1762086 1878507 2094595 2373371 2748500 3158848 3480105 3681578 3827983
12599C827983P7359J14922K13375L57548M71507N28448O87107R11678J098203
$$ 3827983 3905342 4020264 4233639 4591187 5062694 5591142 6278249 7189927 8288130
12590H288130J212487J444545J781742K476325L738168N092651O036344P318454
$$ 8288130 9500617 10945162 12726904 15203229 18941397 24034048 30070392 37388846
12582C7388846R999411J5915761K7397799M9362695Q9827084J37104555J18019264
$$ 37388846 47388257 63304018 90701817 140064512 229891596 366996151 485015415
12575D85015415K3268559p5270110j27457492j00548337n9267682l5895182k3510354
$$ 485015415 508283974 433013864 305556372 205008035 145740353 109845171 86334817
12568H6334817j5955840j1656594r571025q445674p161527n515923m233414l331449
$$ 86334817 70378977 58722383 49151358 40705684 33544157 28028234 23794820 20463371
12560B0463371k644969k079621j596185j299414j077032r70388q87181q76777
$$ 20463371 17818402 15738781 14142596 12843182 11766150 10795762 9908581 9031804
12552I031804q04693o54827n45440n24785m48928l75148k88219k66741k60196
$$ 9031804 8227111 7572284 7026844 6502059 6053131 5677983 5389764 5123023 4862827
12543D862827k73572k32107k24855k17998j93965j77898k09101k28157k02526
$$ 4862827 4589255 4357148 4132293 3914295 3720330 3542432 3333331 3105174 2902648
12534B902648j33967q1451j57118j31688j12516j46957j26829j61514j45032j52250
$$ 2902648 2768681 2687230 2530112 2398424 2285908 2138951 2012122 1850608 1705576 1553326
12524A553326j25207r5559m0862n0599p1309r0694p0480m9659o6440m1472k0377
$$ 1553326 1428119 1332560 1291698 1241099 1169790 1079096 1008616 958957 892517 851045 830668
12513H30668k152K838o925j2789j6633j4385j1480l4329k3420J4324j87p739k2617
$$ 830668 828516 831354 824429 811640 795007 780622 769142 734813 711393 725717 725530 717791 695174
12500F95174o5237o238Q099o706n604p069l7110j7951k4711K9541N9929Q76l183
$$ 695174 629937 623699 631798 625092 619488 612419 575309 557358 532647 562188 622117 622993 619810
12487F19810q856l8012k4034l7031o724N916J2882q928n1884o9155l1214K2963
$$ 619810 610954 572942 548908 511877 505153 511069 523951 515023 463139 393984 362770 385733
12475C85733K5788K1334j2018m0499j4390J7434J4422N2290k847l7008l2243j4300
$$ 385733 411521 432855 420837 380338 365948 383382 397804 450094 447247 410239 377996 363696
12463C63696J967N316j739j479j2408K2453q383K10O754m294n887j8944n0031
$$ 363696 365663 370979 369240 367761 355353 377806 369423 369633 376387 372093 366206 347262 297231
12450B97231n9308o0842n6350q69M921L5350M0891l5328k6587M442K9971K4712
$$ 297231 237923 177081 120731 119862 124783 160133 201024 165696 139109 143551 173522 198234
12438A98234R276j5529j7351l5757j4534j8493k2092r56L0614N0433J2147K3343
$$ 198234 207510 191981 174630 138873 124339 105846 83754 82798 113412 163845 175992 199335
12426A99335l2770k0269j3042N0202M6254j294n1471l0757K6436J7839m740k6730
$$ 199335 166565 146296 133254 183456 229710 228416 176945 146188 172624 190463 185723 158993
12414A58993k3432K3173J5259q199K3469o611L3226n284k23L2475L0636L4553
$$ 158993 135561 158734 173993 165794 189263 182652 215878 210594 210371 242846 273482 308035
12402C08035Q962J3778M7350M9464p453k0065o0563l8379m1188l1946J2054l721
$$ 308035 316997 330775 378125 427589 420136 400071 339508 301129 259941 227995 240049 236328
12390B36328p434P9734O445n2563k9615l6638j5310M3254K9891N571N236O830
$$ 236328 228894 308628 315073 262510 232895 196257 180947 224201 254092 259663 264899 271729
12378B71729l1214l4228m1542j0424l3981n603K6258J4394k06K279j8075J9789
$$ 271729 240515 206287 164745 154321 120340 114737 140995 155389 155183 157462 139387 159176
12366A59176M0803k2218k3188l919m316j6093J2071J2491P163K6987J7337n9068
$$ 159176 199979 177761 154573 150654 146338 130245 142316 154807 161970 188957 206294 147226
12354A47226l2151k3572j5957J3858k1059j9003P910J2831j2971j5917q095q909
$$ 147226 115075 91503 75546 89404 68345 49342 57252 70083 57112 41195 33100 24191
12342B4191J9039J9028M0013M3645j0625l0323m3514j8562O15M562O332m40J1268
$$ 24191 43230 62258 102271 145916 135291 104968 61454 42892 43507 48069 54401 53961 65229
12329F5229M0002J9188j2653k5543k4565j5616K9229m514j7996L8433Q72n180
$$ 65229 105231 124419 111766 86223 61658 46042 75271 70757 52761 91194 92066 86886
12317H6886O177K3000o347k6544K0463Q783l452l559l4489l5823L09p76o918N8357
$$ 86886 93063 116063 109716 83172 103635 112418 108966 105407 70918 35095 35404 34628 27710 86067
12303H6067O0536M4209j4760m8414l4663J0598J8156J7180j8306j2815l346R064
$$ 86067 146603 190812 176052 127638 92975 103573 121729 138909 120603 107788 104442 113506
12291A13506J25J6392N1871J4662j7294Mn779j1232l4125k4975l1072j1026J1736
$$ 113506 113631 130023 181894 196556 179262 179266 173487 162255 128130 103155 72083 61057 72793
12278G2793L262R667K1430R364m1048J7210j5329n687j2011q056k71q585K6171
$$ 72793 76055 85722 107152 116516 75468 92678 77349 71662 59651 51595 51324 42739 68910
12265F8910n0308m6689L6536J9482M7025K1884j4804L396n251n4360J7845k3630
$$ 68910 18602 -28087 8449 27931 74956 96840 82036 85432 80181 25821 43666 20036
12253B0036o0061n438J3813K6843K8428N2918k3983p822m350n116K8906n472K5656
$$ 20036 -40025 -45463 -31650 -4807 23621 76539 52556 44734 40384 35268 64174 58702 84358
12240H4358K5499m5573l1690j2032K4499Q688L503J943L1502J6673P925r950m7409
$$ 84358 109857 64284 32594 20562 45061 53749 57252 59195 90697 107370 115295 105345 57936
12227E7936k1314P265N929K6385K5900l5277K261L0688L278J0376m745l8335l4845
$$ 57936 36622 43887 49816 76201 102101 66824 69085 99773 103051 113427 108682 70347 35502
12214C5502N483J1696J4629n257J2353Q582K4630Q020j80j1540P026l6410k6309
$$ 35502 40985 52681 67310 62053 74406 82988 107618 115638 115458 103918 110944 74534 48225
12201D8225O046L4826O0284j2563j4545k4658k7139l3458l6748r918L992q110
$$ 48225 54271 89097 149381 136818 122273 97615 70476 37018 270 -9648 -5656 -13766
12189a3766l0963M584L9531M9484J4563r471l6797o632j6119j2418j6555k9540
$$ -13766 -44729 -40145 -614 48870 63433 53962 17165 10533 -5586 -18004 -34559 -64099
12177f4099J3807L4353O1221L7860J6839p728N655l0807k6725j1039K1860K1072
$$ -64099 -50292 -15939 45282 83142 99981 92253 97908 67101 40376 29337 51197 72269
12165G2269j5906M4927p688l5288l578r077N871K1200R548k0564j8784M42j4178
$$ 72269 56363 101290 93602 58314 54736 45659 51530 72730 82278 61714 42930 43372 29194
12152B9194k0408L8790q367k9651k33L4318K9947N8025J02858J06049J48259J10957
$$ 29194 8786 47576 39209 9558 9325 43643 73590 131615 234473 340522 488781 599738
12140E99738N6762m5494j12098l1617M7356J11471K87318N21120P51171N23539
$$ 599738 656500 611006 498908 467291 514647 626118 913436 1434556 2185727 2709266
12130B709266k3955n25336o65269n01418k91842j63432j06193p8593o3488o1057
$$ 2709266 2685311 2159975 1494706 993288 701446 538014 431821 353228 289740 228683
12120B28683m7821n975L879L783j9879j6989k5946k6980k4919K6265m05k9158
$$ 228683 180862 174887 178766 182549 162670 145681 119735 92755 67836 94101 93696 64538
12108F4538l268o045k0644j4390N506q518K0643K196j5943k0004k0444m2848K0426
$$ 64538 61270 55225 34581 20191 25697 17179 37822 40018 24075 4071 -16373 -59221 -38795
12095c8795L2545K5136j1130n063Q68K5616K1994L003J058M449j2126k0442k4909
$$ -38795 -6250 18886 7756 2693 3561 29177 51171 54174 55232 59681 47555 27113 2204
12082B204J4560M3510K4968j7868o0293k801J2149J6394K0758P848J4837m3487
$$ 2204 16764 60274 85242 67374 7081 4280 16429 32823 53581 61429 76266 32779
12070C2779k5076k3237p59N276K463r996K7969O5975K5567J1842L6288K1000m5015
$$ 32779 7703 -15534 -16293 -11017 -8554 -18550 9419 75394 100961 112803 149091 170091 125076
12057A25076n2605m1139M6607J2368j4417j6137n075N686k1529l13q379p080K0093
$$ 125076 72471 31332 77939 90307 75890 59753 54678 60364 38835 38522 30143 23063 43156
12044D3156K5090J7177n5598o3677j7433j0138J7208J7753q709k930K7133J1198
$$ 43156 68246 85423 29825 -33852 -51285 -61423 -44215 -26462 -35171 -38101 -10968 230
12032B30r10K1919k095K8890N534m4632m5338K6814K7999J934J8607N385J4320
$$ 230 -680 21239 19144 48034 53568 8936 -36402 -9588 18411 20345 38952 44337 58657
12019E8657k7J2085M4715P4768J01349L2953n379M4399N2923m7688j02055o4601
$$ 58657 58630 70715 115430 190198 291547 324500 319121 363520 416443 368755 266700 202099
12007B02099m7125k6591j6454k8375N518j857q50k6419J7272j6952j2695j7104
$$ 202099 154974 128383 111929 83554 89072 87215 86365 59946 77218 60266 47571 30467
11995C0467p100J1849L1551J6371j0165j2212m125P502k1964k1883j4513l2818
$$ 30467 23367 35216 66767 83138 72973 60761 56636 64138 42174 20291 5778 -27040
11983b7040K502K0510L06m193j0508n079O520L5553j2323l6457l0517j2631L6182
$$ -27040 -24538 -4028 -3722 -7915 -18423 -23502 -16982 18571 6248 -30209 -60726 -73357 -37175
11970c7175J8428N369L5032n887q661J4366j3070M896m6465q643J7588K9111K2767
$$ -37175 -18747 -13378 21654 15767 7106 21472 8402 13298 -33167 -41810 -24222 4889 27656
11957B7656j7728K0669p486J219K6089l6020P427L2955O791j7496N561R121L7450
$$ 27656 9928 30597 23111 24330 50419 14399 21826 54781 61572 44076 49637 58758 96208
11944I6208R7077R3467Q9300K4379m3376r2622m2380n2475m0730m1015J2488j2912
$$ 96208 193285 286752 376052 400431 357055 264433 222053 169578 128848 87833 100321 87409
11932H7409l0537J4430k5238O400l064m2801q789J6809K9129L7829l0429m1227
$$ 87409 56872 71302 46064 52464 49400 6599 -2190 14619 43748 81577 51148 9921
11920I921N307j297k3641N427j2214L90L2196n265k18l23k2264J1793J1510l5583
$$ 9921 15228 13931 -9710 -4283 -16497 -16107 16089 10824 10606 10283 -11981 -188 11322 -24261
11906b4261N819K1996l3650J8133p734j1449l385j1935L3035R418p803J2058l625
$$ -24261 -18442 3554 -30096 -11963 -19697 -31146 -34531 -46466 -13431 -4013 -11816 242 -3383
11893c383j4765K4123J9780k6577k6346J3011L9944l0932R452N1126j4750n0537
$$ -3383 -18148 5975 25755 -822 -27168 -14157 25787 -5145 4307 55433 40683 -9854
11881i854l6872Q663j1872j1912L2430K4482j7192M3491L3329k9974l2559m880
$$ -9854 -46726 -38063 -49935 -61847 -29417 -4935 -22127 21364 54693 24719 -7840 -12720
11869a2720J1245K2615K0108K127O609m873J6034K6390m76k6915j8029l5404j69
$$ -12720 -1475 21140 41248 43375 49984 45111 61145 87535 87059 60144 42115 6711 6542
11856F542q234j9283R482L8628J3326k2149p274K2109L1092R163j9872k6909k3286
$$ 6542 -1692 -20975 -11493 27135 40461 18312 11038 33147 64239 73402 53530 26621 3335
11843C335K0031O944K4082J7464k6059j9599k3666j277O434n042J4357p658k5458
$$ 3335 23366 30310 54392 71856 45797 26198 2532 1255 7689 2647 17004 9346 -16112
11830a6112j3880K6346K1021N346j2720P907J7167P131j7092j116R477o003L247
$$ -16112 -29992 -3646 17375 22721 10001 17908 35075 42206 25114 23998 33475 27472 30719
11817C0719O553l4304j3191K8026L7206k394k3775m6844l677k9081K8524M7385
$$ 30719 37272 2968 -10223 17803 55009 52615 28840 -18004 -21681 -50762 -22238 25147
11805B5147m7176J0147N3689k3273m5724r297K0657K3438J9090O419j7483j705
$$ 25147 -22029 -11882 41807 18534 -27190 -36487 -15830 7608 26698 33117 15634 13929
11793A3929J8959r501l2032j7411J1029J8044m189k9120L1435k677K110K2201
$$ 13929 32888 23387 -8645 -26056 -15027 3017 -1172 -30292 1143 -1534 576 22777
11781B2777j2325k0569j1521j60J2483j7496r910J724K9900L7719J748n396K3877
$$ 22777 10452 -10117 -21638 -21798 -9315 -26811 -36721 -34997 -5097 32622 34370 28974 52851
11768E2851J785n502J4265j9110k8700o156j5195K5034K012q573l1300o647K4782
$$ 52851 54636 49134 63399 44289 15589 9433 -5762 19272 21284 12711 -18589 -25236 -454
11755d54J1468K0699J1118l0891j3507m377j563K4917N779m5963j0906k5962K7581
$$ -454 11014 31713 42831 11940 -1567 -5944 -7507 17410 23189 -22774 -33680 -59642 -32061
11742c2061L1094Q168l4880k9187K9829L6732L8524J9731l2466j7362m192K1907
$$ -32061 -967 7201 -27679 -56866 -27037 9695 48219 67950 35484 18122 13930 35837
11730C5837L0444N087l5823j5184k7115o245J6830M6374o223l3864j4155m827
$$ 35837 66281 71368 35545 20361 -6754 -12999 3831 50205 43982 10118 -4037 -8864
11718h864j989k218o00M1330L1448J495k0747j349k7454N971K24q049k692o834
$$ -8864 -10853 -13071 -13671 27659 59107 60602 39855 38506 11052 17023 17247 9198 6506 -328
11704c28J4826j5028J2484j4088k5420K0770k220k7543J5852L2833j089J6801
$$ -328 14498 -530 11954 -2134 -27554 -6784 -9004 -36547 -20695 12138 11049 27850
11692B7850K2128k8967j273j353j028k5798J8882J2887J1107R895k7358l3307
$$ 27850 49978 21011 19738 18385 17357 -8441 10441 23328 34435 44330 16972 -16335
11680a6335J2947N515J1807O14J6887Q458N466j4645r772P181m5311m0325J0134
$$ -16335 -3388 2127 13934 14548 31435 39893 45359 30714 20942 28123 -17188 -57513 -47379
11667d7379K2743L0475L5008j0615l1436k0768j695m509o277P463j2151J9415
$$ -47379 -24636 5839 40847 30232 -1204 -21972 -23667 -28176 -34453 -26990 -39141 -19726
11655a9726K84l638K5311K214J4434k6547k5703j5960O335j3059j86L3533N996
$$ -19726 -19442 -23080 2231 4445 18879 -7668 -33371 -49331 -42996 -56055 -56241 -22708 -16712
11642a6712j5380M3896N3498O688J122k2809l8905l2543j28m767p360K6441M3973
$$ -16712 -32092 11804 65302 71990 73112 50303 11398 -21145 -21273 -26040 -33400 -6959 37014
11629C7014j6959n3135l6195P791K3279J2406J8146Q26R890M2849n232j7961r651
$$ 37014 20055 -33080 -69275 -61484 -38205 -25799 -7653 -6827 3063 45912 40680 22719 13068
11616A3068m139r425J712k2360L502M0446K7693j6744j4622p504l0749J983j0433
$$ 13068 8929 -496 1216 -21144 -17642 22804 50497 33753 19131 11627 -19122 -17139 -27572
11603b7572k4842Q479L6473K5443k58j4189j1315j9374O862O77J3028M0340N690
$$ -27572 -52414 -43935 -7462 17981 17723 3534 -7781 -27155 -20293 -19616 -6588 33752 39442
11590C9442J2848P768l2325l2530q801q756L6809M1019J078n8198J4178J3663
$$ 39442 52290 60058 27733 -4797 -13598 -22354 14455 55474 56552 -1646 12532 26195
11578B6195k0324j5244k9466k1472l849J8533K9638k5446j3094j7995J0629L1016
$$ 26195 5871 -9373 -38839 -60311 -64160 -45627 -15989 -41435 -54529 -72524 -61895 -30879
11566c0879K8956P888p864K8624M4892k2867m0765k076m8420J8857J5395M655
$$ -30879 -1923 5965 -1899 26725 71617 48750 7985 5909 -42511 -23654 -8259 -3604
11554c604j6862j0135r287J7659K3847j6275j8914K2097j2445j9539J6296j4378
$$ -3604 -20466 -30601 -39888 -22229 1618 -14657 -33571 -11474 -23919 -43458 -27162 -41540
11542d1540L9035J4535R770M605o336j5445k6553j8706J2736L3581K6916k3527
$$ -41540 -2505 12030 21800 26405 20069 4624 -21929 -40635 -27899 5682 32598 9071
11530I071r136N341j7098j4190j1030n953J0211K9358J9963j6493k0242k1458
$$ 9071 -65 5276 -11822 -26012 -37042 -42995 -32784 -3426 16537 44 -20198 -41656
11518d1656O657M2755j8153k6447J7685K4572K0393K795j4819k4370n032p268
$$ -41656 -34999 7756 -10397 -36844 -19159 5413 25806 28601 13782 -10588 -15620 -22888
11506b2888K2094Q001L7290j8183K5973J094l032k2966j9288l9501Q996j0774
$$ -22888 -794 7207 44497 26314 52287 53381 50349 27383 8095 -31406 -22410 -33184
11494c3184j404N2591m205J3112J933o0508l9967L9171L3260J0262n435m777Q476
$$ -33184 -34588 18003 13798 26910 28843 -31665 -71632 -32461 799 11061 5626 849 9325
11481I325P531J3270r989J8833L3926K8491n001p689M804K2463j2356j596P11
$$ 9325 16856 30126 20137 38970 72896 101387 96386 88697 93501 115964 103608 102012 102723
11468A02723O4209Q0011J04862J41058J76119J80317R4841q6695j91991j94471
$$ 102723 166932 246943 351805 492863 668982 849299 944140 857445 665454 470983
11458D70983j25649n8363q6751r3422l9432k3493j9339m977L5575j0553k031j9667
$$ 470983 345334 286971 200220 106798 67366 43873 24534 19557 55132 44579 42548 22881
11446B2881q704j9202L6783K5329J4367P356k5497k1762k112k9233L569J6221
$$ 22881 14177 -5025 31758 57087 71454 78810 53313 31551 29439 206 3775 19996
11434A9996O733n0033o303l711j0027q527K5394J8705p743J2794J2946Q007l672
$$ 19996 26729 -23304 -29607 -33318 -43345 -51872 -26478 -7773 -15516 -2722 10224 18231 14559
11421A4559J6216J561l7115j9610M0866p907o4626J8038K3514M023n475j3119
$$ 14559 30775 32336 -4779 -24389 16477 8570 -56056 -38018 -14504 -10481 -15956 -29075
11409b9075J4088n373J8333r280m248n728K4817L7365J1793l8552j0213L3914
$$ -29075 -14987 -20360 -2027 -11307 -15555 -21283 3534 40899 52692 14140 3927 37841
11397C7841r072J170k127L805J4542J8291j5937m6871j6812M4091L8706N185k2750
$$ 37841 28769 29939 27812 31617 46159 64450 48513 1642 -15170 28921 67627 72812 50062
11384E0062l7599l3348K1627J9108r513N168j0177m2134l6936J3679L0175j5688
$$ 50062 12463 -20885 742 19850 10337 15505 5328 -36806 -73742 -60063 -29888 -45576
11372d5576L5290M7083l796j8924L591k983q017K7338M6969p909o7064k5635K1327
$$ -45576 -10286 36797 33001 14077 17668 14685 6668 34006 80975 73066 6002 -19633 1694
11359A694J7609n2084j8189K3947J9535k074J148J6543k136L816k5148n09o345
$$ 1694 19303 -32781 -50970 -27023 -7488 -9562 -8414 8129 5993 9809 -15339 -15848 -22193
11346b2193O722K7844K7870M5073l9432j9417j0690N198l0655J0402j0040j0889
$$ -22193 -15471 12373 40243 85316 45884 26467 15777 20975 -9680 722 -9318 -20207
11334b0207J3858n836j5599l1556J3714j608o403N0358M205k0732k6510Q654L23
$$ -20207 -6349 -12185 -27784 -59340 -45626 -47234 -53637 -3279 926 -19806 -46316 -37662 -37339
11321c7339n852Q487K5266K9143p618R259L1712J202j9171k0221l6363L0634L5428
$$ -37339 -43191 -34704 -9438 19705 12087 21346 53058 54260 35089 14868 -21495 9139 44567
11308D4567J4212l2223l2464k4283J6910k4925k138n127J6049K7526K086R985
$$ 44567 58779 26556 -5908 -30191 -13281 -38206 -40344 -45471 -29422 -1896 190 10175
11296A0175k3540j7595j446M192m0255J7084M0157L0276K4233J701Q554q661k3135
$$ 10175 -13365 -30960 -32406 -28214 -68469 -51385 -11228 19048 43281 44982 53536 44875 21740
11283B1740j7473m2652J4065m50J2195Q652j0500n343k8061M649K6423K8106l4449
$$ 21740 4267 -38385 -24320 -24770 -12575 -3923 -14423 -19766 -47827 -43178 -16755 11351 -23098
11270b3098k0043j7284L7315K7657q880K0303K3752P744m742j4316l942m3962
$$ -23098 -43141 -60425 -23110 4547 -4333 15970 39722 47466 42724 28408 24466 -19496
11258a9496n4550K3167L861j1860n949K9280J598N04k6519K0990L5936k917k3359
$$ -19496 -74046 -50879 -47018 -58878 -64827 -35547 -33949 -33445 -59964 -38974 -3038 -5955 -29314
11245b9314k9582L855N3501L4594j0902j693q129q339L8949M865j9433j9191l400
$$ -29314 -58896 -55041 -1540 33054 22152 20459 12330 3991 42940 47805 28372 9181 5781
11232E781O77j4406p807M643L3710N584q562O3053K7990k7556j3274k5629k1898
$$ 5781 6458 -7948 -15755 -11112 22598 28182 19620 82673 110663 83107 69833 44204 22306
11219B2306k9842K823J3946J058J429j1314k056j7639p340L1682J9839K250l3758
$$ 22306 -7536 -4713 9233 10291 11720 406 -1650 -19289 -26629 5053 24892 27142 -6616
11206f616m361L2193Q855k9392q847n219K4168j4720l421K4096K1801J0354M193
$$ -6616 -10977 21216 30071 679 -8168 -13387 10781 -3939 -7360 16736 38537 48891 53084
11193E3084j7832l6604l9436K0959N0017Q511J0153l4576k9296K5463J2276m3357
$$ 53084 35252 -1352 -40788 -19829 30188 38699 48852 14276 -15020 10443 22719 -20638
11181b0638Q473J3405k2923J960M085J4369K0094l236J3378j4184q720O806k4834
$$ -20638 -12165 1240 -21683 -19723 -15638 -1269 18825 15589 28967 14783 6063 12869 -11965
11168a1965K7810J7629l6344J4255N607M125K5931R214j2718n372n1765k806L760
$$ -11965 15845 33474 -2870 11385 16992 21117 47048 56262 43544 38172 -13593 -16399 -12639
11155a2639L2060P959m3349j6195J1565N756K9669j888l2010l1749R165J4751
$$ -12639 19421 27380 -15969 -32164 -20599 -14843 14826 12938 -19072 -50821 -41656 -26905
11143b6905r163j6577k7726P104N874L1805L183n2579j1520J9656O7502J3723
$$ -26905 -36068 -52645 -80371 -73267 -67393 -35588 -32405 -84984 -96504 -76848 -9346 4377
11131D377p758n014j3744r659J0381m22l5570q84J9437J6316l1286j1054M931
$$ 4377 -3381 -8395 -22139 -31798 -21417 -21839 -57409 -58293 -38856 -22540 -53826 -64880 -59949
11118e9949J2836J8683J2704K788O588Q186j8854q911K3269j6571k9583l5332
$$ -59949 -47113 -28430 -15726 -12938 -6350 1836 -17018 -25929 -2660 -19231 -48814 -84146
11106h4146K8683L2218L6217l1054M564K8355j2713J2147P79k3722K004J8987
$$ -84146 -55463 -23245 12972 -18082 -13518 14837 2124 14271 15050 -8672 -6668 12319
11094A2319J1987k1500k3125j5622k4763J2343N1553M1853q001l031j6567j8166
$$ 12319 24306 2806 -20319 -35941 -60704 -48361 3192 45045 37044 34013 17446 -720
11082g20j0294j974M71l91J2749O852r873k2728J3185Q928J0953n365j6191k1899
$$ -720 -11014 -12988 -12517 -12908 -159 6693 -3180 -25908 -12723 -3795 7158 1793 -14398 -36297
11068c6297J8017K5395L4048j6463j7811J3564J1663n119j5940p912l6334l1368
$$ -36297 -18280 7115 41163 24700 6889 20453 32116 26997 11057 3145 -33189 -64557
11056f4557J1511j521N672L0106M518k969N682J1129M1193K4609M8981k0654k1850
$$ -64557 -53046 -54567 -48895 -18789 -14271 -17240 -11558 -429 40764 65373 114354 93700 71850
11043G1850k187j0278j4165j6433j2264l2445k5236J8338j3744j1494J554j3575
$$ 71850 69663 59385 45220 28787 16523 -15922 -41158 -22820 -36564 -48058 -46504 -60079
11031f0079K8625K4345J2116j6627k8229N144K99K1282P96R449K4247m3971N58
$$ -60079 -31454 -7109 5007 -11620 -39849 -34705 -34406 -13124 -12328 -2879 21368 -22603 -22045
11018b2045L6992K5647R382J1359l6596n2158l848M5315L2721L659r63k3858K3051
$$ -22045 14947 40594 49976 61335 24739 -27419 -31267 14048 46769 50428 49465 25607 48658
11005D8658o115k0283m280J9063J231k6105l6832J986J1447j1304N683j4802k0109
$$ 48658 42543 22260 17980 37043 38274 12169 -24663 -22677 -11230 -22534 -16851 -31653 -51762
10992e1762L236L7188L1875N422J1444k2465k5184j0113L2565P007o015o330L11
$$ -51762 -48526 -11338 20537 25959 37403 14938 -10246 -20359 12206 19213 13198 6868 7179
10979G179j2068j6722J4468K235O470j3402l0508J4K7332L1188N894j6788n162
$$ 7179 -4889 -21611 -7143 -4908 1562 -11840 -42348 -42334 -15002 16186 22080 5292 130
10966A30L9j6515Q685L871J2408J6558l3956k3762P409J314j3430J9034N6000
$$ 130 169 -16346 -7661 -3790 8618 25176 -8780 -32542 -25133 -23819 -37249 -18215 37785
10953C7785K0881k8679l2587r052K478q559P58M9585J9277k6466p892j5277m042
$$ 37785 58666 29987 -2600 -11652 -9174 -17733 -16975 32610 51887 25421 17529 2252 -1790
10940a790m21L2591N787j0945j0078K2942n68l048r880L0580p328l9403n6651
$$ -1790 -2211 30380 36167 25222 15144 38086 37518 34470 24590 55170 47842 8439 -48212
10927d8212r206R133j125L9051K2838Q261l449l1860o535Q056k1138K2006L238
$$ -48212 -57418 -48285 -49410 -10359 12479 20740 17291 -14569 -21104 -13048 -34186 -12180 -8942
10914h942k156q500k5463k7515R222M1363j7975J5771N602J2793j6095k8014k1662
$$ -8942 -11098 -19598 -45061 -72576 -63354 -21991 -39966 -24195 -18593 -5800 -21895 -49909 -71571
10901g1571J1182N360j0052r681L0197J9588J0436J1577L3965r058j7772k0663
$$ -71571 -60389 -55029 -65081 -74762 -44565 -24977 -14541 -2964 31001 21943 4171 -16492
10889a6492O693j3218j8581j1402j2946K9101K2097l632K775j569J0290R664O641
$$ -16492 -9799 -23017 -41598 -53000 -65946 -36845 -14748 -18380 -15605 -17174 -6884 2780 9421
10876I421K9269j8609m1919J9704O207O484j2230j1315l3433N986j3463J6215
$$ 9421 38690 20081 -21838 -2134 4073 10557 -1673 -12988 -46421 -40435 -53898 -37683
10864c7683L9358J9780l7281m1228N909J0q084R110k287j3512L6224L7955J0366
$$ -37683 1675 21455 -15826 -57054 -51145 -51135 -59219 -50109 -52396 -65908 -29684 8271 18637
10851A8637J7824k0637J418R524q218l410J6006k1888O472J141o0619m3045r925
$$ 18637 36461 15824 17242 26766 18548 15138 31144 9256 15728 16869 -43750 -86795 -96720
10838i6720K5167P094L1147M5875l3934m797L1996k48m113J2799M012l9413n292
$$ -96720 -71553 -64459 -33312 12563 -21371 -26168 5828 5580 1467 14266 18278 -21135 -26427
10825b6427J1732K5229J764m2344q237K0660K506Q844L868q608k6379k9412j6004
$$ -26427 -14695 10534 12298 -30046 -38283 -17623 -15117 -6273 -2405 -11013 -37392 -66804 -82808
10812h2808K3161K3964l019k603K6214n090K2229M3595m501j6419j8706J318M532
$$ -82808 -59647 -35683 -38702 -41305 -15091 -20181 2048 45643 41142 24723 6017 7335 11867
10799A1867J4024k2802p801j3257k0161J1473J4327L5820l0361p009k8452j9649
$$ 11867 25891 3089 -4712 -17969 -38130 -26657 -12330 23490 -6871 -13880 -42332 -61981
10787f1981P184N2238L909j6631K3587j2236n339o643j3338j1544l719k2477k1743
$$ -61981 -54797 -2559 1350 -15281 8306 -3930 -9269 -15912 -29250 -40794 -44513 -66990 -88733
10774h8733k9551K3257L6092L9230R597l910J0435l514J55J9895J2665J2946K602
$$ -88733 -118284 -95027 -58935 -19705 -10108 -14018 -3583 -7097 -6942 12953 25618 38564 41166
10761D1166J1211j2635j6346l658j0393J7417K9355l511j6749j7868k0626K2347
$$ 41166 52377 39742 23396 19738 9345 26762 56117 52606 35857 17989 -2637 19710
10749A9710J6019j8617k4236K527j6158P476J0783j0149q65l1438k2728L8653
$$ 19710 35729 17112 -7124 -4597 -20755 -13279 -2496 -12645 -13510 -44948 -67676 -29023
10737b9023l353m830j864M845J883l3615o810N0209K581K6924k353p696j1200
$$ -29023 -32376 -37206 -39070 -34225 -32342 -65957 -72767 -22558 -19977 6947 4594 -3102 -14302
10724a4302K033l053j081J6800J6731k3025j0596l4315O341M648J1344L6417L0776
$$ -14302 -12269 -15322 -16403 397 17128 -5897 -16493 -50808 -44467 -39819 -28475 7942 38718
10711C8718m746J5942M85j0773J7071j5121n2689j1407o998k078N759J3187K2102
$$ 38718 33972 49914 50399 39626 56697 41576 -11113 -22520 -29518 -31596 -25837 -12650 9452
10698I452J0445O958k9392j5087J0588j2415J6773n386l3147J1334m943J0079
$$ 9452 19897 26855 -2537 -17624 -7036 -19451 -2678 -8064 -41211 -29877 -34820 -24741
10686b4741J5949l4034P57O1669K8050l500j4313j4889n337j6059J1942j5675
$$ -24741 -8792 -42826 -42069 19600 47650 44150 29837 14948 9611 -6448 5494 -10181
10674a0181j6479l5980l04K5497N3158K5683L1408j4376j7865L334k3308r158
$$ -10181 -26660 -62640 -62944 -37447 15711 41394 72802 58426 40561 43895 20587 11429
10662A1429j4250L9563k292l0762M1642K5975m4227k9612j0385J681L644J6539
$$ 11429 -2821 36742 34450 3688 45330 71305 27078 -2534 -12919 -11238 -7594 8945
10650H945O068q070j8143l7081j6497r294Q15Q267J1553Q424l0277k1637K5185
$$ 8945 15013 6943 -11200 -48281 -64778 -74072 -73257 -64990 -53437 -45013 -75290 -96927 -71742
10637g1742O867M046M055j0982K3484N503K6005P095l2619k5310L8630J2068p47
$$ -71742 -64875 -60829 -56774 -67756 -44272 -38769 -12764 -5669 -38288 -63598 -24968 -12900 -13647
10624a3647k1043K1134M0350J3883J7357r782m0660l2559K1944L77j5521p723
$$ -13647 -34690 -13556 26794 40677 58034 48252 7592 -24967 -3023 -2646 -18167 -25890
10612b5890J9807N36J8368j859l0882O364r925r914J4389k58j544J734L0516Q551
$$ -25890 -6083 -5547 12821 10962 -19920 -13556 -23481 -33395 -19006 -19264 -20808 -19074 11442 19993
10598A9993p491j4080R974J9672N804l2255l8893k8974P887P267L1549J9317m610
$$ 19993 12502 -1578 8396 28068 33872 1617 -37276 -66250 -58363 -51096 -19547 -230 -4840
10585d840K0384L8253m351J2466o2390l1686J3255O240O657j5779J0512L4056
$$ -4840 15544 53797 49446 61912 -478 -32164 -18909 -12669 -6012 -21791 -11279 22777
10573B2777j216j257L105N910K5475n0367l2446J6582r351L0513L0667N069j3888
$$ 22777 21561 20304 23409 29319 54794 4427 -28019 -11437 -20788 9725 40392 45461 31573
10560C1573j9017J760L0044K5819M202j2493k550j0115k0849m3012q121K2290
$$ 31573 12556 14316 44360 70179 74381 61888 59338 49223 28374 -14638 -22759 -469
10548d69J7740O144K2199m5943j6235O5767J1884l1895m0184l8830K3024L5577
$$ -469 17271 23415 45614 -329 -16564 49203 61087 29192 -10992 -49822 -26798 8779
10536H779K7608L4439J3159m0002R943J4341n0662k2270J0340j1210n151j7574
$$ 8779 36387 70826 83985 43983 53926 68267 17605 -4665 5675 -5535 -10686 -28260
10524b8260J7067J5283K9519p131m1392L786k417J9525J1785J128k6078k9074
$$ -28260 -11193 4090 33609 26478 -14914 -11128 -13545 5980 17765 18893 -7185 -36259
10512c6259j8425L0448M8067O113J6588k9552j5794L407L2062N3960J7781p832
$$ -36259 -54684 -24236 23831 29944 46532 16980 1186 4593 36655 90615 108396 100564
10500A00564p2291n9224o397j4845J6008K8579K0890m2606J491K6618K1661M586
$$ 100564 28273 -30951 -37348 -52193 -36185 -7606 13284 -29322 -27831 -1213 20448 25034
10488B5034j9883q279j5339k2276j0962k3089N0429L4069N472L6156o764k8053
$$ 25034 5151 -3128 -18467 -40743 -51705 -74794 -24365 9704 15176 51332 44568 16515
10476A6515P59j5721n3200J6153R401K3651n76N07l0105k872M4625K1307p557
$$ 16515 17274 1553 -51647 -35494 -26093 -2442 -3018 -2511 -32616 -35488 9137 30444 22887
10463B2887L537l778j8211k7410j592j9415j5380k283L789K6152K9717m446o942
$$ 22887 26424 22646 4435 -22975 -24567 -43982 -59362 -61645 -57856 -31704 -1987 -6433 -13375
10450a3375J2792J2569k2107J8987J2808R519p131k7658q315n608k3969j2126
$$ -13375 -583 11986 -10121 8866 21674 31193 24062 -3596 -11911 -17519 -41488 -53614
10438e3614j637n049J3869Q20J7338K4074K7153N727k245L6693l192o637l651
$$ -53614 -55251 -60300 -46431 -45611 -28273 -4199 22954 28681 26436 63129 59937 53300 49649
10425D9649m867J8331L1804k1649l3603k9554J6089K6774n427k7707m015l117
$$ 49649 44782 63113 94917 73268 39665 10111 26200 52974 47547 19840 15825 12708
10413A2708L249l6228M3025j062n118l792l674M0289M7678K4784O3814Q7413J01184
$$ 12708 15957 -20271 22754 21692 16574 12782 9108 49397 97075 121859 185673 273086 374270
10400C74270P0069k0889r6381q2942p7246r3746k7581q136N093L9666L8444m2146
$$ 374270 444339 423450 327069 244127 166881 73135 45554 37418 42511 82177 120621 78475
10388G8475m3439k5076J3644J2838K6975K5385L5199J7244K3757j4364j1347K6446
$$ 78475 35036 9960 23604 36442 63417 88802 124001 141245 165002 150638 139291 165737
10376A65737j3632n9201k7806J603j1012m5688K5160L376q138j9480p003m976
$$ 165737 152105 92904 65098 66701 55689 10001 35161 38537 30399 10919 3916 -1060
10364a060l6264j2146J8707O739k2930k6337q668K3439q346K5472o180m3316K0341
$$ -1060 -37324 -49470 -30763 -24024 -46954 -73291 -81959 -58520 -66866 -41394 -47574 -90890 -70549
10351g0549N6268J1236j0492J6575J5059j5879J9644j4327m5542j3488r345k9492
$$ -70549 -14281 -3045 -13537 3038 18097 2218 21862 7535 -38007 -51495 -60840 -90332
10339i0332K9214L7967R704J8751M5684N713j4904j5992j8204K599L2273J9171
$$ -90332 -61118 -23151 -13447 5304 50988 56701 41797 25805 7601 10200 42473 61644
10327F1644k5155j2410k5313p092K3887j2520l4568N484K3860M172k912K0778
$$ 61644 36489 24079 -1234 -8326 15561 3041 -31527 -26043 -2183 1989 -923 19855
10315A9855l2269q999J1897n166j5513j0155K6550K4577k8388r581j7907K6236
$$ 19855 -12414 -21413 -9516 -14682 -30195 -40350 -13800 10777 -17611 -27192 -45099 -18863
10303a8863j7442J8688K651R08j9119j3024O755q117J9334l066O859J0772R790
$$ -18863 -36305 -17617 -14966 -14058 -33177 -46201 -39446 -47563 -28229 -31295 -24436 -13664 -3874
10290c874N3166L5261j8010k1368m1704J530L3817J594r852j2457k9641O548R985
$$ -3874 49292 84553 66543 45175 3471 5001 38818 40412 30560 18103 -11538 -4990 4995
10277D995J402k366L2724J2895k2813j051J993L351J1262l3021n981J2796J1981
$$ 4995 6397 4031 36755 49650 26837 25786 27779 31130 42392 9371 3390 16186 28167
10264B8167N288J5009n865k2234K972J2497k6652r559M425L7070J2752o932q1084
$$ 28167 33455 48464 42599 20365 23337 35834 9182 -377 4048 41118 53870 46938 -34146
10251c4146l5028L1703P525O799j4180j5802k55M4465K1582L1739k909K4J3350
$$ -34146 -69174 -37471 -29946 -23147 -37327 -53129 -53384 -8919 12663 44402 41493 41517 54867
10238E4867L611P685k2572j8663k0469j0838P027q486l1126J9373L8865L7448
$$ 54867 58478 66163 43591 24928 4459 -6379 648 -7838 -38964 -19591 19274 56722
10226E6722q281j3290j7286N646N207k2554k7466J9224r2o080L1610o03j1923
$$ 56722 48441 35151 17865 23511 28718 6164 -21302 -2078 -2170 -8250 23360 22757 10834
10213A0834m002m8647j1609J8221N644J814n165M5935n536k2846K1279l79K5022
$$ 10834 6832 -41815 -53424 -35203 -29559 -27745 -32910 13025 7489 -15357 5922 5543 30565
10200C0565l03j6300l130n846q254l0953p600K0995K2276O553O27m669n502k9131
$$ 30565 30262 13962 10832 4986 -3268 -34221 -41821 -20826 1450 8003 8630 3961 -1541 -30672
10186c0672K1313N5121k435M990k5432k6698k809R566M196K8072L951o675J4233
$$ -30672 -9359 45762 43327 48317 22885 -3813 -6622 2944 7140 35212 39163 32488 46721
10173D6721p168O19k7450l4624K4643L1715J0189o64k1626j7088j1136j4771J4155
$$ 46721 39553 40172 12722 -21902 2741 34456 44645 43981 22355 5267 -5869 -20640 -6485
10160f485r241k6046j2936Q309L203K4212K996J4688R072k7138k0491j6740R8
$$ -6485 -15726 -41772 -54708 -46399 -43196 -18984 -15988 -1300 7772 -19366 -39857 -56597 -56499
10147e6499M8643P495L5375J647k7821J528J2630J7840J2130J2866n664m8638
$$ -56499 -7856 -361 35014 36661 8840 10368 22998 40838 52968 65834 60170 11532
10135A1532M693k6548m0577j6416K2268K4860L9758K584O547m472J5562k124o6212
$$ 11532 16225 -10323 -50900 -67316 -45048 -20188 19570 22154 28701 24229 39791 37667 -28545
10122b8545l3128N6026j942j1144K2397J2331K9269J2690j9462j0042j1771l4035
$$ -28545 -61673 -5647 -7589 -18733 3664 15995 45264 57954 38492 28450 16679 -17356
10110a7356j4341j991L2711J2026J941M0690j4745j1294R014k5354K8716m5626
$$ -17356 -31697 -33688 -977 11049 12990 53680 38935 27641 36655 11301 40017 -5609
10098e609j8738m801M421L1302L5496J096k2741l4194M393R824L023m8811r415
$$ -5609 -24347 -29148 -24727 6575 42071 43167 20426 -13768 -9375 449 3472 -45339 -54754
10085e4754k629k0957J7861K7141K4136K7380j0914k1856o583j912K5635J8857
$$ -54754 -57383 -78340 -60479 -33338 -9202 18178 7264 -14592 -21175 -23087 2548 21405
10073B1405l5037j2225J3025J0935l2236l6582P128o59o700J399K2687N5525o767
$$ 21405 -13632 -25857 -12832 -1897 -34133 -70715 -63587 -64246 -70946 -69547 -46860 8665 1898
10060A898P909k9979j6108K148O319M7581O192n236M31J9763L277l591k2802n036
$$ 1898 9807 -20172 -36280 -34132 -27813 19768 25960 20724 21155 40918 44195 40604 17802 12766
10046A2766l5888m025O96l641R149k7045J3034J0961K2895M8053O3414O2951k228
$$ 12766 -23122 -27147 -26451 -30092 -20943 -47988 -34954 -23993 -1098 46955 110369 173320 171092
10033A71092n9731p8546k8245L0128P50l3287L3544N6682n2891k2197J463J606
$$ 171092 111361 32815 4570 34698 35448 2161 35705 92387 39496 17299 18762 20368
10021B0368N640k4247k059q404k5489K38L7407N4085P204k2808m021l0158K2848
$$ 20368 26008 1761 -298 -8702 -34191 -33953 3454 57539 64743 41935 37914 7756 30604
10008C0604l75L416J8476k4366Q612j5625J7293K4074l1045l4446m600O453L0917
$$ 30604 30229 33645 52121 27755 36367 20742 38035 62109 31064 -3382 -7982 -1529 29388
9995B9388J854l8274j4822L6738J3947j6426n7884P912K5672J1341J5416l072
$$ 29388 31242 -7032 -21854 14884 28831 12405 -45479 -37567 -11895 -554 14862 11790
9983A1790K446q926J0592j5446j5181n938l1568J7856q604J9927k0135J9903J4015
$$ 11790 14236 5310 15902 456 -14725 -20663 -52231 -34375 -42979 -23052 -43187 -23284 -9269
9970i269p093o196Q16j913Q82P614Q330j2542j3327J6482m350N563P721k1246
$$ -9269 -16362 -22558 -21742 -23655 -22773 -15159 -6829 -19371 -32698 -16216 -20566 -15003 -7282 -28528
9956b8528P420j643J3861k0459k1668k680N0047N0617J558j7035j0902m9931m19
$$ -28528 -21108 -22751 -8890 -29349 -51017 -53697 -3650 46967 48525 31490 20588 -29343 -29762
9943b9762K5896P882O462J4532J3071n218J895J5476j4913O876K977K2973J2503
$$ -29762 -3866 4016 10478 25010 38081 32863 34758 50234 35321 42197 45174 68147 80650
9930H0650q577k4807l2866J6998j2204m0668p819L238L4802K427M969Q483j4576
$$ 80650 72073 47266 14400 31398 19194 -21474 -29293 -26055 8747 11174 16143 24626 10050
9917A0050k1662j489K8806j2467K216n165j7492n394M656K3484K8755J032K7147
$$ 10050 -11612 -13101 15705 3238 5454 289 -17203 -22597 -17941 5543 34298 35330 62477
9904F2477j0375j3419j7093J1088K7499K3259j874l1694k3929J6901p666L7718
$$ 62477 52102 38683 21590 32678 60177 83436 81562 49868 25939 42840 35174 72892
9892G2892L8298K8375l772l8476l0064L4982L4865L6022j2496l873J1941j7533
$$ 72892 111190 139565 135793 97317 67253 102235 137100 173122 160626 156753 168694 151161
9880A51161n496k2741k6506J200l4638o4802K131J3259j5351l4143L5247L2578
$$ 151161 145665 122924 96418 97618 62980 -1822 309 13568 -1783 -35926 -679 31899
9868C1899J7100J8843o333L0410j0156M735P735k2366N564J7631m2723k6568M741
$$ 31899 48999 67842 61509 91919 81763 86498 94233 71867 77431 95062 52339 25771 30512
9855C0512K9197k0139j833J1717j7710j6020j4566l6635k7543K6405K3562K4701
$$ 30512 59709 39570 37737 49454 31744 15724 1158 -35477 -63020 -36615 -13053 11648
9843A1648K3574K0780J3836j063m4085o091Q337j9315L775N91J036L6408R078
$$ 11648 35222 56002 69838 68775 24690 18599 26936 7621 11396 11987 13023 49431 58509
9830E8509J7362k814N046j5918Q198J2149k1509r875n720j3231J3335n819j9179
$$ 58509 75871 73057 78103 62185 70383 82532 61023 51148 45428 32197 45532 39713 20534
9817B0534j7713J5958j62r873K3553J0744j3935m4173j1993L8298m183r492j97
$$ 20534 2821 18779 18617 8744 32297 43041 29106 -15067 -27060 11238 7055 -2437 -2634
9804b634j248Q082n725m129n619J1234J4211l0205j0926J2702K5687J5380L2367
$$ -2634 -3882 4200 -1525 -5654 -11273 -39 14172 -16033 -26959 -14257 11430 26810 59177
9791E9177L538q993m7241k0708j1522n562O6077L7824l764n154N364o557o852
$$ 59177 62715 53722 6481 -14227 -25749 -31311 34766 72590 68826 63672 69036 62479 55627
9778E5627j504k7793P530K2607l673j5423o688k4781j984J4317R710J2353L1952
$$ 55627 54123 26330 33860 56467 52794 37371 30683 5902 3918 18235 27945 40298 72250
9765G2250J1482J7001J943m9385k097J1678K4139k4601j7975k5023k893K836R198
$$ 72250 83732 100733 102676 53291 51194 62872 87011 62410 44435 19412 16519 19355 28553
9752B8553J8557J5796j4883p9805p328K7381J8601M0611M3884j3173j8297j3915
$$ 28553 47110 62906 48023 -31782 -39110 -11729 6872 47483 91367 78194 59897 45982
9740D5982n612K0167L5092j4995k3793J6117o845m6587R437K4905N805J7212l275
$$ 45982 40370 60537 95629 80634 56841 72958 66113 19526 28963 53868 59673 76885 73610
9727G3610J8794K318k3812j4228j9387j3873m560L7675J5727q133q746O711j1608
$$ 73610 92404 94722 70910 56682 37295 23422 18862 56537 72264 64131 55385 62096 50488
9714E0488q095J8293L6837k3949j941L991k8261r118P509K4267K3115k2778k8944
$$ 50488 42393 60686 97523 73574 71633 75624 47363 38245 45754 70021 93136 70358 41414
9701D1414r464J7984Q28n299j0279J0333K8207J7055l803j9868j0729k2665j6998
$$ 41414 31950 49934 50762 45463 35184 45517 73724 90779 86976 67108 56379 33714 16716
9688A6716Q631K2811o670j2047J2298M9611J9405k7608j3506K5041K992j4740
$$ 16716 25347 48158 41488 29441 41739 91350 110755 83147 69641 94682 97674 82934
9676H2934k351J7667k735n5372k0877M6425J6285O757j426K7136k3901l795M588
$$ 82934 80583 98250 95515 40143 19266 65691 81976 88733 87307 114443 90542 86747 91335
9663I1335K4726J9994l2908j7091J5941j7783K1716m406q619l374k4814Q134j4371
$$ 91335 116061 136055 103147 86056 101997 84214 105930 101524 92905 89531 64717 72851 58480
9650E8480l711Q725j2377n177K0642q587M051L4836J5640k3399k689L0747J4052
$$ 58480 54769 63494 51117 45940 66582 57995 62046 96882 112522 89123 86434 117181 131233
9637A31233k6260J1193l0335K926J2283L3698N121k4553P565j863q781k263J5511
$$ 131233 104973 116166 85831 88757 101040 134738 139859 115306 122871 121008 112227 109964 125475
9624A25475J4K00j4186J1581J1868J0045K3610k3282k0520K697j5713l0994K0159
$$ 125475 125489 125689 111503 123084 134952 144997 168607 145325 124805 127502 111789 80795 100954
9611A00954J5991K2110j1775j4650j5936K9646J530O755J3073r227j6277L8898
$$ 100954 116945 139055 127280 112630 96694 126340 127870 134625 147698 138471 122194 161092
9599A61092J7291l315J8784J7885j7201j3026q702J1049L2137k4201k7882k2518
$$ 161092 178383 175068 193852 211737 194536 181510 172808 183857 215994 191793 163911 141393
9587A41393k914L1837j5707r027K9223N11M112J6358l178K2802k847j1468K7314
$$ 141393 138479 170316 154609 145582 174805 175316 179428 195786 192608 215410 212563 201095 228409
9574B28409K4680K454l062j0742l3500l6826m749j2J0745N672K3565J6608N196
$$ 228409 253089 255543 252481 241739 208239 171413 166664 166652 177397 183069 206634 223242 228438
9561B28438j9822l9834Q671J6858J4148K6834q103M1631L00k7960k8474q178J9675
$$ 228438 208616 168782 177453 194311 208459 235293 227190 268821 269121 241161 212687 204509 224184
9548B24184j6136M0011m0598j9091J9757P400j5793J9274K5355l7818L2566j0682
$$ 224184 208048 248059 207461 188370 208127 215527 199734 219008 244363 206545 239111 228429
9536B28429k1994J7078L3741L0885m1354k47p250M07o50N227O552o556J497N743
$$ 228429 206435 223513 257254 288139 246785 246538 239288 239695 239045 244272 250824 244268 245765 251508
9522B51508Q306k5829o951L090P155M1453L4397p569m8772o4322o262L7262K7979
$$ 251508 259814 233985 227034 230124 237279 278732 313129 305560 256788 192466 186204 223466 251445
9509B51445J1825o20p7323N971N732k0111O3111L1351N4593J2425O81k1963j523
$$ 251445 263270 262650 185327 191298 197030 176919 240030 271381 325974 338399 339080 317117 315594
9496C15594L5179O185Q893M3750K6662j2695K610M5138j6958r977J3808l121k4203
$$ 315594 350773 356958 365851 409601 436263 423568 426178 471316 454358 444381 458189 455068 430865
9483D30865L2922L3196l423M105N172J755M589n496K2673L937o911k1069K268
$$ 430865 463787 496983 493560 497665 502837 504592 509181 503685 526358 530295 523384 502315 504583
9470E04583M3960M1849K655o030l0086M475L1444j5798K3203Q263L729L6363L1706
$$ 504583 548543 590392 593047 587017 556931 561406 592850 577052 600255 608518 612247 648610 680316
9457F80316k6491m525J7240k3842Q530r479O243L1691R132J0052J2752J7975R75
$$ 680316 653825 649300 666540 642698 651228 641749 647992 679683 688815 698867 711619 729594 730569
9444G30569m609Q609J9192K9908K0032L5140j9676k6207k9922P70J9787K1793
$$ 730569 725960 734569 753761 783669 803701 838841 819165 792958 763036 763806 783593 805386
9432H05386M450N5291K6647K3507K6535J9509j8330J2151j0602J2953K7261J0878
$$ 805386 809836 865127 891774 915281 941816 961325 942995 955146 944544 957497 984758 995636
9420I95636L2315N4048K5504K3239J7515j33L458K7515J3875J8292N5216O4237
$$ 995636 1027951 1081999 1107503 1130742 1148257 1148124 1151582 1179097 1192972 1211264 1266480 1330717
9408A330717M7677L4990N1031L3856O272Q8086M2000m887L3700P2593P4884L1753
$$ 1330717 1378394 1413384 1464415 1498271 1504543 1592629 1634629 1629742 1663442 1736035 1810919 1842672
9396A842672K7090O4250M0341K1084O0304J05499P6847N5124O2285R8609Q1920
$$ 1842672 1869762 1934012 1974353 1995437 2055741 2161240 2238087 2293211 2355496 2454105 2536025
9385B536025J02165J02348O6612Q8219P5860Q5913J26413J14670J23291J48074
$$ 2536025 2638190 2740538 2807150 2895369 2971229 3057142 3183555 3298225 3421516 3569590
9375C569590J57293J47948J10379J64242J75753J39611J69106K49164K84058K71897
$$ 3569590 3726883 3874831 3985210 4149452 4325205 4464816 4633922 4883086 5167144 5439041
9365E439041K28651K37940K94324K98696L25425L59879M01089M45794M86738N02002
$$ 5439041 5667692 5905632 6199956 6498652 6824077 7183956 7585045 8030839 8517577 9019579
9355I019579N90303O37061O42519O95117Q00546Q86962R30350J033337J185516
$$ 9019579 9609882 10246943 10889462 11584579 12385125 13272087 14202437 15235774 16421290
9346A6421290J313622J457162J587655J741792K023875K281197K512221K754988
$$ 16421290 17734912 19192074 20779729 22521521 24545396 26826593 29338814 32093802
9338C2093802L082455L427631L765160M112934M504013M740859M915760M957059
$$ 32093802 35176257 38603888 42369048 46481982 50985995 55726854 60642614 65599673
9330F5599673M792942M389204L717325K788114J631111L98327q76129k061915
$$ 65599673 70392615 74781819 78499144 81287258 82918369 83316696 82440567 80378652
9322H0378652l081797l830323m307627m566231m594240m496281m337273m099564
$$ 80378652 77296855 73466532 69158905 64592674 59998434 55502153 51164880 47065316
9314D7065316l788336l478932l187316k930835k644348k411912k148819j937882
$$ 47065316 43276980 39798048 36610732 33679897 31035549 28623637 26474818 24536936
9306B4536936j792425j638247j451057j317082j203422j121248j030824r15447
$$ 24536936 22744511 21106264 19655207 18338125 17134703 16013455 14982631 14067184
9298A4067184q29473p63684p81279o25350n74352n74375n31862m51874m31943
$$ 14067184 13237711 12474027 11692748 11067398 10493046 9918671 9386809 8934935 8502992
9289H502992m05462l88423l48733l50301l41474l11898k86379k78758k36535k46232
$$ 8502992 8097530 7709107 7360374 7010073 6668599 6356701 6070322 5791564 5555029 5308797
9279E308797k27312k10129k11311j79517k05222j58879j25473j38021j56237j89125
$$ 5308797 5081485 4871356 4660045 4480528 4275306 4116427 3990954 3852933 3696696 3507571
9269C507571j41301r7332j20942j02879j25685r0983p6271p3129r1256p6940q5883
$$ 3507571 3366270 3268938 3147996 3045117 2919432 2828449 2752178 2679049 2587793 2510853 2424970
9258B424970p3434n9913l7753n4761p6740p1601k3923k0788o5791o7923n4652
$$ 2424970 2351536 2291623 2253870 2199109 2122369 2050768 2026845 2006057 1940266 1872343 1817691
9247A817691k1564n5131o1229l3008m6161j6450j9020j0750l1508l3332m3020
$$ 1817691 1796127 1740996 1679767 1646759 1600598 1584148 1565128 1554378 1522870 1489538 1446518
9236A446518m8927m5277j1752o720l4073o3416m5481o5883j4214r08m0477k8341
$$ 1446518 1397591 1352314 1340562 1333842 1299769 1236353 1190872 1124989 1110775 1109867 1069390 1041049
9224A041049p100J3705n095n994R733k1122j2913l7077n9938m4301m8286j9629
$$ 1041049 1033949 1047654 1042559 1036565 1046298 1025176 1012263 975186 915248 870947 822661 803032
9212H03032M760j2375o0498Q159K8466q535m1785M663r383o080l828K877J2926
$$ 803032 807792 795417 734919 743078 771544 763009 721224 725887 716504 710424 706596 709473 722399
9199G22399m2294n1136k9601j7057l947J1702l6965m3335j5343R925j416L4818
$$ 722399 680105 628969 599368 582311 578364 590066 553101 509766 494423 504348 502932 537750
9187E37750j7777m4744k0865k5221K0476R732Q16N0650l1479o9784l1149j065
$$ 537750 519973 475229 454364 429143 449619 459351 460167 510817 479338 409554 378405 377340
9175C77340j5351N7816M1003j4367p7085k394K5871j7121k2993k3263J2538l719
$$ 377340 361989 419805 460808 446441 369356 366962 392833 375712 352719 329456 341994 338275
9163C38275j7755J1547J3736n053J1227L5173j1769m0528r416n946L4192J4146
$$ 338275 320520 332067 345803 340750 351977 387150 375381 334853 325437 319491 353683 367829
9151C67829k5652k155Q513R556j4274J5841r193l878K772J5734K577M016j5377
$$ 367829 342177 340022 348535 358091 343817 359658 350465 346587 349359 365093 367670 371686 356309
9138C56309k6460M381L3048r696n649j1391j4437j0639n988J7171K6437J1815
$$ 356309 329849 334230 367278 357582 351933 340542 326105 315466 309478 326649 353086 364901
9126C64901j3571l6943l0211q970J1611J6674j3700j9371k479k8210n746K673
$$ 364901 351330 314387 284176 275206 286817 303491 289791 270420 267941 239731 233985 236658
9114B36658J3882N145j0610k2360L0674l345n1908k3436K0756r783j8835J818
$$ 236658 250540 255685 245075 222715 253389 250044 198136 174700 195456 185673 166838 168656
9102A68656L8185k313K4129j3013Q868k0520j3606j3191k2509n6440K4966K2470
$$ 168656 206841 204528 228657 215644 224512 203992 190386 177195 154686 98246 123212 145682
9090A45682k9836Q471q317k4381p574L3342K6228K6500r380O114K0468j2299k4375
$$ 145682 115846 124317 116000 91619 84045 117387 143615 170115 160735 166849 187317 175018 150643
9077A50643l5895m5366K2351M8182J066k4065j1055J5193L9630o813j5077l708
$$ 150643 114748 69382 91733 139915 140981 116916 105861 121054 160684 153871 138794 135086
9065A35086J9499j8000j2001M7044N088j2543j9007j2478k4710J2124K949M4910
$$ 135086 154585 136585 124584 171628 176716 164173 145166 132688 107978 120102 123051 167961
9053A67961J8524l596l1872q01n371Q752J0206k9991M240J8335j7117k1643j2170
$$ 167961 186485 182889 151017 150216 144845 153597 163803 133812 138052 156387 139270 117627 105457
9040A05457J4195Q256l980k9652m2484m791n965N2177N2172K1319k9831k142j7112
$$ 105457 119652 127908 123928 94276 51792 47001 41036 93213 145385 166704 136873 134731 117619
9027A17619P345J7298K021n264l1998J3843o163m856p740K2652j075j0429K646
$$ 117619 124964 142262 144283 139019 107021 120864 114701 109845 102105 124757 123682 113253 115899
9014A15899m705m558P478k9579j0653j902k189k5915r082l524M9429K8694r078
$$ 115899 111194 106636 114114 84535 73882 71980 69791 43876 34794 31270 80699 109393 100315
9001A00315L366J7457L9100k185j5944j4039j1932k361L0781r109k7650j830L461
$$ 100315 103681 121138 160238 158053 142109 128070 116138 113777 144558 135449 107799 105969 109430
8988A09430m728k1464j2791P8M7666K4655n1630l5622K8237M878r578J0388Q738
$$ 109430 104702 83238 70447 70525 118191 142846 91216 55594 83831 88709 79131 89519 98257
8975I8257k6569q657j1917J0557L8954J6811m4174n754J7908L8022k3154J148
$$ 98257 71688 63031 51114 61671 100625 117436 73262 67508 85416 123438 100284 101432
8963A01432O918k498J438L23j5914J9594m4796j6900l0371k5228J3547J5044o459
$$ 101432 108350 105852 107290 107613 91699 111293 66497 49597 19226 -6002 7545 22589 16130
8950A6130J172J7280L1179P069J306l68M604n069j3147r219K344k8534o140j4516
$$ 16130 17302 34582 65761 72830 74136 73768 78372 73303 60156 50937 53281 24747 18607 4091
8936D091K9043N6838j7883l9165P237M1779J3294n0924m6438j3761L6389O185
$$ 4091 33134 89972 72089 32924 40161 81940 95234 44310 -2128 -15889 20500 26685
8924B6685q806J52N0193n76m4618l6329O663K2681j2450r2K2655N481J2682L2658
$$ 26685 17879 18031 68224 67648 23030 -13299 -6636 16045 3595 3503 26158 31639 44321 76979
8910G6979J7276j4116K3611p981k9373k2187j7380R595J3663k88r33Q870R715
$$ 76979 94255 80139 103750 95769 66396 44209 26829 36424 50087 49799 48866 57736 67451
8897F7451L8407L175m1205l8361O901K9882k456J1957K3625k8116M955k177k7937
$$ 67451 105858 109033 67828 29467 36368 66250 63794 75751 99376 71260 76215 74038 46101
8884D6101j7077K540k7516M6909K1557j8065j9232j9271J9958O516k9222P785
$$ 46101 29024 31564 4048 50957 72514 54449 35217 15946 35904 42420 13198 20983
8872B0983K2588J6582l481j9605l1238p64k3528P19m047l3685M351O3272K4464
$$ 20983 43571 60153 56672 37067 5829 5065 -18463 -17744 -21791 -55476 -51125 12147 36611
8859C6611M2650m702p831k1088j8290l1354k5093J0227O891K4369r510Q520K3186
$$ 36611 79261 74559 66728 45640 27350 -4004 -29097 -18870 -11979 12390 2880 11400 34586
8846C4586j1262L7739L9907j5134J1660O934k7788m6871J2732L9146k2287k5469
$$ 34586 23324 61063 100970 85836 97496 104430 76642 29771 42503 81649 59362 33893
8834C3893O56K1830N0404P183l2207l5976k8206p149j1773J1277l5616K474L1342
$$ 33893 34549 56379 106783 113966 81759 45783 17577 10428 -1345 9932 -25684 -23210 8132
8821H132N968J4346J4066j9083J476r857R065J0453K3240J0270j659k0309n633
$$ 8132 14100 28446 42512 23429 24905 15048 24113 34566 57806 68076 66417 46108 40475
8808D0475k0382M329l413k2368j0300K7450N7793K4078l2121J177m883j2892j6174
$$ 40475 20093 24422 21009 -1359 -11659 15791 73584 97662 65541 66718 61835 48943 32769
8795C2769M706M4984J321l5316k6251l1415m518J9958M527k8347J6914o288K5873
$$ 32769 37475 82459 83780 48464 22213 -9202 -13720 6238 10765 -17582 -668 -6956 18917
8782A8917J2505N527J5103J4658j3229N209k5081O978K8450j0665k2744l67k5616
$$ 18917 31422 36949 52052 66710 53481 58690 33609 40587 69037 58372 35628 35261 9645
8769I645j4155k109J7852J7775q041k363j215m622J9806Q482r489L701K3248q812
$$ 9645 -4510 -6619 11233 29008 20967 18604 17389 12767 32573 41055 31566 35267 58515 49703
8755D9703j9233j4962R221J9319m2013j7548L6290O76O980j6734k653o200J9058
$$ 49703 30470 15508 24729 44048 2035 -15513 20777 21453 28433 11699 9046 2846 21904
8742B1904N3273L477j8320M449J4048O640j0954n998l1229K3060k7440j8338J0884
$$ 21904 75177 78654 60334 64783 78831 85471 74517 68519 37290 60350 32910 14572 25456
8729B5456N257J422n620l0498l056N320j2884J5679j5275j039j59j3709K9992
$$ 25456 30713 32135 26515 -3983 -7039 -1719 -14603 1076 -14199 -15238 -15397 -29106 886
8716H86K6255J6996K0920j0921p125k0945l1072K8281K6438k3739k1842J947l162
$$ 886 27141 44137 65057 54136 47011 26066 -5006 23275 49713 25974 4132 6079 2917
8703B917j4145J8759L471j9095J3059K6583K473O063k0095m234J7981L3796m8615
$$ 2917 -11228 7531 11002 -8093 4966 31549 34022 40085 19990 15756 33737 67533 18918
8690A8918l4713J9721j1543q797Q877m927K599Q679J9660L8930M978m2899p092
$$ 18918 -15795 3926 -7617 -16414 -7537 -12464 -9865 -1186 18474 57404 62382 19483 12391
8677A2391k0514k8735r310K7139J9221R561R007j30j969J4774J8574J9006j4673
$$ 12391 -8123 -36858 -46168 -19029 192 9753 18760 18630 16661 31435 50009 69015 54342
8664E4342k3538k4583L1935J2406j3577j590o617p544L0229j8624L1111J8511
$$ 54342 30804 6221 38156 50562 36985 35395 28778 21234 51463 32839 63950 82461
8652H2461J2810J1163j35j380j3224n1904j4387L655j114K931N002J8519Q991
$$ 82461 95271 106434 106299 104919 91695 39791 25404 29059 27945 30876 35878 54397 63388
8639F3388p471j5291k3544j7521J6757K6850J7358j8106l988J5399p856l9378
$$ 63388 55917 40626 17082 -439 16318 43168 60526 42420 38432 53831 45975 6597
8627F597k8579j164P09M0223j2012P51j0936J0810K536Q735O794k8235k1932J9085
$$ 6597 -21982 -23146 -22437 17786 5774 6525 -4411 6399 8935 17670 24464 -3771 -25703 -6618
8613f618K2599M009j4750K2583L7808J6007M294j9228P813j3218K6732l572j0256
$$ -6618 15981 19990 5240 27823 65631 81638 85932 66704 74517 61299 88031 84459 74203
8600G4203j9643j9296J9618K9995J4156l8060k6733l5335P169J8718k0658L1378
$$ 74203 54560 35264 54882 84877 99033 60973 34240 -1095 6074 24792 4134 35512
8588C5512M1756K7379k1925j9922j8764j1124K7552L4028l299m3395l302J5253
$$ 35512 77268 104647 82722 62800 44036 32912 60464 94492 91193 47798 44496 59749
8576E9749j7976j5971k1002m720K0367O983k1625J8184P163p940J6467R234P687
$$ 59749 41773 25802 4800 80 20447 27430 5805 23989 31152 23212 39679 48913 56600
8563E6600j8557j2671J6655O461j5962N035n545N09K4868j7896j4903M6478R847
$$ 56600 38043 25372 42027 48488 32526 37561 32016 32525 57393 39497 24594 71072 80919
8550H0919k304m064k1589k6039O195k1148l238o006k569j4203J935p410k6849
$$ 80919 78615 74551 52962 26923 33118 11970 8732 2726 157 -14046 -12111 -19521 -46370
8537d6370j5851J3718J7448o243J9143n120n197L110L9951J0220j0441J0251j5496
$$ -46370 -62221 -48503 -31055 -37298 -18155 -23275 -28472 -25362 14589 24809 14368 24619 9123
8524I123m6930n040L7202J6774K044J8440K6151j5443k7100R700J7418O310n1395
$$ 9123 -37807 -42847 -5645 11129 13173 31613 57764 42321 15221 24921 42339 48649 -2746
8511b746n4127J215K1128R908N4413J3208M071j8129k1277m5824r88K2021K7693
$$ -2746 -56873 -55658 -34530 -24622 29791 42999 47070 28941 7664 -38160 -39148 -17127 10566
8498A0566j0763M150J9830l887j2807Q367J1123N285M327m452k4289j0252K1475
$$ 10566 -197 3953 23783 19896 7089 15456 26579 31864 36191 31739 7450 -2802 18673
8485A8673J989j6454k1814J9420L0364p670Q425j6647k4124K2854J778Q248r722
$$ 18673 20662 4208 -17606 1814 32178 24508 32933 16286 -7838 15016 16794 25042 15320
8472A5320L3852j691j7668k1317j6511J0540p679k1789j0425k744J1781Q534o563
$$ 15320 49172 47481 29813 8496 -8015 2525 -5154 -26943 -37368 -40112 -28331 -19797 -26360
8459b6360L520K6040R003j1762n458o529j4056K2649K8829k744Q239k2095m0397
$$ -26360 -22840 3200 12203 441 -5017 -11546 -25602 -2953 25876 23132 31371 9276 -31121
8446c1121l8587j1811O0594L6543M9440k1482k7502q170j2222K9163L4357j2116
$$ -31121 -69708 -81519 -20925 15618 65058 43576 16074 7904 -4318 24845 59202 47086
8434D7086J7545P054o011l4097k3675J7010q24j1390J761j1872O162J4399k2819
$$ 47086 64631 71685 65674 31577 7902 24912 24088 12698 14459 2587 8749 23148 329
8421C29J5539K475L0881J0321m8780k7644N900j2490j6605K3681J6062K882J1691
$$ 329 15868 18343 49224 59545 10765 -16879 -10979 -23469 -40074 -16393 -331 2551 14242
8408A4242r462J930n673l2932N155K9809P153J6523j6252r652K7011k2336k2266
$$ 14242 4780 6710 1037 -31895 -26740 3069 10222 26745 10493 841 27852 5516 -16750
8395a6750j467J2401N946p693M142n895K441K1231J7830J7555J4913m0489l1069
$$ -16750 -18217 -5816 130 -7563 -3421 -9316 -6875 14356 32186 49741 64654 24165 -6904
8382f904p650K3121J236k7880k5104K2061k072O609L1259q405m7325J7505Q51
$$ -6904 -14554 8567 9803 -18077 -43181 -21120 -23192 -16583 14676 6271 -41054 -23549 -22698
8369b2698M712K0897N642l507k8863k0976J3782K8613J1946k5249m9N023K9367
$$ -22698 -17986 2911 8553 5046 -23817 -44793 -31011 -2398 9548 -15701 -15750 -10727 18640
8356A8640L8072p348k9244k5075R217L882J713r20j8553m4421K5746N3384J949
$$ 18640 56712 49364 20120 -4955 4262 8144 9857 8937 -9616 -54037 -28291 25093 27042
8343B7042j2764k8331n799J5104n496K25n981j5390L0215K3715k106j5428N101
$$ 27042 14278 -14053 -19852 -4748 -10244 -10019 -16000 -31390 -1175 22540 20434 5006 10107
8330A0107j5239O174j764j5483l9610K197L969J6871J3564J7983Q946K228J7582
$$ 10107 -5132 1042 -722 -16205 -55815 -53618 -49649 -32778 -19214 -1231 7715 9943 27525
8317B7525L0111l631m6768k7233J7398K6014Q334J226J7640p662n0075j3110p243
$$ 27525 57636 54005 7237 -19996 -2598 23416 31750 32976 50616 42954 -7121 -20231 -27474
8304b7474K0599J3680K0474j317j949m2263R921K7518k020J3944p43m1109K8528
$$ -27474 -6875 6805 27279 25962 24013 -18250 -8329 19189 17169 31113 30370 -10739 17789
8291A7789J4922k7461k8133j6742r911J4211K5953J6789n489m82J8463P315R289
$$ 17789 32711 5250 -22883 -39625 -49536 -35325 -9372 7417 1928 1446 19909 27224 36513
8278C6513r790Q575r976l216m5983j4315j04J0681O40M23l0879r584k944J1654
$$ 36513 26723 35298 25322 22106 -23877 -38192 -38296 -27615 -26975 -26552 -57431 -67015 -69959 -58305
8264e8305J8575J9592K9422R76q612J1876J305j7765j8404l1666J2528K3704J7838
$$ -58305 -39730 -20138 9284 10260 1648 13524 14829 -2936 -21340 -53006 -40478 -16774 1064
8251A064M711m6761r17K4058j6575J4433K082j8489j1411K5469K8812l878J7974
$$ 1064 5775 -40986 -41903 -17845 -34420 -19987 -17905 -36394 -47805 -22336 6476 2598 20572
8238B0572L351J107k5956l700J4961p421j4720K1485J9961l3059m2383L475L4389
$$ 20572 23923 25030 -926 -4626 10335 2914 -11806 9679 29640 -3419 -45802 -42327 -7938
8225g938r188k049K999n220K3756J1636j68K0410O1299J3759l8449l3912m5692
$$ -7938 -17126 -19175 -16176 -21396 2360 13996 13828 34238 95537 109296 70847 36935 -8757
8212h757k7060J3463J5080O183j8886P384K3885M805k5775Q013O548k0921j7081
$$ -8757 -35817 -22354 -7274 -1091 -19977 -12593 11292 16097 -9678 -1665 4883 -16038 -33119
8199c3119J1911q561q833j8794n146L4958L3436k2157Q971J7287k4071J8453J3913
$$ -33119 -21208 -29769 -38602 -57396 -62542 -27584 5852 -16305 -7334 9953 -14118 4335 18248
8186A8248J1165L4982r521l4572Q054l360J5193P850l8964J5215j2802n069j632
$$ 18248 29413 64395 54874 20302 28356 24996 40189 48039 9075 24290 11488 6419 4787
8173D787m717j6596j3558j6125L7015K0406j4066O309K3794K7745L5217K4529
$$ 4787 70 -16526 -30084 -46209 -9194 11212 -2854 3455 27249 54994 90211 114740
8161A14740q7863k7699K2924N2729k6363O336J6779J494m8349l4813M377J7946
$$ 114740 26877 -822 22102 74831 48468 54804 71583 73077 24728 -10085 -5708 12238
8149A2238K35J2502q344M528O047j8409l5318k0326O345J0961n402L506k9057
$$ 12238 12473 24975 16631 21159 27206 8797 -26521 -46847 -40502 -29541 -34943 -31437 -60494
8136f0494j9102O4303M3463L7354J1380o1425j9029p840l4005j5112J6929J0519
$$ -60494 -79596 -15293 28170 65524 76904 15479 -3550 -11390 -45395 -60507 -43578 -33059
8124c3059J3087K6581L5274j1344R883k2024k3510L0896p647l3488J4318r703
$$ -33059 -19972 6609 41883 30539 40422 18398 -5112 25784 18137 -15351 -1033 -10736
8112a0736k4942J597q156q128q398J3013J9558l337N694J2958j984P187j2828
$$ -10736 -35678 -34081 -42237 -50365 -58763 -45750 -26192 -29529 -23835 -10877 -12861 -5674 -18502
8099a8502q658j3924J638K1884K6224p445K778Q105k8087l7163M263K7876j5418
$$ -18502 -27160 -41084 -39446 -17562 8662 1217 3995 12100 -15987 -53150 -48887 -21011 -36429
8086c6429j0222N1607L0702M4592j890j9302k0397j605N749j1997j5361j4774
$$ -36429 -46651 4956 35658 80250 78360 59058 38661 37056 42805 30808 15447 673
8074F73L0080N272k2454o939j3314j7315j5364K3828N1327M1692j1737k1065l6566
$$ 673 30753 36025 13571 6632 -6682 -23997 -39361 -15533 35794 77486 65749 44684 8118
8061H118L079K6050l927o343j1710P963j1916j5188r508O979J1159j805R216k2923
$$ 8118 11197 37247 33320 26977 15267 23230 11314 -3874 -13382 -6403 4756 2951 12167 -10756
8047a0756j4498K1251p711K9203r228k7600n181j5454j5673N210L1654K0834P457
$$ -10756 -25254 -4003 -11714 17489 8261 -19339 -24520 -39974 -55647 -50437 -18783 2051 9508
8034I508j2734J0500J5567j2491J6861l2910o569J9468l1018k8540o459J6705
$$ 9508 -3226 7274 22841 10350 27211 -5699 -12268 7200 -23818 -52358 -58817 -42112
8022d2112K6610K0862j95l7629R402R180N58J6676r344O281j986r032L1984j2427
$$ -42112 -15502 5360 5165 -32464 -23062 -13882 -13324 3352 -5992 289 -1697 -10729 21255 8828
8008H828m0778L7873Q531k8937j5715k6369p584m398J5084J909K1812Q167o210
$$ 8828 -31950 5923 14454 -14483 -30198 -56567 -64151 -68549 -53465 -51556 -29744 -21577 -27787
7995b7787J7582L0870K5742j1596l9167p524K4336J4757n659k5708J6199K8668
$$ -27787 -10205 20665 46407 34811 -4356 -11880 12456 27213 21554 -4154 12045 40713
7983D0713k952j726J2476L182k8140j9750K2997K5574j5468k1973J7498J702j6362
$$ 40713 37761 36035 48511 51693 23553 3803 26800 52374 36906 14933 32431 34133 17771
7970A7771m24m4520k4280K8528J4978R765j9799q654K6849K4226Q343j0379m853
$$ 17771 17347 -27173 -51453 -22925 -7947 1818 -17981 -26635 214 24440 32783 22404 17551
7957A7551R027j0956l4135l2313J9717L9134n373l4373m476K8080J617J8733j3504
$$ 17551 26578 15622 -18513 -50826 -31109 8025 2652 -31721 -36197 -8117 -6500 12233 -1271
7944a271K1201o062k3819l3373N609L6570p636j1364O2179M170l4203p444J9971
$$ -1271 19930 13868 -9951 -43324 -37715 -1145 -8781 -20145 42034 46204 12001 4557 24528
7931B4528K3131m440l2532k889K454O439l6322J7840K5493o511q736k30J0134
$$ 24528 47659 43219 10687 7798 10252 16691 -19631 -1791 23702 17191 8455 8225 18359
7918A8359j5502j0522n068n126j2368K9742M3706j3894j5429j1056R442P124K498
$$ 18359 2857 -7665 -12733 -17859 -30227 -485 43221 29327 13898 2842 12284 19408 21906
7905B1906j5770l0411O873r552j4760M2107K3057J9337l238m7866l479O277l771
$$ 21906 6136 -24275 -17402 -26954 -41714 393 23450 42787 39549 -8317 -11796 -5519 -9290
7892i290K3611o654J049p043j2247j9256R594N2930N539m6683q212M177r658J924
$$ -9290 14321 7667 8716 1673 -10574 -29830 -20236 32694 38233 -8450 -16662 -12485 -22143 -20219
7878b0219M1329L2343m586l6024k5933O693N698J3662k2383l2780P828L1305N0496
$$ -20219 21110 53453 48867 12843 -13090 -6397 -699 12963 -9420 -42200 -34372 -3067 47429
7865D7429L6444l4856p9733l5055N4090L3859J9400R851o065l2199k1730j742
$$ 47429 83873 49017 -30716 -65771 -11681 22178 41578 51429 45364 13165 -8565 -10307
7853a0307P613J2034O875J0300l2106q542q507L3810J7512J1157l2338M888P027
$$ -10307 -2694 9340 16215 26515 -5591 -14133 -22640 11170 28682 39839 7501 12389 19416
7840A9416m2182j6405L7103K3865m526k1321M817l943N4554j9595l4309j4308
$$ 19416 -22766 -39171 -2068 21797 17271 -4050 767 -3176 51378 31783 -2526 -16834
7828a6834l5860J1476K6306L9423R949j0634K6574M385L360n210j5575l0065J5843
$$ -16834 -52694 -41218 -14912 24511 34460 23826 50400 54785 58145 52935 37360 7295 23138
7815B3138m5975k5624K8548r83K5890n085k2482j9945j7807K0823M4068L3812
$$ 23138 -22837 -48461 -19913 -20896 4994 -91 -22573 -42518 -60325 -39502 4566 38378
7803C8378r352k5385N110j7355l8308J7292K6479J9058j9331j5585L6360j911
$$ 38378 29026 3641 8751 -8604 -46912 -29620 -3141 15917 -3414 -18999 17361 15450
7791A5450J3246L1160j1645K7712N373j6488o5289n2413r613P098K2997J2246
$$ 15450 28696 59856 48211 75923 81296 64808 -481 -52894 -62507 -55409 -32412 -20166
7779b0166l909k5964K0714L6613J8233j4455O50J1902K208l5702j1931j1665L0434
$$ -20166 -24075 -50039 -29325 7288 25521 11066 11716 23618 25826 -9876 -21807 -33472 -3038
7766c038K8176k4352m532j3340K283L740J5701K7434q277k7124j1363o582N119
$$ -3038 25138 786 -3746 -17086 -14803 -11063 4638 32072 23795 -3329 -14692 -21274 -16155
7753a6155j0181J0172n025q402j5721p63J7802j5100j2549k304J0774K7823L4120
$$ -16155 -26336 -16164 -21189 -29591 -45312 -46075 -28273 -43373 -55922 -58226 -47452 -19629 14491
7740A4491k6558l3022J0425N276R524L8440K846k3417j3332j0163j6728L0742
$$ 14491 -12067 -45089 -34664 -29388 -19864 18576 21422 -1995 -15327 -25490 -42218 -11476
7728a1476K7650M294j6316p428N268l134k748k8161K3662K682K0085l8247l2320
$$ -11476 16174 20468 4152 -3276 1992 -1142 -3890 -32051 -8389 -5707 14378 -23869 -56189
7715e6189J9917K7643j402j7328k469N498p188J1586J8111n247k0103o144J7639
$$ -56189 -36272 -8629 -10031 -27359 -29828 -24330 -31518 -19932 -1821 -7068 -27171 -33315 -15676
7702a5676O23j4755J3500k8467l3819L2367M3311j653l7941O502K3796j9708j5478
$$ -15676 -15053 -29808 -16308 -44775 -78594 -46227 -2916 -4569 -42510 -36008 -12212 -31920 -47398
7689d7398N1868K2806k7305k4302K0242K0030N913m194j5694J2415j1150j5476
$$ -47398 4470 27276 -29 -24331 -4089 15941 21854 17660 1966 14381 3231 -12245
7677a2245N4520N0694j4367l074k1820j3835j7178Q722M540J482k2097J5206K8572
$$ -12245 42275 92969 78602 75528 53708 39873 22695 31417 35957 37439 15342 30548 59120
7664E9120p080m2170J8212J1475k2044m576k2406M3582M0230k2149l3150j1266
$$ 59120 52040 9870 28082 39557 17513 12937 -9469 34113 74343 52194 19044 7778
7652G778n719J37K9066K5843j4788j0687N566M559M292J0265l7289l7443j892
$$ 7778 2059 2196 31262 57105 42317 31630 37196 41755 46047 56312 19023 -18420 -20312
7639b0312K9061K7899k6180L41N913j2097p160p612k2936K3218K2402K4306q351
$$ -20312 8749 36648 10468 10809 16722 4625 -2535 -10147 -33083 -9865 12537 36843 28492
7626B8492j0399m0706j4639J2042L2607P272k9275R829N320K228J2692j352k0217
$$ 28492 18093 -22613 -37252 -25210 7397 14669 -14606 -4777 543 2771 15463 14111 -6106
7613f106J4126J4684j2913l2093q572K3472L0350k0259J7619O440k2204L701j3744
$$ -6106 8020 22704 9791 -22302 -30874 -7402 22948 2689 20308 26748 4544 8245 -5499
7600e499J123J7677q049l3878J2311K3601j0082j7200K2595K8466J6187k3342
$$ -5499 -4376 13301 5252 -28626 -16315 7286 -2796 -19996 2599 31065 47252 23910
7588B3910K647Q233k913j9031k7993k1829M4508j4006r057L4132j053R149l1939
$$ 23910 26557 34790 31877 12846 -15147 -36976 7532 -6474 -15531 18601 17548 26697 -5242
7575e242m3354j3637J097N0567j051M406J2026K5336K0776K88k2212j4780Q678
$$ -5242 -48596 -62233 -61136 -10569 -11620 -7214 4812 30148 50924 51212 29000 14220 22898
7562B2898p363l4025P143n047K8737J0058L702R698j8238k8880k5002j648L6528
$$ 22898 15535 -18490 -11347 -16394 12343 22401 26103 35801 17563 -11317 -36319 -37967 -1439
7549a439K6957j6522m926J356L4378m769J5234J1069l1284l9549K7524J4745m2289
$$ -1439 25518 8996 4070 5426 39804 35035 50269 61338 30054 -9495 18029 32774 -9515
7536i515l8797J1522J6803Q090j8981J3070P722q027J3647R179j4137J9352Q212
$$ -9515 -48312 -36790 -19987 -11897 -30878 -17808 -10086 -18113 -4466 4713 -9424 9928 18140
7523A8140K557j6636k4660k2614o003J3164J4658j4035O059J6904J1584L1806
$$ 18140 20697 4061 -20599 -43213 -49216 -36052 -21394 -35429 -29370 -12466 -882 30924
7511C0924J0897j8627j8158l4656N891K873O287m490K64q461m398N484K6535n717
$$ 30924 41821 23194 5036 -29620 -23729 -20856 -14569 -19059 -18795 -27256 -31654 -26170 365 -5352
7497e352o203j7338l4659K5794N1638J6434m2009M077j5287R177P074K7793l584
$$ -5352 -11555 -28893 -63552 -37758 13880 30314 -11695 -7618 -22905 -13728 -6654 21139 17555
7484A7555R730J1785l8728m2115j6250L0904J8391J3547J0347J3338Q827J0584
$$ 17555 27285 39070 342 -41773 -58023 -27119 -8728 4819 15166 28504 37331 47915
7472D7915Q381j3321k1470k7879o952k8180j6167J8610K4566N4750J8933j9811
$$ 47915 56296 42975 21505 -6374 -13326 -41506 -57673 -39063 -14497 40253 59186 39375
7460C9375j7889l5703m181k559o130l213q699L445k9990j5995J4314M2704J1442
$$ 39375 21486 -14217 -18398 -20957 -27087 -30300 -38999 -35554 -65544 -81539 -67225 -24521 -13079
7447a3079m804j3261K3735L733J4834P318J8845j682j2271k5285k3472j1184K0509
$$ -13079 -17883 -31144 -7409 -3676 11158 18476 37321 35639 23368 -1917 -25389 -36573 -16064
7434a6064L6652M626J5160j9382k9005J7850j8387n2176j7732J2380P785J7323
$$ -16064 20588 25214 40374 20992 -8013 9837 -8550 -60726 -78458 -66078 -58293 -40970
7422d0970J9387j8690o351J8819K7127J6681l5293J740K6070J5459J96K5814J3027
$$ -40970 -21583 -40273 -46624 -27805 -678 16003 -19290 -17550 8520 23979 24175 49989 63016
7409F3016j6096j4210P656k0314m6864l2653j045J9898P584j0297Q472K9344k44
$$ 63016 46920 32710 40366 20052 -26812 -59465 -60510 -40612 -33028 -43325 -34853 -5509 -5753
7396e753k2105J0250K1776J5988L5683q994k5079j95L112K3634j9956n739j9167
$$ -5753 -27858 -17608 4168 20156 55839 46845 21766 21571 24683 48317 28361 22622 3455
7383C455O515Q455n728j8654J4522P84j2547L6476J697k0763j4241K06J7453l1352
$$ 3455 9970 18425 12697 -5957 8565 9349 -3198 33278 34975 14212 -29 177 17630 -13722
7369a3722N24L8344j4910k223j1982j1600q077J957o07l6919j4248Q327J6961
$$ -13722 -13198 25146 10236 8013 -3969 -15569 -23646 -21689 -22296 -59215 -73463 -65136 -48175
7356d8175J1432J4222M78j7563P865M063j6626J9460m722L354r914J0931K4113
$$ -48175 -36743 -22521 -22043 -39606 -31741 -27678 -44304 -24844 -29566 -26212 -36126 -25195 -1082
7343a082M3177l1825m0761K551q716K1167l561K6171j6456J5961j0514r127j9452
$$ -1082 42095 10270 -30491 -27940 -36656 -15489 -19050 7121 -9335 6626 -3888 -13015 -32467
7330c2467Q181L6860j4325n246O051k145J4677k1357k0877K712J1965J2569P766
$$ -32467 -24286 12574 -1751 -6997 -946 -3091 11586 -9771 -30648 -27936 -15971 -3402 4364
7317D364k171K7448K4622l1732l2415m844k70j2241r771L621L278k2766k4116
$$ 4364 2193 29641 54263 22531 -9884 -14728 -14998 -27239 -37010 -33389 -30111 -52877 -76993
7304g6993j3599j3159K3475L6803L9870Q403j6546K7436J797j5169l5034O096
$$ -76993 -90592 -103751 -80276 -43473 -3603 4800 -11746 15690 17487 2318 -32716 -26620
7292b6620q615k5934J3214M5706M514l1952j1945j0282O368K5835n011l4555j4837
$$ -26620 -35235 -61169 -47955 -2249 2265 -29687 -41632 -51914 -45546 -19711 -24722 -59277 -74114
7279g4114M6618L3438J1262m413m1895m700N3161r561l7638R69J2446p352k2009
$$ -74114 -27496 5942 17204 12791 -29104 -33804 19357 9796 -27842 -26873 -14427 -21779 -43788
7266d3788Q734j0669K1473K3561j5678L1756K064Q559j3872j9112K2146m8001
$$ -43788 -35054 -45723 -24250 -689 -16367 15389 17453 26012 12140 -6972 15174 -32827
7254c2827l2122o606N4981J2164l4495k2031O411L4950J6624r750R975J5711m42
$$ -32827 -64949 -71555 -16574 -4410 -38905 -60936 -54525 -19575 -2951 -12701 -2726 12985 12543
7241A2543j5678k8742l9424m403Q060K0049K3850J1823j4656P787J4057L388M330
$$ 12543 -3135 -31877 -71301 -75704 -67644 -47595 -23745 -11922 -26578 -18791 -4734 -1346 2984
7228B984J6922o768J0564J070k5392J5002K6509k4749r767l2561L826R531m4408
$$ 2984 19906 13138 23702 24772 -620 14382 40891 16142 6375 -26186 -22360 -12829 -57237
7215e7237K4158N2680j6982J39J4991k832P890l646K711j0031k9913j3517m114
$$ -57237 -33079 19601 2619 2758 17749 14917 22807 19161 21872 11841 -18072 -31589 -35703
7202c5703j0077j3839J6959k1459R879K9175K4284l0063o159M231j3053P327L4842
$$ -35703 -45780 -59619 -42660 -64119 -54240 -25065 -781 -30844 -37003 -32772 -45825 -38498 -3656
7189c656j4397K950M4690J1047j836Q656K0432m2484j6555l3423n412n197J3867
$$ -3656 -18053 -15103 29587 40634 38798 47454 67886 25402 8847 -24576 -29988 -35185 -21318
7176b1318K5396p335k001j3691k0174k949M0919Q22k4169r459K4976J8206k2791
$$ -21318 4078 -3257 -5258 -18949 -39123 -42072 -1153 -331 -24500 -33959 -8983 9223 -13568
7163a3568K5931P476k4356j325O365J8154L9996J5977J0762J566m0383j7910J2984
$$ -13568 12363 19839 -4517 -5842 523 18677 58673 74650 85412 86978 46595 28685 41669
7150D1669N223k2603r185K2006N122o796q022K9294j9592J536k26k9840k193M395
$$ 41669 46892 24289 15104 37110 42232 35436 27414 56708 37116 38652 38426 8586 6393 10788
7136A0788j3432l6891K3323K5216l0166k212P397N369o379K958o020j0647O045
$$ 10788 -2644 -39535 -16212 9004 -21162 -23374 -15977 -10608 -16987 -14029 -20049 -30696 -24651
7123b4651M1815K3114K5195k1440k3905J711K7868k7517L121j6869n012J2462
$$ -24651 17164 40278 65473 44033 20128 21839 49707 22190 25311 8442 3430 15892
7111A5892n2790r344K0804J1780J7652N1585m547m0596k268k6037k081J8936K9025
$$ 15892 -36898 -46242 -25438 -13658 3994 55579 51032 10436 8168 -17869 -19950 -1014 28011
7098B8011L933O880m8089l2694m971K1611M3970J3796k6162j2558j307M7086J1640
$$ 28011 31944 38824 -9265 -41959 -46930 -25319 18651 32447 6285 -6273 -7580 39506 51146
7085E1146J4326k2809J6606r068j0280j0266J2665j2084m2018J6411J2173j9390
$$ 51146 65472 42663 59269 50201 39921 29655 42320 30236 -11782 4629 16802 -2588
7073b588r549m2058L1156K0940K7664Q216k674j1748j0631Q178l9709n7025j459
$$ -2588 -12137 -54195 -23039 -2099 25565 33781 31107 19359 8728 16906 -22803 -79828 -81287
7060h1287R196J6118J3201J0341Q708O320J632r238m9839o01K6971L8118L2479
$$ -81287 -72091 -55973 -42772 -32431 -23723 -17403 -15771 -25009 -74848 -75449 -48478 -10360 22119
7047B2119J3489K7965m479k2243k2354j5641l8533j0651n720l227J9806J8649
$$ 22119 35608 63573 59094 36851 14497 -1144 -39677 -50328 -56048 -59275 -39469 -20820
7035b0820k1256k7259K9783J5769N045J3323O232J8127M53j1617K610J4296N100
$$ -20820 -42076 -69335 -39552 -23783 -18738 -5415 817 18944 19397 7780 10390 24686 29786
7022B9786J8109q175j2246r769m5362l2412j5066M3551O0529R287l9260k7840
$$ 29786 47895 39720 27474 17705 -27657 -60069 -75135 -31584 28945 38232 -1028 -28868
7010b8868k4654m0575O07K3309K0069K5591k0103j5769q810L3554J3902j2741
$$ -28868 -53522 -94097 -93490 -70181 -50112 -24521 -44624 -60393 -69203 -35649 -21747 -34488
6998c4488l834K2687K0347j1276l8538J8250P975K2830j154J7912k415j6009J2994
$$ -34488 -38322 -15635 4712 -6564 -45102 -26852 -18877 3953 2799 20711 18296 2287 15281
6985A5281K9980J7292l4261n0648n15J8386N569L3477J1134l7587k7016l7298
$$ 15281 45261 62553 28292 -22356 -22871 -4485 1084 34561 45695 8108 -18908 -56206
6973e6206J4538M6200m7683l6836N4126O2771K2643K4156n0664l3124j2844j8116
$$ -56206 -41668 4532 -43151 -79987 -25861 36910 59553 83709 33045 -79 -12923 -31039
6961c1039K71j600r265K0066K1606k977j2427J090k2534m9832L668K1549J7143
$$ -31039 -30768 -32368 -41633 -21567 39 -2938 -15365 -14275 -36809 -86641 -82973 -61424 -44281
6948d4281L0743Q752j5395l0240j0826L1146j0799k286J5828K0338o208L483p385
$$ -44281 -13538 -4786 -20181 -50421 -61247 -30101 -40900 -43186 -27358 -7020 -13228 -9745 -17130
6935a7130o358j6864Q574K4281J2271j7951N217j7280K6824K9254k304j4763j3857
$$ -17130 -23488 -40352 -31778 -7497 4774 -13177 -7960 -25240 1584 30838 28534 13771 -86
6922h6l6375j3479J4756R358J6830J2723L477R013M521J0000K7291m20m4127k1778
$$ -86 -36461 -49940 -35184 -25826 -8996 3727 7204 16217 20738 30738 58029 57609 13482 -8296
6908h296j9473M177K6798L899k50L940k1995m1075P727L0222j477m181j5629J0453
$$ -8296 -27769 -23592 3206 7105 6855 10795 -11200 -52275 -44548 -14326 -15803 -19984 -35613 -25160
6894b5160J7609J7400l0260k213K7820l076J5258J073k4470k2916K441Q944j400
$$ -25160 -7551 9849 -20411 -22624 5196 2120 17378 18451 -6019 -28935 -26494 -17550 -18950
6881a8950K5859L9915P642l1819m9494q952L3986M225J1517J3680j1319N607m960
$$ -18950 6909 46824 54466 22647 -26847 -35799 -1813 2412 13929 27609 16290 21897 16937
6868A6937l6912l004K0175j8838J0373J3830J5191J43m3293J7818k2195k1513
$$ 16937 -19975 -22979 -2804 -21642 -11269 2561 17752 17895 -25398 -7580 -29775 -51288
6856e1288n98K5042J1148m14n158J8332K5819J517m409l2849k4739j598p166m496
$$ -51288 -51886 -26844 -15696 -16110 -21268 -2936 22883 24400 19991 -12858 -37597 -39195 -46361 -50857
6842e0857j777l81J9672J4132L2738L099k8411J32k588k4206J255L1835l67N468
$$ -50857 -52634 -53015 -33343 -19211 13527 16626 -11785 -11653 -14241 -38447 -37192 -5357 -5724 -256
6828b56K5929Q994j8334j6381l1972r577L2500O742R658k4991k5937J9803O2538
$$ -256 25673 34667 16333 -48 -32020 -41597 -9097 -2355 7303 -17688 -43625 -23822 38716
6815C8716K1160j2998K8344J1117q710l0694l7883k9289j4231J9421K3857L8726
$$ 38716 59876 46878 75222 86339 77629 46935 9052 -20237 -34468 -15047 8810 47536
6803D7536m9819m0383K1180p362k926N1737r394j6777k102m000K8459J8153kp706
$$ 47536 -2283 -42666 -21486 -28848 -31774 19963 10569 -6208 -8310 -12310 16149 34302 34300 26594
6789B6594K3022l491k3627M439j9052k2935J0369j6272J2199R316K879K0037j5609
$$ 26594 49616 46125 22498 26937 7885 -15050 -4681 -20953 -8754 562 3441 23478 7869
6776G869l491L004k1469J267j2636l3587k7905k9835K0108J6781M2346j6216K9644
$$ 7869 4378 7382 -14087 -12820 -25456 -59043 -86948 -116783 -96675 -79894 -37548 -53764 -24120
6763b4120L1782k4540j4427J0722L5209M899J8722P336m4289k1419n392J0894
$$ -24120 7662 -16878 -31305 -20583 14626 19525 38247 45583 1294 -20125 -25517 -14623
6751a4623j5812M2107L9233m870j2781P253k4206l984L360m003J9165j494K6525
$$ -14623 -30435 11672 50905 46035 33254 40507 16301 12317 15677 11674 30839 29345 55870
6738E5870J5236J8088m506l8051m6541J6249J0515j5299J2662j1722j796p160
$$ 55870 71106 89194 84688 46637 96 16345 26860 11561 24223 12501 10705 3545
6726C545k7087n0280j6433l113J8058K9894O1704K8035r841N854j2932J1128j3441
$$ 3545 -23542 -73822 -90255 -93368 -75310 -45416 16288 44323 34482 40336 27404 38532 25091
6713B5091J5820M8621J9961K959l5503k0688r833k3919k422P563J7158l018m3246
$$ 25091 40911 89532 109493 112452 76949 56261 46428 22509 20087 27650 44808 41790 -1456
6700a456J9344J1753l634k708K5799j5326L050K174k725l4848j0741P506Q726
$$ -1456 17888 29641 26007 23299 49098 33772 36822 38996 36271 1423 -9318 -1812 6914
6687F914j198j1696o235J0864K8588J0953k2941j0170J8195l7796k0906K250K1148
$$ 6914 5716 -5980 -12215 -1351 27237 38190 15249 5079 23274 -14522 -35428 -33178 -12030
6674a2030J6417j0757j684M8496P497k9504m133p777j3317j0859j5834J3492K9270
$$ -12030 4387 -6370 -8054 40442 47939 18435 14302 6525 -6792 -17651 -33485 -19993 9277
6661I277O202j9124K350M1256J2370l3514j7897j6628j3402K929J2700j9950n595
$$ 9277 15479 -3645 -1295 39961 52331 18817 920 -15708 -29110 -26181 -13481 -33431 -39026
6648c9026K358j3162j792P797P796J6501J3470p62j95l1831j1300K2190K2258
$$ -39026 -36668 -49830 -51622 -43825 -36029 -19528 -6058 -6820 -7015 -38846 -50146 -27956 -5698
6635e698J6520n697N0017K6031n6993n7147m739K1646K8360J6541J1147k8235
$$ -5698 10822 5125 55142 81173 24180 -32967 -37706 -16060 12300 28841 39988 11753
6623A1753k5782K511J079J743q569L1289J6928j369j1852o290k4940j5529l0963
$$ 11753 -14029 -11518 -10439 -8696 -17265 14024 30952 29583 17731 11441 -13499 -29028 -59991
6610e9991K4919N4092J522j6348j0831J0383j740J9181L7480L8371k8893k6920
$$ -59991 -35072 19020 20542 4194 -6637 3746 2006 21187 58667 97038 68145 41225
6598D1225n7823m4621l6793J3118O061j1353K7628J4954k0582l858Q954J7011
$$ 41225 -16598 -61219 -98012 -84894 -78833 -90186 -62558 -47604 -68186 -72044 -63090 -46079
6586d6079M2454m174o441Q188m663J4359j1701j9713k129J6940l259L3298l8331
$$ -46079 -3625 -7799 -14240 -6052 -10715 3644 -8057 -27770 -29899 -12959 -16218 17080 -21251
$$ [...]
##END NTUPLES=NMR SPECTRUM
##END=
