##TITLE=Analysis number 319487
Compound Code cc 03846
Book Reference 469/128
Project Code adrs
Chemist Name  davec
##JCAMPDX= 6.0         $$ Bruker NMR JCAMP-DX V2.0
##DATA TYPE= NMR SPECTRUM
##DATA CLASS= NTUPLES
##ORIGIN= Bruker BioSpin GmbH
##OWNER= nmr
$$ XWIN-NMR		Version 3.5
$$ Wed May 17 09:06:54 2006 GMT Daylight Time (UT+1h)  MAYBRIDGE\nmr@NMR_250MHZ
##.OBSERVE FREQUENCY= 250.131544655141
##.OBSERVE NUCLEUS= ^1H
##.ACQUISITION MODE= SIMULTANEOUS (DQD)
##.ACQUISITION SCHEME= undefined
##.AVERAGES= 16
##.DIGITISER RES= 18
##SPECTROMETER/DATA SYSTEM= dpx250
##.PULSE SEQUENCE= zg30
##.SOLVENT NAME= CDCl3
##.SHIFT REFERENCE= (INTERNAL, CDCl3, 0, 16.4558)
##AUDIT TRAIL= $$ (NUMBER, WHEN, WHO, WHERE, WHAT)
$$ ##TITLE= Audit trail, XWIN-NMR		Version 3.5
$$ ##JCAMPDX= 5.01
$$ ##ORIGIN= Bruker BioSpin GmbH
$$ ##OWNER= nmr
$$ C:\u/data/dgb/nmr/ADRS/4520/pdata/1/auditp.txt
$$ ##AUDIT TRAIL=  $$ (NUMBER, WHEN, WHO, WHERE, WHAT)
(   1,<2006-05-17 09:06:33.50 +100>,<MAYBRIDGE\nmr>,<NMR_250MHZ>,
      <created by zg, POWCHK disabled, PULCHK disabled
       configuration hash MD5:
       84 BC 41 DB A1 6E 1D 46 DA 25 12 A5 C1 ED C5 3A
       data hash MD5: 64K
       08 20 46 D6 AA 0D 42 AF 65 23 D2 B0 F9 E4 3F 02>)
(   2,<2006-05-17 09:06:45.28 +100>,<MAYBRIDGE\nmr>,<NMR_250MHZ>,
      <Start of raw data processing
       ef LB = 0.3 FT_mod = 6 PKNL = 1 SI = 32K 
       data hash MD5: 32K
       59 FD A0 FE AC 9E 68 9E 36 58 51 23 62 0B DA 0D>)
(   3,<2006-05-17 09:06:46.95 +100>,<MAYBRIDGE\nmr>,<NMR_250MHZ>,
      <apk 
       data hash MD5: 32K
       07 9B 26 96 C7 71 9D 7B 99 A5 8D 2D 6C 5E 80 BC>)
(   4,<2006-05-17 09:06:47.70 +100>,<MAYBRIDGE\nmr>,<NMR_250MHZ>,
      <abs ABSG = 5 
       data hash MD5: 32K
       56 F3 EF 27 34 7A F3 22 43 7E FC F0 F4 A2 02 3F>)
$$ ##END=
$$ 
$$ hash MD5
$$ D8 38 7E F2 2D D8 C6 E1 07 17 9F DB C9 A1 D8 A1
##$RELAX= 
##$RELAX= 
##$RELAX= 
##$RELAX= 
##$RELAX= 
##$RELAX= 
##$RELAX= 
$$ Bruker specific parameters
$$ --------------------------
##$DU= <C:\u>
##$EXPNO= 4520
##$NAME= <ADRS>
##$PROCNO= 1
##$TYPE= <nmr>
##$USER= <dgb>
##$AMP= (0..31)
100 100 100 100 100 100 100 100 100 100 100 100 100 100 100 100 100 100 
100 100 100 100 100 100 100 100 100 100 100 100 100 100 
##$AQSEQ= 0
##$AQ_mod= 3
##$AUNM= <au_zg>
##$AUTOPOS= <3 >
##$BF1= 250.13
##$BF2= 250.13
##$BF3= 250.13
##$BF4= 250.13
##$BF5= 500.13
##$BF6= 500.13
##$BF7= 500.13
##$BF8= 500.13
##$BYTORDA= 1
##$CFDGTYP= 0
##$CFRGTYP= 5
##$CHEMSTR= <none>
##$CNST= (0..31)
1 1 145 1 1 1 1 1 1 1 1 1 1 1 1 1 1 1 1 1 1 1 1 1 1 1 1 1 1 1 1 1 
##$CPDPRG= <>
##$CPDPRG1= <>
##$CPDPRG2= <>
##$CPDPRG3= <>
##$CPDPRG4= <mlev>
##$CPDPRG5= <mlev>
##$CPDPRG6= <mlev>
##$CPDPRG7= <mlev>
##$CPDPRG8= <mlev>
##$CPDPRGB= <>
##$CPDPRGT= <>
##$D= (0..31)
0 1 0 0 0 0 0 0 0 0.06 0 0 0 0 0 0 0.0002 0 0 0 0 0 0 0 0 0 0 0 0 0 0 
0 
##$DATE= 1147853192
##$DBL= (0..7)
120 120 120 120 120 120 120 120 
##$DBP= (0..7)
150 150 150 150 150 150 150 150 
##$DBP07= 0
##$DBPNAM0= <>
##$DBPNAM1= <>
$$ [...]
##$SUBNAM7= <"">
##$SUBNAM8= <"">
##$SUBNAM9= <"">
##$SW= 20.6930455092707
##$SWIBOX= (0..15)
0 0 3 0 0 0 0 0 0 0 0 0 0 0 0 0 
##$SW_h= 5175.983436853
##$TD= 65536
##$TD0= 1
##$TE= 295.16
##$TE2= 300
##$TE3= 300
##$TEG= 300
##$TL= (0..7)
0 120 120 120 120 120 120 120 
##$TP= (0..7)
150 150 150 150 150 150 150 150 
##$TP07= 0
##$TPNAME0= <>
##$TPNAME1= <>
##$TPNAME2= <>
##$TPNAME3= <>
##$TPNAME4= <>
##$TPNAME5= <>
##$TPNAME6= <>
##$TPNAME7= <>
##$TPOAL= (0..7)
0.5 0.5 0.5 0.5 0.5 0.5 0.5 0.5 
##$TPOFFS= (0..7)
0 0 0 0 0 0 0 0 
##$TUNHIN= 0
##$TUNHOUT= 0
##$TUNXOUT= 0
##$USERA1= <user>
##$USERA2= <user>
##$USERA3= <user>
##$USERA4= <user>
##$USERA5= <user>
##$V9= 5
##$VALIST= <valist>
##$VCLIST= <CCCCCCCCCCCCCCC>
##$VD= 0
##$VDLIST= <DDDDDDDDDDDDDDD>
##$VPLIST= <PPPPPPPPPPPPPPP>
##$VTLIST= <TTTTTTTTTTTTTTT>
##$WBST= 1024
##$WBSW= 4
##$XGAIN= (0..3)
0 0 0 0 
##$XL= 0
##$YL= 0
##$YMAX_a= 500181
##$YMIN_a= -697159
##$ZGOPTNS= <>
##$ZL1= 120
##$ZL2= 120
##$ZL3= 120
##$ZL4= 120
##$ABSF1= 16.45583
##$ABSF2= -4.237343
##$ABSG= 5
##$ABSL= 3
##$ALPHA= 0
##$AQORDER= 0
##$ASSFAC= 0
##$ASSFACI= 0
##$ASSFACX= 0
##$ASSWID= 0
##$AUNMP= <proc_1d>
##$AZFE= 0.1
##$AZFW= 0.1
##$BCFW= 0
##$BC_mod= 0
##$BYTORDP= 0
##$COROFFS= 0
##$CY= 12.5
##$DATMOD= 1
##$DC= 0
##$DFILT= <>
##$DTYPP= 0
##$F1P= 14.0000005364418
##$F2P= -0.99999901652339
##$FCOR= 0.5
##$FTSIZE= 32768
##$FT_mod= 6
##$GAMMA= 0
##$GB= 0
##$INTBC= 1
##$INTSCL= 1
##$ISEN= 128
##$LB= 0.3
##$LEV0= 0
##$LPBIN= 0
##$MAXI= 10000
##$MC2= 0
##$MEAN= 0
##$ME_mod= 0
##$MI= 0
##$NCOEF= 0
##$NC_proc= -3
##$NLEV= 6
##$NOISF1= 0
##$NOISF2= 0
##$NSP= 0
##$NTH_PI= 0
##$NZP= 0
##$OFFSET= 16.45583
##$PC= 1
##$PHC0= 165.479
##$PHC1= 5.705851
##$PH_mod= 1
##$PKNL= yes
##$PPARMOD= 0
##$PSCAL= 4
##$PSIGN= 0
##$REVERSE= no
##$SF= 250.130016548659
##$SI= 32768
##$SIGF1= 0
##$SIGF2= 0
##$SINO= 400
##$SIOLD= 32768
##$SREGLST= <1H.CDCl3>
##$SSB= 0
##$STSI= 32768
##$STSR= 0
##$SW_p= 5175.98343685301
##$SYMM= 0
##$S_DEV= 0
##$TDeff= 65536
##$TDoff= 0
##$TI= <Analysis number 999999
Compound Code 99
Book Reference 9
Project Code 9>
##$TILT= no
##$TM1= 0
##$TM2= 0
##$TOPLEV= 0
##$USERP1= <user>
##$USERP2= <user>
##$USERP3= <user>
##$USERP4= <user>
##$USERP5= <user>
##$WDW= 1
##$XDIM= 32768
##$YMAX_p= 462350705
##$YMIN_p= -72151
$$ End of Bruker specific parameters
$$ ---------------------------------
##NTUPLES= NMR SPECTRUM
##VAR_NAME=  FREQUENCY,     SPECTRUM/REAL,   SPECTRUM/IMAG
##SYMBOL=    X,             R,               I
##VAR_TYPE=  INDEPENDENT,   DEPENDENT,       DEPENDENT
##VAR_FORM=  AFFN,          ASDF,            ASDF
##VAR_DIM=   32768,         32768,           32768
##UNITS=     HZ,            ARBITRARY UNITS, ARBITRARY UNITS
##FACTOR=    0.157963299565203, 1,           1
##FIRST=     4116.09693526289, 0,            0
##LAST=      -1059.88650159012, 0,           0
##MIN=       -1059.88650159012, -72151,      0
##MAX=       4116.09693526289, 462350705,    0
$$ Real data points
##PAGE= N=1
##DATA TABLE= (X++(R..R)), XYDATA
$$ [...]
18667C10352j8113l73p703O416O206J0506R09m474J846j29J6968P569j104J666
18653C30542n612j2614L186L0906K6082K5327J7512j1355l1564k7380j1119k3578
18641C10333l2041j9044j7987j4540k708j6850k553P356k17j1099k939J765K682
18628B02158p93r099j1164L285J9181K578j1448p076J3679K7233J9820K0582K4397
18615B93333l257L336J030P075J6941J8708R197J1156K0183K4577J2773k867q63
18602D11322j8303k4393l5051j3888K571L240J124o846l6553m5513j7577p175
18590B12958n794K944N48Q86O15j579n801m261q953q579J1644O734J0334J0708
18576B22404Q479J4042J7314J7204Q168p163j4490o505j0253J5301K8063K9069
$$ plain form
18667 310352 292239 291866 284163 290579 296785 307291 308200 303726 305572 305443 322411 329980 328876 330542
18653 330542 324930 312316 315502 346408 372490 397817 415329 403974 372410 345030 333911 310333
18641 310333 278292 259248 241261 226721 224013 207163 204610 211966 211749 200650 197711 199476 202158
18628 202158 201365 192266 181102 184387 203568 206146 194698 187622 201301 228534 248354 268936 293333
18615 293333 290076 293412 294442 301517 318458 337166 346363 357519 377702 402279 415052 412185 411322
18602 411322 393019 368626 333575 319687 322258 325498 326622 319776 283223 237710 220133 212958
18590 212958 207164 210108 210656 211542 212157 210578 204777 200516 191563 182984 194628 201362 211696 222404
18576 222404 230883 244925 262239 279443 287611 280448 265958 259453 249200 264501 292564 321633
18564C21633J7427P325N480q613L881K72j954K95K702l553l027l854r619o285
18550C22110j9630k4384l2834l0988j8812P98M142j4882k1213n209j1083m958
18538A43057k99p174o262k4486j8914J4961J0681J865l032R217J0277L851J0602
18525A44344J8177O695K859K354J4613l396j7948j7715M351N750l719K860J3433
18512A72658N027q567j7983k1578j0401r666M815M045n544j5618m099R285K134
18499A04508M909M465J0807n299j0051j358n823j1123n016K67l008p65J0839j593
18485I1759M035K0648P702k0270j6756L692j1981N252K059k875Q38R795K171p298
18471H8771j1084M938J1000m85n924q288L947J2414O828N636j612q904q734L501
$$ plain form
18564 321633 339060 346385 351865 343252 347133 347405 345451 345746 348448 344895 341868 338014 328395 322110
18550 322110 302480 278096 245262 214274 195462 196260 200402 185520 164307 159098 148015 143057
18538 143057 142758 135584 129322 104836 85922 100883 111564 113429 110397 119614 129891 133742 144344
18525 144344 162521 169216 172075 174429 189042 185646 167698 149983 154334 160084 156365 159225 172658
18512 172658 177685 169118 151135 129557 119156 109490 114305 118350 112806 97188 93089 102374 104508
18499 104508 109417 113882 124689 119390 109339 107981 102158 91035 86019 86286 83278 82513 93352 91759
18485 91759 95794 116442 124144 103874 87118 90810 78829 84081 86140 83265 84103 93898 96069 88771
18471 88771 77687 82625 93625 93140 87216 78928 82875 95289 102117 107753 106141 97237 88503 92004
18457I2004Q915J973R31l908R83K685m739J0330r577m142J4561l752j9388j6086
18443G0790J4728O441R736O738P679j003l2858j6164J4635l54j2142Q975P676
18430H4877J1644m008q73m07n730k849M771L945J38K499k010k156q669J2250R440
18415A02862M290J84j0690n284o69J242Q745K459J3126N054J4971N894l116j7577
18401A21491k3947P433O874q069M794M644J1110Q914j901r723q41K077l406j1512
18387A07938j944o091k390Q668N774j0310p876J1702Q101L85n825j7253R095J0715
18373A10689o969J3200Q211k04r505m036J5500J2618o541O160Q965R530K0661
18360A78279M231j0490j4248M78j813p123O287q789N554p4J4262J5894N748J2477
$$ plain form
18457 92004 100919 102892 103823 99915 100898 103583 98844 109174 99597 95455 110016 106264 86876 70790
18443 70790 85518 91959 101695 108433 116112 115109 82251 66087 80722 80368 68226 77201 84877
18430 84877 96521 92513 91640 91233 85503 82654 87425 91370 91508 94007 91997 89841 81172 93422 102862
18415 102862 107152 107336 96646 91362 90693 91935 100680 103139 116265 121319 136290 142184 139068 121491
18401 121491 97544 104977 111851 103782 108576 113220 124330 133244 131343 121620 120779 122856 119450 107938
18387 107938 105994 99903 97513 106181 111955 101645 93769 105471 113572 113957 108132 90879 99974 110689
18373 110689 103720 116920 125131 124927 115422 111386 126886 139504 132963 139123 148088 157618 178279
18360 178279 182510 172020 157772 158250 156437 149314 155601 146812 152366 152292 166554 182448 188196 200673
18346B00673J2343K1994J7174j0625k317M298k567l876j8949k8361j7195j091
18334A71501M615J6876P420m920O917R447K0820L015n83o109j2294j3366L850
18321B07189J26o034R185P700O656J5999P358l212p993M917L547M78R561K1147
18307B76624L4107M1573K1441J0290j7994l8669k5226j1552m142j2062j3097O879
18295B68172J054M003Q479M568j80J0362K3042L8002J8774O903M811k498J9212
18282D04704P645j8980l4473l0409j0874j6000j7066n430L998J1263k807N89Q206
18269C00366O924J2913J313J8466J2607R106J3257L247N233J4466K1111L400p423
18256D14986o377j22p604N699P37K014J6219J0001n946J1779J2661J6734L2061
$$ plain form
18346 200673 213016 235010 252184 241559 239242 243540 240973 237097 218148 189787 172592 171501
18334 171501 176116 192992 200412 195492 202409 211856 232676 235691 235108 228999 216705 203339 207189
18321 207189 207315 201281 210466 218166 224822 240821 248179 244967 236974 241891 245438 245916 255477 276624
18307 276624 310731 352304 373745 384035 366041 327372 302146 290594 286452 274390 261293 268172
18295 268172 269226 273229 281708 286276 286096 296458 319500 357502 376276 383179 387990 385492 404704
18282 404704 412349 393369 358896 328487 317613 301613 284547 279117 283115 294378 291571 292160 300366
18269 300366 307290 320203 321516 339982 352589 361695 374952 378199 383432 397898 419009 422409 414986
18256 414986 408609 408487 400883 406582 407319 409333 425552 435553 429607 441386 454047 470781 502842
18243E02842M9722L9669K5883K2672O24j3460m578K4630L4403N7492R7485J31713
18231I69097J68738J97817J99421J44535K180q4679j18949p4772j2767K0212M6933
18220A457766Q2085R4441J44303K27888L54643N57978R07928J306856J508165
18211F642053J308612O73234q4927k28641K29158M20501l0737r21961j453032
18202F554260j216174p25624l37786j22659M5333J89882L29402N57349R57852
18193F231835J471135J907217J918556J292074R9244r33600q71150Q2608J093594
18184A2291513J552068J289643L81747m87483k56740Q27499J528531J141716l31048
18175A7937446k154020k835188k195727j310494p16086l95422j60487N8338K73503
$$ plain form
18243 502842 552564 592233 618116 640788 641412 627952 623374 648004 682407 739899 837384 969097
18231 969097 1137835 1335652 1535073 1679608 1681788 1597109 1478160 1403388 1390621 1410833 1457766
18220 1457766 1539851 1634292 1778595 2006483 2361126 2919104 3827032 5133888 6642053
18211 6642053 7950665 8623899 8538972 8310331 8539489 8959990 8929253 8007292 6554260
18202 6554260 5338086 4612462 4274676 4152017 4197350 4387232 4716634 5273983 6231835
18193 6231835 7702970 9610187 11528743 12820817 12920061 11986461 11115311 11197919 12291513
18184 12291513 13843581 15133224 15514971 15027488 14770748 15598247 17126778 18268494 17937446
18175 17937446 15783426 12948238 10752511 9442017 8725931 8330509 8170022 8228360 8501863
18166H501863N35385R12284J462244K400209L753443M932607M992532L279725
18158C0770292l9841l143712l172285p55798J833498L833954N318981N926049
18150D0571138N631207M275020J196395j738169j303317J151315J949018J15154
18142E1847761k860246l882286k636064j963671l302830n228737m444493k061911
18134B5467523l7265R88757Q11579n17315k365399l143960k515215j556581q53009
18125A6279115l58124J5955L60086Q13265J382456J812952J735081J210548K37476
18116B3488810K56898K038833M796979Q458619J2325162J4218487J1943272M361815
18108H1888875n786735j1086981j0005624l885665K543585O916408P772574N107897
$$ plain form
18166 8501863 9037248 9949532 11411776 13811985 17565428 22498035 27490567 30770292
18158 30770292 30730451 27586739 24414454 23658656 25492154 29326108 34645089 40571138
18150 40571138 46202345 50477365 51673760 49935591 48632274 49783589 51732607 51847761
18142 51847761 48987515 45105229 42469165 40505494 37202664 31973927 27529434 25467523
18134 25467523 25430258 26419015 27230594 26713279 24347880 21203920 18688705 17132124 16279115
18125 16279115 15920991 15936946 16297032 17110297 18492753 20305705 22040786 23251334 23488810
18116 23488810 23745708 25784541 30581520 39040139 51365301 65583788 77527060 81888875
18108 81888875 76102140 65015159 55009535 51123870 53667455 60583863 68356437 73464334
18100G3464334k77689l946679j945087n61956l333763q829420j0833587q262783
18092C5473370n318509l464566k404341j778013j330228r85617o93964m02156
18084A9095976j10170J93066N87825J239052K358198M061970N946129P000994
18076D0373040O356200L240393j685840m482120o540657p236015n235144l088807
18068B1701050j787097j044887n58554k04014K14308Q20567J734936L058365M849402
18059B8784076O385674O229538L606084j015891n668465n222834j610984J278175
18051C2765373K069443P75067k259260m643368l690873j332108R99908L071356
18043B7755538M098874L137335J44556m562776o570481m803585k857371j750722
$$ plain form
18100 73464334 73186645 69239966 67294879 66732923 63399160 54569740 43736153 35473370
18092 35473370 30154861 26690295 24285954 22507941 21177713 20192096 19498132 19095976
18084 19095976 18985806 19178872 19766697 21005749 23363947 27425917 33372046 40373040
18076 40373040 46729240 49969633 48283793 43801673 37261016 30025001 24789857 21701050
18068 21701050 19913953 18869066 18310512 18106498 18320806 19141373 20876309 23934674 28784076
18059 28784076 35169750 41399288 45005372 43989481 38321016 33098182 31487198 32765373
18051 32765373 34834816 35609883 33350623 28707255 25016382 23684274 24684182 27755538
18043 27755538 31854412 34991747 35136303 30573527 24003046 19199461 16342090 14591368
18035A4591368j167154q33650o94315o24772n77607n25222m61846m06370l38132
18026H962300k94340k37908j49071j09372o5168J9731J53269L96491Q36810J341589
18016A0854331J575432J185882J53068j443903k157405j645739j036481o52801
18008F832384m12534k81634j83436r2583K7472J95668M47695O89639O49465K40814
17998H112950m98028j130840r94795o36208m04739k70953k00346j73849j48352
17989C654840j37486j06999j16511j09146j03918j26342j10414r7069r3373r2151
17979B561431r0325q6509p1121n5342m6463m8763p8227p3548o7962m9224n4960
17968A838987o2478o6121o4491m8322m9615m6928n1441m6978m5557m5588k9461
$$ plain form
18035 14591368 13424214 12590564 11896249 11271477 10693870 10168648 9706802 9300432 8962300
18026 8962300 8667960 8430052 8280981 8171609 8106441 8126172 8279441 8675932 9512742 10854331
18016 10854331 12429763 13615645 13768713 12324810 10167405 8521666 7485185 6832384
18008 6832384 6419850 6138216 5954780 5862197 5889669 6085337 6533032 7222671 7872136 8112950
17998 8112950 7614922 6484082 5489287 4853079 4448340 4177387 3977041 3803192 3654840
17989 3654840 3517354 3410355 3293844 3184698 3080780 2954438 2844024 2746955 2653582 2561431
17979 2561431 2471106 2384597 2313476 2258134 2211671 2162908 2084681 2011133 1943171 1893947 1838987
17968 1838987 1776509 1710388 1645897 1597575 1547960 1501032 1449591 1402613 1357056 1311468 1282007
17957A282007l3858n0965l4995l0342j1654k0691j2861j0475k6301j6436k1931
17946A011498l1231l0086l4411k6605j1771k4532k9588k4297j0571l444j0146
17935G74816l2172j4111k2257k5496j8480k2476k8374j8188K549j5433k3871k3446
17923E33061o708k0958j3594J0621N076j4193j7982j0411j051m52j2106j2790
17911D38513k4411l1827q601J9489r66j4839j4337o514p190o287j357o867m810
17898C29996p328K983J3370j8484k3185j670o708L080N848j4619j9015m501J2072
17885B71839N177J512J30j71j5683j6559l37k558m227Q188m105N056k069l081
17871B43112j481j2422j788k595o430R054R594Q265j2077j9267r958n9J2044J2414
$$ plain form
17957 1282007 1248149 1197184 1162189 1131847 1120193 1099502 1086641 1076166 1049865 1033429 1011498
17946 1011498 980267 950181 915770 889165 877394 852862 823274 798977 788406 784962 774816
17935 774816 742644 728533 706276 680780 662300 639824 611450 593262 595811 580378 556507 533061
17923 533061 526353 505395 491801 502422 507498 493305 475323 464912 463861 463409 451303 438513
17911 438513 414102 382275 373674 393163 392197 377358 363021 356507 349317 343030 341673 334806 329996
17898 329996 322668 325651 339021 320537 297352 295682 288974 292054 297902 283283 264268 259767 271839
17885 271839 277016 278528 278658 278487 262804 246245 245908 243350 239123 247311 243206 248262 246193 243112
17871 243112 241631 229209 227421 224826 218396 227450 237044 245309 233232 213965 204007 203948 215992 228406
17857B28406j4706l1232j6755M606r880n641P595l328J664N084J349l601k0331
17844A43230j636J1312J72r102l785r127q999nj6233p408M309N207l969l575J0146
17829A10537M384k3503N024J7091L816R862j2981n945j925M765m96n696j4771
17816I0162N791R076O293K678j1244j7829M179n202j5970o041Q61J610j000k587
17802F0777p409J1951J2510R33m454m302k567j826j1359j4388K823Q837n15l50
17788E0661p011k824k908J4035R718l91o103m911l031l961J1068n929p973K63
17774D0703n830Q659l04j924q969J401n634K900J1708q578k5625l222O992J0175
17760B2452R200L963K862R306m405l657k29k003p156j8630O168J3884O001q875
$$ plain form
17857 228406 213700 182468 165713 170319 160439 154798 162393 159065 160729 165813 167162 163561 143230
17844 143230 141594 152906 153078 143976 140191 131064 122065 122060 105827 98419 102728 107935 103966 100391 110537
17829 110537 114921 91418 96442 113533 117349 127211 114230 108285 106360 111125 110629 104933 90162
17816 90162 95953 105029 111322 114000 102756 84927 89106 83904 67934 61893 62754 64364 63364 60777
17802 60777 53368 65319 77829 78762 74308 70006 67439 65613 54254 39866 42689 51526 51011 50661
17788 50661 43650 40826 37918 51953 61671 61280 55177 50266 47235 43274 54342 48413 40440 40703
17774 40703 34873 43532 43228 41304 32335 33736 28102 31002 42710 34132 8507 5285 12277 22452
17760 22452 31652 35615 38477 47783 43378 39721 39492 37489 30333 11703 17871 31755 37756 28881
17746B8881r120o445M145J0492n053Q674N783o582k4383j7762r524O213j977O360
17732a0298l47K149r462M746J1717L803K387J7138J5564J0646p845n893o886K801
17718C0220l785n665j215L627p598n125O158Q548n40j430L819n237j388O111N802
17703C2302J334q500q972O396q05l096L967L844l860P069l251n06K2409J9150
17689F7481K1887K2352K6842L1168O512P709n369N43n416k1902k4626j3682j1723
17676A01776r784K5233K5025J5652J6510K0654J6627o291k6147l2576l0829k3503
17664I2347r587J459O567j761L360j4884j5718j2598Q033K675k3526m801K1841
17651E3407K0699K72Q013N396K6262J7477J9775J5955K156Q308K4462J2762R094
$$ plain form
17746 28881 19761 13316 17461 27953 22900 31574 37357 30775 6392 -11370 -20894 -14681 -16658 -10298
17732 -10298 -10645 -8496 -17958 -13212 -1495 2308 4695 21833 37397 48043 40198 34305 27419 30220
17718 30220 26435 20770 19555 23182 15584 10459 16617 25165 24625 23195 27014 21777 20389 26500 32302
17703 32302 33636 25136 16164 22560 21755 18659 22626 26470 22610 29679 26428 25922 48331 67481
17689 67481 89368 111720 138562 169730 176242 183951 178582 179125 173709 151807 127181 113499 101776
17676 101776 91992 117225 142250 157902 174412 195066 211693 205402 179255 146679 115850 92347
17664 92347 82760 84219 90786 89025 92385 77501 61783 49185 57218 59893 36367 31566 53407
17651 53407 74106 74378 82391 87787 114049 131526 151301 167256 169412 177720 202182 214944 224038
17638B24038l740k5906l71L0495M2457J8519M205p835l1168j3900j5629m20j0857
17625B09888j1531j6891j263r089j8717j2444r454o695l784q635j5750j957M77
17612I4155J3885J4896J0312K4803J1837j7528r852k3528j3656q961O9J6054J9047
17599A31533Q584K2792J8924L4882L0116K6815J4815l844r878j3219J3945P779
17587B83244j525j1978l3421j8866q736l804p648k0093j6718k4786k6023n347
17575A04299k866N602J5979P916Q79J1502P878J9599J2469j2495j8844k1161j347
17562A29410O368J4631M52P200K9906K6626J3415J3809m814k6650m3829l2303
17550A34221j0863m507R106K345K5050L5652K8819J5042j9588j7798l3043k2228
$$ plain form
17638 224038 220298 194392 194021 224516 266973 285492 289697 281862 250694 236794 221165 220745 209888
17625 209888 198357 181466 180203 171114 152397 139953 130499 123804 120020 111385 95635 93678 94155
17612 94155 108040 122936 133248 158051 169888 152360 142508 118980 105324 96363 96432 112486 131533
17599 131533 140117 162909 181833 216715 246831 273646 288461 284617 274739 261520 275465 283244
17587 283244 281719 269741 236320 217454 208718 204914 197266 177173 160455 135669 109646 104299
17575 104299 101433 107035 123014 130930 131809 143311 151189 170788 183257 170762 151918 130757 129410
17562 129410 135778 150409 150861 158061 187967 214593 228008 241817 237003 210353 166524 134221
17550 134221 123358 118851 127957 130302 155352 191004 219823 234865 215277 197479 164436 142208
17538A42208J1260O672p957j8616j0603n813j6287j7091j8871j652R945J029Q889
17525H3113j449k551m724j644K47N830J2951J2799m77j0616n578r773M634j347
17511H1415j1794L900N655L257l211K0079J6149N563j191N77j9843k5717j2903
17498F1936m347m156j62n431J79P083r249j4820p669O484Q579N323j078j8089
17484B4583j1269L839k135l800L682p265q46K5004J0244J966O156P66j1644k1423
17470A7858n163J0432K163K272j0082J257o167l568R633q87L30P223j3985q6P774
17455A9004J236r280L762j759n794l569K64K824J0771J0752J2341N201R257N052
17441F0062M137j6556k7094j5291J3975K2339J2314j6781j3244k0266J205N14
$$ plain form
17538 142208 153468 160140 152183 133567 122964 117151 100864 83773 64902 63250 73195 74224 83113
17525 83113 81664 79113 74389 72745 72992 78822 91773 104572 104095 93479 87901 78128 82762 81415
17511 81415 69621 73521 79176 82433 79222 99301 115450 121013 119822 120399 100556 74839 61936
17498 61936 57589 53433 53271 47840 48019 55102 45853 31033 23364 29848 38427 43750 42672 24583
17484 24583 13314 17153 15018 11218 14900 7635 6789 31793 42037 44003 50159 50925 39281 17858
17470 17858 12695 23127 25290 27562 17480 18737 12570 9002 18635 17748 18078 25301 11316 11230 19004
17455 19004 20240 10960 14722 12963 7169 3600 3864 6688 17459 28211 40552 45753 55010 60062
17441 60062 64199 47643 20549 5258 19233 41572 53886 37105 23861 3595 4800 5314
17429E314J3857L570M825l419m257j3734m53m256J0647L305q224M913j659O765
17415A7194K532p267P237M969K941o682L583k595q246n01N127M599m395j2047
17401F449q091L991m309M31N217N891J627k41J4398q495r522q247m446m360p855
17386a7562j3476k143J7787J988Q651L3j4310O101J1362j353R011j1394J0805
17373E500l04l776K97j469r075L819J4447l670j0209k098O023N236j070j3942
17359a0291k798J2048M476r296K391O016O564p013K769k314M398L422o411J831
17345E792j1248o294M307O523j2303K988J8912m878j1960m752N913J3868l210
17332C658k857M238J580p780R16l680r607J2893n943N775K407p073o158p562J0929
$$ plain form
17429 5314 19171 22741 27566 24147 19890 6156 5703 1447 12094 15399 7175 12088 10429 17194
17415 17194 19726 12459 19696 24665 27606 20924 24507 21912 13666 13165 18292 22891 18496 6449
17401 6449 -1642 2349 -1960 -1529 3688 9579 11206 10965 25363 16868 7346 -901 -5347 -9707 -17562
17386 -17562 -31038 -33181 -15394 -13406 -4755 -4722 -19032 -12931 -1569 -2922 6089 -5305 5500
17373 5500 5196 1420 1717 248 -8827 -5008 9439 5769 -4440 -6538 -515 4721 3651 -10291
17359 -10291 -13089 -1041 3435 -5861 -3470 2546 9110 2097 4866 2552 6950 10372 3961 5792
17345 5792 -5456 -11750 -7443 -920 -13223 -10235 8677 3799 -8161 -12913 -7000 6868 3658
17332 3658 801 5039 6619 -1161 -245 -3925 -13532 -639 -6582 -807 1600 -5473 -11631 -19193 -8264
17317h264R851L518k04j3634r931J1944L520p562p868o786m058o741P346J9022
17303i847J7754r101k814r4k087l753j2573j0565N821R232J0187o005p517J9902
17289a460J7521o642j718n317j57O872j1266q528j0039J07J3270Q171K330J953
17275E097N497n67j2065j0007j2033j506J1456J3407K277J0699N450j3669j1649
17262g613J188m473o547J1318J3388J1779r456p192N986j363K548k929j1913k34
17248e513p709j9178k296J1001J882P508n739o027P039K876n459m66P915j3244
17234b7410l489M256M979M272O255R774M684r84j200j8661P01p38J515P686J2353
17219C993J296r423j505m454m581p080k452J0269K0828J0246n107q661m996m735
$$ plain form
17317 -8264 1587 5105 4901 -8733 -18664 -6720 -3200 -10762 -18630 -25416 -29474 -36215 -28869 -9847
17303 -9847 7907 -1194 -4008 -4102 -6189 -9942 -22515 -33080 -27259 -18027 -7840 -13845 -21362 -1460
17289 -1460 16061 9419 7701 2384 2227 9099 -2167 -10695 -20734 -20627 -7357 814 3144 5097
17275 5097 10594 10027 -2038 -12045 -24078 -25584 -14128 -721 1556 12255 17705 4036 -7613
17262 -7613 -6425 -10898 -17445 -6127 7261 19040 9584 2392 8378 7015 9563 6634 -5279 -5513
17248 -5513 -13222 -32400 -34696 -23695 -21813 -14305 -20044 -26071 -19032 -16156 -21615 -22081 -14166 -27410
17234 -27410 -30899 -26643 -21664 -17392 -11137 -1363 3321 2337 1137 -17524 -16823 -17561 -16046 -8360 3993
17219 3993 5289 -4134 -5639 -10093 -14674 -21754 -24206 -13937 6891 17137 12030 3369 -1627 -6362
17205f362p849K075o674l92P43J0650m85o172q300J506O432J3476J1123j5928
17191f157r362P410J2736l141p959n215l016N923L151k373j0272J923N743Q167
17177b442Q471P65o219o033m761n432k391N589K536N861M393J0808j058k762j4450
17162g125j2302P720K081l540r83J6439J0918J895j155j7007j1279O573N91J5343
17148H169O084n91m328j2788k3322O714p930m933N882Q451N665L80K631j792r808
17133b1516q975N27O339N490P203j357o210j2385N680J4019Q711J0997j374j3960
17119f811R15K173j046m242J993N769o475O486J5166K3296q292j0628l25m932
17105A3047j8686j8614m531J1242J4014M595l086j7122j453K1696n466j4321o861
$$ plain form
17205 -6362 -14211 -12136 -18810 -19202 -18459 -7809 -8294 -14466 -22766 -21260 -14828 -1352 9771 -6157
17191 -6157 -15519 -8109 4627 1486 -6473 -11688 -14704 -8781 -5630 -8003 -18275 -16352 -10609 -2442
17177 -2442 6029 6794 575 -5458 -10219 -15651 -18042 -12453 -9917 -4056 337 11145 10087 7325 -7125
17162 -7125 -19427 -11707 -9626 -13166 -14149 2290 13208 15103 13948 -3059 -14338 -7765 -7174 8169
17148 8169 14253 13662 9334 -3454 -26776 -20062 -27992 -32925 -27043 -18592 -12927 -12547 -9916 -11708 -21516
17133 -21516 -30491 -29964 -23625 -18135 -10932 -12289 -18499 -30884 -25204 -11185 -2474 8523 7149 -6811
17119 -6811 -5896 -3723 -4769 -9011 -7018 -1249 -7724 -1238 13928 37224 28932 18304 17979 13047
17105 13047 -5639 -24253 -28784 -17542 -3528 1067 -2019 -19141 -20594 1102 -4364 -18685 -25546
17092b5546J4126r211J254M601N134j0242n321K521J656j4773n092N026J2481
17079b3386J6137p7j1660r558p293K539J4522r25l945Q776O535M139p5q133L076
17064i328K874J1459J0999j5349l1377J2158J0828Q90n389r396k644P197J0975
17051f103J0467N526r859l013j2208o289j382o53P30J3467J1164j4586o65J0818
17037b586p531l328k524k253p643j1894m493R421O271P993L51R285J2544K980
17023F593j6726l493M777Q716j0638K434k650k25m941K453N065k607o43J897o092
17008a6080j5648j781J0142Q592N829q991j6103K2244K831P706K481j4240J046
16995a1972j820n099N643k544n896J2518R260j1693J0644J7232N571j8557j7604
$$ plain form
17092 -25546 -11420 -20631 -19377 -14776 -9642 -19884 -25205 -22684 -21028 -35801 -40893 -35867 -23386
17079 -23386 -7249 -7326 -18986 -28544 -35837 -33298 -18776 -19701 -23646 -14870 -8335 -4196 -4271 -12404 -9328
17064 -9328 -6454 5005 16004 655 -30722 -18564 -7736 -6846 -12235 -21631 -24275 -17078 -6103
17051 -6103 4364 9890 31 -2982 -15190 -21479 -22861 -23514 -22784 -9317 1847 -12739 -13404 -2586
17037 -2586 -10117 -13445 -15969 -18222 -25865 -37759 -42252 -32831 -26560 -18567 -18216 -8931 3613 6593
17023 6593 -10133 -13626 -8849 -133 -10771 -8337 -10987 -11212 -16153 -13700 -8635 -11242 -11885 -9988 -16080
17008 -16080 -31728 -33509 -23367 -14775 -8946 -17937 -34040 -11796 -8965 -1259 1222 -13018 -11972
16995 -11972 -13792 -18891 -13248 -15792 -21688 -9170 90 -11603 -959 16273 21844 3287 -14317
16982a4317p835Q52P717M883J3851j4720l684l95k1R47p544L769r762q404M422
16967c0241N287K944j3017K519J3969J6832k814Q683J662k608o51L02p82m497
16953b412n693P773P11R52l905j5254p700j4811j5781j3765k266J4126J7607J8069
16939b2349L2967J5851o706l989o011o663m983J1121j224m207J0692K869k0084
16926b716r799r799r285L517J7764j0217m2J690K7Q355p075k69l17L541o33K730
16910a2528j7716J751q61R053l097l112Q334J1161n430j8094M378K0537k387n571
16896a3582l91j0019N57M875P695N270m35M845l158o056N947m093k0141O707J2076
16881i903o326j4520N189Q621k258o725j479J925R264O429q247n947p651P146
$$ plain form
16982 -14317 -22152 -21300 -13583 -8700 5151 -9569 -13253 -13648 -13669 -12722 -20266 -16497 -26259 -34663 -30241
16967 -30241 -24954 -22010 -35027 -32508 -18539 -1707 -4521 4162 5824 3216 2565 2867 2085 -2412
16953 -2412 -8105 -332 379 1331 -2574 -17828 -25528 -40339 -56120 -69885 -72151 -58025 -40418 -22349
16939 -22349 10618 26469 19763 15774 9763 3100 -1883 9238 8014 3807 14499 17368 -2716
16926 -2716 -12515 -22314 -31599 -28082 -10318 -20535 -20577 -18887 -18860 -10505 -17580 -17849 -18166 -14625 -15258 -12528
16910 -12528 -30244 -28493 -29354 -20301 -23398 -26510 -18176 -7015 -12445 -30539 -26161 -5624 -8011 -13582
16896 -13582 -13973 -23992 -23435 -18560 -10865 -5595 -6030 -1185 -4343 -10399 -4452 -8545 -28686 -21979 -9903
16881 -9903 -16229 -30749 -25560 -16939 -19197 -25922 -27401 -25476 -16212 -9783 -18030 -23977 -31628 -24482
16867b4482J5133n64o035L907M27q596J0530M572M728O249j823q28Q410J994J63
16852A3785q113j620p959l201j4492k3916J5895J9036K911N357J946n383m09J0588
16838D425m487j1312m206J5129N590K1j2107j0434J5402P299q981r570M229N673
16824c329p292M613K925k270p524R239O833J351n595k1654p143Q345K986N281
16810a3234J1559j1799k103N371N029o289J803P016L954L972j589j975j0363J172
16796g476q401l259O31J1153N455L454N779N42j180L290l3j1622j9848r822l040
16781c4377R95n805P339J6790Q868n643j962J7476J3502l889q884k1898j6386
16768c3874P20K821J890l368N973J3585K3893P976j1229r502k270M764K730J4872
$$ plain form
16867 -24482 -9349 -9913 -15948 -12041 -11614 -20210 -9680 -5108 -380 5869 4046 3218 11628 13622 13785
16852 13785 5672 4052 -3907 -7108 -21600 -45516 -29621 -10585 -7674 -2317 -371 -5754 -6163 4425
16838 4425 -62 -11374 -15580 -451 5139 5160 -6947 -17381 -1979 5320 -3661 -13231 -9002 -3329
16824 -3329 -10621 -6008 -3083 -5353 -12877 -3638 3195 4546 -1049 -22703 -29846 -21501 -18515 -13234
16810 -13234 -1675 -13474 -15577 -10206 -5177 -11466 -9663 -2647 1307 5279 3690 1715 -8648 -7476
16796 -7476 -15877 -19136 -18505 -7352 -1897 1557 7336 7878 6698 9988 9955 -1667 -21515 -31337 -34377
16781 -34377 -33382 -39187 -31848 -15058 -6190 -11833 -13795 3681 17183 13294 4410 -17488 -33874
16768 -33874 -33154 -30333 -28443 -31811 -25838 -12253 11640 19616 8387 -1115 -3385 1379 4109 18981
16754A8981l500n160k02n153k0667Q710r472j6195l045p54J4389K3961K1244R141
16740C2278l561r799k187j3471j1247O850J0339o820j5435m42j1991k507L345
16727b4648p970N872M634p796K508J4713J2430N410j9j059q124m4q478m341J772
16712a5140p746J5386Q472Q531m497j0738R84L496m977m840q53L550m20Q301J4433
16697A3942J537r784j8652j0082K404l934R011N27k434O974r634K422k290k923
16683b2916r949q711P048N816R40L844K335M774O17K1893N400j5252q206l227
16669a5594N712R721m289J105j383L07q239j5741L602K3478J4833N084j3957p09
16655C930O94n117N761K018j587n697n342r562J4176m224o416P829j1440o519
$$ plain form
16754 18981 15481 10321 10119 4966 -15701 -6991 -16463 -32658 -35703 -36457 -22068 1893 23137 32278
16740 32278 28717 18918 16731 3260 -7987 -1137 9202 2382 -13053 -13495 -25486 -27993 -24648
16727 -24648 -32618 -26746 -22112 -29908 -27400 -12687 -257 5153 5134 4075 -4049 -4093 -12571 -16912 -15140
16712 -15140 -22886 -7500 972 9503 5006 -5732 -4748 -1252 -6229 -11069 -11922 -8372 -8792 -491 13942
16697 13942 15479 5695 -12957 -23039 -20635 -24569 -15558 -15031 -17465 -10491 -20125 -17703 -19993 -22916
16683 -22916 -32865 -41576 -34528 -28712 -27772 -23928 -21593 -16819 -16202 5691 11091 -4161 -12367 -15594
16669 -15594 -9882 -161 -4450 -3345 -4728 -4421 -12660 -28401 -24799 -1321 13512 18596 4639 3930
16655 3930 4624 -493 5268 7286 5699 2 -5340 -14902 -726 -4950 -11366 -3537 -14977 -21496
16641b1496l721j858j21k617o13J6055J4982j473j618R196j456j5425j1210J0323
16627a1052K252K970j2583r300q6N75K696M813K232n039L758O631J523j2691M075
16612a9226j016M669M22R265o523M427R847J3714K093j1511q845J154j2918J010
16598a3438P358R018p728j7545p03j130q749P562J3595P094o981J0749J205j1399
16584a1092p175n693J975N793p948j4392L647K1439l03K973j023J356o139O807
16570i775J2749j0960j6981J9058r704m299R695n11k363k416O107K2169j0583
16557B186j5885R114n002r318o337K404m624J0814K7968Q050l758j8398j9338
16544b2124M879q84J0016p19J285K845m216p073j3608R511J2397R948N14O204
$$ plain form
16641 -21496 -25217 -27075 -27196 -29813 -30426 -14371 611 -862 -2480 6716 5260 -10165 -21375 -11052
16627 -11052 -8800 -5830 -18413 -27713 -27799 -27224 -24528 -19715 -17483 -22522 -18764 -12133 -10610 -23301 -19226
16612 -19226 -20242 -15573 -15151 -5886 -12409 -7982 1865 15579 17672 6161 -2684 -1530 -14448 -13438
16598 -13438 -6080 2938 -4790 -22335 -23038 -24168 -32917 -25355 -11760 -4666 -11647 -898 307 -11092
16584 -11092 -18267 -23960 -21985 -16192 -24140 -38532 -34885 -13446 -13749 -10776 -11799 -10443 -16582 -9775
16570 -9775 2974 -7986 -24967 -5909 -15613 -19912 -10217 -10728 -13091 -15507 -9400 12769 2186
16557 2186 -13699 -4585 -9587 -18905 -25242 -22838 -27462 -16648 11320 19370 15612 -2786 -22124
16544 -22124 -17245 -18129 -8113 -8832 -7547 -4702 -8918 -15991 -29599 -20088 -7691 2257 2771 8975
16530H975o075j2992j8137J7P770P071N111N188k002j879l14J3409K905J1143
16516B0190n369k956j1651j2736K096J67k319M140m981O189J4196N679k105j2136
16502a596j3289r03J4967K0499r193k3007j2517j1k305L601Q430k31L112j327
16488a3770R783L501Q083p127j2866p154l194N362P056K265m103j0747K801n859
16474b5969m367P107J0511Q615m72n886j432K634Q880N365j5663j6019R409N276
16460a2011N05J3156J728j767J0628K522j4434j0657N847j2718j7791R71m15j22
16446c4558O705N172J0671K559k979n231k289r586n002O160J5606J3291J636o456
16432d301m826J144q99k1035M541J1478K007j46o261o003o602N546P010J6940
$$ plain form
16530 8975 2900 -10092 -28229 -28212 -20442 -13371 -8260 -3072 -5074 -6953 -7267 6142 9047 20190
16516 20190 14821 11865 214 -12522 -10426 -10259 -12578 -8438 -13419 -7230 6966 12645 10540 -1596
16502 -1596 -14885 -15788 -821 19678 10485 -12522 -25039 -25050 -27355 -23754 -15324 -15555 -12443 -13770
16488 -13770 -3987 -486 7597 470 -12396 -19550 -22744 -17382 -10326 -8061 -12164 -22911 -20110 -25969
16474 -25969 -30336 -23229 -12718 -4103 -4575 -10461 -11893 -9259 -379 4986 -10677 -26696 -17287 -12011
16460 -12011 -11506 1650 3378 1611 12239 14761 327 -10330 -4483 -17201 -34992 -34021 -34436 -34558
16446 -34558 -27853 -22681 -12010 -9451 -12430 -17661 -19950 -29536 -34538 -28378 -12772 519 2155 -4301
16432 -4301 -9127 -7983 -8882 -29917 -25376 -13898 -11891 -12037 -18298 -24301 -30903 -25357 -18347 -1407
16418a407J0690r360j7183p506J7230K262p790k923o155M167O333q101J0716P269
16404a758O356n139k16p730o629j2036m60Q444M643K879n565n636p740m283N237
16389b9633J4708L017K733N891L43j0697l906N707p724L19n700K068Q056J0919
16375c899L423j9046n717K507o097M224K533J4056K284j8774j87N288r515L967
16361b4953J2955O001p543j0801m001K413O440P148J100J557k484r10O886Q525
16347B333R021j2534j1842j4659N123N121j212J2781M637q04K024k601j2993N064
16333a0541q11n526N334j474n017k772J539o527J0483J230m01J3142O347n173
16319a67k88j4887o032M439M773n322M391J147q103l226R991J4222k408L942J374
$$ plain form
16418 -1407 9283 -77 -17260 -24766 -7536 -5274 -13064 -15987 -22142 -17975 -11642 -19743 -9027 -1758
16404 -1758 4598 -541 -757 -8487 -15116 -27152 -27612 -19168 -14525 -11646 -17211 -22847 -30587 -34870 -29633
16389 -29633 -14925 -11908 -9175 -3284 -2941 -13638 -17544 -11837 -19561 -19242 -24942 -22874 -14818 -3899
16375 -3899 -476 -19522 -25239 -22732 -28829 -24605 -22072 -8016 -5732 -24506 -24693 -19405 -28920 -24953
16361 -24953 -11998 -5997 -13540 -24341 -28342 -25929 -19489 -12341 -11241 -9684 -12168 -13078 -6192 2333
16347 2333 11354 -1180 -13022 -27681 -22558 -17437 -18649 -5868 -1231 -2035 -11 -2612 -15605 -10541
16333 -10541 -11352 -16878 -11544 -13018 -18035 -20807 -19268 -25795 -15312 -14082 -14483 -1341 5006 -167
16319 -167 -455 -15342 -21374 -16935 -12162 -17484 -13093 -11946 -20049 -23275 -13284 938 -1470 2472 3846
16304C846n615j5018K495P237k350q048j843j494J2815M736j3099j1288k7M559
16290b3094L398J0335r270p151N186J7153j800k6767q625J4321Q267J038j0264
16277b7273k454O325j1514o257N907Q124K8030J1184j3022o108j0195o236J427
16264b2062J3874R607j1789j2953L724N595K735q113o715Q449P069k242J8536
16251E715q522q111j1726n665J087N439O365J1841J4826P933k763m116p186M76
16237E593J0419j7074o614J4m205K055k197r572K870K669P610q505l698J595o317
16222b5357R688J1878o365j305J1792R967m285o591j695M653l642r410r641J3627
16208f686M398o204j3728j0740J592L697L527Q797k015j846r447L566j4852J0795
$$ plain form
16304 3846 -1769 -16787 -14292 -7055 -9405 -17453 -19296 -20790 -7975 -3239 -16338 -27626 -27653 -23094
16290 -23094 -19696 -9361 -18631 -25782 -20596 -3443 -5243 -32010 -40635 -26314 -18047 -17009 -27273
16277 -27273 -29727 -23402 -34916 -41173 -35266 -27142 888 12072 -950 -7058 -17253 -23489 -22062
16264 -22062 -8188 1419 -10370 -23323 -19599 -14004 -11269 -19382 -26097 -17648 -10579 -12821 5715
16251 5715 -2807 -10918 -22644 -28309 -27222 -21783 -15418 -3577 11249 19182 16419 12303 5117 5593
16237 5593 16012 -1062 -7676 -7662 -11867 -9812 -12009 -21581 -18711 -16042 -8432 -16937 -20635 -19040 -25357
16222 -25357 -15669 -3791 -10156 -11461 331 10298 6013 -578 -2273 2380 -1262 -10672 -20313 -6686
16208 -6686 -2288 -8492 -22220 -32960 -31368 -27671 -24144 -15347 -17362 -19208 -28655 -25089 -39941 -29146
16194b9146K255O064N504J3579o651N994M742o179m891M334j7574j1452J1503
16181b1918J3182J9547K905m646j3611O105r471j327l482n138J666J0124P677
16168A613o466M774N494j1333K58p037k466L681O26m509k881O932k910j6469k291
16153c2984k261J0928Q788Q87j0301J2016K0351o196J37O51J0473Q217p096j4423
16139h13N342J2688p253j5830j9148l843J2265J0178N884K385j4486P876J5405
16126A0650N897j252o249o339k797m448n498k7O429J625J538k659j207k793R802
16111B672J1264Q084M201Q752j4763q279l923k0513k89J8409O784n298J3326r793
16097A0634r421q391P923Q309q046j0121J3184L940K595R49l949r860k648o123
$$ plain form
16194 -29146 -26891 -20827 -15323 -1744 -8395 -2401 2341 -3838 -8729 -4395 -21969 -33421 -21918
16181 -21918 -8736 10811 13716 9070 -4541 1564 -7907 -9234 -12716 -17854 -16188 -6064 1613
16168 1613 -4853 -79 5415 -5918 -5660 -12697 -15163 -11482 -10856 -15365 -18246 -11314 -14224 -30693 -32984
16153 -32984 -35245 -24317 -15529 -14642 -24943 -12927 7424 1228 1365 2016 12489 20706 13610 -813
16139 -813 4529 17217 9964 -5866 -25014 -28857 -16592 -6414 -530 1855 -12631 -4755 10650
16126 10650 16547 15295 9046 2707 -90 -4538 -10036 -10063 -3634 -2009 -471 -3130 -4337 -7130 2672
16111 2672 13936 22020 26221 34973 20210 11931 8008 -12505 -12794 5615 12399 7101 20427 10634
16097 10634 1213 -7178 745 9054 1008 -9113 4071 8011 10606 11555 7606 -2254 -4902 -11025
16083a1025k189P291J8636j426j6232j1266o654J2950N031m69J290j812M416j6517
16069a7976j536r941O017O004J744K714k32O841M689j2538p239n641R234J7148
16055g12l338j0831p84L791r237j1671M584J4459J6072j4347k4744l206J1760
16042b8204R060P54o60R837r890j3564o35q76K610M986l796M462j474J778J1301
16027a4311j638m617M813R698N151n268O780N065r142j2393n236J45Q193J2883
16013A23J122j2098j7987j56o214P235J6954j390j4958n230r38J6191J7023K75
15999d8K837O40O386J0877o183j1671k957m957m411O82L823j6314p259J1641J7917
15984A003q85j9112m781J994j4619k051L941P847K1329Q799j2331p869j991k987
$$ plain form
16083 -11025 -13214 -5923 12713 11287 -4945 -16211 -22865 -9915 -4884 -5353 -4063 -5875 -1459 -17976
16069 -17976 -19512 -29453 -23436 -17432 -15688 -12974 -13206 -6365 -1676 -14214 -21453 -27094 -17860 -712
16055 -712 -4050 -14881 -15665 -11874 -21111 -32782 -28198 -13739 2333 -12014 -36758 -39964 -28204
16042 -28204 -19144 -18390 -19050 -9213 -19103 -32667 -33302 -34178 -31568 -26582 -30378 -25916 -27390 -25612 -14311
16027 -14311 -15949 -20566 -15753 -6055 -904 -6172 608 5673 -3469 -15862 -21098 -20953 -12760 123
16013 123 1245 -10853 -28840 -28996 -35210 -27975 -11021 -12411 -27369 -32599 -33537 -17346 -323 -48
15999 -48 2789 3429 9815 20692 14509 2838 -119 -5076 -9487 -8805 -4982 -21296 -28555 -16914 1003
15984 1003 118 -18994 -23775 -21781 -36400 -38451 -34510 -26663 -5334 3465 -8866 -16735 -18726 -21713
15970b1713P628j1158l430J7715j802N222P586Q970k948o507q544k0649m878O716
15956b7792P29o842M158R539K763l174Q876J2724m745q561k856P424K477l824
15942i104j2755M36J089K642J3722k644j540o657K752J5650p796m569l801Q888
15928c687J2564L338q625j342L135j1270k230N472R300m087P208k168j2337M046
15914f83L078Q385r709j9135p052n67n074k366L19M892P332j3386n57K284M117
15899b8122J9181q267J0691q561l720l643r26l708N991R414P892j2232K187K820
15885a1003l704J6853n057n272o951J387P824J8271J0372n100j6108j4551N118
15872g921Q468N28m039J847l023r315J182j336j8612k1857j599J4894J1118R761
$$ plain form
15970 -21713 -14085 -25243 -28673 -10958 -12760 -7538 48 9018 6070 -437 -8981 -29630 -34508 -27792
15956 -27792 -27063 -33905 -29747 -20208 -17445 -20619 -11743 981 -3764 -12325 -15181 -7757 -5280 -9104
15942 -9104 -21859 -21423 -20334 -17692 -3970 -6614 -8154 -14811 -12059 3591 -4205 -8774 -12575 -3687
15928 -3687 8877 12215 3590 2248 5383 -5887 -8117 -2645 6655 2568 9776 7608 -4729 -683
15914 -683 2395 10780 1071 -18064 -25116 -25683 -30757 -33123 -32804 -27912 -20580 -33966 -34523 -32239 -28122
15899 -28122 -8941 -17208 -6517 -15078 -18798 -22441 -23367 -27075 -21084 -11670 -3778 -16010 -13823 -11003
15885 -11003 -14707 2146 -2911 -8183 -15134 -13747 -5923 12348 22720 17620 1512 -13039 -7921
15872 -7921 547 1075 -2964 -1117 -4140 -13455 -12273 -13609 -32221 -54078 -55677 -40783 -29665 -19904
15858a9904p771K668J9413K327k432j0962j03J2469Q008K391q994n627J0519P825
15844I827j2586o637m291k113q08K123K741k742l011p444j935Q75J0649N028K55
15829a0069J5948j5929k0547m501o138j867L547J5487K0048O815o27p843j0295
15816a5971p768o519J856O374N810P765N75L237r544M528q059Q878R138R6n263
15801d867n376p501L463p24r747J03O3J1218J1299o115o849M165p864K276J6218
15786b38j4529q812M594R976R98J002J1228n731j674Q423q801r462L610J3085
15772C669n946n597j319L874N533K237p251m352m293j3995K346J4783Q741K04
15758a366m825J487r24J795r391j750P648J2028L683j9J38j4608j7917k1721N139
$$ plain form
15858 -19904 -27675 -25007 -5594 -3267 -5699 -16661 -16764 -4295 3713 6104 -2890 -8517 2002 9827
15844 9827 -2759 -9396 -13687 -15800 -16608 -14485 -11744 -14486 -17497 -24941 -26876 -26001 -15352 -10324 -10069
15829 -10069 5879 -10050 -30597 -35098 -41236 -43103 -39556 -24069 -4021 2794 2167 -5676 -15971
15816 -15971 -23739 -30258 -28402 -22028 -16218 -8453 -7878 -4641 -14185 -9657 -17716 -8838 300 396 -4867
15801 -4867 -10243 -17744 -14281 -15005 -24752 -24649 -24586 -13368 -2069 -8184 -15033 -10868 -18732 -16456 -238
15786 -238 -14767 -23579 -18985 -9009 -8011 -7009 4219 -1512 -3186 5237 -3564 -13026 -9416 3669
15772 3669 -2277 -7874 -9193 -5319 214 2451 -4800 -9152 -13445 -27440 -25094 -10311 -1570 -1366
15758 -1366 -6191 -4704 -5628 -3833 -13224 -14974 -7326 4702 8385 8366 8504 -6104 -24021 -45742 -40603
15743d0603J2024J753o844q882J3790J2123r408j0293L479J2592m323n012J477
15730b8127N770J719J6433O091n89K488M487l729j5379j663j010L448J0992m508
15716c577j4359p299l23J2436K702k303N110l135j2921N942o37j111K537J3142
15702c796n536l560R029k059n231j033K389m831j2252J0973J2167Q018O413Q347
15688A9038k3902j8739j04J640O738J392P05J1000o918l959N476N281Q877M217
15674A0742k432L191r416n309J1226r827j9978n953J2978M816j0454m45j432P795
15660a4498J1281m469n029o556q502m936j2385o565J2352J0820K192J4706N626
15647e963o089q689p3O315Q733J2711N637r11l467l369o39p732j5711j1465O433
$$ plain form
15743 -40603 -28579 -26826 -33670 -42552 -28762 -16639 -26047 -36340 -32861 -20269 -24592 -29604 -28127
15730 -28127 -22357 -20638 -4205 1886 1297 3785 8272 4543 -10836 -12499 -13509 -10061 931 -3577
15716 -3577 -17936 -25235 -25558 -13122 -10420 -12723 -7613 -10748 -23669 -17727 -18364 -19475 -16938 -3796
15702 -3796 -9332 -12892 -3863 -5922 -11153 -12186 -9797 -14628 -26880 -15907 -3740 4278 10691 19038
15688 19038 -4864 -23603 -23707 -22067 -15329 -13937 -13232 -2232 -9150 -13109 -7633 -2352 6525 10742
15674 10742 8310 11501 2085 -3224 8002 -1825 -21803 -27756 -14778 -9962 -20416 -20861 -22293 -14498
15660 -14498 -3217 -7686 -12715 -19271 -27773 -32709 -45094 -51659 -39307 -28487 -26295 -11589 -5963
15647 -5963 -12052 -20741 -20814 -14499 -5766 6945 12582 11671 8204 4835 4196 -3536 -19247 -30712 -24279
15632b4279N884N355K474k66L931P021k579J669r99j5916j373n367k219k761j2795
15617d2220r779K6529L0559j3398j5377Q64R518O753P765k895p91j651L696Q778
15603H351R12j3071r741M193M880K570k542r741P027j921R428r198o239M330m264
15588a5026J367n34m0l324m69r444N404P988Q280J7861J1408l529j916p171j0299
15573E56K196m603j3201m613P198J0117n089n462k187j0355r822K539M016r522
15559c8232P768O135q328O493K3359r464k1058j6480Q841L0695n376l199L72J226
15545a7248L57k692K872k153O694r580P5m868j2294r335L389J6420J5692R863
15531b808j033Q278P725P901k483p588p843j774p317o430J0006p386q1J0785o568
$$ plain form
15632 -24279 -18395 -13040 -10566 -10832 -6901 120 -2459 -790 -1789 -17705 -19078 -24445 -26664 -29425 -42220
15617 -42220 -51999 -25470 5089 -8309 -23686 -22822 -13304 -6551 1214 -1681 -2472 -4123 -427 8351
15603 8351 9263 -3808 -13549 -9356 -4476 -1906 -4448 -14189 -7162 -9083 345 -8853 -15092 -10762 -15026
15588 -15026 -13659 -14193 -14233 -17557 -18026 -27470 -22066 -14078 -5798 12063 23471 19942 18026 10855 556
15573 556 2752 -1851 -15052 -19665 -12467 -2350 -7439 -12901 -15088 -25443 -35265 -32726 -28710 -38232
15559 -38232 -30464 -24329 -32657 -26164 -2805 -12269 -33327 -49807 -40966 -10271 -15647 -18846 -18474 -17248
15545 -17248 -16891 -19583 -16711 -18864 -12170 -21750 -21675 -26543 -38837 -48172 -44783 -28363 -12671 -2808
15531 -2808 -3841 4437 12162 20063 17580 9992 2149 375 -6942 -13372 -3366 -10752 -10833 -48 -6616
15516f616j6551l03O420L431j3244K335R242J5004r849r569n878K1575K995r005
15502a0013M070p391m556m187N713J3728l187N803j1549m195J8368O027j3225
15489d594j1751k371o845j5540J884J5706P223R484j302r605O264j4626j1463
15476c7536Q933J1138O024P520N546K994p439l042n5k348m647m926k078k018R63
15461b0971j92J6014k231m037K653j144N108j391j4494M799R454m722m472R971
15447e655o795K275J637n892j0399Q800Q99q313m703r40q2P677J0817L514n157
15432a2317l371k268R711R495j4174p798N073J987j2791l306p610L917J5368P474
15418a0610n196Q238N041L662j761l114J597p667o971R528n745j6608M725K569
$$ plain form
15516 -6616 -23167 -23470 -17050 -13619 -26863 -24528 -15286 -282 -10131 -19700 -25578 -4003 -1008 -10013
15502 -10013 -5943 -13334 -17890 -22077 -16364 -2636 -5823 -20 -11569 -15764 2604 8631 -4594
15489 -4594 -16345 -18716 -25561 -41101 -39217 -23511 -16288 -6804 -8106 -17711 -11447 -26073 -37536
15476 -37536 -28603 -17465 -11441 -3921 1625 4619 -2820 -5862 -5917 -8265 -12912 -17838 -19916 -21934 -20971
15461 -20971 -21163 -5149 -7380 -11417 -8764 -9908 -4800 -6191 -20685 -15886 -6432 -11154 -15626 -5655
15447 -5655 -12450 -10175 -8538 -14430 -24829 -16029 -15130 -23443 -28146 -29086 -29168 -21491 -10674 -7160 -12317
15432 -12317 -15688 -17956 -8245 1250 -12924 -20722 -15649 -13662 -26453 -29759 -37369 -33452 -18084 -10610
15418 -10610 -15806 -7568 -2527 1135 -626 -3740 -2143 -9810 -16781 -7253 -12998 -29606 -24881 -22312
15404b2312J403P959m120j0335p136n415N895J0081L399Q9P250K370K932K455
15390e485m44J5300p94k2727N088J1743m451n749j1586p500L256J5895M60q658
15376a5652l920K324n507p78o24P326J1265M539j434O633o241j385O811J1323
15362A4680O751M772r726l274N172N102n394o118j3027Q24J4466R997L79r380
15348A5224r110j5967n680j464L687P756N872n128p773k999o235O339J325N316
15334h837J2661o094N193N717n061k921M981L181j244L758P189p741m834R35M881
15319A1764L992N63n831k438L22O730R562Q771j4600p005L439p53M580m543j9199
15304d646o52P984K087O652o380j5933R210J0514Q066j7935J0985K1124L640j0991
$$ plain form
15404 -22312 -20909 -12950 -17070 -27405 -34541 -39956 -34061 -23980 -20581 -20492 -13242 -10872 -7940 -5485
15390 -5485 -5929 9371 8577 -14150 -9062 2681 -1770 -7519 -19105 -26605 -23349 -7454 -6994 -15652
15376 -15652 -19572 -17248 -22755 -23533 -24157 -16831 -5566 -1027 -2461 4172 -2069 -3454 3357 14680
15362 14680 21431 26203 16477 13203 18375 23477 18083 11965 -1062 -238 14228 24225 24604 15224
15348 15224 6114 -9853 -15533 -16997 -13310 -5554 318 -4810 -12583 -15582 -21817 -15478 -14153 -8837
15334 -8837 3824 -2270 2923 8640 3579 658 5639 8820 7576 11334 18523 10782 5948 6883 11764
15319 11764 15756 16319 10488 8050 8372 15102 24664 33435 18835 11830 15269 14516 19096 14553 -4646
15304 -4646 -5298 2686 4773 11425 5045 -10888 -1678 8836 16902 -1033 9952 31076 34716 23725
15290B3725j6627O289J928q296j2290p955N581J217o905K668J4969k601j2243
15277a0540k11P476J9378N348j4954J911K024m945N522J2324k441Q364k794j1345
15263A5117k0286J322L859K184J3679J1341l280o188m613j2453Q29N527J2281
15250A9319r485j1044N617M88N953n677r667j122R139J4073R312n029o257n200
15236A0420N928M447o870J623J4061J952k477o553J94J937Q845l922l744p550
15222A8291j0921J0634j006j1964n840M237m720Q246J1599j4003K122P342R896
15209B3913r649r453R081l050n419o106K050J6705l162q764r657j1148N665R953
15195I59J8347Q918q732j0195K304J1022j0162q878M809N326k728j3577O278Q087
$$ plain form
15290 23725 7098 13387 15315 7019 -5271 -13226 -7645 -6428 -13333 -10665 4304 1703 -10540
15277 -10540 -10751 -3275 16103 21451 6497 8408 10432 5487 11009 23333 20892 29256 26462 15117
15263 15117 -5169 -3847 12 2196 15875 27216 23936 17748 13135 682 1511 7038 19319
15250 19319 9834 -1210 4407 4895 10848 5171 -4496 -5618 3521 17594 26906 21877 15620 10420
15236 10420 16348 20795 13925 15548 29609 31561 29084 22531 22725 24662 33507 29585 25841 18291
15222 18291 7370 18004 16998 5034 -806 3431 -1289 6957 18556 4553 6675 14017 23913
15209 23913 14264 4811 13892 10842 5423 -683 1367 18072 14910 6146 -3511 -14659 -8994 959
15195 959 19306 28224 19492 9297 11601 22623 12461 3583 8392 13718 10990 -2587 3691 11778
15181A1778N725k50j5287M202M866j7757k0282Q085J1874J263N127K0397Q498
15168B8239q414j1998L420J013N422o336j4751j1681L443M071J965J714J6131
15155A2238Q651L563j0952j1668L336O054K915q203m791j2981j3201m065L735
15142b5369J0416R109O000Q703l337m029R496r460P081O564k1103q410L188M033
15128g118j716k0595K698J8259M450j445J579p468j2426J924O436n40L654P620
15114d688q51n551k076n782Q65K732K371J0228M809J539j468l035J267k208L858
15099B010k0878P589O336l917o248K1472N991J262o731K709J0725p779n648K36
15085G129r003R621J943p089o566J365n681n56Q167k155k805l934L409Q519j220
$$ plain form
15181 11778 17503 17253 1966 6168 11034 -6723 -27005 -18920 -7046 -5783 -656 19741 28239
15168 28239 19825 7827 11247 12260 17682 11346 -3405 -15086 -11643 -7572 -5607 -3893 12238
15155 12238 20889 24452 13500 1832 5168 11222 14137 5934 1143 -11838 -25039 -29104 -25369
15142 -25369 -14953 -5844 156 8859 5522 1493 10989 1529 8610 15174 -5929 -14339 -11151 -7118
15128 -7118 -8834 -29429 -26731 -8472 -4022 -5467 -3888 -11356 -23782 -21858 -15422 -15962 -12308 -4688
15114 -4688 -5539 -11090 -13166 -18948 -18083 -15351 -12980 -2752 2057 3596 2128 -907 360 -1848 2010
15099 2010 -18868 -11279 -4943 -8860 -15108 6364 12355 13617 6886 9595 20320 12541 6893 7129
15085 7129 -1874 7747 9690 2601 -3965 -2600 -8281 -8837 -670 -2825 -5630 -9564 -6155 2364 1144
15070A144j3574k038K711J8210Q208j357j2513j756O717m220n13n867o447j8553
15056b9848o578J1393O774p751q500N10P816K1127R997j4504k0314J1775J7339
15043g64K373M688m214j292O120o604j954o561J2157q931j7515j146K0129J0533
15029G019m909M720r262n70M168K278j293L584j2667R233J2799M299R867r518
15015A9748j1114j556j2063p255P607P682n907l786o134j66J6430o01j8925M112
15001a1928J2175J1819j3589m47J687p503k0852r474J5998J5781M920p10R806
14988G683k24j896j977q600K006M095O102j6031j5251J539N799k1954J1114J6781
14974a0814O897Q92j2072N011J0080M212J1224n332r371k363n566J2315R088Q594
$$ plain form
15070 1144 -12430 -14468 -11757 6453 14661 13304 791 -965 5752 1532 1019 -4848 -11295 -29848
15056 -29848 -36426 -25033 -18259 -26010 -34510 -34000 -26184 -5057 4940 -9564 -29878 -18103 -764
15043 -764 1609 6297 2083 791 6911 307 -1647 -8208 3949 -4982 -22497 -23643 -3514 7019
15029 7019 2110 6830 -2432 -3002 1166 3444 2151 5735 -6932 2301 15100 19399 29266 19748
15015 19748 8634 7078 -4985 -12240 -4633 3049 -2858 -6644 -12778 -12944 3486 2885 -16040 -11928
15001 -11928 247 12066 -1523 -1970 -283 -7786 -28638 -38112 -22114 -6333 -1413 -2123 7683
14988 7683 7459 5563 3586 -5014 -3008 1087 7189 -8842 -24093 -22554 -16755 -38709 -27595 -10814
14974 -10814 -3917 -3025 -15097 -10086 -6 4206 15430 10098 727 -1636 -7202 5113 14201 22795
14960B2795K028q547j5981p449P265Q708J6405R285K6580M6159O4650R2145P2674
14947C36717k467o2738p5244l7286J663r721k5359l7999l8357j5488J134m995
14935B9860j2344r607m841j915J504j4592l50J884L311J3615o568k453K379L44
14921B27m933O059K877q352L27j1074R408M627r512r016J2681P720o347L620J6661
14906A4973J453j6478o205P816m054q654R83J3127P446L672j7578Q483L380o397
14892A967j3078p249L855J3465Q069p552j201j008o190j3046R94J8864K2791J277
14878B1958j3460q621K583J2181Q104j6696j6589K470J7267Q000k377o122p810
14865H88q415o55k3k873J2795L99j2399l114Q645L565J5648r97n7n534o721J655
$$ plain form
14960 22795 24823 16276 295 -7154 111 8819 25224 34509 61089 107248 171898 264043 336717
14947 336717 334250 271512 196268 158982 160645 150924 125565 87566 49209 33721 34855 29860
14935 29860 17516 7909 3068 1153 2657 -11935 -12285 -10401 -7090 6525 -43 -2496 -117 227
14921 227 -4706 1353 4230 -4122 -3795 -14869 -5461 -834 -10346 -19362 -6681 1039 -5308 -1688 14973
14906 14973 16426 -52 -6257 1559 -2495 -11149 -10166 2961 10407 14079 -3499 4984 8364 1967
14892 1967 -11111 -18360 -14505 -1040 7029 -523 -1724 -2732 -8922 -21968 -20974 -2110 20681 21958
14878 21958 8498 -123 2460 14641 22745 6049 -10540 -8070 9197 17197 14820 8698 888
14865 888 -7527 -8182 -8205 -11078 1717 2116 -10283 -13397 -4752 -1187 14461 13464 13407 7873 1152 2807
14849B807m912m495P909K500r354M348r584N735J3156J858l032j973j0601J1590
14835E952n574M934L021Q360L631k964m467l735M66q543m950Q701O548q506n731
14820b857j6317M186J924O384J1333K560J2657J7627k332j3943j8367j0591J305
14807f431L36K615j453N941J066q889R05k999J574J1066k458K381p450j3595l700
14792b1091K8545n059j2703L347k13M400P458k259p279r334k4q741p830n798J4476
14777b2105K578l550j081q274j817J8737J5635j092O222J8l128k446j3562M763
14763i102P955J557l090n441O093J4468j1995q748j2354J840J4437N873o960j3024
14749a8491J2795J8317M978J113P180J0433n774l339J252q586k1995j1742O695
$$ plain form
14849 2807 -2105 -6600 1309 3809 -5545 -1197 -10781 -5046 8110 9968 6936 4963 -5638 5952
14835 5952 378 5312 8333 16693 20324 17360 12893 9158 9624 1081 -3869 4832 11380 2874 -2857
14820 -2857 -19174 -14988 -13064 -6680 4653 7213 19870 37497 35165 21222 2855 -7736 -6431
14807 -6431 -6095 -3480 -4933 1008 2074 -6815 -5910 -8909 -7335 3731 1273 3654 -3796 -17391 -21091
14792 -21091 7454 2395 -10308 -6961 -7174 -2774 4684 2425 -4854 -14188 -14212 -22953 -30783 -36581 -22105
14777 -22105 -19527 -23077 -24158 -32432 -34249 -15512 123 -969 5253 5271 2143 -303 -13865 -9102
14763 -9102 -1147 410 -2680 -8121 -2028 12440 445 -8303 -20657 -18817 -4380 1493 -5467 -18491
14749 -18491 -5696 12621 17599 18712 25892 36325 30551 27212 28464 19878 -2117 -13859 -7164
14736g164J0092r463n550L274N261K573j505j784p439o869q485P755K1376j308
14722G64n546M033m079k375M932K400O36l29Q444o163j2122Q432O609O793J181
14707A3610n291k0092j6755J2915J0821j0188R7Q274j1822l612j926M534O325
14694a3110M918R954J2819j923o788N434Mp093j2086R98K0720J6687j0836j1180
14680H518j2264o987J776J719L357Q611m685L469q815o938j98J5703j067m267
14666b068j184J763J1031N961R110N351o643j1176j3589q116K78l036P186k51
14652e383o906p205Q545J4473R969r538L120j0964j2418j008R821n014j2986N707
14638a9787Q626L075K0496J873k1242j2268n841O750J3248j5873l506l963P324
$$ plain form
14736 -7164 2928 -6535 -12085 -8811 -3550 -977 -2482 -4266 -11705 -18574 -27059 -19304 2072 764
14722 764 -4782 -749 -4828 -7203 -2271 129 765 436 8880 2717 -9405 -973 5636 12429 13610
14707 13610 8319 -11773 -28528 -15613 -4792 -14980 -14883 -6609 -18431 -22043 -23969 -19435 -13110
14694 -13110 -8192 1762 14581 12658 5870 11304 11308 4215 -7871 -6873 13847 30534 19698 8518
14680 8518 -3746 -10733 -8957 -7238 -3881 4730 45 3514 -5301 -12239 -12437 3266 2199 -2068
14666 -2068 -3252 -1489 9542 15503 24613 29964 23321 12145 -1444 -9560 -9282 -12318 -5132 -5383
14652 -5383 -12289 -19494 -10949 3524 13493 3955 7075 -3889 -16307 -17315 -7494 -12508 -25494 -19787
14638 -19787 -11161 -8086 12410 14283 -6959 -19227 -25068 -18318 -5070 -20943 -24449 -28412 -21088
14625b1088Q409J482r25j3172m374J0429R657q069j387N327J4891J379J766K032
14611F357l330o43J69R292J20j5244q002k749j425q232N254P042J5475J8113j0337
14596A1860j8113l56L1462K9115K2637L425j2623k3283l0822j7846j563J0832
14584D725Q204j4331q75K725Q792j0987k02n473N134q428j8885j3073N595R385
14570b7694k928J0598k828M856J8829l017K64Q207Q440l810n669j0753j6258k038
14556b3801K513N708p035L208J0251J9086p891m278j0741j5598r360J1730O571
14543a9637j402j261J8165R256k006O800J0175p417m975j4404j3873j1392Q27
14530c1144J1244J037m586J2492M438m387j374R26j3937J6366J8930r619j4215
$$ plain form
14625 -21088 -12679 -11197 -12122 -25294 -29668 -19239 -9582 -17651 -19038 -13711 1180 2559 4325 6357
14611 6357 3027 2384 2553 11845 11965 -3279 -11281 -14030 -15455 -23687 -18433 -11391 4084 22197 11860
14596 11860 -6253 -6609 24853 53968 76605 80030 67407 44124 13302 -4544 -6107 4725
14584 4725 12929 -1402 -2277 448 9240 -1747 -1949 -7422 -2288 -10716 -29601 -42674 -37079 -27694
14570 -27694 -30622 -20024 -22852 -17996 833 -2184 -1920 6287 14727 10917 5248 -5505 -21763 -23801
14556 -23801 -21288 -15580 -22615 -19407 -9156 9930 2039 -2239 -12980 -28578 -37938 -26208 -19637
14543 -19637 -21039 -22300 -4135 5121 3115 9915 20090 12673 7698 -6706 -20579 -31971 -31144
14530 -31144 -19900 -18863 -23449 -10957 -6519 -10906 -12280 -11354 -25291 -8925 10005 386 -13829
14517a3829M580k89n516O98m92M539N910l899j304J025J2600j886Q509J60j0185
14502F21n512P764M275L721j1324j4100Q153J0033J4357n116j8756l929M987L047
14488a779N450l276O482O606n143J4795L210n194o513O071j070j7171r807q010
14474a5349j1294n31K341n743K050J2893L130j918N028R33J303n483o17o568J2380
14459g445J1549j872q774L331M463O537o71l230N473k989q570J0249n933j8565
14445a6447P316O445n75J600p294n828n288j0814N2j793Q410j288k974K0292l125
14430a1311p914L665n15k16N863O769K2533R857j9514K990n617j1287p564m666
14416a6927J8711R261L235n41j5889r094j4771J1124J8265J0061j6891p802J327
$$ plain form
14517 -13829 -9249 -9538 -15054 -14356 -14848 -10309 -4399 -8298 -9602 -8577 4023 2137 10646 10806 621
14502 621 -4891 2873 7148 10869 -455 -14555 -6402 3631 17988 12872 -5884 -9813 -4826 -1779
14488 -1779 3671 395 6877 13483 8340 23135 26345 21151 14638 20709 19639 2468 -7339 -15349
14474 -15349 -26643 -27174 -24833 -30576 -28526 -15633 -12503 -14421 -9393 -8460 -7157 -12640 -13257 -19825 -7445
14459 -7445 4104 2232 -6542 -3211 1252 7789 7118 3888 9361 6372 -2198 8051 2118 -16447
14445 -16447 -9131 -2686 -3261 -1661 -8955 -14783 -20071 -30885 -30833 -32626 -24216 -25504 -28478 -8186 -11311
14430 -11311 -19225 -15560 -16075 -16291 -10428 -3659 18874 28731 9217 12207 6590 -4697 -12261 -16927
14416 -16927 1784 11045 14280 13739 -2150 -11244 -26015 -14891 3374 13435 -3456 -11258 -9931
14403i931Q197l05p225m307J2645M034J899q045J072P781Q236p305K878j26p831
14388A667j0437J3959J5380o198M551o752q137r911P487M762q665N215j3302r49
14374a1330r834L384J827R432K04O315j773j527P958l679k183n258L338j0295
14360a3421P102r086K210m16J4458l942m178R906o276j1862J2734J7571m269k017
14346H514q907R703j2994p831K640K527j56R551k607r188J034J1827Q450p608
14332D955N015O564P819L365j524n351m782j4131l295J2127J4847O173j1914k0457
14318e89N234J545k959n341j2914l773P440m952J2205J3726K457j1473N454P788
14304A3848O826j5009j5248M66r20O560M164o011o699k68J578J429R849J1683
$$ plain form
14403 -9931 -1734 -2039 -9264 -13571 -926 3108 5007 -3038 -1966 5815 14051 6746 9624 9498 1667
14388 1667 -8770 5189 20569 14371 18922 12170 4033 -5878 1609 6371 -2294 2921 -10381 -11330
14374 -11330 -21164 -17780 -15953 -6521 -6317 -2 -1775 -3302 4656 977 -1206 -6464 -3126 -13421
14360 -13421 -6319 -15405 -13195 -13611 847 -3095 -7273 2633 -3643 -15505 -2771 14800 10531 8514
14346 8514 -393 9310 -3684 -11515 -8875 -6348 -6504 3047 440 -8748 -7714 4113 12563 4955
14332 4955 9970 16534 24353 27718 26194 20843 16061 1930 -1365 10762 25609 31782 19868 -589
14318 -589 4645 6190 3231 -2110 -15024 -18797 -11357 -16309 -4104 9622 12079 606 6060 13848
14304 13848 20674 5665 -9583 -9117 -10037 -3477 687 -5324 -12023 -12291 -10713 -9284 565 12248
14290A2248P65L975J756l271M026n47j9173k283K4288p77j5368q764N772K371
14276E018J0271L882J6805l000k1083j2072n656J4252Q213p955N259m691j9537
14263a0294q335N263N488m665j1289k692K293L35n150J1675J0455k979j5144R734
14249a5305J8488k24Q728J3821o262p729r74p324k9260k153N821j193M717N098
14235a3751M760k590j5625P041Q36o099q95j532Q730L258Q581m39m259J5733N291
14220I040N07o031r176J3216J2594j0267k573J2357J2825q651j1213n015l849
14207C764M27k776p048Q795L406o526Q119J6009J085j0918m387J0965q176J29
14193A2868k782j0776P324J935q365k013J8331J0116m374p422q494r517j1658
$$ plain form
14290 12248 13013 16988 18744 15473 19499 18952 -221 -2504 21784 21007 5639 -3125 2647 5018
14276 5018 15289 19171 35976 32976 11893 -179 -5835 8417 16630 8675 13934 9243 -10294
14263 -10294 -18629 -13366 -7878 -12543 -23832 -26524 -24231 -23896 -29046 -17371 -6916 -9895 -25039 -15305
14249 -15305 3183 2959 11687 25508 19246 11517 10543 3219 -26041 -28194 -22373 -23566 -18849 -13751
14235 -13751 -8991 -11581 -27206 -20165 -19329 -25428 -26323 -27855 -19125 -15867 -7286 -7725 -11984 3749 9040
14220 9040 9547 3516 -5660 7556 20150 9883 7310 19667 32492 23841 12628 7613 3764
14207 3764 4191 1415 -5633 3162 6568 42 8161 24170 25255 14337 9950 20915 12739 12868
14193 12868 10086 -690 6634 8569 204 -1809 16522 26638 22264 14842 6348 -3169 -14827
14180a4827q555j377J1270N446J308J3m456J928j2409l700M631J7708L042r853
14166i831M412M325J198L422Q189o069j9348N25J6548j258q34N596N375k227p544
14151B479n771j490J0186j1549q074l354R850L23J856R956Q731j000j0666K735
14137D212m580M39n812j0908J2777N156q532j8353J897l28M362J429Q977J4655
14123E391j1128j6157K906P872m89j0065M054K09j921R951J630j0345L794m082
14109a8380m544R93M414l169j257J8825P351J0458J4615n932j3239q764n907j959
14095f495o006j4663j904J2033P441r05k712M124n468j488L509J6504J1978P649
14081B3597o776J437K85N059Q49q855j5617q493p082J661j2219j2463k976J5403
$$ plain form
14180 -14827 -23382 -24759 -13489 -8043 -6735 -6722 -11178 -9250 -21659 -25359 -20728 -3020 22 -9831
14166 -9831 -5419 -1094 104 3526 11715 5646 -13702 -13177 3371 2113 1279 6875 12250 10023 2479
14151 2479 -3292 -4782 5404 -6145 -14219 -17573 -7723 -7400 -5544 4412 13143 12143 1477 4212
14137 4212 -368 71 -5741 -16649 -3872 1284 -7248 -25601 -23704 -24032 -19670 -18241 -9264 5391
14123 5391 -5737 -21894 -18988 -11116 -11605 -21670 -17616 -17407 -19328 -9377 -7747 -18092 -14298 -18380
14109 -18380 -22924 -21931 -17517 -20686 -21943 -3118 4233 14691 29306 23374 10135 1371 -4536 -6495
14095 -6495 -12501 -27164 -29068 -17035 -9594 -10499 -13211 -9087 -14555 -16043 -12534 3970 15948 23597
14081 23597 16821 18258 18543 23602 24451 15596 -21 -8514 -15596 -13935 -26154 -38617 -41593 -26190
14067b6190J7092n097J363J7691J3667M457j6212j5753o905P765J3772j039J428
14054F039L998L741j192J661q65j4519p197L565N119R769k094m588j72p849m540
14039i124r473N203R131O591J5101R529J182k4269K516p843n699N552K859L072
14025D328j3703p512J0750P967n109m020j046O215K938J77p50k004k233j4810
14011a8812N577K2667j221j1522k193Q236K120O149r333j0469j2338J3337J9468
13998A1666n968p532n241K52J114j4605j313K3646J4771K959Q27k094O73m383
13984A4772j0235j8038m152J0336J7702Q494M431k1184K836O653n470P019J8598
13971C1762j2510k6989P245Q916r327j1105n167J4758R499p555O987J5048q914
$$ plain form
14067 -26190 -9098 -14195 -12832 4859 18526 22983 6771 -8982 -15887 -8122 5650 4611 6039
14054 6039 10037 13778 12586 14247 13382 -1137 -8334 -4769 350 10119 8025 3437 3265 -4584 -9124
14039 -9124 -18597 -13394 -4263 2328 17429 26958 28140 3871 6387 -1456 -7155 -1603 1256 4328
14025 4328 -9375 -16887 -6137 1830 -3279 -7299 -8345 -2130 808 985 235 -1769 -4002 -18812
14011 -18812 -13235 9432 8211 -3311 -5504 2732 4852 11001 1668 -8801 -21139 -7802 11666
13998 11666 5698 -1834 -7075 -6823 -5709 -20314 -21627 2019 16790 19749 20576 18482 19155 14772
13984 14772 4537 -13501 -17653 -7317 10385 18879 23310 2126 4962 11615 6145 13164 31762
13971 31762 19252 -7737 -492 8424 -903 -12008 -17175 -2417 7082 -473 6514 21562 12648
13958A2648j3245l834P894m200J2286J0249m610n533q295l951k859P780m630j6845
13944a7145L058Q440L433N72J8067j0471j0958P913J811J3873k869j0232K319
13931G811k265M16q120o932K185J088K650M875q129M806o047J614j0609k369J6864
13916b162R177q492j5930N788J8216J2783R59L688J78j4374o690r745j2783N057
13902a4330J9905J4406K003Q818L971j0312j4149J5292K03m320j2835j1256j115
13889c719o880j3868O949J2627O00J253J853M98j0262J5730J8827l636O08j0450
13875A0130L313k878k779R255J573J879j507j5228k760l009J3328m086j848M128
13861I511n757J843O909k852J726q354l303l305M102P797K522l162N793J674k472
$$ plain form
13958 12648 -597 -4431 3463 -737 11549 21798 17188 11655 3360 -591 -3450 4330 -300 -17145
13944 -17145 -14087 -5647 -2214 -1642 16425 5954 -5004 2909 4720 18593 15724 5492 7811
13931 7811 5546 5962 -2158 -9090 -6905 -5817 -3167 1708 -6421 -1615 -7662 -6048 -16657 -19026 -2162
13916 -2162 7015 -1477 -17407 -11619 6597 19380 20339 24027 24205 9831 3141 -6604 -19387 -14330
13902 -14330 5575 19981 21984 30802 34773 24461 10312 25604 25807 21487 8652 -2604 -3719
13889 -3719 -10599 -24467 -17518 -4891 -4291 -3038 -1185 -687 -10949 4781 23608 19972 20580 10130
13875 10130 13443 10565 7786 17041 18614 20493 18986 3758 998 -2011 11317 7231 5383 9511
13861 9511 3754 5597 12506 9654 11380 3026 -277 -3582 520 8317 10839 7677 13470 15144 12672
13846A2672j445n098J7169R674q254j6239N335M963j1931l086L118M215J8941
13833C0034J822j2714q822j4741J095j328J0054l238p208R435J8530j988j323
13820A9608K467J762l74j1230j433p981R419M648j3183p310P124J2587M166j0491
13806I779q683n426N579J197R228J4446p352m727N924N056k448p10p604j6825
13792b566Q326n705j4437n890l467O784J7875R270N003m339L278J0140r103j2109
13778C060p498R039m636q6L169O697J8455Q816r976k1046j0326J0176J6094k400
13764A9538L924q710j107l021L650K343p820o646m513N729n778j6353k008J3346
13750g426K1596m304j1128J0474J5528P057j846q44n894p75j342o868J098r287
$$ plain form
13846 12672 11227 6129 23298 32972 24718 8479 13814 18777 6846 3760 6878 11093 30034
13833 30034 31856 19142 10320 -4421 -3326 -4654 5400 2162 -5046 4389 22919 20931 19608
13820 19608 22075 23837 23463 12233 10800 2819 12238 16886 3703 -3607 3517 16104 20270 9779
13806 9779 1096 -4330 1249 2446 11674 26120 18768 14041 19965 25021 22573 21863 14259 -2566
13792 -2566 5760 55 -14382 -20272 -23739 -16955 920 10190 15193 10854 14132 24272 15169 3060
13778 3060 -4438 4601 -35 -121 3048 9745 28200 37016 27040 5994 -4332 5844 21938 19538
13764 19538 23462 14752 13645 10624 14274 16617 8797 2151 -2362 3367 -2411 -18764 -20772 -7426
13750 -7426 14170 9866 -1262 9212 24740 31797 29951 29107 23213 22438 21096 14228 15326 6039
13736F039j3393j4398j878J4961J0506m536K567k070K07K628M282O748K767j0405
13722D025j2867P903P253j6849o480J1945R381N728q286o556J1079J2711J892
13709B0879J41n120j0158J0559l175M882K310j8708Q02J1420j1363j6259K145
13696a1645J4837O089m037o112q116N433k001L797P169K427J7137L412Q32K301
13682C1523o31J126k3524j0118j061L889j414o285J1j159k60K882r493L1R785
13667d698J0110j1347Q55J6986J5648m130n40n77j744j7382L71N354L556q088
13653D374Q628R728j5356N339O160l495K026K373j1274K597P662n156k923n791
13639D892q263L431j544o042P008L874L349J1883J5763j287r605p654j3845J929
$$ plain form
13736 6039 -7354 -21752 -23630 -8669 1837 -2699 -132 -2202 -1995 633 4915 11663 14430 4025
13722 4025 -8842 -939 6314 -10535 -17015 -5070 4311 10039 1753 -4803 6276 18987 20879
13709 20879 21020 15900 5742 16301 13126 18008 20318 1610 2412 13832 2469 -13790 -11645
13696 -11645 3192 9281 5244 -868 -8984 -3551 -5552 -1755 5414 7841 24978 28390 29222 31523
13682 31523 30892 32018 8494 -1624 -2685 1204 -210 -6495 -6484 -7643 -7903 -5021 -14514 -14483 -4698
13667 -4698 5412 -5935 -5080 11906 27554 23424 22884 22307 20563 3181 3552 8906 12462 4374
13653 4374 13002 22730 7374 12713 18873 15378 17404 19777 8503 11100 18762 13606 10683 4892
13639 4892 -3371 60 -1484 -7526 -518 3356 6705 18588 34351 33064 23459 15805 1960 3889
13625C889o594M707J3951R941k575j0254j2746O790P707J1030R99K852M65p359
13611B2803j2117R894J7930M284r618p83j721j014n612j294n138j582M38J0969
13597B7439j847Q977J2581l61q277j1347j8529m986J1326J4768O907k0612M701
13584B0740j086J4000K107n900k193n637N714l336m894j3981J1019J098J658L470
13570B2779r731n680J2086j528o249M286R101O68M11j8836k009N802J3175j921
13556B2354j3974o461K410N541J3993J4847J0229l114r466l6q577N259Q846J0304
13542E2155n698j6394N2M724K691K556q482M375j6352n683J2775m033O784O024
13528C5494L844j6358r592Q015Q98j7524o415J6114J0798K821p830o955j579l770
$$ plain form
13625 3889 -2705 2002 15953 25894 23319 13065 319 7109 14816 25846 26845 29697 30162 22803
13611 22803 10686 20580 38510 42794 33176 32393 30672 29658 24046 22752 17614 16032 16470 27439
13597 27439 25592 34569 47150 46789 38512 27165 8636 3650 14976 29744 36651 16039 20740
13584 20740 19654 33654 35761 29861 27668 22031 27745 24409 19515 5534 16553 17651 19309 22779
13570 22779 13048 7368 19454 17926 11677 15963 25064 25732 26143 7307 5298 11100 24275 22354
13556 22354 8380 1919 4329 9870 23863 38710 48939 45825 36359 36323 27746 33005 41851 52155
13542 52155 46457 30063 30115 34839 37530 40086 31604 35979 19627 13944 26719 22686 29470 35494
13528 35494 39338 22980 13388 21403 22301 4777 -1638 14476 25274 28095 20265 13310 11731 7961
13514G961J1409r30r379P45J1106J0317M822K075k395J982o212l301L766J0202
13500D2168N054K049n911o66K486l050j0851J078K846r972m014K309J3395N234
13486D2155q703m460N220J5498Q335k257O249o993j5092j379j3377o282O131J0368
13472C5413J2199j672l456L002j621O43j0116K804Q359r042j584J199J650P622
13458D5400p42j1280K68l036n628L254M473J5721J3544n555m456j4004j6287Q216
13444B9888M112J4059J093j1674N516Q998m034M07l737k407K1491J9812O434l565
13430H6393j4049O269l211K63j2477L8M459p289n505l457L993j8162r597M695
13416C2363M888O522L776M198M009J3428J5156K1875R656m251p530j7205k150
$$ plain form
13514 7961 19370 18440 9061 9806 20912 31229 36051 38126 35731 37713 31501 28200 31966 42168
13500 42168 47222 49271 43360 42694 45180 42130 31279 32357 35203 25231 21217 23526 36921 42155
13486 42155 33452 28992 34212 49710 58045 55788 62037 55044 39952 38573 25196 18914 25045 35413
13472 35413 47612 45940 42484 45486 43865 44508 34392 37196 45555 36513 34929 36128 37778 45400
13458 45400 44658 33378 33646 30610 24982 28236 32709 48430 61974 56419 51963 37959 21672 29888
13444 29888 34000 48059 49152 37478 42994 51992 47958 48365 44628 42221 63712 83524 89958 86393
13430 86393 72344 78613 75402 75665 63188 63226 67685 60396 54891 51434 55427 37265 27668 32363
13416 32363 37251 43773 47549 51747 55756 69184 84340 106215 115871 111620 104090 86885 84735
13403H4735Q997l23j5430r764j3988m716j590p36l61r168Q242R239J3007J803
13389F9947j0181R335k835K26J354Q249J2965J4996J3342J4525R354J030L339
13376A45646J5104J2089K4316L1034N1923Q7717J19202J63474K28121K60459K13760
13365A352845J02101p1510k21396k50747k10693j53234r5982o1877m8023l9946
13355C01538l3381k5671j1294k694j0074j3357L728N210j4096j4586n12j654K276
13342A85433o36j0512j4507o621L898K3637P255j659N058o26k29J789j9377k1473
13328A51430l016r223j5645P561J1232r633j55j673j1221j541P138J0702O387
13315A42343J766J021J1690J4852j514O827q180L464K890n062J704k6381r061
$$ plain form
13403 84735 93732 93409 77979 68215 54227 49511 47921 47185 46824 37656 45898 55137 68144 69947
13389 69947 59766 69101 66266 66492 67846 76095 89060 104056 117398 131923 141277 142307 145646
13376 145646 160750 172839 197155 228189 280112 367829 487031 650505 878626 1139085 1352845
13365 1352845 1454946 1383436 1162040 911293 700600 547366 451384 389507 341484 301538
13355 301538 268157 242486 231192 228498 218424 205067 208795 214005 199909 185323 184811 183157 185433
13342 185433 184797 174285 159778 153157 157055 180692 187947 186288 191346 190720 190491 192280 172903 151430
13328 151430 148414 139191 123546 131107 142339 132706 132551 130878 119657 118116 125254 135956 142343
13315 142343 144109 145130 156820 171672 170158 176985 168805 172269 175159 170097 171801 145420 136359
13302A36359J162N833J217j2421k1086P898J409j547K813P670J0915l717k2617
13289A13888P8J0518K903j4361p891N161l773j94Q740L272J549r222m282j4q242
13274I8130P963J251j0242J409k435j740P890j0942q63J5154J860O721m766k2083
13260H7307K368J4108N994J2826K594n768n82K7182J7182l363n392l287Q462M878
13246A64509K501r895p060j0235o298Q299K551m349r437r52K666j8545j4617j0552
13232H8586m053J5090N903O398m979m13Q4M265r144L412J811m853r642k910m431
13217H5124K705O50j663n229j0889J2542J1416J0179r605j5117o376L579N423
13204H2739K0339n430j1569O728K1478K3197J9384k464J2597R298P377J1347n073
$$ plain form
13302 136359 137521 143354 144571 132150 111064 118962 120371 118824 121637 129307 140222 136505 113888
13289 113888 113966 124484 127387 113026 105135 110296 106523 106329 115069 118341 119890 110668 106386 106372 98130
13274 98130 106093 107344 97102 98511 96076 94336 102226 91284 90421 105575 107435 114156 109390 87307
13260 87307 89675 103783 109777 122603 125197 119429 118847 146029 163211 159848 154456 151169 159631 164509
13246 164509 167010 157115 150055 139820 133522 141821 144372 140023 130586 129634 132300 113755 99138 88586
13232 88586 84533 99623 105526 111924 106945 106532 106616 110881 101737 105149 106960 102107 92465 89555 85124
13217 85124 87829 88479 86816 81587 70698 83240 94656 104835 95230 80113 73737 77316 82739
13204 82739 103078 97648 86079 92807 114285 137482 156866 154402 166999 176297 183674 195021 189948
13191A89948m699j1632l0065j6520j0479m540p123m147R612R01P32k924j3666
13178I5398n801j540m059J4876J5737P574m537l385p249j271J1314L346j0815
13165A09588M629O882J159q778L255j824O490n636P776j426M416P951J8975J1251
13151A64708j938l617j4558j8663J4702J0690Q065J6586J6092J0452n494J3575
13139B10600K8134K3204n190j1085j1315k6556k3628L418J4647J6933j819j1082
13127B06261j5172M473K317m806M444O508K601J030j6437k1362O888l927j4367
13114A58451j2526q179n453M200k606j629Q85Q689q453j4906P772J3203l548j9431
13100A16469O223K0103K8883J1142K2448J4086j5501q280J228j0555m36N068J0083
$$ plain form
13191 189948 185249 173617 143552 127032 116553 112013 104890 100743 110355 111256 111988 109064 95398
13178 95398 89597 88057 83998 98874 114611 122185 117648 114263 107014 105743 117057 120403 109588
13165 109588 114217 121099 122258 113480 116735 114911 121401 115765 123541 122115 126531 134482 153457 164708
13151 164708 162770 159153 144595 125932 140634 151324 159389 175975 192067 202519 197025 210600
13139 210600 238734 261938 256748 245663 234348 207792 184164 187582 202229 219162 217343 206261
13127 206261 191089 195562 197879 193073 197517 204025 206626 207656 191219 169857 176745 172818 158451
13114 158451 145925 137746 132293 136493 133887 132258 133143 141832 133379 118473 126245 139448 135900 116469
13100 116469 122692 142795 171678 182820 205268 219354 203853 195573 196801 186246 185810 190878 200961
13087B00961k04m506j0853R326l786r763K909p12n464k395n543l212j6660j0010
13073A40088J503r393r420o060Q05K6955N4087P2671J02726O9756K5632J580r434
13060D61496p5J2887K2182J2844j4667j2444j9723N807j273o350k851j9909l718
13047D34206O839J1837Q546n797J9190L0551K8864J7428J0997J3168L8466N4120
13035F68415O0020P3262J29294K30894L57824M88672N03339L18672n1003m65746
13025B313643n36128l54944j87742j00617p3853p0345n1327n1143m4819k4967
13015H17758j700P381K1782L3140L4888K2274L7376K0149N682q490M061P924r86
13002A001239Q361L231k0799j262J7976J677J1710M3513M9422K5272J1277Q539
$$ plain form
13087 200961 200757 196251 185398 194724 190938 181175 184084 183372 177908 175513 169970 166758 150098 140088
13073 140088 141591 132198 122778 116718 117523 144478 198565 271236 373962 443718 469350 470930 461496
13060 461496 461421 474308 496490 509334 494667 482223 462500 468307 467034 460684 457833 437924 434206
13047 434206 441045 452882 461428 455631 474821 505372 534236 551664 562661 575829 614295 668415
13035 668415 728435 801697 930991 1161885 1519709 2008381 2511720 2830392 2779389 2313643
13025 2313643 1777515 1422571 1234829 1134212 1060359 990014 938687 887544 842725 817758
13015 817758 816058 823439 845221 878361 913249 935523 972899 993048 998730 990240 994301 1002225 1001239
13002 1001239 1009600 1012831 992032 990770 1008746 1010423 1022133 1065646 1115068 1140340 1151617 1160156
12990A160156J5461L5896N2768N2008P2019O6366N2926N9806N8993O8778N8960
12979A754137O1116Q0132R8012J13929J10282R4901R5307J08079J28758J49911
12969B794564J67576K05743K42495K75394L05191L36998M27031N44258P09662
12960F008912Q66823R97560J079145J117896J143828J230882J392062J611328
12952A5448436J958084K571347L637707N268159P760176J1760846J8275713K8362929
12944I5043397M1340085N2058324N1553555L3362141q79680l7110915n4344886
12937A81022021m8198866l3300304k1156257j3788514r633407p128762n414957
12930D2400954m064960l009765k274498j827113j613769j510500j425278j341467
$$ plain form
12990 1160156 1175617 1211513 1264281 1316289 1388308 1454674 1507600 1567406 1626399 1695177 1754137
12979 1754137 1815253 1895385 1993397 2107326 2217608 2312509 2407816 2515895 2644653 2794564
12969 2794564 2962140 3167883 3410378 3685772 3990963 4327961 4754992 5299250 6008912
12960 6008912 6875735 7873295 8952440 10070336 11214164 12445046 13837108 15448436
12952 15448436 17406520 19977867 23615574 28883733 36643909 48404755 66680468 95043397
12944 95043397 136383482 188441806 239995361 273357502 272477822 235366907 181022021
12937 181022021 132823155 99522851 78366594 64578080 54944673 47815911 42400954
12930 42400954 38335994 35326229 33051731 31224618 29610849 28100349 26675071 25333604
12922B5333604j264200j269089j288934j170993r61752q09730p28582o89627o46279
12913A6504418o40971o12177n91355o09608o21389o10846n88587n49438m89973
12904A1190074m39827m10686m02208l73484l36409l05396k54665j97582j81587
12895H288230j74076j73424j86360j96245j98694j94681k17557k26817k09693
12886F510683j82968j75110j79254j83440j95724j69119j54023j40057j15744
12877E015244j20897j43958j36778j19785j17266j20922j06863j03948j10948
12868C933879j00702j06349r5803r9532r2314q9523q8050q2622p7198m5043m7594
12857C009149q7876q1515p2983p7004p5249o4868o0508n6790m2622l6658n2854
$$ plain form
12922 25333604 24069404 22800315 21511381 20340388 19378636 18568906 17840324 17150697 16504418
12913 16504418 15863447 15251270 14659915 14050307 13428918 12818072 12229485 11680047 11190074
12904 11190074 10750247 10339561 9937353 9563869 9227460 8922064 8667399 8469817 8288230
12895 8288230 8114154 7940730 7754370 7558125 7359431 7164750 6947193 6720376 6510683
12886 6510683 6327715 6152605 5973351 5789911 5594187 5425068 5271045 5130988 5015244
12877 5015244 4894347 4750389 4613611 4493826 4376560 4255638 4148775 4044827 3933879
12868 3933879 3833177 3726828 3631025 3531493 3439179 3349656 3261606 3178984 3101786 3056743 3009149
12857 3009149 2921273 2839758 2766775 2689771 2614522 2549654 2489146 2432356 2389734 2353076 2300222
12846B300222n0018k7738k3726p287l6018n9978o0525m7018m6027o0476n5683
12835A825728n1043l3341m2032k6457j6276j7464l8299m3953n4282o8635n4211
12824A379735m5064n7126l9767n0967p4408m9098m3806k8946j2889o596k6756
12813I44312n086k5478l0553l1252k8090l9010l7638l8719m3795l8080l0288k9423
12801E66900k4783l0575k6831j4296j4298k5982j8530o95j644J4753j451k938
12789D19630J3860J0773J096m26K3836K0577R515N383P735P377K1008J0459k6363
12776E24460n1914l1717J9233K0521J1873J5143Q940q549j1331j1251k8631l9564
12764D17213l1237m693P249P056J6261Q625n132N515J2647J0865m517j9273l6277
$$ plain form
12846 2300222 2250204 2222466 2198740 2191453 2155435 2095457 2034932 1987914 1941887 1881411 1825728
12835 1825728 1774685 1741344 1699312 1672855 1656579 1639115 1600816 1556863 1502581 1433946 1379735
12824 1379735 1334671 1277545 1237778 1186811 1112403 1063305 1019499 990553 977664 971068 944312
12813 944312 939226 913748 883195 851943 823853 784843 747205 708486 664691 626611 596323 566900
12801 566900 542117 511542 484711 470415 456117 430135 411605 410910 409266 424019 422568 419630
12789 419630 433490 444263 445359 444933 468769 489346 498861 504244 511979 519356 540364 550823 524460
12776 524460 472546 440829 460062 480583 492456 507599 516539 507990 496659 485408 456777 417213
12764 417213 385976 381283 388532 395588 411849 420474 415342 420857 433504 444369 439852 420579 384302
12751C84302j7545p867N742Q009J8371L1163K7647K2169j743j0074r880J4766
12739D65060J4214J1100R869J6526J4615L129k189J3654J3112J0225L10l241K0684
12726E87068L0303N7564P5072Q4525R2500J17596J56422K38756L26895L79404
12716B146105L67249L27567K39784J00185j42510l17377l42980k82476k14925
12707A880622j66897j21140q9273p5440p7945o8354m0157j6622j8455l3341r267
12696A163731k2352j9082k5965k0848k9518r259J2661Q800J1877M989P461J8049
12684A100544L6122K6065M0445J05057J97369K50614K10388P3272j52074k88696
12674A599106k32213j32169n7496k665j2735l4521m2205m2658r615Q420P128K2981
$$ plain form
12751 384302 366757 358890 364632 372641 391012 422175 449822 471991 470248 460174 450294 465060
12739 465060 479274 490374 500243 516769 531384 534513 532324 545978 559090 569315 569625 566384 587068
12726 587068 617371 674935 750007 834532 927032 1044628 1201050 1439806 1766701 2146105
12716 2146105 2513354 2840921 3080705 3180890 3038380 2721003 2378023 2095547 1880622
12707 1880622 1713725 1592585 1503312 1427872 1349927 1281573 1241416 1224794 1206339 1172998 1163731
12696 1163731 1141379 1122297 1096332 1075484 1045966 1036707 1049368 1058168 1070045 1075034 1082495 1100544
12684 1100544 1136666 1162731 1203176 1308233 1505602 1756216 1966604 2039876 1887802 1599106
12674 1599106 1366893 1234724 1177228 1174563 1161828 1127307 1085102 1042444 1032829 1041249 1048377 1071358
12662A071358J8183L4559M4399M5112L3401N7318M3708J7631J0519Q317J2989
12651A397494K7072J8056j691r347k1713j6450L4607Q8280Q3575L6034Q463K1184
12639A665564K6171O0631R8125J25384J48279J52048J75287K06147K33296K76309
12629C167241L79467N60439Q10376J121616J224140R55157L13776n40676j016562
12620F974974q41342m91475j68425K8638J24025J66053J98221K56854L63064M66433
12610G077020N31283N90044P20594R69133J241737J538912J915544K445349L114035
12601B0143651L834812M682123N749573P181903R313002J3457269K1988580L7255409
12593A23606322O1492185Q8951711R9024534P4281358J4994595p0532075j12070602
$$ plain form
12662 1071358 1089541 1124100 1168499 1213611 1247012 1304330 1348038 1365669 1376188 1384505 1397494
12651 1397494 1424566 1442622 1440931 1431584 1409871 1393421 1428028 1516308 1599883 1635917 1644380 1665564
12639 1665564 1691735 1752366 1850491 1975875 2124154 2276202 2451489 2657636 2890932 3167241
12629 3167241 3546708 4107147 4917523 6039139 7263279 8218436 8532212 7991536 6974974
12620 6974974 6133632 5642157 5473732 5502370 5626395 5792448 5990669 6247523 6610587 7077020
12610 7077020 7608303 8198347 8918941 9888074 11129811 12668723 14584267 17029616 20143651
12601 20143651 23978463 28660586 34410159 41592062 50905064 64362333 86350913 123606322
12593 123606322 185098507 274050218 373074752 447356110 462350705 391818630 279748028
12586B79748028q5879129n0539135k9244171j8191617j2490362r516391p964888
12579F5922335p080699n874526m480148l512623k934035k536894k272411k048052
12571C5182947j847205j675137j444879j174544r67132q97145r09087r15041r12377
12562B4440400r11525q66717q39976q69658r08538q99379q71989q19406p50666
12553A6702546o72442o01092n79652o05098n80812n03912m25134l40891k75359
12544A2118154k24187k00756k28390k41054k61423k89125l30666l41117l11316
12535I690120k57113k28761k29146k48807k59650k49087j71312j03422m1849K0519
12525G921492O8628M5129o6811k75880m49533m04785k84179k13834j59266j15956
$$ plain form
12586 279748028 193868899 143329764 114085593 95893976 83403614 73887223 65922335
12579 65922335 58841636 52967110 48486962 44974339 42040304 39503410 37230999 35182947
12571 35182947 33335742 31660605 30215726 29041182 28074050 27176905 26267818 25352777 24440400
12562 24440400 23528875 22662158 21822182 20952524 20043986 19144607 18272618 17453212 16702546
12553 16702546 16030104 15429012 14849360 14244262 13663450 13159538 12734404 12393513 12118154
12544 12118154 11893967 11693211 11464821 11223767 10962344 10673219 10342553 10001436 9690120
12535 9690120 9433007 9204246 8975100 8726293 8466643 8217556 8046244 7942822 7900973 7921492
12525 7921492 7990120 8035249 7968438 7692558 7243025 6838240 6554061 6340227 6180961 6065005
12515F065005p2145j9594M9473R4536P2825k4888j89947l23941l61058l14531
12505D975735k63957k31352j85638j45341j17153j07949r5144j02323j13027r8977
12495C514874r3283q2187o0730l3579l2460m6329k5058P850J7678L2332P1781
12484C270889J61849K80949N20376P82120Q39157N68716n4212p83983q91216m83043
12474D211602j74996r7431j35704k82713l92299k98170j83680j18919n9789m1162
12464B426739n1479o8117j13504j66161j79913j62794j18410r2812q5103o8778
12454A319668m9079n4384o2671m2712l5960j9057k2843l9423m2156l3881j2834
12443I04668K8799N8385J22733J73832K95746M75578P21342Q83267P28290K32076
$$ plain form
12515 6065005 5992860 5973266 6022739 6117275 6190100 6165212 5975265 5651324 5290266 4975735
12505 4975735 4711778 4480426 4294788 4149447 4032294 3924345 3829201 3726878 3613851 3514874
12495 3514874 3421591 3339404 3278674 3245095 3212635 3166306 3141248 3149098 3166776 3199108 3270889
12484 3270889 3432738 3713687 4234063 5016183 5855340 6424056 6369844 5585861 4694645 4211602
12474 4211602 4036606 3939175 3803471 3520758 3128459 2830289 2646609 2527690 2467901 2426739
12464 2426739 2375260 2307143 2193639 2027478 1847565 1684771 1566361 1473549 1388446 1319668
12454 1319668 1270589 1216205 1153534 1110822 1074862 1055805 1032962 993539 951383 917502 904668
12443 904668 933467 991852 1114585 1288417 1584163 2059741 2781083 3664350 4392640 4624716
12433D624716n08403j008618p81802m83025k69200j54221r5662p1639p0759n5323
12423A126064k0850k0564m1956n2163m9063m5156k4360j8804l3800l6847l3462
12412G49039j9365j9140l2468k4683j0955N064J238r046j1498k4167k3333j4709
12400E65977J5838M2368K3358P911K0183P2791J22283J95367K91980K77686J70314
12389A806056p0761k97193l06538k06218j03073n5777l3326k3413j8901j6739
12379F74117k5066k5794m5459n4096k7212n609R661n488J863j4855k0497j0330
12367D51235j7638M90j1642k07Q66m931m161n756m739j0556J3855R371J7645J6711
12353D50543l374k859J1970l700n576Q46l405j3734j5369q29j4024k0938j9275
$$ plain form
12433 4624716 4116313 3107695 2325893 1842868 1573668 1419447 1323785 1252146 1181387 1126064
12423 1126064 1105214 1084650 1042694 990531 941468 896312 871952 853148 819348 782501 749039
12412 749039 729674 710534 678066 653383 642428 647492 648730 639684 628186 604019 580686 565977
12400 565977 581815 624183 647541 655452 675635 748426 870709 1066076 1358056 1635742 1806056
12389 1806056 1735295 1438102 1131564 925346 822273 766496 733170 709757 690856 674117
12379 674117 649051 623257 577798 523702 496490 490881 500542 495054 496917 482062 461565 451235
12367 451235 433597 434087 422445 422238 423104 418173 414012 408256 403517 392961 406816 416187 433832 450543
12353 450543 447169 444310 456280 452580 447004 447850 444445 430711 415342 414513 400489 379551 360276
12340C60276p925p848k2490j3053r424N656j95m901j0852k2572j4336j3447m239
12327B34650p534j3996j0179j4868o824n530r165O26k3410j2336j544j2113o846
12314A10931j1241J2529J0697r132p363N54L569K331n544n308r12J3645J8043
12301A32799L602J667j3207j3383p872j8089p374O85J1035K1476K490j0918o269
12288I6642j3037j5844k8048k3955k1102k8758j6743R276K9226K9921J8714R660
12276D5952o945P845N565N825P65p971j3967j722q861J2341j111J0725J6874l625
12262F1690J5597J1650k1025k4790j6867P432J738N577j6310j7921j402o390P342
12249F321N861J1693j288j4176l062j557L66k331Q49q162R078J0481k57o362K893
$$ plain form
12340 360276 352351 344503 322013 308960 299536 305192 304997 300096 289244 266672 252336 238889 234650
12327 234650 227116 213120 202941 188073 181249 175719 166554 167180 143770 131434 129890 117777 110931
12314 110931 99690 112219 122916 113784 106421 106975 110544 112875 107331 102023 101111 114756 132799
12301 132799 136401 138068 124861 111478 103606 85517 78143 78828 89863 111339 113829 102911 96642
12288 96642 83605 67761 39713 15758 -5344 -34102 -50845 -41569 -12343 17578 36292 45952
12276 45952 39007 46852 52417 58242 59007 51036 37069 35347 26486 38827 37716 48441 65315 61690
12262 61690 77287 88937 67912 43122 26255 33687 35425 41002 24692 6771 5369 -1021 6321
12249 6321 12182 23875 22587 8411 5349 3792 4158 1827 2676 -5486 3592 14073 13816 7454 10347
12234A0347J7032J4600J5051m832j0589j8232j0058k371n480p105L677O602J0337
12221A8979R762J6870J636K609p286Q79q501J986O395q78K1728R574j6711j0129
12207D6913L222M67o029m509l017P791K917p052k9797P479R371m934j9386n94
12193B842J8987O556m886j1760p067L501m690J8013R7j557R74J8236J3309J0740
12179F3295J2952p347m632o141p186j2136k2432j3674J7533J8014n62M600L818
12166D6102K386J9110J4417l79l414p94j4767R487K0707J4982J2847J2065K2579
12153A55328K5232N2655P4401J03053J63719K97744M40993N19873M22898J37822
12143B393718l07829n62255m67220k93022j56450p9057o1765m7586m1362l4486
$$ plain form
12234 10347 27379 41979 57030 52198 41609 23377 13319 10948 5468 -1637 2040 8642 18979
12221 18979 28741 45611 47247 49856 42570 43449 34948 36934 43329 42451 64179 73753 57042 46913
12207 46913 50135 50602 44573 40064 37047 44838 47755 40703 10906 18385 27756 22822 3436 2842
12193 2842 21829 28385 23499 11739 4672 8173 3483 21496 21593 20036 21010 39246 52555 63295
12179 63295 76247 68900 64268 58127 50941 38805 16373 2699 20232 38246 37684 42284 46102
12166 46102 48488 67598 82015 81636 78222 77428 62661 72148 92855 107837 120684 132749 155328
12153 155328 180560 233215 307616 410669 574388 872132 1313125 1832998 2255896 2393718
12143 2393718 2085889 1523634 1056414 763392 606942 527885 466120 418534 377172 342686
12133C42686j5423l4129m0701k8992k3714j6141j8153j3472p129J976P850P221
12121A61879j0503k589R94p652m666j324q865M99j1595j411J8200j115p690M821
12107A28983k1560j2327K107j1554j1035j1267O966l122J092P854j4172j8161
12095D3804K816M710N219n716J435L235J0545k69N402K040J1104P15k822q073
12081G4145k63M487O94l365j906j334j986n760l675L480J8330Q431K399j9310
12067G4367j1224j3961n411r645l921Q70m961k148p462j390o87r83J2175J723
12053B7342K237M10J222r756J00R425j567o078J1702n930n634j989l490L03M316
12038B2613M116l388J5809m324n660J959q116j5177K444J6024J3480O19j1138
$$ plain form
12133 342686 327263 293134 252433 223441 199727 183586 165433 151961 144832 146808 154658 161879
12121 161879 151376 148787 149781 142129 137463 136139 127274 127773 116178 114767 132967 131852 124162 128983
12107 128983 107423 95096 97203 85649 74614 63347 70313 67191 68283 76137 61965 43804
12095 43804 46620 51330 56549 50833 52268 55503 66048 65779 71181 73221 84325 85040 82218 74145
12081 74145 73882 78369 79063 75698 73792 72458 70472 64712 61037 64517 82847 91278 93677 74367
12067 74367 63143 49182 43771 34126 30205 31075 26114 23966 16504 15114 14427 13444 25619 27342
12053 27342 29579 29989 31211 21455 21555 30980 29413 23335 35037 29107 23473 21484 17994 18297 22613
12038 22613 26729 23341 39150 34826 29166 31125 23009 7832 10276 26300 39780 40399 29261
12025B9261j6269m894n958J0186J6173J1394m815q839N89n419m800n133J1015
12012B2491J703K043K158j4372k0953J283j911J4674J0499j6280p156j435l426
11999a0682J1089J3398J390P808l963J141J4489j875j2481k703o750k340K1220
11986B9741O432o426j2833k034P993Q690m707n907J1879j079o642n827J0028o652
11972B2656M739L008N246N793J5537j188k4118l9699j4803J1011P297j354O248
11959C73Q204K1561j2761p604N416L151J852j6711l223J5721Q001j901l980r616
11945H483m968r885L100o54m611O094J2028l841p581J4475N156L536R199p270
11931B3261n911k2817K724J1304p643q655q381J1932k017o569R028J0490j1787
$$ plain form
12025 29261 12992 8098 2140 12326 28499 39893 35078 26239 26828 21409 16609 11476 22491
12012 22491 24194 26237 28395 14023 -6930 -5647 -7558 7116 17615 1335 -5821 -7256 -10682
11999 -10682 407 13805 15195 23003 19040 20181 34670 32795 20314 17611 10861 8521 29741
11986 29741 36173 29747 16914 14880 22873 31563 26856 20949 32828 31749 25107 19280 29308 22656
11972 22656 27395 30403 35649 41442 56979 55791 31673 -8026 -22829 -11818 -4521 -5875 373
11959 373 8577 30138 17377 9773 15189 18340 20192 3481 258 15979 23980 22079 18099 8483
11945 8483 3515 -6370 -3270 -3924 -8535 -2441 9587 5746 -1835 12640 17796 21332 30531 23261
11931 23261 17350 -5467 -2743 8561 918 -7737 -16118 -4186 -6203 -12772 -3744 6746 -5041
11918e041L544J688j2063p905j78l709o218J9650K3346o134m054j6316j333p670
11904b2393l734J0157K1991P028L188J1608r446r318m891K078N466L216L681J0224
11890B8855N281n618j6919j6251q659O736R237L005o534j0294J289j55O378P578
11876C929J527j819R384p038J0589P007m454j2806J079P123q7K169o405l186Q373
11861A5385P259p163j7184n232R326R357m902o594j1293J547J111o292m960K64
11847a9371k306N004J9049J0984O747r77q385j747p167K360Q490r219M632p877
11833B17O663l414l225p82P655J0210j684r43k3374j399R234K308n396r794J414
11818a2310K855J2669j408J529l089m476p59K173L337m99Q652n442j795o987q828
$$ plain form
11918 -5041 -1497 191 -11872 -19777 -19955 -23664 -29882 -10232 13114 6980 2926 -13390 -14723 -22393
11904 -22393 -26127 -15970 6021 13049 16237 27845 18399 9081 4190 6268 11734 14950 18631 28855
11890 28855 34136 28518 11599 -4652 -13311 -6575 2662 5667 -867 -11161 -9872 -10027 -3649 3929
11876 3929 5456 3637 13021 5983 16572 23579 19125 6319 7398 14521 14434 16603 10198 7012 15385
11861 15385 22644 15481 -1703 -6935 2391 11748 6846 252 -11041 -9494 -8383 -14675 -19635 -19371
11847 -19371 -21677 -16673 2376 13360 20107 19130 10745 8998 1831 4191 12681 3462 8094 217
11833 217 6880 3466 241 -541 7114 17324 15640 14697 -8677 -10076 -842 1466 -3930 -13724 -12310
11818 -12310 -9455 3214 1806 3335 246 -4230 -4989 -2816 521 22 8674 3232 1437 -5550 -14378
11803a4378M732n039P793R89p040K485n15J706R747M503n974M374p826l274P273
11788d44M599J886K060l820j2268R543J0808M683j1357r943O116J7183O208M97
11774B5751l168o822j0133R24M118O182O425l276j0070j2086l435J1317j724j260
11760B743J779j1028q151K3810J3730r78l669k343K910j3260j0010l112K1l491
11746a1049J0556J3683p651r727O757P900Q598O96p057K239Q777j1587j406J0825
11732B1554L868p340K673k285k080M16L814J2893K918m345l575R54N352J2058
11718D6875L360l476N286J1349m07N689M478J7306J4264N537J9108K5866K8400
11705A83635J8190L6587M7976N0962O6267J01619J21985J44469J56551J53619
$$ plain form
11803 -14378 -9646 -14685 -6892 -5903 -12943 -10458 -10973 -9267 480 4983 -991 3383 -4443 -7717 -444
11788 -444 4155 6041 8101 4281 -7987 1556 12364 17047 5690 -4253 1863 19046 25254 25751
11774 25751 22583 15761 5628 6552 10670 16852 23277 20001 9931 -2155 -5590 5727 4003 2743
11760 2743 4522 -6506 -14657 9153 22883 21905 18236 15893 18803 5543 -4467 -7579 -7558 -11049
11746 -11049 -493 13190 5539 -4188 2569 10469 19067 19763 12706 14945 23722 12135 10729 21554
11732 21554 25422 18082 20755 18470 16390 16806 20620 33513 36431 32086 28511 29465 34817 46875
11718 46875 50235 46759 52045 63394 62987 68676 73154 90460 104724 110261 129369 155235 183635
11705 183635 201825 238412 286388 337350 403617 505236 627221 771690 928241 1081860
11695A081860R9303K0713n0535j16087j49058j49271j28200r1192p8854o4466
11685C74213m0863l1394k3408l317k6872k0899k1188j365k3279k0369j6563j1964
11673A32732J1046N524j0450p041j0529L81N85j3015j7428j1898l145Q58J4436
11660I2056q526o092j190j6014L135r9j742O87n986j0134L377J2047K630M647
11646F8796O501l380k067j1802j4417p329o993P552j906n58J4225j0935j0277
11633B7410j4096R515J8292O654r8k2014q415J077Q133J741k49q356J285n973
11619A4906r001N782m722q782K597J4667l12n224r763P355J323r465J1046K646
11605A3053l799k723M617o503o282m293K523l181Q248R27M643J0728Q08m421p355
$$ plain form
11695 1081860 1181163 1201876 1151341 1035254 886196 736925 608725 517533 438679 374213
11685 374213 333350 301956 278548 275231 248359 227460 206272 204907 181628 161259 144696 132732
11673 132732 143778 149302 138852 131811 121282 121663 122248 109233 91805 79907 76762 77620 92056
11660 92056 83530 77438 76248 60234 63369 63270 61528 62215 56229 46095 49472 61519 64149 68796
11646 68796 75297 71917 69850 58048 43631 36302 29309 36861 34955 34397 48622 37687 27410
11633 27410 13314 22829 41121 47775 47677 25663 17248 18325 26458 28199 27950 19594 20879 14906
11619 14906 5905 11687 6965 -1817 780 15447 15135 9911 148 7503 8826 -639 10407 13053
11605 13053 9254 6531 11148 4645 -1637 -5930 -3407 -6588 1660 2587 7230 17958 18766 14345 6990
11590F990M950O89r100M426o502M032k506q545o888J2440L714n121M389J2399
11576A5367J1605j1257R500J4016K00j1388o86j571K053L530m236j863K722o068
11562B1924J139m354j4182J298m783M44n685j403q503p628L407J2522o107q22
11548a2733p527O271P786M067N598J0699J840p252n790j760k779n063O632J0051
11534A0040P69K205J731l807o593Q446M59o888o006j3664L256L241r30K811q530
11519a3460j1830J3523K684R300K457N684J428P06L802M532q128p965n759P791
11505D765m532j7382M823K016j2114J2020J2202J043j4015N189O884L950N812
11492A0661J6455O149n434q54j5054j8516L36K309o90k540o77r414j0872J2478
$$ plain form
11590 6990 11940 12629 3529 7955 1453 5485 2979 -5566 -12454 -14 3700 -1421 2968 15367
11576 15367 26972 15715 25215 39231 39431 28043 27357 25786 27839 31369 27133 25270 27992 21924
11562 21924 23063 18709 4527 5825 1042 1486 -4199 -5602 -14105 -21733 -18326 -5804 -11911 -12733
11548 -12733 -20260 -13989 -6203 -2136 3462 14161 16001 8749 2959 1199 -1580 -6643 -11 10040
11534 10040 10809 13014 14745 10938 4345 12791 13250 6362 356 -13308 -10052 -6811 -7741 -4930 -13460
11519 -13460 -25290 -11767 -9083 217 2674 8358 9786 10492 14294 18826 10698 2733 -3026 4765
11505 4765 233 -17149 -12326 -10310 -22424 -10404 1798 2841 -11174 -5985 899 4849 10661
11492 10661 27116 33265 27831 26977 11923 -6593 -6257 -3948 -4638 -7178 -7855 -17269 -28141 -15663
11478a5663J0835M128L683n970n219j3110L71M606R662J002m447L020j246P2L109
11463e167K908J1678L386M665Q563n276k0599p009jq078J029J2953R092J3845
11449B1989M288j1933k0202J651k190k93L104O392n47j2957J3072K1080n94N938
11435B8798J148r077N016j0075p298r6j1987j2180L100N930n543n725K993o445
11421b1441o450P640O983L113J5237J0404j888j2883m864N0k3709l887K3186P986
11407e23M784J1732n442p424n595m924j6032m954J4322J6480l455n827J0657J2857
11393A6656r85j898o066l745J2091N821l110j4476L421Q278Q24j5255n814n231
11379i489R185J0271M255M594l112m554n581k92K097Q561N265n273j5216j1024
$$ plain form
11478 -15663 -4828 -700 2983 -2987 -8206 -21316 -20945 -16339 -6677 -5675 -10122 -7102 -8348 -8276 -5167
11463 -5167 -2259 9419 12805 17470 26033 20757 158 -6851 -6852 -14930 -13901 -948 8144 21989
11449 21989 26277 14344 -5858 -4207 -6397 -6690 -3586 2806 2259 -10698 2374 23454 22860 28798
11435 28798 29946 20869 25885 15810 8512 8416 -3571 -15751 -12651 -6721 -12264 -17989 -14996 -21441
11421 -21441 -27891 -20251 -13268 -10155 5082 15486 13598 715 -4149 -4099 -27808 -31695 -8509 -523
11407 -523 4261 15993 10551 3127 -2468 -7392 -23424 -28378 -14056 2424 -1031 -6858 3799 16656
11393 16656 15671 13773 7707 3962 16053 21874 18764 4288 7709 15987 16811 1556 -4258 -9489
11379 -9489 -304 9967 14222 18816 15704 11150 5569 5277 7374 15935 21200 15927 711 -10313
11365a0313Q051l62O807m128j2019j9303J142K2679J2019N258M490J467p260Q747
11351A7275m914J2206L729j7985k927p703N521Q721R920p71m476n925M494J2428
11337B9593P935L298o671l417j7579k861Q195k641N39q594P09j4125M396J4140
11323A2917J360K498o483J241n334j908R809q19q095m487P136J7521M502r135
11309B0723R844P730o947j0345o969j147m79l47O462R509m132m453L498L218r291
11294A6874p072O106J0694j9415o582J6692J2842Q188K050j1762n911J1343J431
11281C5478j1159j4217M220J8096J1088l152k2957q295L892J6834R462J0745o579
11268D3456n840j1326M605J6018l261n522r86j1316n848J0573P828j4011P46J010
$$ plain form
11365 -10313 -2262 -2624 4183 55 -11964 -31267 -30125 -7446 4573 9831 14321 15788 8528 17275
11351 17275 12361 24567 28296 10311 7384 -319 5202 13923 23843 23072 18596 12671 17165 29593
11337 29593 37528 40826 34155 30738 13159 10298 18493 15852 16391 7797 8506 -5619 -1223 12917
11323 12917 14277 16775 10292 11533 6199 4291 14100 13281 5186 699 7835 25356 29858 20723
11309 20723 30567 38297 31350 21005 14036 12889 12410 12063 18525 28034 23902 19449 22947 26165 16874
11294 16874 9802 15908 26602 7187 605 17297 30139 38327 40377 28615 22704 34047 35478
11281 35478 24319 10102 14322 32418 43506 40354 17397 9102 12994 29828 39290 50035 43456
11268 43456 37616 26290 30895 46913 43652 38130 37144 25828 19980 30553 38381 24370 25116 26126
11254B6126j6948j3635q126P973K9542j31N596k75Q47o674P615m305j4227N44
11240A3922J7209L58j0769o805n91J1669J3849K198K188k729N710jo476m931j089
11225C3712Q939J8290j0716k0380r956L112n7k111M520K4536J6375Q067q228j0298
11211E5805q761O903J375j6825j2881K778O44K062J759j367j5044p911J8846K0339
11197D7722j984n001M684J406j256Q482L435k3194m059K755k816l401j791q986
11183A5996P460o065M408J1588l330j5743P32J3709L67j215n306J0482j715K957
11169C4325K526R440k531n900K951J090r04q033L511J689J614L621l903J455o955
11154C3996j815J4323P215j135k047j6447n995O288N496q361J3193K747n04O866
$$ plain form
11254 26126 9178 -4457 -12583 -4610 24932 24801 30397 30122 30969 24295 31910 27605 13378 13922
11240 13922 31131 31489 20720 13915 13324 24993 38842 41040 43228 40499 46209 46208 39732 34801 33712
11225 33712 42651 60941 50225 29845 19889 23001 22944 20833 25353 49889 66264 74331 66103 55805
11211 55805 47044 53947 55322 38497 25616 28394 29038 31100 32859 31492 16448 8537 27383 47722
11197 47722 45738 40737 45421 46827 45571 54053 57488 34294 30235 32990 30174 26773 24982 15996
11183 15996 23456 17391 21799 33387 30057 14314 15046 28755 29122 27907 22601 33083 31368 34325
11169 34325 36851 46291 43760 37860 40811 41901 40997 32964 36475 38164 39778 43399 39496 40951 33996
11154 33996 32181 46504 53719 52584 50537 34090 28095 34383 39879 31518 44711 47458 46954 53820
11140E3820j6902m669O290o021p352r149J3446J7022o928K612R515N361p960l686
11126D5399L12j0190R568J1333k847k893j243J239M008J0N306j3731n094L078
11112D4255J0196j2740p084l886N161j43j5988j1792J6520J6841P71o589K561
11099C8083r804J701j5009N168J912k534Q889R948l943m290Q926Q584n481n132
11085C7018P79O074j0447l711K875K216R656j626o904r797p190j598N76L79K674
11070B0974Q834Q62j2021P100K354J1751j2749p28p874m813K1619J7913L323j4047
11056D2498q799K973N308J3029K1379K532j0942j1676q539J617j501o228P706
11043D9357K196N870N659m587p871J149K722q244K948J4067J1940J1384O03J714
$$ plain form
11140 53820 36918 32249 38539 32518 25166 16017 29463 46485 39557 42169 51684 57045 49085 45399
11126 45399 45711 35521 45089 56422 53575 50682 49439 50678 54686 54696 60002 46271 41177 44255
11112 44255 54451 41711 34627 30741 35902 35759 19771 7979 24499 41340 42111 35522 38083
11099 38083 28279 29980 14971 20139 22051 19517 28406 38354 34411 30121 39047 47631 42150 37018
11085 37018 37797 43871 33424 29713 32588 34804 44460 42834 35930 26133 18943 17345 17921 18300 20974
11070 20974 29808 30670 18649 25749 28103 39854 27105 26377 18503 13690 35309 53222 56545 42498
11056 42498 33699 36672 41980 55009 76388 78920 67978 56302 47763 49380 47879 41651 49357
11043 49357 51553 57423 63082 58495 50624 51773 54495 46251 49199 63266 75206 86590 87193 88907
11029H8907J2428j445n04J0634J8505L964j978l420K493K3609K0423K9489L4995
11016B38100O3440Q7667J25874J87784L01951M05873M61680L55583J16756k35953
11006B108755m43784m29228l17793k12170j33432r0228n6410m1742k7473j9506
10996C36989k3986j4854m445k7699j8267J1780j6389n342j739k4280p743P997
10984B12022m27j1963j1562P86M08o960K364j2500j4983j5872j5793J571J0866
10971A37957J406L236j3021j0744j4019p234Q921O508J6116M051j0071o691Q748
10958A25163J9028n568n616r175p435n251j6854j0343J6288n282j347J187k899
10945I1896L807J106J4524K6955K4735J6939N34m191l7015l0488p642J810k81
$$ plain form
11029 88907 101335 99890 99386 110020 128525 132489 130511 127091 129584 153193 173616 203105 238100
11016 238100 301540 389207 515081 702865 1004816 1410689 1872369 2227952 2344708 2108755
11006 2108755 1664971 1235743 917950 705780 572348 482120 425710 383968 356495 336989
10996 336989 313003 298149 293704 266005 247738 259518 243129 237787 236048 211768 204025 212022
10984 212022 211595 199632 188070 188856 189264 182304 184668 172168 157185 141313 125520 127091 137957
10971 137957 139363 142599 129578 118834 104815 97581 106502 113010 129126 133177 123106 116415 125163
10958 125163 144191 138623 133007 123832 116397 111146 94292 83949 100237 94955 93608 94795 91896
10945 91896 95703 96809 111333 138288 163023 179962 180496 176305 139290 108802 101160 102970 102689
10932A02689P323J7075K3286J6067N155j2302j6615K298J9696J5806J6758K8645
10920B25881M0282K9586L5356L7461K0451J2836j6889l4188m5733l1000k1724
10909B52319j7111j9762k1067j7937m378J985j2752N158K64l779K0019L0414K6725
10896B40098P720l982o016k2593j3906r294P011J774R545J4557L2467L2519K8131
10883C18031L6327K5569J6416R652O249k7436k4012k7296k4433m7245l8215k7025
10871A96582j942k027j4756n138p554r817p397j3522j6424p12K019J7876J5393
10858A52581L369K410j396L941o617N797j6048r780L156P188J7897J3797J2322
10845A88617M087K0214J7409J1341J4772m946j5899p555j4122k0541j0351k8247
$$ plain form
10932 102689 110012 127087 150373 166440 171595 159293 142678 144976 164672 180478 197236 225881
10920 225881 266163 295749 331105 368566 389017 401853 384964 350776 305043 274043 252319
10909 252319 235208 215446 194379 176442 172064 174049 161297 166455 166719 162940 182959 213373 240098
10896 240098 247818 243836 237820 215227 201321 192027 199038 200812 210357 224914 257381 289900 318031
10883 318031 354358 379927 396343 405995 412244 384808 360796 333500 309067 261822 223607 196582
10871 196582 194640 192613 177857 172719 165165 155348 147951 134429 118005 117293 119312 137188 152581
10858 152581 155950 158360 156964 160905 154288 160085 144037 134257 137413 144601 162498 176295 188617
10845 188617 192704 212918 230327 241668 256440 251494 235595 228040 213918 193377 183026 154779
10833A54779j1968j4703k585K291k436j289p956j4837O440n434j6678O655J5086
10820A07365R489m089J330j0443q437j749J808J2222J152o336O232J0848j4762
10807A04630j2034J8049J58o127J0307K4298l171p104j7974q776m100n773m124
10794H8259P018K5247K9023j182O954l647k203K654J2012J0286R51n239m721j3088
10780A52324p919J4769R160J1666j9106k2134K122p441N832J1841J2288J3262
10768A76664P016K724j8935p624k2429j7855n17q37K958k431l329N985Q977L827
10754A34194K201j5986L9J1016R272j6586n590J403K0364L1362J7067K5201J7742
10741B31699j9270l903o71j0954J1751J6047n90K976q321r693J0685O462j0999
$$ plain form
10833 154779 142811 128108 125523 127814 125378 124089 116133 101296 107736 102302 85624 92279 107365
10820 107365 116854 112765 114095 103652 95215 93466 95274 107496 108648 102312 108544 119392 104630
10807 104630 92596 110645 110803 104676 114983 139281 136110 129006 111032 102256 98156 92383 88259
10794 88259 95277 120524 149547 148365 155319 151672 149469 152123 164135 174421 175372 170133 165412 152324
10780 152324 144405 159174 168334 180000 160894 138760 140882 133441 139273 151114 163402 176664
10768 176664 183680 186404 167469 159845 137416 119561 119044 118207 121165 118734 115405 121390 130367 134194
10754 134194 136395 120409 120448 131464 140736 124150 118560 119963 140327 171689 188756 213957 231699
10741 231699 212429 208526 207855 196901 208652 224699 224109 227085 218764 209071 219756 226218 215219
10728B15219k4333k148j4226j4214K65q999j1969m260k2136k0349M10R062L5695
10715A38017M3968O6296R9056J40774J10646J2209m1191k5076N103J2121J0493
10704E72416J1082J1518j1799j3137j2216J2165M213o579o616j891q372j1404
10692E39380M612K8400j0386j0087j1336j917J9370L0134J3095K355l369j3676
10680E86575j1380Q403L1305L6553L7941K7195J2461Q36j363L624J9634L5409
10668G87193J9105l154k0364l425P102J9756K4511L8324O0362L5903L4427L9258
10656A038998L8437M2611K5235M0800J8898L248J0247J3892J1045O133j4916K121
10644A236749L0737N9560O7393N8757J7646L959K1871N5186P6237Q2790R6398
$$ plain form
10728 215219 190886 188738 174512 160298 160563 151564 139595 135335 113199 92850 93260 102322 138017
10715 138017 181985 248281 347337 488111 598757 610966 569775 544699 549802 561923 572416
10704 572416 583498 595016 583217 570080 557864 570029 574242 567663 561047 559156 550784 539380
10692 539380 543992 572392 562006 551919 540583 538666 558036 588170 601265 603620 600251 586575
10680 586575 575195 583598 614903 651456 689397 716592 729053 729889 728526 732150 751784 787193
10668 787193 806298 803144 782780 779355 786457 806213 830724 869048 929410 965313 999740 1038998
10656 1038998 1077435 1120046 1145281 1186081 1204979 1208227 1218474 1232366 1243411 1249544 1234628 1236749
10644 1236749 1267486 1327046 1394439 1453196 1470842 1474801 1496672 1551858 1628095 1710885 1807283
10633A807283J03108J05746R4044Q1486Q8295Q7591Q8188J08885J49622J75142
10623B889390J60411J36809J37025J45499J68584K12556K43070K92428L33559
10614D719331L77485M25226M92143O18461Q03433R70084J078372J074523R96061
10605A1555119R14193R79303J296727J787257K347302K903830L535329M485614
10597B9804674O122430Q750001J2979346K0025346L1748408N0022131P2620496
10590B32072832Q7575865P8534341L8856027k4959780q1388613r0405428o6288687
10583A73996557m1487787k6003674j7402630j2505322r466573p292533n599279
10576E4238759m306781l402927k809026k342263j951196j653974j515593j552584
$$ plain form
10633 1807283 1910391 2016137 2110181 2191667 2279962 2367553 2455741 2564626 2714248 2889390
10623 2889390 3049801 3186610 3323635 3469134 3637718 3850274 4093344 4385772 4719331
10614 4719331 5096816 5522042 6014185 6632646 7436079 8406163 9484535 10559058 11555119
10605 11555119 12469312 13448615 14745342 16532599 18879901 21783731 25319060 29804674
10597 29804674 35927104 44677105 57656451 77681797 109430205 159452336 232072832
10590 232072832 319648697 398183038 437039065 412079285 330690672 240285244 173996557
10583 173996557 132508770 106505096 89102466 76597144 67130571 59838038 54238759
10576 54238759 49931978 46529051 43720025 41377762 39426566 37772592 36256999 34704415
10568C4704415j696792j733333j548296j298378j137831j072368j021152r72621
10560B4223644r27600q81186q68730r06094r33778r23232q64020p95184p11710
10551A6412110o40132o04789n89305n79032n30404m53746l77806l24973k63958
10542A2047965k32796k22352k49115k54181k86857l12272l27833l26335k99772
10533I536452k65158k53094k64374k75860k81911k47837k18705k11088j90688
10524G327737j91766k18870k01749j69608j51630j56503j60969j53072j36610
10515E786960j47970j67023j54463j63173j66982j55674j26487j37937j23179
10506D444072j16956j00018j15248j11875j14664j04375q7500q5396p9871q0393
$$ plain form
10568 34704415 33007623 31274290 29725994 28427616 27289785 26217417 25196265 24223644
10560 24223644 23296044 22414858 21546128 20640034 19706256 18783024 17919004 17123820 16412110
10551 16412110 15771978 15167189 14577884 13998852 13468448 13014702 12636896 12311923 12047965
10542 12047965 11815169 11592817 11343702 11089521 10802664 10490392 10162559 9836224 9536452
10533 9536452 9271294 9018200 8753826 8477966 8196055 7948218 7729513 7518425 7327737
10524 7327737 7135971 6917101 6715352 6545744 6394114 6237611 6076642 5923570 5786960
10515 5786960 5638990 5471967 5317504 5154331 4987349 4831675 4705188 4567251 4444072
10506 4444072 4327116 4227098 4111850 3999975 3885311 3780936 3693436 3608040 3528169 3447776
10496C447776r1037j08458r1420r2642p9849m7143o2153o0267m4420m1825m8361
10485B680201n4045o7116o5369o0798n8156l5748k0076k4097l7570k8696l4911
10474B193619n9635q9347j05492j04341j00348r1731p1492q3576p9047o1111o6343
10463A281156m1854j7536j5772m3225n9489o3479o3954m8085l7863l8080m6432
10452H05387m7217m8684m1191l6330k3078m1191l9190m0580m6883l2773k0811
10441C87459m310n675J1408j5661k9244R45j97Q4O150J8862M1300L8347J3705
10428D63173k947j911j4296j5223p189j7053l191K079M362q260j2071m83J5831
10415D02821j1524j3295k872J253r123k2496j8199k258M097J4216P705P882O854
$$ plain form
10496 3447776 3356739 3248281 3156861 3064219 2984370 2937227 2875074 2814807 2770387 2728562 2680201
10485 2680201 2626156 2559040 2493671 2432873 2374717 2338969 2318893 2294796 2257226 2228530 2193619
10474 2193619 2133984 2044637 1939145 1834804 1734456 1642725 1571233 1487657 1408610 1347499 1281156
10463 1281156 1239302 1221766 1205994 1162769 1103280 1039801 975847 927762 889899 851819 805387
10452 805387 758170 709486 668295 631965 608887 567696 528506 487926 441043 408270 387459
10441 387459 383149 377474 388882 373221 343977 344922 344725 344809 350959 369821 411121 449468 463173
10428 463173 460226 458315 444019 428796 421607 404554 401363 403442 407804 399544 387473 386990 402821
10415 402821 391297 378002 375130 376383 367260 344764 326565 324307 328404 342620 350325 358207 365061
10402C65061p178k3203k5492j6881K971k409J482n980j4463p631m667P716Q869
10389B78195L538n384r550P494J7239J4586O041K797j02O538N494j1287j2673
10376C02926j2575K542P589p091Q373J2167j1421j3332o200L493j1302P991L878
10363B87038O121r46p371o306J3220O729n212m883k436j4158K4587J9007j743
10350C13647J4630O082j2508K405l88o08P003n585p096n141r225j6524K786j2734
10336B76744k4354l375J290o544j6342p691Q159m004j1437n296l153k0432k3429
10323A60136k0460P23j430r213o846K715K433r481p982p204k04P339Q868l352
10309A16042j431q563p444k868j2589r574r510j885J060m319K0580L7220k748
$$ plain form
10402 365061 357883 334680 309188 292307 295278 292869 294351 288371 273908 266277 261610 269326 278195
10389 278195 281733 276349 266799 274293 291532 306118 312159 314956 314854 321392 326886 315599 302926
10376 302926 290351 292893 300482 293391 301764 313931 302510 289178 282978 286471 275169 283160 287038
10363 287038 293159 292213 284842 278536 291756 298485 293273 288390 285954 271796 296383 315390 313647
10350 313647 328277 334359 321851 324256 323868 323260 330263 324678 317582 312441 303216 286692 289478 276744
10336 276744 252390 249015 250305 243761 227419 219728 227887 223883 212446 207150 203997 183565 160136
10323 160136 139676 140399 138969 129756 122910 125625 128058 118577 110595 103391 103187 110526 119394 116042
10309 116042 114611 106048 98604 95736 83147 73573 64063 62178 63238 58919 79499 116719 113971
10296A13971M9j1250j459J565J075j3315j0889q342j2342j117O71n484p607k2242
10282B3284j0182K125r484j451L5124N0591K5447o666O88O642p836J2723J6567
10269A37572J529L523P996J6329J8884K2157J8868J6773K5099K7433L4396L3580
10257C64139L6174L2672M6447P5494R3569J17552J71384K42095L20243M17094
10247A916863N03456N57395N11625L48698P6296k27174m47559m99073m38397l63701
10237A938429k84225k36934j91421j70622j03130m6324l9980m6514n6135m0077
10227G23067l8003j7682l5125j4345m546L506L2151M0075Q3011J26877J93242
10216A092228K66067L23396K83923J54286p4520k46522l14842k94845k22537j49826
$$ plain form
10296 113971 114020 102770 101311 102876 103951 90636 79747 71405 59063 57946 58617 53133 45526 23284
10282 23284 13102 15227 5743 4292 39416 90007 115454 108788 109476 116118 108282 121005 137572
10269 137572 139101 142624 150620 166949 185833 207990 226858 243631 268730 296163 330559 364139
10257 364139 400313 432985 479432 554926 648495 766047 937431 1179526 1499769 1916863
10247 1916863 2420319 2977714 3489339 3838037 3914333 3687159 3239600 2740527 2302130 1938429
10237 1938429 1654204 1417270 1225849 1055227 952097 905773 865793 819279 763144 723067
10227 723067 685064 667382 632257 617912 613366 616872 649023 689098 772109 898986 1092228
10216 1092228 1358295 1681691 1965614 2119900 2045380 1798858 1484016 1189171 966634 816808
10206H16808j06798n8315l9169m1106l7813l9919l2181l1470j1224k91k8471k8649
10194C61402l6666j2424K391P590j2128n080q535n19r296r828q076L636J2611
10181B85078K30M48O84p826m358K6254J1259J5299m879p043J0501K7066O4387
10168D17100J02267J30866J75598K88015M30642M50493L40436P9944k62807m56056
10158A696498m19432l02113j99686j32152q7447o6578m3740l5922l0015l8505
10148C40908l0767j4281r620m334k78K51L643l874j9325j7752m100R285K463m385
10134B47834r188r54l654j578j8050P11j832l840q426m249L673n967r81K559j0875
10119A85183j9489N435J2567j577r901j1739q518L976j1943j6176p472M896J4343
$$ plain form
10206 816808 710010 651695 612526 571420 533607 493688 461507 430037 418813 418522 390051 361402
10194 361402 324736 312312 314703 322293 310165 305085 296550 296031 286735 276907 268831 272467 285078
10181 285078 285308 285756 286440 278614 274256 300510 311769 327068 322189 315146 325647 352713 417100
10168 417100 519367 650233 825831 1113846 1544488 1994981 2335417 2415361 2152554 1696498
10158 1696498 1277066 974953 775267 643115 555668 489090 445350 409428 379413 340908
10148 340908 310141 295860 286240 281906 281628 281879 285522 281648 262323 244571 240471 249756 252219 247834
10134 247834 238646 237692 234038 232460 214410 215121 213289 209449 201023 196774 200447 194480 193499 196058 185183
10119 185183 165694 171129 183696 182119 172218 160479 151961 155937 143994 127818 120346 125242 139585
10106A39585k78j7391j2995k0623j3462k451K459J702J6750J4155J939j2839o636
10093H9915N212M198j470M188p042Q176Q346p569n24J969l868k0887j3113L605
10079G1136k878K090J531o00l535j1095K0901K9303p287j6057j3604m308O63J2476
10065G8736O229k019j3465p744m24J374m611n027O509J2077p682j2555L271n693
10051D8976q933K461J203L728r835q811j0879K464J4840J2798n681j8082j728
10038B2521L886J4754M796m462j322j0820l895J2774J1658J2131L989n880q55
10025E9275N179O479p432p037p079L738q41K272R925l080j1315M959O713j5K972
10010F4713K14j597k8O512o544K1783K0541J4747M341m232j8650k1023l520q526
$$ plain form
10106 139585 139307 121916 108921 88298 74836 72385 74844 76546 93296 107451 109390 96551 89915
10093 89915 95127 99325 97855 102043 95001 103177 111523 103954 103430 105399 101531 80644 67531 71136
10079 71136 68258 70348 71879 71279 67744 56649 77550 106853 99566 83509 69905 65597 66260 78736
10065 78736 84965 82946 69481 61737 61313 62687 58076 53049 59558 71635 63953 51398 54669 48976
10051 48976 40043 42504 43707 47435 37600 28789 17910 20374 35214 48012 42331 24249 22521
10038 22521 26407 41161 45957 41495 40173 29353 25458 38232 49890 62021 66010 60130 59275
10025 59275 64454 70933 63501 56464 49385 53123 52282 54554 64479 61399 50084 55043 61756 61741 64713
10010 64713 64927 63330 63302 69814 63270 85053 105594 120341 124682 120450 101800 80777 77257 68731
9996F8731J2164m835k7775j265L887j07M661J5484N476J783j1351r560n483j2564
9982C9246j0638m08K362M931o511L653L753n088P655m71J1074l682J2233J2365
9968G0474l293r678j5011N380M466j7029K145L51o668Q457K4176K351J0517j3306
9954F3332j4003r751K403J2130L844p889j2009J4236J2433l145l427n439j3198
9941C9517j3738N352J7198N786R04N342j1695r804j430q01J3551o524j3698O285
9927C6245J2910L370L430K706J080M168O31j630j1530N809R840m273J64P536m983
9912F5473l670q67J811O237J138j4274j7109j79M29n4r475j0245J0317N797P74
9897C6103N571J568P470Q273L987o717m982Q670m641r515M877j6166k70K753J3650
$$ plain form
9996 68731 80895 76060 48285 47020 50907 50800 55461 70945 76421 78204 66853 57293 51810 39246
9982 39246 28608 28200 30562 35493 28982 32635 36388 31300 38955 38484 49558 45876 58109 70474
9968 70474 67181 57503 42492 47872 52338 35309 37454 37805 31137 39594 63770 66121 76638 63332
9954 63332 49329 39578 41981 54111 57955 50066 38057 52293 64726 61581 58154 52715 39517
9941 39517 25779 31131 48329 54115 55019 60361 48666 38862 37432 36631 50182 43658 29960 36245
9927 36245 49155 52525 55955 58661 59741 63909 64540 62910 51380 57189 67029 62756 62920 70456 65473
9912 65473 61803 60936 62747 68984 70122 55848 38739 38560 38989 38935 29460 19215 29532 35329 36103
9897 36103 41674 43242 50712 58985 62972 56255 51273 59943 55302 45787 50664 34498 34228 36981 50631
9882E0631J2760N867O975J3353O358O76k192O382k473j0156n362L559n032j1965
9868F9381o156m317J2429J3526n583j1998j044o362M443J1079q313k188l944j458
9854E9495k597O316J1529J1474J505L466Q328Q982O53j3958p92M810q962L585
9840I3834J124r363K387O426k897j7783k0883m016K806R030K0512J3180q534J745
9826H7568R865K649p409K534J2851J2297o206k602R755K512N781O124k316j4113
9812A19290p456k477k315m262P488K328n559r265r251K0597M737j0731k1559l792
9798G7773J2753J6669L075N77m18l123j0228j1399P595J077o357M389L962O31
9784I6976N360l43l313R82J3607J2182o902L147J099q151J650J6517o116q262
$$ plain form
9882 50631 63391 69258 76233 89586 95944 96620 94428 100810 98337 88181 82819 86378 81346 69381
9868 69381 63225 58908 71337 84863 79280 67282 66238 59876 64319 75398 67085 64897 60953 59495
9854 59495 56898 63214 74743 86217 87722 91188 99516 108498 109151 95193 94401 99211 90249 93834
9840 93834 94958 85595 87982 94408 91511 73728 52845 48829 51635 60665 81177 94357 85823 87568
9826 87568 97433 100082 92673 95207 108058 120355 114149 111547 121302 123814 129595 135719 133403 119290
9812 119290 111834 109357 107042 102780 110268 112596 107037 97772 88521 109118 113855 103124 81565 77773
9798 77773 90526 107195 110270 110847 110429 107306 97078 85679 93274 94351 87994 92383 96345 96976
9784 96976 102336 101993 98680 99662 113269 125451 118549 121696 122795 114644 116294 132811 126695 118433
9770A18433O110N107Q216N757q214q806N939J5276q114J1677N807N9r232p785
9756A40230L153K488L20k1299j52k86M286k879n962p251l490J1940k980p579L03
9741A10842J1781k146o149M357P164Q489P455L56L520n693J054j364j0122J425
9727A30969J3606r78r066J6372J2786J8391M378K013p327j2720P402J5033j887
9714A88972J748j3810k0325O998J4145j541q571l590O850J4805M483p383m194
9701A78587L328j429J0270Q507K3908J7615K7185J9109K3429J8120J6916N577
9689C51122R094o3m214J6006L967j114K742j3782j2512l109k086J4722N976R635
9675C76384Q109J575n404L644J3634m444k390Q821J0056M448J0298R44P649j285
$$ plain form
9770 118433 124543 129650 137866 143623 135409 126603 132542 147818 139704 151381 157188 157247 148015 140230
9756 140230 143383 145871 146191 124892 124740 124454 128740 125861 119899 112648 109158 121098 118118 110539 110842
9741 110842 122623 120477 114328 118685 125849 134338 141793 142149 145669 139976 141030 139666 129544 130969
9727 130969 144575 143597 134531 150903 163689 182080 186458 188471 181144 168424 175826 190859 188972
9714 188972 190720 176910 156585 163583 177728 176187 167616 164026 170876 185681 190164 182781 178587
9701 178587 181915 180486 190756 199263 223171 240786 267971 287080 310509 328629 345545 351122
9689 351122 360216 360153 355939 371945 375912 374798 377540 363758 351246 348137 346051 360773 366749 376384
9675 376384 384493 386068 380664 384308 397942 393498 391108 399929 409985 414433 424731 425675 433324 432039
9661D32039J8255M746J81J3251K184J9872K6011R274O215J3157K4016J3296J2882
9648E95379M827K592J8551K9477P255J0223R721L6036K9130L3761L6461J8707
9636H32120J2407P829K5259J5710K0814K6461J8397K0814J9086K8679K3882L0636
9624A082094J7529M7856M3810M8040N0732M3011N1940M8147M6146O3712P4098
9613A617115P8376P2474P5501Q4790Q5671R9675J04741R9749R6984J44387J67051
9602B726514J58176J68584J81171J98781K29739K50197K79836L05774L34985L83750
9592E217507M47387M91673N79075O61011P56564Q72257J032832J226757J450132
9583A2735195J717736K052617K494228L040043L753281M663093N774681P095067
$$ plain form
9661 432039 450294 455040 455221 468472 470656 490528 516539 525813 532028 545185 569201 582497 595379
9648 595379 600206 602798 621349 650826 658081 668304 678025 714061 743191 776952 813413 832120
9636 832120 844527 852356 877615 893325 914139 940600 958997 979811 998897 1027576 1051458 1082094
9624 1082094 1099623 1147479 1191289 1239329 1290061 1333072 1385012 1433159 1479305 1543017 1617115
9613 1617115 1695491 1767965 1843466 1928256 2013927 2113602 2218343 2318092 2415076 2559463 2726514
9602 2726514 2884690 3053274 3234445 3433226 3662965 3913162 4192998 4498772 4833757 5217507
9592 5217507 5664894 6156567 6735642 7396653 8153217 9025474 10058306 11285063 12735195
9583 12735195 14452931 16505548 18999776 22039819 25793100 30456193 36230874 43325941
9575D3325941Q456354R587519R993110R073804O466989K363195k290804o202864
9567H0773244q425600q892151q234854p125653n952664m916072m048881l336010
9559B9841359k783153k334700j960592j684313j465174j278391j134874j002655
9551A6197507q88294p86345p07669o32838n86798n55500n16999m89246m44767
9542A0589051m16759l98763l96870l80122l61980l46110l38630l14769l06334
9533G328714k92270k53417k55756k40947k18606j86197j67101j63531j48048j51631
9523E251210j43935j45272j27592j36376j35432j29526j28994j23237j28206j15619
9513C937021j13427j04790j03288r2355q5830j03273j06150r7239q2239q6076
$$ plain form
9575 43325941 51782295 61369814 71362924 80436728 86903717 89266912 86976108 80773244
9567 80773244 72347644 63455493 55220639 48094986 42142322 37226250 33177369 29841359
9559 29841359 27058206 24723506 22762914 21078601 19613427 18335036 17200162 16197507
9551 16197507 15309213 14522868 13815199 13182361 12595563 12040063 11523064 11033818 10589051
9542 10589051 10172292 9773529 9376659 8996537 8634557 8288447 7949817 7635048 7328714
9533 7328714 7036444 6783027 6527271 6286324 6067718 5881521 5714420 5550889 5402841 5251210
9523 5251210 5107275 4962003 4834411 4698035 4562603 4433077 4304083 4180846 4052640 3937021
9513 3937021 3823594 3718804 3615516 3523161 3437331 3334058 3227908 3130669 3048430 2962354
9503B962354o6239n6537o3832o5720p3862p2094p1528o0088o6608p2486n3496
9492B239864o0765o1705n0378n7632l6358l0989m3796o4557o6217l9521m1720
9481A686226n0187m3345k9411l4285m9303l1537k3395k6109l0305k6805l4614
9470A306930k7061k7293k2671l1879l9702k5023j3806k1617j2391k8142k9543
9459A027802k3172l1726k0873j1711k7040m9560l4938l0874k2238j6249j4929
9448G44492k6461k9809k7569k8422k1714j4120j2535j5949l2304l0065j5752p944
9436D81848k7818l5722j4262O9j5541j6493o692r787p784j3410j3381k9818k3472
9423B67737r795J668N268p136r632J0579N572j8971j895J51J1402O497o945j3377
$$ plain form
9503 2962354 2896115 2839578 2775746 2710026 2636164 2564070 2492542 2432454 2365846 2293360 2239864
9492 2239864 2179099 2117394 2067016 2009384 1973026 1942037 1898241 1833684 1767467 1727946 1686226
9481 1686226 1636039 1592694 1563283 1528998 1479695 1448158 1424763 1398654 1368349 1341544 1306930
9470 1306930 1279869 1252576 1229905 1198026 1158324 1133301 1119495 1097878 1085487 1057345 1027802
9459 1027802 1004630 972904 952031 940320 913280 863720 828782 797908 775670 759421 744492
9448 744492 718031 688222 660653 632231 610517 596397 583862 567913 535609 505544 489792 481848
9436 481848 454030 418308 404046 404115 388574 372081 365389 355602 347818 334408 321027 291209 267737
9423 267737 257942 259610 264878 257742 248110 258689 264261 245290 243395 243546 254948 261445 254500 241123
9409B41123k065J4096k224j409l978m191j4545n230k580O280Q951L704j996q184
9395B27752m770N476j440j4931m178J560r310r832j698k155j2034r676k259J2634
9381A75139J3407K991r576M57k153r184k0452K805K548r612m190M492q83K961
9367A48750Q342J3828J0017p798j65r501J148n334j3115p489j7010K77J7002p325
9353A31627o293N071K240J0143l681R26M734P484q489K141Q55J1771J807l923
9339A56413M103k851m091Q79l112l302j87R258N358M181J0228l347m022j9337
9325A50171m126n50o090N418m426j3637r502q348q848R297P813m622q641q156
9311I5753n142l84n11q591N979J0893P346J2598l574j1048j4477o102l119J2197
$$ plain form
9409 241123 239058 253154 250930 249521 245543 241352 226807 221577 218997 225277 234228 237932 235936 227752
9395 227752 222982 228458 227018 212087 207909 209469 200159 190327 188629 186474 174440 164764 162505 175139
9381 175139 188546 191537 181961 182418 180265 171081 150629 153434 155982 146370 142180 146672 145789 148750
9367 148750 157092 170920 180937 173139 172974 163473 164621 159287 146172 138683 121673 121950 138952 131627
9353 131627 125334 130405 132645 142788 139107 140033 144767 152251 143762 145903 146758 158529 160336 156413
9339 156413 160516 157665 153574 154453 151341 148039 147852 157110 162468 166649 176877 173530 169508 150171
9325 150171 146045 145495 139405 144823 140397 126760 117258 108910 100062 109359 117172 112550 103909 95753
9311 95753 90611 90227 89716 81125 87104 97997 105343 117941 114367 103319 88842 82740 79621 91818
9297I1818O440N446j0296p997l166o99p661k034R155J0286N997r934o240j8066
9283F3049n227J506j1075k985N803p116M359O107j806j6754j899j80q063n606
9269B0113Q54o098N20N042p723l693j03J5695J454L338J0784J0939j2024l705
9255C5393l524M015J7219l488l83R311K870k0270p176R675P21n069q108j13l49
9240C0724J9223J0514l093j7662j4279n958K862J1790m083j1657M137M911j1310
9227A6119J1081Q850O038n317O359o399M666O074J3140j1303k635n334J701J977
9213D5017Q302k9N307P527j6531o259l260j7267J0387K670K512l64M170q29j2651
9198B8702o329j996R644j1736R634j2463r604P005M144M606P542P373Q397l261
$$ plain form
9297 91818 98258 103704 93408 85411 82245 81546 73885 71851 81006 91292 97289 87355 81115 63049
9283 63049 57822 59328 48253 45268 51071 43955 48314 54421 52615 35861 33962 33782 25719 20113
9269 20113 20967 14869 15389 20431 12708 9015 8912 24607 26061 29399 40183 51122 39098 35393
9255 35393 31869 35884 53103 49615 49232 58543 61413 41143 33967 43642 44363 39294 31186 31073 30724
9240 30724 49947 60461 57368 39706 25427 19469 22331 34121 30038 18381 22518 27429 16119
9227 16119 27200 36050 42088 36771 43130 36731 41397 47471 60611 49308 46673 41339 43040 45017
9213 45017 53319 53290 58597 66124 49593 43334 40074 22807 33194 35864 38376 38012 42182 41353 28702
9198 28702 22373 20377 30021 18285 27919 15456 5852 12857 17001 21607 29149 36522 44919 41658
9184D1658j1418Q121L37j0731p534j7242q321Q249J5369P274l871o820n800L62
9170I633J3784L639r887k712Q306M197K765m277Q395J1750q837j5824k431j2364
9156F137j954J4545J1181J1018J341r692n593l020r903l258n725L628L842J5740
9142B8287l846j0607L76K928j6334m030l340q044J7405Q638r637K392O272l839
9128F621L052J6628k695j6086l823J2666J6394k945J6627j971j8756o586Q153
9115B7279N842n844j0562m305R203P59l491l232m680J173p400m55J5885P114N058
9100C2344j7215q454K795O224j0384j0430q477j586J1584K130j790j797j6R005
9086C933N178l035j0184j0641N510J1937J651J208o503m436M432l627J619P508
$$ plain form
9184 41658 30240 38361 38698 27967 20433 3191 -5130 3119 18488 25762 21891 15071 9271 9633
9170 9633 23417 27056 17169 14457 22763 26960 29725 25448 33843 45593 36756 20932 18501 6137
9156 6137 4183 18728 29909 40927 42268 32576 26983 23963 14060 10802 5077 8705 12547 28287
9142 28287 24441 13834 14210 17138 804 -3226 -6566 -14610 2795 11433 1796 4188 10460 6621
9128 6621 9673 26301 23606 7520 3697 16363 32757 29812 46439 44468 25712 19126 27279
9115 27279 33121 27277 16715 12410 21613 22372 18881 15649 10969 12142 4742 4287 20172 27286 32344
9100 32344 15129 6675 9470 15694 5310 -5120 -13597 -15183 -3599 -1469 -3259 -5056 -5072 3933
9086 3933 9111 6076 -4108 -14749 -9239 2698 4349 5557 -946 -5382 -950 -4577 -2958 4550
9072D550Q844P280j2005n899K520L052J201J2247J524p521Q881r979n087J3121
9058B2729P810P029m819l34j0642k729r48K38J558J0753k212L523j6554j3710
9044A692J8229Q127n425j7277l841N136R70K082J713K666j2291K667j005p337
9030c894J1070N216K802J0150n753j376k653k94j3667N510P573R140m954m287
9016A4583J3350Q441k4333n620Q372l956j7762k900J9148J2342m940j4898L345
9003E172L215P121O706M399p672p696R886L386j3251O8p131M502M571o017p255
8988Dj3424J8560M31j985K729k81K844j89K478J35l720J2150o899k884J2161Q714
8972C0824J664N397M426j1759j9304L504J353p925N474n876k009L728o43j207
$$ plain form
9072 4550 13394 20674 8669 2770 5290 8342 9543 21790 23314 15793 24674 14695 9608 22729
9058 22729 30539 37568 32749 32415 21773 19044 18096 18334 19892 30645 28433 31956 15402 1692
9044 1692 19921 28048 22623 5346 1505 6641 7611 9693 11406 14072 1781 4448 3443 -3894
9030 -3894 7176 12392 15194 25344 19591 18215 15562 15268 1601 7111 14684 23824 18870 14583
9016 14583 27933 36374 12041 6421 14793 10837 -6925 -9825 9323 21665 16725 1827 5172
9003 5172 8387 15508 22214 26613 18941 11245 21131 24517 11266 11334 4203 8705 13276 7259 4
8988 4 -13420 5140 5571 3586 6315 6034 8878 8689 11167 11302 7582 19732 12833 9949 22110 30824
8972 30824 32488 37885 42311 30552 11248 14752 16105 8180 13654 7778 5769 9497 8854 7647
8958G647Q115L817p255o652l084L211J2457m460K998J2912n124p306J84N150K410
8943B5020J2325r680p137j9916k4109j3025J0187J0055K7405J6226J750R590M263
8930D2954J382O154l084P189R533j0752j7905M546m318J260o905j4364M935L381
8916B4006p861m554r35j998l574O896P019O543O11m405m994j206J0874r461n761
8901A1200L714p503j3178R830P151J49m853q280J815J0670N734q071j0133q260
8887a0015J2112K3778J309P917l1J369m151j2890j1431J3766R114Q859j2973p575
8873A9158l311j1076N249O541Q66J1867J7633l503j0966o343n934j617K424n130
8859A5858j0900o193R151M809n728k653O183l481l023m245J0495J7376P886k879
$$ plain form
8958 7647 15762 19579 12324 5672 2588 5799 18256 13796 16794 29706 24582 17276 17460 22610 25020
8943 25020 37345 27665 20528 612 -23497 -36522 -26335 -16280 11125 27351 29101 38691 42954
8930 42954 44336 50490 47406 54595 64128 53376 35471 40017 35699 36959 30054 15690 20625 24006
8916 24006 16145 11591 10656 8658 5084 11980 18999 25542 26153 21748 16754 15548 26422 16961 11200
8901 11200 14914 7411 -5767 4063 11214 11363 6510 -1770 45 10715 16449 8378 -1755 -10015
8887 -10015 2097 25875 27184 35101 35070 36439 32288 19398 7967 21733 30847 39706 26733 19158
8873 19158 15847 4771 10020 16561 17427 29294 46927 43424 32458 26115 20181 18564 20988 15858
8859 15858 4958 -1235 7916 12725 6997 4344 10527 7046 4023 -222 10273 27649 35535 32656
8845C2656J0062p973j2838J2016K6237M742j188l765r636o341n796n370j2724
8832B0082j7609K203O747O297J673n900m454o435L536M477M119J1376J02o603
8818A9611r131m799N203j766Q644J203j4177m000n751N018J0207O944p553M264
8804A3917m598p036J1496L527j336l794l34M249R438o608n454j445J2658R129
8790C3809j359Q336j2565K796k587n507l557j1285L625j53N33k351J8633J1533
8776C9901o332j2653j0998j591O908l826n551m390j883m120J9436M855K40P031
8762B7027j953l366j5259j202J1906K265J5116L671m036K555p966n099J2154o237
8748B9576l29p602j5676r291J2164R729j3572J645Q507R30n535n632M424M717
$$ plain form
8845 32656 42718 34745 21907 33923 60160 64902 63714 59949 50313 43972 38176 32806 20082
8832 20082 2473 4676 11423 17720 19393 13493 9039 2604 6140 10617 14736 26112 26214 19611
8818 19611 10480 5681 10884 9118 17762 18965 4788 788 -4963 55 10262 17206 9653 13917
8804 13917 9319 2283 13779 17306 15970 12176 11842 16091 25529 18921 13467 12022 24680 33809
8790 33809 32450 40786 28221 31017 28430 22923 19366 8081 11706 11553 12086 9735 28368 39901
8776 39901 33569 20916 9918 8327 15235 11409 5858 1468 -415 -4535 14901 19756 19996 27027
8762 27027 25074 21708 6449 5247 17153 19418 34534 38205 34169 36724 28758 23659 35813 29576
8748 29576 29247 21645 5969 -3322 8842 18571 4999 6644 15151 16081 10546 4914 9338 14055
8734A4055N581l040k524J2012q58M539j187j319j163L253k641Q265L678k8084
8720A0567o838n87K373N863J0676j0478j8197P224j0702Q159J7385J0002L461
8707B8908j4918r047p892J457J3964k55J0820R834O267k538J1427L701k054l449
8693D6225l630R68O910J4436Q832N84L245j3608m927j1372m065J0942R009m901
8679E8648l67k463r702q403p820J4914R214Q641P547j0953j0028j8771m530k43
8665B5684k322p589R726J2379K0578J2822p18n941p697j1515j2496o785r600m074
8651A2452P620k751J3488J5336q026R400Q592J266J717j1156L166p32L750O621
8637F0743l274m412j3825j2076M6M851L717R54N555R510j2526j1130m562N971
$$ plain form
8734 14055 19636 16596 14072 26084 25226 29765 28578 27259 26096 29349 26708 34973 38651 10567
8720 10567 3729 3142 5515 11378 22054 11576 -6621 603 -10099 -1940 15445 25447 28908
8707 28908 13990 4943 -2949 -1492 12472 12217 23037 32871 39138 36600 48027 51728 49674 46225
8693 46225 42595 43563 50473 64909 73741 74325 77570 63962 59035 47663 43598 54540 63549 58648
8679 58648 58281 55818 46116 37713 29893 44807 54021 62662 70209 59256 49228 30457 25927 25684
8665 25684 23362 15773 25499 37878 58456 71278 70560 64619 56922 45407 32911 26126 16526 12452
8651 12452 20072 17321 30809 46145 38119 47519 56111 57377 59094 47938 51104 50372 54122 60743
8637 60743 57469 53057 39232 27156 27202 32053 35770 36724 42279 51789 39263 28133 23571 29542
8623B9542M317k996j2352N353K1558P53j4780N803J1010l429P235J6340J907L708
8609G3969k878P191N67Q652m965K390O017j536m40j0294j535K0145O055P7J3660
8594A17075J1500J9685J6045K0020L6719K9616K7415N2782L7226M6520P5061J12961
8582F02625K30437M29098O73521R16165R04792N26474k61675j021948r57695n79217
8572A462577l21703j95257j21024j05247p5461m2706l9629m2754k6136k6989j5468
8561D50203r05j2556k5037j2197j6094o335j3156j1592O083R223J4147J5829J0939
8548D08552J1675J5974L2550N3736L3477L6921N4831P8278J42279K36635L66977
8537A471885O14926J076548J643769J886750J408392K17664j634042k133998j415857
$$ plain form
8623 29542 33859 30863 18511 23864 45422 46175 31395 37198 48208 44779 52014 68354 70261 73969
8609 73969 71091 78282 78849 87501 82536 84926 90943 89407 88967 78673 77138 97283 103338 103415 117075
8594 117075 128575 148260 164305 184325 221044 250660 278075 330857 368083 414603 489664 602625
8582 602625 833062 1262160 1935681 2851846 3756638 4283112 4021437 2999489 2041794 1462577
8572 1462577 1140874 945617 824593 719346 643885 601179 561550 518796 492660 465671 450203
8561 450203 449298 436742 411705 399508 383414 377079 363923 352331 358414 367637 381784 397613 408552
8548 408552 420227 436201 468751 522487 555964 592885 647716 725994 868273 1104908 1471885
8537 1471885 2086811 3163359 4807128 6693878 8102270 8319934 6685892 4551894 3136037
8528C136037p86452m68254l08021k15832j54934j25796r5677p0682n4229k4998
8518H31162k7428l6408l2109l0602m7644l0667l4108k2605k298j6445K184O808
8506E59840l419r650k3090l386M764J0398q365n906K1492L0501L8284Q8488J45282
8493H45233K46975M29438O55688Q73371P97134L91825l67463j012423q83117n19393
8483A457268l00928j83566j19686r6297o6939n1235m9938l1332k0362j3221j5484
8472E08280k4057m4169l5863l6543j2835N659k364k056k1394j9665j6220j1723
8460B87050l548n365j2034o634j2941o087N827L044p167k2223j3986j0786l880
8447A91270L048j1429k6308M812K0130j1629p230j2213o542K151o965l949J1211
$$ plain form
8528 3136037 2349585 1881331 1573310 1357478 1202544 1076748 981071 910389 856160 831162
8518 831162 803734 767326 735217 704615 656971 626304 592196 569591 567293 550848 553032 559840
8506 559840 556421 546771 523681 520295 525059 535457 527092 521186 542678 573179 611463 699951 845233
8493 845233 1092208 1521646 2177334 3050705 3847839 4239664 3872201 2859778 1976661 1457268
8483 1457268 1156340 972774 853088 756791 689852 638617 588679 557347 536985 523764 508280
8472 508280 484223 440054 404191 367648 354813 360472 358108 356052 334658 314993 298773 287050
8460 287050 283502 278137 266103 259469 246528 240441 246268 249312 242145 219922 205936 195150 191270
8447 191270 194318 182889 156581 161393 181523 169894 162664 150451 143909 146060 139095 135146 146357
8434A46357p735j7635q589Q402m837l726P30p216p59Q779k0255m955L700N96k466
8419I0391q820q901J058J0892M354J736m13j5855j8865m616L957J4631M636j1050
8405F3135o719j203L983P692j3243j649r187R75J308K01n639J0119K063o463n159
8390D0214J3602P804q636J091n957k362N64m102l026m89L530j0036j3682K236
8376B0751J6056q697o728j030j188m004P014J3603M563l880p458o908n94J3929
8362C5429J9397m15J557q679q34p46j1383j0123p690J1373L205q275k6346j2021
8348a5551R489J1777O49j084L063j199l38J9161Q316K988m089l956N912N003j0747
8333B9394o176N983K5468K1595M594R660J752k84k299j2585j2930o139j3514p231
$$ plain form
8434 146357 138622 120987 112398 120800 115963 112237 112967 105751 104992 113771 93516 88561 92261 92857 90391
8419 90391 81571 72670 73728 84620 88974 90710 90297 74442 55577 50961 54918 69549 74185 63135
8405 63135 56416 55213 59196 66888 53645 51996 42809 43784 45092 45293 39654 49773 51836 45373 40214
8390 40214 53816 61620 52984 54075 48118 45756 46320 42218 39192 38703 42233 32197 18515 20751
8376 20751 36807 28110 21382 20352 19164 15160 22174 35777 40340 36460 29002 22094 21500 35429
8362 35429 54826 54411 55968 47289 46455 45709 34326 24203 16513 27886 31091 22816 -3530 -15551
8348 -15551 -6062 5715 6364 5280 8343 7144 6806 25967 34283 37271 33182 29226 35138 40141 29394
8333 29394 23218 29201 54669 76264 80858 90518 92270 91986 89687 77102 64172 58033 44519 37288
8319C7288k221j716J622j1406o162P55p401L125L25O216Q377j3076j1533r050
8305d857K787m170Q986J7645J1342j1214o087q204l477j0987j0267R621r125M037
8291a3970L2053K5606O507j0528R502J2581p531j2115j4964q941k736J1397N201
8278C2062M717p789j4214J8836J6342r904k0883j1904J3474k802j6219n116J4259
8265A0859o005q971N988J540j98N80J3086M364j1805j5055m307k201J3533J171
8251B579r820N444P482J189j0502j1160L741O86j0195J7015P728m479j9775j2725
8237c2792J468L933Q165Q653K872j2953n820R063Q325R820k788J538J0541M907
8223A4932J680j2762K077K132N975j1852m574N623k610j2402l16m723j621P78
$$ plain form
8319 37288 35067 33351 34973 23567 17405 18160 10759 13884 14209 20425 28802 15726 4193 -4857
8305 -4857 -2070 -6240 2746 20391 31733 20519 14432 6228 2751 -8236 -18503 -8882 -18007 -13970
8291 -13970 18083 43689 50196 39668 49170 61751 54220 42105 27141 18200 15464 26861 32062
8278 32062 36779 28990 14776 33612 49954 40050 19167 7263 20737 17935 1716 -3400 10859
8265 10859 4854 -4117 1871 3411 3213 3793 16879 21243 9438 -5617 -9924 -12125 1408 2579
8251 2579 -7241 -1797 5685 6874 -3628 -14788 -11047 -10361 -20556 -3541 4187 -292 -20067 -32792
8237 -32792 -31324 -27391 -19226 -10573 -7701 -20654 -26474 -17411 -9086 734 -2054 -516 10025 14932
8223 14932 16612 3850 5927 8059 14034 2182 -2392 3231 621 -11781 -12097 -16820 -18441 -17663
8209a7663J3953J0325J919L235p062k0048q373R996K6168J2378j9123m499J833
8196C039J1117O194l330j2009o036O994r134O41L444j045J7427L567n312n833
8182I724J438j136k807N275J030m45Q047q26r542r076k871j919J0643n274m358
8167b097J6034p347j372K311J5207m570r876m415j194K446J4996j0573j9324O090
8153c684q01P059j1979j0708Q697L067M877Q7m28Q641Q301l270p012o133n16R90
8137b812J3268O790n050J760J0664Q593m369j4558k222r8m282n106o073J3946
8123A0451Q187j6112o102p13m511J701J843P601M920q955J91J0162O734M01r000
8108F798k177M749J810j4907j2750M478k598n164j0647M717K491O361K819O518
$$ plain form
8209 -17663 -3710 6615 8534 11769 4707 -15341 -23714 -13718 12450 24828 5705 1206 3039
8196 3039 14156 20350 17020 5011 -1025 5969 -3165 -2524 920 -125 17302 20869 15557 9724
8182 9724 11162 10026 7219 12494 13524 13079 21126 20300 10758 1682 -1189 -3108 7535 2261 -2097
8167 -2097 13937 6590 5218 7529 22736 18166 8290 3875 2681 5127 20123 9550 -9774 -3684
8153 -3684 -4485 2574 -9405 -20113 -11416 -8349 -3472 -3385 -3813 4828 13129 9859 2847 -3286 -3802 -2812
8137 -2812 10456 17246 12196 13956 24620 33213 28844 14286 12064 11966 7684 2578 -3495 10451
8123 10451 18638 2526 -3576 -4289 -8800 -7099 -5256 2345 7265 -1690 -1499 8663 15397 15798 6798
8108 6798 4621 9370 11180 -3727 -16477 -11999 -14597 -19761 -30408 -25691 -23200 -16839 -14020 -7502
8094g502J9863J8652Q832J3547J578k836J0206j2735j2614p596p520R68o621j1679
8080D543Q555J7291n184j6384m457N339K775N423n355m969j1144N6R458J0316
8066A6263J1775o417j6802o569J0958K627Q911J1361j2182n507m390R32o997r13
8052C050L453J8294R864j178P59J8256R405L110m099j86K625j4120q066m363j6883
8037A9921Nj3235j8871K190Q216j452J1152K0883J0280M225m473j8108j7309N493
8023H917j406N617P490K649K758M46m778J7177j130o523m038m337Q567R756J33
8008D1298l527J7358M80m08m867j8928o792Q327J2466Q369O446n865j979k690
7994D9688l875j0500k991K297j0857N144N466n086O769o581n937N125j234m184
$$ plain form
8094 -7502 12361 31013 39845 53392 54970 52134 62340 49605 36991 29395 21875 22843 16222 4543
8080 4543 13098 30389 25205 8821 4364 9703 12478 17901 12546 7577 -3567 -3511 5947 16263
8066 16263 28038 21621 4819 -1750 9208 11835 20746 32107 19925 14418 10028 10960 3963 3050
8052 3050 6503 24797 34661 33483 34242 52498 61903 65013 60914 60728 63353 49233 41167 36804 19921
8037 19921 19926 6691 -12180 -9990 -1774 -3226 7926 28809 39089 43314 38841 20733 3424 8917
8023 8917 7511 13128 20618 23267 26025 26471 21693 38870 37740 31217 27179 22842 31409 41165 41298
8008 41298 37771 55129 55609 55201 50334 31406 24614 32941 45407 53776 60222 54357 52378 49688
7994 49688 45813 35313 32322 34619 23762 28906 34372 29286 36055 29474 23537 28662 27428 23244
7980B3244J0538L042K542m665j6817o147O134O386K1651N100r193J882N890Q68
7966E0455j5805J73j777j3940j2647p456M191N439j2204m990J0576M511J627M7
7952H200K343R51k335M211j085k629J333n232K164N759k913P435M764J6182Q024
7937D7172J860k2717k807R002R082j7336k9973r110m992m101p366R800J7337J7502
7923A3353N024k7779M423J620p914o762K944J5671J785k828p565J3820K0434L740
7909B9966J433J2584j296j003j3654j6817j501O918P158M256j4852q276n725m819
7895e628Q475K0458K937k080r006J74l054j3377q758j324M600R255k1319p050
7881b5697M469l192l05J9765J6048J0213J4645M206m470j5878k8841n160P960
$$ plain form
7980 23244 33782 36824 39366 34701 17884 11737 17871 24257 45908 51008 41815 43697 49587 50455
7966 50455 34650 34823 33046 19106 6459 -997 3194 8633 -3571 -8561 2015 6526 8153 8200
7952 8200 10543 11494 9159 13370 12285 9656 10989 5757 7921 13680 10767 18202 22966 39148 47172
7937 47172 49032 26315 23508 32510 41592 24256 -5717 -14827 -19819 -23920 -31286 -21486 -4149 13353
7923 13353 18377 -9402 -4979 -3359 -11273 -18035 -15091 580 2365 -463 -8028 5792 26226 29966
7909 29966 31399 43983 42687 41684 28030 11213 9712 16630 23788 28044 13192 4916 -809 -5628
7895 -5628 2847 23305 26242 24162 15156 15330 12276 -1101 -9859 -11183 -6583 2672 -18647 -25697
7881 -25697 -21228 -24420 -24725 -4960 11088 21301 35946 40152 35682 19804 -9037 -14197 -6237
7868f237q393J9105K6677r302q635k381j6462j216K533N576K798J2821n525j2769
7854a410K35O086L387j11O296J5791J114j88l852j7517j3010M75l672p707P519
7839f564K869L44L972r85k860Q973M63K701J1798r788o401J0128Q4o379j3333
7824d978r68K359j0229p416l920O57N257J7355K842N910P700q937j1753o028k158
7809a4307O777J4566N818j2286N525R41r381J0699K2262q564k0808J078J5061
7796A7381Q89j5939j4864J0495P333j0282q641M999L974O289M204k616R08j060
7782C070J0249P751j6912j3503o404K218N20O693J5586K263n481K049k585o566
7768a052k588M870P010J1983j617o338j5036j4460q568M279Q654J0167k102k315
$$ plain form
7868 -6237 -14630 4475 31152 21850 13215 10834 -5628 -6844 -4311 1265 4063 16884 11359 -1410
7854 -1410 -1175 4911 8298 8187 14483 30274 31388 31200 27348 9831 -3179 -2704 -6376 -14083 -6564
7839 -6564 -3695 -3351 621 -364 -3224 5749 6212 8913 20711 10923 4522 14650 14734 8355 -4978
7824 -4978 -5946 -3587 -13816 -21232 -25152 -24495 -19238 -1883 959 6869 14569 5632 -6121 -12149 -14307
7809 -14307 -7530 7036 12854 568 6093 7034 -2347 8352 30614 22050 1242 2320 17381
7796 17381 18270 2331 -12533 -2038 5295 -4987 -13628 -8629 -4655 1634 5838 3222 4130 3070
7782 3070 13319 21070 4158 -9345 -15749 -13531 -13011 -6318 9268 11531 6050 8099 5514 -1052
7768 -1052 -3640 1230 8240 20223 18606 12268 -2768 -17228 -25796 -21517 -12863 -2696 -4798 -7113
7754g113Q288m540n99J2024p248j2038k0592n396J1242K2630P606j2611R622r64
7740C11j4733k292o663J611P591P474j100L35N362J2065L557k1346j7237R251
7726a5814l404J2899q300l590L760Q777O433l748j156O331m524O978R066p337
7712F371j0290J765j0169o43R003p541m134J1652J478J505k095q617o953J355
7698a7313o19J0310L885K371M075P497j237o063L133j0316r651j8272n903L215
7684c4888Q855l440m063J53J1420J5547R233L27k512o081q258O458r251K948n52
7669a4104K276J1833J5472j7760m269R950o236l558M471N628l066j0570K675P208
7655e0L641j2503j4265n285L438J194l79O959N900p426n979P343Q012J1002n073
$$ plain form
7754 -7113 1175 -3365 -3964 8060 812 -11226 -31818 -37214 -25972 -3342 4264 -8347 1275 311
7740 311 -14422 -16714 -23377 -21766 -14175 -6701 -7801 -7466 -2104 9961 13518 -7828 -25065 -15814
7726 -15814 -19218 -6319 -14619 -18209 -14449 -5672 761 -2987 -4143 2188 -2336 4642 13708 6371
7712 6371 -3919 -2154 -12323 -12966 -3963 -11504 -15638 -3986 -2508 -1003 -3098 -11715 -18668 -17313
7698 -17313 -17932 -7622 -3737 -1366 2709 10206 8969 2906 6039 -4277 -13928 -32200 -38103 -34888
7684 -34888 -26033 -29473 -33536 -33383 -21963 -6416 2817 3144 632 -5449 -13707 -7249 -16500 -13552 -14104
7669 -14104 -11828 5 15477 -2283 -6552 3398 -2838 -6396 -1925 3703 637 -9933 -7258 -50
7655 -50 3591 -8912 -23177 -28462 -25024 -23830 -24209 -17250 -11350 -18776 -24755 -17412 -9400 1602 -3471
7640c471N036o831r304j0276J4059R043J426Q447o633j3203j1097P813O079K61
7626h651j310K114L874n276k1819k254K0462Q507j1123j8765o735J4484K5165
7613a327Q603k0679j1456J6221K1430L046l383j0655O324J694j1618j0490l135
7600a5425M075J1216J5012N246n870m50j365j2992k0845k832J2098J1094J580
7587E42p447j096p202k5m605k41k146p32q823J5376N041j5392n252J3208J6731
7572b063L274O276o625K03M800k811l580L490j524j1717K123J4577N301j6978
7558e254j2637P399L935n078m512k44l000r167N105n31J2755J2514p579M10j0402
7543a6286j1964o522P083O896o531o90Q870m084k879R784M442J7941J3081j2893
$$ plain form
7640 -3471 1565 -5266 -14570 -24846 -10787 -1744 -318 8129 1496 -11707 -22804 -14991 -8912 -8651
7626 -8651 -9961 -7847 -3973 -9249 -31068 -33322 -12860 -4353 -15476 -34241 -40976 -26492 -1327
7613 -1327 7276 -13403 -24859 -8638 12792 15838 12455 1800 8124 9818 -1800 -12290 -15425
7600 -15425 -11350 -134 14878 20124 14254 13804 12439 -553 -21398 -24230 -12132 -1038 542
7587 542 -6905 -8001 -15203 -15228 -19833 -20074 -22220 -22952 -31775 -16399 -11358 -26750 -32002 -18794 -2063
7572 -2063 1211 7487 862 1065 5865 3054 -526 2964 1440 -10277 -8154 6423 11724 -5254
7558 -5254 -17891 -10492 -6557 -11635 -16147 -16391 -19391 -28558 -23453 -23984 -11229 1285 -6294 -5884 -16286
7543 -16286 -28250 -34772 -27689 -20793 -27324 -28014 -19144 -23228 -26107 -16323 -11881 6060 19141 6248
7529F248j8820j5006L45O499j0849P151K2166O673L654j3782j4120n284R143m158
7515b0140j1692J115l607O148J2936k497Q587r044j0379k809R179J2307J1050
7502A154J643j930O426o056o49j291N312N777N687K833j5563p903n718Q907n515
7487f886P460k951o433J233l862P499J0338j0948q58Q086O974Q49l551j914j0983
7472e947n52K316M371Q067j0673m002J2128j821l701l913M21O277J4537j4929
7458B579j5688j1507J249N356R862o902N666L923n23Q032K3003j1395k8736o589
7444b1670n570r15P664J6094J4735m340J0442k50k3364j3074J1192N764O195r209
7430f306l742k628L193n140m472R698R607J678q935m60j1600n806m09k263J4105
$$ plain form
7529 6248 -12572 -27578 -27233 -20734 -31583 -24432 -2266 4407 8061 -5721 -19841 -25125 -15982 -20140
7515 -20140 -31832 -30717 -34324 -28176 -15240 -17737 -9150 -18194 -28573 -31382 -22203 -9896 1154
7502 1154 2797 867 7293 1237 588 -703 4609 10386 16073 18906 3343 -4560 -10278 -1371 -6886
7487 -6886 574 -2377 -8810 -7577 -11439 -3940 6398 -4550 -5408 2678 9652 10501 6950 5036 -5947
7472 -5947 -6499 -4183 188 8255 -2418 -6420 5708 3887 186 -3727 -3306 2971 17508 2579
7458 2579 -13109 -24616 -23367 -18011 -8149 -15051 -9385 -5462 -5985 2047 25050 13655 -15081 -21670
7444 -21670 -27240 -28155 -20491 -4397 10338 5998 16440 16190 -7174 -20248 -9056 -3292 2903 -6306
7430 -6306 -10048 -12676 -9483 -14623 -19095 -9397 210 1888 -7047 -7507 -19107 -24913 -25322 -27585 -13480
7415a3480M563j3105l23o088K314J3322j4009r436J6808Q032O858O279k074p253
7401g592k259Q352J237j3657k441J8912J5812j3131j7863r248k80M633M911K120
7387a0494J8116m750k3897J685K2574J3405K0069n813q295j3690k5557o811Q187
7374a5271J3725Q539M508l46m016j5770j1266K246J088J2757o988k025K0263Q814
7360A6258M897j2840j9985n149J2578r14m632O170R243j0883M666l429j1325k510
7346a7855J4078n068n534j551M185J482K367l739N611J8419P85j8177j2087k545
7332a9629J740L468q49n21L358L017k459Q970P551K599m618j6684o784P145k301
7317a5997J2203P389P005j1300j08R366n709j3631QJ2468q850j1636L417M066
$$ plain form
7415 -13480 -8917 -22022 -22345 -28433 -26119 -12797 -26806 -36242 -19434 -11402 -4544 1735 -339 -7592
7401 -7592 -9851 -1499 -262 -13919 -16360 2552 18364 5233 -12630 -21878 -22158 -17525 -12614 -10494
7387 -10494 7622 2872 -21025 -19340 3234 16639 36708 30895 22600 8910 -16647 -23458 -15271
7374 -15271 -1546 6993 11501 11155 7139 -8631 -19897 -17651 -16563 -3806 -10794 -12819 7444 16258
7360 16258 21155 8315 -11670 -16819 -4241 -5155 -9787 -3617 5626 -5257 -591 -4020 -15345 -17855
7346 -17855 -3777 -8845 -14379 -15930 -11745 -10263 -7896 -11635 -6024 12395 13180 -4997 -17084 -19629
7332 -19629 -17889 -14421 -15270 -15791 -12433 -9416 -11875 -2905 4646 7245 2627 -14057 -20841 -13696 -15997
7317 -15997 -3794 3595 10600 -700 -808 8558 2849 -10782 -10774 1694 -7156 -18792 -15375 -11309
7303a1309M860l513L689K398o317N084j4841O45L088P227O958m747j1493J573
7289a6698M707J7992R052j2545L807R5P24K1366m542n128R740k489k0500j0618
7275e037n690Q030P092j8842n424m010J5201N450o621r866k005J0676M764q28
7261g110n086J597j3394o936j666J1067J3914q976j2363J6422J0194r827o38M378
7247h424p644R56J2999L494m596q139q25Q027M111l908l229o090p651J698M097
7232a5124k591K364M370P195J1780r950j4201L922Q450K069m372k836k197J037
7218a0084o941L476J0876j619l271j205o635n736O799L129L341P474j4086J733
7204a2749P722J3648l330n808j0502l241M78J0044r237L55m778L990n030j5542
$$ plain form
7303 -11309 -6449 -9962 -6273 -3875 -10192 -5108 -19949 -19304 -16216 -8989 -2031 -6778 -18271 -16698
7289 -16698 -11991 6001 15053 2508 6315 6410 7134 28500 23958 18830 28570 26081 5581 -5037
7275 -5037 -10727 -2697 4395 -14447 -19871 -23881 -8680 -3230 -9851 -19717 -21722 -11046 -6282 -7110
7261 -7110 -12196 -10599 -23993 -30929 -32595 -21528 -7614 -16590 -28953 -12531 -2337 -12164 -12802 -8424
7247 -8424 -16068 -15112 -2113 1381 -3215 -11354 -12179 -4152 -41 -3949 -7178 -13268 -20919 -19221 -15124
7232 -15124 -17715 -15351 -10981 -3786 7994 -1956 -16157 -12235 -3785 -1716 -6088 -8924 -11121 -10084
7218 -10084 -17025 -13549 -2673 -4292 -7563 -8768 -15403 -21139 -14340 -11211 -7870 -396 -14482 -12749
7204 -12749 -5027 8621 5291 -517 -11019 -14260 -13782 -3738 -12975 -12620 -17398 -13408 -18438 -33980
7190c3980M134m937k885j008J2465L930l846M599J2349r167O965J6032K479p290
7176a60O5J081n265q190m613n09M307k018K595M625k104j422k90n031n421m752
7160b7102m287J8833M843l763k641j3219r6O417n855j1593L312O723l260l160
7146c4848J0260M753J3953r714L579J974j5903L33R035J0543K157r665q780M56
7132b1867K3140P913k608j14o324j3434j010k884Q304m76j4062M266R748N075
7118d333p535K943J4928p906j5277k209M14p6R373q52p559j1431m64J512j0548
7103c9020j978k163J1098K813Q025J465N631l374m92o305o489P074j3273l012
7089d0000R255N409P917p875L328j819Q063R267r87j863M598l715j0030r232N7
$$ plain form
7190 -33980 -29846 -34783 -37668 -38676 -26211 -22281 -26127 -21528 -9179 -18346 -11381 4651 7130 -160
7176 -160 -95 986 -4279 -12469 -17082 -17591 -13284 -15302 -12707 -8082 -10186 -11608 -11898 -16929 -22350 -27102
7160 -27102 -31389 -12556 -7713 -11476 -14117 -27336 -27432 -21015 -26870 -38463 -35151 -28428 -31688 -34848
7146 -34848 -24588 -19835 -5882 -15596 -12017 -10043 -25946 -25613 -16578 -6035 -3878 -13543 -22323 -21867
7132 -21867 1273 9186 6578 6464 140 -13294 -14304 -17188 -8884 -9360 -23422 -19156 -9408 -4333
7118 -4333 -11868 -8925 6003 -1903 -17180 -19389 -18975 -19051 -9678 -10530 -18089 -29520 -29984 -28472 -39020
7103 -39020 -40998 -43161 -32063 -29250 -21225 -19760 -14129 -17503 -17995 -24300 -30789 -23715 -36988 -40000
7089 -40000 -30745 -25336 -17419 -25294 -21966 -23785 -15722 -6455 -7442 -9305 -4707 -8422 -18452 -27684 -27627
7074b7627Q465J1249l380r736r5O786q65r520N934Q035P350k570j75J4954J071
7059I876k0256l110N054P308Q012j553J59l147K633q437L259J9350l023j3347
7045B778j678o385k078k255J004o320K360P885J0013k467j479J626L206M10j2946
7030f326l376N320L142m199J0347J0386p065r876o906l142k120k225O902L79J179
7015g580Q075l05p423m140m797l570O899k620o375p889q232J5438J2166j0315
7001b0668j4782R37M332N910o83J490L494J0152K122J648J0642p227j9125q457
6987c0215p329j516N039J0933j245N229L327p434K361J6832o75n100K582o52o064
6972a3927M053J3402k623Q876k120l941J633j0809m414P359N87j0162m647k92
$$ plain form
7074 -27627 -19162 -7913 -11293 -21029 -21124 -14338 -15203 -24723 -18789 -10754 -3404 -5974 -6149 8805 9876
7059 9876 -10380 -13490 -8436 -1128 6884 5331 5490 2343 4976 -3461 -202 19148 16125 2778
7045 2778 1100 -5285 -7363 -9618 -8614 -14934 -12574 -4689 5324 2857 1378 3004 6210 6620 -6326
7030 -6326 -9702 -4382 -1240 -5439 4908 15294 8229 -1647 -8553 -11695 -13815 -16040 -9138 -8759 -7580
7015 -7580 495 190 -7233 -11373 -16170 -19740 -12841 -15461 -21836 -29725 -37957 -22519 -10353 -20668
7001 -20668 -35450 -34513 -30181 -24271 -24954 -23464 -19970 -9818 -7696 -6048 4594 -2633 -21758 -30215
6987 -30215 -37544 -39060 -34021 -23088 -24333 -19104 -15777 -23211 -20850 -4018 -4693 -9793 -7211 -7863 -13927
6972 -13927 -9874 3528 905 9781 7661 3720 5353 -5456 -9870 -2511 -1924 -12086 -16733 -17025
6958a7025k561O450l605j2054L735P814O117J2128Q314n791J382J4646M720l823
6944B0447j6098j8285O597P801L370N403O37r608j906N459K825k378p663j0557
6930a3956o134J1074J0049k716n004K075J2243L196k405O432o887j0313J0610
6917H264J517m665j6789p043R067m87q3O197l456l986o72L799K050j0226j0959
6902b7472n444J3277J0493P5J4977N799j9302l458n881J204M448o059j940J0905
6888h378J5685k571j3557l572o784k944R912j2160j1376J5913R273k670L014j921
6874a2136N85J9170L068p677m237o825J5638L260j790j903n670q124J8983M511
6860A6853r534j2059Q800L270p369M740M098R5m492J16n23l514j0430l510K9588
$$ plain form
6958 -17025 -19586 -13136 -16741 -28795 -25060 -17246 -11129 999 9313 3522 4904 19550 24270 20447
6944 20447 4349 -13936 -7339 462 3832 9235 9872 264 -1642 3817 6642 4264 -3399 -13956
6930 -13956 -20090 -9016 1033 -1683 -6687 -4612 7631 10827 8422 14854 7967 -2346 8264
6917 8264 9781 5116 -11673 -18716 -9649 -10136 -10219 -4022 -7478 -11464 -12136 -8337 -6287 -16513 -27472
6902 -27472 -32916 -19639 -9146 -9071 5906 11705 -7597 -11055 -16936 -15732 -11284 -17343 -19283 -8378
6888 -8378 7307 4736 -8821 -12393 -19177 -22121 -12209 -24369 -35745 -19832 -10559 -13229 -10215 -12136
6874 -12136 -11551 7619 10687 3010 -1227 -8052 7586 10846 9056 7153 1483 -6641 12342 16853
6860 16853 7319 -4740 4060 7330 -39 4701 8799 8894 4402 4518 3995 481 -9949 -13459 16129
6845A6129k894j1027K909J833l085N066m327j0472q715K593j718K281P668N084
6831A325j165o488N532N387j106j604r10j574J119N987j5702j6464R285M629o063
6816a7812o928N22J1381P470p515J7878p86m647K19J510Q04J162r283Q644K2005
6801B4624r346j0053J382o548K527k18n338l311P99J0270J1783l390n124M867
6787A2924m542j1487p132j4603J2246J2283l784M098P643m094j0590l01J1132
6774C793R66j3551N372N264m990q094M213M606j140j380K642M481j1049j1550
6760b0417j1732k753j0949O149L969R471m094j3064J1691K6743J2495K433o984
6747B958M046o511j407J0995P330J1642P794l937Q445p142j5388j7204m281O935
$$ plain form
6845 16129 13235 2208 5117 6950 3865 8931 4604 -5868 -14583 -11990 -13708 -11427 -3759 1325
6831 1325 160 -6328 -796 4591 3485 1881 971 -603 516 6503 -9199 -25663 -16378 -11749 -17812
6816 -17812 -24740 -24218 -12837 -5367 -12882 4996 4210 -437 -218 1292 2096 3258 -6025 2619 24624
6801 24624 15278 5225 6607 59 2586 2368 -2970 -6281 -5482 4788 16571 13181 8057 12924
6787 12924 8382 -3105 -10237 -24840 -12594 -311 -4095 3 7646 3552 -7038 -7339 3793
6774 3793 4759 -8792 -3420 1844 -3146 -11240 -7027 -2421 -3561 -4941 -2299 2182 -8867 -20417
6760 -20417 -32149 -34902 -45851 -39702 -35733 -26262 -30356 -43420 -31729 -4986 7509 9942 2958
6747 2958 7004 493 -914 10081 17411 29053 36847 32910 41355 34213 18825 1621 -2660 4275
6733D275J3139n506j177K319l270L407J7308j2185N120N509m691l288J6319J54
6719C7433q800J1407J2113J9242L2842M6964P3649P7319P5860L9034k5941r3811
6707B97311r0185n3758k8246k1046j7017j6919k4259l0866l555J2159J1242j2862
6695B1999j1880J3393m427N544m341o97K302J0697m977N70j1294J375J7084m988
6681C0360j2063L90n215o381j915m466n428j363J5938o760j2974p48n324l737
6667a9686J1430J5448P229k974J950q494J026L328j2324j0659J1883R397L123
6654A0677J715o175n89L835j696k019q086L5J3145Q04o8k904l617j949Q660j0990
6638G78j5044P087J7796j4065j9461j501P21J2393O222K54J3302M753n026j280
$$ plain form
6733 4275 17414 11908 10731 13050 9780 13187 30495 18310 23430 28939 24248 20960 37279 37433
6719 37433 28633 40040 52153 71395 104237 151201 224850 302169 378029 417063 391122 297311
6707 297311 207126 153368 125122 104076 87059 70140 45881 15015 11460 23619 34861 21999
6695 21999 10119 23512 19085 24629 20288 19591 21893 32590 27613 28183 16889 18264 35348 30360
6681 30360 18297 18687 13472 7091 5176 710 -4718 -6081 9857 3097 -9877 -10625 -15949 -19686
6667 -19686 -8256 7192 14421 11447 13397 4903 5929 9257 -3067 -13726 -1843 7554 10677
6654 10677 12392 6217 5628 9463 7767 5748 -2338 -2303 10842 11646 11578 8674 5057 3108 11768 778
6638 778 -14266 -7179 10617 -3448 -22909 -24410 -23689 -11296 -5074 -4820 8482 13235 8209 6929
6624F929j2959o014p638n032q38Q496N759Q472M892o257m770o436j6725P0J8475
6609a3576J5592j4872j072N844m430k1260r775M633M109R695O127k723R397j53
6595a2464j0764O213k962o79J2805K367j0495P255l048j9861o325n715J0608J3259
6581a9806Q354n29J143Q731J756J31M170o524Q575k503m195j3690n240N758j687
6566a5556j2480l153J1354J6731K291M272J4215N942j8515j083m683r399M222
6553e842K604q676J0054J8386o833j3813q362N915Q065j383j1563J051J6175j101
6539D677j2559j518m635O453J2411m368o300n22m044P54o973R778L203R890N869
6524A2116Q425k112j0380q708j415K150j3431Q033L2K172m877r31k026K3555J1226
$$ plain form
6624 6929 -6030 -12044 -19682 -24714 -25552 -17056 -11297 -2825 2067 -4190 -8960 -15396 -32121 -32051 -13576
6609 -13576 2016 -12856 -13928 -8084 -12514 -33774 -43549 -38916 -34807 -25112 -18985 -21708 -12311 -12464
6595 -12464 -23228 -17015 -19977 -20656 -7851 -5484 -15979 -8724 -11772 -31633 -37958 -43673 -33065 -19806
6581 -19806 -11452 -11981 -10838 -2107 -351 -220 3950 -2574 6001 3498 -697 -14387 -19627 -13869 -15556
6566 -15556 -28036 -31189 -19835 -3104 -813 3459 17674 23616 5101 4018 -665 -10064 -5842
6553 -5842 -3238 -11914 -1860 16526 9693 -4120 -12482 -6567 1498 115 -11448 -10397 5778 4677
6539 4677 -7882 -9400 -14035 -7582 4829 461 -5839 -6361 -10405 -9651 -16624 -6846 -3643 6247 12116
6524 12116 20541 18429 8049 -659 -2074 76 -13355 -5322 -5290 -3118 -7995 -8926 -10952 12603 23829
6509B3829j1012J23j965Q460m945k564k623r573j2147r669o490j4148M089J945
6495c6690L755J1498K1141J0012J0907M977k940j0103r992p35q30n671q030K219
$$ plain form
6509 23829 12817 12940 10975 19435 14490 11926 9303 -270 -12417 -22086 -28576 -42724 -38635 -36690
6495 -36690 -32935 -21437 -296 9716 20623 25600 22660 12557 2565 1830 1000 -4671 -12701 -10482
$$ [...]
##END NTUPLES=NMR SPECTRUM
##END=
