##TITLE=Analysis number 318458
Compound Code cc 04205
Project Code adrs
Chemist Name melford
+D2O for solubilty
##JCAMPDX= 6.0         $$ Bruker NMR JCAMP-DX V2.0
##DATA TYPE= NMR SPECTRUM
##DATA CLASS= NTUPLES
##ORIGIN= Bruker BioSpin GmbH
##OWNER= nmr
$$ XWIN-NMR		Version 3.5
$$ Wed Mar 29 13:34:42 2006 GMT Daylight Time (UT+1h)  MAYBRIDGE\nmr@NMR_250MHZ
##.OBSERVE FREQUENCY= 250.131544655141
##.OBSERVE NUCLEUS= ^1H
##.ACQUISITION MODE= SIMULTANEOUS (DQD)
##.ACQUISITION SCHEME= undefined
##.AVERAGES= 16
##.DIGITISER RES= 18
##SPECTROMETER/DATA SYSTEM= dpx250
##.PULSE SEQUENCE= zg30
##.SOLVENT NAME= CDCl3
##.SHIFT REFERENCE= (INTERNAL, CDCl3, 0, 16.522)
##AUDIT TRAIL= $$ (NUMBER, WHEN, WHO, WHERE, WHAT)
$$ ##TITLE= Audit trail, XWIN-NMR		Version 3.5
$$ ##JCAMPDX= 5.01
$$ ##ORIGIN= Bruker BioSpin GmbH
$$ ##OWNER= nmr
$$ C:\u/data/dgb/nmr/ADRS/1700/pdata/1/auditp.txt
$$ ##AUDIT TRAIL=  $$ (NUMBER, WHEN, WHO, WHERE, WHAT)
(   1,<2006-03-29 13:34:21.03 +100>,<MAYBRIDGE\nmr>,<NMR_250MHZ>,
      <created by zg, POWCHK disabled, PULCHK disabled
       configuration hash MD5:
       84 BC 41 DB A1 6E 1D 46 DA 25 12 A5 C1 ED C5 3A
       data hash MD5: 64K
       96 3F 6E 9F 5A 3F 17 BB 4E 70 68 10 BB 6D 2C E4>)
(   2,<2006-03-29 13:34:34.59 +100>,<MAYBRIDGE\nmr>,<NMR_250MHZ>,
      <Start of raw data processing
       ef LB = 0.3 FT_mod = 6 PKNL = 1 SI = 32K 
       data hash MD5: 32K
       84 78 BF B0 72 3E 47 43 F8 E7 66 B6 B4 32 45 45>)
(   3,<2006-03-29 13:34:36.05 +100>,<MAYBRIDGE\nmr>,<NMR_250MHZ>,
      <apk 
       data hash MD5: 32K
       26 1C 66 87 43 3B 24 EE D5 07 80 DD 6C F9 33 D4>)
(   4,<2006-03-29 13:34:36.83 +100>,<MAYBRIDGE\nmr>,<NMR_250MHZ>,
      <abs ABSG = 5 
       data hash MD5: 32K
       5F 48 4D A1 13 19 0B FC CF 38 EC 3D A9 DE 1C 70>)
$$ ##END=
$$ 
$$ hash MD5
$$ B7 5B 8F FE FC 49 E0 46 A2 3C FE B7 74 36 0A AA
##$RELAX= 
##$RELAX= 
##$RELAX= 
##$RELAX= 
##$RELAX= 
##$RELAX= 
##$RELAX= 
$$ Bruker specific parameters
$$ --------------------------
##$DU= <C:\u>
##$EXPNO= 1700
##$NAME= <ADRS>
##$PROCNO= 1
##$TYPE= <nmr>
##$USER= <dgb>
##$AMP= (0..31)
100 100 100 100 100 100 100 100 100 100 100 100 100 100 100 100 100 100 
100 100 100 100 100 100 100 100 100 100 100 100 100 100 
##$AQSEQ= 0
##$AQ_mod= 3
##$AUNM= <au_zg>
##$AUTOPOS= <30 >
##$BF1= 250.13
##$BF2= 250.13
##$BF3= 250.13
##$BF4= 250.13
##$BF5= 500.13
##$BF6= 500.13
##$BF7= 500.13
##$BF8= 500.13
##$BYTORDA= 1
##$CFDGTYP= 0
##$CFRGTYP= 5
##$CHEMSTR= <none>
##$CNST= (0..31)
1 1 145 1 1 1 1 1 1 1 1 1 1 1 1 1 1 1 1 1 1 1 1 1 1 1 1 1 1 1 1 1 
##$CPDPRG= <>
##$CPDPRG1= <>
##$CPDPRG2= <>
##$CPDPRG3= <>
##$CPDPRG4= <mlev>
##$CPDPRG5= <mlev>
##$CPDPRG6= <mlev>
##$CPDPRG7= <mlev>
##$CPDPRG8= <mlev>
##$CPDPRGB= <>
##$CPDPRGT= <>
##$D= (0..31)
0 1 0 0 0 0 0 0 0 0.06 0 0 0 0 0 0 0.0002 0 0 0 0 0 0 0 0 0 0 0 0 0 0 
0 
##$DATE= 1143635660
##$DBL= (0..7)
120 120 120 120 120 120 120 120 
##$DBP= (0..7)
150 150 150 150 150 150 150 150 
##$DBP07= 0
##$DBPNAM0= <>
##$DBPNAM1= <>
$$ [...]
##$SUBNAM7= <"">
##$SUBNAM8= <"">
##$SUBNAM9= <"">
##$SW= 20.6930455092707
##$SWIBOX= (0..15)
0 0 3 0 0 0 0 0 0 0 0 0 0 0 0 0 
##$SW_h= 5175.983436853
##$TD= 65536
##$TD0= 1
##$TE= 294.16
##$TE2= 300
##$TE3= 300
##$TEG= 300
##$TL= (0..7)
0 120 120 120 120 120 120 120 
##$TP= (0..7)
150 150 150 150 150 150 150 150 
##$TP07= 0
##$TPNAME0= <>
##$TPNAME1= <>
##$TPNAME2= <>
##$TPNAME3= <>
##$TPNAME4= <>
##$TPNAME5= <>
##$TPNAME6= <>
##$TPNAME7= <>
##$TPOAL= (0..7)
0.5 0.5 0.5 0.5 0.5 0.5 0.5 0.5 
##$TPOFFS= (0..7)
0 0 0 0 0 0 0 0 
##$TUNHIN= 0
##$TUNHOUT= 0
##$TUNXOUT= 0
##$USERA1= <user>
##$USERA2= <user>
##$USERA3= <user>
##$USERA4= <user>
##$USERA5= <user>
##$V9= 5
##$VALIST= <valist>
##$VCLIST= <CCCCCCCCCCCCCCC>
##$VD= 0
##$VDLIST= <DDDDDDDDDDDDDDD>
##$VPLIST= <PPPPPPPPPPPPPPP>
##$VTLIST= <TTTTTTTTTTTTTTT>
##$WBST= 1024
##$WBSW= 4
##$XGAIN= (0..3)
0 0 0 0 
##$XL= 0
##$YL= 0
##$YMAX_a= 99433
##$YMIN_a= -165952
##$ZGOPTNS= <>
##$ZL1= 120
##$ZL2= 120
##$ZL3= 120
##$ZL4= 120
##$ABSF1= 16.522
##$ABSF2= -4.171173
##$ABSG= 5
##$ABSL= 3
##$ALPHA= 0
##$AQORDER= 0
##$ASSFAC= 0
##$ASSFACI= 0
##$ASSFACX= 0
##$ASSWID= 0
##$AUNMP= <proc_1d>
##$AZFE= 0.1
##$AZFW= 0.1
##$BCFW= 0
##$BC_mod= 0
##$BYTORDP= 0
##$COROFFS= 0
##$CY= 12.5
##$DATMOD= 1
##$DC= 0
##$DFILT= <>
##$DTYPP= 0
##$F1P= 14.0000005364418
##$F2P= -0.99999901652339
##$FCOR= 0.5
##$FTSIZE= 32768
##$FT_mod= 6
##$GAMMA= 0
##$GB= 0
##$INTBC= 1
##$INTSCL= 1
##$ISEN= 128
##$LB= 0.3
##$LEV0= 0
##$LPBIN= 0
##$MAXI= 10000
##$MC2= 0
##$MEAN= 0
##$ME_mod= 0
##$MI= 0
##$NCOEF= 0
##$NC_proc= -4
##$NLEV= 6
##$NOISF1= 0
##$NOISF2= 0
##$NSP= 0
##$NTH_PI= 0
##$NZP= 0
##$OFFSET= 16.522
##$PC= 1
##$PHC0= 175.8755
##$PHC1= 6.043724
##$PH_mod= 1
##$PKNL= yes
##$PPARMOD= 0
##$PSCAL= 4
##$PSIGN= 0
##$REVERSE= no
##$SF= 250.13
##$SI= 32768
##$SIGF1= 0
##$SIGF2= 0
##$SINO= 400
##$SIOLD= 32768
##$SREGLST= <1H.CDCl3>
##$SSB= 0
##$STSI= 32768
##$STSR= 0
##$SW_p= 5175.98343685301
##$SYMM= 0
##$S_DEV= 0
##$TDeff= 65536
##$TDoff= 0
##$TI= <Analysis number 999999
Compound Code 99
Book Reference 9
Project Code 9>
##$TILT= no
##$TM1= 0
##$TM2= 0
##$TOPLEV= 0
##$USERP1= <user>
##$USERP2= <user>
##$USERP3= <user>
##$USERP4= <user>
##$USERP5= <user>
##$WDW= 1
##$XDIM= 32768
##$YMAX_p= 318181419
##$YMIN_p= -704595
$$ End of Bruker specific parameters
$$ ---------------------------------
##NTUPLES= NMR SPECTRUM
##VAR_NAME=  FREQUENCY,     SPECTRUM/REAL,   SPECTRUM/IMAG
##SYMBOL=    X,             R,               I
##VAR_TYPE=  INDEPENDENT,   DEPENDENT,       DEPENDENT
##VAR_FORM=  AFFN,          ASDF,            ASDF
##VAR_DIM=   32768,         32768,           32768
##UNITS=     HZ,            ARBITRARY UNITS, ARBITRARY UNITS
##FACTOR=    0.157963299565203, 1,           1
##FIRST=     4132.6476996994, 0,             0
##LAST=      -1043.33573715361, 0,           0
##MIN=       -1043.33573715361, -704595,     0
##MAX=       4132.6476996994, 318181419,     0
$$ Real data points
##PAGE= N=1
##DATA TABLE= (X++(R..R)), XYDATA
$$ [...]
23319B68074m8405k64476j04125n4578k4605K07276J44737m1494o2917o9173P2016
23308B2330J86265r7724k37921m5819K6409N7696O2415p2110M0758J07927l8745
23297A1481J43515m4140O0698K6771j87896j02447O8605J9389M9810J6977N3277
23286A16040R464K6732O3862L2640j72559k46190O7799R0400l18875n3415M1050
23275c43052M4445L0092N7061J65808j3003L807l7833R1713L8975n0875q0157
23264i3019r4361M502L7950R0419P482J2128j10404m2464m1292J21584J13027
23253E552j6424o6956N9605j713j44084l8472J55472O5866j07118o6199R2805
23242f1666R2350n4360q8328k4490R6561J18647N5657k40147k6489L7214m9289
$$ plain form
23319 268074 219669 -44807 -148932 -203510 -228115 -20839 123898 82404 19487 -49686 22330
23308 22330 208595 110871 -127050 -172869 -146460 -88764 -26349 -98459 -57701 50226 11481
23297 11481 154996 110856 171554 198325 10429 -92018 -23413 -4024 45786 62763 116040
23286 116040 125504 152236 216098 248738 76179 -170011 -102212 -11812 -330687 -384102 -343052
23275 -343052 -298607 -268515 -211454 -45646 -58649 -54842 -92675 -962 38013 -12862 -93019
23264 -93019 -187380 -182878 -144928 -54509 -47027 -34899 -145303 -187767 -229059 -107475 5552
23253 5552 -10872 -77828 -18223 -19936 -164020 -202492 -47020 18846 -88272 -154471 -61666
23242 -61666 30684 -23676 -112004 -136494 -39933 78714 134371 -105776 -132265 -95051 -144340
23231a44340k0432J07733n4111O2582K6085j20237L1958o403Q659j10292m651
23220b23449R4772O2922J78357J52177j81111R432R9761l4553O123j34974q3326
23209e3869J08639O0817p1555l6554j45374J21650L2272m886M7222p2276O1354
23198D7440N6689j36129j16467j9967n0776R8764j6009r4432N3618J25213m2810
23187i4866j73792P0302J6116m7963O1759N7371j37118j53730p1642J41323J44722
23176a87518K28650J6567j63351j12972N0132m0975m4840J97037P1175j3276J12210
23165A12839J63156L5803r2415k81729j06879J22972J94283R5303q6652m5407
23155A11274J11973k57474j72885Q9481o9066J95683o1636q1301J22898Q3803
$$ plain form
23231 -144340 -164772 -57039 -111150 -48568 -22483 -142720 -110762 -117165 -108506 -218798 -223449
23220 -223449 -128677 -65755 112602 264779 83668 93100 192861 158308 164431 29457 -53869
23209 -53869 54770 115587 44032 7478 -137896 -16246 16026 11140 58362 -13914 47440
23198 47440 104129 -32000 -148467 -168434 -219210 -120446 -136455 -230887 -177269 -52056 -94866
23187 -94866 -268658 -198356 -182240 -230203 -168444 -111073 -248191 -401921 -473563 -332240 -187518
23176 -187518 41132 57699 -105652 -218624 -168492 -209467 -254307 -57270 13905 629 112839
23165 112839 275995 311798 219383 -62346 -169225 -46253 148030 243333 156681 111274
23155 111274 223247 -34227 -207112 -117631 -186697 8986 -52650 -133951 -11053 72750
23145G2750q9848j72962N3878K7856J02828r4711K289O4107p3627j21020L619
23134b24841J89146k8815l1316J3602J58508j37415m3756j34698K38483K87276
23124B86174j09713j25362K7189Q2695J1685j46034k48983n9994K91435J93508
23114B02600p792l7985j61616j6966P6776l06009k38593q4335J82476K90455J36679
23103C5690K28195k7593Q774j51305j01477o3738Q2122M9464K0846l5756P0790
23092A16012q6416k0239p2136j26342j6364j5422K7992M6716n1738J67094j13849
23081a44692l444O405K4876J04670L9908q64J9892K5912k5653M8411M2113M0637
23069A78171q5915N6097J01918J9016o8907q6802J01206l39j55081k4669j9864
$$ plain form
23145 72750 -17098 -190060 -136182 -108326 -5498 -100209 -97920 -33813 -107440 -228460 -224841
23134 -224841 -35695 -64510 -95826 -82224 76284 -61131 -104887 -239585 -1102 286174
23124 286174 176461 51099 78288 160983 172668 26634 -222349 -282343 9092 202600
23114 202600 194808 156823 -4793 -21759 55017 -250992 -489585 -573920 -391444 -100989 35690
23103 35690 263885 236292 245066 93761 -7716 -71454 10668 60132 80978 45222 116012
23092 116012 29596 9357 -62779 -189121 -205485 -220907 -192915 -146199 -197937 -30843 -144692
23081 -144692 -148136 -141731 -116855 -12185 27723 26859 46751 72663 47010 95421 137534 178171
23069 178171 92256 148353 250271 269287 200380 113578 214784 214445 59364 34695 14831
23058A4831l2048p6374j11900q5058J04055K16136L2136L0151k6478n1344K330
23047A6437m8913j6324N915k7669N3025L6225r2576j664R1892J45453Q7165O5733
23035C14699m1347j75047K240K2736j3615J5284J35163j39846m4718J02030p5256
23024A02323L5543K168j40072m7973l1913k516R3851N2558j64025K5956N5875
23013a8225p772J0447p4634k9171M8044J43043J1950o068o1437p8808j0000J2395
23001f0236K34444K4515k10287O451O2495L2953j10521j722N0029k4762K1130
22990B4489m029P7212N1566j7269m1052R7874p3634k40972l7294n0130k0710J78827
22978e5122L4196o0178j25553l6555j9J84582N2473j12090j921K75759R6770j79523
$$ plain form
23058 14831 -17217 -93591 -205491 -290549 -186494 29642 61778 91929 65451 14107 16437
23047 16437 -32476 -48800 -42885 -70554 -17529 18696 -73880 -75544 16348 161801 248966 314699
23035 314699 273352 98305 100545 123281 109666 124950 260113 120267 75549 177579 102323
23024 102323 137866 140034 -38 -48011 -79924 -82440 11411 63969 -100056 -74100 -18225
23013 -18225 -25997 -15550 -90184 -119355 -71311 71732 83682 77614 16177 -62631 -72631 -60236
23001 -60236 174208 198723 -11564 -5113 57382 90335 -20186 -21908 28121 3359 24489
22990 24489 20460 97672 149238 131969 90917 188791 115157 -125815 -163109 -213239 -233949 -55122
22978 -55122 -20926 -81104 -206657 -243212 -243231 -58649 -6176 -118266 -120187 155572 252342 72819
22966G2819J36942K41813q3898j04470j39844j95465K7956J38136J05967j04175
22956I5781k401j76971k2576m399M5519n262R9930K8055n5440R4262n0960k8969
22944A6569n196q6614J6267J8678J28310J01649M3472j05999j32506P128Q9350
22933I1108O2003j60581N5581Q1048N7477q1730m7195j09611j9588J5920j07343
22922a62911O9414J43259o410J30226j05827j85421l37370k1093J60028J25125
22912a90980M8452L5224m8026Q2612r2042P3188o0474J98454O087k26952J53985
22901b0472J00888j69228j1614J12647N927O3978Q531k07064J49505M6653P619
22890H7370J36555j02858n7616J05055O2027k09542o8481J19170m7849Q965J02010
$$ plain form
22966 72819 209761 451574 367676 263206 123362 -72103 -44147 93989 199956 95781
22956 95781 93380 -83591 -106167 -110566 -65047 -70309 29621 57676 2236 96498 45538 16569
22944 16569 11373 -75241 -58974 -40296 88014 189663 233135 127136 -5370 1758 91108
22933 91108 153111 -7470 48111 129159 186636 104906 57711 -51900 -71488 -55568 -162911
22922 -162911 -93497 49762 43352 173578 67751 -117670 -455040 -476133 -316105 -190980
22912 -190980 -142528 -107304 -155330 -72718 -164760 -91572 -152046 46408 52495 -174457 -20472
22901 -20472 80416 -88812 -100426 12221 18148 82126 90657 -116407 33098 79751 87370
22890 87370 223925 121067 63451 168506 230533 20991 -47490 71680 23831 32796 134806
22879A34806k01193p6061K485j92176o1652J44074J4162k6647L2250J96721J59262
22868A26031p8453r0921j01859j06859K55294J42989M4114j35608j50017j53298
22858b48587N6394P0750l7522L6232K03685r2578L1086j24027m4104J35158J49124
22847A35611q7149p7579j9810L2580q6995M5987N6884J69061K08300p4748J01837
22836D03979J09896r3704k11913j3536N8935l4974j00713j39018p4038j512q1121
22825a77719j54669N4808J62448J58660J1654j36935j5820r4107q0418K13532
22815e8566J37029k20785j05962Q4761K24954J62535P6617j01221l02391l29055
22805d32084j13784Q6242J50021K99667J5145o3974L1253Q8285O0554j14042M9582
$$ plain form
22879 134806 -66387 -142448 -139963 -332139 -393791 -249717 -235555 -262202 -229952 -33231 126031
22868 126031 47578 -43343 -145202 -252061 3233 146222 190336 54728 -95289 -248587
22858 -248587 -192193 -121443 -158965 -122733 80952 -11626 19460 -104567 -148671 -13513 135611
22847 135611 48462 -29117 -48927 -16347 -103342 -57355 -471 168590 376890 302142 403979
22836 403979 513875 420171 208258 194722 253657 218683 117970 -21048 -95086 -96598 -177719
22825 -177719 -332388 -277580 -115132 43528 55182 -81753 -97573 -191680 -272098 -58566
22815 -58566 78463 -142322 -248284 -163523 61431 223966 300583 199362 -103029 -432084
22805 -432084 -545868 -459626 -309605 -9938 5207 -58767 -27514 60771 121325 7283 56865
22794E6865m1525j38551K8938J4488p4713R3782J83706J10712O8685k19839j51066
22783f8518j1435J55976p3374j11383p8776J20498l9065J20128L5152m0726r3820
22772h5343P1401K6377J5691J1660j10658m542P6939P7441M8259J01299j68616
22761E9908r3766j10656J25906J4600M0123r1272J33989K40291m1433j59977j92587
22750g4874q147J31832M947K877k4134j09682M8066j43267P2685j15419Q2750
22739a32366m1107k88R2159J5794k944j24033K39746l1929k05892j00710M742
22728b86828J7089K4018K1228o4889R1270K22315J44148k56404l6288q310K01148
22717F8497J56273q5595q6826j50838o0833J52348J4628n0164J9335J3879O4203
$$ plain form
22794 56865 15340 -123211 -94273 -79785 -154498 -60716 122990 233702 302387 82548 -68518
22783 -68518 -79953 76023 2649 -108734 -187510 -67012 -106077 14051 49203 8477 -85343
22772 -85343 -13942 12435 28126 39786 -70872 -75414 1525 78966 127225 228524 59908
22761 59908 -33858 -144514 -18608 -4008 36115 -55157 78832 319123 277690 117713 -74874
22750 -74874 -83021 48811 53758 56635 32501 -77181 -29115 -172382 -99697 -215116 -132366
22739 -132366 -173473 -173761 -81602 -65808 -68752 -192785 46961 15032 -190860 -291570 -286828
22728 -286828 -269739 -245721 -224493 -289382 -198112 24203 168351 -88053 -124341 -132651 68497
22717 68497 224770 139175 52349 -98489 -159322 -6974 7654 -42510 -23175 -9296 54907
22706E4907J60982p6311n2761M6541k81390j5065K65687R4719j11201j85633n508
22695a05033J00472N7895M915m7548n4305l0486J25781k6446j96939J95110J41874
22684A65290k56281m8189K0664j31270N7347M9123j5252P2292O1466M3970M0103
22673E9263J90141j9310j98986N5136Q663j68791M6912P1905m9380k106m3322
22662d9875j50171K20576K64303j66255j18728m6368p1343K9513k5524Q498L3833
22651g1541j51013j69607P8233J73774M3062K3952o252j00584Q0130Q2598q2886
22640a00134N5780Q7183O5238j16079p2719j542J41289o6394j08017P4449J64445
22629A23499J33234n8803k8905k4932K5153m5793J250j70808L9842L7221j66337
$$ plain form
22706 54907 215889 139578 86817 133358 -148032 -163097 102590 197309 86108 -99525 -105033
22695 -105033 -4561 53334 58249 10701 -43604 -74090 51691 25245 -171694 23416 165290
22684 165290 -90991 -139180 -118516 -249786 -192439 -143316 -158568 -86276 -24810 19160 59263
22673 59263 249404 230094 31108 86244 94907 -73884 -26972 44933 -4447 -6553 -49875
22662 -49875 -200046 20530 284833 118578 -150 -46518 -117861 -88348 -113872 -105374 -71541
22651 -71541 -222554 -392161 -313928 -140154 -97092 -73140 -79392 -179976 -99846 -17248 -100134
22640 -100134 -44354 42829 108067 -8012 -80731 -82273 59016 -7378 -115395 -40946 123499
22629 123499 256733 197930 169025 144093 169246 123453 124703 -46105 -6263 30958 -135379
22618a35379P0767J67055n3482k28540j62782J39802J09845r6909k0107P5472
22608a34258L3708l111k9300N9642j8476j5729o071Q9608J72366N4295r6276K0497
22596A26895j00683j23431J24715o649J18173J05369j33891j40738L7728K9759
22586C7247l4294j63294k2494n6810k0342O3237O9974l1625N7150Q6193J27861
22575A12803J2770j00912M4858O1129K9964J78541J28919k11452L7764r4053J05026
22564C05357k36659k20643j74125P7902P7351n1379j02686j6829j0631o0327R0517
22553c22152J00501P0429j2310k8695J26126Q464Q231Q266L1950j50801o0674
22542b20665j3916L0371J12822o826j35539k2728r114J63245p5623M0717O2488
$$ plain form
22618 -135379 -64612 102443 48961 -179579 -342361 -202559 -92714 -189623 -209730 -134258
22608 -134258 -100550 -103661 -132961 -73319 -91795 -107524 -113595 -23987 148379 202674 106398 126895
22596 126895 26212 -97219 27496 20847 139020 244389 110498 -30240 7488 37247
22586 37247 2953 -160341 -182835 -239645 -259987 -196750 -126776 -158401 -101251 -15058 112803
22575 112803 125573 24661 69519 130648 160612 339153 468072 256620 294384 200331 305357
22564 305357 68698 -151945 -326070 -248168 -170817 -222196 -324882 -341711 -352342 -412669 -322152
22553 -322152 -221651 -151222 -163532 -192227 -66101 -57637 -49406 -41140 -9190 -159991 -220665
22542 -220665 -234581 -204210 -91388 -98214 -233753 -256481 -265595 -102350 -177973 -137256 -74768
22531g4768n903j9565j58102j17442J19389K95079K10677N4959M8950q1346j90846
22520H1082o7991j7051j64390r6701J32188P6358J77103r4074r1263l7984l9567
22509a42290J16591r8725o5050j01065J39519K72847Q7845L6832j63146r3235
22499i877M595K18274L4469o7900o8416O0547j22001L6115L2982q0667K24564
22488B62685L260j33574J52799j19241j39976J61017J80343k5284j60183j24563
22478E7283q2222J06304j06419K4968p5086N1405J64547p8340m2304K38854J30610
22467C89600k08466k45730k54292L7002J99583J28031J41803j81490j23862P2791
22457d5030o148k4335O6347p8840k15348L89689J87819n8129j08446p8741j3782
$$ plain form
22531 -74768 -80671 -100236 -258338 -375780 -256391 38688 249365 304324 353274 271928 81082
22520 81082 13091 -3960 -168350 -265051 -132863 -56505 120598 26524 -64739 -102723 -142290
22509 -142290 -25699 -124424 -189474 -290539 -151020 121827 209672 246504 83358 -9877
22499 -9877 -5282 212992 247461 179561 111145 171692 49691 85806 118788 38121 262685
22488 262685 265945 132371 285170 165929 25953 186970 367313 342029 181846 57283
22478 57283 -24939 81365 -25054 -86 -75172 -23767 140780 62440 20136 258990 389600
22467 389600 181134 -64596 -318888 -281886 -82303 45728 187531 6041 -117821 -45030
22457 -45030 -51178 -75513 -9166 -88006 -303354 86335 274154 216025 107579 28838 15056
22446A5056N4467L6036j11237j25136P6383N2205J57490m9526p9183k06433p2455
22435b52333Q8510M7112M4946j23125m8855q9230m9833R8444n1673J9370J85993
22424a30674M6633R1039Q9193p1785n3755n3418R9717J05046j6725M4566P6706
22413B26543K5625j46251n2075p1556m6041J28743j08551o5622O7769n437j27347
22402a74200o2513j07810J06267J39306M2235L115j1448l3473P2213N7127J40693
22391A71512J2466m993k21165j12011l1904J17027j5843q5727k6190j4996J73789
22380c8035Q8565m3797r5444J85759m6260j87719p4676N4358N6431L8424K2901
22369c9493o0014j19097j42246J78256P2272R0069r4441L9898m9093J06698m471
$$ plain form
22446 15056 69523 105559 -5678 -130814 -54431 -2226 155264 105738 26555 -179878 -252333
22435 -252333 -163823 -116711 -71765 -194890 -243745 -332975 -382808 -284364 -336037 -316667 -130674
22424 -130674 -84041 6998 96191 24406 -29349 -82767 16950 121996 105271 149837 226543
22413 226543 252168 105917 53842 -17714 -63755 64988 -43563 -109185 -41416 -46853 -174200
22402 -174200 -236713 -344523 -238256 -98950 -56715 -53600 -65048 -98521 -26308 30819 171512
22391 171512 183978 178985 -42180 -154191 -186095 -69068 -84911 -170638 -196828 -211824 -38035
22380 -38035 50530 6733 -88711 97048 50788 -136931 -211607 -157249 -100818 -62394 -39493
22369 -39493 -99507 -218604 -360850 -182594 -110322 -20253 -114694 -74796 -123889 -17191 -21662
22358b1662j2769M8457o1230O5305q451j958J242M0229K8464j47377k48067q652
22346c26469q7014M8263M8726J94204J84946j93450q6033p6654M1120N6661J17113
22335g8587J18576n0714m1709O7136J28729m1917N2232N7503N7909o7472j36173
22324F5513l8J81520q6584r0575m047j6653j2576j9877o1957j53087J07769k2090
22312a12682o447J76966K1033O7787J04440q5420l3910q5800P1110n6154m678
22301E6245O2290K1858j98967q6134L14564L2245r6462k33878j21481J97686M0853
22290a1181N8265N7729o6040j3599j57626L5846J0599N2314J65878J14454K68267
22279E14906j01482k68842j74812j36433o8697M398K35783m7862j68575J32630
$$ plain form
22358 -21662 -34431 14026 -47204 18101 9650 7692 8934 49163 77627 -69750 -317817 -326469
22346 -326469 -413483 -365220 -316494 -122290 62656 -130794 -216827 -293481 -252361 -195700 -78587
22335 -78587 39989 -10725 -52434 14702 143431 101514 153746 211249 269158 201686 65513
22324 65513 65475 246995 160411 69836 65789 49136 36560 16683 -45274 -198361 -90592 -112682
22312 -112682 -119129 57837 78870 146657 251097 165677 131767 45967 117077 60923 56245
22301 56245 118535 140393 -58574 -144708 169856 202101 105639 -128239 -249720 -52034 -11181
22290 -11181 47084 104813 38773 25174 -132452 -96606 -86007 -33693 132185 246639 514906
22279 514906 413424 144582 -30230 -166663 -235360 -230962 4821 -43041 -211616 -78986
22269g8986N0221L0146N3820M6095J04008Q570J19848j9968l22884j84931o6298
22258b60359J2304J86036R081j24182J5742Q1810J18018o2726J89913P7918j30477
22247A13078J4054n0634O4603r3947R9383k80405j87097p9572P596N8142K26995
22236a07804J22071K1724N7368j81686r7073M6897j4526J25461R2116J18342J44074
22225C26964j24989k03314Q2026O9904k3700p6215j93611q5624r7032j40876J96040
22214b70427K60360j0494o677M3119R973p7059j80825m9998l0703j3652L1800
22203b94583K01580q6658l3826l4717K13818Q8688j28623r3069r1785l7600n2474
22192c49249l6949r0944J53151K10795J14729o399j916J67030j5817j55622L9041
$$ plain form
22269 -78986 -28765 1381 55201 101296 205304 213874 333722 313754 -9130 -194061 -260359
22258 -260359 -248055 -62019 -52938 -177120 -161378 -79568 38450 -24276 165637 243555 113078
22247 113078 127132 76498 141101 47154 146537 -133868 -320965 -400537 -392941 -334799 -107804
22236 -107804 14267 35991 93359 -88327 -185400 -138503 -153029 -27568 64548 182890 326964
22225 326964 201975 -1339 80687 150591 126891 50676 -142935 -228559 -325591 -466467 -270427
22214 -270427 -10067 -20561 -27238 15881 25854 -51205 -232030 -282028 -312731 -326383 -294583
22203 -294583 -93003 -179661 -213487 -248204 -34386 54302 -74321 -167390 -259175 -296775 -349249
22192 -349249 -386198 -477142 -323991 -113196 1533 -4866 -6782 160248 144431 -11191 27850
22181B7850J2725q1687L242j7500M0030J21280J08221j80667M9681J60672L1696
22170B75543j06323j00499j19191p4057J11930q7172J86525j1151j69392J21117
22160B7330J22717J31509k4662k01803j68151J940N62l5496j1412L6645K2619
22149i8202R5483O5449P3050j05617j50199K4937K18163K2591j03543n6345O5887
22138E1654k470j56820m3454O3152J30541l8364l8442N2688J64713p2306r3484
22127A7408l2454j00301M115P745j59273q9629J05068k3937j5865j76646J19107
22116c44662K09985k1877j83843Q7874J47820J10243p009k32023R0076N5650j23758
22105b11524p554J38083P9276L6589M7340j84793j3253P2224n6221M8120K7857
$$ plain form
22181 27850 40575 -41112 -37870 -55370 -15340 105940 214161 33494 83175 243847 275543
22170 275543 169220 68721 -50470 -124527 -12597 -99769 86756 75605 -93787 27330
22160 27330 150047 281556 256894 55091 -113060 -111120 -110558 -146054 -157466 -120821 -98202
22149 -98202 -2719 62730 135780 30163 -120036 -95099 123064 145655 42112 -14233 51654
22138 51654 49184 -107636 -151090 -87938 42603 4239 -34203 18485 183198 110892 17408
22127 17408 -15046 -115347 -111232 -103487 -262760 -352389 -247321 -271258 -287123 -463769 -344662
22116 -344662 -134677 -156554 -340397 -252523 -104703 5540 -1469 -233492 -143416 -87766 -211524
22105 -211524 -219078 -80995 -1719 34870 82210 -102583 -115836 -43612 -99833 -51713 -23856
22094b3856J32815r2192j83521k2192R7817K1109L3130m1358J70235N450K2031
22083A19468J37599N3475j57284q7093k4628j1707o5822p9048J93078Q4090k04522
22072d2394J13643L9779j01887P2185P1634r2181J22549P0877M5029p8905j00292
22061A20037j46632q0017J91401K57295j53856j70264l0599J92904K38915q763
22051D10421k09435R587j10673r9318o863N1682K8677j9877n7095K9845J57207
22040A84158j55685k56771p1859q539K04601J43471K166n9643j04291L278P9242
22029c9872J13642o2732k7004k8115K00099l7571l6039k6407j33096p5567J0526
22018a42136j33177j15588J13680K46474J54081M4297N3838L4343j36515j47007
$$ plain form
22094 -23856 108959 16767 -166754 -188946 -91129 -70020 -36890 -78248 91987 97437 119468
22083 119468 257067 310542 153258 66165 41537 29830 -35992 -115040 78038 162128 -42394
22072 -42394 71249 111028 9141 81326 152960 60779 183328 254205 299234 220329 120037
22061 120037 -26595 -106612 84789 342084 188228 17964 -12635 180269 419184 410421
22051 410421 200986 210573 99900 582 -6281 45401 74078 54201 -2894 26951 184158
22040 184158 28473 -228298 -300157 -308696 -104095 39376 41542 -18101 -122392 -119114 -39872
22029 -39872 73770 11038 -15966 -44081 156018 118447 82408 56001 -77095 -152662 -142136
22018 -142136 -275313 -390901 -277221 -30747 123334 167631 221469 255812 119297 -27710
22008b7710j26595J14237k719m8208N1106q1553m9858L7807M1714m6575p3894
21997b12248Q2641Q0383J35402j61683p7997J09855M4417L5421k15198N2380J20306
21986f321P9757M2431j33353j85057L3141N9616J50895J9080m3315j69878K00297
21975D7293j03455l0163q39N624J3606K44906j08197L7567J2444m2311K0460o6282
21963C0653R132p9089k9598n0992K2592J5515K07243Q9458j43108M49P2121j92941
21951d8565j03517k9117o783J14405N6560p0431J65833P7168l0944j03295l5249
21940a3935Q7126M2185J46942j39972o9889J25318k2157j95070j49431M2937J166
21929a44780r6854J03361Q8054m9797n0884J64687R3873N9756j86350j9524J27149
$$ plain form
22008 -27710 -154305 -40068 -42787 -90995 -39889 -121442 -171300 -133493 -91779 -138354 -212248
21997 -212248 -129607 -49224 86178 -75505 -153502 -43647 770 36191 -179007 -126627 -6321
21986 -6321 73436 115867 -17486 -202543 -169402 -109786 41109 60189 16874 -153004 47293
21975 47293 -56162 -86325 -87164 -81540 -67934 176972 68775 106342 118786 76475 96935 30653
21963 30653 39785 -39304 -68902 -119894 -97302 -81787 125456 214914 71806 72255 144376 -48565
21951 -48565 -152082 -181199 -187982 -73577 -17017 -87448 78385 155553 124609 21314 -13935
21940 -13935 73191 115376 262318 122346 52457 177775 155618 -39452 -188883 -145946 -144780
21929 -144780 -241634 -138273 -50219 -100016 -150900 13787 107660 167416 -18934 -38458 88691
21918H8691J3640O31r8230j18866k2586o7756L0889J56605l0998o5234j44167
21907b57381R5108K17470O756O769M939n763J65291j05663l9916J29128k7159
21896A89579o6255j07693n5294J52782J88327p1159r4087j75967L8942J30905
21886A30080R9932N5110o6605q0580j6664j09061j5309M5480q62J45851K7568
21875B14940l650j28066L9951j36149l2336R3812M5624r9287O6182j08362q113
21864e5454J3870Q110M5270L2492p0064q0229j18520R9204O8594J27045O1998
21853A32316N7476j83210j77477L6190J21208P1617J50472O4444m161j77218r3392
21842a735j49862o4277p1210k11024J16738K09828Q8995J21440j51378q6472p1180
$$ plain form
21918 88691 102331 102962 4732 -114134 -136720 -204476 -173587 -16982 -47980 -113214 -257381
21907 -257381 -162273 55197 61953 68722 73661 67898 233189 127526 87610 216738 189579
21896 189579 123324 15631 -39663 113119 301446 230287 136200 -39767 -825 130080
21886 130080 230012 285122 218517 137937 121273 12212 -3097 42383 41521 187372 214940
21875 214940 211290 83224 123175 -12974 -45310 48502 94126 -5161 61021 -47341 -55454
21864 -55454 -41584 -33474 11796 44288 -25776 -106005 -224525 -125321 -56727 70318 132316
21853 132316 189792 6582 -170895 -134705 -13497 58120 208592 273036 268875 91657 -1735
21842 -1735 -151597 -215874 -287084 -498108 -381370 -171542 -82547 38893 -112485 -198957 -270137
21831b70137J26757M0660j8325K1069L4065j17534M2021N3520M8325j07630J71121
21820B3912j58333j29002J66725J53424J01201J15873P0506n0889j85165j08381
21810a29M2209j523p072P7139k2592J08139K9998j46857m0529J28659J14764L5443
21798C17649k5872k8564L7619k8705j73383j64342o5449o4660J75413J28663Q2641
21787A91010J8188K0886n9994j01133j5908o3979J09575R4696M8465n2257j50818
21776C8731O2058l999j33693m2194O6987R4755o2614j80832Q033P3067r802j1918
21764a01421n0110P1517Q7520J68727k33487j00421O7111l5302J06474J50582
21754A31190p9085l2442m1336k0892j31988l8526J42572J50590K08725k48943
$$ plain form
21831 -270137 -143380 -102720 -121045 -99976 -65911 -183445 -141424 -87904 -39579 -147209 23912
21820 23912 -134421 -263423 -96698 56726 157927 273800 344306 293417 108252 -129
21810 -129 42080 40557 33485 110624 88032 196171 226169 79312 38783 167442 282206 317649
21798 317649 291777 263213 300832 272127 98744 -65598 -131047 -195707 -20294 108369 191010
21787 191010 209198 230084 170090 68957 53049 -10930 98645 193341 241806 189549 38731
21776 38731 100789 96790 -36903 -79097 -12110 82645 20031 -160801 -152768 -79701 -89503 -101421
21764 -101421 -151531 -80014 7506 176233 -57254 -157675 -90564 -125866 -19392 131190
21754 131190 52105 19663 -21673 -42565 -174553 -213079 -70507 80083 288808 39865
21744C9865j52029J38670m7999j78883J18194N6013J49632p7248Q586P4063j06680
21733B2184L5149q8236j2326J37155J787j80216j2254n9793P0591O2143J98816
21722A75000O9013p075J8796O5851j25279l39235k40485r8144J1421K72956J12012
21711h5169o5897J2123J14141j22820j07521P1473j7673m8179Q6545R6093q5673
21700a52557L1035J25273P0981j06973m2083J24340j40697o8593q148q7618N8766
21689a96274J24687n1820j3004j79314o1724J76511J4059j14731J10044K34707
21679D3141O1638j35357J89589M6924l5127r317M0134P666j66922R8843n7419
21668H3793k82736j09313J71355J56701M609Q402j00939J14696j84643Q6726J49991
$$ plain form
21744 39865 -112164 26506 -21493 -200376 -82182 -26169 123463 46215 54801 128864 22184
21733 22184 57333 -30903 -43229 93926 95713 -84503 -96757 -156550 -85959 -23816 175000
21722 175000 244013 236938 255734 321585 196306 -142929 -383414 -481558 -470137 -197181 -85169
21711 -85169 -151066 -138943 -24802 -147622 -255143 -183670 -201343 -249522 -162977 -66884 -152557
21700 -152557 -121522 3751 74732 -32241 -74324 50016 -90681 -159274 -167422 -255040 -196274
21689 -196274 -71587 -123407 -136411 -315725 -377449 -200938 -186879 -301610 -191566 43141
21679 43141 104779 -30578 159011 205935 170808 161491 201625 209291 42369 141212 83793
21668 83793 -198943 -308256 -136901 19800 24409 32811 -68128 46568 -138075 -51349 98642
21657I8642k10364j34663J54993L6273j27950q8643j01318J9684m5166L0036k6797
21646c95273p2000q2345J58916L44660J15884j28520J7936k7623o9913N3024J8408
21635f6846m3489j531Q5691n9756o2667K2740O4854j12297o6299J30687J78168
21624F9255N9422j21737r0091J04847P6392j37J1129M050J45305n1285k26185
21613a9035q6189J01418q454p5751J0520J51481q925j03022l0559N2567p3932
21602h9881j49728k09426J1054J34758O8031r7650K37490L27074J77525R5877
21592E05124j21217k37369k55286j2166M4192l0887R5972j55579o5773J5307J42087
21581g5595R9620r0301j01914J07310J02387k7997j47069j59788R8942p196K262
$$ plain form
21657 98642 -111722 -246385 -91392 -55119 -183069 -271712 -373030 -353346 -398512 -368476 -395273
21646 -395273 -467273 -549618 -390702 -46042 69842 -58678 -40742 -68365 -138278 -85254 -66846
21635 -66846 -110335 -111866 -26175 -85931 -148598 -125858 -61004 -173301 -239600 -108913 69255
21624 69255 128677 6940 -83151 21696 98088 97951 109080 113130 258435 207150 -19035
21613 -19035 -105224 -3806 -12260 -88011 -77491 73990 65065 -37957 -68516 -15949 -89881
21602 -89881 -239609 -449035 -437981 -303223 -235192 -332842 -95352 231722 409247 505124
21592 505124 383907 146538 -108748 -120914 -76722 -107609 -11637 -167216 -232989 -217682 -75595
21581 -75595 24025 -66276 -168190 -60880 41507 13510 -133559 -293347 -194405 -201601 -199339
21570a99339Q6834J12577J20685J02052j45380j67524K1687J4968K622p6659o9545
21559a97022m3125O7585k7206M8657J2530p4424o1466J00574R5695j9186J71493
21548G4105j5765j64057J1523J08765m953k9089K9994L5443j5960M2457J6515
21537H8978O2254j46696m2112j40o0099J31367K5416q7654q9355j9703j05456
21526b43200O8306J75728K8225M8152J43125k9629j89065j51741k2290o3190J00207
21515a35372J35009J18736m5410j11121J28939P5277n4961Q5008r1711j40113
21505c5719J39375K86989k2618j20297j33924j57720q9979j24155m0005P6306
21495b21747P0657p8452j02244K9405K04839J4010n5794j3582j09561J9658J15794
$$ plain form
21570 -199339 -112505 72 120757 222809 77429 -90095 -68408 -53440 -50818 -127477 -197022
21559 -197022 -240147 -172562 -199768 -151111 -138581 -213005 -274471 -173897 -78202 -97388 74105
21548 74105 58340 -105717 -94194 14571 9618 -19471 10523 45966 30006 72463 88978
21537 88978 151232 4536 -37576 -37716 -97815 33552 58968 -28686 -118041 -137744 -243200
21526 -243200 -174894 834 29059 77211 220336 190707 1642 -150099 -172389 -235579 -135372
21515 -135372 -363 118373 72963 -38158 90781 166058 111097 196105 104394 -35719
21505 -35719 103656 390645 368027 247730 113806 -43914 -133893 -258048 -298053 -221747
21495 -221747 -151090 -229542 -331786 -302381 -97542 -83532 -139326 -152908 -262469 -242811 -127017
21484a27017r2784N1631J72887M6072M4698O6275J9556R0759m3540k48050K4351
21473D838L6846o976K3649R7946j89532k18615j4277j1555J42091M4439k06257
21462b97403N055J67497n2207L3451N5307j13719j17202J43873J41379j101N9399
21451B4329R0728j22886r3r792n2678P2512P3720P7938o318j89908j32734O4128
21439a11054K3225j26885J46666N8421M244P5499l9194J38435k8420k71712r6627
21428b27402N1948N7629K43269P0524k21885n7154J91247J27381j80126n8569
21418c138J21072P0285j9203j57228j75665j8851J90560K3172P5592j2380k50866
21407a56650r8759j8896J60557J14382J54035j5601L8346j13829j89332J0027
$$ plain form
21484 -127017 -219801 -168170 4717 50789 95487 161762 181318 272077 228537 -19513 4838
21473 4838 41684 34708 58357 156303 -33229 -251844 -266121 -277676 -135585 -91146 -297403
21462 -297403 -292348 -124851 -177058 -143607 -88300 -202019 -319221 -175348 -33969 -35070 24329
21451 24329 115057 -7829 -7922 -17714 -70392 2120 75840 153778 147460 -42448 -175182 -111054
21439 -111054 -87829 -214714 -68048 -9627 -5383 70116 30922 169357 140937 -130775 -227402
21428 -227402 -175454 -117825 125444 195968 -25917 -83071 108176 235557 55431 -3138
21418 -3138 117934 188219 169016 11788 -163877 -182728 7832 31004 106596 94216 -156650
21407 -156650 -255409 -274305 -113748 634 154669 139068 177414 63585 -125747 -115720
21397a15720l4643j06958o5028J5073J07798l9843R4351K5253j39803j12534L7663
21386c34391m2701J27920K05538J95590M2676r6139j55207Q9021r540J28758n3189
21375I8336j41339J09148j02218o4369L4796k4156J00090K13531J00451J33771
21365D58041k2075l01733n5461J31331j49983j37644k734L8075R7313K7333Q8482
21354A70945r8824j14045J592j760k8264k29712o4902L06357O0486j01966N3386
21343d6707N8571o1976r4373p8698N8517k0913j184j4361o9361Q4859O3991K8368
21331i3267J22849m9214M894K5733o9618j8631r198p0178q6854j33431k1710K27704
21319a70921J74977j04082J89932Q7715m4119Q8224J03030k7827j81628m2684
$$ plain form
21397 -115720 -150363 -257321 -322349 -307276 -199478 -239321 -144970 -119717 -259520 -372054 -334391
21386 -334391 -377092 -249172 -43634 151956 194632 98493 -56714 32307 22767 151525 98336
21375 98336 -43003 66145 -36073 -100442 -65646 -89802 10288 223819 324270 458041
21365 458041 435966 134233 78772 210103 60120 -77524 -80258 -42183 55130 82463 170945
21354 170945 72121 -41924 -40332 -42092 -70356 -300068 -364970 -58613 1873 -100093 -46707
21343 -46707 11864 -50112 -144485 -223183 -164666 -185579 -186763 -201124 -270485 -185626 -121635 -93267
21331 -93267 29582 -19632 -14738 10995 -58623 -77254 -86452 -156630 -243484 -376915 -398625 -170921
21319 -170921 4056 -100026 89906 177621 133502 221726 324756 296929 115301 72617
21309G2617J1450o4885k29312m8565J95618j403r73l5783m363q6538J56838N7395
21297B2096k71123n1423k6583q8731O0107J85925R7099R9454j29030j15671r4406
21286c12286L011J33018J43012r276p8508P3053J28936j85667P237q6022n0753
21275b34245j71516p2711J61156J70161m8299L3805J03990L4629R270j57184L3302
21264a37642J24600R655O073j19486p1946l3052R4915P9659Q3044l7153j19290
21253a20623k12791l548M9523L5576Q1517p0322p4589J11302L6691l2190l8378
21242b37832q4794M8384m4528P2160k9212Q1795L1977j96248P2975K92273o5210
21231e8260m7708K62552J14891k4815l4117r162O5028K5702j31937o8424K26432
$$ plain form
21309 72617 84067 19182 -210130 -258695 -63077 -64480 -65453 -101236 -105599 -192137 -35299 22096
21297 22096 -249027 -300450 -327033 -415764 -355657 -169732 -72633 26821 -102209 -217880 -312286
21286 -312286 -309275 -176257 -33245 -42521 -121029 -47976 80960 -104707 -97470 -183492 -234245
21275 -234245 -405761 -478472 -317316 -147155 -195454 -161649 -57659 -23030 -13760 -170944 -137642
21264 -137642 -13042 -3387 2686 -116800 -188746 -221798 -126883 -47224 35820 -1333 -120623
21253 -120623 -333414 -336962 -287439 -251863 -170346 -240668 -315257 -203955 -167264 -199454 -237832
21242 -237832 -322626 -274242 -318770 -246610 -275822 -194027 -162050 -358298 -285323 6950 -58260
21231 -58260 -105968 156584 271475 246660 212543 203381 268409 294111 162174 93750 320182
21220C20182K7861j63665M1990q6878j63593Q723k5879P4558j8196m580l0367
21209a9844j71361J1074J48946N4532J43554K00734O6034l7314o0253j28421O4189
21198B71870K01704K63404j31186j80934O6102J80765J77000N4164M1669q8058
21188H56500p1904j17734o4528q1115q0772r7816k1434K06820R8989K3286n0731
21177E99561j5774m0760j48181o4100L8808j37902j31955L9461J81382M9842q4026
21166B86356J45472N7537p6129j27936m7520O8113m855k56826j85574P9960K75741
21155B14339K06504j19409k42908r7064n2011o3658P7177P3653l0528k59607J10058
21144a83454K66111J32988j9848Q1811j3844k44146j46907J26709J51099j67043
$$ plain form
21220 320182 348043 184378 226368 139490 -24103 -15380 -41259 33299 15103 10523 -19844
21209 -19844 -191205 -180131 -31185 23347 166901 367635 433669 396355 336102 207681 271870
21198 271870 473574 736978 605792 424858 490960 671725 848725 902889 944558 856500
21188 856500 784596 666862 602334 521219 440447 342631 321197 528017 627006 650292 599561
21177 599561 583787 543027 394846 330746 369554 231652 99697 139158 320540 370382 286356
21166 286356 431828 489365 413236 285300 237780 305893 301038 44212 -141362 -61402 214339
21155 214339 420843 301434 58526 -38538 -90549 -154207 -77030 -3377 -33905 -293512 -183454
21144 -183454 82657 215645 195797 277608 263764 19618 -127289 -580 150519 -16524
21134a6524r0546Q5312l639M2394l0526n5615l1599p601j1849J7077K37398K4726
21122A59008K9537n2897L3830J03016j16698m9853O1472n6536j05263J04718l2229
21111G8105N6231M0800q7252j03013N8058J20305j9925j20809k49178o5570q979
21100c01227k090J06049R371N7673J78200K9654n0396o9538P4263q6186k18569
21089b72796l1808p667N5090L08084J64813j8721J45876j53433j33901j02302
21079d6765o8822O9543R7136Q9366j5953J4793j50168q9138j7723M936j3729k8898
21067a55422K9255M6311k7419n8824J76700R1166n9871r0503P1911M5377K1659
21056I0340q2568p0246J53262k4029o8046o5185r367R8989J02168J5980r9029
$$ plain form
21134 -16524 -107070 -21758 -25397 16997 -13529 -69144 -100743 -108344 -120193 -103116 134282 159008
21122 159008 188545 135648 169478 272494 155796 105943 167415 110879 5616 110334 78105
21111 78105 134336 175136 87884 -15129 42929 163234 143309 22500 -226678 -292248 -301227
21100 -301227 -303317 -197268 -187897 -130224 47976 77630 27234 -42304 31959 -54227 -272796
21089 -272796 -304604 -312271 -257181 50903 215716 196995 342871 189438 55537 -46765
21079 -46765 -115587 -46044 51092 140458 124505 139298 -10870 -100008 -117731 -112795 -126524 -155422
21067 -155422 -126167 -79856 -107275 -166099 10601 101767 41896 -48607 23304 68681 90340
21056 90340 7772 -62474 90788 66759 -1287 -66472 -75839 23150 125318 141298 42269
21045D2269j54445p6540R684M1101J49515M3623J33176M6043k03161l6160o3441
21034f8336r7421r4034j12513j8813J41840R3567j79945j0011J22881p4775O4417
21023b33143j2027O6379Q5908J64994q3251j58378O1588R7455J31109m1893k6846
21012E1895J22941R0628j25935n4738m9759r928n7125k5760Q9586k104L9147Q9965
21000A58813j39826p8585r699j28185j48557N0230j12181j23664P3861K10963
20990b46830J27956j48373m4808J67273J57768N7103m8087j15786p681P445P4051
20979a9969M5706p5198j1389K266j88333N9796j8438P0911r852N4321K42445K2237
20967A74503O887j0866j10197j9676J00043N0550j25264R8435M6494j22236j61743
$$ plain form
21045 42269 -112176 -188716 -179032 -137931 11584 55207 188383 234426 31265 -4895 -68336
21034 -68336 -165757 -259791 -372304 -391117 -249277 -155710 -335655 -345666 -222785 -297560 -233143
21023 -233143 -245170 -178791 -92883 72111 -11140 -169518 -107930 -10475 120634 78741 51895
21012 51895 174836 265464 139529 84791 35032 25104 -32021 -57781 31805 29701 68848 158813
21000 158813 18987 -59598 -69297 -197482 -346039 -295809 -407990 -531654 -457793 -246830
20990 -246830 -118874 -267247 -312055 -144782 12986 70089 22002 -93784 -101465 -94020 -19969
20979 -19969 25737 -49461 -60850 -58584 -246917 -187121 -205559 -134648 -144500 -90179 152266 174503
20967 174503 181390 170524 60327 40651 140694 191244 65980 164415 210909 88673 -73070
20956g3070j07433P9384J61099P1771L3904Q4384o9036p5821k5644j60459L4689
20945d6232J58003N1442P219j87399m3910K7765j55957J93345J57876j98652j96205
20934b32705k56196K2286K51220J05756J65335n1585j22354o3056O5447R4203
20924b1649K238Q9867J1536j86325K4271J03962Q5214R4089Q197j86589m8419
20913b3608l9547r6765J76052n9914j02783L37691k8566j47768J35493j09867
20903D0418p9886q0076J5788j9373O781j28077l9156R7049J23267O3339m333N1963
20891D7704j4390K2846j02641o218J9035J36486l7978r8956k76848R4892n5300
20880b71368k0428J8096J73104J19722P6074P3732K9314j28217o1441J64523P4816
$$ plain form
20956 -73070 -180503 -101119 59980 131751 165655 250039 181003 105182 79538 -80921 -46232
20945 -46232 111771 163213 170432 -16967 -60877 -33112 -189069 4276 162152 -36500 -232705
20934 -232705 -488901 -466615 -215395 -109639 55696 4111 -118243 -181299 -115852 -21649
20924 -21649 -19411 70456 81992 -104333 -80062 23900 109114 203203 211400 24811 -23608
20913 -23608 -63155 -159920 16132 -43782 -146565 191126 162560 14792 150285 40418
20903 40418 -39468 -119544 -103756 -123129 -116348 -244425 -283581 -186532 -63265 74 -4259 47704
20891 47704 33314 56160 -46481 -52699 -33664 102822 64844 -34112 -310960 -216068 -271368
20880 -271368 -291796 -273700 -100596 19126 95200 168932 198246 70029 8588 173111 247927
20869B47927m6227p3252J49574R2425l12532k28428J51517J50724l5093j02115
20859e480k8091M1935P4849J7157p314P6079n3316j03227n0136j3745R6927N3951
20847I9589m9225m1453Q3772o7461j92037j8317J77149J0761q7674K3220J43442
20836H1766P474J05139n0003j66706m3819Q0963Q8546p7485j40145R2803J30484
20825A09017j0401r0985r9417Q2289P6064j8170J7453K16232j4680r3462o4873
20814A09067m7174P833k7825K3866K3975J8255m0202r3438J33686J9726k8134
20803I9635P4588P5040N8608J16768J4406j73603N6997j08219l09587N2620K55869
20792B13122M5458J51960R7964j27541j46417l49070Q661J79292Q5913J5417R5732
$$ plain form
20869 247927 201700 128448 278022 370447 57915 -170513 -18996 131728 96635 -5480
20859 -5480 -33571 8364 83213 100370 93056 169135 115819 12592 -37544 -51289 45638 99589
20847 99589 50364 8911 92683 25222 -166815 -185132 -7983 2778 -84896 -61676 81766
20836 81766 89240 194379 144376 -22330 -66149 14814 103360 25875 -114270 -21467 109017
20825 109017 98616 7631 -91786 -9497 66567 48397 65850 282082 267402 173940 109067
20814 109067 61893 69726 41901 65767 89742 107997 67795 -25643 108043 127769 99635
20803 99635 174223 249263 307871 424639 439045 265442 322439 214220 -95367 -42747 213122
20792 213122 258580 410540 508504 380963 234546 -114524 -105863 73429 159342 174759 270491
20781B70491J1281Q985J19413O6396M8407m631k01167l48091Q5218J32263J87428
20770C75993J9499k3398N8562L4171L5852o4519j86727K404K919J213r473j39650
20758A06846J3951J20j25817J02661J00513K7585n5963k47328k473J22642j08705
20747f5968n6595Q5605N2689N7924q0911M6796n5880R8846Q5866o2366j3619l5496
20735E6891j14466l1528k4111K00890L7608L0348J58443m3487j61610j65128m2631
20724i8781O9585m0823k0931M0947n245M2106J15789M3837k58873m9918J32573
20713b9734M0168j09070j32646K0268R4344J55492Q0326n7991j41095J40706j7639
20702D3129Q5349q5956m9868K23964J00262p1868J26533J43445r2670J46371L9942
$$ plain form
20781 270491 281772 290757 410170 476566 524973 520342 319175 -28916 56302 188565 375993
20770 375993 395492 372094 430656 464827 500679 436160 249433 251837 254756 255969 246496 106846
20758 106846 120797 120917 -4900 97761 198274 225859 169896 -77432 -79905 42737 -65968
20747 -65968 -122563 -36958 15731 73655 -7256 39540 -16340 82506 168372 106006 92387 56891
20735 56891 -57575 -89103 -113214 87676 125284 155632 314075 270588 108978 -56150 -98781
20724 -98781 -29196 -70019 -90950 -50003 -55248 -13142 102647 146484 -112389 -162307 -29734
20713 -29734 10434 -98636 -231282 -211014 -116670 38822 119148 61157 -79938 60768 43129
20702 43129 128478 42522 -7346 216618 316880 245012 371545 514990 422320 568691 608633
20691F08633P764J34932J24120P0017N237P8777J07392R1990J87785K51768J99353
20680A867768K13731N11030P46695J067128J169923Q18304m2036o11185p88797
20671D952561p32101m31661J8607L34822P16285R16969R45599R60827R50681Q60296
20661I492885J597220K779485M679229P802043J2186014J6338041J5749889N713278
20653G6338084p340926j4017765j3408298r005963m586249q13311K107523M939979
20645C4213074P243802N621256l42609o043345q524140p458907m605823k314247
20637A7789061r66301l51946n61965j003661q10421J75638J458367L205823O015120
20628B4949715Q913688Q862828L765783k812188o562518o523332l916678q68521
$$ plain form
20691 608633 616397 751329 875449 945466 950703 1029480 1136872 1228862 1416647 1668415 1867768
20680 1867768 2081499 2592529 3339224 4406352 5576275 6394579 6352543 5741358 4952561
20671 4952561 4220460 3788799 3807406 4142228 4858513 5775482 6721081 7681908 8632589 9492885
20661 9492885 11090105 13869590 18548819 26350862 38536876 54874917 70624806 76338084
20653 76338084 68997158 54979393 41571095 32565132 27978883 27165572 29273095 34213074
20645 34213074 41456876 47078132 46735523 40692178 32168038 24709131 20103308 17789061
20637 17789061 16822760 16470814 15908849 14905188 14094767 14270405 15728772 18934595 24949715
20628 24949715 33863403 42726231 46492014 43679826 37117308 30593976 26677298 25808777
20620B5808777K213914O258272J1937385J7016860J4570005J929869j0411696
20613F9323386j5915660j4772999j0691267p296390m894697l348592k150517j549188
20605H704076j213186r58970o28145m15487n95719l86067l72278k78728m5497
20596C809999p8876j66489k3127q4417q2832k1974J1829R3532q1640l42259k84154
20585B749592k81650j70357P6121K3396l8292r2107J82128L4535j00095m0661
20575B342610j16297n12757k72832J41615R2249q6906j01514P4169J05497K61074
20565A926908J58002J17701J50794M20585K16625k08362j84744q7696N2487j22143
20555B440157J16276M44868L34085J61364K37136Q7682j03605l66958n08423l62426
$$ plain form
20620 25808777 28022691 34280963 46218348 63235208 77805213 79735082 69323386
20613 69323386 53407726 38634727 27943460 20647070 15752373 12403781 10253264 8704076
20605 8704076 7490890 6531920 5903775 5488288 4892569 4506502 4134224 3855496 3809999
20596 3809999 3731123 3564634 3541507 3457090 3374258 3352284 3364113 3457645 3376005 3033746 2749592
20585 2749592 2467942 2297585 2373706 2397102 2358810 2266703 2448831 2483366 2383271 2342610
20575 2342610 2226313 1713556 1440724 1582339 1674588 1587682 1486168 1560337 1665834 1926908
20565 1926908 2084910 2202611 2353405 2773990 2990615 2782253 2597509 2509813 2562300 2440157
20555 2440157 2556433 3001301 3335386 3496750 3733886 3821568 3717963 3351005 2842582 2480156
20545B480156l55419k30701M924k04310j95701j23134K1516l6060R8539j41555
20535A318255j98891n8975r6343L2651J20940J5971L5120j21295r9484J66276
20525A114225K05720N5482J08364K82649K37439p7180N1652J06213J57321K9026
20515B270911k4694Q9748J24185n8970L722J24969o443j81064j86899l4599k09421
20504A911445k65532k37062j67573m53455j34055J68977o2285k01050j46647j2814
20494C99949j14637j40660k3705J77321P7803k65287L3198j82192j18696K10345
20484E3439N1120j0480P3083j6617j11676J50249j01759M880Q8467o3816j54314
20473c7424Q7616Q510k2730Q3461J78444L9784k40975O795J60948J26357j8824
$$ plain form
20545 2480156 2124737 1894036 1898960 1694650 1498949 1375815 1397331 1361271 1459810 1318255
20535 1318255 1119364 1060389 964046 996697 1117637 1133608 1168728 1047433 947949 1114225
20525 1114225 1319945 1375427 1483791 1766440 2003879 1926699 1978351 2084564 2241885 2270911
20515 2270911 2246217 2335965 2460150 2401180 2404902 2529871 2523428 2342364 2155465 2120866 1911445
20504 1911445 1645913 1408851 1241278 787823 653768 822745 760460 559410 412763 399949
20494 399949 285312 144652 120947 298268 376071 110784 143982 -38210 -156906 53439
20484 53439 104559 94079 167162 150545 38869 189118 87359 92239 180706 116890 -37424
20473 -37424 50192 58702 35972 119433 297877 337661 96686 103481 264429 390786 371962
20462C71962k9662r2588l5207J1515q4631K3915n0455j02649p4753J71937j01287
20451H097o1885j6560k4156J24749R8264j02773J8623k8945j44470q8664K80921
20440F3201K16006j9084j89657j11476n8025L4755M9181J84966L7543o2747m3762
20429A00901P3068o604K29373q51j74195L0585M5112P3172o9032K157j4712l1742
20417B57232j01585k96061J11574K02454k1162O9044j1244K9804j43944j8379
20407G7733l3181p8252N0316K9672J04949P7462r3946k1552j7602m7315m6852
20396A432j21015l6705N1451Q8255P6817j21616p4963k5607J13684Q0399k8629
20385C503j55561J00428R9258r2547K2507k7948J02461q919j45962j33570P1351
$$ plain form
20462 371962 342300 249712 214505 226020 141389 165304 114849 12200 -62553 109384 8097
20451 8097 -53788 -70348 -94504 30245 128509 25736 44359 15414 -129056 -217720 63201
20440 63201 279207 260123 70466 -41010 -99035 -64280 -15099 169867 207410 144663 100901
20429 100901 173969 167365 396738 395887 221692 252277 297389 370561 301529 303686 288974 257232
20417 257232 155647 -140414 -28840 173614 152452 221496 210252 240056 96112 77733
20407 77733 44552 -33700 16616 46288 151237 228699 134753 113201 95599 48284 1432
20396 1432 -119583 -156288 -104837 -16582 60235 -61381 -136344 -161951 -48267 32132 3503
20385 3503 -152058 -51630 47628 -44919 -22412 -50360 52101 43182 -102780 -236350 -164999
20374a64999J28317J05268r4664k12069N2238R2927O0050J00764J78197j34015
20364A12014j17206L7772K41445L2388k2740k8001j16119k39177k36933N3051
20354b83506J54042O4050M7818m1391k8715o2295n3688O3508K2173O7577o7431
20343a17858Q3468J1860R4674J2310m5823m062p0759j41562m0680J27238Q5807
20332e387j7813P2646n0677j53158j31822M2994J92078M9647j11891J50706K84288
20321C21611J7724k3584q2370j78244j89227K1726N6539k31627N5941R4802N050
20310a31659k0277M979K4385O1487Q1120R212%k2811j48587J13467R7560L4463
20298A03339j48845L8466j2310n2799K6169m4772j30127L2596k3810J03052O8755
$$ plain form
20374 -164999 -36682 68586 -26078 -238147 -185909 -92982 -32932 67832 246029 112014
20364 112014 -5192 32580 274025 306413 283673 255672 139553 -99624 -336557 -283506
20354 -283506 -129464 -65414 -17596 -58987 -87702 -149997 -203685 -140177 -118004 -50427 -117858
20343 -117858 -34390 -22530 72144 84454 38631 34569 -36190 -177752 -218432 -91194 -5387
20332 -5387 -23200 49446 -1231 -154389 -286211 -243217 -51139 -1492 -113383 37323 321611
20321 321611 339335 315751 233381 55137 -134090 -112364 -55825 -287452 -231511 -136709 -131659
20310 -131659 -151936 -146957 -122572 -61085 20035 29247 29247 6436 -142151 -28684 68876 103339
20298 103339 -45506 -7040 -19350 -72149 -45980 -90752 -220879 -188283 -212093 -109041 -40286
20287d0286k1524O859q4444j14919O2230J08320J13339J95356k4701j95421j33307
20276a28498j09905P6577J28201l8422q9304n437J05710J85698J02906k7268q5581
20265A14677n0876n8929J46230p0322p6007j87M1282J88701Q5399m5561p4243
20254B00164o0680r0820k4809q7283Q6130P3551o3041J08764L0443p4261J25276
20243B23434o0494P37n2288j8550j7566J38220K11739N820j87292j55434j35086
20232d6760p3412l1379N1480K3138J6924J27183J90761l7952K673J5434M4578
20221B82668J00429k15891j53308j01996j12462l8157Q5811J38383J25200j4691
20211I5986j17586l2641p1860o6711J61144O6602M1104n1667n2857j44849K5105
$$ plain form
20287 -40286 -61810 -54951 -139395 -254314 -192084 -83764 29575 224931 200230 4809 -128498
20276 -128498 -238403 -161826 -33625 -72047 -161351 -166788 -61078 124620 227526 200258 114677
20265 114677 63801 4872 151102 80780 4773 4586 45868 234569 319968 274407 200164
20254 200164 139484 48664 23855 -63428 22702 96253 33212 141976 172419 98158 223434
20243 223434 162940 163677 111389 92839 75273 213493 425232 431052 243760 88326 -46760
20232 -46760 -120172 -151551 -100071 -76933 -60009 67174 257935 219983 222656 238090 282668
20221 282668 383097 167206 13898 -88098 -200560 -238717 -152906 -14523 110677 95986
20211 95986 -21600 -54241 -126101 -192812 -31668 34934 76038 24371 -28486 -173335 -148230
20200a48230J11104Q6297N2202j09046j32103j67844k0461J48149o8855j25013
20190c73800K7817J02590r944r6112J37644K43017l8951j84406j5436K81656J59239
20179B33314k17005k59547K2377J44884Q4410J8121M8106N4048l04312j5326O7178
20168a23752J28248J6908P7892l5960j94981j67769L4929P8321K29991k8536j27022
20157a11731L489p161j24026J6751R6299M1658l0997j3979p2732q162k7883J150
20145b37324r832J03761J32863J97908J4134j90468j3663j04279j37282o8661
20135c12843K58204J33495r8129k2649R0768o2184M0668J66832O5109j36908q6186
20124C6177j20184j82895k5600P444P4724J65458P6528N2770j69387k7316K6789
$$ plain form
20200 -148230 -37126 49171 101373 -7673 -139776 -307620 -328081 -179932 -248787 -373800
20190 -373800 -345983 -243393 -253337 -349449 -211805 31212 -7739 -192145 -207581 74075 233314
20179 233314 16309 -243238 -220861 -75977 8433 26554 74660 128708 -175604 -190930 -123752
20168 -123752 4496 21404 99296 63336 -131645 -299414 -264485 -186164 43827 15291 -111731
20157 -111731 -108242 -115403 -239429 -222678 -126379 -84721 -115718 -129697 -202429 -210591 -238474 -237324
20145 -237324 -247156 -143395 -10532 187376 201510 11042 -2621 -106900 -244182 -312843
20135 -312843 -54639 78856 -19273 -41922 48846 -13338 27330 194162 259271 122363 36177
20124 36177 -84007 -266902 -292502 -285058 -210334 -44876 31652 84422 -84965 -112281 -85492
20113h5492j04262r5991K6498r6976q0527p1351j19923J65040K70992J57027O5821
20102C0856J1831k52721J58003K99667j8411k31097j83033r6668J34706J30096
20092a6771K48662o8343k39626J38047J55979m5264j42245K8218O5204l2951J41222
20081B32132J9204j8625J52186N0692L7950K05270p4786j10308k9404p2887J07325
20070D98749j4457P7984M4955j77230j87700K10884M7176j21574n6931J53329
20060D75185N1169j51585n5845j32133j04678r697J51970j96304l3920l8809L948
20049d0699k6511M0380K55523L02027J27446j79055j47830o2652K6782N6071J20723
20038D72205j02089m9248J45534j11253j67033l9267P7742J42834l40783j7442
$$ plain form
20113 -85492 -189754 -285745 -259247 -356223 -436750 -508101 -628024 -462984 -191992 -34965 30856
20102 30856 42687 -210034 -52031 247636 229225 -1872 -184905 -281573 -146867 -16771
20092 -16771 231891 163548 -76078 61969 217948 172684 30439 58657 123861 90910 232132
20081 232132 251336 232711 384897 435589 473539 678809 604023 493715 464311 391424 498749
20070 498749 484292 562276 607231 430001 242301 453185 500361 378787 321856 475185
20060 475185 526354 374769 318924 186791 82113 72416 224386 28082 -5838 -44647 -40699
20049 -40699 -67210 -26830 228693 530720 658166 479111 331281 268629 295411 351482 472205
20038 472205 370116 320868 466402 355149 188116 148849 226591 369425 28642 11200
20028A1200J80948L0593l6363L260J19517j2256l6761n4576O4230j00017p6330
20017I3445O6125J08915K0449j38831l0583p4461j92818P4300M09213j3202j27249
20006A95303j68626p2754O1337j6336j34648p0929J21574O6293J13607p8675j3725
19995B421L1135l4987R255k2274J5193J00129Q3950R845P7916j30450j30565q429
19983C139J81915J94341J09855j50301j80276J84536J93815j39598j94532k31849
19973b8955j31133N1729R4132J01983k617m599o3995J11401j5788q4228j37283
19962a09353M5330K2218o5118P841j27066q6055O9271J1547N5068J68513J95M6661
19950C9052j1212J1992j52506j11683L284Q093J52459M4294m7279O0019K6498
$$ plain form
20028 11200 192148 222741 186378 189638 309155 296899 260138 205562 269792 169775 93445
20017 93445 159570 268485 288934 150103 119520 45059 -147759 -73459 335754 322552 195303
20006 195303 26677 -46077 15260 -1076 -135724 -206653 -85079 -18786 94821 16146 2421
19995 2421 33556 -1431 7824 -14450 743 100872 184822 194667 272583 142133 11568 3139
19983 3139 185054 379395 489250 338949 158673 343209 537024 397426 202894 -28955
19973 -28955 -160088 -108359 -14227 87756 85139 80540 16545 127946 112158 27930 -109353
19962 -109353 -64023 -41805 -106923 -99082 -226148 -312203 -242932 -231385 -176317 -7804 -7609 39052
19950 39052 27840 39832 -112674 -224357 -221073 -212980 -60521 -16227 -63506 -3487 23011
19939B3011J91175o5590M6898K24932K3054K0558M6439j95337j45777j40592j12993
19928h4222L1559k2950l0695N5642J05986o3948m561P5250j8218k79141N9306
19917a75992K67978J5518l2763j1962k8154k0651j10767k6072O9214J30967J71040
19906B48356j46476j60160m5575Q3675r2911j33373O2312J35177Q2228n7725o9456
19895i3928j38247J83301L4474o0856L376Q5361J0856j14984K3682J38301J18633
19884A89969j43003k39933j08551J3327J27063K4497J08472P8036q7419m856R8538
19873E6140k2848j98098j02566O9297K07839P6852j46096k51726m222j0130j34523
19862d60081K66361K20967j89394M2067o4392n435j23131j09678P0578J75200
$$ plain form
19939 23011 214186 148596 195494 420426 443480 464038 510477 315140 169363 28771 -84222
19928 -84222 -52663 -75613 -106308 -50666 55320 -8628 -13189 62061 43843 -235298 -175992
19917 -175992 91986 107504 74741 62779 34625 13974 -96793 -122865 -53651 77316 248356
19906 248356 101880 -58280 -103855 -20180 -113091 -246464 -184152 -48975 33253 -24472 -93928
19895 -93928 -232175 -48874 -14400 -75256 -71880 13481 24337 -90647 -66965 71336 189969
19884 189969 46966 -192967 -301518 -288191 -161128 -136631 -28159 49877 -37542 -42398 56140
19873 56140 33292 -164806 -267372 -198075 9764 86616 -59480 -311206 -315428 -325558 -460081
19862 -460081 -193720 27247 -162147 -120080 -184472 -189907 -313038 -422716 -352138 -176938
19852a76938K09054j01277k64531k2126O7766R9906N7420J500J07010j5436j41977
19841a79629o8299P6470J84181P1068k80501j76246M0923Q1610J69681j25770
19831b06512O2756O7839j48712o9857n8971J0429n312l1691q3351k6398J97494
19820b92286K14630L3967j12227P518L9686O3565J10152L9322j45247J01218J91776
19809B52074L7960p2497m9993n1558J0267L5393J9091K67725O1764j58354j18968
19798B32904j02974j4154L6059N6224p6674j1270j11033n2332j24112j001J7368
19787a50995J54272l2969q0184J13438J01523O0531K3013q2973n6985m89J3217
19776F1399j0721L4703J44032J42850n3429l17101q2015N8528j04887N1127J83716
$$ plain form
19852 -176938 32116 -69161 -333692 -355818 -288052 -188146 -130726 -129226 -22216 -37652 -179629
19841 -179629 -247928 -171458 12723 83791 -196710 -372956 -332033 -250423 -80742 -206512
19831 -206512 -143756 -75917 -224629 -294486 -353457 -343028 -348340 -380031 -463382 -489780 -292286
19820 -292286 -77656 -43689 -155916 -148398 -108712 -45147 65005 104327 -40920 60298 252074
19809 252074 290034 217537 167544 115986 126253 161646 180737 448462 510226 351872 232904
19798 232904 129930 115776 151835 208059 131385 120115 9082 -43250 -167362 -168363 -150995
19787 -150995 3277 -29692 -109876 3562 105085 165616 188629 105656 48671 48182 61399
19776 61399 50678 85381 229413 372263 318834 1733 -80282 -21754 -126641 -75514 108202
19765A08202Q5273R8562J16157r6150k76884n1086O2919k8734L4508J95488P0904
19754C19159o4329m3505r7109k8408L6020K57888q3427L368j15345R9J25130j90938
19742A18603l6992K80731J92426o5308k16601j29528J8078o1866j43961q5689
19732a30107r28J26746N0712r9832R5506j08532J18717M8429m6157R4163R7268
19721B45985K7541L9810k54879o8176J16027J69123J99364L3157j50461m0230
19711C17261j07724j48397k2415M9569J39879M7527p3323J8709J81972O8804L4508
19700E06370J23712N7780l95168j46379j37200N5323j14045K4144J52380M3755
19690A70672R05K26715L0370J72905l7911j31547r9250j0534o663j33251j8262
$$ plain form
19765 108202 193475 292037 408194 312044 35160 -15926 46993 18259 52767 248255 319159
19754 319159 254830 211325 114216 85808 121828 379716 296289 299657 184312 184411 309541 118603
19742 118603 81611 362342 554768 489460 272859 143331 161409 99543 -44418 -130107
19732 -130107 -131035 -4289 46423 -53409 42097 -66435 52282 100711 54554 148717 245985
19721 245985 273526 313336 58457 -9719 106308 275431 474795 507952 357491 317261
19711 317261 209537 61140 38725 88294 228173 275700 202377 221086 403058 471862 506370
19700 506370 630082 687862 292694 146315 9115 64438 -49607 -25463 126917 170672
19690 170672 171577 398292 428662 601567 563656 432109 332859 322325 315662 182411 164149
19679A64149M9174j46363L0463K75647r3614j36598j52503l3231O913m3803j5483
19668i5249k7354Q7017N1173l0709J55727j16249j99159N7595l4738q1462J62208
19657g1200J50835P8029q9048j7406l5513K5341Q9836p0773k8270O7427j68852
19646f9594j59106R9626J2196J99333J79562j16800j69222n1645J6709j25790
19636a84731Q9373O9836l4102L3217j20446j8185J00782l5760j1905n6632n09
19625a69062J00719K36205P1733J10841K31441N2572j70092J08357K80921K80770
19615A134405L3490j40361o2535M50131K85068K37527J73843j7753M1900j2351
19605B123364J69111M2838j12663l7030o2674j90164k34681k57443l9490L2591
$$ plain form
19679 164149 213323 66960 97423 373070 279456 142858 -9645 -42876 -35963 -79766 -95249
19668 -95249 -122603 -35586 15587 -15122 140605 24356 -174803 -117208 -151946 -233408 -71200
19657 -71200 79635 157664 68616 51210 15697 41038 130874 60101 31831 99258 -69594
19646 -69594 -228700 -129074 -116878 82455 262017 145217 -24005 -75650 -58941 -184731
19636 -184731 -95358 -25522 -59624 -26407 -146853 -165038 -64256 -100016 -111921 -168553 -169062
19625 -169062 -68343 167862 239595 350436 581877 634449 464357 572714 853635 1134405
19615 1134405 1167895 1027534 964999 1415130 1700198 1937725 2111568 2093815 2135715 2123364
19605 2123364 2292475 2335313 2222650 2185620 2122946 1932782 1698101 1440658 1401168 1433759
19595A433759m9167q2722j30953k29108k59564j96387n9636J35329n9912J7847
19585E19486J88463P1906j44975P571J15237R2663J02248R018j6816J55505P9530
19574A179836L4392P8507L39754K11218J33774j93548r053O877k0946K26487K7774
19563B015072p5354n8965j9456l4807j32416n36k53495k64541j29670k15395j62117
19552F68320j80727j84519m092m8438M1314K19797j42487j07841j24654j10129
19542B6544M1405J59416J34139j66714j75532q1243r0886J8765l3220O5120J74116
19531G1910J81016O3697O6219J43725k9562j35621j84557j59924k18901R5808
19521a06190J15269q2577n1325R3480K61308J06330j0588l6128k6274j15456o3268
$$ plain form
19595 1433759 1384592 1301870 1170917 941809 682245 485858 426222 561551 501639 519486
19585 519486 707949 779855 634880 642451 757688 850351 952599 961617 944801 1100306 1179836
19574 1179836 1214228 1292735 1632489 1843707 1977481 1783933 1774880 1781757 1760811 1987298 2015072
19563 2015072 1939718 1880753 1861297 1826490 1694074 1693538 1440043 1175502 1045832 830437 668320
19552 668320 487593 303074 298982 250544 291858 511655 369168 261327 136673 26544
19542 26544 67949 227365 361504 194790 19258 -61985 -152871 -134106 -167326 -102206 71910
19531 71910 252926 316623 382842 526567 497005 361384 176827 16903 -201998 -106190
19521 -106190 9079 -73498 -124823 -31343 229965 336295 325707 289579 263305 147849 84581
19510H4581J05382O9897L1251m9192j93408k6692o4050M8778J11199l8726j10595
19499c1575J03151J72093n550l3482J19597J3388k2834j26551k61279M6391M3522
19488A6871K4330N987j9152M2625J19865J0937k07307r4107J20467J39407K4226
19477A84149n5845K2620M6201n2477j66298M0508J36810k5357j46706P481j9075
19466b7989n2546J2313n0755j50524J44362R4223j07585L5514k1837J23724J00440
19455I9340Q1360j93660J9912N6176k3356R2765k24j12510p9562r9650K44276
19444H4867r767L5719K5230J45033k11875j02717K04944J35004k1692j42511j06700
19433C5535j028m1829L4134N0726J2977J68763R2863l7842n0272k07143j84326
$$ plain form
19510 84581 189963 259860 291111 241919 48511 21819 -42231 6547 117746 79020 -31575
19499 -31575 71576 243669 238119 204637 324234 337622 314788 188237 -73042 -26651 16871
19488 16871 41201 47188 28036 70661 190526 201463 -5844 -99951 20516 159923 184149
19477 184149 128304 150924 197125 144648 -21650 18858 155668 130311 -16395 -8914 -27989
19466 -27989 -80535 -68222 -118977 -269501 -125139 -30916 -138501 -102987 -124824 -1100 99340
19455 99340 180700 -12960 6952 63128 39772 132537 132313 19803 -59759 -159409 84867
19444 84867 75100 110819 136049 281082 69207 -33510 171434 306438 284746 142235 35535
19433 35535 34507 -7322 26812 77538 90515 259278 352141 314299 264027 56884 -127442
19422a27442q3438J46405J47981K38960q214q2923o5156L2061N4033J45057q770
19411C88554k4041j35895L8443N1570j13649k08967j24652J19610J34000k692
19401A22281l4590j69508Q5901J64973j79002o4996N6981j4061n761J12353r0685
19390a6114k74970M9381j2058p5881j05644J54157J31935l2495o4472O3507J24030
19379e8624J41238J64447k01668j80356O9793p477j13817Q3398m1226P499K3179
19368a13614Q115j33669j40415r8119M1387L5897J52048J31589O6525J04002K10464
19357B64210j44835j74647j05393j57529l7282k1127n9544J77254K52786J42985
19347A36878j35358R947J58912L8986r1605j19882o3917k1970j37068k27654j26199
$$ plain form
19422 -127442 -210880 -64475 83506 322466 314252 231329 166173 198234 252267 397324 388554
19411 388554 364513 228618 267061 318631 204982 -3985 -128637 -9027 124973 122281
19401 122281 87691 -81817 4084 169057 -9945 -74941 -17960 -32021 -37782 74571 -16114
19390 -16114 -291084 -241703 -253761 -329642 -435286 -281129 -149194 -181689 -246161 -182654 -58624
19379 -58624 82614 247061 45393 -134963 -65170 -72647 -186464 -103066 -144292 -136793 -113614
19368 -113614 -105499 -239168 -379583 -477702 -436315 -400418 -248370 -116781 -50256 53746 264210
19357 264210 119375 -55272 -160665 -318194 -355476 -376603 -436147 -258893 -6107 136878
19347 136878 1520 11467 170379 209365 117760 -2122 -66039 -88009 -225077 -452731 -578930
19336e78930K2287J24084M7449M9841r264J79098J70390R7850L2700r7695j18534
19325h0724k12620j63521P2760K00267j24341Q3718k6525L821J13588M456J6770
19314a12351M4221J90526J27983P1517j47738j91364R0733J60772j48419j77440
19304i1560K7610j8504k1518q3654J81430J94482o5775k6413m9154r5486n794
19293e4336j50510M3561l6104Q3504j7867m2041J55930K5227P8867r2461p3022
19282g9252R9943J0742j28028o4242N6162J72250j7245M4028J9328J8095o4068
19271F7713r3098N3730Q3274P5951L6732j61391L486L4537k280j16807m4655q2754
19259a45562p5253l5630P3480K13760J36576k4491j3954J7634j83831q4083P849
$$ plain form
19336 -578930 -556643 -432559 -385110 -335269 -344533 -165435 4955 102805 135505 37810 -80724
19325 -80724 -293344 -456865 -384105 -183838 -308179 -224461 -250986 -247165 -133577 -129121 -112351
19314 -112351 -68130 122396 250379 321896 174158 -17206 73527 234299 85880 -91560
19304 -91560 -63950 -82454 -103972 -187626 -6196 188286 122511 96098 46944 -48542 -54336
19293 -54336 -204846 -161285 -197389 -113885 -131752 -173793 -17863 7364 86231 -6230 -79252
19282 -79252 20691 31433 -96595 -160837 -104675 67575 50330 94358 113686 131781 67713
19271 67713 -25385 28345 111619 187570 224302 62911 66397 100934 98654 -18153 -62808 -145562
19259 -145562 -220815 -256445 -182965 30795 167371 142880 128926 146560 -37271 -121354 -113505
19248a13505O6143J2876k0895N1154p7808L5724j44070j40190q9412P7068K23926
19237a18989K74628L2438O4375o7222J02437K0355q5436k15291o9704P0600J40601
19226A48792m4981q8145j10079j77996k6956J10206Q0318r3070O3595J78033J73758
19215B13475K5176R3153j01462k43081j01772Q419O8409O713l3976R6164j9241
19204A1977q2351J59971m5208k3852O8343N5396J03290p6867M8443r0221p7671
19193E1250M4761K3306n6907L0869l36736j9490J81862N21J73920N5128j43714
19182D770k1731j24789r2395K14522J87696n2006K21601J16480j11513j40939
19172B01696k23779r9535r2884l8178N3706l7721M6795J03877J38805j3002j02584
$$ plain form
19248 -113505 -47362 -34486 -55381 -4227 -82035 -46311 -190381 -330571 -419983 -342915 -118989
19237 -118989 155639 188077 252452 185230 287667 308022 222586 7295 -62409 8191 148792
19226 148792 103811 15666 -94413 -272409 -299365 -189159 -108841 -201911 -138316 39717 213475
19215 213475 238651 331804 230342 -12739 -114511 -106092 -37683 -30970 -64946 31218 11977
19204 11977 -70374 89597 44389 20537 88880 144276 247566 170699 219142 128921 51250
19193 51250 96011 119317 62410 93279 -243457 -262947 -81085 -80564 93356 148484 4770
19182 4770 -16961 -141750 -234145 -19623 168073 116067 337668 454148 342635 201696
19172 201696 -22083 -121618 -214502 -252680 -198974 -236695 -189900 -86023 52782 39780 -62804
19161f2804L668r3098m4976R7727J74909q0758K5728k6272m0092J58810r6861
19150A5981O329J05599k03467k38847R0242J16764M4769L97270K02052l9559r4653
19139D02480j31616j5170Q1713M7884l2927J8278o298r7781N7961K35124J07972
19128F67620q087J59963M12592Q67037J409848J294152M93757p70641j148895
19119C377346j005126o94672l53164k15086K20264M01221M08787M23414Q2811
19110B645795m13433l05030m12768n32953l60216j46084n387K3815n0230J11701
19100E55210L3514J1577J5210M79332N78198N90869N92632j23211n51579l90443
19090A791309l24294j81076K03419L17845N44465J079795J148237N04721n35841
$$ plain form
19161 -62804 -59136 -152234 -197210 -99483 75426 -5332 20396 -5876 -45968 112842 15981
19150 15981 22310 127909 -75558 -314405 -224163 -107399 -62630 334640 536692 497133 402480
19139 402480 270864 255694 337407 385291 352364 370642 364344 266563 324524 559648 667620
19128 667620 659533 819496 1232088 2099125 3508973 4803125 5296882 4526241 3377346
19119 3377346 2372220 1677548 1324384 1109298 1329562 1730783 2139570 2562984 2645795
19110 2645795 2232362 1927332 1514564 981611 621395 475311 469924 493739 443509 555210
19100 555210 588724 600301 615511 1094843 1673041 2263910 2856542 2733331 2181752 1791309
19090 1791309 1467015 1285939 1489358 1807203 2351668 3431463 4579700 5084421 4548580
19081D548580j124355j080640p17943m73537l12458k90404P1750n101j49083M5968
19071E12777o7405j17583j78542q9391M7992O8941J93961L8870j66931j83232
19061E9457j22306k0447k0170J23349j18450N1808Q5787m6380L1564J93938q782
19050B09368k43961J5608P0004R8182R8071j0687J786k14308l7574K5842n5711
19039d3380j96684J21155J97258L3374n7928p0711j5699p1372O6691j1878l165
19028e2339l6369q3342J24800O3005J17921P0593j15319o6487j57348K0795L8702
19017g5388J03789J2508j57958Q0982l4827p4002j23508K0537J41063K13181n0713
19006E5664j68689o9976m098N2128K44768J43619q1556q6380J03811l3251j22843
$$ plain form
19081 4548580 3424225 2343585 1625642 1152105 839647 549243 620993 615892 466809 512777
19071 512777 445372 327789 149247 59856 107848 176789 370750 409620 242689 59457
19061 59457 -62849 -83296 -103466 19883 -98567 -46759 39028 -7352 24212 218150 209368
19050 209368 -34593 -18985 51019 149201 247272 236585 238371 24063 -13511 12331 -43380
19039 -43380 -240064 -118909 78349 111723 53795 -16916 -32615 -103987 -37296 -49174 -52339
19028 -52339 -88708 -172050 -47250 15755 133676 204269 88950 22463 -134885 -114090 -75388
19017 -75388 28401 40909 -117049 -36067 -70894 -144896 -268404 -247867 -106804 106377 55664
19006 55664 -113025 -183001 -187099 -134971 109797 253416 171860 85480 189291 156040 33197
18995C3197J31368K6745p0139l2280j1764K7715M6505j03455o9720q7772O150
18984a03450J82499O8582j45471k88584k081K57365Q672j9996P8465K802J70124
18973B08927O8393j13296k31376J36836K02176m8162o3713j0329l5371J28308
18963B42393N2721l078P7104J02736m8511j7165Q1714J24756K69048J74615O1539
18952A117872L8807Q4784J20905K4877m1379K00490J89625K49236K40947N02004
18942B728168M76817L83891M39168N84582R90874J460425K281750L442180N500904
18933A8288759R811819J5712810K1025929J8722271K726861j3296411j8762319
18926E4229719j5715252r547081m397445p80252K796509P196763J0406677P208859
$$ plain form
18995 33197 164565 191310 121171 88891 77127 104842 151347 47892 -21828 -109600 -103450
18984 -103450 79049 147631 2160 -286424 -288505 -31140 -22468 -42464 36001 38803 208927
18973 208927 277320 164024 -67352 69484 271660 223498 159785 149456 114085 242393
18963 242393 295114 292036 369140 471876 423365 406200 487914 612670 881718 1056333 1117872
18952 1117872 1156679 1241463 1362368 1387245 1345866 1546356 1735981 1985217 2226164 2728168
18942 2728168 3204985 3588876 4028044 4612626 5603500 7063925 9345675 12787855 18288759
18933 18288759 28100578 43813388 64839317 83561588 86288449 72992038 54229719
18926 54229719 38514467 28967386 24569941 23789689 26586198 33782961 44189638 51398497
18918E1398497k072469r188467j0519523q109482m984219l016549j863615j006203
18910A0637970p12779J5952O51876J090292K236328M081757P514139J1260292
18902C6775827J0229878K406992n777671q943954p545356m179584n26011K723241
18894B5163362P591205J4976505K0903708J5345831j079338j4304201j8898807
18887D9698265j5609490j0381137o504914m101562k682378j743089j194233q67274
18879F614188n42614k08410k59331l43096k51187m37032n00748n36216m97715
18870C037839k52874j94657k46426j63534L603J14727k3421l43432l54705k39330
18860A337790n6043j31606j86094K5675J19721J41538n459j58437n2666j48050
$$ plain form
18918 51398497 49326028 40137561 29618038 21508556 16524337 13507788 11644173 10637970
18910 10637970 9925191 9941143 10593019 11683311 13919639 18001396 25515535 36775827
18902 36775827 47005705 49412697 43635026 34691072 27145716 22966132 22440121 25163362
18894 25163362 32754567 47731072 68634780 83980611 82901273 68597072 49698265
18887 49698265 34088775 23707638 17202724 13101162 10418784 8675695 7481462 6614188
18879 6614188 6071574 5863164 5603833 5260737 5009550 4572518 4071770 3535554 3037839
18870 3037839 2784965 2590308 2343882 2180348 2183951 2298678 2275257 1931825 1577120 1337790
18860 1337790 1281747 1150141 964047 989722 1109443 1250981 1245522 1087085 1034419 886369
18850H86369q0146m0961K17514J79248o2510j75399k30869k534J01717j2767Q681
18839G88343K01131J94947M25593J06939l02894l88086k70427j30640k47138j9237
18829C58531J02421o904N9435j03408l57128Q9714J85166J7048p3915N0888q1295
18818B40553J26227N7384q8653l2292k08424k4425n532l0336Q1411j5837J2518
18807A12594J03922k8347q6852p4731K9477K18204L44242R9266j76496l08706
18797B32573j74751M56K6739k4119p0097M0171J43196O6405l8557j4398o3025
18786A24593K5818j3523j5312O8654j05390Q3759K4834p5508j31329j12883M2317
18775h3970q8367l7238P0011K66202J60056M1448n7677P6244J27673K39394L71794
$$ plain form
18850 886369 806223 765262 982776 1162024 1099514 924115 693246 690712 792429 779662 788343
18839 788343 989474 1184421 1610014 1716953 1414059 1025973 755546 624906 377768 358531
18829 358531 460952 454048 513483 410075 52947 142661 327827 344875 270960 321848 240553
18818 240553 366780 424164 335511 303219 94795 70370 64838 34502 115913 100076 112594
18807 112594 216516 188169 101317 26586 56063 274267 618509 717775 541279 232573
18797 232573 57822 58278 85017 60898 -9199 30972 174168 240573 202016 187618 124593
18786 124593 150411 136888 121576 190230 84840 168599 193433 117925 -13404 -126287 -83970
18775 -83970 -172337 -209575 -139564 126638 286694 328142 270465 346709 474382 713776 1085570
18764A085570K19578K17312n0602l58770m53552j91827r2319m0730o1003o0481
18754B13176j4199p5595j39267l3384J08457j41844j42487Q9278J24397K26993
18744B15525J35391r9742Q5795K58695m7381k0933M2747k36686n0654m4208L2737
18733B71286k10189J7797Q1892K1192J3895j58430N2031j89181j45442J06388
18723a38761J96118l5125P8784P422J6133m1575J1615q2807J33692J31628j18927
18712A58197r1574J8871J13068N1454J9208r3999j39320o3047L4784J8110m6896
18701b1144M8693J09163M3543j26353l2971M9581J5412j28711k05432J76765P8832
18690G378j15642j68114J75382K10595L4622k44028l9523J88376J36048n5794
$$ plain form
18764 1085570 1305148 1522460 1471858 1113088 659536 467709 375390 334660 273657 213176
18754 213176 198977 123382 -15885 -49269 59188 -82656 -225143 -135865 -11468 215525
18744 215525 350916 251174 336969 595664 548283 527350 570097 333411 282757 238549 271286
18733 271286 61097 78894 160786 181978 195873 37443 89474 -99707 -245149 -138761
18723 -138761 57357 22232 101016 108438 124571 82996 94611 11804 145496 277124 158197
18712 158197 66623 85494 198562 250016 269224 175225 35905 -27142 7642 25752 -21144
18701 -21144 27549 136712 180255 53902 20931 70512 85924 -42787 -248219 -71454 7378
18690 7378 -108264 -276378 -100996 109599 144221 -99807 -139330 49046 185094 129300
18680A29300j63721P1005J9949Q5439J4911n9310k5173j70036L0932L7454J29093
18669I9843K15294j00261j20200o6196l9158M2635k4057J67026J16086j70647
18659A20365j5832j4432r8020j04978M1532m6255J23960J16140j29753j51356
18649a58629l6782P5283J19163J89735O5737q1468j54403J3969L5551l2885l8534
18638c263J12140l4720j10563m4205J5755J22389j08744o1679m1080N3737R0129
18627a0104K03649j03938L3886k6984r3820l3326r8897l3952o5031j64418j17337
18616e10272O5769L6414L00749Q9071O944l0055r5363J07325N011j79195N7356
18605a46246K04313k4516k69637j19974k4772k7085J2422R992k6029R8422M2264
$$ plain form
18680 129300 -34421 36584 56533 141972 156883 97573 72400 -97636 -66704 -29250 99843
18669 99843 315137 214876 94676 28480 -10678 31957 7900 174926 291012 120365
18659 120365 104533 90101 -7919 -112897 -71365 -117620 6340 122480 -7273 -158629
18649 -158629 -195411 -120128 -965 188770 254507 173039 18636 32605 68156 35271 -3263
18638 -3263 108877 74157 -36406 -80611 -64856 57533 -51211 -112890 -153970 -100233 -10104
18627 -10104 193545 89607 123493 96509 2689 -30637 -129534 -163486 -228517 -392935 -510272
18616 -510272 -444503 -408089 -107340 -18269 -11325 -41380 -136743 -29418 -24407 -203602 -146246
18605 -146246 58067 33551 -236086 -356060 -380832 -407917 -395495 -385503 -411532 -313110 -270846
18594b70846J54042Q1755O5384K8275O094r8321J21707J15754r4962o5226K02453
18583B46109J49528k9189r5149k22547j20170M6517l5785l2954q0591n0753J20798
18572a04186K31241J36605p263m1102o2852o0722j1274j17317r1336l2706J68099
18561G187O1472j6218j3204r0634k9779J00674K38540j36461j34911P0669j74434
18550a17099K8313J22110o5811j26691J67958N7814L1361J07949Q6388j47416
18540A44876j07875j73566p3011R8268J4947k6518J89490O6215n8375p0667o2200
18529e8416j3212O9116K25028r0126l2102j12685L0722O8095N86o4417n1977J82438
18517A53050N5280k88557n5248J66692q0189j15312j18341L5642J01010l9803
$$ plain form
18594 -270846 -116804 -35049 30335 58610 64704 -33617 88090 203844 108882 43656 246109
18583 246109 395637 366448 271299 48752 -71418 -24901 -60686 -93640 -174231 -224984 -104186
18572 -104186 127055 263660 256397 215295 152443 91721 80447 -36870 -128206 -160912 7187
18561 7187 68659 52441 39237 -51397 -81176 19498 258038 121577 -13334 57335 -117099
18550 -117099 -88786 33324 -32487 -159178 8780 66594 97955 205904 292292 144876
18540 144876 37001 -136565 -209576 -111308 -96361 -122879 66611 132826 74451 3784 -58416
18529 -58416 -71628 -2512 222516 132390 100288 -12397 18325 86420 87006 22589 -29388 153050
18517 153050 208330 -80227 -135475 31217 -48972 -164284 -282625 -246983 -145973 -185776
18507a85776J37999M6653L6575N8991j9820o78j14877j30233M3440J47825j49172
18496a29073J4731L1355j599l4337j16249n6932N9096R2637J56939Q3355r9911
18485A2K08262j17530j37214Q5062J54471o8743O5072K34855J77592j27865k14515
18474B59459P4622J24893R559n9686j11819j11375j4944J53724K5353j56593r3096
18463A00097r1856j01016J23692Q8460L0354r1145R5128J46486L9841J01725j4741
18452D27025O0053O2112k1080k40965N194J42782P995n1502j72889M7556R2052
18441C58333j22424k11448j90273J5477m2470p6582N9097K64943J34738R9785
18431B89176J17984j43580m4712J7662P650j991j20152j78199k1769J11588l0650
$$ plain form
18507 -185776 -47777 -1124 35451 94442 74622 73944 -40933 -171166 -127726 20099 -129073
18496 -129073 -114342 -82987 -84586 -118923 -235172 -292104 -233008 -140371 16568 99923 12
18485 12 208274 90744 -46470 38592 193063 124320 189392 424247 601839 473974 259459
18474 259459 334081 458974 468533 408847 297028 185653 170709 324433 349786 193193 100097
18463 100097 8241 -92775 30917 119377 149731 58586 153714 300200 340041 441766 427025
18452 427025 487078 549190 528110 287145 292339 435121 443116 391614 218725 266281 358333
18441 358333 235909 24461 -165812 -150335 -192805 -269387 -210290 54653 189391 289176
18431 289176 407160 263580 218868 236530 244180 242189 122037 -56162 -77931 33657 3007
18420C007J1250M9595K1022j07850l2136q7381J09109m5931m3352O6355L60218
18409C03906J99780j18442k32033L8530j1990m8357R9744J57545P1992p8619j09192
18398B72864N6247J42579n4958L412L6663P8740m4326o3512j25468j64267N5592
18387A93566j2864j36992M8841j3965J06581j59609m0961Q472O6298O3617p9905
18376D3079K4833Q9095o2586L4948O5816J29733j01913k8171j5169n9439O2896
18365A83122O5077j99164p3165K11388R6193P3534j09629p4654j03897O2820J31744
18354B63369r4945n7411j00143r9348p7639J16110L0371l1366N3855l0281j14453
18343a41881j01084O61q527Q2428M4479L5238l7303R4805K03550J9939J6376j84295
$$ plain form
18420 3007 14257 63852 84874 -22976 -55112 -142493 -33384 -79315 -122667 -56312 303906
18409 303906 503686 385244 153211 191741 179751 131394 231138 388683 460675 382056 272864
18398 272864 329111 471690 416732 420144 456807 535547 491221 427709 302241 137974 193566
18387 193566 180702 43710 92551 78586 185167 25558 -15403 -6931 59367 122984 43079
18376 43079 67912 157007 94421 129369 195185 324918 223005 194834 179665 120226 183122
18365 183122 248199 49035 -24130 187258 283451 356985 247356 172702 68805 131625 263369
18354 263369 168424 111013 10870 -88478 -166117 -50007 -19636 -51002 2853 -27428 -141881
18343 -141881 -242965 -242304 -250831 -168403 -123924 -88686 -125989 -31184 172366 192305 208681 24386
18331B4386j40752M8773J25882K6472k12140M5555J56600Q1991j22668n2720K7006
18320H385r5307q7639J18249o2172n3783L2886P3865K652l6951K5131j36145J46104
18308f4725P1326j65062k08314N539J8624p2323J7800K96722P9903J84940J08041
18297B72471j56644j0157N5438m9240k16430J3631J95341k7216J8730R4745Q0440
18286B71109j24113M321j7744p517o1222P879n4378j1255j2812k35834r0519J20302
18274b11783M9191L4485j47261l5987j4179M6411J14858o6861L7871j20199j5287
18263c28741O696j2601J9480K01942O9870J05867O0085n864j71954J08725M2378
18252I5883J4360K31375P1673o6435j00899j80811q1463n618J56885J73072o6648
$$ plain form
18331 24386 -116366 -67593 58289 84761 -127379 -81824 74776 156767 34099 -18621 8385
18320 8385 -86922 -174561 -56312 -118484 -172267 -139381 -65516 -62864 -99815 -74684 -210829 -64725
18308 -64725 6601 -158461 -366775 -361236 -342612 -414935 -397135 -100413 -20510 164430 272471
18297 272471 115827 105670 161108 111868 -104562 -90931 104410 77194 95924 190669 271109
18286 271109 146996 151317 133573 126056 64834 72713 18335 7080 -5732 -241566 -332085 -211783
18274 -211783 -162592 -128107 -275368 -311355 -325534 -279123 -164265 -231126 -193255 -313454 -328741
18263 -328741 -322045 -334646 -315166 -113224 -43354 62513 122598 116734 -55220 53505 95883
18252 95883 110243 341618 413291 346856 245957 65146 -16317 -21935 134950 308022 241374
18241B41374k7685k43658r8373l978r7430J42627J61701n0982p0375O0599N8606
18230G2426j02323N4625K1182j24927N924J13975k5796j01690L6651J07930n0161
18219G816n3576J46887J41546Q7102J6675P5100j22830l91014j74018K62479K44872
18208B41039J9896n5779m0501P526j4886r3225J35408Q3433q053j44629p792O7896
18196A90333R6155n5022q5439j13574q53k4333n8320N0347J70913N793O8625n638
18184B38987j2188o643r2342q1057R5476k415K9100j9192j2917M8111K0525n6285
18172A49160R7116J38858j78562m3346K0805K8171K4630R4354m6932J06159P4332
18161D64745o0263j29541n5692j56419q0634K6836o6890r8739P0580j3052J29179
$$ plain form
18241 241374 213689 -29969 -128342 -132320 -229750 -87123 74578 23596 -46779 13820 72426
18230 72426 -29897 24728 45910 -79017 -73093 40882 15086 -86604 -49953 57977 7816
18219 7816 -45760 101127 242673 329775 346450 421550 298720 -92294 -266312 -3833 241039
18208 241039 260935 205156 164655 172181 157295 64070 199478 282911 274858 130229 122437 190333
18196 190333 286488 231466 146027 32453 31600 7267 -51053 -706 170207 176000 244625 238987
18184 238987 226799 220156 127814 46757 142233 139818 168918 149726 136809 184920 205445 149160
18172 149160 246276 385134 206572 163226 184031 212202 236832 331186 284254 390413 464745
18161 464745 404482 274941 219249 62830 -17804 9032 -57858 -156597 -86017 -99069 30110
18150C0110M9638L17928K05396j6749n6623r9766k4129Q2880m7246M6911Q5911
18139E74261n2660K7065J01322K6345n2372Q4893L74541L21063J41941M1878R0774
18128A679051J47553K42915K20450K26064J0399m3616L02863P18210P65677O92233
18118D961799P01471R88054J266898J707898K181844K913686M187332O265265
18110B5174247R830812J7297402L2469248O1387016R5003653P7019041p853639
18103C10327780o7347321q0704224n9883379l4935284j9918568j2184564p834623
18096B7519817n476349l848907k967547j991921j641858j276927j000860p91660
18088H523788p79504q22580p20713q82848q38436l73202k79563k53071l68639
$$ plain form
18150 30110 79748 397676 603072 586323 529700 429934 405805 488685 441439 488350 574261
18139 574261 521601 548666 649988 676333 623961 708854 1083395 1404458 1546399 1588277 1679051
18128 1679051 1826604 2069519 2289969 2516033 2526432 2482816 2785679 3503889 4269566 4961799
18118 4961799 5663270 6651324 7918222 9626120 11807964 14721650 18908982 25174247
18110 25174247 35005059 52302461 84771709 146158725 241162378 318181419 310327780
18103 310327780 242980459 162276235 102392856 67457572 47539004 35354440 27519817
18096 27519817 22043468 18194561 15227014 13235093 11593235 10316308 9315448 8523788
18088 8523788 7744284 6921704 6200991 5318143 4479707 4106505 3826942 3573871 3205232
18079C205232m58629k83039m1694o4422k50552m5098k8327r8340o5955j05802
18069A763374n7593m3735r4051k65312j85944k9739r7803j23160k31549P2917
18059G07405j1827J7962Q5086j55653j99625l2207q2603J1083J38799m155l0337
18048D43928j12740p5592o7887j28666r2267R1090J83706j1989j17976q4920M7159
18037G3846J18584m26o6700l1926j29251J19526J13915Q7091j73012J7025L63076
18026D91748K28299p6861m01278r7806K65187j04152k10670J946J73860j27600
18016A42673o490J11735q6973M3340k1435J1584P0041k8324J51261K828j00321
18005B89919j32147k6081Q035o3064L4377K3329J10090N4214j26615l3365J03770
$$ plain form
18079 3205232 2746603 2463564 2421870 2357448 2106896 2061798 2033471 1935131 1869176 1763374
18069 1763374 1705781 1662046 1567995 1302683 1116739 1087000 989197 866037 634488 707405
18059 707405 695578 713540 798626 642973 443348 411141 328538 339621 478420 474265 443928
18048 443928 331188 255596 187709 59043 -33224 57866 241572 229583 111607 26687 73846
18037 73846 192430 192004 125304 93378 -35873 83653 197568 284659 111647 128672 491748
18026 491748 720047 643186 241908 144102 409289 305137 94467 96413 270273 142673
18016 142673 136183 247918 160945 204285 182850 194434 264475 236151 387412 390240 289919
18005 289919 157772 131691 139726 76662 111039 134368 244458 298672 172057 138692 242462
17994B42462K45758j31858l474l1740p9857j99855J38891O9092q3991j00158N6413
17983A21683L550K3115O1081j05316j32619n1609J76413J22466K1917j05869n7295
17972G7517L8007k7753q9817K3243J64299M9355n9268r060j32943N835q1072O9808
17960B8151N8869j04738r881m434J8606L8633l1748r5039j57620K7553M3428J12903
17948g5317R8660J73280M2061k56821j09100j5415Q6968P2629L5952j24270J21101
17937D9728Q8220J11630k1132j75994K7653r476l9770j94672K8542N4273J9616
17926f1382L10185k32906l7160m1762Q3624n3538j4761K71775O0517j23758o1315
17915I9519R0462Q7049J17047L5087j74563j11657j4177o1j27695J27678O9901
$$ plain form
17994 242462 488220 356362 352888 321148 241291 41436 180327 249419 165428 65270 121683
17983 121683 125233 148348 209429 104113 -28506 -80115 96298 218764 240681 134812 77517
17972 77517 115524 87771 -2046 21197 185496 234851 175583 166523 33580 39415 -41657 28151
17960 28151 87020 -17718 -27599 -32033 -13427 25206 -6542 -101581 -259201 -231648 -188220 -75317
17948 -75317 23343 196623 238684 -18137 -127237 -142652 -55684 16945 52897 -71373 49728
17937 49728 137948 249578 228446 52452 80105 70629 30859 -163813 -135271 -80998 -61382
17926 -61382 248803 15897 -21263 -63025 20599 -32939 -47700 224075 284592 160834 99519
17915 99519 189981 277030 394077 429164 254601 142944 128767 128706 1011 128689 198590
17904A98590N857j12235M636J4022r2648O9338P9581q9364p2338m8759o2553n7527
17892a63400J47411R3453k07192r965O1971r8112l4886l11p4055N1046J85371
17881d8669O5978q6147p8689k04358k2721N8299J27020J7422k17808K4703m4432
17870d09402q2414K24844Q2994J27535K5587m5972q4978J23790Q8505J72329k19326
17859C492k15204l7860J34255K9228k8571J44480P7543L8234r9180k25216j02405
17848b81204J07412L23933R7373N4074N9136j19647k40776n1558J77969L5396
17838A62108R4129j99753j62492Q8546Q1274k4013L8216l7653o3902J6535L5107
17827B8102n9357l5136J7524p6421R3820r391q1858o7980k1200Q2541Q5794q723
$$ plain form
17904 198590 204447 92212 96848 110870 18222 87560 167141 77777 5439 -43320 -105873 -163400
17892 -163400 -15989 77464 -129728 -139693 -77722 -175834 -210720 -211031 -285086 -234040 -48669
17881 -48669 17309 -68838 -147527 -351885 -374606 -316307 -189287 -171865 -389673 -364970 -409402
17870 -409402 -491816 -266972 -183978 -56443 -30856 -76828 -161806 -38016 50489 222818 3492
17859 3492 -211712 -249572 -115317 -86089 -114660 29820 107363 145597 46417 -178799 -281204
17848 -281204 -173792 150141 247514 301588 360724 241077 301 -51257 126712 162108
17838 162108 256237 56484 -106008 -17462 63812 39799 78015 40362 -23540 -7005 28102
17827 28102 -31255 -66391 -48867 -125288 -31468 -40859 -122717 -190697 -211897 -129356 -43562 -52285
17815e2285j50090Q3443K7271q0574m1747K5517P8365k2460J23604O5339j28630
17804g2247j16419O7268K11740J09788j06395j40109N8600k5070O5032K2194r8805
17793b4423j14925J39129j9655j4974j24242q9559l6949j39459Q8733J68056O0491
17782a07777q8953j03539J76359K94005J3461j45882l52501O9370K32292l405
17772a6570R197J37596j707j00680L7187q8976j75165J49209j6825n8815p363
17761a32912J66267J93644Q3045Q5732n210j13250j36906j42930j56315p2652
17751b31487R5705q0866N2657L3809P6663m1190L0672k7667J90328K892M8313
17740A49829o6369K0837M7380k2400o7690J31277J6582o9772m7184n7559J5585
$$ plain form
17815 -52285 -202375 -118932 -91661 -172235 -213982 -188465 -110100 -132560 -8956 56383 -72247
17804 -72247 -188666 -121398 90342 200130 93735 -46374 12226 -12844 52188 74382 -24423
17793 -24423 -139348 -219 -19874 -34848 -159090 -248649 -285598 -425057 -336324 -168268 -107777
17782 -107777 -196730 -300269 -123910 170095 183556 37674 -314827 -245457 -13165 -16570
17772 -16570 -7373 130223 128516 27836 65023 -23953 -199118 -49909 -66734 -125549 -132912
17761 -132912 33355 226999 310044 395776 390566 277316 140410 -2520 -158835 -231487
17751 -231487 -135782 -216648 -163991 -130182 -53519 -94709 -64037 -91704 98624 101516 149829
17740 149829 83460 104297 151677 129277 61587 192864 209446 139674 92490 34931 50516
17729E0516o7972J2112r7312l2346j42016k5049J85580k6021N019J83660n8632
17718a2461o1654O1404J09154r2730l45827K15842J78582j86322j44237J02593
17708a75656M1683q3877o6830N5039J23365J88444M4919r3295J63440o2296r9201
17697C5735j5622r19K0406j62561q7094P0012K29408j41289j23906N6437O1187
17686e8206J25011M2523m2145L8295O2428Q7382k81442l23928R4171R8575j747
17675a59083Q2699l6934M9638r9946n1140J24749P2791o7278P6999o0273M0621
17664b7157J50981k03762k32871K33674J85839j06939J6025k53036l1776J02169
17654a66853O0102P9252J06681K0614j25692P766K553j64213k34496l4427J91712
$$ plain form
17729 50516 -17456 -5344 -102656 -135002 -277018 -302067 -116487 -142508 -137489 46171 -12461
17718 -12461 -74115 -12711 96443 3713 -342114 -126272 52310 -134012 -278249 -175656
17708 -175656 -133973 -217850 -284680 -229641 -106276 82168 127087 33792 197232 134936 35735
17697 35735 20113 19194 39600 -122961 -210055 -140043 89365 -51924 -175830 -119393 -58206
17686 -58206 66805 109328 67183 105478 167906 255288 -26154 -350082 -255911 -157336 -159083
17675 -159083 -76384 -113318 -63680 -163626 -214766 -90017 -17226 -84504 -7505 -67778 -27157
17664 -27157 123824 -79938 -312809 -79135 106704 -235 15790 -237246 -269022 -166853
17654 -166853 -106751 -27499 79182 99796 -25896 -18130 -15577 -179790 -414286 -448713 -257001
17643b57001O4626Q0194L6601P1787L4598j83001J83006J61938m2147j97233j35095
17632a81727p0602J88442P1243j18198j38424P0451J73936L7787J04153Q959j85266
17621c9246K0415J42169M8511K6100j03691k13676K4035n7105O3918P3367l4915
17610e0118j18904J68190J10984P6370L8262j67038m2838J27143L11959M9575
17600E03585p2954j13716k36146j20235K9785N0217k12158j38147J02391J93750
17590a3628O2817J4278p5767Q49P3434K7890j73934o6937k7937p8079L8408J57823
17578f0783L8809o194m1262m1120P4924Q3394P8268N130m0557l4790R6070J04632
17566B56521p9319p3993l8090j89148j5370J22418M1869j21731j55748o4878M9745
$$ plain form
17643 -257001 -192375 -112181 -75580 -3793 30805 -152196 30810 192748 150601 -46632 -181727
17632 -181727 -252329 -63887 7356 -110842 -249266 -178815 -4879 32908 137061 146020 -39246
17621 -39246 -18831 123338 171849 197949 94258 -119418 -95383 -152488 -88570 -15203 -50118
17610 -50118 -169022 -832 110152 186522 224784 57746 14908 142051 454010 503585
17600 503585 430631 316915 80769 -39466 -9681 40536 -171622 -309769 -207378 -13628
17590 -13628 49189 63467 -12300 -11451 61983 89873 -84061 -150998 -178935 -257014 -218606 -60783
17578 -60783 -21974 -28168 -69430 -110550 -35626 47768 126036 131166 90609 55819 151889 256521
17566 256521 177202 103209 65119 -124029 -139399 -16981 24888 -96843 -252591 -317469 -267724
17555b67724J16531m0708J19752j3580j56545k2278J60430K69087K45703n0559
17545C60109k19951o8168k5192n6512j54081R659J55933J67077M506J7171j29031
17534F1520O2567J03269K1711Q460k03037M6623J34695j27597k6666p3189M0578
17523D8934p5587o7690k4266k51477j19800K45936J66711j50331j8908l9387J00445
17512a85420R9386l5496J3135K05436l7457n1871j08662J59204P2487j64128j48093
17501a81479Q7953R7545r1940o2176O7679M7365l6733l3013l7657n7758J99434
17490g80N6403m771J37245K3181k6451j27054n5952j95712O8273J60414J91819
17479B26615J61468j109p6601r4547n2783m1923N7271p3177p2092j38570J67608
$$ plain form
17555 -267724 -151193 -191901 -72149 -85729 -242274 -264552 -104122 164965 410668 360109
17545 360109 140158 71990 46798 -9714 -163795 -154136 1797 168874 173380 190551 61520
17534 61520 124087 227356 249067 257527 54490 101113 235808 108211 81545 8356 48934
17523 48934 -26653 -94343 -118609 -370086 -489886 -243950 -77239 -227570 -246478 -285865 -185420
17512 -185420 -86034 -121530 -108395 97041 59584 7713 -100949 58255 130742 -33386 -181479
17501 -181479 -93526 4019 -87921 -150097 -82418 -35053 -71786 -104799 -142456 -200214 -780
17490 -780 55623 50852 188097 211278 184827 57773 1821 -193891 -125618 34796 226615
17479 226615 388083 386974 310373 215826 163043 121120 178391 105214 33122 -105448 62160
17468F2160J04072k33097k30465j1484J17597L1357K5114R4093L7803K1175j768
17457A6557o6431K1143J10138m3823Q5576J28560L6676k74576j29013J53415P6482
17446A14704j15492K3933m3960O3198L20449J51551N08008N29703M3578m49002
17436A146670k30855l06722j08001j11413p1007r4303k02835n4837L4816J53767
17426A55280Q6889m6497l6647q311q4185k9005p0549j09281L1449L5850R207j30253
17414a96053p349l3556J41000K75745q7311j41160L12471M3218q1818p5591o0755
17403H8841k26700j72283k152j5278K72235k9456m8020R8241J03099p6240L1555
17392B3842L5597j70109o1242O092l9424j30570m1926k3784J1473J61813J40600
$$ plain form
17468 62160 166232 -66865 -297330 -308814 -191217 -159860 -134746 -40653 -2850 18325 16557
17457 16557 -49874 -28731 81407 37584 123160 251720 288396 13820 -115193 38222 114704
17446 114704 -788 23145 -20815 42383 362832 514383 1022391 1552094 1595672 1146670
17436 1146670 915815 609093 501092 389679 318672 224369 21534 -33303 1513 155280
17426 155280 242169 195672 159025 150714 66529 37524 -33025 -142306 -110857 -75007 -65800 -196053
17414 -196053 -203402 -236958 -95958 179787 92476 -48684 263787 307005 225187 149596 88841
17403 88841 -137859 -310142 -312294 -327572 -55337 -84793 -132813 -34572 68527 -7713 23842
17392 23842 59439 -110670 -171912 -165820 -205244 -335814 -377740 -401524 -390051 -228238 -87638
17381h7638l0229J4947j856l586k4050J01208K4933q3705J59514N9529P0796P3539
17369B73402m1690j74867K8106J34153j10831n5034j26268n2052O0081M285l134
17358f3849j7495j24065J42981P9167n7120J09502l3696m4792J41778J46517j6869
17347B62059n5580j43184m0904L0676o112j7444k0131Q526Q1326K4346p4612M6225
17335I5191Q8104p2601m6219Q8050k3229k45576n3682j4398p4834K27747J9399
17324a2048L7164r9649O0917L25189R1620n4701k6919P3333q1222k64525k04860
17313a55701l4210J68949L2182p7804K7405J10731L9906N1780j70648j45301J41839
17302a0872l9290j00505j69924J6517J82971P8268Q8396r5784p8443Q4246J83077
$$ plain form
17381 -87638 -117867 -102920 -104776 -108362 -132412 -31204 -6271 -89976 69538 129067 199863 273402
17369 273402 231712 56845 84951 219104 108273 53239 -73029 -125081 -65000 -60715 -63849
17358 -63849 -81344 -205409 -62428 16739 -40381 69121 35425 -9367 132411 278928 262059
17347 262059 206479 63295 22391 53067 46955 29511 9380 17906 99232 123578 48966 95191
17335 95191 183295 110694 64475 152525 129296 -116280 -169962 -184360 -259194 -31447 -12048
17324 -12048 25116 -74533 -13616 311573 403193 348492 321573 394906 313684 49159 -155701
17313 -155701 -189911 -20962 11220 -66584 -39179 71552 111458 163238 -7410 -152711 -10872
17302 -10872 -50162 -150667 -320591 -304074 -121103 -42835 45561 -50223 -128666 -44420 138657
17291A38657K71283n1781j36202j60923M0267n5119r4397k0986j81578j34658
17281c85437L6779K88K4873J78663K00293K967k3616q0509j64967m2504L7394
17270b15776J68952O1400j03696J92531J80912q4006o2289j68844l8834K00102
17260A30452j234j32429j0839R2288J29792K04869j54312k70032j66897O9190
17250a09152k3714J16052l7894p2703k5316j11337j52948J39527J64822Q4779
17240b7884N270J38735J4872l6721Q6866J54326O7910r2109o5906k57300r1083
17229a03024J02438J04404L1679j70785j29557J11227J07471P2019J34581n4907
17219B05546p8032N0091J16073L1798j21743r7884r622j83723j88497j10864K25478
$$ plain form
17291 138657 409940 358159 221957 61034 101301 46182 -48215 -69201 -250779 -385437
17281 -385437 -348658 -348370 -323497 -144834 55459 58426 34810 -45699 -210666 -253170 -215776
17270 -215776 -46824 14576 -89120 103411 284323 200317 138028 -30816 -69650 130452
17260 130452 129218 -3211 -14050 78238 208030 412899 258587 -11445 -178342 -109152
17250 -109152 -132866 -16814 -54708 -127411 -152727 -264064 -417012 -277485 -112663 -27884
17240 -27884 -22614 116121 130993 94272 181138 335464 403374 311265 245359 -11941 -103024
17229 -103024 -586 103818 135497 -35288 -164845 -53618 53853 125872 260453 205546
17219 205546 127514 177605 293678 325476 203733 105849 96227 -87496 -275993 -386857 -161379
17208a61379P1362J38909o2301j0854L1536J30239J36979j47674j9273j52272
17198d4728j26563j09263J54709P6703O7101n4718j25291k37500J71272J26107
17188a02171j08694j14379K17331K10689l7604p6253P9722l197j46587p014r813
17177i7970N7274j35543m9741k88N9176j92884R04J23940J38312j6018J5436k8859
17165a26261m1166q6169J75395J47861M581j72209j30683n4705J10055J00471
17155g2830J09812j05785r2464j3265K02794m6767q3304m4678M4583j56931k9803
17144b88638K211K03787Q9153k51622j5114K00818j5772r5702p2269O3127J27200
17133e2821M1712m6122n890j7170M5197J01102m6985l0218j13852P7333k9523
$$ plain form
17208 -161379 -90017 48892 -13409 -24263 7273 137512 274491 126817 107544 -44728
17198 -44728 -171291 -280554 -125845 -49142 17959 -36759 -162050 -399550 -228278 -102171
17188 -102171 -210865 -325244 -107913 102776 65172 -11081 68641 65444 -81143 -88157 -97970
17177 -97970 -40696 -176239 -225980 -226268 -167092 -359976 -359072 -235132 -96820 -112838 -97402 -126261
17165 -126261 -167427 -253596 -78201 69660 74241 -97968 -228651 -283356 -173301 -72830
17155 -72830 36982 -68803 -161267 -174532 28262 -18505 -101809 -146487 -101904 -258835 -288638
17144 -288638 -286427 -82640 6513 -245109 -260223 -59405 -75177 -170879 -243148 -180021 -52821
17133 -52821 -11109 -57231 -63121 -80291 -35094 66008 19023 -11195 -125047 -47714 -77237
17122g7237J0386J9619m8524j7638Q2586O6283O7318J11298J04465j24174k01612
17111g230p8957L2519J05063n155N8882R8143p8083J3472N9913L4422k22625p8397
17099f8033r3870K231N2519K14775p7370j74192O8304J33837K2482k99063j16334
17088c34714m1525l0933K14862J13701K20117P0842j16791n2334M2736N5400J34505
17077B75866j0033k86202N9504K21453l6376j30485q2174P997j5493Q2857k5807
17066F1107r7836R3164P9981M2302n6542q274j14138j85216J03453J75192j69290
17055g6097j30961J9668J80907R0656Q8801o4422l5414j66977K4951R1631P9525
17044A02268q6511L9101n8425j22937J4540K48569k13049O4472J15465o7164j08618
$$ plain form
17122 -77237 -66851 -47232 -95756 -113394 -30808 35475 102793 214091 318556 194382 -7230
17111 -7230 -86187 -53668 51395 46240 105122 203265 125182 138654 198567 232989 10364 -68033
17099 -68033 -161903 -159672 -107153 107622 30252 -143940 -75636 58201 80683 -218380 -334714
17088 -334714 -376239 -407172 -192310 -78609 141508 212350 95559 43225 85961 141361 275866
17077 275866 265833 -20369 39135 260588 224212 93727 11553 19550 4057 86914 61107
17066 61107 -36729 56435 136416 178718 122176 113902 -236 -185452 -81999 93193 -76097
17055 -76097 -207058 -187390 -6483 84173 172974 108552 73138 -93839 -68888 22743 102268
17044 102268 15757 54858 -3567 -126504 -111964 136605 -76444 -11972 103493 36329 -72289
17033g2289j56054Q4085J86656J14820O0023n852m799k7640o9744O5084k2338
17022A51952K059j77367M9628L4934J20471q6908k44082m0944J54186l9801j11347
17011a87219O4692j1470l4688K8550N3262r331Q1562N3675L91j7143J78577J08298
16999C09156K65569Q6754r3387K3303j39077o2383O497n2074Q7148M14548O73630
16988A519684J264181J851775K311572J264774p05126j964913k076471j270920
16980B194556p10403l95591j63173l50900k04766J5651L5346j10832j89848k8651
16970I1389k34373m8012R6194P7239N6754j33308n5807j1542m9554J57318J13598
16959E9896L6191N1659L6815j53947j05694J09072K36767k8837k26062j23112
$$ plain form
17033 -72289 -228343 -144258 42398 157218 217241 211389 206590 178950 109206 174290 151952
17022 151952 154011 -23356 26272 61206 181677 94769 -149313 -190257 -36071 -75872 -187219
17011 -187219 -122527 -133997 -168685 -140135 -86873 -96204 -14642 39033 39424 22281 200858 309156
16999 309156 574725 661479 568092 591395 452318 389935 396432 344358 431506 846054 1519684
16988 1519684 2783865 4635640 6947212 8211986 7506860 5541947 3465476 2194556
16980 2194556 1484153 1088562 925389 574489 369723 385374 420720 309888 120040 91389
16970 91389 -142984 -190996 -94802 -17563 39191 -94117 -149924 -161466 -211020 -53702 59896
16959 59896 96087 147746 184561 30614 -75080 33992 270759 241922 15860 -107252
16949a07252o2580J57878J27275M0913R408k445j24353k9331P0333n5062l8147
16938a3363M5475n5666K2457J21525L0647j57643L8441R668Q805m832l3270l5994
16926b3750J1863K056O4305m8571r0886O1698n0479J9809N9832K13854P048j2288
16914B14491m448R4447O4364k21222K6111o2976j16299k1994m6752n3647N8906
16903f9019j70135l012J37684K317j65957j05110J52100O140Q0737J73941M6284
16892H5970l43840j70077K43328K65728q3282N8155O8959j50568j98451M3935
16882a80143J15836r6801k8675L8675Q5876J49137L0753n5275m6575N6816L0715
16871A00339m6945K2652m6297J7189J54800m2084j99227r2625l5277m1993L7585
$$ plain form
16949 -107252 -169832 -11954 115321 156234 165642 163197 38844 9513 79846 24784 -13363
16938 -13363 32112 -23554 -1097 120428 151075 -6568 31873 41541 50346 45514 12244 -23750
16926 -23750 -11887 -9831 54474 5903 -84983 -23285 -73764 -53955 5877 219731 226779 214491
16914 214491 210043 304490 368854 147632 173743 110767 -5532 -27526 -74278 -127925 -69019
16903 -69019 -239154 -242166 -104482 -102165 -268122 -373232 -221132 -214992 -134255 39686 85970
16892 85970 -257870 -427947 -184619 81109 -2173 55982 124941 -25627 -224078 -180143
16882 -180143 -64307 -161108 -189783 -151108 -65232 83905 114658 59383 12808 69624 100339
16871 100339 53394 76046 29749 46938 201738 159654 -39573 -132198 -167475 -209468 -171883
16860a71883J3151M848Q7829J34810J12346o8626l4048j56729M4952r4314k5787
16849a53451p3341O6119J14231M3173j38349j12649k365R1880N3209k34913j97860
16838e44316J74435K76160L08827Q323M8754Q2281j56371n4421j06886n1429l8157
16827e2800J15619J5681n1167N9182r5309L3027n5163j57368l890Q6167J76600
16816G0579n103Q9845M6186q7555j54603j25520r9117L01600j933Q04r1727j45529
16804b02073j25898O582j23410j78612K82518J68854R2929J22562K0915j24750
16794f0383o1017K5651n2860O0181J82145k16j58285K6008l4679J8427q0704L0807
16782a04925r6882j2519J15251J26406J584Q3419k6346j00964J2973j26688K6036
$$ plain form
16860 -171883 -158732 -153884 -66055 68755 181101 112475 78427 -78302 -33350 -127664 -153451
16849 -153451 -226792 -160673 -46442 -3269 -141618 -254267 -256632 -164752 -111543 -346456 -544316
16838 -544316 -369881 -93721 215106 223429 272183 354464 198093 143672 36786 -14643 -52800
16827 -52800 62819 78500 27333 86515 -8794 24233 -30930 -188298 -192188 -106021 70579
16816 70579 65476 155321 201507 113952 -40651 -166171 -265288 36312 34379 35183 -56544 -202073
16804 -202073 -327971 -321389 -444799 -623411 -340893 -172039 -79110 43452 64367 -60383
16794 -60383 -121400 -95749 -148609 -88428 93717 93501 -64784 -38776 -73455 -55028 -135732 -104925
16782 -104925 -201807 -214326 -99075 27331 28915 112334 85988 -14976 -2003 -128691 -102655
16771a02655L560P9909k526K5694R9098j4223p3126r4725J29994K7316k41489
16760a63173J03981J32176j23683J7004k6175j05824L2954J16005K3819Q9429
16750I6513j96164j71517J11327M0908j3252o7667o0940J15277J41897K61257
16740B57639L8510j86308J585N9097Q7892O6555j88605m950m8193j16799m6478
16729h0055j30093l7762K73982O8057K7935j92446r3756r5820K00127J99261P1937
16718B11367q8605r618j3367M6235K39577P3270o2673j16594r1175O4333o0664
16707A92086j66734j6098P1673J25955j46909k00060L0788n598n7135J90804O8508
16696H7280j50679P7893p9474n9327n3757m7874m2574o095L6029J60691N2345
$$ plain form
16771 -102655 -99095 -19186 -21712 3982 103080 88857 15731 -78994 51000 78316 -163173
16760 -163173 -59192 72984 -50699 -33695 -59870 -165694 -132740 -16735 7084 96513
16750 96513 -99651 -271168 -159841 -118933 -132185 -199852 -260792 -145515 -3618 257639
16740 257639 296149 109841 111426 170523 258415 324970 136365 131415 83222 -33577 -80055
16729 -80055 -210148 -247910 26072 94129 122064 -70382 -164138 -259958 -59831 139430 211367
16718 211367 122762 113144 99777 146012 385589 458859 396186 279592 188417 252750 192086
16707 192086 25352 9254 80927 206882 59973 -140087 -109299 -114897 -172032 18772 87280
16696 87280 -63399 14494 -64980 -124307 -178064 -225938 -268512 -274607 -238578 -77887 -25542
16685b5542j00032l8221J39254J21556R6966n5807j1352r716p8513j5548j10177
16674h7132K6040j78O4851O5650K3649j24226J10192j15985q9350O7278k8210
16663h7421K5952o1787P8372j30473O0107k9086k7940P3295l07R7116N8887o2658
16651e943n3332o2948J08287O6472P2156k4985j38751j7539n2882P8410J68732
16640A37677n9813J1223k18143k25516r113L89552R0806j26811j14657J0430j81002
16629b95367P251J96873L4627j78025n9940N6999P457J2767O4813J53335J99734
16618B00524J79926K385J41315j79118j88147j80554K8035n3027o6197m8719k07486
16607c71063J48416n1878K29647J39987O8875R4219Q1104j17578j50277p7137
$$ plain form
16685 -25542 -125574 -163795 -24541 97015 193981 138174 126822 117106 38593 23045 -87132
16674 -87132 -61092 -61270 3581 69231 92880 -31346 78846 -37139 -126489 -59211 -87421
16663 -87421 -61469 -123256 -44884 -175357 -115250 -144336 -172276 -98981 -99288 -2172 56715 -5943
16651 -5943 -59275 -122223 -13936 52536 124692 99707 -39044 -56583 -109465 -31055 137677
16640 137677 77864 89087 -129056 -354572 -363685 25867 116673 -10138 -124795 -114365 -295367
16629 -295367 -288116 -91243 -56616 -234641 -294581 -237582 -230125 -217358 -152545 790 200524
16618 200524 380450 382835 524150 345032 156885 -23669 4366 -48661 -114858 -163577 -371063
16607 -371063 -222647 -274525 -44878 95109 163984 258203 339307 221729 71452 -5685
16597e685n6562M7201N2724K5960J36412j47919j56673P221m9525j26185R5329
16586a77702K04664K8201P8889j32775J885K608k9028M0016L9476o7631L0603
16575A9206N5209M8495p8281k4603J2506j46269k42458M7382M06468p4737Q3099
16564A06017m4399M2572m5032Q7490L8514P459n9709k5578M3195m4268k03102
16553i6841j8063M5072M7072j3562J7968M2279q6774j62055j48294P3329k8092
16542c27961R5175Q4287N8853J7061q0973P3910R5177J02009J03910n9093J9187
16531A81542J09948k26125k97626j22236r8540J29427J07919O7420R0296j25258
16521a83233n5565L9103j1190j9911o9210n679l2730P236K1757j45082j53852
$$ plain form
16597 -5685 -62247 -15046 37678 63638 200050 52131 -104542 -97321 -146846 -273031 -177702
16586 -177702 26962 55163 134052 1277 3162 5770 -23258 16758 56234 -11397 19206
16575 19206 74415 122910 44629 20026 32532 -113737 -356195 -308813 97655 22918 106017
16564 106017 61618 104190 59158 146648 185162 192621 132912 107334 150529 106261 -96841
16553 -96841 -114904 -69832 -22760 -36322 -18354 23925 -62849 -224904 -373198 -299869 -327961
16542 -327961 -232786 -148499 -89646 -72585 -153558 -79648 15529 117538 221448 162355 181542
16531 181542 291490 65365 -232261 -354497 -453037 -323610 -215691 -148271 -57975 -183233
16521 -183233 -238798 -199695 -210885 -230796 -300006 -305685 -338415 -331179 -309422 -454504 -608356
16510f08356J67712K37804K745p28M1858P6657o5019m5054R7723k615k43000q6340
16498d26613M6123K1548l607K5542J28238P3136J21247j13960L6465J79351J43347
16487B30817r6998j62777j19580O6900q0924o599m8015m4525J99255J49961K18971
16476C06486k5819l16215o5722k13778j30713L9017J65471J48243J079j31539
16466b23490n0763J41912K9934j55537L2035Q1489J22037j268l2751J7908J17807
16455G9313j56122k7177k0408L16658J34788j62445j24226q2525P0848N4436j06744
16444b3604n9382R0922J45298j72153m340Q0361O2394l6825j32493p669O1479
16433C988M4253P6288j23143L5430n3694L0838q6140N0351M6446j4402p3435n0738
$$ plain form
16510 -608356 -440644 -202840 -200095 -200823 -158965 -82308 -147327 -192381 -94658 -97273 -340273 -426613
16498 -426613 -380490 -358942 -362549 -337007 -208769 -135633 -14386 -128346 -91881 87470 230817
16487 230817 133819 -28958 -148538 -81638 -162562 -169161 -217176 -261701 -62446 87515 306486
16476 306486 280667 -35548 -101270 -315048 -445761 -406744 -241273 -93030 -91951 -223490
16466 -223490 -274253 -132341 -102407 -257944 -225909 -144420 -22383 -23651 -56402 -38494 79313
16455 79313 -76809 -103986 -124394 192264 327052 164607 40381 -42144 28704 83140 -23604
16444 -23604 -82986 7936 153234 -18919 -23259 57102 119496 82671 -49822 -57491 3988
16433 3988 48241 124529 1386 36816 -16878 13960 -72180 -21829 24617 10215 -63220 -113958
16421a13958K01916N4459n67Q974O1786m8213l3954n4201j10295k5177P8438J6715
16409C5923q6198N3663J66786J58883j13476M889L5933j07865k910j91691K7015
16398a9048n3930j69607L2625K79986J67274M9306r8951p9133r2275P0347N9649
16387A46243m7420m634Q4715J3568m2763l2535L680O4948J5435M4861J6621k00382
16375F2337N6035K14798O4545k4544n2285k85576l27848j0022J3498l6480Q7433
16364b38109K19890P1813o8236n6823K30022r7490j82435J24567J72640O7767
16354B43606j2896j19692j31640l02375k54518O6803J11291J16369K10998R2875
16344B0821Q6555k1791j37917J8922q3217k6215K03592r482R7010L5321p7815
$$ plain form
16421 -113958 87958 142417 141850 150824 212610 164397 130443 76242 -34053 -59230 19208 35923
16409 35923 -50275 3388 170174 329057 215581 220470 256403 148538 145628 -46063 -19048
16398 -19048 -72978 -242585 -209960 70026 237300 286606 187655 108522 16247 86594 146243
16387 146243 98823 94189 178904 192472 149709 117174 120854 185802 201237 246098 262719 62337
16375 62337 118372 333170 397715 373171 320886 35310 -292538 -302560 -289062 -325542 -238109
16364 -238109 -18219 53594 -14642 -71465 158557 61067 -121368 3199 175839 243606
16354 243606 230710 111018 -20622 -322997 -577515 -510712 -399421 -283052 -72054 20821
16344 20821 107376 85585 -52332 -33410 -116627 -142842 60750 51268 148278 183599 105784
16333A05784l9096j83848n2459k0877p9746J50450L7965J3933m0776k11052m6713
16322c66435O2974J31476P9075J3512J00250q9532Q985J3932R0458K354j80410
16311a33361j2678O8229J48402l0651j46816Q5227K3957p2720K54532M8304p8957
16300A53468j50223j58072j71118N2295L0431k4121j34171K67579K86102J34286
16290B86456j22806q0435M9574O561j14779l4928q3094j5718R1529M960p9583
16279i2263J92137J11597J0965j66443Q0000l3787Q9441P688j16992O6747R923
16268A59013n7598n4938j36573K03J29380L1511p0437p5598k5223N0132R1621
16257D1493J8091J07703Q6075j24513q5313o3861q0149J22423q8665J1139Q8429
$$ plain form
16333 105784 66688 -117160 -169619 -190496 -270242 -119792 -81827 -67894 -108670 -319722 -366435
16322 -366435 -303461 -171985 -92910 -79398 20852 -68680 -59695 -45763 44695 47049 -133361
16311 -133361 -146039 -77810 70592 39941 -106875 -21648 2309 -70411 184121 232425 153468
16300 153468 3245 -154827 -325945 -273650 -243219 -267340 -401511 -133932 152170 286456
16290 286456 163650 83215 132789 139350 24571 -10357 -93451 -109169 -17640 -12680 -92263
16279 -92263 99874 211471 222436 55993 135993 102206 191647 199335 82343 149090 159013
16268 159013 101415 46477 -90096 -89893 39487 70998 561 -75037 -100260 -50128 41493
16257 41493 59584 167287 253362 128849 43536 -20325 -100474 21949 -66716 -55577 32852
16246C2852o6119j03690j90181R8440o4552l373J58924R7911M0562o565p9845
16235h5636j4680l9247r1772Q0277l710L5361J4262j7357M9163K1074J55089K1399
16223A24223j01050N5979M63k9107l9986J3768r1643n0098l9003L0769k5740L6098
16211a15327j77591j41260J23057L20507P4626j30360j37650L4753R9115j17204
16201a67334q621K5230J92554R0009j72623P9963L9558m9447k854k3040j57445
16190a54050J73301L8471k09922K017o3613K9189M8537N7711J8121O1064J25782
16179A26608k1219k18415k09630P3829K65586J04810j13951K0974n4599J45665
16169A19658Q0091J66801j60088j47942N1815j4121q0907j92063m8789K19043
$$ plain form
16246 32852 -33267 -136957 -327138 -228698 -293250 -296623 -137699 -39788 774 -5791 -85636
16235 -85636 -100316 -139563 -231335 -151058 -154768 -119407 -105145 -122502 -73339 -52265 102824 124223
16223 124223 23173 79152 79615 50508 10522 24290 -67353 -117451 -156454 -125685 -151425 -115327
16211 -115327 -292918 -434178 -311121 9386 84012 -46348 -183998 -149245 -50130 -167334
16201 -167334 -175955 -150725 41829 131838 -40785 39178 78736 29289 26435 3395 -154050
16190 -154050 19251 57722 -152200 -150183 -213796 -184607 -136070 -78359 -60238 826 126608
16179 126608 105389 -113026 -322656 -248827 16759 121569 7618 28592 -26007 119658
16169 119658 199749 366550 206462 58520 110335 96214 15307 -176756 -225545 -6502
16159f502K17688J08682o7278j38857q070n1738Q001k2552j99694q1062J11520
16148a29862L2664J12162J02682q2793j41773O4638J13226J83163r5588k32476
16138g3957m8251L61504J29172Q4932l2603o4326k46061n2683K67743O9411j13714
16127B81167o4362j5973j38718k4405o8716J6581M7966K1220j13892J2426P476
16116c9230J3785l3663Q3749l3096l8085j34528R791J09724O7965N9774n3169
16105A3017j21562n0592n029J47923O650j39048j0039M4613J13902J20048P6417
16094A96300O615k37970k1794J40273J68290j16982k16180n0623K8823r0178k0227
16083b13653J14073J60542N0920q3749L3410K0974j12470j0357P8409J5805o5145
$$ plain form
16159 -6502 211186 319868 252590 113733 105663 53925 61926 39374 -160320 -241382 -129862
16148 -129862 -97198 14964 117646 34853 -106920 -42282 70944 254107 158519 -73957
16138 -73957 -122208 239296 368468 453400 420797 356471 110410 57727 325470 394881 281167
16127 281167 216805 200832 62114 37709 -31007 -14426 33540 54760 -59132 -46706 -39230
16116 -39230 -25445 -59108 24641 -8455 -46540 -181068 -171277 -61553 6412 66186 13017
16105 13017 -108545 -159137 -164166 -16243 -9593 -148641 -158680 -114067 -165 119883 196300
16094 196300 202915 -35055 -56849 83424 251714 134732 -81448 -132071 -103248 -193426 -213653
16083 -213653 -99580 60962 111882 28133 61543 82517 -29953 -40310 38099 53904 -11241
16072a1241K9954J25169q0880k01396P0032P2152n3677J8050J30665R4401q4097
16061A09132n4239n971r7537j89646r8432l2783M9030N5494J72599J64648j59816
16050h7521M7316j1480j2535J96384O850P9147j73858j20618P7779R1576j43894
16039e0854j94724M1307O1139J20892K89649j13367k50627k0219j2964j32803
16029b62571J82839M5126Q8155m1636K0765L9587j97128j39713L8476J9482N2546
16018a54072K24138Q7915j59207j12666r5829r3242q4863P3821R0148K00571N2797
16007B9511K131p0312l5118J35937j26997L689O4813p8007j15244j07500N3371
15996b43726K32538O7646k30209j27678n5242J02650K27757R7285M0740o1843
$$ plain form
16072 -11241 18713 143882 63002 -138394 -68362 3790 -49887 -31837 98828 193229 109132
16061 109132 54893 48922 -48615 -238261 -336693 -369476 -320446 -264952 -92353 72295 -87521
16050 -87521 -40205 -51685 -64220 132164 139014 218161 44303 -76315 1464 93040 -50854
16039 -50854 -245578 -204271 -143132 -22240 267409 154042 -96585 -116804 -129768 -262571
16029 -262571 -79732 -34606 53549 11913 32678 72265 -124863 -264576 -226100 -206618 -154072
16018 -154072 70066 157981 -1226 -113892 -209721 -302963 -387826 -314005 -223857 -23286 29511
16007 29511 31642 -38670 -73788 62149 -64848 -61159 3654 -74353 -189597 -297097 -243726
15996 -243726 -11188 56458 -173751 -301429 -356671 -254021 -26264 71021 111761 49918
15986D9918j48153M2528l1039K0549M8202n7701J38365q6223j6082N08j00177
15975a39305J45916J03328j47422j52506m8041J49233J33396l4247j10345R4504
15965e489M2067K3132l9649r6007j60354q8943K3735J33197J11667n1896j00706
15954b09246N2208N0133M5534R886L3500R4857R7778j44295j15630K1595m3959
15943a07639n6513L1343K60935J5928o1729j14553o5700J06772O0213j46092J12142
15932C5107P9580q2356N43m0598K0609M7381L5261p8899n1501K284R5888L36017
15920C99316O6518j25990j62699r0968M5405o4118q6543M123Q0105M3207j52928
15909d4572o5705J2975l7702Q1014Q1149K6434L5099K1415J8895R3484N1209j68477
$$ plain form
15986 49918 -98235 -55707 -86746 -66197 -17995 -75696 62669 -23554 -39636 -39128 -139305
15975 -139305 6611 109939 -37483 -189989 -238030 -88797 44599 10352 -99993 -5489
15965 -5489 36578 59710 20061 -75946 -236300 -325243 -301508 -168311 -56644 -108540 -209246
15954 -209246 -157038 -106905 -61371 -51485 -17985 76872 174650 30355 -85275 -63680 -107639
15943 -107639 -164152 -132809 128126 144054 82325 -32228 -97928 8844 69057 -77035 35107
15932 35107 114687 32331 32874 -7724 12885 60266 95527 16628 -34873 -32589 63299 399316
15920 399316 465834 339844 177145 86177 131582 67464 -19079 -14956 65149 108356 -44572
15909 -44572 -110277 -97302 -135004 -53990 27159 53593 88692 110107 129002 222486 273695 105218
15897A05218k24800o1900l2611j18311J35603K76846M3973o6609O957J01009r9003
15886F6372K9324N7174L0451k43775r6272o2556n4719L3119J7436J78930Q0400
15875C5884O3432M8352n8926j22671p8287Q9658J29908L4385j20893m2965j24915
15864a47038N719J13810k0322j29409j02241K08467R8855O3774L0165k18838q8723
15853a85781p3321j37575J6600J01647J4002J58826R3048L6688j1259K2984o8327
15842c2468J11314J28895P9538n4931P764K629K3574j59100j57418L925m684L9405
15830a1557R088j27505O614J49113j79276r5476j47695Q4711P7857O7933M2025
15819a24168N5557M0314p0745O9884j1843N9416j0248n0206O1208q9725r6750
$$ plain form
15897 105218 -119582 -181482 -214093 -332404 -196801 80045 124018 57409 64366 165375 66372
15886 66372 95696 152870 183321 -60454 -156726 -219282 -274001 -240882 -223446 -44516 35884
15875 35884 99316 147668 88742 -33929 -112216 -22558 107350 141735 20842 -22123 -147038
15864 -147038 -141319 -27509 -47831 -177240 -279481 -71014 27841 91615 121780 -97058 -185781
15853 -185781 -259102 -396677 -380077 -278430 -264428 -105602 -12554 24134 12875 35859 -32468
15842 -32468 78846 207741 287279 232348 240112 242741 266315 107215 -50203 -46278 -50962 -11557
15830 -11557 -2469 -129974 -123360 25753 -153523 -248999 -396694 -311983 -234126 -166193 -124168
15819 -124168 -68611 -28297 -99042 -29158 -41001 18415 8167 -42039 19169 -70556 -167306
15808a67306Q7608q1230q6013L1657K7770K28836O2769j10624j10057p3358k65656
15797d55604M8320J49267J24670M5934L9241J15753L2652J22404o9253P0318o0614
15786A63088P1918j49009o1483K5216J33368j9015k08210J13384R6492n3869J60644
15775B72524J37385j33091l02264r7048J07926Q5158K8080p0769q0160n6389l959
15764a12607p529P9919n6921o035K9764j11178p6803k3400J14667k1347j4473
15753b05943L7509m8615L5898N2259J8937R5991J564l2851l4735m424M7720J24645
15741H7955j4957j74267M5140o8167k6531n9029K6932L00293J59643k00703j01300
15730b4991j88888r1152J75589K12815j04451L4236O465j07138M3966K5207l8890
$$ plain form
15808 -167306 -79698 -160928 -246941 -215284 -187514 41322 104091 -6533 -116590 -189948 -455604
15797 -455604 -407284 -258017 -133347 -87413 -48172 67581 100233 222637 153384 223702 163088
15786 163088 235006 85997 24514 49730 183098 164083 -44127 69257 165749 111880 272524
15775 272524 409909 276818 -25446 -122494 -14568 70590 98670 27901 -52259 -108648 -112607
15764 -112607 -120136 -40217 -97138 -103173 -73409 -184587 -261390 -284790 -170123 -191470 -205943
15753 -205943 -168434 -217049 -181151 -128892 -109955 -13964 -12400 -45251 -79986 -84410 -36690 87955
15741 87955 72998 -101269 -56129 -124296 -150827 -209856 -182924 117369 277012 76309 -24991
15730 -24991 -213879 -305031 -129442 83373 -21078 13158 19623 -87515 -43549 -18342 -57232
15719e7232j08704n036J15336o597j42844Q873N3959q5426j99349J90600N0317
15708a86103L5801k8027M215p290O010J20365J23845M8894p509j59134j46553
15697a95486J020O1199J689r0834J77606J45446j52439q6910J64126J54861k3914
15686A56364j21455L0504k4904Q0345n8577o1853n3105K0020j0885J33803P6666
15675A66923r1545j3827p9492j88904O4951J41527J42207k04525j04258J68119
15665A176L1904p048M1259r7591j63807p0406J76861j58804M9694L2823j0853
15654a74792Q6975P2959J09279n6643j3762J84632l2380k00873j7567J19686J1735
15643H9249K0336j45922j21869l1645J92408k6319N2333N7545L1508o0390j76364
$$ plain form
15719 -57232 -165936 -170972 -55636 -62233 -205077 -196204 -142245 -227671 -427020 -236420 -186103
15708 -186103 -150302 -178329 -174114 -181404 -175394 -55029 68816 117710 110201 -48933 -195486
15697 -195486 -194466 -133267 -131578 -222412 -44806 100640 -51799 -138709 25417 180278 156364
15686 156364 34909 65413 40509 120854 62277 424 -52681 -32661 -43546 90257 166923
15675 166923 75378 61551 -17941 -206845 -141894 -367 141840 -62685 -166943 1176
15665 1176 33080 26032 67291 -30300 -194107 -264513 -87652 -246456 -196762 -163939 -174792
15654 -174792 -87817 -14858 94421 37778 24016 208648 176268 -24605 -42172 77514 89249
15643 89249 109585 -36337 -158206 -189851 2557 -23762 28571 86116 117624 57234 -119130
15632a19130M4251J62610n0381q0298J7847J00029j68904j64618Q7197O2022r6714
15621b06089N3798M6759J11169J3432J61808O6483O5891m1067k25139P710Q6754
15610A41509l9650j74393n3228K3671N2401J7993q1723r7035k1209J79927N6184
15599D447j39583q7497M6713J17763O3647j16985O376K1156N2629n872k7227r4356
15587a58789k43213p4215R9499J69825K03250k5189q5301K44761q9813r3183k1926
15576g4294K08798k9772k3085j21928K6533N1787o3404M3931P8519L895l720j34521
15564c7261q2463n8712l2158J47815J06161Q7738n1596k46969K0509j8572M1575
15553a23933J41330P7479j45896r9305P598n7707l0583K6503J26479l7829L2271
$$ plain form
15632 -119130 -74879 87731 37350 -42948 -25101 74928 -93976 -258594 -171397 -109375 -206089
15621 -206089 -152291 -105532 5637 19069 180877 247360 313251 272184 47045 54755 141509
15610 141509 101859 -72534 -125762 -102091 -49690 -31697 -113420 -210455 -231664 -51737 4447
15599 4447 -135136 -222633 -175920 -58157 5490 -111495 -105119 -83963 -31334 -37206 -64433 -158789
15587 -158789 -402002 -476217 -376718 -206893 -3643 -28832 -114133 130628 40815 -52368 -74294
15576 -74294 134504 104732 81647 -40281 -13748 38039 -25365 18566 97085 100980 97260 -37261
15564 -37261 -119724 -178436 -210594 -62779 43382 131120 79524 -167445 -146936 -165508 -123933
15553 -123933 17397 94876 -51020 -150325 -142727 -200434 -231017 -204514 -78035 -115864 -83593
15542h3593M0659Q2697n0202J02m883j130k1078o8403N1477N968O7371M6388O1770
15529A27143N6459k7903K9800r3690R4624k094j03948o2181J30094J99365p5163
15518B72506o9089o5559j07894N9417O6426J8496Q1582m5595j48388j826k7661
15507C2415j62046j67636J15629R8796l9975J2670l319O1687J13915J14356P739
15496A84231m2338q3288J17888q6202n4483j4810K9834j50064p4339K4424K4560
15485a24587j42844O9757L26566O2851j63117q2991l0163J93215j49104n0660
15475i1077N6382k1995M8548m7476k4453J90649O5685n3850r18j50930j84163
15464b13598R1970l7675J537L4996Q5077J94942K24758r7158m0533N5968O9665
$$ plain form
15542 -83593 -42934 39763 -10439 -10337 -15220 -16350 -37428 -105831 -54354 -48386 18985 65373 127143
15529 127143 183602 155699 185499 91809 186433 184339 80391 18210 148304 347669 272506
15518 272506 203417 137858 29964 89381 155807 174303 255885 210290 61902 60076 32415
15507 32415 -129631 -297267 -181638 -82842 -122817 -110147 -113466 -51779 62136 176492 184231
15496 184231 141893 58605 176493 90291 35808 20998 50832 -99232 -173571 -149147 -124587
15485 -124587 -267431 -197674 128892 191743 28626 -54365 -84528 108687 -40417 -91077
15475 -91077 -34695 -56690 -8142 -55618 -80071 110578 176263 122413 121495 -29435 -213598
15464 -213598 -121628 -159303 -157766 -122770 -37693 157249 382007 284849 244316 300284 369949
15453C69949m9255j35899q5182L199l6781M9305J30734p956j13006j56706k06524
15442b38122k24579l2001J27858J21591J83033R6835p5349L010j22994p0824J24054
15431a07488Q2529l4013J45934K27188l4177k96349p8667K28011j3248J0026J7752
15420A47498j10375l27417m7585J31670J58683K14578k9334l9978R7797q9927
15410A05610k11059j04519J21974J34917k6442R6035R1342q083K0065Q6527r336
15399B97031l18352j14663q6711p813j09229J47486Q8036J5381j6653J39469n1820
15388a7838j3909R2470K0869r7964j32251L030O8899l0033L3627j21156k7274
15377b21530J42333J67582P6094o5048o3900J8472R4771m5056j04190j09265M3471
$$ plain form
15453 369949 320694 184795 99613 102812 66031 115336 246070 238114 125108 -31598 -238122
15442 -238122 -462701 -494702 -366844 -245253 -62220 34615 -40734 -37724 -160718 -231542 -107488
15431 -107488 -24959 -58972 86962 314150 279973 -16376 -95043 132968 119720 129746 147498
15420 147498 37123 -290294 -337879 -206209 -47526 167052 137718 97740 195537 105610
15410 105610 -105449 -209968 -87994 46923 20481 116516 207858 199775 219840 306367 297031
15399 297031 -21321 -135984 -222695 -230508 -339737 -192251 -104215 -88834 -105487 33982 -17838
15388 -17838 -31747 60723 81592 -16372 -148623 -145593 -76694 -106727 -73100 -194256 -221530
15377 -221530 -79197 88385 164479 99431 35531 54003 148774 103718 -472 -109737 -66266
15366f6266K14970j05455k64575n5053J16643J20037O6994R8434M3676l2418j29845
15355G142o5912N715J14713N5720K8041J28416O7812k67480j96740q2038o387
15344b10998J91341k6982J22459j26274j13545O9072K1444J98013Q4057o6200
15334A42387j87953o5219J07899J731q056K1536q7203N9636Q844j68642J38080
15323c6960J16779j86665j5293J21728P6026O5070j02123M801n2555M0634L1896
15312F3338l6262K8204n5334k50505k146K07416J16029J10920K8290O6485j87382
15301H9053k39546J85068M5517m2911K7308K3107j15328n7335n3088p9704J88874
15290b8985J12099n4577j47852J05428K01766L9079J7487j82202q0565N0323r91
$$ plain form
15366 -66266 148704 43249 -221326 -276379 -159736 -39699 27295 125729 169405 136987 7142
15355 7142 -58770 -53055 61658 117378 145419 273835 341647 74167 -122573 -204611 -210998
15344 -210998 -19657 -46639 75820 -50454 -163999 -94927 -73483 124530 208587 142387
15334 142387 -45566 -110785 -2886 -1155 -9211 12325 -74878 -15242 -6398 -175040 -36960
15323 -36960 79819 -106846 -122139 -411 75615 140685 38562 43363 -9192 31442 63338
15312 63338 27076 55280 -54 -250559 -252705 -45289 70740 181660 209950 276435 89053
15301 89053 -150493 34575 80092 37181 64489 87596 -27732 -85067 -138155 -217859 -28985
15290 -28985 83114 28537 -119315 -13887 187879 226958 244445 62243 -18322 32001 31010
15279C1010Q2068J10926J1903k82211n0049j5736O556m2121j03204J31708R4256
15268b4894Q938q1944k7026J60033p1048K1478Q8962j57244l8584K82718j2251
15257A49138k5359k7166r4722J88371l7943p6657j37145J43899l0854k41337N7654
15246a32121J32474l8706q1399n7484r5828J92987M4853q0013K6729L105j69440
15235b54843J8239K27593J61778J08949j39352k23927j18373r6623J10385K31056
15225B4882m4885p884K5038O0587q2516N1859o600L4509q5166O9460K4884j71416
15213a07248o516K46939K3978K8061K59510j27407l3171r4487m686l1009l0733
15202A23231K7359P0684l2959j12642j72417L6396N5631P502r3421Q6077j55998
$$ plain form
15279 31010 113078 224004 235907 -46304 -96353 -112089 -105533 -147654 -250858 -119150 -24894
15268 -24894 -15956 -97900 -124926 35107 -35941 -14463 74499 -82745 -121329 161389 149138
15257 149138 123779 96613 1891 190262 152319 75662 -61483 82416 51562 -189775 -132121
15246 -132121 353 -38353 -119752 -177236 -273064 -80077 -35224 -115237 -88508 -85403 -254843
15235 -254843 -236604 -9011 152767 261716 122364 -101563 -219936 -316559 -206174 24882
15225 24882 -20003 -27887 -2849 57738 -24778 27081 20481 54990 -30176 39284 64168 -107248
15213 -107248 -113764 133175 157153 185214 444724 317317 284146 189659 184973 153964 123231
15202 123231 150590 221274 188315 75673 -96744 -60348 -4717 2785 -90636 -4559 -160557
15191a60557M848K8544j45921J16558J60668R5641o0811l7373k5433J11373j32760
15180d5223r6372n2864j0911L5905J34297J91308J33207k28999o1413j04752L168
15169a02649L15244J64828j92911j31027j4950O4131p5642K4008m5951J19690
15159A24771j9601n4802P3907n2230j09783Q1498L8852n8910J9980m0281j67918
15148a64517j23024O8862J33825n1911r8589n4677O0610P0837O1877m5836J08514
15137c4029m1499j94946J06204q2442J97621Q5297n7223j09214q166O8440m6764
15126a16721o0163R5159J04275M4702j01134J0106R3113J03774j72548l0028J31216
15115A01751P0519j08802j34873Q2927l7104n1149j49298j8023J75697J47062
$$ plain form
15191 -160557 -155709 -127165 -273086 -156528 4140 99781 38970 1597 -23836 87537 -45223
15180 -45223 -141595 -194459 -205370 -169465 -35168 156140 289347 60348 -1065 -105817 -102649
15169 -102649 212595 377423 184512 53485 38535 102666 27024 51032 5081 124771
15159 124771 105170 50368 124275 72045 -37738 43760 82612 23702 43682 3401 -164517
15148 -164517 -287541 -218679 -84854 -136765 -235354 -290031 -229421 -158584 -96707 -142543 -34029
15137 -34029 -75528 -270474 -164270 -246712 -49091 36206 -21017 -130231 -138397 -69957 -116721
15126 -116721 -176884 -81725 22550 67252 -33882 -23776 69337 173111 563 -29465 101751
15115 101751 172270 63468 -71405 11522 -25582 -76731 -226029 -244052 -68355 78707
15105G8707P4256o4282r767j06634j77920O2591J10963j678n6069J66023k4419
15094E1771K0397J47232J0551r5598r6336j07591p9262j4083J45820J96356P0074
15083B49331j05107l6924j38801l3033J52822o9729r0558k615L3890P9064Q6415
15072A24755j55775r460K5033k0571L4719J4951O031l4841J7025P5752N3386j90650
15060e9645m5969R2318j3257J6895j03694K9036J04777l7567M3719K4971n3307
15049a723n9479j25281k98997O9587J82714O2138K12043P8224p2175k8305N3776
15038G2522J45626Q7770j68542R3811q3018q8195K0876j24201q6906J567Q389
15027a20301M1183K1459Q1200Q5467j9027l0679j21634L9400J51104J55727J50142
$$ plain form
15105 78707 152963 88681 78914 -27720 -205640 -143049 -32086 -33764 -89833 76190 51771
15094 51771 72168 219400 229951 134353 38017 -69574 -148836 -162919 -17099 179257 249331
15083 249331 144224 107300 -31501 -64534 88288 18559 -71999 -74614 -40724 38340 124755
15072 124755 -31020 -40480 -15447 -36018 -1299 13652 19683 -15158 1867 77619 131005 -59645
15060 -59645 -105614 -13296 -26553 -9658 -113352 -84316 20461 -17106 26613 51584 -1723
15049 -1723 -61202 -186483 -485480 -415893 -233179 -171041 41002 119226 47051 18746 72522
15038 72522 218148 305918 137376 231187 148169 59974 80850 -43351 -130257 -128690 -120301
15027 -120301 -79118 -57659 23541 109008 89981 59302 -62332 -22932 128172 283899 434041
15016D34041j01492k83111j60751p6531M7257j6564N4868K65306R465j34874r3535
15005e5921n3876J23464J22450O3259J12325J8149k33093j08136J31166l7771
14995H2016k2206o7338j925o5932m4209N6033K3496K4778R4669J05066j77538
14984F910k22987Q8335j8676p6250k11074J7843K66970J58933O0342o032p8870
14973a4556J18438k0680j41765j1457Q8881M6186M7561J91084j3147j73429r9259
14962A7857p0413o359L0234P5024l687J0346J17287J30003j28667n4682J23271
14951B40214p1982j65457N6087m2327n4014o8215R004j38788j17775J31628J24469
14940i7156R2195l6761N1913J8847j56562N1344O0585O0170k7460l0008p9309
$$ plain form
15016 434041 332549 49438 -111313 -187844 -140587 -157151 -102283 163023 172488 37614 -55921
15005 -55921 -109797 13667 136117 199376 311701 329850 96757 -11379 119787 82016
14995 82016 59810 -7528 -9453 -75385 -119594 -63561 -40065 -15287 79382 184448 6910
14984 6910 -216077 -127742 -146418 -222668 -433742 -415899 -148929 10004 70346 64314 -14556
14973 -14556 103882 83202 -58563 -70020 18861 65047 112608 303692 290545 117116 17857
14962 17857 -52556 -58915 -28681 46343 42656 53002 170289 300292 171625 116943 240214
14951 240214 168232 2775 58862 16535 -37479 -105694 -96690 -235478 -353253 -221625 -97156
14940 -97156 -4961 -41722 10191 29038 -127524 -76180 -15595 44575 17115 -12893 -92202
14929i2202j5574j34150J25600J37969J14396p2850j71405Q3217l8826o9009r3473
14918b26307j12890j07721J06156K29233Q5744J0123k4994l2586o5654P4151J80876
14907A16131J3907k09469j51318M4532J76589P5263J38959J45730j82018n7488
14897A10818q9114l6857P7885N5229j99826j95841m3934J15125L7427P8700k9634
14886a20022J01630N3582q9797k1775l4189r0017N6790j15418j73580O9010J14772
14875b49014N0140k1562O4313J38575j008J13359J2343k13204q2840Q8370L2013
14864f8515l5159j9901q8930Q5884p9269k37314j62053J0341J35670J15037L8575
14853c05634j2640L8737J34151J26417J76574o748n6278j33455n524j87928n6298
$$ plain form
14929 -92202 -107776 -241926 -116326 21643 136039 63189 -108216 -24999 -63825 -132834 -226307
14918 -226307 -339197 -446918 -340762 -111529 -25785 -15662 -40656 -73242 -138896 -64745 116131
14907 116131 130038 -79431 -230749 -186217 -9628 65635 204594 350324 168306 110818
14897 110818 21704 -15153 62732 117961 -81865 -277706 -321640 -206515 -169088 -90388 -120022
14886 -120022 -18392 35190 -54607 -76382 -110571 -200588 -143798 -259216 -432796 -363786 -249014
14875 -249014 -198874 -220436 -156123 -17548 -18556 94803 107146 -106058 -188898 -100528 -68515
14864 -68515 -103674 -123575 -212505 -126621 -205890 -443204 -605257 -594916 -459246 -344209 -305634
14853 -305634 -318274 -279537 -145386 -18969 157605 150857 94579 -38876 -44400 -232328 -288626
14842b88626J42336J16359n9774j0321J07027o7680j11190j0933M2186q809O0915
14831h8510R6884R855l6192k7901N183K7153k42895P5740J09439N2147R9329P5907
14819A56139n0970j24291j20546j3511P2154j875j00610j16702r0195n7630K51585
14808a96452J69128P3372j3160O1862r7503L335J30163r2770j45322K4057R8175
14797A4885j27765O6838J86325l6018k49696n414N2838J4884J259p7045M3669
14786a15240l2316J42507J48820O4740n1229l7290M9810M311J0027j33804j17865
14775f7529R98M3185O6111N0235Q8957q0413j27156k14285r931R3466O4517J01415
14763I570R0228J96251m7542M4899R0864r2508j35971j30781r8328O0617l8865
$$ plain form
14842 -288626 -146290 -29931 -89705 -100026 7001 -60679 -171869 -182802 -140616 -149425 -88510
14831 -88510 8374 18229 -17963 -45864 -40681 -13528 -256423 -180683 -71244 -19097 80232 156139
14819 156139 105169 -19122 -139668 -153179 -81025 -82900 -183510 -300212 -390407 -448037 -196452
14808 -196452 -27324 46048 32888 94750 -2753 582 130745 37975 -107347 -83290 14885
14797 14885 -112880 -46042 140283 104265 -145431 -150845 -98007 -83123 -81864 -158909 -115240
14786 -115240 -147556 -5049 143771 208511 157282 119992 169802 174113 184140 50336 -67529
14775 -67529 -66531 -23346 42765 93000 181957 101544 -25612 -239897 -249828 -156362 -91845 9570
14763 9570 99798 296049 248507 293406 384270 291762 155791 25010 -73318 -12701 -51566
14752e1566j4889k5194L6071L916j12769l0376J70859J100J2043J42923J03940
14741B36058J4368j83004K436j4433r09m9382m4527K3976k00123j35491J9995
14730c31036j85211J5793K92313K28758O8090J33383k27837k66190j56196J39928
14720b88205L23284N3738m4779J43764l782r5155k983j5108Q2889R686j63179
14709A70l9122n4347K12247J68878K1198j77234k7213n8472j60902Q3415J70587
14698A39205j43609j04354j1208q179J9243K22855m1955R7124j765j51986N2990
14687F8361p5351K5557j55637O1797J37762p6238O3809O5816j586n5688J62201
14676B20803r0862j76597K17119J09206J82j18688J87599j01950m9556N1622p6122
$$ plain form
14752 -51566 -66455 -91649 -55578 -51662 -164431 -194807 -23948 -22848 -10805 132118 236058
14741 236058 250426 67422 69858 55425 54516 5134 -39393 -15417 -215540 -351031 -331036
14730 -331036 -516247 -500454 -208141 20617 88707 222090 -5747 -271937 -428133 -288205
14720 -288205 35079 88817 44038 187802 184020 88865 85882 70774 153663 163349 170
14709 170 -38952 -93299 118948 287826 309024 131790 104577 46105 -114797 -31382 139205
14698 139205 -4404 -108758 -119966 -128145 -108902 113953 71998 169122 167357 15371 68361
14687 68361 -6990 18567 -137070 -75273 62489 -13749 50060 115876 114290 58602 220803
14676 220803 129941 -46656 170463 279669 279851 161163 348762 246812 197256 248878 172756
14665A72756j763L2411p878j68944o6139j70316R2477J72000j0974o85j28812
14654h5867J72651J72787P819M4215j08757k1795R9499J8626j10922j45972m8166
14643e882q075J4211l3375k2257j06933k5383n5338J0956J54656P8977L3141J32477
14631A67175R4640k0905j19610J0626m2841O1179L7070L4782j17877K0026J2044
14620A36309j4238o5055J27125J44200j45127j12853J49504j1967k15354j11323
14610a18779Q889Q2423m6715L6878O6493K4227k7059p1582l0239K7248J47326
14599I9110r2733k25155p7929J27824J10047J36778q86o9233m2789K1017P7434
14588F3485O8757K30961q8010k03798j67992j74900j50770J15524N6988Q3343
$$ plain form
14665 172756 170993 203404 195526 26582 -39557 -209873 -117396 54604 43630 42945 -85867
14654 -85867 86784 259571 267390 311605 202848 181053 280552 299178 188256 42284 -5882
14643 -5882 -13957 254 -33121 -55378 -162311 -187694 -243032 -232076 -77420 1557 34698 167175
14631 167175 261815 240910 121300 131926 89085 150264 187334 222116 104239 124265 136309
14620 136309 122071 57016 184141 328341 183214 70361 219865 207898 -7456 -118779
14610 -118779 -109890 -27467 -74182 -37304 29189 53416 26357 -45225 -75464 -48216 99110
14599 99110 6377 -218778 -296707 -168883 -58836 77942 77056 7823 -34966 -13949 63485
14588 63485 132242 363203 275193 71395 -96597 -271497 -422267 -306743 -249755 -166412
14578a66412j4185J10493m5621K534J45592l9366j26616M6452p4181K613J24887
14567c3810K2544O7113L1100p969m254K6345L612m4995J4857J47131R425j86048
14555D5051l6787k8364n5437k0856J95333L01498j21780m01161j68976j99J42904
14544a48774J78843J09927j82J0768j32431J06654o1215r9312J41646o6480j09862
14533g0418J3251J4869N9945n6127j5442M1072O9655R7426N209j52357k2529M8428
14521C2982M0443r5492r2048K5458m0836J47510J57211j14316j66904l7337J0239
14510a33090M4897P5348J12105J76001k043k87994k08095J39127q664j9931J40799
14499B8460l6957Q3813K945n6589J17262k7361m4822o7289j05196K43459N1508
$$ plain form
14578 -166412 -180597 -70104 -115725 -113191 32401 -6965 -133581 -87129 -161310 -158697 -33810
14567 -33810 -11266 55847 86947 78978 74724 101069 104681 59686 74543 221674 231099 45051
14555 45051 8264 -20100 -75537 -96393 98940 400438 278658 -122503 -291479 -291678 -148774
14544 -148774 30069 139996 139814 150582 18151 124805 63590 -35722 105924 39444 -70418
14533 -70418 -57167 -42298 17647 -38480 -53922 -12850 56805 154231 159440 7083 -15446 32982
14521 32982 73425 -22067 -114115 -88657 -129493 18017 175228 60912 -105992 -143329 -133090
14510 -133090 -88193 -12845 99260 275261 273218 -14776 -222871 -83744 -92408 -112339 28460
14499 28460 -8497 75316 78261 21672 138934 111573 66751 -538 -105734 137725 189233
14488A89233J7810k4845J4139m849l2099L6594J4629j29318j39949j93521K5622
14477b26554J06948k4683Q4705Q0532l4431M1638q8777m0619j96039q4829J48632
14466b33477K91578J48578j99343j13062L23817P9974k22372j28184k1021M510
14456f9002j9304L2261K7100r917N4337n9699j47121J20624L5846j76661J14646
14445i6890J07744K6392K17311J75746j92909k38434J01096J15M6901r3014J9050
14434G3108j19705p5007l3653J83317J17575K8790Kn0962j71351j51940Q1460
14423a18366J51079j43729L2451J4668R1559o6738j00842l2010Q4179R8467L28
14412A1046k8901k5868J38530l620l9201L5141N9660P8094N867o3614m3541o3625
$$ plain form
14488 189233 207043 182198 196337 191488 159389 195983 210612 81294 -58655 -252176 -226554
14477 -226554 -119606 -144289 -59584 20948 -13483 28155 -60622 -101241 -297280 -382109 -233477
14466 -233477 58101 206679 7336 -105726 218091 298065 75693 -52491 -73512 -69002
14456 -69002 -88306 -56045 -28945 -38862 15475 -44224 -191345 -70721 -34875 -211536 -96890
14445 -96890 10854 37246 254557 430303 237394 -1040 100056 100171 147072 54058 73108
14434 73108 -46597 -121604 -155257 28060 145635 174425 174427 123465 -47886 -199826 -118366
14423 -118366 32713 -111016 -78565 -63897 27662 -39076 -139918 -171928 -87749 10718 11046
14412 11046 -17855 -43723 94807 91187 51986 87127 146787 224881 230748 167134 123593 59968
14400E9968j48215p4348J45276K04420K3305j07639L6561q5810j7963M4692j65209
14389h4962J50442Q1795l2318K2381J14080k2984p3361j55870r8498J18284J54112
14378A73101P4689o4747p3606n2053j31263J38744J37555j24135k5046j00590
14368d7351J04186K45806L5500o8868p8532j01932K35812J11729j76012M0585
14358C00923J98468L4149p14M4968k001j52127k08149j19406o6499K2134Q2937
14347A34683P9556o9818k07050J2415j278J549j40733k9951K14896R7272K26729
14336C18270L0229k24988j44255J71573O3083m2927k17415n4768K01059K3601
14326A23462m5636L8812o9441j43763J0285K97946Q8046n9006j00197j03931o659
$$ plain form
14400 59968 -88247 -162595 -17319 187101 210406 102767 139328 53518 35555 80247 -84962
14389 -84962 65480 147275 114957 137338 251418 228434 155073 -797 -99295 18989 173101
14378 173101 247790 183043 109437 57384 -73879 64865 202420 78285 53239 -47351
14368 -47351 56835 302641 338141 269273 190741 88809 324621 436350 260338 300923
14358 300923 499391 533540 532826 577794 575793 423666 215517 96111 29612 51746 134683
14347 134683 214239 144421 -62629 -50214 -51492 -49943 -190676 -220627 -5731 91541 318270
14336 318270 348499 123511 -20744 150829 213912 170985 -46430 -101198 99861 123462
14326 123462 77826 116638 47197 -96566 -86281 211665 299711 240705 140508 36577 29918
14315B9918J5092n3809o725j3909K39075J28820l8942j85652O103J72160N6775
14304C48906p5700l3102M009n9275j37639j71600k1048K60045M7703J03117J7095
14293B82511o922j07123m8624O4649p0291n7722K7095O7381j29422m6480l8576
14282f3524j82007O4468J47976M6190l4229P283j61525J8387J28358P7118O6362
14271A14857K4367j38557j04665j02799P5000M6666P3244J78189L8422q2983K464
14260A24205N7447J45575j7546K317J81886J53683o7244j85003j14048m1337M8891
14249B88826k0519P3589O6010j48362j50901p2364o2349O2335N7034J39833K9029
14238B62161K30098K1975j38194M5298J4148r6673J02139p3625n9780Q8389J85133
$$ plain form
14315 29918 45010 -8799 -15524 -29433 209642 338462 299520 113868 119971 292131 348906
14304 348906 273206 240104 244113 184838 47199 -124401 -145449 114596 162299 265416 282511
14293 282511 275589 168466 119842 184491 114200 56478 83573 150954 21532 -24948 -63524
14282 -63524 -245531 -181063 -33087 13103 -21126 -13843 -175368 -156981 -28623 48495 114857
14271 114857 139224 667 -103998 -206797 -131797 -85131 -11887 166302 204724 121741 124205
14260 124205 181652 327227 309681 311998 493884 647567 580323 395320 281272 239935 288826
14249 288826 268307 341896 407906 259544 108643 36279 -26070 36265 93299 233132 262161
14238 262161 492259 514234 376040 421338 435486 338813 440952 367327 307547 395936 581069
14227E81069J17961q0028j10247K56561j0957P5498J50334j36629J6423J23038
14217I83023m8311K24703J09257p6162J07587J85698K08667K26711R9634J49959
14207B170766L23662O4155J34340K30138P2478L15350N87960N22553M21730M87727
14197E330859N92473N47221M20150O81277N82349Q45685Q72128P28937O77229
14188A1278308O27655K85502M15295J17603l12205m76913m31540o38282r00089
14179I965334q20463p88863r70910p36441o28181n98352l40734m37936n43053
14170D100401n51824m92168k69056m8617l00852l90976k59884j47418n4117l16254
14160A269235l9873N2054J49026k5098l6494j19876j23294k5019K0801o4976k18764
$$ plain form
14227 581069 699030 619002 508755 765316 754359 829857 980191 843562 859985 983023
14217 983023 934712 1159415 1268672 1192510 1300097 1485795 1694462 1921173 2020807 2170766
14207 2170766 2494428 2558583 2692923 2923061 2995539 3310889 3898849 4421402 4843132 5330859
14197 5330859 5923332 6470553 6890703 7571980 8154329 9000014 9872142 10601079 11278308
14188 11278308 11905963 12191465 12606760 12724363 12412158 11935245 11503705 10865423 9965334
14179 9965334 9144871 8356008 7385098 6648657 6020476 5422124 5081390 4643454 4100401
14170 4100401 3548577 3056409 2787353 2738736 2437884 2046908 1787024 1639606 1585489 1269235
14160 1269235 1229362 1281416 1430442 1405344 1368850 1248974 1125680 1100661 1121462 1056486 837722
14149H37722o0193J48930P3623j29426j57174j51868M2979J04860n9600o7262
14139E82591m0268j08749l06263j00297n22K14608M5401r7971J51433j8975Q9879
14128D10867J093j22774p7674J08684J27229j4499M9616P8801j11882j16797M9247
14117C81911O4297K5286j58647n5777J46655o2151j27670Q327L824j22252M3423
14106A47226Q4119N6842J9709L0150L6749j5335o3694q0486R8914J81754L63240
14095H59188L95498J65609j62171l28538k05719j18930k20047k48043l6328N3173
14085A53692m4373J34844J05608p3333r7507j27749R254k9671j81670q5093P8745
14074a57253L5436J23906M0167J08719k0114n5248p27O0071k64154k39139J45999
$$ plain form
14149 837722 777529 926459 1000082 870656 713482 561614 604593 709453 649853 582591
14139 582591 542323 433574 127311 27014 26492 241100 286501 188530 339963 320988 410867
14128 410867 411960 289186 211512 320196 447425 432926 482542 561343 449461 332664 381911
14117 381911 446208 471494 312847 257070 403725 341574 213904 222231 226055 103803 147226
14106 147226 231345 288187 307896 338046 374795 359460 295766 215280 314194 495948 859188
14095 859188 1254686 1420295 1258124 929586 723867 604937 384890 136847 100519 153692
14085 153692 109319 244163 349771 276438 178931 51182 60436 30765 -150905 -235998 -157253
14074 -157253 -121817 2089 42256 150975 130861 75613 74886 134957 -129197 -368336 -222337
14063b22337K46493K08778j60670o4384P9327J27964M8531O8061j43568j32358
14053E5837M4307n5469J2496k1186N0779J23108k3359J62043n8301k27995o161
14042E6099K9725J04852j3928m1255J51033j15616j99614J1616L6214J08494n8957
14031F8663j13187k33457j50886O8335Q4889J72646K10964P6727m9647L1283j6355
14020A49975j13790J1460k7325M613Q0547J94276j31499l3492k577j71594r1329
14009a30735O0868J80815O2416q8010p5066J40514Q8468n3845j53756k5072m0764
13998c4167r742k7986P6808m8059l8314J0388J07048R328l5766O8647J03063K1246
13986B02494j43225p1074K08099K38511j66132k65552K055P2873J35212q2257
$$ plain form
14063 -222337 24156 232934 72264 7880 87207 215171 263702 331763 188195 55837
14053 55837 100144 44675 57171 35985 86764 209872 186513 348556 290255 62260 56099
14042 56099 85824 190676 176748 135493 286526 170910 -28704 -17088 19126 127620 68663
14031 68663 -44524 -277981 -428867 -360532 -275643 -102997 107967 184694 135047 166330 149975
14020 149975 36185 47645 20320 24933 105480 299756 168257 134765 132188 -39406 -130735
14009 -130735 -69867 110948 173364 85354 10288 150802 239270 185425 31669 6597 -34167
13998 -34167 -43909 -71895 4913 -43146 -81460 -71072 35976 45304 9538 78185 181248 202494
13986 202494 59269 -11805 196294 434805 268673 3121 5176 78049 213261 131004
13976A31004q7939p6621j9892J41907J05698Q3100P3169p5705k28458r5237K10291
13965A61317j25235P1435m5296k97r2014O3819L8540j42542J6826L47270L108
13954B96931j26135p6919j67924O4371J16625K34p5742Q2104j27395j21479J78098
13943D2769J7359L1431Q1849j74468j15046q5923J32284J39862R3060J67484l5297
13932B95364l6451q3985j26981J90004J33270j71689j21701j73001o2626K50602
13922I2806k4190o221j03434L5261J56169r6595j04735k08389k2763P5530J11280
13911i5281J42972l415M3224l7684J4770N7966m7372j28435l5922p6761J33580
13900c2358J13833L2055q0803J36461R6812m0651n4304l6996J18143P353n5418
$$ plain form
13976 131004 43065 -33556 -53448 88459 194157 277257 350426 274721 46263 -48974 161317
13965 161317 36082 107517 62221 61924 -30090 33729 72269 -70273 -53447 293823 296931
13954 296931 170796 93877 -74047 -9676 106949 107183 31441 113545 -13850 -135329 42769
13943 42769 60128 91559 173408 -1060 -116106 -202029 -69745 70117 163177 330661 295364
13932 295364 258913 174928 47947 237951 371221 199532 77831 -95170 -157796 92806
13922 92806 68616 62395 -41039 -5778 150391 53796 -50939 -259328 -282091 -206561 -95281
13911 -95281 47691 44276 87500 49816 64586 122552 75180 -53255 -89177 -165938 -32358
13900 -32358 81475 113530 32727 169188 266000 225349 171045 134049 252192 259545 204127
13889B04127n2610j30019k3156o2595l0305p1800j01598l8738N6319Q7916J95519
13878C3060N5440Q8482J34641J00140j52455m2445j8677M6457K5901j26809K1149
13867A64884j63610r1894j72451o5950R9959J63917Q4588j0104r0294j03648N6841
13856a27762j580q2306m5943k029p0110N6125J15262K10234K33766J7358j30293
13845A72722j72981j57771l9417P150J17413n1525p0632Q1258K18159J1802k9210
13834H6968J34115M4716K8534n3721j97102r0986K38878M0304j99494j25742j23418
13823b16948j34208J18954j13471M9217J19974Q9231N4246j64637o6163J5014
13813b48791P368Q428q1039m4067j7875J2969O4567O9061J35873J28656j0603
$$ plain form
13889 204127 151517 21498 -1658 -64253 -94558 -166358 -267956 -306694 -250375 -162459 33060
13878 33060 88500 176982 311623 411763 259308 216863 198186 244643 270544 143735 164884
13867 164884 1274 -90620 -263071 -329021 -229062 -65145 19443 9339 -80955 -184603 -127762
13856 -127762 -129342 -211648 -257591 -259620 -329730 -273605 -158343 51891 285657 303015 172722
13845 172722 -259 -158030 -197447 -190297 -72884 -124409 -195041 -113783 104376 116178 86968
13834 86968 221083 265799 294333 240612 43510 -47476 191402 231706 32212 -93530 -216948
13823 -216948 -351156 -232202 -345673 -296456 -176482 -87251 -33005 -197642 -263805 -248791
13813 -248791 -241423 -232995 -314034 -358101 -375976 -363007 -298440 -229379 -93506 35150 24547
13802B4547k2939K3368q2565N1074n55J20905L4604l8932k3917P7901m4650j67693
13790d8852k3629J49749J4143l0055L7517m6830k99815K1613K31022J40260m0400
13779A04723J25745p0781j48194j97036k23864N0178K26682J89337J77500N4557
13769B88847m6747j15192n1526M7012j00032m5070j10144m2033K3549Q8789j08939
13758a71486j81855P6547K41940K20077j7569j81263M6747P2904N3805k03026
13748d3179l6645J81531l5496K54268J00157k60511q7754k30381j33710J78444
13738a13276K29915J53802J78718k41633j32455o2209j49082q6973K9780K53162
13728E9749R8453N9783j2686j84627j24301n6092M0172n3077m0347J01221M5205
$$ plain form
13802 24547 1608 24976 -57589 -6515 -7070 113835 148439 109507 85590 163491 118841 -48852
13790 -48852 -72481 77268 91411 61356 98873 52043 -247772 -226159 4863 145123 104723
13779 104723 230468 159687 11493 -185543 -409407 -359229 -132547 56790 234290 288847
13769 288847 242100 126908 75382 122394 22362 -22708 -132852 -174885 -151336 -62547 -171486
13758 -171486 -353341 -276794 -34854 185223 167654 -13609 33138 106042 159847 -43179
13748 -43179 -79824 101707 66211 320479 420636 160125 72371 -158010 -291720 -113276
13738 -113276 116639 270441 449159 207526 75071 12862 -136220 -223193 -193413 59749
13728 59749 158202 217985 205299 20672 -103629 -159721 -119549 -172626 -212973 -111752 -66547
13717f6547q1232R6238J9500k0841j4677o1160p1839O1276q0624l5930q737o1069
13705c25642K21038J34979J93769N6320j13929O2042N2897p670J1006l4093n6330
13694A94387l2866j00973N5693O4757N9282K00385M57q3366o9754m7932P9515
13683C19585k7168K364M6984j16304P5273O3764O8135j43152j92396P3710q4520
13672H6275n0219M4953J92791K12415q7635l3633M8647m9618M7479j13729r1714
13661B06012q5495J81288O7055R1642J81892o4755K656J66063o5434J50623J225
13650H32772j97777L1011Q6686L13679J44737K99809M62893L40153N22447J201430
13640D037840J170645O29996l45959p67224n69286k52748K35913M46937M96118
$$ plain form
13717 -66547 -147779 -51541 -32041 -52882 -67559 -128719 -200558 -139282 -219906 -255836 -264573 -325642
13705 -325642 -104604 30375 224144 280464 166535 228577 281474 273804 284810 250717 194387
13694 194387 161521 60548 116241 180998 240280 440665 441122 357756 288002 240070 319585
13683 319585 292417 294781 341765 225461 300734 364498 432633 289481 97085 170795 86275
13672 86275 36056 81009 273800 486215 398580 364947 413594 363976 411455 297726 206012
13661 206012 120517 301805 368860 460502 642394 577639 580295 746358 680924 831547 832772
13650 832772 634995 666006 752692 1066371 1211108 1510917 1973810 2313963 2836410 4037840
13640 4037840 5208485 5838481 5492522 4725298 4156012 3903264 4139177 4586114 5082232
13631E082232Q10384J368930J598449J509936J765451K126638L123274N232718
13623B2618012Q300632J4073327K5634099M6019382P1573387O6178173Q332934
13616B62729946m5194387o3814141n3391231l3650475j9871819j2238702p696129
13609B6873062n068027l526293k471645j713126j437817j456451j089589q64804
13601I245310o50453n71772o73916p62715p87811o40355m15069k99992j80496
13592D262731l6377K56367J8752j09072j88142l50092l15130l11954k62418j75138
13582B789527P3897n3898J3758J41647j60178k05088l22451m59078k10589k30758
13572A376789j96902k19952L3865M542j94647k33732K7190O4006r5345j284M8115
$$ plain form
13631 5082232 5892616 7261546 8859995 10369931 12135382 14262020 17385294 22618012
13623 22618012 30918644 44991971 70626070 116645452 188218839 254397012 262729946
13616 262729946 217535559 153721418 100330187 66679712 46807893 34569191 26873062
13609 26873062 21805035 18278742 15807097 14093971 12656154 11199703 10110114 9245310
13601 9245310 8594857 8023085 7349169 6586454 5798643 5158288 4743219 4443227 4262731
13592 4262731 4226354 4482721 4501473 4392401 4204259 3854167 3539037 3227083 2964665 2789527
13582 2789527 2863424 2809526 2823284 2964931 2804753 2599665 2277214 1818136 1607547 1376789
13572 1376789 1179887 959935 993800 998342 803695 569963 597153 661159 565814 564530 612645
13561F12645K2250j54130q5960q3689q1936P628N4088J4001j3816o9721j64842
13550E6518p9998J41250M8418j16401O5359O6464K8697j7206P4607p8370p0472
13539A18866J8803N1131Q3735J2209L1246Q5221K8795k62710p6859K67572M7270
13528D05279j62258R0741O9051L1579j13043j13168j1906j31847k3296r6698p9250
13517a34816J28781J17495L7463o5832L2452M5594m9314L7609O2686j78000J24735
13506A58853k7964j41728k1344J39516J2499J8026j23664J87877j2125j20518
13496F9428J8989K6007J88799j22650j86591j42933P6945J69774j282P0063l6289
13485A30260k04149O9713o7206j79525l394J10952K19678J18773p7254K1501p4562
$$ plain form
13561 612645 634895 480765 394805 311116 229180 236808 290896 304897 291081 221360 56518
13550 56518 -23480 117770 166188 49787 115146 181610 210307 193101 267708 189338 118866
13539 118866 137669 188800 272535 284744 315990 401211 430006 167296 90437 358009 405279
13528 405279 243021 333762 402813 434392 321349 208181 196275 64428 41132 -55566 -134816
13517 -134816 -6035 111460 148923 83091 115543 161137 111823 149432 212118 34118 158853
13506 158853 130889 -10839 -32183 107333 119832 137858 14194 202071 189946 69428
13496 69428 88417 114424 303223 180573 -6018 -148951 -72006 97768 96486 166549 130260
13485 130260 -73889 -4176 -71382 -250907 -254301 -143349 76329 195102 117848 139349 64787
13474F4787K1346m0613j5710j66733N1729J22519N729O9106q1904j35083o9829
13463a74656N0292J49632K9988j4759O9377J70421k1728q3204L410r8957L069
13452H2885J8335p2449j39358R5878P6804K791j6877p1631j9036K8447k2202K3784
13440a2629J14065j02295n2406J33420J08182m1748j5125P8983p4621k11847j80692
13429b56713Q5906L12431J91715j6892p3716m035o0050n1600J83070o0464j23612
13418A26040q9308j44368j668J06626R8719K8664j09943J419L6428P3223O2553
13407A88385J21175p1291j79395L7144J8978J23585K18251Q9464k9925j13594
13397D02777j50456Q2979l5077J28951j4594j25260k00344k1050l9882j72666
$$ plain form
13474 64787 86133 45520 29810 -136923 -85194 37325 43054 112160 30256 -104827 -174656
13463 -174656 -124364 25268 55256 40497 109874 280295 258567 175363 178773 79816 82885
13452 82885 101220 28771 -110587 -14709 62095 64886 48009 -23622 -42658 -14211 -36413 -12629
13440 -12629 101436 -859 -53265 80155 188337 146589 131464 210447 135826 -76021 -256713
13429 -256713 -170807 141624 333339 316447 242731 238696 178646 127046 310116 249652 126040
13418 126040 36732 -107636 -109304 -2678 96041 124705 14762 16181 52609 125832 188385
13407 188385 309560 238269 58874 96018 114996 238581 456832 546296 516371 402777
13397 402777 252321 335300 300223 429174 414580 289320 88976 67926 28044 -144622
13387a44622R7668J84119k9223p3885K3351J2590j46391q0353N3864K9798j26185
13376a99269L0062Q5089Q4576M7437l3249Q187Q5945J92405k7391k32292j07802
13365f6302R9420R415k5285p6129L362J05586J06571p3576n2836j11824Q0666
13354i32P5226j8389j34729k6675R3337L1231j43097l5923J18777J84004q7624
13343E5206k2120p101k33015q7474J5410J49742K34844N4092Q1686j7455j30396
13332I3419M457j4204q8144l8354m6963J35980K15727j10907L4617r8687j55943
13321f9002m3396J73393P5140n2754o6517R786J0997P8694R9907k20077n6390
13310f0219j72785j1861N5779P9499J64789J74136J4644p1009q8860k6867N6760
$$ plain form
13387 -144622 -46954 137165 107942 34057 57408 69998 -76393 -156746 -102882 -73084 -199269
13376 -199269 -169207 -84118 458 47895 14646 22833 108778 301183 273792 41500 -66302
13365 -66302 33118 42533 17248 -58881 -55519 50067 156638 83062 30226 -81598 -932
13354 -932 74294 55905 -78824 -105499 -12162 19069 -124028 -159951 -41174 142830 55206
13343 55206 33086 25985 -207030 -294504 -279094 -129352 105492 159584 241270 223815 93419
13332 93419 97876 83672 -4472 -42826 -89789 46191 261918 151011 185628 86941 -69002
13321 -69002 -112398 60995 136135 83381 16864 26650 37647 116341 216248 -3829 -60219
13310 -60219 -233004 -244865 -189086 -109587 55202 229338 243982 172973 84113 57246 114006
13299A14006o4911K2765O2183p025o3463J16307j02743j27738J3794p5531K8279
13288h4077P6470N8426O3115p1300n0846p8673q8622P6251j0128k29279P6255
13277b62408L498O4786K63449J04335q4179k467m4361k49345l4589N8384J01467
13266h1430M1205J78133L5296j37091j34756Q3067l0873M5093J5573j40854J27947
13255A310J8251n5787k3548p6869O2118J22341J47711L3069Q878J1788j28525
13244A20737Q5258M8362k1444N9334m8475k06018q8386Q9880J4192q770J12211
13233A56881q3619L997k1587j03008q9807k8218k7053M6443j4193J49994m278
13222a4448o6284j05595o6107J35382J05921K62209P881l21072r0204P5570R203
$$ plain form
13299 114006 49095 71860 134043 127018 63555 179862 77119 -50619 -36825 -112356 -84077
13288 -84077 -7607 50819 113934 42634 -8212 -86885 -175507 -99256 -109384 -338663 -262408
13277 -262408 -258910 -194124 69325 173660 89481 87014 42653 -206692 -241281 -182897 -81430
13266 -81430 -40225 137908 173204 36113 -98643 -15576 -46449 -1356 14217 -126637 1310
13255 1310 19561 -36226 -59774 -136643 -74525 47816 195527 228596 237474 249262 120737
13244 120737 205995 254357 232913 292247 243772 37754 -50632 39248 53440 44670 156881
13233 156881 73262 77259 55672 -47336 -137143 -165361 -192414 -145971 -160164 -10170 -14448
13222 -14448 -80732 -186327 -252434 -117052 -11131 251078 258959 -62113 -152317 -76747 -67544
13211f7544r437L5512q2398J4097M1730p9761J7143O9651n1373J8425J5582R0893
13199A2520o7110j06734o1895j4887R065k6039L1947J99570L35311P8819l1116
13188C59451j42452j71980l2693j2898J23872j7768n068n1245O8876J39760P5031
13177C32886p1890k43893j41209k1814L8224J83677Q8298N6557M0790K0330o0663
13166B21293j77970P5304J10894P4254m1626R5970J17343J0912q9937k39155q4643
13155G2639k2329L4002J0150k00940j2161N2019k6131j6331n0071M9399p7626
13144a87380J08680P2559K1729o680J44771Q5629O9516J89313M69770M45906J25082
13133A538895j82501l44285l60907k14324p027l1374k8031J0424j22811k10167
$$ plain form
13211 -67544 -76981 -41469 -123867 -109770 -68040 -147801 -130658 -61007 -112380 -93955 -78373 12520
13199 12520 -54590 -161324 -223219 -238106 -229041 -255080 -223133 -23563 311748 390567 359451
13188 359451 216999 45019 12326 -572 123300 105532 100464 49219 118095 257855 332886
13177 332886 260996 17103 -124106 -145920 -107696 75981 164279 220836 261626 281956 221293
13166 221293 43323 118627 229521 303775 262149 358119 475462 486374 396437 157282 72639
13155 72639 50310 84312 94462 -106478 -118639 -66620 -92751 -109082 -159153 -109754 -187380
13144 -187380 -78700 -6141 15588 8908 153679 239308 308824 498137 967907 1413813 1538895
13133 1538895 1356394 1012109 651202 436878 429851 398477 370446 380870 258059 47892
13123D7892j83493J72509K04605j05422j04611R2705N5549j5771n8590j35949
13113c0576j93462L045J16991Q3714J39528J4383q4377L1899o5872j95338J3063
13102a67002L1855J39115J51838J07222J57459R9880l14729j61795j5459O1507
13092H9891r3272n2264j01792l0797J14877O0152Q2110J15947k04966j41360J04979
13081e6495J47466K5496J21546k02876k75595R540K38791J17599j28251L1772
13071B8993K27059J52113o0575j19818j48784N66q0140K6395O3188P6364n1965
13060A13396q4716M8436m889L5524J40211J377q9958r2757O448J02871N2800J4373
13048B43116O4420j82784j25565L9864j22562N4913R2539n8080j2103j4476j18523
$$ plain form
13123 47892 -135601 36908 241513 136091 31480 124185 179734 163963 105373 -30576
13113 -30576 -224038 -220993 -104002 -20288 119240 133623 49246 81145 15273 -180065 -167002
13102 -167002 -135147 3968 155806 263028 420487 520367 205638 43843 28384 89891
13092 89891 -3381 -55645 -157437 -188234 -73357 -13205 68905 184852 -20114 -161474 -56495
13081 -56495 90971 116467 238013 35137 -240458 -230918 7873 125472 -2779 28993
13071 28993 256052 408165 347590 227772 78988 79554 -586 25809 88997 165361 113396
13060 113396 28680 77116 72227 107751 247962 249339 159381 66624 73072 175943 228743 243116
13048 243116 307536 124752 -813 39051 -83511 -28598 63941 5861 -6242 -20718 -139241
13037a39241j05446p3302J87914J08286l1750r2835J19211Q1974P1613K5676R509
13026A61609p5812j4397q5416m8475q185p327r0278k95298J46462K19569P0633
13015b6915P4427r881P443j11642l150J31821l4708j9716k4830j25621n9617r719
13003b12108l1369O8526O4980m3423L1879k0885q972j91719q381O1802J74555
12992a15115Q3602K1136P7805n5309m6384P0434P3527p759j55767j9475J41198
12981F7893p3939J05373L2257j91043q9934j90521Q6833J20635p6336q5P9635
12970a29232p8595L3169Q9209N5052J80608Q6054m7936o5524j76151p1424L2168
12959i2602K78435P9744j90695o5827q8258q5975j28642R2080O1948M7089k21205
$$ plain form
13037 -139241 -244687 -317989 -130075 -21789 -53539 -146374 -27163 54811 126424 152100 161609
13026 161609 85797 71400 -14016 -62491 -70676 -78003 -168281 -463579 -317117 -97548 -26915
13015 -26915 47512 37631 45074 -66568 -69718 62103 27395 7679 -17151 -142772 -202389 -212108
13003 -212108 -243477 -174951 -109971 -153394 -121515 -142400 -151372 -343091 -351472 -289670 -115115
12992 -115115 -31513 -10377 67428 12119 -34265 36169 109696 101937 -53830 -73305 67893
12981 67893 -6046 99327 131584 -59459 -149393 -339914 -253081 -132446 -208782 -208867 -129232
12970 -129232 -207827 -174658 -85449 -30397 150211 236265 188329 122805 -53346 -124770 -92602
12959 -92602 185833 265577 74882 9055 -79203 -165178 -293820 -201740 -139792 -92703 -313908
12948c13908J9336P3463R5404P1009J69403R1374j57557J12095n3980j81683O674
12937f8370N0570N2808R9391m7827R3268J49000j72746j02728J28261J07858N2945
12926C42430J9392j0066j59020j69000j41433P8341J74618N3212k30290l8969
12916h0785O4871J68706R0503M7186j34823j69536j2327J02114P1798l4207N5797
12905A69297K0025J1189q2165p0512p4888J7111r9722K1039J0448J18243O4608
12894A04673j0597N8733J41468N5741q4133q8976j47729O5994J17413p8262P682
12883A42007j60764o9197l952j06577n8052J29545O2027K9805j05713Q8963L5648
12872a6260j67561j6687L8637M7933M8424o9567j51726P5341O6821K0411k39434
$$ plain form
12948 -313908 -294572 -221109 -125705 -54696 114707 206081 48524 160619 106639 -75044 -68370
12937 -68370 -17800 35008 134399 86572 179840 328840 156094 53366 181627 289485 342430
12926 342430 361822 351756 192736 23736 -117697 -39356 135262 188474 -41816 -80785
12916 -80785 -15914 152792 243295 290481 155658 -13878 -26205 75909 147707 113500 169297
12905 169297 189322 200511 118346 47834 -27054 -9943 -109665 -88626 -78178 40065 104673
12894 104673 94076 152809 294277 350018 265885 176909 29180 95174 212587 134325 142007
12883 142007 -18757 -87954 -91906 -198483 -256535 -126990 -64963 -35158 -140871 -51908 -16260
12872 -16260 -183821 -200508 -161871 -113938 -65514 -135081 -286807 -211466 -144645 -124234 -363668
12861c63668m9136J03981J02308N1724J75791J09416q64J25273j78502j23135
12851d6812m6213J1080J18537J73235Q656m4694j23388k39862l0832K05897M7237
12840C2841J0429k5283m9635k1169J4020Q9178J30208j82995k1728K18492r3190
$$ plain form
12861 -363668 -412804 -308823 -206515 -154791 21000 130416 129552 254825 76323 -46812
12851 -46812 -93025 -81945 36592 209827 218483 173789 50401 -189461 -220293 -14396 32841
12840 32841 43270 17987 -31648 -52817 -38797 50381 180589 -2406 -24134 194358 101168
$$ [...]
##END NTUPLES=NMR SPECTRUM
##END=
