##TITLE=Analysis number 314293
Compound Code cc 04304
Project Code qc-cat
Chemist Name molekula
##JCAMPDX= 6.0         $$ Bruker NMR JCAMP-DX V2.0
##DATA TYPE= NMR SPECTRUM
##DATA CLASS= NTUPLES
##ORIGIN= Bruker BioSpin GmbH
##OWNER= NMR
$$ XWIN-NMR		Version 3.5
$$ Wed Oct 12 14:03:40 2005 GMT Daylight Time (UT+1h)  MAYBRIDGE\NMR@NMR_250MHZ
##.OBSERVE FREQUENCY= 250.131544655141
##.OBSERVE NUCLEUS= ^1H
##.ACQUISITION MODE= SIMULTANEOUS (DQD)
##.ACQUISITION SCHEME= undefined
##.AVERAGES= 16
##.DIGITISER RES= 18
##SPECTROMETER/DATA SYSTEM= dpx250
##.PULSE SEQUENCE= zg30
##.SOLVENT NAME= CDCl3
##.SHIFT REFERENCE= (INTERNAL, CDCl3, 0, 16.522)
##AUDIT TRAIL= $$ (NUMBER, WHEN, WHO, WHERE, WHAT)
$$ ##TITLE= Audit trail, XWIN-NMR		Version 3.5
$$ ##JCAMPDX= 5.01
$$ ##ORIGIN= Bruker BioSpin GmbH
$$ ##OWNER= NMR
$$ C:\u/data/dgb/nmr/ADRS/10750/pdata/1/auditp.txt
$$ ##AUDIT TRAIL=  $$ (NUMBER, WHEN, WHO, WHERE, WHAT)
(   1,<2005-10-12 14:03:18.66 +100>,<MAYBRIDGE\NMR>,<NMR_250MHZ>,
      <created by zg, POWCHK disabled, PULCHK disabled
       configuration hash MD5:
       62 19 C7 07 E1 42 D1 B7 37 6C 3D D0 77 39 F9 E6
       data hash MD5: 64K
       F8 03 84 86 FD E3 AC 30 72 89 5A 30 BE 4B 7E 5D>)
(   2,<2005-10-12 14:03:31.63 +100>,<MAYBRIDGE\NMR>,<NMR_250MHZ>,
      <Start of raw data processing
       ef LB = 0.3 FT_mod = 6 PKNL = 1 SI = 32K 
       data hash MD5: 32K
       D1 D0 A2 6D 1F F5 BD 37 AD 4E FF 74 15 CB E6 63>)
(   3,<2005-10-12 14:03:33.32 +100>,<MAYBRIDGE\NMR>,<NMR_250MHZ>,
      <apk 
       data hash MD5: 32K
       EB 74 E5 B0 0B 31 B5 D5 91 0E 15 6A 45 6B 03 FA>)
(   4,<2005-10-12 14:03:34.05 +100>,<MAYBRIDGE\NMR>,<NMR_250MHZ>,
      <abs ABSG = 5 
       data hash MD5: 32K
       99 CB 49 E1 31 C2 FE 41 37 90 DF 0D DD FB F5 58>)
$$ ##END=
$$ 
$$ hash MD5
$$ BB BC 9A B1 76 48 5B D9 3A 4B 5F 77 C9 52 15 94
##$RELAX= 
##$RELAX= 
##$RELAX= 
##$RELAX= 
##$RELAX= 
##$RELAX= 
##$RELAX= 
$$ Bruker specific parameters
$$ --------------------------
##$DU= <C:\u>
##$EXPNO= 10750
##$NAME= <ADRS>
##$PROCNO= 1
##$TYPE= <nmr>
##$USER= <dgb>
##$AMP= (0..31)
100 100 100 100 100 100 100 100 100 100 100 100 100 100 100 100 100 100 
100 100 100 100 100 100 100 100 100 100 100 100 100 100 
##$AQSEQ= 0
##$AQ_mod= 3
##$AUNM= <au_zg>
##$AUTOPOS= <27 >
##$BF1= 250.13
##$BF2= 250.13
##$BF3= 250.13
##$BF4= 250.13
##$BF5= 500.13
##$BF6= 500.13
##$BF7= 500.13
##$BF8= 500.13
##$BYTORDA= 1
##$CFDGTYP= 0
##$CFRGTYP= 5
##$CHEMSTR= <none>
##$CNST= (0..31)
1 1 145 1 1 1 1 1 1 1 1 1 1 1 1 1 1 1 1 1 1 1 1 1 1 1 1 1 1 1 1 1 
##$CPDPRG= <>
##$CPDPRG1= <>
##$CPDPRG2= <>
##$CPDPRG3= <>
##$CPDPRG4= <mlev>
##$CPDPRG5= <mlev>
##$CPDPRG6= <mlev>
##$CPDPRG7= <mlev>
##$CPDPRG8= <mlev>
##$CPDPRGB= <>
##$CPDPRGT= <>
##$D= (0..31)
0 1 0 0 0 0 0 0 0 0.06 0 0 0 0 0 0 0.0002 0 0 0 0 0 0 0 0 0 0 0 0 0 0 
0 
##$DATE= 1129122197
##$DBL= (0..7)
120 120 120 120 120 120 120 120 
##$DBP= (0..7)
150 150 150 150 150 150 150 150 
##$DBP07= 0
##$DBPNAM0= <>
##$DBPNAM1= <>
##$DBPNAM2= <>
$$ [...]
##$SUBNAM7= <"">
##$SUBNAM8= <"">
##$SUBNAM9= <"">
##$SW= 20.6930455092707
##$SWIBOX= (0..15)
0 0 3 0 0 0 0 0 0 0 0 0 0 0 0 0 
##$SW_h= 5175.983436853
##$TD= 65536
##$TD0= 1
##$TE= 294.16
##$TE2= 300
##$TE3= 300
##$TEG= 300
##$TL= (0..7)
0 120 120 120 120 120 120 120 
##$TP= (0..7)
150 150 150 150 150 150 150 150 
##$TP07= 0
##$TPNAME0= <>
##$TPNAME1= <>
##$TPNAME2= <>
##$TPNAME3= <>
##$TPNAME4= <>
##$TPNAME5= <>
##$TPNAME6= <>
##$TPNAME7= <>
##$TPOAL= (0..7)
0.5 0.5 0.5 0.5 0.5 0.5 0.5 0.5 
##$TPOFFS= (0..7)
0 0 0 0 0 0 0 0 
##$TUNHIN= 0
##$TUNHOUT= 0
##$TUNXOUT= 0
##$USERA1= <user>
##$USERA2= <user>
##$USERA3= <user>
##$USERA4= <user>
##$USERA5= <user>
##$V9= 5
##$VALIST= <valist>
##$VCLIST= <CCCCCCCCCCCCCCC>
##$VD= 0
##$VDLIST= <DDDDDDDDDDDDDDD>
##$VPLIST= <PPPPPPPPPPPPPPP>
##$VTLIST= <TTTTTTTTTTTTTTT>
##$WBST= 1024
##$WBSW= 4
##$XGAIN= (0..3)
0 0 0 0 
##$XL= 0
##$YL= 0
##$YMAX_a= 489605
##$YMIN_a= -311712
##$ZGOPTNS= <>
##$ZL1= 120
##$ZL2= 120
##$ZL3= 120
##$ZL4= 120
##$ABSF1= 16.522
##$ABSF2= -4.171173
##$ABSG= 5
##$ABSL= 3
##$ALPHA= 0
##$AQORDER= 0
##$ASSFAC= 0
##$ASSFACI= 0
##$ASSFACX= 0
##$ASSWID= 0
##$AUNMP= <proc_1d>
##$AZFE= 0.1
##$AZFW= 0.1
##$BCFW= 0
##$BC_mod= 0
##$BYTORDP= 0
##$COROFFS= 0
##$CY= 12.5
##$DATMOD= 1
##$DC= 0
##$DFILT= <>
##$DTYPP= 0
##$F1P= 14.0000005364418
##$F2P= -0.99999901652339
##$FCOR= 0.5
##$FTSIZE= 32768
##$FT_mod= 6
##$GAMMA= 0
##$GB= 0
##$INTBC= 1
##$INTSCL= 1
##$ISEN= 128
##$LB= 0.3
##$LEV0= 0
##$LPBIN= 0
##$MAXI= 10000
##$MC2= 0
##$MEAN= 0
##$ME_mod= 0
##$MI= 0
##$NCOEF= 0
##$NC_proc= -4
##$NLEV= 6
##$NOISF1= 0
##$NOISF2= 0
##$NSP= 0
##$NTH_PI= 0
##$NZP= 0
##$OFFSET= 16.522
##$PC= 1
##$PHC0= -67.95065
##$PHC1= 4.001506
##$PH_mod= 1
##$PKNL= yes
##$PPARMOD= 0
##$PSCAL= 4
##$PSIGN= 0
##$REVERSE= no
##$SF= 250.13
##$SI= 32768
##$SIGF1= 0
##$SIGF2= 0
##$SINO= 400
##$SIOLD= 32768
##$SREGLST= <1H.CDCl3>
##$SSB= 0
##$STSI= 32768
##$STSR= 0
##$SW_p= 5175.98343685301
##$SYMM= 0
##$S_DEV= 0
##$TDeff= 65536
##$TDoff= 0
##$TI= <Analysis number 999999
Compound Code 99
Book Reference 9
Project Code 9>
##$TILT= no
##$TM1= 0
##$TM2= 0
##$TOPLEV= 0
##$USERP1= <user>
##$USERP2= <user>
##$USERP3= <user>
##$USERP4= <user>
##$USERP5= <user>
##$WDW= 1
##$XDIM= 32768
##$YMAX_p= 277402035
##$YMIN_p= -226290
$$ End of Bruker specific parameters
$$ ---------------------------------
##NTUPLES= NMR SPECTRUM
##VAR_NAME=  FREQUENCY,     SPECTRUM/REAL,   SPECTRUM/IMAG
##SYMBOL=    X,             R,               I
##VAR_TYPE=  INDEPENDENT,   DEPENDENT,       DEPENDENT
##VAR_FORM=  AFFN,          ASDF,            ASDF
##VAR_DIM=   32768,         32768,           32768
##UNITS=     HZ,            ARBITRARY UNITS, ARBITRARY UNITS
##FACTOR=    0.157963299565203, 1,           1
##FIRST=     4132.6476996994, 0,             0
##LAST=      -1043.33573715361, 0,           0
##MIN=       -1043.33573715361, -226290,     0
##MAX=       4132.6476996994, 277402035,     0
$$ Real data points
##PAGE= N=1
##DATA TABLE= (X++(R..R)), XYDATA
$$ [...]
30555G162l472j4300L3234P350j1058J7362M5866l4585l4340L2757k8902o0779
30543d3705k1937J7687L2464Q5576N8329r4l3587p5298o5395K8151O3048q774
30531C6465K3347M2082l1320P135M0822l6786n3310k069j9318L071k6580o3708
30519h0169j2540N3401N6942j2171j638q79o457j1455k1175N018J811L5442K1112
30506B7242K0850k1486l5936J7055K7220k2207K883J0965N0514J3227k4086m068
30494F2173L6025m8673o3179j3791J4441N8196k2503k1171l3909j5938Q168k8038
30482f8199J1078L5930Q755N8979O5293P7382l5488n3462J0222k0311n9671l4231
30470c723L7488N2066M8577m0641o6207l4550L7227r318l7365O919j0254q5831
$$ plain form
30555 7162 3690 -10610 22624 29974 18916 36278 82144 47559 13219 45976 17074 -43705
30543 -43705 -65642 -47955 -15491 70085 128414 128320 94733 19435 -45960 -17809 45239 36465
30531 36465 59812 101894 70574 77709 118531 81745 28435 26366 7048 10119 -16461 -80169
30519 -80169 -92709 -39308 17634 5463 3825 2946 -3511 -14966 -36141 -31123 -29312 6130 27242
30506 27242 48092 26606 -9330 7725 34945 12738 15621 26586 77100 90327 66241 62173
30494 62173 98198 49525 -13654 -27445 -13004 45192 22689 1518 -32391 -48329 -40161 -68199
30482 -68199 -57121 -21191 -12436 46543 111836 189218 153730 100268 110490 90179 30508 -3723
30470 -3723 33765 85831 134408 93767 27560 -6990 30237 20919 -16446 -9527 -19781 -105612
30458a05612r6667M3122J12796N8383N465o2347N731N0856L9476P264l4992o193
30446A7282Q172O4158K6440Q960o6299n5663j0094J0247j6875j9995K644K6636
30434d387J9204K387k2639n3448o2523M9569M2673O337q004J1610j0909n2556
30422h2686l906Q006n346M6380L4685K4586L9316L0326J0118M0060o9315l872
30410F8352r272O293k4963j6566K5597j3788N3142Q079p9034o0000M8849L7769
30398D4458l6451M076L8450j0532P098m244L4559m711j3372k0931j1219k6356
30386H25j7617k3117J23311N1502p6048N139R158r0577m2926K1598J7805K6737
30374E790K5500J9040M399j6340K1312L2726m7396o7837L960N1356M1579k5995
$$ plain form
30458 -105612 -202279 -159157 -46361 12022 17487 -44860 -39129 11727 51203 58467 23475 17282
30446 17282 25454 89612 116052 125012 58713 3050 -7044 3203 -13672 -33667 -31023 -4387
30434 -4387 14817 17204 -5435 -58883 -121406 -71837 -29164 -22827 -30831 -19221 -30130 -82686
30422 -82686 -86592 -78586 -83932 -37552 -2867 21719 61035 91361 101479 141539 72224 68352
30410 68352 59080 65373 40410 23844 49441 35653 88795 96874 17840 -42160 6689 44458
30398 44458 8007 12083 50533 40001 47099 42855 77414 72703 59331 38400 27181 825
30386 825 -16792 -39909 83402 134904 58856 63995 73153 -17424 -60350 -38752 -20947 5790
30374 5790 31290 50330 54729 38389 59701 92427 45031 -22806 -18846 32510 74089 48094
30362D8094j1128j9542j7305n84O8032N86L0845q121k9931k0332l4335n5858j9799
30349f9378M9598l8635j8228K0995o686j980k5812K4149Q9625J6659J7912K1184
30337G9403N166n9634n7721l2922M9178N1313J3682K6982m832m2654l7150J4409
30325E220J6044o2570L6761J3203K0890J2298j2281l4439M0519Q6640K3362j00041
30313D5606q6048J1624m019Q5517j2223k7701k2270N7450Q2178m726n2611o2701
30301A0076k6801M577R002j8655J7123m050m8129k6261J3719q585n5939O1596
30289g2327N3276j0923r091K1583k2344J8577L2608J9733j4704j2072K3498j6378
30277A1436J8968k3067j0889O85l3724J12M1771P1688l3416j5973k1604l0040
$$ plain form
30362 48094 36966 17424 119 -465 67567 68153 98998 90877 60946 40614 6279 -49579 -69378
30349 -69378 -19780 -58415 -76643 -55648 -62334 -64314 -90126 -65977 23648 40307 58219 79403
30337 79403 84569 24935 -32786 -65708 -16530 34783 48465 75447 70615 27961 -9189 5220
30325 5220 21264 -41306 -4545 8658 29548 41846 29565 -4874 35645 122285 145647 45606
30313 45606 -40442 -28818 -32837 52680 40457 12756 -9514 47936 130114 125388 72777 10076
30301 10076 -16725 -12148 -3146 -21801 -4678 -8728 -56857 -83118 -69399 -77984 -133923 -72327
30289 -72327 -19051 -29974 -39065 -17482 -39826 -21249 11359 31092 16388 4316 27814 11436
30277 11436 30404 7337 -3552 -2867 -36591 -36479 5292 76980 43564 27591 5987 -24053
30265b4053L4671q472J4906L9373Q807l9311k8655K9636L4722Q496L2747m5729
30253E7138n7570K4175N625L8289N1187O4226j7161k1099j5266o4455p2659o5225
30241g2795j8329J789K1840O014P328j7358j3109J3988P7151M4041J6340j6060
30229E0840l5221k0768P3104Q133K5856k1792m9320P900m4061j03619n8662j7897
30217a85507m651J1394M5722O8597P577R0393M9926L935q08j20186q3534k8439
30205a45581R9642J00007K1586Q835P2532K3779m8895n2339r3023m3618K8020
30194b9055J065j1874l2858j2415P904J1199K6228M1858N4890m3990o526N6343
30182F2769k1606k1925J3819r03M2814l1923l5070k9052N6095L9855k3441n2620
$$ plain form
30265 -24053 10618 2146 17052 56425 65232 25921 -2734 26902 61624 70120 102867 57138
30253 57138 -432 23743 29368 67657 118844 183070 165909 144810 129544 65089 -7570 -72795
30241 -72795 -91124 -89335 -67495 -61481 -54153 -71511 -84620 -70632 6519 50560 66900 50840
30229 50840 15619 -5149 67955 76088 101944 80152 30832 38732 -5329 -108948 -167610 -185507
30217 -185507 -190158 -178764 -133042 -64445 -56868 33525 83451 87386 86578 -33608 -117142 -145581
30205 -145581 -45939 54068 75654 84489 157021 180800 131905 79566 -13457 -57075 -29055
30194 -29055 -27990 -39864 -72722 -85137 -77233 -66034 -39806 2052 56942 12952 6426 62769
30182 62769 41163 19238 33057 32154 74968 43045 7975 -21077 35018 74873 51432 -1188
30170a188l4671n664l6439M8945K6890K7511M3420k9438n8034l5660m952K4645
30158c4635K7924R6039J7393n2209k3327N6596K1974l4177o5511J969N7544L2462
30146A02042N2523o615k802L5562m2115j26531J727L8749m7800r6182J8709K8138
30134d4595L1430L8686n3964J2737J7635p775l9365J1519L2281K4115m4069M4076
30122B2711k761m6706N0005l511k269K5847P3043L602m0181l6796J3917N4015
30110A10916J9447K4917l8674j6927o7122L0297l9800l7957l5121J0540M6545
30099G061j5470K775J7746j4954j2265K4150N5144k8305K1489K9775j8864n8201
30087A0081M363k2412o5499p531M7651M0019K0158m5016K6247L7758l1098O0886
$$ plain form
30170 -1188 -35859 -41523 -77962 -29017 -2127 25384 68804 39366 -18668 -54328 -59280 -34635
30158 -34635 -6711 89328 106721 54512 31185 87781 109755 75578 10067 12036 69580 102042
30146 102042 154565 147950 145148 180710 138595 12064 13791 52540 4740 -91442 -72733 -44595
30134 -44595 -13165 25521 -28443 -15706 1929 -5846 -45211 -33692 -1411 22704 -21365 22711
30122 22711 19950 -26756 23249 19738 17469 43316 116359 119961 79780 42984 56901 110916
30110 110916 130363 155280 116606 99679 32557 62854 23054 -14903 -50024 -39484 7061
30099 7061 -8409 -5634 12112 -2842 -15107 9043 64187 35882 57371 87146 68282 10081
30087 10081 14444 -7968 -73467 -80998 -33347 6672 26830 -18186 8061 45819 14721 75607
30075G5607L1214k4823n6397j1659n1566l2982l480l8557r705R6105O8340N2333
30063I4430j7262q7271k5050O026l4070M9018M8316n0909j100n5832l1104O8581
30051c6227O0134p1690k3578M6160j6375M2816J4062o053k5895l472L0379K9253
30039C9514L1839O259Q291m1752l8694p385K1779k6323n1176J9999M9559K7742
30027C9652L4399m718k5275q3010m1629j682R044P886k5329n1552J2877L5231
30015i4106K4966m4535j9353R9098M2968l2831j5822K9277k3895l5139O506L2943
30003b9923M2054j2535j2326L7329M4542n4496n6263m0186M4948O1441q7669K8599
29991c4485P3779O2432m1055R916L773m1508m6428q754N4775L3509N944N795p402
$$ plain form
30075 75607 106821 81998 25601 13942 -37624 -70606 -74086 -112643 -122348 -26243 42097 94430
30063 94430 77168 -10103 -35153 -29127 -63197 -14179 34137 -16772 -17872 -73704 -104808 -36227
30051 -36227 23907 -47783 -71361 -25201 -41576 1240 15302 9249 -16646 -20118 10261 39514
30039 39514 71353 77612 85903 44151 5457 -1928 19851 -6472 -57648 -37649 11910 39652
30027 39652 74051 69333 44058 -38952 -80581 -82263 -73219 -65333 -90662 -142214 -129337 -94106
30015 -94106 -69140 -113675 -133028 -33930 9038 -23793 -39615 -10338 -34233 -69372 -62866 -29923
30003 -29923 12131 -404 -12730 24599 69141 14645 -41618 -81804 -36856 24585 -63084 -34485
29991 -34485 39294 101726 60671 70587 74360 32852 -13576 -22330 32445 65954 71898 77693 70291
29978G0291j3404l349M2729M9645K0972m5481q1492l8263L8493K7092J8430L84
29966H6047j4832j6558n2615N452N9553K4390m2484p456l7094m7377k3340L9139
29954b7175N6514N0247M1706O336o2748p1313k3861N652m6944J0877J9316M8971
29942G578O6074Q4l2104Q216J5013p9764j3276O7283J6553j8347l9996L1364n946
29929B2732n1291o7313k05J1811Q7483K4246k6071m351j5983Q402J9308L1444
29917D0212j3770l0385J1389l122j4436j6148J216L774j0153m5977L5086J9903
29905b2411N8103p237j0422j0157L9967o6771n0036o7718j7478J1937K7217M2677
29893g2329N8922k0995J795J3288L1549L1134P5933n4693n5528j7816j5370P1756
$$ plain form
29978 70291 56887 53538 96267 145912 166884 121403 39911 1648 40141 67233 85663 86047
29966 86047 71215 54657 2042 7494 67047 91437 48953 41497 4403 -42974 -66314 -27175
29954 -27175 29339 79586 121292 127628 64880 -6433 -30294 -24642 -71586 -60709 -41393 7578
29942 7578 73652 73736 41632 49848 64861 -14903 -28179 39104 55657 37310 -2686 28678 22732
29929 22732 -28559 -95872 -96077 -84266 3217 27463 1392 -2959 -18942 -10540 8768 40212
29917 40212 26442 -3943 7446 4324 -10112 -26260 -25044 -21270 -31423 -77400 -42314 -22411
29905 -22411 35692 28455 18033 7876 47843 -18928 -68964 -136682 -154160 -142223 -115006 -72329
29893 -72329 -13407 -34402 -32607 -19319 12230 43364 119297 64604 9076 -8740 -24110 47646
29881D7646K7387m0939l6578K9550k5350n270M8800M3044j7156l8791J3535J5526
29869F1404n8250o1615O4666L4095K3119k3366n0139K7176N8056K3133l490k3037
29857G1752n4609m4414r149M6299k818l8271n7781j49J1226K8874K4170J4132
29845a0738j2143r309j1103K4786L9096K98J5666J9514J984j971P845J7040p3819
29832G146L9468K6746m1905p4000l3294k9033K1381J0493l687Q2861M9748M9472
29820A05396k2813m0350p8090m0948m1775L7868Q2966K6918m5023m2130K0362
29809c7619O499K2406k962o0892j2243P979j3951O6093o073n0936K8110Q1648
29797B8059j1219k1929J233P7614O568l1081o492j6906l4115M2260l262J8756
$$ plain form
29881 47646 75033 34094 -2484 27066 1716 -3554 45246 88290 71134 32343 45878 61404
29869 61404 3154 -58461 6205 40300 63419 40053 -10086 17090 75146 98279 94789 71752
29857 71752 17143 -27271 -36420 9879 7061 -31210 -88991 -89140 -77914 -49040 -24870 -10738
29845 -10738 -22881 -32190 -43293 -18507 20589 20887 36553 56067 58051 56080 63925 80965 7146
29832 7146 46614 73360 31455 -42545 -75839 -104872 -83491 -72998 -76685 6176 55924 105396
29820 105396 82583 42233 -35857 -76805 -118580 -80712 2254 29172 -15851 -57981 -37619
29809 -37619 -31120 -8714 -11676 -72568 -84811 -76832 -90783 -24690 -30763 -81699 -53589 28059
29797 28059 16840 -5089 -3856 73758 80326 49245 42753 25847 -8268 33992 30730 49486
29785D9486j6715m8409l1029N3954K1139k0369l7293l3460o6069N059O8160O2170
29773F624j1797q222N3798L3859k5100p9191m0816l9791Q922K64j5026L8544O1848
29760a6084K006j8709L4862M6192K7650m3168m070L104J0510l883N0077j8135
29748G0352n3051p838l3867p358q378L060m3075K5514L9304L8683R598k4429m363
29735D152k4157M5094M9627N3720M794n7204k5347K861J086n1432j5460l526K3965
29722H173L492K4377O350j4589j9344j2585q355l4398O0784P0522J3526j13643
29710a5690j7353O0282r429m5034j4458j2746O08m752K4304J5360m2908j0938
29698g2754M5691L2729l9585j3197J8704p256m9559l1314J6864Q3606N2268k9756
$$ plain form
29785 49486 32771 -15638 -46667 7287 28426 8057 -29236 -62696 -128765 -123706 -55546 6624
29773 6624 -5173 -13395 40403 74262 49162 -30029 -70845 -110636 -101714 -101450 -116476 -77932 -16084
29760 -16084 -14078 -32787 2075 48267 75917 32749 28679 31783 42293 38410 88487 70352
29748 70352 17301 9463 -24404 -31762 -40140 -37080 -80155 -54641 -15337 23346 32944 8515 4152
29735 4152 -20005 25089 74716 128436 133230 76026 50679 53540 54626 3194 -12266 -15792 8173
29722 8173 11665 36042 42392 27803 8459 -4126 -12481 -46879 13905 84427 97953 -15690
29710 -15690 -33043 27239 17810 -27224 -41682 -54428 -53820 -58572 -34268 -18908 -61816 -72754
29698 -72754 -27063 5666 -33919 -47116 -28412 -35668 -85227 -116541 -99677 -16071 36197 6441
29686F441L663M5991M1838N8363m7339n1460p7018k9443K4889K6072k4115n437
29674b7555j3563r4175K7818K7236J6160K5727O0759P0474N4576J2912o8711k6235
29662F5423m0750k9037n747n5795M0655R101k1756k2469O981Q1557q485m5340
29650b5662l2495K4738L4987J0790j7509m347K6553l3827n3356L1663j3559M4978
29638g046J5808K2233m5905j5799M6305K6968l549n527r771k5412j7326J8873
29626a48J6198K0751j2134M7879j1135M0137o002p5529m1993K0533O5241M3279
29614A07077P757m7111q2216k8461j4345k4M1939k0605p6555r734J3049J4086
29602i5143R5885N1338J4004l6502o9894j2455O7646L8874n7461n6658m968J7563
$$ plain form
29686 6441 10104 56095 97933 156296 108957 57497 -19521 -48964 -24075 1997 -22118 -27555
29674 -27555 -41118 -135293 -107475 -80239 -64079 -38352 22407 92881 147457 160369 91658 65423
29662 65423 24673 -4364 -10111 -65906 -25251 -16150 -37906 -60375 -53394 28163 19678 -25662
29650 -25662 -58157 -33419 1568 12358 -5151 -9498 17055 -16772 -70128 -38465 -52024 -7046
29638 -7046 8762 30995 -14910 -30709 15596 42564 39015 33488 23717 -1695 -19021 -148
29626 -148 16050 36801 24667 72546 61411 101548 95546 20017 -21976 -1443 63798 107077
29614 107077 114834 67723 -14493 -42954 -57299 -57323 -15384 -35989 -112544 -122278 -109229 -95143
29602 -95143 742 52080 66084 29582 -40312 -52767 14879 53753 -3708 -60366 -65334 -47771
29590d7771K5776K0069j1683j6411M1395O155K9697l3880j10271o9607L2066N0592
29578h3873O5174N3902k734j0477j3349p6382J6360J2041L4792L6783J9809k9756
29566B2290r066L1125m7739K835j2454l8181M5555M6761M1817k1734k4596n6586
29554a9973j654k2183p535j8581l1705r472L5430K3834L3488P3071k4443J1607
29542D1884j01003k6962P2922N9060O169p753k2531k5611N4852M3334j3685m4035
29530C6641J4118p927l2045k6249J267K4595L784J935k8817K3200L7708j9846
29518B8364o2403k6569o784J8029O8234l988O35L2016P1419K2746k7206K974l2826
29505H4641m8238p1042L0166l615K9256K7268L8561l7253l5978l1906J7262K1134
$$ plain form
29590 -47771 -21995 -1926 -13609 -30020 11375 17530 47227 13347 -96924 -166531 -134465 -83873
29578 -83873 -18699 35203 32469 21992 8643 -67739 -51379 -39338 -4546 32237 52046 22290
29566 22290 13224 44349 -3390 -555 -13009 -51190 -5635 41126 82943 61209 36613 -19973
29554 -19973 -21627 -43810 -51345 -69926 -101631 -111103 -75673 -51839 -18351 54720 30277 41884
29542 41884 -59119 -86081 -13159 45901 52070 44317 21786 -3825 51027 94361 80676 36641
29530 36641 50759 42832 10787 -15462 -14195 10400 14184 16119 -12698 10502 48210 28364
29518 28364 -34039 -60608 -67392 -49363 18871 14883 15518 47534 118953 141699 114493 117467 84641
29505 84641 36403 -34639 -4473 -8088 21168 48436 86997 49744 13766 -18140 -878 20256
29493B0256J2270L00k2399P91k4638J7346M8788m1995j6318r90p119O7369P4161
29480A27822J8243j5211o2630N6910J35l5475j5466K5696p7448Q639j2286K3745
29468D2674O0813N22Q447j5701Ml4287l7069N193k1712j5421L2963K4439R072
29455E9937r509J558m351J2602J9674N598l4766n4403m3309K768k2614K802J4749
29442d9264L1287O0331r027m0599n6360L197M4190k2682l102N0210l7875J2386
29430a7308j6243m526j2663M0155m0133L6259L9956l280p9874k0851m038L1748
29418e0798k0321K0676L7159J963j6598L169q440M4047m3078l8667j0505N6668
29406b4725Q2081J8594K4163q600K6960l169J7041j2747o7286n2966o8647m6998
$$ plain form
29493 20256 32526 32826 10427 11218 -13420 3926 52714 10719 -5599 -6589 -13708 53661 127822
29480 127822 146065 130854 68224 125134 125269 89794 74328 100024 22576 31215 18929 42674
29468 42674 103487 104009 112456 96755 96759 62472 25403 30596 8884 -6537 26426 50865 59937
29455 59937 50428 51986 47635 60237 79911 85509 50743 -3660 -46969 -44201 -66815 -64013 -49264
29442 -49264 -17977 42354 33327 -7272 -63632 -60435 -16245 -38927 -42029 8181 -29694 -17308
29430 -17308 -33551 -38077 -50740 -10585 -50718 -14459 25497 22217 -57657 -78508 -82546 -50798
29418 -50798 -71119 -50443 -13284 -11321 -27919 -24750 -33190 10857 -32221 -70888 -81393 -24725
29406 -24725 57356 75950 100113 91513 118473 115304 132345 119598 52312 -654 -69301 -116299
29394a16299N7606O077N3327M3526n5125p833p200o2610Q7085O5221k4874j3567
29382B5334q754J0072m3612o9218m759L2770M8271N2065m9484L726P1236K0995
29370H8642k1548k9409n2783r0249l4274M0402O3143K9420L0698P816o9734l6674
29358g4550m4775J0017O8391R3724p874l0546k9455J7007L480M918o2304m207
29346e6174j3224L0607R095m3390n2842k1554K2599M8357M42M3673P238k1298
29334d6471k8329J9598K8884O092J7950O5200k9996m7946J4611K5903m2667K428
29322a4743Q3765L2075J1573j7020l9184n7045L7348Q377o241o2013m2678M643
29310f1143P4191J5277J4891J0061J9552j2898j4458j3682j0800L884J567K7597
$$ plain form
29394 -116299 -58693 -52616 711 44237 -10888 -18721 -25921 -88531 -1446 63775 38901 25334
29382 25334 16580 26652 -16960 -86178 -90937 -58167 -9896 42169 -7315 -3589 67647 88642
29370 88642 67094 37685 -15098 -105347 -139621 -99219 -36076 -6656 24042 31858 -37876 -74550
29358 -74550 -119325 -109308 -40917 52807 44933 14387 -15068 1939 5419 10337 -51967 -56174
29346 -56174 -69398 -38791 -29696 -73086 -125928 -147482 -124883 -76526 -76084 -32411 -25173 -46471
29334 -46471 -74800 -55202 -26318 -20226 -2276 62924 32928 -15018 -407 25496 -17171 -14743
29322 -14743 69022 101097 112670 95650 56466 -579 36769 45146 38905 -23108 -65786 -61143
29310 -61143 13048 28325 43216 53277 72829 59931 45473 31791 20991 24875 26442 54039
29298E4039N7741k1538n6667n9501l3841M2555K9953N0931P5517n682r266K0650
29286A44891q8298o5837K6662N8597n782P505J088k9519J9499p074l138L5310
29274I3904k471l4445p3678k9914j2806k420j2925J528P3345K4834K5014M9328
29262I9294K9154p1969o1813o0587J6856k658R1781L7957k7757j5911j0943L5157
29250E8561n302q6785P630N6168N757l0646N9400k50l2034l6127l2713L6261j337
29237a417m8125j6452k7580j7355k5570K8274j7552K597J3416L0607N2881K5339
29225i37n4820j3116j9424k990N9485k4283r808l5863k1247O2988j1496K2028
29213d9483L3149O3764J5427K6664m5304l9628o107l0491k783K9465J1222m291
$$ plain form
29298 54039 111780 90242 33575 -25926 -59767 -17212 12741 63672 139189 133507 124241 144891
29286 144891 56593 -9244 17418 76015 70233 77738 78826 49307 68806 61732 58594 93904
29274 93904 91433 56988 -16690 -46604 -59410 -61830 -74755 -73227 118 24952 49966 99294
29262 99294 128448 56479 -5334 -65921 -49065 -51723 40058 78015 50258 34347 23404 58561
29250 58561 53259 -33526 -25896 30272 36029 5383 64783 64533 32499 -3628 -36341 -80 -1417
29237 -1417 -49542 -65994 -93574 -110929 -136499 -108225 -125777 -123180 -109764 -79157 -26276 -937
29225 -937 -55757 -68873 -88297 -91287 -31802 -56085 -65893 -101756 -123003 -60015 -71511 -49483
29213 -49483 -16334 47430 62857 89521 44217 4589 -1518 -32009 -34792 -5327 5895 1604
29201A604O660k0719n7348l5055K5328K5283j4605L2644L8541J307K6454L088
29189C3182k936j0333J4073j0149M4476j9046N4246m7818n7083m556J7191P222
29177A8469k4925L7999L6693k9228m1845k8176K5234J4450M607J0986l5214M2580
29165C1630Q907R312L3430m3011K095j3299n0693j1083K9516P971K5156m9206
29153a9275q643l7750j0412M1040K6021J02409K0431q1788n9109k0727l7562M1380
29141d3985j50J8162l6424J8175M0030N677J3456j5424M7877K4803k4467l0377
29129A7353k4181R830R4306N9909p1150p0666L6368M0231K3442M546J0203k2559
29117A07632m5043l7992J2621J3397q599l623J571p8687p2325K4814L1239O4608
$$ plain form
29201 1604 8264 -12455 -69803 -104858 -79530 -54247 -68852 -36208 2333 3640 30094 33182
29189 33182 30246 19913 33986 23837 68313 49267 103513 55695 -1388 -5944 11247 18469
29177 18469 -6456 31543 68236 39008 -2837 -31013 -5779 8671 13278 24264 -10950 31630
29165 31630 40537 49849 83279 40268 42363 29064 -21629 -32712 -3196 4775 29931 -19275
29153 -19275 -27918 -65668 -76080 -35040 -9019 93390 113821 32033 -27076 -47803 -85365 -43985
29141 -43985 -44135 -25973 -62397 -44222 -4192 1485 14941 -483 47394 72197 47730 17353
29129 17353 -6828 3002 97308 157217 86067 15401 51769 92000 115442 119988 130191 107632
29117 107632 62589 24597 37218 50615 42016 38393 39964 -38723 -111048 -86234 -54995 9613
29105I613Q1767l0523p9149M9338M7481k6018M949P789n1105n232J9912J7145
29093D5967j977p189k7302J6012N2194j4114k7969j2513J1955k7697l9865m8465
29081h0963o6213K8353J5062P613N2264M1064l7261N2002K8858J7093m1357r3605
29069g7090p0894M3628L9678n342K6319K92j9849m6285l1568P5063K5988j510
29057d1570m460L081l4028L0048o1503p629M2336P576p265J186P15j1178K7004
29044e5687P526R101j3908k8813J6756Q4011K4174J7306K477k6177Q189J5983
29032F0938R833k6717l7226k9518m7741n6515K6979O5759J2753q364n1337k6358
29020a07514M6836O4253R0333K3263l6913k0759j0699J4106L1163K059k5850m4538
$$ plain form
29105 9613 91380 60857 -18292 31046 78527 52509 57458 65247 14142 8910 28822 45967
29093 45967 43990 36801 9499 25511 77705 63591 35622 23109 35064 7367 -32498 -80963
29081 -80963 -147176 -118823 -103761 -96148 -43884 -2820 -40081 11921 40779 57872 16515 -77090
29069 -77090 -147984 -104356 -64678 -70020 -43701 -43409 -63258 -109543 -141111 -66048 -40060 -41570
29057 -41570 -46030 -42949 -76977 -46929 -108432 -116061 -73725 -66149 -73414 -72228 -71513 -82691 -55687
29044 -55687 -48161 -39060 -52968 -81781 -65025 18986 43160 60466 62943 36766 44955 60938
29032 60938 70771 44054 6828 -22690 -70431 -126946 -99967 -34208 -21455 -29819 -81156 -107514
29020 -107514 -60678 3575 93908 117171 80258 59499 48800 62906 94069 96128 70278 25740
29008B5740m2219k0997n334K6268L6100L135j5563j1846J401K6736n2246k8350
28996e7175N2754j8927L7244p08l0127l8274L2948k3151l3895M9750L2151l0708
28984b8118j3392j0286k4550k2786l1808J4982R2745K6975j8705M4038J4193m4325
28972a037K3722L3177J4204L1450j8086Q412k7801n0457j5846j2539M6489M0337
28960G2025l0238L1382k9305k2588J1955L4129K8791j9336o2519Q256K767o1470
28948c6151J3392J2825n4977j8604N9484P5696q011L7274O517l710R126J4956
28936A07817J8385k0390m1374j1577P6940M3619o463p5638n2351J331L0754k016
28924F9037o3817j07622O9194N9968L6103j8636j2286j3348J2730l319k1409J3778
$$ plain form
29008 25740 -16479 -37476 -42810 -16542 19558 22693 7130 -4716 -3315 23421 -28825 -57175
28996 -57175 -4421 -23348 13896 13188 -16939 -55213 -22265 -45416 -79311 -29561 2590 -28118
28984 -28118 -41510 -51796 -76346 -99132 -130940 -115958 -23213 3762 -14943 29095 43288 -1037
28972 -1037 22685 55862 70066 101516 83430 91842 64041 13584 -2262 -14801 31688 72025
28960 72025 41787 73169 43864 21276 33231 67360 96151 76815 14296 22552 25319 -36151
28948 -36151 -22759 -9934 -64911 -83515 -24031 51665 43654 80928 87445 83735 92861 107817
28936 107817 126202 105812 64438 52861 129801 173420 166957 91319 38968 40299 71053 69037
28924 69037 5220 -102402 -33208 26760 62863 44227 31941 18593 31323 28004 6595 20373
28912B0373K6978l3262P8419K8256k8729k9772l1881j1748l6214L0882M0750n750
28900D8302m8947o729j9129p290M5009L4210k2931j6984L8859Q449K8421m1957
28888C9283l7584O3727L5843k4306K9863k878k5395N546M2429N781k6406k2466
28876H3437k9695m6372M4393L1893j793j0149l6052n9648m0550p932J9635K1906
28864c0927M5426L2230j07780l9079N8355j8707n5232N6387R7736K7296l7486
28853B8219M937K4988n5826m2963J188k0916R509L3484r516k1430j7307k7479
28841i3112N6257O2453j5857o1686K1277j5632r547N7595M2588j6679k9335N0605
28829D8927k1316j7394J7476N2155K7755K5447l2669k6201J015k4622n9317l4118
$$ plain form
28912 20373 47351 14089 92508 120764 92035 62263 30382 18634 -17580 13302 54052 48302
28900 48302 -645 -7374 -26503 -33793 11216 45426 22495 5511 44370 52819 81240 39283
28888 39283 1699 65426 101269 76963 106826 103948 78553 84099 126528 132309 105903 83437
28876 83437 53742 7370 51763 83656 81863 71714 35662 -23986 -64536 -72468 -52833 -30927
28864 -30927 14499 46729 -61051 -100130 -41775 -60482 -115714 -59327 38409 65705 28219
28853 28219 33156 58144 2318 -40645 -39457 -60373 -50864 -17380 -26896 -48326 -65633 -93112
28841 -93112 -36855 25598 9741 -51945 -30668 -46300 -55847 1748 44336 27657 -1678 48927
28829 48927 27611 10217 27693 79848 107603 133050 100381 74180 75195 50573 -8744 -42862
28817d2862j6130L4379J4185k5982k5539P799j1860p701J2025k7713K4783O3842
28805g74l1607k1831J4236M0644j7157j8378K6613K1122j4865l6546L0118N1140
28793D2715n13j2010m2978l7659J572j4992L1266J1467K7638P5956N3195l6479
28781I9178r8223l6913l898k815j325p1056p629L5448O1455J6581J2690Q084P1294
28768H2871J3412m1755k0593k918N3659K3106j4469j4085J8189k3706Q897Q669
28756I1277l0313O707k5922J6928j9583l4994k174o952m6350L7921q908N3840
28744C1477K8772l0532o7208m102n76J0255m0284l4115R484O4770M1843m2984
28732c3200l3270M1490j2704m5053q793M8718P7151j1717j327k6271k1637J710
$$ plain form
28817 -42862 -58992 -24613 -10428 -36410 -61949 -54150 -66010 -73711 -61686 -89399 -64616 -774
28805 -774 -32381 -54212 -39976 668 -16489 -34867 -8254 12868 -1997 -38543 -8425 42715
28793 42715 42202 30192 -12786 -50445 -48873 -63865 -32599 -21132 6506 82462 135657 99178
28781 99178 955 -35958 -39856 -42671 -43996 -115052 -122681 -87233 -25778 -9197 3493 11577 82871
28768 82871 96283 54528 33935 31017 84676 107782 93313 79228 97417 73711 82608 91277
28756 91277 60964 67671 41749 58677 39094 4100 1926 -5026 -51376 -13455 -22363 31477
28744 31477 60249 29717 -37491 -41593 -42169 -31914 -72198 -106313 -96829 -32059 9784 -33200
28732 -33200 -66470 -24980 -37684 -82737 -91530 -42812 34339 22622 21295 -4976 -26613 -24903
28720b4903M6659J686j0022l2225R965l0663p229P1869M6161k0089n2208K6053
28708B5054j6853k5140j9885j3037%M38j1967o825M7329M7815j3232l6513o954
28695b9770j8627K737j669l824N177o875k9248j0203k7479L2235M0446L0185m929
28682b1844k6937l10M995N9226k1249P142j8426p897o0100k5414O6987M9109m1547
28669c6265K7761N2311L9355k9985m8195n9303N3546P1427q663p4600k2817N4045
28657A8617l3022J802P204j772L7841n107n420j2361k9855l8187L0127L293j9670
28644d6510k217N1413J4585M50K3788r374n7061k3365J207J0848n2230M2081M9321
28631B936l3581r2111l2115R7758L6360j279n798K3303K5807J152K4797Q2916
$$ plain form
28720 -24903 21756 23442 13420 -18805 -8840 -39503 -46732 25137 71298 51209 -999 25054
28708 25054 8201 -16939 -36824 -49861 -49861 -49423 -61390 -68215 -20886 26929 13697 -22816 -29770
28695 -29770 -48397 -45660 -47329 -51153 -45976 -52851 -82099 -92302 -119781 -87546 -47100 -16915 -21844
28682 -21844 -48781 -49091 -44096 15130 -6119 1023 -17403 -25300 -85400 -110814 -43827 5282 -36265
28669 -36265 -8504 43807 83162 53177 4982 -54321 -775 70652 61989 -12611 -35428 18617
28657 18617 -14405 -12603 -5399 -7171 30670 25563 20143 7782 -22073 -60260 -30133 -26840 -46510
28644 -46510 -48727 2686 17271 17721 41509 32135 -24926 -48291 -47084 -36236 -88466 -46385 2936
28631 2936 -30645 -122756 -154871 -57113 -20753 -22032 -27830 -4527 21280 22432 47229 130145
28619A30145j6859m2284J450m623J5471n4954j4494j1066M8420l4646l1112M669
28607i883m5191m4056L9673P5659J4212j99J7653Q12k7590k5288n913J1974Q067
28594I930l0757K7398O3473j0470m6992j8671K7748j2594J5241M0866n1633q217
28582E322K6292L1599j9190n175p775j6024J6306J5309M7789j5013k1470J1338
28570F9308m0110n0484M5211P7084o9016q2838O254j6008m36N6265O6445J0742
28558G2417m7873j3864k4965L7787K9551q714l5653r0050L128M0469j2449l1190
28546h1406J6496m843K0659K6784l360j5302o4193M9002J1671M2984P910M5430
28534E1832l8419m2178R50L9742l8553k9722R360O7487J7607n4729L5699M5973
$$ plain form
28619 130145 113286 71002 72452 67829 83300 28346 13852 2786 51206 16560 -14552 -9883
28607 -9883 -55074 -99130 -59457 16202 30414 30215 47868 48680 21090 -4198 -10111 1863 9930
28594 9930 -20827 6571 70044 59574 12582 -6089 21659 9065 24306 65172 13539 5322
28582 5322 31614 63213 44023 38848 31073 15049 31355 46664 94453 79440 57970 69308
28570 69308 29198 -21286 23925 101009 31993 -50845 -44591 -60599 -61035 -4770 61675 72417
28558 72417 24544 10680 -14285 23502 53053 44339 8686 -81364 -78236 -37767 -50216 -81406
28546 -81406 -64910 -69753 -49094 -22310 -25670 -40972 -105165 -56163 -44492 -1508 6402 51832
28534 51832 13413 -28765 -27815 11927 -26626 -56348 -46988 20499 38106 -16623 19076 65049
28522F5049l1284m8028K4576P305N797J8658m6706k9609j6354j4929K7672N8422
28510B0569K1095p005Q329J5132k4064p2824J7843N411L563O3905j763p339Q572
28497E1424k0713j9277J1941j4202k4221R289M7185j0698K5097o1634l1029r826
28485d6664L9089J0187J9515p862p023l0305N1152P9014K9113k9684m4613j1015
28473E0904k5160m0977m376N788K0798L4461j8309k4283L8442M2582M9399m8714
28461H0555m820j1657p683l0318L382m6748l3342j3438L9530N3887K7380p732
28449D8996r7127J4646P8793J3621l0988k511p1130j5652L5023J742Q0442O9588
28437A25443J8907q959m8484L3079O3919m3335l5590m5116l6006k7247l4349n0027
$$ plain form
28522 65049 33765 -14263 10313 17618 23415 42073 -4633 -34242 -50596 -65525 -37853 20569
28510 20569 41664 34659 42988 58120 34056 -38768 -20925 -15514 -11951 51954 50191 42852 51424
28497 51424 30711 11434 23375 9173 -15048 -5759 41426 30728 55825 -5809 -36838 -46664
28485 -46664 -7575 2612 22127 14265 7242 -23063 28089 107103 136216 106532 61919 50904
28473 50904 25744 -15233 -19609 -13821 6977 41438 23129 -1154 37288 79870 129269 80555
28461 80555 75735 64078 56395 26077 29459 -17289 -50631 -64069 -24539 29348 56728 48996
28449 48996 -48131 -33485 45308 58929 27941 25430 -45700 -61352 -26329 -24587 55855 125443
28437 125443 144350 135391 86907 119986 183905 140570 104980 59864 23858 -3389 -37738 -87765
28425h7765N0007K3788N678p393q8385n0350M3699Q1169N6807p338j8737J5524
28413A6704J5368j7322L1627M6491o8052p6732N8683N6181J0878l9263l9527O864
28401A900J1445J5649N3837l386n2858M0282m8736k5873p27k1382P8199o456m0893
28388A001K3862J9481O253L9942O156J5469l0436k4099m9661n851o3790n4572
28376a16245K4056M2914L3887l9818J3948K8720L2874j0219k3228l6966l3593
28365h3670L0756J1555q910j560J7442J2170L7532j6141J9742K4332n9564l7182
28353e3498N4657P123K3398J5143M5319J2134o8423K3019J7253J370k2030K809
28341E8274r801L8417N3895p1382o939L370j4805K0356l9812N304o506J8684r364
$$ plain form
28425 -87765 -37758 -13970 -8292 -15685 -104070 -154420 -110721 -29552 27255 19917 1180 16704
28413 16704 32072 14750 46377 92868 24816 -51916 6767 62948 73826 34563 -4964 1900
28401 1900 13345 28994 82831 79445 26587 66869 18133 -7740 -8467 -29849 48350 41894 1001
28388 1001 24863 44344 50597 90539 96695 112164 81728 57629 7968 2117 -61673 -116245
28376 -116245 -92189 -49275 -15388 -55206 -41258 -12538 20336 10117 -13111 -50077 -83670
28365 -83670 -52914 -41359 -50269 -51829 -34387 -22217 15315 -826 18916 43248 -16316 -53498
28353 -53498 1159 8282 31680 46823 92142 104276 35853 58872 76125 77495 55465 58274
28341 58274 48473 86890 140785 69403 62464 65834 51029 71385 31573 36877 30371 49055 39691
28328C9691J0207k0733k7350o6287Q026N8176k696m1421L6659N2959l4215m272
28316H744K345j7224l3463J6478L1742K0326j3341J242M5597O4230L2391l6355
28304A22712p1603J9571r927j2856M0404M0729p0762j1389o844o2650l5471K905
28292e5181N8534L5891O7333M7277j1809L1614Q083p3678n0205j9435o699J2617
28280D4342j6224l4634o1974Q214j3025k3258K3043Q7935N2578j7935j2689J5647
28268E2020o2428j180K9849L902j9143N2109k1892N1615K7721k1070j0140k5095
28256E6268q1594n5488l9393J1959J9828M7422O04k290K1634O2384L806p213l0345
28243G582k1690L6905K0352J9751l9956J2766M907L6419M2758M1934J3090m6340
$$ plain form
28328 39691 49898 29165 1815 -64472 -56446 1730 -966 -42387 -5728 47231 13016 8744
28316 8744 11089 -6135 -39598 -23120 8622 28948 15607 16849 62446 126676 159067 122712
28304 122712 51109 70680 60753 47897 88301 129030 58268 46879 40035 -22615 -58086 -55181
28292 -55181 3353 39244 106577 153854 142045 173659 181742 108064 57859 38424 31725 44342
28280 44342 28118 -6516 -68490 -60276 -73301 -96559 -73516 14419 66997 49062 36373 52020
28268 52020 -10408 -11588 18261 22163 3020 55129 33237 84852 112573 91503 81363 56268
28256 56268 -25326 -80814 -120207 -108248 -88420 -40998 -40394 -42684 -21050 41334 45140 37927 7582
28243 7582 -14108 22797 43149 62900 22944 35710 40617 77036 119794 161728 174818 128478
28231A28478n1959m6387k1557m771j0641L1823n5631l3462m388L1510k5737q955
28219g1677k425K5653J3433L0644R350l9880K6669J9088j5926l4678j7158N3812
28207c095J3858m5211J3373p6198k3924K2404K0925K9011J0537q8338P581j4209
28195a33286j2517o763O4426K1083K8760K4513J1827p609N0426j2008n1603J4768
28183g983K3273k2654l5331n7359R641K8666M6740j7197k0418L5088M446M9881
28171C6793j5506K897M6872l6728m9062o2134J0995M3772L0347Q891l4622n3544
28159g1029P2807L0165n733m120K6089j506k4722l1478n4696K3583K315J4061
28147b4264M3212m2371l8463M1562P5893q508p8911k3142j2577J6861M3851K8341
$$ plain form
28231 128478 76519 30132 8575 3804 -6837 24986 -30645 -64107 -68495 -36985 -62722 -71677
28219 -71677 -74102 -48449 -35016 -4372 4978 -34902 -8233 10855 -5071 -39749 -56907 -3095
28207 -3095 10763 -34448 -21075 -97273 -121197 -98793 -77868 -48857 -38320 -126658 -119077 -133286
28195 -133286 -145803 -152566 -88140 -67057 -38297 -13784 -1957 -9566 40860 28852 -22751 -7983
28183 -7983 15290 -7364 -42695 -100054 -90413 -61747 -15007 -32204 -52622 -17534 -13088 36793
28171 36793 21287 24184 71056 34328 -14734 -76868 -65873 -22101 8246 17137 -17485 -71029
28159 -71029 1778 31943 26210 22090 48179 46673 21951 -9527 -64223 -40640 -38325 -24264
28147 -24264 18948 -23423 -61886 -20324 55569 47061 -31850 -54992 -67569 -50708 -6857 21484
28135B1484k1581l9267n696J9718J4175k1927J6684j5887m6936j1356j4930M2659
28123f2860K2456J0490n8102l2774M6330J8310P3176P5745N4168o8636j24209
28112d5906o7931Q6709N5485k3620j0848q841k4338J5608K0453l326Q801n4675
28100e2429m7536J9252M4199J8538j2592l5201K6317R1610j6818K128o7644o3767
28088i3943R505L8100P836L7703P276r868N7097O9375j150p1924l1187o1158r416
28075e1754P1449N1055j7454n664k686J9723L5474k4731q940l8388k5241j180
28063A663J0165j1520J9134P9372M0707n8830m2070o0736N724M6254j1339j9723
28051a199R484L2684N359K053J2654Q0551p479l0264J7974k1735m875l4707l5112
$$ plain form
28135 21484 -97 -39364 -45060 -25342 -11167 -33094 -16410 -32297 -79233 -90589 -105519 -62860
28123 -62860 -40404 -29914 -88016 -120790 -74460 -56150 17026 92771 146939 78303 -45906
28112 -45906 -113837 -27128 28357 4737 -6111 -14952 -39290 -23682 -3229 -6555 2246 -52429
28100 -52429 -99965 -80713 -36514 -17976 -30568 -65769 -39452 52158 35340 37468 -30176 -93943
28088 -93943 -84438 -46338 -38502 -799 6477 -3391 53706 123081 121931 50007 18820 -42338 -51754
28075 -51754 19695 70750 53296 47632 44946 64669 100143 75412 66472 28084 2843 1663
28063 1663 11828 308 19442 98814 139521 80691 38621 -22115 -16391 29863 18524 -1199
28051 -1199 8285 40969 46328 48381 61035 141586 134107 103843 121817 100082 95207 60500 25388
28038B5388l5544j442m4154l7147K7909R0060l8551k0851M4302K0125K1824m6260
28026E659P005J527j8721k0191M6304L7859l6280K2267L2877k0814n003l2963
28014A9526l0239K1992l6226j6569K6216N0876q32q928K0479M432p7932O6742
28002C9537N8856k0265j1408n2946m2066L557j3356N3604J8708M0572n0097m725
27990A9971O1873o060k1498O675N289l7569n0529k6L3663N1698K7864o2970n4841
27977b6460j2844M8083j7390K8703L9250K2368M7267k4874r332k9099K4101k397
27965H7376N876q7741p5425M8395L1570j097n4716M3689J1739J8651K4193j0646
27953D1864J628j2264l8008m0992J5042M984r378J9006J4545R226j643n1783l4967
$$ plain form
28038 25388 -10156 -11598 -55752 -92899 -64990 25070 -13481 -34332 9970 30095 51919 5659
28026 5659 12664 14191 -4530 -24721 21583 59442 23162 45429 78306 57492 52489 19526
28014 19526 -10713 11279 -24947 -41516 -15300 35576 34744 25816 46295 50727 -27205 39537
28002 39537 98393 78128 66720 13774 -28292 -24735 -38091 15513 34221 74793 24696 19971
27990 19971 81844 75784 54286 60961 66250 28681 -21848 -21874 11789 63487 91351 28381 -26460
27977 -26460 -39304 8779 -8611 20092 59342 81710 128977 104103 94771 65672 89773 87376
27965 87376 93252 5511 -69914 -21519 10051 8954 -45762 -2073 9666 28317 52510 41864
27953 41864 43492 31228 -6780 -47772 -32730 -27746 -37124 -18118 -3573 5653 4010 -47773 -82740
27940h2740p780L2455N7076p343L0345m9809k4236K5964L439L2302l6398n4837
27928h1562P6258O0098k2015m5622J5447n171j3727k7796n120j4458L0711J6846
27916a6111P4969L6380m8988l5450M6787K4568m9156l751n71o2560l6034J0814
27904e9103O4369K750k1130o555m856K4249K5351L1801m5786j772j618p810o0964
27891f1074k5270N0499j4204O325N6503K6108l6740K0811J1240L7282M0731k049
27879A10162j8158m8936k0622o06k7977l5880K6350L2388J0084p729k2275j742
27867d941j1481j735n6236n8189J5445M5248l4236P23O3495J3699R0548K7765
27855I0105L311n6486m1723K5611J3211l265L106k4421o8077K4638N8926J6549
$$ plain form
27940 -82740 -90520 -58065 -989 -8332 22013 -27796 -52032 -26068 -22629 9673 -26725 -81562
27928 -81562 -5304 54794 32779 -12843 2604 -2567 -16294 -44090 -49210 -63668 -32957 -16111
27916 -16111 58858 95238 46250 10800 57587 82155 32999 29248 28677 -33883 -69917 -59103
27904 -59103 5266 8016 -13114 -19669 -24525 -276 25075 56876 11090 9318 7700 -110 -61074
27891 -61074 -86344 -35845 -50049 -43724 12779 38887 2147 22958 34198 71480 112211 110162
27879 110162 92004 43068 22446 21840 -6137 -42017 -15667 16721 26805 19076 -3199 -4941
27867 -4941 -16422 -18157 -74393 -132582 -117137 -71889 -106125 -105402 -41907 -28208 62340 90105
27855 90105 93416 36930 -4793 20818 34029 30764 33870 9449 -58628 -33990 24936 41485
27843D1485o1187k0189K523l824M9243N292J116k2798L4600o007j3813N5466K6230
27830H8137k8030j6201K0032q9981J8840M6573M4516l3393o7807J701P860l3744
27818d1497l7002M0353P976O2487M6100K7202k1172n8624j8230k7699L0898j0094
27806F98m1781j1004J9542K1932l1335M2972M556r382K9072p626j7323l6871n451
27793d2001j9625j3928L0632J1483k4812J4650L9696j088M138P5407L500M219
27781H2271k2516J1329l8468r247K2418j740m1472j8161L7235O0059M5566o879
27769A20395K1398j4279q71N78m8653k5364k3273j4035J3847O5060q1485q3705
27757g0387J8076P3494j1233j5326m3524K2877J3969L4312o7149k7180L6116M3636
$$ plain form
27843 41485 -19702 -39891 -37368 -41192 8051 13343 14459 -8339 26261 20254 6441 61907 88137
27830 88137 60107 43906 63938 -26043 -7203 39370 83886 50493 -17314 -15613 -7753 -41497
27818 -41497 -78499 -38146 -30170 32317 78417 105619 84447 25823 7593 -20106 10792 698
27806 698 -41083 -52087 -32545 -10613 -41948 1024 5580 -3802 25270 17644 321 -36550 -42001
27793 -42001 -61626 -75554 -44922 -33439 -58251 -43601 -3905 -4993 -855 74552 78052 82271
27781 82271 59755 71084 32616 23369 45787 44047 2575 -15586 21649 81708 127274 120395
27769 120395 141793 127514 126643 127221 78568 53204 29931 15896 29743 94803 13318 -70387
27757 -70387 -52311 21183 9950 -5376 -48900 -26023 -12054 22258 -44891 -72071 -35955 7681
27745G681k6396K52L4865K0516L5860M802p6407k8784j6034K1196P2941P4864
27733A25356Q1091l7568l8049n9085n1012L4298J6677K8329m0606k205k4290n7440
27721b4504K9727L9523J6788k13k6019P2563K0889n7050m519J2831K1815j0322
27709I1509k0406M157j1476K438p68j2564o9969J0935L1991N737j9064n1872k039
27696d1391P0553J3418N4112K594l0800l3064o9749k2217M2391J6671k0318J1080
27684f720J9906k0453l8527M1414m9239n0905M7890N2098J9707n379l9166n2756
27672h2130K6025J7543M9881R1985P0122L3480o637q3866J663N447L3822K5327
27660A82662m4689o8690j6772k8053l0539J9705k3638m8422J6419l0795k4475
$$ plain form
27745 7681 -18715 -18463 16402 36918 72778 77580 1173 -27611 -43645 -22449 50492 125356
27733 125356 206447 168879 130830 71745 20733 55031 71708 100037 59431 57226 32936 -24504
27721 -24504 5223 44746 61534 61321 35302 107865 128754 71704 67185 80016 101831 91509
27709 91509 71103 75260 63784 66222 65454 52890 -17079 -6144 25847 31584 12520 -39352 -41391
27696 -41391 29162 42580 96692 99286 68486 35422 -34327 -56544 -14153 2518 -17800 -6720
27684 -6720 13186 -7267 -45794 -4380 -53619 -104524 -56634 -4536 15171 9792 -29374 -82130
27672 -82130 -56105 -38562 11319 103304 173426 206906 200269 116403 118066 123513 157335 182662
27660 182662 137973 69283 52511 24458 -6081 13624 -10014 -58436 -42017 -72812 -97287
27649i7287J6535J1387P4257L957k2097J9061l5777m6035P9018K6082k7487N578
27637G192m182k4040j9429J9009L5723J6516p2562j7938J1339m213j9376J0796
27625f1165n668J2452J9949k9746L2906M0394R282J8721k6908j5736k9570j2465
27613d7554K4606L8085K2213M5385j4412j7305p6355p5808L4224O818j5500N972
27601f9631L8565M0937R966K1738r455m1135K3553J84o6602k6851L6306K2784
27589a9641L8380M8934M6108L524n0282J2692j0732m5130J0328k378o3091K3082
27577h206M4757L224N799K3781l0838k1660K0953j252j8471p468k9412k0906N1091
27564A1392K1150L3897K1167p0279m1631K4279K7117L9575k2642j9424K6776O000
$$ plain form
27649 -97287 -80752 -69365 4892 8849 -13248 5813 -29964 -75999 3019 29101 1614 7192
27637 7192 3010 -21030 -40459 -21450 14273 30789 -41773 -59711 -48372 -52585 -71961 -61165
27625 -61165 -66833 -54381 -34432 -64178 -31272 9122 18404 37125 10217 -5519 -35089 -47554
27613 -47554 -22948 15137 37350 82735 68323 51018 -25337 -101145 -66921 -60103 -75603 -69631
27601 -69631 -31066 9871 19837 41575 32120 -9015 14538 14722 -51880 -78731 -42425 -19641
27589 -19641 18739 67673 113781 117305 67023 79715 68983 23853 34181 31803 -31288 -8206
27577 -8206 36551 39775 45574 69355 38517 16857 37810 36558 18087 10619 -18793 -39699 11392
27564 11392 32542 66439 87606 17327 -24304 -25 27092 66667 44025 24601 51377 57377
27552E7377k7403p8019M4912J2288k8519l3361n2458j2076K6187K3766m5148K0033
27540i2421P1760K519l3789M5906M4984L537N3421p990l6034M087L931o2145r3485
27527i5719J6408P2334k2976k4576m071P5406M6944K7061l7086o9737L3144P2845
27515H9977n6300m2231O5176q318L1757J8996k5447q13k2142j1778j7398L3220
27503E4699k23n4400j8718L6433O9693o561j26447j2386K6022K0387N319P948
27491A766p206L2126m43k6229L1790l2818j2827L2708K7649j9996J9147j0014
27479C5653J9422k8617q253N4833n0434o3775j3907j380J3759K8046J2576j1661
27467a3738r239N8383O5783L629k7859K5221m7705n7009M5325J5574n7841j0641
$$ plain form
27552 57377 29974 -48045 -3133 9155 -19364 -52725 -105183 -117259 -91072 -67306 -112454 -92421
27540 -92421 -20661 -18142 -51931 -6025 38959 42496 95917 87927 51893 55980 59911 -2234 -95719
27527 -95719 -79311 -6977 -29953 -54529 -58600 16806 63750 90811 53725 -16012 17132 89977
27515 89977 33677 -8554 56622 48304 80061 99057 73610 72797 50655 38877 21479 54699
27503 54699 54476 76 -18642 17791 87484 80923 -45524 -57910 -31888 -11501 -6182 1766
27491 1766 -5440 26686 26243 14 31804 -1014 -13841 18867 46516 26520 45667 35653
27479 35653 55075 26458 18205 73038 22604 -41171 -55078 -56458 -42699 -14653 -2077 -13738
27467 -13738 -22977 35406 101189 104818 76959 102180 54475 -2534 42791 58365 524 -10117
27455a0117k6643j587l137l6245L9573O3649J4419L2452m043Q21M3123J9587m9260
27442H2592k0815l312K7525K0010k2875j09295j776J736K7005p613O47k5240K6055
27429e356O668n921j0242L9071j4182m2414j6814J3648j636M2103K2890l520p460
27416A6835J4385k817k7149k0108J1275l1437Q6131P94l3390K7159N105J8266
27404F5049j4508n5958P784J3382k1826k6271K3168Q7200p2159l2029Q0157k2536
27392C1453J2955J3836M1915l6463m9346R076L5161q7095l3189J2764J1615k914
27380d0232j4153j8210N3478R4579J7097Q685m928k4360k7277J8280O826N569
27368G5354o717n4594q558n9298n3131L6983L2989L5229J8282L7923l5440m4510
$$ plain form
27455 -10117 -36760 -38347 -41484 -77729 -38156 25493 39912 72364 68321 69142 112265 131852 82592
27442 82592 61777 58465 85990 106000 83125 -26170 -27946 -26210 795 -6818 -6171 -31411 -5356
27429 -5356 1312 -4609 -14851 24220 10038 -32376 -49190 -35542 -37178 4925 27815 24295 16835
27416 16835 31220 28403 1254 -18854 -7579 -39016 47115 47909 14519 41678 46783 65049
27404 65049 50541 -5417 2367 15749 -6077 -32348 -9180 78020 5861 -26168 53989 31453
27392 31453 44408 58244 100159 63696 14350 23426 58587 -28508 -61697 -48933 -37318 -40232
27380 -40232 -54385 -72595 -19117 75462 92559 101244 96316 71956 44679 62959 69785 75354
27368 75354 68637 14043 5485 -53813 -106944 -69961 -36972 -1743 16539 54462 19022 -25488
27356b5488l1938P305M038k81j0l3782o672K1757K3954n266L6202L1042J7431
27343C8292l4985J6368K658k1329J7017O6355q334q4717j862j6819j5344J00J2879
27330b9721K9677J5085n2147m0181M3479K1072Q375M9987K0400j7701n8159j2600
27318b2434j2675l2608K1060R133j6562n2652J5972K1329j8945K7304K0425r382
27306e0035j6526k4149j915L2198j6084j7080j8972M335K9684J7825L5833m3224
27294f8110n2821L8597m367J7881K695N610l1834P2036P3335n5017j10495J0870
27282a01620N5827K1045q2428k654K826P027M6892k0113j4747m742M6383K4727
27270b1577J8703k7595l1587k9351K2762L2138O6245K4859l4850o928j8326k4479
$$ plain form
27356 -25488 -57426 -50121 -46083 -46364 -46374 -80156 -86828 -65071 -41117 -46383 -10181 20861 38292
27343 38292 3307 19675 22333 1004 18021 84376 76042 -8675 -10537 -27356 -42700 -42600 -29721
27330 -29721 -44 15041 -37106 -77287 -33808 -12736 -4361 45626 66026 48325 -9834 -22434
27318 -22434 -35109 -67717 -46657 -37524 -54086 -106738 -90766 -69437 -88382 -61078 -40653 -50035
27306 -50035 -66561 -90710 -92625 -60427 -76511 -93591 -112563 -108228 -78544 -60719 -24886 -68110
27294 -68110 -120931 -82334 -86701 -68820 -66125 -60515 -92349 -20313 53022 -1995 -112490 -101620
27282 -101620 -45793 -24748 -107176 -109830 -107004 -99977 -53085 -73198 -87945 -92687 -46304 -21577
27270 -21577 -2874 -30469 -62056 -91407 -68645 -36507 29738 54597 19747 12819 -5507 -29986
27258b9986L640k1725L8586l6092j8644J3569N1668L9166l7166J404m056M200
27246D564m664M581o8391O916N4184P467n6623j4702k8483N774m2697K1492K4222
27233h6360N4207J1905K6479P0015j8770K206K2695L408o741k640k8068k1223
27221B7113j6971J0174L2202l7384l3588k8915j5421Q714K7700M2045Q862o0832
27209c6301n6359L8691j1096M2153O927j760J9170L1152M3637K103n0889n5746
27197b8318M11L0363M1981P98l5555J5081n116l323O3323M380m4224J1471m0313
27184A0959j601r781J0383J0777m1307n7028k3392j1512O0337M8716N0127J2403
27172E9081j8336J3328K1538p1411m3327j2584n5558O816N0840L1633N0473k4465
$$ plain form
27258 -29986 -26346 -48071 -9485 -45577 -64221 -50652 1016 40182 3016 4420 364 4564
27246 4564 -100 4481 -63910 -56994 -2810 4657 -51966 -66668 -95151 -89377 -132074 -110582 -86360
27233 -86360 -32153 -20248 6231 76246 57476 59682 82377 85785 79044 76404 48336 27113
27221 27113 10142 20316 52518 15134 -18454 -47369 -62790 -54076 -26376 15669 24531 -36301
27209 -36301 -92660 -53969 -65065 -22912 -15985 -17745 1425 32577 76214 78317 27428 -28318
27197 -28318 -27907 2456 44437 45235 9680 24761 19645 16322 79645 84025 39801 51272 10959
27184 10959 9358 -423 9960 20737 -20570 -77598 -100990 -112502 -52165 -3449 46678 59081
27172 59081 40745 54073 75611 4200 -39127 -51711 -107269 -100453 -49613 -17980 32493 8028
27160H028P607K3316K1070o5385k660k0292k5276j6419K8036J611L775n1842k369
27147i0800Q268K8886N8579N6444m035j773m7918K712j3393p0654l8735M701J02227
27134e491O2148J9996J6604o965K9723N4325K5935j7252o6432k5059n6709n4702
27122b3879o5937M2298O3782N5060M15o0031o2200k9339J0769N818J8613m6998
27110i1629J7438J3254K4520O0074K4123k4076m3442J1510J9878J9774M5908K4608
27098A01940o3874o7099m9214L3523M3051M3046K3287J6253o2736p8461p245j0157
27086g7686L474P2589j0543l1579K6794r959l7980M1587J7783L1106L0822n7143
27074g35j0457K2916m2989j2424L2730M6233k1152m3818K8937m332L1157j1607
$$ plain form
27160 8028 15635 38951 60021 -5364 -8024 -28316 -53592 -70011 -41975 -40364 -36589 -88431 -90800
27147 -90800 -82532 -53646 4933 61377 57342 55569 7651 10363 -3030 -73684 -112419 -107718 -5491
27134 -5491 56657 76653 93257 86292 116015 170340 196275 179023 112591 87532 30823 -23879
27122 -23879 -89816 -47518 16264 71324 71739 11708 -50492 -79831 -69062 -63244 -44631 -91629
27110 -91629 -74191 -60937 -36417 23657 47780 23704 -19738 -8228 11650 31424 77332 101940
27098 101940 38066 -29033 -78247 -44724 -1673 41373 64660 80913 18177 -60284 -67529 -77686
27086 -77686 -74212 -1623 -12166 -43745 -16951 -26910 -64890 -23303 -5520 25586 56408 -735
27074 -735 -11192 11724 -31265 -43689 -10959 35274 14122 -29696 -759 -5091 26066 14459
27062A4459j2592j594K5742j3830o863M6499l8606k9697M1552J9329n2458j3277
27050b1336P9057P6040Q948j01831p5776m7716q549J6409j1031L3065P1520N4422
27038G3222m7048q4677r529N4327M6701n5634Q314j8979l1603J3928q718j0138
27026f9834L028J5788K5511q9073J7767N0741k8786L3035L7114K2529J5794J6760
27014E0374K0795q863r771l0600O1821K0853m2356l0369j6091j4665k2098K2217
27002A247J3696l378m6077l5294O65q629L4814N4226K4091K9903j7197k2082o7000
26989d1015m7698K4129R8592L3204m0165k0641k184l6450k7952k064R6036O5970
26977I9762j0433o0237j113M4866K6718n9414l1237M3661N39m3784l401J6982
$$ plain form
27062 14459 1867 273 26015 12185 5322 51821 13215 -16482 25070 44399 -8059 -21336
27050 -21336 57721 133761 142709 40878 -34898 -82614 -91163 -74754 -85785 -52720 18800 73222
27038 73222 26174 -58503 -68032 -13705 32996 -22638 -14324 -33303 -64906 -50978 -59696 -69834
27026 -69834 -66806 -51018 -25507 -114580 -96813 -46072 -74858 -41823 -4709 17820 33614 50374
27014 50374 71169 62306 52535 21935 83756 104609 62253 31884 15793 1128 -20970 1247
27002 1247 14943 11565 -34512 -69806 -69141 -77770 -42956 11270 35361 65264 48067 25985 -41015
26989 -41015 -88713 -64584 34008 67212 27047 6406 4222 -32228 -60180 -62244 33792 99762
26977 99762 89329 29092 27979 72845 99563 40149 8912 52573 53112 9328 5927 22909
26965B2909J3513L0596m6423n7030m013K2958L1847K8098k2533l5989j5891K155
26953b9803r640K8265N1073n5921m5719m2505N159K9445Q9139l0483l3151J2996
26941c1145J5855l5810J524K2282M5502j3134m3319K684K8068j0170o6997k1676
26929a06336K9267K3598N386j4782m370K0962N9481k4588j9144N9683K4533q6086
26917c2396M6289P558M4051M259l5390k7554J7500k0210j7062J2892Q5378J7846
26905A03161j5185l1663P838O872j2399J0914m2968J1554M5824r0040m6562L5565
26893a7089J0043J8697J2695L4265K5322L780K9119l0253n1781m5114Q194k561
26881d683M175p123Q738K9772j3738l721j6173Q317k2937N4771j4699J1854J6040
$$ plain form
26965 22909 36422 67018 20595 -36435 -40448 -17490 14357 42455 19922 -16067 -31958 -29803
26953 -29803 -39443 -11178 39895 -16026 -61745 -104250 -99091 -69646 19493 -10990 -44141 -31145
26941 -31145 -15290 -51100 -49576 -27294 18208 5074 -38245 -35561 -7493 -17663 -84660 -106336
26929 -106336 -77069 -53471 -48085 -62867 -67237 -46275 13206 -11382 -30526 29157 53690 -32396
26917 -32396 13893 21451 65502 69761 34371 6817 24317 4107 -12955 -63 85315 103161
26905 103161 87976 56313 64151 71023 58624 69538 26570 38124 83948 -6092 -52654 -17089
26893 -17089 -7046 11651 24346 58611 83933 87713 116832 86579 34798 -10316 -2122 -4683
26881 -4683 -508 -7631 1107 30879 17141 13420 -2753 5564 -17373 37398 22699 34553 50593
26868E0593l0859m5875J0664L5222P6929N6257k2534o6392j608K1963n3405p3500
26856d2545j6266K3604K5214K282j1886j3799l7693N8N4716m886K3306J8043n206
26843A4942M4631M368n7872k3277J7702l7837j4113M9239P910p8265j1856J0490
26831g3938L3182L6484M6532j4077m5881K1973J8758J8603p0893n1380L8829J16867
26819G5059K2158n7802q5780m7619M5784N2510K948k1844l1388j6145J2485J8325
26807c1309J9991L806o6519J4270R32J8528k3793q777L1595p24l939N7102L5914
26794D7077o4410o1454K1613P2418p970J592j2693q230j6586J0829l0927J8296
26782c0445O1438R6671K4025n4239j02793O790P829L7312k4552j4229K2457Q1342
$$ plain form
26868 50593 19734 -26141 -15477 19745 96674 152931 130397 64005 62397 84360 30955 -42545
26856 -42545 -58811 -35207 -9993 -7711 -19597 -33396 -71089 -71031 -16315 -21201 2105 20148 14942
26843 14942 59573 63941 6069 -17208 494 -37343 -51456 -2217 5693 -72572 -84428 -73938
26831 -73938 -40756 -4272 42260 28183 -17698 4275 23033 41636 -29257 -80637 -41808 75059
26819 75059 97217 39415 -46365 -93984 -48200 4310 7258 -14586 -45974 -62119 -49634 -31309
26807 -31309 -11318 -7512 -74031 -59761 -58829 -40301 -64094 -72871 -41276 -42000 -45939 11163 47077
26794 47077 -17333 -78787 -57174 15244 7274 8866 -3827 -12057 -28643 -17814 -48741 -30445
26782 -30445 30993 127664 151689 97450 -5343 1447 9276 46588 22036 7807 30264 111606
26770A11606L2182r3668n8015K0601p9590K3547N6913k3411k5034J8231j2572
26759b9210K0941n623l1474m3264K8124O6880R6944n149r731n7423n1050R132
26747a0903J4864L2706j6121m7642m953L4128m6209o9950k4792J7385k6696L879
26735a44304L7386N0687j2315J8324k0438L9418P7666J5053j8941o6068L729L6409
26723A6606M1551p1501j04731O294N7800P4796J7236q462o4l0380j3392m92M299
26710a0440K2259k259L9161q050o1233N988J2185k057p8447K5006R261n3754n931
26697a08311L5255J8396J7984K1150m4123k9350L8936l3323K4166N3220Q921J0342
26685A3263m068k749k1411J2225j0865n6367N4176M6000j8928L168p012m1450
$$ plain form
26770 111606 143788 50120 -7895 12706 -66884 -43337 13576 -9835 -34869 -16638 -29210
26759 -29210 -8269 -13892 -45366 -88630 -60506 6374 103318 98169 88438 31015 -20035 -10903
26747 -10903 3961 36667 20546 -27096 -32049 2079 -44130 -114080 -138872 -121487 -148183 -144304
26735 -144304 -106918 -56231 -68546 -50222 -70660 -31242 46424 61477 42536 -23532 -19803 16606
26723 16606 58157 -13344 -118075 -111781 -53981 20815 38051 29589 29525 -855 -14247 -14739 -10440
26710 -10440 11819 9560 48721 40671 -20562 -14574 -2389 -4446 -82893 -57887 -48626 -102380 -108311
26697 -108311 -73056 -54660 -36676 -15526 -59649 -88999 -50063 -83386 -59220 -6000 2921 13263
26685 13263 9195 6446 -14965 -2740 -13605 -69972 -15796 30204 11276 14444 7432 -34018
26673c4018N037N019K7299K6695j3668j062k107L8329K1706n1947j18228m3708
26661a40653N0438P3979M1533O3116k734o024n1880k5517N0046L360k4501r972
26649B1191o352k1779o533K6692K0208l5615m5578k5038O4450P8937k71k7257
26637D3055m3458k1547Q281M733O9229J0377l7355m8779m5323p9889K8681M2639
26625f9356M8318r986m7080M5371M8765L7609j4187l3676m7301K100p679j9047
26613f6149K85j0038K4504K004m3246K8000L7501K348J9198J8736J7477p719M9019
26600G1920l841l5702l9308M6290j8288M967j2920m1272n7633O4206j8020k3380
26588f2981L5586q0092K0111M3556L1254Q407n8486N204Q3185M2838l030M5560
$$ plain form
26673 -34018 -28981 -23962 3337 30032 16364 15302 13195 51524 73230 21283 -96945 -140653
26661 -140653 -90215 -16236 25297 88413 85679 79655 27775 2258 52304 55664 31163 21191
26649 21191 14839 -6940 -13473 13219 33427 -2188 -47766 -72804 -8354 70583 70312 43055
26637 43055 -403 -21950 -13669 -8936 60293 70670 33315 -15464 -60787 -140676 -111995 -69356
26625 -69356 -21038 -31024 -78104 -32733 16032 53641 39454 5778 -41523 -39423 -47102 -66149
26613 -66149 -65864 -75902 -51398 -49394 -92640 -64640 -27139 -24791 -5593 13143 30620 22901 71920
26600 71920 68079 32377 -6931 39359 21071 26038 13118 -28154 -85787 -21581 -39601 -62981
26588 -62981 -27395 -107487 -87376 -43820 -12566 -4159 -62645 -57441 25744 68582 65552 111112
26576A11112K6920m3076n2857R028p973j2209p246K9089J5288k3705j007P333
26564E0697l1767k9155N825J9218K4835l4741m4825k0950l798J1189N6973L1852
26552C5353P565J4249k9534k3288j5304n607m9698K2027M9615O2116m8892j1027
26540G575N148m7247j6201J082r115j9211L5924L3289P511L6162J8239l813j1081
26527C8262P434k2978M0610m579l8805j7004o23l8646k69l211j4858Q0894p123
26514A9104j8537J7058l1035n4959R886M9972K4775m2087k4078L5502L030k6904
26502c8273j0405L2988j0320L2096l5664o948K1598L3858K2602R544n3533n1548
26490e4005L5064M0348j8732k2909R898m0103m5711j1290j0114J0303J3947M8960
$$ plain form
26576 111112 138032 94956 42099 51127 43154 30945 23699 52788 68076 44371 43364 50697
26564 50697 18930 -10225 -4400 14818 39653 4912 -39913 -60863 -64661 -53472 3501 35353
26552 35353 42918 57167 27633 4345 -10959 -16566 -66264 -44237 5378 67494 18602 7575
26540 7575 12723 -34524 -50725 -49643 -58758 -77969 -42045 -8756 -1245 34917 53156 49343 38262
26527 38262 45696 22718 63328 58749 19944 2940 2317 -36329 -36598 -39809 -54667 26227 19104
26514 19104 567 17625 -13410 -68369 -58483 -8511 16264 -25823 -49901 -14399 -11369 -38273
26502 -38273 -48678 -15690 -26010 6086 -29578 -36526 -14928 18930 41532 51076 -2457 -54005
26490 -54005 -18941 21407 2675 -20234 -10336 -50439 -96150 -107440 -117554 -107251 -93304 -44344
26478d4344j599k9875O542L4922Q697O0161N8138l6990p2607j6605m9092k1146
26466a03798L066L2275k4616k2336O188N8805P5446O5081J0286j4306p812m7290
26454C0989K6150o936l5657k575O1566k9896n66L3523o0315l8506q735L579k9005
26441e6384j9195r7158J2649N4899P0949N4205q709m2805j433j8645P0707O7955
26429H7035j7801j0179L9926J8350p9059k9722r895J7445J6939j7032M0101N3872
26417A09980r75m8943j8110p1511r7529l5658R9974L7462J3760m908k9914L6910
26405i462K4844J1458J231L6134l828q4434o5569j6250K0839J0191p890L1129
26393e1607P6954o247j6825n5419K3443O4624J9096l4868j14301j7462M0419P1777
$$ plain form
26478 -44344 -45943 -75818 -69276 -34354 -25657 34504 92642 55652 -16955 -33560 -82652 -103798
26466 -103798 -100732 -68457 -93073 -115409 -109221 -50416 25030 90111 100397 86091 78279 30989
26454 30989 57139 50203 14546 11971 73537 43641 43075 76598 16283 -22223 -30958 -27379 -56384
26441 -56384 -75579 -172737 -160088 -105189 -34240 19965 11256 -31549 -32982 -51627 19080 87035
26429 87035 69234 59055 98981 117331 38272 8550 -1345 16100 33039 16007 56108 109980
26417 109980 109005 60062 41952 -29559 -127088 -162746 -62772 -25310 -11550 -16458 -46372 -9462
26405 -9462 15382 26840 28071 64205 60377 -24057 -89626 -105876 -85037 -74846 -82736 -51607
26393 -51607 25347 19100 2275 -53144 -29701 34923 54019 19151 -95150 -112612 -72193 -416
26381d16r58m3906J0526P46J996M980j8361j4332L3094j2657K819Q9749J5181
26368F8461K4449j7232J5191j3728n5168p4315J9092J5631M3195J3112k8797p6414
26356f6523q897k4151m4864O1764L5326J3603l994L9247K1722k6176k133O7777
26344F2701j3288K701N6150K7180o7576m30j0547J80N418J3863l6644Q040m1519
26331F229m4263p2957q185J7245N5587r183q5704k8085N7307R4637j5440m1368
26319g4180j7053M1091P0254l895j7136M8744K7012p5468r7348J4432O5676J9549
26307A678l2227k0943M4144K1310k061n6392m8054R987M2690N2251L4858j3452
26295C3789l2367P7949L7187p6600k6199J8438o6744o1465n4073N4120L2094k4200
$$ plain form
26381 -416 -1374 -45280 -34754 -34008 -32012 -27032 -45393 -59725 -26631 -39288 -36469 53280 68461
26368 68461 92910 75678 90869 77141 21973 -52342 -33250 -17619 25576 38688 9891 -66523
26356 -66523 -75420 -99571 -144435 -82671 -47345 -33742 -37736 1511 23233 -2943 -5076 62701
26344 62701 49413 52114 108264 135444 67868 67438 56891 57071 62489 76352 39708 47748 6229
26331 6229 -38034 -110991 -119176 -101931 -46344 -55527 -141231 -169316 -112009 -17372 -32812 -74180
26319 -74180 -91233 -50142 20112 16217 -919 47825 74837 -631 -97979 -83547 -17871 1678
26307 1678 -30549 -51492 -7348 13962 11901 -44491 -92545 -82558 -39868 12383 47241 33789
26295 33789 1422 79371 116558 39958 13759 32197 -34547 -96012 -150085 -95965 -63871 -88071
26283h8071K7500L2815P5220L5754m9934o8338K2644K435l0553J750L0361J9495
26271A1078P464j9176k3883o4057K0106J07528L9478j4107o3883n802N0182M149
26259D9077k5461j7271k7110j696L9289O0155O0983k8256m6938l6491j9273k1876
26247a4868Q356k927m1627M034L8677n6305N0035j9460q741Q2500j7680n6177
26235c4183l7051M8634J9714K0840P8150l0089l1403m3209k9536K4718P2767K461
26223F1813r959K6473K0945M878j1293k4466l0709m1117J27k3803M398j731n1172
26210g5616j9348L2634P7940N5559k2877J4581L2025k0040j249N3047k7009r1920
26198G727l2565N92j5903m2162p4778N5470Q5635k4284k0327N7108k909m7202
$$ plain form
26283 -88071 -60571 -27756 47464 83218 33284 -35054 -12410 -9975 -40528 -38778 -8417 11078
26271 11078 18542 -634 -24517 -88574 -68468 39060 78538 64431 548 -5254 44928 49077
26259 49077 23616 6345 -20765 -22461 16828 76983 137966 109710 62772 26281 7008 -14868
26247 -14868 -6512 -9439 -51066 -47032 -8355 -64660 -14625 -34085 -42826 39674 21994 -34183
26235 -34183 -71234 -22600 -2886 17954 96104 66015 34612 -8597 -38133 -13415 59352 61813
26223 61813 51854 78327 99272 104150 92857 68391 37682 -3435 -3308 -27111 -22713 -24444 -75616
26210 -75616 -94964 -62330 15610 71169 48292 62873 94898 74858 73609 126656 99647 7727
26198 7727 -24838 -24246 -40149 -82311 -157089 -101619 -15984 -40268 -60595 -3487 -6396 -53598
26186e3598k397L1748K1039L0076M0059O21m0666l8534k866M859K2307k0662p3171
26173h1185j3005J5188J9912K9051k4898R270L8305L1841J5939l2098m6205K6444
26161a1441L0352L2396M553m891k3962l4824J0409R2906k9985n6176J0009n3378
26149c4032m4999l0961l7389K1562r848J2058N7077L0539M9421O0365k815n2930
26137A8048j2230k1382o3656j4272N0886K1340M078J5645k2064m951K0553Q597
26125E92O4327l7516J5319J3467n9924l1426l3833n4388k9615j742N8781O6254
26113b9704L4593N879K0138K5436k5743m2060K9201j1947m1184k9194K4140J820
26101c8625k1735J0378k1068o94N3149M8364m0478n3662L3611J1469l6551J5643
$$ plain form
26186 -53598 -55995 -24247 -3208 26868 66927 67548 26882 -11652 -14518 -9659 12648 -8014 -81185
26173 -81185 -94190 -79002 -59090 -30039 -54937 -45667 -7362 24479 40418 8320 -37885 -11441
26161 -11441 18911 51307 55860 50969 27007 -7817 2592 95498 65513 9337 19346 -34032
26149 -34032 -79031 -109992 -147381 -125819 -135667 -123609 -66532 -35993 13428 73793 70978 18048
26137 18048 5818 -15564 -79220 -93492 -42606 -21266 -17188 -1543 -23607 -28558 -8005 592
26125 592 64919 27403 42722 56189 -3735 -35161 -68994 -123382 -152997 -154739 -95958 -29704
26113 -29704 4889 10768 30906 56342 30599 -11461 17740 5793 -35391 -64585 -40445 -38625
26101 -38625 -60360 -49982 -71050 -71744 -18595 29769 -10709 -64371 -30760 -19291 -55842 -40199
26089d0199j3916M6630k2544n0668K7620K6682j1305K4004K4454L6866L0752k3283
26077E5093l5462o3040m7474l128L3192L2673K2350j5156J055P028N5716L6763
26065G9610R664N4562m1282m9098k6385m4528L3250J2590M7153K0368k7873m1179
26053B6852K801M0030K4256j2846k6747j4549j995K2389J6604j2114m6258J5503
26041C3926J0529j4598l8820M7329N715l5909k127N4372K3330K8413m9807r2963
26029c0610N2631K9971k8428q4549k540J1962p078l0449l3216M3714J04643k2683
26017C368m337m05J4547R303l1761n3997P827N477M6908K7550K4621p8517N042
26004b4374l189M1028K610k4445n881Q4816j9091n8304j8503J9391m3827L2521
$$ plain form
26089 -40199 -54115 -7485 -30029 -80697 -53077 -26395 -37700 -13696 10758 47624 78376 55093
26077 55093 19631 -43409 -90883 -94011 -60819 -28146 -5796 -20952 -19897 -12869 42847 79610
26065 79610 89274 143836 102554 53456 27071 -17457 15793 28383 75536 95904 68031 26852
26053 26852 29653 69683 93939 81093 54346 39797 37802 60191 76795 64681 18423 33926
26041 33926 44455 29857 -8963 38366 44081 8172 6045 60417 83747 112160 62353 -30610
26029 -30610 22021 51992 23564 -60985 -63525 -51563 -58641 -89090 -122306 -78592 26051 3368
26017 3368 -969 -1374 13173 22476 -9285 -63282 -55455 -49978 -3070 24480 49101 -29416 -24374
26004 -24374 -27563 13465 16075 -8370 -14251 70565 51474 -6830 -25333 -5942 -49769 -17248
25992a7248J8286o937l5673l5563N839P0646O8890J4234j2983J0008l2063m0074
25980G362P555j612j4887J4743P668m1059l8738o607j5187n0782K4539J09111
25968B106M6085k5608l9577l1422N5589L7691j7875o8032j3188M0940N2171k577
25956C6303j7226l5909L615L275n983j846j3947J6574l1349k1833M3479l145p1446
25943i9438J3965M0822K4629K33j8332J770K7434l5119L7973O1711k4414j0508
25931B0726j3807J2746J6411K693J045m7279o602l4150K8596K8062j02236j6404
25919a10199Q306O622L2197Q7325M4508m1718k9113K7961J7518n0105L926k8320
25907c1092o24L0365J3955M695L492K199j7571O421k4294M432L0850l5985J7532
$$ plain form
25992 -17248 1038 -5899 -41572 -77135 -71296 -650 68240 82474 69491 79499 47436 7362
25980 7362 14917 13305 -1582 13161 20829 -20230 -58968 -65575 -80762 -131544 -107005 2106
25968 2106 48191 22583 -16994 -48416 7173 44864 26989 -41043 -54231 -13291 38880 36303
25956 36303 19077 -16832 -13217 -9942 -15925 -17771 -31718 -15144 -46493 -68326 -24847 -27992 -99438
25943 -99438 -85473 -44651 -20022 -19789 -38121 -36351 -8917 -44036 -6063 55648 31234 20726
25931 20726 6919 19665 36076 38769 39814 -7465 -14067 -48217 -19621 8441 -93795 -110199
25919 -110199 -101893 -95271 -63074 24251 68759 27041 -2072 25889 43407 -6698 -2772 -31092
25907 -31092 -31716 -1351 12604 17299 20791 22990 5419 11840 -12454 -8022 22828 -13157 4375
25894D375Q794l0772K8683M4031k4502M2390k2715n1194k5134j0934K3325K17
25882a3436M2674J6951J4589n6002k6021M0410M1006K980N1394k6876l5911m1906
25870I852p0621l1329L0842P2721L8273m4712L877l6505M4022q042l397J3751
25858A8732j9561k5761L4245m3993m3153m157k2603M9440k342L4211j8363J988
25846d1317k9275n1038N3203Q9662N3547o97k1887l9637j2552k9896m0462L1284
25834c9065M5309K6764L2862J0938j083l1159n7464l480k4572L0224R8938p158
25822H1054q1579J903j1051j4714l628j3721K7968N2975K495l5869k3606K1724
25810C951J1516J9877k5915J580k924N5708p9373j02669J585N2220Q526M0476
$$ plain form
25894 4375 13169 -17603 11080 55111 30609 72999 50284 -910 -26044 -36978 -13653 -13436
25882 -13436 29238 46189 60778 4776 -21245 19165 60171 63151 114545 87669 51758 9852
25870 9852 -60769 -92098 -61256 11465 49738 5026 8903 -27602 16420 8378 4981 18732
25858 18732 -829 -26590 7655 -36338 -79491 -83648 -106251 -56811 -59153 -24942 -43305 -41317
25846 -41317 -70592 -121630 -68427 21235 74782 74085 52198 12561 9 -29887 -70349 -39065
25834 -39065 6244 33008 65870 76808 75725 44566 -12898 -16378 -40950 -10726 88212 81054
25822 81054 -525 1378 -9673 -24387 -28015 -41736 -13768 39207 41702 5833 -17773 3951
25810 3951 15467 35344 9429 11009 8085 63793 -15580 -118249 -116664 -64444 -55918 -15442
25798a5442J5911N6860M554p5221n1219n4726K2004n270R0617o812O2654q583
25786C5327r112Q709M2658j2532k4828o357J6073K2148J6321J0619M844m3670
25774F0200q0501l7879k5274J3858J6649J9948O8376l144l587N6054J8198o0852
25762D2046m5742l77J4322o6187J6339j5469l713L1583L6577j3714K1074L4562
25750E1301o0194o4107J8537P0975n136j6439m6823m8714N5478L9093k0059j3601
25738c9689K6582j2238j2090J8680k4140R165l4431j7482J4639o332L3349j8987
25726f2974r100L8650J737j8492L5536N895k3900m833M6990L5483K1561m1851
25714B4702m4787Q042j455J1796N6160L7086k4787j0369J8257p2328N0904J4992
$$ plain form
25798 -15442 469 57329 61883 -13338 -64557 -119283 -97279 -102549 -11932 -18744 43910 35327
25786 35327 26215 34924 77582 65050 40222 33865 49938 72086 88407 99026 103870 60200
25774 60200 -20301 -58180 -83454 -69596 -52947 -32999 35377 32233 28646 84700 102898 42046
25762 42046 -3696 -4073 10249 -55938 -39599 -55068 -58781 -27198 9379 -4335 16739 51301
25750 51301 -8893 -73000 -54463 16512 11376 -5063 -51886 -100600 -45122 -6029 -26088 -39689
25738 -39689 -13107 -25345 -37435 -18755 -42895 -33730 -68161 -85643 -71004 -77336 -43987 -62974
25726 -62974 -72074 -33424 -31687 -50179 -14643 -8748 -32648 -37481 9509 44992 66553 24702
25714 24702 -20085 -12043 -13498 -1702 54458 91544 66757 56388 74645 2317 53221 68213
25702F8213j0097o7071l8460j9576M447O4098n9499l5522L4156Q8296L359l0214
25690B130K6267J8561j3440p922j8758j1057j3542l7383J3397K9097K5797n099
25678H048Q928j6597K4286M9184n3340o2378p020o724N866O3584l4082l7517k9839
25665h7601L4911L7996M362k8833o521L2908K4622K4841L7385m3963l0478M0877
25653D0506n3189l6534l6290K8137M5135r186j4679j1961M9335J2753j6411k3597
25641b5981J6930M7567L4782k7490n114M2583k7044k8713K688L3713n3949M4366
25629E4338M4934m4313k2412n0016L1537J10661l7025l3364k8241n9552o2264
25618i5717k8571P152M1213M6030J4955n5657L960J0567j4735K0884N8560Q347
$$ plain form
25702 68213 58116 -8955 -47415 -66991 -62544 1554 -57945 -93467 -59311 28985 32344 2130
25690 2130 28397 46958 33518 25596 6838 -4219 -17761 -55144 -41747 -12650 13147 8048
25678 8048 16976 379 24665 73849 20509 -41869 -48889 -55613 -49747 13837 -20245 -57762 -87601
25665 -87601 -52690 -14694 -10332 -39165 -45686 -12778 11844 36685 74070 30107 -371 40506
25653 40506 -12683 -49217 -85507 -57370 -12235 -21421 -36100 -48061 1274 14027 -2384 -25981
25641 -25981 -9051 38516 73298 45808 40694 83277 56233 27520 30208 63921 9972 54338
25629 54338 99272 54959 32547 -17469 14068 124729 87704 54340 26099 -33453 -95717
25618 -95717 -124288 -117136 -75923 -29893 -14938 -70595 -66635 -56068 -70803 -49919 8641 16988
25606A6988m9013K0996L4983L386K4755L8539l8712j5805l5389m8070Q949M0197
25594A804j2062n1438M2409L0765N8180n0345n3403m5782M841O5881J7723L5948
25582D4521k5646j0482O7257K2812n4060O441m1559k1805o1761k2769L4553R5430
25570C2932Q1484q6780r4293L2618Q6297j7835l1662J1914J3893k2922J6134L1696
25558E3476j6625j6266l9977o7329Q235L0107k905K8071K1789l3896k062L7755
25546C73J0582L0620k544j41l988k7437K1346O0517l0707k9694P912L881l686
25533C7034q34J8196J736J1315j0772l3519M1250K973n2152m5153l10k0172J8297
25520c2111N1868j5530j3014O6621j4224o0807q7195J8680O1151O0032K5660l6541
$$ plain form
25606 16988 -32025 -11029 23954 27340 52095 90634 51922 36117 728 -47342 -38393 1804
25594 1804 -10258 -61696 -19287 11478 69658 19313 -34090 -79872 -75031 -9150 8573 44521
25582 44521 18875 8393 75650 98462 44402 50843 9284 -12521 -74282 -97051 -62498 32932
25570 32932 114416 27636 -66657 -34039 52258 34423 2761 14675 28568 5646 21780 53476
25558 53476 36851 20585 -19392 -86721 -78486 -48379 -51284 -23213 -1424 -35320 -37382 373
25546 373 10955 41575 39031 38890 34902 7465 28811 89328 58621 28927 36839 40720 37034
25533 37034 36200 54396 56132 67447 56675 23156 64406 67379 15227 -29926 -30236 -50408 -32111
25520 -32111 19757 4227 -8787 57834 43610 -17197 -104392 -85712 -24561 35471 61131 24590
25508B4590p0262j4180J9421L4882Q211r086K2240P506K0619m5544n0122Q3724
25496C1999N8407J6480L6244r5843r8028p2734J0359N3962M8152k32M4319K827
25484C5912M139n3381j1875P7407J4498j19276l2035L4819L9362K8982o2154n373
25472d8975O1052J07772K6600r0522n8176k6025K1495M4360j2309m7869j8659
25461d1256K8050r8016K1125N5229J9740N6324M8326K3300l2344L9024j8165m3176
25449E8161L0996k5767o7139o7919l9962m5388N2833J03656N4814K7379m4591
25438C7073L99n114l6577l6215l5616J2849L563J2370M6741L7532k4450n85k1743
25425i773j5535O828N0213j7683j7063q0881K5531N4668k5097o8428j079N9580
$$ plain form
25508 24590 -45672 -59852 -40431 -5549 2662 -6424 15816 23322 43941 -1603 -51725 31999
25496 31999 90406 106886 143130 47287 -50741 -123475 -113116 -59154 -11002 -11234 33085 35912
25484 35912 40051 -13330 -25205 52202 66700 -52576 -84611 -49792 -10430 18552 -43602 -48975
25472 -48975 12077 119849 146449 55927 -2249 -28274 -6779 37581 25272 -22597 -41256
25461 -41256 -13206 -111222 -90097 -34868 -15128 41196 89522 112822 80478 119502 101337 58161
25449 58161 89157 63390 -3749 -71668 -111630 -157018 -104185 -529 54285 81664 37073
25438 37073 37472 32358 -4219 -40434 -76050 -63201 -59638 -47268 -527 37005 12555 11970 -9773
25425 -9773 -25308 -18480 31733 14050 -3013 -83894 -58363 -3695 -28792 -97220 -98299 -38719
25413c8719J4269l2479K4684N3541J1098m3816m5813j0608L901j7476M8005M8031
25401A4618J0944L2794N381J6267m8410k3425k7043n6094M1585m539J2154K8245
25389B477N587m0164K4850K9010j6079N0580M7093L0403o1011l031k4631m890
25377D0194M2158k8504q1662n4031P508M0651m816L9167j2809K874K1855m3114
25365c0529j4308K1118n176K0675k143L3436J8326k7411P06O1452M3769l170n5117
25352F1628m125l6514J46L1741J4256l3801J4768M744j980O6424P3138M3004J4956
25339B48385l2389J12844K29165K45958J51108K03842K90909O5355r6454j3534
25329A405189N8678N7986k32388l51030k85401j44206m7176l6651o6714n7297
$$ plain form
25413 -38719 -24450 -56929 -32245 21296 32394 -11422 -57235 -67843 -63942 -81418 -33413 14618
25401 14618 25562 58356 63737 80004 31594 8169 -18874 -74968 -33383 -37922 -25768 2477
25389 2477 8064 -32100 -7250 21760 5681 56261 103354 133757 72746 69715 45084 40194
25377 40194 82352 53848 -27814 -81845 -74337 -33686 -38502 665 -12144 -9270 12585 -30529
25365 -30529 -44837 -23719 -28895 -8220 -10363 23073 41399 13988 14694 76146 119915 116745 61628
25352 61628 57503 20989 21135 52876 67132 33331 48099 52843 50863 117287 190425 233429 248385
25339 248385 215996 328840 558005 803963 955071 1158913 1449822 1515177 1418723 1405189
25329 1405189 1463867 1521853 1289465 938435 653034 508828 461652 425001 358287 300990
25319C00990n3680l4214l3904K291L8598m5982o5989j440l6378L7370k7421p8326
25307A915l3126K4124l0851J6706R0473q945m0790P905L5393k4141j2698m031
25295B1934K7723L6333J8781m5284K76K2427k3051O258m4224R572J237L3811j5122
25282E0671o1890l0137L3103K2808l711J5715M9222j0780o4731k7560o4280P44
25270i0826N3340K4851m7439K368L44J4116O2066o943n584l3771Q760P5685J2743
25257F9710k1200l5493j1295J2683k1611J5737K5987N8248o2914o4844k2002J2793
25245d4201m6702j139J461j9014l1318Q577j5133L9997L2298N7016L6977j0190
25233H629k8127k8764n9255n8531J0210R7518O666l7853K2257K5104J6524m9047
$$ plain form
25319 300990 247310 213096 179192 181483 220081 174099 108110 106670 70292 107662 80241 1915
25307 1915 -31211 -7087 -37938 -21232 69241 60296 19506 27411 62804 38663 25965 21934
25295 21934 49657 85990 104771 59487 59763 82190 59139 65397 21173 30745 31982 65793 50671
25282 50671 -11219 -41356 -8253 14555 10844 26559 75781 65001 270 -27290 -91570 -90826
25270 -90826 -37486 -12635 -60074 -57706 -57362 -43246 18820 11877 6293 -27478 -18718 56967 69710
25257 69710 48510 13017 1722 14405 -7206 8531 34518 92766 29852 -34992 -56994 -44201
25245 -44201 -90903 -92042 -90581 -109595 -140913 -132336 -147469 -107472 -75174 -18158 18819 8629
25233 8629 -19498 -48262 -107517 -166048 -155838 -58320 -51654 -89507 -67250 -42146 -25622 -74669
25221g4669P239L1241k999k0254q300j2361j3877N623K8000j041j6491M3622n682
25208c9949K0252k3914L7875K2514j2270l9027N872l6446N437k3013M4679L6254
25196a736L4736l857K2448J2390k2352k019M929l4799K3752j75l1701l1889j5388
25183d5661J1127M636K296j823J3656L80M9995j3482q3615m818L540K8704J884
25170c3181J132o0861J5850P6698j2933k9840P6864L5696l930j08250o3577K9704
25158g6628M3569K5926p942r710L2128Q234l7483o0324j8084K6679N874o339O1807
25145a2293r748k461N4970K2482k7360m5783M045K4635K946k955j3800Q67L227
25132a228J5038j3173n5469l5125l8790q659Q1370k8639m7503O5939J3286l5165
$$ plain form
25221 -74669 -67430 -36189 -39188 -59442 -67742 -80103 -93980 -88357 -60357 -61398 -77889 -34267 -39949
25208 -39949 -19697 -43611 -5736 16778 4508 -34519 -28647 -65093 -59656 -82669 -37990 -1736
25196 -1736 33000 29143 51591 63981 41629 39610 44539 9740 33492 33317 1616 -30273 -45661
25183 -45661 -34534 -29898 -27602 -29425 -15769 -15389 34606 21124 -62491 -67309 -63769 -35065 -33181
25170 -33181 -32049 -92910 -77060 -362 -13295 -43135 33729 69425 65495 -42755 -106332 -76628
25158 -76628 -33059 -7133 -15075 -24785 7343 15577 -21906 -82230 -100314 -73635 -67761 -74100 -12293
25145 -12293 -22041 -24502 30468 52950 25590 -20193 -16148 8487 11433 8478 -5322 -4455 -1228
25132 -1228 13810 637 -54832 -89957 -128747 -137406 -56036 -84675 -132178 -66239 -52953 -88118
25120h8118m0076K925K9143Q6231p913p5277j2184J2210M7778P0725J3278k9469
25108I253j6150l1120M9963m187o7478l5576l92N4714Q8420j85k5101l933j3931
25095D297o425K252O5325j9997k6663r370M075J9195l4669q1882m9525M1176O4162
25082b8049R5893N5754L251k0187l3215j4266O070p266j8367J802L0862o0376
25070A1906m9226l4094M6890Q0446j3068o5001k1211P94M9707Q6165J3040q705
25058I7643k2486k3590j30L7377L3919n4556o0106j8979r943M2286K2863M719
25046D9017o1632O656M3353L5164m1945k7347J9445K0862o2939m5900Q2371n741
25034A1364K9244K1443L3921K9562n0180l8927m7371k9892m4610J0393P455l0664
$$ plain form
25120 -88118 -128194 -125269 -96126 -9895 -17808 -93085 -105269 -93059 -45281 25444 38722 9253
25108 9253 -6897 -38017 11946 7759 -59719 -95295 -95687 -40973 47447 47262 22161 18228 4297
25095 4297 -2128 124 65449 45452 18789 9419 13494 32689 -1980 -83862 -133387 -92211 -28049
25082 -28049 67844 123598 126849 106662 73447 59181 65251 57985 39618 41420 72282 11906
25070 11906 -37320 -71414 -24524 55922 42854 -22147 -43358 -42564 7143 93308 106348 97643
25058 97643 75157 51567 51437 88814 122733 68177 8071 -10908 -20851 21435 44298 49017
25046 49017 -12615 -5959 37394 72558 30613 3266 22711 43573 -19366 -65266 17105 11364
25034 11364 40608 62051 95972 125534 75354 36427 -10944 -40836 -85446 -75053 -67598 -98262
25022i8262K3629P386J7538l3711N6018N2712n1702o6685J5295n89J0170K1177
25010d7024J16941P6952j5670j0164L2715N8862n805l5724P0678P8517r8775p7222
24998A44281k4955P977M219N403K5132m3503n5861K9732L7010j6634l1028n7571
24986B4202l551K9809M3297J3179j7085o3790k2887M3703O611K6871Q997k5077
24974F4279o998p8080l9787K7243k8568M4241K8757n1450l8784J9308P7504N1982
24962F9647j0905J3582L5809n1261n6456K6776O549l9404n2634M7412N7757r794
24950C7078k6295k614p912j0295M3604K6788J2447k310r7839j5655L0813l5900
24938d8090j1494j1987r483M3114P961L9609K9579J2320K9661l5524j1136M2203
$$ plain form
25022 -98262 -74633 -67247 -49709 -83420 -27402 25310 -26392 -93077 -77782 -78371 -68201 -47024
25010 -47024 69917 146869 131199 121035 153750 212612 206807 171083 241761 320278 221503 144281
24998 144281 119326 127303 131522 136925 162057 118554 62693 92425 129435 112801 81773 24202
24986 24202 20651 50460 93757 106936 89851 26061 3174 46877 53488 80359 89356 64279
24974 64279 57281 -20799 -60586 -33343 -61911 -17670 11087 -40363 -79147 -59839 17665 69647
24962 69647 58742 72324 108133 56872 416 27192 33741 -5663 -58297 -10885 46872 37078
24950 37078 10783 8169 257 -10038 33566 60354 72801 70491 -27348 -43003 -12190 -48090
24938 -48090 -59584 -71571 -81054 -37940 -29979 9630 39209 51529 81190 45666 34530 76733
24926G6733J5200j9842P105j2155o572p761J0447n8646m0960M0235J096l2574
24914b7694M5568L2212n8727K68J2372j8503k7229r523L4835L4624L939L8719
24902F0861Q1734L1313j7850q2205L3366K930M9122j1436M3670j2085m1329L8533
24890A76624k2426p8417O079o962l9874l0091J2345O0301M1940p6569r7873L8323
24878a6600M9111J9330j8605j0699M8197M4149M9924k3626l3234J5539K8405k8475
24866A23416K129K3066o769J4253J35809K2201m6634l7778l9396P4532N1253L4452
24854C50534J7524M4702p57n9105n5907k3286O3674R253L0131M3559l8060O888
24842C89150K3015P1631P682L1538j0821k5284P133L3564r005l7333j6873k4755
$$ plain form
24926 76733 91933 72091 79196 67041 60469 52708 63155 4509 -36451 3784 4880 -27694
24914 -27694 17874 50086 -8641 -8373 3999 -14504 -41733 -51256 -16421 18203 22142 60861
24902 60861 142595 173908 156058 73853 107219 110149 159271 147835 191505 179420 138091 176624
24890 176624 154198 75781 81860 74898 35024 4933 17278 77579 119519 42950 -54923 -16600
24878 -16600 32511 51841 33236 22537 70734 114883 164807 141181 107947 123486 151891 123416
24866 123416 125545 148611 141842 156095 291904 314105 267471 229693 190297 264829 316082 350534
24854 350534 368058 412760 412003 352898 296991 273705 337379 346632 376763 420322 382262 389150
24842 389150 412165 483796 491478 523016 512195 486911 494044 527608 518603 481270 464397 439642
24830D39642N1424O5295O3623J32934K19505K52950K41758K51476K5773r0088
24820A654292p780J8495Q3957j39339k90160k04209j82244r5820m0244M5517L9049
24809H81514p059L1074L0772M8748J9944M6841j3576k4820l9371P469O4215O3585
24797A109336P1061l0838N0617J06999J07926J85029J77113J73896K07439K13576
24787B372154J61511J34820J65772K75081L50164L56869L69701L36233L74513
24778D896818M85207N05782O05094O36541Q43812R16058R49492J079959J202186
24769A2120949J239838J510900J805071K078150K323810K708253L534622M568475
24761C1890068N936964Q249245J2258309J9131292K9531140L8671981M4293667
$$ plain form
24830 439642 491066 556361 619984 752918 972423 1225373 1467131 1718607 1744380 1654292
24820 1654292 1646512 1665007 1748964 1609625 1319465 1115256 933012 837192 796948 842465 881514
24809 881514 874455 905529 936301 985049 1004993 1051834 1038258 1013438 974067 981536 1045751 1109336
24797 1109336 1180397 1149559 1200176 1307175 1415101 1600130 1777243 1951139 2158578 2372154
24787 2372154 2533665 2668485 2834257 3109338 3459502 3816371 4186072 4522305 4896818
24778 4896818 5382025 5887807 6492901 7129442 7973254 8889312 9838804 10918763 12120949
24769 12120949 13360787 14871687 16676758 18754908 21078718 23786971 27321593 31890068
24761 31890068 37827032 46076277 58334586 77465878 106997018 145668999 189962666
24754A89962666N6083327L1356042k3862260j9574180M141014K3195377m076647
24747B57225339o2721204n8683744l4345909k0485353j3175442q613364n746752
24740E3453571l940875l196099l290258l277456k913814k455026k155975k516830
24732B9707238k929283k768340k569635k201585j806841j597484j550802j320942
24724A2962326j070865r21096r66444q95687p52400o42624n63784n56237n75794
24715F017395m57105l63801l17419k83858l05372l25529l14210k77082j77112
24706C195907j86526j87094j73166j72423j68453j52385q5141j72652p9365n5820
24696A762882j42998j11769N125m5930k6942J0735j1605l7133N0459J95917J98350
$$ plain form
24754 189962666 246045993 277402035 253539775 233965595 238106609 261301986 257225339
24747 257225339 194504135 135820391 101474482 80989129 67813687 59200323 53453571
24740 53453571 49512696 46316597 43026339 39748883 36835069 34380043 32224068 29707238
24732 29707238 26777955 24009615 21439980 19238395 17431554 15834070 14283268 12962326
24724 12962326 11891461 10970365 10003921 9108234 8355834 7713210 7149426 6593189 6017395
24715 6017395 5560290 5196489 4879070 4595212 4289840 3964311 3650101 3373019 3195907
24706 3195907 3009381 2822287 2649121 2476698 2308245 2155860 2070719 1898067 1818702 1762882
24696 1762882 1619884 1508115 1513240 1467310 1440368 1451103 1439498 1402365 1452824 1648741 1847091
24685A847091K22704J98354N4011j40716j19928M4352J81269M363l36096l67767
24675A587637k50440j59372l8901n3665o6030J603k5711r9376m5718N229m3366
24664H11890p8066n6464J262L7592m9381q8890j653m1453l2866j4571l9166J7990
24652D66224K6298L2985m1590n4496j0505L7400P062q06m9832M0572k0989j9648
24640D12675P7382M9437m2507q6615o4879k8270J2610n0557j8627N394O6942Q3398
24628D16383L4897P2203o378N8868j2762m5384k401Q792K0739n9789n5955j5273
24616D13940L5013R871q6090o0059n310J4139o69j6820k4887k7432M4794Q6870
24604C83360q389j8356k2823j0248J9902J2350O3652K5692j3323L5985Q1743K5736
$$ plain form
24685 1847091 2069795 2268149 2322160 2181444 2061516 2105868 2287137 2291500 1955404 1587637
24675 1587637 1337197 1177825 1138924 1085259 1019229 1020832 995121 895745 850027 855256 811890
24664 811890 733824 677360 678622 716214 666833 577943 576290 534837 501971 487400 448234 466224
24652 466224 492522 525507 483917 429421 418916 456316 463378 462572 412740 453312 432323 412675
24640 412675 490057 539494 496987 410372 345493 317223 329833 279276 260649 266043 332985 416383
24628 416383 451280 523483 517105 575973 563211 517827 515426 524218 544957 485168 429213 413940
24616 413940 448953 458824 372734 312675 307365 321504 320835 304015 279128 251696 296490 383360
24604 383360 374971 356615 333792 323544 343446 355796 419448 445140 431817 467802 549545 575281
24592E75281r4440j07966q9718l6299L8001M2562L1759q053k4084k9637R517N191
24580C12114N2252o4428o4448k3828m1304J3390M5222M929K5565P193J989N1907
24568C20553L0219k51j5388j121k969J2985N2008m8212k5496j7988l877o5821
24556B34642l1064l4901k0405j0169M866J8422J6118M4797K2911m3370r6992J3730
24544A18585L4296J1236Q952O100J1931j800o5288j1010K7389m7997k7635j1292
24532E3467q488L288K9665J0218O018k7297n70J0360O2258L9141m388N695K919
24519A82286l046M6130j7342j0668m3424k9620M659j5880o579l4168k3625K1246
24507F9969K0457M7078Q945k6914M4200J0449M1090k2903k9990J5754L4861p4433
$$ plain form
24592 575281 480841 372875 283157 246858 284859 327421 359180 351127 327043 297406 306923 312114
24580 312114 364366 299938 235490 211662 170358 183748 228970 233899 259464 266657 268646 320553
24568 320553 350772 350521 335133 334012 331043 344028 396036 347824 322328 304340 300463 234642
24556 234642 203578 168677 148272 138103 142969 161391 177509 222306 245217 201847 104855 118585
24544 118585 152881 164117 173069 179169 191100 189300 124012 113002 140391 92394 64759 53467
24532 53467 44979 48267 77932 88150 94168 66871 66301 76661 138919 178060 173672 179367 182286
24519 182286 179240 225370 208028 197360 153936 124316 128975 113095 106516 72348 48723 69969
24507 69969 90426 137504 146449 119535 163735 174184 215274 192371 162381 178135 212996 138563
24495A38563n0597K6678K3921k3929r160O5298Q268L2332L529m7750P948m4875
24483A30226k374P9117M068l5013o3324J5481K9739m4871r138p341n1845j2498
24471C2227L1889K9852q664n3746o5795j5239M7983J23070M6155k0129J1480j321
24459A57762Q995n518J5709k7881j0587j8966L8840M8850q192k1918n8426k5807
24447I2861m5448o9514k6333N4142P2495M71r0997n2725M3857O3560p567m2426
24435g624q847j3183J4968L3429k4848P240M1236R8165N1844j6312m3621j5343
24423A17104n0137q0349J810K7047K1674O5612L7726L4267l207l6629p5889l0754
24411B8275L4863K5049J3105J9189k4773l8385k3831j7682l5244K2525M2171j526
$$ plain form
24495 138563 87966 114644 138565 114636 105476 170774 179042 211374 214903 167153 175101 130226
24483 130226 127852 206969 211037 176024 112700 128181 157920 113049 103911 96570 44725 32227
24471 32227 64116 93968 85304 31558 -34237 -49476 -1493 121577 167732 147603 159083 157762
24459 157762 166757 161239 176948 149067 138480 119514 158354 207204 199012 177094 118668 92861
24447 92861 47413 -22101 -48434 5708 78203 78674 -12323 -65048 -21191 42369 34802 -7624
24435 -7624 -16471 -29654 -14686 18743 -6105 1135 42371 140536 192380 176068 132447 117104
24423 117104 66967 -13382 -11572 15475 37149 102761 140487 174754 171547 134918 59029 28275
24411 28275 63138 88187 101292 120481 95708 57323 33492 15810 -19434 3091 45262 43736
24399D3736k5754o23Q673j4833j4178R009R425J1165o936J3169l117m3244K0588
24386G080l0158R91n689R4517K6376n9220k5403L3255M3073j1179K7476O5624
24374A66743r695j0758N9864j3536m6855m6153n8875j8526m9558J9846Q067P147
24362G711J8671n0000J6225Q692l8571K2981L4178l511j6835j2065J8919j1665
24350e270k1933K1167j275R669L7626j9508K0618J2083J1440l3321L4522K7375
24338I3193J5312K2616P817M127j0800K9172p229p0888q4737M8859K9402p0558
24326F286r0037l3731L8209L8245N1854K2397n9194j0386l4752N0650J1759L8521
24314B9821N1663m8419k0003K5966N7772K9550n466l1166m8112n665K5505k6910
$$ plain form
24399 43736 17982 17359 26032 11199 -2979 6030 15455 26620 19684 32853 29736 -13508 7080
24386 7080 -23078 -22087 -27776 66741 93117 33897 8494 41749 84822 73643 101119 166743
24374 166743 157048 146290 206154 192618 145763 99610 40735 22209 -27349 -7503 564 7711
24362 7711 26382 -23618 -7393 1299 -37272 -14291 19887 16376 -459 -12524 6395 -5270
24350 -5270 -27203 -6036 -7311 2358 39984 20476 41094 53177 64617 31296 65818 93193
24338 93193 108505 131121 138938 143065 132265 161437 154208 83320 -1417 47442 76844 6286
24326 6286 -83751 -117482 -79273 -41028 10826 33223 -25971 -36357 -71109 -20459 -8700 29821
24314 29821 81484 33065 13062 39028 96800 126350 120884 89718 41606 35941 61446 34536
24302C4536O140j6261N7479K9236J9247J326r2429n0761P095L913M714J4821K8446
24289D7502K9162J8902R850K4209p639k755L2020j2740l3235p1764M8355j3814
24277F8053n390O0862P64o9857j2412m4119n037o648J6818J4057k6914k4403n443
24264c9669J4636O3324P5237J3943n6997k2617Q561n8213o940P5673r771K0409
24252G7576L732L4541K5983l1275k6174K3561l3039K6068k9264j080K4159j0085
24240H4703n0123J287l6481n0445K5868j588L293k738K5207J3009L0315R754j3042
24227C9019K1241m9132L986j2431j0674J4886l6196L74n818M1531R1633j9727
24215G8692p380p195p160j7959l9799L435k8131l6250J3093N1189j7721J6317
$$ plain form
24302 34536 40676 24415 81894 111130 130377 131703 39274 -11487 -4392 -479 4235 19056 47502
24289 47502 76664 95566 105416 129625 121986 119231 151251 138511 105276 33512 81867 68053
24277 68053 62663 123525 124289 54432 42020 -2099 -7136 -13784 3034 17091 -9823 -34226 -39669
24264 -39669 -25033 38291 113528 127471 70474 47857 56418 -1795 -8735 66938 57167 77576
24252 77576 81308 115849 141832 110557 84383 107944 74905 100973 71709 70629 94788 84703
24240 84703 34580 35867 -614 -51059 -25191 -26779 -23486 -26224 -1017 11992 42307 52061 39019
24227 39019 60260 11128 15114 2683 -7991 6895 -29301 -28927 -34745 6786 98419 78692
24215 78692 71312 64117 56957 38998 -801 2634 -25497 -61747 -48654 2535 -15186 1131
24203A131L8107R453K9657o938m03m7233l3255Q286j051k6338m040K154n5226
24190h5696R345M7749M032J7539L4852O5771N6641J9361m0423o5416O130L2677
24178A02562R117L2532L0269M6579M6116K0194J4269p945Q1617Q9492J43325K53117
24166H61244L01052L29522J06417j82875j61981Q5365J33673r7667l52830l37796
24156F84124j44020o9527j10996o9188l4497M7770K40m8537J4474L577l2667l5671
24144B05082j9569o9254o6278J2394j0662l1633j23o494K6551P8751m5409n1304
24132B2052N893K1533K8459j0761M1447m0867M907L6568Q766k816j0523J3198
24120A17856J7931m3058l2318m5592j095l8075j4429J6304k1889L2189L6381j49
$$ plain form
24203 1131 39238 48691 78348 71410 71007 23774 -9481 -1195 -2246 -28584 -32624 -30470 -85696
24190 -85696 -76351 -28602 -24570 -7031 27821 93592 150233 169594 129171 63755 69885 102562
24178 102562 111679 144211 174480 221059 267175 287369 301638 293693 375310 464802 608127 861244
24166 861244 1162296 1491818 1598235 1415360 1253379 1338744 1472417 1374750 1021920 684124
24156 684124 540104 470577 359581 290393 255896 303666 303906 255369 269843 273420 240753 205082
24144 205082 185513 116259 49981 62375 51713 20080 19957 13463 40014 118765 73356 22052
24132 22052 27945 49478 77937 67176 108623 67756 72663 109231 117997 115181 104658 117856
24120 117856 135787 92729 60411 14819 13724 -24351 -38780 -22476 -44365 -12176 24205 24056
24108B4056L6841k1784k7709k7186n044j8582J3496K1274o245l848M8644m0898
24096f985q2788n832K9536l28M4406M8765J2145l9952m5893O054k3433L2647J6842
24083a4816Q899K1197L1858K12q1676M2195P2895m557r2714l5733J5578j0393
24071d7055k1484K3396m3459K6100L1003j290O032L6703M097K4556K1626j1880
24059D8345J3289m3334m7331K3348O2874L0061n3980M2038K9883j9623k7647m134
24047E3789J02113M8572m4946n1348m4293l4094m618J0629j2697r392o9437m1511
24035i7233K4072n700P057M5020L7731Q733r06J3545m6713k153J1250m2778J9149
24022b8926K6527L0356N5550m7863l5721l0166k7581o045N834L2479J7154M7541
$$ plain form
24108 24056 60897 39113 11404 -15782 -20826 -39408 -25912 -4638 -10883 -14731 33913 -6985
24096 -6985 -89773 -95605 -66069 -66397 -21991 26774 38919 -1033 -46926 -40872 -64305 -31658 -14816
24083 -14816 -5917 15280 47138 47350 -34326 7869 80764 76207 -16507 -52240 -36662 -47055
24071 -47055 -68539 -45143 -88602 -62502 -31499 -32789 -26757 9946 14043 38599 60225 48345
24059 48345 61634 18300 -29031 -5683 57191 87252 33272 75310 105193 85570 57923 53789
24047 53789 155902 204474 159528 108180 63887 29793 25175 35804 23107 13715 -55722 -97233
24035 -97233 -73161 -78861 -71804 -26784 10947 19680 18774 32319 -14394 -16547 -5297 -48075 -28926
24022 -28926 -2399 27957 83507 35644 -77 -30243 -57824 -63869 -58035 -25556 -8402 39139
24010C9139N171N3580J8701n7539J7784k8299j916O340M9780k2922k5540J351
23998E5630N0006k323o0781n4607p6612k0599K8725Q663k6484K9199N1711K3240
23986E768j7574n5077K9772L3997M9516K7301l0620R471L4441m3345l4579M574
23974A3645L3907p293k7336N3861L7507n5301L0264O3574l8383m9325J9031k5854
23962D8297m2586m5095L0594P3853K3015n8365q7703L9492J2436k1041j8909J1387
23950c4625j0386l2243M5903J9934L162j1021J2201M6656J9202L5053l990k2550
23938F7296n8270l5831K8638r544n624k5738l9045O1854J10334J14105o7169o3373
23926G7633J109j9413k3855n6513J4195N6114N1773j9840o7588N524P411P4994
$$ plain form
24010 39139 44310 97890 116591 59052 76836 48537 46621 52961 102741 79819 54279 55630
23998 55630 105636 103313 42532 -12075 -88687 -109286 -80561 -71898 -98382 -69183 -17472 5768
23986 5768 -11806 -66883 -37111 -3114 46402 73703 43083 52554 86995 43650 9071 13645
23974 13645 47552 40259 12923 66784 104291 48990 79254 142828 104445 55120 74151 48297
23962 48297 5711 -39384 -8790 65063 88078 29713 -57990 -18498 -6062 -27103 -46012 -34625
23950 -34625 -45011 -77254 -31351 -11417 -8255 -19276 -7075 39581 58783 93836 89846 67296
23938 67296 9026 -26805 1833 -7711 -13335 -39073 -78118 -16264 94070 208175 141006 77633
23926 77633 78742 59329 35474 -21039 -6844 49270 101043 81203 13615 19139 26550 101544
23914A01544r92L3843L5054m4009n4983p4053Q1853O1633J3209l8795m1127j6324
23902E6853n1762l914N1540n4483q49M76l3684j9204K497J9900k7959j9591J7048
23889f3132n681P235j580j7061l2153N0969O2610l3514M0335N4708O143n712l9558
23876B3609r746k6745K5909O3763l4652l9348J1609l46Q214J1822n7548J3974
23864i485j8468n124L3055m508j4243j9605O0379R451J8610K1995j7101L5860
23852I0816K8405J1043k8495n9929l9176J1640J3020P0245J7411J6709k2821k8157
23840H0711n0062k6039n0068N2657K8084j8704p7992P818O2333L1785o04k9171
23828A0748p9259J4629J8950k535L7840K1286J4660L473n5834k5466Q6529j2863
$$ plain form
23914 101544 100552 134395 169449 125440 70457 -3596 78257 139890 153099 114304 73177 56853
23902 56853 5091 1177 52717 -1766 -2615 -2139 -35823 -55027 -52530 -32630 -60589 -80180 -63132
23889 -63132 -68813 -61578 -63158 -80219 -112372 -61403 1207 -32307 8028 62736 68879 63167 23609
23876 23609 13863 -12882 13027 76790 42138 2790 14399 14053 22267 34089 -23459 -9485
23864 -9485 -27953 -33077 -22 -4530 -18773 -38378 22001 31452 50062 72057 54956 90816
23852 90816 119221 130264 101769 41840 2664 14304 27324 97569 114980 131689 108868 80711
23840 80711 30649 4610 -45458 7199 35283 16579 -61413 -53595 8738 40523 39919 10748
23828 10748 -68511 -53882 -34932 -37467 373 21659 36319 39792 -16042 -41508 45021 32158
23816C2158L5884k1749n9352l997Q3480m4833K8170O501k3190L1275m9412j5563
23804f28M6975k8637n7678m7094N7399N1463j911m150m7615m5843Q8362P6911
23792H7554L546m4734j7030k760k8208J8602m9407n3822J3593K9065P3397L304
23780C3100n6063j1160N035N1966k796j8092k8431n9632l9846j969N2234N8113
23768a7541j7899m5316l2938M3793K8450Q226N4410q397L380L1818N3730k1809
23756G9907q111R422k4097o4509k2831k1838J5742K9528m8922k1089Q0739O1748
23744F5689o4304m5865l962n642O4209q309j830o586K5016N824j0767m3829j1330
23731d1686j1248L232J2901N3344N6071L9212n7014R936N2258M155l3456k9214
$$ plain form
23816 32158 68042 46293 -13059 -17056 66424 21591 49761 56262 33072 64347 14935 -628
23804 -628 46347 17710 -39968 -87062 -29663 21800 19889 15739 -31876 -77719 10643 87554
23792 87554 91100 46366 29336 26576 -1632 16970 -32437 -86259 -72666 -43601 29796 33100
23780 33100 -22963 -34123 -29088 22878 20082 1990 -26441 -86073 -125919 -127888 -75654 -17541
23768 -17541 -35440 -80756 -113694 -69901 -41451 -33225 21185 12788 16168 47986 101716 79907
23756 79907 71796 81218 57121 -7388 -30219 -52057 -36315 -6787 -55709 -76798 3941 65689
23744 65689 1385 -44480 -48442 -54084 10125 1816 -14 -6600 18416 24240 13473 -30356 -41686
23731 -41686 -52934 -49702 -36801 16543 72614 111826 54812 64748 117006 121161 87705 58491
23719E8491o930q231k475l3830l7495j4754O93k5752L197L2459J5710j3221q666
23706d0804O4705k5248j8767R0038J4395p2688p0334K4017R609J0202J138L0674
23694A6937J3743R36l3444J8145K1737K3717K7297p5013p4394n0582k3465K3064
23682a11322Q8860O0578r80j3396k9874Q831r25l7648m6689j7635N4291R4523
23670D8614j9588k1244j1626k1732O383k1307l2106N7412L9004j5236j415l7865
23658c0706p240j5515Q2923K3325O9326l3404j00499l2190m2462k5314P7228J5469
23646a9059m0467M1241J2372M1670J2981l8787l9778K4212p6764n1917L6673Q449
23634h9174M0086L1175k6612K6516K0832O543j397M6805J5686j3769n563J4711
$$ plain form
23719 58491 51561 43330 40855 7025 -30470 -45224 -44531 -70283 -67086 -34627 -18917 -32138 -40804
23706 -40804 23901 -1347 -20114 69924 84319 11631 -58703 -34686 -25077 -14875 -13737 16937
23694 16937 30680 31616 -1828 16317 38054 61771 89068 14055 -60339 -110921 -134386 -111322
23682 -111322 -22462 38116 37136 23740 -6134 2697 1772 -35876 -82565 -100200 -45909 48614
23670 48614 29026 7782 -3844 -25576 -19193 -40500 -72606 -15194 23810 8574 7159 -30706
23658 -30706 -37946 -53461 29462 52787 122113 88709 -11790 -43980 -86442 -111756 -34528 -19059
23646 -19059 -59526 -18285 -5913 35757 48738 9951 -29827 -5615 -82379 -134296 -97623 -89174
23634 -89174 -49088 -17913 -44525 -18009 2823 9366 7969 54774 70460 56691 51128 65839
23622F5839j3943K566j3545J0603n324n1378n2420N1751Q1975o0134k8469k8791
23610d1270j600j2636N2058Q4663J9781p4152j0191r491l6231o0265O080j2899
23598i6153o364O974m3722N6733O8366j1590m8970O847N3190J8201K2022j6255
23586I279j6889k9725K2599J200M6787O82m6382j7603j3453M2190K0076M5424
23574F4185l6202j1715n1351M2883O657m4019o158q010j6366J6541n14j6033K359
23561e7743m2894m5934N1156O2499J1409l1412J2999l2389J5762J946N1385J046
23549b170j6215P387l7031k4510K2937j470q4765n3597k992M9444N7150j3253
23537i9085N9816P4383l8298K4380j7076j5405M7516O772L635k5655m7476j0862
$$ plain form
23622 65839 51896 54462 40917 51520 46196 -5182 -57602 -5851 76124 15990 -12479 -41270
23610 -41270 -42870 -55506 -3448 81215 100996 26844 16653 7162 -29069 -89334 -83254 -96153
23598 -96153 -102517 -95543 -139265 -82532 -14166 -25756 -74726 -67879 -14689 3512 25534 9279
23586 9279 -7610 -37335 -14736 -13536 33251 33933 -12449 -30052 -43505 -1315 18761 64185
23574 64185 27983 16268 -35083 7800 14457 -29562 -35720 -43730 -60096 -43555 -44069 -60102 -57743
23561 -57743 -100637 -146571 -95415 -32916 -21507 -52919 -39920 -72309 -56547 -54601 -3216 -2170
23549 -2170 -18385 -10998 -48029 -72539 -49602 -51072 -135837 -189434 -192426 -142982 -85832 -99085
23537 -99085 -39269 35114 -3184 21196 4120 -11285 36231 43003 46638 20983 -26493 -37355
23525c7355O7033Q2522K6017q7206q0022j2830J0021p334j1753n191l1096l3337
23513a20531k4284L5784J5516j0163P137k888O2425J8864j8148k31M2854j9411
23501a3076k2438j8561K3851J5402n08M966n4370k857L1939M8770Q94j2780l4146
23488c2914p715n365K4396O060k3977m2742K2606N7145M4158k3391k1334o6515
23476f9588m5535j7496O6382N4266M8389O8539N0943n1140p4385l2471k079J6910
23464A2735N4380l1197l5326k8636r011n638k5282k0480L2324L0174J4215k1718
23452c3460O4824N9662m0389k4759j8916m2131k7493M4433N9013L0306r02j1577
23440E8611o4113o3306M4581J5606k7485m3096M4372K3917l3162J3986P10o683
$$ plain form
23525 -37355 29678 112200 138217 51011 -29011 -41841 -31820 -39154 -50907 -56098 -87194 -120531
23513 -120531 -144815 -109031 -93515 -103678 -96541 -99429 -37004 -18140 -36288 -36519 6335 -13076
23501 -13076 -35514 -54075 -30224 -14822 -15330 -10364 -64734 -67591 -35652 13118 14012 1232 -32914
23488 -32914 -40629 -45994 -21598 -15538 -39515 -82257 -59651 -2506 41652 18261 -3073 -69588
23476 -69588 -115123 -132619 -66237 -11971 36418 104957 155900 104760 30375 -2096 -4175 12735
23464 12735 67115 35918 592 -28044 -37055 -42693 -67975 -88455 -56131 -25957 -11742 -33460
23452 -33460 31364 91026 50637 25878 6962 -35169 -62662 -18229 40784 71090 70188 58611
23440 58611 -5502 -68808 -24227 -8621 -36106 -79202 -34830 -10913 -44075 -30089 -29379 -36062
23428c6062K5579K6104K5731N726j325j8950j649M9414r576j6014J0793l2495
23416B7276o1717J261l59N1846N3248l5899m1390j0133N08J6332K9489l1720m7702
23403d8960j3038o188N2348j3143M7277M1531j3118j10375M9635L7273L8437l4140
23391B7539k7545O4539l6758j07724Q878M7296O8245K037N247n4302p5913m2106
23379a20567J8419N5623Q6856L6867l9700l4527l6009k6664N0135Q2203K7725
23368A00361l728m1424p2601l6239K7145N389M8078n675n4639M0651K8802P87
23356C6907K9318o1825p5904N796K1709m350J2175L9997P8124O1022l4876j00487
23344G606m6704K1765n3430j6926p92K5896N5053Q639l4880k5627M1116J7965
$$ plain form
23428 -36062 -10483 15621 41352 47078 45753 26803 25154 74568 64992 48978 59771 27276
23416 27276 -34441 -33180 -33539 18307 71555 35656 -5734 -15867 -15359 973 30462 -1258 -48960
23403 -48960 -61998 -68186 -15838 -28981 18296 59827 46709 -63666 -14031 23242 61679 27539
23391 27539 -6 64533 27775 -79949 -71071 -23775 44470 46507 51754 -2548 -78461 -120567
23379 -120567 -102148 -46525 40331 77198 37498 2971 -33038 -59702 -9567 72636 100361
23368 100361 96633 55209 -17392 -53631 -26486 -21097 26981 21306 -33333 7318 36120 36907
23356 36907 66225 4400 -71504 -65708 -43999 -48349 -36174 3823 81947 142969 108093 7606
23344 7606 -39098 -17333 -70763 -87689 -88481 -62585 -7532 1107 -33773 -59400 -18284 -319
23332c19l0851j4012m044J0655l1450j8563o351P36P0384m2489J3919O2923M9258
23319E9796l2084m7432l1352k1492L8990j2630n8250L623J7488j7025Q11k3677
23307a23234J1289N5474M5399l6617k8819O723n6258l1398N1062K5000O082k9399
23295a04696L4924N6610M0591P863K650l841j6583l0529l036p845m4012j082m291
23282g3277J1741K2997P0610K7540J2074m0991q4779n1825j093Q1486M7713m7449
23270b5253J6264L6797K561L1734l8007m3285M846o826j7038n801K600l9638L3651
23257d7395N6014L7186l2798j5591m2696m1281L0154M9342L9213n5159n5478O176
23245g2313M6451j3046n0364M2748M1544J9909J500k1667L4960m7228j9603L5544
$$ plain form
23332 -319 -31170 -45182 -49226 -38571 -70021 -88584 -94935 -94199 -23815 -66304 -52385 10538 59796
23319 59796 27712 -19720 -51072 -72564 -33574 -46204 -104454 -100831 -83343 -100368 -99557 -123234
23307 -123234 -111945 -56471 -11072 -47689 -76508 -69785 -126043 -157441 -106379 -81379 -75297 -104696
23295 -104696 -69772 -13162 27429 35292 37942 34101 17518 -13011 -16047 -23892 -67904 -68986 -73277
23282 -73277 -61536 -38539 32071 59611 71685 30694 -54085 -105910 -107003 -25517 22196 -25253
23270 -25253 -8989 27808 30369 62103 24096 -19189 -14343 -21169 -38207 -44008 -41408 -81046 -47395
23257 -47395 8619 45805 13007 -2584 -45280 -86561 -56407 -7065 32148 -23011 -78489 -72313
23245 -72313 -25862 -38908 -89272 -46524 -4980 14929 16429 -5238 29722 -17506 -37109 -1565
23233a565p913L9400K0426l6077k3951K070L1581m2287n8690L1065P653k0517
23221e8805P5715K9015n2081L7947k0781p3925l3268j410J0739J2586K3645P4787
23209B4164K792L0735k9204j9350L5634K807o5588l0459P580K4204O0825n2495
23197h355r346j6949k1285o0456J0431L1829O2501L0593o203n9923J5149O0604
23185B8590O2978L3303k1711n2029p3395m0123l5918k6703Q2261R6302J5019J5119
23173H3693m6377p1539R727J5934K6132j9722j4387K7354L8715L5706J093m7168
23161C9161p7477l2490J8580l4582N8319J6845M7946k0528o2215n8111N83K7082
23149g6887J6866L2251J9814O578n239M7290q936k761M130j3354k3214j6727j3918
$$ plain form
23233 -1565 -9478 29922 50348 14271 -9680 -7610 23971 -18316 -77006 -45941 -38288 -58805
23221 -58805 16910 45925 -6156 31791 11010 -62915 -96183 -97593 -86854 -74268 -50623 24164
23209 24164 26956 57691 28487 9137 44771 47578 -18010 -48469 -40889 -16685 44140 -8355
23197 -8355 -17701 -34650 -55935 -116391 -105960 -74131 -11630 18963 12760 -47163 -32014 28590
23185 28590 91568 124871 103160 51131 -22264 -62387 -98305 -125008 -42747 53555 68574 83693
23173 83693 37316 -34223 -24496 -8562 17570 -2152 -16539 10815 49530 85236 86329 39161
23161 39161 -38316 -70806 -52226 -86808 -28489 -11644 36302 15774 -46441 -104552 -103969 -76887
23149 -76887 -60021 -27770 -7956 -1378 -6617 40673 31737 28976 33106 19752 -3462 -20189 -34107
23136c4107m1675K503J1054L1375J6496q8569O455N9441O914J3237n611N827P036
23123i624N948o2139r181K5679K483k78o87p957L9880L0953j2015j9694o8538
23110h5170p878k0412N4031O0897k4420j0539N6412L1207k8732o6440n2696N6674
23098c7066N3795M4041M3552m2748l5661o8002L7641M0031j2711k2544K1390L2332
23086E4050L622m3643k4105J6915O4465J2837q2867p1462P1377J398o69L3305
23074C5223M118p960K9871j250q2786n0356l2542j4741O6421R5095m0690k9248
23062b8845k6994l4834j0185K1971P914j8710J9789K6854K9729l5674k8360n304
23050h2649J7364O0050M838j3688m0570J3196J1167P486j9254R911K1677J7200
$$ plain form
23136 -34107 -75782 -73279 -62225 -30850 -14354 -102923 -96468 -37027 -30113 -16876 -22487 -16660 -9624
23123 -9624 -3676 -65815 -74996 -49317 -46834 -47112 -47799 -55756 -15876 15077 3062 -16632 -85170
23110 -85170 -93048 -113460 -59429 1468 -22952 -33491 22921 54128 25396 -41044 -93740 -37066
23098 -37066 16729 60770 104322 61574 25913 -42089 -4448 35583 22872 328 21718 54050
23086 54050 57672 14029 -10076 6839 71304 84141 1274 -70188 1189 2587 1918 35223
23074 35223 39341 31381 61252 60002 -22784 -73140 -105682 -120423 -54002 41093 403 -28845
23062 -28845 -55839 -90673 -100858 -78887 -70973 -89683 -69894 -43040 -13311 -48985 -77345 -82649
23050 -82649 -65285 -5235 -397 -14085 -54655 -41459 -30292 -22806 -42060 -32149 -10472 6728
23038F728O802N5301j8783o2970q834o6444m0905O3114J00621j0998p325r864
23026F443j1825j9374K2537L9791l1098O343L9006N221m0962L793j360l8928J2173
23013h240j8558j0548J2118M6064j8935j7745k56n3099L860m5407J1795Q4500
23001a4451M4992l2768Q6237J4865p8865K9575N1962m5774p0845k087J9212J351
22989C404N6729O64o8150l1043L3953N0804n4387K3101L1621O179L0096r5011
22977a2040q9205l0816L1961O1929K5946L9301l0680n11j3647K6923L6426m482
22965D1105O4193j8178p3879m2869K9388Q9195m7224n7148L9018J9772l8724K867
22953G516o314j3648l7691J4355P5995l8564l6139L0759j2512L8628Q545j3915
$$ plain form
23038 6728 13530 68831 50048 -12922 -21756 -88200 -129105 -65991 34630 23632 16307 6443
23026 6443 -5382 -24756 -2219 37572 6474 12817 51823 57044 16082 19875 18515 -20413 -8240
23013 -8240 -26798 -37346 -25228 20836 1901 -15844 -16100 -69199 -65339 -110746 -98951 -14451
23001 -14451 30541 -2227 84010 98875 20010 49585 101547 55773 -15072 -17159 2053 3404
22989 3404 60133 60797 -7353 -38396 -4443 46361 -8026 15075 46696 52875 82971 -12040
22977 -12040 -101245 -132061 -100100 -38171 -12225 27076 -3604 -4115 -17762 9161 45587 41105
22965 41105 105298 87120 13241 -29628 -240 88955 41731 -15417 23601 43373 4649 7516
22953 7516 1202 -12446 -50137 -35782 40213 1649 -34490 -3731 -16243 22385 30930 17015
22941A7015n3898N629j1206L4594k902m1448k4895l061L2082M7957j5165r0456
22929a05754m668J6005K173K2452m3427J1370O9549N3942M5969o1849k5758q182
22917b8178j3276m1980K0232K8157l600M8917Q315J4415J6876n378j5147j1641
22905A7712M1745n4586k7878J4204K9988l2758j1524P2282M1408n5594j1142k3731
22893A26l2443K494k5057l474j7053k4058J3075K8814O4565n8302n8722L4004
22881g6031Q9486J2184J2590j8517k2836L4954j1565m3487R903J7426n265L9232
22869C8074k4745l7123k791k5007M1684K8933Q945K567m8233j6658j872q6058
22857a22284J5181M601N609M2217J9120l2566N5338j0525j02456L4222M6031j1569
$$ plain form
22941 17015 -36883 -31254 -42460 -7866 -10768 -52216 -77111 -80172 -48090 -133 -15298 -105754
22929 -105754 -110422 -94417 -92244 -69792 -113219 -101849 -32300 21642 67611 5762 -19996 -28178
22917 -28178 -41454 -83434 -63202 -35045 -38645 10272 18587 33002 49878 44500 29353 17712
22905 17712 59457 4871 -23007 -8803 21185 -11573 -23097 49185 90593 34999 23857 126
22893 126 -32317 -29823 -54880 -58354 -75407 -99465 -86390 -57576 6989 -51313 -110035 -76031
22881 -76031 13455 25639 38229 19712 -3124 31830 20265 -23222 -13319 4107 -1158 38074
22869 38074 13329 -23794 -26585 -51592 -9908 19025 27970 30537 -17696 -34354 -36226 -122284
22857 -122284 -107103 -102502 -96893 -54676 -35556 -68122 -12784 -23309 -125765 -91543 -45512 -57081
22845e7081N318j8263l305O7473j0841K4770p858K3568k1460j876J8471P913l4835
22832h006k5776L6016L4043l9328l4246J7591p919m8720n51N9910L4695J0600
22820B8309M5301m2285k4182K8081O992k5301k482l8421o1479l381J9288m0o514
22807g6114J6471o355N84k7324j0005J6830k6051M579L2126K9684l0534Q196N2089
22794a5824j1970k8880j7765K9897K3366j4433L6961J7497j2463k5492j8222k5278
22782f2606n0508L1710K6467M8087J8339o111r782j9261L687K1428l0378K472
22770b6456N2550n890j9501m7434k2466j7453k6561K3833Q5869Q1900l1968m0776
22758E647n4700J1032N417J1570J578K07m8364J8006p487J1430K3017j241m6070
$$ plain form
22845 -57081 -51763 -70026 -73331 -5858 -16699 8071 213 23781 2321 445 18916 26829 -8006
22832 -8006 -33782 2234 36277 -3051 -37297 -19706 -27625 -76345 -76896 -16986 17709 28309
22820 28309 73610 31325 7143 35224 42216 16915 14433 -23988 -85467 -88848 -69560 -69600 -76114
22807 -76114 -59643 -65998 -65414 -92738 -102743 -85913 -111964 -107385 -75259 -45575 -76109 -67913 -15824
22794 -15824 -27794 -56674 -74439 -44542 -21176 -35609 1352 18849 6386 -19106 -37328 -62606
22782 -62606 -113114 -81404 -54937 -6850 11489 5378 -4404 -23665 -19978 1450 -28928 -26456
22770 -26456 26094 20204 703 -46731 -69197 -86650 -113211 -89378 -3509 78391 46423 5647
22758 5647 -49053 -38021 -32604 -21034 -19456 -19249 -67613 -49607 -57094 -45664 -22647 -23888 -69958
22745f9958n0803Q889M1159k3766K9078J00976j3137o9779j6269K330j6023l6793
22733a14096j5707J1024K9714L3779l4475l9297J0569J2000k3466n647K7666L5165
22721g2771L9820n459n4777M1505K255n2803k8941M7811O6695K9677n8846n2386
22709i8220K7410j0855r92m028J8407p3426J7929J29961j3695m9868L9148N4553
22697C6324o7960o1255M5386K9582J4915j2821j5774m4742J5213K7262k1560k606
22685e8036j994K6472K1137L0132l7073n2069j0525K4608Q5395O8205M034q9503
22673A0783q9986k5621L1284J1012m2788k8079L0156K4862M9474K5396K0894J5553
22661C2940n3950o3240L4173K1818l3635J0633m7300n617J16726N7017k1331l4135
$$ plain form
22745 -69958 -120761 -111872 -70713 -94479 -65401 35575 22438 -47341 -63610 -61280 -77303 -114096
22733 -114096 -129803 -118779 -89065 -55286 -89761 -129058 -118489 -106489 -129955 -135602 -107936 -72771
22721 -72771 -32951 -38410 -93187 -51682 -49427 -102230 -131171 -83360 -16665 13012 -45834 -98220
22709 -98220 -70810 -81665 -82657 -86685 -68278 -141704 -123775 6186 -7509 -57377 -18229 36324
22697 36324 -31636 -92891 -47505 -17923 -3008 -15829 -31603 -76345 -61132 -33870 -55430 -58036
22685 -58036 -60030 -33558 -12421 17711 -19362 -71431 -81956 -57348 28047 96252 100286 10783
22673 10783 -79203 -104824 -73540 -62528 -105316 -133395 -103239 -78377 -28903 -3507 17387 32940
22661 32940 -21010 -84250 -50077 -28259 -61894 -51261 -98561 -104178 12548 69565 48234 14099
22649A4099m5779j8297K5058k1591L170N8000n9553n8883k7489N964J4829K3128
22637h7344M6569N2989J7400l4374N3002J9625l6481k511p328l7465m0801L5191
22625b1528J1136q762j6070j2788l0144o626O1030K894k2689k7391j372M236j449
22612f9523K1756l4782M2Q5555K967m7551n4053N9186J5329m1502N5150K4422
22600A6996j4884J5116J1762L6893j05439q3915K3751O5496J7663K2430L7341
22589D3210J5833k8744j2389j482K0646k1538l3449J9028Q575K5502M3320j0019
22577F8493k2862k3850j9463j5508j5098o1629n6634O4054J17101l468j7461M1968
22565E5643k4940q2224j8809L8704L5547K4133J1792N938K8605j4183m9069m4171
$$ plain form
22649 14099 -31680 -49977 -24919 -46510 -43340 14660 -44893 -103776 -131265 -125301 -110472 -87344
22637 -87344 -40775 12214 29614 -4760 48242 67867 31386 28875 21547 -15918 -56719 -21528
22625 -21528 -10392 -19154 -35224 -48012 -78156 -84782 -23752 -20858 -43547 -70938 -72310 -68074 -69523
22612 -69523 -47767 -82549 -82507 3048 6015 -41536 -95589 -36403 -21074 -62576 -7426 16996
22600 16996 2112 17228 28990 65883 -39556 -123471 -99720 -34224 -16561 5869 43210
22589 43210 59043 30299 17910 16428 37074 15536 -17913 1115 9690 35192 78512 68493
22577 68493 45631 21781 2318 -13190 -28288 -89917 -146551 -82497 34604 31136 13675 55643
22565 55643 30703 -51521 -70330 -31626 3921 28054 39846 45784 74389 60206 11137 -33034
22553c3034j113j0654j5218M0593L1825L2305j62n8920m3102k1613O7029M8762
22541C6698n4347k3437M109O330m070m0370k3060J0103L6774N4695J2508l9024
22529b3091q215n1188m7702m449K2377J5799r980K0228J4484L6755K2974J3586
22517A578q742k2075K0895J3486l0879r337K5830J20648N6256k4522p6398p8086
22505a1346m5993K9351j7675k5152K3006K2239L477Q1533l1046o0284o628J6663
22493b1855l1933r8010j6521L1198L8293K786k3663L1318n0616K2513L4668J6522
22481f5300J1781K8605O2096J4232K4518m7162k3319n0804l4900j748M5487L0593
22469e921k8768j1357R524o956j0913K9538k8325o9906n3760P4740P1592q26K0392
$$ plain form
22553 -33034 -34147 -44801 -60019 -19426 12399 44704 44542 -14378 -57480 -79093 -12064 36698
22541 36698 -17649 -41086 -36977 -30647 -34717 -75087 -98147 -88044 -51270 3425 15933 -23091
22529 -23091 -31306 -82494 -130196 -134645 -112268 -96469 -106449 -86221 -71737 -34982 -12008 1578
22517 1578 -7164 -29239 -8344 5142 -25737 -35074 -9244 111404 167660 143138 66740 -11346
22505 -11346 -57339 -27988 -45663 -70815 -47809 -25570 -22093 59440 28394 -31890 -38518 -21855
22493 -21855 -53788 -151798 -168319 -137121 -98828 -96042 -119705 -88387 -139003 -116490 -81822 -65300
22481 -65300 -53519 -24914 37182 51414 75932 28770 5451 -45353 -80253 -82001 -36514 -5921
22469 -5921 -34689 -46046 -36522 -43478 -54391 -24853 -53178 -123084 -176844 -102104 -30512 -31338 -10946
22456a0946K971j8116J7017o3986m7105L7430O9408M4007J9254m1801K0014L3663
22444F1810m7264J2820J2524J0119j1527J2318m3935p6587K5465N1224m964k7111
22432b5108L2288J0868L1966O5390l5752m5427O265K6237J377m8431k1763J8935
22420A6845K3509J8999l4078k2163m910J9328M8022j3226K008j3148L453o2442
22408a7803l839o299O3377l9354J8091R050k1448n8795J2238O0308O47l0203n0943
22395f4973K9973L9898m1720m3052J0508M2972L1253j5025l0340o501j1982j0583
22383f9572K4453L6704M2929J8438l0853J0143p308O009j0617L0447J9047q0127
22371a0307J1213l39m0152j401P762k7668J1874j8527l4006J0226m4474k5683
$$ plain form
22456 -10946 -7975 -26091 -9074 -73060 -120165 -82735 -13327 30680 49934 8133 28147 61810
22444 61810 14546 27366 39890 50009 38482 50800 6865 -69722 -44257 6967 2003 -25108
22432 -25108 7180 18048 50014 115404 79652 34225 40490 66727 68104 19673 -2090 16845
22420 16845 40354 59353 25275 3112 -1798 17530 65552 52326 54334 41186 44639 -17803
22408 -17803 -21642 -27941 35436 -3918 14173 23223 1775 -57020 -44782 15526 16173 -14030 -64973
22395 -64973 -35000 4898 -36822 -79874 -69366 -26394 4859 -10166 -40506 -47007 -58989 -69572
22383 -69572 -45119 -8415 34514 52952 22099 32242 24934 30943 20326 50773 69820 -10307
22371 -10307 906 567 -39585 -40986 -33224 -60892 -49018 -67545 -101551 -91325 -135799 -161482
22359a61482K5739L4790J4931j0607N0882q004m2299M4461L7719l6434o945j9905
22347g7154M3953j0636L7499K633J1995N8268J9875p9716p2281M2204m915l1925
22335f0200L9891M116l9031k7639J7311P346m105K9539M771J8485j114J8431l8179
22322c0378l7169q9447L0620R5827J7468M0132j1290J8955K6194J2001m5486p8736
22310e1309m7764j8448O3387L2948K8853j1560j1496M2327O96L2066J230k0341
22298D0589K3282k8345j7468m878L0059k8695k3587m289m2661J8315K2018Q765
22286f895L2855j6944k842k0654o5416l1488N3373O6558j4314K6510K5244l3127
22274A2860j0853J6038n602m6335k2557k5710k9585K8956M2420p141p08j5667
$$ plain form
22359 -161482 -135743 -100953 -86022 -96629 -45747 -53751 -96050 -51589 -13870 -50304 -57249 -77154
22347 -77154 -33201 -43837 -6338 -3705 8290 66558 86433 6717 -65564 -23360 -28275 -60200
22335 -60200 -20309 -16193 -55224 -82863 -65552 -58206 -62311 -32772 -28001 -9516 -10630 7801 -30378
22322 -30378 -67547 -156994 -126374 -30547 -13079 27053 15763 34718 60912 72913 27427 -51309
22310 -51309 -99073 -117521 -54134 -21186 7667 -3893 -15389 26938 27634 59700 60930 40589
22298 40589 63871 35526 18058 13180 43239 14544 -9043 -13332 -55993 -37678 -15660 -6895
22286 -6895 25960 9016 6174 -14480 -79896 -111384 -58011 8547 -5767 20743 45987 12860
22274 12860 2007 18045 12443 -33892 -56449 -82159 -111744 -82788 -40368 -47509 -48217 -63884
22262f3884P183J4369O6763K3497n7365J9386o7502J9880Q965L3713K1477o5782
22250c9300J6159l0163n118r858O8102M1709O245O8092L1140j821j9761k5897
22238I9529l8227K8195O057m6989k5978M1028J9561R989K320r4127j0913P148
22226b407K2474M3782J6692n2446J3566j6377n6441L9236J6542j6637K0213j3342
22214A4855l0009k8260k6326Q863q597L1208M3138k902l0863R242L0327J9624
22202C0300O952L3302j0337k5808l221l6117l7147N8742k1514o0323m2599j0378
22190a18148n8288o368O8404N5077K1527O670p926N7672m9163n0131J9068J0056
22178e1550j5655o120P307L2976m1274J2899K5797L2089j5772K8276O5480l6509
$$ plain form
22262 -63884 -56701 -42332 24431 47928 -9437 9949 -57553 -37673 -28708 5005 26482 -39300
22250 -39300 -23141 -53304 -58422 -68280 -178 41531 47776 115868 147008 145187 125426 99529
22238 99529 61302 89497 95554 48565 22587 63615 83176 93165 95485 1358 -9555 -2407
22226 -2407 20067 63849 80541 28095 41661 25284 -31157 8079 24621 7984 28197 14855
22214 14855 -15154 -43414 -69740 -60877 -69474 -38266 4872 1970 -28893 -19651 10676 30300
22202 30300 37252 70554 60217 34409 31188 -4929 -42076 16666 -4848 -65171 -107770 -118148
22190 -118148 -176436 -182804 -114400 -59323 -37796 -31126 -39052 18620 -30543 -80674 -61606 -51550
22178 -51550 -67205 -73325 -66018 -33042 -74316 -61417 -35620 -3531 -19303 8973 74453 37944
22166C7944P042p3565l1291O7758J8081j180J1195k9673n2859q671Q825p373l0962
22153h4729M7527k5686P0046Q7899n331l8247m1171l1832K8525R625K9284j7281
22141B8629l3695N0798k6565M4474J7350N7432k1115l3330j02729k2371L2175
22130h947M0160J4964Q025m0817k9123L9094J7829j5235r987r383j4054K5058
22118A7584j7721j3353L5652P908j7062J6063K413l6149J4250L3638j3068q914
22106B1241l1452m478l9793k0568J4517J3886N7474M9069m2701r2464K409L38
22094g2522J2670M0079L4839K1683l3404m3373K5977J0979P1357m4613j7998N5082
22082F0756r18m5398n1923k1461J6535n222p4779o5449M7833Q1173Q7179J2380
$$ plain form
22166 37944 44986 -28579 -59870 7888 25969 24789 35984 6311 -46548 -55219 -46394 -53767 -84729
22153 -84729 -37202 -62888 7158 95057 89726 51479 10308 -21524 7001 16626 45910 28629
22141 28629 -5066 45732 19167 63641 80991 138423 117308 83978 -18751 -41122 -8947
22130 -8947 31213 46177 54202 13385 -15738 23356 41185 25950 15963 6580 -7474 17584
22118 17584 -137 -13490 22162 30070 13008 29071 31484 -4665 9585 43223 30155 21241
22106 21241 -10211 -14689 -54482 -75050 -60533 -46647 10827 59896 17195 -75269 -72860 -72522
22094 -72522 -59852 -19773 15066 36749 3345 -40028 -14051 -3072 68285 23672 5674 60756
22082 60756 59838 14440 -37483 -58944 -42409 -47631 -122410 -187859 -140026 -58853 28326 40706
22070D0706j2587m6678j6173k5481j8494L972j9185K7812K4503M3174j623O493
22058F439k1674p4796q932J0584Q600K3287J5556L0474N9061j5578k6288m7286
22046d0553J7009J1455o8002j0904J5846Q633R184Q428L3181J5557o450k9037
22034c5653M3639L254n8668m47j0615O2532O9683Q472q12m4329K238k4454K4879
22021C9719n9900n396N1052m2528j4526o9545P850K0566k157m556L4203L6449
22009h769l9607n3312M2749N5002n5977L0796O955M6805J3718k4272j3504j23
21997D61L2214l4133k3333k7229m6748o447M1287L106o68p092N876L9266n548
21984b8988N4339J2417r224m2469m8032L8501M5004m0228L141O9065k0988n0767
$$ plain form
22070 40706 28119 -18559 -34732 -60213 -78707 -74735 -93920 -66108 -41605 1569 -54 6439
22058 6439 -15235 -90031 -98963 -88379 -79779 -56492 -40936 -10462 48599 33021 6733 -40553
22046 -40553 -23544 -12089 -80091 -90995 -75149 -66516 -57332 -48904 -15723 -166 -6616 -35653
22034 -35653 7986 11240 -47428 -47875 -58490 4042 73725 82197 81385 37056 39294 14840 39719
22021 39719 -20181 -25577 25475 -17053 -31579 -101124 -93274 -72708 -74865 -79421 -45218 -8769
22009 -8769 -48376 -101688 -58939 -3937 -59914 -29118 -22163 24642 38360 14088 584 461
21997 461 32675 -1458 -24791 -52020 -98768 -105215 -63928 -60822 -61490 -68582 -62706 -23440 -28988
21984 -28988 25351 37768 28544 -13925 -61957 -23456 21548 -18680 -15539 53526 32538 -18229
21972a8229j0599M646J5973l7912n2077l1393L3538P3293Q8168r750j9452k7963
21960H243K628k0327l1257m7663J2531M0448J4858n8545n573N511q878K8074N6309
21947c641K2655J4262m7970o4081l8204J5932N1773N1948j0268j4007K1130m6882
21935d7353m7523j8577o517J9759O1143K8184m0086J137J3798J8812l4538o8748
21923a20509K3218P1859L6639J1034n0403N7186N189j1146k0839m0270j6490J021
21911e3511k68j2610K5561j7862L9684R5277j4859n3954o536O3392N3066N8689
21899A76069n0632j02714m1800k7928r36M6805O9076K2470l0265k9145k248k2788
21887E964j7622K8264Q062l1611J5985J7428k334K3705o664j6533k2930L4865
$$ plain form
21972 -18229 -28828 -24182 -8209 -46121 -98198 -129591 -96053 -22760 65408 55658 36206 8243
21960 8243 10871 -9456 -40713 -88376 -75845 -35397 -20539 -79084 -84657 -79146 -88024 -59950 -3641
21947 -3641 19014 33276 -14694 -78775 -116979 -101047 -49274 2674 -7594 -21601 -471 -47353
21935 -47353 -94876 -113453 -119970 -100211 -39068 -10884 -50970 -49833 -36035 -17223 -51761 -120509
21923 -120509 -97291 -25432 11207 22241 -28162 29024 34213 23067 2228 -38042 -54532 -53511
21911 -53511 -53779 -66389 -40828 -58690 -19006 76271 61412 7458 922 64314 117380 176069
21899 176069 125437 22723 -19077 -47005 -47941 -1136 67940 90410 60145 31000 28752 5964
21887 5964 -11658 16606 24668 -6943 9042 26470 24136 47841 41177 24644 1714 36579
21875C6579N7959j5323m1022o3300k7114j7743l8816J2422K7081L259k8178j7752
21863a11948O1283K4674K9738k866n2033k4430q426j2697J062p746J5056M3599
21851d4734O6059M1160m6465p1319o838K6401m501N4034J548n5237l073M7262
21839D297r508k6268J2721L7834j6996l2425J9063K0088j9471M962L1041m8172
21827b2834J0959J4596k6529k1284k6915Q1440K8681l7058k5738l6091k7080m4279
21815a32132R0930N5818K298K9237K1084m4317J5584l4019L98j0804L2559J7295
21803D3931K5567K5345k6838p0301M5L1762j109l8334O934L356m5797N970j3038
21790e2507j8818n417L7184J4398m8850K0616M6192J3314j940l2889j3333k7372
$$ plain form
21875 36579 94538 79215 38193 -25107 -52221 -69964 -108780 -96358 -69277 -66018 -94196 -111948
21863 -111948 -50665 -25991 3747 881 -51152 -75582 -84008 -96705 -95643 -103389 -88333 -44734
21851 -44734 21325 62485 16020 -55299 -62137 -35736 -40237 13797 15345 -39892 -42965 4297
21839 4297 -5211 -31479 -18758 19076 2080 -30345 -11282 8806 -10665 -5703 25338 -22834
21827 -22834 -11875 2721 -23808 -45092 -72007 9433 38114 1056 -24682 -60773 -87853 -132132
21815 -132132 -41202 14616 16914 46151 67235 22918 38502 4483 4881 -5923 26636 43931
21803 43931 69498 94843 68005 -2296 -2251 29511 28402 -9932 -2998 358 -45439 -39469 -52507
21790 -52507 -71325 -76742 -39558 -25160 -74010 -53394 -7202 6112 4172 -28717 -42050 -69422
21778f9422p741p830m3179l8628Q1520K6179j3394p802m1375Q4111O0030n141
21766A7328K1453l5228p2536p248l0122K2548M6220j0814J0696J8949J9716k1093
21754b0131K3436M8631N1538o4352r6464m2684q35L2525J3594j5104J4260j7186
21742g2772J0332N8411r526n003L2522M4498j3306p0196j5137L296n5293l2119
21730a24293j7258N0942L2148N3144k1621K1200K5290N569l4220K2831q917p104
21718b289l802K774M0214j7965r003K6272K1841j8893l2858j7656l3059j5192
21706e9616o6997j650M3044M0797K8856J9294P522M4823K647q729l4590k6035
21694a0634m5563K5654J9888J3447M0253j3299n6614m1759M532P964l5381N6030
$$ plain form
21778 -69422 -77163 -84993 -128172 -166800 -85280 -59101 -72495 -80297 -121672 -37561 22469 17328
21766 17328 38781 3553 -68983 -76231 -106353 -83805 -37585 -48399 -37703 -18754 962 -20131
21754 -20131 3305 51936 103474 39122 -57342 -100026 -100861 -68336 -54742 -69846 -55586 -72772
21742 -72772 -62440 -4029 -13555 -18558 13964 58462 45156 -25040 -40177 -36881 -92174 -124293
21730 -124293 -141551 -90609 -58461 -5317 -26938 -5738 19552 25121 -9099 13732 4815 -2289
21718 -2289 -6091 -3317 36897 18932 9929 36201 58042 39149 6291 -11365 -44424 -59616
21706 -59616 -126613 -128263 -85219 -44422 -15566 3728 11250 56073 58720 49991 15401 -10634
21694 -10634 -56197 -30543 -10655 2792 43045 29746 -26868 -68627 -64095 -56131 -91512 -35482
21682c5482L5536L4483m518L30k4810L196k5693k0749n0026L5045M8431N304J9921
21669B0968J8292l5230n7834m2270K3803M9024K3175j2653P1636l1920p5098K5341
21657b2766q010o406J234J2974J7308n370J4505J029m5188l6070j4484j417N4273
21644c8388K0164m106j2228n1004O635O047P5553n0o171J2401L4329L4627M954
21631H2763M4776j4215j8635l0227l0400r226K0603k6061k803L5205m8635k9421
21619b6276j7228n8025k9115k1789K9870l810O0635N0911J6457n8882j8310K6188
21607d9374N2890J9175m6678j0581J4837K5971M769k7922K5604M2744k0788q6432
21595e5785n5500J3643j2152j0368O9436Q105m1095j1035N5752O0416K0702L354
$$ plain form
21682 -35482 54 34537 30019 30349 5539 8735 -16958 -37707 -87733 -52688 -4257 1047 20968
21669 20968 39260 4030 -53804 -96074 -72271 -23247 -72 -12725 58911 26991 -48107 -22766
21657 -22766 -30776 -37182 -35948 -22974 -5666 -11036 3469 4498 -40690 -76760 -91244 -92661 -38388
21644 -38388 -18224 -22330 -34558 -85562 -78927 -72880 2673 2623 -3548 8853 43182 77809 82763
21631 82763 127539 113324 94689 64462 34062 24836 45439 19378 16575 51780 3145 -26276
21619 -26276 -43504 -101529 -130644 -152433 -122563 -126373 -65738 -14827 1630 -57252 -75562 -49374
21607 -49374 3516 22691 -23987 -34568 -19731 6240 11009 -16913 8691 51435 30647 -55785
21595 -55785 -111285 -97642 -109794 -120162 -50726 -42621 -83716 -94751 -38999 21417 42119 45473
21583D5473j4825M7964k1258k3328M9674J9230n4377K8243N2855q900k5485n4518
21571D0748m8546k9352K2203L0098J4912l5710l3591J8894K7941n1652L2453N7814
21559D6212k9613K660k207J7454m7392o8270L300R214K2128K8278N8104k867n1887
21546a4886L1051Q7990P557n944k5947k1703l3764J8240p497L2160K3157k2687
21534F7727J1872M993j6601M7824L9006q706O5785J9530k890Q4436Q6704J9384
21522D19064P226k1368j07684k4418M9694K2151O6936J1835N589Q5759P2093J3869
21510F00746M683p5244j01028o0263j9297l3650l772K6637l7578k6996L6946Q9454
21498D00638P1914Q3085K3258m0007l0447m5423p2388p3115o9930N3129Q4435
$$ plain form
21583 45473 30648 78612 57354 34026 83700 102930 48553 76796 129651 120751 95266 40748
21571 40748 -7798 -37150 -14947 15151 30063 -5647 -39238 -20344 7597 -44055 -11602 46212
21559 46212 16599 19259 17052 34506 -12886 -81156 -77856 -68642 -46514 -18236 39868 37001 -14886
21546 -14886 16165 104155 111712 105768 79821 58118 24354 42594 35097 67257 90414 67727
21534 67727 79599 84592 67991 115815 154821 146115 211900 231430 228540 312976 399680 419064
21522 419064 426290 404922 297238 272820 322514 344665 411601 423436 429025 514784 586877 600746
21510 600746 605429 530185 429157 368894 349597 315947 312175 338812 301234 274238 311184 400638
21498 400638 472552 555637 578895 538888 508441 463018 390630 317515 247585 300714 385149
21487C85149K9460J315M5789O4802l3914q2039l7000k9574o6026q6405o9583k930
21475A19044K9211k2834R974j4275m2491l7703k3469l7986Q639q481j8875O7873
21463B8627J3511r925J5116M2752Q608p8587k5019L0733L5290m0239l7591k6724
21451d3448l4189j7190R3285p614k0733J074M5546L6709o1752l1085K4190q096
21439b3303O081O3425j1846O441j1637l2171r870J6349K9689N8591l0448j6573
21427D4728p4334k2627l0222o0354J2864N123M3850K5087j9825j633J10416Q8861
21415A21934j8316j01425m4840K5397K2174M360J6230l9716j083k3918J9327K5182
21403E306j7113L0282N0961K9310m7336n9214l9419l5720P63m8366J9780M5189
$$ plain form
21487 385149 414609 415924 461713 526515 492601 410562 373562 343988 277962 191557 121974 119044
21475 119044 148255 125421 135395 121120 78629 40926 17457 -20529 -11890 -20371 -39246 28627
21463 28627 42138 32213 47329 90081 98689 20102 -4917 25816 61106 20867 -16724 -43448
21451 -43448 -77637 -94827 -1542 -9156 -29889 -28815 16731 53440 -8312 -39397 -15207 -23303
21439 -23303 -17222 46203 34357 40798 29161 -3010 -12880 3469 33158 91749 61301 44728
21427 44728 -29606 -52233 -82455 -142809 -129945 -124822 -80972 -55885 -75710 -77343 33073 121934
21415 121934 103618 2193 -42647 -17250 4924 9284 25514 -14202 -15285 -39203 -19876 5306
21403 5306 -11807 18475 69436 98746 51410 -7804 -47223 -82943 -82180 -130546 -110766 -65577
21391f5577J0435L442J2077K726j625L8395K6683q673l1404j6392K020j0497N5900
21378A7510N8650P4565k6156n1060K3036n368m4602k8857l9481m1165n2963m485
21366a20376L2751K8173L5910k4899p2586l7265k3801L52L9286p880L7301L889
21354a09145J7424N2993L9382q134l2141J3634M1839N541q5701n9383N4078L5189
21342c4424L7020N7512n9565k0981o057K2556M1841k6476J2689J098M109P435
21330C6757l1728M1551L7690j1214n6540J404L0634p472o7003L502J4136K1552
21318A3269m9992j5876M4522j279O1508J9353Q633O089l6808o9135j3544j3084
21306d6344M9573J8416m3511p8787K0763J6903j3597n5191N715N8217J4649L321
$$ plain form
21391 -65577 -55142 -51700 -39623 -36897 -38522 -127 26556 17883 -13521 -29913 -27893 -38390 17510
21378 17510 76160 150725 124569 73509 96545 91177 46575 17718 -21763 -62928 -115891 -120376
21366 -120376 -87625 -59452 -23542 -48441 -121027 -158292 -182093 -181741 -142455 -150335 -113034 -109145
21354 -109145 -91721 -38728 654 -7480 -39621 -25987 15852 21393 -64308 -123691 -69613 -34424
21342 -34424 2596 60108 543 -20438 -26495 -3939 37902 11426 24115 25213 29322 36757
21330 36757 5029 46580 84270 73056 16516 17920 48554 41082 -25921 -22419 -8283 13269
21318 13269 -36723 -52599 -8077 -9356 52152 71505 80138 86227 49419 -19716 -33260 -46344
21306 -46344 3229 21645 -21866 -100653 -79890 -62987 -76584 -131775 -126060 -67843 -53194 -49873
21294d9873K5961N6065K9540m0682k5492j0487j1193j7358J6463K522K8773n773
21282a534j5748j9714K675p313L2549K8552K9138k341k5783k4068K4094N2445
21270G2952k2387l812k5316m4475L0377L3065J3172J3159j7075l6499K346O0378
21258G5885J0060l9536j51967l7531O3868P2985k6426l6298R497M2191k257L770
21246a5759k5467N030j9771N1840N9046K0077M0433L3289j3193j4609r64m6723
21234G3229m5872q342M7133K1268n5787m3362k5877j7415J3862J3881k2904k9434
21222g9620L1939K8324n967k777o57o360J4249O914Q120j1634M941J4137K1732
21209B3341R1082J7918o6583o849l0849K9462o125k1140K2058P3789O779k7360
$$ plain form
21294 -49873 -23912 32153 61693 21011 -4481 -14968 -26161 -43519 -27056 -24534 4239 -1534
21282 -1534 -17282 -36996 -34321 -41634 -9085 19467 48605 46264 20481 -3587 20507 72952
21270 72952 50565 46753 21437 -23038 7339 40404 53576 66735 49660 13161 15507 75885
21258 75885 85945 46409 -105558 -143089 -79221 -6236 -32662 -68960 -59463 -17272 -19529 -15759
21246 -15759 -41226 -36196 -55967 -4127 54919 74996 115429 148718 135525 120916 119952 73229
21234 73229 27357 19015 66148 87416 31629 -11733 -37610 -55025 -41163 -27282 -50186 -79620
21222 -79620 -47681 -19357 -25324 -28101 -28758 -35118 -20869 -13955 -5835 -17469 -12528 1609 23341
21209 23341 114423 132341 65758 58909 28060 57522 51397 30257 52315 126104 132883 105523
21197A05523p8568l375n227K7335J7022L9396k7613j5628l0735M9930j1169K4379
21185I1270K9519J908K1490k7368K510m4579l1944Q2243J6974j617L3896m3917
21173A30385j06462p411J4067k538q3j2165M3907O0690m3853m7153K2063l9297
21161A2150k2683k6475K5663K2125N2168k1637j1600J6265K6546r548l4761J9166
21149D7379j5407q8896j6929K9583N5362N6001J7400m2199k3717L9153j3395m7502
21137c167L6746K4701l509m3748q1003k0145M3174J0699J7107K9988L1167L8284
21125H0294O1214J2513r4032k3599j8117J4754k8974l3574R0330O2032J6420M027
21113A43288N4329M7616l6825r2812k3751k2443k1521j887L7192L9811L7502J709
$$ plain form
21197 105523 26955 23580 18353 45688 62710 102106 74493 58865 28130 78060 66891 91270
21185 91270 120789 122697 144187 116819 119329 74750 42806 125049 142023 140406 174302 130385
21173 130385 23923 16512 30579 28041 27958 15793 59700 120390 76537 29384 51447 12150
21161 12150 -10533 -37008 -11345 10780 62948 41311 29711 45976 72522 62974 28213 47379
21149 47379 31972 -56924 -73853 -44270 11092 67093 84493 42294 18577 57730 44335 -3167
21137 -3167 33579 58280 54771 11023 -69980 -90125 -46951 -36252 -19145 10843 42010 80294
21125 80294 141508 154021 59989 36390 18273 33027 4053 -29521 60809 122841 139261 143288
21113 143288 197617 245233 208408 115596 91845 69402 47881 45994 83186 122997 160499 162208
21101A62208J6280L6327J1960P445L296k2730l8744J523j3503j4206J270M5727
21089A96853M694q0949J6110R864j077m4627K2637k4361j7417J9998M1367J8243
21077A61335k8961k5037j4324J4005k294m5500m2410J19981Q0023K1229n8652
21066A79395j1030L9496m1719K4182O9804N2918n7857k8382J6428N9168l9907
21055B62496L6142K2408j2698L9057l2681l9891m9K2326M0815P3617M0452n1231
21043D00763j3504k638o1338l071j0159k1543J1027M3331J1220N0892L5336k8845
21031D11471N5242M6176J089j9398M011O1827Q9302K5097J1123p4624n4447K3964
21019E80833k90J7990M5699J6982j9797K0631J4032J6504M7711P521L2128R1838
$$ plain form
21101 162208 178488 214815 226775 234220 237516 214786 176042 177565 164062 149856 151126 196853
21089 196853 201547 120598 136708 146572 145495 100868 123505 99144 81727 101725 143092 161335
21077 161335 132374 107337 93013 107018 104724 59224 16814 136795 216818 238047 179395
21066 179395 168365 207861 166142 190324 260128 313046 255189 226807 243235 302403 262496
21055 262496 298638 321046 308348 347405 314724 274833 274784 297110 337925 411542 451994 400763
21043 400763 387259 384621 323283 320212 310053 288510 299537 342868 354088 404980 440316 411471
21031 411471 466713 512889 513978 494580 498591 560418 649720 674817 685940 611316 556869 580833
21019 580833 580543 598533 644232 661214 641417 662048 676080 692584 740295 747816 779944 871782
21007H71782m928l727Q7261J19323J49338J54911J88373O8637O3529O2612J62424
20996A919535J19338L8901O5693J12243O7528J28169J85066L42761L84429K87093
20986C650756J41614J80851J25287J50895K63919L38169L83847M01072N22359
20977F158769O01311O60911O46442O59658P54204Q62059J008557J263471J644387
20968A4259769K124104K735506L619377N042549P022199R461986J1915558J3565652
20960F9746700J2629489O835996k121694r617080j1546774q372661l866657L63911
20952E4051230M334052P923539J0718224J1958175R051155J114940p915227j3651566
20944G7584522j3211254r462986n900264l143084r00609J111826L304686N899513
$$ plain form
21007 871782 866854 863127 950388 1069711 1219049 1373960 1562333 1630970 1694499 1757111 1919535
20996 1919535 2038873 2077774 2143467 2255710 2323238 2451407 2636473 2979234 3363663 3650756
20986 3650756 3792370 3973221 4098508 4249403 4513322 4851491 5235338 5636410 6158769
20977 6158769 6760080 7420991 8067433 8727091 9481295 10343354 11351911 12615382 14259769
20968 14259769 16383873 19119379 22738756 27781305 34803504 44265490 56181048 69746700
20960 69746700 82376189 89212185 87090491 77473411 65926637 57553976 53687319 54051230
20952 54051230 58385282 66308821 77027045 88985220 98036375 99151315 91236088 77584522
20944 77584522 64373268 54910282 49010018 45866934 44966325 46078151 49382837 55282350
20936E5282350Q882717J1444194J2752931J0546497L067364o283842j2548242
20929H3143969j2430684q296395l705268N26957M461732P980477J0490983J0772845
20921I2944616O038462k941295j1643743j5688184j3901530j0228238p288399
20914C7291689n244610l915082k990032k240142j740535j482871j160356j105990
20906A7412071j039735j040338j062308j039631j092336j105929j035563r08692
20898I087539p56265o17129m96262l22931l58540l31701l87118m22651l82846
20889E012096m26161l60053k43451j85752j35415j36134k13428j60894j70424
20880B980384j47685k24730j85274k14182j41147j29188j33311p5680o6995j34744
$$ plain form
20936 55282350 64165067 75609261 88362192 98908689 101976053 95692211 83143969
20929 83143969 70713285 62416890 58711622 59238579 63700311 71680788 82171771 92944616
20921 92944616 98983078 96041783 84398040 68709856 54808326 44580088 37291689
20914 37291689 32047079 28131997 25141965 22901823 21161288 19678417 18518061 17412071
20906 17412071 16372336 15331998 14269690 13230059 12137723 11031794 9996231 9087539
20898 9087539 8331274 7714145 7217883 6894952 6536412 6204711 5817593 5394942 5012096
20889 5012096 4585935 4225882 3982431 3796679 3661264 3525130 3311702 3150808 2980384
20880 2980384 2832699 2607969 2422695 2208513 2067366 1938178 1804867 1729187 1662192 1527448
20870A527448j37594j04665o6756L702q016l2863l5223n5343o7388n5165l1477
20859I36660j1466j9712n6742n1870K1017k1240M235K7682l7664o014J6300m3902
20847G57284q3764q8218k5904J5947M9135k3229K0998k7319m216O400o9973j9230
20835E07911j6673j6017M0245L1143J1675M116r0823n2526n404M6585M8141J7668
20823E26041m2955p451j4509k9258n3325P766j4758l1617Q8721J4887k6837k4086
20811C92619M7128K8281P576k890J5900j052O4118K6287p080o368K3848M9890
20799F38257k4362l3848l7289L8186R9400J33989J12594O3265J9268k1394m6467
20788I41599p384n7053r0787q6651k4663M6222O3592L8291Q9754J5772m2605m6981
$$ plain form
20870 1527448 1389854 1285189 1218433 1222135 1214119 1181256 1146033 1090690 1023302 968137 936660
20859 936660 925194 905482 848740 796870 817887 796647 800882 828564 790900 784886 801186 757284
20847 757284 673520 585302 559398 575345 624480 601251 622249 594930 590714 597114 527141 507911
20835 507911 491238 475221 515466 546609 558284 562400 471577 419051 413647 460232 508373 526041
20823 526041 483086 475635 461126 431868 378543 386309 371551 339934 428655 443542 416705 392619
20811 392619 439747 468028 475604 472714 488614 487562 551680 577967 570887 564519 588367 638257
20799 638257 613895 580047 542758 580944 680344 814333 926927 990192 1009460 988066 941599
20788 941599 934215 877162 786375 699724 675061 721283 784875 823166 912920 928692 886087 839106
20776H39106m0555n7554n2866p0798q0661j9248N6530R3354J48352J02412R5721
20765A013793O398j2636l6156k4466r5261r8886m5098P6146N4655J3442j2990
20754H38941l184P1765O7029m0877q3584n4765n4358o5339o0532l8893o06J7424
20742E93021k8412o9082m5807n8828o322k0061m7621M9947M5217K1469P5609q675
20730E00455j7946k9055r3898K4858L6007n2547j7544j291K7517L2147j6429k4015
20718C68259n5724o2089k2916Q147j4300J1007J953o102m6429j0209O907J6793
20706A95297R546j7603j9840l4012r009R74K8530k8918K2373N9846k7867k5410
20694A53907K7512P2320J9033o64L0409q6939j0908N3430K6522p825k1477p1747
$$ plain form
20776 839106 798551 740997 688131 617333 536672 517424 573954 667308 815660 918072 1013793
20765 1013793 1020191 1007555 971399 946933 851672 752786 707688 783834 838489 851931 838941
20754 838941 835757 907522 974551 933674 850090 795325 740967 675628 615096 576203 575597 593021
20742 593021 564609 495527 449720 390892 384570 364509 316888 366835 412052 433521 509130 500455
20730 500455 482509 453454 359556 384414 420421 367874 350330 349039 376556 408703 392274 368259
20718 368259 312535 250446 227530 235677 221377 232384 234337 228235 181806 171597 178504 195297
20706 195297 204843 187240 167400 133388 124379 125353 153883 124965 147338 207184 179317 153907
20694 153907 181419 253739 272772 272108 302517 215578 204670 258100 284622 276797 255320 183573
20682A83573o4687o5753J0097R987N3874O2180N4104k7080m6423m1912J5190m0896
20670A02254n1896M0395q505o629L5945K581j1630J1984k205n4746J5033J15949
20658A88530k6905k7609J8534k7743J3139K861p0112o350M8021P0978K5400r9062
20646A09682p884l1935M491j5714j3851r83N926K7977n3069l0629L0374M7013
20634G1398K7567n5636M148J4444P517M4989J884m2115R82r3649l6762L2097M2211
20621A9075K8936j1850k4813q541J7954j6962m9555o6021r923K0433N2787K3779
20609b4701J8072k9676k5285M9337R4312q815J1486J4970o131l8274j9556N6314
20597I2053j488J2884N5546O468l269p378P3268R3728o471o2975J5941K9047k9471
$$ plain form
20682 183573 118886 53133 63230 73217 127091 189271 243375 216295 169872 127960 143150 102254
20670 102254 50358 90753 82248 75619 111564 114145 102515 114499 112294 57548 72581 188530
20658 188530 161625 134016 152550 124807 137946 140807 70695 64345 112366 183344 208744 109682
20646 109682 101798 69863 74354 58640 44789 43806 49732 77709 24640 -5989 24385 71398
20634 71398 98965 43329 47477 61921 69438 114427 116311 74196 75178 -18471 -55233 -23136 19075
20621 19075 48011 36161 11348 2807 20761 3799 -45756 -111777 -121700 -101267 -48480 -24701
20609 -24701 -6629 -36305 -61590 -12253 82059 73244 84730 99700 93569 55295 35739 92053
20597 92053 90565 103449 158995 165463 162194 154816 228084 321812 315341 252366 268307 297354 267883
20584B67883m7124J2141M3407k2442p3899m5229n9489k0205K2108n0349J6765
20573D3567L0478M0412p280Q655M8872O506k2927n3263k7987j2250P4799l0363
20561I9219K5557J6305n9903N039O5000n6976j5684N969J0572l8981j5672O0431
20549A00876q729K8423K5362M0177L2862N7587R9564K233j01796q8118n2276m6461
20537H9704k0961P7692K5933j0923j3128J4464K1553n5468K1236l7082n8463K8097
20525H2654Q287J3006l9109n5482k2738M9869j9451K1303K7682M395j1099j4744
20513D4573J3997j9335K7126m145P892n8124o8495j7906R7903K5879R490J6448
20501G5303p0131p9709L0710L5750m216L9241O0001l35J5008P006L5130K3110
$$ plain form
20584 267883 220759 232900 276307 253865 179966 134737 75248 55043 77151 26802 43567
20573 43567 74045 114457 107177 115832 164704 171210 148283 95020 67033 54783 129582 99219
20561 99219 124776 141081 81178 86217 151217 94241 78557 84526 95098 56117 40445 100876
20549 100876 92147 120570 145932 186109 218971 276558 376122 378355 276559 188441 136165 89704
20537 89704 68743 146435 172368 161445 148317 162781 184334 128866 150102 113020 54557 82654
20525 82654 90941 103947 64838 9356 -13382 36487 17036 38339 66021 70416 59317 44573
20513 44573 58570 39235 66361 62216 70108 11984 -56511 -74417 23486 49365 58855 75303
20501 75303 5172 -74537 -43827 -8077 -12293 26948 86949 86614 101622 108628 143758 166868
20489A66868n0115j8026l7341N476l6692k3571J9465N592N8506r713l9678l5230
20477E541L8588N5080P632n7835q9356O1275K9889l5142l1303L2957Q2755P420
20465A07501k1909k9489m319R401L005j7505K5129j4753J4814K6881l873j9137
20453G5746k5440k2736J6519P1689k2642n0608k8685m366J3480l299n2617j8371
20441e1330L3650O030Q82l3721J4672O4919k1713P214K6704O88j3424L3537J0470
20428G8578p1400L471K4546K7767m0215k3477K2085k0810q9768N1584L3408q418
20416a2649J1985M7259J7901n658L1074l2437k4440K8834N826l0385n1542p949
20404b2181M149L3908k3936M2278L7916K4415j9093k0927M61L3277R3872k4014
$$ plain form
20489 166868 116753 98727 61386 66862 30170 6599 26064 31656 90162 80449 40771 5541
20477 5541 44129 99209 106841 49006 -40350 20925 50814 15672 -15631 17326 100081 107501
20465 107501 85592 56103 51784 61185 64190 46685 71814 57061 71875 98756 94883 75746
20453 75746 50306 27570 44089 115778 93136 42528 13843 9477 22957 19658 -32959 -51330
20441 -51330 -17680 -11650 -10768 -44489 -29817 35102 13389 20603 47307 47995 34571 68108 78578
20428 78578 7178 10649 35195 62962 22747 -730 21355 545 -89223 -37639 -4231 -12649
20416 -12649 -664 46595 64496 58838 89912 57475 33035 61869 67695 37310 -14232 -22181
20404 -22181 -18032 15876 -8060 34218 72134 96549 77456 56529 56990 90267 184139 160125
20392A60125j381R4945Q8387J04394P7000J5064j35153o4951J6799J6220O184
20381C77633O0086L9731Q0837O9613N446k0284p9914o1589j0544q3986o4787k3681
20369B88561k8247N9174K9173K7063L5453Q9590O3806M4512j4606p5745q7617
20358D31117p9239m4958L6070M4195J7974O8297O6581L1055O7385j1650o0090
20347E66737q9932l5329l1666j1916m639J5514L727J42435R1469j1093p5421j49940
20335D09946p5325m0219J04917K6958L8485J05810O7025p314p9157p7251q7321
20324C86554o9792m6049m8688l4253p331q714M6897o120n095o630K3475o2164
20312A62090k1087m9847m5371K6376Q2479K4760l1007J2851l4875j4000M2138
$$ plain form
20392 160125 158744 253689 342076 446470 523470 538534 403381 338430 355229 371449 377633
20381 377633 437719 477450 558287 627900 633346 613062 533148 471559 461015 377029 312242 288561
20369 288561 260314 319488 348661 375724 411177 500767 564573 609085 594479 518734 431117
20358 431117 351878 306920 342990 387185 405159 473456 540037 571092 638477 626827 566737
20347 566737 476805 441476 409810 397894 393255 408769 412496 554931 646400 635307 559886 409946
20335 409946 334621 294402 399319 426277 464762 570572 637597 630283 551126 473875 386554
20324 386554 316762 270713 222025 187772 180441 171727 218624 212504 207409 200779 224254 162090
20312 162090 141003 91156 45785 72161 154640 179400 148393 161244 126369 112369 154507
20301A54507J5038p118J187L3134J3501J12996R7349O9466O9215m012q2847j31957
20289C40459p6446O0644J15218R7961Q1365M1600O022q0394j02661p3651q516
20278D01601m3428k1114o3937n5617k0770K492J553q0239r042j2201L4065j2138
20266A21225l5608N245N432k4136M5898L8331l5007K0562j9004m0730L8467N424
20254A26099L1965J4619k7317j5666L943p4572j4403q024j6567K1179L9199O0454
20242A40909M3076n9655r8732l2291N2179J8462N834K7K1750Q232o914J4925l0461
20229G7341j647j6345L2N5250M60o2354N6172L188p062j4207O6372P410m1092
20216A23518O6564J13521M7803M2864J1487O9969k2436p3064L181m3156n2059
$$ plain form
20301 154507 169545 162427 163614 196748 210249 323245 420594 490060 559275 555263 472416 340459
20289 340459 264013 324657 439875 537836 619201 660801 666823 586429 483768 410117 401601
20278 401601 358173 337059 273122 217505 196735 199227 200780 120541 111499 99298 133363 121225
20266 121225 85617 90862 96294 72158 118056 156387 121380 141942 122938 82208 120675 126099
20254 126099 158064 172683 145366 129700 133643 59071 44668 36644 20077 41256 80455 140909
20242 140909 183985 124330 25598 -6693 45486 63948 69782 69809 91559 99791 92877 107802 77341
20229 77341 75694 59349 59381 114631 115091 52737 108909 112097 105035 90828 157200 164610 123518
20216 123518 190082 303603 351406 394270 405757 475726 453290 380226 383407 340251 288192
20205B88192l7316M6083N0906R5944P4521O642n843o0733k4156p1562p9355n7117
20193B26206o3361m3404k710K1426J9367j9425M101k5502j3057J2425J3032k4406
20181A04692j647K99r771m1760k7811L3653M5513L2864K6349m533l3522J793j0365
20168A15754k5977Q4330M3569P8180M3984k571M0100N3293M5894J3610Q6078n6810
20156E19434j56514l3973O594k0533J2353N1073M9196L5451N7560M2990m6643
20145E16988p0173n6038q5780l1392k6134p7071l6209j2404N3462M5104m1714
20134A78639p9014l7252l5147J8600P8353K2659J1645n3384o8057N0086J0963
20123I8091J0415j106K9501J8459p969k3257l2958j3796k3084p3749k4693M5534
$$ plain form
20205 288192 250876 296959 347865 443809 518330 524972 519129 458396 434240 362678 283323 226206
20193 226206 162845 119441 116731 138157 157524 138099 142200 116698 103641 116066 129098 104692
20181 104692 103045 103344 93573 51813 24002 57655 103168 136032 162381 157848 124326 126119 115754
20168 115754 89777 174107 217676 295856 339840 337269 377369 430662 476556 490166 576244 519434
20156 519434 362920 328947 335541 315008 327361 378434 427630 463081 520641 563631 516988
20145 516988 446815 390777 304997 273605 247471 170400 134191 121787 175249 220353 178639
20134 178639 99625 62373 27226 45826 124179 146838 158483 105099 37042 87128 98091
20123 98091 108506 107400 136901 155360 147391 124134 91176 77380 54296 -19453 -44146 1388
20111A388K0593j0747N7260L226j3530M5244n1729o6042J0055L720N1567J7845
20099F8850K5640q78o9660j5655K8663J8148K4473J768L9793M0211n0423j1364
20087I9566L6014m3373p4379k8893n219O5982m4344k3464O5195N299o569L1151
20075G6966J414J5003l6079j9620O032J1760J7643J9724j0789n8472l862k6981
20063g261l9122K4171J2576j5519J2401P0869O97l3092k2773n620K7912N2857
20051G8096Q2913N5478Q252k8143n0511l4842m2770M6740N4859k6594j7600J6348
20039A42226k5738o9972l9608K639N0483K0078N9375K9131K395p258J5104N8717
20027B37572l411n1982o3339M9028m191o0814j5247M5200O911O643k8899j671
$$ plain form
20111 1388 21981 11234 68494 71720 58190 103434 51705 -14337 -4282 -562 51005 68850
20099 68850 94490 93612 23952 8297 36960 55108 79581 81349 121142 161353 110930 99566
20087 99566 135580 92207 17828 -11065 -16284 49698 5354 -18110 47085 52384 45815 76966
20075 76966 78380 93383 57304 37684 43716 55476 73119 92843 82054 23582 19720 -7261
20063 -7261 -46383 -22212 -9636 -25155 -12754 58115 58812 25720 2947 -2673 25239 78096
20051 78096 161009 216487 224739 196596 146085 111243 68473 115213 170072 143478 125878 142226
20039 142226 116488 46516 6908 9547 60030 80108 139483 168614 171009 163751 178855 237572
20027 237572 234161 182179 118840 167868 163677 102863 87616 132816 139727 146370 117471 115800
20015A15800M7905k4437l5070l0419j2707j0961l8167L3287M7955N1680J2891
20004A57757j6465o672O0135o13k7027J2848j5391N024K7885m6015K4323N9602
19992B35391L752j9925k1214p496j516l7249j5588k9229l4866l0054L1302L4434
19980A07742K726k6428O1822P7140L0640M3874K3848M2001L7010j3632L0427J06395
19968E23565J25064N0632N2829J4144l4831k9208j3905k5726P181J815L018M0815
19956G15393M7942n8394o5097j28909p2443J1181K9472j9094l7581J4245j907
19945D34808N137k8292l0748n2246j9724N5161L8215l1547P079J8642m9486j0548
19933C36451k7551r086P8820P9722p623l413N7025J8358k161K4943O8897P1456
$$ plain form
20015 115800 163705 139268 104198 73779 61072 50111 11944 45231 93186 144866 157757
20004 157757 141292 134620 194755 194142 167115 179963 164572 169596 197481 151466 175789 235391
19992 235391 239143 219218 198004 190508 188992 151743 136155 106926 72060 42006 73308 107742
19980 107742 110468 84040 145862 223002 253642 297516 321364 363365 400375 386743 417170 523565
19968 523565 648629 699261 752090 766234 731403 702195 688290 662564 669745 671560 674578 715393
19956 715393 763335 704941 639844 510935 438492 449673 479145 460051 422470 436715 434808
19945 434808 439945 411653 380905 328659 308935 364096 402311 370764 377843 396485 346999 336451
19933 336451 308900 299814 378634 458356 450733 447320 504345 522703 520542 545485 614382 685838
19921F85838L1703j9159J2110O1557J19208O5785N6049P765r194L4021m3867m5669
19909I56147N854p43N4988N6914o84l3700p4081q6549j29499j20009o0426p6709
19897D91503J3836K2774r164N7729O4367K0001k0274j5013m0443p6733O6279M6301
19885F21163m8922K2J3615K215m6141J9056N0151M0684j2907P8129L5352j736
19873G50681J3110j7791N3037R1242Q3923J08498J6370L0152L1987Q9139P4537
19862A324885P4467L1340R4497J27235J19205J04352J42752K46855L23230L07309
19852B896127L32072K61646J53419J18971J01238J49364L45848M65153N88464
19843E412302O90981O55007N99072N28478M94183N68947P12030J007955J418785
$$ plain form
19921 685838 717541 698382 710492 772049 891257 957042 1013091 1020856 1011662 1045683 1001816 956147
19909 956147 962001 961258 1016246 1073160 1072476 1038776 964695 878146 748647 628638 568212 491503
19897 491503 505339 528113 518949 576678 641045 661046 640772 625759 585316 508583 574862 621163
19885 621163 572241 572263 585878 588093 541952 561008 611159 651843 638936 717065 752417 750681
19873 750681 763791 746000 799037 890279 974202 1082700 1099070 1129222 1161209 1250348 1324885
19862 1324885 1399352 1430692 1525189 1652424 1771629 1875981 2018733 2265588 2588818 2896127
19852 2896127 3228199 3489845 3643264 3762235 3863473 4012837 4358685 4823838 5412302
19843 5412302 6103283 6758290 7357362 7885840 8380023 8948970 9661000 10668955 12087740
19834A2087740K040961K836577L918221N759815Q407452J1426543J4242867J6398616
19826G7118792J3287334L102741p318516j4114525j1816608m650242K030486P471589
19818F5111051J1653321J4466354J0625032o59670j2012842j9149565j6751130
19811E3282551j0884518p041327m833952l357258k354347j669224j336654j038542
19803B0766729p10522n04990l86930m54982n70299o04095m84387l50069j89768
19794A6510687q6995n9149J94681N51140Q96127J339402K004449K902050M256635
19785B8509027O525155R575122J2868316J5908560J7679219J1968867M4850j0874516
19777I2204600j6054968j1202244l199194L691553R222425J3553122J5213428
$$ plain form
19834 12087740 14128701 16965278 20883499 26643314 35050766 46477309 60720176 77118792
19826 77118792 90406126 93508867 86190351 72075826 60259218 55608976 57639462 65111051
19818 65111051 76764372 91230726 101855758 101196088 89183246 70033681 53282551
19811 53282551 42398033 35356706 30522754 27165496 24811149 23141925 21805271 20766729
19803 20766729 20056207 19551217 19164287 18709305 18139006 17534911 17050524 16700455 16510687
19794 16510687 16423692 16364543 16559224 17110364 18006491 19345893 21350342 24252392 28509027
19785 28509027 35034182 44609304 57477620 73386180 91065399 103034266 103079116 92204600
19777 92204600 76149632 64947388 61748194 65439747 74662172 88215294 103428722
19770A03428722Q410724m361829j5975430k1203072j6796636j0753231p232316
19763C5516932n137771l732243k800979k083300j534598j160254q00693p39771
19755A7527323q92989j077371j381443j373186j227670j098670q71642o43312
19747H961040n71671m69244l93902l46694m42830m73882m74627m14050l55946
19738E018194k63640k10195j11401j12903j73308r8409r3158k7633J7384N4514
19728C999445J00262O4286Q6400J54037J40334J01233J45526K47433L28342L95321
19718E762619M68300N66492O56124O33543N66629N54857N68873Q16371J119246
19709A1713054J546959K181046L151031M471316O491106Q951597J1598225J4223393
$$ plain form
19770 103428722 111839446 107477617 91502187 70299115 53502479 42749248 35516932
19763 35516932 30379161 26646918 23845939 21762639 20228041 19067787 18267094 17527323
19755 17527323 16634334 15556963 14175520 12802334 11574664 10475994 9604352 8961040
19747 8961040 8389369 7920125 7526223 7179529 6736699 6262817 5788190 5374140 5018194
19738 5018194 4754554 4544359 4432958 4320055 4146747 4048338 3955180 3927547 3944931 3999445
19728 3999445 4099707 4163993 4250393 4404430 4544764 4645997 4791523 5038956 5367298 5762619
19718 5762619 6230919 6797411 7453535 8087078 8653707 9208564 9777437 10593808 11713054
19709 11713054 13260013 15441059 18592090 23063406 29554512 38506109 50104334 64327727
19701F4327727J4051709Q498299J073082n369025j0506082j2291857q629881k984525
19693D8169447K053872O261773R927339J2415379J0126562L338218l746244r756826
19685G8789520j4186835j4308168j0504414o920910m738545l351894k482633j847488
19677B0448633j281745r27467n98896m93866n17950n97865n94255p25430p86425
19668A3924734p13102m53178k13385j9402J51619J94601K19509J99021K71913
19659A3562330M27200O36123J016390J484194K274456L350467M873718P007262
19651C4632140R738846J2669231J5470513J4981848Q762898Q42688o170325j1862035
19643G9065804j3698380r395902l078982K371382O909869J0839791J3262713J0422668
$$ plain form
19701 64327727 78379436 86877735 87950817 82581792 72075710 59783853 51153972 48169447
19693 48169447 50223319 56485092 66412431 78827810 88954372 92292590 88546346 78789520
19685 78789520 64602685 50294517 39790103 32869193 28130648 24778754 22296121 20448633
19677 20448633 19166888 18239421 17640525 17146659 16628709 16030844 15436589 14711159 13924734
19668 13924734 13211632 12758454 12545069 12525667 12677286 12871887 13091396 13290417 13562330
19659 13562330 13989530 14625653 15642043 17126237 19400693 22751160 27624878 34632140
19651 34632140 44370986 57040217 72510730 87492578 96255476 97098164 90927839 79065804
19643 79065804 65367424 55971522 52892540 55263922 62173791 73013582 86276295 96698963
19635I6698963L121882m290440j0804476j5720182j5606208j1377375p503471
19628C4518693n174361l720985k709147k047959j536937j167033r11595q72517
19620A6378159r26784j039517j144327j152611j075805j038381r51540q04106
19612H245088o77342o14419n51167n38291m83452m87806m11506l03357l00070
19603C877678k64227k48793k43983k09509j49722j81438j57363q4220j43233j73627
19593B021563j10165q4081q6670l2892p3963j42056q4719q5273m6825q3503q6433
19582A104983j9158l0986p00l2265p071l4063L6619M3371K1783m2931p0609l0685
19570I38288K3875q564n9454L3814O668k3903K5827n7342Q425N309o6642l6655
$$ plain form
19635 96698963 99820845 95530405 84725929 69005747 53399539 42022164 34518693
19628 34518693 29344332 25623347 22914200 20866241 19329304 18162271 17250676 16378159
19620 16378159 15451375 14411858 13267531 12114920 11039115 10000734 9049194 8245088
19612 8245088 7567746 6953327 6402160 5863869 5380417 4892611 4481105 4177748 3877678
19603 3877678 3613451 3364658 3120675 2911166 2761444 2580006 2422643 2338423 2195190 2021563
19593 2021563 1911398 1827317 1740647 1707755 1633792 1491736 1407017 1321744 1274919 1191416 1104983
19582 1104983 1085825 1054839 1054139 1021874 1014803 980740 1017359 1060730 1082513 1039582 968973 938288
19570 938288 962163 953599 894145 927959 934627 910724 936551 879209 887634 892943 826301 789646
19558G89646k7000L6610J6820N6630K6527m3572Q688j3221o5130N1773N057K4405
19546H67233r139l4049p9777j7993N5870L9335j417m680k3237J4474n8620m0091
19534G07909J3874J6844l9489L4342L2243p706J3429k778m9265J6384R2825R8438
19522I27050P5493R5508J15653M2334N4784J48257O3948j04525j27963l6686m218
19511A249635K9174M9497O4473Q1110Q7833P0900n594j8487j7084R213o2020R97
19499A539647L0822M4388L8868K4878K7544L6228J37054J40677J08441J79434
19489B307981J90027J95776J84090K44191K29943K26622K22173L20737L47560
19480D469100L84795M07803M83534N13351M92558M70273M96817N52462O69649
$$ plain form
19558 789646 762646 799256 816076 872706 899233 855661 864349 851128 785998 837771 842828 867233
19546 867233 858094 824045 744268 726275 782145 821480 820063 815383 792146 806620 748000 707909
19534 707909 721783 738627 699138 733480 765723 758017 771446 768668 719403 735787 828612 927050
19522 927050 1002543 1098051 1213704 1256038 1310822 1459079 1523027 1418502 1290539 1253853 1249635
19511 1249635 1278809 1328306 1392779 1473889 1561722 1632622 1627028 1608541 1591457 1600670 1538650 1539647
19499 1539647 1570469 1614857 1653725 1678603 1706147 1742375 1879429 2020106 2128547 2307981
19489 2307981 2498008 2693784 2877874 3122065 3352008 3578630 3800803 4121540 4469100
19480 4469100 4853895 5261698 5745232 6258583 6751141 7221414 7718231 8270693 8940342
19471H940342Q56532J129582J522754J874316K654120L650638N033091P073772
19463C2735147R436746J2149156J4136923J1882939O241026n73430o262650r053810
19455G0692047q458592l318873K549799P309839J0149886Q055021K573164m185987
19447H5366304r825772j2974114j3285820r939618o405136m402364l143656k355325
19439B3034499j777579j346301r95069p75023p00112o29021o67554o43573n97486
19430A4902781n40964m38253l07474k47463j26405L6215J06918J49509K61161
19421A3796025L96988O00048P16896J000013J485938K196126L222197M609709
19413B8023940O626573R300077J2215586J5412175J6206324J1615914M539106
$$ plain form
19471 8940342 9796874 10926456 12449210 14323526 16977646 20628284 25661375 32735147
19463 32735147 42171893 54321049 68457972 80340911 86581937 86008507 79745857 70692047
19455 70692047 62233455 58914582 61464381 68774220 78924106 86979127 89552291 85366304
19447 85366304 75540532 62566418 49280598 39340980 32935844 28533480 25389824 23034499
19439 23034499 21256920 19910619 18915550 18140527 17440415 16811394 16143840 15500267 14902781
19430 14902781 14361817 13923564 13616090 13368627 13242222 13278437 13385355 13534864 13796025
19421 13796025 14193013 14793061 15509957 16509970 17995908 20192034 23414231 28023940
19413 28023940 34650513 43950590 56166176 71578351 87784675 99400589 103939695
19406A03939695l541356r302076j1609581q776312j750755M741949R740438J1075797
19398I4517799O836457O2704p465215j2961149j5697694j4289270r878600o451473
19390C4673559m550974l516099k683799k081932j705862j314983j122550j067719
19382A6629641r91992j048772j033469j080509j073601j042028r73678q72532
19374H513060p65770n82674n89081m91146l43679l90474m53065m31803l47078
19365D118290l01719l27163l18799j92705j41432j52630j52888k03343j80988
19356B146623k09939j46942r7195o1717n3357r4471r8896o3557j09782j09397
19346A101370n265N9560m4395m9875k6356j8293l0204P468K287l4535k0181j2597
$$ plain form
19406 103939695 100398339 91096263 79486682 70710370 68959615 73701564 83442002 94517799
19398 94517799 101354256 101416960 93951745 80990596 65292902 51003632 41125032 34673559
19390 34673559 30122585 26606486 23922687 21840755 20134893 18819910 17697360 16629641
19382 16629641 15637649 14588877 13555408 12474899 11401298 10359270 9385592 8513060
19374 8513060 7747290 7164616 6575535 6084389 5740710 5350236 4897171 4465368 4118290
19365 4118290 3816571 3489408 3170609 2977904 2836472 2683842 2530954 2327611 2146623
19356 2146623 1936684 1789742 1692547 1630830 1577473 1483002 1384106 1320549 1210767 1101370
19346 1101370 1096105 1155665 1111270 1061395 1035039 1016746 986542 994010 996297 961762 941581 928984
19334I28984Q0689J45782N1427P9970L4431o0754m3606n2600L7108N5445K4002
19323A280878p6971r8297j16039j30615p2251K2085p5168r891p830l7776M4504
19312G22629M4738N5315P7852R0021Q8281O5718p2398j26904j49150n4100p251
19301G34751M0624P8080N0371K4262J4034l5088m2603r7835n3225L4180M930n8056
19289F94425q094P6708Q0431M1654R595j1936k2076J4887P7459M5863m0149m0054
19277I18713l0748n4874k0682K6245L3188m7346m9603o6508k4773M0803L9971
19266G64386M6532P0049N7110Q5119L5817J253o0791j05151n1466l139n5120j7530
19254G67069O4269P1041L5742M4285L58o2043j31762j23059j9068l945l5601q884
$$ plain form
19334 928984 1009673 1155455 1206882 1286852 1321283 1260529 1216923 1164323 1201431 1256876 1280878
19323 1280878 1203907 1105610 989571 858956 786705 808790 733622 723731 715901 678125 722629
19312 722629 767367 822682 900534 990555 1078836 1144554 1072156 945252 796102 742002 734751
19301 734751 775375 853455 903826 928088 942122 907034 864431 766596 713371 747551 752481 694425
19289 694425 686331 763039 843470 885124 894719 882783 860707 875594 953053 998916 958767 918713
19277 918713 887965 833091 812409 838654 871842 824496 774893 708385 683612 724415 764386
19266 764386 810918 880967 938077 1023196 1059013 1060266 999475 894324 842858 839719 784599 767069
19254 767069 831338 902379 938121 982406 982764 920721 788959 665900 646832 642887 607286 598402
19242E98402p4768p8138n2568l4644L7889O4490M1408N3980J0861m86l6556o0427
19230D69443M3470L7952l6801j4792m7703n4749o6343n7612k9328j750j4910M4643
19218B71520K062r898N1410M0942j0723j6091r640j9536p979m1186m5857M8859
$$ plain form
19242 598402 523634 445496 392928 358284 396173 460663 502071 556051 566912 566426 529870 469443
19230 469443 512913 550865 514064 499272 451569 396820 330477 272865 243537 241787 226877 271520
19218 271520 273582 263684 315094 356036 345313 329222 319582 300046 292067 250881 205024 253883
$$ [...]
##END NTUPLES=NMR SPECTRUM
##END=
