##TITLE=Analysis number 318600
Compound Code cc 04310
Project Code adrs
Chemist Name eburon
##JCAMPDX= 6.0         $$ Bruker NMR JCAMP-DX V2.0
##DATA TYPE= NMR SPECTRUM
##DATA CLASS= NTUPLES
##ORIGIN= Bruker BioSpin GmbH
##OWNER= nmr
$$ XWIN-NMR		Version 3.5
$$ Wed Apr  5 14:50:39 2006 GMT Daylight Time (UT+1h)  MAYBRIDGE\nmr@NMR_250MHZ
##.OBSERVE FREQUENCY= 250.131544655141
##.OBSERVE NUCLEUS= ^1H
##.ACQUISITION MODE= SIMULTANEOUS (DQD)
##.ACQUISITION SCHEME= undefined
##.AVERAGES= 16
##.DIGITISER RES= 18
##SPECTROMETER/DATA SYSTEM= dpx250
##.PULSE SEQUENCE= zg30
##.SOLVENT NAME= CDCl3
##.SHIFT REFERENCE= (INTERNAL, CDCl3, 0, 16.522)
##AUDIT TRAIL= $$ (NUMBER, WHEN, WHO, WHERE, WHAT)
$$ ##TITLE= Audit trail, XWIN-NMR		Version 3.5
$$ ##JCAMPDX= 5.01
$$ ##ORIGIN= Bruker BioSpin GmbH
$$ ##OWNER= nmr
$$ C:\u/data/dgb/nmr/ADRS/2100/pdata/1/auditp.txt
$$ ##AUDIT TRAIL=  $$ (NUMBER, WHEN, WHO, WHERE, WHAT)
(   1,<2006-04-05 14:50:09.20 +100>,<MAYBRIDGE\nmr>,<NMR_250MHZ>,
      <created by zg, POWCHK disabled, PULCHK disabled
       configuration hash MD5:
       84 BC 41 DB A1 6E 1D 46 DA 25 12 A5 C1 ED C5 3A
       data hash MD5: 64K
       C3 5D 0D 8A 88 97 DB 60 56 7F A7 E4 CA 98 DA 94>)
(   2,<2006-04-05 14:50:28.21 +100>,<MAYBRIDGE\nmr>,<NMR_250MHZ>,
      <Start of raw data processing
       ef LB = 0.3 FT_mod = 6 PKNL = 1 SI = 32K 
       data hash MD5: 32K
       F9 AE 98 C9 E1 0F 5D F7 5D 0D 3B 5F FB 11 35 3F>)
(   3,<2006-04-05 14:50:30.41 +100>,<MAYBRIDGE\nmr>,<NMR_250MHZ>,
      <apk 
       data hash MD5: 32K
       18 FD 83 11 9E 84 4A CF 65 9C 8B 69 EE 92 F4 DA>)
(   4,<2006-04-05 14:50:31.37 +100>,<MAYBRIDGE\nmr>,<NMR_250MHZ>,
      <abs ABSG = 5 
       data hash MD5: 32K
       C6 A6 58 35 A5 8F E8 B4 A8 91 2F 22 57 C5 DF 66>)
$$ ##END=
$$ 
$$ hash MD5
$$ CD 84 6A 34 89 56 83 DA DA 38 10 A7 82 02 53 16
##$RELAX= 
##$RELAX= 
##$RELAX= 
##$RELAX= 
##$RELAX= 
##$RELAX= 
##$RELAX= 
$$ Bruker specific parameters
$$ --------------------------
##$DU= <C:\u>
##$EXPNO= 2100
##$NAME= <ADRS>
##$PROCNO= 1
##$TYPE= <nmr>
##$USER= <dgb>
##$AMP= (0..31)
100 100 100 100 100 100 100 100 100 100 100 100 100 100 100 100 100 100 
100 100 100 100 100 100 100 100 100 100 100 100 100 100 
##$AQSEQ= 0
##$AQ_mod= 3
##$AUNM= <au_zg>
##$AUTOPOS= <45 >
##$BF1= 250.13
##$BF2= 250.13
##$BF3= 250.13
##$BF4= 250.13
##$BF5= 500.13
##$BF6= 500.13
##$BF7= 500.13
##$BF8= 500.13
##$BYTORDA= 1
##$CFDGTYP= 0
##$CFRGTYP= 5
##$CHEMSTR= <none>
##$CNST= (0..31)
1 1 145 1 1 1 1 1 1 1 1 1 1 1 1 1 1 1 1 1 1 1 1 1 1 1 1 1 1 1 1 1 
##$CPDPRG= <>
##$CPDPRG1= <>
##$CPDPRG2= <>
##$CPDPRG3= <>
##$CPDPRG4= <mlev>
##$CPDPRG5= <mlev>
##$CPDPRG6= <mlev>
##$CPDPRG7= <mlev>
##$CPDPRG8= <mlev>
##$CPDPRGB= <>
##$CPDPRGT= <>
##$D= (0..31)
0 1 0 0 0 0 0 0 0 0.06 0 0 0 0 0 0 0.0002 0 0 0 0 0 0 0 0 0 0 0 0 0 0 
0 
##$DATE= 1144245008
##$DBL= (0..7)
120 120 120 120 120 120 120 120 
##$DBP= (0..7)
150 150 150 150 150 150 150 150 
##$DBP07= 0
##$DBPNAM0= <>
##$DBPNAM1= <>
##$DBPNAM2= <>
$$ [...]
##$SUBNAM7= <"">
##$SUBNAM8= <"">
##$SUBNAM9= <"">
##$SW= 20.6930455092707
##$SWIBOX= (0..15)
0 0 3 0 0 0 0 0 0 0 0 0 0 0 0 0 
##$SW_h= 5175.983436853
##$TD= 65536
##$TD0= 1
##$TE= 295.16
##$TE2= 300
##$TE3= 300
##$TEG= 300
##$TL= (0..7)
0 120 120 120 120 120 120 120 
##$TP= (0..7)
150 150 150 150 150 150 150 150 
##$TP07= 0
##$TPNAME0= <>
##$TPNAME1= <>
##$TPNAME2= <>
##$TPNAME3= <>
##$TPNAME4= <>
##$TPNAME5= <>
##$TPNAME6= <>
##$TPNAME7= <>
##$TPOAL= (0..7)
0.5 0.5 0.5 0.5 0.5 0.5 0.5 0.5 
##$TPOFFS= (0..7)
0 0 0 0 0 0 0 0 
##$TUNHIN= 0
##$TUNHOUT= 0
##$TUNXOUT= 0
##$USERA1= <user>
##$USERA2= <user>
##$USERA3= <user>
##$USERA4= <user>
##$USERA5= <user>
##$V9= 5
##$VALIST= <valist>
##$VCLIST= <CCCCCCCCCCCCCCC>
##$VD= 0
##$VDLIST= <DDDDDDDDDDDDDDD>
##$VPLIST= <PPPPPPPPPPPPPPP>
##$VTLIST= <TTTTTTTTTTTTTTT>
##$WBST= 1024
##$WBSW= 4
##$XGAIN= (0..3)
0 0 0 0 
##$XL= 0
##$YL= 0
##$YMAX_a= 474574
##$YMIN_a= -649420
##$ZGOPTNS= <>
##$ZL1= 120
##$ZL2= 120
##$ZL3= 120
##$ZL4= 120
##$ABSF1= 16.522
##$ABSF2= -4.171173
##$ABSG= 5
##$ABSL= 3
##$ALPHA= 0
##$AQORDER= 0
##$ASSFAC= 0
##$ASSFACI= 0
##$ASSFACX= 0
##$ASSWID= 0
##$AUNMP= <proc_1d>
##$AZFE= 0.1
##$AZFW= 0.1
##$BCFW= 0
##$BC_mod= 0
##$BYTORDP= 0
##$COROFFS= 0
##$CY= 12.5
##$DATMOD= 1
##$DC= 0
##$DFILT= <>
##$DTYPP= 0
##$F1P= 14.0000005364418
##$F2P= -0.99999901652339
##$FCOR= 0.5
##$FTSIZE= 32768
##$FT_mod= 6
##$GAMMA= 0
##$GB= 0
##$INTBC= 1
##$INTSCL= 1
##$ISEN= 128
##$LB= 0.3
##$LEV0= 0
##$LPBIN= 0
##$MAXI= 10000
##$MC2= 0
##$MEAN= 0
##$ME_mod= 0
##$MI= 0
##$NCOEF= 0
##$NC_proc= -5
##$NLEV= 6
##$NOISF1= 0
##$NOISF2= 0
##$NSP= 0
##$NTH_PI= 0
##$NZP= 0
##$OFFSET= 16.522
##$PC= 1
##$PHC0= 157.0481
##$PHC1= 34.61568
##$PH_mod= 1
##$PKNL= yes
##$PPARMOD= 0
##$PSCAL= 4
##$PSIGN= 0
##$REVERSE= no
##$SF= 250.13
##$SI= 32768
##$SIGF1= 0
##$SIGF2= 0
##$SINO= 400
##$SIOLD= 32768
##$SREGLST= <1H.CDCl3>
##$SSB= 0
##$STSI= 32768
##$STSR= 0
##$SW_p= 5175.98343685301
##$SYMM= 0
##$S_DEV= 0
##$TDeff= 65536
##$TDoff= 0
##$TI= <Analysis number 999999
Compound Code 99
Book Reference 9
Project Code 9>
##$TILT= no
##$TM1= 0
##$TM2= 0
##$TOPLEV= 0
##$USERP1= <user>
##$USERP2= <user>
##$USERP3= <user>
##$USERP4= <user>
##$USERP5= <user>
##$WDW= 1
##$XDIM= 32768
##$YMAX_p= 452857696
##$YMIN_p= -1033413
$$ End of Bruker specific parameters
$$ ---------------------------------
##NTUPLES= NMR SPECTRUM
##VAR_NAME=  FREQUENCY,     SPECTRUM/REAL,   SPECTRUM/IMAG
##SYMBOL=    X,             R,               I
##VAR_TYPE=  INDEPENDENT,   DEPENDENT,       DEPENDENT
##VAR_FORM=  AFFN,          ASDF,            ASDF
##VAR_DIM=   32768,         32768,           32768
##UNITS=     HZ,            ARBITRARY UNITS, ARBITRARY UNITS
##FACTOR=    0.157963299565203, 1,           1
##FIRST=     4132.6476996994, 0,             0
##LAST=      -1043.33573715361, 0,           0
##MIN=       -1043.33573715361, -1033413,    0
##MAX=       4132.6476996994, 452857696,     0
$$ Real data points
##PAGE= N=1
##DATA TABLE= (X++(R..R)), XYDATA
$$ [...]
23354G864n5569J7305Q3399J03N360k8103l1054k287M2474J6337o3683o7920K3360
23341e2414O6994M820n171M7515j476k6201k7142j6552L5583K7916j8309m2067
23329f504m7072Q0985j8469J3418L6081l0772j2166m6996M7148J2493l6546j6416
23317b4816L416j0012q872J9593K5506R158L0733o438o1924j4376L5852O5505
23305F3325J2214j632p8290j0194M3125J0571p4433j8707j7468N7442J8343N8125
23293F2421L8118k2236o1855k3546N363j8150M5161L337k6359l6171j2735L5314
23281a1338q077r251q104N963l3533L3345M0595k2012l2035L9737J0404L0007
23269C5701l6591k9481L8351M7931L8421J4927q8535o9134K7923n8518Q481O7107
$$ y = [7864, -47705, -30400, 52999, 53102, 58462, 30359, -695, -2982, 39492, 55829, -7854, -75774, -52414, 14580, 19400, 14229, 61744, 60268, 34067, 6925, -9627, 25956, 53872, 35563, -6504, -53576, 27409, 8940, 22358, 58439, 27667, 15501, -31495, 15653, 28146, -8400, -24816, -21400, -31412, -40284, -20691, 4815, 13973, 44706, 38268, -23656, -38032, -2180, 63325, 75539, 73907, -4383, -14577, 28548, 39119, -35314, -54021, -71489, -14047, 4296, 62421, 100539, 78303, 16448, -7098, -1735, -19885, 25276, 28613, 2254, -33917, -46652, -11338, -19415, -28666, -36770, -30807, -64340, -30995, 9600, -12412, -44447, -4710, 5694, 35701, -890, -30371, 7980, 55911, 94332, 109259, 20724, -48410, -20487, -79005, -70524, -3417]
23257c417p727k3409L3533L7380J3085k4121j5589q313M511j4278M5607L339l0312
23244A0289m4130r822K2960L1104N1821O9808j6727o8646l4136K3222k884K5527
23232E8386m0074k7140O176O270n4538l6455L9808O4419J5337L7853j2692q5477
23220b8127k2808N1782L1337j1894j04792r168J0697n324R0709M6784n3380l5834
23208d0018K1569P1970j837j1591Q2866j5307n6153n6820j3447L9215R570j6202
23196A3815k5824m2160K9238P7065K889o0071n8046M6884k4j9068K3508J2673
23184H79j6195k7115L3606K1284N1914k2839j4478L2936K3005k1589p3797j1475
23172b3864l6819J7656J11902J6872j9627j1331o811j8529K3480j310L204K3200
$$ y = [-3417, -11144, -34553, -1020, 36360, 49445, 25324, 9735, 1422, 5933, -8345, 37262, 40601, 10289, -33841, -43663, -20703, 10401, 62222, 132030, 115303, 46657, 12521, 35743, 32859, 58386, 18312, -8828, -2652, 3618, -50920, -87375, -47567, 16852, 32189, 70042, 57350, -28127, -50935, 847, 32184, 20290, -84502, -93670, -82973, -88297, 2412, 49196, -4184, -40018, -18449, 53521, 51684, 40093, 122959, 107652, 51499, -5321, -18768, 20447, 30017, 13815, -12009, -54169, -24931, 52134, 55023, -5048, -63094, -16210, -16234, -35302, -11794, 879, -15316, -42431, -8825, 12459, 64373, 41534, 27056, 59992, 82997, 61408, -12389, -23864, -60683, -43027, 68875, 85747, 66120, 54789, 47978, 29449, 52929, 51619, 54823, 78023]
23160G8023j7380k3394r612J8561o0227n4613k108K9605N4808l535k1911K5190
23148A3407N5559J4217o2819m5423O104k9354J2435L5156J7095K4613l4107J3707
23136B0590n601q613m6169r223J02820L5338l8665K719k1057M5075K2577K4255
23124A24046j4249k5123o842q412K2636M3482n1259j1004K4518j6085k2313J2134
23112G1529J5768k4073r9931j1577N7108J0827M3560j993J2670L1766L316l1252
23100G7718n6584K0946O4122n11K1005m7681m0253J2573n113q1107L118L4681
23088B914K4311P1096l2561L808j4106l1951M4791O0113L117m5560n3500O992
23076C9464K5878j1671q6269J4461P9521k3801j1009l7726R861J7621K8412P062
$$ y = [78023, 60643, 37249, 27637, 46198, -14029, -68642, -70750, -41145, 13663, 10128, -11783, 13407, 68966, 83183, 20364, -25059, -18955, -48309, -35874, -718, 16377, 40990, 6883, 20590, 14989, 6376, -39793, -49016, 53804, 89142, 50477, 53196, 32139, 77214, 99791, 124046, 109797, 84674, 77832, 69420, 92056, 135538, 84279, 73275, 97793, 81708, 59395, 71529, 87297, 63224, -36707, -48284, 8824, 19651, 63211, 61218, 73888, 105654, 108970, 77718, 21134, 42080, 106202, 105691, 126696, 79015, 38762, 51335, 46222, -34885, -31767, 2914, 27225, 98321, 65760, 69568, 55462, 23511, 68302, 128415, 131532, 85972, 32472, 39464, 65342, 53671, -32598, -18137, 61384, 37583, 26574, -11152, -1291, 16330, 44742, 51804]
23064E1804j4205o5104K5671j2058K2628K2188L468J5303J743k437J042M9999
23052A00042k7770k3064O758J3636J6891m011k3860L4564M3649p407m1512P516
23040I5432N1540l3825o3081J7590j863n2017J6377j9406n3642J2831N0092J4379
23028C4407K0727j5940J0763P276n0917m881N1393M3935K3175L3123O1396m3806
23016A70651j9106k2633l2282k5380J7526K2515K7876M2650k3064m2873o3925
23005E1955p4856L2032R2146J664L995k1K9700n1081k2596R678m6896L986K4563
22992E4269n560j0304m0963m2561k2796N1963J4791m7491Q0100N0329L5373J3101
22980A30251k3781k1517l1495p824j5788K7068q902J3995l3000p4648j2845O8444
$$ y = [51804, 37599, -27505, -1834, -13892, 8736, 30924, 34392, 49695, 51438, 49001, 50043, 100042, 72272, 49208, 55966, 69602, 86493, 82482, 58622, 93186, 136835, 129428, 87916, 95432, 146972, 113147, 50066, 67656, 65793, 13776, 30153, 10747, -42895, -30064, 20028, 34407, 55134, 39194, 49957, 57233, 6316, 1435, 52828, 96763, 119938, 153061, 214457, 170651, 151545, 128912, 96630, 71250, 88776, 111291, 139167, 181817, 158753, 115880, 51955, -22901, 9131, 101277, 102941, 106936, 106915, 136615, 85534, 62938, 72616, 25720, 29706, 54269, 48709, 38405, -2558, -45119, -67915, -15952, -1161, -48652, 31448, 81777, 117150, 130251, 106470, 84953, 53458, 45634, 29846, 56914, 48012, 62007, 29007, -45641, -58486, 9958]
22968I958j3258l4632K7318L0346K019K3170l1977K2280K2964j6137j3378L1210
22956E9883k496J128n4054n1536J4644L7673L2403j4841J2494k2897K055j0788
22944C668j1014J0787N6785o3027m6859j4579l0886K8698O865P09L3559j5789
22932d1083N8846k2967j06471Q671M8416K972m9395K0756m458r1J3901j8233M0569
22919d8567O8804L6572m340N893J2517L8729K03l4839m2431O493J3936j3198m2172
22906b400l2546N864K0400L1503K4631M5620n140J8992m1972l4576L2777j2024
22894E1129p2483J0872J7235J9707K4934k3928o3284L4570M0509M8973K7431j6139
22882I9526n0926j05385M309M3557L9087R511Q650n3887l8451M5627L9871n300
$$ y = [9958, -3300, -37932, -10614, 19732, 21751, 44921, 12944, 35224, 58188, 42051, 28673, 59883, 57387, 58515, 4461, -47075, -32431, 5242, 37645, 22804, 35298, 12401, 14456, 3668, -7346, 3441, 60226, -2801, -49660, -64239, -95125, -66427, -59562, -58853, -25294, -41083, 17763, -5204, -111675, -103004, -54588, -51616, -101011, -80255, -84713, -84804, -70903, -89136, -48567, 20237, 56809, 52469, 58362, 70879, 109608, 109811, 74972, 32541, 39034, 52970, 39772, -2400, -34946, -29082, -8682, 22821, 47452, 93072, 87932, 106924, 64952, 30376, 63153, 51129, -21354, -10482, 6753, 26460, 51394, 27466, -35818, -1248, 39261, 88234, 115665, 99526, 48600, -56785, -52476, -8919, 30168, 39679, 48329, -5558, -44009, 1618, 41489, 36189]
22870C6189J0963J6664K4557O170K7698k5811k6548L281J2715l1429k287K5277
22858G7439m1251n6629L271R6362m965J0606L3755j1420L1721j6997M79J2622
22846A34993q044j2100q6454o3373K3418P9784n320k3781k5334O5839K1092j0386
22834I0334j2762o1720p262j2708n4571J9684N2460n1507k6234O7821J2096L5763
22822E1394L4487n4988P768J0672k1980n2431l813N5331K1982m0431o3121J0397
22810d4733O4524N7124j2482l0555K3162l305o402m7800j9144J4967L4189K521
22798C2066L7208L6256K8736j6844k7387J3919K0689j0763l2898l5823L9997l4728
22786E0428m9162j0306M327O0859J3659m5567m5701n071L354N3871o922l7923
$$ y = [36189, 47152, 63816, 88373, 94543, 122241, 96430, 69882, 73163, 85878, 54449, 52162, 77439, 36188, -20441, -17170, 79192, 74227, 84833, 118588, 107168, 138889, 121892, 122371, 134993, 126949, 114849, 28395, -34978, -11560, 68224, 62904, 39123, 13789, 79628, 100720, 90334, 77572, 15852, 8590, -4118, -58689, -39005, 13455, -38052, -64286, 3535, 15631, 51394, 85881, 30893, 38661, 49333, 27353, -25078, -28891, 26440, 48422, 7991, -55130, -44733, 19791, 76915, 64433, 33878, 57040, 53735, 47333, -467, -19611, -4644, 29545, 32066, 69274, 105530, 134266, 117422, 90035, 103954, 124643, 113880, 80982, 45159, 85156, 50428, 1266, -9040, -4713, 56146, 69805, 24238, -21463, -26534, -23180, 30691, 23769, -14154]
22774a4154l2373J6815O737L8494J5197j991N6307k9708J2304P9986N6447k3313
22762A80748m1098m4076j2101m8297k3447N413J5346M9028L8207k4718m1789n712
22750D7504j6365q699N8505K4541m3228o0295r000J6990L4023K9627M434J3043
22738I1080K857j0102P001N566R526k2649k3567K1979n1916m6328K738M0849L136
22725C0170K8463l5440l4443l806k9781N54k505K8211K4717k8817J2137P8568
22713F8028J5588l3551J5558K7282m8635r6814M0694M2260L0209Q527j7665j4647
22701C6834K3363p1506k5444J1854P48O6522j4210n6842J7962L8209j9466m5314
22689c7290j5641Q047P352K5807K0220K7661K2057j1515k526j9027Q913l0687
$$ y = [-14154, -46527, -29712, -22975, 15519, 30716, 28725, 85032, 55324, 67628, 147614, 204061, 180748, 139650, 95574, 83473, 35176, 11729, 17142, 32488, 81516, 119723, 95005, 53216, 47504, 31139, 22440, 80945, 105486, 62258, 1963, -7037, 9953, 43976, 73603, 78037, 91080, 93937, 83835, 90836, 96402, 105928, 83279, 59712, 81691, 29775, -16553, -13815, 27034, 30170, 58633, 23193, -11250, -15056, -44837, -44283, -46788, -18577, 6140, -22677, -10540, 68028, 83616, 50065, 65623, 92905, 44270, -52544, -11850, 30410, 60619, 69146, 51481, 36834, 60197, -11309, -36753, -24899, -24151, 42371, 28161, -28681, -10719, 27490, 8024, -37290, -52931, -44884, -37532, -11725, 8495, 36156, 58213, 46698, 44172, 25145, 34058, 3371]
22677C371j3841L313M4146K7017j1949J8819k4675n3237m5270J8621J7628j0947
22665b7004j5687O8492K8971k8123L5616l1455o0675N7819J2976l3824J1654L1140
22653D9900l1907j9911k923m593m176J4775q805j8373L5879K2285M3J7530N3630
22640A03354J6093j5867J0962N470k953m5904l8305K8480o533k2916j9166J1207
22628B3922Q5981L303j7638J3549k307K7550j4331l338n4284m0240K5699r056
22616C8810K66o939J1163k0484K4051j4884L8744M8484j6035J0215K5859n756
22604A33494N487p124j5973n5793k9514J2632K3161K1148j0387m6132J0547J8727
22592F0273j6370O331l659j8869K0021m4650m4541K4391J3574o693M5396L8941
$$ y = [3371, -10470, -7157, 36989, 64006, 52057, 70876, 46201, -7036, -52306, -33685, -16057, -27004, -42691, 25801, 54772, 26649, 62265, 30810, -29865, 27954, 40930, 7106, 18760, 49900, 17993, -1918, -4841, -9434, -13610, 1165, -7640, -26013, 9866, 32151, 32194, 49724, 103354, 119447, 103580, 114542, 120012, 117059, 71155, 32850, 61330, 54797, 31881, 12715, 23922, 109903, 113206, 95568, 109117, 106810, 134360, 120029, 116691, 62407, 22167, 47866, 38810, 39076, 32137, 43300, 22816, 46867, 31983, 70727, 119211, 103176, 113391, 139250, 133494, 138981, 131857, 115884, 60091, 30577, 43209, 66370, 87518, 77131, 30999, 41546, 60273, 43903, 50234, 46575, 27706, 47727, 3077, -41464, -17073, -3499, -10192, 35204, 74145]
22580G4145K7663k1215k5518j5280L3744M6060m7168p2332m3617O076K9492O4307
22568E6357K9016j5723p594J5177j8109o811O2374k2773k3439L5543M8148l6653
22556A15513n5269O83O364l3515m1075K8242K3506j575m7095k1100L5638j4884
22544d567N2196M3437l7691j2195m0766L486m4317l8037j054R020P0613L1067
22532C1192j1876L2067j9916j0235m1171j4531Q495L4034K9571q220o1791L0543
22520a838L3766p038O186J775M2385K1896p615j8123m2803j5902p077K8162r624
22507B4150k1627k1581P4958L192n181M7249k8755o280m0177n0743J0165J743
22495a2887J1773J7580Q863J871L2724O4941j3343m7870l7749l411K6748J771
$$ y = [74145, 101808, 80593, 55075, 39795, 73539, 119599, 72431, 99, -43518, -37442, -7950, 56357, 85373, 69650, 62056, 77233, 59124, 52313, 114687, 91914, 68475, 104018, 152166, 115513, 60244, 60927, 67291, 33776, -7299, 20943, 44449, 42874, -4221, -25321, 10317, -4567, 47629, 91066, 53375, 41180, 414, 3900, -40417, -78454, -79508, -70488, 125, 31192, 19316, 51383, 31467, 21232, -19939, -34470, -25975, 8059, 37630, 29410, -32381, -1838, 31928, 24890, 31076, 32851, 75236, 97132, 89517, 71394, 28591, 12689, 5612, 33774, 24150, 2523, -19058, 55900, 59092, 53911, 101160, 72405, 66125, 25948, -24795, -14630, -12887, -1114, 16466, 25329, 27200, 59924, 124865, 111522, 63652, 25903, 22492, 49240, 51011]
22483E1011l6529M8796M0341p638o7812J1261l875P4216k190l0189l1583L7378
22471H3187L7740j9189J6254N4703k5179n5172n0264J2263M1137k435j561k0350
22459G1134J6283m9111n7108j3653N3396K7189q767l5823J7690P3907P2606m3018
22447A24725n8946m1101n8756L8397Q6487K4078O353k7894l6470k4972j1106P982
22435B8777p399L1303P1163J1411l2955M7135K428l7706k8175K2733n629j9830
22423H3256O0697K2238n3206j04613n0996N6523L8800L1553N2805K4463k7848
22412A33672l9197l7053j7416o9026k6471L3013K4497O4323J6745j9123k1666
22401D2298L1989j9366N2907Q489m0361k3696l6295L5876J3403k7463K9270k5767
$$ y = [51011, 14482, 63278, 103619, 95981, 28169, 39430, 35555, 109771, 107581, 77392, 45809, 83187, 120927, 101738, 117992, 172695, 147516, 92344, 42080, 54343, 95480, 93045, 91484, 71134, 87417, 38306, -18802, -32455, 20941, 48130, 39363, 3540, 21230, 95137, 167743, 124725, 65779, 24678, -34078, 4319, 90806, 114884, 121237, 93343, 56873, 31901, 20795, 28777, 21378, 52681, 123844, 135255, 102300, 149435, 151863, 114157, 85982, 108715, 103086, 83256, 143953, 166191, 112985, 8372, -42624, 13899, 52699, 84252, 137057, 161520, 133672, 94475, 57422, 40006, -29020, -55491, -22478, 2019, 66342, 83087, 63964, 42298, 74287, 54921, 107828, 116317, 75956, 52260, 15965, 51841, 65244, 37781, 67051, 41284]
22389D1284l8741m6065l8010k1827M2309M1147N0812k0978M3504P9211n5875q0349
22377c578M462M0118J775K4312j1675p0250k8149O960O8860K7821K5785M932o4019
22364B7354n5379k3422j3437Q9537Q504k3044K561l8428L827L9600N2435R686
22352G9794j5357r099O411j586j7561l5021J2777r856J2048k3019j9197N0373
22340C0707L8817N251J2601j4655Q637m5873K1249o443l7142P600L0509N714q050
22327D8922k089o083P345j7031p528j4461j010J3497L7635k5466j4246k8980K6104
22314A6609L3977k150J3605L1258j7866N6340J4290m1183o0258Q550J0857L012
22302F7041L7802Q758j21334n0348Q5092L5816K3119J6369k781k2244k2000J9051
$$ y = [41284, 2543, -43522, -81532, -103359, -61050, -19903, 30909, 9931, 53435, 132646, 76771, -3578, 884, 41002, 42777, 67089, 55414, -14836, -42985, -36025, 32835, 60656, 86441, 91373, 27354, -28025, -51447, -64884, 24653, 33157, 10113, 12674, -25754, -21927, 17673, 70108, 79794, 64437, 55338, 61749, 60163, 42602, 7581, 20358, 10502, 22550, -469, -19666, 30707, 69524, 74775, 87376, 72721, 81358, 35485, 56734, 50291, 13149, 20749, 51258, 56972, 48922, 46833, 40750, 48095, 31064, 23536, 9075, 8065, 21562, 59197, 33731, 19485, -9495, 16609, 50586, 48436, 62041, 93299, 75433, 131773, 146063, 104880, 44622, 53172, 64029, 67041, 104843, 113601, -7733, -58081, 27011, 62827, 85946, 102315, 99534, 77290, 55290, 74341]
22290G4341N6793K9463j9837m3759o3347K8536j835j1882k1502J7999P7790J8610
22278A41370r803j4022m743l207m6521p9266M5726M848l6746m482P8795j742q323
22265F1884N7230L6945M6767N019p487n2383m8001k0596l0714l3984o687N1853
22253E9846J7938K0894j8372l1274m2888M0666N4633p356l4488l5889K9234P200
22241F0144m0964j42K9167Q330Q967J8041K1111J2739j7290K7029j7156j2397
22229I7579K3659l0427J9741j2628L7517K2124K6422J8999l9315L64K4285n0154
22217A38166q7634l2278K3543J7762J5295L3559j5811K7129k616m691k0154m8538
22205D3732q519K1511m219L1464k7047k6231L2402p967m917j2939L2174M5127
$$ y = [74341, 131134, 160597, 140760, 97001, 33654, 62190, 60355, 48473, 26971, 44970, 122760, 141370, 131567, 117545, 112802, 109595, 63074, -16192, 29534, 34382, -2364, -6846, 71949, 70207, 61884, 119114, 156059, 202826, 207845, 200358, 147975, 99974, 79378, 48664, 14680, 7993, 59846, 77784, 98678, 80306, 49032, 6144, 46810, 101443, 94087, 59599, 23710, 52944, 60144, 19180, 19038, 48205, 56535, 65502, 83543, 104654, 117393, 100103, 127132, 109976, 97579, 121238, 90811, 110552, 97924, 135441, 157565, 183987, 202986, 163671, 164035, 188320, 138166, 50532, 18254, 41797, 59559, 74854, 108413, 92602, 119731, 117115, 112424, 92270, 43732, 35213, 56724, 52505, 83969, 56922, 30691, 63093, 55126, 50209, 37270, 69444, 114571]
22193A14571J746J429j1911N309o465J6075m0073j7710l6430O8225Q0159J8342
22181A93267n5980m9159L7115L173j2383j4575k5809j1968j4217L2925M5483p2992
22169E4880l3963J5260J902m208J7508L6115o273n986o813j7659m8122j809M244
22156E076P186J4269J2353K6326J4130p244l3210O4228J7553p0838K0412O4656
22144A34897k3091m2042n1701l1748J558K9976K5565k5380N0482L4548k6447j6387
22132F0230J8608M4020J168j2823q578L0870j9021p9274m7246J907M8074M1251
22120G9186K2765O0666J7693p151m2529J6621k3548k6806P908L552k5839J5592
22108I8110n7179l8556O0281P164J6948l2685l5090N1319n2P485k0690M6432n86
$$ y = [114571, 116317, 117746, 105835, 111144, 104679, 120754, 80681, 62971, 26541, 94766, 174925, 193267, 137287, 88128, 125243, 128416, 116033, 101458, 75649, 63681, 49464, 82389, 127872, 54880, 20917, 36177, 38079, 33871, 51379, 87494, 81221, 75235, 68422, 50763, 2641, 832, 5076, 12262, 26531, 38884, 65210, 79340, 72096, 38886, 103114, 120667, 49829, 70241, 134897, 111806, 69764, 18063, -13685, -12127, 17849, 43414, 18034, 68516, 103064, 76617, 60230, 78838, 122858, 124026, 111203, 102625, 133495, 114474, 35200, -12046, -10139, 37935, 79186, 101951, 162617, 180310, 173159, 130630, 147251, 123703, 96897, 104805, 108357, 82518, 98110, 40931, 2375, 62656, 69820, 86768, 54083, 18993, 70312, 70260, 77745, 57055, 103487, 102901]
22095A02901k2453j4653j9312J6803k4186R674j7539K0746J6411J9661m2776n4645
22083i368K9910M335O0193K4076L81J6427j7317m934o078K4765l6160R154j4379
22070H1005j0007q98J4084J5962p1404k4432N8754K6050L4451J751l9816R261
22058I4761K2114l4910j5200j8729n543J8170k6089j3933m808N943K6737j0488
22046C8025m4963L0049R925J272O5358l7529m4481l9366N9145J8380l0197k094
22034B3524M9054J3924L7188N7155O3372j5524m6674j0870J7452j7018J4349l6666
22022A49266N2944L9108o308n4093N764l2538k9716J9141K613M6786J3411j9420
22010A86958P843l370j4465n7959p0324R841p087n081K4490l2232j0450M7729
$$ y = [102901, 80448, 65795, 46483, 63286, 39100, 48774, 31235, 51981, 68392, 88053, 45277, -9368, 20542, 24877, 85070, 109146, 109527, 125954, 108637, 103703, 97625, 122390, 86230, 95384, 81005, 70998, 70100, 84184, 100146, 28742, 4310, 63064, 89114, 123565, 125316, 85500, 94761, 116875, 81965, 66765, 48036, 42493, 60663, 34574, 20641, 15833, 21776, 48513, 38025, -6938, 23111, 33036, 34308, 99666, 62137, 17656, -21710, 37435, 55815, 25618, 23524, 72578, 86502, 123690, 180845, 244217, 228693, 182019, 171149, 188601, 171583, 185932, 149266, 202210, 241318, 235010, 180917, 186681, 154143, 124427, 143568, 146181, 192967, 206378, 186958, 194801, 191431, 176966, 119007, 48683, 58524, 51437, 46356, 70846, 38614, 28164, 75893]
21998G5893n21J3624K7440m575N3167N338J1181J33o0184k9444N1967R443k5378
21985A28084r189P0113p3262o7205J5299L3251J023L9943N0581n8895q276J9185
21973A40652P051j6630L0175j1348l2162n775M6855N1630J1446m2730q6620k4243
21961F8301M1930m124j8830J5744N3963M0910M056n095p1653p2930L157k0289
21949C5140J7229L9639K6808J2493L1751J5919k2824K1927j7130p4519R989L0199
21937A26621Q3337K8261l7990l2692l7187k845L3638K0989k1552k9736P019J7914
21925A55777m4590r616K6379j6211J8877K4289j6277m7678k0862N0376Q715n4368
21913G4811L054L036j060O0655j030k8003K9176n738j1236J6232O743L8684m1036
$$ y = [75893, 75372, 88996, 116436, 111861, 165028, 170366, 181547, 181680, 121496, 92052, 144019, 153462, 128084, 118895, 189008, 115746, 48541, 63840, 97091, 98114, 138057, 188638, 129743, 121467, 140652, 147703, 131073, 161248, 149900, 117738, 111963, 158818, 210448, 221894, 179164, 92544, 68301, 110231, 106107, 87277, 103021, 156984, 197894, 201950, 196855, 125202, 52272, 55429, 35140, 52369, 92008, 118816, 131309, 163060, 178979, 156155, 178082, 160952, 86433, 96422, 126621, 209958, 238219, 200229, 167537, 130350, 127505, 161143, 182132, 160580, 130844, 137863, 155777, 111187, 101571, 127950, 111739, 130616, 154905, 138628, 90950, 70088, 120464, 129179, 74811, 77865, 80901, 79841, 140496, 139466, 111463, 140639, 134901, 123665, 139897, 146640, 185324, 144288]
21900A44288k4987J3034K931O0006k2123k6203L9986m9121l8139k2261K089O1642
21888A41142n604l8132P983L5812L6457P0021m201o4147m5545N5243l5453k8149
21876A25427K3229m351p963j8768J0523J0510J4442o3795O054J158P239k230L171
21863A04646m5209l0115K0435j0418K301J1141J04601M9252k0489j0357m2314
21852A33474j5979j8551k3130J302k7512m620L8946L4452l1028l8408l5735l2141
21840a8930L4751k203l2892N2319L9275M9916M3694k3858O321J5709J1142K2680
21828A97924k2473n9617k2597Q7034J632k9740k0726k2283J282p603L190J1117
21816A17140J428K0903j7921m4612N6569O0410p050j6187K4909J8630l1717n0185
$$ y = [144288, 119301, 132335, 135266, 195272, 173149, 146946, 186932, 137811, 99672, 77411, 79500, 141142, 135538, 97406, 105389, 141201, 177658, 247679, 243478, 179331, 133786, 189029, 153576, 125427, 148656, 144305, 136342, 117574, 128097, 138607, 153049, 89254, 95308, 96466, 103705, 101475, 104646, 59437, 29322, 49757, 39339, 41640, 52781, 157382, 206634, 186145, 175788, 133474, 117495, 98944, 75814, 77116, 49604, 44984, 83930, 118382, 87354, 48946, 13211, -18930, 15821, 13618, -19274, 33045, 72320, 122236, 165930, 142072, 148393, 164102, 175244, 197924, 175451, 115834, 93237, 180271, 181903, 152163, 131437, 109154, 110436, 102833, 106023, 117140, 118568, 139471, 121550, 76938, 133507, 193917, 186867, 170680, 195589, 214219, 182502, 132317]
21804A32317l8762J9310j6681k7946o600K1980K2657Q090L8335N3993l4042l1317
21792A41334L0482J5236J7104k1376l362j3356n6799M3133L0547j6305n9093j1090
21780I6455j6897J650M6433N0730R54l0915n0336M453R519q643l0088N5179K347
21767A30841r814J8554q753P480j814k3519l3949K2451J1174k4973M73R2652q368
21754A72435l7926j5795J941m8496n1469M4182N3216p186L5714J7518M447n473
21742A63108K6938L0347q999r007L2260l1866j0886n3169p1418J4871J4741m6660
21730E0260j698M6857M0008k334N9427K1341M8354J9646n2715k0897J9507J7504
21718B45260j4934Q366m3795p865l7931j9694K6393p38k2166J5035K4039m3326
$$ y = [132317, 93555, 112865, 96184, 68238, 61638, 83618, 106275, 114365, 152700, 206693, 172651, 141334, 171816, 187052, 204156, 182780, 179418, 166062, 109263, 152396, 182943, 166638, 107545, 96455, 79558, 81208, 127641, 178371, 179325, 148410, 98074, 102527, 112046, 103403, 73315, 128494, 130841, 121027, 139581, 130828, 138308, 136494, 112975, 79026, 101477, 112651, 87678, 88151, 180803, 172435, 134509, 118714, 120655, 72159, 20690, 64872, 118088, 110902, 146616, 164134, 168581, 163108, 190046, 220393, 211394, 202387, 234647, 202781, 191895, 138726, 67308, 82179, 96920, 50260, 48562, 95419, 135427, 133093, 192520, 213861, 262215, 281861, 229146, 208249, 227756, 245260, 230326, 238692, 194897, 187032, 149101, 129407, 155800, 155062, 132896, 147931, 171970, 128644]
21706A28644P616K6163k6606J9754K4250J3155N4372k7022l3451k9509N0353m5678
21694A62041j1374k5139k3483K017M0791M6858k424j7705J7597j5031j4880q326
21682A50942l073K5231l58K1142j0645n9875k4144J4518j8957r296K1320R770
21670A16575L3523N9306l1246m7581L946j7764J3489O403j1862m7279l4432J4818
21658E7896o530J4790K8590O0419P489l1213k2737O191j4671q224J8880K3254
21646A34134m8668J7983J7025Q414l442P2598O7262j4489n4954j15190m0996K3344
21634F3021M2594O1049J1805o4546J8192K7364o71j7039N9406L3652j3317n13
21622B20997N7520J410k2831j1996J0604J5440N269n2469M530k9924p7536l3484
$$ y = [128644, 136260, 162423, 135817, 155571, 179821, 192976, 247348, 220326, 186875, 157366, 207719, 162041, 150667, 125528, 102045, 104062, 144853, 191711, 189287, 171582, 189179, 174148, 159268, 150942, 147869, 173100, 172742, 193884, 183239, 123364, 99220, 113738, 94781, 85485, 106805, 116575, 150098, 209404, 178158, 130577, 134523, 116759, 130248, 136651, 124789, 77510, 43078, 57896, 51366, 66156, 94746, 155165, 162654, 131441, 108704, 114895, 100224, 92000, 110880, 134134, 85466, 103449, 120474, 128888, 125446, 198044, 265306, 250817, 195863, 80673, 39677, 63021, 105615, 166664, 178469, 113923, 132115, 159479, 158808, 141769, 201175, 234827, 221510, 220997, 278517, 279927, 257096, 245100, 255704, 271144, 276413, 223944, 228474, 198550, 121014, 87530]
21610H7530K5411K4757L8193L6519L2232n3620J796N8500o757q0544j5614J1275
21598A59678J00535n992K5474l8190m3319L4841J4390j839L175k8838J0819j1220
21586B19514m440K3216J1205J5055L4538K3077p7641q3170l0241k8897N4170O9552
21574B25938M9332j7941j0806P116K4982R106j0262L505L6246J4587J2917m3760
21562C00960k3286J2328k3304l9670l3721j8926k8013P059M3833P247K3595O0614
21550B88716L8256j7660O4379K0638j7843L5390j2254o6279n1554J2993J4740
21539C09522O560L5427j8701K621o672j5043m6745m3986K400L1783L0929j8639
21527B69456j8769j3720N301J0381J6172j3678o86K0591k7821J7877N5722L6905
$$ y = [87530, 112941, 137698, 175891, 212410, 244642, 191022, 192818, 251318, 244561, 164017, 148403, 159678, 260213, 254221, 279695, 241505, 198186, 233027, 247417, 245578, 248753, 219915, 230734, 219514, 215074, 238290, 249495, 264550, 299088, 322165, 244524, 161354, 131113, 102216, 156386, 225938, 275270, 257329, 246523, 253639, 278621, 287727, 277465, 280970, 317216, 331803, 344720, 300960, 277674, 290002, 266698, 227028, 193307, 174381, 146368, 153427, 197260, 204507, 228102, 288716, 326972, 309312, 373691, 394329, 376486, 411876, 399622, 333343, 281789, 294782, 309522, 316082, 351509, 332808, 335429, 328757, 313714, 266969, 222983, 225383, 257166, 288095, 269456, 250687, 236967, 242268, 252649, 268821, 255143, 254457, 275048, 247227, 265104, 320826, 357731]
21515C57731k5186r671J2567K3735k2334K9374J7615j0799k4910J0337K2402K1252
21503D02113J9942j5093l8827q966R753O725m3287O526l8102l5752n621k3427
21491B35984M5813N1222L9506m0407J860J3947j9224m816L2977L7762k2608L891
21479C75907m5977n976k737j7637k8093j1121K3780L7505r110o1261j1455Q6957
21467C30782Q2371k1092k2006r704l3017K048J5182j4180O3425N0580J9637J4726
21455D78752R489P5142M1874q912K1025Q3228J90256J99533K09872K39711K13203
21444A753173J51771m7845j80710k10144j33551l6272K3801J16965J35968J65797
21434A738953J81448O2161o5068k81405k36416j89058r1082o8622p6086o016L1285
$$ y = [357731, 332545, 322874, 335441, 359176, 336842, 366216, 383831, 373032, 348122, 358459, 380861, 402113, 422055, 406962, 368135, 359169, 368922, 375647, 332360, 338886, 300784, 265032, 259411, 235984, 281797, 333019, 372525, 332118, 333978, 347925, 328701, 323885, 356862, 394624, 372016, 375907, 329930, 323954, 321217, 303580, 275487, 264366, 288146, 325651, 316541, 255280, 243825, 330782, 413153, 392061, 370055, 360351, 327334, 329382, 344564, 330384, 393809, 444389, 464026, 478752, 488241, 563383, 605257, 596345, 617370, 700598, 890854, 1090387, 1300259, 1539970, 1753173, 1904944, 1857099, 1676389, 1466245, 1332694, 1296422, 1320223, 1437188, 1573156, 1738953, 1920401, 1982562, 1917494, 1636089, 1399673, 1210615, 1119533, 1050911, 974825, 968809, 1000094]
21423A000094Q2829J29605J52223J90248K77436K02285M2919o1986k03656k57354
21413A554643j05373p7063J272Q6335J74514K17868J61651k2499j60556k43725
21403A587067k96429k02335r9283q9760m0041q2352m6604o0882m975O962j1809
21392F59559l3599P959k723k4804j2729J5179k4498j5380L1470l8979k7322N7327
21380E91460n712M6050M4943k4187n6746n1471l9057m4757M391P547L5834k3129
21368D85166K2537P1621L972n9037o6255m4267o6686m184M3248L3396J9245J2467
21356D51223j7475K2894N6800j2957l5432k6226K303m6083J4454k203M489j3429
21344C98358j492M4215L2759m3598r2146K4267R777P638l3839J0127j9179N0306
$$ y = [1000094, 1082923, 1212528, 1364751, 1554999, 1832435, 2034720, 2077639, 2015653, 1811997, 1554643, 1449270, 1372207, 1373479, 1459814, 1634328, 1852196, 2013847, 1991348, 1830792, 1587067, 1290638, 1088303, 989020, 899260, 859219, 776867, 730263, 669381, 664406, 671368, 659559, 625960, 633919, 631196, 606392, 593663, 608842, 584344, 568964, 600434, 561455, 534133, 591460, 585748, 631798, 676741, 652554, 595808, 544337, 505280, 460523, 464914, 472461, 508295, 485166, 507703, 579324, 583296, 524259, 458004, 413737, 347051, 342867, 386115, 419511, 438756, 451223, 433748, 456642, 513442, 500485, 465053, 438827, 441130, 395047, 409501, 407298, 411787, 398358, 396866, 441081, 473840, 430242, 338096, 362363, 372140, 379778, 345939, 356066, 336887, 387193]
21332C87193O7315M0606J1376k327M717l6478k5762k69k7447J856K122J9921J4229
21319D57052l1889k2184J1457k443K6388q447l2319K0636l0670n4030n2716P7489
21307C58324J32644L2852k3255K9679k7720m808N7908k2094n68n8252n5916p704
21295D11090j7257k6611P1668M3817j0849o3812J8860L0157L7290o3446J0917
21284D41824O2996N014l4947m8003l94N1762k0366o6297K0385O7692k5044n3995
21272D00627K5557P9136j7163k2252q06P205k5810N2447k9434K2291K3017N926
21260E20741K5890K9018o683j1279o0086m5862k1335l8709p835N247L0115N2690
21248D71912J647n036k2883j6965j577K2477k5601j0830j0647j007P0077m153
$$ y = [387193, 454508, 495114, 506490, 504163, 508880, 472402, 446640, 446371, 418924, 420780, 422902, 442823, 457052, 425163, 402979, 414436, 411993, 438381, 429934, 397615, 418251, 387581, 333551, 280835, 358324, 490968, 523820, 500565, 530244, 502524, 497716, 555624, 533530, 532962, 474710, 418794, 411090, 393833, 367222, 438890, 482707, 471858, 408046, 426906, 457063, 494353, 430907, 441824, 504820, 509834, 474887, 426884, 426490, 478252, 457886, 391589, 411974, 479666, 454622, 400627, 426184, 505320, 488157, 465905, 465099, 472304, 446494, 498941, 469507, 491798, 514815, 520741, 546631, 575649, 568966, 557687, 497601, 451739, 430404, 391695, 383860, 389107, 419222, 471912, 473559, 468523, 445640, 428675, 427098, 449575, 423974, 413144, 402497, 401490, 471567, 467414]
21236D67414k5170P192j6288L6553P1191p5797j0104P5470j9884n044l6141j4699
21224D54693k0576J8213L8039j9165J3306q840M3724j7418l0537j6307k8370M2822
21212D69584N5740k9260k4430j1988J2118J9297j4296Q12j8928J5146M1986L3552
21200E49333K687m695M1845j2160M071j2480j12842k2473P1387L2647M4186J3539
21188E95045o6886n4503L9725O740k2281N100J4134j7901M34J4610L2309k1727
21176E24799k360l4778k1524J7161K5851l0979r144k5391R535O9649P0662L582
21164E97063K4278o363m3841l1272L5496M1266L1658J0995K5436J3116m4125r924
21152F43783n3069r370K681j1597L8486O417j730r133L2810K3213J796J9222k2218
$$ y = [467414, 442244, 449436, 433148, 469701, 540892, 465095, 454991, 530461, 510577, 505533, 469392, 454693, 434117, 452330, 490369, 471204, 484510, 475670, 519394, 501976, 471439, 455132, 426762, 469584, 525324, 496064, 471634, 459646, 471764, 491061, 476765, 477577, 458649, 473795, 515781, 549333, 552020, 547325, 589170, 577010, 581081, 568601, 455759, 433286, 504673, 537320, 581506, 595045, 528159, 473656, 513381, 520121, 497840, 502940, 517074, 499173, 499607, 514217, 546526, 524799, 522439, 487661, 466137, 483298, 509149, 478170, 469026, 443635, 453170, 522819, 593481, 597063, 621341, 614978, 571137, 539865, 575361, 616627, 648285, 659280, 684716, 697832, 653707, 643783, 590714, 581344, 584025, 572428, 610914, 617331, 615601, 606468, 639278, 662491, 664287, 683509, 661291]
21139F61291j3502J4701l7153Q4970J40249j29J3221O5686K8679P48K3334l2692
21127I49403l3746l1750M2299M508L308p968k1378k4502r266J1235p42J725K0360
21114I03486L4209l3493k5811O3784M9912M847J43L4144R634J7455N0538m6401
21102A062447m6374J8507K953j0900N6297L0014L2412m6575l3296M4599P4610
21091A184694k9025l8864m0579m6004l9720J0435p46r335k5583j0137O315l1714
21079I29737p9506n4844K6823J3018k2757K7711M5870q177L066l3764p1830m1305
21067G34042J0676k9610l1643K0510M287M2577O3532M7312m3983n9724M371O8402
21055H30749Q5551j6368n6179K4161j8212M701O34j5740k2490L3156M0404j3862
$$ y = [661291, 647789, 662490, 625337, 710307, 850556, 850427, 863648, 929334, 958013, 958761, 982095, 949403, 915657, 883907, 926206, 930714, 934022, 926054, 904676, 880174, 870908, 882143, 881401, 883126, 903486, 937695, 904202, 878391, 942175, 992087, 996934, 997077, 1031221, 1040855, 1058310, 1108848, 1062447, 1016073, 1034580, 1037533, 1026633, 1082930, 1112944, 1145356, 1098781, 1065485, 1110084, 1184694, 1155669, 1116805, 1076226, 1030222, 990502, 1000937, 1000191, 990856, 965273, 955136, 961451, 929737, 850231, 795387, 822210, 835228, 812471, 840182, 886052, 877875, 880941, 847177, 775347, 734042, 744718, 715108, 683465, 703975, 708262, 750839, 814371, 861683, 817700, 757976, 762347, 830749, 916300, 899932, 843753, 867914, 849702, 854403, 855037, 839297, 816807, 849963, 890367, 876505]
21043H76505o6739m4697k0448J1680M5106k2576j07076o4787J9188J76103J34133
21032I36392j316l5884J1950J5880r3881m8662O036K2665M8236J12563J12643
21021A086622J03391N0549K5620N1040j4706k2613K4095J8094K1029J9039K6901
21010A389061O2393J17137J61790K66016L12492J64233O7966r9599j59428r3480
21000B188581J7217M4966J10934J91438K99845K97567J15025j037j57769j59500
20990B947267q6239k9349m170o3722M5122N0976P0364J42784J43871J68372J83498
20979C568774K08414J27307K0987j67695j39337j8634O4624J2532J33677J83091
20969C993740J73377K27716J44571o4043j54775r5555n6128j65033j07709k3855
$$ y = [876505, 809766, 765069, 744621, 756301, 801407, 778831, 671755, 606968, 626156, 802259, 936392, 935076, 899192, 911142, 927022, 833141, 784479, 790515, 813180, 861416, 973979, 1086622, 1190013, 1240562, 1266182, 1317222, 1302516, 1279903, 1303998, 1322092, 1343121, 1362160, 1389061, 1451454, 1568591, 1730381, 1996397, 2308889, 2473122, 2541088, 2441489, 2282061, 2188581, 2205798, 2250764, 2361698, 2553136, 2852981, 3150548, 3265573, 3264536, 3106767, 2947267, 2861028, 2831679, 2827509, 2763787, 2808909, 2859885, 2930249, 3073033, 3216904, 3385276, 3568774, 3777188, 3904495, 3925482, 3757787, 3618450, 3599816, 3664440, 3676972, 3810649, 3993740, 4167117, 4394833, 4539404, 4475361, 4320586, 4225031, 4168903, 4003870, 3896161, 3872306]
20959C872306O557N6015P7210l6110r0967q0202N6260O3263M9872K1851K2210
20948D018265p847J9334L1259K953j6222N8567M4617M5571K9689P5089J29617
20937D430892J43294J49187J59124P4722J5294R8275M7922J2303L5167P2394P1834
20926E310408J38366J55405K26052K87932M26686M09612M38016M21639K88505
20917H102621K01760R1201J0720P3870J02820K27538L65509N45773P73213Q88444
20907A1383469Q40080M81876J63841j4189M6848J65947L50325O30199Q69305J071184
20897A5988885J143208J138709J169879J331914J649944K070300K519995L120909
20889C0133743M075932N266223P019712R826427J4251765K1212484L0906253M1528496
$$ y = [3872306, 3878863, 3934878, 4012088, 3975978, 3885011, 3804809, 3861069, 3924332, 3974204, 3996055, 4018265, 4010418, 4029752, 4061011, 4063964, 4047742, 4106309, 4150926, 4196497, 4226186, 4301275, 4430892, 4574186, 4723373, 4882497, 4957219, 4972513, 5070788, 5118710, 5131013, 5166180, 5238574, 5310408, 5448774, 5604179, 5830231, 6118163, 6544849, 6954461, 7392477, 7814116, 8102621, 8304381, 8395582, 8406302, 8480172, 8582992, 8810530, 9176039, 9721812, 10495025, 11383469, 12223549, 12705425, 12869266, 12855077, 12901925, 13067872, 13418197, 14048396, 14917701, 15988885, 17132093, 18270802, 19440681, 20772595, 22422539, 24492839, 27012834, 30133743, 34209675, 39475898, 46495610, 56322037, 70573802, 91786286, 122692539, 164221035]
20881A64221035M8599944M7105013L0615374q5267k9245042m3242203l6107564
20874A81861290j7559499J321344J8346249L2875055M1498186L9859889K1669337
20867C19871851j0529919l9767603n2956682m5624095k9715281j6912997q470023
20860A15895251k320580L221128R813288J8492014K9562202M0723760M7248231
20853B62635294M4045469K4561731p707107l5655882m6462146l6036691j6536072
20846A88844596K344157J9354803L3528351M0922908L6666092J5160793j8250227
20839C18571473m6263934n6636805m7340497l2211456k1071752j4277296j0125422
20832I0644311p533438n743870m579576l908814l490406l108405k701872k301939
$$ y = [164221035, 212820979, 259925992, 290541366, 290456099, 261211057, 217968854, 181861290, 164301791, 165623135, 183969384, 216844439, 258342625, 298202514, 319871851, 309341932, 269574329, 216617647, 170993552, 141278271, 124365274, 115895251, 113574671, 116795799, 126609087, 145101101, 174663303, 215387063, 262635294, 306680763, 331242494, 323535387, 287879505, 241417359, 205380668, 188844596, 191188753, 210543556, 244071907, 284994815, 321660907, 336821700, 318571473, 272307539, 215670734, 168330237, 136118781, 115047029, 100769733, 90644311, 83110873, 77367003, 72787427, 68878613, 65388207, 62279802, 59577930, 57275991]
20824E7275991k062896j971710k090430k125551k059002j759588j530754j244596
20816D2431464r25956p54780p25316p89726r99500j240893j369017j317143j132639
20807C3176494r32844p51183p01386n82655n76641p78383j020575j011609r05223
20798B5915995q99611p25902o58797o37853o09190o12524m76965l99643l63410
20789B0532100l25984j57270l3028N4408L1955j84118m75318p15424p72208o69153
20779A7285960n48370l83773l43668k50334k07091k0163J58855K32186J68823
20770A6092425k0100l47372o34523p79739q16461o22255m62598l97728k72984
20761A1738665k16077k62133j98213j02198q7242j2535L4286K7378o3054j69070
$$ y = [57275991, 55213095, 53241385, 51150955, 49025404, 46966402, 45206814, 43676060, 42431464, 41505508, 40750728, 40025412, 39235686, 38236186, 36995293, 35626276, 34309133, 33176494, 32243650, 31492467, 30791081, 30208426, 29631785, 28853402, 27832827, 26821218, 25915995, 25016384, 24290482, 23631685, 22993832, 22384642, 21772118, 21295153, 20895510, 20532100, 20206116, 20048846, 20015818, 20070226, 20102181, 19918063, 19442745, 18727321, 17955113, 17285960, 16737590, 16353817, 16010149, 15759815, 15552724, 15532561, 15691416, 15923602, 16092425, 16072325, 15724953, 15090430, 14310691, 13494230, 12871975, 12409377, 12011649, 11738665, 11522588, 11260455, 11062242, 10960044, 10872802, 10860267, 10894553, 10921931, 10858877, 10689807]
20751A0689807k11672k14295l25736k44655j18823j06933o318P2689M8683J6358
20741I599105j0096j96503l02271l77359l47906k52135j39552j34662p3015l549
20731G762057O27J14304J48452J34151L1931k364n3620j29460k13330j84445j07494
20720G500809n4497l6997J904J8467K9135L4013r0762j69449j74151k87699k43158
20709F527615j68601j44987j74846j91486j30147j23228j09916j08930j58051
20700E217423j66538r1907L0848N0978J9815O48o1920j41567j46777j98140j25323
20689D387540q8256m5442j6098l0749j9985o1440q3965J5637p9280j80279r9256
20678C698427j70664j30002j22145m0284m1047l0416p8993j31245l0307k8874
$$ y = [10689807, 10478135, 10263840, 9938104, 9693449, 9574626, 9467693, 9461375, 9534064, 9582747, 9599105, 9589009, 9392506, 9090235, 8712876, 8364970, 8112835, 7973283, 7838621, 7765606, 7762057, 7762684, 7876988, 8025440, 8159591, 8191522, 8189158, 8135538, 8006078, 7792748, 7608303, 7500809, 7446312, 7409315, 7411219, 7429686, 7458821, 7492834, 7402072, 7232623, 7058472, 6770773, 6527615, 6359014, 6214027, 6039181, 5847695, 5717548, 5594320, 5484404, 5375474, 5217423, 5050885, 4958978, 4989826, 5040804, 5060619, 5061267, 4999347, 4857780, 4711003, 4512863, 4387540, 4299284, 4253842, 4237744, 4206995, 4187010, 4125570, 4041605, 4057242, 3977962, 3797683, 3698427, 3527763, 3397761, 3275616, 3235332, 3194285, 3163869, 3084876, 2953631, 2923324, 2894450]
20668B894450r515l8123l7178m510j0612p3902m5102m1068j57381J03M7454j9552
20656B505064n288k2006l4534m0543n7187p0950n0146m4755m9130n5114l222m1246
20644B030943j0057j0947q037m4593p5154n2918r1530o5365n8675M621J118m4849
20632A574557K963l2725k8992j0818m9992j1124m2479p0069j389k7871p6309l5825
20620A189927j8387n9773o1925R448J3220l7893r482J877j2554M3469q743n4009
20608I95175k9184m5724k1529n2504l8563j7838L79K469o1426J8633j1719o7600
20596F70569k4405M7558P7290m9861l5591j0012k7864m0141m399n1677l7394R051
20584E23124l8927j5704J8641m0788k7448J748J3126j6421j7786R135l9218K940
$$ y = [2894450, 2884935, 2846812, 2809634, 2805124, 2794512, 2720610, 2675508, 2634440, 2477059, 2477162, 2524616, 2505064, 2499776, 2477770, 2443236, 2402693, 2345506, 2274556, 2224410, 2179655, 2130525, 2075411, 2072189, 2030943, 2020886, 2009939, 2001902, 1957309, 1882155, 1829237, 1737707, 1672342, 1613667, 1618288, 1619406, 1574557, 1577520, 1544795, 1515803, 1504985, 1454993, 1443869, 1401390, 1331321, 1329932, 1302061, 1225752, 1189927, 1171540, 1111767, 1049842, 1059290, 1072510, 1034617, 1025135, 1027012, 1014458, 1057927, 1049184, 995175, 965991, 920267, 898738, 846234, 807671, 789833, 790212, 792681, 731255, 749888, 738169, 670569, 646164, 693722, 771012, 721151, 685560, 675548, 647684, 607543, 603144, 551467, 514073, 523124, 484197, 468493, 487134, 446346, 418898, 420646, 433772, 417351, 399565, 408700, 369482, 372422]
20572C72422K0119Q505k4083J639J3392M5419r6296p3756j896K607K5345N2980
20560C46397p778l447n7893j2826l1855j2604m853n496m981k073M3806l0842j2248
20547B03307L0323K8472R057j3406o6012k9777l837J7803K253j0897K9230j2006
20535A84510o8186m5096K7095L1761J7343O1802J3931m6603l0236o0974n7729
20524B7618J537k4592N0185k972L2717o7664j1504L8500J8144j4489j4993p312
20512B5175m0067L8104j5344p9603Q2016R7706m9757p3132o4120j4783K743j2457
20500a03519J9682M8262J8753J5666M1991K6187l9432N917n233n6418j1792L90
20488c9546J6378K194j1028n545K4191k9187r7297l4707M6597R279K3043N0547
$$ y = [372422, 392541, 401046, 376963, 378602, 391994, 437413, 341117, 267361, 265465, 268072, 293417, 346397, 338619, 335172, 277279, 264453, 232598, 219994, 215141, 209645, 204664, 202591, 246397, 215555, 203307, 233630, 262102, 271159, 257753, 191741, 161964, 158127, 175930, 178183, 167286, 196516, 184510, 116324, 71228, 98323, 130084, 147427, 209229, 223160, 176557, 146321, 85347, 27618, 29155, 4563, 54748, 51776, 84493, 16829, 5325, 43825, 61969, 47480, 32487, 25175, -14892, 23212, 7868, -71735, 10281, 107987, 58230, -14902, -79022, -93805, -91062, -103519, -83837, -35575, -16822, -1156, 40835, 67022, 27590, 33507, 28274, -28144, -39936, -39546, -23168, -20974, -32002, -37547, -13356, -42543, -139840, -174547, -127950, -118671, -95628, -45081]
20476d5081q448l4030J6319l7026m1038J8225j283L806K1592K391P825N1048P306
20463c8394l0564j16k2809K0152k0625J2524N9264N8324m8790k3238O785j0175
20451c7662P138K0840N557m190l1600m3320J1700J5374J6970k1926l7814j0753
20439a09686N2426J5096K0661k7441L905N5212j8157l4654m9889l8819j490K5838
20427a06998m1049n613L5188o0236P331K5363N9258L8517K2057N019l0234l5142
20415h6539m665N061N4995n284o5764n8451j4608M4147N7634Q769k3129j8480
20403a06314r973k2770J2120P3096M0193m1985K201K4522m8197J4788N2108K6034
20391A5823l4991l8855o594P0479q151J1890P905l5600J2384l3675J1504P6668
$$ y = [-45081, -53529, -87559, -71240, -108266, -149304, -131079, -132362, -128556, -106964, -104573, -96748, -45700, -38394, -68958, -69074, -91883, -71731, -92356, -79832, -20568, 37756, -11034, -34272, -27487, -37662, -30524, -9684, -4127, -8317, -39917, -83237, -71537, -56163, -39193, -61119, -98933, -109686, -57260, -42164, -21503, -48944, -45039, 10173, -7984, -42638, -92527, -131346, -132836, -106998, -148047, -153660, -118472, -178708, -171377, -146014, -86756, -48239, -26182, -21163, -51397, -86539, -91204, -86143, -31148, -36432, -102196, -160647, -175255, -131108, -73474, -64705, -87834, -106314, -116287, -139057, -126937, -53841, -13648, -55633, -53432, -28910, -77107, -62319, -10211, 15823, -19168, -58023, -64617, 5862, -2289, 9601, 17506, -18094, -5710, -39385, -27881, 48787]
20379D8787O6007L986l869j6382j3103N7797M2626j0931r810K1720l4223m8666
20367A03939j0158K6883M2639N876p3246r9867o1909l4210L4676L0900M7324J2812
20355B5659k9121J3506l765k214m5908l3568j1501k9392K5370K7712J8821m810
20343d9211k1292j5302j3154N9085l7009N1482K1668P85Q30L9136K4151L0434
20331I1603n5830l7778o580K2124J1936N0517R67m677L1332J9269L3357P0254
20319B26494J2678O781m0623n111N2049O7166N5733R1982J17586J11333K64724
20308I60792K36018K50474J16051o2702j18814j58146k03387r1600P1441J79519
20298A179646K35796J80879J10062L7306j52884k45518k59852j94711j27195p7108
$$ y = [48787, 114794, 118780, 114911, 98529, 85426, 143223, 185849, 174918, 165108, 186828, 152605, 103939, 93781, 120664, 163303, 169179, 95933, -3934, -65843, -100053, -65377, -34477, 12847, 25659, -3462, 10044, 6279, 4065, -41843, -75411, -86912, -116304, -90934, -63222, -44401, -49211, -70503, -85805, -98959, -39874, -76883, -25401, -3733, -2948, -2118, 37018, 61169, 91603, 35773, -2005, -8585, 13539, 25475, 75992, 76959, 72282, 103614, 122883, 156240, 226494, 239172, 245953, 205330, 200219, 252268, 319434, 375167, 467149, 584735, 696068, 960792, 1196810, 1447284, 1563335, 1500633, 1381819, 1223673, 1020286, 928686, 1000127, 1179646, 1415442, 1596321, 1706383, 1743689, 1590805, 1345287, 1085435, 890724, 763529, 686421]
20288F86421j7188P883J6131O453J22250J69506K07672K68631J94444Q2037j08281
20277A635959j84476k70659j44662q63L2454O8022K02905K08690J63927J9537
20267A730834j08846k38564k56149k00702j49243j59361p6870m4447l5724m9456
20257D11472p3228P807K9075N120M1699l6103n7650j6080K444j0898k8915Q431
20245B83174J7669J5614K3717j6110n3131n5229O575J1707n8782l2807O0182N0240
20233B52819k1795n4607q7987j01849l826N0620R1065N887k3009l0705J7512k665
20221I1460l6791p7310J9928N5285O0604K3713p5988n3125L1337P3157J6392l5613
20209I3049r1304n6962P621J5997K2178N710P303L5185P586p3800N4499J4101
$$ y = [686421, 669233, 677116, 693247, 699700, 821950, 991456, 1199128, 1467759, 1662203, 1744240, 1635959, 1451483, 1180824, 1036162, 1035299, 1067753, 1135775, 1338680, 1547370, 1711297, 1730834, 1621988, 1383424, 1127275, 926573, 777330, 617969, 541099, 496652, 460928, 411472, 338244, 346051, 375126, 380246, 421945, 385842, 328192, 312112, 314556, 303658, 274743, 283174, 300843, 316457, 340174, 324064, 270933, 215704, 222279, 233986, 175204, 142397, 202579, 252819, 231024, 176417, 88430, -13419, -17245, 33375, 124440, 130327, 107318, 76613, 94125, 91460, 54669, -22641, -2713, 52572, 113176, 136889, 60901, 7776, 39113, 112270, 128662, 93049, 1745, -55217, -47596, -31599, -9421, -3711, 3592, 38777, 46363, -27437, 27062, 41163]
20197D1163L2297k374l4921n8571l6783K4092O7781J7871m3683J62q699j377m4010
20184d7052J9321l5897J8922J1580J9776L8127k8061m559L656J6197M8861J9765
20172H0636o508j6427o52q677J9388L1183K456n5599l5630k0029M171j3116k9302
20159d8106m014M0075J8239l2007k1749K6504N3193M7401j2042l2768j4247l2330
20147a1851q687l7119k1813K5305k0453m3743l9769J8399L5404P2260K9246J609
20135a212K5965M234o2810n7083L6154q801m0345N2680M5306J0716q315j4764
20123a8275J0303j781k6965o7815O8585Q289J1497P4079J537K20L0886n7610l8959
20110f009l3610o7735j955L0694p938L3375O8991J037o5656J2008Q974j7759k8462
$$ y = [41163, 73460, 71086, 36165, -22406, -59189, -35097, 32684, 50555, 6872, 7034, -1665, -3042, -47052, -27731, -63628, -44706, -33126, -13350, 24777, -3284, -7843, -4187, 12010, 60871, 80636, 74128, 57701, 57049, 48372, 67760, 98943, 101399, 45800, 10170, -9859, -5688, -18804, -48106, -52120, -12045, 6194, -25813, -47562, -21058, 32135, 79536, 67494, 34726, 20479, -11851, -20538, -57657, -79470, -54165, -74618, -118361, -158130, -139731, -104327, -32067, -2821, -1212, 24753, 28987, -33823, -90906, -54752, -63553, -103898, -51218, -5912, 4804, -3511, -18275, -7972, -9753, -36718, -104533, -35948, -27659, -16162, 57917, 59454, 59674, 90560, 32950, -6009, -39619, -107354, -109309, -78615, -86553, -53178, 15813, 16850, -48806, -36798, -27824, -45583, -74045]
20097g4045k768K3175K6224R185K8144M1545K6464m605k4945J7073k2097J5560
20085E8910K5207j4835k8869j6449L2645J4581L1750Q545M2677m0311k1283M2027
20073A34595J15066J84528K10135K30846J87985N3756j58285k12765j60756j26847
20063D58258N4342P2952J46866J68266J64510Q3670j51080k48603k24947j37412
20053C86822m7550j3824l0299l27m46m9051l0697j5193J5708P450l2784m7792
20041A42017k0042j2934K3828O571P3331K771k3512k7565m8734m2479M2337L0794
20029A46383k898j5314J0804J1180k2596k6468L7964M322O0604R1596J06851J14343
20017E16771J63942J73640K30679J26441q6467k30235k30321j47225M646Q6761
$$ y = [-74045, -76813, -53638, -27414, -18229, 9915, 51460, 77924, 73319, 48374, 65447, 43350, 58910, 84117, 69282, 40413, 23964, 56609, 71190, 102940, 111485, 154162, 113851, 92568, 134595, 249661, 434189, 644324, 875170, 1063155, 1116911, 958626, 745861, 585105, 458258, 512600, 585552, 732418, 900684, 1065194, 1148864, 997784, 749181, 524234, 386822, 339272, 325448, 295149, 294822, 294376, 245325, 214628, 199435, 215143, 222593, 189809, 142017, 121975, 109041, 132869, 139440, 212771, 215542, 192030, 164465, 115731, 73252, 115589, 146383, 143485, 128171, 138975, 150155, 127559, 101091, 139055, 143377, 203981, 295577, 402428, 516771, 680713, 854353, 1085032, 1211473, 1125006, 894771, 664450, 517225, 521871, 608632]
20007F08632K39031K28233J91663O2457p7147l04221k90280j33807o2712j0507
19997D51342k913k3722j741j689K1396k3613k6765J3196Q4708J58336J82888L04836
19985A136259L09803J80072R7764n4385q3748j50916j75014j40682k2014J55431
19975A252570J55644J73546J88137Q4087j09409k21961k36280k35778j60404o4868
19965H25284j27905r6506o9333l4991l6687L0489r520n3835M7948K634j5773k3324
19953D38481n4540l4699l2947K1922j6906L262P2328J8454j134K9569K0588l4813
19941D29565l6425M0625N5391M9809R5975J46230J67588K71379K86118K60687
19931A766942J32443k4413q2988j43181k16114j55664o3323L7864J43040K25963
$$ y = [608632, 847663, 1075896, 1267559, 1330016, 1252869, 948648, 658368, 524561, 461849, 451342, 448429, 424707, 422966, 421277, 442673, 419060, 392295, 405491, 490199, 648535, 831423, 1136259, 1446062, 1626134, 1723898, 1669513, 1585765, 1434849, 1259835, 1119153, 1097139, 1252570, 1408214, 1581760, 1769897, 1853984, 1744575, 1522614, 1286334, 1050556, 890152, 825284, 697379, 600873, 531540, 496549, 459862, 490351, 480831, 426996, 474944, 477578, 461805, 438481, 383941, 349242, 316295, 338217, 321311, 324573, 396901, 415355, 414221, 443790, 464378, 429565, 393140, 433765, 489156, 538965, 634940, 781170, 948758, 1220137, 1506255, 1766942, 1899385, 1874972, 1791984, 1648803, 1432689, 1277025, 1213702, 1251566, 1394606, 1620569]
19921A620569K33587J16836n7886k01307k53002k95175k10753j58388p0662p29
19911G23090n9811r8724p8297k8861J9293M306k5451K1881K2014K0358K1662j3299
19899E28161n3323q474j3484l3868n3513J8707J09p8585k2669K6535m6717l2993
19887B29886Q812J7253J3524K0888j5317m1199K6948l3418k8158l3996M3852N038
19875B14113O0630K6921m4624j4353o2171m567M6888P556n8948J0880k1488l967
19863A56870N3663j877J2274k227o3332K2833J8620P45j3041N9854J3286J0760
19851B68428J3769L5541k6281k0375M2187J699p298l8687j8410O727J8066K81
19839B75647j7166J2158L6865K4081j4223L8941O2647P5487J75919K33033L10996
$$ y = [1620569, 1854156, 1970992, 1913106, 1711799, 1458797, 1163622, 952869, 794481, 723819, 723090, 663279, 564555, 486258, 457397, 476690, 480996, 455545, 477426, 499440, 519798, 541460, 528161, 474838, 466364, 452880, 419012, 365499, 384206, 384315, 305730, 283061, 309596, 262879, 229886, 238698, 255951, 269475, 290363, 275046, 233847, 260795, 227377, 199219, 165223, 209075, 214113, 274743, 301664, 257040, 242687, 180516, 175949, 222837, 230393, 171445, 182325, 160837, 156870, 210533, 208656, 220930, 218703, 155371, 178204, 196824, 197569, 184528, 244382, 257668, 268428, 282197, 317738, 291457, 271082, 313269, 314968, 307670, 268983, 250573, 257300, 275366, 275647, 258481, 270639, 307504, 331585, 317362, 356303, 418950, 494437, 670356, 903389, 1214385]
19828A214385L46405K55488J02702k6942k43342k44568p5819J53986J82593J96637
19818A861525J78901K8397j87828l29555l70380k41969j77659p0044j00002o7195
19808E24191J5367J3240L9339M8346j4946L117o2197j00462l6836o1388k1022
19797C46749K121K9146M1907J8332J3011k8725j1205K1358L1863L392N846N9146
19785E32941Q8715O6754J53558K52958L66353L26944J94164O9143j50185k43817
19775A657528o4651N5013J92022K58229J20822r6879k51048l21938l11510k35910
19765A001678j02011n6435l9910o3267k5606J5399m6397o6032j117n8188R998
19754E68112L3284p3327m7011M2249M2428M5439J2666M972n4229k3067n1471n4786
$$ y = [1214385, 1560790, 1816278, 1918980, 1892038, 1648696, 1404128, 1328309, 1482295, 1664888, 1861525, 2040426, 2068823, 1880995, 1551440, 1181060, 939091, 761432, 691388, 591386, 524191, 539558, 552798, 592137, 640483, 625537, 628654, 566457, 465995, 429159, 367771, 346749, 348870, 378016, 419923, 438255, 451266, 422541, 411336, 432694, 464557, 467949, 473795, 532941, 621656, 688410, 841968, 1094926, 1461279, 1788223, 1982387, 2051530, 1901345, 1657528, 1592877, 1647890, 1839912, 2098141, 2218963, 2122084, 1871036, 1549098, 1237588, 1001678, 899667, 843232, 803322, 740055, 714449, 729848, 683451, 617419, 616302, 558114, 568112, 601396, 528069, 481058, 523307, 565735, 611174, 623840, 628812, 574583, 551516, 500045, 445259]
19742D45259q731K9415j2046l7028J021r742P171L7881K64k9782j0429j2522K5654
19729D26385L5388m2176N58O3497J18886j6514n705O4124O8797n8042j05987k3912
19717E25299L6776M6610M6046L6651O1073n5255m6390l2156k0970n2763L9382
19706E84303K8394m6134o1274k4411M0517l0828l5995j6553N5379M7576K245r087
19694E34132j672j6886k6301j0745Q336k5972o8690j0765K0381L7702q497J6160
19682D47183L3332J5897M7194j6028J8156O3151J8479J0392L9103N9888M8895
19671G85642Q4196P4596P584M5135R2744K38073L34956M21782M54414M44600K09425
19660C193147j5584j94287l86218n22888m00677k00029q8724j4842Q7442K44647
$$ y = [445259, 436528, 465943, 453897, 416869, 417890, 408148, 415319, 453200, 453464, 423682, 413253, 400731, 426385, 461773, 419597, 420155, 483652, 602538, 586024, 580319, 644443, 713240, 655198, 549211, 525299, 562075, 608685, 654731, 691382, 752455, 697200, 650810, 618654, 597684, 544921, 584303, 612697, 566563, 505289, 480878, 521395, 490567, 454572, 438019, 493398, 540974, 543219, 534132, 532460, 515574, 489273, 478528, 486864, 460892, 392202, 381437, 401818, 439520, 431023, 447183, 480515, 496412, 543606, 527578, 545734, 608885, 627364, 637756, 676859, 736747, 785642, 869838, 944434, 952018, 997153, 1089897, 1327970, 1662926, 2084708, 2539122, 2983722, 3193147, 3177563, 2983276, 2597058, 2074170, 1673493, 1473464, 1384740, 1369898, 1457340, 1701987]
19650A701987K48110M20773M54411L06910L1248k13575l32997m57059m95922l14346
19640A349540j80439j02907l6021l2302k6407m9385j3039k0830j24059j45734
19630F18417k8920m8629l5201l098K8051K8157n0566k0800P7216k959p3270r0284
19618C98114n2467P367N3878L1958N4926J33182M8629j7559l3359J4231J9711
19607F58611J7257o133O7855Q4102L8306J29181J64278J48544J94811K48220J12963
19596A857995N8084j7015r2487l6329m3945M511R5065J30819J15316J28744J53306
19585B354064R5973p5705j24112j81208k09693j47874q7283j00796m9921N8510
19575A531955K3900M6046L2669K3900J032j8809r0455j51224m4463m2970L0323
$$ y = [1701987, 1950097, 2370870, 2825281, 3132191, 3163439, 2949864, 2616867, 2159808, 1663886, 1349540, 1169101, 1066194, 1030173, 997871, 971464, 922079, 909040, 888210, 764151, 618417, 589497, 540868, 505667, 502569, 530620, 558777, 508211, 487411, 564627, 561668, 488398, 398114, 345647, 353014, 406892, 438850, 493776, 626958, 675587, 658028, 624669, 638900, 658611, 675868, 669735, 737590, 821692, 859998, 989179, 1153457, 1302001, 1496812, 1745032, 1857995, 1916079, 1899064, 1806577, 1770248, 1726303, 1730814, 1825879, 1956698, 2072014, 2200758, 2354064, 2450037, 2374332, 2250220, 2069012, 1859319, 1711445, 1624162, 1523366, 1473445, 1531955, 1555855, 1601901, 1634570, 1658470, 1659502, 1640693, 1550238, 1399014, 1354551, 1311581, 1341904]
19564A341904N4196Q9499R8627J61146J83998J41962J4269m2471N8347M7871L7799
19553B187147O4524O3259Q2041J51227J91662J35820J33955J79779J43598P3287
19543C406299r92m3204o4159q8259p909M6243J06140J27977J62799J89549J55440
19532C989924K5672q6662j85645j21544m8872k6638M4848Q3077M7878q386p654
19521C705998o1753p4386J0988O9190N1477R2914J24242K20752K14806K22092
19511D576320K93873L39119L58596L16015J64867N3091P7565j8078k7086Q9814
19501F224096J85206L80291M78392N58006N93256M62229K92354P8083P1002J66147
19491I489062M25338P53786R84435J063943R73331R55087R41476R44043J282061
$$ y = [1341904, 1396100, 1485599, 1584226, 1745372, 1929370, 2071332, 2085601, 2043130, 2101477, 2149348, 2187147, 2251671, 2314930, 2396971, 2548198, 2739860, 2875680, 3009635, 3189414, 3333012, 3406299, 3405307, 3362103, 3297944, 3209685, 3201776, 3248019, 3354159, 3482136, 3644935, 3834484, 3989924, 4015596, 3928934, 3743289, 3621745, 3572873, 3546235, 3591083, 3674160, 3722038, 3713652, 3705998, 3644245, 3569859, 3580847, 3650037, 3701514, 3794428, 3918670, 4139422, 4354228, 4576320, 4870193, 5209312, 5567908, 5883923, 6048790, 6101881, 6179446, 6161368, 6134282, 6224096, 6409302, 6789593, 7267985, 7825991, 8419247, 8881476, 9173830, 9251913, 9322915, 9489062, 9914400, 10668186, 11652621, 12716564, 13689895, 14644982, 15586458, 16530501, 17812562]
19482A7812562J926284K865429M084786N690541Q108352J1975197J8339734K7965055
19474I8767940L9215127M8381855N1250381L7643616Q321751j5426314l1640909
19467B36513447m2705967l4181455j1345714J0705961K8193047M0079307M3328874
19460B70587500K8510490j057565k3858135m0345025n1997209m5196437k8884453
19453A07759166j7539249j1580080q244135o101168m464966l070185k085644j438482
19445E3235257j091358j053420j452236j843733j980097j850397j382077o20759
19437D1961180l5227K84835K57286K21369Q9838N5863M80574J006673J829826
19428D6152217L074592M803786P184572J0648229J6518555K5750185L7807705
$$ y = [17812562, 19738846, 22604275, 26689061, 32379602, 40487954, 52463151, 70802885, 98767940, 137983067, 186364922, 237615303, 275258919, 283580670, 268154356, 236513447, 193807480, 159626025, 148280311, 158986272, 187179319, 227258626, 270587500, 299097990, 298040425, 274182290, 233837265, 181840056, 136643619, 107759166, 90219917, 78639837, 70395702, 64294534, 59829568, 56759383, 54673739, 53235257, 52143899, 51090479, 49638243, 47794510, 45814413, 43964016, 42581939, 41961180, 41925953, 42210788, 42468074, 42689443, 42779281, 42835144, 43315718, 44322391, 46152217, 49226809, 54030595, 61215167, 71863396, 88381951, 114132136, 151939841]
19421A51939841M9078422N5732923M9530664K2142679q271995k8361172m5352179
19414B46439183m5668666k3523366K422567K3508013L8813583M6594332L9271552
19407C27857198J1422072j7597072l7235242n4281127n5321919l8780924k3437953
19400A12625033j5035245j0511392p810907n971037m396541l123807k363990j990160
19392F1421954j831151j861535k180837k371841k371298k175233j809860j314989
19384D5505210r31823q59509j059050j283794j579678j618109j519655j277472
19376C5376120j052029r06293q68879r42045q98527r17426r14808r23926q75056
19367B7077131q15704o71744o01637n25267m39977m74155l41163l35294l83899
$$ y = [151939841, 201018263, 256751186, 306281850, 328424529, 320152534, 291791362, 246439183, 200770517, 177247151, 179669718, 203177731, 241991314, 288585646, 327857198, 339279270, 321682198, 284446956, 230165829, 174843910, 136062986, 112625033, 97589788, 87078396, 79267489, 73296452, 68899911, 65776104, 63412114, 61421954, 59590803, 57729268, 55548431, 53176590, 50805292, 48630059, 46820199, 45505210, 44573387, 43713878, 42654828, 41371034, 39791356, 38173247, 36653592, 35376120, 34324091, 33417798, 32548919, 31606874, 30708347, 29790921, 28876113, 27952187, 27077131, 26261427, 25589683, 24988046, 24462779, 24022802, 23548647, 23207484, 22872190, 22488291]
19358B2488291m00950m20107m31427l99446l82429k77526j99751j39659l7043
19349A9799953j9043J8827J06765J22598L7314m2447j26219j35496o5147K7653
19339A9724758J05104R6289J04422J07424J50652J35905K59019L76515M48991
19330B1509079M23571L09692o3414m44104o68437n17797k08594K93476O93903
19321B1327375R34151J020863R94246R79172R62740J157514J782835K771977M112630
19312C6043503O091107R154390J4449143K3282269L5908311M9538389N8401640
19305B32868752N6782275L1117990q941096l8167012m4479202j8969285J4318325
19298B24530747L7641449M7562624L6579232k519176m1973969o6604071o2888447
$$ y = [22488291, 22087341, 21667234, 21235807, 20836361, 20453932, 20176406, 19976655, 19836996, 19799953, 19780910, 19799737, 19906502, 20029100, 20066414, 20023967, 19897748, 19762252, 19697105, 19724758, 19829862, 19926151, 20030573, 20137997, 20288649, 20424554, 20683573, 21060088, 21509079, 21932650, 22242342, 22178928, 21734824, 21066387, 20548590, 20339996, 20633472, 21327375, 22261526, 23282389, 24276635, 25255807, 26218547, 27376061, 29158896, 31930873, 36043503, 42134610, 51289000, 65738143, 89020412, 124928723, 174467112, 232868752, 289651027, 320769017, 311827921, 273660909, 229181707, 210212422, 224530747, 262172196, 309734820, 346314052, 343794876, 301820907, 235216836, 172328389]
19291A72328389m0693504k4000048j5025395j0083679p092712m874356l062382
19284F7496313j783216r41941p98120j221767j847660k455866k648430k165592
19276E3633721j322284n16573M7962J27631O8595L4159L5649J95229O77106J479757
19266E4460952K842012M909115Q122669J3356013K1943676L4776548M9836032
19259A90247017O1166636O3343316M3655655O77082l5281859n0825990l0790632
19252B42191225O186809L5047546M9497872M4771096R174257l6409822o7893810
19245B82565173p3188413n1424366l0552359j8888364j2573266q885259o385396
19238H0667750m519703l158665k318920k086237k451151k903064l127271l049687
$$ y = [172328389, 131634885, 107634837, 92609442, 82525763, 75433051, 70558695, 67496313, 65713097, 64771156, 63973036, 62751269, 60903609, 58447743, 55799313, 53633721, 52311437, 51794864, 51842826, 51970457, 52039052, 52073211, 52108860, 52304089, 52981195, 54460952, 57302964, 62212079, 70334748, 83690761, 105634437, 140410985, 190247017, 251413653, 314756969, 358412624, 359089706, 323807847, 272981857, 242191225, 248378034, 283425580, 332923452, 377694548, 386868805, 350458983, 282565173, 209376760, 157952394, 127400035, 108511671, 95938405, 87053146, 80667750, 76148047, 72989382, 70670462, 68584225, 66133074, 63230010, 60102739, 57053052]
19230E7053052k445689j746108j254444j109799j257308j496599j588295j713651
19222D4441159j765411j721003j651177j579792j423437j315016j167081j010779
19214C2807463r29491q72553q54555q61067q29333p49974p12823p17920p13629
19205B5566118o11947n80731n93199o29167n37482n72218m99608m10210n35013
19196B0596543m98129l94291m10143m35849l46833l95139l05717j63490j49968
19187A7496984k19854k27324k12702j94244j32930n2529n3108j6155M9379j13503
19177A6324014j83720l54408m31983l36037k46341j28193r9221j92992k41584
19168A4109535m10614m93400m17747l27866k90728k77029k76742k22583k33921
$$ y = [57053052, 54607363, 52861255, 51606811, 50497012, 49239704, 47743105, 46154810, 44441159, 42675748, 40954745, 39303568, 37723776, 36300339, 34985323, 33818242, 32807463, 31877972, 31005419, 30150864, 29289797, 28460464, 27710490, 26997667, 26279747, 25566118, 24954171, 24373440, 23780241, 23151074, 22613592, 22041374, 21541766, 21131556, 20596543, 20098414, 19704123, 19293980, 18858131, 18511298, 18116159, 17810442, 17646952, 17496984, 17277130, 17049806, 16837104, 16642860, 16509930, 16457401, 16404293, 16388138, 16437517, 16324014, 16140294, 15785886, 15353903, 15017866, 14771525, 14643332, 14544111, 14351119, 14109535, 13698921, 13205521, 12787774, 12459908, 12169180, 11892151, 11615409, 11392826, 11158905]
19159A1158905j68854j19314k04199k34444j61435j79141j89300j54696r2275
19150I655247m4211n3781j37848o5973j35298j95458k54086k40294q0819l9278
19140H408201m3011r8060l0620l1468m6876O3780J33727J46881J06660O2135k7292
19129H644057j77460j47188j04105q4437M6854J80305J46501p0862k11566k68997
19119G953102l48946l41727k87077j99842j78283j85174j32481q7180n7105j6166
19109F119121k4758l3390q2691j20289j85940j39432m9892O799M4858R3197k6000
19098E601583j06919o8511j69323r8889j29448r5300j6155J948j06127j57362
19088D655497p7516r6319q6300j27449n3837K0202K0420j3409q2931m5182p0540
$$ y = [11158905, 10990051, 10870737, 10666538, 10432094, 10270659, 10091518, 9902218, 9747522, 9655247, 9611036, 9557255, 9419407, 9353434, 9218136, 9022678, 8768592, 8528298, 8447479, 8408201, 8365190, 8267130, 8236510, 8205042, 8158166, 8221946, 8355673, 8502554, 8609214, 8671349, 8644057, 8466597, 8319409, 8215304, 8130867, 8177721, 8358026, 8504527, 8433665, 8222099, 7953102, 7604156, 7262429, 6975352, 6775510, 6597227, 6412053, 6279572, 6192392, 6135287, 6119121, 6094363, 6060973, 5978282, 5857993, 5672053, 5532621, 5482729, 5489528, 5534386, 5627583, 5601583, 5494664, 5426153, 5256830, 5157941, 5028493, 4933193, 4917038, 4918986, 4812859, 4655497, 4577981, 4481662, 4395362, 4267913, 4214076, 4234278, 4254698, 4241289, 4158358, 4113176, 4042636]
19077D042636k5880P3802J35571J89644K52484K28681J50371m5576l44589n10987
19067D146157l45828k51758j79997j14215q5443n1938k821K5677p0762j50484
19057B918588l1082k7611j22515n9467j4007j7022o1122j3918p648m4357j12763
19046B407076j01399r9089m8308q6840n2100k2180l1195p6624m6454n7424p4997
19035A710466l782R2325L2375j467n0950o4740n1680k1718J4343Q2891J63816
19024A901879K63976L76694M55395L88455K86518K2128l50730n58974m59618k70243
19014B055480j06678j2794K4173M7906O785P4739J43003J68204J33126Q2707O3153
19003B679804K1623q3717p5154O7604Q3188L7198O2188J5271p2259j04511j37133
$$ y = [4042636, 4016756, 4090558, 4226129, 4415773, 4668257, 4896938, 5047309, 5001733, 4657144, 4146157, 3800329, 3548571, 3368574, 3254359, 3168916, 3116978, 3114157, 3139834, 3069072, 2918588, 2887506, 2859895, 2737380, 2677913, 2663906, 2646884, 2585762, 2571844, 2564196, 2519839, 2407076, 2305677, 2206588, 2158280, 2071440, 2019340, 1997160, 1965965, 1889341, 1842887, 1785463, 1710466, 1706684, 1799009, 1831384, 1829917, 1778967, 1714227, 1662547, 1640829, 1655172, 1738063, 1901879, 2165855, 2542549, 2997944, 3386399, 3672917, 3695045, 3344315, 2785341, 2325723, 2055480, 1948802, 1936008, 1960181, 2008087, 2014872, 2089611, 2232614, 2400818, 2533944, 2616651, 2679804, 2701427, 2617710, 2542556, 2610160, 2693348, 2730546, 2792734, 2808005, 2735746, 2631235, 2494102]
18992B494102j54052j00499r9102j12073q2782q9649n9222r4085K065Q6652R7204
18981A888559P1575k1749j02310p1440p6207j0965R1308R4947K0712J63014J32205
18970B179649J23995J42116K05303K69125K13177J21418J9683q4430j55632L1019
18960C065423J86545L21107L64073L94611L69224K36215J17830O2520L0798j01538
18950E046808k06840k34203j57838k9472Q9861J94667K25064J18531N1526j27814
18940D970290k04000j48528j83289k31544j80392q8915L3197n7202q9972J7599
18930C837244M3637k865K0945R8339J17361Q6603R6802J49233K17676L31150M49757
18919E445882L54350K14058L4676j11318j35273n183K54690M96864O40753O32173
$$ y = [2494102, 2340050, 2239551, 2140449, 2028376, 1945594, 1855945, 1796723, 1702638, 1704703, 1791355, 1888559, 1960134, 1938385, 1836075, 1764635, 1688428, 1677463, 1768771, 1863718, 1884430, 2047444, 2179649, 2303644, 2445760, 2651063, 2920188, 3133365, 3254783, 3274466, 3190036, 3034404, 3065423, 3251968, 3573075, 3937148, 4331759, 4700983, 4937198, 5055028, 5117548, 5148346, 5046808, 4839968, 4605765, 4447927, 4418455, 4508316, 4702983, 4928047, 5046578, 5098104, 4970290, 4766290, 4617762, 4434473, 4202929, 4022537, 3933622, 3966819, 3909617, 3819645, 3837244, 3880881, 3878016, 3898961, 3997300, 4114661, 4201264, 4298066, 4447299, 4664975, 4996125, 5445882, 5800232, 6014290, 6048966, 5937648, 5802375, 5797192, 6051882, 6548746, 7189499, 7821672]
18909G821672L95383J16717j8112k7580J92184M61017Q44264J146315J138016
18900A2069876R84616O25513K54165O9599Q0472K74901Q05981J147878J562611
18891A7875612K170519K925579L965306N169826P073947J0291888J5987527K4806931
18883I0267135L5595047M5559841N0131280M0031827J9142750l036467j9780498
18876B57910915k3230076j4424510O216988K5752895K9939642J4953169o833842
18869B90285181k8998472m2764056m7184629m0701784k6687869j6170855j0536638
18862G7240878p430554n508189m159769l174122k434618k012214j836192j815385
18854D8869835j590492j331938r26886n55341l03791k71225m04037o50412o76552
$$ y = [7821672, 8217055, 8333772, 8315660, 8288080, 8480264, 8941281, 9785545, 10931860, 12069876, 13054492, 13680005, 13934170, 14003769, 14084241, 14359142, 15165123, 16313001, 17875612, 20046131, 22971710, 26937016, 32106842, 39180789, 49472677, 65460204, 90267135, 125862182, 171422023, 221553303, 261585130, 280727880, 277691413, 257910915, 234680839, 220256329, 226473317, 252226212, 282165854, 297119023, 290285181, 261286709, 218522653, 171338024, 130636240, 103948371, 87777516, 77240878, 69810324, 64302135, 60142366, 56968244, 54533626, 52521412, 50685220, 48869835, 47279343, 45947405, 45020519, 44465178, 44161387, 43890162, 43486125, 42835713, 42159161]
18845D2159161m73968k54345o9402K00101N06412R94978J694481K759267M259570
18836E1776255O298230R030252J3498791K1144815L2378434M5028940N5837800
18829B34993517N7884307M1593418J6237274r651502k6854961k8570668j4752092
18822B70879293J1251510L1193713L0426039J0811075j4108638l8236877n1953315
18815B50262800n4673712m3558801k7517681j7063118j1599437q571270o550786
18808H0727995n095503m058574l325680k921442k727558k592884k462666k305755
18800E5237933k111589j916823j769950j742494j721095j551069j404654j138646
18792D1881613q30755p52650q10352q82405j150179j504437j651677j584829j342296
$$ y = [42159161, 41685193, 41430848, 41361446, 41561547, 42067959, 43062937, 44757418, 47516685, 51776255, 58074485, 67104737, 80603528, 101748343, 134126777, 179155717, 234993517, 292877824, 334471242, 350708516, 341057014, 314202053, 285631385, 270879293, 282130803, 313324516, 343750555, 354561630, 340452992, 302216115, 250262800, 195589088, 152030287, 124512606, 107449488, 95850051, 87278781, 80727995, 75632492, 71573918, 68248238, 65326796, 62599238, 60006354, 57543688, 55237933, 53126344, 51209521, 49439571, 47697077, 45975982, 44424913, 43020259, 41881613, 41050858, 40298208, 39487856, 38605451, 37455272, 35950835, 34299158, 32714329, 31372033]
18783C1372033j065537q44222p28502o17993n23466m35838m30348n85209q06689
18774B5334229q00185p27609n42165l51221l15354j50594k50437l65739m88610
18765B1342315o07402n12470k77827j46218j69015k26115l30527k59063j76710
18756A8636968j12003L8761J43374L1379j51374l48604m63652m22118k72362j51838
18746A6928531Q7549J42899K3700j65085m40548p67232p77855n82451l85927k00166
18736A3863415k72341l30051k08946r9592P2020J88985L18306J45844l5399k27912
18726A3414329l70319l92381j63776r1066L5859R0111j8032k85407m69584n78846
18716A1170888m64029m48116m32874l62287k86888j90488j55379j34635L0234
$$ y = [31372033, 30306496, 29462274, 28733772, 28115779, 27592313, 27156475, 26726127, 26140918, 25334229, 24534044, 23806435, 23264270, 22913049, 22597695, 22447101, 22196664, 21830925, 21342315, 20734913, 20222443, 19944616, 19798398, 19629383, 19403268, 19072741, 18813678, 18636968, 18524965, 18563726, 18707100, 18738479, 18587105, 18238501, 17774849, 17352731, 17080369, 16928531, 17016080, 17158979, 17182679, 17017594, 16577046, 15809814, 15031959, 14449508, 14063581, 13863415, 13591074, 13261023, 13052077, 12952485, 13024505, 13213490, 13531796, 13677640, 13642241, 13414329, 13044010, 12651629, 12487853, 12396787, 12432646, 12522757, 12504725, 12219318, 11749734, 11170888, 10706859, 10258743, 9825869, 9463582, 9176694, 8986206, 8830827, 8696192, 8726426]
18707H726426J72284K84050M77780O12493N38686K17628k40759n55899n64158
18698I668531m62196k73860n4664N6962J45008J59576l59j83448l90624m85247
18688H179679m07701l95005k61915k05216j15176j26508q7181l7722n8115p3611
18678F411529J22121K12535K02930J75248J8671q1912j28318j78417j46845N4799
18668F662341O7047L3234n5565k03591k31766k23061k73877j59885j58997j17097
18658E338783j75559m6307k6520L9356J43922K09420J57939O0464j56551m02058
18648E142889m90903m24566k29094j62987j42934j28753l0128q9230n6315j0749
18638C377230M731J2319O8340m752J11k3214m6783K4360o9978o2399m1585j17888
$$ y = [8726426, 8898710, 9182760, 9660540, 10273033, 10811719, 11029347, 10788588, 10232689, 9668531, 9206335, 8932475, 8877811, 8934773, 9079781, 9239357, 9238998, 9055550, 8664926, 8179679, 7771978, 7376973, 7115058, 6909842, 6794666, 6668158, 6580977, 6543255, 6485140, 6411529, 6533650, 6746185, 6949115, 7124363, 7143034, 7061122, 6932804, 6754387, 6607542, 6662341, 6729388, 6762622, 6707057, 6503466, 6271700, 6048639, 5774762, 5614877, 5455880, 5338783, 5163224, 5116917, 5090397, 5129753, 5273675, 5483095, 5641034, 5701498, 5544947, 5142889, 4651986, 4227420, 3998326, 3835339, 3692405, 3563652, 3533524, 3444294, 3387979, 3377230, 3381961, 3394280, 3462620, 3457868, 3457979, 3434765, 3387982, 3412342, 3342364, 3279965, 3238380, 3120492]
18626C120492j23755j24427j26962o2423p1539l3780j3293p3806m2465r101L9989
18615B478930l8727o7274j878m412l1143J3353k1953N113J4471R461m5573j48091
18603B162277j00319k0645n3079j18272n3777p676m6630l6912j9585j7323p8419
18592A609640o3060j0456m7189n9553l5352k6347L5307Q9987N5593k357O9933
18581A616146L0832J388q3164q4824P398L2977k7215j2044q4616q5236r0950n2624
18569A168068Q003k8247n3642l0493k0004M7565L6516J8177M4899M642m1230l9581
18557A114673P1602Q3076j7279j6061n222J2083o570q3170r6109p1121n0188l047
18545I32667K4526J0138N7407J10616J62820K16353J11816k1048r1523j39787
$$ y = [3120492, 2996737, 2872310, 2745348, 2682925, 2611386, 2577606, 2564313, 2490507, 2448042, 2438941, 2478930, 2440203, 2372929, 2371051, 2366639, 2335496, 2348849, 2326896, 2332009, 2346480, 2355941, 2310368, 2162277, 2061958, 2041313, 1988234, 1869962, 1816185, 1808509, 1761879, 1724967, 1705382, 1688059, 1609640, 1546580, 1536124, 1488935, 1429382, 1394030, 1367683, 1402990, 1492977, 1548570, 1546213, 1616146, 1646978, 1648366, 1565202, 1480378, 1487776, 1520753, 1493538, 1481494, 1396878, 1311642, 1220692, 1168068, 1176071, 1147824, 1094182, 1063689, 1043685, 1091250, 1127766, 1145943, 1190842, 1195484, 1154254, 1114673, 1186275, 1269351, 1252072, 1236011, 1230789, 1242872, 1236302, 1153132, 1057023, 985902, 935714, 932667, 957193, 967331, 1024738, 1135354, 1298174, 1514527, 1626343, 1605295, 1513772, 1373985]
18535A373985m2682N6277k0903r7299j00237p1330o2282p2355o1133q9158k50
18524H12633J2800o0219l292l3622O3338Q3111L9103L3554J43782J87436J53756
18513A432380J76019J38361M1126M9997Q7458J33817J58235P0327p4470k07799
18503B005451k30102j14887n0604j20912j21706k9559J074L8997Q187p7161n4564
18492A254214j9196L3919J05349J85058J47918J90096K50738L04624J75457N4945
18482B683122K631L8183J9376n6716j89533j72148j72903j48822p5454q2037l4706
18471A810993n98J8278k9883k3578k9593l9132l8077N972N4306Q9448J51351J75974
18459B145461J89259J74257R1625J33527M3238r427q0281j36337j77932j07195
$$ y = [1373985, 1331303, 1387580, 1366677, 1269378, 1169141, 1097811, 1035529, 963174, 902041, 812883, 812633, 825433, 765214, 761922, 728300, 791638, 874749, 913852, 947406, 1091188, 1278624, 1432380, 1608399, 1746760, 1787886, 1837883, 1925341, 2059158, 2217393, 2287720, 2213250, 2005451, 1775349, 1660462, 1609858, 1488946, 1367240, 1337681, 1338755, 1377752, 1385939, 1308778, 1254214, 1235018, 1268937, 1374286, 1559344, 1707262, 1897358, 2148096, 2452720, 2628177, 2683122, 2685753, 2723936, 2743312, 2686596, 2497063, 2324915, 2152012, 2003190, 1927736, 1845699, 1810993, 1810395, 1828673, 1798790, 1775212, 1745619, 1706487, 1668410, 1674382, 1728688, 1818136, 1969487, 2145461, 2334720, 2508977, 2600602, 2734129, 2777367, 2767940, 2687659, 2551322, 2373390, 2266195]
18449B266195o7181j00171o0554l0375r507k3824M4917l3822o7220m9362q960
18438A860136k2413J43238J82246K03335J31138M9860J09381L124R940J63280
18428B833265J92882J31064L2044P1477m6230j3259O9557R2943J36278O4083n5153
18417C508951n1097l580P8868J23392K18955K52576K55046L10939N01809N43929
18407E739788N40745N08561M27812K72619R0805j4785Q6368L08641L96350N21334
18397H878238N17806O33306Q27220J197884J688710K241079K904015L749882N087734
18388B7725874P400589J1314229J8049172K8480555M1782474N4427298O0621127
18381B49801318N0128039K0324860j9779909n2164438o1472756n1712603l3731301
$$ y = [2266195, 2199014, 2098843, 2038289, 2007914, 1998407, 1974583, 2019500, 1985678, 1918458, 1869096, 1860136, 1837723, 1980961, 2163207, 2366542, 2497680, 2547540, 2656921, 2660045, 2669985, 2833265, 3026147, 3157211, 3189255, 3260732, 3214502, 3201243, 3270800, 3363743, 3500021, 3564104, 3508951, 3457854, 3454274, 3533142, 3656534, 3875489, 4128065, 4383111, 4694050, 5195859, 5739788, 6280533, 6789094, 7216906, 7489525, 7580330, 7565545, 7651913, 7960554, 8356904, 8878238, 9396044, 10029350, 10856570, 12054454, 13743164, 15984243, 18888258, 22638140, 27725874, 35126463, 46440692, 64489864, 92970419, 134752893, 189180191, 249801318, 299929357, 320254217, 300474308, 248309870, 186837114, 135124511, 101393210]
18374A01393210k0235994j2418617p834748n122478l376212k275294j512316r71277
18366D7646274m27641K67683J109114K299396M002516O685983J1216323J8565634
18358I1365282K9541386M2757320N4154859N7674962M3703733J2159873k7293706
18351C04063709n5318979o0574233m8350732l0674708j8487967j1613179p642248
18344G1401663n198781l493992k120580j228651m86774J99603R71852K070002
18336F2114342L749258O787589J2046685K0481848L2098710M4521612N3355371
18329B35155415N0704661K9340866m833089l9561882n5990191n2645671l7282667
18322A24887442k2689962j3779946q717870n633120l743414k610624j869091j374704
$$ y = [101393210, 81157216, 68738599, 60903851, 55781373, 52405161, 50129867, 48617551, 47646274, 47218633, 47486316, 48595430, 50894826, 54897342, 61583325, 72799648, 91365282, 120906668, 163663988, 217818847, 275493809, 319197542, 331357415, 304063709, 248744730, 188170497, 139819765, 109145057, 90657090, 79043911, 71401663, 66202882, 62708890, 60588310, 59359659, 58872885, 59072488, 60044340, 62114342, 65863600, 72651189, 84697874, 105179722, 137278432, 181800044, 235155415, 285860076, 315200942, 310367853, 270805971, 214815780, 162170109, 124887442, 102197480, 88417534, 79699664, 74066544, 70323130, 67712506, 65843415, 64468711]
18314F4468711q62254l14688M54853J416902K681102M632298P673088J2945192
18306I3095204K1635556L3381385M5121343N2429590M6926437K3226884j1539104
18299C04277295m3677860n5995725m9781375l3688292k0059640j1952780p008381
18292H2113242l571517r81799J400822L951940P286494J2730939K1829392L5275575
18284A60035088N1167046O3347510O3900514M1114734m633492n0242251p2938354
18277B51750795o5106190m2695123k5284847j5590993j0317987p286348n593287
18270G9876020m686110l980918l455703k946271k496634k156675j882607j641722
18262E6629380j604936j624853j516015j252419r73325p96308n54575k95625q5575
$$ y = [64468711, 63606457, 63291769, 63746622, 65163524, 67844626, 72476924, 80150012, 93095204, 114730760, 148112145, 193233488, 245663078, 292589515, 315816399, 304277295, 260599435, 204603710, 154822335, 121134043, 101074403, 89121623, 82113242, 78541725, 77559926, 78960748, 82912688, 90199182, 102930121, 124759513, 160035088, 211202134, 274549644, 338450158, 379564892, 374931400, 324689149, 251750795, 186644605, 143949482, 118664635, 103073642, 92755655, 85469307, 79876020, 75189910, 71208992, 67753289, 64807018, 62310384, 60153709, 58271102, 56629380, 55024444, 53399591, 51883576, 50631157, 49657832, 48861524, 48306949, 48011324, 47925749]
18253D7925749N6312M1562j02577l28477l19346j12289K65858O20405J210430
18244D9257627K190041L659683N737526Q792021J3609633K1672973L4115185N0137998
18236A89172687O5691143P4805371O8738172M2818496J1631827p219830j0152682
18229D35485184j6135056l9399016o4498622p1485699n6717105l6474044k2774822
18222A28000820j5329783j0866973q166652o441160n216497m367591l772946l272397
18214G0566821k917177k632226k370632k097287j876710j744430j479053j205434
18206E4243872q01289m52722l31339l60149l65935l86835o75874r54238j212868
18197D8702623j236887j026547o62188j93019M40512J311891K539934M133575
$$ y = [47925749, 47982061, 48023623, 47921046, 47592569, 47273223, 47160934, 47426792, 48047197, 49257627, 51447668, 55107351, 60844877, 69636898, 83246531, 104919504, 139034689, 189172687, 254863830, 329669201, 398407373, 441225869, 452857696, 445637866, 435485184, 419350128, 379951112, 315452490, 243966791, 187249686, 150775642, 128000820, 112671037, 101804064, 93637412, 87196252, 81979755, 77612164, 73839218, 70566821, 67649644, 65017418, 62646786, 60549499, 58672789, 56928359, 55449306, 54243872, 53442583, 52989861, 52658522, 52298373, 51932438, 51545603, 50869729, 49915491, 48702623, 47465736, 46439189, 45777001, 45583982, 46024494, 47336385, 49876319, 54009894]
18189E4009894O447980J0607111J7667761K8232318M0458965M9958242N0598539
18182B57980810L2750129l360761l9217261n6999034n0638558l2751896j9094382
18175H8669047j1784097q006989n934356m721094l801256l134509k696324k265516
18167D6324906j937931j743982j570982j407940j304690j121178r42362p62355
18159C5533486n63869m83737l43133k60308k22339l61680n73646q22493j021511
18150C0880770r85107j054871j052757j028354r30865p91121o92931o40199n99484
18141B3105081o05643n03746n27590m71174m34037m11351l95145l50154l33803
18132A9072438l63320m21076l66610l35354l18720k42149j41773p7113n3194j43502
$$ y = [54009894, 60457874, 71064985, 88732746, 116965064, 157424029, 207382271, 257980810, 290730939, 287370178, 248152917, 191153883, 140515325, 107763429, 88669047, 76884950, 68877961, 62943605, 58222511, 54421255, 51286746, 48590422, 46324906, 44386975, 42642993, 41072011, 39664071, 38359381, 37238203, 36295841, 35533486, 34969617, 34485880, 34142747, 33882439, 33660100, 33298420, 32724774, 31902281, 30880770, 29895663, 28840792, 27788035, 26759681, 25828816, 25037695, 24344764, 23704565, 23105081, 22499438, 21995692, 21468102, 20996928, 20562891, 20151540, 19756395, 19406241, 19072438, 18709118, 18288042, 17921432, 17586078, 17267358, 17025209, 16883436, 16806323, 16753129, 16609627]
18122A6609627j49294r7228l4702m2669K07912M61221P36750J102833J892788
18113B0687238L318106N916780R948501J4010165J4609017J2859515K830412j9565652
18105F4614082j9813426j0540113n566921l472424k453536j825552j355758r81636
18097A8604716p53924o91110o39729o11397m96200m35887l96163m60039l96231
18088A3724036l44930l70520k72325j88264j87726k08119k20526j94980j42770
18079A1593876j52768k03846j75550j49242j53076j44829j30356j94682j99495
18070A0090032k11529k51118k49496j89113j68589j81433j21961q4555m6563k4973
18060H560702K9524Q2705L1227J6863k7904n0287k53182k77775k63662k73430
$$ y = [16609627, 16460333, 16363105, 16328403, 16285734, 16493646, 16954867, 17691617, 18794450, 20687238, 24005344, 29922124, 39870625, 53880790, 68489807, 81349322, 84179734, 64614082, 44800656, 34260543, 28693622, 25221198, 22767662, 20942110, 19586352, 18604716, 17850792, 17159682, 16519953, 15908556, 15412356, 14976469, 14580306, 14120267, 13724036, 13379106, 13008586, 12736261, 12547997, 12360271, 12152152, 11931626, 11736646, 11593876, 11441108, 11237262, 11061712, 10912470, 10759394, 10614565, 10484209, 10289527, 10090032, 9878503, 9627385, 9377889, 9188776, 9020187, 8838754, 8716793, 8632238, 8585675, 8560702, 8590226, 8672931, 8704158, 8721021, 8693117, 8642830, 8389648, 8111873, 7848211, 7574781]
18050G574781k77785j97310j41169j6431N243m1679o3656n0156j07234q8150m005
18039F592449q4692j15860j98943j31179p2168j32158p0943p4944n2850j11186
18029E547526n0555m6195K677k5667k8494k3463m8789j25532j69796j47580r2584
18018D791548p2644j14930m4166o6045j15694j19861l1803n8772p7030o7152r6094
18007C927357l4024n5201l9148o6293o7554o7578p2825l0288r6055m3462j727
17996C353202L5585o0248P654J5888j9104n9493q1912o821K2052q567l5570K3156
17984C185822p262K2334j6680n6048m0760j64453j38155m9210q1116l8641k1923
17973B593908L9352K5611l2574k3961l7936K4984j6258r2202p6814k2585k4447
$$ y = [7574781, 7296996, 7099686, 6958517, 6942086, 6947329, 6905650, 6841994, 6791838, 6684604, 6596454, 6592449, 6507757, 6391897, 6192954, 6061775, 5989607, 5857449, 5786506, 5711562, 5658712, 5547526, 5496971, 5450776, 5453453, 5427786, 5399292, 5375829, 5327040, 5201508, 5031712, 4884132, 4791548, 4718904, 4603974, 4559808, 4493763, 4378069, 4258208, 4226405, 4167633, 4090603, 4023451, 3927357, 3893333, 3838132, 3798984, 3732691, 3665137, 3597559, 3524734, 3494446, 3398391, 3354929, 3353202, 3388787, 3328539, 3336193, 3352081, 3332977, 3273484, 3191572, 3184751, 3206803, 3198236, 3162666, 3185822, 3178560, 3200894, 3184214, 3128166, 3087406, 2922953, 2784798, 2735588, 2654472, 2615831, 2593908, 2633260, 2658871, 2626297, 2602336, 2564400, 2589384, 2573126, 2480924, 2404110, 2381525, 2357078]
17962B357078o048k5763p3044o2541m4524k9398j9361P931O43J0379J8707n1841
17950B082218j9099N2149O6575l0268l2797p2780n9132o5598k3216k1639k4072
17939A852341l1094k0041J8065n319k1835j3471k3456n5751p7972n1509q600M8839
17927A610197M8862L412r2553o0070l5109P430j1507q894P698J3326N1986p829
17915A526949q5405O147n585l5383k2814k9234M842j2523p5673K9136j8415K2830
17903A304872J6552Q6928k0355l7726K8417l7732k3974J6010m4535m8550m4468
17892A195439j4039O650m6024k4954M5398J8510m6579l6994m3008l107L9266n0221
17880A040337n3115k6508J9511O9908M1324o937K3332K9822J5595q7024l0557
$$ y = [2357078, 2351030, 2325267, 2252223, 2189682, 2145158, 2115760, 2096399, 2104330, 2104973, 2115352, 2134059, 2082218, 2063119, 2115268, 2181843, 2151575, 2118778, 2045998, 1986866, 1921268, 1898052, 1876413, 1852341, 1821247, 1801206, 1819271, 1813952, 1792117, 1778646, 1755190, 1699439, 1621467, 1569958, 1561358, 1610197, 1659059, 1662471, 1569918, 1509848, 1474739, 1482169, 1470662, 1461768, 1469466, 1482792, 1534778, 1526949, 1441544, 1447691, 1442106, 1406723, 1383909, 1354675, 1359517, 1346994, 1271321, 1300457, 1282042, 1304872, 1321424, 1408352, 1387997, 1350271, 1378688, 1340956, 1316982, 1332992, 1288457, 1239907, 1195439, 1181400, 1188050, 1142026, 1117072, 1162470, 1180980, 1134401, 1097407, 1054399, 1051292, 1090558, 1040337, 987222, 960714, 980225, 1050133, 1091457, 1084520, 1107852, 1137674, 1153269, 1066245, 1035688]
17869A035688q006K4452K4095n7599M147L7403L399P7710M9163O2914J92351L01570
17857A747287K21201K48853K03705O4580j62995k96290l03711k48953j78266j25136
17847A170275j24157k2724l0764n259j1275j8732o5704k1982j6259M4282O1064
17836I58765j5488L9312O7139J31555J71115K47723K41640K59364J76765L7327
17826B315217j71877l10622l48777k12622j29707p3385n8337k86n7898K7421P786
17815I86913O041K5389L537M0662n0706k2839O8284N7682J10977J88261K54692
17804A668893K84409K43016Q1319p2079k78976l50504k32179j39139q6529q5989
17794A032242l9799q0201l896k1872n8912n6941k5028Q9757o379o490Q5554N9195
$$ y = [1035688, 1027682, 1052134, 1076229, 1018630, 1022777, 1060180, 1063579, 1141289, 1190452, 1253366, 1445717, 1747287, 1968488, 2217341, 2421046, 2485626, 2322631, 2026341, 1722630, 1473677, 1295411, 1170275, 1046118, 1023394, 992630, 987371, 976096, 957364, 891660, 869678, 853419, 897701, 958765, 943277, 982589, 1049728, 1181283, 1352398, 1600121, 1841761, 2101125, 2277890, 2315217, 2143340, 1832718, 1483941, 1271319, 1141612, 1068227, 1009890, 1009604, 951706, 979127, 986913, 992954, 1018343, 1021880, 1062542, 1011836, 988997, 1057281, 1114963, 1225940, 1414201, 1668893, 1953302, 2196318, 2277637, 2205558, 1926582, 1576078, 1343899, 1204760, 1118231, 1032242, 992443, 912242, 908346, 886474, 827562, 770621, 745593, 835350, 828971, 822481, 908035, 967230]
17782I67230O2433J05194J30183J85684J86881J51939J90663J40238p6226k33481
17772A810738k12608k06229j42358o3265k7473N2633R5078K68086L44042K99022
17762B217666K67509J06111k20521l39226l75385k64984j86624j36797q8931j39536
17752H39282n6709L5590q996o739m4876J0065L7693Q318k107m1746r8172q1780
17740E89823k7180R5113j4359l8699L6495J1558pL8303l5799k4161Q854L1362
17728F71303L6103q5148m462L3126P4878K3983L3834J10995J09850J31639K34869
17717A370970K68846L07098M17916L52472J83124O0101J9723q8089j44485l06895
17707B440781m19989l80050k96564k16697j19503k0409q0536q1834p0423o5750
$$ y = [967230, 1029663, 1134857, 1265040, 1450724, 1637605, 1789544, 1980207, 2120445, 2044219, 1810738, 1598130, 1391901, 1249543, 1186278, 1158805, 1211438, 1306516, 1574602, 1918644, 2217666, 2485175, 2591286, 2370765, 2031539, 1656154, 1391170, 1204546, 1067749, 978818, 839282, 782573, 818163, 809167, 802428, 757552, 767617, 805310, 813628, 811521, 769775, 671603, 589823, 562643, 657756, 643397, 604698, 641193, 652751, 652744, 691047, 655248, 631087, 639941, 671303, 707406, 622258, 617796, 650922, 725800, 749783, 783617, 894612, 1004462, 1136101, 1370970, 1639816, 1946914, 2364830, 2717302, 2900426, 2960527, 2980250, 2892161, 2747676, 2440781, 2020792, 1640742, 1344178, 1127481, 1007978, 987569, 907033, 825199, 754776, 689026]
17697F89026j6620j0483m6144L3833j6317J127P7837n8732m5830q4507j2877j1436
17685D98877N8161Q4894k9298p1676O3589N9040O307m1962J4918n0344l6267l6772
17673E19467J8313o005K9028j1465J0043N7240J70822K04363K79955L45547K47006
17662A864314J26858j35970l04799l33445k42084j34355o3265n8541P212m8441
17652F77484n9142m4857m861P251k3178l6993J8584p192J2457Q230n7489m8360
17640D41934l0880k5808J2145L0953R337n8092p6320J8186M1756L4675L0369k2411
17628D05844j0505J82k2859K1456l5881m2208N1306O0822j9884l1774J1488J7254
17616D05241J7329M9755m6658o5797j0166j5695r703M9298k6166k7850J2936k176
$$ y = [689026, 672406, 661923, 615779, 649612, 633295, 634422, 712259, 653527, 607697, 523190, 510313, 498877, 557038, 641932, 612634, 540958, 604547, 663587, 669894, 627932, 642850, 592506, 556239, 519467, 537780, 531775, 560803, 549338, 559381, 616621, 787443, 991806, 1271761, 1617308, 1864314, 1991172, 1855202, 1550403, 1216958, 974874, 840519, 777254, 718713, 725925, 677484, 618342, 573485, 568624, 575875, 552697, 515704, 534288, 527096, 539553, 547783, 490294, 441934, 411054, 385246, 397391, 428344, 437681, 379589, 303269, 321455, 363211, 397886, 428255, 405844, 395339, 395521, 372662, 394118, 358237, 316029, 367335, 428157, 408273, 376499, 387987, 405241, 422570, 472325, 425667, 359870, 349704, 334009, 324306, 373604, 347438, 319588, 332524, 330348]
17604C30348k3642l5610k7410n035j0267K388J2855K8197M3433J946j153o90o5472
17591B49888J795l5116j720M6196J4483l4099K1172O58K1034N481P358k8642l5785
17578B32703k8825J8618P84k8527N618M1480O956k1145L9276k5900j7542o1935
17566A61561l2428o926M5182L890m8766J377Q9144L6506R13k7119R136k7035K4694
17553B30129M0339m9671m274Q138M2538n0556L3611K1987L774l4867p7296o2994
17541A00858p686K0069K3972J007L4175N4509J2665k3698N532K7332m8465m5774
17529A54496N472K9795J4810l8404P824N4667j8655m3191J4975q690O5076K941
17517B41116j3107l0193J3244j7199k9259k5993j3177M1511K5582j4682r07k0809
$$ y = [330348, 306706, 271096, 243686, 238651, 228384, 230772, 243627, 271824, 315257, 317203, 316050, 315360, 249888, 251683, 216567, 214847, 261043, 275526, 241427, 262599, 263257, 284291, 289772, 297130, 268488, 232703, 203878, 222496, 223280, 194753, 200371, 241851, 248807, 227662, 266938, 241038, 223496, 161561, 129133, 122207, 167389, 171279, 122513, 123890, 213034, 249540, 250453, 223334, 232470, 205435, 230129, 270468, 220797, 216523, 224661, 267199, 216643, 250254, 272241, 276015, 241148, 163852, 100858, 93172, 113241, 137213, 138220, 172395, 226904, 239569, 215871, 221403, 248735, 200270, 154496, 159968, 189763, 204573, 166169, 173993, 228660, 210005, 166814, 181789, 173099, 238175, 241116, 228009, 197816, 211060, 193861, 164602, 138609, 125432, 166943, 192525, 177843, 176936, 156127]
17505A56127J802N096K3735k800N655m4518k2802K1932L4096k3475L5275J07843
17493B97966m2291l1597r7436o7782J8016M8425J5118l2556p820p8314j8729n869
17481b869L3106M2132M8755M314J7178k9484K902Q921R73K8789N3626l470j183
17468B03690M7631j8923J6070j7482m4356L0610k6887l1279L8314K4713O0965
17457B83066n2762m1854l9702k1891j805L8397K1684K5560M64P6162O058n0614
17445B42763l636R2521R3318O7761N8946K3999m0837j16837j40081o3629p628
17434B06660L3705K2951N2081Q210q9192K4907r954j1471r120m5528j944K2188
17422B03493m275l7988r205L3931J681j7509j4165J417P2530J5622J6958j545
$$ y = [156127, 157929, 163025, 186760, 183960, 189615, 145097, 122295, 144227, 178323, 154848, 190123, 297966, 255675, 224078, 126642, 58860, 76876, 125301, 140419, 107863, 100043, 21729, 3000, -2869, 30237, 72369, 121124, 125438, 142616, 113132, 116034, 124955, 125928, 154717, 208343, 204873, 203690, 251321, 232398, 248468, 230986, 186630, 217240, 190353, 159074, 197388, 222101, 283066, 230304, 188450, 148748, 126857, 125052, 163449, 185133, 210693, 211157, 287319, 293377, 242763, 239127, 331648, 424966, 492727, 551673, 575672, 534835, 417998, 277917, 214288, 206660, 240365, 263316, 315397, 323607, 234415, 259322, 249368, 237897, 228777, 183249, 181305, 203493, 199218, 161230, 152025, 185956, 187637, 170128, 155963, 157380, 229910, 245532, 262490, 260945]
17410B60945n6096k0382J2930J9141K5987K4823k9287j3552l755J5383K5952n9714
17398B02375k8921J2148k3873k9452r452p96K5076k7364k1429j5625K3108N4721
17386A60516L5921n5444n3722J5073l4468l9725k1511M601N0680q673K2654N3229
17374A29131J6732k5357k2422K6696k1652n1854k8446j2631M2743J7947l9404
17363C1483n0363K1130L8575L1790J4695R602J0936J3279n010l7063k9077j1196
17351C8781L6094L3604m419j6672K030K6323r261r784r951J0500k5382n9051M4292
17338E7104L1683N1270j8797l4878K2279M7934J9260J3775Q142k2862O573k4363
17326A57120p9361J623k1616J4591K5320k0955l007J4283n2413K8793N4792J1501
$$ y = [260945, 204849, 184467, 197397, 216538, 242525, 267348, 238061, 224509, 220754, 236137, 262089, 202375, 173454, 185602, 161729, 132277, 122825, 122029, 147105, 119741, 98312, 82687, 105795, 160516, 196437, 140993, 87271, 102344, 67876, 28151, 6640, 11241, 61921, 53248, 75902, 129131, 145863, 120506, 98084, 124780, 103128, 51274, 22828, 10197, 52940, 70887, 31483, -18880, 2250, 40825, 72615, 87310, 96912, 107848, 121127, 116117, 79054, 49977, 38781, 74875, 108479, 104060, 87388, 89418, 115741, 106480, 96696, 86745, 97245, 71863, 12812, 57104, 88787, 140057, 121260, 86382, 108661, 156595, 175855, 189630, 197772, 174910, 181483, 157120, 77759, 79382, 57766, 72357, 97677, 76722, 73715, 87998, 35585, 64378, 119170, 130671]
17314A30671J6193j1243P470l448L2761n3334o1063L7995j1641r00j1097n90L857
17301G5631N8462K1447Q632k7943n311l2796l437j8404k4379m5360j215O2098
17289F7425J4332j2807J1860K340k0228P159j5268J0580M6491L0961k70L5086
17277A77661K181k5597o2039q4279p790L4377N5684l0846l458l348k9174k3575
17265b03M1700N1618k3691k5970k5693m17J8473O4479O3681K2487o8815q5194
17253C2455n7776R908L0492O8575l945k3920m3119j2734j9038j0470O3107K8961
17241F2496O6469J4039l5102O267K0525j5991m4333P173k4321o5496n7902M7198
17229a8978M9183q387m2257K0864N496J6870O6063j6985K8421l996k3124l79L559
$$ y = [130671, 146864, 135621, 143091, 139643, 172404, 119070, 58007, 96002, 84361, 83461, 72364, 71774, 75631, 134093, 155540, 164172, 136229, 130918, 98122, 94685, 76281, 51902, 6542, 5327, 67425, 81757, 68950, 80810, 83150, 62922, 70081, 54813, 65393, 111884, 142845, 142575, 177661, 179842, 154245, 92206, 7927, 137, 34514, 90198, 59352, 55894, 52546, 23372, -203, 41497, 93115, 69424, 43454, 17761, 17344, 35817, 100296, 163977, 186464, 117649, 32455, -25321, -15413, 15079, 83654, 79709, 55789, 12670, -64, -19102, -29572, 33535, 62496, 128965, 143004, 107902, 114169, 134694, 118703, 74370, 81543, 57222, -8274, -66176, -18978, 30205, 21818, -20439, 425, 5921, 22791, 88854, 71869, 100290, 96294, 73170, 72791, 76350]
17216G6350L1092J3982k7975k334k8144l1738q927O7336L8079j4008J8043J0835
17204A42591J3653k6542l5782k7833o031K3918J5236L9517K3508q1583L671j4452
17192F9871k201j1369M9829M9968l3789m1953Q228K4182n610k5903k0440n0119
17180A0694l3173K0122m8345k5130K1854N4315J7737m7361L9659j5163J1369K983
17168I561J7584P849j2426k9081j185J7614K0838j7009l4343J2453J1018j7992
17156a5119j2897L8717J3720K1364k5940j455O7088n2612J7314j3820m2685L2471
17144B6146j9885N0496J2064J7209N2718p489k1502o6091n9834r3230J9267j2283
17132a02414l768L6771J0659L1596K1727K5144N2254l5856p3333Q9316M9935l9939
$$ y = [76350, 107442, 121424, 93449, 91115, 62971, 31233, 22306, 89642, 127721, 113713, 131756, 142591, 156244, 129702, 93920, 66087, 60056, 83974, 99210, 138727, 162235, 80652, 84323, 69871, 67670, 56301, 106130, 156098, 122309, 80356, 88584, 112766, 107156, 81253, 60813, 10694, -22479, -2357, -50702, -75832, -53978, 337, 18074, -29287, 10372, -4791, 6578, 9561, 27145, 34994, 22568, -6513, -7698, 9916, 30754, 13745, -20598, -8145, 2873, -15119, -28016, 10701, 24421, 45785, 19845, 18390, 85478, 32866, 50180, 36360, -6325, 26146, 6261, 56757, 68821, 86030, 138748, 131259, 109757, 43666, -16168, -109398, -90131, -102414, -106182, -69411, -58752, -27156, -5429, 19715, 71969, 36113, -37220, 52096, 102031, 62092]
17120F2092r4352m575J9037J1342L6962M1271j3525l2910K2610L7208k8892P11
17108E6979J1637l499o023k9993M6724N4697j4513m1792j6956K7K517K845k8280
17095C4370n1767m625O0894M7028k65l4413k5732j13050l0731L1173P9887Q984
17083A753K982P655K2000J8986N2832K308o3402k5831K5203k5667j4234L3878
17071C8463J865J3849k7039k0675M0727k0720l9839N390J4758N239q55k8282j0491
17058b7610K8909k9153o342L2499P169M7581j0393m1761l985J1987J5335K5236
17046D9472k0264l9790L3324j8931J5495J4974N069l6083j4661m7715l7488J1598
17034h5000k8146N3244R4249K9002o5982m2074K7567M5716m573M4924q481l6347
$$ y = [62092, -32260, -36835, -17798, -6456, 30506, 71777, 58252, 25342, 47952, 85160, 56268, 56979, 68616, 65117, 59094, 29101, 75825, 130522, 116009, 74217, 57261, 57288, 59805, 62650, 34370, -17397, -22022, 38872, 85900, 85635, 51222, 25490, -87560, -118291, -87118, -7231, 1753, 4735, 12390, 34390, 53376, 106208, 108516, 45114, 19283, 44486, 18819, 4585, 38463, 40328, 54177, 27138, 6463, 47190, 26470, -13369, -7979, 6779, 12018, 11163, -17119, -27610, 1299, -27854, -34196, -1697, 5472, 53053, 42660, 899, -3086, 8901, 24236, 49472, 29208, -10582, 22742, 3811, 19306, 34280, 39349, 3266, -11395, -59110, -96598, -85000, -113146, -59902, 34347, 63349, -2633, -44707, -17140, 28576, 24003, 68927, 60446, 24099]
17022B4099N170n06J1654m0804k8348J4514K2537M1456M6889L0181n0537J7393
17010I3698L6885J6376n3216m3640J2935l8528K915j2243j2679L8661J8080M5001
16998A04245k2137p154L2229M0199n286N239m623j6410j7969O4274o0976m4968
16986F6663l7311J5718L1533k2401j5646P579J0997m5709N216j9304O325J3449
16974A7109K6884K5090m4540q7749k0202L0979P389L5621K1416j0940K7743k0791
16962H009m1265l700o274j8896p789J630k79m5656J01251J0104l3747L242K3497
16949i873L0715N4386J8402J2660l0653p5691n7215J5880J20p848M7071Q426j1609
16936e229J6508L2713Q8178j2304r5713m6058L1275L340l3963k3363k5424L0260
$$ y = [24099, 29269, 28763, 40417, -387, -28735, -14221, 8316, 49772, 96661, 126842, 76305, 93698, 130583, 146959, 93743, 50103, 63038, 24510, 27425, 15182, 2503, 41164, 59244, 104245, 82108, 74954, 107183, 147382, 142096, 147335, 142712, 126302, 108333, 172607, 111631, 66663, 29352, 45070, 76603, 54202, 38556, 46135, 57132, 11423, 16639, -2665, 3660, 17109, 43993, 69083, 24543, -63206, -83408, -52429, -45040, -9419, 11997, 1057, 28800, 8009, -33256, -36956, -43230, -62126, -69915, -68285, -68564, -114220, -12969, -2865, -36612, -33370, -9873, 20842, 75228, 93630, 106290, 75637, -54, -57269, -41389, -41269, -49117, -2046, 6380, -5229, 11279, 43992, 132170, 119866, 24153, -21905, 9370, 12710, -21253, -44616, -70040, -39780]
16924c9780K4615L5899o834L7687J8641m9034l9646k1270k6948R895k3999k419
16912h3193k7156N1843R769J1743k1019K5708M1847J0960k1783j2675L0334M3130
16900E9508J0981j510k0658m986K452L761q527M932N3999J6515p8431n8180P667
16887a2477K8110J8525J8128P7192J0149M678l3911m7732J2061p2196k3748J0304
16875a0917M045m4557l9851m0872R407K8703P4697J16580N0229j6569j06886n0362
16863b6353K0182l1474O9570k9029p8189K2496K5438r327K7110K3676K5839k4000
16851A5939p465K9793n9708l3183K5190M7798K1O400l4861l1311M7713K8801M5282
16838H0409L3748k9732m7585M966J3184l4800K996m0345J8480M6495L9651j0796
$$ y = [-39780, -15165, 20734, 13900, 51587, 70228, 21194, -18452, -39722, -66670, -56775, -80774, -83193, -110349, -58506, -48737, -36994, -58013, -32305, 9542, 20502, -1281, -13956, 16378, 59508, 70489, 68979, 48321, 43335, 45787, 49548, 41021, 45953, 99952, 116467, 38036, -20144, -12477, 15633, 34158, 52286, 129478, 139627, 144305, 110394, 62662, 74723, 2527, -21221, -10917, -6872, -51429, -91280, -132152, -122745, -94042, -19345, 97235, 147464, 130895, 24009, -26353, -6171, -37645, 31925, 2896, -75293, -52797, -27359, -36686, -9576, 14100, 39939, 15939, 8474, 38267, -21441, -54624, -29434, 18364, 18385, 24785, -10076, -41387, 6326, 35127, 80409, 114157, 84425, 36840, 41806, 54990, 20190, 23186, -17159, 1321, 47816, 87467, 76671]
16826G6671n5231m3442k2410k7722L1149K4046j0875K940k9869l0041m8227L9149
16814i3862N7415M1463p392J0376K7944K7118q749o5528K71L1562r805k3327M5522
16801C3008Q1837j9172k4873M135n1686l6331J5835J341L0045J00142J2014j4927
16789A31368l9089J8455J1827k5561q166Q482l3316j4712j0711n5427j3349K9468
16777g31M3062m0608k0997K4014J0402L6714j1931l3739K7734m2826l5751M5233
16765E76L5215L2443K100m920n4125q5404m2953L716O4957N0530K3153M7267J0234
16752H2789l144q074j8894L785p873N851k556j6993J4052L5354m4658m6787n8311
16739f5459k7577M3112L9495p19J1281L5324J266k6007j12720L6384K8793J9097
$$ y = [76671, 21440, -22002, -44412, -72134, -40985, -16939, -27814, -24874, -54743, -84784, -133011, -93862, -36447, 5016, -2376, 8000, 35944, 63062, 54313, -11215, -10944, 20618, 10813, -12514, 33008, 114845, 95673, 70800, 74935, 23249, -13082, 2753, 4094, 34139, 134281, 146295, 131368, 92279, 110734, 122561, 97000, 88834, 97316, 64000, 49288, 38577, -16850, -30199, -731, 42331, 1723, -19274, 4740, 15142, 51856, 39925, 6186, 33920, -8906, -44657, 576, 35791, 68234, 70334, 65414, 11289, -74115, -117068, -113352, -48395, 2135, 25288, 72555, 82789, 79645, 71571, 52677, 56462, 48589, 54440, 51884, 34891, 48943, 84297, 39639, -7148, -65459, -93036, -49924, -10429, -11148, 133, 35457, 36723, 10716, -102004, -65620, -36827, -17730]
16727a7730J1638O421p322J263l6666j6379N6L5968J6827k2932n7057K2245M3608
16714b0060k1427O808r332k3964N3863K2104M3671m1433l9530l1034m8152K2620
16702h5866N0406k5225P65Q1795l560n47J415j0386J3482k249j3813k4396m5406
16689f3585J3627J9821k1395L1425N1939m9928k4746l90K8409J2279j098M1607
16677C7965J7883l1917n618l7703k4499O1240K3749k1686l8825j870Q7658K2056
16665H8433r6316m0660q194k0107J1169J7828O5836N0076l3588m6819j4775M5527
16653A8410o656j0922k3653J988L4489J7085l592j844J1595K2889k8491j2316
16641A8982o5844J7357K4234J3881N8576K6078m5103l7856l7977l9279J6353N3208
$$ y = [-17730, -6092, 329, -6993, -5730, -42396, -58775, -58719, -22751, -5924, -28856, -85913, -63668, -20060, -41487, -34679, -44011, -67975, -14112, 7992, 51663, 10230, -29300, -60334, -108486, -85866, -35460, -60685, -59920, 21875, 18315, 17768, 19183, 8797, 22279, 20030, 6217, -18179, -63585, -49958, -30137, -51532, -20107, 31832, -18096, -42842, -43232, -14823, -2544, -3642, 37965, 55848, 23931, 18313, -19390, -43889, 17351, 41100, 19414, -19411, -21281, 66377, 88433, -7883, -48543, -56737, -76844, -65675, -47847, 17989, 68065, 34477, -12342, -27117, 18410, 11754, 832, -22821, -20833, 13656, 30741, 27149, 25305, 36900, 59789, 31298, 18982, -46862, -29505, -5271, 8610, 67186, 93264, 48161, 10305, -27672, -66951, -50598, 2610]
16629B610o9742n211K7185J1380N9328M5359l2390o2106M782J1986L437k1270
16617b4652o9645m2864k217L2839N453M1669J9412m40j8699r554j0870m7941o889
16604a34398R4714Q4024l4092k3483l154P1367l8220r971N3767J8083r795J2457
16592H1299j2751l9854P760O1587K9037n4768l6132p4671l9298M3977M3709k346
16580G549K5430K4029L5990r9197n1672K754l3158k6738K3480K8817k6828k046
16568i1590p155J2731J3837L4408O176J3870M7637N425k8608l2914m9529m7419
16556a23131J6859L56J1905L8733M8954J8666J01196N8490m2648l4506o7252k9866
16544b244l1730L1799R3627Q483m6335k4317j6995L0585L3971r5861k1414K0868
$$ y = [2610, -67132, -72343, -45158, -33778, 25550, 70909, 38519, -23587, -18805, -6819, -3382, -24652, -94297, -137161, -139378, -106539, -101086, -59417, -40005, -40445, -59144, -68698, -79568, -127509, -134398, -39684, 44340, 10248, -13235, -16389, 54978, 16758, 6787, 60554, 78637, 68842, 81299, 68548, 28694, 36454, 98041, 127078, 72310, 36178, -38493, -77791, -33814, 9895, 7549, 32979, 57008, 92998, -6199, -57871, -55117, -88275, -115013, -91533, -62716, -89544, -91590, -98745, -86014, -72177, -37769, -31593, -17723, 29914, 35339, 6731, -26183, -75712, -123131, -106272, -105916, -94011, -55278, -6324, 12342, 113538, 172028, 129380, 94874, 27622, -2244, -33974, -2175, 91452, 99935, 53600, 29283, 12288, 42873, 76844, -19017, -40431, -19563]
16532a9563M5195K2826M9142R656o2746q615K4982N0905j2384r4310j5302J578
16520h636j8275j9208m5001l311K6175L7614l3457Q962N4851n3292j4842l347
16508g1767j6289K9666L7807N1372L3156l1942k1084J5434l9275k6131K2782K6110
16496I839j8370K9451k1753m8203M51l838M1052M5931J125k6716l4205J7987M594
16483b655k296l4877k3582K102M2890O0752l1338k3283J1438K1659J0316m8702
16471a7576j1158M0560l004r447n1127l8390j3614O7468M0761L0061J758J5035
16459E1327m1744J064J1347p736m4116K5178P9340L5356k7591l5043m4951M5219
16447D7650n4141k2979K6440L5698j8306n0826j6435j2477K9553P716K3513P3121
$$ y = [-19563, 25632, 48458, 97600, 107256, 44510, 35895, 60877, 111782, 99398, 5088, -10214, -8636, -26911, -46119, -91120, -94431, -68256, -30642, -64099, -55137, -286, -53578, -68420, -71767, -88056, -58390, -20583, 30789, 63945, 32003, 10919, 26353, -12922, -39053, -16271, 9839, -8531, 20920, -833, -49036, -48585, -52423, -11371, 34560, 35685, 8969, -25236, -7249, -2655, -4951, -39828, -63410, -61308, -18418, 42334, 10996, -12287, -849, 20810, 31126, -17576, -28734, 11826, 8822, -625, -51752, -90142, -103756, -36288, 4473, 34534, 36292, 51327, 9583, 10647, 21994, 14258, -29858, -4680, 74660, 110016, 82425, 47382, 2431, 47650, -6491, -29470, -3030, 32668, 14362, -36464, -52899, -65376, -35823, -28107, -4594, 68527]
16435F8527L9546L408n8570M403l151p276l7406J2214J7104m9424n4682J7557
16423d7750J0336J0262l480l0337J4647J2370J3381K7241J4556n244L7223M5833
16411I9038k2016k6916P871M0565m0838q082K7694Q456j5811k7698q6962J8122
16399b6577O3935q173n3030j625L4006L340k75n2319O001o472M161M0190L9875
16386D3037l100K7525l6769m7010j5860N903J5553K8742J5174j737k6569o2021
16374e7132m0038k8282M8199Q5539M0102J7943l20k5454l5536o1042r325k3138
16362h8484m1191K5439O5483L1228J7530J290L3572k2212J0977K5740l4189J5438
16350D0621P2787L542j22227l0561O3553K1017R019k0107m3232j4694J0262M1325
$$ y = [68527, 108073, 111481, 52911, 57314, 54163, 46887, 9481, 21695, 38799, -10625, -65307, -47750, -37414, -27152, -30632, -60969, -46322, -33952, -20571, 6670, 21226, 15982, 53205, 99038, 77022, 50106, 57977, 98542, 57704, 49622, 77316, 85772, 69961, 42263, -44699, -26577, 37358, 29185, -23845, -25470, 8536, 11876, 11601, -40718, -34717, -41189, -37028, 3162, 43037, 39937, 67462, 30693, -16317, -32177, -26274, -10721, 18021, 33195, 31458, 4889, -57132, -97170, -125452, -77253, 8286, 48388, 66331, 66011, 40557, 5021, -56021, -65346, -88484, -129675, -104236, -38753, -7525, 10005, 11295, 44867, 22655, 33632, 59372, 25183, 40621, 113408, 116950, -5277, -35838, 27715, 48732, 57751, 37644, -5588, -20282, -10020, 31305]
16338C1305R301n359q224j261j1291l6657j383O0702J5163m5166j6302K0916m903
16325F841J9184p636j9200l6435m1666J37793L9941r9662L4647k8232k1048k0610
16313c6083K5644O9755j4664o3885n2886K1054L9371M000k9935N0808M7952J7140
16301G8271J1298j6933n0028n999J4466P714j7254o1331j946O6414K6914L6539
16289H8125m4358j8987K6418j5545m1562k9353l3246L6869N9646r55K6373M069
16277E7494L375K3647J7542l0150p817l4303p9565k380L0039M9222R286p361J8759
16264D7788r117Q186K6925m9896M575j2890n1932k2184j0010P4928K0807Q181
16252C5361o7295k3101J6512Q234q205q545l4903J8697J5596L3407M7964L5976
$$ y = [31305, 40606, 35247, 27023, 25762, 14471, -22186, -23569, 37133, 52296, 7130, -9172, 11744, 6841, 26025, 18389, -811, -37246, -78912, 58881, 98822, -840, 33807, 5575, -15473, -36083, -10439, 59316, 44652, -19233, -72119, -51065, -11694, -7694, -37629, 13179, 61131, 78271, 89569, 72636, 22608, 16609, 31075, 38789, 21535, -39796, -41742, 24672, 51586, 88125, 43767, 24780, 51198, 35653, -5909, -35262, -68508, -31639, 28007, 27052, 53425, 57494, 60869, 84516, 102058, 71908, 64091, 29788, -49777, -52157, -22118, 27104, 36390, 29029, 47788, 38671, 46857, 73782, 23886, 28461, 15571, -36361, -58545, -68555, 6373, 27180, 35361, -31934, -55035, -38523, -30289, -38494, -47039, -81942, -63245, -47649, -14242, 33722, 69698]
16240F9698M379J8827K4286k6809l2856l1001K8419j9070j4361o1239l007K9771
16228a2963o997L1387l0919k7496J7683K0155N952k6664q54L3245j9101l7631
16216e4203M9697K1997K1796J1031m8592k928P508J6964M1192M7364K4098l2408
16204A03516j0288l7252j3892o996k1272K1237k0255n0667p16j0556K6469L2976
16192A2304J0994k6241n6213k6457K2361m319P4528L6243l1452K9011M1724l1946
16180E0537m5214k1404n524J9437o072l417k0729L6928K5178m1538j4448Q199
16168a8067k2903j4494l1958L713J2752n121m5029j1001N0487P2739m471M5388
16156C2035q117m2850K7988J5240O0364L0097n4350m4733m7743L4631k1351n5801
$$ y = [69698, 74077, 92904, 117190, 90381, 57525, 26524, 54943, 35873, 21512, -39727, -42734, -12963, -19960, 11427, -19492, -46988, -29305, -9150, -3198, -29862, -30716, 2529, -16572, -54203, -4506, 17491, 39287, 50318, 1726, -1202, 6306, 23270, 64462, 111826, 135924, 103516, 93228, 55976, 42084, 35088, 13816, 35053, 14798, -35869, -36585, -47141, -20672, 12304, 23298, -2943, -59156, -85613, -63252, -67571, 6957, 43200, 11748, 40759, 82483, 50537, 5323, -16081, -21605, -2168, -8240, -11657, -32386, 4542, 29720, -11818, -26266, -18067, -40970, -55464, -87422, -83709, -70957, -76078, -121107, -132108, -81621, -8882, -13353, 32035, 23918, -18932, 9056, 24296, 84660, 114757, 60407, 15674, -32069, 2562, -18789, -74590]
16144g4590k0025L330Q171O0666R667L5056j3937k4510n892O2376K9645k7649
16132D2308J5675l2862j11422L4427N2825L9609j9478m0869P966L310M3495l3886
16120A098j2641M5762O6075l5556m3864p681j9063p065j222m7296M7773o808N803
16107a4685L3529p336p547l0284J4876Q262n6286o3865L9783O0286j7908J1004
16095c0171L1509k9404r506k3870k6433L1606O46j9817M6625j0501k6608j0726
16083g6650J7241j7960k626P679p381L2836O6454L4292L4128r794k5585l1345
16071B1289l0173o4359O3333N3229r814K0535o5507q414m7703n778k2346R602
16059h6106l2885J3497J8534O4321K022J7964k4630l7292J2942N163k6218J4215
$$ y = [-74590, -94615, -91285, -83114, -22448, -12781, 22275, 8338, -16172, -22064, 40312, 69957, 42308, 57983, 25121, -86301, -51874, 951, 40560, 21082, -19787, -11821, -8511, 34984, 1098, -11543, 34219, 100294, 64738, 20874, 13193, -5870, -12935, -14157, -61453, -13680, -20488, -14685, 18844, 11508, 3961, -26323, -11447, -3185, -59471, -123336, -83553, -23267, -41175, -30171, 1338, -28066, -37572, -61442, -87875, -56269, -55623, -75440, -28815, -39316, -65924, -76650, -59409, -77369, -79995, -72316, -79697, -46861, 19593, 53885, 88013, 78219, 52634, 21289, -8884, -73243, -9910, 43319, 33505, 54040, -11467, -19881, -67584, -73362, -95708, -86106, -118991, -105494, -86960, -22639, -20617, -2653, -27283, -64575, -51633, -46470, -72688, -58473]
16047e8473K43J3423M3164k509R813j0770k3018k704J5120R192k4051K3134K6703
16034A9267j7148n9145j6250M9432L1775J9691l4416o3257L9467J5753p2083r897
16022i6811J3028M1321L3245p056l7128l214k9692p566O3928J4327l8638K5693
16010b8563n941M302K3248k46M2149L0485o962n2013l7213r324l6144M1000Q92
15997c4330M1967K579M105j018r353o2717K719L1941k3081Q62L4493P7902k2863
15984D3206j564J4926M960K1846m0953m2126m4253j7788J0545L4140K7320j1136
15972h77p1093J4512L3742k4873L2007j253L4048J9339p0204l7236K3164O4390
15960A5666m9847K0578J7711L699j5147k7107L2788L7869n9427k2148O0145q172
$$ y = [-58473, -58230, -44807, -1643, -4152, 5661, -5109, -28127, -30831, -15711, -6519, -30570, -7436, 19267, 2119, -57026, -73276, -23844, 7931, 27622, -6794, -70051, -30584, -14831, -86914, -96811, -83783, -42462, -9217, -16273, -53401, -56615, -86307, -93873, -29945, -15618, -54256, -28563, -34504, -30202, -6954, -7200, 34949, 65434, 58472, 6459, -30754, -40078, -76222, -35222, -34330, 7637, 10216, 14321, 13303, 3950, -58767, -56048, -24107, -47188, -46326, -11833, 66069, 43206, 41642, 56568, 61528, 83374, 42421, 295, -43958, -61746, -51201, -17061, 10259, -877, -71970, -57458, -23716, -48589, -16582, -17835, 16213, 35552, -34652, -71888, -48724, 15666, -34181, -13603, 4108, 7807, -7340, -34447, -1659, 36210, -23217, -45365, 14780, 6608]
15948F608L2153m3385J8152P388K2066m325K4975L5472L0952l5241n8645j3186
15936B2984j093m556N073J5712j9948n3157O0214J03804K5527p2939p8704m123
15924a206k4733L333J1166K0589P6135N1523j6545n2483p8204m5795M5422K9803
15912A9005M6240j2747q3489m3383M1835o860j9130j7726k0228L6452L8870K7248
15900F087L2670K2918P145n804N251l6500q922o096l2248J4055K3064k7914k3907
15887c0201J2087n282L7871M5103N944o5428o0971M2789l0410L8909R0968K1866
15875A03245j18396k0123L7726M625M99l5306j3095L280k5323p885L8714Q494
15863b3545n9066P757L7589J8980n1130m2671J4605J7137K4158j0786M983J4845
$$ y = [6608, 38761, -4624, 13528, 20916, 42982, 38657, 63632, 99104, 130056, 94815, 36170, 22984, 21891, 17335, 22408, 38120, 18172, -34985, 25229, 129033, 154560, 81621, 2917, -1206, -25939, -22606, -11440, 9149, 85284, 136807, 120262, 67779, -10425, -56220, -10798, 19005, 65245, 52498, -30991, -74374, -32539, -39399, -58529, -76255, -96483, -60031, -21161, 6087, 38757, 61675, 68820, 63016, 68267, 31767, 22845, 16749, -15499, -1444, 21620, -6294, -30201, -18114, -23396, 14475, 59578, 65522, 94, -60877, -18088, -48498, -9589, 81379, 103245, -15151, -35274, 2452, 7077, 7576, -27730, -40825, -37545, -62868, -70753, -32039, -23545, -82611, -74854, -37265, -18285, -69415, -112086, -97481, -80344, -56186, -66972, -61989, -47144]
15851d7144o767L5338m8259l9121O7075P6024L0405K3454m4260p213K7893l3814
15839C3611j6832M7425m5916J7161J4746k9561l4981j6629L2041J9520J7083K0724
15827E8392k3295m5233k5468M208k1880k8294L6753J3767k3837l55j2449R904
15815e7787L6644K7574n354r926k7782R072L355M1771j8002j5434L2550L7635
15803E4316j4285J8321p2437n7708l440L3626L8856P580k0504N0200M4995k3619
15791E5901m0765j8887L9401M5409j1562o7413l7994R85k6365j4407l5716M9506
15779f1907K469J3362L2945K7875r244N1466K8842m5438k1941k154K3122J3707
15767E3104P211o0428k3327j1311j4148L5725J0122l9902J0825J5757J8742N4452
$$ y = [-47144, -53911, -18573, -66832, -105953, -38878, 37146, 67551, 91005, 46745, 39532, 67425, 33611, 16779, 64204, 18288, 35449, 50195, 20634, -14347, -30976, 1065, 20585, 37668, 58392, 35097, -10136, -35604, -31396, -53276, -81570, -44817, -31050, -54887, -55242, -67691, -57787, -21143, 6431, 1077, -8849, -36631, -27559, -24204, 17567, -435, -15869, 16681, 54316, 40031, 58352, -14085, -71793, -75233, -41607, -2751, 4829, -15675, 34525, 79520, 55901, 15136, -3751, 35650, 81059, 69497, 2084, -35910, -34925, -61290, -75697, -111413, -61907, -59438, -46076, -13131, 14744, 5500, 56966, 85808, 40370, 18429, 16275, 39397, 53104, 60315, -113, -23440, -34751, -48899, -13174, -3052, -42954, -32129, -16372, 2370, 56822]
15755E6822L20p636o403j5400k234k5182N233m5004J9481J5797j7306K4957j9935
15742a6490j5792J4434O2405L2312Q763k1837j4372J8802n19K3713J0926p2588
15730B9757p7666m010l1433q93O2809J6202m4407j5482M6716K0301n7258r224
15718f4588L8451n1277j3608K2640M3163k0341j6986o255L8470R735l0180N2086
15706A310j8910o0925J528J1525N709k635M3608N9782l3799l2964K6914N7227
15694E8370M287J5892K3318l5986j0552K0334o6051m8334J9771L3827M924l6637
15682a6837K3728J430m7082j2391j4787M9631M1014J0327k717O410K6133l090
15670F1769m4663O880m393j00M55K772K2877l1564l8496k3886L8312K4575o911
$$ y = [56822, 57142, 49506, 43103, 27703, 25469, 287, 5520, -39484, -20003, -4206, -21512, 3445, -16490, -32282, -17848, 44557, 76869, 85632, 63795, 49423, 68225, 67706, 91419, 102345, 29757, -47909, -51919, -83352, -84245, -21436, -5234, -49641, -65123, -18407, 1894, -55364, -64588, -26137, -77414, -91022, -68382, -25219, -45560, -62546, -68801, -30331, -20596, -50776, 1310, -17600, -78525, -76997, -65472, -59763, -62398, -18790, 40992, 7193, -25771, 1143, 58370, 62657, 78549, 101867, 65881, 55329, 75663, 9612, -38722, -18951, 14876, 19800, -16837, 6891, 8321, -38761, -51152, -65939, -16308, 24706, 35033, 32316, 38726, 64859, 61769, 17106, 23986, 19593, 19493, 19948, 22720, 45597, 14033, -24463, -48349, -10037, 14538, 7627]
15657G627r0570o3097l121N0595j556J2761M961l1889k1824J5624Q3621K3727
15645a3141Q065j375L6615J8928N712j1337o8579K104P3688K9327m665l3744k6614
15632A4984K9754K3580o433k6185k2012j7071L924J0127l0227l6460J1243k5489
15620g0265M7838k7511K5912N1587N7856J344l3365n3232k6350p0343l418N1111
15608d8836K7813L9670K6844J2164n4823n4153M025K9562L7803J240l145n6807
15596c8643j4507L6135M0140j1112j4787m992l0664j817k9962q486M1917J1497
15584b5281k992j772K616k0404R243n95L4927r114j3648p510j6018K3536N4032
15571B7020K248k0877r9694j1340M4391n5j0379P8821k478m3182L6488l3054l0591
$$ y = [7627, -82943, -146040, -149161, -98566, -100122, -87361, -82400, -114289, -136113, -120489, -36868, -13141, -5076, -6451, 30164, 49092, 54804, 43467, -25112, -23008, 50680, 80007, 75342, 41598, 14984, 44738, 68318, 61885, 35700, 13688, -3383, 541, 10668, -19559, -56019, -44776, -70265, -22427, -49938, -24026, 27561, 85417, 86761, 53396, 164, -26186, -96529, -99947, -48836, -21023, 18647, 45491, 57655, 2832, -51321, -47296, -17734, 20069, 21309, 18164, -38643, -53150, -17015, 23125, 12013, -2774, -7766, -38430, -40247, -70209, -78695, -36778, -25281, -28273, -30045, -27429, -47833, -38590, -39185, -4258, -13372, -27020, -34530, -50548, -27012, 27020, 29268, 8391, -91303, -102643, -58252, -58307, -68686, 10135, 7657, -35525, 963, -32091, -62682]
15558f2682l952N65l8946L4862k6644q5068K7336O5638M0153M7299J0075n7810
15546d9174K521P8640M3231P886p0522p2887L2048K9923n782K2564k6883L789
15534d646L5075n4449o206j6914N738M5226m2509o956O342L1168K4110k1063n8264
15521f3348P891L6862l1562L245N1927l8440J0848J9715l4243L9365j3837K9700
15509A8123L7120J8503k8485J7209o2270p0151N8366L525l0446k7724j1442N6040
15497b1632R961j880N1919k429j7583j6905o7375o8296O4285N8942l5477n8332
15485a04802m082O651p715L0045J2446O3631l1011k0111M7523M340o232Q067l9671
15472d0921k4213l5921L1797l5198p0111M9566R7479L6431j9788R607j4792k7643
$$ y = [-62682, -66634, -66069, -105015, -70153, -96797, -181865, -154529, -88891, -48738, -1439, 8636, -49174, -46653, 31987, 75218, 83104, 12582, -60305, -28257, 1666, -4116, 18448, -8435, -4646, 30429, -24020, -30226, -47140, -41402, 3824, -38685, -45641, -39299, -8131, 15979, -5084, -63348, -55457, -18595, -50157, -46912, 5015, -33425, -22577, -2862, -37105, 2260, -11577, 18123, 55243, 73746, 45261, 62470, 200, -69951, -11585, -8060, -38506, -66230, -77672, -21632, -11671, -13551, 38368, 35939, 18356, 1451, -65924, -134220, -69935, -10993, -46470, -104802, -108884, -102233, -109948, -79903, -67457, -3826, -34837, -54948, -7425, -3085, -9317, -1250, -40921, -65134, -101055, -69258, -104456, -174567, -125001, -27522, 8909, -10879, -1272, -16064, -43707]
15460d3707K5607R505j2350N8944j0654m8429l7848l1017K6537P0772n132o0986
15448e8758j5687N0674R800n1797r06j3426K6109N0909N8873L5022j7768n3360
15436A9685j6920o6901k7336J7577J3720L874m2798J4171K2595J6307J6780k583
15424c1829j1487n731L4921N5447j1862l2944L8351m3737k847q29K2403L7146
15412D7002j0003m2618n0606j7346k361M5656j0841J487L507j3059J3699O884
15400b8599m7218j1315L6608K0048L8910n534j120m2649j9544N5024J4831j6851
15388g409L051K559J0140j3120j0212L5993l900l7974r532m3814M8202K9397m5461
15375d2080l1934O0202m1511n3739K3786L177L9815L5338M051l942j9264l782
$$ y = [-43707, -18100, -8595, -20945, 37999, 27345, -21084, -58932, -89949, -63412, 7360, 2228, -58758, -74445, -23771, -13971, -65768, -66674, -80100, -53991, -3082, 55791, 90813, 73045, 19685, 2765, -64136, -91472, -73895, -60175, -56301, -99099, -84928, -62333, -46026, -29246, -31829, -43316, -49047, -14126, 41321, 29459, -3485, 34866, -8871, -11718, -12547, 9856, 47002, 36999, -5619, -56225, -73571, -75932, -30276, -41117, -39630, -36123, -49182, -35483, -28599, -75817, -87132, -50524, -30476, 8434, 2900, 1780, -40869, -60413, -5389, 9442, -7409, -4358, -1799, 8341, -4779, -14991, 21002, 17102, -20872, -30404, -74218, -26016, 3381, -42080, -74014, -13812, -55323, -109062, -85276, -82099, -42284, -6946, -2895, -6837, -26101, -29883]
15363b9883m47N3284L4683m9092l7023J1572N8k4059O956j1443J4620N855O401
15350a8518j204q430J0421q628L1857J7113n8260K1542N1650p75l7106O341O8101
15337G4104m0508j5972o4579R550K8506n131K0056j8048n1345m3938O3239P347
15325c6719l8539K7642M9918l763Q951N8287M3725K8950j3312k3586l6131K0287
15313H5710k3908l2080k7239j2608K3550q580K8403J7920k9409j834J7024j0252
15301B6697k2972m3691k8991K2545J6329M7740Q577m8685j9729J5391K7284L011
15289C506l9323m514K2159j8995J6968m7081j8539J0827L8799m887P210K0606
15277a3264M263k8117N496L4086N6050k906q4237l2197J3198m531J4918K1396
$$ y = [-29883, -30330, 22954, 57637, 8545, -28478, -16906, -16848, -40907, -33951, -45394, -30774, -24919, -18518, -19722, -28152, -17731, -26359, 5498, 22611, -35649, -14107, 37543, 36768, -338, 6003, 74104, 33596, 17624, -46955, -37405, -8899, -14030, 6026, -12022, -63367, -107305, -44066, -36719, -75258, -47616, 2302, -1461, 7490, 65777, 109502, 138452, 125140, 101554, 65423, 85710, 61802, 29722, 2483, -10125, 13425, 4845, 33248, 51168, 21759, 19925, 36949, 26697, 3725, -39966, -68957, -46412, -30083, 17657, 26234, -22451, -42180, -26789, 495, 3506, -35817, -40331, -18172, -37167, -20199, -67280, -85819, -74992, -36193, -41080, -33870, -13264, -9001, -37118, -31622, 2464, 58514, 55608, -28629, -60826, -47628, -52159, -37241, -15845]
15265a5845J1286j4863o5516L3277O1675L7571L3974P992j6670J5182P271p2974
15253B2360m0686j4118l1596j7923K0899k5276j9531M3790O9144m6745j5833K7212
15241b8303M9043L009k2718n151k5308K9819K0409L4677j788k5772J6008l5137
15229H788l0879K4045J8618m5261n4362J2729M9909r182j6468m6291N535N4422
15217b8397M5830j2419m0658J379k3537M1519L5242k4176l0067K734K5150j3730
15205b1130k4186J2223L6424L7667J9538m9104n7579m4227k5658M6052O0641j730
15193a1069k6848O783K0820Q4312j3996n7129n5482n6466J2846J08434N8475N243
15181G5923j4793k1886r4858P127L1033k4973N671j2347j9445L2263o303J9230
$$ y = [-15845, -4559, -19422, -84938, -51661, 10014, 47585, 81559, 89551, 72881, 88063, 95334, 22360, -18326, -32444, -64040, -81963, -61064, -86340, -105871, -62081, 7063, -39682, -55515, -28303, 20740, 23749, 1031, -4120, -29428, 391, 20800, 55477, 53689, 27917, 43925, 8788, -22091, 1954, 20572, -24689, -79051, -66322, -16413, -25595, -42063, -88354, -82819, -28397, 17433, 5014, -35644, -34265, -57802, -16283, 18959, -5217, -35284, -32550, -7400, -21130, -45316, -33093, 3331, 40998, 60536, 11432, -46147, -90374, -116032, -69980, -9339, -11069, -37917, -31134, -10314, 73998, 60002, 2873, -52609, -109075, -96229, 12205, 70680, 75923, 61130, 39244, -55614, -48487, -17454, -42427, -36756, -49103, -68548, -36285, -42588, -23358]
15169b3358L4159j4297J4106K3851j4285k9871n2433R808L4859J3953M226J1387
15157A2105m0554r546k093J0087K7844M3452l3388m2583m7068K5852N5785R9396
15145I9289J1585J4389n8154m0452m2762o177j4544M387K7758K3502j9829m8511
15133d9519k2327M5346N201M745k5568l2269q231L3772L6718k7569l4382J1973
15121f2110k1568J6462M2660l6053q022K2517j2124M8568L1867K3454l486L3147
15109G5312l4461n9397J719K6427K4062n277k0943o7353l2528J6692L4255K4514
15097a6978L0943k6374J7862J2021j5230j2848l1341O8363O403m0189k5913L1671
15085a610j3963J2336K9268j9412m4617k8283r624L298J4670j8000l0931N8617
$$ y = [-23358, 10801, -3496, 10610, 34461, 20176, -9695, -62128, -52320, -17461, -3508, 718, 12105, -28449, -37995, -40088, -30001, -2157, 41295, 7907, -34676, -81744, -55892, -107, 99289, 110874, 125263, 67109, 26657, -16105, -22282, -36826, -32439, -4681, 18821, -1008, -49519, -71846, -26500, -21299, -16554, -42122, -74391, -82622, -48850, -12132, -39701, -74083, -62110, -83678, -67216, -24556, -60609, -68631, -46114, -58238, -9670, 22197, 45651, 42165, 75312, 40851, -18546, -16827, 9600, 33662, 28385, 7442, -59911, -92439, -75747, -41492, -16978, 13965, -12409, 5453, 17474, 2244, -10604, -41945, 26418, 32821, -7368, -33281, -1610, -15573, -3237, 26031, 6619, -37998, -66281, -75905, -72607, -57937, -75937, -106868, -48251]
15073d8251L2926K2275l435j99n5034j3197J3556j708l1377k9801O1576M4056
15061h613k4205j914K8058P2530m0290q2285j8201M409P882K5309N3936K5241
15049D1857J4016p935l8717m9230K6160L455l3112q895k9747j7938L8837J0942
15037e0307K7022J8175j7469n110M3238K389l4459M307k2744J0954J4270l4676
15025d4410O364k1010j3447j121R6576N8196m5702m6684l473L479j9050J6249
15013a4033M6909l0844n0272j3033l8204J2820N3650O0669q764k6336N491l6763
15001c8710J1828m349o1330m3776L3583N0179P4372O438N821k321p0071O653L0525
14988a158J6666n2934j6254L3416K5147K9992m5789n3123J7858R019j7069n2123
$$ y = [-48251, -15325, 6950, 3515, 3316, -51718, -64915, -51359, -53067, -84444, -114245, -52669, -8613, -32818, -34732, -6674, 65856, 25566, -56719, -74920, -70511, -62629, -37320, 16616, 41857, 55873, 47938, 9221, -40009, -13849, -10394, -43506, -52401, -82148, -100086, -61249, -50307, -23285, -5110, -22579, -27689, 15549, 17938, -16521, -12214, -34958, -24004, -9734, -44410, -38046, -59056, -72503, -73624, 22952, 81148, 35446, -11238, -14711, -11232, -30282, -14033, 32876, 2032, -48240, -61273, -99477, -86657, -33007, 27662, 18898, -7438, -1947, -38710, -26882, -31231, -92561, -136337, -102754, -52575, 21797, 28235, 34056, 31735, -38336, -31683, -1158, 15508, -37426, -53680, -20264, 4883, 34875, -10914, -64037, -46179, -37160, -54229, -106352]
14976a06352K5084P5609l534n9553K2220K6577O2391n6400l6108J1833k099J671
14964c8661M9455L3103n1226j1200L6017k1372m0520m6036P5396K8979J6477k9227
14952A185o3012q575j5926R305O3524n51m3125o1135R800M5901O2120K1460K957
14939B3928k543L7271n0169r9705o1455J05331R1750l39o051J9870L5335M5278
14927A38501R1318O9936N2875K7521j18253o2190n4949l2517O615J0849k4952
14916A04754n2754l5285l189q3057l0509K4174m7050n727R0274M2095P809J6689
14904B8224k0182k4978j4550M0730l0875O319k3557L3542k0214p682M1724m8246
14892c9745n0989O2499L9403l8146m9914j3961O356K9186j718j2675l1334k5113
$$ y = [-106352, -81268, -5659, -9193, -68746, -46526, -19949, 42442, -13958, -50066, -38233, -40332, -38661, 10794, 43897, -7329, -18529, 17488, -3884, -44404, -90440, -15044, 13935, 30412, 1185, -61827, -70402, -86328, -77023, -13499, -14050, -57175, -118310, -108510, -62609, -489, 20971, 23928, 21385, 58656, 8487, -91218, -152673, -47342, 44408, 44069, 38018, 57888, 93223, 138501, 229819, 299755, 352630, 380151, 261898, 199708, 144759, 112242, 118857, 129706, 104754, 52000, 16715, 13526, -69531, -100040, -75866, -122916, -128643, -38369, 3726, 11535, 28224, 8042, -16936, -31486, 9244, -21631, -15312, -38869, -5327, -25541, -33223, 8501, -39745, -90734, -28235, 11168, -26978, -76892, -90853, -84497, -55311, -57029, -69704, -101038, -126151]
14880a26151L1102L6254l984K2393n955N2794l248m6113l7064n351K8887M0961
14868a5475M7585j7909j1890O751N133L1374l6103n3377r212K468J8397j1313
14856d3571p1666m7118L6970O7281J3737q91J8875n918l0K9844l2508m4040J4083
14843f4952m228J9270M824M81L4609L5076J6782j9818O678N2754O3868n2659m9524
14830D3161K8570J4847n4306l4071k9655q393R669o401K4822m2762n826L1298
14818b9047K4594Q32l7808p9487P491Q1174j9261p5089L0073J0639k4970J2261
14806i8598O4591L3161K3632P527k272j265m0079k4026m9047K1819N9560j4175
14794a9172Q747O1308O218m0149k7147l0027P048K6872L465J4062o644l8472j9075
$$ y = [-126151, -95049, -58795, -62779, -40386, -46341, 6453, 3205, -42908, -79972, -85323, -56436, -15475, 32110, 14201, 2311, 9062, 14195, 45569, 9466, -43911, -53123, -50655, -32258, -43571, -115237, -162355, -125385, -58104, -44367, -45258, -26383, -32301, -32331, -2487, -34995, -79035, -64952, -69180, -49910, -45086, -44605, -9996, 25080, 41862, 22044, 28722, 81476, 145344, 92685, 43161, 71731, 86578, 32272, -1799, -31454, -39847, -30178, -36579, -11757, -54519, -60345, -29047, -4453, -3621, -41429, -120916, -113425, -32251, -51512, -126601, -96528, -85889, -110859, -98598, -34007, -846, 22786, 30313, 28041, 26776, -13303, -37329, -86376, -64557, -4997, -19172, -10425, 50883, 57101, 16952, -10195, -40222, -33174, -6302, -2837, 11225, 4581, -33891, -52966]
14781e2966j1128k4346P538M5462k7031r045m2377J2377J6415K2572L9818k4095
14769d6806j0978L460m655K7617J1772m0429m7114k3196M6945K8906J6768l841
14757d1551O148M88p0806M352M8409j7067K5083O1197K403k0507j8125k4055l8031
14744h2062J4617J6050N0569J715k455J3291k2810j4313J942j1440l8241p026
14732h0163K8714k909m600j2661k9381J8301R8494N0128j3926J5551j0899q110
14720D8539l3329K5140J2811l5959j9929q549N569n390M1122N0613o7138l2706
14708a9206N4013K1976k8093j1920K0647m5665k8165j0191n0095K168J0328j2131
14696i6334J3620O1830O9596j5503j0848K1455J3693o6502n3322L2648L2524k8359
$$ y = [-52966, -64094, -88440, -80902, -35440, -62471, -71516, -113893, -101516, -85101, -62529, -22711, -46806, -57784, -54324, -58979, -31362, -19590, -60019, -107133, -130329, -83384, -54478, -37710, -41551, -35403, -34915, -105721, -101369, -52960, -70027, -44944, 16253, 18656, -1851, -19976, -44031, -82062, -67445, -51395, -826, 889, -1566, 11725, -11085, -25398, -23456, -34896, -73137, -80163, -51449, -54358, -58958, -71619, -101000, -82699, 15795, 65923, 51997, 67548, 56649, 48539, 15210, 40350, 53161, 17202, -2727, -11276, -5707, -11097, 30025, 80638, 13500, -19206, 34807, 56783, 28690, 16770, 37417, -8248, -36413, -46604, -96699, -94531, -84203, -96334, -82714, -20884, 48712, 33209, 22361, 43816, 57509, -8993, -62315, -29667, 2857, -25502]
14684b5502p790k5328Q2034M4208n617l7699o5159j8789n2890r010R5917M2106
14672A6481j9310j7635p464m0370J6851n0426mM8386K013K7053J6771J2966M7231
14659E2543K8652j01842j1643j6484l6621O737j8135L3558J0337J0042J0322j3795
14647d6329L2551j8206J2240p576l2418n1578J5291L2656M2723P959Q0061K0994
14635H8368m8512l6476J546J6726k8273p3192O9338O3517n0288j1845l4210M043
14623c9258k6179J4094j5321r531O0713N3398k7941l4784L7059j1877n8301K591
14611e5337M9825O2324O29l1912j8205k2498J4182j2705l7380L015J4751l2903
14599f6214J7333L3897o334l5841J1862k7793M369L5735m4645N054L4731j3709
$$ y = [-25502, -33292, -58620, 23414, 67622, 62005, 24306, -40853, -59642, -112532, -121542, -25625, 16481, -2829, -20464, -27928, -68298, -51447, -101873, -101877, -53491, -51478, -24425, -7654, 5312, 52543, 81195, -20647, -32290, -48774, -85395, -78658, -96793, -63235, -52898, -42856, -32534, -46329, -13778, -31984, -19744, -27320, -59738, -111316, -96025, -63369, -20646, -12687, 67374, 88368, 39856, 3380, 4926, 21652, -6621, -79813, -10475, 53042, 2754, -9091, -43301, -39258, -65437, -51343, -66664, -76195, -15482, 37916, 9975, -24809, 12250, 373, -57928, -55337, -5512, 56812, 57441, 25529, 7324, -15174, -992, -13697, -51077, -48062, -33311, -66214, -48881, -14984, -21318, -57159, -45297, -73090, -68721, -32986, -77631, -72577, -37846, -51555]
14587e1555o5710m2974L5039L2478k364j2753l9423l8312O8400N6224L7528k811
14575b6233m375k5292K9013K0843j7898J986n3630l7787K2112j0012k2794O7735
14563e6332N8084M6865Q1909m896n3029m9235j8194O841K0264k4184l1017l9703
14551f2627k2879M2263m5556N3070l624J9133k6760n7167K0266M5333M3153K1307
14539B5912j2887k9984l4620L589O9871J4144k4110r2849j6792L3900N293L8300
14527b0233K8051o780p1041k7167O429N759M4533M7188J5994j8029O065j2052
14515a283J1158q5213L3973O5587q424o9000l8090O922L7180R085j3227K1324
14503c0008k1143m7873K2004K4060K9928l266j0259R629j7993q8892l0585L4112
$$ y = [-51555, -117265, -160239, -125200, -92722, -95086, -107839, -147262, -185574, -117174, -60950, -23422, -26233, -30608, -55900, -26887, -6044, -23942, -21956, -75586, -113373, -91261, -101273, -124067, -56332, 1752, 48617, 130526, 125630, 72601, 23366, 5172, 12013, 32277, 8093, -22924, -62627, -85506, -43243, -88799, -35729, -39353, -20220, -46980, -104147, -83881, -38548, 4605, 25912, 13025, -16959, -51579, -47990, 21881, 36025, 11915, -80934, -97726, -63826, -58533, -20233, 7818, 1038, -70003, -97170, -90741, -84982, -40449, 6739, 22733, 4704, 10769, -1283, 9875, -75338, -41365, 24222, 15798, -53202, -91292, -84370, -47190, -38105, -51332, -30008, -51151, -99024, -77020, -52960, -23032, -26298, -36557, -26928, -44921, -133813, -164398, -130286]
14491a30286J0812M3212L2455R070K4011K206K664P040m9739K1619L0989J0225
14479A4278k4046O055O8621j7049K1054L0522o5517m0449q843k170N7126K7864
14467F7446k5874l3243j057j3382j5425O120m4779n4405j5296q206K0205M3013
14455g4883L7034Q728N9542K9623m7470m4670m0819K380Q7356L8867l1714k3191
14443G83N4067j3431J1948J0275p4468n4124p394N3061l1833J3407M0434q788
14431f063n0791j0276k4315j5344L1383K1160J2302l0986k2401O129J2232L329
14419g3641k1654O891J5743j0435m567J2162j525J429P687m2834k6647N2422L1994
14406e2975M8534J2227m1735o4586k2862K7442N2110N6827K6672j704o4782l5421
$$ y = [-130286, -119474, -76262, -43807, -34737, -10726, -8520, -5856, 1184, -48555, -26936, 4053, 14278, -9768, -3713, 64908, 47859, 68913, 99435, 33918, -6531, -15374, -17544, 39582, 67446, 41572, 8329, 7272, -6110, -21535, -15415, -60194, -114599, -129895, -138101, -117896, -74883, -37849, -29121, 30421, 60044, 12574, -32096, -72915, -70535, 16821, 55688, 23974, 783, 54850, 41419, 53367, 63642, -10826, -64950, -72344, -19283, -51116, -37709, 2725, -6063, -56854, -67130, -91445, -106789, -75406, -54246, -41944, -72930, -95331, -89202, -76970, -73641, -95295, -88404, -72661, -83096, -87663, -75501, -77026, -75597, -67910, -110744, -137391, -84969, -52975, -4441, 7786, -33949, -98535, -121397, -93955, -41845, 14982, 41654, 39950, -24832, -60253]
14394f0253O3273O198n254N388K6938j6706j1615k51M904j6880m0187J919m452
14381d6978L2824n171k5102p274k3050M849k4N753J9509n2456M2866j3665K0907
14368d7012k0578L4738l7385M294M240J4863J4084m733l6382m1045n3795N0285
14356a18426O6628K1248o7695m0092Q0423M0217L2267l1597o192N1690k4616l6008
14344c2153J7463m1117j0578J2095K5364q886K7500m877l3715o3853M4232k4774
14332i3299j466J5924P6374M5860J686j7512l7062J985m7137m7375p438P1172
14320c8288J3034j816m6615O428L0807O7829J4289n1603q3386J5882L2256j422
14308d2605j1393K5643N1719K4505q252n5041o307J4036O188K3048p7192l3403
$$ y = [-60253, 3020, 9218, 3964, 9352, 36290, 19584, 7969, 7718, 12622, -4258, -44445, -42526, -46978, -14154, -19325, -44427, -51701, -74751, -69902, -69926, -64173, -44664, -97120, -54254, -67919, -47012, -67590, -32852, -70237, -65943, -61703, -46840, -32756, -37489, -73871, -114916, -168711, -118426, -51798, -30550, -98245, -138337, -57914, -17697, 14570, -17027, -23219, 28471, 3855, -32153, -14690, -55807, -66385, -54290, -28926, -37812, -10312, -15189, -48904, -112757, -68525, -93299, -94765, -78841, -2467, 43393, 45079, 27567, -9495, -7510, -54647, -102022, -109460, -38288, -25254, -27070, -73685, -67257, -36450, 31379, 45668, -5935, -89321, -73439, -41183, -42605, -53998, -28355, 23364, 47869, 39617, -15424, -21731, -7695, -1507, 21541, -55651, -89054]
14296h9054k5141m7238J0351M2078l82K5658L7928J4729K9899K9283j2263l9214
14284b3366k0995o270m2905N4751M1225m916j4707k7065M1663K4663j3098L2389
14272D1369k3006o5084K453N5858k2027j5959q79n6140o767l040p570K9153J5086
14259e6553m6044L3846L1402Q165j057K0325j0146L6854k3006q1314L0630L735
14247e3163o385L7263M3919n7041q315k0559r319K1779J2261j1135o6192q958
14235a25845n3395R7385O7324l6712K2740j0955o6219R568J2830J3888j5827n2688
14223a37906m156R811N4221P0881L4004n1899j5170k6908j9043O3977N3865k3970
14211G707M1731l3896n2047p6693k0627K9815O9601J9623J264J6291M6603K9104
$$ y = [-89054, -114195, -161433, -151082, -109004, -109386, -83728, -45800, -31071, -1172, 28111, 15848, -23366, -44361, -50631, -93536, -38785, 2440, -2476, -17183, -44248, -2585, 22078, 8980, 41369, 18363, -46721, -44268, 11590, -10437, -26396, -27275, -83415, -90182, -93222, -100792, -71639, -56553, -102597, -68751, -37349, -29184, -30241, -9916, -20062, 16792, -6214, -87528, -56898, -53163, -59548, -22285, 21634, -35407, -43722, -64281, -73600, -51821, -39560, -50695, -116887, -125845, -179240, -81855, -14531, -51243, -28503, -39458, -105677, -96109, -83279, -69391, -85218, -137906, -142062, -132251, -78030, -7149, 26855, -25044, -40214, -67122, -86165, -22188, 31677, 7707, 49438, 15542, -36505, -113198, -133825, -104010, -34409, -14786, -13522, 2769, 49372, 78476]
14199G8476l4922n2785l7046N33O567j0623O918N0885q562p6711R39J8890k0025
14186g7466L5155j5255l3973R414j5601k1637k1744P2446N191N253J356l0467
14174h7328j0348O3467K7875R936K5053R62m0434l1655K6259J1294N1182k7571
14162A8692o0390P342k1602N720k5241m263r316O004J1951L8568P2305J2898l8729
14149A3939m4157K3873K4736l5658n8390O9047R2769j8066p8621o8190R503P235
14137f1980M3047l5431k8648K9468K350M9360N0600r659j859k5665m2267p1573
14125a02257k0712K3579O542N8476m064Q129j063M1031J4424o3127j4766N5075
14113A267M4843k6815m5928o9318j5432J5034M4788K7383o786p5979o2372o823
$$ y = [78476, 43554, -9231, -46277, -45744, -39177, -49800, -42882, 8003, -559, -77270, -76331, -57441, -77466, -42311, -57566, -91539, -82125, -97726, -119363, -141107, -68661, -63470, -58217, -56861, -87328, -97676, -34209, -6334, 3602, 28655, 29617, -10817, -42472, -16213, -4919, 46263, 18692, -41698, -34356, -55958, -50238, -75479, -79742, -89058, -83054, -71103, -32535, 39770, 52668, 13939, -30218, -6345, 18391, -17267, -75657, -6610, 86159, 68093, -10528, -78718, -69215, -61980, -18933, -54364, -83012, -53544, -51194, -1834, 48766, 39107, 37248, 11583, -30684, -102257, -122969, -99390, -92848, -34372, -38436, -30307, -31370, 9661, 24085, -39042, -53808, 1267, 46110, 19295, -26633, -95951, -111383, -96349, -51561, -24178, -30964, -106943, -169315, -176138]
14101a76138P2248N3782k2014k2262K3782R64q554L7534J0672m5921o841N8726
14089b4022N3345P894l0273m43n8506K3561J01k3288j9983J0256M5142L6369n3335
14076c3182K422M7295j288L2293K3665p3565J2810J7336K1640l1313m9486j7624
14064d8997K2031j0697j3791J4092o237o7215j4912L8572M12J9561L4261O506
14052b6414K9566J0718k1243l7207M636P2137M7310m1665K33k6637o2195K2809
14040b7952L634K2418j8402k0145j4401N499L0267k6673k5825P1985k0456j5985
14028c6036j4304k3492r015k8744J7356j00m3286K1627Q6585K7346L151q251K1755
14015A4592n5998k3276M5772M707m1739j4983P13k2920k3745m838j8393M3441
$$ y = [-176138, -103890, -50108, -72122, -94384, -70602, -69638, -78192, -40658, -29986, -75907, -82748, -24022, 29323, 37217, 6944, 6501, -52005, -28444, -28343, -51631, -71614, -61358, -16216, 20153, -33182, -30760, 16535, 15247, 47540, 71205, -2360, 10450, 27786, 49426, 18113, -31373, -48997, -26966, -37663, -51454, -37362, -43599, -110814, -125726, -87154, -86742, -67181, -32920, -26414, 3152, 13870, -7373, -44580, -39944, 32193, 79503, 37838, 38071, 11434, -50761, -27952, -24318, -1900, -20302, -40447, -54848, -49349, -19082, -45755, -71580, 405, -20051, -36036, -50340, -73832, -82847, -111591, -94235, -94335, -137621, -115994, -29409, -2063, 1088, -7163, 14592, -41406, -64682, -18910, -14203, -55942, -70925, -70212, -93132, -116877, -121715, -140108, -96667]
14003i6667L9178j0470K6503l6000k6197N9941L3617j9680j5655l3347n9867p857
13991a46501N1265l951K638j9082k713L6019j6961M3036r653j7315J964M1465
13979c9789K9038J0259m9255m7279L7964M4331O313L030p470p084J1142k4929
13967c3729R188J7184J2468j7130o7102l7647o445P992k7802R461J2649N0502
13955g0411r883L2860K7885K1282j9847N2954J4151k3324j4400M050J8878k3750
13943A0445m5927j240M002p74p523O060k5283l0969J44Q470k0253o978k9152J7446
13929a21532J891J778R3337O6149k9264J7528r591l0997j5074O460M4825J70K4134
13916D9814K1096k9457j416j1206k0423J9604L7442l2336l9607o0714k4404K6103
$$ y = [-96667, -57489, -67959, -41456, -77456, -103653, -43712, -10095, -29775, -45430, -78777, -138644, -146501, -95236, -99187, -96549, -115631, -118344, -82325, -99286, -56250, -65903, -83218, -81254, -39789, -10751, -492, -49747, -97026, -59062, -14731, -8418, -5388, -12858, -19942, -8800, -33729, -24541, -7357, 5111, -12019, -79121, -116768, -123213, -115221, -143023, -133562, -120913, -70411, -80294, -47434, -19549, 1733, -18114, 34840, 48991, 25667, 11267, 15317, 34195, 10445, -35482, -36722, -32720, -33494, -41017, -34957, -60240, -91209, -91065, -82595, -102848, -109826, -138978, -121532, -119641, -117863, -24526, 41623, 12359, 29887, 20296, -10701, -25775, -19315, 25510, 25680, 49814, 70910, 41453, 40037, 28831, 8408, 28012, 65454, 33118, -6489, -67203, -91607, -65504]
13904f5504M4560N9148Q335m1869m8369K7185k890m2860K9738K0900j7011r882
13892c8519m5146l7922L683J2720J9343p74L2309j7132p2743n0136l3083N6904
13880a70496J02627L8498R050j6679k7188L9367L3444q342l9435n6657K7920k785
13868g0676J713j6065l6913k341J6016K6326k4956p9500r124O5963K3718J1046
13856i4793K8817K4894o003K5936k5408j6115J4929j1262J4326k5968n1306l9343
13844a61296J9791N7971j0514K6005l667K331j2611K3569J7032m05K8202j0601
13832b4193k1349k8725k2855K6515O1524K1924M152J639J2185l8108q2489k4718
13820a14498J778n312n3879k7702L8437M7541N0652N3815K0066m7400n028o7785
$$ y = [-65504, -20944, 38204, 46539, 4670, -43699, -16514, -19404, -62264, -32526, -11626, -28637, -38519, -83665, -121587, -117904, -105184, -85841, -86615, -54306, -71438, -144181, -194317, -227400, -170496, -67869, -29371, -20321, -37000, -64188, -24821, 8623, 281, -39154, -95811, -67891, -70676, -68963, -85028, -121941, -124282, -108266, -81940, -106896, -186396, -195520, -129557, -105839, -94793, -65976, -41082, -47085, -21149, -46557, -62672, -47743, -59005, -44679, -70647, -121953, -161296, -141505, -83534, -94048, -68043, -71710, -69379, -81990, -58421, -41389, -41794, -13592, -24193, -45542, -74267, -97122, -70607, -9083, 12841, 16993, 18632, 30817, -7291, -89780, -114498, -112720, -118032, -171911, -199613, -161176, -113635, -62983, -9168, 10898, -36502, -41530, -109315]
13808a09315l7674K4279J3787N1375M9324j3326j8850o929P2320O673j7581k8512
13796a4429m1632k6758n8601N815P1079K3119J8167J7148k034j950L2508k9826
13784g394J2145L4989M2871m2915j11252k2259N1568N1651K1266l90R139j8797
13772B0622m0021M810M800l4880j2694J2545k5124l052N0496K6677m5113n3322
13760i4256m716L1892M8357p946L6344N168n6289l7662K4502J0089n0152j5497
13748a10166L3524J2412j220J2138j1352m8065L1995M9553M3890l5890k0094J5137
13736b8138L9030j3588r562M3704J979p9895J9700K981Q325K1294k12M15o470
13723d37r293k351l1906m720L1380j76L5595p0780n594N6205p8411n0611J03021
$$ y = [-109315, -146989, -122710, -108923, -57548, -8224, -21550, -40400, -47329, 24991, 31664, 14083, -14429, -56061, -82819, -141420, -135605, -64526, -41407, -23240, -6092, -8126, -10076, 22432, -7394, 4751, 39740, 82611, 39696, -71556, -93815, -42247, 9404, 30670, 30280, 39419, 20622, -19399, -14589, -9789, -44669, -57363, -44818, -69942, -72994, -22498, 4179, -40934, -94256, -98972, -67080, -18723, -26669, 9675, 14843, -41446, -79108, -54606, -44517, -94669, -110166, -76642, -64230, -65450, -53312, -64664, -112729, -80734, -31181, 12709, -23181, -43275, -28138, 10892, -2696, -12258, 31446, 33425, -46470, -26770, -23789, -15464, 5830, 5618, 6033, -437, -9730, -12081, -43987, -48707, -17327, -17503, 18092, -52688, -58282, -2077, -80488, -131099, -28078]
13710b8078O4040K1792R407J990l7590j4599K9657j001n0919L2665p2960k8436
13698g4032K7578M1704n2766l6570p343K1915J3357Q648L293L6467m2087M3689
13686a6147L5450K4759k1247m7865l6293n931l898L263O4728J9880K124M6882
13674F5705k1390q3992j5881M6586q8893J5921L9536l0605K4600j8135O9222M6593
13662D9267k6823n5586n5027r817N5302k030l5057m4596m951K1449J9363M8453
13650d0053L7232J7917m7334k4397j8543k9759J8101J4161Q789K9199L094m375
13638c5968n3673q4943l9189k760r600J13933O9178K6829p5040m7145m172M1860
13626a00690O914m41j6682N714J7617J7210L3318m469n428M3558M7235l374m2782
$$ y = [-28078, 35962, 57754, 67161, 69151, 31561, 16962, 46619, 45618, -5301, 27364, -45596, -74032, -46454, -4750, -57516, -94086, -101429, -79514, -66157, -57509, -54216, -17749, -59836, -16147, 19303, 44062, 22815, -25050, -61343, -67274, -71172, -67909, -3181, 16699, 18823, 65705, 44315, -39677, -55558, -8972, -97865, -81944, -42408, -73013, -48413, -66548, 2674, 49267, 22444, -33142, -88169, -97986, -42684, -44714, -79771, -124367, -129318, -107869, -88506, -40053, -2821, 15096, -32238, -56635, -75178, -104937, -86836, -72675, -63886, -34687, -31593, -35968, -89641, -174584, -213773, -216533, -226133, -112200, -43022, -16193, -91233, -138378, -142550, -100690, -93776, -94217, -110899, -105185, -87568, -70358, -37040, -41509, -46937, -3379, 43856, 40482, -2300]
13613b300l5147R659n896k8096J0304k4191L6378K5757k6460J4166k4461k8118
13601g8405j6834k4319l104N8188L2528L5218r711O829k8684o691K18m7829m0461
13588a23057M6610M3508K3579j6373j4768J9301L3415J9829k4349n4019L1819
13577a4505p227j1496k9609j3813p484K000k8255J3306m11N121N5341O221J09
13564c0702K4147P9965Q879j4868o6213n7506l0079k0743K8405O4029n7606l8891
13552a11183P821o564m587O6581N1406r60n0030k5536k7798j6349M4952L37J8390
13539e3520M1851N0485q151n5335J7877l6302m2769J289M6519K1233o8739J1843
13527g3719l7077j6714L2267K5272L9165r78J3847Q262m609n4110L9776Q976p4750
$$ y = [-2300, -37447, -27788, -33684, -61780, -51476, -75667, -39289, -13532, -39992, -25826, -50287, -78405, -95239, -119558, -122662, -64474, -31946, 3272, -6439, 390, -28294, -34985, -34767, -82596, -123057, -76447, -32939, -9360, -25733, -40501, -21200, 12215, 32044, 7695, -46324, -14505, -21732, -33228, -62837, -76650, -84134, -82134, -110389, -97083, -97494, -92373, -37032, -30811, -30702, -6555, 73410, 82289, 67421, 1208, -56298, -86377, -107120, -78715, -14686, -72292, -111183, -103362, -109926, -114513, -47932, 3474, 2514, -47516, -73052, -100850, -117199, -72247, -71910, -53520, -11669, 38816, 30665, -24670, -6793, -43095, -85864, -84575, -38056, -16823, -85562, -73719, -110796, -127510, -95243, -69971, -30806, -31784, -17937, -9675, -14284, -68394, -28618, -19642, -94392]
13514i4392M9026L6116o2504R072k1538J5981O3977p454l7770O575j5285m459
13502f2655j1981K9170P4320L3820p7289o8879L1402M6735p810p777q3932r0245
13490a95121k0303P3202Q0637P7126j8111k6077m4951k4189J0543J588o277m205
13478i6138J8332l8193p411K0772K0181K0160P4321l045J3717m872l3657n354
13466b1187Q527K3177N2326r312K727k0780k1545j8853J597r724J3240k899l9746
13453d2452J6445M7120j6006l1699J2253l2660r0252m4890k1891L3242M8318O1997
13441f0475r786J8343K0375L9112l7158O1J4653K4314L8562k6888k7583m0576
13429d7046o1550K2919L1709Q957M2112P575J049L1652j9841l3795j1561N168
$$ y = [-94392, -45366, -9250, -71754, -62682, -84220, -68239, -4262, -11716, -49486, -42911, -58196, -62655, -74636, -45466, 28854, 62674, -14615, -83494, -52092, -5357, -13167, -20944, -104876, -195121, -215424, -142222, -61585, 15541, -2570, -28647, -73598, -97787, -87244, -85656, -91933, -96138, -77806, -115999, -123410, -102638, -82457, -62297, 12024, 8979, 22696, 17824, -15833, -21187, -12660, 10517, 62843, 53531, 56258, 35478, 13933, -4920, -3323, -13047, 193, -2706, -42452, -26007, 21113, 5107, -26592, -14339, -46999, -137251, -182141, -204032, -170790, -122472, -60475, -70261, -51918, -31543, 7569, -29589, -29528, -14875, 9439, 48001, 21113, -6470, -47046, -108596, -85677, -53968, -45011, -2899, 4676, 5725, 37377, 17536, -16259, -27820, -22652]
13417b2652O3551o581m0332k3960m2509K3199j3095m240L7121J8531m5978j1340
13405f8285m149r841K0850L2426J0757O124l6027j5624j9434l3048J9642K6350
13393g0259J9520N1804J537j8744l9947m1259j6254k966L9997M0691O2061l9935
13381a3754n0946j0667O910J4139n717k0660o634k3801L6318N2477K3451j5569
13369a4453k7238m0813l7849K7510J2086N333P451N211q074N3194k340L072N91
13356a6319L7948j7818L0927M397m0620l7883K8652o26M7379k6704n4643j0487
13344e5797n5790N4680O8896Q4544M1186r1469k9861J4082m0414k0199M2022J9411
13332C1291L9631m5595J1344M207m0774k3366k335L0056R767J0279j8612m9550
$$ y = [-22652, 40899, 34318, -6014, -29974, -72483, -49284, -62379, -66619, -29498, -10967, -56945, -68285, -72434, -82275, -61425, -28999, -18242, -12118, -48145, -63769, -83203, -116251, -96609, -70259, -50739, 1065, 2602, -16142, -56089, -97348, -113602, -116568, -76571, -35880, 26181, -13754, -64700, -75367, -68457, -54318, -60035, -80695, -87329, -111130, -74812, -22335, 1116, -14453, -41691, -82504, -120353, -92843, -80757, -75424, -67973, -62762, -70836, -17642, -19982, -16910, -16319, 21629, 3811, 34738, 39135, -1485, -39368, -10716, -11342, 36037, 9333, -45310, -55797, -111587, -56907, 11989, 96533, 137719, 46250, 16389, 30471, -9943, -30142, 11880, 31291, 70922, 25327, 36671, 40878, 104, -23262, -25597, 4459, 14226, 24505, 5893, -43657]
13320d3657j0318K0684K8951J8063k3303j1529l4786K574K6696M3652J427j3353
13308E101J414r176j2308L5826l4955k2330J4533R684k5125k7623J3044o3219
13296a15134m6196L7205K5695K5499o4748r329L8450j3699k7300J9652N0094M3507
13284c6304J5903P7569K9871r1712l7722n0744L6501K8838k9424l636k8865K681
13272h7044K1970O0902R857M6406J5601p871n5079o9392m9004R435R9000O395
13260A176j5598o1081K1709N480J2448N0138O2057J9622k2794n192k8670m1675
13248b380p2546m1953j2165o07L8993P3007j5455l9313K2011L0381r047m9225
13236g8299O480M1602M8859M9525r129q0264l4292J1867L2861R959L9982Q194
$$ y = [-43657, -53975, -33291, -4340, 13723, -9580, -21109, -55895, -53321, -26625, 17027, 18454, 5101, 6515, -2661, -14969, 20857, -14098, -36428, -21895, -12211, -37336, -64959, -51915, -115134, -161330, -124125, -98430, -72931, -137679, -147008, -108558, -122257, -149557, -129905, -79811, -36304, -20401, 57168, 87039, -4673, -42395, -93139, -56638, -27800, -57224, -60860, -89725, -87044, -65074, -4172, 5685, 52091, 67692, 59821, 4742, -64650, -113654, -104219, -5219, 1176, -14422, -75503, -53794, -48314, -35866, 14272, 76329, 95951, 73157, 67965, 39295, -2380, -74926, -116879, -129044, -129651, -90658, -17651, -33106, -72419, -50408, -20027, -29074, -78299, -71819, -30217, 18642, 68167, 59038, -21226, -55518, -43651, -10790, -831, 39151, 47345]
13224D7345o9183n777J7260p804k8850k7603M9284K9528J2878Q133j5791q0m552
13211D788l2321k1692p252K5332M7901n633o789k5101j7146P925L8572P5845r893
13198G4536l0468r397N3355L5811K324o1880j5356q202m347k8484l766n97R114
13185A2643k7715P7K704J0253j1922L6960l991l0197k5214k6372L5982p216m2202
13172g6210O3090p939j0362O1676R345O409J9069l6218l9103m7901K0882O7396
13160C0134k298l7633l080J3501L6732n104o3482n590K3571j7370o873J0288J6563
13147a0641k0317M344J1667K6417l5930n9029k4468J529J22231K568l1420m875
13135a7924R403M047l219k1853o470l712n2502L3065L1568l2733j8257k384j2978
$$ y = [47345, -21838, -27615, -10355, -18159, -47009, -74612, -25328, 4200, 17078, 25211, 9420, 9340, 4788, -27533, -49225, -56477, -31145, 16756, 11123, 4334, -20767, -37913, -29988, 8584, 84429, 74536, 44068, 34671, 88026, 123837, 126161, 64281, 48925, 40723, 36376, 7892, 4126, 3529, 12643, -15072, -14995, -12291, -2038, -13960, 23000, 19009, -11188, -36402, -62774, -26792, -34008, -76210, -13120, -21059, -31421, 30255, 39600, 46009, 65078, 28860, -10243, -58144, -37262, 30134, 27836, -9797, -12877, 624, 37356, 32252, -31230, -36820, -13249, -30619, -37492, -27204, -10641, -30958, -26614, -14947, 11470, -24460, -83489, -107957, -106428, 15803, 18371, -13049, -17924, -8521, -4474, -7693, -29546, -36016, -39728, -92230, -59165, -27597, -60330, -78587, -80971, -93949]
13122i3949J6062L9337J807O1253k131k8372k0758R109J1531J3004m1306k4900
13110e9313K4276N1176j079q433J5218k0286k8214k2402j7802M16j176J5173M1208
13097a1238K2764p9359K633j2457O7914N8396j0611m5176l4941j4623M925l2735
13085h4508n0850N2634O1580J0930m449j1309J5175M876n1483k2997K7756J2979
13073c9666j3906O6172j328k8931n1924N3978J5071o3541l5807j9353K2678K1589
13061g4968k4013P3734P3594j354L7680K6006l7905j02163l184P4414R506j2867
13049C8480m0882N204K5589L99Q181J2242J4248L507k2930o5413N3797J3438k0808
13036B5052J8791k7402J3445m3323k7530K6812K1415j684k7000j3840n3329j5767
$$ y = [-93949, -77887, -38550, -36743, 24510, 22379, -5993, -26751, -17642, -6111, 6893, -34413, -59313, -35037, 16139, 15060, 6627, 21845, 1559, -26655, -49057, -66859, -66443, -67619, -52446, -11238, 11526, -67833, -65200, -77657, -9743, 48653, 38042, -7134, -42075, -56698, -51773, -84508, -135358, -82724, -21144, -10214, -14663, -25972, -10797, -5921, -57404, -80401, -52645, -39666, -53572, 12600, 11272, -17659, -69583, -15605, -534, -64075, -99882, -119235, -96557, -74968, -98981, -25247, 48347, 46993, 84673, 110679, 72774, -29389, -32573, 41841, 51347, 38480, -2402, 2802, 28391, 28790, 36971, 49213, 63461, 66968, 44038, -21375, 32422, 45860, 25052, 43843, 16441, 29886, -13437, -40967, -14155, 7260, 5576, -21424, -35264, -88593, -104360]
13024a04360L4914O1394j1774n1338j7641N9757J8613J0423K9685P11r405Q118
13012B9097k1179k2245o2340j8270O6804L4264K8758K2456J6940j3273k4633M32
13000C6811J8556q601p10o547k5540r234L7353j0044l4993k5311M8882K8342K2384
12987G1348o248k5894m7201p836l7100l4921L1255K0935l6355m1689M4969Q77
12975f7860j680j0746Q9098K6034p5780o4945n7415L077K0747k7206k4378J10483
12963h0571L5069n7666J7261Q2473Q825K2731L8629J7277Q829L2892j815P046
12951A30980Q462r964m3239q6956m6226M0446K0353l3185R346j6108Q392J2556
12939e143n0914j2638R6126J2928J3608J9553j9379n0023J4060J6290j4137l7865
$$ y = [-104360, -69446, -8052, -19826, -71164, -88805, -29048, -10435, -12, 29673, 30384, 20979, 29097, 7918, -14327, -76667, -94937, -28133, 6131, 34889, 57345, 74285, 61012, 36379, 36811, 55367, 46766, 46056, 39509, 13969, 4735, 42088, 32044, -2949, -28260, 20622, 48964, 71348, 65100, 39206, -7995, -15831, -52931, -87852, -56597, -35662, -72017, -113706, -68737, -67860, -69540, -80286, 8812, 34846, -40934, -105879, -163294, -160217, -139470, -166676, -191054, -80571, -45502, -103168, -85907, -3434, 5391, 28122, 66751, 84028, 92857, 125749, 123934, 130980, 139442, 129478, 86239, -717, -46943, -6497, 13856, -19329, -9983, -26091, -17699, -5143, -56057, -68695, 27431, 40359, 53967, 73520, 54141, 4118, 18178, 34468, 20331, -17534]
12927a7534k4842K638L1385j2886O434O091l2457k8987K3172N5501j7450J3740
12915D805M509k6801J4386J9583J8647J0358K9366j7731n1425j5732j6719m9589
12903g6343L3M3076m413o6790L6979O7262p5702L950M8054N7460l4600n8403j4267
12890g3704k587M1577j249J829J3651J9909r401n1308k1290J2040K4052K8586
12878a7895O1550K9378k3504k3917m054k6108L687J2705K0846j1047l5857J1602
12866b614k4493n0011L9537P354l9058j4291J7516M8063P4033J7263j5531o2487
12854d719j6752M8135P2680Q9221R409k2831j356k4185q2225o7240J6878N2001
12842F9016Q0749K7814n4888M760K2332K3700k4833J1963j1215l0374P8097j5046
$$ y = [-17534, -42376, -39738, -8353, -21239, -14805, -8714, -41171, -70158, -46986, 8515, -8935, 4805, 9314, -17487, -3101, 16482, 35129, 45487, 74853, 57122, 5697, -10035, -26754, -76343, -76310, -33234, -37647, -104437, -67458, -196, -75898, -71948, -23894, 33566, -1034, -59437, -73704, -76291, -34714, -35963, -34134, -20483, -574, -9975, -61283, -82573, -70533, -46481, -17895, 43655, 73033, 49529, 25612, 21558, -4550, -863, 11842, 32688, 21641, -14216, -2614, -27107, -77118, -37581, -30227, -69285, -83576, -66060, -17997, 56036, 73299, 57768, -4719, -21471, 26664, 99344, 188565, 197974, 175143, 173787, 149602, 67377, 137, 17015, 69016, 149765, 177579, 122691, 127451, 149783, 173483, 148650, 160613, 149398, 119024, 197121, 182075]
12830A82075l7185o0980l2503k3116m164j5324J665N8023K6798o3746l2379K2160
12818B1324j6088l0964k3170J4452K8943p331m834M9063q040j0732m3688M887
12806b6178N004m3302j8144n532K4065N3462K8959l1903l2188L6604O3724K5689
12794H0260j8399k4592K8103K5641k5837p6146l8767K9203N9114J9724m2458J1896
12782B7742j5706M2950l7246k7517J156P1570j0152J5570k047l1745o5669k8094
12770e9188J4769J8422o9210j8226o276J1224J1100K301O3452N2203l3362j5816
12758b8607K9827k2456l0779O375M2381L4395P0595L5766j5051p5730j1091L1859
12746F7484L6231L3954Q1294J48963J14937N3633k9397r2634p0200n9281n2771
$$ y = [182075, 144890, 83910, 51407, 28291, 24127, 8803, 10468, 68491, 95289, 31543, -836, 21324, 5236, -25728, -48898, -34446, -5503, -12834, -17668, 31395, 23355, 12623, -31065, -26178, -21174, -64476, -82620, -88152, -64087, -10625, 18334, -13569, -45757, -9153, 54571, 80260, 61861, 37269, 65372, 91013, 65176, -10970, -49737, -20534, 38580, 58304, 15846, 27742, 12036, 54986, 17740, -9777, -8621, 62949, 52797, 68367, 66320, 34575, -31094, -59188, -44419, -25997, -95207, -113433, -119709, -108485, -97385, -95084, -31632, 20571, -12791, -28607, 1220, -21236, -52015, -45640, -3259, 31136, 101731, 137497, 122446, 46716, 35625, 67484, 103715, 137669, 218963, 367926, 482863, 536496, 507099, 414465, 344265, 284984, 232213]
12735B32213k7616L2152m4049m7275M73P613J1235j4616J8507k5517l4669m6343
12723F2108j5915j8578j5611j4080L0668j038k4894q417J475L383J0243N7550
12711F6894k4448l3061M5588O3297k6940j1550p8129q7627P8108L4096k1918J7256
12699B1566l9011L7578K9227L1617l952k689J8201j7346K9549o686k7478n2092
12687A8484K2699K6048o598m2749L228L0821K8259m7019q759L5531O9635J18719
12675B48299P8879Q2333N3992m6144q0971j10817q0418k7327k8393k1553m1998
12664B5882k3468M1887K8705j3899k0195j1497M7606J4618k3206j167N907k675
12652F8498n1775Q412J0763q300k8936l1706L4867J8295L767M9606l5278p467
$$ y = [232213, 204597, 236749, 192700, 145425, 145898, 153511, 164746, 150130, 168637, 143120, 108451, 62108, 46193, 27615, 12004, -2076, 28592, 27554, 2660, -5757, -4282, -899, 9344, 66894, 42446, 9385, 54973, 118270, 91330, 79780, 1651, -85976, -7868, 26228, 4310, 21566, -17445, 20133, 49360, 80977, 77025, 74336, 92537, 75191, 104740, 98054, 70576, 18484, 41183, 67231, 60633, 17884, 21112, 51933, 80192, 33173, 24414, 59945, 129580, 248299, 327178, 409511, 463503, 417359, 336388, 225571, 145153, 117826, 89433, 67880, 25882, 2414, 44301, 73006, 59107, 38912, 27415, 75021, 89639, 66433, 65266, 71173, 68498, 16723, 25135, 35898, 27598, -1338, -33044, 1823, 20118, 23885, 73491, 38213, 30746]
12640C0746M1075L2489j5961O6406j0317k3133m9359m6451j7029o7550m8665O3473
12628d4276J23488N9621K3799J3143k2010m6539p5375k1706L4098J8648j1444
12617E1447j9046n1774k4449J6361R260L1869O4260K1186K1776q18k0901l7086
12605F2085k9451J1836K6604L5377J5901K3353l1152k8753l7804J1925R222o7886
12593A257l8139r420M7042j2784o6467k6032M8244p840j6321J5374J5737j1779
12581f1128L4318K7887J2872n129k4038J9696M7748L2736q226J13p3271o9797
12569f6219N3184j481l312m3531j4831J1204k2438O5823L6369m049k1676l1725
$$ y = [30746, 71821, 104310, 88349, 154755, 144438, 121305, 71946, 25495, 8466, -59084, -107749, -44276, 79212, 138833, 162632, 175775, 153765, 107226, 31851, 10145, 44243, 62891, 51447, 32401, -19373, -43822, -27461, -18201, 13668, 77928, 99114, 120890, 120072, 99171, 62085, 32634, 44470, 71074, 106451, 122352, 145705, 114553, 85800, 47996, 59921, 69143, 1257, -36882, -46302, 740, -12044, -78511, -104543, -56299, -64139, -80460, -65086, -49349, -61128, -26810, 1077, 13949, 8820, -15218, 4478, 52226, 84962, 76736, 76849, 3578, -66219, -13035, -14516, -17828, -61359, -76190, -64986, -87424, -21601, 14768, 10719, -10957, -42682]
$$ [...]
##END NTUPLES=NMR SPECTRUM
##END=
