##TITLE=Analysis number 314061
Compound Code cc 04504
Book Reference 4
Project Code adrs
Chemist Name cardiff
##JCAMPDX= 6.0         $$ Bruker NMR JCAMP-DX V2.0
##DATA TYPE= NMR SPECTRUM
##DATA CLASS= NTUPLES
##ORIGIN= Bruker BioSpin GmbH
##OWNER= NMR
$$ XWIN-NMR		Version 3.5
$$ Tue Oct  4 12:12:15 2005 GMT Daylight Time (UT+1h)  MAYBRIDGE\NMR@NMR_250MHZ
##.OBSERVE FREQUENCY= 250.131544655141
##.OBSERVE NUCLEUS= ^1H
##.ACQUISITION MODE= SIMULTANEOUS (DQD)
##.ACQUISITION SCHEME= undefined
##.AVERAGES= 16
##.DIGITISER RES= 18
##SPECTROMETER/DATA SYSTEM= dpx250
##.PULSE SEQUENCE= zg30
##.SOLVENT NAME= CDCl3
##.SHIFT REFERENCE= (INTERNAL, CDCl3, 0, 16.522)
##AUDIT TRAIL= $$ (NUMBER, WHEN, WHO, WHERE, WHAT)
$$ ##TITLE= Audit trail, XWIN-NMR		Version 3.5
$$ ##JCAMPDX= 5.01
$$ ##ORIGIN= Bruker BioSpin GmbH
$$ ##OWNER= NMR
$$ C:\u/data/dgb/nmr/ADRS/10380/pdata/1/auditp.txt
$$ ##AUDIT TRAIL=  $$ (NUMBER, WHEN, WHO, WHERE, WHAT)
(   1,<2005-10-04 12:11:57.43 +100>,<MAYBRIDGE\NMR>,<NMR_250MHZ>,
      <created by zg, POWCHK disabled, PULCHK disabled
       configuration hash MD5:
       62 19 C7 07 E1 42 D1 B7 37 6C 3D D0 77 39 F9 E6
       data hash MD5: 64K
       DF CB D1 C6 4D 25 E6 EC 0A 93 51 15 6F 50 1D 3B>)
(   2,<2005-10-04 12:12:08.10 +100>,<MAYBRIDGE\NMR>,<NMR_250MHZ>,
      <Start of raw data processing
       ef LB = 0.3 FT_mod = 6 PKNL = 1 SI = 32K 
       data hash MD5: 32K
       A6 ED 69 F3 F9 9C 01 1E 3A 65 17 4A CB FF 88 D2>)
(   3,<2005-10-04 12:12:09.87 +100>,<MAYBRIDGE\NMR>,<NMR_250MHZ>,
      <apk 
       data hash MD5: 32K
       D2 2A B3 86 F3 C7 B2 71 3C 26 61 15 F7 59 AF 0A>)
(   4,<2005-10-04 12:12:10.59 +100>,<MAYBRIDGE\NMR>,<NMR_250MHZ>,
      <abs ABSG = 5 
       data hash MD5: 32K
       AD 27 8D 85 9F 86 22 E7 18 F4 00 6D C3 E4 09 F7>)
$$ ##END=
$$ 
$$ hash MD5
$$ FA 69 0B 3C 10 9E 20 01 A7 AB 86 00 8A D3 0A E8
##$RELAX= 
##$RELAX= 
##$RELAX= 
##$RELAX= 
##$RELAX= 
##$RELAX= 
##$RELAX= 
$$ Bruker specific parameters
$$ --------------------------
##$DU= <C:\u>
##$EXPNO= 10380
##$NAME= <ADRS>
##$PROCNO= 1
##$TYPE= <nmr>
##$USER= <dgb>
##$AMP= (0..31)
100 100 100 100 100 100 100 100 100 100 100 100 100 100 100 100 100 100 
100 100 100 100 100 100 100 100 100 100 100 100 100 100 
##$AQSEQ= 0
##$AQ_mod= 3
##$AUNM= <au_zg>
##$AUTOPOS= <26 >
##$BF1= 250.13
##$BF2= 250.13
##$BF3= 250.13
##$BF4= 250.13
##$BF5= 500.13
##$BF6= 500.13
##$BF7= 500.13
##$BF8= 500.13
##$BYTORDA= 1
##$CFDGTYP= 0
##$CFRGTYP= 5
##$CHEMSTR= <none>
##$CNST= (0..31)
1 1 145 1 1 1 1 1 1 1 1 1 1 1 1 1 1 1 1 1 1 1 1 1 1 1 1 1 1 1 1 1 
##$CPDPRG= <>
##$CPDPRG1= <>
##$CPDPRG2= <>
##$CPDPRG3= <>
##$CPDPRG4= <mlev>
##$CPDPRG5= <mlev>
##$CPDPRG6= <mlev>
##$CPDPRG7= <mlev>
##$CPDPRG8= <mlev>
##$CPDPRGB= <>
##$CPDPRGT= <>
##$D= (0..31)
0 1 0 0 0 0 0 0 0 0.06 0 0 0 0 0 0 0.0002 0 0 0 0 0 0 0 0 0 0 0 0 0 0 
0 
##$DATE= 1128424316
##$DBL= (0..7)
120 120 120 120 120 120 120 120 
##$DBP= (0..7)
150 150 150 150 150 150 150 150 
##$DBP07= 0
##$DBPNAM0= <>
##$DBPNAM1= <>
$$ [...]
##$SUBNAM7= <"">
##$SUBNAM8= <"">
##$SUBNAM9= <"">
##$SW= 20.6930455092707
##$SWIBOX= (0..15)
0 0 3 0 0 0 0 0 0 0 0 0 0 0 0 0 
##$SW_h= 5175.983436853
##$TD= 65536
##$TD0= 1
##$TE= 296.16
##$TE2= 300
##$TE3= 300
##$TEG= 300
##$TL= (0..7)
0 120 120 120 120 120 120 120 
##$TP= (0..7)
150 150 150 150 150 150 150 150 
##$TP07= 0
##$TPNAME0= <>
##$TPNAME1= <>
##$TPNAME2= <>
##$TPNAME3= <>
##$TPNAME4= <>
##$TPNAME5= <>
##$TPNAME6= <>
##$TPNAME7= <>
##$TPOAL= (0..7)
0.5 0.5 0.5 0.5 0.5 0.5 0.5 0.5 
##$TPOFFS= (0..7)
0 0 0 0 0 0 0 0 
##$TUNHIN= 0
##$TUNHOUT= 0
##$TUNXOUT= 0
##$USERA1= <user>
##$USERA2= <user>
##$USERA3= <user>
##$USERA4= <user>
##$USERA5= <user>
##$V9= 5
##$VALIST= <valist>
##$VCLIST= <CCCCCCCCCCCCCCC>
##$VD= 0
##$VDLIST= <DDDDDDDDDDDDDDD>
##$VPLIST= <PPPPPPPPPPPPPPP>
##$VTLIST= <TTTTTTTTTTTTTTT>
##$WBST= 1024
##$WBSW= 4
##$XGAIN= (0..3)
0 0 0 0 
##$XL= 0
##$YL= 0
##$YMAX_a= 403306
##$YMIN_a= -248625
##$ZGOPTNS= <>
##$ZL1= 120
##$ZL2= 120
##$ZL3= 120
##$ZL4= 120
##$ABSF1= 16.522
##$ABSF2= -4.171173
##$ABSG= 5
##$ABSL= 3
##$ALPHA= 0
##$AQORDER= 0
##$ASSFAC= 0
##$ASSFACI= 0
##$ASSFACX= 0
##$ASSWID= 0
##$AUNMP= <proc_1d>
##$AZFE= 0.1
##$AZFW= 0.1
##$BCFW= 0
##$BC_mod= 0
##$BYTORDP= 0
##$COROFFS= 0
##$CY= 12.5
##$DATMOD= 1
##$DC= 0
##$DFILT= <>
##$DTYPP= 0
##$F1P= 14.0000005364418
##$F2P= -0.99999901652339
##$FCOR= 0.5
##$FTSIZE= 32768
##$FT_mod= 6
##$GAMMA= 0
##$GB= 0
##$INTBC= 1
##$INTSCL= 1
##$ISEN= 128
##$LB= 0.3
##$LEV0= 0
##$LPBIN= 0
##$MAXI= 10000
##$MC2= 0
##$MEAN= 0
##$ME_mod= 0
##$MI= 0
##$NCOEF= 0
##$NC_proc= -5
##$NLEV= 6
##$NOISF1= 0
##$NOISF2= 0
##$NSP= 0
##$NTH_PI= 0
##$NZP= 0
##$OFFSET= 16.522
##$PC= 1
##$PHC0= -58.23634
##$PHC1= 15.70042
##$PH_mod= 1
##$PKNL= yes
##$PPARMOD= 0
##$PSCAL= 4
##$PSIGN= 0
##$REVERSE= no
##$SF= 250.13
##$SI= 32768
##$SIGF1= 0
##$SIGF2= 0
##$SINO= 400
##$SIOLD= 32768
##$SREGLST= <1H.CDCl3>
##$SSB= 0
##$STSI= 32768
##$STSR= 0
##$SW_p= 5175.98343685301
##$SYMM= 0
##$S_DEV= 0
##$TDeff= 65536
##$TDoff= 0
##$TI= <Analysis number 999999
Compound Code 99
Book Reference 9
Project Code 9>
##$TILT= no
##$TM1= 0
##$TM2= 0
##$TOPLEV= 0
##$USERP1= <user>
##$USERP2= <user>
##$USERP3= <user>
##$USERP4= <user>
##$USERP5= <user>
##$WDW= 1
##$XDIM= 32768
##$YMAX_p= 570217498
##$YMIN_p= -653956
$$ End of Bruker specific parameters
$$ ---------------------------------
##NTUPLES= NMR SPECTRUM
##VAR_NAME=  FREQUENCY,     SPECTRUM/REAL,   SPECTRUM/IMAG
##SYMBOL=    X,             R,               I
##VAR_TYPE=  INDEPENDENT,   DEPENDENT,       DEPENDENT
##VAR_FORM=  AFFN,          ASDF,            ASDF
##VAR_DIM=   32768,         32768,           32768
##UNITS=     HZ,            ARBITRARY UNITS, ARBITRARY UNITS
##FACTOR=    0.157963299565203, 1,           1
##FIRST=     4132.6476996994, 0,             0
##LAST=      -1043.33573715361, 0,           0
##MIN=       -1043.33573715361, -653956,     0
##MAX=       4132.6476996994, 570217498,     0
$$ Real data points
##PAGE= N=1
##DATA TABLE= (X++(R..R)), XYDATA
$$ [...]
28807 106710 198294 109820 9935 6833 -51449 -157143 -187293 -186353 -73941 -99445 -247149
28796 -247149 -202384 10409 11996 -82952 -36602 -41703 -140273 -190583 -180598 -61951 132023
28785 132023 108244 35442 48410 90193 -92549 -88128 -39799 134420 194124 216044 164014
28774 164014 22093 64034 50416 44657 78089 27436 72478 22894 -21750 191986 201046
28763 201046 86030 84474 104669 -74993 -914 90493 17014 -103961 -175898 -325122 -412246
28752 -412246 -191960 7127 91127 57512 -119497 -57695 -78170 -7253 31748 -115164 -94816
28741 -94816 -69137 -45999 48770 47149 32367 -86823 68057 178585 8572 -153735 -157925
28730 -157925 -258249 -133082 32006 79637 -109392 -218861 -170241 -173966 -192583 -193985 -101237
28719 -101237 -92411 -91318 -40276 -47919 -168968 -91205 208217 129549 10399 -78685 -98169
28708 -98169 -5940 7801 -6604 -12382 37891 -8981 -12508 -96589 -180623 -325444 -96648 189806
28696 189806 22982 -149610 -107698 9070 70822 106996 150722 136113 -52607 -64260 2348
28685 2348 1853 -37832 -32283 -185454 -145092 -53368 -35887 26877 119078 155772 139273 97496
28673 97496 84273 10430 -18193 27377 168592 127189 123002 -54313 -87652 -28185 -111405
28662 -111405 -120224 -96012 -33013 -80661 -129609 -52861 -9219 -157143 -171153 -34991 119190
28651 119190 57019 56789 88238 172441 9857 -29401 6571 -41032 -71007 -260060 -177825
28640 -177825 119106 66291 33989 -114752 -180783 54948 140451 101829 48841 -76078 -75594
28629 -75594 -11498 64411 108218 24308 -94889 -246715 -165088 -26682 14579 -2542 18991
28618 18991 -12546 -21051 -142060 -77504 -86949 33293 268567 134090 208704 309904 204287
28607 204287 315680 485878 578822 496802 308445 26478 -124956 -87881 128748 169712
28597 169712 126906 124394 -37462 -152711 -171469 -59218 -16617 136891 102673 74644 -31721
28586 -31721 -82813 57068 273749 271474 66045 23915 24144 6592 46851 66532 10664 -128032
28574 -128032 -206551 -185275 -157363 -141393 -52510 -17247 40772 1807 27246 64400 159853
28563 159853 206101 299680 284382 284149 285408 100088 -131386 -214634 -108358 56947 194844
28552 194844 244291 196062 187043 112090 22712 -56228 -56419 -54522 -196404 -204252 -158348 -102608
28540 -102608 -183936 -189153 -69532 -68283 113884 28514 -39781 -109155 -125326 -225086 -304191
28529 -304191 -265885 -82366 -3983 104383 103839 84838 112095 187229 110841 63065 43521
28518 43521 -203511 -137856 23312 18726 60914 168256 112155 111387 95647 10968 -88932 -179945
28506 -179945 -61102 23617 61794 321238 527266 416640 367042 204647 126744 33425
28496 33425 -64276 -115908 -124450 148906 262631 220906 104612 -262 143907 147112 -41186
28485 -41186 -197995 -189417 -241448 -192224 -183062 -245922 -213571 -168935 89263 62793 10887 29523
28473 29523 192685 255992 115983 -3663 101456 207310 184615 -11093 -143984 -45450
28463 -45450 48395 75061 -37065 31068 -68291 -54948 4759 99912 154275 170744 16811
28452 16811 -91144 -62172 -42841 67870 -29433 -10467 49569 -219178 -249086 -71320 -63193
28441 -63193 -44903 -65455 -119478 -116759 -60778 62640 -58775 -94432 -322633 -430468 -82292
28430 -82292 91481 227490 261605 186049 100384 94332 201388 165069 57667 -25745 98401
28419 98401 185412 104647 51398 147930 136998 -17682 9812 -33001 -13258 -19263 -2200 5627
28407 5627 -18663 72768 64981 96950 134161 172289 158566 37459 11948 -176853 -168483 -158429
28395 -158429 -2238 122861 127885 19475 -56391 23225 55125 -58383 -139928 -182834 -115130
28384 -115130 -74318 -128289 -188387 -116909 -110728 -79519 -34620 -47690 16155 62070 47660 -89059
28372 -89059 -139829 -38573 91348 62207 -52138 -83852 104075 136227 175797 59592 -49751
28361 -49751 48584 127781 107433 31180 -47821 14959 -168468 -225464 -216939 -99421 -56373
28350 -56373 -106087 -113237 -275795 -326246 -126825 -61208 -4924 79206 143155 272182 158476
28339 158476 131160 97334 53259 112225 127267 163634 38032 -34680 -93424 -63684 -77862
28328 -77862 -38798 61530 -31352 -165635 -137338 -215555 -201944 -147671 -130214 -160878 -32433
28317 -32433 103641 -41433 -123761 -46251 72314 231407 80311 46768 -66428 -283770
28307 -283770 -370748 -264388 52986 108876 34981 -178636 -140839 27817 163305 296316
28297 296316 457314 368065 145953 -116082 -215103 -103827 20467 45030 -22694 -52592
28287 -52592 -115152 -149218 -218664 -87836 -1024 26027 -75061 -117377 -32694 71302 142864
28276 142864 164292 87205 28190 185840 229625 34670 57629 214861 293858 103129 72495
28265 72495 15576 -157540 -133965 -58197 -93168 -31049 20321 13104 -142854 -176024 -268365
28254 -268365 -225537 -120317 -96768 -103837 -39398 43388 225000 112625 68793 85137 34060
28243 34060 50742 6929 29019 -8126 -123641 -152964 66666 80418 32859 44853 63053
28232 63053 -84677 -192498 -229036 -202968 -159841 124140 378861 278158 209980 73556
28222 73556 -83775 -74130 101219 227261 257100 258524 50890 -91651 -72577 -91932 -31921
28211 -31921 120993 307857 250699 209188 328079 326146 293778 227598 243259 17646 -226285
28200 -226285 -257242 -112424 86029 -25733 -237753 -140066 32000 117752 179681 195998
28190 195998 231002 204154 360343 251310 -4814 -44710 -26824 13325 11115 -134406 -106410
28179 -106410 -126339 -195957 -122841 -177319 42610 268509 247165 79744 -163489 -127754 -22677
28168 -22677 -122135 -75890 116333 126596 13988 -188396 -195768 11038 90274 62749 -93266
28157 -93266 -3045 172779 152789 119682 159749 58593 -111684 -63199 56450 176894 215938
28146 215938 200626 300469 361355 335136 233786 210749 330645 244991 103461 103927 99856
28135 99856 24053 18192 47349 57792 -29617 -99054 -32057 109673 40453 -24918 140002
28124 140002 264171 220231 -25837 -63736 61124 209096 301662 288261 233716 49184
28114 49184 53549 308168 322024 262063 190976 62595 -3411 9156 -120445 7168 105734
28103 105734 159361 67489 19018 60717 -1785 12794 29707 77091 -72806 -262141 -241303
28092 -241303 -170520 -120388 -65419 36638 145283 222818 187213 164628 168476 184153 273171
28081 273171 317702 311274 197400 203605 170498 15365 -96136 29265 -38085 -158270 -101715
28070 -101715 -9168 24034 37141 -74114 -93139 -62895 -186566 -249267 -300916 -71688 55126
28059 55126 146159 76555 57345 242551 390007 200258 94525 109445 131591 196511 76542
28048 76542 -126732 41491 297316 222174 92865 25821 28515 199909 187370 182696 123744
28037 123744 128171 140656 84236 -68916 -193213 -3362 -8233 10430 104917 122972 154163
28026 154163 74228 98603 211380 61247 45604 213336 107888 36447 -34721 -63133 -11838
28015 -11838 32369 -25273 -163644 -217965 -243427 -161510 82307 110075 103273 99154 -12232
28004 -12232 -153661 -285892 -222547 86852 225035 146421 -31034 -106971 20443 175955
27994 175955 219600 168822 51687 56514 57628 175232 323032 462861 456556 283980 224177
27983 224177 244101 263959 126079 106378 1015 58621 9663 50265 -47586 -235747 -268821
27972 -268821 -180185 -220619 -128904 64937 144636 27996 -126839 -41942 23754 28598 89333
27961 89333 76951 109962 -119150 -341147 -325412 -140614 -95402 18579 140082 271214
27951 271214 258357 140692 -37620 -176176 -326507 -384656 -239955 -130629 -24414 20278
27941 20278 -34838 -48292 -122913 -115844 108 2825 110521 82181 -14318 -116878 -208537
27930 -208537 -172517 -105102 27563 116783 136387 102700 194726 -105908 -282460 -287324 -315949
27919 -315949 -188767 3205 274645 316533 183094 112920 97457 38608 23311 -38106 231
27908 231 74589 152604 67178 83356 47746 -11915 -70767 -107397 -163145 -190343 -191428 -220500
27896 -220500 -191818 -235119 -253293 -178264 -188472 -78775 -82957 -104253 -28857 -92774 -82448
27885 -82448 -39068 -23040 94016 35189 -220687 -165912 -153162 -5649 -77705 -149481 -2144
27874 -2144 29350 -29079 78369 27939 127249 132831 71463 13003 157222 77645 -96069
27863 -96069 -137588 -37989 -3486 40111 76637 146665 113331 48735 -45220 35466 213651
27852 213651 222855 82402 159882 93593 89696 85340 239635 199369 62233 3956 101055
27841 101055 66604 -191492 -218510 -69807 -153996 -193280 -89627 18773 72453 31787 -105246
27830 -105246 95402 72455 -1687 -48253 2783 107087 102944 35880 95432 122610 130926
27819 130926 114061 178142 100935 -139486 -212273 -175465 -159387 -135346 -256656 -186940 -112143
27808 -112143 -2727 12173 -152130 -262650 -242171 -59371 -45122 -253046 -291705 -71914
27798 -71914 116146 306095 294738 148050 174923 328685 238865 141363 187607 103525 125812
27787 125812 344196 418077 271202 202591 289510 384771 261422 179207 143862 179427 57355
27776 57355 -92827 47429 178122 151895 227377 224763 61896 4964 -82734 -7301 -15776
27765 -15776 1611 91527 161662 89181 96867 37222 32137 -107366 -67847 84530 52702 -129099
27753 -129099 -27749 33683 150202 162844 131774 37099 -152447 -201934 -137187 12053 160075
27742 160075 121185 26676 120475 37391 54574 213440 148545 272903 370733 294687 264804
27731 264804 375721 271372 65813 -177204 -2614 233106 369487 242367 122602 -18940
27721 -18940 -154228 -54024 187713 183627 101776 141323 44934 -112558 -140858 -22447 205891
27710 205891 302543 159633 -29662 -66454 -190150 -50980 -111219 -240080 -235778 47061
27700 47061 55224 -39322 -174219 -111705 110097 112623 -61858 -13608 -40531 -25684 -61615
27689 -61615 -29393 -68125 -124147 -92437 -154535 -122704 -78621 -89213 -32109 80389 10642
27678 10642 53887 164026 3197 -78026 -77464 -287078 -194089 -58552 -110633 -59395 -135958
27667 -135958 -114647 29831 133222 149225 97424 92386 70683 -19719 -122723 -262832 -326348
27656 -326348 -222988 -81693 -216623 -159383 -94405 -134616 -166738 -173079 -91907 -3229 -20691
27645 -20691 -147459 -222109 -227288 -169700 -197083 -185379 -284997 -361307 -303129 -246558 -200548 -13014
27633 -13014 172705 140007 55069 -25785 91262 236220 232387 234958 304228 327631 447574
27622 447574 179008 -71818 82496 58669 -20074 97468 5837 -25483 -139240 -127131
27612 -127131 50778 1480 -10234 -89541 -28785 3372 146439 228001 105450 38277 27451
27601 27451 135159 217018 230428 265460 309262 162783 48869 247995 285701 328521 440533
27590 440533 231059 155424 250207 166673 17354 2788 182258 162348 38027 196475
27580 196475 345445 317899 379764 169408 6065 188483 362937 323010 219103 187771
27570 187771 190879 159083 66959 -3532 69943 203045 -3944 -103024 -149773 -162399 -187053
27559 -187053 -34784 210477 230341 157411 90693 33774 -7336 -37039 -228721 -195159 -133331
27548 -133331 -190832 -237859 -149513 -238473 -198477 -93304 63195 127584 206402 5880 -33357
27537 -33357 -77140 -79242 -30617 28390 81064 78980 49899 109434 36253 40501 -175064 -91200
27525 -91200 116933 171697 -61583 -257644 -116029 -28908 340 178277 193388 153402 181645
27514 181645 192837 216698 131746 188365 111663 36210 29709 -47503 -121645 -48080 230155
27503 230155 189181 108078 -125690 -246771 -209361 -142089 -203090 -168222 -271384 -262962 -190205
27492 -190205 -19291 41293 80388 37725 117094 -31841 -129030 -237696 -244211 -151974 -100654
27481 -100654 16588 132607 4584 -17243 -117985 -264820 -158935 14442 133559 9070
27471 9070 -32954 -70316 42146 134395 165387 141013 110962 197287 93431 -48252 -154083
27460 -154083 -83266 -71546 -110437 -276931 -80434 -7983 48667 115795 157419 171109 294901
27449 294901 376615 329974 275527 171444 198880 132098 211151 237139 137020 52704 54161
27438 54161 222528 209871 30752 -53461 -14424 30119 -2068 5078 -28413 55144 47057 89635
27426 89635 186810 179777 48969 49124 196803 232524 75409 8969 -124484 -115102 -240740
27415 -240740 -229314 -291851 -357081 -200040 -221660 -133149 38431 187358 212020 140207 53259
27404 53259 66766 -91574 -227028 -117422 -86416 103171 276031 239942 88842 -18198
27394 -18198 -28550 -249397 -324912 -251229 -300733 -364728 -324299 -262982 -284824 -179715 -168874
27383 -168874 -85812 -141228 -175252 -26956 -137386 -167392 -211349 -131359 -79361 -10902 -179372
27372 -179372 -444671 -430003 -333404 -210758 -162354 -242664 18358 149158 153235 210006 150995
27361 150995 113992 125790 152362 218879 164650 151015 -21822 -150164 -79297 79432 136183
27350 136183 243881 265697 200581 89812 -61637 -19181 53295 72702 75333 43433 -45480
27339 -45480 92979 94053 29919 -14031 -74570 -67779 26026 10750 -45279 -34084 -99621 -35057
27327 -35057 48555 294806 422861 260070 160205 76923 231847 340821 102811 -64927
27317 -64927 -97254 -186122 -192663 -146611 -174343 -82972 -110754 -154873 -21429 46235 -100550
27306 -100550 -85574 -179 -17247 -225051 -226161 -215220 -95837 -48413 68146 142898 177499
27295 177499 108462 26123 -11385 62897 34111 -153635 -216248 -240722 -273550 -155433 -160385
27284 -160385 -85748 -139242 -121057 -24595 65002 32431 -134794 -252215 -284787 -104404 82956
27273 82956 -74512 -225377 -153546 -126018 -107688 -135351 -213102 -351101 -285769 -155927 -227045
27262 -227045 -101599 28899 -29683 -22261 -23875 -172179 -168306 -60998 -7376 67778 177399
27251 177399 300170 221359 -110593 -209156 -162490 -226363 -275300 -218810 -181168 -224954 -192933
27240 -192933 -283533 -344433 -429298 -452416 -363367 -309716 -193795 -36951 69975 185333 88696
27229 88696 -6402 18023 -91813 -285581 -552516 -540244 -262234 -124505 -61411 -102775 -169752
27218 -169752 -70412 -3746 -79579 -174815 -204077 -77199 35249 4749 45594 81806 98881
27207 98881 93947 -19764 -105483 -120036 -161882 -176270 -27495 126624 87029 128256 175368
27196 175368 136114 141864 162983 43259 -155056 -305331 -326910 -300532 -322349 -127037 -147528
27185 -147528 -294153 -250382 -22571 13799 31952 116887 165544 126011 -42812 -169942 -104504
27174 -104504 -63920 -137254 -163499 -124392 -73581 107840 140843 250247 308874 70504 20398
27163 20398 115093 55467 39001 295159 203841 163259 68131 -83281 -30990 3888 47762
27152 47762 105621 42613 -74000 -231314 -206882 -77578 -85937 -47365 125 -63306 -117882
27141 -117882 -187893 -321418 -341677 -410015 -139229 -97615 -272751 -286594 -218611 -408342 -422914
27130 -422914 -347309 -444427 -275613 -367490 -281660 -257964 -274322 -211228 -437118 -415402 -274068
27119 -274068 -152469 -34963 -94152 -104969 -158048 60089 108945 29203 2691 30304 69062
27108 69062 166381 144141 -71419 20404 -10394 -70724 -83963 34113 -82940 -74551 -157633
27097 -157633 -170063 -76368 -33116 -179675 -149774 86853 133510 -16868 20463 111489 58462
27086 58462 154394 177951 310009 306616 106886 -7851 -33787 28344 68191 32701 60134
27075 60134 -26695 -77379 -4751 -45449 -86737 -244911 -99133 207518 228614 183889 209970
27064 209970 82158 -95064 -219036 -335726 -190363 -31634 79438 136394 173728 164039
27054 164039 35826 -31706 99464 217198 139280 47297 53437 -93441 -54692 67227 -88513
27043 -88513 -120706 5026 13928 76899 72444 70406 152610 81654 -22009 -52189 -10493 27824
27031 27824 -4241 -17644 -31220 -122320 44828 99416 33387 -22438 13313 76591 35497
27020 35497 51163 56012 84563 273295 252656 130830 59051 67540 -74773 -75576 26794 125843
27008 125843 77114 33435 12637 -113500 -102426 -46812 -68903 -30879 -152740 -181808 -189041
26997 -189041 -150085 -123677 -37013 80059 119266 124034 123885 74898 38805 -3691 -25004 -45461
26985 -45461 -85148 -85323 5293 -33400 25803 9090 -58243 -120037 -31860 65891 79157 -88472
26973 -88472 -194344 -181933 -164698 30376 150759 37451 52257 104784 -61612 5918 121468
26962 121468 73062 124289 59481 41749 236806 340289 392296 349479 111761 -72513 -221785
26951 -221785 -230475 -154068 -34430 -82624 -155914 -137194 -77150 -49703 138894 151325 -3903
26940 -3903 -30574 42955 120557 9512 -57959 14366 14587 -55079 -98752 -83825 120455 227432
26928 227432 53056 42476 -74209 -203025 -274403 -160646 -87636 59788 149896 231166
26918 231166 206308 95252 245394 143794 -13245 94941 103085 37836 148932 156076 112774
26907 112774 -44854 59440 172523 171835 139662 67189 -70125 -211084 -206147 -167731 -89958
26896 -89958 162 120727 152633 138803 86668 -25400 131858 227203 56824 -108419 -264218
26885 -264218 -211973 -133824 104831 159753 127023 191307 30377 -200941 -285768 -245192 -186398
26874 -186398 20142 118908 99351 84057 45623 3845 157232 224461 55747 -38178 -91538
26863 -91538 -18699 -84413 -207538 -294516 -260091 -187474 -133286 -292743 -216450 -146439 -162968
26852 -162968 -304489 -176380 -74412 -55032 -78372 -256400 -272045 -255865 -151302 -9067
26842 -9067 -69598 -171214 -199967 -293942 -172756 -87884 46604 22498 -8020 -78945 -198060
26831 -198060 -136632 -146977 -80358 -17078 -130737 -37045 -88238 75293 173195 -32987 -148785
26820 -148785 -42221 104113 24608 -86280 15311 27864 -87325 -177900 -142819 -190690
26810 -190690 -93894 61144 144756 10659 -10972 76237 176375 186159 23474 -153465 -132756
26799 -132756 -151952 34797 81101 -51242 -66626 26766 26437 147531 100057 -161131 -201269
26788 -201269 -188894 -8128 73057 21410 -83091 -148876 -141774 -101689 97462 155549 61312
26777 61312 30740 47985 -16635 -49411 151288 210635 148153 251908 317875 317969 125136 -69214
26765 -69214 -167793 54280 262296 203766 173355 126236 136931 -8332 -286503 -392578 -251394
26754 -251394 -251802 -215483 -272286 -167940 -3516 49484 60040 150305 141637 73195 101333 -2448
26742 -2448 -131702 -196835 -412858 -389308 -112204 -152089 -188771 25933 149547 101972 90046
26731 90046 244011 264430 195887 241810 259048 251893 130565 -26436 -118731 -58266 -38545
26720 -38545 -39412 48267 80938 56540 -121101 -105400 -47231 -84591 -17176 8429 51350 109974
26708 109974 106062 68501 -145127 -352361 -244281 -332780 -347819 -336307 -351602 -160467 -133264
26697 -133264 -237757 -369197 -309904 -110353 7636 19587 62736 139845 165180 176055 192546
26686 192546 93032 78725 64049 21924 145429 210774 156555 132502 -56598 -255102 -139448
26675 -139448 -170709 -56268 12078 114395 22209 -17384 20441 89837 286266 199946 30880
26664 30880 -6525 -88489 17766 54107 158799 186597 159846 169022 101060 16362 -17092
26653 -17092 40060 -6603 -109963 -194756 -80882 -88011 -198874 -196752 112794 335084 314562
26642 314562 185804 -72000 -132101 -126947 -85507 -90301 33655 -16770 -95205 -41664 -39333
26631 -39333 -126235 -126940 1508 -101112 -67348 4206 84099 53141 50772 99870 13124 -144677
26619 -144677 79655 236479 134319 118898 45343 -36852 37456 109354 -40248 -262313
26609 -262313 -339262 -207372 -241621 -246901 -145992 -46218 29620 16022 -91277 19480 285398
26598 285398 357638 305093 224837 51581 -219437 -276638 -165037 26113 -66166 -100261 -48257
26587 -48257 -8847 -160152 -112481 -205807 -176002 -130208 -108913 -130233 38080 -57024 -61723
26576 -61723 -63225 66590 162910 235545 68092 83411 35001 -94258 -181040 27316 24838
26565 24838 80285 74621 19968 -88610 -217255 -123880 -27456 -113414 -272738 -276007 -144135
26554 -144135 -58921 -45169 -15281 -63811 -122784 -100036 -71055 -82862 -49725 -38065 -51387
26543 -51387 -3119 174595 -39012 37184 174285 216584 158466 68319 -71885 -224494 -47286
26532 -47286 175244 180431 -56193 -105327 -18342 4957 63862 -35476 -65287 -52860 51289
26521 51289 14725 -125065 19172 65776 141754 39752 -68794 -29817 150925 77641 -181890
26510 -181890 -145236 12371 141116 -39698 -204295 -67493 -2171 -48341 -184853 -307338
26500 -307338 -203256 -28343 -135836 -132056 -87967 7359 -29083 -78386 -93894 -44231 -27389
26489 -27389 69564 -16601 28823 12868 136909 310114 163435 142589 121221 209295 170364
26478 170364 123690 184925 256313 453456 458066 306886 199253 37704 34892 22548 -62171
26467 -62171 200391 280103 155340 148812 155983 206998 238088 -64625 -143402 -36927 34995
26456 34995 153125 299435 281213 269865 129201 41345 57706 128874 323835 355533 353366
26445 353366 386182 180283 -15752 -46414 -27139 14918 -56332 -160100 -57632 27099 -104962
26434 -104962 1184 19958 -150547 -260059 -159848 -85115 -207018 -232871 -126419 6756
26424 6756 77839 62680 -33265 -149317 -366539 -402141 -299732 -19272 59646 -24944 -157556
26413 -157556 -201993 -126187 -245781 -364480 -234336 -178283 -59881 -53527 -216967 -136247 -132000
26402 -132000 -128717 -168162 -306770 -84245 57408 124543 116353 -61741 -596 -16555 14865
26391 14865 37997 -14570 -112480 -213323 -206441 -101222 -90238 80475 52102 -69758 -111121
26380 -111121 -25919 29755 10050 18973 63765 -14702 -69759 -43159 867 -70406 -154775 -135389
26368 -135389 35611 81549 -120693 -178626 69154 134996 7218 3009 74594 184552 224591
26357 224591 197330 215501 296444 207398 30603 -244452 -217522 -89558 30740 -85095
26347 -85095 14036 9967 5796 -214238 -382134 -320569 -212610 -126750 18846 -10182 -30916
26336 -30916 147399 242902 74753 151774 156100 243351 386764 207132 80101 6234 -38020
26325 -38020 -118872 -134022 -140065 -139381 45920 9739 -191573 -152508 -130281 -133857 -42706 51276
26313 51276 114908 44115 -10200 -125591 -110286 -122241 -196519 -178492 -239025 -293681 -240759
26302 -240759 -121396 -95376 -208221 -178832 -121051 -91747 -27799 -86160 -8191 136041 67566
26291 67566 158883 74739 -52626 -2724 121701 207182 -10872 -184987 -190198 -353802 -181735
26280 -181735 -50073 59658 174416 134772 -116682 -265389 -192112 -189806 -82911 19224
26270 19224 159722 -2242 -148944 -197863 -415157 -419065 -271718 -75189 134967 66868
26260 66868 -97254 19373 844 86741 73992 156144 115691 21784 -46019 -153114 -241370
26249 -241370 -274727 -327995 -357944 -322882 -311532 -302012 -337471 -365069 -357156 -362518 -422294 -348238
26237 -348238 -187952 13704 -85503 -40390 -16571 -93108 -133232 -95755 -3248 74802 25700
26226 25700 -126008 -45269 86518 80767 66198 186783 30676 -231947 -422010 -357000 -206659
26215 -206659 72399 277805 127545 35301 42374 -32317 -224803 -170009 -79115 184745 255737
26204 255737 197913 65397 187119 297760 159199 309991 312336 56513 -10990 86694
26194 86694 -30130 -4046 36015 84959 -83509 -117438 9824 100957 55632 -98064 127976
26183 127976 192983 91312 -64936 -85357 -120596 -118197 -53359 191943 179995 -130604 -249668
26172 -249668 -197976 -15360 29784 -7202 60858 192521 79560 -136845 -134693 13709 -46642
26161 -46642 -122524 -135763 -183315 -148098 -165003 -195768 9161 245975 183457 60524 -122493
26150 -122493 -96422 -149508 -136532 -64442 9194 -146801 -236306 -37896 -1808 89173 191604
26139 191604 209866 139649 134316 18059 -22687 59984 103196 83302 123920 112647 4136
26128 4136 -75835 -67026 24457 -16861 -19019 62077 126697 87791 62981 200631 254210 165449
26116 165449 98307 105651 161613 252748 222897 85871 93262 -5046 -21965 -154199 -237873
26105 -237873 -225274 -234084 -288604 -287857 -59764 -48189 -12236 70553 -237768 -329118 -323273 -254908
26093 -254908 -25931 84929 170063 145232 119259 -81030 -172622 -291544 -327169 -104325
26083 -104325 -13672 54942 32917 -86969 -96657 -96372 -79520 -52709 -60999 -18957 97627 63684
26071 63684 -150438 -89364 18218 24019 -75040 -108095 -26048 -9198 -35941 -28093 100886
26060 100886 285989 287847 46007 -60984 102906 128734 276790 325821 253265 339396 204880
26049 204880 8328 -49884 -130027 -188417 -245069 -154953 47891 138178 184498 32121 67349
26038 67349 -95579 -115174 265017 411017 241388 111384 97261 -58719 -196913 -136363
26028 -136363 -97660 118784 94243 47140 -34725 -84075 -112054 -123004 -45558 -110289 117256
26017 117256 277459 152183 -15362 -166846 -61292 49704 229588 103309 -36899 59158
26007 59158 45890 43096 150930 87835 48226 81693 78840 -193470 -284298 -170738 23283
25996 23283 206616 176430 -42925 -156061 -21295 139455 260964 387762 329425 308080
25986 308080 362370 417640 269215 220311 184291 215751 237428 143901 62040 149771 190085
25975 190085 114134 -79882 -94014 -128302 -65090 3022 86554 105097 98867 43340 -25789
25964 -25789 -80825 -195679 -83645 -130680 -297345 -234944 -199622 -4934 164044 178497 95699
25953 95699 71994 129727 207628 138921 -126433 -289879 -191210 -29627 -10066 -83452 -122983
25942 -122983 -138255 -128656 -120485 -110175 -198545 -324756 -189084 -121532 -171598 -244352 -45211
25931 -45211 -155691 -251589 -117908 27880 2004 85523 187236 173495 144545 21663 119731
25920 119731 119019 17893 27065 -128493 -216766 -224133 -169222 -225446 -125228 -181123 -199045 -180031
25908 -180031 -88867 67159 -25835 -181980 -255313 -386962 -277656 -34015 40976 32144 33024
25897 33024 -78168 -66369 -25018 143040 306506 171081 89477 26981 -30209 -27771 -131553
25886 -131553 25455 245494 159967 93008 -112646 -192485 -134370 -77162 125839 124942 65324
25875 65324 38317 35046 -100154 34795 -44948 -92961 -138008 -153062 -147022 26235 33962 -43955
25863 -43955 -99407 -135299 -79127 -40371 -46765 -138330 -98154 75128 -17593 3271 68834 -4282
25851 -4282 114991 209373 208550 167950 237311 122682 -140746 -216524 -95372 -129925 -102201
25840 -102201 -74882 -36906 -161147 -218082 -86021 40887 62049 118078 227517 209508 199899
25829 199899 43404 -142758 -146133 -40839 -121585 -223259 -29233 96150 -19734 -102070
25819 -102070 -165934 -172608 -93939 -109237 -96154 6029 -77481 -238893 -90575 176782 160173
25808 160173 26038 -93048 -157323 -200063 -110582 -81432 -105764 -9010 -65846 -28011 59925
25797 59925 48538 -129257 -179402 -99012 33073 120303 99659 -1801 30607 49539 -128562
25786 -128562 -11917 6098 69744 123532 50339 152873 262867 141598 32434 177199
25776 177199 180687 101752 -23974 37960 226360 259600 289706 182812 155128 15814 -77022
25765 -77022 23206 144136 294877 232605 14949 17741 -35990 -66436 -139105 -264031 -64673
25754 -64673 -24593 -224065 -209181 -215269 -10164 -16657 -245800 -199274 -12369 -73659 -12715
25743 -12715 93332 193412 277162 290288 179923 172463 324350 284889 45821 26048 86981
25732 86981 205487 166501 41328 40707 -9011 33480 87034 64997 -42837 -11607 173547
25721 173547 162972 143305 87292 160175 99695 -16883 29148 117712 148598 192922 160199
25710 160199 -4054 121498 216376 366986 302086 268439 364548 350723 262443 94089 -67886
25699 -67886 -73067 -111623 -60309 -29660 -193260 -323724 -312639 -118435 25289 97452 54379
25688 54379 -129794 -358919 -516973 -292430 65585 173454 131905 -83614 -106792 -6248
25678 -6248 155935 186023 104365 92514 126343 105189 -114793 -126303 63962 51386 58634
25667 58634 -54348 -169746 -31850 -40434 -68793 -186140 -193937 -130937 -113625 -5286 69379
25656 69379 157919 89311 131804 207914 229531 248761 252534 330166 239315 217943 -7653 -6530
25644 -6530 59730 111249 204141 178802 148053 -9227 -127583 -89606 -120750 -68733 120847
25633 120847 49063 -144053 -153044 -37619 -65671 -183075 -126277 -92994 -32255 -133477 -79424
25622 -79424 -8764 -156820 -82421 -58978 -84476 -27756 -179693 -175489 -57861 -25135 69590
25611 69590 41157 6008 104513 296048 183728 29530 173690 192225 18310 -10881 83043
25600 83043 63257 -13866 -120574 22237 114234 -23033 -116247 -77427 -31791 2138 3871
25589 3871 100053 185308 102117 -50395 -82164 -2425 129163 12055 -131925 -197879 -139098
25578 -139098 -265903 -320240 -199469 -289372 -341256 -311232 -238685 84012 173798 79682 44698
25567 44698 105238 97968 9021 -94857 -94627 -66736 44840 -56271 -6767 63497 220821
25556 220821 363540 271896 151604 166078 163747 -46182 -139130 25710 -82227 -170102 -251353
25545 -251353 -388139 -416420 -305228 -62158 34505 -17051 181936 199507 216629 127115 34350
25534 34350 24550 6067 103109 69129 67574 34591 21467 90896 18541 -54205 63249 159871
25522 159871 218626 105146 185359 212372 166955 17565 -37993 -85052 -120578 21455 255456
25511 255456 165548 76277 221381 342049 314242 311112 383272 194949 68740 107031 129272
25500 129272 212710 270981 203354 109964 83228 -24137 82592 34675 -123359 -60349 122255
25489 122255 259919 227662 145945 133596 202346 150592 209028 82402 194626 192769 -15117
25478 -15117 -86141 -2822 -40348 -122421 -230476 -16037 139007 84933 21338 -83520 43512
25467 43512 139717 156977 43647 -113688 -184860 -178013 -233629 -182826 -178976 -121068 -125674 -275952
25455 -275952 -291041 -287067 -200733 69953 223783 17480 -47825 38437 -50042 -206220 -196639
25444 -196639 -153071 11870 50632 23664 95896 197933 185048 154013 44695 9302 113764
25433 113764 125989 84550 24779 -147391 -5616 13414 62463 96832 -92943 -84811 2560
25422 2560 17685 50764 -14067 -142659 -63227 -40822 54819 10606 57926 191497 329168
25411 329168 194021 -70837 -12320 -46785 -37242 -11883 31074 16332 208154 289965 255091
25400 255091 310397 124973 -206556 -199845 -309129 -274869 -146508 -134061 -134792 -93067 976
25389 976 117124 328997 267276 34215 -75577 -158523 -204638 -92866 8775 26823 -108342
25378 -108342 -66961 46897 -89859 -81213 106476 151052 92914 -36169 -15426 57824 115924
25367 115924 130186 187839 56650 138114 98778 35725 -25149 -200260 -40539 99951 49124
25356 49124 81160 115210 121930 107523 -24483 -39125 -41215 -87969 -46082 -162280 -159331 -150393
25344 -150393 -130727 -5965 -22318 -84788 18597 -118362 8412 181949 120538 -37990
25334 -37990 -46540 -169752 -163408 -90120 -90058 -114178 -152751 -99858 -72401 -76759 -190778 -145140
25322 -145140 -37606 -105291 -71040 -23106 -156744 -104510 -175419 -93924 49494 -190083 -197617
25311 -197617 13905 41425 7363 -189758 -354536 -339218 -274163 -232424 -91782 -122170 -91510
25300 -91510 -42879 -64972 -71453 -258160 -160390 36237 21863 78875 89068 18542 18700 -23663
25288 -23663 -118889 65888 183236 174504 201992 93745 -51876 -47744 -88512 -127334 -134951
25277 -134951 -222608 -196688 -78042 27006 -38814 -102452 -126984 -191736 -372766 -478396 -399599
25266 -399599 -257210 -144834 -106043 -165356 -215421 -160249 -59092 -38747 27226 93562 -48709
25255 -48709 42277 39607 -137570 -303005 -373742 -381248 -229134 -146584 -103408 -28378 -117742
25244 -117742 -191872 -275452 -459826 -160993 18942 -55695 -93203 -273941 -311716 -293141 -222248
25233 -222248 -89597 -37601 -90602 -38359 -10461 -59032 -71279 -30644 -14462 -89030 -154305
25222 -154305 -126542 -74589 118754 237071 327636 319965 142351 169625 190086 381910 437254
25211 437254 322794 101504 -145506 -261619 -186391 -87471 -94661 52729 -84933 -153380
25201 -153380 -201858 -203166 -90705 -110190 -101522 -81179 -69380 -87170 -32347 -40881 -12254 -182824
25189 -182824 -355852 -490353 -263893 -137857 -154560 -196258 -168271 -127297 99299 193438
25179 193438 100621 57236 17201 187403 274303 152559 199685 152864 75134 -25708 -150986
25168 -150986 -327962 -392409 -281264 -99483 3342 -72628 -52481 43220 10550 -105574
25158 -105574 -104354 102549 199041 193944 187451 -46579 -152382 -165485 -150571 -140069 97853
25147 97853 144501 196067 293175 147209 129059 63632 -122492 -145705 29886 91368 103309
25136 103309 52168 -5282 -120300 -137551 -38187 -3909 -83944 -66510 -180310 -86757 227575
25125 227575 135379 26244 -14253 56520 -31224 -79382 -37618 51806 57643 -128369 -221773
25114 -221773 -252063 -61368 99279 -27494 -158126 -180356 -204426 -28387 -145778 -165074
25104 -165074 -13882 -57492 -200216 -195963 -236375 -382769 -329347 -262517 -238136 -182947 -120050
25093 -120050 -45252 -82735 -81512 -17336 -73430 18493 134457 241544 123750 128293 174660
25082 174660 288305 250477 183701 98413 100134 156978 257350 222143 235927 299479 197502
25071 197502 15259 -112455 -138369 -4495 85195 154082 201725 100738 -15693 181960
25061 181960 349903 257222 225928 349713 385457 404282 429390 192711 180282 196801 87947
25050 87947 43744 -18399 22630 -133140 -209459 -139776 326132 336233 240882 187671 169764
25039 169764 82483 113697 263588 271342 208578 229759 229984 311613 123597 87628 87438 27475
25027 27475 143611 107964 37560 98415 -69723 -181870 -65122 -125700 -49054 324 -47950
25016 -47950 13286 -8860 43547 77531 22466 177361 273824 172265 -66661 -165719 -158106
25005 -158106 -50445 -56438 120050 109445 165811 169853 26569 49470 -58449 130782 336656
24994 336656 244054 25819 60221 96372 218260 56644 -92935 -43694 -36187 -35819 13167
24983 13167 77718 -32116 -49968 57898 158998 116177 -8585 -46148 -60276 -59597 -98125
24972 -98125 -152932 -153412 -89265 -100749 -9211 3711 -21283 31565 260617 202243 91207 -17748
24960 -17748 -105028 -172006 -193457 26999 84094 -21313 100416 84867 -64612 -19002 75715
24949 75715 158231 91639 87742 85634 50277 76689 62968 5021 105791 145208 142737 157894
24937 157894 121818 122288 104826 34158 14398 116645 -65336 -203444 -147158 -72805 -53160
24926 -53160 54017 -83546 -234137 -195505 -80324 -117245 -14724 58508 68377 243685 350052
24915 350052 61611 9690 49875 138241 325467 134390 27997 -110858 -230750 -195499
24905 -195499 33475 119349 111139 173945 111131 144610 85029 46617 158825 266939 217042
24894 217042 68008 21478 -28943 -2683 -56881 -53298 -96832 52318 -6492 -49168 58306
24883 58306 68000 7678 -114061 -107793 -119104 -219494 -211467 -155327 -230999 -225525 -363236 -262001
24871 -262001 14015 170982 167005 105873 25980 -131095 -175622 -51129 120218 -16577
24861 -16577 -180968 -100658 -144537 -274612 -321964 -159414 7729 233311 259260 12725
24851 12725 -36885 69802 65359 -56670 -181682 -212541 -90926 -20317 37653 121009 -5994
24840 -5994 -62553 -146403 -207288 -330501 -317714 -227071 -211199 -126724 30300 -123851 -188265
24829 -188265 -118311 -29437 -16195 42572 452 31824 -28719 -158773 -5004 -13044 -66845
24818 -66845 -53662 -181947 -161015 -36890 78907 39270 -3417 2454 116591 60541 18248
24807 18248 60893 -10949 -74366 -5415 73024 -62254 -32029 -4281 32757 1166 -81485
24796 -81485 -111331 46428 174079 105614 -91694 -97033 -154201 -147639 -107616 89848 183217
24785 183217 33831 -28674 -40971 -125114 -204341 -83532 -7845 40266 -7690 -986 150524
24774 150524 45938 -2895 -30152 27179 2757 -74115 -68768 -37911 -16254 -145141 -126815
24763 -126815 76172 168527 306198 327979 149569 136424 132471 64692 -44585 -33959 46454
24752 46454 94486 23528 192755 244755 -27122 -139495 -149044 -85841 -64871 84180 175674
24741 175674 24126 -67393 9087 10738 41708 227372 224228 137272 78089 110992 108472 3140
24729 3140 -7111 192673 268852 61622 47001 71601 78577 -3741 -60475 54365 106311
24718 106311 39447 171844 129563 -68116 -11994 106863 257022 268485 147742 18803
24708 18803 -19522 -83316 -75176 40149 132773 167449 125196 49815 26923 49233 51697 55029
24696 55029 -129935 -183832 -115776 75990 153641 155880 133219 118592 82505 45401 32881
24685 32881 -4152 -85388 -83332 -36525 52685 104146 42412 4867 53005 56599 237467 285278
24673 285278 245479 164025 110046 163454 260751 147058 -125483 -104198 49579 89942 -44814
24662 -44814 -48417 -109232 -56502 -3845 135707 189284 123061 113812 196198 103669 -105957 -21484
24650 -21484 45240 123936 204212 147952 123944 178854 298294 259175 186951 146836 30422
24639 30422 60091 159665 160947 144300 112813 264818 182383 4114 -47008 -3516 -59041
24628 -59041 -94153 42515 -36377 -136156 -135651 -41392 75672 104547 187832 110535 37860 -64596
24616 -64596 20163 10372 -22504 13671 77386 140245 106845 5565 -5588 51156 -3345 -64888
24604 -64888 -140662 -80459 42470 23940 -5831 -37237 10984 87155 96971 163290 27736
24593 27736 -89959 -168470 -226771 -57256 -39599 -50160 -80468 -131606 -62626 197014 376919
24582 376919 291104 181824 55158 19264 -15319 -289171 -399180 -307879 -291374 -137666
24572 -137666 10741 545 19541 233956 245884 61465 -8841 -71571 -134238 -203057 -143495
24561 -143495 -117055 8320 -93068 -57103 115571 185274 117284 31459 14413 165343 215747
24550 215747 147811 75896 151763 189921 150169 43079 -97555 -324361 -244908 -382637 -346051
24539 -346051 -151264 -63688 -224642 -284734 -162049 -103798 -100420 70220 99678 66620 -17353
24528 -17353 -76951 -15949 -70449 -247937 -248762 -45103 -96592 -262282 -252356 -321333 -360237 -193621
24516 -193621 -326561 -377015 -99278 -143610 -190721 -230451 -242611 -195423 -510321 -465835 -266131
24505 -266131 -284486 -303564 -201354 -248960 -78561 -9286 97989 70908 179822 110531 72922
24494 72922 34186 77816 -35421 88197 183540 -50344 -171741 -152526 -178710 -282349 -324473
24483 -324473 -290693 -262111 -282039 -228696 -180958 -142330 -55082 -23653 -119574 -173347 -101892
24472 -101892 -24450 114606 167800 215572 290394 204133 46476 132200 56938 -26515 16913
24461 16913 87429 3407 -115695 -169901 -73954 53861 -18952 -42564 -72128 -78446 -85980 -138700
24449 -138700 -299421 -281778 -79640 4675 15290 117437 -11321 -273671 -320085 -314026 -145025
24438 -145025 43971 142987 99306 32841 36799 87979 -96527 -267516 -322379 -215164 -182137
24427 -182137 -226660 -205501 -232985 -195671 -290661 -282410 -106372 26798 180674 38209 -133897
24416 -133897 -363582 -301436 -200173 -84010 19386 64324 -15257 183020 286069 291636
24406 291636 147905 80266 -64994 -66996 -60493 -235900 -279153 -186083 -197581 -64136 -105227
24395 -105227 -91799 -135766 -112486 -99106 -163963 -224609 -189040 -112895 -94436 -197768 -271507
24384 -271507 -246814 -130630 77095 94281 128574 263074 374354 360781 145898 -76461
24374 -76461 -171965 -308139 -131835 -10121 -54270 -178713 -177835 31395 40671 -30006 -65954
24363 -65954 17507 85987 33571 -58453 -177795 -42372 -20215 -61621 31195 -78870 -361891
24352 -361891 -226442 -239958 -247597 -283010 -241306 -282531 -392207 -265769 -158087 -159200 -209448
24341 -209448 -246841 -193378 -18725 -45210 -48045 29634 54662 116430 90655 216444 222725
24330 222725 9609 -315 123874 132099 164076 151950 200853 112288 -186608 -243814 -183175
24319 -183175 -53315 -26918 2518 184812 385972 208340 68613 -153039 -247407 -131661
24309 -131661 21049 56345 62589 -144846 -60716 106114 162343 187772 202512 212638 291511
24298 291511 196651 -68062 -92340 46095 -102726 -65508 -60598 -230476 -333599 -293306 -278486
24287 -278486 -349902 -370700 -365725 -339440 -265447 -250842 -280806 -301501 -350728 -275599 -139218
24276 -139218 38603 -705 -70271 -143716 -161155 -22168 61127 -47692 11952 101867 86921
24265 86921 37197 154683 178672 -41293 -26444 -31048 -13664 -94326 74518 127165 104340
24254 104340 155405 89782 -41615 -30726 46586 -30314 -195498 -201193 -134445 -212893 -220082
24243 -220082 -105428 -87587 -40487 83692 155733 324741 148744 -70548 9921 -97946
24233 -97946 -119291 -38657 162914 98471 58218 156878 123093 228782 285834 229439 65831
24222 65831 10326 186850 236457 249780 133564 108195 156805 78864 20814 -49158 20984
24211 20984 52386 -9999 -3695 -14756 25684 -9900 16264 -7753 81596 -138517 -253516
24200 -253516 -290123 -245214 -175066 -44949 -43820 -51762 67146 150013 24533 123189 165381
24189 165381 -82066 -78413 -44723 -81300 -174732 -129475 -76810 -56391 34918 -33158 -7788
24178 -7788 14389 34250 123779 35778 7731 -30687 95007 159894 164283 -59773 -153129 -41600
24166 -41600 -7731 85026 134275 148270 70481 47829 196793 60814 173193 66509 40165
24155 40165 125539 95517 146224 71644 -6229 -67553 -131434 -163331 -108808 -6675 9282
24144 9282 -114692 -177913 -337455 -354535 -200620 -209785 -200147 -222936 -104447 -105818 -315211
24133 -315211 -285727 -119357 -52339 -15164 6223 -21294 -143396 -274371 -229237 42521 71421
24122 71421 80328 62067 74488 272752 319296 244105 197296 169657 206148 303968 179366
24111 179366 216571 219853 142674 45234 -200778 -172300 -188575 -80873 103856 -10202 -91625
24100 -91625 -208623 -229467 -75831 10283 54155 83389 21478 -60418 -168314 -238651 -204406
24089 -204406 -262348 -178098 -50465 29572 21778 54936 62378 73459 253719 250945 151527 35067
24077 35067 -151738 -140679 -130710 -98862 -14804 -21843 37763 63746 -70694 -156145 -215179 -85503
24065 -85503 -63681 -4700 6381 7875 -114308 -39046 -15671 -112824 109588 126861 -52714
24054 -52714 -66624 36694 111886 110484 191441 216161 184973 301215 252244 224383 140534
24043 140534 92759 58346 53464 47625 118604 124608 -8371 -108501 122351 82150 24930
24032 24930 -14357 -5700 4938 57653 -62912 -208804 -283735 -160617 -151592 -205267 -141904
24021 -141904 -65950 -18378 36238 -11408 -148103 -228801 -210397 -209210 -293959 -271856 -109548
24010 -109548 -85990 -157701 -198700 -319865 -283482 -224631 -69781 112025 24305 -76212 -27869
23999 -27869 -166009 -120404 12906 172218 225061 205640 99527 31186 -141352 -257817
23989 -257817 -351760 -453555 -425071 -301072 -176422 -160911 -265840 -266046 -143904 -112904 -7795
23978 -7795 124960 142799 26884 22757 30199 -117068 -67230 93234 218738 200378 122792
23967 122792 238192 156268 16836 -209607 -299614 -289280 -171172 -363413 -369029 -123112
23957 -123112 144082 155522 46307 -23570 47952 145465 25617 -101442 -41867 137235
23947 137235 367371 303642 216077 79657 181604 316885 145263 117071 155594 137262
23937 137262 150697 87677 -118582 -282771 -304671 -246619 -260309 -333330 -353006 -329420 -379803
23926 -379803 -412794 -482598 -414262 -165575 -112396 -42631 52483 -32954 -112048 13119 236038
23915 236038 146422 32051 -61646 -111858 -114645 51447 262318 246206 254144 261579 174119
23904 174119 319799 304054 127543 -25369 32415 13430 89765 176833 59064 7687 -41645
23893 -41645 23842 22447 -3329 -100227 -251536 -330257 -280182 -176195 -177379 -221112 -47151
23882 -47151 21857 45516 6931 55460 -107874 -32575 -33172 -143282 -167393 4218 69684
23871 69684 14541 -97868 -165537 -235183 -180883 -298221 -363100 -130043 -38466 -40720 -154106
23860 -154106 -195765 -255762 -424595 -284978 -156948 37694 190284 244063 250018 120176
23850 120176 40393 143192 52279 -86943 -40612 -53426 53909 43959 -100218 -137399 -266249
23839 -266249 -333012 -146992 -94375 138633 168914 -45152 -137807 -146038 2607 153917 209326
23828 209326 118989 143706 169201 67343 -104892 -56635 -2060 -137295 -195903 -141991 -217023
23817 -217023 -239766 -203929 -93315 -55867 -229255 -352892 -169640 -110934 -149661 -111176 -28368
23806 -28368 -110243 -132881 -27685 -55481 90710 28176 -23418 -4071 -222879 -329434 -256781
23795 -256781 -201050 -104380 65618 96006 -53165 -92913 -70235 -46995 -16697 19540 -38976
23784 -38976 1651 85168 101078 -5307 -173928 -191637 -131111 -58774 37912 12777 -27663
23773 -27663 41284 56544 -2273 14967 82025 -47314 -131825 65205 24661 -31725 -75681
23762 -75681 13227 -24853 56480 211058 137814 24344 43382 -58834 -139350 -1381 100093
23751 100093 119786 35130 -82137 -66000 -57791 7509 56586 -31188 -121529 -184819 -209650
23740 -209650 -131061 85675 219728 290100 337589 303244 96553 125056 277848 412913
23730 412913 292463 236972 94588 -97786 -75760 -16834 -138571 -273549 -149171 -70658
23720 -70658 -75422 -190133 -302008 -501811 -318978 -4625 65310 -37709 -5195 10171 -7530
23709 -7530 -6341 73043 -41236 -9769 55192 -4933 -148153 -89924 -158868 -181548 -240363 -333103
23697 -333103 -398977 -328676 -219013 -205064 -169863 -152599 -188238 -117235 -52827 105385 99232
23686 99232 49432 60005 187978 203028 83385 -27153 -93354 -55027 -52509 -105560 -180363
23675 -180363 -67231 -3681 -24220 126265 21128 4272 75464 179183 202373 -111601
23665 -111601 -888 159935 61495 -86780 -74441 -3648 -5117 -117454 -103305 92877 117273
23654 117273 -115932 -256076 -270339 -297667 -154091 144674 161186 218264 204018 -53798
23644 -53798 -223740 -125807 -52214 -39899 -285960 -338692 -286411 -184182 -41998 -97211 -188087
23633 -188087 -175512 -184440 -213647 -232943 -201048 37679 190766 272034 169125 101301 8823
23622 8823 -75484 -183923 -162498 -57924 -14052 -172851 -196482 -124538 -40714 -5084 -53131
23611 -53131 -218042 -288651 -140601 -74151 16800 198873 143720 33206 6588 155155 144108
23600 144108 23969 -9772 -148839 -202760 -260417 -228216 -210487 -247382 -378855 -347420 -192173
23589 -192173 -74904 -257603 -371723 -373437 -394905 -245980 -125033 -218188 -291806 -343540 -348547
23578 -348547 -380237 -249959 -190691 -74901 -4205 71817 111170 -59599 -251473 -325687 -265606
23567 -265606 -334833 -268734 -97346 -20081 -19490 -89822 -119703 -89814 -89531 43601 20382 -51106
23555 -51106 28252 -15968 -140648 -72051 -115491 -40279 -93515 33538 129104 149628 102222
23544 102222 -97961 -245852 -222031 -244865 -281719 -241719 -237567 -28456 -7683 -103249 -277638
23533 -277638 -199614 -168507 -143905 -47437 1645 8343 25671 -24624 55562 252313 218377
23522 218377 164060 21191 -114923 -187154 -215539 -252308 -334323 -460877 -431917 -278524 -85743
23511 -85743 121352 304725 289145 322132 200754 175656 215015 202795 209307 236235 268836
23500 268836 345332 278618 191432 137577 94162 -57350 -158617 -100978 -48696 -36762 14563
23489 14563 -113942 -220801 -248519 -53721 134313 54589 55776 -28700 -135591 14789 68312
23478 68312 63504 105402 112093 -64846 -232814 -266369 -146816 -35925 -47760 -8158 40129
23467 40129 51166 77591 120361 111425 43042 58225 122124 201341 147507 50364 84590 93043
23455 93043 99769 125242 121342 -16534 -86823 -46881 63246 157971 120446 -36187 -91673
23444 -91673 -94051 -86361 -111970 -100372 -27927 -19378 85097 13832 54566 140509 170998 252593
23432 252593 309233 194404 132125 67210 135618 127039 124559 -16586 -10340 -82691 -127319 -95782
23420 -95782 -79071 108904 160749 111895 16536 -569 85791 69296 89336 70530 97066
23409 97066 -14836 -200020 40340 154083 219584 183928 114378 24737 1261 -110442 -156164
23398 -156164 -199563 -224605 -254876 -177658 -121472 -245413 -324526 -298241 -196026 -57384 69538
23387 69538 128280 242458 329374 325406 367750 429019 374092 137743 4226 75475 21491
23376 21491 49984 213253 133719 236044 221923 222415 257478 203899 221071 243541 162603 -45728
23364 -45728 33283 161618 237720 273014 254665 202504 239560 339661 235816 105411 41471
23353 41471 220813 220468 168086 86659 168841 151772 197431 300624 323039 92705 -12876
23342 -12876 47898 64146 281193 350754 336664 315215 333400 380575 300824 213281 277102
23331 277102 -32839 -103734 132700 156078 112729 203154 452024 538860 525869 756736 975301
23320 975301 1182135 1621940 2019440 2640313 2969003 2888646 2809784 2594438 1979624 1580125
23310 1580125 1143068 624400 256794 226648 333783 328731 324168 272635 351587 217508 43176
23299 43176 -65011 -69132 -162202 -127809 47311 141722 93931 98949 125948 -8496 -255495
23288 -255495 -166677 -32976 57512 83472 3283 -76697 -287939 -338563 -243143 -161751 -86702
23277 -86702 82812 69185 -5642 78385 121582 173478 212549 99370 136565 272671 208899
23266 208899 69153 -4417 73108 106978 97465 -19912 -234331 -251458 -252149 -290541 -311887
23255 -311887 -152692 -13977 -24641 -141817 -230454 -128414 -34514 21049 81798 208198
23245 208198 224803 66357 -72245 -167516 -154683 -140870 -128559 -68814 113 15824 -157418
23234 -157418 -225744 -141519 -37446 44516 -41259 107692 34702 -20192 73759 224524 302011
23223 302011 254344 271897 214982 154747 78812 78753 -46432 -71841 -150158 -201541 -196114 -68695
23211 -68695 -80944 -254140 -230842 -268959 -56703 10883 -86806 73226 210846 173078 22652
23200 22652 -23156 10435 -42993 -137372 -115495 -16296 52939 -32762 -136802 -263601 -173159
23189 -173159 -29858 97550 175063 81869 -85500 -126001 -219836 -159442 53622 28336 -88550
23178 -88550 -179520 29180 65128 74685 -24599 -51430 -178288 -293145 -204958 -62225 151813
23167 151813 228098 197298 180372 182231 163362 -26378 -62640 -2570 -85320 -206272 -200281
23156 -200281 -119425 -35887 2133 -89019 87004 37265 79057 117665 40544 3730 -77211
23145 -77211 -161664 -214250 -107982 -139481 37533 162790 155593 81105 -28549 -99509 -14202
23134 -14202 -24840 -78567 -45828 -31711 7337 120444 130480 62763 2863 66740 30884
23123 30884 -110250 -196975 -253504 -235507 -31489 70197 192710 259831 189230 87744 160706
23112 160706 -60115 -267620 -224469 -44020 91412 108757 127709 -2890 -40352 47695
23102 47695 -23091 -14393 -76453 -114500 6176 100441 192470 214732 158689 80443 6800 -4711
23090 -4711 19961 -37234 -91037 -106140 26660 45642 -108503 -189194 -266455 -286085 -238452
23079 -238452 -194450 -28112 -23861 -73159 -9514 99979 104715 -35255 -5847 -13083 165483
23068 165483 253655 236759 151522 89369 124573 100120 -20457 137377 234139 207062 -33494
23057 -33494 111537 224930 341928 308081 264591 196062 186723 108548 -50415 -170911 -224812
23046 -224812 -88949 35686 -76674 -98327 1190 107522 107894 113919 215965 310574 228435
23035 228435 73883 15029 56516 98458 176538 128101 141504 290721 163083 90533 68700
23024 68700 53354 197226 359449 426401 487778 463555 386372 336202 98161 -109464 -157337
23013 -157337 -186807 -155124 -162487 -71515 7617 73435 86327 136586 182412 109394 57205 -1138
23001 -1138 24585 -63392 -39961 769 91324 148842 249178 169660 182637 187873 53180 20031
22989 20031 105487 5842 -161807 -94217 -7462 114234 290572 150893 82011 213236 276431
22978 276431 182620 217779 240330 169494 202909 45595 -88247 -105551 -91297 116770 179818
22967 179818 278383 66072 -41693 -148147 -149207 105110 96250 47808 130499 128991 89403
22956 89403 178393 -17954 -12464 24220 -26682 -216569 -198545 38012 65008 146816 156323
22945 156323 103133 60114 80113 138773 114242 71233 212155 145711 27139 174503 245643
22934 245643 78023 49975 198120 158391 15175 12392 125111 321635 286783 294789 188275
22923 188275 219372 235488 33792 6089 55192 39275 -100216 -144632 -26803 77570 285616
22912 285616 349889 226842 147958 253515 345633 321086 332287 325744 377796 369059 310535
22901 310535 425680 415936 483566 728350 850019 762198 620794 343789 152427 95708
22891 95708 119110 81802 -44438 -51979 -68828 -34809 -55880 -9808 -15208 60457 118325 244853
22879 244853 299641 368098 282465 291153 301960 349710 336783 349975 331723 327474 251578 187597
22867 187597 28500 107690 164559 306658 375474 379591 582218 721289 786244 746074 726384
22856 726384 691445 867890 862361 816106 875227 907152 835660 746770 1052097 1371570 1698120
22845 1698120 2169505 2570026 2865491 3203247 3454430 3438989 3232968 2894626 2477456 2066518
22835 2066518 1784998 1533977 1586205 1444730 1377773 1578278 1677142 1463098 1360744 1425095
22825 1425095 1348582 1346478 1469603 1503221 1633110 1445568 1395259 1605064 1755816 1849408
22815 1849408 1934405 1843781 1984447 2200753 2421118 2623390 2557398 2622899 2724942 2658839
22805 2658839 2660256 2881534 3101207 3263954 3345295 3536488 3780763 4164172 4392059 4546834
22795 4546834 4926536 5314633 5752106 6290303 6832934 7403271 8363776 9248621 10256867
22786 10256867 11304739 12236273 13395624 14927277 16567708 18544950 20983733 24009676
22778 24009676 27749067 32582814 38723052 46491437 56841342 70971781 90901378 119452617
22770 119452617 162044756 225662633 314008192 416441828 506218285 557423338 555709685
22763 555709685 509032756 437762897 358017231 278827618 208638479 154215282 115580927
22756 115580927 88555480 69515403 55822392 45429203 37470990 31367237 26398194
22749 26398194 22458728 19157080 16527068 14365249 12586799 11210600 10133406 9184769
22741 9184769 8515000 8018217 7435423 6865830 6403625 5926809 5548742 5093479 4726842
22732 4726842 4433381 4122229 3799920 3489031 3445156 3333121 3216857 3159978 2953781 2671091
22722 2671091 2578318 2597154 2583677 2510589 2440521 2247214 2064430 1920519 1836442 1879387 1937729
22711 1937729 1962511 1909622 1781263 1746196 1701958 1737970 1752555 1580526 1376766 1352945 1488267
22700 1488267 1391904 1490962 1637361 1557632 1453893 1404139 1560229 1716567 1803026 2016693
22690 2016693 2501070 3252236 3767656 4102129 3933413 3602193 3293135 2917071 2430216
22681 2430216 2026291 1594096 1413099 1251790 948542 810015 601942 604605 572724 469588
22671 469588 399955 344794 499694 450600 495169 525257 382718 482483 443246 346558 449892
22660 449892 525364 553063 461199 450167 397383 279186 239646 367952 539026 662874 700462
22649 700462 471337 375883 372937 390889 464742 488328 553440 673351 843949 860201 864151
22638 864151 609420 474338 596834 588949 372557 206774 82286 41204 4586 100641
22628 100641 268734 160945 -136220 -277135 -226153 -214504 -194488 -148784 -137581 -111657 -47072
22617 -47072 18831 -121257 -243310 -76028 86660 -9077 -165817 -195738 -105322 -47550 48414
22606 48414 163182 199762 282395 238028 156256 134228 168739 86623 196639 115792 133242
22595 133242 112406 62920 -46184 -126899 105765 84725 115927 339985 386861 339946 241590
22584 241590 275356 298566 216429 288344 239658 109431 20627 55256 185116 -25099 4523
22573 4523 40570 24117 87429 38936 -3209 67000 36650 -243542 -73341 111687 164170
22562 164170 168305 111414 84077 8689 -92347 -113616 -29277 -64652 -130531 -77652 -100973
22551 -100973 -173797 -208718 -322314 -52836 27215 40224 100326 115086 83267 224416 333184
22540 333184 383051 276736 -46318 -206565 -198871 -1585 56836 134172 38462 105732 48774
22529 48774 34709 90760 13295 -23722 -114858 -8688 -68634 -58984 -104069 22632 80953
22518 80953 -18536 7767 -41030 -11236 25242 -105270 -292001 -314060 -350834 -230757 -73231
22507 -73231 -93667 -70167 -106000 -126004 -55230 -7303 -36154 -67456 39860 59572 -14645
22496 -14645 -31145 -214632 -397912 -336695 -76102 -81674 -97554 35391 43087 -4845 8747
22485 8747 -76760 -195686 -150238 -129469 -60424 -3464 -144936 -94991 -45470 -11404 22490
22474 22490 -46335 -11983 62806 147464 159026 192388 -116678 -179970 -160397 -45885 73037
22463 73037 46613 77645 58665 -16023 32137 5369 -11526 -77805 -229816 -257060 -180680
22452 -180680 -32911 122914 90728 -15996 -175550 -165633 -169217 -117913 -56267 -42394 100710
22441 100710 152240 75210 -51272 -4371 117548 177267 151499 251285 204479 190300 386170
22430 386170 369283 206645 45365 -75008 -147777 -168709 -5393 95027 13717 -75838
22420 -75838 96050 191173 104130 -78204 -88666 -160178 -184638 -163609 -207383 131722 366188
22409 366188 262195 94310 4558 46473 42496 -120643 -245854 -232589 -53552 52986
22399 52986 78417 152325 201586 112315 3307 -12578 -104173 -33203 -4736 149520 288022
22388 288022 188237 54686 -96842 -202731 -221244 -260148 -246442 -117542 -80120 -591 41190
22377 41190 12029 224932 210216 129654 61358 -14020 -39759 -130973 -163024 -75502 45364
22366 45364 49652 -43225 25737 -14960 -163504 -160740 -19590 -27839 3734 14393 -94501 -334130
22354 -334130 -231996 -177206 -195663 -106429 -266577 -426828 -333733 -159658 -9335 213377
22344 213377 34791 -187897 32979 158510 209107 209806 92111 -117331 -139918 -68966 113418
22333 113418 135875 83135 234556 74564 -9441 63275 129864 96365 -16646 -113928 -59102
22322 -59102 31494 9777 -117083 -239636 -137950 -39150 -8166 -95870 -116284 -127797 -103596
22311 -103596 -173695 -269148 -190878 22443 -65832 -258500 -272070 -246370 -167250 -155833 -199161
22300 -199161 -96727 -18848 -182942 -244955 -289425 -164503 -65227 -80453 -226440 -179920 -2850
22289 -2850 214879 303415 372753 289567 -48043 -285512 -347784 -309606 -286721 -376440 -287043
22278 -287043 -300853 -237254 -137289 -150445 -19760 119800 7879 -66982 25101 6043 21496
22267 21496 188244 59082 -134983 -92006 -119144 -300668 -240859 -57064 -19362 -137330
22257 -137330 -79992 -63789 -5250 57002 -245148 -436375 -518693 -500078 -301330 -292227 -265550
22246 -265550 -206631 -171890 -92681 -105084 -128990 -15638 75503 85206 -19089 47896 44325
22235 44325 115603 115704 52509 37899 59699 141100 117348 95199 53579 -123475 -264508 -206854
22223 -206854 99605 346005 372188 310912 287052 273623 165757 151769 170772 334233 442257
22212 442257 561995 669292 897946 1240977 1653250 2159633 2504412 2755191 2799473 2567687
22202 2567687 2193084 1814518 1454845 1100809 741145 434791 167837 167866 136841 82923
22192 82923 74009 -65411 -86362 -14762 -20339 5071 -40446 -112530 -106990 -14574 94206 55741
22180 55741 -180753 -67860 -102691 -265983 -199694 -40332 -105049 -199216 -121422 -16520 -35829
22169 -35829 -97667 -371135 -299674 14105 99097 70916 147277 103254 248251 215076 97849
22158 97849 -13767 -57287 -16518 31761 131767 103987 -38962 -158570 -250326 -317925 -182912
22147 -182912 -231445 -271541 -200152 -160552 -97066 -112828 -256289 -213906 -22908 149844 52327
22136 52327 -29422 -99540 -226082 -180669 -157153 -160648 -92981 -66879 -258760 -330508 -239958
22125 -239958 -189295 -100422 114146 -11810 -122517 -217770 -196437 -62324 -41650 -158024
22115 -158024 -2278 23742 63816 -74275 -225368 -391364 -384384 -208122 -168487 -75214 156753
22104 156753 194174 57342 -50153 65940 43790 -13457 20629 -27094 -103670 -98738 -141427
22093 -141427 -159706 -259365 -189885 -146534 -148637 -175109 -220063 -122669 -58522 -239537 -280812
22082 -280812 -200110 -237620 -275482 -355591 -391255 -331312 -272969 -276063 -266331 -133225 86694
22071 86694 220328 54900 -112927 -54578 32149 -8496 -185243 -230771 -318068 -335736 -213622
22060 -213622 -67745 34141 -38441 -263416 -314591 -163938 -155716 -205015 -220511 -128613 -87336
22049 -87336 -86427 -148678 -131097 -323440 -435834 -401808 -388582 -396461 -192130 -33253 -88896
22038 -88896 -24162 -107057 -61468 -70144 -179302 -142252 -184463 -151097 -154219 -64652 -87919 -47399
22026 -47399 98368 84555 -117081 -92027 62709 54434 -92726 -139968 20507 184876 117303
22015 117303 26975 -27250 -53307 84446 24486 -29961 -140116 -55691 -4934 -18013 -17055
22004 -17055 -75111 -107221 -274106 -355931 -201364 -180955 -138725 -268323 -332902 -214100 -91958
21993 -91958 -150723 -182659 -89717 -55041 12963 -171730 -189661 -140397 -131866 -183622 -159421 -31470
21981 -31470 -32441 -43954 -169644 -69771 92647 91072 114908 -5938 -293137 -432146 -332274
21970 -332274 -202401 -394327 -471208 -218633 -97798 -31890 -66670 -234742 -356753 -273939
21960 -273939 -228560 -181075 -92332 4266 233794 127004 16603 -32909 -312143 -246693 -102829
21949 -102829 -16220 119208 159466 161858 141994 -2609 -231698 -191759 -146868 -159947 -148897
21938 -148897 -147971 -202053 -265623 -377420 -244289 -208319 -181094 -53733 190523 176541 153129
21927 153129 -49477 2457 -117320 -265228 -219584 -31663 169414 184450 21899 2328
21917 2328 -3590 -61609 -156123 -91771 -37842 -100895 -91477 -155911 -162022 -68611 -76081 -151536 -122891
21904 -122891 -19861 -24658 18236 108682 201417 25666 -139590 -108429 -126405 -164773 -111601
21893 -111601 -132457 -302344 -176236 38942 39781 31889 -65146 -76065 78984 9161 -39436
21882 -39436 -37549 -87062 -148910 -120896 -76673 -41460 136063 95914 -62085 87691 242153
21871 242153 144199 -49840 -46183 -123053 -237273 -128062 107438 131719 84860 4559 87642
21860 87642 96 39822 188688 35280 -20970 33220 126638 -79392 -263576 -373395 -394003
21849 -394003 -281580 -232005 -99034 105928 -1273 -187075 -273281 -329962 -242704 -149675
21839 -149675 -272479 -489760 -415156 -295849 -255089 -56836 39179 167746 195346 99000
21829 99000 67938 -40932 -91322 -91712 -150739 -213867 -297212 -339151 -439581 -351607 -132531
21818 -132531 -197217 -386999 -228904 -58950 -108601 -122294 -50261 -6320 -152073 -291914
21808 -291914 -301207 -189086 -25217 53883 204510 227175 90691 -25977 -53881 -55499 20884
21797 20884 51731 35826 -17031 -176448 -277042 -247077 -57231 -22551 -5783 6213 -143271
21786 -143271 -471617 -356417 -110262 -101862 2143 -9624 -92091 -261634 -350447 -131205
21776 -131205 -70117 -231214 -160451 -79626 -113088 -126522 -189028 -139958 -201282 -335853 -244475
21765 -244475 -188109 -165227 -147982 78019 176468 -32080 -199909 -239038 -74909 137611
21755 137611 156021 70499 -27514 -79726 91966 45835 58994 93469 192589 251433 23613
21744 23613 -76504 57338 121327 50679 90639 48665 -49739 -196764 -238850 -156764 17184
21733 17184 108851 138175 61683 -142568 -237913 -111816 3216 -180345 -197149 -140991 23340
21722 23340 104959 -61207 -107727 -94624 -98634 -139575 -127980 -62947 -162343 -147205 -86501 -259023
21710 -259023 -256590 -81095 -100033 -227107 -190516 -130781 90580 264316 257790 44660 -110280
21699 -110280 2114 -39301 -85933 -184952 -262365 -268370 -158750 -64343 -11789 -144242 -213918
21688 -213918 -58681 126594 130883 38233 -62781 -146432 -224283 -155427 39848 13701 -4725
21677 -4725 -101535 -257495 -339605 -230978 -101882 -181375 -315333 -147637 -147178 -116489 -162749
21666 -162749 -260185 -333695 -310492 -279421 -239176 -266218 -162745 -75889 -1580 32399 6701
21655 6701 -94173 -122604 -17366 71601 30033 -76980 -230757 -281215 -194793 -118896 -118571
21644 -118571 6800 -82586 -67505 57013 77164 -213646 -171589 -118111 7380 125908
21634 125908 18141 -49703 -143941 -311874 -384033 -364033 -305993 -209583 -70176 -22975 56955
21623 56955 49403 -147540 -160375 -121202 -108114 -77009 -10145 -105284 -246966 -267071 -161710
21612 -161710 -108224 -44977 -127438 -225352 -198070 -128130 -302351 -152184 -192493 -239693 -205369
21601 -205369 -225056 -270319 -259074 -259186 -121900 19032 60035 19317 141109 142684 193752
21590 193752 85612 -83618 32065 76066 201009 87751 94239 24298 -120072 -64991
21580 -64991 149466 84784 89639 147401 100527 -75644 -276337 -116130 79533 110366 26468
21569 26468 121598 83638 44626 108469 -96487 -168450 -297897 -194235 -227184 -109440 -35377
21558 -35377 -140786 -241614 -127869 -133352 -50135 -103651 -189580 -146700 -21764 -123534 -100155
21547 -100155 -53670 36512 -110499 -138866 57410 107704 89008 53295 15873 -9873 156782
21536 156782 310010 307449 444578 431057 557156 746436 782595 721985 552184 431792
21526 431792 377784 428924 574478 631735 772332 776850 552728 624401 655606 628229 452306
21515 452306 334903 609847 597862 309217 140662 187649 323090 487863 546105 478220
21505 478220 237052 169389 195317 298031 262264 275391 414223 615026 589948 499797 452583
21494 452583 522549 653588 861018 879090 660549 529272 537631 605171 588284 463794 252252
21483 252252 202429 273434 165071 8280 -107665 -21944 72053 98894 24260 43697 177797
21472 177797 189289 252945 334635 310260 336003 148317 -9203 -87006 -82287 -116874 -27379
21461 -27379 -83964 -183344 -180891 -130158 -168166 -45158 -103173 -209934 -270666 -401650 -443812
21450 -443812 -250219 -167722 -90309 58060 221279 155479 60329 -6272 -4432 19972 33423
21439 33423 89972 -69160 -27068 -35355 -149384 -97521 -100636 -89707 22242 -19096 -268739
21428 -268739 -264771 -72421 49252 140391 117103 15696 10774 21683 -76512 -59877 64389
21417 64389 115998 36260 -87700 -317368 -366009 -276467 -91311 113757 156186 113846 136365
21406 136365 103848 150542 52118 -82854 -1694 13919 -3843 -24882 103646 213510 139414
21395 139414 23301 24122 -120010 -144790 -153797 -206031 -191248 -36796 90512 30126 -79333
21384 -79333 -94286 -47034 -34655 -145550 -235556 -273311 -230636 -176098 -95336 -112098 -188357
21373 -188357 -145645 -43934 22712 -92247 -163807 -174358 -125469 -221502 -110945 -68006 -70957
21362 -70957 -52541 35807 -86776 -285567 -341254 -242536 -110170 39588 146668 119085 -13551
21351 -13551 -143923 -268255 -152741 -25575 115894 90448 49548 33489 59362 98091 117132
21340 117132 661 -188905 -389663 -416745 -321851 -251843 -92500 2829 -115556 52702
21330 52702 217404 152025 -25258 -227532 -311041 -248746 -115759 -42517 -57758 -162543 501
21319 501 100559 47889 -23392 -90949 -251041 -223168 -21465 -86442 -94276 -122375 -85649 -215653
21307 -215653 -87095 48110 -11949 -108642 -107936 -84995 -69776 -106308 -42357 55405 22429
21296 22429 92927 31872 -27569 -39798 -17650 46833 103772 -21113 -99007 -101662 81315
21285 81315 160114 -15965 24987 211463 401426 526819 420845 315870 164303 91386
21275 91386 -8854 11034 151768 261286 249759 107397 112627 211722 199247 -14657 -67712
21264 -67712 50875 43098 31157 -4716 13875 87859 -20701 74844 86325 -1402 117345
21253 117345 222668 76064 -70558 -149219 -129254 -261767 -237478 -72907 -31657 200213
21243 200213 73721 -187866 -119267 17635 63415 63820 38402 -86831 -97251 86101 106747
21232 106747 125259 108080 -46208 -20632 -81287 22700 188613 155973 127050 243548 305735
21221 305735 403999 258503 295491 399650 431951 488110 389229 252082 167531 79108 127827
21210 127827 44587 11144 58612 62075 161836 106163 14148 -10489 60907 87398 52578 -95585
21198 -95585 -211457 -147693 -54644 -42506 46086 260435 336610 479803 232387 171953 280000
21187 280000 247843 328672 283849 337239 356540 278387 189222 165929 287782 129281 -31130
21176 -31130 52419 131055 115066 54037 128917 142553 195820 219282 229946 87397 30301
21165 30301 -140168 -32555 6788 199428 141757 123205 213224 210263 130584 53781 24309
21154 24309 75140 -30890 -59482 -79114 -206010 -129994 30331 267912 499427 534264 517976
21143 517976 440363 378537 390372 495942 289503 -29648 -18602 -87379 -15497 74762 135968
21132 135968 54460 -51327 -3437 -39119 116009 139148 114034 147123 64156 112259 195186
21121 195186 187245 223755 292658 190520 274542 461464 531395 370061 310699 304832 359199
21110 359199 414233 246737 359560 452305 318086 283456 389308 359932 269573 84602
21100 84602 44303 194063 221652 103115 83538 200369 261116 300842 306429 199793 298676
21089 298676 294506 325163 268327 351315 522519 557768 404506 406749 448644 339337 342001
21078 342001 280864 108397 -81414 -42795 106454 233018 388747 462700 529579 366277
21068 366277 348955 235134 178837 338268 562442 677659 826189 834391 719405 708929
21058 708929 612976 623568 752644 803725 709012 785493 887313 774237 709114 655572 550344
21047 550344 619484 843734 894768 804591 969964 1077520 998675 968720 888334 909493 948494
21036 948494 1051947 1075078 926236 1063602 983191 1001780 1028234 1039848 1122396 1387976 1640163
21025 1640163 1739382 1767446 1828048 1932920 1981740 1960721 2083603 2053233 2255082 2459138
21015 2459138 2424480 2542549 2569278 2634508 2847477 3038203 3179111 3310104 3481859 3609462
21005 3609462 3628211 3842597 4210403 4600169 5071050 5113441 5218272 5362516 5753935 6013416
20995 6013416 6307289 6814235 7334989 7671758 8187663 8711001 9103595 9576327 10089010
20986 10089010 11110698 12191421 13334893 14414011 15665305 17141655 18881040 20864475
20978 20864475 23256226 26188580 29713394 34122312 39524299 46199803 54058087 63143291
20970 63143291 73581597 84173274 94045286 101720752 106422580 108346666 108183447 106638300
20962 106638300 104991841 104586439 105813163 108711934 112729256 116509018 118710420 118352379
20954 118352379 115026738 109457667 102565475 95203087 88500019 83182216 79750422 78180650
20946 78180650 78893429 82156373 87703737 94896469 103114485 110814860 116302929 118663864
20938 118663864 118425497 115965364 112513229 109336930 107178180 106650410 108096091 110824377
20930 110824377 113459635 114524824 112903157 108325087 100774925 91423785 81112454 70956042
20922 70956042 61338247 52892837 45786198 39903973 35091875 31018120 27660841 24801740
20914 24801740 22526244 20530674 18751010 17361194 16175246 14931457 13965629 13365266
20906 13365266 12698346 11974279 11337844 10718101 10198563 9688536 9244484 8820896 8546992
20897 8546992 8173301 7675166 7386373 7347738 7291780 7042374 6860776 6660970 6457716 6115528
20887 6115528 5731760 5573631 5307812 5089051 4948855 4753023 4515797 4293018 4066481
20878 4066481 3995722 3895163 3840318 3669698 3440026 3334267 3274681 3091165 2714996 2666088
20868 2666088 2444471 2283215 2275418 2294593 2126783 2176210 2268072 2234187 2028575 1718514
20858 1718514 1783033 1947940 1949738 1973333 1874832 1747272 1764999 1786019 1623387 1562930 1620365
20847 1620365 1472426 1276192 1325750 1338448 1190804 1199534 1167284 1126953 980082 902313 822538
20836 822538 782731 859274 989282 998656 1120871 937766 881901 992015 1188779 1272118 1105946
20825 1105946 1082011 1063643 1089223 1025617 931749 796359 882761 1013702 1146001 1259877
20815 1259877 1143183 1096322 924263 975441 914369 723401 735807 629187 705760 764275
20805 764275 925299 965648 673289 515758 603288 373794 175375 269670 382379 351277
20795 351277 353618 485819 551131 511961 455130 381736 408840 491805 494025 528346 553606 513733
20783 513733 422288 448699 530236 668531 763544 594391 499751 561793 537517 556339 675630
20772 675630 621747 504569 501050 537214 488746 424629 403037 403490 425873 362714 381690 345428
20760 345428 380101 507319 386563 331717 375211 349369 218141 254053 411684 475540 396514
20749 396514 351062 437136 420117 323598 434382 552374 697561 606472 473300 429043 427069
20738 427069 366252 307717 374967 322723 293624 475714 564160 535243 470875 557923 769320
20727 769320 668750 565954 434949 469884 395066 439144 476917 372015 342910 407341 306184
20716 306184 333213 238922 148383 189990 228663 373215 451319 439642 354006 171625 238993
20705 238993 394123 319212 173229 216295 279058 300281 256829 350060 285554 206299 252487
20694 252487 128402 29768 41188 177763 82892 3690 129108 155717 103994 -83549 -20629
20683 -20629 161634 137046 35169 112277 151855 255277 240754 253264 429800 319159 271598
20672 271598 320926 255782 176638 58503 36033 267758 303885 175037 282238 382633
20662 382633 194437 290939 207318 295125 100961 68784 198121 174792 -71603 18952 125475
20651 125475 177917 202186 85124 221336 409169 452095 166035 80980 68276 171457
20641 171457 198642 161137 138521 146066 137537 54802 226892 313875 247320 286567 369392 217410
20629 217410 -12421 90598 171968 29130 181235 321650 290335 192394 116948 123519 202341
20618 202341 195470 2616 72358 91491 96888 44485 1640 59924 82095 -55942 -220998
20607 -220998 -270777 -149923 -40148 -103151 -111285 -128148 -210494 -52325 -81511 -34229 -11737
20596 -11737 44324 114742 119718 76000 30704 -65354 -141696 76312 244457 175946 112498
20585 112498 -17734 -105776 -89824 -153536 -79837 -51056 -82987 -10391 -220484 -217501 -27794
20574 -27794 104443 114160 27012 -88262 36032 49283 94789 158466 43704 -183233 -435302
20563 -435302 -450459 -437459 -621626 -433591 -161308 -22690 47122 -66505 -184303 -269169
20553 -269169 -206885 -125185 -7551 9654 28797 -60250 -198283 -184576 -124235 -25244 94289
20542 94289 13502 122174 101131 92585 41761 22205 -104159 -207985 -229544 -241737 -241563 -130376
20530 -130376 -140138 -146183 -99429 -127955 -114112 3264 23632 -6157 137218 136495 46438 70982
20518 70982 -7084 -165109 -267200 -238401 -194691 21527 263686 236928 109326 174085 30401
20507 30401 -13143 42446 109601 107440 -112126 -254753 -199205 -158365 -90303 -144320 -220061
20496 -220061 -238173 -41603 -84750 -96233 5769 25401 -186808 -346379 -246569 -239105 -131877
20485 -131877 80418 78187 -16795 83105 76376 151450 168327 149550 155860 138463 287142 305353
20473 305353 283693 373066 285016 209014 54282 131201 90542 -67550 -172078 -237648 -211527
20462 -211527 -309767 -269058 -121582 19144 25091 -41791 -140068 -261852 -159461 -172988 -167730
20451 -167730 -173678 9144 148869 161979 246995 482165 479938 322881 306017 152697 282367
20440 282367 398518 681347 866356 944454 1175187 1213597 1396754 1745846 2097108 2488497
20430 2488497 2566625 2584357 2541568 2507503 2759105 2794876 2680146 2755175 2738602 2737552 2722516
20419 2722516 2783562 2674638 2495619 2402178 2173570 1918632 1645292 1538434 1379409 1352976
20409 1352976 1222091 1160753 1180188 990236 748718 705028 743461 868349 754693 828019
20399 828019 843280 908024 966686 923119 853855 697880 596916 676364 823266 690062 567749
20388 567749 554488 638658 831514 834448 888230 826481 814860 767360 577561 479793 515395
20377 515395 496895 446550 509120 685572 601421 549966 463217 572161 694646 700632 634155
20366 634155 608898 530432 407646 694159 1034849 1131341 1065693 1054990 1015636 1123194 1286242
20355 1286242 1396389 1423813 1495307 1649987 1741789 1849554 1869455 2065913 2403706 2504115
20345 2504115 2632323 2569152 2378111 2190660 2220415 2059253 1801632 1544204 1326337 1290161
20335 1290161 1069758 1036420 860263 589625 512606 463229 477299 327082 136094 117600
20325 117600 69193 84 30385 224999 304650 147539 98033 223889 229498 156963 205748
20314 205748 216728 86405 12966 98259 155149 385808 530600 389132 331031 439648
20304 439648 380986 245397 241978 261568 439323 518410 540291 644039 730894 942405 807483
20293 807483 623520 568691 536823 597119 805932 888816 860899 903633 881334 812312 770338
20282 770338 788404 671247 476291 244215 129939 245516 358286 391229 358366 388412
20272 388412 478682 448765 324906 155613 55843 62202 -93319 -106107 -6767 19628 17020
20261 17020 10409 87399 210911 167624 1728 -4873 105423 143550 71851 40793 238711
20250 238711 330489 137993 217741 314889 246438 117955 4247 10317 -79020 -104623 -109497
20239 -109497 -111311 134915 248013 329866 264634 29913 -12425 57135 63698 246440 333092
20228 333092 522687 477434 395194 319853 271814 228786 323692 283786 240681 170493 165324
20217 165324 126232 144009 158749 238019 107354 73510 -96291 -21145 -10748 19708 -31657
20206 -31657 -61729 -24108 30825 -268 -1176 13470 -11142 -57718 -147789 -30321 16578 -30949
20194 -30949 1018 -68098 -178428 -181640 -163313 -246016 -136362 -31500 4977 -120673 -198735
20183 -198735 -190098 76284 73507 54173 141788 141946 165754 334955 349568 285456 391785 456311
20171 456311 514520 469385 508324 691075 809466 801693 659308 514533 518397 554830 485226
20160 485226 594770 594398 361442 372902 308676 209509 218960 160800 326927 479550 628811
20149 628811 692679 664165 470554 484903 591566 464467 368919 420294 475571 427149 413942
20138 413942 420268 302141 361273 521088 568343 785958 884668 931624 853394 797874 616361
20127 616361 485516 529372 616623 625598 627134 764884 876246 868255 785685 783721 647601
20116 647601 668389 852089 1008725 1012167 803812 625347 744662 800013 664455 615899
20106 615899 543638 509357 551314 573037 683984 664940 686913 688987 606594 502302 428327
20095 428327 598242 968667 1130134 1135724 1246725 1168715 1048930 1054704 1044178 1006181 945765
20084 945765 824626 1024759 1112172 984201 834005 925103 911920 1012158 915974 666777
20074 666777 429316 401328 398098 405985 360236 322434 291332 258459 200505 119837 128890 270785
20062 270785 88032 83831 248560 356345 248869 227701 245885 219262 125764 198779 300459
20051 300459 157701 86381 -47626 -38865 -56230 -181956 -29355 221375 298768 257157 147888
20040 147888 85330 109032 321966 452975 272939 42764 21431 180114 387486 398687
20030 398687 267877 227974 46836 43812 235397 143528 77869 101111 36872 77129 12102
20019 12102 157877 338139 375796 206004 184958 82463 11600 95833 94153 166524 385790
20008 385790 555129 689188 697407 786704 927331 1070406 1038095 952784 939607 1021013 1091830
19997 1091830 1109483 1145312 1192536 1114061 1139444 1209466 1175722 1075236 926235 1088956 1216031
19986 1216031 1100587 1123960 1040055 827020 788639 746305 663108 625819 592284 544610 699841
19975 699841 743904 636846 616579 650562 585668 425890 561904 608869 352583 212052
19965 212052 502298 674121 675688 561585 541167 371644 461495 636528 617341 497186
19955 497186 591954 754263 691693 642313 785222 950336 950166 911091 852154 971788 1148136
19944 1148136 1287633 1451134 1497276 1561647 1632217 1674840 1664713 1677940 1921759 1911763 1841167
19933 1841167 1683384 1572541 1483415 1389968 1392228 1316554 1149516 909567 764000 761843 970122
19922 970122 1090172 1130377 1139801 1005963 1060290 1133913 1184971 986737 875217 991269 1118907
19911 1118907 1162449 1101443 1173182 1161578 1117377 1143909 1121267 1100933 1081187 1120449 1036734
19900 1036734 1054639 1177547 1347917 1676353 1601636 1426880 1556929 1898847 2176251 2331254
19890 2331254 2281666 2136366 2196110 2511460 2799815 2913000 2927073 3062396 3353231 3570039
19880 3570039 3759220 3848945 4039507 4356386 4887180 5480812 6228890 6831756 7571837 8579048
19870 8579048 9457773 10402377 11321750 12235114 13248077 14319232 15686545 17454655 19394725
19861 19394725 21495916 23833664 26786854 29997069 33890741 39285025 46493616 56083742
19853 56083742 69069667 86131221 106988635 130262654 153999478 176520284 197418986
19846 197418986 218056974 240490147 264867614 289413813 311403515 329519945 343934274
19839 343934274 354671310 361971899 366482109 369013387 367880173 359917904 343508622 320479201
19831 320479201 294065075 267186472 242708064 222193017 205914078 192850332 180382822
19824 180382822 166585017 151029864 133935392 116071644 98802643 83129256 69661609
19817 69661609 58563053 49861741 43330069 38375343 34656529 31535969 28933177 26941197
19809 26941197 25155558 23517560 22197793 21190113 20466675 19923883 19384843 18950360 18918712
19800 18918712 19005393 19363874 19876060 20522307 21525178 22786551 24517152 27028571 30697922
19791 30697922 35931834 43041237 52724597 65143169 79670712 95187131 110575194
19784 110575194 123461263 132363653 136789845 136715654 133598127 129489204 126264224 125585996
19776 125585996 127491465 130906882 134967564 137309881 135968289 129983028 119758297 106287725
19768 106287725 91160633 76220539 62693735 51091916 41774017 34373334 28667978
19761 28667978 24561787 21582429 19215059 17506043 16067700 14762486 13688190 12592859
19753 12592859 11831036 11016944 10360857 9736109 9204474 8744849 8463719 7981139 7550077
19744 7550077 7332766 6995618 6465506 6082006 5836916 5284146 4807941 4449568 4119844
19735 4119844 3972119 3851100 3777281 3676121 3572689 3471833 3391669 3269385 3356065 3211135
19725 3211135 3146965 3014989 2988273 3283922 3334944 3300662 3331850 3372505 3307606 3262122 3228106
19714 3228106 3175631 2843480 2611377 2842785 3007560 2986737 2838659 2756170 2725216 2707995
19704 2707995 2726575 2684067 2589901 2724376 2788999 2868725 2843711 2822414 2940874 3017446 3072475
19693 3072475 3106496 3150783 3191178 3285594 3617887 3879233 3992916 3930394 4063324 4449067
19683 4449067 4831968 5326363 5789610 6386509 7274246 8282772 9392486 10748153 12233168
19674 12233168 13575044 14972702 16257398 17711268 18910712 19769502 20353335 20608179
19666 20608179 20510670 19876339 18740807 17443337 15983820 14414212 12924787 11760212
19658 11760212 10965856 10194369 9655457 9404661 9421440 9296073 9242180 9354036 9639997 9755691
19648 9755691 9993080 10447729 10802230 11161391 11680423 12024855 12589420 13416226 14298639
19639 14298639 15463109 16849959 18251177 19878146 22039455 24352870 27047723 30234794
19631 30234794 33938737 38161672 43211361 49083039 55793982 64175055 75008627 88763853
19623 88763853 106163935 128191493 155680504 188904570 227600415 271249891 319701601
19616 319701601 372134845 426913007 480872380 527985022 559752360 570217498 559943232
19609 559943232 535241969 502751871 468499672 437807655 414535466 398773209 384996206
19602 384996206 365956263 337849075 302142371 262821055 223115689 185480382 152356415
19595 152356415 125336974 104177287 87797893 75085598 65358238 57440720 51035987
19588 51035987 45719447 41231225 37220395 33542222 30389252 27698980 25667663 23853406
19580 23853406 22406012 21131572 20169223 19338935 18607102 17784379 17045932 16330185 15654756
19571 15654756 15005353 14429084 13918078 13514298 13323097 13154081 13336007 13440675 13656752
19562 13656752 14049821 14752054 15808652 17245333 18636965 20014903 20898647 21182659 20701709
19553 20701709 19871479 19297653 19172362 19375434 20168559 21279870 21993850 21906315 20637456
19544 20637456 18863322 16628113 14293597 12227110 10494735 9204882 8120996 7168159
19536 7168159 6623048 6284775 5906217 5752337 5593316 5310714 4933410 4760515 4537756
19527 4537756 4053395 4005196 4028979 3938591 3874394 3718434 3573485 3364407 3292977 3212811
19517 3212811 3135890 3076684 2984623 2903498 2880375 3060341 2962054 2872617 2780308 2691873 2739809
19506 2739809 2628990 2583180 2723006 2652573 2590010 2631737 2616716 2654938 2486063 2576419 2587294
19495 2587294 2547132 2488188 2601184 2658350 2657324 2652684 2721777 2716017 2572556 2692758 2629538
19484 2629538 2488849 2349745 2331604 2325669 2182606 2001484 2005746 2107389 1849499 1829330
19474 1829330 1859850 1887786 1693311 1566237 1655903 1526222 1363561 1341104 1158788 1029105
19464 1029105 1192761 1411538 1282028 1250348 1225015 1323034 1237129 1102105 1054617 1138395
19454 1138395 1019403 904753 794348 886409 1152863 1169081 1111942 1171843 1148014 1186021
19444 1186021 1160587 1287105 1329765 1352611 1233205 1299055 1266249 1130241 1103964 1067393 1063526
19433 1063526 1022196 1008888 993675 959427 915106 942469 1031635 896482 785412 788947 779668
19422 779668 823090 996946 1061553 949067 873951 937336 904440 804682 724163 838784 942217
19411 942217 803037 637689 623615 671037 794892 936073 855555 811752 665097 499036
19401 499036 441650 455209 496087 484795 617406 712998 735703 771169 669534 505089 515042
19390 515042 502774 315045 308950 439063 522070 583501 477923 514444 500562 417644 348803
19379 348803 354884 331618 448422 396606 458191 541864 572965 611035 690381 785410 833074
19368 833074 973968 867689 813270 726543 734478 752144 641700 433494 359452 540345 585858
19357 585858 442843 463350 502003 611326 569844 621088 518896 444757 422277 436504 502517
19346 502517 528257 651381 716789 649524 711167 829132 1016798 1207127 1237951 1446178
19336 1446178 1790670 2017634 2039865 1989890 1775785 1861604 1776684 1719385 1904593 2006946
19326 2006946 1873024 1880636 1905610 1821318 1805043 1827860 1809985 1762153 1753874 1654528 1436853
19315 1436853 1331344 1244073 1315851 1245823 1218361 1169888 1165336 1185659 1293089 1305273 1162726
19304 1162726 1154730 1230931 1127970 1022025 965788 930586 800703 645053 682097 674652 567834
19293 567834 624609 558416 491717 516322 540254 404091 356228 241470 336447 417099 397297
19282 397297 244853 195841 147519 278855 371289 535756 608274 461028 556117 667666
19272 667666 695232 617661 636166 686783 737457 920505 1146107 1075925 1020952 1108811 1185428
19261 1185428 1036675 1017819 1153705 1191108 1057889 970287 1077215 1065766 1022137 992452
19251 992452 915940 952664 837179 659234 606467 506350 405536 408122 386394 566672 472921
19240 472921 420629 394915 348061 207143 183263 314031 354930 404383 441766 363676 296376
19229 296376 198640 163915 325556 385409 539321 609244 590333 324918 98513 77033 219426
19218 219426 377291 359723 370654 347556 436546 556863 493355 385062 418956 476036 501373
19207 501373 512113 312235 299094 270573 318159 405706 490245 458453 633937 666410 610802
19196 610802 425958 491464 490727 369718 460784 309900 129889 51069 -112784 -96500 54284
19185 54284 79729 217889 346170 308810 438891 361691 336766 470745 386714 299624 448059
19174 448059 425064 520950 406192 167801 95955 121589 149855 195399 295710 283445 413582
19163 413582 382215 296446 51402 -20377 -64424 -15805 8433 -83524 -28209 158211 224130
19152 224130 247278 250010 155645 207655 175145 275624 389831 327459 433392 414189 375442
19141 375442 339282 355646 235169 233502 354518 393765 395800 444895 588596 710053 721428
19130 721428 723113 846904 934009 1002361 1043749 999147 964340 956457 1030170 1144482 1308687
19119 1308687 1144855 920694 845760 915480 853519 878686 765214 677616 703227 766418 795838
19108 795838 824841 921834 995515 948626 804686 837515 823343 699515 793540 902329 1004006
19097 1004006 1090894 1055447 1063058 1407230 1582262 1487526 1340801 1354452 1346327 1335763 1204298
19086 1204298 1054134 962441 928551 949139 786669 941440 1124676 1133624 1181348 1348014
19076 1348014 1207177 1083292 1234520 1187890 1206583 1385896 1451510 1298422 1226495 1254218
19066 1254218 1256076 1277614 1428064 1642377 1560415 1446729 1227329 1155105 1187941 1102347 1014039
19055 1014039 899993 942703 988396 990056 1134487 1217889 1072536 970235 864120 805454
19045 805454 799027 1002173 1497829 1594981 1314475 1334751 1451777 1490841 1580362 1590758 1579368
19034 1579368 1425136 1325590 1185148 1001653 824960 738612 772291 772778 702985 702394 726970
19023 726970 641245 665338 692527 661116 689350 696800 691610 766978 896701 977856 894284 858193
19011 858193 1072931 1102208 994393 864364 923403 837470 538897 369594 227948 267649
19001 267649 492294 561365 552005 552604 593166 508814 347756 234074 211249 204276 83205
18990 83205 -101087 -157859 -138314 -44098 134937 157355 -50032 167155 251801 163291 201533
18979 201533 217713 146780 -30800 -34661 -34195 7529 -14461 -38338 -31940 -8429 183981 236480
18967 236480 332294 451834 219336 52206 139378 185741 88902 140370 158037 254588 145247
18956 145247 76633 52507 6318 17604 133375 197671 -13453 -145214 12026 87027 143537
18945 143537 129188 263361 155885 96743 -83755 -282921 -371201 -111839 13205 67176
18935 67176 81785 207971 125897 -76021 -118833 -29860 -134435 -125827 77085 264846 234682
18924 234682 118032 176841 193128 67641 23121 74243 111804 -30712 -121218 -52959 -221253
18913 -221253 -323320 -247393 -136963 -117740 92387 232680 155091 133081 255991 196188
18903 196188 95773 29596 -20520 -110152 -167950 48403 229699 223682 127757 164577 74465
18892 74465 -27961 26966 85763 161888 370069 195613 193831 351876 452158 308377 83917
18881 83917 80849 168463 194735 332167 429944 361554 336337 474593 536643 522274 589832
18870 589832 650545 647666 593476 526145 390686 235488 157860 202588 320385 414575 522580
18859 522580 549578 402483 257312 118923 76645 53312 157922 301983 428770 460986
18849 460986 207787 128090 103951 83658 185892 296422 315161 248733 173744 303041 287974
18838 287974 245520 176325 186910 98849 53411 41631 243739 381280 415852 412930 337222
18827 337222 268114 262203 267239 283024 276566 400145 210672 157069 254742 390485 502853
18816 502853 511815 450228 424308 522945 610523 584713 580816 492247 244708 140086 183812
18805 183812 127670 66942 12875 61626 270624 388371 623264 551325 492201 523873 619193
18794 619193 538626 289919 299612 418164 523441 450723 439807 272575 54579 62539 51516
18783 51516 127493 175509 84548 182767 175802 -68386 -158721 -61668 -74505 -13623 -27706 80061
18771 80061 175582 309052 299433 307151 464099 671052 832084 1014811 1314380 1512353 1411365
18760 1411365 1277888 1096853 722778 537720 500840 518462 331164 146078 28713 116879
18750 116879 206236 24127 -72801 129976 360548 403877 286907 372611 362425 245832
18740 245832 299151 237123 100064 11298 -27807 -99104 25389 219609 267511 142086 -57320
18729 -57320 104882 214375 267998 133354 90739 140708 99083 202555 174114 35558 108383
18718 108383 182450 202425 178408 237220 162978 -75311 -143324 -203578 -201000 -71129 -177286
18707 -177286 -121099 -95381 -27668 3169 -18626 -24307 33978 147890 103811 -76784 -232611
18696 -232611 -106681 -29911 172711 122820 -9513 89144 38698 11369 -48325 -233049 -320730
18685 -320730 -73591 80092 197202 188149 61656 109820 84414 -77658 -100819 -42967 91149
18674 91149 115000 74867 -25344 -61337 -55741 12999 -9658 -172258 -134683 272231 407535
18663 407535 355832 358195 273039 119628 8724 736 -23795 -46934 -27880 131121 306778
18652 306778 360717 403476 356729 243206 338959 327552 241815 118364 -95019 -300274 -367672
18641 -367672 -221996 130794 343187 307765 211769 288806 535090 391833 158608 89212
18631 89212 234452 385413 489093 461438 468731 428649 381686 257372 183876 388485 463512
18620 463512 508554 494446 527749 566703 396993 322464 574084 774812 563715 544903 563708
18609 563708 536524 504567 764493 922264 1216460 1392540 1432659 1546803 1562212 1732883
18599 1732883 1879205 2104767 2346169 2493559 2806084 2945345 3134052 3371844 3642676
18590 3642676 3999931 4457212 4828863 5504365 5994022 6716397 7610279 8651388 9977263
18581 9977263 11858960 14127182 17149063 20862112 25822183 32626387 42119990 55222034
18573 55222034 72152547 91906038 110064717 121888700 124954792 120385990 110494939
18566 110494939 97131233 82435798 68518876 56562520 47042433 39984181 34786323
18559 34786323 31077634 28557840 26838397 25963103 25885491 26280528 27300355 29297127 32488425
18550 32488425 37033040 43443358 52583412 64990397 81069965 99398668 115991888
18543 115991888 126085156 127105480 120202029 108057755 93020451 77154563 62592978
18536 62592978 50504289 41404900 34732090 30020186 26707750 24641296 23412909 22762492
18528 22762492 23024467 24180676 25986996 28831422 33474142 40423247 50320044 63920000
18520 63920000 80353562 97614497 111659554 119162096 119235949 112495591 101129208 87547430
18512 87547430 73909157 61301245 50815770 42783128 36968995 32480135 29296177 27233914
18504 27233914 25877317 25231362 25153886 25828556 27064231 29144793 32258306 37094341 43918971
18495 43918971 53567531 66752291 82975009 99886767 113093533 118725864 115779781
18488 115779781 106352912 92914451 77822361 63138381 50173715 39629717 31743449
18481 31743449 25838592 21304120 17976239 15494109 13527686 11973721 10660278 9390526
18473 9390526 8370104 7736756 7066650 6614917 6435459 6196716 5813593 5752599 5782240 5524071
18463 5524071 5197163 5025311 4959709 4774568 4351028 3967176 3647973 3430942 3286593 3191216
18453 3191216 3066641 3057982 3041160 2800769 2762199 2778669 2753538 2702613 2670007 2768276 2712243
18442 2712243 2782703 2925107 2950834 2822375 2907874 3071694 2894415 2730715 2681149 2506290
18432 2506290 2210400 2118669 1986968 1872898 1900006 1974499 1784683 1626304 1560535 1521336
18422 1521336 1572680 1464200 1377900 1456214 1434491 1393023 1451270 1432764 1328793 1361558 1363179
18411 1363179 1314802 1310362 1177475 1069568 894273 923331 946983 842160 907537 1034877
18401 1034877 1153333 1122300 1010741 954899 1094865 1198603 1034841 760590 872400 956234
18391 956234 871892 908555 1011101 956386 942742 1006295 976713 896526 790447 685173 750397
18380 750397 822854 675168 683799 752251 761827 908071 897846 821914 879558 864102 956637
18369 956637 1170472 1055080 1005225 991816 956536 795257 730497 739231 732048 824001 790642
18358 790642 831550 696690 660203 551043 526351 600368 730829 706449 643438 675473 687044
18347 687044 665945 723100 751050 683329 680428 735083 656886 663193 700965 859209 712360
18336 712360 636089 725479 879639 718835 329175 228832 173408 142273 238825 272033 302069
18325 302069 339452 248268 209254 193918 355608 365124 363752 570883 549537 559758 547940
18314 547940 574704 546025 630897 537911 558518 580266 619627 556396 571906 489102 394187
18303 394187 275193 171751 163191 173959 235828 263362 163185 147922 29696 60405 30157
18292 30157 149694 294455 215859 228880 306091 310501 388544 316612 168529 73318 190678
18281 190678 142300 324295 279308 -15178 -31643 53830 299947 369192 305403 182248 194171
18270 194171 160326 249245 272374 281425 397432 347391 319183 411710 344481 260252 189000
18259 189000 203752 351699 485097 567676 474664 405878 342853 380312 364343 302262 413358
18248 413358 379147 347711 446991 355053 312271 363290 455890 450124 360768 439318 384246 466442
18236 466442 327623 209024 255012 276132 436233 366505 120487 -24620 160794 197391
18226 197391 333973 374508 360323 296696 216373 62994 -77114 54558 207987 318218
18216 318218 584431 507920 433456 496480 405177 169107 143019 177865 50192 -32156 74996
18205 74996 12706 -17249 -51310 -228334 -259054 6683 89658 -22405 -25393 33766 195239
18194 195239 318800 421262 364392 353505 161294 96407 27315 64539 166709 83996 127706
18183 127706 286870 229618 196611 274559 349532 413334 461001 399452 314245 354397 395971
18172 395971 527815 472345 557897 538876 392088 555204 808920 744791 599752 500864
18162 500864 406684 342651 396357 534407 520020 428376 360922 306741 472993 514630 480498
18151 480498 473304 553918 559106 564938 599725 713169 609123 574026 570400 571742 608101 751954
18139 751954 829599 786717 890000 1077885 1262063 1444530 1574600 1785796 2082824 2003792
18129 2003792 2070966 2308393 2678094 2985264 3093337 3365971 3851557 4244484 4990558 5753012
18119 5753012 6548772 7242711 8165885 9557328 11447797 14049528 17453756 22098224 28925577
18110 28925577 38891320 54416436 80128317 123338538 186044786 239171961 247359010
18103 247359010 223869695 194657249 163879210 124984556 88447364 62682418 45829034
18096 45829034 34517092 26732465 21449694 17694200 14738444 12630292 10977992 9577759
18088 9577759 8330271 7233328 6309675 5635288 5011349 4601651 4110848 4008339 3621225
18079 3621225 3236978 3066759 3066627 2995895 2878450 2912068 2792409 2628941 2485992 2423963
18069 2423963 2303338 2154136 2085597 2077108 2008811 1825983 1824248 1609706 1439500 1488263 1460787
18058 1460787 1213651 1354683 1437749 1476156 1344543 1342444 1386404 1426406 1414854 1144569 1143418
18047 1143418 1270121 1356849 1309202 1218811 1277371 1329539 1330566 1280747 1150541 1102851 1047429
18036 1047429 1099992 1027258 856261 744045 793664 850387 894044 862357 767247 711452 769803
18025 769803 768681 706025 803487 943011 1150976 1292339 1206585 1272134 1336802 1320236 1218731
18014 1218731 1213421 1179514 1217968 980536 859184 751782 685463 740428 773199 664320 501763
18003 501763 373093 532961 577582 512515 646419 858383 775573 614441 587371 647261
17993 647261 849088 1017647 891846 764048 772551 867932 781834 755727 711878 769464 766498
17982 766498 797454 815691 873217 816169 805862 656899 636422 875958 923902 843479 873318
17971 873318 814607 700780 742256 662506 774156 835450 983862 1062672 1074269 881591 552267
17960 552267 459790 482317 525837 613806 557743 521235 502838 348813 275599 291693 284611
17949 284611 393940 607693 546221 396420 183662 217092 430615 489148 233396 84207
17939 84207 79788 177291 208192 376357 473243 404805 362942 349018 517925 580562 514247
17928 514247 460302 533892 691590 709761 649792 576963 440752 478549 571265 378650 191973
17917 191973 261870 209444 142253 36539 67765 -13243 50840 8769 22064 169801 107312
17906 107312 170738 238189 332688 279583 41595 -53646 -53208 76306 227519 256437 343756
17895 343756 265726 3228 -1338 45981 65096 192162 267372 166949 256004 475853 448343
17884 448343 413083 366572 276928 130663 2777 -61788 -24403 119374 124673 185160 191319
17873 191319 91019 61857 24032 11691 100516 181450 39945 -71095 -80740 -129707 -134212
17862 -134212 30480 161733 289206 331727 223617 158010 236512 240883 385422 440738 315542
17851 315542 302844 268414 262618 216070 273420 246031 286419 222696 251538 371782 332002
17840 332002 218926 157209 244055 103990 -48812 53815 218384 335936 437001 291883
17830 291883 188201 205400 331818 376075 381670 295496 314540 258804 356254 337917 370522
17819 370522 316461 244983 315719 295296 323426 344712 149072 129510 118693 6676 41778
17808 41778 53142 -177161 -59075 -71560 -45825 190249 288956 -2540 -254770 -221140 -61233
17797 -61233 -23110 -215195 -155775 14946 113167 220950 233711 329232 338488 197636 -23550
17786 -23550 -30536 80915 205615 267568 296667 151783 223971 392234 332571 193500 202059
17775 202059 204330 83404 68175 -46762 -104943 -2269 90913 93897 32963 76246 11126
17764 11126 -26122 63036 63446 59597 157483 361672 165970 56449 11510 128203 199535
17753 199535 39816 226048 206662 172888 124957 6487 -87421 48628 -25429 -990 133890
17742 133890 190104 277008 260648 172041 176218 163374 262412 357249 323737 242035 -19455
17731 -19455 -39160 192391 241603 102232 180333 206222 130917 43860 53681 63412 24155 41338
17719 41338 31545 -4653 149427 255252 165328 184221 389499 453899 378188 400918 602659
17708 602659 446866 244270 -47729 -134883 -152022 -173831 -217856 -283913 -275387 -154817 177638
17697 177638 402178 355605 237400 400131 427749 177704 56053 70202 32553 -35010
17687 -35010 457 -8524 156064 243532 140763 87350 187192 227020 271633 345062 386079
17676 386079 198696 221252 161434 80726 132167 216526 178781 85533 49887 7814 -49896
17665 -49896 -77430 37098 187317 194259 228887 304096 428258 398462 304810 489633 271160
17654 271160 29303 79528 91367 141502 102503 13176 15405 85140 212430 59306 -74451
17643 -74451 -15367 150922 138101 236226 257577 157037 159299 36927 -55187 84435 114781
17632 114781 162239 241647 119653 24676 55246 186458 159525 89354 127324 6621 -93482
17621 -93482 -66209 -70746 -85588 -62110 -20986 -5070 -85317 -141114 -151353 30000 60792 157191
17609 157191 208847 228410 204773 206400 81417 51340 -2519 31410 -59022 -91463 170007
17598 170007 290566 216288 215998 171147 86038 -34578 -44272 46462 168999 6858 -169981
17587 -169981 -169958 -84158 32639 43201 126663 141994 49458 3142 -109413 -52817 38235 81892
17575 81892 536 -138090 -104008 29849 42464 -61352 -145754 -63814 59392 170706 271292
17564 271292 268080 93148 159919 -4483 -173403 -195007 -8136 -48553 -104755 58285 64355
17553 64355 -81768 -129680 -75949 75924 197599 199795 84777 9072 69974 159784 265296
17542 265296 139972 85338 29733 70350 194001 273763 315425 176819 265429 175170 -43916
17531 -43916 -51006 -9178 34298 29994 113061 104382 159202 134850 99652 178521 184083 -105871
17519 -105871 -302281 -251603 -163546 8172 65492 101831 156145 152320 -12484 72087 93169
17508 93169 131364 119649 113488 154973 226092 305315 370735 359493 436598 549349 455043 212779
17496 212779 191389 153599 14053 -202962 -219328 135209 201188 -9483 57045 -74452
17486 -74452 -101658 106766 200981 103763 -26303 -4140 50170 314477 140271 158121 269999
17475 269999 183420 18367 75301 302077 71671 22752 83413 54954 119015 42966 50597
17464 50597 63158 79524 161818 25118 174657 239114 19298 -7825 -80478 -20425 8463
17453 8463 -162790 -229474 -269600 -272488 -194890 -181464 -3419 76269 191273 410850 353601
17442 353601 358483 362580 658836 981593 1043996 930247 1051478 974498 750260 463307 330391
17431 330391 231867 304553 367585 276041 204339 185277 277098 122231 257917 388350 288752
17420 288752 262927 106247 39507 224299 126777 8291 44477 2199 136520 194908 254349
17409 254349 144555 248494 68943 -28054 37628 -47748 -265329 -348779 -261256 -19192
17399 -19192 122885 7258 -23980 -7888 125264 135870 -54435 -40708 -52263 -225946 -251970
17388 -251970 -186466 -97066 -24761 86483 125267 108210 40523 50912 154636 336640 300886
17377 300886 170214 93024 197315 377744 424972 310768 125408 97814 129241 226343
17367 226343 324765 301337 263777 164831 41142 1569 111134 67534 2374 198625 252182
17356 252182 236859 303222 414326 350321 218919 223506 158992 -27651 -114487 -13031 68019
17345 68019 104203 226334 220081 198790 183519 185518 155501 189 -4898 82720 280029 359865
17333 359865 214871 118174 205630 193106 200043 199545 99551 118750 139531 15568 94412 77287
17321 77287 42661 38370 60053 82065 143752 235623 388843 237693 41356 -125806 -79271
17310 -79271 142245 248891 248987 72205 -40803 72015 244255 221053 73897 -118942 -107067
17299 -107067 -59499 -157578 -256168 -317537 -408647 -409266 -137645 96029 154850 -36488 -127601
17288 -127601 36880 178290 80725 57079 21842 -78947 -197285 -260986 -300791 -132837
17278 -132837 -91993 -71984 -51873 14360 90723 54541 -127826 -108978 -94578 64757 224215
17267 224215 100301 124252 163838 174346 164927 -31388 -166699 -255796 -119143 88543 269820
17256 269820 336681 238466 239484 297984 294945 256006 293903 348303 251995 77364 66477 -34403
17244 -34403 -104573 -157199 -111861 -51979 -110332 -331455 -446445 -418362 -168487 -83638 -143493
17233 -143493 -168379 -74717 -49768 -41852 87534 166646 72090 6857 -169098 -166724 55462
17222 55462 278547 235892 -59848 -226028 -194151 -16539 89269 122018 100717 310501
17212 310501 306716 296461 125958 195432 298287 262865 333957 219523 -5573 -8711 172084
17201 172084 239089 116760 93161 114511 -76781 -65700 53310 136841 178199 108521 -40258
17190 -40258 58612 -27606 -91208 101360 288138 315878 215551 228169 209775 205550 191672
17179 191672 8409 -83522 -145992 -114082 -84258 -123311 -58574 95609 109252 36685 -15971
17168 -15971 79423 -53040 -78657 -185856 -236092 -129997 -40947 -110674 -190215 -103110 28592
17157 28592 52573 257627 282504 185202 108854 -123231 -183584 -257922 -433029 -400941 -258879
17146 -258879 -105829 -74184 -93494 -84872 -115277 -203010 60192 109416 50509 8824 200706
17135 200706 239677 126948 -56021 17875 88754 -109876 -135074 55817 -44578 -12826
17125 -12826 -140645 -367932 -476208 -334168 -267900 -274072 -325743 -205742 -232803 -284698 -266528
17114 -266528 -125108 95803 104952 71460 79717 80257 51128 34860 8492 16245 102747 139055
17102 139055 123471 167521 145844 -36487 -74219 87957 148229 213732 104992 163474 297745
17091 297745 338840 198544 233374 215812 3218 -210400 -194824 -77028 58866 54513 -44907
17080 -44907 -66385 -76738 -5942 32064 13202 -14534 -45273 -182984 -145981 3045 48074
17069 48074 93989 79009 62925 99377 32920 -63405 -99333 74039 252697 234508 72128
17058 72128 -111723 -47152 123851 128805 32783 -2057 5811 45476 152762 237777 218371
17047 218371 48475 91592 141910 158439 17133 -99754 16746 -73095 -70878 3457 171213
17036 171213 166471 55920 -16662 -93257 83071 -41085 -76332 -113001 -105239 21653 61304
17025 61304 46910 3975 -13520 70027 120043 210176 184837 143680 120919 124499 -80033 -134666
17013 -134666 -34549 -50540 83375 34317 -26092 -19204 -2112 -86480 -204143 -188779 -69738
17002 -69738 -112912 -124088 -51930 -134037 -127139 -117730 -177872 -179423 -169536 147311 228672 18553
16990 18553 -93883 -213554 -255582 -190341 -224867 -251500 -122616 113720 34267 -56005 -67745
16979 -67745 -30135 -50168 -120237 -177087 -159141 -285426 -327132 -157911 -108937 -199685 -329578
16968 -329578 -354758 -319254 -399224 -301800 -281781 -127964 -35091 -7962 -111181 -126584 -15893
16957 -15893 121911 69568 41331 6672 -66460 13865 83520 93324 49129 -174041 -378101
16946 -378101 -396377 -220184 -184202 -153019 -6872 -5866 8393 28412 -112273 -121632 -92674
16935 -92674 -10994 -164928 -420358 -342016 -139519 -143983 -93431 -54888 10834 -3055 -30140
16924 -30140 -148887 -149601 -199707 -139201 -111045 -51793 -83732 -120153 -112408 -1789 1621 59703
16912 59703 129786 26379 70900 146121 196540 81752 -144892 -74298 50028 -98211 -157156
16901 -157156 -50132 82173 1135 -151640 -209829 -179621 28547 101467 -90789 -227879
16891 -227879 -347474 -195825 -55212 -89620 -85269 -266496 -251194 -347159 -140864 56025
16881 56025 107008 162383 152888 -29506 -34975 -116364 -62960 95570 126025 120989 133751 170314
16869 170314 244426 213978 257614 65530 -18831 80792 200806 199805 -39698 -71505 57162
16858 57162 60694 21754 21409 195778 153150 106760 80210 46385 44543 167390 129819 10309
16846 10309 -75925 27436 170577 122905 149118 52162 -45210 61993 -14640 -116554 -179635
16835 -179635 -4125 -24798 2115 234837 138004 105659 -19203 -71514 -90379 59990 106014
16824 106014 116815 123301 -25800 -263115 -296708 -212434 -282926 -160843 67365 101613 -106324
16813 -106324 -187652 -151575 -32911 20811 -99725 -151041 18989 71329 -20105 -104343 -135256
16802 -135256 -142301 -73643 -32100 -19902 41624 167293 303762 134171 62430 99906 31413
16791 31413 16388 69282 -196053 -193778 -56954 165023 299569 367496 274783 61952 48847
16780 48847 142141 95211 131854 222373 117400 26397 -37174 42009 -9463 -64163 70646
16769 70646 216877 202007 191035 275965 388034 345431 168240 20348 -231656 -245915 -191235
16758 -191235 -122336 -87381 -160097 -144129 -40524 77200 192460 161560 -6627 -128358
16748 -128358 -112322 -109448 -4112 55163 -118969 -207773 -218048 -102667 -46649 -149816 -285703
16737 -285703 -154177 -97904 -117723 -90557 45216 140398 194104 270468 278754 175136 -251184
16726 -251184 -343325 -392475 -426000 -357251 -219615 -162620 -62745 -117824 -188776 -105832 -95042
16715 -95042 -95457 -55373 171923 207839 38252 106272 64210 105051 79446 78045 182938 137649
16703 137649 133473 249421 245706 147071 -24745 -69884 88217 172479 209864 134114 178027
16692 178027 213041 106603 -83884 -88321 -109408 -144638 -107888 -20768 131330 324818 326724
16681 326724 201193 143586 218616 156159 33988 -11280 -58563 -118296 -83250 -184695 -156221
16670 -156221 -26105 3168 66986 153997 20258 -37344 7602 -84366 -101801 -17504 43504
16659 43504 -34802 -114115 -111683 -39495 -21196 -63774 -110072 -175035 -383834 -418265 -431110 -363074
16647 -363074 -386828 -153787 32748 193459 308952 106701 -146745 -153620 -271731 -197590
16637 -197590 -90791 -138669 -191791 -149194 -136701 -55333 -187568 -281796 -269866 -175611 -110893
16626 -110893 -107693 -191964 -229558 -219934 -205075 -157504 -120960 -160292 -93355 -104135 -101972 -49405
16614 -49405 82463 45414 105289 165382 44035 -972 63628 -21543 38710 -4488 -107663
16603 -107663 -118002 24060 142111 180107 173653 44849 61935 -23719 -10205 150894 222605
16592 222605 151984 85405 -69975 -75031 -24166 -147302 -235220 -202897 -185496 -193413 5101
16581 5101 -8776 -47368 -102020 -195084 -253963 -55432 104111 127331 -31191 -222587 -99515
16570 -99515 82756 139007 178814 110143 70772 -19324 -126970 -121020 -51569 138481 304742
16559 304742 216313 178696 139251 -29716 -56854 40867 -35370 -77681 -142172 15223 21356
16548 21356 8757 169751 88906 -32948 -125949 -133961 -217546 -167851 -206710 -158421 -50665
16537 -50665 55572 -20757 -43803 -74951 -139117 -115388 28105 139442 44650 25300 63355
16526 63355 39162 51286 31357 36276 8533 -329102 -217755 53180 243983 310241 109022
16515 109022 -65466 -224151 -230348 -365194 -480322 -416763 -274715 -140906 -136920 -202933 -255337
16504 -255337 -179300 103381 154049 77942 156986 204061 178391 225747 308602 243909 175498
16493 175498 228321 258558 120856 55625 94410 50066 -41647 -11263 94375 27792 -16123
16482 -16123 139120 206350 195947 147992 150821 103154 -169886 -37042 116073 155922 213928
16471 213928 155504 43840 208188 232604 -30444 -98473 -194784 -203276 -161130 -44439 49356
16460 49356 -75980 -103135 19676 -86381 -176608 -96053 26988 152515 176003 21567
16450 21567 36259 -59073 -104254 45641 138640 27431 41827 -2408 -102333 -15632 6734
16439 6734 127142 305590 374762 256835 156619 32323 128038 278757 128911 -138086
16429 -138086 -255676 -243986 -314325 -189302 -101698 12327 210607 228457 314468 264821 200360
16418 200360 327642 410689 383197 239724 102146 53724 152442 223283 139778 -22485 -48578
16407 -48578 -99134 -55543 -285026 -370082 -151051 -14335 66290 109970 10620 148433 209870
16396 209870 102911 22079 -279588 -204441 -15237 2362 -152427 -166296 -207656 -213620 -112969
16385 -112969 -25675 -44637 -48825 -175950 -227483 -187719 -77714 -46432 -104656 -49403 5860
16374 5860 -20163 82256 90372 -12436 -67523 -180720 -126724 -78287 -46827 22414 65487
16363 65487 -28235 63951 -51142 -190777 -129990 -62019 -11610 21470 51349 -238288 -290504
16352 -290504 -9910 59951 -131620 -195805 -286595 -245158 12289 147914 173758 86495 -57915
16341 -57915 76516 89902 12029 -86459 -56590 98334 319715 478374 181585 -100446
16331 -100446 -177409 -187279 -137000 -261766 -260563 -280617 -84559 117845 103904 221193 218338
16320 218338 194388 193720 164225 34910 97736 79526 -67532 -116473 -266224 -237915 -256124
16309 -256124 -267096 -95897 -78501 -31181 56950 -12030 -118073 -23765 127802 109611 57942
16298 57942 128384 151817 5636 73061 148966 35564 12281 -34184 -46743 -20468 69676
16287 69676 103907 56174 65895 358655 396186 235906 129104 22185 126072 62322 -15732
16276 -15732 6674 -31924 -230655 -222902 -23811 82478 95914 80997 158319 174176 220971
16265 220971 88483 -67212 -35444 -95438 12364 44774 26513 35134 95632 -49538 -127726
16254 -127726 -50035 32797 166036 204294 236952 206827 272501 361066 335843 217593 -48285
16243 -48285 -21600 -32148 -38241 -64357 5498 123390 16317 90836 251085 220218 204501
16232 204501 -10603 -38326 61980 2575 -112602 -139219 -78043 122391 243853 115738
16222 115738 95607 81896 191025 137977 -31044 -170281 -198853 -196954 -135557 -149416 -154108
16211 -154108 39187 54004 -52647 -158176 -328276 -465957 -267404 -206683 -135241 2424
16201 2424 55070 -50676 -132659 -78579 -163301 -223373 -95798 124086 238444 313760 146906
16190 146906 75812 77789 -84810 -65630 131077 279121 335032 270726 315970 199564 136872
16179 136872 140191 89006 -70394 -68960 -81346 47221 79236 19667 -118099 -82324 -146665
16168 -146665 -105105 -80832 -134632 -155296 8629 -33626 10791 -133985 -232360 -294096 -298233
16157 -298233 -193081 -60186 -170882 -274043 -272809 -270215 -214293 -114997 -157241 -103974 18346
16146 18346 216563 389770 277352 219736 -35695 -225346 -203290 -64708 50007 131472
16136 131472 116332 46690 23158 -57498 -84197 -48122 -45090 -57927 94875 111989 4284
16125 4284 3975 170940 241163 113855 57865 81368 -77277 -179887 -247817 -261875 -87804
16114 -87804 20620 67008 76698 88998 84975 195159 257772 84957 -111191 -346216 -444849
16103 -444849 -211841 -20047 140706 145007 140818 164479 169239 207726 152482 133232 19724
16092 19724 -98558 -150661 -318579 -363513 -176218 -92419 -128074 -11030 121579 23141 134060
16081 134060 105938 -15468 -47873 -208143 -255091 -233819 -158977 -145480 -255473 -198215 -12392
16070 -12392 90851 118589 83903 37299 -97007 -93774 -223651 -197304 -123486 -95241 -127669
16059 -127669 -316043 -487777 -553135 -273987 -243129 -246942 -37261 168277 181931 221028 185136
16048 185136 46322 -67362 -133722 31300 130659 146185 278005 208503 56521 27485
16038 27485 142664 191768 78885 31389 -93899 -51234 -78389 -175034 -90068 21085 86546
16027 86546 118206 123939 107713 192591 190156 16301 -65609 -116014 103012 138510 41308 -176581
16015 -176581 -256836 -110470 39709 -64397 -223702 -150702 6344 105338 137942 184024
16005 184024 363635 356763 348009 295046 337716 236015 -156273 -162508 -29498 -186982 43890
15994 43890 200357 203541 207655 144470 90666 182514 255961 335350 239900 11312 -39384 -69047
15982 -69047 -10283 -118687 -180825 -168668 -120103 167916 221592 209872 323694 463858 209930
15971 209930 -123766 45347 332493 262959 305549 155391 -31118 1418 49482 11874
15961 11874 -6937 3569 82076 188728 157303 20999 -51529 -114134 -63082 -79693 -95293
15950 -95293 -122881 -30526 43784 72349 -11370 -147281 -176868 -27076 -151795 -263417 -238803
15939 -238803 -277845 -194531 -249330 -296795 -74614 -24488 2224 109243 36125 -4300 -18490
15928 -18490 -125100 -154514 -112283 -108319 -105805 -49633 -19343 -59186 -191520 -178408 -226684 -215977
15916 -215977 -68401 -95202 -168476 -95691 -90318 -217211 -142982 -9360 68071 84451 -77295
15905 -77295 -128045 -67528 -197811 -147305 26486 -38427 -107570 -21486 -68123 5332 46195
15894 46195 -22257 -137393 -141329 -42662 -86088 -210916 -237564 -219239 -188141 -190597 -161139 -94828
15882 -94828 67215 201194 187798 216616 91622 -92526 -201316 -63195 -80724 -125612
15872 -125612 -72912 -27694 -131534 -246419 49515 27037 94557 241058 343784 195915
15862 195915 121299 29177 12670 -7903 31741 73641 117891 74447 10296 44713 101276
15851 101276 290158 325219 361794 320893 206778 38420 -1669 -133126 -189464 -101320 98402
15840 98402 411240 372753 179742 120921 -49962 -35266 -189111 -298413 -150589 -6110
15830 -6110 48332 59473 156544 295764 113507 -6373 132275 117790 17011 -96253 -56588
15819 -56588 -13901 -129875 -198383 -115760 77845 78853 46708 -46899 -235686 -359283 -317855
15808 -317855 -224554 -342814 -302645 -242156 -108930 -223745 -259372 -211845 -202513 -228878 -188633
15797 -188633 -84300 -130101 -148217 -70184 -70070 9769 77555 175925 133899 150857 91508 76489
15785 76489 146352 94619 -48693 40793 196098 86087 133588 136446 99883 150381 147163
15774 147163 7018 -39548 183659 161975 186983 129110 93294 2325 -125367 -119783 -223703
15763 -223703 -286790 -371501 -347356 -370912 -521396 -389943 -239864 -211431 -234939 -199329 -62767
15752 -62767 -14663 100932 197996 140026 230800 188317 198286 132599 96756 14639 -55679 62663
15740 62663 173605 202618 232214 120238 -1624 -95389 44792 75082 74090 -16727 5302
15729 5302 -5594 -46070 110971 65306 214591 258502 132384 -19117 28764 139814 188441
15718 188441 43874 2585 99034 368402 234451 35341 -41743 54546 147515 192281 136518
15707 136518 62457 90517 75546 -97223 -204765 -254962 -190589 -76787 -56568 -71832 -172714
15696 -172714 -30704 -42522 -41226 81040 33514 39186 18402 -23226 12234 86481 74629
15685 74629 106394 186421 284541 352783 371745 378365 408990 277710 190670 195380 238560 132088
15673 132088 68427 51262 -129062 -227817 -247504 -68187 75895 96745 200014 282448 373327
15662 373327 334407 142480 113756 -5393 -35345 -28807 3329 -2724 12470 -83278 -60864
15651 -60864 -164870 -210447 88292 159862 92745 93683 4450 -54060 -285957 -317451 -355919
15640 -355919 -209110 -122092 15932 43329 -27866 -44113 -37691 -77967 -18973 125909 218287
15629 218287 160212 230572 154984 138111 197387 241200 53318 -35006 -140543 -120065 -176709
15618 -176709 -318777 -270389 -211632 -161908 -258711 -334416 -350025 -334892 -242010 -69885 -28329
15607 -28329 -139092 -173689 -147152 -210417 -299648 -118680 10569 -75054 -189316 -179394 -62871
15596 -62871 22105 -92656 -169050 -129336 -73802 -100346 -29794 34454 -16679 -118258 -135384
15585 -135384 8573 -3668 -78316 -124216 60395 150118 166246 172064 70773 97509 255583
15574 255583 266995 172433 131752 174190 103391 82067 -21638 50069 111638 -5732 6636
15563 6636 -78766 -161085 -148738 -114053 -99413 97292 133794 219618 262754 208892 223202 211255
15551 211255 42490 36788 86748 111909 133692 196111 74160 -10048 -16727 -8397 68131 88829
15539 88829 125052 102239 59 -8090 17118 105121 212116 312206 250244 -13520 -54754
15528 -54754 -48931 65629 105539 165589 252714 357870 332452 239174 207932 180457 44345
15517 44345 136080 188856 50070 -35128 11026 272252 337033 162077 112855 65935 117384
15506 117384 46280 57841 117898 160996 50743 -31483 -189181 28570 28978 29442 83305 159948
15494 159948 171897 120589 11354 -100880 -124578 33566 165458 126367 234524 118907
15484 118907 60703 -51802 2841 28634 150900 127516 80819 -53963 -84498 -48233 31883
15473 31883 -105350 -124491 -56599 -53195 -79025 40021 205169 294066 247133 53916 -64109
15462 -64109 19571 -37619 102105 62382 68160 97097 49923 -29359 -185651 -155782 -34048
15451 -34048 -50599 57138 -22180 -114255 -81710 6594 234138 348894 281485 407359 99875
15440 99875 -239245 -285041 -305812 -282036 -147214 74898 32438 -150954 -246098 -268903 -290210
15429 -290210 -194701 -135858 -154599 -163037 -134561 2655 -136613 -196971 -117419 2461 125907
15418 125907 103251 -40266 -242595 -260915 -96519 157015 246075 140622 91169 219955
15408 219955 289493 134782 103319 145467 188937 238738 124882 49058 159214 217267 172936
15397 172936 268195 336599 327505 311295 196546 -2152 -83925 -216483 -147466 -144110 -196866
15386 -196866 -93519 -79948 78219 166159 80079 56204 -86808 -66368 40404 34814 123143
15375 123143 188340 90863 -95656 -82971 43357 181436 134689 -56607 -100440 -108956 -80473
15364 -80473 -78350 -23492 -117632 -87326 -41129 25966 -184489 -273642 -274447 -250085 -115136 33250
15352 33250 -23594 -138782 -169737 -189000 -167089 -320289 -98492 90540 25450 152987 141016
15341 141016 -144989 -258995 -48914 166861 114685 131157 -34257 -63577 11562 139008
15331 139008 266390 167830 78260 61232 -116757 -175751 -274196 -307670 -196083 -104204 -129484
15320 -129484 -77612 60920 42300 -9664 -45051 22932 52359 -20355 -20738 71875 -14275 -166901
15308 -166901 -208006 -191083 -86641 -15926 -70601 -148563 -64582 -103076 -109911 -91964 60355
15297 60355 78174 -114202 -190631 -226310 -205570 -377397 -333036 -67952 80239 93603 69940
15286 69940 96905 140423 184086 185894 69180 -11699 -136087 -141939 -36203 63189 10047
15275 10047 -233933 -369363 -252467 -199570 -162765 -66285 19929 -48374 -25786 39322 -29868
15264 -29868 -19306 37358 4625 -106577 -106141 -32697 45490 -9208 -28800 -50819 -70677 -113117
15252 -113117 -268179 -232132 -94813 -25350 223210 177096 1273 21077 -4175 147349
15242 147349 26119 -188770 -158592 75349 228515 103143 136343 171761 74933 8680
15232 8680 5925 106148 235081 276697 106526 69568 118037 91006 196591 33960 9564
15221 9564 250459 268253 74450 -2628 98764 72410 -101508 -34450 73777 16325 59629
15210 59629 28053 -163341 -290185 -143292 -111236 10222 -31920 -141805 -3383 27800
15200 27800 -121214 -87117 -55488 -18851 56526 90274 94986 69229 44584 -69985 -52474
15189 -52474 -26562 -7986 -74361 -5645 -36780 23084 84129 102815 38457 109279 63519 66751
15177 66751 52006 50762 35186 12593 37218 -114049 -10699 -40177 47061 169843 246712
15166 246712 35103 -37308 -27047 19479 45649 69485 5708 -95266 -276818 -248024 -161592
15155 -161592 -77198 -93331 -43967 13893 -71115 -199870 -162620 -130005 -94859 66615 279528
15144 279528 261446 230499 228419 255340 248924 338271 108760 -75828 -88522 -51883 -83744
15133 -83744 -92109 -188910 -74629 -6576 136412 189605 115706 121198 201279 107646 38604 -49827
15121 -49827 -265817 -309539 -216842 -102757 136223 27695 -215012 -256392 -240391 -348712
15111 -348712 -330456 -362858 -395619 -396871 -344439 -370873 -202458 -109739 -136068 -84089 -35514
15100 -35514 -191590 -293353 -163120 -194352 -360507 -255515 10912 68842 -17963 -6393
15090 -6393 37548 10085 14466 29261 149189 191444 144259 43715 -13115 60709 5970 43438
15078 43438 27085 324 2294 -110699 -241451 -303820 -162767 -11797 -180467 -134199 -110261
15067 -110261 -249722 -272687 -174308 -69893 -16839 -119303 -101226 -44010 -44195 -93576 -159624
15056 -159624 -36177 -50490 -78953 -64634 10055 -238637 -384152 -464042 -373990 -201884 -43336
15045 -43336 -249038 -239654 -250847 -121046 -24683 -75589 -117505 -92177 -103100 -150981 39278
15034 39278 34174 -30892 -53060 159839 160536 102371 -54352 -78480 -4167 26097 -30439 -16815
15022 -16815 61458 125894 349854 323436 102169 -59549 18986 55949 -107102 -83252 8873
15011 8873 69300 -29305 -131449 -271572 -336374 -215395 91952 60815 -21133 22466 184019
15000 184019 200253 261657 195597 20841 48117 39556 -65281 -6431 84179 97863 -39560
14989 -39560 -81706 -48841 84472 23978 -60233 65525 203914 193070 110783 -7272 -39539
14978 -39539 -127288 -82792 15027 107008 104741 74794 81577 135124 116965 246200 189084 -9976
14966 -9976 -103635 26573 15415 33533 -208755 -351181 -169374 -109592 28039 139400 -127101
14955 -127101 -186190 -224595 -188272 -150248 -133714 -88255 67587 53895 -124404 -56393 203978
14944 203978 186103 231104 239768 168712 124590 129176 198921 331547 233045 2221 -146394
14933 -146394 -212444 -243072 -271425 -228027 -110921 -77829 -31489 59233 183511 188544 69101
14922 69101 -29698 -113421 -161406 -212496 -110256 63 -26516 150028 264986 126683 64080
14911 64080 92399 -86415 -293279 -365304 -281486 -142967 -69229 -97454 -88242 -39040 159728
14900 159728 22649 -135141 -170885 -146786 -102985 11479 155593 18660 -86654 -12371
14890 -12371 -130172 -128383 17917 7059 -51880 25519 108172 98229 65125 102745 61175 20692
14878 20692 20071 -54978 -59609 -154975 -197107 -157968 -56074 -9208 -37175 -9765 125006 151978
14866 151978 183831 58242 -30915 -16373 -6242 187347 199270 -70338 -181824 -102482 55217
14855 55217 84253 -25994 -131663 -64942 48052 221165 132839 21378 31546 -24573 -159559
14844 -159559 -255095 -211552 -168355 -237206 -372250 -232130 -239337 -123037 -31696 -113008 -180257
14833 -180257 -112951 -50165 14790 -6065 43495 195133 53128 -169632 -223574 -213093 -60104
14822 -60104 -12551 -144471 -155176 -195007 -99691 -9527 50163 61808 101022 -52760 -220115
14811 -220115 -368582 -332526 -154350 -155947 -78874 -84911 -19673 44147 -89258 -42813 68388
14800 68388 -84487 -185597 -44205 -111990 -201058 -293494 -194362 -18396 126835 107625 159280
14789 159280 253827 295504 152061 17142 -65775 55071 245659 135408 -33829 -85529
14779 -85529 -99425 -121759 -40572 28161 -17760 -130947 -207945 -168711 -149540 57069 88307
14768 88307 10699 11423 -82092 -138910 -165300 -37997 -15451 -3700 98842 58720 6321 16253
14756 16253 30124 -130045 -368898 -300201 -161426 -46297 148958 50034 -101408 -195703
14746 -195703 -170221 -148046 -128020 -199006 -94947 -22689 -36631 -40389 28751 96215 113147
14735 113147 44433 47670 -14146 98603 191878 149875 -5357 -60960 -132228 -4975 184059
14724 184059 170076 -42858 -180800 -202252 -183558 -296492 -200800 -51614 -242563 -314233
14714 -314233 -431043 -287867 -210647 -112474 -29376 40051 61746 -67623 -77573 -42438 -95611
14703 -95611 -91199 -84512 -93785 -35140 -34148 -158204 -261765 -240691 -285066 -397230 -257898 -169987
14691 -169987 -114605 -37401 -6721 44679 151302 92627 79549 111429 49634 -82749 -283120
14680 -283120 -342671 -171221 -193965 -66694 50222 19564 143100 36321 4516 -89223
14670 -89223 -266878 -164040 -268193 -225848 -303030 -214367 -167417 -100822 -307567 -262176 -209637
14659 -209637 -152222 -121734 -71849 12195 86431 163436 106908 -118989 -30322 -128501 -48160
14648 -48160 -106758 -325381 -329594 -417915 -465862 -362652 -274299 -220821 -284470 -125961 32792
14637 32792 145878 182153 209347 100374 140687 -46026 -147009 -135156 -41341 -6409 -30422
14626 -30422 -14661 165426 67965 -168417 -222214 -133158 -62630 -155383 -272714 -299422 -389442
14615 -389442 -240850 -60520 84752 -64053 -190607 -143591 -31660 -70838 -242231 -265983
14605 -265983 -180903 34596 -34741 -56404 49553 -76657 -56391 231592 360444 282057
14595 282057 373551 386772 204480 137222 356721 346515 330121 248813 160068 79141 37210
14584 37210 -13745 -183554 -206474 -350120 -490287 -385640 -218179 -62649 -51024 -42641 -87732
14573 -87732 -134698 -48761 108591 245883 144124 33795 208679 35759 -130082 -23363
14563 -23363 -67692 68866 9460 178894 187852 126242 -208553 -254065 -187030 -199538 -120416
14552 -120416 -43190 45886 252366 264511 291711 305204 430638 535860 332965 145544
14542 145544 147431 129439 -34519 -159799 -215796 -146118 -54149 -66641 -34507 8768 -127448
14531 -127448 -313872 -283325 -240248 -37626 143845 103014 11353 -137464 -293837 -163019
14521 -163019 -8937 6908 27426 14685 65205 -38382 -65882 -115764 -150799 -104755 -183636
14510 -183636 -124080 51439 93541 -18026 -76446 65467 83646 105394 173102 248228 175384
14499 175384 -81151 -244695 -105208 -143852 -217722 -148662 6497 -20359 -126517 -83987
14489 -83987 -87952 -193070 -105959 157259 342621 363138 212324 -1486 -13785 133692 158742
14478 158742 105817 172226 168051 47302 185681 329991 157532 16639 -8942 -84213 -150596
14467 -150596 -79079 -97873 -132748 -330472 -144113 75117 94334 178764 234712 346090 315473
14456 315473 256953 23748 -64121 40007 -51588 -164773 -258983 -106057 -59242 -72460 -46695
14445 -46695 -247642 -493142 -377952 -180925 -144910 31662 122219 226789 194684 63246
14435 63246 -64198 -40436 9597 53435 73035 72380 191364 189623 209267 -10255 -100130 -160391
14423 -160391 -107307 32206 135162 161166 228668 267122 346794 534463 646286 593679 451201
14412 451201 572597 876981 1015193 923589 915133 1069560 1256360 1230303 1083291 1094709
14402 1094709 930137 691621 454812 399407 401881 337108 327691 338491 304279 371555 415494
14391 415494 275413 198406 120032 -12732 71938 5676 82829 -55001 -126619 29739 94386
14380 94386 70218 177230 218545 320792 208956 228258 297011 449415 314698 242609 88846
14369 88846 17576 99716 73887 28674 -137807 -82032 76982 172652 110603 41943 44836
14358 44836 -222 -198030 -275569 -79335 53303 -9250 -6651 -26805 -74029 53592 -49880
14347 -49880 -46897 37774 35039 33766 -68494 -42592 -90265 -60762 44811 -93416 -142288 -145064
14335 -145064 -171490 -265055 -281932 -355238 -325320 -133890 -120295 -282247 -417599 -357229 -224789
14324 -224789 -210068 -281799 -135025 -181416 -384752 -436955 -292713 -119293 -99415 -180438 -61313
14313 -61313 -150957 -206568 -98413 19630 -26853 -42012 -144852 -326356 -364222 -176788 -8228
14302 -8228 -14597 -251816 -316393 -329197 -209780 -16799 -61391 54811 112088 -41424 -171155
14291 -171155 -79318 -66739 -29295 -127843 -177022 -178550 -6622 179517 -15114 -168952 -36580
14280 -36580 -57103 -222476 -204860 -54090 21299 69885 41602 -54611 -124269 -28873 -11706
14269 -11706 45054 -54521 -70942 -6560 160543 342390 211793 57363 41143 109855 93779
14258 93779 26780 61478 -27010 97890 127241 67584 -50913 -216054 -208665 -81222 -63024
14247 -63024 -81892 -269922 -395251 -200523 -1573 91939 122532 100937 40265 39634 186225
14236 186225 91112 -2601 111589 109629 -145441 -283215 -138644 -13326 31713 -62738 -188695
14225 -188695 -269868 -197111 -209914 -242286 -182274 -163894 -182339 -147904 -5786 25912 63055
14214 63055 149106 196320 89939 -7839 -125730 -110710 -32147 -130760 -172694 -238665 -129598
14203 -129598 -26487 66627 -40942 -57343 -1509 52775 94233 165055 165682 311801 215093
14192 215093 131458 194882 105156 111591 107588 35850 -82538 -142152 -231564 -285890 -134117
14181 -134117 13550 -121445 -304339 -285140 -173662 -74403 -23462 -186688 -425080 -324108
14171 -324108 -43435 55141 -6956 -46219 58348 194877 290235 361353 221363 102099
14161 102099 39047 -42665 -147738 64794 105222 -5256 -56137 8701 106636 -86720 -172408
14150 -172408 -86657 -60692 -80968 -51355 -108603 -186527 -197220 62314 40847 -8136 6036
14139 6036 -65457 -6327 -48835 -141346 72224 170302 244798 239075 112527 120175 66841 20135
14127 20135 75793 -29422 -88289 -130347 23091 77977 -33463 102387 78262 -34252 -175872
14116 -175872 -224932 -196687 -226572 -136225 -1313 50299 -61340 -63363 -44539 195597 186580
14105 186580 160413 167472 -54636 86282 208805 167560 146612 107115 -6738 -255747 -310771
14094 -310771 -243440 -192427 -81022 1649 -79747 -56097 38118 -45922 -26572 -26765 -108724 -134628
14082 -134628 -161456 -165695 -133528 -116159 -80458 -25819 -83755 -61117 -47685 -141711 -145526 208968
14070 208968 231049 66134 -90446 -282958 -343568 -84632 201213 387175 220639 2880
14060 2880 -210624 -275828 -141308 8534 199159 75293 -66403 -106458 -222002 -246120
14050 -246120 -220524 -202877 -171952 -145265 -291316 -294281 -73602 144282 239282 200050 78442
14039 78442 151002 152558 37916 5408 5087 -45495 97472 83469 47754 108570 86353 -1670
14027 -1670 -196978 -247239 -192365 -210264 -314322 -275506 -86546 117732 184245 280311 332450
14016 332450 364092 212046 128281 104332 -103515 -214482 -295315 -309492 -242500 -118415 -37082
14005 -37082 -66610 -72387 -162147 -219370 -156155 -70474 17334 -8725 116028 110970 132608 -13862
13993 -13862 -181695 -82938 74573 124114 126607 -40286 -41600 -55580 -10231 42456 97344
13982 97344 -67639 -299342 -198672 -159571 -218298 -164669 -75050 -178605 -57613 70097
13972 70097 -72879 -71803 10893 -73183 -209139 -276960 -309724 -210674 -12734 71418 66308
13961 66308 39453 9057 -83410 -86383 148775 425798 369172 200218 109069 82996 133495
13950 133495 51448 -83449 -99569 -38758 14386 -116253 -125097 -21198 18227 -12565 -106836
13939 -106836 -200748 -393503 -568353 -519386 -336937 -327932 -331196 -258782 -140353 -53396 -79043
13928 -79043 -42263 -87824 -122754 -81137 -9535 122433 210284 281021 165652 115455 32695
13917 32695 82603 200676 83081 -76883 -63560 22049 35170 -45497 -68284 -3623 25504
13906 25504 106414 84870 -58983 -62945 -42762 -26610 -40799 -82377 -95725 -63400 38830
13895 38830 -35228 -220567 -236958 -301569 -248583 -160955 -28320 200788 173938 -78018 50149
13884 50149 51320 55835 221305 263969 96942 28601 -93458 -53915 -80588 -56579 -126577
13873 -126577 87460 164040 159777 240950 113007 147258 -53135 24297 12597 -97420 -109812
13862 -109812 -228455 -203852 -31594 16685 102229 171064 71868 -52374 -120377 -40520 -97336
13851 -97336 -192881 -283067 -182095 -82296 13695 -20090 73763 -70357 -281042 -332843 -335654
13840 -335654 -373498 -206799 -91783 -141523 -198187 -234790 -175274 -88607 28447 -11879 -23839
13829 -23839 -48614 -90782 -65552 -61208 -10591 29959 36211 -94608 -155961 -72370 -64178 -125439
13817 -125439 -95330 -8639 -105710 -131200 -86979 53165 141622 147782 75152 -6425 20531
13806 20531 86444 1290 52453 98700 -1551 -22979 -271398 -401397 -253140 -87478 -92401
13795 -92401 -79175 -69357 -102763 78514 171778 153854 219499 196622 22092 -142894 -197729
13784 -197729 -86978 61910 114394 130341 162560 -42525 -123470 -157252 -83439 -51275 163687
13773 163687 261680 277374 201298 235036 25319 66185 173064 50869 105199 171541 160580
13762 160580 216579 220048 164283 73957 8517 34029 -17520 -121637 -93450 -45335 -44904 5408
13750 5408 -134571 -128665 -12115 144356 36127 -65362 -218698 -426003 -598277 -416529
13740 -416529 -239827 -90452 123962 35128 24874 62023 57177 60377 117011 26758 -110299
13729 -110299 -161348 -137544 -154488 -68888 -43520 7704 -267495 -409315 -315110 -352562 -282168
13718 -282168 -217095 -226687 -149428 -85215 -84324 -48627 -77790 -101515 -166657 -294580 -315961 -334541
13706 -334541 -115100 86098 83353 -6527 -112097 -120742 -149116 -195507 9025 153292 27378
13695 27378 -72784 -29143 -15605 -192428 -253055 -136988 -139539 -36747 6000 9643 -98356
13684 -98356 -137531 -58848 -58814 -161741 -221059 -348412 -260621 -221643 -299735 -237907 -144430 -25098
13672 -25098 -31382 -100414 -93601 -134769 -174300 -237334 -257610 -334558 -288082 -247761 -168692 -142137
13660 -142137 -154931 -193382 -255542 -473491 -462610 -390306 -234347 -135810 -77342 151280 246282
13649 246282 156672 4105 -144917 -103397 -143554 -258754 -185551 -4044 -26637 -60128 -55251
13638 -55251 -120220 -132787 -37967 -128970 -169435 -277781 -91647 215787 85625 -20082 65449
13627 65449 62335 -189218 -293664 -144194 62023 127261 200870 92699 20063 108306 147258
13616 147258 124624 144734 103223 70248 75914 93957 226569 267367 245320 119454 142103
13605 142103 286116 267913 105226 -40724 27671 138837 60114 20099 -35752 -104649 -36236
13594 -36236 198732 272825 380886 369981 306424 253907 15222 -138596 -161950 -87206 33589
13583 33589 -117486 -208950 -195790 -121200 -43729 37986 -11477 -7682 -27090 -17109 -6355 -100721
13571 -100721 -115325 -206242 -22809 140800 -1847 -180510 -182953 -53363 -82752 142626
13561 142626 42850 -47215 -22029 -7671 1938 -41244 -279731 -258408 -299665 -337366 -244825
13550 -244825 -110727 -57875 -117646 -21170 -113820 -63268 92508 94542 -15517 -142024 -289946
13539 -289946 -335051 -251433 -277588 -17582 185653 208174 13338 -67636 -5659 -26700 -368214
13528 -368214 -286172 -85262 -167975 -260267 -200597 -120466 -212808 -307690 -311779 -170237 -68377
13517 -68377 16053 10719 -3147 -144579 -183607 -133719 -141638 -56239 2420 -57617 -102126 -104340
13505 -104340 46776 121772 166175 163761 215213 350837 273866 111029 157997 22176 -155327
13494 -155327 -197029 -193985 -192316 -146652 -7416 98598 77299 98453 14074 49035 -83597
13483 -83597 -364939 -426792 -116420 102234 172514 8025 76325 98580 140460 130525 -42587
13472 -42587 -107164 49422 131679 -120620 -299580 -203583 -58427 -35279 189208 303666
13462 303666 105710 -36856 -130156 -110494 -8420 -159757 -315061 -199102 67613 54516
13452 54516 71332 108437 166426 27428 -108485 -75056 -46377 5935 14002 44436 -26687
13441 -26687 -71204 59815 262160 102366 -169363 -308733 -263186 -149517 -69405 39005
13431 39005 181832 93559 19754 108950 293359 272530 49584 -212483 -337868 -375902 -319959
13420 -319959 -128440 -260298 -353057 -319782 -179920 15080 118189 -61035 -325796 -506050
13410 -506050 -377660 -281152 -185517 -114776 51245 6687 75450 46774 -114741 -95937 16424
13399 16424 44285 -22178 -39705 -41187 -55931 -205729 -238006 -95438 -80414 -88204 15258
13388 15258 39712 -68074 -101763 99088 240433 76221 18855 -25763 108431 168045 -14649
13377 -14649 -114481 -45246 5785 -26803 -4658 31182 7420 70970 51618 -162197 -230595
13366 -230595 -67189 42941 88349 175650 -24786 -152129 -261552 -294012 -275400 -240038
13356 -240038 -136762 -36343 -258554 -184509 -105666 81538 193136 15696 -96694 -48567
13346 -48567 62294 153956 264675 266330 257796 272128 122065 115296 200076 219103 283992 168121
13334 168121 -39699 -251183 -251585 -143850 -121392 -221187 -274615 -270780 -103063 30062 18581
13323 18581 -149279 -182820 -190688 -282714 -382762 -342008 -350091 -342692 -275332 -19250 -70763 -80863
13311 -80863 46243 59829 -155011 -332125 -331477 -110556 56017 104100 57386 15770 -179706
13300 -179706 -269086 -223337 -177301 -73563 -14618 -45591 -578 157288 47466 33561 17392
13289 17392 3450 32857 -57313 -56488 -34709 16859 -97410 -121606 56727 112743 123303 15426
13277 15426 86882 229231 348732 288627 116096 94339 164899 220479 91778 -115461 -99805
13266 -99805 -112755 -286416 -271794 -351057 -274218 -229841 -213779 13346 -12243 -68114 -97804
13255 -97804 -242421 -396543 -243468 31195 -25599 -14301 48351 125270 167500 175633 64171
13244 64171 43604 104839 141386 -19654 -75956 -121139 -304586 -276076 -204915 6798 118266
13233 118266 94382 42178 -182262 -65848 52497 157733 121277 51154 -111109 -198209
13223 -198209 3322 11238 92074 175135 31727 -63717 -49316 18826 165547 245634 53750
13212 53750 73761 -38864 -94998 5423 -73471 -89018 -141539 -115826 35187 3346 -36371
13201 -36371 -92641 -152375 -55931 -66120 -27197 -100967 -236525 -138497 40066 -68513 -142327
13190 -142327 -101396 57244 -8411 17016 -55359 -175635 -142499 -119435 -175383 -135402 -33192
13179 -33192 80823 261151 260904 201541 83002 26866 147578 183685 139701 204215 194723
13168 194723 202404 125022 -120977 -89462 66746 -38667 -144889 -265604 -280887 -244373 -133885
13157 -133885 -83521 85607 172516 206661 203933 114480 47351 -15407 -94576 -79359 47949
13146 47949 23320 -118978 -156190 -146316 -242746 -246828 -259656 -82848 -11120 -124844 -274484
13135 -274484 -167160 -81621 -181745 -132531 -247370 -152477 -51179 -61608 -105533 -1384
13125 -1384 58582 96079 96635 71248 47722 -53574 -135495 -82617 -129760 -261848 -219677 -123225
13113 -123225 -169165 -122639 -119555 -150892 -149053 129710 255484 166970 192192 95236 197459
13102 197459 257677 136371 45275 103606 213689 136704 70384 24526 126988 44159 -98057
13091 -98057 -72825 -43323 19899 151967 228346 65650 -191040 -230436 -135280 -52203 -48306
13080 -48306 -87910 -160645 -154732 -32006 104050 140284 51085 -50884 -53264 -161568 -286475
13069 -286475 -320224 -322410 -126546 145168 253343 83588 -11019 -69347 -165922 8953 -3293
13058 -3293 60842 5113 -158682 -166132 -132124 -46559 78232 160104 111322 143359 67764 14742
13046 14742 115572 179565 118354 -90711 -291603 -342876 -428607 -363530 -137993 -108307 -20704
13035 -20704 -122667 -202080 -100051 103216 184883 182128 220998 86735 -57592 -105780 3711
13024 3711 -138768 -134028 -148967 -107100 -18843 82898 -129967 -180863 -129324 -290365 -218187
13013 -218187 130561 331887 227561 149088 152124 97367 123922 105089 73156 -132200 -4813
13002 -4813 221801 247689 280694 283373 134910 131231 152349 66738 65227 -109713 -162175 -182955
12990 -182955 -115650 -122377 -51639 52430 173532 120243 112188 46951 99410 177499 20394
12979 20394 65885 159107 99188 -34559 83468 -2381 -174362 -339670 -338950 -125006 -191401
12968 -191401 -118359 15365 130824 -60934 -62646 67665 57561 -116908 -82028 14446 153980
12957 153980 83583 -105275 -65029 50409 14545 -44252 -52855 -30229 103877 168069 28177
12946 28177 -933 13797 -118422 -115349 38357 153721 121248 254213 462871 534595 512209
12935 512209 472229 387242 372029 290309 136413 25026 44252 24087 -53593 -43936 -2340
12924 -2340 1057 -66121 13801 -36188 73759 110266 75920 -40474 85135 26390 -62120
12913 -62120 -144420 -202673 -173049 -127972 -95131 -47399 -144549 -164845 -127513 -149707 25629
12902 25629 174373 213014 214429 230358 122596 97527 138151 -24624 -181787 -29911 -4143
12891 -4143 133593 -99995 -399704 -407176 -467072 -510693 -365488 -194641 -188340 -141767 6389
12880 6389 46294 -128778 -279180 -162530 -148847 -165813 -103726 -16596 -85654 -104203 -172295
12869 -172295 -155574 -14237 136232 56804 20186 9293 81212 30494 105864 112006 -103329
12858 -103329 -80016 -163926 -215136 -129704 -58051 28895 -49826 -37386 76875 73620 117663
12847 117663 182588 139609 22894 -115388 -67653 10908 3619 -110341 -85155 -110420 -147097
12836 -147097 -242312 -204789 -77862 -31634 -20154 -3952 27357 -4189 -104586 -82277 38613
12825 38613 -5154 -137322 -101768 -52721 -175980 -195124 -169936 -110836 91677 127749 -76833
12814 -76833 -209796 -346809 -383050 -415278 -416882 -227056 -231979 -333627 -342456 -262738 -178829
12803 -178829 -82927 -124380 -220526 -248203 -198005 -66312 -54049 -16091 17134 -112081 -105708
12792 -105708 -171193 -169932 -81786 -119465 -84644 -70591 -49409 -54305 -11470 -59262 -86123 -71617
12780 -71617 -5312 -86641 -127087 -116980 -187620 -237691 -141558 -276654 -356550 -334994 -286029
12769 -286029 -71567 -39927 17660 74527 77528 63247 88117 183004 134188 153180 73976
12758 73976 56517 91130 14574 -221640 -319126 -179340 -41928 -23174 -49124 68945 10585
12747 10585 -39004 -38025 16447 65159 -28367 87632 36573 -85781 10715 48138 -70647
12736 -70647 -39386 188357 172974 84810 150608 80399 89312 247948 256512 174064 41813
12725 41813 -30394 -217686 -136000 77191 141110 121965 -45418 -192648 -185608 -170857 -36771
12714 -36771 107771 50163 79766 34795 12032 153805 263325 221196 196998 285864 216044
12703 216044 -76707 -74521 -15996 -43928 -109473 -102154 -3775 102333 37567 221547 313418
12692 313418 273371 306923 273239 258203 121232 23898 124952 248797 258386 62140 16533
12681 16533 -6803 -76452 -66735 -32554 -30106 66510 -4558 -52347 58883 181627 207550 -2182
12669 -2182 -1455 45345 96674 24396 93193 255478 192784 -81988 -339536 -499844 -382216
12658 -382216 -154461 70855 39678 95274 62125 108032 -9399 -156375 -122726 13792
12648 13792 22831 18675 -26397 -69959 -41403 -1357 98338 197838 23323 -115703 -43205 82834
12636 82834 16237 -58812 -3030 -5142 59997 -80041 -48732 25820 119190 139476 112909 222106
12624 222106 247593 258575 192675 149288 182559 172277 114962 24698 114635 72323 -70089
12613 -70089 -67794 -55182 -148371 -80824 8694 -75403 -66444 -92428 -25585 -8945 50228 156666
12601 156666 297212 316726 137715 49802 69351 98945 157248 314426 366570 433027 468241
12590 468241 457716 336128 70469 18563 125293 104486 4039 -17937 22051 136130
12580 136130 55336 -39676 -167464 -329560 -130634 114417 179842 73509 -7533 -152659
12570 -152659 -260924 -67029 46969 79379 106736 31856 97289 176677 256532 268823 346634
12559 346634 214774 249554 350434 281764 99195 -52882 -28807 -87036 -3049 23006 -114216
12548 -114216 -173960 -186203 -217116 -213279 -112509 -93301 -162947 -253686 -377858 -328002 -443947
12537 -443947 -419732 -347452 -489757 -544118 -354211 -168026 -58808 44535 124742 53664
12527 53664 113585 41618 62561 157569 8528 33775 -32846 -63863 -11527 39536 -97521
12516 -97521 -253297 -96844 -23359 -62570 4188 59024 -9380 38551 214469 225216 74998
12505 74998 -106070 -82943 3069 122372 165104 165566 41587 -134851 -95196 -23142 -44170
12494 -44170 -124622 -151843 -64945 -10081 -19008 -129419 -134835 -244043 -185899 5868 82465
12483 82465 185633 188522 169083 9313 -43885 19177 38424 48670 185192 311905 -80347
12472 -80347 -252755 -56472 -5529 151007 203683 -10355 -238276 -277205 -13343 131294
12462 131294 117738 -40063 15669 101414 176185 179766 239582 158155 134190 81337 -170693
12451 -170693 -394742 -152368 103712 49663 -4403 -43143 190222 201464 92620 -74775
12441 -74775 -97777 45626 101466 -40728 -147134 -225030 -139523 4722 144597 168572 183994
12430 183994 251751 271558 142016 165738 77788 30242 53904 -1412 -35967 17625 111068
12419 111068 37727 -23896 -15226 -119468 -45256 -196465 -241598 -311471 -130374 -7812 19018
12408 19018 46515 31720 -96064 -112437 41170 -104422 -182431 -136754 -40815 -49966 108707
12397 108707 255035 179956 66342 6861 29535 64439 64255 -29763 -79416 -41128 -208904
12386 -208904 -355593 -361060 -431800 -333534 -338252 -422194 -373790 -238664 -108368 -52185 3611
12375 3611 55773 107744 70092 59767 -57302 -143685 -254685 -364650 -349207 -209752 -59118
12364 -59118 -28146 -138189 -88189 18535 6933 60682 191571 246819 174308 72701 -43563
12353 -43563 -93852 -241961 -81984 30368 6430 62769 131655 71926 101399 168423 4861
12342 4861 -220091 -102170 45787 124549 51538 -98010 -87275 53106 26352 92833 220714
12331 220714 407194 509766 228265 45507 -146163 -83837 29153 160992 284558 209338
12321 209338 301184 285222 256470 175862 35692 -257605 -252592 -126941 -28111 107950 132404
12310 132404 -9315 18018 257885 325022 361721 338746 171489 17797 -212249 -319404
12300 -319404 -255403 -178771 -239814 -150641 132701 290112 356823 227195 222208 215735 232341
12289 232341 214046 -79541 -210046 -154966 29752 102394 -98720 -198375 -190415 -291683 -322980
12278 -322980 -439156 -304556 -103424 -10628 -109655 -183614 -97962 -64731 -26050 -114412 -180152
12267 -180152 -175473 -216291 -166335 -101946 -63853 43521 92393 71964 55565 95351 278259
12256 278259 240299 183670 275089 369350 258015 143792 11034 -41270 -11233 189487 102330
12245 102330 95778 56103 -22361 -149233 -227208 -117706 105068 57306 101207 69940 139957
12234 139957 131750 129679 -27067 -30963 -43544 -83872 -124754 -32745 -46706 -144318 -146224 -55320
12222 -55320 -176059 -218989 -418776 -414206 -187814 -163406 -146951 -263816 -320176 -247264 -112354
12211 -112354 15549 -72256 -99200 30559 139512 144307 91922 125254 36725 -176441 -6046
12200 -6046 -34715 -114623 -132209 -176864 -40081 -31962 -33699 -191149 -77600 85437 157586
12189 157586 252689 328443 294666 197426 203368 82812 216295 291072 95021 108257 200295
12178 200295 204121 21745 -38166 101465 160367 78794 -21475 -132393 -263686 -324697 -243588
12167 -243588 -214811 -158793 55404 -8397 -27374 108871 165391 -85633 -237307 -385125
12157 -385125 -297018 -142737 -160585 -191474 -168579 -93449 -32567 -14426 1788 16839 -197413
12146 -197413 -341851 -279907 -274484 -256486 -229882 -253952 -202373 -79661 -87963 29870 35728
12135 35728 -148680 -214548 -146350 -83850 2402 120623 192489 87811 -65018 -265253 -171528
12124 -171528 -326659 -171261 -31138 -31946 -44722 122131 180772 50546 96527 188368 184771
12113 184771 142155 48266 37062 20296 111579 242397 129908 -26113 -131134 -168733 -6611
12102 -6611 188992 258454 178488 63073 6635 -2030 -198236 -436793 -611108 -536836 -321227
12091 -321227 -246379 -168409 -263681 -382076 -232611 -40947 -12818 62946 155032 98219 -128175
12080 -128175 -236783 -309095 -382206 -380506 -384826 -354559 -451249 -483905 -215870 -24996 -1939
12069 -1939 -141539 -269166 -234531 -28283 4730 21571 -55444 -167986 -212076 -173525 -41277
12058 -41277 -93752 -16745 54999 137951 174091 154314 255799 7953 -108017 2163 197534
12047 197534 279467 171179 84660 52956 186709 55747 67801 132726 62194 2014 -67828
12036 -67828 -138529 -61296 -64337 -144496 -144171 32779 -68377 -273009 -282953 -265541 -227393 -168726
12024 -168726 -154399 -205291 -326692 -93386 -26708 -293321 -313497 -226836 -187667 -235203 -300840
12013 -300840 -331476 -365497 -574348 -604537 -281684 -81911 -261697 -405398 -363461 -309905
12003 -309905 -82535 -80593 -134812 -280590 -215898 -303987 -329510 -312198 -237296 -189619 -45292
11992 -45292 -274124 -363411 -299872 -266594 -186114 -83755 118961 27551 -9079 1868 -44375
11981 -44375 -57254 -55022 -55916 -70288 -51045 -116181 -171792 -405435 -466178 -266958 -226648 -311896
11969 -311896 -233406 -209589 -152822 -208882 -180721 -42690 45688 44348 -116500 -226660 -183580
11958 -183580 -153175 -195441 -107607 -80274 -82496 -142689 -194083 -267615 -292348 -50569 73780
11947 73780 -41060 -232164 -123384 64856 133924 216217 244277 69861 19164 64012 63222
11936 63222 -93556 -381832 -438957 -226721 88472 116236 30048 2812 157362 234946 54866
11925 54866 -124153 -100642 -233546 -364743 -270488 -131686 20187 66938 213775 186420
11915 186420 168177 90167 150026 109176 143233 204551 195839 189350 196015 167960 263505 352726
11903 352726 306874 267088 181673 266768 350006 294284 174162 62811 71150 129207 74150
11892 74150 -110951 -235633 -264066 -10191 116125 -59358 56437 106593 68515 -16971
11882 -16971 11803 23395 117094 72672 103735 54722 79494 86342 94370 174219 115854 79743
11870 79743 -3476 -25964 48945 229489 133299 172979 274900 319335 295091 303169 317695
11859 317695 296776 170170 109277 26082 17754 -55715 -85366 34724 127949 -8837 -151079
11848 -151079 -117857 99556 336245 287368 226987 98930 -94794 -92340 -60312 13400 -70898
11837 -70898 -197058 -163789 -127695 -219052 -116932 -74473 -98035 -115793 -60352 -15893 -146341
11826 -146341 9246 18899 -79522 -31918 18606 -12182 -151616 -160898 -15572 37940 -149588
11815 -149588 -180470 -188693 -273900 -326262 -184646 -170627 -191741 -14408 125729 158038 20087
11804 20087 -121547 -6342 -17672 -124715 -144836 -85367 -320555 -561556 -515633 -261897
11794 -261897 -96903 24636 215256 156796 -41209 -138322 -76345 -186808 7665 202962
11784 202962 426796 403953 284631 220847 302836 405194 235080 43505 84973 65936
11774 65936 49763 -76187 -109871 -298835 -303406 -134017 57735 74037 -63208 47381 12644
11763 12644 -12149 -38598 -64059 21833 57581 -108588 -126408 -174458 -85586 2617 -16444
11752 -16444 -50690 -31630 -141203 -55013 -140186 -321703 -332788 -338467 -237492 -289876 -333453
11741 -333453 -364494 -351279 -287597 -270934 -185600 -89507 34969 -75165 -82813 -27078 58390
11730 58390 127285 51586 70357 -33949 -71646 -118266 -2487 185140 217897 279062 310408
11719 310408 201574 -7420 -82725 -54900 -50536 -107343 -80214 -248970 -239136 -313887 -201383
11708 -201383 -41232 58842 158527 95268 10704 25299 47102 17409 -45264 -218531 -129970
11697 -129970 -73736 -26660 -75711 -169759 -93284 -36252 -69256 -159259 -230148 -66400 25972
11686 25972 -60587 -203578 -272440 -348489 -336542 -405831 -429695 -421730 -351165 -157870 -80350
11675 -80350 -111981 -173563 -311623 -296785 -386031 -228568 -238457 -202076 -92784 -121944 -236455
11664 -236455 -94612 -47951 -105083 -216975 -170854 -53629 -96691 -84632 -178312 -234696 -255945
11653 -255945 -293552 -314226 -163877 -110788 -309367 -300320 -19941 -20125 -69916 -42186 -77292
11642 -77292 -209473 -212648 78641 61246 -72440 -29793 54416 86103 61973 7400 -26064
11631 -26064 91813 38108 -41022 -5596 -136066 -307432 -334753 -233064 -186789 -220447 -281518
11620 -281518 -215816 -213038 -40841 -43481 -109901 -66816 -10007 -44679 1841 8045 -39631 -29370
11608 -29370 84052 128546 59677 16638 69223 116991 97748 89944 76794 38904 111007 10595
11596 10595 -91279 -81227 -40885 55379 198965 206380 240045 -40397 -248690 -389982 -365771
11585 -365771 -209250 -124249 -148852 -165308 23265 115924 -48484 -152260 -264676 -78263
11575 -78263 100555 43535 -35761 67903 107052 141126 102479 -74882 -185865 -273626 -159138
11564 -159138 -69666 -50172 -135462 -116322 32347 -31980 -44333 -49996 -22165 32349 135861
11553 135861 1583 -52935 135615 105121 191739 175227 -46078 -144744 -116722 -26796 -31062
11542 -31062 -43331 -180566 -190457 -199425 -33901 36643 -89195 -210318 -345294 -333133 -234226
11531 -234226 5624 47048 -112179 -47754 -94480 -287983 -338659 -351897 -362566 -250256 -105191
11520 -105191 -144159 -165501 -234987 -362799 -375563 -172635 -3153 84549 2722 -209677 -18590
11509 -18590 140262 40061 46568 96299 77112 4762 31143 98418 188075 320136 372738
11498 372738 263895 210151 153320 165527 169696 145957 -8611 -172145 -223019 -115142 -186847
11487 -186847 -212319 -208046 -229397 -268369 -77713 -120007 -91062 -11442 6029 20919 12802 102100
11475 102100 9544 19597 89141 40247 113987 234642 338437 373606 246701 27421 -153645
11464 -153645 -129785 1039 -55624 -40100 -63695 -131099 -124320 -182480 -147235 -158011 -140953
11453 -140953 -268163 -348402 -294640 -128577 -106591 -120635 -109871 145023 314546 180365
11443 180365 -56082 -197670 -310012 -260183 -265850 -290856 -377087 -304597 -193379 -162386 -262964
11432 -262964 -186848 -34680 -55588 -208198 -124777 -123531 -145103 -52784 26212 -38094 45526
11421 45526 312590 324807 188711 -72338 -281632 -311469 -253767 -294295 -168855 -20163
11411 -20163 22826 -64168 -152484 30906 105001 184760 53186 -103451 -148356 -321999 -412151
11400 -412151 -275864 -77904 -63782 -80578 -120645 -129125 -89834 -2135 -19928 -81555 -133372
11389 -133372 -220227 -161439 -68481 -65839 -75340 -271841 -255275 -159009 -145310 -114622 -130706 -34513
11377 -34513 -124754 -100225 -31582 -39003 -74839 -67116 -138300 -240358 -40008 -4511 -243008
11366 -243008 -242049 -260408 -199180 -144675 -260833 -510208 -422788 -334783 -280196 -115498 -58398
11355 -58398 10153 113487 34699 40705 73021 111799 88849 107900 -153386 -287510 -226362
11344 -226362 -104771 -30870 -120900 -42811 -29238 4345 -188957 -298967 -258970 -41748 66993
11333 66993 -44401 -102119 13135 85241 52767 83647 21977 -25136 148530 246221 251873
11322 251873 111622 -4712 -136916 -133887 -191280 -197616 -200978 -114203 -30217 -19671 14825
11311 14825 77476 61731 -135414 -72827 73544 15300 31574 34536 121964 117260 71511 28702
11299 28702 -168725 -118534 -198599 -285289 -334734 -106554 -10431 -81073 -50544 -57866 -120436
11288 -120436 -48478 15649 17482 -14944 -45008 -26717 176305 31790 -95935 -57655 -27912
11277 -27912 -41033 83396 169490 216759 202208 -117255 -144558 -174685 -209311 -84450 -75844
11266 -75844 -93975 431 99346 72262 -280635 -366200 -236842 -329224 -335192 -269305 -236393
11255 -236393 -32843 126424 -27963 -157188 -329517 -382089 -206715 -173102 -134505 -35684
11245 -35684 -104320 -94559 -149812 11595 178615 128195 195055 228779 -68939 -254138 -374304
11234 -374304 -401723 -383121 -280120 -251666 -114834 1758 96151 159749 186945 33731 -31020
11223 -31020 -88611 -26798 89748 214707 151499 118138 80865 -34084 -4796 4545 -38904
11212 -38904 -107108 -99930 -157777 -67802 14844 89140 89844 136927 367965 290538 131775 87623
11200 87623 104293 -10091 -19325 -43155 -30411 20867 103510 -79661 -94550 63511 119228
11189 119228 11166 -54997 459 -144252 -196157 -128776 -40101 -116024 -119042 -165356 -22479
11178 -22479 157595 291175 224931 65613 3055 -93062 -38038 -60039 -68214 -206040 -289440
11167 -289440 -374729 -169292 68873 167078 53405 130096 271403 317963 99233 80144
11157 80144 31057 124876 8817 -143434 -329460 -349653 -199718 -172957 -143869 -122227 -96634
11146 -96634 -78507 25324 108220 223706 399978 282673 217477 109720 32535 25468 129195
11135 129195 191829 62477 198714 297357 110932 -46944 -176937 -277588 -278375 -147648
11125 -147648 -37691 -36105 -146753 -197175 -125158 -112210 -49811 -114754 -138366 -101762 -72903
11114 -72903 -56371 -203177 -256221 -174576 -10636 81288 111575 -28294 -174058 -292120 -265922
11103 -265922 -250381 -158838 28636 -28643 -124129 -141664 -140347 -281059 -162160 -120862 -214643
11092 -214643 -175849 -142503 -24652 -58080 -166966 -165173 -248403 -227215 -233165 -95316 -70573
11081 -70573 -86961 -112065 -254956 -340764 -248844 -141264 73016 106504 113361 117454 374366
11070 374366 389656 249120 155397 31537 -14284 -90395 -227500 -49762 55892 -38040
11060 -38040 -45111 -83743 -5271 104791 141488 230311 127297 68282 -36566 32699 135344
11049 135344 274498 337362 236538 146345 100438 -30332 5817 100143 24423 -47968 -145901
11038 -145901 -296301 -194387 -16424 -4913 -84752 -15964 17230 199193 245147 262648 203878
11027 203878 -44624 -132638 -30480 174772 252898 195680 49029 27923 -53226 -84359 -110054
11016 -110054 -64843 -98905 -105230 -21009 16597 89237 368731 298540 104784 13866 -85798
11005 -85798 -466 104056 55110 3804 48892 143530 143060 307521 301270 207081 177490 63842
10993 63842 156073 273739 261672 154267 65188 -160792 -306983 -299906 -254195 -268616 -226185
10982 -226185 -166861 -142891 -7347 54610 -6951 41638 -13556 -177956 -296375 -342364 -273606
10971 -273606 -17169 104259 34776 8855 49581 -22922 -87955 -16171 -42121 -165978 -206499
10960 -206499 -58994 110288 85725 181110 214728 237024 112820 -26306 -39411 -4459 75872
10949 75872 -78351 -139789 -269238 -332600 -393672 -160170 77563 40044 -60380 -168442
10939 -168442 -281242 -112346 -91658 -159358 -134479 -32115 -37293 -155495 -120725 -162270 -238728
10928 -238728 -160907 -220392 -209617 -194399 -199019 -146784 -105156 -20463 -67602 16592 51341 -30156
10916 -30156 -47557 -108545 7819 100422 179081 159758 -25985 -159586 -314749 -340847 -134337
10905 -134337 208550 215527 86046 27364 -13939 -55910 -180146 -137051 -58588 34602 5461
10894 5461 -40990 61046 -19717 -6033 176677 215599 120572 -168382 -246811 -164616 -60663
10883 -60663 63360 74199 125818 120429 13367 -176433 -84885 -68970 -36248 -24734 -45020
10872 -45020 -34002 -99824 -36483 93485 11439 -187459 -282214 -343689 -415308 -374534 -192582
10861 -192582 78780 120603 62871 -122014 -80496 -79000 -83445 71631 38166 75401 201869
10850 201869 253475 285892 286518 301620 105641 -4366 92485 44651 28118 -46893 -152913
10839 -152913 -88737 -72212 -281821 -323200 -277106 -301190 -202020 -16489 -67188 -250007 -300816
10828 -300816 -329157 -413753 -261113 -169937 -171883 -92108 -87397 47798 208691 26196 -179151
10817 -179151 -166398 -64579 64565 241126 184946 162477 53685 79596 47562 31001 -24423
10806 -24423 -86469 -68259 -7913 -185898 -225726 -80417 -95153 -70814 46620 1441 -21962
10795 -21962 -39102 -159459 -229310 -278101 -190073 6142 125756 183498 150778 81449 227764
10784 227764 312317 183989 88235 73859 11931 -104702 -195578 -258495 -305875 -357185 -262213
10773 -262213 -252644 -91833 -15044 216375 241381 132451 40776 160614 185523 200643 148988
10762 148988 99044 103397 80390 131782 292089 207986 98684 105723 136887 -7623 -224127
10751 -224127 -289613 -243942 -196152 -345742 -481342 -330480 -33908 -13708 68967 148042 94790
10740 94790 -60424 -46499 24395 121052 56136 -80927 -100494 -68213 38292 97165 33504
10729 33504 78914 189093 26338 -135991 -142340 -36681 -13268 -123992 -34934 -72026 -160987
10718 -160987 -59576 -157489 -113131 -230990 -181794 -171813 -227426 -318544 -128785 -137075 -231142
10707 -231142 -221947 -203585 -277722 -431428 -341440 -62905 160001 88892 -43904 -195472 -164073
10696 -164073 -160957 -15095 19881 52931 87068 62440 96544 337593 191691 34767 95037
10685 95037 -25302 -87196 -6473 132448 366778 372668 284053 300103 342602 209295 182790
10674 182790 252708 230029 42913 -153128 -204194 -31100 -72314 -214586 -267322 -225646 -66220
10663 -66220 -47328 6705 59071 -56148 -111728 -47285 34306 57544 77577 61253 137385
10652 137385 165937 148320 46709 -26965 -4978 23441 27044 156900 59699 168596 300028
10641 300028 181198 52181 4307 -188533 -178671 54788 116152 -128262 -230384 -260071
10631 -260071 -300188 -203028 -26788 -62767 106018 172883 60684 83450 144768 180295 193613
10620 193613 140110 256704 246894 239129 138781 108488 171111 -53632 -138078 -112049 -126655
10609 -126655 -28479 114064 19272 58681 190373 137420 163870 96975 30072 148048 299133
10598 299133 221916 120405 144079 94094 276206 254667 105961 176144 270216 58278 -187479
10587 -187479 -234139 -138553 -93341 34173 108559 69917 42801 45884 -44955 -94491 95461
10576 95461 208053 95494 105144 65435 26579 151150 241611 269408 325665 291926 295049
10565 295049 211878 48120 77891 -21889 -160220 -73123 100759 112463 43474 -145302 -288971
10554 -288971 -160356 11732 -2339 -70597 28930 32885 70259 67656 -56431 -112622 -29805
10543 -29805 54745 245213 203554 -20001 -79051 -213328 -168291 -120572 -134737 -30183 98058
10532 98058 -30984 -107785 -53831 72457 242375 272236 104743 -66094 995 82429 143270
10521 143270 -4827 -166633 34763 4275 -105999 -183361 -126562 65946 129791 81749
10511 81749 83354 189270 223597 34403 -57956 -187152 -200716 -165514 -301596 -330640 -111438
10500 -111438 43421 5184 -115699 -263441 -326504 -120879 -81672 -82629 34087 -52136 44876
10489 44876 54825 31067 34566 -77751 50559 98495 22654 -23401 -116717 -210640 -225663 -73619
10477 -73619 -72968 -115357 -603 191499 295784 198088 7335 -218466 -48103 149260 40685
10466 40685 -153673 -8329 139424 194577 356865 210079 24867 -88229 -802 -23353
10456 -23353 -79489 -77576 -147809 -101273 1128 -31449 57878 28197 22006 -119293 -237026
10445 -237026 -371948 -446616 -294998 -118230 -140598 -209146 -198300 -248862 -186902 -80296 -94297
10434 -94297 -20232 -78121 -69473 -48539 155928 214247 135989 91903 145559 201299 298153 212196
10422 212196 -26251 -3256 108344 35020 -20002 -101340 -87801 -46435 26251 -21239 -76366
10411 -76366 -98774 -88405 -101830 -52260 -191986 -89962 48067 75742 204033 211946 177301
10400 177301 20841 -137581 -366484 -57592 157469 31334 -61306 -54202 118489 198180
10390 198180 203887 201638 301299 287268 153443 -171067 -343328 -148422 -8943 96080 305423
10379 305423 351748 115272 1779 117972 201888 194330 198945 145519 57518 37627 33910
10368 33910 9558 -11333 51225 226689 307176 206487 128446 -30810 -176676 -61759 -75239
10357 -75239 -300907 -352631 -161163 176084 338846 -31431 -282914 -243224 -74781 -104061
10347 -104061 -48643 115541 -81500 -60608 -91082 -36264 -34595 -4580 32974 -117931 19055
$$ [...]
##END NTUPLES=NMR SPECTRUM
##END=
