##TITLE=Analysis number 314062
Compound Code cc 04509
Project Code adrs
Chemist Name cardiff
##JCAMPDX= 6.0         $$ Bruker NMR JCAMP-DX V2.0
##DATA TYPE= NMR SPECTRUM
##DATA CLASS= NTUPLES
##ORIGIN= Bruker BioSpin GmbH
##OWNER= NMR
$$ XWIN-NMR		Version 3.5
$$ Tue Oct  4 12:19:30 2005 GMT Daylight Time (UT+1h)  MAYBRIDGE\NMR@NMR_250MHZ
##.OBSERVE FREQUENCY= 250.131544655141
##.OBSERVE NUCLEUS= ^1H
##.ACQUISITION MODE= SIMULTANEOUS (DQD)
##.ACQUISITION SCHEME= undefined
##.AVERAGES= 16
##.DIGITISER RES= 18
##SPECTROMETER/DATA SYSTEM= dpx250
##.PULSE SEQUENCE= zg30
##.SOLVENT NAME= CDCl3
##.SHIFT REFERENCE= (INTERNAL, CDCl3, 0, 16.522)
##AUDIT TRAIL= $$ (NUMBER, WHEN, WHO, WHERE, WHAT)
$$ ##TITLE= Audit trail, XWIN-NMR		Version 3.5
$$ ##JCAMPDX= 5.01
$$ ##ORIGIN= Bruker BioSpin GmbH
$$ ##OWNER= NMR
$$ C:\u/data/dgb/nmr/ADRS/10390/pdata/1/auditp.txt
$$ ##AUDIT TRAIL=  $$ (NUMBER, WHEN, WHO, WHERE, WHAT)
(   1,<2005-10-04 12:19:09.46 +100>,<MAYBRIDGE\NMR>,<NMR_250MHZ>,
      <created by zg, POWCHK disabled, PULCHK disabled
       configuration hash MD5:
       62 19 C7 07 E1 42 D1 B7 37 6C 3D D0 77 39 F9 E6
       data hash MD5: 64K
       9D 90 EC 28 1E 22 A7 26 94 DA E1 FB A0 8D 3A F6>)
(   2,<2005-10-04 12:19:22.20 +100>,<MAYBRIDGE\NMR>,<NMR_250MHZ>,
      <Start of raw data processing
       ef LB = 0.3 FT_mod = 6 PKNL = 1 SI = 32K 
       data hash MD5: 32K
       B9 6B 02 47 0B 0C 5E 68 DC 2B 06 91 F0 56 C4 17>)
(   3,<2005-10-04 12:19:23.82 +100>,<MAYBRIDGE\NMR>,<NMR_250MHZ>,
      <apk 
       data hash MD5: 32K
       B4 8E 46 6B 09 E3 42 83 42 EE 03 10 42 6B C6 0A>)
(   4,<2005-10-04 12:19:24.55 +100>,<MAYBRIDGE\NMR>,<NMR_250MHZ>,
      <abs ABSG = 5 
       data hash MD5: 32K
       B2 E0 3F B1 49 37 13 26 71 D6 B5 B7 52 A2 C5 60>)
$$ ##END=
$$ 
$$ hash MD5
$$ 8C F9 0F 7F BE 2B 1B A9 AA E9 B8 68 E6 BE 8E 40
##$RELAX= 
##$RELAX= 
##$RELAX= 
##$RELAX= 
##$RELAX= 
##$RELAX= 
##$RELAX= 
$$ Bruker specific parameters
$$ --------------------------
##$DU= <C:\u>
##$EXPNO= 10390
##$NAME= <ADRS>
##$PROCNO= 1
##$TYPE= <nmr>
##$USER= <dgb>
##$AMP= (0..31)
100 100 100 100 100 100 100 100 100 100 100 100 100 100 100 100 100 100 
100 100 100 100 100 100 100 100 100 100 100 100 100 100 
##$AQSEQ= 0
##$AQ_mod= 3
##$AUNM= <au_zg>
##$AUTOPOS= <27 >
##$BF1= 250.13
##$BF2= 250.13
##$BF3= 250.13
##$BF4= 250.13
##$BF5= 500.13
##$BF6= 500.13
##$BF7= 500.13
##$BF8= 500.13
##$BYTORDA= 1
##$CFDGTYP= 0
##$CFRGTYP= 5
##$CHEMSTR= <none>
##$CNST= (0..31)
1 1 145 1 1 1 1 1 1 1 1 1 1 1 1 1 1 1 1 1 1 1 1 1 1 1 1 1 1 1 1 1 
##$CPDPRG= <>
##$CPDPRG1= <>
##$CPDPRG2= <>
##$CPDPRG3= <>
##$CPDPRG4= <mlev>
##$CPDPRG5= <mlev>
##$CPDPRG6= <mlev>
##$CPDPRG7= <mlev>
##$CPDPRG8= <mlev>
##$CPDPRGB= <>
##$CPDPRGT= <>
##$D= (0..31)
0 1 0 0 0 0 0 0 0 0.06 0 0 0 0 0 0 0.0002 0 0 0 0 0 0 0 0 0 0 0 0 0 0 
0 
##$DATE= 1128424748
##$DBL= (0..7)
120 120 120 120 120 120 120 120 
##$DBP= (0..7)
150 150 150 150 150 150 150 150 
##$DBP07= 0
##$DBPNAM0= <>
##$DBPNAM1= <>
##$DBPNAM2= <>
$$ [...]
##$SUBNAM7= <"">
##$SUBNAM8= <"">
##$SUBNAM9= <"">
##$SW= 20.6930455092707
##$SWIBOX= (0..15)
0 0 3 0 0 0 0 0 0 0 0 0 0 0 0 0 
##$SW_h= 5175.983436853
##$TD= 65536
##$TD0= 1
##$TE= 296.16
##$TE2= 300
##$TE3= 300
##$TEG= 300
##$TL= (0..7)
0 120 120 120 120 120 120 120 
##$TP= (0..7)
150 150 150 150 150 150 150 150 
##$TP07= 0
##$TPNAME0= <>
##$TPNAME1= <>
##$TPNAME2= <>
##$TPNAME3= <>
##$TPNAME4= <>
##$TPNAME5= <>
##$TPNAME6= <>
##$TPNAME7= <>
##$TPOAL= (0..7)
0.5 0.5 0.5 0.5 0.5 0.5 0.5 0.5 
##$TPOFFS= (0..7)
0 0 0 0 0 0 0 0 
##$TUNHIN= 0
##$TUNHOUT= 0
##$TUNXOUT= 0
##$USERA1= <user>
##$USERA2= <user>
##$USERA3= <user>
##$USERA4= <user>
##$USERA5= <user>
##$V9= 5
##$VALIST= <valist>
##$VCLIST= <CCCCCCCCCCCCCCC>
##$VD= 0
##$VDLIST= <DDDDDDDDDDDDDDD>
##$VPLIST= <PPPPPPPPPPPPPPP>
##$VTLIST= <TTTTTTTTTTTTTTT>
##$WBST= 1024
##$WBSW= 4
##$XGAIN= (0..3)
0 0 0 0 
##$XL= 0
##$YL= 0
##$YMAX_a= 532409
##$YMIN_a= -314399
##$ZGOPTNS= <>
##$ZL1= 120
##$ZL2= 120
##$ZL3= 120
##$ZL4= 120
##$ABSF1= 16.522
##$ABSF2= -4.171173
##$ABSG= 5
##$ABSL= 3
##$ALPHA= 0
##$AQORDER= 0
##$ASSFAC= 0
##$ASSFACI= 0
##$ASSFACX= 0
##$ASSWID= 0
##$AUNMP= <proc_1d>
##$AZFE= 0.1
##$AZFW= 0.1
##$BCFW= 0
##$BC_mod= 0
##$BYTORDP= 0
##$COROFFS= 0
##$CY= 12.5
##$DATMOD= 1
##$DC= 0
##$DFILT= <>
##$DTYPP= 0
##$F1P= 14.0000005364418
##$F2P= -0.99999901652339
##$FCOR= 0.5
##$FTSIZE= 32768
##$FT_mod= 6
##$GAMMA= 0
##$GB= 0
##$INTBC= 1
##$INTSCL= 1
##$ISEN= 128
##$LB= 0.3
##$LEV0= 0
##$LPBIN= 0
##$MAXI= 10000
##$MC2= 0
##$MEAN= 0
##$ME_mod= 0
##$MI= 0
##$NCOEF= 0
##$NC_proc= -5
##$NLEV= 6
##$NOISF1= 0
##$NOISF2= 0
##$NSP= 0
##$NTH_PI= 0
##$NZP= 0
##$OFFSET= 16.522
##$PC= 1
##$PHC0= -60.50345
##$PHC1= 4.549892
##$PH_mod= 1
##$PKNL= yes
##$PPARMOD= 0
##$PSCAL= 4
##$PSIGN= 0
##$REVERSE= no
##$SF= 250.13
##$SI= 32768
##$SIGF1= 0
##$SIGF2= 0
##$SINO= 400
##$SIOLD= 32768
##$SREGLST= <1H.CDCl3>
##$SSB= 0
##$STSI= 32768
##$STSR= 0
##$SW_p= 5175.98343685301
##$SYMM= 0
##$S_DEV= 0
##$TDeff= 65536
##$TDoff= 0
##$TI= <Analysis number 999999
Compound Code 99
Book Reference 9
Project Code 9>
##$TILT= no
##$TM1= 0
##$TM2= 0
##$TOPLEV= 0
##$USERP1= <user>
##$USERP2= <user>
##$USERP3= <user>
##$USERP4= <user>
##$USERP5= <user>
##$WDW= 1
##$XDIM= 32768
##$YMAX_p= 536254605
##$YMIN_p= -428670
$$ End of Bruker specific parameters
$$ ---------------------------------
##NTUPLES= NMR SPECTRUM
##VAR_NAME=  FREQUENCY,     SPECTRUM/REAL,   SPECTRUM/IMAG
##SYMBOL=    X,             R,               I
##VAR_TYPE=  INDEPENDENT,   DEPENDENT,       DEPENDENT
##VAR_FORM=  AFFN,          ASDF,            ASDF
##VAR_DIM=   32768,         32768,           32768
##UNITS=     HZ,            ARBITRARY UNITS, ARBITRARY UNITS
##FACTOR=    0.157963299565203, 1,           1
##FIRST=     4132.6476996994, 0,             0
##LAST=      -1043.33573715361, 0,           0
##MIN=       -1043.33573715361, -428670,     0
##MAX=       4132.6476996994, 536254605,     0
$$ Real data points
##PAGE= N=1
##DATA TABLE= (X++(R..R)), XYDATA
$$ [...]
23450 43764 99438 107578 61264 30408 -103485 -123072 -141055 -142709 -254182 -154076 -44155
23439 -44155 -174540 -100537 -12085 -135104 -270357 -219887 -203815 -137631 -47914 -77027 -39131
23428 -39131 -30510 30268 20704 -36847 30134 84460 67684 -14425 24429 27707 -54866 -156737
23416 -156737 -174746 -217172 -166720 -186489 -137453 99656 163549 156587 73747 -16987 -62633
23405 -62633 -58025 -59007 -172182 -246371 -190961 -73246 2745 -124482 -35160 79669 81715 25011
23393 25011 5596 113452 30161 -97854 -128927 -157239 -133282 -137017 -63885 -46309 -16759
23382 -16759 -59858 -68541 -7369 -51080 -141045 -168705 -79392 62063 144507 193361 32359
23371 32359 -28189 -7479 2347 -46772 -55075 -18710 -53404 -171942 -175519 -13746 76557 33855
23359 33855 -139930 -112885 38504 15007 -78325 -83917 -13540 -14970 -73965 -92282 -59260 -42225
23347 -42225 -49674 -66298 -35976 105972 90389 97390 125213 48215 -29363 -56014 -78160 -137611
23335 -137611 -138179 -148427 -86433 21921 10801 45497 49299 106066 50177 88058 62192 -32761
23323 -32761 -21093 40724 48803 85278 66339 -28358 -186116 -129288 -6613 31989 40864 57824
23311 57824 97180 -386 -58728 100152 210426 62468 72959 129721 94721 95799 54242
23300 54242 -15660 33679 -45835 -105043 -20550 -31484 -38437 -47337 -25913 2862 62970 56997
23288 56997 18622 -49933 -105182 -123907 -174704 -182745 -122237 -89396 16138 47488 2671 -53010
23276 -53010 -132096 -105372 -141937 -101725 -60290 -82118 37549 73697 -4675 -69645 -46220
23265 -46220 -16869 -42379 -1678 57087 6697 -36300 -70562 -134131 -131424 -95696 -82314 -35461
23253 -35461 -74562 -65128 -89279 -118855 -173320 -102131 -57394 28565 56842 56595 27110 -83672
23241 -83672 -116366 -151941 -51519 -63694 -79543 5414 30079 -48549 -76842 -58379 -5204
23230 -5204 -45091 -103437 10883 2465 -22660 116500 171610 221636 215370 124522 -27119 -113647
23218 -113647 -145171 44136 137408 61259 -35936 3890 -15613 -86633 -107360 -183185 -157992
23207 -157992 -168770 -160228 -192375 -177254 -148905 -119516 -184930 9864 64105 -26112 -22789 15248
23195 15248 7978 -116872 -53525 84075 78033 72230 53000 157584 161057 178902 76607 -12944
23183 -12944 -25796 31532 69639 -26961 -73221 -122009 -33824 11681 -79107 -234835 -210153
23172 -210153 -98455 -11309 85419 100244 101670 -87371 -227259 -136484 -94625 -147680 -133865
23161 -133865 -118603 -69071 18572 80573 44708 -2441 -27661 -1333 -25016 -93502 -185995
23150 -185995 -157941 -61251 67324 45583 -89938 -200894 -191729 -119925 -42932 70903 113277
23139 113277 87751 50317 81459 31468 26836 81400 96227 112661 49963 -8093 40687 66473
23127 66473 -15950 102682 234543 179250 171083 228298 192630 2797 -24679 16771 19054
23116 19054 -52699 19439 171109 168239 34696 -70985 -29578 -9012 -121568 -140847 -115202
23105 -115202 -122633 -125626 -8538 17836 16244 77288 180710 100516 49871 -78715 -6097
23094 -6097 33563 -16908 58345 79952 25997 -3964 -47324 -133014 -88874 -37235 -6080 -13321
23082 -13321 91086 135434 157641 72318 79741 95190 -44447 -92021 -95618 -121867 -85667 -40195
23070 -40195 -41519 32466 21797 -66480 -4313 -38770 8162 82979 107416 136321 213924 146285
23058 146285 87703 97012 63702 95791 96515 56738 -113228 -208169 -237988 -199428 20241 102569
23046 102569 -35733 -67069 -117240 -148767 -223434 -235713 -233120 -234918 -259842 -296398 -330268 -269116
23034 -269116 -77570 -45278 -72822 -135897 -194624 -149439 6093 80127 35532 3390 -40763
23023 -40763 -17453 -109594 -132178 -149095 -70630 16000 -67564 -105131 8033 -32518 -61876
23012 -61876 -58594 2327 -35417 -100413 -73120 -41504 -103918 -67755 30521 -18489 -59210 -45077
23000 -45077 -66069 25968 166144 240571 302475 206205 85501 24442 -63402 -175766 -162749
22989 -162749 -32547 34840 -4107 -109971 -27401 -72962 -159946 -51837 -18228 62820 115841
22978 115841 113553 48953 -99369 -88044 -89732 -57614 104702 -684 -144984 -157791 -119804
22967 -119804 -45681 92903 33232 -63358 -91011 -118143 -121628 -87525 -186791 -170435 -63456
22956 -63456 -33614 -8725 -9931 91639 85061 41746 136702 62282 5379 -25456 -122318 -108555
22944 -108555 -31661 -37465 52417 -36009 -94214 -69238 -54448 -109175 -141210 -166714 -99925 -93130
22932 -93130 -72711 -3174 68736 35677 -40709 21146 47183 -24797 49238 130050 46611 -16398
22920 -16398 10279 68065 -3939 -60143 -3941 30598 5394 -48352 -15684 -75604 -74269 -27430
22908 -27430 -24719 -230091 -247392 -184586 -144126 -95882 -62996 -62932 11821 102500 51392 69060
22896 69060 76690 52998 104431 185795 99218 15929 -42266 -90506 -99971 -218245 -144859 50968
22884 50968 153299 146814 5826 -110027 -199208 -79134 132031 34404 -120918 -105587 -60643
22873 -60643 47718 85126 37323 -58527 -109957 -56781 18640 64235 6035 -97145 -47122
22862 -47122 -38756 -54140 -152721 -40165 -17493 18754 103809 117651 104055 18879 -80022 -141121
22850 -141121 -119476 -100183 -60391 -39192 89567 128346 116981 109900 22865 -87803 -126642
22839 -126642 -53879 -163350 -133436 14292 38753 -117344 -168412 -100611 -35061 61520 26711
22828 26711 210006 298154 286887 144194 -19488 25233 67027 138826 217245 260067 231292
22817 231292 251506 250371 196405 98355 82005 105025 138466 140773 178026 118448 27425 -73688
22805 -73688 -28183 25859 54603 115719 142075 96857 19909 9123 -58133 -36668 37297 102299
22793 102299 133511 76506 160413 104277 -313 -60420 -82781 -124160 -136721 -113421 -132374
22782 -132374 -205415 -159753 -114178 -35452 45249 67033 -34340 -74616 -8996 -9397 -5185 21878
22770 21878 145952 10521 -86957 -7832 58449 76976 137584 62395 26047 82540 110488
22759 110488 172310 190958 125824 31543 95058 89270 -47560 -150233 -153895 36216 164856
22748 164856 143349 78320 49234 -5691 -108225 -60116 77554 143505 26533 -110616 -220253
22737 -220253 -242336 -213462 -169398 -42139 -93958 -180947 -94359 16321 133965 75698 61610
22726 61610 115554 137519 42988 -5286 -36993 -14027 15006 28653 40568 11784 -137239
22715 -137239 -152286 -178674 -227576 -233436 -54943 38720 -30471 -38358 -18500 2402 67391 175139
22703 175139 130391 60026 9254 41113 -109224 -218311 -94700 55631 101681 51397 -48220
22692 -48220 89804 82197 44831 83557 53020 6181 -44960 -81306 39379 194599 147442
22681 147442 12684 6492 -18448 29440 77117 -13411 26523 133451 161585 227403 157781
22670 157781 75580 102282 161025 13747 1612 55254 41111 195497 144734 139143 102369
22659 102369 48510 94699 77569 57781 -61809 -95500 -30307 -29118 -14383 52820 213272
22648 213272 197625 195107 210184 182771 195473 232681 198490 103485 124635 112476 54330 -48853
22636 -48853 -103706 -105388 -150930 -18154 209970 130975 34279 -14771 -53076 -24911 52587
22625 52587 65153 55011 -2185 -19472 -48534 -56333 115081 108387 88270 114124 77522 117154
22613 117154 140051 96419 98054 79937 129322 74932 -69598 -54914 38161 34119 94993 42135
22601 42135 -14568 -65188 -150645 -858 53596 2740 -99094 -154486 -89750 -7640 -34914
22590 -34914 -64710 3493 148607 222368 94597 -39984 -37476 86188 34624 41731 -10177
22579 -10177 -171209 -202596 -204358 -236043 -224349 -126264 14929 47111 -19161 35503 -17249
22568 -17249 -99291 -123303 -168678 -122778 -75963 19714 -22100 -90965 61112 159149 190201
22557 190201 95088 -1919 -65245 -6365 159563 89926 20469 -76248 -21894 73504 127964
22546 127964 29214 -64872 -90003 45288 67604 4172 -4001 45744 34651 -53757 -110550
22535 -110550 -76306 -58540 14387 -27009 48841 137951 109809 101959 -38191 -67212 -68353 -91534
22523 -91534 -40690 -8101 -11851 2355 104770 99510 38375 87089 211243 154224 70406 5809
22511 5809 126982 225579 69183 -63237 -33557 -65764 32218 60242 20288 -43365 62587
22500 62587 182835 135124 124672 212111 148390 13455 -87037 9503 -62682 -205160 -223906
22489 -223906 -258495 -177398 -25695 36822 65799 130796 48382 83741 -59108 -179908 -128134
22478 -128134 -128659 -159798 -126749 -107433 -210613 -137464 -15980 11597 -71294 -154700 -113511
22467 -113511 33533 45930 -57709 -117124 -107943 -33022 -55021 -58794 -149576 -180405 -187941 -122418
22455 -122418 1532 139669 -13059 -87114 -52572 -38137 5453 25628 -66949 -92844 5507
22444 5507 72529 34143 -56358 -162060 -185082 -169479 -15103 -36088 2336 71191 112507
22433 112507 114214 167096 152623 100827 111616 -42045 -104843 -86836 -110969 -19343 -42336
22422 -42336 69398 220547 217446 124495 43680 95893 63256 -89806 -118609 -200092 -216923
22411 -216923 -182671 -147521 -52099 17420 -85746 -81596 -92319 -14457 -33996 -104161 -125862
22400 -125862 -151806 -203876 -271507 -328816 -281457 -220792 -192846 -194774 -281027 -184387 -1402
22389 -1402 106300 168988 134101 38361 23483 13370 59572 162911 148337 77824 39240
22378 39240 -58820 -158574 -192829 -112172 101673 94672 98285 130087 60522 1358 -18946 47385
22366 47385 -11265 7162 171872 96528 -30829 -92913 -97115 -111436 -77014 -79419 -104589 -31667
22354 -31667 -41312 20583 60636 -6352 -114585 -230556 -199701 -89579 -18516 27381 88650
22343 88650 75199 54575 11724 -8337 86 -78063 -119631 -48090 -81996 -137892 -120861 -4721
22331 -4721 51277 -14990 -55049 79078 20304 -36435 -4113 28009 -14634 104910 197309
22320 197309 171333 142839 127418 180104 237554 242532 208571 164387 114941 36083 14326 9594
22308 9594 -34794 -48286 -99096 -52522 -58402 -67472 2076 49288 62269 52528 -4332 -120578
22296 -120578 -73248 -46705 -186632 -225330 -262253 -221752 -240236 -203207 -125224 -73230 -125991
22285 -125991 -131851 -188326 -187206 -201097 -214743 -191828 -90983 21439 76949 51082 13399
22274 13399 -18395 26134 101285 76286 53670 -67663 -165789 -141716 -173906 -70721 -4114
22263 -4114 -65829 -50612 41121 -12944 -5769 23393 42606 -19284 -42960 33111 -5543 46243
22251 46243 88103 106667 78295 -47315 -56802 21268 -38391 -141268 -70945 -78047 -73968 34303
22239 34303 24679 -3129 75829 163460 97975 46866 80499 112928 59805 -102355 -62639 5284
22227 5284 -1190 -24504 -21181 -39334 -185324 -155108 -121199 -123264 -19656 57395 34516 -56564
22215 -56564 -130630 -51809 126055 194441 213234 218662 132179 19869 12288 -4188 -182144
22204 -182144 -64316 -17637 -86330 47164 125424 47824 -23529 -2370 36234 60280 -28673
22193 -28673 -8977 -37138 45494 108525 139698 -28716 -119433 -184699 -135676 -26348 -35020
22182 -35020 -99929 -146037 65509 105582 36163 68057 92129 79999 31523 43839 144878
22171 144878 134838 39957 25681 166226 375066 306624 221730 141785 36497 26974 79280
22160 79280 -31757 -70728 -84428 -69828 18258 33490 -80890 -208375 -203671 -220519 -205892
22149 -205892 -197933 -143803 -52929 -103049 -299761 -277640 -195928 -128081 -106472 -34120 -9679
22138 -9679 -78735 -110247 -25973 -14670 81178 42527 -14289 -29476 30750 62407 23996 -10818
22126 -10818 125146 492 -85509 -61704 -69790 -123692 -157489 -188942 -202272 -207283 -259019 -245365
22114 -245365 -64246 81403 212842 80640 139543 247029 333717 199118 -30285 26485
22104 26485 82243 61566 19996 43657 30645 -9188 -64770 34167 -17333 -39588 -4265 -92268
22092 -92268 -45524 53508 -26723 -73058 30120 70571 -51087 -40719 -6331 89721 197293
22081 197293 201938 155484 144686 94146 128481 117069 30905 54398 55156 52103 60099 63387 56820
22068 56820 -41597 -91206 -98149 -144214 16502 53619 26451 25042 102732 156441 122257 63514
22056 63514 -132862 -168505 -135604 -129394 -187022 -112756 12509 -83818 -24678 17771 123194
22045 123194 181780 201912 208050 132311 100636 65410 49594 145977 132109 21673 -6239
22034 -6239 -7808 21698 47020 117172 120595 161587 170769 141124 155487 131970 115197 46590
22022 46590 -25630 -30103 61907 126900 167492 131284 63915 -8044 105783 56132 142140 172292
22010 172292 94053 43195 -83931 -116985 -32009 50975 48112 -70787 -189392 -289391 -252187
21999 -252187 -31458 54985 81905 -57431 -13192 40433 -17915 -6848 105021 102615 73317
21988 73317 -57102 -65547 -126790 -61553 39804 -19278 -71816 -4473 -47722 -5164 174281
21977 174281 212757 61312 -22379 -66568 -145240 -68662 -12291 31904 -7555 -60373 83404
21966 83404 173617 15048 -48369 -16937 59295 69621 10603 -65244 -21720 128613 155103
21955 155103 215662 88934 -93215 -61024 33883 39059 35852 -53829 -3757 63361 148223
21944 148223 190063 174293 44121 -55855 -33382 29663 108135 107215 -50383 -38559 -31285 -125272
21932 -125272 -67807 44217 62002 -75058 -97431 -63904 -97288 -106177 -92652 5738 3912
21921 3912 21824 7348 46394 101054 8856 -86617 -160301 -57752 -26718 -58260 -6398 3959
21909 3959 -96174 -216115 -142058 11432 69055 66261 164735 110480 91166 116201 98145
21898 98145 17890 -78709 -62521 16736 -41269 10612 3828 -14373 -576 -1516 136123 323132
21886 323132 220761 42472 687 -44351 -80579 28614 145089 171539 188547 226221 186111
21875 186111 114681 -5175 -34665 -14407 -26328 -72259 -3617 -18694 -79765 -41200 24325
21864 24325 49148 -39740 -86077 -74120 -73330 -112468 -60270 -43894 -59693 -102239 -107809 -62444
21852 -62444 -29388 -10683 -15264 -22415 -91139 -147997 -141289 -122898 -104322 -70603 -26702 -107792
21840 -107792 -138871 -67877 -77260 -92607 -115295 614 -39489 -91010 -161871 -147932 -44664
21829 -44664 -70590 -78502 10856 60961 -157442 -283304 -220640 -71012 -95227 -32413 -18463
21818 -18463 -35052 -77706 -1088 48643 71095 76894 -2036 3866 187392 150579 141140 136265
21806 136265 -14620 31352 59954 22648 73286 105492 80791 87345 107551 -7727 33585
21795 33585 89077 18441 -15237 -25733 -52064 67807 30680 37661 79139 -32239 -4110
21784 -4110 -39886 -26544 32101 20744 -23820 -18069 -12137 -5011 17697 30053 112100 13913
21772 13913 -17756 -25593 -130388 -109166 -8905 31949 59774 -15067 18123 16738 -32436 -5096
21760 -5096 67238 155932 67931 54057 34161 49811 29135 17719 37940 13880 5126 117954
21748 117954 121278 55111 77552 165181 190736 64358 32745 -28019 -146593 -224691 -140457
21737 -140457 -51299 -37193 -71437 -68421 -21516 -132818 -94209 -90736 -152246 -119923 90423
21726 90423 150568 106615 140495 62171 -40900 -240409 -252418 -60907 -53248 4724 294
21715 294 95987 71502 10942 7434 163527 129763 59467 92906 45710 25472 -24253 -20330
21703 -20330 86270 38541 -89066 -199528 -152518 -79417 -25964 13416 -16859 93517 253750
21692 253750 155615 32746 -71185 -50419 10411 45339 -13951 -33681 -106915 -188703 -121487
21681 -121487 62610 139119 90642 170584 78929 78532 -2404 -67777 -115143 -119050 -41344 27058
21669 27058 -58215 -78884 -28896 11 63108 38996 117318 76918 30312 27789 35391 115064
21657 115064 76625 12642 -135462 -83078 -84556 -83981 -14266 -19027 -5706 -58555 -128885 -36166
21645 -36166 122726 64423 -122038 -125975 -41060 -51183 73152 161788 138182 2649 26621
21634 26621 16874 -27140 -69433 55228 11852 -41505 -32433 -98308 -116384 -90329 25591 81800
21622 81800 41557 12471 -118084 -47293 -18932 -97677 -73102 -97402 -95406 -53799 -78760 -84240
21610 -84240 -13421 76904 39575 7951 23132 3498 -23244 -2097 -1933 64682 -20665 -82485
21598 -82485 -63658 -119422 -189267 -23366 64996 97122 112606 107559 81789 2230 -186535
21587 -186535 -74328 63213 131663 213588 243046 83155 43019 11472 91853 81572 76679
21576 76679 114290 104703 181013 257717 85799 -32048 -96249 -158478 -75614 -125116 -156797
21565 -156797 -170062 -247099 -146756 -30046 16073 127167 139278 109591 180328 73047 -57942
21554 -57942 -94387 -115449 -143429 -107113 -252273 -213809 -83334 60003 -38135 -66389 -83237
21543 -83237 -8626 3141 22538 156745 118017 113992 231992 227462 192031 150653 74241 -1164
21531 -1164 -64375 -46496 -185830 -245691 -143591 -97736 -85637 -93327 -73154 -71454 6954 62940
21519 62940 80636 47178 169302 210607 246240 356859 199722 -8652 -66656 -92263 -70257
21508 -70257 -16790 -79817 -101547 30921 77939 85246 117443 27387 47996 155827 258433
21497 258433 211818 162210 193953 163386 75054 -75946 -5470 -89690 -90311 -76893 -79433 -91886
21485 -91886 -5256 48828 -133812 -223267 -187449 -90628 -69199 -50129 -96161 -91709 -55492 43204
21473 43204 142629 234721 144977 91263 130984 93115 96312 115607 231815 334837 294074
21462 294074 346684 275134 135984 34875 7001 101710 195372 151756 96139 106738 -30045
21451 -30045 -98079 -24205 137437 69023 -62754 -74687 -137982 -40744 7906 81428 115009
21440 115009 46356 33691 15455 90388 89506 149661 220598 117703 56743 38621 54607 158422
21428 158422 14404 -147098 -155221 -50133 89969 177733 213278 115884 -158008 -173191 -51752
21417 -51752 -8036 59933 77693 145947 77934 -96042 -137880 -13050 40060 97415 83236
21406 83236 78605 117516 102588 130128 156156 190821 133962 -16565 3444 60471 -17291 -2572
21394 -2572 104319 193792 215224 189107 142377 172239 138076 47658 -7682 -39955 -45712 -33192
21382 -33192 -29992 98228 159160 97032 129660 160750 128374 237256 339618 371168 307371
21371 307371 360766 374627 287497 228096 144651 88468 80000 59446 -102435 -84211 -32220
21360 -32220 127385 225529 113788 -83829 -173565 -57984 93647 157432 246329 252331 221403
21349 221403 170682 267545 285656 201810 171473 270533 317867 332339 336467 169618 44785
21338 44785 46964 148906 141133 122006 155913 169460 101440 103952 80443 192820 241828 316112
21326 316112 205318 142471 79732 -45588 -181395 -134978 -32204 -5288 83374 31211 -6303
21315 -6303 46673 -18957 -102376 -144035 -59530 34333 3651 105348 287941 233533 72281
21304 72281 107366 118545 145657 248843 243643 124269 172118 164511 53094 58463 128949 229129
21292 229129 255814 223971 249803 287586 252071 119313 47899 115195 169711 134563 68535
21281 68535 948 57460 115473 23271 -28281 -69809 15857 106989 179216 65691 138315
21270 138315 246257 298584 252907 215964 161264 206185 318353 327807 266981 284439 255379
21259 255379 118997 88415 171945 232980 159345 96738 93128 219451 85434 14584 36863
21248 36863 48899 149085 144579 102366 138501 197599 199196 210897 211467 194024 133331 72353
21236 72353 -37547 15908 112410 55517 51050 96276 41462 80551 99312 -6293 -88534
21225 -88534 -71796 52356 182398 144390 109693 117665 160267 130446 145162 31931 66092
21214 66092 215652 242019 185831 79351 34081 48017 49529 29145 66099 44723 101412
21203 101412 185239 296366 298359 214187 36885 38013 141201 27787 -103355 -55909 112831
21192 112831 162202 101900 152266 142583 219097 276584 281034 167120 106775 103306 37564 19925
21180 19925 194350 286488 305111 338202 370024 369068 567295 741564 841216 921434 895885
21169 895885 829122 723955 596875 494660 510406 645036 822734 955403 1029521 1027195
21159 1027195 901992 760488 639220 612781 665084 671747 623216 582725 581080 593630 555986
21148 555986 709830 827795 1010517 1121716 1250025 1215219 1197561 1056432 988120 963721
21138 963721 923851 895112 930689 1049201 1072034 1012101 901714 800229 708616 556316 410162
21127 410162 412301 483508 341261 201569 93026 -3259 191268 296028 329178 308484 240885
21116 240885 146806 153785 211553 152622 -13840 -9570 149630 196005 145031 115683 237533
21105 237533 377116 390596 359052 389317 369548 279079 238409 181775 180285 230323 280924
21094 280924 308275 323089 294553 206450 133968 39253 152240 179986 199995 284418 385654
21083 385654 230274 154423 215009 191092 253732 219947 201707 331548 380165 249158 148212
21072 148212 179237 364964 352639 335816 368577 354439 296068 237506 240439 336277 248598
21061 248598 71327 112763 120544 91526 107060 111340 157840 70112 109257 197220 203224 165343
21049 165343 112393 58967 68775 50501 167860 222013 180002 183775 222750 171862 131432 63746
21037 63746 47161 106586 148846 160183 103719 -240 116102 261280 198467 -20412 7468
21026 7468 196045 289110 391214 346597 371830 409345 348653 259982 190789 150601 89671
21015 89671 129645 150276 233197 310291 209522 217721 239337 213250 193430 57702 79665
21004 79665 186729 256491 132048 129675 169456 265573 350938 317807 241371 158113 48117
20993 48117 87984 126209 26734 29256 104135 53168 16319 57781 197856 160862 252625 211951
20981 211951 130141 98726 40150 -19763 16952 48304 126873 148895 210408 190943 211283
20970 211283 278027 322311 343229 254890 201830 181152 277884 184889 206708 324765 442913
20959 442913 344493 154019 126369 144509 302681 337768 460424 446325 416056 369597 281684
20948 281684 251187 313674 303606 291356 377866 427281 327650 252546 184297 257402 289287
20937 289287 298390 354279 397793 203749 203167 219057 183033 195105 271409 229033 256772 112287
20925 112287 25937 55300 78032 5052 125151 237128 378802 408285 388122 355805 278616
20914 278616 211476 271102 306575 319638 467891 567656 444423 372107 442900 366863 377243
20903 377243 304970 135194 175170 154503 147653 163123 225903 213045 242090 254761 307636
20892 307636 261833 333424 366327 349492 307472 232327 181642 178245 203945 247047 246061 174404
20880 174404 222375 213601 201504 183803 181105 321480 354342 145398 192291 229244 296734
20869 296734 253076 219743 237098 224712 161470 143446 275408 347336 394716 327146 399477
20858 399477 486452 499754 408488 296527 209210 266515 251106 246374 206477 264720 421835
20847 421835 481144 387351 448481 466027 340791 300450 225471 322426 393387 400829 287044
20836 287044 251616 369028 453920 354184 371008 396646 405614 428043 394326 312557 396560
20825 396560 454681 358099 342645 442973 384346 318268 334783 447418 539423 432991 400787
20814 400787 265991 293831 390568 432309 394107 240206 340757 502783 526417 474122 407618
20803 407618 351238 416723 528308 519285 441920 276659 209026 245836 296419 317751 292207
20792 292207 233803 262309 285732 316071 287177 299200 422889 446551 447137 485895 502076 626348
20780 626348 650622 561341 523246 497879 517996 593051 667744 690559 675017 645561 696240
20769 696240 590156 427622 382680 418004 320635 196176 196064 428243 506729 438667 400758
20758 400758 347797 385860 508569 513843 501185 387830 475745 608179 585576 432827 373994
20747 373994 441915 490619 514529 580165 619421 577212 448124 385546 414510 587442 664209
20736 664209 734388 685242 649948 663004 557894 560025 530305 564667 715091 791627 775232
20725 775232 821739 948552 913949 833735 790741 915948 989863 963433 751396 630446 671120
20714 671120 685378 664355 731723 866181 891216 965981 1001705 1057298 1022421 1073753 1047142
20703 1047142 1094000 1091136 1201289 1236064 1230914 1186279 1230048 1226575 1305000 1376802 1355304 1247485
20691 1247485 1106102 1041789 1131048 1222018 1241300 1248264 1266737 1181438 1134931 1100292 1284809
20680 1284809 1291671 1266141 1347821 1305140 1286315 1307594 1404499 1505062 1560592 1597692 1718351
20669 1718351 1655288 1660702 1641113 1757805 1876394 1984520 2023106 2192000 2444787 2519711
20659 2519711 2565597 2645489 2796224 2898241 2941371 3076658 3291913 3588705 3870269 4196409
20649 4196409 4363490 4453296 4496168 4522917 4652927 4966793 5213483 5571283 5931439 6345140
20639 6345140 6748104 7058707 7284465 7481016 7737819 8132222 8572284 9057550 9609966
20630 9609966 10275381 10915490 11543355 12502992 13721134 15195691 16936405 19212758 22058986
20621 22058986 25625192 30290722 36603716 45430948 57801192 74538981 95461493 118110181
20613 118110181 138387592 151973754 156653050 152148970 141197017 128117042 117788158
20606 117788158 114149737 118925355 131196522 147622953 163006629 172226613 172287136 162928786
20598 162928786 145983126 125527290 106359353 91586353 82025422 77161419 76668316
20591 76668316 80268736 88389957 101872255 120320189 141115961 159765281 172033372
20584 172033372 175244125 169182629 156146100 140860655 128391802 122586694 125418520
20577 125418520 135999633 150848295 164761192 172598694 171268944 160138056 141342736
20570 141342736 118665727 96382401 77787019 63918256 54018131 46659176 41194332
20563 41194332 36788446 33118275 30010940 27360965 25148298 23001287 21292429 19808593
20555 19808593 18400164 16954963 15571810 14219840 13093372 12092022 11296280 10561474
20547 10561474 9900565 9193474 8598609 7914441 7113848 6390598 5796123 5361006 5099494
20538 5099494 4884999 4650807 4425617 4201575 4178663 4178858 4026803 3768898 3443765 3282854
20528 3282854 3155411 2936844 2789333 2603140 2494791 2359458 2187745 2091964 2209262 2211739
20518 2211739 2164708 2226188 2158806 1891141 1750662 1567219 1510683 1560147 1486936 1344740
20508 1344740 1308327 1409508 1382756 1506740 1573453 1601263 1495487 1412778 1493010 1533628 1432950
20497 1432950 1306530 1239695 1252714 1293456 1305499 1362715 1382028 1388381 1295080 1279261 1249613
20486 1249613 979789 802857 799678 782895 902516 818309 655154 654753 659991 628289 722988
20475 722988 718146 697033 593228 562636 691070 733917 714737 698456 699844 598431 593754
20464 593754 578722 526743 590756 536822 444233 338832 332069 410974 532587 546083 480789
20453 480789 434599 323500 341653 307768 263620 221156 271516 342000 469435 495056 511108
20442 511108 545818 524827 638291 663554 681627 642247 516011 377565 310193 334904 299810
20431 299810 305587 397905 416230 344271 339708 371073 343809 252577 208902 218445 290683 285076
20419 285076 249392 287690 216265 236762 251693 267846 335821 292552 124181 -5049 13700
20408 13700 189381 279901 327693 336416 412193 496004 366214 417158 475041 407352 272380
20397 272380 232670 247033 96514 39282 144848 294841 265849 100093 27605 -89308
20387 -89308 21300 28052 107138 29482 -35283 60172 68486 -71014 -133725 -16497 3461
20376 3461 -24236 53263 71930 93027 91417 211656 209331 249098 253422 246683 212122 258836
20364 258836 197751 117411 137125 167867 216819 143841 56694 35321 133427 187285 181018 174333
20352 174333 154204 81809 126450 101276 13375 68028 133343 101526 94017 80796 77581 54939
20340 54939 123391 70882 64317 25641 18597 -60388 -43687 -21877 33891 26246 33347 80402
20328 80402 9651 -62922 54273 97007 50438 89985 250487 371290 347131 211490 96478
20317 96478 179502 332602 282376 215855 279155 275822 141156 -46738 -4071 60914 133085
20306 133085 130457 10218 16684 58519 168038 137403 20382 91874 273589 302609 169496
20295 169496 9690 -23330 56747 90909 123232 106187 -5785 47325 58206 152927 189234
20284 189234 167529 190948 140321 111708 161453 182502 140456 124882 186407 218221 211680 148743
20272 148743 96146 -45637 -3399 133781 192796 246904 230288 162595 92497 34713 128217
20261 128217 211001 227144 169140 121352 67441 164987 136719 156335 111693 -102 -23194
20250 -23194 78138 319794 429633 339763 193093 14353 -28694 114235 191946 168420
20240 168420 73294 92499 151792 128762 112877 223486 337737 295567 176190 204491 331966
20229 331966 289110 184998 175417 247465 193689 183095 229326 222037 126165 86683 162282 194302
20217 194302 280841 295862 161323 81295 109182 81207 -12430 13805 -94932 -46275 28694
20206 28694 122326 125411 233713 302853 234940 219411 159695 93094 103870 126039 132327 158240
20194 158240 63161 33419 -12056 -34553 -93306 -39418 -31197 -118501 -62616 117814 174261
20183 174261 72225 23898 95052 94474 105375 193205 196488 97865 87615 155674 141922 178733
20171 178733 287443 416804 605735 599681 461546 355732 241454 219862 240187 227199
20161 227199 123399 -15635 -55024 91289 25366 -16622 68858 61847 87424 183470 236482
20150 236482 189397 74632 91190 195593 169480 167249 120548 183965 193932 108172 144891
20139 144891 91216 125340 135248 72793 41090 99760 227426 254805 81500 43035 -1749
20128 -1749 29000 163242 267738 274258 188417 185521 166571 107404 105261 109513 100123 88550
20116 88550 128814 104084 75902 98648 179125 217744 128394 124064 92488 14402 -83697 -41639
20104 -41639 30260 173662 257546 297514 308042 289754 295074 142750 87723 87610 213854 223685
20092 223685 127673 83498 191317 254940 343236 400327 346233 164287 124328 174746 258951
20081 258951 398623 376095 303162 248168 169767 286443 266583 287430 184368 201650 267298
20070 267298 329325 244040 189315 169247 165991 143098 153145 222933 276440 275836 352543 283481
20058 283481 206857 236927 320360 295324 227892 336017 499578 592309 585719 583605 753387
20047 753387 988934 1214115 1252471 1296797 1179802 1042596 1064758 1008428 983455 1032329 1019280
20036 1019280 966316 896447 1035367 1067997 1119797 1080516 911802 783452 782899 641787 607857
20025 607857 583542 553835 719397 823497 983710 1164841 1234151 1192376 1105366 1112170 999269
20014 999269 964717 924517 870948 978573 890869 875372 944730 1073522 1248746 1114004 1027120
20003 1027120 834056 575851 408801 300245 286362 353724 373332 372542 393408 462864 495158
19992 495158 483968 561642 573209 624176 788810 887336 945470 824196 770469 873410 912564
19981 912564 899856 865676 975343 989475 1010869 921464 877393 808320 754283 773137 863625
19970 863625 771241 677133 577392 522952 479405 497014 608624 592359 421633 296089 290333
19959 290333 321348 302578 360848 380677 463151 454502 392633 305075 325965 417964 461759 338080
19947 338080 427914 531092 532084 401849 361186 349646 487440 665172 711591 656408 663801
19936 663801 793496 870369 865743 943734 1043064 1160371 1122877 1170751 1092619 1042622 1065003
19925 1065003 1058819 990676 937665 993264 1089186 1082861 1040058 1057287 1016344 1003842 858061
19914 858061 637112 544357 569010 529696 463188 389511 343353 390299 399536 261756 317492
19903 317492 342162 340708 405587 357814 260304 207897 222106 284076 332721 480895 503135
19892 503135 389560 339307 381434 418996 503809 622616 662603 742686 844678 999951 1149796
19881 1149796 1292337 1316240 1386461 1382131 1334122 1332810 1227424 1248385 1175012 1082129 1023041
19870 1023041 871415 763806 759976 695301 596307 495670 480854 533791 484383 327368 332305
19859 332305 419255 493745 497667 528125 514152 442711 466869 484817 457568 380507 379547 323133
19847 323133 402144 527066 477250 438392 560001 535248 547416 575187 491574 440470 449969
19836 449969 530650 567834 644364 712726 681402 774806 879891 958853 991420 1168801 1187672
19825 1187672 1265715 1459925 1631727 1594129 1359197 1314542 1348306 1208105 1102342 977756
19815 977756 888572 854747 838451 755861 673167 571964 502027 455576 419840 339452 316660
19804 316660 294652 300227 307338 380135 415587 472502 610417 687959 677027 547156 529401
19793 529401 619720 571575 568292 673845 688624 581269 523854 528255 485028 411968 489806
19782 489806 512782 459076 487073 473785 334231 339424 363490 331149 442485 460706 455435
19771 455435 471917 479583 436412 379584 303672 374686 421909 338889 261269 373147 402292
19760 402292 357096 366773 283825 231535 298570 380894 377390 292710 266429 369621 450983 381780
19748 381780 347056 283113 285060 335382 387365 557501 575986 491412 363646 178291 295562
19737 295562 372538 329300 447196 485651 505051 420098 461589 602442 579337 493687 436795
19726 436795 414821 453275 476121 519705 615160 578792 486839 489695 559602 518939 428300 438775
19714 438775 430386 366583 281818 302670 446270 458886 347438 301414 506700 613311 551791
19703 551791 588648 632246 641087 710578 583106 454025 522447 533329 587739 572102 510044
19692 510044 514301 510947 443790 302618 271658 314039 416013 526328 551451 608288 667997
19681 667997 789038 616884 521010 491259 419360 465610 553720 491902 471691 507800 485099
19670 485099 480557 602509 833884 854039 740394 878215 965962 834653 660526 610249
19660 610249 744583 781134 809270 702255 580376 469549 550818 684709 697278 679843
19650 679843 595792 452223 378638 412097 608598 663079 679299 712990 737685 762835 721474
19639 721474 689997 704199 737321 743776 737547 693322 681412 637754 628028 661275 756092 813690
19627 813690 722734 616921 632460 658978 799559 818692 702734 774723 887968 964549 990197
19616 990197 874323 914142 1042131 1101518 1006836 916051 784715 724463 659176 697614 660199
19605 660199 583038 518359 614353 698797 876230 917985 923093 917436 1040302 1035267 1127429 1077520
19593 1077520 1040058 1057962 946651 1069632 1197242 1100220 1098402 1112987 1158419 1322237 1359383
19582 1359383 1295408 1262446 1293653 1344469 1425530 1275970 1123456 1030359 1026089 1144942 1334507
19571 1334507 1432427 1256182 1103019 1150991 1107261 959657 984320 1107752 1170320 1241842
19561 1241842 1426088 1428515 1469639 1429963 1261055 1310530 1408943 1415263 1436075 1499314 1481327
19550 1481327 1455902 1428201 1532880 1657666 1544315 1471164 1377339 1410295 1559366 1732258
19540 1732258 1746947 1746317 1816183 1910352 1859481 1777035 1831841 1908669 2006850 2094753 2265560
19529 2265560 2336070 2395533 2439620 2470688 2335375 2210546 2360148 2724303 2852341 2763563
19519 2763563 2706513 2685503 2716044 2854996 2869306 2970845 2999727 3239514 3469952 3605270
19509 3605270 3754078 3990200 4259724 4527604 4734216 4886156 5113370 5351057 5680525
19500 5680525 6049363 6460578 7039113 7627667 8080686 8520986 9106025 9906725 10832429
19491 10832429 11796639 12984448 14551759 16403905 18730285 22116227 26718728 33230090
19483 33230090 42362012 54475100 68772343 83546047 97459996 109234768 118221473
19476 118221473 125096590 130164087 133455000 135396969 136158869 136091396 136280409 136535984 137041759
19467 137041759 137772885 138202981 137965536 136471153 132978663 127086241 117727546 104964298
19459 104964298 90490801 75785472 62371708 51635530 43950775 38479454 34444081
19452 34444081 31445246 29016728 26929828 25263082 23975738 22903167 21959620 21191532
19444 21191532 20595929 20041687 19684391 19561318 19619199 20017592 20757397 21722021 22983266
19435 22983266 24823089 27507254 31303999 36822402 44896450 56182947 70434284 86093085
19427 86093085 101564534 115694961 126898436 135476671 142254992 147044341 150317230 151891024
19419 151891024 151640215 150782166 149690548 148842923 148892246 149081579 149169457 148936769 146873041
19410 146873041 142444034 134863641 122872215 107647921 91270058 75432358 61984931
19403 61984931 51717835 44385522 39151374 35214964 32170488 29712197 27667666 25874533
19395 25874533 24418365 23041453 21645987 20432239 19488025 18626424 17975079 17546968 17293164
19386 17293164 17197527 17259827 17732315 18587068 19777552 21607998 24193196 28062324 33480726
19377 33480726 41226283 51953514 66063669 83456982 103063383 123941267 144709264
19370 144709264 164003696 180443358 192474400 199061770 199876246 194992705 185014848 170999762
19362 170999762 154176871 135884267 117166102 99050357 82546911 68620438 57444641
19355 57444641 49042312 42892030 38100141 34276035 31260722 28871503 26770265 25011784
19347 25011784 23452797 22032901 20738248 19644750 18733270 18002369 17198287 16345930 15815249
19338 15815249 15321320 14952509 14726581 14547603 14459200 14589723 14902720 15389898 16168897
19329 16168897 17410951 19006914 20990811 23565141 27126135 32101174 38917713 48458214
19321 48458214 61434792 78297754 98729230 121832938 146463810 171230468 194382388
19314 194382388 214282371 229334485 238013000 239570926 234222100 222646916 205885805
19307 205885805 185396451 163039183 140082718 117861593 97578421 80300268 66500323
19300 66500323 55872178 48064236 42161004 37450885 33584440 30451159 27809246 25456713
19292 25456713 23157256 20979375 19061312 17285083 15691908 14106350 12668976 11544190
19284 11544190 10624512 9709780 8832315 8076224 7514215 7055957 6522211 6085628 5582692
19275 5582692 5080817 4725660 4372260 4082228 3896548 3716314 3486106 3554022 3620302 3634475
19265 3634475 3691173 3809297 3686745 3464174 3238968 3210485 3103053 2944557 2854158 2763688
19255 2763688 2695626 2671940 2575457 2411160 2229631 2064056 2044173 1930692 1705856 1544141
19245 1544141 1415416 1341370 1384285 1371689 1320522 1370797 1385745 1398371 1478037 1456220 1406927
19234 1406927 1375022 1359550 1375145 1401194 1497931 1599969 1665205 1556309 1419564 1400772 1537831
19223 1537831 1673558 1752424 1633048 1598160 1562871 1574114 1464688 1392730 1457524 1621390
19213 1621390 1664748 1656599 1624870 1780347 1980870 2092912 2119947 2082170 1999267 1912844 1991206
19202 1991206 2033150 1996089 1856129 1724362 1699034 1602959 1395301 1287054 1213377 1213721 1035208
19191 1035208 957554 956827 983312 817859 785189 784940 774619 807418 749414 631318 722095 909496
19179 909496 962794 900718 817540 858981 874086 756682 649187 706751 728756 825973 928606
19168 928606 857192 749487 745841 767175 711916 708539 671040 682348 681734 742965 741726 732923
19156 732923 757511 749225 720509 760703 626093 630003 693766 736566 815797 712505 642412
19145 642412 651277 744555 799815 821551 775739 527317 685385 833921 818840 771645 663176
19134 663176 655232 650558 636895 661006 770943 757451 658396 622265 679176 710527 710180 739184
19122 739184 739250 711861 585649 530968 636495 727161 822825 834642 772659 695073 508385
19111 508385 536945 677796 726953 786237 845523 774726 729700 686699 656966 742934 847123
19100 847123 899453 753124 667532 737903 736445 625025 703721 793806 834801 870112 826094
19089 826094 849905 893040 1011916 1001763 945455 823849 649449 602969 656483 728904 808005
19078 808005 865264 786411 758851 815197 832680 780705 807676 829556 855157 950563 949127 1029789
19066 1029789 1106251 1054317 970191 958170 829258 824685 818207 911050 1008736 930667 1002001
19055 1002001 1162562 1305491 1408256 1333460 1291071 1381330 1346914 1334426 1464985 1491626
19045 1491626 1383203 1384060 1470170 1573563 1582232 1520013 1504317 1478050 1458101 1440192 1385159
19034 1385159 1283889 1233010 1291444 1444220 1595794 1630585 1637740 1658238 1600853 1541965 1466580
19023 1466580 1368996 1326030 1407047 1561184 1634322 1766087 1832008 1893315 1864179 1883800 1771665
19012 1771665 1718425 1746159 1793554 1679345 1606857 1647094 1742827 1856199 1983911 2039687 1957654
19001 1957654 2006739 2135979 2220426 2207000 2209125 2224705 2314627 2413788 2441604 2394561 2618195
18990 2618195 2918113 3028260 3163047 3322744 3427646 3486326 3622373 3698774 3796144 3947411
18980 3947411 4163216 4483486 4732403 4901594 5098900 5463184 5830751 6159278 6483341
18971 6483341 6981520 7551886 8053972 8721336 9516148 10199725 10911022 11835543 12842126
18962 12842126 13874966 15083238 16241356 17538868 19127842 21131940 23648265 26853687
18954 26853687 31138072 36743284 44159489 53739818 65049980 77879459 91995322 107204822
18946 107204822 123468867 140764304 158147476 174794753 190197584 203940458 216191732
18939 216191732 227399660 237168855 244826808 250300494 254131341 257163852 260220824 263518855
18931 263518855 265945622 266460473 264697063 259904517 252448560 243147922 231432751 217048436
18923 217048436 200401025 182339496 163445394 144630250 126646270 109732932 93920073
18916 93920073 79473484 66814866 56159951 47594993 40907148 35732944 31562205 28096340
18908 28096340 25124100 22471708 20236682 18225297 16367318 14664625 13241257 11967236
18900 11967236 10769079 9685765 8784061 8018349 7320967 6646063 6094086 5598863 5068238
18891 5068238 4580107 4158394 3930175 3709940 3481846 3328430 3303402 3165237 3000943 2919191
18881 2919191 2802619 2689050 2576515 2423747 2383016 2389265 2338960 2331913 2256847 2251011 2296162
18870 2296162 2182547 2116249 2079375 2084326 2054565 2037261 2171760 2155507 2100670 2200676 2125091
18859 2125091 2116588 2162308 2156464 2168060 2278094 2463363 2592309 2485406 2361736 2306823 2385897
18848 2385897 2249624 2033955 1964676 1959237 1989012 2244510 2380134 2337822 2319248 2466771
18838 2466771 2593720 2649178 2694882 2843067 3019690 3173737 3326336 3398064 3428342 3383331
18828 3383331 3236070 3046665 3035677 3119004 3136891 3187864 3296905 3459200 3635041 3878091
18818 3878091 4174281 4412325 4597719 4908870 5321404 5786111 6151963 6527601 7073587
18809 7073587 7600460 8232785 9005323 9669090 10379763 11148642 11826321 12435460 13018528
18800 13018528 13574525 14321439 15482746 17027589 18886147 21195834 24486393 29104044
18792 29104044 35691759 45016699 58262592 75599609 96426429 119974752 143332494
18785 143332494 162406715 174603052 177933925 172705763 161132712 146146649 132189987
18778 132189987 122963805 120049196 123710348 133021407 145605314 157349016 164666088 165342674
18770 165342674 158322765 144489969 126127062 106103140 87306654 71278540 58584458
18763 58584458 49211828 42275176 37009033 33065417 29789229 26838781 24356940 22328376
18755 22328376 20675316 19443570 18370667 17409824 16389066 15688543 15054167 14544293 14322870
18746 14322870 14344310 14531719 14874069 15511556 16504522 17835703 19657731 22206713 25700620
18737 25700620 30757971 38371795 49133848 63229780 80273016 99504057 118480667
18730 118480667 133968392 143694385 146180031 141494003 131457134 118788268 107257830
18723 107257830 99891325 97820195 101303244 109570922 120595393 130742866 137054909 137691326
18715 137691326 131591425 119838021 103999082 86492128 70102753 56197391 45092425
18708 45092425 36895893 30911180 26454861 23003280 20327042 18064348 16085181 14403953
18700 14403953 13015679 11668709 10413799 9205128 8105468 7115948 6359389 5753653
18692 5753653 5265494 4800563 4353447 4085333 3899289 3532558 3101535 2739148 2593986
18683 2593986 2420443 2343253 2192486 2011381 1813320 1609238 1532622 1515494 1513536 1498418
18673 1498418 1534435 1385144 1277282 1242354 1222939 1235246 1151869 1102630 873869 698343
18663 698343 652661 590959 480040 505253 550346 589567 721370 682940 742470 733920 759319
18652 759319 812093 781309 711874 625080 538654 544810 547812 505178 451148 356121 448558 528075
18640 528075 588945 567427 534746 571251 408886 331276 390734 393877 475443 472327 445811 349880
18628 349880 403741 536796 530815 563207 428928 323658 272332 321431 342661 260670 136448
18617 136448 204391 256111 251098 360034 479929 451790 415347 427722 483083 489143 484392 530424
18605 530424 629719 632320 731690 663054 679030 767268 954548 1123450 1137409 1145326 1150674 1100817
18593 1100817 1053142 1062647 1197733 1287816 1379571 1626979 1786455 1808500 1773604 1805521 1798199
18582 1798199 1743572 1681199 1543088 1382122 1159743 1130011 1156353 1009522 849813 914297
18572 914297 840264 759550 644011 483624 436502 406415 339802 328909 387218 431703 476316
18561 476316 600432 573630 585592 683003 823521 834009 895426 1031199 1093860 1155810 1187549
18550 1187549 1206229 1226037 1213973 1104754 986156 943218 893332 836365 881092 949474 978416
18539 978416 984879 946907 1013132 1114103 1152251 995753 745352 591356 561795 582798 591928
18528 591928 639866 578159 461532 366766 388286 482884 535753 422747 482531 583204 584534
18517 584534 480309 462708 454452 435832 542449 672474 640699 669175 608311 638536 605159
18506 605159 668371 713909 658616 529410 612727 731557 742382 890768 1011810 1063247 1129161
18495 1129161 1137093 1087249 948093 893495 886646 854274 862308 808225 871595 1099053 1131103
18484 1131103 1176816 1094854 1065698 956905 861009 697463 605464 644227 636653 581713 682886
18473 682886 718227 718462 653405 623924 518856 442098 367831 320429 336724 340690 376754 411665
18461 411665 399113 412661 398842 451141 389258 431998 543725 590725 558164 562882 547617
18450 547617 477794 511352 609751 666911 698949 729649 833889 977781 954167 950743 1088798
18439 1088798 1349664 1536698 1655799 1643148 1639985 1811745 1850083 1981463 1934132 1876488
18429 1876488 2030970 2157751 2065257 2025111 2021239 2043889 1967752 1899523 1859576 1856488 1844930
18418 1844930 1717267 1669883 1662831 1607426 1632109 1556503 1398063 1340952 1288319 1255238 1105328
18407 1105328 946146 844471 718617 669909 596573 659187 652451 696702 727986 763715 758630
18396 758630 617870 702319 760355 698215 692795 767923 762037 737060 911056 1119239 1133617
18385 1133617 1038170 967545 960186 942527 926403 927152 990191 1019418 1028915 1038992 937709 944740
18373 944740 1086588 1234681 1198233 1168607 1118049 1283748 1409084 1377454 1401367 1518093
18363 1518093 1617183 1663408 1957248 2000880 1940003 1980556 2025820 1997670 2077940 2319655 2351552
18352 2351552 2453196 2522657 2543308 2636184 2778922 2923186 3082697 3256603 3486396 3800291
18342 3800291 4160696 4529469 4779975 4931944 5178626 5598989 5915220 6211590 6504979
18333 6504979 6939737 7546575 8348088 9281290 10461844 11963153 13792766 16252775 19381883
18324 19381883 23562977 29337151 37673778 50039422 67897220 92564796 121857424
18317 121857424 149912669 169728238 176043124 167606112 146950165 120027936 93368452
18310 93368452 71972415 56866678 46948604 40294539 35818787 32799437 30649238 29365774
18302 29365774 28615746 28320106 28370728 29028003 30661350 33551447 38068825 45166685 56203544
18293 56203544 72754874 95639967 123289521 150234258 169295801 175270124 167041936
18286 167041936 146903915 120306159 93820768 72447724 57428768 47512773 40983400
18279 40983400 36724420 33906091 32116614 31015180 30540471 30615245 31464096 33308386 36473707
18270 36473707 41619148 49988051 63044095 82295143 107024714 133208446 154419987
18263 154419987 165117518 162370856 147186971 123975291 98594284 76128346 59288421
18256 59288421 47791871 40181928 35154526 31775876 29331410 27478610 26270418 25635151
18248 25635151 25444066 25798729 26798117 28818291 32082464 37304650 45477657 58167559
18240 58167559 76697548 100813003 126310867 147139245 157906056 155355590 140408687
18233 140408687 117532318 92413672 70093220 53471132 42143373 34695298 29563791
18226 29563791 25886193 23101410 20726313 18704879 16813643 15026894 13482323 12194310
18218 12194310 11058964 9968379 9086371 8425480 7933548 7493146 7089559 6525019 5959428
18209 5959428 5267425 4636635 4052791 3419435 2889803 2547202 2370609 2146836 2012088
18200 2012088 1977744 1846724 1711817 1601255 1502382 1449157 1514080 1534024 1374252 1322552
18190 1322552 1408855 1368348 1478679 1628180 1789870 1881189 1836097 1760524 1714766 1554483
18180 1554483 1402878 1254690 1277297 1173872 1087088 1180403 1145635 1105154 1082695 980760
18170 980760 850727 876913 985191 1104909 1100402 1003135 965485 888269 764211 683453 765199
18159 765199 826469 960551 1104399 1142525 1086417 984923 1111181 1191935 1279412 1279755 1151496
18148 1151496 991041 889962 931703 1012691 1139170 1341600 1410664 1419586 1410790 1340747 1268632
18137 1268632 1280106 1425085 1549960 1587849 1629454 1656348 1790859 1963126 2177127 2386237
18127 2386237 2564693 2731453 2930542 3132380 3285869 3481924 4002693 4497788 4994322
18118 4994322 5720649 6587038 7588764 9033952 10754846 13239733 16523193 21125092
18110 21125092 28148286 38570457 55166175 83429886 129763104 180731292 191236909
18103 191236909 164716697 139793378 104932003 68651884 44239289 29916289 21368598
18096 21368598 16134832 12715474 10183270 8276010 6958730 5901401 5160058 4610320
18088 4610320 4038005 3512222 3177316 2865306 2681157 2419767 2078987 1937098 1716825
18079 1716825 1560772 1414398 1148868 1068745 956921 894035 841410 780561 706312 734321
18069 734321 602174 452921 422652 455329 327441 433940 452472 348840 259557 235049
18059 235049 276351 334293 446309 397766 413688 466237 358616 354867 414921 518534 455368
18048 455368 408683 336073 288492 235763 243806 343434 442713 421182 330302 228780 187673
18037 187673 254342 339582 271040 237286 273394 198894 118198 111510 237735 249352 115941
18026 115941 36310 -7464 32196 86275 35372 -10777 5074 -12150 75702 154272 94783
18015 94783 31189 -48360 20963 46299 132655 89575 23522 62696 35592 136901 266502
18004 266502 239887 158311 93814 82650 -2555 17303 -82672 -149976 -103176 -36129 -22636
17993 -22636 -98493 -84345 5080 41499 40414 -52110 -127141 -107481 -134595 -200028 -60608 40632
17981 40632 -4153 -15893 -107767 -143255 -107838 22426 301521 351838 286402 259721 166782
17970 166782 60195 196633 214892 152140 82701 47481 -36965 -112847 -26514 -12551 43904
17959 43904 152324 139477 60300 60789 103354 76833 102737 112478 -113765 -189035 -32806 -46934
17947 -46934 -192258 -84895 -175801 -169143 -120373 -37123 -942 30930 66881 -28231 -127683
17936 -127683 -270150 -220636 -50379 15672 41403 36425 -13957 49319 157505 173414 182089
17925 182089 201524 149592 112368 176908 266950 214795 42328 -93247 -162011 -145771 -159122
17914 -159122 -76007 -34556 -90568 -122170 -95358 2072 21231 -23444 -62342 -127941 -82875
17903 -82875 -89127 -131778 -170151 -219659 -116861 -77539 -178733 -272959 -191799 -147589 -160518
17892 -160518 -233900 -211212 -169611 -23201 -12703 -133724 -217196 -243350 -210465 -242870 -77940
17881 -77940 -28039 -78851 -136187 -110238 -14890 -23677 -29831 39469 -21470 -57120 -21832 107060
17869 107060 126678 -55265 -278133 -271333 -202633 -116033 -192595 -73785 -158216 -275189 -206005
17858 -206005 -188743 -246677 -276241 -202925 -72790 -53699 -88466 -11288 32992 -4592 -43806
17847 -43806 -111355 -109546 -141522 -127255 -174204 -259334 -259239 -134467 -161705 -295821 -329003 -205024
17835 -205024 -229944 -163509 -26711 -13546 61907 77329 85720 29012 -12693 -27787 -5596
17824 -5596 18182 -44228 -41004 40833 30905 -65296 -146732 -215835 -174783 -169556 -147328 -168603
17812 -168603 -145765 -111132 -50374 -112959 -51773 912 61635 100025 128244 92072 54016
17801 54016 3657 23244 141931 108882 166789 400940 663225 747369 779028 741304 584755
17790 584755 480178 441807 339421 54373 42737 55224 116123 -11968 30936 186692
17780 186692 113365 18672 78330 120982 112964 242506 306399 285834 297081 254319 261822 381232
17768 381232 560403 689012 821276 908849 698754 421028 238313 181244 137138 73549
17758 73549 44855 120780 168330 48523 -2735 -38844 16401 29316 -40655 -211780 -190550
17747 -190550 -68562 59239 163904 148313 307558 550453 699538 686109 662980 591311
17737 591311 481829 343541 252208 162476 150228 181157 191808 20005 63343 117513 49344
17726 49344 25713 22076 -67494 -76973 -75556 -109999 -88571 94174 290770 475483 520941 536829
17714 536829 678810 647584 679864 581224 427530 235585 106058 -37349 41020 42109 -40838
17703 -40838 -140614 -170003 -145162 -98558 -162994 -125512 -121280 -144190 -147886 -79149 -58774 -84826
17691 -84826 -126421 4197 2638 49106 41417 -12515 -78367 -124445 -119286 -77295 -13863 -69498
17679 -69498 -160780 -116026 -75038 35708 142961 208559 212984 75922 89310 -62320 -189757
17668 -189757 -238629 -60151 -52826 -116573 -83279 -11578 9523 35712 4322 -20233 -57679
17657 -57679 -32118 -137457 -108567 -105524 -202994 -128178 -191301 -247899 -141620 51886 51816 65075
17645 65075 44338 -33702 90907 133968 54002 -20446 -111170 -87379 -72591 -120104 -233645
17634 -233645 -272874 -164359 -158547 -207715 -236463 -141628 -69361 24666 7726 -10884 22274
17623 22274 215713 308155 292600 198325 117401 85682 131216 94703 -12932 -31818 -35349
17612 -35349 -81255 -45542 31312 15020 -56739 -18047 -17510 -63921 -186727 -71665 76755
17601 76755 -1379 -99172 -213176 -207108 -128531 17490 173761 131871 45976 -68822 -69668
17590 -69668 37806 35949 -57527 -115736 -75122 -2323 55813 12414 -47935 -21317 -55526 -25305
17578 -25305 24804 68813 -33910 -213132 -146931 -58148 -103636 -120517 -102861 -37951 29237
17567 29237 58680 4941 -35312 -52902 -63504 -14163 109217 62949 -18661 -90172 -22671
17556 -22671 -70024 -7364 131511 190851 146608 70339 -53455 -73544 61817 61527 11740
17545 11740 -49157 44306 26123 -21108 80065 137667 95271 81920 134930 71231 26086
17534 26086 -21113 -92064 -134499 -121724 -23020 -7207 -55556 53101 -136008 -249878 -293399
17523 -293399 -300981 -356210 -256300 -136946 -75353 -6645 74513 92082 52837 30061 -3362
17512 -3362 -21494 -49573 -100154 -61719 -161833 -236416 -174546 -217733 -281465 -145244 47997
17501 47997 123733 67564 97957 46725 47012 37642 35048 -112364 -164877 -141824 -17531 16927
17489 16927 -57545 -126753 3727 101831 69397 81984 43220 60157 28490 47498 -40521
17478 -40521 -117274 -76798 -12052 -87262 -151570 -87085 -75571 -83289 26872 85242 -160004
17467 -160004 -131410 76000 31086 13508 98404 138085 89754 49622 108256 102255 106686 117058
17455 117058 170097 185150 5228 -54893 77148 54517 75131 154456 175396 197732 154121
17444 154121 103620 107782 71110 189016 408322 732325 969853 813857 746473 593250
17434 593250 375416 204279 182760 168924 144189 134805 144836 71827 146000 104732 -96098
17423 -96098 -95381 -97616 -98376 -20160 23084 42499 -8608 -169781 -140222 -169796 -254259 -195107
17411 -195107 -101342 -12445 61187 97322 -19640 -19606 -10680 -9785 -32384 -700 43451 30630
17399 30630 37135 24669 -41731 -162654 -193250 -49432 70518 -50069 -88937 -91034 -207118
17388 -207118 -217093 -105088 -126277 -185704 -155574 -59203 -64867 -99180 82 169738 290693
17377 290693 109948 -79543 -16282 120203 101982 61358 162859 173710 73113 17566
17367 17566 93920 129163 164289 137038 194664 192589 181819 136656 185538 165882 162367 96385
17355 96385 96511 133460 95085 1385 -12051 -2474 55858 22147 -65678 -53730 18933 96932
17343 96932 163076 260167 310583 260199 132354 121847 2931 -61906 -196124 -185128 -863
17332 -863 5055 21850 100192 156104 113911 60824 81717 104772 73671 15593 43228 25556
17320 25556 34130 4396 -46359 -13433 -69535 8381 116518 224852 243386 190006 162132
17309 162132 120448 71009 101601 64667 51258 74467 148468 237216 214826 120450 64304
17298 64304 -160 46999 9412 -88597 -4743 40484 -54240 -181941 -124138 -86420 30948
17287 30948 -1965 65608 100436 50513 -457 -178539 -99224 53822 93884 95888 -92601
17276 -92601 -16884 -8626 -150649 -128744 -17882 177090 140000 147970 172983 76574 -58579
17265 -58579 -98058 2143 76461 78528 124047 239555 133820 81244 28831 -81981 -149799
17254 -149799 -103573 -73750 -71414 55261 147682 164627 143546 194414 179155 -11136 69200
17243 69200 32046 84858 84208 139968 96901 64807 29044 33516 38154 -51986 -8817 89029
17231 89029 138808 116369 204130 264567 129698 63996 5520 -64721 -132402 -188584 -208051
17220 -208051 -198799 -98907 -18280 -69686 -75773 -131828 -139409 -25943 134593 119624 71155 28427
17208 28427 84213 101110 55259 88010 155030 81742 881 -28049 10948 -13045 -33496 73158
17196 73158 164583 169788 237333 192301 16227 74760 109868 121948 39196 34512 65000 103896
17184 103896 47773 -64641 -70969 -49763 46996 94557 -43174 -137861 -195884 -207117 -161008
17173 -161008 -140510 25297 72916 23609 -5728 3613 36272 21926 39615 48810 -39871 -6134
17161 -6134 90284 167304 76796 39503 42992 45715 95238 115846 28407 56131 110869 -6843
17149 -6843 -86303 -15830 46342 49835 -89662 -33187 100404 24531 -19654 18913 -52746 -83843
17137 -83843 -122692 -36596 18703 573 42373 -12289 -22375 30039 30263 -13846 17117 -32249
17125 -32249 -21749 49905 6607 -43122 -46390 30795 283274 391940 309275 132244 57032
17114 57032 71881 92617 63752 85053 139434 137548 138927 210931 143471 83018 66707 71466
17102 71466 -23273 -101980 -107538 -94440 -146487 -66985 13807 45153 33563 3075 5125 -2442
17090 -2442 -79074 1160 -79435 -107665 -23700 32887 11584 7903 -16050 -52464 -100680 -28753
17078 -28753 -23802 -11999 99405 55941 -72590 -88497 8845 121196 155407 55293 -78446
17067 -78446 -220825 -173615 -65286 -20199 2945 45547 98309 84619 123815 5519 -100024
17056 -100024 -110204 2547 26829 -49578 -103504 -187758 -220796 -200918 -136231 35625 101498
17045 101498 55568 31895 4617 -60464 -92148 -108559 -105420 -48169 11290 35726 72145 18886
17033 18886 70002 50350 -104003 -187371 -201126 -202146 -206978 -54439 -5007 -6761 -24802 2806
17021 2806 18654 44900 -60358 -51037 27961 133317 163912 7597 -197600 -157840 -18747
17010 -18747 5833 111850 108557 -31436 -77768 -147106 -144493 -92143 -6709 11812 20848 36959
16998 36959 109499 278148 310379 262962 160847 128019 118357 52782 15549 -35069 -125472
16987 -125472 -94447 38214 26889 -46188 -57681 2275 73418 91362 89956 23083 27539 118769
16975 118769 135931 107553 98145 144572 72256 -33999 95572 101494 19996 36860 74487
16964 74487 3069 -11596 -70523 -176795 -187232 -173514 -80845 34454 94636 130072 112164
16953 112164 97640 -38875 -34245 -197233 -261203 -272698 -184332 -50774 -131109 -206755 -189928
16942 -189928 -137967 -88167 -63818 5295 -8621 2737 -58322 -97273 -17516 30929 -54696
16931 -54696 -217446 -247807 -110701 10491 6948 24245 31859 25705 84776 28062 41480 122302
16919 122302 141102 65056 91620 79598 -40755 -163050 -134356 -101970 -82954 30453 -41237
16908 -41237 -23694 -92924 -126899 -47449 16002 -7793 91645 74045 41388 -112233 -42929
16897 -42929 21802 -2743 4844 -4097 -76948 -120506 -179609 -305180 -375821 -337593 -215944 -102689
16885 -102689 -44414 -21833 33670 -71304 -84769 -20311 94165 40079 -4907 17135 21948
16874 21948 -19762 -78401 -103312 -79986 -41891 23606 -8435 37581 9494 -38623 -31398 63605
16862 63605 73526 -10439 -145599 -181401 -200200 -141681 -191254 -227336 -222931 -199675 -215264 -176828
16850 -176828 -180175 -193035 -184576 -179586 -148184 -9833 14479 60396 58860 34295 28338 -99758
16838 -99758 -195199 -213953 -196637 -17962 46871 -27569 -100010 -22319 83476 -36391 -85849
16827 -85849 49522 37841 -43316 -107391 -101232 -142736 -133622 -64714 -76493 -109515 25598 135873
16815 135873 47108 -3443 9761 -83421 -114861 -72523 -199854 -108583 -81373 -112472 -44413
16804 -44413 -238139 -353368 -333574 -252961 -160223 -59582 -44571 13930 65974 143608 87380
16793 87380 -52708 -132510 -92853 -37389 -116347 -123915 -117626 -14543 -950 2586 42308 112713
16781 112713 170520 43694 -80156 -132668 -75775 -104689 -94654 -125154 -52320 23867 71966
16770 71966 121309 56233 -62844 -100515 21252 -20621 -143735 -75448 47669 -27847 -1739
16759 -1739 52389 -19030 -41248 -146809 -182519 -89782 -117305 -69181 46450 -8552 -7128 73219
16747 73219 67623 6073 50418 151201 102854 84327 -4062 16306 51064 106202 86571 -57055
16735 -57055 -139534 -7271 149553 123301 -15790 -47202 -93892 -59517 41796 101999 149434
16724 149434 103121 55229 -66877 -241388 -71074 26539 -44167 -65565 -15078 -30380 -139834
16713 -139834 -122457 -63617 -96843 -4159 66356 152807 110366 87671 56303 73531 184668
16702 184668 72251 -105027 -120924 11320 98567 11473 -63466 -98317 -68840 -137977 -174839
16691 -174839 -184649 -201425 -206350 -146783 -78824 -30609 -29194 2023 -79446 57695 149561 112509
16679 112509 -37606 -116979 -148198 -88624 -220738 -238119 -83225 46083 135945 110463 -49501
16668 -49501 -131943 -173358 -227225 -217678 -161796 -188907 -193538 -79912 -85525 -237550 -294820 -226570
16656 -226570 -108506 -63053 -65601 -28012 35142 67244 -81202 -79354 -77274 -36342 -78515 -36502
16644 -36502 -17671 32161 25299 -79724 -151773 -31219 31924 169158 187537 131861 154681
16633 154681 247478 59966 -96498 -36800 -88347 -88217 -48624 -139267 -140585 -212130 -54886
16622 -54886 76673 154358 -22504 -118672 12452 75103 123334 217854 204432 55484 -79191
16611 -79191 -108594 -68911 -207413 -286777 -218645 -153435 -95303 -14101 47073 -14160 1730
16600 1730 -26461 -35199 -55237 10040 128284 109221 120520 -55602 -224330 -257128 -139058
16589 -139058 -47438 -95190 -18219 -2393 -73367 -174335 -132594 -127496 -159934 -140015 -200831
16578 -200831 -291712 -328354 -295234 -207976 -330015 -428670 -316674 -237147 -233395 -189732 -113982
16567 -113982 -29959 20518 17781 30551 -9415 61288 30908 -18192 66064 118716 103500 193450
16555 193450 168140 72575 16305 -35554 -139420 -176191 -185997 -201255 -233973 -175815 -70437
16544 -70437 -81069 -72200 24339 15033 -32427 -137368 -195242 -175633 -216691 -223875 -135320 -91541
16532 -91541 -30320 -17386 -131086 -178317 -169374 -119568 -83916 -108561 -109653 -73404 27102 35734
16520 35734 46524 -79703 -107590 -55009 -67951 -64809 -7589 77195 102725 -5025 -41019
16509 -41019 172735 185446 20806 -52794 -93377 -57915 -142660 -98520 9764 43191 69665
16498 69665 43743 8876 39973 7780 -64835 -203742 -221382 -155499 -46283 37600 19639
16487 19639 -154639 -193514 -116491 -71376 -82574 -42010 22472 43175 -67335 -66339 -155778 -81493
16475 -81493 58228 97335 -40601 -171051 -156068 -167137 -77754 -19556 -68752 -205041 -132856
16464 -132856 -201650 -82859 -44171 -103948 -61516 25362 -99281 -198055 -134606 -114516 -47391
16453 -47391 659 58267 60245 85463 84602 -54488 -99755 -33933 -58125 9355 121074 36126
16441 36126 51266 -31547 -51839 -67777 -70554 -128242 -49536 141550 99193 -71796 -136622
16430 -136622 -125908 -114518 -84206 -125689 -39473 -64215 -181773 -135822 -87608 -156161 -161086
16419 -161086 -68276 -57271 -135485 -165865 -104497 -7285 82304 18811 -54334 -42806 -100087
16408 -100087 -201615 -214757 -152477 -3687 77499 -94024 -147480 -48328 -17300 -71574 -142377
16397 -142377 -240373 -295685 -250006 -64586 -13919 57495 33393 178138 279097 295119 168159
16386 168159 132992 75755 78304 -6817 -28403 -123848 -169744 -161636 -117622 34620 141269
16375 141269 86647 58321 49133 45843 -36818 -67176 -1838 40384 78648 64370 177082 242609
16363 242609 156394 77237 23142 244734 277328 241399 174351 41925 14675 -1890 -11465
16352 -11465 12655 -51506 -79744 -77903 -23106 59812 51137 -10829 -68722 -75695 78812 55788
16340 55788 -340 -5422 -83565 -78658 -42916 34023 -8367 -48028 1946 -36050 18365 11637
16328 11637 -40735 -49985 -110834 -79318 74176 24198 -26848 48895 15204 20403 9938 -3686
16316 -3686 -656 27025 20602 19105 2329 35958 6252 19660 -28516 -33819 -15290 -79456 -207227
16303 -207227 -267955 -204525 -64980 -105870 -58179 -21571 -126425 -98308 -96163 -8763 -26147
16292 -26147 -175670 -104414 73897 48189 4658 2287 -19611 -47115 -93570 -115913 -211690
16281 -211690 -234810 -255278 -318631 -281687 -102458 -5430 79061 43887 35353 -8254 -50291
16270 -50291 4135 -61767 -111015 -139397 -39936 -25434 -107407 -171375 -249844 -273170 -259618 -210649
16258 -210649 -219483 -65722 125448 97447 -8500 -121548 -171627 -134614 -97783 -73634 -80773
16247 -80773 -111051 -78287 -81249 -59706 -105552 -123385 -32993 -47081 -121986 -60160 -14462 16417
16235 16417 -52863 -184338 -182353 -166881 -149073 -1673 85540 77264 53810 24257 -18807 -29225
16223 -29225 1663 46851 77030 54860 76638 29198 -110556 -98386 -66524 -72210 -110549 -145216
16211 -145216 -92038 -93336 -64721 -137942 -222386 -240404 -175625 -123762 -16042 -168820 -269713
16200 -269713 -254808 -243312 -228225 -238232 -101027 -5295 -6729 -48598 -120269 -78554 -85254 -259201
16188 -259201 -296519 -259731 -302847 -213121 -133379 -23766 26984 105125 -11655 -82433 -59303
16177 -59303 -115800 -99890 -72611 -85781 -196809 -210045 -158351 -77958 -29152 -23226 -29581 -123807
16165 -123807 -238885 -204685 -116999 -130032 -191261 -162981 -61056 48486 61353 -24095 -99890
16154 -99890 -111226 -106334 -88816 -78309 -222957 -237138 -231678 -220186 -237361 -112219 -22012 17987
16142 17987 23917 48891 -1587 -112840 -45173 37334 -46124 -93487 -154400 -100456 -14973 -22688
16130 -22688 -26541 9636 59747 98922 50704 21528 -11971 50154 56187 64142 86564 -9464
16118 -9464 -96262 -154368 -90345 -108841 -94731 -46522 -28250 -41575 -71356 31331 124289 72943
16106 72943 100493 99258 -9352 -185564 -252997 -196432 -138506 -25883 -102436 -170187 -92676
16095 -92676 8783 39004 -43378 -82307 -12317 104647 96855 110294 -26386 3513 60767
16084 60767 49394 34879 65901 124585 68769 -40835 82168 99967 52370 -9237 -90767
16073 -90767 -181173 -176218 -134344 -104065 -80955 -37161 60595 49015 102647 6508 -111469 -228619
16061 -228619 -202667 -144058 -70467 2399 83956 52764 -20101 14181 106812 120476 91464
16050 91464 41438 61210 63083 92887 105700 10874 -31219 67926 143380 169605 74724 49733
16038 49733 116244 173320 206512 167710 77708 -29324 -40706 -138806 -139306 -76459 -16097 -71778
16026 -71778 -155185 -91237 2652 -78111 24244 35396 101182 148715 123786 82041 71731
16015 71731 69715 35531 -17051 -111752 -146210 -125048 -66946 -36445 -20552 -13857 -111357 -146677
16003 -146677 -136906 -185237 -168214 -105324 -48334 -146834 -37596 29363 -176978 -128964 30782
15992 30782 28339 29595 -66501 -165857 -203370 -235835 -191726 -163650 -228539 -145275 -161027 -155073
15980 -155073 -126848 -90394 -116380 -111731 3418 120600 161153 203099 181623 127259 58343
15969 58343 -42829 -96023 -52567 17715 -32365 -127578 -55881 -81861 -133808 -69095 -111535
15958 -111535 -139329 -93534 29600 96752 85648 102525 189961 102648 -35488 -61196 -160240
15947 -160240 -181279 -232710 -193335 -258022 -259830 -170130 -92927 32666 134439 23634 6342
15936 6342 4268 -133934 -177597 -141072 -85532 -245945 -268109 -87141 -52907 -102124 8403
15925 8403 53361 41077 33926 -44466 -117902 -248721 -258373 -266762 -199363 -108242 -157198 -65307
15913 -65307 -2792 -44330 -102012 -153916 -182751 -204039 -192601 -164589 -82215 -7349 34563 209196
15901 209196 222198 152950 143624 -35229 -89285 -881 -38363 7196 28609 6014 89333
15890 89333 3358 -43231 -170753 -265680 -237067 -191795 -132649 -65031 -124572 -206150 -102992
15879 -102992 -9614 -41041 -70675 -100508 -31255 -50213 -351 -20881 -27224 80616 -3587
15868 -3587 54110 97792 142262 88872 2479 -63128 -134091 -47893 52472 22149 26965 -10545
15856 -10545 -101409 -264892 -228264 -80655 -29981 29687 371 -26626 -50841 -175649 -160055
15845 -160055 -92446 -5549 49316 30523 -78861 -124450 -110766 -50541 -37931 -98978 -171395
15834 -171395 -158698 -113342 -106520 -61582 30246 105089 14209 28796 55700 59175 92781 50988
15822 50988 56805 119125 22051 4962 -93533 -146072 -92497 -102931 96683 123952 20491
15811 20491 -477 18550 57529 113610 172687 119052 6361 -120394 -17795 55284 154249
15800 154249 187301 66610 5983 -96113 -94813 -105740 -119743 -172064 -164731 -109023 -72381
15789 -72381 25792 100987 -1817 -57571 56807 137452 2349 -100466 -111458 -151009 -191651
15778 -191651 -74074 -52637 -46528 6617 3524 67205 76747 118169 120176 99118 6242 13504
15766 13504 39877 51974 99839 198488 236310 109549 92637 98821 150377 239688 55524
15755 55524 12838 54647 65247 11384 24679 -3868 -30972 -65771 -79376 -6982 102828
15744 102828 4509 -33343 -71638 -130550 -157811 -11923 12728 21708 -5350 -121245 -88238
15733 -88238 68417 52762 35218 107507 92757 48690 65859 -5946 117375 154398 49296
15722 49296 22285 -43039 -111284 858 -40429 -130578 -6612 72357 127905 66038 53784
15711 53784 101818 148508 150846 183904 113929 -56983 -143267 -78118 -25115 -41574 -88587 -114794
15699 -114794 -143856 -103383 -78357 -96481 -70001 -71090 34421 101806 149051 148578 138829 163987
15687 163987 29180 -51121 13105 131723 77678 -16668 42193 126806 116889 11609 -185790
15676 -185790 -203415 -100379 -75368 17888 64054 37056 -7936 -27954 -44466 44817 -45219
15665 -45219 -129340 -193891 -103899 -174186 -264643 -318539 -353625 -284426 -240532 -283340 -188515 -104956
15653 -104956 -30042 28134 108104 58408 18264 -16573 -39188 -68311 -27263 -47416 -149450
15642 -149450 -233231 -135126 -88162 -13301 11976 -25352 -82911 -85332 -564 115131 228720
15631 228720 272120 202476 131204 6859 -7244 56053 29479 -41520 -12203 2306 98945
15620 98945 153562 174872 39942 -29363 37560 8274 39532 160733 149721 39021 -74893
15609 -74893 -119603 -149997 -60143 -58684 -48540 -24947 -47708 35750 131242 83106 -35475 -30506
15597 -30506 -50940 -70395 -97362 -100221 -152459 -203649 -81067 -6054 80197 67773 190 -17888
15585 -17888 -35866 -91985 -27870 14167 80651 141924 58595 -45449 -125753 -135013 -127823 -156684
15573 -156684 -199508 -225392 -153681 -98466 -57607 -82472 -85660 -46920 41661 45078 -140121 -123486
15561 -123486 -106647 91357 181899 90173 -89381 -103799 -4064 116123 134358 83751 -66521
15550 -66521 -190591 -263694 -217260 -103224 -14904 48534 20376 67375 3157 27027 57872
15539 57872 -8625 15350 108919 120198 28554 40044 -13421 570 -3487 6313 -65686 -56903
15527 -56903 143745 115410 -473 -62784 -3850 99667 79309 79322 22606 4823 53351 69337
15515 69337 63684 103562 167861 232145 190396 196290 90756 53 -92267 26425 90786 122705
15503 122705 120266 73538 106430 129346 111071 40593 2707 -44297 -75712 -49128 -46472 -43454
15491 -43454 -18012 11312 38593 82386 159838 152012 164659 157560 65175 42566 59001 26319
15479 26319 14284 -124860 -208230 -15894 18745 141356 83157 879 59060 90977 102488
15468 102488 136331 103434 60756 50789 84965 203697 244731 190071 7302 4814 38322
15457 38322 -54042 -161798 -224955 -230572 -254744 -256611 -176281 -80366 -27053 -30600 -16205 34340
15445 34340 55563 14423 -9690 22768 14876 15613 -61168 -106518 -67649 60343 87349 18271
15433 18271 9115 58855 66225 6867 -21883 -32811 66986 87263 -69379 -41227 17242 -16574
15421 -16574 -8998 92598 113681 39432 -28135 78063 -26453 -188273 -189547 -164580 -145003
15410 -145003 -105319 -28802 30743 46784 57906 93007 197974 148354 74293 -72515 -168211
15399 -168211 -108398 -36361 -73423 -46931 -6556 18201 75408 135991 136123 67522 39291 -34318
15387 -34318 -31928 -30815 -73252 -144884 -242774 -198467 -108589 13961 149497 214281 142333 76152
15375 76152 -27575 -12733 -41035 -46828 -88514 -10903 147343 153772 88020 72717 179161
15364 179161 84977 33521 26258 85046 158680 137398 119984 66381 90485 195149 201635 179074
15352 179074 232870 234886 65090 133402 300941 197862 53945 -49137 -74980 -76887 89031
15341 89031 241017 211378 119575 -57677 -78140 -1981 -28568 -136324 -157923 -234495 -122703
15330 -122703 -96758 -188792 -148831 -45 -41019 -84658 49901 80079 -26900 -32858 -23730
15319 -23730 -4182 75855 60704 -1812 21745 -53934 -125997 -142040 -87983 -4770 9078 28204
15307 28204 139156 38672 -38261 -12503 93817 138387 220929 105452 87529 92083 -60594
15296 -60594 -70547 -27980 -15423 -26971 -10462 47907 78140 109448 80428 16361 78697 161618
15284 161618 91086 143375 263597 304298 283920 208599 51317 -118031 -39325 -60542 -153358
15273 -153358 -273011 -181356 -75888 -176120 -223974 -44172 113602 91101 40824 15613
15263 15613 -35497 10643 140446 109450 54928 171410 132603 87124 122971 129126 23921
15252 23921 -92410 -85421 -52343 -103101 45898 236265 186054 188003 213192 102787 8692
15241 8692 -16340 -43878 -153613 -52445 47920 89584 268937 174799 123574 208188 192889
15230 192889 -28355 -146450 -95100 21044 96089 86746 29736 33169 8072 -6362 63431
15219 63431 3857 16837 106776 245230 237732 116773 35450 -55027 -117859 -25252 -60581
15208 -60581 -65420 -16050 -61467 34587 158234 212594 251193 158076 122713 81475 144180 215284
15196 215284 201564 164612 49818 68708 154462 193954 305625 325383 192242 123616 73444
15185 73444 144159 55025 80373 82570 64724 55001 18745 23073 15804 -8051 29854 39176 -5669
15172 -5669 -99098 -141002 -9065 284072 260314 235451 253223 337385 404349 303115 180904
15161 180904 78891 49615 73482 -3352 67223 116530 173837 216727 136963 216695 195374
15150 195374 162790 154088 66920 73552 60995 40559 58888 110263 164894 187328 156557 101842
15138 101842 17700 2545 -9852 13270 149632 206125 249398 210620 200618 122677 125281
15127 125281 119832 181085 218505 122444 118607 125388 180128 220925 246406 206434 160785 161933
15115 161933 83506 160015 223282 209075 169304 144481 7471 42994 177403 149935 49137
15104 49137 57153 110742 218918 132691 232255 165272 59797 164101 137493 98773 75001
15093 75001 172037 205588 88383 -65709 -78067 -79072 -9278 41057 168708 153682 91365
15082 91365 60655 -12404 16971 -22354 42034 72464 14179 20378 14375 82454 154900 134707
15070 134707 100159 137764 157860 31135 -104160 -53631 -37037 38682 46797 103868 207261
15059 207261 198913 334558 360859 235791 182152 218283 223361 222136 195659 282776 324838 206504
15047 206504 177231 171137 245075 116173 40606 90222 126998 144030 65112 173665 200678
15036 200678 40349 109635 215011 223207 141753 134967 189165 303413 267115 146092 204712
15025 204712 172023 128989 148905 147801 185620 197146 116110 54719 84828 152781 116200 235588
15013 235588 229335 197104 119656 29928 109454 169558 125375 245774 295112 258599 250019 314132
15001 314132 386652 285352 195977 104462 80800 10117 151606 56441 27051 139681 261529
14990 261529 312672 252590 131787 -14332 -75703 -52779 -2718 106711 214347 273387 244967
14979 244967 345862 338856 328902 142493 64671 74640 188034 287814 180578 173491 132334
14968 132334 155728 225559 289696 360040 314532 272427 254481 325738 341099 342954 414763 417082
14956 417082 342345 302668 222956 161687 164251 205417 268217 302660 270173 318936 397708 437182
14944 437182 352438 311912 225136 196455 204838 155614 219956 126371 45198 55210 100469 204178
14932 204178 124647 160907 162516 186250 173656 140054 29352 26334 130554 109091 109541 177605
14920 177605 106537 222200 252731 173052 118819 46286 73758 59273 -10191 31091 221155
14909 221155 335738 307363 279091 301311 306525 396681 269862 52257 7578 86945 214615
14898 214615 296541 153337 108844 197232 301310 292155 272791 232993 358874 336564 310183
14887 310183 286830 302310 280538 200076 103413 95123 150391 173565 138875 111649 51430 172344
14875 172344 301174 325525 292315 219660 162537 175538 227907 155408 120578 149752 262347
14864 262347 292969 233027 118753 169673 227976 185613 185317 308056 391813 287025 308493
14853 308493 261664 381345 421869 442296 505235 596221 645899 581920 467433 428875 452096
14842 452096 456771 433776 380488 262687 246582 256460 281887 430425 464089 448517 510046
14831 510046 555546 524704 484613 585487 734196 803970 854439 895360 1152915 1225618 1314580
14820 1314580 1279830 1379245 1665263 1740062 1688924 1868960 2091313 2268568 2500527 2867081
14810 2867081 2996725 3049116 2937636 2867338 2868800 2757063 2679400 2602885 2533405 2392205 2326129
14799 2326129 2220446 2072177 1868870 1628158 1541494 1415828 1277290 1226343 1105144 1089405
14789 1089405 931294 824592 798194 842847 919407 890533 736387 509037 575162 601325
14779 601325 556967 578717 608937 615372 531576 552255 583421 442767 363121 433686 602048
14768 602048 540983 546507 358196 239963 349848 464482 528469 506276 453022 426904 370449
14757 370449 276341 283242 347048 299135 322744 385633 408317 403261 452143 528521 551126 601892
14745 601892 406398 264729 176251 96376 166299 301022 354728 366378 336942 420938 412708
14734 412708 331246 280842 267943 315741 316222 304382 482551 513102 549675 490011 422307 364517
14722 364517 401576 432434 492772 576732 501463 336449 331880 313307 189772 164033 260556
14711 260556 353747 270555 234474 256211 292874 274653 358590 397748 287699 416191 404313
14700 404313 469386 515777 354910 324505 225148 215500 284321 247697 219856 206039 294259
14689 294259 297763 229701 302862 314437 257173 203815 193116 262209 230632 226367 258279 306931
14677 306931 391985 378796 421952 374360 235470 262073 514656 536270 528174 572198 606843
14666 606843 541369 527968 513185 623000 552276 542510 575781 493027 532909 574099 500927
14655 500927 481651 602718 699876 636486 566095 495635 420058 268120 289073 307921 375811
14644 375811 518522 614425 582638 544478 623817 693076 705079 701162 761133 706582 663440
14633 663440 624750 734442 802163 845463 868848 699525 558551 475175 444525 571645 683769
14622 683769 842631 991889 1152784 1056963 998185 950703 858057 780600 713042 671045 768340
14611 768340 866960 891554 774937 869099 869923 732574 665968 630370 766986 847989 719935
14600 719935 766212 817885 723881 781576 833080 946936 944897 902457 822288 734441 727834 692819
14588 692819 766496 784821 750744 708844 767142 852198 848682 818721 728273 709013 706701 544065
14576 544065 461446 595282 652148 609643 611007 599635 625772 723210 770077 835962 728585
14565 728585 874162 944582 897625 790162 827044 832243 837392 884754 919199 950278 893102
14554 893102 891166 976674 937968 899754 868528 869181 816315 795489 829177 788343 757254 874826
14542 874826 1021895 1091874 936982 892875 903282 852797 873925 927646 1003366 1045053 1080097
14531 1080097 1086016 1120554 1183919 1147120 1109010 1151406 1317778 1385939 1305062 1298365 1301146 1286816
14519 1286816 1275555 1230023 1213162 1227288 1274494 1233215 1288986 1229512 1093775 1067174 1274493
14508 1274493 1394696 1359760 1259000 1179991 1166166 1266377 1295751 1286213 1291241 1271338 1289404
14497 1289404 1360258 1484622 1567683 1618962 1689666 1754119 1773149 1826390 1876109 2033444 2103967
14486 2103967 2207706 2355005 2472005 2440839 2383496 2491034 2506779 2519548 2501497 2618689
14476 2618689 2720407 2762372 2811758 2850130 2818988 2736922 2654633 2644367 2684379 2661616 2626405
14465 2626405 2637171 2729567 2837760 2978568 3039138 3041806 3066168 3189690 3242389 3415557 3413153
14454 3413153 3405844 3523199 3616057 3737113 3737736 3712930 3801960 3930251 3937197 4055328 4240071
14443 4240071 4438067 4595779 4578348 4630924 4813274 5000359 5098902 5116267 5211599 5423637
14433 5423637 5541870 5660147 5924031 6240944 6477028 6690729 6934121 7242010 7520981
14424 7520981 7724159 8059405 8370058 8639601 8973993 9330003 9797607 10240982 10872503
14415 10872503 11364653 11723388 12162779 12649442 13127277 13688915 14333832 15160747 15890079
14406 15890079 16679034 17535279 18553435 19596794 20633109 21767031 22928164 24328768
14398 24328768 25778655 27244521 28805191 30442116 32399154 34614846 37049832 39578299
14390 39578299 42214282 45214598 48554946 52185371 56262373 60878428 65944374 71473324
14382 71473324 77908629 85155099 93233551 102251426 112569875 124196541 137305227 152167108
14374 152167108 169144444 188222759 209639827 233729148 260411568 289618745 320920112
14367 320920112 353656939 386973129 419833028 450833127 478609063 501958561 519890952
14360 519890952 531490457 536254605 534030290 525033622 509603189 488437358 462525452
14353 462525452 432883012 401033686 368224505 335588800 304134876 274561172 247358701
14346 247358701 222380720 199818282 179598982 161663915 145583142 131236671 118514343
14339 118514343 107165253 97165017 88329147 80281035 73060711 66617377 60933368 55812431
14331 55812431 51177073 46994345 43400496 40012884 36994270 34254922 31738623 29505842
14323 29505842 27402798 25471578 23908252 22530444 21350152 20144240 18933253 17782468
14315 17782468 16722738 15775812 14867966 14103380 13423917 12808985 12216514 11566012 10882105
14306 10882105 10239907 9694451 9229225 8807994 8503792 8112163 7803779 7486739 7116783
14297 7116783 6825664 6576036 6394640 6121439 5794880 5555142 5304648 5047516 4936354
14288 4936354 4799548 4641827 4499409 4192904 3995643 3934975 3833439 3733962 3592562 3476610
14278 3476610 3403423 3359126 3231381 2993907 2847789 2889946 2775257 2545155 2534946 2501574
14268 2501574 2446840 2375940 2235597 2222103 2140559 2067583 1915162 1834240 1662034 1437790
14258 1437790 1373414 1425608 1417886 1403440 1275103 1140243 1087905 1031573 988949 949143 967148
14247 967148 1028732 1048605 1054897 1029156 1036769 976270 814048 669891 540964 591841 542727
14236 542727 611778 639631 678247 673283 665033 475268 377715 417462 591956 678563 677617 827696
14224 827696 797373 748950 778732 871929 975041 917081 817619 810648 865332 840302 772970
14213 772970 677474 594007 587531 659175 684811 579767 519686 451900 270659 332964 417242
14202 417242 501257 476563 490967 613093 598704 539640 517856 429243 329874 345571 399033
14191 399033 476298 425197 362580 302959 360520 358127 327195 458284 473410 326765 294139
14180 294139 326433 409140 363742 205083 169174 168837 165886 223396 303416 376839 323879 242416
14168 242416 291904 422762 436095 326532 172146 38334 -77791 -21213 92569 137987
14158 137987 143736 77831 73146 109493 161832 266882 340982 330799 228727 159314 233507
14147 233507 153394 195942 161901 -87940 -80809 21521 -7097 79368 127394 43931 119860
14136 119860 117119 8235 15792 98585 192269 241318 59938 -58111 -85283 -56742 -165842
14125 -165842 -196203 -108201 -62737 -137636 -97507 -117178 -105723 36934 -21762 -116486 -177132
14114 -177132 -171956 -25462 -68927 -159464 -163265 -18236 92661 131363 11508 -60414 -67744
14103 -67744 -138823 -135589 -72432 -16683 -45836 54811 54394 6750 -90988 -99351 -74224 -112237
14091 -112237 -189845 -279834 -218039 -82885 -22157 -111221 -142825 -127846 35055 68480 49014
14080 49014 70066 -79643 -135167 -49274 18330 110150 98482 118744 61414 39197 14599
14069 14599 -20602 -66111 -121861 -119022 -112384 -50485 -4861 177653 209742 96052 -7522
14058 -7522 114294 209215 225834 107418 22089 -95209 -154130 -85237 -77195 -58506 -987
14047 -987 -111126 -162695 -94950 -110229 -152951 -125909 -80877 -101961 -128485 -196223 -107371 -156555
14035 -156555 -258943 -139393 -23169 -41330 -23688 -36758 -119472 -141765 -153799 -111193 -82378
14024 -82378 -144145 -155700 -94179 47285 -9079 -32680 13773 22278 -32575 -132347 -170217 -171796
14012 -171796 -120938 -24903 -87125 -103443 -81689 -61428 13317 132338 129792 179958 180496 146628
14000 146628 42306 -24514 -27075 -49743 -81891 -25558 12169 117501 -56093 -82473 12165
13989 12165 3322 39594 71044 13580 -80750 -65849 -26067 26299 46065 -23848 -84983 -47656
13977 -47656 -70773 -48042 -23468 64566 9643 -46175 -106984 -107553 -82864 -78739 -212474 -274810
13965 -274810 -222012 -94668 -4616 -9680 -57047 -80265 -92465 17812 125932 9054 28677
13954 28677 102751 87305 87097 -638 -54028 -101403 -84696 -45403 31702 19785 95784 206428
13942 206428 165989 97708 117718 199428 164841 252910 344246 308776 210480 295955 391789
13931 391789 438536 448133 382317 344343 339102 460006 532275 643844 682774 797683 955467
13920 955467 937756 904643 987709 1098417 1148153 1321003 1493759 1631782 1849578 2190508
13910 2190508 2352645 2523769 2649460 2637847 2696015 2757171 2777386 2649034 2576691 2570614 2379643
13899 2379643 2234581 2082284 1917112 1696499 1572745 1449643 1429054 1315960 1071243 961231
13889 961231 760438 541171 550634 513283 579668 572621 584145 547759 507486 493695 437204
13878 437204 367975 391466 236265 134355 151587 97263 113689 134536 154804 110965 161386
13867 161386 189540 154111 33051 51450 320535 388882 274805 170573 109274 41125 26843
13856 26843 145040 119090 72413 -3014 -65028 -57617 -48986 -45597 92781 139649 82003 90623
13844 90623 100674 -28760 -60471 -135982 -187668 -168813 -191734 -103662 89801 70740 87913
13833 87913 79799 51322 100682 158865 29300 -35051 83927 166084 104746 104958 42699 10431
13821 10431 -39953 -12874 37100 51037 -6959 34732 -48312 -19480 62836 73025 50477 41811
13809 41811 31368 -51998 -127053 -122404 -90079 -132617 -238407 -241408 -222765 -111271 -20338 -32580
13797 -32580 -194101 -199545 -197220 -275922 -326375 -307018 -276845 -205011 -148595 -149083 -22852 20753
13785 20753 90414 178880 152075 51385 -69380 15382 11747 -169205 -193166 -186396 -247684
13774 -247684 -272032 -93661 -15362 -10430 42638 79147 -15163 -194687 -228698 -157906 -161096
13763 -161096 -137611 -150126 -216902 -77484 -99300 -195014 -280697 -180118 -4401 -4493 -30898
13752 -30898 -56361 157583 189543 72301 -33887 -79042 -67312 -56990 -166931 -197386 -247021
13741 -247021 -169760 -108628 -39238 -57558 -15210 31020 41244 -36859 -192542 -170961 -61969
13730 -61969 -71054 -173790 -162674 -159777 -157536 -84858 -4215 46257 -58634 -103139 -37011 -55264
13718 -55264 -27823 29538 -35320 -203919 -308773 -215524 -36589 64852 -51063 -30496 -51317
13707 -51317 48358 51363 7670 -21112 -204333 -227246 -130608 -63322 312 24407 44996 5928
13695 5928 -197841 -270330 -209755 -189484 -69729 40843 2633 -123848 -97557 -51818 -12125
13684 -12125 -68987 -41733 -104370 -120754 -114616 -172922 -188149 -211346 -209238 -232518 -136350 -31750
13672 -31750 -73559 -143428 -154177 -43896 -60598 -172434 -86639 -93305 -124147 -93356 -58131
13661 -58131 -33187 -56440 -84173 -99281 -61239 80827 73636 52074 -46802 -113578 -205441 -159270
13649 -159270 -115352 -11013 -25315 -231811 -207699 -281595 -168356 -100594 -146792 -128241 -49553
13638 -49553 -39181 -14483 74694 20310 -105160 -248764 -201973 -181024 -111610 -136451 -151665
13627 -151665 -178741 -252251 -246659 -176626 -107428 -90391 -110077 -47695 -3442 -7665 -36693 -1137
13615 -1137 118790 113088 93534 43618 -95991 -287804 -256333 -96734 5231 -53709 -48557
13604 -48557 -151318 -221450 -190162 -205009 -264954 -184844 -113409 -267425 -345709 -265934 -260624
13593 -260624 -293929 -280590 -164806 -167227 -279386 -272649 -227178 -145044 8708 13066 -1805
13582 -1805 35249 68478 72926 57945 35906 32910 -20606 -71027 -61019 107189 157967 83591
13570 83591 52924 -48891 -238701 -260383 -300770 -230393 -130603 -75791 -84080 -177833 -367743
13559 -367743 -399249 -252470 -202234 -226833 -156974 9896 88670 51899 43099 52810 49536 110830
13547 110830 133544 109948 85247 96108 140980 66324 -110514 -97999 -100796 13533 13292 -110863
13535 -110863 -259819 -112194 -27241 -52754 -52776 -25568 28729 -84184 -160345 -147210 -122041
13524 -122041 -8158 -111111 -121822 -160731 -212692 -267341 -247063 -274811 -197853 -156089 -88805
13513 -88805 -37028 -128587 -208841 -221310 -170492 -111452 -172124 -179751 -170721 -259366 -212967 -175821
13501 -175821 -158235 -66412 89186 41563 -114028 -272304 -204616 -103722 -141727 -245124
13491 -245124 -365587 -280058 -120535 -81373 -145974 -136386 -164797 -153470 -81112 467 -13384
13480 -13384 -116121 -118387 -226001 -317091 -228567 -30563 12433 29409 37282 34895 71894 112604
13468 112604 101284 28857 -41575 -62371 32829 79427 -37358 -69575 -134147 -249198 -228986
13457 -228986 -99822 -108234 -71358 -69372 -85637 -43473 -62454 -81611 -23737 -35714 -99114 -86267
13445 -86267 -72263 -68778 -124012 -108093 -84444 -136648 -237478 -155471 -186743 -219236 -113752
13434 -113752 62442 161072 79506 -31699 84386 89818 141711 202919 230017 127618 79118
13423 79118 164626 227298 131329 -47324 -139886 -57754 -50411 -42176 -78518 -15013 -63330 -144589
13411 -144589 -205665 -105611 90138 109691 -16879 -23241 -55976 -29816 -835 -57250 -87297
13400 -87297 -80670 19638 -25959 -27927 -19125 131921 187573 58534 7585 -39183 -45028 -29916
13388 -29916 -35671 55231 57529 10648 -46103 -65422 -75270 -51818 -92138 -116492 -79316 15308
13376 15308 -119173 -81125 9922 135298 90917 74150 73243 -16727 -33444 -95915 -139009 -188763
13364 -188763 -292552 -173887 -170942 -156850 -167623 -3335 154608 140894 144466 208776 260675
13353 260675 305989 257031 244042 75279 -33243 -109311 -98060 28350 12777 36296 60953
13342 60953 -17858 20024 -9706 -93575 -24195 52480 25165 -45462 -124664 -87836 -32511 51404
13330 51404 66476 -2827 83089 59078 67564 58433 -3174 -42748 -4269 -45561 -31479 10987
13318 10987 42591 62880 47142 22980 -39722 12463 50388 38049 14989 -67859 -87741 -23302
13306 -23302 -14674 58320 101719 45592 79569 179791 69624 35519 140485 242231 290067
13295 290067 246924 193724 177829 95076 110395 70893 43114 59574 129751 84980 111312
13284 111312 192608 200338 30534 21923 49756 7556 56469 58703 102441 153433 129349 77317
13272 77317 -4481 791 27830 -54247 8978 112722 119669 24693 69292 1693 -17990 157304
13260 157304 140680 90205 -10497 -22199 -93658 -55641 -77716 -46452 37201 124392 111980
13249 111980 -61018 -96641 -88004 78844 70710 5177 -88753 -154651 -262703 -289170 -178731
13238 -178731 -69654 -112893 -155132 -101328 -93953 -142012 -53077 36417 -59017 -187928 -199467
13227 -199467 -196334 -207137 -79974 117192 50919 -65139 -62589 27881 117645 103230 94887
13216 94887 54695 101306 78727 29063 74770 125238 68038 71838 71786 2407 -156552 -131873
13204 -131873 -123262 -83342 -69915 -35144 -27573 45725 125368 205639 206611 189691 140127 86985
13192 86985 213034 321225 265870 120870 6088 -55304 -114768 -67 -17284 107199
13182 107199 352881 545195 680775 613651 523618 427732 391629 333501 164776 79983 47184
13171 47184 -40070 -156190 -30988 122431 118811 228210 292394 293084 113367 1223 -4021
13160 -4021 -31680 124592 140948 94754 196593 130934 81089 123140 190802 235325 201328
13149 201328 74627 -30141 63869 13672 43468 47862 27248 116742 161595 154484 218326
13138 218326 267051 425514 734678 1038636 1247145 1347875 1281496 1110534 804838 678318
13128 678318 554166 423388 263423 215699 219486 175611 177077 31780 -96133 -64075 -41356
13117 -41356 -1458 3800 -35408 -21589 52146 151018 120939 132014 28065 -123542 -178039
13106 -178039 -24824 84313 84614 140668 90858 77314 30051 9927 42113 83609 94655
13095 94655 179964 353141 459428 646888 882841 1074975 1350151 1461886 1363882 1222464
13085 1222464 1039679 836686 566404 473818 402528 215110 64850 7530 -104811 -64623
13075 -64623 -13175 -129271 -108511 -49350 50051 47462 45861 137823 68657 97420 45113 -55437
13063 -55437 -54622 -78670 -110373 -55041 -29731 2587 12556 131491 204331 168556 91401 75871
13051 75871 47455 147994 210400 186724 150756 94588 189455 253090 281760 345865 386700
13040 386700 329903 197831 126011 155033 167263 198885 210940 40907 -153288 -173054 -163792
13029 -163792 -106983 -26056 -11431 -138260 -193274 -138530 -52183 70057 120284 163772 165890
13018 165890 50044 -102078 -153764 -203606 -135964 -103975 -160581 -134873 -119966 48443 71886
13007 71886 92321 -19113 -77380 -85600 -156836 -128880 -118864 -108319 -111298 -66985 -88460 -83659
12995 -83659 -86450 -45280 -4305 38738 92724 23230 -57875 65251 181246 180526 279587 164445
12983 164445 38308 111198 118747 130726 137577 32733 -58997 -1377 -62999 -143456 6691
12972 6691 115749 42102 94020 156692 172115 125946 61956 93361 103251 55740 34158 143162
12960 143162 193939 45123 -66736 -147955 -206843 -116815 -123865 -7850 48626 -37110 2461
12949 2461 17170 -24550 43398 7372 -16426 -20004 -29236 55292 124347 -25831 -107787 -124230
12937 -124230 -166342 -95395 77701 176408 79421 73433 91581 95197 94846 125475 188334 168557
12925 168557 29044 -40241 -12564 48762 13631 22621 51555 12227 -26502 17744 112082
12914 112082 241924 193973 140534 66898 26934 140016 144305 161789 176988 197586 145390
12903 145390 9438 13132 -20728 38362 148513 116642 -93368 -95106 49500 67402 169710
12892 169710 124033 100310 54276 -31893 -129666 -132640 -120730 -89427 21753 38133 -19263
12881 -19263 -58178 -63388 -103323 -139589 -117676 -7383 107456 44917 -26546 37413 146911
12870 146911 204645 164434 124387 101974 129821 129271 18881 -51707 -85686 38371 53200
12859 53200 25939 104578 45614 48596 88533 56663 6400 -2688 404 -38570 27635 33882
12847 33882 -7576 -34304 47264 85001 138429 99261 84948 -59540 -13624 79338 35911
12836 35911 -7912 -35627 -93818 -52509 -33786 80621 88117 100601 110192 42159 -81339 -94070
12824 -94070 -93586 -58549 -45028 51454 11702 -9531 -41156 -183261 -185020 -114148 -131013 -64721
12812 -64721 44367 19583 -9758 -5589 3960 -41093 -44400 -25754 -110737 -130612 -146842 -130254
12800 -130254 -14462 91059 100475 -79310 -130632 -91632 -69180 -64070 -73691 -215740 -236883
12789 -236883 -153983 -68665 1957 28304 23980 45599 -57689 -50186 -35411 -53857 29299 176291
12777 176291 11738 -139922 -213943 -230892 -43816 57699 33033 17872 27316 -1215 21375
12766 21375 60472 101076 53897 -43211 2270 76628 109415 85504 -65381 -248180 -307682
12755 -307682 -182324 -131175 -188953 -63707 49435 29690 79699 -502 -123403 -63092 -15365
12744 -15365 -8534 -46450 107023 152951 139577 -5620 -50257 -14110 -40017 -18801 43285
12733 43285 157136 109689 31167 -34739 -69403 -82226 72826 233142 140967 8030 21866
12722 21866 19694 -2614 57765 99241 111760 98809 74730 62637 13344 57826 84718 181443
12710 181443 149559 86675 38679 25239 46144 55987 54049 92736 95296 1965 -27979 -32258
12698 -32258 -50701 108254 231415 145293 36883 55425 45675 47671 107888 97917 166992 230384
12686 230384 169277 166513 57025 -40793 71837 223811 286796 270439 256217 280863 237388
12675 237388 123490 115926 180517 202132 139753 56308 28908 6559 30129 61885 122150
12664 122150 172217 204174 224386 126846 -24955 -51099 92600 191072 215320 124130 128304
12653 128304 46049 64985 47576 91251 111620 107909 34598 -44247 -39527 14922 36127 167996
12641 167996 202194 120823 13871 -89047 -16643 -41426 -1153 65068 71909 68737 28616
12630 28616 81235 204276 275833 304228 161665 100862 69750 6556 -11620 -4487 -8937 -9118
12618 -9118 24560 37424 -29241 -109908 -2904 111685 -43773 -104912 -55481 62865 152803
12607 152803 185385 263963 202186 84774 67388 22371 43995 107963 184104 112231 92213
12596 92213 66898 59870 108200 104260 46556 -46565 279 77560 181395 171261 159420 149923
12584 149923 152801 20160 -130182 -143781 -14414 64399 77928 -18747 -18637 101751 215440
12573 215440 139765 33465 -45490 -31736 18906 128266 122879 224479 239060 245630 329843
12562 329843 341157 232657 193503 209479 211851 210554 298453 282797 242973 114434 176753
12551 176753 148579 74758 51296 82750 100188 247485 322732 270200 232668 270616 406121
12540 406121 371393 266616 122491 -22785 -43535 -44638 -101751 18390 16841 -14733 76657
12529 76657 132418 161845 237664 300636 264427 233350 248655 104112 151791 81211 100177
12518 100177 264960 271397 300280 266691 232743 216225 267850 276005 239813 331878 326898 285009
12506 285009 23997 63236 229591 234754 295595 324319 325554 385595 418591 373855 384505
12495 384505 195868 52231 58848 79581 179123 271986 298263 259154 251929 248677 322049 367876
12483 367876 381972 289556 257940 252017 301706 296362 164887 157684 148322 216316 166478 127726
12471 127726 238263 329206 289413 260631 251133 241416 291771 424303 426091 378041 355428 383746
12459 383746 288580 221789 219373 217350 270509 181376 103113 134189 215513 373425 441800 490477
12447 490477 519478 448708 277593 149432 97989 50967 128332 178336 218780 274157 304436
12436 304436 285467 230672 221560 200799 175009 258893 322490 342921 392809 448759 429486 358818
12424 358818 201945 222713 238522 278216 294410 342116 293909 377278 398542 426885 430148
12413 430148 424645 551063 609117 629940 567997 520955 433767 358126 271009 190512 296895
12402 296895 395867 214161 -3033 33058 210012 325310 362493 338317 298593 267932 239303
12391 239303 279476 258582 302954 357991 275447 173745 227470 287311 222434 204182 179068
12380 179068 205969 156697 177657 80494 155613 294242 249174 235012 359529 350513 397515
12369 397515 391337 347876 431688 404153 265862 216255 132478 151917 231302 264782 246498
12358 246498 227991 154522 104899 65906 191197 163969 72742 163390 244475 304856 314945
12347 314945 171850 250323 394529 279358 287184 299729 416016 460281 327172 278848 280022
12336 280022 304570 358269 327159 320351 210663 100859 302304 309943 216025 229792 236810
12325 236810 220284 259828 312730 348876 259676 107579 115270 115739 157646 209106 357904 420370
12313 420370 347416 94631 18956 149491 180238 199183 329167 337967 322636 312890 409565
12302 409565 422695 245150 250576 289483 269340 270748 208282 325749 503277 403595 357443
12291 357443 388016 208388 147865 271651 383713 361122 292574 295702 313243 310795 282536
12280 282536 211073 208808 207373 199176 245858 335426 281743 216960 159892 85550 213766 281400
12268 281400 160304 85661 172122 152442 123093 59225 97728 215750 180067 129022 198373
12257 198373 371744 349736 329159 280411 210277 165967 183320 302096 305152 313157 226429
12246 226429 179744 242549 285793 259311 353000 264136 256601 277050 297513 364229 321508 244088
12234 244088 239259 201085 285829 377049 386214 339700 334531 334081 385534 387020 410382 416549 470356
12221 470356 473191 496419 482615 421889 411634 440674 276021 189195 200343 298101 281537
12210 281537 329579 285455 244022 223588 271078 355857 332901 223673 131886 -16317 -34670
12199 -34670 -115257 -93327 -12208 130123 282417 354966 404909 473003 451468 341936 312848
12188 312848 198106 70284 140014 201882 402404 351293 370547 304154 303117 264194 248805
12177 248805 289759 278276 240733 238839 223165 231751 303337 322304 228052 275835 361936 503461
12165 503461 493244 428423 504082 573123 474526 362591 277868 304023 379372 383078 392248 442716
12153 442716 361139 272845 237209 321068 418605 542906 579214 552046 508312 523769 503918
12142 503918 422347 352809 410392 457587 430854 340239 344719 371442 403896 460317 567406
12131 567406 682412 625859 537992 543956 469925 399838 305744 202733 220801 286636 351459
12120 351459 263969 205982 217234 380898 462487 503932 494530 508208 477295 420604 430431 479014
12108 479014 406721 426743 388944 341130 404260 476950 436014 388858 482703 475586 343624
12097 343624 466907 528581 595975 563106 669659 741051 731340 699470 664468 664036 539620
12086 539620 403423 337359 437597 469138 651970 724569 726903 676794 571348 596131 748319
12075 748319 744022 699421 569092 636972 695054 637239 703059 783139 802019 843814 902642
12064 902642 875665 770311 665829 652898 657478 760588 818436 849797 770742 753954 818813
12053 818813 864607 798345 780774 741863 789412 830669 789195 711643 640309 573181 566969 570648
12041 570648 692720 654714 653878 620107 621947 748963 758896 781649 873005 922268 875229 802798
12029 802798 739992 833180 919334 1042533 1073698 1019698 986813 974996 1021932 1066724 981877
12018 981877 988170 979897 1065741 1145751 1114846 1070030 1003979 1008427 1055542 1083857 1004706 1047364
12006 1047364 1190638 1247222 1129976 1035667 1091998 1328815 1307302 1186713 1204777 1198797 1195195
11995 1195195 1124291 1020033 1198736 1257099 1243743 1221246 1253173 1434248 1617321 1677744
11985 1677744 1515122 1482121 1557733 1552110 1504786 1667818 1611931 1571274 1538631 1521034 1451295
11974 1451295 1490323 1538577 1622811 1608004 1698081 1796600 1797985 1845118 1744339 1679437 1692193
11963 1692193 1685827 1845730 1925129 1991667 1980377 1977105 2027425 2000651 1893036 1755216 1789436
11952 1789436 1791283 1770728 1679570 1638116 1756227 1841448 2048363 2137054 2112893 2147205 2242574
11941 2242574 2235434 2330048 2412359 2368329 2463130 2526534 2531012 2510451 2337277 2205902 2174894
11930 2174894 2331449 2368153 2409811 2456723 2521920 2693692 2809407 2701746 2598205 2655176
11920 2655176 2774596 2789559 2829461 2788804 2763622 2888208 2895579 2911549 2966758 3158851 3122005
11909 3122005 3076398 3105609 3146349 3095138 3168557 3206387 3212638 3176900 3179032 3211272 3274217 3254301
11897 3254301 3219376 3332301 3415879 3520203 3593376 3561059 3565538 3561823 3485244 3454522 3490543
11886 3490543 3404193 3514365 3634605 3743562 3795644 3699571 3826414 3899087 3914089 3912396 3940474
11875 3940474 4035697 4126378 4082900 4134630 4190195 4171970 4116016 4224410 4252625 4298130 4370719
11864 4370719 4432914 4406547 4357141 4403492 4500328 4461379 4409789 4354226 4346157 4495898 4618260
11853 4618260 4650084 4652473 4669752 4628868 4629489 4740731 4730398 4741033 4784171 4753371 4787178 4815305
11841 4815305 4873863 4934596 5014938 5028824 5086450 5153402 5170595 5153282 5185100 5185044 5230118 5305291
11829 5305291 5389537 5573053 5611804 5600090 5604578 5656176 5673270 5702211 5809004 5838849 5789892
11818 5789892 5715668 5610545 5653853 5589387 5528161 5655980 5694352 5699795 5800834 5872527 6034554
11807 6034554 5936001 5794346 5895704 6069212 6088880 6117446 6090842 6079059 6159109 6216722 6321090
11796 6321090 6425764 6499169 6727011 6787458 6721820 6764220 6684079 6676105 6726976 6816657 6967648
11785 6967648 7103868 7130891 7143835 7132007 7286648 7427451 7451633 7543594 7430105 7526871
11775 7526871 7655425 7654900 7725464 7805909 7675309 7567369 7705485 7906460 7958612 7975827 8047462
11764 8047462 8127877 8261790 8292615 8403420 8437793 8378483 8406544 8430988 8488587 8571455 8736875
11753 8736875 8938305 9083248 9168917 9318017 9458859 9487031 9514707 9578738 9629457 9659157
11743 9659157 9851389 10024065 10186588 10319692 10528825 10659212 10629328 10650797 10828212 11016674
11733 11016674 11135509 11188807 11287396 11349302 11509704 11560344 11700262 11897974 12031860 12137028
11723 12137028 12184874 12352010 12425774 12530977 12702834 12925644 13070186 13197711 13552727 13713465
11713 13713465 13912754 14206084 14283362 14426601 14666481 14966577 15205354 15421478 15580986
11704 15580986 15749390 15967060 16114939 16455493 16806254 16942510 17211325 17676865 18048838
11695 18048838 18345912 18515969 18779650 19035458 19343769 19547598 19854578 20202903 20498765
11686 20498765 20875812 21336842 21787124 22206639 22566465 22894633 23193822 23654995 24148363
11677 24148363 24665652 25195215 25613828 25884734 26387568 26835681 27320251 27875357 28449834
11668 28449834 29049993 29583698 30090421 30664547 31239426 31822207 32434587 33066228 33774491
11659 33774491 34389123 34947845 35486564 36241350 36913856 37622371 38324156 39016147 39636193
11650 39636193 40254871 40925079 41580534 42275046 42930149 43634810 44179304 44877998 45539478
11641 45539478 46213576 46815360 47334798 47877311 48635130 49096566 49578639 50088308 50575409
11632 50575409 51083161 51511479 51964268 52372097 52770541 52978672 53194539 53401472 53555419
11623 53555419 53736129 53878512 53896995 53996816 53835114 53552278 53561823 53398725 52903901 52598581
11613 52598581 52286542 51915302 51417893 50874481 50332898 49740251 49190180 48538273 47847783
11604 47847783 47217789 46597232 45888484 45109700 44340705 43558948 42881294 42192552 41458989
11595 41458989 40520303 39631230 38606046 37778065 37017926 36171143 35419243 34666424 33832561
11586 33832561 33063698 32419819 31684214 30928126 30328219 29631081 28990475 28302840 27536546
11577 27536546 26797177 26138836 25463044 24730152 24028270 23501258 22998347 22455059 21922748
11568 21922748 21427818 20819170 20213719 19775266 19475612 18999790 18376855 18025737 17580680
11559 17580680 17098768 16606824 16192991 15864875 15514518 15145703 14658302 14187935 14020658
11550 14020658 13784404 13508859 13271290 13047210 12611153 12221618 11962885 11552908 11248513
11541 11248513 11004034 10868980 10796415 10563613 10267153 10010051 9815298 9693805 9504656
11532 9504656 9346698 9158203 8907419 8746706 8465022 8368845 8177377 8058218 7893984 7668343
11522 7668343 7438894 7255574 7201309 7155774 7083460 7027930 6891261 6829239 6736741 6618377
11512 6618377 6459675 6392687 6298591 6209225 6072828 5879196 5729382 5615697 5458431 5405455
11502 5405455 5313235 5179634 5097008 5159614 5112263 5109632 5088041 4900851 4765446 4661312 4658227
11491 4658227 4646483 4651522 4667115 4661297 4534973 4340538 4140291 4126833 4123228 4024358 3910410
11480 3910410 3883674 3870230 3869776 3779117 3766119 3827640 3887721 3685704 3490315 3502793 3536537
11469 3536537 3439518 3222065 3153863 3071109 3031353 3111067 3065300 3112435 3141896 2970643 2908854
11458 2908854 2902774 2942605 2897587 2789464 2838309 2829063 2764000 2746749 2774240 2762706 2751283
11447 2751283 2730446 2792650 2708398 2708345 2634479 2408503 2468897 2584606 2660711 2631496 2566890
11436 2566890 2604691 2560509 2376298 2182634 2168296 2311633 2214525 2206481 2207841 2181434 2194156
11425 2194156 2162684 2138908 2011874 2092784 2134698 2131741 2164424 2242125 2139125 2030176 1983991
11414 1983991 2029110 2049515 1924638 1945642 1939294 1980041 1983721 1899124 1947376 2005699 1931664
11403 1931664 1898991 1780654 1567877 1471239 1543685 1665020 1834452 1893971 1833082 1785391
11393 1785391 1758491 1719333 1664141 1669819 1614172 1459367 1461572 1553150 1533606 1513227 1480955
11382 1480955 1585193 1661396 1627519 1585023 1582750 1589928 1520437 1390820 1332303 1359789 1380661
11371 1380661 1381228 1327186 1262682 1193521 1140160 1181007 1189137 1160123 1097630 1025247 1166610 1394355
11359 1394355 1472310 1368495 1312905 1355202 1336776 1290411 1299892 1440215 1593182 1542500 1454741
11348 1454741 1297426 1219490 1148329 1111053 1114819 1177495 1215159 1075210 1092115 1114065 1091239
11337 1091239 1057513 1173849 1210064 1220708 1197526 1091025 1063486 1068610 1096634 977622 907929
11326 907929 1032171 1031287 934173 964572 1090637 1053768 1072589 1083804 931759 868623 936916
11315 936916 926798 933764 897463 815070 938903 946432 977351 975967 922318 949917 899926 930388
11303 930388 993353 1065938 1165549 1031626 902972 1010958 1135651 1023893 899872 950068
11293 950068 888553 805817 777484 804862 752443 683469 746520 892742 1043458 1041860 994860
11282 994860 995123 894767 784688 698170 772436 902643 1021103 976923 814391 794302 791982
11271 791982 624787 556696 717632 731547 644806 622718 723350 763095 761912 652565 737415
11260 737415 767658 685323 867828 878677 863766 791761 772774 736161 896820 911384 940552
11249 940552 849244 830083 859817 903264 996791 981381 1059095 1172029 1215739 1331437 1560221
11238 1560221 1961124 2320142 2575860 2756639 2883631 2747463 2443358 2198349 1848319
11229 1848319 1552829 1353570 1210681 1157605 1133611 1089163 1083686 1035011 949715 864438 747125
11218 747125 687209 717065 742345 715898 780990 774663 799081 645516 555266 627966 720946
11207 720946 681341 639752 625857 750442 743056 623444 649510 696806 755265 871777 842922
11196 842922 759971 652249 497886 461095 469283 483541 483123 541608 598993 657347 644104 661404
11184 661404 669116 646800 560552 489613 466440 631075 769418 834397 825996 829848 877465 974362
11172 974362 933198 780377 602187 446270 450878 572590 645934 652752 575044 516143 495549
11161 495549 580651 644915 558463 567854 610493 754605 718612 689371 625599 479507 559659
11150 559659 641736 649771 667692 690188 605482 587905 607576 624024 579088 644728 648632 707380
11138 707380 633128 628470 724433 873654 1064374 1224197 1647117 2061948 2375665 2651387
11128 2651387 2778579 2703003 2472402 2268208 2082674 1851234 1489708 1033128 735693 640495
11118 640495 773636 811939 758653 715181 803134 805378 670886 634545 626342 635892 661854 640513
11106 640513 707331 748718 830257 850844 844448 758303 715794 583919 613612 823807 902268
11095 902268 838638 873259 866879 857604 851790 827352 746650 782534 855986 855213 753241 714899
11083 714899 575459 484839 419766 443025 530570 493074 570209 686992 723754 669652 684861
11072 684861 622471 545097 397831 416490 447269 368583 361389 447611 623962 694486 567662
11061 567662 537755 570812 651348 773937 770495 669454 598405 504296 444486 454366 567787
11050 567787 615887 644446 693402 578506 489355 467174 547243 511300 494537 563630 525347
11039 525347 518303 540949 520234 525014 506298 495934 478173 506061 582761 655258 653385 501445
11027 501445 423282 492223 535751 586292 645187 603960 577235 607694 684488 722285 624468
11016 624468 536507 512252 550415 439161 500411 554433 518742 464815 502054 551607 642712
11005 642712 785190 761186 698699 598609 600142 638044 681055 628174 467045 361584 417162
10994 417162 569937 651778 544777 507131 637742 635838 648269 582450 527089 457583 420994
10983 420994 365635 388105 402870 390035 453781 465443 481147 602366 686307 698638 730551
10972 730551 671054 629592 539004 519621 522006 553346 401658 338816 372762 435751 595914
10961 595914 644094 721129 700450 563613 402653 322249 328007 509337 490411 436677 474463
10950 474463 539184 553329 454978 410616 450841 590612 621333 521134 556040 617778 576112
10939 576112 556787 550187 675275 656698 716692 672344 522055 470787 443618 442917 602199
10928 602199 667269 625727 613066 605445 630045 650677 674593 659227 524679 459418 453453 461525
10916 461525 466265 583120 647473 620860 566558 574046 637507 602279 669602 692339 644545 651071
10904 651071 568247 666068 758438 716014 613891 572327 475846 425388 398236 418620 431220
10893 431220 367050 384358 530008 575094 553642 500845 495503 445675 448129 439896 392072 350883
10881 350883 463552 498809 525750 595456 467396 473476 467988 510331 463146 483076 629231
10870 629231 736515 703938 647448 673347 650298 599765 733413 753548 592802 483147 433039
10859 433039 517146 540390 552558 493035 437309 417772 358392 467518 525240 470418 514720
10848 514720 537884 445804 475036 497459 624454 498781 424915 387915 438967 461983 589491
10837 589491 661998 672267 497849 417359 489526 485779 423630 537587 615065 560269 458115
10826 458115 477306 532024 568757 557602 556708 589000 625572 507441 431299 427792 456685 495514
10814 495514 468912 502532 521659 509222 533922 539949 518050 508151 522436 483960 464720 542969
10802 542969 491404 436617 461125 452863 397156 374126 470203 520036 542032 626481 632324 632853
10790 632853 465702 413214 330451 333140 327512 465535 477660 419734 415295 478002 445915 384709
10778 384709 423646 392952 387633 414326 431469 465669 546628 622924 558743 521585 545675 598080
10766 598080 640363 545646 376385 432816 588435 597107 574397 497940 459956 448867 477049
10755 477049 454960 399578 561952 512394 394891 412365 383726 367157 337897 371485 479215
10744 479215 582719 541047 438424 360068 398512 390968 349925 370541 590882 658945 678964
10733 678964 663716 638784 679488 611828 467836 415108 363898 342162 375752 475508 449000
10722 449000 384457 409075 455872 387000 356345 323924 204452 301690 438595 426816 327640
10711 327640 343271 384492 374426 289729 270560 201040 198703 229760 155578 156961 172992 388215
10699 388215 506888 610657 542186 364001 311567 262703 265226 291909 236846 304602 395574
10688 395574 436778 471523 432028 304208 223410 329394 416254 461287 363115 317848 396420
10677 396420 512429 430554 278709 348770 433939 370613 368925 514394 531517 416735 439932
10666 439932 534044 501519 328937 321341 411834 395786 327133 259778 273946 226615 216732 308288
10654 308288 350811 408220 547969 585111 472326 562738 573224 515674 484183 428850 418397
10643 418397 371970 310463 300989 405452 582717 583916 730570 798969 724872 681223 657339
10632 657339 575015 674402 728975 768735 689919 625348 473952 668705 915184 961890 1062899
10621 1062899 1266934 1449593 1685672 2110537 2681284 3306717 4006460 4666614 5224225
10612 5224225 5687876 6186660 6382659 6311299 6173514 5904940 5587848 5157516 4528690 3795797
10602 3795797 3228662 2626100 2048618 1724005 1610623 1386429 1184722 1101542 934254 780895
10592 780895 804125 791249 721806 674453 625611 565139 554089 458909 412837 354227 305751
10581 305751 413363 586759 670230 576742 475569 436652 511806 459458 458852 453034 406299
10570 406299 321926 254043 285063 462583 520524 569271 487778 517334 544554 513857 594001
10559 594001 618141 416150 235394 131169 234240 387607 383245 371902 424151 384207 424927
10548 424927 488126 464197 355095 317091 324709 270277 332224 394168 353450 223971 185934
10537 185934 233278 310391 439493 466643 458716 457574 314666 310826 339053 387326 352041 441814
10525 441814 523121 500158 463433 421026 341113 326494 396349 348223 313844 384991 454613
10514 454613 554092 611372 510844 318672 287733 166428 228113 322965 317920 298299 351197
10503 351197 473152 449422 420187 431464 450914 374572 374000 470923 444144 477614 494150 435223
10491 435223 506434 518220 528579 529662 478006 503376 504266 456361 433772 502617 552441 637515
10479 637515 697224 724762 706128 629623 556045 529920 427699 405662 490176 522503 561278
10468 561278 581783 615772 673231 520993 510249 589310 434369 408986 365398 389391 502007
10457 502007 578600 578996 428351 374059 305262 316743 331372 234047 220903 378364 483023
10446 483023 493971 515375 403941 392216 353274 351655 359861 437410 397798 400162 437184 444090
10434 444090 413644 379307 450665 508844 406222 310645 265462 323747 445885 557707 504424
10423 504424 498702 445938 431419 398913 454522 481677 503844 456691 467906 378190 322722 311507
10411 311507 263010 336625 406175 478656 359258 312216 344253 354736 375372 511442 604035
10400 604035 519970 487123 442901 415579 520450 521417 557304 551451 537344 575902 635846 636183
10388 636183 611631 451889 473737 405288 374351 363753 290701 328340 332802 358147 328303
10377 328303 358189 444295 479581 500914 470923 449539 505251 561409 477199 427221 548184
10366 548184 421608 262513 295650 357902 401107 230701 247102 324837 400110 390137 411240
10355 411240 497198 534773 509128 441345 373908 413930 539363 549629 435857 298412 243785
10344 243785 422779 492968 517737 482719 423036 395675 497320 442201 515396 497410 572722
10333 572722 697664 719560 653128 530926 516827 597901 762315 906718 935667 973067 1092537
10322 1092537 1242791 1208413 1141053 1004870 994784 908473 881276 941762 944502 931428 893276
10311 893276 785521 634017 514897 455089 536866 571074 663212 658255 654590 672012 660437
10300 660437 673635 587329 482694 476888 579024 526831 420655 465401 604038 634443 458355
10289 458355 394598 432345 469484 532709 436843 498835 500314 384154 301519 467879 566067
10278 566067 575383 524202 446160 416838 512902 622268 667010 614134 575605 535805 496564
10267 496564 444129 419877 449841 549279 668414 738227 753554 701155 648623 619372 711411
10256 711411 810471 745575 658521 682215 647244 627201 581049 571006 428496 354857 291000
10245 291000 342460 358806 480510 522420 500372 547469 653974 675082 663975 567895 591707
10234 591707 670245 679674 564463 504121 420911 408527 512934 618769 741577 805882 692883
10223 692883 672619 669282 744572 771708 775492 670416 587660 431693 650565 727829 748949
10212 748949 694863 785440 765764 646266 654655 666377 658909 624341 591608 653876 655743 702123
10200 702123 793207 723104 549916 510922 537930 602387 649284 546015 565356 547087 599599
10189 599599 629003 739069 859184 1025270 1098614 1108216 946750 733597 526480 530206 637797
10178 637797 620438 584244 652921 623742 611362 540970 560116 627917 761207 862608 805520
10167 805520 617232 675734 822177 821538 770343 649048 645629 773209 915464 841967 768565
10156 768565 755645 755586 737504 756176 773195 799560 771645 889541 909439 901325 996019 996248
10144 996248 1058723 993213 877999 800767 911305 960010 1004402 1079864 1032388 871935 790774
10133 790774 824012 835576 787877 880136 957852 1044521 1072204 999089 920370 874604 969186
10122 969186 1134801 1145434 1025329 912742 813299 878381 978775 980917 999929 1033403 1077486
10111 1077486 1074664 1124896 1076568 1039247 1041429 1092097 1087216 1112760 1299321 1291528 1116259 994933
10099 994933 970964 1003187 1032046 1029783 1054839 1187627 1199409 1074211 1025535 998146 1136454
10088 1136454 1204080 1141395 1210326 1182317 1118095 1006793 1084838 1208908 1239966 1257023 1256816
10077 1256816 1256072 1340441 1416534 1317249 1185999 1173479 1204406 1292957 1343255 1289015 1260316
10066 1260316 1235354 1156367 1167597 1014961 1063246 1200514 1284431 1215857 1114661 1170086 1195659
10055 1195659 1232713 1316646 1283251 1265296 1301772 1393531 1425579 1410619 1396644 1340286 1359613
10044 1359613 1436460 1423869 1489271 1593103 1576871 1491946 1491502 1410457 1407450 1397837 1427285 1481348
10032 1481348 1503599 1532105 1684720 1719806 1599858 1601441 1603577 1706507 1951633 2089624 2135778
10021 2135778 2024807 1965684 1980771 1930174 1869127 1701973 1519960 1499977 1539448 1562261 1683528
10010 1683528 1736940 1720163 1625316 1626451 1727625 1755636 1800242 1829439 1714870 1603971 1490050
9999 1490050 1560351 1754921 1812393 1819671 1795889 1683550 1709453 1776351 1684946 1688309 1658996
9988 1658996 1592542 1620689 1690838 1701050 1682202 1862447 1993058 2004016 1816897 1710774 1765512
9977 1765512 1805066 1858751 1823241 1792229 1931298 1936192 1810874 1811697 1849689 1777245 1726009 1807844
9965 1807844 1869771 2024630 2049504 2072377 2079021 2143226 2021087 1904261 1874198 1947226 2094605
9954 2094605 2178648 2226911 2177672 2236399 2209180 2075269 2068817 2117410 2184362 2169323 2125174
9943 2125174 2184962 2327458 2422476 2435863 2425916 2433777 2412895 2447391 2478071 2489510 2505596 2391870
9931 2391870 2429374 2506365 2510908 2548112 2550548 2528734 2513111 2521328 2572785 2568471 2567380 2676661
9919 2676661 2809758 2803434 2729464 2783951 2912207 2868175 2875744 2953004 2873522 2863865 2960654 2982853
9907 2982853 3063947 3218783 3138473 3015426 3037028 3024064 3114641 3098468 3081903 3137337 3126320
9896 3126320 3160715 3260662 3349142 3344890 3389039 3339035 3405295 3478468 3383071 3336538 3440352
9885 3440352 3648128 3721340 3588259 3563225 3565827 3586156 3669728 3759810 3816241 3776490 3749621
9874 3749621 3852939 3958721 3961529 3950905 3901466 3975244 4025124 3990470 4075112 4210594 4230752
9863 4230752 4187147 4242428 4225068 4228735 4336672 4467199 4536300 4560983 4562362 4550916 4417719
9852 4417719 4365973 4437256 4527443 4644904 4714635 4785553 4781299 4798489 4865818 4959649 4961343 5059294
9840 5059294 5091224 5172558 5262713 5344415 5371527 5530796 5663372 5673165 5923541 6440651 6884809
9829 6884809 7724428 9046031 10474999 11478354 11641414 11080373 10040218 8835769 7699189
9820 7699189 6901086 6634526 6401380 6207293 5994157 5941672 5957852 5856135 5830905 5854876
9810 5854876 5939771 5948387 5958624 6031167 6078653 6214527 6352136 6270842 6201035 6181940 6095585
9799 6095585 5954387 6063666 6141548 6210338 6310099 6296334 6300384 6212925 6227808 6252932 6228637
9788 6228637 6249301 6320041 6438355 6568219 6582942 6509376 6420143 6406896 6503086 6571833 6650196
9777 6650196 6575915 6584709 6616690 6608159 6555425 6550299 6523823 6473567 6426649 6403573 6506993 6542252
9765 6542252 6627399 6638019 6509542 6420520 6472043 6426658 6280490 6179389 6249007 6303480 6330599
9754 6330599 6359658 6404297 6381786 6236353 6164344 6126054 6119539 6113659 6071060 6033588 6036497 6041567
9742 6041567 5978739 6027575 5956423 5928578 5874322 5936595 5942932 5838127 5790059 5776305 5650411
9731 5650411 5543706 5383848 5313780 5274174 5409152 5412370 5352489 5282360 5310725 5401355 5447010
9720 5447010 5376879 5261933 5218890 5066597 5059263 4958748 4880476 4921280 4870977 4870740 4877976 4755882
9708 4755882 4795299 4761968 4679789 4659607 4409250 4322704 4300588 4218495 4190286 4161299 4256223
9697 4256223 4399141 4410486 4360306 4252547 4114768 3975234 4021094 4026913 3869415 3920775 3876676
9686 3876676 3814495 3843615 3886647 3737764 3581522 3669943 3684678 3596788 3642405 3664882 3656846
9675 3656846 3589175 3442679 3318767 3130043 3047590 3064221 3063442 3030681 3040947 3088845 3112461
9664 3112461 3123532 3183922 3124819 3069300 2981082 2923839 2963348 2929147 2940220 2803909 2670795
9653 2670795 2697474 2698033 2572747 2460090 2344964 2320253 2290646 2447240 2565639 2554995 2513831
9642 2513831 2450049 2382280 2369994 2265169 2258029 2400544 2414785 2423930 2369106 2348118 2243181
9631 2243181 2196650 2161116 2118980 2088016 1971347 1938517 1942886 1997520 2028704 1971723 1927581
9620 1927581 1876406 1943599 1975495 1961886 1861930 1759535 1821817 1904803 1825289 1773435 1690766
9609 1690766 1634001 1666528 1694186 1606999 1645367 1705721 1681896 1670918 1590292 1568526 1603814
9598 1603814 1627986 1578384 1540447 1567512 1609976 1590763 1424642 1443381 1478079 1481722 1520269
9587 1520269 1448676 1316680 1333670 1361846 1279678 1235418 1335883 1464668 1380239 1250372 1334825
9576 1334825 1383512 1344264 1186671 1163266 1153064 1175756 1110021 1153083 1180959 989160 989661
9565 989661 1012293 1074654 1071698 1119311 1169778 1250333 1287704 1158130 1108723 1075830 1037227 961661
9553 961661 977859 963568 920919 1007303 1095145 1061025 1045619 988608 963952 964142 881424 858038
9541 858038 880762 929116 1009272 1077856 1104542 1069292 986441 1025709 1017328 888819 759832
9530 759832 769556 861277 1011528 1060482 973580 1000801 1092043 1059553 975030 803291 733836
9519 733836 757253 817795 815636 885941 925296 934030 1010766 991782 949282 888730 829941 836286
9507 836286 644900 500937 595940 721872 769360 833682 776824 759804 825979 883379 849177
9496 849177 839039 783229 770972 784133 673686 667887 682028 639258 489749 480921 591518
9485 591518 680916 637868 639434 761697 676885 555951 487025 490732 547503 548525 670234 666047
9473 666047 717799 737753 760339 761914 698145 701048 650995 571602 538012 554381 528183 575654
9461 575654 622222 615503 541521 494345 355843 286606 328375 251658 164035 269486 396394
9450 396394 405801 434439 473826 534614 497069 416160 379499 418900 434213 514699 427945 476937
9438 476937 520840 493626 434873 399059 481237 614254 609577 526396 487568 474827 444321 400992
9426 400992 384593 441639 451667 349593 327358 330340 308876 370600 443528 487573 469146 392221
9414 392221 305397 293360 398558 436849 430149 389897 361521 374535 400820 288407 253891
9403 253891 299966 240105 174962 124989 107537 204666 225702 132582 167065 273036 291817
9392 291817 277609 366883 356991 257011 274169 235370 147452 292747 500336 522197 499580
9381 499580 500135 446110 317087 337258 442386 487204 374704 421510 444133 381513 377495 299100
9369 299100 272626 295955 342484 464350 361813 230446 190914 153781 144386 116558 73587
9358 73587 145399 273316 266488 211766 187984 203784 356396 361759 494503 478232 373234
9347 373234 334245 244010 245076 281283 371710 439205 428476 424444 469569 493007 470827 382450
9335 382450 308446 287811 300495 300464 254904 284036 347841 322454 323698 433023 454293 336012
9323 336012 199566 143979 238033 306598 205473 117586 207697 157149 186398 187620 234086
9312 234086 326668 307287 219599 287797 365083 289358 274837 194802 136040 160096 152960 198062
9300 198062 215538 268109 193624 266787 249067 163868 93072 46461 200687 233198 57222
9289 57222 -17571 24699 -76340 -185554 -142285 -129844 -21727 182975 188436 90616 -29546
9278 -29546 -79286 -54052 -8493 138761 114985 18842 104074 192688 244391 382503 327516
9267 327516 260048 369055 244048 161581 215725 301089 250926 187536 168406 120435 151589
9256 151589 203896 136266 230157 250348 248909 127506 198182 245113 39625 12326 68052
9245 68052 -68339 -190539 -133772 -168195 -145372 -113888 -64905 7436 -21730 80545 36328
9234 36328 67226 151279 132626 59670 2586 -86064 23851 117757 97054 10761 -84363 -56958
9222 -56958 37652 146548 142490 31960 53122 125853 28276 -71731 18117 84609 72273
9211 72273 167963 127091 66525 118871 147562 261822 285644 181052 54726 14391 32672
9200 32672 39513 -19073 -56963 -76632 -38106 72594 176385 166453 97391 128638 214966 164648
9188 164648 58079 55442 62401 108247 125811 212197 299479 180486 -9493 -19911 9936
9177 9936 88636 172343 114321 -7602 -23829 13732 10566 -77909 -155163 -61917 67153 112386
9165 112386 128547 179423 162997 135522 162522 85756 49686 121126 243048 319282 176758
9154 176758 46230 115717 95480 150031 264722 275414 135440 81790 155835 151745 163247
9143 163247 191491 122345 82579 81991 -22575 -79572 13226 113213 102837 133031 33175 13858
9131 13858 13651 -16933 30610 32102 100160 200576 252794 260192 236106 321146 296358 123329
9119 123329 177098 205344 45343 -6830 -53835 -132878 3987 59214 46393 -52529 7919
9108 7919 -1126 3089 123773 116874 86617 274643 308814 209352 65254 -45221 9190 152810
9096 152810 212408 139705 145876 104348 -16404 -47254 -45397 -135674 -164728 -242497 -109686 103287
9084 103287 190179 233375 192062 117229 118894 213857 162696 30827 77927 2583 -203166
9073 -203166 -125368 -23818 -65367 -83617 -47902 -41665 -126342 -55473 41311 62565 44826 -69233
9061 -69233 -30430 54647 81595 154003 68995 139891 165697 47970 -5978 -35635 -37288 133437
9049 133437 62097 67426 56372 -48732 -44486 -29083 -68913 -57840 54233 106640 154199 -56297
9037 -56297 -144924 -46783 -54992 -114208 -155665 -38307 25996 116072 100157 36434 42627 37654
9025 37654 67836 186770 240893 194821 220120 163014 115808 34886 -82772 1448 -7719 18194
9013 18194 132273 117599 67269 29384 48683 103868 99288 102213 115505 31317 -74151 -163750
9001 -163750 -11359 53712 67638 103106 119693 231797 225457 75240 -58447 -49005 -103153
8990 -103153 -291025 -213310 -71213 4034 74176 30848 45738 141784 42277 3114 -66684
8979 -66684 -75439 -44148 -63132 -129060 -40572 113621 155073 98503 161926 252172 154002 -56584
8967 -56584 -73126 -85544 -74361 -79807 -39856 49609 124708 124177 40086 -17132 -8380 -59637 -77472
8954 -77472 -107034 -123686 -46988 -10516 51377 95142 28241 -35763 -51911 -139378 -200011 -189119
8942 -189119 -144625 -135338 -9929 96078 49164 -3558 20557 75909 99141 50392 23188
8931 23188 29960 75337 132911 118300 38440 71504 122006 105272 164520 48519 -91067 -65373
8919 -65373 59877 90500 -2228 1005 -117423 -41391 42929 -110640 -129155 6288 146807
8908 146807 211317 141147 197956 192344 167346 110310 53228 62588 112932 193012 219775 68348
8896 68348 -77707 -62125 -62510 -31265 -58192 -44056 72700 25627 -54630 -40492 -25694 -78377
8884 -78377 -134809 -137469 -123525 -78203 -72031 -75678 -55965 1400 106175 76142 -49633 -55610
8872 -55610 75169 93966 111033 84104 46509 4943 20549 13622 83499 85013 -49203 -109597
8860 -109597 -75898 -48466 -88046 -116882 -118068 -147979 -202085 -94427 -46243 -70492 -82006 -76975
8848 -76975 -142796 -119461 -41596 39713 124236 267646 250085 168309 107259 -100994 -168089
8837 -168089 -91050 -19162 3927 220888 103375 20836 -9435 -108662 -84888 -13370 59778
8826 59778 48823 24735 -76824 -98474 -155895 -39151 -82361 -38175 -73632 -134612 -76325
8815 -76325 -58112 -64280 -73106 -52274 -101525 -111307 -124937 -137965 -85581 -85585 -53935 17317 23823
8802 23823 57453 206486 191806 61319 -75014 -9646 167122 202569 124850 21546 25411
8791 25411 36852 61703 25186 3332 -45603 -72629 -30014 -60206 -123303 -105170 -36478 -57737
8779 -57737 96830 209362 166819 105410 153835 155274 200709 217079 201285 174367 38540
8768 38540 -37295 2984 26896 98945 193848 128560 71574 114060 100638 30896 82943 24755
8756 24755 -30487 52304 157726 79176 58482 87302 42473 -10219 -86945 -52405 -84588 -12294
8744 -12294 -7215 4672 57295 35395 70076 55586 8834 -12339 44055 95238 97139 102333
8732 102333 79293 45430 159367 120497 -8281 -120574 -52521 45441 113343 -35015 -94951
8721 -94951 -61458 -166141 -57144 12768 51962 -7153 -33492 -96062 -132151 -90054 67588
8710 67588 114300 81419 44904 -58949 -61083 -63098 -90744 -82838 20213 99413 59421 4995
8698 4995 -19370 79889 263886 281832 177998 72355 13320 68146 14393 5195 81997 179113
8686 179113 189026 86337 39615 43504 77719 163073 139418 66471 40666 32442 145274 188499
8674 188499 142056 182956 209545 131934 132654 209894 239919 232531 132528 -19342 17078 126486
8662 126486 221634 186707 118905 3643 -120530 -51718 153486 197641 99353 -52985 -122488
8651 -122488 -69711 53222 94850 12292 80125 88822 33894 97807 178693 73259 25683
8640 25683 131163 238022 128615 44129 70033 96616 64172 163646 229673 154560 278601
8629 278601 574523 922838 1212856 1561541 1776068 1666813 1558825 1264742 896632 640461
8619 640461 543970 486477 343974 238515 194809 285150 209940 226834 263029 224521 174741
8608 174741 149667 243823 188816 128321 124795 52654 115266 209597 264647 269846 275881 154571
8596 154571 84753 98656 59135 72507 190354 246525 207498 258004 368789 556900 721596
8585 721596 878474 1066405 1381044 1991835 2793122 3274043 3365181 3183531 2682028 1984036
8575 1984036 1335846 1053143 768617 554018 328576 309322 406568 389536 366840 298824
8565 298824 228191 171090 126390 132202 -47967 -105503 -106704 -199831 -195446 -75032 -100962 -152307
8553 -152307 -137494 -82123 -38122 -7230 17148 -119248 -209323 -153972 15432 20876 33437
8542 33437 46217 208750 215857 263558 358617 623508 1030312 1449884 1640929 1583743 1302629
8531 1302629 1077809 785976 586986 360394 118833 65852 19189 80744 175129 158763
8521 158763 150759 131186 106146 86194 81446 -19383 -42479 -149355 -244941 -191953 -116035 -18310
8509 -18310 20299 2528 -22486 -32022 18943 -19371 -25954 -581 45169 39936 -9894 33864
8497 33864 20149 248 77196 74094 -34990 -143890 -119780 -33428 -30962 -65236 12432 15812
8485 15812 -126118 -125669 -144099 -91586 -141171 -184854 -160198 -155195 -147434 -107600 -12501 85833
8473 85833 147668 -23234 -132898 -4033 -22142 -148892 -279462 -269715 -250540 -154959 63233
8462 63233 161901 233015 190611 40726 -67799 -67316 -117724 -160727 -179403 -53791 -9108 13167
8450 13167 46787 135799 140373 190821 197017 182531 170823 168924 245123 319718 289509 141634
8438 141634 177799 215393 272785 158006 -30943 -98830 -71581 4526 69812 55786 -19577
8427 -19577 34692 -7309 -153172 -150418 -74149 43008 50732 82468 82815 153986 155121 79377
8415 79377 89219 33392 89637 108154 -131946 -156948 -124380 -78154 114413 249030 134187
8404 134187 -33498 -154559 -157251 -44533 45515 83201 39458 -28425 -29374 68526 148053 108393
8392 108393 94608 95026 106132 174470 115897 27649 -38959 -15047 27929 39316 66167 119814
8380 119814 39809 35091 43437 96694 113361 26487 -57941 -174609 -193092 -135058 -21452 -58878
8368 -58878 -77294 37091 127287 156549 105844 2262 -69962 3341 31277 53741 9747
8357 9747 18147 -86976 -122939 -33660 -78488 -115810 -70754 -179843 -216341 -120047 -63508 24231
8345 24231 2727 -52045 13368 -46816 -110609 -110032 -159567 -79834 -99422 -62585 847 85495
8333 85495 94265 51078 125985 154294 137278 119085 42175 -35143 3971 57048 114825 55411
8321 55411 9002 193574 244659 148637 -32316 -73391 16224 101900 38091 -19819 -86066
8310 -86066 -44631 -5412 33352 63564 21463 9272 10280 -6268 15818 70585 87466 34835
8298 34835 33242 -60527 -109995 -235245 -308722 -202195 -55966 104349 72203 -12350 -5999
8287 -5999 108383 114352 -109913 -177303 -161395 33245 193642 262978 161208 29472 -38451
8276 -38451 -56611 -41025 -109461 -82960 -5281 -40702 -70628 -72986 -54126 -38757 -97074 -246784
8264 -246784 -254022 -138963 -21286 75871 104383 8104 29658 -32875 -123270 -46433 -4310
8253 -4310 -11782 95946 34221 49356 109466 69275 -42464 -66008 -91776 -76309 -97707 -109344
8241 -109344 -30855 1388 110964 168824 158782 165859 172286 38846 -48764 -63811 -10483 -121503
8229 -121503 -101836 -114324 -10767 28427 37856 93462 99408 -48691 -106117 -136389 -128759 -212808
8217 -212808 -182971 -88535 -92451 13162 73055 -48588 21225 72985 21730 11052 80920
8206 80920 170071 142517 134830 155863 45775 5069 8848 -30021 -52205 -37263 39464 -37022
8194 -37022 -94013 -119540 -87569 -20431 -39286 -119556 -269420 -311915 -263137 -112239 -158925
8183 -158925 -132508 -26774 5308 -54844 -35878 -59617 -67807 7739 63375 -30605 -31107 -1095
8171 -1095 88628 118464 112684 -23287 -157930 -90637 -25819 -51960 -25473 -179167 -290572
8160 -290572 -237070 -148570 -131383 -120428 -85608 -48934 -151783 -274335 -178871 27554 40047
8149 40047 -7694 39642 200712 281922 251135 192509 90021 -9718 -123667 -63615 30025
8138 30025 86884 81272 -22015 -122895 -41117 -40658 40912 61984 7563 -16659 79021 -35009
8126 -35009 -9512 98335 58322 43373 -29972 -24177 11284 31762 57975 40015 54169 54498
8114 54498 123466 190379 171805 98562 112091 -3032 -218983 -250960 -118395 -37563 -41787
8103 -41787 43117 42387 77900 162122 242390 292558 183789 75204 76611 70020 15084 -12777
8091 -12777 74616 138478 64039 -34474 -27226 -8111 -42130 -82797 -137318 -182916 -302072 -283947
8079 -283947 -198658 -166945 -120155 -71037 -50147 -64988 -91933 -46444 -55633 -111909 -113720 3228
8067 3228 94001 50083 -33885 29254 89669 22206 -110827 -46843 -10493 8708 -42775 -17024
8055 -17024 -72931 -103048 50891 105714 98070 101272 194834 158135 91231 63529 74967 -857
8043 -857 -50361 -110427 -174938 -153721 -109746 -71847 -57577 2841 75551 105763 82404 31165
8031 31165 3392 -51600 -71536 -106153 -29902 -6742 -43126 -36461 -58498 -62301 -59690 -42490
8019 -42490 -83790 -82864 -31118 -11473 28369 71021 40945 13553 40243 39034 20522 4703
8007 4703 -70240 -40709 87358 18848 -58628 -126886 -122719 -24453 -7907 -47071 -2591 16007
7995 16007 65982 51446 21999 73712 70620 -8623 -139401 -134544 -2295 49464 114722 148074
7983 148074 235861 187905 134583 64146 107698 212578 164800 -23280 -5307 51158 45423
7972 45423 87595 70931 87689 145155 31130 10870 6352 95779 110018 93807 25316 61670
7960 61670 -36377 -108656 -64012 -17773 -24747 -101852 -115964 -123790 -93460 24164 166979 99941
7948 99941 125179 186074 163706 220999 253860 99009 104923 210442 282779 215520 130238 211394
7936 211394 231092 39322 39854 140065 197608 211617 167938 131800 136859 222258 159797 58392
7924 58392 -6408 6593 51197 -28854 -114031 -84421 -33514 53540 -12252 -55878 -40529 10835
7912 10835 97008 115308 109516 38239 119703 55821 -43425 -83393 20051 -3453 83492 113329
7900 113329 562 -59980 -25791 34499 42806 -52119 -102030 -95053 -105694 -94336 -22723 66025
7888 66025 92042 104219 85149 10886 27701 39630 -18033 -104272 28580 -11416 62804 133673
7876 133673 69833 15385 67756 139404 88643 70927 40851 -17561 49354 81535 -6152 58859
7864 58859 157475 177958 200045 209455 58327 70996 73791 -53146 -267303 -287976 -229120 -282561
7852 -282561 -298835 -235496 -259714 -158162 29259 29296 41618 -32424 -62318 -36621 -172392 -121895
7840 -121895 6114 -41086 -68009 68424 145770 8037 -185787 -275648 -274498 -172024 -98596
7829 -98596 -48826 -95718 -154108 -148859 -237907 -150350 34351 63555 -97399 -198377 -160398
7818 -160398 -152070 -68925 29551 -19631 -99580 -78396 -14127 -48724 -14428 81263 97554 21306
7806 21306 79619 238201 218220 114609 2970 -11753 -23576 -65385 -1569 -12925 -165270
7795 -165270 -253621 -183710 -62447 117555 30626 -98493 -35691 -5725 42375 -45348 -23366
7784 -23366 11478 -29208 -73148 -79440 -32189 -108691 -70870 -123295 -162465 -137026 -65460 -3310
7772 -3310 40036 -45157 -117117 -60916 57722 -10278 -48149 -45610 -20429 -6091 -69433 -61129
7760 -61129 -39382 -28261 -130983 -16793 83747 87809 1012 -95787 -162995 -120792 -67229
7749 -67229 -61333 -42494 63699 41489 -61422 -94903 -44728 -121811 -43243 -8340 -33575 -93370
7737 -93370 12724 48394 -39129 -33117 -11435 -112849 -207277 -251221 -128189 39300 40987
7726 40987 -55936 -103891 2599 32145 -22657 71930 23991 -72370 -80624 -12225 147824 183654
7714 183654 120882 -35883 -66777 -129405 -270313 -257461 -141430 37012 85606 56322 170722
7703 170722 206533 110909 5367 -5371 87013 193213 141529 124253 23055 27038 47214
7692 47214 -72757 -106606 -100559 -142700 -209354 -231456 -223760 -167677 -138611 -216045 -153718 35952
7680 35952 80736 2679 -31327 -20690 45121 51737 -87419 -124122 -117073 -30534 -106215 -110364
7668 -110364 -79188 -127777 -96466 53108 67422 62402 38165 -73592 -45227 14350 81369
7657 81369 167502 169864 160202 6283 -40490 128974 60631 -11150 -115238 -196884 -45050
7646 -45050 -63908 -124092 -101412 11426 27218 37329 -61597 -131448 -84262 -67611 31156 75311
7634 75311 -22516 -46725 -14963 22067 -99475 -170767 -192573 -58493 -18368 14309 16255 48632
7622 48632 11251 -10996 -13099 -42996 -40678 -99018 -102720 -8735 -60659 -107598 -107922 -192297 -126866
7609 -126866 -42386 3570 -83798 -135539 -75920 -33711 -4988 100562 92776 -780 -33591 -37379
7597 -37379 -68789 -157731 -93568 -156727 -275332 -206482 -104125 -129232 -112300 -54072 -36863
7586 -36863 -25165 -75185 -23904 -137811 -236632 -289056 -92583 148687 200368 183364 107559
7575 107559 39431 55107 29823 -52118 -159023 -202311 -240403 -105811 -28234 -67540 32704
7564 32704 111891 103191 -11988 -63180 49470 206613 253414 124030 92240 116908 119410
7553 119410 175482 104742 47404 52239 116382 110618 154722 271779 203399 108598 67520 63749
7541 63749 4853 -19226 15292 -29416 -105990 -185398 -159016 -130198 -163388 -183555 -148601 -64077
7529 -64077 3710 50997 44452 8086 -38354 -98904 -164753 -170611 -166398 -132868 383 40661
7517 40661 -59667 -133902 -116467 2558 62489 -22428 -92412 -33922 -70586 -138489 -168360
7506 -168360 -86311 -51302 -56936 -72255 -81115 -51652 -77825 -123078 -85454 -25046 8236 -50130
7494 -50130 -89710 -99356 -66605 -11793 63770 -36630 -167154 -156062 -85746 -4667 63446 -53942
7482 -53942 -149738 -75436 -19161 -92053 22180 127533 1733 -75594 -60590 491 110103
7471 110103 62075 114321 40862 -39040 -30866 27673 50968 19507 1476 -75490 -122009 -176958
7459 -176958 -201362 -47451 45225 45421 79251 54190 -1086 21509 77936 -5800 -28187 -138828
7447 -138828 -64610 -19900 19508 -32171 -53953 -40342 21129 35591 43602 54938 -95226 -114731
7435 -114731 -50585 -65610 -233720 -237776 -249683 -283881 -255847 -171724 20946 133513 86206
7424 86206 -22348 -131848 -14194 166851 168346 85573 -26865 -63379 207 140850 126884
7413 126884 43871 -31347 -3705 -48366 -7183 75635 9953 30937 70481 -18454 -35805 -57260
7401 -57260 867 7262 -76772 -92412 -28163 -96285 -78504 31892 96526 -33626 -59671 -69503
7389 -69503 -58963 45521 87466 43778 -46555 35142 158323 158581 177590 248422 153087 2309
7377 2309 -34182 -46809 -20168 -45209 -60870 -113408 -54843 -68862 53659 12174 36049 56513
7365 56513 -62313 -42010 -25936 -62182 -23470 57297 47416 -14471 -2310 478 50356 108249
7353 108249 45214 8393 13756 -87238 -176571 -154517 -76862 -74441 -33253 -19270 -23657 -42274
7341 -42274 -16470 12508 -6970 -42290 -29985 13443 70717 17643 -121809 -116037 17584 113898
7329 113898 71785 81378 65370 -143886 -158388 -156046 -225285 -277658 -213112 -143892 -35198 -12459
7317 -12459 9965 -19720 -183799 -132710 -6123 108519 40124 52343 21702 6739 -1509
7306 -1509 -3114 -123118 -161063 -166950 -162042 -31727 27852 -3765 -46896 20252 164977 98614
7294 98614 87953 14460 -92209 -16712 99099 81050 -8052 -65294 -50821 6874 -46452
7283 -46452 7424 129422 176612 90439 58156 95894 85942 -45517 -47201 -185905 -192348 15350
7271 15350 36887 -32255 -130627 -26252 40099 -45862 -84819 -94660 -46917 -4292 101432 124558
7259 124558 102000 93833 85496 60408 -35530 -42410 61927 80474 -105715 -109537 -139547 -226593
7247 -226593 -221317 -196953 -218578 -229680 -127705 -154592 -171454 -187688 -50436 -15482 -130807
7236 -130807 -138220 -235427 -146113 -71580 -78513 -3396 48261 -23360 15543 -36590 -27710 62599
7224 62599 7686 32452 -11933 -33715 8675 122530 56102 -62029 -142439 -96504 -86430
7213 -86430 40001 7389 -201730 -158419 -187355 -139928 -13526 40302 -12920 -22109 -10151
7202 -10151 -27524 -121370 -89815 -138716 -118321 39250 116178 90362 18139 52037 -44876 -28513
7190 -28513 16259 40307 4542 -122142 -219821 -177070 -214221 -247730 -127992 -118488 -144037 -283783
7178 -283783 -270168 -158099 -223972 -284014 -230345 -129601 -117405 -88877 -156003 -46909 41942
7167 41942 87981 153869 -57712 -72433 -35934 -71721 -8499 63386 121583 119959 21817 -30418
7155 -30418 -128096 -114212 -86595 -113658 -1067 166449 58358 -24850 72400 -23280 -62866
7144 -62866 -27689 6572 80307 54343 134035 200841 133398 77362 7429 -122661 -100746 -129138
7132 -129138 -54071 98927 140516 87344 100152 46484 -17650 59952 113499 32958 -47208
7121 -47208 -128893 -118980 -150117 -4024 73015 103299 97505 67934 119862 143741 99887 83201
7109 83201 -7698 31323 108869 42404 -25307 -51080 17044 31970 -22280 -32403 -16354 13187
7097 13187 123746 165569 115122 89838 -840 -77907 -119267 -114631 -31722 99357 197651 192708
7085 192708 229334 175001 99488 111133 99350 -14334 -127848 -94567 -10161 -84387 -179847
7074 -179847 -194761 -127418 -69124 -70821 -134272 -40281 113971 189271 95858 -26286 -153430
7063 -153430 -153361 -119740 -113545 -163595 -242464 -131843 -6065 42490 -7554 -82619 -81756 -125957
7051 -125957 -95403 -27797 -29024 7277 -123929 -317543 -246380 -164585 -53384 -40719 -54764
7040 -54764 -54121 -68932 -115887 -128015 -82539 -19583 34967 88485 77194 39150 -13174 -68041
7028 -68041 -129405 -19247 119981 72566 -11645 -117184 -31664 38472 -2528 30063 22829
7017 22829 28942 13954 43832 -29507 38452 9861 -88109 32017 100823 40797 -99374 -183053
7005 -183053 -191271 -121006 -120831 -106433 52414 174235 198273 68590 -77067 -75702 3419 -17976
6993 -17976 28814 40093 135732 185387 123036 12782 -65760 20045 67378 -57319 -132303
6982 -132303 -127953 -146839 -233584 -246413 -71215 -121342 -354854 -264706 -187202 -41608 135678
6971 135678 112540 47859 -82916 -82461 -83983 -128374 -203520 -149523 -128177 -149416 -81839 -39515
6959 -39515 -26367 -83397 -189891 -157576 -26404 -68587 -121290 -122559 22015 23150 -28830 -25506
6947 -25506 -43488 -152899 -232921 -189374 -82715 -9152 -25679 -29180 -4774 -28321 -53090 37066
6935 37066 59490 150 -80888 -133616 -55909 -30795 -44825 -37968 -23633 -66891 -138805 -109518
6923 -109518 -20721 -20482 -40237 -37846 -22457 -110843 -80164 -39713 -82878 -93482 73917 70531
6911 70531 9146 -15768 60763 198479 125007 153157 80850 -6963 -115671 -136098 -172119
6900 -172119 -170840 -78266 -74885 -94535 -102666 -68440 34159 14279 -40244 -64911 -55370 18832
6888 18832 80038 18107 -64127 -245332 -211709 -120987 -191288 -169646 -96486 -3167 211273
6877 211273 229124 115989 56597 125340 111441 -35128 -53659 -12009 8980 -5189 -85545
6866 -85545 -121625 -108296 -33565 32879 34688 -40825 -90247 -59712 -62529 -69459 -85076 -20381
6854 -20381 -165 20629 74827 -872 -5320 -23467 -2925 -38759 13102 -18739 -10857 92835
6842 92835 152118 -52004 -126358 -172107 -154966 -152038 -181427 -133565 -91186 -24271 39469 23963
6830 23963 -1366 33645 35678 100154 120967 7569 2539 11851 27306 27914 8368 -6175 69626
6817 69626 93287 114678 145512 74249 113011 149834 107026 6693 -38238 -28700 -59654 -28282
6805 -28282 -16742 -15545 -7317 166253 126679 121631 2738 -21672 18973 66990 76614 83479
6793 83479 59241 10234 -54418 -113499 -189884 -176093 -117930 -122848 -108305 -99536 -153184 -170331
6781 -170331 -127670 -150362 -143756 -135109 28712 -5417 20421 133490 13088 -58513 -14388
6770 -14388 -83044 -183573 -148221 -9635 98984 50813 -119822 -228493 -211336 -157577 -115502
6759 -115502 13902 -60404 -32064 136367 249107 224389 78789 -29322 -64716 -208538
6749 -208538 -299842 -212600 -166634 -87307 86007 140104 124124 165135 75619 -58462 -17986
6738 -17986 -38557 -42817 -74603 -102138 -122085 -19078 41672 34198 -86536 -82365 5624 -4043
6726 -4043 75194 137713 170271 181350 229485 126636 4268 -91615 -122603 -174964 -190690 -239759
6714 -239759 -187907 -24233 73925 67765 12599 -26620 -47473 -40834 24590 79469 -61736 -60018
6702 -60018 -1182 -13077 56480 -5399 44250 91546 -3075 121098 189952 19849 -63860
6691 -63860 -18465 -21872 -167423 -174675 -41014 39491 76277 37248 -35185 46351 100825 -31185
6679 -31185 -101344 -36145 -44277 -111416 -113102 -133590 -151850 -473 -48936 2774 -36523 -143964
6667 -143964 -69605 -9432 -46486 -15110 54260 -7139 -59567 -53732 -126782 9017 115067
6656 115067 128385 181383 51054 -16936 42943 56377 115152 103293 145539 194778 129842
6645 129842 71542 136584 50093 -4696 -83382 -226134 -332465 -192861 -79494 34143 -33117
6634 -33117 -78489 -89354 21338 69620 17277 26227 -460 -36121 64992 72134 16456 -7185
6622 -7185 -54370 -143050 -156432 -202941 -290093 -277692 -225543 -170698 -70917 -43076 -105277 -116178
6610 -116178 -154266 -184474 -216234 -185811 -95622 38910 39307 -6707 214804 264781 164761
6599 164761 224451 170902 110733 107561 27756 -37738 -53260 -96158 -153448 -98058 -49593 -33280
6587 -33280 -79601 -40128 -80713 -73668 -18258 74479 141972 157843 57000 -18510 -59731 44495
6575 44495 81044 20325 -16779 36548 63148 22720 -18075 -12402 49221 -114809 -126537 -16328
6563 -16328 -6789 -44905 -116740 -155546 -190056 -356361 -399382 -291069 -353136 -204342 -57536
6552 -57536 75202 68518 22953 -73847 -89381 42486 66347 47004 -17848 86158 145676
6541 145676 118164 95215 31539 -59512 -14203 100836 111929 -20404 -23264 16956 30068
6530 30068 -54551 -131858 -126364 -73990 -104256 -97442 -96875 -61660 -80658 -68404 -108538 -149168 -79498
6517 -79498 -34230 -98815 18103 105659 -56409 -52291 105341 77348 90974 -17536 -5225
6506 -5225 31808 102346 71630 -31602 -97591 -25129 -117207 -144959 -197997 -195362 -197624 -207421
6494 -207421 -174598 -77719 -47776 19968 60505 71626 109848 63927 42665 93306 133939 141936
6482 141936 123922 156682 167022 66853 127178 61689 -82729 -128928 -9586 31515 15342
6471 15342 131027 34341 -44311 -31036 -35959 -41736 -80200 -11849 16947 51527 2345 -56702
6459 -56702 -99437 -96341 -95116 -177829 -160176 -22948 -69134 -77967 -1349 -42954 -39220 52432
6447 52432 68876 10964 -75438 -208797 -234247 -153862 -68516 -182253 -209455 -113351 33948
6436 33948 94538 37509 -79546 -59910 -21711 -77231 -22259 -51908 -44968 -106375 -121369 -12994
6424 -12994 -114065 -138689 -168439 -66791 16109 159505 262252 182332 156142 77376 -19447
6413 -19447 -108142 -86193 20293 106199 40029 11651 38695 -50608 -78438 -16278 21133 -26591
6401 -26591 -29316 16531 -92410 -126873 -229689 -269261 -99760 -42915 -104498 -67453 -138413
6390 -138413 -165217 -110983 -187605 -150207 -82436 -67409 -29370 1435 30605 -34561 -99084 -45064
6378 -45064 -2196 71776 94732 124063 149322 59508 43063 70419 34842 155028 254252 328387
6366 328387 191549 110511 87523 74847 27732 -20135 52113 139628 137517 -12691 -76940
6355 -76940 44277 63397 -9891 -125409 -135045 3527 -7144 -34146 34367 83248 189754
6344 189754 212163 222448 171029 63898 28202 69539 83779 43863 -19730 -104483 -29890
6333 -29890 124411 40659 40070 149708 207397 95567 35580 -23066 -77221 -110508 57714
6322 57714 128280 167646 216304 240311 153016 103159 86038 106533 58988 33392 100380 203937
6310 203937 127283 48574 159649 199816 166056 142114 117800 65238 31468 8847 -19575
6299 -19575 -63273 -90997 -22440 112414 157608 176995 168765 42882 74053 -13518 2803 -7805
6287 -7805 -83693 -156485 -84523 -55318 -98529 -54374 34763 162451 186115 189349 185531 137854
6275 137854 95277 150 46542 63155 -75550 -97282 -142868 -149908 -180785 -44733 24115
6264 24115 80269 74614 49992 162557 178315 53108 -36111 -85393 -116709 -23895 -104662 -119184
6252 -119184 2107 75049 21631 -23901 -123651 -120582 2465 -18017 -55534 16232 -117617
6241 -117617 -150216 -33133 58863 24036 -17460 -10493 19655 7206 78046 81082 -66883 -125492
6229 -125492 -6124 8892 -11031 319 -91984 -137727 -63511 -101262 -131431 -34414 44256
6218 44256 -31932 -6914 22658 25711 41218 32291 39036 106275 74810 597 1263 10749 -15729
6205 -15729 -3866 -52751 -40680 -109785 -93091 -62705 -76773 40909 24417 98642 -28696
6194 -28696 -145005 -121609 -164487 -173881 -121572 -197001 -153602 -120681 -75041 -12460 10119 -26363
6182 -26363 36625 68263 -33974 -129623 -22514 -3605 -62980 -156235 -140998 -113966 -13891
6171 -13891 21268 37239 -23258 -61462 77033 52434 69125 157072 99554 -19133 -110359
6160 -110359 -104373 26691 96805 -21901 -48030 9716 137390 113479 95845 87078 -23527
6149 -23527 -125462 -68800 -58872 -120872 26814 120600 80208 -36160 -154272 -178569 -134484
6138 -134484 -126420 -39989 52485 105197 57451 160604 262649 118951 91779 45963 59691
6127 59691 22166 50235 -26806 -46151 -103775 -127110 -95414 -154807 -178126 -123391 -161209 -52407
6115 -52407 31182 115045 141182 127625 28678 -21526 26406 35727 -84140 -124651 -59571 -123108
6103 -123108 -223946 -239031 -222415 -174940 -139177 -51056 -146036 -129861 -87164 0 32450
6092 32450 -28662 -56637 -142638 -121930 -45771 -10981 -88771 -89514 -162636 -52054 -38000 -125624
6080 -125624 -100753 -91209 -115436 -136100 -66201 -90828 -65706 60594 85778 -24700 -31529 -100520
6068 -100520 -167830 -181909 -165913 -119598 -194348 -155412 -44570 15461 69861 95533 47286
6057 47286 193825 196101 80353 29300 -34329 -105640 -110046 -149443 -150013 -123757 -36188 35463
6045 35463 -21717 28353 102336 68240 -49095 -129208 8917 58240 29422 13128 -93867
6034 -93867 -56953 -47456 -126021 -108915 -142046 -191081 -115276 -44019 -1649 17429 56202 27000
6022 27000 40278 -51845 -83919 -79876 -122592 -106913 -65134 -58126 4635 16574 -9352 -67112
6010 -67112 84035 138817 81904 99911 37215 -106673 -196943 -154021 -95034 -1997 -28409
5999 -28409 17266 -6505 50480 138804 109425 152800 166924 56383 42376 -88530 -114866
5988 -114866 -170248 -133760 -109704 -54354 -58815 -27965 -20914 71899 42589 87770 23271 -57810
5976 -57810 -204133 -111861 24060 107594 129657 83722 -7258 -63303 -71947 -50211 62141
5965 62141 -4505 -14608 -118865 -66735 -29184 -98280 -60861 -29371 17599 -91633 -193290
5954 -193290 -54070 -6155 23118 -20405 217 33702 -44282 -76385 -132731 -190027 -159496
5943 -159496 -27375 -24707 48519 104311 80125 3423 -122045 -126645 -36026 18991 20416 34917
5931 34917 88303 -58517 -78038 37442 27526 -38672 -224233 -107266 44959 35743 -75374
5920 -75374 -125220 -159580 -144202 -53914 89266 173056 36751 -102682 -127995 -45877 86805
5909 86805 157639 181622 161014 144896 45004 3971 19674 -18745 -28757 15152 -40053 -67126
5897 -67126 -25391 29588 3868 -4979 100053 95013 23276 28610 26264 -70881 -162084 -127707
5885 -127707 -61128 -38585 104630 95101 -48757 -122869 -195975 -189623 -143415 206 149924
5874 149924 140120 65116 -22557 -25532 -30019 36616 107346 57689 98588 38056 -20216 -87918
5862 -87918 -102266 -128635 -258463 -329378 -271417 -172025 -64881 9316 53587 5309 -53660
5851 -53660 -152682 -29557 67818 176628 175365 69800 -79962 -102396 -32975 -135719 -247810
5840 -247810 -136483 -46190 3875 -84792 -76806 -81878 -76478 69376 53250 18576 -45461 -42988
5828 -42988 -102406 -75358 10363 -34424 -130647 -132862 -40837 -61026 -84564 6232 11342 96733
5816 96733 39377 -19117 121348 156336 143046 19511 -11045 233 29325 88680 71076
5805 71076 102771 153331 98045 86689 96075 11601 11975 -23483 56549 86738 17085 -69532
5793 -69532 -158100 -127498 -111115 -112408 109465 227008 161565 167195 143167 122467 11694 -14659
5781 -14659 23147 57152 146210 96688 -8694 154494 234856 184034 170885 116098 115824 193321
5769 193321 145235 115597 127997 21701 -25641 4516 56644 93805 86627 24185 63225 118263
5757 118263 136884 51389 -68140 -92919 -24540 -10341 -30681 2601 69108 71837 -3117 -54608
5745 -54608 -139000 -86704 -41780 -117655 -40612 -12104 10512 -37453 -55328 40155 32417 51566
5733 51566 -21619 19554 130136 164324 149882 70142 80201 37332 47187 -47098 -44254 -9759
5721 -9759 50368 67276 -54798 -152126 -118287 -58260 1197 122881 283015 165223 64208
5710 64208 150553 204060 230948 134212 10976 -22406 -45187 46339 14720 -82445 -170781 -170130
5698 -170130 -191379 -160099 -55664 67329 156583 120326 61355 -49796 -45585 3822 -77772
5687 -77772 -25424 78126 37720 19484 2129 -78781 7568 170661 170474 120730 149298 199853
5675 199853 123198 128544 119140 253947 283773 165601 239451 264242 219631 72533 -36206
5664 -36206 -63219 14069 -28662 -86409 -100916 -90280 -136675 -115785 -112388 -100994 -135539 -120808
5652 -120808 -91994 -40875 37025 -15277 -230293 -227280 -139283 -123650 -99585 -121014 -67275 -98669
5640 -98669 -14467 24061 43664 55623 46794 36644 84255 8713 -26369 22959 73040 86977
5628 86977 49428 1013 -166203 -163098 -41854 38774 8260 71115 67243 62135 5036 -48306
5616 -48306 -42948 31936 63181 -9998 -73652 -173391 -104244 -98294 -109340 -84404 -33972 13073
5604 13073 55594 -43225 -45806 19067 50252 125323 53680 -17634 -60297 -128580 -122285 -119418
5592 -119418 -144958 -103277 16806 152542 184283 192188 234837 176871 29115 62082 13258
5581 13258 -73724 -45490 73988 13441 23632 -145107 -274716 -185262 -74475 -908 5752
5570 5752 -68165 -57399 -121064 -274227 -322277 -224691 -152620 -115609 -181316 -343594 -287782 -29160
5558 -29160 24222 36217 23461 -10523 38555 328 -97423 -31495 -50193 7495 -94977 -140590
5546 -140590 -22660 49366 66174 47424 78158 11536 -22031 -28859 -117936 -201680 -229395 -264499
5534 -264499 -108596 -19455 -86540 -133553 -98892 -64943 18538 44519 8852 -83163 -11530
5523 -11530 12652 112371 29191 -215447 -158300 43687 67105 51487 42927 -4094 -2989 -121544
5511 -121544 -52994 31277 39075 144009 145123 141624 111534 4814 -41699 78414 129324 65230
5499 65230 18215 58182 69232 1192 28854 -21671 30369 168233 246760 328624 299999 241717
5487 241717 78148 31635 163538 103907 23217 14185 -71536 -18839 -15567 -18734 -5748 -65748
5475 -65748 -106479 19533 31869 19920 119091 72357 37152 154620 215044 124021 52653
5464 52653 -24792 -83985 -32451 -6126 -5136 16846 56640 55311 -30874 -136532 -124586 71681
5452 71681 141611 74397 -54733 -57554 -19292 -31822 69603 163057 171133 122366 28510 38003
5440 38003 -78254 12008 99481 12682 -52286 39029 6086 -23681 68517 43184 -76368
5429 -76368 -109796 29604 190557 112592 18261 82569 87012 78335 157230 213995 94380 -35936
5417 -35936 -88096 -50482 -47206 -67541 -10841 -36949 -147782 -197257 -254298 -145739 -71625 -21192
5405 -21192 -55097 -79727 -140661 -159366 -50959 73653 102808 34409 97924 132538 129138 56983
5393 56983 122855 22142 -53770 -119835 -7355 68235 36307 45239 -10292 -69422 -39467 -54087
5381 -54087 -173830 -190639 -264269 -185696 -104371 -128756 -191591 -120099 -97847 -81236 -23610 -75984
5369 -75984 -138474 -131788 -138705 -117462 -98161 -111205 -142417 -233159 -260866 -320815 -164409 -65531
5357 -65531 -33660 -43688 -98707 -149005 -108837 2366 148895 132076 106616 -3424 -32422
5346 -32422 -162647 -106561 74260 78507 27533 -117113 -112387 -77288 -111527 -95543 -129611 -242672
5334 -242672 -247187 -87759 -3967 -60883 -60275 -37729 -1256 677 -91417 -126982 -108207 -101451
5322 -101451 -34444 -58615 -9252 65318 48553 100940 101357 56234 60955 120 31599 35304
5310 35304 85957 82230 73486 64797 23367 13922 90768 111187 108605 35904 -21068 3248 -60663
5297 -60663 -88093 -146789 -16336 129549 71730 3639 17488 -53651 -93144 -75381 -76062 -47850
5285 -47850 -82871 -262945 -195117 -61496 -110792 -245694 -264408 -191820 -105840 -58848 -8344
5274 -8344 -91358 -101410 46442 55679 -73585 -558 97515 139835 23668 -35987 46318 95039
5262 95039 92369 76252 111089 122654 88241 -49639 95497 219853 220742 171740 233757 174847
5250 174847 133377 74014 104819 140784 18913 -27323 -29246 29654 113303 42411 -67128
5239 -67128 -146760 -51991 64838 97461 137438 226867 236383 196946 116411 28431 33199 68855
5227 68855 -65945 -47904 -33145 -73973 -77012 -24110 29291 42784 126501 10020 -82773 -195682
5215 -195682 -132776 -66374 -32897 -27284 -31178 -30338 67025 54768 75127 -12660 -63707 -3917
5203 -3917 81124 24838 -28876 -24339 -66108 -57158 56130 85396 88175 30050 76805 69421 165892
5190 165892 129069 65292 -30800 -76860 4774 42088 17261 -20022 76011 148164 179367 82051
5178 82051 51920 23743 67849 77155 54662 -34735 -25815 -75867 59671 31678 -57715 -64471
5166 -64471 -24669 -87962 -220228 -111782 -41892 -119120 -124344 -82806 20719 -52772 -109621
5155 -109621 -170344 -217803 -266509 -190151 -83003 -33903 -55680 -88807 -145472 -146787 -120684 -86170
5143 -86170 -1360 38339 142717 108745 -19036 -88761 -114367 -31226 -101940 -138611 1972
5132 1972 -73725 -46732 -24731 -194730 -161510 66159 200044 126636 105695 3384 -51693
5121 -51693 -63708 -66495 -166029 -100104 -8329 44601 72008 -81047 -11053 36782 106656 126242
5109 126242 94856 7934 16011 -23643 -87865 -224601 -213724 -192348 -138008 -37372 -61963
5098 -61963 -104380 -26044 -37262 -55963 47151 23570 40665 29907 -71532 -94503 -64989
5087 -64989 -64787 47413 97772 183483 241588 117482 -23003 47262 168985 161947 210978 216853
5075 216853 118882 33030 15697 44231 170403 306638 333518 185430 28396 -57021 -59198
5064 -59198 -93750 -75345 6453 -48512 -79119 -62755 -113394 -192324 -106970 -36653 -57574 -2411
5052 -2411 24107 25897 66356 -13918 1914 -18466 15133 -31653 -82046 -76750 -33167 -31486 -34708
5039 -34708 2205 -10787 -55173 -164240 -134052 -31955 -61261 -70813 -93071 -19589 -20743 -2552
5027 -2552 51618 48188 4689 -36911 24916 244076 271908 205178 168116 105832 41855 -6201
5015 -6201 -95456 -110028 -176809 -182765 -111674 -88750 -60964 25190 44015 10435 72575 -18570
5003 -18570 -3834 65719 23844 -32298 10240 -19068 17766 28369 -32171 -37252 -95674 -80101
4991 -80101 -67107 -86605 -7920 -75641 -144704 -127179 -14581 47712 -34120 2638 -55940 -84149
4979 -84149 -102467 -29078 45327 25015 87219 231501 169074 45499 -97279 -81099 39325
4968 39325 146363 162535 149577 151144 126834 46427 -85915 -191143 -181422 -85681 -34229 12762
4956 12762 4591 124720 188206 122951 130048 38542 -45 122324 166101 131207 -39619 -41588
4944 -41588 -63349 -30269 33617 116481 20021 -115128 -166041 -172112 -169706 -96017 -68453 -40953
4932 -40953 -31259 30046 51483 -82624 -185959 -165301 -121733 -237899 -321896 -219378 -98518
4921 -98518 13156 -2386 -52287 -6668 42542 -83650 -149719 -120228 -49280 -60306 1874
4910 1874 -43856 64104 109361 109518 147694 74787 43085 45854 16006 -3880 3530 28003 97721
4897 97721 27049 -76261 -167041 -69487 25344 68512 -56433 -172460 -136987 -112045 -119629
4886 -119629 12197 58062 -48485 -58835 -84473 -250237 -271151 -209596 -196146 -143587 -106755
4875 -106755 -70310 77651 189442 188696 192381 69333 12762 -48556 -86362 -12984 -1729 -21605
$$ [...]
##END NTUPLES=NMR SPECTRUM
##END=
