##TITLE=Analysis number 319769
Compound Code cc 04546
Book Reference 444/142
Project Code adrs
Chemist Name howarde
##JCAMPDX= 6.0         $$ Bruker NMR JCAMP-DX V2.0
##DATA TYPE= NMR SPECTRUM
##DATA CLASS= NTUPLES
##ORIGIN= Bruker BioSpin GmbH
##OWNER= nmr
$$ XWIN-NMR		Version 3.5
$$ Fri May 26 11:01:52 2006 GMT Daylight Time (UT+1h)  MAYBRIDGE\nmr@NMR_250MHZ
##.OBSERVE FREQUENCY= 250.131544655141
##.OBSERVE NUCLEUS= ^1H
##.ACQUISITION MODE= SIMULTANEOUS (DQD)
##.ACQUISITION SCHEME= undefined
##.AVERAGES= 16
##.DIGITISER RES= 18
##SPECTROMETER/DATA SYSTEM= dpx250
##.PULSE SEQUENCE= zg30
##.SOLVENT NAME= CDCl3
##.SHIFT REFERENCE= (INTERNAL, CDCl3, 0, 16.522)
##AUDIT TRAIL= $$ (NUMBER, WHEN, WHO, WHERE, WHAT)
$$ ##TITLE= Audit trail, XWIN-NMR		Version 3.5
$$ ##JCAMPDX= 5.01
$$ ##ORIGIN= Bruker BioSpin GmbH
$$ ##OWNER= nmr
$$ C:\u/data/dgb/nmr/ADRS/5260/pdata/1/auditp.txt
$$ ##AUDIT TRAIL=  $$ (NUMBER, WHEN, WHO, WHERE, WHAT)
(   1,<2006-05-26 11:01:18.01 +100>,<MAYBRIDGE\nmr>,<NMR_250MHZ>,
      <created by zg, POWCHK disabled, PULCHK disabled
       configuration hash MD5:
       84 BC 41 DB A1 6E 1D 46 DA 25 12 A5 C1 ED C5 3A
       data hash MD5: 64K
       05 1F 97 3D 87 69 41 51 47 05 3D DC F2 4A 75 C2>)
(   2,<2006-05-26 11:01:36.15 +100>,<MAYBRIDGE\nmr>,<NMR_250MHZ>,
      <Start of raw data processing
       ef LB = 0.3 FT_mod = 6 PKNL = 1 SI = 32K 
       data hash MD5: 32K
       40 4B 48 F4 CE E0 03 D6 09 D0 0B 22 02 98 EF 2E>)
(   3,<2006-05-26 11:01:40.50 +100>,<MAYBRIDGE\nmr>,<NMR_250MHZ>,
      <apk 
       data hash MD5: 32K
       23 CB B1 20 5B 38 EB C4 56 AF AE FE 17 88 1F 07>)
(   4,<2006-05-26 11:01:42.06 +100>,<MAYBRIDGE\nmr>,<NMR_250MHZ>,
      <abs ABSG = 5 
       data hash MD5: 32K
       C1 F6 0F 56 04 D0 7B C4 B1 0E EF 65 D3 3F A7 70>)
$$ ##END=
$$ 
$$ hash MD5
$$ 8A 6C C1 DB 99 17 DD 86 2F BC 49 E1 6B FD 73 EF
##$RELAX= 
##$RELAX= 
##$RELAX= 
##$RELAX= 
##$RELAX= 
##$RELAX= 
##$RELAX= 
$$ Bruker specific parameters
$$ --------------------------
##$DU= <C:\u>
##$EXPNO= 5260
##$NAME= <ADRS>
##$PROCNO= 1
##$TYPE= <nmr>
##$USER= <dgb>
##$AMP= (0..31)
100 100 100 100 100 100 100 100 100 100 100 100 100 100 100 100 100 100 
100 100 100 100 100 100 100 100 100 100 100 100 100 100 
##$AQSEQ= 0
##$AQ_mod= 3
##$AUNM= <au_zg>
##$AUTOPOS= <14 >
##$BF1= 250.13
##$BF2= 250.13
##$BF3= 250.13
##$BF4= 250.13
##$BF5= 500.13
##$BF6= 500.13
##$BF7= 500.13
##$BF8= 500.13
##$BYTORDA= 1
##$CFDGTYP= 0
##$CFRGTYP= 5
##$CHEMSTR= <none>
##$CNST= (0..31)
1 1 145 1 1 1 1 1 1 1 1 1 1 1 1 1 1 1 1 1 1 1 1 1 1 1 1 1 1 1 1 1 
##$CPDPRG= <>
##$CPDPRG1= <>
##$CPDPRG2= <>
##$CPDPRG3= <>
##$CPDPRG4= <mlev>
##$CPDPRG5= <mlev>
##$CPDPRG6= <mlev>
##$CPDPRG7= <mlev>
##$CPDPRG8= <mlev>
##$CPDPRGB= <>
##$CPDPRGT= <>
##$D= (0..31)
0 1 0 0 0 0 0 0 0 0.06 0 0 0 0 0 0 0.0002 0 0 0 0 0 0 0 0 0 0 0 0 0 0 
0 
##$DATE= 1148637675
##$DBL= (0..7)
120 120 120 120 120 120 120 120 
##$DBP= (0..7)
150 150 150 150 150 150 150 150 
##$DBP07= 0
##$DBPNAM0= <>
##$DBPNAM1= <>
$$ [...]
##$SUBNAM7= <"">
##$SUBNAM8= <"">
##$SUBNAM9= <"">
##$SW= 20.6930455092707
##$SWIBOX= (0..15)
0 0 3 0 0 0 0 0 0 0 0 0 0 0 0 0 
##$SW_h= 5175.983436853
##$TD= 65536
##$TD0= 1
##$TE= 294.16
##$TE2= 300
##$TE3= 300
##$TEG= 300
##$TL= (0..7)
0 120 120 120 120 120 120 120 
##$TP= (0..7)
150 150 150 150 150 150 150 150 
##$TP07= 0
##$TPNAME0= <>
##$TPNAME1= <>
##$TPNAME2= <>
##$TPNAME3= <>
##$TPNAME4= <>
##$TPNAME5= <>
##$TPNAME6= <>
##$TPNAME7= <>
##$TPOAL= (0..7)
0.5 0.5 0.5 0.5 0.5 0.5 0.5 0.5 
##$TPOFFS= (0..7)
0 0 0 0 0 0 0 0 
##$TUNHIN= 0
##$TUNHOUT= 0
##$TUNXOUT= 0
##$USERA1= <user>
##$USERA2= <user>
##$USERA3= <user>
##$USERA4= <user>
##$USERA5= <user>
##$V9= 5
##$VALIST= <valist>
##$VCLIST= <CCCCCCCCCCCCCCC>
##$VD= 0
##$VDLIST= <DDDDDDDDDDDDDDD>
##$VPLIST= <PPPPPPPPPPPPPPP>
##$VTLIST= <TTTTTTTTTTTTTTT>
##$WBST= 1024
##$WBSW= 4
##$XGAIN= (0..3)
0 0 0 0 
##$XL= 0
##$YL= 0
##$YMAX_a= 361721
##$YMIN_a= -499619
##$ZGOPTNS= <>
##$ZL1= 120
##$ZL2= 120
##$ZL3= 120
##$ZL4= 120
##$ABSF1= 16.522
##$ABSF2= -4.171173
##$ABSG= 5
##$ABSL= 3
##$ALPHA= 0
##$AQORDER= 0
##$ASSFAC= 0
##$ASSFACI= 0
##$ASSFACX= 0
##$ASSWID= 0
##$AUNMP= <proc_1d>
##$AZFE= 0.1
##$AZFW= 0.1
##$BCFW= 0
##$BC_mod= 0
##$BYTORDP= 0
##$COROFFS= 0
##$CY= 12.5
##$DATMOD= 1
##$DC= 0
##$DFILT= <>
##$DTYPP= 0
##$F1P= 14.0000005364418
##$F2P= -0.99999901652339
##$FCOR= 0.5
##$FTSIZE= 32768
##$FT_mod= 6
##$GAMMA= 0
##$GB= 0
##$INTBC= 1
##$INTSCL= 1
##$ISEN= 128
##$LB= 0.3
##$LEV0= 0
##$LPBIN= 0
##$MAXI= 10000
##$MC2= 0
##$MEAN= 0
##$ME_mod= 0
##$MI= 0
##$NCOEF= 0
##$NC_proc= -3
##$NLEV= 6
##$NOISF1= 0
##$NOISF2= 0
##$NSP= 0
##$NTH_PI= 0
##$NZP= 0
##$OFFSET= 16.522
##$PC= 1
##$PHC0= 171.7562
##$PHC1= 0.07921032
##$PH_mod= 1
##$PKNL= yes
##$PPARMOD= 0
##$PSCAL= 4
##$PSIGN= 0
##$REVERSE= no
##$SF= 250.13
##$SI= 32768
##$SIGF1= 0
##$SIGF2= 0
##$SINO= 400
##$SIOLD= 32768
##$SREGLST= <1H.CDCl3>
##$SSB= 0
##$STSI= 32768
##$STSR= 0
##$SW_p= 5175.98343685301
##$SYMM= 0
##$S_DEV= 0
##$TDeff= 65536
##$TDoff= 0
##$TI= <Analysis number 999999
Compound Code 99
Book Reference 9
Project Code 9>
##$TILT= no
##$TM1= 0
##$TM2= 0
##$TOPLEV= 0
##$USERP1= <user>
##$USERP2= <user>
##$USERP3= <user>
##$USERP4= <user>
##$USERP5= <user>
##$WDW= 1
##$XDIM= 32768
##$YMAX_p= 324426507
##$YMIN_p= -83907
$$ End of Bruker specific parameters
$$ ---------------------------------
##NTUPLES= NMR SPECTRUM
##VAR_NAME=  FREQUENCY,     SPECTRUM/REAL,   SPECTRUM/IMAG
##SYMBOL=    X,             R,               I
##VAR_TYPE=  INDEPENDENT,   DEPENDENT,       DEPENDENT
##VAR_FORM=  AFFN,          ASDF,            ASDF
##VAR_DIM=   32768,         32768,           32768
##UNITS=     HZ,            ARBITRARY UNITS, ARBITRARY UNITS
##FACTOR=    0.157963299565203, 1,           1
##FIRST=     4132.6476996994, 0,             0
##LAST=      -1043.33573715361, 0,           0
##MIN=       -1043.33573715361, -83907,      0
##MAX=       4132.6476996994, 324426507,     0
$$ Real data points
##PAGE= N=1
##DATA TABLE= (X++(R..R)), XYDATA
$$ [...]
20714 538823 550614 551210 570230 578276 624949 681472 735989 782273 843969 909126 949340 958235
20702 958235 968261 1003887 1038343 1094348 1187318 1287426 1379456 1468270 1549479 1667717 1821892
20691 1821892 1996855 2218357 2471759 2791043 3198505 3757136 4547258 5671908 7307240
20682 7307240 9635956 12821159 16664835 20616277 24036273 26348994 27088274 26068929
20674 26068929 23701873 20990850 19104695 18721927 19956962 22458831 25471362 28171756
20666 28171756 29868011 30009002 28330426 25093800 21170698 17591154 15020394 13512460
20658 13512460 12878672 13028923 13991528 15859665 18708892 22269092 25952593 29055038
20650 29055038 31006146 31361891 29918813 27160108 24191195 22150806 21697742 22856747
20642 22856747 25213311 28000170 30386143 31677597 31334177 29121879 25399484 21060381
20634 21060381 17119688 14113449 12009802 10519567 9457956 8642104 8000637 7459338
20626 7459338 7031632 6655216 6332629 6079978 5851312 5632593 5422248 5219246 5022607
20617 5022607 4877352 4737333 4590270 4449576 4326668 4202152 4069035 3926607 3767812
20608 3767812 3659197 3531638 3421146 3329357 3258194 3177667 3093545 3002921 2897624 2756299
20598 2756299 2629062 2540650 2447002 2352261 2267791 2192617 2148742 2091641 2057303 2036566 2018707
20587 2018707 1986136 1921282 1867376 1803072 1726412 1650534 1603805 1565642 1544135 1532509 1516608
20576 1516608 1497150 1454992 1406910 1329393 1264600 1225311 1178728 1121644 1067938 1035022 984564
20565 984564 941580 910478 881714 859866 840410 809243 772664 747394 701195 696810 684895 652952
20553 652952 621932 615084 609235 603342 587225 554793 545013 531168 507218 479805 469521 475439
20541 475439 454504 443438 418184 416085 405795 424603 427010 393676 385119 372312 344296 326301
20529 326301 327286 298248 284944 277064 265197 252123 242648 239938 237721 238815 249792 258136 246439
20516 246439 206076 183534 185172 169677 157578 165492 173665 172624 170804 167139 165564 162380 161980
20503 161980 154186 128647 115410 120628 132952 131927 115477 127037 143196 139997 144653 148183 129027
20490 129027 136492 156364 152428 143136 125522 115060 121844 124971 121305 116675 125463 127965 113854
20477 113854 114398 120722 112657 93220 72770 81697 112640 122567 99627 94556 93260 78079 70414
20464 70414 70223 82891 86278 94223 107766 108066 106156 90144 88247 74261 72915 67460 63374 68632
20450 68632 64602 71941 80569 84288 66973 51169 47631 41492 50771 80763 98918 94552 86919
20437 86919 79198 73502 107919 130109 105905 88481 85115 74598 68229 59091 49474 45322 57038
20424 57038 48627 60773 60884 64343 85920 98057 90834 76577 75898 76103 64858 52333 46392 42313
20410 42313 48098 42491 52686 62282 62991 66494 52503 40200 41219 42589 25994 18184 22275 11883
20396 11883 38579 46409 54550 45272 12461 20721 38164 40136 33360 35517 31396 16488 32233
20383 32233 17591 19065 38766 31544 28478 17830 14039 33887 37646 27579 14974 11012 5440
20370 5440 15906 7250 33325 53214 24918 26476 21347 23150 19347 7306 -15783 1018 7672
20357 7672 17834 30881 26729 17836 2117 -15079 -23355 -10497 6859 19297 15977 -7739 -16325
20344 -16325 -10515 -34294 -13339 4019 7104 19913 9447 -4014 -9383 -6363 -10897 -21762 -13507
20331 -13507 -9248 -35351 -30643 -6510 4708 10670 8906 1248 19608 12194 -840 9593 -9486
20318 -9486 -30810 -16610 7045 13388 18631 21251 6099 12819 11627 8115 6856 -5394 1852
20305 1852 1936 -14334 -15501 -26973 -15824 -15362 -18221 -16496 -3638 -12782 2082 20088 21671 11914
20291 11914 9441 22119 10077 9611 8788 12162 20265 17093 15100 4164 2481 122 -337 4213
20277 4213 665 -8723 -42578 -48032 -25462 -262 10772 -13195 -29370 -32446 -20536 755 3901
20264 3901 -13458 -21578 -20455 -21282 -3701 7175 -932 -4982 -2004 2985 -1672 -4603 -6949 -4185
20250 -4185 -5648 2628 -7395 -1434 4937 -1782 -7910 -4656 6661 18290 6046 -7535 5596
20237 5596 -2985 -15259 -11433 -1827 -5953 5985 23968 6898 -16903 -14725 -8403 -12669 -24648
20224 -24648 -31239 -40782 -22241 -4387 3816 4128 7009 3136 17546 35142 39021 39423 27709 34232
20210 34232 31256 37060 30339 8477 16139 33235 31159 18540 12654 47252 54183 28892 18355
20197 18355 20630 6358 399 9653 14670 21546 18188 7217 -992 -22492 -28950 -3594 10597
20184 10597 9185 -1400 -18544 -12827 2336 -3886 -5073 -11909 -12801 -18743 -5598 20275 13647
20171 13647 7390 262 5645 11229 6504 20556 47704 38278 17195 3863 1885 10086 22861
20158 22861 36110 27983 14596 11789 32146 19293 11882 7965 3991 11402 10377 10509 -5542
20145 -5542 2893 -214 -19980 -20444 -6130 32 16127 5865 -1602 -13931 -7996 -16092 1956
20132 1956 -3243 14407 37052 29816 39424 25137 23281 32755 45641 46848 46859 40726 52254 42732
20118 42732 39850 47423 55836 92359 107974 116618 121260 129295 139368 162697 150070 152661 148314
20105 148314 129142 127153 153789 177201 161876 158056 177003 172601 156161 130857 111175 100748
20093 100748 81646 72042 69719 78349 100479 111074 120352 117220 147844 170786 186872 183662 171977
20080 171977 143361 133888 131628 145842 157250 153630 173024 200886 203623 190708 175798 146178
20068 146178 106326 78329 72079 78793 65284 41831 38241 45977 37290 32057 28746 32991 60701
20055 60701 54082 51646 49763 39982 40701 33153 43112 50120 30517 27271 31142 29548 55467 51986
20041 51986 39562 34977 8980 -1497 17253 27152 31199 17266 5146 1493 11631 26686
20029 26686 27482 9396 18567 9133 7554 23773 26639 29075 26425 18916 28456 40780 42522 21688
20015 21688 14036 4351 898 -9277 -4606 7355 17094 17737 20725 31525 31104 11950 10087 26520
20001 26520 34256 41576 55990 73195 77573 89637 94874 109847 130456 128207 158795 159230 146540
19988 146540 144647 135907 120928 122570 128735 135282 139366 146968 139819 145551 149109 111204 70080
19975 70080 66358 60299 53032 50010 50173 65252 62416 49269 78513 74863 58680 36625 7137
19962 7137 6929 37598 55405 46886 51076 34044 29234 20371 10721 11507 13681 26438 47295 66048
19948 66048 90785 100253 88351 94180 98876 115084 143386 168502 169334 167019 175334 164018 153720
19935 153720 135072 147613 169210 170330 174880 165938 168671 175943 178196 153582 140086 138365 116231
19922 116231 95701 86688 96755 96811 85530 70903 90791 93219 90947 96560 110510 112545 103448
19909 103448 120220 143537 146028 145197 183656 196034 183791 169613 174184 180992 178606 181154 170219
19896 170219 146456 120625 109765 100810 100985 93419 79682 62626 54447 65724 100277 97899 80245
19883 80245 85604 79333 49672 37757 41734 37826 27176 26426 26337 17653 18075 15733 13332 19880 39229
19868 39229 31913 53543 63861 56271 31762 43742 60424 77004 71698 74254 78360 82785 110092
19855 110092 119720 142492 159108 161358 175187 194482 220738 230412 240970 245985 236839 220712
19843 220712 203343 202942 202759 179420 147409 126798 93111 57306 46237 62220 78592 77558
19831 77558 66970 59652 47484 24322 15300 11753 -5867 3443 14127 25390 26528 27219 25941
19818 25941 22500 18538 19696 22279 29067 27820 28982 33261 33030 29116 39067 36526 39102 49597
19804 49597 45528 35398 35104 14888 24610 31607 22025 16330 20412 14792 13904 16769 20821 28370
19790 28370 27426 33469 43725 27519 18075 27975 24491 25737 26034 32785 49505 39925 46104 47744
19776 47744 34064 24206 23136 26394 28503 24088 18065 14456 1096 2086 3381 -3113 -18083 -6748
19762 -6748 2663 12161 11135 18248 37381 53824 40827 11229 13498 11899 11658 42446 41235 34994
19748 34994 36117 46697 47319 30545 31774 33946 28499 41604 53971 51419 48940 65699 60591
19735 60591 50301 49259 48790 69931 68307 62594 72729 59067 31849 35573 60094 66041 46928
19722 46928 24242 17009 18125 32921 38061 3446 10543 16808 615 2435 14982 28812 28598
19709 28598 30330 14645 15579 20590 21688 31996 31947 22279 28973 24423 16035 7651 19565 14320
19695 14320 8732 36725 47590 48093 57592 68078 71363 68095 71472 61125 44069 25964 21511
19682 21511 20764 45034 58535 60671 58666 71044 74994 62059 37169 16157 18715 25921 32331
19669 32331 48968 43247 32282 28456 31694 46308 31242 13266 30369 36825 52241 58169 37239
19656 37239 49178 58409 56198 65728 65197 47747 42743 54782 74331 69783 55306 69334 80035
19643 80035 91855 78392 57088 58886 67855 89016 93252 84782 99480 100431 93062 71761 62729
19630 62729 70476 84479 84834 85508 76461 82850 71103 71383 66884 74430 73935 48584 57036 60990 78645
19615 78645 104031 105227 115739 108672 108137 120670 137788 159919 146253 129177 117110 124847 135447
19602 135447 126103 133003 149437 180023 202365 194661 175284 172449 171497 150343 156954 150789 129890
19589 129890 138797 132002 115625 95079 85507 116454 124602 104041 89050 99506 95919 88908 107805
19576 107805 118905 127284 142751 130398 126035 120263 125612 120441 133063 139126 143572 140493 145230
19563 145230 150478 162079 194436 216529 213012 194181 203444 235975 244703 235150 245098 258074 247929
19550 247929 255564 241768 228719 253189 283503 304699 303338 284647 266609 294458 301319 288801
19538 288801 298396 290045 279634 296870 288781 284166 289146 297424 294739 325248 343799 353969 353560
19525 353560 376053 383446 385698 407988 448170 483288 518095 563127 593335 618116 640149 665796
19513 665796 689208 713772 743912 770555 813345 880371 947866 1027253 1118138 1202061 1298723
19502 1298723 1430400 1559377 1731297 1927530 2149928 2424914 2810039 3371116 4196744
19493 4196744 5450840 7224934 9454565 11901252 14465452 16925032 18937465 20407888
19485 20407888 21437993 22074773 22499131 22883510 23066490 23071750 22985404 22903975 23079292 23414635
19475 23414635 23658967 23693770 23405144 22789750 21784702 20164651 17958822 15442482 12851309
19466 12851309 10586164 8965390 7870225 7101454 6540040 6147686 5841303 5560414 5328440
19457 5328440 5163333 5006804 4867840 4752168 4660418 4575604 4509323 4514238 4511099 4543735 4612833
19446 4612833 4748727 4930196 5192925 5620724 6301697 7340473 8921124 11024556 13472636
19437 13472636 16151619 18865138 21239522 23099727 24514121 25542465 26210944 26719942
19429 26719942 26992742 26950299 26705250 26267543 26004928 26166670 26520903 26827828 26909638 26591934
19419 26591934 25901224 24594916 22480263 19850333 16866219 14007116 11838529 10396801
19411 10396801 9474164 8857654 8435222 8184434 8076112 8127407 8369526 8795483 9544816
19402 9544816 10770469 12546811 14931908 17862460 21199178 24745547 28275856 31454579
19394 31454579 33992752 35725981 36619219 36592693 35583066 33601606 30922320 27875217
19386 27875217 24735800 21637384 18651496 15915274 13627714 11851712 10537154 9603651
19378 9603651 8891500 8316074 7840961 7443995 7110855 6807054 6503426 6243533 6017060
19369 6017060 5822602 5684556 5549924 5413533 5296439 5215971 5125958 5055060 4987158 4905011
19359 4905011 4847818 4835679 4862152 4898903 4980004 5101899 5283632 5549803 5955304 6539756
19349 6539756 7421959 8741347 10600622 13104810 16260332 19989341 24130300 28450077
19341 28450077 32625671 36308864 39252965 41227679 42150491 41875258 40358317 37756923
19333 37756923 34450860 30842625 27115915 23380238 19824837 16666340 14118058 12207102
19325 12207102 10786142 9737703 8947981 8325362 7777906 7258253 6799097 6411363 6069967
19316 6069967 5772885 5491155 5222072 5001821 4813061 4617618 4423994 4220002 4051984
19307 4051984 3898961 3763378 3624944 3476985 3331171 3205197 3094317 2981379 2877345
19298 2877345 2771974 2681255 2603751 2518201 2425139 2381110 2335465 2274853 2222241 2204301 2199694
19287 2199694 2215226 2206398 2201391 2188624 2173961 2141322 2087078 2015591 1970181 1941124 1887452 1835586
19275 1835586 1792753 1741227 1680053 1627212 1567702 1497309 1423939 1347730 1279663 1219957 1151336
19264 1151336 1103696 1058412 1036295 997751 956610 924640 927578 921554 898004 893455 872598 834947
19252 834947 802227 784313 764862 750477 720905 702738 696105 675074 633619 629155 626113 625702
19240 625702 602715 597307 595568 600664 612433 631943 644326 650578 683677 713979 769057 793712
19228 793712 802232 808456 817138 815087 789212 766993 755558 726133 698809 683117 640486 602768
19216 602768 570757 508924 450437 432218 410847 378886 367626 338526 325919 324667 327567 311357
19204 311357 277862 288134 304497 309665 296294 278707 268615 249486 239215 241545 227025 231394
19192 231394 212450 192327 179273 175301 190395 216833 209518 202023 194568 204832 201146 195253 200106
19179 200106 176232 162324 166675 173889 173153 161641 175989 194831 190259 176644 158934 151711 142276
19166 142276 129206 127918 126666 130321 141241 134584 136561 145092 156026 143366 139716 147406 152254
19153 152254 136624 149481 172132 176572 170437 159529 151144 141249 127011 126025 130263 145902 158132
19140 158132 157114 133029 112744 104727 106527 105045 114690 115712 101779 82317 85216 81957 70491
19127 70491 66476 76569 86450 95748 97916 90469 88627 100225 113872 98385 96195 120929 128639
19114 128639 128212 142006 153540 167126 148201 126526 114110 106851 110256 97013 80264 78492
19102 78492 84200 82436 87049 83688 97446 103799 99818 85107 79426 83034 89680 96505 86084 90322
19088 90322 97543 114149 116102 95916 90830 103154 89492 67955 53691 71673 100916 83943
19076 83943 77350 82725 70839 69364 77560 92016 73955 67790 75583 62867 63596 62157 71725 82802
19062 82802 74063 89316 99744 99884 89452 47649 58654 80096 96789 89525 70694 79140 79439
19049 79439 72779 88176 103334 108152 93263 79277 68478 72393 56721 51182 61053 71178 79417
19036 79417 77131 85864 81899 84222 79846 64013 54124 69159 63066 43984 44505 45407 52637 78290
19022 78290 88630 79177 74093 88823 74509 57976 48288 53127 55257 72756 84463 64779 74928
19009 74928 88931 93053 87353 91062 83267 72164 66932 79240 60270 79911 114757 129856 136288
18996 136288 129685 107100 124699 119471 148229 172609 172999 166432 171085 189657 215445 223478 216555
18983 216555 208677 207010 206958 218654 245894 266294 261527 284510 308606 329431 334625 346626 338249
18970 338249 322013 301417 298618 302274 296119 296773 310276 322515 331999 357676 341007 306918 297462
18957 297462 290564 310012 309739 293176 281841 279970 265895 245566 248382 251867 253332 252540 251632 258849
18943 258849 268426 281573 267135 265968 265227 265344 252578 255688 259748 258091 272782 281220 282239 262234
18929 262234 281921 299209 308757 316150 313671 336190 389473 411432 440863 471733 509106 526804
18917 526804 524890 530870 557848 550535 555476 555806 559843 603155 631525 645405 678808 716444 732922
18904 732922 762694 777553 769973 793379 802153 802941 847363 866201 880496 921180 962972 1031497
18892 1031497 1118865 1207727 1316611 1402163 1501140 1630030 1778673 1941798 2104571 2279442
18882 2279442 2471890 2722513 3014462 3360910 3807606 4439205 5303758 6423370 7847873
18873 7847873 9612140 11676415 14071656 16736275 19549617 22433873 25334230 28123710
18865 28123710 30648822 32838847 34709028 36345370 37720543 38909087 40001098 40987414
18857 40987414 41938448 42928707 43988212 45019160 45754244 45916186 45405098 44331969 42768867
18848 42768867 40636693 38015519 34956029 31583023 28108390 24810734 21833067 19195272
18840 19195272 16881210 14877497 13232199 12008337 11101668 10415271 9859782 9416557 9046365
18831 9046365 8698396 8379454 8097718 7858002 7674132 7550164 7482166 7476834 7518908 7623240
18821 7623240 7756162 7893902 7998400 8020699 7994228 7877871 7665280 7382284 7079664 6791193
18811 6791193 6540345 6328563 6157446 6056322 5979827 5950152 5995704 6089555 6251229 6521788
18801 6521788 6987073 7761559 9029519 10981523 13712447 17225828 21376744 25716958
18793 25716958 29566558 32322555 33522713 32906952 30751711 27603683 24326000 21833102
18785 21833102 20434661 20308131 21419460 23325253 25388328 26993701 27676657 27152590
18777 27152590 25409133 22721479 19535939 16467185 13872832 11821245 10336832 9355549
18769 9355549 8700441 8203460 7809168 7479630 7153807 6842497 6540337 6279989 6067069
18760 6067069 5859909 5688737 5569998 5480381 5424086 5392460 5361479 5347870 5307713 5264549 5260318
18749 5260318 5327529 5476599 5732350 6183668 6927598 8120504 9916849 12352977 15390466
18740 15390466 18837037 22247100 25013903 26703878 27055459 25954515 23768865 21063166
18732 21063166 18655889 17088192 16544010 17147676 18704167 20711869 22572533 23806868
18724 23806868 24082491 23188078 21216419 18495752 15538801 12849350 10628344 8937222
18716 8937222 7731528 6875361 6267556 5808092 5455517 5169967 4912759 4666250 4449733
18707 4449733 4252326 4077371 3895979 3715822 3559791 3404379 3248293 3120859 3014344
18698 3014344 2896419 2780515 2700532 2619537 2535934 2457775 2386627 2309129 2213516 2132887 2049464
18687 2049464 1984411 1956178 1900460 1824798 1763420 1733703 1689407 1630957 1585362 1550511 1508847
18676 1508847 1463606 1426323 1376809 1334083 1293682 1251971 1181181 1130217 1100768 1092782 1063051
18665 1063051 1043466 1029885 1016225 990796 953254 932286 914328 877595 828361 791355 764150
18654 764150 725427 707280 700604 681670 675441 646104 635197 643695 616508 598892 564724 533932
18642 533932 528862 506664 472444 463600 443406 456276 462349 449489 446127 461309 463259 452121
18630 452121 438895 418658 400935 383439 374228 386547 375906 355147 337850 338118 350759 348316
18618 348316 334092 307008 291786 281399 271650 274851 282893 301810 302857 306553 288556 282998 295336
18605 295336 285413 289207 305461 309241 306948 313438 309364 314930 330458 346674 363298 383568 430327
18592 430327 459848 459963 470339 502729 535406 546723 547397 562844 569843 584004 596736 622905
18580 622905 636447 639382 625284 621401 624427 638149 671053 678581 690259 686114 670344 674116 647150
18567 647150 602941 552539 486482 447915 423166 401350 387122 386521 370444 361003 365177 368575
18555 368575 357183 333262 309393 290542 274418 256831 240348 232973 217234 196516 195558 174901
18543 174901 152015 160742 163264 191237 200590 185648 169346 163297 183564 174799 167254 153398 139961
18530 139961 149042 151844 157100 175209 185944 205372 218308 243505 251390 266099 296083 315513
18518 315513 337630 341822 343597 339886 315223 297254 282067 268720 252057 245472 252870 258758 248865
18505 248865 253165 263710 266025 249919 217231 197210 185989 182258 195617 172930 147956 133558
18493 133558 113516 110545 110366 111342 128637 134302 134272 130951 130865 121017 102112 86613 71862 73807
18479 73807 86129 73174 76088 81428 79773 70814 76087 90069 101538 108364 116878 127436 129024
18466 129024 133380 123636 109994 93035 64620 51037 41972 40929 43890 35878 40428 27825 12437
18453 12437 24786 36002 36726 55741 53786 67575 93587 123331 143881 155485 147677 127684
18441 127684 120154 106597 106261 93490 69959 47165 50509 69778 72792 76099 75838 58976 44348
18428 44348 29436 28039 50321 49086 53927 90083 117584 139903 151764 158267 163711 174833 176530
18415 176530 165231 137877 116725 99087 77282 66041 76171 96039 115737 117276 123799 114819
18403 114819 120187 119658 129395 132779 139807 144758 163760 186700 197031 199240 188225 208953 221882
18390 221882 200221 184996 182659 163581 133660 136604 148621 151683 148997 147802 156754 175130 190695
18377 190695 204354 225769 245724 243847 253096 258871 248883 248517 281686 300439 335110 355604 382686
18364 382686 434593 475696 486487 490801 508855 528721 540656 553473 579606 589007 593454 586611
18352 586611 594466 614712 634160 654605 684588 697329 720914 770601 826762 896790 920957 918582
18340 918582 936056 947601 957507 983319 1038862 1119627 1224566 1357462 1535745 1748291 2024558
18329 2024558 2381902 2822803 3429361 4312892 5703611 7905145 11225956 15627467 20525382
18320 20525382 25048868 28415008 29865491 28805477 25306619 20434713 15647387 11947886
18312 11947886 9454642 7809755 6729730 6021052 5557047 5270430 5091791 5020359 5031053
18303 5031053 5099356 5255350 5558615 6064172 6875649 8217515 10373677 13614477 17890849
18294 17890849 22583639 26799873 29798431 30857081 29454149 25737822 20848638 16199922
18286 16199922 12640612 10260457 8707293 7644702 6949674 6534384 6265236 6145272 6123239
18277 6123239 6186101 6371961 6699935 7269968 8231109 9813428 12318781 15826961 20009132
18268 20009132 24166951 27526857 29380489 29142182 26656776 22494388 17907630 14006019
18260 14006019 11235751 9380072 8122147 7292861 6733761 6356633 6090774 5912696 5850633
18251 5850633 5871515 5960231 6151186 6512637 7157021 8205667 9889832 12482803 16035526
18242 16035526 20136954 24094804 27187605 28724903 28133385 25332554 21062128 16574364
18234 16574364 12876033 10263616 8497831 7310558 6488433 5887580 5406319 5047073 4784421
18225 4784421 4560061 4373470 4217267 4087147 3983863 3892159 3750199 3618949 3467454 3310360
18215 3310360 3141743 2964042 2800431 2666979 2541958 2434295 2335500 2237875 2157384 2091203
18205 2091203 2008233 1926734 1857582 1798791 1746231 1704126 1661064 1627989 1589025 1579956 1585608 1586097
18193 1586097 1570827 1552109 1502429 1441352 1381217 1303227 1243310 1219432 1180013 1136632 1087188
18182 1087188 1043177 1015010 980458 939021 903693 893935 867024 834682 801400 758074 727702
18171 727702 722604 704994 670268 636205 613170 606032 577484 548436 537223 512483 512101 503914
18159 503914 519315 548085 519498 505768 516634 510958 478905 458681 441101 434261 429447 409436
18147 409436 400362 387777 379643 368507 337031 332032 338862 316537 306483 322782 303105 298886
18135 298886 332686 342742 370655 380727 395520 406737 408859 425489 449240 467071 466830 467591
18123 467591 502402 547327 575638 592057 638961 730500 846205 964717 1105146 1310724 1605941
18112 1605941 2083847 2811709 4033848 6238288 9873337 14123364 16882355 18479861
18104 18479861 19617927 18776231 13623141 8743563 6028255 4546256 3658003 3087332
18096 3087332 2701114 2396289 2172037 1997509 1859279 1746592 1650987 1589622 1509882 1454737
18086 1454737 1366875 1280834 1201330 1132460 1092065 1057649 1006855 976745 951142 931980 887633
18075 887633 870626 831362 783558 743615 726197 690287 670093 654610 637780 613989 592835
18064 592835 587634 580344 564496 549142 521567 502961 511571 486998 465887 458075 456661 444585
18052 444585 419191 392900 374277 370847 382093 368156 334908 322692 318771 326465 306354 301056
18040 301056 286632 283432 279338 256214 252114 236896 206819 198312 207377 200412 196950 193396 201673
18027 201673 209090 214147 214241 187444 178314 186820 199806 195797 190755 172713 164036 152434 151418 181556
18013 181556 183044 157444 152811 150664 155335 164340 156415 139626 125633 118653 101135 82029 83159
18000 83159 81963 69017 81469 96053 93271 76527 70741 60818 52126 43470 47902 49337 53156
17987 53156 55379 57818 69556 62144 49135 44841 33121 39938 40964 49485 28315 22877 33309
17974 33309 50731 50684 53099 47421 25414 24867 10055 2407 6811 5418 23177 26347 31443 38429
17960 38429 38673 35470 35214 44372 38486 27556 9927 -1371 -16412 -23837 -7951 -14098 -9045 -1518
17946 -1518 -1914 -1105 3079 11736 5535 -21150 -8363 1787 -24018 -26126 -8878 -12994 -15542 -3039
17932 -3039 1944 -3942 8160 12202 20338 23825 34930 22943 25836 11719 -16008 -3393 6146
17919 6146 13027 34515 20819 22320 17312 99 1564 6741 -3452 -11242 -28191 -35163 -19782
17906 -19782 -17275 -7829 2799 11779 27374 23914 20370 18621 25642 21350 -2508 -12660 -7281
17893 -7281 -17341 -32502 -38592 -46801 -27300 -2782 17203 6523 -3048 13284 12329 3974 -1301
17880 -1301 -7302 -8479 -14683 -25284 -31777 -28634 -14712 -17614 -27191 -24882 -31211 -27004 -19467 -34024
17866 -34024 -49837 -58352 -49620 -49583 -44640 -22194 -13941 -6786 976 -2129 11434 9971 11970 3061
17852 3061 2275 -2132 5863 3309 -11084 -22698 -15559 -12248 -13419 -14040 -18319 -32447 -29390 -19713
17838 -19713 -18770 -11878 9926 15479 12964 4835 5570 789 -277 -13606 -25238 -20916 -2943 8838
17824 8838 -3371 -27257 -31850 -35089 -41630 -26224 -14100 -14796 6526 4600 -33334 -50432 -38815
17811 -38815 -22259 -27879 -34503 -21589 7614 20092 23483 17433 14892 17663 43195 61383 90170
17798 90170 124743 128207 110158 93809 53067 42691 41938 17334 13534 -3765 5830 7403 7916
17785 7916 9987 8620 -8027 3669 16580 15882 25675 41763 37159 22919 48437 70412 98978
17772 98978 116032 134994 164417 174135 156552 124777 91856 64985 57163 42866 18820 5743
17760 5743 10487 15473 2801 -8333 9700 32313 29330 11732 5598 22244 39634 50822 76501
17747 76501 118589 105656 102012 116134 115597 80899 63192 48434 12780 -14224 -7501 -5780 -8991
17734 -8991 -2658 19101 25087 -2080 -18166 5551 11797 13752 24402 32087 28849 39527 61192
17721 61192 89319 117998 139007 130880 126051 103142 86124 78455 60389 46212 28859 30228
17709 30228 34751 46679 53015 61406 60497 33925 4016 -4212 -12414 -11076 10502 26287 36833
17696 36833 18007 -7965 -10278 -10314 -1212 -425 3354 6631 -7665 -5588 13827 33839 27117 17969
17682 17969 -8687 -10805 -27723 -19785 -12102 492 -6695 -11495 9085 6270 683 -9914 -5838
17669 -5838 -8002 6411 21233 43632 40166 23750 -4934 -16666 -18137 -33159 -23282 -18923 -12094
17656 -12094 -14696 -20990 -18547 -14761 -25118 -36600 -40609 -31768 -21090 -9854 -17491 -5347 8444
17643 8444 7881 15284 17210 2635 3390 -7565 -18607 -22903 -20613 -13627 -22751 -7215 10742 7341
17629 7341 16778 25540 20505 7188 -10838 -20341 -13355 -10482 -3723 -11792 -39150 -36409 -34169 -28187
17615 -28187 -6113 9751 -2105 -10351 -13524 -15355 -2280 -2412 1624 -13457 -26657 -14757 -16230
17602 -16230 -23068 -29860 -29832 -32656 -36829 -37825 -31021 -24439 -24737 -39395 -29047 -27818 -34498 -11533 15067
17587 15067 22523 39782 34695 31569 37408 41200 49055 50746 44469 13409 -2462 -9597 -16237 -19086
17573 -19086 -22162 -15097 -2103 -17269 -31300 -19815 -13860 -3002 3461 -12035 -18842 -11313 -15668
17560 -15668 -13799 -7061 6376 4918 3163 6001 18966 23019 -3409 -16196 -18093 -28084 -36426
17547 -36426 -32524 -33661 -23608 5115 9991 16205 35322 19904 170 -48 -16628 -31588 -17131
17534 -17131 17405 36824 40688 46879 55112 51821 53679 55126 81728 81900 91636 103607 117704
17521 117704 118158 123607 134236 123499 107741 101142 99191 90548 88723 78878 75088 62549 35183
17508 35183 36542 48065 51585 28304 11355 4040 -5449 -9132 -1062 17600 21715 17716 -1416
17495 -1416 -33535 2741 32873 12682 2326 38110 72114 73093 74958 70361 56408 63328 84876
17482 84876 88406 93767 108667 112471 102884 102732 112837 112451 108865 98999 78503 63094 47026 40864
17468 40864 61244 64475 43043 48402 64928 73892 65926 61762 51040 25348 16108 16850 16374 13491
17454 13491 5562 13537 11169 1435 11274 12086 16360 13709 15940 18389 38844 40607 52527 82484
17440 82484 105135 99254 97807 111855 94151 74148 82101 88829 86236 79545 84690 73037 61680
17427 61680 58930 52318 29446 27751 24436 37284 51773 60061 63578 47928 36425 38781 45331
17414 45331 49761 53638 45843 31958 30608 19745 20101 28555 25807 17842 16234 12700 9591 6009
17400 6009 -6804 -15921 -17841 -887 -630 -4497 17045 28612 26793 15831 -504 -15692 -37236
17387 -37236 -46491 -50814 -58642 -49215 -29355 -17707 -18321 -9915 -1495 5122 7989 -568 -19573 -2937
17373 -2937 15363 15007 23268 5102 6182 4592 -6372 -7016 14453 27392 12733 24740 30233
17360 30233 1081 262 -2847 -4966 -16595 -10931 4419 26590 13992 749 7921 -9633 -27857
17347 -27857 -24169 -13118 -15416 -26841 -20102 2940 -4559 -22176 -34794 -33066 -26460 -16644 -2247
17334 -2247 6565 17847 27569 24764 26185 35437 47662 67311 54526 35873 31181 47777 80413
17321 80413 104347 109260 111685 118852 106999 84375 67722 66265 73586 63384 60528 80512 100128
17308 100128 118384 109093 106078 113109 103242 81170 72304 51185 49375 41713 22770 24989 29063
17295 29063 26508 17412 3879 8985 24184 22010 15042 23951 30850 5757 1051 9675 4343 11478
17281 11478 15491 19925 28977 36276 38695 49324 43873 23353 24501 19911 16755 8404 18847 14992
17267 14992 6099 8330 3073 6254 -16564 -21892 -18889 -17447 -13776 7765 -16716 -43808 -36138
17254 -36138 -4039 9599 4161 5221 7009 7776 11363 -6286 -18303 -9576 7784 10385 -670
17241 -670 -18592 -48926 -50118 -30672 -34491 -34682 -20597 11455 6250 -13149 -10705 -8536 -13757 -27209
17227 -27209 -19752 -15043 -8995 -13051 -39145 -46081 -40785 -22676 -16235 -17807 -772 -2441 207 -20104
17213 -20104 -30157 -24791 -38541 -31969 -9828 -15264 -16860 -1424 -7362 -10925 -12298 -25941 -4429
17200 -4429 8317 -1184 -6234 5303 8553 -12043 -29379 -33836 -27649 -26690 -16795 -15717 -21142 -19720
17186 -19720 -18872 2679 -2257 -4830 -14868 -28159 -42995 -37536 -39941 -30039 -18186 -7635 12501
17173 12501 16151 18220 8700 -19923 -17259 -21722 -27685 -18237 -15403 -4137 11474 2767 -14861
17160 -14861 -23258 -16625 -4654 -10900 -23551 -23164 -23015 -30496 -21393 -13076 -6319 -9908 -33093 -32497
17146 -32497 -30731 -27811 -13194 -1754 -70 -16958 -39223 -54007 -56751 -51108 -34931 -13783 6828
17133 6828 24231 30199 23437 -476 -15981 -28513 -25075 -33282 -26629 9438 38875 30205 -3797
17120 -3797 -11003 -3214 20230 26410 7647 -2646 589 10062 17360 33272 31459 15763 8756
17107 8756 5408 -3762 -14112 -32924 -25716 -11461 -24936 -17694 -6318 3425 -6452 -8673 -33745
17094 -33745 -51590 -39885 -16554 -9272 -10174 -19454 -22245 -32741 -33228 -3153 9092 -8903 -7363
17081 -7363 -754 -5819 -15465 -20050 -22689 -15691 -3834 -5860 13595 22637 35936 38476 24761 25640
17067 25640 6702 -7118 -14457 -34077 -39515 -33748 -3770 19216 14703 -10145 -19478 -26815 -15543
17054 -15543 -14304 -19672 -23983 -13535 -6357 -7031 -23136 -32825 -6086 -3419 -20110 -38045 -50436
17041 -50436 -36163 -44767 -46418 -52797 -51698 -26943 -24430 -19702 -3887 1483 -8938 -22657 -27823
17028 -27823 -51817 -57996 -63614 -62089 -43484 -31132 -31135 -12862 -6065 -14591 -2245 -13982 -31995
17015 -31995 -25803 -17864 -11458 -20472 -8568 -3229 -2698 -485 -6203 -32767 -38337 -21262 -8159 3027
17001 3027 6439 -6282 -18858 -18926 -17181 -26426 -28745 -24701 2243 11056 15583 18367 47 -19211
16987 -19211 -29368 -26149 -24559 -20797 -11913 -6835 -10677 -16968 -5974 -4174 -12013 -23340 -37726
16974 -37726 -38809 -18746 -14402 -3394 175 9956 10619 -5547 -9263 -1807 5403 -4207 -18489 -36928
16960 -36928 -59618 -37975 -12939 -15930 -21548 -20464 -7825 -25556 -30265 -32682 -38677 -40508 -48689
16947 -48689 -19709 -1266 647 -1421 204 -19413 -32510 -44444 -45935 -33195 -4968 3063 -1993
16934 -1993 -7264 -18602 -16916 -8002 -7122 -7261 -21702 -9975 4179 8164 7410 955 396 -22835
16920 -22835 -41538 -47052 -47587 -34292 -8293 4341 5490 11230 854 -10942 -19575 -1762 8403
16907 8403 -1176 -5283 -21055 -20789 -16208 -22964 -23421 -26466 -35786 -34658 -34762 -32899 -19525 -19935 -6909
16892 -6909 1887 -2080 -10692 -9823 5009 877 -10446 -29078 -32168 -36909 -21431 -21970 -41360 -23681
16878 -23681 -27728 -31184 -39272 -31269 -15496 -7152 -9559 -12742 -8894 -2732 2956 18818 -4967 -32035
16864 -32035 -31522 -16359 -5703 -26959 -34816 -12564 -6518 -33352 -31578 -19912 -27485 -14962 -8177
16851 -8177 -14795 -28138 -33688 -34625 -29004 -31752 -32055 -49476 -66940 -61258 -32235 -11876 -3924 -7351
16837 -7351 -6450 3468 4650 -4879 -22493 -24054 -36361 -39503 -36441 -33757 -23241 -3179 4279 -6213
16823 -6213 -14277 -29996 -19480 -15812 -878 -8666 -13455 1742 -6867 -29010 -24049 -16661 -16903 -12002
16809 -12002 -15703 -22873 -9659 2428 10875 22340 29130 36265 21561 18355 25158 39989 39872
16796 39872 36427 35482 19467 6496 34389 49452 24914 12410 16000 11970 -4267 -19341 7889
16783 7889 22402 27942 19187 16147 20351 14123 19582 7672 -13858 -28411 -21462 -6279 -7459
16770 -7459 10611 1044 19334 18041 9949 14446 -1950 5466 14022 20657 32610 35943 26033 33548
16756 33548 40563 41250 37627 53836 46350 40086 53318 50386 44666 47487 43789 38793 40117 30036
16742 30036 18804 81 -1544 -6914 4255 20573 1137 -22593 -33158 -13313 -4690 -1682
16730 -1682 6319 23251 15238 13986 24951 16867 -11761 -11507 6938 2091 -13704 -14782 -14706 2302
16716 2302 10911 18280 19692 10255 20151 19653 17067 14670 -7861 -5016 21080 31051 23503 2498
16702 2498 -17269 -26547 -29430 -11213 -8332 -15967 -35902 -34749 -20251 -29598 -31253 -6093 16900
16689 16900 20760 10476 -23473 -32401 -27945 -35722 -40175 -19947 -15341 -11585 -15350 -23925 -18392 -4027
16675 -4027 -665 -2951 10239 23465 26650 -1061 -41668 -38329 -27822 -27854 -41376 -42204 -30013 -33678
16661 -33678 -30357 -28028 -20986 -23819 -18042 -29121 -8708 -13138 -32824 -16357 -7229 -4333 -3497 -15879
16647 -15879 -27704 -12659 739 -6918 -13835 -3037 -9079 -3596 7649 321 4391 4912 -3333
16634 -3333 -10918 -13400 -19533 5812 26087 61405 88156 100817 103403 97451 101442 106927 96460
16621 96460 79575 72642 61417 56761 44414 46921 38696 29781 14145 16390 18678 10167 5508
16608 5508 2146 -8287 -9871 3563 -871 13511 -2525 -11257 -14501 -10296 -7742 -12028 -9249 9948
16594 9948 12734 5337 -1491 -850 12536 8885 -12338 -13997 -7605 -19487 -18879 -9781 6078 22683
16580 22683 53843 84159 105070 98978 84217 76083 80091 106078 109937 88857 99277 104667 84162
16567 84162 74956 75305 83050 93921 88036 70993 74764 79783 59824 46422 47881 63581 47957
16554 47957 23241 10413 24622 33342 35561 30685 32658 27728 4991 6965 7682 6877 30770 20565
16540 20565 -246 -1963 -5680 -10465 7309 -3366 -9394 2793 5715 2348 1279 -6482 15803
16527 15803 15166 9949 -9739 -13832 -4960 -7664 -5436 5814 11125 7335 26449 17256 -1758 20810
16513 20810 39331 28101 20642 24412 26842 37537 23628 17857 12227 16156 41574 56956 55183
16500 55183 60832 52045 32031 19604 25619 49936 54789 39092 21500 29344 22595 18799 18959
16487 18959 39992 42330 28544 9750 -16264 -8143 14758 6533 3469 -3398 6576 -1359 -11958
16474 -11958 -13742 -5451 -3725 -10760 -6351 2001 1464 4685 10801 -8337 -23523 -21518 -22703 -6667
16460 -6667 17727 34750 20648 5693 1364 -2405 -16556 -13666 6006 807 -1585 -10604 1884
16447 1884 -9781 -4818 -16796 -20281 -15701 -23288 -28060 -8696 -3253 -3910 -8357 2374 3876 -16094
16433 -16094 -43393 -59338 -66942 -67716 -46739 -30139 -41453 -47196 -38970 -34661 -34949 -28653 -29013 -16574
16419 -16574 -6070 -24201 -37484 -40110 -49686 -37671 -21738 -19367 -11143 -6695 -11290 -10306 -955
16406 -955 -14613 -29710 -27438 -35124 -47109 -29265 -3390 -1196 -8713 4078 24238 17348 -3345
16393 -3345 -21558 -41348 -44153 -37110 -29697 -24090 -13841 -10263 -15224 -23548 -22710 -21336 -19323 -21308
16379 -21308 -21183 -25934 -28259 -38059 -38940 -34617 -41369 -49991 -43161 -30092 -30705 -41865 -25298 -12025
16365 -12025 -14954 -14700 -17490 -38058 -40804 -39748 -29322 -17644 -7406 -22193 -35096 -26226 -10786
16352 -10786 -23998 -25227 -20988 -20800 -12568 -21819 -35803 -20335 -7564 3947 -22286 -30565 -38008
16339 -38008 -52057 -41354 -42992 -55603 -54802 -52229 -25889 -18528 -22151 -17078 1454 -8613 -11875
16326 -11875 -8481 8579 -6237 -9679 -22623 -27700 -21097 -19577 -24750 -11959 -4409 -9546 -23290
16313 -23290 -37713 -28835 -16166 -20725 -40847 -43610 -35913 -25948 -5656 3830 -8474 -35984 -39445
16300 -39445 -38952 -31348 -17148 -17165 2333 -9996 -26753 -36372 -28113 -44077 -69017 -68094 -51140 -54844
16286 -54844 -34067 -11017 -13634 -36597 -42260 -38496 -36088 -38331 -35532 -27966 -23474 -23258 -22701 -21986
16272 -21986 -27796 -38343 -44913 -44904 -45008 -41294 -23918 -13024 -33004 -37867 -25578 -33458 -43673 -48385
16258 -48385 -53972 -56173 -64126 -54055 -26246 -2163 -9327 -5096 -13012 -7036 -5282 -6727 -18302
16245 -18302 -31150 -15876 -12998 -16200 -13318 -30605 -24016 -4263 -13465 -16864 -12069 -15535 -20499
16232 -20499 -26712 -22827 -28282 -31918 -33070 -18363 -33403 -47402 -48232 -30327 -23354 -11918 10652
16219 10652 29362 36475 21179 21231 16729 2948 -11490 -13741 -12812 -11781 -26058 -22368 8689 16883
16205 16883 12228 -2990 -25222 -39906 -36825 -21319 -19961 -20082 -16949 -8088 -15332 -59082 -63294
16192 -63294 -40852 -39906 -48529 -36736 -22466 -10879 -12993 -30835 -45424 -45972 -37958 555 15489
16179 15489 7179 -9929 -13819 -20396 -29539 -13472 -3661 -9838 -28522 -19930 -16797 -38203 -45544
16166 -45544 -33780 -29071 -27597 -9916 -9634 -1824 -9606 -23191 -12734 -5976 -12855 -23931 -28469
16153 -28469 -24820 -12029 -3689 -14189 -22094 -21547 89 -4239 -22562 -22486 -10503 -31215 -46061
16140 -46061 -46771 -32634 -20716 -12203 -8172 -7128 -14230 -9004 5009 3647 -7345 -12861 -23402
16127 -23402 -33770 -30632 -40871 -58038 -51058 -36914 -26900 -16359 -26319 -38398 -31304 -33875 -47153
16114 -47153 -43744 -35887 -34234 -32358 -21969 -29934 -37727 -26718 -31411 -31151 -9610 -5894 -20954 -32929
16100 -32929 -21833 78 -6193 -15424 -4448 -4777 -21729 -49038 -47376 -33806 -34164 -31291 -23089
16087 -23089 -5909 -3183 -15602 -25510 -32619 -26612 -45854 -46417 -42111 -44817 -47986 -28551 -29947 -41267
16073 -41267 -27645 -14826 -7451 -10961 -33865 -26974 10034 30655 5023 -21352 -5820 -7707
16061 -7707 -11860 7206 19099 26321 16482 12536 3109 9434 13069 11658 -11249 -15859 -8243 -977
16047 -977 -12690 -12114 -14947 -18295 -5033 -6747 -8319 -11755 -15038 -17378 -20786 -6409 13252 21537
16033 21537 6733 -17978 -44677 -52311 -43970 -16821 -9510 -23266 -27450 -13045 -8499 -5233 10126
16020 10126 12834 22108 22443 6887 -7333 -11961 -25708 -22461 -33944 -32576 -34824 -14286 -13637 -9553
16006 -9553 5673 19057 12113 -4176 -4279 12563 15721 6472 -1081 -13751 -24759 -33513 -24224
15993 -24224 -8889 -22694 -47497 -44639 -40706 -35897 -15124 2970 9014 7355 10127 3211 -8913
15980 -8913 -9693 -8404 -8863 -11359 -19220 -31408 -22761 335 1330 -13695 -35171 -11355 11342 8266
15966 8266 14875 13757 -6051 -15766 -14751 -21315 -20905 -8601 -13938 -26869 -22485 -16027 -21335 -15638
15952 -15638 -4193 -9530 -18385 -2915 672 1076 -3510 -9676 -21877 -30748 -8755 -1268 -6676 -16144
15938 -16144 -15350 -17325 -23544 -20897 -23798 -15935 -7221 -18429 -13894 -23231 -34048 -40471 -28484 -18399
15924 -18399 -22410 -17983 -9989 -4154 -26129 -59700 -47660 -38770 -31347 -25015 -28587 -35457 -31856 -25126
15910 -25126 -32875 -33721 -28963 -31117 -28466 -27164 -22557 -7982 -22530 -23960 -17149 -11707 -8851 -16513
15896 -16513 -12314 -16277 -34880 -28730 -27179 -10738 5035 12503 6651 -3377 -10634 11158 26586
15883 26586 18667 29455 3863 -13295 -12504 -25403 -37650 -25936 -14846 -8774 -9131 -9451 3243
15870 3243 12098 15101 9358 14254 29835 35678 31073 12227 1279 -2705 7506 14029 -12185
15857 -12185 -20187 -21830 -13005 -9305 10338 21261 17352 18335 20780 27309 29204 26642 12361 -10264
15843 -10264 -21390 -18792 -22424 -13001 -13739 -5272 -1042 1411 1253 12968 6004 -10139 -30824 -42798
15829 -42798 -42626 -19319 -9873 -15339 -10431 -9444 -10084 -7767 -12837 -13397 -6966 -26162 -16055 -10714 -8849
15814 -8849 -8785 -3684 10076 10930 -3311 -904 -3942 -10452 -1787 11255 16383 29154 15638 35
15800 35 -3522 -3094 -10479 -21958 -13966 -994 -3526 -18159 -3884 -10897 -28886 -20629 -23806 -21778
15786 -21778 -14268 -5854 -25174 -39280 -40246 -40053 -33894 -41851 -46392 -26070 -14308 -14316 -809 -10217
15772 -10217 -5343 4414 5079 -352 -10010 -18189 -26887 -33255 -10966 -9976 -21791 -3485 9642 2345
15758 2345 -13582 5596 2461 517 -66 -3062 -16209 -10990 -25050 -24543 -8238 -14104 -21819 1864
15744 1864 -4475 -22125 -26407 -12880 -3594 -3956 -28014 -47993 -22052 -12960 5756 12801 9216
15731 9216 7238 -5358 -12585 -23619 -35538 -23727 -9879 -191 339 1718 5689 95 6440 3714
15717 3714 -8090 -9536 4005 2545 -9753 -23648 -17832 1079 9621 -2793 -8117 -4427 -7645
15704 -7645 -19973 -12039 191 -7359 -18477 -9615 7733 -28940 -45664 -33710 -8166 -14161 -29819
15691 -29819 -20684 -9709 -8788 -1711 10408 14883 13663 -8617 -19876 -20868 -13813 -23906 -17310 -9126
15677 -9126 -16800 -15018 -24736 -22058 -45006 -52107 -54695 -35196 -14068 -4956 20198 30234 22074
15664 22074 8721 14038 23713 24456 20444 34097 24463 -1223 -21456 -20731 -12597 -770 22467
15651 22467 44185 24857 -732 -7766 -18017 -17577 -21952 -16574 -14053 -15853 -21877 -18245 -12937 -28785
15637 -28785 -26591 -19132 -21381 -41561 -45166 -29206 -18320 -4137 6143 2922 147 5198 14610
15624 14610 19821 29526 23094 14838 1028 -6458 -16155 -7960 -39127 -52976 -34433 -22712 7605
15611 7605 10079 -18237 -34607 -45162 -48261 -35606 -19240 -12791 9340 11757 8761 4416 -15663
15598 -15663 -36318 -10768 -1764 5180 7672 -16072 -24236 -18434 -4538 24984 34948 33288 37978
15585 37978 41259 35643 28085 37193 37353 21403 17882 40520 46795 41960 15908 26134 14989
15572 14989 9203 -1334 -33792 -15709 -3407 -4159 -4805 18135 16767 2431 -5092 12788 22443
15559 22443 19346 18152 24084 30833 30727 34943 33093 957 -821 -2040 12453 26454 38897 26642
15545 26642 7056 22131 36351 28208 11826 -2065 -7829 -2811 10115 7555 8739 27427 36995
15532 36995 38396 20887 6822 19575 18731 9030 9387 -1989 24626 35252 26263 27906 44187
15519 44187 26448 19503 33109 34166 40120 23003 27526 34983 26275 17706 4195 -11213 2218
15506 2218 5835 21157 7869 -9379 -21453 -2246 11105 7418 973 13739 18239 20629 10702
15493 10702 7653 5479 14760 26498 16745 5027 13050 23535 22716 -17384 -21693 -8139 5635
15480 5635 21298 28919 22034 233 1457 26806 31523 21962 1155 1081 6454 11528 12119 2554
15466 2554 1624 13126 10882 -13343 -21615 -14849 -6214 -13629 -4819 -5019 -4400 -11136 -16325 -25939 -29219
15451 -29219 -30797 -14687 5163 -5280 -20088 -25830 -28764 -18199 -2008 4137 -1179 -17965 -10839
15438 -10839 3795 -515 12593 23146 3055 1085 14505 24390 28047 11987 1439 1098 8642
15425 8642 8034 -3410 -14230 -5982 -8383 977 8670 -930 6022 16440 9583 -11876 -5031 -2764
15411 -2764 1778 16498 11543 -4333 -16761 -4574 -7030 -5075 8488 -932 -18067 -6586 2468
15398 2468 -18112 -33684 -25244 -7532 -4504 -8286 -14942 -29705 -28353 -16475 12039 9943 -2922
15385 -2922 3342 15439 9693 -11251 -31413 -25638 -11347 -7672 -24507 -45486 -48232 -22194 -7387
15372 -7387 7814 14289 3410 -15103 -9645 -3260 -16546 -32907 -11453 1438 -1231 -17702 -27842
15359 -27842 -23080 -19904 -24572 -25838 -18636 -10286 -11961 -19047 540 6261 9796 2049 -1746 -6428
15345 -6428 -16797 -19191 -19460 -9484 -16640 -2790 11675 19967 21845 3799 1376 2673 -2816 8197
15331 8197 -9550 -15998 -27182 -28605 -28262 -11194 -3554 -26649 -25159 -23525 -35757 -21560 -26545
15318 -26545 -28096 -28865 -27121 -17506 -20966 -9218 6296 15772 18929 18409 21305 9701 14161 21836
15304 21836 17124 14283 6785 1864 1610 740 531 -8087 829 7680 -5695 3874 8585 -267 244
15289 244 19883 26183 6292 -10990 -9932 -1785 -8358 -2379 8835 10889 -9294 -26098 -23183
15276 -23183 -26548 -12283 275 4471 -4433 -17975 -14989 -21427 -16266 3512 12097 1122 -8944
15263 -8944 -19575 -12073 775 9638 17182 35204 23954 7875 12022 11953 3663 -12047 -18834 -18284
15249 -18284 -9446 -9396 -9432 -7485 -821 -5746 -6782 -27881 -31901 -24999 -9456 -5642 -4362 -17471 -15682
15234 -15682 -10255 10619 18136 5248 -7691 -13586 6935 8910 732 -10242 -1024 1608 -3854
15221 -3854 -18547 5380 24635 7990 -9964 -16061 -7629 -6516 -22717 -26317 -17177 -3491 -18339
15208 -18339 -6596 13898 -8115 -16026 -18646 -8681 -6741 -8796 -15119 -18597 -27600 -14959 836
15195 836 5831 9468 -6458 -15939 -16518 -12632 -8495 -9554 -24815 -17159 -14631 -11063 -19152 -14499 1493
15180 1493 -941 -3053 -5516 14777 21567 -5367 -2807 -20753 -54235 -49866 -50419 -58678 -50872 -32565
15166 -32565 -11386 5684 10063 1327 -9907 -19370 -32896 -35653 -28623 -14214 3151 12873 11129
15153 11129 417 6793 -495 -3685 5817 -5772 -19834 -32470 -36634 -20268 -6793 -4579 2625
15140 2625 6765 8926 -11611 -24706 -6055 369 -7368 -5908 -17227 -27105 -19655 -20917 -45380
15127 -45380 -51132 -26943 -8954 -6575 -20498 -25349 -922 93 -119 3336 4018 3727 6273 -1837
15113 -1837 -1431 4012 3433 8128 6323 -3002 -8519 2252 4453 9350 23107 9146 3565 14747
15099 14747 15207 14504 14761 19940 13261 13160 -5122 -19503 -27821 -26355 -12113 -4650 -17570 -24256
15085 -24256 -41257 -24158 -9519 -21642 -10608 -12137 -5050 -8300 -4394 1672 446 -7176 -15620
15072 -15620 -23093 -28382 -29249 -31127 -13954 -22303 -27544 -10517 -14465 -9856 8705 5356 2616 6068
15058 6068 9312 10720 4512 2137 2705 2048 2887 38 4786 3925 23961 10215 1234 12988 21940
15043 21940 -1178 -35712 -38394 -14007 9830 14756 -29 12759 17049 26056 29683 27526 12160
15030 12160 11513 11005 24684 13570 -12447 -7023 5797 15591 8719 4639 -7616 -12373 6225
15017 6225 15042 21178 9053 8747 18242 23851 6279 -20691 -9973 -13893 -21311 -2543 994 4226
15003 4226 -10225 -3587 20742 35430 30643 21086 24936 4360 -23019 -27387 -26474 -26434 -30019 -13847
14989 -13847 10753 9783 -6300 -5189 11939 20680 11898 -2026 6061 -9837 -27397 -23477 -4574
14976 -4574 -693 -2544 -2674 -1104 6959 6355 -9679 -25880 -23641 -6293 -14669 -46856 -35686 -41401
14962 -41401 -61277 -47405 -23424 -14819 -14786 -12544 -6798 -2639 7252 14481 6289 -8200 719 1918
14948 1918 -7062 3238 -5695 -14309 -26907 -30756 -32230 -28981 -4915 8500 3647 -27053 -25593
14935 -25593 -6809 -10125 -12011 -16667 -4967 -682 -5374 -15249 -26907 -40773 -50353 -58851 -65657
14922 -65657 -36326 -15913 -35410 -30699 -31452 -25708 -29522 -15424 -4805 -16005 -18898 7495 21279
14909 21279 7178 11117 949 -12594 -20658 -25696 -15833 14228 16634 11447 -2970 7848 -4517
14896 -4517 -16455 -12361 -14129 5029 5116 -3652 -4303 -13737 -15975 -17005 -18121 -3567 1261 13517
14882 13517 27536 8860 -18412 -24726 -18329 -1089 23113 18795 -6856 -25998 -12844 -13152 -10981
14869 -10981 5393 3460 3695 854 2361 5444 5966 25259 30584 11369 9976 8434 15324 8454
14855 8454 -16687 -26481 -22428 -20109 -25422 -13387 -22695 -21989 -21966 -11326 -21044 -23620 2447 9655
14841 9655 13596 -3608 -9386 7462 -4394 -6168 -13632 -23797 -33144 -21615 -19233 -26381 -16473
14828 -16473 -8440 -5456 -11845 -17966 -19997 -2590 1594 4602 8449 632 15957 22157 1703 -20375
14814 -20375 -32443 -47813 -44682 -29537 -17768 -11955 -14255 -16243 -27543 -31215 -32166 -22663 -13538
14801 -13538 -4369 5523 2331 19207 23184 14500 3350 -19244 -12040 -18954 -18114 -13560 -23387 -29084
14787 -29084 -31415 -12646 -22723 -23609 -21889 -25046 -17702 -26266 -19765 -26711 -17235 -11787 -21364 -21471
14773 -21471 -18523 -19460 -43246 -42083 -30098 -4694 5477 7651 9440 5470 -15611 -28462 -12685
14760 -12685 -4081 -6867 -3257 -94 3024 6736 4311 4620 10839 5743 7545 -8097 -11779 -3775
14746 -3775 3944 -4905 -5028 1830 -249 -3518 -5190 -1774 9000 29604 9849 -17597 -14394 -20020
14732 -20020 -19133 -845 21665 10523 5771 11955 -8615 -18107 -8094 -10098 -15585 -13135 -12869 -13575
14718 -13575 -22817 -30014 -29101 -33049 -13797 -13397 -25257 -24674 -24972 -28044 -14125 -6185 6174 -3595
14704 -3595 -20974 -18191 -22944 -22525 -22104 -23130 -31619 -44851 -48092 -22517 -15174 -10229 -11496 4855
14690 4855 331 11531 26227 26997 19997 16154 10627 19884 21571 26519 33493 16929 14170 11080
14676 11080 8736 -1842 -7351 2365 1051 4492 9156 903 23184 42701 36522 256 -9251
14663 -9251 -18823 -7121 -14005 -15452 -16391 -21659 -20147 -12384 -17028 -14982 -29206 -23548 -18879 -16451
14649 -16451 -13941 -14041 -13763 -23396 -13916 4995 -15267 -35721 -42739 -41459 -18773 -2354 4784 805
14635 805 -29523 -27785 -34810 -25377 -27041 -25741 -18733 -9828 -18414 -994 12476 15158 17467 22265
14621 22265 18655 19398 35354 33548 4666 14847 32853 36152 24179 18720 22645 26503 17825
14608 17825 -9260 -26128 -21660 -2054 -6281 -17193 -19330 -15087 -4727 -14221 -7397 -11291 -19369
14595 -19369 -15538 -24353 -28504 -24745 -35086 -33709 -25922 -6096 -13138 -16683 -7547 -3558 7502 -14244
14581 -14244 -26541 -752 9132 9232 -9518 -8716 -19366 -38027 -27442 -26994 -42614 -41984 -24383
14568 -24383 1064 14292 1879 4645 23507 3124 -3426 -16925 -51418 -54110 -17064 17498
14556 17498 22438 27369 34573 46638 27961 77 6362 -980 -14603 -6175 14064 -19042 -34911
14543 -34911 -16782 -3428 -5343 -4476 -12491 -14094 -4643 2771 -1783 -5743 1345 -23992 -36727 -25258
14529 -25258 -6202 -6365 -11093 -6758 5854 16802 25833 18216 12344 -428 -5157 -3962 -239 5972
14515 5972 10207 13736 21908 3326 -18314 -4347 128 -4684 -13506 -1207 -896 8257 1710 -18892
14501 -18892 -10115 -4982 -9676 13317 20766 18262 9595 10580 -10911 -24177 -27858 -16708 -16004 -40788
14487 -40788 -43315 -38247 -39975 -39555 -25360 -11847 -17491 -9618 -549 11988 14778 18733 33242 38231
14473 38231 27896 33679 43290 31358 13335 -9414 -1717 -5984 -14985 -4493 14657 23082 21436
14460 21436 13763 11332 1696 10020 23839 8630 8952 5324 10516 29837 21836 13321 33727 24691
14446 24691 -2400 -8457 -12920 -4229 -1790 8809 10302 -287 7969 31501 30304 10723 8029
14433 8029 13897 13112 5764 -7924 -21236 -38505 -31910 -11431 8025 19300 2040 14790 18091
14420 18091 15006 11163 -3903 -3039 -98 4286 -4991 -4682 -4867 -12649 -27518 -31675 -27776 -30588 -24235
14405 -24235 -15445 -9259 4208 15935 6152 11405 26988 36820 10964 13500 9038 13457 -374
14392 -374 14161 43991 42214 35691 32853 22625 17598 25421 16543 15272 11929 1017 -1321 4346
14378 4346 12083 3905 6401 4099 -33013 -37879 -17777 -24834 -2822 12514 -12981 -32896 -30269
14365 -30269 -28272 -21412 -20947 -17828 -6880 4923 20642 71 -10885 -13660 -13638 -21634 -25842 -18730
14351 -18730 -4554 2983 -16505 -26872 -24339 -16231 -16450 -6402 -22299 -26862 -10959 -1615 4524
14338 4524 -9041 -14251 -14482 -28573 -11509 3910 -497 5130 -7855 -5807 -14961 -33100 -29504
14325 -29504 -20901 -16462 -7515 -19869 -35846 -36759 -19768 -1089 -1531 -12104 -6158 13871 22855
14312 22855 9942 -3868 6010 794 -5995 -8999 9517 16976 25498 32287 25314 10691 6920
14299 6920 11763 7336 16868 16176 4178 5677 9489 20278 19030 5000 -1225 -4085 5363 13059
14285 13059 365 -2404 11953 11290 -521 -13498 -27094 -23059 -15739 -20776 -26426 -17134 -17705 -7031
14271 -7031 1035 -2996 410 -15263 -22916 -5564 -11310 -6353 12719 -2387 -21333 -16426 -21581
14258 -21581 -7560 21808 15404 4702 15103 20831 29198 28033 36504 30510 13627 6258 -8865
14245 -8865 -15451 -268 8405 -12404 -28556 -25945 -9983 21284 20641 21168 19338 26726 34974 20614
14231 20614 12978 6206 -10724 -7591 1032 -12573 -4670 9349 20678 19423 17486 20432 13951
14218 13951 28785 37739 39934 24389 9871 23765 17439 2340 1738 1472 -16 -86 22664 14453
14204 14453 16528 15735 12377 -7142 -19553 -22438 -23863 -30337 -26016 -14726 4776 -10571 -10703 -11506
14190 -11506 -15977 -15085 -4601 19157 33679 33097 -2799 -5929 -1624 -4631 1982 3798 3803 19590
14176 19590 18794 12021 13446 17913 14354 30742 35476 23651 20502 16626 12892 7413 -502 1871
14162 1871 7295 9705 14564 16553 25705 27353 36395 41190 27577 11613 15643 17125 12666 -62
14148 -62 -15622 -19264 -5613 21238 22707 18158 11862 -9635 -46095 -34326 -16889 -15193 -8053
14135 -8053 -2377 -2876 -1954 -4793 1411 8239 18823 34024 58841 43035 31774 30389 24517 24713
14121 24713 13559 12094 10207 10521 16762 27208 39522 31099 -888 -7466 -522 22368 53923
14108 53923 68175 86518 58466 21573 41775 32895 36805 35655 34241 59223 34432 13689
14096 13689 14082 9491 -352 -1458 16597 17646 18630 23624 16130 9559 9693 21016 19572 9534
14082 9534 -5549 -742 4896 11977 11445 -3654 -12203 11116 -2960 -1888 -962 -12833 -20800 -27127
14068 -27127 -32042 -4039 6927 14659 18202 26484 27824 21092 15124 4867 -3522 -4411 5684 6741
14054 6741 5077 9234 9145 16917 13134 5316 -7682 -12791 -4661 -2804 -7481 -12316 -17195 -2372 -16182
14039 -16182 -22081 6134 8830 128 8324 30734 30494 14713 20918 11364 7377 23093 11744
14026 11744 -687 -10015 24 -3355 -28951 -32501 -6578 22871 16735 11350 3344 2057 6330
14013 6330 15786 13041 984 13490 16623 21548 10092 7433 14774 19819 13813 2628 -2330 204
13999 204 -5604 12413 22099 24749 -158 83 17369 20809 16228 2858 10425 25490 19322 7917
13985 7917 7382 -6122 1504 8459 23213 15351 14518 12927 7671 11486 -864 2718 4371 14015
13971 14015 8212 2869 14438 15176 20238 17096 26081 42245 32909 20397 43296 51396 43567 37372
13957 37372 31499 41123 6525 5189 18054 -6889 -4401 425 16937 26735 19876 12206 -1853
13944 -1853 -2635 5495 19518 13418 -15419 -9644 -11744 -4735 -6679 -3899 4695 22459 31907 35805
13930 35805 33962 19085 4412 -945 -3957 7116 22128 1055 5547 15741 26784 34952 20588
13917 20588 34554 36580 36310 32918 25123 34013 41040 29187 20957 28651 30183 28961 8551 -13444
13903 -13444 -6728 12230 29301 26575 17847 29195 23949 2706 -12913 -9652 12218 19722 15881
13890 15881 22562 16814 19705 30335 28717 27250 43931 55779 52202 28467 3520 15264 3228
13877 3228 24996 49552 33279 42220 55082 36248 20924 32040 72305 87925 80738 59812
13865 59812 46320 16547 25605 33704 31892 28193 20886 -4726 -14757 -1857 6042 -11359 3738
13852 3738 29707 17956 27754 35374 20262 13463 20527 18625 -3064 -1133 12373 14984 15011 24204
13838 24204 18377 16457 12093 -745 -5532 20862 27846 38334 19954 19801 33039 21391 12939
13825 12939 14446 12461 20253 21489 19056 14421 23224 39946 47142 50778 30523 12780 30229
13812 30229 27287 6486 1827 16040 34381 30099 34904 26629 9750 15287 7098 7176 14368 -2026
13798 -2026 31 19344 37235 36205 17096 -6297 -4147 15323 25963 21335 18448 1859 -4511
13785 -4511 7400 14622 36293 41893 27237 14054 15857 6469 -10710 947 8869 14051 3055
13772 3055 -14370 -1021 29151 43372 30903 22100 22238 14468 7735 26137 26628 17363 8295 -1763
13758 -1763 -34 15319 34775 23107 19745 6872 7643 27211 47592 50100 26007 19274 13192
13745 13192 8988 4722 23452 26215 23823 20879 32037 41555 40523 30254 18824 12244 4415
13732 4415 575 17160 29671 37984 41755 34696 19723 23193 16409 23566 8187 -3089 3951
13719 3951 15265 13275 19939 17192 27193 22804 39314 50627 46742 50124 55466 57342 31715
13706 31715 11940 6925 13299 26035 49078 48955 31631 11999 15875 3380 9855 30495 38398
13693 38398 49294 53433 17033 -11617 11953 6255 7701 4789 1468 1374 -14809 -14018 -2687 13631
13679 13631 15130 17002 29041 31383 12755 1095 23378 36316 47366 38646 28635 22623 1918
13666 1918 -13694 -9017 -1220 -5118 1803 6318 48543 62437 41357 23407 20365 14990 23175
13653 23175 51455 62694 54402 55718 42201 38483 43729 25892 13745 20133 33347 28095 14673
13640 14673 11543 26633 22576 32192 56606 54106 46209 56509 65217 56681 40935 53901 89156
13627 89156 77996 59517 57431 49249 38115 32004 19041 15952 24626 39129 31103 42509 54354
13614 54354 36196 15207 25248 19867 22046 46422 63071 58490 58285 86129 72225 45033 35031
13601 35031 53076 59120 54372 59541 76038 79256 64072 33214 18442 24552 12042 6648 19079
13588 19079 23568 20908 27011 16688 27811 10250 11816 23893 27360 23783 23511 28037 22145 5853
13574 5853 31429 44959 34741 25211 40041 37392 31511 41280 53659 54031 41014 44000 52323
13561 52323 44047 20212 793 -1698 -1236 145 12036 27066 28504 26053 27051 -7557 -14574 -9775
13547 -9775 -2422 3860 -843 25361 22337 16284 28422 39579 39687 34778 55876 54112 46847 61953
13533 61953 55301 59479 59059 40375 33101 20019 12639 7578 13767 19054 7753 333 12038 8510
13519 8510 18298 36183 36773 19164 32138 30724 19647 24484 32960 43637 31276 42939 52455
13506 52455 51010 35428 28421 33601 58438 76624 73166 67106 35237 39615 42697 33295 31071
13493 31071 31198 23332 21647 29968 24923 28212 18331 13203 15834 6349 22789 38302 44487 38405
13479 38405 24210 13900 35170 64659 70421 54788 54117 34047 30316 28444 34903 25795 23694
13466 23694 30000 44081 39086 42051 66401 53671 34344 27865 12283 14530 21985 17213 35880
13453 35880 44852 47471 40817 15860 7039 20888 14114 16970 24500 35383 66860 82251 67049
13440 67049 73935 83573 88980 66348 42606 33434 34130 35397 41461 50708 54967 67910 71158 55606
13426 55606 49857 25229 8409 37321 65175 61888 43410 36776 38360 44960 53689 64707 42995
13413 42995 50423 47635 35166 7548 3774 30232 36998 43558 35746 33533 32306 42466 62329
13400 62329 71027 84212 88638 66626 40670 31882 36510 40078 54522 55009 45174 48953 57451 61955
13386 61955 65941 59135 62577 47120 38914 60166 78090 67200 46803 32684 42401 49508 60398
13373 60398 69604 54476 35014 39850 48244 48220 41922 20487 33390 34363 23071 25668 42911 36994
13359 36994 15457 5430 9789 4942 21826 27523 31267 23152 37364 60193 52751 44302 26912
13346 26912 20702 25148 27317 21700 19012 34933 41440 61066 79435 79873 77628 81961 50942 32341
13332 32341 28963 29296 40722 38813 39363 39376 45695 50034 55324 57865 67402 62224 39194 54066 55092
13317 55092 47408 38081 37067 46767 75314 93955 91187 77585 61982 45790 37467 34701 53069
13304 53069 48095 41460 41019 49040 60116 49514 47524 40614 42673 44487 39858 61226 74376 67565
13290 67565 93217 101182 83691 59808 61715 74039 75269 64117 65967 70690 77494 69048 59909
13277 59909 44606 62612 75465 65055 74715 82071 93377 86808 75994 83727 96456 105244 132511
13264 132511 159239 178943 197799 219399 260720 288665 333089 396706 468667 563415 658550
13253 658550 722964 763196 794535 814642 815082 780947 741380 699777 635428 555761 479378 402744
13241 402744 345176 294986 256392 240961 230106 230334 229076 202731 192377 187175 166362 160166
13229 160166 153181 158432 158569 136176 144023 151232 152340 145629 116973 111614 114835 113220 99799 101695
13215 101695 124935 141527 152468 150580 157195 168936 145960 132102 121667 105831 78580 73310
13203 73310 105645 123351 118201 125145 124264 134049 141068 150628 156099 163373 182710 188852 194250 200624
13189 200624 211424 225050 220798 222907 227363 211846 184677 160926 165560 190402 203235 212909
13177 212909 220938 207735 189448 172839 183691 191769 191835 202135 209522 213302 213433 238175 251558
13164 251558 244180 245163 243774 225072 222533 207293 207470 194636 203850 220969 237391 244741 232207
13151 232207 220989 206510 199864 174230 137479 136146 150902 156651 140001 133337 120902 122854
13139 122854 134581 154753 143599 136064 131862 129130 131386 126393 110436 103588 104854 125281 118694
13126 118694 122714 131166 134674 129239 135101 135199 133654 144943 135002 133311 139465 138326 128375 124148
13112 124148 114798 106692 118463 125223 109187 128702 117983 112657 115800 115936 96908 92978 103211
13099 103211 109533 117914 135640 144084 157934 164628 157008 153231 175322 190887 182729 199660 202539
13086 202539 205992 214295 206734 211382 205053 208730 220702 189969 168312 161362 143234 121685 97531
13073 97531 99378 131994 147881 129838 110676 124877 123737 131061 131866 134873 121329 127099 134133
13060 134133 123009 121236 127623 145846 165879 153766 149675 163319 175083 168357 147100 147584 157759
13047 157759 170534 170168 161834 163141 160094 159210 160471 161892 156743 165761 154543 165537 172034 151748
13033 151748 142576 119049 120123 160755 153702 139584 133877 141345 148429 147789 147129 139315 138187 154713
13019 154713 149102 127325 130332 142350 146493 147604 159064 160164 135460 151976 171742 179194 171586
13006 171586 176056 180936 174785 172435 164797 170311 179155 167431 163931 159443 170849 184436 186242
12993 186242 175512 158489 164007 197539 217356 229772 241031 233463 200941 198309 210427 198826
12981 198826 194750 207236 200267 189560 182906 180049 168343 174401 190683 206373 200364 202145 229774
12968 229774 236427 239559 250227 263181 289999 317191 358077 406544 440566 495415 549030 592785
12956 592785 609696 637849 660647 661831 653205 638882 627471 601676 591720 581888 570136 557029
12944 557029 556766 540591 542437 524701 524972 516063 513425 517910 515180 532660 549667 557980 557049 540197
12930 540197 538011 528967 527627 520126 536058 556313 557129 556776 579574 579065 568279 569356 575490 602984
12916 602984 615962 612097 609437 637293 655249 662278 660333 664757 684303 705510 709768 731023 745343
12903 745343 744329 739387 743021 746372 749940 757990 796862 817988 825020 825473 855133 883437 890950
12890 890950 905403 944490 970914 1019330 1050479 1078883 1116184 1145255 1169691 1203426 1249950
12879 1249950 1295366 1337780 1373753 1451732 1535452 1613257 1671566 1725264 1786342 1852189 1901660
12868 1901660 1964697 2044962 2127740 2206657 2279590 2363659 2488528 2637055 2803477 2997766
12858 2997766 3224275 3481965 3782355 4150121 4584515 5090125 5694165 6421535 7286795
12849 7286795 8255222 9321864 10496779 11803814 13297129 15066306 17303082 20298548
12841 20298548 24478790 30383561 38537779 49277266 62523599 77736290 93829171
12834 93829171 109391294 122996396 133521870 140358317 143383335 142681253 138315164 130397691
12826 130397691 119337756 105796115 90867805 75992505 62525468 51410181 43017203
12819 43017203 37045038 32822623 29734809 27330168 25370311 23684946 22170100 20756395
12811 20756395 19419190 18168320 16990942 15898078 14907915 14026585 13270996 12585248 11954977
12802 11954977 11400548 10908421 10459297 10015074 9618271 9259660 8897841 8560690 8243967
12793 8243967 7943354 7671902 7423163 7162382 6936535 6707266 6501640 6318202 6134657
12784 6134657 5954151 5786929 5627762 5455596 5267679 5099319 4939854 4796471 4651870
12775 4651870 4510733 4366547 4209104 4072146 3939032 3814705 3705609 3594976 3486016
12766 3486016 3371327 3249655 3151282 3043110 2968498 2897288 2787230 2698652 2617196 2521160
12756 2521160 2441318 2365210 2306161 2242799 2161992 2070936 1994263 1929717 1862206 1806071 1759189
12745 1759189 1701681 1658259 1604730 1553097 1506006 1455578 1406279 1372186 1351402 1320719 1287004
12734 1287004 1242161 1205499 1151656 1114273 1077286 1024248 983369 935993 899666 868163 858344
12723 858344 839757 816173 796556 774922 749065 736639 717772 694365 665519 641931 600149
12712 600149 579911 530750 478061 426493 386549 370034 365168 362813 352365 351800 340853 340392 350401
12699 350401 369533 366355 346998 343080 330345 315278 309356 278594 254307 244858 239417 227190
12687 227190 199206 184061 173880 168202 160747 130143 122479 120880 96504 89805 77779 89124
12675 89124 79431 71767 66154 56630 67024 53036 69962 80483 99090 109787 104320 116506 127564
12662 127564 125191 104284 108541 116710 121544 134551 140125 145628 135639 149257 144374 123950 113022
12649 113022 122245 142896 146248 134086 141209 146556 138180 127497 138542 142433 112014 104452 98759
12636 98759 89353 105704 110329 102781 90999 102157 97605 89866 93014 79308 75360 75088 49775
12623 49775 37729 46604 40920 42259 47627 51537 66525 76573 73907 77401 78640 56888 66402
12610 66402 82963 91396 86478 76117 71709 73328 82102 83302 65890 47473 53310 56483 51118
12597 51118 43024 49625 58601 66631 73877 65557 67353 84893 84329 85774 67452 54033 58159 62403
12583 62403 70894 84103 71820 61455 69252 81201 80719 66679 69149 72254 62359 78712 85657
12570 85657 78400 61535 50159 61602 59018 56684 64737 45235 36410 29634 26084 11962 3548
12557 3548 18696 34248 22249 1967 -2474 5233 1673 -3282 -16034 -9395 -14139 -19310 -38385
12544 -38385 -42081 -28975 -17576 -16798 -31564 -30621 -16550 -17488 -23216 -5944 12694 18578 338
12531 338 -20773 -21788 -9701 4577 27484 29171 13166 13138 25767 20387 1452 -16697 -24167
12518 -24167 -5511 12277 8356 -8918 -17190 -15440 185 -10237 -13672 -17029 -17596 -24643 -13456
12505 -13456 12296 4270 -4203 -5485 22901 28006 18847 8997 4738 12370 7225 5805 7244 3474
12491 3474 12758 8682 -1466 -2921 -11153 -25413 -15499 3099 -329 -7344 -5659 17063 43169
12478 43169 25317 151 -13278 -13191 1471 9272 14523 21340 -6501 -19735 -18988 1748 -4874
12465 -4874 -6356 -6761 1136 5164 10670 10328 2314 -2572 2804 1000 12943 16498 8755 6706 5936
12450 5936 -30364 -48980 -32491 -11064 -5628 111 -23410 -23069 1609 13877 1147 8787 1269
12437 1269 -9748 7533 19787 -4726 -24052 -16785 -4815 22466 49549 75421 83465 77026
12425 77026 74255 59999 78133 121937 146543 160592 197700 242548 287989 345058 368371 397930
12413 397930 451886 497172 575360 642995 705510 779331 848678 895932 925033 903947 875152
12402 875152 836769 766697 699303 624897 548257 470278 403320 345013 291835 255996 228490
12391 228490 202036 192021 184974 182664 177140 180295 178796 141921 121795 109247 105523 96785 94115
12378 94115 69850 45972 36598 34296 23980 40415 60589 69605 83958 78299 64603 65839 64371
12365 64371 48802 47420 42617 32017 46922 70439 84224 77503 50405 46984 55539 37354 26912
12352 26912 27452 40431 56744 79898 79963 50370 28663 20364 17055 34740 29672 25980 26579 48657
12338 48657 63028 56553 61534 52724 48734 55348 59832 78405 86575 74835 62460 73082 85628
12325 85628 100043 108110 98474 110363 109607 108145 113679 89179 77995 85105 69260 78727 100966
12312 100966 125360 133201 122860 138677 148330 169225 173214 165849 191514 229787 259478 285262
12300 285262 308423 342627 383294 438504 506340 615686 766615 949099 1200534 1503952
12290 1503952 1875601 2276939 2722904 3159373 3532056 3801912 3972130 4004536 3922377 3705826
12280 3705826 3398618 3045245 2662663 2287110 1917978 1600058 1360961 1179375 1016642
12271 1016642 900374 813093 767146 723675 669095 614924 586826 557214 519779 482577 461879
12260 461879 447638 457609 451167 463583 468574 478385 488933 506637 517789 512679 517736 507758 480332
12247 480332 416444 376280 365127 329801 291324 257508 230494 208591 222281 213438 187952 190188
12235 190188 187133 198154 211029 199476 188154 170374 169800 188317 193806 173642 145281 139821
12223 139821 141943 156515 160800 168965 184952 173848 192977 227954 258498 269010 321894 386776
12211 386776 422042 429078 443514 429377 404856 335296 276247 241502 214757 198722 164276 140823
12199 140823 142193 138510 124573 125782 106410 102197 111231 90139 83325 78510 69009 76712 74730
12186 74730 54243 49896 70085 51447 70418 70700 64422 62131 63985 50927 40065 51700 56155
12173 56155 52142 35824 44043 49446 54126 52443 56930 43596 14217 5392 11464 13879 28646
12160 28646 40999 31878 14348 25511 21188 11799 9039 -17207 -11453 423 -10764 -20077 -6394
12147 -6394 -3474 -12803 2256 27817 34851 26493 15423 12485 11440 -3130 -8603 -15581 -413
12134 -413 11677 1946 5274 23740 30567 24301 34282 32955 23983 -2556 -6980 -5906 -10687 -11908
12120 -11908 -23065 -20663 -12328 2213 -629 10483 1993 2813 24389 28692 -23 -5124 264
12107 264 11216 -1064 -4847 -7014 -11480 -2174 -14962 -43783 -38638 -9115 19809 14164 1169
12094 1169 -1476 4822 17469 40830 42614 27669 20205 10164 24349 13098 -6019 -5605 -16649
12081 -16649 -4497 7228 -49 -4242 -11040 -2468 26965 26492 20489 32778 29091 15134 -4824
12068 -4824 357 1247 6357 24858 32599 42979 32825 16513 -965 -7038 -2156 12389 11161
12055 11161 6700 8081 11418 11066 11297 -11944 -28577 -17162 -5283 -24750 -36256 -36673 -21128
12042 -21128 -18515 -15323 -17049 -21759 -19079 -9255 -11383 -21082 -9076 -11031 -14393 -19493 -16730 -26296
12028 -26296 -15335 -14422 -18669 -14451 -16484 -13682 -7973 2823 -1081 6352 -6784 -12889 -11381 -13922
12014 -13922 -25646 -24404 -7698 -3363 3929 2712 -162 -15676 -17895 -13014 -3902 3624 -8458
12001 -8458 -28696 -10595 6900 5048 -4662 9122 15476 12767 16601 7248 13496 28485 6004
11988 6004 -20579 -5541 2799 1882 7568 10946 17245 27498 15054 17255 34147 34498 37148 16642
11974 16642 5672 7509 3892 8097 1199 195 6838 -8297 -31594 -28223 -7289 8545 17812
11961 17812 12843 17040 5559 4198 5034 5885 17955 19625 3331 3221 29340 25468 18228 30232
11947 30232 32135 25836 21832 11032 11310 7126 470 12541 29468 54401 67541 100921 126581
11934 126581 116189 107479 87921 67372 58047 42240 23953 16564 2839 4045 -363 -11014
11922 -11014 -20813 -19096 -2621 -7807 -10398 1690 14849 20138 14693 15880 4747 10835 15848
11909 15848 15865 18216 8332 13602 10413 -25081 -31239 -20022 -17061 -21412 -17031 -16 10235 5252
11895 5252 -1713 1003 17691 33519 28659 15058 10012 7516 16740 29281 37180 34857 35505 36985
11881 36985 36238 62473 65546 38787 13957 -1220 -16964 -22120 -11516 -10494 -14054 -3718 -2866
11868 -2866 -10348 -14140 14939 20180 19550 17991 14575 9211 -4943 -19946 -7141 5442 24313
11855 24313 42242 55873 33693 20844 31478 29533 24998 14412 10839 13901 16416 -566 6641
11842 6641 15479 22839 18947 13255 29761 27099 25022 15417 4215 9058 18264 12898 13845 13156 29548
11827 29548 21514 8055 28206 31172 32979 28378 42549 46299 48967 49900 47033 53224 69753 80139
11813 80139 69260 56101 63569 89528 82743 94086 94466 78727 78763 86595 51098 15147 10207
11800 10207 26936 34984 36654 50287 62463 57784 54482 30649 38566 43311 41200 40886 49353 67525
11786 67525 87668 89290 88512 84842 86251 83039 90461 85212 73043 73152 74629 72015 82418 99309
11772 99309 89572 94043 96890 101564 75957 74795 66833 78589 85204 82595 85636 69784 62000 52246
11758 52246 50511 40860 42150 59581 72986 67181 65188 50504 42205 53615 55220 62830 69683
11745 69683 79673 103704 133011 149101 146762 142829 156870 160038 138868 144807 136676 119050 124324
11732 124324 129346 115778 81543 56157 43083 37817 29915 21211 2578 -9548 489 15786
11720 15786 26935 30410 23338 20214 4888 23236 46864 40194 26742 18349 39430 49316 48205
11707 48205 47556 56316 57290 50373 50827 55396 73913 84449 59426 76730 90405 93875 76172 82466
11693 82466 101688 108256 108563 113477 81643 73607 65539 54597 46354 30335 10144 13734 29754
11680 29754 29824 22531 27524 18916 11239 4852 -3113 -459 7576 3125 -18598 -33027 -13403 12751
11666 12751 7533 -5496 -941 -318 9314 32846 36521 15253 6323 10242 15917 7665 -4236 10184
11652 10184 5653 -2755 6862 17083 27163 13179 9291 11887 24386 24763 8933 8958 -7732 -13694
11638 -13694 15151 19479 13860 11492 17395 4882 -3003 -6744 -357 27249 31915 27288 33854 17126
11624 17126 7729 14417 4114 11368 13883 13166 3572 9374 18167 12368 17656 13442 19234 19413 31756
11609 31756 36497 44159 31098 25085 18302 30175 28892 12478 349 3807 21275 26487 13739
11596 13739 4635 4684 4706 3336 -1111 -5103 5558 13529 14135 29741 24633 19822 24308 22038 6349
11581 6349 -3160 -2500 8868 28659 17808 28435 32878 15512 16897 23414 22762 23402 22560 29631
11567 29631 32931 32384 20613 12567 28388 29355 15765 19192 22363 7948 13198 23733 16198 42432
11553 42432 50357 40271 20779 6741 9197 28861 20990 13217 17413 24476 10191 -2733 10624
11540 10624 27047 25631 29557 36292 2546 -11268 2549 24980 21067 5727 3517 3475 15667
11527 15667 24311 31405 39849 41827 53158 67360 80726 64767 62365 39947 23511 31689 40238
11514 40238 42602 36400 13940 966 16941 33123 15363 23171 44920 61017 54215 49106 42260
11501 42260 21384 3487 -660 -2864 1067 7716 16206 29292 21068 26573 32158 29888 29552 25076
11487 25076 16042 9816 25899 48390 55517 38247 24011 12950 16619 9767 -4489 -10880 -1403
11474 -1403 22739 18115 23655 40654 37247 25695 7801 5991 16407 40810 49305 35082 43567
11461 43567 46942 34215 12734 -2513 9247 27409 12161 4482 9610 12620 8860 9064 657
11448 657 15751 21015 46363 69305 55328 32986 4857 -5872 10026 24085 27155 33678 28684
11435 28684 14693 18981 23167 14613 -804 7013 9155 -9654 -5743 -1432 5994 3421 21402
11422 21402 34860 46421 71162 70491 53179 38604 39210 38164 33496 34807 60923 66091 53368
11409 53368 48343 44061 29617 26533 47558 59855 61241 82378 72283 58519 49163 36298 46509
11396 46509 36369 28630 41092 52883 66373 68238 49907 55322 55377 51537 48970 67524 57797
11383 57797 46127 45714 55892 70136 70510 71803 51486 13279 5413 17640 22217 33767 42001
11370 42001 41221 38970 42969 42439 59441 59814 51611 58563 69109 60615 38046 18350 16587 27327
11356 27327 27976 14679 24457 46655 46907 37044 21383 10243 12785 25773 22562 26530 34019 46897
11342 46897 56618 50890 60228 39299 49464 61398 58353 45608 47047 47228 43822 42743 61989
11329 61989 54996 53607 57110 61707 65162 49970 40096 36145 34103 38000 37533 55159 74497 69870
11315 69870 66410 68835 48691 17676 22462 22858 27829 37828 43046 58513 58401 53567 48002 49511
11301 49511 44010 46257 44561 49484 48559 56587 68544 80549 85460 87591 81749 71908 74650 65951
11287 65951 49888 63990 60604 81999 77054 52662 55584 71429 85125 71105 71121 70717 73468
11274 73468 87867 75307 75729 86237 72402 72784 76074 80804 83955 83754 78354 74348 78107 90162
11260 90162 117406 138859 132307 127252 128817 127486 133899 133786 119916 107763 105402 98669 111258
11247 111258 124521 127719 107869 106587 110145 113954 113923 104415 89325 77330 69130 66660 61341 51160
11233 51160 55719 67169 64708 71836 83346 95837 98917 84974 78246 73531 68615 60641 69022
11220 69022 65038 82824 92226 99189 107120 106578 107671 101296 82983 99360 134009 130508 125420 120128
11206 120128 116138 107472 97404 104246 122610 137054 113528 94166 76753 69898 82686 87448
11194 87448 76735 63970 82505 88091 117127 126498 114010 102960 103458 101374 94684 100550 104858
11181 104858 105728 85946 73299 71711 89542 122631 105650 94904 98635 93683 85046 85698 101787
11168 101787 112207 96788 95030 91159 87279 96536 102768 81640 54539 48025 51138 78964 91206
11155 91206 82277 88989 100222 91322 74637 75835 71561 75884 77423 87773 82838 79569 81494 77120
11141 77120 88996 96142 87769 69875 61085 76411 74162 83600 84730 78083 92379 88972 66981
11128 66981 73774 89618 80377 82893 102993 114458 108725 102266 73979 60532 78304 99820 93023
11115 93023 96063 89851 73599 73307 60725 54469 67756 66571 52331 59217 55488 66239 75625
11102 75625 62093 73979 76663 77398 98672 113299 119276 94441 81413 87062 82607 82254 84477
11089 84477 77479 70170 81284 98492 83438 45183 51925 72078 86494 86228 74873 87762 95216
11076 95216 99754 105491 94184 74190 81682 90018 102373 106131 106413 93116 115277 116014 109303 120818
11062 120818 120499 123758 120254 118374 106873 97945 94134 94165 112843 126067 120633 116809 116255 92445
11048 92445 83435 95020 112232 121959 116718 137085 138040 138327 116330 113523 117397 125813 134857 150215
11034 150215 151314 152018 173162 166624 166231 179060 178273 169596 168460 166345 175146 160047 144938 129504
11020 129504 114878 117574 124553 119144 114881 122902 143508 149126 147182 160079 186568 183282 172024
11007 172024 163561 167781 163646 145805 129371 134459 135349 139729 152879 162920 166635 168264 162296
10994 162296 160096 164454 175112 193921 204955 204786 199879 191284 204704 218828 230416 270672 316109
10981 316109 360904 436554 544883 691822 927741 1214203 1507680 1726169 1866796 1890719
10971 1890719 1749057 1446446 1114138 854521 664485 556763 491770 453488 421368 401651
10961 401651 359984 353208 323185 309332 289751 270863 284863 304936 314877 302863 290116 273217
10949 273217 258581 267448 263145 242478 247908 252872 257164 279916 299342 289895 289629 293303 305585
10936 305585 300662 293336 257667 268861 291273 298204 300816 291817 263573 246041 248991 236715 208093
10923 208093 220714 234972 246982 230681 227054 224999 234407 228583 225102 226931 218287 211458 196079
10910 196079 191146 212961 227340 215414 204473 208854 234480 239643 236545 232077 223840 205784 202243
10897 202243 232455 254771 265825 280338 290698 276033 261924 239091 245601 260627 252599 251099
10885 251099 236651 221067 216889 210563 189961 179126 194244 190398 185560 192631 191139 189878 182591
10872 182591 193808 181706 191454 212262 197593 178680 172476 170440 179139 202316 182097 154894
10860 154894 173160 172603 163004 179450 179050 173555 176928 157874 166490 187630 201581 209848 230278
10847 230278 232976 241202 237540 243122 233107 220825 219245 221589 237917 231172 228201 247116 242026
10834 242026 225682 204187 187389 190341 197057 188284 189528 202878 189246 194734 223152 236579
10822 236579 241895 233998 229234 235233 221999 231782 258636 264258 273351 303828 315548 341231 356803
10809 356803 347624 347951 357976 351454 348572 338875 332210 304783 296980 292346 280748 252615 230386
10796 230386 236788 258933 280219 274840 272540 283856 276580 269535 269452 277518 269928 256214 244369
10783 244369 235843 228011 224411 230980 235227 245119 251923 272267 278732 285638 303375 295035 289653 293014
10769 293014 288836 272091 260972 263913 275269 284472 294506 297193 301004 294991 285093 304657 303069
10756 303069 307762 303717 288946 285453 297997 295647 298812 295570 274911 245844 234709 224482 214458
10743 214458 215782 195808 184382 194594 199915 219604 247742 266531 277321 290321 306059 305401
10731 305401 321273 344306 352664 351567 329123 310805 294005 282478 296498 288177 277540 265390
10719 265390 268826 269459 264558 270195 277219 281179 303502 338922 366398 387775 408397 431195 437889
10706 437889 423240 417954 410492 382362 348033 329095 319948 295977 313381 337633 362437 378108
10694 378108 376437 374815 365004 361128 369541 367724 371102 386024 451607 566004 719640 865493
10682 865493 1017069 1173519 1300407 1357480 1327224 1212392 1102368 1016819 988241 950652
10672 950652 924679 892213 868025 865273 872586 864272 869192 898823 925861 920487 920911 921209 940145
10659 940145 939301 918723 908022 912988 901737 876672 876927 879696 847489 839639 854438 871720 897037
10646 897037 933703 985513 1032973 1044166 1075775 1094449 1121030 1160201 1156312 1143883 1166377 1198542
10634 1198542 1224027 1251255 1289354 1329999 1359615 1369025 1384146 1376319 1357862 1373868 1383411 1399515
10622 1399515 1435286 1475992 1509619 1588994 1678145 1787614 1939522 2128621 2375916 2658575
10612 2658575 2949159 3207021 3436324 3613910 3752186 3844059 3900127 3924720 3909667 3872495
10602 3872495 3786475 3669265 3517569 3364041 3273764 3207746 3170022 3200406 3269428 3349556 3415688
10591 3415688 3450251 3483235 3547197 3636582 3724797 3874182 4065766 4301189 4569394 4866540
10581 4866540 5192251 5586096 6063216 6583175 7194450 7905469 8762659 9746105 10770999
10572 10770999 11850006 12989200 14221598 15578514 17143648 19161402 21786724 25100052
10564 25100052 29396303 35254174 43518673 55583150 73734081 101598491 143258840
10557 143258840 197962729 253482336 294705608 318893779 324426507 298350533 238820603
10550 238820603 175013696 128217615 98047625 78564437 65489103 56341677 49669974
10543 49669974 44627264 40760895 37693468 35217515 33231135 31639513 30225900 28807144
10535 28807144 27302706 25648383 23937136 22370385 21029805 19901042 18941089 18078803
10527 18078803 17304893 16571187 15868153 15217283 14612316 14058537 13516669 12987894 12495730
10518 12495730 12043503 11614756 11213281 10817567 10469064 10160727 9857834 9541612 9252219
10509 9252219 8977162 8722362 8458684 8203419 7979617 7752986 7529715 7297893 7083171
10500 7083171 6873062 6639111 6400950 6168959 5943062 5757217 5577257 5408017 5257438
10491 5257438 5138301 5009246 4852165 4678024 4516483 4362178 4215005 4086642 3954316
10482 3954316 3800350 3664911 3558273 3437606 3303015 3176835 3100735 3018643 2926898 2831877
10472 2831877 2745897 2665011 2580945 2496058 2398458 2303511 2212106 2140696 2072710 2019566 1997929
10461 1997929 1971519 1924463 1882269 1839514 1777927 1701588 1639448 1577682 1535607 1484072 1430235
10450 1430235 1363803 1322390 1311496 1311263 1301666 1289300 1300341 1337325 1404478 1500585 1551848 1571815
10438 1571815 1553826 1437401 1247356 1070132 936587 824723 712397 617686 531709 490867
10428 490867 473911 478568 522888 592498 678589 756626 845138 949894 1052138 1117648 1147471
10417 1147471 1109559 1025406 877115 685120 548701 489006 476109 450854 428631 399629 363688
10406 363688 321245 313903 280678 221506 181181 162670 160607 138878 147246 168778 170162 191402
10394 191402 201859 206563 205477 180136 172575 184027 165714 152863 164866 176943 195466 190214
10382 190214 173914 155679 143616 148090 142968 144278 161641 170390 168501 173365 174179 183454 185613
10369 185613 198093 226197 237757 224305 194036 163352 139151 123976 100475 101808 126276 110538
10357 110538 91576 95663 79149 81597 98142 90688 78298 92349 105240 106851 113239 94274
10345 94274 96690 116759 137520 147964 129185 131671 128217 123919 118797 100916 77927 97918 119286
10332 119286 128524 116216 123916 107123 116538 160947 154303 124571 108089 118136 132382 124342
10320 124342 114185 102451 75162 61859 92428 106138 110101 116893 81963 76646 75102 78162
10308 78162 80362 114003 118800 120847 126898 112147 108326 104556 109510 103393 97924 103880 128476 129377
10294 129377 117508 99854 104024 87505 67108 72595 80672 78217 71077 89008 102560 81362
10282 81362 50222 61987 65766 58531 52160 32431 33404 78507 80666 54975 37033 37591 37442 33371
10268 33371 55649 53289 50886 45632 38204 32887 45531 66378 80352 103860 131045 132144 123022
10255 123022 145624 172990 177290 166271 168097 152081 135189 144058 152333 164432 159990 158631 176121
10242 176121 212999 243515 277942 293634 326436 385562 435536 476609 538675 614466 681777
10231 681777 752336 825228 910521 1010349 1141631 1292930 1495486 1770589 2176094 2762544
10221 2762544 3614717 4900674 6762660 9240984 12025461 14522332 16260558 16957489
10213 16957489 16309324 14152861 11144280 8341377 6271118 4895616 3994368 3389086
10205 3389086 2944883 2604209 2338875 2143154 2033931 1933663 1824637 1742265 1649387 1549071
10195 1549071 1444258 1348446 1255937 1174528 1083255 1032542 999842 957102 889193 852827 815796
10184 815796 772334 725904 700641 669024 636601 629313 605312 576005 555369 542018 527589 515281
10172 515281 499976 483381 475552 465343 442411 423045 416868 418734 426977 399549 371287 377471
10160 377471 364162 353301 338858 347718 337550 314239 319280 322645 314456 307043 308721 315559 309559
10147 309559 278672 258762 262022 264408 263524 251464 267383 302548 302717 306945 347107 416995 502049
10134 502049 626526 813761 1071338 1360300 1580559 1708021 1757581 1651332 1373200 1047664
10124 1047664 785290 623347 499186 392805 326127 312516 299500 274922 279559 258549 235718
10113 235718 223959 205233 190703 171372 179969 174058 159218 147752 127384 107539 104088 92375
10101 92375 77682 67322 58494 48885 63553 85014 86915 77573 70760 87679 107984 98224 85092
10088 85092 88085 78831 101980 132278 149335 192239 218582 219393 228941 226249 211721 202750 203403
10075 203403 228436 238286 264415 306306 291606 282024 266784 238665 194590 142227 98830 81554
10063 81554 99904 98469 58185 47152 70606 84845 82194 86372 95842 108147 123242 148686
10051 148686 195061 229358 299607 381546 452450 519724 553751 552221 520586 464634 401159 333016
10039 333016 250342 184171 140482 133730 135275 148781 143438 111660 95494 96270 70319 49882
10027 49882 46383 62651 72762 80949 88221 73925 52942 32683 36759 49570 39351 45359 57294
10014 57294 58489 67531 68735 72024 66106 64682 55329 63169 52719 29427 11094 15542 20227 25140
10000 25140 30795 31901 34955 40985 43730 48960 47599 26648 28891 34471 17553 -1912 -16318
9987 -16318 -13385 -29818 -20842 -5748 20906 28303 31428 15329 6885 5390 10020 2658 -5337 -13377
9973 -13377 -12996 -12026 12131 29809 26867 16898 12168 13113 10255 -3095 -13186 -24957 -21077 -12001
9959 -12001 14939 24865 10495 -12316 -15425 -3705 6725 12552 20048 17220 14227 2877 -2254
9946 -2254 -5528 -9528 -15913 -25974 -12959 -19170 -20966 -5315 14319 18284 15731 1490 -77 23958
9932 23958 15415 -10884 -21877 -22182 -24374 -15167 16473 -3809 -16488 -34275 -50273 -18645 17030
9919 17030 17079 -3305 -13845 -26586 -24355 -16641 -15434 -26944 -33578 -16738 -8716 210 10335 17572
9905 17572 859 6165 10757 12305 -99 -6587 5310 3821 17605 12310 8650 -17251 -38204
9892 -38204 -26479 -5638 5867 -2641 -20907 -1383 9039 18917 3832 -12134 -4801 -588 -2720
9879 -2720 -11700 5794 9698 5724 -12749 -17126 -7005 4127 439 20509 8708 -2312 -12430
9866 -12430 -8968 -5949 -15238 -15761 5300 1778 18901 50648 46108 53922 47944 21848 -7409 -29139
9852 -29139 -28976 -6767 14981 34757 33259 33101 38168 44831 27701 19921 26956 12664 8056 -8994
9838 -8994 -30793 -46635 -52314 -49131 -22432 -4493 10748 -1070 -3299 7574 14925 20074 46362
9825 46362 57204 42530 23275 21317 28324 43414 49001 23738 5972 6220 15731 31659 32174
9812 32174 51193 58647 50393 59729 51839 39159 40190 29327 18202 6661 28280 38003 39408
9799 39408 24177 20840 22931 27911 33934 46967 66315 69039 78789 78055 69572 65075 79955 91467
9785 91467 94155 73535 30071 29964 40997 21825 6750 15719 34690 35451 34742 38366 31068 16461
9771 16461 -422 11613 19678 14154 25315 24962 27639 37634 48070 31752 21785 18971 16110 44496
9757 44496 53507 52994 34507 32408 27449 24137 18063 10313 5202 -2274 10686 7348 13236 11370
9743 11370 10421 25137 50669 52113 43142 11463 8417 22184 28518 25621 22517 592 704 7185
9729 7185 19572 30317 16372 -15336 -20455 18065 55686 65238 65480 62179 51550 41797 28704
9716 28704 26246 55799 75056 69859 74500 86609 79862 74355 70973 63132 57065 68935 43287
9703 43287 29774 21962 19343 33550 40686 48640 60447 64262 63843 62498 60613 57037 58507 59984
9689 59984 60590 58209 47008 47074 47875 50325 63423 63049 74728 60318 56677 71133 86475 96794
9675 96794 93003 84116 115969 140367 112118 106911 88381 88862 102233 113556 105127 100742 103145
9662 103145 87628 83026 94755 92923 76706 81307 90336 87279 88669 87475 89388 95557 93640 90643
9648 90643 96925 109557 121064 118571 132411 136658 124250 122779 131816 144364 144943 150866 139080
9635 139080 133806 127564 119469 118148 122156 126258 123315 126633 106602 91158 98709 129093 130276 117888
9621 117888 104239 95277 102298 111016 100158 110244 101161 82334 81312 82923 80367 95178 110295
9608 110295 100064 92198 75488 83288 85896 85929 90058 122277 147741 161072 152288 140325 144752
9595 144752 147871 144089 154207 164200 170184 141068 128077 118015 118034 100179 95298 88707 85321 78619
9581 78619 70944 88163 108566 113047 109587 107899 107043 104265 114470 122098 123410 99895 75800 57632
9567 57632 61670 61814 70916 79128 90096 106572 124666 120190 118373 110907 110375 95722 99162 110781
9553 110781 84058 78711 83405 77710 70436 84723 96029 113547 97444 89501 105485 119978 107738
9540 107738 92593 96366 99001 98239 93639 88175 95046 113514 130207 117198 102372 116339 118885
9527 118885 97249 91367 109218 111489 119243 109429 95113 91271 93200 77762 78172 113386 114279 109470
9513 109470 107492 104382 106154 111466 106127 108228 109576 109630 110381 115603 127679 135091 125443 108121 120275
9498 120275 139793 139062 117851 116736 122584 126360 123730 133105 140551 144110 127661 113605 129632
9485 129632 121066 124133 138194 136681 143271 148273 138810 131571 134265 130564 120438 120721 104723 96791
9471 96791 94034 85340 68224 72810 77847 79174 76672 86972 79746 85648 119097 148692 149786 142365
9457 142365 142379 143831 149871 144845 145097 131143 121500 132837 145463 147534 147977 142693 142112 146249 159425
9442 159425 163192 143897 152728 145354 134623 117680 114267 121307 144268 155710 142037 152281 153417
9429 153417 150324 137347 132771 150594 157277 157287 166123 166022 166583 164592 169328 180871 180744 180276 179242
9414 179242 187906 198964 189085 179149 188553 184428 179268 176255 166363 173767 175021 176624 189045 188858
9400 188858 174777 171046 146658 152240 170507 175297 175015 185632 179753 169690 176113 188193 184205
9387 184205 180412 179298 198057 190128 179950 177677 177760 172535 183008 195249 177600 177901 166503 176462
9373 176462 180473 187082 201489 198859 179980 181252 197748 191633 176567 187446 208595 215365 209618
9360 209618 215864 213348 207331 213389 217024 215231 214113 198871 186805 203285 217852 231599 233023
9347 233023 237617 233923 245925 263702 230685 203804 202910 197759 198997 207270 219972 219762 208251
9334 208251 219716 230987 229086 211645 217312 220896 224432 247164 270381 268812 254724 241242 248831
9321 248831 256536 257824 257036 262406 274559 256317 248311 236846 235867 251365 238054 234373 225170 230104
9307 230104 229560 239306 245925 265627 290326 290387 283651 268740 259385 270524 276107 299085 321402 326211
9293 326211 333957 327315 322875 339477 338946 331214 318312 306644 304073 296934 309828 305826 305897 318668
9279 318668 316178 319389 292735 310397 333811 324405 333323 339603 336047 331493 318103 326823 326261 325049
9265 325049 336115 371886 377447 363281 363168 356219 353089 381086 393674 376227 366078 371337 377165
9252 377165 363168 368302 387722 388972 393756 393866 401206 412644 418252 410171 406603 433069 424006 418171
9238 418171 411020 414583 429664 437710 431171 428848 415234 392089 393617 397437 397633 382264 412207
9225 412207 427008 433934 440418 449463 446234 438914 428728 432202 432633 427057 439529 456951 459975 471093
9211 471093 461702 461976 472609 473344 462017 466774 481161 492396 499856 505546 525115 525066 519601 501476
9197 501476 487439 496389 491490 497357 498399 496091 511510 514741 524656 528368 537345 555136 567050
9184 567050 591336 569132 570331 567567 590585 601362 602772 605171 604226 586201 576065 586967 585277
9171 585277 596047 607372 609839 594511 595312 616034 633449 634340 628270 628139 637645 660041 674036
9158 674036 658426 638723 640616 654906 680331 692379 674274 660373 669653 688410 690684 684656
9146 684656 676031 673145 695390 721288 735178 744200 750033 764014 763102 774603 790066 794787 807349
9133 807349 814122 828953 821120 789608 790708 800153 812047 824538 849405 869467 864170 866100 893712
9120 893712 914299 915328 923693 922520 902598 912587 930439 938918 945304 947849 957820 978251 999625
9107 999625 1006341 1019193 1029279 1041276 1046703 1037133 1030983 1033065 1033212 1032209 1038484 1064613 1101301
9094 1101301 1114825 1126414 1146170 1144853 1136221 1128085 1125596 1134699 1159863 1169334 1184994 1196748 1219350
9081 1219350 1233132 1234543 1244617 1246193 1247178 1266834 1285550 1297540 1305614 1307529 1319154 1320397 1320305
9068 1320305 1346964 1382673 1410467 1419580 1437387 1445289 1460181 1475976 1492404 1498767 1515604 1533847
9056 1533847 1541031 1572643 1597297 1601810 1614917 1623153 1642623 1658105 1679422 1702294 1708131 1730304
9044 1730304 1755720 1790265 1815609 1822555 1835148 1852472 1866162 1902686 1925147 1932702 1945551 1972176
9032 1972176 1985289 1977430 2003903 2029568 2050587 2090042 2118946 2137010 2164819 2195852 2220717 2233653
9020 2233653 2258925 2277555 2299677 2350626 2373734 2407831 2425151 2453730 2465851 2504153 2544955
9009 2544955 2566564 2582205 2617274 2664457 2709452 2730976 2753239 2798933 2832305 2854920 2889047
8998 2889047 2940873 2972201 3010541 3060569 3087249 3121304 3150528 3183186 3228377 3260452 3287598
8987 3287598 3335304 3389411 3428540 3465893 3502887 3525961 3572030 3616357 3656356 3693264 3751564
8976 3751564 3797053 3846751 3909998 3951327 3993448 4046086 4082885 4145391 4189948 4233936 4277303
8965 4277303 4328631 4373311 4414695 4460752 4522578 4584293 4661770 4732317 4766345 4796960 4847181
8954 4847181 4906274 4963673 5017282 5074678 5133853 5190046 5238596 5284841 5347544 5396662 5458710
8943 5458710 5503399 5559707 5607921 5640778 5678987 5719141 5794722 5848728 5888127 5937045 5981375
8932 5981375 6020896 6088551 6132669 6173096 6245984 6291930 6347883 6383227 6405810 6420584 6452784
8921 6452784 6484145 6501287 6526463 6541164 6567686 6625189 6650212 6652038 6676271 6672239 6673751 6691008
8909 6691008 6719416 6737107 6730531 6741081 6746181 6745507 6733816 6735985 6747546 6751006 6749241 6739005 6714187
8896 6714187 6688266 6676573 6657794 6618269 6587071 6576387 6582168 6548497 6506025 6466167 6431733 6399027
8884 6399027 6390047 6363815 6325766 6296136 6249707 6217868 6188985 6150737 6094193 6021509 5969608 5920397
8872 5920397 5875663 5832953 5804067 5762869 5698966 5642058 5592843 5541235 5500116 5459214 5423521
8861 5423521 5353830 5295116 5237765 5183863 5141983 5097048 5041906 4988445 4938251 4890812 4833399
8850 4833399 4793940 4740176 4669821 4593026 4540766 4495453 4430721 4382722 4334928 4277208 4257999
8839 4257999 4224475 4178026 4132182 4071186 4018535 3985774 3941677 3889270 3839180 3789272 3755229
8828 3755229 3712736 3654340 3608820 3561973 3497252 3443732 3421083 3363920 3299669 3264802 3238959
8817 3238959 3207801 3167049 3123412 3101671 3066412 3028766 2997162 2963034 2928449 2888556 2877152
8806 2877152 2839219 2785084 2736525 2712616 2691761 2650903 2629973 2605726 2582117 2547760 2514911
8795 2514911 2483553 2475983 2440264 2405960 2380571 2345967 2293944 2274006 2258084 2223986 2191723 2171948
8783 2171948 2140058 2114002 2104901 2095328 2068406 2027474 1974856 1936472 1909606 1903241 1892958 1868208
8771 1868208 1834755 1823719 1803848 1790910 1784577 1784088 1770986 1749671 1736822 1702734 1667950 1640066
8759 1640066 1619462 1607230 1579050 1551377 1526995 1511838 1501859 1484933 1459999 1442488 1438315 1421786
8747 1421786 1404061 1386342 1381277 1380947 1362994 1339929 1327196 1322539 1328969 1313084 1285833 1263161
8735 1263161 1246718 1231725 1216875 1211194 1206940 1196880 1179139 1166680 1146818 1120480 1111844 1097188
8723 1097188 1100954 1115899 1098908 1076505 1062755 1055510 1045431 1021562 999363 991605 991525 973067 946170
8710 946170 966754 969731 953886 956565 940817 927245 896062 875966 857456 862518 866100 864704 871355
8697 871355 862164 863129 857636 830744 794186 784567 807823 804636 776172 761802 768364 746390 728411
8684 728411 729229 750212 752803 745349 727052 713923 714897 715819 715155 712021 704590 677377 682614 691561
8670 691561 676594 648687 638747 633730 629768 621931 644793 648036 614580 591268 594492 575152 561929
8657 561929 576071 589455 597691 593761 602814 582817 563974 556368 550257 548385 564536 558806 549965
8644 549965 522021 496498 509032 519256 522863 520636 513578 518781 517540 508599 510271 501879 497048
8631 497048 490110 474998 467911 461105 461196 461741 447916 450625 444902 452398 477655 470855 448312 455901
8617 455901 461835 447301 436954 421767 428565 437124 425225 422053 415608 375758 363282 372293 401098
8604 401098 407355 396547 385347 384788 380195 368711 364799 370542 369100 369782 371818 369484 356867 356855
8590 356855 373079 379711 374978 373497 365573 331097 310256 306826 296462 283847 267834 270235 298753
8577 298753 307719 307204 311599 314298 318241 326860 350740 360326 349889 335483 334592 344152 339253 315382
8563 315382 290524 268257 263977 257214 269381 270205 250027 254460 256699 266852 274456 287463 304019
8550 304019 308133 284080 265308 251197 237427 244753 244354 235027 242569 251525 246252 245148 259846
8537 259846 252149 240055 233187 234461 242465 244349 240062 247080 243143 232531 222767 237690 239559 223738
8523 223738 225154 221187 205651 220457 223033 197260 190435 215509 213699 236353 247908 247893 238173
8510 238173 220600 204275 193274 190014 199091 197737 213565 227793 237596 213005 212815 210439 219534
8497 219534 232940 227170 216614 208982 184653 187420 184026 191307 210586 200122 193053 187623 180195
8484 180195 181926 196646 201250 199975 174959 171713 175668 168726 163599 162846 158557 154154 140212 133374
8470 133374 143049 171488 179369 176656 172052 185745 175428 165353 154202 150374 148599 160634 166799
8457 166799 158205 138794 136296 147120 153331 144027 128560 142453 151532 154612 155765 150897 137617
8444 137617 140475 145615 147994 138274 130173 122138 112004 102947 92364 95023 109380 127974 152851
8431 152851 165394 162674 141006 124377 132790 135134 119056 105871 91908 103412 124877 129067
8419 129067 140914 139638 140576 106955 97551 99292 100613 105089 96082 109272 126621 115223 122394
8406 122394 114007 124065 131524 117025 106222 108152 107153 94572 74546 70381 84588 98107 104095
8393 104095 114743 102829 106698 119724 110094 104846 93898 105970 119920 113492 116609 125168 136195
8380 136195 144613 140511 136846 143335 158985 162736 157903 147105 159681 178776 199463 225145 256233
8367 256233 316206 395040 501060 593882 637900 665268 655553 598569 502875 405434 326653 263061
8355 263061 231606 197058 162018 160916 167770 176237 161322 162174 160812 151416 155123 151799 154327 163948
8341 163948 161554 129051 112935 104200 109254 116696 137036 144061 172687 168645 163932 186391 207152
8328 207152 216701 235282 291345 362024 436672 510357 607254 676803 692755 669011 575574 448957
8316 448957 348574 291090 251613 220477 176572 148991 151329 159828 161538 145166 141479 146701
8304 146701 108430 103655 117143 120797 115357 109065 97613 75888 71890 63622 57839 64319 85292
8291 85292 98074 93566 85145 91135 101741 118289 99631 94119 116878 120699 115988 119007 134437
8278 134437 133810 123715 110957 99802 84503 95148 89939 61357 33308 13715 24035 31841
8266 31841 54204 62078 61022 55843 51967 61134 67386 67759 78510 93804 93588 64675 63131 63330
8252 63330 50280 60973 58179 47165 47487 55634 79363 94120 95868 84768 55648 57279 77167
8239 77167 73043 51581 68587 72277 64010 51696 39840 46338 44261 30861 25287 25562 23306 44252
8225 44252 66102 61709 63880 58103 68912 69071 63362 65224 66434 54942 42044 30152 22661 35842
8211 35842 52510 51633 42042 34297 50888 57507 41306 4131 -921 4564 5002 14159 15343 17488
8197 17488 27822 43831 42038 52321 66391 72800 61093 39377 18823 11356 6836 15081 40378
8184 40378 45612 57423 62253 53468 38101 55956 69429 44385 26158 756 -17435 -14918 3909
8171 3909 895 -8097 1370 -446 7018 14939 28183 38646 44074 43354 38280 37812 48760 33097
8157 33097 22923 18021 19841 28323 29966 15337 16419 26173 24426 7623 -8805 14827 44300
8144 44300 54298 38641 15470 19864 24673 11939 7320 49970 49223 19924 2777 5204 -5948
8131 -5948 -35842 -36339 -18586 -10137 10528 8753 -16565 -24186 19031 43562 42830 22786 15296 32289
8117 32289 33210 1378 -11411 -9676 16793 47196 56139 46646 22494 1461 -9109 -10253 2744
8104 2744 15736 16096 28247 18311 35358 49453 44852 27576 11385 18916 35545 20589 15556
8091 15556 15046 17499 12873 33155 33170 38317 23018 1325 10274 23874 26270 25417 5967 -12852
8077 -12852 -14374 -14841 -6722 22365 29269 29511 14766 -2342 -6556 252 3076 3856 9038 16960 15462
8062 15462 19974 23111 25537 28550 26823 25439 32667 30469 28049 26963 33315 35673 22846 19411
8048 19411 -6371 -8996 2824 11446 27095 20050 14866 11960 16158 12213 -13406 -24445 -14389
8035 -14389 4875 4051 8504 -8067 -23946 -6272 6167 23879 25977 13259 7911 979 -8303
8022 -8303 13345 21485 27246 24362 25618 21257 22885 20219 32218 37527 28989 18155 -1721 -23498
8008 -23498 -25526 -14493 -7170 -6426 -6718 14709 17957 -12201 -28851 -12878 8038 8820 9371 8946
7994 8946 8009 25957 35091 18845 628 2373 11213 11839 25517 24107 35312 33981 22069 17315
7980 17315 18917 33656 13122 2492 6326 11716 32583 38888 38987 36022 14816 5628 13488 10288
7966 10288 3182 7830 12701 21104 25144 21595 40295 50617 32146 32843 30213 3182 -4380 2948
7952 2948 19799 21372 33602 45753 37738 37980 36533 12686 2532 8385 21587 34536 29705
7939 29705 15918 15109 31622 36758 45178 59581 49123 51255 45338 22106 18008 18826 16696 7422
7925 7422 4425 8383 -9175 -6294 -22648 -22213 447 15110 15077 13861 8107 2541 -15938 -13581
7911 -13581 -2873 -3411 -1796 5151 5401 2174 -779 -8704 -19803 -21949 -5413 7723 4611 18247
7897 18247 31300 11369 2014 -15925 -16807 -16529 -12321 -7712 2474 17308 28919 9387 3951
7884 3951 12713 21975 19479 26162 22445 36555 43175 37017 32667 30910 19072 16807 21385 32096
7870 32096 21562 -11474 -10387 7314 17984 22622 11416 9488 2641 2822 -357 37064 39310
7857 39310 23000 -795 -462 18113 37592 25993 16819 18229 21724 -2298 -5014 2285 6578
7844 6578 14497 5100 14637 -587 5651 1488 -10016 -1262 10573 20593 32980 36044 22473
7831 22473 2111 1151 22739 33567 20815 12221 15435 8120 -1686 -7749 -342 6207 -1145 924
7817 924 1554 -10503 -26241 -13111 -24002 -29648 -12829 -2260 -17522 -18260 -8952 -1261 6796 11423
7803 11423 4460 -3698 3051 -868 -2082 2435 5728 13233 23347 28261 8642 589 3649 6970
7789 6970 22862 28749 25342 -2573 -18548 -4867 -11324 -7560 3786 3747 -5325 -12222 -15228 -6453
7775 -6453 -1179 -7124 6626 25929 13424 -3990 -9894 1620 -9789 -30619 -22631 -8450 -15122
7762 -15122 -7796 -12877 -15849 -23400 -4645 13296 -4092 -7711 -8212 -467 -9608 -26635 -26628 -34539 -34403
7747 -34403 -29679 -6372 -11795 -31538 -40218 -32403 -18804 -17784 -7458 1757 7951 15087 13991 20925
7733 20925 25006 1067 -8191 -7548 -15175 -4394 -1362 -13610 -28740 -32395 -21601 -23018 -14476 -29406
7719 -29406 -41307 -26248 -27500 -12384 -4898 -1842 -6923 2207 15669 29412 28827 12908 -4736
7706 -4736 -10259 -1778 1117 -17818 -16189 -19016 -30959 -44392 -19119 19117 24360 5579 -2570
7693 -2570 -8426 -3076 -6155 -16941 -13962 2813 13387 4825 -28435 -24539 -1554 1994 -3761 -26511
7679 -26511 -31218 -32748 -34318 -48382 -58539 -60227 -57865 -53990 -50349 -40493 -22241 -18117 -23817 -21360
7665 -21360 -37024 -44089 -42967 -22716 -8026 -23656 -36123 -23875 -18409 -19068 -17105 -31373 -49521
7652 -49521 -48609 -22735 -7685 717 -2621 -448 9673 -23232 -25204 -18578 -12552 -19611 -25260 2723
7638 2723 18269 8777 -12190 -17275 -32778 -46695 -44544 -36444 -12158 3517 -8612 -35284 -42134
7625 -42134 -47827 -47420 -34785 -14406 -4654 -15094 -17187 -22094 -16225 -27842 -30840 -37934 -35172 -22377
7611 -22377 -6306 -16747 -19906 -3678 -2351 -15906 -18074 -19746 954 18113 12539 -3269 -18986
7598 -18986 -13926 2540 -3325 -36691 -43317 -44871 -44319 -55141 -67324 -42772 -22591 -4883 6453
7585 6453 4356 -3776 -13448 -19720 -31736 -28849 -30441 -18528 -5568 -1741 -23916 -19882 -17908 -20830
7571 -20830 -32972 -31169 -29902 -21331 -13360 -29478 -32918 -16174 7746 18197 18449 4935 3038
7558 3038 5623 -6058 -12580 -15825 -19712 -23505 -30940 -34613 -34586 -14990 -1827 -149 -14710 -24980
7544 -24980 -23715 -40000 -26902 -28730 -26835 -25249 -30828 -18022 -27256 -23488 -23063 -23942 -14638 -8531
7530 -8531 -12295 -8346 -12668 -18721 -8357 -4421 -6272 -9929 -13881 -28603 -39754 -17315 -16313 -24916
7516 -24916 -37801 -27079 -6695 -8269 3410 -1154 -11429 -21566 -14247 -4408 -20572 -28565 -7428
7503 -7428 -1368 -20048 -25280 -23843 -27343 -15570 1999 -3067 -20371 -45587 -52236 -19966 -18857
7490 -18857 -14455 1457 11334 146 -13713 -33523 -30160 -23581 -18466 -8660 -1935 -2061 -13014 -15211
7476 -15211 -7577 -8384 -20701 -19257 -11906 -18644 -33117 -30566 -10910 4758 27328 39171 29801
7463 29801 -161 3212 11819 10599 19585 4416 -7264 -21350 -13126 -5413 5688 6787 -16826
7450 -16826 -23148 -10508 1650 -1045 3048 -960 1385 -9279 -15908 -22633 -18980 2959 17121
7437 17121 5405 -11057 -27390 -28929 -29502 -37917 -13628 1415 -2833 -1549 3721 14170 6649
7424 6649 7924 10096 -2343 -2760 -7461 -3865 7021 6108 -4105 747 -5237 -30347 -33579 -19673
7410 -19673 -31753 -40566 -27230 -11564 -30649 -33610 -12841 -7782 -20105 -18199 -28308 -35173 -32752
7397 -32752 -16554 -8706 -11348 -5947 5103 33 -10591 -10039 -21757 -24999 -2395 -2788 -20309 -37793
7383 -37793 -46587 -69536 -70267 -47940 -22548 -16270 -9504 -163 6079 3600 -6115 -21182 -5491 13035
7369 13035 30898 28857 4873 -4993 -10146 -6479 821 -8881 -18658 -20551 -17141 -3921 -4051 497
7355 497 -14178 -13012 -24416 -26262 -23008 -9670 -17669 -15499 4443 33313 27194 7573 -10819
7342 -10819 -12617 -16435 -28481 -15766 -7354 -27378 -40504 -30759 -339 7037 6292 4013 2905 -17499
7328 -17499 -42933 -56676 -35830 -1631 -403 -10692 -4799 -930 -2244 1220 13933 13557 2466
7315 2466 -3175 1646 -3139 -14435 -31384 -26929 -20171 2463 8285 -25309 -42650 -36572 -34565 -43555
7301 -43555 -31895 -35083 -15298 -30648 -19481 4034 6830 -9748 -4214 -23832 -19931 -14893 -30669
7288 -30669 -25424 -18712 -392 -10825 -8649 -34101 -56276 -48954 -51329 -57887 -60333 -48499 -48021 -41521
7274 -41521 -52716 -46507 -37012 -51507 -67756 -54994 -47217 -41981 -27582 -9541 -3106 2211 -3869
7261 -3869 6428 8268 330 -13081 -12898 -9093 -4909 -19213 -15880 -20 13704 -1333 -27488
7248 -27488 -5148 6301 9752 29200 21726 -15667 -21593 -22398 -21729 -9168 -4325 -1683 -15106 -37634
7234 -37634 -35030 -27587 -29075 -50809 -45520 -28844 -17184 -24731 -38827 -29946 -28221 -14571 -3031
7221 -3031 -5113 5168 2221 -10254 -18720 -16984 -20349 -12391 -18136 -11988 -11092 -931 13006 14425
7207 14425 14604 11269 1044 -6833 -18231 -14191 -9331 -19779 -19306 -15162 -30573 -31544 -13774 -5143
7193 -5143 -14864 -8528 -27956 -35891 -28150 -24967 -20045 -18196 -1541 5703 2805 -5228 -4439 -5134 -11153
7178 -11153 -7059 2062 8668 -8631 -29836 -22763 -30396 -55100 -35177 -31091 -20416 -16255 -20994
7165 -20994 1053 7126 -14431 -35664 -37812 -14202 -3047 -12669 -17748 -15272 -22094 -17502 -22028
7152 -22028 -12808 8627 23951 19984 9799 -4979 11293 24051 19316 -13153 -40719 -50201 -37171
7139 -37171 -33774 -36901 -22269 -18510 -10459 5580 -6399 -11806 -16048 -37902 -43311 -31635 -32648
7126 -32648 -18575 -23164 -38198 -26069 -14375 -10163 -6862 -4313 -6129 -16317 -20896 -19594 -19394 -14713
7112 -14713 -14715 -27127 -28995 -31818 -26872 -37307 -46778 -37036 -24278 -9405 -8923 -11071 -27611 -35276
7098 -35276 -16745 -10690 -3011 -6372 -23117 -28258 -7894 -4187 -8564 -30229 -43833 -27220 -19167
7085 -19167 -16405 -17669 -13189 -35056 -60211 -43992 -28790 -20896 -40331 -36384 -26053 -26803 -32908
7072 -32908 -23988 -35772 -37997 -32931 -34657 -46622 -50190 -37041 -49184 -51504 -70123 -70391 -52054
7059 -52054 -36864 -14641 -3352 5922 17415 2873 -13718 -4495 19418 22465 18999 10431 -964
7046 -964 -3359 -16865 -25018 -25829 -5789 13530 20890 18819 8996 3151 -20212 -46484 -37474 -20918
7032 -20918 -13955 1369 16610 2275 -18823 -17517 -16215 -8155 -109 -5415 6963 9014 7321
7019 7321 30330 43716 45279 38841 13612 -1230 -8710 -4049 -12364 -33620 -34031 -22643 -9596
7006 -9596 3565 13946 19840 19895 10117 21083 17857 4280 5510 22217 25668 4269 -12041 -4712
6992 -4712 8765 -3782 -21701 -19783 -12629 -8002 -880 -14958 -33463 -27300 -19010 -24648 -24011 -33540
6978 -33540 -25873 -28181 -34841 -17918 973 14196 26773 15787 5077 -11315 -21433 -6131
6966 -6131 5378 9360 13268 -5753 -4563 -9285 -19142 -18792 -6376 -8837 -16351 -30762 -25985 -29793
6952 -29793 -32001 -23577 -32015 -27683 -17319 -20881 -16079 -22368 -26072 -17382 -13115 -2197 5486 -8945
6938 -8945 -7423 -3637 -24225 -36718 -22709 -906 -12900 -29495 -27925 -16671 -13136 -16650 -26957
6925 -26957 -24182 -21416 -9715 -7544 -7641 -14793 -9271 9590 20619 11767 -2866 362 -940 -9203
6911 -9203 -21507 -27611 -32122 -40224 -37531 -28970 -14729 -152 17212 27352 23950 1512 -12453
6898 -12453 -16676 -283 1325 -6030 -7695 -4048 -12769 -20041 -29858 -26549 -32649 -25701 -12427 -16857
6884 -16857 -21847 -12291 -14171 -32179 -43154 -43176 -22993 -15026 -6829 -15026 -31354 -30450 -26410 -10503
6870 -10503 -7044 -18908 -27745 -41677 -59732 -52482 -43765 -45518 -44589 -31664 -11092 -13638 -3090
6857 -3090 -13605 -5298 -5038 -12547 -23853 -10101 2440 -4856 -9334 5513 2848 -20465 -35828
6844 -35828 -33630 -12648 -3558 -9479 -9778 -2482 -9188 -9399 -7766 -8779 -14226 -14999 -710 -6182 -25680
6829 -25680 -17664 -16443 -19218 -35450 -29013 -21316 -47195 -28745 -6602 8301 939 -17753 -16614
6816 -16614 -7526 -4457 -7355 6721 9560 5254 -1689 3710 -1308 -1761 -7917 -19013 -12505 -6040
6802 -6040 -8274 -717 9554 2485 -4522 1752 5090 2645 -8219 -2504 2339 -7055 8378 20104
6788 20104 29094 11482 7162 15227 10839 -35 -18121 -12997 16091 24394 32721 25991 2465
6775 2465 3243 13436 -2070 3931 4925 -3221 -10056 -8205 -5096 -671 10333 10117 -6316 -25836
6761 -25836 -20829 -29597 -31260 -24154 -22516 -31360 -37295 -29039 -10504 6757 -3019 -17549 -20239 -22034
6747 -22034 -14493 -26059 -29243 -39788 -39141 -44828 -36370 -11959 -2457 -18049 -35008 -42207 -39728 -40417
6733 -40417 -43721 -34714 -28613 -25519 -23104 -21655 -18992 -10008 -5891 4460 19726 27447 13626 -10138
6719 -10138 -32778 -47501 -25654 -4351 9673 16551 14159 -619 -30982 -24673 -23594 -22888 -21179
6706 -21179 -9729 -10845 5620 -8110 -12088 8901 14462 14255 12794 13505 8081 11017 -2347 -10129
6692 -10129 -20684 -20467 -4270 1171 -9157 -12073 -25789 -27615 -18189 -3261 1350 3056 4717 -10065
6678 -10065 -33863 -38479 -4816 9247 -338 2910 20374 26168 18715 -947 -4414 -20270 -25317
6665 -25317 -26173 -27833 -27324 -21725 -28023 -31686 -18666 -20891 -19087 -24196 -37598 -47099 -48051 -43055 -41407
6650 -41407 -18455 -9914 -766 -3430 -19603 -18682 -7924 -1011 15947 29413 3961 -4177 -6366
6637 -6366 -7897 -32994 -21575 -10178 -37401 -67122 -78642 -72643 -50341 -13691 -3045 -5909 -10789
6624 -10789 -7762 771 -337 18075 10496 1506 0 -2241 -10844 -22731 -17986 -19583 -10331 557
6610 557 5775 11003 -18626 -12861 3105 -4595 -10259 -10402 -18319 -8400 1179 8181 8378 -15797 -16048
6595 -16048 -27127 -32614 -29372 -21170 -19016 -9955 -18288 -28231 -28425 -10182 -8910 -12176 -13240 -35784
6581 -35784 -49519 -19917 -2593 -3220 -10875 -19606 1509 5659 -4779 -17786 -10363 -18695 -19114 -30713
6567 -30713 -20376 -19200 -27437 -42214 -26951 -8839 7209 49 -14937 -12205 -11483 561 -11058
6554 -11058 -18282 -19486 -3445 5246 12398 19843 14139 12853 6033 1188 -892 -10945 -25718 -17900
6540 -17900 13459 22273 0 -5429 2367 8207 -7403 -22526 -22052 -14980 -21300 -25334 -23100 -16107
6526 -16107 -11976 3243 2395 -6251 -17402 -22694 -12118 -12059 -18393 -27606 -18311 4236 -9227 -25747
6512 -25747 -18713 -17973 -36783 -31522 -12620 -13819 -28164 -24358 -12302 -13319 -27715 -19312 -14525 -1135
6498 -1135 4495 7305 14415 -13762 -21658 -5305 -14210 -47405 -55253 -51745 -19248 -23510 -30923 -27774
6484 -27774 -19083 -6814 -21630 -28801 -21464 -4591 -7648 -21194 -20872 -13003 -10157 -12860 -21936 -21208
6470 -21208 -24413 -22025 -21154 -14577 133 17187 24368 27664 12400 -5717 -13726 -4322 -17876 -40635
6456 -40635 -33264 -22601 -26527 -20054 -1195 -4297 -12386 -26607 -44200 -32799 -21598 -14612 14395
6443 14395 26752 28151 9697 -5758 -25547 -24918 -14049 -10969 -13529 -20285 3738 17441 6067
6430 6067 -10517 -8566 -19265 -14147 3693 -8912 -16557 -6848 -7306 4810 12453 11866 7471 -9233
6416 -9233 -19744 -21807 -9883 -7246 6001 3482 -9555 -5501 -568 -7126 -111 -13105 -32398
6403 -32398 -32799 -19895 -6614 -29895 -33098 -15185 -16170 -17112 -18557 -31316 -43308 -54359 -31960
6390 -31960 -40065 -30061 -43846 -62554 -48035 -25897 -19258 -13125 -16551 -21157 -27277 -48129 -14170
6377 -14170 3413 -13862 -12176 -5135 -27481 -38784 -28567 -45776 -49600 -45640 -54207 -83907 -80978
6364 -80978 -50508 -28709 -43318 -36651 -14902 -28247 -41078 -16545 -9115 -17807 -26298 -24030 -14167
6351 -14167 -25044 -25024 -9217 -16066 -8570 -2480 -21639 -13063 -10893 -8316 -11015 -5814 2647 -6170
6337 -6170 -22200 -12505 -6971 -16419 -1054 4001 12007 23858 18753 24677 8407 -8977 -24427
6324 -24427 -20138 -30840 -31613 -42422 -35938 -18439 -3951 -7819 -30388 -39728 -29721 -21269 -2804
6311 -2804 15881 -2328 -34059 -42451 -37208 -27927 -5889 -7914 -32235 -29372 -14560 -18010 -22582
6298 -22582 -26689 -29219 -17734 -24440 -46900 -40502 -28697 -32791 -21396 -4776 -6957 -6510 -3569 -7352
6284 -7352 -12538 -18135 -35261 -47972 -34347 -10510 8224 16164 6182 -9530 -13269 -21432 -20955 -3994
6270 -3994 3416 5669 5704 9469 25011 23038 8097 959 -747 2364 -9359 -383 -18342 -32928
6256 -32928 -18869 -30175 -39093 -43985 -17601 -14770 -34555 -50005 -46056 -34264 -25212 -18081 -15414
6243 -15414 -18905 -5844 -15044 -24108 -29949 -36367 -24786 -13803 1683 4683 28603 31292 1294
6230 1294 -22656 -9414 14484 20829 19198 12647 4866 1036 2877 -205 20600 4929 17496
6217 17496 9317 2506 -6479 -9078 -12722 4560 7337 2593 6204 -16124 -36375 -33983 -17294 5198
6203 5198 9107 -2198 -1956 1805 -3774 -9616 -13910 -32226 -33855 -17403 -14566 -12819 -17609 -34329
6189 -34329 -29141 -4222 10966 27600 10743 -2970 -13891 -10796 157 -377 15642 23779 17578
6176 17578 12383 8573 839 -11831 -18789 -8247 -1579 -2145 -6450 -40091 -59453 -30270 -19883
6163 -19883 -16942 -15749 -9537 -3380 -4715 -11909 -2419 247 -13658 -27320 -19794 -9545 -8979 -19734
6149 -19734 -19090 -10289 -18190 -19186 -1702 5086 -8434 -17892 -7747 -5087 -725 17487 8960 -21554
6135 -21554 -32117 -31174 -20567 -7924 6329 3742 -6487 -6408 -22421 -34867 -27576 -14092 5735
6122 5735 965 234 -2092 -29516 -52350 -29649 -3122 -4656 -12534 -26679 -36841 -14823 4360
6109 4360 6207 17385 6406 7705 -4823 -12938 -9317 -13654 -4645 5120 20984 16538 -8661 -8224
6095 -8224 1177 10827 -2616 10299 16752 8661 14227 -414 -6100 -510 -14018 -545 -273 10263
6081 10263 26947 25042 -1770 -7133 -7865 -7859 4095 -9319 -15647 -5164 -9729 -24641 -6018 6698
6067 6698 4972 4470 9881 20947 26051 19433 13405 5033 -9393 -16114 -12964 -30620 -28613 -36015
6053 -36015 -44259 -43332 -43194 -43819 -22325 -25307 -37405 -38743 -48146 -31138 -22204 -17404 -22606 -35357
6039 -35357 -23409 -8391 -8294 -26581 -30119 -9749 -8098 -3704 -21005 -28121 -30819 -36364 -28744 -44400
6025 -44400 -31122 2724 14476 16223 22437 24719 1177 2230 3302 -181 1697 3761 4371 -22391
6011 -22391 -42759 -35071 -24466 -29521 -18162 -14241 -16714 -6946 -5862 -8091 -5585 -28574 -34958 -20427
5997 -20427 -26444 -28885 -1669 -1540 -14748 -21247 -24159 -20790 -8884 2569 -9317 -17462 -23890 -18623
5983 -18623 -21250 -22995 -26719 -19910 -23877 -17910 -22034 -21828 -29114 -19591 -15036 -10990 58 -759 10807
5968 10807 8400 -4737 436 5265 23318 25580 816 -6133 729 -495 -10529 1115 15026
5955 15026 34067 48869 33758 36356 24948 17017 15437 3945 -4406 -7737 -18054 -12455 -4542
5942 -4542 -9063 -11109 -35854 -37919 -7686 -7296 -31763 -30695 -11479 -3176 9653 19384 -1080 -15122
5928 -15122 -7503 -15849 -26359 -11647 4441 -11575 -24256 -25868 -8923 -15778 -29255 -18458 -97
5915 -97 -359 -19349 -27498 -18043 -10867 -2932 17610 5862 5813 1533 -14801 732 -6350 9363 31929
5900 31929 45294 39516 36410 27171 12965 9780 13941 23316 20310 -1570 -15466 -30684 -43204
5887 -43204 -39569 -30707 -19015 -10755 -7709 -27790 -27525 -17868 -24800 -21812 -13289 -16226 -12000 -5350
5873 -5350 -11957 -13012 -3099 19952 -6643 -5777 13897 17853 18976 19254 18581 5430 -20051 -26097
5859 -26097 -22960 -20207 -28701 -31405 -18954 -28241 -22604 -4043 -1955 -7031 -13874 -32560 -42126 -41835
5845 -41835 -18678 -10254 -13067 -3471 4552 -4281 -8353 -117 -17617 -20242 -16073 12790 37886 36288
5831 36288 16393 -16471 -31069 -27029 -38816 -28029 -3831 11647 12836 16947 7813 6797 13060
5818 13060 2477 -5813 2446 -8507 -21346 -23422 -17187 -845 -21807 -31272 -21633 -12006 -9229
5805 -9229 -19577 -4698 -6173 -15593 1401 -421 -6134 1999 8013 10969 8200 1374 -14237 -12386
5791 -12386 -8122 -30472 -37923 -23767 -14110 -17066 -15549 -1552 12195 11326 14525 11436 856 -17497
5777 -17497 -20767 -13000 189 -705 18894 21468 15479 -688 -18748 -1305 7722 4040 -19139
5764 -19139 -35700 -25100 -14356 -25370 -46742 -48365 -34267 -14716 -29047 -29576 -24235 -37258 -26770
5751 -26770 3829 -10810 -16740 -14565 -11230 10439 -447 -31557 -34293 -17184 -17736 -20829 431
5738 431 -10340 -23275 -32039 -20759 -7125 2072 -1821 -6669 998 -19748 -28893 -26710 -891 -8515
5724 -8515 -10841 8011 19192 -642 -14837 -12772 -11110 -6051 -3850 -2533 6405 14971 18776 10070
5710 10070 -5569 -17059 -898 -1869 -16744 -29783 -14487 -1359 -17765 -29490 -15375 6875
5698 6875 5141 11522 25040 16050 365 -68 -8750 -5261 -17208 -7513 7984 7149 8582 4925
5684 4925 6409 -11929 -10407 968 1929 2329 4142 9526 11919 -8187 -21259 -37139 -35113 -18406
5670 -18406 -25944 -32240 -27695 -18235 -10044 -21180 -5056 -3273 -10674 -25909 -13220 -12243 -12377 -2709
5656 -2709 16766 11928 1656 13485 19182 25791 11596 -5355 7196 13741 -1979 -13986 -15220
5643 -15220 -19571 -39775 -40198 -21910 -5755 -3025 16539 27885 -2355 -26805 -4426 13304 13052
5630 13052 -2517 -12535 -10919 384 7693 8962 3292 -833 1914 -24033 -34755 -30801 -12297
5617 -12297 -3431 -8028 -25380 -15195 1363 4772 12646 4341 -5338 -6908 -15314 -16359 9994 36004
5603 36004 25998 9200 -1176 -11187 -9210 -14201 -12517 -14944 -22636 -5526 15185 12233 20571
5590 20571 29841 10849 -2938 136 13278 27029 22740 -4556 -10102 -2286 3216 4310 -12990
5577 -12990 -16822 -6044 -23774 -30183 -22153 -9297 -13206 -17523 -4237 11351 -4231 -11588 -28953
5564 -28953 -20069 -9359 -21513 -14538 -14810 -7077 1693 15174 11719 -943 -16183 -13932 -5073 -10255
5550 -10255 -24317 -19914 -24376 -37223 -33644 -34745 -14071 -9414 604 12965 -1439 -13365 -22577
5537 -22577 -5974 8867 10829 12308 -2715 -2528 -629 -11273 839 11815 17304 26590 26044 32781
5523 32781 32379 37190 40257 21436 17152 21961 22153 32664 11622 -12412 -2099 -16387 -29871
5510 -29871 -9755 7012 -5579 -6101 -1172 -11450 -14401 -21786 -25673 -13263 -2322 -13348 -28647
5497 -28647 -28859 -24169 -20053 -26197 -25375 -36092 -31168 -25073 -20539 -17556 -7414 -14333 5147 -2197
5483 -2197 -7567 1866 18076 8700 -10778 -9332 10577 21964 14138 5783 -13297 -20002 -24800 -30024
5469 -30024 -25031 -26060 -7299 12811 25543 33092 19975 16167 30619 51704 43290 28158 18998
5456 18998 7210 4056 6762 4068 -1955 -4125 3239 9451 7241 106 18971 31592 11931 -2352
5442 -2352 -2636 -9099 -5963 -5787 -21789 -37458 -36085 -24160 -24447 -20998 -8322 -12862 -15809 -20130 -24113
5427 -24113 -21440 -1702 4447 -5582 -20140 -2061 11683 1007 -5943 -4799 -1383 2694 -8132
5414 -8132 -3350 2286 -11431 -10220 1796 6834 13075 12107 26903 32888 17525 8239 -97 -465
5400 -465 5262 17737 27413 16541 -2022 -1183 10900 17657 4699 5067 340 -8636 6117 21993
5386 21993 17777 21066 33633 11699 -14163 -13824 -12626 2809 9106 13187 17853 5291 -5706
5373 -5706 -4446 1808 3430 17446 18952 -12525 -21622 -19553 -14088 -1770 11555 17570 18725 9103
5359 9103 -972 -10646 -17735 -27187 -13460 -13956 -19567 -20445 -8316 2819 -10899 -17337 -16731 -1655
5345 -1655 8 3871 6417 -14856 -15920 -5486 -1122 -1166 3653 -8491 -26736 -17468 2243 -4665
5331 -4665 5955 18633 3873 -7894 -22126 -18209 -8333 -19897 -35978 -25391 -27241 -33302 -23918
5318 -23918 -18945 -19177 -6308 2822 114 -3943 -1009 21690 21710 -2443 -8470 -4831 3348 7122 -3735
5303 -3735 496 2443 -4639 -10138 -21898 -30288 -7855 5695 34116 47498 40561 26456 11580
5290 11580 -12736 -24473 -12036 4793 5260 3935 24149 35519 16801 9391 17457 18742 -669
5277 -669 -10744 -2967 17125 21164 8190 3376 -27256 -25411 -15067 -3509 -16049 -21021 -25378
5264 -25378 -8593 11455 16152 33274 39352 17252 3740 12825 25515 30050 21776 -3974 -18616
5251 -18616 -20500 -9320 -14391 -30432 -32925 -1649 8198 -4599 -9222 -29153 -42841 -42993 -23898
5238 -23898 -5807 19439 27185 24035 -1962 -11258 -18198 -26890 -37017 -28124 -28397 -24403 -21004 -3667
5224 -3667 -505 7480 15717 37485 39353 26603 -774 8488 5362 -6975 -1914 -1288 -11526 -31361
5210 -31361 -36186 -32491 -6868 3819 2543 6947 3940 9648 7838 1805 -14199 -8612 -29620 -35055
5196 -35055 -25000 -11364 7582 11840 10876 -481 378 1002 -5468 -7522 642 24816 39134 22821
5182 22821 183 9821 392 -5262 -15762 -33874 -40970 -39550 -24530 -2845 3252 10533 1709
5169 1709 -16422 -25752 -30286 -13421 837 -2688 -7548 -16337 -12199 -8246 -6203 -3927 -315 17278
5155 17278 13496 -9175 -28579 -23369 6058 18165 7106 -4258 -12283 -21045 -8990 2722 -3115
5142 -3115 -9419 -25749 -23373 -16837 -32895 -14924 17237 22138 3760 2020 -1777 2977 2887 9762
5128 9762 10532 1091 -11487 -21944 -39300 -49647 -28347 -10695 -3981 1042 12038 2919 -1749
5115 -1749 -3752 -6971 -13732 -10526 887 -5191 -22036 -42537 -46727 -29047 -35220 -44319 -29699 -26903
5101 -26903 -47033 -37742 -33285 -37265 -33314 -16613 561 5853 -13985 -13767 -22038 -11781 -3202 -351
5087 -351 -3514 -9534 -3204 4937 1971 -1488 214 -2292 5031 -21039 -35333 -24458 -17916 7637
5073 7637 11211 18787 13149 -4236 -31704 -25776 -13454 -10138 4752 15059 -8560 -31110 -30973
5060 -30973 -32094 -11579 -8475 8601 9649 -10435 -20213 -22546 -20321 -13799 -6634 -3394 -2589 6934
5046 6934 -2857 -22199 -17731 3007 -4875 -6928 -8278 -4033 1748 17781 13658 7992 -565 1253
5032 1253 14445 11850 -6164 -28942 -11198 15183 -4256 11848 18897 17754 15390 19220 13970
5019 13970 7379 2404 -1424 -18859 -34682 -27196 -6640 -3420 933 -5771 -6516 -4579 -4649 4822 8701
5004 8701 7897 -8309 -3450 -8531 -2895 -21108 -18869 -20904 -15000 -2875 -5738 -35939 -42770 -23592
4990 -23592 -15706 11743 4531 -4829 -22093 -15542 4776 8787 10682 3652 1860 4960 6454 3995
4976 3995 -1717 11904 7986 -14245 -15396 19252 8338 -6922 -23520 -27328 -5582 13242 20989
4963 20989 4304 2408 2147 1738 -9987 4304 19751 36238 18227 -3694 -14260 -9531 7697
4950 7697 8698 -4736 -4938 9401 20485 25860 28638 14636 -27503 -31430 -24179 -11865 -13509 -15088
4936 -15088 -21199 -13975 5591 -1228 7039 -7559 -30182 -40373 -43322 -31848 -11749 -19141 -21308
4923 -21308 -10220 -5748 -6259 -8197 -34791 -32763 -25199 -9382 10157 21157 -7055 -20792 -24032
4910 -24032 2445 29451 26979 27997 33997 24840 30665 23534 23183 24384 7286 -4196 -7278 -8923
4896 -8923 -7895 -12902 -3864 -6008 -24747 -3325 20016 10205 8630 -12690 -17384 -32941 -31313 -13425
4882 -13425 11138 7025 -2294 -1036 -10250 -19791 -16838 -25932 -22016 -24790 -18278 -12673 -1276 -14138
4868 -14138 -25143 -15900 -12987 -26654 -18264 -3194 -3208 -14627 -162 8885 4524 -1362 -4939 -5636
4854 -5636 -5771 272 2483 1402 742 -879 4961 4944 17059 27492 33237 41487 17888 -5407 -20567
4839 -20567 -38767 -51640 -44105 -17298 -14737 -29747 -26801 -17979 8620 6377 -5156 -6340 13927
4826 13927 -1944 -5558 -5564 -10436 -20717 -19349 -9620 5167 16112 -8507 -9700 7230 3863 -10607
4812 -10607 -4968 -10291 -1700 -5875 -15834 -1718 -470 -4235 -12714 -15687 -7921 -16899 2862 11402
4798 11402 -1158 -7505 -14 -2989 -10717 -6888 2192 -2724 -5594 5275 12180 17227 35492 23286
4784 23286 27278 17013 12343 12160 11032 -1924 7121 20288 18777 3151 2465 6806 -11997 -22685
4770 -22685 -11690 -3268 -1033 2346 1210 -1866 -4294 -5308 609 22376 34751 40338 26639 10184
4756 10184 8362 11856 -8253 -17208 -6120 5710 6570 9106 2717 30476 38520 32566 11409 11026
4742 11026 -4683 -5239 -4662 39 11035 25844 29064 24105 27198 19388 -22520 -51568 -39066 -13390
4728 -13390 -13271 -33989 -31901 -23871 -23879 -37640 -22888 -8012 -4942 -4166 -2415 -1024 -7458 21578 57607
4713 57607 60090 26395 -6010 -14561 -9317 -8391 2997 2889 1340 132 -6729 -19904 -24586 -30922
4699 -30922 -35975 -22895 -28715 -49088 -59550 -54268 -57628 -35486 -32066 -18116 -17360 -23196 -29592 -9094
4685 -9094 15144 19432 20199 13931 23339 24363 16772 10473 26182 25770 10544 -20149 -22335 -7519
4671 -7519 -7315 -5028 -12333 -13042 -4291 -12610 9781 24069 17632 19411 9525 5816 7251 9037 -12699
4656 -12699 -13026 13306 11588 -2289 -7425 2957 -8940 -19299 -18639 -6411 -12204 -14701 -27838
4643 -27838 -39569 -38139 -37728 -49715 -46994 -27062 -24804 -26252 -23686 -15804 -16699 -4850 10134 781
4629 781 -9411 -4848 -6518 6136 4297 10018 3848 11053 23388 26427 7432 -15936 -34556 -31671
4615 -31671 -19025 -21326 -12526 -6998 -17081 -26219 -8578 -567 7995 14050 19383 28690 30578 22553
4601 22553 23072 14737 8957 759 12110 27102 23695 26875 36897 39865 48202 41956 40406 10926
4587 10926 -10401 -1275 13788 -5581 -4516 15055 11574 -3234 -15020 2664 19712 22731 12520
4574 12520 18043 16608 9549 -10766 -14883 -13843 7345 8230 2072 8571 14796 6951 10721 5499
4560 5499 -70 6985 3693 -2043 -53 14679 25148 21696 18794 19893 3481 9936 12184 10939
4546 10939 34361 24701 24012 20202 -4148 -5935 -3088 -1388 25957 36434 33207 37968 44469 24969
4532 24969 23789 31454 29819 34427 34069 23200 31122 15836 5764 5429 -4018 4417 7352 9601
4518 9601 -2127 -13695 -3825 -3126 -27369 -27143 -14592 -4028 -2184 -209 21667 46231 30929
4505 30929 24663 10385 -13369 -22276 -10232 -6416 -7225 -7602 -3462 -16715 -26567 -25086 -23120 -15376
4491 -15376 -26543 -15560 8020 1579 4528 31428 44778 36434 3879 -3299 -4245 633 -923
4478 -923 -5992 -21525 -12837 -24732 -40341 -40621 -46442 -40173 -38988 -60072 -54193 -41794 -28980 -24569
4464 -24569 -18650 -7995 -8510 3322 -2124 -6155 2725 -4953 -11422 -11431 -14035 -18371 -11784 1092 7943
4449 7943 -4372 3488 11203 -6465 -9004 -310 393 -11447 -12140 -14967 -9400 -5040 2919 -7005 -10497
4434 -10497 -15599 -17305 -19753 -27601 -19163 -16226 -15180 -7045 -10772 -19470 2239 16439 20717 10624
4420 10624 -2638 8409 34568 39157 27557 19833 8051 12666 25565 12742 6814 11678 -5690
4407 -5690 -18498 -799 -5594 -4115 3077 -246 -1261 -5332 189 5500 15453 16676 4803 2270
4393 2270 5143 -5068 -16029 -19840 -19772 -14507 -7006 11127 17782 34732 28962 25746 10681 -4762
4379 -4762 -4526 16929 24992 23285 13417 13314 13299 16523 21401 21435 21344 19145 38700 39185 22073 15624
4363 15624 6754 -11847 -17945 -6530 555 10800 19444 8704 -12387 -7442 3606 -8048 -9172
4350 -9172 10216 18582 40182 51945 30060 36464 36396 29821 7685 -19501 -10866 6540 12587 3754
4336 3754 -13590 -18315 -19116 -1857 -223 -7033 9788 32037 28709 16384 5425 2601 11615 10099
4322 10099 5514 1864 20019 40551 28849 23054 29990 23551 -1768 -24683 -43912 -47184 -57719
4309 -57719 -42297 -19727 3472 -6929 11125 22884 20328 13920 9476 -7181 -3911 -5778 -14786
4296 -14786 -4911 -3012 -19602 -1476 6127 6418 -12186 -23679 -15891 -22025 -30128 -4762 -5992 -13426
4282 -13426 -34977 -36499 -27535 -9683 9465 6094 -14490 -17783 -2059 12022 8636 22158 28402
4269 28402 32113 41747 44677 39036 32644 8652 -82 9112 12163 12133 18060 7524 -5207 -9557
4255 -9557 2978 -16383 -18634 -30833 -36821 -24251 -24784 -13843 -16218 -13867 -17640 -21481 -31598 -537
4241 -537 12763 20259 9560 -13376 -16334 -5185 -16051 -22035 -22405 -19821 -7500 27589 21191 -9684
4227 -9684 8892 16555 6184 8355 -5309 -23156 -24850 -6533 7914 14361 13350 -4758 -22683
4214 -22683 -23614 -10710 -6881 3723 14037 6532 -7933 -16189 -5985 -3032 83 9726 19311 24414
4200 24414 4374 -1457 13228 14153 1029 -9862 -7389 -6328 -2073 -1787 -10057 -557 -13790 -21033
4186 -21033 -14648 -19455 -7603 -1591 -11003 -7082 -7337 507 9114 8344 16757 11515 11714 2184 -10702
4171 -10702 -21163 -18215 -4306 -15323 -21774 -19587 2341 24981 24073 -1095 -4963 10971 12202
4158 12202 23557 24317 18005 6095 7977 9023 12937 6947 20721 11417 2913 -6057 -19392 -9199
4144 -9199 4280 1756 -10320 2347 18286 16640 9209 6225 7635 10251 16034 15308 22979 19563
4130 19563 20324 10227 10947 13874 -851 -23075 -27468 -35808 -27458 -8565 12634 20585 -1472 -20092
4116 -20092 -20676 -18379 -14454 -21253 -19966 3526 27005 35463 39682 37053 33798 17588 -17294 -36037
4102 -36037 -20628 -5994 2147 -5714 -8777 3111 13886 9080 -5936 -3312 -5830 -3886 -1701
4089 -1701 9235 11764 19212 6548 5362 14943 16164 10001 6322 1173 315 4924 3283 8288 12465
4074 12465 -861 9478 -13635 -37634 -26542 -9584 -1002 12339 17809 16406 29657 16032
4062 16032 12336 21900 27672 18695 9720 9159 30460 38027 30183 40992 17518 5520 5372 18400
4048 18400 22173 30752 27112 6264 -48 9117 -6408 -13756 -18221 -17462 -13201 -17389 -32865 -34119
4034 -34119 -27719 -38764 -25867 2577 2859 -22134 -12277 -28764 -23943 -20270 -26395 -16126 -11713
4021 -11713 -25007 -14352 -6217 -15260 -35594 -25115 -21733 -19008 -14497 -13006 -22344 -27348 -33250 -62068
4007 -62068 -51960 -26460 -18705 -4739 -3752 -1013 -5902 -2656 2630 3867 -8607 -14385 -4449 -9230
3993 -9230 8349 7084 -7844 -21638 -22467 8270 13589 17065 15394 924 -844 14680 8682 2208
3979 2208 17947 29018 32702 16978 -3053 15345 18717 20935 19012 5601 377 11166 19022
3966 19022 22553 29434 15604 3826 -2428 -5333 10182 31637 26857 16711 23697 11977 2520
3953 2520 2399 -21118 -28969 -16513 -15582 -6460 5788 2680 16670 26725 28109 17358 7021 -1923
3939 -1923 4280 12618 15357 -3695 -4559 -5034 -17483 -23018 -37806 -18104 -9286 -442 19147 15499
3925 15499 2880 6096 17759 45537 47822 36236 39182 61944 63029 42212 22858 33384 33507
3912 33507 23355 36995 36881 27347 17061 7208 1248 5329 -343 -4796 2198 8853 5121 5706
3898 5706 -2663 862 -2886 5005 10548 1936 9259 6052 7758 19086 10258 -7906 -17947 -31328
3884 -31328 -30324 -27346 -16860 -7196 2083 16379 19189 16957 6500 -12953 -20865 -31187 -38733
3871 -38733 -19882 -3901 1920 4426 -4855 -20127 -18126 -9475 -11798 -22940 -18436 -20033 -17244 -7140
3857 -7140 3294 9124 10041 -3265 1968 11574 -1530 -14289 -14326 10409 23584 16239 -3128 -22180
3843 -22180 -37454 -23856 7167 -8070 -29055 -20062 -19649 -5137 -4255 -3036 -9581 -12125 6692
3830 6692 -3242 -2647 -14770 -19365 -8900 -364 16207 4455 -17436 -27879 -37098 -19737 -7000
3817 -7000 8887 21726 14857 8881 19851 -2773 1891 24915 36033 49609 49264 17837 4159
3804 4159 12266 12818 20446 11463 19431 29569 27448 7168 -14258 -31797 -42393 -26727 -3094
3791 -3094 2287 6335 11337 -11061 -10041 -4829 1799 5032 -2675 -15645 -18975 -24852 -18581 -4953
3777 -4953 3539 20096 21794 16335 5028 16264 32157 20339 21228 26556 20234 20092 13527 -2768
3763 -2768 -17303 -18763 -6745 -7816 -39000 -22093 -12998 -16435 -17481 -6484 -7709 -26078 -31478
3750 -31478 -1563 13716 -9176 -28237 -23391 -8469 -6461 -15908 -39319 -32441 -26105 3602 9756
3737 9756 -1211 10161 25251 17353 14477 13728 10392 15706 -6128 -15516 -14386 9415 4273 -24360
3723 -24360 -38976 -13884 -3795 -2437 -10880 -4571 -2237 2337 -9626 -22058 -34363 -28646 -10341
3710 -10341 4551 6090 4340 -20768 -30429 -13906 -13397 -12527 -468 2347 -5608 -5859 4530 14809
3696 14809 1750 -17167 -13445 5762 -925 -5118 16036 17466 -6019 -24278 -23019 -11595 -8430
3683 -8430 -896 -12743 -8614 -1771 -7723 3881 7721 -4957 -10160 -23097 -325 13561 29914
3670 29914 23228 -11506 -15319 -19229 -2404 13900 10829 2881 -11709 -19459 -19351 -8417 5274
3657 5274 -5794 -12400 -8252 -1985 3756 236 -14069 -5768 13623 35711 35279 20955 3902 -12371
3643 -12371 -6929 11000 -3421 -10380 -16338 -17426 -10641 -32612 -22215 -17290 -13563 -16271 -9235 -1288
3629 -1288 -830 -8001 -3045 -11006 -12788 -28170 -34808 -36715 -18478 -11036 -17594 -20191 -12786 5714
3615 5714 19869 31438 20398 1366 -11838 -15285 -183 1781 -9851 -10421 -18178 -8079 4856
3602 4856 9049 15615 18720 16138 17020 -1509 -9205 15655 1849 -31164 -33434 -30721 -17778 -16838
3588 -16838 -11379 -345 -11271 -18756 -9219 8729 13998 -2848 -4810 2827 8163 16320 4309
3575 4309 12668 29221 35693 28059 29117 28060 22146 21453 30306 23983 4049 -10908 -4174 -5913
3561 -5913 -7525 -13553 -15165 -2516 14225 25644 22862 13324 6593 12032 5736 -9344 -27463 -28196
3547 -28196 -30582 -12939 9224 16998 15438 24754 37169 49930 45246 34863 23337 12597 -10030
3534 -10030 -22327 -10308 -7976 -2297 -9698 -4999 14562 32660 30470 23598 26204 30317 34394 14225
3520 14225 16541 19341 29401 18941 9860 480 4534 13470 13229 18095 34983 31769 27700 19144
3506 19144 14924 3483 8143 19338 4093 -17018 3280 4807 8822 11589 21545 19885 27285
3493 27285 38250 27045 17082 9033 4040 364 5688 -564 -10627 -1913 -13647 -25937 -21849
3480 -21849 -20040 -12087 -5765 -13324 -12966 -36323 -35603 -9152 10568 2361 -28674 -40833 -20955 8310
3466 8310 24991 18150 2031 1352 7510 -493 -7713 -2817 -3148 -19520 -12485 -9125 -12864 -23185
3452 -23185 -9571 5076 16098 15149 11777 14756 18959 14706 23415 18653 18181 12443 6313 7056 9834
3437 9834 1488 5763 22493 28370 13570 4296 -950 4252 4111 5925 22098 17163 5787 5325
3423 5325 16578 15117 14146 -106 -8841 -4006 -5763 2881 -7765 -10684 -678 19702 31498 23241
3409 23241 12880 -4657 1353 -16099 -34281 -23741 -17784 -1640 -6137 1102 -3060 -7348 1212
3396 1212 -11183 -23232 -25056 -21871 4887 24574 3473 -12942 -10200 882 -15643 -21327 -12104
3383 -12104 -12326 -2463 26013 24276 8857 -3279 6472 16396 -3132 -13957 -18929 -24690 -19018 -12878
3369 -12878 -2256 -15151 -5805 -2847 -8235 -19533 -22997 -24630 3991 21623 11734 18400 28306
3356 28306 24845 10753 -7102 118 4323 -20358 -20763 1255 5674 10676 20733 7666 1333
3343 1333 -8075 2401 -6258 -11997 -10958 -11485 -55 3658 7807 17365 6916 1562 -13120 -18061
3329 -18061 1034 9304 5266 -20051 -5800 7887 425 -10509 -8484 -18671 -8703 -4548 -12390
3316 -12390 -11974 -18151 -27230 -25719 -12371 -10817 4617 23400 33203 21253 495 -14963 -18476
3303 -18476 -9725 -15440 -3159 8871 6737 30617 32996 5934 -14263 -8409 -13584 2676 25567
3290 25567 24103 28576 21274 6999 -3786 8712 22902 8992 -5281 -27689 -28737 319 5997
3277 5997 11572 36146 25737 6623 16359 21782 20931 2025 -9775 -30408 -36534 -39709 -26375
3264 -26375 -9060 -10657 -4693 525 12872 24813 11487 837 6828 8812 22428 24168 14359
3251 14359 20407 8751 -4321 -12025 -15364 -3151 13764 14698 21044 16180 23484 7813 -3829
3238 -3829 -5586 -10539 -21657 -29294 -23251 -7678 14793 18251 11681 10311 -7197 -25920 -26392 -19725
3224 -19725 -2328 -10187 -15689 6991 16178 4102 -517 9161 18426 16168 11966 9264 7757 -1830
3210 -1830 2666 2493 11607 -14263 -11867 -5538 -11744 -7736 8545 8442 11650 27114 24193 20481 14709
3195 14709 -5992 -9607 -13567 -28805 -38768 -41151 -32332 -27780 -30366 -20133 -4012 3196 8118 -12311
3181 -12311 -12807 -11165 -21419 -3903 6605 -9800 -15159 -9764 2642 -7953 -18042 -8764 -12167
3168 -12167 -6346 -6136 5856 11812 27378 25111 5452 17566 21277 10514 19149 22707 12854 21123
3154 21123 22401 33162 16018 -7296 -7694 -14847 -27855 -45300 -32998 -26733 -19796 -23666 1023
3141 1023 79 -7159 -13532 -5770 11379 7417 -1158 2598 7860 -3718 9559 25096 12126 -4079
3127 -4079 -8682 -15842 -6287 12867 29852 29768 10516 -2839 -502 9758 6954 1327 12675 26703
3113 26703 13155 12433 26547 32774 18297 33679 30142 19005 18679 6513 -18717 -32733 -28434
3100 -28434 -14607 4393 12379 14801 -12476 -22664 -6432 11656 25266 27039 25520 14668 413
3087 413 3232 -6957 -11594 2163 -990 -22317 -17293 -6780 16436 21119 9551 11371 -8133
3074 -8133 -14792 -13613 -34284 -26245 -10818 4657 5320 -7420 -20116 -22116 -18009 -9882 -17807 -11580
3060 -11580 -3829 -1207 8765 24211 14818 -4802 -16401 -12550 -30976 -32353 -16226 -18714 -20032
3047 -20032 -13420 -8301 -13250 -11021 -13016 -21488 -17029 -10409 -8298 -1496 2843 -13903 -6132 2776
3033 2776 15887 30512 22276 28313 26377 14339 1064 -13405 -5367 -2806 -829 -15106 -13387
3020 -13387 6917 7016 -12231 -9573 2241 1031 2925 2032 3177 -29729 -40864 -19924 -27251 -25593
3006 -25593 -7509 -4230 -11597 -6173 13702 12321 11158 10964 4621 11359 17641 24094 25022 35601
2992 35601 35957 23026 11307 21421 33825 38164 40766 40391 50105 56825 51513 36250 20461 2133
2978 2133 23512 38114 15294 11722 5013 18041 23026 31410 40630 38058 46647 53616 22173 12878
2964 12878 13541 19975 24594 22474 9160 -3233 -2963 3047 18886 11245 -1699 -8948 -31758 -38812
2950 -38812 -48922 -33793 -8809 -12383 -26415 -34623 -34535 -29175 -14088 -1627 9975 19389 22620
2937 22620 32816 32142 21075 28259 41722 31518 27402 24661 26823 8836 16286 20385 -7504
2924 -7504 -19308 -8300 16375 12829 2304 -2884 -393 -17309 -5612 -6817 -9883 6738 4075
2911 4075 13815 19826 20459 553 -11100 -11368 278 2823 8647 18519 19665 16932 8998 14549 24121
2896 24121 11665 3043 5865 4718 34416 30121 17796 30172 32694 28794 24175 19872 35939
2883 35939 26304 10503 -17901 -33576 -22491 -9377 -5748 -7295 -7973 11918 14516 8753 23455
2870 23455 28346 29750 49606 47161 35276 8631 448 1821 -7550 -9278 -5736 15759 34048
2857 34048 44885 21199 -9245 -23218 -17849 -3821 -1606 -4800 -3487 -13536 -34955 -17836 -11292
2844 -11292 -17293 -16388 -9663 2692 -9227 -28902 -33284 -33679 -32345 -19169 -22430 -17657 6124 15646
2830 15646 33026 42928 36852 28817 3892 1764 -17193 -22006 -13376 -7917 10486 28385 19100
2817 19100 25243 32851 27963 24797 22703 -2963 -21678 -18302 -6081 -293 6255 -8394 -2216 -5351
2803 -5351 5387 6103 7462 10153 13542 1353 -10529 336 -3551 16896 42534 44360 40478 55621
2789 55621 63664 44365 46992 54327 37796 17651 31234 33745 33523 32352 37923 37482 42439 27072
2775 27072 15178 10128 12901 33149 35512 32820 23460 13597 6809 17270 27103 13487 -1991
2762 -1991 -8556 -8697 3439 14217 15570 19344 12104 9707 17695 18996 9212 16677 10788 13857 25553
2747 25553 24472 4217 20466 34240 22066 25795 20107 28169 18844 6127 -2620 -1096 -2359
2734 -2359 12455 7188 22955 27930 10030 -10417 -27626 -26170 -10891 -5678 -1770 1567 4231
2721 4231 6706 15655 28987 28667 12593 10549 19572 18646 8159 8480 11753 -21639 -36043 -19539
2707 -19539 -12244 -2737 -19745 4769 27348 34740 22475 -1375 7509 22110 25740 34441 13567
2694 13567 -3785 3817 -946 -10779 -18861 -14394 -10416 -9454 16632 52021 56722 43069 13483 -1461
2680 -1461 5521 29141 11384 503 -12591 -1688 15248 -1988 -25482 -25136 -13351 1774 -9390
2667 -9390 -3701 -12338 -25281 -31822 -41188 -31071 -23273 -9193 19505 30874 24086 5225 -6736
2654 -6736 -26480 -26797 -27227 -28218 -10087 -9823 -9253 8663 22075 20367 17592 25423 8722 -3197 311
2639 311 -22548 -30078 -4081 11947 -1627 3808 12695 6043 -446 -21655 -22399 -13339 2082 19188
2625 19188 7449 -17748 -22453 -25590 -27281 -31057 -7032 -8655 -2232 6281 6717 -3657 -3179 4372
2611 4372 13623 15938 22278 18745 12838 20422 13521 12665 11531 23588 3524 -3827 397 -16760
2597 -16760 -2305 8014 6504 23965 36416 30011 19016 -3545 -19137 -23522 -2335 23483
2585 23483 17864 24088 20546 22155 -5311 -11029 -13403 -24267 -39205 -28360 -4205 -1345 -7870
2572 -7870 -647 1592 -11665 13947 28897 25424 27903 14623 5374 11122 19912 -2490 -9056 7860
2558 7860 13539 -6358 -10961 2726 15353 11376 6260 6294 -4593 -27488 -40035 -30028 -13978
2545 -13978 -4135 16571 24672 11047 -18040 -32832 -25451 -8347 8024 26139 18646 15097 13276
2532 13276 8066 1575 -3478 -3636 -3753 -4214 -14647 -26960 -35144 -13779 -19243 -34683 -15158 -1262
2518 -1262 4520 -16497 -5559 4794 2948 5634 -5625 -9732 -26379 -31370 -29719 -27208 -28184 -9090
2504 -9090 -24003 -24475 -27379 -9148 285 14432 6970 -23762 -36998 -6609 4317 4539 16495
2491 16495 22319 18255 6121 -12480 6421 16543 10971 13761 12655 11627 1545 3102 8406
2478 8406 -14460 -3771 4946 13118 20626 11112 -3016 -27310 -17559 -12531 -11900 -1820 -1111 -13171
2464 -13171 -10113 6954 12100 19732 45522 36493 16278 20397 8871 -8101 -2948 510 2230
2451 2230 13727 24007 20981 22802 8519 5967 14264 22278 20875 23619 19738 882 -5411 -9662
2437 -9662 6161 11220 7773 15354 45428 30413 7854 2028 -6314 -5826 881 -4737 -5292 5975
2423 5975 2801 -5538 -521 10854 7948 -5613 3896 -12035 -35757 -32622 -23229 1380 16339
2410 16339 32316 22802 2094 -34602 -33981 -5218 35127 26434 20849 8579 -7354 -22763 -14380
2397 -14380 -17805 -2861 10862 1464 1585 8922 16293 21060 -4566 -6441 2419 -2659 -1180 2110
2383 2110 3179 14859 22340 37182 21705 8824 -1122 -15678 -27658 -13725 6901 14223 16630
2370 16630 9355 -5051 -1292 12186 24362 33735 29406 40098 62023 47060 20489 24044 23682
2357 23682 16436 -8824 -24416 -11753 -2549 210 6694 5161 12803 8864 8390 3194 11295 1022
2343 1022 -9986 -17379 -22699 -7600 -8587 115 1444 -14029 -10782 -22088 -8544 12434 18658 14836
2329 14836 13057 32033 15958 -1366 4280 1256 -14917 -4862 7730 18831 38365 54710
2317 54710 68988 65834 43835 45413 36489 19690 13643 537 -94 12996 13914 6786 -16752 -18951
2303 -18951 -9936 -7179 422 10499 15316 24850 14139 -4775 -7884 7763 10005 -351 11548
2290 11548 32691 17256 10911 11093 2496 4899 -2579 -8805 -1177 -8935 -11512 9407 12381 7864
2276 7864 1934 20370 9365 11920 -4136 -13203 6097 15231 24537 34409 18897 20418 17096 22644
2262 22644 19891 29456 41161 25618 17271 31207 30613 25128 31457 24746 21995 22744 29148 29458 14716
2247 14716 21108 17577 21527 31868 32729 30825 23789 11903 -1315 -1481 -6496 -4601 204 9226
2233 9226 20950 27163 4765 -2191 -2572 2377 7717 15012 39611 15445 -27360 -21312 -20857 -28323
2219 -28323 -16372 17016 17477 -439 3651 3931 6518 6032 17921 10643 12420 19663 -7092 -7680
2205 -7680 15684 10057 17646 8875 -1059 15686 18789 -2619 12429 23731 31372 29284 29126 24716
2191 24716 19241 12929 20678 35208 22364 -1786 -17817 -22065 -1399 17813 17673 7367 15174
2178 15174 18016 14430 15816 16636 -3977 -20113 -16307 -2431 5617 4312 -6717 -8226 -4215 -12812
2164 -12812 -1309 9316 2064 -6461 134 1267 4422 25035 24895 22626 8089 19878 11056 32046
2150 32046 38234 33025 20274 17046 18133 7099 -13783 -1533 5921 19611 18837 8272 -665
2137 -665 -1599 1298 24361 34968 25446 30553 41505 23879 16543 15209 16449 28201 35749 31688
2123 31688 13187 3737 19270 26007 24482 15148 11648 3029 -1718 13532 10150 19107 16416 11548
2109 11548 -952 -6601 916 -5645 -7539 -11037 -24166 -28888 -24945 -15832 -24084 -33831 -35063 -2330
2095 -2330 8570 17416 27102 22271 -9664 -16853 -7530 8909 8131 6321 30216 22526 13609 270
2081 270 -13702 12655 27069 23611 8363 -1211 9001 -15124 -27943 -21751 -18183 16789 35840
2068 35840 32532 31787 32456 20363 11855 10490 9604 27984 30379 27946 11508 7349 -13859 -6555
2054 -6555 7871 3275 -5510 -9473 6324 14048 8459 -3021 -9231 -3343 13207 22600 7388 -1866
2040 -1866 -7499 -9419 6881 20852 12439 10958 8164 8188 9321 13003 1916 -13069 -30510 -41433
2026 -41433 -35009 -33083 -25832 -30419 -24005 -21862 -26685 -19719 -17724 -30072 -10844 -10540 -16954 -15461
2012 -15461 -10208 -3395 -11744 -14335 -15219 -10413 10695 14282 3273 -8544 14873 17283 13063 16376
1998 16376 12150 9634 419 -14572 -12111 4674 -2446 -24392 -23818 -10985 -3086 -1073 11612 2768
1984 2768 -7266 3080 11324 35123 31273 29174 19403 7357 -879 -6359 3918 23075 9332
1971 9332 4742 23908 34293 24545 11112 8928 1919 -9281 -11193 -7208 -15066 -1040 19232
1958 19232 17564 16228 16520 9917 6251 -3653 -23268 -35104 -13597 9154 8653 17254 18470 9352
1944 9352 -5240 15256 21023 21398 15732 7515 2492 2002 4093 -1430 -12538 -3644 11337 22701
1930 22701 39412 36649 17490 2672 -16123 -7844 1734 -12596 -18963 -14499 -1227 -6887 -15486
1917 -15486 -14271 -10921 -4402 -1072 -5945 4249 27674 37968 37561 31042 19720 20835 14094 15597
1903 15597 9219 2294 -1131 11523 22099 4654 3449 16220 23926 32116 19764 6640 11891
1890 11891 1254 1445 19041 11423 10769 14531 24256 33443 27040 10224 -2506 -25577 -19752 -7274
1876 -7274 -11119 -14547 1526 6362 -11206 -12103 1736 1201 16441 22279 21176 22287 18680 1313
1862 1313 -16164 -11428 8716 1868 -33890 -40544 -22514 -909 -6927 -22279 -29634 -31427 -25213
1849 -25213 -9065 11980 9585 -7783 -21218 -8945 3673 10976 18801 18634 24932 21109 3384
1836 3384 -6346 -1822 -13135 -18954 -28526 -15314 -8686 -23302 -25210 -11994 3606 12670 9278 3514
1822 3514 -684 1901 23152 25313 28163 14554 7213 20822 34117 41569 52409 42772 47873 28596
1808 28596 13270 19404 13705 10588 -4599 -6347 19153 3657 -8155 4534 6019 11 -10697
1795 -10697 -2553 15807 19035 10967 9480 4948 -7385 -4573 17272 8088 3512 -3037 -6810 330
1781 330 19531 16179 4399 -5053 4858 5520 -3609 -1443 19719 25717 19786 29005 39583 29707
1767 29707 49001 48316 39991 41054 46806 50922 18015 26650 31097 17411 15417 24740 26187 17728
1753 17728 2908 -4620 -6507 2005 5399 13269 4059 -4585 -27628 -44364 -23004 -1848 4770
1740 4770 -1559 7011 13704 9601 23552 33136 26405 19089 13690 12660 5927 -2974 11612 11696 16229
1725 16229 663 -13893 -26310 -22495 -28269 -14455 3980 15143 6473 -1602 -31243 -40873 -22336
1712 -22336 -27920 -28470 -13933 14993 31389 25486 15705 -1472 5993 27666 28466 27468 47121 30674
1698 30674 328 -16440 -21614 -14713 -13704 -14557 -7057 -8041 1444 22955 19597 6928 -3273 -2166
1684 -2166 -1078 615 -10747 -6278 -2889 -3337 -13770 -17417 -4275 16818 1989 -20680 -15158 -6462
1670 -6462 -12563 396 -6615 -3230 14654 25578 15104 17184 20110 8423 -10357 -6598 11361
1657 11361 33242 25588 -61 -11972 9971 12010 13031 14428 13667 6355 14778 21590 26968 34965
1643 34965 19968 17126 5608 -9443 -11107 1517 26574 28392 12978 -5121 -2465 6149 -2762
1630 -2762 -11315 -10954 -7964 -8632 3176 18143 4734 4169 39468 44273 43979 58208 47275 24900
1616 24900 -1698 -7046 -16556 -5080 8017 5704 -8448 -30466 -29197 -27772 -19278 -15492 -8802
1603 -8802 -19137 -19886 -4507 -9678 22613 28987 21728 9396 -16237 -33600 -27288 -14997 23992
1590 23992 56580 54834 33662 5041 -4440 -8310 1248 12110 27243 6274 7086 13193 18233
1577 18233 13716 41986 60657 45820 42158 36459 30317 14502 2614 -987 7751 457 -12824
1564 -12824 -2437 -12036 -17982 -14889 5946 20314 8999 2370 953 10781 10993 342 11559
1551 11559 8502 -6092 -18083 -27839 -18417 -10805 4581 19976 19895 6238 4754 7140 5130 -2540
1537 -2540 3854 4397 4618 18191 32822 18655 18293 18208 33249 46029 40872 30746 31086 33320 29654
1522 29654 11217 -2071 -264 14175 7389 -3146 -13007 3227 5332 -3887 18359 30596 33474
1509 33474 29613 14978 -177 11004 22578 25909 26039 15324 24197 11590 -10883 -4098 -3439
1496 -3439 4998 22913 29831 23385 24631 28268 18803 15582 -6757 -6567 13800 12836 4037 14987
1482 14987 22561 20223 947 -14857 -17437 9029 6101 -16816 -16380 -9294 51 -9161 -6428 8177
1468 8177 7811 6814 -5300 -5371 10735 6431 13110 35712 30614 11716 10614 20345 32084 30497 28896
1453 28896 25317 26968 23194 -3070 -19117 -13852 -13964 -13071 -9903 25 6278 2487 -8734 4501
1439 4501 16756 24268 18090 2674 -1624 -11478 -20080 -5924 -5653 4738 8327 610 11482 -123
1425 -123 -10209 -5666 -10500 -32708 -27526 -22470 -17759 2711 11853 8642 -2097 -1142 -5252 -511
1411 -511 1634 -3829 6485 -5644 -7038 4598 2682 -294 1593 1082 5021 9666 -625 -2103
1397 -2103 -5335 -4664 -25062 -35563 -44859 -54999 -26864 4850 4607 23719 25799 23545 14236 -1335
1383 -1335 -1917 19471 38515 27665 10446 1607 152 9695 14930 -1486 -9897 -3895 -13329 -11230
1369 -11230 -11965 -20593 6649 2584 -14078 -15353 -21417 -28939 -25083 -37555 -21754 -6745 3585
1356 3585 8922 7799 -12424 -11061 -13213 -7367 -20114 -17569 -6695 181 12364 1707 -1596 13050
1342 13050 1448 3768 6060 3346 -4982 -16800 -23968 -31359 -29224 -30849 -15169 15291 39835
1329 39835 13593 -4794 -11028 -26980 -30475 -8634 -2973 1238 -14141 -14981 -13418 -4755 -7147 -24580
1315 -24580 -37148 -27205 -17467 -30374 -31966 -26229 -24842 -27927 -25114 -9802 2303 15104 16273
1302 16273 19704 27430 33761 17728 18690 21505 19189 19940 22478 8904 25417 21414 11543 15656
1288 15656 23257 8767 14423 21445 5833 9406 18376 14147 12565 32466 12665 -6557 10912
1275 10912 12746 -2206 8543 10321 -450 -326 -2693 8986 -4372 3682 4570 -14932 -26622
1262 -26622 -16824 -2668 8054 11550 4546 -6981 8657 32854 29875 9574 -4935 1445 -4531
1249 -4531 -14786 -2911 984 14310 22643 4520 -12277 -13266 -16285 -24528 -19380 2894 13456
1236 13456 434 6015 -14738 -22005 -20884 -18214 -33527 -33516 -11382 -19123 -31847 -9833 16230
1223 16230 20800 -18596 -35009 -48260 -33247 -8832 -6821 -21353 -21523 -19835 -24674 -18070 -29798
1210 -29798 -38329 -29876 -24774 -23822 -30661 -11567 8502 4778 -5392 -7489 -6966 -2508 -28580 -29823
1196 -29823 -26914 -31125 -8395 -948 -6689 -44182 -60861 -37843 -11201 -927 -14101 -25707 -20940
1183 -20940 -2243 20878 28536 34721 19477 11986 14797 8904 27721 31046 22631 15757 6556 -12830
1169 -12830 -2022 6518 1601 -10509 -19021 -11542 -24614 -19869 -22281 -18022 -8275 -6032 -8663 -29095
1155 -29095 -16531 -11908 -13475 -24141 -24154 -8983 5774 7648 11413 14575 11340 3637 13954 4726
1141 4726 7397 283 3240 -12749 -20509 -20774 4 5482 7925 24123 27083 25666 22372 16245
1127 16245 -6482 2439 -1395 -6484 -9763 -26470 -48228 -39523 -29587 -11121 -12675 -16812 -20165 -13080
1113 -13080 -69 4954 14328 16606 13283 -12138 -6962 -11513 -14941 -15067 4200 3859 3787 -12125 -4673
1098 -4673 2960 -8272 -34810 -42012 -25921 -43254 -47821 -37510 -14150 -5657 20475 24131 30627
1085 30627 34647 27088 10533 13089 -18077 -40736 -34801 -22255 -14564 -9835 -8949 5315 8033 12117
1071 12117 14141 20231 18701 3728 14453 30519 14754 12649 -4515 -17615 -6275 2368 2146
1058 2146 -1319 -16752 -37821 -47831 -16249 2152 11391 12545 13226 -7071 -16374 -40199 -57889
1045 -57889 -57437 -28754 -14871 -6114 986 -12967 -25583 -26654 -15571 1629 -2993 -1439 -10203
1032 -10203 -17515 -15469 -28498 -17229 -11460 -5955 -4640 -10262 -4889 -9782 -21636 -23077 -10093 -1337
1018 -1337 14064 9554 16646 14617 -2724 -4590 4158 11834 4643 6734 -2916 -12515 -8049 -782
1004 -782 10608 7390 16696 17271 -2180 -2490 3190 9213 15938 18797 38224 46119 34896 22563
990 22563 1947 -13282 -3642 15349 26280 29536 24766 37493 16267 -6898 -9361 -12283 -3830
977 -3830 7073 -4192 -12480 3162 13003 7123 -6662 -18637 -25892 -14211 8446 6527 -1985
964 -1985 -18938 -30033 -6521 9085 18219 20466 2616 -7056 -9991 -15430 -27705 -38929 -40305
951 -40305 -26484 -15191 -4413 1879 -644 -2990 49 13599 19303 13465 1012 -3002 -11508 -13801
937 -13801 -1762 -7702 -22861 -10620 -5332 -4169 13046 14286 26326 19590 1695 5903 24617
924 24617 14868 6470 2830 -9603 -4061 -14864 -7531 -773 -5207 6592 -1175 2138 -12659 6354
910 6354 15200 5068 -11464 -18047 -1348 -3887 -16439 -38525 -27781 -39060 -32286 -7037 9794
897 9794 11645 -3063 -13992 -14751 -6192 5545 5280 -14134 -16979 -24909 -11519 5677 -3678 -8562
883 -8562 -9437 -14608 -1656 14089 -1065 -8902 -23270 -19407 -205 -7051 -31158 -15550 2387
870 2387 12195 12510 5625 -1981 -12250 -13001 2707 1412 5622 1124 10862 3356 -1967 -715 875
855 875 -8889 -16937 -11347 -16551 -32533 -26940 -16704 -16276 -22436 -5017 24928 47897 38303 3058
841 3058 7481 4621 15527 11158 -12982 -21070 -14271 -8534 -13536 -3637 10407 1232 393 937 -2063
826 -2063 2727 -3897 3861 -7290 -24814 -12715 -7660 6395 5163 -1389 -23058 -23736 -9211 -27019
812 -27019 -30183 -35236 -22238 8070 11497 13786 27550 18635 4220 -5381 -10177 -4670 -11152 -20611
798 -20611 -2359 -8087 -16364 -12264 -13225 -7417 -11874 -19251 -27197 -21425 -18821 -23620 -18842 -3618 -16920
783 -16920 -22684 -19113 -9280 12677 2603 -9892 3064 19061 18853 -572 -19562 -41312 -43111
770 -43111 -27056 -26311 -34467 -32346 -12656 1634 -17969 -31318 -21040 -8782 1812 -8486 -9442
757 -9442 -11103 -24353 -56448 -52241 -31065 -10910 6733 5872 -18373 -37407 -36327 -32067 -44642
744 -44642 -40137 -36584 -24392 -14485 -22989 -15214 836 5769 -11785 -13389 -35331 -49304 -54501 -68658
730 -68658 -61551 -54997 -42396 -36490 -33274 -36218 -31364 -20237 -16620 9784 -994 -2928 -4764 -16862
716 -16862 5462 10838 5292 -7354 -25586 -21895 -11275 -12273 -16469 11499 12118 -18782 -33716 -22113
702 -22113 -14503 -16350 -5214 -4571 3296 15219 27682 17525 -1430 -19415 -16620 -16975 -4594 4844
688 4844 5805 4850 2741 -9827 -22278 -23684 -16437 -22868 -22056 -25227 -25107 -12997 -16062 -41913 -34031
673 -34031 -10059 -5282 -4597 12629 338 -10750 -5280 -17618 -21750 -9363 -19030 -24045 -31831 -30452
659 -30452 -15791 -15426 -5541 -854 -11720 -28432 -22432 -24253 -27664 -21803 -15501 -6620 -18956 -45416
645 -45416 -37487 -15640 -26750 -20199 -5708 -8120 -12451 -14008 -16893 -23650 -40089 -27244 -20709 -9595
631 -9595 -9865 -21767 -25559 -23801 -11720 -11035 -25991 -16130 -14933 -11621 6912 21250 11799 20
617 20 -19786 -22916 -13573 -23051 -28291 -36629 -47057 -47454 -23902 6495 4536 -14208 -1594 -10040
603 -10040 -12785 -28509 -18746 -4697 -4126 -14390 -28385 -35279 -35839 -37640 -22748 -21745 -12923 -26102
589 -26102 -22681 -17011 -17808 2509 14325 13461 11492 11873 -4586 3068 4835 -8115 -1289 7784 -9441
574 -9441 -28247 -36196 -34987 -37704 -24186 -23450 -1513 -762 802 8618 -9249 -23841 -31121 -27294
560 -27294 -23215 -20624 -6383 -4974 -8152 6391 -2194 6245 32644 34567 23272 -1773 -31017
547 -31017 -24994 -18165 -3694 -16248 -12200 -12220 -22606 -44892 -40428 -7056 -1663 -16315 -36434 -35601
533 -35601 -17709 -227 10878 13400 12160 15464 9934 -21249 -30475 -8090 -9852 -11747 -24095
520 -24095 -65285 -59733 -45429 -27330 -14310 -8555 -4505 -7920 -24704 -30512 -34978 -48881 -50183
507 -50183 -30125 -34614 -38942 -32662 -24113 -29314 -11001 -15723 -15282 -14369 -21294 -25106 -25834 -36849 -34964
492 -34964 -14229 -13042 -15833 -23232 -42718 -64465 -45796 -15098 1859 4324 -1066 1914 -20915
479 -20915 -35712 -15147 -20545 -24094 -15726 -6013 -13626 -9290 -7685 -4975 -4619 -3849 -10010 -16776 -6351
464 -6351 5913 -4671 -28334 -25998 569 23050 12255 13416 20826 23146 5432 -9388 -11803
451 -11803 -11679 -8248 -23667 -37962 -35201 -22372 -6134 -2541 18784 41812 26959 14147 -3291
438 -3291 -15780 -30603 -40827 -38976 -20302 10745 2517 -2127 -5492 -12144 7969 7744 -18689 -19958
424 -19958 -20361 -18646 -25690 -26767 -39074 -34169 -13756 -19168 -23765 -18996 -20181 -33581 -26258 -25200
410 -25200 -38594 -26927 -16453 -30811 -23281 -29520 -27459 -20743 -13558 -19808 -35568 -23833 -16470
397 -16470 -32193 -38573 -21480 -19838 -16364 -26430 -34645 -37753 -42034 -31853 3932 14652 10652
384 10652 -20490 -42507 -40931 -49438 -53609 -49188 -29636 -24380 -23228 -6765 -15031 -34068 -26153 -11574
370 -11574 -11056 -24413 -39961 -41993 -20490 1093 -7592 -16237 -20121 -1707 19178 11989 -10407
357 -10407 -22738 -45850 -43974 -38218 -36080 -46265 -47014 -35531 -21963 -28551 -32934 -24513 -19540 -12840
343 -12840 -30360 -45269 -32105 -11268 -12351 -25275 -20418 -14439 -25047 -28596 -36370 -35015 -28476
330 -28476 -31327 -39800 -29533 -46831 -50286 -36850 -25105 -23798 -40822 -36006 -24203 -10626 2175
317 2175 -6708 -31857 -33957 -32947 -25527 -21035 -33197 -21414 -22233 -37370 -28095 -27401 -39511 -41587
303 -41587 -25059 -6164 -10150 -15977 -23686 -44902 -41370 -28890 -25989 -13949 -23807 -22567 -3859
290 -3859 -4479 -6679 15726 5515 171 4986 3150 2211 -6488 -6753 2545 843 -6266 -25776 -12034
275 -12034 2479 12368 10439 -6932 -7552 -8108 -12005 -29253 -20556 -27436 -50465 -55695 -43361 -26804
261 -26804 -15061 -15833 -18744 -16308 -15995 -25440 -27462 -7807 -3980 -28008 -36319 -17930 -9929 -14038
247 -14038 -26607 -26716 -46293 -40840 -28264 -23206 -17971 -16031 -21218 -20323 -17828 -9068 2669 1525
233 1525 -3870 -10615 -12572 -924 5502 -2035 -17223 -13142 -11482 4311 5096 -9875 -20421 -22645
219 -22645 -9577 -7060 -18262 -39687 -28885 -20837 -18633 -8995 7801 3891 -2587 -14192 -26170
206 -26170 -29391 -11416 -19551 -22637 -34324 -46723 -22252 -4105 -17730 -16723 -9719 -10868 -12316
193 -12316 -29999 -39316 -28236 -27776 -35430 -33469 -28848 -19964 -25503 -31744 -28070 -19206 -8438 5023
179 5023 1019 -7123 -24210 -44888 -45196 -36410 -29069 -12426 -2337 -868 -4865 -11843 -10460 -11834
165 -11834 -26682 -31132 -23917 -23453 -27057 -27902 -24541 -31375 -28390 -30122 -21821 -11326 -12057 -19234 -17719
150 -17719 -6398 -1683 -8163 -18930 -13981 -14804 -12804 1388 -3353 -12483 -18460 -21260 -24695 -29055
136 -29055 -43442 -42414 -33438 -29936 -39416 -41818 -40984 -30589 -27133 -10404 1600 -19360 -34886 -20324
122 -20324 -19318 -28868 -30963 -30479 -22774 -26272 -27896 -25935 -24420 -13577 -10622 -20574 -40033 -52058
108 -52058 -42419 -39279 -45718 -37500 -29473 -29745 -31964 -22883 -12660 -13152 -19306 -17939 -12939 -13411 -22631
93 -22631 -26673 -25328 -35257 -28224 -22568 -31245 -26544 -14275 -17902 -36428 -58934 -56105 -49061 -48667 -32641
78 -32641 -18322 -29513 -25241 -21942 -21358 -18208 -11690 -4565 -20676 -21223 -10392 -13447 -22408 -25363 -26450
63 -26450 -16470 3860 16583 1663 -13921 -3522 5688 2045 -10446 -18183 -20466 -30034 -24028 -18677
49 -18677 -22318 -32769 -30241 -26858 -23977 -23141 -21044 -30049 -36888 -27496 -7599 4608 -2748 -10243 -9074
34 -9074 -16749 -22346 -26701 -25223 -9803 -13193 -18989 -14710 -27568 -41488 -38625 -24565 -25209 -22144 -6157
19 -6157 -12189 -26249 -26560 -25926 -28212 -43539 -45144 -29635 -30428 -36891 -40563 -50193 -47121 -28193 -23820
4 -23820 -12854 -14057 -11633 3442
0 3442
$$ Imaginary data points
##PAGE= N=2
##DATA TABLE= (X++(I..I)), XYDATA
32767 91434 97471 89449 89533 96065 97227 93338 100183 112585 120789 113967 106104 98793 102536 102273 96521
32752 96521 101472 104286 121891 122070 121887 136940 137337 120017 118320 112274 106997 110093 114986 129464
32738 129464 147234 147277 146650 147169 150902 135968 123957 135044 136772 139102 142834 136404 129329 126934
32724 126934 118378 117014 130449 127960 131642 145282 158383 151958 148826 164887 171083 156072 150043
32711 150043 155596 145425 161303 162939 147120 136842 147030 150503 146874 160297 184031 175597
32699 175597 164335 151733 157198 161942 176090 173482 154627 141311 154554 153126 151777 150103 158516
32686 158516 162158 165615 161822 161041 158383 165282 174960 182066 182547 169521 177642 192918 175127 163170
32672 163170 179945 185957 177344 178323 182891 185567 181323 176743 195359 202520 205056 206226 188490 180461
32658 180461 185519 197436 194517 191596 188916 193346 189475 191658 200627 207972 208754 229477 220491 211737
32644 211737 208895 206914 215238 227512 228963 237980 228306 226467 231757 233796 225358 214613 209434 206786
32630 206786 204827 206783 209922 207826 204623 206035 208517 207194 207225 215736 218103 221507 221225 232941 244221
32615 244221 232555 230518 240534 262087 256717 252975 251114 240794 233634 240721 251596 257219 254764
32602 254764 251041 250229 240556 240368 244452 246537 244317 236696 242206 242046 239990 239354 243416 246030 257214
$$ [...]
##END NTUPLES=NMR SPECTRUM
##END=
