##TITLE=Analysis number 314680
Compound Code cc 05646
Book Reference 350/196/2
Project Code adrs
Chemist Name chrisr
##JCAMPDX= 6.0         $$ Bruker NMR JCAMP-DX V2.0
##DATA TYPE= NMR SPECTRUM
##DATA CLASS= NTUPLES
##ORIGIN= Bruker BioSpin GmbH
##OWNER= NMR
$$ XWIN-NMR		Version 3.5
$$ Mon Oct 24 11:42:26 2005 GMT Daylight Time (UT+1h)  MAYBRIDGE\NMR@NMR_250MHZ
##.OBSERVE FREQUENCY= 250.131544655141
##.OBSERVE NUCLEUS= ^1H
##.ACQUISITION MODE= SIMULTANEOUS (DQD)
##.ACQUISITION SCHEME= undefined
##.AVERAGES= 16
##.DIGITISER RES= 18
##SPECTROMETER/DATA SYSTEM= dpx250
##.PULSE SEQUENCE= zg30
##.SOLVENT NAME= DMSO
##.SHIFT REFERENCE= (INTERNAL, DMSO, 0, 16.522)
##AUDIT TRAIL= $$ (NUMBER, WHEN, WHO, WHERE, WHAT)
$$ ##TITLE= Audit trail, XWIN-NMR		Version 3.5
$$ ##JCAMPDX= 5.01
$$ ##ORIGIN= Bruker BioSpin GmbH
$$ ##OWNER= NMR
$$ C:\u/data/dgb/nmr/ADRS/11270/pdata/1/auditp.txt
$$ ##AUDIT TRAIL=  $$ (NUMBER, WHEN, WHO, WHERE, WHAT)
(   1,<2005-10-24 11:41:41.00 +100>,<MAYBRIDGE\NMR>,<NMR_250MHZ>,
      <created by zg, POWCHK disabled, PULCHK disabled
       configuration hash MD5:
       62 19 C7 07 E1 42 D1 B7 37 6C 3D D0 77 39 F9 E6
       data hash MD5: 64K
       CE 5C F8 24 B1 8D 17 0A E5 A2 6D B6 32 D9 33 7A>)
(   2,<2005-10-24 11:42:05.03 +100>,<MAYBRIDGE\NMR>,<NMR_250MHZ>,
      <Start of raw data processing
       ef LB = 0.3 FT_mod = 6 PKNL = 1 SI = 32K 
       data hash MD5: 32K
       3E 27 83 6F 12 16 ED 52 46 4E B1 66 19 0A 24 F5>)
(   3,<2005-10-24 11:42:09.08 +100>,<MAYBRIDGE\NMR>,<NMR_250MHZ>,
      <apk 
       data hash MD5: 32K
       CB 01 44 BF E9 C6 7A B3 F1 BD 20 97 31 D7 CE 3C>)
(   4,<2005-10-24 11:42:10.67 +100>,<MAYBRIDGE\NMR>,<NMR_250MHZ>,
      <abs ABSG = 5 
       data hash MD5: 32K
       17 5F 34 51 7A AD 48 41 45 F6 FC 7F CA EC 45 13>)
$$ ##END=
$$ 
$$ hash MD5
$$ 25 C3 61 B1 7E 35 B0 13 AF BC 02 E8 FA 3B C3 38
##$RELAX= 
##$RELAX= 
##$RELAX= 
##$RELAX= 
##$RELAX= 
##$RELAX= 
##$RELAX= 
$$ Bruker specific parameters
$$ --------------------------
##$DU= <C:\u>
##$EXPNO= 11270
##$NAME= <ADRS>
##$PROCNO= 1
##$TYPE= <nmr>
##$USER= <dgb>
##$AMP= (0..31)
100 100 100 100 100 100 100 100 100 100 100 100 100 100 100 100 100 100 
100 100 100 100 100 100 100 100 100 100 100 100 100 100 
##$AQSEQ= 0
##$AQ_mod= 3
##$AUNM= <au_zg>
##$AUTOPOS= <15 >
##$BF1= 250.13
##$BF2= 250.13
##$BF3= 250.13
##$BF4= 250.13
##$BF5= 500.13
##$BF6= 500.13
##$BF7= 500.13
##$BF8= 500.13
##$BYTORDA= 1
##$CFDGTYP= 0
##$CFRGTYP= 5
##$CHEMSTR= <none>
##$CNST= (0..31)
1 1 145 1 1 1 1 1 1 1 1 1 1 1 1 1 1 1 1 1 1 1 1 1 1 1 1 1 1 1 1 1 
##$CPDPRG= <>
##$CPDPRG1= <>
##$CPDPRG2= <>
##$CPDPRG3= <>
##$CPDPRG4= <mlev>
##$CPDPRG5= <mlev>
##$CPDPRG6= <mlev>
##$CPDPRG7= <mlev>
##$CPDPRG8= <mlev>
##$CPDPRGB= <>
##$CPDPRGT= <>
##$D= (0..31)
0 1 0 0 0 0 0 0 0 0.06 0 0 0 0 0 0 0.0002 0 0 0 0 0 0 0 0 0 0 0 0 0 0 
0 
##$DATE= 1130150499
##$DBL= (0..7)
120 120 120 120 120 120 120 120 
##$DBP= (0..7)
150 150 150 150 150 150 150 150 
##$DBP07= 0
##$DBPNAM0= <>
##$DBPNAM1= <>
$$ [...]
##$SUBNAM7= <"">
##$SUBNAM8= <"">
##$SUBNAM9= <"">
##$SW= 20.6930455092707
##$SWIBOX= (0..15)
0 0 3 0 0 0 0 0 0 0 0 0 0 0 0 0 
##$SW_h= 5175.983436853
##$TD= 65536
##$TD0= 1
##$TE= 296.16
##$TE2= 300
##$TE3= 300
##$TEG= 300
##$TL= (0..7)
0 120 120 120 120 120 120 120 
##$TP= (0..7)
150 150 150 150 150 150 150 150 
##$TP07= 0
##$TPNAME0= <>
##$TPNAME1= <>
##$TPNAME2= <>
##$TPNAME3= <>
##$TPNAME4= <>
##$TPNAME5= <>
##$TPNAME6= <>
##$TPNAME7= <>
##$TPOAL= (0..7)
0.5 0.5 0.5 0.5 0.5 0.5 0.5 0.5 
##$TPOFFS= (0..7)
0 0 0 0 0 0 0 0 
##$TUNHIN= 0
##$TUNHOUT= 0
##$TUNXOUT= 0
##$USERA1= <user>
##$USERA2= <user>
##$USERA3= <user>
##$USERA4= <user>
##$USERA5= <user>
##$V9= 5
##$VALIST= <valist>
##$VCLIST= <CCCCCCCCCCCCCCC>
##$VD= 0
##$VDLIST= <DDDDDDDDDDDDDDD>
##$VPLIST= <PPPPPPPPPPPPPPP>
##$VTLIST= <TTTTTTTTTTTTTTT>
##$WBST= 1024
##$WBSW= 4
##$XGAIN= (0..3)
0 0 0 0 
##$XL= 0
##$YL= 0
##$YMAX_a= 424079
##$YMIN_a= -517370
##$ZGOPTNS= <>
##$ZL1= 120
##$ZL2= 120
##$ZL3= 120
##$ZL4= 120
##$ABSF1= 16.522
##$ABSF2= -4.171173
##$ABSG= 5
##$ABSL= 3
##$ALPHA= 0
##$AQORDER= 0
##$ASSFAC= 0
##$ASSFACI= 0
##$ASSFACX= 0
##$ASSWID= 0
##$AUNMP= <proc_1d>
##$AZFE= 0.1
##$AZFW= 0.1
##$BCFW= 0
##$BC_mod= 0
##$BYTORDP= 0
##$COROFFS= 0
##$CY= 12.5
##$DATMOD= 1
##$DC= 0
##$DFILT= <>
##$DTYPP= 0
##$F1P= 14.0000005364418
##$F2P= -0.99999901652339
##$FCOR= 0.5
##$FTSIZE= 32768
##$FT_mod= 6
##$GAMMA= 0
##$GB= 0
##$INTBC= 1
##$INTSCL= 1
##$ISEN= 128
##$LB= 0.3
##$LEV0= 0
##$LPBIN= 0
##$MAXI= 10000
##$MC2= 0
##$MEAN= 0
##$ME_mod= 0
##$MI= 0
##$NCOEF= 0
##$NC_proc= -3
##$NLEV= 6
##$NOISF1= 0
##$NOISF2= 0
##$NSP= 0
##$NTH_PI= 0
##$NZP= 0
##$OFFSET= 16.522
##$PC= 1
##$PHC0= -82.17925
##$PHC1= 6.186499
##$PH_mod= 1
##$PKNL= yes
##$PPARMOD= 0
##$PSCAL= 4
##$PSIGN= 0
##$REVERSE= no
##$SF= 250.13
##$SI= 32768
##$SIGF1= 0
##$SIGF2= 0
##$SINO= 400
##$SIOLD= 32768
##$SREGLST= <1H.DMSO>
##$SSB= 0
##$STSI= 32768
##$STSR= 0
##$SW_p= 5175.98343685301
##$SYMM= 0
##$S_DEV= 0
##$TDeff= 65536
##$TDoff= 0
##$TI= <Analysis number 999999
Compound Code 99
Book Reference 9
Project Code 9>
##$TILT= no
##$TM1= 0
##$TM2= 0
##$TOPLEV= 0
##$USERP1= <user>
##$USERP2= <user>
##$USERP3= <user>
##$USERP4= <user>
##$USERP5= <user>
##$WDW= 1
##$XDIM= 32768
##$YMAX_p= 333731567
##$YMIN_p= -123139
$$ End of Bruker specific parameters
$$ ---------------------------------
##NTUPLES= NMR SPECTRUM
##VAR_NAME=  FREQUENCY,     SPECTRUM/REAL,   SPECTRUM/IMAG
##SYMBOL=    X,             R,               I
##VAR_TYPE=  INDEPENDENT,   DEPENDENT,       DEPENDENT
##VAR_FORM=  AFFN,          ASDF,            ASDF
##VAR_DIM=   32768,         32768,           32768
##UNITS=     HZ,            ARBITRARY UNITS, ARBITRARY UNITS
##FACTOR=    0.157963299565203, 1,           1
##FIRST=     4132.6476996994, 0,             0
##LAST=      -1043.33573715361, 0,           0
##MIN=       -1043.33573715361, -123139,     0
##MAX=       4132.6476996994, 333731567,     0
$$ Real data points
##PAGE= N=1
##DATA TABLE= (X++(R..R)), XYDATA
$$ [...]
16168d4365J9110J9596P006l7449K1664o873l6967J6295K8760J3590j8951p593
16156b6177L62K0021n150J1040J189j9898j0037L7458J8436j7506k0470k5174
16144c5906K352J8264k5866J1294Q01j4279K0063K7767j0913j707J0329j0396
16132h197p267J4951j8997J226j3743K84K3846m591o579l4184k0925L0342J3851
16119b9983R86l4337l551M4400J4884n836l1586p327K1882m711Q911n158m078
16106c5504n443n905p740J4526L834K0583J9242j6468K936J1384J0051j1056J4509
16093A4949K7J1126k1032j1274p791n852j2385j4216L1778j2423j0187N966K7704
16080c610p53j1823J265K4779j5533j2094L117j8109O828J6649O900j4764J0817
$$ y = [-44365, -25255, -5659, 1347, -36102, -14438, -21311, -58278, -41983, -13223, 367, -18584, -26177, -25815, -5794, -10944, 96, 1285, -18613, -28650, 8808, 27244, 9738, -10732, -35906, -33554, -15290, -41156, -29862, -29061, -43340, -23277, 4490, -6423, -8130, 2199, -8197, -15464, -513, -19510, -18284, -32027, -31743, -7897, -12488, -19067, -53251, -74176, -43834, -29983, -28997, -63334, -66885, -22485, -7601, -13437, -45023, -52350, -30468, -35179, -26268, -31426, -35504, -40947, -46852, -54592, -40066, -36232, -15649, 3593, -12875, -9939, 1445, 11496, 440, 14949, 14976, 26102, 5070, -6204, -13995, -19847, -32232, -46448, -14670, -27093, -37280, -31314, -3610, -4363, -16186, -14921, 9858, -5675, -17769, -14652, -32761, -25933, -9284, -2384, -17148, -6331]
16067f331l9570l2095J6924l808j9307J0751K2420K8623L4288P355j4976k4808
16055b0534p883k1309O74j2673m497K6685M4968J8116l515j1222j3044k4111L735
16042b4610N280K1818m057j7830m5326O320K0530J7656n829Q218P43j9182P871
16029b8398O433K6960M332O549P294j8780r31L569J15J898j0639j8821k1009R864
16015c1564L6599K1964q914q454K5649m501j1771Q332p474k7265k0996j1091j1335
16002e0821J1631J4183K3085k5312O297P429J5974n419k1131p423J5508q701k3985
15989d8685Q650J1345K9752j989K247r022p355J8755q93o503m213q438n900j5594
15975c7843R663L7211K9634M21j3430m731j2681k3367r31J3102J3403J0670k2300
$$ y = [-6331, -45901, -77996, -61072, -64880, -84187, -73436, -51016, -22393, 11895, 19250, 4274, -20534, -28417, -49726, -49052, -61725, -66222, -39537, 5431, 23547, 20032, 8810, -4234, -28345, -24610, -19330, 2488, -1569, -19399, -64725, -58405, -37875, -20219, -26048, -17830, -17087, -36269, -28398, -21965, 4995, 9327, 15876, 23170, 4390, 3459, 7028, 7143, 9041, -1598, -20419, -41428, -31564, 5035, 26999, 18085, 9631, 35280, 30779, 19008, 27340, 19866, -7399, -28395, -39486, -50821, -39190, -25007, -1922, -27234, -20937, -13508, 2466, -2953, -24084, -31507, -15999, -24700, -48685, -40035, -28690, 1062, -927, 1320, -7702, -15057, 3698, 2805, -3698, -7911, -16349, -22249, -37843, -28180, 9031, 38665, 39086, 25656, 20925, 8244, -15123, -16054, -2952, 10451, 21121, -1179]
15962a179k2495k2039J7395K3763m794q778Q653k7049J4677J450J8312J3999L374
15949A5289l2306J6479J3241P353k57O580r184j5673j5932n957Q060L5155Q521
15936C1369n168N90J3846k1074r060q487j4143J3303R31J2598Q611n087k421m634
15922A1174n29k767l922j4256k380j1753L98k7525J2861J5799L0228L2106j7303
15909B2131l6846l1866k0707J4892L9715l043k1937L122k998P712J815J1931j7285
15896c3364j262P288m923r051K1905N724n012K0898K955j0302J1339Q674j3120
15883A749j151o882k3727k7o153R218q554P202J59n587K330k3692J465m154Q706
15868d9098k4173P03J4462P202K443n080L4220L5757o623P456j1423k8395N638
$$ y = [-1179, -23674, -45713, -28318, -4555, -9349, -18127, -9474, -36523, -21846, -20396, -2084, 11915, 15289, -17017, -538, 12703, 20056, 19799, 26379, 17195, 1522, -14410, -20367, -12307, 22848, 31369, 26201, 26791, 40637, 19563, 10503, 2016, -12127, 1176, 2107, 14705, 23316, 18229, 15808, 11174, 10645, 7878, 3956, -10300, -12680, -24433, -24035, -51560, -38699, -22900, 7328, 39434, 22131, -14715, -46581, -67288, -52396, -12681, -15724, -37661, -34539, -37537, -29825, -28010, -16079, -33364, -34626, -27338, -32261, -41312, -19407, -13683, -18695, 2203, 5158, -5144, 6195, 14869, 1749, 598, -6284, -30011, -30038, -36191, -26973, -35527, -28325, -28166, -33753, -31423, -55115, -53650, -57804, -49098, -73271, -72568, -58106, -50904, -48461, -53541, -19321, 16436, 9813, 17269, 5846, -22549, -16911]
15855a6911R834J3053k0262J918J1495k9318j7828J4372J1371R175J2317J2140
15843A1356L993K252R059k367k7451j4178R739N678R076n075l465Q130m536r987
15829g776N738n220J7225l372l1117j0474j1486J3205J2778r234q32o831k713
15816d0109J407K7733K2094n973j1102K5350j8689k7961j3670q869P123K824L3063
15803f779K2032K0931P37k2715n599k3433j9504j1283q09k277K8294L8604J4897
15790C3096k9976k0186m042J8032J3552m527K326J038j0769j2925k239K1411M6009
15777E0800m725l6563k5382j1800j7584J1339J7207J0190o365j2720K2939J9552
15765A6888j1892k3882J0704r588O001K8256J0344K2848K9223J3499L1878K8254
$$ y = [-16911, -7077, 5976, -14286, -12368, -873, -30191, -48019, -33647, -22276, -13101, -784, 11356, 15349, 17601, 26660, 24293, -3158, -17336, -7597, -1919, 7157, 2082, -1383, 6747, 2211, -7776, -2038, -7258, 9967, 6595, -24522, -34996, -46482, -33277, -20499, -29733, -30565, -37396, -40109, -38702, -10969, 11125, 5152, -5950, 19400, 711, -27250, -40920, -49789, -42666, -39842, -6779, 15253, 36184, 36921, 14206, 8607, -14826, -34330, -45613, -46422, -48699, -20405, 18199, 33096, 3120, -17066, -21108, -3076, 10476, 5949, 8275, 9313, -1456, -14381, -16620, 4791, 50800, 46075, 9512, -15870, -27670, -45254, -33915, -16708, -6518, -12883, -25603, -2664, 16888, 4996, -18886, -8182, -17770, -11769, 16487, 26831, 49679, 78902, 92401, 124279, 152533]
15753A52533K3327L0589m0725k4493o106k4201j6939j5685Q833k2851k6082o392
15741C1808J1340o351j100r331J0840j273j9648K309l010l0089N060j1505n364
15728b6314j2898M331p573R719K9816m400m371R406k2905o949K2342j8809j6871
15715d5476J1626K6458k1447j6433J8700q87j5884q545k174L7596K5311j910r622
15702b687p918j705j5816J0164m053l279J4840J3903j7450J223j1517K1140J6505
15689A3350p70k8162j4991j3107M821K8147L6979P35k5302P451p508p276j0317
15676a5950r745J3412j1789l672o637k2235j0082L2888j5557J579k1837L831J5008
15663e0786J2894K774Q332L1135J4359l2425j5389J9631N703j7721r517P662q971
$$ y = [152533, 175860, 206449, 165724, 141231, 135125, 110924, 93985, 78300, 87133, 64282, 38200, 31808, 43148, 36797, 35697, 26366, 37206, 35933, 16285, 18594, 15584, -14505, -9445, -20950, -26314, -39212, -34881, -42454, -32735, -2919, -7319, -11690, -2284, -25189, -32138, -9796, -28605, -45476, -33850, -7392, -28839, -45272, -26572, -27459, -43343, -51888, -54062, -16466, 8845, 6935, -2687, -10605, -12310, -28126, -17962, -22015, -25294, -10454, 3449, -14001, -12778, -24295, -3155, 13350, 12580, -15582, -30573, -43680, -38859, -10712, 26267, 27002, 1700, 9151, 1643, -5633, -15950, -25695, -12283, -24072, -27744, -34381, -56616, -66698, -33810, -49367, -47788, -69625, -65794, -50786, -37892, -35118, -26786, 4349, 18708, -13717, -29106, -9475, -3772, -21493, -31010, -23348, -32319]
15650c2319R839J43R539J5577L006P009k9318k3543j4445j2411q580L1410N786
15637c8307J7859J8431L847j0254J2235J6269J7863r103J9529j5795l2129R274
15625I719J0102k130r456r078j5053l6343R404L0116L7246j1849j7305J4135q061
15612A447n690J8481o796q306k142p429J712r482j0957o545J3463K4845q242M837
15598h04o12l343j2035K4565M218p350J0927N707o987L653n125J163o739j6134
15584h896j0814K9461K6007j0276j6635p180j4076j161k2171o86K3057K9023j6784
15571a131N10l940M284K3947R98p809j9113k0525J1092J4747R460k2134k0523
15558c0137M1442Q441j3896r818J2679J3126j3853j7261R67J2549L169J3646p146
$$ y = [-32319, -22480, -22337, -12798, 2779, 5785, 12794, -16524, -40067, -54512, -66923, -75503, -44093, -38307, -20448, -2017, 1830, -8424, 3811, 20080, 37943, 28840, 48369, 32574, 445, 9719, 19821, 17691, 8235, -843, -15896, -52239, -42835, -12719, 24527, 12678, -4627, 9508, 1447, -4243, 14238, 7442, -864, -3006, -10435, -8723, -18205, -29162, -35707, -22244, 2601, -5641, -804, -1416, -4759, -16794, 7771, 11989, 4639, 15566, 21273, 14286, 17939, 12814, 13977, 7238, -8896, -19710, 9751, 35758, 25482, 8847, 1667, -12409, -13570, -35741, -36427, -13370, 15653, -1131, -621, -4561, -277, 23670, 24668, 16859, -2254, -22779, -11687, 3060, 12520, -9614, -30137, 11305, 19746, 5850, -3968, 8711, 21837, 7984, -9277, -8310, 4239, 7408, 21054, 13908]
15545A3908p142k6435L818J7115P258l6138q30J2913K1229L052K437n1156o579
15532d6550J9858k2072r842L032L5118J7917j10j4774M499K7801K220j9479r384
15519a1766L0214p219j0288M619P890k852k2736j0080K738M989L820j281j287
15506a3239O420Q70k6304J4006n516J1587J9310p936l2128K834K8544M090p6k3278
15492b0816k001P268K5836K798k1007k1991j2863j0209M277K3888K7092k180j5634
15479a5542J089M3450O396j3735R50R337j6734q856j193r493K1669K0980k0739
15466A7579q549j5456j414J7754n365k6221J3475K224K4620J5877j1349j5027
15454H148l930P094K3J160j7101q714j43j3396k4818O268L909J8775K21j12J7739
$$ y = [13908, 6766, -19669, -15851, 1264, 8522, -27616, -28446, -15533, 5696, 8748, 11185, -39971, -46550, -26692, -48764, -58606, -55574, -20456, -2539, -2649, -17423, -12924, 14877, 17097, -2382, -11766, 18448, 11229, 941, 5560, 13450, 10598, -12138, -22218, -19480, -14491, -10671, -11952, -13239, -6819, -5949, -32253, -18247, -23763, -12176, 7134, -802, -32930, -30096, -1552, 2538, 2462, -20816, -22817, -15549, 10287, 13085, -7922, -29913, -42776, -52985, -48708, -24820, 2272, 92, -15542, -14453, 28997, 35393, 21658, 22608, 31945, 15211, 6355, 5162, -4331, 17338, 38318, 17579, 9030, -6426, -7840, 9914, 4549, -21672, -8197, -5973, 18647, 34524, 23175, 8148, 4218, 11312, 11335, 12495, -4606, -13320, -13463, -26859, -51677, -45409, -41500, -22725, -22504, -22616, -4877]
15439d877n950q063J4155R549j7452J4745m419k3686k735Q222l600j718J6504
15426i325J9690j29j8322o697j4689j7160o399n139J8758L7982K4756m741J0624
15413B9209j5265j5843n037j1563P727m372Q712O748N390J6107J2931k4655j2272
15400b183O651k083J4984L520k741K0616m2995k9675q369J4542L0541j5400k9353
15387d1945J3926K3996K0438m108j5032q212j8495m971j6242M003R920J7003Q389
15374a1330j1533k5106L019J9699K8129J4334K844J1034p66k554p326j9372P115
15361H187j3016l4650J6554j4877J0514K0076j1301j0708r95k6497K4414J5467
15349a6832P29j4682j453J4880q325m296J2428L6419Q049K808M852j1279l6036
$$ y = [-4877, -10827, -18890, -4735, 4814, -12638, 2107, -2312, -25998, -28733, -20511, -24111, -25829, -9325, 10365, 10236, -8086, -14783, -29472, -46632, -53031, -58170, -39412, -1430, 23326, 18585, 29209, 13944, -1899, -6936, -18499, -10772, -15144, -6432, 316, 5706, 21813, 34744, 10089, -2183, 4468, 2385, 17369, 20889, 18148, 38764, -4231, -33906, -42275, -27733, 2808, -12592, -41945, -28019, -4023, 16415, 12307, -2725, -10937, -29432, -34403, -50645, -46642, -36722, -19719, -11330, -22863, -47969, -44950, -25251, 2878, 17212, 20056, 31090, 30324, 27770, 20444, 1072, 8187, -4829, -39479, -22925, -37802, -27288, -7212, -18513, -29221, -30216, -56713, -32299, -16832, -16103, -30785, -32238, -17358, -25683, -29979, -17551, 18868, 26917, 29725, 34577, 23298, -12738]
15336a2738J3924K8J4715N114K242N369j9954p304n610K622J6261K5385j167k2415
15322A6472r519j8625o622J0548J551j7902J6196J1542J7973P245j783q884J763
15309A9955J7681l025k0172O806j4322k8916m553O648K1664J29j9761j1084R327
15296a9623R685J5598L8062Q674o995k2101j8936j4109J1461M318L445K523k035
15283I967k2454k7891q723J2265r853J6675K5560j4756m652J1650j2668K633k1135
15270d3382p75K6875M092p238o757P715j2951k718J7813o680O853j0327k3966
15257e1446J1404K4256K4207L04l5161j2041K4909O755j1984k3530J1761p939
15245c8505l6591K1384K0859J2611k741j1828m8J2438Q425k022O639M741Q411
$$ y = [-12738, 1186, 1214, 15929, 21043, 23285, 28654, 8700, 1396, -4214, -1592, 14669, 40054, 38887, 16472, 6953, -11672, -18294, -7746, -6195, -24097, -7901, 3641, 21614, 28859, 27076, 18192, 19955, 37636, 34611, 14439, 21245, 6923, -21993, -26546, -19898, 1766, 1895, -17866, -28950, -19623, -9938, 5660, 43722, 52396, 45401, 23300, 4364, -9745, 1716, 6034, 9479, 12002, 9967, -12487, -40378, -49101, -36836, -46689, -30014, -4454, -19210, -23862, -12212, -24880, -22247, -43382, -44157, -17282, -13190, -20428, -27185, -19470, -32421, -35139, -17326, -24006, -17153, -27480, -51446, -40042, -15786, 8421, 8725, -26436, -38477, -13568, -6813, -18797, -42327, -30566, -38505, -75096, -53712, -32853, -20242, -22983, -34811, -34859, -22421, -13996, -16018, -9379, -4638, 3773]
15232C773k605k0026j5857J3042p764p277O830j8341P354L1929Q982R400K823
15219A2263j6634j9725M383K7967O371k557J149O478k0258n021J5137k503K7163
15206C4213M816m3621m2367J959M78J3398O070J5050K7608j119j2834l2254j4536
15193d3139J9428m41q096J2920l169J7103K0097k0727m118l380Pj2401j1141N999
15179c1058m153R670m821K6661K9235n625l6551j0344Q51M880P376j0868J474
15166b3273J0459p636J007o941j3555L2156L771j4493j4002n31K5284K8448k6430
15153e736j8215J0399j664k35r145K2931N272J212k933K3349K1987l7716k339
15140G167j0299p869J2179k947j1004L990o132q952j570Q332m576J5811K2012
$$ y = [3773, 1168, -18858, -34715, -21673, -29437, -36714, -29884, -48225, -40871, -8942, 40, 9440, 12263, -4371, -24096, -19713, 8254, 14625, 12068, 13217, 19695, -563, -5584, 9553, 7050, 34213, 39029, -4592, -46959, -45000, -44522, -31124, -25054, -10004, 17604, 16485, 3651, -28603, -43139, -23711, -24152, -32248, -19328, -22497, -5394, 14703, -6024, -10142, -13522, -13515, -25916, -37057, -31058, -35211, -25541, -30362, -3701, 25534, 19909, -16642, -26986, -26135, -21255, -13879, -24747, -23273, -12814, -20450, -19443, -26384, -39939, -7783, -4012, -18505, -32507, -33038, -7754, 20694, -5736, -23951, -13552, -15216, -15451, -24596, -1665, 3607, 4819, 1886, 25235, 47222, 9506, 7167, -3132, -11001, 1178, -1769, -12773, -8783, -14915, -23867, -25437, -17105, -21681, -5870, 16142]
15127A6142l278j6251J0825k540M36R581j5734r067J6932K6824N368j2162j2117
15114A4959K446r589k3813l2764n535j0498q609P523J7534J0204J4656K6080m242
15101a648k0654J1573J1084J5176N189j0470k261k6046j1170L1665K1533J3461
15089C7432j6426l8845p318j846J838L9062J3179k0165j2710r795L8747J0532
15077C3685j0275l0830j6603q836k2516j6464K9362J8392K0550N296k0075l096
15065b1410J0995Q67o073K4360J3295k7051j9364o061j7302J9282j2265j3606
15053e4333Q641N361K8327K3289J7609j3930L11O674k7503j5711j1620K826M296
15040b5763j1567J2083j2620l5472p289J9983J3448K9837K3628p287j7397j2617
$$ y = [16142, 12864, -3387, 7438, 4898, 5334, 14915, -819, -9886, 7046, 33870, 39238, 27076, 14959, 17405, 7816, -15997, -48761, -54296, -64794, -73403, -65880, -48346, -38142, -23486, 2594, -1648, -22302, -10729, 355, 15531, 20720, 10250, 7989, -18057, -29227, 2438, 23971, 37432, 21006, -17839, -25157, -27003, -25165, 13897, 27076, 6911, -5799, -15594, 23153, 33685, 23410, -7420, -24023, -32859, -55375, -71839, -42477, -24085, -3535, 1761, -18314, -21410, -10415, -9548, -15621, 8739, 22034, -5017, -24381, -30442, -47744, -28462, -40727, -54333, -45692, -40331, -12004, 11285, 28894, 14964, 15275, 21949, -5554, -21265, -32885, -30059, -25763, -37330, -25247, -37867, -73339, -80628, -60645, -47197, -17360, 6268, -1019, -18416, -31033]
15028c1033N708L4043J9748k3648k6965q47Q105N08J775J4512M143j4949n288
15015a4188J4561p611l7235k2596K5553K1956R351P903j8458K6351K7120J2797
15003D5504k6774l2027k717N249L955J317q649k6159J329L6320J5316j8524k2406
14990b8266L429j6825j8489K4206L4805k689m99J843k3822q630K716J0479r342
14977c1084m1996l154J3849P903r258L6385K9772n66K1347L5873L5069m110J0077
14964A00107K480j5884K704m4038k6980k1870J3496j6145j0516J232K3195M440
14952A2221o897n055m528l297r208p675K7109J3694P201n042q899j0560L399L298
14938E761k0357l513r895J2279J8920j8321k312J7562J5970m401j7325k1875J0085
$$ y = [-31033, -25325, 8718, 28466, 4818, -22147, -22994, -14889, -14381, -12606, 1906, 6049, -8900, -14188, 373, -7238, -44473, -67069, -41516, -19560, -10209, -2306, -20764, 5587, 32707, 45504, 18730, -13297, -16014, -10765, -6810, -5493, -14142, -40301, -38972, -2652, 12664, -5860, -28266, -24837, -41662, -60151, -35945, -1140, -3829, -4328, -2485, -26307, -34937, -32221, -21742, -31084, -73080, -76234, -62385, -54482, -63740, -27355, 2417, 1851, 23198, 59071, 94140, 90030, 100107, 102587, 86703, 89407, 45369, 18389, -3481, 10015, -6130, -16646, -15414, 7781, 12221, 5324, 269, -4259, -7556, -16764, -24439, 2670, 16364, 23565, 18523, 9624, -936, 2463, 5761, -14596, -18109, -28004, -15725, 3195, -15126, -17438, 124, 16094, 11693, -5632, -27507, -17422]
14925a7422J4984k3706q238J2133J4062J2806k555J1284l453j5159j0284k4384
14913c9932N827L4833L0683P411j7892J000j3847l616m20N253j4610m429J3472
14900C733K7810O525N660N963j6144o897j7067j0739o184l0078j3178M164J2993
14887c3439J0705K5504R781N617j8144j4987O159q697o847L347J0286M807p802
14874a3710k6924R896L3933k4l2333j5847J9375J9129p769k4853J2367Q205k4788
14861d3343j4914k907J4521M2922J0426k2946j5942J3824m235j4882m653J5038
14849b7091k479l645P636J1328j4496j5919l931p078L600m679Q364K7253J3406
14836g731n604L161J1908K758J445l306j1846k0925o859N31K1198J0388q752k20
$$ y = [-17422, -2438, -26144, -34382, -22249, -8187, 4619, 2064, 13348, 9895, -5264, -15548, -39932, -34105, 728, 31411, 38822, 20930, 21930, 8083, 4467, 4047, 9300, -5310, -9739, 3733, 31543, 38068, 43728, 49691, 33547, 26650, 9583, -1156, -7340, -37418, -50596, -46432, -33439, -22734, 2770, 12551, 18168, 24, -14963, -8804, -17501, -24348, -21001, -10715, -5908, -13710, -40634, -30738, 3195, 3171, -29162, -45009, -25634, -6505, -14274, -39127, -26760, -18555, -43343, -58257, -61164, -46643, -3721, 6705, -16241, -32183, -18359, -22594, -37476, -42129, -27091, -29570, -33215, -25579, -14251, -28747, -44666, -48597, -55675, -52075, -56754, -48390, -21137, -7731, -13335, -10174, 1734, 4492, 5937, 2631, -9215, -30140, -36999, -36468, -15270, -4882, -13634, -13854]
14822a3854M6951K3006j2028j4090k2131p379j0359K4159n046j9552l0607N8J8364
14809b2508K5533J7448o34j911r940M062K4682j1046n854R94p854k3593J3150
14796B529K0447r129l040K0357J043p95j2262q522J0626M268k54q70j1297J0900
14782B4001l89q285K2371N745j4214r044K792j1860k6623j4190O335K3469j2802
14769a2694k4010m564k918K3033J4616J7054j4869k4801J351k947J2589J6488
14757a672R022J718J7328j2251j4115k0898O357O413L0935J9714O728j439n011
14744D2829k8874j3448Q907K4480j5538l0307J707K1349K303R852j9446k157K4666
14731B6323m575k1547k0816m229M274J5365k089j0358j6958R331K0954K4233k0074
$$ y = [-13854, 33097, 56103, 44075, 29985, 7854, 475, -9884, 14275, 9229, -10323, -40930, -40872, -22508, 3025, 20473, 19839, 17928, 7988, 12050, 36732, 25686, 19832, 20826, 12972, -10621, 2529, 22976, 13847, 10807, 31164, 32207, 31412, 19150, 10628, 21254, 25522, 25268, 24398, 13101, 24001, 23612, 15327, 37698, 43443, 29229, 20185, 22977, 11117, -15506, -29696, -23361, 108, -12694, -36704, -41268, -44186, -21153, -6537, 10517, -4352, -29153, -27802, -30749, -18160, -1672, 7350, 9068, 26396, 14145, 30, -20868, -14511, -8098, 22837, 42551, 49279, 47840, 42829, 13955, 507, 9414, 33894, 18356, -11951, -10244, 11105, 13408, 23260, 3814, 1657, 26323, 21748, 201, -20615, -24844, -20570, -5205, -7294, -17652, -34610, -25279, -4325, 19908, -166]
14718a66j1145K4562J0719k0980k9693J3939J7555J6237k3907k6834k1627M558
14706d6782M3021K4493N660k1275j6752j8155p939M410N326R178K5031K6003j5589
14693A6630j6378K419J024j7348K758o399k4358q514L0596L1526Q143j9972r955
14680i828J8666J9196K9781j0202l8476n340j0299k6694P09J616J4474Q929N560
14667a908K7845k0477k7529j0862P524L1554Q692m519k8749l3753L824L653J5570
14654b9135L416O294J840J7083J1106j4819P162P434k0892l7759j3148k677K290
14641f1805J9922L707m47j4920Q313K6343m341m13J3768o527J3293J4443O711
14628A8047N658j1366p710p031j8396l7j5081o113k314K1618L969K2972J0976
$$ y = [-166, -11311, 13251, 23970, 2990, -26703, -12764, 4791, 21028, -2879, -29713, -51340, -46782, -3761, 20732, 26392, 5117, -11635, -29790, -37729, -33319, -27993, -18815, 6216, 32219, 16630, 252, 2671, 3695, -13653, -10895, -17294, -41652, -50166, -19570, 11956, 20099, 127, -9828, 8838, 28034, 57815, 47613, 9137, 3797, -6502, -33196, -32487, -30871, -16397, -7468, -1908, 25937, 5460, -22069, -32931, -25407, 6147, 14839, 10320, -18429, -52182, -48358, -44705, -29135, -25719, -19425, -17585, -502, 10604, -4215, 2947, 10381, -10511, -48270, -61418, -64095, -61805, -41883, -38176, -38623, -53543, -45230, -18887, -23228, -23641, -9873, -16400, -3107, 11336, 18047, 23705, 12339, 4629, -2402, -20798, -20835, -35916, -42029, -44343, -22725, -18756, 4216, 15192]
14615A5192J1258j213j5926k5062n811L351K4339N403M657j4927q310n217Q714
14602c552q60j6859q227q663P454J653Q746j8233k5275J1743K8523k8963m2293
14589i4806o777J2003K1229J4296J9747R612p590p38j4179j259L0470q67M368
14576a4491J1429R871l559J2542J5782O826n32N815Q53k8759J2590q273j0329
14563I765J5085P773j240o791j8853k0598j6596Q668K0945j0087P506L492j8907
14550a9838k576K2630J6755l4367j5107N15J2067O843K740k4413K396J9520K6028
14537A3193J5009l1671k9524J797k1402J7725J6723J7194J2439j1376k6431l9
14525b6363K0907O042J4598m761N872j5411N19J9796q993n690k1813Q594J8866
$$ y = [15192, 26450, 25237, 9311, -15751, -21562, -18211, 6128, 11531, 16188, 1261, -7049, -12266, -3552, -4412, -21271, -29498, -38161, -30707, -29054, -20308, -38541, -63816, -52073, -23550, -52513, -94806, -101583, -89580, -68351, -54055, -34308, -24696, -32286, -33024, -47203, -48462, -17992, -18859, -14491, -3062, 6809, 3250, 15792, 31574, 38400, 37868, 43683, 44536, 15777, 28367, 20094, 9765, 24850, 32623, 31383, 24592, 5739, -14859, -31455, -22787, -1842, -11929, -4423, -931, -19838, -22414, 216, 16971, -17396, -32503, -31988, -19921, -13078, -10338, -34751, -32355, -12835, 13193, 28202, -3469, -32993, -31196, -52598, -34873, -18150, -956, 11483, 107, -26324, -26363, -5456, 586, 15184, 10423, 16295, 884, 1403, 21199, 12206, 6516, -15297, -6703, 12163]
14512A2163o154j4401j1613L417J1681J2129P033q519j9532J229p345Q277J5749
14499D114O909N12j6674k4247J0384R670k6271J5893K6251L120r913P049K143
14486H940j642j5192J0187P371j0776J0152Q707n167L143l720o393J2119J6562
14473C4291J9383l242k0391l5518J0872O589j695M520j6188m640K1536l703P909
14460A9723j6390j600n215j6727N659J3938O903j3923M98K6738J2116j8945p242
14447E533O105P952n702J4k6439L159j0681l697J092K977J2084K7653J068J521
14433B2639J680j4062n963L238K4466j0625j1689j1492J248k5544R30m272K4113
14420e333o37l755j2391J3348R720J6595J5756l6834N582J9095O992r082j624
$$ y = [12163, 6009, -8392, -20005, -16588, -4907, 7222, 14255, 5736, -13796, -12567, -19912, -11635, 4114, 11023, 11535, -5139, -29386, -19002, -9332, -35603, -19710, 6541, 9661, -252, 6797, 8940, 7298, -7894, 2293, 9664, -1112, 9040, 17747, 12580, 15723, 12003, 5610, 17729, 34291, 53674, 50432, 30041, -5477, 5395, 11984, 10289, 14809, -1379, -6019, 15517, 11814, 19723, 3333, 1733, -3482, -20209, -14550, -612, 6291, -7632, -7134, 19604, 31720, 12775, 5533, 11638, 19590, 13888, 13902, -12537, -9378, -20059, -23756, -22664, -19687, -7603, 20050, 21118, 22639, 24319, 10257, 4294, 7532, 31998, 21373, 9684, -1808, -560, -26104, -25174, -29446, -5333, -5970, -9725, -22116, -8768, 952, 17547, 33303, -3531, 2051, 21146, 28138, 19056, 17432]
14407A7432O382j2754p398K8994L654K5Q36k9653o552j1177k4569L749j8292J0004
14393c9319j373J7410L0269j7432j1313J074M58j3476q551L6695n74Q18j1706
14380a7020j3772n597j5133Q739K0138J3416L5830J3491j3850k1249j9431M022
14368a0416J1824L2692P853j3805k0452j3817j5338o675J1673n387L2334R406
14356A9892j2869k712Q280r04j4943N590J8457K1600r524J2834P521k2413j7516
14343A3293q707K553j798k3021L709J7716N053j7871n784j5132J8232L6955K1876
14330D7074l3027j4397k0263p51J9485L6123o561j6197k1985j3374P801k4013
14318d0085j3611n701j4729L40K7463l630j2809L1603M1647J0634k3285j7013
$$ y = [17432, 23814, 11060, 3662, 32656, 36310, 36335, 37171, 7518, 966, -10211, -34780, -31031, -49323, -39319, -40692, -23282, 6987, -10445, -21758, -20684, -20226, -33702, -42253, -5558, -6132, -5314, -17020, -30792, -36389, -51522, -42783, -22645, -9229, 26601, 40092, 26242, 4993, -14438, -10416, 1408, 34100, 41953, 28148, 7696, -6121, -21459, -28134, -16461, -21848, 10486, 19892, 7023, 4311, 12591, 11687, -3256, 2334, 20791, 42391, 32867, 45701, 53222, 30809, 13293, 4586, 7139, 5341, -17680, -13971, 3745, 8798, -9073, -14857, -29989, -11757, 25198, 47074, 14047, -350, -20613, -21364, -1879, 34244, 27683, 11486, -10499, -23873, -16072, -40085, -53696, -59397, -74126, -73786, -46323, -49953, -62762, -31159, 10488, 21122, -2163, -19176]
14306a9176Q05J0231L730K6734K0041N435J9387j470R911j987K066j1700j5097
14293D8910m680j3056k5932L381k685J7904K9807n552m7671q215P018k0898R985
14280a1684J3272r865L2461K2041R606n530j5945k8251j9421O58Q417k745J5974
14267H988M849J0597r97m744k2151j5670M963J3454P110L1629L078m873l790j7895
14253A4548M788O043K3911L67j7643l7581p551J0010J7413J0396R203K879r44
14240C5839j8733L4176q235j5486l9045J257j035j707O334O144r140L0528P034
14227B7931o678m871J4964l117k4843j548O179J1697L3062j1639j4939J751j9812
14214H137k2617m169J6045m694J1047q480J260J3797J5942L471L700K9360J837
$$ y = [-19176, -18371, -8140, -4410, 22324, 42365, 47800, 67187, 65717, 75628, 73641, 75707, 64007, 48910, 44230, 31174, 5242, 8623, 5938, 23842, 53649, 48097, 426, -7789, -771, -21669, -11684, 1588, -8277, 24184, 46225, 55831, 50301, 34356, 6105, -13316, -12658, -4241, -6986, 8988, 13837, 24434, 23437, 18693, -3458, -19128, -14165, -711, 6399, 38028, 41106, 36233, 32443, 14548, 19336, 25379, 49290, 49657, 32014, -5567, -13118, -3108, 14305, 24701, 33904, 36783, 35839, 17106, 51282, 43047, 27561, -11484, -10227, -11262, -12969, -6635, -491, -9631, 20897, 27931, 21253, 16382, 31346, 28229, 3386, 1838, 8017, 19714, 52776, 41137, 26198, 27949, 8137, -14480, -18649, -2604, -7298, 3749, -4731, -3471, 10326, 26268, 29739, 33439, 62799, 64636]
14201F4636n068N581r295k5729J2033J3353J1148m16M708L5839L5222M4714O1997
14188B48723N0663N212K8562N8989P8844P7387Q2854Q4027L4756r665J3067l564
14176G49855j0003j6958k7433k3015n7714n6513q0975o0066o3128n4439l7659
14165B61952n3372l1342k0690p799j5640k9119K5137J6807r182k5671j6253m211
14153I0617j0336J6394j3446J468q745j3938k4444k290o741N624l2775L932J7518
14140B2838k3974o258l4709R448L5557k2883K0387L4946j1807j4122Q671l886
14128A4208p825J0153J6790k9456m1434l11k5012J3240J9952m893J053J2960M86
14115b0089j0971K126J1850M848O186K143J1105K4520K7872M986l658m0982l234
$$ y = [64636, 59568, 65149, 55854, 30125, 42158, 55511, 66659, 66243, 70951, 106790, 142012, 186726, 248723, 299386, 304598, 333160, 392149, 470993, 548380, 631234, 715261, 750017, 740352, 753419, 749855, 739852, 722894, 695461, 672446, 614732, 558219, 477244, 417178, 354050, 299611, 261952, 208580, 177238, 156548, 148749, 133109, 103990, 129127, 145934, 136752, 111081, 94828, 90617, 80281, 96675, 83229, 84697, 75952, 62014, 37570, 35280, 28539, 34163, 1388, 5320, 22838, -1136, -7394, -42103, -32655, 2902, -19981, 406, 35352, 23545, 9423, 18094, 14208, 6383, 16536, 33326, 3870, -37564, -37875, -62887, -49647, -29695, -34588, -33535, -20575, -20089, -31060, -28934, -17084, -12236, -6050, -3907, 7198, 31718, 59590, 64576, 60918, 19936, 16702]
14102A6702L2248J3050m476J6542q890l6448k3254O061K900J8774L5k0516O378
14089A9106J2362l5930K58j070l257k1510J1471m293j3279J5052K8747M914m83
14076A2088j0539J7824J0430l3333j9844N771J5066P964j3624k8338R806J4437
14064a2292J4231r43k8353J3381L1785J2389n093o727j7372j6990j8607j2712
14052d7303J4487L8659Q732L499P898R898k626j8911m462j4670K3759M657n55
14039B3062J991J6482k606K1018K2079q798j6743J2313l589J4211Q288l540k3996
14026F0172Q593J1555J8278J8450j043j1835L7499K29k8700j9960m769O829J3210
14013A08508K481N313j0622j8848r98j8184j3660j2507l477R290J1692j4954N483
$$ y = [16702, 48950, 62000, 57524, 74066, 65176, 28728, 5474, 11535, 14435, 33209, 33244, 12728, 19106, 31468, -4462, -4204, -5274, -8531, -30041, -18570, -22863, -36142, -21090, 7657, 12571, 12088, 1549, 19373, 29803, -3530, -23374, -17603, -2537, 5427, -8197, -36535, -26729, -12292, 1939, 996, -27357, -13976, 17809, 30198, 25105, 18378, 1006, -15984, -34591, -47303, -32816, 5843, 14575, 18074, 25972, 35870, 33244, 14333, 9871, -4799, 18960, 23617, 23062, 25053, 41535, 38929, 59947, 82026, 73228, 56485, 68798, 65209, 79420, 87708, 84168, 60172, 68765, 80320, 98598, 117048, 116005, 104170, 141669, 141898, 113198, 93238, 88469, 95298, 108508, 110989, 116302, 105680, 86832, 85834, 67650, 53990, 41483, 38006, 47296, 58988, 44034, 49517]
14000D9517j2016p597k9839j526J8946l2645n737Q107M275K1739j7096k7558j2234
13987d3664J7115K8465Q927J4917j0091k788K134L4253j5259k491l322p544l0771
13974a0119J625j0175j3221K9071J7634k6540k2567l5481k959J5495K2442L95
13962c4400o351j1434n157J2770Q744j329L4750Q741j6407j1143k5677j192M854
13949d3231M628P238J6287P031l17J2962n869J3991J2640r271M581l1390j5795
13936b6515L134J1224J1672k286l069L0861j8709k7299j6116M113J3485N033k888
13923a7360k891K5619J0750l997j2986n019O467n877j2337j296J3219J1132Q841
13910A4265J00J1628j8782k2205N768Q198q865k4546K328K4692J0931k6514r850
$$ y = [49517, 37501, 29904, 65, -1461, 17485, -15160, -20897, -12790, -8515, 13224, -3872, -31430, -43664, -26549, 1916, 10843, 25760, 15669, 12881, 15015, 49268, 34009, 31518, 28196, 20652, -10119, -8494, -18669, -31890, -2819, 14815, -11725, -34292, -69773, -72732, -57237, -34795, -34400, -40751, -52185, -57342, -44572, -35828, -37157, -2407, 6334, -10073, -21216, -46893, -48085, -43231, -38603, -31365, -15078, -8047, -8364, 4598, -1271, 12720, 25360, 16089, 20670, -10720, -26515, -23381, -12157, -485, -2771, -5840, 25021, 6312, -20987, -37103, -32990, -19505, -14472, -17360, -20251, 5368, 16118, 12121, -865, -5884, 583, -5294, -17631, -18927, -5708, 5424, 14265, 14365, 25993, 7211, -14994, -9226, -1028, -9893, -34439, -32111, -7419, 3512, -23002, -32852]
13897c2852k5312K806R824J4107R350O562M968l72J0464J0373k3758J6514p80
13884A894l136K781j9902J1830J0284J1199j8809j9906J3097J3991K3188R575
13872C6086J0134n518j5065l1274q615k3574m434o708J8208J2817j0190Q067J4483
13859e583J5231k3889j8629J3715K0344j5350j0614J6062O783J583k5031j5997
13847d1375L5950K8196j3577r898l869j5211l572o608J9388L0378j941o109L19
13834A2071j0318J2054J0421k6405j700J7731R73J0907J1772j4388k4908J8115
13822A6325J8441N722J3925p862N364P407K431j1310m392J2741Q749k5024L2376
13809G4893r855J07j3904k9154N550J0256j8924q776q848m946J0878J8126j586
$$ y = [-32852, -58164, -55358, -45534, -31427, -22077, -15515, -10547, -10919, -455, 9918, -13840, 2674, 1894, -1242, 1539, -18363, -6533, 3751, 14950, -3859, -23765, -10668, 3323, 26511, 36086, 46220, 40702, 25637, -5637, -14252, -37826, -42260, -48968, -30760, -17943, -28133, -20066, -5583, 9648, -14241, -32870, -19155, 1189, -14161, -24775, -8713, -1930, -347, -25378, -41375, -5425, 22771, 9194, -704, -4573, -19784, -23356, -29964, -10576, 19802, 17861, 11752, 12071, 1753, 13807, 24228, -2177, -3877, 13854, 14827, 25734, 37506, 23118, -1790, 16325, 34766, 40488, 54413, 46551, 51915, 59322, 61753, 50443, 46051, 58792, 67541, 42517, 74893, 65038, 65145, 51241, 22087, 27637, 37893, 18969, 10193, 1345, -3601, 7277, 25403, 23817]
13796B3817j078j9348o263k2148M710k123J3947J4122J6584K7122L390O510J3028
13783G2270K216l3917l245R934p836j7146q05j106k6221O22k671K486L740n055
13769f734j301r214l2584O610L8579n243m756J0647k332l433o002j8598k294j838
13755c8493N006j696M846K7946K5885K5540q630l0287j529J4549O383j8944j3394
13742b818J0339N262M842o41o120J7330M178N845j5180j2112J822L1013K0907
13729F4667q947j0249J6456J0548k8707j4851l436l729j2418L0168n136k1536
13717A2830Q752J5843j0203j6367j4226K4027K5853R724j2715j8581l780j0224
13705A0933J5820J8528l241J5202j6233q008P264l8320l1493K5086m716K643J5357
$$ y = [23817, 22739, 3391, -2872, -25020, -20310, -22433, -8486, 5636, 22220, 49342, 52732, 59242, 72270, 74486, 40569, 37324, 47258, 39422, 22276, 21471, 20365, -5856, -5234, -7905, -5419, -1679, -6734, -8035, -17249, -49833, -43223, -4644, -9887, -14643, -3996, -6328, -9761, -15763, -34361, -36655, -38493, -33487, -35183, -30337, -2391, 23494, 49034, 40404, 10117, 8588, 23137, 29520, 10576, -2818, 7521, 12783, 17625, 16984, 10864, 28194, 32372, 38217, 23037, 10925, 12747, 43760, 64667, 55720, 45471, 61927, 72475, 43768, 28917, 25481, 21752, 9334, 39502, 34366, 12830, 21582, 37425, 27222, 10855, -3371, 20656, 46509, 56233, 43518, 24937, 21157, 10933, 26753, 45281, 42040, 57242, 41009, 33001, 40265, 1945, -29548, -4462, -9178, -6535, 8822]
13692H822P703Q940K0294J9994L040j8028m6367P44l845Q179k493k9448j1713
13679c4178J2321J6936J0117j5423J7853o415q633k1984j6003R274J3179K4293
13667A337J3298q182L1815M088N929J6167j8423N323m335l0585O080J6987M947
13654D4446j428j9778m4198j2468K2636l958n466J3205L0392j1663l6547l033
13642b7860R779L21k544J2221r206j1123J7479R030l93j4646q581k4480j6371
13629f6374K0448n275N858p026J855K4060K0483J2977K3345J239l4722p718k704
13616a3554K290j5107M8995L9570j4228K348j9099j6382J0954J2100L999j571
13604D0315N526l0375o304K1736J6120j7778j2510K0455o756k963k0988J710P150
$$ y = [8822, 16525, 25465, 45759, 65753, 68793, 50765, 4398, 5142, 1297, 9476, 6983, -22465, -34178, -21857, -4921, 5196, -10227, 7626, 1211, -7422, -29406, -45409, -36135, -22956, 1337, 14635, 6453, 38268, 42356, 48285, 64452, 46029, 51352, 47017, 16432, 22512, 39499, 44446, 43018, 23240, -20958, -33426, -10790, -14748, -20214, -7009, 23383, 11720, -24827, -27860, -18081, -17760, -20304, -8083, -17289, -28412, -10933, -1903, -2296, -16942, -25523, -50003, -66374, -45926, -51201, -45343, -52369, -50514, -26454, -5971, 7006, 30351, 31590, -3132, -10850, -13554, -11264, -26371, 22624, 62194, 47966, 50314, 31215, 14833, 25787, 37887, 41886, 40315, 45841, 15466, 9162, 30898, 47018, 29240, 16730, 37185, 30429, 27466, 6478, 8188, 15338]
13591A5338j0659o260L7768J157l856j4878j2679Q437J6461P441j0639k2709k1058
13578a6136O131K3839M291J3936j3234M065J3558k5942K423L6907k6071m8197
13566b4430r890q544J0193l415p510J1961J9105M332J3466j7443k582K3291O965
13553A5499k8210n348K283K6848L2105J0585l5636o522j8225k425N338J722N333
13540C347n338P011M182J3824j7977l1479k515l530K9272J5762r646j7991q542
13527b3620Q651K3682J4953n65j3653J234q599k653K975P390N382r853k1534l214
13513a9424J5432R67KN293J0804J9442k2869m216K51J2238p505L1837R334k0909
13499C0677m4427k1113J8980K4438j859j233j6869J4144l66q453j2135O648L08
$$ y = [15338, 4679, -1581, 36187, 37344, 33488, 18610, 5931, 14368, 30829, 38270, 27631, 4922, -16136, -10005, 13834, 18125, 32061, 18827, 22892, 36450, 10508, 12931, 49838, 23767, -24430, -34320, -42864, -32671, -36086, -43596, -31635, -12530, -8198, 5268, -12175, -14757, 8534, 15499, -12711, -18059, -15776, 11072, 43177, 53762, 18126, 11604, -6621, -9046, -3708, -1986, 3347, -1991, 5020, 9202, 23026, 5049, -26430, -28945, -32475, -3203, 12559, 2913, -15078, -23620, -14969, 8713, 23666, 23101, 9448, 10682, 2083, -570, 2405, 9795, 15177, 5324, -16210, -19424, -3992, -3025, -3023, 2270, 13074, 32516, 9647, 5431, 5682, 17920, 10415, 42252, 51586, 30677, -13750, -34863, -15883, 8555, 6696, 5463, -11406, 2738, 2372, -6081, -18216, -11568, -11260]
13486a1260o663L724m647J0306l451j8004q206K587L3271J7218N328M598m719
13473B0082Q452Q308j4556m2980j6169K0853K4447J8621k4517K0417k026l3952
13461a3020j1254J2704O018K1208K5458o47p444j504J1891o55j1984J0243p002
13448C4012k0603r571j1244P870k94N847J4573J54p550J5971R59k2850R07J1332
13434A9513J031J916j3486J7030J7474L0754j6102r669j92J3583j2302j2641q862
13421B8047o084m693n960R263L8919J9585J8321l6650m3374n270P299J6801L0753
13408F6957n464j8168j0295J089J1913K570K2171j168j2674l4785R09O447q601
13395B0901M201L0764K8134r230j8116j8093k000R787k923j1903K1527j4430k2371
$$ y = [-11260, -17923, -14199, -18846, -8540, -11991, -29995, -38201, -35614, -2343, 14875, 20203, 24801, 20082, 28534, 36842, 22286, -20694, -36863, -16010, 8437, 27058, 2541, 22958, 20932, -13020, -24274, -11570, -5552, 15656, 41114, 40467, 33023, 31519, 43410, 42755, 30771, 41014, 34012, 13409, 3838, -7406, 464, 170, 6017, 20590, 20744, 13194, 29165, 30124, 7274, 8181, 19513, 20544, 22460, 8974, 26004, 43478, 74232, 58130, 48461, 48269, 61852, 49550, 36909, 28047, 21963, 17270, 11310, 20573, 59492, 79077, 97398, 60748, 17374, 12104, 19403, 36204, 66957, 61493, 43325, 33030, 34119, 46032, 48602, 70773, 69605, 56931, 22146, 23055, 29502, 20901, 25102, 55866, 84000, 74770, 56654, 38561, 36561, 46348, 43425, 31522, 53049, 38619, 16248]
13382A6248J7009J7574o120k224M0565L3590j474j6316M650K513O563K3267J5339
13369A51184M5726L333M4902Q4468N2372L9091P7005N9958O1057L6167J3128K1470
13357F89861J8327O200j2995J174J5027o20m3544m9240m4686m5663l9520n9410
13345D34911n6415l4641m6122m2440j5640j0679m6515j8781J483m697P522J7714
13333A85700n426m453m7799k3574j3347j6732Q084J9175K4677l7875k6219k893
13321E9318q855m147J9015N104k2291j379J5091K1871k2066K3628J225m9008r172
13308B8334M299k9952j833L6752K1532K075k8806K062p369p379j521J4112J8083
13295E0389j8596j8895M168J3705J9534K7758k379j9282k7968j6335m046K0476
$$ y = [16248, 33257, 50831, 44711, 42487, 83052, 116642, 115168, 98852, 103502, 106015, 112578, 135845, 151184, 196910, 200243, 245145, 329613, 381985, 421076, 498081, 558039, 619096, 655263, 668391, 689861, 708188, 714388, 701393, 702567, 717594, 716974, 673430, 624190, 579504, 533841, 494321, 434911, 378496, 343855, 297733, 255293, 239653, 228974, 182459, 163678, 165161, 160464, 167986, 185700, 180274, 175821, 128022, 104448, 91101, 74369, 82453, 101628, 126305, 88430, 62211, 59318, 50463, 46316, 65331, 70435, 48144, 46765, 61856, 83727, 61661, 85289, 86514, 37506, 28334, 32633, 2681, 848, 37600, 59132, 61207, 32401, 34463, 27094, 19715, 18194, 32306, 50389, 31793, 12898, 17066, 30771, 50305, 78063, 75684, 56402, 28434, 12099, 8053, 28529]
13283B8529l481j1746J7128K6331j7711j7196l73p064J2673J3953m041m404p447
13270B5151r459K448j7175j647J5795k3082J4388K0825q846r012L3898K0017j1105
13257E2196m276K709P460j8807M396k7850l853M787J6449j1565N68J148o900k774
13243A3688Q251N041k602P002J7688L193j4011J3000J6216j6775k2180J401J9081
13230D8993l969R1k0556j1446K1116l099k564K1122K6348J033M545J5388j8417
13217G8585k2315J8040k8j2420J0892o761o854k1467j7947K608L965J4037J6230
13204E6565J0649r902N877J0700O337M591J3173j8426Q922J2696O23J7818K7935
13191A47558N776r141j5927j3713p957O126R728J9583J9094n305L175j4678J353
$$ y = [28529, 25048, 13302, 30430, 56761, 39050, 21854, 21481, 14417, 27090, 41043, 37002, 32598, 25151, 15692, 18140, 965, -682, 15113, -7969, 6419, 27244, 18398, 9386, 43284, 63301, 52196, 47920, 50629, 58089, 39282, 43678, 15828, 11975, 16762, 33211, 21646, 22214, 23362, 16462, 13688, 21939, 26980, 24378, 31380, 49068, 52261, 38250, 51250, 67466, 50691, 28511, 29912, 48993, 45024, 45115, 24559, 13113, 34229, 31130, 28566, 49688, 76036, 77069, 81614, 97002, 78585, 56270, 74310, 74282, 61862, 72754, 65993, 59139, 37672, 19725, 22333, 26298, 40335, 56565, 67214, 57312, 63189, 73889, 80226, 84817, 97990, 79564, 88486, 101182, 101805, 119623, 147558, 153334, 144193, 128266, 114553, 106596, 112722, 122450, 142033, 161127, 155822, 158997, 144319, 145672]
13178A45672k79m8280k1683J2958P186L274m516K888N943N919K1962j3054k6545
13165I1445K089K0560L6040r627q92O994R088m498k1068K3321K8389N257N814
13152A92912j4564n2583r834r311r37L951j4486K912q730J1247o01L91J4027l4399
13138G9995K955P292j8908J0505K03l3957K957M788K61j6459k6852N487L1681
13125D9948j1511J5051o979J3977L1207l2411r123k0025K4517J6967j952J8468
13113H8134J5331J4649R351P592j3304j4666K1590J1760k8175j784K1342j0834
13101A20986q370J1649j2914o875K7598J1961j2042p445K1831N725p904q046M781
13088A40935J2954K301O2J2159P910K33N738K3208n27q434j0895Q761m454q517
$$ y = [145672, 145393, 97113, 75430, 88388, 95574, 98848, 94332, 97220, 103163, 109082, 131044, 117990, 91445, 93534, 114094, 150134, 140507, 139615, 146609, 155697, 151199, 130131, 153452, 181841, 187098, 192912, 178348, 125765, 115931, 106620, 105683, 109634, 95148, 98060, 89330, 100577, 99976, 100367, 114394, 79995, 82950, 90242, 71334, 81839, 82042, 48085, 51042, 55830, 56091, 39632, 12780, 18267, 49948, 38437, 53488, 46509, 60486, 91693, 59282, 50159, 30134, 54651, 71618, 69666, 88134, 103465, 118114, 127465, 135057, 121753, 107087, 128677, 140437, 112262, 110478, 131820, 120986, 112616, 124265, 111351, 104476, 132074, 144035, 131993, 124548, 146379, 152104, 144200, 136154, 140935, 153889, 156190, 156252, 168411, 176321, 176554, 182292, 205500, 204973, 196539, 185644, 194405, 189951, 181434]
13074A81434j9425j6780L0823L4126k069N322L27J5520J4422l901l1903l2791
13062A75105N640K9891M3078j437k9023M605L0892J4215K0546N138j3543J0669
13050B95776R764l996K2106L3744K1520K125O989O477K615j886K5261K4117n71
13037D44041L666Q633N245J0921N371K7049L0878K1331l010L0616k933K056L179
13024E87043l047M324J7763p52K5127K2424L25p849N189J0837r892q164O141J0617
13010F60086K6798M3781M5118K2227J6754p215J2618N550J0310K6897K6476J8249
12998I07649J3056J7014L2636L4865n49L4041K7395M3433O3136M4918M1706L5828
12986A295128O8686N0091J9754L4505L0800M2003M7120N4479N4059O9069M5035
$$ y = [181434, 162009, 145229, 176052, 210178, 208109, 213431, 213758, 229278, 243700, 239799, 207896, 175105, 180745, 210636, 253714, 252277, 223254, 227859, 258751, 272966, 293512, 298650, 285107, 295776, 305540, 301544, 323650, 357394, 378914, 381039, 388028, 394505, 397120, 395234, 420495, 444612, 444041, 447707, 456340, 461585, 472506, 477877, 504926, 535804, 557135, 554125, 584741, 581808, 583864, 587043, 583996, 588320, 606083, 605331, 630458, 652882, 653207, 645358, 650547, 661384, 651492, 643328, 649469, 660086, 686884, 730665, 775783, 798010, 814764, 807549, 820167, 825717, 836027, 862924, 889400, 907649, 920705, 937719, 970355, 1005220, 1004671, 1038712, 1066107, 1109540, 1172676, 1217594, 1259300, 1295128, 1363814, 1413905, 1433659, 1468164, 1498964, 1540967, 1588087, 1642566, 1696625, 1765694, 1810729]
12975A810729R3125J27163J02598J05191J11303J45790J24834J36115J56174J76428
12965C089450J72370J72885J93467K53293K89909L05856L19812L62815M20233
12956E580090M68940N44693O23425P15217Q21580R54883J081703J230671J388885
12947A3410087J616219J849057K121361K530388L096733L850132M923215O387643
12939C9784835Q112310J0079301J1985579J3275314J3411774J2170816R753045
12932A18572974O810463M281332K733238K183172J926653J050382r57516m003186
12924A32597512p358771j0104152j1597610j1713045j0894399r581140q209257
12917F3139138p006056n983286n174761m534825l902882l272419k717114k238923
$$ y = [1810729, 1903854, 2031017, 2133615, 2238806, 2350109, 2495899, 2620733, 2756848, 2913022, 3089450, 3261820, 3434705, 3628172, 3881465, 4171374, 4477230, 4797042, 5159857, 5580090, 6049030, 6593723, 7217148, 7932365, 8753945, 9708828, 10790531, 12021202, 13410087, 15026306, 16875363, 18996724, 21527112, 24623845, 28473977, 33397192, 39784835, 47897145, 57976446, 69962025, 83237339, 96649113, 108819929, 118572974, 125383437, 129664769, 132398007, 134581179, 136507832, 137558214, 136600698, 132597512, 125238741, 115134589, 103536979, 91823934, 80929535, 71348395, 63139138, 56133082, 50149796, 44975035, 40440210, 36537328, 33264909, 30547795, 28308872]
12909B8308872k009046j980375k103786k196036k162425k031269j788240j496814
12901A2540881j264020j069416r01207p36284o45228n43092m49995l77149l24305
12892F230185l21181k85519k49731k44022k08268j94129k02774j98671j98107
12883D127783j81882k01052j97964k07411j84305j80427j67368j66381j90068
12874B450925j47561j33741j18689p4218j00872j19364q3617q4737o2376p8107
12864A447643l8948m4983l9452l8789l9977l7607m0251n7963m7013l6980l8140
12853I87540o3752l8206l0784j4900k5760l2621k9747J4244k3817n1666k3634
12842F66897k190k6180l0671J538j2822J2692m84m0038m1160j6982k9412j715
$$ y = [28308872, 26299826, 24319451, 22215665, 20019629, 17857204, 15825935, 14037695, 12540881, 11276861, 10207445, 9306238, 8569954, 7924726, 7381634, 6931639, 6554490, 6230185, 5909004, 5623485, 5373754, 5129732, 4921464, 4727335, 4524561, 4325890, 4127783, 3945901, 3744849, 3546885, 3339474, 3155169, 2974742, 2807374, 2640993, 2450925, 2303364, 2169623, 2050934, 1976716, 1875844, 1756480, 1672863, 1588126, 1525750, 1447643, 1408695, 1363712, 1324260, 1285471, 1245494, 1207887, 1167636, 1109673, 1062660, 1025680, 987540, 923788, 885582, 854798, 839898, 814138, 781517, 751770, 766014, 742197, 690531, 666897, 664707, 638527, 607856, 609394, 596572, 609264, 608780, 568742, 527582, 510600, 481188, 479473]
12830D79473N7329L1994n414m0756l5457L1r51J0603j55j077k5848o661k3870
12817D39241j4516k118K605J0819o18j9079p222O027Q205K0017J1777J5771k0756
12804D50153M718l821J3477q019k6489j2541j1438j2881J1546l652j8383j4477
12792C68193q10k260K620J2137k0926j1687J0867L733j926k6344l975K7845K5010
12779C82477M241j0671m7025k5065o455N368l026j7838k5334J7536J6887P073
12767B98168M289m853j059j5941J352n206K952l171Q859k1318J8762j8267j0510
12754B54057J6357r077j0591O349n940l0695n077J7639k609l23J566j990L3663
12741B63329M318r62j4569j4331j0929J8136R648K787R09k1402j4755j8372j473
$$ y = [479473, 536802, 568796, 563382, 522626, 487169, 487200, 486249, 496852, 496697, 495620, 469772, 463111, 439241, 424725, 422607, 425212, 436031, 435413, 416334, 409112, 415139, 423344, 443361, 455138, 470909, 450153, 454871, 451050, 464527, 456508, 430019, 417478, 406040, 393159, 404705, 401053, 382670, 368193, 367383, 365123, 367743, 379880, 358954, 347267, 358134, 361867, 359941, 333597, 329622, 357467, 382477, 386718, 376047, 329022, 303957, 297502, 302870, 299844, 282006, 256672, 274208, 291095, 298168, 302457, 297604, 296545, 280604, 281956, 276750, 279702, 276531, 285390, 264072, 282834, 264567, 254057, 270414, 261337, 250746, 257095, 251155, 220460, 215383, 233022, 230413, 230090, 231656, 229666, 263329, 267647, 266685, 252116, 237785, 226856, 244992, 254640, 257427, 258336, 236934, 222179, 203807, 202334]
12728B02334K822J2558M680j5268l1022R147J1226M974j464Q67J0148m688k0565
12715A85749m000J2238l13n110K573J7910k433L916L9822K7491j9015k5692J2020
12702B45156J7902J8957J2419j3482l5202k562r920m0810j671K319J5210K2662
12690B30978l2248m6666L610K0438m495P98j5083L999k408N388K39j2062J6114
12677A68602N909l77M492L209l077o747L616r837N495o085M954j0451O426j3559
12663A52570k9867j3739k299j3205l613K3956K9989O755J3677J3858P74L5907
12651B14763K5503j4401L2494J8025L970o621K023P217K3318j0283l7076J321
12639B60253r198j8233r750j0444j0397k2586n191J0399L2973l79o916m0645k5720
$$ y = [202334, 205156, 217714, 222394, 207126, 176104, 185251, 196477, 201451, 199987, 200854, 211002, 206314, 185749, 181749, 193987, 193674, 188564, 191137, 209047, 206614, 210530, 250352, 277843, 258828, 233136, 245156, 263058, 282015, 294434, 280952, 245750, 243188, 233268, 192458, 190787, 193106, 208316, 230978, 198730, 152064, 155674, 176112, 171617, 172415, 157332, 161331, 158923, 164311, 164550, 152488, 168602, 174511, 174134, 178626, 181835, 178758, 172011, 175627, 165790, 171285, 165200, 170154, 159703, 166129, 152570, 122703, 108964, 106665, 93460, 89847, 113803, 143792, 150547, 164224, 178082, 178856, 214763, 240266, 225865, 258359, 276384, 280354, 273733, 275756, 282973, 306291, 296008, 258932, 260253, 251055, 232822, 223072, 212628, 202231, 179645, 174454, 184853, 217826, 217447, 210531, 169886, 144166]
12626A44166j567j8349J6284K0280j5407j0982N677M277m605j7631j9307j7453
12614H5383r843J9300l062l660N696k5442J8499P397N69J419j7934l5239k0211
12601B2872K1435J6820r869O56K6588p496K168K3001Q859L754n085Q741J1629
12588A24073j0562j8424J5104j801j0209J3902j030j1618r257l2254J2476K3552
12576I3952J0237J9582M361p94j5423q058r481J6677R275M745L859j2669J1968
12563A28231o876k0145l889q009J0455J0442l3381k096m314J4308L6596L8474
12551A59796j04j2173J4296j0388J1411K0926K6683J1269L088K4239J1279j766
12539B58556K1891K1454q861j5184k4592j2345M340k3613k7454o364q964j9114
$$ y = [144166, 142599, 124250, 140534, 160814, 145407, 134425, 140102, 144379, 139774, 122143, 102836, 85383, 75540, 94840, 91778, 88118, 93814, 68372, 86871, 94268, 94837, 96256, 78322, 43083, 22872, 44307, 61127, 51258, 51914, 78502, 71006, 73174, 96175, 105034, 108788, 103703, 112444, 124073, 113511, 95087, 110191, 108390, 98181, 112083, 111053, 99435, 90178, 57924, 70400, 93952, 104189, 123771, 128132, 127338, 111915, 103857, 94376, 111053, 120328, 125073, 128932, 116263, 128231, 121355, 101210, 97321, 89312, 99767, 110209, 76828, 74732, 70418, 84726, 121322, 159796, 159692, 147519, 161815, 151427, 162838, 183764, 210447, 221716, 224804, 249043, 260322, 258556, 280447, 301901, 293040, 277856, 253264, 240919, 245259, 221646, 194192, 187828, 178864, 159750]
12527A59750j8566Q583J7643K0701Q3j6417j0379q503J4776J1675K0505l920P477
12514B03408M204j1299J6704J5889K345R2791P8277N1001M1817J6670O5389N2636
12502F29832O5709P1563L3073L9589K269J536R807o098j57l3227J287o045l6954
12489G72184n5430m2414m4719o7767j05180o1007k047k3553k2493k2293j8359
12478C06922l4168k7474k0582l1883J6543K362k1531m0264j0004R349k2726k9224
12466I7320P308j0387o398n430K3452J6691L079k6610k2663N026N92L515K2466
12453A07961k6016q995P324N911j3390q36j1831M491K6149O801p201n428j2514
12440G2426j698p845L173N983j04o260J9859J7655M602k4466m496R376J9335l856
$$ y = [159750, 141184, 149767, 167410, 188111, 188194, 171777, 161398, 152895, 167671, 179346, 199851, 195931, 203408, 207612, 196313, 213017, 228906, 231251, 324042, 402319, 453320, 495137, 511807, 577196, 629832, 695541, 767104, 800177, 839766, 842035, 843571, 853378, 847280, 847123, 813896, 815183, 809138, 772184, 716754, 674340, 629621, 561854, 456674, 395667, 393620, 370067, 347574, 325281, 306922, 272754, 245280, 224698, 192815, 209358, 211720, 190189, 149925, 139921, 149270, 126544, 97320, 104628, 94241, 87843, 82413, 105865, 122556, 125635, 99025, 76362, 81388, 81980, 85495, 107961, 81945, 72950, 80274, 86185, 72795, 71959, 60128, 64619, 90768, 97569, 90368, 84940, 72426, 70728, 62883, 66056, 72039, 71935, 65675, 85534, 103189, 107791, 83325, 78829, 88205, 107540, 103684]
12426A03684k4087J4972J5994J570j2503k1928n449q858l4850J2859M6258n202
12414H2460k2018L37k2914J920R718O078J18j620J5071P166Q928o852j4531q156
12400E5705j623K1927o802j9743p70n918J7293J8681K124q914Q467p308p705K1182
12386H6596N355o57l72j6715N095J4434K821R942P565M102l909l0001m3123j2571
12372B8562P897J6235K0339K2855k746n988J2598J8916m261k239r099L075L437
12359A09581K4877L979j0506j6577j1018j3960k7604J0960L5768J4056J4952j8728
12347A15780P552J893l550p319j8208l944K5173O931k0319k144J466J2485r969
12334A05827j9167Q307L7069K3387j2557k4802r189p378k3136j3083k661K4186
$$ y = [103684, 79597, 94569, 110563, 112133, 99630, 77702, 72253, 63395, 28545, 41404, 87662, 82460, 60442, 60779, 37865, 39785, 49503, 55581, 55699, 54079, 69150, 76316, 85244, 78392, 63861, 55705, 54082, 76009, 69207, 49464, 48694, 42776, 60069, 78750, 80874, 71960, 80427, 73119, 65414, 86596, 91951, 91294, 90922, 74207, 79302, 93736, 96557, 106499, 114064, 118166, 114257, 84256, 41133, 28562, 36459, 52694, 73033, 95888, 93142, 87154, 99752, 118668, 114407, 112168, 103069, 106144, 109581, 134458, 138437, 127931, 111354, 100336, 86376, 58772, 69732, 105500, 119556, 134508, 115780, 123332, 125225, 121675, 114356, 96148, 92204, 117377, 124308, 103989, 101845, 103311, 115796, 105827, 86660, 94967, 132036, 155423, 142866, 118064, 108875, 101497, 78361, 65278, 62617, 86803]
12322H6803L1732K3640k740k0751k1604L227L7347J0491j6863n467j234n913l8201
12309H0467k0978L1388M0781K5293J8387k376j3402j4648K059M5929J4282N678
12297B12860M996K5536K090J9943M970k2381J3882r15L256K6123k3963m4288n243
12284B16866k685j557J2543k554k9635j2100j4835j5677j5646o114J8621J3710
12272A60937J2128J1175k7742p91K2065J5962J8776L643j9111l6694l1714j0352
12260A18282J235Q986J086J0433J4048q122K5161J1426k9251j2774K3665O628
12248A70803k876k4408n958J5084K0752L5175K4698o800k3017q617O551j832J7440
12235B16995j8507j5895J5683K917j6876K6587k0140q232P982k6270J0448L5158
$$ y = [86803, 118535, 142175, 139435, 118684, 97080, 100307, 137654, 148145, 131282, 125815, 124581, 118668, 80467, 59489, 90877, 131658, 156951, 175338, 172962, 159560, 144912, 146971, 192900, 207182, 212860, 217856, 243392, 245482, 265425, 270395, 248014, 261896, 260981, 264237, 290360, 266397, 222109, 216866, 214181, 212624, 225167, 222613, 192978, 180878, 166043, 150366, 134720, 128606, 147227, 160937, 173065, 184240, 156498, 155707, 177772, 193734, 212510, 216153, 197042, 160348, 128634, 118282, 119517, 128503, 129589, 140022, 154070, 145948, 171109, 182535, 153284, 140510, 164175, 170803, 167927, 143519, 137561, 152645, 173397, 208572, 233270, 226470, 203453, 194836, 201387, 199555, 216995, 198488, 182593, 198276, 201193, 184317, 210904, 190764, 182532, 190514, 164244, 174692, 209850]
12223B09850K6105L55j4207J6244j0702k678J46j7711j8987P244r188o344K354
12210A82481j407q222q13L7873J4103o128n556o820r136P232L403o25N965R893
12196B22243n293q62J1041j2172o690o6K134K1311J5197R139k37j417o216L4193
12182B82305k490q852J0789J1899o219L0154j162k4809j012r078L985P348P171
12169C00029O860j4229j1590O723l897M345J3791K3386R702n582k640N766j1015
12156C21649P549P86K282K94k281J0519L048J0304j3945M738R398J9941j3828
12143C60454k0868L151J8933J1246N691K8845q88k4975j1552K1957o01K7701L5632
12130D54726J149K6234l996o9K135J3949P872j2339r560j5572J3260J6013N917
$$ y = [209850, 235955, 236310, 222103, 238347, 227645, 224967, 225113, 207402, 188415, 195659, 186471, 180127, 182481, 181074, 172852, 172039, 209912, 224015, 217887, 212331, 205511, 196375, 203607, 207010, 206385, 212350, 222243, 216950, 216088, 227129, 214957, 208267, 208201, 210335, 231646, 246843, 255982, 255745, 254328, 248112, 282305, 279815, 270963, 281752, 293651, 287432, 317586, 316424, 291615, 290603, 281525, 285510, 292858, 300029, 306889, 292660, 281070, 287793, 283896, 288241, 302032, 325418, 335120, 329538, 326898, 332664, 321649, 329198, 329984, 332266, 332560, 330279, 340798, 343846, 354150, 340205, 344943, 354341, 374282, 360454, 339586, 342737, 361670, 372916, 378607, 407452, 406564, 381589, 370037, 391994, 391393, 419094, 454726, 455875, 482109, 478113, 478044, 480179, 494128, 502000, 489661, 480101, 464529, 477789, 493802, 499719]
12117D99719J958J1269P978K1684m919m171L3939K185j523J7582j5065J3809M0677
12104F25122j7828l136L4817J9362L054n188N636n199K3826J4111o32p182K9312
12091G16075L5906M1289K079K5827L1201L0964L9929j6087M6l988J0656M9997
12079I63894L4727J95L8147K277Q675K6511J2638p429L789J5349L2983M4749L1874
12066A208379k586Q69N4362N9815J8443K2027J8273L1201M9696L1041K1753J9212
12054A532485O392J8080L9345M1418O3343L7309M0692L5254O6853N0456N3505
12043A985132M1594L6938P8647O3871N0364P4609O0764M2350N5115O9811R0298
12032B649493P0571O9660P8495Q8337Q8754J02638J44531J10570J21789J25265
$$ y = [499719, 501677, 512946, 520924, 542608, 537689, 533518, 567457, 569642, 568119, 585701, 570636, 584445, 625122, 607294, 604158, 638975, 658337, 661391, 656203, 661839, 656640, 680466, 694577, 693945, 686763, 716075, 751981, 793270, 795349, 821176, 852377, 883341, 923270, 907183, 907229, 903241, 913897, 963894, 998621, 998816, 1036963, 1039240, 1047915, 1074426, 1087064, 1079635, 1083424, 1098773, 1131756, 1176505, 1208379, 1205793, 1206662, 1261024, 1320839, 1339282, 1361309, 1379582, 1410783, 1460479, 1491520, 1513273, 1532485, 1538877, 1556957, 1596302, 1637720, 1701063, 1738372, 1779064, 1814318, 1881171, 1931627, 1985132, 2026726, 2063664, 2142311, 2206182, 2256546, 2331155, 2391919, 2434269, 2489384, 2559195, 2649493, 2720064, 2789724, 2868219, 2956556, 3045310, 3147948, 3292479, 3403049, 3524838, 3650103]
12022C650103J30738J42167J57455J63010J69493J83536K00022K14237K33707
12013E244468K39296K58642K72805K90829L00291L18492L39354L83911M09687
12004H057775M04691M96568N09512N35748O09289O57473O93557P37181P80102
11995A3481896Q53616Q84013R60592J000943J045048J098205J151592J168833
11987B1644738J182086J186649J191846J145134J091648J000266R11158Q00753
11979C0154278O84459N52402M55754L30078K24663J56974R6129K6774k6503q4913
11969C2570095j46068j87755k03655k35648k45745k32657k85863l24004l25017
11960C0383683l11387l35860l69025l75907l91607m12054m46885m60783m64675
$$ y = [3650103, 3780841, 3923008, 4080463, 4243473, 4412966, 4596502, 4796524, 5010761, 5244468, 5483764, 5742406, 6015211, 6306040, 6606331, 6924823, 7264177, 7648088, 8057775, 8462466, 8959034, 9468546, 10004294, 10613583, 11271056, 11964613, 12701794, 13481896, 14335512, 15219525, 16180117, 17181060, 18226108, 19324313, 20475905, 21644738, 22826824, 24013473, 25205319, 26350453, 27442101, 28442367, 29353525, 30154278, 30838737, 31391139, 31846893, 32176971, 32401634, 32558608, 32654737, 32681511, 32655008, 32570095, 32424027, 32236272, 32032617, 31796969, 31551224, 31318567, 31032704, 30708700, 30383683, 30072296, 29736436, 29367411, 28991504, 28599897, 28187843, 27740958, 27280175, 26815500]
11951B6815500m48444m61865m91681n15591n03649m96868n16072m96591m86648
11942B2398091m91097n31024m93937m55929m78534m69145m40910m30847m55641
11933A8151027m46381m43804m47087m04599m19625m30677m29691l97296m20615
11924A4311252m21672m32089m25237l98406m05137m42624m31457m21184m14794
11915A0518652m20232m09167l98081l81234l44554l53894l40273l22474l09922
11906G238821l02558k61080k76073k59006k31970k33803k29961j90821k08088
11897E045461k19620k06718j78084j65402j76753j45462j27354j34261j50101
11888C541706j38453j24718j40837j28416j22990q5802q2479p5726j02889j00544
$$ y = [26815500, 26367056, 25905191, 25413510, 24897919, 24394270, 23897402, 23381330, 22884739, 22398091, 21906994, 21375970, 20882033, 20426104, 19947570, 19478425, 19037515, 18606668, 18151027, 17704646, 17260842, 16813755, 16409156, 15989531, 15558854, 15129163, 14731867, 14311252, 13889580, 13457491, 13032254, 12633848, 12228711, 11786087, 11354630, 10933446, 10518652, 10098420, 9689253, 9291172, 8909938, 8565384, 8211490, 7871217, 7548743, 7238821, 6936263, 6675183, 6399110, 6140104, 5908134, 5674331, 5444370, 5253549, 5045461, 4825841, 4619123, 4441039, 4275637, 4098884, 3953422, 3826068, 3691807, 3541706, 3403253, 3278535, 3137698, 3009282, 2886292, 2800490, 2718011, 2642285, 2539396, 2438852]
11878B438852j13839o4461n1490p3294r1250p3111m6043n0020p2109n3359k5424
11867A724452l0234l5852m8610n1188n4693p1159m0500l6747r816m5711j6107
11856A283835j7266l6641j6932m4227l9722l3068n1754m244O803k8508k5846K4027
11844A016457m643l1585m4458j7028j3918j9013j6882j1540j799l5761r501o706
11832H03623j0954l4079r04j146k2710j7996j048j4380Q551J0727j0424l5116
11820F74144l5303J3763K4094r659l8188l0146K550l239j0909m275l69J7139j3318
11807E86284p137m862j1734O571l7871k5975k1710k2732K11j6089M993j1373J9800
11794D58376K1368o221m853j5226l3318p528l079l410n166R597l405j2996K379
$$ y = [2438852, 2325013, 2260552, 2209062, 2135768, 2044518, 1971407, 1925364, 1875344, 1803235, 1749876, 1724452, 1694218, 1658366, 1609756, 1558568, 1503875, 1432716, 1392216, 1355469, 1345653, 1299942, 1283835, 1266569, 1229928, 1212996, 1168769, 1129047, 1095979, 1044225, 1039981, 1046784, 1018276, 992430, 1016457, 1011814, 980229, 935771, 918743, 904825, 885812, 868930, 857390, 855591, 819830, 810329, 803623, 792669, 758590, 757686, 756540, 733830, 715834, 714786, 700406, 708957, 719684, 709260, 674144, 638841, 652604, 676698, 667039, 628851, 598705, 601255, 598016, 587107, 582832, 582463, 599602, 586284, 579147, 574285, 562551, 569122, 531251, 505276, 483566, 460834, 461045, 444956, 449949, 438576, 458376, 479744, 473523, 468670, 453444, 420126, 412598, 409519, 406109, 400943, 410540, 407135, 394139, 396518]
11781C96518K0042n98q290r295k5400k416j5880k3456j3658K0060R963r017K6304
11768C64877n80j3231L538J3080j3095r910j029j5719J2164N576o190j9584j8180
11755C01717j5503J1814J9242J2369l832j6703m1156m432o960k9630J9778J5297
11743B62001k2206j8031r204j394M2815J4145k1316j6028K3859L3141k9525j5329
11731B42928J3099o033q339j2081k1187j0663K3242l208j3772J3911o767j8023
11719A93107o600K6568O452j2083J0504K1160k142o050L48j5783k2236j072n356
11706A86817J6314R811M199j3117j3035L497r653J5148Q059K1451J3427j2470
11694B30448O112o38l7761n0512N378K5822j469n578J0643J1952J506j8630l1811
$$ y = [396518, 416560, 415962, 407672, 398377, 372977, 370561, 354681, 331225, 317567, 337627, 347590, 338573, 364877, 364297, 351066, 354604, 367684, 354589, 344679, 343650, 327931, 340095, 345671, 339481, 319897, 301717, 286214, 298028, 317270, 329639, 325807, 309104, 267948, 263516, 256556, 226926, 246704, 262001, 239795, 221764, 212560, 211166, 253981, 268126, 246810, 230782, 254641, 287782, 258257, 242928, 256027, 249994, 241655, 229574, 208387, 197724, 220966, 217758, 203986, 217897, 211130, 193107, 186507, 213075, 219527, 207444, 217948, 239108, 236966, 230916, 231264, 215481, 193245, 192173, 186817, 203131, 212942, 217141, 204024, 190989, 194486, 184833, 199981, 208040, 229491, 242918, 230448, 236560, 235922, 198161, 147649, 153027, 178849, 177380, 171802, 182445, 194397, 195903, 177273, 145462]
11681A45462O429j1888K1242J2637L3193n608P729Q254j4272Q925j7292m235J451
11668A92027l992J3112o313Q210j0001J6397L760m992m1735k7950J2377L1404
11656A82304R079J3982j6359K248m867J609N673J3513j7599j0679P059K4585n925
11643B04623k754L0704K2100J3389j4357j865P768K5830K2017K5290M8268L5589
11631D16602J4049L5255L0538M9856R0082O0735Q7066N8710N3242J5611k1477
11620H90269m3070l2974p4505p0562m3238n8208o1153p9133l4711q746k2114m561
11608C57294j1454P032K880m1118j5797n207k7549p517l310j1420l2796n8802
11596A52236l7748j3563J8710J9834J4369R758r649J5095J0311j7344j2030j8629
$$ y = [145462, 151891, 140003, 161245, 173882, 207075, 201467, 209196, 217450, 203178, 212103, 194811, 190576, 192027, 188035, 201147, 194834, 203044, 193043, 209440, 213200, 208208, 166473, 138523, 150900, 182304, 191383, 205365, 189006, 191254, 186387, 187996, 193669, 207182, 189583, 178904, 185963, 210548, 204623, 201869, 232573, 254673, 268062, 253705, 251840, 259608, 285438, 307455, 332745, 381013, 416602, 430651, 465906, 496444, 546300, 636382, 697117, 784183, 842893, 896135, 911746, 890269, 847199, 814225, 739720, 669158, 625920, 567712, 506559, 427426, 392715, 383969, 361855, 357294, 345840, 352872, 355752, 314634, 298837, 293630, 266081, 258564, 255254, 243834, 211038, 152236, 114488, 100925, 119635, 139469, 153838, 163596, 153947, 169042, 179353, 162009, 149979, 131350]
11584A31350k0857J008N92o573K813j1165k1346J9013O221p305O188k768q43K6186
11570A22514M369j4509l0303l490r92p080j085j022m262l485J3333K7289K7874
11557A29151N901q341j304J4578P681j4005j3336n24Q944m8542k0539l801K4569
11544H0432K1663K1053p546j3759M187k078j6987J9252k865J8q931J172K966n891
11530I2686m412J2259J3576J6942j6567m237l3258J370Q780l487o797j2781r136
11517E4938J1113N7981J1987j0010j3918K231j3010q547K3328j7774Q773Q822
11505A15914j1224j8134n585m024n977j0469K7656q334k0177K722K9298K8968
11493A20634p322l09m23L257j4026j6380j6482m962K0617j086j104m263j3820
$$ y = [131350, 110493, 111501, 112093, 105520, 108333, 97168, 75822, 94835, 101056, 93751, 99939, 97171, 96328, 122514, 126883, 112374, 82071, 78581, 77589, 70509, 69424, 68402, 64140, 60655, 73988, 101277, 129151, 135052, 126711, 125407, 139985, 147666, 133661, 120325, 119801, 128745, 80203, 59664, 55863, 80432, 102095, 123148, 115602, 101843, 106030, 103952, 86965, 106217, 103352, 103370, 94439, 95611, 98577, 92686, 88274, 100533, 114109, 131051, 114484, 110247, 76989, 78359, 87139, 83652, 76855, 64074, 54938, 66051, 124032, 136019, 126009, 112091, 114322, 101312, 92765, 116093, 98319, 107092, 115914, 104690, 86556, 80971, 76947, 70970, 60501, 88157, 79823, 59646, 62368, 91666, 120634, 113312, 113003, 112580, 115837, 101811, 85431, 68949, 63987, 84604, 83518, 82414, 78151, 64331]
11480F4331P429j8720j5981q944L739J1470O931j2325R526j0394j2072J0870K4040
11467E9900Q47P31L92J8172K2462J3822J634k8965j3350j4707O035J561o813j1059
11453E0662L497j6692o507M898P027K4992j6096o927m14J6725M804j5676j072
11440D9221J33l2258k6766J5771L0311j4637j7559Q805Q560L0682l9008j4419
11428a164L9586L3123j1635J3475J1628O258j7105j5980m716N248J2636J453r580
11415F3227j5677M549J9477J6294K8610k0036j6074k3197j8543L715o476p769
11403B8100J4052L0522M0066j4316l3499J0344J328k342J2234K53p286Q595o404
11390H1647j8319j0071j0848j4109N08l6287P067K4369Q372j5177k33j551o046
$$ y = [64331, 71760, 53040, 37059, 28115, 31854, 43324, 50255, 37930, 47456, 37062, 24990, 35860, 59900, 60747, 61478, 61870, 80042, 102504, 116326, 117960, 88995, 75645, 60938, 66973, 68534, 61721, 50662, 54159, 37467, 30960, 35858, 42885, 67877, 51781, 44854, 44440, 61165, 65969, 50293, 49221, 49354, 17096, -9670, 6101, 36412, 21775, 4216, 13021, 21581, 52263, 13255, -1164, 38422, 71545, 59910, 73385, 85013, 91271, 74166, 58186, 53470, 58718, 71354, 72807, 63227, 47550, 52099, 71576, 87870, 116480, 96444, 80370, 57173, 38630, 42345, 35869, 28100, 42152, 72674, 112740, 98424, 64925, 75269, 76597, 74255, 86489, 86742, 79456, 88051, 81647, 63328, 53257, 42409, 28300, 28808, -7479, -412, 23957, 32329, 17152, 16919, 15368, 9322]
11377I322J3531J1890j8804J89K8174j5618k3126J48L4377J3583j3905J4924O637
11364F1322m746j3158r676M807r43j5276O251n811j6808Q90J5256L0122l410j3148
11350C5672j5431k7498j3078P092J7289J3305Q19O660J4837Q86j7255J353J5672
11337D0323K4141k1464k1190K845K7863j394j3530l738K9275q65j0647k6509j0225
11324A4885p615P841N518J673j3243J419K366J2510k3011q558M776K1766J3904
11311C4231N604J6794M506q071M863J0971P618j7942n162k085K5221j1691j2747
11298E2110Q094r82P299J4558j108Q982k2707k3038k558M503J3372r457l0981
11285A8087o438j1536k248M5618J6724k4554n853J5914L272L148M958J2301K0916
$$ y = [9322, 22853, 34743, 15939, 16128, 44302, 28684, 5558, 5706, 40083, 53666, 39761, 54685, 61322, 56576, 43418, 33742, 38549, 37606, 22330, 28581, 22770, 5962, 6852, 22108, 52230, 48820, 35672, 20241, -7257, -20335, -13243, 4046, 17351, 18170, 24830, 39667, 40553, 23298, 24651, 40323, 64464, 43000, 21810, 24655, 52518, 51124, 37594, 33856, 63131, 62266, 51619, 25110, 14885, 7270, 15111, 20629, 22302, 9059, 10478, 12844, 25354, 2343, -6215, -1439, 20327, 34231, 39835, 56629, 61135, 53064, 57927, 68898, 76516, 58574, 53412, 51327, 76548, 64857, 52110, 60204, 59222, 66521, 81079, 79971, 88953, 66246, 43208, 40650, 45153, 58525, 49068, 18087, 11649, 113, -2135, 43483, 60207, 35653, 29800, 45714, 48986, 52134, 57092, 69393, 90309]
11272I0309k6529k8822J6546K4696N964J5463L029j2794r977n452q139j401p186
11259E5707m110J7504j6340j4390j3559J9936k122j276K2796J3827O265J1579
11247I5817j0233j1924n612o38k2713l565k622J5049J454K333j3373o178L0567
11234F8362Q965j9088L57N241P171K931k441k1565n61K5787J119p275q31j3225
11220E4947j7921p473K9642r764K2137N457J5359P79j185j6667k6918p695J918
11207D2616J1086k1521j6926K069J7789J8955J9978P802O951j9785k4377n898
11195C8739K8r601K9587L6091P025k9994o572m582J3046L408j4107J930K0645
11182H5643m361j8202J570q91q632K044k0041k0572J8237P093K110R964M688L1031
$$ y = [90309, 63780, 34958, 51504, 76200, 82164, 97627, 100656, 87862, 77885, 72433, 64294, 62893, 55707, 51597, 69101, 52761, 38371, 24812, 44748, 42626, 41350, 64146, 77973, 84238, 95817, 85584, 73660, 68048, 67410, 44697, 41132, 38510, 53559, 55013, 57346, 43973, 37795, 68362, 77327, 58239, 58596, 63837, 71008, 73939, 71498, 49933, 49372, 75159, 76278, 69003, 68172, 54947, 37026, 29553, 59195, 49431, 71568, 77025, 92384, 93163, 91978, 75311, 48393, 40698, 42616, 53702, 32181, 15255, 17324, 35113, 54068, 74046, 81848, 88799, 69014, 44637, 38739, 38767, 29166, 58753, 94844, 101869, 71875, 65303, 60721, 73767, 77175, 63068, 64998, 85643, 81282, 63080, 64650, 63759, 55127, 57171, 37130, 16558, 34795, 41888, 43998, 53962, 58650, 89681]
11168H9681J1498M052J6822l764m9333m938J2518J2393J1541n694k0715k5248
11156D8813j0784l18K7399O679l292o293K502N814M331K6723Q497J3263K0018
11143A43352J9517N298P74K1815M874j6401K3754L0304k09r009K5692p540l534
11130B38687L012K609L8133K103j8069l4408j3610P872K3156j7824j4706k9875
11118A87080L704J7027p546j3163j7700k6556j4303n110K2682J1992l8000j1050
11106A09057n183J2393K4655L1l587j7474k8702j1093N739n152P499R004j822
11093I5365r061l2283J8227J3162j161m553J0579K6679K641r257j6258n436L559
11080I2203m868R219l790j0179j3415k0158j5714J2486Q826L0554J3663l9216
$$ y = [89681, 101179, 105231, 122053, 118289, 68956, 64018, 76536, 88929, 100470, 94776, 74061, 48813, 38029, 37711, 65110, 71789, 68497, 62204, 64706, 70520, 74851, 101574, 110071, 123334, 143352, 162869, 168167, 168941, 190756, 195630, 179229, 202983, 233287, 233078, 224069, 249761, 242221, 238687, 241699, 244308, 282441, 284544, 266475, 232067, 218457, 226329, 249485, 231661, 216955, 187080, 190784, 207811, 200265, 187102, 169402, 142846, 128543, 123433, 146115, 158107, 120107, 109057, 103874, 116267, 140922, 140953, 137366, 119892, 91190, 80097, 85836, 80684, 88183, 97187, 95365, 86304, 54021, 72248, 85410, 84249, 79696, 90275, 116954, 119595, 110338, 94080, 88644, 92203, 87335, 96554, 92764, 82585, 69170, 49012, 33298, 45784, 54610, 85164, 98827, 59611]
11068E9611l6141O692L2483K7899J961k6010j2706j546k3710J2882J4071J0585
11056F6071J3345P213j8878j2195J7590N861J0030K9143K9812J0079L3334P127
11044A98532j288J3776O9803L8722O571K0281P539R588m0685o1687j0863P95K28
11031B51312r703p998O19j5749r431j0376K2019J2706O22k920J5673j0635L816
11018B39955r54k856j3456j6477r241R386K6078J8210O189K1l097l2993R758j410
11004B29113n8660k4220J3135k2662l6495n917J7209L1281m765j2259j3050j920
10992A10790P235m880J5378R645l002K718r256j2044J3396K8649L0908j795k0336
10979A67406o425J9963J0128l7279l5325m2066j1835M82J620M655r461m556K408
$$ y = [59611, 23470, 30162, 62645, 90544, 92505, 66495, 53789, 52243, 28533, 41415, 55486, 66071, 79416, 86629, 67751, 55556, 73146, 79007, 89037, 118180, 147992, 158071, 191405, 198532, 197244, 211020, 280823, 319545, 326116, 346397, 353936, 363524, 322839, 261152, 250289, 251084, 251312, 241609, 233611, 234230, 218481, 209050, 198674, 220693, 233399, 234021, 231101, 246774, 236139, 239955, 239001, 236145, 222689, 206212, 196971, 206357, 232435, 250645, 256834, 256855, 253758, 220765, 230523, 229113, 170453, 146233, 159368, 136706, 100211, 94294, 111503, 142784, 138019, 125760, 112710, 110790, 118025, 113145, 128523, 138168, 135166, 137884, 128628, 116584, 129980, 158629, 189537, 187742, 167406, 160981, 180944, 191072, 153793, 118468, 76402, 64567, 65049, 66669, 71324, 61863, 57307, 59715]
10966E9715J4983k770p49M653K8795k915J335j1085q916P383j6287r292l268j7099
10952D4483K43n213J2114L016j1494p587K3303m474J8870J4587k8257K1544J3236
10939I4371n0611n144J9264J4092J2354J0471J0973K955o285l3361j1248L835
10927F1666n239r257M798P639o094J530l0014N096K1920L0868J6402o418k1836
10914G1061J1738R119r350n803m21O552M627j9960o094l468Q985N159O307j8011
10900F0441j7795n34l6316p956L2207L1167J3660k6668J1248K201J2283J4425
10888H8363L667J2643k8065J1114j0840k7124r662L141L59L4699K9593K109J2903
10875A22900j0091j1566q982j2508k3707p355J566M8402M2482N714J1529l1118
$$ y = [59715, 74698, 71928, 71179, 75832, 104627, 101712, 103047, 91962, 83046, 90429, 74142, 64850, 61582, 44483, 44726, 39513, 51627, 54643, 43149, 35562, 58865, 54391, 73261, 87848, 59591, 81135, 94371, 43760, 38616, 57880, 71972, 84326, 94797, 105770, 108725, 102440, 69079, 57831, 61666, 56427, 47170, 51968, 59607, 53513, 55043, 25029, 30125, 52045, 82913, 99315, 92897, 71061, 82799, 91918, 82568, 76765, 76344, 82896, 87523, 67563, 61469, 58001, 66986, 72145, 78452, 60441, 42646, 42112, 5796, -2160, 30047, 61214, 74874, 48206, 59454, 61655, 73938, 88363, 92030, 104673, 76608, 87722, 76882, 49758, 40096, 43237, 43596, 78295, 107888, 109997, 122900, 112809, 101243, 92261, 79753, 56046, 48691, 50257, 98659, 141141, 146855, 158384, 127266]
10863A27266n0453O146m680l562P961j7751M290j5933k8421j8754L9171O578J7146
10850F9004J8067o534j9299j4791k544J4508J9983K9410o624j1540K678L159j001
10837I4476K4174K0526k9318k0360J775j0831j5736m718M0051n986k5408L7243
10825A05888L5620l296p995P167N72j3285k750o712j2025j1147k9739o470P101
10812F2929J1975K943J647j7672m290K3467J3985L4042j0287k9597l3375r515
10800D6252L2568N44r854K6564J0221j4159j6324k2654J8093N844k0013k1244
10788C5838j444m791K534J8196L1630M447J3499l789k4175j1663J0421K5917K2592
10775A19212L043O158p98j174K122K0938j515j0671r333K6074N1955J3783J652
$$ y = [127266, 76813, 82959, 78279, 74717, 82678, 64927, 69217, 53284, 24863, 6109, 45280, 51858, 69004, 87071, 80537, 61238, 46447, 43903, 58411, 78394, 107804, 101180, 89640, 92318, 95477, 94476, 118650, 139176, 109858, 89498, 91273, 80442, 64706, 59988, 100039, 94053, 68645, 105888, 141508, 138212, 130217, 137384, 137956, 124671, 121921, 115209, 103184, 92037, 62298, 55828, 62929, 74904, 77847, 79494, 61822, 57532, 80999, 94984, 129026, 118739, 89142, 55767, 46252, 78820, 79364, 69510, 96074, 106295, 92136, 75812, 53158, 71251, 77095, 57082, 35838, 34394, 29603, 32137, 50333, 81963, 86410, 99909, 96120, 71945, 60282, 70703, 96620, 119212, 122255, 128413, 127615, 126441, 128563, 149501, 147986, 137315, 127982, 154056, 206011, 219794, 221446]
10762B21446Q815J2377M8916L5522J9236J4424L2239N6595Q4530Q5014J40581
10751G59695J83880K23312K05901K07637J30768L5804o4123j26949k00587j86557
10741A168781j56536j61405j53189j19403o3374n3736l6805j7751K098j1074k6860
10730C70746k771j0539l6303l0391j5909k0589j9820j0518j4835o408J6813m954
10718B14522l2154j2012J5711j0143M678J9315J3969P639l0883k0332J2136n076
10706A77370l33K5481K2131N809l810j4724K513J7556l0659m9333J9415M3503
10694B14919j4888j8827j5457P200K8530O055m232n955P074K4331L6411J6542
10682B81703m625k5156m26K2849j5697j896K8827k7205j9127R867m888L328J9737
$$ y = [221446, 230261, 242638, 291554, 327076, 346312, 360736, 392975, 449570, 534100, 619114, 759695, 943575, 1166887, 1372788, 1580425, 1711193, 1746997, 1682874, 1555925, 1355338, 1168781, 1012245, 850840, 697651, 578248, 514874, 461138, 424333, 406582, 408680, 397606, 370746, 367975, 357436, 321133, 290742, 274833, 254244, 234424, 223906, 209071, 202663, 219476, 214522, 182368, 170356, 186067, 175924, 180602, 199917, 213886, 221525, 190642, 170310, 182446, 177370, 177037, 202518, 224649, 230458, 226648, 211924, 214437, 231993, 201334, 152001, 171416, 214919, 200031, 181204, 165747, 172947, 201477, 207532, 203300, 197345, 204419, 228750, 265161, 281703, 277078, 251922, 251496, 274345, 258648, 256752, 285579, 258374, 239247, 249114, 244226, 247554, 267291]
10669B67291P165J101M843Q620J2393J0549J0401K8438K764J3074Q406m113J7387
10656C88319M7635R651O660J532k3096J1133L8933K2703L2452L4934k550P553
10644E75859M1949M4316K8307K4215J6875M5826M3594O6567P2825N8806N7100
10633A076239N6309J28310J24405J04261R7305J46357J78501K45858K84553K99133
10623B741231M29169N49569O85510Q33705R90065J125148J150182R87915P12599
10614A0205093M22346K02122J32705J89377M35915P79868J245730J700243J987901
10605A7301300J953463J530500Q60992J32992m33972o16311m76244q1968N57300
10596B0728052J245629J920480K280619K109092J365804K71131q44161j634951
$$ y = [267291, 274456, 275557, 280400, 289020, 301413, 311962, 322363, 350801, 353565, 366639, 375045, 370932, 388319, 435954, 445605, 452265, 453797, 430701, 441834, 480767, 503470, 535922, 570856, 568306, 575859, 617808, 662124, 690431, 714646, 731521, 777347, 820941, 887508, 960333, 1019139, 1076239, 1132548, 1260858, 1385263, 1489524, 1586829, 1733186, 1911687, 2157545, 2442098, 2741231, 3170400, 3719969, 4405479, 5239184, 6229249, 7354397, 8504579, 9492494, 10205093, 10627439, 10829561, 10962266, 11151643, 11587558, 12367426, 13613156, 15313399, 17301300, 19254763, 20785263, 21646255, 21779247, 21345275, 20728964, 20252720, 20170752, 20728052, 21973681, 23894161, 26174780, 28283872, 29649676, 29920807, 29076646, 27441695]
10588B7441695j951126j825867j356621p36167j15014M56064Q12278P17690J98071
10579B3641003n35822j247897j738990j892104j774009j429628r85986n84221
10571A3452346l00071j45747j66438l53382o76098r41129j063224j153388j117172
10562G535697r84968q68163o99812n30525m28530l65772l21351k76003k63101
10553B797472k12823j96468k07043k06824j69839j12412r5459j11387j08105j09644
10543A267468j06705p9399p4650r7315o4709m3919p1362n2666m6561k5260j4149
10532E90773j8859l2403l1141j9758l7108j5326k691o864n6732l1874j42l407
10520C34468j0593J6298p379R253J0208R997j3505J0073J6097K4917k087k8904
$$ y = [27441695, 25490569, 23664702, 22308081, 21571914, 21456900, 21912964, 22725242, 23442932, 23641003, 23105181, 21857284, 20118294, 18226190, 16452181, 15022553, 14036567, 13452346, 13152275, 13006528, 12840090, 12486708, 11810610, 10869481, 9806257, 8652869, 7535697, 6550729, 5682566, 4982754, 4452229, 4023699, 3657927, 3336576, 3060573, 2797472, 2584649, 2388181, 2181138, 1974314, 1804475, 1692063, 1596604, 1485217, 1377112, 1267468, 1160763, 1081364, 1006714, 909399, 844690, 800771, 729409, 676743, 630182, 604922, 590773, 571914, 539511, 508370, 488612, 451504, 436178, 433487, 426623, 369891, 338017, 337875, 334468, 323875, 340173, 332794, 342047, 352255, 362252, 348747, 358820, 374917, 399834, 397747, 368843]
10508C68843l8089k1574j0633L66K529R753k648L707J642K6799K1946R074J0708
10495C82423p017k2089J3432p887j663J2347J2298K460l3582J2381O365k0981
10483C48487O207K3891m200j4508n072J8071M2568K349M780j7900r204N771L5440
10470D36680J6886j8763N426j0572J6549J4262J7719j4606l0913N661p666K294
10458D32957K9538K7324J4916N693k2049O640L5207L7021L2916K3996R784l964
10446F29979J0310K8595O862j0295p77K2165J4892J2252P360K0179J7312J2378
10434G71212R488n542j214O493l6978J7279K7294K6047Q808L8716M5214J7701
10422I24518J9311P661K16J7382J5021o292K8424R732L0035M1257J879k2699J3417
$$ y = [368843, 330754, 309180, 298547, 298913, 301442, 311195, 308547, 312254, 313896, 340695, 362641, 371715, 382423, 375406, 353317, 366749, 358862, 357199, 369546, 381844, 384304, 350722, 363103, 369468, 348487, 354694, 378585, 374385, 359877, 354805, 372876, 415444, 417793, 422573, 404673, 395469, 401240, 436680, 453566, 434803, 440229, 429657, 446206, 460468, 478187, 463581, 432668, 438329, 430663, 432957, 462495, 489819, 504735, 510428, 488379, 495019, 530226, 567247, 600163, 624159, 633943, 629979, 640289, 668884, 675746, 665451, 664674, 686839, 701731, 713983, 721343, 741522, 758834, 771212, 780700, 775158, 773944, 780437, 743459, 760738, 788032, 814079, 822887, 861603, 906817, 924518, 943829, 951490, 951706, 969088, 984109, 977817, 1006241, 1015973, 1046008, 1087265, 1089144, 1066445, 1079862]
10409A079862J0487J6560K5914l3376k6214M3027M5803K4200J0144L0356L2103
10398A258866J8607L4520N0646M2973L1107K5583M8247M8237L9533M5765P3221
10387A717305L3053K9808O0276P6994O9421O5806O4117N2746O7329Q8604P0765
10376B396224P8897Q2030J08499J16110J19984J21803J37807J81714J82159K09164
10366C734391J91146K39086K05613K10843K26288K93100L26484L41106L82118
10357F150175M51520N34286N87857O38548P21422Q07086R63801J116822J251604
10348A3223121J442448J629745J773050J906129K064856K379301K784120L362977
10340C0565747M170903N178439O584397Q542397J1336599J5338826K1066347K8969870
$$ y = [1079862, 1090349, 1106909, 1132823, 1099447, 1073233, 1116260, 1162063, 1186263, 1196407, 1226763, 1258866, 1277473, 1311993, 1362639, 1405612, 1436719, 1462302, 1510549, 1558786, 1598319, 1644084, 1717305, 1750358, 1780166, 1840442, 1917436, 1986857, 2052663, 2116780, 2169526, 2236855, 2325459, 2396224, 2475121, 2557151, 2665650, 2781760, 2901744, 3023547, 3161354, 3343068, 3525227, 3734391, 3925537, 4164623, 4370236, 4581079, 4807367, 5100467, 5426951, 5768057, 6150175, 6601695, 7135981, 7723838, 8362386, 9083808, 9890894, 10854695, 11971517, 13223121, 14665569, 16295314, 18068364, 19974493, 22039349, 24418650, 27202770, 30565747, 34736650, 39915089, 46499486, 55041883, 66378482, 81717308, 102783655, 131753525]
10332A31753525L8923504M8001535N0324232M1840750K2888021l504388k7287939
10325C02939240l9213076m0559307l7145162l2820743k7782061k1792285j6039859
10318H7586747j1368581p887362n448107l625106k337685j688345k210497l729289
10310D9291775n036943n356260m819296m128050l488702k897173k439017k089267
10302A9037067j803983j559414j354106j157659r83595q73803p95700p06216o08585
10293I194006n80777m78722m09971l17056k30518j74803j00473l3232k4823n5431
10283F788200j28343j94206l09053l91214m09960m12069l95712l47207k97934
10274C902502k75065k20961j81604j85232j68428j35212r5932r5274j17369r4255
$$ y = [131753525, 170677029, 218678564, 269002796, 310843546, 333731567, 330227179, 302939240, 263726164, 223166857, 186021695, 153200952, 125418891, 103626606, 87586747, 76218166, 68330804, 62882697, 59257591, 56919906, 55231561, 53021064, 49291775, 44254832, 38898572, 34079276, 29951226, 26462524, 23565351, 21126334, 19037067, 17233084, 15673670, 14319564, 13161905, 12178310, 11304507, 10508807, 9802591, 9194006, 8613229, 8134507, 7724536, 7407480, 7176962, 7002159, 6901686, 6868454, 6843631, 6788200, 6659857, 6465651, 6156598, 5765384, 5355424, 4943355, 4547643, 4200436, 3902502, 3627437, 3406476, 3224872, 3039640, 2871212, 2736000, 2640068, 2544794, 2427425, 2333170]
10264B333170p7885p8769p8938q4581j13381j16970p1246m1155n8815p2676m1251
10253A497503m7010m2679n8674m6499j9778l3883n0415m8139l8836l1739l2305
10242A047546k3931j5265j6448k5480j8898j2986l3526k8826j7654Q273j6517
10231H46288m0334l1518N479J1847j5867k4198l4236j1335J1394j4965j3716k4874
10219F63965q019P173j7423j6728j9564M198j1605J0376N153k3928j2048J6367
10207E97917K6096M0029O8482L9029K9637N951m4040k7141o81k3367m5534m3417
10195F22961k9059k9640o751j7366j0267N725J2996J3714q321p619K3147K0263
10183E89783M29l381J1042J6397J3373j0098K3902k2697l1256l7093J0950K3763
$$ y = [2333170, 2255285, 2176516, 2097578, 2012997, 1899616, 1782646, 1711400, 1670245, 1611430, 1538754, 1497503, 1450493, 1407814, 1349140, 1302641, 1282863, 1248980, 1198565, 1150426, 1111590, 1079851, 1047546, 1023615, 1008350, 991902, 966422, 947524, 934538, 901012, 872186, 854532, 862805, 846288, 805954, 774436, 779915, 791762, 775895, 751697, 717461, 706126, 717520, 702555, 688839, 663965, 655946, 663119, 645696, 628968, 609404, 613602, 601997, 612373, 617526, 593598, 581550, 597917, 624013, 664042, 732524, 771553, 801190, 807141, 763101, 735960, 735279, 711912, 666378, 622961, 593902, 564262, 557511, 540145, 529878, 535603, 548599, 562313, 553992, 546373, 569520, 589783, 590212, 586831, 597873, 614270, 627643, 617545, 641447, 618750, 587494, 550401, 561351, 585114]
10171E85114J3123j6959L745N7185O9895J7361J861M6159P2962Q6564P5860J10311
10159A123181P4174L5146j3028n8540o3690p4085p1563r7129q5439o2324n1356
10148F55347l2187r095j2136j0464k2847m564j0197j0047o845k772Q591J5693
10136E58477j5546j7474k4665o069r560j158j6176j048j4586k9341n558K533r102
10123D10727J3263O102k1686k6330L046L324k4726j6811k8979J580r983n478J5167
10110C19216M067q960K5147K9578N4339R543J1711K3186L1564L174O537m765j8938
10097D85399j9863k3149l2225m2068r678j2626m0391j1000l3438Q206k1267k7305
10085B20595j6544J7859k0969j5928J6654J3847J5334m913N999L307M832N75l2012
$$ y = [585114, 598237, 581278, 585023, 642208, 712103, 729464, 731325, 777484, 850446, 937010, 1012870, 1123181, 1197355, 1232501, 1219473, 1160933, 1097243, 1023158, 951595, 854466, 769027, 706703, 655347, 623160, 614065, 601929, 591465, 568618, 564054, 553857, 543810, 536965, 534193, 542784, 558477, 542931, 525457, 500792, 494723, 485163, 484005, 467829, 466781, 452195, 422854, 417296, 419829, 410727, 423990, 430092, 408406, 382076, 385122, 388446, 363720, 346909, 317930, 319510, 309527, 304049, 319216, 323283, 314323, 339470, 369048, 423387, 432930, 444641, 467827, 499391, 502565, 509102, 504337, 485399, 465536, 442387, 410162, 368094, 358416, 345790, 305399, 294399, 260961, 269167, 247900, 220595, 204051, 221910, 200941, 185013, 201667, 215514, 230848, 225935, 231934, 235241, 240073, 240648, 208636]
10072B08636j74O175m074Q668J5675k2895r713L1938K8244L160K2606J3934n522
10059B96658j2232K4788N8463L3909P6799P7313M5410r473k7372l1591l8403n0128
10047D44141n6431o2895m6633j0930p504r224M170r124J372l1108p522J4554m106
10034B18760j4782p747l419N938p673j6290J1292J9334j426o304k3965l766j2654
10021A57298k4586k0797Q207J2781k1656l8707o295J5174K3751K3421L889K591
10009A35071J7162k3875j6985m410J4644j372R577j2808k7072l0652k250P763
9997F4793J1322K1230q925n249N475J8459K0092M734k903k7711m897N314r813
9984I1921J2594L265K503j7961k5297k7K617j820Q681J8351J203J083J8179k0894
$$ y = [208636, 208462, 214637, 210563, 219231, 234906, 212011, 202298, 234236, 262480, 265640, 288246, 302180, 296658, 284426, 309214, 367677, 401586, 478385, 555698, 601108, 591635, 564263, 532672, 494269, 444141, 387710, 324815, 278182, 267252, 259748, 250524, 254694, 245570, 246942, 215834, 208312, 222866, 218760, 203978, 196231, 192812, 198750, 191077, 174787, 186079, 205413, 203987, 197683, 173718, 169952, 157298, 132712, 111915, 120122, 132903, 111247, 72540, 66245, 81419, 105170, 128591, 132480, 135071, 152233, 128358, 111373, 106963, 121607, 120235, 129812, 117004, 89932, 59280, 57030, 64793, 76115, 97345, 88420, 83171, 88646, 107105, 127197, 131931, 129028, 101317, 96420, 101734, 91921, 104515, 107780, 110283, 92322, 67025, 66998, 69615, 67795, 76476, 94827, 96030, 97113, 115292, 94398]
9970I4398m2431L391J7853j5667o241J9286J6237l952P204N113j025j1797k2549
9957E9820q12l680j5751k34J9941l060K0843K4967j593k9687J4516K0745J9764
9944A25779J8303k3059k7200k325j015r53l954j7698J4120J9663j0921M793K2353
9931A17886n655J6693j2249J6502P365J1001K0499J67j9807q098K5580J5966j6119
9918A69731M78M7881K5639J7086m327M0058O4153J00051P1409N9647J64575K13255
9906I69636K09684K36900K11265J36189P755j25728j87457j92873j91938j75763
9896H97670j46958j20933n1558p2279m4383j6156k2031k450k3960n0642o4348
9885B81972j4487O140o466m2766k9879O970J7292k5998n1794k1453K3156j14j6388
$$ y = [94398, 51967, 55358, 73211, 57544, 51303, 70589, 86826, 82874, 90078, 95191, 94166, 82369, 59820, 59008, 55328, 39577, 39343, 59284, 56224, 77067, 102034, 100441, 70754, 85270, 106015, 125779, 144082, 121023, 93823, 91498, 90483, 89530, 85576, 67878, 81998, 101661, 90740, 95533, 117886, 112231, 128924, 116675, 133177, 140542, 151543, 172042, 172209, 152402, 144304, 169884, 185850, 169731, 170209, 218090, 243729, 260815, 256488, 296546, 360699, 460750, 532159, 591806, 756381, 969636, 1179320, 1416220, 1627485, 1763674, 1771429, 1645701, 1458244, 1265371, 1073433, 897670, 750712, 629779, 578221, 505942, 461559, 445403, 423372, 420922, 396962, 346320, 281972, 267485, 273625, 267159, 224393, 194514, 201484, 218776, 192778, 140984, 119531, 142687, 142573, 126185]
9872A26185q700O488j7305l571J068k13K967j5838L328j9284k9645K275j5475
9859C2280q832J0773l342q633k6771R662L6740N372Q233j6062J8929k104o98n034
9845E0513L258j0971K5972R307J6068p322l3675j6145N882K9629J3351N127R693
9832A00687k8294l3255j68J2557P192j1283J1518J9703l627l233j9090k510N933
9819E6130Q105L327l1772J0442J3981l525o753j8787Q372J7947O020q924K13k0534
9805C4242r83J8533J9534r727j0748k427J5216m478l6237j2464M210K5658O558
9792D6887J3880J1401k0661j4769q133l088j232O849p521K688L146K7499O199
9779F3145j472k8492l7906n008J8068o69j0358L524M3290K2360J322P349k3792
$$ y = [126185, 117485, 123973, 106668, 103097, 104165, 103952, 106919, 91081, 94409, 75125, 45480, 47755, 32280, 23448, 34221, 30879, 22246, -4525, 5137, 41877, 47249, 55482, 39420, 58349, 56245, 55547, 50513, 53771, 42800, 68772, 78079, 94147, 86825, 53150, 37005, 42887, 72516, 85867, 90994, 100687, 72393, 39138, 38970, 51527, 58719, 47436, 58954, 78657, 75030, 71797, 52707, 50197, 56130, 64235, 67562, 35790, 46232, 60213, 56688, 49935, 31148, 39520, 57467, 63487, 54563, 54776, 34242, 33259, 51792, 71326, 61599, 50851, 48424, 63640, 59162, 22925, 10461, 14671, 40329, 46887, 60767, 72168, 51507, 36738, 28605, 25517, 24285, 31134, 23613, 26301, 29447, 56946, 63145, 61673, 33181, -4725, -9733, 8335, 7666, -2692, 832, 44122, 66482, 67804, 75153, 51361]
9766E1361q786n806j530P778j3875j800k8477j0638K8508n21K5386j1168j8768
9753A1664O101r309J0016K6622J0724j8723J4008J0088j037J1366J269k8186l259
9740D1344k9185m306L7577j7294M938j6901J7892n486m997k7236n048J4431k3646
9727a7917o147K9502K3382J8930J7073L205m300m4926k8680M579K7069J2063J3238
9714D7071o61j5706j6491J1625k3600J3717R239k210J4908O496j3590l782R050
9701C6066k4545p387J1185J3051Q422m586P737N240j4981j3614k61O282J9691
9688D2300j6373Q58p229J5249J8601r473j9853P241N250R16K6972j0728k11j8602
9674C4918n482P279j169M719K9619m115l0203N114J8N36P560L4267J585K468p541
$$ y = [51361, 42575, 36769, 35239, 43017, 29142, 27342, -1135, -11773, 16735, 16214, 41600, 30432, 11664, 17765, 8456, 18472, 45094, 55818, 37095, 51103, 61191, 60154, 71520, 72789, 44603, 41344, 12159, 7853, 45430, 28136, 33074, 16173, 34065, 28579, 23582, -3654, -8702, 5729, -17917, -24064, 5438, 28820, 47750, 64823, 68028, 63728, 18802, -9878, -5299, 21770, 33833, 47071, 46410, 30704, 14213, 25838, 2238, 15955, 25194, 22984, 37892, 44388, 30798, 27016, 36066, 11521, 4134, 15319, 28370, 36792, 32206, 39943, 45183, 30202, 16588, 16327, 22609, 42300, 25927, 26785, 19556, 34805, 53406, 43933, 24080, 31321, 36571, 37487, 64459, 53731, 53520, 34918, 29436, 36715, 35546, 40265, 69884, 65769, 35566, 40680, 40698, 41234, 48794, 83061, 84646, 87114, 79573]
9659G9573j8801l91K8257L1754M2480Q0472J17153J18492Q0100K953m5488q5259
9647D31295p1877q1997o9575j1475l524j2021k4241l975o178l846q744K272O727
9634A42841k3500j1521q035k408j0722K172k1703p882J2536j6971k4174j3074
9622A7559K7179N490M399J3485l604O182l1214l028j6626k1511J0556K8208L0169
9609F7244L4746l330m2508j5775j2128k9116o271K5954p45k3209j6284j9806j1396
9596e2624L2001K7017o57j2522j7120K646P987J4178K3735K9591l187j5738K135
9583C7442K1540j2176J7285J2808k689l0580j8387N178Q63m163Q94K6031j4906
9570C9140L840k861p853k78J2240m993p245p2Q065r259k2896O904q734J699K067
$$ y = [79573, 60772, 60381, 88638, 120392, 162872, 243344, 360497, 478989, 559089, 562042, 516554, 431295, 359418, 277421, 207846, 196371, 192847, 180826, 156585, 152610, 146432, 142586, 133842, 136114, 142841, 119341, 107820, 99785, 97377, 86655, 88827, 67124, 59242, 71778, 54807, 30633, 17559, 44738, 50228, 54627, 68112, 64508, 70690, 39476, 36448, 19822, -1689, 8867, 37075, 67244, 101990, 98660, 56152, 40377, 28249, -867, -7138, 18816, 18071, -5138, -21422, -41228, -52624, -20623, 6394, 5737, -6785, -23905, -21259, -13272, 906, 24641, 54232, 51045, 35307, 37442, 58982, 46806, 64091, 76899, 74210, 43630, 25243, 30421, 31284, 27121, 28015, 54046, 39140, 42980, 40119, 32266, 31988, 44228, 39235, 31990, 31918, 39983, 30724, 7828, 14732, 5998, 7697, 9764]
9555I764O18q484k527n079q650J0009k1694k1311L9791J4627o866Q42l624j1062
9541a3646J3542K7988K5012R631j4007j2969j9882K1246J0611K629R036L38m4273
9528A5256j5177K0302M926J6544J4345o978j5104q620Q253k4029J3117J9831Q015
9515E0681l048m440o891k1622r213N219M697k1098m938K6922J2406j3332K8032
9502D3375J2899k107l1718q959q149J8777J9941r771P6q069l088m203M460J6777
9488D0241l0005j2861L0978K0655n354j9699P508o801k434J3830K2889j6648J0700
9475E2999M309k3714k3490r852J531M464Q018J8497K0820R406j3691p196j0912
9462C1189k0858K493l314M832K067m627j0668J0355J4474J4816j3362n19k8649
$$ y = [9764, 10382, 1898, -629, -5708, -14358, -4349, -26043, -47354, -7563, 7064, 198, 1040, -2584, -13646, -104, 27884, 52896, 62527, 48520, 35551, 15669, 36915, 47526, 50155, 59191, 59529, 15256, 79, 20381, 25307, 41851, 56196, 49218, 34114, 25494, 33747, 9718, 22835, 42666, 50681, 47633, 43193, 36302, 14680, 5467, 10686, 15383, -5715, -10653, 16269, 28675, 15343, 43375, 56274, 54167, 22449, 13490, 5341, 24118, 44059, 34288, 34364, 26295, 23207, 19004, 23464, 40241, 10236, -2625, 28353, 49008, 43654, 23955, 31463, 24662, 22228, 36058, 58947, 42299, 52999, 57308, 33594, 10104, 252, 1783, 6247, 14265, 32762, 53582, 62988, 49297, 42101, 31189, 10331, 12824, 9510, 14342, 16409, 11782, 1114, 11469, 25943, 40759, 27397, 26878, -1771]
9449a771j5419j4854Q38J4821J4320L1470n577o545J5980q917L6492L0890j9271
9436G2457o6754J513J3356M757n172J7851l1630k7067K1263K2925J6946r708j9175
9423A1562J7865L1885J0233j2795j0244k3812j1766J0437j1334r758o809Q518
9411C982j9136k2448K0702J5054L3868K6262L523m399J3r775j4969J2979m389
9398D1267k9278J3776P744N607J883n050q281l965p390J1849j561R535j2449j147
9384B2540N350n841j1027p57K6687J2742m801p65k0244l260j3566q049K2458k271
9370A9196J0532J7364L9624R085N701j2651k9541k1819P054p240J676J8057q967
9357D8071j3774n417k6025j0335l068K9524J5118j2130j9482R47M226K0931J1962
$$ y = [-1771, -17190, -32044, -31206, -16385, -2065, 29405, 23828, 17283, 33263, 24346, 60838, 91728, 72457, 5703, 7216, 20572, 25329, 20157, 38008, 6378, -20689, 574, 23499, 40445, 30737, 11562, 29427, 61312, 71545, 58750, 48506, 24694, 12928, 23365, 12031, 2273, -4536, 3982, -15154, -37602, -16900, -1846, 32022, 58284, 61807, 57408, 57421, 47646, 32677, 45656, 41267, 11989, 25765, 33509, 39116, 40999, 35949, 27668, 23703, 16313, 28162, 26601, 36136, 23687, 22540, 27890, 22049, 11022, 10265, 36952, 49694, 44893, 44128, 23884, 20624, 7058, -991, 21467, 19196, 29728, 47092, 86716, 95801, 101502, 88851, 59310, 37491, 44545, 37305, 38981, 57038, 48071, 34297, 28880, 2855, -7480, -10548, 18976, 34094, 21964, 2482, 3429, 7655, 28586, 40548]
9344D0548m713j0208J5392j2958k6771l559L6554J6455K0299k7654l6692j3041
9332f348R669o76r885p999J1048N493J0751N682J1113J3996K556k2416o250J8702
9318C5436R971K2981R386k6089k0694L400L421r262j4770J7076M630N822q781
9305C2527J213j0546k5146k1980o740R831J1828J8161R714j184k6045J086J3908
9292F627O358O513R942k4813j8584J3397M042J484J7845j9316k0891J0665J0902
9279D171K0437r865j8987j4788J0684N648j2164j2506M011n837K3522O713L0260
9266C1299J4165j5851m211P00J0538n681l47j5234P036J4832j1125k5690p71K4370
9252B4030j7243k7577q795K8552O748k169J0749L164j4705n548r036J5623J8585
$$ y = [40548, 35835, 25627, 41019, 28061, 1290, -2269, 34285, 50740, 71039, 43385, 6693, -6348, 3321, 2645, -7240, -15239, -4191, 1302, 12053, 17735, 28848, 42844, 45400, 22984, 16734, 35436, 45407, 68388, 77774, 51685, 30991, 34391, 37812, 28550, 13780, 30856, 35486, 41308, 32527, 33740, 23194, -1952, -23932, -30672, -20841, -9013, 9148, 18862, 17678, -8367, -7281, 6627, 12985, 19498, 29440, 4627, -13957, -560, 3482, 4966, 22811, 3495, -17396, -6731, 4171, 24608, 14743, -4244, -19032, -8348, -2700, -14864, -27370, -23359, -29196, -5674, 1039, 31299, 45464, 29613, 25402, 26102, 36640, 30959, 30612, 15378, 22414, 37246, 26121, 431, -340, 24030, 6787, -20790, -29585, -1033, 5715, 3546, 14295, 17459, 2754, -2794, -11830, 3793, 22378]
9239B2378p363K911j2232L36K2544K3652J509l257K205l4699R19O964j4794J3463
9225B4536J5807N520j5177k2516l167R285j593k2255j9577o264N0811l501j6063
9212d154P002Q433P346M055j8476p541M255P570k488j2001j5320j3631j189K0463
9198a5676m611R136n375m877J2338J2274J4080L5345O307l0523k4096l190J3665
9185A4797j299j6368L059Q705R494J1252K6233j0013j6184j6231k082j025j6678
9172f340O730J7363J7117J2758k7528k2869K1430q902j6378J3322K2869J9207
9160D8779j1423J600m429N801J7091L74o985q388P668j305J608n998o569k3254
9146A4570r518j2050Q558j9061J1184K390N969L1744L715j8850L526j6799j2938
$$ y = [22378, 15015, 17926, 5694, 6030, 28574, 52226, 53735, 50478, 52683, 17984, 18903, 25867, 11073, 24536, 40343, 45863, 30686, 8170, 5003, 14288, 12695, -9560, -29137, -35401, 15410, 11909, -4154, 2848, 11281, 18627, 22682, 4206, -3335, 920, 8490, 6002, -5999, -21319, -34950, -36139, -15676, -20287, -11151, -16526, -21403, -9065, 3209, 17289, 52634, 58941, 28418, 4322, 1132, 14797, 13498, -2870, 189, 8894, 18388, 29640, 55873, 45860, 29676, 13445, 11363, 10338, -6340, 390, 17753, 34870, 47628, 20100, -2769, 18661, 9759, -6619, 6703, 29572, 48779, 37356, 38956, 34527, 40328, 57419, 57793, 50808, 42420, 50088, 48783, 50391, 44393, 37824, 14570, 5052, -6998, 1560, -17501, -6317, -3927, 2042, 33786, 37501, 18651, 22177, 5378, -7560]
9133g560q520n013j9933K3212J8528J6176M11M878m870j7196J8093M681k0050
9120B837J304K0734O371K129p338j4235l5691j5444J4758J3363J6045p59j8133
9107a4059l3740N446M7601L4012J032n364L501p107J4327k763k5351j0770J3943
9094B0708P140J0896q275j6712o813J5235q581l1321K4190L029M132l663j8905
9081h940Q246J0502j6829R123k729M151n70Q856L5885j5731j6441J0640J3615
9068C9778p458R553j865o966j5810j7517k5500J8684J1964j0433l7217k0483j2527
9055g5797j0313O501K7784L0369K942J9676k5959j1221O51K6904N741K651j8415
9042a8486J5286O448K36R095O022Q268j8369q82L0666q688j2995k2615j3351R565
$$ y = [-7560, -16080, -21093, -41026, -17814, 714, 16890, 17301, 22179, 17309, 113, 18206, 22887, 2837, 4141, 24875, 31246, 33375, 26037, 11802, -23889, -39333, -24575, -11212, 4833, 4074, -14059, -47799, -42353, 5248, 39260, 40292, 34928, 38429, 31322, 45649, 42886, 17535, 6765, 20708, 27848, 38744, 30469, 13757, 6944, 22179, 13598, -17723, 6467, 9496, 13628, 9965, -8940, -694, 9808, -7021, 2102, -627, 3524, 2954, 11810, 47695, 31964, 15523, 26163, 39778, 32320, 41873, 40008, 33042, 17232, -285, -25785, -7101, 4863, -5570, -42787, -63270, -75797, -86110, -79609, -51825, -21456, -18514, 1162, -24797, -36018, -35367, -8463, -2722, -71, -18486, -3200, 3248, 3484, 12579, 18601, 26869, 8500, 7618, 38284, 29596, 16601, -6014, -19365, -9800]
9028i800J1309K0340q457k9020j2511J6874qK135k526Q241L3901L1992j2911m4335
9014E224n097K3281L288R948N790j6520m2761O603l174K1052r775L685J6511l9656
9000b1601J0846K6056L2925J6339m381j8733k7016n133K2751K392j3869n732O186
8987B1030K0036J5164L168p108j2327k5016o216j1231J1491j2763j3803k075j620
8974b1270K2946K8490J8326j6105j3687o746k748j3098L7577R410j5400k3096
8962D599j4104m027J63K98J1777j5033J9764K1155J1445q603M689n844j5618j5941
8948e280P689j9583j9071O973j866j4008J0457P459K6355j2070j371k2840J0490
8935b6666K5879J280m546J7282K520J0900j642N533r46k707o495l0429k1637o298
$$ y = [-9800, 1509, 21849, 13392, -15628, -28139, -11265, -11273, -9138, -11664, -3423, 30478, 62470, 49559, 5224, 127, 23408, 26696, 36644, 42434, 25914, -16847, -10244, -13418, 7634, -2141, 1544, 18055, -21601, -10755, 15301, 48226, 64565, 60184, 41451, 14435, 9302, 32053, 34445, 20576, 14844, 21030, 41066, 56230, 59398, 52290, 39963, 14947, 8731, -2500, 8991, -3772, -17575, -19650, -21270, 1676, 30166, 48492, 32387, 18700, 11954, 9206, -3892, 33685, 43095, 27695, 4599, -9505, -13532, -13369, -13071, -1294, -16327, 3437, 24592, 36037, 27434, 32123, 26279, 10661, -5280, 2409, -17174, -36245, -29272, -31138, -45146, -34689, -27230, -875, -12945, -14316, -37156, -26666, -787, 493, -4053, 13229, 15749, 26649, 25007, 30540, 29594, 26887, 20392, -10037, -31674, -37972]
8921c7972J5862L9070K0903m391j6587l169j71N524k8931O893L3975N153j8363
8908A7796k652r612K1582q895k2685p552J220n592J6975l264k4335P230J8241
8895a543R40j4366K7214q335J2435N26O855j4742m662M736Q093O589m538l8266
8881a9064J2231L3048N063j6263j5388J223L3323L939k3035n242L0332O424p249
8868C9342o738L494P12j947Q839r952k1788M500K5242J3489j9696k2199j18J0386
8854B3566K696m014J8377K2453j1166k8770K765p137o923L498j2033J2686J4537
8841C0535k4622O714l0206p127K5219R499p963k3090K0821J149J3145L989l331
8828A4732m4087J3335K0443k9730k0299O472L777K1868N2281L5561k8665m1227
$$ y = [-37972, -22110, 16960, 37863, 33472, 16885, 13716, 13545, 19069, -9862, -2969, 31006, 36159, 17796, 15144, 5532, 27114, 18219, -4466, -12018, -10798, -16390, 585, -2679, -27014, -19784, -1543, -603, -14969, 12245, 3910, 16345, 16871, 23726, 8984, 4322, 9058, 17151, 23740, 19202, -19064, -6833, 26215, 31278, 15015, -373, 850, 34173, 38112, 15077, 9835, 40167, 46591, 39342, 32604, 36098, 36810, 34863, 43702, 33750, 11962, 16462, 41704, 55193, 35497, 13298, 13180, 23566, 26262, 22248, 40625, 63078, 51912, 23142, 25907, 18770, 11847, 15345, 3312, 15998, 30535, 5913, 12627, -17579, -24706, 513, 10012, 2049, -21041, -220, 929, 14074, 18063, 14732, -29355, -16020, 4423, -25307, -45606, -39134, -35357, -13489, 38792, 74353, 45688, 4461]
8816D461l476K6726k1124o112J4822J2087p728k5438n017p1K0636J4816m340J6062
8802C6304N868j5665o801J2214L340k0154j3160j306J1173k7794j4333O58K3439
8789f217q281K0045J1136R088j92j8289k4625k0038l032J2650j9242N349J4385
8776b7263J4224j016K836J314Q613O78J8920J3381j1769K914K5233Q03j8974j9573
8762A0321k112k2834J9398K7359J2986j4278M954J926J6003n805l197l654m5333
8749d266m7979R347L5854M135K2322M341k6984o581p774K8320L6974P517j3321
8736D1905l0494M598l157J3825L623l6472l30K4892J7308l082j537p870k6901
8723c692j971J1950j0657O019Q043J8445J5782R253m868j5835K453k0966m294
$$ y = [4461, 985, 27711, 6587, 475, 15297, 27384, 19656, -5782, -10799, -10870, 9766, 24582, 20242, 36304, 42172, 26507, 19706, 31920, 35260, 15106, 1946, 640, 11813, -15981, -30314, -29656, -6217, -14498, 5547, 16683, 25771, 25579, 7290, -17335, -37373, -40405, -27755, -46997, -41648, -27263, -13039, -14055, -11219, -9905, -1292, -614, 18306, 31687, 19918, 22832, 48065, 48868, 29894, 10321, 8209, -14625, 4773, 32132, 45118, 30840, 35794, 37720, 53723, 47918, 44721, 41067, -4266, -52245, -42898, -7044, -2909, 19413, 23754, -3230, -9811, -17585, 10735, 47709, 55226, 41905, 11411, 16009, 12852, 26677, 30300, -6172, -6502, 18390, 35698, 32616, 31079, 23209, -3692, -5663, 6287, -4370, 1649, 9692, 28137, 43919, 53172, 48304, 32469, 34922, 13956, 9662]
8710I662L0246m783j0932q948K3543K6619j0359o887m83P118j6419k1592j0248
8697F537m007J4117R712m524Q680J5396k1645M881K9235J948j4761k4086r654
8684A1829J08K0376J5950j4280q547M550L532R802J4041M043m881p972N124J5408
8670F9083j3670k595r549j2930k7488P402J4284J0701J4999p631N840L4267m406
8657G8307k7330j1013N665K6767p518j7479Q43L719n976j386J0311L2368J3297
8644A00575k8901k5803j46J0056K4929P520J6754R482k1908l7042n783J3327j1558
8631E1502j7146j1121j5692R157J7802J8983j519p297K3854J276j5971k5077p545
8618B1206K0366J5346m4388j807o96j9293n179K7584n863o633J9876P040L2028
$$ y = [9662, 39908, 35125, 24193, 15245, 38788, 65407, 55048, 48161, 47678, 54796, 38377, 16785, 6537, 2530, 16647, 26359, 21835, 30515, 45911, 24266, 29147, 58382, 60330, 45569, 21483, 11829, 11937, 32313, 48263, 33983, 25436, 29986, 33518, 43320, 57361, 61404, 56523, 48551, 53675, 69083, 55413, 52818, 43269, 30339, 2851, 10253, 24537, 35238, 50237, 42606, 48446, 82713, 78307, 50977, 39964, 45629, 72396, 64878, 47399, 48242, 51961, 45985, 44599, 54910, 87278, 100575, 71674, 45871, 45725, 55781, 80710, 88230, 104984, 114466, 92558, 55516, 49733, 63060, 51502, 34356, 23235, 7543, 16700, 34502, 53485, 51966, 44669, 68523, 69799, 53828, 28751, 21206, 41572, 56918, 12530, 10723, 10027, -9266, -14445, 13139, 7276, 643, 20519, 27559, 59587]
8605E9587p547j8759q051P107O457N839l023j9292K1651K3239k1474l7998l9M1630
8591D9327K6867p131j9335r796J0032J7313M406k3437j2251j1582J3299L5436
8579G3148j3857R750J4386J6053L59p641K1110N253J3632J0083J6397k0509o655
8566A31509K1057q572o552J8893L5257J6669L764j3756k9606n3990r532J3238
8554A18379M660L0400j7929k8009L568j2856l2307k4492L610K9889j3893j3142
8542D7878P468O276j3464k2821k536j802P245q61k253j7798J4653Q04k0521J3057
8528A5325K2335J3453j2951m709r86J12l3283J1855K5379j80k6053j7006J3041
8515F332J9090l0095J452Q753l0126P19J6551J6963l825l9239j297N993K1957
$$ y = [59587, 52040, 33281, 25230, 32337, 38794, 44633, 41610, 22318, 43969, 67208, 45734, 7736, 7697, 49327, 76194, 69063, 49728, 39932, 49964, 67277, 71683, 48246, 35995, 24413, 37712, 73148, 59291, 69041, 83427, 99480, 99839, 92198, 113308, 118561, 132193, 142276, 158673, 138164, 131509, 152566, 143994, 137442, 156335, 191592, 208261, 212025, 198269, 168663, 114673, 105141, 118379, 123039, 153439, 135510, 107501, 111069, 98213, 65906, 41414, 45024, 74913, 61020, 47878, 55346, 61622, 48158, 25337, 22801, 20999, 28244, 27383, 25130, 7332, 21985, 22789, 2268, 15325, 37660, 51113, 38162, 33453, 32467, 32579, -704, 11151, 36530, 36350, 10297, -6709, 6332, 25422, -4673, -3221, 5532, -24594, -23875, -7324, 9639, 5814, -33425, -34722, -28729, -6772]
8502f772o13j0577K2563K952j7246J1789j45P372o310J0783J0771o563p710P149
8488A7443L931J3714J3333p306j3877J3582K1775P933j9940m0892j929K2483j5788
8475A4462l0947n059Q699r747Q942J4598J5811J2915K85Q420J7740k5294K389
8462C3214R783N276J3774k2090l8961j3342J7464J9361M964m730k939l307j2238
8449F229j0502K1473J8187l285j6100l6078l862K1802Q759l032k565o148J4928
8436I806P573J3000j0310j0927K2310l327J6382k670j3948j4215r217Q678J725
8423A4860N595J3637m145K9164J7300l0325p076k471o56j2056j0734j1329R822
8410A1586K6563K037Q439J2658Q84r249k4724j7503k4069k3438K9195J2095j2095
$$ y = [-6772, -7385, -17962, 4601, 7553, -9693, 2096, 1951, 9323, 3013, 13796, 24567, 18004, 10294, 17443, 21374, 35088, 48421, 41115, 27238, 40820, 62595, 70528, 50588, 9696, 7767, 30250, 14462, -16485, -21544, -12845, -22592, -13650, 948, 16759, 29674, 29959, 38379, 56119, 30825, 33214, 42997, 48273, 62047, 39957, 996, -12346, 5118, 24479, 29443, 24713, 21774, 18467, 6229, -4273, 17200, 35387, 32102, 16002, -20076, -23938, -2136, 6623, 3591, 1026, -5122, 9806, 17379, 30379, 20069, 9142, 31452, 28125, 44507, 41837, 27889, 13674, 4457, 13135, 14860, 20455, 34092, 29947, 59111, 76411, 46086, 39010, 36539, 35883, 23827, 13093, 1764, 11586, 38149, 40186, 48625, 61283, 62167, 52918, 28194, 10691, -13378, -36816, -7621, 4474, -7621]
8397g621r700N548p572q252j653K3493o485M248J6850j856O246N16n675K756j7559
8382f716j9223n674P357J1217M2108J2853n202p728J0791J768J124k1325O15j2566
8368I399k4997j8496K093M645K4925L1952j3328J0499O479j9269j9316n050J5674
8355E210p368J4978K661n892R51K39j1220j7169K541j5445J0222k3264J4627M0021
8341A1092J7239j3208k6319k1927L2668R824j5786l0811n44j520R749K1363l9129
8328d7309r053J1582q520M1875J2554L444l690k0180m472m311J0947K8n85P660
8314a0030Q83J0536M02J4342j5049j1328p058J676n464n39L279J2187J2261k1393
8300a5295l6264J206j679l123K9825M0461j0646j274j9458O522J0261m899J6541
$$ y = [-7621, -17321, -11773, -19345, -27597, -29250, -5757, -12242, -7994, 8856, 7000, 13246, 13762, 8087, 10843, -6716, -25939, -31613, -24256, -13039, 29069, 41922, 36720, 28992, 39783, 41551, 42675, 21350, 21965, 9399, -15598, -34094, -32001, -27356, -2431, 29521, 16193, 26692, 33171, 13902, -5414, -10464, 5210, -2158, 12820, 15481, 9589, 10540, 10779, -441, -17610, -15069, -30514, -20292, -43556, -28929, 11092, 28331, 15123, -11196, -33123, -455, 9369, -6417, -37228, -37772, -39292, -29543, -8180, -47309, -56362, -44780, -53300, -11425, 1129, 4573, 883, -19297, -23769, -28080, -17133, -17105, -17690, -10030, -9147, 1389, 1791, 16133, 1084, -10244, -17302, -15626, -21090, -21629, -18350, -6163, 6098, -15295, -51559, -50353, -52032, -55155, -25330, 15131, 4485, 3211, -16247, -9725, 536, -4363, 12178]
8287A2178K9069j1917j3527N918k1064j6438M423k476J0730J5977j4406j0368
8275a1901oK9525l476j2798P342N572K2101p710m364J0672L0879K084r585j6393
8261D1942k1185K5131M7892L4124K8238Q6004R2211M3849r10m3135l3070k5296
8249B75795k5471j5585l6044l2847j6919k1755j2771k543K38k9263k0523R459
8237G1771N215N627k0874q598l7160J0308J9680r795j5046p992M251K1652J4129
8224E3168K102R355J2292K677K2214J7876K1856L9574P974M5749O7344N9828L4121
8211C96130K9982J397m7060p0430m4285j9628m6410m8538k3957k5822r051j5880
8199G6448j8990j0670k1414o471R34K306J341K4862K0851k7089l3712m922K6741
$$ y = [12178, 41247, 29330, 15803, 21721, 657, -15781, -11358, -13834, -3104, 12873, -1533, -11901, -11907, 17618, 14142, 1344, 8686, 14258, 36359, 28649, 24285, 34957, 65836, 67920, 58335, 41942, 20757, 45888, 93780, 127904, 156142, 242146, 334357, 378206, 377296, 334161, 301091, 275795, 250324, 234739, 198695, 165848, 148929, 127174, 114403, 111860, 112098, 82835, 62312, 71771, 76986, 82613, 61739, 53141, 15981, 26289, 45969, 36174, 21128, 13136, 17387, 39039, 53168, 55270, 64625, 76917, 79594, 101808, 119684, 141540, 181114, 189088, 234837, 302181, 362009, 396130, 426112, 427509, 380449, 310019, 265734, 246106, 199696, 151158, 127201, 101379, 92328, 76448, 57458, 46788, 25374, 18903, 19837, 22143, 23484, 48346, 69197, 42108, 8396, 3474, 30215]
8186C0215J1810o471k2382j1604J9856J5967N318J9456j2913j465K1k4871l722
8173A9215j7114J0223J133k2562N663L948p431J7379O302k4122k080J9910M188
8160A4652l470O504k6594p329R733j846N837L22L059M155k2873p536M541L438
8146a7407J8974j258k765k39l632r953j3088o213O907J6744j1499K5415K6035
8133B8021J2544k6312J1173K742n018k4251n130k1538J4081K6568J8846q730l2496
8120i500j8113K2936M0415J851L534k9149R768L2568O857R335q915k8290J2163
8107D5460l09p363l6612k8096R971J2793J4693L588j4146K504j0228k9157p202
8094d4104K1471K8552J5077J023R170j4677m3444n217K7613K2978o464k2087k5539
$$ y = [30215, 42025, 35554, 13172, 1568, 21424, 37391, 42709, 62165, 49252, 47787, 47808, 22937, 19215, 2101, 12324, 13457, -9105, -3442, 506, -6925, 10454, 16756, -7366, -9446, 10464, 14652, 11182, 17686, -8908, -16237, -6504, -8350, -2513, -2191, 868, 5023, -17850, -25386, -20845, -17407, 1567, 309, -2456, -2695, -6327, -16280, -29368, -35581, -28674, -11930, -23429, 1986, 28021, 40565, 14253, 25426, 28168, 23150, -1101, -6231, -27769, -13688, 12880, 31726, 22996, -9500, -27613, -4677, 35738, 37589, 41123, 11974, 21742, 54310, 61167, 70502, 61587, 33297, 45460, 45151, 37788, 1176, -26920, -16949, -4156, 10537, 14125, -21, 2483, -7745, -36902, -44104, -22633, 5919, 20996, 22019, 31189, 16512, -26932, -32149, -4536, 18442, 11978, -10109, -35648]
8081c5648P794M4362l791P739J3503n253q792J983J5028K23l8593j7650M2789
8068B3694m365o07K1435J4975k4979m1449k2649n624L4321J0719K1236K3219j1477
8055C8449k4811l542j2357r104J7442J8836k760j849j431J8373j791j1033j2591
8042A1831r600j382O225J8911K788k934J0350j0332j9018q046K168J3402Q183
8029B2546J1303o852j9099J8448l19l067Q299n702q054n779P176J0703l302l860
8015B2441J6689q877j0578r718j8743j4111l14K6150L2658J5864J885k4343N784
8002C4787K3229j4725j9723j4555J3147p198N337J4446K9096J5920N132k1215
7990F3678k2043j9875q39J8505Q7J429K421l029L540K8197n884j6205j9229k3287
$$ y = [-35648, -27854, 16508, 12717, 20456, 33959, 28706, 19914, 21897, 36925, 37148, -1445, -19095, 23694, 19329, 18722, 40157, 55132, 30153, -11296, -33945, -39569, -5248, 5471, 26707, 49926, 38449, 13638, 10096, -2261, -11365, 6077, 24913, 22153, 20304, 18873, 37246, 35455, 24422, 11831, 2231, 849, 7074, 25985, 28773, 25839, 36189, 25857, 6839, -1207, 961, 14363, 22546, 33849, 26997, 7898, 26346, 26027, 22960, 31259, 25557, 17503, 11724, 18900, 29603, 26301, 22441, 39130, 30253, 19675, 9957, -8786, -22897, -23211, 2939, 35597, 51461, 53346, 29003, 34787, 58016, 43291, 23568, 9013, 22160, 14962, 20299, 34745, 63841, 79761, 84893, 63678, 41635, 21760, 20921, 39426, 39513, 40942, 43363, 40334, 43874, 72071, 66187, 49982, 30753, 7466]
7976G466K020R335j3745J795K7134J5980n420p206o124J1251J7379j1636l0856
7963A7373q907J5509J2155o393P609J8000j1985k2293l469K643j5995J1676J447
7950A7370N725K083j3031j2388j4144J2007K8096J41P49j908K844m422k4824l846
7936e548L323j0729J3228M132j6292l779M61J1751N639l746k5603J4959M312R151
7922A259l88j1711j1718q4J9529K5672j0732k904J3904k9006l1007R108L956j1043
7908c5165J4043J975M817m335q7K4507M557j1964Q587o153q12P254J1164k6098
7894g710o825p538l668J2537L0684j788q597p229J481N762L04k6611j3056K3706
7880h548k868l482m882O460K0356N738J7124j308N070j1619L755o748M795j0871
$$ y = [7466, 9486, 18821, 5076, 6871, 34005, 49985, 44565, 37359, 31235, 42486, 59865, 48229, 17373, 8466, 23975, 36130, 29737, 37346, 55346, 43361, 21068, 17599, 20242, 4247, 15923, 17370, 23095, 25178, 12147, -241, -14385, -2378, 25718, 25859, 26608, 24700, 27544, 23122, -1702, -5548, -2225, -12954, 274, 4406, -11886, -15665, -15204, -3453, 2186, -1560, -27163, -12204, -7892, 1259, 871, -10840, -22558, -22642, -3113, 22559, 11827, 8923, 22827, -6179, -37186, -28078, -24122, -35165, -21122, -19147, -14330, -18665, -18752, 5755, 10312, -1652, 6935, 782, -30, 7224, 18388, -7710, -14535, -22073, -25741, -13204, 17480, 15692, 7095, -134, 1347, 7109, 7413, -19198, -32254, -8548, -11416, -14898, -19780, -13320, 7036, 12774, 29898, 28590, 33660, 22041, 25796, 19048, 23843, 12972]
7866A2972k256p685j0016j8213j511J7786O737J2439J8131l895n460j9855j4728
7853a5554L1089O531m799L180p745J1541k4062k5452r554K429K1670k267J5034
7840B041M736o120k6450R449o341k9738J9711P483j30k1702n4090k1988L5933
7827h7206O5226K7571k876r190l0261J7153P568r726k0964J3902J5667j189k6152
7814d0477p153P544J4027O073j9423j1810K8443n611O342M935N966K9655k1207
7801b696M081P161k439J5165J6273k1020k3248j7156K8169R139j5491k1804o506
7788c0372P331k992J0727P893j9736q049P680m790L1600K8561o022j2463R505
7775A8873l404P610k9709o583n579J488L266M447K8637J520l3646l7304m612J7728
$$ y = [12972, 10716, 3031, -6985, -25198, -26709, -8923, -2186, 10253, 28384, 24489, 19029, -826, -15554, 15535, 22066, 17267, 20447, 12702, 24243, 181, -25271, -34825, -32396, -10726, -12993, 2041, 6777, 657, -25793, -16344, -22685, -52423, -32712, -25229, -25359, -47061, -101151, -123139, -87206, -21980, 5591, 2715, -6475, -36736, -19583, -12015, -21741, -42705, -28803, -13136, -14325, -40477, -47630, -40086, -26059, -19986, -39409, -51219, -22776, -28387, -22045, -17110, -11144, 18511, -2696, 1385, 8546, 6107, 21272, 37545, 16525, -6723, -23879, 4290, 13429, -2062, -23866, -30372, -23041, -26033, -15306, -7413, -27149, -35198, -27518, -32308, -708, 27853, 21831, 9368, 18873, 15469, 23079, -6630, -13213, -18792, -17304, -14038, -9591, 19046, 20566, -13080, -50384, -54996, -37268]
7761c7268J0558R250j808l895O841K5099m13l0102m0386k0484L441M680K8987
7748d5500J2582j4113J1120J6190Q810m25j286j589Q848J3916j911r348K557j5440
7734a5589Q951J1939j1281k9169L0342K6934J0837j1323o511J5167j68j8336j505
7721A0288Q718J599J0220l838j555j9297Q172K0603l889p416k3434k497l605n341
7707a1272J8929K1975J7118Q082j4708l8719j6222q115K5435p392k2737k590k1368
7694e1584L0151L6067j2641l5915l0866K8763P024j8535j2856K6525K0170J7561
7682C864k3515k537J1216r491p346J8850m034N219q482r330Q550K2322J8277K153
7668B5716m0667k9690J539j348L440L4900L0104j2146j0677j8880n735R492j9672
$$ y = [-37268, -26710, -17460, -19268, -23163, -16322, 8777, 8364, -21738, -62124, -82608, -79167, -74487, -45500, -32918, -47031, -35911, -19721, -10911, -11336, -12622, -14211, -5363, 8553, 6642, -2706, -149, -15589, -6638, 5301, -5980, -35149, -4807, 22127, 32964, 21641, 15130, 30297, 30129, 11793, 10288, 19006, 20605, 30825, 26987, 25432, 6135, 14307, 34910, 31021, 23605, 171, -2326, -5931, -11272, 7657, 29632, 46750, 54832, 40124, 1405, -14817, -22932, 2503, -4889, -27626, -30216, -51584, -21433, 14634, 1993, -33922, -64788, -36025, -29001, -47536, -60392, -33867, -13697, 3864, -19651, -22188, -10972, -20463, -27809, -8959, -12993, -7774, -16256, -25586, -17036, 5286, 23563, 25716, -14951, -44641, -43102, -44450, -41010, -6110, 23994, 11848, 1171, -17709, -23444, -13952, -33624]
7655c3624k620K2590O230K156O584l876P877j8305q899N666j524K4578J823j5881
7641g225J1698p651k7228J1185j611m732j916P845K2044J8349J9371N664j3250
7628C2543k025P706Q94k9227j0646j5211j67J3829J2631K3683J5379j247j4444
7615C3698j9330j8822J6151J1891l1020N63K1254j5326K99n952j7448k780j3661
7602d0483k633K0880K8653j668k1122j1533J9135P636j4807K051J5988p828J1079
7589E348J3028j5241n878l75l129j1940J5382N79O324K6254j5814l0331J6036
7576B43J229Q60Q89M913k5354q968L7310J0123l7786j6344J6042K1555J3929o930
7562A1711j8651P466j3832j7421q959J700j1797n961j802K0321K8396K2897k0045
$$ y = [-33624, -36244, -13654, -7424, -5268, 1316, -2560, 5317, -12988, -21887, -16221, -17745, 6833, 8656, -7225, 4473, -3178, -30406, -19221, -20832, -25564, -27480, -19635, 2409, 20758, 40129, 45793, 32543, 30518, 38224, 39118, 9891, -755, -15966, -16133, -2304, 10327, 34010, 49389, 48142, 33698, 14368, -4454, 11697, 23588, -7432, -6869, 14385, -941, -642, -6594, -24042, -26822, -40483, -43116, -22236, 6417, 4749, -16373, -27906, -8771, -1135, -15942, -13891, 2097, -5731, 5348, 18376, 3135, -2743, -3118, -6247, -18187, -2805, -2226, 4098, 30352, 14538, -15793, 243, 1472, 2332, 3221, 8134, -17220, -26188, 11122, 21245, -16541, -32885, -16843, 4712, 18641, 11711, -6940, 526, -13306, -30727, -39686, -37986, -49783, -55744, -57546, -37225, -8829, 14068, -5977]
7549e977m7612r399n475J0399J3694K2908K1447R626p383j0150j4901r616j7346
7536d9785J24O813L9764K94j4840m821p30J2453n273l0722O044J992J6891P797
7522a3999J2578K0352j539l830K602R568j0702R882q542k194P243l533Q123j1783
7508A4226l519J2153k5605k9605J1000K8718q321N416m482o31P509j1269j8558
7495b2968K0351J6183p326J4596P45j1384r403k3383j2526J6573M743j3264L593
7482b3470L073k026J9881K0478j0632k9572k503J621M880L418j1902J4215K2587
7469A0048j1989j4538n311K4694l678J3727P333j3383K876K622j0402k9065j6726
7456d3792K121r366J7552J4455O517l5825J5824L31j8435L8461J6245k362N482
$$ y = [-5977, -53589, -62988, -68463, -58064, -44370, -21462, -15, 9611, 2228, -7922, -22823, -32439, -49785, -49661, -42848, -3084, -2790, -17630, -22451, -23181, -10728, -16001, -46723, -40679, -38687, -21796, -13999, -1421, 18931, 17392, 13562, 16164, 25732, 15030, 24912, 16370, 14176, 21419, 17886, 26009, 14226, 10707, 22860, -2745, -32350, -21350, 7368, -953, 4463, -19, -650, 6859, -4410, -22968, -2617, 13566, 6240, 20836, 21581, 10197, 794, -22589, -35115, -18542, -13799, -27063, -23470, -20397, -22423, -2542, 17936, 7304, -22268, -24771, -23150, -18270, -14852, -26754, -12539, 10048, -1941, -16479, -21790, 2904, -774, 12953, 20286, 6903, 9779, 12401, 1999, -27066, -43792, -41671, -51037, -33485, -19030, -12513, -48338, -32514, -32183, -50618, -12157, 4088, 1726, 7208]
7443G208M303n163k639l783Q846j547k1608J9996K671k7295l2678j0861J5945
7430d6605P291j6703K0678N089O741K2207N003k8732M826J2835j1289k6638k1133
7417f6430J3022J1484J2878P739k3997N447K4137K2434O714k2844k57k7493K530
7404c4636K4345J4550L66r90j2170m1459j0261K0513J0007R007L136L185K5024
7391A0617P77k1125j414J0958J5222j3863q603k9852J451J5436M6438K6122j8608
7378C3556k2683J285N217M51J1436J0532k7406k2089j330l1979m328J3044o030
7365d0324j2375m651J7376J6773P423n199m880m911q18J3065Q862J580J3512l816
7351A617k8755n091P304k033N482r737j3560L4695R126N934P5O575K4620j2488
$$ y = [7208, 11511, 6348, 3709, -74, 8772, 7225, -14383, 5613, 8284, -19011, -51689, -62550, -46605, -39314, -56017, -35339, -30250, -23509, -1302, 3701, -25031, -20205, -7370, -18659, -45297, -66430, -53408, -41924, -29046, -21307, -45304, -39857, -15720, 6714, 13428, -9416, -9673, -37166, -34636, -10291, 4259, 4625, 3635, -8535, -49994, -60255, -39742, -29735, -20728, -17592, -14407, 10617, 11394, -9731, -11145, -187, 15035, 1172, -7431, -37283, -35832, -20396, 26042, 52164, 33556, 10873, 12158, 17375, 17826, 29262, 39794, 12388, -9701, -11031, -43010, -47338, -34294, -40324, -52699, -57350, -39974, -23201, -15778, -20977, -25857, -30768, -31586, -18521, -9659, -8079, 5433, 1617, -27138, -32229, -24925, -26958, -21476, -31213, -44773, -10078, -952, 4982, 5057, 11632, 36252, 23764]
7337B3764k5649k6808j1034K428L7179J1856K9776P42j6316k1523k4585K4320
7325D150J0275j2076J1404j9139o522q198k58J9472J3706o037K284O087k0165
7312e017j3852Q787J4375N3K2837l141k5701Q59l239L730N933q524R633J2129
7298A8862K4605j870k6178j6667L103K4887j5116K05r977K7847o69j1316j1440
7285F276k0282j6934K523J3502N369n919K2085J8849j9171l48K570k1505q69o760
7271b0614J4581k992J2279K06k120J0286j4696l1603J93J7246J4102J4427j448
7258I847K730m323J60Q554j1434k863k2709l857K587j666O784N195j038J4173
7244B140J4468j5770J9815J4172o158L345J7515J2891o035l6730J4668Q875k951
$$ y = [23764, -1885, -28693, -39727, -37299, -120, 11736, 41512, 42254, 25938, 4415, -20170, 4150, 14425, 2349, 13753, -5386, -11908, -20106, -20364, -892, 12814, 6777, 9061, 15148, -5017, -18869, -10082, 4293, 4346, 27183, 24042, -1659, -800, -4039, -309, 5624, -2900, 6733, 18862, 43467, 41597, 15419, -1248, 1855, 26742, 11626, 11831, 1854, 29701, 29032, 17716, 6276, -14006, -30940, -28417, -14915, -9546, -15465, 6620, 25469, 6298, 5950, 8520, -12985, -13854, -20614, -6033, -9025, 3254, 3460, 1340, 11626, -3070, -34673, -34480, -17234, -3132, 11295, 9847, 12577, 8254, 8414, 16968, 5534, 2671, -20038, -23895, -21308, -22974, -16190, -10995, -12033, 2140, 16608, 838, 20653, 34825, 28667, 32012, 49527, 62418, 56383, 19653, 34321, 43196, 40245]
7231D0245j6187o303k3532j0821K2360O576j7739l5205n279j0766Q868M2037K0959
7218A5213q653j2693j4163J1588M0543J2229j6766k7287K8746j2215j10M715j7449
7205C698K229l1688j4998J4798J4600J0681L048j6722o822P577m101K3638M6118
7192E2056J8383k7117L146m491l0742l4866k2449R893L3871L1002J2742o464o63
7179C4301q264k7042j4154k0475K2811J2748K8563l449j2694k4198l686R746J490
7166d303k1500p437O872L186j4446K4424J7990o805p560l323q470K739j7285K043
7152c3875J5831K100J2681k2287L693J49r811q158L529R224J038K2145J6071o708
7138E622K0439p773M285J5351k8150q775K6559l37N023r671j459k3568o704j2056
$$ y = [40245, 24058, 17755, -5777, -16598, 5762, 12338, -5401, -40606, -45885, -56651, -47783, -5746, 15213, 6560, -6133, -20296, -8708, 31835, 44064, 27298, 11, 28757, 16542, 16432, 21147, 3698, 5927, -25761, -40759, -25961, -11361, -680, 2368, -14354, -21176, -13599, -17700, 5938, 52056, 70439, 43322, 46468, 41977, 11235, -23631, -46080, -36187, -2316, 28686, 41428, 34964, 34301, 26037, -1005, -15159, -35634, -12823, -75, 28488, 25039, 12345, -11853, -15539, -5793, -4303, -25803, -33240, -26368, -23182, -37628, -13204, 4786, -2019, -9579, -12902, -21372, -18633, -35918, -33875, -18044, -15944, -3263, -25550, -21857, -21708, -31519, -39677, -36148, -26924, -25886, -3741, 12330, 5622, 26061, 18288, 22573, 37924, 9774, 999, 27558, 27221, 32244, 22573, 21114, -2454, -9158, -21214]
7124b1214K3593l603m6100J1110K2521K5516O761l64J986K090j7295r815M527
7111b87m021p975j1308Q01j515J6435N76j1983P36j5954j0300j3616n02K0596
7097c8317K5085k088N742M096j0663j3844N553J5345n863j1269l556K1050P62
7084g967k5405j8326P637L8361J6511q862o320R980K9909p582l3343j0551n270
7071b1228N230l702K6440J1675l1650j1008Q11K4407j969r424j445K440j057j4877
7057b5357r558l918J651J4481q731j5564j059J0641J8011K0416m487N212M952
7044F690L9539P399N428m906l1653j2557R348m6905M665J6984n553K8321K496
7031A9296j1294j6810j7555L917J6330k0810j155L3248J6583m462N366J3020l0386
$$ y = [-21214, 2379, -1224, -47324, -36214, -13693, 11823, 18584, 18220, 20206, 22296, 5001, -4814, -287, -4308, -12283, -23591, -22790, -24305, -7870, -7294, -19277, -18541, -34495, -44795, -58411, -58913, -38317, -13232, -15320, -9578, -5482, -16145, -29989, -24436, -9091, -14954, -26223, -29779, -8729, -7967, -33372, -51698, -44061, -5700, 10811, 1949, -4371, 5609, 35518, 27936, -5407, -15958, -21228, -15998, -19700, 6740, 18415, -13235, -24243, -23432, 975, -994, -10418, -11863, -9423, -10480, -25357, -34915, -38833, -37182, -22701, -31432, -46996, -48055, -37414, -19403, 1013, -3474, 1738, 6690, 46229, 53628, 59056, 54150, 22497, 9940, 19288, -27617, -22952, -5968, -11521, 16800, 19296, 8002, -8808, -26363, -22446, -6116, -26926, -28081, 5167, 21750, 17288, 22654, 35674, 5288]
7018E288j4720l4639r504J2660J8222K877l91m855j1965M085n920R648J7644r02
7004a2472J1611J8309K184k011N070J1686j6350o103K1651p205j8285m444J6102
6991A9743K0854k7201j6561p900o63k2658O600J9509j8947k6845P65l018J1846
6978d4476K1174M988L6886K3805k2154j3345o362m2032k0258K4759J0286o799
6966c3528P390R719J2885N567K5929m324j5563J5388k962l7775j2579K35N802
6953b3816o659N680j906L503L233K281o740k2458k546J6008J7731J8383L527Q212
6939A4433j1604J0402k631k320M835Q187O298p648l866k3764o260R743j4913j7889
6925c6997K5776J3928r959p221o082j870j318Q922K1458j0832n254L2805K040
$$ y = [5288, -9432, -44071, -53575, -40915, -22693, -19816, -20207, -25062, -37027, -32942, -38862, -29214, -11570, -12472, -861, 17448, 19632, 17621, 22691, 34377, 18027, 11924, 33575, 26370, 8085, 3641, 19743, 40597, 13396, -3165, -11065, -11728, -34386, -27786, -8277, -27224, -54069, -53304, -56322, -44476, -23302, -18314, 18572, 42377, 20223, 6878, 516, -41516, -61774, -37015, -26729, -33528, -26138, -16419, -3534, 2033, 27962, 23638, 8075, 23463, 20501, -17274, -29853, -29618, -23816, -30475, -24795, -26701, -23198, -19965, -17684, -24424, -46882, -49428, -33420, -15689, 2694, 6221, 14433, 2829, 13231, 10600, 8280, 13115, 21302, 27600, 19952, 16086, -7678, -13938, -4195, -19108, -36997, -11221, 2707, -7252, -14473, -20555, -22425, -23743, -14821, 6637, -4195, -9449, 23356, 25396]
6912B5396q294j7323j1514L2323P141j8662k1664j0650N630k8767q797J0432L8984
6899e765Q756j8955O0J2591r261J6044p255j2516j8165q368K4272N7248J274j2828
6885B7132l2995l2368j557q229j864M51J0865K1831K7673l030k6922K2339K3261
6872B6587J4105j7540j9917j7107Q521K7007m014k9466r344j7274M359J7452j1169
6859b7800j4653j303K1346p567J4133k4m822K3747J2610J795k8502j2265j986
6846b5291M15L6588K4818O375n608l2167l685J6837K8155l0569M855m040j8232
6833a549j6199J3389j233j2713K1492j4088j5228M5765K6494k2558l8036J2095
6821b369J0572o627J7634j8857J209J4585j314j700j064p86n853j4707l4197R219
$$ y = [25396, 17102, -221, -11735, 20588, 27729, 9067, -12597, -23247, -17617, -46384, -55181, -44749, -5765, 2991, -15964, -15904, -3313, -12574, 3470, -3785, -16301, -34466, -42834, -18562, 38686, 39960, 27132, -5863, -38231, -39788, -48017, -49881, -49430, -38565, -16734, 10939, 7909, -19013, 3326, 26587, 40692, 23152, 3235, -13872, -5351, 21656, 17642, -11824, -21168, -38442, -34083, -16631, -27800, -42453, -43756, -22410, -29977, -15844, -15868, -20690, 3057, 15667, 17462, -11040, -23305, -25291, -24876, 11712, 36530, 42905, 37297, 5130, 1445, 18282, 46437, 15868, 20723, 16683, -1549, -17748, -4359, -5592, -18305, 3187, -10901, -26129, 19636, 46130, 23572, -14464, -2369, 8203, 1576, 19210, 353, 1562, 16147, 14833, 13133, 12069, 11283, 5430, -9277, -43474, -34255]
6807c4255J5690Q793J6161q58J0806j3442j6757K6793M339q545l4125r053P354
6794b7099J895J3292p757l899J777N458l931J84K2858K5112r380j5297n505k809
6780e101j6358j2132J6842N85j1402J0019J9066J1270J5488Q204l1070j9270Q204
6767e655k71j5650O863k071J2660o20J2376j296j043Q027j1204J2523K8619L1
6753D3289j5768l1009q49P13j6301j2398j6709p939j2617R771L8513L4717J2288
6740B5701n815j2997J4393m504O590l5986k6946J5064P925J3578k7839N015J6780
6727i041K495N751k869J2340K8604l051j7657j9343K5898J1039l4173k0215j7035
6714c7257K7688L5488R166n125j9817j0604O210J8219r781j7153j605j2681L700
$$ y = [-34255, -18565, -9772, 6389, 5531, 16337, 2895, -13862, 12931, 17270, 8725, -25400, -34453, -27099, -25204, -11912, -19669, -23568, -21791, -16333, -20264, -20080, 2778, 27890, 18510, 3213, -2292, -5101, -21459, -33591, -16749, -16164, -27566, -17547, 1519, 12789, 28277, 36481, 5411, -13859, -5655, -5926, -21576, -14713, -16784, -4124, -4744, 7632, 6336, 5293, 13320, 2116, 14639, 43258, 43289, 27521, -3488, -4337, -3624, -19925, -32323, -49032, -56971, -69588, -59817, -21304, 13413, 25701, 19886, 6889, 21282, 16778, 23368, -12618, -39564, -24500, -16575, -2997, -30836, -25821, -9041, -6546, -795, -3664, 8676, 37280, 34229, 16572, -2771, 23127, 34166, -7, -20222, -37257, -9569, 25919, 35085, 29960, 10143, -461, 5749, 23968, 14187, -2966, -4571, -17252, -13552]
6701a3552J3445j1055r184P474J69j9462j3927J1242J7348J4921k4931P050K9615
6688I153K208J1218j2758j3611K9810k336M880J6182J447n583m167j6993p246
6675A2204J2686k814j8249j8726j0197J4738K8256j2576j2398J747j572p760q97
6662a5558M346J3418O625k7423j2695M555K5298K45k9277j0502J7409O009L561
6649a3989j3307K161R589o196K1067k3n574P556J8599p722k6526p405Q682R801
6635c287P278j0316j2089k3935Q058L3416J464j2354l416K448q812j4212O985
6622b8772L1867j1029j3167j5715J076J7925J3654J6778P774j5473l1373K0400
6610f055L5701L118J2619M539J4742j1831l7996k4080J1071O026j4250j270K5124
$$ y = [-13552, -107, -11162, -20346, -12872, -12703, -32165, -46092, -34850, -17502, -2581, -27512, -20462, 9153, 11361, 22579, 9821, -3790, 26020, 23684, 28564, 44746, 46193, 40610, 36443, 19450, 12204, 24890, 22076, 3827, -14899, -25096, -10358, 17898, 5322, -7076, -5329, -6901, -14661, -15558, -11212, 2206, 8831, -18592, -31287, -26732, -1434, -1189, -30466, -40968, -23559, -17550, -13989, -27296, -25135, -15546, -21742, -675, -698, -6272, 1284, 19883, 12161, -14365, -21770, -13088, -3287, 3991, -6325, -18414, -42349, -34291, -875, 589, -11765, -15181, -12733, -21545, -35757, -28772, 3095, -7934, -21101, -36816, -35740, -17815, -4161, 12617, 20391, 4918, -26455, -6055, 29646, 32764, 45383, 49922, 64664, 52833, 14837, -9243, 1828, 7854, -6396, -7666, 17458]
6597A7458K8934J680j9981m334m721P296L380j485k4528j6718J7723p585j7336
6584b0217J0418K3515N640n339m889J9118J8715n171j6330j4512Q707j4995j1097
6571f437j1386K1627J1214J0480K2535K2857R694P58j4309k6693q520K3478J4215
6558F9513l746N273K1619K394J1366o805k3202O467J7295J0519n575j3242J5909
6545A07785j773l752L7118J9831k1386k0543K1936o510j3797o297l6719N036J3088
6532I4017J6534o284j1299p724m0193r197l638j607R16k3941J6600J5309j5968
6519B3525K126k9405J7621j5323k603M1185K9961K2359n507r505k4621j5012R81
6506C5782N119j8779M371l448j6314j0632j3976Q955K5979o803J4190J3026R95
$$ y = [17458, 46392, 48072, 28091, 23757, 19036, 26332, 29712, 28227, 3699, -13019, 4704, -2881, -20217, -9799, 13716, 19356, 14017, 9128, 28246, 46961, 41790, 25460, 10948, 19655, 4660, -6437, -17823, 3804, 15018, 25498, 48033, 70890, 80584, 81342, 67033, 40340, 31820, 55298, 69513, 65767, 71040, 92659, 95053, 106419, 99614, 76412, 82879, 100174, 110693, 105118, 91876, 107785, 106012, 102260, 139378, 159209, 137823, 117280, 139216, 132706, 118909, 112612, 75893, 80929, 94017, 110551, 104267, 92968, 85244, 45051, 35854, 32216, 30609, 31525, 7584, 24184, 39493, 23525, 25651, -3754, 13867, -1456, -4059, 37126, 67087, 89446, 83939, 74434, 49813, 34801, 35782, 40901, 22122, 26493, 23045, 6731, -3901, -17877, -8922, 17057, 10254, 24444, 37470, 38465]
6493C8465j339p379j4013J5324J834N951O333j2403K38j8166k8123M634K8953
6480B0309L039j6663J589K4476j6623k2471N946N135P788J949R737O653j7343
6467A3521k5569n797N865K4479L0948j4733j8139L824J1830j318P473j3550k1125
6454b291k5347j6287K709K9873J2918p729N658j1011J0524K7577j3031l1668r85
6441a9090J0310J0086J1762P099k0463j0483M137J7340L505m208K884l1603m927
6428b3651P868k0619j505Q428n010j864Q759q805j0361K655J9726j5880K051K2521
6414a5687j441r282R237K6898k2148l372l738J3759M0779J2189M710j5518k4423
6401A1963j2456k8355n54K4153Q68J842p597J2867q05J1881J71j7463r767r850
$$ y = [38465, 37126, 29747, 15734, 31058, 32892, 38843, 45176, 32773, 33011, 14845, -13278, -8644, 20309, 23348, 6685, 8274, 32750, 16127, -6344, -398, 4737, 12525, 14474, 24211, 30864, 13521, -12048, -17845, -11980, 12499, 43447, 28714, 10575, 14399, 26229, 24911, 32384, 18834, -2291, -27638, -43925, -41216, -11343, 1575, -6154, -496, -11507, -983, 26594, 13563, -18105, -19090, -8780, 1306, 13068, 20167, -296, -10779, -6642, 10698, 14203, 9995, 12879, -18724, -23651, -15783, -36402, -37907, -29479, -34489, -36353, -27594, -36399, -46760, -44105, -24379, -40259, -38208, -15687, -17128, -26410, -17173, 9725, -12423, -15795, -19533, -5774, 35005, 47194, 51904, 36386, 11963, -493, -28848, -29402, -5249, -4381, -2539, -10136, 2731, 1926, 13807, 13978, -3485, -13252, -23102]
6387b3102K1806J8704J0777j8037l8257p844R582M84Q928J9004P7M271j2368n895
6373a1870K385L491m297j3347l5498r010N706J6548J4393L213J3128k039m876
6360b2073J5907q205Q967Q02L6J6824j8753J127o547j0551O432L5397j0022k6668
6346a7327J8996K7796k5371l31o00N786M211j2054j700J025j4825Q66J0327j9676
6332b2877j9740J527J3185O443Q891K2593j099j1128k2533m311J1090N525K3441
6319A1007p7k2547k134m781j900J5576j4552r067r137J8971J1220O563O607K4202
6305B9951J4324j0017J073k1359k7892J3128r784j1418j0725J0509K9607P246
6293A4643k875M251p254J4456J1187j5470j3283n544J2911o612o839L2770K5083
$$ y = [-23102, -1296, 17408, 28185, 10148, -28109, -35953, -26371, -25887, -16959, 2045, 2122, 6393, -5975, -11870, -9485, -5994, -10291, -23638, -59136, -68146, -62440, -45892, -31499, -28286, -15158, -17197, -22073, -6166, -14371, -5404, -4602, -4566, 12258, -6495, -5368, -11915, -22466, -16034, 19363, 9341, -17327, 1669, 29465, 4094, 3763, 3163, 8949, 13160, 1106, -594, 431, -14394, -13528, -3201, -22877, -42617, -41090, -27905, -21462, -12571, 10022, 8923, -2205, -24738, -29049, -17959, -12434, 11007, 10930, -11617, -13751, -18532, -20432, -4856, -19408, -28475, -37612, -18641, -7421, -858, 5749, 29951, 44275, 34258, 35331, 13972, -13920, -792, -10576, -21994, -32719, -22210, 7397, 14643, 11768, 16019, 8765, 23221, 34408, 18938, 5655, 111, 13022, 6410, -429, 32341, 57424]
6280E7424l8782k3715J1161K6353N028j5589P470j3341j4853k4401o219Q0K7013
6267b371K0128j9221k4540j6N860m161n015K7805R395R620M748O461J3319J6359
6253E8371n931j7420j7358j6975L28J977q660K053J8716R678k2366R819Q248j4070
6239F410K501l287k4794O551K3276J999n738K367l46o253n692O652j4774o269
6225a7397J525Q402K5919k470k0123m695N894J7733m222j1862j2933n855N225
6212a4859j931l713p74N924k4229N027J4508J9037L1990j5263l1261o383j0171
6199c2098L731K9268J1240k7303J2828J8192j8495k0204j3818j786p1J0606J8895
6186i015L1256J4136o069Q83Q605k85l5786j5063J3438n044m904j7340l409j0280
$$ y = [57424, 18642, -5073, 6088, 32441, 37469, 21880, 29350, 16009, 1156, -23245, -29464, -29384, -2371, 17757, -1464, -26004, -26020, -20160, -24321, -29336, -1531, 7864, 17484, 22232, 28693, 42012, 58371, 52440, 35020, 17662, 687, 1015, 2992, -5668, -3615, 15101, 24779, 2413, 12232, 20480, 6410, 8911, 5624, -19170, -12619, 10657, 12656, 6918, 9285, 8939, 2686, -3006, 3646, -11128, -17397, -15872, -7470, 18449, 15979, -4144, -8839, -2945, 14788, 10566, -1296, -14229, -20084, -14859, -16790, -20503, -21277, -15353, -39582, -34555, -20047, -1010, 30980, 15717, -15544, -21927, -32098, -28367, 901, 12141, -15162, -2334, 15858, -2637, -22841, -36659, -38445, -38516, -27910, -9015, 22241, 36377, 30308, 31191, 39796, 39511, 3725, -11338, 2100, -2944, -7848, -25188, -28597, -38877]
6172c8877k590P515K837j8261J0373J8075r327J3058M479m839k935j7377j445
6159c9314j8481j1388K2625P44Q311N13Q703L9736n812l7647j3267k449K0066
6146b7660K1572N816J5260q271J7470q960j5606p901n815K0238J1513k900k1193
6133f437l2449K976L3846J8579J504L278k7214J5410R389J2805O622l4157p714
6120c562M963P703l551l3402j7432K3301J5597J6896L322j6638J526j518k1293
6107b4088o33k342K7237L605r841L973J23k6840P083j1733R264j155K3491K417
6093E61k1403o797j0799N410M001J5396r025K166N955j4938L595K0825p91M030
6079a814K731k5963l3q445k2522o278l960K9302L3954n848J1635R47l6578O690
$$ y = [-38877, -41467, -33952, -31115, -49376, -39003, -20928, -30255, -17197, -12718, -17557, -20492, -37869, -39314, -57795, -69183, -46558, -45814, -37503, -36990, -28287, 11449, 5637, -32010, -45277, -47726, -27660, -6088, -272, 14988, 6717, 24187, 15227, -379, -8280, -14095, 6143, 17656, 14756, -6437, -38886, -35910, -2064, 16515, 18019, 21297, -5917, 9493, 18882, 31687, 38309, 4152, -3562, 1401, 9104, 5553, -27849, -45281, -21980, -6383, 10513, 13835, -2803, -1277, -2795, -24088, -24721, -27063, 174, 3779, -6062, -2089, -1966, -28806, -21723, -33456, -24192, -25347, -1856, 561, -20842, -27639, -38438, -33028, -29027, -13631, -22656, -20490, -14535, -29473, -25878, -5053, -5844, -1814, 917, -25046, -25079, -33524, -56046, -62324, -66284, -36982, -3028, -8876, 2759, 3706, -32872, -26182]
6065b6182k309j7092j5437J4467P049K3902J0380k312o136j7247k5797j1549M601
6052f3662L6335J5247p189n093j6603J29O521J7891J605l2812j2471J3904R082
6039c7116l091J0774M447P041K4087K6276j4907p972j6900k2084n386o541j9067
6026f0439L3285M4527q07j6739o794N50r471k4432L198J941R102l458j4820K1593
6012b2764Q441J4324j5029J307l040Q363K116p479J2342j2463j7777n175J4218
5999b2616o622N437J1704k041J0190J1667k087n429J8986l165l0167m1810K560
5986e3393K3099Q195J8860J2282j3490j5792l135K1281L7116L1473K463j8190
5974E0769j7831j4380k3231n298L234J1075m94R332J8198j1585O093K3991k8346
$$ y = [-26182, -28491, -45583, -61020, -46553, -39504, -15602, -5222, -7534, -13670, -30917, -56714, -68263, -63662, -27327, -12080, -19269, -24362, -40965, -40836, -34315, -16424, -14819, -47631, -60102, -46198, -37116, -40207, -29433, -24986, -17945, 6142, 32418, 17511, 9539, -7361, -29445, -34831, -41372, -60439, -27154, 17373, 16566, -173, -6967, -6417, -15888, -40320, -37122, -35181, -26079, -29537, -44357, -22764, -14323, 1, -15028, -13721, -16761, -8398, -6282, -13761, -1419, -13882, -31659, -36834, -22616, -29238, -23801, -12097, -14138, -3948, 7719, 5632, 203, 19189, 16024, -14143, -55953, -53393, -30294, -22099, -3239, 9043, -4447, -20239, -23374, -2093, 35023, 66496, 68959, 50769, 32938, 18558, -4673, -9971, -6737, 4338, 3844, 13176, 31374, 19789, 25882, 49873, 21527]
5961B1527o586J8931j2877j2734o405l143k812j2194L2841m67L048j0632j6461
5948g964J1099j3188N447L26j1164j3040m714K8493M0063K7174R581k3280j0880
5935C7953j5196J7229j6516q099p305L426M505J1484r766k1063r685j0052k5393
5922d8478j0143K1257K8944N948j3222k048J3418j0063J6523r655K2440K6650
5910D1571j0940l9055j2859J3356J3656m411q867j0892J309K700l049J0374K1314
5897A4207k4425M41K0277P457K7371j0446j5368R179M04l574r451k5447J37K9163
5883A9925j5118k0134j0515J782L657n92J2534K4472j4072m2784l0648J5296L3971
5870b2226J5657Q779l1621p185K9788J3118o60N949J6782L152j9637k9849j7138
$$ y = [21527, 14941, 33872, 20995, 8261, 1856, -1287, -4099, -16293, 16548, 16081, 19129, 8497, -7964, 3135, -10053, -4606, -4280, -15444, -28484, -33198, -4705, 35358, 62532, 72113, 48833, 37953, 22757, 39986, 23470, 15371, 8066, 11492, 15997, 27481, 17715, -3348, -13033, -23085, -48478, -58621, -37364, -8420, -2472, -15694, -17742, -4324, -14387, 2136, -7519, 14921, 41571, 30631, -8424, -21283, -7927, 5729, 1318, -7549, -18441, -17132, -14432, -17481, -7107, 14207, -10218, -9777, 10500, 17957, 45328, 34882, 19514, 28693, 29097, 25523, 16072, -9375, -9238, 19925, 4807, -15327, -25842, -24060, -20403, -20995, -8461, 16011, 1939, -40845, -71493, -56197, -22226, -6569, 2210, -29411, -36596, -6808, 6310, 5650, 11599, 28381, 31533, 11896, -17953, -35091]
5857c5091m952J9326L0578o621k204k0423m0884K4717K2504p899M1400o414j5445
5844a408M852m0055k0603k3504j0373K4646J8372K3398J0199j0013J727N161J1956
5831e645R099o755J4047j3420l962J7895m124J5138j2253j7713j1363n782q610
5818c3448q805O149Q29j8121N751k315J9830p74k2595J6659K1644M645j5349q276
5804c4176Q3J5637Q238j5251j9461j6029j3921R863K5634K1903m709j507K6500
5791B804J2825m751J5085l237k893m3484j7830R791Q657J0236Q413k8856j8513
5778e1753Q013J9165P145J115J0002J0399o985j8753m458M240r087j103J2018
5765b0042J2195j6124J3047P80j8818j9657J0023K6339M3103k0429j2580M245
$$ y = [-35091, -40043, -20717, 9861, 3240, 1036, -19387, -60271, -35554, -13050, -20949, 20451, 14037, -1408, 3444, -36611, -57214, -80718, -91091, -66445, -48073, -24675, -14476, -24489, -22762, -17601, -5645, 3454, -3301, 10746, -2674, -6636, 11259, 7135, 22273, 10020, -7693, -19056, -24838, -33448, -42253, -36104, -35275, -53396, -47645, -49960, -30130, -30904, -53499, -36840, -15196, -10551, -25900, -34176, -34093, -18456, -10218, -25469, -44930, -60959, -74880, -65017, -39383, -17480, -22189, -23696, 2804, 15629, 10878, 25963, 22726, 19833, -23651, -41481, -31690, -23033, -12797, -4384, -33240, -51753, -43740, -24575, -17430, -16315, -6313, 4086, -2899, -21652, -26110, -21870, -30957, -32060, -20042, -7847, -23971, -10924, -10144, -28962, -48619, -38596, -12257, 30846, 10417, -2163, 2082]
5753B082l5391J3937K0953O1j1200n155J4537J3721o347o65j7643N186k892k4258
5739c3074r186K4925K57J2118J2464j3051o600Q124J5400N78j2779j2961R01J1226
5725a658p125j218o872P256J4201q27J028J1842j0414j2581j5293J5527J0975
5712D841p782r009L634j7796m93J0333J7707q338k5306J9410L2205p012k815p798
5698A781K7543k6031l9594p222k047j7119J87L5398J0624o078j3528L4523K1521
5685A9958J8016j7178k6662k5685m114K3703K2574Q968K8549K0121l1683l0037
5673F530j8718J5611J9516j5204R312R80j2892k5473N431k65j8308J6095J1050
5660f335P412k0177j4077O195n117J1559L3186R613k0124N257K5238J3651j0520
$$ y = [2082, -33309, -19372, 1581, 1642, -9558, -14713, -176, 13545, 7198, 6533, -11110, -5924, -8816, -33074, -42260, -17335, -17078, -4960, 7504, -5547, -12147, -4023, 11377, 11955, -824, -13785, -12884, -1658, -8783, -10001, -16873, -9617, 4584, 3757, 4785, 16627, 6213, -6368, -21661, -6134, 4841, -2941, -11950, -8316, -26112, -26605, -16272, 1435, -6903, -32209, -12799, 19406, 12394, 9579, 1781, 29324, 3293, -36301, -43523, -45570, -62689, -62502, -27104, -16480, -22558, -36086, -1563, 19958, 37974, 20796, -5866, -31551, -35665, -11962, 10612, 19580, 48129, 68250, 36567, 6530, -12188, 3423, 22939, 7735, 17047, 18027, 5135, -20338, -14907, -15172, -33480, -17385, -6335, 1077, -19100, -33177, -26982, -32099, -20540, 12646, 22259, 2135, 7392, 32630, 46281, 35761]
5647C5761j0276k5820M441M840j1650n394Q211k3181j3045L345r101k1615P963
5634e5521K2187J8242K8526L650m348O782q469K899j6269k989J1521m905n17K521
5620C310K236J6485J1391l444k9767j1301k600J210p598j0973L50L3816J700m909
5606i4j325L185L374j3575k0382q775J1507Q946o422q194l260k1206l608L9650
5592b0179N870M759J7084j3917l1091j1395J7935K5961P086j870J722k4195p99
5579b3029J9640L924J1328K583j8453Q674r687J3189L3765J2040j2820Q76M422
5566D6452M176j5391k7745r095Q621k4072K5787M261K1246j4962m820j1890N489
5553H057p555J9975n912j2096l3525j3156j325L5860o957r153L9425J6932j4792
$$ y = [35761, 25485, -335, 4106, 8946, -2704, -8098, 113, -23068, -36113, -32768, -41869, -63484, -55521, -33334, -15092, 13434, 17084, 12736, 19518, 11049, 13948, -2321, -5310, 6211, 1306, 789, 3310, 5546, 22031, 33422, 29978, 211, -11090, -13690, -12480, -20078, -31051, -30701, 3115, 4815, -94, -1419, 1766, 5140, -8435, -28817, -37592, -26085, -17139, -23561, -31755, -35015, -56221, -59829, -20179, -14309, -9550, 7534, -6383, -37474, -48869, -30934, -4973, 2113, 243, 1965, -22230, -23029, -3389, 535, 11863, 14446, -4007, 4667, -5020, 8169, 41934, 53974, 41154, 42030, 46452, 50628, 35237, 7492, -1603, 7018, -17054, 8733, 12994, 34240, 19278, 14458, 2568, 8057, 502, 20477, 14565, 2469, -31056, -44212, -45537, -9677, -16634, -25787, 13638, 30570, 15778]
5540A5778j3631n461j4994J3683j298J1507M821k0057l4912P533Q618J065j0267
5527c7615J8780Q343O503k4822j5051j1581k66J4415K9329J9078O792r248j2016
5514g359J2983l439K940k3628o117R484J8932J4466j4103j5824o032K2577R394
5501A4274k0507j2646j1652k9080J6126L2378J0255r007l941k386Q671R888p833
5488e460j4415M406K2645J1974k0234r523J933j7610O360J9083K0074R914m6003
5475a6856k3937N540Q654J4976l465l875J8764k8366J003L5622K4192L29m4184
5462a1603l5271J8915P268p152J1428R61J8001j318j881j0413k7921j4356l041
5449e6383o252l001M293o270K1718J7403L836J7507K406K4971L3007j9960j7186
$$ y = [15778, 2147, -3314, -18308, -4625, -5923, 5584, 10405, -9652, -44564, -37031, -28413, -27348, -37615, -18835, -10492, -3989, -28811, -43862, -55443, -55709, -41294, -11965, 7113, 13905, 4657, -7359, 5624, 2185, 5125, -18503, -24620, -15136, 3796, 18262, 4159, -11665, -17697, 4880, 14274, -6233, -18879, -30531, -59611, -43485, -11107, -852, -9859, -13800, -16186, -7515, 2373, -5460, -19875, -15469, 7176, 19150, -1084, -10607, -8674, -26284, -19924, -841, 19233, 29147, -16856, -40793, -35253, -26599, -11623, -15088, -18963, -199, -28565, -27562, 8060, 32252, 32581, -11603, -46874, -27959, -20691, -27843, -16415, -15454, 2547, 1229, -652, -11065, -38986, -53342, -56383, -62635, -65636, -61343, -67613, -45895, -28492, -24656, -7149, -4743, 20228, 53235, 33275, 16089]
5436A6089J3679J5554j7823j945j6245l2627N697K3881j0876j5363J7703J3182
5424A0906j9532k0258j3265Q400O561l276M779m77m684P477J6702p41M745K6437
5410B3774j129j262j6238M881l362o196j746J6617L3641q541p632l4399k8629
5397c0221k1941J660J0824P55L607o758K0708j1286N143J9784k5671j5387J1659
5384c7124J8876m904j9388l149p54J4266J0856K504j419K07J1195j8513k0085
5371d7432m000J802j9206P898L8797J4637j8059M173M350j3004m740p759L0246
5358a2297J1069j1281J4461j2071k5043J6059k036M913O238J1179J8564n898r508
5345D349J0459P736M969j134R683K923l3563j6530J7508k075j8428Q806J9100
$$ y = [16089, 29768, 45322, 27499, 25554, 9309, -23318, -17621, 6260, -4616, -19979, -2276, 10906, -8626, -28884, -42149, -33749, -27188, -30464, -25685, -26162, -30846, -23369, -6667, -7408, -2663, 23774, 22645, 21383, 5145, 10026, 6664, 468, -1278, 15339, 48980, 40439, 32807, -1592, -30221, -52162, -50502, -39678, -38923, -35316, -42074, -21366, -32652, -27509, -7725, -33396, -48783, -37124, -18248, -23152, -42540, -45689, -46443, -32177, -21321, -18817, -20236, -20029, -8834, -27347, -47432, -51432, -49630, -68836, -60938, -22141, -7504, -25563, -21390, -17040, -30044, -34784, -42543, -12297, -1228, -12509, 1952, -10119, -35162, -19103, -21139, -16226, -9988, 1191, 19755, 13857, 4349, 14808, 22544, 27513, 26379, 36062, 38985, 5422, -11108, 6400, 4325, -14103, -5297, 13803]
5332A3803L157j597l041j7567R03k9534j2762L1883L1280L188J6806j1311j6936
5319H272N516P72M586o171O361j5433j9263j8251K6552J9043k0581M876j4686
5306a8407N322n851O507N633n725P639K0705j0825j8078r512q299N143J6605J2567
5292C424J8967j2057k1441O074j274o007p027j404j2135J3130n817J3607k601
5279a4561K247L631J0068P662o921m344O402Q799j1532q034N352q97l340j6544
5265b2012j8013j759N964L0734j996j5409l536j1176J005J4233m569J1534r450
5252b4450j8388J3708P339R618K3068J7954J5767M291k7207j8844k0171n307J900
5239b0722M346n62K1306n534K241K4715l0372K574K1092j9116k4420P110j859
$$ y = [13803, 16960, 15363, 12322, -5245, -4342, -33876, -46638, -14755, 16525, 19713, 36519, 25208, 8272, 13788, 14560, 19146, 12975, 19336, 3903, -15360, -33611, -7059, 11984, -8597, -3721, -18407, -13085, -18936, -12429, -6796, -12521, -4882, 15823, 4998, -13080, -22592, -30891, -25748, -9143, 3424, 22391, 10334, -11107, -5033, -6307, -12314, -19341, -20745, -32880, -19750, -25567, -11960, -14561, -12314, -8683, 1385, 9047, 2126, -2218, 4184, 12983, 1451, -6583, -1231, -2128, -5468, -22012, -40025, -41784, -35820, -5086, -7082, -22491, -26027, -37203, -36198, -21965, -26534, -15000, -24450, -42838, -29130, -21791, -12173, 10895, 28849, 44616, 48907, 21700, 2856, -17315, -22622, -20722, -16376, -16938, 4368, -1166, 1075, 25790, -4582, -2008, 19084, -32, -24452, -17342, -19201]
5226a9201J1161k996m198J2949J1691j614J5878j2078r239Q02O665l309Q133K491
5212A7135o880O366k012j5247J6397J7653p05K240J0638j0858N027l675q230j9938
5198G911J0231p821j4887J1688k964p833O060j3036j1542n915r751O504J8538
5185a2817q065K724j4948P656j3465J3551J6532K4550P04j0737Q101k0218k0907
5172b7339r773N408K5052K2925L0614k064j8711Q38m483n585k9676m7811l083
5159f3688K2935R206k949K4529M459n210j1537O76J3430J633j3587j0550K6067
5146d586J6549J9782M803l7232l6474J6618l679r856j0872J0651j2938J2085K6759
5133h390J6617j8242m906r494J8784m030k1128j3689j2166j0934j4326J3696K6682
$$ y = [-19201, -8040, -11036, -15234, -2285, 9406, 7792, 23670, 11592, 2353, 3155, 9820, 6511, 14644, 17135, 10255, 16621, 14609, -638, 15759, 33412, 32707, 34947, 45585, 34727, 39754, 36079, 27849, 7911, 18142, 10321, -4566, 7122, 4158, -3675, 2385, -10651, -22193, -28108, -37859, -31355, -12817, -20882, -18158, -33106, -25450, -38915, -25364, -8832, 15718, 16422, 5685, 13786, -6432, -27339, -37112, -31704, -6652, 16273, 46887, 44823, 26112, 26950, 22467, 16882, -12794, -60605, -63688, -40753, -31547, -34496, -9967, -5508, -10718, -22255, -21579, -8149, -6516, -20103, -30653, -4586, 11963, 31745, 36548, -684, -37158, -20540, -24219, -34075, -44947, -34296, -47234, -35149, -8390, 8227, -10015, -14921, -24415, -5631, -9661, -30789, -44478, -56644, -67578, -81904, -68208, -41526]
5120d1526j655l774L4789K1299k7561K143J751K1239j1212q112J132l822Q203
5107g106J457K806k652J7237J3549k905j7212l616P720K307L6573Q529l7703m3222
5093b4238L594K7473L131j1990n988K819N791P489l1928K6834N0023k72k0141
5080C2597N195j8218j5391k8713j2395J2730J118j038j1768J6802K4345j6066
5068a0802j8679p825N367j0071j9228J5941K4931J3468M820O02O168L848K826
5055A1366l736j0929k5482J6783m240j6633K0669J7919l869k690k6414q81J4842
5042a3295j1426j0668M555J3323j0685K0975J3310j7006J4055J448k2613j4026
5030c2053l1555J6287J0612K2126J4429k351J7059j0276k5555J1169j3654m2729
$$ y = [-41526, -43181, -46955, -12166, 9133, -18428, -16285, -14534, 6705, -4507, -12619, -11487, -15309, -7106, -5649, -2843, -5495, 11742, 25291, 22386, 5174, 1558, 9278, 11585, 48158, 56687, 18984, -24238, -20644, 6829, 9960, -2030, -8018, -5199, 592, 8081, -23847, 2987, 53010, 52738, 32597, 37792, 19574, 4183, -24530, -36925, -24195, -23077, -24115, -35883, -19081, 5264, -10802, -29481, -37306, -31939, -42010, -61238, -45297, -20366, -6898, -2078, -1476, 4692, 8540, 11366, 7630, -3299, -28781, -11998, -16238, -32871, -12202, 5717, 1848, -842, -27256, -28137, -13295, -24721, -35389, -30834, -17511, -28196, -7221, 6089, -10917, 3138, 4586, -18027, -32053, -63608, -47321, -36709, -14583, -154, -2505, 14554, 4278, -21277, -10108, -23762, -66491]
5018f6491K9864L1686K1803K0084k5093j3838J6501N600l0910k38r822k0174L0950
5005a0078J9165J1003j5253m6262O789M614j4760j9521L2625J8113J1050K311
4993b04j3417J0532J5538O740j7180J472j3947j142L0700r712k3146J820J6822
4980D876K326k87k236k0834J6391N191o617Q437o875L047r519j7570k018j0207
4966c5895J7688k444j5860J6272J9630M119k9964K1991k67k5125j522j3357M971
4953c9763K0010o181P034j5714j782K6675p15j2889J0549K7319q21k82j6383j4122
4939a7065j6009L1769L683R403K657l4758k5507J7152K4136p725M539k5416j5052
4926d8193O509J0104J2192J8762K7758P511l4284J0035J1039j0414n956J9306
$$ y = [-66491, -36627, -4941, 16862, 36946, 11853, -1985, 14516, 20116, -10794, -11032, -20854, -41028, -10078, 9087, 20090, 4837, -41425, -34636, -30022, -44782, -64303, -31678, -13565, -2515, -204, -13621, -3089, 12449, 19189, 2009, 3481, -10466, -11608, 19092, 9380, -13766, -11946, 4876, 7202, 6915, 4679, -16155, 236, 5427, -1190, 7247, 372, 3419, -6100, -23670, -25688, -35895, -18207, -20651, -36511, -20239, -609, 3510, -26454, -4463, -4730, -29855, -31377, -44734, -39763, -19753, -25934, -18900, -34614, -36396, -9721, -10436, -23325, -12776, 14543, 13722, 13440, -2943, -17065, -33074, -1305, 2378, 11781, 14438, -20320, -45827, -28675, -4539, -12264, -7725, -33141, -48193, -41684, -31580, -19388, -626, 27132, 34643, 359, 10394, 21433, 11019, 5063, 24369]
4914B4369K5188k7096k3388j6914n532J3479J6940J2789m1315n462K2430R398
4902D886k5681J248J138j3144M433o969L693J3824L6574r565k2325j5860j1093
4889c8841j564K826k525JK7137M446R933Q476Q830q765K637K070k5620o796n20
4874a8275P661K8334M3371l775k8171j8523J6648J2591j6305n215J246M44M926
4861B4957O814L852l5045l2470K4200P550k3331k2758r597K0652J4344l130K2401
4848a561J3041p306k261K786N226J7344j9799q296N112K4077r70J7456K2711m0587
4834B6973j8378j5926J2907J9581R696N03R792j5195k063J6286p598l0339j0188
4821c949j4662K266J9857L8234j7654j1751P869l615j5128K4939j2585j5688l972
$$ y = [24369, 49557, 22461, -927, -17841, -23373, -9894, 7046, 19835, -21480, -26942, -4512, 4886, -20795, -19547, -18409, -31553, -27120, -34089, -30396, -16572, 20002, 10437, -11888, -27748, -38841, -40405, -37579, -40104, -40103, -12966, -8520, 1413, 9889, 18719, 9954, 12591, 14661, -10959, -17755, -18275, -10614, 17720, 61091, 57316, 29145, 10622, 27270, 39861, 23556, 18341, 19587, 20031, 24957, 31771, 35623, 578, -31892, -7692, -142, -23473, -46231, -55828, -35176, -20832, -23962, -1561, 11480, 4174, 1913, 4699, 9925, 27269, 7470, -826, 4286, 28363, 27393, 44849, 67560, 26973, 8595, -7331, 5576, 25157, 34853, 35356, 45148, 29953, 27890, 44176, 36578, 6239, -3949, -18611, -16345, 3512, 41746, 24092, 12341, 20210, 16595, 1467, 26406, 13821, -1867, -5839]
4808e839M587M0391j1586j0738J7019J4130k1601K225J9934K466p66k3505l7174
4795a0457J3459J464n133j2113r357j0065J0904j2776O334j537m592J383J7338
4782a5148J4527oq40k3054o913J9993j292o243K9965l414j5528L537O79N82j3557
4767a6712j0156K89K357j2180J5746m983r873o130j4696j8076J8366K5850j3585
4754d3783K3317J987k3477R740L6102R227k0134j7131r457J2759k181K4177J1201
4741A2347r804m255L780N139n079k5434J3201L3011k644m5337l722Q216j0070
4728c0651J3221q310j3697J5548j4571L015J0067O400j1934J0649m112L894L6205
4715A5724q237l8622R637M619k0572m203K2572J6129p172m749m383o038q870J0050
$$ y = [-5839, -1252, 39139, 27553, 16815, 33834, 47964, 26363, 28588, 48522, 50988, 50222, 26717, -10457, 3002, 4466, -667, -12780, -22137, -32202, -21298, -34074, -27740, -29277, -33869, -32486, -15148, -621, -627, -1467, -24521, -31434, -11441, -12733, -18976, 10989, 7575, -7953, -4416, -3737, -3155, -16712, -26868, -26579, -24222, -36402, -20656, -25639, -35512, -41642, -56338, -74414, -56048, -30198, -43783, -20466, -18479, -41956, -32216, 3886, 13113, -7021, -24152, -33609, -20850, -23031, 1146, 12347, 2543, -1712, 2068, 7207, 2128, -23306, -10105, 22906, 20262, -25075, -28797, -20581, -30651, -17430, -25740, -39437, -23889, -38460, -35445, -25378, -18978, -30912, -20263, -24375, -20481, 15724, 7487, -31135, -21498, -16879, -37451, -41654, -19082, -2953, -10125, -14874, -19257, -25295, -34165, -24115]
4701b4115J3302q553j998J6374r689j296K4014q235O72N248M668k1550l5357j3654
4687f0169J2181K3485O877m414J3295R803J2579j201j92l468l921j9255j0447
4674b4847k4135o824L4628R415k900J6590q27m911M855j6514j4041P243J4878
4661g390j6632Q159J4499J596J3011p346J0086L5339n819l6576l1437J1680R879
4648i51p159P754Q346m4667q629j0312l487J740O689L8782J9366K8564M580n752
4634C4864q19O03l440j2549P180j1707l1163k5358M958L324O624J5632p931l2887
4620e2669R880J9278K6873Q274J3563j0023k6472k3135q956K5699j1450M465M363
4607b0310k942J458J7694R478J1253j8599l3160J1290K7340l320q934j805R36
$$ y = [-24115, -10813, -19366, -21364, -4990, -14679, -15975, 8039, -196, 476, 5724, 10392, -11158, -46515, -60169, -47988, -24503, -17626, -22040, -8745, 1058, 13637, 12436, 12244, 8776, 4855, -14400, -24847, -48982, -55806, -21178, -11763, -14663, 1927, 1100, -3811, 1044, -15470, -29511, -22268, -7390, -24022, -15863, -1364, 232, 13243, 5897, 15983, 51322, 45503, 8927, -22510, -10830, -951, -8110, -356, 7990, -36677, -45306, -55618, -59105, -57365, -50676, -11894, 7472, 36036, 40616, 34864, 34045, 34648, 31208, 18659, 25839, 14132, -17031, -42389, -37431, -34107, -27483, -11851, -19782, -52669, -42789, -23511, 3362, 11636, 25199, 15176, -11296, -34431, -43387, -17688, -29138, -24673, -20310, -23252, -21794, -4100, 5378, 16631, -1968, -35128, -23838, 3502, 182, -8752, -10557, -9621]
4594i621q540k0500n810L4812J4210K4253J5531j0793m0022l5442j7406K9952
4582b9376K6773R469n312j0442j4006q978j606K0400J3753k5655j8399J2239J3995
4569a7145k980j1769L6878J4679j5470p735k6008o617q282O360o483N599J6174
4556b2799L7307M056k5764J8521j1691j0516K363L44J5057j1650r126m059K7699
4543I742N195j3570P216K7668K9310Q523k6886m9069k0117j2179k854J0989o825
4530c2857J1924K0829L050j267N015J141j6650k7752m13L2658N30j6967J7002
4517c757J8451q858j748j843n736J8147O479j7147j8357q699J5649L8375k0905
4504A0051r222j3215j340J1077J5935Q475o675K0409j1876j0466J5736m068J2738
$$ y = [-9621, -18161, -38661, -44471, -9659, 4551, 28804, 44335, 33542, -6480, -41922, -59328, -29376, -2603, 6866, 1554, -8888, -22894, -31872, -33478, -13078, 675, -24980, -43379, -31140, -17145, -20125, -31894, 4984, 19663, 4193, -3542, -29550, -36167, -44449, -38089, -44572, -38973, -22799, 14508, 18564, -7200, 11321, -370, -10886, -8523, -8179, 6878, -4772, -13898, -17957, 9742, 14937, 1367, 8583, 36251, 65561, 74084, 47198, -1871, -21988, -34167, -37021, -26032, -32857, -20933, -104, 2946, 1679, 6694, 7835, -8815, -36567, -36980, -4322, -3792, -20759, -3757, 14694, 5836, 4088, 2245, -3491, 14656, 21135, 3988, -14369, -23068, -7419, 30956, 10051, 829, -12386, -13726, -2649, 13286, 21761, 15086, 35495, 23619, 13153, 28889, 24821, 37559]
4491C7559O062Q171J0990l029l2572K188M888P715k8563k5277J775k5729k806
4478c8628O929j309p547J1231K0823L9643K7479l3394l8030r568Q978R914Q783
4465E304r05j5098K478K145J2528K487r394R114J9956Q396J3861j731k22K460
4451E1379k3202j3358q222j3241j3486L316K5205K2731j0021K899J0104j0482
4439B3622n249j260O445j2843P727Q211k4148k7626J0131J0350o906J6750J6455
4426B1659l684j0815p628O286J2038J051l7298k3062q701L733L1270K4892j5825
4413f084J5489L4848n831n301j743K5352q967m6437j8001k514L657K0957N392
4400A0817K247N980j6500j3797k2130q053K994J3763K4016J2355K844j6528j208
$$ y = [37559, 43621, 51792, 62782, 59753, 27181, 29369, 34257, 41972, 13409, -11868, -10093, -35822, -38628, -31699, -33008, -40555, -29324, -8501, 31142, 58621, 25227, -12803, -22371, -13393, -3479, 5304, 4399, -10699, -8221, -6076, 6452, 8939, -455, 8659, 28615, 37011, 50872, 49141, 48919, 51379, 28177, 14819, 6597, -6644, -20130, -16814, 8391, 31122, 21101, 24000, 34104, 23622, 18373, 17113, 23558, 10715, 18442, 26653, 2505, -25121, -14990, -4640, -11546, 5204, 21659, 17975, 7160, -468, 5818, 17856, 18907, -18391, -41453, -50154, -46421, -15151, 9741, -6084, 9405, 44253, 38422, 33121, 31378, 56730, 47763, 1326, -16675, -19189, -15532, 5425, 10817, 13064, 19044, 2544, -11253, -33383, -41436, -38442, -24679, -663, 11692, 14536, -1992, -3200]
4387c200q256k2146j7963M407J0840J1035M23J1782p076R976k890J646J5365j7454
4373a3511J8042Q549j7131m365j4270l7114K7712J8964M941k1688L2356K8074
4361C0559j5458j1534m388j2086p684p451K0413J3173K1524j4675J1514Q060o870
4348B5097N15l2956j8562J4625Q716p514j5087j7858K1322K3926P236o337j5239
4335a2116j8574k772n706M339J1083J7541K2392L2213L315m0129j5104J6124k7536
4322a4930k750J914J3608L773K785q427J83J2729j0679K585N352j1087J7999J7415
4308C0470l906J859l3221j2332k6986J015J1103J3038m062k2564j3052k08K3203
4295c5643K5330j459k5995o068J8335L2056J0820j7798J8562r171J944p255J7228
$$ y = [-3200, -11456, -33602, -51565, -47158, -36318, -25283, -24860, -13078, -20154, -10178, -13068, -11422, 3943, -13511, 4531, 13080, -4051, -8416, -22686, -59800, -32088, -13124, -8183, -29871, 2485, 30559, 15101, 3567, -821, -12907, -20591, -28042, -7629, 5544, 27068, 12393, 23907, 31967, 25097, 25612, -7344, -25906, -11281, -2565, -10079, -25166, -43024, -21702, 2224, 9460, 3123, -12116, -30690, -33462, -39168, -34829, -23746, -6205, 16187, 48400, 51715, 11586, -3518, 12606, -14930, -17680, -15766, -2158, 1615, 4400, -4027, -3844, 8885, -1794, 791, 6143, -4944, 13055, 30470, 26564, 28423, -4798, -17130, -44116, -43101, -31998, -18960, -23022, -45586, -58638, -58846, -35643, -10313, -11772, -37767, -43835, -25500, 6556, 17376, -422, 18140, 8969, 10913, 3658, 20886]
4282B0886n209j7784j2761J605J2332m903j2642j0650o842o901K1163J1080m884
4269a5510j1972k0693J7994J2370K201J1373k036R111j7306o631J972m6Q30o94
4255a9037j2317Q610Q696J4902J7083k0321J3594J4150l0042m5388L391L5913
4243a0766L0791r754m324O755j3797m989J2660J0848K600k1843k5452O940J5790
4230d541r503J533Q361q53j7952k3709J7395J6398K6166J4919k6237k4970R999
4217a2994j535J6976M1604n1928j9464M770K5133j349j3943j4673R678p277J6134
4204h868r495k278n151j8399K568J7343K4931K1766j4625k063k9643J6025J3572
4191E683R609q488j1540J3683J4342q102j2513j2155K1993K3905j1230k572j2103
$$ y = [20886, 15677, -2107, -14868, -13263, -931, -5834, -18476, -29126, -35968, -42869, -21706, -10626, -15510, -27482, -48175, -30181, -17811, -15610, -4237, -6273, 2838, -14468, -21099, -19127, -19173, -18343, -19037, -31354, -22744, -14048, 854, 17937, -2384, 11210, 25360, -4682, -50070, -46679, -10766, 20025, 10271, 5947, 12702, -1095, -6084, 6576, 17424, 20024, -1819, -27271, -20331, -4541, -14044, -12511, -4150, -5003, -22955, -46664, -29269, -12871, 13295, 28214, 1977, -22993, -12994, -14529, 2447, 44051, -7877, -27341, -22571, 2562, 1213, -12730, -27403, -17725, -25002, -8868, -18363, -20641, -25792, -44191, -41623, -24280, 651, 22417, 7792, 5729, -23914, -7889, 5683, 15292, 6804, -4736, 8947, 23289, 15187, 2674, -9481, 12512, 36417, 25187, 22615, 10512]
4178A0512k3270q328Q031K3604j8286k6234O240n027K2415M8758j485k0991n246
4165A0693J1883j204J6522L8262k6715k1941N800Q196p936N54l57j0654J1153
4152C4256J0600J79r262j9430j1331l522j2125n936J752J1754K0832J7557O322
$$ y = [10512, -12758, -21086, -13055, 10549, -7737, -33971, -27731, -32758, -10343, 38415, 36930, 15939, 10693, 22576, 21372, 37894, 76156, 49441, 27500, 33300, 41496, 33560, 34114, 33757, 23103, 34256, 44856, 45035, 35773, 16343, 5012, 1490, -10635, -16571, -14819, -3065, 17767, 35324, 41646]
$$ [...]
##END NTUPLES=NMR SPECTRUM
##END=
