##TITLE=316681	cc 05803	adrs	ugmt
##JCAMPDX= 6.0         $$ Bruker NMR JCAMP-DX V2.0
##DATA TYPE= NMR SPECTRUM
##DATA CLASS= NTUPLES
##ORIGIN= Bruker BioSpin GmbH
##OWNER= nmr
$$ XWIN-NMR		Version 3.5
$$ Tue Jul 11 13:40:16 2006 GMT Daylight Time (UT+1h)  MAYBRIDGE\nmr@NMR_250MHZ
##.OBSERVE FREQUENCY= 250.131544655141
##.OBSERVE NUCLEUS= ^1H
##.ACQUISITION MODE= SIMULTANEOUS (DQD)
##.ACQUISITION SCHEME= undefined
##.AVERAGES= 16
##.DIGITISER RES= 18
##SPECTROMETER/DATA SYSTEM= dpx250
##.PULSE SEQUENCE= zg30
##.SOLVENT NAME= CDCl3
##.SHIFT REFERENCE= (INTERNAL, CDCl3, 0, 16.522)
##AUDIT TRAIL= $$ (NUMBER, WHEN, WHO, WHERE, WHAT)
$$ ##TITLE= Audit trail, XWIN-NMR		Version 3.5
$$ ##JCAMPDX= 5.01
$$ ##ORIGIN= Bruker BioSpin GmbH
$$ ##OWNER= nmr
$$ C:/u/data/dgb/nmr/ADRS/15141/pdata/1/auditp.txt
$$ ##AUDIT TRAIL=  $$ (NUMBER, WHEN, WHO, WHERE, WHAT)
(   1,<2006-01-24 11:29:07.24 +000>,<MAYBRIDGE\nmr>,<NMR_250MHZ>,
      <created by zg, POWCHK disabled, PULCHK disabled
       configuration hash MD5:
       62 19 C7 07 E1 42 D1 B7 37 6C 3D D0 77 39 F9 E6
       data hash MD5: 64K
       AD D1 29 C9 0A 8A C3 67 CB F6 E2 43 8C D1 E3 97>)
(   2,<2006-01-24 11:29:13.70 +000>,<MAYBRIDGE\nmr>,<NMR_250MHZ>,
      <Start of raw data processing
       ef LB = 0.3 FT_mod = 6 PKNL = 1 SI = 32K 
       data hash MD5: 32K
       4B 81 22 9A B9 F1 7D 72 F8 C6 C2 CE BD 06 7D 04>)
(   3,<2006-01-24 11:29:16.51 +000>,<MAYBRIDGE\nmr>,<NMR_250MHZ>,
      <apk 
       data hash MD5: 32K
       B3 42 43 37 7B D8 17 AD F9 27 AB 67 FF 0E 6B 08>)
(   4,<2006-01-24 11:29:17.46 +000>,<MAYBRIDGE\nmr>,<NMR_250MHZ>,
      <abs ABSG = 5 
       data hash MD5: 32K
       4C E5 BD 82 18 96 C0 F9 6A 49 65 6F C1 F9 35 B9>)
$$ ##END=
$$ 
$$ hash MD5
$$ 28 5B AE 52 23 83 F0 0E 93 86 BC CA F7 A6 D6 75
##$RELAX= 
##$RELAX= 
##$RELAX= 
##$RELAX= 
##$RELAX= 
##$RELAX= 
##$RELAX= 
$$ Bruker specific parameters
$$ --------------------------
##$DU= <C:\Restored>
##$EXPNO= 15141
##$NAME= <ADRS>
##$PROCNO= 1
##$TYPE= <nmr>
##$USER= <dgb>
##$AMP= (0..31)
100 100 100 100 100 100 100 100 100 100 100 100 100 100 100 100 100 100 
100 100 100 100 100 100 100 100 100 100 100 100 100 100 
##$AQSEQ= 0
##$AQ_mod= 3
##$AUNM= <au_zg>
##$AUTOPOS= <9 >
##$BF1= 250.13
##$BF2= 250.13
##$BF3= 250.13
##$BF4= 250.13
##$BF5= 500.13
##$BF6= 500.13
##$BF7= 500.13
##$BF8= 500.13
##$BYTORDA= 1
##$CFDGTYP= 0
##$CFRGTYP= 5
##$CHEMSTR= <none>
##$CNST= (0..31)
1 1 145 1 1 1 1 1 1 1 1 1 1 1 1 1 1 1 1 1 1 1 1 1 1 1 1 1 1 1 1 1 
##$CPDPRG= <>
##$CPDPRG1= <>
##$CPDPRG2= <>
##$CPDPRG3= <>
##$CPDPRG4= <mlev>
##$CPDPRG5= <mlev>
##$CPDPRG6= <mlev>
##$CPDPRG7= <mlev>
##$CPDPRG8= <mlev>
##$CPDPRGB= <>
##$CPDPRGT= <>
##$D= (0..31)
0 1 0 0 0 0 0 0 0 0.06 0 0 0 0 0 0 0.0002 0 0 0 0 0 0 0 0 0 0 0 0 0 0 
0 
##$DATE= 1138102146
##$DBL= (0..7)
120 120 120 120 120 120 120 120 
##$DBP= (0..7)
150 150 150 150 150 150 150 150 
##$DBP07= 0
##$DBPNAM0= <>
##$DBPNAM1= <>
##$DBPNAM2= <>
##$DBPNAM3= <>
##$DBPNAM4= <>
##$DBPNAM5= <>
##$DBPNAM6= <>
$$ [...]
##$SUBNAM7= <"">
##$SUBNAM8= <"">
##$SUBNAM9= <"">
##$SW= 20.6930455092707
##$SWIBOX= (0..15)
0 0 3 0 0 0 0 0 0 0 0 0 0 0 0 0 
##$SW_h= 5175.983436853
##$TD= 65536
##$TD0= 1
##$TE= 294.16
##$TE2= 300
##$TE3= 300
##$TEG= 300
##$TL= (0..7)
0 120 120 120 120 120 120 120 
##$TP= (0..7)
150 150 150 150 150 150 150 150 
##$TP07= 0
##$TPNAME0= <>
##$TPNAME1= <>
##$TPNAME2= <>
##$TPNAME3= <>
##$TPNAME4= <>
##$TPNAME5= <>
##$TPNAME6= <>
##$TPNAME7= <>
##$TPOAL= (0..7)
0.5 0.5 0.5 0.5 0.5 0.5 0.5 0.5 
##$TPOFFS= (0..7)
0 0 0 0 0 0 0 0 
##$TUNHIN= 0
##$TUNHOUT= 0
##$TUNXOUT= 0
##$USERA1= <user>
##$USERA2= <user>
##$USERA3= <user>
##$USERA4= <user>
##$USERA5= <user>
##$V9= 5
##$VALIST= <valist>
##$VCLIST= <CCCCCCCCCCCCCCC>
##$VD= 0
##$VDLIST= <DDDDDDDDDDDDDDD>
##$VPLIST= <PPPPPPPPPPPPPPP>
##$VTLIST= <TTTTTTTTTTTTTTT>
##$WBST= 1024
##$WBSW= 4
##$XGAIN= (0..3)
0 0 0 0 
##$XL= 0
##$YL= 0
##$YMAX_a= 554015
##$YMIN_a= -559744
##$ZGOPTNS= <>
##$ZL1= 120
##$ZL2= 120
##$ZL3= 120
##$ZL4= 120
##$ABSF1= 16.522
##$ABSF2= -4.171173
##$ABSG= 5
##$ABSL= 3
##$ALPHA= 0
##$AQORDER= 0
##$ASSFAC= 0
##$ASSFACI= 0
##$ASSFACX= 0
##$ASSWID= 0
##$AUNMP= <proc_1d>
##$AZFE= 0.1
##$AZFW= 0.1
##$BCFW= 0
##$BC_mod= 0
##$BYTORDP= 0
##$COROFFS= 0
##$CY= 12.5
##$DATMOD= 1
##$DC= 0
##$DFILT= <>
##$DTYPP= 0
##$F1P= 14.0000005364418
##$F2P= -0.99999901652339
##$FCOR= 0.5
##$FTSIZE= 32768
##$FT_mod= 6
##$GAMMA= 0
##$GB= 0
##$INTBC= 1
##$INTSCL= 1
##$ISEN= 128
##$LB= 0.3
##$LEV0= 0
##$LPBIN= 0
##$MAXI= 10000
##$MC2= 0
##$MEAN= 0
##$ME_mod= 0
##$MI= 0
##$NCOEF= 0
##$NC_proc= -2
##$NLEV= 6
##$NOISF1= 0
##$NOISF2= 0
##$NSP= 0
##$NTH_PI= 0
##$NZP= 0
##$OFFSET= 16.522
##$PC= 1
##$PHC0= 238.2558
##$PHC1= 9.560495
##$PH_mod= 1
##$PKNL= yes
##$PPARMOD= 0
##$PSCAL= 4
##$PSIGN= 0
##$REVERSE= no
##$SF= 250.13
##$SI= 32768
##$SIGF1= 0
##$SIGF2= 0
##$SINO= 400
##$SIOLD= 32768
##$SREGLST= <1H.CDCl3>
##$SSB= 0
##$STSI= 32768
##$STSR= 0
##$SW_p= 5175.98343685301
##$SYMM= 0
##$S_DEV= 0
##$TDeff= 65536
##$TDoff= 0
##$TI= <Analysis number 999999
Compound Code 99
Book Reference 9
Project Code 9>
##$TILT= no
##$TM1= 0
##$TM2= 0
##$TOPLEV= 0
##$USERP1= <user>
##$USERP2= <user>
##$USERP3= <user>
##$USERP4= <user>
##$USERP5= <user>
##$WDW= 1
##$XDIM= 32768
##$YMAX_p= 417037206
##$YMIN_p= -28134
$$ End of Bruker specific parameters
$$ ---------------------------------
##NTUPLES= NMR SPECTRUM
##VAR_NAME=  FREQUENCY,     SPECTRUM/REAL,   SPECTRUM/IMAG
##SYMBOL=    X,             R,               I
##VAR_TYPE=  INDEPENDENT,   DEPENDENT,       DEPENDENT
##VAR_FORM=  AFFN,          ASDF,            ASDF
##VAR_DIM=   32768,         32768,           32768
##UNITS=     HZ,            ARBITRARY UNITS, ARBITRARY UNITS
##FACTOR=    0.157963299565203, 1,           1
##FIRST=     4132.6476996994, 0,             0
##LAST=      -1043.33573715361, 0,           0
##MIN=       -1043.33573715361, -28134,      0
##MAX=       4132.6476996994, 417037206,     0
$$ Real data points
##PAGE= N=1
##DATA TABLE= (X++(R..R)), XYDATA
$$ [...]
22635 -6451 -5024 -8404 -13870 -17355 -11655 -17248 -16684 -22956 -17127 -7698 -2332 7677 5848 4473 -822
22620 -822 -3372 -2479 460 -5077 -1996 5100 9466 12380 9030 7775 2643 6119 5608 8206 9056 9610
22604 9610 4371 3901 12514 10714 6172 2979 6318 11946 13628 4959 -7733 -10615 -1775 -140 -6358
22589 -6358 -10826 -5471 -2726 -2209 -686 1351 857 3877 -284 -392 -2425 -8536 -7570 -5192 -1825 -4929
22573 -4929 -11815 -9323 -9422 -5733 -4862 -8311 -7861 -5827 -6483 -4829 -2818 -4860 4663 1997 -497 -942
22557 -942 1094 5890 9389 4565 -1388 -3756 -2661 -3266 2098 2784 -97 -3941 -4013 1637 1099 -3068
22541 -3068 -12584 -12918 -3795 -2801 1879 2519 3352 10121 13077 4014 6343 10306 -1509 -6808 -980
22526 -980 -3164 -3317 -1394 -4636 -6124 -7017 -10335 -4087 991 -602 -1680 -2509 -5785 -3461 6717
22511 6717 10026 8391 5083 7495 8227 3347 2112 -1086 -2696 -1538 -10048 -10615 -12652 -7961 1339
22496 1339 2849 1248 3100 985 -6956 -9411 -1608 3444 2120 -3421 3255 8246 6310 5000 204
22481 204 -9972 697 8403 -735 2656 4661 1361 -1072 -1329 -917 977 3971 1577 -2568 1521
22466 1521 7129 7522 4639 4316 5239 1014 -3613 -8899 -3855 -4592 -4361 -143 -2623 -7473 -12615 -5983
22450 -5983 659 -4419 -15371 -11088 -9682 -4702 -5841 -1554 2053 6842 12288 16756 12108 4483
22436 4483 2420 5786 4766 2446 2424 -4047 -7635 -10397 -9052 -7724 -7768 -2478 2723 -3525 -11675 -13329
22420 -13329 -4455 2633 6704 12737 7791 829 554 4414 2638 9691 12197 14059 6936 3981 3537
22405 3537 425 -1197 -3735 3466 44 -7698 -13940 -12664 -1422 8236 8959 8982 5716 4946 3488
22390 3488 8887 15211 13378 15363 15700 11474 9494 4969 7472 6730 -3787 -4501 -8190 -19837 -14333
22375 -14333 -12863 -13275 -11398 -6339 2413 5614 4631 761 -3138 5341 7878 1314 -1323 -1041 4015
22360 4015 4982 -2484 -4269 507 5845 10729 18960 21237 21016 19857 11822 10629 11551 8195 3285
22345 3285 3338 2447 1226 -3099 -1142 4360 7640 3988 2431 5909 109 -1167 6877 8177 -1482
22330 -1482 -9517 -10543 -5826 1674 653 -2844 -219 -2967 -2950 -2557 2018 5591 773 -898 1897
22315 1897 -1712 -9029 -10234 -3216 6456 11380 7761 621 1204 2396 2256 -3705 -365 2912 5806
22300 5806 4552 4116 -4867 -6971 -8215 -8271 -8178 -7857 -6072 4165 1688 1258 -1422 -5927 -9452 -8537
22284 -8537 286 -1605 -1204 -519 3357 2650 -453 205 -8005 -1229 8081 9795 421 -2844 -6018 -6194
22268 -6194 -1408 2144 -2139 4105 7761 3867 2798 1716 -817 -3927 -4351 -4308 -5285 -748 -248 -4220
22252 -4220 -4100 -3849 1663 10508 12347 9163 1039 5931 7993 8224 -112 -2754 1870 -3713 -2605
22237 -2605 6771 8733 -6149 -11342 -10315 -9206 280 1704 -991 -418 5905 4575 -4468 -9106 -12808
22222 -12808 -10082 582 6163 4195 -1469 -1290 -93 4264 2678 -3757 -6700 -4261 -998 -736 -12023
22207 -12023 -15345 -19127 -18121 -14091 -5313 -5235 -2079 965 -785 -7003 -4930 -6756 -3206 719 1191
22192 1191 2091 4231 -108 -5773 -7186 -2085 -1394 -4217 -4683 3853 7004 10113 11009 10705 14480 13794
22176 13794 12851 10570 9966 8757 4343 2484 3791 9444 6429 1378 -752 2968 4357 -1686 -4581
22161 -4581 -7959 -2496 -2655 -3606 816 3430 226 -3632 -3449 -5859 -3595 753 -1564 -8131 -7362 -7868
22145 -7868 -13853 -15968 -12444 -944 8951 5329 5586 6360 -78 -1221 -2875 -286 6145 11752 4562
22130 4562 -530 -2151 -582 -1237 -3511 -2782 651 -3740 -5651 -7373 1098 -1078 -4784 -8044 -10204
22115 -10204 -7530 -5550 -4476 -4639 -4705 -5650 -9673 -9422 -5699 -8506 -13239 -10333 -6836 -6009 -5655 -5476
22099 -5476 -1068 -2080 -10580 -11113 -3627 -5168 -6363 -6699 -3349 2036 4959 507 4414 4686 1859
22084 1859 -4297 -450 1870 -4695 -13638 -18728 -17880 -16047 -16329 -13251 -11314 -12500 -14732 -11411 -1965
22069 -1965 2254 2092 1933 -3837 -12686 -11594 -4453 189 -3542 -1551 2857 -2945 -7200 -1777 1500
22054 1500 3671 3010 6437 9990 5783 8744 8900 -1790 -9238 -8822 -8458 845 3166 2214 -2572 -211
22038 -211 -3364 -3244 -2690 -1083 703 8715 4828 -5572 -9842 -5030 -4268 -2461 2055 2252 3091 -3154
22022 -3154 -7671 -9317 -8396 -9859 -8445 4 6456 5117 2798 -4045 -6142 -870 -1493 -4239 1591
22007 1591 418 -3463 -3536 -4066 2680 -1504 -5644 -6736 -13075 -13117 -6568 -4289 -8625 -3179 -4266 -13360
21991 -13360 -19316 -17396 -11448 -2024 4668 4792 2668 -1747 -2795 -4857 -2957 -13 -2802 -5853 -6878
21976 -6878 -7386 -3513 5540 442 -4541 -1953 8475 5118 -3771 -5157 -3280 3229 9785 4425 -1996
21961 -1996 -199 -1184 682 131 -6408 -3337 -2173 5884 5719 8546 10535 17563 12770 8420 14276
21946 14276 12055 11336 1045 -5339 -1850 531 3970 169 -1025 -4402 -851 -5180 -4930 -3022 -3734
21931 -3734 975 2124 -2062 -5914 -6015 489 6038 1317 7172 10733 8191 994 -6354 -6459 -1164
21916 -1164 1449 -3469 -978 4737 2170 -2793 1505 -1300 -6898 -8285 -4914 -2923 1189 11102 12394
21901 12394 6525 4150 5772 -5810 -8196 -2321 3149 5649 1781 -4155 -8163 -8741 -2510 -1445
21887 -1445 6461 9521 3774 -618 -742 -2606 -11052 -9943 -4012 1289 -5786 -4818 -806 694 2475
21872 2475 1567 -5945 -3678 -4264 -664 10571 18356 14863 7060 -744 -788 1486 1448 -3236 -4121 -4026 -8978
21855 -8978 -5408 2178 6018 1775 -6881 -8580 -6286 -213 -1742 898 9984 7248 -2991 -4241
21841 -4241 -7336 -4440 -7592 -6229 -3778 -8023 -5740 -6774 -6048 -6187 -6011 -4022 2385 5355 6752
21826 6752 9839 12870 18390 13701 12744 10569 -780 -5547 271 -3511 -5065 -188 1863 -3668 8
21811 8 5981 6468 6729 5628 3637 768 5636 4109 -2154 -6873 -4444 -25 -1761 -3068 -4741 -7035
21795 -7035 -6942 -8498 -10742 -3128 6609 4828 -3197 -7478 -9066 -4579 -1270 -6794 -7644 -6974 -4697 -6765
21779 -6765 -3293 8941 6202 -3099 -207 6336 3933 723 6453 5089 2454 6195 9010 7527
21765 7527 7508 5320 6533 6789 2608 -3577 -6765 -10438 -7456 -6739 -7518 -3987 -933 1243 6627 8212
21749 8212 3403 -654 -4131 -2398 1343 -350 -114 -88 -1562 -1148 2336 3542 1099 2632 7701 8741
21733 8741 847 -4038 -11969 112 10830 11491 10387 -222 -4065 -2388 1663 -508 4237 10761
21719 10761 10708 8730 9425 11170 6037 -2038 -7884 -5879 -2509 -834 -2153 -2058 2518 -2738 -2868 7521
21703 7521 15267 11619 2677 -3163 -3673 1240 2850 -69 -750 -9 -1718 984 311 697 -3674 -1376
21687 -1376 -196 -2020 -779 2865 4245 8391 5399 -2239 -9787 -11011 -4781 6064 4813 112
21673 112 -1469 -2100 -8822 -5012 -1538 -1290 -4048 -6782 -8150 -4701 -430 384 3201 8926 797 -5002
21657 -5002 -9641 -11571 -4317 -2558 -4035 -1626 6109 1828 -5375 -7391 -8177 -2749 5458 4578 6163
21642 6163 6697 -1585 -8557 -10147 -5178 285 6099 7563 1345 6490 12379 8255 651 -7622 -5897
21627 -5897 283 -4940 -10664 -7624 -6757 -2055 -724 -433 -8674 -6136 -2377 -9799 -9064 -2725 -3027 -6258
21611 -6258 -9673 -10933 -11291 -4407 -2020 90 -4137 -7500 -9775 -3685 6010 8328 8525 8911 6481
21596 6481 3789 3919 174 -3172 -8948 -10520 -5192 -622 1133 37 -8032 -3071 -2291 -3087 6076
21581 6076 10187 4322 955 -98 -2512 2 6876 6850 4591 3625 4327 4176 7471 7578 4256 -2938
21565 -2938 2042 10339 9983 4291 4781 4375 544 -22 -1448 -10896 -14604 -12543 -12659 -15830 -18564 -13156
21549 -13156 -15724 -13212 -5296 2724 2987 4819 -1751 -2800 1102 3184 7485 -424 -8246 1982
21535 1982 4138 3137 -314 -1851 -10757 -2648 3363 5942 701 2616 441 532 1211 5966 3704
21520 3704 1492 7038 9274 7099 6425 7911 8553 5447 6670 14123 16108 18108 18439 16538 18205
21505 18205 21158 21429 21006 13910 11744 8433 4114 -6220 -8678 -7364 -288 3955 2758 3382 8439
21490 8439 13095 13259 6424 319 -1524 -511 -1914 -3028 595 1224 2630 92 -760 84 -5438 -8866
21474 -8866 -8372 -1259 -5959 -431 3685 247 1279 2511 611 -4817 -6719 -5054 -4501 -9942 -11087
21459 -11087 -7056 -7447 -4905 -1878 -1645 -3584 -1067 -2079 -6023 -9156 -2151 -1286 -2491 -3124 -2643 -10148
21443 -10148 -9235 -4191 334 7999 4309 1813 -1360 -2342 -5045 -3317 -1503 1904 569 -351 4837
21428 4837 -45 -1188 723 -3721 -4134 1415 7382 2676 2453 1969 9151 11806 8248 3797 1537
21413 1537 827 -291 1029 2471 -2891 -3241 -2735 -3690 -4232 -3439 -1747 4024 4518 5532 4469 326
21397 326 -5802 -4658 -10315 -8720 -1866 104 -7280 -4598 1681 1778 -298 -2265 -7942 -8299 -16511 -18265
21381 -18265 -12293 -3491 6915 8722 4526 5840 2994 -4106 -4344 -1266 -4847 -11070 -11226 -3934 2896
21366 2896 9117 10615 9993 3156 -4670 -7012 -4419 -8742 -16627 -11858 -2426 -3706 -8939 -4985 -2007
21351 -2007 -2222 -1658 -4069 -12574 -13797 -1932 4513 1616 -3852 -3503 -2903 -3538 -861 -2269 -8691 -2484
21335 -2484 2325 12492 11995 4572 2474 755 -41 6788 5552 4847 6735 4769 3153 -1550 -733
21320 -733 -9743 -12823 -9718 -1624 1773 -77 -4342 -9266 -7913 -3747 -1187 -7135 -4034 2873 8154
21305 8154 4678 2775 -1240 5426 14013 10082 4105 -990 -3372 -4615 -1231 -582 -824 -4147 -2655
21290 -2655 -1347 -9353 -7119 1176 10582 7017 5295 -825 -3616 1413 6049 3637 -2811 -3418 1323
21275 1323 7888 14608 11127 -327 -1129 -1859 -4811 -1553 4639 8060 9233 8550 7106 3319 2421
21260 2421 4941 -1967 -9033 -9776 -3564 4471 6540 6882 4956 7797 3151 4770 10017 9035 4051
21245 4051 -4206 -2681 -1136 -2722 -9433 -16007 -14531 -11847 -11626 -6566 -2545 5502 6159 -320 -2034
21230 -2034 -210 -34 1412 6117 13952 12818 9073 10745 12050 6969 2298 2814 -2015 -6438 -8906
21215 -8906 -3287 2397 919 -6837 -10657 -7156 -1220 2510 1321 -160 -4244 -2257 -302 1831 990
21200 990 -2494 -8409 -10130 -8640 -4655 -3745 -3024 -2480 -2630 -9158 -4040 -750 3812 4928 319 -7603
21184 -7603 -7492 -227 2096 -2 -3235 -2760 -4033 -1519 -2319 -1468 -2313 -5316 -3276 -252 3236 6820
21168 6820 3635 4392 2567 8222 8359 3538 7742 3813 -5720 -5069 3816 4191 8356 8590 10509 13099
21152 13099 7864 1187 -6621 -6026 -6544 -6698 55 3492 11459 13941 10073 4145 -3186 -2578 -280
21137 -280 -8466 -6587 1629 5948 2438 587 3679 8787 11501 11173 7567 2762 1613 1793 4933
21122 4933 7767 5193 8975 12323 12498 6973 3312 -737 -2665 -2513 2762 10796 8296 7298 9780
21107 9780 6271 3009 127 -826 284 2445 1777 905 7447 4393 2346 3672 5022 7443 15391
21092 15391 13441 11061 9318 9784 5180 6768 7959 4278 5575 -3069 -5925 -4294 218 3497 6989
21077 6989 11626 4381 -638 -5313 -5814 -2457 -561 -6021 -686 2137 5750 11756 9241 7633 6686
21062 6686 7453 4314 -5042 -2581 3114 1066 -2411 728 1854 -6895 -11304 -12856 -4289 -83 4404
21047 4404 6972 11880 8537 8046 8569 12463 12844 11172 4756 5734 11282 9058 11470 9247 2827 2070
21031 2070 -998 -6306 -6477 -131 -2450 -2785 3402 11067 12491 6415 2584 7526 730 -5172 1639
21016 1639 8815 12984 16971 11629 6132 10950 16410 20148 22923 36261 41912 42908 54769 70785
21002 70785 89991 100470 106020 105138 97480 76461 60825 46734 34839 26553 15431 11824 12854
20989 12854 13169 10720 5143 1532 5735 10437 15189 16788 8922 5839 4361 3416 6920 7954 1579
20974 1579 -1452 -1071 -3837 -2685 7423 13624 8835 9875 13774 12129 2689 -2608 -2572 2464 8284
20959 8284 8966 7694 -1478 58 4687 5730 4922 4439 6594 6348 5092 6623 6343 4872 8744 16326
20943 16326 13195 9504 11038 13468 12167 14522 9880 1088 -957 4386 5075 6936 8043 11465 9868
20928 9868 7064 3792 2155 261 -5655 -1816 4333 11992 12198 13097 14451 10027 6631 1867 5869
20913 5869 5088 3877 5012 8425 16068 15270 13370 11665 4605 8890 10572 9727 16855 16562 17047 17168
20897 17168 10689 4278 632 9405 13959 15562 19442 27566 36313 38546 40393 36836 37466 36996 44944
20882 44944 47290 46070 45899 52897 57996 54551 56785 63044 65831 61021 64136 61483 65270 72113 73761
20867 73761 74125 77120 84608 91591 93209 91354 98623 104259 108191 117010 121072 137205 159093 169097
20853 169097 181827 211230 250193 285436 320514 379596 457141 543111 653054 807991 1029642
20842 1029642 1352260 1799324 2343261 2959859 3588374 3993420 4183972 4156012 3760756 3201061
20832 3201061 2579711 1952403 1429922 1034243 757764 570105 448627 361066 292836 248489
20822 248489 210994 178940 153882 140074 119448 102383 91087 87428 83267 72404 62113 55844
20810 55844 53072 45559 36987 33659 32092 29095 28302 25117 23237 20400 15894 13782 15337 15324 20377
20795 20377 20782 16320 29819 42940 43399 37272 32334 22566 17311 13535 8836 11307 10688 9136 7359
20780 7359 8005 5491 5117 7385 6465 2202 -745 -5340 668 5172 -1551 4148 800 258 760 -4766
20764 -4766 -11288 -16015 -15715 -7681 -6413 -11566 -15969 -13104 -5714 -3724 -1125 848 -3702 -6130 1639
20749 1639 4233 -7022 -9253 -4924 3161 5419 4627 5831 6635 2459 -2529 737 6084 9871 17896
20734 17896 17510 5618 942 2680 5628 -1169 -6294 -5031 -3646 -3641 -1237 -1654 -4492 -10474 -15533
20719 -15533 -12848 -10588 -5879 971 -1123 -6101 -8873 -10263 -7224 -6198 -4099 -1766 714 899 6370
20704 6370 6905 -1679 2115 7241 2012 -2286 -9282 -3926 5106 7450 6324 3425 5419 15207 15646
20689 15646 10768 -131 -3220 -5850 -1793 -2935 -618 -40 -6829 -10813 -14677 -8332 2952 3929
20675 3929 2582 3425 -4652 -13876 -8697 -2664 4697 7363 303 -1115 6176 13226 11175 -766 -10404
20660 -10404 -5187 -4838 -9673 -11300 -19814 -16296 -11661 -12774 -11686 -8483 -6818 -6977 -8111 -5311 -4002
20645 -4002 -3361 -5601 -8503 -3559 -3104 -1473 -1824 2581 -2421 -4867 -3978 327 -409 -2917 -6786 -4785
20629 -4785 -2594 -9387 -9174 354 -3373 -1472 530 1341 7991 5987 -3550 -2447 1968 3255 3302 1636
20613 1636 -8516 -13765 -16090 -8949 -5379 -2856 -1301 2944 2015 639 -2740 -1653 3774 867 5267
20598 5267 9010 1729 -5040 2245 7643 609 1626 1468 5203 1639 297 -6261 -10718 -14554 -13341
20583 -13341 -10530 -6327 -4650 1309 -1226 -5061 -6032 -5967 -4873 -4621 -5427 -4946 -996 -1981 -4109 -2682
20567 -2682 -5623 -13621 -9402 -6043 -2135 -4056 -57 3470 4270 1349 -3739 -7683 -3834 1278 424
20552 424 -1835 -1376 -726 -2309 -366 6931 16903 11477 7465 513 -2591 -5010 2804 9529 -1761
20537 -1761 -5290 -5815 -11415 -5023 -3918 -7686 -6092 -6968 -4514 -1413 4327 4829 2593 4154 8640
20522 8640 2772 1305 2048 -4647 -1148 -3867 -6704 -13474 -14837 -8012 -4122 -6534 -9011 -7572 3257
20507 3257 5208 176 -2317 -3117 -2617 -3552 1481 -2937 -6272 -9604 -4994 2101 -3359 -2708 2402 -1223
20491 -1223 -5097 -9324 -10428 -6277 -2859 -4384 109 3261 2884 -2040 -3541 1361 9150 14745 6904
20476 6904 -2271 -3231 -2382 466 798 3574 6728 1687 -1854 1222 6079 4282 -2294 2332 1463 2583
20460 2583 9735 8796 1647 158 2740 4326 8220 5127 -2717 -736 2749 -1147 952 8596 9509
20445 9509 14164 17923 20346 24042 28953 36713 48449 67494 92172 104435 106959 100116 82771
20432 82771 65337 47418 36673 27410 16688 8337 4748 6372 4311 -21 -1029 2574 8160
20419 8160 9077 11357 6603 215 -250 -3124 -7262 -8380 -5358 -5599 -1784 3344 8214 6460 3256
20404 3256 -1395 1101 3274 2909 4254 6533 5571 4811 1112 -6197 -1649 1832 3154 3479 -6555
20389 -6555 -9889 -11507 -15428 -12860 -6727 -3074 5682 -2603 -7400 -4626 -5013 -5774 -7549 -3672 -1241
20374 -1241 -6479 -1919 -1064 -7678 -17722 -15880 -10540 -7150 -7469 -4887 -3781 -5151 -255 0 4667
20359 4667 6800 4011 -861 -7063 -6645 -8481 -8180 -3561 868 2688 3123 1727 -3096 -7849 1489
20344 1489 -4008 -4038 1733 9686 17678 12253 7945 6755 -314 -479 104 -4660 -3818 -2919 1842 -4260
20328 -4260 -5705 -9 2011 3503 4678 5 -3447 -3607 -2005 -8610 -5829 3574 7292 11399 8945
20313 8945 9545 8137 6910 7613 4010 3924 -678 -1682 2771 6215 7458 635 -6832 -4113 -7649 -3024
20297 -3024 212 2710 350 2943 -530 3127 5576 11256 7621 1065 3194 6364 5111 4313 4620
20282 4620 5515 10375 4244 264 3470 3894 4608 3685 3264 582 -26 34 929 -1072 -2969 36 606
20265 606 732 882 3166 -1488 -4720 5305 1174 -2107 -2281 -6566 -11267 -16301 -12736 -8406 -2050
20250 -2050 3032 4276 8986 8209 9504 1005 -8161 -1107 1615 -1338 -3789 932 5768 5201 1115
20235 1115 -2777 -4234 -8959 -2961 1171 3915 7596 12595 10620 -1236 3595 7692 9527 4574
20221 4574 2568 1290 1 -1072 159 4366 1744 -962 2054 1836 -2306 -5589 -7096 -2445 2482
20206 2482 -4225 -10405 -9859 -3123 653 -1251 238 1218 -1669 -2471 -2154 -2844 -12026 -12301 -15033 -19262
20190 -19262 -16073 -11217 -4832 -3355 463 -932 -1708 -2647 -3951 -11244 -9283 -8358 -5619 -435 5110
20175 5110 2772 5101 2710 5328 4609 3038 -1023 3458 14322 9990 6659 10576 7351 6098 6967
20160 6967 7621 8776 5605 8036 17561 21564 23040 23297 23365 25397 18466 12718 13598 10946 8409 4795
20144 4795 1404 -38 -864 3060 6204 13235 12678 7848 -247 -1336 1750 7056 2621 -1038 -495
20129 -495 4775 10590 6047 4181 4683 7292 4291 -2537 -2457 2599 -5406 -11996 -12816 -13792 -12479 -9671
20113 -9671 -7129 -7221 -1774 -8135 -13131 -8838 -1413 -642 -14416 -10446 -2899 -2343 2298 -2285 -8272
20098 -8272 -5017 878 -2422 -3319 -5726 -8956 -90 6856 6390 8765 4025 -1297 -6816 -8393 -10279
20083 -10279 -12496 -14641 -8394 -1768 -6791 -7980 -7451 -1715 4729 9800 11779 920 -6447 -309
20069 -309 8990 13046 13534 13835 6173 -5559 -6359 -7035 -6720 -2911 -4216 -4534 -8472 -12698 -11679 -13680
20053 -13680 -12949 -12674 -2089 -20 -1820 -6761 -7408 -6239 461 1197 -8466 -15707 -8934 6329 4736
20038 4736 1345 -2003 -5950 1751 -5340 -12895 -19222 -15887 -15994 -18410 -4395 4044 5285 4864 1128
20023 1128 3599 704 -4560 -4148 -2908 -5773 -2847 -2669 -4413 -3477 -5073 -218 -39 385 -95 -127 -4598
20006 -4598 -4520 -2746 -8415 -11212 -15948 -13871 -8912 -8810 -4790 -603 -3875 -7320 -6883 -8483 -6928 -116
19990 -116 5988 6581 6646 -1002 689 4486 7274 9221 5469 6106 7158 7617 6940 3465 7503 3755
19974 3755 9334 11430 9629 8291 3547 9153 7164 3285 1437 -4998 -9426 -11919 -15162 -15075 -8602
19959 -8602 -4475 -6772 -6366 -5438 -2486 -5510 -12766 -15887 -9491 -2780 34 118 -6571 -12767 -11026 -10372
19943 -10372 -7489 311 7864 6555 7121 4935 7748 12183 15113 7609 1432 3384 -1894 -1373 -4274
19928 -4274 -6679 -6112 -1493 2458 -7195 -11048 -7687 -2092 133 -3217 -7662 -6115 -11548 -12687 -8294
19913 -8294 -6317 -8513 -10856 -14866 -12094 -14324 -10584 -5525 -3237 -165 903 -1290 -4393 -8274 -11737
19898 -11737 -11920 -3976 -570 -2778 5785 3847 -3895 -8088 -7562 -6939 -1942 -1624 822 2918 8012
19883 8012 8087 1639 61 -449 3008 4852 922 -8855 -10660 -6164 515 -2430 -10634 -5645 -1949
19868 -1949 -1842 -8309 -5762 -1854 -6212 -14772 -21234 -18530 -11111 2343 4839 -3256 -7659 -10956 -1291
19853 -1291 5721 9448 6551 12618 11696 6899 5961 1842 -3312 -6394 -8434 -4626 1540 5731 9564
19838 9564 7638 931 1295 -4736 -6111 -4163 -5441 -489 2763 233 -2725 -1744 -2058 -732 -292 -2279
19822 -2279 -3619 2645 8883 7178 9757 9426 3616 329 -3397 1718 6158 11197 12572 10798 4848
19807 4848 -2905 -6420 -1900 -5661 971 3188 1883 405 -810 5370 11046 5261 -2993 -11605 -4273
19792 -4273 814 1031 -7492 -8915 -4307 -7501 -14459 -15034 -8998 -8213 -8364 -2177 -5088 -6616 -8522 -8757
19776 -8757 -7303 -8433 -7047 -7366 -9922 -12912 -11001 -3545 -5359 -9665 -2074 -1856 -3104 -3193 -1765 -7972
19760 -7972 -10186 -1968 -3146 -6917 -6982 -9282 -9588 -1731 747 2542 4043 587 328 2814 3006 1472
19744 1472 3081 -870 -1207 -1325 -1101 -1284 3560 2673 501 -1462 -5932 -3672 6674 10194 660 -6299
19728 -6299 -2955 6200 2796 -7942 -11907 -9781 -11649 -8954 1869 10531 9881 -161 -5129 -3084
19714 -3084 -1247 -5308 -6059 -5596 -4400 292 -932 2746 -1978 -6978 -8525 -7556 -9886 -5386 -3178
19699 -3178 2657 -1549 -7638 -8386 -4470 -1990 4555 -2956 -7289 -6358 -12602 -13078 -5360 2401 -210
19684 -210 -7772 -8369 -7327 -7460 -6542 -5802 -5937 3453 6915 4182 9887 9758 4963 1235 7861 4957
19668 4957 4601 4795 -2469 -3932 -8801 -13995 -13522 -9847 -7582 -12532 -1088 238 -4991 -158 -889
19653 -889 -1017 -2633 -10815 -9820 -4397 -384 7055 5719 -5802 -4444 -2363 -8264 -8484 -2809 2459
19638 2459 7688 3804 5696 2089 -2252 222 3191 -2708 -91 -119 1468 -2049 -6012 -12351 -8809
19623 -8809 -5516 -1587 -4516 -7787 -7612 -10534 -11440 -8336 -5184 1060 -1379 -6550 -6208 1114 1729 4356
19607 4356 5773 -4498 -9447 -5723 -4054 -7133 -14382 -8957 1359 4697 6502 2030 642 -1054
19593 -1054 1894 188 -2702 6352 8618 8554 4998 4004 1152 -6498 -7907 -7160 -9285 -10299 -7614 -5093
19577 -5093 -3658 6774 7878 3972 -308 -3803 -5667 -5302 -8599 -9954 -6483 -8349 -12979 -9782 -5535
19562 -5535 -5313 -6152 -5134 -7696 -15849 -22908 -16764 -11833 -4737 -541 -4716 -11800 -8447 -9603 -7892
19547 -7892 -5666 -5206 -3324 2071 3651 730 805 -2074 -7510 -5619 -2046 -739 -5362 -9295 -6326
19532 -6326 -4004 -1491 2940 6601 2676 -2877 -7041 -5473 -7800 -7603 499 9655 12017 11794 12252
19517 12252 5808 -2426 4108 8512 7133 7943 4625 1411 -1967 -1737 -5873 -4158 -128 1555 -2436
19502 -2436 -6317 -4394 359 2224 2303 -1928 1758 -1260 -8136 -4190 1018 6789 3044 4282 -406
19487 -406 -5998 -6892 -4443 -3997 -8534 -5393 -3252 -915 338 -852 -306 -4611 -12311 -19778 -13705 -8126
19471 -8126 -4931 -3056 -6307 -11058 -6123 609 -144 -3344 -5939 -7499 -4994 -3305 -3661 -399 1325
19456 1325 -1258 1235 2415 2659 2358 1603 3917 7176 5568 164 -6350 -5770 -1542 -2713 1553 6906
19440 6906 6332 2758 2499 4965 4308 -1723 -4915 -4545 -4645 -3843 -5770 -10155 -3749 -3488 -7183 -5201
19424 -5201 -5981 947 -2310 -5901 93 -3887 -8253 -17153 -16249 -4726 -6594 -1456 4689 7281 2996
19409 2996 1187 3637 -2706 -4997 -1716 -106 3778 -1641 -6049 -8193 -5775 -4677 27 -4543 -3022
19394 -3022 2377 12112 9322 -1682 -869 4126 6881 8474 9621 9984 6670 8090 13804 15389 13076
19379 13076 11266 5040 2864 2344 3968 7717 8455 6123 841 -2733 -6425 -10118 -7803 -9488 -7720
19364 -7720 -1158 -1251 2239 6202 -838 -3173 -9715 -3737 -1291 -3456 -7406 -2776 -2506 -9611 -5227
19349 -5227 4592 3278 -1074 2679 6377 4335 -886 -2733 -4123 -8552 -8812 -6588 -6548 -5279 -4445 -3560
19333 -3560 -5248 -10055 -7065 -11748 -18337 -14202 -11446 -10384 -9986 -6322 -9917 -11915 -11272 -12265 -11059
19318 -11059 -9825 -5359 -4086 -6479 -4691 -2498 -3120 6678 7949 7692 6457 2554 5178 352 -4909
19303 -4909 -10615 -9019 -4567 -9498 -10600 1351 8965 -177 -8588 -9473 -13305 -15040 -3945 -3213 -8628
19288 -8628 -5185 -10908 -19201 -17998 -14376 -8378 -9100 -9366 -992 -778 1971 9002 7463 -426 -2299
19273 -2299 -7445 -13696 -4312 990 340 -1171 -7750 -1034 7652 4490 -806 2908 3617 4288 9124
19258 9124 11550 9173 4714 247 -2199 -162 -399 -4515 -4091 -6846 -10464 -11300 -11902 -9520 -8807 -4048
19242 -4048 216 -4887 -3059 -7492 -14147 -10821 -7415 -5833 -6454 -5840 -1873 -4121 -6003 -20 1471
19227 1471 1235 561 -2997 -9079 -8259 -10969 -10810 98 6466 4422 3979 2017 -4448 316 -65 -9249
19211 -9249 -6803 -11306 -6964 -1127 395 -3810 -14955 -17897 -11663 -9325 -5645 -3091 1320 9057
19197 9057 9984 6979 -3097 -5317 -14583 -11311 -4084 -3108 -4999 -12062 -17571 -13722 -10007 1429 6688
19182 6688 8033 1292 52 -461 473 3469 11239 12834 13449 14339 8587 1784 -703 -8132 -8183 -3209
19166 -3209 3719 6743 6574 -374 -2569 50 -4449 -8621 -6878 2224 2994 -502 -1337 -1006 -616 -1378
19150 -1378 761 -799 -8741 -11730 -9001 -6705 -8200 -4490 -247 1097 2250 5913 6187 3085 8375
19135 8375 14108 11216 8859 3955 3545 5071 4005 9157 4873 -4930 -11597 -10789 -6743 -9545 -9708
19120 -9708 -7059 -3185 -1722 2036 5178 4239 1287 -4019 1129 2943 7961 -1106 -845 3124 -4120
19105 -4120 -6608 -2621 18 668 -4437 -5078 -38 5223 14548 11343 4384 2074 297 -3558 -1624
19090 -1624 6328 957 466 2830 4167 -1247 -3220 -5591 -5374 -4091 -806 2977 4158 554 -4948
19075 -4948 -5455 -6733 -3664 -2279 -5994 -1509 4793 -537 -5888 -9650 -14386 -12711 -14099 -9568 -1068
19060 -1068 2331 12206 14254 11333 7355 4390 -2694 -6018 -9543 -6501 197 6698 3923 650 3261
19045 3261 4004 -1271 -9819 -4162 3188 2286 -2832 -7475 -5829 -747 10192 11380 3149 186 1009
19030 1009 -575 4096 7213 4203 -673 543 -5189 -6611 -11317 -13124 -11650 -5693 -2364 -371 305
19015 305 2009 6942 4915 7593 5019 1405 -416 -48 -1272 -5067 -7419 -8956 -8487 -7683 -3574 436
18999 436 1074 3290 1691 2586 6806 4217 5239 7928 2350 -1524 8603 12000 4969 -1142 -1213 -3342
18983 -3342 -4538 -6018 431 5742 -2268 -10065 -10126 -12597 -13740 -5564 -612 4173 9570 9668 5271 1782
18967 1782 -3344 -5747 -4534 -10741 -13205 -10068 -2819 -8485 -12062 -9770 -10862 -10360 -9196 -6117 -2963
18952 -2963 -7891 -10993 -9465 -3969 -4870 -3291 -1411 4723 6280 2365 3717 4438 4553 5059 1316 9549
18936 9549 11529 4810 -2044 -1908 -2258 -3303 -687 -2157 -5919 -3939 37 -3504 -4368 -5026 -7360 -6490
18920 -6490 -10155 -14859 -2983 6338 3149 1757 -1730 1204 1149 8046 10886 5854 3073 4715 1571
18905 1571 -5677 -4023 -8721 -3465 5435 6096 5008 1727 3147 6748 1944 -1949 -7189 -7285 -9165
18890 -9165 -4890 -3245 -996 -4397 -97 -782 -1825 -298 3637 8406 4931 2439 3943 1776 4817
18875 4817 -3557 -8124 -10804 -12697 -5647 -2408 -3742 -3979 -64 -2436 -7846 -8621 -4695 -4220 -4417 -3962
18859 -3962 1100 1537 4064 11256 10749 6113 11076 21202 23709 14960 11126 8088 5771 10427 12924
18844 12924 9745 2709 6812 9476 7954 7794 318 -5635 343 245 -176 -2974 2202 6383 5702 4653
18828 4653 7551 11840 16509 14722 17632 16849 4575 -3718 -827 -1426 -1705 -4847 -5474 -6915 -9762
18813 -9762 -6913 -8941 -14827 -17667 581 6704 8767 11127 13749 7177 640 124 1167 4376 -186
18798 -186 -9855 -12477 -11075 -7119 -7289 -13025 -15067 -5630 1160 6567 10836 2548 593 -2180 -3979
18783 -3979 -1972 -5022 -4530 -5859 -9489 -5090 -2361 -5567 -8652 -3657 -490 -2828 -7024 1055 5721
18768 5721 -1438 1371 15795 24651 37148 56168 59652 49446 36374 18580 13135 14744 15017
18755 15017 13038 5546 5671 4249 -4089 -12102 -13126 -11155 -2482 39 4385 8954 11956 2905 -966
18740 -966 2519 6213 5456 2159 1045 -1971 -5227 -125 4557 9774 4212 1494 7465 1534 -1230
18725 -1230 -6125 -3242 629 7993 10080 7362 -258 -5547 -48 -1603 -714 1683 -375 1564 -203
18710 -203 4209 4054 -3075 -7726 -5716 -6235 -6286 -1427 2774 559 -2061 959 1110 -2685 -1063 -5394
18694 -5394 -4674 -773 -6720 -11442 -8100 -6527 -718 179 -5935 -3114 -4977 4597 12000 6337 8838
18679 8838 5574 3180 4169 4497 720 3115 7440 8819 11150 19560 20595 21304 30450 41956 47472
18664 47472 63751 100971 139331 149765 141200 150701 163703 151854 121724 91292 67914 48986
18652 48986 31134 19691 14907 6446 -4359 -5646 686 139 -3873 2985 6233 8259 8188 6457
18638 6457 3783 5161 6030 -197 335 4102 -943 -1210 -3947 -3311 -2395 -9850 -12942 -15214 -10472 -6045
18622 -6045 -4566 -878 -2629 2358 7150 10292 9832 8156 7694 4491 -5093 -9765 -1541 1203 2652
18607 2652 -4587 -5455 -1261 -3550 -10492 -10135 -7361 1186 6295 -2200 -1765 -1234 -80 7819 15328 13288
18591 13288 7095 355 1145 3004 5555 7104 9601 14890 13183 898 -7598 -8421 -9075 -7205 -7676
18576 -7676 -6369 -11148 -5931 -3615 -4906 -1279 4490 5878 8241 4591 8948 15915 16826 13749 6384
18561 6384 3696 -5438 -5652 -7641 -1637 1231 4822 5998 4292 8462 3864 -3843 -1525 -416 -2084
18546 -2084 5266 9801 6729 4514 2240 3150 -6124 -7185 -8622 -9129 -1456 -3018 -8165 -11460 -12115
18531 -12115 -7751 -8915 -11554 -11992 -10131 -8398 -5123 -1314 4013 4513 -5684 -5147 -4283 -5061 -2286
18516 -2286 -1161 -9530 -4967 -6672 -6894 2158 3601 3826 6009 10913 11905 5187 6098 4042 -2320 -4832
18500 -4832 528 10354 6867 778 -1453 -3243 2110 9401 8485 1637 -2687 -2757 8799 11836 14013
18485 14013 15503 12726 4652 1235 7287 14140 18762 16121 16834 13047 9981 13351 12135 8476 4773
18470 4773 5668 9215 5652 3842 5876 1236 -1827 -8183 -8335 -6598 -8672 -8188 -7764 -3311 -2849 -1101
18454 -1101 3315 4695 6317 -16 -38 -1127 -35 3003 8241 2858 -8252 -1194 9139 11670 4285
18439 4285 8975 13092 12185 13184 15943 12619 9617 8548 7116 9421 10375 2990 -754 4520 10476
18424 10476 12176 20829 20433 11353 9200 9582 17391 22931 21640 17607 15900 20618 26877 26838 31870
18409 31870 42650 54536 64433 68985 73172 75925 80831 84288 79824 74618 69549 56608 42186
18396 42186 31679 23861 18858 19677 14361 6946 2319 1316 1546 -37 2435 3266 11174 13054 10914
18381 10914 12898 4684 -1675 1208 312 4862 7674 9460 12465 10897 9809 7380 -14 -6565 -7357
18366 -7357 -2534 1943 7444 7160 8724 5193 3052 9930 14767 17400 17237 13150 12375 19343 18786 17549
18350 17549 21750 19154 11880 10069 9647 11817 11462 15796 16575 15169 13903 10433 11076 13765 8909
18335 8909 11200 12632 5136 7960 15210 16778 12377 14189 14184 9521 7288 10014 12402 17848 25124
18320 25124 18349 14702 15021 13210 14440 18665 20892 28161 33988 43078 60348 85729 134649 181367
18306 181367 186616 189781 205389 203490 171595 132322 97763 73994 55118 35308 29041 28390 30764
18293 30764 35452 34177 28875 25265 22780 19576 24181 26685 17002 12262 16816 21835 22822 16492 14008
18278 14008 11597 12603 11522 14936 21939 23123 20330 13880 17010 17415 25912 33044 39957 40533 37842
18263 37842 34069 42479 50172 50947 49598 48072 50706 52560 56400 63146 77085 88631 82048 81301
18249 81301 97363 122561 134572 144269 165114 195604 232722 290720 395475 568200 794197
18238 794197 992326 1097190 1205981 1415024 1657151 1719152 1587853 1409256 1271506 1140712
18228 1140712 962487 748516 547794 378577 266696 194004 143624 110405 92784 84596
18218 84596 77453 71325 66025 61891 58875 50814 38402 33067 38171 33215 33590 31072 24020 21765
18204 21765 12133 10245 8399 17000 19751 18926 19483 14445 17469 22097 26812 17537 18420 23587 20872
18189 20872 16607 15328 15208 15156 17558 16825 18386 20705 20271 15503 17777 19941 10844 1879 5474 11588
18173 11588 12106 8682 11154 19859 19178 14918 22162 24278 18392 8375 12923 23363 27782 27971 25250
18158 25250 24430 29512 30300 35094 34295 39187 38878 26850 19978 28440 36369 39325 40758 37791 45685
18143 45685 55756 58353 61200 58643 53906 58709 67104 67186 75775 85016 83239 91565 103868 112826
18129 112826 117779 127481 132614 146573 159741 168096 183761 202457 216131 242788 281863 325278
18117 325278 383380 457012 538657 637528 756147 900934 1096191 1367605 1768836 2383732
18107 2383732 3416985 5326774 8729128 12222664 11492194 9255888 6740026 4293024
18099 4293024 2607969 1669989 1157577 846237 657034 532195 437772 365073 308983 272730
18089 272730 243456 206540 172152 153762 145633 133412 109866 92281 81394 78000 70103 64631
18077 64631 57544 58096 54669 56330 50425 43343 29619 24035 22956 20155 20239 14499 9777 14789 18153
18062 18153 20817 12442 7678 9035 12399 6548 7411 12964 18844 22886 23935 21253 18401 14290 12202
18047 12202 7191 5147 6285 7645 12669 16445 10399 4986 2373 6673 5339 8957 11391 13693
18033 13693 13659 9088 7047 -1089 -5377 614 2974 -1879 -5860 -7872 -5593 -2309 -1129 1724 2052
18018 2052 5657 2066 -5492 -6043 -1527 -1533 -2140 1393 3142 7309 7598 4945 -251 -6480 -7788 -5854
18002 -5854 -3596 -3181 -10792 -8914 2884 7524 11052 9674 12053 12736 3320 -4331 2109 10143 8969
17987 8969 3523 -318 -5757 -1484 2399 -2070 -2759 -3539 -5513 -5447 -7166 -2390 1128 -1545 -5827 -1863
17971 -1863 -1248 -2518 -1694 -2332 -4511 -4245 -8550 -7393 -2083 289 -2718 1103 9199 4747 2402 3597
17955 3597 7820 5025 8106 14351 17873 12201 8363 6823 -3837 -12351 -8472 458 -720 -260 2471
17940 2471 859 6634 7215 188 -4271 192 -1451 -2270 -3789 -9247 -14319 -7930 -6540 -5281 -6622
17925 -6622 -10087 -3877 644 4751 3995 -1619 -4890 -4284 -6306 -3040 437 -4008 -1806 1214 463
17910 463 -845 3092 1759 -1987 -8508 -10966 -9247 -6503 -3295 -990 414 1618 4579 1889 -1424
17895 -1424 2676 3298 9277 1441 -3293 -4744 -3410 1066 -571 -6116 -1195 3968 -2362 -8840 -4132
17880 -4132 1014 -3725 -8865 -18118 -14231 -2374 9102 9910 -786 1315 156 1201 703 -4370
17866 -4370 -8946 -8957 -8849 -5216 -412 -3112 -1392 2128 6742 11452 6909 305 -2946 -2360 -1194 -4422
17850 -4422 -2476 633 1596 3359 5661 3136 597 7447 2237 2405 8153 8595 7885 5306 3962 -154
17834 -154 -7150 -10055 -8773 5111 12933 14222 13589 6218 1077 -80 1435 1906 -477 -1544 -5107
17819 -5107 -10170 -13512 -8641 -9624 -3940 443 4753 9059 2725 3185 6000 3017 -2316 -2882 -10953
17804 -10953 -11790 -12775 -11378 -4687 -3654 -6260 -247 8077 9763 9921 2403 -4376 -7791 -2225 -2277 4030
17788 4030 5909 11736 10111 -1882 -12480 -8787 -12095 -14789 -12552 -9897 -4903 1799 -28 -2359
17774 -2359 -1100 -6397 -6387 -1824 -7293 -3282 2392 5522 -1123 -3344 -917 -497 -807 794 -362 -236
17758 -236 853 -2778 -2911 -4596 -1349 5974 -612 1742 -28 2180 7832 4340 -711 -715 -4321 -10414
17742 -10414 -6151 -7518 -9357 -8027 106 3755 -6010 -6573 -496 4616 2347 -11154 -11604 -3447 -1970
17727 -1970 -2715 -1732 -813 -3802 -3021 -3563 -5309 -7017 -6905 -1963 -421 -1980 -1060 491 5089 6310
17711 6310 1754 -1568 -2024 -5865 -6215 -296 7729 8878 5969 -1926 -2120 3646 10159 9798 7949 5518
17695 5518 -530 -4343 -5840 1544 3550 -4933 -7071 -8625 -5242 -8973 -12632 -9274 -3300 -678 -9822
17680 -9822 -11526 -7746 -13518 -13470 883 6577 5124 -768 -4940 -5026 -2540 2594 2852 -466 -287 2047
17664 2047 6414 11694 5928 78 -3766 -7024 189 5356 -2492 968 978 -1706 -1349 444 730 1911
17648 1911 687 2783 2644 8209 9305 11021 13205 7648 791 -3448 -3643 -3926 -6020 -6248 -1018 4313
17632 4313 8405 5638 -1049 -1761 -7813 -8587 -8822 -10324 -5569 2802 178 732 2726 141 -5887 -2651
17616 -2651 -1916 -2266 -3615 -4610 -1826 -1940 -4420 -7048 -3674 -967 -1123 1986 -1476 8190 18212 10809
17600 10809 3933 1956 -6770 -11758 -3299 9936 12017 3535 -5300 -6602 -6234 -974 6918 5168
17586 5168 -3133 -4313 -3198 -7459 -3486 576 1267 69 3971 5643 3165 -1258 -1764 9274 15611
17571 15611 17571 23612 22701 22563 37955 72046 101579 114934 123156 123200 99309 73255 52105 38937
17557 38937 31256 24662 11723 6164 6904 1220 -2108 -4127 -3226 349 2261 -3922 -5631 -1273 -1122
17542 -1122 -3201 -6391 -5117 -2946 317 1997 -4578 838 4372 6539 8014 7994 3058 479 1501
17527 1501 6773 4940 8451 10969 17718 32169 59680 100769 130959 137439 143161 126784 102893
17514 102893 80650 55495 33976 31187 21250 16199 8025 4696 109 -5367 -8343 -5540 -5739 -2248
17500 -2248 6675 2684 -1017 2297 1225 -2395 -1811 -2817 -1242 79 -469 -5475 -9737 -7252 -12319
17485 -12319 -9526 -6602 -2581 -6633 -12043 -15082 -15951 -12022 -7989 -7281 981 10203 5981 -1323 -772
17470 -772 -5665 -5451 563 1111 -760 -345 -983 3310 7142 4246 -915 -4744 -1516 3568 1722 2749
17454 2749 2532 5889 4318 778 -1610 8176 20590 20338 14395 10254 13316 15191 17686 25996 28618
17439 28618 37448 62841 90520 82060 69575 54679 39260 29137 25521 21646 17548 18770 19110
17426 19110 10882 13203 21183 26332 23856 28311 36515 42059 41080 36906 32517 37147 37709 34264 31729
17411 31729 36579 49449 67498 83777 98710 103828 102486 109668 120994 134445 155575 180982
17399 180982 219772 267652 339857 432070 580373 855195 1369510 2189001 2661317 2294429
17389 2294429 1822364 1266289 795330 504519 345569 252437 194583 161248 139487 122162
17379 122162 108099 107188 131910 169488 194758 186925 189478 197792 185612 154892 128504 93600
17367 93600 62192 39442 26551 22541 22579 16449 21267 25343 25903 19098 14820 18961 25432 28547
17353 28547 31114 37191 32584 32342 44778 58366 76071 108775 156198 184626 174760 173388 187619
17340 187619 185231 153662 125487 92273 69377 55805 49619 64738 74349 69281 53141 29549
17328 29549 14164 3891 -2776 -2745 2582 1242 741 -1710 -3066 -3312 -686 5076 9826 6196 2221
17313 2221 877 -1641 -3501 -3165 621 4463 -2972 -8357 -10623 -8598 -7647 -547 -1222 1866 -2929
17298 -2929 -2765 -7406 -8144 -10434 -14161 -15166 -16137 -10236 -11498 -18522 -12783 -4899 -9618 -8202 -7787 -7822
17282 -7822 -1186 -2023 -2520 1616 -1763 -6595 -4014 -99 -8857 -11412 -2301 -1228 -961 -3361 -1744
17267 -1744 -2081 -6062 -8009 -11739 -20760 -15754 -4674 -2097 -1728 -5856 -12743 -14406 -12607 -15685 -15756
17252 -15756 -13989 -7672 -3781 -9179 -7936 -7986 -8870 -5150 -7399 -10741 -7963 -419 3200 -613 -4834
17237 -4834 -8187 -6433 -13077 -14673 -8924 -9312 -10598 -12584 -11467 -5311 -2242 -5438 -10994 -8084 1099
17222 1099 3990 -551 -279 -731 -4421 -4531 -5499 -14702 -21055 -12447 -4624 -5678 -7534 -12291 -14404 -14200
17206 -14200 -11797 -7306 -6659 -3788 1305 3309 6864 2732 144 -668 1077 4233 8000 7887 876
17191 876 -6079 -9567 -6212 -7168 -9981 -6141 1799 5855 6337 4324 -2879 -5709 -4695 -679 -5288
17176 -5288 -6013 1986 2963 48 -2809 -8866 -7104 614 2055 -2120 -2911 2991 8613 8963 9791 10586
17160 10586 648 -4953 -7551 -10612 -11742 -7710 -12508 -20716 -23623 -15221 -5680 -4865 -5056 -2988 3871
17145 3871 8784 4696 3185 7536 10360 9343 -3918 -4594 2207 5170 1313 -4377 -3066 -3014 -3777
17130 -3777 -422 1507 -2190 -787 1641 688 1039 -1424 -2920 -3460 3020 4879 1193 -295 2691
17115 2691 -4466 -9018 -4346 853 953 5563 9826 8435 5988 3282 11314 6334 3721 5456 1902
17100 1902 -1155 7736 6726 -4167 -11476 -8950 -1370 -2924 -10142 -9824 -9425 -3979 -6344 -8278 -7220
17085 -7220 -53 2681 -1128 465 1717 2911 1047 -4842 -5618 -6929 -12040 -8426 -11738 -5322 2734
17070 2734 5387 -3528 -8276 -9028 -10470 -13873 -8826 -7846 -2682 8778 15739 10222 2778 -2921 -6372
17055 -6372 -6046 -9095 -6738 -6751 -1256 -3708 -5617 -3328 -4628 -4119 504 -358 -5001 -7128 -11557 -8959
17039 -8959 -7238 -8623 -10864 -13547 -14347 -9881 -8871 -3835 4329 7890 7161 4244 4873 -835 1508
17024 1508 -4721 -12674 -9813 -3878 1278 -2785 -11482 -4096 4698 3398 3309 6410 751 -3082 -2259
17009 -2259 7183 4381 2922 4504 10903 6305 -1461 -8585 -15414 -15318 -8587 -12708 -14449 -11616 -7104
16994 -7104 -2452 -5071 -3389 -1325 -1853 -1933 -267 -967 2346 708 -10476 -18523 -16691 -10302 -5812
16979 -5812 -3993 -3631 -620 2111 2423 11 -3408 -5429 -5999 -7237 -357 5232 5705 -1834 -8598 -4725
16963 -4725 -5524 -6211 -7901 -6252 217 -3544 -1542 -3509 -5370 -7958 -10562 -9618 -9414 -8056 -3876 1022
16947 1022 1438 -2381 -11396 -21124 -18224 -5686 3634 -1082 -2807 1654 5921 4978 2216 243 6961
16932 6961 12782 10292 11493 6415 5969 9091 6284 3483 1623 -3325 -4578 260 845 5637 660
16917 660 -1908 6354 11075 7831 3177 -3401 -7882 -5513 -763 -3932 -8428 -6511 -8125 -2017 6802
16902 6802 10485 6185 8050 5040 5850 6554 -1073 -1877 761 6574 10430 12600 12969 12379 13792 7107
16886 7107 2834 -1498 -12580 -11405 -8386 -6880 2234 3855 -1720 -2153 -912 -1493 -6903 -4884 772
16871 772 -2057 -9186 -7450 -2015 3938 2489 -1755 -476 -3303 -5439 -476 5581 17027 14345 15694
16856 15694 13101 11718 12698 11865 6604 -501 -9579 -7550 -794 -1559 4739 1469 -1252 -3746 -4256
16841 -4256 -7659 -9798 -5011 -1147 1342 2801 3868 1529 -5726 2865 7891 10242 7119 7064 8268
16826 8268 12902 16000 17430 7195 -5079 -8776 -9242 -11656 -8936 6569 6700 2422 5150 -2426
16812 -2426 -12013 -17698 -13969 -3787 -1008 -388 -6100 -1971 -3586 -9407 -11725 -9500 -764 4694 4196
16797 4196 2196 -857 6582 6044 1625 1399 -5737 -6200 -12172 -9871 -2434 -139 -918 -1594 -3808 -3885
16781 -3885 -6616 -4130 -5476 -6757 -5973 -6903 -10439 -9613 -5680 -2755 -10287 -11854 -4056 -59 2295
16766 2295 2333 2936 4377 3912 7669 -1710 -9470 -10928 -10771 -4525 55 -2081 -11591 -17730 -15446 -7289
16750 -7289 -8448 -9605 -11191 -6157 -3754 4171 1312 -4037 829 -2769 -6066 -10267 -12656 -11382 -3655
16735 -3655 -161 1299 4586 -1080 436 5787 5219 3437 2655 396 2755 9142 11085 7553 2557
16720 2557 -4643 -7625 -9034 -6635 -11106 -5410 -1402 -838 -95 -10393 -5675 377 -1448 -3974 1667
16705 1667 9006 15533 16137 25845 40182 52117 61004 55487 39762 27841 23459 20465 7461 -2210
16691 -2210 -5595 -2725 -370 7521 10593 6638 7981 7916 -1372 -8120 -13252 -14621 -8977 -1095 3560
16676 3560 2343 -3601 -15035 -20239 -11926 -3349 -6808 1194 6096 -1821 -8059 -4603 -3231 -7576
16662 -7576 -13446 -10694 -4093 -12414 -2276 2311 6130 6114 3254 4763 -1333 -12647 -11304 -2814 -6021
16647 -6021 -8468 -6043 -4436 -2284 -5306 -6416 -14129 -14150 -2121 3037 -997 -3891 -6054 -4419 -4634
16632 -4634 -6734 -9976 -11888 -4788 -246 -4903 -4888 -5805 -8649 -15449 -23548 -14484 -3797 -3045 -92
16617 -92 7252 7394 1469 -5423 -5441 4802 7500 436 -525 -357 2997 1726 1087 -2175 -2167 8180 9291
16600 9291 4788 956 288 1270 -2058 -963 -5180 -12038 -13108 -10530 -4946 2505 -3785 -6300 -6174
16585 -6174 -9438 -2983 2676 4496 3563 3468 -291 -3689 -2785 -5805 -8585 -6767 -6834 -3104 -2001 4772
16569 4772 5544 -2622 -4295 2079 1110 -6243 -7462 -4617 1091 -2894 -1211 -2788 5621 5570 0 -3235
16553 -3235 -5128 -5158 -3274 2717 7100 7936 -549 -3044 -7521 -6903 -8823 -7450 -6046 -2864 6080 3766
16537 3766 -870 -187 -776 982 -5782 -8830 -7018 -2589 -724 -5046 -2134 -4655 -10137 -3941 -7128
16522 -7128 -6041 -4156 -4758 -4876 -5348 -11441 -21649 -28134 -21308 -17387 -20909 -17717 -6316 1866 3083
16507 3083 3816 190 -2917 248 1835 304 -6216 778 3492 7134 14430 17652 13320 7229 -938
16492 -938 -4723 -7423 -5612 -3874 -4498 -5187 -4031 -846 3387 3430 2314 1235 336 207 -1299 -9351
16476 -9351 -17818 -22268 -16289 -12142 -9409 -6871 -12111 -13475 -14284 -20912 -23634 -22549 -16335 -14887 -10736
16461 -10736 -12972 -18778 -15937 -10198 -3450 -10413 -11796 -5886 -4735 -942 -5935 -6575 -939 2583 4674
16446 4674 7207 -6570 -13803 -12213 -7817 -9045 -11398 1851 8631 -2162 -10065 -11753 -6440 -3174
16432 -3174 130 2047 -2550 2830 5364 5771 257 262 306 2994 1658 3798 -383 -5793 -6270 -10067
16416 -10067 -8764 -6294 -5635 -3073 612 -2952 -11931 -13097 -2338 -1395 971 7324 -889 -1160 -56
16401 -56 -4921 -6852 946 3502 2812 604 1268 4487 7713 1704 -1689 8485 10321 6973 -2290
16386 -2290 -2548 3939 1788 7995 4895 2943 9315 9605 6521 5872 -5385 -11143 -11669 -9965 -8923
16371 -8923 -3127 -424 -3895 -9134 -10264 -6720 -4429 -5568 -4399 -2353 2002 5422 11930 10029 9462
16356 9462 2399 -3732 -2108 -494 -4136 -7378 -12713 -12222 -8048 -11771 -11282 -6531 -1551 599 1888
16341 1888 325 -8916 -13676 -8789 -970 -4313 -7077 -13073 -9533 -4825 -4551 -10799 -13412 -7121 -5927
16326 -5927 -5442 877 1839 1374 2217 -1680 -3653 -559 11774 13185 4843 4032 -1105 -3231 5336 7348
16310 7348 2968 325 5034 -2364 -6848 -6544 -12825 -15175 -13796 -6889 841 183 -2331 -3459 -1694
16295 -1694 -5540 -14203 -11485 -7346 -785 4086 5366 6930 8733 6723 3991 3922 -4135 -10574 -3136
16280 -3136 3962 -390 -8474 -2758 280 -5420 -5645 -4498 -7100 -7372 -5874 -2773 -6387 -9348 -16637
16265 -16637 -21395 -10355 -3654 -785 -4268 -3948 -827 2133 52 -5125 -2575 -1495 -4893 -8117
16251 -8117 -16089 -15972 -9872 -2935 -7530 -9153 -4341 -1207 -245 -2980 -615 -3100 2290 7280 1669
16236 1669 -351 -694 3437 891 3863 -2924 -847 564 -2944 -8307 -10067 -9447 -7286 -4969 -4690
16221 -4690 -1228 -1457 -12016 -18540 -20288 -16101 -8280 722 6719 5531 -922 -3642 -5286 -11361 -5054
16206 -5054 -4333 -7989 -4827 3118 6108 7597 -186 -6752 2484 -2063 -5981 673 -3762 -4233 -753
16191 -753 901 -1205 -5097 -258 -3615 1653 6387 2579 2927 3367 -2985 -3139 -1203 -556 -2326 -4220
16175 -4220 -3772 -4633 -7012 -7361 -5310 -6356 -6697 -7745 -7046 -2205 -1792 -5448 -5951 -2356 -653 -676 -1543
16158 -1543 -6405 -4252 -4655 -8753 -5801 1674 -3805 -6273 -5695 1024 10820 8603 1681 -1463 77
16143 77 4283 8804 6491 9519 7436 5345 -1853 -8923 -3492 3992 7697 -1137 -8533 -2855 1001
16128 1001 -2896 -5201 -8661 -10414 -4936 675 -847 -3079 -2967 -3470 -1251 -2777 -1782 -6261 -3163
16113 -3163 -3576 -5079 -6652 -6158 -7526 -7633 2243 8462 11172 10437 2712 104 -2493 -11302 -9323 -5924
16097 -5924 -3136 -7150 -14604 -16207 -10022 -4491 -1410 3155 1504 1504 -9857 -14561 -7817 -4422 -1815
16082 -1815 -4544 -5199 -4585 -4489 -3456 -2502 -2894 -2849 -4145 -4441 -4300 -5166 -5137 -6539 -5032 -4389 -6006 -8572
16064 -8572 -13159 -7209 -1437 2199 -873 -693 7403 -1967 -15926 -19240 -15377 -13710 -13887 -12287 -12892
16049 -12892 -9512 -6125 -5117 -2897 -2194 3948 8675 6436 4820 2847 1301 2535 3011 1768 -700
16034 -700 -564 4212 3101 1454 208 -145 8826 10755 10418 5533 588 -2399 -3855 -6699 -2047 159
16018 159 821 -980 4026 386 -11615 -7948 -2376 4350 -1196 -12537 -13873 -13861 -13218 -10739 -16693
16003 -16693 -10018 2404 5856 2202 2602 2020 -2938 -3792 -8041 -12799 -13253 -7748 -2148 -157 -3640
15988 -3640 -10659 -16175 -17141 -12826 -9101 -5091 -4057 1483 756 -6579 -7341 -2309 5971 5699 2771 855
15972 855 -2350 -1653 284 6729 6633 -4693 -9352 -5414 -8234 -5043 92 -4580 -10010 -10217 -12151 -7704
15956 -7704 2996 1319 -1887 -1487 2670 -4548 -6654 -6627 -8548 -8699 -2678 -8370 -14452 -9178 -3627
15941 -3627 -4826 -6867 -4680 -4014 -3297 -4384 -1099 -261 -1631 -2814 -2430 -1494 315 1843 -4050 -8594
15925 -8594 -15130 -11315 -10963 -12456 -6989 -3418 -3793 -10677 -10837 -13584 -19651 -11653 -4667 -7903 -3475
15910 -3475 2782 5291 7532 -4913 -9379 -3478 -721 -7795 -10309 -8132 -4928 -6147 -8899 -10181
15896 -10181 -10385 -13175 -14705 -12620 -11466 -9064 -9483 -9795 -7572 -15968 -16986 -14764 -10653 -8736 -14161
15881 -14161 -14457 -13487 -14014 -6760 -2460 -480 -4008 -1797 8678 10282 5838 6124 186 -5150 -6570
15866 -6570 -7323 -6700 -5187 -8757 -9033 -3768 -6150 -15163 -13666 -1843 2782 1498 -6371 -9527 -8425
15851 -8425 -7453 -2228 399 1614 2298 914 2087 6052 9340 1422 -1110 3811 11964 4440 5168
15836 5168 9043 4221 -1665 -8132 -12339 -9787 -8779 -618 1903 -1411 -8319 -7269 -4500 -2070 -779
15821 -779 2961 2427 13129 6844 -4163 -2818 -511 1390 1327 2662 7254 -2841 -8119 -2481 -4605
15806 -4605 -8994 -6317 -5108 -3259 -9009 -6937 -3407 -11142 -12997 -8754 -3614 -307 -400 -1340 -1433 -940
15790 -940 2666 3704 6285 -557 -3691 -5649 -4560 -1582 3016 -2163 -7854 2374 4612 4291 8125
15775 8125 13819 8734 4869 5241 2859 -689 798 1988 -2169 -7165 -13882 -11943 -379 3653 3089
15760 3089 415 -3028 -5348 -2827 -4016 -6490 -9675 -11487 -11347 -11124 -7001 -6974 -2213 -5289 -8067 -4970
15744 -4970 -1910 -672 3873 5639 2615 1886 1101 4665 2946 -3997 -3742 4002 1921 -4305 -12675
15729 -12675 -12093 -4819 -3368 -4431 -6931 -11419 -8082 -9776 -14416 -13230 -9075 -3999 -2110 -3822 -6535
15714 -6535 -7773 -1529 83 1464 6859 8328 1286 -4436 -1119 -2531 3195 1104 -4105 -7428 -12829
15699 -12829 -13709 -10677 -7562 -8199 -8355 -5551 -381 -374 -5565 -9878 -9329 -5104 -7429 -5678 -1078 2666
15683 2666 4516 442 -6286 -1768 240 2195 3002 2085 3596 -777 -210 -913 -5632 -2207 2499 1659
15667 1659 -618 -543 -6349 -8830 -15801 -18644 -12325 -7086 -11677 -6665 -5532 -6126 -10225 -9598 -17751 -16949
15651 -16949 -10407 -4682 -8298 -7231 -5696 -1958 -768 4625 4888 -1378 -11533 -15397 -12177 -9387
15637 -9387 -11330 -9648 -8750 -12411 -13101 -15107 -9765 -7358 -7852 -7367 -3964 -2780 -5875 -10435 -12190 -7410
15621 -7410 -8569 -7007 -9560 -12169 -14835 -10017 -6868 -10157 -11540 -9257 -6982 -2339 -1278 -770 255
15606 255 3170 7634 2686 316 -3858 -8559 1412 4782 2409 3810 10249 10341 5955 1668 5057
15591 5057 2390 -4019 -5158 -1824 4406 3889 960 125 7278 12579 15589 7567 2144 3573 3774
15576 3774 -2806 -6353 -2659 579 3419 3350 -3264 540 7772 6774 4409 5240 8055 8424 4643 -1209
15560 -1209 -7810 -9394 -10186 -11451 -17980 -17689 -16940 -23089 -17809 -16693 -13798 -8682 1046 4224 7105
15545 7105 7551 8187 5258 -248 776 4768 4367 1962 -1749 -534 3182 -1525 -1933 4201 -1013 -7032
15529 -7032 1028 -871 -7795 -5090 385 -965 -6849 -3286 4098 6196 1383 -6286 -8986 -12356 -15104
15514 -15104 -17014 -17087 -12511 -4464 1254 -1785 888 2547 5340 3701 10787 11645 7113 -2163 -4030
15499 -4030 1543 3895 2265 1135 9198 7198 -3991 -6192 -9982 -5371 -2051 -176 4167 5876
15485 5876 1624 -2811 -7222 -11374 -16559 -21477 -21381 -14898 -10925 -10137 -6620 -7276 -9161 -7180 -5564 -6234
15469 -6234 -7550 -11557 -11211 -10801 -11769 -9438 -2669 4012 2743 5928 3551 4126 5384 6197 -54 -13144
15453 -13144 -13949 -12172 -4369 -3290 -3441 -5932 -11482 -12350 -10391 -9502 -9592 -13072 -5682 -5194 -9 89 -9476
15436 -9476 -9741 1379 5058 2718 6276 3676 1463 2392 -355 583 6583 6256 6937 -2490 -7065 -5129
15420 -5129 497 326 -2031 -11051 -13639 -15846 -16595 -11446 -10384 -9109 -4055 7857 4876 1228 980
15405 980 -3372 -5274 191 4521 3459 -245 -1630 6092 7174 -551 -9103 -7927 -5430 -5769 -8594
15390 -8594 -1235 -263 2654 5626 3026 1420 292 -659 -3382 -4686 -5052 -2370 704 3571 3518 -2908
15374 -2908 -4998 -7030 -11480 -13876 -9793 -11101 -8270 -1566 4828 8850 9030 9774 8921 2088 919
15359 919 -4400 -5663 -5127 -2805 1966 -157 -4894 -13545 -8795 837 16 -1482 1192 -1066 -7157
15344 -7157 -11436 -7408 -3743 4803 12555 8716 3104 -3406 -11485 -5573 -1495 -4780 -4789 -6031 -4120
15329 -4120 -5873 -687 -726 947 1043 4723 3948 612 2091 4892 2895 -3454 -4314 2240 880 -5009
15313 -5009 -6133 -2335 404 5594 6251 12289 13727 16345 13966 10422 5521 1134 -3366 -5380 -1932
15298 -1932 3112 1928 2819 2254 4684 -331 -9549 -9159 -2623 -1690 -886 3692 4316 216 -3533 2145
15282 2145 6532 5548 2798 1862 7517 11418 10645 5850 8689 13661 14519 13329 14011 8544 1964 -1184
15266 -1184 7327 6816 -4492 -7624 2402 14918 12086 6582 2906 3564 8077 7847 4178 -738 -7195
15251 -7195 -3190 6391 4502 1911 3083 391 -6492 -12647 -7051 1023 -2141 -10835 -11528 2806 6213
15236 6213 264 -1048 -3051 -6625 -8178 -4711 -48 -1663 -1541 458 -3446 -5908 -6493 -3267 -1626
15221 -1626 -2989 -5735 -8544 -10206 668 2921 -7928 -14546 -21707 -22225 -20376 -10949 -10013 -6870 -860
15206 -860 5173 8938 6334 -2342 -6334 -4590 -4853 -2341 -2607 -3887 -3729 -5320 -2833 1037 220 3349
15190 3349 6011 5722 -2075 -1531 -5746 -11597 -9133 -13670 -15300 -14508 -9428 -8448 -8606 -5048 949 4084
15174 4084 -2825 -3602 -3454 -8656 -4551 -518 -2429 -7970 -5235 433 -2812 -5919 -4371 -4770 -7447
15159 -7447 -3975 -5370 -5027 2642 2198 479 -2648 -9071 -10801 -4796 1179 4047 -2371 -5917 -68
15144 -68 1973 843 6566 2387 -1631 -5970 -9227 -4424 -561 -2508 -1209 11 1703 7440 2821
15129 2821 -6977 -9683 -4030 -7106 -5109 -5361 1510 5622 8107 7614 5905 1495 2008 4248 3044
15114 3044 6811 10729 10900 13418 15425 12855 6467 3190 -2712 -8824 -14654 -12396 -13970 -10842 -2801
15099 -2801 -4658 -1464 -6375 -5093 -9649 -6280 -3947 -660 -1865 -3905 -4410 -8377 -10484 -9118 -7427
15084 -7427 -10608 -10998 -15330 -3849 -1633 -4851 -6200 -11086 -11645 -6822 -4283 -10102 -8294 -5877 -3446
15069 -3446 -1312 -1810 -2205 -1073 -1970 3478 2599 6716 7041 4917 4846 4735 73 3672 8397 5733 1749
15052 1749 4026 -1864 -8566 -6494 -4678 -5785 -9161 -12514 -7178 2364 690 1817 3452 -6034 1340
15037 1340 4688 8189 7982 4890 2410 4576 3890 -2722 -12401 -3528 5106 3498 -1482 -2295 -326
15022 -326 3490 -846 -5171 -7421 -5460 -1665 -9724 -8303 -5614 -3828 -1532 -3874 -3533 -4039 1488
15007 1488 2883 12426 14254 15881 15596 11278 6514 4378 4868 1178 -3059 -7044 -4175 -3837 -4642 -7242
14991 -7242 -6542 -697 -1385 -379 -6077 -3728 1084 4579 6419 201 -1616 -259 -588 -2416 -1671 3352
14975 3352 -2354 -6975 2508 10279 10600 2228 -3335 -4044 -868 157 -6417 -13879 -13462 -10345 -13144
14960 -13144 -13946 -6172 -5291 -3500 -1696 7036 7545 4813 1002 5291 3584 6852 7129 8394 11428
14945 11428 8555 932 -4560 -6903 -5839 2227 4424 -1917 -2245 1922 -1222 -2065 -6336 -2256 -2410
14930 -2410 -1229 59 5534 4456 1377 -550 5419 8093 3409 -3177 -5501 -5223 -2578 -2288 1702
14915 1702 -647 -6364 -6693 -2375 -1491 -3374 -956 -5536 -5579 -9048 -16577 -13686 -10205 -13379 -14820 -13869
14899 -13869 -11376 -4813 -1681 -5353 -3654 212 5251 1112 3293 1466 -3873 -3595 -5031 -2163 -494
14884 -494 -3036 2974 7349 3989 -4271 -7552 -6775 -1732 -156 -1905 2499 7761 7382 -1256 -7539
14869 -7539 -12732 -14221 -11338 -3165 6162 7283 26 -6264 -5029 606 2792 3043 -1995 -2345 185
14854 185 2227 5745 1154 -8981 -7280 -10232 -15432 -10076 -10571 -6576 -746 1942 5232 11101 7975
14839 7975 3623 5646 5143 2186 -850 3823 5600 5434 -4152 -2009 2757 -2030 521 634 -3558
14824 -3558 -1548 817 -5221 -12693 -11701 -7445 -8243 -8428 -7753 -2289 -2008 1214 4109 1874 4715 2106
14808 2106 -2557 -3899 -1859 -1285 121 5330 12057 938 -6741 -7429 1340 7644 -1706 -6045 -12237
14793 -12237 -9652 -6246 -9811 -13889 -11661 -4461 -5095 -10946 -7823 -3353 -1833 -1569 -7715 -16374 -14188
14778 -14188 -4134 3799 8947 5689 1588 -2096 -2642 -5175 -9175 -12966 -12255 -8535 -216 7255 4230
14763 4230 -1639 -6764 -1041 2781 -2716 -1966 1068 -1304 -6770 -3614 1194 3811 -1128 -3493 1676
14748 1676 4697 8885 10060 5668 4872 591 -5025 -8190 -9242 -9304 -11320 -3567 -254 435 -4409 -8007
14732 -8007 -11262 -4350 10310 21005 33552 33836 24306 13176 4520 5702 1063 -5851 -8714 -11033
14718 -11033 -12477 -9480 -3047 -136 -5177 -13268 -10984 -8942 -6177 -7561 -8711 -13084 -18135 -15904
14704 -15904 -14086 -4972 4450 -1052 -8869 -2539 1522 -4688 -2941 302 -882 -2958 -1571 -3156
14690 -3156 -6177 -3875 -4102 -6168 -4800 -1273 -606 3149 -657 -6767 -7146 -5778 1709 11111 10223 -5614
14674 -5614 -8679 -8465 -14600 -20592 -14603 -5512 -10742 -4859 2705 81 856 3280 1927 580 -3084
14659 -3084 -6531 -2207 5873 9659 6082 930 1555 1990 6272 10844 13119 11266 -540 -3416 2578
14644 2578 10541 9319 2114 -4251 -2807 -837 -593 -2763 -7594 -4832 -6718 -5334 -10263 -7267 -7251
14629 -7251 -7754 3427 10865 12029 9378 -1258 -695 -1908 1289 4018 2254 -1050 -2102 -3956 -7691
14614 -7691 -10825 -6420 -3625 -1191 947 3233 -3677 -1560 708 3483 9242 10365 12614 13670 10908
14599 10908 16825 20820 25207 32107 49489 63995 72211 61335 50985 37415 21691 11848 10348
14586 10348 13134 13732 12514 10845 9455 14029 13938 12216 13070 8794 201 703 6103 11040 9165 5435
14570 5435 4015 -1024 -2658 -2271 -1609 -4093 -10378 -3922 -4117 -877 205 6180 12652 20424 19607 14717
14554 14717 13316 12745 11492 10593 11620 18224 27252 38980 46858 56126 70848 91719 128423 189758
14540 189758 236817 256371 236282 179019 128778 91178 65603 42846 31097 30808 33181 26103
14528 26103 20205 7026 8265 4170 2735 8519 15532 18594 13722 11923 8807 8640 10887 12985
14514 12985 18495 20358 18540 13952 11532 10766 2350 -6394 -4189 2378 1937 147 -3392 -6563 -4116
14499 -4116 10899 13024 2857 2207 -456 -5556 -3306 1485 -372 -11960 -8353 -3258 3311 8669
14485 8669 18441 18339 15203 7662 1852 2616 2631 1076 -2644 -3498 -3838 -1356 358 -3928 -892 -728
14469 -728 223 4560 17051 21985 18695 14502 15768 12513 15262 15534 17326 15309 10684 6551 8437
14454 8437 5257 1197 626 -6890 -9975 -6347 -2818 -9829 -8846 -2836 -62 -5320 -805 4433 2528
14439 2528 8437 9116 4059 5154 4858 4165 1699 400 9070 14467 9205 11302 13635 6471 1189
14424 1189 7530 16045 15924 16537 15858 17721 18269 11715 11756 11092 19409 27739 31336 31501 32430 33153 38888
14407 38888 50161 64388 68901 77398 73007 67611 65818 54149 50708 57778 68574 83287 106133
14394 106133 136026 192833 288520 434891 590442 645327 576451 463056 342714 227010
14384 227010 149419 109839 84281 64719 52633 53384 59843 60498 56199 50720 43410 41301 36192
14371 36192 30447 24947 21994 24707 22154 23708 19332 18909 21334 24301 23327 31636 32330 24641 15123
14356 15123 10064 11687 9289 10287 3719 -455 -881 3906 8740 8852 11719 16062 20983 17047 15412
14341 15412 24828 24131 10635 7412 10071 8037 2763 5647 13008 14176 14983 9985 6880 1889 5955
14326 5955 10185 13157 12808 9927 10280 10767 5420 10142 18257 19436 15306 12455 12756 14641 13053 15345
14310 15345 20178 28603 25866 19534 18221 19867 20487 22581 25047 19846 21279 17704 13146 13204 18308
14295 18308 23414 24553 25314 24125 24087 26389 28909 29873 31409 27994 32521 39153 46592 47402 49637 56678
14279 56678 52451 46855 45204 51304 61632 71805 72462 70411 70358 74339 85960 92199 101092 111493
14265 111493 124006 149577 184148 237598 321134 454751 608256 653768 602306 526956 452348
14254 452348 406829 401355 430581 488794 569612 697163 882472 1168545 1637969 2466121 3827341
14243 3827341 5290716 5688749 4939364 3812245 2647780 1708374 1106155 758704 550778
14234 550778 431852 349700 282992 236144 204987 187592 169873 153298 139822 126969 116639
14223 116639 103573 86265 72601 62153 56099 50487 40035 39759 41630 51190 54172 46557 35749
14210 35749 27433 27539 30176 31692 40337 33886 29629 27241 28725 44230 58895 63660 63066 65282
14196 65282 69021 72746 65655 51701 43388 49784 50523 55540 61950 69766 82679 105743 108345 100121
14182 100121 85061 63560 50669 42108 34302 36097 38961 36991 39676 38538 30866 34185 38816
14169 38816 34403 26442 23975 27347 25106 34293 40509 37901 36065 35120 37871 39538 39211 38261 41695
14154 41695 44314 47505 47331 38333 37641 48495 56753 58392 60036 60703 62079 68110 78559 83377 87003
14139 87003 85562 90550 99215 99347 98109 105297 117896 124287 132479 141233 147145 151073 170539 195887
14125 195887 223952 262485 307642 343430 382349 422152 467463 541682 638590 758679 911714
14114 911714 1121918 1406531 1825942 2464261 3510255 5408440 8526173 11228948 10497279
14105 10497279 8530480 6251607 4096415 2601912 1735995 1240426 923508 718123 581079
14096 581079 477901 401692 352517 318073 291124 274579 261446 238790 216624 185578 155822
14085 155822 135182 122611 116372 107821 105290 104456 100379 89502 81060 73796 71705 71663 67298 64439
14071 64439 63387 59169 52408 49961 60521 65285 62554 53291 49801 51777 49253 45704 43210 44265
14057 44265 43712 44402 41305 38491 39730 42926 46165 49514 50367 54665 53109 53478 57601 58415 64550 69516
14041 69516 68549 64484 61006 65002 59601 54750 58825 60027 58246 50687 46658 45836 47367 40039 38908
14026 38908 45588 53415 52315 57206 55301 55818 59655 62672 58598 48808 51581 59626 60159 58719 61585
14011 61585 69606 75138 83821 95132 104254 118650 126986 139429 153840 174011 200909 235635 264645
13998 264645 303731 355715 427186 493713 568314 677408 789359 903320 1088390 1421281
13988 1421281 2023055 2889306 3575337 3614495 3487431 3527634 3748939 3604116 2987056 2294580
13978 2294580 1625277 1102120 766264 570873 455724 380231 326483 291736 259900 231087
13968 231087 216468 203479 187892 169250 155265 147480 143394 139030 136251 134588 135000 130591 129265
13955 129265 129422 127704 131898 137620 138045 141406 143816 147958 153239 160475 183266 206000 228891 252379
13941 252379 278023 310690 368186 441230 507449 554098 608495 685566 786611 912305 1072351
13930 1072351 1308045 1644954 2120037 2862992 4138717 6371307 9473603 11025035 9774945
13921 9774945 7782089 5539981 3629504 2386894 1668469 1249944 989673 826282 727125
13912 727125 670860 650001 667690 681899 656718 634441 627736 640950 669744 733741 841174
13901 841174 1009842 1275162 1704601 2443494 3725542 5402091 6148560 5453440 4317480
13892 4317480 3062097 2000698 1306159 904268 668072 521926 429721 365369 321691 288106
13882 288106 264817 253552 225993 191076 165403 139640 125587 111826 105925 94721 84452 77857
13870 77857 64080 54323 46348 52827 52020 60332 62266 61544 58906 44822 42834 38013 30879 21853
13856 21853 15664 15741 28934 27875 19962 23110 29327 32462 36113 27945 24152 20605 15036 16174 21858
13841 21858 19982 19857 15977 16497 10336 15651 24517 20857 12012 17052 15124 12858 18118 18227 16393
13826 16393 14009 12648 17673 14569 2930 -10351 -9550 -2673 -3987 -5174 -8676 -8516 -3000 860
13812 860 4037 3190 3760 2772 -1707 -7380 -2179 8000 10023 10226 11071 9471 6157 3689 171 4806
13796 4806 10108 14234 10587 12981 11459 18732 13090 7641 4784 1285 2932 2941 6412 7524 6947 6834
13780 6834 8649 9487 13879 10994 6250 -2233 -4168 116 3244 2043 2347 4339 5509 4888 7101
13765 7101 6247 2818 4274 13014 17688 17921 13634 6982 7393 5828 8786 17721 26660 33730 32408
13750 32408 29068 17127 7630 3063 2424 1672 7235 9984 12965 13701 15749 11904 5411 1244 1457
13735 1457 2982 6874 8464 11309 11706 8037 6481 6624 6306 6040 4354 2003 253 -3326 1958 5751
13719 5751 7271 7750 3738 -212 -4744 -1761 -1912 1076 3011 194 33 5075 3822 35 -3347
13704 -3347 -7560 -9833 -2875 5210 3926 6652 5309 4816 4850 -1893 -7711 -4438 3005 8827 17239
13689 17239 15446 16189 18630 15930 9338 6007 10013 9707 9264 14333 5461 -4340 -6883 -9706 -4922
13674 -4922 151 4381 13757 13519 12626 12600 9796 9681 9906 11317 6307 4407 2910 7583 4771 2258
13658 2258 -3990 -7938 -6726 -6769 -5177 -3602 -2751 -4937 -4485 -534 2550 746 4061 4051 5976 5965 -1282
13641 -1282 -5269 -7957 -6921 -8908 -6929 -4466 -5969 -2168 2536 2948 131 6551 12707 5642 1282
13626 1282 3445 2594 -3735 -664 520 3 -2788 5546 6900 15406 24762 34180 46440 45857 40994
13611 40994 35812 18537 13181 13436 14530 9834 2810 -5170 -1812 -150 -2554 -2904 -11111 -1802 3999
13596 3999 2487 451 693 72 -3895 -7394 -6130 -3894 -6769 -761 -1998 -3754 -4347 -6087 -6041 -6994
13580 -6994 -8407 -3689 -2891 4398 7795 9642 7101 3837 3942 -3260 -9760 -9338 -13240 -9644 -7471
13565 -7471 -5665 -3935 -4623 -3764 2882 6976 7081 7388 394 -8588 -9178 -5479 -7746 -6796 -9110 -7777
13549 -7777 -5517 -12176 -11796 -9298 -8918 -3013 -1712 -5100 -3246 -5522 -6684 -11788 -7823 -4252 -3953
13534 -3953 -1308 -2145 -5837 -4499 -1609 -293 -5154 -10687 -9190 -553 2884 -329 -3663 -3867 -6330
13519 -6330 -10293 -3546 1559 4897 6075 12031 14087 10247 8081 6057 3098 13172 14966 11232
13505 11232 10471 4684 -2043 1721 5344 6517 15679 25240 25708 20180 18728 20488 19222 10141 1309
13490 1309 -2083 -1139 3981 4832 2926 1289 6454 6230 552 3051 -5497 -7169 -4303 -3335 -1097 -1841
13474 -1841 -3435 -4613 1585 8998 9512 1550 -7837 -2869 7112 7549 4592 -771 -79 -1996 -1777 -1625
13458 -1625 6997 8349 2804 3474 -850 -589 1854 4805 6201 6642 5442 4139 6610 8319 13025
13443 13025 9725 8731 8824 11440 12382 15317 25701 35516 50861 57237 50354 45979 36791 26271 23299
13428 23299 16472 8131 12043 7930 10047 17589 23660 27557 23603 28904 20323 15486 17077 15752
13414 15752 15385 18222 23277 28585 32646 35510 38245 45641 54403 50498 46018 51775 62202 74776
13400 74776 73845 66584 55095 43906 30472 24654 23324 14684 10039 3552 2234 6906 9963 8299
13386 8299 6421 4434 2135 -314 -1629 -2349 -3650 2469 -1541 -4482 -2961 5735 13718 9342 8504
13371 8504 10145 10065 7515 5338 4557 9758 10335 6953 4469 1399 -2904 -6044 -1905 4103 6291 -1332
13355 -1332 -1773 -8417 -9022 2353 7925 12665 6332 4161 -1698 -1445 -3095 -546 3789 11607 13126
13340 13126 5563 -3019 -3190 6326 628 -428 5344 1618 250 -511 -7428 -13377 -8310 4035 3294
13325 3294 -3501 -4035 7491 18807 11726 7845 10252 13623 12973 13745 13546 4371 190 -1380 384
13310 384 8643 7154 5345 4973 5622 -1074 -5843 -114 -1222 -8456 -10095 -7672 -8286 -1359 2876 2874
13294 2874 2635 5611 7530 3593 4268 9443 15104 10772 2994 801 -3362 -9070 -2218 -1810 -10323
13279 -10323 -7758 400 8276 9109 7481 3476 -3648 -5654 -9421 -3939 -1471 -1129 -3175 -12831 -11755
13264 -11755 -3978 2736 6062 3239 -1786 -3084 -2098 -2485 -2220 306 -226 940 946 -3334 -8012 -5799
13248 -5799 -4132 -6019 -3006 4639 7801 9943 10011 -618 2480 4402 4078 8060 9532 5812 5608
13233 5608 7715 7922 12956 9396 941 2623 7342 8384 2401 3510 3474 2810 7437 3797 -5605 -7470
13217 -7470 -4399 3092 2503 -2553 -2519 -4707 -739 -2039 -5828 1579 425 5105 9848 4559 3148
13202 3148 10660 13989 8353 4097 938 -1833 3616 14988 20580 11994 3890 2545 4570 9620
13188 9620 6334 6468 -1893 -1675 5266 11455 9144 5477 -3066 -7742 -7645 -2678 5834 6969 4062 4284
13172 4284 3453 1839 -1781 -380 2548 -542 2936 -903 6141 10457 6095 9175 3780 1791 8000
13157 8000 6542 4452 1875 371 -2171 -1505 1782 5843 3509 -521 2968 7340 4362 5708 10210
13142 10210 11325 5791 8929 8083 10226 7396 9081 4255 1328 9486 13667 10810 14219 10443 5968
13127 5968 4587 -564 2027 7028 9090 3551 -2741 -4332 882 3820 4977 1979 3181 12708 13152
13112 13152 6618 7391 9348 9508 4978 535 1967 1023 3314 4628 966 504 1496 -3925 -8133 -4057
13096 -4057 -4630 460 905 1614 2654 1322 -4014 4802 5350 4725 4302 6773 11673 10314 11362 14530
13080 14530 12446 10792 3894 630 4781 12239 8686 7846 5547 9283 8832 4061 2307 -3177 -1762
13065 -1762 -24 1444 2537 4787 5674 4163 95 2993 1265 2551 10407 19758 11741 9449 12148
13050 12148 14651 13212 10174 7401 7917 6358 2557 -1455 -4277 -3184 6282 14901 14133 8606 8430
13035 8430 13355 5290 -3379 924 8784 10411 10545 9519 4821 -713 3992 9397 6406 4345 3354
13020 3354 1706 -3352 -3920 -1244 2104 -181 -1782 116 4853 2543 -2664 495 7753 4194 3751
13005 3751 7141 9272 -144 -1202 -17 -439 -3352 -9462 -16557 -11496 -9022 -7776 -12316 -5773 3991
12990 3991 4377 -1449 -6586 -11562 -12632 -8797 -7279 -10198 -9624 -10985 -8834 -5575 -3301 -651 -3769
12975 -3769 -5976 -5119 -12871 -5299 4344 11988 14745 10705 1029 -6705 -492 -306 -2676 6765 1979
12960 1979 -2860 -796 4335 8531 10570 12398 2385 2453 3151 3559 -5092 -8356 -6399 -2871 -6077
12945 -6077 -759 7573 13280 14789 7077 2024 1154 4885 2957 2464 2121 3177 10593 13267 13384 10245
12929 10245 4197 5576 1141 -865 -684 -1769 546 3510 5168 7244 5918 9272 11326 16013 10255
12914 10255 9621 10091 508 4474 12132 11327 10861 5201 -3471 -1656 6601 8492 7737 2308 1135 4401
12898 4401 -1867 7344 8913 4312 2364 2594 651 -8324 -13170 -8247 -4950 -4774 -8171 -7801 -4912
12883 -4912 -5275 -5999 -1234 2613 4786 8835 11179 12355 11834 9370 10446 7355 9982 10364 3779 806
12867 806 5511 10197 7236 2209 -737 -982 -3484 -6495 4434 11675 1665 -3469 -554 4334 7570
12852 7570 9054 11750 11274 7406 3797 -1831 -5122 -286 2991 3496 4532 6822 3684 5111 1187
12837 1187 1601 2238 -3419 -6820 -2401 5955 4733 1178 5798 7950 523 -7315 -5995 -1105 4130
12822 4130 3925 1569 716 120 1609 2345 2700 6016 11041 7213 2650 3819 3698 -348 1617 362
12806 362 1289 3746 -1139 2778 4288 4271 3841 3545 7793 8727 13191 6281 1772 1063 2949 5511 4195
12789 4195 10336 12738 8473 8258 8957 1541 -135 -1908 -4587 -2867 7409 12815 10844 7245 10782
12774 10782 9664 10154 8683 7970 4883 2727 -2822 -2418 -242 -3206 -2201 1538 4032 4066 3307 821
12758 821 3691 -2958 -4384 -4452 4912 13043 17152 17148 12077 14668 18241 11925 8170 3330 1528 1657
12742 1657 6911 2433 6222 4816 2624 1532 3888 6249 7347 4918 941 -1005 3167 137 5702
12727 5702 12342 9112 7705 6635 8100 9278 8588 814 1167 54 -958 3244 8001 8765 10142
12712 10142 6374 1675 -3714 -5363 -5 5952 -1241 -1305 -1427 38 858 -7576 -4483 572 2751
12697 2751 2210 1435 3334 5672 11861 15350 15799 10047 7858 6078 4514 8531 12858 10088 7229
12682 7229 5667 7198 6735 10375 12397 9930 6060 3696 4727 4037 2235 3907 2073 -4766 -7506
12667 -7506 -5230 -3016 -420 -2103 -1103 -2430 -1793 589 -4927 -6690 -1013 2717 6265 4050 -433
12652 -433 5684 14833 16827 8930 247 -1353 -1786 1011 4673 2303 -3872 -7971 1140 8956 10047
12637 10047 10282 8844 3726 5633 3630 -2470 -9376 -9663 -12379 -10985 -7905 -4920 1010 105 2007
12622 2007 -318 -731 3088 -1996 -4456 -6307 -1571 8518 12880 7551 6556 11237 10848 12972 12308
12607 12308 9929 9646 15260 18896 9720 4383 2218 5815 13169 13593 8873 -343 1262 2464 4275
12592 4275 5160 5993 3277 -1469 3071 9016 11848 8329 10760 10172 -1914 -4731 -5247 -2922 -1872
12577 -1872 4416 4965 2704 5412 8958 13190 6938 356 287 1894 6931 7423 7923 17619 23009 14761
12561 14761 9064 1041 1659 6966 10936 5339 6583 9783 6555 4932 -1065 -1498 -401 2202 1400
12546 1400 6031 17756 22927 23257 15329 10952 5884 -2922 -5427 -273 -329 -1194 -4208 -5905 -8887
12531 -8887 -1967 538 -1332 -1155 6331 11515 13519 14182 10610 6136 4560 2629 -7382 -817 9729
12516 9729 2302 -5051 -2251 -1172 359 3589 6654 4951 6875 10899 11586 4474 -5448 -7643 -4286
12501 -4286 1480 11769 8368 6229 10862 10102 4778 -495 -545 -5358 -2620 139 1844 -1131 -8548
12486 -8548 -3076 4932 2598 -1748 -6167 -2901 481 -934 -344 2507 6333 4018 8658 5907 2559
12471 2559 2633 7254 7090 6319 12926 14556 8465 1422 5174 8666 9358 6738 367 -1050 3352 101
12455 101 750 711 -955 -4934 -2072 10610 10840 13673 9847 8498 10320 7332 6051 -828 1166 2187
12439 2187 -4257 -8768 -1495 -3190 -598 3048 5620 3753 2255 1841 2652 9163 6563 2494 -1274
12424 -1274 -149 1437 2140 6930 8253 7033 14501 15344 10047 6533 8011 8473 12293 5974 600
12409 600 2982 9767 10796 6830 6316 10250 10052 5699 1888 3916 9439 4499 4997 -1544 -5535 -4262
12393 -4262 -3239 4438 3553 3016 2656 -414 7488 10870 4432 2941 11927 10684 7289 10825 15080
12378 15080 13178 12919 9198 7503 1862 -6581 -2246 -101 635 -258 -414 7696 13569 13909 12016 12357
12362 12357 10663 5545 6220 10130 9083 9455 7717 7372 8190 7821 8757 11048 10537 5527 1027 -2264
12346 -2264 2936 8510 13495 9068 9656 6722 2895 57 632 8684 13887 16669 14971 13178 15054
12331 15054 16147 21018 20857 24418 24077 12027 6909 10525 8644 9056 6738 10289 9816 8558 7306
12316 7306 9609 10353 14226 12776 10089 9537 6623 3166 -564 -2903 1514 6206 9706 20309 20072
12301 20072 15488 13558 17346 22313 21036 22015 23922 27868 22713 18090 17179 12513 17358 19589 15264
12286 15264 13686 12956 8643 7173 5649 5618 4756 8690 4365 1129 2710 7649 6810 7543 10417 10539
12270 10539 12280 14029 14512 7148 1343 -5271 -6381 -8478 -9366 -4328 -7846 -5462 -1317 3588 3752
12255 3752 3099 1463 1241 847 1444 2000 2936 6182 10932 6471 7655 8221 9116 15761 9840 6276 8636
12238 8636 12772 7178 5701 6992 414 -2629 -1136 4583 6773 10796 15572 7208 9179 9470 597
12223 597 -273 454 -3533 -4634 858 6893 13735 13906 12959 18746 22656 17459 15945 21675 18993 7480
12207 7480 -702 -1309 3247 5056 13094 13066 11850 11939 15243 9655 7269 10246 15044 14306 12496 14587
12191 14587 11484 4601 5195 8666 11131 16611 16398 17657 19211 15334 9308 10045 11057 8854 10420
12176 10420 17901 19517 13893 10115 12335 3747 -1915 -2513 -1449 3597 4310 11808 17797 23315 11780
12161 11780 2172 -271 2884 4335 6826 473 3221 8366 9577 12380 18757 20474 25151 18367
12147 18367 12143 4868 -384 4497 12108 7469 499 2812 4332 2162 -563 1438 3400 3613 6557
12132 6557 9872 12005 9934 10875 13292 17980 19472 24251 26930 16113 7798 4460 6004 6303 -775
12117 -775 4066 6040 13073 17537 13039 13471 12220 11684 10921 14522 14260 12839 16738 16341 10362 5391
12101 5391 -3099 -4804 -5130 -466 7047 6785 4457 2291 4650 6051 8414 8457 11918 13161 12282 9954
12085 9954 10947 15084 11253 -1271 -5837 -6723 -5867 -2234 -3392 774 1817 5884 10778 17236 12289
12070 12289 7511 11442 14329 9003 3870 6479 6980 12160 17601 19791 21038 18821 16134 14633 12906
12055 12906 16580 21311 19296 17240 12973 9886 14974 13410 9450 10525 8290 8459 8932 12856 8217
12040 8217 11583 21092 27174 20833 13676 6982 5526 11451 15142 16052 6932 5892 12839 13162 12455
12025 12455 10530 12329 13129 9091 19944 23986 14903 11429 5410 7772 11688 14659 16404 10868
12011 10868 3308 5152 -122 -612 10005 12087 5076 3524 3995 13867 17277 14130 14018 15800 18503
11996 18503 11664 14084 16224 17106 15195 8724 13487 13701 10310 6263 9643 14347 13800 18787 23938
11981 23938 21424 18348 17765 20401 24010 20852 11874 15352 19310 24984 19736 16436 17075 17135 11867
11966 11867 12115 16623 16411 14037 11480 9133 13574 18931 11411 14732 19632 14273 13318 11718 9616
11951 9616 15928 15079 16744 13976 18983 14087 9407 13902 13547 6982 2919 4279 -239 -1914 -325
11936 -325 -7212 -4766 3770 7922 10012 16280 18977 16945 18699 14236 6821 7310 5377 5826 12500
11921 12500 12564 13525 16790 22375 20976 10615 5188 7064 13492 14864 15880 17187 16680 14155 18471
11906 18471 21711 15122 6987 12901 18130 13412 9722 14418 12848 12064 18454 19121 15757 14664 15308
11891 15308 13444 9537 14178 15342 12149 5293 5022 4581 6639 15695 21006 20728 16126 10861 14897
11876 14897 18082 17138 21867 19655 18335 18360 9991 6524 3403 9615 16893 14993 9686 7948 12355
11861 12355 19740 24150 25009 19636 15840 13551 17240 24672 23958 23518 16606 12247 15735 16413 14225
11846 14225 14277 12482 4171 8061 16089 14474 15975 14134 9733 7528 8846 6712 12485 22943 23332
11831 23332 23450 21519 18275 19681 16731 17209 19590 16732 10299 8149 9848 11603 7735 12486 13909
11816 13909 10758 15625 16796 11865 6449 8183 13704 18088 28317 28977 21225 23346 21597 10703
11802 10703 14391 18816 16118 4421 3959 7103 8537 9210 8823 21235 24883 28703 30003 31041 33734
11787 33734 29169 24259 23340 28017 22285 17601 16683 19701 25936 31163 37471 37145 32234 22613 18100
11772 18100 22790 20595 21016 20364 23923 17833 15376 15000 21499 23290 19642 19604 15250 12001 14277 19237
11756 19237 16010 19919 26367 30411 28100 32502 30027 20034 16450 16739 13166 16510 16720 14564 13784
11741 13784 8099 12232 24681 28043 31866 31306 25192 14948 15404 17080 16449 10368 10786 10840 16513
11726 16513 19289 19219 20710 18771 14033 15633 20805 28004 31980 33867 38666 38669 33965 34255 36079 30306
11710 30306 29725 24132 17807 18808 19972 14064 14184 16465 21071 26030 25203 26993 31441 37326 39429
11695 39429 31973 27323 27226 28230 27395 31105 28197 23396 15682 9653 6687 1185 3295 11117 13654
11680 13654 10581 11015 14791 24330 27293 28931 29428 32422 37313 34272 30059 21449 25821 27101 26799
11665 26799 21350 22204 20618 21475 22077 14885 14780 13827 20862 27516 19636 21271 21689 21368 18970 17032
11649 17032 21574 28924 30389 34771 37168 35420 35969 36105 39951 46914 48205 39164 26270 17760 13436
11634 13436 13680 19003 15808 18438 16133 21610 26361 24777 21591 18110 24525 27940 28229 24637 33300
11619 33300 36767 35210 32666 29495 24964 23481 23590 23067 29512 26992 26497 29031 24459 21259 22995
11604 22995 26006 36433 42392 33698 24515 22775 35254 41353 43652 51006 47979 41654 39897 38407
11590 38407 38704 40298 44143 44700 39476 33976 33981 36179 37953 36740 34828 33391 34956 31898 27201 27597
11574 27597 33374 32410 32948 38367 41759 36030 33919 34427 37127 40043 39793 37740 37701 35369 30009 26606
11558 26606 37773 39749 47384 54719 51730 48083 38066 33310 35094 37042 33505 35552 38076 37902
11544 37902 35138 43264 52959 59095 54412 48908 50411 49148 52848 48677 48291 44683 40378 40739 49695
11529 49695 49760 45013 47917 44533 42854 51294 60375 61844 64328 63459 62172 57784 45454 47811 53918
11514 53918 48773 47306 54527 53120 49191 53075 53118 48782 51176 48655 48013 50888 45649 42082 45699
11499 45699 48927 48244 49371 53783 51469 58012 66398 70326 66323 57680 60675 71386 88583 105032
11485 105032 128019 136084 142197 139792 120943 100664 78336 65047 57009 61614 59762 57672 52633
11472 52633 51221 51991 54687 53969 53308 54489 45177 40686 42655 43354 43695 45741 42300 45106 41063 45278
11456 45278 49274 43258 50433 58353 59966 59785 66268 68820 71015 75385 72952 67844 62721 59693 52967
11441 52967 46227 47099 44625 34459 29892 32564 33130 44572 53352 57396 59608 68189 74572 73322
11427 73322 71764 72656 74653 82261 84769 87776 88196 85641 79754 76068 72557 62858 64126 72413 79362
11412 79362 84948 81638 85598 87267 80870 73269 72212 72745 67482 68715 73597 70777 74951 88107
11398 88107 94311 99227 103425 106641 108283 110543 118110 121474 116445 113704 114878 116360 125003 134827
11384 134827 141745 140169 137523 139532 141795 137526 128736 128044 137505 139135 148176 160793 177439 192043
11370 192043 210751 237511 268845 311135 366320 434068 517596 649192 849834 1149599 1544303
11359 1544303 1982000 2310272 2439396 2310395 1972834 1564937 1176568 865497 641073
11350 641073 496439 410926 365301 333328 306269 291117 282643 272451 267981 276606 295818 313215
11338 313215 334328 351178 384485 422960 482218 574735 711234 923102 1248987 1670063 2116778
11327 2116778 2410203 2493817 2293287 1917188 1477782 1086128 792841 596476 475294 393901
11317 393901 339007 304136 281494 259697 234767 220440 209128 196676 186125 185191 183415 186631
11305 186631 194130 197960 195336 193353 185940 174778 162667 155350 152417 151483 148638 142662 138994 142690
11291 142690 147958 143658 145590 143013 146244 146446 150646 145445 141324 142312 139900 141179 143327 155302
11277 155302 161974 170367 188398 195009 187029 172029 154370 142288 137044 130539 127770 111841 100660
11264 100660 96681 102244 104271 104491 105077 109694 110182 110698 120491 136122 147100 158126 164674 169562
11250 169562 161258 150537 146669 144616 135545 126276 117286 109757 104982 109184 113635 109583 104823 108783
11236 108783 110642 110097 102220 106282 112416 121896 124117 126097 129179 131615 138794 147298 154661 164879
11222 164879 176529 178481 179722 172555 170112 168274 168138 169463 173205 176589 181035 182844 180108 185641
11208 185641 189834 194189 211788 228501 242127 271690 324716 392280 452872 514652 552051 543150
11196 543150 508924 459297 400742 343576 305061 271972 249875 236457 226043 223711 228697 231850
11184 231850 228848 222727 219063 214421 208115 202360 206989 222698 243722 271773 306411 364354 436776
11171 436776 501959 546166 548895 525196 468659 406758 359947 318233 294702 278464 268660 260489
11159 260489 258138 261430 255191 253673 249306 239721 230499 226511 226186 233551 257350 281327 302770 312310
11145 312310 311626 304645 289929 275353 262575 254634 257484 272160 295732 318653 344468 365774
11133 365774 375817 391888 402543 398710 383965 375456 381914 391973 404052 411787 414381 423269 431555
11120 431555 444006 446376 447372 449894 459248 461558 456966 451260 452589 464234 480890 501599 528554
11107 528554 548254 565794 583028 608174 639126 662933 664460 666975 670990 694617 742558 794242
11095 794242 834151 871701 891458 894033 892914 904226 941129 1016578 1123685 1247680 1395162
11084 1395162 1573510 1761233 1992616 2292670 2692975 3260476 4127000 5522924 7918369
11075 7918369 11724320 15377682 16876518 18159076 16826853 13291380 10020234 7020392
11067 7020392 4791364 3391291 2554063 2036014 1704592 1480839 1334120 1224074 1141468
11058 1141468 1080955 1035217 1013372 999560 1000663 1018649 1059592 1103840 1123655 1155861 1166961
11047 1166961 1157480 1154165 1169385 1200269 1230115 1269418 1339612 1480898 1708481 1853395 1789122
11036 1789122 1628223 1438559 1267565 1146172 1078085 1048734 1043667 1057304 1079244 1101450 1137487
11025 1137487 1185913 1235187 1273591 1308467 1323271 1327350 1318431 1297737 1282607 1287426 1312204 1355655
11013 1355655 1404647 1459343 1506316 1544200 1578323 1602282 1621083 1642088 1679445 1736138 1796910
11002 1796910 1875126 1958701 2049419 2137668 2220288 2291395 2356738 2411176 2464211 2529702 2590010
10991 2590010 2656002 2741029 2829717 2933752 3062592 3234309 3429537 3626228 3812545 4001267
10981 4001267 4193959 4396938 4630874 4899610 5200246 5530664 5903797 6340574 6838971
10972 6838971 7437449 8144783 8997707 9954653 10878595 11693296 12340670 12875748 13471610
10963 13471610 14270172 15413695 16994613 19091840 21801548 25215095 29451008 34646572
10955 34646572 41068856 49143842 59738537 74214683 95093830 126488928 173741418
10948 173741418 237624226 311058514 374571275 408233173 406074810 361180620 296411386
10941 296411386 225074014 163586504 117535778 86354635 66398241 53598428 45314246
10934 45314246 40008552 36922360 35365893 35059372 35769742 37357444 39849608 43431437
10926 43431437 48511166 55735103 66233048 81859099 106008792 144105154 201707201
10919 201707201 275644490 352637024 402690893 417037206 389567287 328458354 256047256
10912 256047256 186585885 131609652 92963189 67884746 52018419 41746659 34835621
10905 34835621 29999835 26435978 23543848 21069498 18755550 16690390 14905137 13479546
10897 13479546 12448130 11761586 11277367 10744979 10114052 9288477 8378819 7494910 6720704
10888 6720704 6107286 5602136 5174621 4798841 4476926 4207318 3981038 3772266 3589440
10879 3589440 3430202 3305868 3220804 3177562 3161174 3156183 3159092 3155531 3167930 3237852 3395257
10868 3395257 3711637 4310067 5469481 7443333 9189775 8675403 7351173 5805683 4339772
10859 4339772 3315348 2704735 2331097 2098320 1927445 1780658 1638775 1517504 1421866
10850 1421866 1365583 1318795 1283673 1242598 1210348 1176505 1118953 1055963 990206 928508 882471
10839 882471 848576 822436 816002 821764 842630 868557 883093 897667 906234 902139 892353 873515
10827 873515 848416 820128 804495 793921 784662 773713 757450 729853 697451 659644 623521 591734
10815 591734 557869 526462 502737 485652 492365 513841 543884 578691 608775 648357 687599 716836
10803 716836 740000 755910 761889 760666 764162 774652 792775 824995 866596 923920 990037 1064281
10791 1064281 1143717 1250866 1423482 1686812 2109249 2817731 4083110 6248085 8791823
10782 8791823 9282754 7926155 6188882 4348543 2922271 2031325 1515300 1208943 1015243
10773 1015243 875158 749609 639393 549823 482433 427038 378546 341275 321421 311676 304574
10762 304574 290444 267811 240202 225802 223972 215426 221649 223102 220593 226195 217663 204346 190578
10749 190578 184930 181746 169256 151472 141656 149842 157069 154591 140584 131901 129386 128733 129146 131853
10735 131853 133978 128926 130123 128542 116166 109878 102225 104194 106186 119378 130113 148199 167437
10722 167437 185051 198123 197368 188095 172889 160232 147906 150566 162752 175203 188456 201425
10710 201425 206251 208946 212329 228756 249367 258145 247441 223944 196758 174315 158723 150160
10698 150160 151232 158101 166064 172321 174377 178390 177271 183725 179786 174309 159607 152284 141372 138663
10684 138663 143872 151574 157903 157539 141930 130612 114778 99291 87469 88877 99276 104680 107135
10671 107135 118331 130511 140682 146608 144721 142800 140371 145160 140801 137419 147447 162724 179153
10658 179153 194669 200845 201758 198035 176292 156910 140660 123762 108958 97278 83728 75528
10646 75528 77422 80531 84543 88201 91499 86527 74647 73491 80176 89804 91190 100769 105969 103862
10632 103862 101898 102151 106963 114132 116108 111705 109367 105975 98321 98333 95783 89577 94419 97986 97214
10617 97214 90392 93786 82670 73651 63186 51908 43344 41237 45889 57236 62128 75467 93869
10604 93869 108453 106292 103183 95218 92927 95660 96483 93263 83508 78042 78389 76279 76526 75129 72781
10589 72781 73099 71970 79536 94160 101425 116921 112355 101545 93215 86691 76062 64979 62571
10576 62571 55958 56969 55312 50967 52027 54768 57884 62286 62742 69242 82745 82471 76692 71665 65345
10561 65345 59753 51734 55695 60935 62341 75337 78287 80312 95826 105720 96061 94742 98416 101111
10547 101111 107868 114892 116306 124977 130801 141473 148057 168265 191425 219459 255281 299879 352850
10534 352850 428839 534824 697415 953454 1317727 1748608 2136550 2337121 2314107 2046220
10524 2046220 1666574 1259805 914057 658996 493501 395706 335777 295995 271205 267413
10514 267413 269809 271618 282151 296874 318852 356228 411826 496341 617076 827565 1160272
10503 1160272 1587661 2027936 2303544 2375429 2160639 1781279 1349171 969847 685026 491694
10493 491694 365166 282874 234850 208175 186293 161783 142876 130152 125146 118279 104243 92573
10481 92573 82637 76412 65436 56077 53799 46773 44096 51515 58010 54903 51852 45574 39360 39293 36689
10466 36689 36449 36861 36720 35725 35128 33233 34224 46550 54989 65182 71065 74073 76819 80004 88827
10451 88827 98732 110982 146249 192533 255035 345187 508686 728411 787056 670049 528341
10440 528341 368612 237356 156136 113500 104834 94307 76800 64162 63015 62965 68313 61503
10428 61503 59886 62554 61821 58655 52059 50068 56289 58400 47867 39790 33680 33360 28463 24115 21583
10413 21583 30007 37551 42026 37697 35926 34627 36828 31422 22860 23001 23393 23873 20310 21377 19886
10398 19886 25064 25871 23813 20573 16894 17404 8775 2434 7888 12476 12080 10772 13097 16426 15757
10383 15757 18153 21977 26094 26383 27397 22892 20097 20602 18039 19836 20113 25552 34229 36310 40787
10368 40787 54493 67671 67658 61139 56139 48412 40598 37874 39158 38689 30668 31163 25760 20582 24434
10353 24434 32841 49260 61661 70544 97969 127029 122859 102355 74699 46638 31965 28020
10341 28020 17306 12985 15802 21083 21356 18972 24490 35009 37865 31518 28423 28002 27477 27894 23247
10326 23247 33805 46021 51223 52863 51383 44849 31222 25044 24784 23524 21024 15673 15326 10031
10312 10031 5981 11321 9652 1958 2692 -282 -873 2290 -4233 -8593 -8257 -6271 -317 2868 7043
10297 7043 6030 3554 5174 5505 2023 7033 9213 9019 3282 845 5213 6896 4814 6243 13718
10282 13718 20202 12899 7442 21 700 4493 5756 12319 22871 21480 21655 20844 27167 35105 35221
10267 35221 35377 43171 64127 89912 115828 123992 110758 81132 63592 43099 31554 24648 27803
10254 27803 21806 19562 20765 22669 24636 21524 18830 19546 15486 17462 18146 13755 10392 18289 14341
10239 14341 12009 11294 9241 13494 16202 16542 16191 12689 18632 25965 22667 18575 14458 9233 4022
10224 4022 7165 6659 2207 103 -570 413 4949 9747 8544 10183 14357 9550 12275 6996 430
10209 430 2596 8829 10281 5486 5335 7078 8729 5373 6838 10696 14114 20406 17572 10178 11479
10194 11479 9183 9422 6343 4978 1655 -1343 1025 3219 2299 5174 11610 11435 4795 911 8931
10179 8931 8776 8008 7164 5071 7921 6360 3942 13184 14152 5725 4460 7828 4263 3958 8118 4945
10163 4945 -1800 -848 -1790 173 2421 5818 17336 19924 19069 16465 14216 10991 3745 -491 136
10148 136 3598 2806 -788 743 1629 3493 4581 4817 4850 -3818 2476 5299 5229 3657 2785 3125 -2101
10131 -2101 -2732 1353 4527 6654 6579 2539 2705 5278 8834 8644 8365 10914 3781 4958 4369 5450
10115 5450 13183 10510 9712 7405 4520 7685 8083 9552 11969 12463 4942 8575 13056 7182 10245
10100 10245 9836 9846 10289 1331 -1073 4198 6949 9913 4350 -1201 5433 15243 15257 12839 15344 14211
10084 14211 14074 12141 7699 4508 -829 3621 2675 3325 3333 -1355 2607 11217 6922 1799 8194 10010
10068 10010 5885 5023 3953 4108 1419 937 5090 6437 7858 1365 1526 2074 4741 4838 725 3200
10052 3200 12274 4617 54 -4579 -11294 -6106 -323 8166 7786 3082 3004 -2264 -2191 -3026 -2560 -7727
10036 -7727 -9422 -7527 -1332 3340 5404 6334 5381 5104 2251 224 -2773 -2937 1747 4935 2776 11779
10020 11779 29801 38770 39537 38480 37142 25242 20623 16873 9143 2698 5583 11210 8718 12952
10006 12952 15330 12657 7109 2342 -3043 -9697 -10485 -6232 422 -7830 -13143 -6989 -3997 339 201
9991 201 -465 -2282 -8442 -12010 -7249 -8032 -11124 -7443 -5751 -7577 626 7337 -2980 -4215 -158
9976 -158 7213 8360 4508 6524 4177 459 -1454 4320 4924 1452 -1034 -2345 -6304 -10303 -4327
9961 -4327 -1618 540 3969 4108 5884 11797 7639 4285 -5753 -12419 -8611 5194 3298 6595 7829
9946 7829 1408 10731 7858 7140 5089 2893 2517 2869 2907 1030 10520 12369 4006 5336 5059 -1118
9930 -1118 -4119 -4962 686 2722 5313 6435 1791 1669 9851 16156 16369 14988 14979 9303 4529 -4059
9914 -4059 -2425 3791 -2002 401 -656 1519 6413 5707 10120 6183 -1330 -3107 -4778 -6864 3111
9899 3111 8750 7311 15764 22948 16005 4640 4860 4997 2823 -1580 6379 14274 21061 26523 22534
9884 22534 14702 14830 10223 6966 5789 1686 2818 3914 4852 2410 3102 4593 2751 523 1158 -3268
9868 -3268 715 4180 7153 8472 7194 9704 4634 4373 10016 7333 6400 6921 5392 343 2042 8722
9852 8722 10597 5379 3610 2541 10413 15019 11929 17580 30567 43990 58643 85982 105547 90215
9838 90215 68901 46908 32129 20342 12218 10805 7507 -339 -6891 -3147 8544 5859 5790 11503
9824 11503 15262 11141 8321 6815 7411 9897 13584 13100 9803 8545 8684 9286 2333 334 2744 7060
9808 7060 12144 6635 5016 7891 9337 6039 6764 8310 7790 12721 5495 6471 8760 9578 1817 -8043
9792 -8043 -3547 3900 5119 6191 2168 2121 7773 9545 8707 6153 5859 2008 -3273 -3297 -3468 -3734 1061
9775 1061 8009 8073 3788 -327 3963 9528 12487 5217 6502 4823 1889 2705 5617 11348 9865 3586
9759 3586 2954 2180 1763 3173 11280 9962 5525 3614 7104 3056 1049 4578 9885 11530 5143 13276
9743 13276 19731 23286 22753 20803 21549 15572 12472 5585 3339 7123 4561 13276 15366 15444 15134 14074
9727 14074 9861 3596 2446 2563 -5715 -3225 215 4633 5952 4188 -1979 4021 3372 -622 3985
9712 3985 7035 3278 5223 9129 13366 -81 -3240 2069 859 4695 7186 7212 10254 16832 18012
9697 18012 5356 -2601 -955 -2499 558 -746 -1374 -452 -3598 -6086 -1669 -1567 -1941 1850 4098
9682 4098 7806 9635 12650 7747 4358 4072 8 -2732 688 6924 1375 -5121 -3261 -5407 -15274
9667 -15274 -13508 -8373 -3862 -3364 -6276 -1695 -7588 -7706 3420 8738 11733 8044 3351 1475 -3358
9652 -3358 1769 8251 3018 -1414 5585 7667 8565 217 840 2640 -3641 -4659 596 1867 5485
9637 5485 5843 1117 3841 6399 -2143 -3859 1016 8365 10152 12977 13427 18861 13813 22363 23878
9622 23878 16255 11795 13768 16201 14459 20023 22959 14212 13532 18815 15954 11309 7349 9446 12013
9607 12013 15551 10091 11690 18168 17404 11470 16622 24356 21946 14578 12078 14330 21930 20875 10543
9592 10543 5599 11412 14575 16828 22378 17325 3827 1738 9341 15248 17497 23248 31329 28218
9578 28218 24036 23301 17688 14700 23082 24936 25868 20534 11799 14921 18616 16355 10108 11642 14098
9563 14098 13292 18073 20060 19458 19093 17039 14371 15213 12416 12878 10801 12354 11947 10292 15714 18372
9547 18372 15395 15088 11204 9100 15344 15577 17824 19388 17334 17651 14924 11418 10781 12623 7727 12176
9531 12176 16787 11141 10255 6935 2959 2887 559 -2639 396 7281 6574 6700 8993 11847 14416 10830
9515 10830 11468 22991 31411 35541 32772 29837 28982 31887 34712 27863 22115 26803 27312 27071 26879 29373
9499 29373 27932 25636 27023 26333 27959 30182 21629 24604 23569 23336 25103 29337 34978 41500 45569
9484 45569 45991 42235 33825 28833 29935 37544 38718 34576 33416 43335 53673 58165 59548 56674 55634
9469 55634 53228 50892 43853 45529 51620 53258 50222 46522 45750 49310 49390 54092 60447 66298 71954
9454 71954 77736 83092 78683 73770 76075 77687 83630 95994 104396 106690 105265 104745 105513 106978 112532
9439 112532 116422 110478 111444 118771 125293 131727 130171 134363 133863 130231 139986 147141 153327 153611 163514
9424 163514 177072 180559 185610 187831 194216 197505 203826 216876 231482 238450 248137 257071 273973
9411 273973 279162 287688 306300 316076 323983 333681 347599 356541 374892 391223 411895 438483 458389
9398 458389 472713 490527 509432 534650 561404 579499 595987 618884 641038 662813 688818 711729
9386 711729 734156 749969 762828 778148 792841 801405 814925 820722 817403 816403 818107 808403 799987
9373 799987 784572 763717 751799 730938 709024 687938 658811 631484 610351 595854 564300 535577
9361 535577 514877 497586 478533 455273 438186 423672 408295 396176 379680 368726 353818 336873
9349 336873 321124 313042 302707 284620 269228 261080 249887 234579 231293 224864 212367 200423
9337 200423 191948 186903 181518 175955 169928 164868 164716 161914 157042 149677 137947 132859 133439 125870 122754
9322 122754 122322 117623 114456 111382 102906 98944 97155 88732 95966 105359 99600 92295 83458 80345 84999
9307 84999 79191 76419 80480 71869 60404 56735 59903 57123 57936 55632 54525 52705 53739 58407 59369
9292 59369 61935 56664 52002 45778 47518 47268 43540 38139 30689 38207 42489 41937 39986 39036 34558
9277 34558 34952 32354 36253 41466 47546 40100 30877 33391 29062 35270 38141 40410 40508 33046 26828
9262 26828 20962 26921 25862 25484 29501 32486 34435 32704 32949 27206 20106 17060 20433 24091 21639
9247 21639 19888 16852 21265 28022 30979 32061 27775 24807 25475 22104 27769 32638 28767 21532 17170
9232 17170 23363 19098 6641 4901 6375 12080 17366 16876 14717 13663 13031 13877 13045 14959 11962
9217 11962 10255 13416 15130 12881 15489 10319 5574 8351 19674 15384 10213 13945 10010 6217
9203 6217 2024 10190 17518 19075 11537 12592 10553 11158 11557 12208 18224 19279 19509 20676 16470 16187
9187 16187 5668 6281 16058 18720 15149 18194 14363 12513 7170 5578 4332 -1313 2384 10073 12445
9172 12445 14203 13700 7576 2104 4059 952 5167 13271 12216 8088 2008 2429 3209 243 353 7452
9156 7452 5782 2141 12445 16151 12329 4451 -3188 2472 6980 11761 7174 537 2759 3758 3471
9141 3471 5813 12106 12067 9998 6172 8674 11206 13902 14019 17894 13333 7147 8097 10224 7285 4591
9125 4591 -321 4643 9738 9135 8210 11248 7537 6528 11131 6488 3562 4768 14808 11548 -453
9110 -453 -4880 1826 3953 7108 5015 2319 4745 3000 5385 6946 6163 8918 13737 16178 7764
9095 7764 2899 730 -2259 -3022 6348 10284 10100 2960 5226 7101 2177 1935 4115 2988 -1050 -1094
9079 -1094 703 -232 265 -1349 -2589 -3942 -6525 -4033 1593 2364 1090 -3101 -7279 -5147 -665 628
9063 628 6338 11866 10330 9920 1111 5148 8598 6908 5160 2370 2920 5281 5696 6894 10182 9629
9047 9629 6180 -2602 -7825 -10229 -5619 -2578 -958 -2793 -1549 2588 5124 5364 10839 16820 9662
9032 9662 2685 -3577 -5808 -8062 -7343 -1883 -2217 -5085 2626 5496 4754 1694 4500 421 4695 684
9016 684 -8202 -9914 -13685 -14858 -12676 -9799 -4553 -592 174 -437 2789 -5663 -11331 -7826 3279
9001 3279 3351 4786 3945 -555 3098 -1010 -169 3882 7079 8991 10214 7527 15081 13826 7230 5696
8985 5696 3554 2125 4633 5210 114 9549 13877 7882 49 2079 7300 11685 15212 13867 7787
8970 7787 3318 2100 6865 9379 11963 15681 13137 10062 10969 12429 8583 4690 3906 6377 4298
8955 4298 1692 4957 -1873 -3633 1081 841 -1553 1652 5197 -4768 -6774 -5472 -338 7288 4693
8940 4693 6723 6323 4402 1847 4594 6401 8242 3377 -4506 -6072 -2268 1803 -5923 -14043 -14866
8925 -14866 -7362 -4821 -5243 -135 -1012 -1090 91 5681 8709 13482 7384 -715 -444 -279 -6332 -3010
8909 -3010 2152 -1279 -3234 -1322 5147 10489 10887 9773 11329 15288 13675 9478 11694 10105 6065
8894 6065 2583 3565 138 127 702 6862 8454 4380 2325 -670 -6433 -7413 -7635 -3265 -2627 -4384 -5111
8877 -5111 -4468 1996 3406 1673 7186 -1311 -13454 -14395 -5519 -6297 -4107 -132 877 321 -3560 2562
8861 2562 -1647 -1111 -1721 -240 1020 2311 813 2382 378 -989 -1562 -706 4719 7090 1840 2080
8845 2080 -438 1474 11618 15260 14777 7650 4437 3589 -1408 -3798 -1848 -1293 -1264 -1729 669 2765
8829 2765 2409 979 1208 -6875 -11376 -12311 -7703 -1307 -3584 -7410 -5098 -3040 -5328 1645 -223 -5210
8813 -5210 -8071 -6411 -6714 -5130 -8020 -3485 1930 732 7650 14771 9235 -21 -3922 -407 1539
8798 1539 -593 6175 6294 6784 4320 -393 -2537 -2791 -5831 -3769 2086 9043 11980 487 -917
8783 -917 2649 11305 10943 12731 13038 9877 1010 -11788 -13462 -11348 -6525 -3878 2410 7930 9669
8768 9669 11638 3177 3165 4038 8449 8575 3478 -607 96 360 -7778 -12661 -21584 -16255 -9884 -8413
8752 -8413 -3956 -5639 -10911 -17140 -15602 -13261 -9542 -5065 -2016 -3173 4715 5012 -4280 -3877 1538
8737 1538 11322 22511 30784 23424 15663 16414 14227 5980 7434 9025 4655 9745 4665 -2862 -3535
8722 -3535 -1479 3512 8289 5488 -878 -6109 -7136 4178 6074 4399 -4008 -9120 -11352 -7592 -7866
8707 -7866 -8674 -4195 -4459 -6837 2229 4185 367 2993 3972 -1858 -4860 -4579 4627 4560 13664 20264
8691 20264 19395 14757 19315 19582 14517 12086 10228 3679 -2495 -4564 1973 2061 -5460 -4592 2715 1595
8675 1595 -435 1389 4800 4795 1097 -419 -86 356 -8827 -11739 -14154 -14675 -10964 -5180 -3343 4985
8659 4985 9537 7838 6637 2916 -485 -2277 7124 5730 2802 6277 10728 5068 2900 5782 4696
8644 4696 -3574 -2035 5547 10267 9517 6136 5801 9632 8368 6508 1323 -505 2698 -1972 -5839
8629 -5839 -1867 6014 5029 -269 -6369 -5704 -7519 -10976 -8806 -3233 -556 4027 4680 8401 11476 14883
8613 14883 12562 950 -5710 -3778 548 6184 11494 13280 8264 8862 7329 8884 17479 12470 -5525
8598 -5525 -12971 -11148 -1406 -2722 -6477 -8404 -3115 8266 12209 10654 4643 3505 -1155 -3939 -10328
8583 -10328 -12416 -7223 -5103 -973 -420 -4725 -1087 2112 3605 4598 1606 1378 -2606 -8666 -9980
8568 -9980 -8064 -3965 -3500 -8270 -7809 -4173 -2131 -5035 -10498 -4545 1026 6403 1196 -9119 -9935
8553 -9935 -6273 -1542 708 1889 3493 5104 2882 957 -175 -2888 -5760 -6263 -8172 -13340 -13559
8538 -13559 -9634 -3130 2766 2763 3425 -2928 -6710 -5050 -744 -1018 -2530 -4804 -4666 1750 -2711 21
8522 21 3873 11309 9572 3255 -4083 -700 2950 5527 764 934 -1127 -11595 -11877 -6837 -9504 -1330
8506 -1330 -647 -4600 -2893 -1932 -6203 -12574 -8341 -1151 4498 6704 11851 14463 8540 -72 -5100
8491 -5100 -2952 8577 14215 9211 4895 -3580 -5038 1586 8047 4559 1441 -2909 -298 -910 -2862
8476 -2862 -709 -3416 -6448 -5979 -577 -4949 -9258 -8934 -7017 -4287 4374 4428 -638 2128 6086 4689
8460 4689 2135 5479 5868 14132 16529 8808 -2623 -3547 2456 4683 7147 2000 -487 -5680 -4026
8445 -4026 -2589 -711 -86 -5544 -11010 -5655 2446 -224 677 1602 -4283 -9545 -11318 -11209 -7870 -5110
8429 -5110 -7364 -10430 -9384 -10433 -7084 -5677 -4006 773 4426 6601 6897 3082 1757 -962 -1194
8414 -1194 -2050 287 3539 5906 -120 -2942 -8349 -12896 -7614 9334 9293 5570 2339 -4612 -8809
8399 -8809 -3772 -7972 -11797 -8979 -5325 -3852 3085 -3520 756 -861 -1207 -3183 -5090 -10727 -10753 -11369
8383 -11369 -4581 -1856 -6527 -2052 -3211 -7981 -6128 -5048 -4214 2277 3624 41 -1962 -5968 -7741
8368 -7741 -6786 -4336 2054 -3895 2556 2407 -1535 -5246 -6556 -4976 -3046 -6348 -6387 -1398 1169 1724
8352 1724 7671 7764 6143 252 2588 6419 10859 8171 10779 9995 5677 3693 516 -1595 -5042 -6799
8336 -6799 -7153 -9896 -5092 -12138 -15497 -8348 -3496 -4938 -4102 -6687 -7411 -3250 -4954 -8860 -13303 -13930
8320 -13930 -14603 -6571 -4928 614 1854 3567 -3296 -5364 -871 412 4672 -368 -2574 -3145 -1203
8305 -1203 38 -4266 3493 13875 14812 12949 5954 4869 5395 7533 3226 -1961 689 381 4572
8290 4572 7100 -499 -4541 -879 -9280 -9230 -18 -1742 -2106 -2110 -4857 -9351 -14720 -13120 -14326 -11167
8274 -11167 -8752 509 -1135 -5383 -5013 -1140 1760 -3966 -10938 -9336 -2329 -1524 -1691 1250 -10675
8259 -10675 -11493 -12658 -7876 -3578 -1362 1738 7605 1969 -6703 -5500 -993 5784 7534 8473 5314
8244 5314 4944 5016 10198 12103 7034 4691 2189 7070 6378 4235 4347 2760 -936 -874 -1766 -3596 -7363
8227 -7363 -8673 -3638 -3122 -2842 -4015 -9210 -16710 -14265 -12904 -10861 -6264 644 -6125 -17611 -21768
8212 -21768 -11705 -1407 2145 -5683 -9811 -11791 -9194 -2565 1240 398 4257 8820 11393 10129
8198 10129 9414 -730 -3363 -1947 -3453 -2956 -4536 -7175 -4815 -4177 -1035 2320 1291 -1434 -5193
8183 -5193 -7814 -6852 -6084 -4593 -341 -4067 -9599 -4994 -1075 -3943 1897 4440 5116 4769 7499 1222
8167 1222 -6529 -6927 -7891 -403 3330 2951 5779 2899 3830 3602 649 5396 11466 17947 16587 5790
8151 5790 866 2291 4423 8060 6824 5932 8948 10869 13741 11035 6470 11565 10846 1817 -6620
8136 -6620 -3301 -6491 -7333 -3645 -5527 -4408 -4746 739 1216 -8816 -8139 -8236 -8229 -4498 -1650 -781 3920
8119 3920 8028 10679 8048 6959 5560 -2955 -3749 -2611 -4430 -3242 -188 -2327 -1238 -3581 -8846
8104 -8846 -9005 -3889 -754 3346 -1197 2114 2044 -7747 -8095 -998 7036 13461 5621 593 1408 -122
8088 -122 -7947 -5743 -11438 -13631 -8731 -10579 -2606 5435 7041 5355 -533 1651 4305 319 -9628
8073 -9628 -5522 -5299 -5205 -5333 108 -829 4556 5540 -539 -3057 -4284 5341 5350 884 2274 792 5583
8056 5583 1830 -10717 -13464 -14687 -13472 -5099 714 927 1195 3904 666 -3672 2477 1573 -8719
8041 -8719 -12598 -5346 3363 3593 1987 66 242 -2117 -1854 -2875 -7375 -5967 -2815 -3406 -7451 -11326
8025 -11326 -16901 -12833 -4136 -4508 -6606 -13001 -17110 -11803 -6087 -6872 -9943 -6582 -1478 -1650 -3826
8010 -3826 -2134 -2623 1893 6691 9001 3411 -3370 374 -3567 -2498 2276 -3155 -10747 -13246 -9638
7995 -9638 -11767 -15421 -8638 2620 5707 5995 3198 -3079 -5000 3331 7925 8878 4198 -7123 -11217
7980 -11217 -7119 -8140 -1500 2000 -472 -5888 -9885 -7169 -5118 -12598 -9618 -740 -2643 -1050 3503
7965 3503 2686 137 -6152 -7559 -2501 -5094 224 5591 2549 -4508 1736 1219 602 -1177 -11197
7950 -11197 -13033 -4603 -1146 -1397 1865 4198 3315 1860 3130 278 4394 12767 13927 10892 10849 5786
7934 5786 6431 6047 12877 9342 7002 508 2942 11087 5517 5521 7052 10524 13916 10756 288 -620
7918 -620 1790 -5779 -6373 -7646 -8863 -9609 -12296 -9474 -7145 179 -470 3279 7201 8787 2847 -1730
7902 -1730 -543 -4484 -2896 3410 5581 10931 3813 -1098 1225 1065 2819 3218 4189 -430 -3624 -1349
7886 -1349 -6213 -4666 9396 13017 10332 7803 5160 5489 6325 6435 8178 6126 9571 6968 6153 3610
7870 3610 -1362 -3513 -3187 -5716 -7462 -10102 -5975 -662 4244 5954 -1048 2559 7535 5373 -2259
7855 -2259 -262 7823 5285 4076 3166 3045 7200 7557 12722 15589 10465 2036 4720 5265 -3627 -7425
7839 -7425 -5391 -5539 -4044 -5867 -7073 -7119 126 -840 -3380 -5947 -4114 56 6562 9114 9040 7432
7823 7432 6057 54 -1566 -1640 4641 7151 6016 4377 -2976 -5316 -299 5028 6147 -2285 2840
7808 2840 13405 9528 -5067 -3293 -4803 -6417 -5288 -5855 -3921 -112 502 3773 7085 7343 12
7793 12 -3722 -3536 -911 -875 1415 -1064 -7794 -12952 -7374 2706 8789 5531 -1171 -1686 -681 -5254
7777 -5254 -13071 -12379 -6171 -4703 -11743 -13182 -11713 -9330 1559 1738 -6172 -9481 -4462 -3118 -4927
7762 -4927 -2330 2678 -1172 787 -63 6320 5306 3756 6150 5328 -5417 -9054 -4446 -430 3087
7747 3087 9105 2068 -1133 -3944 -4418 -8810 -15618 -17451 -7146 -543 2131 3178 3147 -796 -204 -4243
7731 -4243 -11513 -9356 -7833 -3877 -6781 -5159 -8375 -9322 -6567 -6477 -9195 -9259 -9430 -16885 -12602 -8409
7715 -8409 1159 585 -4159 -9818 -12738 -15184 -13437 -7981 -6022 -8351 -9667 -7708 -10323 -6555 -6253
7700 -6253 -13703 -17900 -15071 -12559 -7237 -9785 -6614 -7479 -5547 -4930 -4135 -2965 -7415 -9591 -8388 -4952
7684 -4952 -8393 -12732 -4781 1125 -2891 988 303 3188 3107 -773 -4766 -1825 -3844 -10318 -3944 -1546
7668 -1546 -5417 2298 7705 3527 -1287 -4212 901 3130 -930 -11593 -9513 -4688 -3542 -5559 -4602
7653 -4602 1936 -85 552 -1979 -9739 -10881 -3387 6857 9138 8929 6554 10419 15858 14730 7870
7638 7870 3197 5688 6575 3249 4629 5842 -3941 -9920 -8844 -3183 1584 -3404 -2955 2681 3572 -2192
7622 -2192 -6866 -8448 -12599 -10966 -4053 1860 768 3344 6716 8216 3496 -1070 -3659 -9379 -16337
7607 -16337 -16858 -10426 -6523 -2557 1861 6026 8339 10090 2125 -1724 -3482 -2258 -2218 2000 1521 1964
7591 1964 800 4806 3691 3372 694 3993 1020 445 328 430 834 -1234 -8367 -13410 -11474 -2422
7575 -2422 1296 4992 -524 -6799 -4742 -2996 -8106 -9565 -9223 -9371 -14494 -18846 -13814 -11519 -15210
7560 -15210 -13106 -10045 -9304 -11148 -14738 -9210 -3268 -11473 -14018 -11852 -7961 1286 2945 2008 -3481
7545 -3481 -3350 9521 4369 -205 -3147 -2320 -366 -4330 -2509 -1984 -160 4503 -1475 1275 4489
7530 4489 3523 7157 5453 8416 5913 -1582 -7958 -2875 5911 10371 -3045 -2995 2634 -1893 1158
7515 1158 2787 4981 7939 -524 2471 5414 6419 6732 2449 5260 4655 1982 -5124 -7375 -3778
7500 -3778 -91 2184 761 -590 -11269 -15557 -9972 -6291 -9265 -7114 -5010 -5283 5630 -5806
7486 -5806 -14099 -5344 491 2872 4770 7713 3180 -1125 -4956 -3684 -1151 919 2967 -426 -1642
7471 -1642 -1693 -1213 -4555 -5568 -102 4559 5230 -5470 -9897 -11524 -12629 -7664 -5174 -3931 -1685 -2767
7455 -2767 -871 -1772 -3031 1044 3993 4879 2960 -5915 -8109 -3104 4838 3155 -338 -743 -2387 -4156
7439 -4156 -7071 -6851 -13256 -9000 521 2876 3018 -4878 -5851 -6037 -12227 -9914 -9861 -8477 -7407 -9534
7423 -9534 -7558 -6637 -6395 -2424 -236 -167 -3869 -8144 -8151 -4234 -1893 -110 882 890 2744 1082 1785 1618
7405 1618 4904 -2279 -7411 -10587 -8265 -7724 -12637 -14443 -12695 -8280 -9662 -12137 -12224 -12556 -11093 -7321
7389 -7321 -5684 -6262 -8564 -4952 -4036 -6592 -11793 -13832 -9617 -12098 -9110 -8548 -6905 -7111 1171 -3098
7373 -3098 -7143 -8732 -6356 -3839 -4365 -685 1330 -1337 -4667 -8777 -2456 666 -3801 -5654 -3896
7358 -3896 -4566 -4220 -979 6261 -176 -5227 281 -685 -6777 -4983 1183 1571 -3238 3439 10406 12320
7342 12320 7884 6406 2901 -6666 -4047 565 965 -2756 403 -440 -10713 -7691 -5270 -2701 6170
7327 6170 10770 6512 4321 -1121 -504 -213 2677 2713 3890 -2094 1649 8873 5865 4514 -2165 -1978
7311 -1978 -555 1999 4239 11279 11194 5018 3088 6436 4975 3417 1605 -3079 -9070 -9948 -3668 -2203
7295 -2203 1440 321 -5150 -4732 -6980 -5979 -4560 -1658 1324 -181 361 -66 -928 4396 7441 2638
7279 2638 -2352 1239 3738 4211 2527 2195 4302 -4481 -4785 -5436 -11512 -11721 -2824 -6046 -10528 -10797
7263 -10797 -13018 -9636 -3288 3468 4555 -7786 -14718 -8795 -5888 -4568 -3581 -7560 -1592 1969 -2370
7248 -2370 -246 212 -4080 -5242 -5972 -6742 330 5353 -1352 -2720 -8047 -3085 118 -2137 -6794 -8864
7232 -8864 -13432 -10653 -1224 58 -4083 2924 9693 4442 1388 -448 -3280 -6865 -3423 -3999 -8282
7217 -8282 -16955 -10650 -2043 5956 2448 -5422 -6454 -4473 -5074 -6321 -2313 -2167 2436 5954 11399
7202 11399 13078 4638 3637 6135 12350 6343 4563 -6 3928 6930 6184 2360 -6107 -9237 -9846
7187 -9846 -1262 -7383 -11004 -2871 4921 4754 2557 1534 1037 -2183 -2195 643 3191 7973 8224 7207
7171 7207 6067 2800 2925 12879 13764 4839 -510 -1288 6077 3770 -6027 -9619 -8333 -5889 -2400 2177
7155 2177 9057 7691 5250 -2261 -2021 -2502 2363 -621 -1046 -6417 -16641 -23260 -16946 -14467 -12470
7140 -12470 -7975 -8004 -5719 -1355 2969 -1049 -7747 -4855 -1705 -4654 -4778 -3987 -2638 974 -3001 -2090
7124 -2090 284 1682 -1169 -1504 -931 -5843 -1683 12424 14654 14534 12196 2494 -2262 3619 7083
7109 7083 7521 12184 4680 -2449 2704 5164 6064 1512 -7460 -7475 -4182 477 -1003 2254 3107 -207
7093 -207 1398 2982 -4254 -10172 -10097 -6911 -7563 -7193 -2972 -8347 -7409 -2918 54 8313 14700 8326
7077 8326 1157 -420 1561 8796 11212 5245 -6194 -7794 -13815 -11730 454 4112 6430 -1619
7063 -1619 -1056 -1280 -6405 -5507 -7388 -9596 -7270 450 8937 5864 4670 -241 -5272 -4820 243 6054
7047 6054 12966 4963 -5986 -5522 -9109 -7942 -4539 -960 -4302 -11236 -9973 -3216 -522 -3226 -1345
7032 -1345 3998 9677 9261 6583 8808 3719 549 4650 2674 -587 -10134 -16508 -11676 49 3882
7017 3882 -1465 -4103 -13064 -13078 -13035 -15095 -13237 -4572 -1479 -7240 -7738 -722 7904 9762 5218 3625
7001 3625 3368 -153 -136 4528 4536 6300 4706 4077 936 -4412 -10089 -5437 -3277 -1337 -3396 -6172 -6816
6984 -6816 155 -3960 -6200 -3977 -6305 -10595 -7811 -3210 -8370 -7468 -2642 -4529 -5320 -8231 -9166 -10442
6968 -10442 -7039 -1145 771 -3061 -5788 -3087 5015 7264 -141 -1888 2148 -831 133 8905 4583
6953 4583 -3918 -1920 4746 9971 8777 1475 2648 7641 4315 9453 8362 2799 3696 3374 9930
6938 9930 13074 7648 2743 5278 12430 14987 15344 15965 12386 3600 -1324 -4841 -3183 -1945 -1826 -2298
6922 -2298 3341 5374 5541 5530 7772 8727 -30 -5768 -3505 1334 3365 4146 9987 3514 -6116 -6229
6906 -6229 -2263 3017 -1913 -6447 -154 3660 3959 1866 -833 -1404 -4341 -3275 -9436 -15935 -13279
6891 -13279 -12058 -13575 -5424 -2691 -3843 743 6884 594 -5586 -10202 -7720 -5505 -7385 -3900 -2143
6876 -2143 950 2846 4109 2439 2612 8710 7244 -2051 -669 3671 4141 2437 3290 4653 2280 -1443
6860 -1443 -1153 1619 -323 -3234 -5750 -9643 -8622 355 1652 -45 -2562 -5699 -3212 3285 4101
6845 4101 -5331 -15558 -11970 -4787 3696 7741 5549 3247 -4189 -13738 -13676 -9895 -7855 -8263 -9481
6830 -9481 -4845 634 6930 6954 1905 -5337 -5412 -2962 3669 4704 7747 9283 8537 12917 12344 4285
6814 4285 564 -1071 -1879 -5660 -4293 2618 5802 2929 2332 4148 5319 7940 7784 164 -7171 -4102
6798 -4102 347 991 7586 2496 -4693 -2439 -6214 -11813 -2820 1234 -1198 -9326 -9422 -9094 -11773 -4604
6782 -4604 3672 2765 5776 5333 746 -6178 -4201 6577 6481 500 -8745 -5286 -1143 440 6401 4275
6766 4275 -317 -4172 -4895 -9259 -4726 2414 4953 7061 2508 -3168 -9426 -6264 -6172 -12234 -7566 5522
6750 5522 4501 1417 6764 7119 2961 3454 2879 3421 7331 3029 -3051 -862 -2208 -5664 -7723 -5748
6734 -5748 -3047 -4653 -8598 -5866 -9761 -6239 87 2615 666 4826 8323 10522 15820 7060 -504
6719 -504 -4820 1387 -3001 -7895 -5669 -5683 -3342 1475 8885 6517 6363 3747 1275 -370 2169 3350
6703 3350 3291 2425 3554 -132 -3234 104 4648 5233 10551 13346 7961 7549 9907 8254 5191 5489
6687 5489 5982 6605 9752 5796 4948 8168 7270 8040 7229 -4960 -10915 -11773 -5567 3655 3800 -383 3912
6670 3912 10436 13479 7994 3315 6629 4544 -827 4031 3605 -4332 -11775 -12410 -18446 -12968 -10396
6655 -10396 -14883 -12051 -7752 -830 6293 7410 7749 8809 12623 6197 2994 1062 -2691 -3453 -2915
6640 -2915 -2166 -5148 -3173 -8232 -11637 -4784 -3611 -1966 4117 95 -5885 -3187 -884 -6858 541
6625 541 5671 1177 1904 1531 -1075 -7120 4103 5359 -352 -2511 1902 1676 -4846 -4046 -3656 28
6609 28 -1542 -7040 -7716 -7680 -4517 -3300 -8151 -7872 692 5081 3389 1618 -364 -4221 -12035 -8138
6593 -8138 -3816 1813 4248 922 -3064 -776 -7859 -8041 -10425 -9481 -7649 -3758 -1124 741 3765
6578 3765 -1706 -5599 -3981 -5769 -319 -1229 -3318 1695 11701 20213 27383 14270 9525 10627 8173
6563 8173 5471 2300 -784 -4879 -10774 -12746 -8215 -5574 3765 7112 7843 5015 6348 6124 754
6548 754 -417 -662 -113 -14336 -17477 -6055 -5882 -14295 -12208 -7889 -5400 -5813 -4990 -2890 -7504 -5558
6532 -5558 -358 -3583 -4350 -3013 -6557 -808 -1403 -6106 -12162 -13992 -5429 -191 1857 -4446 409
6517 409 -3857 -5725 -1783 1504 6451 4419 -2376 -6093 -3333 4202 11247 4204 -1728 -2903 -4006
6502 -4006 -174 1874 146 -2503 -7013 -10092 -10247 -9188 -6042 3335 1228 -6319 -8364 -8942 -8699 -2787
6486 -2787 -895 -5455 -6380 -1283 6910 5538 -1593 -2706 -5836 -5670 -1003 4093 9176 10013 7461 5224
6470 5224 2456 2199 3001 -1041 -3057 542 -157 -9004 -9142 -4561 -7374 -4401 2477 -2162 -498 176
6454 176 4528 4878 3710 -3526 -727 1445 3565 5038 1400 5439 1331 -3007 -2027 -1639 4626 9301
6438 9301 1573 203 2784 1749 6863 9368 -2896 -3866 2723 4027 2951 -2199 -2008 6342 11187
6423 11187 7890 -280 -3264 4544 9885 2311 -1739 -6069 -5207 -6446 -8332 -10007 -6978 -6739 -5828
6408 -5828 -6504 -9987 -6476 -6114 -455 3747 1608 402 -386 -2802 -4981 -8740 -5248 -7856 -9654 -1317
6392 -1317 7350 7500 9355 1506 573 1928 -2620 -2341 -5486 -3498 -784 3440 -1119 -6420 -2281 3755
6376 3755 5575 9202 6896 5762 -1697 -10485 -14109 -11332 -6065 -1497 297 -953 -727 192 -2505
6361 -2505 -1983 3281 3493 3821 8513 11163 10246 11555 7138 -635 -6072 -3789 -1574 -2113 1406 9141
6345 9141 17538 15796 7791 4434 919 339 106 5847 9263 4626 3965 -1052 -8970 -11593 -11093 -10546
6329 -10546 -6555 -15312 -22388 -13879 -10232 -13661 -9009 -4804 -2610 -2563 -1953 3486 932 -3960 -7789
6314 -7789 -4871 -4083 -6899 -4521 -6433 -2181 5056 2794 -2933 1690 5831 4670 3376 601 -5904
6299 -5904 -3825 1296 4215 756 -853 -2321 7263 8447 1648 -3824 -9950 -9467 -8398 -5718 -1926
6284 -1926 2776 1872 2595 5152 5244 -7041 -6825 -3194 4724 3511 7071 10112 9796 8200 1640 539
6268 539 -498 2916 5168 3097 -5384 -4423 -9161 -12115 -4121 -1529 10708 13519 13596 14821 11982 1542
6252 1542 -2493 -7811 -15251 -20834 -12278 -7674 -9232 -5804 -7005 -5208 -5620 -7757 -6265 1315 6694
6237 6694 -663 -4759 -1125 -3756 -7310 470 -395 -2260 -2523 -3062 -2634 -5135 -10084 -15896 -11610 -5918
6221 -5918 -5217 346 6098 14763 7310 -1343 3983 9082 -1213 -10016 -10708 -8721 -13448 -9905 166
6206 166 1390 -3115 -1951 -2387 -6105 -7256 -11055 -6681 792 2375 1016 486 2082 7344 -635 -6888
6190 -6888 -9506 -6674 -7275 -8244 -9046 1076 5410 6155 1843 -5339 -5185 -2826 4841 10615 12826 8171
6174 8171 2403 -5272 -8414 -4436 -4914 -2508 -955 -6175 -12290 -11988 -10507 -9983 -12363 -12008 -4783 -1447
6158 -1447 2399 5883 5834 9275 13513 4419 -115 2900 10510 7239 6586 10636 10771 1464 -3472 -955
6142 -955 151 -455 7180 2054 -97 2544 4261 7434 7375 2731 -3445 -5217 -3103 -10979 -15439 -10226
6126 -10226 119 7667 2281 5383 -4638 -14820 -10242 -3701 5010 10905 9851 1670 -187 102
6112 102 3170 780 6477 4271 -4717 -2351 1346 9455 12321 10081 1387 3906 4504 509 -6553
6097 -6553 -9829 -8283 -7078 -3610 4729 8258 5917 -2587 -8804 -7504 451 -1851 -5388 5213 5994
6082 5994 5988 2060 2851 -2231 -7052 -14570 -13521 -14868 -14242 -9202 -9349 -10962 -13203 -12891 -12545 -2133 4029
6065 4029 1732 3825 1322 3545 1236 -1385 -8049 -4926 -10944 -15968 -18174 -8172 -7990 -255 -2908
6050 -2908 -4408 -4580 -733 2348 176 -2869 -1667 -2054 1672 -14 4864 8987 5569 5906 6745 8564
6034 8564 6840 4381 -4134 -6585 -12001 -9945 -13068 -13393 -9189 -5523 -2255 4071 6486 5498 5423 11936
6018 11936 11852 12999 7316 -368 2906 589 3206 858 -1694 5777 12720 7821 1031 -2769 -4374
6003 -4374 -2067 -1726 1779 428 -7099 -11727 -11267 -6682 -4385 -7943 -10313 -3754 271 3801 518
5988 518 -590 -1731 1611 2061 3368 5567 10263 6276 -7343 -10360 -10529 -3667 933 5507 -1994
5973 -1994 -9537 -12424 -11783 -5169 -7176 -13294 -10809 -11183 -6782 1605 4858 11212 8494 -639 -2773
5958 -2773 -2267 836 1393 -4885 -3491 -4442 -6759 -5767 525 -3601 -1195 206 -2392 -9030 -13365 -14347
5942 -14347 -9935 -6946 -4444 -1826 -2044 -1457 -4031 -3915 -5402 -4874 -1254 1048 3704 9105 6489 244
5926 244 -4463 -4011 3377 8987 8868 -790 -1757 -2751 -3975 -9419 -3930 1968 3958 -1706 -5024 -4494
5910 -4494 -2780 -5030 -8951 -6765 -9608 -7504 -6376 -12358 -11267 -8253 -4481 -1826 -4291 -950 -2475
5895 -2475 -1937 -3166 -1050 -2330 -2457 -66 1131 -666 2524 -294 -3318 -10707 -9023 -7106 -4680
5880 -4680 -5744 -4908 -10262 -9221 -3520 -2521 2573 9742 7985 -3690 -9749 -2244 2270 -4186 -9888
5865 -9888 -8472 -7049 -7322 -8644 -9897 -6119 -2801 182 -7345 -9758 147 8986 14137 14199 18980 16984
5849 16984 10957 15555 18113 14523 8983 5591 1585 2888 7241 1589 -1494 6342 10128 6513 119
5834 119 -13084 -11938 -11758 -12973 -10587 -8867 -11997 -6658 -5123 -7830 -13722 -12317 -5133 -2303 -3028
5819 -3028 -5171 1207 7892 8248 7875 7807 233 -8992 -9578 -12119 -11899 -13282 -7758 -6262 -2598 2008
5803 2008 1582 782 -2312 -3589 -2157 -1011 -3799 -2710 -845 -18 -4756 -7497 -10006 -9233 -1005 -622
5787 -622 135 4079 -3137 -3910 -6439 -5194 -2980 3424 1164 -1124 -2302 419 1636 -6332 -9678 -5979
5771 -5979 -4346 -4020 -4906 -6895 -6324 -6177 -3814 -3177 -118 1060 2927 5298 4016 -3536 -5387 2401
5755 2401 6393 4360 7547 10870 16430 6072 -965 -7858 -5446 1645 -893 -6297 -5063 -2993 -4056
5740 -4056 -4857 -8469 -8660 -11970 -7246 -2043 2970 6775 4657 -2150 -10353 -12031 1525 3748 -1314
5725 -1314 -3799 -11891 -13294 -927 5534 5501 2048 -4411 -11840 -11912 -11769 -6971 458 2779 5766 2803
5709 2803 -123 1265 -3971 -9809 -11558 -12213 -3235 -3454 -2730 -1606 -11401 -7573 -811 -138 -766 1063
5693 1063 -1300 -2867 68 2437 -1539 -7258 -2534 -2662 -7978 -3753 2153 2259 3419 5474 4789 345
5677 345 -364 -3033 -3009 -6083 -5609 -5504 -5633 -11909 -19602 -15360 -6743 -5209 -10431 -11653 -13822 -4435 -1869
5660 -1869 -1349 5285 10488 5708 3414 -3489 -12231 -7766 -4812 -5781 -4908 940 643 2089 4139 1553
5644 1553 2917 11005 8658 -699 -5332 -6914 -8897 -7935 -4762 -5680 205 4857 3910 -885 -10361 -6249
5628 -6249 -1434 2940 -469 -14941 -12953 -3246 5513 3356 -3794 -5745 -5215 -4621 -2266 -1128 -1170 -1627
5612 -1627 3832 5682 8256 13050 11978 1123 -6338 -8892 -8348 -6574 -3319 -6872 -10003 1036 2742
5597 2742 1735 6019 2163 2515 -51 6849 6856 1090 -1706 -2418 -2026 -9855 -9643 -9917 -4906 1103 -1543
5580 -1543 -5082 -6747 -12414 -16059 -13347 -7941 -5094 -7855 -7499 -12290 -14581 -10280 -4873 -6727 -11081
5565 -11081 -10236 -11571 -6755 -1486 -4100 1774 5834 4674 -8 -2824 -1557 -4170 -5869 -2618 -1060
5550 -1060 -2083 -5446 -6217 -10057 -732 1611 5789 -83 -7815 -8998 -4992 -4035 -356 -5950 -6431 -4820
5534 -4820 -4482 -2598 -4396 -10054 -8442 -4889 -2430 -7321 -6764 -5822 -6558 -1694 2170 5166 2213 -208
5518 -208 -2880 -989 496 -412 1180 3587 9895 5139 4010 6025 8964 5535 -2154 -4635 -5707
5503 -5707 -9768 981 9945 4174 -4180 -7875 -11796 -9789 -4323 5612 8643 1656 -466 -949 -3082
5488 -3082 -411 284 -1352 -3775 -379 1591 2495 3424 237 -1405 -1042 4939 3383 -481 2097 1555
5472 1555 1991 4755 367 3162 5467 -1385 -7885 -13890 -10990 -4179 -9138 -9997 -3943 4730 6945
5457 6945 3254 1452 -2057 -1450 -2860 -1459 -1589 -808 2018 -2609 -3917 -1890 -9733 -13218 -3625 -5526
5441 -5526 -2106 -880 388 -2602 -3714 -1912 -2116 -3118 -537 -2762 -1624 -1022 1801 709 -1751
5426 -1751 1773 -3894 -4704 -1105 1786 6639 8990 10259 3748 -3371 -7204 -8835 -7488 925 -1647
5411 -1647 -2321 3503 4913 5149 9586 2651 -4709 -1648 -2683 -3281 239 1460 432 676 -120 2886
5395 2886 4732 2319 -3720 -2946 4740 4277 -3308 -2144 243 3645 4525 3749 -1541 -2026 5641 5063
5379 5063 -1536 -797 3280 6848 4167 -4447 -3903 -2841 842 3658 6048 -2159 -7722 -6296 -6843 -2579
5363 -2579 2849 2344 135 5814 6577 7017 5181 4206 3842 2488 2931 -1932 -5035 -972 1700 1283 371
5346 371 2171 4510 4468 8838 9012 7624 4894 -1546 -777 2238 1520 -168 -7343 -5375 -1484 1357
5330 1357 5150 6208 11352 12807 8244 -4672 -4829 -1189 -879 4891 2520 -2450 4212 2444 -6827
5315 -6827 -7382 1559 3696 6467 3918 2345 1089 -2442 -129 4860 6245 11876 10856 8562 10800
5300 10800 3705 104 -2742 54 -1467 -692 -2094 -6210 -12186 -13131 -7311 -9862 -5436 -3374 -3544
5285 -3544 -7474 -12657 -9009 -7793 -9337 -8235 -11095 -3959 -3480 -2353 165 444 -4110 846 1808 -2660
5269 -2660 -4305 -7872 -7547 2358 4035 9406 4692 568 -3456 -10542 -9394 -4365 -5120 -7929 -7633 -146
5253 -146 3574 -5757 -8712 -13446 -3409 6108 4011 6582 7872 3283 686 1945 3318 4334 1830
5238 1830 8258 15155 15567 13146 4008 -4412 -6790 -3444 -5245 -1886 -2750 -424 4842 11593 11658 7309
5222 7309 6846 6581 8204 1962 -1660 4465 6769 4835 2616 64 2924 4763 4104 4507 -3124 -5503
5206 -5503 -8778 -2190 5271 6385 6746 6804 5659 2859 -809 -5017 -4245 -9217 -9045 -7944 -2880 527
5190 527 482 8693 6503 4658 4389 5247 11509 10131 7350 7775 4829 -900 3650 2318 5259 2811
5174 2811 1235 9791 18302 12296 4818 405 -1767 -2428 -62 945 -746 2218 3556 932 4755
5159 4755 13583 16387 17088 11128 4713 1114 1140 870 -2230 5756 9699 10038 7531 2774 6527 13313
5143 13313 11883 6660 6149 4248 5264 -2676 -6494 535 -174 -1909 2104 -109 -7776 -6240 313
5128 313 -2916 -5394 -3656 -1076 1784 48 -1996 2652 4060 3130 -7896 -11791 3153 7544 4211
5113 4211 5884 4845 2652 -2807 1504 8597 6315 1094 -36 8696 9620 11406 10185 3996 2162
5098 2162 1594 -4881 -6329 -6467 -11228 -6678 -8528 -13744 -14933 -11736 -11226 -11611 -10721 -7425 -14204 -10805
5082 -10805 -10895 -4868 -4376 -4545 2225 6360 3603 8060 16560 10747 5366 -366 -7516 -204 13 -1998
5066 -1998 3449 5049 2893 1611 1790 1535 2775 6380 5793 3505 -1954 -4145 -3630 -3323 -3628 -7987
5050 -7987 -5710 -2352 8266 6825 -3297 -6793 -5964 -3506 -4038 -8542 -5916 -262 7380 10374 9278
5035 9278 7520 9997 7576 -404 -4358 -2414 2380 4852 -7463 -16930 -21675 -14453 -9234 -6933 -6609
5020 -6609 -4114 3502 6754 8360 4667 5665 3295 2968 4646 4220 9660 7953 7770 3248 -6631 -12124
5004 -12124 -5571 2035 2303 3869 -730 -9490 -9138 -10682 -7925 -5422 2329 2351 3105 4106 2170 187
4988 187 3350 8463 6705 9831 5103 6096 5993 1171 -6686 -11093 -11681 -11146 -5981 3667 4999 2201
4972 2201 -1044 77 3395 2526 -73 -5579 -4983 -1209 -315 -2071 -6695 -9887 -2018 2986 8478 9479
4956 9479 4405 2427 1739 5412 6161 2559 4105 8769 14253 8294 7907 8001 7897 13820 15297 11631
4940 11631 3334 1481 196 1088 1342 3251 6194 8643 11140 8742 5530 7935 4603 2451 -4388
4925 -4388 -2890 7205 11126 11920 9145 9274 7902 7871 3452 4506 3519 -2030 421 4000 113 -5787
4909 -5787 -4013 -5165 -2853 -1978 -637 1383 5861 6967 6083 2196 973 4581 8369 10075 12711
4894 12711 10043 5249 -604 -307 742 -1826 7744 8683 11508 14960 11503 3715 3507 1920 -3227
4879 -3227 -5502 -13634 -19882 -13647 -8515 -9526 -2775 -12598 -21848 -15271 -538 7840 2217 -2484 -6378
4864 -6378 4990 3350 4977 12487 7740 2321 -2008 -2437 1257 -2263 -2143 2671 5194 6004 1732
4849 1732 -2422 -3341 -1094 2441 2803 6825 10848 10493 5256 10374 11344 8115 3116 -852 610 3100
4833 3100 -71 1940 -590 -380 -1337 -2231 -2621 -5619 -5795 -3300 -538 -2134 -1896 -3806 -4581 -1292 -4584
4816 -4584 -9938 -6075 -3872 -3974 -1676 -2795 -5011 -5321 -7311 -9377 -8832 -3600 -3768 -6377 -5910 1897
4800 1897 6421 3997 1016 8638 9760 12210 14968 11661 5765 7592 6296 2582 -4391 -7986 -12157
4785 -12157 -16481 -15506 -9514 -10220 -9233 -11164 -9800 -2869 -3848 6 431 388 -1483 -6211 -11567 -10166
4769 -10166 -6675 -9117 -7146 -5798 -8498 -7734 -2872 -891 -1908 389 6116 1447 853 -6885 -11323
4754 -11323 -6573 1584 -2899 -2702 -691 1652 -325 -2016 3707 7028 11891 11618 4715 7453 14443
4739 14443 9279 3522 241 -1091 3515 39 -9036 -3674 -242 4141 8031 11644 9175 3535 1639
4724 1639 -2953 -8511 -8239 -9719 -8661 -3610 -1179 -4980 -4659 -4513 7217 12579 11128 2030 5608
4709 5608 5369 4220 -494 -7962 -14364 -10229 -3542 3183 -1716 -7494 -6676 -6792 -3885 -3152 -358 9024
4693 9024 9274 10564 9817 15280 18431 13164 16192 12443 12406 5621 -3337 -5748 -4176 -7788 -10520 -4137
4677 -4137 -3325 -9116 -4610 -1 6608 8840 6755 -1369 -10757 -13748 -7173 -5828 -6284 -7003 -9040 -7014
4661 -7014 3087 -357 -5428 -6715 -3996 -3246 -3010 -5141 -8842 -7477 -1093 -3193 -5187 -11384 -16809
4646 -16809 -20902 -17774 -7622 168 2388 1498 2229 8451 10192 2364 -957 -1477 -1460 -2636 567 -6653
4630 -6653 -5089 4091 420 -4626 -4531 2245 3660 1478 2629 -174 2363 -1052 -5160 -10780 -9338
4615 -9338 -7746 -4751 -8983 -4695 -3160 -955 -601 -1383 3050 6837 7630 1742 -3890 -4477 -7368 -7551
4599 -7551 -4532 -8235 -9961 -12584 -9276 -7488 -11528 -9510 -6127 17 5570 5434 1908 2688 -2046
4584 -2046 -10018 -4937 798 -6372 -3154 3763 2441 2306 1629 -1108 -2624 -389 -2041 -1095 -3072 -9356
4568 -9356 -13195 -16829 -18221 -13511 -12108 -13480 -9781 -8153 -13927 -8919 -4459 -7918 -11248 -3417 204
4553 204 3696 3224 292 -2536 -3068 2715 6047 7550 5429 9888 8247 8113 1403 -4052 -5583 -2535
4537 -2535 7449 5110 5087 1494 1032 2417 5729 4700 1807 1530 -1809 -1222 276 1022 -4755 -8726
4521 -8726 -11637 -8079 -3367 1859 4788 861 819 -1359 -5220 -10372 -9416 -1326 -5855 -3588 -3607 -2930
4505 -2930 -6471 -2668 -3024 -10359 -17417 -12749 -2551 5303 800 -3297 -6999 -9091 -9292 -7576 -7445
4490 -7445 -6774 -8580 -5299 1843 8432 8452 2091 312 -251 -1601 -498 170 -1007 -2259 231 -4432
4474 -4432 -4541 -5090 -7943 -6099 -2962 -3155 -7110 -9471 -7075 -7824 -7495 -7154 -2609 -6490 -9415 -710
4458 -710 407 1073 -7005 -7479 -6615 -6099 -8863 -868 -1266 -4444 -4921 1296 6130 7542 5924 149 -393
4441 -393 -6077 -13783 -13175 -13339 -12089 -4865 1240 5639 9160 6755 7224 10186 9039 7541 2911 4431
4425 4431 4701 3550 1714 395 -4414 -11703 -2838 -974 -3787 -4532 -3814 4329 4496 -3675 -63 11741
4409 11741 19797 18034 10173 -124 -154 -865 -2981 -1127 3013 2260 2107 4775 3337 -1349 -8934 -12710
4393 -12710 -7270 1809 -190 3218 11030 9105 8823 6258 2762 4363 -2035 -7052 -2462 1055 4814
4378 4814 3733 -3762 -4534 -10573 -10515 -1686 1079 808 1370 7855 6958 -5876 -8305 -2761 1644 -575
4362 -575 -2840 -1876 419 -51 -1890 -3470 -6488 -824 2215 -712 -2704 -4969 -4717 -6495 -2631 -1854
4346 -1854 -770 -3472 -3409 1292 7989 6427 9555 9635 4850 -301 -8626 -9475 -1876 -317 -5590 -3375
4330 -3375 2886 8456 1373 -1892 -2079 -2856 -5180 -16107 -12830 -11829 -981 -416 -4263 -4518 651
4315 651 6619 6990 7569 8721 5938 882 -3204 -3638 1137 -2052 4540 9444 6121 4203 -2394 -5110
4299 -5110 -6042 -11751 -10498 -6890 -3179 -7704 -9357 -4934 -1336 2387 3176 2263 5721 11737 8243 3847
4283 3847 1302 6543 6827 872 -4979 -3660 2737 8855 2585 -5528 -10588 -4295 618 3317 2818
4268 2818 3189 -838 4745 6643 12437 17243 15190 12146 5714 5942 3858 5735 2362 1626 5350 5922
4252 5922 3988 1573 -317 -490 1731 -2775 -8936 -7309 -3843 349 2025 1327 -3655 -4855 -3202
4237 -3202 -4433 -3217 -1760 -5323 -8912 83 2992 4851 5102 4934 1960 1659 3173 1002 -473 1679
4221 1679 -3362 -12871 -8940 -2476 6089 7904 95 -7317 -5346 -1176 2312 5599 -4472 -6376 -7202
4206 -7202 -3529 -2967 -5185 -5551 -6264 -1926 4234 2405 -3526 -404 -1130 -6174 -5513 -6764 -6916 -9773
4190 -9773 -11990 -10308 -7214 -5216 -8910 -10999 -9525 -8725 817 2171 4474 4359 -8278 -15465 -22686
4175 -22686 -23014 -15994 -14651 -10467 -9843 -4831 249 -326 6085 8269 2544 -515 -863 -2844 347 5783
4159 5783 12158 9790 1809 -3113 1592 1942 -874 7987 11993 3666 -621 -3595 -956 4735 5442
4144 5442 139 1020 -3849 -9585 -9163 -1590 11115 7920 7133 6694 -540 -5100 -310 1850 -399 -5941
4128 -5941 -10610 -7031 4592 1386 -3959 -72 -668 246 1491 1306 3303 4167 1706 -1819 1197 8046
4112 8046 3843 -5643 -6363 -5935 -2793 -1957 -113 -349 -3990 -5235 -5527 -9759 -12373 -8123 -4433 369
4096 369 950 1422 -2460 -1666 -725 -2950 1059 2509 290 2622 6319 6479 1348 -2966 -10846 -5351
4080 -5351 1495 1726 598 9814 14527 1843 -5446 -8436 -12053 -12503 -13504 -14474 -4636 5027 771
4065 771 -5730 -3011 7520 13536 7398 6000 2731 -3451 -6403 -702 961 3109 6427 6116 3707
4050 3707 5943 4092 2628 -2840 -7108 2737 773 -5489 -7464 -6925 -8912 -6825 -4876 514 3
4035 3 -4742 -555 2110 -2711 -7941 180 664 244 4137 5882 2489 2107 3302 -1261 -7281 -4599
4019 -4599 1124 -2633 -11561 -8051 -653 9489 18976 15889 6654 10870 7780 5174 9155 2153 -1677
4004 -1677 592 3596 2038 -1186 549 988 -3172 -4992 -2640 -4614 -8348 -5346 -4245 1802 2091
3989 2091 -1899 429 -129 -1882 2010 3376 436 -8823 -13905 -10733 -11622 -5921 986 -388 -281 3288
3973 3288 4381 1264 -5782 -3662 4463 6351 6057 6579 12250 9245 1426 -1690 -5632 -5530 1525 9888
3957 9888 8295 -872 -13468 -13673 -5768 4612 2701 1771 110 933 6931 918 -2260 122 -8501
3942 -8501 -4828 1908 5478 1629 -4526 -5314 -636 4437 6382 8779 7981 9594 11350 10103 6345
3927 6345 2634 6960 7050 8071 9449 8608 5442 2953 3018 -4965 -2624 1431 919 1684 -11248 -6623
3911 -6623 -557 -7580 -11384 -11702 -8022 -1539 346 -5482 -12170 -6978 -5946 -4564 -2548 -4724 -9337
3896 -9337 -5284 -616 592 4557 2584 5051 801 1418 5257 5734 4508 4159 7517 11307 13171 9655
3880 9655 3370 434 -1495 1445 7998 3439 6148 11553 5618 1602 -1438 -5152 -6402 -2142 -495
3865 -495 -3663 -9023 -10736 -7373 -7594 -5268 -3273 -2352 7675 7499 1341 -2104 -5021 -8791 -6684 -10882
3849 -10882 -10910 -8954 -9843 -11143 -12841 -9896 -8059 -1785 -1157 -3166 -5795 -10944 -14144 -8432 -2018 -2626
3833 -2626 -6758 -3913 -5640 -8135 -9663 -3775 -16 -5348 -3475 -1264 -1049 -5888 -10656 -12039 -6396
3818 -6396 5623 5094 5517 3507 2337 9004 9713 8626 12054 8672 -2259 -12736 -6850 1265 4480
3803 4480 3810 -2399 -9002 -11878 -7317 -10294 -11428 -11026 -7165 -2844 -6607 -9797 -14400 -7041 6249
3788 6249 2610 -37 3138 7792 4493 7057 9875 9355 9002 7738 -31 -1764 3 -4497 -6982
3773 -6982 -1940 -2160 -12350 -18842 -13271 -10520 -8275 -4603 -9884 -6694 -6111 -15836 -15596 -7032 -1020
3758 -1020 -4124 -3637 935 1618 -1552 -3674 -3615 -2416 -2765 373 -4308 -9225 -5491 -1437 1246 -641
3742 -641 -9089 -11863 -11866 -7570 -6796 -2764 -1848 799 226 -1246 -4022 -5245 -3576 6309 6294 -3754 -474
3725 -474 6398 16030 15299 13760 11677 8741 7171 5163 4240 6501 5358 -1459 -5701 -3701 -1484 4326
3709 4326 -1333 -9267 177 5596 154 -5977 -6670 -6157 -7196 -10778 -4551 -125 2647 2930 -864 -1685
3693 -1685 -5964 -9686 -5380 -9510 -12369 -2594 -2002 -3698 -803 -4820 -904 10059 11882 5778 345
3678 345 -5828 -5885 -2620 -4514 -9455 -8284 107 338 -2289 -3034 -1984 633 2285 -5016 -6192 -2694
3662 -2694 -2057 -7251 -7265 -7682 -10260 -16159 -16154 -10532 -6834 -8033 -6304 -5875 -11689 -12865 -3292 -946 -2162
3645 -2162 3346 3082 2864 -1553 922 7444 10838 -2161 -9317 -4117 -3414 4459 8021 3552 2808 1976
3629 1976 -1404 631 833 -5509 730 6369 -517 -6510 -4842 -5402 -3789 -3063 -5415 -7222 -4809 -1948
3613 -1948 -676 -37 94 -9078 -17156 -13704 -3834 -3349 1043 -1172 -6981 -5097 -2795 349 -1881 -4244
3597 -4244 -2116 -5049 -6229 -7681 -3899 5998 2958 -3050 6806 12556 11892 9782 3879 -4984 -5074 -613
3581 -613 4563 6408 1622 77 -5832 -7540 -8288 -7925 -4474 -4080 535 -8093 -12961 -9502 -6707 -4083
3565 -4083 2708 3624 359 1797 104 3308 -610 -427 1875 3672 5819 3692 -2397 5534 13724
3550 13724 13510 7223 839 -2260 -2128 5210 6425 2812 185 -3924 -115 6048 5553 4366 -1330
3535 -1330 1245 291 -2900 -3390 223 -841 -1748 -3949 -8861 -11781 -10759 -4615 -3035 -10403 -15193 -12036
3519 -12036 -9460 -5311 -1021 5262 1572 -3000 1097 2145 -469 -2089 -2470 785 2760 3149 1159
3504 1159 -2505 -3742 214 -2237 957 1896 -2044 -7090 5747 9360 -1800 -11450 -6886 2489 1502
3489 1502 -52 6800 11731 5649 -1473 -4541 -3979 1768 5413 1718 4906 1958 -1579 -1777 -2903
3474 -2903 2445 12361 13012 8118 8522 -40 3980 6808 10835 2843 4156 2604 -5060 -12458 -9607
3459 -9607 -4009 4304 4776 5432 3377 1399 342 5998 1080 -3876 -8312 -9907 -7359 -835 3068
3444 3068 -1724 -4824 -4320 -7421 -11540 -19251 -12442 -3266 -2752 -7543 -14738 -13698 -8143 -5951 -7753
3429 -7753 -9276 -6137 -5079 -5685 -5225 -3359 -2225 -7191 -9387 -817 5192 2319 -924 740 389 1699
3413 1699 -1707 -3257 -9565 -8554 -6322 -10416 -8320 -4327 -4829 -5293 2405 9491 11909 12448 10521 13076
3397 13076 15445 12937 6011 14096 12819 9781 8737 7451 9195 6799 10534 13052 6224 2746 -399
3382 -399 -7261 -11031 -4922 534 -2787 -3152 -4420 -6168 -4765 -5260 1565 8253 16032 14842 11038 3417
3366 3417 -1873 -9057 -5655 -2665 -1325 3267 1674 -3867 -3231 -4601 -7945 -8436 -2478 -3787 -10883
3351 -10883 -11060 -5574 503 4042 5110 1806 -751 -3013 -6530 -5430 -5096 -6413 -9030 -6024 -2409
3336 -2409 5465 7936 1 6321 14873 13556 10708 3972 6731 7811 6105 11323 14101 13449 8754
3321 8754 1047 -2007 1356 6094 -262 -7994 -7922 -9211 -3163 943 6920 7308 4353 -1319 -5029 -986
3305 -986 4270 6021 2774 653 -2323 -1868 2645 7400 3250 1641 -1023 1259 -1509 -7954 -8871 -11050
3289 -11050 -2763 5922 4169 -3264 -1461 4678 6786 1374 2331 3895 -1649 -3808 -8734 -9886 -16116
3274 -16116 -15827 -5789 3955 7183 5532 4853 4638 6624 6111 7770 7112 10312 4162 1829 1242 1729
3258 1729 4136 2478 -919 -6249 -5399 -7927 -10788 -7614 3073 2689 -1348 -2987 3266 10186 4893
3243 4893 -2287 -4132 -7911 -4238 -2984 -1848 -575 430 -1832 -1982 -4222 -4311 -3625 -9065 -11465 -5993
3227 -5993 -6144 -9277 -3006 2441 -1000 -1302 -2960 -5381 -3002 -188 2235 -1350 -9537 -16198 -15862 -15259
3211 -15259 -10356 329 6787 3759 871 -6001 -7397 -7254 -2332 -3306 -3030 2006 -743 -6456 -6370 -6823
3195 -6823 -7607 -10669 -13622 -8768 -2779 1354 -879 -4388 -1113 6375 1154 -5092 -6345 -9377 -2884
3180 -2884 3316 -1668 -6929 -2479 -7096 -4155 -134 -2139 -547 -5321 -6493 -6622 -11180 -18959 -12776
3165 -12776 -5417 -3944 -8180 -7051 -2169 -7039 3749 7091 5667 10804 6902 5626 10928 8715
3151 8715 5251 3333 -1546 -5355 -3378 -6436 -5184 672 4530 4082 -2715 -1498 -3009 1432 2643
3136 2643 -5773 -13173 -7797 859 1694 6898 8546 2020 57 668 361 -1540 -4945 -4473 -4268 -6386
3120 -6386 -1544 -4167 -3896 -496 -2584 -2537 2138 2994 4351 5844 4882 837 209 -6642 -2352 197
3104 197 -515 -1350 -2539 4070 -113 -1311 2547 5369 6019 2639 2947 2497 2963 5884 5511 -2640 -11494
3087 -11494 -16035 -13853 -4950 4178 2045 1131 -2817 -7221 -7639 -8752 -6901 -10774 -5123 7168 11150
3072 11150 1173 -5428 -6905 -9520 -9279 -12866 -13940 -17059 -16260 -7725 -4660 3283 3684 2205 3218
3057 3218 7981 4869 640 3214 -162 982 2270 550 1222 -343 -3232 -3467 -2692 4295 7689 1876
3041 1876 194 -2913 2757 10858 5258 -1527 3866 7749 2336 -3114 1099 773 298 1986 3098
3026 3098 6476 6603 122 -2921 -1362 -6838 -14597 -14812 -10576 -50 3448 6296 4555 3702 4037 1536
3010 1536 -1311 -6488 -7792 -5550 948 1088 4459 9768 9675 8252 9444 8718 10327 6021 3216 3223 2401
2993 2401 4629 3167 -205 4220 4627 6900 9266 10225 7847 7638 12380 11976 9361 7820 3335 8000
2977 8000 8370 3534 5552 8603 6961 -600 170 1281 8776 13806 9067 14755 11989 3868 4905
2962 4905 6597 5126 1248 3622 2423 338 8962 14529 11654 -733 -2961 2779 1738 -1233 -1085
2947 -1085 -772 -832 5229 4140 7017 13700 12202 67 -2572 854 4394 2935 -3110 347 7927
2932 7927 1336 2961 5031 1784 -1519 -1814 3172 8403 13726 6365 -499 688 -487 -3824 791
2917 791 2538 -101 -4436 -1538 -5645 -7140 -1998 -1128 -6490 -7155 -9276 -8527 -3782 -4637 -13621 -14907
2901 -14907 -7001 5695 5534 -1472 -2074 3992 7131 5862 9333 6554 7664 5626 1371 6133 3749
2886 3749 3660 -1289 -6760 -7759 -8274 -10543 -11535 -5626 992 7197 3609 573 -7737 -8767 -12049 -6502
2870 -6502 -1065 5683 10931 10361 -4112 -6801 -2971 -2066 -3726 -10315 -9429 -6861 -10789 -8325 -1410
2855 -1410 3625 -3173 41 -5833 -6762 -1218 1606 -2343 3527 6340 11479 9311 12401 13441 13179
2840 13179 7053 3813 2568 -2701 666 -13 -1729 -1092 -1450 -7494 -7790 -2768 -891 -2950 -3027 -196
2824 -196 -179 -2720 390 1819 2052 5131 -786 -6135 -2537 881 245 2182 2768 -2244 -531 -3635
2808 -3635 -6787 -7893 -4193 1180 1279 -6551 -6865 -1874 2206 517 -2888 -4961 1522 -484 -2 -2580
2792 -2580 -5442 -6035 -2250 2648 -811 -1113 -2045 -3998 4151 14871 18544 18255 5469 -7187 -9858
2777 -9858 -9925 -8536 -4293 -2818 -4074 -8021 -4239 463 943 -581 -2989 -1584 6470 5914 7780 6565
2761 6565 -4374 -3746 -4126 -2346 646 3499 1379 462 94 4133 6739 9974 2900 -2757 -5977 -6548
2745 -6548 -12276 -11920 -5611 5650 11557 5114 5406 5945 2951 293 2559 11852 10090 3259 -2213
2730 -2213 -3241 -3956 -5001 810 1850 4291 6404 7040 8008 2581 2371 3188 6048 2953 -1913 -8813
2714 -8813 -11001 -6253 -245 3261 6270 11817 10395 4742 791 -509 -4636 -3896 -629 -6353 -9210
2699 -9210 -2892 934 145 421 -1937 -6110 -3133 -1796 -4755 -6795 -4878 -3497 -5610 -5448 5118
2684 5118 6535 -212 -6408 -5118 -1651 -2522 -8908 -13240 -10309 -5196 976 -1578 -5006 215 -2122
2669 -2122 -258 4422 -3 -444 -967 -642 874 -1985 -3813 -6399 -1970 1980 3553 5002 6026 6537
2653 6537 -180 -217 4712 8829 2515 -4457 -1432 983 2820 3965 4327 2116 -4156 -3741 -3200 -4889
2637 -4889 -8805 -1441 -1833 1547 5730 -1582 -1197 4792 8221 3536 3711 841 -3047 5612 13256 7687
2621 7687 -298 6478 9030 6384 5898 10563 7794 -2794 -7420 -1166 -2964 -231 4335 2337 2717
2606 2717 7038 12429 17488 15351 15737 15750 8809 2725 6024 7371 -1534 125 6277 7584 4039 1309
2590 1309 3594 11884 11235 7744 7850 5514 1236 -971 -6562 -9996 -2221 5560 8952 4546 -1912
2575 -1912 -1473 -3994 -7729 -6738 -3214 3941 3871 6553 4823 741 -1827 -1993 1559 5108 3753 -7292
2559 -7292 -13274 -8099 2624 3169 2798 12826 8174 8 -4301 -3821 -1835 -2983 -6034 -3913 1106
2544 1106 6327 2128 -536 -3976 1294 7581 11266 13490 7028 5839 3634 -3296 -11763 -13022 -10024
2529 -10024 -665 2204 4668 6236 9191 4944 2703 2651 -302 3101 3184 3083 5306 2923 3629 4766
2513 4766 7650 1910 517 -4529 -8240 -4447 -5425 751 131 449 5466 1655 -1802 220 5829 40
2497 40 -4962 -1878 -201 -90 6202 -91 -2374 -1936 1180 3748 -2298 -6408 -9250 -6163 753 5251
2481 5251 3445 7116 6974 994 4451 10098 6971 1207 -535 -3711 -1995 2038 -1946 -1796 4079
2466 4079 2655 -9728 -8112 -2297 -3350 -7785 -1246 4400 3568 -62 -766 -4145 -6869 -3950 -1138
2451 -1138 717 4804 6927 4758 1288 -1675 5029 6353 -3243 -986 875 5868 8469 2989 3179
2436 3179 4399 12446 18809 15170 8238 7801 12739 11608 3531 1954 6351 11190 4117 -3648 -3653 2377
2420 2377 1111 -2277 1227 244 -3258 -7156 -6074 -1636 3335 11167 8107 2793 29 665 2872
2405 2872 1019 3425 2028 -6810 -8568 -9897 -7078 3136 5435 4238 3133 221 -2523 4991 4576
2390 4576 8091 3684 1914 -96 818 1537 4365 3778 -3327 -2733 -4314 -6602 -9448 -3559 3574 1861
2374 1861 -6404 -19088 -22958 -11858 -11974 -3588 2020 -1042 -4265 -4955 -2774 -457 1004 2716 4171
2359 4171 792 -6640 -5286 4126 11172 2870 -6353 -2318 1525 5437 7766 3906 -2091 -5777 2699
2344 2699 9743 8231 4955 4426 9730 6072 7736 8762 8194 12072 9397 3902 517 1210 4882 8631
2328 8631 2861 -2507 -5830 -7734 3256 9682 10041 7152 -2053 -7159 -2950 -3888 -10329 -11752 -8465
2313 -8465 -8995 -10639 -8350 -38 410 3504 2445 -9980 -7694 -6261 -7329 -8164 -4620 -6969 -5136
2298 -5136 -3817 -4422 -4492 -5520 -10766 -6368 -5829 -2753 174 -2007 -2392 -3161 -2404 933 -1988 -1644 2386
2281 2386 1115 -2260 -4300 -5759 -7284 -5575 -3110 -6805 -12221 -7418 -337 -2062 -6578 -7805 -4757
2266 -4757 -382 566 200 57 -1123 -3793 -710 1127 2624 480 -5259 -9995 -7484 -7240 -6245 -6541
2250 -6541 -2210 1322 592 -2916 1887 2177 990 -2546 -6039 -6122 -3189 772 1787 2945 1195 -2050
2234 -2050 4285 9238 1911 -4995 -3765 5061 4717 3318 -924 -3785 -3774 907 3567 1096 -8244 -12748
2218 -12748 -7277 -756 -2240 -2086 6593 12961 14642 7135 300 -703 454 7882 12706 8783 1227
2203 1227 -923 86 5314 11758 10871 2803 -2832 -2120 5256 3956 2275 -2228 -4086 -3466 890 4741
2187 4741 5428 6932 6371 6307 6626 5195 -637 -2654 2900 13966 2619 -4759 -2928 2678 2749 3502
2171 3502 3585 1140 4783 5375 4873 4357 1681 -1132 -8093 -9449 -6924 -2797 2639 -1838 -2948 -1394
2155 -1394 -814 1880 -636 2427 6248 7057 7648 4421 -5631 -3262 -1236 -3627 -11706 -6522 -3070
2140 -3070 -2792 -827 -2006 -1284 922 7736 5693 1747 182 1968 259 -941 -11493 -13286 -7590
2125 -7590 -5157 1541 3335 2611 -817 1744 -489 -944 4181 6483 5251 1598 4271 7050 5942
2110 5942 -2238 -3822 861 5382 -105 -4427 1980 8229 7 -1164 1151 4284 4454 -1817 -4932
2095 -4932 -6582 -5522 -7236 -8027 -4556 -926 -368 5933 2844 -506 0 1017 -5426 -8194 -4927 -3733
2079 -3733 2071 1468 -7162 -2204 1922 1004 -3679 -7826 -10445 -12923 -7552 -6903 -9487 -3220 994 763
2063 763 910 4129 -1786 -3639 6210 9343 10176 12258 17596 15905 8820 8622 502 -3460 -3459 3364 952
2046 952 -4853 -2463 4822 9114 9702 8604 6147 5803 1036 7716 6661 1182 -2279 -3719 -3317 -5473
2030 -5473 -5405 -6090 -3410 -3668 976 6596 5287 5022 401 1074 -2879 -5270 2713 9286 9703 8176 7843
2013 7843 769 -2596 2061 6000 5168 3935 2412 651 958 -1903 -5816 -3924 -2449 -4104 1782
1998 1782 1002 3419 4164 14862 11165 1747 1704 -2630 -7273 -5585 -934 4535 6430 5020 -1442 -4182
1982 -4182 -1751 -3365 3368 9208 8258 7858 3806 3116 1438 1241 -1330 6337 3731 1041 -7526 -8862
1966 -8862 -4140 3719 1857 -2480 8250 16911 13874 3505 -113 2326 4215 7169 8993 6267
1952 6267 -869 -5648 -9960 -11989 -7215 -7234 -3302 -5405 -3291 1543 3032 5790 8536 4407 -148
1937 -148 -3067 -6447 -13682 -13746 -8995 -12054 -7751 -7437 -5117 114 -3367 -5186 -1449 2818 2071 -2840
1921 -2840 -8563 -6297 -7543 -6738 2197 5093 8928 1869 5714 5434 6042 10893 509 -6697 -5505
1906 -5505 -11115 -8779 -7179 -9801 -11609 -7474 -2286 977 -754 1516 3673 10299 11774 14510 17143
1891 17143 12207 6383 4785 7248 7273 5717 2736 -802 2223 6989 10793 9803 5005 1489 1304 3550
1875 3550 5083 -104 1343 1327 -65 -1848 3633 7038 11281 7284 1745 -289 -2986 -5657 -10789
1860 -10789 -10812 -8482 -7153 -136 1330 1146 -899 -3111 -3608 -2837 -7896 -13028 -11091 -15072 -13130 -13387
1844 -13387 -5750 -3908 1858 1699 1539 184 -4294 -8346 -7469 -3593 603 4373 2998 3532 2232 2814
1828 2814 8516 10902 6503 -478 784 -5773 -13224 -3154 3644 4641 -21 588 -2666 -7966 -2472
1813 -2472 -729 2703 3145 3998 -786 -2079 -2086 -4363 -1703 -4062 -3807 -4362 -12332 -17744 -22335 -17446 -15516
1796 -15516 -9325 -3300 5124 14781 11110 3557 633 2258 7263 8991 825 259 9158 6954 4655
1781 4655 4520 -485 -2849 -2401 199 1466 737 -964 -5368 -9773 -5995 -744 407 -3597 -5219 -10185
1765 -10185 -3208 -7112 -7961 -6781 -8993 -7960 -10669 -6139 -903 -4882 -6601 -2864 -1728 -3864 -2468
1750 -2468 -3367 -3720 -2297 4113 8025 6427 984 -5113 -2057 -886 -3164 877 -1896 -1716 6634 8762
1734 8762 6031 7509 4643 1720 2915 2749 -386 -1303 -1240 -1922 -1870 -4525 -2885 2123 6314 10047 4336
1717 4336 765 3470 6186 3809 6687 3397 -4272 -4584 -1526 -6060 -6664 -7082 -6042 -7579 -15962 -8878
1701 -8878 1892 6930 2687 -5098 -4502 5053 8366 7407 5348 -2627 -7735 -5941 1742 6761 -213
1686 -213 -9344 -8252 5532 11769 16613 6369 -3553 -3578 -3073 7987 5801 193 -1585 -4347 -444
1671 -444 2363 2817 3718 6472 6466 409 -4295 -8321 -3912 2233 -791 -4516 -6639 -4507 4482 6759
1655 6759 1133 -7708 -11665 -5868 -2966 2198 3739 -1137 4238 8878 9105 15531 14765 8563 -776
1640 -776 -2314 1104 4710 5968 5663 11749 7694 7581 4232 5385 6436 8104 11556 6887 2340 3203
1624 3203 7513 6467 6143 7958 7488 9019 7734 7226 7571 3660 5384 9492 16203 18626 15584 14597
1608 14597 11921 11864 11123 7566 -3058 -4816 -7804 -5093 1550 4809 3967 1904 1857 -1923 -5038 -390
1592 -390 9014 6497 -2077 -2719 -4959 -16482 -14446 -4949 -4647 -5741 -244 -3945 411 890 -3784 -5303
1576 -5303 1389 5705 1838 1341 2293 -806 2201 3278 6449 2853 -564 896 5580 6863 -2808
1561 -2808 -11763 -9857 -6223 -8261 -7015 2135 109 131 1957 -225 18 729 1159 -3360 -2152 2619
1545 2619 -13 -1555 -2459 -6734 -5919 -2114 -1940 -1700 4155 6602 7780 9587 10364 9848 7984 8752 9814
1528 9814 4440 2735 832 1045 -2262 -6061 121 8270 6007 9718 8191 1039 6258 5426 -2823
1513 -2823 -5088 -2545 -1103 -3108 -5878 -8609 -11646 -8732 -6845 -4532 -2660 1295 -679 -6563 -1080
1498 -1080 1899 -5194 -9475 -8899 -6336 -2268 -432 2415 -2172 -5577 -5715 -4044 -4719 -8480 -10973 -14390
1482 -14390 -9144 -3926 -671 2061 3180 3581 2917 -263 3063 7681 3093 11545 9662 5543 -1059
1467 -1059 -4228 -7218 -2235 -287 -2071 -1220 1616 -2465 -4770 -1202 -3645 -9097 -8986 -4477 806
1452 806 -5383 -8742 -8090 -887 -2978 -5194 -3882 -3785 -7906 -4179 1496 7669 8671 3817 -479 -5900
1436 -5900 -10712 -8972 -6695 -4102 -2582 1114 192 8454 14691 17662 17150 3277 -4599 -5312 -8637
1421 -8637 -5035 -181 6487 11352 16444 14908 15960 13039 3806 -3169 -10378 -9708 -4781 -1521 5722
1406 5722 6351 6917 8555 4715 -192 -855 -1125 -609 1018 7189 8803 1961 -2356 7491 15067 9342
1390 9342 12078 11978 2270 173 8350 4745 5742 3558 2175 4200 6487 7769 5528 355 4506
1375 4506 8223 4167 1616 3775 2163 1826 4526 6584 3268 5439 11494 18427 25459 26223 19386
1360 19386 24807 19765 15146 17065 11532 9937 4708 2884 -769 -188 4666 4811 147 -5203 -4341
1345 -4341 695 1259 1960 106 4644 6607 4355 -4703 -3454 2723 3150 -308 -5115 -5061 -1585 -3212
1329 -3212 -5129 -3300 2261 -363 -1202 -693 -823 1299 -7915 -13055 -7385 -1955 1425 3351 15102
1314 15102 16373 10701 11161 10893 5924 3671 8003 14963 15370 16203 20049 18633 8335 1595 1592 -5019
1298 -5019 2832 6308 159 5841 10773 5818 -267 -5576 -15656 -19896 -15161 -3145 4552 6955
1284 6955 6589 -1164 2656 3113 576 2982 4804 2456 -700 2962 5356 8605 8782 9603 7830 5859
1268 5859 7390 5009 3639 5086 742 -1417 1070 -1797 -2656 -534 1211 753 -1087 -2510 2415
1253 2415 2342 625 -4969 -10382 -7885 -7038 -5370 -1032 -614 -7093 -7955 -11211 -4462 7647 7213 7541
1237 7541 11288 12641 9863 3819 -2276 -7658 -6719 -3901 -486 -6022 -5804 41 5907 2927 307
1222 307 -3651 1484 8719 2464 -6994 -9843 -7400 -6916 1378 4891 -902 -997 -1304 -8915 -11465 -10538
1206 -10538 -11598 -9456 -638 6369 6353 7080 3656 1718 -845 -3661 -3841 -506 -30 -3511 -5217 -5220 -1729
1189 -1729 -1869 -5464 -5667 -10685 -10262 -11036 -7259 -2134 -1236 -2745 -7195 -5318 -919 7873 8568 1256
1173 1256 624 6998 14525 13446 9893 607 -4590 2036 1228 -8583 -8682 -1398 5005 1611 -261 3402
1157 3402 -6 -6672 -8453 -5211 -1699 -1643 2894 5406 497 960 999 2535 4506 -2101 5698 8876
1141 8876 6629 4941 6771 4316 3066 8285 8893 4242 1630 -1598 -2284 -586 1668 3780 1595
1126 1595 -2538 -2684 -2716 1074 1572 8935 14164 11436 5402 3031 2928 6613 1926 -3199 -1587 5462
1110 5462 4690 -1491 -5421 -3467 -4102 -5089 -3036 -2056 -714 1326 -1516 1074 6886 2290 -1205 3284
1094 3284 2213 1355 2872 6885 7986 2408 1242 5586 2638 -1880 2950 4383 46 -4421 -10473
1079 -10473 -4195 -7731 -6126 -453 -1911 6136 10675 7774 4361 3865 6275 2019 6920 2605 376
1064 376 5065 10871 18363 14519 1603 -4945 265 -1741 -8924 -7285 -3426 -833 3491 3960 2839
1049 2839 4009 5322 1759 2887 6384 8643 12930 14782 10890 5631 -2896 -6040 -516 3927 4641
1034 4641 4193 446 2770 9691 9028 7832 7845 -885 -4466 -1786 802 -1166 -3305 -5137 1109 185
1018 185 -212 780 667 -549 416 758 4630 7682 -450 -3422 -6509 -11012 -9358 -523 7312 13140
1002 13140 13568 11855 13829 12803 12331 5128 4459 195 917 6192 4377 3773 2164 4004 7295 8543
986 8543 2048 5787 6464 10625 10120 3135 5010 2350 7232 8799 9814 3721 3581 6212 8019 4700
970 4700 -1670 -3086 -666 3765 9028 2068 -845 -1743 -3573 -2373 -1631 -6283 -4876 -7085 -12075 -14363
954 -14363 -14522 -9883 -3929 -3343 -3091 437 3416 10749 9265 1763 -1966 -132 1701 1060 234 22
938 22 -3971 -3439 -3055 8201 12433 7647 4887 5557 2216 4137 820 -2627 3027 3002 -2680 -244 7201
921 7201 7542 4739 2300 1758 471 -124 4363 5164 960 -1901 -36 700 3430 5369 3929 4355 -391
904 -391 -2360 -2363 -5065 -420 -1478 -1866 -2787 -1281 -1449 1222 720 4921 6703 5251 7652 16037 17795
887 17795 7209 4619 4918 3598 3441 7495 4506 6951 4749 2754 589 3517 -585 -3317 5496
872 5496 10452 9878 10075 8751 6993 -438 956 -2195 2865 5908 1170 4089 5945 2314 10475 16100
856 16100 16752 14752 8944 4757 66 1263 -528 -6493 -4520 -2908 5472 4952 1317 8459 13799
841 13799 12853 10823 15582 17783 18736 15562 10880 18882 18826 11649 3542 1688 1932 7041 955 -5090
825 -5090 -3199 7973 12574 5063 -927 2759 2989 2325 -1231 4865 2071 -1394 -1476 2273 -304 4921
809 4921 9002 11396 10552 9562 17219 11680 7395 408 3914 12806 7830 3775 6165 5231 3165 1469
793 1469 3163 36 4134 2323 2075 5063 4273 -2585 -2488 -1620 -387 -3218 -9432 -10863 -9043 -572
777 -572 2515 3275 4057 7914 2566 2693 7870 10212 3292 1866 1291 6229 7763 6393 1723 2638 8885
760 8885 6980 3619 6108 13500 7546 9251 6549 1582 8803 13716 12049 7381 12043 10967 10911 9194
744 9194 5274 6393 5786 5208 3991 -2280 -4515 336 -254 -2391 133 3941 -1115 -5538 -1970 -2162
728 -2162 -3328 2064 5440 16892 14090 3515 22 1553 -4911 1658 15192 18173 16528 9223
714 9223 13888 14357 11819 13013 10722 11112 6858 -871 -2456 -4424 -4316 7595 8638 9146 7936 8745
698 8745 7569 7368 10745 11275 4819 -2149 -6273 -2186 -4522 1655 5080 5636 3157 132 -251 3056
682 3056 8521 4868 -2095 -6954 -2032 1741 -3144 -3114 -3000 5237 12585 13930 10605 4751 3752 2043
666 2043 917 -2049 1188 -1314 -1707 -5575 -9111 -4695 -298 13419 10577 5107 4864 4233 4768 4465
650 4465 1185 6836 11607 10625 3890 -4391 -456 8903 9182 7543 4510 4991 10500 15792 18627 16143
634 16143 5695 1749 4430 7313 2129 -220 1039 -2511 -5576 -1438 1606 6816 8415 3331 7372
619 7372 12461 16386 18454 17267 14666 19261 14361 11022 10876 7698 596 -5675 -4746 -1807 7752 10513
603 10513 5822 5742 8013 5371 -126 -3670 5111 10206 15029 10641 6505 -2741 -7160 -3444 -1719
588 -1719 6258 8804 2734 -2147 1369 4125 5452 4095 10327 -1327 -3809 623 2568 5892 13175
573 13175 19512 14467 6923 -416 -3387 722 5224 1426 3809 4437 11057 19362 13663 3583 -3466
558 -3466 -3545 2741 64 -3490 -3590 -3063 950 -1245 -3297 -2771 -5378 -10343 -5163 -2844 5672 11043
542 11043 9953 12870 14879 15971 11550 8799 4042 -4692 -7052 -6928 -3655 -2358 175 2178 6212
527 6212 7501 2591 2037 6574 9000 14081 14437 18585 14519 6552 3445 492 -7925 -7668 303 8682
511 8682 7246 4470 3912 7498 8483 6297 -2130 -931 6312 1316 3882 6281 6565 8371 6418 5107
495 5107 9035 15099 11908 6201 1097 2746 8381 9505 8712 3078 5652 5463 7985 8419 4022 3504
479 3504 1696 8937 10800 11788 10445 7106 8652 2043 1308 1615 1260 6177 15495 14007 5442 2651
463 2651 3920 8630 6689 4484 990 3267 1665 134 -2325 -4303 -6951 -6979 -10030 -14088 -7489 -1465
447 -1465 6762 6700 -1502 -2962 1714 4790 2888 3730 7127 6095 6672 5797 -1901 6281 10869 13434
431 13434 13961 11791 11703 12829 11464 8117 18574 17695 8921 9780 9725 5943 -960 -6754 -3685 2839
415 2839 4314 1779 5339 13691 15517 7628 13701 18158 10316 1432 9200 4616 -646 805 5929
400 5929 8730 10220 10142 6126 3960 2785 -2900 3361 12465 10915 7616 10812 13187 8006 2919 5585
384 5585 8683 5411 9192 10819 3853 -2996 -3531 907 4856 3428 1600 1169 1610 1541 2915 1679
368 1679 7757 5571 1288 4180 4961 9291 13737 12210 5724 3766 9633 10163 4512 -69 571 2884
352 2884 6385 9591 7319 9511 6090 4335 11156 11927 14313 12880 7857 5812 1897 4827 5644 -1187
336 -1187 -5631 -7118 -7496 -5113 -817 1805 1035 -7796 -5378 1177 3019 -945 -1193 3804 6663 6021
320 6021 6864 4392 -1771 -3792 516 1314 1428 7281 11425 7151 7086 6919 4271 4911 6010 8918 4988
303 4988 3135 8258 15158 15570 14406 15508 13050 4849 -2596 -3218 4945 7985 4421 9549 12042 12140
287 12140 6137 3036 3840 1349 -2832 -1029 5644 12905 9113 7972 9885 7066 2519 726 4426
272 4426 7711 6442 4376 2272 4517 5345 1978 -1655 -4090 145 -502 2679 2487 4228 9986 10736
256 10736 9875 10098 7423 2981 4755 10741 10076 4667 4399 4362 3952 5015 241 5103 8019 5850 4708
239 4708 5516 5884 11949 10539 6096 -373 -1379 3121 3384 3606 3673 6863 14152 14187 11069 11053 13527 12096
221 12096 12345 10199 6038 7695 7360 1655 3293 4420 7702 8566 3516 3682 3437 1235 602 1334 2024
204 2024 1932 -991 -4326 -1348 7565 7298 5435 3616 3547 2390 8718 11628 10488 10127 11227 13645 7742
187 7742 5802 3298 4700 7752 4135 9160 6609 6 -5624 -7793 -3103 4520 8944 5762 2008
172 2008 635 1029 8004 10075 3630 -1743 902 6570 9722 6725 996 2152 6984 10772 14750
157 14750 13554 8227 11580 12859 11254 7603 7832 5334 4079 3607 292 927 1286 4473 2774 2967
141 2967 31 -1438 -829 1107 6114 9693 12086 13778 11419 8632 6834 4905 4201 2749 5950 10952
125 10952 6741 -62 1414 7226 9402 9393 10492 6795 9034 6346 2197 -991 3312 4635 7346 12302
109 12302 13058 8351 5448 6366 11617 14763 12452 11469 11240 9406 8141 3313 5849 7710 10765 11375
93 11375 9956 6764 2776 2890 2839 2828 6780 6657 1611 1226 10328 10234 4557 -253 -1962 -2721 1073 2390
75 2390 2050 290 4237 7955 8012 4950 1644 2785 2922 2813 5727 4914 2111 177 500 -395 -2818
58 -2818 -2020 1110 376 229 3269 7224 10265 13613 13975 10709 5351 3300 2175 3639 469 -3266
42 -3266 -2103 2448 -388 4191 12008 12532 17027 17635 16271 11604 6115 6388 8929 12340 10956 7004
26 7004 6738 9589 6605 5654 9230 8641 4773 7617 9755 7666 4208 1435 5757 10294 8560 3409
10 3409 1974 7554 11092 10521 4691 613 2913 5066 2763 -946
0i46
$$ Imaginary data points
##PAGE= N=2
##DATA TABLE= (X++(I..I)), XYDATA
32767 35609 36501 33689 31164 33697 34789 36119 33453 27975 28785 33592 37777 39516 36418 36539 33365
32752 33365 28878 28061 34961 35477 37526 35052 36396 43001 43113 40950 39034 38414 41449 44217 42664
32737 42664 42695 40042 42536 40900 45216 47502 48197 53638 51418 49060 47183 47366 53250 50036 46354
32722 46354 49731 56370 56603 55220 54004 51673 49267 49685 49205 49611 47333 44162 49328 52120 51066
32707 51066 53581 52400 49521 48033 49225 53634 59413 63482 64958 65689 65139 63414 64870 61757 63397
32692 63397 63155 57582 58853 59361 58226 55028 55379 56112 55634 57304 61126 60470 57926 60203 63430 63359
32676 63359 62900 66567 68935 65201 66616 68159 72091 72991 70872 70752 71479 66889 66686 68210 74014 75350
32660 75350 70821 70267 71343 70579 69947 67325 65159 65371 66419 67884 70954 76829 81164 78842 78815 79048
32644 79048 79208 78835 78626 78606 73474 70409 73134 70021 72458 72651 75265 76023 74425 76968 77694 78022 79348
32627 79348 82113 85769 86452 86323 86753 82637 84956 87727 84122 83499 84897 86824 87844 92494 91704 87842
32611 87842 93169 94521 90828 84661 86065 84672 86429 89026 91627 94991 96615 98104 92650 90684
32597 90684 96675 100559 102297 105384 102036 99431 96679 96615 94997 93261 97859 100956 101443 97062 94350
32582 94350 98713 99762 95861 95449 96693 95928 94850 101083 106520 106005 108130 107251 105649 111211 116558
32567 116558 111805 107394 98347 93656 95448 95270 99259 105035 102801 101820 109369 115933 114264 109643 103545
32552 103545 103947 106439 111265 110865 108286 110596 109179 108767 111270 117010 111407 110538 112901 111511 108436
32537 108436 106976 110078 116462 117572 114624 111974 113928 114929 113300 112201 105971 104774 104717 105625 108497
32522 108497 117068 123897 120703 117024 118256 119457 119944 118247 116434 110240 112941 119223 118592 115297 117228
32507 117228 121134 125364 126744 123690 124340 122299 121722 121563 121936 114059 110710 114514 111159 104168 107836
32492 107836 111200 114244 117036 123245 119851 115784 116191 126491 129281 129178 130699 129157 131783 134815
32478 134815 133680 130966 124876 121941 120082 121551 122439 123887 125644 126385 131441 135580 134935 132551 128626
32463 128626 127044 122964 121086 123093 126612 132057 132164 128242 126940 135206 143031 147048 142327 136337
32449 136337 130269 131281 132463 133152 134709 138010 137742 134520 134624 135848 132735 128087 121864 129050 131835
32434 131835 133508 133943 137018 132311 131878 134042 136548 137486 143086 140142 141002 144406 143402 139530 143609
32419 143609 146216 142568 134853 133832 141171 139135 143836 140741 137977 141362 145650 147190 145942 145584
32405 145584 148832 142093 138189 141111 143878 145501 149627 148444 150921 155967 147437 145994 145815 146267 148317
32390 148317 146384 145845 141167 135709 137920 142294 147780 149483 149109 149700 145960 145697 145277 146875 142730
32375 142730 133959 135481 140616 145076 145453 134827 132186 144477 148789 147249 152274 154813 155234 154438
32361 154438 151226 153447 152434 145021 142372 143881 146049 148497 150240 146083 149540 153690 151975 144445
32347 144445 140026 136130 142152 143296 144691 144613 145017 144161 142748 146473 152345 152815 151610 154253 149848
32332 149848 142789 144511 146673 148095 144445 142753 153860 149697 145219 140202 139807 143284 139928 140658
32318 140658 140682 132177 136079 141026 142130 145937 147230 150975 148651 151963 155166 154285 157563 159371 150905
32303 150905 146377 144818 138216 126608 127601 140090 148947 149081 148454 150198 152979 154572 149349 148221
32289 148221 152079 149980 147087 148808 145700 155148 166761 167714 159093 156692 161127 161695 154900 156010
32275 156010 160548 159952 149513 143460 142165 139543 144681 158255 162158 160604 155653 166387 171281 169325
32261 169325 160558 159836 162283 157380 152149 152325 153780 155562 155925 150675 145225 145893 148168 147025 145325
32246 145325 141233 138460 147246 159583 158104 160515 164150 159785 158095 161044 159033 153419 149316 153785
32232 153785 154660 156462 160340 153798 151776 152829 152256 151357 154825 155802 154494 149907 147738 154484 153817
32217 153817 151655 151111 149127 153892 154145 154458 153263 148566 150802 155269 164485 160796 158452 162345 157104
32202 157104 146824 144305 151215 150862 147711 152545 153764 150368 149352 148300 148088 151143 161173 164682
32188 164682 167044 161618 157537 163278 168489 165212 161866 160994 156932 157228 159882 159949 160123 163953 161189
32173 161189 158566 157705 156255 156955 156222 153534 147510 148105 153604 157181 150097 145339 152214 157641 164199
32158 164199 166885 162920 160582 160309 153225 151993 152028 155043 159165 162259 157810 157221 154456 151303 163137
32143 163137 174106 171543 174090 173582 166014 156914 159596 160962 154842 152774 153842 157578 156325 152065
32129 152065 150903 162410 170591 173953 163293 156887 155916 157026 164576 163756 164555 162448 159551 165693
32115 165693 163684 161335 162410 159902 160665 155248 156117 159979 161499 164172 162658 165579 168058 165091 167727
32100 167727 165968 160130 156062 152275 152928 155209 156389 153009 152763 161492 163682 161150 161518 160614 157798
32085 157798 154777 155511 161736 159787 160696 160003 154067 147661 153487 158574 160963 165659 169600 164342 158832
32070 158832 163484 168387 164659 159606 151655 149630 151744 160703 166753 164704 159788 158371 160828 164202
32056 164202 169135 168787 162001 157942 154838 154660 160789 156219 157214 163100 164805 163121 162992 157363 155320
32041 155320 153686 159072 161660 165415 160204 154450 155371 154840 154564 159207 165400 159991 158283 160212 159378
32026 159378 156260 156380 160733 163634 168111 170348 163881 155876 158575 163377 162751 160068 163151 167582 165523
32011 165523 152998 147179 156439 162491 164986 165655 157633 155775 161861 165963 167354 164469 164737 159551
31997 159551 156479 153106 152440 149581 157462 158304 153184 151288 152945 154907 153095 154727 156561 154779 158326
31982 158326 169233 178221 178061 172568 171913 176253 174270 171155 168346 167451 166088 159998 165083 169067 165908
31967 165908 165920 166034 162703 158961 157273 159526 157085 158039 164159 164322 159057 159211 155797 156871 161626 160597
31951 160597 165357 169013 164725 167951 170505 167694 163236 166577 167421 166354 170201 163094 157748 160881
31937 160881 165639 167021 168813 168516 160899 159728 159981 165930 177614 178803 177838 169856 170367 174541 175126
31922 175126 175712 177644 171783 168313 165412 161947 161988 165108 165127 159529 154935 147718 148112 155993 158744 160691
31906 160691 155207 144071 149099 160465 163720 162144 160983 158870 159007 157835 160907 161037 168739 172948
31892 172948 171707 172210 166050 161973 158078 164492 165233 157383 156910 167741 174386 172789 168633 166955 165777
31877 165777 161323 164428 163793 169441 176103 172924 163802 161940 156316 149712 151714 164117 166169 155784
31863 155784 154124 157359 159030 159872 153225 154210 157959 157604 158008 162012 160119 156543 157916 158624 151664
31848 151664 154174 152027 152428 155260 153220 155554 155461 153741 156120 160063 156404 156601 162525 166442 168309
31833 168309 169562 171348 169528 166485 158866 154483 161508 172552 164994 154942 154202 154049 155137 157163
31819 157163 156846 156109 148591 149566 154288 157099 161827 161571 159891 158748 157280 151686 148681 155443 154466
31804 154466 156349 160503 153754 156909 156008 158268 164247 160909 157124 156825 157461 155906 154340 150188 152970
31789 152970 156079 159710 163799 165152 161976 160901 160846 161041 165742 171052 165985 155857 157668 161656 165916
31774 165916 166364 161455 153618 154755 156056 155725 157543 159739 161244 158566 154993 158953 164430 166507 167181
31759 167181 169217 164720 163067 166397 168080 165028 166048 164308 161331 158517 162886 165754 163904 162074
31745 162074 163782 168438 175545 171863 161909 163809 166950 165236 164056 169801 173198 171970 172407 172456 170003
31730 170003 171263 177940 175373 179032 179213 172061 169836 164337 161746 160931 153024 151785 152187 151533 153712
31715 153712 155094 156106 158142 160793 162701 163598 166407 163013 160378 164683 162219 155128 147475 143707
31701 143707 152753 153302 150700 152006 154689 156718 165237 163303 166800 172330 168501 169093 171719 170771 170605
$$ [...]
##END NTUPLES=NMR SPECTRUM
##END=
