##TITLE=Analysis number 319518
Compound Code cc 05804
Project Code adrs
Chemist Name ugmt
##JCAMPDX= 6.0         $$ Bruker NMR JCAMP-DX V2.0
##DATA TYPE= NMR SPECTRUM
##DATA CLASS= NTUPLES
##ORIGIN= Bruker BioSpin GmbH
##OWNER= nmr
$$ XWIN-NMR		Version 3.5
$$ Wed May 17 14:43:29 2006 GMT Daylight Time (UT+1h)  MAYBRIDGE\nmr@NMR_250MHZ
##.OBSERVE FREQUENCY= 250.131544655141
##.OBSERVE NUCLEUS= ^1H
##.ACQUISITION MODE= SIMULTANEOUS (DQD)
##.ACQUISITION SCHEME= undefined
##.AVERAGES= 16
##.DIGITISER RES= 18
##SPECTROMETER/DATA SYSTEM= dpx250
##.PULSE SEQUENCE= zg30
##.SOLVENT NAME= CDCl3
##.SHIFT REFERENCE= (INTERNAL, CDCl3, 0, 16.522)
##AUDIT TRAIL= $$ (NUMBER, WHEN, WHO, WHERE, WHAT)
$$ ##TITLE= Audit trail, XWIN-NMR		Version 3.5
$$ ##JCAMPDX= 5.01
$$ ##ORIGIN= Bruker BioSpin GmbH
$$ ##OWNER= nmr
$$ C:\u/data/dgb/nmr/ADRS/4660/pdata/1/auditp.txt
$$ ##AUDIT TRAIL=  $$ (NUMBER, WHEN, WHO, WHERE, WHAT)
(   1,<2006-05-17 14:42:37.09 +100>,<MAYBRIDGE\nmr>,<NMR_250MHZ>,
      <created by zg, POWCHK disabled, PULCHK disabled
       configuration hash MD5:
       84 BC 41 DB A1 6E 1D 46 DA 25 12 A5 C1 ED C5 3A
       data hash MD5: 64K
       C7 2D D6 6F 5B 48 C2 CD 0D A2 B9 E2 FC 39 66 B8>)
(   2,<2006-05-17 14:42:54.96 +100>,<MAYBRIDGE\nmr>,<NMR_250MHZ>,
      <Start of raw data processing
       ef LB = 0.3 FT_mod = 6 PKNL = 1 SI = 32K 
       data hash MD5: 32K
       87 B2 F1 39 F4 79 20 AB E2 E9 64 FC DC 29 60 9C>)
(   3,<2006-05-17 14:42:59.42 +100>,<MAYBRIDGE\nmr>,<NMR_250MHZ>,
      <apk 
       data hash MD5: 32K
       DE 42 5E 8B 79 18 AE 7E E7 97 8D 35 43 AA DD 25>)
(   4,<2006-05-17 14:43:01.12 +100>,<MAYBRIDGE\nmr>,<NMR_250MHZ>,
      <abs ABSG = 5 
       data hash MD5: 32K
       CA EF 87 6E C7 21 89 84 69 DF 71 03 64 42 D9 8E>)
$$ ##END=
$$ 
$$ hash MD5
$$ CE D3 47 8A 3A 85 0F A1 93 73 8F 2E 95 60 38 E3
##$RELAX= 
##$RELAX= 
##$RELAX= 
##$RELAX= 
##$RELAX= 
##$RELAX= 
##$RELAX= 
$$ Bruker specific parameters
$$ --------------------------
##$DU= <C:\u>
##$EXPNO= 4660
##$NAME= <ADRS>
##$PROCNO= 1
##$TYPE= <nmr>
##$USER= <dgb>
##$AMP= (0..31)
100 100 100 100 100 100 100 100 100 100 100 100 100 100 100 100 100 100 
100 100 100 100 100 100 100 100 100 100 100 100 100 100 
##$AQSEQ= 0
##$AQ_mod= 3
##$AUNM= <au_zg>
##$AUTOPOS= <44 >
##$BF1= 250.13
##$BF2= 250.13
##$BF3= 250.13
##$BF4= 250.13
##$BF5= 500.13
##$BF6= 500.13
##$BF7= 500.13
##$BF8= 500.13
##$BYTORDA= 1
##$CFDGTYP= 0
##$CFRGTYP= 5
##$CHEMSTR= <none>
##$CNST= (0..31)
1 1 145 1 1 1 1 1 1 1 1 1 1 1 1 1 1 1 1 1 1 1 1 1 1 1 1 1 1 1 1 1 
##$CPDPRG= <>
##$CPDPRG1= <>
##$CPDPRG2= <>
##$CPDPRG3= <>
##$CPDPRG4= <mlev>
##$CPDPRG5= <mlev>
##$CPDPRG6= <mlev>
##$CPDPRG7= <mlev>
##$CPDPRG8= <mlev>
##$CPDPRGB= <>
##$CPDPRGT= <>
##$D= (0..31)
0 1 0 0 0 0 0 0 0 0.06 0 0 0 0 0 0 0.0002 0 0 0 0 0 0 0 0 0 0 0 0 0 0 
0 
##$DATE= 1147873354
##$DBL= (0..7)
120 120 120 120 120 120 120 120 
##$DBP= (0..7)
150 150 150 150 150 150 150 150 
##$DBP07= 0
##$DBPNAM0= <>
##$DBPNAM1= <>
##$DBPNAM2= <>
##$DBPNAM3= <>
$$ [...]
##$SUBNAM7= <"">
##$SUBNAM8= <"">
##$SUBNAM9= <"">
##$SW= 20.6930455092707
##$SWIBOX= (0..15)
0 0 3 0 0 0 0 0 0 0 0 0 0 0 0 0 
##$SW_h= 5175.983436853
##$TD= 65536
##$TD0= 1
##$TE= 295.16
##$TE2= 300
##$TE3= 300
##$TEG= 300
##$TL= (0..7)
0 120 120 120 120 120 120 120 
##$TP= (0..7)
150 150 150 150 150 150 150 150 
##$TP07= 0
##$TPNAME0= <>
##$TPNAME1= <>
##$TPNAME2= <>
##$TPNAME3= <>
##$TPNAME4= <>
##$TPNAME5= <>
##$TPNAME6= <>
##$TPNAME7= <>
##$TPOAL= (0..7)
0.5 0.5 0.5 0.5 0.5 0.5 0.5 0.5 
##$TPOFFS= (0..7)
0 0 0 0 0 0 0 0 
##$TUNHIN= 0
##$TUNHOUT= 0
##$TUNXOUT= 0
##$USERA1= <user>
##$USERA2= <user>
##$USERA3= <user>
##$USERA4= <user>
##$USERA5= <user>
##$V9= 5
##$VALIST= <valist>
##$VCLIST= <CCCCCCCCCCCCCCC>
##$VD= 0
##$VDLIST= <DDDDDDDDDDDDDDD>
##$VPLIST= <PPPPPPPPPPPPPPP>
##$VTLIST= <TTTTTTTTTTTTTTT>
##$WBST= 1024
##$WBSW= 4
##$XGAIN= (0..3)
0 0 0 0 
##$XL= 0
##$YL= 0
##$YMAX_a= 538615
##$YMIN_a= -539556
##$ZGOPTNS= <>
##$ZL1= 120
##$ZL2= 120
##$ZL3= 120
##$ZL4= 120
##$ABSF1= 16.522
##$ABSF2= -4.171173
##$ABSG= 5
##$ABSL= 3
##$ALPHA= 0
##$AQORDER= 0
##$ASSFAC= 0
##$ASSFACI= 0
##$ASSFACX= 0
##$ASSWID= 0
##$AUNMP= <proc_1d>
##$AZFE= 0.1
##$AZFW= 0.1
##$BCFW= 0
##$BC_mod= 0
##$BYTORDP= 0
##$COROFFS= 0
##$CY= 12.5
##$DATMOD= 1
##$DC= 0
##$DFILT= <>
##$DTYPP= 0
##$F1P= 14.0000005364418
##$F2P= -0.99999901652339
##$FCOR= 0.5
##$FTSIZE= 32768
##$FT_mod= 6
##$GAMMA= 0
##$GB= 0
##$INTBC= 1
##$INTSCL= 1
##$ISEN= 128
##$LB= 0.3
##$LEV0= 0
##$LPBIN= 0
##$MAXI= 10000
##$MC2= 0
##$MEAN= 0
##$ME_mod= 0
##$MI= 0
##$NCOEF= 0
##$NC_proc= -2
##$NLEV= 6
##$NOISF1= 0
##$NOISF2= 0
##$NSP= 0
##$NTH_PI= 0
##$NZP= 0
##$OFFSET= 16.522
##$PC= 1
##$PHC0= 167.0738
##$PHC1= 2.951337
##$PH_mod= 1
##$PKNL= yes
##$PPARMOD= 0
##$PSCAL= 4
##$PSIGN= 0
##$REVERSE= no
##$SF= 250.13
##$SI= 32768
##$SIGF1= 0
##$SIGF2= 0
##$SINO= 400
##$SIOLD= 32768
##$SREGLST= <1H.CDCl3>
##$SSB= 0
##$STSI= 32768
##$STSR= 0
##$SW_p= 5175.98343685301
##$SYMM= 0
##$S_DEV= 0
##$TDeff= 65536
##$TDoff= 0
##$TI= <Analysis number 999999
Compound Code 99
Book Reference 9
Project Code 9>
##$TILT= no
##$TM1= 0
##$TM2= 0
##$TOPLEV= 0
##$USERP1= <user>
##$USERP2= <user>
##$USERP3= <user>
##$USERP4= <user>
##$USERP5= <user>
##$WDW= 1
##$XDIM= 32768
##$YMAX_p= 305802063
##$YMIN_p= -29106
$$ End of Bruker specific parameters
$$ ---------------------------------
##NTUPLES= NMR SPECTRUM
##VAR_NAME=  FREQUENCY,     SPECTRUM/REAL,   SPECTRUM/IMAG
##SYMBOL=    X,             R,               I
##VAR_TYPE=  INDEPENDENT,   DEPENDENT,       DEPENDENT
##VAR_FORM=  AFFN,          ASDF,            ASDF
##VAR_DIM=   32768,         32768,           32768
##UNITS=     HZ,            ARBITRARY UNITS, ARBITRARY UNITS
##FACTOR=    0.157963299565203, 1,           1
##FIRST=     4132.6476996994, 0,             0
##LAST=      -1043.33573715361, 0,           0
##MIN=       -1043.33573715361, -29106,      0
##MAX=       4132.6476996994, 305802063,     0
$$ Real data points
##PAGE= N=1
##DATA TABLE= (X++(R..R)), XYDATA
$$ [...]
17639a4637k799P850R829L078p499n572M651M357k43L831k829l249n425J475L28
17624f854j269K238k75K630m205j452P201K581P15M965l135q708m487p11L80l131
17608a3517m681K016R152M183m86j252j880k729K184R75p119J5J1292M956k823
17593B86l556L174K947J095m150j304L697m268J619m22j953J211j356j54n214
17578h348j1040M621J2994P682j667n729L160j346m152l30l19j588N146J400M019
17563D503o88n793k906K978j571l341M433O176n337o15n2j259k625m931l146K969
17547a1205K224O068q4m80j875K187O18J42o75M047N340l710j618l950l681M239
17531b413Q9O8L473M274k934j498n864J997K339m657K457L043j902m533j49L756
$$ plain form
17639 -14637 -17436 -9586 243 3321 -4178 -9750 -5099 -742 -985 2846 17 -3232 -8657 -7182 -6854
17624 -6854 -8123 -5885 -6160 -3530 -7735 -9187 -1986 595 1310 6275 3140 -5568 -10055 -10766 -10386 -13517
17608 -13517 -18198 -16182 -7030 -2847 -3333 -4585 -6465 -9194 -7010 -6035 -13154 -13139 -1847 3109 286
17593 286 -3270 -96 2851 3946 -204 -1508 2189 -2079 -460 -882 -2835 -1624 -2980 -3134 -8348
17578 -8348 -19388 -14767 -1773 5909 4242 -1487 1673 327 -3825 -4155 -4474 -6062 -916 484 4503
17563 4503 3815 -1978 -4884 -1906 -3477 -6818 -2385 3791 -1546 -2161 -2213 -3472 -6097 -11028 -14174 -11205
17547 -11205 -8981 -2913 -2997 -3477 -5352 -3165 -2547 -2405 -3080 967 6307 2597 979 -2971 -6652 -2413
17531 -2413 -2324 -2256 1217 5491 2557 1059 -4805 -2808 -469 -5126 -2669 374 -1528 -6061 -6210 -2454
17515b454J333n85L250p00j888l408m956K450m1p93M519K01j373l276K586L479
17499a656j068l188j561j923Q33j645P996K250j157o289L040M005l981L519J447
17484F22n73N80L696m941k913L517L50J909M041K047n947m846J889pl950K362
17468b164l44N554K980j075n116m325P12K018N576o551J321J692l648J191o404
17453h583K92J0640J843n666m981N197M56o72L415N216L186N370J5025Q003j0421
17438B8320p713o328p619m494L351k310l080k938M604q009q80O022K373q1K950
17423D168m582l371J13K887L001J989m50l473j839j589M199K383K918k730L465
17408G089J132j214k081n137o30k755k570m708O104L957l182j755Q456N121J420
$$ plain form
17515 -2454 -1121 -1706 1544 844 -1044 -4452 -9408 -6958 -6999 -7792 -3273 -3072 -4445 -7721 -5135 -1656
17499 -1656 -2724 -5912 -7473 -9396 -8563 -10208 -2212 38 -1119 -7408 -4368 -363 -4344 -825 622
17484 622 49 629 4325 -616 -3529 -12 338 2247 6288 8335 2388 -2458 -569 -576 -4526 -2164
17468 -2164 -2508 3046 6026 4951 -165 -4490 -3778 -1760 3816 -2735 -1414 278 -3370 -2179 -8583
17453 -8583 -8291 2349 4192 -1474 -6455 -1258 -802 -1474 1941 7157 10343 15713 30738 38741 28320
17438 28320 20607 14279 6660 2166 5517 3207 127 -2811 1793 -6216 -7096 -1074 1299 1218 4168
17423 4168 -414 -3785 -3672 -785 2216 4205 3755 282 -1557 -3146 1053 3436 6354 3624 7089
17408 7089 8221 7007 4926 -211 -841 -3596 -6166 -10874 -4770 -813 -3995 -5750 2706 7827 9247
17393I247q850o654n482J903K890O919M595o226k587k470N216k731q798l769P296
17378i501M512M449J88k919j725L48n236O93M892R75j041j11k41l552J982N459
17362h28l676J264p94o024m971L615O050o32J386J132k485o753k637N627K977
17347f749j908K411O99L623m863M852O174J596k414l801L9L180K158m320r505
17332h828n100L135K044P527Q287j203n428n992n903m696M402P801M002N020J60
17317E228J463l302O343j072p715m093N550N981j906r10n272r64L855j300l551
17302a665o014p9K737L46j373R54m76K328M127P229j440j191o123q23L560J90
17286B287k791m213l007K756K472J802M597j279l267o383p725k002J989R127k61
$$ plain form
17393 9247 397 -6257 -11739 -9836 -6946 -27 4568 -1658 -4245 -6715 -1499 -4230 -13028 -16797 -9501
17378 -9501 -4989 -540 -352 -3271 -4996 -4648 -9884 -9191 -4299 -3324 -4365 -4476 -4717 -8269 -6287 -828
17362 -828 -4504 -3240 -4034 -10058 -15029 -11414 -5364 -5996 -4610 -3478 -5963 -12716 -15353 -9726 -6749
17347 -6749 -8657 -6246 -5547 -1924 -6787 -1935 4239 5835 3421 -380 -341 2839 4997 677 -8828
17332 -8828 -13928 -10793 -8749 -1222 7065 5862 434 -5558 -11461 -16157 -11755 -3954 48 5068 5228
17317 5228 6691 3389 9732 8660 945 -3148 2402 8383 6477 5567 295 -669 3186 1886 -1665
17302 -1665 -7679 -7758 -5021 -4675 -6048 -5094 -5570 -3242 885 8114 6674 5483 -640 -1463 2097 2287
17286 2287 -504 -4717 -7724 -4968 -2496 -694 3903 2624 -643 -7026 -14751 -16753 -14764 -5637 -5898
17271e898n87O672N048k305n491k436M659K650m021n5k753j09l717o511L413K971
17255h470O299l518J024L5l72Q627k392N786O493m981k372j693j311j31j585j869
17239d30J714l960n835m785M836L214N477j0162J2j149j64j996P577j337J267
17224e721j670n45m70Q460k047J029m66K6q21m049k639N1j479Q025M673J277j435
17207B199K251J18p269m532K177k151K004L039K66M322J896l43K227K509q652
17192F1l719k911M684K290l031m300j450J844k851L191M18n846K414L126j773
17177g853K437K888m097p039K465k109M544L673j298K574p06J509n18l234m665
17162a1429J945K032k6L112l761N709J659o812K050J981m105m635L714P579n667
$$ plain form
17271 -5898 -6485 187 5235 2930 -2561 -4997 -338 2312 -1709 -1764 -4517 -4626 -8343 -14854 -11441 -8470
17255 -8470 -2171 -5689 -4665 -4630 -5002 3625 1233 7019 13512 8531 6159 4466 3155 3024 1439 -430
17239 -430 1284 -2676 -8511 -13296 -8460 -5246 231 -9931 -9919 -11068 -11232 -13228 -5651 -6988 -5721
17224 -5721 -7391 -7936 -8406 54 -1993 -964 -1430 -1404 -2225 -6274 -8913 -8862 -10341 -2316 2357 3634 2199
17207 2199 4450 4568 -2701 -7233 -5056 -7207 -5203 -2164 -1898 2424 4320 3977 6204 8713 61
17192 61 -3658 -6569 -1885 405 -2626 -6926 -8376 -6532 -9383 -6192 -5774 -11620 -9206 -6080 -7853
17177 -7853 -5416 -2528 -6625 -13664 -11199 -13308 -8764 -5091 -6389 -3815 -4521 -3012 -3530 -6764 -11429
17162 -11429 -9484 -7452 -7478 -4366 -8127 -2418 -759 -7571 -5521 -3540 -7645 -12280 -8566 -987 -6654
17147f654J45L797L707k004J894p299q139k38N145O744L640j043n636j648j28
17132g717k327N45l336p41K242Q16m526J382O857J96l029l826n196Q498P560Q541
17116E939l835l673K902O108J211n423p094Q66L700l352r080K39O85k387J332
17101a1862L961m409m15J1551N274q672l208P561j65L355l316p050O09O7Q145
17086A426K91k779n585K948L365r254L718M809R82j140n47l42m505r051J275K466
17070a1923P98n05j476k467k335K561m8K330L508O144L897l068k688j325R229
17055B632j219K044k905p568K864P983N839l320l765L271k702k134k026j072N537
17040C459k257j864p13J946O937J711m213m478l91j846N07K965M748K699O269
$$ plain form
17147 -6654 -6509 -2712 995 -1009 885 -6414 -14553 -14791 -9646 -2902 738 -305 -5941 -7589 -7717
17132 -7717 -10044 -9499 -12835 -13576 -11334 -10518 -15044 -13662 -6805 -6609 -9638 -13464 -18660 -10162 -2602 5939
17116 5939 2104 -1569 1333 7441 8652 3229 -3865 -2999 701 -2651 -11731 -11492 -10807 -13194 -11862
17101 -11862 -7901 -12310 -12725 -1174 4100 -4572 -7780 -219 -384 2971 -345 -7395 -6786 -6719 1426
17086 1426 1717 -1062 -6647 -3699 -334 -9588 -5870 -1061 -79 -1219 -1766 -2108 -6613 -15664 -14389 -11923
17070 -11923 -11125 -11630 -13106 -15573 -17908 -15347 -15395 -13065 -9557 -3413 484 -2584 -5272 -6597 2632
17055 2632 1413 3457 552 -7016 -4152 3831 9670 6350 2585 5856 3154 1020 -1006 -2078 3459
17040 3459 1202 -662 -1375 571 7508 9219 5006 528 137 -1709 -1202 1763 6511 9210 15479
17025A5479l491j2476o244M299k382m75J484L061o74J45O022N27k479k518n380
17010e102J791L71M48K264j537o77K747l120n252L048O135p31L936k849o153o900
16994a1581L90O289J726J526k346K631m165l236k976k277M390o24l416k210K320
16979a3559j202P416j571J342j066O636M246n918J617m962n351R33L264M763O818
16964C406J371N274j127k160p00J068N685m892k994l926J785r67J650J669j298
16949C844j400J60K67l676N649N423m108m889J407l08k080n586j0452L017J669
16934a1063P905P057k160J160m803m395j321J911J2198L467k557K241q965r290
16920h615J1198N442j452q00K541M28j562L031m532k306q25p77K911J588M90p616
$$ plain form
17025 15479 11988 -488 -6732 -2433 -4815 -5290 -3806 -745 -1419 -1274 4748 5275 2796 278 -5102
17010 -5102 -3311 -2940 -2492 -228 -1765 -2442 305 -2815 -8067 -5019 1116 385 4321 1472 -4681 -11581
16994 -11581 -11191 -4902 -3176 -1650 -3996 -1365 -5530 -8766 -11742 -14019 -9629 -10253 -13669 -15879 -13559
16979 -13559 -14761 -7345 -8916 -7574 -8640 -2004 2242 -3676 -2059 -7021 -12372 -11439 -8175 -3412 3406
16964 3406 4777 10051 8924 6764 6064 7132 12817 7925 4931 1005 2790 1823 3473 5142 3844
16949 3844 2444 2604 2871 -805 4844 10267 6159 1270 2677 2369 289 -5297 -15749 -12732 -11063
16934 -11063 -3158 3899 1739 2899 -1904 -6299 -7620 -5709 6489 9956 7399 9640 675 -8615
16920 -8615 2583 8025 6573 5773 8314 8742 7180 10211 5679 3373 2548 1771 4682 6270 6760 -856
16904h56m831L194K283l491j117m02j342K215J862j912P09l447p240J512J1346
16889a517O92N397L681o833l755O815M363q442o631R343l715j0184L751L563k373
16874e845l919j535M093N006K039j894n983q566O57N662O22K63m643k275N598
16859a0720N389Q012M297k245k854j369k265n873P03j803J226J601m360k234J643
16844a0852P51M774m024N62j042j386K683J760j046L537N86K292j418J946k341
16829c218n52J388k077k342M484M028N611n004l446m401L221O614o605j1500l49
16814a4148j433L221K774k65K528k266M051O659j194q942j929R29J971L99K011
16799e634M233l715k808N14J919m150J227k618k275L651M106N84k404L255l253
$$ plain form
16904 -856 -5687 -2493 -210 -3701 -4818 -5220 -6562 -4347 -2485 -4397 -3688 -7135 -14375 -12863 -1517
16889 -1517 -825 4572 8253 1420 -2335 4480 8843 401 -6230 3113 -602 -10786 -7035 -3472 -5845
16874 -5845 -9764 -11299 -7206 -2200 -161 -2055 -8038 -16604 -15947 -10285 -9663 -9400 -14043 -16318 -10720
16859 -10720 -5331 2681 6978 4733 1879 510 -1755 -7628 -6925 -8728 -7502 -5901 -10261 -12495 -10852
16844 -10852 -10101 -5327 -9351 -8789 -9831 -11217 -8534 -6774 -7820 -4283 -3697 -1405 -2823 -877 -3218
16829 -3218 -3770 -2382 -4459 -6801 -2317 1711 7322 2318 -1128 -5529 -2308 4306 -2299 -13799 -14148
16814 -14148 -15581 -12360 -9586 -9851 -7323 -9589 -5538 1121 -73 -9015 -10944 -10015 -8044 -7645 -5634
16799 -5634 -1401 -5116 -7924 -7410 -5491 -9641 -8414 -11032 -13307 -9656 -5550 -4966 -7370 -4115 -7368
16784g368K773q867n05M932l346p719Q43J040Q51L028M622K477K494j893O448
16769a90R89L697O589l262q090o277J667o77r57J99o240K170k63o051K285k79
16753a4690O321j618q26Q360P490r745l792K120K653Q580L604k380m12l933q50
16738H82N969p03p52o283o69K514M933j091n983j084N644R42q79l671J677P242
16722H688R64k607j1126k389K172N365K413l84l415q73L50n051M992k742k321
16707e964J539l059j041L737J766K301R831k334q643m133j043j739N52L400J567
16692c263J0250N203l78m302o836r259k854j336O677N853M804K533R80J772l688
16677F156M90N279L007K81J513k529j1090q685m312O369l948n156l925o60O161
$$ plain form
16784 -7368 -4595 -13462 -13967 -9035 -12381 -20100 -19257 -18217 -17366 -14338 -9716 -7239 -4745 -6638 -190
16769 -190 799 4496 11085 7823 -267 -6544 -4877 -5554 -6511 -6312 -12552 -10382 -10645 -16696 -14411 -14690
16753 -14690 -8369 -9987 -10813 -2453 5037 -4708 -8500 -6380 -3727 4853 8457 6077 5665 1732 882
16738 882 6851 6148 5396 -887 -1556 958 5891 4800 -1183 -2267 3377 4319 3440 -231 1446 8688
16722 8688 9652 7045 -4081 -6470 -4298 1067 3480 3096 -319 -1192 -842 -5893 -901 -3643 -5964
16707 -5964 -4425 -7484 -8525 -4788 -3022 -721 9110 6776 -1867 -6000 -7043 -8782 -8230 -4830 -3263
16692 -3263 6987 12190 11812 7510 674 -8585 -11439 -12775 -6098 -245 4559 7092 8072 9844 6156
16677 6156 6646 11925 14932 15213 16726 14197 3107 -5578 -9890 -3521 -7469 -12625 -16550 -17210 -11049
16662a1049O58l691O129J852J028m837J135K724N47l689j724K838J600k135l16
16647h930Q79l562l746O92L894K336N181P43o214n415m473l71J1863J104n334
16632a1353L737J639L14N14N728O89j409j790n750N301j530K084j968n279k610
16617a1683J949R409M495J656k458l096o717L755K555P37L664M21k534n931q0
16602c858j141k332K956J235k008Q66M915q91n235l677l476n267L125N387O892
16587b509k160J041j826j0042K351M342j265K749j574k789N556J984j720k181
16573h043K240N35k89P571N850k943j787m962N28K142q397o512L47K293N010N490
16557i27n055N55J179k611n48l769m392M506J569K226K752N29J243k525m689m451
$$ plain form
16662 -11049 -10391 -14082 -7953 -6101 -5073 -9910 -8775 -6051 -5504 -9193 -10917 -8079 -6479 -8614 -8930
16647 -8930 -8051 -11613 -15359 -14667 -10773 -8437 -3256 -2513 -8727 -14142 -18615 -18986 -7123 -6019 -11353
16632 -11353 -7616 -5977 -5663 -5149 579 1268 -141 -1931 -7681 -2380 -3910 -1826 -3794 -9073 -11683
16617 -11683 -9734 -325 4170 5826 3368 272 -6445 -2690 -135 602 4266 4687 2153 -3778 -3858
16602 -3858 -4999 -7331 -4375 -3140 -5148 -4282 633 -258 -5493 -9170 -12646 -17913 -14788 -9401 -2509
16587 -2509 -4669 -3628 -5454 -15496 -13145 -8803 -10068 -7319 -8893 -11682 -6126 -4142 -5862 -8043
16573 -8043 -5803 -5268 -5557 2014 7864 4921 3134 -1828 -1300 842 -7555 -14067 -13720 -11427 -6417 -927
16557 -927 -5982 -5427 -4248 -6859 -7407 -11176 -15568 -11062 -9493 -7267 -4515 -3986 -2743 -5268 -9957 -14408
16541a4408j605j743P12L900L206J744K740k147p578r49J848L337K367l849M025
16526h400J0089L585k948L92r390p001K633N68j907j781m314N164Q68L775M36
16511h231o43k65J512j62m132O89p8N432N877N066o51J025q48l651L622q583l277
16494g298m079o57M223j700l957K126L73r37o478M87Q884L034k147N174L471j976
16478a457p946m51k657O203R130m979j007k67n251K079n373M009M02j399k924
16463a1888K939k086M24J628P069j582k860r13j623N960N112l378q693p249q437
16448b5577J491J0022K48k847O792Q778N381N469m054J682k773j58m48K836K835
16433I677k370m756L994k075m181q930J412P318K540R57k36N000j1483p933M489
$$ plain form
16541 -14408 -16013 -17756 -17044 -13144 -9938 -8194 -5454 -7601 -15179 -16128 -14280 -10943 -8576 -12425 -8400
16526 -8400 1689 5274 2326 2718 -6672 -13673 -11040 -10472 -12379 -14160 -18474 -13310 -12442 -8667 -8231
16511 -8231 -8874 -9139 -7627 -7789 -11921 -11232 -11310 -5878 -1 5065 4414 5439 4591 940 4562 -4021 -7298
16494 -7298 -11377 -12034 -7811 -9511 -13468 -11342 -10969 -11906 -18384 -17897 -9013 -5979 -8126 -2952 519 -1457
16478 -1457 -9403 -9854 -12511 -6308 2822 -2157 -3164 -3431 -8682 -6603 -11976 -7967 -7565 -8964 -11888
16463 -11888 -8949 -11035 -10611 -8983 -1914 -3496 -6356 -7269 -8892 -2932 2180 -1198 -9891 -17140 -25577
16448 -25577 -24086 -14064 -13816 -16663 -9871 -1093 4288 9757 5703 7385 4612 4454 4006 6842 9677
16433 9677 7307 2551 6545 4470 289 -8641 -7229 89 2629 3586 3350 8350 -3133 -11066 -6577
16418f577p48m080J0461P9p117l775L871K605N311j254J850l054J065K923m861
16403c301J298Q013K407k332l260p489j384K698l843k480k089l49k189K321K483
16388i496R90J681J574n71l819L437L167l91Q55j912p455J748M230J1197R87j835
16372D387m633n012n433K021K259n005J449M54o44L819l560K614M622K199l275
16357c738k84N521K975M983k366k684K830O03n363m181j135m538n0L297L74L487
16341b69N477R00k886n6m708J632m874M45L906j85J193l162j747l93q06J295M805
16324E67n930K12j617K557M483K723m682j683J796j287j464R76l920r50j509r72
16308a0700N742K461l97j433K464J205j072m973J553L010m062j931K333o970l929
$$ plain form
16418 -6577 -7325 -11405 -944 -865 -7982 -11757 -7886 -5281 30 -1224 626 -2428 -1363 1560 -3301
16403 -3301 -2003 6010 8417 6085 2825 -4664 -6048 -3350 -7193 -9673 -11762 -12111 -14300 -11979 -9496
16388 -9496 -8506 -6825 -5251 -5822 -9641 -6204 -3037 -3428 -2573 -4485 -11940 -10192 -5962 5235 6222 4387
16372 4387 -246 -5258 -10691 -8670 -6411 -11416 -9967 -9513 -10157 -6338 -9898 -7284 -2662 -463 -3738
16357 -3738 -4022 1499 4474 9457 7091 4407 7237 7840 2477 -1704 -2839 -7377 -7427 -4130 -3756 -269
16341 -269 5208 6108 3222 3166 -1542 90 -4784 -4339 -433 -618 575 -2587 -4334 -4727 -5533 -4238 567
16324 567 -5363 -5151 -6768 -4211 272 2995 -1687 -3370 -1574 -2861 -4325 -3349 -7269 -8219 -9728 -10700
16308 -10700 -4958 -2497 -2894 -4327 -1863 -658 -1730 -6703 -5150 -2140 -6202 -8133 -5800 -12770 -16699
16293a6699J492M263J1156K293k226k387L530k887j377j094j641L63K41J409J279
16278b285L979j724n719j260k665P114m11j203p849n33K227K621J316j216p710
16263a5318K61R520P828J708K892r57R58j046l582N33K543r70o373l144J367O534
16247B754O850n416q029M25R44m213N240M818m55j893k121R79m574k651j773R103
16231a2j053M726m048j116J052N446R4j187m824k915k47k360k506j222J059l918
16215a3031L207L36O845M428L29Q06m047K73j821J123K066k911j079o189n24M656
16199e533R655N492j799p583j931n62j876m919o274k770l293N889J0708J272q95
16184d419m558m330l382K315P869j522J170n718L572k411O024K75j89M381k309
$$ plain form
16293 -16699 -15207 -10944 212 2505 279 -2108 1422 -1465 -2842 -3936 -5577 -5214 -4973 -3564 -2285
16278 -2285 1694 -30 -5749 -7009 -9674 -2560 -2971 -4174 -12023 -12556 -10329 -7708 -6392 -7608 -15318
16263 -15318 -15057 -5537 2291 3999 6891 5934 6892 5846 2264 2797 5340 4370 -2003 -5147 -3780 2754
16247 2754 9604 4188 -3841 -3416 -2472 -6685 -1445 3373 2918 1025 -1096 -117 -4691 -7342 -9115 -12
16231 -12 -1065 3661 -387 -1503 -451 4995 5089 3902 -922 -3837 -4084 -6444 -8950 -10172 -9113 -13031
16215 -13031 -9824 -9488 -2643 1785 2114 2920 -1127 -854 -2675 -1552 514 -2397 -3476 -9665 -10189 -5533
16199 -5533 4122 9614 7815 232 -1699 -2261 -4137 -9056 -15330 -18100 -21393 -15504 -4796 -3524 -4419
16184 -4419 -8977 -13307 -16689 -14374 -6505 -8027 -6857 -12575 -9003 -11414 -5390 -5115 -5304 -923 -3232
16169c232j787P35m767k967L978L770l490K433M945l049K848m266l189L864r234
16154a3408l823O510J359n450n537k980O397O351J308j795Q57K759J416k434O208
16139b262K398m02M358R49k370J67l056n149M672M606n85l262m607j228J027O726
16123A982L517j825k033j689j800q058n369J268q35M185J2189j933K391N250l926
16108C314o117j598M785m06k824j81o60J314l847j857L719K952n94q92k172P09
16092d355m35j473K59n343l885j109M130J1613O424L217q43n334n279J419n187
16077f181k204N64l51j979L350R56l63k159j845L47L957k961J335m561M318N170
16061b607J659O50j338K546J868Q154m524n069m519k705n688n460M299O549o661
$$ plain form
16169 -3232 -5019 -4284 -9051 -12018 -8040 -4270 -7760 -5327 -382 -3431 -583 -4849 -8038 -4174 -13408
16154 -13408 -17231 -10721 -9362 -14812 -20349 -23329 -16932 -10581 -9273 -11068 -10211 -7452 -6036 -8470 -2262
16139 -2262 136 -266 4092 5041 2671 2838 -218 -5367 -695 3911 3326 64 -4543 -5771 -4744 1982
16123 1982 5499 3674 1641 -48 -1848 -9906 -15275 -14007 -14842 -10657 1532 -401 1990 7240 3314
16108 3314 -2803 -4401 384 -22 -2846 -3027 -3687 -2373 -6220 -8077 -4358 -1406 -2000 -2892 -5064 -4355
16092 -4355 -4790 -6263 -6004 -11347 -15232 -16341 -12211 -598 5826 9043 8200 2866 -2413 -994 -6181
16077 -6181 -8385 -7821 -8172 -10151 -6801 -5845 -6208 -8367 -10212 -9865 -5908 -8869 -7534 -12095 -7777 -2607
16061 -2607 -948 -298 -1636 910 2778 10932 6408 1339 -3180 -5885 -11573 -17033 -12734 -6185 -12846
16046a2846m118L762O144l245K755N226K024K92k065K728j481m073M967j00K071
16031B041k555j331n077l539K661j632k788l199k589J425P061o040r579L03N049
16016a9789M890M245L56M088p1o618j993J792M972K023m285K650O351k376O422
16001B657k551n117q71K609l654j292Q06J788J673p9k841N730O054o873p930r74
15985a0865P149J973Q542l457l509L76k638L730n83k142k336N759j415l606k656
15970e678J119P05J936l80N256j285j264K299m626q82j256l490M959L609k074
15955a052l27M783m460k657n647p531J270j558P355O679J017O723n321r722j219
15940a1667M071k426l951N41J1452l65K874J262k688l695j1363j408J418Q648
$$ plain form
16046 -12846 -16964 -13202 -7058 -10303 -7548 -2322 -298 -6 -2071 657 -824 -4897 70 -30 2041
16031 2041 -514 -1845 -6922 -10461 -7800 -9432 -12220 -15419 -18008 -16583 -9522 -15562 -25141 -24838 -19789
16016 -19789 -14899 -10654 -10298 -6210 -6281 -12899 -14892 -13100 -8128 -6105 -10390 -7740 -1389 -3765 2657
16001 2657 106 -5011 -5882 -3273 -6927 -8219 -7413 -5625 -3952 -4031 -6872 -1142 4912 -1961 -9891 -10865
15985 -10865 -3716 -1743 6799 3342 -167 209 -2429 1301 718 -1424 -3760 1999 584 -3022 -5678
15970 -5678 -4559 -3854 -1918 -2298 2958 1673 409 2708 -1918 -2800 -4056 -7546 -2587 1022 -1052
15955 -1052 -1379 3404 -1056 -3713 -9360 -16891 -15621 -17179 -9824 -3145 -2128 4595 -726 -10448 -11667
15940 -11667 -7596 -10022 -13973 -13432 -1980 -2345 529 1791 -897 -4592 -15955 -17363 -15945 -7297
15926g297J26J631J778Q50L756n44J382j493O17K086J445j225l992m364l628M212
15910d660j530L41N708p67P64l99l001M758J779o161J672n580r546q70L938O870
15894f684J520N613P74m177L70Q194O63r337m340l317L700R616l697n723J501
15879e324N71O248j309m028M94M982k462P11m024N258Q345l459n706J555j223
15864F29l690k927K816N979J651n314K214j037k418P201J2k469P88Q85q205o846
15848a0731m359J5R162J0842k002o247M391j636m529M304J070K327j252n87n042
15833d274k066j540K809k418m111p56N924O889M637j1244n614Q483K872K758j793
15818E56m743K823Q020l947k96r22K179o74q447n296O923J981j151M338m838j1269
$$ plain form
15926 -7297 -7171 -5540 -3762 -2912 844 300 1682 189 806 2892 4337 3112 -880 -5244 -8872 -4660
15910 -4660 -6190 -5849 -141 -908 -144 -543 -3544 1214 2993 -3168 -1496 -7076 -16622 -17492 -13554 -6684
15894 -6684 -5164 449 1223 -2954 -2584 5610 6273 -3064 -7404 -10721 -7021 2595 -1102 -6825 -5324
15879 -5324 -4753 1495 186 -3842 -3348 1634 -828 -117 -4141 1117 9462 6003 297 1852 629
15864 629 -3061 -5988 -3172 2807 4458 -856 1358 321 -2097 5104 5116 2647 3435 4320 -3885 -10731
15848 -10731 -15090 -15075 -5913 4929 2927 -3320 1071 -565 -5094 -790 280 2607 1355 768 -4274
15833 -4274 -6340 -7880 -5071 -7489 -11600 -12356 -6432 457 5094 -6150 -11764 -3281 -409 2349 556
15818 556 -4187 -1364 6656 2709 2413 1491 3670 2996 -5451 -10747 -3824 -1843 -2994 1344 -3494 -14763
15802a4763k505Q540L293L675J877r215J053R927P73j4773l798J328N253O991
15788b344k342j4M618j804NO9k070o533n292k28Q590l578k097O92N036P25M591
15771a976P372m065l153n159j531k472k030Q963Q95l615m22M92J224Q74O34J487
15755b482m895m639k302O321L9l257O933N581K203p2m565p561J665Q315j846n493
15739f055K330K780L761k298k997n887O062O254j86l033n376p127k233l556o094
15724b3655j75Q155O504l375L380J160O079K220k562J403L700l394l887j779k248
15709h474N996M603J014l784M73p914j327l426R95r19J192L861O205J972j127
15694f60m828n202m959j269N126M376P03K38K629m553r14L010l978l737Q37p768
$$ plain form
15802 -14763 -17268 -8728 -5435 -1760 117 -9098 -8045 1882 2655 -12118 -15916 -14588 -9335 -2344
15788 -2344 -4686 -4700 -82 -1886 -1881 -1812 -3882 -10415 -15707 -15935 -7345 -10923 -13020 -12328 -7292 -6567 -1976
15771 -1976 5396 1331 -1822 -6981 -8512 -10984 -13014 -4051 -3156 -6771 -7193 -6701 -5477 -4603 -3969 -2482
15755 -2482 -7377 -12016 -14318 -7997 -7958 -11215 -4282 1299 3502 3430 -1135 -8696 -7031 1284 -562 -6055
15739 -6055 -3725 -945 2816 518 -2479 -8366 -2304 3950 3764 731 -4645 -11772 -14005 -17561 -23655
15724 -23655 -23830 -15675 -9171 -12546 -9166 -8006 -1927 293 -2269 -866 2834 -560 -4447 -6226 -8474
15709 -8474 -2478 2125 3139 -645 -172 -8086 -9413 -12839 -11844 -12763 -11571 -7710 -1505 467 -660
15694 -660 -5488 -10690 -15649 -16918 -11792 -7416 -6713 -6475 -3846 -8399 -9313 -6303 -10281 -14018 -13181 -20949
15678b0949K969O564k440j652R344P821k96J846k104M404l009k710k483j515M323
15663A13M595M04j5847o650O027J997o83K641J833j36P39l126o549j253N230J0214
15647d51M015m989j21L581q81J240J813k014m948m152j962j419N318K249k352
15632e073j995N019P540O446l675l676k832M671n266j035o2L912n955q218L652
15617f547j185k584k596K340K28J294N217M246k940n660K349R115N042m952J7
15602C384k756o345R30j326O2L382J770J539j540m435K015k348n026q04N923O678
15586A103O420q67j996k374k346l898o279L464O712j34M120K795m65Q96j100j453
15570D598N65P06o452j07m091j549L07L745L533q4L327K944k525r24K618k47o866
$$ plain form
15678 -20949 -17980 -11416 -13856 -15508 -6164 1657 1361 3207 1103 5507 2498 -212 -2695 -4210 113
15663 113 4708 5112 -10735 -17385 -11358 -9361 -10044 -7403 -5570 -5706 -4967 -8093 -14642 -15895 -10665 -451
15647 -451 3564 -1425 -1546 2035 1154 2394 4207 2193 -2755 -6907 -8869 -10288 -4970 -2721 -5073
15632 -5073 -7068 -2049 5491 11937 8262 4586 1754 6425 1159 124 62 3974 -1981 -10199 -6547
15617 -6547 -7732 -10316 -12912 -10572 -10344 -9050 -3833 413 -2527 -8187 -5838 3277 8319 3367 3384
15602 3384 628 -5717 -4787 -6113 -6051 -2669 -899 640 -900 -5335 -3320 -5668 -10694 -11498 -5575 1103
15586 1103 7523 6656 4660 2286 -60 -3958 -10237 -6773 -61 -195 3925 6720 6255 7151 6051 4598
15570 4598 5163 5869 -583 -690 -4781 -6330 -6023 -2278 1255 1171 4498 7442 4917 3993 6611 6364 -502
15553e02p257J45j094K192k549L999Q63l988k819L133M797O201m770j239l453
15538f341l292O554P248J1m418m216J516P399o24l453j928L16O606k541o060O947
15522C724N888k204q982L271N967p503m550J394J940L320J048J117j462j558l613
15507b203n158k061L200N444K447k696L700J652J120m598l233j333k132r42L255
15492c538K126j336k359J184J442L99L852P687m553q095o045n102k760P748N03
15477h847p21N447n227q105J0537K616L48P287o56q762K075O862m272m752K360
15462c810K200P076K085j025K01n996p796j930J623J176L42N529N335j663m834
15447a487m252R15l977K503M978l01m60J016O192K205j026j457L096m998l023
$$ plain form
15553 -502 -7759 -7614 -8708 -6516 -9065 -5066 -4203 -8191 -11010 -7877 -3080 3121 -1649 -2888 -6341
15538 -6341 -9633 -3079 4169 4180 -238 -4454 -2938 4461 3837 384 -1544 -1228 5378 2837 -3223 3724
15522 3724 9612 7408 -1574 1697 7664 161 -4389 -2995 -1055 2265 3313 4430 2968 1410 -2203
15507 -2203 -7361 -9422 -6222 -778 1669 -1027 2673 4325 5445 847 -2386 -3719 -5851 -6793 -3538
15492 -3538 -1412 -2748 -5107 -3923 -2481 -2082 1770 9457 4904 -3191 -9236 -14338 -17098 -9350 -8847
15477 -8847 -9568 -4121 -9348 -17453 -6916 -4300 -3952 3335 2679 -6083 -4008 2854 -1418 -6170 -3810
15462 -3810 -1610 5466 7551 6526 6727 731 -7065 -8995 -7372 -6196 -5854 -325 5010 3347 -1487
15447 -1487 -5739 -4824 -8801 -6298 -1320 -1621 -2081 -1065 5127 7332 6306 4849 7945 2947 -76
15432g6M264M153K65L359m085k252n552n045j869n18j456K359K097k21n757M657
15416e677O002n077R48k685M967j120M693O489K507L81P35k627k848J80M17k327
15400D958m614n380Q428P708J480j0103q97K782o189j780j752j248m397M190K37
15385f577l440M373l219n016K265L473k295k196O332M334K913k338k227O27M624
15370A633k958l413l785K335j47M80O120J5o154L763M029L822M484J780n719m375
15354A910n026O09M473p547n157K906O123l179j006J529J448m345o865L284L578
15339g265j576j60M313j894J473K932P21J183O222M173j4788q135j379N959r88
15324i209l948P88N796O431m613r533J818q76N606P076K494k265q000J185K699
$$ plain form
15432 -76 4188 8341 8606 11965 7880 5628 76 -4969 -6838 -7356 -8812 -6453 -4356 -4577 -10334 -5677
15416 -5677 325 -4752 -3804 -6489 -1522 -2642 2051 8540 11047 11428 12163 9536 6688 6868 7285 4958
15400 4958 344 -5036 3392 11100 12580 2477 1580 4362 -1827 -3607 -5359 -6607 -11004 -6814 -6577
15385 -6577 -10017 -5644 -8863 -13879 -11614 -8141 -10436 -12632 -6300 -1966 947 -1391 -3618 -2991 1633
15370 1633 -1325 -4738 -8523 -6188 -6335 -5855 265 280 -5874 -2111 1918 5740 10224 12004 6285 1910
15354 1910 -3116 -2507 1966 -5581 -10738 -7832 -1709 -4888 -5894 -4365 -2917 -7262 -14127 -10843 -7265
15339 -7265 -8841 -9001 -4688 -6582 -5109 -2177 -1456 -273 5949 10122 -4666 -12801 -14180 -8221 -9209
15324 -9209 -13157 -12369 -6573 -142 -4755 -14288 -12470 -13346 -7740 -664 1830 -435 -8435 -7250 -4551
15309d551k783L920O807l101r700o50l673q203K028M658N279q11k524r1L321j110
15293a1184n563l18L732N587L945k256l379J2218N867j800j598n360o080o259
15279a2448j54r36P629j476j516o806n887O669N414N652p073k075O268j286N484
15264b541M497K692k357r448r539K122k311k837K031O484K860L811K609K560j329
15249f96J89p292M198J0713R87j492q514m733M799K675l596O422K684o461J935
15234A818Q58J648l825l625L67J018N46M399l506O542r79q205q572K889M044N104
15218E21L487L22j571Q51j972l722r10L530l73j1655q661J0605J1970M310L728
15203A0460p021m453N034J468k469J519P465K687J742l182Q42O744r155j372J016
$$ plain form
15309 -4551 -7334 -3414 3393 292 -9408 -10058 -13731 -21934 -19906 -15248 -9969 -10780 -13304 -13395 -10074 -11184
15293 -11184 -16747 -17065 -13333 -7746 -3801 -6057 -9436 2782 8649 6849 5251 -109 -6189 -12448
15279 -12448 -12602 -13538 -5909 -7385 -8901 -15707 -21594 -14925 -9511 -3859 -10932 -13007 -6739 -8025 -2541
15264 -2541 1956 4648 2291 -7157 -16696 -14574 -16885 -19722 -17691 -11207 -8347 -4536 -1927 633 -696
15249 -696 -507 -7799 -3601 7112 8099 6607 -1907 -6640 -1841 834 -2762 3660 6344 -117 1818
15234 1818 2676 4324 499 -3126 -2759 -1741 -1195 3204 -302 6240 5261 -2944 -11516 -8627 -4583 521
15218 521 4008 4330 2759 3610 1638 -2084 -2994 536 163 -11492 -20153 -9548 2422 6732 10460
15203 10460 3439 -1014 4020 5488 3019 4538 12003 14690 16432 13250 14092 20836 11681 10309 11325
15188A1325l11M755l671n818q40m779p723J319J0401Q381N866J0610L283M066
15174C6864K3200K6736J3421J5085L382j1207j6715r217r282j1176p810o371m723
15161D2187l755p886j274r665l810P10j141M211R144j956p34m571J512Q818J1129
15146D2919J7323J5828J3785J4830J5703J1480J2085p35j5973j2586j9257j7861
15134G7541j0646j884k429n947n141J776r446n25J0323J4361K3960J3760J1999
15121A17702J5564R355q240j5559k0286j4618j3521j389o322q55k21r428r186
15108D2996K809l51j1482m063L026o00j027l858M736J340P444J1945P641Q447
15094F9003J1871J3230Q373J2703P063j815r725j7674k1191j6477j2379l775K184
$$ plain form
15188 11325 11014 15769 12098 6280 5440 661 -7062 -5743 4658 13039 18905 29515 32798 36864
15174 36864 60064 86800 100221 115306 118688 107481 90766 81549 72267 61091 53281 46910 42187
15161 42187 38432 30546 29272 19607 15797 16507 15366 19577 28721 26765 26031 21460 22972 31790 42919
15146 42919 60242 76070 89855 104685 120388 131868 143953 143218 127245 114659 95402 77541
15134 77541 66895 65011 62582 56635 51494 53270 43824 43299 53622 67983 91943 105703 117702
15121 117702 133266 142621 134381 118822 98536 83918 70397 69008 62686 61831 61610 52182 42996
15108 42996 45805 45454 33972 29909 32935 32335 31308 27450 32186 33526 40970 52915 60556 69003
15094 69003 80874 94104 102477 115180 122243 120428 110703 93029 71838 55361 42982 39207 41391
15081D1391o375j0327q215m138M120O059k52l143m578n86j279m462j518M675r29
15066A0443M100P227j71j471o413o683k066M583L756K032L779k391l085L600r963
15051G277j901J1055J36l586M555R154l404r814j3272j334k735j496O894L131
15037D660p285r199J255J1115K165L280J273J309k162l779P289N993r94j366m536
15022I018j089m068r16k756K569Q97j551q944k247L143M134L349K387j711J134
15007C349M487j556k270l224M40M56P60p162K650J566n350k047K599L449K201
14992C48K444k20J52K724J820O49j205j402l022j711N593M646L99K722p148j367
14976E422K485q391n961M019J2401P130j621L447n428p095j352m194k903M478
$$ plain form
15081 41391 35016 24689 16474 12336 16456 22515 22263 19120 14542 13956 12677 8215 6697 11372 10443
15066 10443 14543 21770 21599 20128 13715 7032 4966 9549 13305 15337 19116 16725 13640 17240 7277
15051 7277 5376 16431 16567 12981 17536 26690 23286 13472 200 -1134 -3869 -5365 1529 4660
15037 4660 -2625 -11824 -10569 546 2711 5991 7264 8573 6411 2632 9921 15914 14920 13554 9018
15022 9018 7929 3861 2945 189 2758 3655 2104 -6840 -9087 -5944 -1810 1539 3926 2215 3349
15007 3349 7836 6280 4010 786 1226 1682 2442 -4720 -2070 -504 -5854 -7901 -5302 -1853 348
14992 348 2792 2572 2724 5448 7268 7917 6712 5310 2288 577 6170 10816 11215 13937 6789 5422
14976 5422 7907 -484 -6445 -2426 9975 17105 15484 18931 13503 6408 5056 862 -2041 2437
14962B437K276n262m006R963j57N549J4376J9793K0424J8527J0813k4406k5878
14949D4449j5482q062j0738j206L204J760r430r837M291P285k661m97j277R12
14935B711j232k795O56J0267O071k663k743l624L536j554j008l203K01k377q894
14920f651j912K673O705o5m509j071L281m38o241K986O222m185q63O11O558M59
14904C560N226K206n032k606n222m594n654k226j208L717O367O328L194l271o941
14889f156J0619j657o036k107L129j913k403J175L235k786J616J266l006kM329
14874f97j352q711k173j530K085J1579N457j574l826J508J076q73q760N669J1427
14859I305L39j1177l659L050j840l428R73K611M18r21l680N172J0069Q94q714
$$ plain form
14962 2437 4713 -549 -4555 5408 5251 10800 25176 44969 65393 83920 94733 70327 44449
14949 44449 28967 20905 10167 8961 12165 13925 4495 -5342 -1051 6234 3573 3076 1799 2711
14935 2711 1479 -1316 -660 9607 15678 13015 10272 6648 10184 8630 7622 4419 4620 2243 -6651
14920 -6651 -8563 -5890 815 750 -3759 -4830 -1549 -1987 -8228 -5242 980 -3205 -4068 -3457 3101 3560
14904 3560 8786 10992 5960 3354 -1868 -6462 -12116 -14342 -15550 -11833 -5466 862 4056 785 -6156
14889 -6156 4463 2806 -3230 -5337 -2208 -4121 -6524 -5349 -2114 -4900 -3284 -2018 -5024 -5026 -697
14874 -697 -2049 -10760 -12933 -14463 -12378 -799 4658 3084 -742 766 1842 969 -7791 -2122 9305
14859 9305 9644 -1533 -5192 -2142 -3982 -7410 -6437 -3826 -3408 -4329 -8009 -2837 7232 8126 -588
14844e88q40J773L139k24j253k009n708O185O866p2k952o721q77n545k300m11
14828a1537n19j487n013j872m554K227P155P833N00k001R623N486o281m723k034
14813g197o796j889M323R435P115q134l222P62J828q77N068L34k828l305J282
14798d101J541l137P82O787n049q183J258p30N216K463R77l563l367j059N439
14783d726n252J692j647R247J271j193m524M346O765O0n686m843l338n603O14
14768a2817P015J471O206O340p26j451k863j075k754n364K09k968K597p73o591
14753a3544m971M7M153J0294Q143Q39j902m055n917K226l07J537m931q398o518
14738b3304M496L522O130J2431J297p175k288L634m681m672J431M472K224M031
$$ plain form
14844 -588 -1428 345 3484 3260 2007 -2 -5710 475 7341 7269 4317 -2404 -3281 -8826 -11126 -11537
14828 -11537 -12056 -13543 -18556 -20428 -24982 -22755 -15600 -7767 -7267 -9268 355 5841 -440 -5163 -7197
14813 -7197 -13993 -15882 -11559 -2124 4991 -3143 -6365 -5603 -3775 -4652 416 750 -2078 -5383 -4101
14798 -4101 -2560 -5697 -4915 1872 -3177 -11360 -10102 -10832 -5616 -3153 -2176 -5739 -9106 -10165 -4726
14783 -4726 -9978 -8286 -9933 -686 585 -608 -5132 -786 5979 6039 353 -4490 -7828 -13431 -12817
14768 -12817 -5802 -4331 1875 8215 7489 6038 3175 2100 -654 -6018 -5809 -8777 -6180 -6953 -13544
14753 -13544 -18515 -18468 -14315 -4021 4122 4961 3059 -996 -6913 -4687 -4994 -3457 -8388 -16786 -23304
14738 -23304 -18808 -15286 -9156 3275 4572 -2603 -4891 -1257 -5938 -10610 -9179 -4707 -2483 1548
14724A548O849l434K757K198M617N00j017M204l248o112R58R43K099J611L013
14709A7486p713l398K98l575j300p10j538M98L773K516P64j558J215L053l518
14694F293r50N106l350m828L861m296j319J106r43p838O770M515k332l668n062
14679f935l090l41L349P08m224J786N162l191L661j497k246o21k825L245L879
14664c180L978N924m454m222m958j679K271k709J639M263K533K938q448k93J682
14649d715M783K043N450L35k792m005L708J168j253j304n24L514m95o660j76K526
14633A603j743m522o02L669M087j0006L046j788J400M233J276J443M267j01q6
14618F176M621Q34l551l041j920m140L01Q59o129p519p96P011K984L669j557m58
$$ plain form
14724 1548 8397 4963 7720 9918 14535 15035 14018 18222 14974 8862 9820 10763 12862 14473 17486
14709 17486 9773 6375 6673 3098 1798 1088 -450 48 3821 6337 7101 5543 6758 9811 6293
14694 6293 5343 10449 7099 2271 6132 1836 517 1623 680 -7158 -388 4127 1795 -1873 -6935
14679 -6935 -10025 -10366 -7017 -6309 -10533 -8747 -3585 -6776 -3115 -4612 -6858 -7479 -10304 -7059 -3180
14664 -3180 798 6722 2268 -1954 -6912 -8591 -6320 -9029 -7390 -3127 -594 2344 -6104 -6397 -4715
14649 -4715 68 2111 7561 7896 5104 1099 4807 5975 4722 3418 2894 6408 5913 -747 -923 1603
14633 1603 -140 -4662 -5264 -1595 2492 -7514 -4468 -6256 -4856 -623 653 2096 6363 6262 6176
14618 6176 10797 11631 8080 5039 3119 -1021 -720 139 -5990 -13509 -14305 -7294 -4310 -641 -2198 -2656
14602b656m524j905O151m93o108N19K897J84O11J815l639Q325K794j760k2K02
14586B391R99M698J448k538k835K448M585R17n513m737l820j313N68l297l50R72
14570e377K705n18j117l11m922P6K994k460o75K692J330R12j326l672r66J671
14554h964J393o311j808N410O914L774j755m14L864n342K620o640k945Q631L729
14539B156m663o526j569M995K13j839P584K912p07J798J25J286k754j0789r185
14524a6963R39P803M406K570m894j391r700k11M940K466m32M582Q600Q16L567
14509G098m343L739j276N55p690p299j172M808m013M642O498L251m609M182Q004
14494A2375j780j533l909o036m363M624N529J75L214n561l869J988m166m280o60
$$ plain form
14602 -2656 -7180 -9085 -2934 -3427 -9535 -9016 -6119 -5935 -5324 -3509 -7148 1177 3971 2211 2189 2391
14586 2391 3390 8088 9536 6998 4163 6611 11196 12113 6600 1863 -1957 -3270 -2702 -5999 -6349 -5377
14570 -5377 -2672 -3190 -4307 -4618 -9540 -9464 -6470 -8930 -9605 -6913 -5583 -4671 -5997 -9669 -10635 -8964
14554 -8964 -7571 -13882 -15690 -10280 -3366 408 -1347 -1761 2103 -3239 -619 -7259 -10204 -1573 2156
14539 2156 -2507 -9033 -10602 -5607 -5394 -7233 351 3263 2556 4354 4479 5765 3011 -7778 -16963
14524 -16963 -16024 -8221 -3815 -1245 -6139 -7530 -17230 -17441 -12501 -10035 -10467 -5885 2715 3531 7098
14509 7098 2755 6494 5218 5773 -1917 -9216 -10388 -5580 -9593 -4951 1547 4798 189 4371 12375
14494 12375 10595 9062 5153 -883 -5246 -622 4907 5082 8296 2735 -1134 854 -3312 -7592 -8252
14479h252O852P752o243l154J501p539j781J0234M412J384l331j730m099N89L276
14464a29l613j60q24l089M663L159m48n54J549J205j199J555p4j691L444l02j69
14447C323J024r018K86K19N04l57l449n091n365j920L990L808P218Q202O362j463
14431H273m257j0809j656N072N92m855o310K519J110j936n936j506J730K08M201
14416a3560Q723J406L863N355j040k968o688j470M795k248K154j332k189k914
14402h113j894L423n248L897O84k227l095J777K604K246L594L586l738l636K212
14387c928L135k90j32J15L018n394j066l406J695J370l479k561M520M797o911
14372h517J161R416N504k024O787j013l266m179m54J882L471l898m546q781J676
$$ plain form
14479 -8252 -1400 6352 109 -3045 -1544 -9083 -10864 -630 3782 5166 1835 105 -3994 -3405 -129
14464 -129 -3742 -3902 -4726 -7815 -3152 7 -441 -995 554 1759 560 2115 2041 350 3794 3492 3323
14447 3323 4347 -4671 -4385 -4166 -3662 -4019 -7468 -12559 -17924 -19844 -15854 -12046 -4828 3374 9736 8273
14431 8273 4016 -6793 -8449 -3377 -2785 -7640 -13950 -11431 -10321 -12257 -18193 -19699 -17969 -17761 -13560
14416 -13560 -4837 -3431 432 5787 4747 1779 -4909 -6379 -1584 -3832 -1678 -3010 -5199 -8113
14402 -8113 -10007 -6584 -11832 -7935 -7251 -9478 -12573 -10796 -8192 -5946 -2352 1234 -2504 -6140 -3928
14387 -3928 -793 -1083 -1215 -1100 1918 -3476 -4542 -7948 -6253 -4883 -8362 -10923 -6403 -1606 -8517
14372 -8517 -7356 2060 7564 5540 12327 11314 8048 3869 3415 5297 8768 4870 324 -8457 -6781
14357f781K883J828n6k358L781K357n528L33L82P387Q85K325M215l340j006k848
14341D459p657r315k699P523L406O898l321o046J565M736M898J05K831k109J015
14326F289L162l893l172K229L853q928m664L196P45Q99p976o223P315K758K806
14311a604j973K754p56m65J483k666K740K503j514l061M909M690j689l833m847
14296c329m853p86M801M735K72p953k717L265O695K478o527m373m720j234N15
14281a3731k988R68M611N215O451J2856K037k550M078N944o432q833m859m709
14267a942k763N125j800P335O35j179Q14K1j2505l250K348n470j647P869N678
14252g31l81l436L692M844p381l369j218K590P368k990L270P3j366J060M00o905
$$ plain form
14357 -6781 -3898 -2070 -2126 -4484 -703 1654 -3874 -3541 -3159 4228 5113 7438 11653 8313 7307 4459
14341 4459 -3198 -12513 -15212 -7689 -4283 2615 -706 -6752 -5187 -451 4447 4552 7383 5274 6289
14326 6289 9451 5558 2386 4615 8468 -460 -5124 -1928 -1183 -284 -8260 -14483 -7168 -4410 -1604
14311 -1604 -3577 -823 -1579 -2044 -561 -3227 -487 2016 502 -2559 2350 7040 5351 1518 -3329
14296 -3329 -8182 -8968 -4167 568 840 -7113 -9830 -6565 130 2608 -3919 -8292 -13012 -14246 -13731
14281 -13731 -16719 -15751 -11140 -5925 526 13382 15419 12869 16947 22891 16459 7626 2767 -1942
14267 -1942 -4705 420 -1380 5955 6590 5411 6225 6246 -6259 -9509 -7161 -12631 -14278 -6409 -731
14252 -731 -1112 -4548 -856 3988 -3393 -6762 -7980 -5390 1978 -1012 2258 2331 965 2025 2425 -4480
14236d480k986N218o21k445J804J819K255R33n419p56J195l669q375J540M196
14221i791J659O71K571l700Q99q055M800M432j415Q543L521j237n222j16j605
14206d045L697N9m929J092Q7M316Q149k97R28o35l284j131j032k292K297K077
14190E057n061j1042l361q46l727K350J3240J1554K320O2j882K367k442r971o057
14175g439k431j306J1175J545l372J151M982n05R86M394l513l68l49k609m95L424
14159E270k737q513k959j1j611J298K27O83R116O376l273k525K607O33q6O324
14143A0819Q0k055j961j971N296J782m260l430m42l161n800j834L464N710q27
14128A410P94N73k580n839O19J072L132k968j373P00o257l708M987k601K368J3925
$$ plain form
14236 -4480 -7466 -2248 -2869 -5314 -3510 -1691 564 1497 -3922 -4678 -3483 -7152 -15527 -13987 -9791
14221 -9791 -8132 -7461 -4890 -8590 -7691 -15746 -10946 -6514 -7929 614 4135 2898 -2324 -2440 -4045
14206 -4045 -348 -289 -5218 -4126 -4039 277 8426 8129 9057 8422 5138 4007 2975 683 2980 5057
14190 5057 -4 -11046 -14407 -15253 -18980 -16630 -3390 8164 10484 10546 8664 11031 8589 -1382 -7439
14175 -7439 -9870 -11176 -1 1544 -1828 -677 4305 3800 4786 9180 5667 5299 4950 2341 1846 5270
14159 5270 2533 -5980 -8939 -8950 -10561 -9263 -9036 -8353 763 7139 3866 1341 3948 4581 4495 10819
14143 10819 10899 8844 6883 4912 10208 11990 7730 4300 3858 697 -5103 -6937 -3473 2237 1410
14128 1410 2204 2777 197 -5642 -5023 -3951 -819 -3787 -5160 -4460 -10717 -14425 -9438 -12039 -9671 4254
14112D254l233n239M866q52l463N271J0949j373q297K976J622l584k702j139P249
14097G305J617k248M900j670j102m849l567J466K689l497K908L771K053j15O79
14082A0340M310N402K037l720q745n555P60N626Q447M202o955j5052k705j545
14068c153O645Q403l081o011k541O582O352k473M067N088j153o514J590N551m03
14053A8949j340k702n687k191j743K852R14k990k803k275J412m743J057J084l818
14038d024j710J110J597Q949M895k761r04M140P765K742q332o494j166N551L12
14023A1670j238l10p731l817K589Q694K4l651J229M139M347n256m933L50N59q322
14007a657k811P295M06J726M794k141o457L945J816m581l560k039L21m822r78
$$ plain form
14112 4254 1021 -4218 648 -204 -3667 1604 12553 11180 2883 5859 7481 3897 1195 56 7305
14097 7305 8922 6674 11574 9904 8802 3953 386 1852 4541 1044 3952 7723 9776 9661 10340
14082 10340 14650 20052 22089 18369 9624 4069 4829 10455 18902 23104 16149 1097 -1608 -3153
14068 -3153 3492 11895 8814 2803 262 6844 13196 10723 14790 19878 18725 12211 13801 19352 18949
14053 18949 17609 14907 9220 7029 5286 8138 9052 6062 3259 984 2396 -2347 -1290 -206 -4024
14038 -4024 -5734 -4624 -3027 5922 10817 8056 7152 11292 19057 21799 13467 6973 5807 11358 11670
14023 11670 10432 10122 2391 -1426 1163 9857 9881 6230 7459 11598 15945 10689 5756 6106 6665 -1657
14007 -1657 -4468 2827 3233 4959 9753 7612 1155 5100 6916 2335 -1225 -3264 -2943 -7765 -8743
13992h743N473M449N252M800j852j274m292J913L979j559L982K750K573m73k66
13977A6712l233K386m140p136l100K493L515K407p92o262j244J35l108j624K136
13962h55P717M796r436j188O703N206j098j861l882J341M744Q82M814m979m657
13947H247q916J603N245M905K000J546l562p109O55K673m47O119k590n016l912
13932A441J126L848M321K477o169l74K349O683l497o236q690n752k805R482R108
13917G312L237m5k59j680k813O984L651l805o429O7L647K899P848j374p14J676
13901B0202k668q083l543M498J303n867k72P693R086k982j412n109q068Q86k419
13886C245J58L264j830K157q05m362J046n42L542p466K017R668O23m255q578m715
$$ plain form
13992 -8743 -3270 1179 6431 11231 9379 8105 3813 5726 9705 8146 12128 14878 17451 16978 16712
13977 16712 13479 15865 11725 4589 1489 3982 7497 9904 9112 2850 1606 1741 -1367 -2991 -855
13962 -855 6862 11658 2222 1034 7737 12943 11845 9984 6102 7443 12187 13069 17883 12904 8247
13947 8247 -669 934 6179 11084 13084 14630 11068 3959 4614 7287 6840 12959 10369 5353 1441
13932 1441 2567 6415 10736 13213 7044 6670 9019 15702 12205 5969 -2721 -8473 -11278 -1796 7312
13917 7312 10549 10504 10245 8565 5752 12736 16387 12582 6153 6220 9867 12766 20614 19240 18526 20202
13901 20202 17534 9451 5908 10406 11709 5842 5570 13263 22349 19367 17955 12846 4778 5664 3245
13886 3245 3403 6667 4837 6994 6189 1827 2873 2331 5873 -1593 424 10092 10715 6460 -2118 -6833
13870f833K147Q232M91L811m13l994O967j00o999n81K177J137L058R054j081k097
13854A4976k61l598j1978k461K198N152L629J719N575J600m618m448M241j111
13840A0615l629p24k195j697O870L361P994N904n791j0445l923j36l63l357q13
13825A671K985P098j142o720P679j50r109k979R041J1936k249o083n282L83P054
13810A4133K559m675o195k322K43n483k415J706k131M092M458K187Q720l14L613
13795A8176L486L22o486l786r946o012N658M323j976j212L232k076l41M050M781
13780A2193K641n018j1183N408P341K545q799m662N997O895L579L82p432k956
13766F931R051K329l770l292k648J016L566n077n97P01j0542N10R331l278J027
$$ plain form
13870 -6833 -4686 3546 4037 7848 7435 3441 10408 10308 3309 2728 4905 6042 9100 18154 17073 14976
13854 14976 14715 11117 -861 -3322 -1124 4028 7657 9376 14951 16551 11933 7485 11726 10615
13840 10615 6986 6262 4067 2370 9240 12601 20595 26499 20708 10263 6340 6204 5841 2484 1671
13825 1671 4656 11754 10612 3892 11571 11421 2312 -667 8374 20310 18061 11978 6696 7079 14133
13810 14133 16692 12017 5822 3500 3743 -1740 -4155 -2449 -4580 -488 3970 6157 14877 14563 18176
13795 18176 21662 21984 15498 11712 1766 -4246 1412 5735 3759 2547 5779 3703 3362 7412 12193
13780 12193 14834 9816 -1367 4041 11382 13927 5128 466 6463 13358 16937 17319 9887 6931
13766 6931 15982 18311 14541 11249 8601 9617 13183 8106 7509 8210 -2332 -1822 7509 4231 5258
13751E258J212J436K506j1872p501J104O311P741L284k65n374o514l4k214l09
13736e231P00l95n047J111k830M158j76L338O021r42R62L485l762n826K507k570
13720d497k15L837l660K031J814J449L707L306o566L777K552o470p720j335N640
13705b350K772L029J434k177m949L033J147L881L788J168o547m257L28L15O240
13690F855L996K595l275j184R39L785j692k013l984j451l531m471K102R65J827
13675A463J859M639m417K695M863q806n17rL852j004m087K129l098L588L417N163
13659A1730l073r141l862j48J98Q24Q272K960m52r654k982k013K556Q099L666
13644F980P03m433J306J305J216J61k67M662j346j0199M214N846K3l925j765Q323
$$ plain form
13751 5258 6470 7906 10412 -1460 -8961 -7857 -1546 6195 9479 9214 3840 -2674 -2708 -4922 -5231
13736 -5231 -4531 -4926 -9973 -8862 -11692 -7534 -7710 -4372 1649 707 1669 5154 1392 -4434 -1927 -4497
13720 -4497 -4712 -875 -4535 -2504 -690 759 4466 7772 1206 4983 7535 1065 -6655 -7990 -2350
13705 -2350 422 3451 4885 2708 -2241 792 1939 5820 9608 10776 4229 -28 300 615 6855
13690 6855 10851 13446 10171 8987 9926 13711 12019 10006 6022 4571 1040 -3431 -1329 -364 1463
13675 1463 3322 7961 3544 6239 11102 2296 1779 1770 5622 4618 531 2660 -438 3150 6567 11730
13659 11730 8657 -484 -4346 -4494 -4296 -3472 4800 7760 7308 -2346 -5328 -7341 -4785 3314 6980
13644 6980 7683 3250 4556 5861 7077 7238 6971 11633 10287 88 4302 10148 10171 6246 4481 12804
13628A2804n271p191n54O058N584J048k558p270J485j634m576K98Q715L029m255
13613E712K62L442J409K875k759J661m783k541P459j029N72m823o203r837M785
13598c798M220J0o38M855k828l883P85P46N023J498J531m352m856N978J378n156
13582E13j213p88k327N700j310q333l672O709Q151j72j696M963L751n375m417
13567D84n952M426L073m15K006M056L641k425n525m808r559o277K726J1593M673
13552A717J580K246m519l948K766l40O076K925k93j025p984k998k796P349N109
13537E865L19k45k749j971j472l208M034J277J875N574m364k171N412k232p827
13522a883Q484Q68p223o46N494k111k27m384l641J0740O566R39l621l912J149
$$ plain form
13628 12804 7533 342 -212 5846 11430 12478 9920 2650 4135 2501 -2075 -1777 6938 9967 5712
13613 5712 5974 9416 10825 13700 10941 12602 7819 5278 12737 11708 12280 7457 1254 -8583 -3798
13598 -3798 422 432 -206 4649 1821 -2062 -1277 -531 4492 5990 7521 3169 -1687 4291 5669 513
13582 513 -700 -1488 -3815 1885 575 -7758 -11430 -4721 3430 3258 1562 6525 10276 4901 484
13567 484 -5468 -1042 2031 1616 3622 7678 11319 8894 3369 -1439 -10998 -17275 -14549 -2956 1717
13552 1717 3297 5543 1024 -2924 -158 -498 5578 8503 8210 7185 -799 -3797 -6593 756 5865
13537 5865 6184 5939 3190 1219 -253 -3461 573 1850 3725 9299 4935 2764 8176 5944 -1883
13522 -1883 6601 7469 246 -400 5094 2983 2756 -1628 -5269 5471 12037 12976 9355 5443 6592
13507F592n388p668O216O443m652L3m272l309L340O9J058R934L973n364m72j249
13491E284j554M651O959R21m078R88m41n589K087L643n378p397J682N213Q027
13476A5018q409o924m709J445M888O103M32o24p387j31J990m599M661O127j992
13461E889K923j150j973K418j252m384K551l006r213M64K790N140K253j346L509
13446E613M043q13q894l485O00k231K451L104n194K699M310l170m120J171m405
13431h321o034l703K090Q783K145J039M886M969l074n309l036p78P422R999J442
13416A2520N73m818K3M58M609k534l357k960m627P768l247j336J864j71q83p166
13400c284r60K437O28K57q8N063J695l39n498j0139K086J0556K857J813k547J173
$$ plain form
13507 6592 1204 -6464 -248 6195 1543 1576 -2696 -6005 -2665 -2596 -1538 8396 12369 7005 6533 5284
13491 5284 3730 8381 15340 16261 12183 13171 12730 7141 9228 12871 7493 96 1778 6991 15018
13476 15018 6609 -315 -5024 -3579 1309 7412 7844 7220 -167 -298 1692 -2907 1754 7881 5889
13461 5889 8812 7662 5689 8107 6855 2471 5022 2016 -7197 -6733 -3943 1197 3450 2104 5613
13446 5613 9656 8843 -51 -3536 -2936 -5167 -2716 388 -4806 -2107 2203 -967 -5087 -3916 -8321
13431 -8321 -14355 -18058 -15968 -7185 -5040 -4001 885 5854 2780 -2529 -5565 -6343 1079 11078 12520
13416 12520 13093 8275 8298 8756 13365 10831 7474 4514 -113 7655 4408 3072 4936 4765 3882 -3284
13400 -3284 -4244 -1807 -1179 -922 -1010 4053 5748 5409 -89 -10228 -8142 2414 5271 7084 4537 5710
13384E710o35q378p291Q856N765M318L319K878n260l572M018M361m752r790k210
13369b663o624N05O955K406M213J766k025n590l804r1k474L3K566J917L276L083
13353C449j377j469j795P44m109K394J259p7N403N951J378k053J826j0966p52
13338a94O533j316q77K856k887K400j877p301j887M787J026J520k46r78j889K01
13322a29m078n787r358R498P104k477l963j820j629N059J93o13j632P095m5m313
13306f895j806l020o67K962N999M543P500r24P19J263j597N201O837n856o708
13291G551j3107K215M683M580P356m286k750P93k714n935M263n01l918M313O08
13276C151o226k061m982N733L406J179K336M652J006m669l518j989Q67k299J279
$$ plain form
13384 5710 5075 -3303 -10594 -1738 4027 8345 11664 14542 9282 5710 9728 14089 9337 -453 -2663
13369 -2663 -9287 -8782 -1827 579 4792 6558 4533 -1057 -4861 -4952 -7426 -7393 -4827 -2910 366 3449
13353 3449 2072 603 -1192 -448 -4557 -2163 -904 -981 4422 10373 11751 9698 11524 558 -194
13338 -194 6339 5023 4146 7002 4115 6515 4638 -2663 -4550 237 1263 2783 2537 1559 -330 -129
13322 -129 -4207 -9994 -19352 -9854 -2750 -5227 -9190 -11010 -12639 -7580 -7387 -8000 -9632 -2537 -2582 -6895
13306 -6895 -8701 -11721 -12388 -9426 -3427 1116 8616 7692 8411 9674 8077 13278 20115 14259 7551
13291 7551 -5556 -3341 1342 5922 13278 8992 6242 7035 4321 -1614 2649 2148 -1770 2543 3151
13276 3151 -3075 -5136 -10118 -4385 -979 200 2536 7188 8194 3525 7 -1982 -1115 -3414 -2135
13261b135l12k460m835L599L990j03p998Q67K643J1346Q90Q59p493k699K765Q63
13245b13P092R79j409K346j578l240M165P691j357o954l810o058M44N530L199
13230F827K191J21k901n406j072O214j581p417M08N176M105q415K634M857N452
13215A1193j142k389l923j245K236q65J465L543R36Q97j255O07m491j0503k712
13200g648K677P066j616j363Q676N897L200l694o642k045j590N581K261j941l510
13185E309l327l004l706R05J0218Q515m639o208r153l62J77k081j018m652K041
13170a0985R619O743p8O084m96j637K390M422L025j3307k234k598J450N176N148
13155A2722n226n983l195K419N355L101k150k572K352K661k834K386R89m839l092
$$ plain form
13261 -2135 -2447 -4907 -9742 -6143 -2153 -2256 -10254 -9387 -6744 4602 5492 6351 -1142 -3841 -1076 -213
13245 -213 6879 7858 6449 8795 7217 3977 8142 15833 14476 7522 3712 -2346 -1902 3628 6827
13230 6827 9018 9139 6238 832 -240 5974 4393 -3024 -2616 2560 6665 -1750 884 5741 11193
13215 11193 10051 7662 3739 2494 4730 3865 5330 8873 9809 10706 9451 10058 5567 -4936 -7648
13200 -7648 -4971 2095 479 -884 7792 13689 16889 13195 6553 4508 2918 8499 10760 8819 5309
13185 5309 1982 -1022 -4728 -3823 6395 14910 10271 4063 -5090 -5452 -5275 -7356 -8374 -13026 -10985
13170 -10985 -1366 5377 5299 11383 10887 9250 11640 16062 19087 5780 3546 948 2398 7574 12722
13155 12722 7496 1513 -1682 737 6092 9193 7043 4471 6823 9484 6650 9036 10025 5186 2094
13140B094k029L852k991J473l245o858l350O877M844K94n420P73M531o415o740
13125a2310L123O306o1N786N574m872p749j757M844J1311J445j0731j391N313
13111D831l8J60p89l231L110q295n607n70J328M133m435J191L061K121J012j426
13095c444j739J990L577l755m221k025R202Q67j031L91N271r563J503N771l87
13080B407l978P15M930j669k2m500j452J917J258O074P26M341K930n006n524m375
13064a228M680K473n21l42J082J369N999N29j0849p025k775L808p46o30m278K714
13048e740L396m355j354M429N358M196p01M937K05o589p325n503K69n47O009J0196
13032F881N027N41q696K035M047q308n111J787M968K541k987R16j975J0317J155
$$ plain form
13140 2094 65 3917 926 2399 -846 -7704 -11054 -4177 667 961 -4459 -3686 845 -5570 -12310
13125 -12310 -9187 -2881 -2942 2844 8418 3546 -4203 -5960 -1116 10195 11640 909 -482 4831
13111 4831 4793 4953 4164 933 4043 -4252 -9859 -10429 -9101 -4968 -9403 -8212 -5151 -3030 -2018 -3444
13095 -3444 -5183 -3193 384 -3371 -7592 -9617 -415 452 -579 -188 5083 -4480 -2977 2794 2407
13080 2407 -1571 -856 4074 2405 2383 -2117 -3569 -1652 -394 5680 6406 10747 13677 8671 3147 -1228
13064 -1228 3452 5925 5404 5062 6144 7513 13512 14041 3192 -3833 -6608 -2800 -3546 -4176 -8454 -5740
13048 -5740 -2344 -6699 -8053 -3624 1734 5930 5229 10166 10371 3782 -3543 -9046 -8777 -9324 -3315 6881
13032 6881 11908 12449 3753 5788 9835 1527 -3584 -1797 3171 5712 2725 3641 1666 11983 13138
13017A3138p609n764k476K442L056m2K690j054K420J323k262J54m322k250J0771
13002A0215J729J908K080m299n5J104l101l815L820o431p700j180R323l75j54
12987C069K731p76k428K537l732l23m058N168M90O77P44M066J133l108o492N7
12971b45P022N55p39J956k215j97N373k787k607M56l197K720M917p506n878N971
12955C599N903k250N744m66n988p630k006M119q42K754K180m45Q27J013L370K545
12939A2427q57L06r457l342M344O075l546k165J062P61l318m086O58K387m523
12924c274j780p0N063N44K865K537n719j848O460M323L889L295L165r718l349
12909F383L732l526k11J102l480R56K810r87J541K154K00r74O63k870L034K07
$$ plain form
13017 13138 5529 -235 -2711 -269 2787 2745 5435 4381 6801 8124 5862 6016 1694 -556 10215
13002 10215 11944 13852 15932 11633 11578 12682 9581 5766 9586 3155 -4545 -5725 3598 3223 3069
12987 3069 5800 5024 2596 5133 1401 1078 -2980 2188 2678 3355 4099 8165 9298 6190 -302 -245
12971 -245 6777 7332 6593 8549 6334 6137 11510 8723 6116 6572 3375 6095 11012 3506 -2372 3599
12955 3599 9502 7252 12996 12530 6542 -1088 -3094 1025 183 2937 5117 4672 5499 6512 9882 12427
12939 12427 11570 11876 2419 -923 3421 9496 5950 3785 4847 5608 2290 -1796 -1138 1249 -3274
12924 -3274 -5054 -5124 -61 483 3348 5885 166 -1682 4778 9101 12990 16285 19450 9732 6383
12909 6383 10115 6589 6378 7480 4000 4956 7766 6779 8320 10474 10674 9700 10363 7493 10527 10734
12893A0734k821K951m913o93k023k747M018k691N875L939N40J956m427j0322j021
12878a645L653j486o086P891M364l82l756M121m79n892k838Q73m913k033j384
12863i992J0778L72m202J963K608j580J779L218K239O43j117n61L400L845r791
12848C602L425L967n682n297L164P277k618j1841K281M139j576K376O980R9k194
12833H102m018Q56J668m26J791K432L521K028l888p793k152R298l397q147k382
12818b507j927O873M938J882N911K171j1383j623J713M746j020j849L896q65L425
12803A4381N442j695m794k13n975m096m732J105K66l595L580M117N03O710l99
12788A0605m92M25o108m435L865P21j609J358p076q265k957L219O761O898L154
$$ plain form
12893 10734 7913 10864 5951 5258 3235 488 4506 1815 7690 11629 12169 14125 9698 -624 -1645
12878 -1645 2008 522 -5564 2327 6691 6309 2553 6674 6195 303 -2535 -1662 -6575 -8608 -9992
12863 -9992 786 1158 -3044 -1081 1527 -53 1726 4944 7183 7826 6709 6148 9548 13393 3602
12848 3602 7027 10994 5312 15 3179 10456 7838 -4003 -1722 2417 841 3217 10197 10296 8102
12833 8102 4084 4940 6608 6182 7973 10405 13926 15954 12066 4273 2121 11419 8022 -125 -2507
12818 -2507 -4434 2439 7377 9259 15170 17341 5958 4335 6048 10794 9774 7925 11821 10956 14381
12803 14381 19823 18128 13334 13121 7146 3050 -1682 -577 -311 -3906 -326 3791 4294 11004 10605
12788 10605 10113 10538 4430 -5 3860 4581 2972 4330 -2746 -11011 -13968 -10749 -3988 2910 6064
12773F064p32q69J087q000J416O031l185o79J042o108J544k719O8P348M137J040
12757G485m108j301R7j799l889m297M31O132K589K483P838j595n771k905L071
12742D461K871k599k296m633O861L491K037Q02j211J142M479n241k562Q445O341
12727B2388n674q428k870K032K29j839l127N113Q823N131j603j1167q972o729
12713f693N91N310j376j44l564r89N769O960N770J415j618l583k597J144N406
12698A1801K420Q80n532k493k879K623L445Q27j391K460K245K643m588n462n946
12683A053n448m245o9J261L99R182P569o237o190Q12R519M328M374N269L061l632
12667B1006L02m76n839n222j204L710l270n037P188J675M312L743r790j904j962
$$ plain form
12773 6064 5332 4463 5550 -2450 -1034 4997 1812 1133 2175 -3933 -2389 -5108 -5040 2308 6445 7485
12757 7485 3377 2076 2173 374 -3515 -7812 -7381 -1249 1340 3823 11661 10066 4295 1390 4461
12742 4461 7332 4733 2437 -2196 4665 8156 10193 10995 9784 10926 15405 10164 7602 16047 22388
12727 22388 16714 8286 5416 7448 7677 5838 2711 7824 16647 21778 20175 9008 36 -6693
12713 -6693 -6102 -792 -2168 -2312 -5876 -6865 -1096 5864 11634 13049 11431 7848 5251 6395 11801
12698 11801 14221 15101 9569 7076 4197 6820 10265 11092 9701 12161 14406 17049 12461 6999 1053
12683 1053 -4395 -8640 -8709 -7448 -7049 2133 9702 3465 -2725 -1913 7606 11934 16308 21577 24638 21006
12667 21006 21308 20832 14993 9771 8567 12277 9007 3970 11158 12833 17145 20888 11098 9194 7232
12652G232J852K43j25m657L92J0348K809l71p389p300J081O05J220M742q30l089
12636F763j972O790P441j331j372J104q727j0020k585L197j87j265J906M967K657
12621G366k246M635L101n850m226j328M70P93J722m53J2046L801o260J977L227
12606A8775n355p036r691l1L111n2R006N086n32o283m504j153N982J678j074O873
12590A4800N802q776j1506o48L107l291j549Q958M588m033K230k629l818Q035
12576A1270N743p027k424q06J555k306j044M512K428K201m804l767L44m4L68M49
12560F648J234J779L107m336l324j461l297J485O753J214n93L350N03o822m288
12545A952L793P004P41l815k228j517l814R78M612P608P575p012q40k029p193
$$ plain form
12652 7232 9084 9327 9202 4545 4937 15285 18094 17723 10334 3034 4115 4720 5940 10682 9852 6763
12636 6763 4791 11581 19022 17691 16319 17423 8696 -1324 -3909 -712 -899 -2164 -258 4709 7366
12621 7366 5120 9755 12856 7006 2780 1452 1922 2715 4437 3984 16030 19831 13571 15548 18775
12606 18775 13420 6384 -3307 -3338 -227 -279 8727 13813 13281 6998 2494 1341 7323 9001 7927 14800
12590 14800 20602 11826 320 -328 2779 -512 -2061 6897 11485 7452 9682 7053 3235 11270
12576 11270 17013 9986 7562 6756 8311 6005 4961 9473 11901 14102 9298 5531 5875 5831 6199 6648
12560 6648 7882 9661 12768 8432 5108 3647 350 1835 8588 9802 9209 12559 13062 6240 1952
12545 1952 5745 12749 13490 9675 7447 5930 2116 3094 7706 15314 22889 15877 15037 13008 5815
12530E815k537o68l283q403J810N410P626K138L957l960J072M47m169J536L314
12515A0105K724J0565q592l106k342o381M737L914J937K328J248j066j873k377
12501A1821R97K681l207k14K367l543l288j124J255L878o389j864M664j992j703
12486D339J128J702q61O82J607j567P65K472P37j72j147P65M887J2O34k485M23
12469A3921O203K106O873N278N469Q064n19M174l450j1798j3458o335j4763K498
12455D263N990j575m93L575M736N494j951l511l708r892k177K905L137N366L652
12440A5811L811m247l385M302N966J272K501m006k642l677l492N132L710k698
12426A8358j261L932J133J030M122Q601N005Q783J875q552j1538q863j149K965
$$ plain form
12530 5815 3278 2610 -673 -9076 -7266 -1856 5770 7908 11865 7905 8977 9424 5255 6791 10105
12515 10105 12829 23394 14802 11696 9354 2973 7710 11624 13561 15889 17137 16071 14198 11821
12501 11821 12818 15499 12292 12078 14445 10902 7614 6490 7745 11623 5234 3370 8034 6042 4339
12486 4339 5467 7169 6308 6990 8597 7030 7795 10267 11004 10832 9685 10450 15337 15349 15983 13498 13921
12469 13921 20124 22230 29103 34381 39850 47914 47395 51569 48119 36321 22863 16528 1765 4263
12455 4263 10253 8678 8185 11760 16496 21990 20039 16528 12820 2928 751 3656 6793 12159 15811
12440 15811 19622 15375 11990 16292 22258 23530 26031 22025 19383 15706 12214 17346 21056 18358
12426 18358 17097 21029 22162 23192 27314 35915 40920 49703 51578 43026 31488 22625 21476 24441
12412B4441j106J347M718R59j79o498p896K48P23j373M560n730o45P813N51o062
12396A5871L168m481K307j611m05k140m946K804N244j014j272K133r18j169n327
12381H244J850P182k642L047M469N613J640r44n450l086j114N080K076o768j0177
12366I020N670L670j429l57o90J638n05q464l102J182O089J311M454j087j320
12351A6080P26J344L21l125k402n969J361J2172P281J494k515L079p07j983J744
12336B8901k871l883M152L119k108o905j570K409k288p167p339K273L353N324
12322A5400l80l286Q477K471n225j808K234J337m176L143J256M34n070p101n818
12307A888Q22N560P24L099O248J734k097L086q711p311K120M506l802O5R24L159
$$ plain form
12412 24441 23335 24682 29400 30359 30180 23682 15786 16034 16757 15384 19944 14214 13569 21382 21933 15871
12396 15871 19039 14558 16865 15254 14849 12709 7763 10567 15811 14797 13525 15658 14740 13571 8244
12381 8244 10094 17276 14634 17681 22150 27763 29403 28459 23009 19923 18809 23889 25965 19197 9020
12366 9020 14690 18360 16931 16574 15884 17522 17017 8553 5451 6633 12722 14033 18487 17400 16080
12351 16080 16806 18150 18471 15346 12944 6975 8336 20508 27789 29283 26768 29847 29140 27157 28901
12336 28901 26030 22147 26299 29418 27310 20405 18835 21244 18956 11789 4450 6723 10076 15400
12322 15400 15020 11734 20211 22682 17457 15649 17883 19220 15044 18187 19443 19877 14807 7706 1888
12307 1888 2710 8270 8994 12093 18341 20075 17978 21064 12353 5042 7162 11668 7866 7931 8855 12014
12291A2014n98k752k415N273K235L972K042K631r292K538J350o776o689M027J2130
12276A9690K289n958n091M539J261N07k28M002l515k311o214k983j098P439L105
12261A5434N046k398n109m976L173j475K172l471K846N522J006P49k754l193l741
12246H831k15N429J3387k462o892J387o242m389K739k056j63R186K70R38q730
12231A1018m726l465m413j322M417O649P328M990J346n102m175j610p0j116j731
12216H018M915n13J908k957o523o28N518n77j539l173k816P558J0732N765J160
12201B6848l498l298L29K441L281J335p009j0735n28m37l375L060L656P876L099
12186B3045Q88l905Q27L208m186q39j853l849k214M832M338J639J935k775M340
$$ plain form
12291 12014 11416 8664 6249 11522 13757 17729 19771 22402 13110 15648 16998 10222 3533 7560 19690
12276 19690 21979 16021 10930 15469 16730 17237 17009 21011 17496 15185 8971 5988 4890 12329 15434
12261 15434 20480 18082 12973 7997 11170 9695 11867 8396 11242 16764 17770 18519 15765 12572 8831
12246 8831 8616 14045 27432 24970 18078 19465 13223 8834 11573 9517 9354 18540 18810 19748 11018
12231 11018 6292 2827 -1586 -2908 1509 8158 15486 20476 21822 16720 12545 10935 10865 9749 8018
12216 8018 12933 12420 14328 11371 4848 4220 9738 9161 7622 4449 1633 9191 19923 25688 26848
12201 26848 23350 20052 20381 22822 26103 27438 20429 9694 9166 8729 5354 8414 12070 19946 23045
12186 23045 23933 20028 20855 24063 19877 19038 17185 13336 11122 15954 20292 21931 23866 21091 25431
12171B5431O063n094k466l215L860J454l359l380L57J201K892p33m276k531k632
12156A3572k641k472J2871O560o914r146k713O403J80J706M151o262L361n800
12142A2856n669l428J0154P716L552l822O33P28j104K853n756K153n585n87L774
12127A8468N448k376q902j0096l61L268N199L706J063o803L586L937R3L074K97
12112A9601k716k790j245P229N959j651p671l05O992K158k762K854k167l039R72
12097B1419j781o31K53j751N818J334p534p606j608O06k294M587K469M681R83
12082A8945n540L950L721O574K808q58M74k593M496L149m812o335k216R26J638
12067B4327m746n483L855q26J241j021L978L104J383J295L394J195L796p51M839
$$ plain form
12171 25431 31494 26400 23934 20719 24579 26033 22674 19294 19651 20852 23744 23011 18735 16204 13572
12156 13572 10931 8459 21330 27890 20976 11830 9117 15520 15700 17406 21557 15295 18656 12856
12142 12856 7187 3759 13913 21629 25181 21359 21992 22720 21616 24469 18713 20866 15281 14694 18468
12127 18468 23916 21540 12638 2542 2181 5449 10648 14354 15417 8614 12200 16137 16230 19304 19601
12112 19601 16885 14095 12850 20079 26038 24387 16716 16411 23403 25561 22799 25653 23486 20447 21419
12097 21419 19638 19007 19260 17509 23327 24661 17127 9521 7913 8519 6225 10812 13281 17962 18945
12082 18945 13405 17355 21076 27650 30458 29600 30074 27481 31977 35126 30314 23979 21763 22689 24327
12067 24327 19581 14098 17953 17127 18368 17347 21325 24429 25812 27107 30501 31696 35492 34741 39580
12052C9580J0071R913O160P942N934j1170r813r73r400k878j610l455j0963n711
12038B3627M514O90o96J712Q46l076m974j374P654k568p854j007M942J697n793
12023A8340j979M832O832K976m359k934N917n686k69k008L628l29L331L377o271
12008B5398l951K30j056k183O874O338J470K109P684L947J678M424j0508n119
11994C7335o618l545l401K026j845o641k17L12k578J389k919O387M744k606O441
11979B8264M540J064J809l27m336j579m728L158R455L396k427Q019J756q708n747
11964C3609J1357k252p979k644J3391J0086P269P269R177J7074K0112K3048L0561
11951A70078K2031J0368J3853j249j8856l3776l5428k2327j6488j2984m362l027
$$ plain form
12052 39580 49651 59564 65724 73666 79600 68430 58617 57644 48244 45366 43756 40301 29338 23627
12038 23627 28141 28831 28135 29847 30693 27617 22643 21269 28923 26355 18501 17494 22436 24133 18340
12023 18340 16361 21193 28025 31001 26642 23708 29625 23939 23670 21662 25290 24961 28292 31669 25398
12008 25398 21447 21677 20621 18438 25312 31650 33120 35229 42913 46860 48538 52962 42454 37335
11994 37335 30717 27172 23771 25797 23952 17311 17094 17406 14828 16217 13298 19685 24429 21823 28264
11979 28264 32804 33868 35677 35350 31014 29435 24707 27865 37320 40716 38289 46308 48064 39356 33609
11964 33609 44966 42714 34735 32091 45482 55568 62837 70106 79283 96357 116469 139517 170078
11951 170078 192109 202477 216330 215081 196225 162449 127021 104694 88206 75222 70860 67833
11939F7833J962Q20n373R47j68l812o211j401n306j84R25m317M4M657K573o312
11923D6677l023K426Q752N716j570O116j411M675N110O818P717M844L020J7369
11909A13236K5806L2425L3799N1432N0815L8578K4976J4166J107j6631k1411k9241
11897C19057m1489l9800k7093k3016k5016j4095j0433j4598j1100P4m814o949
11885A00728k626m33j860J3112J2487J1721Q740J9545K9519L0721K9735K0329
11873B71718J3587j6316l6875l7446l4303k0691j3923r061j0856j2077p086k71
11861H6400k559l402o170m356R61l608j232j322O87K005K138o635n641K77M079
11846F1622J552J480k5j710j560R74k310j3758K534j56o163M62N07L422r82n931
$$ plain form
11939 67833 69795 70615 65242 66189 66021 62209 55998 54597 49291 49107 50032 45715 45759 50416 52989 46677
11923 46677 43654 46080 54832 60548 58978 65094 63683 68358 73468 80286 88003 92847 95867 113236
11909 113236 139042 171467 205266 256698 307513 346091 371067 385233 386340 369709 348298 319057
11897 319057 277568 237768 210675 187659 162643 148548 138115 123517 112417 112491 107677 100728
11885 100728 98102 97669 95809 108921 121408 133129 141869 161414 190933 221654 251389 271718
11873 271718 285305 268989 232114 194668 160365 139674 125751 116690 105834 93757 86671 86400
11861 86400 83841 80439 74269 69913 70874 67266 66034 64712 65399 67404 69542 62907 57266 57543 61622
11846 61622 63174 64654 64629 62919 61359 62333 60023 46265 48799 48643 42480 42942 43449 46871 45889 39958
11830C9958k360l846M785N606L871k85m812N26j082p2O21o132N381M743N426k440
11814D9888q443l445l79N581J461J2725N682Q414J6456N982m605n962j3447q646
11800F1262o513m956K256J087r65l275q361P959P956l713n659j73n63j525L396
11785D8213l235J527K139k344K30j5l853M940R297O999P22l249k928j2464m676
11770D1303n24o235R534O153n226n360O568m610m358J678l290k748q58q70Q01
11755C1958p008J701O555R785o170Q81O627n152m159l708N717j02J697J862n267
11740C5217K435M488O681k756M909r113j0242m479K567m590K642n5m718N550J32
11725B8668K463J992L603K294j938j430L015l66j569L672l417l052n51o514J395
$$ plain form
11830 39958 37598 33752 38537 44143 48014 47729 42917 43443 42361 42289 42910 36778 42159 46902 52328 49888
11814 49888 41445 38000 37621 43202 44663 57388 63070 71484 87940 93922 89317 83355 69908 61262
11800 61262 54749 49793 52049 53136 52171 48896 40535 48494 56450 52737 47078 46905 46342 44817 48213
11785 48213 44978 46505 48644 46300 46530 46515 42662 47602 56899 63898 64620 61371 58443 45979 41303
11770 41303 40779 34544 44078 50231 45005 39645 46213 41603 37245 38923 35633 32885 32027 31157 31958
11755 31958 24950 26651 33206 42991 36821 37702 44329 39177 35018 31310 37027 36925 38622 40484 35217
11740 35217 37652 42140 48821 46065 50974 41861 31619 27140 29707 25117 27759 27704 22986 28536 28668
11725 28668 31131 33123 36726 39020 37082 35652 38667 38301 36732 40404 36987 33935 33384 26870 28265
11710B8265N703M875l897J018l55j904j427K942l190p58J788L631k251K116O644
11695D3200K123l585K409m868q497l768K314j350l98O982M411l44Q33l621K158
11680C7999j431p076o44M8l336P013Q415K642j964q374J264o12j336N293o493
11665C1408o741k909j833L390O512K86K147K408N30JM396M455M099N53j806J157
11649D8053J316O378p296m663l831m204L871O649l928n010K885M303Q076M88j959
11634E1128l370j0210l066n00Q90M958N800o857K253K339J981J770j743J77l446
11619D2104m352R21k907M711N574o334j0278J0022O410M877M635K635p716n577
11605D4725M616L768l797o076q208K226N768J163Q405K459j844J274j920q837
$$ plain form
11710 28265 33968 38843 34946 35964 35609 33705 32278 35220 32030 31272 33060 36691 34440 36556 43200
11695 43200 45323 41738 44147 39279 30782 27014 29328 27978 27580 34562 38973 38629 39462 35841 37999
11680 37999 36568 29492 28848 28896 25560 32573 40988 43630 41666 33292 34556 33944 32608 37901 31408
11665 31408 24667 21758 19925 23315 29827 30113 32260 34668 35198 35199 39595 44050 48149 48702 46896 48053
11649 48053 49369 55747 48451 43788 39957 35753 39624 46273 42345 37335 40220 44523 52599 53087 51128
11634 51128 47758 37548 34482 33982 34872 39830 45630 38773 41026 43365 45346 47116 45373 45550 42104
11619 42104 37752 38673 35766 40477 46051 39717 29439 39461 45871 50748 55383 58018 50302 44725
11605 44725 49341 53109 49312 43236 35028 37254 43022 44185 52590 55049 53205 54479 52559 43722
11591D3722q84P617j225l896J416N47M828L51J437K331M66p230n07O836k684l081
11575E0044p31k267J182R621L913m53K2j126N579L449o99j0204j611n385J778
11560E3112k642J538k345k451M786n977m257N964P433L623r82J222k03q787k33
11545D9801j009N910L222M952k575Q02M751j792p602r152n805O242O211J484J931
11530E7371L924R940N76n437l18M98J043M620J802L673R078N38K298k626l532
11515H3448K51K086J872N068J879p78n37k166m34J935p368q465r238l153N00K076
11499F6976N03J684n285r147N926J2669P131q99P24n006p101k685j86J49k540
11484F2913N161K133j907L09P29K628L513L285K835M261K94m23J281J060J295
$$ plain form
11591 43722 42838 50455 49230 45334 46750 47297 52125 52476 53913 56244 56710 49480 48973 55809 53125 50044
11575 50044 49313 47046 48228 57849 61762 61309 61331 60205 65784 69233 68534 58330 56719 51334 53112
11560 53112 50470 52008 49663 47212 51998 46021 41764 47728 55161 58784 57802 59024 58821 50034 49801
11545 49801 48792 54702 57924 62876 60301 61103 65854 64062 56460 47308 41503 47745 53956 55440 57371
11530 57371 61295 71235 71811 66374 66056 66554 67597 72217 74019 77692 86770 87308 89606 86980 83448
11515 83448 83699 85785 87657 92725 94604 93826 93289 91123 90689 92624 85256 76791 67553 64400 64900 66976
11499 66976 67479 69163 63878 54731 60657 73326 80457 79558 80282 75276 68175 65490 65304 65453 62913
11484 62913 68074 70207 68300 68609 69338 71966 75479 78764 81599 85860 86154 85731 87012 88072 89367
11469H9367j148m649M097K388n809p228o131Q074Q03J708L640O37k380j817K238
11454H3790k782m634j656j569L106N240l615o112N567J191N58k452n484j534N56
11439G0170K674N57M032j508K318L330K755j909k33j1348p385O834R940N478K923
11424H8628N220M175q46q538k125K483n99N182j744l638M05m995J425M46o234
11409G9245l973K337R58m881M977P050J189r628K54q30m693J669J007m294l552
11394F6835k508L524N280j479j648K230N303k312m419N481Q257N173j200j401
11380H7116L23P46K799j88j267N05L020K081L041J934K389M867j826m430K745
11365A03855N558l115n653n282n055N79m287k926Q595L300j1256j1491p9J506
$$ plain form
11469 89367 88219 83570 87667 90055 84246 77018 70887 78961 79764 81472 85112 85749 83369 81552 83790
11454 83790 81008 76374 74718 73149 76255 81495 77880 71768 77335 78526 79084 76632 71148 69614 70170
11439 70170 72844 73401 77433 75925 78243 81573 84328 82419 82186 70838 63453 70287 80227 85705 88628
11424 88628 93848 98023 97177 88639 86514 88997 88398 93580 91836 88198 88603 83608 85033 85479 79245
11409 79245 75272 77609 78567 73686 78663 85713 86902 77274 77528 76698 72005 73674 74681 70387 66835
11394 66835 64327 67851 73131 71652 70004 72234 77537 75225 70806 76287 84544 89717 88517 87116
11380 87116 87439 88185 90984 90796 89529 90034 93054 95135 98176 100110 102499 107366 105540 101110 103855
11365 103855 109413 106298 100645 95363 90308 90887 86600 83674 92269 95569 84313 72822 72743 74249
11351G4249o83m722J965O182K941m657o457N579N595L77M290O707J1617K474j87
11336A05270L543O452N895K600L663J487r198r040o717o632k512J029N019M573
11322A05432o62J1028R324N43M571J0948K771o87J683J892j73n238o748o633N307
11307A33358k303m888l27O933J0606P475J0O168K6144K9834L3735N6471Q6040
11294C89256J36745K08728K78389L16551K94061J81450l810j53975k76417k91910
11284A079068k44785j73668j03761o4250m8873l9615k2311k6453k4500k2791j3764
11273B94297n790l180J272L527l448j0627o595n838q990P13L364r953o418p657
11259B34677k425m197n136o791j862L071m378M35K78k273j78l486M774j055l365
$$ plain form
11351 74249 73566 68844 70809 76991 79932 75275 68818 74397 79992 80369 84659 91366 102983 105457 105270
11336 105270 108813 115265 121160 123760 127423 128910 119712 110672 103955 97323 94811 95840 100859 105432
11322 105432 104770 115798 125122 125665 130236 141184 143955 143268 144951 146843 146670 141432 134684 128051 133358
11307 133358 131055 126167 125840 132773 143379 150854 150864 157032 183176 213010 246745 303216 389256
11294 389256 526001 734729 1013118 1329669 1623730 1805180 1801370 1647395 1370978 1079068
11284 1079068 834283 660615 556854 492604 443731 404116 381805 355352 330852 308061 294297
11273 294297 288507 285327 286599 290126 286678 276051 269456 263618 254628 255341 258705 248752 242334 234677
11259 234677 232252 228055 222919 216128 214266 217337 212959 213394 213672 211399 211221 207735 212509 211454 208089
11244B08089M32J0791J6584K5097K7597L6077N9913J03899J58248K21699K79842
11233A148268L06237K58986J26054l6121j82379k75456k86869k20837j53244j00054
11223E84585p4645m6524k7429k6634k7712k9667j3881j2371j0524j8700p496K329
11211B91331j364q510n612j028j830q089j4045m179k095l569j744P76n126l817
11197B31099m318q833j3521p822j4387j4422j1263n826q915O1N35Q339K798L077
11183A56602m186K670N784p00K661p168m353O816Q500M232J925j943l359n645
11169A61836r85Q296O189j56K476k654l115P085N857O903L914o13j0123k563J562
11154A83909K414L678l186k566P93j983o606n517l344J809L263l836M975J1801
$$ plain form
11244 208089 208521 219312 235896 260993 288590 324667 384580 488479 646727 868426 1148268
11233 1148268 1454505 1713491 1839545 1803424 1621045 1345589 1058720 837883 684639 584585
11223 584585 509940 463416 435987 409353 381641 351974 338093 325722 315198 296498 289002 291331
11211 291331 289967 281457 275845 274817 272987 264898 250853 246674 244579 241010 239266 240042 234916 231099
11197 231099 226781 217948 204427 196605 182218 167796 156533 150707 141792 141853 142388 150727 153525 156602
11183 156602 152416 155086 160870 160170 162831 155663 151310 158126 166626 170858 172783 170840 167481 161836
11169 161836 160851 169147 175336 175180 177656 175002 171887 178972 184829 191732 195646 195033 184910 182347 183909
11154 183909 186323 190001 186815 184249 185042 183059 176453 170936 167592 169401 172664 168828 173803 185604
11140A85604K298M04Q411M486J2081J1995J1003J1521Q788M625r451p513r085
11127B35167j3282l166j4944j2500n184L508l69l38q108m909O359J7274J9441
11114B18949J8748J4283Q021M909l122n939l058j0137l035l736o048n922l301
11101B20612m344n714q173n675r90M461N336P061N392J3126J0644L404n557n961
11087B33622k123R375J0157J8443J9572K0861J8491K1283K7286J2770N444n377
11075C89804r135j4136k5934k7684k8021j7343j4927j5599n767N881R272O739
11063B53150K829P433J1605Q121J1030J2905J1124L287l866n602k59k457o859
11050C02441p294L483J597l895J632J656j964j1916o459o388N7N664O479J1703
$$ plain form
11140 185604 187902 188306 196717 201203 213284 225279 236282 247803 256591 261216 251765 244252 235167
11127 235167 221885 218719 203775 191275 186091 189599 189230 188892 180784 175875 182234 199508 218949
11114 218949 237697 251980 260001 264910 261788 255849 252791 242654 239619 235883 229835 223913 220612
11101 220612 216268 210554 202381 196706 195716 200177 205513 212574 217966 231092 241736 245140 239583 233622
11087 233622 231499 240874 251031 269474 289046 309907 328398 349681 376967 389737 395181 389804
11075 389804 380669 366533 340599 312915 284894 267551 252624 237025 231258 237139 246411 253150
11063 253150 255979 263412 275017 283138 294168 307073 318197 321484 317618 312016 311757 309300 302441
11050 302441 295147 298630 300227 296332 297964 299620 297656 285740 279281 272893 272950 278614 285093 296796
11036B96796J7574J9542J8533J6652J1104N885J5927J0806L284N355Q80J4835
11024D37173J7351J2178N227p270k1000j1827p800l513R1J2156K5569K5867L3765
11011E17967L0101L6229J9654J2932n794r897k0867l6951m0476m6016l0932j4321
10999D11629O0J0270J7114L8420L3835L4871J8888J0584n978k2339k3105k1047
10987E03202k2101r018k121J0064K1699L1130K8548L2185M0564M0562K3601K0344
10975G18659J3698Q129L787K529R661J7886P959K597k729q445P511J9698J7517
10962H18457K0689L4089K9120K6590L0915M1372L6599L1081J6095K646r584j9576
10950A058493k9719l1857j8555j83O697L093L083k436j0329j923K928m093N190
$$ plain form
11036 296796 314370 333912 352445 369097 380201 386086 402013 412819 416103 421458 422338 437173
11024 437173 454524 466702 471929 464659 443659 431832 424032 420519 420610 432766 458335 484202 517967
11011 517967 548068 584297 603951 616883 611089 601192 580325 543374 502898 456882 425950 411629
10999 411629 411689 421959 439073 477493 511328 546199 565087 575671 569693 547354 524249 503202
10987 503202 481101 472083 469962 480026 501725 532855 561403 593588 634152 674714 698315 718659
10975 718659 732357 740486 744273 746802 756463 774349 782308 784905 782176 773731 781242 800940 818457
10962 818457 839146 873235 902355 928945 959860 1001232 1037831 1068912 1085007 1087653 1078069 1058493
10950 1058493 1028774 996917 978362 978179 984876 987969 991052 988616 978287 976364 979292 975199 980389
10937I80389J7126K8709M3897N1793N8012N5772L6281L2610K6419K5283L5822
10926A392113M7252M5309L6239M1369L7358K5283K7257M4323O2915P3358Q6356
10915A919132R2595J01644J11212J16962J25573J51412J79002K18704K63812L19066
10905C599114L74900M43587N04048N30765M80054L57367K80524K53437L26247
10896G150043M69226O28446Q07149J004816J269518J667704K232529L039535M265970
10887B2534936O235837R611536J5481652K4755475L6759604M8993287N5011959
10880B19384286N0140843L3337040K596123k4297899m6784857n4439036m6734877
10873A33201623l3767838k1446226j3478020r018073o457316m899857l905758
$$ plain form
10937 980389 997515 1026224 1070121 1121914 1179926 1235698 1271979 1304589 1331008 1356291 1392113
10926 1392113 1439365 1484674 1520913 1562282 1599640 1624923 1652180 1696503 1759418 1832776 1919132
10915 1919132 2011727 2113371 2224583 2341545 2467118 2618530 2797532 3016236 3280048 3599114
10905 3599114 3974014 4417601 4921649 5452414 5932468 6289835 6570359 6823796 7150043
10896 7150043 7619269 8247715 9054864 10059680 11329198 12996902 15229431 18268966 22534936
10887 22534936 28770773 38382309 53863961 78619436 115379040 164372327 219384286
10880 219384286 269525129 302862169 305458292 281160393 234375536 179936500 133201623
10873 133201623 99433785 77987559 64509539 55491466 49034150 44134293 40228535
10866D0228535l176878k614118k175848j811940j523944j273092j041719q26413
10858B5784583o43476n00436m29696m42263n54658o64423p27450o61911m83467
10849B0676803k63284q8298J5415K4334j1697j9628M6459J76787L87605O15889
10839B1560385Q83800J243496J705577K351982L312616M914940P812590J3006618
10831E6792004K1386144L2692750M4671275N2067886N0434084L6264786J1493134
10824C05802063j6249974l8831368m9615203m8028259l7226622k5224026j5850914
10817G4775697j0150980o998725n271089m270147l633919l118987k650861k202558
10809C6478431j799515j453004j198599j034311r75931r81440j061051j153784
$$ plain form
10866 40228535 37051657 34437539 32261691 30449751 28925807 27652715 26610996 25784583
10858 25784583 25141107 24640671 24210975 23768712 23214054 22549631 21822181 21160270 20676803
10849 20676803 20413519 20325221 20340636 20364970 20353273 20333645 20380104 20556891 20944496 21560385
10839 21560385 22444185 23687681 25393258 27745240 31057856 35972796 43785386 56792004
10831 56792004 78178148 110870898 155542173 207610059 258044143 294308929 305802063
10824 305802063 289552089 250720721 201105518 153077259 115850637 90626611 74775697
10817 74775697 64624717 57625992 52354903 48084756 44450837 41331850 38680989 36478431
10809 36478431 34678916 33225912 32027313 30993002 30017071 29035631 27974580 26820796
10801B6820796j212885j205323j121908r84681q62139p71322p07019o71985o57035
10792A8626499o35375o03431n74715n46051n10017m85465m66678m56205m36416
10783A3912146m14275m02004l85578l72914l53345l41877l23118l13899l01511
10774A0703625k76189k62666k59151k48788k36409k32602k32600k30563k29471
10765H495186k31931k24014k15607k17595k00649j82461j70261j65652j53790
10756F733226j63458j62213j56713j55701j56385j66678j68245j73093j50326
10747E280414j41435j28766j10124r4195p6324o7076o1947m4666k8366j171M0513
10736D566857J03742J68160J74284J09282j8092j95108l29071l64346l19318k47510
$$ plain form
10801 26820796 25607911 24402588 23280680 22295999 21433860 20662538 19955519 19283534 18626499
10792 18626499 17991124 17387693 16812978 16266927 15756910 15271445 14804767 14348562 13912146
10783 13912146 13497871 13095867 12710289 12337375 11984030 11642153 11319035 11005136 10703625
10774 10703625 10427436 10164770 9905619 9656831 9420422 9187820 8955220 8724657 8495186
10765 8495186 8263255 8039241 7823634 7606039 7405390 7222929 7052668 6887016 6733226
10756 6733226 6569768 6407555 6250842 6095141 5938756 5772078 5603833 5430740 5280414
10747 5280414 5138979 5010213 4900089 4805894 4729570 4662494 4600547 4555881 4527515 4526344 4566857
10736 4566857 4670599 4838759 5013043 5122325 5104233 4909125 4580054 4215708 3896390 3648880
10726C648880j75880j34141j21131j08935j02181q7952q5851r0919q8703r2726
10716B560461r7592j00793r3529q3972p9047o2102m8577l0067l2563k4957j4580
10705A892682k3960k6587l8139l9500l9518n5192o0352o7460p0847p2777o4067
10694A334283m9473l2694k0061r073l065j2178j9050k2413k4608l0914m6357l9310
10682A025087l0417l4055l3928k8171j6095k1719l1514k5802k9644k4927j6713
10671G32102j8570k0215j4921j6112n976q660r508k2691k8314k9766k1929k3191
10659E12249k4271k2736j9661j8190j8568j4555j4606j1282j0298k6890j8463
10648C12729j3958q879N738L083l459l073N661J0011J7691J1109K475q36m743
$$ plain form
10726 3648880 3473000 3338859 3217728 3108793 3006612 2918660 2832809 2741890 2653187 2560461
10716 2560461 2462869 2362076 2268547 2184575 2105528 2043426 1994849 1964782 1932219 1907262 1892682
10705 1892682 1868722 1842135 1803996 1764496 1724978 1669786 1609434 1541974 1471127 1398350 1334283
10694 1334283 1284810 1252116 1232055 1222982 1219917 1207739 1188689 1166276 1141668 1110754 1064397 1025087
10682 1025087 994670 960615 926687 898516 882421 860702 829188 803386 773742 748815 732102
10671 732102 713532 693317 678396 662284 656308 647648 638140 615449 587135 557369 535440 512249
10659 512249 487978 465242 445581 427391 408823 394268 379662 368380 358082 331192 312729
10648 312729 298771 289892 295630 298713 295254 292181 297842 307853 325544 336653 339128 338292 333549
10635C33549j0444k3650j8723k2280k0686k1442q473N210J0172J1945J4422J0252
10623B59852J2172J0935k035m085j1952j5142p713r037q751j1823J147R291Q902
10610B31761R682P849p4M477J415k195j93q101j7744j2260m464o427j4927j3419
10596A75380m463q595n978j596M607L613R717R824M446P875J1639j148o02n150
10582A99569r329l070p331p923P12L367J084L940O208L987N774J2402o64p469
10568B01257q546j0880p200j1953j0543m657o39m862j0974j5999o980j52K316
10555A10188M485L217j532j0982l037L489r490M66n140r62L464L125j33l893J455
10540I4720K638q565o706r78L612M123L387o874J591m514n716m451Q947J0107
$$ plain form
10635 333549 323105 299455 280732 258452 237766 216324 207851 213061 223233 235178 249600 259852
10623 259852 272024 282959 280924 276839 264887 249745 242032 232995 224244 212421 213568 222859 231761
10610 231761 241443 249292 249218 253695 255110 252915 252722 244621 226877 214617 210153 203726 188799 175380
10596 175380 170917 162322 156344 154748 159355 162968 172685 182509 186955 194830 206469 205321 204719 199569
10582 199569 190240 187170 179839 171916 172628 175995 177079 181019 187227 191214 196988 209390 208726 201257
10568 201257 192711 181831 174631 162678 152135 147478 146839 141977 131003 115004 108024 107872 110188
10555 110188 114673 117890 116358 105376 102339 105828 96338 96804 91664 90702 94166 97291 97158 93265 94720
10540 94720 97358 88793 82087 81109 84721 88844 92231 85357 86948 82434 76718 72267 81214 91321
10526I1321P756K017q185p961n496K587L247P053P452L386P427J895r032j4390
10512H9077m478m907r891r531p534o950r590j1128p511n165k497J1568J5166N344
10498D1973j0255q113O539k427l437l314k282L62R378O720K587K026L649j87p055
10483C6164k406j823j0780n701O504N386J1737N445K606J7456K6443K5993L6812
10470A53836O3518J01902J57308K23024K92697L22122K77053J47798l9756j90264
10460A509238k89488k92238k39018j66167j01044o9437m5858l3672k6888j8436
10450B26992j7182j8216j2790j4910p423m13l687m445l141o964m370n31p980q615
10436A16325o930N865J1183M346k74o252m625n923j681Q70P290J2613J2939K6662
$$ plain form
10526 91321 99077 101094 92909 84948 79452 82039 85286 92339 99791 103177 110604 112499 103467 89077
10512 89077 84599 79692 69801 60270 52736 45786 36196 25068 17557 12392 9895 21463 36629 41973
10498 41973 31718 23605 30144 27717 24280 20966 18684 19046 28424 35144 37731 39757 43406 43219 36164
10483 36164 33758 31935 21155 15454 21958 27344 39081 44526 47132 64588 91031 117024 153836
10470 153836 217354 319256 476564 699588 992285 1314407 1591460 1739258 1699502 1509238
10460 1509238 1219750 927512 688494 522327 421283 351846 305988 272316 245428 226992
10450 226992 209810 191594 178804 163894 156471 156058 152371 147926 144785 137821 133451 132920 124940 116325
10436 116325 109395 115260 126443 130789 130515 124263 119638 113715 112034 112904 120194 132807 145746 172408
10422A72408L4048O1459R8375J58272K22884K80710L04056K61149J15886m9566
10412A659681j90736k83295k84493k23608j53707r8562o0963l6976k6326j9125
10402B81890j8129j8143k3780k0535q575o648j0403p884q903l003j4931n465j0808
10389A24683j1540p29n091k671q148N924r4m344n706L146l200l905K533O45l618
10374H7885n511m535j057k871n293m464m280m704L291K660L711J154P685K898
10360G6569p40j957Q460m619r159K07l415p21n410j63m352o761q514K263j248
10345D0440J805J81L190k939l744J180q927n938l458j493K226L565J166M673R039
10330D0966K39j295j601J18J918J124j933Q77l290M074L360O23j852O041k126
$$ plain form
10422 172408 206456 267915 366290 524562 747446 1028156 1332212 1593361 1709247 1659681
10412 1659681 1468945 1185650 901157 677549 523842 425280 364317 327341 301015 281890
10402 281890 263761 245618 221838 201303 192728 186080 175677 167793 158890 155887 140956 135491 124683
10389 124683 113143 112414 107323 104652 96504 102428 102334 97990 92284 95430 92230 88325 90858 91503 87885
10374 87885 82374 77839 76782 73911 68618 64154 59874 55170 58461 61121 64832 65986 73671 76569
10360 76569 75829 73872 82332 77713 68554 68761 65346 64625 59215 59052 54700 47939 39425 41688 40440
10345 40440 42245 42426 45616 42677 38933 40113 31186 25248 21790 20297 22523 26088 27254 31927 40966
10330 40966 41205 39910 38309 38427 40345 41469 39536 40413 37123 41197 44557 45180 43328 49369 47243
10315D7243l3L440m413k681K959J214K94p489r762P544L01j586K375M200m166
10300C9440r979N452J844j932l134m21M835k25p929L752N088k769l197j32L851
10285C4544O464m320o54n272p44K967Q060L556L789q413l481M138l046K946m718
10270C5816o373K338l93R61Q021J152j128l776j97R029Q668k373K223J60K507
10255E6635P806O204O469Q379J3961J2475Q514L395K149K2538K2481K7247M2834
10242B41087O0238J00866J54960K26589L01077L19000K59393J13589r8595k77505
10232A400699l27799k65446j88923j23710q2302n3243l4023k6961k0061j0776
10222B67455j2868j0638r483j8149j3874o476n054j0901p041l502p688j0830n481
$$ plain form
10315 47243 47210 50650 46237 43556 46515 47729 48023 40534 30772 38316 38617 37031 39406 43606 39440
10300 39440 29461 34913 36757 34825 31691 31270 36105 35880 27951 31703 36791 34022 30825 30693 34544
10285 34544 41008 36688 36034 30762 30018 32985 41045 44601 48390 39977 36496 40634 37588 40534 35816
10270 35816 29443 31781 31388 32349 40370 41522 40394 36618 36421 45450 54118 51745 53968 54128 56635
10255 56635 64441 70645 77114 85493 99454 111929 120443 123838 125987 148525 171006 198253 241087
10242 241087 301325 402191 557151 783740 1084817 1403817 1663210 1776799 1678204 1400699
10232 1400699 1072900 807454 618531 494821 412519 359276 325253 298292 278231 267455
10222 267455 254587 243949 234466 216317 202443 195967 190913 180012 172971 169469 161781 150951 145470
10209A45470k707l74J572P10M928P642O038N795J0145l413j2178j6101j4161j0007
10195A23359j7085j1174j1743n205o157m072K177O226K101J665P472j533j337
10182H4694k534k374l705j888j639j972p440m901P308l737OJ670K975K466m011
10167F4918j332J618l600J814O176r70m045k439k696o11r73M63p329K217P915
10152F1126J261l5J761K372l402o553l482N486l997j622l491p495j459j074K259
10137D1655o174l361J1766M738o437l98L462N545o6Q81J221j633o97l799k947
10122D3756l978k21Q26N66L457M268j29q40l155n957p243Q959M256m087K584k812
10106D0250p207M925k676l366o885l511p54K432M016Q78Q85L314P839Q899Q134
$$ plain form
10209 145470 142763 142389 143961 144671 149599 157241 163279 169074 179219 175806 163628 147527 133366 123359
10195 123359 106274 95100 83357 78152 71995 67923 70100 76326 78427 80092 87564 86031 84694
10182 84694 82160 79786 76081 74193 72554 70582 63142 58241 65549 61812 61818 63488 66463 68929 64918
10167 64918 63586 65204 61604 63418 69594 68624 64579 62140 59444 58833 57860 58323 50994 53211 61126
10152 61126 62387 62352 64113 66485 63083 56530 53048 58534 54537 52915 49424 41929 40470 39396 41655
10137 41655 35481 32120 43886 48624 42187 41789 45251 50796 50730 51611 52832 51199 50502 46703 43756
10122 43756 39778 39557 40383 40949 44406 48674 48545 47705 44550 38593 31350 40309 44565 40478 43062 40250
10106 40250 33043 37968 35292 31926 25041 21530 20776 23208 27224 28102 28987 32301 40140 49039 57173
10091E7173q053p452K478L994m072j0022R698R355j350n000j456n171l039Q46
10077C7929L528o17N528j109n674n008J658N783K249o971l972L504M46O66R05
10062C8845K954N843l157n053o710k324M006O462j227j186k708K706O825P322
10048E2598N22o548l331K654K574K655j80p198k057K395k765m228n12j369K653
10033C7863o76K364O197J359R67k544k894j415M058k609r573m668J3281N946K698
10018E0354k235K17L254N980k785k641K370L747L155j188k562j827O8J431L763
10003F1101L899m78k771K99o398o681O455L692k422P19J207m42J884O80j357r34
9987E8453o165O733J304l014K217P18m294j703M422L99p235L157K652J9k553j467
$$ plain form
10091 57173 49120 41668 44146 48140 44068 34046 43744 53099 51749 46749 45293 40122 37083 37929
10077 37929 41457 40840 46368 45259 39585 34577 36235 42018 44267 37296 33324 36828 37274 37940 38845
10062 38845 41799 47642 44485 39432 32722 30398 34404 40866 39639 38453 35745 38451 45276 52598
10048 52598 53120 46572 43241 45895 48469 51124 50944 43746 41689 44084 41319 37091 36579 35210 37863
10033 37863 37187 39551 45748 47107 48074 45530 42636 41221 45279 42670 33097 28429 41710 47656 50354
10018 50354 48119 48336 51590 57570 54785 52144 54514 58261 61416 60228 57666 55839 55907 57338 61101
10003 61101 65000 64522 61751 62050 55652 48971 55426 59118 56696 57415 58622 58180 60064 60744 59387 58453
9987 58453 52288 59021 60325 57311 59528 60246 55952 54249 58671 59070 51835 54992 57644 57663 55110 53643
9971E3643o712R84J272o480r326j413o7N244k724Q784L032m95k871j15R339J939
9955E4034l894K301J01m148K176J45k746M857L001k75L600N81j938K658k904m918
9939E2631M854L570j288M188R388L471m523j865p908r84M748m610o794O19K238
9924E7735P085L703l454r164P947P784m012m105K285j746k068N06l324r70m060
9909E4142l243L395o899m057M127N230O202m315N53k400K948N756k415l142k449
9894E3433j080o223L494N050j767M008M921M175l73m758j885M59q574J121K009
9879E4010k976m736k778K387N166L763n368L029K691L661L164m800j3521m563
9865C9129N451Q422N216m497l571k627K532J2301N665l85M483L38k104O414J0224
$$ plain form
9971 53643 46931 47915 49187 42707 33381 31968 31901 37145 34421 43205 46237 45742 42871 42756 52095 54034
9955 54034 50140 52441 52542 48394 50570 50715 47969 52826 55827 55552 59152 59733 57795 60453 57549 52631
9939 52631 57485 61055 59767 63955 73343 76814 72291 70426 62518 61534 66282 61672 54878 55497 57735
9924 57735 64820 68523 65069 55905 63852 71636 67624 63519 65804 64058 61990 62496 59172 58202 54142
9909 54142 50899 54294 47395 43338 47465 52695 58897 54582 55135 52735 55683 61439 59024 55882 53433
9894 53433 52353 46130 49624 54674 52907 56915 61836 66011 65638 60880 58995 59454 50880 52001 54010
9879 54010 51034 46298 43520 45907 51073 54836 49468 52497 55188 58849 62013 57213 43692 39129
9865 39129 44580 53002 58218 53721 50150 47523 50055 62356 68021 67636 72119 72457 70353 76767 86991
9850H6991M891l071j3600l000k036q993l895j653j022J316O578L897l759q991
9836E3653o186M922Q576K752j206L668Q46O146J353J749Q78p990m036j655j487
9821F1983j780p384j092Q41n99p515L358K753M72n376J929O996N858L787k179
9806F2052k646n049J270J978N516L32j788k027l371K454l253j214L143N749n864
9791E7282l983P488M013M989k052j1868R69l57m331J414N870K352m576l289j1882
9776D2039l238J1944O945k133p2j750j473l60O195N902J299m577m874j79K31L004
9760E8903q6J731L879K449k777J285j025M394l305M9j850j1497n865r01j445J370
9744D5309O108R102J783n640P90l502q764L63Q89K234m690k447K184L017j341
$$ plain form
9850 86991 91882 88811 75211 72211 70175 61182 57287 55634 54612 55928 62506 66403 62644 53653
9836 53653 47467 52389 60965 63717 62511 66179 67025 73171 74524 76273 77151 69161 65125 63470 61983
9821 61983 60203 52819 51727 52568 51969 44454 47812 50565 51037 45661 47590 54586 60444 64231 62052
9806 62052 59406 54357 55627 57605 63121 63453 61665 59638 56267 58721 55468 54254 57397 63146 57282
9791 57282 53299 60787 64800 69789 67737 55869 56838 56481 52150 53564 59434 61786 57210 53921 42039
9776 42039 38801 50745 57690 55557 55485 53735 52262 51902 58097 63999 65298 60721 55847 55668 55899 58903
9760 58903 58817 60548 64427 66876 64099 65384 64359 68753 65448 65497 63647 52150 46285 45384 43939 45309
9744 45309 51417 60519 62302 56662 57452 53950 45186 45549 46438 48672 43982 41535 43719 46736 45395
9729D5395J263k607m433o971l933K521P855Q697L255m385j0690k492m314M546
9715C3707L419K253O829K7o702p245k592K965M323M020j160k284k43J425M912
9700D3654j869k143N549R02K495m612n13n103m717p392j161J471R867M364J097
9685D1889m695j103M41j940p354J816J123l279K032j88P384l826j0818k591P831
9670B6722N368J498K983n33m242K825j596k784M114k216K025O017J765l920j668
9655C6358k341P28K189j380j129k155n62j3K295N65n205j678K945j297K44J704
9639C1268m120K460O618l112m556k073q734k872R34K403J069N935M296n414o547
9624A7555M52K616K779L601M989J295o625j051M195k854n909j623M872L111m283
$$ plain form
9729 45395 46658 44051 39618 32647 28714 31235 39090 47787 51042 46657 35967 33475 29161 33707
9715 33707 37126 39379 46208 46235 39533 32288 29696 32661 36984 41004 39844 37560 37317 38742 43654
9700 43654 41785 39642 45191 46093 48588 43976 43463 38360 33643 26251 25090 26561 36428 40792 41889
9685 41889 37194 36091 36532 34592 27238 29054 30177 26898 28930 28742 36126 32300 21482 18891 26722
9670 26722 32090 33588 36571 36038 31796 34621 33025 30241 34355 32139 34164 40181 41946 38026 36358
9655 36358 34017 34745 36934 35554 34425 32270 31708 31695 33990 34555 29350 27672 30617 29320 29564 31268
9639 31268 27148 29608 36226 33114 28558 26485 17751 14879 15813 18216 19285 25220 29516 24102 17555
9624 17555 18007 20623 23402 27003 31992 33287 26662 25611 29806 26952 21043 19420 24292 27403 23120
9609B3120K272L456Q75J70p06l987m842k459m433n796J402k115L540N582N943
9594B2022N88o801l850L681O572J833J985K82k720q064k734N699P081M533k530
9579B7577k902l503o78j805K955l031n807j129Q122L835J924k822m200o84Q03
9564A8655M74K396K486o091L102L215n220q141m72K020J431j437K078L463l145
9549A4814K96L743J846N38k915K58J622n472j305L911N140J734j223l536K673
9534B2124l53O80L555m536r029k053J775m28R491N547R70j793q362r850M47O256
9518A4441J0199K726j612n439k283p59m502o376J953O500P677P883K88m263O32
9503B7065m098m550O242k343r07m189j577K190O537J0739n072n919j0443q829
$$ plain form
9609 23120 25392 28848 29723 29893 29187 25200 20358 17899 13466 7670 9072 6957 10497 16079 22022
9594 22022 22610 15809 11959 15640 22212 24045 26030 26312 23592 15528 12794 18493 25574 30107 27577
9579 27577 24675 21172 20494 18689 21644 18613 12806 11677 19799 23634 25558 22736 18536 17852 18655
9564 18655 19129 21525 24011 17920 21022 24237 19017 10876 10404 12424 13855 12418 14496 17959 14814
9549 14814 15110 18853 20699 21237 18322 18580 20202 14730 13425 17336 22476 24210 22987 19451 22124
9534 22124 21771 22451 26006 21470 12441 10388 12163 11735 21226 26773 27743 25950 17588 7738 8185 14441
9518 14441 24640 27366 25754 20315 18032 17273 12771 6395 8348 14848 22525 30408 30696 26433 27065
9503 27065 22967 18417 24659 22316 21409 17220 15643 17833 24370 35109 30037 24118 13675 4846
9489D846L701L865N295L414n372P15O23l064K993m70j575J495j690R8p856O89
9473G707L738J662K784N037k136n488K656j867O346M890l387l022j559l591m70
9458A3300J141j235n257m292L128P131n391j870K227M445p977L833j85J620L722
9443A4340M139J553o838n382j042M583M604O177o823m699K802N556K367k950M766
9428B3153K875o185q212o840n03L299P061r46O65o926m638k61J1404M209m138
9413A4017n355m017N018O39r65l430J1152L949q714K187J937p733P4j47o546L258
9397E324J965n27K783L665m72l87J703n205r83k020k088n015M644O087M581L059
9381A7114j760k857k856N016o56R29n45j1919l211M470O032l328r289k138J022
$$ plain form
9489 4846 8547 12412 17707 21121 15749 16464 17087 14023 17016 16546 14971 16466 14776 14874 7018 7707
9473 7707 11445 13107 15891 20928 18792 13304 15960 14093 20439 25329 21942 18920 17361 13770 13300
9458 13300 14441 13206 7949 3657 6785 13916 8525 6655 8882 13327 5350 9183 8998 10618 14340
9443 14340 18479 20032 13194 7812 6770 11353 15957 22134 15311 10612 13414 18970 21337 18387 23153
9428 23153 26028 19843 11631 4791 4288 7587 14648 13702 14367 7441 2803 2542 13946 18155 14017
9413 14017 8662 4645 9663 10302 9337 5907 17059 21008 12294 14481 16418 8685 8759 8612 2066 5324
9397 5324 7289 6762 9545 13210 12738 12351 14054 8849 7866 5846 3758 -1257 3387 9474 14055 17114
9381 17114 15354 12497 9641 14657 14001 14930 14385 2466 -745 3725 9757 6429 -2860 -4998 -3976
9366c976K396O604K474K557K824n63L526p80K420L058l750J563n381P04L803l60
9350A7119l855l353m492k340L981L060m03j824J782P68L34M92Q44k281L936K79
9334A4047n075o18J251m027l995L090J87L43m140Q83r536m072j250P433M450n131
9318f160K484P373j22p922O304K110k664q49M669p34K707r68m558l115J999J053
9302A607k229j104K315J022J349o265R18N507O984l07k144J021J460K246K210
9287A4590j3487r696L092P197N145l483k899k973P647J1058M58p608J235j332
9273H944K223L068l884n872J237M602l207m200J001O441N662k221j067k575n493
9258D659k279j019M381J988j0671m212J459N968p84K50M854R40n986l553J340
$$ plain form
9366 -3976 -1580 5024 7498 10055 12879 12316 15842 15062 17482 20540 16790 18353 12972 13676 17479 17119
9350 17119 13264 9911 5419 3079 7060 10120 9717 7893 9675 10443 10777 11269 12113 9832 13768 14047
9334 14047 8972 8354 9605 5578 1583 4673 4860 5203 1063 1946 -7590 -11662 -12912 -5479 -1029 -6160
9318 -6160 -3676 3697 3575 -4347 1957 4067 1403 554 5223 4489 7196 6228 1670 -1445 554 1607
9302 1607 -622 -1726 589 1611 2960 -3305 -2387 3120 10104 9797 7653 8674 10134 12380 14590
9287 14590 1103 -8593 -5501 1696 6841 3358 459 -2514 5133 16191 16649 9041 10276 8944
9273 8944 11167 14235 10351 4479 5716 10318 7111 2911 3912 10353 16015 13794 12727 10152 4659
9258 4659 2380 1361 5742 7730 -2941 -7153 -5694 274 -510 -260 4594 5534 -452 -4005 -2665
9243b665l44L111m886K884L533J00l954J138M751K65m863o040j976O684N881K097
9227E716J306O172n633n315k115M579L56O969O482n079j0734m951K508M69M957
9212E687J400j863j478q40l085n010n134n780L208j304l660M884K825j13K986
9197g277m315O403o90N271M288l081j383p31p644J720N279O443k614R26j585r292
9181h282k657P257N660L612M719j296o111l84l441P48L844L916m844j587M704
9166E858L935j156q584m609K213m98K813J0449R02n116N417K799K489r282n153
9151B477M120m260k307J714j0338k408M635O215Q463L255p990l956n00p28K21
9136a387M336Q05k998j141M19N88J477J497r05l843J961K636M249R589K684k134
$$ plain form
9243 -2665 -3009 102 -4784 -1900 1633 1733 -2221 -1083 3668 3933 -930 -6970 -8946 -2262 3619 5716
9227 5716 7022 13194 7561 2246 131 4710 5066 12035 18517 13438 2704 -2247 261 730 5687
9212 5687 7087 5224 3746 2906 -179 -5189 -10323 -16103 -12895 -14199 -17859 -12975 -10150 -10263 -7277
9197 -7277 -11592 -5189 -5879 -608 3680 599 -784 -1515 -9159 -7439 -2160 4283 1669 2595 1010 -8282
9181 -8282 -10939 -3682 1978 5590 10309 9013 2902 2518 -923 -175 3669 7585 2741 1154 5858
9166 5858 9793 8637 53 -4556 -2343 -2841 -28 10421 11323 6207 11624 14423 16912 7630 2477
9151 2477 6597 2337 30 1744 -8594 -11002 -6367 -152 8311 11566 3576 -380 -880 -1608 -1387
9136 -1387 2949 3754 756 -385 34 622 2099 3596 2691 -1152 809 3445 7694 17283 19967 17833
9120A7833n383q196P92m848Q82N180M706J36J045q38n385m283n981J007K811J851
9104A329j384k533K683r33L855J424M621K111n889o655R7M998K903O01l383R8
9088C943k04j612K412m488N362p88j248L247J394j2286r1Q032P046k42k037m510
9072C930r080l791P111R069N56p740o709k365L330L331O242K728p3n513j892K387
9056A521N937P889J694l5n353j10m146j003m40K400M16o437r84j30L06l5P571
9039I061k238n065o85K996J288R58n716k667M086K925n883m440L628J614k036
9024b174k272k682J0421J0736K531q952m576p33O42J248l368o12j47K733p345
9009d550p723M860P574K076j292N01K195K214k658n159L230L705j053m569J516
$$ plain form
9120 17833 12450 4254 5046 198 1080 6260 10966 11102 12147 11309 5924 1641 -4340 -3333 -522 1329
9104 1329 -55 -2588 95 -838 3017 4441 9062 11173 5284 -1371 -1274 3724 6627 7228 3845 3943
9088 3943 3739 2127 4539 51 5413 4625 3377 6624 8018 -4268 -4359 3673 10719 10477 8440 3930
9072 3930 -5150 -8941 -1830 7239 7795 55 -6654 -9019 -5689 -2358 3884 6612 6539 1026 -866 1521
9056 1521 7458 15347 17041 17006 11653 11543 7397 6394 5954 8354 8770 2333 1349 1219 1525 1490 9061
9039 9061 6823 1758 1073 4069 5357 6315 599 -2068 2018 4943 -940 -5380 -1752 -138 -2174
9024 -2174 -4446 -7128 3293 14029 16560 7608 3032 2299 2941 4189 821 209 62 2795 -4550
9009 -4550 -12273 -7413 161 2237 945 1446 3641 5855 3197 -1962 1268 4973 3920 -649 867
8994H67M625o72j049L944l812m277J448l036M032k79n280j563K18O054j715l086
8978c581p20N56K678J803p96j376j183m916L213N350m258o928l828K339J854L213
8962f580N28M606K355N83m5m142k00K512P432K42l859J884O38l00j76l806m46
8945A226k765l102M943L424jN257O60O179j175j2020J515k942M93N587j425l942
8929A912O807n41m567o25O910O49j0205L5l18k227j16m629J005Q157M727j829
8913E145o956l477O024M921k82J843j271k220k90p12R5J0401J916n485K333K185
8897A4170j091m434o749n831k462j592M116L240L672K472L693O54o444n558j98
8882b342L262M525n191o997j28M452M677M4l74L33O57P69k505N192O552j706J642
$$ plain form
8994 867 5492 4820 3771 7715 3903 -374 1074 -1962 2070 1791 -3489 -5052 -4834 1220 -495 -3581
8978 -3581 -4301 -3745 -1067 736 -60 -1436 -2619 -7535 -4322 1028 -3230 -10158 -13986 -11647 -9793 -6580
8962 -6580 -6052 -1446 909 1492 1447 -2695 -2895 -383 7049 7291 3432 5316 5954 5654 5478 1672 1226
8945 1226 -1539 -4641 302 3726 3725 8982 9642 15821 14646 2626 4141 1199 1692 7279 5854 1912
8929 1912 8719 8178 3611 2986 9896 10545 340 375 57 -2170 -2286 -6915 -5910 2247 6974 5145
8913 5145 -1811 -5288 736 5657 5375 7218 5947 3727 3437 2725 2820 13221 15137 9652 11985 14170
8897 14170 13079 8645 1896 -3935 -6397 -7989 -3873 -633 3039 5511 9204 9858 3414 -2144 -2342
8882 -2342 920 5445 254 -6743 -6871 -2419 2258 2302 1928 2261 2918 3687 1182 6374 12926 11220 12862
8865A2862P80j192o109j154K400J157k094O632j11Q15k840m223j389r467k673
8850f606M914O805q944q016l447L332j106L297K847R495J012m45k363j241K706
8835B240l618j405L801Q673l059j666L506K09j789N436n518j24L724m722q244
8820b556n704K03P31R81P612o851r291Q448P967K453l313p392O430l107m647K004
8804f032R892P884J037k035m686n276J230K631j291n889j0685R23J917Q09l97
8789i968K173O392P422k658m724L517l790l906K430m257Q82q38j816k883k855
8774a4879O318M437m167j940n476K037K951M367O779m091k899L643J406j618Q07
8759b325K71L50m168k570o53p08K83k187r97Q068N284j605o10j433L839j987K560
$$ plain form
8865 12862 13642 12450 6341 5187 7587 8744 6650 13282 13171 13986 11146 6923 5534 -3933 -6606
8850 -6606 -1692 5113 -3831 -11847 -15294 -11962 -13068 -9771 -6924 2571 3583 3138 775 -466 2240
8835 2240 -1378 -2783 1018 9691 6632 4966 8472 8681 6892 12328 6810 6686 10410 5688 -2556
8820 -2556 -8260 -8057 -7326 -6345 1267 -5584 -14875 -6427 1540 3993 680 -6712 -282 -3389 -8036 -6032
8804 -6032 3860 11744 12781 10746 6060 784 2014 4645 3354 -2535 -13220 -12297 -10380 -9571 -9968
8789 -9968 -7795 -1403 6019 3361 -1363 2154 -1636 -5542 -3112 -7369 -6487 -7325 -9141 -12024 -14879
8774 -14879 -8561 -4124 -8291 -10231 -15707 -13670 -10719 -6352 427 -3664 -6563 -2920 -1514 -3132 -2325
8759 -2325 -2054 -1704 -5872 -8442 -9095 -9803 -9520 -11707 -12704 -4636 648 -957 -1567 -3000 839 -1148 1412
8742A412K275o527q961R1J0480Q591q956p707L412J987N825Q072l097p340J425
8727I82L17n612k360l162M130O583o94j969N719r10l086J282Q14j1977n738k457
8711a8138Q849Q643l452j887k843L117O445K575m414J962J328l964r545k312Q401
8696e235J1813n467n089L662P655q13k165j693J772l6l099j308k15L090K599l097
8680B374k419N46m956k678P110R537l05o331P77M702k257l812j286k768O494M299
8664I027K100M27j973k462j794k74K139J610j008M818l611j2841L759J75P19N421
8648F232O023L802p977m663J625O12k573m708J056l034l606K745R230m232R32
8633A464P503l86P276L756j498r858r132j696L953O813J851k535r21j417j893
$$ plain form
8742 1412 3687 -2840 -11801 -11710 -1230 7361 -1595 -9302 -5890 -3903 1922 9994 6897 -443 982
8727 982 1299 -4313 -6673 -9835 -5705 878 184 -1785 3934 3024 -62 1220 2034 -9943 -15681 -18138
8711 -18138 -9289 -646 -4098 -5985 -8828 -5711 734 3309 -1105 857 2185 -1779 -11324 -13636 -5235
8696 -5235 6578 1111 -3978 -316 7339 6526 4361 2668 4440 4404 1305 -3 -218 2872 5471 2374
8680 2374 -45 501 -4455 -7133 -23 9514 9209 2878 3655 8357 6100 2288 1002 -1766 4728 9027
8664 9027 11127 11554 9581 7119 5325 5051 7190 8800 7792 12610 8999 -3842 -83 92 811 6232
8648 6232 12255 16057 8080 3417 5042 5654 3081 -1627 -571 -3605 -7211 -4466 4764 532 1464
8633 1464 8967 8581 15857 19613 18115 8257 -875 -2571 1382 8195 10046 7511 6590 5173 3280
8618C280J833N061M080k328k571l423j176J613J175N054K846K907K55m470l884
8603A0252j448L163j598Q557J391q855m07k148k692O131L147o551j558p70j921
8588D693p06k016M555N696k450K049Q46K268O524n34r123l161l210o345O788R881
8572A5755L763l296J897K348k212J950L512j214J0039Q485K804J1304J1143P190
8558G3468J960j0284p509K332J260m644J505O35l420P468N987j113m812K757O373
8543G1963O367k637m039n901j077O23J781o517M67N127j791J665n876n995K577
8528E6737O807J944k679l844J433j324q06k911n789Q71L079J0826K2286J9005
8514A05635M721j5341k3086j7597j7333q373n359j281J357n686m569N01M074O074
$$ plain form
8618 3280 5113 10174 14254 11926 9355 5932 4756 6369 7544 12598 15444 18351 18606 14136 10252
8603 10252 8804 11967 10369 18926 20317 11462 11055 8907 6215 12346 15493 8942 7384 6614 4693
8588 4693 3987 1971 6526 12222 9772 11821 12667 14935 21459 20925 11802 8641 5431 -914 5874 15755
8572 15755 19518 16222 18119 20467 18255 20205 23717 22503 32542 41027 43831 55135 66278 73468
8558 73468 75428 65144 57635 59967 61227 56583 58088 58723 55303 62771 68758 67645 62833 65590 71963
8543 71963 78330 75693 71654 65753 64676 65299 67080 60563 61030 66157 64366 66031 60155 54160 56737
8528 56737 63544 65488 62809 58965 60398 59074 58268 55357 49568 50439 53518 64344 86630 105635
8514 105635 110356 95015 71929 54332 36999 28626 23267 21986 23343 17657 13088 13589 17663 23737
8500B3737l223l894k898j675K999r44O998L800L70j967K394r010j2943k795J559
8485B508M653M178n855K886Q653j295n961o395Q99K082L507M936J5558R328M836
8470D4518P513n176l996q90m740j0714j5007p026M101k97o329q390L559P328N1
8455D505J588M608R149o668j1421M00m022j393l870j760P009J2267P357n051k555
8440A0143l506K411k382j186O56m850j96K725J861o24L110J009j627n189l944
8425a589L063L33R85L752Qj0208k294J186N611J221K949L73n042p511k724O65
8409i222J163L615j485J402N864K208k600J731k232j1439O29K532O587J881k979
8394b345M922R868K313m501m960n72o729l931L226P528k545k721j63m662n316
$$ plain form
8500 23737 20514 16620 13722 12047 15046 14102 21100 24900 25270 23303 25697 16687 3744 949 2508
8485 2508 7161 11339 5484 8370 17023 15728 9767 3372 4271 6353 9860 14796 30354 39682 44518
8470 44518 52031 46855 42859 41969 37229 26515 11508 4482 8583 8286 1957 -6433 -2874 4454 4505
8455 4505 6093 10701 19850 13182 1761 2161 -1861 -3254 -7124 -8884 -1875 10392 17749 12698 10143
8440 10143 6637 9048 6666 5480 6136 1286 1090 3815 5676 5052 8162 9171 7544 2355 -1589
8425 -1589 1474 1807 2792 6544 6552 -3656 -5950 -4764 847 2068 5017 5390 348 -7163 -9887 -9222
8409 -9222 -8059 -4444 -5929 -4527 1337 3545 945 2676 444 -10995 -10366 -7834 -1247 634 -2345
8394 -2345 2577 12445 14758 10257 5297 4725 -2004 -5935 -2709 4819 2274 -447 -610 -5272 -10588
8379a0588M118J067l570O088m591k079J2238M361m793K90l068m966o718m973J0058
8364g126M761j381k834k493p02N748Q39J38J472L953K339k307r56j753j915k054
8348d271m17R87O24l403l65N936J342M394J06N53m89l600k958J980n038J044O104
8331B529k215j182o780k392M077L351M705m319k80P25L703N535R959j871p781
8316G764N603O337j482m128j1231o367L415j729m14Q78J606l77N664J685m691
8301B533l103L623k426q482n37j556K621P03K458Q61j58J655j71m649q862L248
8285a2242k125L362P672j994l77M324j818J460p9j939P37K430O50L579N13J905
8269F058p263L546J136q446m616l199J30k653r0O340j526K627J653M371l960j544
$$ plain form
8379 -10588 -6470 -5403 -8973 -2885 -7476 -9555 2683 7044 2251 2541 -527 -5493 -12211 -17184 -7126
8364 -7126 -2365 -3746 -6580 -9073 -9775 -4027 -3188 -3050 -1578 2375 4714 2407 1451 -302 -2217 -4271
8348 -4271 -4688 -3701 -3077 -6480 -6845 -909 433 4827 4933 5486 4997 1397 -1561 419 -4619 -3575 2529
8331 2529 314 -868 -7648 -10040 -5963 -2612 2093 -2226 -2506 -1781 1922 7457 17416 15545 7764
8316 7764 13367 19704 18222 14094 2863 -3504 -89 -1818 -2232 -1354 252 -125 5539 7224 2533
8301 2533 -570 3053 627 -7855 -8392 -9948 -7327 -6624 -4166 -3305 -3463 -1808 -1979 -6628 -15490 -12242
8285 -12242 -14367 -11005 -3333 -5327 -5704 -1380 -3198 -1738 -1817 -3756 -3019 -589 61 3640 4153 6058
8269 6058 -1205 2341 3477 -4969 -9585 -12784 -12654 -15307 -15397 -9057 -10583 -7956 -6303 -1932 -5892 -7436
8253g436m735L5M086M441j084j143L119l947K675L480M300l046J998K077l355
8238A465l454m98k272L940N969n67j899j385p405l685J752M182M351l439K315
8223f30J75J684l244l947K314Q647n618j076K491O620J2656j2017j1764p127N377
8208e459L4l527J977M318j108o35K743j630l406o479J73L695j547k899J14k82
8192a3918L050L947j500M595L524j692J725K323n658l524R68K619j439j299P239
8177I60K88l000N407J753l832K123r10p833l045O546%k491j129j350k686P482
8161a717L921k715m136O676M965q756n435l922L168K870J70m477J282j17L345
8146d878k112J238r57k708k41m2J233j52j936Q823M102j194l147J980K792L965
$$ plain form
8253 -7436 -12171 -12136 -8050 -3609 -4693 -5836 -2717 -6664 -3989 -509 3791 745 2743 4820 1465
8238 1465 -1989 -2487 -4759 -819 5150 4583 2684 1299 -6106 -9791 -8039 -3857 494 -2945 -630
8223 -630 -455 1229 -2015 -5962 -3648 4999 -619 -1695 796 7416 20072 8055 -3709 -10836 -5459
8208 -5459 -5425 -8952 -6975 -2657 -3765 -4400 -1657 -3287 -6693 -13172 -12999 -9304 -10851 -13750 -13636 -13918
8192 -13918 -10868 -6921 -8421 -3826 -302 -1994 -269 2054 -3604 -7128 -6160 -3541 -4980 -6279 960
8177 960 1248 -1752 3655 5408 1576 3699 2789 -5044 -8089 -1543 -1543 -4034 -5163 -6513 -9199 -1717
8161 -1717 2204 -511 -4647 2029 6994 -1762 -7197 -11119 -7951 -5081 -4911 -9388 -8106 -8223 -4878
8146 -4878 -6990 -5752 -6709 -9417 -9658 -9700 -8467 -8619 -10555 -1732 2370 1176 -1971 9 2801 6766
8130F766l551o543l89J690k938o35k173o920K020K745o242K274Q48m959J189K26
8114a6592L900J4175k184n285j454o7O055l506J337K323K051N06p26j869J024
8099c12k18o703M780L661o15m70O708k417l85O685M918l489J203J258r77m590
8083I037m15l941j680m990j1045q744M668O981N684N584R49K207L647p279p193
8068f530o81K808k360M716M790J936j978k405j506o685l532K379J3225P12l308
8053A581l676j318J0960L328j642N00k359L206m281j746J434n139l308J241M579
8038C360n271q477m74L417M174L036l97l804Q617M979k483n729j729l273K09Q29
8022c016l373j140m50L37k77J055k143l161K178j443K915K013K468J146m332K532
$$ plain form
8130 6766 3215 -3328 -3717 -2027 -4965 -5600 -7773 -14693 -12673 -9928 -16170 -13896 -13048 -18007 -16818 -16592
8114 -16592 -12692 1483 -701 -5986 -7440 -7507 -1452 -4958 -3621 -1298 753 1259 533 -1336 -312
8099 -312 -530 -7233 -2453 1208 593 123 6831 4414 4029 10714 15632 12143 13346 14604 13627 9037
8083 9037 8622 4681 3001 -1989 -13034 -21778 -17110 -10129 -4445 1139 2088 4295 7942 663 -6530
8068 -6530 -7211 -4403 -6763 -2047 2743 4679 2701 296 -1210 -7895 -11427 -9048 4177 4889 1581
8053 1581 -2095 -3413 7547 10875 9233 9733 7374 10580 6299 4553 5987 848 -2460 -1219 3360
8038 3360 -1911 -10388 -10862 -7445 -3271 -235 -632 -4436 4181 9160 6677 948 -781 -4054 -3845 -3016
8022 -3016 -6389 -7529 -7979 -7642 -7919 -6864 -9007 -12168 -9990 -11433 -8518 -6505 -4037 -2891 -7223 -4691
8006d691l46n039j886R697P902M32l158O821n764m928K785P000O103O137m739
7991A6326o839o955J534L78K234M88l194J669P168R97m482Q94j581j392J776L439
7975A2460L386M871k290k978k030Q479P456l144J242r63m267p128j187J784o363
7960I328K080l68K305N129L161K178J957k455J02O164k668l356K130q44k711j084
7944B1048K699M447L561J6106J2280J6397J6203J1963k534j0013j3555j5620m139
7931E8843q551l730o056N27N155N701k426n993K255k99j2506q734J670m146K224
7916B3934J211P541P711n000L79L728n61m433k880m538k716k473r340k729O879
7901A6713M667k523K118P873J2332Q786O491O089J362R009J79r887l769m698o416
$$ plain form
8006 -4691 -5037 -10076 -11962 -2265 5637 6069 2911 9732 3968 -960 1825 8825 14928 21065 16326
7991 16326 9487 2532 4066 4444 6678 7166 3972 5641 12809 13806 9324 10218 8637 7245 9021 12460
7975 12460 15846 20717 18427 15449 13419 21898 29354 26210 27452 26489 22222 15094 13907 15691 9328
7960 9328 11408 11040 13345 18474 21635 23813 25770 23315 23417 29581 26913 23557 25687 24843 22132 21048
7944 21048 23747 28194 31755 47861 60141 76538 92741 104704 102170 92157 78602 62982 58843
7931 58843 50292 46562 40506 41033 46188 51889 49463 43470 45725 45426 32920 24186 25856 21710 23934
7916 23934 25145 32686 40397 35397 35776 39504 38943 34510 31630 27092 24376 21903 12563 9834 16713
7901 16713 21380 18857 20975 28848 41180 49966 56457 62546 63908 72917 73096 63209 59440 54742 48326
7886D8326r540K766J607n291o305K986j930p554l985k719m493K469N041K4j387
7871B0015n141j507l652J138K560J627j2180N477O319k391K94M795K914P034j174
7856B6128n685j324J061J0618O58N745L594J301n173p062o293l493L116K134j883
7841B3442k148K468J187p080m822N071q05O843O485r096m872m085q499q553o121
7826a0585m97M733N634k297O417J967j684n888m33P334k321l867J983M169R792
7811A4457L511k309p601k162l964o14N919L954J961l947R79J807j812r577j931
7796a329O249N257j125q955l770m910R46J737J946q6J900J732N75O376J681r487
7780a263l430M557j66j297o991J590J246M348O90J227M33m183J572m174j0032
$$ plain form
7886 48326 38786 41552 43159 37868 31563 34549 32619 25065 21080 18361 13868 16337 21378 21402 20015
7871 20015 14874 13367 9715 10853 13413 15040 2860 8337 14656 12265 12559 17354 20268 27302 26128
7856 26128 20443 19119 20180 30798 31456 37201 40795 42096 36923 29861 23568 20075 23191 25325 23442
7841 23442 21294 23762 24949 17869 13047 18118 17313 24156 30641 21545 16673 12588 4089 -4464 -10585
7826 -10585 -11082 -6349 -715 -3012 3405 5372 3688 -2200 -2633 4701 2380 -1487 496 4665 14457
7811 14457 17968 15659 8058 5896 1932 1318 7237 11191 13152 9205 10184 11991 10179 602 -1329
7796 -1329 4920 10177 9052 97 -3673 -8583 -7637 -5900 -3954 -4040 -2140 -408 167 6543 8224 -1263
7780 -1263 -4693 -136 -302 -1599 -8590 -7000 -5754 -1406 -716 511 944 -3239 -1667 -5841 -15873
7765a5873J160L907O963l041l691j815N004j09O917l747M123O76m475k67J045
7750c223k002j161J344o97K165j573p636O708P308R70m751k274q073K834L773
7735f288j271k524J706M256O550L320K681l469k130k407l923L506j035k932P984
7720D024K041l172m039l880K12m539m0n557L286J462O363K892p54n177m809M004
7704g683Q473l686n810m000q16l254R04p8O77N440O595J962n134m710J145J73
7688i802J574o88K634P878j236m835L532J888J767n357l861M82q126J894M667
7673g589K257J307m016J33j808N17l475L332K953R03J96k620k731M53k390n779
7657a8357N86o50J889r01N059N324Q519M887J68l113J438N10l6m176k976O689
$$ plain form
7765 -15873 -14713 -10806 -3843 -6884 -10575 -12390 -7386 -7495 -578 -4325 -202 474 -4001 -4268 -3223
7750 -3223 -5225 -6386 -5042 -5739 -3574 -5147 -12783 -6075 1233 2203 -2548 -4822 -12895 -10061 -6288
7735 -6288 -7559 -10083 -8377 -4121 2429 5749 8430 4961 2831 424 -3499 7 -1028 -3960 4024
7720 4024 6065 2893 -1146 -5026 -4814 -9353 -9393 -14950 -11664 -10202 -3839 -947 -1701 -6878 -11687 -7683
7704 -7683 790 -2896 -8706 -12706 -13522 -16776 -15872 -15950 -15273 -9833 -3238 -1276 -6410 -11120 -9975 -9802
7688 -9802 -8228 -8916 -6282 1596 360 -4475 -943 945 2712 -2645 -6506 -6024 -14150 -12256 -7589
7673 -7589 -5332 -4025 -8041 -7908 -9716 -9199 -12674 -9342 -6389 -5486 -5290 -7910 -10641 -10188 -12578 -18357
7657 -18357 -17771 -18421 -16532 -17433 -12374 -7050 1469 6356 6524 3411 4849 5359 5323 1147 -1829 4860
7641D860M27K381l813m359q99n734n155K015N428k262J946L313l275k996k059
7626a0182M140Q188L865p197r867J888M319l539o247p007j204J4483J1660L410
7612F710j005l412r73j905k941j712l775l686Q194R888l098o758K439L980M216
7597F162o525r436k260N295L958j488K428J031L031L060l685m898J084J485m241
7582d999m221l026l028J76N340L014L794L22j169K949K692J059K790N901k569
7567I025j3206m04J9l904j270o33N919O100j672j65N842l34m34J156j049j2290
7551g300r71M649L874o649M294M115l450k764m375K441L380N64M194o788m112
7536h898N887J746l337q085j443L911O122L312k745k050M240L15q06j192K860
$$ plain form
7641 4860 5287 7668 3855 -504 -1403 -7137 -12292 -10277 -4849 -7111 -5165 -1852 -5127 -8123 -10182
7626 -10182 -6042 2146 6011 -1186 -11053 -9165 -4846 -8385 -14632 -21639 -22843 -8360 3300 6710
7612 6710 5705 2293 1320 -585 -3526 -5238 -9013 -12699 -4505 5383 2285 -4473 -2034 1946 6162
7597 6162 -363 -9799 -12059 -6764 -2806 -4294 -1866 -835 2196 5256 1571 -3327 -2243 -758 -4999
7582 -4999 -9220 -12246 -15274 -15098 -9758 -6744 -2950 -2628 -3797 -848 1844 2903 5693 11594 9025
7567 9025 -4181 -4585 -4566 -8470 -9740 -10373 -4454 1646 -26 -191 5651 5317 4883 6039 4990 -7300
7551 -7300 -8271 -3622 252 -6397 -2103 2012 -1438 -4202 -8577 -6136 -2756 -2192 2002 -4786 -8898
7536 -8898 -3011 -1265 -4602 -12687 -14130 -10219 -4097 -785 -3530 -5580 -1340 -1025 -1831 -3023 -163
7521a63P39Q08m667n981k255K062M294l256P717m455m575L613k624k67L926o59
7505e743N83L904l56L282N614m289q179M813M656o461r11m263q431K326Q754L550
7489a151o54l983J379M420j090n43n945j471j973M545J078j124j75m560m168N860
7473i555N344k732K057K268J417J001n059K506N821k930K761j012j161J483o881
7458d672k490P661k071k385l295p451K859N538Q280m007l672J1877l7l746j496
7443H93k789l821l15l744J966K941l038J08J420M749J636l270l270L260k544K705
7427c113j567P06k50k165p102K96O284J525K197p84L24j541l342j66N211O567
7411C080J287k328M77j452j530R00K0K846k631k886n966m493n003j608K433N240
$$ plain form
7521 -163 576 1384 -3283 -9264 -11519 -9457 -5163 -8419 -702 -5157 -9732 -6119 -8743 -9010 -5084 -5743
7505 -5743 -5160 -1256 -1612 1670 7284 2995 -5184 -371 4285 -2176 -3087 -7350 -15781 -13455 -4701 -1151
7489 -1151 -1805 -5788 -4409 11 -1079 -1622 -7567 -9038 -11011 -6466 -5388 -6512 -6687 -11247 -15415 -9555
7473 -9555 -4211 -6943 -4886 -2618 -1201 -200 -5259 -2753 3068 138 2899 1887 726 2209 -4672
7458 -4672 -7162 499 -1572 -3957 -7252 -14703 -11844 -6306 1974 -2033 -5705 6172 6135 2389 893
7443 893 -1896 -5717 -6032 -9776 -7810 -4869 -7907 -7799 -6379 -1630 6 -3264 -6534 -3274 -5818 -3113
7427 -3113 -4680 -3974 -4224 -6389 -13491 -13195 -6911 -5386 -3189 -3973 -3649 -5190 -8532 -8698 -3487 3080
7411 3080 4367 2039 2516 1064 -466 434 454 3300 669 -2217 -8183 -12676 -17679 -19287 -16854 -11614
7395a1614L777k573K830J001J442M162n461M73k484J377L649n69j533m636j497
7380a1656N3L552J731m264L842M260N24p557n196l274M384K946N230N904K139
7365B618k605J723l265m601q166p169K89P956O815K641N06Q676j712n622o340
7350h256l507P32k796K206M578P410k033k323k659m03M845J567J237N77m198j669
7334d692o148N113O755L761j243m032k839J676m930j36r03O228L125j69j723n54
7318g11l27j954k325l062J257K184J1283M937r740k906M856k842r081k078L979
7303f530Q430n425n153N908M464J352k761k174M03l150j911l680K459N40K400
7288d828j324Q829k224m732n998P245P757N611j928m698p455n927k804j34J071
$$ plain form
7395 -11614 -7837 -10410 -7580 -6579 -5137 -975 -6436 -5963 -8447 -7070 -3421 -3990 -5523 -10159 -11656
7380 -11656 -11603 -8051 -6320 -10584 -6742 -2482 -1958 -9515 -14711 -17985 -13601 -10655 -5425 479 2618
7365 2618 13 1736 -1529 -6130 -14296 -21465 -21176 -13220 -6405 -3764 -3258 5418 3706 -1916 -8256
7350 -8256 -11763 -11031 -13827 -11621 -7043 367 -1666 -3989 -6648 -7051 -2206 -639 598 1175 -3023 -4692
7334 -4692 -10840 -5727 1028 4789 3546 -486 -3325 -1649 -6579 -6715 -7618 -1390 1735 1566 -157 -711
7318 -711 -1038 -2992 -5317 -8379 -7122 -4938 6345 11282 1542 -1364 3492 650 -8431 -10509 -6530
7303 -6530 1900 -3525 -8678 -2770 1694 3046 285 -1889 -1486 -4636 -6547 -10227 -7768 -7228 -4828
7288 -4828 -6152 2677 453 -4279 -10277 -3032 4725 10336 8408 3710 -3745 -9672 -12476 -12610 -11539
7273a1539j526l48J202L46J604K797J784r07l864k123o42p51N949L285l881j254
7257i868p83l528J560L076L780N536j951J149K327J716l97m203K567L285L13P60
7241E339N622K550n10p308l908m116p448J308Q108j615o950n528K059P534j045
7226e908o273l215j116j327L186N210K987l587M683Q459j350o431K536l511o542
7211a2199n343M779K061L714q88p589L643M337K837J61j337K307O355j373j501
7196c6m235J354N06J333O523M196n841j3337p140N317M634k552j133J662K472
7181f277M389M730j176M956j788q124o046N531L409K650K680m258j23Q15J485
7166B853K088p735k722j156N74Q879M898M133p284o366k311J1994M603p933m726
$$ plain form
7273 -11539 -13065 -13413 -12211 -11865 -10261 -7464 -5680 -6587 -10451 -12574 -13216 -13967 -8018 -4733 -8614 -9868
7257 -9868 -10651 -14179 -12619 -9543 -5763 -227 -2178 -1029 1298 3014 2617 -1586 981 4266 4579 5339
7241 5339 10961 13511 13001 5693 1785 -2331 -9779 -8471 -363 -1978 -8928 -14456 -12397 -4863 -5908
7226 -5908 -12181 -15396 -16512 -17839 -14653 -9443 -6456 -10043 -5360 3099 1749 -4682 -2146 -5657 -12199
7211 -12199 -17542 -12763 -10702 -6988 -7876 -15465 -11822 -7485 -4648 -4487 -5824 -3517 2838 1465 -36
7196 -36 -4271 -2917 -2411 -1078 5445 9641 3800 -9537 -16677 -11360 -6726 -9278 -10411 -8749 -6277
7181 -6277 -1888 2842 1666 6622 4834 -3290 -9336 -3805 -396 2254 4934 676 553 1368 2853
7166 2853 4941 -2794 -5516 -6672 -6098 2781 7679 11812 4528 -1838 -4149 7845 12448 4515 -211
7151b11m301k669J116K302l813k299N392J879O729K981L33l922l66j614j501m735
7135d699J53N170K513K634k880n196K524K395L497p281n443j944k875q022j643
7120b1097P780L314J038M144M955l93n240m113l422L572O918L719n166l839O359
7105a471J864N590J538R28o168j1100p366N146Q522L906j390M346L202l266n302
7090a021R59j278n639K003j171N621l059L694O028q19q308j113N400p626O911
7075E82J185k055M133j107m566k365k472l177K654K06n94K713P155L523k66l097
7059B452k163L926K179k941p642P94L579j680L836P0l160m859M753K470o997q64
7043f247J800O3P76m105k445P928k668k365l69q98M82K308j384n22K681N926Q965
$$ plain form
7151 -211 -4512 -7181 -6065 -3763 -7576 -9875 -4483 -2604 4125 7106 7439 3517 3151 1537 36 -4699
7135 -4699 -4546 624 3137 5771 2891 -2305 219 2614 6111 -1170 -6613 -8557 -11432 -19454 -21097
7120 -21097 -13317 -10003 -8965 -4821 134 -259 -5499 -9612 -13034 -9462 -2544 1175 -3991 -7830 -1471
7105 -1471 393 5983 7521 8449 2281 -8819 -16185 -11039 -2517 1389 -1 4345 7547 4281 -1021
7090 -1021 -62 -1340 -6979 -4976 -6147 -526 -3585 109 6137 5318 -2990 -4103 1297 -6329 582
7075 582 1767 -288 3845 2738 -1828 -4193 -6665 -9842 -7188 -6982 -7576 -4863 2292 5815 5549 2452
7059 2452 289 4215 6394 3453 -4189 -3395 184 -1496 2340 2410 -750 -5609 -856 1614 -5383 -6247
7043 -6247 -4447 -4384 -3608 -7713 -10158 -2230 -4898 -7263 -7632 -8530 -8048 -5740 -7124 -7646 -4965 961 9926
7026I926M047j755r822J814j094k085j300L658l730k168l961L851k20K615M157
7011C933J757L36J035q019n44Q71K330N327O433r91k181m071m825J1178p192r906
6995d529J749L091M902o24p26j2191j0053m190l1L878N583Q695N237k354q525
6980a0088j794R057J330m050m221L023O578m62j722j284j892k242n435m729j332
6965a9263M158M492O264J200K254k680k366K015L010p082n126J937M753l174l268
6950a2876M393N988J483L835J702j214r176L869l002j989K660M563o21P422l201
6935C836o427J067p06M191j685n442N793P390k936m028J847n274j475L801M723
6920D675j799j620j506n018m735K625k19O387O743K01j016j096o513p262j607
$$ plain form
7026 9926 13973 12218 2396 4210 3116 1031 -269 3389 -341 -2509 -6470 -2619 -2839 -224 3933
7011 3933 5690 6026 7061 -958 -1502 -631 1699 7026 13459 12468 10287 6216 1391 12569 5377 -4529
6995 -4529 -2780 311 5213 4589 3863 -8328 -18381 -22571 -22602 -18724 -13141 -4446 791 -1563 -10088
6980 -10088 -11882 -2825 -1495 -5545 -9766 -6743 -165 -627 -2349 -3633 -5525 -7767 -13202 -17931 -19263
6965 -19263 -15105 -10613 -4349 -3149 -895 -3575 -5941 -3926 -916 -7998 -13124 -11187 -6434 -9608 -12876
6950 -12876 -8483 -2495 -1012 2823 4525 3311 -5865 -1996 -4998 -6987 -4327 236 -385 7037 3836
6935 3836 -2591 -1524 -2230 1961 276 -5166 627 8017 5081 1053 2900 -2374 -3849 -48 4675
6920 4675 2876 1256 -250 -5268 -10003 -7378 -7597 -1210 5533 5734 4718 3622 -2891 -10153 -11760
6905a1760K162L714L17j2330P121M825p21o251J909Q823j837m371m20r139k449
6890b0407N034N427j084K157Q313M905m135r532o152k339L53M582K268k948P5
6875a3483L582j3777n428P4Q279P581L849j889L641L821k719k386P905o25J07
6860a468n581j718K732L13p99M631O97k787m949j872N307l204L995k06o83J755
6844c837K643k28J355l909p473K714J668m430l093J919K698P816L322m601M014
6829E78O17l612j912n372j007O576J397L504J115n317M322k226k763J877J442
6814g81P191O29N08o17n287j498m770p488M35o04L177J436M795p323K42P001o21
6797c575j817K665L397p65l93q678m648q21N622P823j615K897L429p27l228j080
$$ plain form
6905 -11760 -9598 -5884 -5567 -17897 -10776 -5951 -6672 -12923 -11014 -2191 -4028 -8399 -8819 -17958 -20407
6890 -20407 -15373 -9946 -11030 -8873 -560 4345 210 -9322 -15474 -17813 -17460 -12878 -10610 -13558 -13483
6875 -13483 -9901 -23678 -29106 -29032 -20753 -13172 -9323 -11212 -7571 -3750 -6469 -8855 -950 -1575 -1468
6860 -1468 -7049 -8767 -6035 -5722 -6521 -1890 -1193 -3980 -8929 -10801 -5494 -8698 -4703 -4909 -5592 -3837
6844 -3837 -1194 -1422 -67 -3976 -11449 -8735 -7067 -11497 -14590 -12671 -9973 -2157 1165 -3436 578
6829 578 1195 -2417 -4329 -9701 -10708 -4132 -2735 769 1884 -3433 889 -1337 -4100 -2223 -781
6814 -781 6410 7039 7547 6930 1643 145 -4625 -12113 -11678 -12282 -9105 -7669 -2874 -10197 -9955 -2954 -3575
6797 -3575 -5392 -2727 670 -95 -488 -9166 -13814 -14635 -9013 -1190 -2805 92 3521 2794 -434 -1514
6781a514r513J65k017K376P768NJ975j59n34k807J914J548K881L556r08m846o677
6764f787M25k139l440K819O730O194k028n914k854J987L297k93J206j953j630
6749d380Q43M523l531k99k484m767n787J431M413P439j213m441k691k646Q95M495
6733h200J138N299K737l81N023j553n961m075j1034o043L182O753K301M225N156
6718a433l431l867Q21k856o304K891j161J402L453K949J285L603j943J883k613
6703e321k517r26q30J0832L850r56J03m214M05Q199l49p405M432l204j1264K103
6687g062M165O071q80l472m403p098j114j255N46j440O50N322O145J1373l053
6672D495k201n570J958J385o119k721R720J3502j391m458r88N674k542k510j0140
$$ plain form
6781 -1514 -11027 -10862 -12879 -10503 -2735 -2730 -755 -914 -1448 -4255 -2341 -793 2088 5644 4736 -110 -6787
6764 -6787 -6362 -8501 -11941 -9122 -2392 3802 1774 -4140 -6994 -5007 -1710 -2003 -797 -2750 -4380
6749 -4380 -3537 986 -2545 -2844 -5328 -10095 -15882 -14451 -10038 -2599 -3812 -8253 -10944 -13590 -12695 -8200
6733 -8200 -7062 -1763 974 593 5616 4063 -1898 -5973 -17007 -23050 -19868 -13115 -10814 -6589 -1433
6718 -1433 -4864 -8731 -7910 -10766 -17070 -14179 -15340 -13938 -10485 -7536 -6251 -2648 -4591 -2708 -5321
6703 -5321 -7838 -8764 -9594 1238 5088 4132 4235 21 426 8625 8276 871 5303 2099 -9165 -7062
6687 -7062 -2897 3174 2294 -1178 -5581 -12679 -13793 -15048 -14502 -15942 -15292 -9970 -3825 7548 4495
6672 4495 2294 -3276 -1318 67 -6052 -8773 947 14449 13058 8600 7612 13286 10744 8234 -1906
6657a906L030O487K808k680n367m153J362l3o321K202K55M996j355j564J817J037
6641F15K893J653o037j906R825l90r369k852O757R544O37p551r637o210o380j864
6625b0272N149L803L229q69n391k782j078N457p77K200N890lK451N795q86n269
6609c353m503o218j221L172k53P18M661M31L503j561o31Q124M924L750j576j2656
6593b689j1032R76N990L061P323j006n386N71k502L356j056k898K250p345Q67
6578i520L14L899L225j662q39L712k022m418J08O651K220Q22j725r48l448J91
6562c440k832K391N356Q581q261p727m815l342k796R566Q750M02K291n94n029
6547a499m867r436n5R728M149n571r01j980j732J329K220K190J669m621K795K472
$$ plain form
6657 -1906 1124 7611 10419 7739 2372 -1781 -419 -452 -6773 -4571 -4316 680 -675 -2239 -422 615
6641 615 3508 5161 -876 -2782 7043 6653 -2716 -5568 1189 10733 11370 3819 -5818 -12028 -18408 -20272
6625 -20272 -15123 -11320 -8091 -8960 -14351 -17133 -18211 -12754 -13531 -11331 -5441 -5444 -2993 2802 1916 -3353
6609 -3353 -7856 -14074 -15295 -12123 -12376 -11658 -6997 -6566 -3063 -4624 -5255 2869 7793 11543 9967 -2689
6593 -2689 -13721 -12745 -6755 -3694 3629 2623 -2763 -2192 -4694 -1338 -2394 -5292 -3042 -10387 -9520
6578 -9520 -9206 -5307 -2082 -3744 -4583 -871 -2893 -7311 -7203 -552 1668 2490 765 -183 -3631 -3440
6562 -3440 -6272 -3881 1475 10056 1795 -5932 -10747 -14089 -16885 -7319 1431 1833 4124 3530 -1499
6547 -1499 -6366 -15802 -15857 -6129 -1980 -7551 -8452 -10432 -12164 -10835 -8615 -6425 -4756 -9377 -6582 -4110
6531d110k289M396l742j564R824M531l514p801n350L418O339K722l076n608O267
6516D43j09j123l09J72M140K95l552N96J790n258P748k911j0333L337P018J257
6500C201k002j717k804J3j999l649l155J204L121O661K247L464k405l583m853
6485f256l565K514J337k736k50j106K366J3737J0567n922l339K332m440l857l709
6470b327p604m782J719K841l926L751L498n112J807K167L997Q265O47j123J983
6455E801m597n0j027n124M11m678M849N688K099o08m93k95j0l158L733P76l056
6438B61l21J072L050K682p01j4172n021J283L180J940j839M35j413J942J413o37
6422f846m422n365O159L360k553n740J590l971K311P849M820M977P39J410n633
$$ plain form
6531 -4110 -6399 -2003 -5745 -7309 2515 7046 3532 -4269 -9619 -6201 138 2860 -216 -5824 443
6516 443 334 -789 -1098 -926 3214 3509 -43 553 2343 -2915 4833 1922 -8411 -5074 1944 3201
6500 3201 1199 -518 -3322 -3309 -5308 -8957 -12112 -10908 -7787 -1126 1121 4585 2180 -1403 -6256
6485 -6256 -9821 -7307 -5970 -8706 -8956 -10062 -7696 6041 16608 10686 7347 9679 5239 1382 -2327
6470 -2327 -9931 -14713 -12994 -10153 -14079 -10328 -6830 -11942 -10135 -7968 -3971 4294 4941 3818 5801
6455 5801 1204 1154 127 -4997 -4586 -9264 -4415 1273 3372 2764 2271 1976 1966 -1192 2541 3317 261
6438 261 -60 1012 4062 6744 6043 -8129 -13150 -11867 -8687 -6747 -8586 -8151 -9564 -7622 -6209 -6846
6422 -6846 -11268 -16633 -10474 -7114 -9667 -15407 -13817 -17788 -15477 -7628 -2808 2169 2908 4318 -1315
6407a315l292L509M572n238m810K056l565L276N403P074J58o992m563J547J746
6392d34m885N733q92k59n650q775L195O532N590O966o435l690J39o969l793K659
6376a0968O206R208k121q315k702j349P272J247o855K20M90N046j468R72l707
6361f824j970K04O314J0184L444o65q870p485o8R20j512l193L547o6l431n208
6345a4679j413J253P100J120O089L36n58j770o693O772k54l865l319j835k645
6330a4361K011J405P473Q429l423L054J20J697n208p072O95J1289N500j9K017
6315A3607q516n352n215j699K47K587M428j483n004k174j43N592O98n076M770
6300b733K589k733k220L007j719o360K698N091K600J193J5N527j053n267L435
$$ plain form
6407 -1315 -4607 -1098 3474 -1764 -6574 -4518 -8083 -4807 596 7670 7828 836 -3727 -2180 -434
6392 -434 -5319 414 -478 -737 -6387 -15162 -11967 -5435 155 7121 686 -3004 -2865 -9834 -13627 -10968
6376 -10968 -4762 4446 2325 -5990 -8692 -10041 -2769 -1522 -8377 -8157 -7667 -2621 -4089 -3117 -6824
6361 -6824 -8794 -8590 -2276 7908 11352 10687 1817 -5668 -5736 -4816 -6328 -9521 -5974 -6040 -9471 -14679
6345 -14679 -16092 -14839 -7739 -6619 -530 -194 -752 -2522 -9215 -2443 -2697 -6562 -9881 -11716 -14361
6330 -14361 -12350 -10945 -3472 4957 1534 4588 4708 6405 1197 -5875 -5180 6109 11609 11590 13607
6315 13607 5091 -261 -5476 -7175 -6928 -4341 87 -1396 -6400 -8574 -8717 -3125 -2427 -7503 -2733
6300 -2733 -144 -2877 -5097 -2090 -3809 -10169 -7471 -2380 220 1413 1428 6955 5902 635 4070
6285D070k977o311N94J78j238Q1J165K55n086J547j993r664K600M322O67J15N216
6268f459J76l894L691M399n9J44L642N60N38L184m000m202O88K14m593p947N221
6251h697Q473n852K630j771O866j378n400m595j049L614J827m202k841L803P647
6236i25J834q398k929M205N741L289K390j207o617l686k081k125K807J861o04
6221f445l387R970N815n350M628o3p605o305R885N520r493o105K192j474k243
6206a0460j97R9o101K779M630O461J0625m493m535k589n631m694K039N41L025
6191h501J027M60N339k841p35M227k904m169K836K529J546M819J382n117j0036
6176a0138m42L420K924O108l22k74K742o234o524n319Q524M477K527j605k394
$$ plain form
6285 4070 1093 -5218 -4624 -4446 -5684 -5603 -4438 -4183 -9269 -7722 -9715 -19379 -16779 -12457 -11790 -11675 -6459
6268 -6459 -6283 -10177 -6486 -2087 -2146 -2002 1640 2200 2738 5922 1922 -2280 -1592 -1378 -5971 -13918 -8697
6251 -8697 -224 -6076 -3446 -5217 1649 271 -5129 -9724 -10773 -7159 -5332 -9534 -12375 -8572 -925
6236 -925 909 -7489 -10418 -6213 -472 2817 5207 4000 -2617 -6303 -8384 -10509 -7702 -5841 -6445
6221 -6445 -9832 138 5953 603 5231 5168 -2437 -8742 1143 6663 -2830 -8935 -6743 -8217 -10460
6206 -10460 -10657 -10558 -16659 -13880 -9250 -2789 7836 3343 -1192 -3781 -9412 -14106 -12067 -11526 -8501
6191 -8501 -7474 -7014 -1675 -4516 -5251 -1024 -3928 -8097 -5261 -2732 -1186 3633 5015 -102 -10138
6176 -10138 -10580 -7160 -4236 1872 1550 1276 4018 -2216 -8740 -14059 -5535 -1058 1469 -136 -2530
6161b530k820r80m469j444N444k505K594L660o52O94J0806j097q411P4L758l168
6145a046J777P12n503n424P757J798j236n633j725k975J613k08K337L998J972
6130a786L936p932k580K054J665K216j546K430P365n540o567K212n86L339J2807
6115A1487l138j0491P23K3p402M700l249k139M327O693J221j240o208q921k767
6100a6381Q189M078K990l024j558L433N825O065j211o123m871K303K602k804r54
6085a441J206J508l545m438J197M608j985j783L404N548M465J240j869j241n575
6070A299p025l382O117J449L146j351j736J624L16q90p650k784M286P70J85j033
6054f659J008M352l74L22k17j365p382l751K087N885O179O482O08k761k233q48
$$ plain form
6161 -2530 -5350 -6330 -10799 -12243 -6799 -9304 -6710 -3050 -3702 -3008 7798 6701 -1710 -1636 2122 -1046
6145 -1046 731 1443 -4060 -9484 -1727 71 -1165 -6798 -8523 -11498 -9885 -10093 -7756 -3758 -1786
6130 -1786 2150 -5782 -8362 -6308 -4643 -2427 -3973 -1543 5822 282 -6285 -4073 -4659 -1320 11487
6115 11487 8349 -2142 -1419 -1396 -8798 -4098 -7347 -9486 -5159 1534 2755 1515 -4693 -13614 -16381
6100 -16381 -8192 -4114 -1124 -4148 -5706 -2273 3552 9617 8406 2283 -2588 -285 2317 -487 -1441
6085 -1441 -235 1273 -2272 -6710 -5513 -905 -2890 -4673 -1269 4279 8744 9984 8115 6874 1299
6070 1299 -5726 -9108 -2991 -1542 1604 253 -1483 141 457 -433 -8083 -10867 -6581 -5811 -5626 -6659
6054 -6659 -5651 -1299 -1673 -1351 -1568 -2933 -10315 -14066 -11979 -6094 85 6567 7175 4414 2181 1333
6038A333k412o338p621O331l395J011L386n22M739j030N121O368M76P59l451k744
6022B011q22J379K497m528p651P80n001M449N662l866N572K53k173k372J828j910
6006c892l274K429O389M973k083k116o957o906P389Q045j605k494j021o530N58
5991g095P560K350o353j121p835k757K840N736J844L858M069n183m943M590N974
5976C534j498O21K345k601j564J86N70K783j257q888j057M787L269p757k592Q082
5960a037K093k869L113N338J165l74n537j238k31J260k137M886j993l625L39l378
5944d225P26L081L157K528j999m7l879o036k802J556O225q973n198k268O974P757
5928c423J497N3Q73N670K742l840l231N99J548k00K761l017L70j533k054p21r
$$ plain form
6038 1333 -1079 -7417 -15038 -8707 -12102 -11091 -7705 -8227 -3488 -4518 603 6971 7447 8206 4755 2011
6022 2011 1189 2568 5065 537 -7114 -6334 -11335 -6886 -1224 -5090 482 735 -1438 -3810 -1982 -3892
6006 -3892 -7166 -4737 1652 6625 4542 2426 -4531 -11437 -4048 3997 2392 -102 -1123 -7653 -7095
5991 -7095 465 2815 -3538 -4659 -12494 -15251 -12411 -6675 -4831 -973 3096 -2087 -7030 -2440 3534
5976 3534 2036 2657 5002 2401 837 1023 1593 4376 3119 -5769 -6826 -2039 1230 -6527 -9119 -1037
5960 -1037 1056 -1813 1300 6638 7803 7429 1892 654 423 1683 -454 4432 2439 -1186 -847 -4225
5944 -4225 -3499 -418 2739 5267 3268 3221 -658 -6694 -9496 -7940 -1715 -10688 -15886 -18154 -11180 -3423
5928 -3423 -1926 -1873 -1000 4670 7412 3572 341 940 2488 2288 5049 2032 2402 869 -1185 -1906 -1915
5911a915K090K320K689l30l46p194j691n18p32j617L23L549O99M810m556l730
5895f149O950J670o33L496k118j966l351j27l340k356j438j767q088N86J1976
5880f655O156M764L199J441k426k413L90j865l354o745L034O997L907l602J696
5865D524o878n356o854j160M841R2k794l807M823L91R459L955k980j041k895M639
5849a041n09k574l920m95P183K40n834K35k410L75n39Q727K023l972j1740M295
5833i956M098J893R329N51l056m888J699o123p248O84o81J048N189M518K007O580
5817E644j93n793N006P049j624l96m300k537J716K040k478k675m43m844n027L885
5801d970P246M891Q15l708o507k078J2765N601q14m566J180K269j1048J025O023
$$ plain form
5911 -1915 175 2495 5184 4854 4508 -2686 -4377 -4895 -5627 -7244 -6921 -3372 -2673 2137 -2419 -6149
5895 -6149 801 2471 1838 5334 3216 1250 -2101 -2228 -5568 -7924 -9362 -11129 -19217 -18631 -6655
5880 -6655 -499 4265 7464 8905 6479 4066 4456 2591 -763 -7508 -4474 2523 6430 2828 4524
5865 4524 -2354 -7710 -14564 -15724 -10883 -10791 -13585 -17392 -12569 -12178 -2719 1236 -1744 -2785 -5680 -1041
5849 -1041 -1550 -4124 -8044 -8539 -1356 -1116 -6950 -6715 -9125 -8750 -9289 -562 1461 -2511 -14251 -9956
5833 -9956 -5858 -3965 5364 5915 2859 -2029 -330 -6453 -13701 -13017 -13698 -12650 -7461 -2943 -936 5644
5817 5644 5451 -342 4664 11713 10089 9693 5393 2856 4572 6612 4134 1459 1016 -3828 -8855 -4970
5801 -4970 2276 7167 7982 4274 -2233 -4311 8454 14055 13241 8675 9855 12124 1076 2101 8124
5786H124J530j8448n977J0850P72R91J814o526K191L244k494k993l700J180j947
5771a1389j0607J3693J3856l820l266n61k349N128M937j1399K18P100N395j641
5757E295m161L22R08n345O84O472P92l349k036L577O028L921r434m831K783O742
5741H368J59o660J391J00P56j267l730o27K637K708J971J042o129l11M980J54
5725E542k574M05O14J560J822m018n021m497O198L551K142r87j121M492k724r753
5709d369N733L054m220k548l808k633K932p389l762R859N312j939m710p723Q041
5694h170K116M324P471K48Q3l747m652L837L351N307J281o584o996n66J484M881
5678C668M436j1073p367k98L557M791J386j663M067j727l886L144M663r842l807
$$ plain form
5786 8124 9654 -8794 -14771 -3921 -3149 -2158 -344 -6870 -4679 -1435 -3929 -6922 -10622 -9442 -11389
5771 -11389 -21996 -8303 5553 1733 -1533 -2094 -4443 685 5622 -5777 -5559 1541 6936 5295
5757 5295 1134 1456 2364 -2981 -2297 4175 4967 1618 -418 3159 9187 13108 3674 -1157 1626 8368
5741 8368 8527 1867 3258 3358 4114 2847 -883 -1510 1127 3835 5806 6848 719 408 5388 5542
5725 5542 2968 3373 3987 5547 7369 3351 -1670 -6167 31 3582 5724 4737 3616 8108 5384 -4369
5709 -4369 1364 4418 198 -2350 -6158 -8791 -5859 -13248 -17010 -7151 -1839 -3778 -8488 -16211 -8170
5694 -8170 -6054 -1730 5741 5989 6072 2325 -2327 1510 4861 10168 11449 4865 -2131 -2697 -1213 3668
5678 3668 8104 -2969 -10336 -10634 -7077 -2286 -900 -2563 1504 -223 -4109 -965 3698 -6144 -9951
5663i951K567N437o229M326L790l42K507J914j91p94k659q35n451M124j306L088
5647eO566k963n12n333M029O134J994l378l48n933K581O230q235j295o653j168
5631h289N829J339o659K856K897o520N445P432J751J041p308r975m365P766M035
5616b725k663J441K030K979l00N889j46m301k000j626L394k324k494K98k830k940
5600h318n97j822R811L912j391J846q91Q690N16r231p46O50O059O821Q79p222
5584H966m428n723L285J14k861m514O949L666k12l11N304o317k938L387n09K890
5568F748j324O331k800l221N4n146r95M115J081m143M463R602m51j617m707j0247
5552b257m503K467L295j649o08K472l162P64K206O100J783l040o148k284k223
$$ plain form
5663 -9951 -7384 -1947 -8176 -3850 -60 -402 2105 4019 3828 3034 375 -460 -5911 -1787 -3093 -5
5647 -5 6561 3598 3086 -2247 1782 7916 9910 6532 6184 251 2832 9062 827 -468 -7121 -8289
5631 -8289 -2460 -1121 -7780 -4924 -2027 -8547 -3102 4330 6081 7122 -186 -10161 -14526 -6760 -2725
5616 -2725 -5388 -3947 -1917 1062 762 6651 6505 2204 204 -1422 1972 -352 -2846 -2548 -5378 -8318
5600 -8318 -8915 -10737 -926 2986 1595 3441 2550 11240 11756 2525 1779 2429 8488 15309 16188 8966
5584 8966 4538 -1185 2100 2214 -647 -5161 1788 5454 5242 4931 10235 3918 980 4367 3858 6748
5568 6748 5424 11755 8955 5734 5788 642 -353 3762 4843 700 5163 14765 14314 12697 7990 -2257
5552 -2257 -6760 -4293 -998 -2647 -3255 -783 -3945 -3181 -975 5125 6908 3868 -2280 -4564 -6787
5537f787O774O119o33K76n074j0786o081O325O02J78N025k69K949K874l559j17
5521b184K87K859m440m98N233K805n193l076O61n91j009L023K009k814m969m601
5505a2498N527J239K282m765j224O590N424q819r41J067L304Q463K224j453q014
5490a594l156P13k549j764L206L335o62J844K967P83K201J845j075L921k495m864
5474B656M67N914n608L828J552o113p70K568j738P36k08K636M11q72l618L385
5458E226l779l827l666L846L680Q21m23J730J296m127n538K933l289M318P922
5443G123j749j987Q32n240o690k113l053O00J99j818N890N354N013n50k893j1632
5427a2714k677L411P332J88q990K404R527K484N076M594m506j1497l446o7j948
$$ plain form
5537 -6787 -13 6106 5473 5749 675 -10111 -16192 -9867 -9265 -9087 -4062 -4331 -1382 1492 -2067 -2184
5521 -2184 -1897 962 -3478 -3976 1257 4062 -1131 -4207 -3546 -4137 -5146 -2123 -114 -2928 -7897 -12498
5505 -12498 -6971 -5732 -3450 -8215 -9439 -2849 2575 -6244 -7185 -6118 -2814 5649 7873 6420 -1594
5490 -1594 -4750 -4037 -6586 -8350 -5144 -1809 -2471 -627 2340 3123 5324 7169 6094 10015 7520 2656
5474 2656 3123 9037 3429 7257 8809 2696 1926 4494 2756 3492 3284 5920 6331 5459 1841 5226
5458 5226 1447 -2380 -6046 -2200 1480 2301 1878 3608 4904 777 -4761 -1828 -5117 -799 7123
5443 7123 5374 3387 4219 -1021 -7711 -9824 -12877 -12277 -12078 -13896 -8006 -2652 2361 1811 -1082 -12714
5427 -12714 -15391 -11980 -4648 -4460 -13450 -11046 -1519 965 6041 10635 6129 -5368 -8814 -8881 -10829
5412a0829N371O598k465J499M474N45p00M965p09m610k431l547J336j460m323
5397f286K83j520q1p11J470J600q4Q62J1372J1063o960k511l243J26N21k494N96
5380D003k938p377l367J460Q563K645l823j072k864L911N076q851N009k744K54
5365b115L416L917m144n020j134R74L884J256J469l797p206N38L472J158k553
5350e885m476l973M223K611L374L489O905n610j877M07L440k544j423K320n16
5335D65m489J650J724m677l446M85p14L296L776L932J672M093n480l764L922J554
5319C999k130m283M671m133p12P708l326j0431J302Q337J567p501m796j089L759
5304g058K526K034K128k611N248j493r347j920K152N959K527K243p031K366j98
$$ plain form
5412 -10829 -5458 1140 -1325 174 4648 5193 4493 9458 8749 4139 1708 -1839 -503 -1963 -6286
5397 -6286 -6003 -7523 -7604 -8315 -6845 -5245 -5329 -4467 6905 17968 11008 8497 5254 5380 5901 3407 4003
5380 4003 1065 -6312 -9679 -8219 344 2989 -834 -1906 -4770 -859 4217 -4634 375 -2369 -2115
5365 -2115 1301 5218 1074 -3946 -5080 -4106 -222 1034 2503 -1294 -8500 -7962 -4490 -3332 -5885
5350 -5885 -10361 -14334 -10111 -7500 -4126 -637 6268 658 -1219 -812 2628 84 -1339 981 465
5335 465 -4024 -2374 -650 -5327 -8773 -8288 -9002 -5706 -1930 2002 3674 7767 2287 -1477 2445 3999
5319 3999 1869 -2414 2257 -1876 -2588 5120 1794 -8637 -7335 1002 2569 -4932 -9728 -10817 -7058
5304 -7058 -4532 -2498 -370 -2981 2267 774 -8573 -10493 -8341 -2382 145 2388 -4643 -2277 -2475
5289b475j675q135M629L867o983P75m14M482L165l429n671J375J78m795k933J554
5273a6485O195K274K102L921M702k557j375L67o06p38l13p027J054M50J581O658
5257B03K165l355N673o43k910k20R327j398r652q295l979L252K350M08n520j610
5241a4204P386K386j608O7P80m241j829K836l151Q517n11r04j131J904O627l633
5225g09k960o267L620k822j0483O68J803m099N396J822l971M066K528L981M700
5210b727P48j426k656M39L20J694J107M186m726J22n752L842J055j64j308j656
5194f902n12J281q43k046Q71O037k452L268K548N783m826j074k19j0923o736J4111
5178b634Q032n480k123K627Q863j103m207n093l037O802l068p792j706N096L632
$$ plain form
5289 -2475 -4150 -12285 -7656 -3789 -10772 -9997 -10411 -5929 -2764 -6193 -11864 -10489 -10311 -15106 -18039 -16485
5273 -16485 -10290 -8016 -5914 -1993 2709 152 -1223 -856 -1462 -2200 -2513 -9540 -8486 -8036 -6455 203
5257 203 2368 -987 4686 4043 1133 913 10240 8842 -810 -9105 -13084 -9832 -7482 -7074 -12594 -14204
5241 -14204 -6818 -4432 -6040 -5973 -5193 -9434 -11263 -8427 -11578 -3061 -3572 -4476 -5607 -3703 2924 -709
5225 -709 -3669 -9936 -6316 -9138 -19621 -18953 -17150 -21249 -15853 -14031 -18002 -13936 -11408 -7427 -2727
5210 -2727 -1979 -3405 -6061 -5622 -5302 -3608 -2501 1685 -3041 -2919 -8671 -4829 -3774 -3938 -5246 -6902
5194 -6902 -7414 -6133 -6976 -9022 -8151 -2114 -4566 -1298 1250 7033 2207 1133 914 -10009 -16745 -2634
5178 -2634 5398 -82 -2205 422 9285 8182 3975 -1118 -4155 2647 -421 -8213 -9919 -4823 -1191
5163a191j395P292n845p812n134p10j233M011p0j416o79M052N439O412N051K783
5147I555o929r31j22n957n687J29j270j115m435K51J2239L860l496j04J98M49
5131c365K215N298J553n46l538J434k011l174l862j536m42K081l846N636M400
5116B97j299P848R73k551j1296k106N375O269m009M60k054J313O852n754o551
5101f233m62m17n996k76N733N421M022k712l185J639m34o62L029L482k757k478
5085b286l490k908O92O963K293P348N916o668j2509k508L489L31j265n761m290
5070a4653J004J171l631o232L158J1833R367K229Q97m096n323K588K944J883k496
5055F43l466M056K596m497n10k925l235j409R901J723l344J774j349L437k992
$$ plain form
5163 -1191 -2586 4706 -1139 -8951 -14085 -14795 -16028 -12017 -12087 -13503 -14182 -10130 -4691 1721 6772 9555
5147 9555 2626 1695 1573 -4384 -10071 -9942 -11212 -12327 -16762 -16511 -4272 -412 -3908 -4012 -3814 -3365
5131 -3365 -1150 4148 5701 5155 1617 3051 1040 -2134 -5996 -7532 -7974 -5893 -9739 -4103 297
5116 297 -1002 6846 7819 5268 -6028 -8134 -2759 3510 -499 -39 -2093 -780 6072 318 -6233
5101 -6233 -6695 -7112 -13108 -13384 -7651 -2230 1792 -920 -4105 -2466 -2900 -3562 -533 2949 192 -2286
5085 -2286 -5776 -8684 -7992 -1029 1264 8612 14528 7860 -4649 -7157 -3668 -3337 -4602 -10363 -14653
5070 -14653 -13649 -12478 -16109 -22341 -19183 -7350 2017 4246 5143 1047 -4276 -1688 1256 3139 643
5055 643 -2823 1233 3829 -668 -1178 -4103 -7338 -8747 1154 2877 -467 1307 -42 3395 403
5040D03J285O686l864k813K23J637k217m039L141m35J001J942k457o853o004O920
5024e444J870K919K123l362l821L997m485k806L017K15J742o44m213j266L049
5009g109N808j344j37J104M866m138k974M950l01p181J387k79n00l562K17J851
4993g342J715M629K329l272l166l320K833P873n536j555n62n340M153O088M94
4978B1l71J422N287O442j600p394k944p29n32J654n420q395R08K262L53J861k005
4961i180M89K834K828n25M637l624j291L344J624M439J124o608n799J436R969
4946E697O078K402o728j0468n052L231J259j235L494j873j849O309K423J350R26
4931E964k495L824O221j261r29k210l97n58l344n328K20k765J795k963K085K886
$$ plain form
5040 403 1688 8374 4510 1697 1920 3557 1340 -2699 442 7 1008 2950 493 -6360 -12364 -5444
5024 -5444 -3574 -655 1468 -1894 -5715 -1718 -6203 -9009 -5992 -5777 -4035 -4679 -8892 -10158 -7109
5009 -7109 -1301 -2645 -2782 -1678 3188 -950 -3924 1026 725 -6456 -5069 -5348 -5848 -9410 -9193 -7342
4993 -7342 -5627 -998 1331 -1941 -5107 -8427 -5594 2279 -3257 -4812 -5374 -10714 -6561 -473 21
4978 21 -350 1072 6359 12801 11201 3807 863 134 -398 1256 -4164 -12559 -11651 -9389 -9036 -7175 -9180
4961 -9180 -8691 -5857 -3029 -3554 1083 -2541 -3832 -488 1136 5575 6699 91 -5708 -4272 5697
4946 5697 11775 14177 7449 -3019 -8071 -4840 -3581 -4816 -1322 -3195 -5044 1265 3688 5038 5964
4931 5964 3469 7293 13514 12253 11324 9114 8717 8159 4815 -513 -293 -3058 -1263 -4226 -2141 745
4915G45l6l47k068J986J299l463m41J492l206j764n437M43K324J309J945M508
4899g11m228n636J248J75O924r90l231j316m519K597Q801P817n27l954m46L78
4883B382M721k940l105O073J677l753j042J528k191k114J426l479m772K212M07
4868b970n743j194o93R589M831m52m98j425J527m412O04J918O331J697M45L849
4852A3404j531j1136K291L08n496n334K618Q907N765p504j096K100j070M348m905
4837A669L584M178J449N316n611j0591o671O48J2220l52k76N337M470q452L867
4822A0785N342p330j0990O393J677j2213n09P201p23j308j989r82K7L523m560
4807e656K302K86n82K409K055j196n600J774K674O844k53n854m443K709M673P187
$$ plain form
4915 745 709 362 -1706 280 1579 -1884 -2325 -833 -4039 -5803 -11240 -10797 -8473 -7164 -5219 -711
4899 -711 -4939 -10575 -9327 -9152 -2228 -3218 -6449 -7765 -12284 -9687 -886 6931 6404 2450 2004 2382
4883 2382 7103 4163 1058 7131 8808 5055 4013 5541 3350 1236 2662 -817 -5589 -3377 -2970
4868 -2970 -8713 -9907 -10600 -1011 3820 3368 2870 1445 2972 -1440 -836 1082 7413 9110 9555 13404
4852 13404 11873 737 3028 3336 -2160 -7494 -4876 4031 9796 2292 1196 3296 2226 6574 1669
4837 1669 5253 9431 10880 16196 10585 -6 -6677 -6029 6191 5839 5563 10900 15370 6918 10785
4822 10785 16127 8797 -2193 4200 5877 -6336 -6845 356 -367 -1675 -3664 -4646 -4619 -1096 -5656
4807 -5656 -3354 -3068 -3650 -1241 814 -382 -5982 -4208 -1534 5310 5057 -797 -5240 -2531 2142 9329
4791I329o70j889k745M451p915l537K742K549Q00K383P944o821j3492J863K430
4776b578L041R999J405j555J100o410k733K149R76q702j978K298K880j494l189
4761d791K599o11K87K759l859J579J505j222K977J279j316k494j268l480j173
4746g229L91M41r70M595j14M830L849l055R12o137J503P719j793r832p389L86
4730a1893J567J261j188K858O686P67P586J3264K700q520p540o465j3K990K30
4715D290j438N79j873M88J751J545J15n245m157L039J619L472q632J484M079q66
4699B50L942M385L869l422j509n400p347L80j455J0644M017k487j063N479R89
4684A1272o299r113p30m403O440M732K897n388j325M368o28n822p438R0J0658
$$ plain form
4791 9329 8659 6770 4025 8476 561 -2976 -234 2315 3115 5498 13442 6621 -6871 -5008 -2578
4776 -2578 463 10462 11867 10312 11412 5002 2269 4418 5394 -3308 -5286 -2988 -108 -1602 -4791
4761 -4791 -2192 -2803 -2516 243 -3616 -2037 -532 -1754 1223 2502 1186 -1308 -2576 -6056 -7229
4746 -7229 -6838 -6397 -7367 -2772 -2886 1944 5793 2738 3650 -2487 -984 6735 4942 -4890 -12279 -11893
4730 -11893 -10326 -9065 -10253 -7395 -709 58 7644 20908 23608 15088 7548 1083 1070 4060 4290
4715 4290 2852 3431 1558 2046 3797 5342 5457 212 -3945 -906 713 4185 -4447 -2963 1116 250
4699 250 4192 8577 12446 9024 7515 2115 -5232 -4852 -6307 4337 8354 5867 4804 10283 11272
4684 11272 4973 -4140 -4870 -9273 -2833 1899 4796 -592 -1917 2451 1823 -3999 -11437 -11347 -689
4669f89M00r83k58j502K646J837Q83J627j36o046o443l300Q01J613L648L122p36
4652c516n93o107O419N205O436K772l795j255j544K36O27K014k47L091K497J81
4636A2421j634q201p920M389Q170M13O14O99n524p920p429J46O007J956K021k696
4620d488o84P51q201j203Q882P478P319n928m341o73k812J447j708j586Q776J363
4604D392N317J835q260l930m376K134n534J108M270k410j812J449J579K403l903
4589e738N699k499l699L316N951K071K978J908k32K056O2k860o868N38L006j909
4573C780k010o137r21P121M844J890m312L572N458n260n518J062Q01k810n594
4558d034m262k940K288O763j06k074o787L33J526O204L19l712n881L564L588L602
$$ plain form
4669 -689 -289 -1272 -1530 -3032 -386 1451 2334 3961 3825 -2221 -8664 -11964 -11163 -9550 -5902 -2780 -3516
4652 -3516 -4109 -10216 -3797 1408 7844 10616 6821 5566 4022 4258 4885 6899 6652 9743 12240 12421
4636 12421 10787 2586 -5334 -945 7225 7638 8252 8951 3427 -4493 -11922 -11776 -5769 -3813 -1792 -4488
4620 -4488 -5172 -4421 -12622 -13825 -4943 2535 9854 3926 -415 -1088 -3900 -2453 -4161 -5747 3029 4392
4604 4392 9709 11544 3284 -646 -5022 -2888 -8422 -7314 -3044 -5454 -7266 -5817 -4238 -1835 -5738
4589 -5738 -39 -2538 -6237 -2921 3030 5101 8079 9987 9755 11811 11873 9013 2145 2683 5689 3780
4573 3780 1770 -4367 -5288 1833 6677 8567 4255 7827 13285 8025 2507 3569 4370 1560 -4034
4558 -4034 -8296 -11236 -8948 -2185 -2291 -4365 -11152 -10819 -9293 -3089 -2770 -6482 -12363 -8799 -5211 -1609
4542a609J031M222k564m574J656j542k352N7j593P16L173N579J772J057M313J160
4526A0502l836q871r193l944O019j848j855M801K040m53O138Q89m3K273k024r53
4510c58r563J791J2741k529m622N768J101k863r024k95N73R40P721Q216M585l530
4494A0652j1440L26j068N333k047j416N003k541m255K947q4p8k274J011Q770K227
4478A1066l178O009J776P94l791r158o138m757j295L660m885K542P849R12k235
4463h29m18L742K984m967L268O083o26r752l486N486L896q71n044L298p431o100
4447a0767J260P309M648k864j095j289k636j332L904K997M680m682j991q272Q76
4432i254J150k02k33P590N616K863j981p859J233j602m047l823j447O032J97K29
$$ plain form
4542 -1609 -578 3644 1080 -3494 -1838 -3380 -5732 -5675 -7268 -6552 -3379 2200 3972 5029 9342 10502
4526 10502 6666 -2205 -11398 -15342 -9323 -11171 -13026 -8225 -6185 -6638 -500 389 346 2619 595 -358
4510 -358 -9921 -8130 4611 2082 -2540 3228 4329 1466 -7558 -7853 -7280 -6340 1381 9597 14182 10652
4494 10652 -788 -462 -1530 3803 1756 340 5343 2802 -1453 1494 1410 1332 -942 69 8839 11066
4478 11066 7888 13897 15673 16467 12676 3518 -2620 -7377 -8672 -5012 -9897 -7355 494 1406 -829
4463 -829 -1247 2495 5479 512 3780 9863 9237 -515 -4001 1485 5381 4510 -534 2764 -4667 -10767
4447 -10767 -9507 -2198 2450 -414 -1509 -2798 -5434 -6766 -2862 135 4815 133 -1858 -10130 -9254
4432 -9254 -8104 -8306 -8539 -949 4667 7530 5549 -2310 -1077 -2679 -6726 -10549 -11996 -5964 -5767 -5538
4416e538k803m618O867L151k510m426L774Q967l585j0064K629Q611K27j850o67
4401a835L530N851j701K87Q725K649j1359p783J659L444q32l11o156j584N062
4386c54K768j925n343R487M538N64J741m252o408j235p080l979l758J221Q269
4371e746K664j517K242j430l272P97O502O991K814L506n1n118M62J597M135O92
4355A5268o751q071J063l18O346M633n18j951k563m297j1128k909M099m622k305
4340a4024Q379J0580o474p005m592P480L52j547K321K722K203K118J329O563L81
4325A0786l069k093p706j265Q897O19m001n201k855P176N539n472Q56O528J111
4310I850m860k241J786r50n233R62L402m92k243K483J672j047K065L211N214Q9
$$ plain form
4416 -5538 -8341 -12959 -6092 -2941 -5451 -9877 -6103 2864 -721 -10785 -8156 455 682 -1168 -1835
4401 -1835 1695 7546 5845 6132 14857 17506 6147 -1636 23 3467 2635 2324 -3832 -5416 -354
4386 -354 2414 489 -4854 4633 9171 9735 11476 7224 816 -419 -7499 -11478 -15236 -14015 -5746
4371 -5746 -3082 -4599 -2357 -3787 -7059 -6262 240 7231 10045 13551 13500 8382 8844 10441 14576 15268
4355 15268 8517 446 1509 1191 7537 12170 11652 9701 7138 2841 -8287 -11196 -7097 -11719 -14024
4340 -14024 -5645 4935 -1539 -8544 -13136 -5656 -5304 -6851 -4530 -1808 395 2513 3842 10405 10786
4325 10786 7717 5624 -2082 -3347 5550 6169 2168 -3033 -5888 1288 6827 1355 2211 8739 9850
4310 9850 4990 2749 4535 3585 -1648 -686 2716 2224 -19 2464 4136 3089 5154 8365 13579 13668
4294A3668n7p199K438l09m450p915l90N160O66p16K46Q09L335k651k431m12o918
4277g126Q0J981O942N37K741J816n603o164j417J117M44k290J57O06O079N044
4261D944K416l518j977l317K533M267m232l071o28k336O519n45l066k277K468
4246a820n034M259N557Q71n233l033K208J0041k91j0993m519m425k951L485r43
4231a2821Q497L013m927lj879m424L721L904K18k63K69P02j55p96R5N492k189
4214a546N817K231N78K066m091o314p869l832N744Q033K523p295o30k637J259
4199e963n592k720m25o000M235K013j376O723Q549N756J002q008r0R77J919j331
4183c31j781r493L206L439l317J295L134K54O747n14N675Q697q664l622O63k022
$$ plain form
4294 13668 13611 6412 8850 8541 4091 -3824 -4214 946 1612 896 1142 1951 5286 2635 204 -208 -7126
4277 -7126 -7046 -5065 1877 2414 5155 6971 1368 -4796 -6213 -5096 -4652 -6942 -6785 -6179 -100 4944
4261 4944 7360 3842 1865 -1452 1081 5348 1116 -1955 -2583 -4919 1600 1055 -2011 -4288 -1820
4246 -1820 -6854 -2595 2962 3833 -1400 -4433 -2225 7816 7525 -3468 -7987 -12412 -15363 -11878 -12821
4231 -12821 -4324 -1311 -6238 -6241 -8120 -12544 -8823 -4919 -4701 -4964 -4695 -3993 -4148 -4944 -4849 643 -1546
4214 -1546 4271 6502 7080 9146 5055 -1259 -9128 -12960 -7216 817 3340 -3955 -4585 -7222 -5963
4199 -5963 -11555 -14275 -14700 -20700 -16465 -14452 -15828 -9105 -556 5200 6202 -1806 -1896 -919 1000 -331
4183 -331 -2112 -11605 -8399 -4960 -8277 -6982 -3848 -3594 3153 2639 8314 17011 8347 4725 5388 3366
4167C366k933K46K498M629l260o619O61l864l147N700O535k157l796O309K019
4152F187k264q50p88n923k899m23L12k847M589Q157J779M347n584r166k224l263
4136a0860K863j63l789L4Q69o47L324M634J564r828J724N922n371o918R698K846
4120d098L181K270K571j822p708J318p8q27j702o234j301q33O348N437J768l17
4104b027j902q26K390l286n55L304k903p47K884M591j064R06R73O7L583n012o093
4087e717r89M972m92J787L608j851j725P46n198j791K850j534k942j578q31J917
4071h768K627J93M478p69J062N49L645O482J784m684n329O061N084n333o823k95
4055c6m389l819K465N723L93R54J836M536k774p472K582j32k583p08P611m056
$$ plain form
4167 3366 433 679 3177 7806 4546 -2073 -1412 -5276 -8423 -2723 3812 1655 -2141 4168 6187
4152 6187 3923 3073 2285 -3638 -6537 -6960 -6648 -9495 -4906 3251 5030 9377 3793 -5373 -7597 -10860
4136 -10860 -7997 -8160 -11949 -11915 -11046 -11693 -8369 -3735 -2171 -11999 -10275 -4353 -9724 -16642 -6944 -4098
4120 -4098 -917 1353 3924 2102 -5606 -4288 -4366 -5193 -6895 -13129 -14430 -15263 -8915 -3478 -1710 -2027
4104 -2027 -3929 -4755 -2365 -5651 -6206 -2902 -5805 -6552 -3668 923 -141 765 1738 1805 5388 376 -5717
4087 -5717 -6706 -1734 -2226 -439 3169 1318 -407 339 -4859 -6650 -3800 -5334 -8276 -9854 -10685 -8768
4071 -8768 -6141 -5948 -1470 -2239 -1177 -628 3017 9499 11283 6599 1270 7331 12415 7082 259 -36
4055 -36 -4425 -8244 -5779 -56 337 1291 3127 7663 4889 -2583 -1 -133 -2716 -3424 4187 131
4039A31o646J767R950p59j988r914R77L065k489q16Q15L075K231M08j685L118
4023A240P625K301l835o035m461n224k006L585Q338J0766J351n591j742O297p869
4008D740r083N898R310N177L646o584o968l287N85L551K630o054j658n960k465
3993f522l359J397J267O035M785L05j60M787M307m411n597Q40K547J1O11l888
3977B955Q1j097l342N07J840k219m465k403K578N32J805n80L191N664L57n048
3961C56R17P881j464L180l560j730L013m409o366m148j062J438K715m92N258L45
3945A872L732M897p69l483j208k450L829m986m510m391o311m57N706R583L57q007
3929f596Q58P756L893k52m697j371R07l047o578n97l132j822L213L675n82K948
$$ plain form
4039 131 -6515 -4748 5202 4443 2455 -7459 -6482 -3417 -5906 -6722 -5907 -2832 -601 -193 -1878 1240
4023 1240 8865 11166 7331 1296 -3165 -8389 -10395 -6810 1528 12294 13645 8054 6312 12609 4740
4008 4740 -4343 1555 10865 16042 19688 13104 6136 2849 3434 6985 9615 3561 1903 -4057 -6522
3993 -6522 -9881 -8484 -7217 -1182 3603 3908 3748 8535 12842 8431 2834 3674 6221 6232 6843 2955
3977 2955 3036 1939 -1403 -896 944 -1275 -5740 -8143 -5565 -5033 -3228 -3808 -617 5047 5404 356
3961 356 1273 9154 7690 10870 7310 5580 8593 4184 -2182 -6330 -7392 -5954 -3239 -3731 1527 1872
3945 1872 5604 10501 9732 6249 5041 2591 6420 1434 -3076 -7467 -13778 -14235 -8529 1054 1411 -6596
3929 -6596 -5738 2018 5911 5659 962 -409 498 -2549 -9127 -9724 -12856 -14678 -11465 -7790 -8372 -5424
3913e424N200K173L420L360o152l554n79K633L817l426J042J965M339n759j932
3898A123Q495l171o983L66j807J330J799j74K929K266m730k531m159k068M318
3883b997P175N24j0269m055j918K570M570K287L608J691L366o898o481L805j372
3868d394p229J775K593p91M703P386N925k576l613n40k006o280n574K201K760
$$ plain form
3913 -5424 -224 1949 5369 8729 2577 -977 -1556 1077 4894 1468 2510 4475 8814 3055 1123
3898 1123 9618 6447 -536 -170 -1977 -647 1152 978 3907 6173 1443 -1088 -5247 -7315 -2997
3883 -2997 4178 4702 -5567 -9622 -11540 -8970 -4400 -2113 1495 3186 6552 -346 -6827 -3022 -4394
3868 -4394 -11623 -9848 -7255 -8046 -3343 4043 9968 7392 3779 3239 1233 -5047 -10621 -8420 -5660
$$ [...]
##END NTUPLES=NMR SPECTRUM
##END=
