##TITLE=Analysis number 319517
Compound Code cc 05810
Project Code adrs
Chemist Name ugmt
##JCAMPDX= 6.0         $$ Bruker NMR JCAMP-DX V2.0
##DATA TYPE= NMR SPECTRUM
##DATA CLASS= NTUPLES
##ORIGIN= Bruker BioSpin GmbH
##OWNER= nmr
$$ XWIN-NMR		Version 3.5
$$ Wed May 17 14:35:30 2006 GMT Daylight Time (UT+1h)  MAYBRIDGE\nmr@NMR_250MHZ
##.OBSERVE FREQUENCY= 250.131544655141
##.OBSERVE NUCLEUS= ^1H
##.ACQUISITION MODE= SIMULTANEOUS (DQD)
##.ACQUISITION SCHEME= undefined
##.AVERAGES= 16
##.DIGITISER RES= 18
##SPECTROMETER/DATA SYSTEM= dpx250
##.PULSE SEQUENCE= zg30
##.SOLVENT NAME= CDCl3
##.SHIFT REFERENCE= (INTERNAL, CDCl3, 0, 16.522)
##AUDIT TRAIL= $$ (NUMBER, WHEN, WHO, WHERE, WHAT)
$$ ##TITLE= Audit trail, XWIN-NMR		Version 3.5
$$ ##JCAMPDX= 5.01
$$ ##ORIGIN= Bruker BioSpin GmbH
$$ ##OWNER= nmr
$$ C:\u/data/dgb/nmr/ADRS/4650/pdata/1/auditp.txt
$$ ##AUDIT TRAIL=  $$ (NUMBER, WHEN, WHO, WHERE, WHAT)
(   1,<2006-05-17 14:34:58.15 +100>,<MAYBRIDGE\nmr>,<NMR_250MHZ>,
      <created by zg, POWCHK disabled, PULCHK disabled
       configuration hash MD5:
       84 BC 41 DB A1 6E 1D 46 DA 25 12 A5 C1 ED C5 3A
       data hash MD5: 64K
       C9 5B 44 87 2C 9F 3B DC 9E 6A 8B CC 88 ED 32 10>)
(   2,<2006-05-17 14:35:18.31 +100>,<MAYBRIDGE\nmr>,<NMR_250MHZ>,
      <Start of raw data processing
       ef LB = 0.3 FT_mod = 6 PKNL = 1 SI = 32K 
       data hash MD5: 32K
       6C 78 F2 ED 2F 89 5E 3B 09 4D 6E DD 93 D4 6D 45>)
(   3,<2006-05-17 14:35:20.37 +100>,<MAYBRIDGE\nmr>,<NMR_250MHZ>,
      <apk 
       data hash MD5: 32K
       4C B5 9E 75 29 96 5F DE 7C DC 26 4D E8 7B 36 93>)
(   4,<2006-05-17 14:35:21.20 +100>,<MAYBRIDGE\nmr>,<NMR_250MHZ>,
      <abs ABSG = 5 
       data hash MD5: 32K
       BA 63 DD E8 9D 1F C0 17 39 DB 03 40 31 80 BB 22>)
$$ ##END=
$$ 
$$ hash MD5
$$ 44 E6 0A 2D CA 93 39 68 0F 4E 21 2D 0C 03 5E F5
##$RELAX= 
##$RELAX= 
##$RELAX= 
##$RELAX= 
##$RELAX= 
##$RELAX= 
##$RELAX= 
$$ Bruker specific parameters
$$ --------------------------
##$DU= <C:\u>
##$EXPNO= 4650
##$NAME= <ADRS>
##$PROCNO= 1
##$TYPE= <nmr>
##$USER= <dgb>
##$AMP= (0..31)
100 100 100 100 100 100 100 100 100 100 100 100 100 100 100 100 100 100 
100 100 100 100 100 100 100 100 100 100 100 100 100 100 
##$AQSEQ= 0
##$AQ_mod= 3
##$AUNM= <au_zg>
##$AUTOPOS= <43 >
##$BF1= 250.13
##$BF2= 250.13
##$BF3= 250.13
##$BF4= 250.13
##$BF5= 500.13
##$BF6= 500.13
##$BF7= 500.13
##$BF8= 500.13
##$BYTORDA= 1
##$CFDGTYP= 0
##$CFRGTYP= 5
##$CHEMSTR= <none>
##$CNST= (0..31)
1 1 145 1 1 1 1 1 1 1 1 1 1 1 1 1 1 1 1 1 1 1 1 1 1 1 1 1 1 1 1 1 
##$CPDPRG= <>
##$CPDPRG1= <>
##$CPDPRG2= <>
##$CPDPRG3= <>
##$CPDPRG4= <mlev>
##$CPDPRG5= <mlev>
##$CPDPRG6= <mlev>
##$CPDPRG7= <mlev>
##$CPDPRG8= <mlev>
##$CPDPRGB= <>
##$CPDPRGT= <>
##$D= (0..31)
0 1 0 0 0 0 0 0 0 0.06 0 0 0 0 0 0 0.0002 0 0 0 0 0 0 0 0 0 0 0 0 0 0 
0 
##$DATE= 1147872895
##$DBL= (0..7)
120 120 120 120 120 120 120 120 
##$DBP= (0..7)
150 150 150 150 150 150 150 150 
##$DBP07= 0
##$DBPNAM0= <>
##$DBPNAM1= <>
##$DBPNAM2= <>
##$DBPNAM3= <>
$$ [...]
##$SUBNAM7= <"">
##$SUBNAM8= <"">
##$SUBNAM9= <"">
##$SW= 20.6930455092707
##$SWIBOX= (0..15)
0 0 3 0 0 0 0 0 0 0 0 0 0 0 0 0 
##$SW_h= 5175.983436853
##$TD= 65536
##$TD0= 1
##$TE= 295.16
##$TE2= 300
##$TE3= 300
##$TEG= 300
##$TL= (0..7)
0 120 120 120 120 120 120 120 
##$TP= (0..7)
150 150 150 150 150 150 150 150 
##$TP07= 0
##$TPNAME0= <>
##$TPNAME1= <>
##$TPNAME2= <>
##$TPNAME3= <>
##$TPNAME4= <>
##$TPNAME5= <>
##$TPNAME6= <>
##$TPNAME7= <>
##$TPOAL= (0..7)
0.5 0.5 0.5 0.5 0.5 0.5 0.5 0.5 
##$TPOFFS= (0..7)
0 0 0 0 0 0 0 0 
##$TUNHIN= 0
##$TUNHOUT= 0
##$TUNXOUT= 0
##$USERA1= <user>
##$USERA2= <user>
##$USERA3= <user>
##$USERA4= <user>
##$USERA5= <user>
##$V9= 5
##$VALIST= <valist>
##$VCLIST= <CCCCCCCCCCCCCCC>
##$VD= 0
##$VDLIST= <DDDDDDDDDDDDDDD>
##$VPLIST= <PPPPPPPPPPPPPPP>
##$VTLIST= <TTTTTTTTTTTTTTT>
##$WBST= 1024
##$WBSW= 4
##$XGAIN= (0..3)
0 0 0 0 
##$XL= 0
##$YL= 0
##$YMAX_a= 497841
##$YMIN_a= -468785
##$ZGOPTNS= <>
##$ZL1= 120
##$ZL2= 120
##$ZL3= 120
##$ZL4= 120
##$ABSF1= 16.522
##$ABSF2= -4.171173
##$ABSG= 5
##$ABSL= 3
##$ALPHA= 0
##$AQORDER= 0
##$ASSFAC= 0
##$ASSFACI= 0
##$ASSFACX= 0
##$ASSWID= 0
##$AUNMP= <proc_1d>
##$AZFE= 0.1
##$AZFW= 0.1
##$BCFW= 0
##$BC_mod= 0
##$BYTORDP= 0
##$COROFFS= 0
##$CY= 12.5
##$DATMOD= 1
##$DC= 0
##$DFILT= <>
##$DTYPP= 0
##$F1P= 14.0000005364418
##$F2P= -0.99999901652339
##$FCOR= 0.5
##$FTSIZE= 32768
##$FT_mod= 6
##$GAMMA= 0
##$GB= 0
##$INTBC= 1
##$INTSCL= 1
##$ISEN= 128
##$LB= 0.3
##$LEV0= 0
##$LPBIN= 0
##$MAXI= 10000
##$MC2= 0
##$MEAN= 0
##$ME_mod= 0
##$MI= 0
##$NCOEF= 0
##$NC_proc= -2
##$NLEV= 6
##$NOISF1= 0
##$NOISF2= 0
##$NSP= 0
##$NTH_PI= 0
##$NZP= 0
##$OFFSET= 16.522
##$PC= 1
##$PHC0= 167.3525
##$PHC1= 2.137101
##$PH_mod= 1
##$PKNL= yes
##$PPARMOD= 0
##$PSCAL= 4
##$PSIGN= 0
##$REVERSE= no
##$SF= 250.13
##$SI= 32768
##$SIGF1= 0
##$SIGF2= 0
##$SINO= 400
##$SIOLD= 32768
##$SREGLST= <1H.CDCl3>
##$SSB= 0
##$STSI= 32768
##$STSR= 0
##$SW_p= 5175.98343685301
##$SYMM= 0
##$S_DEV= 0
##$TDeff= 65536
##$TDoff= 0
##$TI= <Analysis number 999999
Compound Code 99
Book Reference 9
Project Code 9>
##$TILT= no
##$TM1= 0
##$TM2= 0
##$TOPLEV= 0
##$USERP1= <user>
##$USERP2= <user>
##$USERP3= <user>
##$USERP4= <user>
##$USERP5= <user>
##$WDW= 1
##$XDIM= 32768
##$YMAX_p= 338351700
##$YMIN_p= -175189
$$ End of Bruker specific parameters
$$ ---------------------------------
##NTUPLES= NMR SPECTRUM
##VAR_NAME=  FREQUENCY,     SPECTRUM/REAL,   SPECTRUM/IMAG
##SYMBOL=    X,             R,               I
##VAR_TYPE=  INDEPENDENT,   DEPENDENT,       DEPENDENT
##VAR_FORM=  AFFN,          ASDF,            ASDF
##VAR_DIM=   32768,         32768,           32768
##UNITS=     HZ,            ARBITRARY UNITS, ARBITRARY UNITS
##FACTOR=    0.157963299565203, 1,           1
##FIRST=     4132.6476996994, 0,             0
##LAST=      -1043.33573715361, 0,           0
##MIN=       -1043.33573715361, -175189,     0
##MAX=       4132.6476996994, 338351700,     0
$$ Real data points
##PAGE= N=1
##DATA TABLE= (X++(R..R)), XYDATA
$$ [...]
17064A9818l590q355o695O219O993p2j336n613L371L163j0039l852J159j495n015
$$ 19818 16228 7873 1178 7397 14390 14318 12982 7369 10740 13903 3864 12 1171 -324 -5339
17049e339K775N921O040K551m018J480K622j51k622k816p05k224P96j325O06J314
$$ -5339 -2564 3357 9397 11948 7930 9410 12032 11881 9259 6443 5738 3514 4310 2985 3591 4905
17033D905j540J49l229r69q06K136n17j192l93M646J0599N008n151l897R03Q25
$$ 4905 3365 3514 285 -684 -1490 646 129 -1063 -1456 3190 13789 18797 13646 9749 10652 11477
17017A1477R8M680Q56k049j164k103r17J219m510p005k298m691r96K375L4N072
$$ 11477 11575 16255 17111 15062 13898 11795 10878 12097 7587 582 -1716 -6407 -7403 -5028 -4994 78
17001G8Q087r68J305o669P83Q849j961n06k74r747K70o81P363K956K758o041k560
$$ 78 8165 7197 8502 1833 2616 11465 9504 8998 8724 -1023 -753 -1434 5929 8885 11643 5602 3042
16984C042J922l263k64J781K842j339K677M02j782j1751j626J829l706L090O943
$$ 3042 4964 1701 1437 3218 6060 4721 7398 7800 6018 -5733 -7359 -5530 -9236 -6146 797
16969G97Q748r85j0333n716J371K181K020j05O460J104L91J753M665R11j0062
$$ 797 9545 8560 -1773 -7489 -6118 -3937 -1917 -2022 4438 5542 5933 7686 12351 13262 3200
16954C200j4399K092M650k984R120J2404n385k724n260M366L970J62r482l753
$$ 3200 -11199 -9107 -4457 -7441 1679 14083 8698 5974 714 5080 9050 9212 -270 -4023
16940d023j108L486Q98M87L957k80j437J586K92l822l275M02M047K868m92l418
$$ -4023 -5131 -1645 -747 -260 3697 3417 1980 3566 3858 36 -3239 -2837 1210 4078 3586 168
16924A68m05R44L821r215P73M465m18k032J415K130K011L600m2m305N56l894k79
$$ 168 -237 707 4528 -4687 -3914 551 133 -1899 -484 1646 3657 7257 7215 2910 3466 -428 -707
16907g07j047q5R37M48o979O68n861K901L655m47J234J566j930L844L684k619
$$ -707 -1754 -1839 -902 -454 -7433 -6765 -12626 -9725 -6070 -6517 -5283 -3717 -5647 -1803 1881 -738
16891g38k605q799L163J1687K217p237n372O272J0212j92n477p737K574m26l869
$$ -738 -3343 -12142 -8979 2708 4925 -2312 -7684 -1412 8800 8608 3131 -4606 -2032 -2458 -6327
16876f327j85K123K141K645K057j154j583n719r39L80j443l339n751J2531L707
$$ -6327 -6512 -4389 -2248 397 2454 1300 -283 -6002 -6941 -6561 -8004 -11343 -17094 -4563 -856
16861h56p627m108L173J715k097O353M067J815k669j424m117N04N850m291l399
$$ -856 -8483 -12591 -9418 -7703 -9800 -3447 620 2435 -234 -1658 -5775 -5271 579 -3712 -7111
16846g111N676J909L994p368L627N299j862j460J445j976m936j289M640J057L55
$$ -7111 -1435 474 4468 -2900 727 6026 4164 2704 4149 2173 -2763 -4052 588 1645 2000
16831B000J855J01j689k132k341l674m838n929M260M76J45L670j970J791O908
$$ 2000 3855 3956 2267 135 -2206 -5880 -10718 -16647 -12387 -11911 -11766 -8096 -10066 -8275 -1367
16816a367j541o334P246P184J047n271o462q492L07P140N424R36k298j95O392
$$ -1367 -2908 -9242 -1996 5188 6235 964 -5498 -13990 -13683 -6543 -1119 -183 -2481 -2676 3716
16801C716M209k65K22q553k312J466M792M811J592n231r14L84q144j739M489K40
$$ 3716 7925 7660 7882 -671 -2983 -1517 3275 8086 9678 4447 3533 3917 -4227 -5966 -1477 -1237
16785a237L157o750p593l089Q986Q053K344k752J855k1k132L106L041k334L546
$$ -1237 1920 -4830 -12423 -15512 -6526 1527 3871 1119 2974 2953 821 3927 6968 4634 8180
16770H180P469k956j087M06l350p91r82m514N35L357m636o202j957N13n916J557
$$ 8180 15649 12693 11606 12012 8662 7871 6889 2375 2910 6267 1631 -4571 -6528 -6015 -11931 -10374
16754a0374M429l623o922M431M284M15j535Q33L775M26m195O54m497O191J1137
$$ -10374 -5945 -9568 -16490 -12059 -7775 -7360 -8895 -8062 -4287 -3861 -8056 -7402 -11899 -5708 5429
16739E429l783j2234l779M061M358O969n551q95o16m180O066O21j078K590R36
$$ 5429 1646 -10588 -14367 -10306 -5948 1021 -4530 -5425 -6041 -10221 -4155 -3534 -4612 -2022 -1086
16724a086j973k059P651L823n735J328j276J860m997m378J074M066j30K05l389
$$ -1086 -3059 -5118 2533 6356 621 1949 673 2533 -2464 -6842 -5768 -1702 -1832 -1627 -5016
16709e016n209K450N734L986Q06J75J572k879k290J079k888K216m75j555L21j581
$$ -5016 -10225 -7775 -2041 1945 2751 2926 4498 1619 -671 408 -2480 -264 -739 -2294 -1973 -3554
16693c554k092M894l09N883M807j045j411m851j79m819m813m250K399N224j818
$$ -3554 -5646 -752 -1061 4822 9629 8584 7173 2322 2143 -2676 -7489 -11739 -9340 -4116 -5934
16678e934m876M64K142m00K997P843L915m156n520J575l111j176J829K562n297
$$ -5934 -10810 -10346 -8204 -8604 -5607 2236 6151 1995 -3525 -1950 -5061 -6237 -4408 -1846 -7143
16663g143j807P393k585m30P990K609L928l712k779K504j502R00n470o870l662
$$ -7143 -8950 -1557 -4142 -4572 3418 6027 9955 6243 3464 5968 4466 5366 -104 -6974 -10636
16648a0636l303l461N9j249M235M273M316L961J132K240k346j797j1349k609J9
$$ -10636 -13939 -17400 -17341 -18590 -14355 -10082 -5766 -1805 -673 1567 -779 -2576 -13925 -16534 -16515
16633a6515Q090Q516p930k822O333j638o198k814L346P249J205m530j086N775
$$ -16515 -8425 91 -7839 -10661 -4328 -5966 -12164 -14978 -11632 -4383 -3178 -7708 -8794 -3019
16619c019N50m955l436l03K82L97K011m616j342P696P73j14J445Q04L117N967
$$ -3019 -2469 -7424 -10860 -11163 -10881 -10484 -8473 -13089 -14431 -6735 -5962 -6076 -4631 -3827 -710 5257
16603E257M562o29k450l258m937K875L703m379J224L624O480M996o628J819j083
$$ 5257 9819 9190 6740 3482 -1455 1420 5123 744 1968 5592 12072 17068 10440 12259 11176
16588A1176o015m90L568P591m87o562k763N27J67M06j440j954L138j848p004L558
$$ 11176 5161 4671 8239 15830 15343 8781 6018 6545 6712 7118 5678 3724 6862 5014 -1990 1568
16572A568Q95j518J093m92m999k184N569R2l463n38M06K783l3J749J821L690N087
$$ 1568 2463 945 2038 1546 -3453 -5637 -68 24 -3439 -3977 -3571 -788 -821 928 2749 6439 11526
16555A1526k332m587o712q704L876L323m111m046q01K873L783K216j275o87q99
$$ 11526 9194 4607 -2105 -10809 -6933 -3610 -7721 -11767 -12568 -9695 -5912 -3696 -4971 -5658 -6557
16540f557L076K107m923L701l155J72N129R29l484o604j791J994M527k201l48
$$ -6557 -3481 -1374 -6297 -2596 -5751 -5579 -450 479 -3005 -9609 -11400 -9406 -4879 -7080 -7428
16525g428K012K144l103q670p267M1N007O993j651k937L932J924J932P368n73
$$ -7428 -5416 -3272 -6375 -15045 -22312 -22271 -17264 -10271 -11922 -14859 -10927 -9003 -7071 297 -276
16510b76n391M153k007M374L673o007M11J454k349l822k912K785M26M429k400
$$ -276 -5667 -1514 -3521 853 4526 -1481 -1070 384 -1965 -5787 -8699 -5914 -5488 -1059 -3459
16495c459r3j080R976L607L202K812j1235j293k561K625J862j2049j0382j39L79
$$ -3459 -3552 -4632 5344 8951 12153 14965 3730 2437 -124 2501 4363 -7686 -18068 -18207 -17828
16480a7828L173Q89P270K307J0254q01o215o59M251l371K007N910N283m116n800
$$ -17828 -14655 -13766 -6496 -4189 6065 5264 -951 -1610 2641 -730 1277 7187 12470 8354 2554
16465B554k140L270J758l459o006q350j165J521J0029J497J091N357j168L62K950
$$ 2554 414 3684 5442 1983 -4023 -12373 -13538 -12017 -1988 -491 600 5957 4789 5151 8101
16450H101l084J658N556k8m630r542J685K317k136J072L432K64k212o41J490m090
$$ 8101 5017 6675 12231 12203 7573 -1969 -284 2033 -103 969 4401 4665 2453 1812 3302 -788
16434g88k287n697j619Q585j089l941N149R752N76n954o453l945M223K348M654
$$ -788 -3075 -8772 -10391 -1806 -2895 -6836 -1687 8065 8641 2687 -3766 -7711 -3488 -1140 3514
16419C514M371o093j0004j0241L970K893M873M056j968P189M942m386q872n656
$$ 3514 7885 1792 -8212 -18453 -14483 -11590 -6717 -2661 -4629 2560 7502 3116 -5756 -11412
16405a1412m006K390R225m883m529J0609n8j373L495j505o787n794l740O384R987
$$ -11412 -15418 -13028 -3803 -8686 -13215 -2606 -2664 -4037 -542 -2047 -8834 -14628 -18368 -11984 -1997
16390a997L437J865P193L784j105n52m108m223r602q190K114N782l98k353O917
$$ -1997 1440 3305 10498 14282 13177 12625 8517 4294 -5308 -13498 -11384 -5602 -6000 -8353 -1436
16375a436l135J34o265n719k891M249P080M435O039M744j359J267j737n06L106
$$ -1436 -4571 -4437 -10702 -16421 -19312 -15063 -7983 -3548 2491 7235 5876 7143 5406 4900 8006
16360H006k474q132k905L172k495M78K034o859L368R031J426o512l192k089P513
$$ 8006 5532 -2600 -5505 -2333 -4828 -4350 -2316 -9175 -5807 3224 4650 -1862 -5054 -7143 370
16345C70k19q36j221l14n056n945P25M747n956q33J416r83Q550M677N93J979n843
$$ 370 151 -685 -1906 -2220 -7276 -13221 -12496 -7749 -13705 -14538 -13122 -14105 -5555 -878 -285 1694 -4149
16328d149k782r67L844K164Q10r619K461M902J899k868m009k49O649O807l429
$$ -4149 -6931 -7898 -4054 -1890 -1080 -10699 -8238 -3336 -1437 -4305 -8314 -8563 -1914 4893 1464
16313A464l049J855M847n767l632K637l271l939K921M04J375N031r52j942J146
$$ 1464 -1585 270 5117 -650 -4282 -1645 -4916 -8855 -5934 -5530 -4155 876 -76 -2018 -872
16298h72L12j894J677k897j421K750l553j870m204K725K636K555M194q842m072
$$ -872 -560 -2454 -777 -3674 -5095 -2345 -5898 -7768 -11972 -9247 -6611 -4056 138 -8704 -12776
16283a2776J604P377L843J723m394L33O012J861o25k84o183o31L462L680k926
$$ -12776 -11172 -3795 48 1771 -2623 -2290 3722 5583 4958 4674 -1509 -2140 1322 5002 2076
16268B076m967Q250M812p301K050L739p461n945L890O536k66l718o16k590J65
$$ 2076 -2891 5359 10171 2870 4920 8659 1198 -4747 -857 5679 5413 1695 1079 -1511 -1346
16253a346j339o750k439p59q93O42r36Q922M177J725K970n762j759O241k4J037
$$ -1346 -2685 -9435 -11874 -12633 -13526 -12884 -13820 -4898 -721 1004 3974 -1788 -3547 2694 2670 3707
16237C707m25j851n705j25l085m692k388J781P318K068L463L790J901j260L968
$$ 3707 3282 1431 -4274 -4399 -7484 -12176 -14564 -12783 -5465 -3397 66 3856 5757 4497 8465
16222H465j721l961k971j114m96K631l560j081k190j336M211N997m212o072n35
$$ 8465 6744 2783 -188 -1302 -1798 833 -2727 -3808 -5998 -7334 -3123 2874 -1338 -7410 -7945
16207g945O059M763k371J997J878l883r10o037j610L172j33n240j210L103K836
$$ -7945 -1886 2877 506 2503 4381 498 -412 -6449 -8059 -4887 -5020 -10260 -11470 -8367 -5531
16192e531l94l547M31P154N67j383o010l769j218O769P289N637k919j1262j814
$$ -5531 -5925 -9472 -9041 -1887 -1320 -2703 -8713 -12482 -13700 -6931 358 5995 3076 -8186 -10000
16177a0000P019L637N3L682O29n381n593M187N729k937M267n06o841R65Q417j262
$$ -10000 -2981 656 709 4391 5020 -361 -5954 -1767 3962 1025 5292 4786 -2055 -1090 7327 6065
16161F065j199K394O474l123j5265m006Q53k941K646M938J198j758L499Q762K499
$$ 6065 4866 7260 13734 10611 -4654 -8660 -7807 -10748 -8102 -3164 -1966 -3724 -225 8537 11036
16146A1036k359r822n609o664J918P065P54R05n948l80J568L867L08J4M580J075
$$ 11036 8677 -1145 -6754 -13418 -11500 -4435 -3681 -2776 -8724 -9104 -7536 -3669 -3361 -3347 1233 2308
16130B308K760m136k317j238L066L927k673J3N586l831l454J460O367O665m227
$$ 2308 5068 932 -1385 -2623 443 4370 1697 1710 7296 3465 11 1471 7838 14503 10276
16115A0276m413l230o83o169O543P346K21M93k375O084k995j0172J171m71k818
$$ 10276 5863 2633 1950 -4219 2324 9670 9891 10384 8009 14093 11098 926 2097 1626 -1192
16100a192J037O245q69k034n006j796n296k813r9J337O660r83k122L126J83Q026
$$ -1192 -155 6090 5221 3187 -1819 -3615 -8911 -11724 -11823 -10486 -3826 -4809 -6931 -3805 -3622 4404
16084D404L581r512m726K951j440K365O728m362Q28O65j039k883K128J246P81
$$ 4404 7985 -1527 -6253 -3302 -4742 -2377 4351 -11 817 1482 443 -2440 -312 934 1715
16069A715j124J100r48j183P078L337k345k070l465q34P11k256k366j479l235
$$ 1715 591 1691 743 -440 6638 9975 7630 5560 2095 1261 1972 -284 -2650 -4129 -7364
16054g364N219n38m647l326O377L501o411n501K734K050k982P16M897k154k960
$$ -7364 -2145 -2683 -7330 -10656 -4279 -778 -7189 -12690 -9956 -7906 -10888 -10172 -5275 -7429 -10389
16039a0389n019P93J2483P542J279m053j785o503M402M040l278k348k233O326
$$ -10389 -15408 -14615 -2132 5410 6689 2636 851 -5652 -1250 2790 -488 -2836 -5069 1257
16025A257J719j494m198K390o54o292O058j596j164q61p330R43K280O420O212
$$ 1257 2976 1482 -2716 -326 -980 -7272 -1214 -2810 -3974 -4835 -12165 -11222 -8942 -2522 3690
16010C690r45p73k531n172n406M430O342K793l550k960n712M086M297j782k647
$$ 3690 2745 1972 -559 -5731 -11137 -6707 -365 2428 -1122 -4082 -9794 -5708 -1411 -3193 -5840
15995e840l600K868j747O632L882J506O156k515j0790j313M259L955P47q534L602
$$ -5840 -9440 -6572 -8319 -1687 2195 3701 9857 7342 -3448 -4761 -502 3453 4200 -4334 -732
15980g32O87k695m419l856p04R084J0565L435n700m222L595r26J81L136q764L45
$$ -732 -45 -2740 -7159 -11015 -11719 -2635 7930 11365 5665 1443 5038 4112 4293 7429 -1335 -990
15964i90J11J753j942n95J0524m982n200k967j54N131j325j322P737M757r416
$$ -990 -879 874 -1068 -1663 8861 3879 -1321 -4288 -4442 689 -636 -1958 5779 10536 1120
15949A120k86m454l290P71L956N348J506j536q885O61K315L069J0378K831q832
$$ 1120 834 -3620 -6910 -6139 -2183 3165 4671 3135 -5750 -5089 -2774 295 10673 13504 4672
15934D672k150k15O032r761q657J119K305N157j711j687J288L18k23M17m86P880
$$ 4672 2522 2307 8339 -1422 -10079 -8960 -6655 -1498 -3209 -4896 -3608 -3290 -3513 -3096 -3582 4298
15918D298n020j602k79R44p870j659j449Q0L435L981N808p978l446R546M327n392
$$ 4298 -722 -2324 -2603 -1659 -9529 -11188 -12637 -12557 -9122 -5141 667 -7311 -10757 -1211 3116 -2276
15902b276M164j551n983J629J09J170k248N375n04J577m769p27K447q751L597
$$ -2276 1888 337 -5646 -4017 -3908 -2738 -4986 389 -115 1462 -3307 -4034 -1587 -10338 -6741
15887f741O064j465J084j195J00N854J234N99q853n522M513J731L598J581m722
$$ -6741 -677 -2142 -1058 -2253 -2153 3701 4935 5534 -3319 -8841 -4328 -2597 1001 2582 -2140
15872b140k325J623L068j772J409r93n124k548j4p19J889J3214P317n512q800
$$ -2140 -4465 -2842 226 -1546 -137 -1130 -6254 -8802 -8816 -9535 -7646 5568 12885 7373 -1427
15857a427q184k909N358O130m39l680K081M618M48R31O15l402L597k229L553J420
$$ -1427 -9611 -12520 -7162 -1032 -1471 -5151 -3070 1548 1996 2927 3542 140 3737 1508 5061 6481
15841F481j0873K49O961M400J016l447l861j337k151m01K341m819l188J119L299
$$ 6481 -4392 -4143 2818 7218 8234 4787 926 -411 -2562 -2963 -622 -5441 -8629 -7510 -4211
15826d211j731m457R00j140j005Q47j395N285Q623q18L40M006P329N99j4878k718
$$ -4211 -5942 -10399 -9499 -10639 -11644 -10797 -12192 -6907 1716 898 1238 5244 12573 13172 -1706 -4424
15810d424M099R230j644m890m233j352J867k40k655L541J0147R78n152k569O165
$$ -4424 -325 8905 7261 2371 -1862 -3214 -1347 -1587 -4242 -701 9446 10424 5272 2703 8868
15795H868k202r149n145j515L083J90R957j749J007J0289m002k161K315j141P56
$$ 8868 6666 -2483 -7628 -9143 -6060 -5870 4087 2338 3345 13634 9632 7471 9786 8645 9401
15780I401k07l116M396j834m98o539m104j285K183L00m06p06l072l220j310m26
$$ 9401 9194 6078 10474 8640 8142 1603 -2501 -3786 -1603 -1303 -1709 -2415 -5487 -8707 -10017 -10443
15764a0443J780R552k879n256L96Q723N141k549l667k110m371o046Q95j306k631
$$ -10443 -8663 889 -1990 -7246 -6850 1873 7014 4465 798 -1312 -5683 -11729 -10834 -12140 -14771
15749a4771l934K100K642L497L318M26K978k400O37K951j857ko27M28P279L913
$$ -14771 -18705 -16605 -13963 -10466 -7148 -6722 -3744 -6144 -5507 -2556 -4413 -4415 -5042 -4614 2665 6578
15733F578j927J188n07m463l744q305j0286L544R551M130P922k226l53l562k804
$$ 6578 4651 5839 5332 869 -2875 -11180 -21466 -17922 -8371 -4241 3681 1455 1102 -2460 -5264
15718e264l682N582j958o611L614N813N113q2n199o859K230M210M546J705m527
$$ -5264 -8946 -3364 -5322 -11933 -8319 -2506 2607 2525 -2674 -9533 -7303 -3093 1453 3158 -1369
15703a369J487r37L322K265M309J56j357n828l784m034k227K184L606P40m28m364
$$ -1369 118 -819 2503 4768 9077 9233 7876 2048 -1736 -5770 -7997 -5813 -2207 -1467 -1895 -6259
15687f259j406J129j722n78N555P508M271M628L900m114l540l081m320m845J264
$$ -6259 -7665 -6536 -8258 -8836 -3281 4227 8498 13126 17026 12912 9372 6291 1971 -2874 -1610
15672a610O291O098l65J682l345m815p432p185J048l228N445J0163R379k879N214
$$ -1610 4681 10779 10414 12096 8751 3936 -3496 -10681 -9633 -12861 -7416 2747 12126 9247 14461
15657A4461m745j1872r778K384J174K623J18K729Q617k047j1250l095k552N224
$$ 14461 9716 -2156 -11934 -9550 -8376 -5753 -5635 -2906 5711 3664 -7586 -10681 -13233 -8009
15643h009m386j188L38J2104R994m852K44o17m589k280m292J878J507o791R58
$$ -8009 -12395 -13583 -13245 -1141 8853 4001 4245 3628 -961 -3241 -7533 -5655 -4148 -10939 -9981
15628i981L762m235l218Q134K347m191j244j463j200K822K094l300K326O402j908
$$ -9981 -6219 -10454 -13672 -5538 -3191 -7382 -8626 -10089 -11289 -8467 -6373 -9673 -7347 -945 -2853
15613b853l430o87m565Q947N075o40K367P50r6k891o034k698J13q43o17M141J751
$$ -2853 -6283 -6970 -11535 -2588 2487 1847 4214 4964 4868 1977 -4057 -6755 -6642 -7485 -8102 -3961 -2210
15596b210K077K172P67n844r0O534Q189j54k748l229k969j361o847l454n292K620
$$ -2210 -133 2039 2806 -3038 -3128 3406 11595 11441 8693 5464 2495 1134 -5713 -9167 -14459 -11839
15580a1839j90q05L884R651j849m459L503j227l464O06J15L717J9K721j769r007
$$ -11839 -12029 -12834 -8950 701 -1148 -5607 -2104 -3331 -6795 -6189 -6074 -2357 -2338 383 -1386 -10393
15564a0393K047R67K193N43n691r071L123L590Q942j008n519R58M964R53p09n375
$$ -10393 -8346 -7379 -5186 -4643 -10334 -19405 -16282 -12692 -3750 -4758 -10277 -9319 -4355 -3402 -4111 -9486
15548i486k573m965k787R427J986o64J520l171L144R59j155J921J83m707j171
$$ -9486 -12059 -17024 -19811 -10384 -8398 -9062 -7542 -10713 -7569 -6610 -7765 -5844 -5661 -10368 -11539
15533a1539L314J430J605M373j416p50L116L624m684j055l218n299j639K11K248
$$ -11539 -8225 -6795 -5190 -817 -2233 -2983 133 3757 -927 -1982 -5200 -10499 -12138 -11927 -9679
15518i679J0401L845l348K187l403P66O058J333p10j871k406L36m42k33J771j683
$$ -9679 722 4567 1219 3406 3 769 6827 8160 7450 5579 3173 3509 3067 2834 4605 2922
15502B922K090n792J160j624l621n4O196m004j826L433k795j089O537M974L632
$$ 2922 5012 -780 380 -1244 -4865 -4919 1277 -2727 -4553 -1120 -3915 -5004 1533 6507 10139
15487A0139l744m031J1519R842j279p559o326m451J57j842k59j352n305l346j059
$$ 10139 6395 2364 13883 23725 22446 14887 8561 4110 4267 2425 2166 814 -4491 -7837 -8896
15472h896n36K588p50o059K267O221Q027K456n370k073J128k402M493J0669M271
$$ -8896 -9432 -6844 -7594 -13653 -11386 -5165 2862 5318 -52 -2125 -997 -3399 1094 11763 16034
15457A6034j0607o970M358M686j416r67R93K722L569p28l414m689L018P358k895
$$ 16034 5427 -1543 2815 7501 6085 5118 6111 8833 12402 11674 8260 3571 6589 13947 11052
15442A1052r358m865j485M048L251L55k967l119q951R17R049P50L372M135L191
$$ 11052 1694 -3171 -4656 -608 2643 2998 31 -3088 -12039 -11122 -2073 -1323 2049 6184 9375
15427I375r750j0321J249J2197K601k568L008N22m588o796k906N811P464j998
$$ 9375 -375 -10696 -9447 2750 5351 2783 5791 6313 1725 -5071 -7977 -2166 5298 3300
15413C300o295k32j193l166p262j078K027k754J12O721K318R052M702n15j781
$$ 3300 -2995 -3227 -4420 -7586 -14848 -15926 -13899 -16653 -16541 -9820 -7502 1550 6252 5737 3956
15398C956k410J619L756j169p025l143L333L193J647J818P11J503p385K119P647
$$ 3956 1546 3165 6921 5752 -1273 -4416 -1083 2110 3757 5575 6286 7789 404 2523 10170
15383A0170p43n508n300k152Rl953J215k758l14N707K115J327n85L1l516p867
$$ 10170 9427 3919 -1381 -3533 -3524 -7477 -6262 -9020 -9334 -3627 -1512 -185 -770 -739 -4255 -12122
15367a2122p50K618L339q9M739L029k149J86K759K908K463N44j822n200o964O635
$$ -12122 -12872 -10254 -6915 -7004 -2265 764 -1385 -1199 1560 4468 6931 7475 5653 453 -6511 124
15351A24O482n743j821k958o65P195M396l139o567L99m220R2O790N233L08l965
$$ 124 6606 863 -958 -3916 -4581 2614 7010 3871 -2696 -2297 -6517 -6425 365 5598 5906 1941
15335A941n91p120n105N392L943N123L4p582l196M759J716l067K012n304j749
$$ 1941 1350 -5770 -10875 -5483 -1540 3583 3617 -3965 -7161 -2402 -686 -3753 -1741 -7045 -8794
15320h794O863L664l03K271K394n208J629J504m094p304p94J059j429n775J378
$$ -8794 -1931 1733 1430 3701 6095 887 2516 4020 -74 -7378 -8172 -7113 -8542 -14317 -12939
15305a2939M190l73J649Q776P235l665q334m635j619L978L564L043j663k502q866
$$ -12939 -8749 -9122 -7473 1303 8538 4873 -3461 -8096 -9715 -5737 -2173 870 -793 -3295 -12161
15290a2161O384L702k50Q600O93j0531p394l18P31M206n162j0339n728j466R465
$$ -12161 -5777 -2075 -2325 6275 6968 -3563 -10957 -11275 -10544 -6338 -11500 -21839 -27567 -29033 -19568
15275a9568O528P714k134K440k133k882K045J162K104j404k293K735M199l200
$$ -19568 -13040 -5326 -7460 -5020 -7153 -10035 -7990 -6828 -4724 -6128 -8421 -5686 -1487 -4687
15261d687l052J86q66n85J644M135L446k031l41m96K724l642o64J23K461N971
$$ -4687 -7739 -7553 -8419 -9004 -7360 -3225 221 -1810 -2151 -2647 77 -3565 -4229 -4106 -1645 4326
15245D326j504q629j463L715P477L547J761m617k694M780L654m855n999L318Q358
$$ 4326 2822 -5807 -7270 -3555 3922 7469 9230 4613 1919 6699 10353 5498 -501 2817 11175
15230A1175M317m509p594o123l378L58J393o112j018K169o190o300O252O462O337
$$ 11175 15492 10983 3389 -2734 -6112 -5754 -4361 -10473 -11491 -9322 -15512 -21812 -15560 -9098 -2761
15215b761P965M732l540p884p330j912L521j485Q734L965m642l057J241K355N666
$$ -2761 5204 9936 6396 -1488 -8818 -10730 -7209 -8694 40 4005 -637 -3694 -2453 -98 5568
15200E568m022j43J33q99n19n580J276L217M369p805L361K939j853L858n442p448
$$ 5568 1546 1403 1536 637 118 -5462 -4186 -969 3400 -4405 -1044 1895 42 3900 -1542 -8990
15184h990m548n12N5k077K505K552M379K659L191L033K726o383p833l326J06j348
$$ -8990 -13538 -14050 -13995 -16072 -13567 -11015 -6636 -3977 -786 2247 4973 -1410 -9243 -12569 -12463 -13811
15168a3811L111Q185M880M669j995j125M032K44j001k821L21J773L220N478J233
$$ -13811 -10700 -2515 2365 7034 5039 3914 7946 8190 7189 4368 4689 6462 9682 15160 16393
15153A6393q080m124J665J11q56j370K547n352m62j94O290L494r862l229K423
$$ 16393 8313 4189 5854 5965 5109 3739 6286 934 472 278 6568 10062 200 -3029 -606
15138f06K644r99r45J920j375k569o355Q81J107m529K171k99J034P562J0118K041
$$ -606 2038 1039 94 2014 639 -1930 -8285 -7404 -6297 -10826 -8655 -8954 -7920 -358 9760 11801
15122A1801q88k320n432J252M039J305N24j404l140o900n092j747k722M823R4
$$ 11801 10913 8593 3161 4413 8452 9757 10281 8877 5737 -1163 -6255 -8002 -10724 -5901 -5807
15107e807o660L74J538J284P300M556J443q89L164r605p640R39Q512O756J308
$$ -5807 -12467 -12093 -10555 -9271 -1971 2585 4028 3139 6303 -3302 -10942 -10003 -1491 5265 6573
15092F573o967l540j762j037l930P19L958j4K911j390j315j296K745J132J340
$$ 6573 -394 -3934 -5696 -6733 -10663 -9944 -5986 -6000 -3089 -4479 -5794 -7090 -4345 -3213 -1873
15077a873m734l071k058j450M598M373J447j834M544L074K971k906o85M6n204
$$ -1873 -6607 -9678 -11736 -13186 -8588 -4215 -2768 -4602 -58 3016 5987 3081 2396 2442 -2762
15062b762l739q61l15q936N300M934p371m414J097R181M321k52L025l670r696
$$ -2762 -6501 -7362 -7677 -16613 -11313 -6379 -13750 -18164 -17067 -7886 -3565 -3817 -792 -4462 -14158
15047a4158j1J0988J62k776N472k838k28K040k325K133P27l814o033j23R517K571
$$ -14158 -14169 -3181 -3019 -5795 -323 -3161 -3389 -1349 -3674 -1541 -814 -4628 -10661 -10784 -1267 1304
15031A304L509M548r53m92p890p442o613O0L440K095N73K970o20p91L122r7l940
$$ 1304 4813 9361 8408 7916 26 -7416 -14029 -13969 -10529 -8434 -7861 -4891 -5511 -6302 -3180 -3277 -7217
15014g217J122L149n64R179K123k249l029k827j895l440m1N96N064q421o514J72
$$ -7217 -6095 -2946 -3510 5669 7792 5543 2514 -313 -2208 -5648 -5689 -5093 -29 -8450 -14964 -14792
14998a4792o767J612J4952Q088q37K088n482l299K250J635n94m241m78l294n135
$$ -14792 -21559 -19947 -4995 3093 2256 4344 -1138 -4437 -2187 -552 -1146 -5387 -5865 -9159 -14294
14983a4294r68O520R998P045M135m379k215l468m293J280L452O09o958j864k398
$$ -14294 -15262 -8742 1256 8301 12436 8057 5842 2374 -1919 -639 2813 3422 -3536 -5400 -7798
14968g798N76l831M371N917N160l265J012L237k458n925L038N73k578K391O04
$$ -7798 -7222 -11053 -6682 -765 4395 1130 2142 5379 2921 -3004 34 607 -1971 420 1024
14953A024J187m916m587K356R032j8o666o91M78l086L066J657J725j961p623o419
$$ 1024 2211 -2705 -7292 -4936 4096 4078 -2588 -3279 -2801 -5887 -2821 -1164 561 -1400 -9023 -15442
14937a5442j081L22L027P306L204K679j077k166P02l650q031j789k32N125J317
$$ -15442 -16523 -16201 -13174 -5868 -2664 15 -1062 -3228 -2526 -6176 -14207 -15996 -16228 -11103 -9786
14922i786L163K0m343L957P275o066j865J687p15r35L838m893J245J875Q76m54
$$ -9786 -6623 -6603 -10946 -6989 286 -5780 -7645 -5958 -6673 -7608 -3770 -8663 -7418 -5543 -4667 -5121
14906e121J315j376q72K05M333m051o281k229L99N521R124Q49L064j761j407N426
$$ -5121 -3806 -5182 -6054 -5849 -1516 -5567 -11848 -14077 -13678 -8157 967 1816 4880 3119 1712 7138
14890G138J1257J582p006l693n591J156n02n571J641j615l428r62p586L94j621
$$ 7138 18395 19977 12971 9278 3687 4843 4341 -1230 411 -1204 -4632 -5594 -13180 -12786 -14407
14875a4407k33l744Q744P267q182l326J717Q789N281N917l662n447K575k830r16
$$ -14407 -14640 -18384 -9640 -2373 -10555 -13881 -12164 -3375 1906 7823 4161 -1286 1289 -1541 -2457
14860b457L415j929N895M64q983L145j112q332K904R367k850m83m030j645N388
$$ -2457 958 -971 4924 5388 -3595 -450 -1562 -9894 -6990 2377 -473 -956 -4986 -6631 -1243
14845a243K77O957K716l281p437p413l326L424J0455J022k238l624k54j865N712
$$ -1243 -966 5991 8707 5426 -2011 -9424 -12750 -9326 1129 2151 -87 -3711 -3965 -5830 -118
14830a18J1115J956l73n264O04o222j279O569q46m880J619O27M159M253n381p223
$$ -118 10997 12953 12580 7316 7920 1698 419 6988 6142 1262 2881 3508 7667 11920 6539 -684
14814f84Q57L737r193m366L368k330J29J849O222K4k12j104m946l601l24P489
$$ -684 173 3910 -5283 -9649 -6281 -8611 -8482 -6633 -411 -387 -599 -1703 -6649 -10250 -10574 -3085
14798c085K839L230k78j377J140k547k052M344L721j342r457j512L534j925k150
$$ -3085 -246 2984 2706 1329 2469 -78 -2130 2214 5935 4593 -4864 -6376 -2842 -4767 -6917
14783f917j252j484P137M31j695m90l17J191J804P40m99l782j909M663M770Q03
$$ -6917 -8169 -9653 -2516 -2085 -3780 -4270 -4587 -3396 -1592 -852 -1351 -5133 -7042 -2379 2391 3194
14767C194k043l927j017Q549k678p293n401j95N729M950L728m947o986m89L789
$$ 3194 1151 -2776 -3793 4756 2078 -5215 -10616 -10811 -5082 -132 3596 -1351 -8337 -8826 -5037
14752e037o991m581j303O003R117k247m098k145K741O148L987o047l076o18l471
$$ -5037 -12028 -16609 -17912 -11909 -2792 -5039 -9137 -11282 -8541 -2393 1594 -4453 -7529 -8147 -11618
14737a1618K496j273M863J446J466K922K587k789L144K946M441J135l268n497
$$ -11618 -9122 -10395 -5532 -4086 -2620 302 2889 100 3244 6190 10631 11766 8498 3001
14723C001m931l936M641K145L622K974p447j70R04n017l925P841P772N780J498
$$ 3001 -1930 -5866 -1225 920 4542 7516 69 -101 803 -4214 -8139 -298 7474 13254 14752
14708A4752q862k097N69K642l76k270j046j089m405k315K659N224K613n903L38
$$ 14752 5890 3793 4362 7004 6628 4358 3312 2223 -2182 -4497 -1838 3386 5999 96 434
14693D34K648j488n385j572J574Q652N08p406m02l159k401J417r74k253Q32k888
$$ 434 3082 1594 -3791 -5363 -3789 4863 5371 -2035 -2437 -5596 -7997 -6580 -7554 -9807 -8975 -11863
14677a1863n15J42L451l777M630K620J391N409K312J518P64J805N138J002m823
$$ -11863 -12378 -12236 -8785 -12562 -7932 -5312 -3921 1488 3800 5318 6082 7887 13025 14027 9204
14662I204r94o227j256Q61r78p249j96M247k25k462o765M982J2648L522j389p611
$$ 9204 8210 1983 727 1588 610 -6639 -6835 -2588 -2813 -5275 -12040 -7058 5590 9112 7723 112
14646A12r75K50m702m476j060Q027M117k220l54m973K579N796J1053l36j2606
$$ 112 -863 -613 -5315 -9791 -10851 -2824 1293 -927 -1281 -6254 -3675 2121 13174 12838 232
14631B32o836J483m574j659m549l36O56L138Q252J1841N724k25l358j620n492
$$ 232 -6604 -5121 -9695 -11354 -15903 -16239 -15583 -12445 -4193 7648 13372 13147 9789 8169 2677
14616B677n362n843k36N11l75R491J429l226L673N175k560l86j839p982Q07P044
$$ 2677 -2685 -8528 -8764 -8253 -8628 863 2292 -934 2739 7914 5354 4968 3129 -4853 -4046 2998
14600B998k55m562p461l910m768J146M437J974N598K244N232O946j1129j626k035
$$ 2998 2743 -1819 -9280 -13190 -17958 -16812 -12375 -10401 -4803 -2559 2673 9619 -1510 -3136 -5171
14585e171n58K102J297k19J615L409j064N192l928p992M32j231K515L810M105
$$ -5171 -5729 -3627 -2330 -2549 -934 2475 1411 6603 2675 -5317 -4885 -6116 -3601 209 4314
14570D314l718M469n41l036r96K223P40k41p339k256O673L47l52k351l284J540
$$ 4314 596 5065 4524 1488 492 2715 3455 3214 -4125 -6381 292 639 287 -2064 -5348 -3808
14554c808N819K473L029k389k397K7M08l018l232M636N987J455o18l568K933l621
$$ -3808 2011 4484 7513 5124 2727 2754 3162 144 -3088 1548 7535 8990 8372 4804 7737 4116
14538D116l492m982N077k420J608q9o397m462K943J861M75K486J950l147k84J929
$$ 4116 624 -4358 719 -1701 -93 -182 -6579 -11041 -8098 -6237 -5762 -3276 -1326 -4473 -4757 -2828
14522b828K800L866n553q720o039L529Q411L365j410n850M092N829J166m653l404
$$ -2828 -28 3838 -1715 -10435 -16474 -12945 -4534 -1169 -2579 -8429 -4337 1492 2658 -1995 -5399
14507e399K983P974O77q106j353o644k658Q441o696l971K955K515M867P435J153
$$ -5399 -2416 5558 6235 -1871 -3224 -9868 -12526 -4085 -10781 -14752 -11797 -9282 -4415 3020 4173
14492D173L925k696o031q975m36R70j279O168O431J132j057Q96O35J402m576O36
$$ 4173 8098 5402 -629 -9604 -10040 -9070 -10349 -4181 2250 3382 2325 3221 3856 5258 682 1318
14476A318k754j380K034L007l775o923r72j180K587q87n6K786k757j944O518M845
$$ 1318 -1436 -2816 -782 2225 -1550 -8473 -9445 -10625 -8038 -8925 -8981 -6195 -8952 -10896 -4378 467
14460D67l946k975K502P320j334m094p667k104K557L001K710N195J482j452K105
$$ 467 -3479 -6454 -3952 3368 2034 -2060 -9727 -11831 -9274 -6273 -3563 1632 3114 1662 3767
14445C767K393j953j174K506K265n812p839m263M208M702M069j88k731K24l133
$$ 3767 6160 4207 3033 5539 7804 1992 -5847 -10110 -5902 -1200 2869 2681 -50 174 -2959
14430b959k227J831P565K767p724q221K972J879m961n394M755L579J765l082k91
$$ -2959 -5186 -3355 4210 6977 -747 -8968 -5996 -4117 -9078 -14472 -9717 -6138 -4373 -7455 -7746
14415g746N13M978m855L970L45l546K46K132N550m63l177n643o416O647O792o21
$$ -7746 -7233 -2255 -7110 -3140 -2795 -6341 -6095 -3963 1587 1124 -2053 -7696 -14112 -7465 -673 -1294
14399a294o763q35L36N309K167k396m66J015M587L514l481q456l670M662m13P594
$$ -1294 -8057 -8892 -8556 -3247 -1080 -3476 -3942 -2927 1660 5174 1693 -6763 -10433 -5771 -6184 1410
14383A410p33J187n696q969M889N126J610r03n410m222J915l73M189M888K249
$$ 1410 677 1864 -3832 -12801 -7912 -2786 -1176 -2079 -7489 -11711 -9796 -10169 -5980 -1092 1157
14368A157J0220j861n442n700j016Q25K711Q36l195m65m94J1803K493p65o708
$$ 1157 11377 9516 4074 -1626 -2642 -1817 894 1730 -1465 -1930 -2424 9379 11872 11107 4399
14353D399l512m964n232K047K256M804P224o228k485j809n532o62R193Q438n446
$$ 4399 887 -4077 -9309 -7262 -5006 -202 7022 794 -1691 -3500 -9032 -9694 -501 7937 2491
14338B491n319P99M774K192k215m135p500l000J862p21L95q96M028L203P21K32
$$ 2491 -2828 -2029 2745 4937 2722 -1413 -8913 -11913 -10051 -10772 -10377 -11273 -7245 -4042 -3321 -3089
14322c089n189R79P229M04k190J956j847k070j242m189K37P63J433N41K282k56
$$ -3089 -8278 -7299 -70 334 -1856 100 -1747 -3817 -5059 -9248 -9011 -8248 -6815 -6274 -3992 -4248
14306d248n084n995j223J49k999K416l274N092P220j71J8L007o09m039K312Q835
$$ -4248 -9332 -15327 -16550 -16401 -19400 -16984 -20258 -15166 -7946 -8117 -8099 -5092 -5701 -9740 -7428 1407
14290A407M125j245m726o47m057N207l109k93K811n655j050l367K967N784Q334
$$ 1407 5532 4287 -439 -1086 -5143 64 -3045 -3338 -527 -6182 -7232 -10599 -7632 -1848 6486
14275F486N926o294n337k204M72L94j5J884J301l869k167k601j556n627L093m044
$$ 6486 12412 6118 781 -1423 -951 -557 -572 1312 2613 -1256 -3423 -6024 -7580 -13207 -10114 -14158
14259a4158J572O213Q236m93l057P0K656N388l431j003R86o22k765l280J472k550
$$ -14158 -12586 -6373 1863 1370 -1687 -1617 1039 6427 2996 1993 2979 2357 -408 -3688 -2216 -4766
14243d766k357M604J72m403J532M083J200m82k479q30Q66P039k374M86M761o357
$$ -4766 -7123 -2519 -2347 -6750 -5218 -1135 65 -417 -2896 -3726 -2860 4179 1805 2291 7052 695
14227F95R12m12j579J230P70L715p194Q26p59n20k316o575p230K563J741k191
$$ 695 1607 1195 -384 846 1616 5331 -1863 -1037 -1796 -2316 -4632 -11207 -18437 -15874 -14133 -16324
14211a6324R226L227L771L770l541N476J532L69K978n823n838m583O903K215r27
$$ -16324 -7098 -3871 -100 3670 129 5605 7137 7506 10484 4661 -1177 -5760 1143 3358 2431
14196B431K48l65m22l518L77K752K143K466k501j0600j901l685p92M028M427L722
$$ 2431 2679 2314 1892 -1626 -1249 1503 3646 6112 3611 -6989 -8890 -12575 -13367 -9339 -4912 -1190
14180a190o536q937O63J2324Q166J213k981o274l050j767N462P194N571J229J031
$$ -1190 -7726 -16663 -16000 -3676 4490 5703 2722 -3552 -6602 -8369 -2907 4287 9858 11087 12118
14165A2118o74l33K020p24o045o740R36M32n785k14N830j2029m290J5087J1900
$$ 12118 11444 11111 13131 12407 6362 -378 558 990 -4795 -5009 821 -11208 -15498 -411 11489
14150A1489N014l194k242m681j748O024o093r343l214L938J542O215j95j749p11
$$ 11489 16503 13309 11067 6386 4638 10662 4569 -4774 -7988 -4050 -2508 3707 3512 1763 1052
14135A052J23K249J685N565j914o023o539K98o90k114n064k156L285O399K047
$$ 1052 1175 3424 5109 10674 8760 2737 -3802 -3504 -4194 -6308 -11372 -13528 -10243 -3844 -1797
14120a797QK501k488K55K168L324O148p82k545o9j803n590P37J287j818n86J583
$$ -1797 -1789 712 -1776 -1521 647 3971 10119 9337 6792 6723 4920 -670 67 1354 -464 -1050 533
14103E33l464j975L579J682j235o82M158M999j711m457j324N136M226j112o062
$$ 533 -2931 -4906 -1327 355 -880 -1562 2596 7595 5884 1427 103 5239 9465 8353 2291
14088B291K59J377K892n411l201j286J500o253J484N898K324o99k519L443M510
$$ 2291 2550 3927 6819 1408 -1793 -3079 -1579 -7832 -6348 -450 1874 1175 -1344 2099 6609
14073F609j475K65l855q090j26J15L293O859J250p089m590L675J201N96j874k
$$ 6609 5134 5399 1544 -6546 -6672 -6557 -3264 3595 4845 -2244 -6834 -3159 -1958 -1362 -3236 -3238
14057c238O84j545n23m756N318Q300N627j457k709M281J3670K609k29n510o187
$$ -3238 -2554 -4099 -4622 -9378 -4060 4240 9867 8410 5701 9982 23652 26261 26032 20522 14335
14042A4335o488J617O382L954J0072J8139K8431L7734O0419P1760O4467J7855
$$ 14335 7847 9464 15846 19800 29872 48011 76442 114176 174595 246355 310822 328677
14030C28677l7781n9806o7968n7248k9746j3655p364r131j8269m515P128P448
$$ 328677 290896 231090 163122 105874 76128 62473 55109 45978 27709 23194 30322 37770
14018C7770o504n155P667J398l753k605l286p829o884M89J910p79O171l498q88
$$ 37770 31266 26111 33778 35176 31423 28818 25532 17703 10819 11308 13218 12439 18610 15112 14224
14003A4224J408k153k523J217J0558L529p98j952k334o387m11m65K311p754K748
$$ 14224 15632 13479 10956 12173 22731 26260 25462 23510 21176 14789 14378 13913 16224 8470 11218
13988A1218Q21M99K18r08r3M75j640l789K323j517M819j235r717l958M149K043
$$ 11218 12039 12538 12756 11848 11755 12230 10590 6801 9124 7607 12426 11191 1474 -2484 1665 3708
13972C708n976k092L255M471L384k154P8q15J932q82j0083K452M526N520k02j252
$$ 3708 -2268 -4360 -1105 3366 6750 4596 4674 3859 5791 4909 -5174 -2722 1804 7324 7122 5870
13956E870K012K483m739k798k489M169l410m99K57N097k486j1411l048J977N861
$$ 5870 7882 10365 5626 2828 339 4508 1098 599 856 5953 3467 -7944 -10992 -9015 -3154
13941c154j935N92R386P54q143j458J356m311j217k631J882j837J995N114N967
$$ -3154 -5089 -4497 4889 5643 -2500 -3958 -2602 -6913 -8130 -10761 -8879 -10716 -8721 -3607 2360
13926B360l838j173l290K529R07j816m083M082Q200l279p885K782Q81J413J703
$$ 2360 -1478 -2651 -5941 -3412 -2505 -4321 -8404 -4322 3878 599 -7286 -4504 -3623 -2210 -507
13911e07K022P969p094m366J098L695K603L438M226L211J838K381J3589J5584
$$ -507 1515 9484 2390 -1976 -878 2817 5420 8858 13084 16295 18133 20514 34103 49687
13897D9687R947q406k0358q949n981M309L260j953q378o724k476L638k088K260
$$ 49687 59634 51228 30870 21921 15940 20249 23509 21556 13178 6454 3978 7616 5528 7788
13883G788j115k882J637L540K49K355j0962m681J325P336q936K275O559K289K432
$$ 7788 6673 3791 5428 8968 9217 11572 610 -4071 -2746 4590 -4346 -2071 4488 6777 9209
13868I209k016r41p299K794Q26p56R60Q735m179j326k202j56j97k21M131J173
$$ 9209 7193 6252 -1047 1747 2573 1817 2777 11512 7333 6007 3805 3649 3452 3231 7362 8535
13852H535k459m605N17l060N214m453K776L046m730J278L462k032j589L12l261
$$ 8535 6076 1471 1988 -1072 4142 -311 2465 5511 781 2059 5521 3489 1900 2212 -1049
13837a049k284M280Q877k402p014R71L217l449L18j084K581o92L077q36L296K499
$$ -1049 -3333 947 9824 7422 408 1379 4596 1147 1465 381 2962 2270 5347 4511 7807 10306
13821A0306r48l741o717J290l525j055L884L960k989m26J073N29K032K257P94
$$ 10306 9358 5617 -1100 190 -3335 -4390 -506 3454 465 39 1112 1641 3673 5930 6724
13806F724J642k305K189j845J525Q44k153p925j088k100k978N098Q209J906n848
$$ 6724 8366 6061 8250 6405 7930 8774 6621 -1304 -2392 -4492 -7470 -2372 5837 7743 1895
13791A895J699k357m11P564K71l508m028r55Q25j006Q270J2346J0469Q253Q234
$$ 1895 3594 1237 826 8390 8661 5153 1125 170 995 -11 8259 20605 31074 39327 47561
13776D7561J0838J8294J7607K543n085k459O236l612k3551k6151j1896n640r611
$$ 47561 58399 76693 94300 96843 91758 89299 95535 91923 68372 42221 30325 24685 15074
13763A5074k142j621n168N78M996k683q61J839J490n094K014p71k969N349O274
$$ 15074 12932 11311 6143 6721 11717 9034 8173 10012 11502 6408 8422 7651 4682 10031 16305
13748A6305J3659J3715J5128O064K690j2469j9707j0561l409r942n378m940L002
$$ 16305 29964 43679 58807 64871 67561 55092 35385 24824 21415 11473 6095 1155 4157
13735D157N748j386N616J168n124l105k56o55K114k025k813l454m47L230L141
$$ 4157 9905 8519 14135 15303 10179 7074 6818 6163 8277 6252 3439 -15 -462 2768 5909
13720E909K358n334p333n72M556N812m354M919P18m386L506k705m177M817J226
$$ 5909 8267 2933 -4400 -4972 -416 5396 1042 5961 6679 2293 5799 3094 -1083 3734 4960
13705D960m824p427M27K083L513K747j322K475q64q81k274l846j329K556L098
$$ 4960 136 -7291 -6864 -4781 -1268 1479 157 2632 1768 887 -1387 -5233 -6562 -4006 -908
13690i08L01O036j823p316m680J115K412J3678P309j181m566l488m588o281r817
$$ -908 -607 5429 3606 -3710 -8390 -7275 -4863 8815 16124 14943 10377 6889 2301 -3980 -13797
13675a3797J882Q586M101l488J111n093j867K015R945N518M84K422n75k63q268
$$ -13797 -11915 -3329 772 -2716 -1605 -6698 -8565 -6550 3395 8913 9397 11819 11244 10981 2713
13660B713m02n50k716k368N260J898J950j821N35m177K067J35l906j471l913J019
$$ 2713 2311 1761 -955 -3323 1937 3835 5785 3964 4499 322 2389 2524 -1382 -2853 -6766 -5747
13644e747M39M165O375l249l407o529n09q90O148Q55K676j074J1M663O351j43
$$ -5747 -5308 -1143 5232 1983 -1424 -7953 -8462 -9352 -3204 -2349 327 -747 -736 3927 10278 10135
13628A0135K602p634q985k123j538O289R047l046n686M946P794j2N485k328K00
$$ 10135 12737 5103 -3882 -6005 -7543 -1254 7793 4747 -939 4007 11801 11789 17274 14946 15146
13613A5146k223L68n183O377O017k594l799J94K051J136o185o620n160o943o979
$$ 15146 12923 13291 8108 14485 20502 17908 14109 14303 16354 17490 11305 4685 -475 -7418 -14397
13598a4397L664N565M148o11K986K039o260k745J645J867J659J80J212j321q089
$$ -14397 -10733 -5168 -1020 -1631 1355 3394 -2866 -5611 -3966 -2099 -440 -260 952 -369 -8458
13583h458p208M172Q291M980l437K118l846O524K348q098L673O897J724L735j539
$$ -8458 -15666 -11494 -3203 1777 -1660 458 -3388 3136 5484 -2614 1059 7956 9680 13415 11876
13568A1876M502M202N291J505j3119o155l943k206O341J70k273L97k278p106m585
$$ 11876 16378 20580 25871 27376 14257 8102 4159 1953 8294 8464 6191 6588 4310 -2796 -7381
13553g381K361M605J819K427k237L541M718K964M21j0577o322k523Q11M557M4
$$ -7381 -5020 -415 1404 3831 1594 5135 9853 12817 13238 2661 -3661 -6184 -5373 -816 -772
13538g72m032o19o51n060m191M097R329O755JM01p00P28L882l615l527j701j58
$$ -772 -4804 -5423 -6074 -11134 -15325 -11228 -1899 4856 4857 5258 4558 5286 9168 5553 2026 325 167
13521A67k201L716L643l332o950l809j589N025K807l880l268L007Q978N965k997
$$ 167 -2034 1682 5325 1993 -4957 -8766 -10355 -5330 -2523 -6403 -9671 -6664 2314 8279 5282
13506E282j515L366j687n715m576l703o31N717J444j233k604m115L16J732Q233
$$ 5282 3767 7133 5446 -269 -4845 -8548 -9179 -3462 -2018 -3251 -5855 -9970 -9654 -7922 311
13491C11J468Q6K346J300K39p518q344N72O374O246r924k167P305J715L322J036
$$ 311 1779 1865 4211 5511 5750 -1768 -10112 -9540 -3166 3080 -6844 -9011 -1706 9 3331 4367
13475D367L112J65j377p14j791k03J587k794K676l721j819k610m680l283K351
$$ 4367 7479 7644 6267 5553 3762 3559 5146 2352 5028 1307 -512 -3122 -7802 -11085 -8734
13460h734P99O93Q093Q02n180m266l390N3J549M504N376K651L237j135J549n663
$$ -8734 -7935 -7242 851 1653 -3527 -7793 -11183 -11130 -9581 -5077 299 2950 6187 5052 6601 938
13444I38L073L902j2297r163j383m04J481M786M712l62K191k93o968o18O186J0396
$$ 938 4011 7913 -4384 -13547 -14930 -15334 -13853 -9067 -4355 -4717 -2526 -2819 -9787 -10405 -4219 6177
13428F177N648J539j99j257q430q267l645K814O833j907k885m908m881M895N403
$$ 6177 11825 13364 13165 11908 3478 -4789 -8434 -5620 1213 -694 -3579 -8487 -13368 -8473 -3070
13413c070j561r57J896j437K822J894L79M304K84J569p452o947n285O678R490
$$ -3070 -4631 -5588 -3692 -5129 -2307 -413 -34 4270 4554 6123 -1329 -8276 -13561 -6883 2607
13398B607J256o407O6R649P26p71n862k623L404M102J391j287j803L960j835l045
$$ 2607 3863 -2544 -2478 7171 7897 7126 1264 -1359 2045 6147 7538 6251 4448 8408 6573 3528
13382C528O513J405L84j653j034m555m661n823k965l502O670O557l086M73M342
$$ 3528 10041 11446 11830 10177 9143 4588 -73 -5896 -8861 -12363 -5693 864 -2222 -1749 2593
13367B593K666Q3r493J142O656L334l241l629M561N226j759q87m439o259l57J2237
$$ 2593 5259 5342 -4151 -3009 3647 6981 3740 111 4672 9898 8139 7252 2813 -3446 -3803 8434
13351H434K977k494l734l574M61m639l937P78L495K924j278l159K366O803K749
$$ 8434 11411 8917 5183 1609 2070 -2569 -6506 -5728 -2233 691 -587 -3746 -1380 5423 8172
13336H172m608k381O73j159n75m5J561J286n358j174k756r13j132k807M631Q276
$$ 8172 3564 1183 1856 697 122 77 1638 2924 -2434 -3608 -6364 -7277 -8409 -11216 -6585 1691
13320A691L003K306M60P4P873l802o373l062R16k19p151Q18L850K132L676o713
$$ 1691 4694 7000 7460 7534 15407 11605 5232 2170 3086 2867 -4284 -3466 384 2516 6192 -521
13304e21l818o516M882P992J141l844j0373l629Q81r38l704J1354O745J937N638
$$ -521 -4339 -10855 -5973 2019 3160 -684 -11057 -14686 -13805 -14743 -18447 -7093 -348 1589 7227
13289G227L980k415l357l426j229m85K532P960O85n416j344k961m160l472N884
$$ 7227 11207 8792 5435 2009 780 295 2827 10787 11472 6056 4712 1751 -2409 -5881 3
13274Cj326p266p10O28K522L560M113l298p537K417N711K402j810q21j737J873
$$ 3 -1323 -8589 -9299 -8671 -6149 -2589 1524 -1774 -9311 -6894 -1183 1219 -591 -1412 -3149 -1276
13258a276L8l556p242K312K978Q988K070p295k239L136k84O029J392q19q62O407
$$ -1276 -1238 -4794 -12036 -9724 -6746 2242 4312 -2983 -5222 -2086 -2370 3659 5051 4232 3370 9777
13242I777r10p469l421j76N043K399K043N034p160n174K873j023l081k35k050
$$ 9777 8867 1398 -2023 -2199 2844 5243 7286 12320 5160 -14 2859 1836 -1245 -1480 -3530
13227c530l904j146J532O931j213k204K276J69j1883n821P834N481K98J964J0521
$$ -3530 -7434 -8580 -7048 -117 -1330 -3534 -1258 -1089 -12972 -18793 -10959 -5478 -5180 -3216 7305
13212G305K877p378l924p148K526R079p68k009K034M87k622k624Q00M249J222
$$ 7305 10182 2804 -1120 -8268 -5742 3337 2569 560 2594 3081 459 -2165 -1365 2884 4106
13197D106l850q298j631M831M796K363P342p70l292k675k419n316J758L166M831
$$ 4106 256 -8042 -9673 -4842 -46 2317 9659 8889 5597 2922 503 -4813 -3055 111 4942
13182D942M740J274q07j398l225p753l816Q12p526j042Q671L01j468M418N663
$$ 4942 9682 10956 10149 8751 5526 -2227 -6043 -5231 -12757 -13799 -5128 -4827 -6295 -1877 3786
13167C786J916m32K158K297o441l47j170j876L759O60l283L35J0093J866j3093
$$ 3786 5702 5270 7428 9725 3284 2937 1767 -109 3650 4310 1027 1362 11455 13321 228
13152B28p474N090q04L82J897J010M607k494J357k08J630l535L875j286K418O22
$$ 228 -7246 -2156 -2960 -2578 -681 329 4936 2442 3799 3591 5221 1686 5561 4275 6693 7315
13136G315J200K709l281n730j374j072K425M999K667n074J582J190m040L559P063
$$ 7315 8515 11224 7943 2213 839 -233 2192 7191 9858 4784 6366 7556 3516 7075 14138
13121A4138j836o958m09N338K096n297m287o029K003N00M83L043L325K60j322
$$ 14138 12302 5344 4935 10273 12369 7072 2785 -3244 -1241 -741 -258 2785 6110 6370 5048
13106E048j800R548L154l792l581O66J987n99p214q19L754J460M722K046J709
$$ 5048 3248 12796 15950 12158 8577 9243 11230 10631 3417 2598 6352 7812 12534 14580 16289
13091A6289m334l163l877k822J488O478J327n829k332Q7J040K124J213r026m215
$$ 16289 11955 8792 4915 2093 3581 10059 11386 5557 3225 3312 4352 6476 7689 -1337 -5552
13076e552j750M199Q649P287J2456P001l701j4869J47n716o197m173l723J782
$$ -5552 -7302 -3103 5546 12833 25289 32290 28589 13720 13867 8151 1954 -2219 -5942 -4160
13062d160k505R78M560N277L433J397L115r82m623q05L47k435k613j979l972L335
$$ -4160 -6665 -5687 -1127 4150 7583 8980 12095 11113 6490 5685 6032 3597 984 -995 -4967 -1632
13046a632K724K937J246L510M04n623k251m079K088M608R23N087l389k771k752
$$ -1632 1092 4029 5275 8785 9189 3566 1315 -2764 -676 3932 4855 9942 6553 3782 1030
13031A030j148j004R828N879J4278J1389k353j5214j2767l539O002Q53m901l539
$$ 1030 -118 -1122 8706 14585 28863 40252 37899 22685 9918 6379 12381 13234 8333 4794
13017D794j932M493j563L612P033J506L829Q944R164p193m407m102p666n206M05
$$ 4794 2862 7355 5792 9404 16437 17943 21772 30716 39880 32687 28280 24178 16512 11306 11711
13002A1711J15j130k053q4j015K952l426Q73j255L664Q853J43m990j1102J769
$$ 11711 11826 10696 8643 8559 7544 10496 7070 7943 6688 10352 19205 19348 14358 3256 5025
12987E025K392j686L721M935P089k57l291j53K352L222m430p680p01o651p4n736
$$ 5025 7417 5731 9452 14387 21476 21219 17928 17775 20127 23349 18919 11239 10538 3887 3813 -1923
12971a923o005L960K501J208O592J3002P011m547m310n020K515k394l347m409
$$ -1923 -7928 -3968 -1467 -259 6333 19335 26346 21799 17489 12469 14984 12590 9243 4834
12957D834p564M973j485Q17O39l644M656L1m659P00q2k79L361L623K92m412o862
$$ 4834 -2730 2243 758 1575 2214 -1430 3226 3257 -1402 -702 -784 -1063 2298 5921 6213 1801 -5061
12940e061K793j902Q89J428r43j611M757N653O028j093p053N298o65p808j991
$$ -5061 -2268 -4170 -3281 -1853 -2796 -4407 350 6003 12031 10938 3885 9183 8518 710 -1281
12925a281k912q65J784N423j912L170M682M164m965l188P836o19j1415o885Q459
$$ -1281 -4193 -5058 -3274 2149 237 3407 8089 12253 7288 4100 11936 11317 -98 -6983 1476
12910A476R617j1K679p68K715l387k252l454J646r73l07J395j193M995q200q233
$$ 1476 11093 11082 13761 12993 15708 12321 10069 6615 8261 7288 6981 8376 7183 12178 3978 -4255
12894d255k355N30n297K928P55M821P331n290n202j278j406O567n213p50N368
$$ -4255 -6610 -6080 -11377 -8449 -7694 -2873 4458 -832 -6034 -7312 -8718 -2151 -7364 -8114 -2746
12879b746L873k431L416J809K388K181K390j704j1384j893J120j5k555k27N522
$$ -2746 1127 -1304 2112 3921 6309 8490 10880 9176 -2208 -4101 -2981 -2996 -5551 -5778 -256
12864b56J931n984k599L730L955M474J305m164l102J0329N575O912j0431j1356
$$ -256 1675 -4309 -6908 -3178 777 5251 6556 2392 -710 9619 15194 22106 11675 319
12850C19P29p4J380m2l090l084r07j771q55N466K092J177J015m291j081K421K374
$$ 319 1048 974 2354 2312 -778 -3862 -4769 -6540 -7395 -1929 163 1340 2355 -1936 -3017 -596 1778
12833A778J127J922j355p009l069N856L156j939N38j681o57O316o437k474L04
$$ 1778 2905 4827 3472 -3537 -6606 -750 2406 467 1005 -676 -1333 4983 -1454 -3928 -3624
12818c624j117M529L461P003K200k173j205L7M39l292k205j442j335m395l029
$$ -3624 -4741 -212 3249 10252 12452 10279 9074 9111 9550 6258 4053 2611 1276 -3119 -6148
12803f148L575O135L467M206p61l417l935j505j602K8M526O73L563m222Q32m177
$$ -6148 -2573 3562 7029 11235 10474 7057 3122 1617 15 43 4569 5242 8805 4583 5415 1238
12787A238k57O793j374J065J793k017j1546j150L322O378k474m483p94Q18M989
$$ 1238 981 7774 6400 7465 9258 7241 -4305 -5455 -2133 4245 1771 -2712 -3506 -2688 2301
12772B301o71J885M36K511P838M56l736n20p034J313j377o27K543o937J488k51
$$ 2301 1630 3515 3951 6462 14300 14756 11020 10500 3466 4779 3402 2775 5318 -1619 -131 -382
12756c82l415P54K876K129n85J109N410L095j435n881k490j603j008P45L922M022
$$ -382 -3797 -3043 -167 1962 1377 2486 7896 10991 9556 3675 1185 -418 -1426 -681 3241 7263
12740G263n496m47K942p129n974m73L506R94k315L832N046J244o682k730L574
$$ 7263 1767 1320 4262 -2867 -8841 -9314 -5808 -4814 -7129 -3297 1749 2993 -3689 -6419 -2845
12725b845j427j390k384L171n873o560M918P793M86J507K161J996k740n055K938
$$ -2845 -4272 -5662 -8046 -4875 -10748 -17308 -12390 -4597 -4111 -2604 -443 1553 -1187 -6242 -3304
12710c304M39J1972L892k000j962L385K22J032O5o456j356L467O37K01m712o406
$$ -3304 -2865 9107 12999 10999 9037 12422 12644 13676 13741 7285 5929 9396 10033 10234 5522 -884
12694h84j055K944p794M454K935R72k114N331K81j0795o156K586J5043Q637m23
$$ -884 -1939 1005 -6789 -2335 600 1572 -542 4789 5070 -5725 -11881 -9295 5748 14385 13962
12679A3962o112p606k649L175k716J557l261N593N165P076J686j102o825n715
$$ 13962 7850 244 -2405 770 -1946 -389 -3650 1943 7108 14184 15870 14768 7943 2228
12665B228l33M097N464k893l994k295m000K04J910P58M252p79j680p06p65O654
$$ 2228 1895 5992 11456 8563 4569 2274 -1726 -1522 388 1146 5398 4619 2939 2233 1468 8122
12649H122J452o1K186k707M529l846r669l556J216K675o55K35r576O821Q709J18
$$ 8122 9574 9513 11699 8992 13521 9675 6 -3550 -2334 341 -314 -79 -9655 -2834 5875 5993
12633E993R68K438M401n583o299P965k336L968j672r278k880R5k505l049K218
$$ 5993 6961 9399 13800 8217 1918 9883 7547 11515 9843 565 -2315 -2220 -4725 -7774 -5556
12618e556m316k373L37K469L204O391L515j47M569j144n526J358L160r03k825
$$ -5556 -9872 -12245 -11908 -9439 -6235 156 3671 3524 8093 6949 1423 2781 5941 5038 2213
12603B213r15Q84K951K248n120j2273j737R910N262K395J535k419m951R55K453
$$ 2213 1298 2182 5133 7381 2261 -10012 -11749 -1839 3423 5818 7353 4934 -17 938 3391
12588C391j186K225N123J955n837j233K676p98K525Q16m674m772M58N502J072
$$ 3391 2205 4430 9553 11508 5671 4438 7114 6316 8841 9657 4983 211 669 6171 7243
12573G243k172k700k980O043m904p223J650O110K330l907J364M723J964m20k248
$$ 7243 5071 2371 -609 5434 530 -6693 -5043 1067 3397 -510 854 5577 7541 7121 4873
12558D873o545n743N27J2223R539j0385l664L489N215K103j0650k695M025m291
$$ 4873 -1672 -7415 -6888 5335 14874 4489 825 4314 9529 11632 982 -1713 2312 -1979
12544a979l265j098O65O05O220M638L659Q90q87n564k285N136K350J03o1o042
$$ -1979 -5244 -6342 -5677 -5072 1148 5786 9445 10335 9448 3884 1599 6735 9085 9188 9127 3085
12528C085L231M575n27q568n66O858j833l279q631q45M096l067m191O101M397
$$ 3085 6316 10891 10364 1796 1230 8088 6255 2976 -5655 -6500 -2404 -5471 -9662 -3561 836
12513H36J705J460L651m222L664m7J892L335l793K419L752r35q448m936N075n956
$$ 836 2541 4001 7652 3430 7094 7047 8939 12274 8481 10900 14652 13717 5269 333 5408 -548
12497e48m638L641n31k279k611J15M110N274L447Q284l857n794L090N112o558
$$ -548 -5186 -1545 -2076 -4355 -6966 -6851 -2741 2533 5980 14264 10407 4613 7703 12815 6257
12482F257o060r148Q400R823j658l341m433k247o892J488J200j397J901K233P088
$$ 6257 197 -8951 -551 9272 7614 4273 -160 -2407 -9299 -7811 -6611 -8008 -6107 -3874 3214
12467C214J732L699L768K222l92l389n925o926m130P125o17j418K215J974K30
$$ 3214 4946 8645 12413 14635 14243 10854 4929 -1997 -6127 998 381 -1037 1178 3152 3382
12452C382k053l687K403k47K16N067M127R609M492j622j1466r575l255M709R060
$$ 3382 1329 -2358 45 -202 14 5081 9208 18817 23309 21687 10221 646 -2609 2100 11160
12437A1160L846l401l542J594l960m037l63K175N458j537m568q914k434J166N755
$$ 11160 15006 11605 8063 9657 5697 1660 1297 3472 8930 7393 2825 -6089 -8523 -7357 -1602
12422a602Q787j274p12K982j03m897j256J106j74m794j092L958j874M429M321
$$ -1602 7185 5911 5199 8181 8078 3181 1925 3031 2857 -1937 -3029 929 -945 3484 7805
12407G805L319K780m06k227K160L742r34m940q324j730M10N008q503j926L579
$$ 7805 11124 13904 13498 11271 13431 17173 16239 11299 2975 1245 1655 6663 -1840 -3766 -187
12392a87K765O85q861j712R10M080M132L794R02l551j23O11K09R930N554j672
$$ -187 2578 3263 -5598 -7310 -6400 -2320 1812 5606 6508 2957 2834 3445 3654 13584 19138 17466
12376A7466j0397k631N05n731j490N426J622K073L297n313k978K512O312n328
$$ 17466 7069 4438 4943 -788 -2278 3148 4770 6843 10140 4827 1849 4361 10673 5345
12362E345J480r45k380K209K15j532j342L982m417j408O910L671j16k910l39j
$$ 5345 6825 5880 3500 5709 5924 4392 3050 7032 2615 1207 8117 11788 11672 8762 8423 8422
12346H422j157k570m632Q629j270j0874k491R010k084n645o70j477k266M60m147
$$ 8422 7265 4695 63 8692 7422 -3452 -5943 3067 983 -4662 -5332 -6809 -9075 -8615 -12762
12331a2762L581P968M583M749k355j598O53m994k226L258L484l343L714l410k497
$$ -12762 -9181 -1213 3370 8119 5764 4166 4819 -175 -2401 857 4341 998 4712 1302 -1195
12316a195K770l675P0J487N108o266m132L297M681l305k365N650M56J80N68k5
$$ -1195 1575 -2100 -2030 -543 4565 -1701 -5833 -2536 2145 -1160 -3525 2125 2581 2761 3329 3304
12300C304r26j823J508J744j508k190m523N359O378j110m49N294j054n825k548
$$ 3304 2378 555 2063 3807 2299 109 -4414 945 7323 6213 5764 11058 10004 4179 1631
12285A631J2679k851o07L415j279l146r630L557L425M599Q168N755j237M93Q399
$$ 1631 14310 11459 10852 14267 12988 9842 212 3769 7194 11793 19961 25716 24479 24972 33371
12270C3371o148j0751l170j107O7K083P55p872m430L971k717L590r62n141R96
$$ 33371 27223 16472 13302 12195 12262 14345 15100 7228 2798 6769 4052 7642 6680 1539 2535
12255B535k930m52L512J896M954K298l175m142q522L791N326l18O371K989p485
$$ 2535 -395 -847 2665 4561 9515 11813 8638 4496 -4026 -235 5091 4773 11144 14133 6648
12240F648J093k59r14O23m278l046P612M494N369q23M464k212L322N397K52k010
$$ 6648 7741 7482 6568 7191 2913 -133 7479 11973 17342 16519 20983 18771 22093 27490 27742 25732
12224B5732l281L787o712n316n5k516k287l418o543j839k066q07O826Q12M390
$$ 25732 22451 26238 19526 14210 14155 11639 9352 5934 -609 -2448 -4514 -5321 1505 2317 6707
12209F707Q39J584K642o14J68n077n409J953J0077J0489Q86r423o837j920K382
$$ 6707 7546 9130 11772 11158 11326 6249 840 2793 12870 23359 24245 14822 7985 6065 8447
12194H447j203k997L543L394k271L470l284k994n532P792N999n586n081O76j030
$$ 8447 7244 4247 7790 11184 8913 12383 9099 6105 573 8365 14364 8778 3697 4373 3343
12179C343l28O747M632o525j0975k241j068L6m46P154N217q190m9N888L520j508
$$ 3343 3015 9762 14394 7869 -3106 -5347 -6415 -6379 -6825 329 5546 -2644 -2693 3195 6715 5207
12163E207J159K819L13J863l00l546o79j824j555M171j328K084l544J632q29k46
$$ 5207 6366 9185 9498 11361 11061 7515 6836 5012 3457 7628 6300 8384 4840 6472 5643 5397
12147E397M549j047m476N113m639j465K45N330O027Q89j0847q708o83Q331K750
$$ 5397 9946 8899 4423 9536 4897 3432 3677 9007 15034 15923 5076 -3632 -4315 4016 6766
12132F766K585j2j675l031q482O874M569O114m201q047K838J0487n96r799r112
$$ 6766 9351 9339 7664 4633 -3849 3025 7594 13708 9507 1460 4298 14785 14189 4390 -4722
12117d722N253M200k856L077o44l410j199K582J884K566N692k963n481j445N653
$$ -4722 531 4731 1875 4952 4308 898 -301 2281 4165 6731 12423 9460 3979 2534 8187
12102H187J0251L657n864N78n489m857N9j711k297P878K670p129j81n786L615
$$ 8187 18438 22095 16231 16809 11320 6463 6522 4811 2514 10392 13062 5933 5752 -34 3581
12087C581R975K095p865r389k776Q561n867J073L012k20K331O566j138j112l034
$$ 3581 13556 15651 7786 -1603 -4379 4182 -1685 -612 2400 2180 4511 11077 9939 8827 5793
12072E793n357L963O27l299J331N318j292P706L290l53q36j709o464J86K011k637
$$ 5793 436 4399 5026 1727 3058 8376 7084 14790 18080 17727 16891 15182 8718 8904 10915 8278
12056H278n1M521n352n595M230J794K022J82J774M741N374q97m205K618L150M468
$$ 8278 8227 12748 7396 1801 6031 7825 9847 10029 11803 16544 21918 21021 16816 19434 22584 27052
12040B7052N322J540L088o053j2431j3211j690N791J1033L305k743q726j290M06
$$ 27052 32374 33914 37002 30949 18518 5307 3617 9408 20441 23746 21003 12277 10987 11393
12026A1393n7R95K506J619l69J744j204k634l287n902R03K1k865J0096l046q396
$$ 11393 11336 12331 14837 16456 16087 17831 16627 13993 10706 4804 5707 5728 2863 12959 9913 1517
12010A517j934L620n99J284J616q58P54P292O53l153L9m087n657N625O381r69
$$ 1517 -417 3203 2604 3888 5504 4646 5400 12692 13345 10192 10231 6144 487 6112 12493 11524
11994A1524n502K014Q97J515q680j082L393k430L017Q520j74J543k449J780J076
$$ 11524 6022 8036 8933 10448 1768 686 4079 1649 4666 13186 13012 14555 12106 13886 14962
11979A4962p399O67M569M300j766K703m055o144l312n76n680m277N382L339L159
$$ 14962 7563 8230 12799 17099 15333 18036 13981 7837 4525 3949 -1731 -6008 -626 2713 5872
11964E872q74L931M134J133j451K760J071n038k308o684l187N513K063K015J031
$$ 5872 4998 8929 13063 14196 12745 15505 16576 11538 9230 2546 -641 4872 6935 8950 9981
11949I981L467J070l198J161M391J652r19k122j382O001m894j752n047J511L633
$$ 9981 13448 14518 11320 12481 16872 18524 17605 15483 14101 20102 15208 13456 8409 9920 13553
11934A3553k783m413j667n06m234l224N161L608Q55M415k50j254K543J509K488
$$ 13553 10770 6357 4690 4184 -50 -3274 1887 5495 6350 10765 10515 9261 11804 13313 15801
11919A5801n359q548k39Q803P396l827m547k329K414k331L145j747O15J427l123
$$ 15801 10442 1894 1655 10458 17854 14027 9480 7151 9565 7234 10379 8632 9247 10674 7551
11904G551L656K108P098J158o244K847J817k16P41N474L048M310l802o748k941
$$ 7551 11207 13315 20413 21571 15327 18174 19991 19775 20516 25990 29038 33348 29546 22798 19857
11889A9857K094l78p440m471j415o027p174M440P885M46K873L079J812J979J488
$$ 19857 21951 21573 14133 9662 8247 2220 -4954 -514 7371 7817 10690 13769 15581 17560 19048
11874A9048l867P0o008r24J826M99K39m44M934J804j391p741r91k353K313r17
$$ 19048 15181 15251 9243 8319 10145 10644 10883 10439 15373 17177 15786 8045 7054 4701 7014 6097
11858F097L045M041K715j668R53n998M518M971J296J241l647n934K456m150n492
$$ 6097 9142 13183 15898 14230 15183 9185 13703 18674 19970 21211 17564 11630 14086 9936 4444
11843D444k6O636k04O413L114n008j095k366j526l083L121N487K296n801k124
$$ 4444 4418 11054 10850 17263 20377 15369 14274 11908 10382 7299 10420 15907 18203 12402 10278
11828A0278l67K06J108N84J69Q201k90j134L334m524l294k959N107k596o813k949
$$ 10278 9911 10117 11225 11809 11978 20179 19889 18755 22089 17565 14271 11312 16419 13823 7010 4061
11812D061k487N106O593R03Q1m94o816q321k300P125R128J315L541n571p64J348
$$ 4061 1574 6680 13273 14176 14257 13763 6947 -1374 -3674 3451 12579 13894 17435 11864 11100 12448
11796A2448J350M773n539K548K981N52k639j163k512j165J232K348m868p711N435
$$ 12448 13798 18571 13032 15580 18561 19113 16474 15311 12799 11634 12866 15214 10346 2635 8070
11781H070O049j913k438J291R00J396o43l773l557O138L155k009Q75l455p17N338
$$ 8070 14119 12206 9768 11059 11959 13355 12712 8939 5382 11520 14675 12666 13541 10086 9369 14707
11765A4707n589k871K13P039j574K677p917K417L302j789l936k041L413J36j53
$$ 14707 9118 6247 6460 13499 11925 14602 6685 9102 12404 10615 6679 4638 8051 8187 8034
11750H034N876j953p68K88r013l680M524K493J1268O176N2J088q34p324j0416
$$ 8034 13910 11957 11189 11477 2464 -1216 3308 5801 17069 23245 23297 24385 23551 16227 5811
11735E811k999J594J070J365J903J241R997N710l970r687o658J989N644l931N275
$$ 5811 2812 4406 5476 6841 8744 9985 19982 25692 21722 12035 5377 7366 13010 9079 14354
11720A4354L826J902m524n971N997J615k007l827j450M68K583K018K272k396j600
$$ 14354 18180 20082 15558 9587 15584 17199 15192 11365 9915 10383 12966 14984 17256 14860 13260
11705A3260j477k780L340M739j320j30L37J056p35m409k287Q144j6j124L296o536
$$ 13260 11783 9003 12343 17082 15762 15632 15969 17025 16290 11881 9594 17738 17722 16598 19894 13358
11689A3358k298k853j894M926K870j146m314k528L593P201k48O497K975n674p578
$$ 13358 11060 8207 6313 11239 14109 12963 8649 6121 9714 16915 16667 23164 26139 20465 12887
11674A2887n491j693M551J645M64q68M915K167J968K13J889M76p136q219L716
$$ 12887 7396 5703 10254 11899 12363 11495 16410 18577 20545 20758 22647 23123 15987 7768 11484
11659A1484L158O945P06k386j127k198K805J49r55r10M573L255j918l806K877
$$ 11484 14642 21587 22293 19907 18780 16582 19387 19536 18581 17671 22244 25499 23581 19775 22652
11644B2652j898N017j926p184J686J232o59j520l384P64O323O803m829o94M48
$$ 22652 20754 25771 23845 16661 18347 19579 18920 17400 14016 14780 21103 27906 23077 22383 22831
11629B2831J676k170p642m713M262N604M937j662q461l612K612J512k511p921
$$ 22831 24507 22337 14695 9982 14244 19848 24785 23123 14662 11050 13662 15174 12663 4742
11615D742j0803M305O121j229n794J55M014l798k423o241L179k584M668J0049
$$ 4742 -6061 -1756 4365 3136 -2658 -2503 1511 -2287 -4710 -10951 -7772 -10356 -5688 4361
11601D361L482K638J0359o502L058O300O189o51k057n560L729L58j050J612M344
$$ 4361 7843 10481 20840 14338 17396 23696 29885 29234 27177 21617 25346 25704 24654 26266 30610
11586C0610k74l561r77o866k011k50K471Q52j753N00N519j0353k023L853K422
$$ 30610 30336 26775 25798 18932 16921 16671 19142 19994 18241 18741 24260 13907 11884 15737 18159
11571A8159p999p361k037Q440R170L27M63L72k115r366m12K465m558m254r82Q924
$$ 18159 10160 2799 762 9202 18372 18699 19162 19534 17419 8053 7641 10106 5548 1294 312 9236
11555I236J6148J114p361m321J72k769M782j483k231j839p75j842Q669Q470J237
$$ 9236 25384 26498 19137 14816 14988 12219 17001 15518 13287 11448 10673 8831 17500 25970 27207
11540B7207k739j718n914p47j325n252k26n728k10M28R206Q082N100P60r414Q23
$$ 27207 24468 22750 16836 16089 14764 9512 9286 3558 3348 3776 12982 21064 26164 26924 17510 18333
11524A8333P197N97q708p939n18K122N188N22k338J452M572M309m434k948l623
$$ 18333 25530 26127 17419 9480 8962 11084 16272 16794 14456 15908 20480 24789 20355 17407 13784
11509A3784l991K325L827K734J689l843j216l066O633K589Q31n8J055N258m042
$$ 13784 9793 12118 15945 18679 20368 16525 15309 12243 18876 21465 22296 22238 23293 28551 24509
11494B4509j687J170O42o617j528r41L813P962J60K778p085q25M006n462q11K06
$$ 24509 22822 23992 24634 18017 16489 15548 19361 27323 27483 30261 23176 22351 26357 20895 20084 20290
11478B0290O550p04p18j825J552k569L42L706q16k609p72L137m804j768M191J826
$$ 20290 26840 26136 25418 23593 25145 22576 22918 26624 25808 23199 22427 25564 20760 18992 23183 25009
11462B5009l813n77L620L323K643K101K884K526N183M81j1379l533L340M66M103
$$ 25009 21196 20619 24239 27562 30205 32306 35190 37716 42899 43380 32001 28468 31808 32274 36377
11447C6377N438p869p637l623q4L584j890N191M096j0536j0821j038j543K712
$$ 36377 41815 33946 26309 22686 22602 26186 24296 29487 33583 23047 12226 11188 9645 12357
11433A2357R402n7J689J996P36K7J369J186k362n636Q010Q190k89l566l767J210
$$ 12357 21759 21702 23391 25387 26123 26150 27519 28705 26343 20707 28717 36907 36618 33052 29285 30495
11417C0495l629k156M40Q374M908M228J196l922n021L901j013l807q96P629J667
$$ 30495 26866 24710 25150 33524 38432 42660 43856 39934 34913 38814 37801 33994 33098 40727 42394
11402D2394k042l121j431L058K474k34k16j051M654n645J310J145n13j392m303
$$ 42394 40352 37231 35800 38858 41332 41098 40882 39831 44485 38840 40150 41295 40782 39390 35087
11387C5087l026j084J811J666N466q8k185L86N22M8k496J080j08K808k80k56J409
$$ 35087 32061 30977 32788 34454 39920 39832 37647 38033 38555 38603 36107 37187 37079 39887 39607 39351 40760
11370D0760N188l355j814K12n156Q30k480J703K059J786q12m172k753j485o90
$$ 40760 45948 42593 40779 40991 35835 36665 34185 35888 37947 39733 38921 34749 31996 30511 29821
11355B9821L413N505l074n858r163K337K888R12Q578O985k071J67K315R334j632
$$ 29821 33234 38739 35665 29807 20644 22981 25869 26781 35359 42344 40273 40440 42755 52089 50457
11340E0457J644N154P184n442r62n146J039K57n177k625k573o675k293N630K897
$$ 50457 52101 57255 64439 58997 58035 52889 53928 54185 49008 46383 43810 37135 34842 40472 43369
11325D3369k750N158O244j769l904o900l656l259q7K599l75N522J767n387J544
$$ 43369 40619 45777 52021 50252 46348 39448 35792 32533 32446 35045 34670 40192 41959 36572 38116
11310C8116k351l070j327l137Q291L851j314m744j685L569m137J130M146M17m561
$$ 38116 35765 32695 31368 28231 36522 40373 39059 34315 32630 36199 32062 33192 37338 37755 33194
11295C3194J409J505k135J621l233L564M660j876M798L949m048J336j831m381
$$ 33194 34603 36108 33973 35594 32361 35925 40585 38709 43507 47456 43408 44744 42913 38532
11281C8532n796K500J59l90O306Q14Q6N471l370q500m134j885N393N914k206n25
$$ 38532 32736 35236 35395 35005 41311 42125 42211 47682 44312 35812 31678 29793 35186 41100 38894 38369
11265C8369m323J87P923M291q316k561O656L289M308r62k577L978k717m845K573
$$ 38369 34046 34233 42156 46447 38131 35570 42226 45515 49823 48861 46284 50262 47545 42700 45273
11250D5273N44J731N793k0J219M53P588l945J510Q75q47L046J2417J3987J3235
$$ 45273 45817 47548 53341 53321 54540 54993 62581 58636 60146 61021 60174 63220 75637 89624 102859
11235A02859Q189L480j1883j5138r938r253m665J027k335J301l538k571M0M133
$$ 102859 111048 114528 102645 87507 77569 68316 63651 64678 62343 63644 60106 57535 57575 61708
11221F1708o133k541M859O62K828M50l135P83l827l932k291k035k486o32K870
$$ 61708 55575 53034 57893 58555 61383 61833 58698 59481 55654 51722 49431 47396 44910 44278 47148
11206D7148n688m041K506P851N103k204N22p984L188K849l041r108n10M837L411
$$ 47148 41460 37419 39925 47776 52879 50675 51197 43213 46401 49250 46209 37101 36591 41428 44839
11191D4839K645M635J168k71K558K511q514l869N387O138m647o178L00J341O920
$$ 44839 47484 52119 53287 53016 55574 58085 49571 45702 51089 57227 52580 46402 46702 48043 54963
11176E4963O95q024K59N676Q782K2625J7479R66n497j4132j1659j0243k031L863
$$ 54963 55658 47634 47893 53569 62351 84976 102455 103421 97924 83792 72133 61890 59859 63722
11162F3722P413O729m078N836J4266K932Q622J8776J0475J6336K6682L7253N8247
$$ 63722 71135 77864 73786 79622 93888 96820 105442 124218 134693 151029 177711 214964 273211
11149B73211R8397J72135K98350M08804M09582K51088k7417k91391m07273l49664
$$ 273211 371608 543743 842093 1250897 1660479 1911567 1884150 1592759 1185486 835822
11139H35822k27802j31319p4575m6412k8887k6704k3491k2212j4847m497m855
$$ 835822 608020 476701 402126 355714 326827 300123 276632 254420 239573 235076 230221
11128B30221j0010j7171m091q941k814o172m873k478P4p039n957l501n477l472
$$ 230221 220211 203040 198949 190008 187194 181022 176149 173671 173745 166706 160749 157248 151771 148299
11114A48299j3p98k2219j7259K340K512M393o422n664k219j553o044q539k318
$$ 148299 148286 147488 125269 108010 110350 112862 117255 110833 105169 102950 101397 95353 86814 84496
11100H4496N899Q770M612J338O624j235K279M707l090m981o423j0027n890J920
$$ 84496 90395 99165 103777 105115 111739 110504 112783 117490 114400 109419 102996 92969 87079 88999
11086H8999R45N680J922o083J922j213o677k062M931J299J942P14N33N79m179
$$ 88999 89944 95624 97546 91463 93385 92172 85495 83433 88364 89663 91605 92319 92852 93431 89252
11071H9252l901l69l872m945k566J383m97J081l988J483M001j28k445Q145k338
$$ 89252 85351 84982 81110 76165 73599 74982 74485 75566 71578 73061 77062 76934 74489 82634 80296
11056H0296K918L093O780K039J074m75Q93Q57J58J722J3809J1884K719j191m854
$$ 80296 83214 86307 93087 95126 96200 95725 96618 97475 97633 99355 113164 125048 127767 126576 121722
11041A21722p290L179k340j627n889n661m315q700j1975p428k818p24p888O315
$$ 121722 114432 117611 115271 113644 107755 102094 97779 89079 77104 69676 66858 66134 58246 64561
11027F4561L619p316o242o820l806K097P535J1146J504J993J1479P380k266k999
$$ 64561 68180 60864 54622 47802 43996 46093 53628 64774 66278 68271 79750 87130 84864 81865
11013H1865n593O202Q11L828K941n95k793j617j931O039O4j072l679J001Q838
$$ 81865 76272 82474 83285 87113 90054 89459 86666 85049 83118 89157 89221 88149 84470 85471 94309
10998I4309J4502J1127Q270L389p304j1317K610K5411L6140K9583J7038J1506
$$ 94309 108811 119938 128208 131597 124293 112976 115586 140997 177137 206720 223758 235264
10986B35264P101n953j3274j3457j5591p164J350l216k112k816p208r632m124
$$ 235264 242365 236412 223138 209681 194090 186926 188276 185060 182948 180132 172924 163292 159168
10973A59168l504l847j92p132r387q433q945p335r16J6197J7968J2968Q22k572
$$ 159168 155664 151817 151625 144493 135106 126673 117728 110393 109477 125674 143642 156610 157432 154860
10959A54860p52k52r276q803p292j0332r78p73K51J979k49K017L427L653R671
$$ 154860 154108 153856 144580 135777 128485 118153 117175 116402 116653 118632 118383 120400 123827 127480 137151
10944A37151K0539K7472K3351J4063K963o482q646j2725n055L057J6430K3754
$$ 137151 157690 185162 208513 222576 225539 219057 210411 197686 192631 195688 212118 235872
10932B35872K4078K6317M2318N2968N8872N8581L2138l768m1272p7318q5284o6089
$$ 235872 259950 286267 328585 381553 440425 499006 531144 527376 486104 408786 323502 257413
10920B57413l1429j7461j7424j5595j5399j3885q226l363N259J1364j958k613
$$ 257413 225984 208523 191099 175504 160105 146220 137994 134631 139890 151254 149296 146683
10908A46683N680o2J616J5084J4561J7823J1180J396j8038j8874j1681q531q065
$$ 146683 152363 152301 153917 169001 183562 201385 212565 213961 195923 177049 165368 156837 148772
10895A48772n486n808r438j0438r262M129J1457J1777K0537J6102J7424K1533
$$ 148772 143286 137478 128040 117602 108340 112469 123926 135703 156240 172342 189766 211299
10883B11299J2748O597J2608L0381L4026J3465j2226m9714m8958k5235n394M483
$$ 211299 224047 230644 243252 273633 307659 321124 308898 259184 210226 184991 179597 184080
10871A84080N095k856j0984j3973j0593j1600q858m307L97Q204K0843M3648M6167
$$ 184080 189175 186319 175335 161362 150769 139169 130311 126004 126401 134605 155448 199096 245263
10858B45263L2524K1202J6389K2753J4354J0146J1023O788K1189K2465J0078L70
$$ 245263 277787 298989 315378 338131 352485 362631 373654 380442 401631 424096 434174 434544
10846D34544k272K466J0459J7546K9286L6866M2558N2505O9883R1884J06938J37373
$$ 434544 432272 434738 445197 462743 492029 528895 571453 623958 693841 785725 892663 1030036
10834A030036J76519K43297L77085O37610J105378J779194K268481K020959Q55143
$$ 1030036 1206555 1449852 1826937 2464547 3569925 5349119 7617600 9638559 10493702
10825A0493702q23402k072845k184323j529996q99879n37885l37562k13002j45127
$$ 10493702 9670300 7597455 5413132 3883136 2983257 2445372 2107810 1894808 1749681
10816A749681j14800j00409p4827o6387m9239l8146l2719j4374j3431k1962k1562
$$ 1749681 1634881 1534472 1459645 1393258 1344019 1305873 1273154 1258780 1245349 1223387 1201825
10805A201825j3107j0592j3670o158j8857j3489P584K2544J2504j3805l3878k6682
$$ 1201825 1188718 1178126 1164456 1158298 1139441 1125952 1133536 1156080 1168584 1154779 1120901 1094219
10793A094219j0226J3546L1057K8204L6539M5080L8730K9390J6120k767r906n228
$$ 1094219 1083993 1097539 1128596 1156800 1193339 1238419 1277149 1306539 1322659 1319892 1309986 1304758
10781A304758J6214L2114L7781L2679L3643L0157K7002K2721J0300n331J0779
$$ 1304758 1320972 1353086 1390867 1423546 1457189 1487346 1514348 1537069 1547369 1542038 1552817
10770A552817K4677N7570Q9957J13216J36179J50225J65131K10952K78542L98473
$$ 1552817 1577494 1635064 1725021 1838237 1974416 2124641 2289772 2500724 2779266 3177739
10760C177739N53805O54797O14350M02408J49216K3171J06423K93802M75245O42169
$$ 3177739 3731544 4386341 5000691 5403099 5552315 5575486 5681909 5975711 6450956 7093125
10750G093125P94312R69774J240668J674615K298349L113661M143010N560870
$$ 7093125 7887437 8857211 10097879 11772494 14070843 17184504 21327514 26888384
10742B6888384P831426J1932918J9759347L4040338N4619131P1332562O7835696
$$ 26888384 34719810 46652728 66412075 100452413 155071544 226404106 294239802
10735B94239802L8159716r354047n2837312p0933790n9464873l7986084k2394316
$$ 294239802 332399518 323045471 270208159 199274369 139809496 101823412 79429096
10728G9429096j4000678r457519o706488m966982l889418l201436k728707k384961
$$ 79429096 65428418 55970899 49264411 44297429 40408011 37206575 34477868 32092907
10720C2092907k106575j846615j616557j434372j263776j081988q53663n87264
$$ 32092907 29986332 28139717 26523160 25088788 23825012 22743024 21889361 21302097
10712B1302097l74787l39724m84068o84014p38394n90660l84635l40420m94796
$$ 21302097 20927310 20587586 20103518 19419504 18681110 18090450 17705815 17365395 16870599
10703A6870599p15688q02510p22365n62845m44644l74226l49653l51963l72647
$$ 16870599 16154911 15352401 14630036 14067191 13622547 13248321 12898668 12546705 12174058
10694A2174058l93982m12659m20341m16304m00283l72694l54850l52642l47138
$$ 12174058 11780076 11367417 10947076 10530772 10130489 9757795 9402945 9050303 8703165
10685H703165l20630k80676k36797k06830k00827j90161j88053j86952j86207
$$ 8703165 8382535 8101859 7865062 7658232 7457405 7267244 7079191 6892239 6706032
10676F706032j84255j78057j71103j54505j44716j46739j47940j56770j56740
$$ 6706032 6521777 6343720 6172617 6018112 5873396 5726657 5578717 5421947 5265207
10667E265207j59508j54618j41492j36791j36543j19387j07165j05646j02463
$$ 5265207 5105699 4951081 4809589 4672798 4536255 4416868 4309703 4204057 4101594
10658D101594j05448j09131j08087j01969r9076j02841r8587q8049q5691q4568
$$ 4101594 3996146 3887015 3778928 3676959 3577883 3475042 3376455 3288406 3202715 3118147
10648C118147q6185r2276r3865q3342q4305p5110p8363p6452p0789p1617n9022
$$ 3118147 3031962 2939686 2845821 2762479 2678174 2603064 2524701 2448249 2377460 2305843 2246821
10637B246821o5677o7414n1015l4665l7526m0729l9792l7714l0824l1789l2786
$$ 2246821 2181144 2113730 2062715 2028050 1990524 1949795 1910003 1872289 1841465 1809676 1776890
10626A776890l4230l6505m1550l0106k7520k4189j9939k5047l1965l5049m3621
$$ 1776890 1742660 1706155 1664605 1634499 1606979 1582790 1562851 1537804 1505839 1470790 1427169
10615A427169l3697j6726J5165M0325N9622L6970j3759o7679j03262j20823j12952
$$ 1427169 1393472 1376746 1391911 1432236 1491858 1528828 1515069 1447390 1344128 1223305 1110353
10604A110353q6738o8819n8490o1954o8954o4146n0659l7480k7870q809j3216
$$ 1110353 1023615 954796 896306 834352 765398 701252 650593 613113 585243 576434 563218
10593E63218k1059k9182l3131m6534m3546k9837k0332j4353j633K004O061J0067
$$ 563218 542159 512977 479846 433312 389766 359929 339597 325244 323611 325615 331676 341743
10581C41743J7213J9061R353M356o185o575r915J851P310j0802k3515k3497j2798
$$ 341743 358956 378017 387370 391726 385541 378966 369051 370902 378212 367410 343895 320398 307600
10568C07600o472l843P624J6109J1762l118j2114j3204r061k19Q797K3450L7911
$$ 307600 301128 297285 304909 321018 332780 329662 317548 304344 295283 295064 303861 327311 365222
10555C65222L5784K3203P62j1596p950r856m0028o7480p7549r1469q8987n7438
$$ 365222 401006 424209 424971 413375 405425 395569 355541 288061 210512 119043 30056 -27382
10543b7382J893M2721N2685N1210L4767K1255J5265Q789M956j003j1069j8329
$$ -27382 -25489 17232 69917 121127 155894 177149 192414 201203 206159 205156 194087 175758
10531A75758j3261N228J8726J2521L0511L6626J8229J2357k301j2058j3307p156
$$ 175758 162497 167725 186451 198972 229483 266109 284338 296695 294394 282336 269029 261873
10519B61873j0036p230n057r554j3713q560j0588Q66K000J3843K9522L2174K8461
$$ 261873 251837 244607 239550 229996 216283 207723 197135 198001 200001 213844 243366 275540 304001
10506C04001L1144K0831M469j6461k4336j2233Q855J3493K1334K7053K6317L7064
$$ 304001 335145 355976 360445 343984 319648 307415 316270 329763 351097 378150 404467 441531
10494D41531M4439N9149N1930L2392j1101n5968p9146p5643n0298k7043j8579
$$ 441531 485970 545119 597049 629441 618340 562372 483226 407583 357285 330242 311663
10483C11663k4668j9534j6730j4314K450N089O634K076m063m088r612o051L387
$$ 311663 286995 267461 250731 236417 238867 243956 250590 252666 248603 244515 234903 228852 232239
10470B32239Q390J8695J6461j772o852k5093l0044j8162L05R011K1922J9241M6808
$$ 232239 240629 259324 275785 274013 267161 242068 212024 193862 194167 203178 225100 244341 291149
10457B91149N9342M6499K5360j2289k5094J8885N0068N3332R902m2231p3703o8237
$$ 291149 350491 396990 422350 410061 384967 403852 453920 507252 517154 474923 401220 332983
10445C32983o1015m8963l4925j1065K730M812J8580J4039q321j4157j9814k3871
$$ 332983 271968 223005 188080 177015 179745 184557 203137 217176 208855 194698 174884 151013
10433A51013k0500k0501j2553k928r825q824O650L4623N4032N9236L2965J7061
$$ 151013 130513 110012 97459 94531 84706 75882 82532 117155 171187 230423 263388 280449
10421B80449J8319J6122J6827J8137K3530K8373K1969K6900K2429J0359O108J9184
$$ 280449 298768 314890 331717 349854 373384 401757 423726 450626 473055 483414 489522 508706
10409E08706J6679K3005L8129M9043O5889Q9944J13612J51847K05845L33613N70482
$$ 508706 525385 548390 586519 635562 701451 791395 905007 1056854 1262699 1596312 2166794
10398B166794R06145J186584J125444O07197j26408n94066m16864J99435O41821
$$ 2166794 3072939 4259523 5384967 5992164 5865756 5271690 4854826 5054261 5696082
10389E696082N36746o5770q07473j188300j044465o77754l96740k41372j50612
$$ 5696082 6232828 6167058 5359585 4171285 3126820 2449066 2052326 1810954 1660342
10380A660342j13772r1867p2188n5472m2335k1853K151p496k2451l0229l7885
$$ 1660342 1546570 1454703 1382515 1327043 1284708 1262855 1265006 1257510 1235059 1204830 1166945
10369A166945l2347j9856j8089k1461k5469k9280k812J1253N269J3931J7145J2833
$$ 1166945 1134598 1114742 1096653 1075192 1049723 1020443 1017631 1028884 1034153 1048084 1065229 1078062
10357A078062J5152J5077N442J4942M5190L8789K8221Q961r188j3025P003L2583
$$ 1078062 1093214 1108291 1113733 1128675 1173865 1212654 1240875 1249836 1240648 1227623 1234626 1267209
10345A267209M9867M0919K8363K8377K7745K8149K4950J9711Q639J1802K7624
$$ 1267209 1317076 1357995 1386358 1414735 1442480 1470629 1495579 1515290 1523929 1535731 1563355
10334A563355N9984R2122J18668J41702J57067J78613K19957K79758L97676O19644
$$ 1563355 1623339 1715461 1834129 1975831 2132898 2311511 2531468 2811226 3208902 3828546
10324C828546R10692J168528J230346J016317O23801K90957J28260J06944J19880
$$ 3828546 4739238 5907766 7138112 8154429 8778230 9069187 9197447 9304391 9424271
10315I424271K09590M59597R19892J532128K265641L146908M222786N738725Q374771
$$ 9424271 9633861 10093458 11013350 12545478 14811119 17958027 22180813 27919538 36294309
10306C6294309J3499686K3567341M1224605O3336104P5282852O2010188K3136615
$$ 36294309 49793995 73361336 114585941 177922045 253204897 315215085 338351700
10299C38351700k7691906o4992696p1504693n2763394l1594137j8468454j1599655
$$ 338351700 310659794 245667098 174162405 121399011 89804874 71336420 59736765
10292E9736765p839965n630733m265459l387643k762417k316086j927376j558553
$$ 59736765 51896800 46266067 42000608 38612965 35850548 33534462 31607086 30048533
10284C0048533j285083j179156j224462j260784j152482r44612q37047r36597
$$ 30048533 28763450 27584294 26359832 25099048 23946566 23001954 22164907 21228310
10276B1228310j096207j151879j031806q47517o97592o10844n42303m87502m18019
$$ 21228310 20132103 18980224 17948418 17100901 16403309 15792465 15250162 14762660 14344641
10267A4344641l69426l33197l15474k88579k81977k85980l10506l47321l78664
$$ 14344641 13975215 13642018 13326544 13037965 12755988 12470008 12159502 11812181 11433517
10258A1433517m07713m14381m09893l82610l65180l54478l49788l35141k99344
$$ 11433517 11025804 10611423 10201530 9818920 9453740 9099262 8749474 8414333 8114989
10249H114989k59407k20037j96509j89765j83057j66058j63391j69196j68234
$$ 8114989 7855582 7635545 7439036 7249271 7066214 6900156 6736765 6567569 6399335
10240F399335j64891j66395j54010j52883j63086j63462j55463j60733j57466
$$ 6399335 6234444 6068049 5914039 5761156 5598070 5434608 5279145 5118412 4960946
10231D960946j49979j46626j38815j25527j13041j11247r5908j01553j02463j11489
$$ 4960946 4810967 4664341 4525526 4399999 4286958 4175711 4079803 3978250 3875787 3764298
10221C764298j07628r6774q1511p6365p0235p1674p6466q7111j02318r8852j00078
$$ 3764298 3656670 3559896 3478385 3402020 3331785 3260111 3183645 3096534 2994216 2895364 2795286
10210B795286r4963q0962q7837q0102q0059p9578o4205o1760n4874l7430l6229
$$ 2795286 2700323 2619361 2531524 2451422 2371363 2291785 2227580 2165820 2110946 2073516 2037287
10199B037287n1893m6522m0213m4409m2089k7295l4277l5124m3296l4735l3995
$$ 2037287 1985394 1938872 1898659 1854250 1812161 1784866 1750589 1715465 1672169 1637434 1603439
10188A603439l7380l6111k2964k2428l2202l4726l9499m1103j9882K285K4604
$$ 1603439 1566059 1529948 1506984 1484556 1452354 1417628 1378129 1337026 1317144 1319429 1344033
10177A344033M0065M6180J4279l2353q1712j02611j17692j08981r0174o9100n8321
$$ 1344033 1384098 1430278 1444557 1412204 1330492 1227881 1110189 1001208 911034 841934 783613
10166G83613n8926m8446m2451k5593j8178j7031j9031j6521k5327l9908m0164
$$ 783613 724687 676241 633790 608197 590019 572988 553957 537436 512109 472201 432037
10155D32037m0586l1940k7670k2841j6177j1971N561J4359J6068J7411O825J95
$$ 432037 391451 359511 331841 309000 292823 280852 286413 300772 316840 334251 341076 341271
10143C41271n030p206N80M232m025j5027j3171k7362k6516j4600K808P175J6722
$$ 341271 336241 329035 329615 333847 329822 314795 301624 274262 247746 233146 235954 243129 259851
10130B59851J1281O196l572k0058j3148l077N775J5539R600N918m055k1216j9794
$$ 259851 271132 277328 273756 253698 240550 237473 243248 258787 268387 274305 270250 249034 229240
10117B29240j9845p707p856k7338o0371q6387r1780p4738k8407J7948N4338O3735
$$ 229240 209395 201688 193832 166494 106123 19736 -72044 -146782 -175189 -157241 -102903 -39168
10105c9168N3777M0331K4063R955J3475Q459P94p681j1370j0751o291Q742J0973
$$ -39168 14609 54940 79003 88958 102433 110892 111686 104005 92635 81884 75593 84335 95308
10092I5308K2998K4943J9869P935L312k342k72L525j651p635n345Q31r100q329
$$ 95308 118306 143249 163118 171053 174365 172023 171751 175276 173625 165990 160645 161476 152376 144047
10078A44047r903j1917n640j560O628R028M209J1660Q822J127M360P67q70o69
$$ 144047 134144 122227 116587 115027 121655 130683 134892 146552 155374 156501 160861 161628 160758 160089
10064A60089k327p057p874L01l399k2055j1155P08J3895N158P334R880k522q57
$$ 160089 157762 150705 142831 143132 139733 117678 106523 107231 121126 126284 133618 143498 140976 140119
10050A40119L353N54j974k182K542J981l347m15J112K126o243p136m053o755J519
$$ 140119 143472 144026 142052 139870 142412 144393 141046 140631 141743 143869 137626 130490 126437 119682 121201
10035A21201p309j4924o944j0373o803k401q764j161j542J495K00j403M223K466
$$ 121201 113892 98968 92024 81651 74848 72447 63683 62522 60980 62475 62675 61272 65495 67961
10021F7961k009P09o69J675P927L159k61r645j971M344O521p136j5327m676L919
$$ 67961 65952 66661 65992 67667 75594 78753 78492 68847 66876 71220 77741 70605 55278 50602 54521
10006E4521J343K491K314j0724r645j4621r333p384j0650k328R258J747r131j1264
$$ 54521 55864 58355 60669 49945 40300 25679 16346 8962 -1688 -4016 5242 6989 -2142 -13406
9992a3406m759Q289J8201K1406J4118Q759l515j4278k651J0050O861k904p49n321
$$ -13406 -18165 -9876 8325 29731 43849 52608 49093 34815 32164 42214 49075 46171 45422 40101
9978D0101o5o831p435l392J506O932L123L29j213p327l529j645L76O268J724o207
$$ 40101 40036 33205 25770 22378 23884 30816 33939 34268 33055 25728 22199 20554 20930 27198 28922 22715
9962B2715n617q986j726M671M170M66O088JM908l710n219j553j314o705n141L100
$$ 22715 17098 8112 6386 11057 15227 15693 21781 21782 26690 22980 17761 16208 14894 8189 3048 6148
9946F148Q579L617n875o468O503K630o870m386M144J4943O116K406J589o686J440
$$ 6148 14727 18344 12469 6001 12504 15134 8264 3878 8022 22965 29081 31487 33076 26390 27830
9931B7830O742j895K060K868Q188P422J397n016j0556p305o404R13P54K719L047
$$ 27830 34572 32677 34737 37605 45793 53215 54612 49596 39040 31735 25331 26244 26998 29717 32764
9916C2764l767L28o670M3K027Q370J2781O813L009j432J222L345p116P358J8958
$$ 32764 28997 29325 22655 22698 24725 33095 45876 52689 55698 54266 55488 58833 51717 59075 78033
9901G8033J8546K2868K1944L4000L8128N8349J15037K19851L50486M29432L71806
$$ 78033 96579 119447 141391 175391 213519 271868 386905 606756 957242 1386674 1758480
9890A758480J43870j64387l70494l96132k80717j65920j06169o6103m9671l1995
$$ 1758480 1902350 1737963 1367469 971337 690620 524700 418531 352428 302757 270762
9880B70762k2190j1997j2899j1734j4797p574M54p941j5282j2018p48O728K7557
$$ 270762 248572 236575 223676 211942 197145 189571 190025 182084 166802 154784 154036 160764 188321
9867A88321L6380K4806l650l7850l5480k8970j4035j662o784m063P80k30p137
$$ 188321 224701 249507 245857 208007 172527 143557 129522 127860 121076 117013 117793 117563 110426
9854A10426r492n79L18k421p317j2853k368O196R812R02j302k19K849l797Q662
$$ 110426 100934 100355 100673 98252 90935 78082 75714 81910 91722 92624 91322 91103 93952 90155 98817
9839I8817L662l668p689n991k523k3O08Q069K432k276k304k081l054m851k54N822
$$ 98817 102479 98811 91122 85131 82608 82585 83193 91262 93694 91418 89114 87033 83979 79128 78874 84696
9823H4696Q927J336k537m877m961l464l746k320N095J1499p63Q74O730j29j622
$$ 84696 93623 94959 92422 87545 82584 79120 75374 73054 78149 89648 88885 89759 96489 96360 94738
9808I4738o189l848K054P967L634m281J278L337M31o920k048N540L487Q244M585
$$ 94738 88549 84701 86755 94722 98356 94075 95353 98690 99121 92201 90153 95693 99180 107424 112009
9793A12009j555M325N805Q002J5010K187O84N599N402O52N765O360M717j80O257
$$ 112009 110454 114779 120584 128586 143596 145783 146467 152066 157468 158120 163885 170245 174962 174782 181039
9778A81039P954Q683J4090J7434J0324J4229J2409P138J1631J0470R161R751J0476
$$ 181039 188993 197676 211766 229200 239524 253753 266162 273300 284931 295401 304562 314313 324789
9765C24789J9277K2801K5972K4894J6856J7890K0571K2259K2555J9175L1414K8032
$$ 324789 344066 366867 392839 417733 434589 452479 473050 495309 517864 537039 568453 596485
9753E96485K9355K0211K0861K4258K7107L6258L0959J3691O933J5757J3709L462
$$ 596485 625840 646051 666912 691170 718277 754535 785494 799185 806118 821875 835584 839046
9741H39046N156J973K663j5713r698j4831j0390j3993k1475k0634k5264k2519
$$ 839046 844202 846175 848838 833125 823427 808596 798206 784213 762738 742104 716840 694321
9729F94321k3156j4909j9707k7140j9766j9711j5497j8904k5786k3829j5698j0531
$$ 694321 671165 656256 636549 609409 589643 569932 554435 535531 509745 485916 470218 459687
9717D59687j0263j4162j6938j6841j8758j4050r013l437o668j4539r727j2770
$$ 459687 449424 435262 418324 401483 382725 368675 359662 356225 349557 335018 325291 312521
9705C12521j7988j3259j7600r993j983k594p728p843m528Q30k288n619n187j3366
$$ 312521 294533 281274 263674 253681 251698 249104 241376 233533 229005 229835 227547 221928 216741 203375
9691B03375m579J386M961N863J6181J0143J6241J5514K375L322j222j2302k3230
$$ 203375 198796 200182 205143 211006 227187 237330 253571 269085 271460 274782 273560 261258 238028
9678B38028k3253k0828j3162j4001m671n516q375j548k922m873r558l792k007
$$ 238028 214775 193947 180785 166784 162113 156597 148222 146674 143752 138879 129321 125529 123522
9665A23522l950p917K316M316k469m811j1771J745n40n95O458L573p70q574l306
$$ 123522 119572 111655 113971 118287 115818 111007 99236 100981 100441 99846 106304 109877 109107 100533 97227
9650I7227O79L46k196L781l904O45l316k840k290m131l877J452m122L421J1824
$$ 97227 97906 98252 96056 99837 95933 96578 93262 90422 88132 84001 80124 81576 77454 80875 92699
9635I2699J3367Q570J433q871j0537j4445j0871P6o63n635o819L374l76l277p676
$$ 92699 106066 114636 116069 107198 96661 82216 71345 71421 70758 65123 58304 61678 61302 58025 50349
9620E0349J264q304j132N795J387K756L520m05n490l808l740j647L307j089o134
$$ 50349 51613 43309 42177 47972 49359 52115 55635 55230 49740 45932 42192 40545 43852 42763 36629
9605C6629o945k398R32J770m063j170l526K619J0688M76j325J0314J9459J1092
$$ 36629 29684 27286 28218 29988 25925 24755 21229 23848 34536 35012 33687 44001 63460 74552
9591G4552J2785L122j8278j7799j2948n371J215l041m680k245L845N758K711l135
$$ 74552 87337 90459 72181 54382 41434 36063 37278 34237 29557 27312 31157 36915 39626 36491
9577C6491k687l372q168j648N572m561j463L70M672J831p204K127L938k826k976
$$ 36491 33804 30432 22264 20616 26188 21627 20164 20534 25206 27037 19833 21960 25898 23072 20096
9562B0096M571M293p025p706M90J382j590K673M131q16j029J231j615j731O58
$$ 20096 24667 28960 21935 14229 14719 16101 14511 17184 21315 20499 19470 20701 19086 17355 18013
9547A8013n874j045R13O958O641q971k608L535k901p49R852Q745n721l876j2718
$$ 18013 12139 11094 12007 18965 25606 16635 14027 17562 14661 13912 23764 32509 26788 22912 10194
9532A0194n389n1o96R252J191j311M498n672k408K136j025o414O550l854P2J925
$$ 10194 4805 4754 4058 13310 14501 13190 17688 12016 9608 11744 10719 4305 10855 7001 7073 8998
9516H998j179O983K595k685p757m191L454J713n002Q1O008K304r76j0031j657
$$ 8998 7819 14802 17397 14712 6955 2764 6218 7931 2929 3010 9018 11322 10346 315 -1342
9501a342J857O215O714j233j558n08l636n142l179J746q056p484J494J0831M366
$$ -1342 515 6730 13444 12211 10653 10145 6509 1367 -1812 -66 -8122 -15606 -14112 -3281 1085
9486A085L962j403k432l446K672P035O980O75R376K189N223J0556J6985K3480
$$ 1085 5047 3644 1212 -2234 438 7473 14453 15128 24504 26693 31916 42472 59457 82937
9472H2937L2061L2007J5054J1910j0683k7268l3250k6914j9769j0928k854l145
$$ 82937 114998 147005 162059 173969 163286 136018 102768 75854 56085 45157 42303 39158
9460C9158K83k6m419p875l364j931m146k108l195j924K77M321j123k786K545L265
$$ 39158 39441 39415 34996 27121 23757 21826 17680 15572 12377 10453 10730 15051 13928 11142 13687 16952
9444A6952L701l430q333n175P74O11Q20P677P200p45j4567j7117q792j1155L325
$$ 16952 20653 17223 8890 3715 4489 5100 5920 13597 20797 20052 5485 -11632 -20424 -31579 -28254
9429b8254Q720J6631J1674J825o614Q03l199r79m294p637M501m50M508l008P07
$$ -28254 -19534 -2903 8771 10596 3982 4785 1586 607 -3687 -11324 -6823 -7273 -2765 -5773 -5066
9414e066O202J116m365M251L125j627l873K702j803j635O707k670n036K945M321
$$ -5066 1136 2252 -2113 2138 5263 3636 -237 2465 662 -973 5734 3064 -1972 973 5294
9399E294J32P40k559K73l469n112M154L306k793r003p73J1924M336m216k263J606
$$ 5294 5426 6166 3607 3880 411 -4701 -547 2759 -34 -9037 -9810 2114 6450 2234 -29 1577
9383A577Q80n558p910P685N886j43q8J596j013N04o963j0129J143R38l026L480
$$ 1577 2457 -3101 -11011 -3326 2560 2417 2329 3925 2912 3416 -3547 -13676 -12533 -11595 -14621 -11141
9367a1141O174k884j475K283j079n142N11P805M311k132k950J03j409N050J090
$$ -11141 -4967 -7851 -9326 -7043 -8122 -13264 -12753 -4948 -637 -2769 -5719 -5616 -7025 -1975 -885
9352h85p81l623L579K627n740o031L550p60m979K82Q149N641r351m909L697J092
$$ -885 -1666 -5289 -1710 917 -4823 -10854 -7304 -8064 -13043 -12761 -4612 1029 -8322 -13231 -9534 -8442
9336h442K955J746k896J66Q998J2409R293n727r842o905O18L80n848j308K654
$$ -8442 -5487 -3741 -6637 -6471 2527 14936 24229 18502 8660 1755 2373 2753 -3095 -4403 -1749
9321a749k730l690j687k523m140n88K230k315M570Q156P070K481j421q664m680
$$ -1749 -4479 -8169 -9856 -12379 -16519 -17107 -14877 -17192 -12622 -4466 2604 5085 3664 -5000 -9680
9306i680J121J549k491l082K15K111P816k966k289l482K378J999J685O651L022
$$ -9680 -8559 -7010 -9501 -12583 -12368 -10257 -2441 -5407 -7696 -11178 -8800 -6801 -5116 1535 4557
9291D557k249p907K107K650K862m306K57q41L214M50p86N66Q017K976J320o978
$$ 4557 2308 -5599 -3492 -842 2020 -2286 -2029 -2870 344 794 8 574 8591 11567 12887 5909
9275E909k810m083l803N55P54j78k565J618j557J976M314q58q160L49N080k07
$$ 5909 3099 -984 -4787 -4232 -3478 -3656 -6221 -4603 -6160 -4184 130 -728 -8888 -8539 -3459 -3666
9259c666Q42j71o142l279m40N868l50L946K229Q83L909N38p210q201K6L741o89
$$ -3666 -2824 -2995 -9137 -12416 -12856 -6988 -7338 -3392 -1163 -280 3629 4167 -3043 -11244 -11218 -7477 -8166
9242h166n567j624M747Q483j331k715j622L17k724L863Q149M047k23n540j744
$$ -8166 -13733 -15357 -10610 -2127 -3458 -6173 -7795 -7478 -10202 -6339 1810 5857 5634 94 -1650
9227a650l52K267M827M217n028n966k358k774j809L79J723J683K938J839n92k458
$$ -1650 -2002 265 5092 9309 4281 -1685 -4043 -6817 -8626 -8247 -6524 -4841 -1903 -64 -656 -3114
9211c114J017j190L938K700j856m231L777J896M008N545J891m375q614m986J354
$$ -3114 -2097 -3287 651 3351 1495 -2736 1041 2937 6945 12490 14381 10006 1392 -3594 -2240
9196b240J236L029J352J201j777J248J67R57k663k039M168J688j0095J323n59
$$ -2240 -1004 2025 3377 4578 2801 4049 4216 5173 2510 471 4639 6327 -3768 -2445 -3004
9181c004j372j804k234Q96k582m27N87M23P754L506j211j329K83N335o426p710
$$ -3004 -4376 -6180 -8414 -7518 -10100 -10527 -9940 -9517 -1763 1743 532 -797 -514 4821 -1605 -9315
9165i315J324K736L439k371K98K944r10J789O322k054l288N155L886n049p305
$$ -9315 -7991 -5255 -1816 -4187 -3889 -945 -1855 -66 6256 4202 914 6069 9955 4906 -2399
9150b399L28j820k237j310j291K763L913L756j090l431J030l66K028K626k16r341
$$ -2399 -2071 -3891 -6128 -7438 -8729 -5966 -2053 1703 613 -2818 -1788 -2154 -126 2500 2284 -7057
9134g057O236k019L019L957O11j602J281J472J055o198j5089l797P549N643J128
$$ -7057 -821 -2840 179 4136 4747 3145 4426 5898 6953 755 -14334 -18131 -10582 -4939 -3811
9119c811L595o527n055N143m56l968k91K377k137o662M742L881L331K168j411
$$ -3811 -216 -6743 -11798 -6655 -7111 -11079 -11370 -8993 -11130 -17792 -13050 -9169 -5838 -3670 -5081
9104e081k448N114l223J469J884P73p44p60k669o823mK143k291P661J2281p64
$$ -5081 -7529 -2415 -5638 -4169 -2285 -1512 -2256 -3016 -5685 -12508 -12512 -10369 -12660 -4999 7282 6518
9088F518o641o076N059P368Q057q682r281l230r29k926k271M000K683j911m554
$$ 6518 -123 -6199 -1140 6228 14285 5603 -3678 -6908 -7837 -10763 -13034 -9034 -6351 -8262 -12816
9073a2816k471L079J936K429j712M427O010q216n801Q558M973M741n699m728q94
$$ -12816 -15287 -12208 -10272 -7843 -9555 -5128 882 -7334 -13135 -4577 396 5137 -562 -5290 -6184
9058f184L300Q46n147l718q47o643M75J844L412M882K947K520Q494m158q333k954
$$ -6184 -2884 -2038 -7185 -10903 -11750 -18393 -17918 -16074 -12662 -7780 -4833 -2313 6181 2023 -6310 -9264
9042i264J040K7L984L450K940l043j465K822q10l502P26K781m735j541J50L237
$$ -9264 -8224 -8197 -4213 -763 2177 -866 -2331 491 -319 -3821 -3095 -314 -5049 -6590 -6440 -3203
9026c203n992l897k391l584M704M487L588L485j573J65R129O391M901J507j833
$$ -3203 -9195 -13092 -15483 -19067 -14363 -9876 -6288 -2803 -4376 -4211 4918 11309 16210 17717 15884
9011A5884k97l880q866p626K03N031J006o546L273p270L4J3856K963O456l615
$$ 15884 15587 11707 2841 -4785 -4582 449 1455 -5091 -1818 -9088 -9054 4802 7765 14221 10606
8996A0606o647k573m415o325o912l930P283M156L339L872J368J696P305N919L693
$$ 10606 3959 1386 -3029 -9354 -16266 -20196 -12913 -8757 -5418 -1546 -178 1518 8823 14742 18435
8981A8435l911k307l856j824j808l932l81P027j456l84J396L089M189O28P359
$$ 18435 14524 12217 8361 6537 4729 797 416 7443 5987 5603 6999 10088 14277 14905 22264
8966B2264J636o979k419l796r431q118L990J0842j025l051o700j1855o255M019
$$ 22264 23900 16921 14502 10706 1275 -6843 -2853 7989 6964 3913 -2787 -14642 -20897 -16878
8952a6878L352J1748K179J438o900q326j754M49O18K223j381Q774O355j806l551
$$ -16878 -13526 -1778 401 1839 -5061 -13387 -15141 -14692 -14074 -11851 -13232 -4458 1897 91 -3460
8937c460n637L959o577L33L849L239J410J694k014n640K738K981M007L389l21
$$ -3460 -9097 -5138 -11715 -11382 -7533 -4294 -2884 -1190 -3204 -8844 -6106 -3125 882 4271 3950
8922C950k071p94m132l04n664o192J359N540l998j292L269J803K741L119o036
$$ 3950 1879 1085 -3047 -3351 -9015 -15207 -13848 -8308 -12306 -13598 -10329 -8526 -5785 -2666 -8702
8907h702L373M677J361m383K82m607R94l926k176N68N400M776M564m409j043n89
$$ -8702 -5329 -652 709 -3674 -3392 -7999 -7005 -10931 -13107 -12539 -7139 -2363 2201 -2208 -3251 -3840
8891c840m195j903M758q50J078N391K070K002K488k478l22L37l122p348M178K659
$$ -3840 -8035 -9938 -5180 -6030 -4952 439 2509 4511 6999 4521 4199 4536 1414 -5934 -1756 903
8875I03l368m577L103M785J085p292L775J430K421o533m871l184j24M793P209
$$ 903 -2465 -7042 -3939 846 1931 -5361 -1586 -156 2265 -4268 -9139 -12323 -12447 -7654 -445
8860d45k478J623K128m338j2774p455J11j078P948N753K396J164Q053M90J35O165
$$ -445 -2923 -1300 828 -3510 -16284 -23739 -23628 -24706 -16758 -11005 -8609 -7445 608 1098 1233 7398
8844G398o27j492N385k248j025m038k742m324N603M664j130l307K859J967k639
$$ 7398 6771 5279 10664 8416 7391 3353 611 -3713 1890 6554 5424 2117 4976 6943 4304
8829D304k857N16K067m29J78l54k705l225j084r10K294n938j387O064N108K27
$$ 4304 1447 1963 4030 3601 3779 3425 720 -2505 -3589 -4499 -2205 -8143 -9530 -3466 1642 1869
8813A869n893j727r05k928p46P957K961j920M638J618k854m401L778J2108j732
$$ 1869 -4024 -5751 -6656 -9584 -10330 -2373 588 -1332 3306 4924 2070 -2331 1447 13555 11823
8798A1823l239j30k242n224j0730k331m41M842J0941n894k801N980J003Q17m913
$$ 11823 8584 8454 6212 988 -9742 -12073 -12514 -7672 3269 -2625 -5426 554 1557 2374 -2539
8783b539O394L262l687l5M465q90l786j891L391l754j0833l189N132l018l242
$$ -2539 3855 7117 3430 3395 7860 6970 3184 1293 4684 930 -9903 -13092 -7960 -10978 -14220
8768a4220l40M665l065J14N023M379M718M380K393j624m695l029j383k101j829
$$ -14220 -14560 -9895 -12960 -12846 -7823 -3444 1274 5654 8047 6423 1728 -1301 -2684 -4785 -6614
8753f614M003J939J524l15k564P407K757K220J0006O990J0247J8128Q583p201
$$ -6614 -2611 -672 852 537 -2027 5380 8137 10357 20363 27353 37600 55728 64311 57110
8739E7110j2726k0870q411n625K739l057n883L645L160J976o022M203J141q084
$$ 57110 44384 23514 15103 9478 12217 9160 3277 6922 10082 12058 6036 10239 11380 3296
8725C296r10N025n65k18j128J538O993L542K635m951q857l471j692N43j0724l963
$$ 3296 2386 7411 6846 6628 5500 7038 14031 17573 20208 15257 6400 2929 1237 1780 -8944 -12907
8709a2907O734O450M715P550l213j502M935L988K487J2617K3375L8710L5339J5972
$$ -12907 -6173 277 4992 12542 9329 7827 12762 16750 19237 31854 55229 93939 129278 145250
8695A45250j6155l9856l2019j9657j2702J781r591o183j1548m980L035J2787N02
$$ 145250 129095 89239 57220 37563 24861 26642 17051 10868 -680 -5660 -2625 10162 10664
8682A0664L301r14N602P296K530l822j0299l410j077n209j204O193m215p08K138
$$ 10664 13965 13051 18653 25949 28479 24657 14358 10948 9871 4662 3458 9651 5436 4728 6866
8667F866k516l318O011K392N904J0722J806n091j868p28L900J438j017J2095K2134
$$ 6866 4350 1032 7043 9435 15339 26061 27867 22776 20908 20180 24080 25518 24501 36596 58730
8652E8730R532J861q516k1346j4656j0723J70J753m991K80M25O156R067j732l823
$$ 58730 68262 70123 61607 40261 25605 14882 15052 16805 11814 12094 12519 18675 27742 26010 22187
8637B2187M635r552m174L431o147l033j722m127n91k198L668j018r44J792L959
$$ 22187 26822 17270 13096 16527 10380 7347 5625 1498 907 -1291 2377 1359 415 2207 6166
8622F166M738O099K716m133j017m661K38L180J593q36J168M774n436q986J029
$$ 6166 10904 17003 19719 15586 14569 9908 10146 13326 14919 14083 15251 20025 14589 5603 6632
8607F632k309n846L169Q110K979n724J466j109N100Q73m172K691m5K517M952l357
$$ 6632 4323 -1523 1646 9756 12735 7011 8477 7368 12468 13341 9169 11860 11815 14332 19284 15927
8591A5927m346N932J1732M33q231p636q218k182M71O933L741J955K35M817j774
$$ 15927 11581 17513 29245 29678 21447 13811 5593 3411 3882 10815 14556 16511 16746 21563 19789
8576A9789k364l201n125M272K865m053j292j407M723j160l596o670m164k516R4
$$ 19789 17425 14224 9099 13371 16236 12183 10891 9484 14207 13047 9451 2781 -1383 -3899 -3805
8561c805K516l547M93N623K355k887J035n299L83N614N204Q79j196P593O088J1186
$$ -3805 -1289 -4836 -4343 1280 3635 748 1783 -3516 -3133 2481 7685 8564 7368 14961 21049 32235
8545C2235J2580R713O46k536j4222r966k993n958m777M501n6j265m82j887j516
$$ 32235 44815 54528 55174 52638 38416 28450 25457 19499 14722 19223 19167 17902 17420 15533 14017
8530A4017l686l729L034N701q368m452J899M559j905l393J301M497o450k429N022
$$ 14017 10331 6602 9636 15337 6969 2517 4416 8975 7070 3677 4978 9475 3025 596 5618
8515E618O093k909p389M94r67p482L171L352M993k706J236J900M220M575M032
$$ 5618 11711 8802 1413 1907 940 -6542 -3371 -19 4974 2268 3504 5404 9624 14199 18231
8500A8231K497j29j239l193l947j29p772J057L655K498R107n865q235l10m915
$$ 18231 20728 20599 19360 16167 12220 12091 4319 5376 9031 11529 20636 14771 6536 6226 1311
8485A311j718K984l712M052R57j596n606K771K619j347N132Q829M078O009J1576
$$ 1311 -407 2577 -1135 2917 3874 2278 -3328 -557 2062 715 5847 14676 18754 24763 36339
8470C6339O437n100m181j0333j3435k771L265j630N33k730l238k620m995L306
$$ 36339 42776 37676 33495 23162 9727 6956 10221 8591 9124 6394 3156 536 -4459 -1153
8456a153L099J994p00L442J060o099J282k682m629l136k01N28N337L248N44p218
$$ -1153 1946 3940 3240 6682 7742 1643 2925 243 -4386 -7522 -7723 -7195 -1858 1390 1934 -5284
8440e284k924P257R835N875m327m059K718k825J677Q30l173K09Q213J8178J0682
$$ -5284 -8208 -951 8884 14759 10432 6373 9091 6266 7943 8773 5600 5809 14022 32200 42882
8425D2882P156p48j3453r245n841n136l968n846k065L750l822p990N596R492k796
$$ 42882 50038 49290 35837 26592 20751 15615 11647 5801 3736 7486 3664 -4326 1270 10762 7966
8410G966q977p93J673O53j131J493J063r826l875N879O296L535p33L890k567l245
$$ 7966 -1011 -1804 -131 522 -609 884 1947 -7879 -11754 -5875 421 3956 3223 7113 4546 1301
8394A301n899J366K068l74K425J367k090j704l361m974M740L235M816J0726M393
$$ 1301 -4598 -3232 -1164 -1538 887 2254 164 -1540 -4901 -9875 -5135 -1900 2916 13642 18035
8379A8035m824M970o184r184m161j150J199O042O068J188l302n987K418j708l158
$$ 18035 13211 18181 11997 2813 -1348 -2498 -1299 4743 10811 11999 8697 2710 5128 3420 262
8364B62k703J670j828K898K154p049k239M541K59N067R127m04p496m544j100p00
$$ 262 -2441 -771 -2599 299 2453 -4596 -6835 -2294 -2035 3032 12159 11755 4259 -285 -1385 -2085
8348b085J927l103l740j129k685N394K113q086K198K90K448n88o58J141k090O099
$$ -2085 -158 -3261 -7001 -8130 -10815 -5421 -3308 -11394 -9196 -8906 -6458 -7046 -7704 -6563 -8653 -2554
8332b554j156j039k733q56J245o835k724K901J4094L104j94k970j692M076J64
$$ -2554 -3710 -4749 -7482 -8338 -7093 -13928 -16652 -13751 343 3447 3253 283 -1409 2667 2831
8317B831k792n365J304P541l724p646r99J0788K926O806O57l668l059L220n410
$$ 2831 39 -5326 -4022 3519 -205 -7851 -8850 1938 4864 11670 12327 8659 5600 8820 3410
8302C410J312n505l84N238J233l599L508J246P40l057m183j0301o80N301N629
$$ 3410 4722 -783 -1167 4071 5304 1705 5213 6459 7199 4142 -41 -10342 -11022 -5721 -92
8287i2R89l274l885l746k649m77O293J232o388J717R289M482l886M00J754K273
$$ -92 897 -2377 -6262 -10008 -12657 -13134 -6841 -5609 -11997 -10280 -991 3491 -395 5 1759 4032
8271D032l039k673L579j088n117q2O18o195N099K682L7N433M415q889M66j196
$$ 4032 993 -1680 1899 811 -4306 -4388 -3770 -9965 -4866 -2184 -2147 3286 7701 -1188 -722 -1918
8255a918o029o89Q5N3N472J140q866l013J112l15n877K2O462N651R59L029l5Q49
$$ -1918 -7947 -8636 -8551 -8498 -3026 -1886 -10752 -13765 -12653 -12968 -18845 -18823 -12361 -6710 -5751 -2722 -2757 -1908
8237a908o544Q33M16J579l157L695K120J186L902k28l176k03p0M674M773n116
$$ -1908 -8452 -7619 -7203 -5624 -8781 -5086 -2966 -1780 2122 1894 -1282 -1485 -1555 3119 7892 2776
8221B776m606N887K70J98o61K973j729k653L411k549p846L423J252k903k810q06
$$ 2776 -1830 4057 4327 4525 3864 6837 5108 2455 5866 3317 -4529 -1106 146 -2757 -5567 -6373
8205f373K243j189j340k994j527j666O471l62j537Q00j824n503L214K198L785
$$ -6373 -4130 -5319 -6659 -9653 -11180 -12846 -6375 -6737 -8274 -7474 -9298 -14801 -11587 -9389 -5604
8190e604L892m46P612K969n553m691L733L34N821n241n918n215p091K841P122
$$ -5604 -1712 -2158 5454 8423 2870 -1821 1912 2246 8067 2826 -3092 -8307 -15398 -12557 -5435
8175e435J2074M504k763k939j578r190o415K191P175L055l348J250j055J99K432
$$ -5435 6639 11143 8380 5441 3863 -5327 -11742 -9551 -2376 679 -2669 -1419 -2474 -2275 157
8160A57J0749L732k099m04l962j0325m710p171K763J0500M363m525m815l775K670
$$ 157 10906 14638 12539 12135 8173 -2152 -6862 -14033 -11270 -770 3593 -932 -5747 -9522 -6852
8145f852J812M621K077K692j100K227j720k60n977J637l152l932l342m47M745
$$ -6852 -5040 -419 1658 4350 3250 5477 3757 3497 -2480 -843 -3995 -7927 -11269 -11716 -6971
8130f971Q656N236N513m284L465O097m861p647j157l774l454M71j758K009N445
$$ -6971 1685 6921 12434 8150 11615 17712 12851 5204 4047 273 -3181 -2710 -4468 -2459 2986
8115B986o51l919o816m294j287O784O395k07q13l068L435n622l079M266r20j016
$$ 2986 2335 -1584 -8400 -12694 -13981 -7197 -802 -1009 -1822 -4890 -1455 -7077 -10156 -5890 -6810 -7826
8099g826O17M063n330j858O22K122L150K191N127M337p463k24o3L411J241j282
$$ -7826 -7209 -3146 -8476 -10334 -9712 -7590 -4440 -2249 2878 7215 -248 -472 -535 2876 4117 2835
8083B835p731P422Q433J463p822r424k69l095K183J2353K515k568m490m618q19
$$ 2835 -4896 2526 10959 12422 4600 -4824 -5093 -8188 -6005 6348 8863 6295 1805 -2813 -3632
8068c632O272l77m148J862n483n503N340L254L725m845j913N737k892l613k218
$$ -3632 2640 2263 -1885 -23 -5506 -11009 -5669 -2415 1310 -3535 -5448 289 -2603 -6216 -8434
8053h434j80j415J580K0k26N437P337P931m783j1326m28L191L275K521m11p377
$$ -8434 -8614 -10029 -8449 -8429 -8655 -3218 4119 12050 7267 -4059 -4487 -1296 1979 4500 4089 -3288
8037c288j0237K059Q192Q201o182o651N7o91L813M293k01n68j730j391N187o1
$$ -3288 -13525 -11466 -3274 4927 -1255 -7906 -7849 -8540 -4727 -434 -635 -1203 -2933 -4324 863 802
8021H02n033m811m305Q535Q85K77K347M385j942p147J765K360j065M70M301q784
$$ 802 -4231 -9042 -13347 -4812 -3927 -3650 -1303 3082 1140 -6007 -4242 -1882 -2947 -2477 1824 -6960
8005f960j411K584O82j368L509L383P375o25n583l056n22Q25k259L917m89o19
$$ -6960 -8371 -5787 -5105 -6473 -2964 419 7794 7169 1586 -1470 -1992 -1167 -3426 491 2 -617
7989f17p603J223M748K571k221k483L976L675m010j51k5J688N186j662p084o104
$$ -617 -8220 -6997 -2249 322 -1899 -4382 -406 3269 -741 -892 -917 771 5957 4295 -2789 -8893
7973h893m100J089M712P253j20m873l90l572K240P91M212J655q747K661L618n852
$$ -8893 -12993 -11904 -7192 61 -59 -4932 -5322 -8894 -6654 -5863 -1651 4 -8743 -6082 -2464 -8316
7957h316j973L883Q043q03n912n605M000J884m96k453j522O247R437k023J565
$$ -8316 -10289 -6406 1637 834 -5078 -10683 -6683 -4799 -5295 -7748 -9270 -3023 6414 4391 5956
7942E956L940j278k995k019q79J300K191Q1m629n132k734K478L50M400O768k705
$$ 5956 9896 8618 5623 3604 2725 4025 6216 6297 1668 -3464 -6198 -3720 -3370 1030 7798 5093
7926E093j929o12j289J167J906k527O005O34n318L004k054o038k268N673Q669
$$ 5093 3164 2552 1263 2430 4336 1809 7814 8448 3130 6134 4080 -1958 -4226 1447 10116
7911A0116K931q060p984N382R067n152n912n737n791K87L705K936R830k812o853
$$ 10116 13047 4987 -2997 2385 11452 6300 388 -5349 -11140 -10853 -7148 -4212 5618 2806 -4047
7896d047K205J0777P190o901n469K286K343j950J511j604k53k345r25Q64K646
$$ -4047 -1842 8935 16125 9224 3755 6041 8384 6434 7945 6341 6088 3743 2818 3682 6328
7881F328J05o390K44L790K051m006j820J397k857M235O53N376J679m385j726l387
$$ 6328 6433 43 287 4077 6128 2122 302 1699 -1158 3077 3730 9106 10785 6400 4674 1287
7865A287o022Q79P688M53j73Q90l5p485q88l179n073k504k231j864M930L269M644
$$ 1287 -4735 -3856 3832 4285 4112 5002 4967 -2518 -3406 -6585 -11658 -14162 -16393 -18257 -13327 -10058 -5414
7848e414j679j194M072R862J2054j186p027K585M117j1633p092O66n589n524N249
$$ -5414 -7093 -8287 -4215 5647 17701 16515 9488 12073 16190 4557 -2535 -1869 -7458 -12982 -7733
7833g733L916N214O501p422n416m768n658J446j661Q009P184n133l599j123M135
$$ -7733 -3817 1397 7898 476 -4940 -9708 -15366 -13920 -15581 -7572 -388 -5521 -9120 -10243 -6108
7818f108M284J607p940m383J0236J537J105m265L185l715o847K028M601L966K975
$$ -6108 -1824 -217 -8157 -12540 -2304 -767 338 -3927 -742 -4457 -11304 -9276 -4675 -709 2266
7803B266l331k222m925M466Q17n129k620N144j03j527N472P77Rm198Q3J369n306
$$ 2266 -1065 -3287 -8212 -3746 -2929 -8058 -10678 -5534 -5637 -7164 -1692 -915 -906 -5104 -5021 -3652 -8958
7786h958K300J949K686J187j303m944p108O199k155L272J063J608j186l906K513
$$ -8958 -6658 -4709 -2023 -836 -2139 -7083 -14191 -7992 -10147 -6875 -5812 -4204 -5390 -9296 -6783
7771f783M936Q39K166m838k819L512R541J99q48m295J79K243J97p45L89m142r594
$$ -6783 -1847 -1008 1158 -3680 -6499 -2987 6554 6753 5905 1610 1789 4032 4229 3484 3873 -269 -9863
7754i863j45J466M8M424R550M582p346l47K775K886k998j496m1J452L446j099
$$ -9863 -10008 -8542 -8494 -4070 5480 10062 2716 2369 5144 8030 5032 3536 3495 4947 8393 7294
7738G294m917p183L45L264m404j865O264L201m345k425M657R71p3L903m244o849
$$ 7294 2377 -4806 -4461 -1197 -5601 -7466 -1202 1999 -2346 -4771 -114 857 784 4687 443 -6406
7722f406R8M880R1k092R134N825l838n309l801j007K448K743K458p74l202j93
$$ -6406 -6308 -1428 -1337 -3429 5705 11530 7692 2383 -1418 -2425 23 2766 5224 4450 1248 1055
7706A055P2q260M64p340N098O505J209L630J308l929l07L43j12l718m398j814
$$ 1055 1127 -7133 -6669 -14009 -8911 -2406 -1197 2433 3741 -188 -495 -152 -264 -3982 -8380 -10194
7690a0194J1871N172l370j110m284J689L62P184L730o426O448m449p954o001l928
$$ -10194 1677 6849 3479 2369 -1915 -226 136 7320 11050 4624 11072 6623 -1331 -7332 -11260
7675a1260J418J3507O120o223o710j051k083m198J910O378O821j545k82j232J105
$$ -11260 -9842 3665 9785 3562 -3148 -4199 -6282 -10480 -8570 -2192 4629 3084 2802 1570 2675
7660B675k606M309O943k27q537p401n359m033O702L138o223m743J797P593M993
$$ 2675 69 4378 11321 11094 2557 -4844 -10203 -14236 -7534 -4396 -10619 -15362 -13565 -5972 -979
7645i79q553n485l20J217J064O649J879L972M654o31j920O08N113j395L54j739
$$ -979 -9532 -15017 -15337 -14120 -13056 -6407 -4528 -556 4098 3467 1547 2155 7268 5873 6227 4488
7629D488j041M452j758l877l121m007m940J402Q661L762m480k012M5Q64L628o
$$ 4488 3447 7899 6141 2264 -857 -4864 -9804 -8402 259 4021 -459 -2471 -2426 -1562 2066 2060
7613B060m953o588o890j157M363M536K615O087K800J535n688k818k76J445J434
$$ 2060 -2893 -9481 -16371 -17528 -13165 -8629 -6014 73 2873 4408 -1280 -4098 -4374 -2929 -1495
7598a495O855j995K952J77L550N97l988l452m23N109j272o211j994k923k707J393
$$ -1495 5360 3365 6317 6494 10044 10641 6653 3201 2778 7887 6615 404 -1590 -4513 -7220 -5827
7582e827K114l376l12K487M86N43o57m565k312R297K063q115m391L821N376o041
$$ -5827 -3713 -7089 -7401 -4914 -4428 -3885 -4542 -9107 -11419 -2122 -59 -8174 -12565 -8744 -3368 -9409
7566i409m727j330K805L690M516J229R43O425M810O25M960m342j2487l001K808
$$ -9409 -14136 -15466 -12661 -8971 -4455 -3226 -2283 4142 8952 9577 14537 10195 -2292 -5293 -2485
7551b485N797P64l992n537k135k877m270P921Q18k003j790K522m185j280o51m434
$$ -2485 3312 4076 84 -5453 -7588 -10465 -14735 -6814 -5996 -7999 -9789 -7267 -11452 -12732 -13383 -17817
7535a7817L292R296O944P80O47q04j492K401j188j152k490K198P823n10p583M86
$$ -17817 -14525 -5229 1715 2495 3142 2338 846 3247 2059 907 -1583 615 8438 7928 345 831
7519H31l94K520L931p741l884L029J536o496N531J034j525N07J417m071m534n796
$$ 831 437 2957 6888 -853 -4737 -1708 -172 -6668 -1137 -103 -1628 -1121 296 -3775 -8309 -14105
7503a4105m265k507R998M017k333j346j640L636J926K11j048l37Q066L159m056
$$ -14105 -18370 -20877 -10879 -6862 -9195 -10541 -12181 -8545 -6619 -6408 -7456 -7793 273 3432 -624
7488f24m076k055P22J794L38N64K00J042p32m544k882J615N375R61n121m233J698
$$ -624 -4700 -6755 -6033 -4239 -3901 -3337 -3137 -2095 -2827 -7371 -10253 -8638 -3263 -2302 -7423 -11656 -9958
7471i958J414o519J970J1982K274k949l378n125k594O93J0378N490l54m917j481
$$ -9958 -8544 -15063 -13093 -1111 1163 -1786 -5164 -10289 -12883 -12190 -1812 3678 3324 -1593 -3074
7456c074N02O71j83L279m79j397n003j724k117N869Q896L810M84m629l48l344
$$ -3074 -2572 -1901 -2084 1195 716 -681 -5684 -7408 -9525 -3656 5240 9050 9534 4905 4557 1213
7440A213n315j826r81L42m168J618j617M666M856j397j962j474j183O120m940
$$ 1213 -4102 -5928 -6909 -6567 -10735 -9117 -10734 -6068 -1212 -2609 -4571 -6045 -7228 -1108 -6048
7425f048k199k340k822K30L485P94L436K390p95L295j713J186n947m566L958M345
$$ -6048 -8247 -10587 -13409 -13179 -9694 -8900 -5464 -3074 -3869 -574 -2287 -1101 -7048 -11614 -7656 -3311
7409c311N83l468p10M172j001n034J915L842L677n914o639J61L691k705N70J33
$$ -3311 -2728 -6196 -6906 -2734 -3735 -8769 -6854 -3012 665 -5249 -11888 -11727 -8036 -10741 -10171 -10038
7393a0038J838L124j649r37M00M302M942n755k845r96M365j816m196p33k692k442
$$ -10038 -8200 -5076 -6725 -7662 -7262 -2960 1982 -3773 -6618 -7614 -3249 -5065 -9261 -9994 -12686 -15128
7377a5128m384P852O945l347R307J1333l922j2917p575P09J635J64n473N508j836
$$ -15128 -19512 -11660 -4715 -8062 1245 12578 8656 -4261 -11836 -11127 -9492 -9328 -14801 -9293 -11129
7362a1129J248L498N085L791R20o333m05j824j651N347K743L58o389l324o476
$$ -11129 -9881 -6383 -1298 2493 3413 -2920 -3325 -5149 -6800 -1453 1290 1648 -4741 -8065 -14541
7347a4541n4O409j602J779K759m598j035J071j155l294L022P041N679j426j230
$$ -14541 -14595 -8186 -9788 -8009 -5250 -9848 -10883 -9812 -10967 -14261 -11239 -4198 1481 55 -1175
7332a175P161M176o784l069k275p65o0J860l276J587J0808O127p929o539k322
$$ -1175 5986 10162 3378 309 -1966 -2731 -2791 -931 -4207 -2620 8188 14315 6386 -153 -2475
7317b475n323o921l7O769P533n782j712j595j749R47m177O558R365Q71m293K881
$$ -2475 -7798 -14719 -14756 -7987 -454 -6236 -7948 -9543 -11292 -10345 -14522 -7964 1401 2272 -2021 860
7301H60j656n708l975K903l106K81M650J332K710K214L128n94j934m412m001P36
$$ 860 -796 -6504 -10479 -7576 -10682 -10401 -5751 -4419 -1709 505 3633 3039 1105 -3307 -7308 -6572
7285f572K339J039j466K750K72o28L660M316o054k544J828j264K105m610o474
$$ -6572 -4233 -3194 -4660 -1910 -1638 -2266 1394 5710 -344 -2888 -1060 -2324 -219 -4829 -11303
7270a1303K132R110k461m880r054k636J1256j25k063M573R374L063J276j619p740
$$ -11303 -9171 -61 -2522 -7402 -16456 -19092 -7836 -7961 -10024 -5451 3923 6986 8262 6643 -1097
7255a097p53M57j0669r435O792Q756O584M739l10M667L62o350k381l461q18K775
$$ -1097 -1850 -1393 -12062 -21497 -14705 -5949 635 5374 5064 9731 10093 3743 1362 -2099 -2917 -142
7239a42R106K020k042N874L35j1356k812L542J001r649o656K18L704j721J51p56
$$ -142 8964 10984 8942 14816 15151 3795 983 4525 5526 -4123 -10779 -10561 -6857 -8578 -8427 -9183
7223i183M431N051L424j423q980j504j733K335L142n587k589L719q55j538K817
$$ -9183 -4752 299 3723 2300 -6680 -8184 -9917 -7582 -4440 -10027 -12616 -8897 -9752 -11290 -8473
7208h473P331N311P03n775l338O294n27o921j737J394K55L744j38K265j963N220
$$ -8473 -1142 4169 4872 -903 -4241 2053 1526 -5395 -7132 -5738 -5483 -1739 -1877 388 -1575 3645
7192C645N140J832p418q441m51j251m6R085o522L585K900L64k089N328P32l446
$$ 3645 8785 10617 3199 -5242 -5693 -6944 -6990 2095 -4427 -842 2058 2422 333 5661 6393 2947
7176B947n943k180J030J569L192m121l304n77N915n231j904N495M713J267N107
$$ 2947 -2996 -5176 -4146 -2577 615 -3506 -6810 -7387 -1472 -6703 -8607 -3112 1601 2868 7975
7161G975P813P12p438o801o937j0877M266J522k883k432M535M101M594j6o868
$$ 7975 15788 16500 9062 2261 -4676 -15553 -11287 -9765 -12648 -15080 -10545 -6444 -1850 -1866 -8734
7146h734m989P141L805R969K740K62N379j734j2966k527K845k066k684J178o619
$$ -8734 -13723 -6582 -2777 7192 9932 10194 15573 13839 873 -1654 1191 -875 -3559 -2381 -9000
7131i000q51M230J065l179m523k789K535M975L592J678Q167p37p949j841k22k272
$$ -9000 -9851 -5621 -4556 -7735 -12258 -15047 -12512 -7537 -3945 -2267 5900 5163 -2786 -4627 -4849 -7121
7115g121J209Q642L08m75j04K963n698L376R46m84K49j997m187j672k479m4M407
$$ -7121 -5912 2730 3038 2563 2459 5422 -276 3100 4046 3562 3811 1814 -2373 -4045 -6524 -6568 -2161
7098b161p17L47l349Q55k316o28o134J323K44P671N60K848J673J027m350k078
$$ -2161 -2878 -2531 -5880 -5025 -7341 -7969 -14103 -12780 -12536 -4865 -4305 -1457 216 1243 -3107 -5185
7082e185j128l440L0R887n240j695J222L836l451l361j896p29M540P683N0r84
$$ -5185 -6313 -9753 -9723 164 -5076 -6771 -5549 -1713 -5164 -8525 -10421 -11150 -6610 1073 1123 139
7066A39J379J096l992j516l54K228l906j099J694M53PjN944m52j61j615O507n08
$$ 139 1518 2614 -1378 -2894 -3248 -1020 -4926 -6025 -4331 -3878 -3871 -3872 2072 1620 1459 -156 6351 5843
7048E843q43j498l307K650n611j595j907m344k14K528N998L883L754o732l637
$$ 5843 5000 3502 195 2845 -2766 -4361 -6268 -10612 -10826 -8298 -2300 1583 5337 -1395 -5032
7033e032M04L340k632j260L224L664O52l752o878q32l745J266O221N009r603q53
$$ -5032 -4628 -1288 -3920 -5180 -1956 1708 2360 -1392 -8270 -9102 -12847 -11581 -5360 -351 -9954 -10807
7017a0807O029n687k576M987M768M64N144J339m489j500j269Jk837M806R0l95
$$ -10807 -4778 -10465 -13041 -8054 -3286 -2822 2322 3661 -828 -2328 -3597 -3596 -6433 -1627 -1537 -1932
7001a932J732J214n082m640L135O634L089o70O121m552q640o30J023M265k257
$$ -1932 -200 1014 -4068 -8708 -5573 1061 4150 3480 9601 5049 -3591 -4221 -3198 1067 -1190
6986a190l818k569K809K375J022m458M201M417j036k867o470m815l862o54Q066
$$ -1190 -5008 -7577 -4768 -2393 -1371 -5829 -1628 2789 1753 -1114 -7584 -12399 -16261 -16915 -8849
6971h849M000j794Q85R904K305l661l286R453l886n940k023p05j982l864n444
$$ -8849 -4849 -6643 -5758 4146 6451 2790 -496 8957 5071 -869 -2892 -3597 -5579 -9443 -14887
6956a4887O702J1545J423l13K163j817j142r445o182O64j476m69j333N166M671
$$ -14887 -8185 3360 4783 4470 6633 4816 3674 -5771 -11953 -11289 -12765 -13234 -14567 -9401 -4730
6941d730q14o80J830j387j404k496K402K421J974M400k546K982K059q41l074k739
$$ -4730 -5544 -6224 -4394 -5781 -7185 -9681 -7279 -4858 -2884 1516 -1030 1952 4011 3170 96 -2643
6925b643o280k89J524l476M082L345n706r49N310L840Q980k750n009j189k199
$$ -2643 -8923 -9212 -7688 -11164 -7082 -3737 -9443 -10392 -5082 -1242 7738 4988 -21 -1210 -3409
6910c409K300L12m36m153k469n788M374R974m872o941m498K903N201j79k789M417
$$ -3409 -1109 -797 -1233 -5386 -7855 -13643 -9269 705 -4167 -11108 -15606 -12703 -7502 -7681 -10470 -6053
6894f053M362K179q894j347K779l963o228P903P087k916j669J083L12K588O015
$$ -6053 -1691 488 -8406 -9753 -6974 -10937 -17165 -9262 -2175 -5091 -6760 -5677 -5365 -2777 3238
6879C238R0K41j298L352L53k505l477J171j151M23o305j128J731R574k29p179
$$ 3238 3328 3569 2271 5623 5976 3471 -6 1165 14 437 -5868 -6996 -5265 4309 4080 -3099
6863c099J887l046l302k597R386K892K289J80j0067k109p69o315L413L855P28
$$ -3099 -1212 -4258 -7560 -10157 -771 2121 4410 4590 -5477 -7586 -8355 -14670 -11257 -7402 -6674
6848f674j665m077j031M675k920M416n74J879j538L05N182J999m45j882J711J695
$$ -6674 -8339 -12416 -13447 -8772 -11692 -7276 -7850 -5971 -7509 -7204 -2022 -23 -468 -2350 -639 1056
6832A056L197J296k41m258m529k516r79J909k3k902Q59O010K87j817M654L377
$$ 1056 4253 5549 5308 1050 -3479 -5995 -6974 -5065 -5088 -7990 -7131 -1121 -834 -2651 2003 5380
6816E380m318J98K62o997m310O828K045J955q56J201R94o609K603M829j736Q37
$$ 5380 1062 1260 1522 -5475 -9785 -2957 -912 1043 187 1388 2382 -4227 -1624 3205 1469 2306
6800B306j243m445j500R647J049L05K202k000k578L99l67l46j405j682N28M848
$$ 2306 1063 -3382 -4882 4765 5814 6119 8321 6321 3743 4142 3775 3429 2024 342 870 5718
6784E718k936l962J436N053M513l134r601k342j673j371j72k132Q789P657N22
$$ 5718 2782 -1180 256 5309 9822 6688 -2913 -5255 -6928 -8299 -8471 -10603 -1814 5843 6365
6769F365l480o419P51O81q16K677J999K867n248k366L474L591m01o240o965m803
$$ 6365 2885 -3534 -2783 -2102 -2918 -241 1758 4625 -623 -2989 485 4076 3675 -2565 -9530 -14333
6753a4333M378K88R74J688l826J184L242n766L328L916M609M84j03K134J84j442
$$ -14333 -9955 -9667 -8693 -7005 -10831 -9647 -6405 -12171 -8843 -4927 -318 166 63 2197 2381 939
6737I39j971K165k50l109J199J572k527l258R387O249q454J627N878k450l602
$$ 939 -1032 1133 883 -2226 -1027 545 -1982 -5240 4147 10396 1942 3569 9447 6997 3395
6722C395k568n910l983N765K146J233N958O63m998p66P209j858o717M413M59q33
$$ 3395 827 -5083 -9066 -3301 -1155 78 6036 6699 1701 935 8144 6286 -431 3982 4441 3608
6706C608p917p148K539O126P60M138L76k98r25P751N884J61k195n427j150M898
$$ 3608 -4309 -11457 -8918 -2792 -2032 2106 2482 2184 1259 9010 14894 15055 12860 7433 6283 11181
6690A1181K186o265L302o879J791L101o942l698k665J975J037K482K603M102j350
$$ 11181 13367 7102 10404 3525 5316 8417 1475 -2223 -4888 -2913 -1876 606 3209 7311 5961
6675E961m299l453o28j031j252P87l399J699P405J0169P15n445r309l590M734
$$ 5961 1662 -1791 -2419 -3450 -4702 -3915 -7314 -5615 1790 11959 12674 7229 -2080 -5670 -936
6660i36j605M572k02P234k354j926k329J828j662J972j919o490n031J807N699
$$ -936 -2541 2031 1829 9063 6709 4783 2454 4282 2620 4592 2673 -3817 -8848 -7041 -1342
6645a342o73o71N85Q877l642n267N472p64K39L535j800l357m46l678l116o425
$$ -1342 -2015 -2686 -2101 6776 3134 -2133 3339 2575 2814 6349 4549 1192 746 -2932 -6048 -12473
6629a2473L874M062N607N339l84n608J38K856k020p058M682L041q78p346p99K209
$$ -12473 -8599 -4537 1070 6409 6025 417 555 3411 1391 -5667 -985 2056 1178 -6168 -6967 -4758
6613d758N702K634M31j370m388q253k962l860P33K82K558O785M299M93l793l199
$$ -4758 944 3578 4009 2639 -1749 -10002 -12964 -16824 -16091 -15809 -13251 -6466 -2167 -1674 -5467 -8666
6597h666K917J490k766O404L195l364n06L581o946J254K607J230R06m151L451
$$ -8666 -5749 -4259 -7025 -621 2574 -790 -1296 2285 -4661 -3407 -800 430 1336 -2815 636
6582F36q67J216J291K859O72r34O685K393P64j6l749j626k242m353m08L513K760
$$ 636 -231 985 2276 5135 5807 4873 11558 13951 14715 14699 10950 9324 7082 2729 2321 5834 8594
6565H594J90l788m096L036k888m607K139K585m263J146L393j391k63J89m688k121
$$ 8594 8784 4996 900 3936 1048 -3559 -1420 1165 -3098 -1952 1441 50 -213 -24 -4712 -6833
6549f833L765K580P59Q98n197m656L826R497k277l724k168L022K348K382K475
$$ -6833 -3068 -488 271 1169 -4028 -8684 -4858 4639 2362 -1362 -3530 -508 1840 4222 6697
6534F697n064p450j255Q02o136l883M650j386k55l291L608N727j121M947K001
$$ 6697 1633 -5817 -7072 -6270 -12406 -16289 -11639 -13025 -13280 -16571 -12963 -7236 -8357 -3410 -1409
6519a409l933p45m130p095L797O982L287R887J196m199k063j032j524n165K218
$$ -1409 -5342 -6087 -10217 -17312 -13515 -6533 -3246 6641 7837 3638 1575 543 -981 -6146 -3928
6504c928k699r28j933o358j06j064M562J0571q70K958r8N94j015O009J515l944
$$ -3928 -6627 -7555 -9488 -15846 -15952 -17016 -12454 -1883 -2753 205 107 701 -314 5695 7210 3266
6488C266N392k282N28k121o156k59K325n914p66p40K695L808m49J904J0426k09
$$ 3266 8658 6376 6904 4783 -1373 -1632 693 -5221 -5987 -6727 -4032 -224 -673 1231 11657 11448
6472A1448l760j578O17j722P830l908n243p40l04M513j194o699k34P729O42o321
$$ 11448 7688 6110 6727 5005 12835 8927 3684 2944 2640 7153 5959 -740 -974 6755 7397 1076
6456A076j0002m830M342l037J870P350L96k223K054N782k098p550l3J497L669
$$ 1076 -8926 -13756 -9414 -12451 -10581 -3231 -2835 -5058 -3004 2778 680 -6870 -6903 -5406 -1737
6441a737M057L036j128J301k352j1020p27P856O018L366q399n352k22J445P896
$$ -1737 2320 5356 4228 5529 3177 -7843 -8570 -714 5304 8670 271 -5081 -5303 -3858 4038
6426D038M24o640l308J395K381j105m286k005M101k783m77L070j855j210m908
$$ 4038 4462 -2178 -5486 -4091 -1710 -2815 -7101 -9106 -5005 -7788 -8265 -5195 -7050 -8260 -13168
6411a3168l297N036R13j686K722M013Q690K855n979m543n07j159K6L515M665r83
$$ -13168 -16465 -11429 -10516 -12202 -9480 -5467 3223 6078 99 -4444 -4951 -6110 -6084 -2569 2096 1113
6395A113K940P785p52o150m599j803J65N86K151N025n946n942L178k669j876N242
$$ 1113 4053 11838 11086 4936 337 -1466 -1301 -715 1436 6461 515 -5427 -2249 -4918 -6794 -1552
6379a552k715L380J205L61j077n466p323J359R568K729o393m63P245L077l32j538
$$ -1552 -4267 -887 318 679 -398 -5864 -13187 -11828 -2260 469 -5924 -6387 858 3935 3603 2065
6363B065j516J335m90m488J430J275K05n679k426k5N541R715Q382q259m415J350
$$ 2065 549 1884 1394 -3094 -1664 -389 -184 -5863 -8289 -8314 -2773 6942 15324 7065 2650 4000
6347D000k006J72K125r21K428O113Q4m404J013N681k477j4372o33N426M184r117
$$ 4000 1994 2166 4291 3370 5798 11911 11995 7591 8604 14285 11808 -2564 -3197 2229 6413 -2704
6331b704m329Q462M076K52J930J754m225o08J32k131m32J183k960N65l906N469
$$ -2704 -7033 1429 5505 5757 7687 9441 5216 4608 4740 2609 2177 3360 400 965 -2941 2528
6315B528j619o281J1650j025o847N226j043m524k88N644L547k886l798J265j2876
$$ 2528 909 -5372 6278 5253 -1594 3632 2589 -1935 -2223 3421 6968 4082 284 1549 -11327
6300a1327J630L299P673m230n78K034L252j189K145m552M948k22n162K858J0074
$$ -11327 -9697 -6398 1275 -2955 -3533 -1499 1753 564 2709 -1843 3105 2883 -2279 579 10653
6285A0653L613O25L189l896n461r727L276o53K330K769k161nK084m603L868J856
$$ 10653 14266 14891 18080 14184 8723 -1004 2272 1619 3949 6718 4557 4552 6636 2033 5901 7757
6269G757m103m171N812O162n232q406n940n301J003j172M102M462n396k314L368
$$ 7757 3654 -517 5295 11457 6225 -2181 -8121 -13422 -12419 -13591 -9489 -5027 -10423 -12737 -9369
6254i369l204L262J800M890Q795O921j933j0007j0993l823J2999O526q116j201
$$ -9369 -12573 -9311 -7511 -2621 6174 13095 11162 1155 -9838 -13661 -662 5864 -2252 -3453
6240c453M43l889J334J603j956M635k534k742k009l992K963J541p593N049Q889
$$ -3453 -3010 -6899 -5565 -3962 -5918 -1283 -3817 -6559 -8568 -12560 -9597 -8056 -15649 -10600 -1711
6225a711N57L292n36m759j353P199L243k753j1031m102k719P029M891j430k005
$$ -1711 -1154 2138 1602 -3157 -4510 2689 5932 3179 -7852 -11954 -14673 -7644 -2753 -4183 -6188
6210f188j801K965N702Q16l152K475L167o265m85j053L98K660L122l586l873N944
$$ -6188 -7989 -5024 678 1494 -1658 817 3984 -2281 -2766 -3819 -3421 -761 2361 -1225 -5098 846
6194H46J588j144Q65j738k460J975L119j789k05o021j786O731N624n695k608k661
$$ 846 2434 1290 2155 417 -2043 -68 3051 1262 1057 -4964 -6750 -19 5605 -90 -2698 -5359
6178e359k856L190N010J712j150R44k385l212R6M248J38m670J758L135Q44j607
$$ -5359 -8215 -5025 -15 1697 547 1491 -894 -4106 -4010 238 376 -4294 -2536 599 1443 -164
6162a64j088p12L721k249J618O92n06p346L440j179q050p51M583N52j945o090
$$ -164 -1252 -1964 1757 -492 1126 1818 1312 -6034 -2594 -3773 -11823 -12574 -7991 -7439 -9384 -15474
6146a5474J155Q444K653k785M520O412m065K81N414K287o753p09k703l514l834
$$ -15474 -14319 -5875 -3222 -6007 -1487 4925 860 1141 6555 8842 2089 1380 -1323 -4837 -8671
6131h671L752M863L807O233j987p299l950m615o638M002R762M747n82o424j029
$$ -8671 -4919 -56 3751 9984 7997 698 -3252 -7867 -14505 -10503 -741 4006 3424 -3000 -4029
6116d029m18j592P6l562M329q32M53L9R005L871n632k110j765N369j836l051L24
$$ -4029 -4447 -6039 -5963 -9525 -5196 -6028 -5575 -5536 3469 7340 1708 -402 -2167 3202 1366 -1685 -1361
6099a361L626n375k504j005o222p88j873n336M748J480L526J302k35l295L004
$$ -1361 2265 -3110 -5614 -6619 -12841 -13629 -15502 -20838 -16090 -14610 -11084 -9782 -10017 -13312 -10308
6084a0308M019M41r613J588J2015N696k491q522o73k56P100N844K428k902n655
$$ -10308 -6289 -5848 -15461 -13873 -1858 3838 1347 -7175 -7848 -8104 -1004 4840 7268 4366 -1289
6069a289k86l969J056R974K327j110m83O44m321p07P48k272K026n007j3227K492
$$ -1289 -1575 -5544 -4488 5486 7813 6703 6220 6864 2543 1836 2584 312 2338 -2669 -15896 -13404
6053a3404O028q55K127P337M592K477L698k405j0997j333p07k925L3L958m164
$$ -13404 -7376 -8231 -6104 1233 5825 8302 12000 9595 -1402 -2735 -3442 -6367 -6334 -2376 -6540
6038f540J7K908n79J613K958m882N7J440N343J26m977q332L455J6092k393o672
$$ -6540 -6523 -3615 -4194 -2581 377 -4505 -4448 -3008 2335 2461 -2516 -10848 -7393 8699 6306 -366
6022c66n58j352r54n191k404Q397Q491l834r981j730P094J411k446K940m934j860
$$ -366 -924 -2276 -3230 -8421 -10825 -2428 6063 2229 -7752 -9482 -2388 -977 -3423 -483 -5417 -7277
6006g277j340j884L726l586j878M716m1J901M86K649m415o327j174O651N243J021
$$ -7277 -8617 -10501 -6775 -10361 -12239 -7523 -7564 -5663 -5177 -2528 -6943 -13270 -14444 -7793 -2550 -1529
5990a529o714N39L70K457L750p7L136J936o34p167m621M834P951P435p712n606
$$ -1529 -8243 -7704 -7334 -4877 -1127 -1204 1932 3868 3234 -3933 -8554 -3720 4231 11666 3954 -1652
5974a652k724j945k672j488k623R181M426k585o493L974K374J098K364O678k313
$$ -1652 -4376 -6321 -8993 -10481 -13104 -3923 503 -2082 -8575 -4601 -2227 -1129 1235 7913 5600
5959E600l822j157P270m184m420n723j906k326J627L603K45O356K004N443m007
$$ 5600 1778 621 7891 3707 -713 -6436 -8342 -10668 -9041 -5438 -5193 1163 3167 8610 4603
5944D603L222L839l075l060m065J099p341p876j422R773J2541Q962o738j1662
$$ 4603 7825 11664 8589 5529 1464 2563 -4778 -12654 -14076 -4303 8238 17200 10462 -1200
5930a200j46m245m195J2210K927L650K42p68l155k503p25k766K083J612L020k012
$$ -1200 -1346 -5591 -9786 2424 5351 9001 9243 8475 5320 2817 2092 -674 1409 3021 6041 4029
5914D029n600L792N36K41p3m977J409o180n404J2042O391k122R211j592o394k849
$$ 4029 -1571 2221 2757 2998 2925 -2052 -643 -6823 -12227 -185 6206 4084 13295 11703 5309 2460
5898B460L050l013M357J610m532j165k670n314P69j248O27M711P86k974m591K381
$$ 2460 5510 2497 6854 8464 3932 2767 97 -5217 -4448 -5696 -5069 -358 428 -2546 -7137 -4756
5882d756N468m434l726o417M567N524O049m560M816J856j836K2M517m320o044
$$ -4756 712 -3722 -7448 -13865 -9298 -3774 2275 -2285 2531 4387 2551 2573 7090 2770 -3274
5867c274K921K656k720l563j294K055l867k461L573N375K797O420n75r187p941
$$ -3274 -353 2303 -417 -3980 -5274 -3219 -7086 -9547 -5974 -599 2198 8618 8043 -1144 -9085
5852i085O072P945R78l268l595p85J88m548R41M424q696l54L924q401k641O66
$$ -9085 -3013 4932 5910 2642 -953 -1738 -1550 -6098 -5157 -733 -9429 -9783 -5859 -14260 -16901 -16235
5836a6235l006M154Q131R686J864k099k031k151j283J2L142K369l337N45K674
$$ -16235 -19241 -15087 -6956 2730 4594 2495 464 -1687 -2970 -2958 184 2553 -784 -239 2435
5821B435J902K976P17o253p583r94M396M478M60r75l303k671j591N395o029j0635
$$ 2435 4337 7313 8030 1777 -5806 -6800 -2404 2074 2534 1559 -1744 -4415 -6006 -611 -6640 -17275
5805a7275L071J1025K266o220L113n922l795n29k115L278M005j494O065K831k153
$$ -17275 -14204 -3179 -913 -7133 -4020 -9942 -13737 -14266 -16381 -13103 -9098 -10592 -4527 -1696 -3849
5790c849J974N155M181l525J905j60M78m618M385N708k79k350l759j981J086O848
$$ -3849 -1875 3280 7461 3936 5841 5681 6159 1541 5926 11634 11355 9005 5246 3265 4351 11199
5774A1199R50j306q675r265k849L591L782O945J990p714l450l791j583l458o821
$$ 11199 12149 10843 2168 -7097 -9946 -6355 -2573 4372 6362 -1352 -4802 -8593 -10176 -13634 -20455
5759b0455J326P17P853j574L265m13r81j154O81R403M685N58O722K02r030n143
$$ -20455 -19129 -18412 -10559 -12133 -8868 -9281 -10262 -11416 -10735 -1332 3353 3911 10633 10835 1805 -3338
5743c338k114J304R28J153q61J13J891M48Kj658p1L668j926o384k826l551J161
$$ -3338 -5452 -4148 -3220 -2067 -2928 -2815 -924 -476 -474 -2132 -2203 1465 -461 -6845 -9671 -13222 -12061
5726a2061N640Q55J815N862K433j516j022K726K595l532k945O0L303P882q231
$$ -12061 -6421 -5566 -3751 2111 4544 3028 2006 4732 7327 3795 850 910 4213 12095 3864
5711C864q847Q86k950o017M190O420R76N134L218l306k561m441j42p22k771L254
$$ 3864 -4983 -4097 -7047 -13064 -8874 -2454 -1478 3656 6874 3568 1007 -3434 -3576 -4298 -7069 -3815
5695c815Q20l36L996l021L37O54l810k733j542n113O205K953k578J269m296O266
$$ -3815 -2995 -3331 665 -2356 -2019 -1365 -5175 -7908 -9450 -14563 -8358 -5405 -7983 -6714 -11010 -4744
5679d744R570M359n949m858J313K877n386K17l382p916L700N015r19p863M218
$$ -4744 4826 9185 3236 -1622 -309 2568 -2818 -2601 -5983 -13899 -10199 -5184 -6103 -13966 -9748
5664i748K040K115p33l864k87l828j0239Q600J0243N784o5o200j3175M763N697
$$ -9748 -7708 -5593 -6326 -10190 -10477 -14305 -24544 -15944 -5701 83 18 -6182 -19357 -14594 -8897
5649h897k560j233N785J215q978J9J1222l413l817P667M591L877M147l437o629
$$ -8897 -11457 -12690 -6905 -5690 -14668 -14649 -3427 -6840 -10657 -2990 1601 5478 9625 6188 -441
5634d41R79n648J006P894M309k146n205N431k892o111M95J09j46R373L275p72
$$ -441 538 -5110 -4104 3790 8099 5953 748 6179 3287 -2824 -2329 -2220 -2366 7007 10282 9510
5618I510N080K228j0938j0117m684L865k297J694L844k863n151L074m313K222
$$ 9510 14590 16818 5880 -4237 -8921 -5056 -7353 -5659 -1815 -4678 -9829 -6755 -11068 -8846
5604h846J774j88q70P875M342j631k059o302k549J474l081m186J838J01K863O556
$$ -8846 -7072 -7260 -8130 -255 4087 2456 397 -5905 -8454 -6980 -10061 -14247 -12409 -12308 -9445 -2889
5588b889L707J0685m57p232j0369m95j357m89P166O678K009o018R21M247n96l679
$$ -2889 818 11503 11046 3814 -6555 -7050 -8407 -8896 -1730 4948 6957 939 1860 6107 5511 1832
5572A832n927K314L628K705r68k286J76j052J163K502M744N144j0731m214p96
$$ 1832 -4095 -1781 1847 4552 3584 1298 1474 422 1585 4087 8831 13975 3244 -970 -1766
5557a766k617Q676J163m003L356K503l305n467j752J758n065k430n79P148J036
$$ -1766 -4383 4293 5456 1453 4809 7312 4007 -1460 -3212 -1454 -6519 -8949 -9528 -2380 -1344
5542a344r17J124N153n45N391j077o857O53m405n162N598p47k776J848R34o60
$$ -1344 -2261 -1137 4016 3471 8862 7785 928 1581 -2824 -7986 -2388 -3135 -5911 -4063 -3129 -3789
5526c789k982l95J0133J767o581n660M412P847P004k633l084k973n084K603K424
$$ -3789 -6771 -7166 2967 4734 -1847 -7507 -3095 4752 11756 9123 6039 3066 -2018 585 3009
5511C009J620K086L197m357k659l031n620K22j336n323j265m39N209M674l968
$$ 3009 4629 6715 9912 5555 2896 -135 -5755 -5533 -6869 -12192 -13457 -13896 -8687 -4013 -7981
5496g981o736N50M558j188j343M908L629L742M0L608K927j497L965K388j299k255
$$ -7981 -14717 -14167 -9609 -10797 -12140 -7232 -3603 139 179 3787 6714 5217 9182 11570 10271 8016
5480H016l066n792j083j219l013J397O558r32p217j334p16Q66Q526P33J6R99p665
$$ 8016 4950 -842 -1925 -3144 -6157 -4760 1798 866 -6351 -7685 -8401 -7535 991 1724 1740 2739 -4926
5463d926k629J853L620k992L027K921k951o241l820N763N017L619L59K323L175
$$ -4926 -7555 -5702 -2082 -5074 -2047 874 -2077 -8318 -12138 -6375 -1358 2261 2620 4943 8118
5448H118K266M583J351n302q583n44K354K7n060n80P050j713o754L87N2K350K265
$$ 8118 10384 14967 16318 11016 2433 1889 4243 4270 -790 -1370 5680 3967 -2787 -2400 -2348 2 2267
5431B267Q81J617n478o841J739O583q78n975k966L243K191J744M550R33j042k332
$$ 2267 3148 4765 -713 -7554 -5815 768 -110 -6085 -9051 -5808 -3617 -1873 2677 3610 2568 236
5415B36j837p354n120L343L935R670P299m398O66j699r5n819l348n155l099R299
$$ 236 -1601 -8955 -14075 -10732 -6797 2873 10172 5774 6440 4741 4646 -1173 -4521 -9676 -12775 -3476
5399c476O06J038l790N194Q820K42j515n910k46k396q70k146K303O86L61Q56k121
$$ -3476 -2870 -1832 -5622 -428 8392 8634 7119 1209 963 -1433 -2303 -4449 -2146 -1460 -1099 -243 -2364
5382b364j357J459k839J700P0K458J537K282n82r84J089J427n039n174L803R140
$$ -2364 -3721 -2262 -5101 -3401 -3331 -873 664 2946 2364 1380 2469 3896 -1143 -6317 -2514 6626
5366F626K508k722L845p49L25L433m625O458k210r735l404r95K102N453l137J606
$$ 6626 9134 6412 10257 9508 9833 13266 8641 15099 12889 3154 -250 -1245 857 6310 3173 4779
5350D779k117M682J016p124l946n463K533p70O83K739M770l163l452M30j286k222
$$ 4779 2662 7344 8360 1236 -2710 -8173 -5640 -6410 -5727 -2988 1782 -1381 -4833 -4403 -5689 -7911
5334g911K722n796L239K969r19J036P50J362o54K796Q269j289k464k520k521q65
$$ -7911 -5189 -10985 -7746 -4777 -5696 -4660 -3910 -2548 -3202 -406 7863 6574 4110 1590 -931 -1796
5318a796N64J463J042j362m556r60M196J124K70J587J548M277K239o759K922N51
$$ -1796 -1232 231 1273 -89 -4645 -5605 -1409 -285 -15 1572 3120 7397 9636 2877 5799 6350
5302F350q670M598J162n508K336m422N272J556k791j409m493j876J978K26P98
$$ 6350 -2320 2278 3440 -2068 268 -4154 1118 2674 -117 -1526 -6019 -7895 -5917 -5691 -4893
5287d893J1770N57o915N974J849k075m365m630j450N192J178q01m185n143l40
$$ -4893 6877 7434 519 6493 8342 6267 1902 -2728 -4178 1014 2192 1391 -2794 -7937 -8277
5272h277K105l747O54O886N171K043L382p749o927N80p62J456k202O27J922k434
$$ -8277 -6172 -9919 -9265 -2379 2792 4835 8217 468 -6459 -5879 -6641 -5185 -7387 -6760 -4838 -7272
5256g272L983P06K828l13J653l564J752j306j67l425j054k382M976L889J518Q98
$$ -7272 -3289 -2583 245 -68 1585 -1979 -227 -1533 -1700 -5125 -6179 -8561 -3585 304 1822 2720
5240B720J829n51K788l530k266J429o77K75j971p911r185L697Q037K313m99n613
$$ 2720 4549 3998 6786 3256 990 2419 1742 2017 46 -7865 -17050 -13353 -5316 -3003 -3502 -9115
5224i115j272N079J795k855n168j877O387N815n01N992j317j430n592l980J452
$$ -9115 -10387 -5308 -3513 -6368 -11536 -13413 -7026 -1211 -1712 4280 2963 1533 -4059 -8039 -6587
5209f587J282j070N531K073p079q907L593O599n437Q791K732o585j562Q920J719
$$ -6587 -5305 -6375 -844 1229 -5850 -14757 -11164 -4565 -10002 -1211 1521 -5064 -6626 2294 4013
5194D013J879n640l473m357l900k964J406K363J230N807n561j0710l47J1465R25
$$ 4013 5892 252 -3221 -7578 -11478 -14442 -13036 -10673 -9443 -3636 -9197 -19907 -20254 -8789 -7864
5179g864L662R588l570M69l467N845N248m651k190N085r87n920L662K004O62L206
$$ -7864 -4202 5386 1816 2285 -1182 4663 9911 5260 3070 8155 7168 1248 4910 6914 7576 10782
5163A0782j019j085n142l986L139k372k420K846M02n546l784r87l864J217J0097
$$ 10782 9763 8678 3536 -450 2689 317 -2103 743 1145 -4401 -8185 -9172 -13036 -11819 -1722
5148a722J014O382K302k080m504o964p514l902K550K954J274j132j900k393P608
$$ -1722 -708 5674 7976 5896 1392 -5572 -13086 -16988 -14438 -11484 -10210 -11342 -13242 -15635 -8027
5133h027K243N7n807N619J1476n469j0758k126K631P369L171o640P80j295l805
$$ -8027 -5784 -5727 -11534 -5915 5561 92 -10666 -12792 -10161 -2792 379 -6261 -5481 -6776 -10581
5118a0581k650M029J1918m51j045L434N1J303k05n277k494P83L222M488q73l148
$$ -10581 -13231 -9202 2716 2265 1220 4654 4705 6008 5803 526 -1968 -1185 2037 6525 5652 2504
5102B504o026M330P858J490m675o448m237l452M645O816J235m579j276k98L975
$$ 2504 -3522 808 8666 10156 5481 -967 -5204 -8656 -4011 2805 4040 -539 -1815 -2113 1862
5087A862k499J019J33k891p043p62j373L050J285N016l446m982N62j491Q674O313
$$ 1862 -637 382 515 -2376 -9419 -10181 -11554 -8504 -7219 -2203 -5649 -10631 -10069 -11560 -2886 3427
5071C427l592m190q18J065Q411M078q98o943m581K933J525m195J753L124O882
$$ 3427 -165 -4355 -5173 -4108 4303 8381 7483 540 -4041 -1108 417 -3778 -2025 1099 7981
5056G981L745m515j6716m796Q634N339p24m043m727l239P43J0498l23M754M331
$$ 7981 11726 7211 -9505 -14301 -5667 -328 -1052 -5095 -9822 -13061 -12318 -1820 -2143 2611 6942
5041F942L582r04p783n823j79j210R28J284L558M517L647m230p516j06M676M695
$$ 6942 10524 9620 1837 -3986 -4165 -5375 -4447 -3163 395 4912 8559 4329 -3187 -3293 1383 6078
5025F078L68m571q60L298j630l505j998o38M414K709P47m58M1m802n766N709J813
$$ 6078 6446 1875 1015 4313 2683 -822 -2820 -3458 956 3665 4412 3954 3995 -807 -6573 -864 949
5008I49j502k090n82j66Q440J937K910r950p99K174j283M567k721L62q081j800
$$ 949 -553 -2643 -3225 -3391 5049 6986 9896 -54 -853 1321 38 4605 1884 2246 -5835 -7635
4992g635L214l619k910N020R032l154p506L752M947O429J960k862K120k57J419
$$ -7635 -4421 -8040 -10950 -5930 3102 -52 -7558 -3806 1141 7570 9530 6668 8788 8531 9950
4977I950p554k362M309N768O862j503n050l866L67q545O97N166j740k656j249
$$ 9950 2396 34 4343 10111 16973 15470 10420 6554 6921 -1624 -927 4239 2499 -157 -1406
4962a406K176K009j259m836k279m662m070j288P043J0185l041n175k586L382M232
$$ -1406 770 2779 1520 -3316 -5595 -10257 -14327 -15615 -8572 1613 -1428 -6603 -9189 -5807 -1575
4947a575o255m560k366J672Q726J999K029K269N312n164p302J279P894Q16p684
$$ -1575 -7830 -12390 -14756 -13084 -4358 -2359 -330 1939 7251 2087 -5215 -3936 3958 4774 -2910
4932b910q11N564K734m574m703j213K155K534N448m392J158L956n907q29J858
$$ -2910 -3721 1843 4577 3 -4700 -5913 -3758 -1224 4224 -168 990 4946 -961 -1790 68
4917F8L12m326kr52P49l580M625M335o011n259J567j227M718K166K562m983K348
$$ 68 380 -3946 -3948 -4900 -4151 -7731 -3106 1229 -4782 -10041 -8474 -9701 -4983 -2817 -255 -5238 -2890
4900b890O625m137m001j329J829k310J1790L79j074n873j485J515J69r2L026K583
$$ -2890 3735 -402 -4403 -5732 -3903 -6213 5577 5956 4882 -991 -2476 -961 -792 -884 2142 4725
4884D725l28l141o04m256p957o509O168M928K806M164j061m574n564m856Q198
$$ 4725 4397 1256 652 -3604 -11561 -18070 -11902 -6974 -4168 -4 -1065 -5639 -11203 -16059 -7861
4869g861O751l613M10l240J83M484j347n026r83K913L512M29p255p80j981J229
$$ -7861 -1110 -4723 -4313 -7553 -7370 -2886 -4233 -9259 -10242 -7329 -3817 -3388 -10643 -11423 -13404 -12175
4853a2175p859k512L523M838j034M897N190n16L153k313l810L307O92J390l526
$$ -12175 -20034 -22546 -19023 -14185 -15219 -10322 -5132 -5648 -2495 -4808 -8618 -5311 -4619 -3229 -6755
4838f755J858j218L066m005j710K916J0770P065n849n918r02j218J752m17Q56
$$ -6755 -4897 -6115 -3049 -7054 -8764 -5848 4922 11987 6138 220 -682 -1900 -148 -565 291
4823B91j170l091m984m897L522K540l825l313q10j066N622J3806K995K662J435
$$ 291 -879 -3970 -8954 -13851 -10329 -7789 -11614 -14927 -15737 -16803 -11181 2625 5620 8282 9717
4808I717l093m724k558L767M511k490m788J73J712M274K164n350l643L29K111
$$ 9717 6624 1900 -658 3109 7620 5130 342 515 2227 6501 8665 3315 -328 1 2112
4793B112J888J493N20l913q335L63l216N12L125R34J21k795M931K292L826p262
$$ 2112 4000 5493 6013 2100 -6235 -5872 -9088 -8576 -5451 -4517 -4396 -7191 -2260 32 3858 -3404
4777c404J868p755n248N919L881K02Q96j349J336R90j853L891j631n221L62L790
$$ -3404 -1536 -9291 -14539 -8620 -4739 -4537 -3641 -4990 -3654 -2664 -4517 -626 -2257 -7478 -7116 -3326
4761c326J033q13J237o703n522Q734J0226l382K203P278n978n575%M234P22N80
$$ -3326 -2293 -3106 -1869 -8572 -14094 -5360 4866 1484 3687 10965 4987 -588 -588 3646 4368 4948
4745D948J604l035n632R03K572l67j7l746K711k761o140K145L862M35k87n327
$$ 4948 6552 3517 -2115 -1212 1360 993 976 -2770 -59 -2820 -8960 -6815 -2953 -2518 -2805 -8132
4729h132K96N26K952K733n321L555M98J832n2o10O012k625l114M172M925m212
$$ -8132 -7836 -7310 -4358 -1625 -6946 -3391 -2893 -1061 -1113 -1723 4289 1664 -1450 2722 7647 3435
4713C435l304n968k267P573L855l370Q59L372j318K411l30J80K618l961l379L285
$$ 3435 131 -5837 -8104 -531 3324 -46 813 4185 2867 5278 4948 5128 7746 3785 406 3691
4697C691M983p044j1767J403Q9M313K269J068k786K652k276j556J310J442j548
$$ 3691 8674 1630 -10137 -8734 -8645 -4332 -2063 -995 -3781 -1129 -3405 -4961 -3651 -2209 -3757
4682c757J199k510M86K606M107P240r23K840l642J823q85k738l697N034J802n026
$$ -3757 -2558 -5068 -4582 -1976 2131 9371 8448 11288 7646 9469 8584 5846 2149 7183 8985 3959
4666C959p943n683O831K722m93N800R577J615p792p962j661M976j301l413J825
$$ 3959 -3984 -9667 -2836 -114 -607 5193 14770 16385 8593 631 -1030 3946 2645 -768 1057
4651A057M080K679n008R04o776k558O487L778K16L419Q084K850q519j725m517
$$ 1057 5137 7816 2808 3712 -3064 -5622 865 4643 4859 8278 16362 19212 10693 8968 4451
4636D451r88K380n169j351M118K08k095k426o913j736R319J986j693L97l513j400
$$ 4451 3463 5843 674 -677 3441 3649 1554 -872 -7785 -9521 -202 1784 91 488 -3025 -4425
4620d425J812P440j65j604j650p99N074J143j236l946p86L977M581k510o413k457
$$ -4425 -2613 4827 4662 3058 1408 609 5683 6826 5590 1644 858 4835 9416 6906 493 -1964
4604a964J552L717l752k348J172j960L660k262j06L479j0978l989j321m691P254
$$ -1964 -412 3305 -447 -2795 -1623 -3583 77 -2185 -2291 1188 -9790 -13779 -15100 -19791 -12537
4589a2537M347L853J571q87P527K943l125Q035L439r182j844P639l020p248m225
$$ -12537 -8190 -4337 -2766 -3653 3874 6817 3692 11727 15166 5984 4140 11779 8759 1511 -2714
4574b714J374n5j520o69K270l952k554P660K930l626l824P87j71K658j26J820
$$ -2714 -1340 -1395 -2915 -3584 -1314 -5266 -7820 -160 2770 -856 -4680 -3893 -4064 -1406 -1532 288
4558B88o209m127k564q395K036j083K592O928R940L345o782O782J066J88m441
$$ 288 -5921 -10048 -12612 -21007 -18971 -20054 -17462 -10534 -594 2751 -4031 2751 3817 4005 -436
4543d36K590P323o507n043J579N113M412k224k248m252l513J014R072K221r62
$$ -436 2154 9477 2970 -2073 -494 4619 9031 6807 4559 307 -3206 -2192 6880 9101 8139
4528H139l454K147N1P66M15J874n97l007m310q207l216l729J952j432n92O18M511
$$ 8139 4685 6832 6883 7649 8064 9938 9341 6334 2024 -6183 -9399 -13128 -11176 -12608 -13200 -12582 -8071
4511h071K805k472k175N90R565J945n663o52Q148K346K341j0134n325j150O56
$$ -8071 -5266 -7738 -9913 -9323 242 2187 -3476 -4128 4020 6366 8707 -1427 -6752 -7902 -7246
4496g246Q342M39o796l259K879K433k510K972O191n312M091R460p34n152l313
$$ -7246 1096 1535 -5261 -8520 -5641 -3208 -5718 -2746 3445 -1867 2224 11684 10950 5798 2485
4481B485j49q76m515P24R32K004q625O07K989K212k960o106j610R54O36K213R52
$$ 2485 2336 1460 -3055 -2331 -1399 605 -8020 -7413 -4424 -2212 -5172 -11278 -12888 -11934 -11298 -9085 -8133
4464h133j066j57q59O555K112m555N86N679R43k831K129Q953l285o087l266N930
$$ -8133 -9199 -9356 -10215 -3660 -1548 -6103 -5517 162 1105 -1726 403 9356 6071 -16 -3282 2648
4448B648K570m757j16M9N841o576P30q12J175k499m366J759M408J896L597K441
$$ 2648 5218 461 345 394 6235 -341 389 -423 752 -1747 -6113 -4354 54 1950 5547 7988
4432G988p651j890L805J447n226l676Q89P799M204o771n882J18o16l046m330Q025
$$ 7988 337 -1553 2252 3699 -1527 -5203 -4314 3485 7689 918 -4964 -4846 -5462 -8508 -12838 -4813
4416d813L863K5J671q480n664M49M858L98k156O230p80q258M049L355O161O519
$$ -4813 -950 -925 746 -7734 -13398 -12949 -8091 -7693 -9849 -3619 -4399 -12657 -8608 -5253 908 7427
4400G427k082j148r66J988k919P219K161k529k033M155l306k053N37p53j024r019
$$ 7427 5345 4197 3231 5219 2300 9519 11680 9151 7118 11273 7967 5914 6451 5698 4674 -4345
4384d345p711k68L974m732n817L607O415j237P242m55K686K608n652k110j64k271
$$ -4345 -12056 -12324 -8350 -13082 -18899 -15292 -8877 -10114 -2872 -3327 -641 1967 -3685 -5795 -5959 -8230
4368h230P98L468m112j635q42K12O972m473N255P775K525J917m4k618K997m190
$$ -8230 -7432 -3964 -8076 -9711 -10553 -10341 -3369 -7842 -2587 5188 7713 9630 9586 6968 9965 5775
4352E775j292N789K917n971n518J401J1869L85r040M145P24m515j976K581Q284
$$ 5775 4483 10272 13189 7218 1700 3101 14970 15355 6315 10460 11184 6669 4693 7274 15558
4337A5558l635q326k829j518J596K392L18n071J221q87k993O694O260l326j367
$$ 15558 11923 3597 768 -750 846 3238 3556 -1515 -294 -1181 -4174 2520 8780 5454 4087
4322D087O977q662l281Q53p991q817K430L356j442K176P152Q582j957R27N578
$$ 4087 11064 2402 -879 -26 -8017 -16834 -14404 -11048 -12490 -10314 -3162 5420 3463 4390 9968
4307I968l372k919M335k237k014l765q78k889l95Q41O792l386L061K38p360l121
$$ 9968 6596 3677 8012 5775 3761 -4 -882 -3771 -4166 -3325 3467 81 3142 3380 -3980 -7101
4291g101j113N166P00M357j573j0119l280j430M639M61P091N791M276L618p176
$$ -7101 -8214 -3048 -2348 2009 436 -9683 -12963 -14393 -9754 -9293 -2202 3589 7865 11483 4307
4276D307p759m070L473M031L51j53q15k657k717J56N702K553m904r088j010J1596
$$ 4307 -3452 -7522 -4049 -18 333 180 -635 -3292 -6009 -5853 -151 2402 -2502 -11590 -12600 -1004
4260a004L744k293k200K211Q734N649p08k801J523k319r837j420j164j149m317
$$ -1004 2740 447 -1753 458 9192 14841 14133 11332 12855 10536 699 -721 -1885 -3034 -7351
4245g351k315j578r43J498o70m676j798M480J393L494K029K501Q388K53k656J106
$$ -7351 -9666 -11244 -12187 -10689 -11359 -16035 -17833 -13353 -11960 -8466 -6437 -3936 4452 4705 2049 3155
4229C155n006p178j342O597O552m75l302l598J107m060k251K916L606k770p133
$$ 3155 -1851 -9029 -10371 -3774 2778 2303 -999 -4597 -3490 -7550 -9801 -6885 -3279 -6049 -13182
4214a3182j921M83j154Q778K626O425K430j102J522M96k308K536J888o86m098
$$ -13182 -15103 -14620 -15774 -6996 -4370 2055 4485 3383 4905 5401 3093 5629 7517 6831 2733
4199B733p54L83k165M367L739L987J584p679l483M774K348o902q734J998R283
$$ 2733 1979 2362 197 4564 8303 12290 13874 6195 2712 7486 9834 2932 -5802 -3804 5479
4184E479P680N611Q43k194j1314q281L976J26j401L620P381l160o054l350n34
$$ 5479 13159 18770 19613 17419 6105 -2176 1800 1926 525 4145 11526 8366 2312 -1038 -1572
4169a572M709Q756j401p411n012K290p608L866O301P343L250M250l067k172j393
$$ -1572 3137 11893 10492 3081 -1931 359 -7249 -3383 2918 10261 13511 17761 14694 12522 11129
4154A1129o742j315N43k142K397K869l88j38J193n14j048m860k873L752N995n703
$$ 11129 4387 3072 3615 1473 3870 6739 6351 6213 7406 6892 5844 984 -1889 1863 7858 2155
4138B155o66j680o407o332O353j185k35J221N978p84l693m101J0465j521k077
$$ 2155 1489 -191 -6598 -12930 -6577 -7762 -7997 -6776 -798 -1582 -5275 -9376 1089 -432 -2509
4123b509j705J35r6J639L74M750P51j0159o987Q312R188M281m363L789Q60k616
$$ -2509 -4214 -4079 -4175 -2536 -2162 2588 3339 -6820 -13807 -5495 3693 7974 3611 7400 8260 5644
4107E644o008n577k853M155J261N001L873L108m423o27M291j244j330J755O94
$$ 5644 -364 -5941 -8794 -4639 -3378 1623 5496 8604 4181 3554 7845 6601 5271 7026 7720
4092G720j270M16Q770j606K385o166p080n403M448Q283N700K184l103q028M20
$$ 7720 6450 6866 15636 14030 16415 10249 3169 -2234 2214 10497 16197 18381 15278 7250 7670
4077G670l46o450n853k043K608N485l670j20K925n395J378M210J974O906k349
$$ 7670 7324 874 -4979 -7022 -4414 1071 -2599 -2719 206 -5189 -3811 399 2373 9279 6930
4062F930K515N015q66m666k904r360p634K045Q831k68j210o605p07M254L651j468
$$ 6930 9445 14460 13594 8928 6024 -3336 -10970 -8925 -94 -362 -1572 -8177 -8884 -4630 -979 -2447
4046b447R042j852k444K41m871l721r62J325K612q283O615N068k654j452L711
$$ -2447 6595 4743 2299 2540 -2331 -6052 -7014 -5689 -3077 -11360 -4745 323 -2331 -3783 -72
4031g2j536l600M09j387q59J917K015k297J722M681j701J409J437j758k34Q269
$$ -72 -1608 -5208 -4799 -6186 -7045 -5128 -3113 -5410 -3688 993 -708 701 2138 380 146 8415
4015H415O183n351l502p01O24q429L368J532k694K14pj713L617j647J908L357
$$ 8415 14598 9247 5745 5044 5668 -2761 607 2139 -555 -341 -348 -2061 1556 -91 1817 5174
3999E174J679j371J098M438k904K410M669j095m333m176m00J61K008L541O96L242
$$ 5174 6853 5482 6580 11018 8114 10524 15193 14098 9765 5589 5189 5350 7358 10899 11595 14837
3983A4837m048l643k401N799p25n584l735m836k732J403m396l813j674Q720P250
$$ 14837 10789 7146 4745 10544 9819 4235 500 -4336 -7068 -5665 -10061 -13874 -15548 -6828 422
3968D22N07k86J078Q76J156L053K156l835J225q231r30p91p199N105P934j891
$$ 422 929 643 1721 2597 3753 6806 8962 5127 6352 -1879 -2809 -3600 -10799 -5694 2240 349
3952C49J204K682m75o90j714j292k423q19j0160J574L246J133m15L576P07N46
$$ 349 1553 4235 3760 3070 1356 64 -2359 -3178 -13338 -11764 -8518 -7385 -7800 -4224 -3517 -2971
3936b971l725K578R697J414o507o780N51M068J457K83K341K608k646J33k344P040
$$ -2971 -6696 -4118 5579 6993 486 -6294 -5743 -1675 -218 65 2406 5014 2368 2501 157 7197
3920G197P016l999n961O2j760J508m111j272p168J725M851q73m467O136M410j634
$$ 7197 14213 10214 4253 4315 2555 4063 -48 -1320 -8488 -6763 -1912 -2785 -7252 -1116 3294 1660
3904A660j56l450L270j47l586Q552n71l082M004N724P81q59j0717j0061k31N411
$$ 1660 1504 -1946 1324 1177 -2409 6143 5572 2490 6494 12218 12999 12140 1423 -8638 -8869 -3458
3888c458l591j048L603K673Q16K467k719n076n55O476J176N589P3m692q73m840
$$ -3458 -7049 -8097 -4494 -1821 -1005 1462 -1257 -6333 -6888 -412 764 6353 6426 1734 861 -3979
3872c979N95j320K447r46l730N960L035O14l868k979q04k360J479L973l688m548
$$ -3979 -3384 -4704 -2257 -3203 -6933 -973 2062 2676 -1192 -4171 -4975 -7335 -5856 -1883 -5571 -10119
3856a0119M152J328k637J457K785M520O388l962j172l717m496j536p358Q92N393
$$ -10119 -5967 -4639 -7276 -5819 -3034 1486 7874 3912 2740 -977 -5473 -7009 -14367 -13475 -8082
3841h082M609j544j08Q29M542N930J736m141q194k27n76J680j271k030M898L630
$$ -8082 -3473 -5017 -5125 -4296 246 6176 7912 3771 -4423 -4650 -5226 -3546 -4817 -6847 -1949 1681
3825A681k600n210N449O998L803Q10p84L66o434l867M917O278L49p464m134J871
$$ 1681 -919 -6129 -680 6318 10121 10931 10147 10513 4079 212 5129 11407 11756 4292 158 2029
3809B029L175N816J91k010l468r71N427l419k121N29k35J929r51o984M605P018
$$ 2029 5204 11020 11211 9201 5733 4762 10189 6770 4649 5178 4943 6872 5921 -1063 3542 10560
3793A0560r43k415k569L062J528m469K407l018n871j100j806L143P63M805l529
$$ 10560 9617 7202 4633 7695 9223 4754 7161 4143 -1728 -2828 -4634 -1491 -728 4077 548
3778E48k773k452j0945l552M078L335J986R56L709J0462j220q427n325O33K515
$$ 548 -2225 -4677 -15622 -19174 -15096 -11761 -9775 -8819 -5110 5352 4132 -4295 -9620 -8987 -6472
3763f472p34M101O908m94j240O839N303l774j920j787J965j940m071j275o68k05
$$ -6472 -7206 -3105 3803 3309 2069 8908 14211 10437 8517 6730 8695 6755 2684 1409 741 536
3747E36n553m464j145N778M422j604J549O67J789Q312l922j0943n243J317L073
$$ 536 -5017 -9481 -10626 -4848 -426 -2030 -481 186 1975 10287 6365 -4578 -9821 -8504 -5431
3732e431O724R61M582k652o478p66J254m062k633j482n983J078R525L875j02P238
$$ -5431 1293 2254 6836 4184 -2294 -3060 -1806 -5868 -8501 -9983 -15966 -14888 -5363 -1488 -1590 5648
3716E648n829P75m405o660N595Q526K127P36O527qo661p494L831p03n098L919
$$ 5648 -181 594 -3811 -10471 -4876 3650 5777 6513 13040 13032 6371 -1123 2708 2005 -3093 826
3700H26N788N641j758n455q470j4J631o83L356p67n006M471N575m219R37j130
$$ 826 6614 12255 10497 5042 -3428 -3442 -1811 -2494 862 95 -4911 -440 5135 916 1853 723
3684G23o678p398J321O09N651J614j490o99N906J573K05P104J3789r90k278m557
$$ 723 -5955 -13353 -12032 -11423 -5772 -4158 -5648 -6347 -441 1132 1337 8441 22230 21240 18962 14405
3668A4405k772r44k849k340l014l092m801M191Om520k261O28R5L114L848k217
$$ 14405 11633 10689 7840 5500 2486 -606 -5407 -1216 -1210 -5730 -7991 -7363 -7268 -4154 -306 -2523
3652b523n429k937l51p24n166R35J645K484M46N979Q47l637l179P617P645J970
$$ -2523 -7952 -10889 -11240 -11964 -17130 -16195 -14550 -12066 -11620 -5641 -4794 -8431 -11610 -3993 3652 5622
3636E622k178K99k885m982p783L888K135J475q1o950m51O801M978M357L603K681
$$ 5622 3444 3743 858 -4124 -11907 -8019 -5884 -4409 -4490 -11440 -11891 -5090 -112 4245 7848 10529
3620A0529m610Q53J387j377j539j919j917L332j342j373l480Q70j715m804K590
$$ 10529 5919 6772 8159 6782 5243 3324 1407 4739 3397 2024 -1456 -586 -2301 -7105 -4515
3605d515O412j983k712N309M069l25k474o024r888q3K540j250J230J968m115n37
$$ -4515 1897 -86 -2798 2511 6580 6255 3781 -2243 -12131 -12214 -9674 -10924 -9694 -7726 -11841 -12378
3589a2378P508M314j0083p395N163M938P731Q250o090l181n789O84N988n375j305
$$ -12378 -4870 -556 -10639 -18034 -12871 -7933 -202 8048 1958 -1223 -7012 -6328 -340 -5715 -7020
3574g020K5j243L47j364P445J011j957k96j931M042P511M359m087J86K98m991
$$ -7020 -6995 -8238 -7891 -9255 -1810 -799 -2756 -3052 -4983 -941 6570 10929 6842 7028 7326 2335
3558B335n029j375M851j942l901L576P004K386J056q98j164N94K859j394m869
$$ 2335 -2694 -4069 782 -1160 -5061 -1485 5519 7905 8961 8063 6899 7493 10352 8958 4089
3543D089n016K50j272k487n331M917O208m405k771J250K695n627O760O782K859
$$ 4089 -927 -677 -1949 -4436 -9767 -4850 1358 -3047 -5818 -4568 -1873 -7500 -740 6042 8901
3528H901K011j809p62j035R77n710l114l035J304l227k181O154N189M962P50J007
$$ 8901 10912 9103 8341 7306 8283 2573 -541 -3576 -2272 -5499 -7680 -1526 3663 8625 9375 10382
3512A0382k681R34r873l994N561j140m069K642O11q4N837N929p163m720j199q04
$$ 10382 7701 8635 -1238 -5232 329 -811 -4880 -2238 -1627 -1711 4126 10055 2892 -1828 -3027 -3831
3496c831M009j338q374J985J0379j740r64k181k473j178k74j289O643M640Q320
$$ -3831 178 -1160 -9534 -7549 2830 1090 126 -2055 -4528 -5706 -5980 -7269 -626 4014 12334
3481A2334o17p303j118j58k378l823L254j020K501K09R88M136m189l545O4l967
$$ 12334 11717 4414 3296 3138 760 -3063 191 -829 1672 1881 2869 7005 2816 -729 -665 -4632
3465d632J621J0612m089m574k849K234M777k842p14j914Q85K876K17q04P477O263
$$ -4632 -3011 7601 3512 -1062 -3911 -1677 3100 258 -456 -2370 -1485 1391 1608 804 8281 14544
3449A4544k969l386L251q56p68M84K66K41o35q483j331Q88m386k615l497J938
$$ 14544 11575 8189 11440 10584 9816 10300 10566 10807 10172 1689 358 1246 -3140 -5755 -9252 -7314
3433g314k80j572J137P620Ll814k484j866l04N767M497J713M942J651n842l850
$$ -7314 -7594 -9166 -8029 -409 -406 -4220 -6704 -8570 -8874 -3107 1390 3103 8045 9696 3854 4
3417Dk814n631k216J921J45N803K966r05N683M047l159n9j907n486k448M667K406
$$ 4 -2810 -8441 -10657 -8736 -8591 -2788 178 -727 4956 9003 5844 5785 3878 -1608 -4056 611 3017
3400C017J904j976o471J06O79K257L554K027p092J976L421m441j009j335N996
$$ 3017 4921 2945 -3526 -3420 -2741 -484 3070 5097 -1995 -19 3402 -1039 -2048 -3383 2613
3385B613N084K09j184k863N5l178J721q58j77K331o321M41J429M186j849q998
$$ 2613 7697 7906 6722 3859 3914 736 2457 1599 1422 3753 -2568 -2127 -698 3488 1639 -7359
3369g359l724M630J467l138K06J359j114l727k124J779J935j431j352M024P962
$$ -7359 -11083 -6453 -4986 -8124 -7918 -6559 -7673 -11400 -13524 -11745 -9810 -11241 -12593 -8569 -607
3354f07M47m812j873j968k812K533M746j088m024L169M147j411r507J674R425
$$ -607 -160 -4972 -6845 -8813 -11625 -9092 -4346 -5434 -9458 -6289 -2142 -3553 -13060 -11386 -1961
3339a961J168L158K886q031q807L179R12J185k429l917O507K249O190M86n653
$$ -1961 -793 2365 5251 -2780 -11587 -8408 -7496 -6311 -8740 -12657 -6150 -3901 2289 2775 -2878
3324b878M90o269k291K781J132O026O29k568J563l214J215M47k453L725k67j306
$$ -2878 -2388 -8657 -10948 -8167 -7035 -1009 -380 -2948 -1385 -4599 -3384 -2937 -5390 -1665 -1932 -3238
3308c238l485M307M317m282N21l63J137n683N706L752J102M451N30j409j2633
$$ -3238 -6723 -2416 1901 -2381 -1860 -2223 -1086 -6769 -1063 2689 3791 8242 8772 7363 -5270
3293e270m808K618J2875m435j281n037l588K545K551N914k570M26J036j066o731
$$ -5270 -10078 -7460 5415 980 -301 -5338 -8926 -6381 -3830 2084 -486 -60 976 -90 -6821
3278f821J1810O942m375l259o042n547K266L896L174mj133j614n516kj152j367
$$ -6821 4989 11931 7556 4297 -1745 -7292 -5026 -1130 2044 2040 907 -707 -6223 -6225 -7377 -8744
3262h744O070r34Q44O239k071o070J422J279O056J765p107Q61k450j859K709J825
$$ -8744 -2674 -3608 -2764 3475 1404 -4666 -3244 -1965 4091 5856 -1251 -390 -2840 -4699 -1990 -165
$$ [...]
##END NTUPLES=NMR SPECTRUM
##END=
