##TITLE=Analysis number 318507
Compound Code cc 05903
Project Code adrs
Chemist Name ugmt
##JCAMPDX= 6.0         $$ Bruker NMR JCAMP-DX V2.0
##DATA TYPE= NMR SPECTRUM
##DATA CLASS= NTUPLES
##ORIGIN= Bruker BioSpin GmbH
##OWNER= nmr
$$ XWIN-NMR		Version 3.5
$$ Thu Mar 30 12:04:50 2006 GMT Daylight Time (UT+1h)  MAYBRIDGE\nmr@NMR_250MHZ
##.OBSERVE FREQUENCY= 250.131544655141
##.OBSERVE NUCLEUS= ^1H
##.ACQUISITION MODE= SIMULTANEOUS (DQD)
##.ACQUISITION SCHEME= undefined
##.AVERAGES= 16
##.DIGITISER RES= 18
##SPECTROMETER/DATA SYSTEM= dpx250
##.PULSE SEQUENCE= zg30
##.SOLVENT NAME= CDCl3
##.SHIFT REFERENCE= (INTERNAL, CDCl3, 0, 16.522)
##AUDIT TRAIL= $$ (NUMBER, WHEN, WHO, WHERE, WHAT)
$$ ##TITLE= Audit trail, XWIN-NMR		Version 3.5
$$ ##JCAMPDX= 5.01
$$ ##ORIGIN= Bruker BioSpin GmbH
$$ ##OWNER= nmr
$$ C:\u/data/dgb/nmr/ADRS/1950/pdata/1/auditp.txt
$$ ##AUDIT TRAIL=  $$ (NUMBER, WHEN, WHO, WHERE, WHAT)
(   1,<2006-03-30 12:04:29.72 +100>,<MAYBRIDGE\nmr>,<NMR_250MHZ>,
      <created by zg, POWCHK disabled, PULCHK disabled
       configuration hash MD5:
       84 BC 41 DB A1 6E 1D 46 DA 25 12 A5 C1 ED C5 3A
       data hash MD5: 64K
       E6 60 01 50 95 AA 31 C0 BD 21 73 C1 57 80 0E 0C>)
(   2,<2006-03-30 12:04:41.27 +100>,<MAYBRIDGE\nmr>,<NMR_250MHZ>,
      <Start of raw data processing
       ef LB = 0.3 FT_mod = 6 PKNL = 1 SI = 32K 
       data hash MD5: 32K
       F7 40 0E 36 45 1D C4 CF 52 16 70 98 84 76 85 0C>)
(   3,<2006-03-30 12:04:42.81 +100>,<MAYBRIDGE\nmr>,<NMR_250MHZ>,
      <apk 
       data hash MD5: 32K
       C5 60 D1 57 06 1E 6A 3E 88 BC 4C 21 45 48 95 93>)
(   4,<2006-03-30 12:04:43.55 +100>,<MAYBRIDGE\nmr>,<NMR_250MHZ>,
      <abs ABSG = 5 
       data hash MD5: 32K
       2C C0 BD 69 AD 22 14 E7 E9 04 54 1F 1E C4 19 B7>)
$$ ##END=
$$ 
$$ hash MD5
$$ 78 E3 F9 B6 41 27 8C C9 99 71 07 76 33 8E 86 13
##$RELAX= 
##$RELAX= 
##$RELAX= 
##$RELAX= 
##$RELAX= 
##$RELAX= 
##$RELAX= 
$$ Bruker specific parameters
$$ --------------------------
##$DU= <C:\u>
##$EXPNO= 1950
##$NAME= <ADRS>
##$PROCNO= 1
##$TYPE= <nmr>
##$USER= <dgb>
##$AMP= (0..31)
100 100 100 100 100 100 100 100 100 100 100 100 100 100 100 100 100 100 
100 100 100 100 100 100 100 100 100 100 100 100 100 100 
##$AQSEQ= 0
##$AQ_mod= 3
##$AUNM= <au_zg>
##$AUTOPOS= <26 >
##$BF1= 250.13
##$BF2= 250.13
##$BF3= 250.13
##$BF4= 250.13
##$BF5= 500.13
##$BF6= 500.13
##$BF7= 500.13
##$BF8= 500.13
##$BYTORDA= 1
##$CFDGTYP= 0
##$CFRGTYP= 5
##$CHEMSTR= <none>
##$CNST= (0..31)
1 1 145 1 1 1 1 1 1 1 1 1 1 1 1 1 1 1 1 1 1 1 1 1 1 1 1 1 1 1 1 1 
##$CPDPRG= <>
##$CPDPRG1= <>
##$CPDPRG2= <>
##$CPDPRG3= <>
##$CPDPRG4= <mlev>
##$CPDPRG5= <mlev>
##$CPDPRG6= <mlev>
##$CPDPRG7= <mlev>
##$CPDPRG8= <mlev>
##$CPDPRGB= <>
##$CPDPRGT= <>
##$D= (0..31)
0 1 0 0 0 0 0 0 0 0.06 0 0 0 0 0 0 0.0002 0 0 0 0 0 0 0 0 0 0 0 0 0 0 
0 
##$DATE= 1143716668
##$DBL= (0..7)
120 120 120 120 120 120 120 120 
##$DBP= (0..7)
150 150 150 150 150 150 150 150 
##$DBP07= 0
##$DBPNAM0= <>
##$DBPNAM1= <>
##$DBPNAM2= <>
##$DBPNAM3= <>
$$ [...]
##$SUBNAM7= <"">
##$SUBNAM8= <"">
##$SUBNAM9= <"">
##$SW= 20.6930455092707
##$SWIBOX= (0..15)
0 0 3 0 0 0 0 0 0 0 0 0 0 0 0 0 
##$SW_h= 5175.983436853
##$TD= 65536
##$TD0= 1
##$TE= 294.16
##$TE2= 300
##$TE3= 300
##$TEG= 300
##$TL= (0..7)
0 120 120 120 120 120 120 120 
##$TP= (0..7)
150 150 150 150 150 150 150 150 
##$TP07= 0
##$TPNAME0= <>
##$TPNAME1= <>
##$TPNAME2= <>
##$TPNAME3= <>
##$TPNAME4= <>
##$TPNAME5= <>
##$TPNAME6= <>
##$TPNAME7= <>
##$TPOAL= (0..7)
0.5 0.5 0.5 0.5 0.5 0.5 0.5 0.5 
##$TPOFFS= (0..7)
0 0 0 0 0 0 0 0 
##$TUNHIN= 0
##$TUNHOUT= 0
##$TUNXOUT= 0
##$USERA1= <user>
##$USERA2= <user>
##$USERA3= <user>
##$USERA4= <user>
##$USERA5= <user>
##$V9= 5
##$VALIST= <valist>
##$VCLIST= <CCCCCCCCCCCCCCC>
##$VD= 0
##$VDLIST= <DDDDDDDDDDDDDDD>
##$VPLIST= <PPPPPPPPPPPPPPP>
##$VTLIST= <TTTTTTTTTTTTTTT>
##$WBST= 1024
##$WBSW= 4
##$XGAIN= (0..3)
0 0 0 0 
##$XL= 0
##$YL= 0
##$YMAX_a= 320380
##$YMIN_a= -330820
##$ZGOPTNS= <>
##$ZL1= 120
##$ZL2= 120
##$ZL3= 120
##$ZL4= 120
##$ABSF1= 16.522
##$ABSF2= -4.171173
##$ABSG= 5
##$ABSL= 3
##$ALPHA= 0
##$AQORDER= 0
##$ASSFAC= 0
##$ASSFACI= 0
##$ASSFACX= 0
##$ASSWID= 0
##$AUNMP= <proc_1d>
##$AZFE= 0.1
##$AZFW= 0.1
##$BCFW= 0
##$BC_mod= 0
##$BYTORDP= 0
##$COROFFS= 0
##$CY= 12.5
##$DATMOD= 1
##$DC= 0
##$DFILT= <>
##$DTYPP= 0
##$F1P= 14.0000005364418
##$F2P= -0.99999901652339
##$FCOR= 0.5
##$FTSIZE= 32768
##$FT_mod= 6
##$GAMMA= 0
##$GB= 0
##$INTBC= 1
##$INTSCL= 1
##$ISEN= 128
##$LB= 0.3
##$LEV0= 0
##$LPBIN= 0
##$MAXI= 10000
##$MC2= 0
##$MEAN= 0
##$ME_mod= 0
##$MI= 0
##$NCOEF= 0
##$NC_proc= -3
##$NLEV= 6
##$NOISF1= 0
##$NOISF2= 0
##$NSP= 0
##$NTH_PI= 0
##$NZP= 0
##$OFFSET= 16.522
##$PC= 1
##$PHC0= 174.4256
##$PHC1= 4.77099
##$PH_mod= 1
##$PKNL= yes
##$PPARMOD= 0
##$PSCAL= 4
##$PSIGN= 0
##$REVERSE= no
##$SF= 250.13
##$SI= 32768
##$SIGF1= 0
##$SIGF2= 0
##$SINO= 400
##$SIOLD= 32768
##$SREGLST= <1H.CDCl3>
##$SSB= 0
##$STSI= 32768
##$STSR= 0
##$SW_p= 5175.98343685301
##$SYMM= 0
##$S_DEV= 0
##$TDeff= 65536
##$TDoff= 0
##$TI= <Analysis number 999999
Compound Code 99
Book Reference 9
Project Code 9>
##$TILT= no
##$TM1= 0
##$TM2= 0
##$TOPLEV= 0
##$USERP1= <user>
##$USERP2= <user>
##$USERP3= <user>
##$USERP4= <user>
##$USERP5= <user>
##$WDW= 1
##$XDIM= 32768
##$YMAX_p= 284671121
##$YMIN_p= -235407
$$ End of Bruker specific parameters
$$ ---------------------------------
##NTUPLES= NMR SPECTRUM
##VAR_NAME=  FREQUENCY,     SPECTRUM/REAL,   SPECTRUM/IMAG
##SYMBOL=    X,             R,               I
##VAR_TYPE=  INDEPENDENT,   DEPENDENT,       DEPENDENT
##VAR_FORM=  AFFN,          ASDF,            ASDF
##VAR_DIM=   32768,         32768,           32768
##UNITS=     HZ,            ARBITRARY UNITS, ARBITRARY UNITS
##FACTOR=    0.157963299565203, 1,           1
##FIRST=     4132.6476996994, 0,             0
##LAST=      -1043.33573715361, 0,           0
##MIN=       -1043.33573715361, -235407,     0
##MAX=       4132.6476996994, 284671121,     0
$$ Real data points
##PAGE= N=1
##DATA TABLE= (X++(R..R)), XYDATA
$$ [...]
27215c176J4792R3019K6142l3115n8692j3954q044N3342J3050m3393k0806j3132
$$ -3176 11616 104635 130777 97662 38970 25016 16972 70314 83364 39971 19165 6033
27203F033j2688l7137o4556m6528O2141O2179K2275k0291k6660M718K48M0506
$$ 6033 -6655 -43792 -108348 -154876 -92735 -30556 -8281 -28572 -55232 -50514 -50266 -9760
27191i760K0141k0041Q0314Q998m5148m4439J1388P926O5396O4124q450r5826
$$ -9760 10381 -9660 70654 79652 34504 -9935 1453 9379 74775 138899 130449 34623
27179C4623k1338J0915P9893m4025p4254n507J272N4712J7942k3870j9577l3078
$$ 34623 13285 24200 104093 60068 -14186 -19693 -18421 36291 54233 30363 10786 -22292
27167b2292K6973j7137m208j6473n2881p109J39993Q8763k8503Q723n0518l152
$$ -22292 4681 -12456 -16664 -33137 -86018 -93127 46866 135629 107126 115849 65331 62179
27155F2179O5156m5894j6312m1347k3802p553m1313p5057K8621L2970J7007n607
$$ 62179 127335 81441 65129 23782 -20 -7573 -48886 -123943 -95322 -62352 -45345 -50952
27143e0952K7113Q552K5673o9088K639O3083M012l0410m0009K1697N1460j0282
$$ -50952 -23839 -15287 10386 -58702 -56063 7020 11032 -19378 -59387 -37690 13770 3488
27131C488k90J5776n9416N443L4915J2191k7581l587m4782k4563l251K2002J7250
$$ 3488 3198 18974 -40442 -34999 -84 12107 -15474 -19061 -63843 -88406 -91657 -69655 -52405
27118e2405K8541O019O5096M2440j4212l8560m4606O783k704l0427M856n031J0478
$$ -52405 -23864 -17845 47251 89691 75479 36919 -7687 -904 -3608 -34035 -29179 -34210 -23732
27105b3732m0973q88K2042N6986j4022m636K4237M9186n6540p188J928K2J3843
$$ -23732 -64705 -65593 -43551 13435 -587 -5223 19014 68200 11660 4472 6400 6422 20265
27092B0265K511m179N6205K8641j2297L7657m8424l4678j9946m2655j03783n2794
$$ 20265 22776 18597 74802 103443 91146 128803 80379 45701 25755 -16900 -120683 -173477
27080a73477P5878R4811J0684P750n2189K1L9379L5689L3591l5590p4399L4348
$$ -173477 -97599 -2788 7896 15646 -36543 -36522 2857 38546 72137 36547 -37852 -3504
27068c504M049k4600J819J0538K9497l9072m164M8400k4808j3273p979l7623J6978
$$ -3504 545 -24055 -22236 -11698 17799 -21273 -25437 22963 -1845 -15118 -23097 -60720 -43742
27055d3742L8202N1166m0543k1348J828N806L6855j6569J598j1428m5926p807
$$ -43742 -5540 45626 5083 -16265 -14437 -8631 28224 11655 13253 1825 -44101 -51908
27043e1908K4786P225M9482k218m1715j2132m3646o7431q933J4648M759K8059
$$ -51908 -27122 -19897 29585 27367 -14348 -26480 -70126 -137557 -146490 -131842 -127083 -99024
27031i9024M5779r926M5187O072J599L810O4756k7131m8221N6453J3351l364j8030
$$ -99024 -53245 -63171 -17984 -11912 -10313 -6503 58253 31122 -17099 39354 52705 49341 31311
27018C1311j1445j508n6258O786O7034k8708k4567m401j31q960k685J5859j826
$$ 31311 19866 18358 -37900 -31114 35920 7212 -17355 -21756 -21887 -30847 -33532 -17673 -19499
27005a9499o6002n866R209Q9173J4764k4319k6534n1752j6059L4518k0875j3487
$$ -19499 -85501 -91367 -82158 7015 21779 -2540 -29074 -80826 -96885 -62367 -83242 -96729
26993i6729Q028k6365P7865M3755J3599J8248m985p323P932K7756K1535O555K2339
$$ -96729 -88701 -115066 -37201 6554 20153 38401 33416 26093 34025 61781 83316 89871 112210
26980A12210m8387p8677k7003L9472m931K3904k4015j5165k8846l7047N727P0014
$$ 112210 63823 -14854 -41857 -2385 -7316 16588 -7427 -22592 -51438 -88485 -82758 -12744
26968a2744N4705N096k7661j5559L5645R778j1231J4935J2978n5140l3182l2517
$$ -12744 41961 47057 19396 3837 39482 49260 38029 52964 65942 10802 -22380 -54897
26956e4897J5484Q272K863P791j558k0895k6660M4482M6793M664P901P0341j5325
$$ -54897 -39413 -31141 -28278 -20487 -22045 -42940 -69600 -25118 21675 26339 34240 104581 89256
26943H9256l0497n0626J4014n0391J8302L8914J2752l3231j9410P588j5260L3026
$$ 89256 58759 8133 22147 -28244 -9942 28972 41724 8493 -10917 -3329 -18589 14437
26931A4437K5532p3553l6829L8593L6381k874l2488J3022J4995K9239J4662k0375
$$ 14437 39969 -33584 -70413 -31820 4561 1687 -30801 -17779 -2784 26455 41117 20742
26919B0742n9585J5945r984P8066M6959k5621l020M3126J42q6310M813k6650l1473
$$ 20742 -38843 -22898 -32882 45184 92143 66522 63502 106628 106770 20460 25273 -1377 -32850
26906c2850j2576m2674k565l1670M9966M990J609j5958k9723J0016M0952M8226
$$ -32850 -45426 -88100 -90665 -122335 -72369 -67379 -65770 -81728 -111451 -101435 -60483 -12257
26894a2257L3256o9048p8766j204O737p673P9645J24103N6408k7991o9113j309
$$ -12257 20999 -48049 -126815 -128019 -121282 -128955 -49310 74793 131201 103210 34097 32788
26882C2788O6596K7214j1080k2522k3316m700L0725j5446o6223l0674j4225P2288
$$ 32788 99384 126598 115518 92996 69680 64980 95705 80259 14036 -16638 -30863 41425
26870D1425L8249o0845j4265N333m9601j2277K8833j7317j1785K7860l5748j3901
$$ 41425 79674 18829 4564 9897 -39704 -51981 -23148 -40465 -52250 -24390 -60138 -74039
26858g4039J15762L6591l7809j0279l9689r1183K4341Q6976o451m3684l5075L3743
$$ -74039 41723 78314 40505 30226 -9463 -100646 -76305 10671 4220 -39464 -74539 -40796
26846d0796K8803J5806M5854k6876J2952P073k0029K942L787n5743k5243L8250
$$ -40796 -11993 3813 49667 22791 35743 42816 22787 25729 29516 -26227 -51470 -13220
26834a3220O0979j7154q8998j7281R441j5228L1888M8316j362M9046L9734j3529
$$ -13220 47759 30605 -58393 -75674 -66233 -81461 -49573 -1257 -2619 46427 86161 72632
26822G2632j7233J3735k3278o0763m5678R163J1832l338N4262n5476K5119J1728
$$ 72632 55399 69134 45856 -14907 -60585 -51422 -39590 -42928 11334 -44142 -19023 -7295
26810g295l6688J5836Q289N2005N0440j91J6804l0952p9346J5568K8437K969j9862
$$ -7295 -43983 -28147 -19858 32147 82587 82396 99200 68248 -11098 4470 32907 35876 16014
26797A6014M0612l4854K9293J6033o470l6126L0638N1810N4354j9865o4409l5776
$$ 16014 56626 21772 51065 67098 60628 24502 55140 106950 161304 141439 77030 41254
26785D1254J1761k5583k8595N4307K9250j5077k366n0374k4297Q87J2165P6669
$$ 41254 53015 27432 -1163 53144 82394 67317 64951 14577 -9720 -8833 3332 80001
26773H0001M9739o2781n9869m0404M5640k0274j8140k3332j4030K8101N9188n994
$$ 80001 129740 66959 7090 -33314 12326 -7948 -26088 -49420 -63450 -35349 23839 17845
26761A7845k1365J6586K3503J6038k4076o3911o8013K1327O1016k3783l6856m408
$$ 17845 -3520 13066 36569 52607 28531 -35380 -103393 -82066 -21050 -44833 -81689 -86097
26749h6097J386k1051O4456L8318k0411k5132L5849j2997n3033L0190N0921K876
$$ -86097 -84711 -105762 -41306 -2988 -23399 -48531 -12682 -25679 -78712 -48522 2399 5275
26737E275L480J189N1376n7017k4834J10220N526J2949J8232n2037q1898J3596
$$ 5275 8755 9944 61320 4303 -20531 89689 95215 108164 126396 74359 -7539 6057
26725F057j2063r414Q903M5456M8308l1603m1228l1392k2497L5152J3110J3403
$$ 6057 -6006 -15420 -6517 38939 87247 55644 14416 -16976 -39473 -4321 8789 22192
26713B2192L5507k8698k2108l2985n4407K626N9732J01623j7985j6601j968o404
$$ 22192 57699 29001 6893 -26092 -80499 -77873 -18141 83482 65497 48896 46928 40524
26701D0524k9960p301M395n9890n371Q947N5361J2285k412m3549L4685K5891l7713
$$ 40524 10564 3263 7658 -52232 -57603 -48656 6705 18990 16578 -26971 7714 33605 -4108
26688d108N93K5833k5222K2320L8930m9088o5208j5892K665n8483L6633O5221
$$ -4108 -3515 22318 -2904 19416 58346 9258 -55950 -71842 -69177 -127660 -91027 -25806
26676b5806L8689O129r4439l3280j4165k70P7178M3160J9397l5598N5556o783
$$ -25806 12883 19012 -75427 -108707 -122872 -123142 -45964 -2804 16593 -19005 36551 29768
26664B9768l7473j0191m2840K3237K6837J6953J4407M7643j0985q8463k3089l4
$$ 29768 -7705 -17896 -60736 -37499 -10662 6291 20698 68341 57356 -31107 -54196 -54230
26652e4230J6159J5814j9334r115L5605O188q2693q29R3083J15983K394o8300
$$ -54230 -38071 -22257 -41591 -50706 -15101 -8913 -91606 -92435 648 116631 119025 50725
26640E0725n2639j7255K9610m277K7783l4183p7295j4151J5824M1820O7749q054
$$ 50725 -1914 -19169 10441 6164 33947 -236 -77531 -91682 -75858 -34038 33711 25657
26628B5657n6450l2780l5686m4429O1258K2530J3405M0263J2096J6950J6093K6148
$$ 25657 -30793 -63573 -99259 -143688 -82430 -59900 -46495 -6232 5864 22814 38907 65055
26616F5055j9640l768p453o6412M4673L364o871L895o8937p253O845j9024k5866
$$ 65055 45415 41647 34194 -32218 12455 15819 8948 12843 -56094 -63347 -56502 -75526 -101392
26603a01392N7591Q2462J2032j2295K7729k3711L04j3286m5967M5063j3398L56
$$ -101392 -43801 38661 50693 38398 66127 42416 42720 29434 -16533 28530 15132 15488
26591A5488P380l1271j9886K6397L6181m519n0279O995L4808j7888l175K360J6780
$$ 15488 22868 -8403 -28289 -1892 34289 29770 -20509 -13514 21294 3406 231 2591 19371
26578A9371J848L1014P1025m5096r1181j7529j2674l5080J737O7801L2048k1071
$$ 19371 21219 52233 123258 78162 -13019 -30548 -43222 -78302 -76565 -8764 23284 2213
26566B213m0915O1679M2839k1463n7017l6474j3713j5817K5925J7378P713j2057
$$ 2213 -38702 22977 65816 44353 -12664 -49138 -62851 -78668 -52743 -35365 -27652 -39709
26554c9709J3376k8443J2832K1523j5648j8825l2120m6314l003L5283L4136K8417
$$ -39709 -26333 -54776 -41944 -20421 -36069 -54894 -87014 -133328 -136331 -101048 -66912 -38495
26542c8495K2416K8108j2549m5836J4157J4713n5147m6014M7517K7040O049l6686
$$ -38495 -16079 12029 -520 -46356 -32199 -17486 -72633 -118647 -71130 -44090 -38041 -74727
26530g4727m914m5601R861O3621M4825l6410L6865N4307m922J3437Q3801k5540
$$ -74727 -79641 -125242 -115381 -51760 -6935 -43345 -6480 47827 42905 56342 140143 114603
26518A14603j20784m5646o0574J3879N0308J0438N1759p315l4652m9885o3848
$$ 114603 -6181 -51827 -112401 -98522 -48214 -37776 13983 6668 -27984 -77869 -141717
26507a41717Q4693N270M7513M1219J2950Q777m2328m3096K7820N4865k1759k6611
$$ -141717 -57024 -51754 -4241 36978 49928 58705 16377 -26719 1101 55966 34207 7596
26495G596J3271k2948J5688N6126Q418n0642l2755j4992M7471K9171J4736o3858
$$ 7596 20867 -2081 13607 69733 78151 27509 -5246 -20238 27233 56404 71140 7282
26483G282J0696k75m0375m5743L7731p986J9629K8192n413l7299K7401L8011O722
$$ 7282 17978 17703 -22672 -68415 -30684 -38670 -19041 9151 3738 -33561 -6160 31851 38573
26470C8573K5621j3256K0627O828q453K0256m0266Q830K5940q028J238p929m4934
$$ 38573 64194 50938 71565 78393 69940 90196 49930 58760 84700 76672 77910 69981 25047
26457B5047m1207k7911l3326M8646P3670k5441p0730k0269J0621L4725J2951P204
$$ 25047 -16160 -44071 -77397 -28751 44919 19478 -51252 -71521 -60900 -26175 -13224 -6020
26445f020L0219n1806r505l0593l0924K4369J1693O317j0347p154R2643l139n2190
$$ -6020 24199 -27607 -37112 -67705 -98629 -74260 -62567 -56250 -66597 -73751 18892 15753 -36437
26432c6437k4114K969N0440k6397L8940L4333l4702j599l4046M99L5614l465k6618
$$ -36437 -60551 -57582 -7142 -33539 5401 39734 5032 3433 -30613 -30114 5500 2035 -24583
26419b4583O481P0401j4356J0968j4315n6234J8319K3572l1306j6827p1919q531
$$ -24583 -18102 52299 37943 48911 34596 -21638 -3319 20253 -11053 -27880 -99799 -108330
26407a08330M1280K382L4069O4788k5052j8490j3221n0096K1936O9731l0483o1055
$$ -108330 -67050 -64668 -30599 34189 9137 -9353 -22574 -72670 -50734 18997 -11486 -72541
26395g2541N7370L5586p1805l9901q217n4368m7024P0730R9627K7154M9979K3274
$$ -72541 -15171 20415 -51390 -91291 -99508 -153876 -200900 -130170 -30543 -3389 46590 69864
26383F9864K8845J9569o6641j13847o307M8500K0495m838L88P697O6580j4324
$$ 69864 98709 118278 51637 -62210 -68517 -20017 478 -4360 -3972 3725 70305 55981
26371E5981M528l3635r304m4472J2838k7481m0020j8750N3316O2509L0097J9978
$$ 55981 60509 26874 17570 -26902 -14064 -41545 -81565 -100315 -46999 15510 45607 65585
26359F5585p3750k9035k3968k7811m6479M333J8125K2054P7087P735j4146J1789
$$ 65585 -8165 -37200 -61168 -88979 -135458 -131125 -113000 -90946 -13859 -6124 -20270 -8481
26347h481o235k4216m3874L331O4001M7477J2356m2967k0961J3864n27l1619J7905
$$ -8481 -14716 -38932 -82806 -79475 -15474 32003 44359 1392 -19569 -5705 -6232 -37851 -19946
26334a9946L5771L7909M240n3739K5427J6977R649m0249J4480m0607m6582l70
$$ -19946 15825 53734 57974 4235 29662 46639 56288 16039 30519 -10088 -56670 -57040
26322e7040K9086L583j0439q197L2632N3592O655m218J6720n3382l5464J2189
$$ -57040 -27954 -24371 -34810 -43007 -10375 43217 49872 45654 62374 8992 -26472 -14283
26310a4283L0169l1208o1475K376L0273L5219L1295o348j7689J140j1610J2973
$$ -14283 15886 -15322 -76797 -74421 -44148 -8929 22366 16018 -1671 -531 -12141 832
26298H32K9235O0269N1928j9453m6442n965L5159K5928j5873P1981j0253q8706
$$ 832 30067 90336 142264 122811 76369 70404 105563 131491 115618 187599 177346 88640
26286H8640k8116o2847p87J5743K8683K1004j8794o1450q106N5409l2947K0441
$$ 88640 60524 -2323 -3110 12633 41316 62320 43526 -17924 -26030 29379 -3568 16873
26274A6873K4708J9324P0573N474j1431J9120n4816j24478l427N4982l0775R236
$$ 16873 41581 60905 131478 136952 125521 144641 89825 -34653 -38080 16902 -13873 -4637
26262d637M5302N4135m35l4461k9997n902j5752L8235j3288k2361j2235j240k1349
$$ -4637 40665 94800 94365 59904 29907 24005 8253 46488 33200 10839 -1396 -2636 -23985
26249b3985j2285K6258N7416N4379R91j09357n3739K6855M9126K6304m1040m0615
$$ -23985 -36270 -10012 47404 101783 102774 -6583 -60322 -33467 15659 41963 923 -39692
26237c9692j5401q379N5028j5515K1564J6361l5624L891K6034N4698k4813n0850
$$ -39692 -55093 -63472 -8444 -23959 -2395 13966 -21658 -17767 8267 62965 38152 -12698
26225a2698q650m2038o119l096j3214k8385L279k983K5040J0527J0452K2141P7760
$$ -12698 -21348 -63386 -69505 -72601 -85815 -114200 -110921 -113904 -88864 -78337 -67885 -45744 32016
26212C2016n0658m0103k439K6514M4727J1866j9508m4229L8463K1800j4862J4573
$$ 32016 -18642 -58745 -61184 -34670 10057 21923 2415 -41814 -3351 18449 3587 18160
26200A8160L284K1636n5750k1235K238k583j0235J1432P501J9794k0576j0377
$$ 18160 21444 43080 -12670 -33905 -31667 -34250 -44485 -33053 -25552 -5758 -26334 -36711
26188c6711P0569j6858p1118o380k0947J8420J6863M2405N2932M064n8701k4671
$$ -36711 33858 17000 -54118 -60498 -81445 -63025 -46162 -3757 49175 53239 -5462 -30133
26176c0133k1650K3156L6201m0806K8855O2854k2082J1953l2952j4154K3972M2982
$$ -30133 -51783 -28627 7574 -33232 -4377 58477 36395 48348 15396 1242 25214 68196
26164F8196J1833n0346o6400l0023m554J4450L9692K4836K7705Q5830m2279o406
$$ 68196 80029 29683 -36717 -66740 -71294 -56844 -17152 7684 35389 121219 78940 72534
26152G2534L8526n0705m1902n2098M5589m4669L9442M4002m2953m5726k7763j1119
$$ 72534 111060 60355 18453 -33645 11944 -32725 6717 50719 7766 -37960 -65723 -76842
26140g6842J8702K0096J8302L7412L7287P008K246k8589j0552L1269l3297k3781
$$ -76842 -58140 -38044 -19742 17670 54957 61965 64211 35622 25070 56339 23042 -739
26128g39L1591l4431l4843k4327n1424M3916N1786l6026j9495K9942o778M1857
$$ -739 30852 -3579 -38422 -62749 -114173 -70257 -18471 -54497 -73992 -44050 -50828 -8971
26116h971j6272K7805Q6050j8947q5720r843N0373M9301r1j9697m0491o8964J4340
$$ -8971 -25243 2562 88612 69665 -16055 -25898 24475 73776 73685 53988 13497 -55467 -41127
26103d1127M6423L4489K6532P036k174P3695o0940j01062J0028k8096Q670M5784
$$ -41127 5296 39785 66317 73353 71179 144874 83934 -17128 -7100 -35196 -26526 19258
26091A9258k614k4250K7443o8757m8896P2436M1540M2997j7660l5092j183O8046
$$ 19258 16644 -7606 19837 -48920 -97816 -25380 16160 59157 41497 6405 5222 73268
26079G3268n3176p1918n345N082N5189L1269J3668K2189P91l0764j8104O376l5491
$$ 73268 20092 -51826 -57171 -52089 3100 34369 48037 70226 71017 40253 22149 28525 -6966
26066f966j1825M125j6672l8386p34K2486j0458M102L7360l3146K3527N2705M044
$$ -6966 -18791 -14666 -31338 -69724 -70458 -47972 -58430 -54328 -16968 -50114 -26587 26118 30162
26053C0162k1218l7761O2350M0209M5041l3836k4484K4154K543j5471J0618m4419
$$ 30162 8944 -28817 33533 73742 118783 84947 60463 84617 87160 71689 82307 37888
26041C7888m7297M8354K57k8499K9982P7773k2426n2822N325O4769K038j0544
$$ 37888 -9409 38945 39202 10703 40685 118458 96032 43210 48535 113304 115342 104798
26029A04798j1166k0011k1378l4499k5593J4600J5764J688L6347n9537k8175L4382
$$ 104798 93632 73621 52243 17744 -7849 6751 22515 24203 60550 1013 -27162 7220
26017G220L8824J9001L2287J4415n6877n9039j5612l5422J9783Q1168l5909l6591
$$ 7220 46044 65045 97332 111747 54870 -4169 -19781 -55203 -35420 45748 9839 -26752
26005b6752l2466n2412L4598R0825N9935o5124j2391M3758J1797l7638o105L2118
$$ -26752 -59218 -111630 -77032 13793 73728 8604 -3787 39971 51768 14130 8025 40143
25993D0143J285L1482J9788j48289j2597M5118n2583Q000M5295O0013l6048m0949
$$ 40143 41428 72910 92698 -55591 -68188 -23070 -75653 -67653 -22358 37655 1607 -39342
25981c9342L495m3806J0435j3088K126j2686j6845J7026j4816J965j6685K1218
$$ -39342 -35847 -79653 -69218 -82306 -80180 -92866 -109711 -92685 -107501 -105536 -122221 -101003
25969a01003k3148M6131L9131M0983M6859J0293j1988J4787M2146k9939j3446
$$ -101003 -124151 -78020 -38889 2094 48953 59246 47258 62045 104191 74252 60806
25958F0806k4741l0561Q14N106j0203j3673j26758J8637K2394K3359J6997N4127
$$ 60806 36065 5504 6318 11424 1221 -12452 -139210 -120573 -98179 -74820 -57823 -3696
25946c696J5748l6547L9487j0982K9098L0689J4387o5890J4776m56J5177M7458
$$ -3696 12052 -24495 14992 4010 33108 63797 78184 12294 27070 26614 41791 89249
25934H9249J1597m3471k2004O29k4508L4315l1842j16018L1006J1050l3638R859
$$ 89249 100846 57375 35371 36000 11492 45807 13965 -102053 -71047 -59997 -93635 -83776
25922h3776J1530R802j0126o674O723J9356j7950J4090O3580L1716l7571m1375
$$ -83776 -72246 -62444 -72570 -79244 -72521 -53165 -71115 -57025 6555 38271 700 -40675
25910d0675k075K2152l0514j981j5564p9130N9975M1765O470j8982K16O3809Q917
$$ -40675 -42750 -20598 -51112 -53093 -68657 -147787 -87812 -46047 -39577 -58559 -58343 5466 14383
25897A4383m7453R844j6437L5787N4824K9292m6861m2987k0746K4923l460K0933
$$ 14383 -33070 -23226 -39663 -3876 50948 80240 33379 -9608 -30354 -5431 -8891 12042
25885A2042l0792J8066M8873m406m9471n9544J4278k4129P371J4386K5072M0561
$$ 12042 -18750 -684 48189 43783 -5688 -65232 -50954 -75083 -67712 -53326 -28254 12307
25873A2307J1923j9174N1674m7933n1445m4185o624p293J2227K6162M0307P3774
$$ 12307 24230 5056 56730 8797 -42648 -86833 -93457 -100750 -88523 -62361 -22054 51720
25861E1720K4860j4165p2990l2165k6550J4352j6756n221K7040j3728j0713N1639
$$ 51720 76580 62415 -10575 -42740 -69290 -54938 -71694 -76915 -49875 -63603 -74316 -22677
25849b2677k6713n0442N4994M5291j7306K1629m2797K5704K0934K9426q194o0280
$$ -22677 -49390 -99832 -44838 453 -16853 4776 -38021 -12317 8617 38043 29849 -30431
25837c0431k2392L3929j7077O0515k4074J3074K0245J0327r426J7980j0053o6722
$$ -30431 -52823 -18894 -35971 24544 470 13544 33789 44116 34690 52670 42617 -24105
25825b4105q034j304l7293K0721O5825k4896j4051M2655l6185n3724K5714K1307
$$ -24105 -32139 -33443 -70736 -50015 15810 -9086 -23137 19518 -16667 -70391 -44677 -23370
25813b3370K237L5191k8744j0491M1584M7539j9144P728k1995Q199m6635n6911
$$ -23370 -21133 14058 -14686 -25177 16407 63946 44802 52530 30535 38734 -7901 -64812
25801f4812o841l827M0570l9384O742M2296K1767j1119M8476N5443R465m6877
$$ -64812 -71653 -75480 -34910 -74294 -67552 -25256 -3489 -14608 33868 89311 98776 51899
25789E1899j4401J4020k5285k7470K3964K5760o4139j1520P361M3976P052J0482
$$ 51899 37498 51518 26233 -1237 22727 48487 -15652 -27172 -19811 24165 31217 41699
25777D1699M479K3564L660j4309M3558r100l4187M3589J3785J0592l4293n0754
$$ 41699 46178 69742 73402 59093 102651 93551 59364 102953 116738 127330 93037 42283
25765D2283k4034L4844l0941m9134l2705j4800O5542j1545k5340M1621L8725k4361
$$ 42283 18249 53093 22152 -26982 -59687 -74487 -8945 -20490 -45830 -4209 34516 10155
25753A0155l5596K9770L2034O670k0120k1375n3812K1652O7643L6159j9411J3546
$$ 10155 -25441 4329 36363 43033 22913 1538 -52274 -30622 37021 73180 53769 67315
25741F7315m122l8009P528Q296l3989n6750k6243L8499L9123P1169l2215R228
$$ 67315 63193 25184 32712 41008 7019 -49731 -75974 -37475 1648 72817 40602 49830
25729D9830l585l0679l3954m2523M9398L7281J3713J8612q267k8853l6877j717
$$ 49830 46245 15566 -18388 -60911 -11513 25768 39481 58093 49826 20973 -15904 -17621
25717a7621k9028M1978k2848r023k443L0715p767m4981p533r793r772K913O7852
$$ -17621 -46649 -4671 -27519 -36542 -38985 -8270 -16037 -61018 -68551 -78344 -88116 -85203 -17351
25704a7351O2138L4432l5249p3696m8968Q085M1474J3849J6770K313N8369m1792
$$ -17351 44787 79219 43970 -29726 -78694 -70609 -29135 -15286 1484 3797 62166 20374
25692B0374O199o1800K1410L2229k9587m4225j6637Q170L9568L2498K2369j6712
$$ 20374 26573 -35227 -13817 18412 -11175 -55400 -72037 -63867 -24299 8199 30568 13856
25680A3856n1806k9516j8654L9165p185K0961N1019l3779q417L5825K8088m116
$$ 13856 -37950 -67466 -86120 -46955 -54140 -33179 17840 -15939 -24356 11469 39557 35441
25668C5441j8198j013K87k0638K2244N476K5259Q749l7943P424L3021p4385o7562
$$ 35441 17243 16230 16517 -4121 18123 23599 48858 57607 19664 27088 60109 -14276 -81838
25655h1838J7697K0206M6926l627p9843k3515k6244J8052L594M3946P0262N3660
$$ -81838 -64141 -43935 2991 -636 -80479 -103994 -130238 -112186 -108592 -64646 5616 59276
25643E9276j4518k3918M306k571O0078j3167m9938q03K4815k929L3410j6966j2697
$$ 59276 44758 20840 25146 22575 82653 69486 19548 18745 43560 40631 74041 57075 44378
25630D4378l6564K3002J9179j8200q0489l551J6380L8042L2595L7265m7971n3531
$$ 44378 7814 30816 49995 31795 -48694 -52245 -35865 2177 34772 72037 24066 -29465
25618b9465J9204J2970L3641n882l435k2849j7861r525J9216m8540L251k2665
$$ -29465 -10261 2709 36350 30468 27033 4184 -13677 -23202 -3986 -52526 -49275 -71940
25606g1940m0043M2116j4605o5559l0692Q6659J6681O9183J7456j4780K8363N944
$$ -71940 -111983 -69867 -84472 -150031 -180723 -94064 -77383 -8200 9256 -5524 22839 28783
25594B8783p5664J4561m5722J4635J835O2680O8845M4278k3582m3118j5425n5618
$$ 28783 -46881 -32320 -78042 -63407 -61572 1108 69953 114231 90649 47531 32106 -23512
25582b3512J1625J9402K0490k263K3442L448o0248k6543M8550l601L0912m4234
$$ -23512 -11887 7515 28005 25742 49184 52632 -7616 -34159 14391 10790 41702 -2532
25570b532K2805P6957J2408p6568n3029L0112m4915L615j0616K4203M7159L6307
$$ -2532 20273 97230 109638 33070 -19959 10153 -34762 -31147 -41763 -17560 29599 65906
25558F5906m3716o9670n913l6130L3546K1856p981o0420Q868r086N822q378O2740
$$ 65906 22190 -47480 -53393 -89523 -55977 -34121 -42102 -102522 -93654 -102740 -96918 -105296 -42556
25545d2556M2440k5254M215j7701Q230O3621J4149j6622L0037j9719l9186l6024
$$ -42556 -116 -25370 -21155 -38856 -30626 32995 47144 30522 60559 40840 1654 -34370
25533c4370n9989J7612J4204J8231O1752L0040j8477J0033J5855l5580m4926j0256
$$ -34370 -94359 -76747 -62543 -44312 17440 47480 29003 39036 54891 19311 -25615 -35871
25521c5871j3689L2920N5824P5771j0046m1530r93o6507l5348J4954n170J2385
$$ -35871 -49560 -16640 39184 114955 104909 63379 62386 -4121 -39469 -24515 -29685 -17300
25509a7300K4311K6310m7231j122r704l0826O681Q537K3945o54j2414k5648K0425
$$ -17300 7011 33321 -13910 -15032 -24736 -55562 -48881 -40344 -16399 -17053 -29467 -55115 -34690
25496c4690J9928m7327L0410j7562n7852N5308K7100r521K0022K6887M6090n1936
$$ -34690 -14762 -62089 -31679 -49241 -107093 -51785 -24685 -34206 -14184 12703 58793 6857
25484F857k3548l9811n6894J5819j996q907o653O5030N6653J1600J6350o2040
$$ 6857 -16691 -56502 -113396 -97577 -99573 -108480 -115133 -50103 6550 18150 34500 -27540
25472b7540l4694N4908K1271j2205L4615M6323k3575n7823k2689k4033N7282K7074
$$ -27540 -62234 -7326 13945 1740 36355 82678 59103 1280 -21409 -45442 11840 38914
25460C8914p9454M807q958P951M9194J2937O133o1845n6906L0355N0502N0216
$$ 38914 -40540 -35733 -44691 -36740 12454 25391 31524 -30321 -87227 -56872 -6370 43846
25448D3846m4580o8938P572O6851M6927j3958q721m8099j3845R618M782M1380
$$ 43846 -734 -69672 -62100 4751 51678 37720 28999 -19100 -32945 -23327 -18545 22835
25436B2835N325p1901N1416n501J0077J8594n2575o2484J6583N7433L9007k0429
$$ 22835 28160 -43741 7675 2174 12251 30845 -21730 -84214 -67631 -10198 28809 8380
25424H380l860o2252m8213o980L8443m959k8604j3273r298O5997J01404L701j7806
$$ 8380 4520 -57732 -105945 -112925 -74482 -79441 -108045 -121318 -130616 -64619 36785 40486 22680
25411B2680L738m1403m5286K5327j3375k7281L4494J8432k4939P86m7747L5039
$$ 22680 26418 -14985 -60271 -34944 -48319 -75600 -41106 -22674 -47613 -46827 -94574 -59535
25399e9535j4394m6257N3460K1018l4923j5214M5944O3080m671l4368j4048J4643
$$ -59535 -73929 -120186 -66726 -45708 -80631 -95845 -49901 13179 8508 -25860 -39908 -25265
25387b5265j0177k6063p77J01L4125j734k790j6396M2605m1444K2942N420k64
$$ -25265 -35442 -61505 -62282 -62181 -28056 -29790 -32580 -48976 -6371 -47815 -24873 -19453 -19717
25374a9717M0476L893n3749m9053M4404K6194k7321L8326P673j1333m8446k5350
$$ -19717 20759 24652 -29097 -78150 -33746 -7552 -34873 3453 11126 -207 -48653 -74003
25362g4003j7215P926p040o466m947J1650R581M2450L7464j2572J653J0649K7358
$$ -74003 -91218 -83292 -90332 -96798 -101745 -90095 -80514 -38064 -600 -13172 -11519 -870 26488
25349B6488r795K9427p755n9990K8528j0512k4966l2511J7579O5195J8985j082
$$ 26488 16693 46120 38365 -21625 6903 -3609 -28575 -61086 -43507 21688 40673 39591
25337C9591m4544j8922k3023K6203l3410l6277K6944J5787M6868K765L3268m0849
$$ 39591 -4953 -23875 -46898 -20695 -54105 -90382 -63438 -47651 -783 1982 35250 -5599
25325e599p4317J6678O5487m8937O277L0120m7922J2217J7358J6152m654k2663
$$ -5599 -79916 -63238 2249 -46688 -40411 -10291 -58213 -45996 -28638 -12486 -17140 -39803
25313c9803k392l2676q555m2164L4493K9574P2537J8273r5179J8810N3964n0390
$$ -39803 -42195 -74871 -83426 -125590 -91097 -61523 11014 29287 -65892 -47082 6882 -43508
25301d3508l4146K590O9664j486m1989P3861L2601J3444M9740k8079p3290k8848
$$ -43508 -77654 -75064 -5400 -6886 -48875 24986 57587 71031 120771 92692 19402 -9446
25289i446k51K6447M2087K0144R847q7416q9045L3126K7304l4935K2588L0499
$$ -9446 -9697 16750 58837 78981 88828 1412 -87633 -54507 -27203 -62138 -39550 -9051
25277i051K1033K1832j1399K7174L8840J1053j0137l4131k4957q293J0853q38
$$ -9051 11982 33814 22415 49589 88429 99482 89345 55214 30257 21964 32817 31979
25265C1979M124n9074k8131M2241K7088k2515k0222k6769O4799K4069m2140m7693
$$ 31979 36103 -22971 -51102 -8861 18227 -4288 -24510 -51279 13520 37589 -4551 -52244
25253e2244l3456Q584P326n099n075P7179J6862l5256k5167n5609M46L6426O9605
$$ -52244 -85700 -77116 -69790 -74889 -79964 -2785 14077 -21179 -46346 -101955 -101509 -65083 4522
25240D522l2290l8447p931k938P2269N9314l4759M233Q803n8079J4084j904K7809
$$ 4522 -27768 -66215 -74146 -77084 -4815 54499 19740 23973 32776 -25303 -11219 -13123 14686
25227A4686J0060M2369p487r429K7063k0454m6697k2955N5754k9247L8809L7572
$$ 14686 24746 67115 59628 50199 77262 56808 10111 -12844 42910 13663 52472 90044
25215I0044M7476o1185r9750p1105K432Q871M6899M0279n0356L5009O246L2316
$$ 90044 137520 76335 -23415 -94520 -92088 -83217 -36318 3961 -46395 -11386 -5140 27176
25203B7176r640l0233K7794N3180P920q1235n903M3550J4913K8198J8789N687
$$ 27176 17536 -12697 15097 68277 76197 -5038 -10941 32609 47522 75720 94509 100196
25191A00196q3814l9416J1133o1286j9113O1154M1301L5641R115m3139r949P2307
$$ 100196 16382 -23034 -11901 -73187 -92300 -31146 10155 45796 54911 11772 1823 74130
25179G4130j8245l4716O8738l7220l7433K3478P1025M9580m6986n0534j5912k1305
$$ 74130 55885 21169 89907 52687 15254 38732 109757 159337 112351 61817 45905 24600
25167B4600k4019o8101j3243K5712M6489K490m7417m7493J3454O1438M5672k5968
$$ 24600 581 -67520 -80763 -55051 -8562 -6072 -53489 -100982 -87528 -26090 19582 -6386
25155f386L5254N4780m9153q1439o2960R270j4530J0971p155L5299j4470M9602
$$ -6386 28868 83648 34495 -46944 -109904 -100634 -115164 -104193 -111348 -76049 -90519 -40917
25143d0917K6065M900l6226R056j690O309m498j542N370Q023N9309O836M0310
$$ -40917 -14852 -9952 -46178 -37122 -38812 -32503 -37001 -38543 -33173 -25150 34159 40995 81305
25130H1305M3206L9210n1939o5634j0039R996N9790l973l1140l4234k2903j0453
$$ 81305 124511 163721 111782 46148 36109 46105 105895 101922 70782 36548 13645 3192
25118C192j8304M4580k1608j1869M4742p495M4799n0633j5127N8220L918J1083
$$ 3192 -15112 29468 7860 -4009 40733 33238 78037 27404 12277 70497 74415 85498
25106H5498K149o2501k9874k1335j2040J5586J5145J2409n0742j1676j0218k1091
$$ 85498 87647 25146 -4728 -26063 -38103 -22517 -7372 5037 -45705 -57381 -67599 -88690
25094h8690k7764Q8261N3982L7603o4909j0738n652j9305L3676k466m1764j03079
$$ -88690 -116454 -28193 25789 63392 -1517 -12255 -17907 -37212 -3536 -6002 -47766 -150845
25082a50845M7128L0762K4086m1045o3177j0969P2575J9782O0593M1974J3147
$$ -150845 -103717 -72955 -48869 -89914 -153091 -164060 -91485 -71703 -11110 30864 44011
25071D4011p2133l7694j764Q505O6721N4076J2519k3314n1103J2667M1818P171
$$ 44011 -28122 -65816 -67580 -59075 7646 61722 74241 50927 -176 12491 54309 61480
25059F1480N37l6470O071k9583j2696K2064o6075l2635j4187J6511m4720O1073
$$ 61480 62017 25547 31618 2035 -10661 11403 -54672 -87307 -101494 -84983 -129703 -68630
25047f8630N9809m37k2484K9299Q4906j0478r9795m4204L0557R1020j0395o6341
$$ -68630 -8821 -9258 -31742 -2443 82463 71985 -27810 -72014 -41457 49563 39168 -27173
25035b7173k6866o432L2461j1336N3258j1627n1111j9515k7201l5963n9052k553
$$ -27173 -54039 -60471 -28010 -39346 13912 2285 -48826 -68341 -95542 -131505 -190557 -193110
25023a93110N4675P4027K5908N0363k998k8858l4159L093K1670M0231J6556L11
$$ -193110 -138435 -64408 -38500 11863 8865 -19993 -54152 -51059 -29389 10842 27398 27709
25011B7709j9975l3788l1036j4082N5067L4984n817j7285K1820k8601n6430M3018
$$ 27709 7734 -26054 -57090 -71172 -16105 18879 13062 -4223 17597 -11004 -67434 -24416
24999b4416J2482l0096J8732L5188l7678M6437L2225l645l062J0659r527l8556
$$ -24416 -11934 -42030 -23298 11890 -25788 20649 52874 49229 46167 56826 47299 8743
24987H743n3647M6582M2295P826P882J1856q642K4187j5035m1744M2506l9146
$$ 8743 -44904 1678 43973 51799 59681 71537 62895 87082 72047 30303 72809 33663
24975C3663j4393K8597k5183l3867P1480N481m8507l3551L2491K9835k1874l2770
$$ 33663 19270 47867 22684 -11183 60297 65778 17271 -16280 16211 46046 24172 -8598
24963h598M3969Q3427n1102n6158M5576K3789m2352n0567J7338L3039m9995p7115
$$ -8598 35371 118798 67696 11538 57114 80903 38551 -12016 5322 38361 -11634 -88749
24951h8749k9034O0525o996K993l5944r408r320L8007K9971k3488p259L3728J0946
$$ -88749 -117783 -57258 -64254 -61261 -97205 -106613 -115933 -77926 -47955 -71443 -78702 -44974 -34028
24938c4028Q024K9818m7714o440k8439j4101O2924L0461j1920o6289m7842O650
$$ -34028 -26004 3814 -43900 -50340 -78779 -92880 -29956 505 -11415 -77704 -125546 -118896
24926a18896N1054P912P221K0055N6885J869k6855n4805P289O7781L1767l0708
$$ -118896 -67842 -59930 -52709 -32654 24231 26100 -755 -55560 -48271 19510 51277 20569
24914B0569k9207r897J6232N6412J8146l2509K0768N488o1468l5871j1485q76
$$ 20569 -8638 -18535 -2303 54109 72255 39746 60514 66002 4534 -31337 -42822 -43698
24902d3698L8148o115L2912J9047M6058J5758r316k5419L186m8812q0281M8436
$$ -43698 -5550 -11665 21247 40294 86352 102110 92794 67375 70561 21749 -58532 -10096
24890a0096K9367q883M7854M619k7400p8840r0121m475J1122J5332N2943J6937
$$ -10096 19271 10388 58242 62861 35461 -43379 -133500 -137975 -126853 -111521 -58578 -41641
24878d1641K8529k982K0100M2469m1244j2564K9703P1412J2673k0306n4915m4320
$$ -41641 -13112 -16094 4006 46475 5231 -7333 22370 93782 106455 86149 31234 -13086
24866a3086K1176K9385M4666Q579o1317p0181J5262L3304N556r415l5249Q0149
$$ -13086 8090 37475 82141 90720 29403 -40778 -25516 7788 13344 3929 -31320 48829
24854D8829R813l5398R499k0744m8814m2639L3915P5088j9387m588J9211q824
$$ 48829 58642 23244 32743 11999 -36815 -79454 -45539 29549 10162 5574 24785 15961
24842A5961j6408m9231r520N6383K6618p5168O468K5811P249k7098l264k5925
$$ 15961 -447 -49678 -59198 -2815 23803 -51365 -44897 -19086 -11837 -38935 -42199 -68124
24830f8124M5822J5223K6703K9344o4400n2631L355m1185n209O1775M3459J8452
$$ -68124 -22302 -7079 19624 48968 -15432 -68063 -64708 -105893 -111102 -49327 -5868 12584
24818A2584J6848J5771N7879m978k8589J8496l9488r6698n4548J1406M6186k036
$$ 12584 29432 45203 103082 98104 69515 88011 48523 -48175 -102723 -91317 -45131 -47167
24806d7167K8114P7600n339J7316M7035o010j13297j4457M1553k5441m2015K9237
$$ -47167 -19053 58547 53208 70524 117559 111549 -1748 -16205 25348 -93 -42108 -12871
24794a2871L6617M2064K1955k124l2022m63L1219K001m8054o8719m0986j896j9295
$$ -12871 23746 65810 87765 85641 53619 53156 84375 86376 38322 -30397 -71383 -73279 -92574
24781i2574n8622J9529J19735P5089J0056K1390n740j0434p9755n2677K3856P9327
$$ -92574 -151196 -131667 -11932 63157 73213 94603 88863 78429 -1326 -54003 -30147 49180
24769D9180k2580j5178O8481R767k4583p104m3641K4406J6684J1907m0686l1919
$$ 49180 26600 11422 79903 89670 65087 57983 14342 38748 55432 67339 26653 -5266
24757e266J3793l34m9627o3449R0539J16280J2061l994l7921l4152k9277L7460
$$ -5266 8527 8193 -41434 -104883 -14344 101936 113997 110003 72082 37930 8653 46113
24745D6113R732P019l296j6749o9093r881n05O2671L7202n3140k7840l6100j7994
$$ 46113 55845 62864 59568 42819 -26274 -36155 -36660 26011 63213 10073 -17767 -53867 -71861
24732g1861n4430M0487K4202K925R506K3961j711n44l8045m319k0365m7989K3716
$$ -71861 -126291 -85804 -61602 -58677 -49171 -25210 -26921 -27465 -65510 -69829 -90194 -138183 -114467
24719a14467J924R330M5898M6537k8005j7337k7616q31M0451N719j1026k2935
$$ -114467 -112543 -103213 -57315 -10778 -38783 -56120 -83736 -84567 -44116 -38397 -49423 -72358
24707g2358N9473P0742k1648k5811K6092j5202J4687N2729O7o5647p8735M04K9080
$$ -72358 -12885 57857 36209 10398 36490 21288 35975 88704 88771 23124 -55611 -55207 -26127
24694b6127m391o038M7411J5623p45m6268j8442P792j2549M0643j2341N179N1062
$$ -26127 -30518 -36556 10855 26478 25733 -20535 -38977 -31185 -43734 -3091 -15432 -10253 40809
24681D0809m8188n133k0504l4994j5802O3570O6037l8745j3875p864k7501l3536
$$ 40809 -7379 -12512 -33016 -68010 -83812 -20242 45795 7050 -6825 -14689 -42190 -75726
24669g5726M1172N0307N971p8176Q790R8698j5411m4093j4433m5829J3824O8819
$$ -75726 -34554 15753 21724 -56452 -47662 51036 35625 -8468 -22901 -68730 -54906 13913
24657A3913M6998j4994K0142j47J1924K7380K7404J3115j4920j4325l3053j7716
$$ 13913 60911 45917 66059 65912 77836 105216 132620 145735 130815 116490 83437 65721
24645F5721n8294n6453K1524Q7913k1876N655J0442k9154j5950m3J8780J3341
$$ 65721 7427 -49026 -27502 60411 38535 44190 54632 25478 9528 9485 28265 41606
24633D1606l0474N6776P4859n1444o0520j7290k9866O0896R8476j0250l0290m8802
$$ 41606 11132 67908 142767 91323 30803 13513 -16353 44543 143019 132769 102479 53677
24621E3677j312J1828o3082K317K2112m3049K5573J8401R351o1395K2410Q2989
$$ 53677 52365 64193 1111 3428 25540 -17509 8064 26465 35816 -25579 -3169 79820
24609G9820l476m3913o0108k3653k3719N3671L8470J7785l7759J0623N9307p4573
$$ 79820 76344 32431 -27677 -51330 -75049 -21378 17092 34877 -2882 7741 67048 -7525
24597g525n7591k4561k4188k2785p457P9574P7860O8072r109k6389N2469k3604
$$ -7525 -65116 -89677 -113865 -136650 -144107 -64533 13327 81399 72290 45901 98370 74766
24585G4766n0249m9645J7424j6503j3165L9027Q950Q140J507k8588j1516j1192
$$ 74766 24517 -25128 -7704 -24207 -37372 1655 10605 18745 20252 -8336 -19852 -31044
24573c1044Q0517J8444n0306L7311L7007n1557m5154m4667j9401M4828M5345O582
$$ -31044 49473 67917 17611 54922 91929 40372 -4782 -49449 -68850 -24022 21323 27905
24561B7905j7063j8685o478M572N1752K7639J102j3150J9529j9944m8839m0584
$$ 27905 10842 -7843 -14321 -9749 42003 69642 70744 57594 77123 57179 8340 -32244
24549c2244j6124N8480P0553l8276r6443k9048L8159N0585K8545J9125P915k9888
$$ -32244 -48368 10112 80665 42389 -54054 -83102 -44943 5642 34187 53312 61227 31339
24537C1339k1122m8156k0337M8740P0952M7906o3274q5637J9037O073J202j519
$$ 31339 10217 -37939 -58276 -9536 61416 109322 46048 -39589 -20552 -14479 -13277 -14796
24525a4796j2602j1631l665K8583O438j5202K4078M5622j0432J841k2205j6990
$$ -14796 -27398 -39029 -42694 -14111 -7673 -22875 1203 46825 36393 38234 16029 -961
24513i61J6572N767k0251n5595Q66L682J892N6466j5169J952J7376k3103L5751
$$ -961 15611 21378 1127 -54468 -53602 -49920 -48028 8438 -6731 -4779 12597 -10506 25245
24500B5245J416m6760L2101J7177q858L0885m5612O965J1738J6234p958k7099
$$ 25245 26661 -20099 12002 29179 20321 51206 5594 12559 24297 40531 32573 5474
24488E474m9176k4891l8460M4030l1835j0816J6407N032J6493L3498O0945P6477
$$ 5474 -43702 -68593 -107053 -63023 -94858 -105674 -89267 -84235 -67742 -34244 26701 103178
24476A03178P1559J417q1225p6508o4804k6326j8199l7757m312L8770M2719Q763
$$ 103178 174737 176154 94929 18421 -46383 -72709 -90908 -128665 -132977 -94207 -51488 -42725
24464d2725n8590K8354J7185j7006L3633K3396K154j2755k8700l5188P3969p312
$$ -42725 -101315 -72961 -55776 -72782 -39149 -15753 -13599 -26354 -55054 -90242 -16273 -23585
24452b3585J2981K1625M8781J6948n4924k7467M9304M6197k0341q041m067l6832
$$ -23585 -10604 11021 59802 76750 21826 -5641 43663 89860 69519 61478 57411 20579
24440B0579k2554m070M3617l888p1969l0352p8826j9061N5834Q9165M4896j4936
$$ 20579 -1975 -6045 37572 33684 -38285 -68637 -147463 -166524 -110690 -21525 23371 8435
24428H435j7981L1968o795j2277L7075k974R247M4456m8274p4595k9520L342j838
$$ 8435 -9546 22422 15627 3350 40425 37451 46698 91154 42880 -31715 -61235 -57893 -59731
24415e9731R929K180k4356j1619L0833K6346O7188P420m9032o4865m3541O0297
$$ -59731 -49802 -47622 -71978 -83597 -52764 -26418 40770 48190 -842 -65707 -109248 -48951
24403d8951m087R030J8050R514K6662M6095P594p295j2946K4050o5942o6564K4942
$$ -48951 -53038 -44008 -25958 -16444 10218 56313 63907 56612 43666 67716 1774 -64790 -39848
24390c9848Q4431L694k9075Q408j5920K1517R206j2677j5853m2103N8335L3150
$$ -39848 44583 48277 19202 27610 11690 33207 42413 29736 13883 -28220 30115 63265
24378F3265J1244O584J4076n1818M6977k6321j3958j1669n3439k2741j6865k6419
$$ 63265 74509 81093 95169 43351 90328 64007 50049 38380 -15059 -37800 -54665 -81084
24366h1084m3090j0385O9916M2885J1186N762M9811M4262m7093j6264J4749r954
$$ -81084 -124174 -134559 -64643 -21758 -10572 -4810 45001 89263 42170 25906 40655 30701
24354C0701j1914l0398o8522p968Q5390L8879m8450l8018j3966M1445K325K9382
$$ 30701 18787 -11611 -80133 -88101 -2711 36168 -12282 -50300 -64266 -22821 -20496 8886
24342H886J8337J5589O089J6732m3671o1599k4049j9265K5020j7087l2936J4553
$$ 8886 27223 42812 48901 65633 21962 -39637 -63686 -82951 -57931 -75018 -107954 -93401
24330i3401O134J8851M407Q661J6413j4794k6R033L8704k315o4217j2823r834
$$ -93401 -87267 -68416 -64009 -55348 -38935 -53729 -53755 -44722 -6018 -8333 -72550 -85373 -95207
24317i5207P710p626j7398l243J1899L2095J2204K7091J762j0122k1525J4025
$$ -95207 -87497 -95123 -112521 -115764 -103865 -71770 -59566 -32475 -30713 -40835 -62360 -48335
24305d8335L6013O3622N202k1283n1857l6L2763L3975k3485j9943K5060k537k3006
$$ -48335 -12322 51300 56502 35219 -16638 -16674 16089 50064 26579 6636 31696 29159 6153
24292F153P989m3870q763N0019M1551m4347n5388M1187M5105K7290J9711l3708
$$ 6153 14142 -29728 -38491 11528 53079 8732 -46656 -5469 39636 66926 86637 52929
24280E2929k2824K9521N06n1088k0191L6333K1891j1085m12j3780N0273M708j01206
$$ 52929 30105 59626 60132 9044 -11147 25186 47077 35992 35580 21800 72073 76781 -24425
24267b4425q4008K1465O4944O5558l1399o2055l9066L7437Q3066K0422k899j9254
$$ -24425 -108433 -86968 -22024 43534 12135 -49920 -88986 -51549 31517 51939 49040 29786
24255B9786O609K3292R371k9188m7068l975K6428L4104M2025j5379p3054K547
$$ 29786 36395 59687 69058 39870 -7198 -11173 15255 49359 91384 76005 2951 5498
24243E498L6124N3785N3532k5255m3586j08693m2028N6515J04165P1023k3704
$$ 5498 41622 95407 148939 123684 80098 -28595 -70623 -14108 90057 161080 137376
24232A37376n4397k4393k6236m6171N077J298k096k7692o6367m5152j7928K3936
$$ 137376 82979 58586 32350 -13821 -8744 -7446 -9542 -37234 -103601 -148753 -166681 -142745
24220a42745K1595m917N5214Q8883j4581m0761j1598M7964L3352k2740l9018M972
$$ -142745 -121150 -126067 -70853 18030 3449 -37312 -48910 -946 32406 9666 -29352 -24380
24208b4380J2034J6750l3507n5351J714N456k602J3139J2056j675l7053L3486
$$ -24380 -12346 4404 -29103 -84454 -82740 -77284 -79886 -66747 -54691 -56366 -93419 -59933
24196e9933K0419K992K6619M8326l0228n3477j01880m8947N9383N7620m198j4677
$$ -59933 -39514 -36522 -9903 38423 8195 -45282 -147162 -196109 -136726 -79106 -83304 -97981
24184i7981m0699k5779L7924J5609R1858L1062R221k3913m0677K1568L0829O1943
$$ -97981 -138680 -164459 -126535 -110926 -19068 11994 21215 -2698 -43375 -21807 9022 70965
24172G0965L3657o5935n2080j7175j4029j8360L5798N791K423L8227k5239J0023
$$ 70965 104622 38687 -13393 -30568 -44597 -62957 -27159 -21368 -18945 19282 -5957 4066
24160D066j1026n480n796J4345k9879M31k3200J0545M1830L4397k6992L694j3881
$$ 4066 -6960 -12440 -18236 -3891 -33770 -33339 -56539 -45994 -4164 30233 3241 6935 -6946
24147f946N0180K7686l0463m1651q934O0299K9903l4247p527j3802j6686K7056
$$ -6946 43234 70920 40457 -1194 -10128 50171 80074 45827 38300 24498 7812 34868
24135C4868n6756J0913l0287k1425k3075o7121K409L7725R9182M4214K7423j7585
$$ 34868 -21888 -10975 -41262 -62687 -85762 -152883 -150474 -112749 -13567 30647 58070 40485
24123D0485n8461o3482m6185O7131K6973q423L2584K4339J8489K3196o608M0691
$$ 40485 -17976 -81458 -127643 -60512 -33539 -41962 -9378 14961 33450 56646 50038 90729
24111I0729j4140j5963p9455o8369J0444o879J5598k561K5111l884j4685Q003
$$ 90729 76589 60626 -18829 -87198 -76754 -83633 -68035 -70596 -45485 -49369 -64054 -56051
24099e6051K3990K755k2941j4477J4329P7274Q927p1239j8966O4245J4221j7092
$$ -56051 -32061 -29306 -52247 -66724 -52395 24879 33806 -37433 -56399 7846 22067 4975
24087D975m3568L2256K5952m2383j8946j0985K7485J2820j971j7074L3692P6958
$$ 4975 -38593 -6337 19615 -22768 -41714 -52699 -25214 -12394 -14365 -31439 2253 79211
24075G9211Q44n1964N95q304K6792J921l3129m8169L5747Q7170k5411j02469J4584
$$ 79211 80055 28091 28686 20382 47174 49095 15966 -32203 3544 90714 65303 -37166 -22582
24062b2582K1874R613k9779l2616N9072K3373j362J0384m5595q191K8388K5154
$$ -22582 -708 8905 -20874 -53490 5582 28955 27593 37977 -7618 -15809 12579 37733
24050C7733L6237J7219k5921J6777K8890l0460o8017J4031q429M4714j0164q8559
$$ 37733 73970 91189 65268 82045 110935 80475 12458 26489 18060 62774 52610 -35949
24038c5949j7090m4130m4862J3051P5262j0569K0885K5293O0257O4850l0909l0850
$$ -35949 -53039 -97169 -142031 -128980 -53718 -64287 -43402 -18109 42148 106998 76089 45239
24026D5239j081J6564o0781K3683M407n0286j9754J17531k6749m7340j0455j6547
$$ 45239 44158 60722 -59 23624 28031 -22255 -42009 75522 48773 1433 -9022 -25569
24014b5569K6713q404k221n28J3666N930p4114J6810P60j1114M7952R889M583
$$ -25569 1144 -7260 -9481 -10009 3657 9587 -64527 -47717 -46957 -58071 -10119 -230 4353
24001D353j2000M350j4703R212K8936L5782Q745J6404L62m5951P569O0359j7520
$$ 4353 -7647 -3297 -18000 -8788 20148 55930 64675 81079 81441 35490 43059 103418 85898
23988H5898K6230M0409l5617o3121j3255l8392o6458j8005L8999L1659k763k3743
$$ 85898 112128 152537 116920 53799 40544 2152 -64306 -82311 -43312 -11653 -14416 -38159
23976c8159r51J5220L6985n281O43n9081k5949N16R862J3668J8090k4417k0566
$$ -38159 -39110 -23890 13095 7814 8457 -50624 -76573 -76057 -66195 -52527 -34437 -58854 -79420
23963g9420O3055L5879j0388j2549K6135J5945m1960l6075j2587k468M5827O3335
$$ -79420 -16365 19514 9126 -3423 22712 38657 -3303 -39378 -51965 -54433 -8606 54729
23951E4729J3852m3738n2391l6889M4379k0727n5110L749P7576O3170J4836k571
$$ 54729 68581 24843 -27548 -64437 -20058 -40785 -95895 -92146 -14570 48600 63436 60865
23939F0865K8259l7115k2457m0193M8806K173J8062m399l7189N3414J1322j0935
$$ 60865 89124 52009 29552 -10641 38165 40338 58400 54001 16812 70226 81548 70613
23927G0613m3815L7713K3723m6478L1179j9096m0372n5371K1351k491p9713n3399
$$ 70613 26798 64511 88234 41756 72935 53839 13467 -41904 -20553 -23044 -102757 -156156
23915a56156R2938K3364r92N2395l5421n3766L5940L3798o3427k5983l8993J8974
$$ -156156 -63218 -39854 -40846 11549 -23872 -77638 -41698 -7900 -71327 -97310 -136303 -117329
23903a17329M450K4189J3236K5637K2514K8633k7573L600J7255P57l1265k0045
$$ -117329 -112879 -88690 -75454 -49817 -27303 1330 -26243 -22643 -5388 -4631 -35896 -55941
23891e5941O230k380p960L6733l8319m8114R573N5054K5806j1901J3123k7325
$$ -55941 -49711 -52091 -60051 -23318 -61637 -109751 -100178 -45124 -19318 -31219 -18096 -45421
23879d5421k9442k1886K5233O0486P4056K4854o1954o8987J4046Q908l7514M4460
$$ -45421 -74863 -96749 -71516 -11030 63026 87880 25926 -43061 -29015 -20107 -57621 -13161
23867a3161Q9107L4059l1071K0096K0747j2938k5501o076l6119l8212o5554O486
$$ -13161 75946 110005 78934 99030 119777 106839 81338 75262 39143 931 -64623 -58137
23855e8137j13k0665m1498J4531M3600J2913m762k9623M0060L7482Q7324P0769
$$ -58137 -58250 -78915 -120413 -105882 -62282 -49369 -54131 -83754 -43694 -6212 81112 151881
23843A51881k1207l5545j2687j9219m4222k6150r685j5154l6530n1523O6328R5397
$$ 151881 130674 95129 82442 63223 19001 -7149 -16834 -31988 -68518 -120041 -53713 41684
23831D1684p177l7763l7109K5877j1031J7390l2264K6104L387N2766m3490J7050
$$ 41684 34507 -3256 -40365 -14488 -25519 -8129 -40393 -14289 -10902 41864 -1626 15424
23819A5424R6503l531j00626n4490O9527N7656j9415k7474o2690k6012n2799r756
$$ 15424 111927 108396 7770 -46720 22807 80463 61048 33574 -29116 -55128 -107927 -117683
23807a17683N7602N0731J5543n8085m9010j520j7564O8454O9252O8601o637L014
$$ -117683 -60081 -9350 6193 -51892 -100902 -102422 -119986 -51532 17720 86321 79684 82698
23795H2698l881m8914L3222L558P234m35k6897m6694R438K3830O4398M5221o8590
$$ 82698 78817 29903 63125 66683 73917 73482 46585 -109 9329 33159 97557 142778 74188
23782G4188j13241J2674L4464j1719K8144k433m0034M575p061q02N6978J5845
$$ 74188 -39053 -26379 8085 -3634 24510 22077 -17957 -13382 -20443 -21245 35733 51578
23770E1578o3570j2436M1189j0730L4327L4727o628k0142n8605j8618j2963j0698
$$ 51578 -11992 -24428 16761 6031 40358 75085 68457 48315 -10290 -28908 -41871 -52569
23758e2569l7748j7393M973K0090l0558K1313P1730M2384j8096L022l6512q16
$$ -52569 -90317 -107710 -102737 -82647 -113205 -91892 -20162 22222 4126 7148 -29364 -30180
23746c0180J4348L4291P924l493M2181r718J2687K0125k8470L587K8455l0154
$$ -30180 -15832 18459 26383 22890 65071 55353 68040 88165 59695 63282 91737 61583
23734F1583P775l6980k8096l055r423K6440K9851N5591K6566n6252m1463M976
$$ 61583 69358 32378 4282 1227 -8196 18244 48095 103686 130252 74000 32537 37513
23722C7513K8873K916k2644m9256k0536k4657N169N6941k3276K7345N2976J9637
$$ 37513 66386 69302 46658 -2598 -23134 -47791 -42622 14319 -8957 18388 71364 91001
23710I1001M7165n997l5865j8544k9083J1914j4057l4377o4424K3088K7523N4421
$$ 91001 138166 132169 96304 77760 48677 60591 46534 12157 -52267 -29179 -1656 52765
23698E2765l0240q8031L8230J09809j9574n4008m0501K7331R371j4673p500K1537
$$ 52765 22525 -65506 -27276 82533 62959 8951 -31550 -4219 5152 -9521 -17021 4516
23686D516K4555K5386L4479Q194n5523K0351L186l4349n0384J6473j7891P16L0181
$$ 4516 29071 54457 88936 97130 41607 61958 65144 30795 -19589 -3116 -21007 -20291 9890
23673I890L5705l606N1383k1192k5451j9920j378J169K2497k0172J5815P09J7076
$$ 9890 45595 41989 93372 72180 46729 26809 25431 26600 49097 28925 44740 45449 62525
23660F2525l1116o6864k4214N7928r452m4574j3779o854r10l277M5002L2029r498
$$ 62525 31409 -35455 -59669 -1741 -11193 -55767 -69546 -76400 -77310 -80587 -35585 -3556 -13054
23647a3054M0307j2585J743J6198J9811o7139n280q706N7167p84p932J0223l1839
$$ -13054 27253 14668 16411 32609 52420 -14719 -19999 -28705 28462 27678 19746 29969 -1870
23634a870n0567K657K9200L8634l4366J0883o5655k2798K1235M4415L0415J1416
$$ -1870 -52437 -49780 -20580 18054 -16312 -5429 -71084 -93882 -72647 -28232 2183 13599
23622A3599P146K1113R735L003j1616j2052j0440n069j3989m7449L5661L044j6371
$$ 13599 20745 41858 51593 54596 42980 30928 20488 15419 1430 -46019 -10358 -7314 -23685
23609b3685L1162k0522k0071n654L2029M920l422k5517J3457M8588J1736j3715
$$ -23685 7477 -13045 -33116 -38770 -6741 -1821 -5243 -30760 -17303 31285 43021 29306
23597B9306m4940K3179K4789K6034n2685j9224K8302l0409k0808K829L9090J4841
$$ 29306 -15634 7545 32334 58368 5683 -13541 14761 -15648 -36456 -33627 5463 20304
23585B0304l7529M5164J3034O252K216K94q9783k3318K0809J4123N2993J046J1863
$$ 20304 -17225 27939 40973 47225 49441 49735 -40048 -63366 -42557 -28434 24559 25605 37468
23572C7468l3823m6596K0283r05n9833j7788K059M0068K8758K1792q498m7338
$$ 37468 3645 -42951 -22668 -23573 -83406 -101194 -99135 -59067 -30309 -8517 -17015 -64353
23560f4353K0956K3796l3090m3944q804L3213M5575k0551M3936K0405J0534L5868
$$ -64353 -43397 -19601 -52691 -96635 -105439 -72226 -26651 -47202 -3266 17139 27673 63541
23548F3541j9855k6851o5044k3311J5315m2018N3286p302N4702j6475m7931j2818
$$ 63541 43686 16835 -48209 -71520 -56205 -98223 -44937 -52239 2463 -14012 -61943 -74761
23536g4761l350m7382R919K0232J9968O9322N207k2138l388m326L3573O834J1135
$$ -74761 -78111 -125493 -115574 -95342 -75374 -6052 -845 -22983 -26371 -30697 2876 9710 20845
23523B0845l828q765j5253n7921J9767J3689j103l7081O263L1122m2867J0872
$$ 20845 17017 8252 -7001 -64922 -45155 -31466 -32569 -69650 -63387 -32265 -75132 -64260
23511f4260J4194L1349m9499k6398n100Q710O680L8174K6203l0419n38N0500L723
$$ -64260 -50066 -18717 -68216 -94614 -99714 -91004 -84324 -46150 -19947 -50366 -50904 -404 3319
23498C319J6210j6181j9751m3498l4145J3023Q362J10568L4638n8393N473J6176
$$ 3319 19529 3348 -16403 -59901 -94046 -81023 -72661 37907 72545 14152 19625 35801
23486C5801j7571q6165k356P0527K7172l9618n1893n1697N621j6077R399K2643
$$ 35801 18230 -67935 -70291 236 27408 -12210 -64103 -115800 -110179 -126256 -116857 -94214
23474i4214N2214N5616K4369K7547o0602k1301O85k098l5576n0498N1551O2076
$$ -94214 -42000 13616 37985 65532 4930 -16371 -15686 -17784 -53360 -103858 -52307 9769
23462I769j8864K5165j5923M144K0152l2951m070j9189N6794O7570K370n4995
$$ 9769 -9095 16070 147 4291 24443 -8508 -12578 -31767 25027 92597 94967 39972
23450C9972o1848l7301k0262m7132K7017n7775L8543J608J0868J4808j2674K8703
$$ 39972 -21876 -59177 -79439 -126571 -99554 -157329 -118786 -117178 -106310 -91502 -104176 -75473
23438g5473K3563N1815L5483M980k384l1843l0218L736L2604o4077n8071l3924
$$ -75473 -51910 -95 35388 40368 37984 6141 -24077 -20341 12263 -51814 -109885 -143809
23426a43809k2323O4506L2215L0654j7304P023J7833l0114r860K1302K9644K0712
$$ -143809 -166132 -101626 -69411 -38757 -56061 -49038 -31205 -61319 -71179 -49877 -20233 479
23414D79K214m6337Q262K043N8839O0235k9876l0358k231j4412K638J6987j00715
$$ 479 2693 -43644 -35382 -33339 25500 85735 55859 25501 23270 8858 11496 28483 -72232
23401g2232j4327M1489J2061R609k5924R748K6795l2042J322M6992n5933l4806
$$ -72232 -86559 -45070 -33009 -23400 -49324 -39576 -12781 -44823 -43501 3491 -52442 -87248
23389h7248j0452m9552K6956R0184K5631O4303j5750m4564o1813m9179O8982P1452
$$ -87248 -97700 -147252 -120296 -30112 -4481 59822 44072 -492 -62305 -111484 -42502 28950
23377B8950K3371n7329n8512N4319K5932n848N230K0358K0122k5791n401j0602
$$ 28950 52321 -5008 -63520 -9201 16731 10883 16113 36471 56593 30802 25401 14799
23365A4799l5981K2300N6786R522l0961K6205j5591l2369L4251m3072p491L6965
$$ 14799 -21182 1118 57904 67426 36465 62670 47079 14710 48961 5889 -1602 35363
23353C5363L4148m2659j7614k3505l0565L2444Q975q9735m0789P4547N4842j4523
$$ 35363 69511 26852 9238 -14267 -44832 -12388 -3413 -93148 -133937 -59390 -4548 -19071
23341a9071m9378l487O6024M7930m2516j7238p286l5083M5611P6978o4830l8842
$$ -19071 -68449 -71936 -5912 42018 -498 -17736 -25022 -60105 -14494 62484 -2346 -41188
23329d1188J1772j5622p869k090l3524J3273Q7723k4362j2996K441m3417p5O1496
$$ -41188 -29416 -45038 -52907 -54997 -88521 -75248 12475 -11887 -24883 -22442 -65859 -65934 -4438
23316d438l7844l132k971j6233k252O0009m6358j3182L9649J1262M4020K7635
$$ -4438 -42282 -45414 -48385 -64618 -66870 -6861 -53219 -66401 -26752 -15490 28530 56165
23304E6165L903L875L2317k9690r7700n0725R746O6222N1692j6281n5346n3781
$$ 56165 60068 63943 96260 66570 -31130 -81855 -72109 -5887 45805 29524 -25822 -79603
23292g9603q933K2582L4111m8246n2886k1673N2539J0182L1941M1102K8818M683
$$ -79603 -88536 -65954 -31843 -80089 -132975 -154648 -102109 -91927 -59986 -18884 9934 14617
23280A4617k4008p403Q732K4243L0867J6042Q012n0979O23K802L1284O2734o2671
$$ 14617 -9391 -16794 -8062 16181 47048 63090 71102 20123 20746 23548 54832 117566 54895
23267E4895p7910j8587M2615M0410K5075p8607n9729O3410K1896j4530K8213K9770
$$ 54895 -23015 -41602 1013 41423 66498 -12109 -71838 -8428 13468 -1062 27151 56921
23255E6921r009K9804L1544k3203j5089k2206j5761K4342l1603q4611k4114l2583
$$ 56921 47912 77716 109260 86057 70968 48762 33001 57343 25740 -58871 -82985 -115568
23243a15568K1419L9458K2755R250L8770K0801l8014L4414N05k8489j0246M1587
$$ -115568 -94149 -54691 -31936 -22686 16084 36885 -1129 33285 33790 5301 -4945 36642
23231C6642j5691Q903N0148m6001l5711O3921L538j3657j4031N401J2446k2148
$$ 36642 20951 29854 80002 34001 -1710 62211 65749 52092 38061 43462 55908 33760
23219C3760J925L4569l5600n8183q8878j2486K897P4157O4792j0148L090K99N116
$$ 33760 35685 70254 34654 -23529 -112407 -124893 -121996 -47839 16953 6805 9895 10194 15310
23206A5310k5194L9241L2890N1884K8055l3971p4875p654n550l6920K3763m008
$$ 15310 -9884 29357 62247 114131 142186 108215 33340 25686 20136 -16784 6979 2971
23194B971p5069L3063N3764K8047J8804k6167J8223l1443m1316P9683L3018l3342
$$ 2971 -72098 -39035 14729 42776 61580 35413 53636 22193 -19123 60560 93578 60236
23182F0236l1078n5576k3783m653K5928N3433J4303R877L2553M5231l1958r1429
$$ 60236 29158 -26418 -50201 -54854 -28926 24507 38810 48687 81240 126471 94513 3084
23170C084p6063m4954k645J4605k579k103P7761O8672J4167l3436r955k452j7170
$$ 3084 -72979 -117933 -120578 -105973 -108552 -110655 -32894 35778 49945 16509 6554 4102 -13068
23157a3068n6537J2705k0103J8810L2356P005P0790O1337J0716n3910p6746J2468
$$ -13068 -69605 -56900 -77003 -58193 -25837 -18832 51958 113295 124011 70101 -6645 5823
23145E823p573K3093p994k853r018N799J1916l1134k0365l5777n01L4673L6070
$$ 5823 -1750 21343 13349 10496 1478 7277 19193 -11941 -32306 -68083 -68584 -33911 2159
23132B159J6033o6964k08P7415j511j7329k0521J3146j8289P58k7970L315o4436
$$ 2159 18192 -48772 -48980 28435 26924 9595 -10926 2220 -16069 -15311 -43281 -39966 -104402
23119a04402j2542N8655j7217l6199j011N6857N1830M6531Q037n5086J3359q058
$$ -104402 -116944 -58289 -75506 -111705 -112716 -55859 -4029 42502 50539 -4547 8812 754
23107G54r0354k495L8494N0426K4825J8867k4217N081l2533N3259K7888M2677
$$ 754 -89600 -92095 -53601 -3175 21650 40517 16300 21381 -11152 42107 69995 112672
23095A12672n9247p2181J0392K5451l999j4216j3833l1691J2553N5262k6958m5921
$$ 112672 53425 -18756 -8364 17087 13088 -1128 -14961 -46652 -34099 21163 -5795 -51716
23083e1716j2483K2293J9104m4844k2663K8310j8583p342K6619O0308q778n5190
$$ -51716 -64199 -41906 -22802 -67646 -90309 -61999 -80582 -87924 -61305 -997 -9775 -64965
23071f4965M858k0384K7707L1687K730K1559n599q174m3147L0782L948m2373J4824
$$ -64965 -60107 -80491 -52784 -21097 -18367 3192 -2407 -10581 -53728 -22946 -18998 -61371 -46547
23058d6547l343K0948j6346L818P0918j8344l5421m4602l6810J4937P7697J6438
$$ -46547 -49890 -28942 -45288 -41470 29448 11104 -24317 -68919 -105729 -90792 -13095 3343
23046C343M0492N9372k1782K1700o9589n1835j1917k9116k347M894M4001O7983
$$ 3343 43835 103207 81425 103125 33536 -18299 -30216 -59332 -61679 -56785 -12784 55199
23034E5199J891l5278J8755j3064l726J771p9256k9539o2652O50Q5436J5605r93
$$ 55199 57090 21812 40567 27503 23777 25548 -53708 -83247 -145899 -145249 -59813 -44208 -45201
23021d5201l0141J1703K8088K2374K6908l0924K2506K1981K6587r064o0622l5544
$$ -45201 -75342 -63639 -35551 -13177 13731 -17193 5313 27294 53881 44817 -15805 -51349
23009e1349K5190K6974J6696k2925j410j5670l9297j1712L259N7041L0829l0201
$$ -51349 -26159 815 17511 -5414 -6824 -22494 -61791 -73503 -70244 -13203 17626 -12575
22997a2575j9686M5277j5041R10J419j3187m7836R403N241K9064L076j4000j9477
$$ -12575 -32261 13016 -2025 -1115 304 -12883 -60719 -51316 -46075 -17011 -13935 -27935 -47412
22984d7412N413K3356L0650m7399k5746M6530l6383k299N6705L3727M1667m4615
$$ -47412 -41999 -18643 12007 -35392 -61138 -14608 -50991 -53290 3415 37142 78809 34194
22972C4194p2769r734R683k1455m9780l696R5026O0618J4096R682l2208l3734
$$ 34194 -38575 -48309 -38626 -60081 -109861 -113557 -18531 42087 56183 65865 33657 -77
22960g7L8708Q293n8400j4987J3445J9802j493M940k025j6665j0678K0180m1846
$$ -77 38631 46924 -11476 -26463 -13018 6784 5291 10231 8206 -8459 -19137 1043 -40803
22947d0803O881O851K5299k2570j5773k796J4629Q413j6127K0518K2256k3193
$$ -40803 -33922 -27071 -1772 -24342 -40115 -42911 -28282 -19869 -35996 -15478 6778 -16415
22935a6415L6296N3316j6209m1307l1228P760J0891M1287J4438o0853K0903M639
$$ -16415 19881 73197 56988 15681 -15547 -7787 3104 44391 58829 -2024 18879 23518
22923B3518l8138L8267p548j6904J6830M0822j2610k9112j1918L5831K6150p7282
$$ 23518 -14620 23647 16099 -805 16025 56847 44237 15125 3207 39038 65188 -12094
22911a2094O939j0326k4472k9433J0344P742M6409L477p7883O81R4618k4745p5229
$$ -12094 -5155 -15481 -39953 -69386 -59042 -51300 -4891 -1414 -79297 -78616 16002 -8743 -83972
22898h3972M0183r442J7243K5470N1165l9417p171L4933J3915o7804o2669q200
$$ -83972 -43789 -53231 -35988 -10518 40647 1230 -5941 28992 42907 -24897 -87566 -95766
22886i5766R3586N2523k415N1005M192o1591o3737j804L8084J089j4489K3642
$$ -95766 -2180 50343 47928 98933 103125 41534 -22203 -24007 14077 15166 677 24319
22874B4319k1281m458j9654m9377j6633L5687N325j7332k3914Q0233L4876k0571
$$ 24319 3038 -1420 -21074 -70451 -87084 -51397 -46072 -63404 -87318 -7085 27791 7220
22862G220l7109l0157l3206M5947J3547k9405o350J9333O4544J8940m5211r046
$$ 7220 -29889 -60046 -93252 -47305 -33758 -63163 -69513 -50180 14364 33304 -11907 -20953
22850b0953k6602q430K4509M0136J7218r143J9728o070k2545n7486l4959l7678
$$ -20953 -47555 -55985 -31476 8660 25878 16735 36463 30393 7848 -49638 -84597 -122275
22838a22275p278N8630J9003j9392o091l0232K0579N3900m640P757M9183p780
$$ -122275 -129553 -70923 -51920 -71312 -77403 -107635 -87056 -33156 -37796 -30039 19144 11364
22826A1364m9742k8249n3840k9522J6248Q3634Q1600M9493m386k5199m358j5475
$$ 11364 -38378 -66627 -120467 -149989 -133741 -50107 31493 80986 76600 51401 47043 31568
22814C1568J7820l9628o017L2707J2958k1823k5498n7363J7842k6534r501K517
$$ 31568 49388 9760 3743 36450 49408 27585 2087 -55276 -37434 -63968 -73469 -70952
22802g0952p721K118L2842J7525j8368m0002j1968l0972M6764M3293o616K668
$$ -70952 -78673 -76555 -43713 -26188 -44556 -84558 -96526 -127498 -80734 -37441 -44057 -41389
22790d1389m042o157j7330q848M2433m146k2319K3534M4271K2218r363l4508l0945
$$ -41389 -45431 -51588 -68918 -77766 -35333 -39479 -61798 -38264 6007 28225 18862 -15646 -46591
22777d6591K3825j0365M0602N5902K773p83j5055m9737M495l7230J2532n906n0564
$$ -46591 -22766 -33131 7471 63373 66146 65363 50308 571 5066 -32164 -19632 -25538 -76102
22764g6102N3372M1704J0679L9780J9640q073M3341j05465n4599M10l8070R475
$$ -76102 -22730 18974 29653 69433 89073 81000 124341 18876 -35723 -35313 -73383 -63908
22752f3908K2568l205M2469J8981k7370o2083l4065k3249n27J0202M5101J5545
$$ -63908 -41340 -44545 -2076 16905 -10465 -72548 -106613 -129862 -130389 -120187 -75086 -59541
22740e9541k872k9758j5822k5289M3150O9605K4455k8119J0405L2086m7703N5857
$$ -59541 -62413 -92171 -107993 -133282 -90132 -20527 3928 -24191 -13786 18300 -29403 26454
22728B6454N0948j3685k208k5940l8810K99q173m432K3401L3464k5084k0690j9764
$$ 26454 77402 63717 61509 35569 -3241 -2942 -11115 -15547 7854 41318 16234 -4456 -24220
22715b4220l8055L2266P7035n040j2305j885J3184L4719p916p5445m7145N6727
$$ -24220 -62275 -30009 47026 41986 29681 27796 40980 75699 67783 -7662 -54807 1920
22703A920L0165J9513J6763k9820k7446k86l0895l4487L8261k3905j6659J7273
$$ 1920 32085 51598 68361 38541 11095 10809 -20086 -54573 -16312 -40217 -56876 -39603
22691c9603M4592K7812j6554J0402L7248O558m7393l3777o1101n88K2064l4467
$$ -39603 4989 32801 16247 26649 63897 70455 23062 -10715 -71816 -72404 -50340 -84807
22679h4807k4026k5278K7001M3395N5348L4063r282k6142J8314m906k327N7461
$$ -84807 -108833 -134111 -107110 -63715 -8367 25696 16414 -9728 8586 3680 1353 58814
22667E8814o589J0373k9814K300m3104j3433J220R941J4886L3040o7330n4235
$$ 58814 52225 62598 32784 35084 -8020 -21453 -20233 -10292 4594 37634 -29696 -83931
22655h3931K2866M4592o5938N243J0401J876K7656J4218k5881k7876j38J1569
$$ -83931 -61065 -16473 -82411 -77168 -66767 -64891 -37235 -23017 -48898 -76774 -76912 -65343
22643f5343l3621J5387j5347o4979Q33P3873N6506j5957N5573P1575p8025o6590
$$ -65343 -98964 -83577 -98924 -163903 -163070 -89197 -32691 -48648 6925 78500 475 -66115
22631f6115m483J5237L1886j5854J8561O43o1028O1144P3901l785o1732o133M0240
$$ -66115 -70598 -55361 -23475 -39329 -20768 -20125 -81153 -20009 53892 50107 -11625 -17758 22482
22618B2482k2446J1917R307Q571j3558n1049m8800L5486O7911j8398M408j4121
$$ 22482 36 11953 21260 29831 16273 -34776 -83576 -48090 19821 1423 5831 -8290
22606h290n2856j4200O2724N0141m4891m1507Q391K6857l532L6475j9573k4643
$$ -8290 -61146 -75346 -12622 37519 -7372 -48879 -40488 -13631 -17163 19312 -261 -24904
22594b4904p3362j0877J8672K926j0637L680L515J5542J30193k4641o6164m0764
$$ -24904 -98266 -109143 -90471 -87545 -98182 -94502 -90987 -75445 54748 30107 -36057 -76821
22582g6821k3704M2482N8862J2225j5664m9773j0694M0349M2455n48Q917J7366
$$ -76821 -100525 -58043 819 13044 -2620 -52393 -63087 -22738 19717 19169 28086 45452
22570D5452n6678j681l7994j8169P1448N8814l6361m9955m439n9433J6151L9103
$$ 45452 -11226 -12907 -50901 -69070 2378 61192 24831 -25124 -29563 -88996 -72845 -33742
22558c3742K2668K2222p839J9915J0114P433L6293K9291m6764j6947l2619j1712
$$ -33742 -11074 11148 3309 23224 33338 40771 77064 106355 59591 42644 10025 -1687
22546a687m050M0154j6944m7235M1895J5139L2368P604o6059r216k3633K796K7434
$$ -1687 -5737 34417 17473 -29762 12133 27272 59640 67244 1185 -8031 -31664 -28868 -1434
22533a434Q617l646k8978M916j4031J0355J825K3706M5311k3039l2004k1254N8309
$$ -1434 7183 3537 -25441 -20525 -34556 -24201 -22376 1330 46641 23602 -8402 -29656 28653
22520B8653J2251k2422l0865J5501O2087n8989l186j0657K7413O7709r612N3001
$$ 28653 40904 18482 -12383 3118 65205 6216 3030 -7627 19786 87495 77883 130884
22508A30884q1922k4696M8700m8629L182o817J9945k4289l2433J3457M4965j6607
$$ 130884 48962 24266 72966 24337 27519 20702 40647 16358 -16075 -2618 42347 25740
22496B5740j0424Q9152J7602J4114j0384k8578n1600J2083j6755n2919L6581K6085
$$ 25740 15316 104468 122070 136184 125800 97222 45622 57705 40950 -11969 24612 50697
22484E0697K7229K6115n1497k5724o463K293M077O359J095o235j0683J0376r754
$$ 50697 77926 104041 52544 26820 20357 22650 26727 33086 34181 27946 17263 27639 17885
22471A7885N2537L0963l3976p0102o5856p6094k034L5056j7648L1099N5523J7605
$$ 17885 70422 101385 67409 -2693 -68549 -144643 -146677 -111621 -129269 -98170 -42647 -25042
22459b5042l9350r56L4123J4928m332K2107O4760q513p0489R4N41N6782N6512
$$ -25042 -64392 -65348 -31225 -16297 -20629 1478 66238 57725 -12764 -12670 -12129 44653 101165
22446A01165p6177p884J9654J043m8996k3487K6273R831l426o684j8969l8536
$$ 101165 24988 17104 36758 37801 -11195 -34682 -8409 1422 -2004 -8688 -27657 -66193
22434f6193o255O0130J1312n519K0895r213J4991j9218l4891n204o4589J0869
$$ -66193 -72448 -12318 -1006 -6525 14370 5157 20148 930 -33961 -39165 -103754 -92885
22422i2885M6636K3368l9386k9777L4013K6490M9386M2037q6441m3424j3250M3111
$$ -92885 -46249 -22881 -62267 -92044 -58031 -31541 17845 59882 -26559 -69983 -83233 -40122
22410d0122N7949L9539r038m187n6437p6793l8002O0833K7594N6091j9606p3070
$$ -40122 17827 57366 48328 44141 -12296 -89089 -127091 -66258 -38664 17427 -2179 -75249
22398g5249N4167Q1143j1367p6962l8041O0738K5866J9291l8957n9583j0246k2623
$$ -75249 -21082 60061 48694 -28268 -66309 -5571 20295 39586 629 -58954 -69200 -91823
22386i1823Q9424R0319K9169j3609l7695j3455k8136j5353n1287j7307M1223J5241
$$ -91823 -2399 87920 117089 103480 65785 52330 24194 8841 -42446 -59753 -18530 -3289
22374c289J5128J1292k2205R122O059m5289m7095J4419L2552j6522K0921O3116
$$ -3289 11839 23131 926 10048 16107 -29182 -76277 -61858 -29306 -45828 -24907 38209
22362C8209M2578k1755n9338k1111K2272J6571R819J80r0725m0290M7858J9842
$$ 38209 80787 59032 -306 -21417 855 17426 27245 27425 -63300 -103590 -55732 -35890
22350c5890m0031n3709K5729J7466J8221P597N3434O3266N415k1470j6540L8132
$$ -35890 -75921 -129630 -103901 -86435 -68214 -60617 -7183 56083 61498 40028 23488 61620
22338F1620K4406l2113k6580l0185k3648j1973K4307O1463K3130M0094m4637l1553
$$ 61620 86026 53913 27333 -2852 -26500 -38473 -14166 47297 70427 110521 65884 34331
22326C4331j8448n2825K8218J03139Q416o2100l7782K1765o602k7899j6822M2591
$$ 34331 15883 -36942 -8724 94415 102831 40731 2949 24714 18112 -9787 -26609 15982
22314A5982N991n1252m0530J5423N9538M9572R906K0462m0086n278K2761r156
$$ 15982 21973 -29279 -69809 -54386 5152 54724 64630 85092 45006 39728 62489 53333
22302E3333j8332q2486K377l270q430O2564Q4890J3068j26252o6710K229K8482
$$ 53333 35001 -47485 -45108 -48378 -56808 5756 90646 103714 -22538 -89248 -87019 -58537
22290e8537J2666M4974q74k0036n235Q57p5505K0107K7573J0232O2389M6929L0443
$$ -58537 -45871 -897 -1771 -21807 -27042 -26185 -101690 -81583 -54010 -43778 18611 65540 95983
22277I5983M2050l6034p6532j3227k9267M137q025j4532l7479L3377J5223k7625
$$ 95983 138033 101999 25467 12240 -17027 -12890 -20915 -35447 -72926 -39549 -24326 -51951
22265e1951K7975O5883M234J150j5547k0550r578L2924k0498q0967j3416l4159
$$ -51951 -23976 41907 46141 47291 31744 11194 1616 34540 14042 -66925 -80341 -114500
22253a14500J690L8160L1041n621L1912J3767j0320k1553n970L9274N209J4982
$$ -114500 -112810 -74650 -43609 -49230 -17318 -3551 -13871 -35424 -41394 -2120 3089 18071
22241A8071K2941o8597J841n824n6195L0845O270j8877N6960L1143q692o4424
$$ 18071 41012 -27585 -25744 -31568 -87763 -56918 -50648 -69525 -12565 18578 9886 -54538
22229e4538m8008L8561K0568K0308K2175L5552R541l1186K2430r14N7910p988
$$ -54538 -102546 -63985 -43417 -23109 -934 34618 44159 12973 35403 34489 92399 84411
22217H4411k043o0216J2894j9564j5642n932r362m3574J4697N349n870k1949O5
$$ 84411 82368 22152 35046 15482 -160 -6092 -15454 -59028 -44331 -38982 -44852 -66801 -66736
22204f6736R2933Q2620M779k5111m7948o8731J3421L3940j0688J3920j254o564
$$ -66736 26197 108817 113596 88485 40537 -28194 -14773 19167 8479 22399 21145 14581
22192A4581o7877p928L4692K0882r8779J4341k2161J5350Q5267K1755j4807l7588
$$ 14581 -53296 -61224 -26532 -5650 -104429 -90088 -112249 -96899 -11632 10123 -4684 -42272
22180d2272K521l0912j641L3477n074o622l1498M550M8420J4241l8199k2900L2504
$$ -42272 -39751 -70663 -72304 -38827 -43901 -50523 -82021 -77471 -29051 -14810 -53009 -75909 -43405
22167d3405l111M3268L9254M0151l7328o8014n803L5754J559l0966l3198K2160
$$ -43405 -46516 -3248 36006 76157 38829 -29185 -34988 766 2325 -28641 -61839 -39679
22155c9679P9611J1661n7015m9838L529k4057L5008J0044M4507J6862J8526J5913
$$ -39679 39932 51593 -5422 -55260 -51731 -75788 -40780 -30736 13771 30633 49159 65072
22143F5072j0496p9078M7693J2361k6974K4242L8529M671j323k0718q535m8736
$$ 65072 54576 -24502 23191 35552 8578 32820 71349 76020 74697 53979 45444 -3292
22131c292p7340o797P8245M2467j1000o4758l8260k4857J4316J7807k0299J3051
$$ -3292 -80632 -87429 -9184 33283 22283 -42475 -80735 -105592 -91276 -73469 -93768 -80717
22119h0717L3932m3595j2231l6000p9607o278M3426P1147K7452N1617L2614k9510
$$ -80717 -46785 -90380 -102611 -138611 -218218 -224496 -181070 -109923 -82471 -30854 1760 -27750
22107b7750p700N1708P829j0193o124k528M6215k6625m0593l9593j8570M8103
$$ -27750 -35450 16258 24087 13894 7770 5242 51457 24832 -15761 -55354 -73924 -25821
22095b5821O6673K8805k8922m9803o297n434j153O4743q394l8102l1343K6848
$$ -25821 40852 69657 40735 -9068 -15365 -20799 -21952 42791 34397 -3705 -35048 -8200
22083h200k6319o7604m5576J1969J09378O7863L5824j2046P0580j7602k1819k1441
$$ -8200 -34519 -102123 -147699 -135730 -26352 41511 77335 65289 135869 118267 96448 75007
22071G5007L9465l9005n2851J6939j034J9874j453l1439j4753J6613j2468Q6801
$$ 75007 114472 75467 22616 39555 38521 58395 56942 25503 10750 27363 14895 101696
22059A01696L2399K7959L5568K6887J31680J10748R1610J26951L16288K65192
$$ 101696 134095 162054 197622 224509 356189 466937 558547 685498 1001786 1266978
22049A266978J20080o0270j19308j85407k20391k29488j76544q9959m1816r2585
$$ 1266978 1387058 1326788 1207480 1022073 801682 572194 395650 305691 263875 171290
22039A71290o9951n633n1089K50l6740m9831r847Q0365K1506K0839K0473o3872
$$ 171290 101339 95706 44617 44867 8127 -41704 -51551 28814 50320 71159 91632 27760
22027B7760m4636k4824l2424j9474R343M521M6429K3347r794L3424k504O902J0865
$$ 27760 -16876 -41700 -74124 -93598 -84255 -79734 -33305 -9958 -19752 13672 11168 18070 28935
22014B8935K2056L350p2145m7404L0106K4663K341K6835n113J9154O0439L0492
$$ 28935 50991 54341 -17804 -65208 -35102 -10439 -8098 18737 13624 32778 93217 123709
22002A23709l9318o1065j6059L5340Q252n0656m123o3334j8852Q0292K4492p2657
$$ 123709 84391 23326 7267 42607 50859 203 -3920 -67254 -86106 -5814 18678 -53979
21990e3979n6366K5448M7597L1011M0408L9583l1122l906k2458M1206N120q463
$$ -53979 -110345 -84897 -37300 -6289 34119 73702 42580 38674 16216 57422 62542 54079
21978E4079p2560j9461N0084R4215O4653k6220m7451o5223J0863R260n0629L3885
$$ 54079 -18481 -37942 12142 106357 171010 144790 97339 32116 42979 52239 1610 35495
21966C5495M1807M354k1327l8654n5610k021L6567p2967k1233K2384O3092J1949
$$ 35495 77302 81656 60329 21675 -33935 -35956 611 -72356 -93589 -71205 -8113 3836
21954C836K8679p3742k184K1858o197N0573L8586J2092m8578n5776J7712N688
$$ 3836 32515 -41227 -43411 -21553 -27750 22823 61409 73501 24923 -30853 -13141 -7453
21942g453o138m1193l5887j713L0898k765J1708N1035J6895K5194P7563K8985
$$ -7453 -13591 -54784 -90671 -92384 -61486 -64251 -52543 -1508 15387 40581 118144 147129
21930A47129m2135n4664k5659K6222K6240n6616n3388K2275j8959l8841m0899
$$ 147129 104994 50330 24671 50893 77133 20517 -32871 -10596 -29555 -68396 -109295
21919a09295M1880L4401K4800J773M3845P3554l7962o126O036m2349P756P5673
$$ -109295 -67415 -33014 -8214 -6441 37404 110958 72996 66870 72906 30557 38313 113986
21907A13986j1274o4732L3923J1862l2382l3764K5203K4492k8700n1917q70O0718
$$ 113986 102712 37980 71903 83765 51383 17619 42822 67314 38614 -13303 -14173 46545
21895D6545K8381m958m3149o2230J9761Q6175K4999K5531j5380k9172m7831m0240
$$ 46545 74926 69968 26819 -35411 -15650 70525 95524 121055 105675 76503 28672 -11568
21883a1568n2657o581O4384M6113M5948m0507q5414j3783K5957J4032k170N495
$$ -11568 -64225 -70806 -6422 39691 85639 45132 -40282 -54065 -28108 -14076 -16246 -10751
21871a0751L0262p0065N6275P7518K3635k7853j5895n5956j6490L9540L9728j1412
$$ -10751 19511 -50554 5721 83239 106874 79021 63126 7170 -9320 30220 69948 58536
21859E8536K8565p1294K0370l5887j9008M3476O5947N345j6092M1728m846p1686
$$ 58536 87101 15807 36177 290 -18718 24758 90705 96050 79958 121686 116840 45154
21847D5154j1300j5322j0502N060O4681L5216Q745k9829j5359N632P083p190L3099
$$ 45154 33854 18532 8030 13090 77771 112987 121732 91903 76544 82176 89259 82069 115168
21834A15168l3646k684J8533q2785l8717M2104l1443o2351Q155J376P2459M5065
$$ 115168 81522 78838 97371 14586 -24131 17973 -13470 -75821 -67666 -66290 6169 51234
21822E1234o4524M7414L7740k1944L0706o300l2983k5773o1021m1150k9689K7800
$$ 51234 -13290 34124 71864 49920 80626 74326 41343 15570 -45451 -86601 -116290 -88490
21810h8490Q1064J2822N5652L0135p3678m4749m9896p202J6288M7463K0545j554
$$ -88490 -7426 5396 61048 91183 17505 -27244 -77140 -84342 -68054 -20591 -46 -1600
21798a600j1390M0104k992L1167p8113j1331J4453l3617k241P154k4753M2485
$$ -1600 -12990 27114 24122 55289 -22824 -34155 -19702 -53319 -55560 -48406 -73159 -30674
21786c0674N2351k0548k1723l0989k5125J9813N9033K7374N1547j7744m0060P459
$$ -30674 21677 1129 -20594 -51583 -76708 -56895 2138 29512 81059 63315 23255 30714
21774C0714L5975j2917k1022j6859j7028l4904L9276K1451L4688m2415M0263o167
$$ 30714 66689 53772 32750 15891 -1137 -36041 3235 24686 59374 16959 57222 51055
21762E1055J2793o8304L7875M7796j9334j5349J693l0302J4919j3758m7329k6517
$$ 51055 63848 -4456 33419 81215 61881 46532 48225 17923 32842 19084 -28245 -54762
21750e4762L2715L8289L4624j2204J6957J7091p713n9058l6126K5690N92L9308
$$ -54762 -22047 16242 50866 38662 55619 72710 64997 5939 -30187 -4497 -3905 35403
21738C5403R2660k0539j0209k9930n6423P883N728n1914m8271J2172J2701j359
$$ 35403 128063 107524 97315 67385 10962 18845 24573 -27341 -75612 -63440 -50739 -52098
21726e2098k2526J8915L75j7411K3688N3102R5262J7318n3238p6023j8664k6303
$$ -52098 -74624 -55709 -55334 -72745 -49057 4045 99307 116625 63387 -12636 -31300 -57603
21714e7603l5533o944L1058J1940M5174n1468k084q211j2667K8079K1326L0505
$$ -57603 -93136 -100080 -69022 -57082 -11908 -63376 -65460 -73671 -86338 -58259 -36933 -6428
21702f428J541P8504L1031J2958m747r827l3875k8744K2801o373M9221k0836l6751
$$ -6428 -4887 73617 104648 117606 112859 103032 69157 40413 63214 56841 106062 85226 48475
21689D8475j6169O7028j0591j7452P282k0741n2618J1608J07789J2691k6935N178
$$ 48475 32306 99334 88743 71291 78573 57832 5214 16822 124611 137302 110367 115545
21677A15545l4076n0554M8489O705p3168M803J2374O95K6515K0110L4886n4348
$$ 115545 81469 30915 79404 86109 12941 17744 30118 30813 57328 77438 112324 57976
21665E7976k3668L970l043P3995r219K5304O276m7045M5655j9276p4979l3044
$$ 57976 34308 38278 35235 109230 100011 125315 131591 84546 130201 110925 35946 2902
21653B902J1139j0986j7706n725M6703j4725M7137M1751N5740m3823j9829M655
$$ 2902 14041 3055 -14651 -20376 26327 11602 58739 100490 156230 112407 92578 97233
21641I7233j4048L1110N1572n828K1796K3534K7456k1900J0106l235k7779n8901
$$ 97233 83185 114295 165867 160039 181835 205369 232825 210925 221031 217796 190017 131116
21629A31116p6657n8187L3533J7129j2633K3667l465k4195M5738N0991k7760j06303
$$ 131116 54459 -3728 29805 46934 34301 57968 54503 30308 76046 127037 99277 -7026
21617g026M0334M9261R60n9148k5632n1049N288N7623L0704J9233K7099K862l1176
$$ -7026 33308 82569 83529 24381 -1251 -52300 -47012 10611 41315 60548 87647 90509 59333
21604E9333k9883N09K6625k4168L7208P1302k5386n2349J5118P209J2826k5028
$$ 59333 29450 29959 56584 32416 69624 140926 115540 63191 78309 85518 98344 73316
21592G3316m1985J3565k1795o047m0482k6953O6929K2224J2340L9803l447l6712
$$ 73316 31331 44896 23101 17054 -23428 -50381 16548 38772 51112 90915 87468 50756
21580E0756M0344l0925j7921p1580J952M8956J9545k0338K6562L8476k5758L9889
$$ 50756 91100 60175 42254 -29326 -27374 21582 41127 20789 47351 85827 60069 99958
21568I9958k7443k9119k00j4170j3686k669M0268K7273j9068j7635J9983K116
$$ 99958 72515 43396 43196 29026 15340 12671 52939 80212 61144 43509 63492 65608
21556F5608N6181l3143O307Q516l6844m511m1925n8717l0R328k583N1585l635
$$ 65608 121789 88646 94953 103469 66625 62114 20189 -38528 -38558 -29230 -31813 19772 16137
21543A6137J3627L1192K772l2294K0351L7132o3588l8065j0582M273l5937l4283
$$ 16137 29764 60956 63728 31434 51785 88917 25329 -12736 -23318 -19045 -54982 -89265
21531h9265L0694P0103R054K5021M5102M4422N1804j2358l6525L521K7370l0449
$$ -89265 -58571 11532 20586 45607 90709 135131 186935 174577 138052 141573 168943 138494
21519A38494K5967j1242M2586J7931N3996J0077k6979j0793j1661R0929P397j9613
$$ 138494 164461 153219 195805 213736 267732 277809 250830 240037 228376 319305 326702 307089
21507C07089L8835M252n3234n6840K132j07786j2086K7370J4548M416l3499m011
$$ 307089 345924 350176 296942 240102 242234 134448 122362 149732 164280 168696 135197 131186
21495A31186J2510M2284J5055j4020K2160j8298n5189P486K1021R847q641j6546
$$ 131186 143696 185980 201035 187015 209175 190877 135688 143174 164195 174042 165401 148855
21483A48855K5642J5309K8597N1376o5j7341q815k4655K6814l6700l8788O7545
$$ 148855 174497 189806 218403 269779 269714 252373 243558 218903 245717 209017 170229 237774
21471B37774m3844m9995J5914l0064l0841N058K7067K0334N8211K1000j4916M5631
$$ 237774 193930 143935 159849 129785 98944 104002 131069 151403 209614 230614 215698 261329
21459B61329K6212p957K0357J3876N3687N1795N9192n056o0852k5612O0813p556
$$ 261329 287541 279584 299941 313817 367504 419299 478491 473435 412583 386971 447784 440228
21447D40228k9956q542L1922J2692R077M6760M1700L6285N8807N5454k2276Q4909
$$ 440228 410272 401730 433652 446344 455421 502181 543881 580166 638973 694427 672151 757060
21435G57060J12360P9144R4975J23379J55579K48648L16780K98329K33412P3525
$$ 757060 869420 948564 1043539 1166918 1322497 1571145 1887925 2186254 2419666 2493191
21425B493191k16451l58176k97554j64507n9487M41m1795j4549L9485Q8332J45568
$$ 2493191 2276740 1918564 1621010 1456503 1397016 1397457 1355662 1341113 1380598 1468930 1614498
21414A614498J90011K52113K39354J54529N7957k395j1325N4068J45485J19227
$$ 1614498 1804509 2056622 2295976 2450505 2508462 2506067 2494742 2548810 2694295 2813522
21404B813522J51223K53420M15972L98431M42580N44898N78758P53779R03263
$$ 2813522 2964745 3218165 3634137 4032568 4475148 5020046 5598804 6352583 7255846
21395G255846R61190J174904J412841J772970K375736L156649M275521N714376
$$ 7255846 8217036 9391940 10804781 12577751 14953487 18110136 22385657 28100033
21387B8100033P637436J0604055J5410176K3636139L6115379N0322594N6653939
$$ 28100033 35737469 46341524 61751700 85387839 121503218 171825812 228479751
21380B28479751M4218371J1972999k6311691n1762118n5963420m4812715l0353847
$$ 228479751 272698122 284671121 258359430 206597312 150633892 105821177 75467330
21373G5467330j9498647j2758213q701633o269082m812883l759049k966573k390903
$$ 75467330 55968683 43210470 34508837 28239755 23426872 19667823 16701250 14310347
21365A4310347j905162j568758j279069j022602p54670o12073n41325m47118m25092
$$ 14310347 12405185 10836427 9557358 8534756 7780086 7168013 6626688 6179570 5754478
21356E754478l99735l78736l76194l78741l49308k99966k51926k27797j54549
$$ 5754478 5354743 4976007 4599813 4221072 3871764 3571798 3319872 3092075 2937526
21347B937526p9825p9053p3945j30951j67986j94974k38090k07916r4966k5445
$$ 2937526 2857701 2778648 2704703 2573752 2405766 2210792 1972702 1764786 1669820 1644375
21337A644375K6382J23397J55761K08719K55644R5071j82548k55442k90787k89860
$$ 1644375 1670757 1794154 1949915 2158634 2414278 2509349 2326801 2071359 1780572 1490712
21327A490712k24035j16045m6293j25621j54072j05387o6866p1392m3384j5501
$$ 1490712 1266677 1150632 1104339 978718 824646 719259 652393 581001 537617 522116
21317E22116j7405j9907P4756l0614n095M351P286N6321k0538o3400L6O959P414
$$ 522116 504711 484804 559560 528946 523851 528202 535488 591809 571271 507871 507907 514866 522280
21304E22280n0512m7383K548m7j4913k4712j3704j1057l8719j7753J7784K4212
$$ 522280 471768 424385 426933 426886 411973 387261 373557 362500 323781 306028 323812 348024
21292C48024M9699j0332j0005N615K1495q7144k1559L5326K7894m2638j9306j04147
$$ 348024 397723 387391 377386 383001 404496 317352 295793 331119 359013 316375 297069 192922
21280A92922r2685q1024M8349J01270M4128J1734l585n0867R345m3537l2310K6858
$$ 192922 100237 19213 67562 168832 212960 224694 221109 170242 179587 136050 103740 130598
21268A30598M5889J7422O6431m2577j8971j0584J5868N3789j1124m5288R182j4434
$$ 130598 176487 193909 260340 217763 198792 188208 204076 257865 246741 201453 210635 196201
21256A96201n4814j06214q7834j2033j1953j495J239L8393N5607P3854p077k245
$$ 196201 141387 35173 -52661 -64694 -76647 -78142 -76903 -38510 17097 90951 83874 81629
21244H1629k494O219M925M2267J7743K4856k2408J4123j3037k2921J6072p085
$$ 81629 79135 85354 90279 132546 150289 175145 152737 166860 153823 130902 146974 139889
21232A39889J0904J7039Q0945M7699j2905j5902K4153J746k8502J0030j5668o3118
$$ 139889 150793 167832 248777 296476 283571 267669 291822 293568 265066 275096 259428 196310
21220A96310k4525m7183m0854m1051J0460j6392L8558M3328Q9438O4327k0784
$$ 196310 171785 124602 83748 42697 53157 36765 75323 118651 208089 272416 251632
21209B51632p7662o5408m0539J0420M2327J9365n9962k3539k4179J0685J8865
$$ 251632 173970 108562 68023 78443 120770 140135 80173 56634 32455 43140 62005
21198F2005Q9458M5589J7264m8781p5701o8572L8706R835o7009o7676N340m0689
$$ 62005 151463 197052 214316 165535 89834 21262 59968 69803 2794 -64882 -59542 -100231
21186a00231n9383K784K3256N4458J9302L4635K9392N8094k7496q496k7678L797
$$ -100231 -159614 -156830 -133574 -79116 -59814 -25179 4213 62307 34811 26315 -1363 2434
21174B434K4373N8227L6670J7171N3907N7992L9304J0110n1209o3456p6881o5378
$$ 2434 26807 85034 121704 138875 192782 250774 290078 300188 248979 185523 108642 43264
21162D3264K2152p342K0711k9459j5976J06202L6876n9251o0706M9982L4752J3810
$$ 43264 65416 58074 78785 49326 33350 139552 176428 117177 56471 106453 141205 155015
21150A55015n2668m1138k4005n229J4267l0548p3847m2974K4741P5250P1498k9880
$$ 155015 102347 61209 37204 31975 46242 15694 -58153 -101127 -76386 -1136 70362 40482
21138D0482K072k7467l1804L8088O8792m2641l1782K177K3663j0065k6163l342
$$ 40482 42554 15087 -16717 21371 90163 47522 15740 17917 41580 31515 5352 2010
21126B010j652K1433M794j0490j1125k5207N247j4064J7506J4857O931N7075L8738
$$ 2010 358 21791 26585 16095 4970 -20237 -14990 -29054 -11548 3309 10240 67315 106053
21113A06053n5080q1154j8868J7124M9494o6824o1123M6371J4950p256N1747P5270
$$ 106053 50973 -30181 -49049 -31925 17569 -49255 -110378 -64007 -49057 -56313 -4566 70704
21101G0704l326L1160N0589m4651q2715k6882j3342K9899L9617K2048J5347j313
$$ 70704 67378 98538 149127 104476 21761 -5121 -18463 11436 51053 73101 88448 87135
21089H7135j8296M903L305J9035j1348k8628K889K4231K0594o1924l8498L8742
$$ 87135 68839 73742 77047 96082 84734 56106 58995 83226 103820 41896 3398 42140
21077D2140K017l2345L007j255k9370j5058k5603L8484P1355N1965L5931l2975
$$ 42140 44157 11812 14819 13564 -15806 -30864 -56467 -17983 53372 105337 141268 108293
21065A08293j9435r427k9243m7703k6470J2562J00335L0333O236l8600j6114J5610
$$ 108293 88858 79431 50188 2485 -23985 -11423 88912 119245 125481 86881 70767 86377
21053H6377l9265j2571j9801n6309K4503O1214K2193r2741m5102L0878L3085l9697
$$ 86377 47112 34541 14740 -41569 -17066 44148 66341 -26400 -71502 -40624 -7539 -47236
21041d7236K8964P1299P1933P483o89j6547K6279j7837n0499l2962K0123J2616
$$ -47236 -18272 53027 124960 132443 131754 115207 141486 123649 73150 40188 60311 72927
21029G2927J7859K1600n9966M0670l5934k6456k8850k0029J9603J0332j5642k0267
$$ 72927 90786 112386 52420 93090 57156 30700 1850 -18179 1424 11756 -3886 -24153
21017b4153J3623j5680L8517Q774j3681O3069r980k466j1229N720m2608P086o1314
$$ -24153 -10530 -26210 12307 21081 7400 70469 60489 58023 46794 52514 9906 16992 -44322
21004d4322k7957M5927Q6251j0408J7585N2845n9488N754K4974J9136P265j8928
$$ -44322 -72279 -26352 59899 49491 67076 119921 60433 66187 91161 110297 117562 98634
20992I8634p5116k2401l9829l474K5687M8996M0164M6956j6455J1973O0065R2857
$$ 98634 23518 1117 -38712 -42186 -16499 32497 72661 119617 103162 115135 175200 268057
20980B68057J31130J65546J01302K5120K9793P7875k6807j15433j30714j57742
$$ 268057 399187 564733 666035 691155 720948 798823 772016 656583 525869 368127
20970C68127k7080K5283J18463J24113O7195P5159K9880M5198L920q6528j28182
$$ 368127 341047 366330 484793 608906 676101 751260 781140 826338 830258 743730 615548
20959F15548r0773j21746j83184j38534m5380N0583M9718m8416o099R6729k435
$$ 615548 524775 403029 219845 81311 35931 86514 136232 87816 81717 178446 176011
20948A76011K1000k9508j3698Q37l745k1433p25R927m2642J5272j46l1983l5614
$$ 176011 197011 167503 153805 154642 150897 129464 128739 138666 96024 111296 111150 79167 43553
20935D3553J3243n2793O9l1012k1638Q041K9035M0896M799J0286J1029m2918l3880
$$ 43553 56796 4003 4072 -26940 -48578 -40537 -11502 29394 34193 44479 55508 12590 -21290
20922b1290k1264j598N2350K9331P731k232n903L7466J5126j1961O041l5987n272
$$ -21290 -42554 -44152 8198 37529 45260 43028 37125 74591 89717 77756 83797 47810 42538
20909D2538J1065j0965J0953q4000J7052J3019L7581J1019j7912k93j2798k7518
$$ 42538 53603 42638 53591 -30409 -13357 -338 37243 48262 30350 30057 17259 -10259
20897a0259K9126N6105m929m0138M1081l752m944K7380k8020j6655J946j00400
$$ -10259 18867 74972 70043 29905 70986 67234 62290 89670 61650 44995 46941 -53459
20885e3459J478Q8941M9763M24K8987J6056m4386J7256n5254o0714k6400K505
$$ -53459 -51981 36960 86723 87147 116134 132190 87804 105060 49806 -10908 -37308 -34803
20873c4803N559j577q216J3570M4156M136N5886P083K8873J2188j01797j6962
$$ -34803 -29244 -30821 -39037 -25467 18689 22825 78711 85794 114667 126855 25058 8096
20861H096M2447n0894P664K1614P122O269l2156n6033L771L2995M0397J5855p710
$$ 8096 50543 -351 7313 28927 36049 42318 10162 -45871 -42100 -9105 31292 47147 39437
20848C9437L7695j2604m1744m0532m662L1534K1636J1823j7308k5686L5228j0184
$$ 39437 77132 64528 22784 -17748 -22410 9124 30760 42583 25275 -411 34817 24633
20836B4633N3833L8491o7681J8328K8362p2648n9862J574o3736j1147o844Q475
$$ 24633 78466 116957 49276 67604 95966 23318 -36544 -34970 -98706 -109853 -116697 -108222
20824a08222Q8680M9694Q0435M133m4479j3093m6153j6109m0496N8598J7809l401
$$ -108222 -19542 30152 110587 114720 70241 57148 10995 -5114 -45610 12988 30797 27396
20812B7396j4590l9042L092M9466O3035l4551k9427J4995O164j3800J3633j4978
$$ 27396 12806 -26236 -23144 26322 89357 54806 25379 40374 46538 32738 46371 31393
20800C1393k8731m2632n4497L1587K9896p357M5898N086N5866L6478J4233m0458
$$ 31393 2662 -39970 -94467 -62880 -32984 -40341 5557 10643 66509 102987 117220 76762
20788G6762J500j4062J9079J9777L7266M692m0618j7271k022N802J5660k4418
$$ 76762 78262 64200 83279 103056 140322 145014 104396 87125 85103 90905 106565 82147
20776H2147l6612m4121p261K8067Q2408J772l4917J5278P087l1877Q073o3860
$$ 82147 45535 1414 -5847 22220 104628 106400 71483 86761 93848 61971 70044 6184
20764F184p8794Q44L8895J6250M6728k666J6561L2966l605M793l7045L260K6635
$$ 6184 -72610 -71766 -32871 -16621 30107 27441 44002 76968 73363 78156 41111 44371 71006
20751G1006k9607l6013l684N1010k6310l7804K0846M902N1356j3300m4756O4605
$$ 71006 41399 5386 1702 52712 26402 -11402 9444 14346 65702 52402 7646 72251
20739G2251R6587L131j061L4423n023k0466o3474o1609m7880O6659J60635P2463
$$ 72251 168838 171969 170908 205331 200308 179842 116368 54759 6879 73538 234173 306636
20727C06636R4072K68504K89295K15982J43905J3378K8016l8150j34201k15442
$$ 306636 400708 669212 958507 1174489 1318394 1331772 1359788 1321638 1187437 971995
20717I71995k97923k09412p4916n7477L33j5817n0293L634M5476J04697J62158
$$ 971995 674072 464660 389744 332267 332600 316783 266490 270124 315600 420297 582455
20706E82455J55638R8245J58710K59708K51425N5310r6472j92382k24861k15997
$$ 582455 738093 836338 995048 1254756 1506181 1561491 1465019 1272637 1047776 831779
20696H31779j84645j62730p3312l1616q2974k4251P272j2070j3560L0100n3174
$$ 831779 647134 484404 411092 379476 296502 272251 279523 267453 253893 283993 230819
20685B30819j2610J2266m2558r862M0850n87k7521J62j5058K8410L7331M3434
$$ 230819 218209 230475 187917 178055 218905 218318 190797 190959 175901 204311 241642 285076
20673B85076k421M8486J78259K37629K74780K19004M0396M1128J00484J73488
$$ 285076 282655 331141 509400 747029 1021809 1240813 1281209 1322337 1422821 1596309
20663A596309k51k69251l21718k23702n7744M1994K71008L25132R5637O0535m085
$$ 1596309 1596058 1326807 1005089 781387 723643 765637 1036645 1361777 1457414 1517949 1513864
20652A513864l0287p9102j08235k43059j60491n8519J49519K82123K86493L1466
$$ 1513864 1483577 1404475 1296240 1053181 892690 834171 983690 1265813 1552306 1583772
20642A583772j21651j58709p4403l1685j97480k46934j88249j95025j31848n7189
$$ 1583772 1462121 1303412 1229009 1197324 999844 752910 564661 369636 237788 180599
20632A80599l893k1770r534J5240j0013N040n2307k7668R530O1425N0085q2505
$$ 180599 176706 154936 145402 160642 150629 155669 103362 75694 85224 146649 196734 114229
20620A14229q4615j2629N1655m342J5714J8182k3215J6719j0028j4681J1123K2608
$$ 114229 29614 16985 68640 64298 80012 98194 74979 91698 81670 66989 78112 100720
20608A00720l1451l4040N7700P9j4016L2921N8204Q6415l6678n1453K1363L346
$$ 100720 69269 35229 92929 93008 78992 111913 170117 256532 219854 168401 189764 193110
20596A93110K3145O7786n2619l7174k4530k6260j1521k272m775L4384q9204o5635
$$ 193110 216255 284041 231422 194248 169718 143458 131937 129665 124890 159274 70070 4435
20584D435P7363P0968J3684m691l7595k4412j9706R931J4452l5719k8415M2577
$$ 4435 81798 152766 166450 161759 124164 99752 80046 89977 104429 68710 40295 82872
20572H2872M0077l4345j595J4990K0418K2141M1815K9169Q60K506j7419j7553
$$ 82872 122949 88604 87009 101999 122417 144558 186373 215542 216402 218908 201489 183936
20560A83936M2780M0671J4546m0083o746o920J1620l0705j6186L0578N5330L2280
$$ 183936 226716 267387 281933 241850 235104 228184 239804 209099 192913 223491 278821 311101
20548C11101J7298J309l6626k0895m3531m3928n6047l0546P013K2541J5818l8979
$$ 311101 328399 329708 293082 272187 228656 184728 128681 98135 105148 127689 143507 104528
20536A04528j1409m6514N479L4553J8150L5544L556l4255l2633K4255Q1891L0713
$$ 104528 93119 46605 52084 86637 104787 140331 143887 109632 76999 101254 183145 213858
20524B13858q505k7041o2013k8070M5150k3706R643j5004m592k5393M1316o7367
$$ 213858 205353 178312 116299 88229 133379 109673 119316 104312 99720 74327 115643 48276
20512D8276l5368P7703M8222J9804M7009M7550o7819p1704K54K0300L2980O367
$$ 48276 12908 90611 138833 158637 205646 253196 185377 113673 113927 134227 167207 173574
20500A73574j2878N6775Q802M9046Q3285m026k8296K2752K0198J4427K4923j3370
$$ 173574 160696 217471 226273 275319 358604 354578 326282 349034 369232 383659 408582 395212
20488C95212J0154O179j1592M595P4607N5169mJ69L9920N9180p786j9212M9636
$$ 395212 405366 411545 399953 404548 479155 534324 534320 534489 574409 633589 625803 606591 656227
20475F56227J337L2085J4714K6752R1679N7797J03025R3810O4769n6805k0397
$$ 656227 657564 689649 704363 731115 822794 880591 983616 1077426 1142195 1085390 1064993
20464A064993L0842M7452N8624J26425J18520J11059R1221J52378K66006L72748
$$ 1064993 1095835 1143287 1201911 1328336 1446856 1557915 1649136 1801514 2067520 2440268
20454B440268M68523L96655K95788L34854L05504L36638K93030L54413N37581
$$ 2440268 2908791 3305446 3601234 3936088 4241592 4578230 4871260 5225673 5763254
20445E763254P78354J286182J788537K349291L171677M500659O541455J0492340
$$ 5763254 6541608 7827790 9616327 11965618 15137295 19637954 26179409 36671749
20437C6671749J7360880K3779237K4069634J7893574R211918K905267l321800
$$ 36671749 54032629 77811866 101881500 119775074 128986992 131892259 128570459
20430A28570459j1657661k0167564k1400673j4826565l955065O555937J6866850
$$ 128570459 116912798 96745234 75344561 60517996 56562931 63118868 79985718
20423G9985718K2262223K0002706J1390063L304731l201762j0312467j9795534
$$ 79985718 102247941 122250647 133640710 136945441 133743679 123431212 103635678
20416A03635678k5668768k4292057j6634376r716984n995731m071302l004407
$$ 103635678 77966910 53674853 37040477 27323493 21327762 17256460 14252053
20409A4252053k293523j741751j303156j003403o75289m42756l65283m06334l79199
$$ 14252053 11958530 10216779 8913623 7910220 7234931 6792175 6426892 6020558 5641359
20400E641359k75346l22359l69337l49546k96077l64900l56915l69357l91800
$$ 5641359 5366013 5043654 4674317 4324771 4028694 3663794 3306879 2937522 2545722
20391B545722l38429l12881j89579j84557j43804r7474q2724m9406j8081q8047
$$ 2545722 2207293 1894412 1704833 1520276 1376472 1278998 1196274 1146868 1128787 1040740
20381A040740n2140q7367r3939K2085l4525p6854n3565q1247R965k340Q447m271
$$ 1040740 988600 901233 807294 829379 794854 718000 664435 583188 593153 590813 599260 594989
20369E94989j7597n9205j6221n6254j12903Q934K2143j9841p454j191L0365K2840
$$ 594989 577392 518187 501966 445712 332809 341743 363886 344045 336591 335400 365765 388605
20357C88605L4644k0123m2080L4798k4045k7260k0846J7943L4213L1664O7875
$$ 388605 423249 403126 361046 395844 371799 344539 323693 341636 375849 407513 475388
20346D75388N3574J02787J94532P9871R4196L6744K0798N0910p908j48161k11867
$$ 475388 528962 631749 826281 906152 1000348 1037092 1057890 1108800 1100892 952731 740864
20335G40864j42200j12679q2038p3340o4768m0009r670m0606K0107J21129N4195
$$ 740864 598664 485985 403947 330607 265839 225830 216160 175554 195661 316790 370985
20324C70985n6412L7430j5103j9851k4473L366o6904M1305K7j7069J8484j2970
$$ 370985 314573 352003 336900 317049 292576 295942 229038 270343 270370 253301 271785 258815
20312B58815n6750l1006J3636M3243k9636p5781l8408m7140k0688r821l2795Q0155
$$ 258815 202065 171059 184695 227938 198302 122521 84113 36973 16285 6464 -26331 53824
20300E3824Q2189m6395m3626j22O783r7711o3578L5179J4718q58P3460P0784M327
$$ 53824 136013 89618 45992 45870 52653 -45058 -108636 -73457 -58739 -59597 13863 84647 88974
20287H8974K7332m026j7582K5303P6270M9845p8737p1244k9654J2895K8289j7194
$$ 88974 116306 112280 94698 120001 196271 246116 167379 96135 66481 79376 107665 90471
20275I0471J4956L2969j8511l4323j8386l7288Q7140N7927M4879k0848p672m6232
$$ 90471 105427 138396 119885 85562 67176 29888 117028 174955 219834 198986 191314 145082
20263A45082l9931m694k761n1342L3404K191O256J1798j7851R936K0591k9807
$$ 145082 105151 100457 97696 46354 79758 81949 88205 100003 82152 92088 112679 82872
20251H2872K2809K905k6631n8542L100O6010L3794J2997l3000k0111K9077L2314
$$ 82872 105681 108586 81955 23413 26513 92523 126317 139314 106314 86203 115280 147594
20239A47594j9542k0806k9008m0729k0646l979M1914k4673j1735J4483m1987n2919
$$ 147594 128052 107246 78238 37509 16863 12884 54798 30125 18390 32873 -9114 -62033
20227f2033J7531j1371O3620k857k4402P1950O0632k852k3856k5770K5563J02185
$$ -62033 -44502 -55873 7747 4890 -19512 52438 113070 110218 86362 60592 86155 188340
20215A88340M5088l5355j01809p8785k3849L0232J5957K306M937p060J2444J7947
$$ 188340 233428 198073 96264 17479 -6370 23862 39819 42125 47062 40002 52446 70393
20203G0393L7560K9105m6602p8249o9793R9916K6166j4481K0955J0250k3576N0778
$$ 70393 107953 137058 90456 12207 -57586 42330 68496 54015 74970 85220 61644 112422
20191A12422J6504L1923j6804J971j2408n6157k1658K6075N4046J8709J0242L7409
$$ 112422 128926 160849 144045 146016 133608 77451 55793 81868 135914 154623 164865 202274
20179B02274Q364O864l6144L4640l5889o2659m9383K3741M1308J4100k8342n5141
$$ 202274 210638 217502 181358 215998 180109 117450 68067 91808 133116 147216 118874 63733
20167F3733M8083J24287P449j1632n4092n9128m5496q472j4841l6381K9788O8846
$$ 63733 111816 236103 243552 231920 177828 118700 73204 64732 49891 13510 43298 112144
20155A12144J04732j2998o9637k2934l5093R793K9211N0066m9605m5381O1832
$$ 112144 216876 203878 134241 111307 76214 86007 115218 165284 115679 70298 132130
20144A32130P1332Q6523J5341k717R6882N509j9581o8595j39870m4404K6160Q2022
$$ 132130 203462 289985 305326 302609 399491 405000 385419 316824 176954 132550 158710 240732
20132B40732J1325K628L2854R0P2924Q7275j474q8703q5481o0352j4269j5955
$$ 240732 252057 254685 287539 287629 360553 447828 446354 357651 272170 211818 197549 181594
20120A81594O140j6544L9173K247o3177j1258J1726n5467j3128K1535O2192k0068
$$ 181594 187734 171190 210363 212610 149433 138175 149901 94434 81306 102841 165033 144965
20108A44965O777q481l031J2626m4923l6371N5817O5580k3123l7161J4342O000
$$ 144965 151742 143261 140230 152856 107933 71562 127379 192959 169836 132675 147017 153017
20096A53017K7254J3180J2825L7461o24p2650r862J216L4809O1532J15648J28540
$$ 153017 180271 193451 206276 243737 243113 170463 160601 161817 196626 258158 373806 502346
20084E02346O7604M6112l5814j34471r0046k9614m2970p2544n377N5244R6606
$$ 502346 569950 616062 580248 445777 355731 326117 283147 210603 205226 260470 357076
20073C57076J39458J44354O8831r108r2104j90136o8711m8382m2847r510k5358
$$ 357076 496534 640888 709719 700611 608507 418371 349660 301278 258431 248921 223563
20062B23563l6280k4281M179j432K9283p43l0522m3406K2919k0838J7519r801
$$ 223563 187283 163002 167181 165749 195032 194289 163767 120361 143280 122442 139961 130160
20050A30160K0921m342k0326l1589m0893M180J9471O5466M4596m4756p1125M7560
$$ 130160 151081 146739 126413 94824 53931 58111 77582 143048 187644 142888 71763 119323
20038A19323M2859J7820l0912k6145m3111k5445k9820j9903j9524J5902L4650
$$ 119323 162182 180002 149090 122945 79834 54389 24569 4666 -14858 1044 35694
20027C5694l0186K5288j4624L2615L6331j5544L9475K4700k8935p1570j9501K1167
$$ 35694 5508 30796 16172 48787 85118 69574 109049 133749 104814 33244 13743 34910
20015C4910M5523Q0261O334L747M940m9958k8240K0701J4356K2172J14250k4305
$$ 34910 80433 160694 167028 170775 175715 125757 97517 118218 132574 154746 268996 244691
20003B44691q0382j8601J2991j0252P434k0152J6654q234j034K1591m935l8156
$$ 244691 164309 145708 158699 148447 155881 135729 152383 144149 143115 164706 159771 121615
19991A21615l280j60n9549N156k6033J0964L6605J2830M4433P3068r644k8453
$$ 121615 118335 118175 58626 63782 37749 48713 85318 98148 142581 215649 206005 177552
19979A77552l4576k8763n8300O654K3592O8405j4405J6662J8116l5999p3885K9314
$$ 177552 142976 114213 55913 62567 86159 154564 140159 156821 174937 138938 65053 94367
19967I4367M1708L6226m3104n2756o0293J3360J37873M7636O953P793m7564m190
$$ 94367 136075 172301 129197 76441 16148 29508 167381 215017 221970 229763 182199 178009
19955A78009L108n667J463N5420p638n4030J8804M008n403L976L7735O105J7928
$$ 178009 181117 175450 176913 232333 224695 170665 189469 193477 188074 192050 229785 235890 253818
19942B53818o2656J5313O0701N3418N2650M9605k531p9602m9824r178L7259k1093
$$ 253818 191162 206475 267176 320594 373244 422849 420318 340716 290892 281714 318973 297880
19930B97880k3599n5820q363L7415L1261m9201j8034j3527L7208M6687J4045l5488
$$ 297880 274281 218461 210098 247513 278774 229573 211539 198012 235220 281907 295952 260464
19918B60464M6747L6456L2334o3232r3006j4657Q4192M5531M389k125L2691N9536
$$ 260464 307211 343667 376001 312769 219763 205106 289298 334829 339218 337093 369784 429320
19906D29320N2911L3659L1949J0614O7683M2543J71378J71890J50460J53641Q1208
$$ 429320 482231 515890 547839 558453 626136 668679 840057 1011947 1162407 1316048 1397256
19895A397256j8657O707m3850R5456J72979J63825K13455K43466K11475K53827
$$ 1397256 1378599 1385306 1341456 1436912 1609891 1773716 1987171 2230637 2442112 2695939
19885B695939J81834J39436J93115J55087J67460K36477L60166N99999Q86410
$$ 2695939 2877773 3017209 3210324 3365411 3532871 3769348 4129514 4729513 5615923
19876E615923J225778J762099K477513L591156N678195R331925J5506464K1533808
$$ 5615923 6841701 8603800 11081313 14672469 20350664 29682589 45189053 66722861
19868F6722861K0616179J3079404N374078J11660m984522j2422996k0360549k1511287
$$ 66722861 87339040 100418444 105792522 105904182 100919660 88496664 68136115 46624828
19860D6624828j5414933r214723n595429l521614k445415j792392j337070j075824
$$ 46624828 31209895 21995172 16399743 12878129 10432714 8640322 7303252 6227428
19852F227428q32933o01914l55309k83931j56405k4652l3284j8371O9012J35611
$$ 6227428 5394495 4792581 4437272 4153341 3996936 3972284 3939000 3920629 3989641 4125252
19842D125252j1047j11135j08570o1666p2058j14543j06778O4794J15501J35108
$$ 4125252 4114205 4003070 3894500 3832834 3760776 3646233 3539455 3604249 3719750 3854858
19832C854858R9573P0287N8174J15503J57737J34474K22460L06064M60217Q30488
$$ 3854858 3954431 4024718 4082892 4198395 4356132 4490606 4713066 5019130 5479347 6309835
19822F309835J141077J441730J997188K860752M245191O411688J0304405J7346969
$$ 6309835 7450912 8892642 10889830 13750582 17995773 24407461 34711866 52058835
19814E2058835K7591437L3450707K7259596J4612244M272288l260990j1666058
$$ 52058835 79650272 113100979 140360575 154972819 159245107 155984117 144318059
19807A44318059k3888487l2728185k9428259j8897576j1260864p029307m543885
$$ 144318059 120429572 87701387 58273128 39375552 28114688 21085381 16541496
19800A6541496l127981k311382j715608j297620j036229q33346o27766l73232
$$ 16541496 13413515 11102133 9386525 8088905 7052676 6219330 5591564 5218332
19792E218332j98618j99125j97229j94466k13997l10764k53466k30083j78203
$$ 5218332 5019714 4820589 4623360 4428894 4214897 3904133 3650667 3420584 3242381
19783C242381j21767j15778j64605k12338k41202j69172j76853k17597k17848
$$ 3242381 3120614 3004836 2840231 2627893 2386691 2217519 2040666 1823069 1605221
19774A605221j97755r6388J4222m9678J07625K14451J83251M6568j32830l24288
$$ 1605221 1407466 1311078 1325300 1275622 1383247 1597698 1780949 1827517 1694687 1370399
19764A370399k65720n1394n3827o6151O91L9773J50439K46389J88550m6922k76278
$$ 1370399 1104679 1053285 999458 933307 933998 973771 1124210 1370599 1559149 1512227 1235949
19753A235949l34203k35572j00513p3151j4019J7121J2347m0837K168J1070l9478
$$ 1235949 901746 666174 565661 492510 478491 495612 507959 467122 469290 480360 440882
19742D40882k7529j1632K4348p4061l8082M3017K7988k1725J937P2396J28543
$$ 440882 413353 401721 426069 352008 313926 356943 384931 363206 365143 437539 566082
19731E66082O5735J7038L1885O5346M1780l742j01833j39578m6757L4212O3781
$$ 566082 631817 648855 680740 746086 787866 784124 682291 542713 495956 530168 593949
19720E93949K8115L0803J6017p186M4154O9900J06610J94014J70037N1290j68790
$$ 593949 622064 652867 668884 661698 705852 775752 882362 1076376 1246413 1297703 1128913
19709A128913k64510j92873j01662l9088M4650n4384l3415J28862L00049K68130
$$ 1128913 864403 671530 569868 530780 575430 521046 487631 616493 916542 1184672
19699A184672L376j37900k49248j60618j43335l9946q807m2716m7356m1540L2475
$$ 1184672 1188048 1050148 800900 640282 496947 457001 448194 405478 358122 316582 349057
19688C49057p1589n1711J4522q2040l1620L6746Q0628l3050q0656L2300O7215
$$ 349057 277468 225757 240279 158239 126619 163365 243993 210943 130287 162587 229802
19677B29802O4254J0903M133J8665k6619j3388K0608p18k5939K9810M8066N8002
$$ 229802 294056 304959 309092 327757 301138 287750 308358 307640 281701 311511 359577 417579
19665D17579M5964M9618J4629l3503m3313K9083L0850Q6834J4142p8193K183K2145
$$ 417579 463543 513161 527790 494287 450974 480057 510907 597741 611883 533690 535873 558018
19653E58018L090q4511p3456P0608O4074J3879J1469m3933n0P0161Q1396r149
$$ 558018 561108 476597 403141 473749 537823 551702 563171 519238 519188 589349 670745 661596
19641F61596p6105l1993l7620J2339P2974J48798Q9532L1209M3388J58467K10394
$$ 661596 585491 553498 515878 528217 601191 749989 839521 870730 914118 1072585 1282979
19630A282979J00982J3618q794l3691j4132l0161L2917J20987K78496L48225L47168
$$ 1282979 1383961 1397579 1388785 1355094 1340962 1310801 1343718 1464705 1743201 2091426 2438594
19619B438594L94792K80186M4152K9979r266J57933L12810M58619P04717R86562
$$ 2438594 2833386 3113572 3157724 3187703 3178437 3336370 3649180 4107799 4812516 5799078
19609E799078J386497J932546K666398L662801N338359Q577495J4996496K5265324
$$ 5799078 7185575 9118121 11784519 15447320 20785679 29363174 44359670 69624994
19601F9624994L0439607J6053836n345008k5209575k8246509j7169404q633309
$$ 69624994 100064601 116118437 110773429 85563854 57317345 40147941 31514632
19594C1514632l579837J46904L852363Q962266J7312222K7089022K3435028M333071
$$ 31514632 27934795 28081699 31934062 40896328 58208550 85297572 108732600 113065671
19586A13065671j6238476l0098600k4041166j3858197q037624m990458l183881
$$ 113065671 96827195 66728595 42687429 28829232 20791608 15801150 12617269
19579A2617269k177543j624584j172573p99515o03115m78126m44210l29448j72571
$$ 12617269 10439726 8815142 7642569 6843054 6239939 5761813 5317603 4988155 4815584
19570D815584j38604j09836k38077j93257k27671j21492J6400O7595N1506j9260
$$ 4815584 4676980 4567144 4329067 4135810 3908139 3786647 3803047 3870642 3922148 3902888
19560C902888M7651L2128Q8446J90684J92236K97138N09885Q65422J394265J926799
$$ 3902888 3950539 3982667 4071113 4261797 4454033 4751171 5261056 6126478 7520743 9447542
19550I447542K702141M087763O825498J2238730J9318233J7959179N131903r289193
$$ 9447542 12149683 16237446 23062944 35301674 54619907 72579086 77710989 68421796
19542F8421796j9832883j6174389q676293m195946j291703J109469L751260P806956
$$ 68421796 48588913 32414524 23738231 19542285 18250582 19360051 23111311 30918267
19534C0918267J4436756J9234141J1432529k547800j6111498k0214541j3201187
$$ 30918267 45355023 64589164 76021693 73473893 57362395 37147854 23946667
19527B3946667p447251m443582k801301j834982j244568r45956p33176n78256
$$ 23946667 16499416 12055834 9254533 7419551 6174983 5229027 4495851 3917595
19519C917595l65510l05633k21158q9755r9093j17762j74242k13953j93537k46248
$$ 3917595 3552085 3246452 3025294 2935539 2836446 2718684 2544442 2330489 2136952 1890704
19509A890704k45848j84044j06763o7740J2886L378L5148k1953j76806j68407
$$ 1890704 1644856 1460812 1354049 1286309 1299195 1302573 1337721 1315768 1138962 970555
19499I70555r8678p0469q0361l0560j2909m9108k7392p1621r4793l5382M485j0617
$$ 970555 871877 801408 721047 690487 677578 628470 601078 529457 434664 399282 403767 393150
19487C93150l1358k8630j2214l8204p3667K9418N8003J5634l949M150Q1525j1351
$$ 393150 361792 333162 320948 282744 209077 238495 296498 312132 308183 312333 393858 382507
19475C82507p1948r0852k7020L7336K1205L1707l3973l2251K4135K0957K6371
$$ 382507 310559 219707 192687 230023 251228 282935 248962 216711 240846 261803 288174
19464B88174p685j6940l4821q2915l0777N5968J4755J8411P9600N2628m9753q0585
$$ 288174 280489 263549 228728 145813 115036 171004 185759 204170 283770 336398 286645 206060
19452B06060n7476o1188l6613N5952O7903k1109K6477j2096l0913k1437O086K1429
$$ 206060 148584 87396 50783 106735 174638 153529 180006 167910 136997 115560 121646 143075
19440A43075m8176k7094K3816M751O947R671O2680N4940P3826j6610o9902j0303
$$ 143075 94899 67805 91621 96372 103319 112990 175670 230610 304436 287826 217924 207621
19428B07621Q557J5132R759l7476m8641q692l4934L1890L6557n0567j3548r722
$$ 207621 216178 231310 241069 203593 154952 146260 111326 143216 179773 129206 115658 105936
19416A05936p4068K2034J11579L7556j237O856o2937k5297K925l1345l6517k4664
$$ 105936 31868 53902 165481 203037 201800 208656 145719 120422 123347 92002 55485 30821
19404C0821J1353o1265r203k2155L376O0887q110M974M2882j5203o1003j2367
$$ 30821 42174 -19091 -28294 -50449 -47073 13814 5704 10678 53560 38357 -22646 -35013
19392c5013k866O9144M3087j3719r365j899K8493J6203q3769n242P0540M578n384
$$ -35013 -37879 31265 74352 60633 51268 49369 77862 94065 10296 5054 75594 80172 74788
19379G4788N8180R800k0847j193k002L2072l9829J8480O2517p813o8703j9550
$$ 74788 132968 142768 121921 120728 118726 150798 110969 129449 191966 184153 115450 95900
19367I5900L9712K7510L2493m956m6756m6545k1997O653O7706O6371j3172p3152
$$ 95900 135612 163122 195615 190659 143903 97358 75361 82014 149720 216091 202919 129767
19355A29767L390J3808k8964j2110K3200j255j5726j0081n1819m2466P136L8211
$$ 129767 133157 146965 118001 105891 129091 127836 112110 102029 50210 7744 14880 53091
19343E3091K3342J1961L33k7847J3549J4634k9078m9409L0469O3364k8794L0269
$$ 53091 76433 88394 88727 60880 74429 89063 59985 10576 41045 104409 75615 105884
19331A05884L2611P7378N7716N9536J46949J49250J46450J16567l531m0986m3630
$$ 105884 138495 215873 273589 333125 480074 629324 775774 892341 888810 847824 804194
19320H04194r6072j64122j27752n6736p9762j9403m5038n2825p1573K7476r217
$$ 804194 708122 544000 416248 359512 279750 260347 215309 162484 90911 118387 109170
19309A09170R142L6555J1370m1853q6953M138n150N217L9550O9638J4773o2675
$$ 109170 118312 154867 166237 124384 37431 41569 36419 41636 81186 150824 165597 102922
19297A02922k9765L7196M9046m0596l2481j2600L0939K2974k9918m9956j3610
$$ 102922 73157 110353 159399 118803 86322 73722 104661 127635 97717 47761 34151
19286C4151J9675M2542L0556q183k0798o3143q8260Q556N0144K9728m1751K5635
$$ 34151 53826 96368 126924 118741 97943 34800 -53460 -44904 5240 34968 -6783 18852
19274A8852O2426O8865P3620J03333J01789J57817R6128M4311n7930l8438n9060
$$ 18852 81278 150143 223763 327096 428885 586702 682830 727141 669211 630773 571713
19263E71713j45762p8466r1276o7684m0314j5412o0446p7561o507O1895j0013
$$ 571713 425951 347485 256209 188525 148211 132799 72353 -5208 -11715 50180 40167
19252D0167l2556n6815N091J6396L4855n7774n495P5770K1817M7678n563o8710
$$ 40167 7611 -49204 -44113 -27717 7138 -50636 -56131 19639 41456 89134 83571 14861
19240A4861j9351J0264J953K3803N4287L3068o5359q2023l1365L4808J6099L758
$$ 14861 -4490 5774 7727 31530 85817 118885 53526 -28497 -59862 -25054 -8955 -5197
19228e197l771j7444K4373J8962j5537o8844k6938K6349P696N9611J8560M0751
$$ -5197 -8968 -26412 -2039 16923 1386 -67458 -94396 -68047 -60351 -740 17820 58571
19216E8571N0868L5059q1735l8025j3731K4990k1347L4514O1670j0039m6065K4196
$$ 58571 109439 144498 62763 24738 11007 35997 14650 49164 110834 100795 54730 78926
19204G8926J00588J7615j02791m533k4402K984p8774l6546P2289Q6780K921m8052
$$ 78926 179514 197129 94338 89805 65403 68387 -10387 -46933 25356 112136 115057 67005
19192F7005J3649k2975p8824m187Q373K501l6640M4844J43728J4084j28835j1292
$$ 67005 80654 57679 -21145 -25332 -16959 -14458 -51098 -6254 137474 151558 22723 11431
19180A1431L8414N3070l4568j6770p350R592K8803m2849o3255K6769J1553j6167
$$ 11431 49845 102915 68347 51577 44227 53819 82622 39773 -23482 3287 14840 -1327
19168a327m828J3076M6774n9580p5723J7167L1585N8839N786j5786m3444J0027
$$ -1327 -6155 6921 53695 -5885 -81608 -64441 -32856 25983 31769 15983 -27461 -17434
19156a7434l0349J3137P812N4906L3517j6713J6267J2441K0810p548m2579k3139
$$ -17434 -47783 -34646 -26834 28072 61589 44876 61143 73584 94394 86846 44267 21128
19144B1128J5570M1233l0334m9347M6864N705J192L830n142j1182k4557n6678
$$ 21128 36698 77931 47597 -1750 45114 50819 52011 55841 50699 39517 14960 -41718
19132d1718J7056M874n3262K9448J432k0132J7767K8705m4903L5096k1512L250
$$ -41718 -24662 -19788 -73050 -43602 -42170 -62302 -44535 -15830 -60733 -25637 -47149 -43899
19120d3899M3033J0570R098n34j7738L1359k3260p6938L0833J0108N5346l5545
$$ -43899 -866 9704 18802 18268 530 31889 8629 -68309 -37476 -27368 27978 -7567
19108g567o1558j4994P5882K5513J2045l6093j7942N7934j1426l2160k0041j05522
$$ -7567 -69125 -84119 -8237 17276 29321 -6772 -24714 33220 21794 -10366 -30407 -135929
19096a35929j0982N824L2280M6170K5062K6153m161j5625k2170k5076m0160O2218
$$ -135929 -146911 -141087 -108807 -62637 -37575 -11422 -15583 -31208 -53378 -78454 -118614 -56396
19084e6396N3119m0452j6078Q0359O1766l1786m8692n9427r236k0724j4951q198
$$ -56396 -3277 -43729 -59807 20552 82318 50532 1840 -57587 -66823 -87547 -102498 -110696
19072a10696P3909J2490N3849L4240L237N4012R4923J50182J56565L2526p8355
$$ -110696 -36787 -24297 29552 63792 67029 121041 215964 366146 522711 555237 476882
19061D76882j05417j31447p5002o1835l9612J5395J00028q35J41353J52372J11299
$$ 476882 371465 240018 165016 103181 63569 78964 178992 178157 319510 471882 583181
19050E83181K1916j02504j43585j14772k710k9997k5245n8693m8473m2230l055
$$ 583181 605097 502593 359008 244236 241526 211529 186284 127591 79118 36888 33833
19039C3833k2450m300q477M8063J13J3557K8608k152K5433n3779l5106o81l0687
$$ 33833 11383 7083 -1394 46669 46782 60339 88947 86795 112228 58449 23343 22662 -8025
19026h025K2243J4008k4244L2118L3733k2172L674L2509l9424m0632k4185n4740
$$ -8025 14218 28226 3982 36100 69833 47661 51335 83844 44420 3788 -20397 -75137
19014g5137k0411N1296N2665Q6998J64901J07126O3580M4436m0946q0286n8896
$$ -75137 -95548 -44252 8413 95411 260312 367438 431018 475454 434508 354222 295326
19003B95326r7823p4732r939J2732k6185l0482M6794J18165J16285m1216n926
$$ 295326 197503 122771 112832 125564 99379 68897 115691 233856 350141 308925 302999
18992C02999j9011p7380o8031l4842k7016K794n3700r9539J660L0308K5902J3344
$$ 302999 283988 206608 138577 103735 76719 79513 25813 -73726 -72066 -41758 -15856 -2512
18980b512j096J0237L5146K3280Q986n0823m4942P0347K9819o5710K1815O0990
$$ -2512 -3608 6629 41775 65055 74041 23218 -21724 48623 78442 12732 34547 95537
18968I5537m8298r4278l4028P4529l170p2886L4366J3181k2562l5888K6079j1536
$$ 95537 47239 -47039 -81067 -6538 -9708 -82594 -48228 -35047 -57609 -93497 -67418 -78954
18956g8954k17M1390M9752j1009J4133l6909r804Q2468k6123l1060k8969n2606
$$ -78954 -79171 -37781 11971 962 15095 -21814 -31618 50850 24727 -6333 -35302 -87908
18944h7908R795P4371L461K1462m2748m9860l1651M2181N2987n9790j9220L677
$$ -87908 -78113 -3742 -281 21181 -21567 -71427 -103078 -60897 -7910 -67700 -86920 -83243
18932h3243N4468O2179L4893r02Q927q064k2097J3794L7200J627m5296j29873
$$ -83243 -28775 33404 68297 67395 76322 68258 46161 59955 97155 98782 53486 -76387
18920g6387K413J12874L413n6260L7336m577L9918j8586k5404k7391O602L1112
$$ -76387 -73974 38900 42313 -13947 23389 18812 58730 40144 14740 -12651 -6049 25063
18908B5063l7294m0373k1213J0291K4792j0990j0639M3073K501M6398n6813k5122
$$ 25063 -12231 -52604 -73817 -63526 -38734 -49724 -60363 -17290 -14789 31609 -25204 -50326
18896e0326K0425K7359m9629j5020l8732J2328k9531k1415K5750K1621O2057O7367
$$ -50326 -29901 -2542 -52171 -67191 -105923 -93595 -123126 -144541 -118791 -97170 -35113 32254
18884C2254N0862K6673o6874n8667m3986R131m6779M3762j135K2205L2107l4107
$$ 32254 83116 109789 42915 -15752 -59738 -50607 -97386 -53624 -54759 -32554 -447 -34554
18872c4554l6910R120L1737n5610q503Q078j785p762J2857M0086r20N5905j8062
$$ -34554 -71464 -62344 -30607 -86217 -94720 -86642 -88427 -96189 -83332 -43246 -44166 11739 -6323
18859f323o7673J6981L9677K4048q603k2214k1082K7838J9273O722p0466M337
$$ -6323 -73996 -57015 -17338 6710 -1893 -24107 -45189 -17351 1922 8644 -61822 -57485
18847e7485K7848L1034M7429p163m7080J278p711J0211J0694j2465l6692Q262
$$ -57485 -29637 1397 48826 41663 -5417 -4139 -11850 -1639 9055 -3410 -40102 -31840
18835c1840J1147K0113L5415k0586l6692q5464P574O7534P722N659n0087K7050
$$ -31840 -20693 -580 34835 14249 -22443 -107907 -100333 -32799 -25077 -19418 -69505 -42455
18823d2455j6302L815L4952l1925m4556p568m8901N5118J01695M5538l3284o786
$$ -42455 -58757 -54942 -19990 -51915 -96471 -104039 -152940 -97822 3873 49411 16127 9341
18811I341L3502k4312o9196m808k2978L7250J15102J4442J5073k5509o3432p290
$$ 9341 42843 18531 -50665 -55473 -78451 -41201 73901 88343 103416 77907 14475 7185
18799G185m3602K3033N7949J1502K2391R381O3611l295k2052k5702o3206K2366
$$ 7185 -36417 -13384 44565 56067 78458 87839 151450 148155 126103 100401 37195 59561
18787E9561p799K7208M1391K803j8777m3229K9215K6787J2902l1881K0839m0621
$$ 59561 51762 78970 120361 123164 104387 61158 90373 117160 130062 98181 119020 78399
18775G8399m2546K8342N829n1667m8256K0678O7126J18996N3763K8502N4764R8975
$$ 78399 35853 64195 70024 18357 -29899 -9221 57905 176901 230664 259166 313930 412905
18763D12905R2117K9979j09587j82952q3335k3157j3077P604j775n5174J5966
$$ 412905 505022 535001 425414 242462 159127 135970 122893 130497 128722 73548 89514
18752H9514K5650n1910l2624K9388P4917p937k1873l4654k1931Q298j9941k0818
$$ 89514 115164 63254 30630 60018 134935 126998 105125 70471 48540 56838 36897 16079
18740A6079M4437K243m1120R205L9175K4596k2267o9821l565L6966o268O7444
$$ 16079 60516 62759 21639 30844 70019 94615 72348 2527 -1038 35928 29660 97104
18728I7104J9462K4352l9448m9825l0890r0430J142J18130N9945J2513J716m5977
$$ 97104 116566 140918 101470 51645 20755 -69675 -68533 49597 109542 122055 123771 77794
18716G7794k3750L381M6522J5011n4875J4657L849j0829m9816o2762J1721P5487
$$ 77794 54044 57425 103947 118958 64083 78740 82589 71760 21944 -40818 -29097 46390
18704D6390k3875l5117j6975L5412K0559Q759M3339k0305l5762j7348j558j3387
$$ 46390 22515 -12602 -29577 5835 26394 35153 78492 58187 22425 5077 3519 -9868
18692i868K563k2359Q989q492K5893j907o7451J1213M7110J4805q993M6609L6127
$$ -9868 -7305 -29664 -20675 -29167 -3274 -5181 -72632 -61419 -14309 496 -8497 38112 74239
18679G4239Q928q7972l5245l366J136N9540K3642o0646o6406l7265P9766L9384
$$ 74239 83167 -4805 -40050 -43416 -42280 17260 40902 -19744 -86150 -123415 -43649 -4265
18667d265k07k9821j1207J0257P1873J7220l6842k8521n1460l3664N1780J4013
$$ -4265 -4472 -34293 -45500 -35243 36630 53850 17008 -11513 -62973 -96637 -44857 -30844
18655c0844J3742K0627N7845j9421o1359j9665L4097O8682P336N9211K5470L7599
$$ -30844 -17102 3525 61370 41949 -19410 -39075 -4978 63704 71040 130251 155721 193320
18643A93320J6502k1258o8832j50315n4845N9583P3449J8648n9200M8311M0606
$$ 193320 209822 188564 119732 -30583 -85428 -25845 47604 66252 7052 55363 95969
18632I5969m5762n8803k4884J6692M5302L565q284p349l1174J9739m1778k3921
$$ 95969 50207 -8596 -33480 -16788 28514 32079 23795 16446 -14728 5011 -36767 -60688
18620f0688M9918P0828k570l7872p990K127k394M6827R548p313j3096r156l8596
$$ -60688 -10770 60058 57488 19616 11626 13753 11359 58186 67734 60421 47325 38169 -427
18607d27P190l3769O0980M0403k5688m5508J6432L3662j3587M9924j8843m0239
$$ -427 6763 -27006 33974 74377 48689 3181 19613 53275 39688 89612 70769 30530
18595C0530l7999m9365L7602L2389N8431j898k0620o152L3587k4285l1124l4061
$$ 30530 -7469 -56834 -19232 13157 71588 69690 49070 42918 76505 52220 21096 -12965
18583a2965O7744J7654k1167l8658j2086l6863L4876J5472M2786O7452P5718J96
$$ -12965 54779 72433 51266 12608 522 -36341 -1465 14007 56793 124245 199963 200159
18571B00159n9903o5591p958k3509n5150N8846j5672p9558L9288j2176n836M9188
$$ 200159 140256 74665 66707 43198 -11952 46894 31222 -48336 -9048 -21224 -27060 22128
18559B2128k2759J6731j3705j9568L1315l7574n450J0642n785K1113r118K9383
$$ 22128 -631 16100 2395 -17173 14142 -23432 -28882 -18240 -24025 -2912 -12030 17353
18547A7353M2703L8077l3412k978l458j455j9728n8347K3965L6540j4171m4987
$$ 17353 60056 98133 64721 61743 58285 56830 37102 -21245 2720 39260 25089 -19898
18535a9898p070l504N0766q148K2503M239m4504k3736n763J9677j6741o026j0807
$$ -19898 -26968 -30472 20294 12146 34649 38888 -5616 -29352 -35115 -15438 -32179 -38205 -49012
18522d9012L7803O0074L2243K7908J1299o5962k3390l8692n0503L0699R7292J869
$$ -49012 -11209 48865 81108 109016 120315 54353 30963 -7729 -58232 -27533 69759 71628
18510G1628p4794r5310o3281L6806O436J6950M7132L4368r723l0789M902q610
$$ 71628 -3166 -98476 -161757 -124951 -118515 -101565 -54433 -20065 -29788 -60577 -55675 -64285
18498f4285j8671j4623J5737N7098J8806O64L0582k5274K9662L4176L2726j3151
$$ -64285 -82956 -97579 -81842 -24744 -5938 -5274 25308 34 29696 63872 96598 83447
18486H3447m8004p0904l058L5573l092J8928Q49L0652L1655L9349j6105m0650
$$ 83447 35443 -35461 -38519 -2946 -6038 12890 13739 44391 76046 115395 99290 58640
18474E8640k4785k4658K8303q509L8101K4479n305n9726R340L6034l623o5937
$$ 58640 33855 9197 37500 28991 67092 91571 86266 26540 35880 71914 68291 2354
18462B354m0232J0256R770K187o228n3718K2465j2367l8796M1757O1512O92l9908
$$ 2354 -37878 -27622 -17852 -15665 -21893 -75611 -53146 -65513 -104309 -62552 -1040 -348 -40256
18449d0256K9898M2413k1645R29q3281k7302O0542K4192J1187O392p5659J5315
$$ -40256 -10358 32055 10410 11339 -71942 -99244 -38702 -14510 -3323 3069 -72590 -57275
18437e7275M018M45N539M4287K5850k9615N601N4944j7238n841N412o249L6598
$$ -57275 -53257 -52812 -47273 -2986 22864 -6751 -1150 53794 36556 30715 36127 29878 66476
18424F6476J7703k9705n3269K694Q725L8642N1145o2002q0282J8955K883M1915
$$ 66476 84179 54474 1205 3899 12624 51266 102411 40409 -39873 -20918 -18035 23880
18412B3880J17163J0895m3893p2121k6462P4624Q1824k3061p5293m2112k9823
$$ 23880 141043 151938 108045 35924 9462 84086 165910 142849 67556 25444 -4379
18401d379n491N7616m0549J1867P9253m8116j21492k4823P4152K3380K2033M971
$$ -4379 -9870 47746 7197 19064 98317 50201 -71291 -96114 -21962 1418 23451 28422
18389B8422k042L077N226J442M633k7340m6702J7616N7267K9670N2695J431n7308
$$ 28422 26380 29457 34683 36125 40758 13418 -33284 -15668 41599 71269 123964 125395 68087
18376F8087l3240m5524K9109j4805m952M1499o712o290L7228L6277K0806l0579
$$ 68087 34847 -10677 18432 3627 -1325 40174 33462 27172 64400 100677 121483 90904
18364I0904j6510l3028K496M6049Q1195m2775o583n8263J7712Q1978j2423j04304
$$ 90904 74394 41366 43862 89911 171106 128331 121748 63485 81197 163175 150752 46448
18352D6448j3916n1029l9082l378J1349J9525M3838k4110l635J7130m4301N6931
$$ 46448 32532 -18497 -57579 -60957 -49608 -30083 13755 -10355 -13990 3140 -41161 15770
18340A5770p713l2544j7182J7273l1452o2802J7130Q030M2704j3076O1441o403
$$ 15770 8057 -24487 -41669 -24396 -55848 -118650 -101520 -93490 -50786 -63862 -2421 -8824
18328h824j7936k2004K548M890J8887k6707P11L4963j5938j194M2506J5343K1431
$$ -8824 -26760 -48764 -46216 -41326 -22439 -49146 -48435 -13472 -29410 -30604 11902 27245 48676
18315D8676n653m3740m1781K5932J2680k8694r353N955L0364p106L4861L997p956
$$ 48676 43023 -717 -42498 -16566 -3886 -32580 -41933 -35978 -5614 -12720 22141 26138 18182
18302A8182J6406j4597k1935K0917N4565J0247l8324j1499q69o9941m4533L7303
$$ 18182 34588 19991 -1944 18973 73538 83785 45461 33962 33093 -36848 -81381 -44078
18290d4078N3509L3001J2471j645l9732m5788k6834m7606j3450J21542K3025o7127
$$ -44078 9431 42432 54903 53258 13526 -32262 -59096 -106702 -120152 1390 24415 -42712
18278d2712o853P2118K3472m7744k1025J1201K45L2345M7280N4025k0863j8108
$$ -42712 -49565 22553 46025 -1719 -22744 -11543 -11298 21047 68327 122352 101489 83381
18266H3381o9206j1979K7017L7129k4733l5112K5343K68j5850m6214K4775M694
$$ 83381 14175 2196 29213 66342 41609 6497 31840 32108 16258 -29956 -5181 -487
18254d87K2233J7901L9140j5967n2952j1819L8300L9662J7923j7196q298j1560
$$ -487 21746 39647 78787 62820 9868 -1951 36349 76011 93934 76738 68440 56880
18242E6880k1478j1500j2899o826N8714n361M725M4659O1716j070K959J7558m3947
$$ 56880 35402 23902 11003 4177 62891 57530 62255 106914 168630 167560 170519 188077 144130
18229A44130l8326m3273l8903m5854O8039K0457j0681N9427k9372o3538J4746
$$ 144130 105804 62531 23628 -22226 45813 66270 55589 115016 85644 22106 36852
18218C6852L1628k2899o0053k4601L9325p144N1450K243k4715K883k2581P0657
$$ 36852 68480 45581 -14472 -39073 252 -6892 44558 46801 22086 24969 2388 73045
18206G3045J5827N7411j8896m7978K9942l9642K9461k8309r251o1529n1138j4245
$$ 73045 88872 146283 127387 79409 109351 69709 99170 70861 61610 81 -51057 -65302
18194f5302j1126r360M7294M4166l3994K0030M242L4858K6524N929M4038J3792
$$ -65302 -76428 -85788 -38494 5672 -28322 -8292 -4050 30808 57332 63261 107299 121091
18182A21091k9462J519P09m5675K9286k1133n5130J7895L9495n4451n1298J8349
$$ 121091 91629 93148 93857 48182 77468 56335 1205 19100 58595 4144 -47154 -28805
18170b8805j2664J8061J5423l7876M1921O1662o474k2561M3734K3155O7140Q0235
$$ -28805 -41469 -23408 -7985 -45861 -3940 57722 51248 28687 72421 95576 162716 242951
18158B42951j8505J0184K2323l2003n9128m5402J9781Q4907k3250l2845J0546
$$ 242951 224446 234630 256953 224950 165822 120420 140201 225108 201858 169013 179559
18147A79559P1223L5919J3504J3074j6869J9084l217K4134n2895N649L6157j0571
$$ 179559 250782 286701 300205 313279 296410 315494 312277 336411 283516 289165 325322 314751
18135C14751M080M7829L5973K0049P9371O8683J3254O3807K2796M8037Q6381J19224
$$ 314751 318831 366660 402633 422682 502053 570736 583990 647797 670593 718630 805011 924235
18123I24235J79180J83615J67586K33656K26775K14389L11806M29043N57246Q11219
$$ 924235 1103415 1287030 1454616 1688272 1915047 2129436 2441242 2870285 3427531 4238750
18113D238750J140364J666874K312181L358611N534833R789502J8285854K9833690
$$ 4238750 5379114 7045988 9358169 12716780 18251613 28041115 46326969 76160659
18105G6160659K6888209N884624j6161286l2130135k4643009j3249033p414112
$$ 76160659 103048868 108933492 92772206 60642071 35999062 22750029 15335917
18098A5335917m212535k616359j728488j210198q95047p01966o05519n06846m04484
$$ 15335917 11123382 8507023 6778535 5568337 4673290 3971324 3365805 2858959 2454475
18089B454475l04902j92206j48009j98905j74422j25460n0237q4047n0335k0529
$$ 2454475 2149573 1957367 1809358 1610453 1436031 1310571 1260334 1176287 1125952 1105423
18079A105423j09480j30553j19058q3229k000o6165p3176q0382k9770K824k7227
$$ 1105423 995943 865390 746332 663103 661103 594938 521762 441380 411610 414434 387207
18068C87207o1185M9900k6690r7952p7000j7216r242J8818M4342j8967o690p42
$$ 387207 326022 375922 349232 251280 174280 157064 147822 166640 210982 192015 185325 184583
18056A84583k8519q529J4566R500m241p868K2599M5919k7805k8727l3142n8235
$$ 184583 156064 147535 162101 171601 167360 159492 182091 228010 200205 171478 138336 80101
18044H0101K648N024q661L502K1488k0227J8346o724l0181K6329J4742l210k4095
$$ 80101 82749 87773 79112 82614 104102 83875 102221 95497 65316 91645 106387 103177 79082
18031G9082K3263j4029P138m8882j0086M4918k5895n5309O338J8059K0976m1703
$$ 79082 102345 88316 95454 46572 36486 81404 55509 200 6538 24597 45573 3870
18019C870m7110k873K3644N0392M3009L899J1999m2877m5281k5089O7578N7591
$$ 3870 -43240 -46113 -22469 27923 70932 74831 86830 43953 -1328 -26417 41161 98752
18007I8752o394J3598N4191l5954m3549j3832p735K7130k7758l8388L6887Q46
$$ 98752 92358 105956 160147 124193 80644 66812 59077 86207 58449 20061 56948 57794
17995E7794N2698j5644q0477k7360L4095l7072j8412M8306J5243l6452k9052M796
$$ 57794 110492 94848 14371 -12989 21106 -15966 -34378 13928 29171 -7281 -36333 -31537
17983c1537J9373J9969J9913o7823m3085J4208J9492k0500J9817N5363P2549J863
$$ -31537 -12164 7805 27718 -40105 -83190 -68982 -49490 -69990 -50173 5190 77739 79602
17971G9602o489j0349r0012j3515J7394M6965O2137N407M281j2572l9882l8133
$$ 79602 73113 62764 -27248 -40763 -23369 23596 85733 91140 95421 82849 42967 4834
17959D834p9803k5467K2002m4408l6727J7083J6649j9708N9475L1301M1682L0111
$$ 4834 -74969 -100436 -78434 -122842 -159569 -142486 -125837 -145545 -86070 -54769 -13087 17024
17947A7024P0884n55O835P237q0820M079L5285k0943n6814Q82P5877j0173m762
$$ 17024 87908 87353 94188 101425 20605 24684 59969 39026 -17788 -16906 58971 48798 44036
17934D4036k2715N9407L0056J11n1023n649j6644l8594l8513N961L904N438o8676
$$ 44036 21321 80728 110784 110895 59872 54223 37579 -1015 -39528 -33567 -29663 -24225 -92901
17921i2901j1569O7935L0973k6000j6116l186K1793p1749o3032L1719k5212L1014
$$ -92901 -104470 -36535 -5562 -31562 -47678 -50864 -29071 -100820 -163852 -132133 -157345 -126331
17909a26331N1390M5750j5275J9391M0780L4613k8110n7663l1079J2884K3370
$$ -126331 -74941 -29191 -44466 -25075 15705 50318 22208 -35455 -66534 -53650 -30280
17898c0280M4902O2427J5796n6369n2757k4026K3381P0367K7038J2580l2534m6956
$$ -30280 14622 77049 92845 36476 -16281 -40307 -16926 53441 80479 93059 60525 13569
17886A3569M5134L1019k2660N1695k5448o8523l7042l6098m3389j7734j3891J191
$$ 13569 58703 89722 67062 118757 93309 24786 -12256 -48354 -91743 -109477 -123368 -122177
17874a22177K5265R2273O9887q4084r3984L3679R6048m1440n5725k045L3045N7983
$$ -122177 -96912 -4639 65248 -18836 -112820 -79141 16907 -24533 -80258 -82303 -49258 8725
17862H725Q6504l9281k0963M8384N8786l6355l3458L8851N8381l2977r6084m4713
$$ 8725 95229 55948 34985 83369 142155 105800 72342 111193 169574 136597 40513 -4200
17850d200N7412k1580m3315J734n9291p3055k2425J8494J01455N4774M7167j6907
$$ -4200 53212 31632 -11683 -9949 -69240 -142295 -164720 -146226 -44771 10003 57170 40263
17838D0263j871j1502K491j3501n3601q670n735K721K9238R240L383k5435k507
$$ 40263 38392 26890 29381 15880 -37721 -46391 -52126 -49405 -20167 -10927 -7544 -32979 -35486
17825c5486P3385P1985j9204j5086r254l0342n9951m8121m436N524q172j854P6461
$$ -35486 37899 109884 90680 75594 66340 35998 -23953 -72074 -76510 -70986 -79158 -81012 -4551
17812d551M2810p4621O906O0703L1333j4931L7954n3411n6100m3683L3872l0163
$$ -4551 38259 -36362 -29456 31247 62580 47649 85603 32192 -23908 -67591 -33719 -63882
17800f3882k7032r279J875J5998K6787O3855Q635m1599m670j1561J0977M3979
$$ -63882 -90914 -100193 -98318 -82320 -55533 8322 16957 -24642 -29312 -40873 -29896 14083
17788A4083P644j823K3658P913j6358J567l4231l2304J8370m5486j5689J0064
$$ 14083 21727 19904 43562 51475 35117 36684 2453 -29851 -11481 -56967 -72656 -62592
17776f2592Q4291K1734n5314l4031J6865M2295o0735l1916N0484K7282K2060m6391
$$ -62592 21699 43433 -11881 -45912 -29047 13248 -47487 -79403 -28919 -1637 20423 -25968
17764b5968k6000m8424K2958J07206K7963j6169m3945l2972M2124O7835l3387
$$ -25968 -51968 -100392 -77434 29772 57735 41566 -2379 -35351 6773 74608 41221
17753D1221j3859l619l1156J0196K7505j8608J3197k3879J0132j5655L2117j7015
$$ 41221 27362 23743 -7413 2783 30288 11680 24877 998 11130 -4525 27592 10577
17741A0577k1565K5252J2893n9354K776K8634J9310N342k0475O087J8765l3135
$$ 10577 -10988 14264 27157 -32197 -29421 -787 18523 23865 3390 9477 28242 -4893
17729d893k5481m3143k1430L8286M338l7103k1948n041K2694M9451O8300k906
$$ -4893 -30374 -73517 -94947 -56661 -52323 -89426 -111374 -116415 -93721 -44270 24030 21124
17717B1124l5937J6949K256L2117K6738m550K526l6939m5136J1362L9999j14j4533
$$ 21124 -14813 2136 4392 36509 63247 58697 61223 24284 -20852 -9490 30509 30395 15862
17704A5862L6256L7529o1410p5128L2956M0566p5129K0705O3130K2459M8567n54
$$ 15862 52118 89647 28237 -46891 -13935 26631 -48498 -27793 35337 57796 106363 105809
17692A05809M6690p6113q1400j073K3806O432M1490j5976k7334R196o7906k7436
$$ 105809 152499 76386 -5014 -6087 17719 24151 65641 49665 22331 31527 -36379 -63815
17680f3815L2445J7054K9046k6931L1253j0426o6498p0360m900O043j3858J0584
$$ -63815 -31370 -14316 14730 -12201 19052 8626 -57872 -128232 -133132 -127089 -140947 -130363
17668a30363P9376K1502P4657J0038k8826o868L6248k8219j6120L0563l4122l0968
$$ -130363 -50987 -29485 45172 55210 26384 19516 55764 27545 11425 41988 7866 -23102
17656b3102M964J5411k6036j1101l4201K4482M2314K3957k4965L977J7858k502
$$ -23102 -18138 -2727 -28763 -39864 -74065 -49583 -7269 16688 -8277 -4300 13558 11056
17644A1056N197P8963n6078o2770k1472o640k3311M7867k2223q435L1861M6156
$$ 11056 16253 95216 39138 -23632 -45104 -51744 -75055 -27188 -49411 -57846 -25985 20171
17632B0171p912j7395K2377l2501K027L7849M8814N052m8108n4239Q910O7313
$$ 20171 12259 -5136 17241 -15260 -13233 24616 73430 78482 30374 -23865 -14955 52358
17620E2358j6993J6071J3578k159l4353m311K4001l6947m180M6299J8402q060
$$ 52358 35365 51436 65014 62855 28502 24191 48192 11245 7065 53364 71766 63706
17608F3706j9229p574J5994O08J198P164l4887k7853l5365j5583J7605K5499l3798
$$ 63706 44477 36903 52897 53505 54703 61867 26980 -873 -36238 -51821 -34216 -8717 -42515
17595d2515O0681N1942P2340k072n5703l4751N5152n5467p9900k3300o359j1028
$$ -42515 18166 70108 142448 140376 84673 49922 105074 49607 -30293 -53593 -59952 -70980
17583g0980O3002J9545p0910l3059J5348j8235P280J6546K6164J8605n2194j1240
$$ -70980 -7978 11567 -59343 -92402 -77054 -95289 -88009 -71463 -45299 -26694 -78888 -90128
17571i0128K0652N006M6779j2078j751j300M1881K3035j7489J981N8251J0669
$$ -90128 -69476 -64470 -17691 -29769 -31520 -32820 9061 32096 14607 16588 74839 85508
17559H5508o5694J4586m6013m8874K8169J7029O1685M5854j7206K4148K3854m2589
$$ 85508 19814 34400 -11613 -60487 -32318 -15289 46396 92250 75044 99192 123046 80457
17547H0457l1017l594k8676n9766m386k3913k3105L9746P6277j267J5705L1338
$$ 80457 49440 45846 17170 -42596 -46982 -70895 -94000 -54254 22023 20756 36461 67799
17535F7799k140j4269m7912j4972J9437L539j6000j1332k0672m7927j3934J8217
$$ 67799 65659 51390 3478 -11494 7943 11482 -4518 -15850 -36522 -84449 -98383 -80166
17523h0166m4336m7155R4578P2057J5656L7551J0631j8939j7484K2322N7877j7762
$$ -80166 -124502 -171657 -77079 -5022 10634 48185 58816 39877 22393 44715 102592 84830
17511H4830r9934j10354k9175L4215K6090K4397M3943J1117N3934N026n867O364
$$ 84830 -15104 -125458 -154633 -120418 -94328 -69931 -25988 -14871 39063 44089 38222 44586
17499D4586o2689K1000J1162J2615l9648M493n626K0564N8584k1024M656j00586
$$ 44586 -18103 2897 14059 26674 -12974 -8481 -14107 6457 65041 44017 48673 -51913
17487e1913r3751k5167M818K3818J04004O858m2190n3996l0083p033M3869P3860
$$ -51913 -145664 -170831 -166013 -142195 -38191 -31333 -73523 -127519 -157602 -164635 -120766 -46906
17475d6906R54j7493L0292O8331K4622m6568n2074m7431l3657L1125k6665n7429
$$ -46906 -45952 -63445 -33153 35178 59800 13232 -38842 -86273 -119930 -88805 -115470 -172899
17463a72899J4157M7543R2024Q6580L3564j8292o7404p8140O1297M091j9936n6819
$$ -172899 -158742 -111199 -19175 67405 100969 82677 15273 -62867 -1570 2521 -17415 -74234
17451g4234K4700K9308Q1199M1470q9735k8708N7771P7856O9937P8626N9897Q2923
$$ -74234 -49534 -20226 60973 102443 12708 -16000 41771 119627 189564 268190 328087 411010
17439D11010J36306N766o0415j11011j47717p7280m4554o7948n0709j4485m3502
$$ 411010 547316 553082 492667 381656 233939 156659 112105 44157 -6552 -21037 -64539
17428f4539Q122k3456j6089L7126P88L7774R754M0985M7422J3763J369k6110m1630
$$ -64539 -56417 -79873 -95962 -58836 -58048 -20274 -10520 30465 77887 91650 93019 66909 25279
17415B5279j6925O1939j4497j0531l035P285k3006j4005K4856Q057J6710j8657
$$ 25279 8354 70293 55796 45265 42230 49515 26509 12504 37360 45417 62127 43470
17403D3470k0264l1983l1888k6957O9069l537k8977K0576J3944P44K4823L5758
$$ 43470 23206 -8777 -40665 -67622 1447 -2090 -31067 -10491 3453 4197 29020 64778
17391F4778n422J7033j0410k5007k4344K6531K6886q761k9637m9810K2339N9405
$$ 64778 59356 76389 65979 40972 16628 43159 70045 61284 31647 -18163 4176 63581
17379F3581l0036l3789J9058k3846P1571Q1482l049o3801q2907K6954N2674j4476
$$ 63581 33545 -244 18814 -5032 66539 148021 144972 81171 -1736 25218 77892 63416
17367F3416q413l2406k6923k7946L4204N7075K9825l7675l0738p4439l2167J4656
$$ 63416 55003 22597 -4326 -32272 1932 59007 88832 51157 20419 -54020 -86187 -71531
17355g1531K5972N6485J5468k7506N227J4645M5839K7237j0703j9543r0380R932
$$ -71531 -45559 10926 26394 -1112 4115 18760 64599 91836 81133 61590 -28790 -18858
17343a8858Q0397R3171O313Q248l2697K3340q4020M651N615m8861o469L1123n0565
$$ -18858 61539 154710 161023 169271 136574 159914 75894 80545 86160 37299 30830 61953 11388
17330A1388L2418J3307J5890J5681k8578K5110j3755J6173M9955L3876L315o2559
$$ 11388 43806 57113 73003 88684 60106 85216 71461 87634 137589 171465 174780 112221
17318A12221p7671k1541j9555J7796n4244o212O1567J1998j0674j3461j4405L0960
$$ 112221 34550 13009 -6546 11250 -42994 -49206 12361 24359 13685 224 -14181 16779
17306A6779p2284j2156p124k0140j1207j3590j4450N3868Q5929N2037q2115J4228
$$ 16779 -55505 -67661 -74785 -94925 -106132 -119722 -134172 -80304 5625 57662 -24453 -10225
17294a0225Q4506k2095k0094o880n8334k8360k921n112j7839N5200J5953N4330
$$ -10225 74281 52186 32092 25212 -33122 -61482 -64403 -69515 -87354 -32154 -16201 38129
17282C8129r356o134k9958J4730K2796m2921o9393m0606M8452J4806m0160J007
$$ 38129 28773 22639 -7319 7411 30207 -12714 -82107 -122713 -74261 -59455 -99615 -98608
17270i8608L2764K4242R94L7136n916n4524l7490J3209K860j9214K9190o3263
$$ -98608 -65844 -41602 -40608 -3472 -9388 -63912 -101402 -88193 -85333 -104547 -75357 -138620
17258a38620K0318P9570K6326K1710l4546J3869k1161m6704J6171O5062o159j4250
$$ -138620 -118302 -38732 -12406 9304 -25242 -11373 -32534 -79238 -63067 1995 -4164 -18414
17246a8414n3761M1025P5091l1073j2877j0604k517L3658m551l3302J4333P838
$$ -18414 -72175 -31150 43941 12868 -9 -10613 -13130 20528 15977 -17325 -2992 4846
17234D846J4189m555k2242m503M0594J2331m9149p1736K9551Q1284k2602k9124
$$ 4846 19035 14480 -7762 -12265 28329 40660 -8489 -80225 -50674 30610 8008 -21116
17222b1116N5908M3065L829j290l7407o5796k6628J0583l3555L5702O6856k8490
$$ -21116 34792 77857 81686 80396 42989 -22807 -49435 -38852 -72407 -36705 30151 1661
17210A661j8901j672j9806L3854j0264k3680k6957l8614Q649O1656q434k8913
$$ 1661 -17240 -18912 -38718 -4864 -15128 -38808 -65765 -104379 -95730 -34074 -42508 -71421
17198g1421o240K8778M3163K2768j3218J2333n0010k8029l14K0714N8317M3742
$$ -71421 -77661 -48883 -5720 17048 3830 16163 -33847 -61876 -62190 -41476 16841 60583
17186F0583j6120N178m1954o9937n121J5604Q626J6841j721M2969O4425J9034
$$ 60583 44463 49641 7687 -62250 -67371 -51767 -43141 -26300 -28021 14948 79373 98407
17174I8407n1040j3375m9852j5076M9073l4196J3167K4963n9545q0475J5397Q7399
$$ 98407 47367 33992 -15860 -30936 18137 -16059 -2892 22071 -37474 -117949 -102552 -15153
17162a5153K6921n1981j5192K3036K781k6278l0737l78N382J2963M8062J9552
$$ -15153 11768 -40213 -55405 -32369 -29588 -55866 -86603 -86981 -81599 -68636 -20574 -1022
17150a022l5615K6511J06422N7451p4631m7031j2124j4832K5646K8338j884m7951
$$ -1022 -36637 -10126 96296 153747 79116 32085 19961 5129 30775 59113 57229 9278
17138I278p4441k0612K2650J6456N1653L5735l0816r5801r789K2750J727k9294
$$ 9278 -65163 -85775 -63125 -46669 4984 40719 9903 -85898 -95687 -72937 -71210 -100504
17126a00504o0150J5143R1911l7072j9759M4327L7618M7650m1090j3049O1510
$$ -100504 -160654 -145511 -53600 -90672 -110431 -66104 -28486 19164 -21926 -34975 26535
17115B6535J2736k6191l7223K3717K6463J5724p297O310n1290l8336r3273N7568
$$ 26535 39271 13080 -24143 -426 26037 41761 34464 40774 -10516 -48852 -142125 -84557
17103h4557M7137m6222n0084k2798L1211L7104P1938J1723J7444L1063O6330m8536
$$ -84557 -37420 -83642 -133726 -156524 -125313 -88209 -16271 -4548 12896 43959 110289 61753
17091F1753j00656k7319l67O8757l91M7168o3671n179L3747p3455L851k8696M0235
$$ 61753 -38903 -66222 -66589 2168 1777 48945 -14726 -19905 13842 -59613 -55762 -84458 -44223
17078d4223N0110l7390Q575j6958l6438J3743j3426j188M2660P303l7312j9653
$$ -44223 5887 -31503 -22928 -39886 -76324 -62581 -76007 -77195 -34535 -27232 -64544 -84197
17066h4197J0159K7652M1518m905j65n6945k5431N4972K1405j8391l5912k5818
$$ -84197 -74038 -46386 -4868 -9773 -9938 -66883 -92314 -37342 -15937 -34328 -70240 -96058
17054i6058J9774M725K3464l500l179K4149J8712k2564K5691M759j9389m3510
$$ -96058 -76284 -71559 -48095 -51595 -54774 -30625 -11913 -34477 -8786 -4027 -23416 -66926
17042f6926K7761l4523J0372K3018L7836J6538k3581l115K5575K5928Q350m4881
$$ -66926 -39165 -73688 -63316 -40298 -2462 14076 -9505 -12620 12955 38883 47233 2352
17030B352r211K2311l9410L516j3767N436L6000N6355k0961J3992K0221k101n1282
$$ 2352 -6859 15452 -23958 -20442 -34209 -28773 7227 63582 42621 56613 76834 74733 23451
17017B3451l504m746J0648K6339k2098l8469J5330L0963n167J0213M4219n3331
$$ 23451 19947 15201 25849 52188 30090 -8379 6951 37914 32747 42960 87179 33848
17005C3848m7480j7282J7978k4881L5952k3575p1732l9701k903K7148L116M9719
$$ 33848 -13632 -30914 -12936 -37817 -1865 -25440 -97172 -136873 -139776 -112628 -109512 -59793
16993e9793j7907l654L0397O4366m2984r2950P8393K1071n5244k1326M8083N1278
$$ -59793 -77700 -81354 -50957 13409 -29575 -122525 -44132 -23061 -78305 -99631 -51548 -270
16981b70p037j4281j5331j2952J2265J7525K7675l1330j524n416j6855J0456q3738
$$ -270 -7307 -21588 -36919 -49871 -37606 -20081 7594 -23736 -25260 -30676 -47531 -37075 -120813
16968a20813K0202M3129L5607M9409l3849k9J1487m307J7985L6710j5048o6137
$$ -120813 -100611 -57482 -21875 27534 -6315 -6344 5143 836 18821 55531 40483 -25654
16956b5654m0737j1816L918m2855K1518R0181n4087K0224M1256r500k6464l205
$$ -25654 -66391 -78207 -74289 -117144 -95626 -5445 -59532 -39308 1948 -7552 -34016 -37221
16944c7221j422m6293o483l3855K0694L8378M9439N6026j9072k7667K6437K4928
$$ -37221 -38643 -84936 -91419 -125274 -104580 -66202 -16763 39263 20191 -7476 18961 43889
16932D3889j074m2024K3187l2468m1486L8389k2267k4965l316J11172P6839k7337
$$ 43889 42815 791 23978 -8490 -49976 -11587 -33854 -58819 -62135 49037 125876 98539
16920I8539j9918k838o2663M224J3895L942r8253Q551Q9314M0443q0081k8380
$$ 98539 78621 75783 13120 17344 31239 35181 -63072 -54521 34793 75236 -4845 -33225
16908c3225k6098K3909Q6635l5073l6155m0630m9257m6217M3884J19481L3556
$$ -33225 -59323 -35414 51221 16148 -20007 -60637 -109894 -156111 -112227 7254 40810
16897D0810O267r231k1072j3489K2817k3125j1974K5097k6436K0778p511n4361
$$ 40810 47077 37846 16774 3285 26102 2977 -8997 16100 -10336 10442 2931 -51430
16885e1430o3978l1347K3365O670O600K1423J24012N3120q806n4661N514m6364
$$ -51430 -115408 -146755 -123390 -116720 -110120 -88697 35315 88435 79629 24968 30482 -15882
16873a5882m1119J7536J9987O77l6407J2205P543j8298K347K1025J0442j6825
$$ -15882 -57001 -39465 -19478 -18801 -55208 -43003 -35460 -53758 -51411 -30386 -19944 -36769
16861c6769K3585K9487J7457K8963j107j9386k9213o5507k3094O4516k1123K8554
$$ -36769 -13184 16303 33760 62723 61616 42230 13017 -52490 -75584 -11068 -32191 -3637
16849c637J9471j941r279m7608p187J6577j9986N8148O924p8038L5151J12653
$$ -3637 15834 13893 4614 -42994 -50181 -33604 -53590 4558 11482 -66556 -31405 81248
16837H1248M3326k1412L4478R706o6171p9741k5961K7035J0369J3077L3059j8151
$$ 81248 124574 103162 137640 147346 81175 1434 -24527 2508 12877 25954 59013 40862
16825D0862N086N3354L6928L0103N698o2139r3134k1355j3556l6110O628o85J8663
$$ 40862 45948 99302 136230 166333 172031 109892 16758 -4597 -18153 -54263 -47635 -48320 -29657
16812b9657m452K9041K3350l7604p2753L4819J9022N566M3907K5159l2579M115
$$ -29657 -34109 -5068 18282 -19322 -92075 -57256 -38234 -32668 11239 36398 3819 7934
16800G934m7093m3084J4539M9664J5569K88J4819l826n101n7029K4664K8626n3
$$ 7934 -39159 -82243 -67704 -18040 -2471 -2183 12636 8810 3709 -53320 -28656 -30 -83
16787h3M4051K3319j9888j5511k9604l7902j6648m4372K5162O7847k2847k0387
$$ -83 43968 67287 47399 31888 2284 -35618 -52266 -96638 -71476 -3629 -26476 -46863
16775d6863J9361K1678l2492n3553l9296P3107M9677M6497k9214l9121l8980M1186
$$ -46863 -27502 -5824 -38316 -91869 -131165 -58058 -8381 38116 8902 -30219 -69199 -28013
16763b8013L5855m3623k3638L9897P1580L0771j7847n0281o5052l4892N8486Q1151
$$ -28013 7842 -35781 -59419 -19522 52058 82829 64982 14701 -50351 -85243 -26757 54394
16751E4394k934K1137m1042j1629R368Q032L3818o258k2771O0227j1819q6332
$$ 54394 51460 72597 31555 19926 29294 37326 71144 64886 42115 102342 90523 4191
16739D191J6557n523K5511Q138k8793n1479p8163K281J4692m0677p4708R1020
$$ 4191 20748 15225 40736 48874 20081 -31398 -109561 -107280 -92588 -133265 -207973 -116953
16727a16953N0277O5347J8151Q8563j5848j3225m2103j7899p0660k2989J9286
$$ -116953 -66676 -1329 16822 105385 89537 76312 34209 16310 -54350 -77339 -58053
16716e8053R759k8162o0007J683M7821J5052P7938O7012K2382R086m1943n7316
$$ -58053 -48294 -76456 -136463 -134780 -86959 -71907 6031 73043 95425 104511 62568 5252
16704E252m1756j8909m4821L1310L516k3995L6426j9528m2606q198K7720P772
$$ 5252 -36504 -55413 -100234 -68924 -65408 -89403 -52977 -72505 -115111 -123309 -95589 -87817
16692h7817J4502J1092J7481N0179l2259m8204L2357L7118m3906K478l2946J996
$$ -87817 -73315 -62223 -44742 5437 -26822 -75026 -42669 -5551 -49457 -46979 -79925 -77929
16680g7929n129J1470K15K1888L9619J2849n0402n4322q485K8878K4562k1751
$$ -77929 -83058 -71588 -71373 -49485 -9866 2983 -47419 -101741 -110226 -81348 -56786 -78537
16668g8537Q852L0363q298l8752m6103m482K3839J2258r384m0333K8379J10126
$$ -78537 -69685 -39322 -47620 -86372 -132475 -136957 -113118 -100860 -110244 -150577 -122198 -12072
16656a2072l3047l6695k4978L6152L9046j0588j1370k5287L2297J6001J7895J84
$$ -12072 -45119 -81814 -106792 -70640 -31594 -42182 -53552 -78839 -46542 -30541 -12646 -12462
16644a2462j9145Q584j4766N6612O6062K7023j1720r634m6466K4955L6639j2540
$$ -12462 -31607 -23023 -37789 18823 84885 111908 100188 90554 44088 69043 105682 93142
16632I3142n2768n8480M8861M5576l7760q152L3531K0229Q579J6068p3524n0534
$$ 93142 40374 -18106 30755 76331 38571 30419 63950 84179 92758 108826 35302 -15232
16620a5232m2135j0535n4862r92M2250P160J1631Q6736P2315n218m5030L8568
$$ -15232 -57367 -67902 -122764 -123756 -81506 -74346 -62715 24021 96336 91118 46088 84656
16608H4656L4570p614o8878m995k6300M4639K6950p2269o734K7066k1206K6313
$$ 84656 119226 111612 42734 37739 11439 56078 83028 10759 4025 31091 9885 36198
16596C6198K2130k2084K534M3935P724k0968j7058N2603L620m3969n2777q3600
$$ 36198 58328 36244 38778 82713 90437 69469 52411 105014 108634 64665 11888 -71712
16584g1712k9986N0108m3112j507k2996l1423M2313L1047K7112J2900m3793N0281
$$ -71712 -101698 -51590 -94702 -96209 -119205 -150628 -108315 -77268 -50156 -37256 -81049 -30768
16572c0768N9768m1876p1568N482j847M2096N4101k8995n1184K454K6089k818
$$ -30768 29000 -12876 -84444 -78962 -80809 -38713 15388 -13607 -64791 -62337 -36248 -39066
16560c9066J0302M1056r0956k7514P5988M0022L2284j325k5626k9003n731L2319
$$ -39066 -28764 12292 -78664 -106178 -30190 9832 42116 40791 15165 -13838 -19569 12750
16548A2750K8972q48p779n1754p977J4375k7097m3869K3783l3500J8083O6680
$$ 12750 41722 40874 33095 -18659 -26636 -12261 -39358 -83227 -59444 -92944 -74861 -8181
16536h181p19l6484l1509K9457L0052M7828K2771k9631n6808M6900J4925j3492
$$ -8181 -8900 -45384 -76893 -47436 -17384 30444 53215 23584 -33224 13676 28601 15109
16524A5109J4155j7854m1735p434n888L8674m9107n1474k9095J8932K3012K0581
$$ 15109 29264 11410 -30325 -37759 -43647 -4973 -54080 -105554 -134649 -115717 -92705 -72124
16512g2124L5771J5068L9735J2470k7380k3669n5739j612M3963K0506L6303o6153
$$ -72124 -36353 -21285 18450 30920 3540 -20129 -75868 -77480 -33517 -13011 23292 -42861
16500d2861l424P838L7941P6431K1956q9928l4059n2086O1792K7502k3942J8830
$$ -42861 -46285 -38447 -506 75925 97881 7953 -26106 -78192 -16400 11102 -12840 5990
16488E990m6808k6021L9136L8970K1158n712J4277j5390k2184p619J6670q834
$$ 5990 -40818 -66839 -27703 11267 32425 26713 40990 25600 3416 -4203 12467 3633
16476C633K636P7911M8302K4082o2613q2989q0513K5168L4065j2635k4107k0776
$$ 3633 6269 84180 132482 156564 93951 10962 -69551 -44383 -10318 -22953 -47060 -67836
16464f7836L765J0230k6991L9294j6793k4956k292L0342M1430J3501O143j2897
$$ -67836 -64071 -53841 -80832 -41538 -58331 -83287 -85579 -55237 -13807 -306 5837 -7060
16452g060K1167l1512q7451L4927L2420K5279l2162K1569L8752J8330J910K1452
$$ -7060 14107 -17405 -104856 -69929 -37509 -12230 -44392 -22823 15929 34259 36169 57621
16440E7621L739l4563l8305j38987j1149L9098m568M3874k8156L6904N6162M8173
$$ 57621 61360 26797 -11508 -150495 -161644 -122546 -127114 -83240 -111396 -74492 -18330 29843
16428B9843l1217j387K4462o9884k92N337k1051J9819L6955M3008L5207j0250
$$ 29843 -1374 -2761 21701 -48183 -48475 -43138 -64189 -44370 -7415 35593 70800 60550
16416F0550J6684n0582J6027l550q059J628j0368n065j0827j0863k086o8693J2263
$$ 60550 77234 26652 42679 39129 31070 32698 22330 17265 6438 -4425 -6511 -75204 -62941
16403f2941J6940K6078l0066l3663M1891M2343k1319o5928k9937J6178L5038J5557
$$ -62941 -46001 -19923 -49989 -83652 -41761 582 -20737 -86665 -116602 -100424 -65386 -49829
16391d9829p3799K0782q77j2109P2714l4129k5253k358m7126L9139Q8529M0150
$$ -49829 -123628 -102846 -103723 -115832 -43118 -77247 -102500 -104858 -151984 -112845 -24316 15834
16379A5834q068l1847K0722l726N115j6084K0245m9608K8324J2035k6301K414
$$ 15834 7766 -24081 -3359 -7085 -1970 -18054 2191 -47417 -19093 -7058 -33359 -30945
16367c0945K1757k3245K554N7987k7946o5226K0488K3353N8734j2960r740k0770
$$ -30945 -9188 -32433 -29879 28108 162 -65064 -44576 -21223 37511 24551 14811 -5959
16355e959m2859j0979K0659j5286L8118J6939J0915J7777J9766k6365r6886q2819
$$ -5959 -48818 -59797 -39138 -54424 -16306 633 11548 29325 49091 22726 -74160 -156979
16343a56979K5594O3464N877J1454l767J9610L0864j5748j4452l8926L5890J3601
$$ -156979 -131385 -67921 -62044 -50590 -54357 -34747 -3883 -19631 -34083 -73009 -37119 -23518
16331b3518M00K8104M5202P132N9604L6804K745k410r6801o9016P90M6946O945
$$ -23518 -23118 4986 50188 57320 116924 153728 156473 154063 57262 -11754 -10964 35982 42927
16318D2927n345K2575L3573o747J5771m2920N216m1062o7182k2513o983L4554
$$ 42927 37582 60157 93730 86983 102754 59834 65050 23988 -43194 -65707 -72690 -38136
16306c8136K3411J5288n455K9211Q617K4129j8335j2017j7277K1147p195O109
$$ -38136 -14725 563 -4892 24319 32936 57065 38730 26713 9436 30583 23388 29497
16294B9497j9608k0037O6215L2256j30968m2980M0979J5335j6061M1179J322J9519
$$ 29497 9889 -10148 56067 88323 -42645 -85625 -44646 -29311 -45372 -4193 -2871 16648
16282A6648P3641l1548j8958L20j0149Q509k0650J4472Q018m5551j1738L5871
$$ 16648 90289 58741 39783 40103 29954 38463 17813 32285 40303 -5248 -16986 18885
16270A8885M5534l4246l5892J1437j0888J4754o044P225n2652K0168N6958l5315
$$ 18885 64419 30173 -5719 5718 -5170 9584 3540 10765 -41887 -21719 35239 -76
16258g6o258M9901o79j7375K5200j3655r3404L002m9598j7605P296J0499N7671
$$ -76 -6334 43567 42888 25513 50713 37058 -56346 -53344 -102942 -120547 -113251 -102752 -45081
16245d5081O3772l9590N441J7164j8000n8089o4938j7008M5848J470K7962J08232
$$ -45081 18691 -20899 -15458 1706 -16294 -74383 -139321 -156329 -110481 -109011 -81049 27183
16233B7183r459m9240J0276M8368j2396K4258l4443m5212r07P8536o646P977n0443
$$ 27183 17724 -31516 -21240 27128 14732 38990 4547 -40665 -41572 36964 30318 38295 -12148
16220a2148j4231m2862l4051J7169K4962R0317J3459J105m5102P66Q6014M1306
$$ -12148 -26379 -69241 -103292 -86123 -61161 29156 42615 43720 -1382 -616 85398 126704
16208A26704j9435l441j0971l2713j5543n9306p0894j5151n3817L4370R1296K1764
$$ 126704 107269 103828 92857 60144 44601 -14705 -85599 -100750 -154567 -120197 -28901 -7137
16196g137j8156L6955j7959n703n5466k2644k3258o870m2910K9173K3523Q7201
$$ -7137 -25293 11662 -6297 -12000 -67466 -90110 -113368 -120238 -163148 -133975 -110452 -23251
16184b3251N5759L615n2869j3627R5731k3973m3277L9283l933K3554M2933l0303
$$ -23251 32508 36123 -16746 -30373 65358 41385 -1892 37391 33458 57012 99945 69642
16172F9642M15j1250j0171k8107j0123L7151N3351n6064p5816K1348L1034J0090
$$ 69642 70057 58807 48636 20529 10406 47557 100908 44844 -30972 -9624 21410 31500
16160C1500l6936K9948n999m5993L3812K249m3009N854n776K8576M7459l8285
$$ 31500 -5436 24512 18513 -27480 6332 8581 -34428 -28574 -34350 -5774 41685 3400
16148C400m1005K7671m074j7714k3385n8809J0480K2674K081L3857L0236j259
$$ 3400 -37605 -9934 -14008 -31722 -55107 -113916 -103436 -80762 -78681 -44824 -14588 -15847
16136a5847K1837K8592k9739k5216L6664K2639L0355k3663J7921K8472m4569J0569
$$ -15847 5990 34582 4843 -20373 16291 38930 69285 45622 63543 92015 47446 58015
16124E8015R893q3152R461k7147k8965K796J3897P513N034n8362j4726J2759K9427
$$ 58015 67908 -15244 -5783 -32930 -61895 -59099 -45202 -37689 -32655 -91017 -105743 -92984 -63557
16111f3557K281k0490N3848J2373M7794m110j5230n3714o5839l232L0624M0438
$$ -63557 -61276 -81766 -27918 -15545 32249 28139 12909 -40805 -106644 -109876 -79252 -38814
16099c8814L1514K2733N988P6429K9190p6789N96R868Q91p8071j3094l857l3569
$$ -38814 -7300 15433 21421 97850 127040 50251 50847 60715 61606 -16465 -29559 -33416 -66985
16086f6985j6120Q533L6811L5509J9006J0914k993o4595R473l8453k0227K1267
$$ -66985 -83105 -74572 -37761 -2252 16754 27668 24675 -39920 -30447 -68900 -89127 -67860
16074f7860j7619J4490O4525n3108j2931K1856L4881J5891J7701J9977k7980m2023
$$ -67860 -85479 -70989 -6464 -59572 -72503 -50647 -15766 125 17826 37803 9823 -32200
16062c2200o7343K7959k2359K6736M0820K9146P488m5934m5071J0731L1289n0020
$$ -32200 -99543 -71584 -93943 -67207 -26387 2759 10247 -35687 -80758 -70027 -38738 -88758
16050h8758m602k670M4954N1258R501L553r216L4573M737L05n5565o107L5973
$$ -88758 -93360 -96030 -51076 182 9683 13236 4020 38593 43330 43635 -11930 -18037 17936
16037A7936K8623o012l0069k2871j9277L8082O3430j0294k7138n9065j7969j0805
$$ 17936 46559 40547 10478 -12393 -31670 6412 69842 59548 32410 -26655 -44624 -55429
16025e5429M6058J9013R44L9786K509n3612r0684k807l9622J049R2516O0678n67
$$ -55429 -9371 9642 10586 50372 52881 -731 -91415 -94222 -133844 -132795 -40279 20399 19832
16012A9832j1084m2935O422R310O3265K1307p289k6226j7906L8845L9440Q675
$$ 19832 8748 -34187 -27765 -18455 44810 66117 58828 32602 14696 53541 92981 101656
16000A01656j6150L0014l1950k6161l2289o7008J2350K9504m9158M0592O712Q666
$$ 101656 85506 115520 83570 57409 25120 -41888 -29538 -34 -49192 -8600 -1888 6778
15988F778l0215l1033l9787J1122L1897L3607L2821R25p087k5423l893k5076J1842
$$ 6778 -23437 -54470 -94257 -83135 -51238 -17631 15190 16115 9028 -16395 -20288 -45364 -33522
15975c3522N6457n5356n4014M5941M9610K2153q425J5350M8258K7043j4078k4686
$$ -33522 22935 -32421 -86435 -40494 9116 31269 22844 38194 86452 113495 99417 74731
15963G4731K0325J5324k1962J5120L4530q7164q8251k848L3912l869J1360p4102
$$ 74731 95056 110380 88418 103538 138068 50904 -37347 -40195 -6283 -10152 1208 -72894
15951g2894j8591K4206r3049n8306J3682O1477L4620L5R598n672N2280L6498r120
$$ -72894 -91485 -67279 -160328 -218634 -204952 -143475 -108855 -108820 -99222 -104894 -52614 -16116 -25236
15938b5236l4077J204M5666k8243N0188k2963k569l2969J4055P524N9679K0584
$$ -25236 -59313 -58109 -12443 -40686 9502 -13461 -16030 -48999 -34944 -27420 32259 52843
15926E2843O66P019j3534O6774J4808m2179q5869m6458m4801l2376M6178N6807
$$ 52843 53509 60528 46994 113768 128576 86397 528 -45930 -90731 -123107 -76929 -20122
15914b0122j631Q780m661k2366L5252l397K1509j9007K772J6388M6469o5896j912
$$ -20122 -21753 -12973 -17634 -40000 -4748 -8145 13364 -5643 -2871 13517 59986 -5910 -7822
15901g822O8017N6056j4165j865k6527j000Q140L0146n3436j29460l5022K4945
$$ -7822 60195 116251 102086 100221 73694 72694 80834 110980 57544 -71916 -106938 -81993
15889h1993M2024K9604K241r726j1610j6505j7928j0002K0350L1880L8521m8907
$$ -81993 -39969 -10365 -8124 -17850 -29460 -45965 -63893 -73895 -53545 -21665 16856 -32051
15877c2051m4330L4981K9895k0515J3247P872J0507K4095K1670k436k4810J8021
$$ -32051 -76381 -41400 -11505 -32020 -18773 -10901 -394 23701 45371 42935 18125 36146
15865C6146m229m6950k9n883k3740j2137L8458l8874k0789k9609M7375R6738M6575
$$ 36146 31917 -15033 -15062 -20945 -44685 -56822 -18364 -57238 -78027 -107636 -60261 36477 83052
15852H3052L2046n3494q3684K790k6105j0344J16280K1900j0451M132l3256j1374
$$ 83052 115098 61604 -22080 -19290 -45395 -55739 60541 82441 71990 76122 42866 31492
15840C1492k0941J5013k6092m0066L0980L6140l0315M1176j4214n3742m0525J8278
$$ 31492 10551 25564 -528 -40594 -9614 26526 -3789 37387 23173 -30569 -71094 -52816
15828e2816o153N2454J3134R2171K2572k5072p579m6773l5017m4843J2195l5463
$$ -52816 -58969 -6515 6619 98790 121362 96290 88711 41938 6921 -37922 -25727 -61190
15816f1190J4211M4050K9447m748n9101m4844Q471J2604M972q002M1971k713p2227
$$ -61190 -46979 -2929 26518 21770 -37331 -82175 -73704 -61100 -56128 -64130 -22159 -24872 -97099
15803i7099o0460N2396J149N6870M7865l534L0410r824K3951l8243m0671k8382
$$ -97099 -157559 -105163 -104014 -47144 721 -2813 27597 17773 41724 3481 -37190 -65572
15791f5572m344n4K5562J0432j4250P3613N0733K4819o8195k7277L3423k5181
$$ -65572 -69916 -69970 -44408 -33976 -48226 25387 76120 100939 32744 5467 38890 13709
$$ [...]
##END NTUPLES=NMR SPECTRUM
##END=
