##TITLE=Analysis number 319577
Compound Code cc 05914
Project Code adrs
Chemist Name avocado
##JCAMPDX= 6.0         $$ Bruker NMR JCAMP-DX V2.0
##DATA TYPE= NMR SPECTRUM
##DATA CLASS= NTUPLES
##ORIGIN= Bruker BioSpin GmbH
##OWNER= nmr
$$ XWIN-NMR		Version 3.5
$$ Fri May 19 09:54:48 2006 GMT Daylight Time (UT+1h)  MAYBRIDGE\nmr@NMR_250MHZ
##.OBSERVE FREQUENCY= 250.131544655141
##.OBSERVE NUCLEUS= ^1H
##.ACQUISITION MODE= SIMULTANEOUS (DQD)
##.ACQUISITION SCHEME= undefined
##.AVERAGES= 16
##.DIGITISER RES= 18
##SPECTROMETER/DATA SYSTEM= dpx250
##.PULSE SEQUENCE= zg30
##.SOLVENT NAME= DMSO
##.SHIFT REFERENCE= (INTERNAL, DMSO, 0, 16.522)
##AUDIT TRAIL= $$ (NUMBER, WHEN, WHO, WHERE, WHAT)
$$ ##TITLE= Audit trail, XWIN-NMR		Version 3.5
$$ ##JCAMPDX= 5.01
$$ ##ORIGIN= Bruker BioSpin GmbH
$$ ##OWNER= nmr
$$ C:\u/data/dgb/nmr/ADRS/4720/pdata/1/auditp.txt
$$ ##AUDIT TRAIL=  $$ (NUMBER, WHEN, WHO, WHERE, WHAT)
(   1,<2006-05-19 09:54:05.56 +100>,<MAYBRIDGE\nmr>,<NMR_250MHZ>,
      <created by zg, POWCHK disabled, PULCHK disabled
       configuration hash MD5:
       84 BC 41 DB A1 6E 1D 46 DA 25 12 A5 C1 ED C5 3A
       data hash MD5: 64K
       81 0B CC A5 22 01 B6 F0 E0 02 41 FF A7 2B 06 09>)
(   2,<2006-05-19 09:54:24.95 +100>,<MAYBRIDGE\nmr>,<NMR_250MHZ>,
      <Start of raw data processing
       ef LB = 0.3 FT_mod = 6 PKNL = 1 SI = 32K 
       data hash MD5: 32K
       F6 B7 F0 62 14 2F 05 8E 0C CC 2C 21 EA 56 66 04>)
(   3,<2006-05-19 09:54:28.86 +100>,<MAYBRIDGE\nmr>,<NMR_250MHZ>,
      <apk 
       data hash MD5: 32K
       80 0B 0D 24 12 A8 6E D7 4C EE 82 6D 08 32 AB 86>)
(   4,<2006-05-19 09:54:30.26 +100>,<MAYBRIDGE\nmr>,<NMR_250MHZ>,
      <abs ABSG = 5 
       data hash MD5: 32K
       D7 D5 47 E9 5E C7 56 8D EE 93 05 76 A3 BC 16 10>)
$$ ##END=
$$ 
$$ hash MD5
$$ F8 4B E1 CC C9 E2 F2 B0 D9 51 DE D2 B2 CB 36 C6
##$RELAX= 
##$RELAX= 
##$RELAX= 
##$RELAX= 
##$RELAX= 
##$RELAX= 
##$RELAX= 
$$ Bruker specific parameters
$$ --------------------------
##$DU= <C:\u>
##$EXPNO= 4720
##$NAME= <ADRS>
##$PROCNO= 1
##$TYPE= <nmr>
##$USER= <dgb>
##$AMP= (0..31)
100 100 100 100 100 100 100 100 100 100 100 100 100 100 100 100 100 100 
100 100 100 100 100 100 100 100 100 100 100 100 100 100 
##$AQSEQ= 0
##$AQ_mod= 3
##$AUNM= <au_zg>
##$AUTOPOS= <7 >
##$BF1= 250.13
##$BF2= 250.13
##$BF3= 250.13
##$BF4= 250.13
##$BF5= 500.13
##$BF6= 500.13
##$BF7= 500.13
##$BF8= 500.13
##$BYTORDA= 1
##$CFDGTYP= 0
##$CFRGTYP= 5
##$CHEMSTR= <none>
##$CNST= (0..31)
1 1 145 1 1 1 1 1 1 1 1 1 1 1 1 1 1 1 1 1 1 1 1 1 1 1 1 1 1 1 1 1 
##$CPDPRG= <>
##$CPDPRG1= <>
##$CPDPRG2= <>
##$CPDPRG3= <>
##$CPDPRG4= <mlev>
##$CPDPRG5= <mlev>
##$CPDPRG6= <mlev>
##$CPDPRG7= <mlev>
##$CPDPRG8= <mlev>
##$CPDPRGB= <>
##$CPDPRGT= <>
##$D= (0..31)
0 1 0 0 0 0 0 0 0 0.06 0 0 0 0 0 0 0.0002 0 0 0 0 0 0 0 0 0 0 0 0 0 0 
0 
##$DATE= 1148028844
##$DBL= (0..7)
120 120 120 120 120 120 120 120 
##$DBP= (0..7)
150 150 150 150 150 150 150 150 
##$DBP07= 0
##$DBPNAM0= <>
##$DBPNAM1= <>
##$DBPNAM2= <>
##$DBPNAM3= <>
$$ [...]
##$SUBNAM7= <"">
##$SUBNAM8= <"">
##$SUBNAM9= <"">
##$SW= 20.6930455092707
##$SWIBOX= (0..15)
0 0 3 0 0 0 0 0 0 0 0 0 0 0 0 0 
##$SW_h= 5175.983436853
##$TD= 65536
##$TD0= 1
##$TE= 295.16
##$TE2= 300
##$TE3= 300
##$TEG= 300
##$TL= (0..7)
0 120 120 120 120 120 120 120 
##$TP= (0..7)
150 150 150 150 150 150 150 150 
##$TP07= 0
##$TPNAME0= <>
##$TPNAME1= <>
##$TPNAME2= <>
##$TPNAME3= <>
##$TPNAME4= <>
##$TPNAME5= <>
##$TPNAME6= <>
##$TPNAME7= <>
##$TPOAL= (0..7)
0.5 0.5 0.5 0.5 0.5 0.5 0.5 0.5 
##$TPOFFS= (0..7)
0 0 0 0 0 0 0 0 
##$TUNHIN= 0
##$TUNHOUT= 0
##$TUNXOUT= 0
##$USERA1= <user>
##$USERA2= <user>
##$USERA3= <user>
##$USERA4= <user>
##$USERA5= <user>
##$V9= 5
##$VALIST= <valist>
##$VCLIST= <CCCCCCCCCCCCCCC>
##$VD= 0
##$VDLIST= <DDDDDDDDDDDDDDD>
##$VPLIST= <PPPPPPPPPPPPPPP>
##$VTLIST= <TTTTTTTTTTTTTTT>
##$WBST= 1024
##$WBSW= 4
##$XGAIN= (0..3)
0 0 0 0 
##$XL= 0
##$YL= 0
##$YMAX_a= 343593
##$YMIN_a= -582940
##$ZGOPTNS= <>
##$ZL1= 120
##$ZL2= 120
##$ZL3= 120
##$ZL4= 120
##$ABSF1= 16.522
##$ABSF2= -4.171173
##$ABSG= 5
##$ABSL= 3
##$ALPHA= 0
##$AQORDER= 0
##$ASSFAC= 0
##$ASSFACI= 0
##$ASSFACX= 0
##$ASSWID= 0
##$AUNMP= <proc_1d>
##$AZFE= 0.1
##$AZFW= 0.1
##$BCFW= 0
##$BC_mod= 0
##$BYTORDP= 0
##$COROFFS= 0
##$CY= 12.5
##$DATMOD= 1
##$DC= 0
##$DFILT= <>
##$DTYPP= 0
##$F1P= 14.0000005364418
##$F2P= -0.99999901652339
##$FCOR= 0.5
##$FTSIZE= 32768
##$FT_mod= 6
##$GAMMA= 0
##$GB= 0
##$INTBC= 1
##$INTSCL= 1
##$ISEN= 128
##$LB= 0.3
##$LEV0= 0
##$LPBIN= 0
##$MAXI= 10000
##$MC2= 0
##$MEAN= 0
##$ME_mod= 0
##$MI= 0
##$NCOEF= 0
##$NC_proc= -4
##$NLEV= 6
##$NOISF1= 0
##$NOISF2= 0
##$NSP= 0
##$NTH_PI= 0
##$NZP= 0
##$OFFSET= 16.522
##$PC= 1
##$PHC0= 161.4331
##$PHC1= 9.645546
##$PH_mod= 1
##$PKNL= yes
##$PPARMOD= 0
##$PSCAL= 4
##$PSIGN= 0
##$REVERSE= no
##$SF= 250.13
##$SI= 32768
##$SIGF1= 0
##$SIGF2= 0
##$SINO= 400
##$SIOLD= 32768
##$SREGLST= <1H.DMSO>
##$SSB= 0
##$STSI= 32768
##$STSR= 0
##$SW_p= 5175.98343685301
##$SYMM= 0
##$S_DEV= 0
##$TDeff= 65536
##$TDoff= 0
##$TI= <Analysis number 999999
Compound Code 99
Book Reference 9
Project Code 9>
##$TILT= no
##$TM1= 0
##$TM2= 0
##$TOPLEV= 0
##$USERP1= <user>
##$USERP2= <user>
##$USERP3= <user>
##$USERP4= <user>
##$USERP5= <user>
##$WDW= 1
##$XDIM= 32768
##$YMAX_p= 381092964
##$YMIN_p= -343211
$$ End of Bruker specific parameters
$$ ---------------------------------
##NTUPLES= NMR SPECTRUM
##VAR_NAME=  FREQUENCY,     SPECTRUM/REAL,   SPECTRUM/IMAG
##SYMBOL=    X,             R,               I
##VAR_TYPE=  INDEPENDENT,   DEPENDENT,       DEPENDENT
##VAR_FORM=  AFFN,          ASDF,            ASDF
##VAR_DIM=   32768,         32768,           32768
##UNITS=     HZ,            ARBITRARY UNITS, ARBITRARY UNITS
##FACTOR=    0.157963299565203, 1,           1
##FIRST=     4132.6476996994, 0,             0
##LAST=      -1043.33573715361, 0,           0
##MIN=       -1043.33573715361, -343211,     0
##MAX=       4132.6476996994, 381092964,     0
$$ Real data points
##PAGE= N=1
##DATA TABLE= (X++(R..R)), XYDATA
$$ [...]
26325G2400p790J8960j9323L456J9491L6467p4687L2137n2689k9525N9433q636
$$ 72400 64610 83570 64247 67703 87194 123661 48974 81111 28422 -1103 58330 49694
26313D9694K1742k3866m3227p6018j6912J01104N8490P999l6030R565J7439n2030
$$ 49694 71436 47570 4343 -71675 -88587 12517 71007 79006 42976 52541 69980 17950
26301A7950k1887N2931r379r1692K6207L7243J6753j3692p663p879j1648n0980
$$ 17950 -3937 48994 39615 -52077 -25870 11373 28126 14434 6771 -1108 -12756 -63736
26289f3736q1513j31n644k4425M4812K8378L7906m2296K0265J12074J5147q3085
$$ -63736 -145249 -145380 -151024 -175449 -130637 -102259 -64353 -106649 -86384 25690 40837 -42248
26277d2248K4504J38647O0018r0788n6174J7650M3045j0891q7558j5602N7078
$$ -42248 -17744 120903 180921 90133 33959 51609 94654 83763 -3795 -19397 37681
26266C7681N8222O6253r4025o0404M39r994J2367J4385k54k907j2807k9246L2290
$$ 37681 95903 162156 68131 7727 8166 -1828 10539 24924 24670 21763 8956 -20290 12000
26253A2000J4258L3361p1061j3864J13747j3524J4622L6037M2595L3815n0353
$$ 12000 26258 59619 -11442 -25306 88441 74917 89539 125576 168171 201986 151633
26242A51633q0497j6789O6594O388M4389r280l7861l631P273j12145n8915j5579
$$ 151633 71136 54347 120941 127329 171718 162438 124577 120946 128219 16074 -42841 -58420
26230e8420L8985r0081M9913P1754J08336L163j1070o5798l5199M4074P1335l6100
$$ -58420 -19435 -109516 -59603 12151 120487 123650 112580 46782 11583 55657 126992 90892
26218I0892o5199q0000n6747J0471L791K6865r800P912j9738R1545q59o6653J818
$$ 90892 25693 -54307 -111054 -100583 -96792 -69927 -79727 -71815 -91553 -8 -867 -67520 -65702
26205f5702j4549P1551P1702l2399m1207p3103L8789J41020P8342p3771l3272
$$ -65702 -80251 -8700 63002 30603 -10604 -83707 -44918 96102 174444 100673 67401
26194F7401l0634J7073j6116l396Q353K673j5241o0042O5456J6342k7843M419
$$ 67401 36767 53840 37724 34328 42681 45354 30113 -29929 35527 51869 24026 28445
26182B8445m1382M3497O6548r1752p2660L6770O9620J5319m1929J2664M1043o137
$$ 28445 -12937 30560 97108 5356 -67304 -30534 39086 54405 12476 25140 66183 60046
26170F0046m8370M748J9787q1473r165P8156R995q670p550m60K7287J4310Q6567
$$ 60046 11676 16424 36211 -45262 -54427 23729 33724 25054 17504 17044 44331 58641 145208
26157A45208k9907n5567M7092K6157l4453R215n902K3611k5241m8J3366n2947
$$ 145208 115301 59734 106826 132983 98530 107745 101843 125454 100213 100165 113531 60584
26145F0584J8034N6847k5527j6994K5110l3329j12921J7332K9229M0498n7528
$$ 60584 78618 135465 109938 92944 118054 84725 -28196 -10864 18365 58863 1335
26134A335J9403k9547p6505K4600k3246M2883N0417N7698R875O026n6288J6676
$$ 1335 20738 -8809 -85314 -60714 -83960 -41077 9340 67038 76913 82939 26651 43327
26122D3327O4053J8841J0689p9510j9714p0242j4841P6859o5205p2811J9663M6979
$$ 43327 107380 126221 136910 57400 37686 -32556 -47397 29462 -35743 -108554 -88891 -41912
26110d1912L7333k9649j0313K9617O1136L2847l966J1522m6886j45318l6723Q9191
$$ -41912 -4579 -34228 -44541 -14924 46212 79059 75093 86615 39729 -105589 -142312 -53121
26098e3121P2309L557q8688L108J6115R5002L0840m605o4739r9398l6467P2108
$$ -53121 19188 22745 -65943 -62835 -46720 48282 79122 74517 9778 -89620 -126087 -53979
26086e3979N9168L8121L7778k7253p8735m340L1512o726N1124n2215M504N589
$$ -53979 5189 43310 81088 53835 -24900 -29240 2272 -4454 46670 -5545 -1041 4548
26074D548P4308P3558K5216Q62n3870j48218j8615Q8836R0797K1316k8430m9557
$$ 4548 78856 152414 177630 178492 124622 -23596 -42211 46625 137422 158738 130308 80751
26062H0751q5339n2516O193n482q348L6242m392P7359k8480J6749R2695Q717N658
$$ 80751 -4588 -57104 -50911 -56393 -64741 -28499 -32891 44468 15988 32737 125432 134149 139807
26049A39807Q996j6685j3865m256j09129o9689o7192K8218J2419Q3183J29168
$$ 139807 148803 132118 118253 113997 4868 -64821 -132013 -103795 -91376 -8193 120975
26038A20975Q6950O59j9907k7596j11979m9653L4461O6950K677M5874j1804m6034
$$ 120975 207925 208584 188677 161081 49102 -551 33910 100860 103537 149411 137607 91573
26026I1573k7924O2394q351l8204p0444q0095j4169L9678N8411p5401m281n5302
$$ 91573 63649 126043 117692 79488 9044 -71051 -85220 -45542 12869 -62532 -66813 -122115
26014a22115M2687O0653R9180O0534K7566L1573N6380o9608K2975M2362m0814
$$ -122115 -79428 -18775 80405 140939 168505 200078 256458 186850 209825 252187 211373
26003B11373n4418p1759m1808j4407Q678N56J066Q6994M4367l2235m510k4344
$$ 211373 156955 85196 43388 28981 37659 38215 39281 126275 170642 138407 133897 109553
25991A09553k2339l7369k3142j2548o3697K8449J061L2452K733k5020p77J3960
$$ 109553 87214 49845 26703 14155 -49542 -21093 -20032 12420 15153 -9867 -10644 3316
25979C316J18501L3141m6820q0500K9238m1035o5766j0461n2802N12L2848J33088
$$ 3316 121817 154958 108138 27638 56876 15841 -49925 -60386 -113188 -112676 -79828 53260
25967E3260Q5534K1550q5689j930j05987j25592N031n5323M7459Q0951R756j0357
$$ 53260 138794 160344 74655 72725 -33262 -158854 -153823 -209146 -161687 -80736 -70980 -81337
25955h1337P4783J04555m667o4025q0412k7954q927j9892J2967L9744m3321j9504
$$ -81337 -6554 98001 93334 29309 -51103 -79057 -87984 -107876 -94909 -55165 -98486 -117990
25943a17990M9765O6179J4469k227P4386K1942l536N5336r110K9861o9348m6244
$$ -117990 -68225 -2046 12423 10196 84582 106524 102988 158324 149214 179075 109727 63483
25931F3483j71339n3198N582K4150L1072n4891K3931K7304J4144n081J3593K7427
$$ 63483 -107856 -161054 -155472 -131322 -100250 -155141 -131210 -103906 -89762 -94843 -81250 -53823
25919e3823L0828K3529j7655n6039L4320O3287l5034q2489O6385M4716j6141o8942
$$ -53823 -22995 534 -17121 -73160 -38840 24447 -10587 -93076 -26691 18025 1884 -67058
25907f7058j8151m0565M1120P7500J8172k7036M0555L0056K8736n4782q2104J31391
$$ -67058 -85209 -125774 -84654 -7154 11018 -16018 24537 54593 83329 28547 -53557 77834
25895G7834O6655m4211o0646n2685j9615Q6313K5460l5398n1249k875j8354q4264
$$ 77834 144489 100278 39632 -13053 -32668 53645 79105 43707 -7542 -10417 -28771 -113035
25883a13035O9111O8819n7314r43J1403K9632K982k283M1093j1971l7741P733
$$ -113035 -43924 24895 -32419 -33362 -21959 7673 10655 8372 49465 37494 -247 7486
25871G486m917K4256n4117K1494J4828q1357l3452p6397M4646J5044N0299J3843
$$ 7486 2569 26825 -27292 -5798 9030 -72327 -105779 -182176 -137530 -122486 -72187 -58344
25859e8344k0103P5814M2492P298m117p1648j7118Q085L8514M8309J3962M4789
$$ -58344 -78447 -2633 39859 47157 43040 -28608 -45726 -37641 873 49182 63144 107933
25847A07933j5840o2420M7134o0867j28046n2973P0043L7707P3408J3049k5544
$$ 107933 92093 29673 76807 15940 -112106 -165079 -95036 -57329 16079 29128 3584
25836C584q4440j4732O7723N91j8263J4062K6415L3026J4373M5431o912m2057
$$ 3584 -80856 -95588 -27865 -27274 -45537 -31475 -5060 27966 42339 87770 80858 38801
25824C8801j05317J9593k9878l4005J02508P1169k5153p6953O550N3465L8891
$$ 38801 -66516 -46923 -76801 -110806 -8298 62871 37718 -39235 -32685 20780 59671
25813E9671j00957l1164M8432l5061l2038o118L5881j1418o411L0111n0025J8605
$$ 59671 -41286 -72450 -24018 -59079 -91117 -97235 -61354 -72772 -79183 -49072 -99097 -80492
25801h0492M475J551q086j8896P8695Q230m6872K4608K028m6317J9920n578P0239
$$ -80492 -76017 -74466 -82552 -101448 -22753 -14523 -61395 -36787 -34759 -81076 -61156 -66734 3505
25788C505J1189k7118k5725n6599L3153L7479J21300J0628J8529P4l7999M9352
$$ 3505 14694 -12424 -38149 -94748 -61595 -24116 97184 107812 126341 126415 88416 137768
25776A37768p7524o3403M4349N5818M7674j13490j21685k3857L3432J7622K1077
$$ 137768 60244 -3159 41190 97008 144682 31192 -90493 -114350 -80918 -63296 -42219
25765d2219J15660k936k8888K316r3051J5075K7919M9742r0546p6668n8627j0183
$$ -42219 73441 70505 41617 43933 -49118 -34043 -6124 43618 -46928 -123596 -182223 -192406
25753a92406M0397L5473J51423M3119o323n3377k7914O7684O6445r788j9838p2547
$$ -192406 -152009 -116536 34887 78006 71683 18306 -9608 58076 124521 114733 94895 22348
25741B2348o1013O3250P6940j0194l7k1075l1756l3313R850J4603o6035l3446
$$ 22348 -38665 24585 101525 91331 91294 70219 38463 5150 15000 29603 -36432 -69878
25729f9878J24176K5720N8984q8173m7096q0833m6026J8197J7957N8916Q7578
$$ -69878 54298 80018 139002 50829 3733 -77100 -123126 -104929 -86972 -28056 59522
25718E9522P7581k6188m7455M3677o1664k3712J2874n0839l0168j9821L6645J1948
$$ 59522 137103 110915 63460 107137 45473 21761 34635 -16204 -46372 -66193 -29548 -17600
25706a7600j2093k1555K1229J05896j98l955P6170j6892k6233j01692J0450N825
$$ -17600 -29693 -51248 -30019 75877 75679 71724 147894 131002 104769 3077 13527 19352
25694A9352p6111P217M2141l4853m5158k9704L24O6168k952p6941p7409K5312
$$ 19352 -56759 -49542 -7401 -42254 -87412 -117116 -116792 -50624 -53576 -130517 -207926 -182614
25682a82614P5595r679L116O5786q61J7646J29475K5593j8281n8008j33775n9222
$$ -182614 -107019 -116698 -113582 -47796 -48657 -31011 98464 124057 105776 47768 -86007 -145229
25670a45229K281M3737P7739O395p5110l4888L8752R9570q244M515k9978n9965
$$ -145229 -142948 -99211 -21472 -15077 -90187 -125075 -86323 13247 5003 9518 -20460 -80425
25658h0425L2683L7326j1699q7418r0742J047J9586K6579J33246L8735j7147l7402
$$ -80425 -47742 -10416 -22115 -109533 -200275 -199228 -179642 -153063 -19817 18918 1771 -35631
25646c5631L393K9040n6065L6757P1816l5228q6921k0921P3620K9808M3790k4925
$$ -35631 -32238 -3198 -59263 -22506 49310 14082 -72839 -93760 -20140 9668 53458 28533
25634B8533m531l0379R567j4562N0857l7295M3372n388O6284K4299j15008K856
$$ 28533 24002 -6377 3190 -11372 39485 2190 45562 40174 106458 130757 15749 18605
25622A8605O468q4204k8697M1631O23O7001J4650j19129n7149J2683M4958Q3074
$$ 18605 25073 -59131 -87828 -46197 -45574 21427 36077 -83052 -140201 -127518 -82560 514
25610E14M9922P4848k2162o6922j3847o1643p5377m7735P8699J23005o056N4758
$$ 514 50436 125284 103122 36200 22353 -39290 -114667 -162402 -83703 39302 33246 88004
25598H8004P5315j41401m7262J5384M913J5987j8311j9221j2162k1073R0865J02628
$$ 88004 163319 21918 -25344 -9960 -5047 10940 -7371 -26592 -38754 -59827 31038 133666
25586A33666m2158n1597Q436M1998N8322j0465j2003N4012n411m6734n2380p3659
$$ 133666 91508 39911 48347 90345 148667 138202 126199 180211 174800 128066 75686 2027
25574B027K5042j8099o3044k4633m5284o6819q920n1608P4843J2165m1617m1879
$$ 2027 27069 8970 -54074 -78707 -123991 -190810 -199730 -251338 -176495 -164330 -205947 -247826
25562b47826O068L1793R7661P0675J826L4023P1256P613j3359q554M8893j5009
$$ -247826 -241758 -209965 -112304 -41629 -39803 -5780 65476 73089 59730 51176 100069 85060
25550H5060k520r0959p044M2396J46307M8931r9412l6312l9410K0851p9090m1860
$$ 85060 82540 -8419 -15463 26933 173240 222171 122759 86447 47037 67888 -11202 -53062
25538e3062r7653M9603Q9865m5768l3882N0478J2436K5796K309m6206N2836Q9585
$$ -53062 -150715 -101112 -11247 -57015 -90897 -40419 -27983 -2187 122 -46084 6752 96337
25526I6337O1770m5044o4337o8394K6309N3394l5823p4069J878O6098o8134q1324
$$ 96337 158107 113063 48726 -19668 6641 60035 24212 -49857 -47979 18119 -50015 -131339
25514a31339M7314N9783l8573N0950j5082r0327k3800m4304Q6165N1636p291J3212
$$ -131339 -84025 -24242 -62815 -11865 -26947 -117274 -141074 -185378 -99213 -47577 -54868 -41656
25502d1656N1008R101p1289o0462k971R8961O5877k8791j3647l6635N2896K5307
$$ -41656 9352 18453 -52836 -113298 -116269 -17308 48569 19778 6131 -30504 22392 47699
25490D7699P2843J1105l8734j11776j58719M0357Q5824M5383L8264L8460n4974
$$ 47699 120542 131647 92913 -18863 -177582 -137225 -51401 -6018 32246 70706 15732
25479A5732j9644n6705M7919p5284O008Q3238O7835r768n5573J3819J1275J0467
$$ 15732 -3912 -60617 -12698 -87982 -81974 1264 69099 59331 3758 17577 28852 39319
25467C9319j6884N9633K6074j13735r1293m8147J0552p308N8679Q1147M9446Q9436
$$ 39319 22435 82068 108142 -5593 -96886 -145033 -134481 -141789 -83110 -1963 47483 136919
25455A36919L9743j27843l0090K0881O5l3948Q9595Q2478j02167m5329j2024q3008
$$ 136919 176662 48819 18729 39610 39675 5727 95322 177800 75633 30304 18280 -64728
25443f4728l1461K5818k4468o502J4716J095r699j8095J10757M1617K6886N4601
$$ -64728 -96189 -70371 -94839 -101341 -86625 -85530 -95229 -113324 -2567 39050 65936 120537
25431A20537m217N4937n428l2517j0808K1799N863m0358l4018m5500l198J39N2512
$$ 120537 116320 171257 165829 133312 122504 144303 150166 109808 75790 30290 27092 27231 79743
25418G9743L0884r5128j01303M1346Q1675N6171n0216q8666q60K3297K8744j8505
$$ 79743 110627 15499 -85804 -44458 37217 93388 43172 -45494 -46354 -23057 5687 -12818
25406a2818K4995n1930k0689R5844M0964R043j4874m5120J3598k229o1578J9362
$$ -12818 12177 -39753 -60442 35402 76366 85409 70535 25415 39013 36784 -24794 -5432
25394e432M6628o9455R788k000m3993q206j5697N6912l9075M0279K0904m5853
$$ -5432 41196 -28259 -18471 -20471 -64464 -72670 -88367 -31455 -70530 -30251 -9347 -55200
25382e5200l9082L2453l224K1845j9508N5503O7979K0055j5705j5323k7344M609
$$ -55200 -94282 -61829 -65053 -43208 -62716 -7213 60766 80821 65116 49793 22449 27058
25370B7058O637k876o0494p5434l7598m6502P8359P5721O7278K3011j49537k962
$$ 27058 33695 30819 -29675 -105109 -142707 -189209 -110850 -35129 32149 55160 -94377 -97339
25358i7339P1676O0635k175k684k003n7328o8589j536O5979L7710l05j7062K9438
$$ -97339 -25663 34972 32797 30113 28110 -29218 -97807 -99343 -33364 4346 4041 -13021 16417
25345A6417Q8414K7680L043q4036j7233n310O9958o9054j15765k3624p663k7088
$$ 16417 104831 132511 135554 51518 34285 28975 98933 29879 -85886 -109510 -117173 -144261
25333a44261k586M0782J09945q063n3926o2074j6543K4916J62667M8682j2305
$$ -144261 -146847 -106065 3880 -4183 -58109 -120183 -136726 -111810 50857 99539 87234
25322H7234K3343N6344k4963o3550l2943k0469n9284m1015K2995k1004p641P7618
$$ 87234 110577 166921 141958 78408 45465 24996 -34288 -75303 -52308 -73312 -80953 -3335
25310c335J00955J6483l3863k2111L4518l1203p3688q51O7907m570n2350p9421
$$ -3335 97620 114103 80240 58129 92647 61444 -12244 -13095 54812 50242 -2108 -81529
25298h1529L3134K5975l9345o3905j9185K2551M6926L7832M2547M0785J1979j3611
$$ -81529 -48395 -22420 -61765 -125670 -144855 -122304 -75378 -37546 5001 45786 57765 44154
25286D4154n4928p3719L5855L4655m4726k779p592K6659k0474R893q2048R3567
$$ 44154 -10774 -84493 -48638 -13983 -58709 -61488 -69080 -42421 -62895 -53002 -135050 -41483
25274d1483J2665k1405K3075P6492L3045q3057M168K7366j1226n4413J1112N6564
$$ -41483 -28818 -50223 -27148 49344 82389 -668 3500 30866 19640 -34773 -23661 32903
25262C2903M076l7557J4712l4654j2727M4309N9412Q5442o391k7353K4009k3682
$$ 32903 36979 -578 14134 -20520 -33247 11062 70474 155916 149525 122172 146181 122499
25250A22499N3959m4086p6975l7795M2303o5108l7710R6536k9079k5447K450J501
$$ 122499 176458 132372 55397 17602 59905 -5203 -42913 53623 24544 -903 1547 3048
25238C048P489j0378m7105o167R343r77l0645N6730J14090K8248r997k0444o7286
$$ 3048 10537 159 -46946 -53113 -43770 -44747 -75392 -18662 95428 123676 113679 93235 25949
25225B5949l9135R5810j2584l8869m9517r1530p0313P8742J6372J5367j5364Q9256
$$ 25949 -13186 82624 70040 31171 -18346 -109876 -180189 -101447 -85075 -69708 -85072 4184
25213D184Q7506n5005o6692j1835J0988O1921O4261K5517j9601O4452q6756q7098
$$ 4184 91690 36685 -30007 -41842 -30854 31067 95328 120845 101244 165696 78940 -8158
25201h158N8275p180J0620M7827K8090l1012L670M899M6973l450j5857l3195n0949
$$ -8158 50117 42937 53557 101384 129474 98462 102132 107031 154004 150554 134697 101502 50553
25188E0553r5549n3320N9587M7116K096J2655K1182M4989M2035r8145p7138L1309
$$ 50553 -44996 -98316 -38729 8387 10483 23138 44320 89309 131344 33199 -43939 -12630
25176a2630L1138l4788m1270m3407M4221L8021J9145l0276j317n674L3277j8769
$$ -12630 18508 -16280 -57550 -100957 -56736 -18715 430 -29846 -31163 -36837 -3560 -22329
25164b2329k8673M019k4537L3619M5032M6573J6537o0104N657q8074q8241M635
$$ -22329 -51002 -46983 -71520 -37901 7131 53704 70241 10137 15794 -72280 -160521 -155886
25152a55886q876K9215J7089J2468L2143R469N6121J3856J1428K0084o3647o2678
$$ -155886 -164762 -135547 -118458 -105990 -73847 -64378 -8257 5599 17027 37111 -26536 -89214
25140h9214J3204K3079k0126J7626n2790k1820M1496O2351l4030K7689r20p4240
$$ -89214 -76010 -52931 -73057 -55431 -108221 -130041 -88545 -26194 -60224 -32535 -33455 -107695
25128a07695n6461k4642l93J06607R4370K331o9648n3006N2380j5213J10978J29012
$$ -107695 -164156 -188798 -189191 -82584 11786 14117 -55531 -108537 -56157 -71370 39608 168620
25116A68620K0177p0247o772k749o504k2850k2553l7899j11710m7222J4890M6940
$$ 168620 188797 118550 111778 109029 102525 79675 57122 19223 -92487 -139709 -124819 -77879
25104g7879M5301K9942l9399L20N7168l7574j06385n7989J6156O3379M4550O9861
$$ -77879 -32578 -2636 -42035 -41715 15453 -22121 -128506 -186495 -170339 -106960 -62410 7451
25092G451J2789K0253l2809o3451m5786O114O5194O4232K4593n8186J4426M6971
$$ 7451 20240 40493 7684 -55767 -101553 -95439 -30245 33987 58580 394 14820 61791
25080F1791n642r2031q0274l19O0779p7790N0479P2613J5552j3681k2209L4543
$$ 61791 56149 -35882 -116156 -116475 -55696 -133486 -83007 -10394 5158 -8523 -30732 3811
25068C811J3231o783n004M7379m1084j4903l9933K2483j4884Q994l3251N825P9597
$$ 3811 17042 10259 5255 52634 11550 -3353 -43286 -20803 -35687 -26693 -59944 -54119 25478
25055B5478J6399l4284m6320l613R3682R2680K977m9287O737L6920n2429j03760
$$ 25478 41877 7593 -38727 -42340 51342 144022 146999 97712 104449 141369 88940 -14820
25043a4820K8417j5101l2312l808L7247J6874j7596j1820J8554J3716L826o6499
$$ -14820 13597 -1504 -33816 -37624 -377 16497 -1099 -12919 5635 19351 23177 -43322
25031d3322l3442M7460P5213K2460j390o3460l3785R7893k0020j43578j4207m1059
$$ -43322 -76764 -29304 45909 68369 66979 3519 -30266 67627 47607 -95971 -110178 -151237
25019a51237N1842J17209r403k1639l5097M2634N3972l2350p0134m2461N4361
$$ -151237 -99395 17814 8411 -13228 -48325 -5691 48281 15931 -54203 -96664 -42303
25008d2303p450k2907M378j5071K5635J5915K1837r6480P9237P1717K9886m5925
$$ -42303 -49753 -72660 -68282 -83353 -57718 -41803 -19966 -116446 -37209 34508 64394 18469
24996A8469P8385K2301m9881l2665n0745p0679j7225m0893j0872N1392r493o8556
$$ 18469 96854 119155 69274 36609 -14136 -84815 -102040 -142933 -153805 -102413 -111906 -180462
24984a80462L1311l5712P1069J48428J09565O7888q8779p4525l6173l7271m0005
$$ -180462 -149151 -184863 -113794 34634 144199 212087 123308 48783 12610 -24661 -64666
24973f4666O039m2066j0628N9492j9550m0905q525M2284J6608l8160P4226R312
$$ -64666 -58627 -100693 -111321 -51829 -71379 -112284 -120809 -78525 -61917 -100077 -25851 -16539
24961a6539p8831P711M3448J7385M318M0299Q785p9848l3074o311J3235k6502
$$ -16539 -95370 -87659 -44211 -26826 -22508 17791 26576 -53272 -86346 -92657 -79422 -105924
24949a05924K1930J07809P8268N485o2415l6292K044K4808l1667L7869j00451
$$ -105924 -83994 23815 102083 107568 45153 8861 10905 35713 4046 41915 -58536
24938e8536m9994J09606k0352j24833O940O69m1070m4287J3078J24217N6085Q3771
$$ -58536 -108530 1076 -19276 -144109 -137169 -136500 -177570 -221857 -208779 -84562 -28477 55294
24926E5294j3241J4433P0920O7097l410m0176j36681j6352K8124l5198J1818R7605
$$ 55294 42053 56486 127406 194503 191093 150917 14236 -2116 26008 -9190 2628 100233
24914A00233M073n2515K7823p705j05327K6964J40902O3623K8820L5825k7380
$$ 100233 104306 51791 79614 71909 -33418 -6454 134448 198071 226891 262716 235336
24903B35336j43457r9480k7033N4868L5294l6665l3115M4291N8734p9953m5347
$$ 235336 91879 -7601 -34634 20234 55528 18863 -14252 30039 88773 8820 -36527
24892c6527L7323J2144L8307m8463M8730J1137j238n6867m9753m0245Q6982N8987
$$ -36527 796 12940 51247 2784 51514 62651 61413 4546 -45207 -85452 1530 60517
24880F0517l1479k0092N5798j6229j31602k9368J55059K6409j14654l0100J6017
$$ 60517 29038 8946 64744 48515 -83087 -112455 42604 69013 -45641 -75741 -59724
24869e9724j1443L2769K8281k350q6511m7284l232N0142M948L2629P7385j3430
$$ -59724 -71167 -38398 -10117 -12467 -98978 -146262 -149494 -99352 -94404 -61775 15610 2180
24857B180J5879K6715M478k8773l6036P5309k1701N5329K2893l9323l0943K705
$$ 2180 18059 44774 49252 20479 -15557 59752 38051 93380 116273 76950 46007 48712
24845D8712o0310J5928L5187J8044n4147L9041Q3751j5491P943r6132j31070n091
$$ 48712 -11598 4330 39517 57561 3414 42455 126206 110715 118658 22526 -108544 -113635
24833a13635J5126R1727J4272j6807q389N4090K2333L7025P2886j17238r0867
$$ -113635 -98509 -6782 7490 -9317 -17706 36384 58717 95742 168628 51390 -39477
24822c9477k8418J5705M0675n6695l8590m3782J6917P1639j3510k5440R1993l277
$$ -39477 -67895 -52190 -11515 -68210 -106800 -150582 -133665 -62026 -75536 -100976 -8983 -12260
24810a2260J0351K9488j8504k1312K2891l9462P224L9826K6070j8403K8108j6996
$$ -12260 -1909 27579 9075 -12237 10654 -28808 -21584 18242 44312 25909 54017 37021
24798C7021n7468O1199K0181Q765k7167l3862r676q0605q286k0163K5086J6362
$$ 37021 -20447 40752 60933 69698 42531 8669 -1007 -81612 -89898 -110061 -84975 -68613
24786f8613M1260O2107N3479k9175l8326J1825l339p1678k0959L6000n998P2507
$$ -68613 -27353 34754 88233 59058 20732 32557 29218 -42460 -63419 -27419 -33417 39090
24774C9090m9978o3402O3830O988o7843o7941R4887O7778o836p6970J7855M6822
$$ 39090 -10888 -74290 -10460 -3472 -71315 -139256 -44369 23409 16573 -60397 -42542 4280
24762D280j45590q2128m6834Q1678J4094O2788J14421Q6864n7507j24008j26203
$$ 4280 -141310 -223438 -270272 -188594 -174500 -111712 2709 89573 32066 -91942 -218145
24751b18145M6817J04207J1551j30450m2392R3690j48J32296Q3399l3028K5839
$$ -218145 -171328 -67121 -55570 -186020 -228412 -134722 -134870 -2574 80825 47797 73636
24740G3636k022j9509j08393n4421n674l4238j4873N7602m7861p4289M0590J21405
$$ 73636 71614 52105 -56288 -110709 -116383 -150621 -165494 -107892 -155753 -230042 -189452 -68047
24728f8047O6464J5487p634k7789o5069k1j3199m570M488J1192J4745J5552l9170
$$ -68047 -1583 13904 6270 -21519 -86588 -86609 -99808 -104378 -99890 -88698 -73953 -58401 -97571
24715i7571M6052O1606j11346l5460n412L1947M0589O6500J11756m1020q0291
$$ -97571 -51519 10087 -101259 -136719 -142131 -110184 -69595 -3095 108661 67641 -12650
24704a2650m1109M4151K9815m715j8176M5071k0094l659L5202j8608n0126k1221
$$ -12650 -53759 -9608 20207 15492 -2684 42387 22293 18634 53836 35228 -14898 -36119
24692c6119J2750k6246j3530r430O8780L6220p8896n6126N9374M9170m3403m5303
$$ -36119 -23369 -49615 -63145 -72575 -3795 32425 -46471 -102597 -43223 5947 -37456 -82759
24680h2759k5629J30799J54821j04473O3L2342o2255J3062J8845j161r3797L724
$$ -82759 -108388 22411 177232 72759 72822 105164 42909 55971 74816 73655 -20142 -16418
24668a6418l2065J4140J04795N1168k578J9618m2003n248m9738o1032j7311L7129
$$ -16418 -48483 -34343 70452 121620 119042 138660 96657 91409 41671 -19361 -36672 457
24656D57Q4294k441n9827m6173J9155K302K1775J4938m3251j0305M9936J49530
$$ 457 84751 82310 22483 -23690 -4535 -2233 19542 34480 -8771 -19076 30860 180390
24644A80390J9606n9885J1731Q5689r9916j1013M905q2238J4648L2500q5800p1302
$$ 180390 199996 140111 151842 237531 137615 126602 131507 49269 63917 96417 10617 -60685
24632f0685m584K2608R461N9953R197q4430K4140L0976l3811l1252K7285L5968
$$ -60685 -65269 -42661 -33200 26753 35950 -48480 -24340 6636 -27175 -58427 -31142 4826
24620D826K9739m4279o5061P2629N4025o3836k5277N5607L0099o9529m0868j8312
$$ 4826 34565 -9714 -74775 -2146 51879 -11957 -37234 18373 48472 -21057 -61925 -80237
24608h0237l9849R094P1283N8679o0922o184r8923J4383m493K7243R0713J4608
$$ -80237 -120086 -110992 -39709 18970 -41952 -48136 -147059 -132676 -137169 -109926 -19213 -4605
24596d605O5815L5725r9050n4756J3636N670r611O5944p6898n7103J02789J069
$$ -4605 61210 96935 -2115 -56871 -43235 -37565 -47176 18768 -58130 -115233 -12444 -11375
24584a1375o2363Q7545R3687j15593J102L4965m822M9059k5215p337P793K2640
$$ -11375 -73738 13807 107494 -8099 -6997 27968 23146 72205 46990 39653 47446 70086
24572G0086l7010r1309j1315J8631L4776o77P4116N411l0305m9743k6242J6080
$$ 70086 33076 -58233 -69548 -50917 -16141 -16818 57298 62709 32404 -17339 -43581 -27501
24560b7501N734K3258M0590M0642o0014o7167o2080J9144J7466N4352K677l2996
$$ -27501 -21767 1491 42081 82723 22709 -44458 -106538 -87394 -69928 -15576 -12899 -45895
24548d5895k5371J6850L6853l0812K1684O1790Q6761L2695p4920j8929j37426
$$ -45895 -71266 -54416 -17563 -48375 -26691 35099 121860 154555 79635 60706 -76720
24537g6720m0471K9112L6391j469q2688P4137L9592j6573J1709N9821O9315M1519
$$ -76720 -117191 -88079 -51688 -53157 -135845 -61708 -22116 -38689 -26980 32841 102156 143675
24525A43675p3861p6666j08599J4354O0268p672Q5705L9673l2955M1934l993j6378
$$ 143675 69814 -6852 -115451 -101097 -40829 -48501 37204 76877 43922 85856 81863 65485
24513F5485m744r2744o8434R23R6171M3161J0843l1376K0705J9807r6531k7036
$$ 65485 60741 -32003 -100437 -99514 -3343 39818 50661 19285 39990 59797 -36734 -63770
24501f3770Q9259j7963n3418l3875L2915J5935N2210Q3183m800L6943p1091p2807
$$ -63770 25489 7526 -45892 -79767 -46852 -30917 21293 104476 99676 136619 65528 -7279
24489g279R445J1948K7791M1608M7435n0007l5959j2501j5443M7425j2788J1047
$$ -7279 2166 14114 41905 83513 130948 80941 44982 32481 17038 64463 51675 62722
24477F2722n8411k0786K151k650o9631J3753k1308m1928M2033m9632k7277J9761
$$ 62722 4311 -16475 -14324 -16974 -86605 -72852 -94160 -136088 -94055 -143687 -170964 -151203
24465a51203o0983M0933P7904Q2378J21340l9890n0444J7562o94k9624k4136j6471
$$ -151203 -212186 -171253 -93349 -10971 110369 70479 20035 37597 36903 7279 -16857 -33328
24453c3328M9717n1500o1878Q233O8075L0056k6598l3583M9686P2961k1270m0799
$$ -33328 16389 -35111 -96989 -88756 -20681 9375 -17223 -50806 -1120 71841 50571 9772
24441I772j2732P007L1627P7378M7515N7311j0107k7332m7672j05241J7402O436
$$ 9772 -2960 4047 35674 113052 160567 217878 207771 180439 132767 27526 44928 51364
24429E1364k2934K2729p9600n1487j0268J39497K9452o4916K2124j0011l7635
$$ 51364 28430 51159 -28441 -79928 -90196 49301 78753 13837 35961 25950 -11685
24418a1685Q593J5752n9657o0543l2922J20850J3280j3250J21994j2022M8027
$$ -11685 -3092 12660 -46997 -107540 -140462 -19612 -6332 -19582 102412 90390 138417
24407A38417K610n5970o0523L5188l1473r7457k5290l494N0546L6361l0484p1174
$$ 138417 141027 85057 24534 59722 28249 -69208 -94498 -97992 -47446 -11085 -41569 -112743
24395a12743j290R2215M6489M5266p572J3987m5750q909J1889j110M4933R423
$$ -112743 -114033 -21818 24671 69937 62365 76352 30602 21693 33582 32472 77405 86828
24383H6828p10n3846j0780K9004J15489q730o5666k1573l2235l3449j2942n6985
$$ 86828 86118 32272 21492 50496 165985 157255 91589 70016 37781 4332 -8610 -65595
24371f5595O8839K7405n6886j8387L4441O7562J2220q0482n8007j3837L11P7543
$$ -65595 3244 30649 -26237 -44624 -10183 57379 69599 -10883 -68890 -82727 -82416 -4873
24359d873J3362J3167M102P5100l4714o4945M7642k5023Q85J4816o0428q0423
$$ -4873 8489 21656 25758 100858 66144 1199 48841 23818 24703 39519 -20909 -101332
24347a01332M4140N206j932k2354K986J6795O341j6355J6007N2704L2212J2464
$$ -101332 -57192 -51986 -53918 -76272 -73286 -56491 -50150 -66505 -50498 2206 34418 46882
24335D6882l3033l4218j07784l8134P1791L6230K9976N0792l8745o5575o864m4932
$$ 46882 13849 -20369 -128153 -166287 -94496 -58266 -28290 22502 -16243 -81818 -88682 -133614
24323a33614q8766n5413Q0641R7314Q8038O2143k2301n1063r093l1450K306J9235
$$ -133614 -222380 -277793 -197152 -99838 -11800 50343 28042 -23021 -32114 -63564 -61258 -42023
24311d2023j6323j6876J6661K2220j4618l0682Q472O7474Q3316r622n4579J296
$$ -42023 -58346 -75222 -58561 -36341 -50959 -81641 -73169 -5695 77621 67999 13420 14716
24299A4716j1627m5474J2825N710J8636O1418K4305n3595n1727N6657n0918p5477
$$ 14716 3089 -42385 -29560 -23850 -5214 56204 80509 26914 -24813 31844 -19074 -94551
24287i4551J26k8838P8794M7267k1653p0836K3378l6469k491o792N503K876l016
$$ -94551 -94425 -123263 -44469 2798 -18855 -89691 -66313 -102782 -105273 -112065 -106562 -103686 -106702
24274a06702j035M4245L604o778K7809L0625Q2263M6179r722j4902O1013m2085
$$ -106702 -107737 -63492 -59888 -66666 -38857 -8232 74031 120210 110488 95586 156599 114514
24262A14514q1290N6357j0246n3516J1559q4277j6013L4608O86J1658m8182j0167
$$ 114514 33224 89581 79335 25819 37378 -46899 -62912 -28304 -27618 -15960 -64142 -74309
24250g4309L9085L287q7431R6J09468P637m9003m4264j1960K7015K2661P4259
$$ -74309 -35224 -31937 -119368 -119272 -9804 -2167 -51170 -95434 -107394 -80379 -57718 16541
24238A6541k8207o0885Q0574Q1817K1764n8504o0197O9240N4339k1456o4517m6615
$$ 16541 -11666 -72551 8023 89840 111604 53100 -7097 62143 116482 95026 30509 -16106
24226a6106j0370q167p949N6865J03535n5293m5335q730K815K9375k8478m9304
$$ -16106 -26476 -34643 -42592 14273 117808 62515 17180 8450 11265 40640 12162 -37142
24214c7142J3992k9606n3445q62J4621k1625O2239J23178Q9435l0493k7777n0091
$$ -37142 -23150 -52756 -106201 -107063 -92442 -114067 -51828 71350 160785 130292 102515 52424
24202E2424p950K561N4210kk6184l4708N87k2918n0756o8664J02258P4620O7668
$$ 52424 44474 47035 101245 101243 75059 40351 40938 18020 -32736 -101400 858 75478 143146
24189A43146m9712o2279o199N525K540L6125P27j33219r1094K2717O8091K7273
$$ 143146 93434 31155 24956 30481 33021 69146 69873 -63346 -154440 -131723 -63632 -36359
24177c6359Q275J023J0841p414m5980K599L1182J1465J19326Q5855p8403L2392
$$ -36359 -28084 -27061 -16220 -23634 -69614 -67015 -35833 -24368 94958 180813 102410 134802
24165A34802m3872m0356L83j2879q732L0411k9642n3182k9423j37M2170P4374
$$ 134802 90930 50574 50957 38078 29346 59757 30115 -23067 -52490 -52627 -10457 63917
24153F3917K9769m5628k0099r120p00J7577K9109m6867K2525L6261m8752p1289
$$ 63917 93686 48058 27959 18839 18139 35716 64825 17958 40483 76744 27992 -43297
24141d3297j2593K6091M5679J4987n42L9747q789M9828l8672j3710l841q7524
$$ -43297 -55890 -29799 15880 30867 30325 70072 61283 111111 72439 58729 54888 -32636
24129c2636J4566k8991L0842M3969l5817k2934L6699N3310k8860l290k0296M855
$$ -32636 -18070 -47061 -16219 27750 -8067 -31001 5698 59008 30148 26858 6562 11417
24117A1417p4828l3864L4057P2196M2534l274n2630k7012J5648n0524J2707l9938
$$ 11417 -63411 -97275 -63218 8978 51512 48238 -4392 -31404 -15756 -66280 -53573 -93511
24105i3511L8635K6980r873M2043L5355o0152K7723M6238J8277j9467M0540p0556
$$ -93511 -54876 -27896 -37769 4274 39629 -20523 7200 53438 71715 52248 92788 22232
24093B2232p8032N4778N0438j1755O0586K8902p2121m0197N6444p716m9648J9869
$$ 22232 -55800 -1022 49416 37661 98247 127149 55028 14831 71275 63559 13911 33780
24081C3780n687L6613l682n6426o345J07914R1953r2132k4356r6418M002q044
$$ 33780 28093 64706 61024 4598 -1747 106167 198120 105988 81632 -14786 -10784 -18828
24069a8828m2543p9917l7451R3304Q6526J7039n9810l3776q9150R236K786L2584
$$ -18828 -61371 -141288 -178739 -85435 1091 18130 -41680 -75456 -164606 -155370 -152584 -120000
24057a20000L2775J38397L2727J4406j08909j07933r076K2247q1797k8083P9534
$$ -120000 -87225 51172 83899 98305 -10604 -118537 -127613 -105366 -187163 -215246 -135712
24046a35712r883K7061l2930Q4036K7291N828j13314k3683Q3326N6878P85Q1259
$$ -135712 -145595 -118534 -151464 -67428 -40137 -34309 -147623 -171306 -87980 -31102 -30317 50942
24034E0942l8589q6389K3528J3364M0348J816l4151m826Q7101k7295j367M890
$$ 50942 12353 -74036 -50508 -37144 3204 5020 -29131 -33957 53144 25849 24482 29372
24022B9372k0110Q1563L4953l0229Q0128j7718q1685o0205j0823p9327q7344K5555
$$ 29372 9262 90825 125778 95549 175677 157959 76274 16069 5246 -74081 -161425 -135870
24010a35870J9531J8190J32877N3157n1588p2475J3631K6890l0085n5598o6701
$$ -135870 -116339 -98149 34728 87885 36297 -36178 -22547 4343 -25742 -81340 -148041
23999a48041P6427O7691l7764p1152Q3799O9055N0076L3517j23789p2222M3289
$$ -148041 -71614 -3923 -41687 -112839 -29040 40015 90091 123608 -181 -72403 -29114
23988b9114N5586J08844l2760j2104N824n1485j6190R660Q8640k5404p9430M685
$$ -29114 26472 135316 102556 90452 96276 44791 28601 38261 126901 101497 22067 26752
23976B6752j1505k7479q887p038M965L5964Q8067L8570R052l9271r9253m0727
$$ 26752 15247 -12232 -21119 -28157 -23192 12772 100839 139409 148461 109190 9937 -30790
23964c0790o6960l2885l4093L8130K4355L6490L6433l4034J5827m3314k3409J4786
$$ -30790 -97750 -130635 -164728 -126598 -102243 -65753 -29320 -63354 -47527 -90841 -114250 -99464
23952i9464M3777R3348M4036m0618p0692j3886P1989k3261p847Q2174J3880k8344
$$ -99464 -55687 37661 81697 41079 -29613 -43499 28490 5229 -2618 79556 93436 65092
23940F5092L0500Q4767k9449n7188p5105q8747q750J36561M5780l3625k9034J066
$$ 65092 95592 180359 150910 93722 18617 -70130 -78880 57681 103461 69836 40802 41868
23928D1868l5185M345o8526n8382m2765J287N676R6868R4412O6494m2500J6410
$$ 41868 6683 11028 -57498 -115880 -158645 -157358 -151682 -54814 39598 106092 63592 80002
23916H0002L1270l2064M4261l0796p6125m5946n5698P1291K0542k3347P1072q355
$$ 80002 111272 79208 123469 92673 16548 -29398 -85096 -13805 6737 -16610 54462 46107
23904D6107n3009N563M0197k4152l5691p4041j1572O9599j7902p2207M5736j5030
$$ 46107 -6902 -1339 38858 14706 -20985 -95026 -106598 -36999 -54901 -127108 -81372 -96402
23892i6402J7091N8858r888J2482k4576P819N6155l2102n721J4874Q6067R9637
$$ -96402 -79311 -20453 -30341 -17859 -42435 -34616 21539 -10563 -16284 -1410 84657 184294
23880A84294l0698p6843m5470j8731l4550k8718J9965k9031J4381J0470n0344
$$ 184294 153596 76753 31283 12552 -21998 -50716 -30751 -59782 -45401 -34931 -85275
23869h5275k40R2975L8525J2487n5540j23533l1755l3032J1186L8996M4149N5410
$$ -85275 -85515 7460 45985 58472 2932 -120601 -152356 -185388 -174202 -135206 -91057 -35647
23857c5647k3097j2984Q9249L926j26673m759N6346k7978J16027M490m353o4552
$$ -35647 -58744 -71728 17521 21447 -105226 -109985 -53639 -81617 34410 38900 34547 -30005
23845c0005j02736L2446Q6619L8897M9244j1120o714j5128Q09n2382o9727k0169
$$ -30005 -132741 -100295 -13676 25221 74465 63345 56631 41503 42312 -10070 -79797 -99966
23833i9966l3234L0071R2337r324r425J0546M3701j1993J2353o2819l7386K3814
$$ -99966 -133200 -103129 -10792 -20116 -29541 -18995 24706 12713 25066 -37753 -75139 -51325
23821e1325l4201O6306J28040K7865n7840n6696o7168r8491P0261O8090l0242
$$ -51325 -85526 -19220 108820 136685 78845 22149 -45019 -143510 -73249 -5159 -35401
23810c5401L7639p43r4761P346j7970M8500m224o9709o5802M3502N6365R501J1420
$$ -35401 2238 1495 -93266 -85920 -103890 -55390 -59614 -129323 -195125 -151623 -95258 -85757 -74337
23797g4337M2078l3261R8829L54j3186O93m7222l7787N7993J4078j5862j0921
$$ -74337 -32259 -65520 33309 33663 20477 21170 -26052 -63839 -5846 8232 -7630 -18551
23785a8551m1523m1821n928l571M2183O766L4708L0265j9708j1085R60M9021j1903
$$ -18551 -60074 -101895 -107823 -111394 -69211 -62445 -27737 2528 -17180 -28265 -27305 21716 9813
23772I813K2387N6940N6846l2546o5250l0700N7493m3363k4824K3941m174K3026
$$ 9813 32200 89140 145986 113440 48190 17490 74983 31620 6796 30737 26563 49589
23760D9589p9073p9843N829k5623K3704J01506J5973K7066L0915l0998K0947l9768
$$ 49589 -29484 -109327 -103498 -129121 -105417 -3911 12062 39128 70043 39045 59992 20224
23748B0224j07730k4143l296N8322P1135q526p6569k0898P9535n5313K7587K9271
$$ 20224 -87506 -111649 -114945 -56623 14512 5986 -70583 -91481 -11946 -67259 -39672 -10401
23736a0401k565q6387Q1890P1757j9300l7576k8735l1544m006r867l6102K8881
$$ -10401 -12966 -99353 -17463 54294 34994 -2582 -31317 -62861 -66867 -76734 -112836 -83955
23724h3955K5181k3391p0652o643M8188P0512P0545j02383l3916j3124N0651N6215
$$ -83955 -58774 -82165 -152817 -159460 -111272 -40760 29785 -72598 -106514 -119638 -68987 -12772
23712a2772J0714l7265M1923o149k0724N6806N5517n437k8081j8375J10P22Q7997
$$ -12772 -2058 -39323 2600 -3549 -24273 32533 88050 82613 54532 36157 36267 36989 124986
23699A24986n0100j17461r7840l915J9030K8706q0892k4234K9640K9975J7846
$$ 124986 74886 -42575 -140415 -144330 -125300 -96594 -177486 -201720 -172080 -142105 -124259
23688a24259K6401L5014P3210p267J1359k7960k7341M2378N3216O7630j9697l145
$$ -124259 -97858 -62844 10366 3099 14458 -13502 -40843 1535 54751 122381 102684 99539
23676I9539r1407j01285P6356O5184J4469j16813k2988J5306r337M3597R480O0699
$$ 99539 8132 -93153 -16797 48387 62856 -53957 -76945 -61639 -70976 -27379 -17899 42800
23664D2800M6793Q7507q3205j16821J599m1029J270q443r4885p987N7574M1764
$$ 42800 89593 177100 93895 -22926 -21327 -62356 -61086 -69529 -164414 -172401 -114827 -73063
23652g3063O447l9476L7439J40259O7631o1034q8741N6619K9780M949k6058q8971
$$ -73063 -66616 -106092 -68653 71606 139237 78203 -10538 46081 75861 80810 54752 -34219
23640c4219m8638m988J44425R12k6838j13559q817M4531n2273n1607J0210l1741
$$ -34219 -82857 -87845 56580 57492 30654 -82905 -91722 -47191 -99464 -151071 -140861 -172602
23628a72602O5959K4449J9230L1528O1141n4039p489L9724K4861p0928k4277M7309
$$ -172602 -106643 -82194 -62964 -31436 29705 -24334 -31823 7901 32762 -38166 -62443 -15134
23616a5134J2436L2428k1308L4785K3616N8k5150l1793K6862q4122p5111P1736
$$ -15134 -2698 29730 8422 43207 66823 66881 41731 9938 36800 -47322 -122433 -50697
23604e0697J1874r760J2060J20136n2857m0601k0858K7967l0944m3075q070N1131
$$ -50697 -38823 -48583 -36523 83613 30756 -9845 -30703 -2736 -33680 -76755 -84825 -33694
23592c3694O7142L857j729O5907p778K4322L600K1447l3749M2676M4457q1332
$$ -33694 33448 37305 35576 101483 93705 118027 121627 143074 109325 152001 196458 115126
23580A15126O83n000j89572l2039k0274m270M4875J3234q450P66R1376k7129J75
$$ 115126 115809 110809 -78763 -110802 -131076 -135346 -90471 -77237 -85687 -84921 6455 -20674 -20499
23567b0499O0855J8901n06J216l6017k2063M2107k7340n3686m5907K1321P140
$$ -20499 40356 59257 58751 59967 23950 1887 43994 16654 -37032 -82939 -61618 -54478
23555e4478N3776Q7624K1936M4707k1004q2120k6152J7274K4391m8780j0552l8817
$$ -54478 -702 86922 108858 153565 132561 50441 24289 41563 65954 17174 6622 -32195
23543c2195r3458m7121k0929K0782L3362j2618J15456J09292j686l894k7567q2096
$$ -32195 -125653 -172774 -193703 -172921 -139559 -152177 -36721 72571 70885 66991 39424 -42672
23531d2672M0488L190n6304j0235m9795o3639J0743o15J29865R5550O5327j9355
$$ -42672 -2184 1006 -55298 -65533 -115328 -178967 -168224 -168839 -38974 56576 121903 102548
23519A02548m2807J8764j0531j4498q3410o5129o7218M3670Q1961O1654L7343
$$ 102548 59741 78505 67974 53476 -29934 -95063 -162281 -118611 -36650 25004 62347
23508F2347p6290m921N0028L2722n3019L113K5063k8261l4360k1240j262l4201
$$ 62347 -13943 -18864 31164 63886 10867 13980 39043 10782 -23578 -44818 -46080 -80281
23496h0281k3340J5129N900J0111K9831Q9037K0022j2407k6255J0684L9535K4054
$$ -80281 -103621 -88492 -82592 -72481 -42650 46387 66409 54002 27747 38431 77966 102020
23484A02020j765J2880j4783j58137p6241P1218P2051j1184K4810k9203q9881
$$ 102020 100255 113135 98352 -59785 -136026 -64808 7243 -3941 20869 -8334 -98215
23473i8215o8279J86N2641Q1150K4218J6011J624N6557j6596p3874O922P2154
$$ -98215 -166494 -166308 -113667 -32517 -8299 7712 9336 65893 49297 -24577 -17655 54499
23461E4499M8457m7612p9090k1757M397J2527j9856L7589O2595K0746o5928P9436
$$ 54499 102956 55344 -23746 -45503 -41106 -28579 -48435 -10846 51749 72495 6567 86003
23449H6003K3763j654k7643q5001M0806k0651P6411P2969P1453l3159j15517k3985
$$ 86003 109766 108112 80469 -4532 36274 15623 92034 165003 236456 203297 87780 63795
23437F3795j8457L2412m6173J0739l0773P088M5378J2529K9223p1504m7382K6656
$$ 63795 45338 77750 31577 42316 11543 18631 64009 76538 105761 34257 -13125 13531
23425A3531Q894m0260K6156O4114L8092R296j5404k9408j07591j16612l8748j6780
$$ 13531 22425 -17835 8321 72435 110527 119823 104419 75011 -32580 -149192 -187940 -204720
23413b04720N4897N4078L7017K212J24934R9574r1759J6438m7219R349j9035n5109
$$ -204720 -149823 -95745 -58728 -56516 68418 167992 76233 92671 45452 54801 35766 -19343
23401a9343q460J168N1119L5429j8723j02454P68K5945j0174q634L9320K6381
$$ -19343 -27803 -26635 24484 59913 41190 -61264 -60496 -34551 -44725 -53359 -14039 12342
23389A2342N0198j1952p706J5854j2147j5767l5838m5207l4353K3931R9394P69
$$ 12342 62540 50588 42882 58736 46589 30822 -5016 -50223 -84576 -60645 38749 39518
23377C9518l2248j4761j8132K8106N2224o058k7281M139r243l5833k0402j2857
$$ 39518 7270 -7491 -25623 2483 54707 48649 21368 25507 16264 -19569 -39971 -52828
23365e2828O1213L5117o3276n3791l427l7219n131J8521K847J8153K2614R2667
$$ -52828 8385 43502 -19774 -73565 -76992 -114211 -119342 -100821 -97974 -79821 -57207 35460
23353C5460j1800r439J5206n2637k9019M4673K470K5550l6935m2441q295m4635
$$ 35460 23660 14221 29427 -23210 -52229 -7556 -5086 20464 -16471 -58912 -67207 -111842
23341a11842P5026M6132J3532K1060j9352l1829l1821P5309K9977k2227n2912
$$ -111842 -36816 9316 22848 43908 24556 -7273 -39094 36215 66192 43965 -8947
23330h947Q4807L4797m3618j4242K1657O9254q8390j1285R6659m1204p0568J7799
$$ -8947 75860 110657 67039 52797 74454 143708 55318 44033 140692 99488 28920 46719
23318D6719K9526j0163j9961j3008k825r056Q772m9080l2462M6842m4157l3620
$$ 46719 76245 66082 46121 33113 30288 21232 30004 -19076 -51538 -4696 -48853 -82473
23306h2473L4351K0920O8563j5127j2694m0365j6967o7792N478l405R93Q850P4248
$$ -82473 -48122 -27202 41361 26234 13540 -26825 -43792 -111584 -106106 -109511 -108518 -99668 -25420
23293b5420O4700J668M1543l8279K3778k1986K4498N295m0541l3862J9179l5118
$$ -25420 39280 40948 82491 44212 67990 46004 70502 75797 35256 1394 20573 -14545
23281a4545j30835j7957j0431M540P0267K3875n059m2936m043J2140L8940J09313
$$ -14545 -145380 -163337 -173768 -169228 -98961 -75086 -80145 -123081 -127124 -114984 -76044 33269
23269C3269j64N4677M3611l7360j01775n6542O0083k7796q0792n2699M8215Q9918
$$ 33269 33105 87782 131393 94033 -7742 -64284 -4201 -31997 -112789 -165488 -117273 -27355
23257b7355P171j515m0313l2352K4910J46181P5239q4519j28235p099P6885M4436
$$ -27355 -20184 -21699 -62012 -94364 -69454 76727 151966 67447 -60788 -67887 8998 53434
23245E3434p7964k9718J07295n8716k3288J6785M3965r472k5693J9229R713j6867
$$ 53434 -24530 -54248 53047 -5669 -28957 -12172 31793 22321 -3372 15857 25570 8703
23233H703j1192P1822j1692j5049o3771J6616J26765O621j3402j8092k194n408
$$ 8703 -2489 69333 57641 42592 -21179 -4563 122202 128823 115421 97329 95135 89727
23221H9727n9510j39633N887Q5218J1218N0631q601m8038O8313k2816p288r134
$$ 89727 30217 -109416 -103529 -18311 -7093 43538 34937 -13101 55212 32396 25108 15974
23209A5974p3946q8161R824Q0342Q3685k4408m8178K007J3135O4262l7189n5719
$$ 15974 -57972 -146133 -136309 -55967 27718 3310 -44868 -42861 -29726 34536 -2653 -58372
23197e8372O130J46829K0176q6625l8977M85k7068m1606O4638l4602j733m2819
$$ -58372 -52242 94587 114763 28138 -10839 -10354 -37422 -79028 -14390 -48992 -50725 -93544
23185i3544o307K7340O214P8928n2305L9336m5998N5857J09889n1894q2443J0327
$$ -93544 -99851 -72511 -66297 12631 -39674 -338 -46336 9521 119410 67516 -14927 -4600
23173d600O3623P5110j4474m7364q339l750m8983n1094L4743p0615r7935J06555
$$ -4600 59023 134133 119659 72295 63956 60206 11223 -39871 -5128 -75743 -173678 -67123
23161f7123l9296l3829K3130N525q416N652Q1007j1348M5081k5601n8332K4733
$$ -67123 -106419 -140248 -117118 -111593 -120009 -114357 -33350 -44698 383 -25218 -83550 -58817
23149e8817N5872l8788m4030O0086R6561m9586o0198J6986M823N931m1021J9259
$$ -58817 -2945 -41733 -85763 -25677 70884 21298 -38900 -21914 -17091 -11160 -52181 -32922
23137c2922P1153Q7733k8807o4106l173M6575J9060O576k7696m1129J3714j2355
$$ -32922 38231 125964 97157 33051 29878 76453 95513 102089 74393 33264 46978 34623
23125C4623K0481j4375j13373m4763N5174J35942P4090j3744q0313r8162n3673
$$ 34623 55104 40729 -72644 -117407 -62233 73709 147799 134055 53742 -44420 -98093
23114i8093P176k6275J3260Q1256l7647q0355m6621O1193O7923K2581q0904L6652
$$ -98093 -90917 -117192 -103932 -22676 -60323 -140678 -187299 -126106 -58183 -35602 -116506 -79854
23102g9854J09668m8946J0978N279K0079M8640j9373p5397J8186k0543j9497O3318
$$ -79854 29814 -19132 -8154 -2875 17204 65844 46471 -28926 -10740 -31283 -50780 12538
23090A2538N5224K2973r0019p0900j2053P0067K6087O8300K9326K2746l91q4652
$$ 12538 67762 90735 716 -70184 -82237 -12170 13917 82217 111543 134289 133898 49246
23078D9246m5958m823P973j4769M1433j0115R3709O0054p5585m0251l85n8752
$$ 49246 3288 -1535 6438 -8331 33102 22987 116696 176750 101165 60914 60529 1777
23066A777j20730J3165K4493J0984p207j8667l5546q654J2929k8971R3594N0882
$$ 1777 -118953 -105788 -81295 -70311 -77518 -96185 -131731 -140385 -127456 -156427 -62833 -11951
23054a1951o2912j3008O5773M0649m2760N963N1510J4141P1833O2616j39357k6453
$$ -11951 -74863 -87871 -22098 18551 -24209 -18246 33264 47405 119238 181854 42497 16044
23042A6044k2985J6196o3994r3201Q5184L8768P1258K4614r7871j96N6376M5569
$$ 16044 -6941 9255 -54739 -147940 -62756 -23988 47270 71884 -25987 -26183 30193 75762
23030G5762m1193m1910K7820O1087n3699p8315P956N5515N2640j6445K3939L9659
$$ 75762 34569 -7341 20479 81566 27867 -50448 -42492 13023 65663 49218 73157 112816
23018A12816l6088p4900O3017O0260m9883L0025n5553j3318O371n1461j870l9451
$$ 112816 76728 1828 64845 125105 75222 105247 49694 36376 42747 -8714 -10584 -50035
23006e0035k6921J6268j0438J6766l114j8354L8708J13527M4565J430o293o266
$$ -50035 -76956 -60688 -71126 -54360 -57474 -75828 -37120 76407 120972 122402 116109 109843
22994A09843m5508p2297L7920J7890j7273j0682q9752k416m791K2580J2019P8678
$$ 109843 64335 -7962 29958 47848 30575 19893 -69859 -72275 -77066 -54486 -42467 36211
22982C6211J0389N9065J8547q7955k0691j5286L5874p440j2818o0389m6631J31413
$$ 36211 46600 105665 124212 36257 15566 280 36154 28714 15896 -44493 -91124 40289
22970D0289O4052k5270k3267j3508M803P0057m1932l4403j8410m5121j2682j2643
$$ 40289 104341 79071 55804 42296 47099 117156 75224 40821 22411 -22710 -35392 -48035
22958d8035L3053O6172j9535k7004K144K8462m6081N2061M5781j02471k6007k4452
$$ -48035 -14982 51190 31655 4651 6795 35257 -10824 41237 87018 -15453 -41460 -65912
22946f5912P2107K7894p7309j4896J815p706k0181n1863O1392J1474J0339j23182
$$ -65912 6195 34089 -43220 -58116 -56301 -64007 -84188 -136051 -74659 -63185 -52846 -176028
22934a76028n4881Q4804J9024N5278P1363M3547q783j6584L1863K21r1861j548
$$ -176028 -230909 -146105 -127081 -71803 -440 43107 34324 17740 49603 49824 -42037 -43585
22922d3585Q861j9869O685J40308K0172l7381r255L89j7901j04687n3978l0195
$$ -43585 -34724 -54593 -47908 92400 112572 75191 65936 66325 48424 -56263 -110241 -140436
22910a40436J09922M2673q3729N512L5244j6336k4478l945M3700l6536l0451k6872
$$ -140436 -30514 12159 -71570 -66058 -30814 -47150 -71628 -75573 -31873 -68409 -98860 -125732
22898a25732K3160o5619K037Q5478L2531N2620L5124m5190m9679J06243M1770
$$ -125732 -102572 -168191 -166154 -80676 -48145 4475 39599 -5591 -55270 50973 92743
22887I2743k1680m5197o233M8923j23o9163k3686p7839K3534P314N5204M2453
$$ 92743 71063 25866 19633 68556 68433 -730 -24416 -102255 -78721 -71407 -16203 26250
22875B6250P1317N6297j9650r704n3348m5606m9509n695l5979L7197M4289j9397
$$ 26250 97567 153864 134214 124510 71162 25556 -23953 -29648 -65627 -28430 15859 -3538
22863c538j5446N916O6477K2702n3077m0859j6839k3104O3218Q1368n1308j0342
$$ -3538 -18984 -13068 53409 76111 23034 -17825 -34664 -57768 5450 86818 35510 25168
22851B5168l3692J6644K3364J7534m2872l6928q888k2285O2035j3143l7567l6969
$$ 25168 -8524 8120 31484 49018 6146 -30782 -39670 -61955 80 -13063 -50630 -87599
22839h7599m574J4373O2769p2565q4176M7680Q2191K1354o171p0590o4049M3650
$$ -87599 -92173 -77800 -15031 -87596 -171772 -124092 -41901 -20547 -26718 -97308 -161357 -117707
22827a17707Q7142M9529O8310J792p2399j133n0769p5345N5306J168M092m1302
$$ -117707 -30565 18964 87274 89066 16667 15534 -35235 -110580 -55274 -54106 -50014 -91316
22815i1316O838N0097J05050R772l4025L1805O9516l054M530q817p2496o3765
$$ -91316 -84478 -34381 70669 80441 46416 78221 147737 144683 149213 140396 67900 4135
22803D135j8760P1429M6232R139n6886n8325j6310R8239M9422q8588Q820J0845
$$ 4135 -14625 56804 103036 112175 55289 -3036 -19346 78893 128315 39727 48547 59392
22791E9392q1089J043M6922o0628j0221M5850N9937j07753m9384k6074q0031Q6242
$$ 59392 -21697 -20654 26268 -34360 -44581 1269 61206 -46547 -95931 -122005 -202036 -115794
22779a15794Q0797j683n117j6530K6868j3647N285N056k1376o383N6129K4034
$$ -115794 -34997 -36680 -41797 -58327 -31459 -45106 -39821 -34765 -56141 -62524 -6395 17639
22767A7639n4092j62892p0123J45031N9842L0528n2172m529M9015k0102O7146
$$ 17639 -36453 -199345 -269468 -124437 -64595 -34067 -86239 -90768 -41753 -61855 5291
22756E291O1257l8550l3795o636J6883j1304l2706J3082M0338Q784j42832K17
$$ 5291 66548 27998 -5797 -12433 4450 -6854 -39560 -26478 13860 22644 -120188 -119971
22744a19971M4853N6170k744Q477j5524N9214L6248O362J530n4079j9163m507
$$ -119971 -75118 -18948 -21692 -13215 -28739 30475 66723 73085 74615 20536 1373 -3134
22732c134k8958J6047P4199O340J3686j71739q2761M5240J08444N4967m3771j775
$$ -3134 -32092 -16045 58154 64494 78180 -93559 -176320 -131080 -22636 32331 -11440 -13215
22720a3215O057J5933K8986J4624p8412j1971J6182M7809j8479m1067l6160r213
$$ -13215 -7158 8775 37761 52385 -26027 -37998 -21816 25993 7514 -33553 -69713 -78926
22708g8926j0381J04210P4573m8879o06l1554o6386k3966K046j6407J9214Q6661
$$ -78926 -89307 14903 89476 40597 39991 8437 -57949 -81915 -79869 -96276 -77062 9599
22696I599J4059o7038k5922M960L7969n5059k8697L0311l0077j4878j8558M0659
$$ 9599 23658 -43380 -69302 -64342 -26373 -81432 -110129 -79818 -109895 -124773 -143331 -102672
22684a02672J0776O0413n101J9701k8770M7505o8702l824P840K4960j2061J2705
$$ -102672 -91896 -31483 -36584 -16883 -45653 1852 -66850 -70674 -62834 -37874 -49935 -37230
22672c7230R6739Q421P1677J13109P687n5691k6482k2018P717o888j85823j37672
$$ -37230 59509 67930 139607 252716 260403 204712 178230 156212 163929 157041 -28782 -166454
22660a66454o4167L9145Q8335L7811O5656O0278k7032r7149o202R206n9865J6396
$$ -166454 -230621 -191476 -103141 -65330 326 60604 33572 -63577 -69779 -60573 -120438 -104042
22648a04042L9398L677n2082o1779P6607J75007J22975o7800j58336p9857L2904
$$ -104042 -64644 -60967 -113049 -174828 -98221 76786 199761 131961 -26375 -106232 -73328
22637g3328K4907O6178J9794o9153j00434J2269K0775P8213L9140j1892j9330
$$ -73328 -48421 17757 37551 -31602 -132036 -119767 -98992 -20779 18361 6469 -12861
22626a2861k1259m5176k3057j1924K3604m2097L466L2083N9077K3333Q253O9756
$$ -12861 -34120 -79296 -102353 -114277 -90673 -132770 -129304 -97221 -38144 -14811 -6558 63198
22614F3198J4696l204o9029K8358n1357n0364l485N987k9646N6329k5621m0592
$$ 63198 77894 74690 5661 34019 -17338 -67702 -71187 -65200 -94846 -38517 -64138 -104730
22602a04730J0779m6998j2982L670K4070M3730L0420M5919j7714o3930m3198j8937
$$ -104730 -93951 -140949 -153931 -150261 -126191 -82461 -52041 -6122 -23836 -87766 -130964 -149901
22590a49901k5901O671J03862M215n1879j7987p6943L0710R2942Q9819M9832o2123
$$ -149901 -175802 -169131 -65269 -61054 -112933 -130920 -207863 -177153 -84211 5608 55440 -6683
22578f683n7891M36Q457R0063r3302j18604L4879O9440O5837r2368j06324p3905
$$ -6683 -64574 -64138 -55681 34382 -58920 -177524 -142645 -73205 -7368 -99736 -206060 -279965
22566b79965o3246N3933J37014J09575M5466O077m3939L6914n4782k6557K2181
$$ -279965 -343211 -289278 -152264 -42689 2777 8854 -35085 1829 -52953 -79510 -57329
22555e7329l6170j3586P5737M3097J7939k4760j07204r2917R5885O1930q4667
$$ -57329 -93499 -107085 -31348 11749 29688 4928 -102276 -195193 -99308 -37378 -122045
22544a22045m157P9554K2886r8283j0087J08479L8731j5848M2518J5238n2136
$$ -122045 -126202 -46648 -23762 -122045 -132132 -23653 15078 -770 41748 56986 4850
22533D850P729m9422n075R4155J4978p8038P2161K8568o3751m1250n838M392K9206
$$ 4850 12579 -36843 -41918 52237 67215 -10823 61338 89906 26155 -15095 -20933 -16541 12665
22520A2665k9690j5696k0969J7305K6907k7078n3183K4477k498N7415N4779o1048
$$ 12665 -17025 -32721 -53690 -36385 -9478 -36556 -89739 -65262 -67760 -10345 44434 -16614
22508a6614n2253n1193O979P3568j7744J8928l401m549L6820j4101n437J3391
$$ -16614 -68867 -120060 -113081 -39513 -57257 -38329 -41730 -46279 -9459 -23560 -28997 -15606
22496a5606l5208Q8379K8008j3137Q5997l3560j12817p2062j987n166p3050m5969
$$ -15606 -50814 37565 65573 52436 138433 104873 -7944 -80006 -81993 -87159 -160209 -206178
22484b06178R8091K9685L269r8804n7719J12656P0518n9649L4261J13N9000J5934
$$ -206178 -108087 -78402 -75133 -173937 -231656 -119000 -48482 -108131 -73870 -73757 -14757 1177
22472A177N7078K9526q0110p604j5872k4075r1570J8091N9886O8678m9771j20937
$$ 1177 58255 87781 7671 67 -15805 -39880 -131450 -113359 -53473 15205 -34566 -155503
22460a55503n6953N0255K7613J4902M3204J37539J18398l8256j48527K4455k3701
$$ -155503 -212456 -162201 -134588 -119686 -76482 61057 179455 141199 -7328 17127 -6574
22449f574k0572J2786k0899K6051k1282O9880K460m3686n2913J8440N9955M7022
$$ -6574 -27146 -14360 -35259 -9208 -30490 39390 41850 -1836 -54749 -36309 23646 70668
22437G0668K0122q3303n2252p3333p759M1795p8739j5079K2338Q550L5763m5026
$$ 70668 90790 7487 -44765 -118098 -125857 -84062 -162801 -177880 -155542 -146992 -111229 -156255
22425a56255j8464L7020J6400m2253K0131Q2415O9679j07510J8116P8162m453
$$ -156255 -174719 -137699 -121299 -163552 -143421 -61006 8673 -98837 -80721 -2559 -7012
22414g012p2755K6937J8988N4377j7066k2573j3570l418N2020j6266l3297K6453
$$ -7012 -79767 -52830 -33842 20535 3469 -19104 -32674 -36092 15928 -338 -33635 -7182
22402g182J07017N4517j124m1862k9604j799n8172r5297j4524J9059q945M8218
$$ -7182 99835 154352 153228 111366 81762 79963 21791 -73506 -88030 -68971 -77916 -29698
22390b9698P3866M5215L9174k7699J6047J5423p8917l6971o6769O878l463n5459
$$ -29698 44168 89383 128557 100858 116905 132328 53411 16440 -50329 -43451 -46914 -102373
22378a02373O111P7250k5144q646K6566o3120o0447P6776M7491J0381l3185j7133
$$ -102373 -96262 -19012 -44156 -52802 -26236 -89356 -149803 -73027 -25536 -15155 -48340 -65473
22366f5473l9557n0289q35M6369P8039M6627L9292J7200L3492l0069n3237n71
$$ -65473 -105030 -155319 -156154 -109785 -31746 14881 54173 71373 104865 74796 21559 20988
22354B0988K7895M782j6797k1065o8916J5753k1018R7856P5839r1471j01787o122
$$ 20988 48883 53665 36868 15803 -53113 -37360 -58378 39478 115317 23846 -77941 -84063
22342h4063J08638J22807O114q4448n4579j4915K2959k0177k4758k0420J4965
$$ -84063 24575 147382 153496 69048 14469 -446 22513 2336 -22422 -42842 -27877
22331b7877L6244O1417l9979j1160L5418M2128J6768p372j13425o6560n0651J2589
$$ -27877 8367 69784 29805 18645 54063 96191 112959 105587 -7838 -74398 -125049 -112460
22319a12460K3321j0904P9004j2255N9181n582l0063q3963n824Q9019L4581N5595
$$ -112460 -89139 -100043 -21039 -33294 25887 20305 -9758 -93721 -99545 -10526 24055 79650
22307G9650L9638l1023p1956j05619p9468N9333J04484J0303j0681J4990M1986
$$ 79650 119288 88265 16309 -89310 -168778 -109445 -4961 5342 -5339 9651 51637
22296E1637m8599q7856O606M6824l9987L2103N814m8177k0158L1392j8609m6684
$$ 51637 3038 -84818 -78212 -31388 -71375 -39272 -33458 -81635 -101793 -70401 -89010 -135694
22284a35694J0181M3464P3193N5482p4205K6755L9185k6655m7973r7567l9479
$$ -135694 -125513 -82049 -8856 46626 -27579 -824 38361 11706 -36267 -133834 -173313
22273a73313K1759O0868Q8658M1733k148J04837P270N879m087l2014k5316O7420
$$ -173313 -151554 -90686 -2028 39705 37557 142394 149664 155543 151456 119442 94126 161546
22261A61546r6666l2204R0695K2112J1970k7922k8290l4277N1644J1856l3366
$$ 161546 64880 32676 123371 145483 157453 129531 101241 66964 118608 130464 97098
22250I7098q7378k6512M4056J6695r9270k6715K9266p9330R504N4192J4463n2426
$$ 97098 9720 -16792 27264 43959 -55311 -82026 -52760 -132090 -122586 -68394 -53931 -106357
22238a06357l2017P4740L2539Q4798M6460m4397o7120o8814L0262L7761n605k1533
$$ -106357 -138374 -63634 -31095 53703 100163 55766 -11354 -80168 -49906 -12145 -17750 -39283
22226c9283J8035O3004K739m479O760p9250l6640J8237L7058M730o1666m4283
$$ -39283 -21248 41756 44495 40016 46776 -32474 -69114 -50877 -13819 -9089 -70755 -115038
22214a15038K9514O0950L8363j482L23m5668N9555j3765j09385r4939L532P9987
$$ -115038 -85524 -24574 13789 12307 12630 -33038 26517 12752 -96633 -191572 -188040 -108053
22202a08053K2896J9018M7658j9860o737n6671m1528M1805M4941O5511k0041J2575
$$ -108053 -85157 -66139 -18481 -38341 -45078 -101749 -143277 -101472 -56531 8980 -11061 1514
22190A514j0295o944Q8143P7536n2365n5437l5310j3947O0393J688P503j5522
$$ 1514 -8781 -15725 72418 149954 97589 42152 6842 -7105 53288 54976 62479 46957
22178D6957k4050j0708r4424K2543l8382N085j1632k4663P2517p858j6788J01898
$$ 46957 22907 12199 -82225 -59682 -98064 -92979 -104611 -129274 -56757 -64615 -81403 20495
22166B0495J1720m1178k0189M5729K7597P5013J7376q8276j1280j68083j32660
$$ 20495 32215 -8963 -29152 16577 44174 119187 136563 48287 37007 -131076 -263736
22155b63736J01213O4147M7030J034L5889J4830j22334L8744J2826o1139K7396
$$ -263736 -162523 -98376 -51346 -50312 -14423 407 -121927 -83183 -70357 -131496 -104100
22144a04100J4807K5961O735N023J3738n3311o4563J51971n1556j09059n2521
$$ -104100 -89293 -63332 -56597 -51574 -37836 -91147 -155710 -3739 -55295 -164354 -216875
22133b16875M3349J38460L8331o2715m197P0954n0966j26842o2430k3622j4347
$$ -216875 -173526 -35066 3265 -59450 -63647 7307 -43659 -170501 -232931 -256553 -270900
22122b70900J84176J85446O7059p2529j11731K2134P0631l9412m9805Q236N6326
$$ -270900 -86724 98722 165781 93252 -18479 3655 74286 34874 -14931 -6695 49631
22111D9631l5096J1009j2378o0170k7419L6473j1966j5412j13329K153L2336P0414
$$ 49631 14535 25544 13166 -47004 -74423 -37950 -49916 -65328 -178657 -176504 -144168 -73754
22099g3754l8817m09R5036o9922n1620K5790N9331Q067j43822r7418K7945Q4494
$$ -73754 -112571 -112980 -17944 -87866 -139486 -113696 -54365 -46298 -190120 -287538 -259593 -175099
22087a75099O9061M4317l819K5125k3421L2691j655o1105l2537R9507L5339n981
$$ -175099 -106038 -61721 -65540 -40415 -63836 -31145 -32800 -93905 -126442 -26935 8404 2423
22075B423l6010K4130K4264K4924o6922o6671J9053M7855J21129N2635j11251
$$ 2423 -33587 -9457 14807 39731 -27191 -93862 -74809 -26954 94175 146810 35559
22064C5559n1416J6913Q9276P5293K0076r3782r7735m7439r1630l8268R8083M4889
$$ 35559 -15857 1056 90332 165625 185701 91919 -5816 -53255 -144885 -183153 -85070 -40181
22052d0181L7282Q2190r1668r6695k7258m818J5868O4454M7321N7811M3433q8262
$$ -40181 -2899 79291 -12377 -109072 -136330 -141148 -125280 -60826 -13505 44306 87739 -523
22040e23n1821l1510K0795r728J25947N4623l0145l2261n1436p2695L4782N7539
$$ -523 -52344 -83854 -63059 -72787 53160 107783 77638 45377 -6059 -78754 -43972 13567
22028A3567k1809j00332N8688j6857R626J5449j6621M9612k6026q7499l9428L7462
$$ 13567 -8242 -108574 -49886 -66743 -57117 -41668 -58289 -8677 -34703 -122202 -161630 -124168
22016a24168Q4370N2522k1713N4669O395n7336j10132k0132m5310k0277L0465
$$ -124168 -39798 12724 -8989 45680 52075 -5261 -115393 -135525 -180835 -201112 -170647
22005a70647O1574L9472p5677L0626Q8266P634j16640Q130k7698M1824M14p4777
$$ -170647 -109073 -69601 -145278 -114652 -26386 -18752 -135392 -127262 -154960 -113136 -112722 -187499
21993a87499K3974k1231L5764R2868j3476K7800K2360O4421J26681J8778q0833
$$ -187499 -163525 -184756 -148992 -56124 -69600 -41800 -19440 44981 171662 190440 109607
21982A09607n8653n1843k2591l948o2587m1511k5222p62M5724j656N3005K3072
$$ 109607 50954 -889 -23480 -27428 -90015 -131526 -156748 -157510 -111786 -113442 -60437 -37365
21970c7365L0162j6642k304k9071Q943r628N8039l8484N0960M6351n3082O2710
$$ -37365 -7203 -23845 -26149 -55220 -46277 -55905 2134 -36350 14610 60961 7879 70589
21958G0589k0891l2746k9536k4847M0925L4076p1180O8205M4552J3789o6066L4286
$$ 70589 49698 16952 -12584 -37431 3494 37570 -33610 34595 79147 92936 26870 61156
21946F1156j6409l9889j8428M8546m935K0460q4871J3925j1333j0289l038N7873
$$ 61156 44747 4858 -13570 34976 30041 50501 -34370 -20445 -31778 -42067 -45105 12768
21934A2768L8904j5536M9222R427o9824k0591j13950k8206K2026J7900P0244K0333
$$ 12768 51672 36136 85358 94785 24961 4370 -109580 -137786 -115760 -97860 -27616 -7283
21922g283l4364j2335N2332M0209p18L3589j9638n0246L1503L3710j5507p3528
$$ -7283 -41647 -53982 -1650 38559 37841 71430 51792 1546 33049 66759 51252 -22276
21910b2276n2620l773R8058k3167m3592q379N3655l4137M8174m3719J6705Q4415
$$ -22276 -74896 -78669 19389 -3778 -47370 -55749 -2094 -36231 11943 -31776 -15071 69344
21898F9344k3549p9104k3509J48293M5312J6013p7584n3696r8629l02m2501q6037
$$ 69344 45795 -33309 -56818 91475 136787 152800 75216 21520 -77109 -77411 -119912 -205949
21886b05949J9176L8124N3650R2846j04395l9885Q9828J8040M2255l5371N175
$$ -205949 -186773 -148649 -94999 -2153 -106548 -146433 -56605 -38565 3690 -31681 -26506
21875b6506K1202j156k831j3970k8513J1866l4886n8830q2211P0702P3239M6158
$$ -26506 -5304 -6460 -9291 -23261 -51774 -39908 -74794 -133624 -215835 -145133 -71894 -25736
21863b5736M8553p6057l2226M4684P6340K9360r3528n7855l2871p8139K5659K6980
$$ -25736 22817 -53240 -85466 -40782 35558 64918 -28610 -86465 -119336 -197475 -171816 -144836
21851a44836M8083O8678Q665k4753m3232r6920L0267Q1494N6141m7261N614K8160
$$ -144836 -96753 -28075 -19410 -44163 -87395 -184315 -154048 -72554 -16413 -63674 -58060 -29900
21839b9900l1522R080K4306M6688j5835q4014j5673K3363R4645L9236m3844l9803
$$ -29900 -61422 -52342 -28036 18652 2817 -81197 -96870 -73507 21138 60374 16530 -23273
21827b3273j7454K309j7008J7647l6468j3590J5402k5401K0987O9820K9020J2213
$$ -23273 -40727 -38418 -55426 -37779 -74247 -87837 -72435 -97836 -76849 -7029 21991 34204
21815C4204n5912j6093K3927Q0974J13901o5893q1468r6403n137l6435K0191J22603
$$ 34204 -21708 -37801 -13874 67100 181001 115108 33640 -62763 -67900 -104335 -84144 38459
21803C8459j0239P266N9022O333n4861J4038l2823m3247O812M0873J5980K1331
$$ 38459 28220 35486 94508 100841 45980 60018 27195 -16052 -9240 31633 47613 68944
21791F8944M2936r658j18325j27847l3621L5238K2145P956L1768Q0539J4480l6472
$$ 68944 111880 102222 -16103 -143950 -177571 -142333 -120188 -112232 -80464 75 14555 -21917
21779b1917M6803K088K8035Q5081K0826q67L915n874n5099m8355P1943N1337j02864
$$ -21917 24886 26974 55009 140090 160916 160049 163964 158090 102991 54636 126579 177916 75052
21766G5052j27938j3608L7266K5269o857n1190K2668M3736j5178j3870n842K8551
$$ 75052 -52886 -66494 -29228 -3959 -10816 -62006 -39338 4398 -10780 -24650 -30492 -1941
21754a941q4516j20986N6685Q2773P4810j4725l4173j7990k5986r0313M8531K3402
$$ -1941 -86457 -207443 -150758 -67985 6825 -7900 -42073 -60063 -86049 -176362 -127831 -104429
21742a04429q4856O1748N8267K4753m7741l828N6555j7206k3568n224r8368o0440
$$ -104429 -189285 -127537 -69270 -44517 -92258 -96086 -39531 -56737 -80305 -85529 -183897 -244337
21730b44337L7825J11742Q7468K1187J0015o0720q6716l0333O0674J05782n6p7256
$$ -244337 -206512 -94770 -7302 13885 23900 -36820 -123536 -153869 -93195 12587 12531 -64725
21718f4725m1873j1677N8209Q8290L5573M257q200j6440j3170N3530J7102M67
$$ -64725 -106598 -118275 -60066 28224 63797 68054 59854 43414 30244 83774 100876 101343
21706A01343j25211l3230J4450Qj3074m0450K9993K829O7522j2598O49l3713Q8225
$$ 101343 -23868 -57098 -42648 -42640 -55714 -96164 -66171 -63342 4180 -8418 -7769 -41482 46743
21693D6743O7881n6464K9313R74L0517k7614r0866O988n294L4244O3414r086p4104
$$ 46743 114624 58160 87473 88447 118964 91350 484 7472 2178 36422 99836 90750 16646
21680A6646J3294r340j05778k7870N5675N5262m3110J5792L5934m4147q0470o9585
$$ 16646 29940 20600 -85178 -113048 -57373 -2111 -45221 -29429 6505 -37642 -118112 -187697
21668a87697J6257N2933L0190M5905K7435j2461m2662l3477m1653P6803P3986
$$ -187697 -171440 -118507 -88317 -42412 -14977 -27438 -70100 -103577 -145230 -68427 5559
21657E559l0456k1723K5876l2672M0928N1004m9712M3919M298J1174L9563j7083
$$ 5559 -24897 -46620 -20744 -53416 -12488 38516 -11196 32723 37021 48195 87758 70675
21645G0675n2355j4183k9549k2381j0954M4627N5639N9136r0665m1317p5685M8334
$$ 70675 18320 4137 -25412 -47793 -58747 -14120 41519 100655 9990 -31327 -107012 -58678
21633e8678M9944q151k8465O3918O9713l9873m5585N2665M2877n6205q7929l8209
$$ -58678 -8734 -16885 -45350 18568 88281 48408 2823 55488 98365 42160 -45769 -83978
21621h3978K2912M7644L5475k869O346r8754J3796K4829n949J5985O2565Q191
$$ -83978 -61066 -13422 22053 19184 25530 -73224 -59428 -34599 -40548 -24563 38002 46193
21609D6193M5087j4814M5929L0264n8759n8202r7710m2971J4231N2248j7750k7020
$$ 46193 91280 76466 122395 152659 93900 35698 -62012 -104983 -90752 -38504 -56254 -83274
21597h3274J5960O6914j8559k8565r98O5879L3243Q8200j1292q7890m1761k9751
$$ -83274 -67314 -400 -18959 -47524 -48522 17357 50600 138800 127508 39618 -2143 -31894
21585c1894m1786O6488l5618J1962n6909o6241p165L4334J01730J5984J8157n6070
$$ -31894 -73680 -7192 -42810 -30848 -87757 -153998 -161163 -126829 -25099 -9115 9042 -47028
21573d7028r1769p5651J09159J13428O6384R47k3850N4672J4506J4172k8219m8505
$$ -47028 -138797 -214448 -105289 8139 74523 75470 51620 106292 120798 134970 106751 58246
21561E8246o9621m092J8766m339j2171L7153K675J2040P1983o6856o0587L8213
$$ 58246 -11375 -15467 3299 -1040 -13211 23942 26617 38657 110640 43784 -16803 21410
21549B1410K1628K3722P5394j8022j5545N775n8271r7655m0190J8525j3425J09115
$$ 21410 43038 66760 142154 124132 108587 114362 56091 -41564 -81754 -63229 -76654 32461
21537C2461R9507o9030q5724j4303O5608N5765j02631m4009L9153k5557R951j6845
$$ 32461 131968 62938 -22786 -37089 28519 84284 -18347 -62356 -23203 -48760 -38809 -55654
21525e5654k0809J9472Q4882m7118J6064l389q8723k8133p389J9116Q7795M0155
$$ -55654 -76463 -56991 27891 -19227 -3163 -6552 -95275 -123408 -130797 -111681 -23886 16269
21513A6269m8126K0872p7488o5474L892J15846J9343m7916k1673P6856M1166K0838
$$ 16269 -31857 -10985 -88473 -153947 -150055 -34209 -14866 -62782 -84455 -7599 33567 54405
21501E4405P8192L5229m7168q2906O36J7629q029r3820k2984o1894q081k5393
$$ 54405 132597 167826 120658 37752 38388 56017 47988 -45832 -68816 -130710 -138791 -164184
21489a64184l669Q371P0428Q5208r576k9244o8304P4146L2029P1306K3134n1887
$$ -164184 -167853 -159482 -89054 -3846 -13422 -42666 -110970 -36824 -4795 66511 89645 37758
21477C7758k0882k4371m8721n5612j2318N8598M2991J14356k5174Q946N72r512
$$ 37758 16876 -7495 -56216 -111828 -124146 -65548 -22557 91799 66625 75571 76143 66631
21465F6631k9862p003l9016p913M3386J2774j9841L2519k7775o0312k7741N8240
$$ 66631 36769 29766 -9250 -17163 26223 38997 19156 51675 23900 -36412 -64153 -5913
21453e913K9436P5531N5841m0212n0186l3167n7245O6270P266n3880m6765n1781
$$ -5913 23523 99054 154895 114683 64497 31330 -25915 40355 47621 -6259 -53024 -104805
21441a04805K3009k3899n8522M9472P4519j5428k7221L0699k563k8260R3815J4417
$$ -104805 -81796 -105695 -164217 -114745 -40226 -55654 -82875 -52176 -54739 -82999 10816 25233
21429B5233k5101n0043r851N3632O0370k8983n0539m9506n6068K4277J6477L2836
$$ 25233 132 -49911 -59762 -6130 54240 25257 -25282 -74788 -130856 -106579 -90102 -57266
21417e7266Q806M2130J2854k7680k6453l7492j3894L8365M4305m8774q181Q0950
$$ -57266 -48460 -6330 6524 -21156 -47609 -85101 -98995 -60630 -16325 -65099 -73280 7670
21405G670o9021p9835J79M5440Q4486n2479L1153J9129k2679K7050j0473Q8614
$$ 7670 -61351 -141186 -141007 -95567 -11081 -63560 -32407 -13278 -35957 -8907 -19380 69234
21393F9234K4802m9584q9535j4391R7803N2306q7377k6456K5165R0246r372m202
$$ 69234 94036 44452 -45083 -59474 38329 90635 3258 -23198 1967 92213 82841 78639
21381G8639N567j9366j2814N380M4922J9757N3506j4894p5280K3543N8498j0790
$$ 78639 84206 64840 52026 57406 102328 122085 175591 160697 85417 108960 167458 156668
21369A56668J64410J44669m565J00883K19911K49132J70481K51475J98510J82133
$$ 156668 321078 465747 461182 562065 781976 1031108 1201589 1453064 1651574 1833707
21359A833707Q3464j17187k05184k84195l09711j71046j81205j33410q6333r9739
$$ 1833707 1917171 1799984 1594800 1310605 1000894 829848 648643 515233 428900 329161
21349C29161Q80L6834o9254j5033O6633m2202J0287l3399k889k8811j36745o3618
$$ 329161 330041 366875 297621 282588 349221 307019 317306 283907 281018 252207 115462 51844
21337E1844Q9930m7827j3400J4175l331M8828N3159l6506o5293L5014l1037m1462
$$ 51844 141774 93947 80547 94722 91391 140219 193378 156872 91579 126593 95556 54094
21325E4094L3230k9451n1166q947k9580j8705J5287m0134M4288N0872L4894J03477
$$ 54094 87324 57873 6707 -2240 -31820 -50525 -35238 -75372 -31084 19788 54682 158159
21313A58159J5241l0266P5019Q0506k5749j07358j6644q66m3573k1095N0347N7183
$$ 158159 173400 143134 218153 298659 272910 165552 148908 148042 104469 83374 133721 190904
21301A90904o1742p6926k2714J4249q304m3793j8607p279L2855Q781Q6255j1888
$$ 190904 129162 52236 29522 43771 35467 -8326 -26933 -34212 -1357 7424 93679 81791
21289H1791r1324p0539J07770l2353J5062L553K6945M5995M2116l4711j4649j0902
$$ 81791 -9533 -80072 27698 -4655 10407 13960 40905 86900 129016 94305 79656 68754
21277F8754L4629k5670m9090j981M1561M7902j6218j7929L2269m7188j9367J08016
$$ 68754 103383 77713 28623 26642 68203 116105 99887 81958 114227 67039 47672 155688
21265A55688M4411J6278N075j2216n0617p1134n9316k532r5553O250l5676J05204
$$ 155688 200099 216377 221452 209236 158619 87485 28169 25637 -69916 -63666 -99342 5862
21253E862Q8022j430O7719L6159m5506k2959Q79j6427L5697m2883J0825k9149
$$ 5862 93884 92454 160173 196332 150826 127867 128746 112319 148016 105133 115958 86809
21241H6809q6009j6299m293l4964J5035j0836Q7764n2997r0807N5877P3675N9238
$$ 86809 800 -15499 -19792 -54756 -39721 -50557 37207 -15790 -106597 -50720 22955 82193
21229H2193k6067k5714P4108Q301o4324n341o8697j22862N9563N7234K7656M6541
$$ 82193 56126 30412 104520 112821 48497 43156 -25541 -148403 -88840 -31606 -3950 42591
21217D2591j5727L191L1621n760n4482r585K7975K077r943J9013j9258L1718N4285
$$ 42591 26864 30055 61676 55916 1434 -8151 19824 21901 11958 30971 11713 43431 97716
21204I7716P3059J10917n923M0192P6195q5239l9352o1442j7514j49579p2732
$$ 97716 170775 281692 275769 315961 392156 306917 267565 206123 188609 39030 -33702
21193c3702j9049j8463k0414O610J06800Q758k463n330m755N89k7215J6935l70
$$ -33702 -52751 -71214 -91628 -85018 21782 30540 28077 22747 17992 18581 -8634 8301 7931
21180G931j9495j7824n4158J04694R0165J4208k512l0149l2520n2002k4113J6847
$$ 7931 -11564 -29388 -83546 21148 111313 125521 123009 92860 60340 8338 -15775 1072
21168A072n3969K1222k3803k490N609L7850L9559q573n3292m1703L8316N7045
$$ 1072 -52897 -31675 -55478 -57968 -52359 -14509 25050 16477 -36815 -78518 -40202 16843
21156A6843l4295J4755M4029J8954l9562j9880m3804J36703N3090k2585L0846
$$ 16843 -17452 -2697 41332 60286 20724 844 -42960 93743 146833 124248 155094
21145A55094J49K777n7009j2050K4503k5660n3448J9261M4810m5773r0112K5000
$$ 155094 155243 158020 101011 88961 113464 87804 34356 53617 98427 52654 -37458 -12458
21133a2458l7022L2227Q2561k9811M9632K0000m2487o3828n81L597j7821O1049
$$ -12458 -49480 -17253 65308 35497 85129 105129 62642 -1186 -1767 1830 -15991 45058
21121D5058R456p4139j02735P1490J0902n4556K1198L3495K9166L8298k6892M5886
$$ 45058 54514 -19625 -122360 -50870 -39968 -94524 -73326 -39831 -10665 27633 741 46627
21109D6627L9140j3576J15457k8453L2258J1838J5797n3244k6213n0088n2760
$$ 46627 85767 72191 187648 159195 191453 203291 219088 165844 139631 89543 36783
21098C6783j5508J16022M0328N19p9745m3430N834L5689l993k9160J238K834r8704
$$ 36783 21275 137297 177625 178144 98399 54969 60803 96492 92499 63339 64577 67411 -31293
21085c1293j0192M2663K3669M5511O5997K4609n3259n1961o191J3381m0418m6553
$$ -31293 -41485 1178 24847 70358 136355 160964 107705 55744 49553 62934 22516 -24037
21073b4037m12J5121P1137N8920L89p3675n7077M5864m8633K3432L3671N6391
$$ -24037 -24449 -9328 61809 120729 121118 47443 -9634 36230 -12403 11029 44700 101091
21061A01091l6914n6838n6715o2274n701O2004N6243J5464q009k0427J8938N4193
$$ 101091 64177 7339 -49376 -111650 -117351 -55347 896 16360 8351 -12076 6862 61055
21049F1055J3724j9456j0716O158l97m0773n0656R810J5603M828N497J313R541
$$ 61055 74779 55323 44607 50765 50368 9595 -41061 -31251 -15648 -10820 -5323 -4010 5531
21036E531N6890m9397l1583Q189k2142L9735K4544J3284O3541l2190k5744M0717
$$ 5531 62421 13024 -18559 -10370 -32512 7223 31767 45051 108592 76402 50658 91375
21024I1375O6927K7389r2552m2383L7881Q464Q0389L0616q1726k9718k9246k0711
$$ 91375 158302 185691 93139 50756 88637 97101 177490 208106 126380 96662 67416 46705
21012D6705l0871m0429M941O6883P4483N4894l8034k0618j27457j7128M8527K7354
$$ 46705 15834 -24595 -19654 47229 121712 176606 138572 117954 -9503 -26631 21896 49250
21000D9250p3292n6248J9435O6101J9921K0736J6970J05769J08140l5849r4174
$$ 49250 -24042 -80290 -60855 5246 25167 45903 62873 168642 276782 240933 146759
20989A46759j4195K0064p1979m1017M1362j1557m3690P6229k8839M802k8517K5533
$$ 146759 132564 152628 80649 39632 80994 69437 25747 101976 73137 77939 49422 74955
20977G4955K0256m3591q0605M16L3484r351O3993J7024K6436P7549K069J2493
$$ 74955 95211 51620 -28985 -28569 4915 -4436 59557 76581 103017 180566 182635 195128
20965A95128l9148n7418j05267J2428R2971o518l1474K1291o4359j00587M2173
$$ 195128 155980 98562 -6705 5723 98694 92176 60702 81993 17634 -82953 -40780
20954d0780J00972l4667q5890N016P6616k4248m3710O0155K9001J3044J02849
$$ -40780 60192 25525 -60365 -55349 21267 -2981 -46691 13464 42465 55509 158358
20943A58358o294O3662M4498J8453O0942M9468p5450m1820J614o7718L8669M5272
$$ 158358 152064 215726 260224 278677 339619 389087 313637 271817 273431 205713 244382 289654
20931B89654p5220o8089k2402K7862m371L190M8792m0113k1362M6702K4268P8715
$$ 289654 214434 146345 123943 151805 147434 150624 199416 159303 137941 184643 208911 287626
20919B87626J1674q6436j08201j6812K9853J8126N6279M9200l2519O7981L257
$$ 287626 299300 212864 104663 87851 117704 135830 192109 241309 208790 276771 280028
20908B80028o3581j9422K2297j34715j6788K1798N7089J15232j06773l2236J9667
$$ 280028 216447 197025 219322 84607 67819 89617 146706 261938 155165 122929 142596
20897A42596n9728N3495n4077q5332J9980N2820Q9788O6043L8969m8850J862P0401
$$ 142596 82868 136363 82286 -3046 16934 69754 159542 225585 264554 215704 217566 287967
20885B87967k1475p3689K3545k5614P170J845o6228K8822N2700o3074n5412N1959
$$ 287967 266492 192803 216348 190734 197904 199749 133521 162343 215043 151969 96557 148516
20873A48516K5952L6012K9008L8460m4405Q413n8651j541L2903j20185J11466
$$ 148516 174468 210480 239488 277948 233543 241956 183305 181764 214667 94482 205948
20862B05948P4339j0871j01910J2017N8323k2988j36423k8032N9312o921j0626
$$ 205948 280287 269416 167506 179523 237846 214858 78435 50403 109715 102794 92168
20851I2168j3143N1358M1465j5160l7244M1703K7496l2372M2225J00025k6023
$$ 92168 79025 130383 171848 156688 119444 161147 188643 156271 198496 298521 272498
20840B72498O048L4681J2905J0946l0734K0165N6380l960q0169n7632n69n6886
$$ 272498 278546 313227 326132 337078 306344 326509 382889 378929 298760 241128 240559 183673
20828A83673N8194R4493j00350o8580o926N7220k120M7881j4832M590k2614p4760
$$ 183673 241867 336360 236010 167430 160504 217724 215604 263485 248653 253243 230629 155869
20816A55869o695L9816O83J9585K4140O5275M0848L738K7903k2451n0369k5576
$$ 155869 149174 188990 189673 209258 233398 298673 339521 343259 371162 348711 298342 272766
20804B72766R340J4629j1360J8122O4087N1124n5742p2600Q4785K9397q6036M7135
$$ 272766 282106 296735 285375 303497 367584 418708 362966 290366 375151 404548 318512 365647
20792C65647N0687n5528k9369K5833O7461L550n0138r6630m2578O7941M1688J7174
$$ 365647 416334 360806 331437 357270 424731 428281 378143 281513 238935 306876 348564 365738
20780C65738K6052J9434M4693O1595K9216k1439M517O8645j577o6139N253J1990
$$ 365738 391790 411224 455917 517512 546728 525289 529806 598451 596874 530735 535988 547978
20768E47978K5933L4081L8071N4359Q48j17058l4872M7282P9819l8666j4031J03992
$$ 547978 573911 607992 646063 700422 701270 584212 549340 596622 676441 637775 623744 727736
20756G27736J08054k3805p4123J00742K9662O9640k2592j24806j08272M8139P8888
$$ 727736 835790 811985 737862 838604 868266 937906 915314 790508 682236 730375 809263
20745H09263O0588P1664R1658k4928L2420J41616R9052J08908K43289K51775K95727
$$ 809263 869851 941515 1033173 1008245 1040665 1182281 1281333 1390241 1633530 1885305 2181032
20734B181032L72045L29082K43078J88048n105l75524m96090l05348j62095p7167
$$ 2181032 2553077 2882159 3125237 3313285 3308180 2932656 2436566 2131218 1969123 1891956
20724A891956O193J2214R7808K20533J97869J16274J38339J28263K18874J36003
$$ 1891956 1898149 1910363 2008171 2228704 2426573 2542847 2681186 2809449 3028323 3164326
20714C164326n7937j56017K6874K50326L13691K72649L55108M02406M58125N20339
$$ 3164326 3106389 2950372 2977246 3227572 3541263 3813912 4169020 4571426 5029551 5549890
20704E549890N79323O78152Q34711R65172J075778J338187J729991K359833L049750
$$ 5549890 6129213 6807365 7642076 8607248 9683026 11021213 12751204 15111037 18160787
20695A8160787M146072N835608Q247883J2585600K0441181L3709180N1413025
$$ 18160787 22306859 28142467 36390350 48975950 69417131 103126311 154539336
20688A54539336O3043871N5841871L8727321L2838467L1699151M402947m9994455
$$ 154539336 217583207 273425078 312152399 344990866 376690017 381092964 331098509
20681C31098509q6692595p8479142n0043325k8179071j6481977j0478061p434898
$$ 331098509 244405914 165926772 115883447 87704376 71222399 60744338 53309440
20674E3309440n687670m519026l741481l014155k470527k071223j808674j703188
$$ 53309440 47621770 43102744 39361263 36347108 33876581 31805358 29996684 28293496
20666B8293496j555975j359878j196018j109806j000142q38922q18203q47435
$$ 28293496 26737521 25377643 24181625 23071819 22071677 21232755 20414552 19567117
20658A9567117p15496o46621o34860o06380n34730m35932m63326m48805l49693
$$ 19567117 18851621 18205000 17570140 16963760 16429030 15993098 15529772 15080967 14731274
20649A4731274l63324l94643l85119n55688m80697m19216k85374k21058K6498
$$ 14731274 14367950 13973307 13588188 13032500 12551803 12132587 11847213 11626155 11652653
20640A1652653K5206j69166j49742j02640n062k48278o67726p04962n15207m14043
$$ 11652653 11677859 11508693 11358951 11256311 11251249 11002971 10335245 9630283 9115076 8701033
20630H701033l24895l32762l03274l51533k48047j67467j35603j71409j17548
$$ 8701033 8376138 8043376 7740102 7388569 7140522 6973055 6837452 6666043 6548495
20621F548495j24385k12144k61776j88101j05648j57134j37208j26232j67924
$$ 6548495 6424110 6211966 5950190 5762089 5656441 5499307 5362099 5235867 5067943
20612E067943p6489j15547r5402j40685j48147n9954n3683j14485j89627j64090
$$ 5067943 4991454 4875907 4780505 4639820 4491673 4431719 4378036 4263551 4073924 3909834
20602C909834j60081r4019j01518j4405o7112o3051j7521q7292j01594j58103
$$ 3909834 3749753 3655734 3554216 3539811 3472699 3409648 3392127 3304835 3203241 3045138
20592C045138n037j9956q0312n2278l778l1847o2180n1866j38874r3051j61359
$$ 3045138 3040101 3020145 2939833 2887555 2883777 2851930 2789750 2737884 2599010 2505959 2344600
20581B344600j31080Q59m4690p1573k153k3167l1737o7049l9274q0405j8880j07943
$$ 2344600 2213520 2214379 2169689 2098116 2095963 2072796 2041059 1974010 1934736 1854331 1835451 1727508
20569A727508O22p0231p8931r191J3194k831K639L5259O5813m9609j44352j2695
$$ 1727508 1728130 1657899 1578968 1569777 1582971 1580140 1582779 1618038 1683851 1634242 1489890 1477195
20557A477195J28024N6982N440n8850j30707j66800n9518l5673j11749r0464O5239
$$ 1477195 1605219 1662201 1667641 1608791 1478084 1311284 1251766 1216093 1104344 1013880 1079119
20546A079119L8316L7196r0910l3092j55608l0043L4153K484J3202P0595P3533
$$ 1079119 1117435 1154631 1063721 1030629 875021 844978 879131 881615 894817 965412 1038945
20535A038945j0366m5017j5463q8151j19611J979N4959l0968j4771j05018j520
$$ 1038945 1028579 983562 968099 879948 760337 762316 817275 786307 771536 666518 664998
20524F64998K4572K2664L4685J5935l4910n3994o649K6546N703j1826p0632o1779
$$ 664998 689570 712234 746919 762854 727944 673950 667301 693847 699550 687724 617092 555313
20512E55313P91M939o5406l5114L5827M6799K7472M0280j7442o7183q5559k2203
$$ 555313 556104 561043 495637 460523 496350 543149 570621 610901 593459 526276 440717 418514
20500D18514k1570N6672O3447j5061r8359o7512K1253O4276n5826K7329j6582
$$ 418514 396944 453616 517063 502002 403643 336131 357384 421660 365834 393163 376581
20489C76581p2538n9044l8547k4173K1346k0461r7882j7593R9159N2378j4326
$$ 376581 304043 244999 206452 182279 203625 183164 85282 67689 166848 219226 204900
20478B04900k9970q4585l9846K6986O7850R18q2899o829j6082Q2697J28851p5594
$$ 204900 174930 90345 50499 77485 145335 146253 63354 56525 40443 123140 251991 176397
20466A76397o6443O5351O0644p1873j03207r724L7973M8283J3289j0177q9283
$$ 176397 109954 175305 235949 164076 60869 51145 89118 137401 150690 140513 51230
20455E1230k3812o6867K6022N555L8657O9321N1082o25j20548j3953L0380O1620
$$ 51230 27418 -39449 -13427 -7872 30785 100106 151188 150563 30015 16062 46442 108062
20443A08062K6130n0461l5853j668M043j22936m4207P7498J31800N701Q4214J5411
$$ 108062 134192 83731 47878 46210 50253 -72683 -116890 -39392 92408 98109 182323 197734
20431A97734n0495p5683l4325l1385K5300K4874n764r612k142N0224N0640l915
$$ 197734 147239 71556 37231 5846 31146 56020 50256 40644 38502 88726 139366 135451
20419A35451J3662L825m4698q2258K0693p0329J5750J42122j293r0637L4804P5663
$$ 135451 149113 152938 108240 25982 46675 -23654 -7904 134218 132925 42288 77092 152755
20407A52755m9005j91290k606M9446j7415J0526M7022N6890m6002m5209l2713
$$ 152755 103750 -87540 -90146 -40700 -58115 -47589 -567 56323 10321 -34888 -67601
20396f7601J9439L5409O9980l2016n4009n582P8227J3724J23j7421J19619n6272
$$ -67601 -48162 -12753 57227 25211 -28798 -34380 43847 57571 57694 40273 159892 103620
20384A03620n0665n4522l4594R952K7230k0135m4558N8599K5425p7531k1108J10959
$$ 103620 52955 -1567 -36161 -26209 1021 -19114 -63672 -5073 20352 -57179 -78287 32672
20372C2672j9135l0041j3242j18k3478p1314J0572L0487l454m4906J2637J10566
$$ 32672 13537 -16504 -29746 -29864 -53342 -124656 -114084 -83597 -87051 -131957 -119320 -8754
20360h754J1620m5013K4623K5412m3862J6824L7661p0152r2982K5215K3121m1172
$$ -8754 2866 -42147 -17524 7888 -35974 -19150 18511 -51641 -144623 -119408 -96287 -137459
20348a37459J9251J2720K4758o153N5055J5418n6624M3095J798m7690q637l2232
$$ -137459 -118208 -105488 -80730 -86883 -31828 -16410 -73034 -29939 -28141 -75831 -84468 -116700
20336a16700K4986P6472K9752p2303L918p3375m4935N18L0669j0514K9973l0052
$$ -116700 -91714 -15242 14510 -57793 -53875 -127250 -172185 -171667 -140998 -151512 -121539 -151591
20324a51591j5333J12754O2066J2849n66N8293J0780k8407l7217o5500M1947J6725
$$ -151591 -166924 -54170 7896 20745 20179 78472 89252 60845 23628 -41872 75 16800
20312A6800K478J14232j5444j13755m3399k2181l4325J03749L4113K7345J3393
$$ 16800 19278 133510 118066 4311 -39088 -61269 -95594 8155 42268 69613 83006
20301H3006l0207L256j34091l2541l707L1174J02555N8128L0681j7063l6380L836
$$ 83006 52799 56055 -78036 -110577 -114284 -83110 19445 77573 108254 91191 54811 58647
20289E8647m4612k5702K513P7080J7154p3935m1538m1041M089m4772P7789J17865
$$ 58647 14035 -11667 -9154 67926 85080 11145 -30393 -71434 -67345 -112117 -34328 83537
20277H3537Q3470r1433j60599r2326m4531O9749J02248o5204j24587O8319J33970
$$ 83537 167007 75574 -85025 -177351 -221882 -152133 -49885 -115089 -239676 -171357 -37387
20266c7387j9509l0519r738j5064L5196J523p0012N2927L2032N3273K799j3943
$$ -37387 -56896 -87415 -97153 -112217 -77021 -75498 -145510 -92583 -60551 -7278 -4479 -18422
20254a8422N2887M9147n9957n4053L3052j7125L0160L0424P238K1410o0346n9871
$$ -18422 34465 83612 23655 -30398 2654 -14471 15689 46113 53351 74761 14415 -45456
20242d5456o5947O2236O2738j6587J0209j5074o9034L766k070J9775n4546P364
$$ -45456 -111403 -49167 13571 -3016 7193 -7881 -76915 -73149 -75219 -55444 -109990 -102626
20230a02626O885J5369O662k1780r420K1357j7874o6279n2136L1395P7570j81
$$ -102626 -95741 -80372 -73710 -95490 -104910 -83553 -101427 -167706 -219842 -188447 -110877 -111058
20218a11058R2150N1700o168k8221k5963M8817k57n7834j7654O758n8661l7550
$$ -111058 -18908 32792 26624 -1597 -27560 21257 21000 -36834 -54488 -47730 -106391 -143941
20206a43941P964M7894K2962m0011J1274m0216k0997P2799L7348K8334O8884K5918
$$ -143941 -135977 -88083 -65121 -105132 -93858 -134074 -155071 -82272 -44924 -16590 52294 78212
20194G8212R147o9060J2551j0754p9254Q979P8320O166m4317j0069p8268k6339
$$ 78212 87359 18299 30850 20096 -59158 -50179 28141 34307 -10010 -20079 -98347 -124686
20182a24686N0289N3922K4210o9738q100N1859J7292J6325l6102Q156m6727q6224
$$ -124686 -74397 -20475 3735 -66003 -74103 -22244 -4952 11373 -24729 -16573 -63300 -149524
20170a49524o2417J3796J5418L546N9886L4868j6512R756K6336K0759P320p938
$$ -149524 -211941 -198145 -182727 -179181 -119295 -84427 -100939 -91183 -64847 -44088 -36768 -44706
20158d4706j25362j7727K9530L8272Q5813R1560o1590j07237n9095J6490M0638
$$ -44706 -170068 -187795 -158265 -119993 -34180 57380 -4210 -111447 -170542 -154052 -113414
20147a13414K6202N2639m1627l2165Q9113j1994l030J9230q6244n043P0741k8516
$$ -113414 -87212 -34573 -76200 -108365 -19252 -31246 -34276 -15046 -101290 -106333 -35592 -64108
20135f4108q5805j2945j9284K6905J8690l0744M5450P0992M0651L2160N6097K5216
$$ -64108 -149913 -162858 -182142 -155237 -136547 -167291 -121841 -50849 -10198 21962 78059 103275
20123A03275M4442n7686o7030m9761l1258k8842q1397m5982K9304N4678N5536
$$ 103275 147717 90031 23001 -26760 -58018 -86860 -168257 -214239 -184935 -130257 -74721
20112g4721L699O2833p0175k9263J8244k9918j1684q017R3828P8711j2047k2134
$$ -74721 -71022 -8189 -78364 -107627 -89383 -119301 -130985 -139002 -45174 33537 21490 -644
20100f44o709P6061O5825q7738p8330o7739l2147Q8993N4214k905o5576N9264
$$ -644 -7353 68708 134533 46795 -31535 -99274 -131421 -42428 11786 8881 -56695 2569
20088B569J13907k4617j11644o0128P574o236M011N2697p2737j153k0117J9665
$$ 2569 116476 91859 -19785 -79913 -72339 -78575 -74564 -21867 -94604 -95757 -115874 -96209
20076i6209M8852M4984L7700J2121r0602M5311J3264q1883K5307m8559q9482j9222
$$ -96209 -47357 -2373 35327 47448 -43154 2157 15421 -66462 -41155 -89714 -179196 -198418
20064a98418M2708O4671M6871K5852j9794k8478k1652M6841L6522m8109n9084
$$ -198418 -155710 -91039 -44168 -18316 -38110 -66588 -88240 -41399 -4877 -52986 -112070
20053a12070J1763J11721K3558m0273o7971J18181K9102k6453N7926M9099k882
$$ -112070 -100307 11414 34972 -5301 -73272 44909 74011 47558 105484 154583 151701
20042A51701p7314k5538j8390n370M2589o0402J3280n3379r9829n1587J6654O7951
$$ 151701 74387 48849 30459 25089 67678 7276 20556 -32823 -132652 -184239 -167585 -99634
20030i9634m132j5268J21922K933r9247m6998M464J4879K1005N7292L5973M1973
$$ -99634 -103766 -119034 2888 5821 -93426 -140424 -135960 -121081 -100076 -42784 -6811 35162
20018C5162L2309k82j7909l3813K3562O1610J9451j0567Q4485J24558R2619J07943
$$ 35162 67471 67189 49280 15467 39029 100639 120090 109523 194008 318566 411185 519128
20006E19128J91911K36541L26006K63086J03702M3288R8046p016j99197k38481
$$ 519128 711039 947580 1273586 1536672 1640374 1683662 1781708 1774692 1575495 1337014
19996A337014k97132l42758k05379j36388j21926m3714j2961p5689m77M6015N5119
$$ 1337014 1039882 697124 491745 355357 233431 189717 176756 101067 100590 146605 201724
19985B01724j4948o8212j00710l026P0691J45877p964p4184l7420m1836N850Q0103
$$ 201724 186776 118564 17854 14828 85519 231396 223432 149248 111828 69992 75842 155945
19973A55945o377K5922J6002l5276r2602q0523J06569L2283o0273k0724l9516
$$ 155945 149568 175490 191492 156216 63614 -16909 89660 121943 61670 40946 1430
19962A430K4295k0591M8842l327J7316r8998l2517L8680O411J8466n3574l4614
$$ 1430 25725 5134 53976 50649 67965 -31033 -63550 -24870 -18459 7 -53567 -88181
19950h8181K0760j8428N2590J2581K7319O0207P7696p017o8131j45725j4863k1935
$$ -88181 -67421 -85849 -33259 -20678 6641 66848 144544 137527 69396 -76329 -91192 -113127
19938a13127K2194m2573J0113P184N259j8671n9650j766J28873O2634P2461k7376
$$ -113127 -90933 -133506 -123393 -116209 -110950 -129621 -189271 -191037 -62164 470 72931 45555
19926D5555r2762p508j7197R6652M7650o0851q6961J7379P1733L5524J562k4471
$$ 45555 -47207 -54715 -71912 24740 72390 11539 -75422 -58043 13690 49214 50776 26305
19914B6305j31454o3129J68M9888L3649k3902L1875L4272J05203J4689J8571N9492
$$ 26305 -105149 -168278 -168110 -118222 -84573 -108475 -76600 -42328 62875 77564 96135 155627
19902A55627r3302n9352o5854Q804m9610N6105L3419n7142n5289K6743P5606L2862
$$ 155627 62325 2973 -62881 -54077 -103687 -47582 -14163 -71305 -126594 -99851 -24245 8617
19890H617k3610k8701L6102p6099p7619p6492M4042M829J0236K7806N5977L721
$$ 8617 -14993 -43694 -7592 -83691 -161310 -237802 -193760 -188931 -178695 -150889 -94912 -91191
19878i1191L8350P0821L8840j4300K818k031k744q73r0015k8653K8068n389K030
$$ -91191 -52841 17980 56820 42520 45338 43307 40563 39690 -50325 -78978 -50910 -56299 -54269
19865e4269R4057O111l6964j9502j4483O597K239m056n1484M2508R9847L5089
$$ -54269 39788 45899 8935 -10567 -25050 -18453 -16214 -20270 -71754 -29246 70601 105690
19853A05690n6107o0166J925O064o0959o9636l9172N0310R2042K8290q866l6982
$$ 105690 49583 -10583 -8658 -2594 -63553 -133189 -172361 -122051 -30009 -1719 -10585 -47567
19841d7567j2519J2554q1064R2739j8031o7494M7289Q2628L028j17028m9578J719
$$ -47567 -60086 -47532 -128596 -35857 -53888 -121382 -74093 8535 11563 -105465 -155043 -153324
19829a53324M3096R8016j561q8896K211j6756L2030o6532j7858J06864k4581j18353
$$ -153324 -110228 -12212 -13773 -102669 -100458 -117214 -85184 -151716 -169574 -62710 -87291 -205644
19817b05644J2163P6232P6985j695l2824l0661Q3688J26155M1981o1050m1885
$$ -205644 -193481 -117249 -40264 -41959 -74783 -105444 -21756 104399 146380 85330 43445
19806D3445k338N394M177K5225L6178R248j19111l2492L7229o4734O2519M3496
$$ 43445 41107 46501 50678 75903 112081 121329 2218 -30274 6955 -57779 4740 48236
19794D8236o0581K6239j2402n1365p6449M5924O4507P8141n5190l8942m2762J347
$$ 48236 -12345 13894 1492 -49873 -126322 -80398 -15891 62250 7060 -31882 -74644 -73297
19782g3297l0667L6413P4716m0351m6615K8305l4360n746L9440O2632j0771j21627
$$ -73297 -103964 -67551 7165 -33186 -79801 -51496 -85856 -91602 -52162 10470 -301 -121928
19770a21928j02367L3059j3465K8726J16896J21969p215J1761k2788n1097k4621
$$ -121928 -224295 -191236 -204701 -175975 -59079 62890 55675 67436 44648 -6449 -31070
19759c1070j0434M778m0499n5828R1283N5157j6783l347m6623o3672M1270N9406
$$ -31070 -41504 -36726 -77225 -133053 -41770 13387 -3396 -6743 -53366 -117038 -75768 -16362
19747a6362J0654j17804j483P7742M0601J14982R011p2772m7198j2740L664l3161
$$ -16362 -5708 -123512 -124995 -47253 -6652 108330 117341 44569 -2629 -15369 -11705 -44866
19735d4866n2002l7057K0050J141n775K4107J5195L6561R0073J08856R2402N390
$$ -44866 -96868 -133925 -113875 -112734 -118509 -94402 -79207 -42646 47427 156283 248685 254075
19723B54075J4155o6015m6693J08605p0103j32377j97394m4330o298n0474r900
$$ 254075 268230 202215 155522 264127 194024 61647 -135747 -180077 -186375 -236849 -246749
19712b46749R4779M5384K6041o1174n4672N3311J00905k0731j8637N1921K4710
$$ -246749 -151970 -106586 -80545 -141719 -196391 -143080 -42175 -62906 -81543 -29622 -4912
19701d912L3653K9436n735k5945m020o0051m9889p8584j0697J1809R7983M4493
$$ -4912 28741 58177 52442 26497 22477 -37574 -87463 -166047 -176744 -164935 -66952 -22459
19689b2459J5002k496q623p079L8214k6541m5307k0333n5597N530J05563Q1423
$$ -22459 -7457 -9953 -18576 -25655 12559 -13982 -59289 -79622 -135219 -129689 -24126 57297
19677E7297M6299n5648J3125K8913K339J5219Q8187P7349R7290l7109p7746M4109
$$ 57297 103596 47948 61073 89986 92325 107544 195731 273080 370370 333261 255515 299624
19665B99624N8038l3999j0009j16634j64931q2922K2910k9005m6254o878p832
$$ 299624 357662 323663 313654 197020 32089 -50833 -27923 -56928 -103182 -110060 -117892
19654a17892M0991K302J413L133k4548L3144m6225K8867M5722R475r202M9732
$$ -117892 -76901 -74599 -73186 -70053 -94601 -61457 -107682 -78815 -33093 -23618 -32820 16912
19642A6912r788r2929j18016n6401N628P6463M9278O8919J08408P1511p664o1213
$$ 16912 7124 -85805 -203821 -260222 -254594 -178131 -128853 -59934 48474 119985 112321 51108
19630E1108J5659k5020p0389l882k9601P8100O8524m2991R345m3261L2983J961
$$ 51108 66767 41747 -28642 -32524 -62125 15975 84499 41508 50853 7592 40575 42536
19618D2536K994K0756p4119k4479k9409n799N783L1300O7371O191J0934r6379
$$ 42536 45530 66286 -7833 -32312 -61721 -67520 -61737 -30437 36934 43125 54059 -42320
19606d2320M6326L6413J0469j01082R850k4968K6367N5003M274j6456M0707k4129
$$ -42320 4006 40419 50888 -50194 -40344 -65312 -38945 16058 20332 3876 44583 20454
19594B0454J6411O5253J01456P264n8444p0633o3074O1766k8698j2788k6236k7948
$$ 20454 36865 102118 203574 210838 152394 81761 18687 80453 51755 38967 12731 -15217
19582a5217j9006k8411Q3093N2538j4619o7127l7912L1508N1656n2939l7511l6726
$$ -15217 -34223 -62634 20459 72997 58378 -8749 -46661 -15153 36503 -16436 -53947 -90673
19570i0673q0039J1949l7775M6805O4243R3261j6549o4231K4852L9941k5371o988
$$ -90673 -170712 -158763 -196538 -149733 -85490 7771 -8778 -73009 -48157 -8216 -33587 -40575
19558d0575o9846J017M3100L3942m994L4513O519J1963j5479l6637M0976R6655
$$ -40575 -110421 -109404 -66304 -32362 -37356 -2843 3676 15639 160 -36477 4499 101154
19546A01154q5523r7748q379M3934O8284M9147K5821n9935j9161m3608J3035O4275
$$ 101154 15631 -82117 -90496 -46562 21722 70869 96690 36755 17594 -26014 -12979 51296
19534E1296L6250l5752R4352m3465r0628j8173n3837M1529r311j5691L1086K0827
$$ 51296 87546 51794 146146 102681 12053 -6120 -59957 -18428 -27739 -43430 -12344 8483
19522H483j9453o3134o0230m8183N688M7315R1581M7026o2727p0958J2953j2225
$$ 8483 -10970 -74104 -134334 -182517 -176829 -129514 -37933 9093 -53634 -124592 -111639 -123864
19510a23864k1506M7197L1130m1954J2059M6691Q3738J7528l8923k3834k6136
$$ -123864 -145370 -98173 -67043 -108997 -96938 -50247 33491 51019 12096 -11738 -37874
19499c7874K932m180O631n3410P8278O9021m720m366l9753L1152L3137m3475L3633
$$ -37874 -34942 -39122 -32491 -85901 -7623 61398 56678 52312 12559 43711 76848 33373 67006
19486F7006O3308p6868k7623N394k9995j8338L0046P1533M9888k0338Q028q706
$$ 67006 130314 53446 25823 31217 1222 -17116 12930 84463 134351 114013 122041 113335
19474A13335K1626Q5566q0971l5513o4923m1539l1506N3262j4197n7677O5461
$$ 113335 134961 220527 139556 104043 39120 -2419 -33925 19337 5140 -52537 12924
19463A2924L1427P767L796K9398Q933k1004m3255k0902J5435N661j2459m5291
$$ 12924 44351 52118 55914 85312 94245 73241 29986 9084 24519 30180 17721 -27570
19451b7570j3257j02192L176Q0904L3493K2469m1878P1201P8222J7860o0490n0187
$$ -27570 -40827 -143019 -139843 -58939 -25446 -2977 -44855 26346 104568 122428 61938 11751
19439A1751o7928L1030J8995q382o986m1180k1999P7770P3243l0218m6442j3356
$$ 11751 -56177 -25147 -6152 -14534 -21520 -62700 -84699 -6929 66314 36096 -10346 -23702
19427b3702j8Q4555M57k2175m480j02349j9467K8657L4000l1315j6490P0859R7490
$$ -23702 -23720 60835 61292 39117 34637 -67712 -87179 -58522 -24522 -55837 -72327 -1468 96022
19414I6022p755j6535k8135k3631L402j9636J6645l331L0726q727k9552L1975
$$ 96022 88267 71732 43597 19966 23368 3732 20377 17046 47772 39045 9493 41468
19402D1468N5463Q8802M4554j22006p8399L959k4491M9222o515q1759k5360J8097
$$ 41468 96931 185733 230287 108281 29882 33841 9350 58572 52057 -29702 -55062 -36965
19390c6965J2292N5727Q0672l545o3740N6008l3168k7757K277L1300Q8754N6941
$$ -36965 -24673 31054 111726 108181 44441 100449 67281 39524 41801 73101 161855 218796
19378B18796P9455J0399Q7141J32416L6652J41476M1337O1568L456m8082Q9599
$$ 218796 298251 308650 395791 528207 564859 706335 747672 809240 812696 764614 854213
19367H54213J7755o7580k07045j40893j00728q7516q8837r4549n3454L2919Q0710
$$ 854213 871968 804388 597343 456450 355722 268206 179369 84820 31366 64285 144995
19356A44995n2221J8469Q4631R5618Q242j07491r7175J7998J1576J6917l1601
$$ 144995 92774 111243 195874 291492 299734 192243 95068 113066 124642 141559 109958
19345A09958n0598p1581K420k0095O193l5117L6580j2781Q350k3217N7154P9120
$$ 109958 59360 -12221 -9801 -29896 -23703 -58820 -22240 -35021 -26671 -49888 7266 86386
19333H6386N8535l1045o7424M2558o149l8146N8279J07083L2335o5791o979J29961
$$ 86386 144921 113876 46452 89010 82861 44715 102994 210077 242412 176621 169642 299603
19321B99603J58567J10407Q1587J44152O0578P2162J64868m4492K0983n6980k04505
$$ 299603 458170 568577 650164 794316 854894 927056 1091924 1047432 1068415 1011435 806930
19310H06930j89309p9100k9406k1547j34549p3670J1323K8687j01106Q171K2682
$$ 806930 617621 538521 509115 487568 353019 279349 290672 319359 218253 226424 249106
19299B49106N4353k3105r5057k04n7559K4692J4524l105R262K3795Q392k7340
$$ 249106 303459 280354 185297 185093 127534 152226 166750 163645 172907 196702 205094 177754
19287A77754M8706J3321q5965o8180k8120J14306R9929j06490j10799j26378k9861
$$ 177754 226460 239781 153816 85636 57516 171822 271751 165261 54462 -71916 -101777
19276a01777n3341l5138J51416J56750j4067j9712J1774j2234r4810o2323J26860
$$ -101777 -155118 -190256 -38840 117910 103843 84131 95905 83671 -11139 -73462 53398
19265E3398P6450q3379M4920J9343p9012q9628k377P0545j1552r219M5202n3188
$$ 53398 129848 46469 91389 110732 31720 -57908 -60285 10260 -1292 -10511 34691 -18497
19253a8497j10887L1365P9774J4764q7163N9202L5136M3135J5614r2815J4471
$$ -18497 -129384 -98019 -18245 -3481 -90644 -31442 3694 46829 62443 -30372 -15901
19242a5901M4271O3895k7013r6498l1841J2353K126O9737J04285R2721N8644p6867
$$ -15901 28370 92265 65252 -31246 -63087 -50734 -48608 21129 125414 218135 276779 199912
19230A99912j00142q298k1422k5228q5816J795J1446n380J8627J4015P329k9535
$$ 199912 99770 91472 70050 44822 -40994 -39199 -27753 -33133 -14506 -491 6838 -22697
19218b2697k5422P3373K8107p5930k8390l3957j6728P3831M5395O910L0839K0408
$$ -22697 -48119 25254 53361 -22569 -50959 -84916 -101644 -27813 17582 24492 55331 75739
19206G5739o5614m0930r6741j8046R8929k1191p6840p120K8588M4613J13250m1621
$$ 75739 10125 -30805 -127546 -145592 -46663 -67854 -144694 -151814 -123226 -78613 34637 -6984
19194f984o809o90P2700O9955j9915o9100j0537k4152M2835P5759O2982r3810
$$ -6984 -13793 -14483 58217 128172 108257 39157 28620 4468 47303 123062 186044 92234
19182I2234n2567J583N362K3469J1288J691o4151l4928n405J01897J1495r1024
$$ 92234 39667 41250 46612 70081 81369 83060 18909 -16019 -21424 80473 91968 944
19170I44j9270O7667l1456M9246M392j014Q0998M3452l9543j10614k8938j735
$$ 944 -18326 49341 17885 67131 71523 70509 151507 194959 155416 44802 15864 14129
19158A4129l6826P6881r98K9882N5145k3742k654L611p7365n3557r9530j3008
$$ 14129 -22697 54184 53186 83068 138213 114471 111817 115428 38063 -15494 -115024 -128032
19146a28032M5665R2382K5004K6722M5746j4651n1330j5062L5521m5749Q7863
$$ -128032 -82367 10015 35019 61741 107487 92836 41506 26444 61965 16216 104079
19135A04079j9384p7661n8876L2784O3219l6064L0575N5760M5263P7297M5054
$$ 104079 84695 7034 -51842 -19058 44161 8097 38672 94432 139695 216992 262046
19124B62046p435r05j25174l9700K1454Q3483O4929j2305o11K619j05544O905
$$ 262046 254611 253706 128532 88832 110286 193769 258698 246393 245782 248401 142857 149762
19112A49762O9131K4805m7178m337p935k2843Q4749m6927j6341j4043j4391P2741
$$ 149762 218893 243698 196520 192183 184248 161405 246154 199227 182886 168843 154452 227193
19100B27193k4568j23734p974N8325l5218N0493o1070q0748o4794j2774L9043
$$ 227193 202625 78891 70917 129242 94024 144517 83447 2699 -62095 -74869 -35826
19089c5826r1M778J14667O3549N460p9967j9656r66n710Q3825k96j4722O6027
$$ -35826 -35917 -31139 83528 147077 152537 72570 52914 51948 46238 130063 129767 115045 181072
19076A81072K4556l4633k4794q3520K276K1206K6687k8120k0759J7714L5955p458
$$ 181072 205628 170995 146201 62681 64957 86163 112850 84730 63971 81685 117640 110182
19064A10182N7071O6337j3777m1329l8108l9136k7352O5853J2891m6463j9615
$$ 110182 167253 233590 219813 178484 140376 101240 73888 139741 152632 106169 86554
19053H6554j227M2575o1768L9664N2061k8816J6819N5180l8503m6081N1402p8629
$$ 86554 85327 127902 66134 105798 157859 129043 145862 201042 162539 116458 167860 89231
19041H9231j7882J44213K8120r7051K2247K2782k3910K3539L79q072n0404o5693
$$ 89231 71349 215562 243682 146631 168878 191660 167750 191289 191668 183596 133192 67499
19029F7499K317J5915P7737J2068r0968n0168K8275J6862P9147J08548M0060o4674
$$ 67499 69816 85731 163468 175536 84568 34400 62675 79537 158684 267232 307292 242618
19017B42618j4980O1331O4232n5891l9666m5546L636L0883n489j6182k6183J0057
$$ 242618 227638 288969 353201 297310 257644 212098 215734 246617 241128 224946 198763 208820
19005B08820j5067n811N1400k8174j4170O168M7874N1185k0287r6092m0513M6569
$$ 208820 193753 187942 239342 211168 196998 203166 251040 302225 281938 185846 145333 191902
18993A91902K2439l4742j7576M2980M9950k0312l1626k4020q334O47J6956Q5934
$$ 191902 214341 179599 162023 205003 254953 234641 203015 178995 170661 171308 188264 274198
18981B74198Q329p5999o4524N522k1840K799J5809L2035j6108N9234O8090L5682
$$ 274198 282527 206528 142004 147526 125686 128485 144294 176329 160221 219455 287545 323227
18969C23227L3143j7650n4603P253K7917O1602N2623m4533p6571l0570l7317n228
$$ 323227 356370 338720 284117 291370 319287 380889 433512 388979 312408 281838 244521 239293
18957B39293L1920m5965Q5556J4625j1634M8824J62946Q7770k0445n2467q1804
$$ 239293 271213 225248 310804 325429 313795 362619 525565 613335 592890 540423 458619
18946D58619j04897J2360R4382K27L376l0341K1811K8793J1835l8904q8565j9335
$$ 458619 353722 366082 460464 460691 464067 433726 455537 484330 496165 457261 368696 349361
18934C49361L7063K6063k3584l26O9430J19439J3414j31662n4456M3336N722M5709
$$ 349361 386424 412487 388903 388577 458007 577446 590860 459198 404742 448078 453800 499509
18922D99509M2431J06863J10052M7283n3669l3515q1050J06972O9069O8249l5252
$$ 499509 541940 648803 758855 806138 752469 718954 637904 744876 813945 882194 846942
18911H46942q5382K2603P5693O4131l6195l5558N6123J02485L1936O5232J00107
$$ 846942 761560 784163 859856 923987 887792 852234 908357 1010842 1042778 1108010 1208117
18900A208117m5773r357J51894J94670J80471K64342K94123J95948K57394K26976
$$ 1208117 1162344 1152987 1304881 1499551 1680022 1944364 2238487 2434435 2691829 2918805
18890B918805K01591L18023L56249J51250O5415J15817J22247J19932K53829L22238
$$ 2918805 3120396 3438419 3794668 3945918 4011333 4127150 4249397 4369329 4623158 4945396
18880D945396L26641M23568O63279R38934J309388J814584K566075L654662N377659
$$ 4945396 5272037 5695605 6358884 7297818 8607206 10421790 12987865 16642527 22020186
18871B2020186Q251317J2246716J6912904K0598440K2105291K2213827K1693979
$$ 22020186 30271503 42518219 59431123 80029563 102134854 124348681 146042660
18864A46042660J7271659P228176m707644j3053485j8686800k3920740k5353511
$$ 146042660 163314319 170542495 165834851 152781366 134094566 110173826 84820315
18857H4820315k1122125j4784078r695382o367867m306512l045655k298368j859715
$$ 84820315 63698190 48914112 39218730 32850863 28544351 25498696 23200328 21340613
18849B1340613j444153j258342r55576q38947o68449m47099l14696j74248j41412
$$ 21340613 19896460 18638118 17682542 16843595 16175146 15728047 15413351 15239103 15097691
18840A5097691j42549j34016r3197q2730q0319k39829l80092l15092l67927l36906
$$ 15097691 14955142 14821126 14727929 14645199 14564880 14325051 13944959 13629867 13261940 12925034
18830A2925034l31956l67807j84427n7099K7556J70203L62296N18303O75232J039529
$$ 12925034 12593078 12225271 12040844 11983745 12011301 12181504 12543800 13062103 13737335 14776864
18820A4776864J578989K241464L326579N131164Q013045J2285743J7474089K1846686
$$ 14776864 16355853 18597317 21923896 27055060 35068105 47353848 64827937 86674623
18812H6674623K3730742K4143259K3923996J9866451R566431l466141j3094476
$$ 86674623 110405365 134548624 158472620 178339071 187905502 184439361 171344885
18805A71344885j9451295k5371056k7936983k3948569j7137739j1429518p497809
$$ 171344885 151893590 126522534 98585551 74636982 57499243 46069725 38571916
18798C8571916n076909l640177k785343k117441j648632j470649j273240r97468
$$ 38571916 33495007 29854830 27069487 24952046 23303414 21832765 20559525 19562057
18790A9562057q26308p46860o20989n50598m50867m58393l68346m30317o27419
$$ 19562057 18735749 17988889 17367900 16817302 16366435 15908042 15539696 15109379 14481960
18781A4481960n26528n70336n65224n25752n71724n03343n49114n01250m12668
$$ 14481960 13955432 13385096 12819872 12294120 11722396 11219053 10669939 10168689 9756021
18772I756021m04857l08743l70134k84155k45873k64043l25712k17277j97829
$$ 9756021 9351164 9042421 8672287 8388132 8142259 7878216 7552504 7335227 7137398
18763G137398j71841j84750k51472j81127p9195j24872j81931j03521j00401r4498
$$ 7137398 6965557 6780807 6529335 6348208 6269013 6144141 5962210 5858689 5758288 5663790
18753E663790j09996n4224k09660k90107k15416j03461p5803o2838q5530j38773
$$ 5663790 5553794 5499570 5289910 4999803 4784387 4680926 4605123 4542285 4456755 4317982
18743D317982k04686r0484n9674j32370j31801j23402L213m6111j59114k4698
$$ 4317982 4113296 4022812 3963138 3830768 3698967 3575565 3578778 3532667 3373553 3348855
18733C348855J2760q2983p3804r1648j74128j76543j20701q5681r6522o2716k1115
$$ 3348855 3361615 3278632 3204828 3113180 2939052 2762509 2641808 2556127 2459605 2396889 2375774
18722B375774r0768N448o9308o5183o7344r3128q466M6121m2934p0519n5107j8514
$$ 2375774 2285006 2290454 2221146 2155963 2088619 1995491 1987025 2033146 1990212 1919693 1864586 1846072
18710A846072m2094N151N6556o2987r9249j06779l0166k2302q3818r325L9883
$$ 1846072 1803978 1809129 1865685 1802698 1703449 1596670 1566504 1544202 1460384 1451059 1490942
18699A490942K6373J6926q1678l0394n4396J3323m4027p3460n359j7298k3732
$$ 1490942 1517315 1534241 1452563 1422169 1367773 1381096 1337069 1263609 1258250 1240952 1217220
18688A217220M3667J7001J9323K1108n2111j7142q1064j30817p4389m6069Q6422
$$ 1217220 1260887 1277888 1297211 1318319 1266208 1249066 1168002 1037185 962796 916727 1003149
18677A003149L6253l0887q0494r655O8853L1635o3933k4499k6054n1504J1472
$$ 1003149 1039402 1008515 928021 918366 987219 1018854 954921 930422 904368 852864 864336
18666H64336l8185j49403o627K6198q304o0222p2326m0026K8125N093R1240l7590
$$ 864336 826151 676748 670121 696319 688015 627793 555467 515441 543566 548659 639899 602309
18654F02309r6242L2049j1779m5764j8430k6424J2758K5860O4068O1010J7001
$$ 602309 506067 538116 526337 480573 462143 435719 448477 474337 538405 599415 616416
18643F16416j9006m7331p3950n0816O365k6609K0459M672n8583o3722m1211o0839
$$ 616416 597410 550079 476129 425313 431678 405069 425528 430200 371617 307895 266684 205845
18631B05845J6359O1467j5525l0049O6949O6842K34K408K328m5972m2461J863
$$ 205845 222204 283671 268146 238097 305046 371888 372122 374530 376858 330886 288425 290288
18619B90288j4077P9423M0678p1825q688l8674p5924J7293R3520N7460l066o6359
$$ 290288 276211 355634 396312 324487 315799 277125 201201 218494 312014 369474 366408 300049
18607C00049o2451J897N7701J1687n6350j17026n0086O6986N4649j7263l2553
$$ 300049 237598 239495 297196 308883 252533 135507 85421 152407 207056 189793 157240
18596A57240K4241O534L2621J3828k7698N272K0493l1547j4197J33875N3731r8458
$$ 157240 181481 188015 220636 234464 206766 212038 232531 200984 186787 320662 374393 275935
18584B75935m8975J8222J9897j826R824m2729p1703k8045l9235p739k3354l8578
$$ 275935 226960 245182 265079 263253 273077 230348 158645 130600 91365 83626 60272 21694
18572B1694j5228N0138l0280L2134O9927k96N911L2165M0663j03699j29181l6254
$$ 21694 6466 56604 26324 58458 128385 128089 134000 166165 206828 103129 -26052 -62306
18560f2306M2585k6872L8275Q2346K646j9303p680P0254q848r8923r1262j10644
$$ -62306 -19721 -46593 -8318 74028 76674 57371 49691 119945 111097 12174 -79088 -189732
18548a89732J38430J93451P1730o1361M262p2865l2187L7772k093n0481k6214
$$ -189732 -51302 142149 213879 152518 156780 83915 51728 89500 87407 36926 10712
18537A0712J05206J04499Q635m2740j37511n967M2961N9336O5495L7374J2640
$$ 10712 115918 220417 229052 186312 48801 42834 85795 145131 210626 248000 260640
18526B60640k1567j2221k6877j22330q8066m8163L9772K8955M9657Q13J6784Q138
$$ 260640 239073 226852 199975 77645 -10421 -58584 -18812 10143 59800 60613 77397 85535
18514H5535j17541j8611N2890J10204M0402q084O194k3364L4268p2298n1395k7652
$$ 85535 -32006 -50617 2273 112477 152879 144795 150989 127625 161893 89595 38200 10548
18502A0548J703k5854J4573R8445J8033n4768r396J3803o5339J1658j3774m3180
$$ 10548 12251 -13603 970 99415 117448 62680 53284 67087 1748 13406 -368 -43548
18490d3548J8337j9187L1103N4854N3256m9144j0773k598m4128k7445K7919J932
$$ -43548 -25211 -44398 -13295 41559 94815 45671 34898 32300 -11828 -39273 -11354 -9422
18478i422m3837R4553j8616L5383M6926m3809m8210N192M8507n4794n2477O4877
$$ -9422 -53259 41294 22678 58061 104987 61178 12968 18160 66667 11873 -40604 24273
18466B4273L7375o194k2706L5911J6821j08430J2698J3734J7693N8309j9654k2640
$$ 24273 61648 55454 32748 68659 85480 -22950 -10252 3482 21175 79484 59830 37190
18454C7190M2381m233l7595K8841o6206L8815k2311j6912l3036l9045l263Q7907
$$ 37190 79571 75338 37743 66584 378 39193 16882 -30 -33066 -72111 -75374 12533
18442A2533N1134r2203L7743J6923o6153p3880P4382L6886L450K9669O6688r892
$$ 12533 63667 -28536 9207 26130 -40023 -113903 -39521 -2635 815 30484 97172 87280
18430H7280l5864n031l1729m7820k4916J47920L861K6577l5983o0885K1105J05168
$$ 87280 51416 46385 14656 -33164 -58080 89840 93701 120278 84295 23410 44515 149683
18418A49683j3954q61J12708J20014J00589N6963O0135O5106J38590N0964N4589
$$ 149683 135729 134868 247576 367590 468179 525142 585277 650383 788973 839937 894526
18407H94526N3850k3124j03091j03373q4002m6407O2757l6568k6212q109J11440
$$ 894526 948376 925252 822161 718788 634786 588379 651136 614568 588356 580247 691687
18396F91687K02767J45245j7080n7301m7101r2294r4982j31058j47379l8985n3579
$$ 691687 894454 1039699 1022619 965318 918217 825923 730941 599883 452504 413519 359940
18385C59940o0637j0486m3115j0490j432n4202m7853O1472N1514p5460M705N8658
$$ 359940 299303 288817 245702 235212 233780 179578 131725 193197 244711 169251 173956 232614
18373B32614k2911l0135J554j0044k9575Q1586r765M9218O5946L1382m9537j197
$$ 232614 209703 179568 181122 171078 141503 223089 213324 262542 328488 359870 310333 309136
18361C09136m8774L955j9111N6255J30380M6831Q2002R2106Q3959M0377m0747
$$ 309136 260362 264317 245206 301461 431841 478672 560674 652780 736739 777116 736369
18350G36369K9794p1806j36587j23179o5840p0575j20749P825O900p4717L0844
$$ 736369 766163 694357 557770 434591 368751 298176 177427 185252 192152 117435 148279
18339A48279j6440m9163J7212M7327Q0725m5516j46885m4614K2460j704L5589
$$ 148279 131839 82676 99888 147215 227940 182424 35539 -9075 13385 11681 47270
18328D7270M0002n3718M6582R789J6460Q6667n735q002K3236L487r8359j22900
$$ 47270 87272 33554 80136 89925 106385 193052 187317 179315 202551 206038 107679 -15221
18316a5221l3973L6570P5499J2339j4918Q1175L6769l9052o982L6136k6938K7328
$$ -15221 -49194 -12624 62875 75214 60296 141471 178240 139188 132206 168342 141404 168732
18304A68732P8934J94459R5632m935L0388J01260J67122N4113J4629N054o6235
$$ 168732 247666 442125 537757 532822 563210 664470 831592 885705 900334 905388 839153
18293H39153o1895q4652o8609k00847r7390N2577n0580o978m6289J9039l9419
$$ 839153 777258 692606 623997 423150 325760 378337 327757 320779 274490 293529 254110
18282B54110l3637N62k0109K1448L563l0000J1125o6721r3258j1694L3599P8382
$$ 254110 220473 221035 200926 222374 225937 195937 207062 140341 47083 35389 68988 147370
18270A47370J7092P792k9027p8636l5038O7129M6277k7056n5795l4652n4154J2768
$$ 147370 164462 172254 143227 64591 29553 96682 142959 115903 60108 25456 -28698 -15930
18258a5930R1219j1774k6690l6921N7068N843M7133O181p3873n046P268K4240
$$ -15930 75289 63515 36825 -96 56972 62815 109948 116129 42256 37210 44478 68718
18246F8718M7754o4211j1206J5301k0923m566K7149K3368j4958l1j7253k1673
$$ 68718 116472 52261 41055 56356 35433 30867 58016 81384 66426 66395 49142 27469
18234B7469L7051o8595n548K0134j5975k6061K7247J12079L5190r4411M0207N7499
$$ 27469 64520 -4075 -9623 10511 -5464 -31525 -4278 107801 142991 48580 88787 146286
18222A46286L7729O7074P6927q4264p4941O761r3917m6482p7787M1720N3982M3950
$$ 146286 184015 251089 328016 243752 168811 175572 81655 35173 -42614 -894 53088 97038
18210I7038m5482l8040Q1648l1558k8188K841j8410q0700j759Q7543K3608l4708
$$ 97038 51556 13516 95164 63606 35418 38259 19849 -60851 -62610 24933 48541 13833
18198A3833l8190O3024J5893K6340j8370q9274j5260P6732K003p046N2786J912
$$ 13833 -24357 38667 54560 80900 62530 -26744 -42004 34728 36731 29685 82471 84383
18186H4383N3458J15560o7396m8650o8989o2735K8671K6593O3015M4050O1811
$$ 84383 137841 253401 186005 137355 68366 5631 34302 60895 123910 167960 229771
18175B29771k1663l327N5654r9136n3668K5024K6493M0303P8726k9589p5195j01838
$$ 229771 208108 204781 260435 161299 107631 132655 159148 199451 278177 248588 173393 71555
18163G1555j00034O293Q6563R4163L4037j9655o3145M6340R391P5875P7569J810
$$ 71555 -28479 -22186 64377 158540 192577 172922 109777 156117 165508 241383 318952 320762
18151C20762L088k8214q3767p0749K7297P378Q9002m0422p1184J0588L6460M4615
$$ 320762 323850 295636 211869 141120 168417 175795 264797 224375 153191 163779 200239 244854
18139B44854P3439N3132o5437r7575k2017m0362O3550L8686L2007n7592m7258
$$ 244854 318293 371425 305988 208413 186396 146034 209584 248270 280277 222685 175427
18128A75427Q2753L792N434J7617j6748o9891M1321J04400k8012m9923k3592J02980
$$ 175427 258180 261972 267406 285023 268275 198384 239705 344105 316093 266170 242578 345558
18116C45558Q2775K4679o7751N3426j6838l0462R8561R420P4996k4136j06878
$$ 345558 428333 453012 385261 438687 421849 391387 489948 499368 574364 550228 443350
18105D43350p968p5196n2499k4662M3161K3862r6678K3812m6407k5988K8359l9105
$$ 443350 435382 360186 307687 283025 326186 350048 253370 277182 230775 204787 233146 194041
18093A94041K999M8972L8511m0334J1071J7968M005J1950M9059j9573m8373q6292
$$ 194041 197040 246012 284523 244189 255260 273228 277233 289183 338242 318669 270296 184004
18081A84004J5148L7495K9957L087m2532p7105m8328L8224J04728O1385O3079
$$ 184004 199152 236647 266604 269691 227159 150054 101726 139950 244678 306063 369142
18070C69142n9786J4009J35871J13802J24225M4197m1209q6485n9169k7554q8236
$$ 369142 309356 323365 459236 573038 697263 741460 700251 613766 554597 527043 438807
18059D38807m5370n6362l4451O676Q6897p0705j04297r431L0140L2911L8684k1211
$$ 438807 393437 337075 302624 309300 396197 325492 221195 211764 241904 274815 313499 292288
18047B92288l0761k3589L9411R3775J7180k6581k1407k8695L7967J0360o3043
$$ 292288 261527 237938 277349 371124 388304 361723 340316 311621 349588 359948 296905
18036B96905q4193k8721L6056Q0470L0144K0213L0544k6536p1986Q1515P9844
$$ 296905 212712 183991 220047 300517 330661 350874 381418 354882 282896 364411 444255
18025D44255K506L6314l0738j7537k7664K0411O6550q147n1671l8381M0637J08874
$$ 444255 446761 483075 452337 434800 407136 427547 494097 485950 434279 395898 436535 545409
18013E45409Q6245Q5122J4717R109J02439L9445n9013M8979P229l135J7278P7736
$$ 545409 631654 716776 731493 740602 843041 882486 823473 872452 879681 876546 893824 971560
18001I71560R9132p8791n1208k3120o9760j52287L4517K9530k2057m9479Q050
$$ 971560 1070692 991901 940693 917573 847813 695526 730043 759573 737516 688037 696087
17990F96087M0115j0226j1952r9136J8684J19774P5418m584k5884m4967j3442
$$ 696087 736202 725976 714024 614888 633572 753346 828764 824180 798296 753329 739887
17979G39887M1384J6235k1971k3736l0942j2044K6648L0557N6483q6092L3719
$$ 739887 781271 797506 775535 751799 720857 708813 735461 766018 822501 736409 770128
17968G70128J35584J52276L8911M1364Q2962o163j11032o133L2382N4473j0819
$$ 770128 905712 1057988 1096899 1138263 1221225 1215062 1104030 1097897 1130279 1184752 1173933
17957A173933o696L8977P5309Q696M2292K1795J18763L9010p0011o2410k6121
$$ 1173933 1167237 1206214 1281523 1290219 1332511 1354306 1473069 1512079 1442068 1379658 1353537
17946A353537j078n9158p8323L4893J05485J74672R5954m0363k8221J17715P2532
$$ 1353537 1352459 1293301 1214978 1249871 1355356 1530028 1625982 1585619 1557398 1675113 1747645
17935A747645k0269M6308J16327M3437M6552J27033J87541J41307R0330J21175
$$ 1747645 1727376 1773684 1890011 1933448 1980000 2107033 2294574 2435881 2526211 2647386
17925B647386K42553L08412M21286N11760N56826P39310P34499O25889O48429
$$ 2647386 2889939 3198351 3619637 4131397 4688223 5427533 6162032 6787921 7436350
17916G436350N84793M88913N03238O74321Q21721J093379J796638K917723M195562
$$ 7436350 8021143 8510056 9013294 9687615 10509336 11602715 13399353 16317076 20512638
17907B0512638O264170R723143J4728878K0167008K2616098K2474117K4065037
$$ 20512638 26776808 36499951 51228829 71395837 94011935 116486052 140551089
17900A40551089K4550669J6468011J458949r012514j2419991j7332143k3227014
$$ 140551089 165101758 181569769 183028718 174016204 161596213 144264070 121037056
17893A21037056k0709704r440924L036391J3425837J8697340J9364657K0687180
$$ 121037056 100327352 90886428 93922819 107348656 126045996 145410653 166097833
17886A66097833K2488864J6590659R21667j3224533j8280733k1770945k8300888
$$ 166097833 188586697 205177356 206099023 192874490 174593757 152822812 124521924
17879A24521924k9164131k1690309j3663679q766272n971073m450845l398173
$$ 124521924 95357793 73667484 60003805 51237533 45266460 40815615 37417442
17872C7417442k625260k126455j702153j570971j379202j210728j151430j176521
$$ 37417442 34792182 32665727 30963574 29392603 28013401 26802673 25651243 24474722
17864B4474722j134185j035335j005597j032580r54330q87210p33351o56718o32202
$$ 24474722 23340537 22305202 21299605 20267025 19312695 18425485 17692134 17035416 16403214
17855A6403214o20713n53734n85129n65412m24446n21948m59070l72451l79608
$$ 16403214 15782501 15228767 14643638 14078226 13653780 13131832 12672762 12300311 11920703
17846A1920703l27644l66638m19341l88260l02832k28703k52688k87605k73820
$$ 11920703 11593059 11226421 10807080 10418820 10115988 9887285 9634597 9346992 9073172
17837I073172j93924k02289k48704k14910k43918k33975k57290k51885k54447
$$ 9073172 8879248 8676959 8428255 8213345 7969427 7735452 7478162 7226277 6971830
17828F971830j97784j90241j46271n8512j23457k88154j67294q5729j43924j92432
$$ 6971830 6774046 6583805 6437534 6379022 6255565 5967411 5800117 5714388 5570464 5378032
17818E378032k40959j63986j32053j00667K3262j02972j45444j33869m5744L2628
$$ 5378032 5137073 4973087 4841034 4740367 4763629 4660657 4515213 4381344 4335600 4368228
17808D368228j21103k24709j81204j88038j13501Q1796L0242k4117j54585j18877
$$ 4368228 4247125 4022416 3841212 3653174 3539673 3621469 3651711 3627594 3473009 3354132
17798C354132q8220j06402j13538q0432r2593K7365k3976j50168j23144J4835
$$ 3354132 3265912 3159510 3045972 2965540 2872947 2900312 2876336 2726168 2603024 2617859
17788B617859l064j16676j0792j5860j5742K580q0626j05777j09413r2597k2743
$$ 2617859 2614795 2498119 2487327 2471467 2455725 2458305 2377679 2271902 2162489 2069892 2047149
17777B047149n9919o3971m7129R1558m8626j37221P5282Q3999m3687r8255m2169
$$ 2047149 1987230 1923259 1876130 1967688 1919062 1781841 1857123 1941122 1897435 1799180 1757011
17766A757011m2280j47220O856r9753j02151K6368N6920j1231o2165l404k5667
$$ 1757011 1714731 1567511 1574367 1474614 1372463 1398831 1455751 1444520 1382355 1378951 1353284
17755A353284o484J297n3239q300N209j74883r4705P685M6971p084o8462l7266
$$ 1353284 1346800 1348097 1294858 1286558 1291767 1116884 1022179 1029864 1076835 1069751 1001289 964023
17743I64023m1370M0996K2226l9876m6581M7153J20456L5688j8506K07Q4976k0273
$$ 964023 922653 963649 985875 945999 899418 946571 1067027 1102715 1084209 1084416 1169392 1149119
17731A149119r4211p7733Q3345M2520k7273m3239n3802o771m8521o0082m344L0559
$$ 1149119 1054908 977175 1060520 1103040 1075767 1032528 978726 971955 923434 863352 859008 889567
17719H89567N49p8389j6205Q4210K3729M0358R4695p2784p6833j4384k4388j7871
$$ 889567 890116 811727 795522 879732 903461 943819 1038514 965730 888897 874513 850125 832254
17707H32254q5791l5412n8474N4493L54K9947J5136r7266l3178M4439l7784r1152
$$ 832254 746463 711051 652577 707070 707424 737371 752507 655241 622063 666502 628718 537566
17695E37566K9501K0998k3989K8098l0012j15328k1068M2620k671R114J5574K1339
$$ 537566 567067 588065 564076 592174 562162 446834 425766 468386 465715 474829 490403 511742
17683E11742Q3589K5187K3658J3374M6069m6347q5282j36690l0008L9009J745
$$ 511742 595331 620518 644176 657550 703619 657272 571990 435300 405292 444301 446046
17672D46046K6444r611k2428M4613O6647q5966q6539j5252K6152K9875q2196l8388
$$ 446046 472490 462879 440451 485064 551711 465745 379206 363954 390106 419981 337785 299397
17660B99397M4759M0323M021k0362K5684m3154j12010m3620j1l2396R57M1310
$$ 299397 344156 384479 388500 368138 393822 350668 238658 195038 195027 162631 163588 204898
17648B04898k5137n5091o8495m8587L5040R0074J22863P1019L8843j7730N302
$$ 204898 179761 124670 56175 7588 42628 132702 255565 326584 365427 347697 352999
17637C52999L8051k4694r1362l96m0496j5743J1480Q3086j6993l0121R3387R7833
$$ 352999 391050 366356 274994 274598 234102 218359 229839 312925 295932 265811 359198 457031
17625D57031k0937q7195J9993J38577R5933n8457m9417M0082l3263q1973J4812
$$ 457031 436094 348899 368892 507469 603402 544945 495528 535610 502347 420374 435186
17614D35186o208Q658K0240m692n2717n5143n1894N991k5717k1312n6117j5389
$$ 435186 428978 437636 457876 453184 400467 345324 293430 299421 273704 252392 196275 180886
17602A80886K6575k457p8127N7936K6945m0696l6631o6895l4776L6142Q6308N4850
$$ 180886 207461 205004 126877 184813 211758 171062 134431 67536 32760 68902 155210 210060
17590B10060M1160m2680l7016N0701j8493p2701R745K9258o4000L6344J87264
$$ 210060 251220 208540 171524 222225 203732 131031 140776 170034 106034 142378 329642
17579C29642o521o4007M5337L164k9936J1810O2056K1899q9250M6441n7638j2442
$$ 329642 323121 259114 304451 307615 277679 289489 351545 373444 284194 330635 272997 260555
17567B60555K9305k4213m1538J6729k8177m6102K3769O3047P8371l5689k7011
$$ 260555 289860 265647 224109 240838 212661 166559 190328 253375 331746 296057 269046
17556B69046j9933J8823L2117j2226j54440N7820L4044j7606O851m3665m4571
$$ 269046 249113 267936 300053 287827 133387 191207 225251 207645 214496 170831 126260
17545A26260p0659k7110j4004O371L5846O0197l6559o132Q8352N9999Q162q129
$$ 126260 55601 28491 14487 20858 56704 116901 80342 74210 162562 222561 230723 222594
17533B22594J67577P2376j19035o1283N2686K1630p4279j01871j0192P324O3362
$$ 222594 390171 462547 343512 282229 334915 356545 282266 180395 170203 177527 240889
17522B40889p529r6472L7879J28987K9417p2780p8479k4266M9536L1327K8305
$$ 240889 233360 136888 174767 303754 333171 260391 181912 157646 207182 238509 266814
17511B66814Q4196R543L4576Q9343L1619r2703j4767n617K7159J4590K7308M081
$$ 266814 351010 360553 395129 484472 516091 423388 408621 403004 430163 444753 472061 476142
17499D76142j2855l9642j3168p839l8713K3261n0217K3638K263K2518M1676P1287
$$ 476142 463287 423645 410477 402638 363925 387186 336969 360607 362870 385388 427064 498351
17487D98351k6232N514l4624j5227O9456K6130k3248J1461L134J978J7574L189
$$ 498351 472119 477633 443009 427782 497238 523368 500120 511581 514715 516693 534267 537456
17475E37456M4768K0680n7273L6576J31838r740P3779J2231J70844N6253j8886
$$ 537456 582224 602904 545631 582207 714045 704305 778084 790315 961159 1017412 998526
17464I98526J79178J86258J96743O0258Q590R2344J14185n3273l7442K3079R2775
$$ 998526 1177704 1363962 1560705 1620963 1629553 1721897 1836082 1782809 1745367 1768446 1861221
17453A861221K54092K68037K99060L04761K71563L90304L25333K57520L31247
$$ 1861221 2115313 2383350 2682410 2987171 3258734 3649038 3974371 4231891 4563138
17444D563138M25642M53336M90081P74562J091822J576416K283823L272715N078808
$$ 4563138 4988780 5442116 5932197 6706759 7798581 9374997 11658820 14931535 20010343
17435B0010343Q201927J2952031J8042167J8233965J1894719Q666503J0315626
$$ 20010343 28212270 41164301 59206468 77440433 89335152 98001655 108317281
17428A08317281P345878p303654k2777356k2349802j3713844o440642j515670
$$ 108317281 115663159 108359505 85582149 63232347 49518503 43077861 41562191
17421D1562191L136813Q554843J4010652J5657295J0826108O560168P607761O316700
$$ 41562191 44699004 53253847 67264499 82921794 93747902 100308070 107915831 114232531
17413A14232531n320758k1179615k3950548j6772764j0127864o135349l874840
$$ 114232531 108911773 87732158 63781610 47008846 36880982 30745633 26870793
17406B6870793k649100j858409j317355j103006r36374p46327p45084o48331n49102
$$ 26870793 24221693 22363284 21045929 19942923 19006549 18260222 17515138 16866807 16317705
17397A6317705n43151n26326n35034m69280k41682j26034J3647L2036J47021K69839
$$ 16317705 15774554 15248228 14713194 14243914 14002232 13876198 13889845 13921881 14068902 14338741
17387A4338741M01813M75057P49166J201803J737201K390731L838362O439949
$$ 14338741 14740554 15215611 15964777 17166580 18903781 21294512 25132874 31572823
17379C1572823J0624373J5614819J7165382J2113492P837867R027960Q083420
$$ 31572823 42197196 57812015 74977397 87090889 94928756 103956716 112040136
17372A12040136l353832j9309795k1987676j4428089p319793k431988J818093
$$ 112040136 108686304 89376509 67388833 52960744 45640951 43208963 45027056
17365D5027056O535803J1930570J4909791J1196000O157732O609413O866115j777521
$$ 45027056 51562859 63493429 78403220 89599220 95756952 102366365 109232480 107454959
17357A07454959j7762838k3618418j7357155j0369119o335434m174080k966210
$$ 107454959 89692121 66073703 48716548 38347429 32011995 27837915 24871705
17350B4871705k153067j694685j325611j042631r03275q29389q19833o93136o73108
$$ 24871705 22718638 21023953 19698342 18655711 17752436 16923047 16103214 15410078 14736970
17341A4736970p29027o95435n95090m91551n14270m24533l64208k96022l77385
$$ 14736970 14007943 13312508 12717418 12225867 11711597 11287064 10922856 10626834 10249449
17332A0249449l06960l12263l27177k41057k71721k10133k37607l24605l78697
$$ 10249449 9942489 9630226 9303049 9061992 8790271 8580138 8342531 8017926 7639229
17323G639229k93765l14870k17402j69466j14692j56690j57998j82233j78366
$$ 7639229 7345464 7030594 6813192 6643726 6529034 6372344 6214346 6032113 5853747
17314E853747j48269j57812j00736j14194j48261k28133o4705q1821k20168j36704
$$ 5853747 5705478 5547666 5446930 5332736 5184475 4956342 4891637 4809816 4589648 4452944
17304D452944j7140p4492j49477m6638L3873j77377k46501j34865p5200m6852
$$ 4452944 4435804 4361312 4211835 4165197 4199070 4021693 3775192 3640327 3565127 3518275
17294C518275m0504o9622N4109j0809r4615j38921j90178j22669m3228m6031m6018
$$ 3518275 3477771 3408149 3462258 3451449 3356834 3217913 3027735 2905066 2861838 2815807 2769789
17283B769789n5193j23839r7303o1169n002k1169p5588j74354j44877m5857m418
$$ 2769789 2714596 2590757 2493454 2432285 2427283 2406114 2330526 2156172 2011295 1965438 1961020
17272A961020J9507m527L8001p8144r3157q9826m6736j3912J245L0786P3925K4893
$$ 1961020 1980527 1976000 2014001 1935857 1842700 1752874 1706138 1692226 1693471 1724257 1798182 1823075
17260A823075j29246r0350j04469j05941q3183L436n236j8974J9152j005Q1398
$$ 1823075 1693829 1603479 1499010 1393069 1309886 1313322 1308086 1289112 1308264 1307259 1388657
17249A388657N5170R9948m7104n7277m1541l0170r8707n0069o344k4483j35114
$$ 1388657 1443827 1543775 1496671 1439394 1397853 1367683 1268976 1218907 1212563 1188080 1052966
17238A052966r5722J03691J3467j1476J4208O080r204k5897k2880j6667p9350
$$ 1052966 957244 1060935 1074402 1062926 1077134 1083214 1074010 1048113 1025233 1008566 929216
17227I29216j7538L2772p9466n5122N25r3059N7971O0057p0094n8211l831n902
$$ 929216 911678 944450 864984 809862 810387 717328 775299 835356 765262 707051 703220 697318
17215F97318m6875j07028k8512R9476N4133o8014o184N3347o0222n1473j3951
$$ 697318 650443 543415 514903 614379 668512 600498 594314 647661 587439 535966 522015
17204E22015J2338q4150p015K8485J5106m5286o212O4349K8553M9870o2051j02093
$$ 522015 534353 450203 443188 471673 486779 441493 435281 499630 528183 578053 516002 413909
17192D13909k2103k4668o3213o9917p5015N5546N7874O1981J2754k4449J4205
$$ 413909 391806 367138 303925 234008 158993 214539 272413 334394 347148 322699 336904
17181C36904Q6587l2602J6804J1234j02806o971j3247J9199o879O769o2617n417
$$ 336904 423491 390889 407693 418927 316121 309150 295903 315102 308223 314992 252375 246958
17169B46958M8586R9105M3582n9252q5108j477m7266J607n7039m1554J21642n580
$$ 246958 295544 394649 438231 378979 293871 292394 245128 246735 189696 148142 269784 264204
17157B64204m4361j20280r80l0831j8773M764l2253L6509J04411j1803m4126n2253
$$ 264204 219843 99563 98583 67752 48979 53743 21490 57999 162410 150607 106481 54228
17145E4228j5722m737R6809O6116j558L0121L3253K0968m6701j5305j7337k3115
$$ 54228 38506 33769 130578 196694 195136 225257 258510 279478 232777 217472 200135 177020
17133A77020l8522q4537J4456r075l2945m4413O7298K0795N6693p504j4852L6236
$$ 177020 138498 53961 68417 59342 26397 -18016 49282 70077 126770 119266 104414 140650
17121A40650j4731m0656n0689L0440M1570L0535K1153p1101l2916J2451j7724
$$ 140650 125919 85263 34574 65014 106584 137119 158272 87171 54255 66706 48982
17110D8982O506J01616K3421j1334r8843M8921j8157J5460N3675j06244o1446
$$ 48982 55488 157104 180525 169191 70348 119269 101112 116572 170247 64003 2557
17099B557K6038r517N5084N764j0997n9229N070P7604M519K6404r957m5354r7179
$$ 2557 28595 19078 74162 79926 68929 9700 14770 92374 96893 123297 113340 67986 -29193
17086b9193J6617M0240N315m4299J3033L1589L0920m001m115J9329l3995p881
$$ -29193 -12576 27664 32979 -11320 1713 33302 64222 60221 56106 75435 41440 33559
17074C3559q8430J12316o042r0023r5501l7324j7518N498M0383O8499k331K383
$$ 33559 -54871 57445 51403 -38620 -134121 -171445 -188963 -183465 -143082 -74583 -76914 -74531
17062g4531K7445K3952K1697L178M5635Q9143o2885J4453K7078P7076J1335j12638
$$ -74531 -47086 -23134 -1437 1741 47376 136519 73634 88087 115165 192241 203576 90938
17050I0938j08533m594M2130m1358l5786K3482R9821Q7553q3276j01039J10112
$$ 90938 -17595 -22189 19941 -21417 -57203 -33721 66100 153653 70377 -30662 79450
17039G9450L1892m7073J3661j22086j15831M8040Q9713K0432p603k7127l0174
$$ 79450 111342 64269 77930 -44156 -159987 -111947 -22234 -1802 -9405 -36532 -66706
17028f6706J7223j4472N0610M4531P3906M0018n0791k8478q1195n3108J26478
$$ -66706 -49483 -63955 -13345 31186 105092 145110 94319 65841 -15354 -68462 58016
17017E8016J489l6827j1440m4489k0367K2931R283k944j09474M948o11j4310J8064
$$ 58016 59505 22678 11238 -33251 -53618 -30687 -21404 -24348 -133822 -128874 -129485 -143795 -125731
17004a25731N2595j8117m4431L1793L6789o0806J9238J16466L7666n3741P4958
$$ -125731 -73136 -91253 -135684 -103891 -67102 -127908 -108670 7796 45462 -8279 66679
16993F6679n2487n9150K1806j6535P6751L9886n1876q1610P0700Q4920p9799m9472
$$ 66679 14192 -44958 -23152 -39687 37064 76950 25074 -56536 14164 99084 19285 -30187
16981c0187k3826j6912K2275R8416q161n3146p4474n6253M0462K5638p5281n4126
$$ -30187 -54013 -70925 -48650 49766 41605 -11541 -86015 -142268 -101806 -76168 -151449 -205575
16969b05575K1911Q9538R3967R110p1935K5943N1045Q804q2157k0639K0589m8985
$$ -205575 -183664 -94126 -159 8951 -62984 -37041 14004 22808 -59349 -79988 -59399 -108384
16957a08384k502M4218L5825n6842j0568j5878n578Q1174n311P946q563n5703
$$ -108384 -110886 -66668 -30843 -87685 -98253 -114131 -119709 -38535 -43846 -35900 -44463 -100166
16945a00166p337K7135P0739J1191n8016M0009l8540J7889J3898r7190n62P1965
$$ -100166 -107503 -80368 -9629 1562 -56454 -16445 -54985 -37096 -23198 -120388 -120950 -48985
16933d8985O7560K0026J00435J15653J88195P5112n5269N7524Q2286m1180j52607
$$ -48985 18575 38601 139036 254689 442884 517996 462727 520251 602537 561357 408750
16922D08750j08019m600k3689p1097k7145P5394k0745J5035J16510M8404N9851
$$ 408750 300731 296131 272442 201345 174200 249594 228849 243884 360394 408798 468649
16911D68649K3246n7773j02738m8074m9637r6173q3862j13314M689K3835L5333
$$ 468649 491895 434122 331384 283310 233673 137500 53638 -59676 -54987 -31152 4181
16900D181K8340o3707p9913k5634O3587M1080j31l5039J5047R5639K5397r0253
$$ 4181 32521 -31186 -111099 -136733 -73146 -32066 -32197 -67236 -52189 43450 68847 -21406
16888b1406O5498J4734M12M9580M405k9669m3072l384l1278l487L9212J07288
$$ -21406 44092 58826 59238 108818 113223 83554 40482 37098 5820 2333 41545 148833
16876A48833J02707J09416l9134l3339J07172j5262K004J16367N1460l4784q8922
$$ 148833 251540 360956 321822 288483 395655 380393 382397 498764 550224 515440 426518
16865D26518o6315L1211K4245l8263l979O4429K4111M5729N7641K0364o3863k4140
$$ 426518 360203 391414 415659 377396 373417 437846 461957 507686 565327 585691 521828 497688
16853D97688n2014j60475j25932O4461Q0985k2440j5302j22864p1665Q0073K3126
$$ 497688 445674 285199 159267 223728 304713 282273 266971 144107 72442 152515 175641
16842A75641K2671o2289p1849m6589L4286j382O1226m0854M5719p7667l7819P6412
$$ 175641 198312 136023 64174 17585 51871 50489 111715 70861 116580 38913 1094 77506
16830G7506q168K2985K6609L888k6380J4333O840m9391O3575k7806k1974Q706
$$ 77506 69338 92323 118932 122820 96440 110773 117613 68222 131797 103991 82017 90723
16818I0723q1257l3222O0925J10304k865j45857n9298N6389P42R7675k0756p4951
$$ 90723 9466 -23756 37169 147473 144608 -1249 -60547 -4158 -3416 94259 73503 -1448
16806a448K3875N75L6417j5353R169j577j17652l9783J32598M8124m2784l7532
$$ -1448 22427 23002 59419 44066 53235 51658 -65994 -105777 26821 74945 32161 -5371
16794e371l0446J957R38J5125M871j21599O1033o483M9739k7829p041l8837k9097
$$ -5371 -35817 -33860 -32922 -17797 -12926 -134525 -73492 -79975 -30236 -58065 -65106 -103943 -133040
16781a33040j0758M8070J12841M1334k5725n7202J905k8552o9837o2442l162M9362
$$ -133040 -143798 -95728 17113 58447 32722 -24480 -22575 -51127 -120964 -183406 -186568 -137206
16769a37206L473M4412N6287R4660N5773k0593j1551n216j06780j18890M1189
$$ -137206 -133733 -89321 -33034 61626 117399 96806 85255 80039 -26741 -145631 -104442
16758a04442k064K1879j7438r05p5330J1124P6054R1654L2387j5353o910J4750
$$ -104442 -106506 -84627 -102065 -102970 -178300 -167176 -91122 532 32919 17566 10656 25406
16746B5406l7837J9914N394L6144r5601j19660j6906J38729P0610m5222p7364
$$ 25406 -12431 7483 12877 49021 -46580 -166240 -183146 -44417 26193 -19029 -96393
16735i6393M7852q7252p651Q6969r0499l3136N8367J9742l5118q972P6315N7336
$$ -96393 -48541 -135793 -143444 -56475 -146974 -180110 -121743 -102001 -137119 -146091 -69776 -12440
16723a2440O1212J3615m2760j14940P816N4849n9569r448Q9353R2863j35126l2997
$$ -12440 48772 62387 19627 -95313 -87497 -32648 -92217 -101665 -12312 80551 -54575 -87572
16711h7572N5650j0119q888O696P0708l3381j01034K1076J820J4591K6325j6522
$$ -87572 -31922 -42041 -50929 -44233 26475 -6906 -107940 -86864 -85044 -70453 -44128 -60650
16699f0650L4439k9493n2287N144L5165Q7123N170p4634r526m4772J3970l288
$$ -60650 -26211 -55704 -107991 -102847 -67682 19441 24611 -50023 -59549 -104321 -90351 -93639
16687i3639J9289k1691J7879J7120N404O8375N3698m1658l414j0653j5911K165
$$ -93639 -74350 -96041 -78162 -61042 -55638 12737 66435 24777 21363 10710 -5201 -3036
16675c036j9579o499m8094K8114J3242L2597J9920n5809O815l0985k8530P254
$$ -3036 -22615 -29114 -77208 -49094 -35852 -3255 16665 -39144 -32329 -63314 -91844 -84590
16663h4590l1209k6619P5928L9375p197q041j7175M6257N4951R5946k0737l712
$$ -84590 -115799 -142418 -66490 -27115 -34312 -42353 -59528 -13271 41680 137626 116889 113177
16651A13177j12155l6101N0372R262M5798j4862p4686m7828j04030m5470J1974
$$ 113177 1022 -35079 15293 24555 70353 55491 -19195 -67023 -171053 -216523 -204549
16640b04549P5678K2088J6777O1269J32144K7157l5193p3177N7387j8865j3780
$$ -204549 -128871 -106783 -90006 -28737 103407 130564 95371 22194 79581 60716 46936
16629D6936J7045l360j00384k7707P0837M127j04958k364P9034M3124R6448L1520
$$ 46936 63981 60621 -39763 -67470 3367 7494 -97464 -99828 -20794 22330 118778 150298
16617A50298j30909n7719o202M5191K9866l9831q6574k3258O6629l3666j1329
$$ 150298 19389 -38330 -44532 659 30525 -9306 -95880 -119138 -52509 -86175 -97504
16606i7504O6357J25648n1403k056M7746o2826j31393j2800J5408j59P3075k7125
$$ -97504 -31147 94501 43098 41042 88788 25962 -105431 -118231 -102823 -102982 -29907 -57032
16594e7032p507J7248N9271j5509P558L0856L9592m600j9733j2520O637L5255
$$ -57032 -64539 -47291 11980 -3529 4029 34885 74477 69877 50144 37624 44261 79516
16582G9516o6248M3824J703M6317L5045l6294M4859n9571o5726L4579m2878p6307
$$ 79516 13268 57092 58795 105112 140157 103863 148722 89151 23425 58004 15126 -61181
16570f1181J3868P1067m2354O8519L2913j41920j17700m8573R7933R3739L9051
$$ -61181 -47313 23754 -18600 49919 82832 -59088 -176788 -225361 -127428 -33689 5362
16559E362L4137Q22m4201n1180l4872N7632Q9751k6900m8386j1070P0275J8864
$$ 5362 39499 40321 -3880 -55060 -89932 -32300 57451 30551 -17835 -28905 41370 60234
16547F0234p3899K2385o463Q3641Q6988J9966q1317o0399P379M6157k062L1465
$$ 60234 -13665 8720 2257 85898 172886 192852 111535 51136 58515 104672 102610 134075
16535A34075J6398J2601N307N8297K9293q3869l7781L7836j9871J3694o2544N174
$$ 134075 150473 163074 168381 226678 255971 172102 134321 172157 152286 165980 103436 108610
16523A08610O9706J0363k33l8246P8528N0942L7414M4190P892L7366K2332j8117
$$ 108610 178316 188679 188446 150200 228728 279670 317084 361274 369166 406532 428864 410747
16511D10747p5639j8526k9004R02O2906l0731K5043k1913l9580m3712P5875m2983
$$ 410747 335108 316582 287578 288480 351386 320655 345698 323785 284205 240493 316368 273385
16499B73385q7263k7501K4207N053n9877k3562P2001N3511k7787m4604m2779q5546
$$ 273385 186122 158621 182828 187881 128004 104442 176443 229954 202167 157563 114784 29238
16487B9238n3755J8186M9916j6628M7528J5403O0938m0361j26755J6113K5644
$$ 29238 -24517 -6331 43585 26957 74485 89888 150826 110465 -16290 -177 25467
16476B5467J2064k9659j01008P164M9035Jn4695j8116J9017P5545O6999q843r1667
$$ 25467 37531 7872 -93136 -85972 -36937 -36936 -91631 -109747 -90730 -15185 51814 42971 -48696
16463d8696N4141P5373K7014L4879n1093J2709m3442q3559p6124Q737J39793P7477
$$ -48696 5445 80818 107832 142711 91618 104327 60885 -22674 -98798 -90061 49732 127209
16451A27209m8126n3769p4428k3205j9509R7413j0762o458M9456M6220n8920p8905
$$ 127209 79083 25314 -49114 -72319 -91828 5585 -5177 -11635 37821 84041 25121 -53784
16439e3784k736l6533l2597M8354M7430N6210k446j8289r4437N3125L2521K3590
$$ -53784 -56520 -93053 -125650 -77296 -29866 26344 23898 5609 -88828 -35703 -3182 20408
16427B0408l316n5965j1827j05660M8141Q1042N5331r3279o9117L0825J5535n1339
$$ 20408 17092 -38873 -50700 -156360 -108219 -27177 28154 -65125 -134242 -103417 -87882 -139221
16415a39221N0845K9010N3579M4801K5131n2967L6034n2306l0044m730K3165j5435
$$ -139221 -88376 -59366 -5787 39014 64145 11178 47212 -5094 -35138 -39868 -16703 -32138
16403c2138L425n6687m3316l2201P9246J12480o8405j01804N123N9723N7140J1205
$$ -32138 -28713 -85400 -128716 -160917 -81671 30809 -37596 -139400 -134277 -74554 -17414 -6209
16391f209n6663L4386o002O8297O3707r5894q7198N7910p0198k462P3176n2029
$$ -6209 -62872 -28486 -34488 33809 97516 1622 -85576 -27666 -97864 -100326 -27150 -79179
16379g9179K5182P9845j4330p831J2873M6233j8811J1738o913k2344j5696O0864
$$ -79179 -53997 25848 11518 3687 16560 62793 43982 55720 48807 26463 10767 71631
16367G1631l6393m5188J4961l1803K2304P3691K8671M5644k1743o0176O686p5781
$$ 71631 35238 -9950 5011 -26792 -4488 69203 97874 143518 121775 61599 68285 -7496
16355g496n3150M488L9868k5062j59505m9926J19182P5740m937K7823M4000l1366
$$ -7496 -60646 -56158 -16290 -41352 -200857 -250783 -131601 -55861 -60798 -32975 11025 -20341
16343b0341J2509r054L2861P2229j1704m1095n0154j1516m638l678Q118K5448
$$ -20341 -7832 -16886 15975 88204 76500 35405 -14749 -26265 -30903 -34581 -26463 -1015
16331a015Q7289k1109k7854J02528L0183N5249L1509j62507j44071K1180K6974
$$ -1015 86274 65165 37311 139839 170022 225271 256780 94273 -49798 -28618 -1644
16320a644k9519l4283K8965k9133j1748M4686K6180N0337l5614r3233n2193P6465
$$ -1644 -31163 -65446 -36481 -65614 -77362 -32676 -6496 43841 8227 -85006 -137199 -60734
16308f0734O0332N4677J9553l0022q2963m4855O9117M4121r8944j0319l2339K5210
$$ -60734 -402 54275 73828 43806 -39157 -84012 -14895 29226 -69718 -80037 -112376 -87166
16296h7166Q2629K7747n8625M2705N632j9688J1268r9970r001K4025L3865K0660
$$ -87166 -4537 23210 -35415 7290 12922 -6766 4502 -95468 -104469 -80444 -46579 -25919
16284b5919O4288m8683p6600k3954N6759M2645J37610K2469m1783l8112l0900
$$ -25919 38369 -10314 -86914 -110868 -54109 -11464 126146 148615 106832 68720 37820
16273C7820k3168k2504L3402L9257m433j8420k8642j9754L3137L4703J6133p4185
$$ 37820 14652 -7852 25550 64807 60374 41954 13312 -6442 26695 61398 77531 3346
16261C346P0692J02602J739q369l7117p2579j5404L7980J8378p0718j4918L9644
$$ 3346 74038 176640 178379 170010 132893 60314 44910 82890 101268 30550 15632 55276
16249E5276j957l2696l3337P824N2628p5798j78134j314N5389k7642K4456J3882
$$ 55276 53319 20623 -12714 -4890 47738 -28060 -206194 -207508 -152119 -179761 -155305 -141423
16237a41423l2531k9529P0538m12K0297J03492O4630l6793J2914k9459j8728L597
$$ -141423 -173954 -203483 -132945 -133357 -113060 -9568 55062 18269 31183 1724 -17004 -13407
16225a3407J9180l4787K4769j255m8069K5733L2627O1911K5872J8800q2503J672
$$ -13407 5773 -29014 -4245 -5500 -53569 -27836 4791 66702 92574 111374 28871 30543
16213C0543j7256r3426M778K325M0230N487K0948k4145J21292L1010l1764k1652
$$ 30543 13287 -80139 -75361 -73036 -32806 -27319 -6371 -30516 90776 121786 90022 68370
16201F8370p2124o4735k2613K3189k5489k6927Q3554R7983N0263k0358j18380
$$ 68370 -3754 -68489 -91102 -67913 -93402 -120329 -36775 61208 111471 91113 -27267
16190b7267o7740M7220O7875K91l5055P4701N8384p1997J7049O279J4291k8642
$$ -27267 -95007 -47787 20088 20379 -14676 60025 118409 46412 63461 69740 84031 55389
16178E5389k7595n5266j3782k2665j8009l1561O4038O6612n6033J80q62M7780
$$ 55389 27794 -27472 -41254 -63919 -81928 -113489 -49451 17161 -38872 -38692 -39554 8226
16166H226N1854N3827K9190r8996J9228J43l3958j10908M2102J1849P467M2667
$$ 8226 60080 113907 143097 44101 63329 63472 29514 -81394 -39292 -27443 -19976 22691
16154B2691R927J0552l06n844o6655Q701p567k8810m4451N5397P4659R8791R178
$$ 22691 32618 43170 42864 37020 -29635 -20934 -28501 -57311 -101762 -46365 28294 127085 136263
16141A36263n1696K4788K6824K866o1205k2836o0072o3504l4489O0747O6242o869
$$ 136263 84567 109355 136179 139045 77840 55004 -5068 -68572 -103061 -42314 23928 17059
16129A7059r3439K272O2904Q3625l1606j16691j6324q5493j9611J1810l3816M447
$$ 17059 -76380 -74108 -11204 72421 40815 -75876 -92200 -177693 -197304 -185494 -219310 -214863
16117b14863M1636N4667O0595R0547M4581k7089p866l0253K5131n4057p3905N4663
$$ -214863 -173227 -118560 -57965 32582 77163 50074 42208 11955 37086 -16971 -90876 -36213
16105c6213K2133m8113J0983m0282N941N0144Q6801P067M5215M8829j21215q6420
$$ -36213 -14080 -62193 -51210 -91492 -85551 -35407 51394 58461 103676 152505 31290 -55130
16093e5130K004J6427L6783q226J996j20971j14617J78170J07359l228o3843m3466
$$ -55130 -53126 -36699 84 -8142 -6146 -127117 -241734 -63564 43795 40567 -23276 -66742
16081f6742m2436Q5604M6288m081k6514r5044j4244J7443R7513J06100Q1790k0521
$$ -66742 -109178 -23574 22714 18633 -7881 -102925 -117169 -99726 -2213 103887 185677 165156
16069A65156p9749j7264N6891J2141j0119o360j41632j08386J04181L5111N051
$$ 165156 85407 68143 125034 137175 127056 120696 -20936 -129322 -25141 9970 15021
16058A5021L5272o0713m3453q105L6909J2304p8276l8219Q8813J5485p8387m3365
$$ 15021 50293 -10420 -53873 -61978 -25069 -12765 -91041 -129260 -40447 -24962 -103349 -146714
16046a46714Q9052P0692N107O947J998j01366M1394M4235r0266l3110O5494L2749
$$ -146714 -57662 13030 18137 25084 27082 -74284 -32890 11345 -78921 -112031 -46537 -13788
16034a3788K4701p3614J9185j106O9093l8126O1459n556l3322O1378M9087l651
$$ -13788 10913 -62701 -43516 -44622 24471 -13655 47804 42248 8926 70304 119391 115740
16022A15740P877o2903j2765m2357j0995K5008N0705o2724j09685k8671J02205
$$ 115740 123617 60714 47949 5592 -5403 19605 70310 7586 -102099 -130770 -28565
16011b8565N1107j0124M9689L2432N0166J470J0835Q399n4062j14519j24868K7137
$$ -28565 22542 12418 62107 94539 144705 146175 157010 165409 111347 -3172 -128040 -100903
15999a00903J00377j1646r8623K8118r506Q5950L5646j9139L3480Q4284K6772
$$ -100903 -526 -12172 -110795 -82677 -92183 -6233 29413 10274 43754 128038 154810
15988A54810l2442r416n505k9229r2078n2170k2898L3161Q7099P4154N1011j8199
$$ 154810 122368 112952 107447 78218 -13860 -66030 -88928 -55767 31332 105486 156497 138298
15976A38298m1689o0225o5756Q052N4150N0886L8782o8153n7015L2760M9365l7941
$$ 138298 96609 36384 -29372 -21320 32830 83716 122498 54345 -2670 30090 79455 41514
15964D1514l5704k1565K1663p4964k0037L5882j05440k1199J32467J6417p3651
$$ 41514 5810 -15755 5908 -69056 -89093 -53211 -158651 -179850 -47383 -30966 -104617
15953a04617P6127L5508k5968M131P0316L9211r7005l6923J5872J8340N5224k6307
$$ -104617 -28490 7018 -18950 -14819 55497 94708 -2297 -39220 -23348 -5008 50216 23909
15941B3909R4294p025j03838m6536K0686k6201P760O6554J6265M1590m5398j038
$$ 23909 118203 111178 7340 -39196 -18510 -44711 -36951 29603 45868 87458 42060 41022
15929D1022l1503K4926O7629R5735K6023o8863j57q6118m6053m1243M677M8955
$$ 41022 9519 34445 102074 197809 223832 154969 154812 68694 22641 -18602 -13925 35030
15917C5030N2140O844Q5166O0689n2260k1395K2512o8354r908J0745p9485O32
$$ 35030 87170 94014 179180 239869 187609 166214 188726 120372 110464 121209 41724 42356
15905D2356j5738n0435m2709m1734K8510O6075R0j5459m2280L4039Q4343l7393
$$ 42356 26618 -23817 -66526 -108260 -79750 -13675 -13585 -29044 -71324 -37285 47058 9665
15893I665m2962N8242j0845j0193O6657J3577L6512j2740j1817J9027l8783o2109
$$ 9665 -33297 24945 14100 3907 70564 84141 120653 107913 96096 115123 76340 14231
15881A4231k1126O2029P2624m434J3435k6015p4474n3133N3208K4221K3288r773
$$ 14231 -6895 55134 127758 123324 136759 110744 36270 -16863 36345 60566 83854 74081
15869G4081n3415J3268J7356M7521n7692m8412O6017J02714q3236m4860n886K1190
$$ 74081 20666 33934 51290 98811 41119 -7293 58724 161438 78202 33342 27456 48646
15857D8646N6302M3125j32510o8461K3282K8920O0625N6243J8836N570o7505l8733
$$ 48646 104948 148073 15563 -52898 -29616 -696 59929 116172 135008 140578 73073 34340
15845C4340P650P216J8082r1768n2262O4453N3851N0971K7602J4667k4504p5637
$$ 34340 41990 49206 67288 -24480 -76742 -12289 41562 92533 120135 134802 110298 34661
15833C4661O0210l6981L2277J09079M2162m2220k6267n9854O5102K4989P004k9337
$$ 34661 94871 57890 90167 199246 241408 199188 172921 113067 178169 203158 210162 180825
15821A80825l2667N800Q5698j1916m060M3172J9146j10602n6960q4254l0453Q211
$$ 180825 148158 153958 239656 227740 223680 266852 285998 175396 118436 34182 3729 11940
15809A1940L2568l7248l5873N711R9700J1842P7008l6334l8312L0335O0322k6925
$$ 11940 44508 7260 -28613 -22902 76798 88640 165648 129314 91002 121337 181659 154734
15797A54734p4760j5139n429n1947J7920O7412K6691o081j773j01776R35L3384
$$ 154734 79974 64835 59406 7459 25379 92791 119482 113401 111628 9852 10787 44171
15785D4171p8380L4071j6913l0944O6729J0824K3580O3466K6942l1471L1876N2690
$$ 44171 -34209 -138 -17051 -47995 18734 29558 53138 116604 143546 112075 143951 196641
15773A96641o2163l5611l2999m9883l0222N6906J78600J9403J687M6750j33779
$$ 196641 134478 98867 65868 15985 -14237 42669 221269 240672 242359 289109 155330
15762A55330n4587j2642k0894M8432L8146R7343O3676m9489n4145k6998k3143
$$ 155330 100743 88101 67207 115639 153785 251128 314804 265315 211170 184172 161029
15751A61029n9942j7928l5020K6657L1394N5015M0037m0812K1123K1341j26471
$$ 161029 101087 83159 48139 74796 106190 161205 201242 160430 181553 202894 76423
15740G6423r4152j9908M7194N0526L4768n0283K9139M5866K9593n6006j7539R96
$$ 76423 -17729 -37637 9557 60083 94851 44568 73707 119573 149166 93160 75621 76617
15728G6617N5460R8525M9661K3916l6264q760n9048K995n399l0614J9485L3218
$$ 76617 132077 230602 280263 304179 267915 259155 200107 203102 197703 167089 186574 219792
15716B19792P6478m9156q7018N4837M2382N3006L5253m2007N7465q148k8276l7733
$$ 219792 296270 247114 160096 214933 257315 310321 345574 303567 361032 352884 324608 286875
15704B86875j02665n2371K0199k4950L1241o5751J00157Q3335j03491j5926L961
$$ 286875 184210 131839 152038 127088 158329 92578 192735 276070 172579 156653 160614
15693A60614k7426P35N238p0850j9624K6605L4068N6055N8375n2076J2782m3514
$$ 160614 133188 133923 139161 68311 48687 75292 109360 165415 223790 171714 184496 140982
15681A40982o7903N732R0893L8228k4931L5652k3532m3812J3232R5962J2566j0419
$$ 140982 73079 78811 169704 207932 183001 218653 195121 151309 164541 260503 273069 262650
15669B62650J8818j5840O8104m1645k2061k2839r552q6337j610K2408m4144n8062
$$ 262650 281468 265628 333732 292087 270026 247187 237635 151298 149688 172096 127952 69890
15657F9890M6954M7179N0144M3592J3416m034m958O7786n737j1281j25698N3040
$$ 69890 116844 164023 214167 257759 271175 267141 262183 329969 324232 312951 187253 240293
15645B40293J39163q8308r1705K8502k8944o7568j5723R852L4906q3032r5299
$$ 240293 379456 291148 199443 227945 199001 131433 115710 125562 160468 77436 -17863
15634a7863k2116Q1160J14236O645P7762J1215j1336N8740J00014l764k6842L3836
$$ -17863 -39979 41181 155417 162062 239824 251039 239703 298443 398457 394693 367851 401687
15622D01687k2453r7983p7042J9842n9938j26165j6366N2005J54402P7083K7298
$$ 401687 379234 281251 204209 224051 164113 37948 21582 73587 227989 305072 332370
15611C32370J129L6640m0492M2235k5982k0227m4529l0925Q26K0826m8987M5799
$$ 332370 333499 370139 329647 371882 345900 325673 281144 250219 251045 271871 222884 268683
15599B68683O5707o932o1789L80J5833n243K5735O3599j1509o2212l0161J0750
$$ 268683 334390 327458 265669 266049 281882 276639 302374 365973 354464 292252 262091 272841
15587B72841j2011m4402J4920l6990P1046K345j01400N2527Q4114r216k2296m020
$$ 272841 260830 216428 231348 194358 265404 267749 166349 218876 302990 293774 271478 267458
15575B67458m455m9907j0053J2456P1689Q9318j2238l237O2394N5232L0908k1075
$$ 267458 263003 213096 203043 215499 287188 376506 364268 361031 423425 478657 509565 488490
15563D88490r7951l4796j4728o4758j9852O8792j1176J7404R613J8201k0755q8614
$$ 488490 390539 355743 341015 276257 256405 325197 314021 331425 341038 359239 338484 249870
15551B49870k3765M3889j7148P0933N4031N7197l6915J913L6188j0384o2503j9218
$$ 249870 226105 269994 252846 323779 377810 435007 398092 400005 436193 425809 363306 344088
15539C44088m2110l8317J2277L4017m9457l226P0119j9625J4079N6676n3588L628
$$ 344088 301978 263661 275938 309955 260498 257272 327391 307766 321845 378521 324933 328561
15527C28561P1303n6516k9534M2221J7702o5838R949L9602j08L6491p876J459
$$ 328561 399864 343348 313814 356035 373737 307899 317848 357450 357342 393833 385957 387416
15515C87416j4196r964n7310k6907J31409K4152j1185j7370k927P2064J9012J6918
$$ 387416 373220 363256 305946 279039 410448 434600 423415 406045 403118 475182 494194 511112
15503E11112k0713j30017K0936J23347J8229P2042J4398N221q6779l3639L1884
$$ 511112 490399 360382 381318 504665 522894 594936 609334 614555 527776 494137 526021
15492E26021K9223r7867p6618N3592L9702Q5674M0906r3968n6015j1679J24687
$$ 526021 555244 457377 380759 434351 474053 559727 600633 506665 450650 438971 563658
15481E63658O0878L5412j2351O9681J7967q2760n3124N6741J8694j35184k456
$$ 563658 624536 659948 647597 717278 735245 652485 599361 656102 674796 539612 537156
15470E37156M5659O3922L4160M5668J81340J65588J23228J62607J58738J98713
$$ 537156 582815 646737 680897 726565 907905 1073493 1196721 1359328 1518066 1716779
15460A716779Q4273k3433q3736r3556j46986n6511j49671j33996o8843j8306k3382
$$ 1716779 1801052 1777619 1693883 1600327 1453341 1396830 1247159 1113163 1044320 1026014 1002632
15449A002632J2004j4878M0921k267q0655q6267M335O0267N0139K0505j6852O6355
$$ 1002632 1014636 999758 1040679 1038412 957757 871490 875825 936092 986231 1006736 989884 1056239
15437A056239K9530L0905m2190J239K1194K865r9714q999j9157o8936N0120J9563
$$ 1056239 1085769 1116674 1074484 1075723 1096917 1099782 1000068 991069 971912 902976 953096 972659
15425I72659j16454m2997N0431L2481l5851m6185J2465P77M7935M0269J392j9378
$$ 972659 856205 813208 863639 896120 860269 814084 826549 827326 875261 915530 916922 897544
15413H97544L0517k6627k5355L7207k1574R1058P687o2635j3483j8311P7530j0453
$$ 897544 928061 901434 876079 913286 891712 982770 990457 927822 914339 896028 973558 963105
15401I63105q6266K321J0142J2861R0392L7552l9519k0924j1208K5157j3145L6542
$$ 963105 876839 879160 889302 902163 992555 1030107 990588 969664 958456 983613 970468 1007010
15389A007010J4266P3733j535O148M0440Q3351k1910J3874m0405k5471K4657l5678
$$ 1007010 1021276 1095009 1093474 1099622 1140062 1223413 1201503 1215377 1174972 1149501 1174158 1138480
15377A138480K0901K0132P3260M7179p2094L4954R5732J7603l6260L1010n2979
$$ 1138480 1159381 1179513 1252773 1299952 1227858 1262812 1358544 1376147 1339887 1370897 1317918
15366A317918j1828L4844k6504M2824L2114j39m8904k3572J9378J03401M0186
$$ 1317918 1306090 1340934 1314430 1357254 1389368 1389229 1340325 1316753 1336131 1439532 1479718
15355A479718l0282k3402N9557R1858N3421n272O9394N7286P946L6813L7270K7256
$$ 1479718 1449436 1426034 1485591 1577449 1630870 1625598 1694992 1752278 1760224 1797037 1834307 1861563
15343A861563L0463M8120R580P0339N3646l3733l6226L578L8743K5716K8944N8585
$$ 1861563 1892026 1940146 1949726 2020065 2073711 2039978 2003752 2007330 2046073 2071789 2100733 2159318
15331B159318J6502j2102k3305Q9085N4950m9770L5611Q1974j2958L3379K1895
$$ 2159318 2175820 2163718 2140413 2229498 2284448 2234678 2270289 2352263 2339305 2372684 2394579
15320B394579P0488P4396N8386O8195L7714K6044K9561m676j1345O4022J06692
$$ 2394579 2465067 2539463 2597849 2666044 2703758 2729802 2759363 2754687 2743342 2807364 2914056
15309B914056J00431K0382J03856P8920M1710P9878r79m92J79086R7550L3133
$$ 2914056 3014487 3034869 3138725 3217645 3259355 3339233 3338254 3337762 3516848 3614398 3647531
15298C647531M2408J17613R4749N2454M6276M3667L6951P0472N3608R9837M6777
$$ 3647531 3689939 3807552 3902301 3954755 4001031 4044698 4081649 4152121 4205729 4305566 4352343
$$ [...]
##END NTUPLES=NMR SPECTRUM
##END=
