##TITLE=Analysis number 313848
Compound Code cc 06013
Project Code adrs
Chemist Name stores
##JCAMPDX= 6.0         $$ Bruker NMR JCAMP-DX V2.0
##DATA TYPE= NMR SPECTRUM
##DATA CLASS= NTUPLES
##ORIGIN= Bruker BioSpin GmbH
##OWNER= NMR
$$ XWIN-NMR		Version 3.5
$$ Fri Sep 23 11:05:55 2005 GMT Daylight Time (UT+1h)  MAYBRIDGE\NMR@NMR_250MHZ
##.OBSERVE FREQUENCY= 250.131544655141
##.OBSERVE NUCLEUS= ^1H
##.ACQUISITION MODE= SIMULTANEOUS (DQD)
##.ACQUISITION SCHEME= undefined
##.AVERAGES= 16
##.DIGITISER RES= 18
##SPECTROMETER/DATA SYSTEM= dpx250
##.PULSE SEQUENCE= zg30
##.SOLVENT NAME= DMSO
##.SHIFT REFERENCE= (INTERNAL, DMSO, 0, 16.522)
##AUDIT TRAIL= $$ (NUMBER, WHEN, WHO, WHERE, WHAT)
$$ ##TITLE= Audit trail, XWIN-NMR		Version 3.5
$$ ##JCAMPDX= 5.01
$$ ##ORIGIN= Bruker BioSpin GmbH
$$ ##OWNER= NMR
$$ C:\u/data/dgb/nmr/ADRS/9890/pdata/1/auditp.txt
$$ ##AUDIT TRAIL=  $$ (NUMBER, WHEN, WHO, WHERE, WHAT)
(   1,<2005-09-23 11:05:34.25 +100>,<MAYBRIDGE\NMR>,<NMR_250MHZ>,
      <created by zg, POWCHK disabled, PULCHK disabled
       configuration hash MD5:
       62 19 C7 07 E1 42 D1 B7 37 6C 3D D0 77 39 F9 E6
       data hash MD5: 64K
       2C ED 6E 99 B5 D3 00 50 7C 55 13 05 1D 98 7D 9B>)
(   2,<2005-09-23 11:05:46.17 +100>,<MAYBRIDGE\NMR>,<NMR_250MHZ>,
      <Start of raw data processing
       ef LB = 0.3 FT_mod = 6 PKNL = 1 SI = 32K 
       data hash MD5: 32K
       84 44 18 71 96 4A 07 BC A0 68 E7 AA EE 89 B5 39>)
(   3,<2005-09-23 11:05:47.96 +100>,<MAYBRIDGE\NMR>,<NMR_250MHZ>,
      <apk 
       data hash MD5: 32K
       D0 44 10 9A A6 3A 83 E5 D2 67 72 6B A9 2F FD 85>)
(   4,<2005-09-23 11:05:48.74 +100>,<MAYBRIDGE\NMR>,<NMR_250MHZ>,
      <abs ABSG = 5 
       data hash MD5: 32K
       85 69 5C D0 08 12 D1 AF 3C CD B6 A2 8D 15 29 21>)
$$ ##END=
$$ 
$$ hash MD5
$$ 26 33 E9 3D 6A CC D1 3C B1 D7 54 4B CB CA 7E E8
##$RELAX= 
##$RELAX= 
##$RELAX= 
##$RELAX= 
##$RELAX= 
##$RELAX= 
##$RELAX= 
$$ Bruker specific parameters
$$ --------------------------
##$DU= <C:\u>
##$EXPNO= 9890
##$NAME= <ADRS>
##$PROCNO= 1
##$TYPE= <nmr>
##$USER= <dgb>
##$AMP= (0..31)
100 100 100 100 100 100 100 100 100 100 100 100 100 100 100 100 100 100 
100 100 100 100 100 100 100 100 100 100 100 100 100 100 
##$AQSEQ= 0
##$AQ_mod= 3
##$AUNM= <au_zg>
##$AUTOPOS= <19 >
##$BF1= 250.13
##$BF2= 250.13
##$BF3= 250.13
##$BF4= 250.13
##$BF5= 500.13
##$BF6= 500.13
##$BF7= 500.13
##$BF8= 500.13
##$BYTORDA= 1
##$CFDGTYP= 0
##$CFRGTYP= 5
##$CHEMSTR= <none>
##$CNST= (0..31)
1 1 145 1 1 1 1 1 1 1 1 1 1 1 1 1 1 1 1 1 1 1 1 1 1 1 1 1 1 1 1 1 
##$CPDPRG= <>
##$CPDPRG1= <>
##$CPDPRG2= <>
##$CPDPRG3= <>
##$CPDPRG4= <mlev>
##$CPDPRG5= <mlev>
##$CPDPRG6= <mlev>
##$CPDPRG7= <mlev>
##$CPDPRG8= <mlev>
##$CPDPRGB= <>
##$CPDPRGT= <>
##$D= (0..31)
0 1 0 0 0 0 0 0 0 0.06 0 0 0 0 0 0 0.0002 0 0 0 0 0 0 0 0 0 0 0 0 0 0 
0 
##$DATE= 1127469933
##$DBL= (0..7)
120 120 120 120 120 120 120 120 
##$DBP= (0..7)
150 150 150 150 150 150 150 150 
##$DBP07= 0
##$DBPNAM0= <>
##$DBPNAM1= <>
##$DBPNAM2= <>
##$DBPNAM3= <>
$$ [...]
##$SUBNAM7= <"">
##$SUBNAM8= <"">
##$SUBNAM9= <"">
##$SW= 20.6930455092707
##$SWIBOX= (0..15)
0 0 3 0 0 0 0 0 0 0 0 0 0 0 0 0 
##$SW_h= 5175.983436853
##$TD= 65536
##$TD0= 1
##$TE= 295.16
##$TE2= 300
##$TE3= 300
##$TEG= 300
##$TL= (0..7)
0 120 120 120 120 120 120 120 
##$TP= (0..7)
150 150 150 150 150 150 150 150 
##$TP07= 0
##$TPNAME0= <>
##$TPNAME1= <>
##$TPNAME2= <>
##$TPNAME3= <>
##$TPNAME4= <>
##$TPNAME5= <>
##$TPNAME6= <>
##$TPNAME7= <>
##$TPOAL= (0..7)
0.5 0.5 0.5 0.5 0.5 0.5 0.5 0.5 
##$TPOFFS= (0..7)
0 0 0 0 0 0 0 0 
##$TUNHIN= 0
##$TUNHOUT= 0
##$TUNXOUT= 0
##$USERA1= <user>
##$USERA2= <user>
##$USERA3= <user>
##$USERA4= <user>
##$USERA5= <user>
##$V9= 5
##$VALIST= <valist>
##$VCLIST= <CCCCCCCCCCCCCCC>
##$VD= 0
##$VDLIST= <DDDDDDDDDDDDDDD>
##$VPLIST= <PPPPPPPPPPPPPPP>
##$VTLIST= <TTTTTTTTTTTTTTT>
##$WBST= 1024
##$WBSW= 4
##$XGAIN= (0..3)
0 0 0 0 
##$XL= 0
##$YL= 0
##$YMAX_a= 316916
##$YMIN_a= -360399
##$ZGOPTNS= <>
##$ZL1= 120
##$ZL2= 120
##$ZL3= 120
##$ZL4= 120
##$ABSF1= 16.522
##$ABSF2= -4.171173
##$ABSG= 5
##$ABSL= 3
##$ALPHA= 0
##$AQORDER= 0
##$ASSFAC= 0
##$ASSFACI= 0
##$ASSFACX= 0
##$ASSWID= 0
##$AUNMP= <proc_1d>
##$AZFE= 0.1
##$AZFW= 0.1
##$BCFW= 0
##$BC_mod= 0
##$BYTORDP= 0
##$COROFFS= 0
##$CY= 12.5
##$DATMOD= 1
##$DC= 0
##$DFILT= <>
##$DTYPP= 0
##$F1P= 14.0000005364418
##$F2P= -0.99999901652339
##$FCOR= 0.5
##$FTSIZE= 32768
##$FT_mod= 6
##$GAMMA= 0
##$GB= 0
##$INTBC= 1
##$INTSCL= 1
##$ISEN= 128
##$LB= 0.3
##$LEV0= 0
##$LPBIN= 0
##$MAXI= 10000
##$MC2= 0
##$MEAN= 0
##$ME_mod= 0
##$MI= 0
##$NCOEF= 0
##$NC_proc= -4
##$NLEV= 6
##$NOISF1= 0
##$NOISF2= 0
##$NSP= 0
##$NTH_PI= 0
##$NZP= 0
##$OFFSET= 16.522
##$PC= 1
##$PHC0= -84.10262
##$PHC1= 7.380491
##$PH_mod= 1
##$PKNL= yes
##$PPARMOD= 0
##$PSCAL= 4
##$PSIGN= 0
##$REVERSE= no
##$SF= 250.13
##$SI= 32768
##$SIGF1= 0
##$SIGF2= 0
##$SINO= 400
##$SIOLD= 32768
##$SREGLST= <1H.DMSO>
##$SSB= 0
##$STSI= 32768
##$STSR= 0
##$SW_p= 5175.98343685301
##$SYMM= 0
##$S_DEV= 0
##$TDeff= 65536
##$TDoff= 0
##$TI= <Analysis number 999999
Compound Code 99
Book Reference 9
Project Code 9>
##$TILT= no
##$TM1= 0
##$TM2= 0
##$TOPLEV= 0
##$USERP1= <user>
##$USERP2= <user>
##$USERP3= <user>
##$USERP4= <user>
##$USERP5= <user>
##$WDW= 1
##$XDIM= 32768
##$YMAX_p= 387336215
##$YMIN_p= -315988
$$ End of Bruker specific parameters
$$ ---------------------------------
##NTUPLES= NMR SPECTRUM
##VAR_NAME=  FREQUENCY,     SPECTRUM/REAL,   SPECTRUM/IMAG
##SYMBOL=    X,             R,               I
##VAR_TYPE=  INDEPENDENT,   DEPENDENT,       DEPENDENT
##VAR_FORM=  AFFN,          ASDF,            ASDF
##VAR_DIM=   32768,         32768,           32768
##UNITS=     HZ,            ARBITRARY UNITS, ARBITRARY UNITS
##FACTOR=    0.157963299565203, 1,           1
##FIRST=     4132.6476996994, 0,             0
##LAST=      -1043.33573715361, 0,           0
##MIN=       -1043.33573715361, -315988,     0
##MAX=       4132.6476996994, 387336215,     0
$$ Real data points
##PAGE= N=1
##DATA TABLE= (X++(R..R)), XYDATA
$$ [...]
19393E7075755k662842k466382K95816M751334O634475M914343J451623m234332
19385F5759790r198709j1264161j1390356r518136o812375m511951k921688j904610
19377H237804j222479r57258n26882k90076l55163k32356k42539j61610p1939
19368D177502m5404L816Q8196P7759j19069l4605J70635J97315K57622M32995
19358E206762O20377R75508J323480J849341K881948M671700P285805R958876
19350C4773797R958738N972773J958027q8849J221063M906704N598632K900628
19342F7201513J176401Q67186J333948L46007r14105j583963k474187m837394
19334F1115406p704878j0010232j0765712r203170o545453m300205k858504j916148
$$ y = [57075755, 54412913, 51946531, 52242347, 56993681, 63628156, 68542499, 69994122, 65759790, 56561081, 45296920, 33906564, 24388428, 17576053, 13064102, 10142414, 8237804, 7015325, 6058067, 5531185, 5241109, 4885946, 4653590, 4411051, 4249441, 4177502, 4132098, 4135914, 4224110, 4301869, 4182800, 4148195, 4318830, 4516145, 4773767, 5206762, 5827139, 6802647, 8126127, 9975468, 12857416, 17529116, 24814921, 34773797, 44732535, 50705308, 52663335, 52574486, 53795549, 58702253, 64300885, 67201513, 68377914, 69245100, 70579048, 70925055, 70010950, 68426987, 65952800, 61115406, 53410528, 43400296, 32634584, 23431414, 16885961, 12585756, 9727252, 7811104]
19326G811104j260423r53062p99721o02026m26795l06016k52915k30272j65451
19317B814423j81564k28626j85086j42399r7311j83360j92292j40355j10655o5251
19307A287524l8987j31390j34015j13560j1414m1453m1527r6414M066J0249j6987
19296F76092q1941j19430k3926N1489L7112j7115n0894p2138L7730M0732P4135
19285E51846J9429n9759n6163q553P489R438Q3964P9685M4159J1136N9547n588
19273G36630M66L8191J6447p2153r4506n9844l4266n5068K0517j14443o6338l0696
19261B84937j16899r5339p6153l8694J9111M6695K4807L8582M7821m7956k4913
19250F1999p646M2923R6819L2877n1123j0810L3337P9557l3466J9333O543n7048
$$ y = [7811104, 6550681, 5597619, 4797898, 4195872, 3769077, 3463061, 3210146, 2979874, 2814423, 2632859, 2404233, 2219147, 2076748, 1979437, 1796077, 1603785, 1463430, 1352775, 1287524, 1248537, 1117147, 983132, 869572, 858158, 816705, 775178, 678764, 682830, 693079, 676092, 594151, 474721, 450795, 502284, 539396, 522281, 471387, 399249, 436979, 477711, 551846, 571275, 511516, 455353, 446800, 454289, 463727, 547691, 627376, 671535, 682671, 742218, 736630, 737096, 775287, 791734, 719581, 625075, 565231, 530965, 475897, 496414, 381971, 315633, 284937, 168038, 72699, -3454, -42148, -23037, 23658, 48465, 87047, 134868, 86912, 61999, 54353, 97276, 194095, 226972, 175849, 165039, 198376, 277933, 244467, 263800, 270343, 213295]
19238B13295n9013l9186J1667J600L1206p771J07766R4238Q188Q825k7361J5310
19226C58764J6609j1754n2263j19051L1666J9188l7822r6066l1423L4770P894
19215A20512q9609n692l9395o1634j2130j5958L419k7271n8951M2574N1271J7971
19203g4893q976N5277M325N827K4576j5366M9989K5409k1664p0718M479j5136
19191c6871L491J9616O1579N4614o6007l99O560p5063K7587J5969J5126J19905
19179A46107k0797o9361L8567N5843j1865O1530K9208m4436K6596j3928n6387
19168A41077K724J7433l6467k0826m8434K0392j0247m9525K2323K9706J1456m6922
19156C2690M1536K0819l9980j603Q0132m7438N1067m1882m3859k1500K1063J5678
$$ y = [213295, 154282, 115096, 126763, 128363, 159569, 151798, 259564, 353802, 361990, 370815, 343454, 358764, 375373, 363619, 311356, 192305, 223971, 243159, 205337, 109271, 77848, 112618, 120512, 30903, 25211, -14184, -75818, -87948, -103906, -100487, -127758, -186709, -144135, -92864, -74893, -83869, -28592, -24267, -18440, 6136, -9230, 40759, 66168, 44504, -26214, -21735, -36871, -33380, -13764, 47815, 102429, 36422, 36023, 42583, -32480, -4893, 11076, 26202, 146107, 125310, 55949, 94516, 150359, 138494, 200024, 229232, 184796, 211392, 197464, 141077, 143801, 161234, 124767, 103941, 55507, 75899, 65652, 16127, 38450, 68156, 79612, 32690, 74226, 95045, 55065, 53462, 133594, 86156, 137223, 95341, 51482, 29982, 51045, 66723]
19144F6723J40620P8224k3405p3333q676l8892j818o1685k8300O2050R4982M3952
19132B50442K8879N6748p799j4685L9552N0700K2099K4426O5232k0264m4671k269
19120D48390p8367l9320j7110k1894p7617j08920l8606Q8331Q9726J8494p8968
19109A84139m7319m9160n8814j7343K6291n7798k2315M7770R5943K5746O1863
19098A89003l6346o6210p1650l114J6203L9037J8337M9392P232m6303n9340n5439
19086a9198Q0830J3988j6215J23724O2569l1063m3173J08928J07687Q9589L5003
19075E12669J26702k4967l4045M2879K3701n0179l2775m5129j6367J0788N1453
19064E64730l7346r6190J1144r5346P123k6313j16249r7081l7719M9184Q0069
$$ y = [66723, 207343, 285567, 262162, 188829, 180153, 141261, 139443, 77758, 49458, 111508, 206490, 250442, 279321, 336069, 328270, 313585, 353137, 403837, 425936, 450362, 515594, 495330, 450659, 448390, 370023, 330703, 313593, 291699, 214082, 105162, 66556, 154887, 244613, 263107, 184139, 136820, 87660, 28846, 11503, 37794, -20004, -42319, 5451, 101394, 127140, 189003, 152657, 86447, 14797, 11683, 27886, 66923, 85260, 134652, 141884, 95581, 36241, -19198, 61632, 75620, 59405, 183129, 245698, 214635, 171462, 280390, 388077, 477666, 512669, 639371, 614404, 580359, 623238, 646939, 596760, 563985, 518856, 502489, 513277, 564730, 527384, 431194, 442338, 346992, 354115, 327802, 211553, 114472, 76753, 125937, 206006]
19053B06006J1567K6847j10557j21424L4253O3957j4458m240p649L5126M769L6645
19041A60842l3565k3116o3745M456J00494o647N6431L2946K4894M1285O1569J06847
19029D62691P1240M5401K1078j5927O7478O520j22920j9912Q4200O587N5898J05902
19017G68236Q597j22440p2597L377j04793j52760q7431m6410o4678q3645j3415
19006C2041j68K7574J18435p65m7500R8032n0558o1098l5616p099R346q062o5657
18993H905j515j8047N6634N0668j1043r164n901l6354L0542Q4245l2097o0462
18981E6411k6586N2820K2194J4109J0731j1517m4535o8106J11437K6382K9797
18970A73137R9391Q7622q9900n363K3033M5586L1804l3896n9098p4298j01542
$$ y = [206006, 217573, 244420, 133863, 12439, 46692, 110649, 96191, 91951, 84302, 119428, 124197, 160842, 127277, 104161, 40416, 44872, 145366, 138719, 195150, 228096, 252990, 294275, 355844, 462691, 533931, 579332, 600410, 584483, 651961, 658481, 535561, 515649, 599849, 606436, 662334, 768236, 776833, 654393, 581796, 585173, 480380, 327620, 240189, 193779, 129101, 45456, 32041, 31873, 59447, 177882, 177117, 129617, 227649, 177091, 115993, 80377, 73278, 82624, 74562, 8905, 7390, -10657, 45977, 96645, 85602, 76438, 70537, 34183, 64725, 148970, 116873, 56411, 29825, 82645, 104839, 118948, 129679, 118162, 73627, 5521, 116958, 143340, 173137, 272528, 360150, 270250, 264887, 287920, 333506, 365310, 331414, 272316, 198018, 96476]
18959I6476n1220p775p3975q200k016Q339O9716N1888K7818o2968m4296p2600
18947f8813L6986j5637J7780J00544M8899j5173p187O199k9716J4472p7063q4002
18935g2711J1306J7691l4793l7624M6793J9249M7754O0961N8480r801k9595o5826
18923A1884J4190n674q070k6504j8544N2317N9901K5686m2965p0266l3085l8510
18911g9640l6685n8951J6279J15678j8826r6332n1303O5762P0962J8439o8218
18900a22835K7483M9069r078k385N7740j8072Q466R6716M6981k0967o3543K3775
18888G3350J02674j1613L0194J8527J9723k2900m332Q6069R8129j3107n6581M1168
18876C61301l093q0128J05557L9573q764M0141j244n5217m3035k5021l5252j0167
$$ y = [96476, 45256, 37481, -36494, -44694, -46710, -38371, 31345, 83233, 111051, 48083, 3787, -68813, -31827, -47464, -29684, 70860, 119759, 104586, 97399, 103598, 73882, 88354, 11291, -72711, -61405, -43714, -78507, -116131, -69338, -50089, -2335, 58626, 117106, 107305, 77710, 11884, 26074, 20400, 12330, -14174, -32718, 19599, 79500, 105186, 62221, -8045, -41130, -79640, -116325, -175276, -158997, -43319, -62145, -158477, -209780, -144018, -73056, -54617, -122835, -95352, -46283, -55361, -57746, -6, -18078, -9612, 87104, 134085, 113118, 49575, 73350, 176024, 164411, 194605, 213132, 232855, 209955, 205623, 291692, 389821, 376714, 320133, 361301, 358208, 278080, 383637, 423210, 414446, 454587, 453343, 398126, 355091, 330070, 294818, 284651]
18864B84651k6191j2046q9550O868J05119k0867o9866m2277n8163K7393K2968
18853A28039k4071L0215k2545O1133N4762K2764M7749R6j1525M586j2906n2504
18841B25793o9145m7361L2797l9312n647R627N9852M6690N5589K3040Q3024O0058
18829D35005k0331k3022K5733J11142M3639j7212j01791m8642o5732M9769J01113
18818D89671p4971m5521k2712j8597j4546k4333o9291k6913M6412n284O1116N155
18806C00186q2526n3418o7391j2345J03749J37218L6739j2468k8156n1273p0854
18795A99461o6346j1634K2216J3512Q1858P2748o3690p1419p5680m293j8986M4728
18783A22475k5714l8118m3265N9952M0982K3625L5367j7090l3990m9223L7915
$$ y = [284651, 258460, 246414, 156864, 163732, 268851, 247984, 178118, 135841, 77678, 105071, 128039, 103968, 134183, 111638, 172771, 227533, 250297, 298046, 298142, 286617, 291203, 278297, 225793, 156648, 109287, 142084, 102772, 97125, 106752, 166604, 213294, 268883, 291923, 374947, 435005, 414674, 391652, 417385, 528527, 572166, 554954, 453163, 404521, 338789, 388558, 489671, 414700, 369179, 346467, 327870, 313324, 288991, 219700, 192787, 239199, 233915, 295031, 300186, 217660, 164242, 96851, 84506, 188255, 325473, 362212, 349744, 321588, 270315, 199461, 133115, 121481, 143697, 157209, 239067, 311815, 248125, 176706, 101026, 96733, 77747, 122475, 96761, 58643, 15378, 75330, 116312, 139937, 175304, 158214, 124224, 75001, 112916]
18772A12916j04885p2690M7246R4046n2211k4481Q4327J24903N3121J3119m695
18761B70716J5400r0939n7584M8400O9392P2620M9566m5445j2937O2816m3674
18750C38331J6584kp9736k2580l1368N9981J6377j2842K3367m745j0339k0479
18738B72549M8214l2605j42793j00955j00265p6190O3865M5498J34160N3594J5977
18727A81049J01289j0292o2728j2926O9528M461m4876N8721k982k48l4032J6551
18715B63515N9279Q4022O9159p417j3489N088m5665M502J2966j5755R0042R4891
18703F01138Q6757N2633L0713P0474M6846r7306k0420O7652L8245J31666O2500
18692A070898J10430k0273o0046N0923O5327N3006N9664J61552J03655J44849
$$ y = [112916, 8031, -64659, -17413, 76633, 24422, -59, 84268, 209171, 262292, 275411, 270716, 286116, 195177, 137593, 185993, 255385, 328005, 377571, 332126, 319189, 382005, 338331, 354915, 354913, 275177, 252597, 221229, 281210, 297587, 284745, 308112, 303367, 293028, 272549, 320763, 288158, 145365, 44410, -55855, -132045, -68180, -22682, 111478, 165072, 181049, 282338, 272046, 209318, 196392, 265920, 270381, 225505, 284226, 281244, 280996, 246964, 263515, 322794, 406816, 475975, 468558, 455069, 460157, 414492, 418994, 431960, 416205, 506247, 601138, 687895, 740528, 771241, 841715, 888561, 791255, 770835, 838487, 876732, 1008398, 1070898, 1181328, 1161055, 1101009, 1151932, 1217259, 1270265, 1329929, 1491481, 1595136, 1739985]
18682A739985J82811K26523L41585M02538O17084J063075J604104K430555M054036
18673A2662296N925750O212814L028243n77043l261991m347841l041089o12785
18665A5988354K269176N163072O407005L326472j206094m629430o807477o122754
18657A4388324m073453k494755j520405j027672p37464n07721l39902k46005j72501
18648C268446j5008q283K0075p533P0750j6299k7275P1025J30042J82970L48509
18637D017419L95797N70602O65059R58098J424866J884392K730444M221237O831622
18628B3699536J0517249J4071125J2835863N706565m07568n091260p353066n780873
18620D8197571k395955J546422N735226O840665K459325k588162n801781o100601
$$ y = [1739985, 1922796, 2149319, 2490904, 2893442, 3510526, 4573601, 6177705, 8608260, 12662296, 18588046, 24800860, 27829103, 27252060, 23990069, 19642228, 16601139, 15988354, 18257530, 23420602, 29827607, 33154079, 31947985, 27318555, 20511078, 14388324, 10314871, 7820116, 6299711, 5272039, 4534575, 4026854, 3686952, 3440947, 3268446, 3253438, 3245155, 3265230, 3257697, 3328447, 3312148, 3284873, 3355898, 3485940, 3668910, 4017419, 4413216, 4983818, 5648877, 6606975, 8031841, 9916233, 12646677, 16867914, 23699536, 34216785, 48287910, 61123773, 66830338, 66422770, 61331510, 53978444, 48197571, 45801616, 47348038, 53083264, 59923929, 62383254, 59795092, 53993311, 47892710]
18612D7892710m211948m326528n382486o364135o734197n444617l700053k380964
18604I347782j521311r73604p57854n39938k97178l01939k24693j55201j23464
18595D452600j87120j25964q4662M412Q2187J59070K62037L14053M93092N56094
18585E925799O26045R68071J411683K165301L297070N414862Q925789J3193889
18577D1928509J4170908P075069j651809q076103j1458119r556379n190864j169378
18569B6071834K612431O836628J0494098R136453K073750m120433q840337j0001048
18561C4263376p095697l314772J23116L356661P033421J0640400J0888266N707592
18553F1602363j093948o684614r446461p875429l801833Q60006N766003J0482664
$$ y = [47892710, 43680762, 39354234, 33971748, 27607613, 20873416, 15428799, 11728746, 9347782, 7826471, 6852867, 6095013, 5555075, 5257897, 4955958, 4731265, 4576064, 4452600, 4265480, 4139516, 4054854, 4059266, 4141453, 4300523, 4562560, 4876613, 5369705, 5925799, 6551844, 7519915, 8931598, 11096899, 14393969, 19808831, 28734620, 41928509, 56099417, 63174486, 61522677, 53446574, 41988455, 32432076, 27241212, 26071834, 28684265, 35520893, 46014991, 55151444, 57225194, 53104761, 44264424, 34263376, 27167679, 23852907, 23976023, 27332684, 34366105, 45006505, 55894771, 61602363, 60508415, 53823801, 44377340, 36501911, 32700078, 33560084, 39326087, 49808751]
18545D9808751J1289293N277556k900820r388983j2877580j1719867q312835n371938
18537A5803577l457927k277998j629244j225664q91233o36204m72776l14107j90870
18528D707554j77243j76580j60940p9689l0195J30887K52180K35377J80512K78232
18518E160095L70903M82569O83370J016322J570958K400764L719768N659964P526943
18509B8591656P830299O435648N669937N654579M876886J874677j681065m311796
18501E4940821m556741j517524K367607N300774O727810L710863k845920q088153
18493E6039537j1517855j2026760r446071o319053m096369k687247j778137j383139
18485F784906j095996p39093m72077l27401k56078k29759k36438j42830j51661
$$ y = [49808751, 61098044, 66375600, 63474780, 54085797, 41208217, 29488350, 21175515, 15803577, 12345650, 10067652, 8438408, 7212744, 6321511, 5685307, 5212531, 4898424, 4707554, 4530311, 4353731, 4192791, 4113102, 4082907, 4213794, 4465974, 4701351, 4881863, 5160095, 5530998, 6013567, 6696937, 7713259, 9284217, 11684981, 15404749, 21064713, 28591656, 36421955, 42857603, 48527540, 54182119, 59059005, 60933682, 59252617, 54940821, 50384080, 48866556, 51234163, 56534937, 63262747, 66973610, 64127690, 56039537, 44521682, 32494922, 23048851, 16729798, 12633429, 9946182, 8168045, 6784906, 5688910, 4949817, 4477740, 4150339, 3894261, 3664502, 3428064, 3285234, 3133573]
18476C133573m5792m4204r3937m9458P5998J24473J40316J05841J48688L52486
18466C847984M34072O79181J175261J769360K841179M567694O030120N241605
18458B6586456J969891j325387l692281m207343k697135l9681K376225L558636
18450B2529381K211612n76462l035957m659221m815234l621371k179657j351460
18442D501631q89009p14300o12745m30144k23284j32842j85015j74317j6679l2410
18432A090886M3966j07183j30705q4316K9749L5297l0278l27k3282p8632m1841
18421G03334m8813l5099j634J0904m4107r4388j24083j8819l0569n3584J9853
18410B82995N368k6689L5184j6222k5058j07400j6632J4140o1902M6855J46481
$$ y = [3133573, 3087781, 3043577, 2949640, 2900182, 2976180, 3100653, 3240969, 3346810, 3495498, 3847984, 4282056, 4961237, 6136498, 7905858, 10747037, 15314731, 21344851, 26586456, 28556347, 27230960, 23538679, 19331336, 16634201, 16594520, 18970745, 22529381, 24740993, 24164531, 21128574, 16469353, 11654119, 8032748, 5853091, 4501631, 3612622, 2898322, 2285577, 1855433, 1632149, 1499307, 1314292, 1139975, 1123296, 1090886, 1134852, 1027669, 896964, 812648, 842397, 877694, 847416, 847089, 823807, 745175, 703334, 654521, 619422, 617788, 628692, 584585, 490197, 366114, 347295, 316726, 263142, 282995, 288363, 261674, 296858, 280636, 255578, 148178, 131546, 145686, 83784, 130639, 277120]
18399B77120P6401N099p4840J16290K495p3955j68409j2164J7084k7167K2030
18388A59984J161M9677j4172L9323P4198k4452j21572K3394N6302m4486l9869
18377A59488J7133r89p6155J9948K27N1938m2353O807l1473j13154l1203N0994
18365A1208J5066k3786j20570j1280J39319M2224j7257m5508J9215R252k819N5103
18353G0167J0906q6231J3037K477m6763n827K2646K9438m3008L0026j5966j6315
18341c5413L7588J06420N4233k4762r430k9030J2005O4656M3321l08j8406m9850
18329A51024j5770r0462j9020R3182p7130j2200J5746n3854M3907j1147K2546
18318D6822R074j2084l024L6676k3388L049J06456J0594l6490q2312K6581K393
$$ y = [277120, 353521, 358620, 283780, 400070, 402565, 328610, 160201, 148037, 165121, 137954, 159984, 161145, 210822, 196650, 235973, 310171, 285719, 164147, 187541, 243843, 199357, 159488, 176621, 175632, 99477, 119425, 119652, 171590, 129237, 136044, 104571, -8583, -39786, 11208, 26274, 2488, -118082, -129362, 9957, 52181, 34924, -10584, 8631, 17883, 15064, 70167, 81073, -5158, 7879, 10356, -36407, -42234, -19588, 9850, -33158, -3132, -19098, -35413, 2175, 108595, 162828, 138066, 128636, 99606, 111611, 176267, 219588, 219280, 200874, 151024, 135254, 44792, 25772, 118954, 41824, 29624, 45370, -8484, 35423, 24276, 46822, 55896, 43812, 40788, 77464, 54076, 57125, 163581, 174175, 137685, 55373, 81954, 84347]
18306H4347L1584n1750J819M1693N2068L8403o6291J0480j44822l8656Q5176K4856
18294F8907P0327M7460l1927J3668o5701j03560j1871M7990M8903L7199L7482
18283A58877K783m4965n1066m0945j24535M510Q290N0304m6272o7275N2319K8577
18271f9398o182K7024L7301R8549j5323q9168q7017L3784K6762l3444O3928Q985
18259d199k3492O812K5810M9870M4435l9706J914K984l7019O3810J07911J33074
18247C32204p6414m0898P378k3714n2583p7300j7055n6658j1467j824Q455L8812
18235B8936l4702L932K4894j6977k1582K3056k6205p9157K2060Q9636l840J2596
18223B2647R2216K2475K9060R3436k4930n3876p8544r3472M1205J1988l4726n6411
$$ y = [84347, 115931, 64181, 66000, 107693, 159761, 198164, 131873, 142353, -2469, -41125, 44051, 68907, 139234, 186694, 154767, 168435, 102734, -826, -12697, 35293, 84196, 121395, 158877, 161660, 116695, 65629, 24684, -99851, -95341, -87051, -36747, -83019, -150294, -97975, -69398, -75580, -48556, -11255, 87294, 71971, -17197, -104214, -70430, -43668, -77112, -13184, -4199, -27691, -20879, 4931, 54801, 99236, 59530, 61444, 64428, 27409, 91219, 199130, 332204, 255790, 214892, 222270, 198556, 145973, 68673, 51618, -5040, -16507, -18331, -9876, 28936, -5766, -1834, 23060, 6083, -15499, 7557, -18648, -97805, -75745, 13891, 10051, 22647, 114863, 137338, 166398, 259834, 234904, 181028, 102484, 9012, 50217, 62205, 27479, -28932]
18211b8932m9082n404J3032L7906j5513P7563L5947j7437M8308M8384o840j5644
18199A22288L6313L3587l1705m9208j611M9644r0932q3597j9629k5601m005J7070
18187d7386L9252n554J246j28220p7483L2216M3852N0010L9052p204o408m0807
18175a07434k851R5750K1120L245n1198o9568J01617j5626p315L9841O8741m8754
18163B7568k9669n8906k5581N1874Q9957L6601q1979J7127Q8911N3925R7578m6564
18151B20842L0113l0376K5323q176o0836J6441l726M725J5018K9952l3881j09670
18139I5749o2362K5703M1527j7053j3195j4381j04985l7782N5939M2337J03872
18128A15369j4702J3654K9369L1494j5977j672j06604k0731O3153O259l5778L2669
$$ y = [-28932, -78014, -83418, -70386, -32480, -47993, 29570, 65517, 48080, 96388, 144772, 137932, 122288, 158601, 192188, 160483, 111275, 109664, 159308, 68376, -15221, -34850, -60451, -64456, -47386, -8134, -13688, -12442, -140662, -218145, -185929, -142077, -92067, -53015, -60219, -66627, -107434, -110285, -14535, 6585, 9830, -41368, -110936, -9319, -24945, -32260, 7581, 76322, 27568, -2101, -61007, -86588, -34714, 55243, 91844, 9865, 26992, 115903, 169828, 267406, 220842, 250955, 220579, 245902, 237726, 176890, 193331, 189605, 194330, 209348, 239300, 205419, 95749, 33387, 59090, 100617, 83564, 70369, 55988, -48997, -86779, -30840, 11497, 115369, 100667, 114321, 143690, 175184, 159207, 157535, 50931, 30200, 93353, 99612, 63834, 96503]
18116I6503M5043k5343j3319l6088k2721P5457L1097P0128o680j5713n0708j7135
18104A30521N7261J5570J1483K8578J2181k281j8924O2700k2877m9433Q021J3739
18092B46539L5292L5648o5494p0152j8741j2862n895l3612j58733O5252O1707
18081G8949p1954o6038p5898L7813K9588K4882p022m8665j7309L897k1835l9907
18069a73499l59K9046J33062N2262k5358m397J8193M6598j9162n0828K9684m2139
18057f897k3323N2404J7483J07194l9089M402Q4015j7938j3295L2891l8189j5424
18045A44234j139O0424K0686N6732O4580K0067k2378r3694j86763k2764J17597
18034A57582n6971q2889J5841N1799m6923p8263l6211O9803r010n1847l5374J9774
$$ y = [96503, 141546, 116203, 102884, 66796, 44075, 119532, 150629, 220757, 214077, 198364, 147656, 130521, 187782, 203352, 214835, 243413, 255594, 253313, 234389, 297089, 274212, 224779, 232800, 246539, 281831, 317479, 251985, 181833, 163092, 150230, 144335, 110723, -48010, 17242, 78949, 6995, -59043, -134941, -97128, -67540, -42658, -49680, -98345, -115654, -111757, -133592, -173499, -173858, -144812, -11750, 40512, 15154, 10757, 28950, 75548, 56386, 5558, 35242, -6897, -30220, 22184, 39667, 146861, 107772, 112174, 196189, 178251, 164956, 197847, 159658, 144234, 143095, 203519, 224205, 280937, 345517, 365584, 343206, 249512, 62749, 39985, 157582, 100611, 17722, 33563, 85362, 38439, -39824, -76035, -6232, -15242, -67089, -102463, -82689]
18022h2689L5944P3432Q1774m3108p8558j8575N4935K1054n9356n7742j752J6518
18010e8123K5404M5956J3414p807J3724Q9197j6368o3532j7665n826K8180R1389
17998A37943L4019k1727P8534O1550K7369N3223o8452l6454K4568n9761j4530
17987B16282L6012k39l4055M60O2224k5617q0535j9882l1545k6243k9181l9007
17975B8674l4296R0402O5048m1509r0943r1409M8530O6456l2929n6512N2831J32693
17963A37036k0369p2633r6023m200L4494m4941j6640j4841K5800O2438M8701K1106
17951E9928k7441j4932k6427N977O190J6358O3716q395Q721M5492k1995R042P4799
17938A91033J9309p0906K054M977j39040n4487O8232k9317j4063N1792j2165l3460
$$ y = [-82689, -46745, 26687, 108461, 65353, -13205, -31780, 23155, 44209, -15147, -72889, -74641, -58123, -32719, 13237, 26651, 18844, 32568, 121765, 105397, 41865, 24200, 18374, 46554, 137943, 171962, 150235, 228769, 290319, 317688, 370911, 302459, 266005, 290573, 230812, 216282, 252294, 252055, 218000, 218460, 280684, 255067, 174532, 154650, 123105, 96862, 67681, 28674, -5622, 84780, 149828, 108319, 17376, -74033, -25503, 40953, 8024, -48488, 4343, 137036, 116667, 44034, -51989, -56189, -21695, -66636, -83276, -98117, -72317, -9879, 38822, 59928, 32487, 17555, -8872, -2895, 3295, 19653, 83369, 74974, 83695, 129187, 107192, 116234, 191033, 210342, 139436, 141490, 146467, 7427, -47060, 21172, -8145, -22208, 29584, 17419, -16041]
17926a6041j2238j0379l7245n5001k9734J01609N4322Q546J6190m4161L1960k5443
17914a7615m407K4877o2672m1365J3565L3635k5039p6344M8194Q7123Q9606P0133
17902A39691l4741p4937p8773r170K8757J1594Q6507n6779K403k5502j9213K8235
17890a928l618O3387L7904M991j2536o3950P9257N5359n312n1844m0797k1066
17878C9847l7426n8197o3819o162P2491j1270j5840l1184N1189P1575Q109K0042
17866C9355p070r9915n5614L6869P1319M1306K0578m625J4615k4689q7268m1420
17854i6559R1956N762l2386k3784L2964M7664Q2951Q355O7729N997n6519j28526
17842E604r1962j0039J08609P5906L3274n745m4989k4417m5812J2089L335k2281
$$ y = [-16041, -28279, -38658, -75903, -130904, -160638, -59029, -4707, 3839, 20029, -24132, 7828, -17615, -22022, 2855, -59817, -101182, -87617, -53982, -79021, -155365, -107171, -20048, 69558, 139691, 104950, 30013, -48760, -57930, -29173, -17579, 68928, 12149, 14552, -10950, -30163, -1928, -5546, 57841, 95745, 100736, 88200, 24250, 103507, 158866, 153554, 101710, 60913, 39847, 2421, -55776, -119595, -125757, -53266, -64536, -80376, -111560, -60371, 11204, 19313, 39355, 32285, -67630, -123244, -86375, -15056, 26250, 46828, 42203, 56818, 32129, -55139, -96559, -4603, 1159, -31227, -55011, -22047, 25617, 108568, 116923, 184652, 190649, 134130, 5604, -86358, -96397, 12212, 88118, 121392, 115647, 70658, 46241, 429, 12518, 15853, -6428]
17830f428l7579Q4280L6482j38217J660L7296L6844K5185j4785J5242k270k3319
17818A4391m4246n6904M8510O6882j0954o4938Q908N536o1600J1355N6916m0384
17806f6528L292K7934L8988m9923j5472K1089J20558J17811Q7750L1745N360m6592
17794B76012j27219L7251m5840p7341J5509K1749n4302q744n5992o465M0899P7741
17782I3258l3205k1483L473J8287n6313k0205O348N0181j7332m1430j4555N3063
17770B0087j4968n4979r8321J7675O7989j8448o2684R1517k682O6336Q5745j4400
17758H2867q2605N915m4484k1777K1405j0986k5820R6188L2241m7727K4037m1588
17746a2334p0352Q555J7532n278K441K4476L1348r8113n3216M2742Q7761L5805
$$ y = [-6428, -44007, 40273, 76755, -61462, -59802, -22506, 14338, 39523, 24738, 39980, 37710, 14391, -29855, -86759, -38249, 28633, 17679, -47259, -38351, -32815, -94415, -83060, -26144, -66528, -63236, -35302, 3686, -46237, -61709, -40620, 79938, 197749, 285499, 317244, 322604, 276012, 148793, 186044, 140204, 62863, 78372, 100121, 45819, 37075, -18917, -25382, 15517, 93258, 60053, 38570, 42043, 60330, 4017, -16188, -9840, 40341, 23009, -18421, -32976, 20087, 5119, -49860, -148181, -130506, -62517, -80965, -143649, -52132, -54814, 11522, 97267, 82867, 262, 6177, -38307, -60084, -38679, -49665, -75485, 20703, 52944, 5217, 29254, -12334, -82686, -74131, -56599, -61877, -59436, -34960, -3612, -101725, -154941, -112199, -24438, 11367]
17734A1367k3940l2720j0787O3673P464m1001J0080J29348N9784K6976l6687j5268
17722A48289l7406j1823N3003Q0166N6646K3997j41750j17250j00371L5370M2905
17711C1776l3910j2618n8795j3838P4773L8789p074j2336O6600P9342p7821o1021
17699A3867m8986l4757o863o007O5140o2783l483j9773j1560m3379K4167R4141
17687d0276K3196l8042k9971L828J04474K3123m7051M9997R8700N9542o9503J7276
17675A55293K4o9817j7624J9875P2326k7645R127o7794M6775M9578k3221j6522
17663A30375k0524n9147j22493r377N0091L0594J5880J3147r913m9386K1289j8841
17651b8305l1773J25007k4123k9719n0597p902k297L5937J9852o1942j19259M6757
$$ y = [11367, -12573, -45293, -56080, 7593, 15057, -25944, -15864, 113484, 173268, 200244, 163557, 148289, 110883, 99060, 152063, 232229, 288875, 312872, 171122, 53872, -46499, -11129, 31776, -2134, -14752, -73547, -87385, -12612, 26177, 19103, 6767, 73367, 152709, 74888, 13867, -35119, -69876, -76739, -82746, -17606, -80389, -83872, -103645, -115205, -158584, -134417, -40276, -17080, -55122, -85093, -81265, 23209, 46332, -719, 49278, 147978, 207520, 138017, 155293, 155317, 85500, 67876, 87751, 160077, 132432, 141559, 73765, 120540, 170118, 146897, 130375, 109851, 50704, -71789, -81166, -31075, -481, 15399, 28546, 18633, -30753, -9464, -28305, -60078, 64929, 40806, 11087, -39510, -47412, -49709, -13772, 6080, -55862, -175121, -128364]
17639a28364J10148k4383q4168M1560P0295N7377q740l8010J4230L2620l660o9172
17627c0267r873J3828m9153n0292J6815j0326m9027M2587J30363Q102m8466m5153
17615h0862O367j6925m6295M2739p82k061J478M3986o7025o34R2434O5608L6327
17602G4355k4541l4138L5131o6007o1597r5320m2839Q5581R7966L6742p3548p4200
17590a42415n0113N9374R5948K2852m3756m8912J8730R9845K3197L3834j3390
17579E5194p0328n5623l3291J10562O3785O9895k2017p0668q788n0437j1435r346
17567c2497P864K1377n0179K714p471j3530o9247M3402N1934L7478l9121K363
17555d4913J2948o1640l6961r467L0703K4854m2870m8148J7060K4988O1646J2753
$$ y = [-128364, -18216, -42599, -126767, -85207, -14912, 42465, 33725, -4285, 9945, 42565, 38905, -30267, -40140, -26312, -75465, -125757, -108942, -119268, -168295, -125708, 4655, 12757, -35709, -80862, -74495, -91420, -137715, -94976, -95758, -97819, -96341, -52355, -119380, -120014, -27580, 38028, 74355, 49814, 15676, 50807, -15200, -76797, -172117, -214956, -129375, -31409, 5333, -68215, -142415, -192528, -133154, -37206, -14354, -58110, -107022, -88292, 11553, 34750, 68584, 55194, -15134, -70757, -104048, 6514, 70299, 140194, 118177, 47509, 38721, -11716, -23151, -32497, -24633, -3256, -53435, -50721, -58192, -71722, -140969, -97567, -45633, -8155, -47276, -44913, -31965, -93605, -130566, -140033, -109330, -84476, -127346, -175494, -158434, -133446, -71800, -59047]
17543e9047j10803J4450P7251R7777n7065p399l1449j26427l3936P7423M9044
17532a10181k1179l8238k6143L7299m928n1039M5155M8416k9433l7176K5149J11386
17520e0912K1178m5063N9688O0963k5329o0039k165n378k543J05100M6280r4090
17508G690j2897o5389j9545K9229p3274K9322O7462K5247n5169J6196K3428q907
17496c6607m957K9235l4099j9831N328o7743n3786k0827J5616P3523j9395l2231
17484a65774J2200R4710l0951n8952M2849J8759P1991k09L1241P094o862n7656
17472d1560L5922K5479j9477l5525j3514m771k2075m778K004Q1436k9017n7741
17460h3617K0186M5600J08527n875m1090N4318q1898o4578P687K2233M698q3104
$$ y = [-59047, -169850, -155400, -78149, 19628, -37437, -44836, -76285, -202712, -236648, -159225, -110181, -131360, -169598, -195741, -158442, -163370, -214409, -169254, -120838, -150271, -187447, -162298, -50912, -29734, -74797, -15109, 45854, 20525, -39514, -41679, -47057, -49600, 55500, 101780, 7690, -5207, -70596, -90141, -60912, -134186, -104864, -37402, -12155, -67324, -51128, -27700, -36607, -41564, -12329, -46428, -66259, -60931, -128674, -182460, -203287, -187671, -114148, -133543, -165774, -153574, -58864, -89815, -148767, -105918, -87159, -15168, -15377, 15864, 22958, 16096, -41560, -5638, 19841, 364, -35161, -48675, -53446, -75521, -80299, -78295, 3141, -25876, -83617, -63431, -17831, 90696, 84821, 43731, 98049, 16151, -48427, -40740, -18507, -13809, -96913]
17448i6913l9762N2369L1304j5842J9699j1913L3433L2258l7004l0936K8949K103
17436c2255l9311n1835J7711O1801Q3905n7804j03820n6837R0921R5973l5151
17425b6702k9260l783K9644M5352J5846J6130p1347l5082J3707k1601K7843q421
17413d7674l1163L0088L5500Q384N2105o2129n9631l182J1296L6452l376n1909
17401h5239k8390N2338l554j0091O470l951J5037N9101j3971K3085L9965l9336
17389A1464j5923J9745K5693M8269j2158l9133n0960k1157N2876n3436p5244n4870
17377a64834R1995J765n862l2782M742p0175n2614J4318M161K429J0960J7279
17365a78618K1617L2515J977m5000k9066M8810K9645m071L6834o2886J6594J14110
$$ y = [-96913, -136675, -84306, -53002, -68844, -49145, -61058, -27625, 4633, -32371, -63307, -34358, -32255, -71566, -123401, -105690, -43889, 40016, -17788, -121608, -178445, -87524, 8449, -26702, -55962, -59745, -30101, 15251, 31097, 47227, -24120, -59202, -45495, -67096, -39253, -47674, -78837, -48749, -13249, -4865, 47240, -14889, -74520, -77702, -66406, -29954, -33330, -85239, -113629, -61291, -64845, -74936, -68466, -72417, -57380, 1721, -12250, 10835, 50800, 11464, -4459, 15286, 40979, 89248, 77090, 37957, -13003, -34160, 18716, -34720, -109964, -164834, -72839, -71074, -76936, -109718, -104976, -175151, -227765, -213447, -209286, -206857, -195897, -178618, -157001, -124486, -122509, -167509, -196575, -147765, -118120, -122191, -85357, -148243, -131649, -17539]
17353a7539J2327n1402n679N8879K2154J8405l0970j16134J9039j4782K0680M2833
17341d2189n4092J4571Q5599O9040r1445j04003j6523M4993K7822l3731J8303
17330h1655P4093J13183N4029l9560r2184n5137o4496L2521O3917O8621Q146k2489
17318E8989N8879J78577j2548r9550n3604n7146K0337J0842Q0791N0563J15287
17307C51417o7449o3690l1828p3019r2962J6937K9059P1945n2321j9899l3491
17296C4699q692j5109K4203J4289j6129p749k0254p0825l7760o387n4183P4188
17284h9709J1109n118J1440J4036K9634j3617k4376j0361N1631L9609K840q210
17272H908J2925J9432K9021k9953K2368L6647M7456M8797n9159l2525P6970j791
$$ y = [-17539, -5212, -56614, -62293, -3414, 18740, 37145, 6175, -109959, -90920, -105702, -85022, -42189, -96281, -81710, 3889, 72929, -18516, -122519, -139042, -94049, -66227, -99958, -81655, -7562, 105621, 159650, 120090, 27906, -27231, -91727, -59206, 4711, 73332, 81478, 58989, 117868, 296445, 283897, 184347, 130743, 73597, 93934, 104776, 185567, 236130, 351417, 283968, 220278, 188450, 115431, 22469, 39406, 68465, 140410, 88089, 68190, 34699, 26007, 10898, 35101, 49390, 33261, 25512, 5258, -65567, -103327, -109714, -163897, -89709, -78600, -83718, -72278, -58242, -28608, -42225, -66601, -76962, -25331, 14278, 17118, 8908, 21833, 41265, 70286, 40333, 62701, 99348, 146804, 195601, 136442, 103917, 180887, 179096]
17260A79096m3284k835P6455J0616m6769L7815m0271j07494j69477n6544Q6571
17249g6121Q2782j5423L1716K6681p1286L925j6731l7729P468j0929j22563N5380
17237a42830R9144j8939k1319j3774Q801O72J6375j5703l1889R380M1743R6366
17225B8027N82j03597n6094k5230j8382J2576m5552M7978Q1408p402J142j7121
17213a01665l6314m056R801N1897Q4932m6277l7282j6715R9749j3248o3562j5551
17201h8291M4002K69K9532K8635m6044j06078L609J21083M8452o1328l6K1276
17189d919o7723J6439k4209j5071K53j7412j0965J5644q905o207j8816R1138L3059
17176a7694M5978O8520o3079q0106M0286J5473n7297l7136k6262M5303o7454j7080
$$ y = [179096, 135812, 132977, 209432, 220048, 173279, 211094, 170823, 63329, -106148, -162692, -76121, 6661, -8762, 22954, 49635, -21651, -17726, -34457, -72186, -64718, -75647, -198210, -142830, -43686, -62625, -83944, -97718, -88917, -88245, -71870, -87573, -119462, -110082, -68339, 28027, 28609, -74988, -131082, -156312, -174694, -162118, -207670, -159692, -78284, -85686, -84544, -101665, -137979, -142035, -132234, -80337, 4595, -41682, -78964, -95679, 4070, -9178, -72740, -88291, -44289, -44020, -14488, 14147, -31897, -137975, -134366, -13283, 35169, -26159, -26195, -4919, -72642, -56203, -80412, -95483, -95230, -112642, -123607, -107963, -116868, -123075, -141891, -50753, -17694, 28284, 96804, 33725, -46381, -6095, 9378, -47919, -85055, -111317, -66014, -133468, -150548]
17164a50548M1749M645M2071P6642p8819J6983K3373J4779M4891n39J3744P98
17152D9769p7486j2998j3153J5684m372L7643j8620j52256n7685N0727q540L9796
17140a51491J34342N500j6823l7396n9228P070O1238P3576k8415l0522n7083L3396
17128f5836Q8198O8055n1259K0333q7538k3097J2345m3811M0014J07520m5586
17117A9338P300J9861m9003k2290M2581L8628J9042l2479j2759m0370j2711J5642
17105g220k9662O952P4094R4961j28216o0658n6825K3611R2219M8854k270o5624
17093i784r27m748j5738M0219N1733l2520o5420k2019O7014q749l3059k5111J452
17080e7657p915N62M037J6961J355M8711r5053L321M1746k6904o2951k3165J2510
$$ y = [-150548, -108799, -104154, -62083, 14559, -64260, -47277, -23904, -9125, 35766, 35227, 48971, 49769, -27717, -40715, -53868, -38184, -42556, -4913, -23533, -175789, -233474, -182747, -191287, -151491, -17149, -11649, -28472, -65868, -125096, -118026, -56788, 16788, -11627, -42149, -99232, -65836, 22362, 90417, 39158, 59491, -28047, -51144, -38799, -82610, -42596, 64924, 19338, 26638, 46499, -2504, -24794, 17787, 56415, 75457, 42978, 30219, -10151, -22862, -7220, -36882, -29930, 44164, 139125, 10909, -49749, -106574, -82963, 9256, 58110, 55840, -9784, -10711, -15459, -31197, 9022, 60755, 28235, -37185, -59204, 7810, -939, -33998, -59109, -57657, -65572, -65010, -60973, -44012, -42657, 6054, -88999, -85678, -43932, -70836, -133787, -156952, -144442]
17067a44442j7947Q7174J06180n4996j0926k0613M4235K8701j6645p2099M350
17056f7028Q841k1374l3971l1032j5871n7267M8935L9978m484n0588j1984P1546
17044a24299M2193N2318k7567l6812n943N9491P1346m6666m1360n1980l5284n7153
17032b01716K8097M7211p5676N3119R4550Q255l7120O7533o5006j8597P1932o0810
17020h8228l0532K5878j725O9034L7999K981k1703N6177j4194q3842L5697J201
17008a1257K2027K0778l8845m3286j1418k9875J837o244n8953K8156Q865m0347
16996a58562N0530J06161N3318l3924L5734N1368p8486r5672l7646q439P4754
16985d0864M1577o209R421o371k5866o6295m9144J38461O2868n1929k4866j5209
$$ y = [-144442, -162389, -75215, 30965, -24031, -34957, -55570, -11335, 17366, 721, -71378, -67028, -58187, -79561, -113532, -144564, -160435, -217702, -168767, -128789, -133273, -183861, -195845, -124299, -82106, -29788, -57355, -94167, -100110, -40619, 30727, -15939, -57299, -109279, -144563, -201716, -173619, -126408, -202084, -148965, -54415, -46160, -83280, -15747, -80753, -99350, -27418, -88228, -118760, -92882, -94607, -25573, 12426, 15407, -6296, 49881, 35687, -48155, -12458, -11257, 10770, 31548, -7297, -50583, -62001, -91876, -90039, -96283, -155236, -127080, -118215, -158562, -108032, -1871, 51447, 17523, 53257, 104625, 26139, -69533, -107179, -115618, -40864, 713, -5496, 3925, -2446, -28312, -94607, -143751, -5290, 57578, 5649, -19217, -34426]
16973c4426O9586r184p6755n5578l5227j178P5861L8850Q3177L7088l2682m2269
16961A7263l1360k5518n2463l3269Q1591P6237R239J3380n29K8603m3012k2435
16949A7727l5061l6105j6396n144j5972O4353L0659o5554j5863O2052N1647m2174
16937e831M7609p509n5810k2263j01476k5682Q6286M8172L184l5202K3520K5558
16925a9444j5714m1480Q3590N9669j8242n2942k3506p7246J8280k8326l430R3903
16913b4888L5759p319J8879m2901j12697O576L546M8206N4295n3779m1559J4721
16901a01161m0720j2233L9657o1492J5020K7705J3595N8700L8385K91j5442m0632
16889g8327N380O1961O9363l252m3662N9756M7805j08237q5854n6247Q394K4680
$$ y = [-34426, 35160, 25976, -50779, -106357, -141584, -142762, -66901, -28051, 55126, 92214, 59532, 17263, -14097, -39615, -92078, -125347, -43756, 32481, 41720, 55100, 54571, 83174, 40162, 17727, -17334, -53439, -69835, -74979, -90951, -26598, 4061, -61493, -77356, -15304, 36343, -5831, 41778, 34269, -21541, -43804, -145280, -170962, -84676, -36504, -33320, -68522, -45002, -19444, -35158, -76638, 6952, 66621, 48379, -4563, -28069, -105315, -87035, -115361, -118791, -24888, 10871, 3552, 22431, -20470, -133167, -126591, -123045, -74839, -20544, -74323, -115882, -101161, -141881, -154114, -114457, -175949, -160929, -133224, -119629, -60929, -22544, -22253, -37695, -78327, -72947, -10986, 58377, 55125, 11463, 71219, 119024, 10787, -75067, -131314, -122920, -98240]
16877i8240M3083J9453J596k3550K1555j241j04385j0782M3827m6047Q220O5777
16865h0734j6549m9173o0087L1100P0923K0778l9534m6163J13697J00256j2098
16854C2416p2332r3057O2989L7629m7111o8358K9077m9590o2916R1654J62475
16843B2876J75896k1079n1480J109l0117l1629k9999l350Q664L5737K0141m6261
16831E0508J2978J74q181K9257o1878n2506m7640R415K1375J106P398N013M9646
16818A6665n8342p4698j1028L4678O7724l7527k6602O3592N4804L1367j632j553
16806E7448L7348n0041j8873j2272j8519m6191n2931j5435R0273K4419q068L0963
16794A8121L3592j9726M7882M0434j4419n2157p245M9177N3639o6367K5944q708
$$ y = [-98240, -55157, -35704, -34108, -57658, -36103, -37344, -141729, -152511, -108684, -154731, -146511, -80734, -97283, -146456, -206543, -175443, -104520, -83742, -123276, -169439, -55742, 44514, 32416, -39916, -132973, -69984, -32355, -79466, -147824, -118747, -168337, -231253, -139599, 22876, 198772, 177693, 126213, 127322, 97205, 65576, 35577, 32227, 40891, 76628, 96769, 50508, 63486, 63660, 55479, 84736, 22858, -29648, -77288, -67873, -46498, -45392, -37994, -32981, 16665, -41677, -116375, -127403, -92725, -25001, -62528, -89130, -25538, 29266, 60633, 59001, 57448, 94796, 44755, 25882, 13610, -4909, -51100, -104031, -119466, -29193, -4774, -12842, 18121, 51713, 31987, 79869, 120303, 105884, 53727, 46482, 95659, 149298, 82931, 108875, 100167]
16782A00167p6316q6921p8652L1389K8552l6597K64P2234j454n5857l36J4734
16770h8793l1665m6090j903R3039O738j01238J7385N8473R7800K6650m1095N7368
16758D6669M6659j1695n6722l3412j3005O2427M100n4875J1672M1210n844P7815
16746A14999M8559N9328l1603q7290p7166n2180p303M9035N7296m8228n950k9633
16734a0136q0357o874K7861N486k1133Q866Q0646J4352k2517J9390Q446O0573
16722H4603m825j15970r1187J2252N4210Q207l9284M414j3076m0158L3673k1988
16710a29129P5516M9406n2939M35j0983O044j6745J17347O1961k3106m5560r1330
16698e9083l6004R0190L927o2322P865K4794N641R053o074J6980k2685J27838
$$ y = [100167, 23851, -63070, -141722, -110333, -81781, -118378, -118114, -45880, -47334, -103191, -103527, -88793, -120458, -166548, -168451, -75412, -68674, -169912, -152527, -94054, 3746, 30396, -10699, 46669, 93328, 81633, 24911, -8501, -21506, 40921, 45021, -9854, 1818, 43028, 37184, 114999, 163558, 222886, 191283, 103993, 26827, -25353, -32656, 16379, 73675, 25447, 19497, -10136, -90493, -97367, -69506, -64020, -85153, -76287, 4359, 18711, -3806, 15584, 24030, 84603, 79778, -36192, -127379, -115127, -60917, -52710, -91994, -87580, -100656, -140814, -107141, -129129, -53613, -4207, -57146, -56711, -67694, -61650, -78395, 38952, 100913, 77807, 32247, -59083, -95087, -4897, -970, -63292, -55427, -30633, -24992, -15939, -22013, -5033, -27718, 100120]
16686A00120K626j17428j00792m6808M0503L1710o5423j2349N4471n283p552J4091
16674a12114n5445K5239L3840j4999n7745q0229N4431J04149R0580j7748m6044
16663g6085l987m1114n6605M8170K1746k9868n1636P8748L0043N0766J16514r7831
16651a1139p6952P7380M3812M109q3373j0324J7481q2544k8041Q6972L9843l192
16639b5968k8107l5627j3861N475j1150Q9215n823n4612q8214j7116K2459O5282
16627i8047l7716O3691O5572o6652o9725N4184P6579o421r8350J2143K4269R5
16615h0378L750M4731P0561K3531J2607n7706k3415o346J19488n121r7047l0494
16603b5839n797J6884K5288l5535Q354k9890J0738m148n1860L2833J6959k2228
$$ y = [100120, 102746, -14682, -115474, -162282, -121779, -90069, -155492, -167841, -113370, -118653, -126205, -112114, -167559, -142320, -108480, -123479, -181224, -261453, -207022, -102873, -12293, -30041, -76085, -80072, -121186, -177791, -129621, -107875, -137743, -189379, -110631, -80588, -29822, 86692, -11139, -88091, -10711, 33101, 37210, -46163, -56487, -39006, -121550, -149591, -62619, -22776, -25968, -54075, -89702, -103563, -98088, -109238, -20023, -25846, -80458, -168672, -185788, -163329, -98047, -135763, -72072, -6500, -73152, -142877, -88693, -12114, -18535, -116885, -104742, -80473, -80378, -76628, -31897, 38664, 62195, 74802, 17096, -6319, -12665, 106823, 101702, 4655, -25839, -31636, -14752, 10536, -24999, -16645, -46535, -35797, -39945, -91805, -58972, -42013, -64241]
16591f4241P2968q451j4011L1433K1338J4322l443j03334j24097m99O7636J5158
16579i5221l9367L5445l364j4925K4091l8175J0905L350k8316l3793N3274K7603
16567i8493o6140j14837K094J2854R6449K0891J10445J17544j986n4089r516p0716
16555e5500p861K9290j6283n6606j5686K2809L0952J208N5761N9012j6308R34
16543C1722l8597R488Q409m1054k9650J2221k5382O1239M3161m8259p4619M0556
16531e0765O7891J8527N2603q261J478l016l3308o2193K0963J6728J5628o4013
16519b7738l6079K4427P2785M6763J0603l0594m9357J4231n1648n1269J7270j6205
16507g6811j9068k2793M371K3233Q0599M3378M8748J4096k6136R225j4630p4599
$$ y = [-64241, 8727, 276, -13735, 17698, 39036, 53358, 49915, -53419, -177516, -178015, -110379, -95221, -134588, -99143, -102507, -117432, -93341, -131516, -120611, -117261, -145577, -179370, -126096, -98493, -164633, -279470, -277376, -264522, -168073, -147182, -36737, 80807, 78821, 24732, 15216, -55500, -63361, -34071, -50354, -106960, -122646, -99837, -68885, -67677, -11916, 47096, 30788, 31722, -6875, 2613, 11022, -30032, -59682, -47461, -72843, -11604, 31557, -16702, -91321, -50765, 17126, 35653, 88256, 79995, 81473, 78457, 45149, -17044, 3919, 20647, 36275, -27738, -63817, -39390, 33395, 80158, 90761, 60167, 10810, 25041, -26607, -77876, -60606, -76811, -95879, -118672, -114301, -91068, -10469, 32909, 81657, 95753, 69617, 78842, 64212, -10387]
16495a0387K5652o211j30277L807j7122P3290k8348m1724K3317K0724J5146o8234
16483a40367j9447N0225n271P630q616j4418L4604n0208m8586O7412P9754j7258
16471f4546N2625l698o496o2233k6544L1908J7213N3679k1509p8439k6652j5165
16459a49857p928O8859l5576j0484M6086n849R296O7971R319l8187l8230k6905
16447a11485o2996k3241P895K98J1164R0177Q1382j1869p9510q8302K6703Q5234
16435g4550O4860n5355k3639k5499K5785l7196o0586L0532O1162J5002J7878m3295
16423a04901k759J127r858Q758P5825M8710m0315m1869J7173P4642j1343M2491
16411E7681k8283o2115l0738R9717l961j19692m1817O7639L7878m0257O348j4614
$$ y = [-10387, 15265, 9054, -121223, -117416, -134538, -61248, -89596, -131320, -108003, -87279, -72133, -140367, -159814, -109589, -114860, -107230, -115846, -130264, -95660, -145868, -194454, -127042, -47288, -64546, -11921, -15619, -22115, -84348, -110892, -78984, -61771, -8092, -29601, -108040, -134692, -149857, -157785, -88926, -124502, -134986, -88900, -94749, -85453, -17482, -8163, -46350, -84580, -111485, -174481, -197722, -189827, -189529, -178365, -88188, -6806, -18675, -98185, -186487, -159784, -74550, -9690, -65045, -88684, -114183, -88398, -125594, -186180, -155648, -94486, -79484, -61606, -104901, -107660, -106533, -116391, -107633, -31808, 16902, -23413, -65282, -48109, 26533, 15190, 57681, 29398, -32717, -63455, 36262, 32301, -87391, -129208, -61569, -23691, -63948, -57600, -72214]
16399g2214M995l3845J05677J06516j5972j05418pl3890m2226J9471Q4572k765
16387A4894m7152J4774N243r885k929J3787n160q898j2365m4455m4348K9947J22231
16374B5684m4066q0058J0629L908m3464O315r722O8036P4218J5058l3250n411
16362a2123J9454L9806r0914q3460J3732P1015J278N2951J7814L2314m7969j10294
16350i6396J9037K9316n6164J032N1406M7659N5194M002k4919q4397k0878m9795
16338a24903o6892q50Q6491j3721O6135K1625j2481j3093J0582J7412o753j7538
16326e3986j7402J8877O404p8739p087J0455L4988K4200Q200J932N8020p97L2142
16313C7207n4616m9521K4546M8120J0539n0522j5139l3305j7785l2615n1968J11675
$$ y = [-72214, -67219, -101064, 4613, 111129, 95157, -10261, -10268, -44158, -86384, -66913, 17659, 14894, -32258, -17484, -12241, -22126, -25055, -11268, -16428, -25326, -37691, -82146, -126494, -96547, 25684, -18382, -98440, -87811, -83903, -127367, -121052, -130774, -62738, 11480, 26538, -6712, -12123, 7331, 47137, -43777, -127237, -113505, -42490, -41212, 11739, 29553, 61867, 13898, -96396, -77359, -48043, -104207, -103175, -51769, -4110, 51084, 55086, 30167, -54230, -75108, -124903, -191795, -192645, -106154, -119875, -53740, -32115, -44596, -57689, -47107, -29695, -36448, -53986, -71388, -52511, -46107, -124846, -131933, -121478, -86490, -62290, -54090, -52158, 5862, 5065, 37207, -17409, -66930, -42384, 5736, 16275, -34247, -49386, -82691, -100476, -133091, -185059, -73384]
16301g3384K4330l918M0560R9224m0529J276N7602j3413m1108o8921J2983J21655
16289A16357M5134l4428k0792m4038J7761l9653j56847n8167O2871M7081M5125
16278a9596o0357n6181Q3339K1363m8268p5902p9377l125o491R4637J09755Q1861
16266D1658m6600k554n2738o2637o485K9396l383n7447k1331J10345M6100J7368
16254h308j7088l8125m5003m9186p7290K304O7564N3183p200j4218l4476J7837
16242a50006K9023k5582j4531Q761m6392O1661O7277R6000n4989k9339j264N1165
16230h216N3582j9461k976l127Q575K311M5656J3431o7140o6363j5609L6610L7218
16217A4491r6590j15847K1481L8814L8391j8647m4228L2747K3337l3682O7635
$$ y = [-73384, -49054, -52972, -12412, 86812, 46283, 47559, 105161, 91748, 50640, -18281, -5298, 116357, 161491, 127063, 106271, 62233, 79994, 40341, -116506, -174673, -111802, -64721, -19596, -79953, -136134, -52795, -31432, -79700, -155602, -234979, -238104, -244595, -149958, -40203, 41658, -4942, -7496, -60234, -122871, -129356, -99960, -103343, -160790, -182121, -71776, -25676, -8308, -25396, -63521, -108524, -157710, -235000, -232696, -165132, -111949, -119149, -133367, -167843, -150006, -120983, -146565, -161096, -152335, -198727, -137066, -69789, 26211, -28778, -58117, -59381, -8216, 45366, 25905, 22929, 19802, 28377, 30688, 76344, 89775, 22635, -43728, -59337, -22727, 14491, -82099, -197946, -176465, -137651, -99260, -117907, -162135, -129388, -106051, -139733, -72098]
16206g2098J0096r4401j1791K9318J7092R6220L1772j2461m6819L0979K5649o7229
16194f3673o6745K6361M8057k0840J3494P8865O5262k463q702n229o7361J0958
16182G984J03695L8735l6711m05M62m9025p6088m3050J389k8630j2281J21782
16170B7857J01606N8906j6522m3147p909p3519k2509L1772n7016n173L0627l6008
16158a1035j00781r7944O2262K1666L3052L8500m861J0303k2257m6796M8148n338
16146g5081m5174L1964n2419n2944J16544L7785n6786p9713J8482K5664q915L6887
16134a03706k7263p4907l0352K8787N2381N613k6056L1862M0244N7657Q7795o1017
16122a8962o5587k6578n5605k384P9930j9556o059o2416K0091j6063J792k9185
$$ y = [-72098, -62002, -156403, -168194, -138876, -121784, -25564, 6208, -6253, -53072, -22093, 3556, -63673, -130418, -104057, -56000, -76840, -63346, 15519, 80781, 78318, 69616, 64387, -2974, 7984, 111679, 150414, 113703, 113298, 113760, 64735, -11353, -54403, -53014, -81644, -93925, 27857, 129463, 188369, 171847, 128700, 120791, 47272, 24763, 56535, -481, -5654, 24973, -11035, -111816, -209760, -147498, -125832, -92780, -54280, -59141, -48838, -71095, -117891, -69743, -75081, -120255, -88291, -140710, -193654, -77110, -39325, -96111, -175824, -157342, -131678, -140593, -103706, -130969, -205876, -236228, -207441, -155060, -149447, -175503, -143641, -103397, -45740, 42055, -18962, -84549, -111127, -166732, -169116, -89186, -108742, -114801, -177217, -157126, -173189, -171397, -200582]
16110b00582K5955K3082k533q1608L629J9681L3521l4528q825M9321R1950J7498
16098f3439o9972n086O9022J06771J936l4316J229m1269m5875q963o0823Q054
16086a42731N3042l5166j7278R7886L3310n944m0123J12692L187o5499o6258k2273
16074i5155l6710n610P1405j1559k7399O0306J53956J2558k3595r5109j00838
16063i7750L0425L3891p4543n538L5531N9943M1605K3148o01M004M8539K4817
16051A23471o2942n5474r3257m6813N2417N1213l194k6748m0650K4663O2109J1770
16039c435k0058n6305L0969M2751m143k3776N2404M3941j2143j6808p7927p7741
16027a22271o1249M3459R2041L8130M8498q0705o050j8653R7853l198l5427Q764
$$ y = [-200582, -174627, -151545, -154078, -235686, -232057, -212376, -178855, -213383, -222208, -172887, -80937, -63439, -133411, -138497, -69475, 37296, 39232, 4916, 6145, -35124, -80999, -89962, -150785, -142731, -89689, -124855, -142133, -44247, -10937, -16881, -57004, 55688, 58875, -6624, -72882, -95155, -131865, -137475, -66070, -77629, -105028, -44722, 109234, 121792, 98197, 3088, -97750, -67325, -33434, -107977, -113515, -77984, -18041, 23564, 46712, 46111, 50115, 98654, 123471, 60529, 5055, -88202, -135015, -82598, -31385, -34579, -61327, -101977, -77314, -15205, -3435, -23493, -79798, -48829, -6078, -10221, -33997, 18407, 62348, 50205, 33397, -44530, -122271, -183520, -140061, -48020, -9890, 38608, -42097, -48147, -66800, 31053, 27855, -7572, 1192]
16015A192l725n0628N5240P9263l3278J6352l0788q317K3899P1718n7627j7056
16003D6245n7325j11759j3377N3756n846n932L1328O5079K3084n230o2028m0070
15991h2075O105J8155J4256r0172J5601P9453n2633O076l0881L3574J5438l3667
15979a00770L2331O8828j3062j4804L0043P6671k9909l424l5826q4997L2736m0966
15967h3149r116o57j667L2324J42272J4216n8020o5243m6517P7018O8331J2184
15955H1976r2045J00L386M295o7976m2825m5998N505N445Q3906J7291m983k1173
15942g3096j1388J5278N6033R7531p812p5548l5227M6346J0427l5659j8061J340
15930b9836O636o484o2228r952m47N1693l3229n9595l8953J956J07511j1232K0628
$$ y = [1192, -2533, -53161, 2079, 81342, 48064, 64416, 33628, 25311, 49210, 120928, 63301, 46245, -11080, -122839, -136216, -82460, -88306, -94238, -62910, 2169, 25253, 20023, -42005, -82075, -75970, -57815, -43559, -133731, -118130, -38677, -91310, -85234, -116115, -82541, -67103, -100770, -68439, 389, -12673, -27477, 2566, 79237, 49328, 45904, 10078, -74919, -42183, -83149, -92265, -92922, -94589, -62265, 80007, 94223, 36203, -29040, -75557, 1461, 69792, 81976, -10069, -9969, -6583, -2288, -70264, -113089, -159087, -153582, -148137, -64231, -46940, -51923, -73096, -84484, -69206, -13173, 84358, 76546, 998, -34229, 12117, 22544, -13115, -31176, -29836, -23200, -29684, -91912, -101864, -102311, -50618, -83847, -143442, -182395, -180439, -72928, -84160, -63532]
15917f3532O7810p3084R760M9342M310K1919l3847k029L0415l2974k2380q260
15905e2550L7877J15237m4956p1684M803k4687J4253J660m7594l7631K3572m7821
15893a29521K0895O4739R9848l5075j4369l6923l9825O676K0007P358Q147N1977
15881B3934L9137K0150l8583j9263P6819n5800r2009K251j062p549J16889R7798
15869A62712n2618m1165p177j0123j1978l3345k9243l030J9743Q4704o9611L6088
15857D4957j03038n4053M2168M2918L8039L3276M1925q4007m1725O9372K9210
15846E9042o9196M6813j7162p705P995k2566j13709j36939J9217Q5191L9435l4129
15834a43713P401Q8505m605J3337N134n9672K4053O6319k3460j9112l5070l9258
$$ y = [-63532, 4278, -68806, -59046, -9704, -5394, 16525, -17322, -19351, 11064, -21910, -44290, -52550, -14673, 100564, 55608, -16076, -11273, -35960, -21707, -20047, -67641, -105272, -81700, -129521, -108626, -43887, 55961, 20886, 6517, -30406, -70231, -63555, -43548, -36190, -28043, 23934, 63071, 83221, 44638, 25375, 102194, 46394, -45615, -43364, -44426, -51975, 64914, 162712, 110094, 68929, 61752, 51629, 39651, 6306, -22937, -25967, -6224, 78480, 8869, 44957, -58081, -112134, -69966, -27048, 10991, 44267, 86192, 2185, -39540, 29832, 59042, -10154, 36659, 19497, 11792, 19787, -2779, -116488, -253427, -234210, -149019, -109584, -143713, -136312, -47807, -52412, -39075, -33941, -93613, -69560, -3241, -26701, -45813, -80883, -120141]
15822a20141N1630j7084j1625q5473m9235J1606O0247R274O6140M9620J8045k6397
15810d3393j0140o2491m4817K046k880l2392J09225j405J858M8460L8574J9468
15798B2113j6182r23m3168o7424L4014j593L0983r190j0916k6361L7096J6395
15786c5156L7831j6715K0936Q1317Q891l1543K4627N3358j7798r1368L4137R485
15774G8002K636n6631K9548J1770m3744o6308O2591O0361j2379J446p6602P601
15762a709l2871j2323K8811p8642M6032O9263N2813j8110m8327r3426o3819N5362
15750i6946N5101M2435o0199n0329j1071l2076K9494K227O0312N3763L5771Q7682
15738A16164l1592m2364r57m6532L1592l4624k6120O075m2966p453l6248k8538
$$ y = [-120141, -68511, -85595, -97220, -182693, -231928, -220322, -160075, -150801, -84661, -35041, -16996, -43393, -53533, -116024, -160841, -158795, -161675, -194067, -84842, -86247, -84389, -35929, 2645, 22113, 5931, 5008, -38160, -105584, -71570, -73163, -42180, -51370, -62286, -88647, -51551, -35156, 2675, -14040, 6896, 88213, 97104, 65561, 90188, 143546, 125748, 34380, 68517, 78002, 80638, 24007, 53555, 65325, 21581, -44727, 17864, 78225, 65846, 67292, -9310, -1709, -34580, -46903, -18092, -96734, -50702, 18561, 71374, 53264, 4937, -88489, -152308, -96946, -41845, 590, -59609, -109938, -121009, -153085, -123591, -121364, -61052, -7289, 28482, 116164, 84572, 42208, 41251, -5281, 26311, -8313, -34433, -28358, -71324, -78777, -115025, -143563]
15726a43563P7112M8720J6049J968J6190l9377q5095k7887L2727M0421q8944m2297
15714a93976N2888N5095N1209o2822q1300M1909M5978L340j5543k0254L3449L6727
15702e3300l0859p331n816n582l6375N3347K9966n5258n3500j4464J0121N7607
15690a11444n931k3895Q9689N3576k3404m5536K1702M7596M1530R052p4324K515
15678a8874J9574R117m9471m3525n1968K4958R6544j5326j8004J7602l8480N5429
15666a2424Q1001K6113l1689K4194n746J5213k7806j13128o6739j4115p92P5461
15654e0457M5052j7705m0280K2094N4015J783k6779k6750j7193m5071O6189J10873
15642G5771K2924j6726j1971j23942q950O3116N4772k7389o0879p024J7680m3022
$$ y = [-143563, -66451, -17731, -1682, 286, 16476, -22901, -107996, -135883, -103156, -62735, -151679, -193976, -141088, -85993, -34784, -97606, -178906, -136997, -91019, -87679, -103222, -123476, -90027, -53300, -84159, -91490, -97306, -102888, -139263, -85916, -55950, -111208, -164708, -179172, -169051, -111444, -117375, -141270, -51581, 1995, -21409, -66945, -45243, 2353, 43883, 52935, -21389, -18874, 700, 9817, -39654, -83179, -135147, -110189, -13645, -28971, -46975, -29373, -67853, -12424, 68577, 94690, 63001, 87195, 81449, 96662, 68856, -44272, -111011, -125126, -125918, -50457, -5405, -23110, -63390, -41296, 12719, 14502, -12277, -39027, -56220, -101291, -35102, 75771, 98695, 81969, 69998, -53944, -62894, 222, 54994, 27605, -33274, -40298, -22618, -65640]
15630f5640l6408J2210l4340k4589m495P0588j0791O4098O4044l2450n0989Q8
15618d8674K1351J3225l2136j8253j2271K7529L470K2117P1465J18942j9383q699
15606A38683p9823o1615N2723O3756K5463p7674N1799l0348o7309o2150N62m4059
15594h9992M8809l2925l7627J26505p229j2818K1716K0599k399j4097R394k1181
15582H755k4647J1152M0341J8030O2638o6830k3682O1708k3043J3853l5527k0289
15570B2459L9549o9706q1340j7040q105Q1323q546N4868j5295m8266N8405O8095
15558G6401r5328p8431j1308J6919J2833M2281K8458l3410n6051N510j455L1560
15546f2021Q9239k3754m7969l0045n7496j7281O7302M1743m4193R357N9447L4918
$$ y = [-65640, -102048, -89838, -124178, -148767, -153262, -82674, -93465, -29367, 34677, 2227, -48762, -48674, -27323, -14098, -46234, -64487, -76758, -49229, -45759, -23642, 47823, 166765, 147382, 138683, 58860, -2755, 49968, 113724, 139187, 61513, 113312, 82964, 15655, -46495, -45933, -89992, -41183, -74108, -111735, 14770, 7541, -5277, 16439, 37038, 34639, 20542, 29936, 8755, -15892, -4740, 35601, 53631, 116269, 49439, 25757, 87465, 64422, 78275, 42748, 22459, 62008, -7698, -89038, -106078, -114183, -32860, -41406, 13462, -1833, -50099, 8306, 76401, -18927, -97358, -108666, -91747, -78914, -36633, -8175, -41585, -97636, -92126, -93581, -62021, 27218, 3464, -44505, -74550, -132046, -149327, -82025, -40282, -84475, -75118, -15671, 19247]
15534A9247J0521l8789N3081L4020q4855j30564l3144J7294m768M3391Q4836m3645
15522g3375m6698L8784j9381K3122M5031L4070O0989m3957k4435J2522n2930k8038
15510g4296q869J1375j2430M0087M7487K8682q541M3389l1201O0431J0905m7445
15498E9574q8341l7863r329j7988K7135n565l6618k7948M7213Q2491Q3827p2330
15486D258j04002J6236M3032M9082k8560n4809p4811k8484N5906M4275K1973J2298
15474d3606k2553J0678R6202j0546m465p192J9296J3232o9942m2541P6995O5714
15462H1272L7836J3385p7244l1425m8889l3890K4859k8934K9170k2510J4505R6462
15450E4597J167n0213j13828r6901J07862J45974M6739N5769l7235q2800m1389
$$ y = [19247, 29768, -9021, 44060, 78080, -6775, -137339, -170483, -153189, -157957, -114566, -29730, -73375, -120073, -81289, -100670, -77548, -32517, 1553, 62542, 18585, -5850, 6672, -46258, -74296, -83165, -71790, -84220, -44133, 3354, 32036, 23495, 66884, 35683, 96114, 107019, 59574, -28767, -66630, -75959, -93947, -66812, -72377, -108995, -136943, -89730, -7239, 76588, 4258, -99744, -83508, -40476, 8606, -19954, -74763, -149574, -178058, -122152, -77877, -55904, -43606, -66159, -55481, 40721, 30175, 25710, 18518, 37814, 51046, -18896, -61437, 15558, 81272, 119108, 132493, 55249, 23824, -25065, -58955, -34096, -63030, -33860, -56370, -41865, 54597, 55764, 5551, -108277, -205178, -97316, 48658, 95397, 151166, 113931, 31131, -10258]
15439a0258L4701P877J3337k4153O2178O3848l1359p482l4341m2287j2834q6116
15427f6889k8169k6073m0162L5896J03384N3765J09407k7420l6751M8467J1214
15416A36669r2339m4196j1235j5635M9461M831L4256l7900P950p2662N440L130
15404c2230l0715O43K66Q7114O7398j05498m5898M6000J8460p6785p1591l200
15392a46036R7001P7058K0830l4523q0435m0215k2098k8667L5678p465Q017j665
15380a22520O9796J7567O603M9351j8120K4638m2281Q967M561n0153m4079M4263
15368e1407L4189J8180k1635j0382K5197M2049n1358R594O4111N1870o3273k3337
15356B3798K2936l2323p4887n0851j7766L5209m2850k7145N0785N3550J3898J6206
$$ y = [-10258, 24443, 32320, 45657, 21504, 83682, 147530, 116171, 108689, 74348, 32061, 19227, -66889, -95058, -121131, -161293, -125397, -22013, 31752, 141159, 113739, 76988, 125455, 136669, 44330, 134, -11101, -26736, 22725, 27556, 61812, 23912, 31862, -40800, -35360, -32230, -62945, -62302, -62036, 25078, 92476, -13022, -58920, -12920, 5540, -71245, -142836, -146036, -49035, 28023, 48853, 14330, -66105, -106320, -128418, -157085, -121407, -128872, -120855, -122520, -52724, -35157, -28554, 20797, 2677, 27315, -14966, -5999, -1438, -51591, -95670, -51407, -17218, 962, -20673, -31055, -5858, 36191, -15167, -5573, 58538, 110408, 47135, 23798, 46734, 14411, -60476, -111327, -129093, -93884, -136734, -163879, -113094, -59544, -45646, -29440]
15344b9440J8586k5287r7801j6667j722O3529N8622k1825m7343J7475K0963j0723
15332g1633L971m189o249l0678j4334j6099L4997K3323L5713O0256r7232K0025
15320f2129M0629L9335k4182L1168N8005K5234N4822K1743N294r0752L1830l6050
15308I4947p7119J5797j3518n6838P2808L6663M9921M4844j5571p2317L3684O6926
15296A80227m596J323r5364p4348R301m3606l7725L1059Q3585P7822Q5959K7544
15284B41181j4768P044o4930o8085l9559j1162N7209L3941m7839k826L6845L2571
15272A59622N3895J5678q971k9917m5158j4169n111j6696P5818k5197m3932o9616
15260D6246j7753M7204N4754o9994k0154J8462j640K0580L1145k6472L7520M2206
$$ y = [-29440, -10854, -36141, -133942, -150609, -152331, -88802, -30180, -52005, -99348, -81873, -60910, -71633, -67662, -71851, -78100, -108778, -123112, -139211, -104214, -80891, -45178, 15078, -82154, -62129, -21500, 17835, -6347, 24821, 82826, 108060, 162882, 184625, 189919, 99167, 130997, 94947, 17828, 33625, 20107, -36731, 36077, 72740, 122661, 167505, 151934, 79617, 113301, 180227, 175631, 176954, 81590, 7242, 16543, -27063, -64788, -33729, 49856, 127678, 213637, 241181, 226413, 233457, 168527, 100442, 60883, 49721, 106930, 140871, 93032, 90206, 127051, 159622, 213517, 229195, 220224, 190307, 145149, 130980, 125869, 109173, 184991, 159794, 115862, 46246, 28493, 75697, 130451, 60457, 40303, 58765, 57125, 77705, 108850, 82378, 119898, 162104]
15248A62104j8640k9450p7923j17702O0601L1902K4837l2292o80J9673J7419l7496
15236B353L2945K6442L5620m6191l4329J8596K8369p8942j9737M2116K8528k4904
15224A0866M594R527j5996q2628L3158j719K869J4459J2848J6029m9612k1964
15212f7569k9523m0840p487O8043J564N844q890J0931L2928N8959j6187m1146
15200c3373L3182N584k7355J9581J5079j1939Q38p2001K298j1423k5663K4520
15188h0672L8932r956m8771n1934L4251L6571k5961q077l5777J0148R5301J15672
15176F9727n5114p0372l4271k0079k2433J3049m5644J7147L845L8005L3566L1420
15164d1154n2781q6379L0957L7354J24392K115m8375M8753J8438K3254p4464J1354
$$ y = [162104, 143464, 114014, 36091, -81611, -21010, 10892, 35729, 3437, 2757, 22430, 39849, 2353, 35298, 61740, 97360, 51169, 16840, 35436, 63805, -15137, -34874, 7242, 35770, 10866, 15460, 24987, 8991, -73637, -40479, -42198, -39329, -24870, -12022, 4007, -45605, -67569, -97092, -137932, -145419, -77376, -75812, -69968, -78858, -67927, -34999, 23960, 7773, -33373, -191, 5393, -21962, -2381, 12698, 759, 1597, -70404, -68106, -79529, -105192, -80672, -41740, -51696, -100467, -152401, -118150, -81579, -107540, -115617, -151394, -141246, -45945, 69727, 14613, -55759, -90030, -110109, -132542, -119493, -165137, -147990, -144145, -106140, -72574, -41154, -93935, -180314, -149357, -112003, 12389, 14504, -33871, 14882, 33320, 56574, -17890, -6536]
15152f536m9391m9997m3610k5298J04936N3341k2422L1473M6327n8679m7032m4165
15140a11053l736M8101p153O525N3658J0845j49127m3119P9628P413l058M9444
15128f1632L0358O142M1794k0361m556R97l4692m1500K0596N4373J3224M0983
15116D5726j3415l3769M3760N1396l1626l2944m6819L4391n912j7735o4679l093
15104g4719r489P2766M8102n8808k1840M9829n6969O578Q7211K7927j9953m7646
15092B989p146N9663j30194p1901m8042k3458P8517L3826m9133N9469L1090j7041
15080h1361j9417L288q320J8280L0753O924J4709L1262L9534l5498m4849R0980
15068D6285K3585k6595k4235j1223o0411j4443L5585k83k7973K496J9967m0138
$$ y = [-6536, -55927, -105924, -149534, -174832, -69896, -16555, -38977, -7504, 38823, -19856, -66888, -111053, -114789, -66688, -73841, -67316, -13658, -2813, -151940, -195059, -115431, -108018, -111076, -61632, -31274, -25132, 16662, -3699, -8255, -7258, -41950, -83450, -62854, -8481, 4743, 45726, 32311, -1458, 42302, 93698, 62072, 29128, -17691, 16700, 10788, -6947, -71626, -74719, -84208, -11442, 36660, -22148, -43988, 5841, -51128, -44550, 42661, 70588, 50635, 2989, -4157, 55506, -74688, -146589, -194631, -218089, -139572, -105746, -154879, -95410, -64320, -81361, -100778, -97490, -105810, -87530, -56777, -49853, -35144, -3882, 35652, 154, -44695, 46285, 69870, 43275, 19040, 7817, -52594, -67037, -31452, -31735, -59708, -57212, -37245, -77383]
15056g7383j1573M9715J2252k0698O45K7327J2345k7179k8731k879K4788q7808
15044a29179m4327M4931M8195Q280l9681J6074J17729N8716K3952l1191P326n475
15032G5350l2999p3564L8160q377L2373k2899m4894l0717j3545J7608R307P22
15020e3475L28M7845Q8057P8971j11153j2448k4858j6399J1966j7192j871M0215
15008B9986j1178L2462p345n676L0730N5291O856J7382j13901K002M7414j0155
14996G3868j9548K2044J7985n4812j1625L8667o6851k8752K0140M9706n2344j00916
14984a12438j3201L7348j4555K3348L1158r362J7360k2407K730m1230l1839l0024
14972a63112M6732M7559K0152k9754n6758K7189J6988o097J1179M308N0820o4289
$$ y = [-77383, -88956, -39241, -26989, -47687, -47042, -19715, -7370, -34549, -63280, -66159, -41371, -129179, -173506, -128575, -80380, -72100, -111781, -95707, 22022, 80738, 104690, 73499, 80825, 75350, 42351, -31213, 6947, -1430, 30943, 8044, -36850, -67567, -81112, -63504, -54197, -53475, -53147, -5302, 82755, 161726, 50573, 38125, 13267, -3132, 8834, -8358, -10229, 29986, 18808, 51270, 43925, 38249, 68979, 124270, 131126, 148508, 34607, 36609, 84023, 73868, 54320, 76364, 94349, 39537, 27912, 66579, -272, -29024, -8884, 40822, -11522, -112438, -125639, -88291, -102846, -79498, -48340, -57702, -40342, -62749, -60019, -101249, -133088, -163112, -116380, -68821, -48669, -78423, -135181, -107992, -91004, -97101, -85922, -81614, -30794, -95083]
14960i5083r278O1126q98J6717M3114P4326J1072k1697l3371M5098M8080k2908
14948A16298l2524J7015j2048K8407m9336m9768K174K0009L5960L2698J2411p4910
14936D6386q1851m448J9663j2083r210M9665l9416l8613m5018n1478Q6873K8789
14924e0741o1098o2562p384P6883O0295L9776l9960K0415k4321o9393p5330p890
14912b01310Q1569R7159l9476q4794n2271k3120N1453N961j5761J01888P1256
14901g446j5088n8001l1189N3134M4777k2057J201M7896N7386q464l8970K7880
14889E1059q132J9157k9873n292J0609l6272j1117k3225r6932j7935L0674N1927
14877f5352o825j7155N8678O1221j2947m7228N005k4417m0412K986m9946q719
$$ y = [-95083, -104361, -43235, -44133, -27416, 15698, 90024, 101096, 79399, 46028, 91126, 139206, 116298, 83774, 100789, 88741, 117148, 67812, 18044, 20218, 40227, 76187, 108885, 121296, 46386, -35465, -39913, -20250, -32333, -41543, 8122, -31294, -69907, -114925, -166403, -79530, -50741, -111839, -174401, -181785, -104902, -44607, -4831, -44791, -24376, -48697, -118090, -193420, -201310, -119741, -22582, -62058, -146852, -199123, -222243, -170790, -164829, -180590, -78702, -7446, -22534, -80535, -111724, -58590, -13813, -35870, -34669, 13227, 70613, 62149, 23179, 51059, 42927, 62084, 32211, 26919, 37528, 1256, -9861, -33086, -130018, -147953, -117279, -65352, -72177, -89332, -30654, 30567, 17620, -29608, -24603, -49020, -89432, -86446, -136392, -145111]
14865a45111P3773q727k0596k7587p1240K8487J03307j301l3349L5955o646k7242
14853a00277k84r341K4791Q0579j6865L729K274l352K6413J2114j4078k4059o672
14840b5028p1011l4830L6916M6852j1495l7640O8097N7778m8882K234K4408K1152
14828B8551r278j7514Q773m8324L9771N6317N6274L466O233o3535l4232p6662
14816e0160l4643J0205j6277J4747O2893k568O6023l9328p0497n679q156j7380
14804i0820J9777J13863q21k3652l4269N567n5395m3199R2041o111j7547m4368
14792h4934m6034O3135Q476l4064K1045k3358K2179M4989J7332k2200l7346N6989
14780a3791m4193r0109l9170O6320R1745j22817q5866N3515N7936k3171r2610
$$ y = [-145111, -71338, -80065, -100661, -128248, -199488, -171001, -67694, -68995, -102344, -66389, -73035, -100277, -100561, -109902, -85111, -4532, -21397, -17668, -15394, -18746, 7667, 19781, 5703, -18356, -25028, -96039, -130869, -93953, -47101, -58596, -96236, -28139, 29639, -19243, -17009, 7399, 28551, 19273, 1759, 10532, -37792, 1979, 58296, 114570, 118036, 124269, 60734, 26502, -50160, -84803, -74598, -90875, -76128, -13235, -15803, 50220, 10892, -59605, -65284, -73440, -90820, -71043, 42820, 41999, 18347, -15922, -10355, -65750, -108949, -16908, -23019, -40566, -84934, -130968, -67833, -59357, -93421, -72376, -95734, -73555, -28566, -11234, -33434, -70780, -13791, -57984, -148093, -187263, -120943, -29198, -152015, -237881, -184366, -126430, -149601, -242211]
14769b42211J5047N6192R5705N4574m0088L2597j7292m7143Q8271L7549l4043
14758h42n3090j08262l8476p9174K9605J59893Q2263m9066k2239q87Q8497L6332
14746D4554r7882m7788J13101M893o5311K6592M2777N2137P5835k0565m8668m6536
14734C3139L8355m7381j3322K3027L4212L9423l0183L5751J04213o7260n6820
14723I3154J1482o0401q7177k0203p6861R17M4745K680M3874L4519q5072j03907
14711b02250K1636O0224L2086L8461O6571L4796L9808k8163k5150p6883p7804
14700a16668l7499R0789J12157M1057q7216j28882P7822R2474P930J1704J3847
14689G7515R1829M336p8655n4922k3436k9607j7656k398k270m0795n0006K6135
$$ y = [-242211, -227164, -170972, -75267, -20693, -60781, -28184, -45476, -92619, -4348, 33201, -842, -53932, -162194, -200670, -279844, -250239, -90346, -8083, -57149, -79388, -80275, 8222, 44554, -53328, -101116, 11985, 16878, -48433, -21841, 20936, 73073, 148908, 128343, 79675, 33139, 71494, 24113, 10791, 33818, 68030, 107453, 77270, 113021, 217234, 149974, 93154, 104636, 44235, -42942, -63145, -140006, -139089, -94344, -91664, -47790, -13271, -98343, -202250, -180614, -120390, -88304, -49843, 16728, 51524, 91332, 63169, 38019, -38864, -116668, -154167, -63378, 48779, 89836, 2620, -126262, -48440, 44034, 51964, 63668, 77515, 169344, 173680, 95025, 40103, 16667, -12940, -30596, -32994, -35264, -76059, -126065, -99930]
14677i9930P0511n2700k9749q1425R7679M6588k2109n8346m015P9636J2774R8489
14665E7403K7841q1556m8280P0215O2425P521p381l7273p1182k8453j6560Q7833
14653B2553Q4114m3532j01094j14010L7610L7666L9693N1497j4206J16863J3023
14642A30177p5397o3937L0546Q2396o2919m6734L0947o748n5668M806L4722n1527
14630d9336k6411l6607L9197M5429l4964k5554j3201l3089Q1823j2978j3851k726
14618h2268N4746P3648p7747j3966M7902R1136n2915j23117M137K4702k6126J3211
14606f6657K7033k4848K0077Q6149j5058l5427P493l7683l7492q9760K4866J07318
14594c3989L5238l4078J2921R7413O6699n5341L9104J7605k2682q8051m7100K2076
$$ y = [-99930, -29419, -82119, -111868, -193293, -95614, -49026, -71135, -129481, -133496, -53860, -41086, 57403, 85244, 3688, -44592, 25623, 88048, 95569, 88188, 50915, -20267, -48720, -65280, 22553, 106667, 63135, -37959, -151969, -114359, -76693, -37000, 14497, 291, 117154, 130177, 54780, -9157, 21389, 103785, 40866, -5868, 25079, 18331, -37337, -32531, 2191, -49336, -75747, -112354, -73157, -27728, -62692, -88246, -101447, -134536, -52713, -65691, -79542, -82268, -27522, 46126, -31621, -45587, 2315, 93451, 40536, -82581, -78444, -53742, -79868, -66657, -39624, -64472, -44395, 41754, 26696, -8731, -1238, -38921, -76413, -166173, -141307, -33989, 1249, -32829, -19908, 77505, 144204, 88863, 127967, 145572, 122890, 34839, -12261, 9815]
14582I815O6047N4386p9984K1000K7568j6715p1372j3143l7054o9044J687N2929
14570e3880p3032O5958P7648L4576n5016j4175r802j5919P7825O8653r69j0661
14558I1206l889j7894j2967O2844l856j23014n4876P4604M0449L5914k3575n1667
14546A3279o0505L8437l6722j9025O0277K8777j31133q0983O1990N8324K4465
14535d2819J6182K8922J03197n58m3017l5698j1816k9835r9184L0942M5087N5098
14523A6501o79L386j1046K233P388Q866n4670j2263P55l0319P8362Q8691O9030
14510A66235o8580r4571m1076j3447L3975K3275q4276m2208l5579j5964Q183L2718
14498a31315L6074l6636O145m2726K7539J9171j8138M0021J00825k5555R428L9038
$$ y = [9815, 75862, 130248, 50264, 71264, 98832, 82117, 10745, -2398, -39452, -108496, -106809, -53880, -126912, -60954, 16694, 51270, -3746, -17921, -27723, -43642, 34183, 102836, 101867, 91206, 87317, 69423, 56456, 119300, 115444, -7570, -62446, 12158, 52607, 88521, 64946, 13279, -47226, -8789, -45511, -64536, -4259, 24518, -106615, -187598, -125608, -67284, -42819, -26637, 2285, 105482, 104924, 61907, 26209, 14393, -15442, -114626, -83684, -38597, 16501, 15822, 19208, 8162, 10395, 17783, 26649, -28021, -40284, -39529, -69848, 8514, 97205, 166235, 97655, 3084, -37992, -51439, -17464, 5811, -78465, -120673, -156252, -172216, -164033, -131315, -95241, -131877, -125732, -168458, -140919, -121748, -139886, -99865, 960, -24595, -15167, 23871]
14486B3871m4432r898Q758k1684M442O2384l2766o4115J0064r672j5702O3594
14474b5156N4776m5888J1268l3986R5027J4162L3815N3405N6311n8035n4367J821
14462A03153j7823m2777l9298m1673m771p8929l3501P5227K4820R3683j5091p275
14450A5745k9392l8965N4534J5820m0225J2161N8429L4588j16467k8053R5606
14439C3781m8322p422P133L0515n8568r2411l7384M8833J65943J18770J1487q4019
14427H8336m1689k9925m2709L1545K1493l1015O7496R5638k7285q1154m5100K8137
14415C3768n2808l2092M2600M6676P2520L6953o875o8635l1361K7505J1626k3683
14403E6194p6975J6987j0077L8774M4926j4513P3378m6907p2738l1967j8856o1535
$$ y = [23871, -20561, -30459, -21701, -43385, -38943, 23441, -9325, -73440, -63376, -73048, -88750, -25156, 29620, -16268, -5000, -38986, 56041, 70203, 104018, 157423, 213734, 155699, 101332, 103153, 85330, 42553, 3255, -38418, -43189, -122118, -155619, -80392, -55572, 38111, 23020, 15745, -13647, -52612, 1922, 17742, -22483, -10322, 48107, 82695, -33772, -61825, 33781, -14541, -21963, -14830, 15685, -42883, -135294, -172678, -123845, 42098, 160868, 172355, 88336, 46647, 16722, -25987, 5558, 27051, -3964, 63532, 159170, 131885, 50731, 5631, 33768, -19040, -51132, -8532, 38144, 110664, 147617, 140742, 72107, 40746, 68251, 79877, 56194, -20781, -3794, -13871, 24903, 69829, 55316, 128694, 81787, 9049, -22918, -41774, -103309]
14391a03309j7641M9068Q7728N2108m5783K1641P2664k1796l1928r3347R9310
14380F8715J10484r028K4677K5682P2478K5431k2627j12817o8310j1570K2791
14369A25906O3206r758K8515Q4171N0352J4854P6034J17117J04686Q4488N0871
14358G90442R8491J50806K39604J03863Q0542O7050L4389j4325r3198r3849j30680
14347A233135k09639j91488r6718p5809j68043j56745l9298m2346m7086j07419
14337I8544M4055M6795k1541r7861m6749j368k660P407J4669Q3123L2630o9910
14325H7134K5344m2016l9008r3157l5267M9576J10195J00311N6018j6221q6114
14314A16795q0895L1912L7477j264L3796j3503n8094n8820k6179O8507l689p6101
$$ y = [-103309, -120950, -71882, 15846, 67954, 22171, 43812, 116476, 94680, 62752, -30595, 68715, 179199, 170171, 194848, 220530, 293008, 318439, 295812, 182995, 114685, 103115, 125906, 189112, 179354, 207869, 292040, 342392, 357246, 433280, 550397, 655083, 739571, 790442, 888933, 1039739, 1279343, 1383206, 1463748, 1530798, 1565187, 1550862, 1457664, 1363815, 1233135, 1023496, 832008, 735290, 659481, 491438, 334693, 295395, 253049, 205963, 98544, 142599, 189394, 167853, 69992, 23243, 21875, 19215, 26622, 41291, 124414, 157044, 87134, 112478, 70462, 31454, -61703, -96970, -47394, 62801, 163112, 219130, 202909, 116795, 35900, 67812, 105289, 104025, 137821, 124318, 66224, 7404, -18775, 49732, 46043, -30058]
14302c0058K8864j1204Q2098j6430l8386O0351k405N704j2612r7089j40423r00
14290a72490M998N0209O9540N5603J0439J0349m579m3328L1245J5446n1093j7676
14278d1337J6037M6925M1515J0881j3678R588J879M5616N2102j7580p0463K4968
14266A06453n4441K6974K4603n6301o333N1994M7115n9273p8564J7456M7104k2106
14254D4681L6307P304j9250k971q52Q3160Q1564k5985k6041j886q3894p0818K2449
14241D3768M1605M6134K4529n7891l8320P217K7874j6429K113J6626M0809K7310
14229A65345m8906q6988L8998Q3200J9199J0637o2079q6819K4362M206k6495j2998
14217B1662K4096n4645Q858K340K1614O5259N9668j1867o9624p1626l5425L9529
$$ y = [-30058, -1194, -12398, 69700, 53270, 14884, 75235, 72830, 78534, 65922, -31167, -171590, -172490, -167492, -117283, -47743, 7860, 18299, 28648, 24069, -19259, 11986, 27432, -23661, -41337, -25300, 21625, 63140, 74021, 60343, 69931, 71810, 117426, 169528, 151948, 81485, 106453, 52012, 78986, 103589, 47288, 40955, 92949, 140064, 80791, 2227, 19683, 66787, 44681, 80988, 88292, 69042, 66071, 65219, 148379, 229943, 203958, 177917, 176031, 92137, 21319, 43768, 85373, 131507, 156036, 98145, 59825, 67042, 94916, 78487, 80600, 97226, 138035, 165345, 116439, 29451, 68449, 151649, 170848, 181485, 119406, 32587, 56949, 61155, 34660, 21662, 45758, -8887, -29, 2311, 23925, 89184, 148852, 136985, 67361, -4265, -39690, -161]
14205a61M2425K9826J9624M9103K9909o6484q3223r0409n6327n4673M1570Q0935
14193e7885R640K4323j2841j0551K2105k5509N0378Q2471J61325L4421o9019n3513
14181A55345n6533q1199m9099J0719N5960j037k27M2547n318m4875K4612L3295
14169H4190J6996O5012L1997q7252j13756O728J4975K4627r772j9437l7996m6538
14157g0226J18854Q1974L6938N1628l4246M0888N8453J6832l6228k3805l0050
14146B11012p2957K1119O6580j0438r157p1614M1627j164k2878j5035p4226j3476
14134D9393L3829J5134k014p0093k1779J31759O7059m6211m2904P8925L0215p0203
14122A53110n6422M4719O7477L5764J336r3006p5234j9476P6071j798J8074J0546
$$ y = [-161, 42264, 72090, 91714, 140817, 170726, 104242, 21019, -69390, -125717, -180390, -138820, -57885, -48245, -23922, -36763, -47314, -25209, -50718, -340, 82131, 243456, 277877, 208858, 155345, 98812, 17613, -31486, -20767, 35193, 34156, 33929, 76476, 71158, 26283, 50895, 84190, 101186, 166198, 198195, 110943, -2813, 3915, 18890, 43517, 33745, 14308, -23688, -70226, 48628, 130602, 167540, 219168, 184922, 225810, 284263, 301095, 264867, 241062, 211012, 138055, 159174, 225754, 215316, 206159, 134545, 176172, 175008, 152130, 137095, 62869, 49393, 83222, 98356, 96342, 26249, 4470, 136229, 203288, 157077, 114173, 193098, 223313, 153110, 96688, 141407, 208884, 244648, 245984, 152978, 77744, 58268, 134339, 132541, 150615, 161161]
14110A61161O929N4248l1605p6541q896n4153M1321k7053j03127m610L0578l7922
14098d9670k3848M6480Q3200M9944J1450K7977n313n9947l8121q311Q8912R0099
14086B12852J8342j8535m277n6672M0458j3307j08681q0198j5320R06P9015Q9691
14074A44274O2103m1923j1936O5656l3950m3529K4587p0393n613L1663N0146L2843
14062B03928J7308k7994J4888L9379m926k0416n6294l2947l5827r5582q4177l0532
14050a13192J15771J18031M3136O885J1585J2856M3511J28655M5131P3807j08991
14039C77185o0314n1075m9725O4321J32925R6921L2879J33832K5123R4241L687
14028H00000J12934J60769J32124J19431K02472O355J6887j19330k02942k27881
$$ y = [161161, 168090, 222338, 190733, 114192, 105296, 51143, 92464, 65411, -37716, -42326, -11748, -49670, -73518, -27038, 56162, 106106, 117556, 145533, 140220, 80273, 42152, 33841, 122753, 212852, 231194, 212659, 208382, 151710, 192168, 178861, 70180, -10018, -25338, -24432, 54583, 144274, 206377, 164454, 152518, 218174, 184224, 140695, 165282, 94889, 89276, 120939, 171085, 203928, 221236, 193242, 208130, 247509, 242583, 222167, 165873, 132926, 97099, 1517, -82660, -113192, 2579, 120610, 163746, 170631, 182216, 195072, 238583, 367238, 412369, 486176, 377185, 316871, 265796, 216071, 280392, 413317, 510238, 543117, 676949, 702072, 796313, 800000, 912934, 1073703, 1205827, 1325258, 1527730, 1534085, 1550972, 1431642, 1228700, 1000819]
14018A000819j81911j57917j71847j04099j13075n526L9808q006p7612l107J9726
14007B37253Q1781Q6893k2292l2334N3914K5089N2430j5571n4877J5120l001K4975
13995D49380m0528K9904l9976k2109j2242J0092O9594J34671o6443n9765R4745
13984E47323L6536j7068j9749J4914M8581J08615r529n5013N4734O0659k1383
13973G48620j16843M5205P0599Q4156M1341N9539R6569J18230l56M171J6898K4736
13961A192865p562Q112m076O9815R3300Q7622Q0445J06945k9787k2908O9748P0667
13949A715186Q8960L9447M0396R0540J26942J34718J12596J12233J10299N7697
13939B629014J20184J16644J66040J57296J72607J93784K94737K48441K44243
$$ y = [1000819, 818908, 660991, 489144, 385045, 271970, 266444, 306252, 298246, 220634, 217527, 237253, 319034, 405927, 383635, 351301, 405215, 430304, 482734, 467163, 412286, 427406, 424405, 449380, 408852, 438756, 398780, 376671, 364429, 374521, 444115, 578786, 512343, 452578, 547323, 583859, 566791, 547042, 561956, 610537, 719152, 709623, 654610, 709344, 770003, 748620, 631777, 676982, 747581, 831737, 873078, 932617, 1029186, 1147416, 1147060, 1151231, 1168129, 1192865, 1185303, 1193415, 1189339, 1259154, 1352454, 1440076, 1520521, 1627466, 1597679, 1574771, 1644519, 1715186, 1804146, 1843593, 1883989, 1974529, 2101471, 2236189, 2348785, 2461018, 2571317, 2629014, 2749198, 2865842, 3031882, 3189178, 3361785, 3555569, 3850306, 4098747, 4342990]
13930D342990L16783L21883L84597K98127L03398M29682N06986N85220O79023
13921H168689Q68191J021012J111037J183951J223962J321957J359834J462753
13913A7721386J628881J883795K398417K982115L755047M766078N999536P768988
13905D8904243J0145466J3332289J7885194K3944555L2033249M1609881N0640612
13898B38495489N4878594M9623486L3668852J0669794j3753434l4766506m8520343
13891B90295932n2878465m8816057m0346526l1397739k3700932j7708423j3418179
13884F2029611j0319275q077141o318895m869355l928045l189936k514751k086131
13876B0726082j774977j386898j260764j209301j201456j154410j096623j021403
$$ y = [4342990, 4659773, 4981656, 5366253, 5664380, 5967778, 6397460, 6904446, 7489666, 8168689, 9036880, 10057892, 11168929, 12352880, 13576842, 14898799, 16258633, 17721386, 19350267, 21234062, 23632479, 26614594, 30369641, 35135719, 41135255, 48904243, 59049709, 72381998, 90267192, 114211747, 146244996, 187854877, 238495489, 293374083, 342997569, 376666421, 387336215, 373582781, 338816275, 290295932, 237417467, 188601410, 148254884, 116857145, 93156213, 75447790, 62029611, 51710336, 43633195, 37314300, 32444945, 28516900, 25326964, 22812213, 20726082, 18951105, 17564207, 16303443, 15094142, 13892686, 12738276, 11641653, 10620250]
13868A0620250q80535p88874o45995n42305m71643m55226l81800l57838l77936
13859E718098l12483k82149k86297l14622k31793j39581j35546k12001k06914
13850C596712j69792k63556j62275n5526q9290j24098r6462p6684p9247p5567
13840B404215r4862j03619q0848m2653q8787n6929m8261r3649n3780q1769r9017
13829A560041m4799J7392L5750l5633l2880j1604j18558p8329P5027j2726n2811
13818A300870O75q451m3476k6596L5839j0005r9710P809l8575j2707l6225N087
13806A074535n7354p7531l3459J6656J1193K1767N0123J6038l2963q2374j0995
13795H95636j7784k9484J3929m5046p8468p7954k2976R1915J04180K9784K0324
$$ y = [10620250, 9739715, 8950841, 8304846, 7762541, 7290898, 6835672, 6453872, 6096034, 5718098, 5405615, 5123466, 4837169, 4522547, 4290754, 4151173, 4015627, 3803626, 3596712, 3426920, 3163364, 3001089, 2945563, 2856273, 2732175, 2635713, 2559029, 2479782, 2404215, 2309353, 2205734, 2124886, 2082233, 1993446, 1936517, 1888256, 1794607, 1740827, 1659058, 1560041, 1515242, 1532634, 1568384, 1532751, 1499871, 1488267, 1369709, 1291380, 1366407, 1353681, 1300870, 1301545, 1293094, 1249618, 1223022, 1258861, 1248856, 1149146, 1156955, 1118380, 1105673, 1069448, 1074535, 1017181, 939650, 906191, 922847, 934040, 955807, 1005930, 1021968, 989005, 906631, 895636, 877852, 848368, 862297, 817251, 738783, 660829, 637853, 729768, 833948, 863732, 884056]
13784H84056r3751p2479O6462O5720l6316N5004N3256O5517l2114o5420j5956
13773H73979j37520q6965j21749j92317j17770p8839j03228p8934r7033M9040
13763i1336k8214L9229P8840K4196Q9180M1806j7684Q6289k2034l7973m2163l3615
13751H6521L4311P8130m5689n3321J14906M5628o026L7397M9506K1862m2854K6520
13739C46891R8270p5529k7848p3642l8470K6827M1819M4846q5349j00304M9683
13728B07194R131n6344J0509K5792n5125o4287j8631R7745J10683n7897j41239
13717F7531j00505P2255R9192R984L4750j2983n365l0203L3402O8856n1397l5413
13705A50104l3654p492k5900J1148L5969o891m703N787J6079M8869O676O9638
$$ y = [884056, 790305, 717826, 784288, 850008, 813692, 868696, 921952, 987469, 955355, 889935, 873979, 736459, 649494, 527745, 335428, 217658, 138819, 35591, -43343, -140376, -91336, -119550, -80321, -1481, 22715, 111895, 153701, 136017, 222306, 200272, 162299, 120136, 86521, 120832, 198962, 153273, 99952, 214858, 260486, 254460, 291857, 341363, 363225, 320371, 346891, 445161, 369632, 341784, 268142, 229672, 256499, 298318, 343164, 257815, 157511, 207194, 216325, 159981, 170490, 196282, 141157, 76870, 58239, 155984, 266667, 208770, 67531, -32974, 39281, 138473, 148457, 183207, 170224, 164859, 134656, 168058, 236914, 185517, 150104, 116450, 108958, 83058, 94206, 130175, 123284, 118581, 124368, 140447, 189316, 195992, 265630]
13693B65630l7591n0920j7609q3571M6212J0805j1944m9948R336Q7577j4186m2983
13681A10808p1891j1706j2847l3871N2424K8887j7510M1715n0182L1610K0149
13670H7586L8762K5171j7694n6922l2877L6500J45970M0937l200m1702q5545q2537
13658E4449k3125m738K7728N3167r714k9219k4023p3159O1465N3436j511k5598
13646E9158J2729J3834l6250J4133n7350K0150O1441L0690Q5645K2547n3880K1823
13634A94670M8545n209J4827j3170n9911j03718m9894L7624O9919N0157K7936
13623B11776N2978m8806j51120j169N5056l0343j8365K7068J2424q0921j7284
13612A1294N2846L7583n1006o8757N1204L9532j3661o9718p197m3215j6791O6970
$$ y = [265630, 228039, 177119, 159510, 75939, 122151, 132956, 121012, 71064, 80400, 167977, 153791, 110808, 38917, 27211, 14364, -19507, 32917, 61804, 44294, 86009, 35827, 67437, 87586, 126348, 151519, 133825, 76903, 44026, 80526, 226496, 267433, 264233, 222531, 136986, 54449, 31324, 26586, 54314, 107481, 97767, 68548, 44525, -28634, 32831, 86267, 84756, 59158, 71887, 85721, 49471, 63604, 6254, 26404, 87845, 118535, 204180, 226727, 172847, 194670, 243215, 238006, 252833, 239663, 179752, 76034, 26140, 63764, 133683, 183840, 211776, 264754, 215948, 64828, 63659, 118715, 88372, 70007, 97075, 109499, 28578, 11294, 64140, 101723, 50717, -18040, 33164, 72696, 59035, -10683, -17880, -61095, -77886, -10916]
13600a0916Q1435k0532l2511M4285k3112r4112J477k3812J8393L918j4549l2465
13588a02501J51438M6429K2717l3984m0780M0922J9704Q906K8000j6376q5975
13577C8500j12924k1970N1685N4880o3724K5235L3046J2132k5904k282P5922R737
13565G4333M8904j0669l5779o3851m9612j9619m884N298L4525O8446k0017n1587
13553b4512Q0251O4836l8845p6083j4185n669J2590P5979m7716M441q708L4773
13541E7152Q1643l8853m6868n0818M5073Q3061k6454p39L5854J348j0023K9476
13529A59852J6913J1945j729K2163k1053l3012j9130r612k3428M5766j986l7083
13517A09606k2197R6186p5017m6961m6674q6015J2893m1791o2728L0413l9191
$$ y = [-10916, 70519, 49987, 17476, 61761, 38649, -55463, -53986, -77798, -59405, -55487, -70036, -102501, 48937, 95366, 118083, 84099, 43319, 84241, 103945, 112851, 140851, 124475, 38500, -74424, -96394, -44709, 10171, -53553, -28318, 4728, 16860, -9044, -11326, 64596, 74333, 123237, 112568, 76789, 12938, -36674, -56293, -61177, -55879, -21354, 47092, 27075, -24512, 55739, 120575, 81730, 5647, -8538, -14207, -1617, 74362, 26646, 31087, 22379, 57152, 138795, 99942, 53074, 2256, 47329, 130390, 103936, 103197, 139051, 140399, 130376, 159852, 176765, 188710, 186981, 209144, 188091, 155079, 135949, 126337, 102909, 148675, 146689, 109606, 87409, 183595, 108578, 61617, 14943, -71072, -58179, -99970, -162698, -132285, -171476]
13506a71476M430L789N0996L5371J6390r9372K3426R9670M9228l0095m5034o4792
13494a27469N0388J01068k6164o8767N649J6748N7315J2839N9162L584j10948
13483b6595o6861O7339O9182N5047n8273k4706J0977k6228j1848O2415J0542k4120
13471C6871j9073M9398J576n0313k1559K0540J8297r471K6276j4614K163k9164
13459A0927K2520m450k5575L8946O3898k3649J1387k1456o66L3092O4022P7172
13447B46168N5550k7533j18633o9343J01184J37085J15752R4601J35353Q7843
13437G58027K1716R3452J43578J89432J75485K64005o957q0246j28982k18375
13427A211135j70971j39422j52094j11100j34709o564o4921p3184k3583m7257
$$ y = [-171476, -167046, -163257, -112261, -76890, -60500, -159872, -136446, -36776, 12452, -17643, -62677, -127469, -77081, 23987, -2177, -70944, -65295, -48547, 8768, 21607, 80769, 84353, -26595, -93456, -26117, 43065, 98112, 39839, 15133, 26110, -118, -11966, 50449, 60991, 36871, 17798, 67196, 68772, 18459, -3100, 17440, 35737, 26266, 52542, 37928, 40091, 10927, 33447, 28997, 3422, 42368, 106266, 82617, 94004, 72548, 71882, 104974, 168996, 246168, 301718, 274185, 155552, 86209, 187393, 324478, 440230, 534831, 670184, 758027, 779743, 873195, 1016773, 1206205, 1381690, 1645695, 1638738, 1558492, 1429510, 1211135, 1040164, 900742, 748648, 637548, 502839, 496275, 431354, 358170, 334587, 287330]
13417B87330q4160j15614L5064K4397J1912N3837p1581l9073o1025o7275k5959
13406e2147k9127J06047J20382l513k6943n1976j6518K1351o0595M1905Q6440
13395A35306R3187o4729j02562l6939m1348k1845J3560J5449R484L2690J04552
13384A36805m880k9209l2644j14258m5636N881R2513J17927K9758J4646P382o4724
13372A13561p1940m0682n4673N1695K8988J3028l4259L9745j9648o3215J9467
13361a7933J5246R597N2891M3657q2766m9597K9321O8095L9004m1157j3136K7655
13349H0877J1520L714J700j05224n114O4982L8466m984n8565n6567j6300p42N1265
13336E028P2919l2010l2297J720J4464M246P825n0552o7288j8687O1300L9268
$$ y = [287330, 203170, 87556, 122620, 147017, 158929, 212766, 141185, 102112, 41087, -26188, -52147, -81274, 24773, 145155, 141642, 114699, 62723, 46205, 67556, 6961, 48866, 135306, 228493, 163764, 61202, 24263, -17085, -38930, -25370, -9921, -437, 32253, 136805, 131925, 102716, 70072, -44186, -89822, -83941, 8572, 126499, 156257, 170903, 178285, 113561, 41621, 939, -53734, -2039, 26949, 39977, 5718, 45463, 25815, -37400, -17933, -2687, 6910, 59801, 103458, 20692, -28905, 416, 68511, 107515, 66358, 53222, 80877, 92397, 96111, 97811, -7413, -12527, 52455, 90921, 85937, 27372, -29195, -45495, -46237, 5028, 77947, 45937, 13640, 15360, 29824, 34070, 41895, -8657, -75945, -94632, -33332, 5936]
13324E936K9237m7634j0840o661l9054M950J16466l5221M0272P3389m0722j02954
13312a2836n8053k9754J5530J3279K6420O30J6485r3264m2057P3068R0062L9702
13300C9212k0998l3198L2480L2537j0642J2490j5921K771j5003O9201N813l9427
13288E9315k3401Q333l7696m7545K2717Q0412L4472O62m2165n9392k6953M895
13276b6346k63M3427K5584m6922L5654K5560K6671p889l73J47J6393J8747n5173
13263E5217k8441k0421r0469J1372k7986l17J4634L5740L7489j2039j6648K1039
13251b0830Q505n0227n1754m3486J0523N4092M8129K4545j2683j7392J1264j8689
13239e8003M1787J050o8892k3936P260M477j5950K9134l7219K755N5716L2795
$$ y = [5936, 35173, -12461, -23301, -29962, -69016, -64066, 52400, 17179, 57451, 130840, 90118, -12836, -70889, -100643, -85113, -71834, -45414, -44784, -28299, -121563, -163620, -90552, -490, 39212, 18214, -14984, 17496, 50033, 39391, 51881, 35960, 38731, 23728, 92929, 98742, 59315, 35914, 44247, 6551, -40994, -18277, 62135, 96607, 97269, 55104, -4288, -31241, -26346, -26609, 16818, 42402, -4520, 31134, 56694, 83365, 75476, 75103, 75250, 91643, 110390, 55217, 26776, 6355, -84114, -72742, -100728, -101045, -86411, -50671, -13182, -25221, -41869, -20830, -12325, -62552, -114306, -157792, -147269, -93177, -45048, -20503, -33186, -50578, -39314, -58003, -16216, -15166, -84058, -107994, -100734, -96257, -112207, -83073, -120292, -117537, -61821, -29026]
13227b9026J9679J854M928M8349R7369o5108n4124m8473o892M5922n1120N3982
13215A7340n1627K8011m2342P2219M4645m6567m2770m7952k7974J1366P3746K2354
13203A0449J5441l5621j093p069j1755m1334L7815L8518K1836o522K9185m6192
13191C658m7768n0108l8273O2765n3127j7109L0234J8687L6373l6668N9614P0865
13179C9143L5457O9628m9945l7415j3681J7490o70n036o6625m646J4609K1424
13167A9733q5647k4785J15153M583q080p9339l4075K4320m216n344J0221J08317
13155D0841J0742j9013j0456N8704N6888k4612m0442o757L0217O2215K5223k6173
13143A57377q8199r4749p1452j6427K3466M5135O2185Q361j97n1470n2631L4280
$$ y = [-29026, -9347, -7493, -2565, 45784, 143153, 78045, 23921, -24552, -31444, 14478, -36642, 17340, -34287, -6276, -48618, 23601, 68246, 21679, -21091, -69043, -97017, -85651, -11905, 10449, 25890, -9731, -10824, -17893, -29648, -70982, -33167, 5351, 27187, 20665, 49850, 3658, -44110, -94218, -132491, -69726, -122853, -139962, -109728, -91041, -54668, -91336, -31722, 39143, 74600, 144228, 94283, 56868, 43187, 60677, 60007, 54971, -11654, -16300, -1691, 19733, -65914, -90699, 24454, 29037, 20957, -58382, -92457, -68137, -72353, -77697, -67476, 40841, 51583, 32570, 22114, 80818, 137706, 113094, 72652, 65895, 96112, 158327, 183550, 157377, 69178, -25571, -97023, -113450, -89984, -44849, 17336, 25697, 25500, -25970, -78601, -44321]
13131d4321o6546j7317M7435K1600k4485k8177J02783R7751m3928j9692k2580
13120B523m5888p3517q9001R0146J21806p895q0407m2713M9987j0868O0079J34649
13108A08901p8543o0079n5921k6811M2887Q4607J4035O3839L0620p2302j01911
13097e0678O7596L8030k0907m3125m6495R5220M7549o8750m8233p1507O2427J01715
13085F2842q349q8652j8302O6454N3770j2987q9487j9249l4085L7584P1872P9541
13073A00952p279L1910L3249l4063q509J3382r6328l3049M1651L171M564M0325
13061H9976k8549M4436O2067r3659q1281k2246N3959M2139n0655k0841N6132k405
13049D9073j6221m6776K2629N628M5580Q219p3509m0052J0930o893O2641J6398
$$ y = [-44321, -110867, -128184, -80749, -59149, -83634, -111811, -9028, 88723, 44795, 25103, 2523, -43365, -116882, -205883, -115737, 6069, -1826, -82233, -124946, -74959, -85827, -25748, 108901, 30358, -29721, -85642, -112453, -69566, 15041, 29076, 92915, 123535, 51233, -50678, 16918, 54948, 34041, -9084, -55579, 39641, 87190, 18440, -29793, -101300, -38873, 62842, 54493, -34159, -52461, 13993, 67763, 54776, -34711, -53960, -88045, -50461, 21411, 100952, 93673, 125583, 158832, 124769, 116260, 129642, 33314, 265, 41916, 45087, 49651, 89976, 61427, 105863, 167930, 74271, -7010, -29256, 24703, 66842, 16187, -4654, 51478, 49073, 32852, -13924, 8705, 14333, 59913, 68132, -5377, -45429, -34499, -41392, 21249, 37647]
13037C7647o0602k7681L1630J612l9494k9087M791M9608N6296j5756o465o8581
13025f6082l8856J851Q9768M4861M5603o7414m1420l0790K2954Q2198M3475l7436
13013D8712n9819J7348j4850m7588N8854L7548j09641m8535K8879Q825J6716Q1850
13001A8299O4476l8822m607n1432n2009K4018j4919N2140P4303r7675j26955K802
12989a50381J02462L8436P4061K7748k724M5016j661j0757M8022j04609n620l9817
12977B0176q7669k0931N3781J3422m925N9027n3777j27570k2364L1200J6738O8538
12965e4354N1111p7794m2298M6454P482J2723K9219M5497L4227N6038P5118o1078
12953A22345k0149M2476n0378j47119M968N6996J989M5075j6806o2728m7796K5867
$$ y = [37647, -22955, -50636, -19006, -17394, -56888, -85975, -81184, -31576, 24720, 8964, 2499, -66082, -104938, -103087, -13319, 31542, 77145, 9731, -31689, -62479, -39525, 42673, 86148, 48712, -11107, 6241, -8609, -56197, 2657, 40205, -69436, -117971, -89092, -80267, -63551, 18299, 82775, 43953, 39346, -12086, -64095, -40077, -54996, -2856, 71447, -26228, -153183, -150381, -47919, -9483, 64578, 92326, 89602, 134618, 132957, 122200, 170222, 65613, 59993, 20176, -67493, -88424, -34643, -21221, -26146, 32881, -20896, -148466, -170830, -139630, -122892, -54354, -3243, -81037, -123335, -76881, -69399, -56676, -27457, 18040, 52267, 108305, 183423, 122345, 102196, 144672, 94294, -52825, -47857, 9139, 11128, 56203, 39397, -23331, -71127, -45260]
12941d5260j6996K8786N4828K9953K5906m9749j26088j0085k5918J8864O8385
12930d7374K0602k1195l2656m4982L2756M2445m2461j10625K6539O9737j3972
12919a21186M3485J02009L1527N198L8627L6514j2913n4493r5664m4761J4147
12908e7510L8123M6711K328m7490L1183l7344K2909J1969p602n5525J8459P5533
12896D1744O3151J21m3352k6287N6047r8418n4258o278K6127K9449R146p85l3770
12883c7363J8399K3778l875m4075m3619j7422N419J8554M1286K6921j5838M3932
12871A6097o287m0240n7093m356M9279J11090R301j2230K8172J6250j09909j2614
12859a2540q372p7183J4344J04055m7609N9174L2170o9481q4903K3820Q0298O2263
$$ y = [-45260, -62256, -33470, 21358, 51311, 77217, 27468, -98620, -108705, -134623, -115759, -47374, -26772, -47967, -80623, -125605, -92849, -50404, -92865, -203490, -176951, -107214, -121186, -77701, 24308, 55835, 61033, 99660, 136174, 123261, 68768, -26896, -71657, -57510, -19387, 27324, 29652, -17838, 13345, -23999, -1090, 10879, 3277, -52248, -33789, 41744, 104895, 105016, 61664, 35377, 91424, -6994, -61252, -67530, -41403, -11954, -2808, -3593, -37363, -18964, 4814, 939, -43136, -86755, -104177, -98758, -80204, -38918, -11997, -27835, 16097, 9810, -30430, -87523, -91879, -42600, 68490, 77791, 65561, 93733, 109983, 74, -12540, -20912, -98095, -83751, 20304, -27305, 31869, 64039, -5442, -90345, -66525, 13773, 76036]
12847G6036N2764k1790j11155l758K9594k5967o8621n9390L4359P7095K8531O3805
12835G1503J9369l9502p6241j8099k84J5180K2481k8751m2120k8398OM7527J8672
12822c8657K2167k7115L1039M7876J7153j0527L6271k0906n2390o5083M4994P0629
12810E5451q7042o3119q0368j01575P7697O3511M0461O1736o2424l315j7890j0932
12798a27809Q706K2900R0926P3301M004K6501K1578m7636l4584l7676m8414O4717
12786A6514L8328K3027k526J8838k3776m4931n160J0308R233m8061k2465l2388
12774f3059m925o1510N2271N5472J1677j9789K0453l6241N230P7860L0729p9701
12762a1533j64745l8223j5591P4159R7157J7383J7475j9451k3394N7349m4771
$$ y = [76036, 128800, 107010, -4145, -7903, 21691, -4276, -72897, -132287, -97928, -20833, 7698, 71503, 90872, 51370, -24871, -42970, -43254, -28074, -5593, -34344, -76464, -104862, -104856, -57329, -38657, -16490, -43605, -12566, 35310, 52463, 41936, 78207, 57301, 4911, -60172, -15178, 55451, -31591, -94710, -175078, -276653, -198956, -135445, -94984, -33248, -95672, -98987, -116877, -127809, -119103, -96203, -5277, 68024, 72028, 98529, 120107, 72471, 37887, 211, -48203, 16514, 54842, 77869, 75343, 94181, 70405, 25474, 20314, 30622, 39855, -8206, -30671, -63059, -67984, -129494, -77223, -21751, -10074, -29863, -9410, -45651, -40421, 37439, 68168, -11533, -176278, -214501, -230092, -155933, -58776, -41393, -23918, -43369, -66763, -9414, -54185]
12751e4185o6381N7954O3378L9214L429r2125j8120L6837O0279k1923n4019l0913
12739g6575M4139N3002k770r247p0564l8254N9854P3949J8395J6785O0963L306
12727A32983k7884J6070o7846l6153M2473m0486j2324N7327l1985j02361j0891
12716h1077P5458M2221m9525R283R3691K5337J2328k7788p4058p2292n696M320
12704d7798l7441P8594Q5397J5627P8044M2135n0333q1036L3299K7606m77p1343
12692G2274q0174K1994P3762R4990K7101K4910n9024j03107l6877l1482m2292
12681c7925L7432m0193j8801J1543J722R473O9279P1768k0375K6160l9903k8763
12669D1417l2994K3466L4888l68P527N6328l7068p09M8628j5561p7842L1562j1083
$$ y = [-54185, -120566, -62612, 766, 39980, 43409, -48716, -66836, -29999, 30280, 8357, -45662, -76575, -32436, 20566, 17796, 8549, -62015, -100269, -40415, 33534, 51929, 68714, 129677, 132983, 105099, 121169, 53323, 17170, 59643, 19157, 6833, 64160, 32175, -70186, -81077, -5619, 36602, -12923, -3640, 90051, 115388, 127716, 99928, 25870, -46422, -52118, -47798, -85239, -6645, 78752, 94379, 172423, 214558, 164225, 83189, 116488, 144094, 143617, 72274, -7900, 14094, 87856, 182846, 209947, 234857, 175833, 72726, 35849, 4367, -37925, -493, -40686, -59487, -47944, -46222, -36749, 32530, 104298, 83923, 110083, 70180, 41417, 8423, 31889, 66777, 66409, 73936, 130264, 93196, 92487, 141115, 125554, 47712, 79274, 68191]
12656F8191m2349K7546R7668P3368j01088o4100L9187O167o2572k6732L180M0123
12644E8589J2975l4413M0160K6946P195n7407m3856m1943m9056o5101n2466N4479
12632a43898J09327j7896q1054p428M9759P6212j9894n2182N720j0429K5968N9645
12620f150L7801K8597k4413L8264N1646k0665N6865N2277q559K9373R279m7023
12608A97292n7970o3800K8165j3353m8179j8216K0367R537N1770K4654l7280j04160
12596a1173k3587R8963j3758j02581l4132j3298P340j3281L9726j7956l9911k6768
12584a50416q582O703L779K3607J5256k6821K3774P4427J1909p8351m2454Q1731
12572f5438R8338J3985K2253r226n3868k1697R9923P798k9361m6791J448l4816
$$ y = [68191, 25842, 53388, 151056, 224424, 123336, 59236, 98423, 104590, 42018, 15286, 18466, 58589, 71564, 37151, 77311, 104257, 111452, 54045, 10189, -31754, -80810, -145911, -198377, -143898, -34571, -52467, -133521, -140949, -91190, -14978, -34872, -87054, -81334, -91763, -65795, -6150, 31651, 60248, 35835, 74099, 125745, 105080, 161945, 214222, 205663, 235036, 244315, 197292, 139322, 75522, 103687, 90334, 42155, 23939, 44306, 53843, 105613, 130267, 92987, -11173, -34760, 64203, 50445, -52136, -86268, -99566, -92226, -105507, -65781, -83737, -123648, -150416, -158998, -152295, -148516, -124909, -109653, -136474, -112700, -38273, -26364, -104715, -147169, -65438, 32900, 46885, 69138, 59912, 6044, -15653, 84270, 92068, 62707, 15916, 17364, -17452]
12560a7452M5837K9006r9398l2130O5246Q9501m6500j6066O2150K6936k3408n0753
12548C2969j14413J802l3708j1818M7209J13610J2361n6427j0925n372N5615l4036
12536c133K2980j01996n1634N6977R5595P2576o5487j15951k1211Q1342M4613
12525A4671L4569q465L1439M365o4817j8402Q25j05470N743K0023j6799k7158
12513a29476p4914N923l5685J8310N5718M0596j7157o263O4453N3970K9080r794
12501e239L2288m1854k3365R5231L7615r7100j0045L2675L5039l2268j3765j19774
12489a10562K7806R7168k2402j7654J8112q002R989l9509K8913J4775m4104K8216
12477a7254P8016L2555j33215k2259j0051r667Q126o424K5064N3026k3720r7668
$$ y = [-17452, 28385, 57391, -42007, -74137, -8891, 80610, 34110, 18044, 80194, 107130, 83722, 32969, -81444, -79642, -113350, -125168, -77959, 35651, 48012, -8415, -19340, -24712, 30903, -3133, 19847, -82149, -133783, -76806, 18789, 91365, 25878, -90073, -111284, -29942, 14671, 49240, 40775, 72214, 76579, 11762, -6640, -5815, -111285, -105542, -85519, -102318, -129476, -204390, -198467, -234152, -215842, -160124, -119528, -136685, -142948, -78495, -24525, 4555, -5239, 27049, -14805, -38170, 57061, 94676, -2424, -12469, 20206, 55245, 22977, 9212, -110562, -82756, 14412, -7990, -25644, -7532, -15534, -5545, -45054, -16141, -1366, -45470, -17254, 60762, 93317, -39898, -62157, -72208, -81875, -73749, -80173, -55109, -2083, -25803, -123471]
12465a23471j1849N3422L0967K4377J1604O9711k2995m8675R9299J3215m5907
12454D9698q3678L5803N2854o9673L2940k2552k2049P1192k1823J262L1770k0829
12442C4915n1226L0006q7304J9592R1199J03173J9009k0798o6641j01178m7140
12431g6393L4714R7532k641m8586N1521j7119r2061J1641M9014K1360K0862J0858
12419F0702j0649P9205K7047q8350O622L8372O8165k4272q7247K6476q575m8087
12407C9409Q4048O5344K5570j3740j8106m7350l469J05797M7574l9358N8427P530
12395C11676L071j6812j10433l4648L523j0070m7664K2741K3197j2545N3336k3956
12383A61416k7111j0511L890n7999l3024J4407j11971l4216Q8727J14958L9071
$$ y = [-123471, -135320, -81898, -50931, -26554, -14950, 54761, 31766, -16909, 82390, 95605, 49698, -33980, 1823, 54677, -14996, 17944, -4608, -26657, 44535, 22712, 23974, 55744, 34915, -16311, 13695, -73609, -54017, 37182, 140355, 159364, 138566, 71925, -29253, -76393, -41679, 55853, 53212, 4626, 56147, 39028, -53033, -41392, 7622, 28982, 49844, 60702, 50053, 129258, 156305, 67955, 74577, 112949, 181114, 156842, 69595, 96071, 87496, 39409, 123457, 188801, 214371, 200631, 182525, 135175, 131706, 237503, 285077, 245719, 304146, 311676, 314747, 297935, 187502, 152854, 156377, 146307, 98643, 121384, 144581, 132036, 185372, 161416, 134305, 123794, 127684, 69685, 36661, 51068, -60903, -95119, -6392, 108566, 147637]
12372A47637m7599l3190M6196k9404m0921O4130J04011M1176l8014J2991O6770
12361B93783K8610K1490j6089j18567q9359L3658j6254o2318J7735J1377j7228
12350H6838K037J3250p4531l148k9498n7061M7624M9626l10M2617k3008m236m6602
12337C598j2684R639L5309l9882N7294Q2205n8662j0446k7980J0399K2683N7019
12325A28492Q2648J49770R6654K6955L6289o5599q5174j52322m6612m645m0636
12314A25820q9238O2116l770l9015O6533P9913q679n9256R790k981m9609n1063
12302D0561R565L3854k8551m0339L3881J18068L8698l2975o5319l2920O942N7900
12290A39365m3147M0682N4864J04160J4188N1323j3537j0663J3558Q084r6466
$$ y = [147637, 100038, 66848, 113044, 83640, 42719, 106849, 210860, 252036, 214022, 227013, 293783, 322393, 343883, 327794, 209227, 119868, 153526, 137272, 74954, 92689, 104066, 86838, 88875, 102125, 27594, 24446, -5052, -62113, -14489, 35137, 34827, 77444, 54436, 50200, 3598, -9086, 553, 35862, -4020, 53274, 135479, 76817, 66371, 38391, 48790, 71473, 128492, 211140, 360910, 457564, 484519, 520808, 455209, 370035, 217713, 171101, 166456, 125820, 36582, 98698, 94928, 55913, 122446, 202359, 193680, 134424, 144214, 141233, 91624, 40561, 50126, 83980, 55429, 15090, 48971, 167039, 205737, 172762, 107443, 74523, 81465, 139365, 96218, 136900, 191764, 295924, 310112, 361435, 347898, 337235, 350793, 358877, 262411]
12279B62411p4084J0851p1059q128K8097j06100k1865R9116J2793l3845m2933
12268E5254n576l7393N0647L1417P6277l0933l3501l7865L4249n4387q8809N9582
12256A8962P2709m4430l1789j236J4277q62L6776K3439j4266P078l0921L0542
12244H0279K9318l1295L2815j9799k2522m6606M5376L6956K0979l4943n3572l6363
12232F23P382K0532K3976K4782j392r237k5043N1018O5687K6599L5870k479o2177
12219A56141p084J364O2823q638p4710K4814O5643n5407r1436l9800l689J7728
12207D7749J01375l9451m7566l6504J05152p060m2631J7212Q5544k0233M3087
12196B06674L3712j7475m7937o0898n0095j3837k5398p2533m0429K4001K9204
$$ y = [262411, 188327, 199178, 128119, 119991, 148088, 41988, 20123, 119239, 132032, 98187, 55254, 49678, 12285, 62932, 94349, 170626, 139693, 106192, 68327, 102576, 48189, -40620, 18962, 91671, 47241, 15452, 14216, 28493, 27631, 64407, 87846, 73580, 80658, 49737, 80279, 109597, 78302, 111117, 91318, 68796, 22190, 67566, 104522, 125501, 90558, 36986, 623, 8005, 28537, 52513, 77295, 75903, 66666, 41623, 92641, 158328, 184927, 220797, 218318, 156141, 149057, 150421, 213244, 204606, 129896, 154710, 220353, 164946, 73510, 33710, 30021, 47749, 149124, 109673, 62107, 25603, 130755, 123695, 81064, 98276, 183820, 163587, 206674, 240386, 222911, 174974, 114076, 63981, 50144, 24746, -47787, -88216, -64215, -35011]
12185c5011k4350L2166P2903J20944M3973r0717m1728j9982n4854N6111Q3244
12174A42699J6077J5633m3088k0087L1427L1203k5662K0972k8207o7869N1256
12163A24354M7011j2251Q043n4785l6707l9245N8015n4889p2497l8947N3368N5762
12151C7232n7211m3534J21253K1686M85J6763L481n9698j0921l394R8030k5763
12139I8409m2690J4331O713J9205K9013N3712J8266l1267n3083J9166J4106j4967
12127A30914n8748k5840J9978q025l9083J06895R4351J1166J0595q0512k3595
12116A38096N108j7379M0149m6450J7548J9945N123M4346P700l5248p078J4233
12104A86093l5276j34781J6991O7138P700l0342L3596m143J0976O1245P0896O0399
$$ y = [-35011, -59361, -27195, 45708, 166652, 210625, 119908, 78180, 58198, 3344, 59455, 142699, 158776, 174409, 131321, 111234, 142661, 173864, 148202, 169174, 140967, 73098, 124354, 171365, 159114, 167157, 112372, 75665, 36420, 94435, 39546, -32951, -71898, -18530, 37232, -19979, -63513, 57740, 79426, 79911, 96674, 100155, 40457, 29536, 26142, 124172, 98409, 55719, 70050, 76763, 95968, 124981, 178693, 196959, 165692, 112609, 131775, 145881, 130914, 72166, 46326, 66304, 58279, 19196, 126091, 220442, 231608, 242203, 161691, 138096, 143204, 125825, 165974, 119524, 137072, 157017, 162140, 206486, 214186, 178938, 171860, 186093, 150817, 16036, 33027, 100165, 107865, 77523, 111119, 106976, 117952, 179197, 250093, 310492]
12092C10492J8699q6211M6054J1756M4776M9505k1174K6580L4348l2329o7077
12081C35419M5958Q1821J19117M0541M299O2265j648J15588J53839M7419L7422
12070A042040M7250j05717k18036j03173j6227o8268n3633k2993j5451r2584m878
12059C88330k2350J0262l1150k671K0903M5384k0603j5925J4825N2998j1737k8435
12047C99831J27607K9849q4664P4167K7392k3583j1591l4435J22393L3635q3135
12036E77466k1132L0092L5332O8151k7568j8107N8463j1518M5042P6423k6020
12025G86624o7792M7622R7163O0542m7069k0961n4744K3874J4750j7605O4585
12014H86989J53586Q7442J1726L4666N8691J579p158J39127Q6733R4220K4671
$$ y = [310492, 329191, 242980, 289034, 300790, 345566, 395071, 373897, 400477, 434825, 402496, 335419, 381377, 463198, 582315, 622856, 627155, 689420, 687772, 803360, 957199, 1004618, 1042040, 1089290, 983573, 765537, 662364, 646137, 577869, 524236, 501243, 485792, 393208, 388330, 365980, 376242, 345092, 342421, 363324, 408708, 388105, 372180, 387005, 440003, 428266, 399831, 527438, 557287, 472623, 546790, 574182, 550599, 539008, 504573, 626966, 660601, 577466, 556334, 586426, 621758, 689909, 662341, 644234, 702697, 691179, 736221, 812644, 786624, 718832, 766454, 863617, 924159, 877090, 856129, 801385, 825259, 840009, 822404, 886989, 1040575, 1128017, 1139743, 1174409, 1233100, 1234679, 1227521, 1366648, 1453381, 1547601, 1572272]
12003A572272K8953N7088J9731M0142J08688N7711j2108N453Q9657N5461J65085
11992B188133J62155J10054J30376R4967R5632O5391K4107J66266K38794J91813
11982C467688K72373J64504K01856L23912K33246K54655K62433L62719L47420
11973E890806K60931M79420O59013O89270O62623P02751Q48002Q43593R95174
11964A2031583J212837J358027J545671J791706K094872K513693L093261L701327
11956B9342977M401568N289158O702163Q276733J0281045J2959454J6353715K0247661
11948A13854474K4838465K8999297L1149308K8746972J9279823L681451j3038572
11941B37511218k4828314k9761963k9594426k6530099k2331658j8249701j4747571
$$ y = [1572272, 1601225, 1658313, 1678044, 1718186, 1826874, 1884585, 1872477, 1877930, 1967587, 2023048, 2188133, 2350288, 2460342, 2590718, 2685685, 2781317, 2846708, 2870815, 3037081, 3275875, 3467688, 3740061, 3904565, 4106421, 4430333, 4663579, 4918234, 5180667, 5543386, 5890806, 6151737, 6631157, 7290170, 7979440, 8642063, 9344814, 10192816, 11036409, 12031583, 13244420, 14602447, 16148118, 17939824, 20034696, 22548389, 25641650, 29342977, 33744545, 39033703, 45735866, 54012599, 64293644, 77253098, 93606813, 113854474, 138692939, 167692236, 198841544, 227588516, 246868339, 250549790, 237511218, 212682904, 182920941, 153326515, 126796416, 104464758, 86215057, 71467486]
11934G1467486j1695121r210721p399944n970096m810267l959714l333637k766201
11926B2321785k462054k112125j676354j457729j273604j066712j006231q85369
11918A0381607p55877o33165n95870n24849m29588n02729m22653l35137l20947
11909E860792l57336k54910k54119k37500k53014k54612j88122k13564j13675
11900C733940k15486j96508k15875j05477q2359o5115j13469q4255r5046n9620
11890B500730m8621l9863j05010j11780p3115j2608o9351j56473j04631j5863
11880A763415j1692J1630l4387o3937r9120j24448m8014J8419k4563j7347L8450
11869A408406J5051j14867j09053k3367J0583l7834o2883m4733o690L9020q067
$$ y = [71467486, 59772365, 50561644, 43161700, 37191604, 32381337, 28421623, 25087986, 22321785, 19859731, 17747606, 16071252, 14613523, 13339919, 12273207, 11266976, 10381607, 9625730, 8992565, 8396695, 7871846, 7442258, 6939529, 6516876, 6181739, 5860792, 5503456, 5248546, 4994427, 4756927, 4503913, 4249301, 4061179, 3847615, 3733940, 3518454, 3321946, 3106071, 3000594, 2918235, 2853120, 2739651, 2655396, 2560350, 2500730, 2452109, 2412246, 2307236, 2195456, 2122341, 2109733, 2040382, 1883909, 1779278, 1763415, 1751723, 1763353, 1728966, 1665029, 1565909, 1441461, 1393447, 1411866, 1387303, 1369956, 1408406, 1423457, 1308590, 1199537, 1176170, 1186753, 1148919, 1086036, 1041303, 1034613, 1073633, 1065566]
11858A065566r2852Q836M0643r2609j5984R700L5094j1250M2123K8859n8050q9661
11846H70415o53P7247m1905k9501n5582o5855K208j3143l5226K0175j9029k7873
11834F81278r944J9226J087k965N0654O5823P4878o292r5938r4362K196O3533
11822G49174P721o2305p7735r8986j50126r5540l5302k2980p8683n8733j7129
11811E9376K8229j0182L7518N573M6968l0433k2963o818L1716J8402J9722P0316
11799B47424M6864M9052M9233M835q414n2934m6077O8821K9400j5873J8302J195
11787C91828o7663r0202j6572N6397L2608M9912J7888o8743m6253j2628k2110
11776B24462l1308l2054P9704K6914n3919m4813o7476K3426J6030Q396N5519R5699
$$ y = [1065566, 972714, 981550, 1022193, 929584, 913600, 923300, 958394, 947144, 989267, 1018126, 960076, 870415, 869762, 947009, 905104, 875603, 820021, 754166, 756374, 743231, 708005, 728180, 709151, 681278, 671334, 690560, 691647, 688682, 739336, 805159, 880037, 873745, 777807, 683445, 685641, 749174, 756895, 694590, 616855, 517869, 367743, 272203, 236901, 213921, 135238, 76505, 59376, 87605, 77423, 114941, 120514, 167482, 137049, 114086, 107268, 138984, 157386, 177108, 247424, 294288, 343340, 392573, 397408, 388994, 336060, 289983, 358804, 388204, 372331, 390633, 391828, 324165, 233963, 217391, 273788, 306396, 356308, 374196, 305453, 259200, 246572, 224462, 193154, 161100, 240804, 267718, 213799, 168986, 101510, 124936, 140966, 149362, 204881, 300580]
11764C00580m5866k0643K7363Q3052j2371j15026o5729L8542K2781k3212L0622
11753B20093J5575J057J673j3512p6714K2360J1556j7871J5713M5617N6395j2696
11741B69246q9131l903m1144J9098N1773p4256m4318J613N5140j2276l4613o238
11729I0991L673L2032J07955J2023q4893o6606J5952j1314n8235K1652P8868P9331
11717B21429L784n7023m8617J8349l693q189Q662K8610M5436m1712j17715o5299
11705a5978K372N3785N5181M4382R5317k1383o431q719K1161o427j01053L1909
11693A44116m6019k3538L7544L1358K0184l1444n5786N3731o805j0987J2564O3403
11681A88321l6110k3760L0172o3024L6854J7974l6954k7879q0290K6684L5341
$$ y = [300580, 254714, 234071, 261434, 344486, 332115, 217089, 151360, 189902, 212683, 189471, 220093, 235668, 236725, 238398, 224886, 148172, 170532, 182088, 164217, 179930, 225547, 281942, 269246, 180115, 176212, 135068, 154166, 205939, 131683, 87365, 88978, 144118, 131842, 97229, 90991, 94664, 126696, 234651, 246674, 161781, 95175, 111127, 99813, 41578, 63230, 142098, 221429, 225213, 168190, 119573, 137922, 134229, 126040, 134702, 163312, 208748, 167036, 49321, -15978, -13606, 40179, 95360, 139742, 235059, 213676, 207245, 198526, 219687, 213260, 112207, 144116, 98097, 74559, 112103, 143461, 163645, 132201, 76415, 130146, 123341, 112354, 124918, 188321, 152211, 128451, 158623, 95599, 132453, 150427, 113473, 85594, 5304, 31988, 67329]
11670F7329R0955O2449p4656J2142L3630N770n8265K2263j9372n607j4751L4107
11658A55994o3882J02745M4087K5352j8931j3211n296n0956m353Q7009q595n2863
11646A97100R2266N7414o361q5845p1171L8900L122p8853J27506J15968M4764
11635D34810m6687r8617l0395l4394q286N8681M6597p3808q2562K963m1192l6615
11623I0495M8157M1203p9786m4090j7906L7840K4087M0970j9728k2914n7752J5375
11611E5951m8466K1332O5854P034p7950m7622j147m6492P2478M7824l879K3549
11599F8466l844l9658n442R0635R355M3654M5206j01982k194J9138n093J00402
11587B18643J4560l0244K7620n2301j11147n0001q670M86N9595p1157n3603M3585
$$ y = [67329, 158284, 220733, 146077, 158219, 191849, 197619, 139354, 161617, 142245, 136638, 121887, 155994, 92112, 194857, 238944, 264296, 245365, 232154, 226858, 175902, 171549, 258558, 249963, 197100, 289366, 346780, 340419, 254574, 183403, 222303, 225425, 146572, 274078, 390046, 434810, 388123, 289506, 259111, 224717, 216431, 275112, 321709, 247901, 165339, 168302, 127110, 90495, 138652, 179855, 100069, 55979, 38073, 75913, 100000, 140970, 121242, 98328, 40576, 55951, 7485, 28817, 94671, 101705, 23755, -23867, -25014, -71506, 972, 48796, 44917, 68466, 64622, 24964, 19522, 110157, 119512, 163166, 208372, 106390, 104196, 123334, 118241, 218643, 233203, 202959, 230579, 178278, 67131, 17130, 8460, 8946, 68541, -2616, -56219, -12634]
11575a2634R1221N2260m6198p3922l9157k3557O1906M0708J3062n0230n3705J2217
11563b8029J8649P0461R957l9877l1920N8325J396n3644N512M2947L4141J1549
11551I9467k5449l3841l706p0840N8195L8422l5469L2765J19816M4380Q41m3412
11539A81169k6637J8150P940j17020J103M9712O8277L352j02221r6039l4191j5397
11527f1802O9603Q6012K2015k3694k4028l7735p5767o910m9566K3119J05212L7183
11515F3642n3473k0912l8062n4361J9180Q2249L535p7155M689l9555Q2632L9380
11503A1789O8291k7988j9525J6964O794M0249M737l019l3502j07834j8639r9629
11491a61312l3344K6392M5139M0945K1395p546N7125j7921l0270m0569K5181L8039
$$ y = [-12634, 78587, 130847, 84649, 10727, -28430, -51987, 9919, 50627, 63689, 13459, -40246, -28029, -9380, 61081, 71038, 31161, -759, 57566, 58962, 5318, 10830, 53777, 87918, 99467, 74018, 40177, 36471, -34369, 23826, 62248, 26779, 59544, 179360, 223740, 224581, 181169, 154532, 172682, 180622, 63602, 64705, 114417, 182694, 186046, 83825, -12214, -46405, -61802, 7801, 93813, 115828, 92134, 68106, 30371, -45396, -52306, -101872, -78753, 26459, 63642, 10169, -10743, -48805, -103166, -83986, -1737, 1798, -75357, -70668, -110223, -27591, 11789, 80080, 52092, 32567, 49531, 56325, 96574, 101311, 98292, 64790, -43044, -61683, -161312, -194656, -168264, -123125, -82180, -60785, -68331, -11206, -29127, -59397, -99966, -74785, -36746]
11479c6746N09p485j8234L4691o727l1352J2568O5720K5873J4961m2147n7763
11467d6132l5718O0225N4100j455K6851L6709l711m0486k7718L1894R0205k756
11455A42008o4574M052m7056r7659M56K4324n462L7364j2667l9396J6009M5946
11443C345l1727N1871M5997L0905l608m3131k0487Q1628m7311M5529Q587l4826
11431H6772L7065j5879n2800j9507k683N29J6741j6732J7542j3271p4121M2722
11419F378j683l1759L2957J1884p1432l0735O0881N7488r6953m624k3852k1899
11407a13349Kk453K0236Q1046O2561l5120l8244n2993M5404K7935L4641j7959
11395A1707q1977o3433K6318N8412R0477M3915L3242J3626l7551r0686n1591l4119
$$ y = [-36746, -36237, -43722, -61956, -27265, -33992, -65344, -52776, 12944, 38817, 53778, 11631, -46132, -81850, -21625, 32475, 31020, 57871, 94580, 90869, 50383, 22665, 54559, 144764, 142008, 77434, 81486, 34430, -63229, -62773, -38449, -43911, -6547, -19214, -58610, -42601, 3345, -28382, 23489, 69486, 100391, 96783, 53652, 33165, 114793, 67482, 113011, 121598, 86772, 123837, 107958, 55158, 35651, 32968, 33497, 50238, 33506, 51048, 37777, -36344, 6378, 4695, -27064, 5893, 17777, -53655, -84390, -23509, 33979, -62974, -67598, -91450, -113349, -113347, -115800, -95564, -14518, 48043, 12923, -25321, -78314, -32910, -4975, 29666, 11707, -70270, -133703, -107385, -48973, 41504, 85419, 118661, 132287, 94736, 4050, -47541, -81660]
11383h1660n9838k252P2165O76n8886O5545L5850n436O5194Q9453n302q73o535
11370A08101k0001L9518m529k155m9476q1758j08158k2809N0683K7584O3128n7557
11358e7429l0007J612K6743M1870Q4586Q3557p375p2180n831J9935n3036j7586
11346A4859j992j8205M959O7843R689l5250J5765N6459L2954m2692p3457p0707
11334c9775k6877n9760m7132j232O6293L7173L4459Q803n6569O5170l4n0420k6143
11321i6044r416J4586P9769O6385j05783l4036J8433l0693k5124K8156L6790K2502
11309c4475N7717k0403n052L0475l8530q1827k901K4911J5223L4459l5610r8218
11297a54231r3664L3169Q2825J22510k3329m015m6405o3936j7636J7041k659J30499
$$ y = [-81660, -141498, -143750, -71585, -70909, -129795, -64250, -28400, -33836, 31358, 120811, 115509, 114636, 108101, 88100, 127618, 123089, 120934, 71458, -10300, -118458, -141267, -90584, -63000, 128, -57429, -87436, -85824, -59081, -17211, 67375, 150932, 143557, 71377, 65546, 85481, 32445, 14859, 12867, -5338, -379, 67464, 77153, 41903, 57668, 114127, 147081, 104389, 30932, -39775, -66652, -126412, -173544, -174776, -108483, -71310, -36851, -28048, -84617, -19447, -19481, -69901, -96044, -105460, -90874, -11105, 55280, -50503, -84539, -66106, -96799, -121923, -93767, -56977, -34475, 23242, 2839, -2213, 28262, -10268, -92095, -94996, -70085, -54862, -20403, -56013, -154231, -247895, -214726, -131901, -9391, -32720, -36735, -83140, -147076, -164712, -147671, -150330, -19831]
11285a9831r146j08281o364L8614N4332O0889j7380O7526L2454o1704K8123K9583
11273H8815r075K0960J6163p5892k8878M7716Q2116J6659q4931K4670J3512K471
11261A14306q429J6700p4996n5298L904l292l8198R924p987n5653j4476P1096
11249d2399J2557J8655N8111L2620l1525L848q1192r5698J12246J15258K291p4133
11237C0639q331M2446k2459J2678l1931m5623P121K0131k2756P807N7119L4389
11225H1230p6091l9113N4125l3308M2043L7657k6089r6862K8273K7061K4504K4516
11213D7946J9617j450n9220m3178L2248m5917m6238K78L7428p372p0332N7869
11201g8321P7214j9465n2678k6934O0598K7364l7336N3194M8960P1961k7475j2150
$$ y = [-19831, -28977, -137258, -143622, -105008, -50676, 10213, -7167, 60359, 92813, 31109, 59232, 88815, 79740, 100700, 116863, 40971, 12093, 59809, 141925, 158584, 73653, 98323, 111835, 114306, 105877, 122577, 47581, -7717, -3813, -7105, -45303, -35379, -43366, -99019, -113495, -42399, -29842, -11187, 46924, 79544, 48019, 51867, -29325, -125023, -12777, 102481, 104772, 30639, 22308, 64754, 42295, 54973, 23042, -22581, -15460, 4671, -18085, -10278, 46841, 81230, 5139, -33974, 20151, -13157, 28886, 66543, 40454, -56408, -28135, -1074, 23430, 47946, 67563, 66113, 6893, -36285, -4037, -49954, -96192, -95914, -58486, -65858, -136190, -78321, -1107, -20572, -73250, -100184, -39586, -12222, -49558, 3636, 52596, 124557, 97082, 84932]
11189H4932J8186q5943r9131M349O5237R7778l7640j09805j4369J8623M648L8161
11177a4974n0376m1135o376m263p55l3224O3966L7469j5399l3423k0714O3322
11165e5882P8080k6741q5056l976j3047M8704J2413l0745k0958R7454P6451K7055
11153A03752l8396n6001L3558N7989K8686p379j1193j2074K5742n0359j8522n0410
11141E393o9072j2605R1468P7944o0926r6080N3579M4877m4872r94o7797N2387
11129b6698O1382P0009l5348n2895L113m662k9011M0713L1776J7412M8771j2494
11117A12068m3972j50492l5509N0398k4068L7789J9207j0666m2440l3489j9900
11106a41074L9000Q200K7957Q01L6894J5088J957J112P0760o0993r7027J117J035
$$ y = [84932, 103118, 17175, -81956, -77607, -12370, 85408, 47768, -62037, -76406, -57783, -53135, -14974, -65350, -106485, -112861, -117124, -117879, -151103, -87137, -49668, -65067, -98490, -119204, -55882, 22198, -4543, -89599, -93575, -106622, -57918, -45505, -76250, -97208, 246, 76697, 103752, 65356, 9355, 42913, 100902, 129588, 122209, 111016, 98942, 124684, 74325, 55803, 5393, -63679, -76284, 15184, 93128, 32202, -63878, -10299, 34578, -10294, -11288, -79085, -26698, 34684, 104693, 69345, 16450, 19563, 14901, -14110, 26603, 58379, 75791, 124562, 112068, 68096, -82396, -117905, -67507, -91575, -53786, -34579, -45245, -87685, -121174, -141074, -102074, -93874, -65917, -65116, -28222, -13134, -11177, -10065, 60695, -298, -97325, -96208, -95173]
11093i5173J2941O8284L2772l7940J16130k2474m493j6797J6176J273q1952q5750
11081i7003M2332R7572N7105Q630m2694o3321j5382O5145K9751j07220m8749k2449
11069i6283p743L8209J2576J7402j3705J5742J8653M5242m0607J3731K7214O0675
11057I1106p941l5343Q482L5862m970p117N4439j4957j7758K5080O0047m645L6993
11044B19278P5959J6531j6640p5291n7649j4182J3006k1045k0752K9138O0416
11033B08769J06651J64480K6739K1196q6588j49603p1631j303J24829P9333r0026
11022C32846J07746J19629J52446L1595j83865l4253J7595p6165p192j5547K5734
11011D70569O0110J10419J01487p737j27811j11240q0459o5205m2988j04369q3645
$$ y = [-95173, -82232, -13948, 18824, -19116, 97014, 74540, 70047, 53250, 69426, 70699, -11253, -97003, -54671, 42901, 100006, 108636, 65942, 2621, -12761, 52384, 82135, -25085, -73834, -96283, -104026, -65817, -53241, -35839, -49544, -33802, -15149, 30093, -10514, 3217, 30431, 91106, 83165, 47822, 56304, 92166, 87196, 80079, 134518, 119561, 101803, 126883, 186930, 182285, 219278, 295237, 311768, 295128, 219837, 162188, 148006, 161012, 139967, 119215, 148353, 208769, 315420, 479900, 506639, 527835, 441247, 291644, 220013, 218710, 343539, 422872, 332846, 440592, 560221, 712667, 744262, 560397, 526144, 543739, 467574, 460382, 444835, 470569, 530679, 641098, 742585, 734848, 607037, 495797, 415338, 350133, 307145, 202776, 119131]
11000A19131M2069k1216O6171J2497l6868l3066N2670N25j9784q6528k4940j687
10988F8974k6449o2882l7685j9895k0429Q6908J8874N2209m5680J19J11152N9385
10976A84601k484j07208n3535L246K7954k8729j9317j7049P884n486K8031K3627
10964D1535j1245j8946k1945m1851k3185J02225M85l0877n003M0666J4232L6602
10952H2693K7731p5831n5977J9297J0984m9959J2749j7504K3241P1507n0138L065
10940A858J8599m5171L2335J171n8602Q3100Q4261m0923N0534o2186m8929K0629
10928C6676N6979O4894l7731K2276P168l7042l4777M9807P2974r3783o2170K2507
10916F7778L4011M6739M4535n6074J3553o2566q819J8010N3180L2805o5868p1904
$$ y = [119131, 161200, 139984, 206155, 218652, 181784, 148718, 201388, 201913, 182129, 95601, 70661, 68974, 42525, -20357, -58042, -77937, -98366, -11458, 7416, 59625, 13945, 14064, 125216, 184601, 182117, 74909, 21374, 24620, 52574, 23845, 4528, -12521, -4637, -10123, 17908, 41535, 30290, 11344, -10601, -52452, -75637, 26588, 27073, -3804, -8807, 31859, 46091, 82693, 110424, 34593, -21384, -2087, 8897, -41062, -28313, -45817, -22576, 48931, -1207, 1858, 20457, -24714, 7621, 8792, -49810, 33290, 117551, 76628, 127162, 64976, 16047, 36676, 93655, 158549, 120818, 143094, 150262, 113220, 78443, 128250, 201224, 107441, 45271, 67778, 101789, 148528, 193063, 136989, 150542, 87976, 79157, 97167, 150347, 183152, 117284, 45380]
10904D5380o7568R6513R1609J1488j0891j1450j24706l5744K7186J4984m3732
10893f931R8887R2495M6960p6223o9017r2692j313K3464K2282l9568j9063J8091
10881b628L4321l0593P769P6678Q8154M2620J471r0033o9819K7071l6284k5992
10869B2735l7918M0179N0732O6890L2898Q911n9263r1651n0006L1317N2827k9904
10857C7747l724K4691O1217O2092l2324k5948M6493L6627l9822m7625m5871l0410
10845D3143K79L8502m0598L3772K5666m4366L5558L7656n3315M6046l4802j5863
10833G1678N3577l7097k4254L9462K7054q015p5334M2273K1924m5266R320j5125
10821F0197p6117l316M2312L5815m2580n62l5576o3059O0992O7652L0904M7901
$$ y = [45380, -22188, 74325, 165934, 177422, 166531, 155081, 30375, -5369, 21817, 36801, -6931, 91956, 184451, 231411, 155188, 86171, -6521, -7834, 15630, 37912, -1656, -20719, -2628, 31693, 1100, 8869, 85547, 173701, 216321, 217792, 127759, 57940, 85011, 48727, 22735, -15183, 24996, 75728, 142618, 175516, 184427, 125164, 33513, -16493, 14824, 67651, 37747, 34023, 58714, 119931, 182023, 149699, 123751, 170244, 206871, 167049, 119424, 73553, 43143, 43422, 81924, 41326, 75098, 100764, 56398, 91956, 129612, 76297, 122343, 87541, 71678, 125255, 88158, 63904, 103366, 130420, 122405, 47071, 89344, 111268, 66002, 75322, 60197, -15920, -19236, 23076, 58891, 16311, 15749, -19827, -82886, -21894, 45758, 76662, 124563]
10809A24563o2643l5822M6465L4580p89K2918J2168m9188l2544l4018n75n1523
10797b6408m2800J1381k3089K3766L1179N6262L6434k3681q6783k3198O9633K5791
10785B8487Q29J6779J865K1746p0532l1805m73R4640L3066N047l8031l8154p0890
10772d7426L2111R0081m4865K7851n6524j0645n6690L4076O9090N7525k9413p3470
10760h299l3923k4947L0159O3114n3834m6385l0969j0808R4156P2317m1656m5418
10748c6493K7482l3477j2533R4202K6124l0509j1392K1264p2880j074L0190M2171
10736D3075L3630L2155m7994N0765O9077N1754J07470P0404l4153p8011O428j13006
10724A91594o7735J6363O276Q3931k1669N5600R9970J34581j7216p1288n2440
$$ y = [124563, 61920, 26098, 72563, 107143, 106354, 129272, 141440, 92252, 59708, 25690, 25115, -26408, -69208, -57827, -80916, -57150, -25971, 30291, 66725, 43044, -43739, -66937, 2696, 28487, 29316, 46095, 47960, 69706, -826, -32631, -33104, 61536, 94602, 99649, 61618, 23464, -47426, -15315, 74766, 29901, 57752, 1228, -9417, -66107, -32031, 37059, 94584, 65171, -8299, -42222, -67169, -37010, 26104, -27730, -74115, -105084, -115892, -21736, 50581, 8925, -36493, -9011, -42488, -55021, 39181, 65305, 34796, 23404, 44668, -28212, -29286, 904, 43075, 76705, 108860, 60866, 111631, 180708, 232462, 339932, 410336, 376183, 298172, 304600, 191594, 123859, 140222, 146498, 230429, 208760, 264360, 364330, 498911, 481695, 410407, 357967]
10713C57967o3007J3180j05916p4458m1364J9276M8543j7849J0438j1152r5872
10702C9786n7896N5982q295M2692q012R87M3437l0799N3073K0348L448J06006
10690B60757o6850m1390m5430n5575J6733r379l3386q8228r103K4815J27536Q4572
10678A65072j3369m0081n8676o7541J0585k5168r076M5413O6342j7951k9024J05472
10666A31998R9621j9651l7646K3016J5970m9912l031L6792L7514J6606j1639m6685
10654A92953k9325j2533P1666N9552k3770p1321L6391P2695J4714k3539Q3578
10643C71061J17943O8421O1290K0027J2107Q6468J09578L8808M1132K14348J44423
10632A285606J05045K35764J97348J92055J42965K37335L15810L86349M37445
$$ y = [357967, 294960, 308140, 202224, 127766, 86402, 105678, 154221, 136372, 146810, 135658, 39786, -18110, 37872, 29577, 72269, 64257, 65244, 108681, 77882, 130955, 151303, 154751, 260757, 193907, 152517, 107087, 51512, 68245, 58866, 25480, -62748, -71851, -47036, 80500, 165072, 151703, 111622, 52946, -14595, -4010, -29178, -38254, 7159, 73501, 55550, 26526, 131998, 231619, 211968, 174322, 197338, 213308, 163396, 160365, 197157, 234671, 251277, 239638, 192953, 163628, 151095, 222761, 282313, 258543, 187222, 223613, 296308, 311022, 287483, 371061, 489004, 557425, 618715, 638742, 650849, 737317, 846895, 885703, 926835, 1141183, 1285606, 1390651, 1626415, 1823763, 2015818, 2158783, 2396118, 2711928, 3098277, 3535722]
10623C535722N36317P23953J075074J582548K054109K624054L661811M794729
10615B0588317N797584O088226M784469K349635n970j416959j562806o81745Q86759
10606C6827510L250424N956671Q968688J1557602J1936071Q378773K062947m003581
10598H4935105p150780p018337m540606j080366K891665P299328J1726802J4913653
10590A01976464J4303247P857099k054279j0437000j4214588j3511072j0195532
10583G3724339o008217j810077K151780N666651P704271O803886K000709m705247
10575H5528095r807304j1644231j0544165p948834n119700k592159m84673J046883
10567C8433912J723346J085349q98752l421622n259223n915233n405842m423585
$$ y = [3535722, 4072039, 4795992, 5871066, 7453614, 9507723, 12131777, 15793588, 20588317, 26385901, 32474127, 37258596, 39608231, 39602261, 38185302, 36622496, 35940751, 36827510, 40077934, 46034605, 55003293, 66560895, 78496966, 86875739, 88938686, 84935105, 77784325, 70765988, 66225382, 65145016, 68036681, 75336009, 87062811, 101976464, 116279711, 124136810, 122082531, 111645531, 97430943, 83919871, 73724339, 67716122, 65906045, 68057825, 73724476, 81428747, 88232633, 90233342, 85528095, 75720791, 64076560, 53532395, 45583561, 40463861, 37871702, 37387029, 38433912, 40157258, 41242607, 40343855, 36922233, 31663010, 25747777, 20341935, 15918350]
10559A5918350l431672k529495j750733j308121j069074q16470o08013m87227
10551C917545l93686l40783l22376k51759k14741k17701j73386o4488j29414j75591
10541A633620o2140o70j14293j37728r8577p5220l3102J0306q3830m5009J4541
10530A007898r5007l4512n6664p4727m9209j2398J0194J9370l3329r456j5347
10519F56813K6489l5901n7072L8173j2888n1087l2562N2913K8734n2852m9168
10508E11592L4980O1743j7268o0321J2454K918J731m246p7418r9174j8916m913
10496C43162O0997M3863M5035k1362q6423n7107l3563k9958O452J0770M2782k4274
10484C00374m1920N0861L686o775K8177r0835k7370K3836j7583j5992o6586O5817
$$ y = [15918350, 12486678, 9957183, 8206450, 6898329, 5829255, 5012785, 4404772, 3917545, 3523859, 3183076, 2860700, 2608941, 2394200, 2176499, 2003113, 1938625, 1809211, 1633620, 1571480, 1570810, 1456517, 1318789, 1220212, 1144992, 1111890, 1122196, 1038366, 993357, 1007898, 912891, 878379, 821715, 746988, 697779, 685381, 695575, 714945, 681616, 672160, 656813, 683302, 647401, 590329, 628502, 615614, 564527, 531965, 584878, 613612, 560760, 511592, 546572, 608315, 591047, 530726, 543180, 546098, 547829, 543583, 466165, 366991, 348075, 343162, 404159, 448022, 493057, 471695, 385272, 328165, 294602, 264644, 271096, 281866, 324648, 300374, 258454, 309315, 313001, 306226, 334403, 243568, 216198, 240034, 222451, 206459, 139873, 205690]
10472B05690k6194o5398j5829k7937j8537O8261J8493k4056L5190K2819K365q2470
10460I2397K8514K636m9442k2392n4714l2311O4281M4366n6623j464m1899j31843
10448a58494K4167k4367N7806N1597M1062n742p8188J572Q0780J12253l0082l2270
10436D0094k2613K6548J4609j1906P0743j05186Q347P8212l6448k6724m566L4170
10424F5280m3585K4329Q6316l3856n3049r1432n735K3041N1391l5238J503O1653
10412E0618O6732p0281p7025k118N1108N2984l2140j2556K6818m7287r295K9897
10400B7455m6818o4196p7442P6041p338Q4750K8838J0574j1979n391K4953j2087
10388B7360k9404j6984J4138j051q828l4786R82r1817L7993P2945K4502k554K2351
$$ y = [205690, 179496, 114098, 98269, 70332, 51795, 120056, 138549, 114493, 149683, 172502, 174867, 92397, 120911, 123547, 74105, 51713, -3001, -35312, 28969, 73335, 16712, 15248, -26651, -158494, -134327, -158694, -100888, -49291, -8229, -13971, -92159, -90587, -9807, 102446, 72364, 40094, 17481, 44029, 58638, 46732, 117475, 12289, 20636, 98848, 62400, 35676, 31110, 65280, 21695, 46024, 132340, 98484, 45435, -45997, -51732, -28691, 22700, -12538, -11035, 50618, 117350, 47069, -29956, -32074, 19034, 72018, 39878, 27322, 54140, 6853, -2442, 27455, -19363, -83559, -161001, -84960, -92298, -7548, 21290, 31864, 19885, 14494, 39447, 27360, -2044, -19028, -4890, -5941, -14769, -49555, -48573, -140390, -102397, -29452, -4950, -7504, 14847]
10375A4847k853K9829O360k4438O1092J1410j9732r7813K5066K5881j372j8397
10363I880N8786L8769K4045l4716n61k1537J0336o542m3503O9914L6947l6690
10351A05128l2575L7068k6567o0478l5170N1391j4022j8639j5497p2939n7079
10340a39379J5370l678L4886O0930l5726k2344J8633L6860J06671N1720m2576
10329H1367m6605j3738k3904p7067o0638L2810O4491M7327N175P1376P766j08095
10317a9735m5535o767k1193q325P5491J12478L3729O39k8208m5078m4531M8544
10305E1509O1564K6118r0774m4614m7056J4971L326O8978J5684n3559M3378L2895
10293H2420q2095q6154m3689J50N2751P3062M3070j8105J0335K4983m9638o895
$$ y = [14847, 11994, 41823, 48183, 23745, 84837, 96247, 76515, -21298, 3768, 29649, 28277, 9880, 68666, 107435, 131480, 96764, 96203, 74666, 85002, 78460, 34957, 104871, 141818, 105128, 72553, 109621, 83054, 22576, -12594, 38797, 24775, 6136, -9361, -82300, -139379, -124009, -127687, -92801, -31871, -67597, -89941, -71308, -34448, 72223, 123943, 81367, 34762, 21024, -2880, -79947, -140585, -107775, -43284, 4043, 9218, 80594, 88360, -19735, -65270, -72037, -93230, -101555, -26064, 86414, 120143, 120782, 92574, 47496, 2965, 51509, 113073, 139191, 48417, 3803, -43253, -28282, -24956, 44022, 59706, 6147, 49525, 82420, 325, -85829, -129518, -129368, -76617, -3555, 39515, 21410, 31745, 56728, 7090, 195]
10281A95m8689L3101O9569n9640N9787J5539J5393J7218m5831p0336J1249M9588
10269D7143M9393J06161k3265k6822m7965k2269j34483l1266K0638r1979L8383
10258a16331O1305Q943j0989o109P2110M6892j482j9441J4416N1499k5916q7669
10246a2772k6658l395L2924K7658k5200o8803J5591k8901l682O0471L6511J3962
10234A7706N2565p554N7166n1743k784J6904M5694l9175j2354j012j4963K5855
10222H6305K458K5540q7395l447Q5442l6052k6341k828K633L0582k21k2307L5203
10209H9572n2338l3935J500L4105R227o811k1907l5313p2496M9097M5356l363
10197B694L024k7953o7452K4673K9141J6564O588M5994O995m4840N2143J23267
$$ y = [195, -48494, -15393, 54176, -5464, 54323, 69862, 85255, 102473, 56642, -13694, -2445, 47143, 96536, 202697, 179432, 152610, 104645, 82376, -52107, -83373, -62735, -154714, -116331, -55026, -46083, -57072, -63181, 8929, 55821, 54339, 34898, 49314, 100813, 74897, -12772, -39430, -42825, -9901, 17757, -7443, -76246, -60655, -89556, -93238, -32767, 3744, 17706, 70271, 62717, 119883, 68140, 65356, 82260, 127954, 88779, 76425, 75413, 60450, 86305, 88763, 114303, 26908, 23461, 108903, 72851, 46510, 43682, 46315, 76897, 76676, 54369, 89572, 37234, 3299, 4799, 38904, 48131, 41320, 19413, -15900, -88396, -39299, 6057, 2694, 5718, -22235, -89687, -65014, -35873, -19309, -12721, 33273, 40268, -4572, 47571, 170838]
10185A70838J3586m4670n245M0698J0111L7503O064P9288R8518n0823n1408L3694
10173C38154k506j17753j27599k4000j995M6627M5807J42679J88980Q0236M675
10162E73305q8789m3614n5359r3324l2507L8762P8491Q6704J61385M3350r6813
10151E71591o5691p7673K4686j4818j39438q7440M4104J04999R3875M3102M5727
10140E43024N2134j31759j38572q5502k0680O465k3093k3036o2454P7698R3848
10129B88073K0911j03451K1110p1519J1239L018n1821M988p4537k890m1937O0985
10117F4169Q9590m3803N892j4006q1386r5836o9770M520P3539M0005L915O8909
10105D5738L7335J3101J7114j0144k6138K0798r453j13401J7282O2208M9671k9338
$$ y = [170838, 184424, 139754, 134509, 175207, 185318, 222821, 228885, 308173, 406691, 355868, 304460, 338154, 335648, 217895, 90296, 66296, 64301, 110928, 156735, 299414, 488394, 568630, 573305, 484516, 440902, 385543, 292219, 259712, 298474, 376965, 463669, 625054, 668404, 571591, 505900, 428227, 452913, 438095, 298657, 211217, 255321, 360320, 454195, 497297, 543024, 595158, 463399, 324827, 239325, 218645, 225110, 202017, 178981, 116527, 194225, 288073, 308984, 205533, 226643, 155124, 166363, 169381, 117560, 122548, 48011, 45121, 3184, 64169, 153759, 109956, 115848, 101842, 20456, -75380, -145150, -140630, -67091, -27086, -23171, 45738, 83073, 96174, 113288, 103144, 77006, 97804, 88351, -25050, -7768, 54440, 104111, 74773]
10093G4773k9303M7446l4200M050M7241O974m0233n5980l1329K611L19K9304K8267
10080D9940l7345m2104Q126O096j373m9226J2130p1804l4901j7812r73L5875M4842
10067i8529P0111J49997k4848n4887m2037r920O86m3564k1449l0497l9672N8443
10055h6166J9569j4895L9313N1784R309q195K2817o8471n7240Q520R7538o214
10043G669k4835N5855R679n6448J934o4235O2350N6771l3410K5777P2672M981
10031A18760J2996k2005m7669l4858l108j5897m8463m6465o6348Q4386J3142J0002
10019d5527l114j5428l2108k805K7835m100j1070N5360K504Q9529K9125o6624
10007B3577j8125l1965l9313J3236l6324K5801l0368j7571N5827K2374K9602r110
$$ y = [74773, 45470, 92916, 58716, 62766, 110007, 116981, 76748, 20768, -10561, -7950, -7631, 21673, 49940, 12595, -29509, -21383, -15287, -16660, -65886, -53756, -125560, -160461, -178273, -179246, -143371, -98529, -28418, 121579, 96731, 41844, -193, -10113, -9427, -52991, -74440, -104937, -144609, -86166, -66597, -81492, -42179, 9605, 18914, 10719, 33536, -34935, -92175, -83655, 13883, 7669, -17166, 38689, 48368, -8080, -6146, -70381, -8031, 48740, 15330, 41107, 113779, 118760, 131756, 109751, 62082, 27224, 24116, 8219, -40244, -86709, -153057, -68671, -55529, -45527, -48641, -64069, -96177, -98982, -71147, -75247, -86317, -30957, -28453, 61076, 90201, 23577, 5452, -26513, -65826, -52590, -88914, -63113, -93481, -111052, -55225, -32851, -3249, -12359]
9995a2359p6888l0994N7532M2057j5481P567r372k3997k7897n8712j7380J25059
9983d0865O7205j6144R5716k7595n9596j8070L491K9294r48m2345k3611n9372
9971i2840l8588O1192P159J5966K9299J6993l2236N5954M0768N0839j01568j37655
9959a24717n8821j0507K9076P5974L0567p423j6981O0503J4568r0796Q616K8388
9947f1553J7391L9529k8944m6839L0454J63788Q2856j66381k4300n8785j68761
9936b21545J7411P3599R6839O6098K6420l5433p3708L54O298M1117J0671r935
9924a814K6693N5209L3087j31437l9696k2739J5041R749j4375o4465J520M2206
9912i1021J8967P7608J10764J0887m7750J0631o5060O26j8109k8862r9519j9869
$$ y = [-12359, -89247, -120241, -62709, -20652, -36133, -28566, -37938, -61935, -89832, -148544, -165924, -40865, 26340, 10196, 105912, 78317, 18721, 651, 4142, 33436, 32488, -9857, -33468, -92840, -131428, -70236, -63077, -47111, -17812, -819, -33055, 22899, 63667, 114506, 12938, -124717, -183538, -194045, -164969, -88995, -58428, -65851, -82832, -22329, -7761, -98557, -89941, -61553, -44162, -4633, -33577, -80416, -49962, 113826, 196682, 30301, 6001, -52784, -221545, -204134, -130535, -33696, 32402, 58822, 23389, -50319, -49965, -43667, -2550, 8121, -1814, 24879, 80088, 113175, -18262, -57958, -80697, -65656, -55907, -70282, -134747, -133227, -91021, -72054, 5554, 116318, 127205, 79455, 90086, 25026, 25652, 7543, -21319, -120838, -140707]
9900a40707R0241N9416L0776o0041j7163O259K4966k7585p1989n6032n6135K3780
9888a94214O4894M3399m5670J3551M9058L3031P6535M6743l879P6061n9389j5079
9876H5041l7997n7865N7994N2113k1120J5815R649p8110Q357N2065J9090j9503
9864H5529r3356j8222O880j9148l3845J9182J26712l8697q6624j7100M3379K0765
9852d545L481J544N804M4119R843j14042l1689R6379j5531m847K413J9442r2706
9839h0335r1450P5516J66115P1094l2905p7636l8885j479Q0145r7304k7854L4931
9827b0047K844l4288l6143n319j3172l231P5292n309l0650J977N5923L2776q9477
9814f8824K8278Q2710L990j422l2330K3419j0937J11661k0224n8177O5582o6626
$$ y = [-140707, -50466, 8950, 39726, -20315, -37478, -31219, -6253, -33838, -105827, -161859, -217994, -194214, -129320, -85921, -131591, -118040, -68982, -35951, 40584, 87327, 83448, 159509, 100120, 85041, 47044, -10821, 47173, 99286, 78166, 93981, 103630, 25520, 33877, 85942, 105032, 85529, -7827, -26049, -19169, -38317, -72162, -52980, 73732, 35035, -51589, -68689, -25310, -4545, -1064, 480, 6284, 50403, 60246, -53796, -85485, 10894, -4637, -9484, -7071, 12371, -80335, -171785, -96269, 69846, 140940, 108035, 30399, -8486, -9965, 70180, -27124, -54978, -20047, -17203, -51491, -87634, -92953, -106125, -109356, -34064, -39373, -70023, -68046, -12123, 20653, -68824, -40546, 42164, 46154, 44732, 12402, 35821, 24884, 136545, 116321, 58144, 123726, 57100]
9802E7100j33653p5979L5403L4071j72K1374O3358J14714j2170r3152l3916l9845
9790f2867J5881J25155L6057n4721j1197m4745J5056L0093m0187q2558m4692k2633
9778a41358J8756P5425l3031M4454N9457j3858k278N4184n9015m4472l6776L5405
9766d3107K3893R8680K747r3049l5394m279o2269p639M386O7100R0859K7667k2584
9753D7011p0081n4601M3077N6292K6039L0417n9594n1679n1895J5354j0953J4630
9741f5983K9946N8100J2335j16538o0518Q7610O6294K8100p8142K9719M2336K2263
9729E5522n2394K6115Q5022K9270m4795l6987J6933P800n2563r0307j2757J3140
9717e6001J1900Q7063L394j34565n4723K0045Q0812M0159K9506O1237L1402j7997
$$ y = [57100, -76553, -152532, -117129, -83058, -83230, -61856, 1502, 116216, 104046, 10894, -23022, -62867, -46986, 78169, 114226, 59505, 48308, 3563, 18619, 48712, 8525, -74033, -118725, -141358, -122602, -47177, -80208, -35754, 23703, 9845, 7567, 61751, 2736, -41736, -78512, -43107, -19214, 79466, 82213, -10836, -46230, -50509, -112778, -120417, -116031, -48931, 41928, 69595, 47011, -23070, -77671, -34594, 21698, 47737, 78154, 18560, -33119, -85014, -69660, -80613, -65983, -36037, 22063, 34398, -82140, -142658, -55048, 11246, 39346, -38796, -9077, 33259, 55522, 3128, 29243, 114265, 143535, 98740, 61753, 78686, 86486, 33923, -56384, -69141, -56001, -44101, 42962, 46356, -88209, -142932, -122887, -42075, -1916, 27590, 88827, 120229, 102232]
9705A02232Q483l5889j64785l235N9243R0498M477q0775q5757p391N7490P5626
9693B0217K4750n1556j9479O9438m9026j4521J2494k4406L4367J6138N0923j4764
9681E4575l807l3402l5035LK9728J4086k5006r0906l1090O5815O9166P631J1684
9668C3442J4885J8269q300l3348L8424l7713p2246J0385L3331L2101Q36l3467
9656c401O3403P0405M1601Q0345J44886K13876L5897j31281j66869k26819q0843
9645D1200l2416M0200n1113j06640l1248J3607K6545L1385P078L1950P8250K493
9633E1291k1118Q374o5594K6056O2050p3989p7745m3069R0695Q3686K2198l1541
9621C1294o3832p9459o4683P7361J34461L2453m7956k4919o3304J4822R2457J8029
$$ y = [102232, 110715, 74826, -89959, -93194, -33951, 56547, 61024, -19751, -105508, -112899, -55409, 20217, 44967, -6589, -26068, 43370, -5656, -20177, -7683, -32089, 2278, 18416, 69339, 54575, 50768, 17366, -17669, -17666, 12062, 26148, 1142, -89764, -120854, -55039, 14127, 21758, 33442, 48327, 66596, 58296, 24948, 63372, 25659, -46587, -36202, -2871, 29230, 30066, -3401, 60002, 130407, 172008, 252353, 397239, 611115, 647012, 515731, 348862, 122043, 41200, 8784, 48984, -2129, -108769, -140017, -126410, -99865, -68480, -61402, -29452, 48798, 51291, 30173, 38547, -27047, -991, 61059, -12930, -90675, -133744, -43049, 40637, 62835, 31294, -32538, -111997, -176680, -99319, 35142, 67595, 19639, -5280, -68584, -53762, 38695, 56724]
9609E6724l2853k8819n1085n6174j3305k708Q6446O332n2662l2005m231P1957
9597e2383K9599p140M0578m6691p2654P6075O6359k907R630o4114n7205n8460
9585a39313K2356K1370j1039k2432K507K0751Q1169K4146j6890n8952m1527J05214
9573a2640J2160k2855N5035M6814l7771k547o6211p7409J2178j1683M9459R0022
9561C4552L5646m8015K5085M756n6459l8611j6424N4429R672k1525n6012L9173
9549c3733P6436m5475k9658O119L6959m439q9694L020P2936P5761r232r1801o4370
9536i7171k6787M8492M7494n219k8417n9690J928P0196m0676K6209J858k8869
9524i0652o1011j00408o3917K643J05588J39420L3290o7963l5525L0347J2185
$$ y = [56724, 23871, -4948, -56033, -112207, -125512, -128220, -41774, -35442, -88104, -120109, -124340, -52383, -22784, -29924, 10654, -36037, -108691, -32616, 33743, 30836, 40466, -23648, -80853, -139313, -116957, -95587, -106626, -129058, -126551, -105800, -24631, -485, -17375, -76327, -117854, -12640, -480, -23335, 31700, 78514, 40743, 38196, -28015, -105424, -93246, -104929, -55470, 34552, 70198, 22183, 47268, 52024, -4435, -43046, -59470, -5041, 4631, -16894, -72906, -33733, 42703, -2772, -32430, -26311, 10648, 6209, -83485, -80465, -7529, 68232, 59000, -32801, -97171, -123958, -75466, -27972, -33191, -61608, -121298, -119370, -49174, -89850, -63641, -61783, -90652, -151663, -252071, -315988, -313345, -207757, -68337, -35047, -103010, -138535, -108188, -96003]
9513i6003K7045J050R8819L0567l2043l2223J7823k5408M546j0228O0372m226
9501D0091j25758l2728L6961P659k2378k028q078L2033J02624j5595r790M562
9489G575L7477k1672n6262j387n0926l983N007O5990j0466L7934k0651K1583j3056
9476b837K1494j472j05436n2395L3685J35356L6503M4127m3693j5611q7743L95
9464c7627K2221l6733p1559p9993K8703J00115K4965J9060k5756p3135R4628m79
9452c5590N1140M0383p1301q9260k9210k238J12435n406J8060N7437r237p3999
9440c6786r9585m0901K3665L1046K132J7980N6136Q0578M5997J2814p6081p2501
9428e5506J2409K6678o553j5963l4650L8498R1388k3156n1278N092p4934K588
$$ y = [-96003, -68958, -67908, 30911, 61478, 29435, -2788, 15035, -10373, -5827, -16055, 44317, 40091, -85667, -118395, -81434, -73775, -96153, -98181, -106259, -74226, 28398, 12803, 3013, 7575, 45052, 23380, -32882, -34269, -85195, -89178, -84171, -18181, -28647, 9287, -11364, 10219, -2837, 18657, 17185, -88251, -140646, -106961, 28395, 64898, 109025, 65332, 49721, -38022, -37627, -15406, -52139, -123698, -203691, -174988, -74873, -49908, -30848, -56604, -129739, -35111, -35590, 15550, 55933, -15368, -104628, -133838, -136076, -23641, -29047, -10987, 46450, 37213, -36786, -136371, -177272, -153607, -122561, -120429, -102449, -46313, 34265, 80262, 93076, 16995, -55506, -43097, -16419, -22972, -38935, -73585, -35087, 56301, 33145, -18133, -13041, -87975, -85387]
9416h5387N815M5256K9520o514N5921N4105K3861n0723r0558n0023p764p3817
9404a50308J05207L9792M2557N9438j03921o4257k610o1152n706O3193O6368N2153
9392D0754J890o7082p0237O3835J08973M2411o534L4146m2417q6396j8750j8444
9380a7851Q842n318o308Q706j9481M9219J5131o4104l1088M6488k905n9486o4110
9367a42265l439M3047J0653K0302j5850j0746P8424j1214q1526L2082J8186m2592
9355a04938L8488O8869J2675L162L0965l1331o416m4287J17300N2017M1876J2528
9343A90908k3939j08780k1558P251j01213o7921L3518M4734L1692j1942K6641
9332f09R178J3853k6621j7367k4644p362K514M3916j7758m3180O7646N3255N2996
$$ y = [-85387, -79572, -34316, -4796, -11310, 44611, 98716, 122577, 71854, -18704, -68727, -76491, -150308, -45101, -5309, 37248, 96686, -7235, -71492, -74102, -135254, -140960, -77767, -11399, 40754, 42644, -24438, -94675, -30840, 78133, 120544, 114010, 148156, 105739, 19343, 593, -17851, -9009, -14327, -20635, -11929, -31410, 17809, 32940, -31164, -62252, -15764, -18669, -78155, -142265, -145704, -102657, -92004, -71702, -87552, -98298, -19874, -31088, -112614, -80532, -62346, -104938, -66450, 2419, 15094, 18256, 49221, 17890, 11474, -32813, 84487, 136504, 178380, 190908, 166969, 58189, 36631, 43882, -57331, -125252, -91734, -47000, -15308, -27250, -609, 8569, 22422, -4199, -21566, -46210, -53572, -51058, -7142, -24900, -68080, -434, 52821, 105817]
9319A05817J2434l6133q5794l7604n4302l4616O0158R7767J9487k6212r0083K0517
9307d8564N4904k4763o4883P0054m5873J7964L3847J3774k1073N9178R9928n189
9295A39304J529k9174O20o4298k3313l7223r503K786L666k326l8398N9339Q900
9282A1909M3172J1133j8723k5651O3410M2193l7467r2303n6143j572Q482k2030
9270g3590j7934K1040O884L6985J37951n4007q9522j337n4942J8187l997j2446
9258h6728m8199j8783M8520n271L6372L6659N1302p709L669m6922Q93L4738k9964
9245c1423j1284j6132J7247m602j3099M0737L5051q2343P1236N903m4792n3598
9233h7099L2324L5435n094m7728L1863R0500P5214m0720m5325l2362Q765j0909
$$ y = [105817, 118251, 82118, -3676, -41280, -95582, -130198, -70040, 27727, 47214, 21002, -69081, -48564, 6340, -18423, -83306, -13252, -59125, -41161, -7314, 6460, -14613, 44565, 144493, 139304, 140833, 111659, 112279, 47981, 24668, -12555, -22058, -19272, -15606, -17932, -56330, 3009, 11909, 55081, 66214, 47491, 21840, 85250, 127443, 89976, -2327, -58470, -60042, -51560, -73590, -91524, -70484, -63600, -26615, 111336, 57329, -32193, -33530, -88472, -70285, -74282, -86728, -134927, -153710, -105190, -110461, -74089, -37430, 13872, 6163, 9832, -37090, -36197, -1459, -31423, -42707, -58839, -41592, -46194, -59293, -18556, 16495, -65848, 5388, 11291, -33501, -87099, -54775, -19340, -24434, -72162, -40299, 50201, 125415, 84695, 39370, 7008, 15773, 4864]
9221D864k0888k1136q3234K5854L4566N8557J3022K2222N7313j2666q3602r4882
9209a00010j8906N5927K357l8234N1817J5563n9672n1585N5436J1660j5619j3771
9197a05037n6506Q5915K9031K072P3598l4170J4301k4344L3662Q6542r2769q3061
9185g0766j9666L5971J1150k5797J1323L1103k6568n5682O3790O8758M5200l4671
9173C4145l4681M6165O6191m4234K2835L4977l20m9464n3732p2796o91L6894J0475
9160d236o8494j7308R4240J7837j0991r819L3984j03289m4270N5683k9915n8104
9148a44682P0952O1003K4398L7782L856M155n0798p897L2302N5149O8539J5560
9136A70319K2523n4432m5231k8173M8280l3154o8598k4562L5193K3003l5522N337
$$ y = [4864, -16024, -37160, -120394, -94540, -59974, -1417, 11605, 33827, 91140, 78474, -5128, -100010, -118916, -62989, -60632, -98866, -47049, -31486, -91158, -142743, -87307, -75647, -91266, -105037, -161543, -75628, -46597, -44525, 29073, -5097, 9204, -15140, 18522, 105064, 12295, -70766, -90432, -54461, -43311, -69108, -57785, -26682, -53250, -108932, -45142, 23616, 68816, 34145, -536, 45629, 111820, 67586, 90421, 125398, 125078, 75614, 21882, -50914, -51605, -14711, -4236, -72730, -90038, 4202, 22039, 11048, 1229, 35213, -68076, -112346, -56663, -86578, -144682, -73730, -12727, 11671, 49453, 53309, 57464, 6666, -1231, 31071, 86220, 154759, 170319, 192842, 138410, 93179, 65006, 113286, 80132, 11534, -13028, 22165, 45168, 9646, 14983]
9124A4983L3632r8786q7616K5054J14375M4384l3217j9337j7784o9070K5231P1771
9112C620K7717K2636O8522j06028q9299K9616k0429o2352L3299J25734J123j658
9100C2501K4094m4735N0527M4088j9134q0688j2477k1058n9576l2245O1023K5475
9088c2205J3473j2628N3836Q4634m5461m9875K5095l9511j8853P9164P6720J4839
9076A49228q2455k4024k99l1271o4484l5299N9903J2967K7419P9827L1399m8523
9064G4388m4864j9905K160l0727M974L7275O6864q963o7615n0131j0917O1216
9052A3755J1322m8083k2394m3044N2715J765k6978M5895R8638O8583r130n2577
9040I0467j3904j3441m7780P3351O4705l9702o9187k7255K8618n5532m6640K3794
$$ y = [14983, 48615, -50171, -137787, -112733, 1642, 46026, 12809, -6528, -24312, -93382, -68151, 3620, 31337, 53973, 122495, 16467, -72832, -43216, -63645, -125997, -92698, 33036, 34159, 32501, 56595, 11860, 62387, 106475, 87341, 6653, -5824, -26882, -86458, -118703, -57680, -32205, -18732, -31360, 22476, 107110, 61649, 11774, 36869, -2642, -21495, 57669, 134389, 149228, 66773, 42749, 42450, 11179, -53305, -88604, -28701, -15734, 11685, 91512, 122911, 74388, 29524, 9619, 11779, -18948, -13974, 23301, 90165, 81202, 13587, -36544, -47461, 13755, 25077, -23006, -45400, -88444, -35729, -33964, -60942, -15047, 83591, 152174, 143044, 90467, 76563, 63122, 15342, 88693, 153398, 113696, 44509, 17254, 45872, -9660, -56300, -32506]
9028c2506J7095q754k0286N3378l6569J3244K1689n70r3722N5564N6727j8097
9016G193n0681n705j4150K3655O1851L3094K8651n9659n8198l2099K6746R7192
9004E7890k6641o1008o2598K5008R1308J3792j3369M2679k3898n5758p014R1122
8992G1513O1736M0450n6636m6284j9132m5631n2482q5622L1366P2265J4327j2947
8980b7077l6840P4264l1630n0767P6717M7772M5818l1529n7074j12975m4872l9565
8968a87758k6442J2032J14095P4479K259o9033Q8298j3285N6477K249o3510k8930
8956c9069k5041L2131K204m6035q470J38896j4260k8671K0227Q6302k1344m5148
8944E1722J0773O4872K9140o3760J4396N936o0747l7446J4823K8226n317O163
$$ y = [-32506, -15411, -24165, -44451, 8927, -27642, -14398, 7291, 6721, -87001, -31437, 25290, 7193, -43488, -49193, -63343, -39688, 22163, 55257, 83908, 24249, -33949, -66048, -39302, 57890, 31249, -29759, -92357, -67349, 23959, 37751, 24382, 67061, 43163, -12595, -19609, 71513, 133249, 173699, 117063, 70779, 51647, 6016, -46466, -132088, -100722, -28457, -14130, -27077, -63917, 10347, -21283, -72050, 4667, 52439, 98257, 66728, 9654, -103321, -148193, -187758, -214200, -202168, -88073, -13594, -11335, -80368, 7930, -5355, 51122, 53371, -10139, -39069, -64110, -31979, -29775, -75810, -84280, 54616, 40356, 11685, 31912, 118214, 96870, 51722, 62495, 127367, 156507, 92747, 107143, 113079, 52332, 14886, 29709, 57935, 52618, 58781]
8932E8781n610n5095l6343o6870R354R0858O0934K0993m1032P9381O2670J2212
8920A90233j0716j06565p5127n461L6366M3745n1461m1631m0510M346k9386r4617
8908a80784l3438O8246j577m2597K8813P0233j6677M4554N9275L4621L799o2576
8896b8108n5079K5759L1527M1952o9417J31162k3705j7756j2767l9400l1477M0440
8884f869j0070k0873L4751O0866o74J5945O449N8531R776o9697m7605k0170l839
8871F521l6937m5431J9136M5723Q2791p4821j09443j1490J06345l28j7400m6780
8859h2114k1117M8447M3668L951O5547k9135p8154k6227o9477K8240j6412p047
8847a39830J7904J0281J31848j051m9927R721L7057k2224l9001q3359L2332Q6392
$$ y = [58781, 53171, -1924, -38267, -105137, -95783, -4925, 56009, 77002, 35970, 115351, 178021, 190233, 179517, 72952, -2175, -7636, 28730, 72475, 21014, -20617, -61127, -56781, -86167, -180784, -214222, -145976, -147553, -190150, -161337, -91104, -107781, -63227, -3952, 30669, 34468, -28108, -83187, -57428, -25901, 16051, -53366, 77796, 54091, 36335, 23568, -15832, -47309, -6869, -16939, -37812, -3061, 57805, 57131, 73076, 79525, 138056, 147832, 78135, 30530, 10360, 6521, -30416, -75847, -56711, -10988, 71803, -3018, -112461, -123951, -17606, -17934, -35334, -82114, -103231, -54784, -11116, -7165, 58382, 29247, -48907, -75134, -144611, -116371, -132783, -139830, -121926, -111645, 20203, 19152, -30775, -21054, 16003, -6221, -45222, -128581, -96249, -9857]
8835i857J9341M2351M419j17613l3238Q9110J01162m7470r6641M1901K1327J14315
8823A29107j8367j11055o2909L8979n895Q524K6410M3266n87l3947O9908j2326
8811G1108m8548J8656m9222p7725J7192R2144l023P1210M4514k7513j43510j22096
8799a56813j6779M9688J03386J299O0622J739L6249N1882m3533J6410m8862n0408
8787D880k8909q116M7248L4205O2239K6996k877j05736p099J5474k8565o9521
8775e9781j8116N3426j60o1411N508K2792l0192K6830j464P2164K4341J7909j10082
8762e8236l8505O9244Q2311m2881L2924o3389N512M1560l032j1530N6012Q8604
8750A58594k5201j07417J9718K6900p1235n1183J523O0338l6993r479J552j3356
$$ y = [-9857, 9484, 51835, 56254, -61359, -94597, -5487, 95675, 48205, -48436, -6535, 14792, 129107, 110740, -315, -63224, -24245, -30140, -21616, 4794, 48060, 47473, 13526, 83434, 71108, 22560, 41216, -8006, -85731, -68539, 23605, 20582, 91792, 136306, 108793, -34717, -156813, -173592, -123904, -20518, -19219, 41403, 43142, 79391, 131273, 87740, 104150, 55288, 4880, -24029, -32145, 15103, 49308, 111547, 138543, 135666, 29930, 22831, 38305, 9740, -59781, -77897, -24471, -24631, -86042, -80534, -57742, -87934, -61104, -62568, 9596, 33937, 51846, -58236, -96741, -27497, 54814, 11933, 44857, -18532, -13020, 28540, 25508, 13978, 69990, 158594, 133393, 25976, 45694, 72594, 1359, -49824, -48301, 12037, -24956, -34435, -32883, -46239]
8738d6239O4707K5750o3713l7846M926L1345m6309q2128l0819J6521K8617O4650
8726g0538k8665n1505M2005P1399k5028M084J9120M4345R846l4381k2853j7512
8714e9683M8765J6607l6921Q180j1856M359j2061m724k8436o1651N2391O6831
8702a8199O3204O1064m8345L8885K8023M7125j7362j5087j3000l9811n373M7797
8690A28921L7165l2103o2610q0396J5339m8908l1210Q2366m6102n5575m7821J4185
8678a26749P2131Q3160K3027m9558n8084k6582o30L9642Q3166K6642o3752k5279
8666b2866n7785J2010N2843L9888J9792p3421l3431l241R4786m7400n345L9818
8654A5648N3836Q3021p5694J936k8716m209n3270r9222l967N4488L9320n2362
$$ y = [-46239, 18468, 44218, -19495, -57341, -52415, -21070, -67379, -149507, -180326, -163805, -135188, -70538, -99203, -150708, -108703, -37304, -62332, -58248, -39128, 5217, 15063, -19318, -42171, -59683, -10918, 5689, -31232, -23052, -34908, -30549, -42610, -47334, -75770, -137421, -85030, -18199, 45005, 106069, 57724, 96609, 124632, 171757, 154395, 139308, 126308, 86497, 81124, 128921, 166086, 133983, 71373, -9023, 6316, -42592, -73802, 8564, -37538, -93113, -140934, -126749, -54618, 28542, 51569, 2011, -56073, -82655, -83285, -43643, 39523, 66165, 2413, -22866, -80651, -68641, -15798, 24090, 43882, -29539, -62970, -66211, 28575, -18825, -24170, 15648, 69484, 152505, 76811, 78747, 50031, 45822, -7448, -106670, -110637, -56149, -16829, -69191]
8642f9191j4137R9257K7062j4687q03O1198J9013J2014j6135n6935r170K1767
8630E9253M7315o8801l3744j8273Q8541q900J2183j9537k1229p4330n840O6068
8618B2706k6253m8465M3660J3303l5432M2610L7638M4832p0442o2005o2627J5384
8606h5091L1460K2419J2881j6904p9851o011P549O6166O6165K9538L146J1735
8594F3202K3502m210m1543J3654J8062N009O847m0376k8346K0793O84R558M1086
8581H7922k5877k0006P4110O1800j7232r1541J6332k3138L3562J5010k9842o790
8569G4310K3623J2499N9832n6978j04604j643l191J8626Q5086p23p1659r066L2499
8556E8611p5146j7017j1808k3739J5210P5481m2953L9603r781o735M9224L9605
$$ y = [-69191, -83328, 15929, 42991, 28304, 27501, 88699, 107712, 119726, 103591, 46656, 37486, 59253, 106568, 37767, 4023, -14250, 74291, 65391, 77574, 58037, 36808, -37522, -43362, 22706, -3547, -52012, -8352, 4951, -30481, 12129, 49767, 94599, 24157, -37848, -100475, -85091, -53631, -31212, -18331, -35235, -115086, -121097, -113548, -47382, 18783, 48321, 51467, 63202, 86704, 82494, 40951, 54605, 72667, 77676, 84523, 44147, 15801, 36594, 37278, 46836, 87922, 62045, 42039, 116149, 177949, 160717, 69176, 85508, 62370, 95932, 110942, 81100, 74310, 97933, 110432, 170264, 113286, 8682, 7039, 3848, 22474, 107560, 106837, 35178, 26112, 58611, -16535, -33552, -45360, -69099, -53889, 21592, -21361, 18242, 8461, 1726, 50950, 90555]
8544I0555N510l081k2499r2917l2664O7409q1658q9159K23O9426J9237j5146l7426
8531a22190N1925M4554m9172N2916M7164J5377J0876K8782K8014J108n3224j6623
8519C9507P4187J8440l6775L6750N4666J61p2869r2344M2863k9632j06111r3163
8507a64320O8639J01451O0561k1812o2643P504K6950O2147o5768q0286J02156
8496C4579R9233o8444j02723k7179K501N6163N680J0735r682n8821m2858Q6508
8484a4308O5807K717L1273p782l1878m3591k13l407m612M6223J3059o986K57m337
8470D2222n1917J4397l4806r9011q209K6501K7425O389J4438Q1255N0132N2101
8458A20917k5663m4559k0244K9810O2983J2764k5379M7339j4749j0772K6736R562
$$ y = [90555, 96065, 92984, 70485, -22432, -55096, 12313, -69345, -158504, -158281, -88855, -69618, -84764, -122190, -70265, -25711, -74883, -21967, 25197, 40574, 51450, 80232, 108246, 109354, 56130, 39507, 113694, 132134, 95359, 132109, 186775, 186936, 114067, 21723, 64586, 34954, -71157, -164320, -95681, 5770, 66331, 44519, -18124, -10620, 16330, 78477, 12709, -67577, 34579, 133812, 65368, -37355, -64534, -62033, -5870, -190, 10545, 863, -57958, -100816, -14308, 51499, 54216, 85489, 77707, 45829, 2238, 2025, -1382, -5994, 40229, 53288, 46302, 46559, 42222, -9695, 4702, -30104, -129115, -137324, -110823, -83398, -77009, -62571, 18684, 68816, 120917, 95254, 50695, 30451, 60261, 123244, 136008, 110629, 157968, 143219, 132447, 159183, 168745]
8446A68745O739M4477n4914j3066L9125K2438r3827n0887M3537N518l1826M578
8434I0637L6347K773j8698q484K5659J7235L5696k4841j04832l3767P3652M4946
8422A36323j5192j15689N6230N6796l8226k9373J4264k7779L1191o5167P426N9801
8410G0605P5742N6546q3950M157L9405j4225k8433k3465k4829j9706k2121N2697
8398H2423j6807n6760J9243l6004j5695J1542k9836L126J07963l5568j01442o1121
8386a28936K9371J11760J14216M8080m6155m3374k3198j02284n2287O0962J2757
8375a9088l8122L5780L7190j7517l7017o406L1644K7944n685o0787j11846o1791
8363b25701J409Q6254Q1482P1188P4888p1229k7758j7269N2919L2717n4893q6797
$$ y = [168745, 175484, 219961, 165047, 151981, 191106, 213544, 119717, 68830, 112367, 117885, 86059, 90637, 126984, 129757, 111059, 102575, 128234, 145469, 181165, 156324, 51492, 17725, 91377, 136323, 121131, 5442, 61672, 118468, 80242, 50869, 65133, 37354, 68545, 3378, 10804, 70605, 146347, 202893, 118943, 123100, 162505, 148280, 119847, 96382, 71553, 51847, 29726, 82423, 65616, 8856, 28099, -7905, -23600, -12058, -41894, -38768, 69195, 33627, -67815, -128936, -99565, 12195, 126411, 174491, 128336, 84962, 61764, -40520, -92807, -31845, -19088, -57210, -21430, 15760, -1757, -38774, -45180, -13536, 14408, 8723, -52064, -163910, -225701, -224292, -138038, -56556, 14632, 89520, 18291, -9467, -26736, 26183, 58900, 4007, -82790]
8351h2790l3426N7096J25482M5049p2100k182J0458l9467m1470l3624l1103m024
8339a02101m7261k3565N0200Q1571J4409j3876p590K5793J5952n7621l978P8807
8327A0740N1748m5645L7083l0476q798P6417K7656m8189j17451M8930P3180J1398
8315H6593L0712J329l434m5162r6514M0934k1127j18903j0204N4476k740N6306
$$ y = [-82790, -116216, -59120, 66362, 111411, 39311, 37129, 47587, 8120, -33350, -66974, -98077, -102101, -149362, -172927, -122727, -41156, -26747, -40623, -48213, -22420, -6468, -64089, -68067, 10740, 62488, 16843, 53926, 23450, 14652, 91069, 118725, 70536, -46915, 2015, 75195, 86593, 117305, 118634, 115200, 70038, -26476, 14458, -6669, -125572, -135776, -81300, -84040, -27734]
$$ [...]
##END NTUPLES=NMR SPECTRUM
##END=
