##TITLE=Analysis number 328172
Compound Code btb 12323
Project Code adrs
Chemist Name stores
##JCAMPDX= 6.0         $$ Bruker NMR JCAMP-DX V2.0
##DATA TYPE= NMR SPECTRUM
##DATA CLASS= NTUPLES
##ORIGIN= Bruker BioSpin GmbH
##OWNER= nmr
$$ XWIN-NMR		Version 3.5
$$ Thu May 10 10:53:03 2007 GMT Daylight Time (UT+1h)  MAYBRIDGE\nmr@NMR_250MHZ
##.OBSERVE FREQUENCY= 250.131544655141
##.OBSERVE NUCLEUS= ^1H
##.ACQUISITION MODE= SIMULTANEOUS (DQD)
##.ACQUISITION SCHEME= undefined
##.AVERAGES= 16
##.DIGITISER RES= 18
##SPECTROMETER/DATA SYSTEM= dpx250
##.PULSE SEQUENCE= zg30
##.SOLVENT NAME= CDCl3
##.SHIFT REFERENCE= (INTERNAL, CDCl3, 0, 16.522)
##AUDIT TRAIL= $$ (NUMBER, WHEN, WHO, WHERE, WHAT)
$$ ##TITLE= Audit trail, XWIN-NMR		Version 3.5
$$ ##JCAMPDX= 5.01
$$ ##ORIGIN= Bruker BioSpin GmbH
$$ ##OWNER= nmr
$$ C:\u/data/dgb/nmr/ADRS/710/pdata/1/auditp.txt
$$ ##AUDIT TRAIL=  $$ (NUMBER, WHEN, WHO, WHERE, WHAT)
(   1,<2007-05-10 10:52:41.82 +100>,<MAYBRIDGE\nmr>,<NMR_250MHZ>,
      <created by zg, POWCHK disabled, PULCHK disabled
       configuration hash MD5:
       76 6E 9A 78 1E 09 19 81 EC 84 63 8F B0 6A 59 2D
       data hash MD5: 64K
       F0 3C F9 2F 92 45 CD 02 02 8F 6E 88 28 99 AF EC>)
(   2,<2007-05-10 10:52:53.82 +100>,<MAYBRIDGE\nmr>,<NMR_250MHZ>,
      <Start of raw data processing
       ef LB = 0.3 FT_mod = 6 PKNL = 1 SI = 32K 
       data hash MD5: 32K
       1A 30 22 04 F0 3A E8 81 A8 74 B0 63 5B 8C DF 0B>)
(   3,<2007-05-10 10:52:55.92 +100>,<MAYBRIDGE\nmr>,<NMR_250MHZ>,
      <apk 
       data hash MD5: 32K
       07 D9 D2 F5 A2 65 FC D9 0F BF EB 1A 84 64 71 32>)
(   4,<2007-05-10 10:52:56.85 +100>,<MAYBRIDGE\nmr>,<NMR_250MHZ>,
      <abs ABSG = 5 
       data hash MD5: 32K
       23 8D C0 41 F3 3B FA D9 00 E8 70 61 AF E1 8C E8>)
$$ ##END=
$$ 
$$ hash MD5
$$ 7C F5 4B 0A BE 92 9C C6 7F A2 81 13 2E 2B 8B 98
##$RELAX= 
##$RELAX= 
##$RELAX= 
##$RELAX= 
##$RELAX= 
##$RELAX= 
##$RELAX= 
$$ Bruker specific parameters
$$ --------------------------
##$DU= <C:\u>
##$EXPNO= 710
##$NAME= <ADRS>
##$PROCNO= 1
##$TYPE= <nmr>
##$USER= <dgb>
##$AMP= (0..31)
100 100 100 100 100 100 100 100 100 100 100 100 100 100 100 100 100 100 
100 100 100 100 100 100 100 100 100 100 100 100 100 100 
##$AQSEQ= 0
##$AQ_mod= 3
##$AUNM= <au_zg>
##$AUTOPOS= <9 >
##$BF1= 250.13
##$BF2= 250.13
##$BF3= 250.13
##$BF4= 250.13
##$BF5= 500.13
##$BF6= 500.13
##$BF7= 500.13
##$BF8= 500.13
##$BYTORDA= 1
##$CFDGTYP= 0
##$CFRGTYP= 5
##$CHEMSTR= <none>
##$CNST= (0..31)
1 1 145 1 1 1 1 1 1 1 1 1 1 1 1 1 1 1 1 1 1 1 1 1 1 1 1 1 1 1 1 1 
##$CPDPRG= <>
##$CPDPRG1= <>
##$CPDPRG2= <>
##$CPDPRG3= <>
##$CPDPRG4= <mlev>
##$CPDPRG5= <mlev>
##$CPDPRG6= <mlev>
##$CPDPRG7= <mlev>
##$CPDPRG8= <mlev>
##$CPDPRGB= <>
##$CPDPRGT= <>
##$D= (0..31)
0 1 0 0 0 0 0 0 0 0.06 0 0 0 0 0 0 0.0002 0 0 0 0 0 0 0 0 0 0 0 0 0 0 
0 
##$DATE= 1178790760
##$DBL= (0..7)
120 120 120 120 120 120 120 120 
##$DBP= (0..7)
150 150 150 150 150 150 150 150 
##$DBP07= 0
##$DBPNAM0= <>
##$DBPNAM1= <>
##$DBPNAM2= <>
##$DBPNAM3= <>
$$ [...]
##$SUBNAM7= <"">
##$SUBNAM8= <"">
##$SUBNAM9= <"">
##$SW= 20.6930455092707
##$SWIBOX= (0..15)
0 0 3 0 0 0 0 0 0 0 0 0 0 0 0 0 
##$SW_h= 5175.983436853
##$TD= 65536
##$TD0= 1
##$TE= 683.16
##$TE2= 300
##$TE3= 300
##$TEG= 300
##$TL= (0..7)
0 120 120 120 120 120 120 120 
##$TP= (0..7)
150 150 150 150 150 150 150 150 
##$TP07= 0
##$TPNAME0= <>
##$TPNAME1= <>
##$TPNAME2= <>
##$TPNAME3= <>
##$TPNAME4= <>
##$TPNAME5= <>
##$TPNAME6= <>
##$TPNAME7= <>
##$TPOAL= (0..7)
0.5 0.5 0.5 0.5 0.5 0.5 0.5 0.5 
##$TPOFFS= (0..7)
0 0 0 0 0 0 0 0 
##$TUNHIN= 0
##$TUNHOUT= 0
##$TUNXOUT= 0
##$USERA1= <user>
##$USERA2= <user>
##$USERA3= <user>
##$USERA4= <user>
##$USERA5= <user>
##$V9= 5
##$VALIST= <valist>
##$VCLIST= <CCCCCCCCCCCCCCC>
##$VD= 0
##$VDLIST= <DDDDDDDDDDDDDDD>
##$VPLIST= <PPPPPPPPPPPPPPP>
##$VTLIST= <TTTTTTTTTTTTTTT>
##$WBST= 1024
##$WBSW= 4
##$XGAIN= (0..3)
0 0 0 0 
##$XL= 0
##$YL= 0
##$YMAX_a= 415660
##$YMIN_a= -353310
##$ZGOPTNS= <>
##$ZL1= 120
##$ZL2= 120
##$ZL3= 120
##$ZL4= 120
##$ABSF1= 16.522
##$ABSF2= -4.171173
##$ABSG= 5
##$ABSL= 3
##$ALPHA= 0
##$AQORDER= 0
##$ASSFAC= 0
##$ASSFACI= 0
##$ASSFACX= 0
##$ASSWID= 0
##$AUNMP= <proc_1d>
##$AZFE= 0.1
##$AZFW= 0.1
##$BCFW= 0
##$BC_mod= 0
##$BYTORDP= 0
##$COROFFS= 0
##$CY= 12.5
##$DATMOD= 1
##$DC= 0
##$DFILT= <>
##$DTYPP= 0
##$F1P= 14.0000005364418
##$F2P= -0.99999901652339
##$FCOR= 0.5
##$FTSIZE= 32768
##$FT_mod= 6
##$GAMMA= 0
##$GB= 0
##$INTBC= 1
##$INTSCL= 1
##$ISEN= 128
##$LB= 0.3
##$LEV0= 0
##$LPBIN= 0
##$MAXI= 10000
##$MC2= 0
##$MEAN= 0
##$ME_mod= 0
##$MI= 0
##$NCOEF= 0
##$NC_proc= -5
##$NLEV= 6
##$NOISF1= 0
##$NOISF2= 0
##$NSP= 0
##$NTH_PI= 0
##$NZP= 0
##$OFFSET= 16.522
##$PC= 1
##$PHC0= 162.7687
##$PHC1= -8.042786
##$PH_mod= 1
##$PKNL= yes
##$PPARMOD= 0
##$PSCAL= 4
##$PSIGN= 0
##$REVERSE= no
##$SF= 250.13
##$SI= 32768
##$SIGF1= 0
##$SIGF2= 0
##$SINO= 400
##$SIOLD= 32768
##$SREGLST= <1H.CDCl3>
##$SSB= 0
##$STSI= 32768
##$STSR= 0
##$SW_p= 5175.98343685301
##$SYMM= 0
##$S_DEV= 0
##$TDeff= 65536
##$TDoff= 0
##$TI= <Analysis number 999999
Compound Code 99
Book Reference 9
Project Code 9>
##$TILT= no
##$TM1= 0
##$TM2= 0
##$TOPLEV= 0
##$USERP1= <user>
##$USERP2= <user>
##$USERP3= <user>
##$USERP4= <user>
##$USERP5= <user>
##$WDW= 1
##$XDIM= 32768
##$YMAX_p= 542669661
##$YMIN_p= -63911
$$ End of Bruker specific parameters
$$ ---------------------------------
##NTUPLES= NMR SPECTRUM
##VAR_NAME=  FREQUENCY,     SPECTRUM/REAL,   SPECTRUM/IMAG
##SYMBOL=    X,             R,               I
##VAR_TYPE=  INDEPENDENT,   DEPENDENT,       DEPENDENT
##VAR_FORM=  AFFN,          ASDF,            ASDF
##VAR_DIM=   32768,         32768,           32768
##UNITS=     HZ,            ARBITRARY UNITS, ARBITRARY UNITS
##FACTOR=    0.157963299565203, 1,           1
##FIRST=     4132.6476996994, 0,             0
##LAST=      -1043.33573715361, 0,           0
##MIN=       -1043.33573715361, -63911,      0
##MAX=       4132.6476996994, 542669661,     0
$$ Real data points
##PAGE= N=1
##DATA TABLE= (X++(R..R)), XYDATA
$$ [...]
13617e874j1055M594j6900j0126J0927J4399J6452J3788N074l042J1720r565j9087
$$ -5874 -16929 -12335 -29235 -39361 -28434 -14035 2417 16205 21279 18237 29957 20392 1305
13604A305r281j2925j5807m85J3329M297p39o377O745K050m715l207J2497m348
$$ 1305 -7976 -20901 -36708 -37193 -23864 -19567 -20306 -26683 -19938 -17888 -22603 -25810 -13313 -17661
13590a7661m413L374r124J0078K2314n845o047r394O269l928k254j613j5712J554
$$ -17661 -22074 -18700 -27824 -17746 4568 -1277 -7324 -16718 -10449 -14377 -16631 -18244 -33956 -32402
13576c2402K3614P858o979q67J954K44j2655j8350l890M857J4713m55Q348o237
$$ -32402 -8788 -930 -7909 -8776 -6822 -6578 -19233 -37583 -41473 -36616 -21903 -22358 -14010 -20247
13562b0247j5984M056j494j5308j3766M471O967J3254k912j3479J0569K5957J8467
$$ -20247 -36231 -32175 -33669 -48977 -62743 -58272 -51305 -38051 -40963 -54442 -43873 -17916 551
13549E51r743j8991N285J937r632j4208N773J3387j1984R039K9612m475r400P449
$$ 551 -9192 -28183 -22898 -20961 -30593 -44801 -39028 -25641 -37625 -28586 1026 -3449 -12849 -5400
13535e400J6126k329r300o336J340j221j4733q124J8777K0627J924M280j073j2484
$$ -5400 10726 8397 -903 -7239 -5899 -7120 -21853 -29977 -11200 9427 11351 15631 14558 2074
13521B074l870K415P311j0039O462n302Q379J946j1247K291P760J3950l932k0114
$$ 2074 -1796 619 7930 -2109 4353 -949 7430 9376 -1871 420 8180 22130 18198 -1916
13507a916k5549J4990R833m278n482j012p32j1037J7404R279j4702M405J3074
$$ -1916 -27465 -12475 -2642 -6920 -12402 -13414 -14146 -25183 -7779 1500 -13202 -8797 4277
13494D277q010o656K584K946m645l648k604k891j2529N223j1848K977N121K884
$$ 4277 -3733 -10389 -7805 -4859 -9504 -13152 -15756 -18647 -31176 -25953 -37801 -34824 -29703 -26819
13480b6819R970N095m959q798m620j731j184r733j4573r74L5736N324j4781n177
$$ -26819 -16849 -11754 -16713 -25511 -30131 -31862 -33046 -42779 -57352 -58326 -22590 -17266 -32047 -37224
13466c7224p861J4881L2930L347o544p492j9916l596M084K5936N458l856q007
$$ -37224 -45085 -30204 2726 6073 -471 -7963 -27879 -31475 -27391 -1455 4003 147 -7860
13453g860j4605K005R219M569j410n810P066r897r028K3727R907k1593j82J172
$$ -7860 -22465 -20460 -11241 -6672 -8082 -13892 -6826 -16723 -25751 -2024 7883 -13710 -13892 -12720
13439a2720J7941J110P006j2072k0579k793N938N92J1345j1129k5556m486K262
$$ -12720 5221 6331 13337 1265 -19314 -22107 -16169 -15577 -4232 -15361 -40917 -45403 -43141
13426d3141M35J517J1161Q574K312k70L552n309L025K990j3861j4380J2683K663
$$ -43141 -42706 -41189 -30028 -21454 -19142 -19412 -15860 -21169 -18144 -15154 -29015 -43395 -30712 -28049
13412b8049J5961J5380K017q839k4409j2360K099R424J1294p92q150N33j1398
$$ -28049 -12088 3292 5309 -3530 -27939 -40299 -38200 -28776 -17482 -18274 -26424 -25891 -37289
13399c7289M213Q485P524J736p047M994J7812l229n127L49p415R915J154j3143
$$ -37289 -33076 -24591 -17067 -15331 -22378 -17384 428 -2801 -7928 -7579 -14994 -5079 -3925 -17068
13385a7068q785J2120N651J2592M485j7860p463P121n99o992P517J2398j0807
$$ -17068 -25853 -13733 -8082 4510 8995 -8865 -16328 -9207 -9806 -16798 -9281 3117 -7690
13372g690n100K2217k268K024k2764q885j399J3381J6284K139o194K4105k174
$$ -7690 -12790 9427 7159 9183 -13581 -22466 -23865 -10484 5800 7939 1745 25850 23676
13359B3676j7664j591k156j0987p492q679M779O834L116R82j0096m20j6544M519
$$ 23676 6012 4421 2265 -8722 -16214 -24893 -20114 -13280 -10164 -9182 -19278 -19698 -36242 -31723
13345c1723J895J0902l261O018J5977o316j4559O182Q750q626J6549j0199J5624
$$ -31723 -29828 -18926 -22187 -16169 -192 -6508 -21067 -14885 -6135 -14761 1788 -8411 7213
13332G213K5005o152p438M501j0612m517k580N232J9759J3838J1000N492P798
$$ 7213 32218 26066 18628 23129 12517 8000 5420 10652 30411 44249 55249 60741 68539
13319F8539j4397P138R649j769n837l281j2441L316O437O709J4995R810J815K730
$$ 68539 54142 61280 70929 69160 63323 60042 47601 50917 57354 64063 79058 88868 90683 93413
13305I3413q25q22L078p85l658J7047Q765Q418O286j6223r363J5383N565J8417
$$ 93413 92588 91766 94844 94059 90401 107448 116213 124631 130917 114694 105331 120714 126279 144696
13291A44696J4060l621M226K2991K1242P867Q679K8168K3739q632q319P781K1245
$$ 144696 158756 155135 159361 182352 203594 211461 220140 248308 272047 263415 255096 262877 284122
13278B84122r585J6322N721j6365R066j7075Q383j37K9545J8151q346O0j823J1711
$$ 284122 274537 290859 296580 280215 289281 272206 280589 280452 309997 328148 319802 319862 318039 329750
13264C29750J8207J7470J2016j1774r73l138l937O086O323J2040o374q731O436
$$ 329750 347957 365427 377443 365669 364696 361558 357621 363707 370030 382070 375696 366965 373401
13251C73401N704j0311L840j1928j5701j1630n11J0206K55p073r363j4799l3034
$$ 373401 379105 368794 372634 360706 345005 333375 332864 343070 343325 336252 326889 312090 279056
13238B79056n416K8281K441k428k861J2523R975j2854N99P585j5623j383J5070
$$ 279056 273640 301921 304362 301934 299073 311596 321571 308717 309316 316901 301278 299895 314965
13225C14965J8630J2075j0401j0473j1400j464J4530Q21j3954J0662J7154O397
$$ 314965 333595 345670 335269 324796 313396 311932 326462 327283 313329 323991 341145 347542
13213C47542l637m683j6049j5247O504M956j616M839O409N145K677M038Q60q37
$$ 347542 343905 339222 323173 307926 314430 319386 317770 322609 329018 334163 336840 340878 341738 340901
13199C40901L206O443j0746J7586K9239K1536k130k0097L014K90Q750r578l6969
$$ 340901 344107 350550 339804 357390 386629 408165 406035 385938 388952 389242 397992 388414 351445
13186C51445r200j165r159k4350k5588k567M668J4864n198j4477j991m754l023
$$ 351445 342245 341080 331921 307571 281983 279416 284084 298948 293750 279273 277282 272528 269505
13173B69505j040j4875j3950l116J1399L03n352j6965M112J647k1999j2949k0924
$$ 269505 268465 253590 239640 236524 247923 248226 242874 225909 230021 231668 209669 196720 175796
13160A75796k3480j2552j149j6339l5351j3356R976N487P570R668p014n364p18
$$ 175796 152316 139764 138615 122276 86925 73569 83545 89032 96602 106270 99256 93892 93174
13147I3174j7036n502q282q242j9389o508J5687K949O407o575j2922r724k145
$$ 93174 76138 70636 62354 54112 34723 28215 43902 46851 53258 46683 33761 24037 21892
13134B1892n096m187J5900l644j016r39k36N369p262R789R862j0154j7105j613
$$ 21892 16796 12609 28509 24865 23849 22910 22674 28043 20781 30570 40432 30278 13173 11560
13120A1560p904n337J72P760q009M581O804j1175p436o797l681L189O448R386
$$ 11560 3656 -1681 -1509 6251 -1758 2823 9627 -1548 -8984 -15781 -19462 -16273 -9825 -439
13106d39j240K338J5462Q4k5193m472O427O691P881K1454p159j0610O980j387
$$ -439 -1679 659 16121 16205 -8988 -13460 -7033 -342 7539 28993 21834 11224 18204 16817
13092A6817L500j4616j1039J0045N639l476J3763K484k0642k6352n3L759N10m267
$$ 16817 20317 5701 -5338 4707 10346 6870 20633 23117 2475 -23877 -23930 -20171 -19661 -23928
13078b3928K167J1448J5762N987r631p39K2385O411o742j866m878m419J736J0254
$$ -23928 -21761 -10313 5449 11436 1805 1066 23451 29862 23120 21254 16376 11957 13693 23947
13064B3947K582K37m74K502Q381J5476o016j0761j2015Q267K3300J3640K139N30
$$ 23947 26529 26766 26292 28794 37175 52651 46635 35874 23859 32126 55426 69066 71205 71735
13050G1735j0463l2670J1542L303J811L222N793j818l535P82q249p36j1941P554
$$ 71735 61272 28602 40144 43447 45258 48480 54273 52455 48920 49702 41453 40717 28776 36330
13036C6330j1865J198l01J4406O082l033Q619J2431m693p437J5261Q357j020q54
$$ 36330 24465 25663 25362 39768 45850 42817 51436 63867 59174 51737 66998 75355 74335 73481
13022G3481m471n35J6433P767O634J0934J0794k850j768K3243J2466J5108L5327
$$ 73481 69010 68475 84908 92675 99309 110243 121037 118187 116419 139662 152128 167236 202563
13009B02563J5883O655P923L360J079O246l106K417J8829k6428l671J7343J0107
$$ 202563 218446 225101 233024 236384 237463 243709 240603 243020 261849 235421 231750 249093 259200
12996B59200p458Q752J3485m470R896J0581q445L64o181J153Q470J3069P929J6270
$$ 259200 251742 260494 273979 269509 279405 289986 281541 281905 275724 276877 285347 298416 306345 322615
12982C22615Q554l480N62J2569P718P063O297n691k63k131o506K1938L1411K6364
$$ 322615 331169 327689 328251 340820 348538 355601 361898 356207 355944 353813 347307 369245 400656 427020
12968D27020K1095Q325K7874M0748L0401K4629K4748L065J7843L0116L9804L2004
$$ 427020 448115 456440 484314 525062 555463 580092 604840 607905 625748 655864 695668 727672
12956G27672J3309J9085K8134J4781Q057K1125K5558O205J6723K7108K6594K5609
$$ 727672 740981 760066 788200 802981 811038 832163 857721 863926 880649 907757 934351 959960
12944I59960J2839Q163J6172J0634J1400J2161J6845J7585o918r854o982j2184
$$ 959960 972799 980962 997134 1007768 1019168 1031329 1048174 1065759 1058841 1048987 1042005 1029821
12932A029821q588M586K346j6287K996j4909j7819p433r846j3260k3943j9259
$$ 1029821 1021233 1025819 1028165 1011878 1014874 999965 982146 974713 964867 951607 927664 908405
12920I08405n171o777l0931j1536N780l2222m1523j3767j8941k1810k5996k2884
$$ 908405 903234 896457 865526 853990 859770 827548 786025 772258 753317 731507 705511 682627
12908F82627l101N065l994j3901m977p874Q311j760j1124m67J0884K322P03Q984
$$ 682627 679526 684591 680597 666696 661719 653845 662156 660396 649272 648805 659689 662011 662714 671698
12894F71698K6494J4674j1426J6613K6346J5932J1935r682K0334K3024L4074O355
$$ 671698 698192 712866 701440 718053 744399 760331 772266 762584 782918 805942 840016 846371
12882H46371P619R721p63N516K1646P398J7541L702L853J422P066J9391J1175
$$ 846371 853990 863711 862948 868464 890110 897508 915049 918751 922604 924026 931092 950483 961658
12869I61658n993j1195n969n104m827j5941r974j4868j6962j7274j2723j5551
$$ 961658 955665 944470 938501 933397 928570 912629 902655 887787 870825 853551 840828 825277
12857H25277j8402l6621k6307j8372j9497j8021k5658k1766k4898k9670k6796
$$ 825277 806875 770254 743947 725575 706078 688057 662399 640633 615735 586065 559269
12846E59269r375l2996m0336k4833j2616l825j6806l5857l7170l1218j5097j0017
$$ 559269 549894 516898 476562 451729 439113 435288 418482 382625 345455 314237 299140 289123
12834B89123N067k0534k8710j4280p087j5178j9336L912m634j6935j0786j5649
$$ 289123 294190 273656 244946 230666 223579 208401 189065 192977 188343 171408 160622 144973
12822A44973j2266l338q015o440L037M79r711j4278j1665K127r77j5975j0892
$$ 144973 132707 129369 121354 114914 117951 118430 108719 94441 82776 84903 83926 67951 57059
12809E7059j283O419k711P211n768Q263j5482j1791J0968n467l568q89j5346p032
$$ 57059 55776 62195 59484 66695 60927 69190 53708 41917 52885 47418 43850 42961 27615 20583
12795B0583q900M449J0809J524j1823N145L880P811n928p369n600K0861J6531
$$ 20583 11683 16132 26941 28465 16642 21787 25667 33478 27550 20181 14581 35442 51973
12782E1973K512P10o766r473J437J733p850Q17o580O263J0454j7728q830j500
$$ 51973 54485 55195 48429 38956 40393 42126 34276 35093 28513 34776 45230 27502 18672 17172
12768A7172k586N492O457m804o735J641K2987k616l537J686O701K925j0274j946
$$ 17172 14586 20078 26535 21731 14996 16637 39624 37008 33471 35157 41858 44783 34509 32563
12754C2563Q929n580p386k0032j4975Q145J4645J565O503J3904j5000j1441K3583
$$ 32563 41492 35912 28526 8494 -6481 1664 16309 17874 24377 38281 23281 11840 35423
12741C5423K405j7006m757p991k879Q057K183K425M375J995O074Q010J017j0138
$$ 35423 37828 20822 16065 8074 5195 13252 15435 17860 22235 24230 30304 38314 39331 29193
12727B9193j6275j3147N049N852O285k145K853o649K558m034L472J991l204J4856
$$ 29193 12918 -229 4820 10672 16957 14812 17665 11016 13574 9540 13012 15003 11799 26655
12713B6655M309m702O040P127p438j390j5016j830j520m35O34P568K840k121k051
$$ 26655 30964 26262 32302 39429 31991 30601 15585 13755 12235 11800 12434 20002 22842 20721 18670
12698A8670p034n86M636J1276O908J2604J6624J6039J351K97Q720K693M383K408
$$ 18670 11636 11050 15686 26962 33870 46474 63098 79137 80488 80785 89505 92198 96581 98989
12684I8989K250j6523m364l947j508j7501J0389J6741o357o5q466q214j2133j1119
$$ 98989 101239 84716 80352 76405 74897 57396 67785 84526 78169 78104 69638 61424 49291 38172
12670C8172M497j1239l851k533P067J7387P874j184J908K090J926r517j9372p010
$$ 38172 42669 31430 27579 25046 32113 49500 57374 56190 58098 60188 62114 52597 33225 26215
12656B6215K0427K0425j328p342M492j0343k930J2676M86k3697j7623K3611L1454
$$ 26215 46642 67067 65739 58397 62889 52546 49616 62292 62778 39081 21458 45069 76523
12643G6523K805j2637K0658J4113J1874K4002K124j1658P754J3229J0548J1989
$$ 76523 79328 66691 87349 101462 113336 137338 139462 127804 135558 148787 159335 171324
12631A71324j452n798L670q361j5087J132M836o65m241k3574n284O438m638K467
$$ 171324 169872 164074 167744 159383 144296 145428 150264 149599 145358 121784 116500 122938 118300 120767
12617A20767J500J3302J662Q387J5677K77L784J3661P180K3056K6077K6278L9810
$$ 120767 122267 135569 137231 145618 161295 161572 165356 179017 186197 209253 235330 261608 301418
12604C01418K2204J4156K3795K4521K9771L4352K6165K3794L4523J7244K5487
$$ 301418 323622 337778 361573 386094 415865 450217 476382 500176 534699 551943 577430
12593E77430K5803K7155J8635R099k712J7805J3924J5402J9899R219J7363J1394
$$ 577430 603233 630388 649023 658122 655410 673215 687139 702541 722440 731659 749022 760416
12581G60416m71M404j324R816l534M079j5539k9892j3883K5689J1206n029j9452
$$ 760416 759945 764349 763025 772841 769307 773386 757847 727955 714072 739761 750967 745938 726486
12568G26486j3889J782o368k1613l3573l268J4953j0523j609J4421k705o148R150
$$ 726486 712597 714379 708011 686398 652825 649557 664510 653987 652378 666799 664094 657946 667096
12555F67096J2001O581J1098Q939K2858K3022k049R330J0638p045J6938J6204
$$ 667096 679097 685678 696776 705715 728573 751595 749546 758876 769514 762469 779407 795611
12543G95611O708j592j521N15j6861j3424K881q10k3815q742O093m415M960m361
$$ 795611 802319 800727 799206 799721 782860 769436 772317 771507 747692 738950 745043 740628 745588 741227
12529G41227n926k4074k6156j2150j2901k8588k9949k5166j6616l3357l6468k3872
$$ 741227 735301 711227 685071 672921 660020 631432 601483 576317 559701 526344 489876 466004
12517D66004j9978l8250l8710k6406l1044j0619p177k3737j9953k6623k0814j9735
$$ 466004 446026 407776 369066 342660 311616 300997 293820 270083 250130 223507 202693 182958
12505A82958j1973P38p031k4679r341j4807m363r462p985P413q122j547r383j4345
$$ 182958 170985 171723 164692 140013 130672 115865 111502 102040 94055 101468 93346 91799 82416 68071
12491F8071Q687K2976J4755j7131k4491j1688j814O391M393J169J0694J42P388
$$ 68071 76758 99734 114489 97358 72867 61179 59365 65756 70149 71318 82012 82154 89542
12478H9542P400j7767n889m950O532J0947n911L856l450J28r917p665k1178m91
$$ 89542 96942 79175 73286 68336 74868 85815 79904 83760 80310 80438 70521 62856 41678 41187
12464D1187R478p48r279o091K6445k079k0652k0811l1904K210K7776J5977o992
$$ 41187 50665 49917 40638 34547 60992 58913 38261 17450 -14454 -12244 15532 31509 24517
12451B4517J380J4456k080j8061m629P46n095J6023P88p586j275p242q228J800
$$ 24517 25897 40353 38273 20212 15583 16329 11234 27257 28045 20459 19184 11942 3714 5514
12437E514J4953R434K650O203J0939M152r101j4500K316R572N905K192P70j4520
$$ 5514 20467 29901 32551 38754 49693 53845 44744 30244 32560 42132 48037 50229 50999 36479
12423C6479J650j510l23j421j2945o191P536L748k782k707M450J6341j7887j639
$$ 36479 38129 36619 36296 34875 21930 15739 23275 27023 24241 21534 25984 42325 24438 22799
12409B2799K2087k0019j8647J3920O030L455L840J8162l597L214Q42L399l226
$$ 22799 44886 24867 6220 20140 26170 29625 33465 51627 48030 51244 52086 55485 52259
12396E2259k4456J311P5M01J694J2385M223k7590j8306J5215Q321R788j0358j9269
$$ 52259 27803 29114 29189 29590 31284 43669 47892 20302 1996 17211 25532 35320 24962 5693
12382E693r814J0096J117j2856j342K2415K9562M070j3887r817J1815M781J6986
$$ 5693 -4121 5975 7092 -5764 -7106 15309 44871 48941 35054 25237 37052 41833 58819
12369E8819m141J912N694J2418J6006K914j4531P77K780Q53k22j1511j2918m0
$$ 58819 54678 56590 62284 74702 90708 93622 79091 79868 82648 83501 83279 71768 58850 58810
12355E8810j2006m780j5399j5770j52J3303n132N565m335j7324R003j347j821
$$ 58810 46804 42024 26625 10855 10703 24006 18874 24439 20104 2780 11783 10436 8615
12342H615J076l822L89J7334J4553j1885j5208q096J029l041M311J051Q46J0354
$$ 8615 9691 5869 6258 23592 38145 26260 11052 2956 3985 944 5255 6306 7152 17506
12328A7506J9767j1464K845M721N798k335r091M55M646n600J502l75J4919K2315
$$ 17506 37273 25809 28654 33375 39173 36838 27747 28202 32848 27248 28750 28375 43294 65609
12314F5609K008j3285k242K516j923k241Q966P27j4982j0717o545K803m558m920
$$ 65609 67617 54332 52090 54606 52683 50442 59408 60135 45153 34436 27891 30694 26136 21216
12300B1216L424R05N611J0882j2942j1388n928m977J523M122M864p562o178O313
$$ 21216 24640 25545 31156 42038 29096 17708 11780 6803 8326 12448 17312 9750 3572 9885
12286I885J3634J2638n621j6485l596k730L58N789l452k933P969P785r329q964
$$ 9885 23519 36157 30536 14051 10455 7725 8083 13872 10420 7487 15456 23241 13912 4948
12272D948m69k975k728r03J1374N287j5649j430k771j2472K315J2870O939J877
$$ 4948 4479 1504 -1224 -2127 9247 14534 -1115 -2545 -5316 -17788 -15473 -2603 4336 6213
12258F213k654q469n717L228r16o434R416J5514J050k470q59o621L855P043J2791
$$ 6213 3559 -4910 -10627 -7399 -8315 -14749 -5333 10181 11231 8761 7902 1281 5136 12179 24970
12243B4970J0347K447j051M362j2161j6848N582r24n292N465O86o30m280J672
$$ 24970 35317 37764 36713 41075 28914 12066 17648 16724 11432 16897 17583 16953 12673 14345
12229A4345R476N363j695J5531N975l067N012k636j4032j2198P503J7642r657
$$ 14345 23821 29184 27489 43020 48995 45928 50940 48304 34272 22074 29577 47219 37562
12216C7562L993K71j2604r561j5129L096J2917p93j8174l699N439j1723P174j3314
$$ 37562 41555 41826 29222 19661 4532 7628 20545 19752 1578 -2121 3318 -8405 -1231 -14545
12202a4545R568K1469Q876K765p501j8449Q214n20q436j2262Q336J402K953l959
$$ -14545 -4977 16492 25368 28133 20632 2183 10397 9877 1441 -10821 -2485 -1083 1870 -2089
12188b089M401j644N926j0406Q737J2936L569J0219k004j0446M832P625m773M598
$$ -2089 2312 668 6594 -3812 4925 17861 21430 31649 29645 19199 24031 31656 26883 31481
12174C1481J3217O961j1551r873j5780J919r096P341l504j9612L951K159o164
$$ 31481 44698 51659 40108 30235 14455 16374 7278 14619 11115 -8497 -4546 -2387 -8551
12161h551r097m11K0475R689J240j617j2301j827K923r8l232Q722l570p524n704
$$ -8551 -17648 -18059 2416 12105 13345 11728 -573 -2400 523 425 -2807 5915 2345 -5179 -10883
12146a0883k480O105J9264p789j0053J0901Q401K1094k581j2021j8156m573m78
$$ -10883 -13363 -7258 12006 4217 -5836 5065 13466 34560 31979 19958 1802 -2771 -3249
12133c249J1475J2873O837r205j50J1863J5942J1338j3412j5151O355J205j3797
$$ -3249 8226 21099 27936 18731 18581 30444 46386 57724 44312 29161 35516 36721 22924
12120B2924L854O014J0115l522r000o872J0185K25j1162k3227j2105N752R784
$$ 22924 26778 32792 42907 39385 30385 23513 33698 33923 22761 -466 -12571 -6819 2965
12107B965J2069N20q760J2204J487Q04M722m030o858k2234L52N109J0580N537
$$ 2965 15034 15554 6794 18998 20485 21289 26011 21981 15123 -7111 -6759 -1650 8930 14467
12093A4467l185j631j4965j153N235R262O496M716j6661p461M141J6442J3678
$$ 14467 11282 9651 -5314 -6467 -1232 8030 14526 19242 2581 -4880 -739 15703 29381
12080B9381q272k2016j763J0918N699p566j1828O030L322q471L108n601j0409
$$ 29381 21109 -907 -2670 8248 13947 6381 -5447 583 3905 -4566 -1458 -7059 -17468
12067a7468M026M820j6455j204K5562K301l481J5496J8492K704j4276n184J0211
$$ -17468 -13442 -8622 -25077 -26281 -719 1582 -1899 13597 32089 34793 20517 15333 25544
12054B5544N738J4687q015k2238p236J4746J7430l067j7810o429j0402j96k337
$$ 25544 31282 45969 37954 15716 8480 23226 40656 37589 19779 13350 2948 2752 415
12041D15J143M490K829j0834r069N181j1212M40L226k654O091J2071p992N001
$$ 415 1558 6048 8877 -1957 -11026 -5845 -17057 -16617 -13391 -16045 -9954 2117 -5875 -874
12027h74J7307P19j465Q43j994m355j1984L642J3596M705j0189j6177o214O604
$$ -874 16433 17152 15687 16530 14536 10181 -1803 1839 15435 20140 9951 -6226 -12440 -5836
12013e836Q554m66p354r302o396K73P85l392N946M893J054J7456J1078j4109p78
$$ -5836 2718 2252 -5102 -14404 -20800 -20527 -19742 -23134 -17188 -12295 -11241 6215 17293 3184 2406
11998B406n617J3870J5047q575j9893j1590J3340r058O581J1665K2199L861n269
$$ 2406 -3211 10659 25706 17131 -2762 -14352 -1012 -10070 -3489 8176 30375 34236 28967
11985B8967j748M822j1041q719L788R977o44K708j0052k5520n410K0518J5145
$$ 28967 27219 32041 21000 12281 16069 26046 25402 28110 18058 -7462 -12872 7646 22791
11972B2791J6639k302n604n037P105p906j7025n750J3704K070M017r406o819j6018
$$ 22791 39430 37128 31524 26487 33592 25686 8661 2911 16615 18685 22702 13296 6477 -9541
11958i541k959p549P296J2137n86L554J7603J0715J812j2730l849K1037M332k0674
$$ -9541 -12500 -20049 -12753 -616 -1202 2352 19955 30670 32482 19752 15903 36940 41272 20598
11944B0598k1732n16O277K736o818O10R814M791r401L005j1655j5515l809m307
$$ 20598 -1134 -1650 4627 7363 545 1155 10969 15760 6359 9364 -2291 -17806 -21615 -25922
11930b5922r629R315J9353J5544N755p279L398L489j3009j836P467J515N738p563
$$ -25922 -35551 -26236 -6883 8661 14416 7137 10535 14024 1015 -821 6646 8161 13899 6336
11916F336N358J2876j2531j0421k222Q395q017k75R757O380Q772M153M540j1160
$$ 6336 11694 24570 12039 1618 -604 7791 -226 -501 9256 15636 24408 28561 33101 21941
11902B1941k019Q505r117k0454p385J1347R672j0897p469O620J3211o087J193
$$ 21941 19922 28427 19310 -1144 -8529 2818 12490 1593 -5876 744 13955 7868 9061
11889I061J3770j8242q891k300l481K683J5957r863j0080n155J341O342M099q358
$$ 9061 22831 4589 -4302 -6602 -10083 -7400 8557 -1306 -11386 -16541 -15200 -8858 -4759 -13117
11875a3117J1388K2655o864k000j5305J0635J9220K746Q24o827k2220J6096K772
$$ -13117 -1729 20926 14062 12062 -3243 7392 26612 29358 30182 23355 1135 17231 20003
11862B0003j1119j6362N387J6943N981M768m696r291O770R38m156p488o556R041
$$ 20003 8884 -7478 -2091 14852 20833 25601 20905 11614 18384 19322 15166 7678 1122 10163
11848A0163M295j4218k4852Q336K334R92R820O96N180J1749K0M706j04K733k1223
$$ 10163 14458 240 -24612 -16276 -13942 -12950 -3130 -2434 2746 14495 14515 19221 19117 21850 627
11833F27k5942k255k244J8880J2403l937r202q227K996J1090N441N181K200m87
$$ 627 -25315 -27570 -29814 -10934 1469 -2468 -11670 -19897 -16901 -5811 -370 4811 7011 6524
11819F524Q152n261k6130L118J3110N554N33j0780l437J6639q217q709J9024L528
$$ 6524 14676 9415 -16715 -13597 -487 5067 5600 -5180 -8617 8022 -195 -8904 10120 13648
11805A3648n860O105Q62j3759L430N298P393R045k1299j4705L518P375J2800q466
$$ 13648 7788 13893 14755 996 4426 9724 17117 26162 4863 -9842 -6324 1051 13851 5385
11791E385m142M559l036o767p072J6213J522j191m466J523N225o006j0699k944
$$ 5385 1243 5802 2766 -4001 -11073 5140 6662 5471 1005 2528 7753 1747 -8952 -11896
11777a1896Q053J6035Q283q489r424j957P792O749N041o073j2813m877j5096J1601
$$ -11896 -3843 12192 20475 11986 2562 605 8397 15146 20187 14114 1301 -3576 -18672 -7071
11763g071N814L734O333p482j1961k593J4067O673Q023N06o355p40K234m364p262
$$ -7071 -1257 2477 8810 1328 -10633 -13226 841 7514 15537 16043 9688 8948 11182 6818 -444
11748d44J538M757p665n246R291J9350R31j0374o132J2006J5549R995J092k9998
$$ -444 1094 5851 -1814 -7060 2231 21581 22512 12138 6006 18012 33561 43556 44648 14650
11734A4650j5834K701O3J660j46P624N064M562m881P31J058k381N208j1263q834
$$ 14650 -1184 1517 1580 3240 3094 10718 15782 20344 15463 16194 17252 14871 20079 8816 -18
11719a8N99J166O395K0418p610r005J577J544j0432k1897L142J1395K196N121
$$ -18 581 1747 8142 28560 20950 11945 13522 15066 4634 -17263 -14121 -2726 -530 4591
11705D591L651J1096M092j1872j5562l448J0663K436Q699j5260J1738J2146q908
$$ 4591 8242 19338 23430 11558 -4004 -7452 3211 5647 14346 -914 10824 22970 14062
11692A4062P83J3581Q671j6730j4586k671j0136o312j0343R212J0930L3998J059
$$ 14062 14845 28426 37097 20367 5781 3110 -7026 -13338 -23681 -14469 -3539 30459 31518
11679C1518k365j3434k7308k634l904L2100J7807o332j5368J1017L987K6541k0662
$$ 31518 29153 15719 -11589 -14223 -18127 13973 31780 25448 10080 21097 25084 51625 30963
11666C0963j7260j5880m193M794K4709J4113K383K842j253k943j0665k427l016
$$ 30963 13703 -2177 -6370 -1576 23133 37246 39629 42471 41218 38275 27610 25183 22167
11653B2167j0501L692l169j7055k320O112m470M197J1762J8324Q004j9417j3920
$$ 22167 11666 15358 12189 -4866 -7186 -1074 -5544 -1347 10415 28739 36743 17326 3406
11640C406R202o795J4873Q053N72o785k593R906n004R532J0608M120m299q222
$$ 3406 12608 5813 20686 28739 29311 22526 19933 29839 24835 34367 44975 49095 44796 36574
11626C6574k6318q189o43M105L162J0051J8549k392k7993J103p897R702p220L757
$$ 36574 10256 2067 1424 5529 8691 18742 37291 34899 6906 8009 112 9814 2594 6351
11612F351N863n886L209m408p25k862r31J6153L677q526j0538J003M907J2828
$$ 6351 12214 6328 9537 5129 4404 1542 611 16764 20441 11915 1377 2380 7287 20115
11598B0115K662r795L259J5321Q290k249K527l544l607k0429j7259o06M130J9779
$$ 20115 22777 12982 16241 31562 39852 37603 40130 36586 32979 12550 -4709 -5315 -1185 18594
11584A8594j639j6448M839k75J447q912R303q042m219J6085l749R3l445r983j921
$$ 18594 16955 507 5346 5071 6518 -2394 6909 -1133 -5352 10733 6984 7077 3632 -6351 -8272
11569h272P17p063q05J1055l958J64J7505O0M387O685j685K918j0121j5870J179
$$ -8272 -7555 -14618 -15423 -4368 -8326 -8162 9343 9403 13790 20475 18790 21708 11587 -4283 -3104
11554c104J2276r2K219L505n177j0058K974J0731j138q971p469Q299K222M162
$$ -3104 9172 9080 11299 14804 9627 -431 2543 13274 12136 3165 -4304 3995 6217 10379
11540A0379K616K85j1787R831o057p564r11l854M628J8393r36j902J1049P856
$$ 10379 12995 13280 1493 11324 5267 -2297 -3208 -7062 -2434 15959 15023 13121 24170 32026
11526C2026j4365j5679n054M642R929L013k260j3751L57N914M664m25l491j001
$$ 32026 17661 1982 -3072 1570 11499 14512 12252 -1499 -1142 4772 9436 9011 5520 4519
11512D519o164K2304K761j056P987J1247n553l465j832k074m970K997m652j3004
$$ 4519 -1645 20659 23420 22364 30351 41598 36045 32580 30748 28674 23704 26701 22049 9045
11498I045l708O25m503O440J2840j298R46O615l922l834J3059j157j3318M905
$$ 9045 5337 5962 1459 7899 20739 19441 20387 27002 23080 19246 32305 31148 17830 22735
11484B2735o568o018M755o846k279J6460J148K02r73j43n203l861J1783J346p971
$$ 22735 16167 10149 14904 8058 5779 22239 23387 23589 22616 22473 17270 13409 25192 26538 18567
11469A8567m95J3090R570O75n238k3764l564j010J918o928J5497J2475Q243p013
$$ 18567 18072 31162 40732 41407 36169 12405 8841 7831 9749 2821 18318 30793 39036 32023
11455C2023r425j6666j0159O25K129o485M699J2353M755q316N957P897j046k909
$$ 32023 22598 5932 -4227 -3602 -1473 -7958 -3259 9094 13849 5533 11490 19387 18341 15432
11441A5432p340o935J0775J845p562P894J4642M975N895n663j1967n523J3684
$$ 15432 8092 1157 11932 13777 6215 14109 28751 33726 39621 33958 21991 16468 30152
11428C0152R163N63k121j7145j5737n684n72N125R234k540m813P851P992k341
$$ 30152 39315 39878 37757 20612 4875 -809 -1381 3744 12978 10438 5625 13476 21468 19127
11414A9127p290M731q73j103P876j857P137O4J442m983N31k591l872m582N579
$$ 19127 11837 16568 15695 14592 22468 20611 27748 27812 29254 24271 24802 22211 18339 13757 19336
11399A9336P734J2946K904n534j4062q160N080o515N625k364l580N519J5231J7755
$$ 19336 27070 40016 42920 37386 23324 15164 20244 13729 19354 16990 13410 18929 34160 51915
11385E1915Q528j845J186k388q374j4210j9398o620N147K565N745m88P81J1250
$$ 51915 60443 58598 59784 57396 49022 34812 15414 8794 13941 16506 22251 21763 22544 33794
11371C3794q8L211M141l214r088j2365q734k145J1354J0332p23K440j0260J0295
$$ 33794 33706 36917 41058 37844 28756 16391 7657 5512 16866 27198 26475 28915 18655 28950
11357B8950l865l82O134n501j267L236L309k107N850r272p798L720J3747l813
$$ 28950 25085 24703 30837 25336 24069 27305 30614 28507 34357 25085 17287 21007 34754 30941
11343C0941q484m798k973P309j0986k1503J3230J0992j1779k229J4655P354L517
$$ 30941 22457 17659 14686 21995 11009 -10494 2736 13728 1949 -280 14375 21729 25246
11330B5246Q141j0747N330k199o599J6084o53P469K581k2233j4776R526K507K680
$$ 25246 33387 22640 27970 25771 19172 35256 34603 42072 44653 22420 7644 17170 19677 22357
11316B2357P449N26o558K067P561J0837q031j2720M084J909k217N187k897l996
$$ 22357 29806 30332 23774 25841 33402 44239 36208 23488 27572 29481 27264 32451 29554 25558
11302B5558j389M082O300J1773J286j0811k9984l096R759o736o289r466J1326
$$ 25558 24169 28251 34551 46324 47610 36799 6815 3719 13478 6742 453 -9013 2313
11289B313R764N790J640o889q727J4758M798N409o419K622p40M91R055m280l539
$$ 2313 12077 17867 19507 12618 3891 18649 23447 28856 22437 25059 24319 24810 33865 29585 26046
11274B6046L401M681R796Q719R405j3087k3854k2003P411J6532O737J5989J3593
$$ 26046 29447 34128 43924 52643 62048 48961 25107 3104 10515 27047 33784 49773 63366
11261F3366J140k658j6315j8170N045K134R397N743l847j0643o475k470R343J975
$$ 63366 64506 61848 45533 27363 32408 34542 43939 49682 45835 35192 28717 26247 35590 37565
11247C7565J509j6734l726q478Q132R603L191J0861O490o377q031R958R363m033
$$ 37565 39074 22340 18614 10136 18268 27871 31062 41923 48413 42036 34005 43963 53326 49293
11233D9293j6305n42Q503K459M936l095K123k087o074N790q710k055L221K489
$$ 49293 32988 32446 40949 43408 48344 45249 47372 45285 39211 45001 36291 34236 37457 39946
11219C9946J3655K267j3442j8734j0276k624R304J0995k209J164P875r288n481
$$ 39946 53601 55868 42426 23692 13416 10792 20096 31091 28882 30046 37921 28633 23152
11206B3152j6989J889J9558K0790P438L441o224j236k909o396N07N59K145N528
$$ 23152 6163 8052 27610 48400 55838 59279 53055 51819 48910 42514 43021 43580 45725 51253
11192E1253M277j2539j0877K608Q179N683J1930L880r682j2988k354J1941J5514
$$ 51253 55530 42991 32114 34722 42901 48584 60514 64394 54712 41724 39370 51311 66825
11179F6825r0l140l950p231j6345p803M590N622Q239R583j7891j2873N750K640
$$ 66825 66735 63595 59645 52414 36069 28266 32856 38478 46717 56300 38409 25536 31286 33926
11165C3926m758j0520J428O851j001J9796r215R96P431M718K656L609r300j4959
$$ 33926 29168 18648 20076 26927 25926 45722 36507 37503 44934 49652 52308 55917 46617 31658
11151C1658J5802P418m219J857o850J3060L287j775p636P544o57o569J2567R571
$$ 31658 47460 54878 50659 52516 45666 58726 62013 60238 52602 60146 59489 52920 65487 75058
11137G5058r715j4717j8830p501K2642J9814R990K792j0649k7928k3767J2177
$$ 75058 65343 50626 31796 24295 46937 66751 76741 79533 68884 40956 17189 29366
11125B9366N160O295J0904j1959k068j699k307R167J006R55j0195p11P746K312
$$ 29366 34526 40821 51725 39766 37698 35999 33692 42859 43865 44820 34625 33914 41660 43972
11111D3972M428l093K656n748O249l4L614o274P180j206q845O368J003k132L673
$$ 43972 48400 45307 47963 42215 48464 48430 52044 45770 52950 51744 42899 49267 50270 48138 51811
11096E1811O045J252p297M184j4075L117J0558L706Q054p960o686q197M841M43
$$ 51811 57856 59108 51811 55995 41920 45037 55595 59301 67355 59395 52709 44512 49353 49796
11082D9796q215l997J345m463M539M042Q156J201O785J996n998M456K371N74K463
$$ 49796 41581 37584 38929 34466 39005 43047 51203 52404 59189 61185 55187 59643 62014 62588 65051
11067F5051o844M915M588q751R00O827j6946J0440O014J6878N141j5007q374m515
$$ 65051 58207 63122 67710 58959 59859 66686 49740 60180 66194 83072 88213 73206 64832 60317
11053F0317j6058o734J7257K854j0550l243J1759j0052j4655n353j884K688J2257
$$ 60317 44259 37525 54782 57636 47086 43843 55602 45550 30895 25542 23658 26346 38603
11040C8603K0330J5962J8263m552l698L933J254n519j1363o822n677j0057j245
$$ 38603 58933 74895 93158 88606 84908 88841 90095 84576 73213 66391 60714 50657 49412
11027D9412o431m546J0409k534J491J5226j4386j3529J773N079N673K373L050
$$ 49412 42981 38435 48844 46310 47801 63027 48641 35112 36885 41964 47637 50010 53060
11014E3060K722n487r757p67r59Q195O197Q142J3700N435p348Q470M974L052M649
$$ 53060 55782 50295 40538 39771 38812 47007 53204 61346 75046 80481 73133 81603 86577 89629 94278
10999I4278j6387j6022l984Q998J3931l250K314Jj0428j5156M546k746K018L2700
$$ 94278 77891 61869 57885 66883 80814 77564 79878 79879 69451 54295 58841 56095 58113 90813
10985I0813N877j183n262j1772m092O813M670p87l733j2270k573M571j211p641
$$ 90813 96690 95507 90245 78473 74381 81194 85864 85077 81344 69074 66501 71072 69861 62220
10971F2220k0667l251J6418L349o612L611K5488q046j3007J870J0777o897l255
$$ 62220 41553 38302 54720 58069 51457 55068 80556 72510 59503 61373 72150 65253 61998
10958F1998K936L875N481o733J1084L455j4373q731M007P031k831j720J951K5107
$$ 61998 64934 68809 74290 67557 78641 82096 67723 58992 62999 70030 67199 65479 67430 92537
10944I2537M613q748j2065J0349j4305p755j1366j4555J1145K3571Q764p723K07
$$ 92537 97150 88402 76337 86686 72381 64626 53260 38705 49850 73421 82185 74462 74669
10931G4669P410r231l246R675M263M278k48p109L215O07n145j2463O56J1966J7289
$$ 74669 82079 72848 69602 79277 83540 87818 87570 80461 83676 84283 79138 66675 67331 79297 96586
10916I6586k2463j426P501p134l256J5080L381j579N857P460j670j4388j2199
$$ 96586 74123 72697 80198 73064 69808 84888 88269 86690 92547 100007 98337 83949 71750
10903G1750R759j1236q327J1149J1465M692Q76m619N493K755k466q841q102k595
$$ 71750 81509 70273 61946 73095 84560 89252 90128 85509 91002 93757 91291 82450 74348 71753
10889G1753J461p08M93N088q711j0800o024J5820N730M910q12Q908Q917O911R652
$$ 71753 73214 72506 72999 78087 69376 58576 52552 68372 74102 79012 78200 87108 96025 102936 112588
10874A12588j220P219j1475p164r097j4814m578l702R440P681J3799J1784n116
$$ 112588 111368 118587 107112 99948 90851 76037 71459 67757 77197 84878 98677 110461 105345
10861A05345j9756j4262l35o157J3629R335J8587p794k414J1937q01j706K701
$$ 105345 85589 71327 70992 64835 78464 87799 106386 98592 96178 108115 107314 105608 108309
10848A08309K703J1373q151p08J2207L636o803L162j7189j7523J2713R396p13
$$ 108309 111012 122385 114234 113526 125733 129369 122566 125728 108539 91016 103729 113125 112412
10835A12412J6488O191j094j2864N22k735j2312N408o584j8746r190Q800J8769
$$ 112412 128900 135091 133997 121133 121655 118920 106608 112016 105432 86686 77496 86296 105065
10822A05065J125J3556J2079K0578l16j3292k918P077p673L311J2178N604j8124
$$ 105065 106190 119746 131825 152403 152087 138795 135877 142954 135281 138592 150770 156374 138250
10809A38250J790M717R900o629O522N347n270k2997P934K1200J120J70j0977j661
$$ 138250 140040 144757 154657 148028 154550 159897 154627 131630 139564 160764 161884 162054 151077 149416
10795A49416K941M232l909j0906m123Q087j2681P868l253J4635O306J6480J9580
$$ 149416 152357 156589 152680 141774 137651 145738 133057 140925 137672 152307 158613 175093 194673
10782A94673m935j8151K8J6268J090r670R66n50j193j914m386j4512j308J0097
$$ 194673 189738 171587 171615 187883 188973 179303 180269 179719 178526 176612 172226 157714 156406 166503
10768A66503K560j774l84Q871O724k188J171j9270r135L317J0072o943L060K941
$$ 166503 169063 167289 166905 175776 182500 180312 181483 162213 153078 156395 166467 159524 162584 165525
10754A65525J0760P559O723P098o935j1998j3227l428j523q25j605J0458q454
$$ 165525 176285 183844 190567 197665 190730 178732 165505 162077 160554 159729 158124 168582 160128
10741A60128k979k175L065R83J3280K883m635q929o041o087Q217k587k977p101
$$ 160128 157149 154974 158039 159022 172302 175185 170550 161621 155580 149493 157710 155123 152146 145045
10727A45045O876P687O665J0494j2164q922N460l374p372M860J688J3561L3160
$$ 145045 151921 159608 166273 176767 164603 155681 161141 157767 150395 155255 156943 170504 203664
10714B03664l490j0853Q342L767j435P18q121m660J975r535n267l17K347P968
$$ 203664 200174 189321 197663 201430 199995 200713 192592 187932 189907 180372 175105 174788 177135 185103
10700A85103m640p250o31p263O972M144j1659J8084P220R15N220n720K5115P962
$$ 185103 180463 173213 172582 165319 172291 176435 164776 182860 190080 190995 196215 190495 215610 223572
10686B23572p600j368J1516J9675K1582L0824K7292K0162K1059J2792J8917N036
$$ 223572 215972 214604 226120 245795 267377 298201 325493 345655 366714 379506 398423 403459
10674D03459k9187m1565k8218k1142l6472k4707q193M322N245J722k571J3177
$$ 403459 374272 332707 304489 283347 246875 222168 213975 218297 223542 225264 222693 235870
10662B35870L136J1364P719j086m623J6512M295N651J0861L3999K9832J5715J7473
$$ 235870 239006 250370 258089 257003 252380 268892 273187 278838 289699 323698 353530 369245 386718
10649C86718O43p821P074q425j9462j1351j4028k1227r863J357p565k08j8621
$$ 386718 387361 379540 386614 378189 358727 347376 333348 312121 302258 303615 296050 295842 277221
10636B77221o567K912J0151j3988k6861K278K7053M579J3989J2257j4464k1631
$$ 277221 270654 273566 283717 269729 242868 245146 272199 276778 290767 303024 288560 266929
10624B66929k7626N145K0655k954K008n304J7518Q275K1081N98O088j1134O479
$$ 266929 239303 244448 265103 262149 264157 258853 276371 284646 305727 306325 312413 301279 307758
10611C07758Q747K208k780j1014R889n275l2355k4376j2585J5333R005l903P887
$$ 307758 316505 318713 315933 304919 314808 309533 277178 252802 240217 255550 264555 260652 268539
10598B68539J3745J1873K121j410j0147j8483j1243l91j0107j5188Q669J1813
$$ 268539 282284 294157 296278 294868 284721 266238 254995 254604 244497 229309 237978 249791
10586B49791K4549J2908L878J844p912P438L083K0925p655j509j2149J8965L0465
$$ 249791 274340 287248 291126 292970 285058 292496 295579 316504 308849 307340 295191 314156 344621
10573C44621K7106j372J3670J7150J6733J6336L0651J4996J4379J5407O108j1074
$$ 344621 371727 370355 384025 401175 417908 434244 464895 479891 494270 509677 515785 504711
10561E04711k6111k1420k8216j5925j3225j4188k8999k0685j075J1566j905J757
$$ 504711 478600 457180 428964 413039 399814 385626 356627 335942 334867 346433 344528 346285
10549C46285J1684N234K6303K425N226J4759K4818K2912L3836J7764K9878L7345
$$ 346285 357969 363203 389506 391931 397157 411916 436734 459646 493482 511246 541124 578469
10537E78469P163O223j0753j4320l2847k9334k7639l3084m797p031Q259N340R192
$$ 578469 585632 591855 581102 566782 533935 504601 476962 443878 439081 432050 440309 445649 454841
10524D54841P867R62q689k695P925J9758K4792L7246L2399J3525J6399J6128J6374
$$ 454841 462708 463670 454981 452286 460211 479969 504761 542007 574406 587931 604330 620458 636832
10511F36832K7106K3995L9334M6149L8247J5401J6464L5348L1819L1901N6581
$$ 636832 663938 687933 727267 773416 811663 827064 843528 878876 910695 942596 999177
10500I99177L3969L4698L1583J5013J1903O233J4769j3360L29J307L679k362j2320
$$ 999177 1033146 1067844 1099427 1114440 1126343 1132576 1147345 1133985 1134314 1135621 1139300 1136938 1124618
10487A124618k0400k8996k5377k9985n7490n6106l6469j8040l3379o248j3517
$$ 1124618 1104218 1075222 1049845 1019860 962370 906264 869795 851755 818376 812128 798611
10476G98611j7227k7487l6036q760j0374n969p799k7J0779L5065K5522J5018Q174
$$ 798611 781384 753897 717861 709101 698727 692758 684959 684932 695711 730776 756298 771316 779490
10463G79490N028L603J5982K4886R371K2748K2668k25q558l833j2644k5480j6324
$$ 779490 784518 788121 804103 828989 838360 861108 883776 883551 874993 871160 858516 833036 816712
10450H16712j4868j9697m680n896k7501l1001k7517l5378j7630j406k6211j5838
$$ 816712 801844 782147 777467 771571 744070 713069 685552 650174 632544 631138 604927 589089
10438E89089O228l137o945p707j1860Q513O586Q050j3593N191J7787Q863J0416
$$ 589089 595317 592180 585235 577528 565668 574181 580767 588817 575224 580415 598202 607065 617481
10425F17481J3730J6947L87J2900J3213J2830K8623J7695J2824K4826J622Q222
$$ 617481 631211 648158 648545 661445 674658 687488 716111 733806 746630 771456 773078 781300
10413G81300m462L040R299N359J7267J2939K5604O754n140K0952J9554K0642J1392
$$ 781300 776838 779878 789177 794536 811803 824742 850346 857100 851960 872912 892466 913108 924500
10400I24500M0225L7918M3086M4480L8361N7534P3590Q1415P6323P7028Q7405
$$ 924500 964725 1002643 1045729 1090209 1128570 1186104 1259694 1341109 1417432 1494460 1581865
10389A581865J05351J20901J05017J09948J11604J03869J25477J34768J40765
$$ 1581865 1687216 1808117 1913134 2023082 2134686 2238555 2364032 2498800 2639565
10380B639565J38031J28923J23343J19969J42550J38509J33254J64023J73498
$$ 2639565 2777596 2906519 3029862 3149831 3292381 3430890 3564144 3728167 3901665
10371C901665J80459J64168J28355J03381L8076J2663J2288P258k8851o4142p9793
$$ 3901665 4082124 4246292 4374647 4478028 4516104 4528767 4541055 4548313 4519462 4455320 4375527
10360D375527j02450r8249o6316l3345M680N5820R2642J20641J47009J60897J64015
$$ 4375527 4273077 4174828 4108512 4075167 4079847 4135667 4228309 4348950 4495959 4656856 4820871
10349D820871J50878J17997Q5861M5464L8437L2157m795m3834m7960n4223n1268
$$ 4820871 4971749 5089746 5175607 5221071 5259508 5291665 5286870 5243036 5195076 5140853 5089585
10338E089585l8440n7954j05598j29762j59091j84214j81139k10522k29803k26455
$$ 5089585 5051145 4993191 4887593 4757831 4598740 4414526 4233387 4022865 3793062 3566607
10328C566607k09140j85834j35908o8857l1762J0836M2146O9206O7050O6951L6459
$$ 3566607 3357467 3171633 3035725 2966868 2935106 2945942 2988088 3057294 3124344 3191295 3227754
10317C227754J0972Q125k6438m8375q5260j02705j45871j84099j73920j35846
$$ 3227754 3238726 3246851 3220413 3172038 3086778 2984073 2838202 2654103 2480183 2344337
10307B344337q7347n6514l0248O423M369O93J7816K8602J8963m675o456P966J5902
$$ 2344337 2256990 2200476 2170228 2176651 2181020 2181713 2199529 2228131 2247094 2242419 2235963 2243929 2259831
10294B259831K390J622K3568L9423L2112K1333N6574O2252O8443Q5440R5108J09037
$$ 2259831 2262221 2263843 2287411 2326834 2358946 2380279 2436853 2499105 2567548 2652988 2748096 2857133
10282B857133J34854J19041J07512J26091J62899J73500J86036K25119K17479
$$ 2857133 2991987 3111028 3218540 3344631 3507530 3681030 3867066 4092185 4309664
10273D309664K06615K54297K91661L34903L74413M42502N29827N87550O54444
$$ 4309664 4516279 4770576 5062237 5397140 5771553 6214055 6743882 7331432 7985876
10264G985876P71727R07591J127125J433220J799607K202802K619448L015134
$$ 7985876 8757603 9665194 10792319 12225539 14025146 16227948 18847396 21862530
10256B1862530L231635L100869K598598J825334Q62812j94418j164572j878999
$$ 21862530 25094165 28195034 30793632 32618966 33481778 33287360 32122788 30243789
10248C0243789k352742k503616k381916k156428j944007j788698j495816j133336
$$ 30243789 27891047 25387431 23005515 20849087 18905080 17116382 15620566 14487230
10240A4487230p35996l58191l1929K70998N45643Q34517J172082J551694J979551
$$ 14487230 13751234 13393043 13361114 13632112 14177755 15012272 16184354 17736048 19715599
10231A9715599K461358K928394L247256L300151K936243K288869J554691O84709
$$ 19715599 22176957 25105351 28352607 31652758 34589001 36877870 38432561 39117270
10223C9117270l26778j377006k279328k906019l352923l573080l439182l000415
$$ 39117270 38790492 37413486 35134158 32228139 28875216 25302136 21862954 18862539
10215A8862539k458282j976973j587043j285493j056338q53070o92642n59501
$$ 18862539 16404257 14427284 12840241 11554748 10498410 9645340 8952698 8393197
10207H393197m16300l00531k25561j74646j23402j26670j08128j23250j29934
$$ 8393197 7976897 7676366 7450805 7276159 7152757 7026087 6917959 6794709 6664775
10198F664775j75029k39188k87738l33954l23803k74824k11007j24321n8418l2784
$$ 6664775 6489746 6250558 5962820 5628866 5305063 5030239 4819232 4694911 4636493 4603709
10188D603709p014k2104m1144o5380p4416q5987q1040p1848l8224j2845K325K4614
$$ 4603709 4596695 4574591 4533447 4468067 4393651 4307664 4226624 4154776 4116552 4103707 4106032 4130646
10176D130646L7451O6115R7675J10805J31635J48223J75117K09919K26830K22063
$$ 4130646 4168097 4234212 4331887 4442692 4574327 4722550 4897667 5107586 5334416 5556479
10166E556479K11286J77984J43380J26877J42491J71105K20966K78276L60895
$$ 5556479 5767765 5945749 6089129 6216006 6358497 6529602 6750568 7028844 7389739
10157G389739M05392M18802M80242N50322O55393P82132R67235J228056J537897
$$ 7389739 7795131 8213933 8694175 9244497 9899890 10682022 11649257 12877313 14415210
10148A4415210J955309K488913L109092L771809M373862M702091M497211L639423
$$ 14415210 16370519 18859432 21968524 25740333 30114195 34816286 39313497 42952920
10140D2952920K293042P47235q61462k300188l273161l640202l520978l087812
$$ 42952920 45245962 45993197 45131735 42831547 39558386 35918184 32397206 29309394
10132B9309394k432748j662898r63073l70752O1849L02300L33471K70157J25672
$$ 29309394 26876646 25213748 24250675 23879923 23941772 24244072 24577543 24847700 24973372
10123B4973372k8396k2599K07264O43310J145523J540622J847440K256337K798413
$$ 24973372 24944976 24922377 25129641 25772951 26918474 28459096 30306536 32562873 35361286
10114C5361286L377386L759195L868366L576917K778725J406033l49294k075330
$$ 35361286 38738672 42497867 46366233 49943150 52721875 54127908 53778614 51703284
10106E1703284l547573m673399n220018n076080m520689l860315l187433k549988
$$ 51703284 48155711 43482312 38262294 33186214 28665525 24805210 21617777 19067789
10098A9067789k011112j593470j292710j077046r25829p97233o93303o01702n26556
$$ 19067789 17056677 15463207 14170497 13093451 12167622 11370389 10677086 10075384 9548828
10089I548828m36935l53113k59221j88552j14439k3308J9903O4270Q4629Q3921
$$ 9548828 9111893 8758780 8499559 8311007 8196568 8173260 8193163 8257433 8342062 8425983
10079H425983Q0594O4910Q7867J22485J57705K02156K30925K63422L15938L51540
$$ 8425983 8506577 8571487 8659354 8781839 8939544 9141700 9372625 9636047 9951985 10303525
10069A0303525L79072M14922M53899M73997N27981N76293O04499O73377P51550
$$ 10303525 10682597 11097519 11551418 12025415 12553396 13129689 13734188 14407565 15159115
10060A5159115Q86672J064540J287920J534454J817527K089115K326224K544656
$$ 15159115 16045787 17110327 18398247 19932701 21750228 23839343 26165567 28710223
10052B8710223K731607K912728L128702L354339L592274L805546L976953M042234
$$ 28710223 31441830 34354558 37483260 40837599 44429873 48235419 52212372 56254606
10044E6254606L994256L823467L594576L344500L118630K896739K719429K535745
$$ 56254606 60248862 64072329 67666905 71011405 74130035 77026774 79746203 82281948
10036H2281948K317714K010291J583436J038688M17918k17329q21158j400134
$$ 82281948 84599662 86609953 88193389 89232077 89649995 89432666 88611508 87211374
10028H7211374j869725k321952k767307l133388l478616l832611m090346m207215
$$ 87211374 85341649 83019697 80252390 77119002 73640386 69807775 65717429 61510214
10020F1510214m203002m099792l944495l749902l531472l356456l222368l124069
$$ 61510214 57307212 53207420 49262925 45513023 41981551 38625095 35402727 32278658
10012C2278658l002729k849841k650618k351443k030233j728922j432601j177988
$$ 32278658 29275929 26426088 23775470 21424027 19393794 17664872 16232271 15054283
10004A5054283r83550q28702p14267o16387n21643m47241l92122l47460l17197
$$ 15054283 14070733 13242031 12527764 11911377 11389734 10942493 10550371 10202911 9885714
9995I885714k80399k58120k34382k22453j86552j50935j14158o2096J1376M3764
$$ 9885714 9605315 9347195 9112813 8890360 8703808 8552873 8438715 8376619 8387995 8431759
9985H431759N2912M8726J6942j6098o7131j16604j33498j56209j63094j52378
$$ 8431759 8484671 8533397 8550339 8534241 8467110 8350506 8217008 8060799 7897705 7745327
9975G745327j25421j12470r1099m9735l2877l4794k911L4998N9557J04917J42216
$$ 7745327 7619906 7507436 7416337 7366602 7333725 7298931 7296020 7331018 7390575 7495492 7637708
9964G637708J88035K44988L04381L60786M07448M46688N12226N71434O15199O18404
$$ 7637708 7825743 8070731 8375112 8735898 9143346 9590034 10102260 10673694 11288893 11907297
9954A1907297O20575N71898N52650N54119N45969N71289O43864P47445R13793
$$ 11907297 12527872 13099770 13652420 14206539 14752508 15323797 15967661 16715106 17628899
9945A7628899J147363J389747J613439J760441J906675J981528K079801K194608
$$ 17628899 18776262 20166009 21779448 23539889 25446564 27428092 29507893 31702501
9937C1702501K376186K648354K962259L373013L903854M547746N214686N482672
$$ 31702501 34078687 36727041 39689300 43062313 46966167 51513913 56728599 62211271
9929F2211271N031761L735310J937734L37210n94648p50888l08881L27005P75858
$$ 62211271 67243032 70978342 72916076 73253286 72658638 71907750 71598869 71925874 72701732
9920G2701732Q78872O35538K99114M239l03541n97404r09967j266541j559027
$$ 72701732 73580604 74216142 74515256 74519495 74215954 73618550 72708583 71442042 69883015
9911F9883015j640405j427718j021327n76509k03093J86612P35436J485444K285137
$$ 69883015 68242610 66814892 65793565 65217056 65013963 65200575 65936011 67421455 69706592
9902F9706592L007520L411044L424563L014516K314146J425963K36705j293592
$$ 69706592 72714112 76125156 79549719 82564235 84878381 86304344 86541049 85247457
9894H5247457k735841l551284l519364k801830j754186p58735j89925k52836j001163
$$ 85247457 82511616 78960332 75440968 72639138 70884952 70126217 69936292 69683456 68682293
9885F8682293k163694l346236m259916m709206m652929m230413l553485k769018
$$ 68682293 66518599 63172363 58912447 54203241 49550312 45319899 41766414 38997396
9877C8997396k004572j337295q03735l42895N9526M22283P29071R20316R57940
$$ 38997396 36992824 35655529 34851794 34508899 34568425 34990708 35719779 36640095 37598035
9868C7598035Q68796O74875M16632K53114K04824J72663J6889l14875o04397p36763
$$ 37598035 38466831 39141706 39558338 39811452 40016276 40188939 40205828 39890953 39286556 38549793
9858C8549793p20551n26657l29678l11631n98385j034680j246276j106211p82910
$$ 38549793 37829242 37302585 36972907 36661276 36062891 35028211 33781935 32675724 31892814
9849C1892814n14380m11187l90999l57590k58655j16750J09158K96555L24949
$$ 31892814 31378434 30967247 30576248 30218658 29960003 29843253 29952411 30248966 30573915
9840C0573915J81572L0247m3792o4670r361Q1020Q4388r9615l42039m71501m89152
$$ 30573915 30755487 30785734 30741942 30677272 30667911 30748931 30833319 30733704 30391665 29920164 29431012
9829B9431012m31114l26189l04182m94164q29899j120544j175315j011298q24733
$$ 29431012 28999898 28673709 28369527 27875363 27045464 25924920 24749605 23738307 22913574
9820B2913574p67155q97471j045461j150582j217632j190341j134155j104949
$$ 22913574 22146419 21248948 20203487 19052905 17835273 16644932 15510777 14405828
9812A4405828j182818j258020j235610j066572q63409p22790o13753n10361m12569
$$ 14405828 13223010 11964990 10729380 9662808 8799399 8076609 7462856 6952495 6539926
9803F539926l44544k81523k23004j86075j41282r9050o3624m9674l6230m6884
$$ 6539926 6195382 5913859 5690855 5504780 5363498 5264448 5200824 5151150 5114920 5068036
9793E068036o5700o3983l4450l8507q6304q5214r9339q0978m8146k0832j5184
$$ 5068036 5002336 4938353 4903903 4865396 4779092 4693878 4594539 4513561 4465415 4444583 4429399
9782D429399n0592o6672q3782o0938l0515j2048l4810o4775o1952o9818m7703
$$ 4429399 4378807 4312135 4228353 4167415 4136900 4124852 4090042 4025267 3963315 3893497 3845794
9771C845794k2224l0736l9468m6338m2911k1109K664N306J2551O902K2729j4602
$$ 3845794 3823570 3792834 3753366 3707028 3664117 3643008 3645672 3650978 3663529 3670431 3693160 3678558
9759C678558l1143L558j0464p58K3970L6369K4212K6443L277p680K7772K9150
$$ 3678558 3647415 3650973 3640509 3639751 3663721 3700090 3724302 3750745 3754022 3746342 3774114 3803264
9747C803264m685r907P698M576M230K6128M6619N4166O4919R0383J13494J21934
$$ 3803264 3798579 3788672 3796370 3800946 3805176 3831304 3877923 3932089 3997008 4087391 4200885 4322819
9735D322819J26466J05034Q4603O5388L5710N9854P4306P3409J06795J09356J24651
$$ 4322819 4449285 4554319 4638922 4704310 4740020 4799874 4874180 4947589 5054384 5163740 5288391
9724E288391J47402J65306J56289J58517J94922K68825L21805L30862K79022K45500
$$ 5288391 5435793 5601099 5757388 5915905 6110827 6379652 6701457 7032319 7311341 7556841
9714G556841K12578K50317K46935K76625L22693L32071L50896L69151M07065M54250
$$ 7556841 7769419 8019736 8266671 8543296 8865989 9198060 9548956 9918107 10325172 10779422
9704A0779422N39677O68343Q30077J045622J353828J720178K189714K732528L335614
$$ 10779422 11319099 11987442 12817519 13863141 15216969 16937147 19126861 21859389 25195003
9695B5195003L891747M212814M088035L398588K390196J647182J486429J702056
$$ 25195003 29086750 33299564 37387599 40786187 43176383 44823565 46309994 48012050
9687D8012050J611222P42238q22491k383438l228000l192550k765598k472331
$$ 48012050 49623272 50365510 49543019 47159581 43931581 40739031 37973433 35501102
9679C5501102k402926k355804k083506j574207r62859l72334J22999M41839N71002
$$ 35501102 33098176 30742372 28658866 27084659 26121800 25749466 25872465 26314304 26885306
9670B6885306N38299M42481L72760M12415N78165Q31670J117810J339470J498849
$$ 26885306 27423605 27866086 28238846 28651261 29229426 30061096 31178906 32518376 34017225
9661C4017225J664467J804028J694104J089163M0667r89035j559962j635665j558720
$$ 34017225 35681692 37485720 39179824 40268987 40309654 39320619 37760657 36124992 34566272
9652C4566272j766071k409636l138427l472232l263567k703744k082014j564803
$$ 34566272 32800201 30390565 27252138 23779906 20516339 17812595 15730581 14165778
9644A4165778j183174r10545p32722o51608n93412n55263m94371m14640l64500
$$ 14165778 12982604 12072059 11339337 10687729 10094317 9539054 9044683 8630043 8265543
9635H265543l44861l47090l55554l15023k72298k11389j76315j36820q5880p0603
$$ 8265543 7920682 7573592 7218038 6903015 6630717 6419328 6243013 6106193 6020313 5949710
9625E949710o8408l5363M873J4299P2910J32416J70496K28118K82471K96813K71793
$$ 5949710 5881302 5845939 5850812 5865111 5938021 6070437 6240933 6469051 6751522 7048335 7320128
9614G320128K40447J76416J26326P5200N0824L8657M7503L8005K3946K4446J8880
$$ 7320128 7560575 7736991 7863317 7938517 7989341 8027998 8075501 8113506 8137452 8161898 8180778
9603H180778L3396O5356P2767Q7792J05522J07189J54820K19154K72973L31284
$$ 8180778 8214174 8279530 8352297 8440089 8545611 8652800 8807620 9026774 9299747 9631031
9593I631031L76053M17941N10350O05019O56860P37627P91006Q48816R75803J167496
$$ 9631031 10007084 10425025 10935375 11540394 12197254 12934881 13725887 14574703 15550506 16718002
9583A6718002J438498J798647K159528K396765K401425K068314J551904J192795
$$ 16718002 18156500 19955147 22114675 24511440 26912865 28981179 30533083 31725878
9575C1725878J201884J428280J435762R08538q7607j098107j702289j812718j734398
$$ 31725878 32927762 34356042 35791804 36700342 36612735 35514628 33812339 31999621 30265223
9566C0265223j736371j928274k157421k154340j872175j447162j022179o64916
$$ 30265223 28528852 26600578 24443157 22288817 20416642 18969480 17947301 17282385
9558A7282385l04065N6675M21704P42471J044631J274460J391160J401322J373851
$$ 17282385 16978320 17034995 17456699 18199170 19243801 20518261 21909421 23310743 24684594
9549B4684594J354600J374424J450304J476733J167503M82164m27096j156104
$$ 24684594 26039194 27413618 28863922 30340655 31508158 31990322 31563226 30407122
9541C0407122j445894j371680j218317j226755j440103j600714j489814j128340
$$ 30407122 28961228 27589548 26371231 25144476 23704373 22103659 20613845 19485505
9533A9485505p26377m30542l68644n14644p79210j063798j285198j370194j294014
$$ 19485505 18759128 18328586 17959942 17445298 16666088 15602290 14317092 12946898 11652884
9524A1652884j077110q58767o61554m55061k93527j32610o3668k6167M1861Q9904
$$ 11652884 10575774 9717007 9055453 8600392 8306865 8174255 8110587 8084420 8126281 8216185
9514H216185P8310Q5179J23738J36070J41252J32083J28752J27881J02292M6857
$$ 8216185 8294495 8379674 8503412 8639482 8780734 8912817 9041569 9169450 9271742 9318599
9504I318599k1965q5003j57117j93251k35855k68242k92462k90429l11569l26457
$$ 9318599 9296634 9211631 9054514 8861263 8625408 8357166 8064704 7774275 7462706 7136249
9494G136249l26954l51676l15960l33199l24095k91980k52835k58131k31137k11478
$$ 7136249 6809295 6457619 6141659 5808460 5484365 5192385 4939550 4681419 4450282 4238804
9484D238804j84133j55890j18728j06400o3275k6413o296J7249L6805P2325J02434
$$ 4238804 4054671 3898781 3780053 3673653 3610378 3583965 3577669 3594918 3631723 3704048 3806482
9473C806482J30392J13438R2264J02131R2318N2585M7575J9883l7277p9202j09282
$$ 3806482 3936874 4050312 4142576 4244707 4337025 4389610 4437185 4457068 4419791 4340589 4231307
9462D231307j28497j32857j20906r3259q3496p7328r4771o1985k7007p307p24
$$ 4231307 4102810 3969953 3849047 3755788 3672292 3594964 3500193 3438208 3411201 3403894 3403170
9451C403170J2327L1552K0594L2476M8810M2572M4865K8648L4763O58N892J2313
$$ 3403170 3415497 3447049 3467643 3500119 3548929 3591501 3636366 3665014 3699777 3700435 3706327 3718640
9439C718640K0724J2976j1832k0397M42R857K6583L1446M0367P7294J22444J40182
$$ 3718640 3739364 3752340 3740508 3720111 3720553 3730410 3756993 3788439 3828806 3906100 4028544 4168726
9427D168726J51370J83503K23716K83471L52807M48627N54562O27116O88689P16265
$$ 4168726 4320096 4503599 4727315 5010786 5363593 5812220 6366782 6993898 7682587 8398852
9417H398852O51596N09798K54244o8635l97291o40729p94016q52523q34056p38519
$$ 8398852 9050448 9560246 9814490 9745855 9348564 8707835 7913819 7061296 6227240 5488721
9407E488721o00899m47639l44287k44365j98405j59309j05659p0016n5353l3883
$$ 5488721 4887822 4440183 4095896 3851531 3653126 3493817 3388158 3318142 3262789 3228906
9397C228906l9582k2512L427k5527J168q598m6176m9359j06600r4537j00528p6293
$$ 3228906 3189324 3166812 3170239 3144712 3145880 3137282 3091106 3041747 2935147 2840610 2740082 2663789
9385B663789n8820l4793m6482l4992r915m261j2340M614N705R062L5189M5763
$$ 2663789 2604969 2570176 2523694 2488702 2478787 2474526 2462186 2466800 2472505 2481567 2516756 2562519
9373B562519N4890L2156J5721Q858j1909p548J4694K8628N2996N5458N3735O3430
$$ 2562519 2617409 2649565 2665286 2674144 2662235 2654687 2669381 2698009 2751005 2806463 2860198 2923628
9361B923628N6823M1728m879o0095q7076j00991p5151n7635m1176j3257K736K2634
$$ 2923628 2980451 3022179 3017300 2957205 2870129 2769138 2693987 2636352 2595176 2581919 2584655 2607289
9349B607289L7060J4326J691l303j4473l5761n5999n8171k9583M963K5576J7925
$$ 2607289 2644349 2658675 2660366 2657063 2642590 2606829 2550830 2492659 2463076 2468039 2493615 2511540
9337B511540K3641L8907M8777L6598L7457K2045Q043j0548r525j9456j6104Q39
$$ 2511540 2535181 2574088 2622865 2659463 2696920 2718965 2727008 2716460 2706935 2687479 2671375 2672214
9325B672214J4026k376R971M2734O7665J00189J37412J74230K01082K37841K68526
$$ 2672214 2686240 2683864 2693835 2736569 2804234 2904423 3041835 3216065 3417147 3654988 3923514
9314C923514K53241K46037K15656J84896J49172J14695P4256K4034n407l5974
$$ 3923514 4176755 4422792 4638448 4823344 4972516 5087211 5161467 5185501 5180094 5144120
9304E144120q8649j14760j32037j37725j16601r2611m9881J3964K9782L9272L3712
$$ 5144120 5055471 4940711 4808674 4670949 4554348 4461737 4411856 4425820 4455602 4494874 4528586
9293D528586R608L7388O0258J01870J24060R2152Q7611P6720P2719O7890N1162
$$ 4528586 4538194 4575582 4635840 4737710 4861770 4953922 5041533 5118253 5190972 5258862 5310024
9282E310024L2424M308j7180k6142J4107L9225K7711j4465m0612r5093j07034
$$ 5310024 5342448 5346756 5329576 5303434 5317541 5356766 5384477 5370012 5329400 5234307 5127273
9271E127273r3552n4303k9508p268J7673N2245O8932Q1002J13451J23742J25293
$$ 5127273 5033721 4979418 4949910 4942642 4960315 5012560 5081492 5162494 5275945 5399687 5524980
9260E524980J28476J15731J30980J38451J36456J22511Q9870N8300K5703J5744
$$ 5524980 5653456 5769187 5900167 6038618 6175074 6297585 6387455 6445755 6471458 6487202
9250F487202L2553M1261M0866M6397N0181N2587O1363M9971K9448L92l602o903
$$ 6487202 6519755 6561016 6601882 6648279 6698460 6751047 6812410 6862381 6891829 6892221 6888619 6881716
9238F881716K258K6776O8793J12805J35240J24280J33979J22811R6086P1178P1177
$$ 6881716 6883974 6910750 6979543 7092348 7227588 7351868 7485847 7608658 7704744 7775922 7847099
9227G847099M9238M3859O9117J02198R2887P4785O0860L5339K6128K3512N6172
$$ 7847099 7896337 7940196 8009313 8111511 8204398 8279183 8340043 8375382 8401510 8425022 8481194
9216H481194P1711N0385J8792K4343P478k9125j22840j94697k07835j77172j88748
$$ 8481194 8552905 8603290 8622082 8646425 8653903 8624778 8501938 8307241 8099406 7922234 7733486
9205G733486k34524l01439l17338l02838k70119k59669k61228k62905k39171k01610
$$ 7733486 7498962 7197523 6880185 6577347 6307228 6047559 5786331 5523426 5284255 5082645
9195E082645j74490j32496j13956q3688q3230m6056m5269l3997j8767q294J654
$$ 5082645 4908155 4775659 4661703 4578015 4494785 4448729 4403460 4369463 4350696 4342402 4344056
9184D344056J270k847k0477j1009M18L9452P6816Q7614Q3349O2936N6618M5993
$$ 4344056 4345326 4342479 4322002 4310993 4311411 4350863 4427679 4515293 4598642 4661578 4718196 4764189
9172D764189M2676P0266J18964J63083J71093J77100J79711K05832K46148K66013
$$ 4764189 4806865 4877131 4996095 5159178 5330271 5507371 5687082 5892914 6139062 6405075
9162F405075K48743K43573K45780K83302K90064K61373J85918J16924J18679J33009
$$ 6405075 6653818 6897391 7143171 7426473 7716537 7977910 8163828 8280752 8399431 8532440
9152H532440J47023J41643J22977L9840l3962j31578k05998k07716j76794j17591
$$ 8532440 8679463 8821106 8944083 8983923 8949961 8818383 8612385 8404669 8227875 8110284
9142H110284m1971L7812N6269P7943L8342n7267j54557j94490j82115j27287n0272
$$ 8110284 8068313 8106125 8162394 8240337 8278679 8221412 8066855 7872365 7690250 7562963 7512691
9131G512691K4609J05291J50168J60519J75318J85645J67135J49543J86403K13779
$$ 7512691 7537300 7642591 7792759 7953278 8128596 8314241 8481376 8630919 8817322 9031101
9121I031101K01157J80141J61734J48012J05636N0514P5705J17507J69127K26273
$$ 9031101 9232258 9412399 9574133 9722145 9827781 9878295 9954000 10071507 10240634 10466907
9111A0466907L23294M61058N78775P33616R04509J081657J269873J392752J452063
$$ 10466907 10790201 11251259 11830034 12563650 13468159 14549816 15819689 17212441 18664504
9102A8664504J401790J291541J185382J201441J385953J717721K107481K515907
$$ 18664504 20066294 21357835 22543217 23744658 25130611 26848332 28955813 31471720
9094C1471720K865897L038110K988868K716595K359407J964375J604689J421216
$$ 31471720 34337617 37375727 40364595 43081190 45440597 47404972 49009661 50430877
9086E0430877J442489J699257K199456K771942L141148K978291K220417J010024
$$ 50430877 51873366 53572623 55772079 58544021 61685169 64663460 66883877 67893901
9078F7893901l37200j583269k585625l234373l512722l436442l040742k547626
$$ 67893901 67556701 65973432 63387807 60153434 56640712 53204270 50163528 47615902
9070D7615902k222227k160849k311432k634502k954242l135678l096791k828066
$$ 47615902 45393675 43232826 40921394 38286892 35332650 32196972 29100181 26272115
9062B6272115k451808k015346j606621j273572r54358p03308n12216l36754j96942
$$ 26272115 23820307 21804961 20198340 18924768 17970410 17267102 16754886 16418132 16221190
9053A6221190q9446J0513J28196K50148L76257N87040P79389R78306J241607J513671
$$ 16221190 16131744 16142257 16270453 16520601 16896858 17483898 18263287 19241593 20483200 21996871
9043B1996871J828724K163009K529245K881639L150413L333845L365894L187860
$$ 21996871 23825595 25988604 28517849 31399488 34549901 37883746 41249640 44437500
9035D4437500K882182K625573K436939K441055K676506L076095L494716L660358
$$ 44437500 47319682 49945255 52382194 54823249 57499755 60575850 64070566 67730924
9027F7730924L340489K409526R99090l31198j154618j556316j791428k075896
$$ 67730924 71071413 73480939 74480029 74148831 72994213 71437897 69646469 67570573
9019F7570573k307324k477693k694326k889398k888692k549595j940738j279597
$$ 67570573 65263249 62785556 60091230 57201832 54313140 51763545 49822807 48543210
9011D8543210p38450m68589n78503r32079j404913j830643k056655k016074j748721
$$ 48543210 47804760 47336171 46757668 45825589 44420676 42590033 40533378 38517304 36768583
9002C6768583j348887q82620m66221q1603K80407N98611R56957J374346J827299
$$ 36768583 35419696 34537076 34070855 33989252 34269659 34868270 35825227 37199573 39026872
8993C9026872K222175K558507K740770K620655K215707J492240N17387m66990
$$ 39026872 41249047 43807554 46548324 49168979 51384686 52876926 53394313 52927323
8985E2927323j263527j801317k024226j929495j675823j392516j269613j397794
$$ 52927323 51663796 49862479 47838253 45908758 44232935 42840419 41570806 40173012
8977D0173012j805455k329259k811782l128475l248913l139694k834963k438067
$$ 40173012 38367557 36038298 33226516 30098041 26849128 23709434 20874471 18436404
8969A8436404j999111j592258j292696j047463q36552p07186n90626m73710l61494
$$ 18436404 16437293 14845035 13552339 12504876 11668324 10961138 10370512 9896802 9535308
8960I535308k81143k46519j76307j19857o1074R094R9227K07633L17910M64219
$$ 9535308 9254165 9007646 8831339 8711482 8650408 8659502 8758729 8966362 9284272 9748491
8950I748491O53653Q67936J071508J270196J385822J405015J274901R59348N48363
$$ 9748491 10402144 11270080 12341588 13611784 14997606 16402621 17677522 18636870 19185233
8941A9185233Q6300k98440n41277n75551m51119k27773n1121P344r9403l57179
$$ 19185233 19271533 18973093 18431816 17856265 17405146 17177373 17126252 17133596 17034193 16677014
8931A6677014o83470j021906j294048j408579j391723j266299j078899q63704
$$ 16677014 15993544 14971638 13677590 12269011 10877288 9610989 8532090 7668386
8923G668386p10348n91969m72978l82762l20608k63278k26822j88121j57900j48063
$$ 7668386 6958038 6366069 5893091 5510329 5189721 4926443 4699621 4511500 4353600 4205537
8913D205537j79032j73279j47950j38329j44987j11591q8386r1936n5678p6877
$$ 4205537 4026505 3853226 3705276 3566947 3421960 3310369 3221983 3130047 3074369 2997492
8903B997492p7828r1357r8420r3928o6799n3517m7373m3348l3837l2036l2060
$$ 2997492 2919664 2828307 2729887 2635959 2569160 2515643 2468270 2424922 2391085 2359049 2326989
8892B326989l6504m2475m6898k8014k9452j3245O194J5188R481j0229M429K7357
$$ 2326989 2290485 2248010 2201112 2173098 2143646 2130401 2136595 2151783 2161264 2151035 2155464 2182821
8880B182821L6910K7703L3813M1479M4228N0916P1667J01398J06023J18787J63120
$$ 2182821 2219731 2247434 2281247 2322726 2366954 2417870 2489537 2590935 2696958 2815745 2978865
8869B978865J69067J70454J49150J09751P8199J6301m0358r9998j24227j45037
$$ 2978865 3147932 3318386 3467536 3577287 3655486 3671787 3631429 3531431 3407204 3262167
8859C262167j13344r7796q5230o4421n5750j7765J5282L7156L7843N6848Q5589
$$ 3262167 3148823 3051027 2965797 2901376 2845626 2827861 2843143 2880299 2918142 2974990 3060579
8848C060579Q8997Q7793Q2357Q9326Q0237R1356J07959Q4105J8788k1653m6787
$$ 3060579 3149576 3237369 3319726 3409052 3489289 3580645 3688604 3772709 3791497 3769844 3723057
8837C723057m4241m3382n6924m0206j2449k1558r901K4998N0512L7055L3905L3815
$$ 3723057 3678816 3635434 3578510 3538304 3525855 3504297 3494396 3519394 3569906 3606961 3640866 3674681
8825C674681K583k6803o3377j01011j06906j00281p5854n7641l6338L0583J06068
$$ 3674681 3677264 3650461 3587084 3486073 3379167 3278886 3203032 3145391 3109053 3139636 3245704
8814C245704J56673K04243K19020K58448K63058K22829J54481O0359n2934j63059
$$ 3245704 3402377 3606620 3825640 4084088 4347146 4569975 4724456 4784815 4731881 4568822
8804D568822k57335k99943l40540l01715k47193j87547j27600q6934m5468j0919
$$ 4568822 4311487 4011544 3671004 3369289 3122096 2934549 2806949 2720015 2674547 2663628
8794B663628K3314N8091Q4553J27461J84422K38231L18549L89617M21683M23114
$$ 2663628 2686942 2745033 2829586 2957047 3141469 3379700 3698249 4087866 4509549 4932663
8784D932663M13495L31589J97090P321j46889k85325l78435m28253m06400l43367
$$ 4932663 5346158 5677747 5874837 5882158 5735269 5449944 5071509 4643256 4236856 3893489
8774C893489k61660k06479j44272r8673n2483k1160j963O214J5834j0774j3932
$$ 3893489 3631829 3425350 3281078 3182405 3129922 3108762 3106799 3113013 3128847 3118073 3104141
8763C104141l1095m1172k6927k6970j8027n3879p8650p7772o6717o8715p2563
$$ 3104141 3073046 3031874 3004947 2977977 2959950 2906071 2827421 2749649 2682932 2614217 2541654
8752B541654k7644j794K507K1051K5558L9691N1067N7450N2004O6315N2044N1065
$$ 2541654 2514010 2512216 2514723 2535774 2561332 2601023 2652090 2709540 2761544 2827859 2879903 2930968
8740B930968O6183Q4140R8471J27023J53887J93077K74432L80146M95549O24104
$$ 2930968 2997151 3081291 3179762 3306785 3460672 3653749 3928181 4308327 4803876 5427980
8730E427980P81465R82301J191453J317447J358726J239619R38701M57075j68938
$$ 5427980 6209445 7191746 8383199 9700646 11059372 12298991 13237692 13694767 13525829
8721A3525829p74885j226096j450961j486717j339495j126155q77559o74049n35604
$$ 13525829 12750944 11524848 10073887 8587170 7247675 6121520 5243961 4569912 4034308
8712D034308m35580l61193k77348k22337j93601j45502j07562r8068q2216p9272
$$ 4034308 3598728 3237535 2960187 2737850 2544249 2398747 2291185 2193117 2110901 2031629
8702B031629o7795o4685m6189m8952l6701l0327j7415j2405j1475P716q799L21
$$ 2031629 1963834 1899149 1852960 1804008 1767307 1736980 1719565 1707160 1695685 1703401 1694602 1694923
8690A694923K5996L5948K5747L3970N1987O0635P6112J00607J08821J37177J80257
$$ 1694923 1720919 1756867 1782614 1816584 1868571 1929206 2005318 2105925 2214746 2351923 2532180
8679B532180K20777K46856K84676K87727K58576J77927J14209N4831o876o8739
$$ 2532180 2752957 2999813 3284489 3572216 3830792 4008719 4122928 4177759 4170883 4102144
8669D102144j16637j46088j54498j45706j21536j13653j11090o7655o2788o2884
$$ 4102144 3985507 3839419 3684921 3539215 3417679 3304026 3192936 3125281 3062493 2999609
8659B999609l2976K251M8329P0996J09094J23836J26720R9697O2920O895o9275
$$ 2999609 2966633 2968884 3017213 3088209 3197303 3321139 3447859 3547556 3610476 3617371 3548096
8648C548096j34254k00779k29483k14467k17904j88864j60038j39061j15644j06791
$$ 3548096 3413842 3213063 2983580 2769113 2551209 2362345 2202307 2063246 1947602 1840811
8638A840811n9790k0130k7023l2698l4686j2195n25J4679K5041K8763L0337L5182
$$ 1840811 1781021 1760891 1733868 1701170 1666484 1654289 1653764 1668443 1693484 1722247 1752584 1787766
8626A787766M9896N6261M8197P9821J02658J12396J51953J48880J60725J50673
$$ 1787766 1837662 1893923 1942120 2021941 2124599 2236995 2388948 2537828 2698553 2849226
8616B849226J31001J03734Q8755O4518L2160L516k6917m0084k4362p942k4615
$$ 2849226 2980227 3083961 3172716 3237234 3269394 3272910 3245993 3205909 3181547 3173605 3148990
8605C148990o0229n6179o4977n2049l3939k4439J623L7338O3156R4784J17829
$$ 3148990 3088761 3032582 2967605 2915556 2881617 2857178 2858801 2896139 2959295 3054079 3171908
8594C171908J49882J48097R4137P2726M2345J382l2226p6838r1542l1947j7750
$$ 3171908 3321790 3469887 3564024 3636750 3679095 3680477 3648251 3571413 3479871 3447924 3430174
8583C430174m078J9524L3043J5286k691Q376n52l4709m7626k1236j9905R387P3107
$$ 3430174 3426096 3445620 3478663 3493949 3491258 3499634 3499082 3464373 3416747 3395511 3375606 3384993 3458100
8570C458100J31590J91171K47920K69406K36064J78258P9099j2658j17269k19526
$$ 3458100 3589690 3780861 4028781 4298187 4534251 4712509 4791608 4778950 4661681 4442155
8560D442155k80453l14901l09319k60703k01669j64559j18693q2426n6109l6569
$$ 4442155 4161702 3846801 3537482 3276779 3075110 2910551 2791858 2709432 2653323 2616754
8550B616754q875N427K3148N4129Q4648J39378J85280K24331K54169L18506L23419
$$ 2616754 2607879 2613306 2636454 2690583 2775231 2914609 3099889 3324220 3578389 3896895 4220314
8539D220314L43887L63934L28824K86073J97420J04849L0510n3077j00629j08438
$$ 4220314 4564201 4928135 5256959 5543032 5740452 5845301 5875811 5822734 5722105 5613667
8529E613667j30936j33495j17278q8457n5494j815N5323Q4658J20522J50829K10535
$$ 5613667 5482731 5349236 5231958 5143501 5088007 5086192 5141515 5226173 5346695 5497524 5708059
8518E708059K59620K31454J47652N2923o2864k32772l56002m16097m60997m40705
$$ 5708059 5967679 6199133 6346785 6399708 6336844 6104072 5748070 5331973 4870976 4430271
8508D430271m24801l75311l14228k67534k27774j66133j03723q3374p6460n7720
$$ 4430271 4005470 3630159 3315931 3048397 2820623 2654490 2550767 2467393 2390933 2333213
8498B333213m2649m5606j6055k9650l3503k0878n106l944n438j6732p409J3188
$$ 2333213 2290564 2244958 2228903 2199253 2165750 2144872 2139766 2135822 2130384 2113652 2106243 2119431
8486B119431J7855J9364R366J6585L4712P1747Q0415N9038O5168O2997P3448J16930
$$ 2119431 2137286 2156650 2166016 2182601 2217313 2289060 2369475 2428513 2493681 2556678 2630126 2747056
8474B747056J49969J88856K26177K36243K06833J63848J01741J1500p3730j54353
$$ 2747056 2897025 3085881 3312058 3548301 3755134 3918982 4020723 4032223 3958493 3804140
8464C804140j98714j91321j83773j39670j13000j06597o8149l6324j5137k5264
$$ 3804140 3605426 3414105 3230332 3090662 2977662 2871065 2802916 2766592 2751455 2726191
8454B726191k7237n888j1050l486K5234M3004M7225O1541N0674L7063K7695K3929
$$ 2726191 2698954 2693066 2682016 2678530 2703764 2746768 2793993 2855534 2906208 2943271 2970966 2994895
8442B994895L1028Q040r826k7428k7186l0604j2555k082R315J9099K6733J201
$$ 2994895 3025923 3033963 3024137 2996709 2969523 2938919 2926364 2924282 2933597 2952696 2979429 2980630
8430B980630k365J0587J9981M9022M0462K7787O5700P4046Q3565Q6220P0951O5152
$$ 2980630 2978265 2988852 3008833 3057855 3098317 3126104 3191804 3265850 3349415 3435635 3506586 3571738
8418C571738N4212M5978L2626J3187M1416M2526N3338P6787R8648J24748P7984
$$ 3571738 3625950 3671928 3704554 3717741 3759157 3801683 3855021 3931808 4030456 4155204 4233188
8407D233188k243o5625j19034j19532q2110n5561m7052j6610M0945P3925Q2245
$$ 4233188 4230945 4165320 4046286 3926754 3844644 3789083 3742031 3725421 3766366 3840291 3922536
8396C922536P7995N3111J1940L183L121j634L811K4548N9971Q7968J28553J54941
$$ 3922536 4000531 4053642 4065582 4068765 4071886 4070252 4074063 4098611 4158582 4246550 4375103 4530044
8384D530044J79781K43649K87441L17064L28281L34519L83688M48213N38661O30054
$$ 4530044 4709825 4953474 5240915 5557979 5886260 6220779 6604467 7052680 7591341 8221395
8374H221395P78684J008482J290124J626045K001264K346670K525526K476349
$$ 8221395 9000079 10008561 11298685 12924730 14925994 17272664 19798190 22274539
8366B2274539K162084J472887N26886n06570j457196k184488k568681k598460
$$ 22274539 24436623 25909510 26436396 25929826 24472630 22288142 19719461 17121001
8358A7121001k348528j957827j548521j164626q61180o33946m44889l47225l10613
$$ 17121001 14772473 12814646 11266125 10101499 9240319 8606373 8161484 7814259 7503646
8349G503646k53629k26982k12379j90978k04855k02552j75947j21046r0798p6535
$$ 7503646 7250017 7023035 6810656 6619678 6414823 6212271 6036324 5915278 5824480 5747945
8339E747945r0834j06803r9560q9131p7772m9678l4195k3211j0988j4344k962
$$ 5747945 5657111 5550308 5450748 5361617 5283845 5234167 5199972 5176761 5165773 5151429 5148467
8328E148467p756j7258k8533q286J2465M0303P1868P6340R8142R4300Q6714R4047
$$ 5148467 5140711 5123453 5094920 5086634 5099099 5139402 5211270 5287610 5385752 5480052 5566766 5660813
8316E660813P3058M5629O2181L3322N0118L3456M9207O2682R1306J25628J76395
$$ 5660813 5733871 5779500 5841681 5875003 5925121 5958577 6007784 6070466 6161772 6287400 6463795
8305F463795K43255L29141M34237N23802O01901O31620N52366L61072Q8477j77556
$$ 6463795 6707050 7036191 7470428 7994230 8596131 9227751 9780117 10141189 10229666 10052110
8295A0052110m09875n19096m94915m16826l13092k03523j50273j02105o5240n6526
$$ 10052110 9642235 9123139 8628224 8211398 7898306 7694783 7544510 7442405 7377165 7320639
8285G320639j9470k6185l7570j0631l612J4715L1881M4524P8227J00352J35374
$$ 7320639 7301169 7274984 7237414 7226783 7223171 7237886 7269767 7314291 7392518 7492870 7628244
8274G628244J47183J58616J42926J29899J51308J32228J22643R8249Q9290J19622
$$ 7628244 7775427 7934043 8076969 8206868 8358176 8490404 8613047 8711296 8800586 8920208
8264H920208J29284J43275J67594J25209J05385J19995J05513P8607P4846R4798
$$ 8920208 9049492 9192767 9360361 9485570 9590955 9710950 9816463 9895070 9969916 10064714
8254A0064714J14439J33250J37507J46253J87410K21171K20277K41117K50078
$$ 10064714 10179153 10312403 10449910 10596163 10783573 11004744 11225021 11466138 11716216
8245A1716216K59521K69618K73519K62034K71443K77586K54596K74565K44987
$$ 11716216 11975737 12245355 12518874 12780908 13052351 13329937 13584533 13859098 14104085
8236A4104085K14453K10441K09741K27922K62702L23771L93311M40331N12564
$$ 14104085 14318538 14528979 14738720 14966642 15229344 15553115 15946426 16386757 16899321
8227A6899321N66707N95417O65710P51914Q20073R01720J017357J108064J149959
$$ 16899321 17466028 18061445 18727155 19479069 20299142 21200862 22218219 23326283 24476242
8218B4476242J099358R65376P92768N58352K92966N4600r1617j24063p7995J6154
$$ 24476242 25575600 26540976 27333744 27892096 28185062 28239662 28148045 28023982 27945987 27962141
8208B7962141J97900M12851O48827Q31294J021793J203696J342788J433807J552279
$$ 27962141 28160041 28572892 29221719 30053013 31074806 32278502 33621290 35055097 36607376
8199C6607376J659686J793431J912436K067314K319786K622790K991958L427816
$$ 36607376 38267062 40060493 41972929 44040243 46360029 48982819 51974777 55402593
8191E5402593L908818M427958M975207N590935O229395O980798P929741R125843
$$ 55402593 59311411 63739369 68714576 74305511 80534906 87515704 95445445 104571288
8183A04571288J0676012J2782072J5630943J9439960K4387097L0509845L7614346
$$ 104571288 115247300 128029372 143660315 163100275 187487372 217997217 255611563
8176B55611563M4888327N0928823N4036749N2400140M4438544K9835412J0530103
$$ 255611563 300499890 351428713 405465462 457865602 502304146 532139558 542669661
8169E42669661j0429623l0062455m5028341n2739225n3192352m8254430m0072365
$$ 542669661 532240038 502177583 457149242 404410017 351217665 302963235 262890870
8162B62890870l0753530k2137495j5079212r561696n199770j482549K060792N768675
$$ 262890870 232137340 209999845 194920633 185358937 180159167 178676618 180737410 186506085
8154A86506085J0011986J5077993K1078774K7878997L4910953M1160442M5221446
$$ 186506085 196518071 211596064 232674838 260553835 295464788 336625230 381846676
8147C81846676M5509212M0854408L1012027J6738694k00929j7272017l2049847
$$ 381846676 427355888 468210296 499222323 515961017 515760088 498488071 466438224
8140D66438224m2692124m8236626m8662256m5018709l8794418l1559845k4473559
$$ 466438224 423746100 375509474 326847218 281828509 243034091 211474246 187000687
8133A87000687j8246093j3151247r046980n748367k976952m08175K296126N497399
$$ 187000687 168754594 155603347 146556367 140808000 137831048 137422873 139718999 145216398
8125A45216398R411293J4198381J9895262K6097877L1709671L4486329L1118431
$$ 145216398 154627691 168826072 188721334 214819211 246528882 281015211 312133642
8118C12133642J8652841j894126k3329698l6985964m0079342l5898349k9201478
$$ 312133642 330786483 328892357 305562659 268576695 228497353 192599004 163397526
8111A63397526k2812875j7669440j3793673j0913163q766848p104720n808334
$$ 163397526 140584651 122915211 109121538 98208375 89441527 82336807 76528473
8104G6528473m827437m123587l585454l184118k820903k397296j924264j448532
$$ 76528473 71701036 67577449 63991995 60807877 57986974 55589678 53665414 52216882
8096E2216882r73453n12031q2802L69690Q32152J272331J740493K250772K742719
$$ 52216882 51243429 50731398 50648596 51018286 51850438 53122769 54863262 57114034 59856753
8087E9856753L278491L854251M593132N598399O892548Q564886J0696913J3282868
$$ 59856753 63135244 66989495 71582627 77181026 84073574 92638460 103335373 116618241
8079A16618241J6247661J9487780K2883570K6216775K8887468K9791241K7022415
$$ 116618241 132865902 152353682 175237252 201454027 230341495 260132736 287155151
8072B87155151J8441422L100622j5940299l1918535l9340676l8129064l2161667
$$ 287155151 305596573 308697195 292756896 260838361 221497685 183368621 151206954
8065A51206954k5162712j9070226j4452098j1044191q641799o966893n759326
$$ 151206954 126044242 106974016 92521918 81477727 72835928 65869035 60109709
8058F0109709m925481m372654l950973l638268l375584l126425k857062k569956
$$ 60109709 55184228 50811574 46860601 43222333 39846749 36720324 33863262 31293306
8050C1293306k302383k049171j826200j639805j454914j304789j158430j000213
$$ 31293306 28990923 26941752 25115552 23475747 22020833 20716044 19557614 18557401
8042A8557401q64703p51411o46714n55028m82872m62423m28138l78650l37868
$$ 18557401 17692698 16941287 16294573 15739545 15256673 14794250 14366112 13987462 13649594
8033A3649594k84732k39265j82543j35201r2905m7123M985J5615M0016N3852M9595
$$ 13649594 13364862 13125597 12943054 12807853 12714948 12667825 12672810 12688425 12728441 12782293 12831888
8022A2831888M8005M2828P2326J01601J30226K04977K84330L68119M61086N56388
$$ 12831888 12879893 12922721 12995047 13096648 13226874 13431851 13716181 14084300 14545386 15101774
8012A5101774O42764P92981R71205J221035J593900K121979K851818L776817M850945
$$ 15101774 15744538 16537519 17508724 18729759 20323659 22445638 25297456 29074273 33925218
8003C3925218N953061O711119O480087M737327J459073k516732n869773p570652
$$ 33925218 39878279 46589398 53069485 57806812 59265885 56749153 50879380 43308728
7995D3308728p438198o126799m534364l230726k278840j612701j125753p53879
$$ 43308728 35870530 29743731 25209367 21978641 19699801 18087100 16961347 16207468
7987A6207468m66073k53405q0171K2314Q5506J45690J96392K23323J85709L9438
$$ 16207468 15741395 15487990 15407819 15430133 15515639 15661329 15857721 16081044 16266753 16306191
7977A6306191k07572m78881p15966q95220r91077r42970q13268o62810m97055
$$ 16306191 16098619 15619738 14903772 14008552 13017475 12074505 11261237 10598427 10101372
7968A0101372l56462k43428j68566r4105k3591K6589Q2348J33375K15472K95338
$$ 10101372 9744910 9501482 9332916 9238811 9215220 9241809 9324157 9457532 9673004 9968342
7958I968342L94324N12404O48037Q05230R77267J032316R49179O66914L23850
$$ 9968342 10362666 10875070 11523107 12328337 13305604 14337920 15287099 15954013 16277863
7949A6277863J21316J84932N05446R32445J412275J916927K410943K870867L198285
$$ 16277863 16399179 16584111 17089557 18022002 19434277 21351204 23762147 26633014 29831299
7940B9831299L358497L261719K926920K331568J598891R05653L97733J42246K12308
$$ 29831299 33189796 36451515 39378435 41710003 43308894 44214547 44612280 44754526 44966834
7931D4966834O35442J328358K178656K929040L173505K533899P51167j938335
$$ 44966834 45602276 46930634 49109290 52038330 55211835 57745734 58496901 56558566
7923E6558566m491381n761298n550122m420795l063338j791423p06965J26117
$$ 56558566 52067185 46305887 40755765 36334970 33271632 31480209 30773244 30899361
7915C0899361O77443R76839J008541Q64989N69378L10704J90067K63259N10190
$$ 30899361 31576804 32553643 33562184 34427173 34996551 35307255 35497322 35760581 36270771
7906C6270771P91119Q76448N93369Q3362l80533n23429k46075K67345O20646M88228
$$ 36270771 37061890 37938338 38531707 38615069 38234536 37711107 37465032 37732377 38353023 38841251
7896C8841251j48347j093263j964633k375417k179908j547659p22522Q4477Q65229
$$ 38841251 38692904 37599641 35635008 33259591 31079683 29532024 28809502 28893979 29759208
7887B9759208J636960K477252L252622L774903L885249L414747K360848Q76158
$$ 29759208 31396168 33873420 37126042 40900945 44786194 48200941 50561789 51437947
7879E1437947q02764k372661l664628m503068m858791m752376m293044l662151
$$ 51437947 50635183 48262522 44597894 40094826 35236035 30483659 26190615 22528464
7871B2528464k972152k292813j736347j308393r86050p18227m77620k58183N312
$$ 22528464 19556312 17263499 15527152 14218759 13232709 12514482 12036862 11778679 11783991
7862A1783991L06751O16613R24547J166769J189518Q96683K93612m59963j162158
$$ 11783991 12090742 12707355 13631902 14798671 15988189 16884872 17178484 16718521 15556363
7853A5556363j629685j784364j658060j402368j101709q39174o34418m90056l69472
$$ 15556363 13926678 12142314 10484254 9081886 7980177 7141003 6506585 6016529 5647057
7844E647057k95986k08326j46850r3271l0641J2968N4481R9582J03760O7843N848
$$ 5647057 5351071 5142745 4995895 4902624 4871983 4884951 4939432 5039014 5142774 5210617 5216465
7833E216465j17771k58133l19662l50388l53444l17956k72787k35012j93853j44945
$$ 5216465 5098694 4840561 4520899 4170511 3817067 3499111 3226324 2991312 2797459 2652514
7823B652514j16477j00113q8448n5943n9249m6883m4951l8124l2197o2097n7275
$$ 2652514 2536037 2435924 2347476 2291533 2232284 2185401 2140450 2102326 2070129 2008032 1950757
7812A950757n6396q0223o3271m4860l2844l0897k1171j4018l3398l3730k2937
$$ 1950757 1894361 1814138 1750867 1706007 1673163 1642266 1621095 1607077 1573679 1539949 1517012
7801A517012k1212j2910K416m133n165J7669M6k082R841K0519K0012K0562L3953
$$ 1517012 1495800 1482890 1485306 1481173 1476008 1493677 1493723 1491641 1501482 1522001 1542013 1562575 1596528
7788A596528K6989K5677L5104N0993M1243N5003P1081Q6808R7521J31720J80767
$$ 1596528 1623517 1649194 1684298 1735291 1776534 1831537 1902618 1989426 2086947 2218667 2399434
7777B399434K42809K63419K79327K92229K65681J70131O7205j5115j48043k30177
$$ 2399434 2642243 2905662 3184989 3477218 3742899 3913030 3980235 3965120 3817077 3586900
7767C586900k68922k86524k48233k00203j52860j14786r4719o4688m1695j5011
$$ 3586900 3317978 3031454 2783221 2583018 2430158 2315372 2220653 2155965 2114270 2099259
7757B099259J2631L724L6447Q5047J20621J68678K12567K54752K57310K45375
$$ 2099259 2111890 2115614 2152061 2237108 2357729 2526407 2738974 2993726 3251036 3496411
7747C496411K09170J70715Q2826m5208j15075j83504k26620k22321j91873j50874
$$ 3496411 3705581 3876296 3959122 3913914 3798839 3615335 3388715 3166394 2974521 2823647
7737B823647j00368k3304O0266J26083K20535K88921K98896L04342K96921K32763
$$ 2823647 2723279 2699975 2760241 2886324 3106859 3395780 3694676 3999018 4295939 4528702
7727D528702J30015J1672j01944k14409k59594k78584k48074j86762j33252n1448
$$ 4528702 4658717 4670389 4568445 4354036 4094442 3815858 3567784 3381022 3247770 3196322
7717C196322j1626k1312j11480k02590k58843l02603k79951k15651j67241j34302
$$ 3196322 3184696 3163384 3051904 2849314 2590471 2287868 2007917 1792266 1625025 1490723
7707A490723j03176r3747p4812p6799p9122n4598n0610l9940l6897k1591j5533
$$ 1490723 1387547 1293800 1218988 1142189 1063067 1008469 957859 917919 881022 859431 843898
7696H43898j6873j7025j1526j2100O217N36J2038K200J631N16L093L5230M2058
$$ 843898 827025 810000 798474 786374 792591 793127 805165 807365 808996 809512 812605 847835 889893
7683H89893L8755L4876L9781L6516L6671L5165O5169Q1140R1959R3827J13282
$$ 889893 928648 963524 1003305 1039821 1076492 1111657 1176826 1257966 1349925 1443752 1557034
7672A557034J41523J73619J23671L4106o0006j65020k10876k03770j90307j62963
$$ 1557034 1698557 1872176 1995847 2029953 1969947 1804927 1594051 1390281 1199974 1037011
7662A037011j12541p8124n2021n1139m1107q882l018k1270m3593l6984k6960o925
$$ 1037011 924470 846346 794325 743186 702079 693197 690179 668909 625316 588332 561372 554447
7650E54447j6801p396j9459j2833j8435j3095k216R825M882k909Q300j5111k775
$$ 554447 537646 530250 510791 497958 479523 466428 464212 474037 478919 476010 484310 469199 466424
7637D66424j9803j6267j9583k2110k1023O390J550k8388k9285j0037M004K956
$$ 466424 446621 430354 410771 388661 367638 374028 375578 347190 317905 307868 311872 314828
7625C14828M482K6110J960j9119l522Q362j5385m660m966o666J0500J6219O800
$$ 314828 319310 345420 347380 328261 324739 333101 317716 313056 308090 301424 311924 328143 334943
7612C34943m65k808K2379P308J1208L9679J2558J3155N778J3715K4505K4646L0608
$$ 334943 334478 331670 354049 361357 372565 412244 424802 437957 443735 457450 481955 506601 537209
7599E37209O425R878M881l0966l5358k8947l6459k3912l0179j7826j3804j8067
$$ 537209 543634 553512 558393 527427 492069 463122 426663 402751 372572 354746 340942 322875
7587C22875O06j6946j0169K519m655K77P418J482j7694m877j5871o846O645k093
$$ 322875 323481 306535 296366 298885 294230 294507 301925 303407 285713 280836 264965 258119 264764 262671
7573B62671j532j5169j606K228o51M427K947k260P952l288n643j1381j1379m793
$$ 262671 261139 245970 244364 246592 245941 250368 253315 251055 259007 255719 250076 238695 227316 222523
7559B22523j2187j3540P905K218J6846J6953R931j189j008J6340K019j0840j8424
$$ 222523 210336 196796 204701 206919 223765 240718 250649 249460 248452 264792 266811 255971 237547
7546B37547L536J5439J1961J2484J7618L0488J3861n141K4822J9357P397N185
$$ 237547 241083 256522 268483 280967 298585 329073 342934 337793 362615 381972 389369 394554
7534C94554J9682J0712J3737J22Q928P616p199k0639l4582l7638k1475k4869k0334
$$ 394554 414236 424948 438685 438807 447735 455351 448152 427513 392931 355293 333818 308949 288615
7521B88615q646n912j2438N061M737j219o835j215R455j0957L633j637J4254J7122
$$ 288615 279969 274057 261619 266680 271417 270198 263363 262148 271603 260646 264279 262642 276896 294018
7507B94018J1568R276J5705K0355J3507J0564j5817k9554k4989q303J822m064
$$ 294018 305586 314862 330567 350922 364429 374993 359176 329622 304633 296330 298152 294088
7495B94088k4578j1858j3465j536K042K719R797J4943m295J014L0740L0950L4709
$$ 294088 269510 257652 244187 242651 244693 247412 257209 272152 267857 268871 299611 330561 365270
7482C65270J6396m963j3590k2723k2164l2098l3328k5644o427r935j1349k253
$$ 365270 381666 376703 363113 340390 318226 286128 252800 227156 220729 210794 199445 197192
7470A97192L712k1213j4289Q583J6132J0171o767m783j1042p413J48m888J3543
$$ 197192 200904 179691 165402 173985 190117 200288 193521 188738 177696 170283 170431 165543 179086
7457A79086j458j3621j6425J2514R489j3555j2209j2693j6178p89n041L840R196
$$ 179086 177628 164007 147582 160096 169585 156030 143821 131128 114950 114161 109120 112960 122156
7444A22156j4092r451k784j845j4525j305J9655k055p282k301R268J0648j1919
$$ 122156 108064 98613 95829 93984 79459 78154 97809 95754 88472 86171 95439 106087 94168
7431I4168j2667l572O475N312j759K815Q747O207n61j6973k2629l053J1356m654
$$ 94168 81501 77929 84404 89716 87957 90772 99519 105726 105165 88192 65563 62510 73866 69212
7417F9212j4436j1749J1142r768m806r615o962K6262J7023O067j6457p05J8081
$$ 69212 54776 43027 54169 44401 39595 29980 23018 49280 66303 72370 55913 55208 73289
7404G3289k725j0708n496J0239N141m096l666j8311P128J6642n341n09Q353r021
$$ 73289 70564 59856 54360 64599 69740 65644 61978 43667 50795 67437 62096 61587 69940 60919
7390F0919m206J0051J4622N578m480J580k3116k0348J2396R371J807L385J096
$$ 60919 56713 66764 81386 86964 82484 84064 60948 40600 52996 62367 64174 67559 68655
7377F8655j2304O003m389m238p41k768P517L373l904j6964j1597K636q091j2572
$$ 68655 56351 62354 57965 53727 52986 50218 57735 61108 57204 40240 28643 31279 23188 10616
7363A0616M470J9197l274N097N874J4137m610j0115r731r91R075J7113Q636j9230
$$ 10616 15086 34283 31009 36106 41980 56117 51507 41392 31661 30670 39745 56858 65494 46264
7349D6264j1248j3521j1454o37J4338M870J9421R332L715J0147o344m944l468
$$ 46264 35016 21495 10041 9404 23742 28612 48033 57365 61080 71227 64883 59939 56471
7336E6471O07m715o180O360K024O053r678r33M152K917J311P026Q62k380J011
$$ 56471 57078 52363 46183 52543 54567 60620 50942 50009 54161 57078 58389 65415 66277 63897 64908
7321F4908j4011m866p854m92L29p907P039L371q962q83j0174J1408J1482O831
$$ 64908 50897 46031 38177 37685 38014 30107 37146 40517 31555 30672 20498 31906 43388 50219
7307E0219L578m765J2014L98k3802N181N198O52j454j0492L933L903p154l0202
$$ 50219 53797 49032 61046 61444 37642 42823 48021 48673 47219 36727 40660 44563 37409 7207
7293G207k3114Q019Q572M993m160J2825J74K697n570K580n514j1255J2228J6572
$$ 7207 -15907 -7888 684 5677 1517 14342 14516 17213 11643 14223 8709 -2546 9682 26254
7279B6254J0112k1264j1776k913J0941J6298M668P383j1727L412J1495M824L921
$$ 26254 36366 15102 3326 413 11354 27652 32320 39703 27976 31388 42883 47707 51628
7266E1628j742J0130R135k0720n213p17m316k0110q278J309j8643k44J5256J28
$$ 51628 49886 60016 69151 48431 43218 42501 38185 18075 9797 11106 -7537 -7781 7475 7603
7252G603o569O056K541O932m040R378j3381m431n527K100M183J7358J3339n68
$$ 7603 1034 7090 9631 16563 12523 21901 8520 4089 -1438 662 4845 22203 35542 34974
7238C4974m070k368j889P427l217K377K496P556p561j8076N469P969R13J1273
$$ 34974 30904 28536 26647 34074 30857 33234 35730 43286 35725 17649 23118 31087 32000 43273
7224D3273L314j1788j3149n8N730J772J7526J3837j9796k0153O458n597J3955
$$ 43273 46587 34799 21650 21592 27322 29094 46620 60457 40661 20508 26966 21369 35324
7211C5324J6300j826j6995m572l993O012l047q487j2126K374J379q069j0414n58
$$ 35324 51624 49798 32803 28231 24238 30250 27203 18716 6590 8964 10343 2274 -8140 -8698
7197h698K432J6402o454j2560j0637j403Q008m623j33l234K3594Q081K111L054
$$ -8698 -6266 10136 3682 -8878 -19515 -20918 -12910 -17533 -17666 -20900 2694 10775 12886 15940
7183A5940M137j513L951k3812J600N610l843j1072P181J7694n57M63r466J9077
$$ 15940 20077 18564 22515 -1297 303 5913 2070 -9002 -1821 15873 15316 15779 6313 25390
7169B5390L0675J994j9881n700J227K844o181j2482j520L548J2014m306j9404
$$ 25390 56065 58059 38178 32478 33705 36549 30368 17886 16366 19914 31928 27622 8218
7156H218j2781N045N57r132Q186J8695l343j3575j4411r923Q619L896k408r018
$$ 8218 -4563 482 1039 -8093 93 18788 15445 1870 -12541 -22464 -13845 -9949 -12357 -21375
7142b1375J99Q146J0021J5515J1462m272j5935Q081P400m976j7371j784J263O933
$$ -21375 -21176 -13030 -3009 12506 23968 19696 3761 11842 19242 14266 -3105 -4889 -3626 3307
7128C307R942J4763N122j864k969n650p70O68q390J4860K815L901Q409m347K003
$$ 3307 13249 28012 33134 31270 28301 22651 21881 22549 14159 29019 31834 35735 44144 39797 41800
7113D1800n094n491k2029j5748k81J1999J0983M141R562O695k464P988o981o502
$$ 41800 36706 31215 9186 -6562 -6843 5156 16139 20280 29842 36537 34073 42061 35080 28578
7099B8578l745j1544j0093K61r266J659K384r779n592p415l058Q04N806J8080
$$ 28578 24833 13289 3196 3457 -5809 -4150 -1766 -11545 -17137 -24552 -27610 -26806 -21000 -2920
7085b920J3593J3360Q433k124k2513j8178N717J1219L422L972j2668j4499o266
$$ -2920 10673 24033 32466 30342 7829 -10349 -4632 6587 10009 13981 1313 -13186 -19452
7072a9452J6430J3690N179J4020o360q273j341P05l300o894O830O43k1342L413
$$ -19452 -3022 10668 15847 29867 23507 15234 13893 14598 11298 4404 11234 11877 -9465 -6052
7058f052J6325l066j053r953m236K6446m40j250L894o324k583m894o035r002J0936
$$ -6052 10273 7207 6154 -3799 -8035 18411 17971 16721 20615 14291 11708 6814 779 -8223 2713
7043B713J2120Q550O736p211j5209m438j0329R516O408M707m4j0542J2587n05
$$ 2713 14833 23383 30119 22908 7699 3261 -7068 2448 8856 13563 13519 2977 15564 15059
7029A5059l017M532o796n509p236J6754o82j4477o899P00j8556j7051j790L109
$$ 15059 12042 16574 9778 4269 -2967 13787 13105 -1372 -8271 -7571 -26127 -43178 -44968 -41859
7015d1859J0041P775L037l63l726J025J9253J5393j79O404J789j0898J863J8426
$$ -41859 -31818 -24043 -21006 -21369 -25095 -24070 -4817 10576 10397 16801 18590 7692 9555 27981
7001B7981O213r511j0793r704R325Q265k449p238l079R116J8483R937j8733j0123
$$ 27981 34194 24683 13890 4186 13511 21776 19327 12089 9010 18126 36609 46546 27813 17690
6987A7690L6J5390K887k635Q910K992r803j8285j1476M785k543j0545j5108p829
$$ 17690 17726 33116 36003 33368 42278 45270 35467 17182 5706 10491 7948 -2597 -17705 -25534
6973b5534K934M591J8135j199j2246j7129j1747J3478K1712M500r62q589m455
$$ -25534 -22600 -18009 126 -1073 -13319 -30448 -42195 -28717 -7005 -2505 -3467 -12056 -16511
6960a6511M786n078J3733J021K248j5839J404J7573J0650q134j6395j3067J5644
$$ -16511 -11725 -16803 -3070 -2049 199 -15640 -14236 3337 13987 5853 -10542 -23609 -7965
6947g965K948n125O519J1573J1275k2363l3756m615Q211p352K1192j090l323J2843
$$ -7965 -5017 -10142 -3623 7950 19225 -3138 -36894 -41509 -33298 -40650 -19458 -20548 -23871 -11028
6933a1028N203O66J0267k900o147J4375J7594K307n108j9579k651L37M938P772
$$ -11028 -5825 -5159 5108 2208 -3939 10436 28030 30337 25229 5650 2999 3336 8274 16046
6919A6046l873j362J2102p588p970M635j1828j4129m161J1360R673N368j0460
$$ 16046 12173 10811 22913 15325 7355 11990 162 -13967 -18128 -6768 2905 8273 -2187
6906b187k2743o920R422J2452N438j904j0214N67L487K424l59j5341n533l033
$$ -2187 -24930 -31850 -22428 -9976 -4538 -6442 -16656 -16089 -12602 -10178 -10537 -25878 -31411 -34444
6892c4444O173j858J2864m82l986n436J9181J2186p583l743P837J0901m038r21
$$ -34444 -28271 -30129 -17265 -17747 -21733 -27169 -7988 4198 -3385 -7128 709 11610 7572 6651
6878F651k0881k950k221J4114O374j714k555K113p531j0172O751K5374j5197j1432
$$ 6651 -14230 -17180 -19401 -5287 1087 -627 -3182 -1069 -8600 -18772 -12021 13353 -1844 -13276
6864a3276J0523M953J3358K178J318l095m125k555j7897j379m381K534J0049L995
$$ -13276 -2753 2200 15558 17736 19054 15959 11834 9279 -8618 -9997 -14378 -11844 -1795 2200
6850B200r608q342m57M766j7300R541J9363l159j1634Q466J1202k844K592j3269
$$ 2200 -7408 -15750 -16207 -11441 -28741 -19200 163 -2996 -14630 -6164 5038 2194 4786 -8483
6836h483p425L081l393o493J1391k827k094P375L49J7649o683r519J2541J1765
$$ -8483 -15908 -12827 -16220 -22713 -11322 -14149 -16243 -8868 -8519 9130 2447 -7072 5469 17234
6822A7234l109o074r685p315m791k128k749r269k410J695J5339K405o047o819
$$ 17234 14125 8051 -1634 -8949 -13740 -15868 -18617 -27886 -30296 -28601 -13262 -10857 -16904 -23723
6808b3723j384K9k098P861O182L0825L891L218K398M844j2579p626J3709Q666
$$ -23723 -25107 -25078 -27176 -19315 -13133 17692 21583 24801 27199 32043 19464 11838 25547 34213
6794C4213N955k655j9267k7622j8233J0175O999P918M971j055P616J4p234n601
$$ 34213 40168 37513 18246 -9376 -27609 -17434 -10435 -2517 2454 1399 9015 9029 1795 -3806
6780c806k509m417m645J9787L290K59M546j0208j6078L316M531J7022J2716q212
$$ -3806 -6315 -10732 -15377 4410 7700 7959 12505 2297 -13781 -10465 -5934 11088 23804 15592
6766A5592j2376M401N429j4877J1035k507r220j0987P087o293J634L079n416J1314
$$ 15592 3216 7617 13046 -1831 9204 6697 -2523 -13510 -6423 -12716 -11082 -8003 -13419 -2105
6752b105Q844J0977J5591J2049m941k9477r614J4900j362k0964j8044P55J3514
$$ -2105 6739 17716 33307 45356 40415 10938 1324 16224 14862 -6102 -24146 -23391 -9877
6739i877L783j4637K213N540R92p638l323J5402K2960r356j694Q572n476l372
$$ -9877 -6094 -20731 -18518 -12978 -11986 -19624 -22947 -7545 15415 6059 4365 12937 7461 4089
6725D089q879m524P714O124J6883J18j0797L20K263J2260o257o442m38k2090l561
$$ 4089 -4790 -9314 -1600 4524 21407 21525 10728 11048 13311 25571 19314 12872 12434 -9656 -13217
6710a3217R407Q556K938j0181j1908n446p018j301j9084n275M204J9994N297j0113
$$ -13217 -3810 4746 7684 -2497 -14405 -19851 -26869 -28170 -47254 -52529 -48325 -28331 -23034 -33147
6696c3147M50k807N119K843l174N991N276R479J2714K212j4736o206P658k731
$$ -33147 -32697 -35504 -30385 -27542 -30716 -24725 -19449 -9970 2744 4956 -9780 -15986 -8328 -11059
6682a1059l642j818Q085J1134N13M227O963m668k211l056J02k661J2073O487n956
$$ -11059 -14701 -16519 -8434 2700 3213 7440 14403 9735 7524 4468 4570 1909 13982 20469 14513
6667A4513p443k968k8200K991L2372P296l608k0980k3071J0397M710N316m226
$$ 14513 7070 4102 -24098 -21107 11265 18561 14953 -6027 -29098 -18701 -13991 -8675 -12901
6654a2901Q310j265j6931k894j0926J1394N274j0851l389J4092K1043J773p779
$$ -12901 -4591 -5856 -22787 -25681 -36607 -25213 -19939 -30790 -34179 -20087 956 2729 -5050
6641e050p344J2802K491j6127m932Q79k179J984K3740J2647j563K057M22L233
$$ -5050 -12394 408 2899 -13228 -18160 -17281 -19460 -17476 6264 18911 17348 19405 19827 23060
6627B3060o526k1313q296R366K901K738Q330M657k0571j8068M891N238J3966P339
$$ 23060 16534 -4779 -13075 -3709 -808 1930 10260 14917 -5654 -23722 -18831 -13593 373 7712
6613G712n969j5618j9571l069J9474O230J6408J856P0N859K131o817K693n733
$$ 7712 1743 -13875 -33446 -36515 -17041 -10811 5597 7453 7523 13382 15513 8696 11389 5656
6599E656p719M243L657K963M649R093j2380j0656j5267p322j709J2939l320j058
$$ 5656 -2063 2180 5837 8800 13449 22542 10162 -494 -15761 -23083 -24792 -11853 -15173 -16231
6585a6231j7738o308J7744j907M14N772O456k647J907r810n447L614K2767j74
$$ -16231 -33969 -40277 -22533 -24440 -24026 -18254 -11798 -14445 -12538 -22348 -27795 -24181 -1414 -1588
6571a588p397Q53q954r216J3239L758l910R573L906j2300q809k50N687P653J8050
$$ -1588 -8985 -8132 -17086 -26302 -13063 -9305 -13215 -3642 264 -12036 -20845 -21095 -15408 -7755 10295
6556A0295P713O369N397J388O08j2664j3832N998k432p948K784o834J058O160
$$ 10295 18008 24377 29774 31162 31770 19106 5274 11272 8840 892 3676 -3158 -2100 4060
6542D060k3830j3666N733J6062K1549J2150m462m766j0738L282P386K238m539
$$ 4060 -19770 -33436 -27703 -11641 9908 22058 17596 12830 2092 5374 12760 14998 10459
6529A0459j0247j584N039Q890k633m218q150K470M012j6375r657l139J3368r143
$$ 10459 212 -1372 3667 12557 9924 5706 -2444 26 4038 -12337 -21994 -25133 -11765 -20908
6515b0908M326J023M00J0729J2565k103K156j6415o575m229O45n106j093K294
$$ -20908 -16582 -15559 -15159 -4430 8135 6032 8188 -8227 -14802 -19031 -18386 -23492 -24585 -22291
6501b2291J460P960M126j6193O195O74j1277k007k44P578L534l333p793L817P152
$$ -22291 -20831 -12871 -8745 -24938 -18743 -18069 -29346 -31353 -31597 -24019 -20485 -23818 -31611 -27794 -20642
6486b0642m368P824L61J4135j567L090j812R099p57l356p635n18O375j2774L079
$$ -20642 -25010 -17186 -16825 -2690 -4257 -1167 -2979 6120 5363 2007 -5628 -6146 229 -12545 -9466
6471i466R032Q4k794j719M801l788k0372l798J4553K674O463K2265p357k4476
$$ -9466 -434 -350 -3144 -4863 -62 -3850 -24222 -28020 -13467 -10793 -4330 17935 10578 -13898
6457a3898l94K281N808O033r61p576L450j2251L852P459O512Q808L415j1298j3277
$$ -13898 -14292 -12011 -6203 -170 -1131 -8707 -5257 -17508 -13656 -6197 315 9123 12538 1240 -12037
6442a2037l609j552j4161r588J4120J6178k464r118J016J3920J5174j103M882
$$ -12037 -15646 -17198 -31359 -40947 -26827 -10649 -13113 -22231 -21215 -7295 7879 6776 11658
6429A1658j5842o206p706R041O733K0564Q534k865n23j701k30m390j2296Q929
$$ 11658 -4184 -10390 -18096 -9055 -2322 18242 26776 23911 23388 21687 21457 17067 4771 13700
6415A3700j781j028q81j295j5696k478K9954O065j0397P041r332q85J4103k800
$$ 13700 11919 10891 10010 8715 -6981 -9459 20495 26560 16163 23204 13872 12987 27090 24290
6401B4290j1438j917J0830Q052j054n027m848j5052L478R476j2690j0787q88j191
$$ 24290 12852 10935 21765 29817 28763 23736 18888 3836 7314 16790 4100 -6687 -7575 -8766
6387h766j5028K62J1840K20o394N861J3958r76j0502J1592J2556r096k216M784
$$ -8766 -23794 -23532 -11692 -11472 -17866 -12005 1953 977 -9525 2067 14623 5527 3311 8095
6373H095m793l262q422j5407m966J0588J7516k978J3466J1351k127k0072j0563
$$ 8095 3302 40 -8382 -23789 -28755 -18167 -651 -3629 9837 21188 19061 -1011 -11574
6360a1574P879n727k6118j9348l43J7744K9075j0135r092k644j2733j322J0601
$$ -11574 -3695 -9422 -35540 -54888 -55231 -37487 -8412 -18547 -27639 -30283 -43016 -44338 -33737
6347c3737M911J3658J5245m11J3658r156j0854j4835k30l323m944J2626J8141
$$ -33737 -28826 -15168 77 -334 13324 4168 -6686 -21521 -21751 -25074 -30018 -17392 749
6334G49J2777j364P342j985m634l04j1269O609O840p807N51O780j80M676j4478
$$ 749 13526 12162 19504 17519 12885 12581 1312 7921 14761 6954 7505 14285 14105 18781 4303
6319D303j2591j8878n665J8221M913J8949n763j7912P194P923p091N502K011k4925
$$ 4303 -8288 -27166 -32831 -14610 -9697 9252 3489 -14423 -7229 694 -6397 -895 1116 -23809
6305b3809k4788J0446J8381K9285J380k50r847j4286k1801R730J3528m173K930
$$ -23809 -48597 -38151 -19770 9515 10895 10645 798 -13488 -35289 -25559 -12031 -16204 -13274
6292a3274N770L140K162L233R738J426q064L695j7968p490M632R478K1068K5806
$$ -13274 -7504 -4364 -2202 1031 10769 12195 4131 7826 -10142 -17632 -13000 -3522 17546 43352
6278D3352m569k0742m429k895j2259J1916K0786j1499o697p39r541Q109Q179R092
$$ 43352 38783 18041 13612 10717 -1542 10374 31160 19661 12964 12225 2684 10793 18972 28064
6264B8064L394j792j0221j4834o702Q580L164p997N768Q38J529j8544j7765j8130
$$ 28064 31458 29666 19445 4611 -2091 6489 9653 1656 7424 8262 9791 -8753 -26518 -44648
6250d4648j321Q833J1377J2702J2129R934k871p456j4912n126R188L667j9988
$$ -44648 -45969 -37136 -25759 -13057 -928 9006 6135 -1321 -16233 -21359 -12171 -8504 -28492
6237b8492p843O766m476j267J0882Q476r462k856o187M259M348N652Q502N769
$$ -28492 -36335 -29569 -34045 -35312 -24430 -15954 -25416 -28272 -34459 -30200 -25852 -20200 -11698 -5929
6223e929M77J338N375l322N95k0233L245J6325l142p646m259O154O128j21L439
$$ -5929 -5452 -4114 1261 -2061 -1466 -21699 -18454 -2129 -5271 -12917 -17176 -11022 -4894 -5015 -1576
6208a576j523o773R463n871K900P515J6677r138M389j0038r889j6954J629J5454
$$ -1576 -3099 -9872 -409 -6280 -3380 4135 20812 11674 16063 6025 -3864 -20818 -19189 -3735
6194c735K4835n36m354j2337K138L545K820m705N222M199O937J3481k658j4550
$$ -3735 21100 20564 16210 3873 6011 9556 12376 7671 12893 17092 24029 37510 34852 20302
6180B0302L813j2307k4366M009J6738J5945j4246m457k91n78j5566j169n674o19
$$ 20302 24115 11808 -12558 -8549 8189 24134 9888 5431 5140 4562 -11004 -12173 -17847 -18466
6166a8466j499j086q317O837J3184j130j3322q548k617R831J1339j1037m850p998
$$ -18466 -19965 -21051 -29368 -22531 -9347 -10477 -23799 -32347 -34964 -25133 -13794 -24831 -29681 -37679
6152c7679J8228P295J0486O350o89n344P622j1317n443L844M214n875q025k876
$$ -37679 -19451 -12156 -1670 4680 3991 -1353 6269 -5048 -10491 -6647 -2433 -8308 -16333 -19209
6138a9209J281J779j273k1433j0071p65J0114J6873N686l273p719p97J2609R899
$$ -19209 -17928 -16149 -17422 -38855 -48926 -49691 -39577 -22704 -17018 -20291 -28010 -28807 -16198 -6299
6124f299R116R781R307j2820N386J2302n444o914j0560j5284N668O124L68Q442
$$ -6299 2817 12598 21905 9085 14471 26773 21329 14415 3855 -11429 -5761 363 731 9173
6110I173m560J9316o284q556P738m607p178O028J3776P410j5634p144L895k358
$$ 9173 4613 23929 17645 9089 16827 12220 5042 11070 24846 32256 16622 9478 13373 11015
6096A1015m823j1701r892L700o863J858m656j402j405K375P378J2980J0929o427
$$ 11015 6192 -5509 -15401 -11701 -18564 -16706 -21362 -22764 -24169 -21794 -14416 -1436 9493 3066
6082C066L356j4961j9734N20J2611R453N23n341k244K0166q210m1670q056K2146
$$ 3066 6422 -8539 -28273 -27753 -15142 -5689 -5166 -10507 -12751 7415 -795 -42465 -50521 -28375
6068b8375J1185R954P670L861J1179k462Q38j2687N29o198Q870J2463Q463j1678
$$ -28375 -17190 -7236 434 4295 15474 13012 13850 1163 1692 -4506 4364 16827 25290 13612
6054A3612j2786K179N696j1128j8205j2538N488O35J8127J2500N391n758l217
$$ 13612 826 3005 8701 -2427 -20632 -33170 -27682 -27047 -8920 3580 8971 3213 -4
6041dJ0265K2796Q062J222k0596j7516J1693J0328P243j3732j2824n629O905J381
$$ -4 10261 33057 41119 42341 21745 4229 15922 26250 33493 19761 6937 1308 8213 9594
6027I594J7990p724j1558j797k389N688J645j4567M368K024l289k64j9017j619
$$ 9594 27584 19860 8302 6505 4116 9804 11449 -3118 1250 3274 -15 -279 -19296 -20915
6013b0915n316M657q08M991o586Q787j75P870Q113L945p168p838l840L552j745
$$ -20915 -26231 -21574 -22382 -17391 -23977 -15190 -15365 -7495 618 4563 -2605 -10443 -14283 -10731 -12476
5998a2476M556J6947O412M828p149j6255k913p585j354L113l408J152o745J0762
$$ -12476 -7920 9027 15439 20267 13118 -3137 -6050 -13635 -14989 -11876 -15284 -14132 -20877 -10115
5984a0115J2409n649n699M323j296m105J7951J5729m049k7138j8043j1885J5546
$$ -10115 2294 -3355 -9054 -4731 -6027 -10132 7819 23548 19499 -7639 -25682 -37567 -22021
5971b2021J2527j1483j3664l437P027R352J0158K1132J2148O970j1806k2514j9199
$$ -22021 -9494 -20977 -34641 -38078 -31051 -21699 -11541 9591 21739 28709 16903 -5611 -24810
5958b4810o649M476J4911j768K476N615J80Op94O102o508q679J0401P171K177
$$ -24810 -31459 -26983 -12072 -13840 -11364 -5749 -5569 -5563 -6357 -255 -6763 -15442 -5041 2130 4307
5943D307p425k3086r205J679R087l946j0168J1749J277o7Q716M056m214r430J909
$$ 4307 -3118 -26204 -35409 -33730 -24643 -28589 -38757 -27008 -25731 -25798 -17082 -13026 -17240 -26670 -24761
5928b4761Q574R952k512O99J4387J1062l329J0842J0716k445k1532k4240r152
$$ -24761 -16187 -6235 -8747 -8048 6339 17401 14072 24914 35630 33185 11653 -12587 -21739
5915b1739K656n901k796J292j927N253J4282J0049q794N170N974m995j1833q994
$$ -21739 -19083 -24984 -27780 -26488 -28415 -23162 -8880 1169 -7625 -2455 3519 -1476 -13309 -22303
5901b2303j6731J2585M106n95L689O662n272j8100J454O269J7093Q907j1105J0554
$$ -22303 -39034 -26449 -22343 -22938 -19249 -12587 -17859 -35959 -34505 -28236 -11143 -2236 -13341 -2787
5887b787p372j2433l848O070J276j1155q144L468O757K637O940p221p32L507L121
$$ -2787 -10159 -22592 -26440 -20370 -19094 -30249 -38393 -34925 -28168 -25531 -18591 -25812 -26544 -23037 -19916
5872a9916O91k975P524N387j685O294p322m354l957N600N791r383p986O964j617
$$ -19916 -19225 -22200 -14676 -9289 -10974 -4680 -12002 -16356 -20313 -14713 -8922 -18305 -26291 -19327 -20944
5857b0944R584q216K209l040N152N992J2272N102j3084N793J476j2912j3400R935
$$ -20944 -11360 -19576 -17367 -20407 -15255 -9263 3009 8111 -4973 820 2296 -10616 -24016 -14081
5843a4081R773J1321O616p870O011k877k0866q185J853O689K644n144n118L300
$$ -14081 -4308 7013 13629 5759 11770 8893 -11973 -20158 -18305 -11616 -8972 -14116 -19234 -15934
5829a5934K968o088L248L747N118n819J2516L092j601m192Q81j164k0880k148
$$ -15934 -12966 -19054 -15806 -12059 -6941 -12760 -244 2848 1247 -2945 -2064 -3228 -24108 -26256
5815b6256J2762M505M623L492j964j3737k842O664N520P067J531j9096o601J8930
$$ -26256 -13494 -8989 -4366 -874 -2838 -16575 -19417 -12753 -7233 -166 1365 -17731 -24332 -5402
5801e402J0418p744k298O956M016Q87l728o738J368j215J2145j9021j6609j0445
$$ -5402 5016 -2728 -5026 1930 5946 6833 3105 -3633 -2265 -3480 8665 -10356 -26965 -37410
5787c7410J0686J2985J9265N079j2473L963P131O260j8553o014J4991j780l165
$$ -37410 -26724 -13739 5526 10605 -1868 2095 9226 15486 -3067 -9081 5910 4130 965
5774I65r613O720L564R000J1747j0132J077k11P971J97n918o969r251J687j7466
$$ 965 -8648 -1928 1636 10636 22383 12251 13328 13117 21088 21285 15367 8398 -853 834 -16632
5759a6632p218j983n20M816L88J56J1740l723o899p422R251J3116j809K384l691
$$ -16632 -23850 -25833 -26353 -21537 -21149 -20993 -9253 -12976 -19875 -27297 -18046 -4930 -6739 -4355 -8046
5744h046K229J7577j6673j4598J5583J0417j1904K569p198j0981k856M607L379
$$ -8046 -5817 11760 -4913 -19511 -3928 6489 -5415 -2846 -10044 -21025 -23881 -19274 -15895
5731a5895l054J4670J6731R626K500p611j3549j771l638J926M564p02j4972k0375
$$ -15895 -18949 -4279 12452 22078 24578 16967 3418 1647 -1991 -65 4499 3797 -11175 -31550
5717c1550j2325P600M988j0106L089J0614J3442L647P482k0700k2195k04J0518
$$ -31550 -43875 -36275 -31287 -41393 -38304 -27690 -14248 -10601 -3119 -23819 -46014 -46218 -35700
5704c5700K8658K3519J0741j5035j0386j9017L553O297l912J8249m951j4135q148
$$ -35700 -7042 16477 27218 12183 1797 -17220 -13667 -7370 -11282 6967 2016 -12119 -20267
5691b0267J169j0703k16m054J1194J8465K7665J348q832j5850J753J5043J1408
$$ -20267 -19098 -29801 -30017 -34071 -22877 -4412 23253 24601 15769 -81 1672 16715 28123
5678B8123o453j7101j1031J223N222m371p128l30J1326Q223j0029j1243J997k531
$$ 28123 21670 4569 -6462 -5239 -17 -4388 -11516 -11846 -520 7703 -2326 -13569 -11572 -14103
5664a4103o035K853K716l665K632l206J6809K3773J3320k1427j1605Q011O631
$$ -14103 -20138 -17285 -14569 -18234 -15602 -18808 -1999 21774 35094 13667 2062 10073 16704
5651A6704l434q563j3655L665J0780J1561j1186j6666J195k403j2091o539j4614
$$ 16704 13270 4707 -8948 -5283 5497 17058 5872 -10794 -9599 -12002 -24093 -30632 -45246
5638d5246J1160J5677j2358J0304Q439M685k497k426n786R711R778j2995m224
$$ -45246 -34086 -18409 -30767 -20463 -12024 -7339 -9836 -12262 -18048 -8337 1441 -11554 -15778
5625a5778j864m867K5546J6857j6232Q096l56o814p473m296j0362n823J1238J2808
$$ -15778 -17642 -22509 3037 19894 3662 11758 11402 4588 -2885 -7181 -17543 -23366 -12128 680
5611F80r01j4016L997J8501j333l923P702J1162K67N97j2097m437j7658j3827
$$ 680 -221 -14237 -10240 8261 6928 3005 10707 21869 22136 22733 10636 6199 -11459 -25286
5597b5286P358J9046J0073k5000l732J7965M152k991P110Q818k5885j664J8744
$$ -25286 -17928 1118 11191 -13809 -17541 424 4576 1585 8695 17513 -8372 -10036 8708
5584H708q632j0288J0353j641j7545j2616K727J3336J2975K193r900j3010n131
$$ 8708 76 -10212 141 -1500 -19045 -31661 -28934 -15598 -2623 -430 -10330 -23340 -28471
5571b8471p168j1058M170J764R144J7773k072j5296p308p08P874J022Q323K380
$$ -28471 -35639 -46697 -42527 -40763 -31619 -13846 -15918 -31214 -38522 -39230 -31356 -30334 -22011 -19631
5557a9631M651J1820m26L56L535L688L266r728m964j0808j1576K0752N127P70
$$ -19631 -14980 -3160 -3586 -3230 305 3993 7259 -2469 -7433 -18241 -29817 -9065 -3938 -3168
5543c168r660J0071N871j2879j939M000m189K651M563r435j6731K877J9706J6743
$$ -3168 -12828 -2757 3114 -9765 -11704 -7704 -11893 -9242 -4679 -14114 -30845 -27968 -8262 8481
5529H481L184J082R866q045j5332p387O855O983J894p668k681k055m18j781M538
$$ 8481 11665 12747 22613 14568 -764 -8151 -1296 5687 7581 -87 -2768 -4823 -5241 -7022 -2484
5514b484l958L981O541j7507l488J5358k492M906J537j4362J3025r645q411O945
$$ -2484 -6442 -2461 4080 -13427 -16915 -1557 -4049 857 2394 -11968 1057 -8588 -16999 -10054
5500a0054p948q167J7680n922N805J0539K366j4636k889r995L049K5146K624j5634
$$ -10054 -18002 -26169 -8489 -14411 -8606 1933 4299 -10337 -13226 -23221 -20172 4974 7598 -8036
5486h036N136P859J10r323P634m322M286j7258M3J7475o257q237o364l235J013
$$ -8036 -2900 4959 5069 -4254 3380 -942 3344 -13914 -13871 3604 -2653 -10890 -17254 -20489 -19476
5471a9476J4926J4206j4196j408J3468k2560k6954p245J1760K2658O645p559m896
$$ -19476 -4550 9656 -4540 -5948 7520 -15040 -41994 -49239 -37479 -14821 -8176 -15735 -20631
5458b0631n634r681m07J9927M907Q006l842L615j4272J034J5240l199j3860P492
$$ -20631 -26265 -35946 -36353 -16426 -11519 -3513 -7355 -3740 -18012 -16978 -1738 -4937 -18797 -11305
5444a1305K557O395J643j017j218j278J628j8132M135J001K381j624M479J2257
$$ -11305 -8748 -2353 -710 -1727 -2945 -4223 -2595 -20727 -16592 -15591 -13210 -14834 -10355 1902
5430A902n362J0005j2503j0499L199l131L080j0162o720J450J6814o411o533Q297
$$ 1902 -3460 6545 -5958 -16457 -13258 -16389 -13309 -23471 -30191 -28741 -11927 -18338 -24871 -16574
5416a6574J7781O816m601q380l200r329J9913J7986r953p124l598j4380n691J2164
$$ -16574 1207 8023 3422 -4958 -8158 -17487 2426 20412 10459 3335 -263 -14643 -20334 -8170
5402h170l486m343q320J0390J4336L299o120j1488K210P574l439M281l530L225
$$ -8170 -11656 -15999 -24319 -13929 407 3706 -2414 -13902 -11692 -4118 -7557 -3276 -6806 -3581
5388c581L789j0278p802L734p776O671J5112p090M789N670j0626L403J0991j2513
$$ -3581 208 -10070 -17872 -14138 -21914 -15243 -131 -7221 -2432 3238 -7388 -3985 7006 -5507
5374e507q697k931k222Q560j671k419Q732R616m222K912qn157o702O047q990j727
$$ -5507 -14204 -17135 -19357 -10797 -12468 -14887 -6155 3461 -761 2151 2143 -3014 -9716 -3669 -12659 -14386
5358a4386l432m458j5204k925n157J1916M871l41J9146K1832k931j8833M096m849
$$ -14386 -17818 -22276 -37480 -40405 -45562 -33646 -28775 -29116 -9970 11862 8931 -9902 -5806 -10655
5344a0655o312j3159R960R480L488J519j830k0362J0082J5436p608r094N493k613
$$ -10655 -16967 -30126 -20166 -10686 -7198 -5679 -7509 -27871 -17789 -2353 -9961 -19055 -13562 -16175
5330a6175j440J325J1107r44j5047Q863p359j4316j967P183Q262r665j2019p041
$$ -16175 -17615 -16290 -5183 -6127 -21174 -12311 -19670 -33986 -35953 -28770 -20508 -30173 -42192 -49233
5316d9233L935J0482p71M591j0198J0219K7685J3361q056j0904k64K977r155j28
$$ -49233 -45298 -34816 -35587 -30996 -41194 -30975 -3290 10071 2015 -8889 -9153 -6176 -15331 -15459
5302a5459L920k897P25R499k101Q60k437l740k502j4176j2411J7625L0561R678
$$ -15459 -11539 -14436 -13711 -4212 -6313 -5453 -7890 -11630 -14132 -28308 -40719 -23094 7467 17145
5288A7145j8086O050O177o31p70L356k488P31j0427k3836q1J5794k022j5606O076
$$ 17145 -941 5109 11286 10655 9885 13241 10753 11484 1057 -22779 -22860 -7066 -9088 -24694 -18618
5273a8618J1783N880k087l020j922n664O437M058J364J302O545L10q783k32j3036
$$ -18618 -6835 -955 -3042 -6062 -7984 -13648 -7211 -3153 -1789 -487 6058 6368 -2415 -2647 -15683
5258a5683p496J0543J3249n80k4117j7484P11R966P168K88p161l954o582O56L824
$$ -15683 -23179 -12636 613 33 -24084 -41568 -40857 -30891 -23723 -23435 -30596 -34550 -41132 -40476 -36652
5243c6652O924M114q350M432J5952n582j2629l012m9J2136p178O119N667j994
$$ -36652 -29728 -25614 -33964 -29532 -13580 -19162 -31791 -34803 -34852 -22716 -29894 -23775 -18108 -20102
5229b0102P493P577J9399J2167k0984j8988m216k629K656p382n289q336R492J5968
$$ -20102 -12609 -5032 14367 26534 5550 -13438 -17654 -20283 -17627 -25009 -30298 -38634 -29142 -13174
5215a3174J1563o8O508j6435l217l943Q205R008j1538J399J2816K1894j6213k0232
$$ -13174 -1611 -1679 4829 -11606 -14823 -18766 -10561 -1553 -13091 -11692 1124 23018 6805 -13427
5201a3427k633p683k31N187l597P062L626j8563J257P667J5554J6296L528j1296
$$ -13427 -16060 -23743 -23974 -18787 -22384 -15322 -11696 -30259 -29002 -21335 -5781 10515 14043 2747
5187B747k4875n552N683M728O337M850J4869L106j2574j4016r454O131J1222K178
$$ 2747 -22128 -27680 -21997 -17269 -10932 -6082 8787 11893 -681 -14697 -24151 -18020 -6798 -4620
5173d620o315r518R412K1568l90l2317j4108K3753O681k550N188J2705k530j0500
$$ -4620 -10935 -20453 -11041 10527 10137 -22180 -36288 -12535 -5854 -8404 -3216 9489 6959 -3541
5159c541l426Q239J5453Q209j4307j5275L723n716Q489J6620j1517j9161k048
$$ -3541 -6967 1272 16725 24934 10627 -4648 -925 -6641 1848 18468 6951 -12210 -14258
5146a4258L519R309J0866m794O650m290J858k29l225j1925l273Q603J8863N742
$$ -14258 -10739 -1430 9436 4642 11292 7002 8860 8631 5406 -6519 -9792 -1189 17674 23416
5132B3416j0872j4494n120l641l433K772n727n594P059P155l763n778j4998r438
$$ 23416 12544 -1950 -7070 -10711 -14144 -11372 -17099 -22693 -15634 -8479 -12242 -18020 -33018 -42456
5118d2456Q40P263p638j2425R088K0190J0689M006N380J1N790l746p06j0380j1588
$$ -42456 -41616 -34353 -41991 -54416 -45328 -25138 -14449 -10443 -5063 -5052 738 -3008 -3714 -14094 -25682
5103b5682M83J2257L764k398N873J9486O276O633l082j3509O369J780l841p498
$$ -25682 -25199 -12942 -9178 -11576 -5703 13783 20059 26692 23610 10101 16470 18250 14409 6911
5089F911o700j3182o555j359P826R664P491Q050R440J210k340j1489j813j0505
$$ 6911 211 -12971 -19526 -20885 -13059 -3395 4096 12146 21586 22796 20456 8967 7154 -3351
5075c351k5146J3432J0153M20m154r38J29m798R127L504P61r786m088q421n506
$$ -3351 -28497 -15065 -4912 -4492 -8646 -9584 -9455 -14253 -5126 -1622 -861 -10647 -14735 -23156 -28662
5060b8662R135P436L481o884J0587J509K432N166J862l267m020l767j0275O50
$$ -28662 -19527 -12091 -8610 -15494 -4907 -3398 -966 4200 6062 2795 -1225 -4992 -15267 -14617
5046a4617J337J724L504l92o182q768L178k605k735J0747J1320n885R612J2778
$$ -14617 -13280 -11556 -8052 -8444 -14626 -23394 -20216 -22821 -25556 -14809 -3489 -9374 238 13016
5032A3016q196l297K554J0790K17Q39l809j8322j5413O061R00q380L298J1891
$$ 13016 4820 1523 4077 14867 15084 15923 12114 -6208 -21621 -15560 -14660 -23040 -19742 -7851
5018g851M928J1331J368J471j5505k1801L29N936n819J443P034K354l37R683k961
$$ -7851 -2923 8408 9776 11247 -4258 -26059 -25730 -19794 -25613 -24170 -17136 -14782 -15119 -5436 -8397
5003h397l195K522L681J1367q548m501O291o059j3390j4396P488O318K9568Q416
$$ -8397 -11592 -9070 -5389 5978 -2570 -7071 -780 -6839 -20229 -34625 -27137 -20819 8749 17165
4989A7165K755j7007j3171J1865P640N607q096q330M392m511r3R998J290L111
$$ 17165 19920 2913 -10258 1607 9247 14854 6758 -1572 2820 -1691 -1784 8214 9504 12615
4975A2615n208k304K423j0344K911K0705J6189N322o601J29j4172n083n067R82
$$ 12615 7407 5103 7526 -2818 93 20798 36987 42309 35708 35837 21665 16582 11515 12497
4961A2497m151j5524j0407J6181j058j3238L08p741N262R462O059q28k417N876
$$ 12497 8346 -7178 -17585 -1404 -2462 -15700 -15392 -23133 -17871 -8409 -2350 -3178 -5595 281
4947B81J4693J125Q870j2166j3668j0673j2540N161N58j342J2048R076k824k971
$$ 281 14974 16099 24969 12803 -865 -11538 -24078 -18917 -18359 -19701 -7653 1423 -1401 -4372
4933d372l666R558r849o330N973O056p432J4922J9100Q388k922k8108n15J2014
$$ -4372 -8038 1520 -8329 -14659 -8686 -2630 -10062 4860 23960 32348 29426 1318 803 12817
4919A2817j0268q702M260P253M154J674J0504j543j6991m279L049j0518j1522
$$ 12817 2549 -6153 -1893 5360 9514 11188 21692 20149 3158 -1121 1928 -8590 -20112
4906b0112Q287J1711N437k351r160r15J726P151J1224l781j8545p776Q723P026
$$ -20112 -11825 -114 5323 2972 -6188 -7103 -5377 1774 12998 9217 -9328 -17104 -8381 -1355
4892a355j5602m231j1343k458K302j1944L342K0090K9850J3383j3227M962j791
$$ -1355 -16957 -21188 -32531 -34989 -32687 -44631 -41289 -21199 8651 22034 8807 13769 11978
4879A1978L595k990j5558j404N907n074P478j1813j2255j610M99L831J0088K653
$$ 11978 15573 12583 -2975 -4379 1528 -3546 3932 -7881 -20136 -21746 -21247 -17416 -7328 -4675
4865d675R780m202J538J3905P692K2904l238m5003j4010K2146J9660J102J124
$$ -4675 5105 903 2441 16346 24038 46942 43704 -1299 -15309 6837 26497 27599 28723
4852B8723o195m921l186j6284j8073O260Q822p868n837N538L559J5420O907l207
$$ 28723 22528 17607 14421 -1863 -19936 -13676 -4854 -12722 -18559 -13021 -9462 5958 12865 9658
4838I658N61n030j2719n696P12L332R9P675L048k447j7461j7375R904K7562J0031
$$ 9658 10219 5189 -7530 -13226 -12514 -9182 -9083 -1408 1640 -807 -18268 -35643 -25739 1823 11854
4823A1854j5282j6932P468r587O335J6710j4308j1623N327J5135P625R84K989
$$ 11854 -3428 -20360 -12892 -22479 -16144 566 -13742 -25365 -20038 -4903 2722 3706 6695
4810F695r147k158j3577j273J0157p706j70K205J842J2040n244j4626P280J6014
$$ 6695 -2452 -4610 -18187 -19460 -9303 -17009 -17179 -14974 -13132 -1092 -6336 -20962 -13682 2332
4796B332L581R291j2354K534O612q205k6433q295j7542K2025K0863j0408n248
$$ 2332 5913 15204 2850 5384 11996 3791 -22642 -30937 -48479 -26454 -5591 -15999 -21247
4783b1247r338L433J6064P368J691M608q189j2895j1531o03K6139M41L512R953
$$ -21247 -30585 -27152 -11088 -3720 -2029 2579 -5610 -18505 -30036 -30639 -4500 -4059 -547 9406
4769I406p021J326n124K047J0515L143qo193p493P2J233r56j1562P063L592p180
$$ 9406 2385 3711 -1413 634 11149 14292 14284 8091 598 670 1903 947 -10615 -3552 40 -7140
4753g140K792q344j4733k58J7960K525R795l414q222N102J5527r425p248r94K4465
$$ -7140 -4348 -12692 -27425 -27683 -9723 -7198 2597 -817 -9039 -3937 11590 2165 -5083 -6077 18388
4738A8388J1564l520j4712j7549j516J4289n084R868J5005j6313n418o692l56
$$ 18388 29952 26432 11720 -5829 -7345 6944 1860 11728 26733 10420 5002 -1690 -2046
4725b046j2434m198J2112J5638J993j2217k672l236j2531J1972j1545j0962P535
$$ -2046 -14480 -18678 -6566 9072 11065 -1152 -3824 -7060 -19591 -7619 -19164 -30126 -22591
4712b2591J1823o85j2479M304p857p51k625R933j4673R734K892J371O060L789
$$ -22591 -10768 -11453 -23932 -19628 -27485 -28236 -30861 -20928 -35601 -25867 -22975 -21604 -15544 -11755
4698a1755j876O387R209j0764J1954M420j7301r416R133Q287n82p794J019J4631
$$ -11755 -13631 -7244 1965 -8799 3155 7575 -9726 -19142 -10009 -1722 -2304 -10098 -9079 5552
4684E552N93p360n410J1044m596p507n228m590p414Q40P782K8605J0120j4713
$$ 5552 6145 -1215 -6625 4419 -177 -7684 -12912 -17502 -24916 -24076 -16294 12311 22431 7718
4670G718J7263n958k5814j7856N230J0639P247m75p21p712p196N907M221o509
$$ 7718 24981 19023 -6791 -24647 -19417 -8778 -1531 -2006 -2727 -10439 -17635 -11728 -7507 -14016
4656a4016j496K303j205o366k035q149k89J3159q53o74J1761O862O371M149j3355
$$ -14016 -15512 -13209 -14414 -20780 -22815 -30964 -31253 -18094 -18947 -19621 -7860 -998 5373 9522 -3833
4641c833p532l900P732J1174l138j0263N121M962J009j940j0001Q898J0332N094
$$ -3833 -11365 -15265 -7533 3641 503 -9760 -4639 323 1332 -608 -10609 -1711 8621 13715
4627A3715N527m135N10J6K535p910l612o006j2856K298n280p641j3622N359J3050
$$ 13715 19242 15107 15617 15633 18168 10258 6646 640 -12216 -9918 -15198 -22839 -36461 -31102 -18052
4612a8052J6173R68J0787j8793p022N391P065j1373p848O162K296N210Q467J0659
$$ -18052 -1879 -911 9876 -8917 -15939 -10548 -3483 -14856 -22704 -16542 -14246 -9036 -569 10090
4598A0090N392k1868j0052R321o938j0866j8914j146K3813J0694N571o844N442
$$ 10090 15482 -6386 -16438 -7117 -14055 -24921 -43835 -44981 -21168 -10474 -4903 -11747 -6305
4585f305O720o524m849n263m748n437N533N376r429j0518K5590K5090J2222j6950
$$ -6305 415 -6109 -10958 -16221 -20969 -26406 -20873 -15497 -24926 -35444 -9854 15236 27458 10508
4571A0508k3671o116K370m018r936J959J1001J0580p915o237K102M6k585j114
$$ 10508 -13163 -19279 -16909 -20927 -30863 -28904 -17903 -7323 -15238 -21475 -19373 -19327 -21912 -23026
4557b3026Q135j1137l704L893Q444J8069j2398Q725K634k2687J4465l491R789
$$ -23026 -14891 -26028 -29732 -25839 -17395 674 -11724 -2999 -365 -23052 -8587 -12078 -2289
4544b289j5788k750L247p283N471r24o595N580l476N55J0608R283j143o220n549
$$ -2289 -18077 -20827 -17580 -24863 -19392 -20316 -26911 -21331 -24807 -24252 -13644 -4361 -5504 -11724 -17273
4529a7273Q892l218L154j423r26p119j7138O251Q524j194p048q470K2191J2480
$$ -17273 -8381 -11599 -8445 -9868 -10794 -17913 -35051 -28800 -20276 -21470 -28518 -36988 -14797 -2317
4515b317r476j3385J203k747O965J6256Q705k566J3016m341n063p399o038K733
$$ -2317 -11793 -25178 -23975 -26722 -19757 -3501 5204 2638 15654 11313 6250 -1149 -7187 -4454
4501d454L412k276O795K22j7648q715J3865J1843L145j051j997l9J263p110K272
$$ -4454 -1042 -3318 3477 3699 -13949 -22664 -8799 3044 6189 5138 3141 3102 4365 -2745 -473
4486d73J2398O493K274j7542o104J4119R60k1229m030j621q224j637m144P320
$$ -473 11925 18418 20692 3150 -2954 11165 12125 -9104 -13134 -14755 -22979 -24616 -28760 -21440
4472b1440J0759j1027K1254k900l639P779l73j6038K8132J1791P233N084j2944
$$ -21440 -10681 -21708 -454 -3354 -6993 786 413 -15625 12507 24298 31531 36615 23671
4459B3671k4747k633j207L580N252K144n018M22o154l364p823N811l809M323p195
$$ 23671 -1076 -3709 -4916 -1336 3916 6060 1042 1464 -4690 -8054 -15877 -10066 -13875 -9552 -16747
4444a6747j2000O737J0726q426Q728j4188r598K10J4158J6799J2129q053j2955
$$ -16747 -28747 -22010 -11284 -19710 -10982 -25170 -34768 -34558 -20400 -3601 8528 475 -12480
4431a2480K150k001J887j30n226N800K880j472J149J0149j0160j2570j8J4647
$$ -12480 -10330 -12331 -10444 -10574 -15800 -10000 -7120 -8592 -7443 2706 -7454 -20024 -20042 -5395
4417e395L1789R957j6164k9275j481J6127P833l65j4063M181j0864P903N491n649
$$ -5395 26394 36351 20187 -9088 -10569 5558 13391 13026 -1037 3144 -7720 183 5674 25
4403B5K810R626k294L388j96r54R558m001K576n952M647J274J251M496l399q590
$$ 25 2835 12461 10167 13555 13359 12405 21963 17962 20538 14586 19233 20507 21758 26254 22855 14265
4387A4265j013N451o652j410Q02k497l095p585j0114l394J0766m830J6205P975
$$ 14265 13252 18703 12051 10641 11443 8946 5851 -1734 -11848 -15242 -4476 -9306 6899 14874
4373A4874n056J3074k1580k7039l164J340Q435p134r933k28R825r01J3944l018
$$ 14874 9818 22892 1312 -25727 -28891 -27551 -19116 -26250 -36183 -36411 -26586 -27487 -13543 -16561
4359a6561N139j437Q968L662P279o514j3479q855P89j607k948J4062R536m766
$$ -16561 -11422 -12859 -3891 -229 7050 536 -12943 -21798 -21009 -22616 -25564 -11502 -1966 -6732
4345f732k946j8215q6O505J7146n169r197L263K1609n122N703M816l350j501R018
$$ -6732 -9678 -27893 -27979 -21474 -4328 -9497 -18694 -15431 6178 1056 6759 11575 8225 6724 15742
4330A5742j9003p122k0742j1455K2021M732n760k0966N036J6369O747N747l056
$$ 15742 -3261 -10383 -31125 -42580 -20559 -15827 -21587 -42553 -37517 -21148 -14401 -8654 -11710
4317a1710N812j763r758n198o355Q617J1270n477k100N471m713q273K665N783
$$ -11710 -5898 -7661 -17419 -22617 -28972 -20355 -9085 -14562 -16662 -11191 -15904 -24177 -21512 -15729
4303a5729p311K506R46j0860j176J0701K8685M798j2501J51j1441l306J3109j2781
$$ -15729 -23040 -20534 -19588 -30448 -31624 -20923 7762 12560 59 210 -11231 -14537 -1428 -14209
4289a4209K2K1539P275N366N169j5383n956q981n120M659J463k184n934o703k07
$$ -14209 -14187 7352 14627 19993 25162 9779 3823 -5158 -10278 -5619 -4156 -6340 -12274 -18977 -19184
4274a9184Q157J1269L07P643R698l570L288o511j2043j090n812N289K227K961
$$ -19184 -11027 242 549 8192 17890 14320 17608 11097 -946 -2036 -7848 -2559 -332 2629
4260B629O793l549m352J1756R183L313O0j6687L669o00p512n119K486P63L894
$$ 2629 9422 5873 1521 13277 22460 25773 25833 9146 12815 12215 4703 -416 2070 2833 6727
4245F727n766p970J0602j6862J0742J705M275j0226j7933O528Q871m477q49L734
$$ 6727 961 -7009 3593 -13269 -2527 -822 3453 -6773 -24706 -18178 -9307 -13784 -14633 -10899
4231a0899o637K217M256p246Q867O128j1774N656N378p058N490l383k06J004m714
$$ -10899 -17536 -15319 -11063 -18309 -9442 -3314 -15088 -9432 -4054 -11112 -5622 -9005 -9211 -8207 -12921
4216a2921M69R882M919j666J400p264l871l649K0100P221K971j9581r941q48J0532
$$ -12921 -12452 -2570 2349 683 2083 -5181 -9052 -12701 7399 14620 17591 -1990 -11931 -12779 -2247
4201b247J0013k476J140o623K077J9969K318j7416J633J1256k2051k4260J8658
$$ -2247 7766 5290 6430 -193 1884 21853 24171 6755 8388 19644 -2407 -26667 -8009
4188h009J2036p220m451k913q746K267J6617j5652l781P021m427M609K5142N819
$$ -8009 4027 -3193 -7644 -10557 -19303 -17036 -419 -16071 -19852 -12831 -17258 -12649 12493 18312
4174A8312j0300k759K250L306j3219o337Q363o494Q769q06j0506J3671M313k5479
$$ 18312 8012 5253 7503 10809 -2410 -8747 -384 -6878 1891 1085 -9421 4250 8563 -16916
4160a6916m753L134R587K8166Q50j2204o495n651K2271j868k3906r05J5948m66
$$ -16916 -21669 -18535 -8948 19218 20068 7864 1369 -4282 17989 16121 -7785 -8690 7258 6792
4146F792j2195n826O469r665m369n111j297J5149J7257j2078q074J4911K878k5885
$$ 6792 -5403 -11229 -4760 -14425 -18794 -23905 -25202 -10053 7204 -4874 -12948 1963 4841 -21044
4132b1044j2936K601J8328P927j6961J9256J0299j4797R12J0526N199m637j3922
$$ -21044 -33980 -31379 -13051 -5124 -22085 -2829 7470 -7327 -6415 4111 9310 4673 -9249
4119i249O030J4960l90j6780O220j0827o967L182j113m148P988P527m068K293
$$ -9249 -3219 11741 11351 -5429 791 -10036 -17003 -13821 -14934 -19082 -11094 -3567 -7635 -5342
4105e342K56j2685K995L217q482k67J1825J4425J1466r59j2383j8407K604L4119
$$ -5342 -5086 -17771 -14776 -11559 -20041 -20308 -8483 5942 17408 16449 4066 -14341 -11737 22382
4091B2382n498K492K879j039K285j62l36j330L554O187J285q639K31J279l091
$$ 22382 16884 19376 22255 21216 23501 23339 23003 21673 25227 31414 32699 24060 24291 25570 22479
4076B2479j4445j3441j704N219m271m513O794L922o289K711k122j1379L72L617
$$ 22479 8034 -5407 -7111 -1892 -6163 -10676 -3882 40 -6249 -3538 -5660 -17039 -16667 -13050
4062a3050k428R561P120j9406J211J789o25N257M302R537J8356J464k03o323j0029
$$ -13050 -15478 -5917 1203 -18203 -16992 -15203 -15828 -10571 -6269 3268 21624 23088 22885 16562 6533
4047F533q597l45j972J680J356Q107Q612o830j4324q091K138Q492J3760P832l918
$$ 6533 -2064 -2409 -4381 -2701 -1345 6762 15374 8544 -5780 -13871 -11733 -3241 10519 18351 14433
4032A4433p955j2559j7335p491O283m584J7537J4844K711m302J1738q466n495
$$ 14433 6478 -6081 -23416 -30907 -24624 -29208 -11671 3173 5884 1582 13320 4854 -641
4019f41l155o113k886L433J1877j1543J404M948J6410N482j4500j1919p791R877
$$ -641 -3796 -9909 -12795 -9362 2515 -9028 -7624 -2676 13734 19216 4716 -7203 -14994 -5117
4005e117L535q736L037P664L686l056j4383p736l174Q058J3925l506K55j473K004
$$ -5117 -1582 -10318 -7281 383 4069 1013 -13370 -21106 -24280 -16222 -2297 -5803 -5548 -7021 -5017
3990e017J022O640K0751L720j2853j7226n178P287N757J3840j9379j3629N154
$$ -5017 -3995 2645 23396 27116 14263 -2963 -8141 -854 4903 18743 -636 -14265 -9111
3977i111L562M554P829K4321k1341q58J1952j452j4725O723L71J2372k150k4392
$$ -9111 -5549 -995 6834 31155 9814 8956 20908 19456 4731 11454 11825 24197 22047 -2345
3963b345k1006n499J2721J0653O247Q389O780j501Q073K855l92o298l2340L148
$$ -2345 -23351 -28850 -16129 -5476 771 9160 15940 14439 22512 25367 24975 18677 -13663 -10515
3949a0515J2493J0876K070L604o424q606j4870n468K8740J0825k1914j2220j4620
$$ -10515 1978 12854 14924 18528 12104 3498 -11372 -16840 11900 22725 811 -11409 -26029
3936b6029q900K0447J0618o260p49J2676j6813n203j974J9288j606m245N415J3355
$$ -26029 -34929 -14482 -3864 -10124 -10873 1803 -15010 -20213 -22187 -2899 -4505 -8750 -3335 10020
3922A0020n692O556K426R918n20l423K313O254N934j0619J1463N637j9836j4445
$$ 10020 4328 10884 13310 23228 22708 19285 21598 27852 33786 23167 34630 40267 20431 5986
3908E986K044J5049M03j8624n920j2192j0783n068J9662J8134j632n866j4464
$$ 5986 8030 23079 23482 4858 -1062 -13254 -24037 -29105 -9443 8691 7059 1193 -13271
3895a3271n890K637j629J577L996j1141k39n589K248Q48J838j7702j4482Q883
$$ -13271 -19161 -16524 -18153 -16576 -12580 -23721 -23960 -29549 -27301 -26453 -24615 -42317 -56799 -47916
3881d7916K826J7762O723j268J785J1701J3473l291O892J2068L302j1909o627
$$ -47916 -45090 -27328 -20605 -21873 -20088 -8387 5086 1795 8687 20755 24057 12148 5521
3868E521j9949k089K048j1492J6755K0699o07j6516r827J787J472M510j1086o678
$$ 5521 -14428 -16517 -14469 -25961 -9206 11493 10886 -5630 -15457 -13670 -12198 -7688 -18774 -25452
3854b5452O891M945m212n15o776j158o948N392j113n023J8606J6037j0246O37
$$ -25452 -18561 -13616 -17828 -18343 -25119 -26277 -33225 -27833 -28946 -33969 -15363 674 -9572 -8935
3840h935n635R624L892Q47k176j881L782O144l782L57R127J0566p348K555j996
$$ -8935 -14570 -4946 -1054 -207 -2383 -4264 -482 5662 1880 2237 11364 21930 14582 17137 15141
3825A5141j016j1457p818N918p950O824Q604q583j5761p492J4655J4956p40O263
$$ 15141 14125 2668 -5150 768 -7182 -358 8246 -337 -16098 -23590 -8935 6021 5281 11544
3811A1544J8470M444q885n586n95j001m559L652j5583j9874J3272K4115J1707
$$ 11544 30014 34458 25573 19987 19392 18391 13832 17484 1901 -17973 -4701 19414 31121
3798C1121j4385j5491k6003p735J4553J3673n12j105R64o278P58k62Q841m256
$$ 31121 16736 1245 -24758 -32493 -17940 -4267 -4779 -5884 -4920 -11198 -10440 -10702 -1861 -6117
3784f117Q927J5920j3871n250P026o980k2509O423j612p168n514J1060R52J4025
$$ -6117 2810 18730 4859 -391 6635 -345 -22854 -16431 -18043 -25211 -30725 -19665 -18713 -4688
3770d688L420j0320K128J0697m438j3473J2164K3138r393n446o119O474l033p139
$$ -4688 -1268 -11588 -9460 1237 -3201 -16674 -4510 18628 9235 3789 -2330 4144 1111 -6028
3756f028J6287l34o656j18R77j4796N08J5234m589m575k900M524N947K065j8596
$$ -6028 10259 9925 3269 3151 4128 -10668 -10160 5074 485 -4090 -6990 -2466 3481 5546 -13050
3741a3050m717J816m061K4226J3715K1193l424j4192j3010j5551O2K1768J654
$$ -13050 -17767 -15951 -20012 4214 17929 39122 35698 21506 8496 -7055 -6993 14775 16429
3728A6429j731p161J218k883R955J7435p501L458N780M38J0042O224k3346j4356
$$ 16429 14698 7537 8755 5872 15827 33262 25761 29219 34999 35437 45479 51703 28357 14001
3714A4001r296J7010N780o409o357o553l516m528Q167l688l804J2244k830o079
$$ 14001 4705 21715 27495 21086 14729 8176 4660 132 8299 4611 807 13051 10221 4142
3700D142j2144k269N829Q978Q718k1612n227J564M120N636j6728p564n14j451
$$ 4142 -8002 -10271 -4442 4536 13254 -8358 -13585 -12021 -7901 -2265 -18993 -26557 -27071 -28522
3686b8522K507P664j93k371L311J7132r439M678L969J4769P416j2471P382m180
$$ -28522 -26015 -18351 -18544 -20915 -17604 -472 -9911 -5233 -1264 13505 20921 8450 15832 11652
3672A1652j4440P384K619r454q815k055j799J007J2821o047J647K093J2134J6575
$$ 11652 -2788 4596 7215 -2239 -11054 -13109 -14908 -13901 -1080 -7127 -5480 -3387 8747 25322
3658B5322j0609j3899l665M094P043l210o916p231j4097M006J1949l662k1557
$$ 25322 14713 814 -2851 1243 8286 5076 -1840 -9071 -23168 -19162 -7213 -10875 -32432
3645c2432o896l21J5281K0011j837P407K507j6035k0377M562J9997K823m522j4665
$$ -32432 -39328 -39649 -24368 -4357 -6194 1213 3720 -12315 -32692 -28130 -8133 -5310 -9832 -24497
3631b4497M016N527J2812j059j0454J3748J5718r134j69N463K978l803P591K447
$$ -24497 -20481 -14954 -2142 -3201 -13655 93 15811 6677 6508 11971 14949 11146 18737 21184
3617B1184r615j5851J1259K310Q451j2080m682j3716j786J1629q848j3568L803
$$ 21184 11569 -4282 6977 9287 17738 5658 976 -12740 -14526 -2897 -11745 -25313 -21510
3604b1510J5479J6976J4249k121j1170P972l656j2344q790L048J3201j617k34
$$ -21510 -6031 10945 25194 23073 11903 19875 16219 3875 -4915 -1867 11334 9717 9483
3591I483j909j0226K923J5436J638j0116l215q471N300j353m275P168J3238J5951
$$ 9483 7574 -2652 271 15707 17345 7229 4014 -4457 843 -510 -4785 2383 15621 31572
3577C1572l942k2752J1610Q116N756K377j3659j5740j0874R193P9k0584K726J8994
$$ 31572 27630 4878 16488 24604 30360 32737 19078 3338 -7536 1657 1736 -18848 -16122 2872
3563B872j2111N63L499Q876O249Q821j607q363J449r074l887N251p8J673M915
$$ 2872 -9239 -8676 -5177 3699 9948 18769 17162 8799 10248 1174 -2713 2538 2460 4133 9048
3548I048j6497L67M28O713J3838J3881M388l041r612j2029K1258m222j5315k0930
$$ 9048 -7449 -7082 -6654 59 13897 27778 32166 29125 19513 7484 28742 24520 9205 -11725
3534a1725p148O245O278n369R925Q189m363P305j6984m52J6027K228j0912K812
$$ -11725 -18873 -12628 -6350 -11719 -1794 6395 2032 9337 -7647 -8099 7928 10156 -756 2056
3520B056m56j1037k985n003k948N789R877J265O302Q808Q13J0875k137R255k59
$$ 2056 1600 -9437 -12422 -17425 -20373 -14584 -4707 -3442 2860 11668 12481 23356 21219 30474 30215
3505C0215j2451q627l964j514N581P536P132j4237j3783o62K0763l213m896M429
$$ 30215 17764 9137 5173 3659 9240 16776 23908 9671 -4112 -4774 15989 12776 7880 12309
3491A2309P69l543J219L451j028k022J935j6985M823l878p66K3591k603j4543
$$ 12309 13078 9535 10754 14205 13177 11155 13090 -3895 928 -2950 -3716 19875 17272 2729
3477B729j16N307j214j3822q226o870l61J5498j650k309J5648N582p584N091n658
$$ 2729 2613 7920 6706 -7116 -15342 -22212 -22573 -7075 -8725 -11034 4614 10196 2612 7703 2045
3462B045J0553j475j2273k1113q237J0929K121j241m477J2890L1280P23j3342
$$ 2045 12598 11123 -1150 -22263 -30500 -19571 -17450 -18691 -23168 -10278 21002 21725 8383
3449H383l442k648p35J2681J2611j8765j3943J0074Q194K807n506m695J503J486
$$ 8383 4941 2293 1558 14239 26850 8085 -5858 4216 12410 15217 9711 5016 6519 8005
3435H005L408j445J2802k9j5753k134k78l407l394n926j2679q072R731K84P01
$$ 8005 11413 9968 22770 22741 6988 4854 4576 1169 -2225 -8151 -20830 -28902 -19171 -18887 -18186
3420a8186j2630j7509J7140R999J4555J9735R933o342n094k9503j2351J5468Q495
$$ -18186 -30816 -48325 -31185 -21186 -6631 13104 23037 16695 11601 -17902 -30253 -14785 -6290
3407f290O808L150J0451q714p772q678j4740K889n156J619j5340J798J7548J8414
$$ -6290 518 3668 14119 5405 -2367 -11045 -25785 -22896 -28052 -26433 -41773 -39975 -22427 -4013
3393d013J5657P36R378N804j150n99q188j652n01L428p182j5789M125J6092j1042
$$ -4013 11644 12380 21758 27562 26412 25813 17625 15973 15472 18900 11718 -4071 54 16146 5104
3378E104j1329K921M062J2291l22j1136j0186J2814J5689p108j869L305j392O340
$$ 5104 -6225 -3304 758 13049 12727 1591 -8595 4219 19908 12800 10931 14236 12844 19184
3364A9184q652Q591r731N925J771p767j0011J2735J0873j211j5445p774p569O872
$$ 19184 10532 19123 9392 15317 17088 9321 -690 12045 22918 21707 6262 -1512 -9081 -2209
3350b209J2224m116j0887j0944j300J2796P660K151N680N044j8081J5962l375
$$ -2209 10015 5899 -4988 -15932 -17232 -4436 3224 5375 11055 16099 -1982 13980 10605
3337A0605k0420j1256l862M431J8465K126j72q58n25K753j762n344j1206m788
$$ 10605 -9815 -21071 -24933 -20502 -2037 89 -83 -941 -1466 1287 -475 -5819 -17025 -21813
3323b1813K834M304K0057K2857O22l0964j3279R706N785M432j0041N730l457n441
$$ -21813 -18979 -14675 5382 28239 28861 -2103 -15382 -5676 109 4541 -5500 230 -3227 -8668
3309h668P211o513k0194O434O40J3643q533j065J210L488O563R047j1167J895
$$ -8668 -1457 -7970 -28164 -21730 -21090 -7447 -15980 -17045 -15835 -12347 -5784 3263 -7904 -6009
3295f009K3593n361L382j691m054j380j1595k1312Q117R693O209j0346L279j719
$$ -6009 17584 12223 15605 13914 9860 8480 -3115 -24427 -16310 -6617 -408 -10754 -7475 -9194
3281i194j813J0266J7337O924j3224j3109l654J5945J774j0086j1843n303o898
$$ -9194 -11007 -741 16596 23520 10296 -2813 -6467 9478 11252 1166 -10677 -15980 -22878
3268b2878q178P92R263l353Q753J6038j995P99O142J1171J0814j5939j8423K90
$$ -22878 -31056 -30264 -21001 -24354 -15601 437 -1558 -759 5383 16554 27368 11429 -6994 -6704
3254f704k521l451j0116j8216j1229m718L3836J5161J8717J8263p634j7812L783
$$ -6704 -9225 -12676 -22792 -41008 -52237 -56955 -23119 -7958 10759 29022 21388 3576 7359
3241G359o120r330L605O647L424M202j729J1378R571L974r813q661o777p918r99
$$ 7359 1239 -8091 -4486 2161 5585 9787 8058 19436 29007 32981 23168 14507 7730 -188 -1187
3226a187p186j365j0864K983P901L892k542m208Q229N364m341j2856K22P907J5601
$$ -1187 -8373 -9738 -20602 -17619 -9718 -5826 -8368 -12576 -4347 1017 -3324 -16180 -15958 -8051 7550
3211G550J1519Q511j0868r984J0546O462R968L443N305j5017l0239P982K175j6230
$$ 7550 19069 27580 16712 6728 17274 23736 33704 37147 42452 27435 -2804 5178 7353 -8877
3197h877K806J4718p938j1273R269J4836J588L642K427j5218j1854m909K246l714
$$ -8877 -6071 8647 709 -10564 -1295 13541 15129 18771 21198 5980 -5874 -10783 -8537 -12251
3183a2251J1654Q699J910M50J3287Q972p143J3594q257k0679o416j4088k1842
$$ -12251 -597 8102 10012 10462 23749 32721 25578 39172 30915 10236 3820 -10268 -32110
3170c2110J3991J840J0149J0665N537Q622r64p079n917r438k054J408J5349O835
$$ -32110 -18119 -16279 -6130 4535 10072 18694 17730 10651 4734 -4704 -6758 -5350 9999 16834
3156A6834k0880n377J1423o271k964J5093q633l12k510Q962K5240o328j3307L017
$$ 16834 -4046 -9423 2000 -4271 -7235 7858 -775 -1087 -3597 5365 30605 24277 10970 13987
3142A3987r154J066k452j3617l983J2913k553l164N480Q658J1275P541O599q933
$$ 13987 4833 5899 3447 -10170 -14153 -1240 -3793 -6957 -1477 7181 18456 25997 32596 23663
3128B3663j2057l872r933m313l81q105j2751K1369K7437J317P553j0104q085M941
$$ 23663 11606 7734 -2199 -6512 -6893 -14998 -27749 -6380 21057 22374 29927 19823 11738 16679
3114A6679M122Q377r538l812K655k983j7952K615R221K748j036K068n174r567
$$ 16679 20801 29178 19640 15828 18483 15500 -2452 163 9384 12132 11096 13164 7990 -1577
3100a577K856O571j4020J260J1572o776m129J1843J3208r534j2513J584J7470
$$ -1577 1279 7850 -6170 -4910 6662 -114 -4243 7600 20808 11274 -1239 345 17815
3087A7815L43N601l653r181j3325k6387k472K6331N106M854n286K582q677j0333
$$ 17815 18158 23759 20106 10925 -2400 -28787 -31259 -4928 178 5032 -254 2328 -6349 -16682
3073a6682M312M606J6304J88m114j7216K730J4070j648J2510j1056j4140r239
$$ -16682 -12370 -7764 8540 8728 4614 -12602 -9872 4198 2550 15060 4004 -10136 -19375
3060a9375n150P150R811j524j915n049j3055k018J439M968J0082N478j040P886
$$ -19375 -24525 -17375 -7564 -9088 -11003 -16052 -29107 -31125 -29686 -24718 -14636 -9158 -10198 -2312
3046b312M782j4287j2177L505J6351p77j5409L010L395j102q473L716m210n675
$$ -2312 2470 -11817 -23994 -20489 -4138 -4915 -20324 -17314 -13919 -15021 -23494 -19778 -23988 -29663
3032b9663j2841O518K1792J3316N562J5959L752J887m192j3453j6003L061K9563
$$ -29663 -42504 -35986 -14194 -878 4684 20643 24395 26282 22090 8637 -7366 -4305 25258
3019B5258J0670J1682Q854j7253j3768j4924j5146j227J1505K8844R372j3627
$$ 25258 35928 47610 56464 39211 25443 10519 -4627 -5854 5651 34495 43867 30240
3007C0240r785J87o343q275K1837K335j9548j818P41p240l724q362N067K910J650
$$ 30240 20455 20642 14299 6024 27861 30196 10648 8830 9571 2331 -1393 -9755 -4688 -1778 -128
2992a28o274R035L592o683j615J4928Q768q014k0823j3350j4240n362KJ9779J7848
$$ -128 -6402 2633 6225 -458 -2073 12855 21623 13609 -7214 -20564 -34804 -40166 -40164 -20385 -2537
2977b537O355k325j0933r376M263J1910n811q044M338L705O149p720l589o320
$$ -2537 3818 1493 -9440 -18816 -14553 -2643 -8454 -16498 -12160 -8455 -2306 -10026 -13615 -19935
2963a9935K7841J3068P856j2448q17n52l091K760J906r868N2J3851r148q625P724
$$ -19935 7906 20974 28830 16382 15565 15013 11922 14682 16588 6720 6772 20623 11475 2850 10574
2948A0574L595l897M424r633k8667l634k4J6319R778k062J9191M24j3068j0821
$$ 10574 14169 10272 14696 5063 -23604 -27238 -27262 -10943 -1165 -3227 15964 16388 3320 -7501
2934g501o033K630Q985J1985p41j1695P463k205J145m61n370o01J9849J6681j4338
$$ -7501 -13534 -10904 -1919 10066 9325 -2370 5093 2888 4033 3572 -1798 -2399 17450 34131 19793
2919A9793k3946K981P953j8001j0789K756l63O800P610R287M65j0546p436p493
$$ 19793 -4153 -1172 6781 -11220 -22009 -19253 -19616 -12816 -5206 4081 4546 -6000 -13436 -20929
2905b0929J480k592R112k058o633M172L259j3159J2772J1389j3125M196J9596
$$ -20929 -19449 -22041 -12929 -14987 -21620 -17448 -14189 -27348 -14576 -3187 -16312 -12116 7480
2892G480n074j5343k8K140L717k087m40O812j017k170J1934n816l062j496p882
$$ 7480 2406 -12937 -12965 -10825 -7108 -9195 -9635 -2823 -3840 -6010 5924 108 -2954 -4450 -12332
2877a2332k0620L20J5423J7917J3244R348o107k6609j9113J9009J9962p374j877
$$ -12332 -32952 -32632 -17209 708 13952 23300 17193 -9416 -28529 -9520 10442 3068 1191
2864A191K24J3125J3234j2072k5604k2971k906j0060J3341K0217K159J27q50J5464
$$ 1191 1415 14540 27774 15702 -9902 -32873 -35779 -45839 -32498 -12281 -10122 -9995 -10845 4619
2850D619Q017O365L429r755Q514j3821J94j8622l571J256P573J1428l433j7874
$$ 4619 12636 19001 22430 12675 21189 7368 7562 -11060 -14631 -13375 -5802 5626 2193 -15681
2836a5681m910K106J4953L75m801R324O986n740m196K711L716Q743R343j378j0799
$$ -15681 -20591 -18485 -3532 -3157 -7958 1366 8352 2612 -1584 1127 4843 13586 22929 21551 10752
2821A0752j7093q767j1178j5342J8976J127P941R005P101L356J2852l365j579
$$ 10752 -6341 -15108 -26286 -41628 -22652 -21525 -13584 -4579 2522 5878 18730 15365 13786
2808A3786J663o893n934J8298j7182P59j454q887J3869O476p164n86M918M675
$$ 13786 15449 8556 2622 20920 3738 4497 3043 -5844 8025 14501 7337 6751 11669 16344
2794A6344j5058j5921M432J7269P631k414o700j2682N469J3194o226k105J501
$$ 16344 1286 -14635 -10203 7066 14697 12283 5583 -7099 -1630 11564 5338 3233 4734
2781D734J4660K333K935r517j1090Q197O704j4475j1062j1801N176N102o255k439
$$ 4734 19394 21727 24662 15145 4055 12252 18956 4481 -6581 -18382 -13206 -8104 -14359 -16798
2767a6798J6342N902o247m887N920K762j118K813J816p910k3924k101N632J0917
$$ -16798 -456 5446 -801 -5688 232 2994 1876 4689 6505 -1405 -25329 -27430 -21798 -10881
2753a0881J4250K3052j336k0570k0390K356J2452O50L648P534j0747l080R468
$$ -10881 3369 26421 25085 4515 -15875 -13519 -1067 -417 3231 10765 18 -3062 6406
2740F406R869l824P192m483O404p050k946o375J2502Q543j389j6237r797r830
$$ 6406 16275 12451 19643 15160 21564 14514 11568 5193 17695 26238 24849 8612 -1185 -11015
2726a1015k680J4559M398q963m002K253J769J2474J6098j0505j047n839j1309
$$ -11015 -13695 864 5262 -3701 -7703 -5450 -3681 8793 24891 14386 13339 7500 -3809
2713c809j1876r622m28p852J0802p127J716J6155r67j5074O699k945J6465l705
$$ -3809 -15685 -25307 -25735 -33587 -22785 -29912 -28196 -12041 -13008 -28082 -21383 -24328 -7863 -11568
2699a1568j6992K0J0256J0840j0925J236J6918J3326j0840p471j0523q782K6441
$$ -11568 -28560 -28540 -18284 -7444 -18369 -17133 -215 13111 2271 -5200 -15723 -24505 1936
2686A936o366j0371J1861M352j2764Q595O758J2983j7127j524M78k297J1090L466
$$ 1936 -4430 -14801 -2940 1412 -11352 -2757 4001 16984 -143 -1667 -1189 -3486 7604 11070
2672A1070l312J1175n446L283o567j0903p959q086J290J0656J51J1462R409J259
$$ 11070 7758 18933 13487 16770 10203 -700 -8659 -16745 -15455 -4799 -4648 6814 16223 17482
2658A7482j393k0420K582J9813L484Q692L730J2743m813k2564k5223J010L699
$$ 17482 16089 -4331 -1749 18064 21548 30240 33970 46713 41900 19336 -5887 -4877 -1178
2645a178J0401L813j531j5977J369J5388J3117J2622j7989k4572K662K563o689
$$ -1178 9223 13036 11505 -4472 -3103 12285 25402 38024 20035 -4537 -1875 688 -6001
2632f001n844J0196o78q82n373J4566M544q617r896l327r391M215J6770J4001
$$ -6001 -11845 -1649 -2327 -3209 -8582 5984 10528 1911 -7985 -11312 -20703 -16488 282 14283
2618A4283k082M79j05j0765M909L76m937Q171J4082M704o339j0187j5815m306
$$ 14283 12201 12680 12575 1810 6719 7095 2158 10329 24411 29115 22776 12589 -3226 -7532
2604g532Q567K114p270J167Q472J2657R998p900j1180j1027j0687J3066N221j659
$$ -7532 1035 3149 -4121 -2954 5518 18175 28173 20273 9093 -1934 -12621 445 5666 4007
2590D007r85j2729k167J545N855l979P310K0593N038K96j0755o821M596q709Q76
$$ 4007 3022 -9707 -11874 -10329 -4474 -8453 -1143 19450 24488 24784 14029 7208 11804 3095 3971
2575C971j3263R796J1967R501M953J927L335O591j6347j8416k9587n226J4498
$$ 3971 -9292 504 12471 21972 26925 28852 32187 38778 22431 4015 -25572 -30798 -16300
2562a6300J4861N469N916M184m288k2231q961K0862O639j6500K097O914L099r262
$$ -16300 -1439 4030 9946 14130 9842 -12389 -21350 -488 6151 -10349 -8252 -1338 1761 -7501
2548g501j6923K330L803n414J743j484k001o226J4402l654P251K800K763L65j4408
$$ -7501 -24424 -22094 -18291 -23705 -21962 -23446 -25447 -31673 -17271 -20925 -13674 -10874 -8111 -7746 -22154
2533b2154L055K480P69j407Q133J2086J1422N658n965n610m249k578o049P725
$$ -22154 -19099 -16619 -15850 -17257 -9124 2962 14384 20042 14077 8467 4218 1640 -4409 3316
2519C316J7879j0686j1707j317R437k950p789Q47o237q472j294N175P741N205
$$ 3316 21195 10509 -1198 -2515 6922 3972 -3817 -2970 -9207 -17679 -18973 -13798 -6057 -852
2505h52K84n553N299o614k338r739M833r234J8756R213J687j5958M572P569N603
$$ -852 -568 -6121 -822 -7436 -9774 -19513 -14680 -23914 -5158 4055 5742 -10216 -5644 1925 7528
2490G528j3062o552O644J140l88J5610N829j3344j0610o162J6471J7083N688l596
$$ 7528 -5534 -12086 -5442 -4302 -4690 10920 16749 3405 -7205 -13367 3104 20187 25875 22279
2476B2279N930q757j117P73n19l805J516Q192k2759J382j281K166q213m849o341
$$ 22279 28209 19452 18335 19108 18589 14784 16300 24492 1733 3115 1834 4000 -4213 -9062 -15403
2461a5403N80J8072K0633o973r951O276j8250n440J2282J0078n645L66Q049o453
$$ -15403 -14823 3249 23882 16909 6958 13234 -5016 -10456 1826 11904 6259 6625 14674 8221
2447H221J1250O193o051l341J294k355N109r359l59K450j3226k918k143k302R373
$$ 8221 19471 25664 19613 16272 17566 15211 20320 10961 10602 13052 -174 -3092 -5235 -7537 1836
2432A836J3063j083j2072j1978j4497J1709L315p913O365K04j7486j1260J6789
$$ 1836 14899 13816 1744 -10234 -24731 -13022 -9707 -17620 -11255 -11051 -28537 -39797 -23008
2419b3008K3170m946J0048O485j872J651k137J4986K364m328j7919J2730M64l779
$$ -23008 162 -4784 5264 11749 9877 11528 9391 24377 26741 22413 4494 17224 17688 13909
2405A3909q113m258L191j1053j6779m529P267J2416j665L593R192P351J343j6192
$$ 13909 5796 1538 4729 -6324 -23103 -27632 -20365 -7949 -9614 -6021 3171 10522 11865 -4327
2391d327m772J0046O949J719M03o100m792j0137L622l000N576o107j5303L31p567
$$ -4327 -9099 947 7896 9615 10018 3918 -874 -11011 -7389 -10389 -4813 -10920 -26223 -25892 -33459
2376c3459P173J1991J4260J8653m425j1526r53J389n797o383J8202j48l746j807
$$ -33459 -26286 -14295 -35 18618 14193 2667 1714 3103 -2694 -9077 9125 8977 5231 3424
2362C424M718r22j7808p330K1116L976n472j0950m217P83k795J6356J9681J511
$$ 3424 8142 7220 -10588 -17918 3198 7174 1702 -9248 -13465 -12682 -15477 879 20560 22071
2348B2071q592j4357q150J1177m223l29K515l863L513j1961j1319Q873M314J0583
$$ 22071 13479 -878 -9028 2149 -2074 -2403 112 -3751 -238 -12199 -23518 -14645 -10331 252
2334B52J289p827m340J358o212j5234n490J1031K8959J3833k719q265P84J764
$$ 252 1541 -6286 -10626 -9268 -15480 -30714 -36204 -25173 3786 17619 14900 6635 7419 9183
2320I183j8176J012Q758L083Q82p800r230N069j2050j3677R794K4572P445q630
$$ 9183 -8993 -7981 777 3860 4742 -3058 -12288 -7219 -19269 -32946 -23152 1420 8865 235
2306B35K073K230R237R983l3Q675k932j0802Q66m741P40J4190L26j4125k5345
$$ 235 2308 4538 13775 23758 23725 32400 29468 18666 19532 14791 15531 29721 30047 15922 -9423
2291i423j3059J1193J6789M567K344p702r198K919J7786K670n146o712K975l153
$$ -9423 -22482 -11289 5500 10067 12411 4709 -4489 -1570 16216 18886 13740 7028 10003 6850
2277F850j6251n522M135N337l352m06Q80J3296n368l386p375r78l351J3172l193
$$ 6850 -9401 -14923 -10788 -5451 -8803 -9209 -8329 4967 -401 -3787 -11162 -12140 -15491 -2319 -5512
2262e512N880l037j4667m217P001K243Q533L267j91J0557P515j8226o116j910
$$ -5512 368 -2669 -17336 -21553 -14552 -12309 -3776 -509 -700 9857 17372 -854 -6970 -8880
2248h880j2170N131K511J9373Q480J0039J19q174R244l037k0015j1607l226j1361
$$ -8880 -21050 -15919 -13408 5965 14445 24484 24603 16429 25673 22636 2621 -8986 -12212 -23573
2234b3573R284O319k56j8039m129N168J7436J0924j007J3150r116k57O3k0881
$$ -23573 -14289 -7970 -8226 -26265 -30394 -25226 -7790 3134 2127 15277 6161 5904 5967 -14914
2220a4914j0833J4986P474n255K139J3057L777n740j5712K429j2084p330K730
$$ -14914 -25747 -10761 -3287 -8542 -6403 6654 10431 4691 -11021 -8592 -20676 -28006 -25276
2207b5276L139P355N499J537L008J714k962j3668k144K724J270j146j405O226
$$ -25276 -22137 -14782 -9283 -7746 -4738 -3024 -5986 -19654 -21798 -19074 -17804 -18950 -20355 -14129
2193a4129L2526j454J958r044L931j605l128n308R339J2719n01l395j0531j6558
$$ -14129 18397 16943 18901 9857 13788 12183 9055 3747 13086 25805 25304 21909 11378 -5180
2179e180o144O558Q306M677r852R535J53J331J2671j834k0137M567J1664j544
$$ -5180 -11324 -4766 3540 8217 -1635 7900 8053 9384 22055 20221 84 4651 16315 14771
2165A4771L527o084J007k387P683R212j0354k6356l216p982j0387J4883J1637
$$ 14771 18298 12214 13221 10834 18517 27729 17375 -8981 -12197 -20179 -30566 -15683 -4046
2152d046P757j532n423r083R675J9324p059j4286q111J4237J5604J5103o265k6954
$$ -4046 3711 2179 -3244 -12327 -2652 16672 9613 -4673 -12784 1453 17057 32160 25895 -1059
2138a059L234R74q099k655M256K454R041K574l146J0707Q116m42j26n153p794
$$ -1059 2175 3149 -4950 -7605 -3349 -895 8146 10720 7574 18281 26397 25955 25829 20676 12882
2123A2882J1384p029m588l153r649j9560q747J3278j402L417J838J7481M764J429
$$ 12882 24266 17237 12649 9496 -153 -19713 -28460 -15182 -16584 -13167 -11329 6152 10916 12345
2109A2345j899j222l358k605O023o177j1364O942O49L054K979J0917Q819p849
$$ 12345 10446 9224 5866 3261 9284 3107 -8257 -1315 -666 2388 5367 16284 25103 17254
2095A7254J324J7370r879q240j619n940J42R839j3969j5367Q882o629j158L307
$$ 17254 18578 35948 26069 17829 16210 10270 10412 20251 6282 -9085 -203 -6832 -7990 -4683
2081d683P017L838q343K325m634k069L274n406q363j8725J5985J9410N769j6392
$$ -4683 2334 6172 -2171 154 -4480 -6549 -3275 -8681 -17044 -35769 -19784 -374 5395 -10997
2067a0997j9159R471k378j203J2133J964k915j601J5306J1139M729p596r615K193
$$ -10997 -30156 -20685 -23063 -24266 -12133 -10169 -13084 -14685 621 11760 16489 8893 -722 1471
2053A471M017K475N22q429M845N424j006R497R16P596R159K62n221j4378J886
$$ 1471 5488 7963 8485 56 4901 10325 9319 18816 19732 27328 36487 36749 31528 17150 19036
2038A9036N911j4654k798Q354m886O085L893M981R955l567j2287m965m712j2805
$$ 19036 24947 10293 7495 15849 10963 17048 20941 25922 35877 32310 20023 15058 10346 -2459
2024b459Q322M342q218n176n689J6492P82r458l357n249Q739J2386N741L724J1702
$$ -2459 5863 10205 1987 -3189 -8878 7614 8396 -1062 -4419 -9668 -929 11457 17198 20922 32624
2009C2624R92J312j3969q854j391j097m286P878O690m608j4055j695Q635M015
$$ 32624 33616 34928 20959 12105 10714 9617 5331 13209 19899 15291 1236 -459 8176 12191
1995A2191L587p450j1847r167n654J3524P300j140J1558J5139J46o26r160j0989
$$ 12191 15778 8328 -3519 -12686 -18340 -4816 2484 1344 12902 28041 28187 27561 18401 7412
1981G412j8968J943K812M274J9182L698j7567j286K681m904j5026m556Q751l167
$$ 7412 -11556 -9613 -6801 -2527 16655 20353 2786 1500 4181 -723 -15749 -20305 -11554 -14721
1967a4721J1700J763l171l836P581l48m682k833N466J344J321J0520O648j9903
$$ -14721 -3021 -1258 -4429 -8265 -684 -1032 -5714 -8547 -3081 -1737 -416 10104 16752 -3151
1953c151n503L489J7985o922p585p47J112J8947N201k247K568j0844p147j985
$$ -3151 -8654 -5165 12820 5898 -1687 -2434 -1322 17625 22826 20579 23147 12303 5156 3171
1939C171m804j2368N168M570n188j703K294N204K945O027k7099l643J3220K821
$$ 3171 -1633 -14001 -8833 -4263 -9451 -11154 -8860 -3656 -711 5316 -21783 -25426 -12206 -9385
$$ [...]
##END NTUPLES=NMR SPECTRUM
##END=
