##TITLE=Analysis number 328183
Compound Code cc 00602
Book Reference lab3
Project Code adrs
Chemist Name stores
##JCAMPDX= 6.0         $$ Bruker NMR JCAMP-DX V2.0
##DATA TYPE= NMR SPECTRUM
##DATA CLASS= NTUPLES
##ORIGIN= Bruker BioSpin GmbH
##OWNER= nmr
$$ XWIN-NMR		Version 3.5
$$ Thu May 10 13:49:40 2007 GMT Daylight Time (UT+1h)  MAYBRIDGE\nmr@NMR_250MHZ
##.OBSERVE FREQUENCY= 250.131544655141
##.OBSERVE NUCLEUS= ^1H
##.ACQUISITION MODE= SIMULTANEOUS (DQD)
##.ACQUISITION SCHEME= undefined
##.AVERAGES= 16
##.DIGITISER RES= 18
##SPECTROMETER/DATA SYSTEM= dpx250
##.PULSE SEQUENCE= zg30
##.SOLVENT NAME= CDCl3
##.SHIFT REFERENCE= (INTERNAL, CDCl3, 0, 16.522)
##AUDIT TRAIL= $$ (NUMBER, WHEN, WHO, WHERE, WHAT)
$$ ##TITLE= Audit trail, XWIN-NMR		Version 3.5
$$ ##JCAMPDX= 5.01
$$ ##ORIGIN= Bruker BioSpin GmbH
$$ ##OWNER= nmr
$$ C:\u/data/dgb/nmr/ADRS/800/pdata/1/auditp.txt
$$ ##AUDIT TRAIL=  $$ (NUMBER, WHEN, WHO, WHERE, WHAT)
(   1,<2007-05-10 13:49:17.21 +100>,<MAYBRIDGE\nmr>,<NMR_250MHZ>,
      <created by zg, POWCHK disabled, PULCHK disabled
       configuration hash MD5:
       76 6E 9A 78 1E 09 19 81 EC 84 63 8F B0 6A 59 2D
       data hash MD5: 64K
       D3 A7 A1 21 A9 51 1C E6 77 1C 48 8B 03 62 00 0F>)
(   2,<2007-05-10 13:49:30.86 +100>,<MAYBRIDGE\nmr>,<NMR_250MHZ>,
      <Start of raw data processing
       ef LB = 0.3 FT_mod = 6 PKNL = 1 SI = 32K 
       data hash MD5: 32K
       F2 FB F3 89 F5 1E DF 54 47 0D 26 0D A6 29 7A 7D>)
(   3,<2007-05-10 13:49:32.63 +100>,<MAYBRIDGE\nmr>,<NMR_250MHZ>,
      <apk 
       data hash MD5: 32K
       FA F8 E1 11 2D D9 89 6B 86 00 08 88 E3 E1 28 4A>)
(   4,<2007-05-10 13:49:33.28 +100>,<MAYBRIDGE\nmr>,<NMR_250MHZ>,
      <abs ABSG = 5 
       data hash MD5: 32K
       72 E8 37 F6 CE 0D 74 F6 69 22 81 CC 37 A3 75 D6>)
$$ ##END=
$$ 
$$ hash MD5
$$ FE 67 CC 68 C5 BB 29 62 27 DC AD 42 C4 46 92 BB
##$RELAX= 
##$RELAX= 
##$RELAX= 
##$RELAX= 
##$RELAX= 
##$RELAX= 
##$RELAX= 
$$ Bruker specific parameters
$$ --------------------------
##$DU= <C:\u>
##$EXPNO= 800
##$NAME= <ADRS>
##$PROCNO= 1
##$TYPE= <nmr>
##$USER= <dgb>
##$AMP= (0..31)
100 100 100 100 100 100 100 100 100 100 100 100 100 100 100 100 100 100 
100 100 100 100 100 100 100 100 100 100 100 100 100 100 
##$AQSEQ= 0
##$AQ_mod= 3
##$AUNM= <au_zg>
##$AUTOPOS= <29 >
##$BF1= 250.13
##$BF2= 250.13
##$BF3= 250.13
##$BF4= 250.13
##$BF5= 500.13
##$BF6= 500.13
##$BF7= 500.13
##$BF8= 500.13
##$BYTORDA= 1
##$CFDGTYP= 0
##$CFRGTYP= 5
##$CHEMSTR= <none>
##$CNST= (0..31)
1 1 145 1 1 1 1 1 1 1 1 1 1 1 1 1 1 1 1 1 1 1 1 1 1 1 1 1 1 1 1 1 
##$CPDPRG= <>
##$CPDPRG1= <>
##$CPDPRG2= <>
##$CPDPRG3= <>
##$CPDPRG4= <mlev>
##$CPDPRG5= <mlev>
##$CPDPRG6= <mlev>
##$CPDPRG7= <mlev>
##$CPDPRG8= <mlev>
##$CPDPRGB= <>
##$CPDPRGT= <>
##$D= (0..31)
0 1 0 0 0 0 0 0 0 0.06 0 0 0 0 0 0 0.0002 0 0 0 0 0 0 0 0 0 0 0 0 0 0 
0 
##$DATE= 1178801356
##$DBL= (0..7)
120 120 120 120 120 120 120 120 
##$DBP= (0..7)
150 150 150 150 150 150 150 150 
##$DBP07= 0
##$DBPNAM0= <>
##$DBPNAM1= <>
$$ [...]
##$SUBNAM7= <"">
##$SUBNAM8= <"">
##$SUBNAM9= <"">
##$SW= 20.6930455092707
##$SWIBOX= (0..15)
0 0 3 0 0 0 0 0 0 0 0 0 0 0 0 0 
##$SW_h= 5175.983436853
##$TD= 65536
##$TD0= 1
##$TE= 683.16
##$TE2= 300
##$TE3= 300
##$TEG= 300
##$TL= (0..7)
0 120 120 120 120 120 120 120 
##$TP= (0..7)
150 150 150 150 150 150 150 150 
##$TP07= 0
##$TPNAME0= <>
##$TPNAME1= <>
##$TPNAME2= <>
##$TPNAME3= <>
##$TPNAME4= <>
##$TPNAME5= <>
##$TPNAME6= <>
##$TPNAME7= <>
##$TPOAL= (0..7)
0.5 0.5 0.5 0.5 0.5 0.5 0.5 0.5 
##$TPOFFS= (0..7)
0 0 0 0 0 0 0 0 
##$TUNHIN= 0
##$TUNHOUT= 0
##$TUNXOUT= 0
##$USERA1= <user>
##$USERA2= <user>
##$USERA3= <user>
##$USERA4= <user>
##$USERA5= <user>
##$V9= 5
##$VALIST= <valist>
##$VCLIST= <CCCCCCCCCCCCCCC>
##$VD= 0
##$VDLIST= <DDDDDDDDDDDDDDD>
##$VPLIST= <PPPPPPPPPPPPPPP>
##$VTLIST= <TTTTTTTTTTTTTTT>
##$WBST= 1024
##$WBSW= 4
##$XGAIN= (0..3)
0 0 0 0 
##$XL= 0
##$YL= 0
##$YMAX_a= 627269
##$YMIN_a= -630636
##$ZGOPTNS= <>
##$ZL1= 120
##$ZL2= 120
##$ZL3= 120
##$ZL4= 120
##$ABSF1= 16.522
##$ABSF2= -4.171173
##$ABSG= 5
##$ABSL= 3
##$ALPHA= 0
##$AQORDER= 0
##$ASSFAC= 0
##$ASSFACI= 0
##$ASSFACX= 0
##$ASSWID= 0
##$AUNMP= <proc_1d>
##$AZFE= 0.1
##$AZFW= 0.1
##$BCFW= 0
##$BC_mod= 0
##$BYTORDP= 0
##$COROFFS= 0
##$CY= 12.5
##$DATMOD= 1
##$DC= 0
##$DFILT= <>
##$DTYPP= 0
##$F1P= 14.0000005364418
##$F2P= -0.99999901652339
##$FCOR= 0.5
##$FTSIZE= 32768
##$FT_mod= 6
##$GAMMA= 0
##$GB= 0
##$INTBC= 1
##$INTSCL= 1
##$ISEN= 128
##$LB= 0.3
##$LEV0= 0
##$LPBIN= 0
##$MAXI= 10000
##$MC2= 0
##$MEAN= 0
##$ME_mod= 0
##$MI= 0
##$NCOEF= 0
##$NC_proc= -1
##$NLEV= 6
##$NOISF1= 0
##$NOISF2= 0
##$NSP= 0
##$NTH_PI= 0
##$NZP= 0
##$OFFSET= 16.522
##$PC= 1
##$PHC0= -49.34876
##$PHC1= -3.157418
##$PH_mod= 1
##$PKNL= yes
##$PPARMOD= 0
##$PSCAL= 4
##$PSIGN= 0
##$REVERSE= no
##$SF= 250.13
##$SI= 32768
##$SIGF1= 0
##$SIGF2= 0
##$SINO= 400
##$SIOLD= 32768
##$SREGLST= <1H.CDCl3>
##$SSB= 0
##$STSI= 32768
##$STSR= 0
##$SW_p= 5175.98343685301
##$SYMM= 0
##$S_DEV= 0
##$TDeff= 65536
##$TDoff= 0
##$TI= <Analysis number 999999
Compound Code 99
Book Reference 9
Project Code 9>
##$TILT= no
##$TM1= 0
##$TM2= 0
##$TOPLEV= 0
##$USERP1= <user>
##$USERP2= <user>
##$USERP3= <user>
##$USERP4= <user>
##$USERP5= <user>
##$WDW= 1
##$XDIM= 32768
##$YMAX_p= 305502959
##$YMIN_p= -133077
$$ End of Bruker specific parameters
$$ ---------------------------------
##NTUPLES= NMR SPECTRUM
##VAR_NAME=  FREQUENCY,     SPECTRUM/REAL,   SPECTRUM/IMAG
##SYMBOL=    X,             R,               I
##VAR_TYPE=  INDEPENDENT,   DEPENDENT,       DEPENDENT
##VAR_FORM=  AFFN,          ASDF,            ASDF
##VAR_DIM=   32768,         32768,           32768
##UNITS=     HZ,            ARBITRARY UNITS, ARBITRARY UNITS
##FACTOR=    0.157963299565203, 1,           1
##FIRST=     4132.6476996994, 0,             0
##LAST=      -1043.33573715361, 0,           0
##MIN=       -1043.33573715361, -133077,     0
##MAX=       4132.6476996994, 305502959,     0
$$ Real data points
##PAGE= N=1
##DATA TABLE= (X++(R..R)), XYDATA
$$ [...]
##PAGE= N=2
##DATA TABLE= (X++(I..I)), XYDATA
15961C31703j230N200K898j125k874J73n1R1L24j992r7j71J432L144K735p682
15945C32478m195q71j297K117k797R78K035k05J995K684j196k961K011M385j99
15930C34962l553k970J858j631J442J666J437l7K772J932o77k164m202J51j091
15915C29895r58L75P54L648J646J690l68k021m8L038j382m742n008L005K957L775
15899C36256l600o44R75j82k35j994k610J556K597J308m54J77K572J105p34q94
15883C35199J379J412j577N96Q43j42L389k88p25k640l380O85J188K034l13j065
15867C36595M48N71M88l427o74R42J433k579j321j559K765N38K802J421L47L505
15851C42295j393P01Q07p43k079N16Q17p32m9j428J474R68p59k96r8l591j242
$$ plain form
15961 331703 330473 335673 338571 337446 334572 334745 334694 334785 335109 333117 333020 332849 334281 337425 340160 332478
15945 332478 328283 327412 326115 328232 325435 326413 328448 328243 330238 332922 331726 328765 330776 335161 334962
15930 334962 331409 328439 330297 328666 330108 331774 333211 333174 335946 337878 337201 335037 330835 330986 329895
15915 329895 328937 329312 330066 333714 335360 337050 336682 334661 334613 337651 336269 331527 326519 329524 332481 336256
15899 336256 332656 332012 332987 332805 332570 330576 327966 329522 332119 333427 332973 333150 335722 336827 336093 335199
15883 335199 336578 337990 336413 337009 337852 337710 341099 340811 340086 337446 334066 334751 335939 337973 337660 336595
15867 336595 337043 337614 338102 334675 334001 334943 336376 333797 332476 330917 333682 334220 337022 338443 338790 342295
15851 342295 340902 341603 342410 341667 339588 340104 340921 340189 340140 338712 340186 341154 340395 340099 340001 336410 335168
15834C35168L905J017P79M888Q34l725o331j510J974O58j223K952L76j281k33
15819C38248L708m28m94K393J727l999m780L576K407N60j96j572j11r50J849j018
15803C40920K05J033k596J329j56J078k004l834j295K148j148q31K565L185J770
15788C42369J593M89l212J228N008P20k821j735J770n00l557J569J423l736l090
15773C37518J585J356n62P67J521q54k334n51k707L10N767N149J284k286k20N665
15757C51408J657k907k501l652J717L668j454J909J702M13j662l736m113J902
15743C44351J810K600l05J453j230m324m34K457M549L365P34j897l112j978m263
15728C43776O96M138L499m09l204Q41K604J569j962j987K157q41l682J864J38
$$ plain form
15834 335168 339073 340090 340869 345757 346591 342866 336535 335025 336999 337657 336434 339386 339762 338481 338248
15819 338248 341956 341528 341034 343427 345154 341155 336375 339951 342358 342918 342722 341150 341039 340089 341938 340920
15803 340920 341125 342158 339562 340891 340735 341813 339809 335975 334680 336828 335680 334849 337414 340599 342369
15788 342369 343962 344451 341239 342467 347475 348195 345374 343639 345409 344909 341352 342921 344344 340608 337518
15773 337518 339103 340459 339897 340664 342185 341331 338997 338446 335739 336049 341816 346965 348249 345963 345743 351408
15757 351408 353065 350158 347657 344005 345722 349390 347936 349845 351547 351960 350298 346562 342449 344351
15743 344351 346161 348761 348456 349909 348679 344355 343921 346378 350927 354292 355026 353129 350017 348039 343776
15728 343776 344472 348610 352109 351700 348496 349337 351941 353510 351548 349561 351718 350877 347195 349059 349197
15713C49197J756K855k706j028J127l14R62J879k424m29J421J354J263m32j678
15698C52803j753j017k510l85J893K53J032j857J404On172j84K256K95L47j844
15682C45567J792j608n50L140J475j357J098k36n46%J002M26J873K590K116j813
15666C54969k589j912J708j302k913K1m90l614K834K443J581J78m59K647n86L18
15650C52834P22J036j035R76q46j954K035j81J821L260P02M29l673k832j873k39
15634C51182j304K610J088Q78k607j801J019K052J591n63l541M98L228l87m50
15619C53493J030j386k156J275J114J311N32o75l319k768k948J552K788J269K029
15604C53141M079K507m342k980J708J424K606o23j339j41M91J200M14j833l70
$$ plain form
15713 349197 350953 353808 351102 350074 351201 350887 351849 353728 351304 350875 352296 353650 354913 354481 352803
15698 352803 351050 350033 347523 347138 349031 349284 350316 348459 349863 349869 344697 344513 346769 347064 347411 345567
15682 345567 347359 345751 345201 348341 349816 348459 349557 349321 348775 348775 349777 350203 352076 354666 356782 354969
15666 354969 352380 350468 352176 350874 347961 347982 347492 343878 346712 349155 350736 350914 350455 353102 352516 352834
15650 352834 353556 354592 353557 354533 353687 351733 353768 353587 355408 358668 359370 359799 356126 353294 351421 351182
15634 351182 349878 352488 353576 354454 351847 350046 351065 353117 354708 354145 350604 351102 354330 353943 353493
15619 353493 354523 353137 350981 352256 353370 354681 355213 354538 351219 348451 345503 347055 349843 351112 353141
15604 353141 357220 359727 355385 352405 354113 355537 358143 357520 356181 356040 356531 357731 358145 356312 355942
15589C55942J825K08J283J567R36k418J395p47l946L17j113J552J303K59j357
15574C57006j55j569L709M15j686m50Q59K4j120L50K230J81k81K946r38R10O47
15557C63078l258j733k514j997K567N699M469k825m189m17N08j572J73L910K76
15542C62175j409k158j09N76k777K935L36K69L021k02l801j611Q8j517j019N581
15526C60378J525p96k1N99j735O69J687J315j814L69J261J276k072N67R66J15
15510C64289O58l64k559j18L065L113J823j469j076k145m46j629o61J289P47J390
15494C65907K959j276l038l67N55q82j151J431J357k81j635J97J27K068m10l296
15478C62265K553J927p68M482K13o48j532k472j478J914M83k786J988j139j859
$$ plain form
15589 355942 357767 357975 359258 360825 361761 359343 360738 359991 356045 356362 355249 356801 358104 358363 357006
15574 357006 356851 355282 358991 359406 357720 357270 358129 358153 357033 357383 359613 359794 359513 362459 361521 362431 363078
15557 363078 359820 358087 355573 353576 356143 361842 366311 363486 359297 358880 359388 357816 357989 361899 362175
15542 362175 360766 358608 358499 359075 356298 359233 359569 359838 362859 362657 358856 357245 357333 355816 354797 360378
15526 360378 361903 361107 361086 361685 359950 360619 362306 363621 361807 362176 363437 364713 362641 363208 364174 364289
15510 364289 364947 364583 362024 361906 364971 368084 369907 368438 367362 365217 364771 363142 362481 363770 364517 365907
15494 365907 368866 367590 364552 364185 364740 363858 362707 364138 365495 365214 363579 363776 363903 365971 365561 362265
15478 362265 364818 366745 365977 370459 370672 370024 368492 366020 364542 366456 366939 364153 366141 365002 363143
15463C63143L260n53N15K680K996K311k748l631l447q60L727K284O81L000Q07
15448C74165p31j858l457k031k954K662K236j795P00r94J492R32j663R54M085
15433C71743r43j262n63j753R62m32n06R96N66j903L612J256O58n3J540Q50l444
15416C71324j546J96L938N31O01Q94n22k205m099K873N372P6p490l391l459M459
15400C67552K857K186K013p00j457k740l48k92J639n27k21l140j892j320K594
15385C66204O60Q56J933J24K906K302N53J750m97n280J182K246j527o24J217K986
15369C76991j673k91K198l33K92j248l256L25M007J808k297j365l41j293j050
15354C72474L561L854M037O40j535L09j896J402J840P47j590j257m954k504nJ140
$$ plain form
15463 363143 366403 365850 366365 369045 372041 374352 371604 367973 364526 363666 367393 369677 370358 373358 374165
15448 374165 373434 371576 368119 366088 363134 365796 368032 366237 366937 365943 367435 368367 366704 367658 371743
15433 371743 370800 369538 368975 367222 368184 367752 367246 368242 368808 366905 370517 371773 372431 372378 373918 374768 371324
15416 371324 369778 369974 373912 374443 375044 375938 375416 373211 369112 371985 377357 377433 369943 366552 363093 367552
15400 367552 370409 372595 374608 373908 372451 369711 369363 369071 370710 370183 369962 366822 364930 363610 366204
15385 366204 366864 367720 369653 369777 372683 374985 375538 377288 376791 371511 372693 374939 373412 372788 374005 376991
15369 376991 375318 375027 377225 376892 377184 375936 372680 373005 377012 378820 376523 375158 374817 373524 372474
15354 372474 376035 379889 383926 384566 383031 383340 381444 382846 384686 385433 383843 382586 377632 375128 375123 376263
15338C76263P41m119J107K681J782j348l815R67L643Q72k778O0J592K433J111
15323C81192n3K064j052M8o85K27Q43J888n0j422q84J123L55n65l197k166j685
15306C75981OJ63R40K861l518j782Q07k129R88N846o0j275K592J291P95N430m
15289C88932l017m061n27p17M457L153j361q51K77J427K25j325P4j583N74k637
15273C83040j418Q96j299j599L521r4j35J295n51L728j948n092j29K282K816K460
15257C87773k220k441K229K353k645J510o81r65K103Q48q77Q19q30j381j560K699
15241C86734n44K743j043k067k807j248o23L038K746r35j411J167J609L5o04j363
15225C85427J348J642j919m384R53L228O985j098l429o15k654k223m66J723L540
$$ plain form
15338 376263 377004 372885 373992 376673 378455 377107 373292 374259 377902 378774 375996 376056 377648 380081 381192
15323 381192 381139 383203 382151 382199 381514 381741 382584 384472 384422 383000 382116 383239 383594 383029 379832 377666 375981
15306 375981 375987 376150 377090 379951 376433 374651 375458 373329 374317 380163 380103 378828 381420 382711 383506 388936 388932
15289 388932 385915 381854 381327 380610 385067 388220 386859 386008 386285 387712 387937 386612 386686 385103 385677 383040
15273 383040 381622 382518 381219 379620 383141 383047 382912 384207 383656 387384 385436 380344 380215 382497 385313 387773
15257 387773 385553 383112 385341 387694 385049 386559 385878 384913 387016 387864 386987 387806 386976 385595 384035 386734
15241 386734 386190 388933 387890 385823 383016 381768 381145 384183 386929 385994 384583 385750 387359 387394 386790 385427
15225 385427 386775 388417 386498 382114 383067 386295 393280 392182 388753 388138 385484 383261 382795 384518 388058
15210C88058J015o25j542L15L787j815q52J48K83K044K180M7j088k117J886L621
15194C95345j380m862k356l461l87J317J116L039L053k135p79J223K540L638k418
15179C93493j636m09K421j943J88N672K861O53l107k467L26L35m57J814k136J700
15163C97308N97k714j590J126m17O140J60j497J036j844k91k714j752M264Q524
15148D06336J831n760l415j386m63M58K453Q29k15L800m99p57L097L54o642m708
15132C95313k279k191k407N29j327j179J191N76j895R41K668j030l620R64K289
15117C88543J105J910P87j252N96K66k329j366Q32J880Q94L134O60j7J428k875
15101C94196K34J449J844K03J059j759M168n84m136k741N87R05j849m54J854l05
$$ plain form
15210 388058 389073 388448 386906 387221 391008 389193 388341 388489 388772 390816 392996 393043 391955 389838 391724 395345
15194 395345 393965 389103 386747 383286 382899 384216 385332 388371 391424 389289 388510 389733 392273 395911 393493
15179 393493 391857 391448 393869 391926 392114 397786 400647 401300 398193 395726 396052 396387 395930 397744 395608 397308
15163 397308 397905 395191 393601 394727 394310 400450 400610 399113 400149 398305 398014 395300 393548 397812 406336
15148 406336 408167 402407 398992 397606 397143 397601 400054 400883 400668 404468 403969 403212 406309 406663 400021 395313
15132 395313 393034 390843 388436 388965 387638 386459 387650 388226 386331 387272 389940 388910 385290 386254 388543
15117 388543 389648 391558 392345 391093 391689 391955 389626 388260 389092 390972 391866 395000 395660 395643 397071 394196
15101 394196 394430 395879 397723 397926 398985 397226 401394 400810 396674 393933 394520 395425 393576 393122 394976 394671
15085C94671M259j215j1N04K86J356O46j074k972j06L396P75k075j287J152Q42
15069C99147J680K28o58j462L93L056J160k04k13k312q31L552L781M31j44l045
15053D04559k821m960O09k28R86L19o96P3K88M966j711k893J51J240L381K584
15037D05847q4J2k758j585J282K536J011l243k485j967J109L17L474M171l99M37
15021D07675J551L00j49m69j868L07J541j087P11m58o517k314K900J37K720K984
15005D07964J748j95N17K17J648J578l399l515k091Q53K363R75J428N61P18k330
14989D09040n03N27l327J1l2j406K865J307J295L72r04M44K374K560j332k294
14973D10997Pm19j226q55j978K500K884J816R13L15K445J234k069p31k109l876
$$ plain form
15085 394671 398930 397715 397704 398208 398494 399850 400496 399422 396450 396344 399740 400515 398440 397153 398305 399147
15069 399147 400827 401055 400397 398935 399328 402384 403544 403340 403127 400815 399984 403536 407317 407748 407604 404559
15053 404559 401738 396778 397387 397159 398145 398464 397768 397841 398129 403095 401384 398491 398642 399882 403263 405847
15037 405847 405763 405775 403017 401432 402714 405250 406261 403018 400533 398566 399675 399992 403466 407637 407238 407675
15021 407675 409226 409526 409377 408908 407040 407347 408888 407801 408512 408054 401537 399223 402123 402260 404980 407964
15005 407964 409712 409517 410034 410251 411899 413477 410078 406563 404472 405325 407688 408663 410091 410652 411370 409040
14989 409040 408537 409064 405737 405748 405716 404310 407175 408482 409777 410149 409245 409689 412063 414623 413291 410997
14973 410997 411004 410585 409359 408504 406526 409026 411910 413726 414639 414954 417399 418633 416564 415833 413724 409848
14957D09848J64j929L307J004O72J493L176j168m04J120l915l408l008K548L018
14942D12518K797P29J577j271l76J786K113K238k286n74j544l893n88q92Q35L592
14926D16761L0j536k796L17K211K229N16k676J966K307N34j20q53j250j001K41
14910D16880J306J841J768j924M250K104N3j18l40p9J25K039o02j81J645j342
14894D27425q01j670n856k761l10R7k087k191J184L326J371N3j233k612k951m90
14878D10494MM939M572p60L40K389l139j709j397J54J034r25L239j614r6O106
14862D23631M486j655l805m710J651K04j732J981O80N5J139L505L392j099j398
14847D26325J919k752k53j373j070J523K792J639k460m148P9K435J219r6j202
$$ plain form
14957 409848 410012 408083 411390 412394 413066 414559 417735 416567 416163 417283 413368 409960 406952 409500 412518
14942 412518 415315 416044 417621 416350 415974 417760 419873 422111 419825 419251 417707 413814 413226 412334 413169 416761
14926 416761 416791 415255 412459 412776 414987 417216 417732 415056 417022 419329 419863 419743 418890 417640 416639 416880
14910 416880 418186 420027 421795 419871 424121 426225 426278 426160 425820 425741 425866 427905 427303 427122 428767 427425
14894 427425 426624 424954 419098 416337 416027 416124 414037 411846 413030 416356 417727 417780 416547 413935 410984 410494
14878 410494 410498 415437 420009 419249 419589 421978 418839 417130 415733 415887 416921 415996 419235 417621 417525 423631
14862 423631 428117 426462 422657 417947 419598 419802 418070 420051 420731 420786 421925 425430 428822 427723 426325
14847 426325 428244 425492 425239 423866 422796 424319 427111 428750 426290 422142 422221 424656 425875 425779 424577
14832D24577J648L856l134m106j956M04K623N206P41K148R75P1j10q33m25j142
14816D30543m638l601P4k021K604J296m05j467J008o82P7L332K043J388Q46J320
14800D31717j950J506j943J02j07k626k785R37J902K019m778k720k72J253K214
14785D24469J554K3r96L425L410L179o79l387j152Jp09L857Q37k939J335J095
14769D33323j315Nn02k954j523N26j636J588J238k566L936K19l546M719J518R35
14753D33965Q52K395J667l494j956k685R31m3K02m16J943K636O07K017J365k341
14737D37645m535k359L281L854n72J351Q52j854l718k205K956j041j393J330M055
14722D37647j883K81j02J701J135J482l52k124J097q89j296o38J540L706M80l247
$$ plain form
14832 424577 426225 430081 426947 422841 420885 421289 423912 429118 429859 432007 432982 433053 432943 432110 431685 430543
14816 430543 425905 422304 422378 420357 422961 424257 423852 422385 423393 422711 422788 426120 428163 429551 430397 431717
14800 431717 429767 431273 429330 429432 429325 426699 423914 424851 426753 428772 423994 421274 421002 422255 424469
14785 424469 426023 426046 425050 428475 431885 435064 434385 430998 429846 429847 429138 432995 433832 430893 432228 433323
14769 433323 432008 432013 431511 428557 427034 427560 425924 427512 428750 426184 430120 430339 426793 431512 433030 433965
14753 433965 434817 437212 438879 435385 433429 430744 431675 431632 431834 431418 433361 435997 436604 438621 439986 437645
14737 437645 433110 430751 434032 437886 437314 438665 439517 437663 433945 431740 434696 433655 432262 433592 437647
14722 437647 435764 436045 435943 437644 438779 440261 439909 437785 438882 437993 436697 436059 437599 441305 441785 438538
14706D38538n34P97J04R37L620m411j226J408r87j80K21K826J82j6J09N0K437
14689D43875j034m772k527K505J99Q16n88k4k531J308P65K163K801q50J391q47
14673D42650N99l50j068j142k033L598J191P50J978k318n197k670L408M022J396
14658D44814K876K906n49l203j620o37j076l33Q33j334q69p07K067J942r96k27
14642D43887K682M45k467K704l08l797L76K242K75l031j497R59n14M625N338p16
14626D51203n221P22J756k815o21K995N404m64j485k30J265o97l575N82L875J55
14610D52849k329k322L20J14M452L41j330J34l155o78M22J239Q21l193M96L994
14594D52175K518K91j917J937K067R49M35j383k975j91Q2j574L816K741j728J79
$$ plain form
14706 438538 438004 438801 438905 439842 443462 439051 437825 439233 438246 438066 438287 441113 441295 441279 441388 441438 443875
14689 443875 442841 438069 435542 438047 438246 439062 438474 438450 435919 437227 437992 440155 442956 442106 443497 442650
14673 442650 443249 442899 441831 440689 438656 442254 443445 444195 446173 443855 438658 435988 439396 443418 444814
14658 444814 447690 450596 450047 446844 445224 444587 443511 443178 444011 442677 441808 441101 443168 445110 444114 443887
14642 443887 446569 447014 444547 447251 446943 443146 443522 445764 446039 443008 441511 442470 441956 446581 451919 451203
14626 451203 445982 446704 448460 445645 445024 448019 453423 452959 451474 451244 452509 451812 448237 448819 452694 452849
14610 452849 450520 448198 448518 448632 453084 453425 452095 452229 449074 448396 448818 450057 450878 447685 448181 452175
14594 452175 454693 454984 453067 455004 457071 458020 458455 457072 454097 453906 453988 452414 456230 458971 457243 457422
14578D57422p12k351j676l22M170K720o19m347k622L411J140j205K569J940j261
14563D58257k390K90P10L08j139K021K705J628R16l26k921m066j574K305K946
14548D59670j02K767Q88J338J358k393j287J721j392m567o48K20L67K107O10J216
14532D61873k579j649j034J325K45J163K48K192K90k087K024M178k465j248j148
14517D61328k475R15J969k66J063M090K564J420j702l241N24m62j037q47j424
14502D62419j422L502P91J407j353o36j344K455L386J185J160J038j646Q03J349
14487D73094k733l101L095L463j411m734p47K833p11l137j350J49k426K5K527
14472D64836R72J336K682n14j089K15J09Q18q38j569j903J527O223L567J439l761
$$ plain form
14578 457422 456710 454359 452683 452361 456531 459251 458632 454285 451663 455074 456214 455009 457578 459518 458257
14563 458257 455867 456157 456867 457175 456036 458057 460762 462390 463306 462980 460059 455993 454419 456724 459670
14548 459670 459568 462335 463223 464561 465919 463526 462239 463960 462568 458001 457353 457573 457940 460047 460657 461873
14532 461873 459294 457645 456611 457936 458181 459344 459592 461784 462074 459987 462011 466189 463724 462476 461328
14517 461328 458853 459768 461737 461471 462534 466624 469188 470608 468906 465665 466189 465727 464690 463843 462419
14502 462419 460997 464499 465290 466697 465344 464708 463364 465819 469205 470390 471550 472588 470942 471745 473094
14487 473094 470361 467260 470355 473818 472407 467673 466926 469759 469048 465911 464561 464710 462284 462309 464836
14472 464836 465808 467144 469826 469312 468223 468438 468547 469365 468527 466958 465055 466582 472805 476372 477811 474050
14456D74050J057K951l935o64j384o31J034N31j398m257j230L737K294r84K760
14441D73931K284J732k065j583K943K698j925j931k57L266k570l32J221p12m04
14426D76296j075J200K347l10j57p98J382q41J46p96j551k134m08j093K520J661
14410D76389m44o19j299k383L536K585N97J422k309n89N998K106l308J201l543
14395D79340p8J298p85j871r80J68J835k36n95O89J909r24J357Q13k87Q10N7j778
14377D80742J267L493o44n026j843Q32K852J583N75m15J626J553l27N95L540l650
14361D86753k682j047J92Q56J495K21j802j015N74K164O47L52M30R75o01K103
14345D89615J744j745m661j652r32j00K07P37J730o51q55P95L295J164l21J704
$$ plain form
14456 474050 475107 478058 474123 473459 472075 471444 472478 473009 471611 467354 466124 469861 472155 471171 473931
14441 473931 476215 477947 475882 474299 477242 479940 478015 476084 475827 479093 476523 476191 477412 476700 476296
14426 476296 475221 476421 478768 478458 478301 477503 478885 478044 478190 477394 475843 473709 473301 472208 474728 476389
14410 476389 475945 475326 474027 471644 475180 477765 478362 479784 477475 476886 482884 484990 481682 482883 479340
14395 479340 479262 480560 479775 477904 476924 477092 478927 478691 478096 478785 480694 479770 481127 481940 481653 482463 482520 480742
14377 480742 482009 485502 484858 479832 477989 478821 481673 483256 483831 483416 485042 486595 486268 486863 490403 486753
14361 486753 484071 483024 483216 484072 485567 485788 483986 482971 483545 485709 486356 486708 487138 488113 487512 489615
14345 489615 491359 489614 484953 483301 482369 482269 482476 483213 484943 484292 483437 484232 487527 488691 488370 490074
14329D90074L596k018p05L50J190O96M80l280k718L193J796j287l820N94J875
14314D90016J398j261k167k392R13R42j627J605r06N60K348j19l55l094j064O059
14298D90856K984k651q53l02J869L906k96k049J529L777j317J042j555l671k682
14283D90587J893L049q68l107o80J600K386L190m65J132J333K264J153K004O56
14268E06127l015k155p92k109m26k598k218M128N162q40p61M57j323L64J389L09
14252E01699J748l80l403o94k55q53n84j85j383o93M45J611M588K017j44j710
14236E01824j877K657J872J435j771j036j494k287l156j167L935K864m00K001
14222E03400K39k409J173M93M79N50J162K504K776k403k845j96K586K844j102
$$ plain form
14329 490074 493670 491652 490947 491297 492487 493183 493663 490383 487665 490858 492654 491367 487547 488141 490016
14314 490016 491414 490153 487986 485594 486507 487449 485822 487427 486521 487081 489429 489310 488955 485861 484797 490856
14298 490856 493840 491189 490336 490034 491903 495809 495513 493464 494993 498770 497453 498495 496940 493269 490587
14283 490587 492480 495529 494661 491554 490874 492474 494860 498050 497585 498717 500050 502314 503467 505471 506127
14268 506127 503112 500957 500165 498056 497630 495032 492814 496942 502104 501264 500503 500960 499637 500001 501390 501699
14252 501699 503447 503067 499664 498970 498715 497862 497278 497093 495710 495017 495462 497073 501661 503678 503534 501824
14236 501824 499947 502604 504476 505911 504140 503104 501610 499323 496167 495000 498935 501799 501399 503400
14222 503400 503639 501230 502403 502896 503375 503925 505087 507591 510367 507964 505119 504923 507509 510353 509251
14207E09251m21j611o77n54L507L174j104m327j520j145m08J227k079j983R11
14192E02241M021J611N1l32k641j413K412N132K963n83m662j543K665J032M5L086
14176E14085K586K116j233r56k488N51K146n59m214k631J022j073J260J721k243
14161E10090O56N202J756j881r92o76NJ994M78j472j550L850r3n259j144L257
14145E14221J428O93p16k168j060J427K313k462L816L415J503q85P05j984m462
14130E15784j269J736J427l26j670M05K610L105J627r65J187O7K69L95r35m492
14114E18955p78j599p92K946M620l13k069j161k03J600j583k91O49p63j610K199
14098E19807J149J229r6o02n48N59Q52J902K498L251J080m811k688K28J546K67
$$ plain form
14207 509251 508830 507219 506542 505988 509495 512669 511565 507238 505718 504573 504165 505392 503313 501330 502241
14192 502241 506262 507873 507924 507592 504951 503538 505950 511082 514045 513462 508800 507257 509922 510954 510999 514085
14176 514085 516671 518787 517554 516598 514110 514661 516807 516248 512034 509403 510425 509352 510612 512333 510090
14161 510090 510746 515948 517704 515823 514831 514155 514160 516154 516632 515160 513610 517460 517367 512108 510964 514221
14145 514221 515649 516342 515626 513458 512398 513825 516138 513676 517492 520907 522410 521525 522230 520246 515784
14130 515784 514515 516251 517678 517352 515682 516087 518697 521802 523429 522464 523651 523718 523987 524382 523447 518955
14114 518955 518177 516578 515786 518732 523352 523039 520970 519809 519606 521206 519623 519332 519981 519218 517608 519807
14098 519807 520956 522185 522089 521487 520939 521498 522350 524252 526750 530001 531081 526270 523582 523810 525356 525623
14082E25623J036j365k989J158L677o64Q51K736j4k888J916M090p25j78p7o0k375
14065E29752j831J1K72P35R90J28J321j500j097q4M44J92J564M067L049j042n628
14048E31343k419L260J868l596K47J602J740o02L078o90j354J493j063J158k60
14033E35805k613J769J869O84j059J139P13J474o22l021q47l130r56K535M31k771
14017E31400L16L232J448J090P88q73n020l166Q563N873J821k892J676L3L18J736
14001E46343P77k114j670j764L4J021J065l96j443p74j296l89L753M67R96N63
13985E45173J972j250j409L90k11m9O4n20L111p72l40K9j555K535J935J227j053
13968E49277j920p99j502l40J976L01J153L39M41r31K197K194j163j093k885o35
$$ plain form
14082 525623 526659 525294 522305 523463 527140 526476 527327 530063 530049 527161 529077 533167 532442 532264 532187 532127 529752
14065 529752 527921 527932 528204 528939 529929 530057 531378 529878 528781 528697 529141 529333 530897 534964 538013 536971 531343
14048 531343 528924 532184 534052 530456 530703 532305 534045 533443 536521 535831 534477 535970 534907 536065 535805
14033 535805 533192 534961 536830 537514 536455 537594 538307 539781 539159 536138 535291 532161 531205 533740 534171 531400
14017 531400 531716 534948 536396 537486 538274 537401 532381 529215 537778 543651 545472 542580 544256 544289 544607 546343
14001 546343 547120 545006 543336 541572 541606 542627 543692 543296 541853 541079 539783 539394 543147 543614 544610 545173
13985 545173 547145 545895 544486 544876 544665 544616 544680 544160 547271 546499 546159 546188 544633 547168 549103 550330 549277
13968 549277 547357 546558 545056 544716 546692 546993 548146 548485 548926 547995 550192 552386 551223 550130 547245 546610
13952E46610M66K110M44K270Q05J947J754Q80m22l342K62q09j118M186K523j610
13936E56956k962l082n89O86N90L583L005l421r95R52J717k24j89r0J016J101
13920E58054K877J226L7j934K050K134r24l477j270j754k032J286J773L332O591
13905E67969J511j903l082r15R82n78l124J208L149K005j630K906R3l054K942
13890E68479k038j039L0N230L896k016J362K202k633k774M85M093N121M366k630
13875E82134K682J516m16K276L752J305J163K056P111P910Q775N992Q013R980
13861F44249K060p563j7415l7686m7308l9830k3582l984R919J5204J2817Q192
13849E15073L794M453P771Q089L191o99j786M68J401J966J991J260o11J081n73
$$ plain form
13952 546610 547076 549186 549630 551900 552705 554652 556406 557286 556864 553522 553784 552975 551857 556043 558566 556956
13936 556956 553994 550912 550323 551009 551599 555182 558187 554766 553771 554723 556440 556216 556027 555937 556953 558054
13920 558054 560931 562157 562194 560260 562310 564444 563520 560043 558773 557019 554987 556273 558046 561378 567969
13905 567969 569480 567577 564495 563580 564562 563984 560860 562068 565217 567222 565592 568498 568591 565537 568479
13890 568479 566441 565402 565432 570662 574558 572542 573904 576106 573473 570699 571184 575277 580398 584764 582134
13875 582134 584816 586332 585916 588192 591944 593249 594412 596468 603579 611489 620264 626256 634269 644249
13861 644249 646309 638746 621331 583645 536337 496507 472925 468941 478860 494064 506881 515073
13849 515073 518867 523320 531091 539180 542371 541672 539886 540354 541755 543721 545712 546972 546361 547442 546869
13834E46869K877J343L034M7l14J255k954N83K401k473N01L852K899l627j316
13819E54977K868n35L57r7j077J613o08M219J852l74o68k772j087M304L703j245
13803E65430q59m49M068K48J885m11Q38J473k369L74M15M093q40j23M16j626r51
13786E71612j430j688J296q03j156P31K304J07j208k865j673K734L837J411j082
13771E72127j671J420M144M120K183j004l082k634L79K528L97K318O496l57m632
13756E82732Q07m10k439J27J154k868k336J750l48k499J731L45N904N046M04K741
13740E91841o87j019j360j943K102P80l422n14J842n42O83R31K048O60j492K40
13724E90148j851n186q49K487q20k148r25J751K381M873P27o41k708k273P43K129
$$ plain form
13834 546869 549746 551089 554123 554170 553856 555111 552157 552740 555141 552668 553169 557021 559920 556293 554977
13819 554977 557845 557310 557667 557570 556493 558106 557498 561717 563569 563195 562527 559755 558668 562972 566675 565430
13803 565430 564571 564122 568190 568438 570323 569912 570750 572223 569854 570228 570643 574736 573896 573773 574189 572563 571612
13786 571612 570182 568494 569790 568987 567831 568562 570866 570973 569765 566900 565227 567961 571798 573209 572127
13771 572127 570456 571876 576020 580140 582323 581319 578237 575603 575982 578510 578907 581225 587721 587364 582732
13756 582732 583539 583129 580690 580817 581971 579103 576767 578517 578169 575670 577401 577746 583650 588696 589100 591841
13740 591841 591154 590135 588775 586832 588934 589714 586292 585778 587620 587078 587761 588692 590740 591400 589908 590148
13724 590148 588297 583111 582262 584749 583929 581781 580856 582607 584988 589861 590588 589947 587239 584966 585709 587838
13708E87838N0M719M194K448j265l131j85M204J044L83j194J463n50k18K453k398
13692E99855j067o53k037J637J63J811j62k565k366L6P08O8K892M085J577j612
13676F02370j271k439k833K161M58J409J952o46j925R15p87k162J314J466j170
13661E98812k378L295L684o30j925K400K85k34j37J442K060k385j339J893J89
13646F05032J309K861j641K539K591j090m473j546N261J605j490k221K703L364
13632F14804J096l971l391J933K64j704k037L033L137R91j25J65j013k347j135
13617F09700Q98J907j663j952J164K082J167n80O80M03k747k448L104K095O24
13602F14434J464R59j363o92k67j642J356L969l1M22J629P47j666N5n37K84J915
$$ plain form
13708 587838 587888 592607 596801 599249 597984 594853 594668 598872 599916 600299 599105 600568 600018 599800 602253 599855
13692 599855 598788 598135 596098 597735 597898 599709 599547 596982 594616 594652 595360 595428 598320 602405 603982 602370
13676 602370 601099 598660 595827 597988 598446 599855 601807 601161 599236 600151 599364 597202 598516 599982 598812
13661 598812 596434 599729 603413 602783 600858 603258 603543 603309 603172 604614 606674 604289 602950 604843 605032
13646 605032 606341 609202 607561 610100 612691 611601 607128 605582 610843 612448 610958 608737 611440 614804
13632 614804 615900 611929 608538 610471 610735 609031 606994 610027 613164 614155 614030 614195 613182 610835 609700
13617 609700 610598 612505 610842 608890 610054 612136 613303 612723 613403 613806 611059 608611 611715 613810 614434
13602 614434 615898 616857 615494 614802 614535 612893 614249 618218 618187 618609 620238 620985 619319 619374 618837 619121 621036
13585F21036l33k141k763M15J437K93L65j061L741K010Q16l159J731k583R52L983
13569F24739Q37J33j111k868j437J88K411K003o04j265O45O82j520o22M753K819
13553F29783j574N16M843O21k142J408K207M72k655N96j329j527j642J502j611
13538F29468k072N155L926j976j619j537j324J92l06J006L723k52k542k565L345
13523F32622J634j843J485J86p91L096M584k620k588k74k620J70R18L995L633
13508F41587j105k016R63J016R2J096j37Q43l002K59J297J307N2o20m74j302J859
13491F41715j258m20L391j401j739j051j741L204j491K234P24N33m63J213K643
13476F46093N74J35o86J052K255m11O83j879q56K182P86l400q88K275j59j244
$$ plain form
13585 621036 620703 618562 615799 616214 617651 617944 618309 617248 620989 622999 623815 620656 622387 619804 620756 624739
13569 624739 625576 625709 624598 621730 620293 620481 622892 624895 624291 623026 623671 624353 622833 622211 626964 629783
13553 629783 628209 628725 633568 634189 632047 633455 635662 636134 633479 634075 632746 631219 629577 631079 629468
13538 629468 627396 632551 636477 634501 632882 631345 630021 630213 629907 630913 634636 634384 631842 629277 632622
13523 632622 634256 632413 633898 634084 633293 636389 640973 638353 635765 635491 632871 633041 633959 637954 641587
13508 641587 640482 638466 639429 640445 640537 641633 641496 642339 639337 639596 640893 642200 642252 641632 641158 639856 641715
13491 641715 640457 640037 643428 642027 640288 639237 637496 640700 639209 641443 642167 642700 642237 643450 646093
13476 646093 646667 646802 646116 647168 649423 649012 649695 647816 646960 649142 649928 646528 645640 647915 647756 646512
13460F46512k078j082K151L062L503m18k282j832J737k38M739p08L027J584l78
13445F57299J031J73j491Q07K689n34j865j752k527K542K66j476K140M48j490
13430F56260J602J227K077l631j271N18L081J96k500n99O27K3J492l79j724oK60
13413F57253K302K201k121M935K852k442j062j073K038J144o9K467L45k081N55
13398F67244j463M11N25O10L162N74j858k029j405K481r74q61J374J907J06R66
13382F70770J766j951l100K36J152J266L206L579j227l06K239J055k245m194j742
13367F70504j261r97o42M0K080K520L312j453k410J320p36n1r9m44L158K099j142
13350F75798j522j96J513p60R14l821j31M229M295k945k248K263Q57J019K965
$$ plain form
13460 646512 644434 643352 645503 648565 652068 651650 649368 647536 649273 649035 653774 653066 656093 657677 657299
13445 657299 658330 658503 657012 657819 660508 659974 658109 656357 653830 656372 656638 655162 657302 657750 656260
13430 656260 657862 659089 661166 657535 656264 656782 659863 660059 657559 656960 657587 657610 659102 658723 656999 656993 657253
13413 657253 659555 661756 659635 664570 667422 664980 663918 662845 664883 666027 665958 668425 668770 666689 667244
13398 667244 665781 666192 666717 667327 670489 671063 669205 667176 665771 668252 667278 666417 667791 669698 669804 670770
13382 670770 672536 670585 667485 667721 668873 670139 673345 676924 675697 675391 677630 678685 676440 672246 670504
13367 670504 669243 668246 667604 667644 669724 672244 675556 674103 671693 673013 672277 672226 672127 671683 674841 676940 675798
13350 675798 674276 674080 675593 674833 675747 671926 671795 676024 680319 677374 675126 677389 678246 679265 682230
13335F82230K90k430m031J891N18q79k48j628M85J952p75l0K073N082N518M87
13319F90505j228r11M34k027j665k660J289M153L744j180J682r17P08J799j855
13304F91871m639N58M279M14J335k283p16J047L716n94j437K621j835o41J436
13289F95132J378J395N11Q17O89m078J12K905p8k432J768P93k988K245J648J112
13273G00929L28J76N3j565l87J448n311L67J509j085J415k194J681O004J762Q81
13257G06011K57O10L13k491l688j468K990P89r47n82J465mK241Q08j167J846K843
13240G09826K491l589k508J460R95j17P85J177K572o52j342n572k345j719K557
13225G04019N292M872J581J868j505j953J578K51J162k46K33j2K070k699k453
$$ plain form
13335 682230 682520 680090 676059 677950 678468 677589 677341 675713 676198 678150 677375 677345 679418 684500 690018 690505
13319 690505 689277 688366 688800 686773 685108 682448 683737 687890 691634 690454 692136 691219 691927 693726 691871
13304 691871 687232 687790 692069 692483 693818 691535 690819 691866 695582 694988 693551 696172 694337 693696 695132
13289 695132 696510 697905 698416 699233 699922 695844 695956 698861 698783 696351 698119 698912 695924 698169 699817 700929
13273 700929 701257 701433 701486 699921 699534 700982 695671 696038 697547 696462 697877 695683 697364 703368 705130 706011
13257 706011 706268 706878 707191 704700 701012 699544 702534 703323 702376 701794 703259 703255 705496 706304 705137 706983 709826
13240 709826 712317 708728 706220 707680 708675 708558 709343 710520 713092 712440 711098 705526 703181 701462 704019
13225 704019 709311 714183 715764 717632 716127 714174 715752 716003 717165 716919 717152 717140 719210 716511 714058
13210G14058L75Q00o20K639K241N69k391%L90L778N23j441r72J793J728J732o37
13193G24565l984j359j362n60M321J553o43Pj712j446J373K662K231L77j363K340
13177G27000K597J409J019p49j728l54K014k335m793j838M032N188L151l472n39
13162G30602L72p20J175M870N53j626o68k230J327K721K23l028k334K864L631
13147G37732J441Q26L896L49l904o525p77L055J208q44J03K190Q29J814J316p44
13131G41965R22J676Q0j451k015L860p10N30J989J78p61K634o88k356J401L308
13115G50562j356j759l370L49M227q32Q58M942J112j307j68j847K386n82O83R84
13099G54882L113J022J058K142l199j140m501p2K237K511o7p9J214n17N46J431
$$ plain form
13210 714058 714433 715233 714613 717252 719493 720062 717671 717671 718061 721839 722362 720921 719949 721742 723470 725202 724565
13193 724565 720581 719222 717860 717300 721621 723174 722531 722538 720826 719380 720753 723415 725646 726023 724660 727000
13177 727000 729597 731006 732025 731276 729548 729194 731208 728873 724080 722242 726274 731462 734613 731141 730602
13162 730602 730974 730254 731429 736299 736852 735226 734558 732328 733655 736376 736599 733571 731237 734101 737732
13147 737732 739173 739999 743895 744244 740340 733815 733038 736093 737301 736457 736560 738750 739579 741393 742709 741965
13131 741965 742887 744563 744643 743192 741177 745037 744327 744857 746846 747024 746263 748897 748209 745853 747254 750562
13115 750562 749206 747447 744077 744426 748653 747821 748679 753621 754733 753426 753258 751411 753797 753215 753898 754882
13099 754882 757995 759017 760075 762217 759018 757878 753377 753305 755542 758053 757986 757907 759121 758604 759150 760581
13083G60581M037R4k552m701J464Q6j123o46r82Q13J645K353J962L326J642j578
13067G66421j231K99j774j327j881P29p78n8L467J813M06j539k927J069K013j04
13051G64598J179M524L960r6l743k274J949j397J783J864j02k05m067l172L028
13036G67829J320M7P48M67k873N720N068j45j566j723Q1m34J783P46M29r96j890
13019G74611N71o36J231L680J722j061k396K089M28J47J044J327P08r8l64j118
13003G81885m30j543p59K59K203J443K317K289l935L022L984l493j592J442Q06
12988G87898L873j735k975q96J852L298k168l773J202J627k579J004J940K119
12974G90687l810l20L571K177j002K744J967k76K71l028N46j60j532j922j7k98
$$ plain form
13083 760581 764618 764712 762160 757459 758923 759009 757886 757240 756258 757071 758716 761069 763031 766357 767999 766421
13067 766421 765190 765489 763715 762388 760507 761236 760458 760400 763867 765680 766086 764547 761620 762689 764702 764598
13051 764598 765777 770301 774261 774165 770422 768148 770097 768700 770483 772347 772245 772040 767973 764801 767829
13036 767829 769149 769196 769944 770411 767538 773258 778326 778181 776615 774892 774973 774539 776322 777068 777497 776501 774611
13019 774611 775182 774546 775777 779457 781179 780118 777722 779811 780239 780386 781430 782757 783465 783367 783003 781885
13003 781885 781455 779912 779153 779412 781615 783058 785375 787664 783729 786751 790735 787242 785650 787092 787898
12988 787898 791771 790036 787061 786165 788017 791315 789147 785374 786576 788203 785624 786628 788568 790687
12974 790687 786877 786557 790128 792305 791303 794047 796014 795738 796009 792981 793527 793367 791835 789913 789896 789598
12958G89598r6q46O0M916L773O19J227n50Q92M717K961R25ol849k598q4j498J547
12940H01708L994K485j889Q94j60M44N591q40j435j229O23J147r40m274k349K329
12924H06099M518j138J977J744j453m016j738J720r65K54R89L333O70M312L603
12909H19909j079j66n94j29l313k774J16J751J126j085J949P81k732j433k88q5
12893H11954J283o93j751M488P570O895L434l826n896k206j523l42J513N47P94
12878H22241L127L724J086J339r96p63j880l366p02K700L52N8J13n53M125J348
12862H31953J380j11j647P18J793O84J125K464j106l412P63K394J737r14R65m94
12846H38292j162K49j54J457k383j694K078K310p36K030K595L06q37L511l66j870
$$ plain form
12958 789598 789502 788656 788716 793632 797405 798024 799251 798701 799593 804310 807271 808196 808190 804341 801743 801659 800161 801708
12940 801708 805702 808187 806298 807192 807032 807476 813067 812227 810792 809563 810186 811333 810393 806119 803770 806099
12924 806099 810617 809479 811456 813200 811747 807731 805993 807713 806748 807002 807991 811324 811994 816306 819909
12909 819909 818830 818664 818070 817941 814628 811854 811970 813721 814847 813762 815711 816492 813760 812327 812039 811954
12893 811954 813237 812544 810793 815281 822851 829746 833180 829354 823458 821252 819729 819387 820900 821447 822241
12878 822241 825368 829092 830178 831517 830521 829758 827878 824512 823810 826510 826862 826920 827033 826480 830605 831953
12862 831953 833333 833222 831575 832293 834086 834770 835895 838359 837253 833841 834604 836998 838735 837821 838786 838292
12846 838292 837130 837379 837225 838682 836299 834605 836683 838993 838257 840287 842882 843188 842351 845862 845496 843626
12830H43626K992N37n87l291m049K301K730J744K205O99J425n51Q59J692j488
12815H50844m253o69J220R23Q89J53J274L35j150k40J841q25n40N51L636K749
12799H56738J114q70J833O10j31p90O80J420k74k119j04J81L166M19l700L301
12783H61474N531j120m092j9p43k096p82Q5N94kpJ979K355J739M92q08M295K229
12765H71104L31k311l461j428K393J357J153J077J637K014J88l619l101j541K342
12750H68135J253J369L72k756Q47K078J014K130r01p15L886J303K809J931r27
12735H81828M16q73j206k023j453j926N50L659m10k050r7M71j049k315j83K642
12719H75981L193L393k033m36K022j59N40L206L662L685J65r32r38L406j383R63
$$ plain form
12830 843626 846618 847155 846568 843277 839228 841529 844259 846003 848208 848907 850332 849781 850640 852332 850844
12815 850844 846591 845922 847142 848065 848954 849107 850381 850716 849566 849326 851167 850342 849802 850353 853989 856738
12799 856738 857852 856982 858815 859425 859294 858504 859184 860604 860330 858211 858107 858288 861454 861873 858173 861474
12783 861474 867005 865885 861793 861774 861031 858935 858153 858238 858832 858830 858823 860802 863157 864896 865388 864580 868875 871104
12765 871104 871435 869124 865663 864235 866628 867985 869138 870215 871852 873866 874054 870435 867334 865793 868135
12750 868135 869388 870757 871129 868373 869220 871298 872312 874442 873541 872826 876712 878015 880824 882755 881828
12735 881828 882244 881371 880165 878142 876689 874763 875313 878972 878562 876512 876415 876886 875837 873522 873339 875981
12719 875981 879174 882567 880534 880098 882120 881961 882501 885707 889369 893054 893219 892287 891349 894755 893372 894335
12703H94335M18k829j284l2J038q13L373n20j896n51j51L264K02J784L934L468
12687I03740p93k38k160k778R76m4L765J243J252O32k517j849m66L678L258J896
12671I09595j185l649K114L405J734m684M47p8oJ8k588O51M258n68N12K077J205
12654I13258j927p97l49n05Q32M359K226k167j566P72L320J805J757l34l380K156
12638I19460M409R75k540K26L365k534m013K205J826J923J877l63K56J800L00
12623I29172N0p83j925j359K775Q16O08L671L368j84j155j770J196m31k994J127
12607I32182J645J307j056J355N087J128l586o24L185P87J2K044J333J605K466
12592I48870l433J799K467k550l217L81K113J750q76J636J214J818J976J543p04
$$ plain form
12703 894335 894753 891924 890640 890608 891646 890833 894206 893686 891790 891239 891088 894352 894554 896338 900272 903740
12687 903740 902947 902709 900549 897771 898747 898703 902468 903711 904963 905595 903078 901229 900763 904441 907699 909595
12671 909595 908410 904761 906875 910280 912014 907330 907777 907699 907693 907711 905123 905774 910032 909464 909976 912053 913258
12654 913258 911331 910534 910185 909680 910512 914871 917097 914930 913364 914136 917456 919261 921018 920684 917304 919460
12638 919460 923869 924844 922304 922530 925895 923361 919348 921553 923379 925302 927179 926816 927072 928872 929172
12623 929172 929222 928439 926514 925155 927930 928746 929354 933025 936393 936209 935054 933284 934480 934049 931055 932182
12607 932182 933827 935134 934078 935433 940520 941648 938062 937438 940623 941410 941422 943466 944799 946404 948870
12592 948870 945437 947236 949703 947153 943936 944317 946430 948180 947304 948940 950154 951972 953948 955491 954787
12577I54787L11n76p7k789J098J390M094M307j064m342m536j730J407O107j348
12562I57039j489n75J857J276N359J877k548l193q76K846R53K482J190J021J70
12547I67389N70K238L114K980o70m610o90L597N33k28j853j240L479r0j195j126
12531I72198J541K927L697K973K85p27j042J726K434p08L59l430j141M289R38
12516I86319k867o71K130J373K386M376Q94J920K879k344k300M501L178L18j427
12501A000665m226j106J925j042L38l9N28l31J252L376j337n309l82J954L554
12486I99820L281P737P87j272l542l303k405j609N052N248P79k911P69J142r19
12471A008654j693L933M393J953P61j618J133J506R65l289J056K653K376R59n60
$$ plain form
12577 954787 955098 954522 954445 951656 952754 954144 958238 962545 961481 957139 952603 950873 952280 958387 957039
12562 957039 955550 954975 956832 958108 963467 965344 962796 959603 958727 961573 962526 965008 966198 967219 967389
12547 967389 967959 970197 973311 976291 975621 971011 970321 973918 974451 974223 972370 971130 974609 974519 973324 972198
12531 972198 973739 976666 980363 983336 983621 982894 981852 983578 986012 985304 985663 982233 981092 985381 986319
12516 986319 983452 982781 984911 986284 988670 993046 993940 995860 998739 996395 994095 998596 1001774 1002092 1000665
12501 1000665 996439 995333 997258 996216 996554 996515 997043 996712 997964 1001340 1000003 994694 994312 996266 999820
12486 999820 1003101 1010838 1011625 1010353 1006811 1003508 1001103 999494 1004546 1009794 1010573 1007662 1008431 1009573 1008654
12471 1008654 1006961 1010894 1015287 1017240 1018001 1016383 1017516 1019022 1019987 1016698 1017754 1020407 1022783 1023742 1023182
12456A023182p95J044K315j03j107o77J425J474L420L483j836k559J67L511k355
12441A030589p2J251Q39L416L114q06p29j299j06k407j483M204M741J941n05j49
12425A042539J867K176n221K642M105L361K96K880K8j825j161L884M847J22n192
12410A055348q677l705J041N971O667p16j167o58P83P72K028Q2J840M725M488
12395A068822M19j677j601L032n10J378M714J004l01m73L106j884l195Q97N479
12380A079210K188K92O41l663q54L583L135k862M64j3J756P14k834L17J274J394
12364A084742J365J983M396N09j076L138j236j025J822J699j054J022J253m320
12350A093218J202K357K359q9N19K011J92J291J404L077J147j93j535j93k197
$$ plain form
12456 1023182 1022387 1023431 1025746 1025643 1024536 1023859 1025284 1026758 1030178 1033661 1031825 1029266 1029433 1032944 1030589
12441 1030589 1030517 1031768 1032607 1036023 1039137 1038331 1037602 1036303 1036197 1033790 1032307 1036511 1041252 1043193 1042688 1042539
12425 1042539 1044406 1046582 1041361 1044003 1048108 1051469 1051765 1054645 1054673 1052848 1051687 1055571 1060418 1060540 1055348
12410 1055348 1046671 1042966 1044007 1049978 1056645 1055929 1054762 1054104 1054887 1055659 1057687 1057769 1059609 1064334 1068822
12395 1068822 1069241 1067564 1065963 1068995 1068485 1069863 1074577 1075581 1075280 1074807 1077913 1076029 1072834 1073731 1079210
12380 1079210 1081398 1081690 1082331 1078668 1077814 1081397 1084532 1081670 1082134 1082121 1083877 1084591 1081757 1082074 1083348 1084742
12364 1084742 1086107 1088090 1092486 1092995 1091919 1095057 1093821 1092796 1094618 1096317 1095263 1096285 1097538 1093218
12350 1093218 1094420 1096777 1099136 1099047 1099566 1101577 1101769 1103060 1104464 1107541 1108688 1108495 1106960 1106767 1104570
12335A104570K644K688Q16K506K414J859M362J409j844j612L338L306R84m24n309
12320A121707j397J294M748K079k642k290K604N01J361J876L434m9k068m213J548
12305A128493K599k131L435L967k568K574R58J148O75J557J206J095R18L382m52
12290A146856k82K230j584J894K468N727J843j059k838q80K886J071j574k02L71
12275A156927O23J72O142L115k353J019R32K038M1J32J276p7L49M106K741l583
12259A173600j962K614P74J881j651J905J608n91O211M190k206K57K437J088J298
12244A191453J875q60j306K84L262R79m60l505L66L945J576J227k820J425K701
12229A200142J323j146n80M188K060j876J421M117M019K530o55O26j02l172j355
$$ plain form
12335 1104570 1107214 1109902 1110718 1113224 1115638 1117497 1121859 1123268 1121424 1119812 1123150 1126456 1127440 1127016 1121707
12320 1121707 1120310 1121604 1126352 1128431 1125789 1123499 1126103 1126604 1127965 1129841 1133275 1133226 1131158 1126945 1128493
12305 1128493 1131092 1128961 1132396 1136363 1133795 1136369 1137327 1138475 1139150 1140707 1141913 1143008 1143926 1147308 1146856
12290 1146856 1146574 1148804 1147220 1149114 1151582 1157309 1159152 1158093 1155255 1154375 1157261 1158332 1156758 1156556 1156927
12275 1156927 1157550 1157722 1163864 1166979 1164626 1165645 1166577 1168615 1168656 1168788 1170064 1169987 1170336 1174442 1177183 1173600
12259 1173600 1171638 1174252 1175026 1176907 1175256 1177161 1178769 1178178 1184389 1188579 1186373 1186630 1189067 1190155 1191453
12244 1191453 1193328 1192468 1191162 1191446 1194708 1195687 1195227 1191722 1192088 1196033 1197609 1198836 1196016 1197441 1200142
12229 1200142 1201465 1200319 1199739 1203927 1205987 1204111 1205532 1209649 1213668 1216198 1215543 1216169 1216067 1212895 1211540
12214A211540J121N46L00R25J409K292N56L744Qj463P7K647K146J988r22j520
12198A225394J909L738J405o42L2J077J582N01j44M80j279n85K714M204N812N84
12182A246782k363j63K015K724J879M202L274K168n32j041m639Q29K321M69j345
12167A256580J969P440J363o97j876J023j025r66L377M606N624p14J343M4j09
12152A277982L61K052Q29K656Q49j840j76P39L944n82q1k045j031K824M648O092
12136A297221J24J558L032J969L49j857N79j495j024P28L298J661K123L503L909
12121A315678J687K4L710J504l121l578j83L144J608M251M935R41R63k68N22J41
12105A331958K379j129M10K230L94J26J553P96L90N100N31j810n86J05j657P78
$$ plain form
12214 1211540 1212661 1213207 1213507 1214432 1215841 1218133 1218689 1222433 1222441 1220978 1221055 1223702 1225848 1227836 1226914 1225394
12198 1225394 1227303 1231041 1232446 1231804 1231836 1232913 1234495 1234996 1234852 1235332 1234053 1233468 1236182 1240386 1246198 1246782
12182 1246782 1244419 1244256 1246271 1248995 1250874 1255076 1258350 1260518 1259986 1258945 1254306 1255135 1257456 1257925 1256580
12167 1256580 1258549 1265989 1267352 1266655 1264779 1265802 1264777 1263811 1267188 1271794 1277418 1276704 1278047 1278091 1277982
12152 1277982 1278343 1280395 1281224 1283880 1284729 1282889 1282713 1283452 1287396 1286814 1286733 1284688 1283657 1286481 1291129 1297221
12136 1297221 1297345 1298903 1301935 1303904 1304253 1302396 1302975 1301480 1300456 1301184 1304482 1306143 1308266 1311769 1315678
12121 1315678 1317365 1317389 1321099 1322603 1319482 1315904 1315721 1318865 1320473 1324724 1329659 1330600 1331563 1331295 1331817 1331958
12105 1331958 1334337 1333208 1333618 1335848 1336242 1336368 1337921 1338717 1339107 1344207 1344738 1342928 1342342 1342447 1340790 1341568
12089A341568L164L080K754L761Q91J863L227J004L353K370j009k570r42M8N25
12074A363087J484P306O788n60K022M27m028j891J127J361N040k205k183L759
12060A381534M022k078k6O58J857L796N631O3p98p10J102P318L195o0J23K876
12044A408503M892M11K250M25o98K663K114L912N297N664J347J749l45J3j019
12029A437178o732p384q017l857j646Q00L970K122J118L447M043J343J66K891
12015A429442M25l43q89L692n44K581J507M3L932O853K180N38k527J752L972J128
11999A453742L284K794J575o72j833K254L903K152R81K371N15J812K580L653K276
11984A481387K551J45N224L360j808j416M483L614K041O14J406j029J738J767
$$ plain form
12089 1341568 1344732 1347812 1350566 1354327 1355218 1357081 1360308 1361312 1364665 1367035 1366026 1363456 1362514 1362562 1363087
12074 1363087 1364571 1371877 1378665 1378105 1380127 1380554 1376526 1374635 1375762 1377123 1382163 1379958 1377775 1381534
12060 1381534 1385556 1383478 1383452 1384110 1385967 1389763 1395394 1395457 1394659 1393949 1395051 1402369 1405564 1405504 1405627 1408503
12044 1408503 1413395 1413806 1416056 1416481 1415783 1418446 1420560 1424472 1429769 1435433 1436780 1438529 1438184 1438197 1437178
12029 1437178 1430446 1423062 1415045 1411188 1409542 1410342 1414312 1416434 1417552 1420999 1425042 1426385 1426551 1429442
12015 1429442 1429867 1429524 1428635 1432327 1431783 1434364 1435871 1435914 1439846 1446699 1448879 1449417 1446890 1448642 1452614 1453742
11999 1453742 1457026 1459820 1461395 1460723 1458890 1461144 1465047 1467199 1468180 1470551 1471066 1472878 1475458 1479111 1481387
11984 1481387 1483938 1484083 1489307 1492667 1490859 1489443 1493926 1497540 1499581 1500195 1501601 1500572 1502310 1504077
11970A504077L598j79J589J451J151k4M241K077j650J627k75J582M073O835n69
11955A529604k338K119J383l70O00L251K28N132O331K848J983J720j833l97K837
11940A553098K255k181J839L782L468l794m304N034J1756J2710O132p20m947k033
11926A582095K446J776R44J899k485L89J951J313j027L292J543J10l91N274O584
11911A605713L537o12j421N109O311J602L607N859J638o56L255K974j135Q47J042
11896A637670L118j773K583L473K555K419N326M133M887M110j080k15K320O264
11882A675790L436J532m601r602j1540q832m737K856M834L629L038N216M933P499
11868A673451L148J156K925J647K652K330M875l79J567L595N485L99K881L885
$$ plain form
11970 1504077 1507675 1507496 1509085 1510536 1511687 1511663 1515904 1517981 1516331 1517958 1517683 1519265 1523338 1530173 1529604
11955 1529604 1527266 1529385 1530768 1530398 1530998 1534249 1534477 1539609 1545940 1548788 1550771 1552491 1550658 1550261 1553098
11940 1553098 1555353 1553172 1555011 1558793 1562261 1558467 1554163 1559197 1570953 1583663 1589795 1589075 1584128 1582095
11926 1582095 1584541 1586317 1587261 1589160 1586675 1587064 1589015 1590328 1589301 1592593 1594136 1594246 1593855 1599129 1605713
11911 1605713 1609250 1608638 1607217 1612326 1618637 1620239 1623846 1629705 1631343 1630687 1633942 1636916 1635781 1636628 1637670
11896 1637670 1640788 1639015 1641598 1645071 1647626 1650045 1655371 1659504 1664391 1668501 1667421 1667206 1669526 1675790
11882 1675790 1679226 1680758 1676157 1666555 1655015 1646183 1641446 1644302 1649136 1652765 1655803 1661019 1665952 1673451
11868 1673451 1676599 1677755 1680680 1682327 1684979 1687309 1692184 1691805 1693372 1696967 1702452 1702851 1705732 1709617
11854A709617J361J806n49L447O591J265O39J243K860l87J350M269L193J068L586
11839A741359K477K887J139J210J298K575K460K679M282P399L772J599q53n92
11825A773691O74M081N151M401j251N14L844L550L502Q63l247j558M776L790P401
11810A810182K708K708K435L584L654L268K914J431L24Q4K078N656N640M550J193
11795A852409K753k67Q2M173M765L519M780L432L262M098L582N772J200K007L329
11780A898896j003J442L109L587J809L152L236Q97M198N388M646K360M686L787
11766A940190K767J163J077K478N476L885K961P049M593J648O183M410J401M050
11752A989331N691K868p46P55O7j100k257K56J929K921K828N112K751J939N002
$$ plain form
11854 1709617 1710978 1712784 1712235 1715682 1722273 1723538 1724177 1725420 1728280 1727893 1729243 1733512 1736705 1737773 1741359
11839 1741359 1743836 1746723 1747862 1749072 1750370 1752945 1755405 1758084 1762366 1769765 1773537 1775136 1774283 1773691
11825 1773691 1774365 1778446 1783597 1787998 1786747 1787261 1791105 1794655 1798157 1799020 1795773 1794215 1798991 1802781 1810182
11810 1810182 1812890 1815598 1818033 1821617 1825271 1828539 1831453 1832884 1833208 1833292 1835370 1841026 1846666 1851216 1852409
11795 1852409 1855162 1854895 1854977 1859150 1863915 1867434 1872214 1875646 1878908 1883006 1886588 1892360 1893560 1895567 1898896
11780 1898896 1897893 1899335 1902444 1906031 1907840 1910992 1914228 1915125 1919323 1924711 1929357 1931717 1936403 1940190
11766 1940190 1942957 1944120 1945197 1947675 1953151 1957036 1959997 1967046 1971639 1973287 1979470 1983880 1985281 1989331
11752 1989331 1995022 1997890 1997144 1997899 1997966 1996866 1994609 1994865 1996794 1999715 2002543 2007655 2010406 2012345 2017347
11737B017347O757N833Q580N983J711L643N189M649R63n62K688Q091O140Q053
11723B085065O829J987M603O922M256L044M556M219J114P274O668O523J775J093
11709B145928M334M329Q786O395K504K648K6K852P044R278M750J931K009N690
11695B208504Q389O853P665P330L973L902N618P236M474N204R984P638N702M978
11681B297450K775M185R379Q367P159M934N041M736Q341Q979J1374J1581O640
11668B390941N612Q999P385N024O607O294J1842J0087O962J0251J0705R393O821
11655B496923R648J3726J2863R964R616J3193J2091R575R400J1200R594J0088
11643B627881J0608J8750K0012J5529J3350J8802J9478J9511J7246K0817J7975
$$ plain form
11737 2017347 2024104 2029937 2038517 2044500 2046211 2049854 2055043 2059692 2060655 2060093 2062781 2070872 2077012 2085065
11723 2085065 2091894 2093881 2098484 2105406 2109662 2112706 2117262 2121481 2122595 2129869 2136537 2143060 2144835 2145928
11709 2145928 2150262 2154591 2163377 2169772 2172276 2174924 2174950 2177802 2184846 2194124 2198874 2200805 2202814 2208504
11695 2208504 2216893 2223746 2231411 2238741 2242714 2246616 2252234 2259470 2263944 2269148 2279132 2286770 2292472 2297450
11681 2297450 2300225 2304410 2313789 2322156 2329315 2334249 2339290 2344026 2352367 2361346 2372720 2384301 2390941
11668 2390941 2396553 2405552 2412937 2417961 2424568 2430862 2442704 2452791 2459753 2470004 2480709 2490102 2496923
11655 2496923 2506571 2520297 2533160 2543124 2552740 2565933 2578024 2587599 2596999 2608199 2617793 2627881
11643 2627881 2638489 2657239 2677251 2692780 2706130 2724932 2744410 2763921 2781167 2801984 2819959
11632B819959J5788K0388K1856K4103K4749K0291K1586K6997L2411K8804K9869
11621C086801L5591L5631L7286L7987L8877M4717M6419M9451N2587O2204O8951
11610C596502P3801P9814Q5296Q7714R7313J06952J19971J35734J53059J72719
11600D708875J96618K13833K37317K65809K87533K84729K34654Q3991k38942q11053
11590E463364j593293k190123k040595j232812m04395Q6385K83893L29038L16561
11581i81977K85010K47451K12028J88149J65093J43891J25789J04960R9039R4447
11571F83880R2487Q4353P2675O2144N7988O4535N8642N6812M8712M6878M6243
11560A375349M1830L7995L3509L2794L5274K9653K5802K6190K8508L1803K8097
$$ plain form
11632 2819959 2835747 2856135 2877991 2902094 2926843 2947134 2968720 2995717 3028128 3056932 3086801
11621 3086801 3122392 3158023 3195309 3233296 3272173 3316890 3363309 3412760 3465347 3527551 3596502
11610 3596502 3670303 3750117 3835413 3923127 4020440 4127392 4247363 4383097 4536156 4708875
11600 4708875 4905493 5119326 5356643 5622452 5909985 6194714 6429368 6513359 6274417 5463364
11590 5463364 3870071 1679948 -360647 -1593459 -1997854 -1911469 -1627576 -1298538 -981977
11581 -981977 -696967 -449516 -237488 -49339 115754 259645 385434 490394 589433 683880
11571 683880 776367 860720 933395 995539 1053527 1118062 1176704 1233516 1282228 1329106 1375349
11560 1375349 1417179 1455174 1488683 1521477 1556751 1586404 1612206 1638396 1666904 1698707 1726804
11549A726804K0928K1567K5569K5396K3489K3283K0634K4996K4045J9202J3512
11538A969425J2431K0163J8661J6863J7551J5880K0590J7737J8866J6410J2678
11527B157255J5586J5137J2204J3191J4642J4243J4377J4673J5886J7177J2351
11516B316722J6924J6569J2863J6548J8324J4169R266J4974J6017J4425J3843
11505B480644J7801J8146J6329J3087J2061J6848J6794J2546J4284J6924J8379
11494B653843J8733J9323J7654J5169J9840K2160K1424K0847K0292K1138K3230
11483B873653K5351J8414K0990K4675K4142K1811J9645K4482K6620K7168L3947
11472C140898L4821L6695L6840L8301M2708M3580M7798M8203M9037N7211O1042
$$ plain form
11549 1726804 1747732 1769299 1794868 1820264 1843753 1867036 1887670 1912666 1936711 1955913 1969425
11538 1969425 1981856 2002019 2020680 2037543 2055094 2070974 2091564 2109301 2128167 2144577 2157255
11527 2157255 2172841 2187978 2200182 2213373 2228015 2242258 2256635 2271308 2287194 2304371 2316722
11516 2316722 2333646 2350215 2363078 2379626 2397950 2412119 2421385 2436359 2452376 2466801 2480644
11505 2480644 2498445 2516591 2532920 2546007 2558068 2574916 2591710 2604256 2618540 2635464 2653843
11494 2653843 2672576 2691899 2709553 2724722 2744562 2766722 2788146 2808993 2829285 2850423 2873653
11483 2873653 2899004 2917418 2938408 2963083 2987225 3009036 3028681 3053163 3079783 3106951 3140898
11472 3140898 3175719 3212414 3249254 3287555 3330263 3373843 3421641 3469844 3518881 3576092 3637134
11461C637134O6685P1360P6504Q0697R2564J07342J17638J15555J15497J31762
11451D612738J66910J94095K01040K07910K33716K61758K69785K34735J26497
11442F509184j31767o21413j349379k063127k184796j513587o11873P002K78613
11433a681143L57037L53438L18648K74246K28283J88089J64895J53529J46305
11424E03327J33580J23459J10579J00229R4612Q4912Q1374P8762P2218O9184O3987
11413A516223O1272N7527N5178M7268M3436M4201N1736N2134N1720N3564N2388
11402B086647N1549N3022O4497O8782P4730Q3402R1818J00220J06554R5671L9237
11391B916129j18969m22070o48292n08012j41530R3335J45291J33303J14761R0214
$$ plain form
11461 3637134 3703819 3775179 3851683 3932380 4024944 4132286 4249924 4365479 4480976 4612738
11451 4612738 4779648 4973743 5174783 5382693 5616409 5878167 6147952 6382687 6509184
11442 6509184 6377417 5756004 4406625 2343498 158702 -1354885 -1966758 -1959756 -1681143
11433 -1681143 -1324106 -970668 -652020 -377774 -149491 38598 203493 357022 503327
11424 503327 636907 760366 870945 971174 1065786 1150698 1232072 1310834 1383052 1452236 1516223
11413 1516223 1577495 1635022 1690200 1737468 1780904 1825105 1876841 1928975 1980695 2034259 2086647
11402 2086647 2138196 2191218 2255715 2324497 2399227 2482629 2574447 2674667 2781221 2876892 2916129
11391 2916129 2797160 2375090 1726798 1218786 1077256 1170591 1315882 1449185 1563946 1654160
11381A654160P5255O6243N9055M6189M2413L9121L0450L0203K8608K5496K1581
11370B118774K0265K3673J9328K0468J6046J6195J6602J8939K1396K1107J5026
11359B327819J6184J5963J8063J0190J0883J4561J3863J6495J7570J5447J3074
11348B490112J3689J7227J1636P831P080J3237J1118J3123J1011J1453R556Q345
11336B625418J0621J2944J3378J1157J5444J3730J2595J4869J1230J2893Q766
11325B763045R279J3625R642R850J3347J3517R887R952J1825J3475R129P382R342
11312B903297J2566J2536J5406J6605J6948J1513Q528Q284R070J3531Q668R382
11300C046334R509O855J3850J2164J3839J2740J3210J6588J6583K2303J4692J5891
$$ plain form
11381 1654160 1729415 1795658 1854713 1900902 1943315 1982436 2012886 2043089 2071697 2097193 2118774
11370 2118774 2139039 2162712 2182040 2202508 2218554 2234749 2251351 2270290 2291686 2312793 2327819
11359 2327819 2344003 2359966 2378029 2388219 2399102 2413663 2427526 2444021 2461591 2477038 2490112
11348 2490112 2503801 2521028 2532664 2540495 2547575 2560812 2571930 2585053 2596064 2607517 2617073 2625418
11336 2625418 2636039 2648983 2662361 2673518 2688962 2702692 2715287 2730156 2741386 2754279 2763045
11325 2763045 2772324 2785949 2795591 2805441 2818788 2832305 2842192 2852144 2863969 2877444 2886573 2893955 2903297
11312 2903297 2915863 2928399 2943805 2960410 2977358 2988871 2997399 3005683 3014753 3028284 3036952 3046334
11300 3046334 3055843 3062698 3076548 3088712 3102551 3115291 3128501 3145089 3161672 3183975 3198667 3214558
11288C214558J8441J7757J5725J2443L452j698L896J5761K5112K4609Q894k061
11276C356889m012p0P331J1317J0011J0560J4049J3120J2391J5680J5093J6320
11264C478679J7903J2596J5500J8143J8873J3776J0514R469J3610J7056J5800
11253C641919J7858J0474J1873J7571J5652J3678J3548J4436J5483J9314J6508
11242C808314J6016J4945J1116O017n44N96J0513J4572J1145O418R129J5290J6827
11229C940354K2233L2511K0631N385j907n207k597M134P872J5928J7283J7671
11217D074291J8749J8247J8101J8524J8133J6534J7153K0940K4908K4109K6231
11206D295920J9952J3283J3171K2841K1892J7722J6780J3671J3046R652J3191
$$ plain form
11288 3214558 3232999 3250756 3266481 3278924 3282376 3280678 3284574 3300335 3325447 3350056 3358950 3356889
11276 3356889 3352877 3352807 3360138 3371455 3381466 3392026 3406075 3419195 3431586 3447266 3462359 3478679
11264 3478679 3496582 3509178 3524678 3542821 3561694 3575470 3585984 3595453 3609063 3626119 3641919
11253 3641919 3659777 3670251 3682124 3699695 3715347 3729025 3742573 3757009 3772492 3791806 3808314
11242 3808314 3824330 3839275 3850391 3856408 3855864 3856460 3866973 3881545 3892690 3899108 3908237 3923527 3940354
11229 3940354 3962587 3995098 4015729 4021114 4019207 4014000 4011403 4015537 4023409 4039337 4056620 4074291
11217 4074291 4093040 4111287 4129388 4147912 4166045 4182579 4199732 4220672 4245580 4269689 4295920
11206 4295920 4315872 4329155 4342326 4365167 4387059 4404781 4421561 4435232 4448278 4457930 4471121
11195D471121J8796K3091K1236J7839J8288J5582J9393K5787K4377L3321L0667
11184D719498K4280K1965J3490J4411J8668K4329K7483K9721K5869K6280K3215
11173D969209K6646K8434K8765L0105L0765K8953J1186L17m203J693J8151L3470
11161E203491L6663K9494K3306J6755K0033K9355L1659L3503L0336J9050J8525
11150E492170K3966L3068M0436M2227L5071K3457K0606J2384R207R936J6587K6613
11138E785728K9535K8921L1974L0845K6194K4806L0802M7825O7627O7412M4315
11127F215984L1188N1018P7819P6798N9646M3872L6530L6118L8574L1683K7814
11116F727044K9866L8105M5400M5747M1816N0047Q5995J39675J71925J35152K7776
$$ plain form
11195 4471121 4489917 4513008 4534244 4552083 4570371 4585953 4605346 4631133 4655510 4688831 4719498
11184 4719498 4743778 4765743 4779233 4793644 4812312 4836641 4864124 4893845 4919714 4945994 4969209
11173 4969209 4995855 5024289 5053054 5083159 5113924 5142877 5154063 5154380 5150177 5151870 5170021 5203491
11161 5203491 5240154 5269648 5292954 5309709 5329742 5359097 5390756 5424259 5454595 5473645 5492170
11150 5492170 5516136 5549204 5589640 5631867 5666938 5690395 5711001 5723385 5732592 5742528 5759115 5785728
11138 5785728 5815263 5844184 5876158 5907003 5933197 5958003 5988805 6036630 6104257 6171669 6215984
11127 6215984 6247172 6298190 6376009 6452807 6512453 6556325 6592855 6628973 6667547 6699230 6727044
11116 6727044 6756910 6795015 6840415 6886162 6927978 6978025 7064020 7203695 7375620 7510772 7538548
11105G538548q3652j18647o1373K3451Q0990R5767J00029R6245P4878N1190L1598
11094G829024L1844L8787M8300N6548N7856N8638N7465O0920O3946O1133O3692
11083H428153O5003P0763P5328Q2856Q7622Q7444Q6810Q1778P9762P9091P6655
11072I301265P2257P6107Q1007Q8668Q9596R8346J01605J05830J06008J05095
11062A0225784R9413J01877J12017J18928J28697J29011J27761J32640J34279
11053A1310407J32774J27225J23864J30861J43229J55538J59210J60397J63949
11044A2607454J65442J71438J78445J85332J89942K04125K07852K08783K04761
11035A4323574J93267J99062K15872K35501K59486K66925K60638K65864K73311
$$ plain form
11105 7538548 7454896 7336249 7274876 7298327 7379317 7475084 7575113 7671358 7746236 7797426 7829024
11094 7829024 7860868 7899655 7947955 8004503 8062359 8120997 8178462 8239382 8303328 8364461 8428153
11083 8428153 8493156 8563919 8639247 8722103 8809725 8897169 8983979 9065757 9145519 9224610 9301265
11072 9301265 9373522 9449629 9530636 9619304 9708900 9807246 9908851 10014681 10120689 10225784
11062 10225784 10325197 10427074 10539091 10658019 10786716 10915727 11043488 11176128 11310407
11053 11310407 11443181 11570406 11694270 11825131 11968360 12123898 12283108 12443505 12607454
11044 12607454 12772896 12944334 13122779 13308111 13498053 13702178 13910030 14118813 14323574
11035 14323574 14516841 14715903 14931775 15167276 15426762 15693687 15954325 16220189 16493500
11026A6493500K87279L10417L45443L74486L95286M03800M05689M02729M01476
11017A9820105M19235M53941M87312N02888N20259N46951N90520O42344O86452
11008B4670007P31325P72059Q13606Q70392R47889J036997J116099J190192J255800
10999C3404366J325080J369830J307803J155721J228343J685885K256768K722385
10991D6456181L123449L515871L953200M489847N177332O009427O923105P892813
10983H7541225Q960234J0223187J1927173J3799020J4125559R389199n982789
10976A49982808l9818430q5664347j04190096p3173345j9251936J3263411K0925624
10969a37926311J9004178J5266144J1891337R512188P978146O770074N683676
$$ plain form
11026 16493500 16780779 17091196 17436639 17811125 18206411 18610211 19015900 19418629 19820105
11017 19820105 20239340 20693281 21180593 21683481 22203740 22750691 23341211 23983555 24670007
11008 24670007 25401332 26173391 26986997 27857389 28805278 29842275 30958374 32148566 33404366
10999 33404366 34729446 36099276 37407079 38562800 39791143 41477028 43733796 46456181
10991 46456181 49579630 53095501 57048701 61538548 66715880 72725307 79648412 87541225
10983 87541225 96501459 106724646 118651819 132450839 146576398 155965597 149982808
10976 149982808 110164378 24500031 -79690065 -152863410 -172115346 -158851935 -137926311
10969 -137926311 -118922133 -103655989 -91764652 -82252464 -74274318 -67504244 -61820568
10962f1820568M796248M137087L623981L182895K813501K536929K340911K156920
10954c6232096J920911J574503J115722P62443Q00305J074857J204476J152462
10946b6626417J055126R79302R25747Q75596Q10914P44982O88191O49209O26096
10937a9271254O06128N84233N52568N06985M72814M54069M49184M35759L89597
10928a4819917L50220L30287L19251L20020L25566L36611L42578L37854L25030
10919a1832500L05744K90356K88747L03995L14842L18423L10065K82222K22257
10910i195849P9203j76162l90725l34037m3691K06360K96375K90274K65416K40147
10900h762689K32172K25803K28736K20203K05854J97092J95543K05010K12222
$$ plain form
10962 -61820568 -57024320 -52887233 -49263252 -46080357 -43266856 -40729927 -38389016 -36232096
10954 -36232096 -34311185 -32736682 -31620960 -30858517 -30058212 -28983355 -27778879 -26626417
10946 -26626417 -25571291 -24591989 -23666242 -22790646 -21979732 -21234750 -20546559 -19897350 -19271254
10937 -19271254 -18665126 -18080893 -17528325 -17021340 -16548526 -16094457 -15645273 -15209514 -14819917
10928 -14819917 -14469697 -14139410 -13820159 -13500139 -13174573 -12837962 -12495384 -12157530 -11832500
10919 -11832500 -11526756 -11236400 -10947653 -10643658 -10328816 -10010393 -9700328 -9418106 -9195849
10910 -9195849 -9116646 -9292808 -9683533 -10017570 -10061261 -9854901 -9558526 -9268252 -9002836 -8762689
10900 -8762689 -8530517 -8304714 -8075978 -7855775 -7649921 -7452829 -7257286 -7052276 -6840054
10891f840054K09444J83867J03215p6899l61814m99367l13468L318J81113K21479
10881g189166K12341J95988J76498J58647J49045J40822J27558J19914J16646
10872e791707J04268R9778R7255R8042R6351R6994J03926J09624J07547J01684
10862d776238R3472R0488R0343R1223Q9874Q9937R0409R3499J04686J02280Q1601
10851c758426O1128N6077O6819Q8162J14893J65288K38761K78695K44149J71418
10841b273036J04870O3488j9490k61229p09932j017146q09161k42942J50225K67007
10831d747346K58677K19692J81466J50149J27695J04191P3478N5063M9343P4761
10821c452831Q9508P0060L7215L5031N5627P1468P1311O6028O3666N7897O0364
$$ plain form
10891 -6840054 -6630610 -6446743 -6343528 -6420427 -6782241 -7281608 -7595076 -7591758 -7410645 -7189166
10881 -7189166 -6976825 -6780837 -6604339 -6445692 -6296647 -6155825 -6028267 -5908353 -5791707
10872 -5791707 -5687439 -5587661 -5490406 -5392364 -5296013 -5199019 -5095093 -4985469 -4877922 -4776238
10862 -4776238 -4682766 -4592278 -4501935 -4410712 -4320838 -4230901 -4140492 -4046993 -3942307 -3840027 -3758426
10851 -3758426 -3697298 -3641221 -3574402 -3486240 -3371347 -3206059 -2967298 -2688603 -2444454 -2273036
10841 -2273036 -2168166 -2104678 -2124168 -2385397 -3095329 -4112475 -4921636 -5164578 -5014353 -4747346
10831 -4747346 -4488669 -4268977 -4087511 -3937362 -3809667 -3705476 -3631998 -3576935 -3527592 -3452831
10821 -3452831 -3363323 -3293263 -3256048 -3221017 -3165390 -3093922 -3022611 -2956583 -2892917 -2835020 -2774656
10810b774656O5381O7320O9685O5562N3859L9448L9069M0250M3653L9885L4655
10799b215889L5709L8552L8811M4005M2105L5297L4358M1745L6767K1789J2680
10788a834071J6523K3009K7919M1790O3178P3283N9156M4261L6324K7624K8641
10777a392363L1477L1251L2530L3244L1734L1222L1320L1065L9766L5950M0549
10766a022255M1479L7723K9350K5133K1129J7479J3551J4419K3190L2348K8785
10755g37669K1597K3141L0635L5650M2435N0066M6492L1369J1522L945P961J7118
10743d15738K4811K6672K6253K6374L1054L2331L1588L1638L4251L9671L5417
10732g5678L3267L4738L6828L2518K4922K0583J9383J9879K9428L3781L4646K9469
$$ plain form
10810 -2774656 -2709275 -2641955 -2572270 -2506708 -2452849 -2413401 -2374332 -2334082 -2290429 -2250544 -2215889
10799 -2215889 -2180180 -2141628 -2102817 -2058812 -2016707 -1981410 -1947052 -1905307 -1868540 -1846751 -1834071
10788 -1834071 -1817548 -1794539 -1766620 -1724830 -1661652 -1588369 -1529213 -1484952 -1448628 -1421004 -1392363
10777 -1392363 -1360886 -1329635 -1297105 -1263861 -1232127 -1200905 -1169585 -1138520 -1098754 -1062804 -1022255
10766 -1022255 -980776 -943053 -913703 -888570 -867441 -849962 -836411 -821992 -798802 -766454 -737669
10755 -737669 -716072 -692931 -662296 -626646 -584211 -534145 -487653 -456284 -444762 -440817 -432856 -415738
10743 -415738 -390927 -364255 -338002 -311628 -280574 -248243 -216655 -185017 -150766 -111095 -75678
10732 -75678 -42411 -7673 29155 61673 86595 107178 126561 146440 175868 209649 244295 273764
10720B73764K5019K0929K2979K8555L1330L5595L3660L2737L0507L3766L2989
10709F01830L2733L4979L4531L4169L2549K5670K6025K4090K5840K6659L4262
10698I33337L2217L4934L8581L3245L4064L8473M1143M0751L6299L1095J5423
10687A309562R293L867J4594K9906L4056L9014L7548K6973K3972L1255M0553M4592
10675A645185L6515L8783M5593M5875M1270L6453L3500L3025M2054M6218M4965
10664B089436L1219J9293J3890J9687K4562K6846L0992L3698L1104L0107L2782
10653B383616M5375O5713P6014O2946L7529M1952P0922Q5513P9380O3415M9713
10642C062088M2791L8107L6178L3070L6800M0333M9822N4404M9326M9983O8886
$$ plain form
10720 273764 298783 319712 342691 371246 402576 438171 471831 504568 535075 568841 601830
10709 601830 634563 669542 704073 738242 770791 796461 822486 846576 872416 899075 933337
10698 933337 965554 1000488 1039069 1072314 1106378 1144851 1185994 1226745 1263044 1294139 1309562
10687 1309562 1318855 1322722 1337316 1367222 1401278 1440292 1477840 1504813 1528785 1560040 1600593 1645185
10675 1645185 1681700 1720483 1766076 1811951 1853221 1889674 1923174 1956199 1998253 2044471 2089436
10664 2089436 2120655 2139948 2153838 2173525 2198087 2224933 2255925 2289623 2320727 2350834 2383616
10653 2383616 2428991 2494704 2570718 2633664 2671193 2713145 2784067 2869580 2948960 3012375 3062088
10642 3062088 3104879 3142986 3179164 3212234 3249034 3289367 3339189 3393593 3442919 3492902 3561788
10631C561788J13507J58723J60682R4600j1018r0859q9831j8226N9223R3973J02518
10620D135080J00088Q7167P0211M8337L8374L6364M9180N9816O3646O7836O5881
10609D821980O9005O5633O3031O5100P3167P9343Q1014Q0210R0248R2476R1361
10598E672568Q9109Q8086Q5279Q8892Q5191Q5934Q6101Q8117R5129J02581J05940
10587F672927J03987J08735J11643J09585J11657J16422J27753J33258J38424
10578G734391J45228J44414J46647J40397J41640J46865J48103J55749J66926
10569I070360J75452J81048J89958K00227K09688K19764K29059K42691K62610
10560A0980857K86262L05261K98446K51335J04816j74618m19109l19360N4590
$$ plain form
10631 3561788 3675295 3834018 3994700 4089300 4078282 3987423 3897592 3879366 3938589 4032562 4135080
10620 4135080 4235168 4322335 4392546 4440883 4479257 4515621 4564801 4624617 4688263 4756099 4821980
10609 4821980 4890985 4956618 5019649 5084749 5157916 5237259 5318273 5398483 5488731 5581207 5672568
10598 5672568 5761677 5849763 5935042 6023934 6109125 6195059 6281160 6369277 6464406 6566987 6672927
10587 6672927 6776914 6885649 6997292 7106877 7218534 7334956 7462709 7595967 7734391
10578 7734391 7879619 8024033 8170680 8311077 8452717 8599582 8747685 8903434 9070360
10569 9070360 9245812 9426860 9616818 9817045 10026733 10246497 10475556 10718247 10980857
10560 10980857 11267119 11572380 11870826 12122161 12226977 12052359 11633250 11313890 11368480
10551A1368480L19285L91218L91887L82469L79597L95386M16132M33178M45932
10542A4923564M39875M35232M30978M35270M60119M93096N15163N25800N47000
10533A9206097N84656O31789O77379P21255P65257Q06434Q52539R18754J000820
10524B6164980J085649J166348J241523J313643J378645J383608J258492J173694
10516C6166582J422940J961353K503151K937710L334694L742114M204029M747969
10508F1020542N401336O144914P029709Q056311R231536J0740656J2585275J3899401
10500A34109680J2287498L526479j9368217n9341894r4540451r1422674m9585419
10493a64334998m265407J6826532J9822388J7087492J3594414J0695270Q684930
$$ plain form
10551 11368480 11687765 12078983 12470870 12853339 13232936 13628322 14044454 14477632 14923564
10542 14923564 15363439 15798671 16229649 16664919 17125038 17618134 18133297 18659097 19206097
10533 19206097 19790753 20422542 21099921 21821176 22586433 23392867 24245406 25164160 26164980
10524 26164980 27250629 28416977 29658500 30972143 32350788 33734396 34992888 36166582
10516 36166582 37589522 39550875 42054026 44991736 48326430 52068544 56272573 61020542
10508 61020542 66421878 72566792 79596501 87652812 96884348 107625004 120210279 134109680
10500 134109680 146397178 149923657 130555440 71213546 -23326905 -114749579 -164334998
10493 -164334998 -168600405 -151773873 -131951485 -114863993 -101269579 -90574309 -81889379
10486h1889379P287759O097036N096836M408333L938295L521069L127537K800969
10478d5611545K560653K370047K165614J890459J499406J079179R17801J048664
10470c2079722J132288Q35919K73995j4866K12750O94883R65275R87668R10685
10461b6081125Q25884P62303P09333O67231O27759N76889N34299N08721M95954
10452b0372752M76510M38792L92382L55367L36006L24827L24917L27300L26914
10443a7069737L30680L16780K90954K74546K57424K53355K57364K56518K44387
10434a4587729K26142K08896J95674J96229J91372J84512J70799J54453J46023
10425a2913629J53113J60841J60855J60084J60301J61697J57933J50787J40721
$$ plain form
10486 -81889379 -74601620 -68504584 -63407748 -58999415 -55061120 -51540051 -48412514 -45611545
10478 -45611545 -43050892 -40680845 -38515231 -36624772 -35125366 -34046187 -33128386 -32079722
10470 -32079722 -30947434 -30111515 -29837520 -29852386 -29639636 -28944753 -27979478 -26991810 -26081125
10461 -26081125 -25255241 -24492938 -23783605 -23116374 -22488615 -21911726 -21377427 -20868706 -20372752
10452 -20372752 -19896242 -19457450 -19065068 -18709701 -18373695 -18048868 -17723951 -17396651 -17069737
10443 -17069737 -16739057 -16422277 -16131323 -15856777 -15599353 -15345998 -15088634 -14832116 -14587729
10434 -14587729 -14361587 -14152691 -13957017 -13760788 -13569416 -13384904 -13214105 -13059652 -12913629
10425 -12913629 -12760516 -12599675 -12438820 -12278736 -12118435 -11956738 -11798805 -11648018 -11507297
10416a1507297J35844J34257J36509J33764J28881J33744J41095J47434J44184
10407a0271585J11712N7182k1140q8767q7736j3242P5120J27120J40047J35451
10397i835838J21591J11684R9633Q9934Q8130Q7727P7889P7557P8938Q0794Q6691
10386h835270Q7247Q7846Q3039P6710P0729P1981P3885P0961O9452O7167O9981
10375h006272O4858N5593L3607J4420P782J9723L9574O2592J07122J58012J50653
10364g292336P7693r682n9896n7684j4101K6222N6253O6814O0147N6041N6635
10353g033894N2962N1095M6873M2194L8072L5375K3271O812j340J5648M3341M4089
10341f635502J9423L515J3778L5775M6435M4636M3303M0008L7737L9145L9548
$$ plain form
10416 -11507297 -11371453 -11237196 -11100687 -10966923 -10838042 -10704298 -10563203 -10415769 -10271585
10407 -10271585 -10159873 -10102691 -10123831 -10212598 -10300334 -10313576 -10238456 -10111336 -9971289 -9835838
10397 -9835838 -9714247 -9602563 -9502930 -9412996 -9324866 -9237139 -9159250 -9081693 -9002755 -8921961 -8835270
10386 -8835270 -8748023 -8660177 -8577138 -8500428 -8429699 -8357718 -8283833 -8212872 -8143420 -8076253 -8006272
10375 -8006272 -7941414 -7885821 -7852214 -7837794 -7830012 -7810289 -7770715 -7708123 -7601001 -7442989 -7292336
10364 -7292336 -7214643 -7224325 -7284221 -7341905 -7356006 -7329784 -7273531 -7206717 -7146570 -7090529 -7033894
10353 -7033894 -6980932 -6929837 -6882964 -6840770 -6802698 -6767323 -6744052 -6737240 -6738580 -6722932 -6679591 -6635502
10341 -6635502 -6616079 -6612564 -6598786 -6563011 -6516576 -6471940 -6428637 -6388629 -6350892 -6311747 -6272199
10330f272199L9087M0615L9652L7894L2152L2325K7828K3459K0804K3878K9487
10319e925018L7771L8794L1347K3068K0587K5325K7854L6754L5673K7463K0829
10308e599553K0151K7781M3557N2949M7823L6358K4697J4758J3741J5753J6853
10297e285132K4221K5047J8929J6217J5823J5480J8217K5305K9161K8717K4306
10286e043709J7373J4451Q759P401J6806K2393K0915K1700J8379J4100J3151J7946
10274d850335K0918K6536L2217K7487K6227K0714J8990J3422J5330J6673J6516
10263d615305J2250J0451J3103J7814J8522J8280J8736K2790K2747K3027K1164
10252d416421J6462J0243N656P074O070J2707J5819J6601J6846J8784J8865J6109
$$ plain form
10330 -6272199 -6233112 -6192497 -6152845 -6114951 -6082799 -6050474 -6022646 -5999187 -5978383 -5954505 -5925018
10319 -5925018 -5887247 -5848453 -5817106 -5794038 -5773451 -5748126 -5720272 -5683518 -5647845 -5620382 -5599553
10308 -5599553 -5579402 -5551621 -5508064 -5455115 -5407292 -5370934 -5346237 -5331479 -5317738 -5301985 -5285132
10297 -5285132 -5260911 -5235864 -5216935 -5200718 -5184895 -5169415 -5151198 -5125893 -5096732 -5068015 -5043709
10286 -5043709 -5026336 -5011885 -5003126 -4995725 -4978919 -4956526 -4935611 -4913911 -4895532 -4881432 -4868281 -4850335
10274 -4850335 -4829417 -4802881 -4770664 -4743177 -4716950 -4696236 -4677246 -4663824 -4648494 -4631821 -4615305
10263 -4615305 -4603055 -4592604 -4579501 -4561687 -4543165 -4524885 -4506149 -4483359 -4460612 -4437585 -4416421
10252 -4416421 -4399959 -4389716 -4384060 -4376986 -4370916 -4358209 -4342390 -4325789 -4308943 -4290159 -4271294 -4255185
10240d255185J4849J6588J8253J8505J7872J8891J4665J3251J5712J5565J3109
10229d077925J5045J2856P257J3099J6403J4099J4874J6112J3806J4741J2163
10218c927470J4205J7574K0724J8199K1659K6828K8980K9481K6655K6351L0879
10207c665935L9585M2190M1145K7744j1257q0118j73134k05496j37204k7363L9990
10196d109853O2997O5880O3518N5077L9251J7496P626J1446K4947L3497K5815
10185c702303J3417R710R486Q883K055O205R147R094J0343J2286J6312J0920Q091
10172c576354R676Q399J1499J0995R891J3015J7106J3361J3059J0869P051J0864
10160c440569R390J1761J0428J0360J0482Q488R435R510Q097J0551R679J0539
$$ plain form
10240 -4255185 -4240336 -4223748 -4205495 -4186990 -4169118 -4150227 -4135562 -4122311 -4106599 -4091034 -4077925
10229 -4077925 -4062880 -4050024 -4042767 -4029668 -4013265 -3999166 -3984292 -3968180 -3954374 -3939633 -3927470
10218 -3927470 -3913265 -3895691 -3874967 -3856768 -3835109 -3808281 -3779301 -3749820 -3723165 -3696814 -3665935
10207 -3665935 -3626350 -3584160 -3543015 -3515271 -3526528 -3606646 -3779780 -3985276 -4122480 -4149843 -4109853
10196 -4109853 -4046856 -3980976 -3917458 -3862381 -3823130 -3805634 -3798008 -3786562 -3761615 -3728118 -3702303
10185 -3702303 -3688886 -3679176 -3669690 -3660807 -3658752 -3652547 -3643400 -3634306 -3623963 -3611677 -3595365 -3584445 -3576354
10172 -3576354 -3566678 -3558279 -3546780 -3535785 -3525894 -3512879 -3495773 -3482412 -3469353 -3458484 -3451433 -3440569
10160 -3440569 -3431179 -3419418 -3408990 -3398630 -3388148 -3379660 -3370225 -3360715 -3352618 -3342067 -3332388 -3321849
10148c321849R141N267J0847J0297J0241J3676J0605J0881R019O383O590Q490
10136c210412J0327J0819O215J1230J2393R090M666R323J2268J2040J1154P629
10124c093258Q428R155Q743J2291Q996O523J0039Q584R846J2457R905R913J1392
10111b966986J4758J5187J1806O148J1231J1554J8091J1365J2374J5977J5112
10100b823383J6408J7372J1326J5884J9222K1645K5382L0319L1030L0979L8234
10089b565582M0563L8421M8532N8027O9996P9870Q6665Q0200L3671j08097l65860
10078b503594n80139n14825k16614L2806J17976J18271J01612Q1155O1158N8001
10068c244193M9356M0631L4086L5306L3710K7021K3005J9860J7354J8543J6947
$$ plain form
10148 -3321849 -3312708 -3307441 -3296594 -3286297 -3276056 -3262380 -3251775 -3240894 -3231875 -3225492 -3218902 -3210412
10136 -3210412 -3200085 -3189266 -3183051 -3171821 -3159428 -3150338 -3145672 -3136349 -3124081 -3112041 -3100887 -3093258
10124 -3093258 -3084830 -3075675 -3066932 -3054641 -3045645 -3039122 -3029083 -3020499 -3010653 -2998196 -2988291 -2978378 -2966986
10111 -2966986 -2952228 -2937041 -2925235 -2919087 -2907856 -2896302 -2878211 -2866846 -2854472 -2838495 -2823383
10100 -2823383 -2806975 -2789603 -2778277 -2762393 -2743171 -2721526 -2696144 -2665825 -2634795 -2603816 -2565582
10089 -2565582 -2525019 -2486598 -2438066 -2380039 -2310043 -2230173 -2143508 -2063308 -2029637 -2137734 -2503594
10078 -2503594 -3083733 -3598558 -3815172 -3782366 -3664390 -3546119 -3444507 -3363352 -3302194 -3244193
10068 -3244193 -3194837 -3154206 -3120120 -3084814 -3051104 -3024083 -3001078 -2981218 -2963864 -2945321 -2928374
10057b928374J2546J3848J3643Q326Q527R643P717J0123J4188J4677J0204J0538
10045b794394R490J2860J6908J9411J8739J5420J5914J7705K0018J5638J5013
10034b617278K1389K6995L4441L8916M4862N3187M6079J1134r4261l98339k94220
10023c127095J1964P4795O7678O0996M3727K1317J4033J9984K7496K6534J5867
10012b742704J2036J5202P629J0368J0454Q185O859O121Q176P524P216R717J0809
9999b622408M689M225N990M752P628J0679Q730J0112R344P319O978P717K497L303
9985b528445N341M708N456K911N353O833L566Q375Q740J691L005N770N099O498
9971b455099P947Q131N133N044N996N255M487M188L698N845P569P459P349N256
$$ plain form
10057 -2928374 -2915828 -2901980 -2888337 -2880011 -2871484 -2861841 -2854124 -2844001 -2829813 -2815136 -2804932 -2794394
10045 -2794394 -2784904 -2772044 -2755136 -2735725 -2716986 -2701566 -2685652 -2667947 -2647929 -2632291 -2617278
10034 -2617278 -2595889 -2568894 -2534453 -2495537 -2450675 -2397488 -2351409 -2340275 -2434536 -2832875 -3127095
10023 -3127095 -3115131 -3040336 -2972658 -2911662 -2867935 -2846618 -2832585 -2812601 -2785105 -2758571 -2742704
10012 -2742704 -2730668 -2715466 -2707837 -2697469 -2687015 -2678830 -2671971 -2665850 -2657674 -2650150 -2642934 -2633217 -2622408
9999 -2622408 -2617719 -2613494 -2607504 -2602752 -2595124 -2584445 -2575715 -2565603 -2556259 -2548940 -2541962 -2534245 -2531748 -2528445
9985 -2528445 -2523104 -2518396 -2512940 -2510029 -2504676 -2497843 -2494277 -2485902 -2477162 -2475471 -2472466 -2466696 -2461597 -2455099
9971 -2455099 -2447152 -2439021 -2433888 -2428844 -2422848 -2417593 -2413106 -2408918 -2405220 -2399375 -2391806 -2384347 -2376998 -2371742
9957b371742M299M696O114O853M707O272Q454J0513J4071J6022J4050J0450J633
9944b263608k0192n6477p0278k6985P113J5226J5919J2574J2817J0690J0346R243
9932b343612P151N547Q883J1916O176K373L08j227j458P00M792R127O898O152
9918b276274M212K082O455L713L830O208J817J777N434K554K708N699R187M268
9904b216330M360L017K456l37J254O082P068N091N320L109l34J999O860P455N597
9889b157333K999j755O00J814Q49Q31L746k401j31M730K957P977L330L753K814
9874b125220N160L763K664J894M968O746N234M677n50j847J623J121O600P061
9860b076106M088N22O50J426K630K787L203J787N773M474J610l57M943M275M938
$$ plain form
9957 -2371742 -2367443 -2362747 -2356633 -2349780 -2345073 -2338801 -2330347 -2319834 -2305763 -2289741 -2275691 -2265241 -2263608
9944 -2263608 -2283800 -2340277 -2410555 -2437540 -2430427 -2415201 -2399282 -2386708 -2373891 -2363201 -2352855 -2343612
9932 -2343612 -2336461 -2330914 -2322031 -2310115 -2303939 -2301566 -2301258 -2302485 -2303943 -2303243 -2298451 -2289324 -2282426 -2276274
9918 -2276274 -2272062 -2269980 -2263525 -2259812 -2255982 -2249774 -2247957 -2246180 -2240746 -2238192 -2235484 -2229785 -2220598 -2216330
9904 -2216330 -2211970 -2208953 -2206497 -2206834 -2205580 -2199498 -2192430 -2187339 -2182019 -2178910 -2179244 -2177245 -2170385 -2162930 -2157333
9889 -2157333 -2154334 -2156089 -2155489 -2153675 -2152826 -2151995 -2148249 -2150650 -2150781 -2146051 -2143094 -2135117 -2131787 -2128034 -2125220
9874 -2125220 -2120060 -2116297 -2113633 -2111739 -2106771 -2100025 -2094791 -2090114 -2090664 -2092511 -2090888 -2089767 -2083167 -2076106
9860 -2076106 -2072018 -2071496 -2070846 -2069420 -2066790 -2064003 -2060800 -2059013 -2053240 -2048766 -2047156 -2047513 -2042570 -2038295 -2033357
9845b033357J053J634L246K349K285m51J869O60M960M582L926K830P04L361L345
9830a997004L323k498k074K895L978M604L643K657O708Q208L468J142R96J952
9816a958002J604J128J219K855M758j471M630K540L838K878J084J469M065K704
9802a924701N940K562N07L717k46M79K479J545L721N274L361Q22J148M93l582
9787a896481K038K285M588L587N017L189J605r21J106M953L458L836L298K333
9773a856109L93q18L085P57K930M305L82M840L345N88L084K595K055K309L134
9758a823125O843K232j532j732k263m23M099K884M418L813K51L93Q22M710J596
9743a797014K187K154j839p21M971N459K957L953L67K107Q45J713r89k020n10
$$ plain form
9845 -2033357 -2032304 -2030670 -2027424 -2025075 -2022790 -2023241 -2021372 -2020712 -2015752 -2011170 -2007244 -2004414 -2003710 -2000349 -1997004
9830 -1997004 -1993681 -1996179 -1998253 -1995358 -1991380 -1986776 -1983133 -1980476 -1973768 -1965560 -1962092 -1960950 -1959954 -1958002
9816 -1958002 -1956398 -1955270 -1954051 -1951196 -1946438 -1947909 -1943279 -1940739 -1936901 -1934023 -1932939 -1931470 -1927405 -1924701
9802 -1924701 -1918761 -1916199 -1915692 -1911975 -1912221 -1911742 -1909263 -1907718 -1903997 -1898723 -1895362 -1894540 -1893392 -1892899 -1896481
9787 -1896481 -1894443 -1892158 -1887570 -1883983 -1878966 -1875777 -1874172 -1875093 -1873987 -1869034 -1865576 -1861740 -1858442 -1856109
9773 -1856109 -1855716 -1856534 -1853449 -1852692 -1849762 -1845457 -1845075 -1840235 -1836890 -1836302 -1833218 -1830623 -1828568 -1826259 -1823125
9758 -1823125 -1816282 -1814050 -1815582 -1817314 -1819577 -1820000 -1815901 -1813017 -1808599 -1804786 -1804535 -1804142 -1803320 -1798610 -1797014
9743 -1797014 -1794827 -1792673 -1794512 -1795233 -1790262 -1784803 -1781846 -1777893 -1777526 -1775419 -1774574 -1772861 -1773850 -1775870 -1776380
9728a776380O582M974Q554O243M106P17l20J748L79L456M271K860k577j819r52
9713a738158N163K999l103q37N338N755N882J911M18J460Q91N224m25o56L79L569
9697a704190L938J135n74J259M719K766k956l1K299K456N133L096K405L076J13
9682a675356k70J526K072Q27J292N315M841l57L43J822j462L58K275K403K758
9667a651613m18J002M258P51K222L145M223J42j387L518N354N62L92J105L916
9652a622828P17k403O45J910L923M840M956J302k299Q74K038L214L273N78J348
9637a597912N56Q39M17J194J963L316J620N61K146M38N046J743k722k213K194
9622a580814M784K268L62M077K74j557n85J993K786K737K857P20M388J011k410
$$ plain form
9728 -1776380 -1769798 -1764824 -1756270 -1750027 -1745921 -1745204 -1745524 -1743776 -1743397 -1739941 -1735670 -1732810 -1735387 -1737206 -1738158
9713 -1738158 -1732995 -1729996 -1733099 -1733936 -1728598 -1722843 -1716961 -1715050 -1714632 -1713172 -1712281 -1707057 -1707482 -1708138 -1707759 -1704190
9697 -1704190 -1700252 -1699117 -1699691 -1698432 -1693713 -1690947 -1693903 -1693934 -1691635 -1689179 -1684046 -1680950 -1678545 -1675469 -1675356
9682 -1675356 -1675626 -1674100 -1672028 -1671201 -1669909 -1664594 -1659753 -1660110 -1659767 -1657945 -1659407 -1659049 -1656774 -1654371 -1651613
9667 -1651613 -1652031 -1651029 -1646771 -1646020 -1643798 -1640653 -1636430 -1636288 -1637675 -1634157 -1628803 -1628241 -1627849 -1626744 -1622828
9652 -1622828 -1622111 -1624514 -1623869 -1621959 -1618036 -1613196 -1608240 -1606938 -1609237 -1608363 -1606325 -1603111 -1599838 -1599260 -1597912
9637 -1597912 -1597356 -1596517 -1596100 -1594906 -1592943 -1589627 -1588007 -1587446 -1585300 -1584862 -1579816 -1578073 -1580795 -1583008 -1580814
9622 -1580814 -1576030 -1573762 -1573400 -1569323 -1569049 -1570606 -1571191 -1569198 -1566412 -1563675 -1560818 -1560098 -1555710 -1554699 -1557109
9607a557109J204M712k025L45L558M601O604k18j471J205J272P09N13j26K034
9592a534192O335J663L46J071L176o07k444K333M54L813M394j66j740L592J896
9577a510076M21J304L475m3l08J173J989J041J622L398j489L998N818L015J136
9562a483526J509j326K456K470j424J172q88J262J600j281J509K994L220M13K243
9547a467597J447J857k796K31m63l543l027R107J1670P382J883O10k111n2l56
9532a445758O21j003J755j70K998L057K515p2O54K419L420L073K48R86L617J772
9516a419868k072K210L134J278j96j94L089M195J442l440P57p97j693J727L626
9501a406802J665K523k945K186M911L24l222j560K935L021p3J851K473M457K046
$$ plain form
9607 -1557109 -1555905 -1551193 -1553218 -1552873 -1549315 -1544714 -1538110 -1538328 -1539799 -1538594 -1537322 -1536613 -1536100 -1536226 -1534192
9592 -1534192 -1527857 -1526194 -1525848 -1524777 -1521601 -1522208 -1524652 -1522319 -1521865 -1518052 -1513658 -1513824 -1515564 -1511972 -1510076
9577 -1510076 -1509655 -1508351 -1504876 -1504919 -1505227 -1504054 -1502065 -1501024 -1499402 -1496004 -1497493 -1493495 -1487677 -1484662 -1483526
9562 -1483526 -1482017 -1483343 -1480887 -1478417 -1479841 -1478669 -1479557 -1478295 -1476695 -1477976 -1476467 -1473473 -1470253 -1469840 -1467597
9547 -1467597 -1466150 -1464293 -1467089 -1466858 -1467321 -1470864 -1473891 -1464784 -1453114 -1445732 -1443849 -1443239 -1445350 -1445402 -1445758
9532 -1445758 -1445137 -1446140 -1444385 -1444555 -1441557 -1438500 -1435985 -1436057 -1435403 -1432984 -1429564 -1426491 -1426243 -1425257 -1421640 -1419868
9516 -1419868 -1421940 -1419730 -1416596 -1415318 -1415514 -1415708 -1412619 -1408424 -1406982 -1410422 -1409665 -1410462 -1412155 -1410428 -1406802
9501 -1406802 -1405137 -1402614 -1405559 -1403373 -1398462 -1398138 -1401360 -1402920 -1399985 -1396964 -1397037 -1395186 -1392713 -1388256 -1386210
9486a386210N82l435k280j797K734L216K694J814N64N96N439J052K042j953m59
9471a375401R9j06J819J583K612M230q26J874j53j096J555K622K592L458K621
9456a352517k00J593N02j78l06J593N651K963J687K619O1m42J020L419j02k086
9440a334723J125K72J79n53L205J07j493L936K492M78k131J838L085O91K717k15
9424a318990J147J341J046o37K29K83J48L070M946L066K076n75k857J66J172l459
9408a307828l28L732J265j073K802J787K028L789Q340k077l515k169R23J517K686
9393a288121L538L254r1n58J607K272J340J402N98N62P78J08L908J155o29k067
9377a270944K018O24K872k83L99J66jK904K389k62J255k204k231L090L041J605
$$ plain form
9486 -1386210 -1385628 -1389063 -1391343 -1393140 -1390406 -1387190 -1384496 -1382682 -1382118 -1381522 -1376083 -1375031 -1372989 -1374942 -1375401
9471 -1375401 -1375302 -1375408 -1373589 -1372006 -1369394 -1365164 -1365990 -1364116 -1364269 -1365365 -1363810 -1361188 -1358596 -1355138 -1352517
9456 -1352517 -1352717 -1351124 -1350622 -1350800 -1351106 -1349513 -1343862 -1340899 -1339212 -1336593 -1336532 -1336974 -1335954 -1332535 -1332637 -1334723
9440 -1334723 -1333598 -1333326 -1333147 -1333700 -1330495 -1330388 -1331881 -1327945 -1325453 -1324975 -1327106 -1325268 -1322183 -1321492 -1318775 -1318990
9424 -1318990 -1317843 -1316502 -1315456 -1316093 -1315864 -1315581 -1315433 -1312363 -1307417 -1304351 -1302275 -1302850 -1305707 -1305541 -1304369 -1307828
9408 -1307828 -1308156 -1304424 -1303159 -1304232 -1301430 -1299643 -1297615 -1293826 -1285486 -1287563 -1291078 -1293247 -1292324 -1290807 -1288121
9393 -1288121 -1284583 -1281329 -1281420 -1281978 -1280371 -1278099 -1276759 -1275357 -1274759 -1274197 -1273419 -1273311 -1269403 -1268248 -1268877 -1270944
9377 -1270944 -1268926 -1268302 -1265430 -1265713 -1265314 -1265148 -1265149 -1262245 -1259856 -1260118 -1258863 -1261067 -1263298 -1260208 -1257167 -1255562
9361a255562p43p50J417K353r88K331L455M712o29j819K058K965P28j542P29p58
9345a242043L601K039J955Q67L215M766l223l265N20K720O8L148K659o47k953
9330a226573L420J930J274k82o17r00L346L873J555j518J18J810M41p72l55K213
9314a211037K768J681K656j405q58M94L598n57N76J645K250M909J293m006k003
9299a197996J070j692k90M665L154m02L319L65m570j511J335J762J247M831L147
9284a181566o74J512L430N085l002l772J307J215J17J829j37K762J292m431m36
9269a175469K243L024j805j717L845J845L03m502j207k382K124N801O169M099
9255a157629j660j452P95j119N182J384r08Q34L497K946j94j154j728Q1m91j056
$$ plain form
9361 -1255562 -1256305 -1257055 -1255638 -1253285 -1254273 -1251942 -1248487 -1243775 -1244404 -1246223 -1244165 -1241200 -1240472 -1242014 -1241285 -1242043
9345 -1242043 -1238442 -1236403 -1234448 -1233581 -1230366 -1225600 -1228823 -1232088 -1231568 -1228848 -1228780 -1225632 -1222973 -1223620 -1226573
9330 -1226573 -1223153 -1221223 -1219949 -1220231 -1220848 -1221748 -1218402 -1214529 -1212974 -1214492 -1214374 -1212564 -1212123 -1212895 -1213250 -1211037
9314 -1211037 -1208269 -1206588 -1203932 -1205337 -1206195 -1205701 -1202103 -1202660 -1202084 -1200439 -1198189 -1193280 -1191987 -1195993 -1197996
9299 -1197996 -1196926 -1198618 -1198908 -1194243 -1191089 -1191491 -1188172 -1187807 -1192377 -1193888 -1192553 -1190791 -1189544 -1184713 -1181566
9284 -1181566 -1182240 -1180728 -1177298 -1172213 -1175215 -1178987 -1177680 -1176465 -1176348 -1174519 -1174656 -1171894 -1170602 -1175033 -1175469
9269 -1175469 -1173226 -1170202 -1172007 -1173724 -1169879 -1168034 -1167731 -1172233 -1173440 -1175822 -1173698 -1167897 -1161728 -1157629
9255 -1157629 -1159289 -1160741 -1159946 -1161065 -1155883 -1154499 -1155407 -1154573 -1151076 -1148130 -1148324 -1149478 -1151206 -1151125 -1151616 -1152672
9239a152672k60K828N045J026O17P23l71K501M146K083J208K566J923k537n02
9224a131676o33J901M090k389r21M177Q34J751j454k706N6J080K886O66K537M537
9208a115264K289l558m600L38K766L127j570R88M810L917K64j040K954k886l337
9193a110802M77R44J499J430n20L045Q62P17k334J874J11l083m92K50M975K173
9177a098874J83j287j501K118j448k277L812K263Q14L270M23N9K855L082J4J7
9161a086477j317J584K317J163M20K523J174j23J438M892J669j848K99P66N6j854
9145a073318j099P05K680n4K435n58k243j075K192L389P53K67K409j237J406P33
9129a062615J308j733Q65l45M51K446j380N194L877J507l592l368P98j976j40
$$ plain form
9239 -1152672 -1152932 -1150104 -1145059 -1144033 -1143416 -1142693 -1143064 -1140563 -1136417 -1134334 -1133126 -1130560 -1128637 -1131174 -1131676
9224 -1131676 -1132309 -1130408 -1126318 -1128707 -1129628 -1125451 -1124617 -1122866 -1124320 -1127026 -1126970 -1125890 -1123004 -1122338 -1119801 -1115264
9208 -1115264 -1112975 -1116533 -1121133 -1120795 -1118029 -1114902 -1116472 -1115484 -1110674 -1106757 -1106493 -1107533 -1104579 -1107465 -1110802
9193 -1110802 -1110325 -1109381 -1107882 -1106452 -1106972 -1103927 -1103065 -1102348 -1104682 -1102808 -1102697 -1105780 -1106272 -1106022 -1101047 -1098874
9177 -1098874 -1098691 -1099978 -1101479 -1099361 -1100809 -1103086 -1099274 -1097011 -1096197 -1092927 -1092504 -1092445 -1089590 -1086508 -1086494 -1086477
9161 -1086477 -1087794 -1086210 -1083893 -1082730 -1082310 -1079787 -1078613 -1078736 -1077298 -1072406 -1070737 -1072585 -1072286 -1071520 -1071464 -1073318
9145 -1073318 -1074417 -1073712 -1071032 -1071086 -1068651 -1069209 -1071452 -1072527 -1070335 -1066946 -1066193 -1065926 -1063517 -1064754 -1063348 -1062615
9129 -1062615 -1061307 -1063040 -1062175 -1062520 -1062069 -1059623 -1061003 -1055809 -1051932 -1050425 -1054017 -1057385 -1056587 -1058563 -1058703
9114a058703M678M356k35k669o13k98K526q88N44K559K201N111lk309J601k39
9098a042381N51K188M49K037n36o22J621j005j422L768L332L004p91l884k77J32
9082a033836k40M08r02J89M135K490J612K66l520m03J915K827N796K366L62l561
9066a020096j445K758K842L527K20l167m641k186K83M86K585J824J47L847J861
9051a011155j312j196K674J968Q76j975j244M391L302p48k377l309j310O5J824
9036a009526N79L609J104M38K06J048M72O31j74K301k100J586K689K731K821j765
9020i93350j190K113K197K210K546k54n78k367J74k706j0K492N263R32l01J801
9004i81028p93k266j437L214N18o92J681L785J483N2q69j051l967r50K140M234
$$ plain form
9114 -1058703 -1054025 -1049669 -1049904 -1052573 -1053186 -1053484 -1050958 -1051846 -1051302 -1048743 -1046542 -1041431 -1041434 -1043743 -1042142 -1042381
9098 -1042381 -1041830 -1039642 -1039193 -1037156 -1037692 -1038314 -1036693 -1037698 -1039120 -1035352 -1032020 -1029016 -1029807 -1033691 -1033968 -1033836
9082 -1033836 -1034076 -1033668 -1034570 -1034381 -1030246 -1027756 -1026144 -1025878 -1029398 -1029801 -1027886 -1025059 -1019263 -1016897 -1016535 -1020096
9066 -1020096 -1021541 -1018783 -1015941 -1012414 -1012194 -1015361 -1020002 -1022188 -1021905 -1021419 -1018834 -1017010 -1016863 -1013016 -1011155
9051 -1011155 -1012467 -1013663 -1010989 -1009021 -1008145 -1010120 -1011364 -1006973 -1003671 -1004419 -1006796 -1010105 -1011415 -1011350 -1009526
9036 -1009526 -1008947 -1005338 -1004234 -1003796 -1003590 -1002542 -1002070 -1001439 -1001613 -999312 -1001412 -999826 -997137 -994406 -991585 -993350
9020 -993350 -994540 -992427 -990230 -988020 -985474 -985728 -986306 -988673 -988499 -991205 -991215 -988723 -983460 -982528 -982829 -981028
9004 -981028 -981821 -984087 -985524 -982310 -981792 -982484 -980803 -977018 -975535 -975483 -976352 -977403 -981370 -982320 -980180 -975946
8988i75946J936P35l955J903J634L50R14L76O30l015p67J567L344L831R08J286
8972i64269J102j69N14r5J341q0l292l800J355N120J759r41K569J601k895q89
8956i61069R5m63M410L646P43p45k160J828O673J175R88P92J603R90j317k089
8940i44900j840O93m72r70o4Q46J479K057l71j623N502K656j54J356L06o55k699
8923i38853o96J607J386j677L433K299j620k215n39J974L45l822j44M414L615
8908i30493L079m236J88J562N17m91R65k1P12o48Q31K460l03K94K718k407p08
8891i25981K502L172L68J961j177q95J420J175J644k112P5L201R35K199L091R30
8875i07492j454J337n27J230J664j110n049k421J321L004J430N35j435K076J651
$$ plain form
8988 -975946 -974010 -973275 -977230 -975327 -973693 -973343 -972429 -972053 -971423 -974438 -975205 -973638 -970294 -966463 -965555 -964269
8972 -964269 -963167 -963336 -962822 -962917 -961576 -961656 -964948 -968748 -967393 -962273 -960514 -961455 -958886 -957285 -960180 -961069
8956 -961069 -960974 -961437 -957027 -953381 -952638 -953383 -955543 -953715 -947042 -945867 -944879 -944087 -942484 -941494 -942811 -944900
8940 -944900 -946740 -946047 -946519 -947489 -947553 -946707 -945228 -943171 -943542 -945165 -939663 -937007 -937161 -935805 -935499 -936154 -938853
8923 -938853 -939549 -937942 -936556 -938233 -934800 -932501 -934121 -936336 -936875 -934901 -934556 -938378 -938522 -934108 -930493
8908 -930493 -927414 -931650 -931462 -929900 -929383 -929874 -928909 -928930 -928218 -928866 -928035 -925575 -925878 -925584 -922866 -925273 -925981
8891 -925981 -923479 -920307 -919939 -917978 -919155 -920050 -918630 -917455 -915811 -917923 -917848 -914647 -913712 -911513 -908422 -907492
8875 -907492 -908946 -907609 -908136 -906906 -905242 -906352 -911401 -913822 -912501 -909497 -908067 -907532 -908967 -906891 -905240
8860i05240j979l2J123L237K910J058K366k535k211o51j16j893k03j637K028l9
8844i03814J170J557M45L58N298m66k13k626j810r29J765L473J217j357J119J805
8828h93008k430K020L617k41j357j85M376L386k914j526K466j746n53J911O58
8813h85526k63K78M19q15M25M323o27j614K844K849J39J75j06p40J004p24J221
8796h76738k388J325L829L068j594k702L136l82J157J79p32l782K707M701J341
8781h66875K304M92K502J149m379j021j89R83P82j909L45Q40J132l78J289J665
8765h61268K141o21J96J717m138j083K034J988L181p08j625l444l820K309L788
8750h59353J978j242K646j54l0J861L714K810m080j378L393M829L536j031Q56
$$ plain form
8860 -905240 -907219 -907251 -906128 -902891 -899981 -898923 -896557 -899092 -901303 -901954 -902070 -903963 -904166 -905803 -903775 -903814
8844 -903814 -902644 -901087 -900642 -900284 -894986 -895452 -895665 -898291 -900101 -901030 -899265 -895792 -894575 -895932 -894813 -893008
8828 -893008 -895438 -893418 -889801 -890042 -891399 -891584 -887208 -883822 -886736 -888262 -885796 -887542 -888095 -886184 -885526
8813 -885526 -885789 -885511 -885092 -885907 -885482 -881159 -881786 -883400 -880556 -877707 -877568 -877393 -877499 -878239 -877235 -877959 -876738
8796 -876738 -879126 -877801 -873972 -870904 -872498 -875200 -872064 -872446 -871289 -871110 -871842 -875624 -872917 -868216 -866875
8781 -866875 -864571 -864079 -861577 -860428 -864807 -865828 -866017 -865034 -864252 -866161 -865816 -864976 -863844 -864222 -862933 -861268
8765 -861268 -859127 -859748 -859552 -857835 -861973 -863056 -861022 -859034 -855853 -856561 -858186 -861630 -865450 -863141 -859353
8750 -859353 -857375 -858617 -855971 -856125 -856155 -854294 -850580 -847770 -851850 -853228 -849835 -845006 -841470 -842501 -841645
8735h41645n32J134K54J507p5k790J655J953j530l553m19J376J67J678l399L69
8719h43850L847L811R38J823o37p59j99k380l289l534m37L432J739L340J766j170
8703h35559M079K003j265m771q64J257J282k99j518K51R47K238J786K770M15j304
8687h28552N15J527J215K23K363l90j268n80k873p67r4P03J559L173q64J316P61
8670h22033n41J278K789l117m290j273L137N576L168J628n14K02m289j542K495
8655h17326N249J71j210J731o8l28k290J28J393O43K524K252l122j994K59K522
8639h09466J721N78p66j182L898K149L18l949l749R21M55j862N510P362M194m129
8623g97997l213j55L092J756J367J393k016m63j824J481P49j564L34R56K342K378
$$ plain form
8735 -841645 -842177 -841043 -840789 -839282 -839357 -842147 -840492 -838539 -840069 -843622 -844041 -842665 -842498 -840820 -844219 -843850
8719 -843850 -840003 -836192 -835254 -833431 -834068 -834827 -835026 -837406 -840695 -844229 -844666 -841234 -839495 -836155 -834389 -835559
8703 -835559 -831480 -829477 -830742 -835513 -836377 -835120 -833838 -834137 -835655 -835404 -834457 -832219 -830433 -827663 -827248 -828552
8687 -828552 -828037 -826510 -825295 -825072 -822709 -823099 -824367 -824947 -827820 -828587 -828681 -827978 -826419 -823246 -824110 -822794 -822033
8670 -822033 -822574 -821296 -818507 -821624 -825914 -827187 -824050 -818474 -815306 -813678 -814192 -813990 -818279 -819821 -817326
8655 -817326 -812077 -811906 -813116 -811385 -811453 -811781 -814071 -813943 -812550 -811907 -809383 -807131 -810253 -812247 -811988 -809466
8639 -809466 -807745 -807167 -807933 -809115 -805217 -803068 -802750 -806699 -810448 -809527 -809072 -810934 -805424 -798062 -793868 -797997
8623 -797997 -801210 -801365 -798273 -796517 -795150 -793757 -795773 -796236 -798060 -796579 -795830 -797394 -797060 -796104 -793762 -791384
8607g91384j240j46L206J128j253k126l7J77J489L242J863p25l663j735M186J345
8591g85673K28m882k848K201j521J708K227J01j67N845O725M527p01j518o170
8576g79918j381L110K24l650j178k016k304L404N618J516k168m956k870J854k63
8561g84978j351o75o39J866K084K000L365J550n120K68K833K3L330M81m10l647
8545g79020k824L721K376J434J648j012l45K422K18k593J039K948N14J119q09
8530g69164L291M670l136k177J301N67J9j294Q04R12k11L2J116J402L65k101l086
8513g66690J188K392M267L10n18q96j600m524o53K784K282J375J106J62J092K630
8497g55293L216K213j18j159P00L156k645k396q68k65o76J750k92k3M79J539J87
$$ plain form
8607 -791384 -792624 -792770 -789564 -788436 -789689 -791815 -791852 -791675 -790186 -786944 -785081 -785806 -789469 -791204 -787018 -785673
8591 -785673 -785445 -790327 -793175 -790974 -792495 -790787 -788560 -788459 -788626 -782781 -776056 -771529 -772230 -773748 -779918
8576 -779918 -781299 -778189 -777965 -781615 -782793 -784809 -787113 -783709 -778091 -776575 -778743 -783699 -786569 -784715 -784978
8561 -784978 -786329 -787004 -787643 -785777 -783693 -781693 -778328 -776778 -781898 -781630 -778797 -778774 -775444 -774963 -775373 -779020
8545 -779020 -781844 -778123 -775747 -774313 -772665 -773677 -774022 -771600 -771382 -773975 -772936 -769988 -769474 -768355 -769164
8530 -769164 -765873 -761203 -764339 -766516 -765215 -764648 -764629 -765923 -765119 -764207 -764418 -764386 -763270 -761868 -761503 -763604 -766690
8513 -766690 -765502 -763110 -758843 -758533 -759051 -759947 -761547 -766071 -766724 -763940 -761658 -760283 -759177 -759015 -757923 -755293
8497 -755293 -752077 -749864 -749982 -751141 -750441 -747285 -749930 -752326 -753194 -753459 -754135 -752385 -752677 -752700 -752221 -750682 -750495
8480g50495j970j264M452J078q36j035L508J865r21j607m5l149J005J304l60P63
8464g47707O36K879J030j374N96J736j524k034K108K342J537j68J124l84k523
8449g41726m148k895K066N292M594o50j260k124K940K664J345j669k933j935R90
8434g39449J884L051L601j126j24k046j753k22j599p4N708K491p137n159L052
8419g38902M249K087M80O30J709k332m161k343M267J589K195J720Q23J899m01
8404g26491P51m59q59K558K984L167j403l749l098L95K573L77L175q49k436K40
8388g23124M03q85J635J931J933J76n59R14l669j07k735K408O384K800k67j288
8372g14050K337k887K58k070k504Q89J729N31L34P10J219M88J144J919m9M53M22
$$ plain form
8480 -750495 -752465 -753729 -749277 -748199 -749035 -750070 -746562 -744697 -745618 -747225 -747270 -750419 -749414 -748110 -748470 -747707
8464 -747707 -747071 -744192 -743162 -744536 -743940 -742204 -743728 -745762 -743654 -741312 -739775 -739943 -738819 -739203 -741726
8449 -741726 -745874 -748769 -746703 -741411 -736817 -737467 -738727 -740851 -737911 -735247 -733902 -735571 -738504 -740439 -739449
8434 -739449 -737565 -734514 -730913 -732039 -732163 -734209 -735962 -736184 -737783 -737857 -732149 -729658 -736795 -741954 -738902
8419 -738902 -734653 -732566 -732086 -731456 -729747 -732079 -736240 -738583 -734316 -732727 -730532 -728812 -727989 -726090 -726491
8404 -726491 -725740 -726199 -727058 -724500 -721516 -718349 -719752 -723501 -726599 -726204 -723631 -723254 -720079 -720928 -723364 -723124
8388 -723124 -722721 -723606 -721971 -720040 -718107 -717931 -718490 -717576 -721245 -721352 -724087 -721679 -715295 -712495 -712762 -714050
8372 -714050 -711713 -714600 -714342 -716412 -718916 -718027 -716298 -715767 -715433 -714723 -713504 -713016 -711872 -709953 -710002 -709549 -709127
8355g09127R64j271l002l605J966K99Q60K214J722J823p38j713j042L80K411L039
8339g04820pJ098K172J745k162k16k756j280J497j362L454N66j346j000j967R89
8323g05395J447K977J288K97j987n17K538N74J55J761K192K66m199j784J354o86
8307f99719j45Q52J023M53o11j768K704k24k73j278J489K510L09Q56L069m63j166
8290f92382r18q1l33J616K25L140K191P22k190k51j102l493k481L732L487r49
8274f89067n75M04l08r17p7L729M909k401n32J195J062p10j50O00J014k728L32
8257f84220j908O27j290N464L426K608J216j975k371O73K164N00L360k041m061
8242f77828j062Q60k867j337K046O91K79J974L631K335l718l480P93M013K774
$$ plain form
8355 -709127 -708163 -709434 -712436 -716041 -714075 -713776 -712916 -710702 -708980 -707157 -707895 -709608 -710650 -710270 -707859 -704820
8339 -704820 -704827 -703729 -701557 -699812 -701974 -702190 -704946 -706226 -704729 -706091 -702637 -702071 -703417 -704417 -706384 -705395
8323 -705395 -703948 -700971 -699683 -699386 -701373 -701890 -699352 -698778 -698623 -696862 -694670 -694404 -698603 -700387 -699033 -699719
8307 -699719 -699864 -699012 -697989 -697536 -698147 -699915 -697211 -697435 -697708 -698986 -697497 -694987 -694678 -693822 -690753 -691216 -692382
8290 -692382 -693300 -693381 -693714 -692098 -691873 -688733 -686542 -685820 -688010 -688261 -689363 -692856 -695337 -691605 -688118 -689067
8274 -689067 -689642 -689238 -689546 -690463 -690540 -686811 -681902 -684303 -684835 -683640 -682578 -683288 -683438 -682838 -681824 -684552 -684220
8257 -684220 -686128 -685501 -686791 -681327 -677901 -675293 -674077 -676052 -678423 -677750 -675586 -675086 -671726 -673767 -677828
8242 -677828 -678890 -678030 -680897 -682234 -680188 -679497 -679218 -677244 -673613 -671278 -674996 -678476 -677683 -673670 -670896
8227f70896j335q55p01K863j985l31K822l06M69k71M143K379K298k997j480l773
8211f69956N59l002P07M344J047p6l411K30o43J81L284K72Q23J288o31J905J343
8194f61736j422R64K173O39P30l992j443J757Q3k087j781R90J977K217M220o9
8178f56780k397m89O45J459J639k673m18J830k19j224j841n315L282R54J175L755
8162f56617k272n868J578O661L685j445p99N17j817L24M503o696q57p34k05M895
8146f55147O659L210L78m48J220j703j005j543m390k401L681J417k568K045K871
8131f47724k809M97j629R11N38J516j350K30j342J827O401j644P0j079o62j005
8115f47254J053P62j304j103L587L819K326K650r14m2p93l742k910o49J195L38
$$ plain form
8227 -670896 -672231 -673086 -673787 -670924 -672909 -673240 -670418 -670724 -670255 -670526 -666383 -664004 -661706 -664703 -666183 -669956
8211 -669956 -669397 -672399 -671692 -667348 -666301 -666377 -669788 -669558 -670201 -670020 -666736 -666464 -665641 -664353 -664984 -663079 -661736
8194 -661736 -663158 -662194 -660021 -659382 -658652 -662644 -664087 -662330 -662247 -664334 -666115 -665125 -663148 -660931 -656711 -656780
8178 -656780 -659177 -659666 -659021 -657562 -655923 -658596 -659014 -657184 -657403 -658627 -660468 -665783 -662501 -661547 -660372 -656617
8162 -656617 -658889 -664757 -663179 -656518 -652833 -654278 -655077 -654560 -656377 -656053 -651550 -658246 -659103 -659837 -660042 -655147
8146 -655147 -648488 -645278 -644900 -645348 -644128 -645831 -646836 -648379 -652769 -655170 -651489 -650072 -652640 -650595 -647724
8131 -647724 -650533 -650036 -651665 -650754 -650216 -648700 -650050 -649820 -651162 -649335 -642934 -644578 -644508 -645587 -646249 -647254
8115 -647254 -646201 -645439 -646743 -647846 -644259 -640440 -638114 -635464 -636378 -636420 -637213 -640955 -643865 -644514 -643319 -642981
8099f42981J166K25J745M33K640o08k516j932K661k332J600L10L59L976K719O78
8083f31857l570l595l36J976K257J300q27Q3J967J088Q9p14j967k292k48R29J244
8066f34473J681J791R31j461l032J622r1J099J512R7m196k272J004n51K360o16
8050f34595J39J319l03j41M752O63M15r61P11K675k089J865L273K104J197J434
8034f17542Q09l848k143k827j436k296lN585M485j11j767k179j850j755l019J051
8018f28846L662J768L96Q53J711Q86J012J380L131k607R14L9l602L89k22j390
8002f20526J027L533N45m33P39P52j471l60R12j082M85K779P28k750p2J170j92
7985f14216N57j180J346K673J948p57k191J489j166J587o62k03k930j650k64J631
$$ plain form
8099 -642981 -641815 -641590 -639845 -639412 -636772 -637380 -639896 -641828 -639167 -641499 -639899 -639589 -639230 -635254 -632535 -631857
8083 -631857 -635427 -639022 -639358 -637382 -635125 -633825 -634652 -634569 -632602 -631514 -631425 -632139 -634106 -636398 -636646 -635717 -634473
8066 -634473 -632792 -631001 -630070 -631531 -634563 -632941 -633032 -631933 -630421 -630324 -634520 -636792 -635788 -636339 -633979 -634595
8050 -634595 -634456 -633137 -633440 -633581 -628829 -628166 -627751 -628712 -628001 -625326 -627415 -625550 -622277 -620173 -618976 -617542
8034 -617542 -616733 -620581 -622724 -625551 -626987 -629283 -629286 -623701 -619216 -619327 -621094 -623273 -625123 -626878 -629897 -628846
8018 -628846 -625184 -623416 -623020 -622167 -620456 -619570 -618558 -617178 -614047 -616654 -615740 -615701 -619303 -618914 -619136 -620526
8002 -620526 -619499 -615966 -615421 -615854 -615115 -614363 -615834 -616194 -615282 -616364 -615879 -613100 -612372 -615122 -615194 -614024 -614216
7985 -614216 -613659 -614839 -613493 -610820 -608872 -609629 -611820 -610331 -611497 -609910 -610572 -610775 -613705 -615355 -615619 -613988
7969f13988K030K47j201K27k80m66K588O08p91K066N73L04l96j781K85L815J15
7952f06045K844P15j395l072k916m149L417L450L224j143R57J748K946p47J836
7937e98330k400k694J664L566k228j121K864P66k478o76M21j297p38j83m544K177
7921f05231Q95P60Q05j029l9N29n99l260K945K604p8J818K344k089l468k568L994
7904f01667N367k118k874J173o28L05j520j380J318M373J208J739j673k486M537
7889e94326L611P13P81k411j496j678k128M179O64j783j297o97j840m8k63J944
7873e96075K274J64m24M83J736L948J224k292M56K42Q67q93j974k150k570J847
7857e93137J413L197o82k322l245J399L805L312N87r46J128K757j222j658j511
$$ plain form
7969 -613988 -611958 -611711 -612912 -612685 -612965 -613431 -610843 -610235 -611026 -608960 -608387 -608083 -608479 -610260 -609975 -606160 -606045
7952 -606045 -603201 -602486 -603881 -606953 -609869 -614018 -610601 -607151 -603927 -605070 -604113 -602365 -599419 -600166 -598330
7937 -598330 -600730 -603424 -601760 -598194 -600422 -601543 -598679 -597913 -600391 -601067 -600646 -601943 -602681 -602864 -607408 -605231
7921 -605231 -604336 -603576 -602771 -603800 -603839 -603310 -603909 -607169 -604224 -601620 -601698 -599880 -597536 -599625 -603093 -605661 -601667
7904 -601667 -596300 -598418 -601292 -600119 -600747 -600442 -601962 -603342 -602024 -597651 -596443 -594704 -596377 -598863 -594326
7889 -594326 -590715 -590002 -589221 -591632 -593128 -594806 -596934 -592755 -592091 -593874 -595171 -595868 -597708 -597756 -598019 -596075
7873 -596075 -593801 -593637 -594061 -593578 -591842 -587894 -586670 -588962 -588506 -588264 -587397 -588290 -590264 -592414 -594984 -593137
7857 -593137 -591724 -588527 -589209 -591531 -594776 -593377 -589572 -586260 -585673 -586619 -585491 -582734 -583956 -585614 -587125
7842e87125J627q19k749n46J399K490L260J009j92j630l425k793k90M71K873K443
7826e83997n29J21P73P14J589k662M70K387N14J324K256k054Q50j611k11K708
7810e77358O43J755l124q9J86q05j822K202J162R7j109l111L165J889K75k985
7794e79029j69O32j893R96L463r26o82J88K074J960J878J565j035j184M200R64
7778e66998j771l526O3r0O02J788Q65p03k995j51K777q30q6J635k352j106J322
7761e71556j460K361L255j78l526o60J796Q26J636N12l328j505J201J870K328
7746e66428K847j298j590q03K188L278J784k50k802m344k949J243M52M433J665
7731e62574J527n17k937k71K655L59m501O16j456rJ075RR99K454K090n08M5J515
$$ plain form
7842 -587125 -585498 -586317 -589066 -589612 -588213 -585723 -582463 -581454 -581646 -583276 -586701 -589494 -589784 -589313 -586440 -583997
7826 -583997 -584526 -584405 -583632 -582918 -581329 -583991 -583521 -581134 -580620 -579296 -577040 -579094 -578244 -579855 -580066 -577358
7810 -577358 -576715 -574960 -578084 -578173 -577987 -578792 -580614 -578412 -577250 -577153 -578262 -581373 -578208 -576319 -576044 -579029
7794 -579029 -579198 -578566 -580459 -579463 -576000 -576926 -577608 -577420 -575346 -573386 -571508 -569943 -570978 -572162 -567962 -566998
7778 -566998 -568769 -572295 -572232 -572322 -571720 -569932 -569067 -569770 -572765 -572916 -570139 -570969 -571055 -569420 -571772 -572878 -571556
7761 -571556 -573016 -570655 -567400 -567578 -571104 -571764 -569968 -569142 -567506 -566994 -570322 -571827 -570626 -568756 -566428
7746 -566428 -563581 -564879 -566469 -567272 -565084 -561806 -560022 -560272 -563074 -567418 -570367 -569124 -568672 -564239 -562574
7731 -562574 -561047 -561564 -564501 -564772 -562117 -561758 -566259 -565643 -567099 -567108 -566033 -566024 -565025 -562571 -560481 -560989 -560944 -559429
7713e59429jJ367L111J102n62k160j902J022P47Q34J741l837j019J573n24j427
7697e59364m29K656J13r00O61J189k2J009l13j256l712J265M769L009K529q96
7681e49692J165j876k380N88j122R5n86k395j947R89J659l61L21O38J560J682
7665e51662k257l197r98L742M306j239j140L832o75k912J455K184m53J383r37
7650e48568K570K182k754m12j288J789P05k789k433l76L795K510K66k073k631
7635e49507k571L458l57K067J671J769Q14l066J122J06J633Q66n75j453l431k86
7619e47740J551M687K75n606j037l77j428K18J520K157J79M802M084O93j288k447
7603e39757P01L1j377J673q48J3j090M15J861j212L2P23K94K780M055j030p12
$$ plain form
7713 -559429 -559430 -558063 -554952 -553850 -554412 -556572 -558474 -557452 -556705 -555871 -554130 -557967 -558986 -557413 -557937 -559364
7697 -559364 -559793 -557137 -557024 -557924 -557263 -556074 -556096 -555087 -555400 -556656 -560368 -559103 -554334 -551325 -548796 -549692
7681 -549692 -548527 -550403 -552783 -552195 -553317 -553222 -553808 -556203 -558150 -557161 -555502 -555863 -555542 -554904 -553344 -551662
7665 -551662 -553919 -557116 -558114 -554372 -550066 -551305 -552445 -548613 -549288 -552200 -550745 -548561 -549014 -547631 -548568
7650 -548568 -545998 -543816 -546570 -546982 -548270 -546481 -545776 -548565 -550998 -551374 -547579 -545069 -544803 -546876 -549507
7635 -549507 -552078 -548620 -548977 -546910 -545239 -543470 -542656 -545722 -544600 -544494 -542861 -541995 -542570 -544023 -547454 -547740
7619 -547740 -546189 -541502 -541227 -546833 -547870 -548247 -549675 -549457 -547937 -545780 -545601 -540799 -536715 -536022 -537310 -539757
7603 -539757 -539056 -539025 -540402 -538729 -539577 -539564 -540654 -540239 -538378 -539590 -539558 -538835 -538541 -535761 -531706 -532736 -533448
7586e33448J801m78j577l926k396K600N055Q96l754K195N227L468j730l139k189
7571e31395j363k957j08K725p38j3N412J117l598l38k531J345M73k230m54L025
7555e31628N84J239J008L359l38m29K519o98k554l982k192K028K098j337j706
7540e32029L545K244j596k436Q38L693j160j208L027q42O14J224j12k012N08j974
7524e27676l244j09j520K598M230J725k319J372M586J402j121k11l270j610P32
7509e24435K536R84k802O61N69k192o55l679J641K74J420J616j003J934j84j597
7493e24912M27p8o76L523J645o0J917l123l377Q22K777k80k839K59M447K078k74
7476e17724n72M065M565J74j330l4j525j47l4q50j054k949l026L488L066n02k471
$$ plain form
7586 -533448 -531647 -532125 -533702 -537628 -540024 -537424 -532369 -531473 -535227 -533032 -527805 -524337 -526067 -529206 -531395
7571 -531395 -532758 -535715 -535823 -533098 -533836 -533849 -528437 -527320 -530918 -531256 -533787 -532442 -531969 -534199 -534653 -531628
7555 -531628 -531044 -529805 -528797 -525438 -525776 -526205 -523686 -524384 -526938 -530920 -533112 -531084 -528986 -530323 -532029
7540 -532029 -528484 -526240 -527836 -530272 -529434 -525741 -526901 -528109 -525082 -525924 -525310 -524086 -524198 -526210 -525702 -527676
7524 -527676 -530920 -531029 -532549 -529951 -525721 -523996 -526315 -524943 -520357 -518955 -520076 -520287 -523557 -525167 -524435
7509 -524435 -521899 -520915 -523717 -523056 -522487 -524679 -525334 -529013 -527372 -527098 -525678 -524062 -525065 -523131 -523315 -524912
7493 -524912 -524485 -524563 -525239 -521716 -520071 -520131 -518214 -521337 -524714 -523892 -521115 -521395 -524234 -523975 -519528 -517450 -517724
7476 -517724 -518296 -514231 -509666 -509492 -510822 -510856 -512381 -512528 -512562 -513412 -514466 -517415 -520441 -516953 -513887 -514389 -516860
7459e16860j630j610R20J573l00r57J408J827J158P13J454J2l487J854J190j842
7443e14577K300K141n45j794k883o25j936K430L161J097j863J58j971J129K002
7428e11776J647k040o06K604J944j944j539P27J432Q48J990j796l785J378j976
7413e12892O15L192K235J412q93J714o06K21M19k917l226k396K532j889K0M504
7397e07955j609J056J635j28L70l55o22l12J92M04K547J500k24j339n318K462
7381e07696N120J067k558J947L572j110j005j056J888J707J513n196m355l297
7367e09459Q76K065Q44N510J829j386J438N130K131k571m162l464j355j681K721
7352e01534L460J492L396m74J281m632l027k557L334L86k77K497n11k769p62L498
$$ plain form
7459 -516860 -518490 -520100 -519180 -517607 -517907 -518864 -517456 -515629 -514471 -513758 -512304 -512292 -515779 -513925 -512735 -514577
7443 -514577 -512277 -510136 -510681 -512475 -515358 -515983 -517919 -515489 -512328 -511231 -513094 -512936 -514907 -513778 -511776
7428 -511776 -510129 -512169 -512775 -510171 -508227 -510171 -511710 -510983 -509551 -508703 -506713 -508509 -512294 -510916 -512892
7413 -512892 -512277 -509085 -506850 -505438 -506331 -504617 -505223 -505002 -504583 -507500 -510726 -513122 -510590 -512479 -512459 -507955
7397 -507955 -509564 -508508 -506873 -507001 -506631 -506986 -507608 -507920 -507728 -507324 -504777 -503277 -503501 -504840 -510158 -507696
7381 -507696 -502576 -501509 -504067 -502120 -498548 -499658 -500663 -501719 -499831 -498124 -496611 -501807 -506162 -509459
7367 -509459 -508583 -506518 -505674 -500164 -498335 -499721 -498283 -493153 -491022 -493593 -497755 -501219 -502574 -504255 -501534
7352 -501534 -498074 -496582 -493186 -493660 -492379 -497011 -500038 -502595 -499261 -498875 -499152 -496655 -497166 -499935 -500697 -497199
7336d97199K640J200J363J84k313j604j651j92M82M31k782j26K829k640j694K621
7320d98451K372J035K515O60j55j192p98l0P19J13j740k726N29M779o4l070l491
7303d98995M083L113k492L244k67N23O81r32K82j51k073QL029J75L156J858J268
7286d83490k562J41J8l429k348n57L042N072J658k024k800k382n42J775Q11J169
7270d86448L851q10l043j153k7M35Q77M039J146q54l123J719L01k412k49M09L991
7253d81351J995k329k698l599K79K245J786k227l098m02M405L672N66l878m3J992
7237d82685L277p43j618j162J104p27k695k807J050K504J696O17J261j104R11
7222d81121m98O61l909K022N573L554P0j920n025q06Q39M03L91K192R11N89J55
$$ plain form
7336 -497199 -494559 -493359 -491996 -491812 -494125 -495729 -497380 -497572 -497090 -496659 -499441 -499567 -496738 -499378 -501072 -498451
7320 -498451 -496079 -495044 -492529 -491869 -492024 -493216 -494014 -494044 -493325 -493212 -494952 -497678 -497149 -492370 -492434 -495504 -498995
7303 -498995 -494912 -491799 -494291 -491047 -491314 -490791 -490110 -491042 -490760 -490911 -492984 -492976 -489947 -489772 -486616 -484758 -483490
7286 -483490 -486052 -485911 -485893 -489322 -491670 -492227 -489185 -484113 -482455 -484479 -487279 -489661 -490203 -488428 -487617 -486448
7270 -486448 -482597 -483407 -486450 -487603 -487630 -487195 -486318 -482279 -481133 -481987 -485110 -483391 -483090 -485502 -485751 -485342 -481351
7253 -481351 -479356 -481685 -484383 -487982 -487703 -485458 -483672 -485899 -488997 -489399 -484994 -481322 -480756 -484634 -484677 -482685
7237 -482685 -479408 -480151 -481769 -482931 -481827 -482554 -485249 -488056 -487006 -484502 -482806 -482189 -480928 -482032 -481121
7222 -481121 -481619 -480958 -484867 -482845 -477272 -473718 -473648 -475568 -480593 -481399 -480560 -480157 -479766 -477574 -476663 -476074 -475919
7205d75919j569j281J257K321r98n241l330J781L569o95k577M992J275j146j796
7190d79357j201K761J601K97o70k013k85M41K231K065k264L51J697R70jJ683Q7
7173d71607j814M72K03J00l466Q37j93J058j478P18J653M28j750J731K808m7l78
7156d70725L59l495k684K077K771K29j213o65J144p91l16l340P07J797J748J093
7140d71304L461M887j053m38j288j902J14Q91N27K134J715p47n63k453j506Q61
7124d66664l14J218j372k102k975l283J375N032n14M67J932J659R06J004o29l
7108d64263j6J441L45m91k926k573j166K401K112J82r91j631k906L131K567L86
7092d64398J191l421L130l10L90N46K732o67l402j07J174J732k4m71r52j084R30
$$ plain form
7205 -475919 -477488 -478769 -477512 -475191 -476189 -481430 -484760 -482979 -479410 -480105 -482682 -477690 -476415 -477561 -479357
7190 -479357 -480558 -477797 -476196 -475899 -476569 -478582 -478867 -478426 -476195 -474130 -476394 -476043 -474346 -473376 -473377 -471694 -471607
7173 -471607 -473421 -472949 -472746 -472646 -476112 -475275 -475468 -474410 -475888 -475170 -473517 -473089 -474839 -473108 -470300 -470347 -470725
7156 -470725 -470366 -473861 -476545 -474468 -471697 -471468 -472681 -473346 -472202 -472993 -473309 -476649 -475942 -474145 -472397 -471304
7140 -471304 -467843 -462956 -464009 -464447 -465735 -467637 -467523 -466632 -466105 -463971 -462256 -463003 -463566 -466019 -467525 -466664
7124 -466664 -466978 -465760 -467132 -469234 -472209 -475492 -474117 -469085 -469599 -469132 -467200 -465541 -464635 -463631 -464260 -464263
7108 -464263 -464279 -462838 -462493 -462984 -465910 -468483 -469649 -467248 -465136 -464954 -465945 -467576 -470482 -467351 -464784 -464398
7092 -464398 -463207 -466628 -463498 -463808 -463418 -462872 -460140 -460807 -464209 -464316 -463142 -461410 -461434 -461905 -462857 -463941 -463011
7075d63011m20J348L884K024k109j931l68K439L186q79k508k67J564j138k918
7060d61104o51J418j225n65Q8j24Q28J991K768m177j218k41j73J661K145m37j298
7043d60314L648M622L13o259Q56j512m20m313m102L203M741J297j736o30J243
7028d59363j062r1J763j487k026J945K618l37K536K1m63J153q40J64R13K189J504
7011d50863j865M03K419o87J744N78l328j580l514k758K81N66L764mj030J839
6995d54035L506q33k017N8M56j446J166J086J010j068o91l631P17O674O565l510
6979d45993n252k26M921J429n00j106r62L6J285j331J148J144o779j214K208K287
6963d48905M635K412l119k450J582j356j792l19r63J688L111J215l034n474J031
$$ plain form
7075 -463011 -463431 -462083 -458199 -456175 -458284 -460215 -460583 -458144 -454958 -455837 -458345 -458612 -457048 -458186 -461104
7060 -461104 -461755 -460337 -461562 -462127 -462039 -462163 -461335 -459344 -456576 -460753 -461971 -462212 -462385 -460724 -458579 -459016 -460314
7043 -460314 -456666 -452044 -451731 -457990 -457134 -458646 -459066 -463379 -467481 -464278 -459537 -458240 -459976 -460606 -459363
7028 -459363 -460425 -460516 -458753 -460240 -462266 -460321 -457703 -458040 -455504 -455483 -455946 -454793 -455633 -455469 -454556 -452367 -450863
7011 -450863 -452728 -452325 -449906 -450593 -448849 -448271 -451599 -453179 -456693 -459451 -459170 -458604 -454840 -454844 -455874 -454035
6995 -454035 -450529 -451362 -453379 -453321 -452865 -454311 -453145 -452059 -451049 -452117 -452808 -456439 -455722 -449048 -442483 -445993
6979 -445993 -451245 -451471 -446550 -445121 -445621 -446727 -447689 -447653 -446368 -447699 -446551 -445407 -452186 -453400 -451192 -448905
6963 -448905 -444270 -441858 -444977 -447427 -445845 -447201 -448993 -449312 -450275 -448587 -445476 -444261 -447295 -452769 -451738
6948d51738J443k50M026J827j050j612k1j524M00M341q3J653J386M30k113n99
6932d43484J354n10j53K312j074M54L464j059k067l253J4M44Pj78j518J528J333
6915d42386L120L86j284n06j709j245k69M87J723l02J129n00l45J147J070n79
6899d40063J762k557l48K453L42Q50p98j74O85m68j179k707k285K607J434j046
6883d41492K851M59j26R3P38J915j535O52j086j153J9K799K369J98o41k354r59
6866d37253j46p78k329r19L51K27j862L671J204N087K536l35k04k572j85J226
6850d32281l930n381M9L826M465M622J244o01J534l205l385J510L926j112l283
6835d32002j905J971L24k396K6j018k641k326K403J020J625L903M430k35L60J681
$$ plain form
6948 -451738 -450295 -450545 -446519 -444692 -445742 -447354 -447375 -448899 -448499 -444158 -444241 -442588 -441202 -440772 -442885 -443484
6932 -443484 -442130 -442640 -442793 -440481 -441555 -441101 -437637 -438696 -440763 -444016 -444002 -443558 -443551 -443729 -445247 -443719 -442386
6915 -442386 -439266 -438880 -440164 -440670 -442379 -443624 -443893 -443406 -441683 -441985 -440856 -441356 -441701 -440554 -439484 -440063
6899 -440063 -438301 -440858 -441206 -438753 -438411 -437561 -438359 -438533 -437848 -438316 -439495 -442202 -444487 -441880 -440446 -441492
6883 -441492 -438641 -438182 -438308 -438215 -437477 -435562 -437097 -436445 -437531 -438684 -438665 -435866 -433497 -433299 -433940 -436294 -437253
6866 -437253 -437399 -438177 -440506 -441425 -441074 -440847 -442709 -439038 -437834 -432747 -430211 -430546 -430750 -433322 -433507 -432281
6850 -432281 -436211 -441592 -441543 -437717 -433252 -428630 -427386 -427987 -426453 -429658 -433043 -431533 -427607 -428719 -432002
6835 -432002 -433907 -431936 -431612 -434008 -433982 -435000 -437641 -439967 -437564 -436544 -434919 -431016 -426586 -426821 -426461 -424780
6819d24780Q00l55n64k819l30j954k316J415j179p83j100N67J003j57K029p52
6803d31275J758J148J25J142j998J05K584J51j25L92J341j588j439L281m34j50
6787d24982q54J36R59j88k88M20K09j750l901J652M455J037j169m334j794K80
6771d30112K146K022j201k061M091M781L076J349J174n079k866j694l13k748K985
6756d24450n42J363L201J001l852j305n82J769K542Q12l32p43j054k438j608l59
6740d26577k52M934J964k219k403K082R57j225Q98J783m74j752j709r7K406J424
6724d20260j099o43j170J694M055M787k415j329j678j99k767j801J760L093J613
6709d16359r94j772J589o28J136p23m794p08q46M08K634j5P8K729R64k080j718
$$ plain form
6819 -424780 -423980 -424335 -424899 -427718 -428048 -430002 -432318 -430903 -432082 -432865 -433965 -433398 -432395 -432552 -430523 -431275
6803 -431275 -429517 -428369 -428244 -427102 -429100 -428995 -426411 -426260 -426385 -425993 -424652 -426240 -427679 -424398 -424832 -424982
6787 -424982 -425836 -425700 -424741 -424929 -425217 -424797 -424588 -426338 -430239 -428587 -424132 -423095 -424264 -428598 -430392 -430112
6771 -430112 -427966 -425944 -427145 -429206 -425115 -420334 -417258 -415909 -414735 -419814 -422680 -424374 -424687 -427435 -424450
6756 -424450 -424992 -423629 -420428 -419427 -423279 -424584 -425166 -423397 -420855 -420043 -420375 -421118 -422172 -424610 -426218 -426577
6740 -426577 -426829 -421895 -419931 -422150 -424553 -422471 -421514 -422739 -421841 -420058 -420532 -422284 -423993 -424090 -421684 -420260
6724 -420260 -421359 -422002 -423172 -421478 -417423 -412636 -415051 -416380 -418058 -418257 -421024 -422825 -421065 -417972 -416359
6709 -416359 -417353 -419125 -417536 -418164 -417028 -417751 -422545 -423253 -424099 -423691 -421057 -421072 -420994 -418265 -417301 -419381 -421099
6692d21099l04K112K556k271k901M08P38J62K061J184O74J129K298K027j400n719
6676d18345j833l33J137o50j889J322K100m9L981p83K72J307k7j654k183J4P01
6659d16912L05L98j186j45K46K158l82l270o45K90k19L754M071J387K83J242J927
6642d06698K660k972j041j037J266p51k160J155J978j846m439r00M464k234j871
6627d14426K024J260q04J166J305M053k508j146K773J309l011k158m901j08J239
6612d13933L180J221q66k379j183k4O3k688P39K712J320J206j235r39J549k584
6596d13841j024N05K023J999j9j289K327K633J105k237j080l11J159j123k831
6581d12004J556J690n53K917k00K288m25k380N72K857J153J737n271l727j478
$$ plain form
6692 -421099 -421403 -419291 -416735 -419006 -421907 -421499 -420761 -420599 -418538 -417354 -416680 -415551 -413253 -411226 -412626 -418345
6676 -418345 -420178 -420511 -419374 -420024 -421913 -420591 -418491 -418540 -414559 -415342 -415070 -413763 -413790 -415444 -417627 -417613 -416912
6659 -416912 -416607 -416209 -417395 -417540 -417294 -415136 -415518 -418788 -419433 -419143 -419362 -415608 -411537 -410150 -409867 -408625 -406698
6642 -406698 -404038 -407010 -408051 -409088 -407822 -408573 -410733 -409578 -407600 -409446 -413885 -414785 -410321 -412555 -414426
6627 -414426 -412402 -411142 -411946 -410780 -409475 -405422 -407930 -409076 -406303 -404994 -408005 -410163 -415064 -415172 -413933
6612 -413933 -410753 -409532 -410398 -412777 -413960 -413984 -413921 -416609 -415870 -413158 -411838 -410632 -411867 -412806 -411257 -413841
6596 -413841 -414865 -414360 -412337 -410338 -410357 -411646 -409319 -406686 -405581 -407818 -408898 -409209 -408050 -409173 -412004
6581 -412004 -410448 -408758 -409311 -406394 -406594 -404306 -404731 -407111 -406539 -403682 -402529 -400792 -406063 -409790 -411268
6566d11268K592L908N77l129q64L340L470J383j763o09J341k06l640L39K72j869
6550d06126J435J230j858j291j541m38M318R45J280J538k108j969K281J653j509
6535d02160k664O02L95j349k515K561J675k22j144J764J634J735M66k063L18J607
6519c99360J903J529j131L83Q72l39J320j069k811J277K16j303k992k203K010
6504d01698M963R25p95q61m389j089O019M88m740J817M799k86k131l276p02J668
6488c99288q05j259L179O753L848L28l570n0k503l369o94L456oj666j151k296
6472c99093j098Q96L120K121q23R74n304m183P79M155K663l368n325L714L141
6457c97631K15J079q37j746L390k65J012j058l352j857J894L631L80K40j408k289
$$ plain form
6566 -411268 -408676 -404768 -404191 -407320 -408184 -404844 -401374 -399991 -401754 -402363 -401022 -401228 -404868 -404529 -404257 -406126
6550 -406126 -404691 -403461 -405319 -406610 -408151 -408589 -404271 -403326 -402046 -400508 -402616 -404585 -402304 -400651 -402160
6535 -402160 -404824 -404222 -403827 -405176 -407691 -405130 -403455 -403677 -404821 -403057 -401423 -399688 -399222 -401285 -400967 -399360
6519 -399360 -397457 -395928 -397059 -396676 -395804 -396143 -394823 -395892 -398703 -397426 -397210 -398513 -401505 -403708 -401698
6504 -401698 -396735 -395810 -396605 -397466 -401855 -402944 -396925 -396437 -401177 -399360 -394561 -394847 -396978 -400254 -400956 -399288
6488 -399288 -400093 -401352 -398173 -391420 -387572 -387244 -390814 -390864 -393367 -396736 -397430 -393974 -393980 -395646 -396797 -399093
6472 -399093 -400191 -399295 -396175 -394054 -394877 -393903 -399207 -403390 -402611 -398456 -395793 -399161 -404486 -400772 -397631
6457 -397631 -397416 -396337 -397174 -398920 -395530 -395795 -394783 -395841 -399193 -401050 -399156 -395525 -395145 -394905 -396313 -398602
6441c98602K138n29k661k629K902L250J9r76j183M66J396L226L257k43l485k786
6425c96440P03K177K695M42o74O63K732K383J13p5k455l263r46O18M591J957m429
6408c89208j220J805K126J542j825l114k580J996j558j976L023L116M73k169j502
6393c91071J64K329J063l49j973J045J544n77K095Q1l475k3k981l53M333J868
6377c86280R31J652j836l294J489j171j980O66K432j573j751j40L640M593l31
6362c82953l95k113N768N5l769k046j27M456J938k581J38M55J981L67J69J70k311
6345c80798j835j103M36o06J081K198k985j998J020J277K094k17J821m5J0p88
6329c80438j531J83j859r7j73l96J174P43J785L481j430M11l70j628k164q29j529
$$ plain form
6441 -398602 -396464 -396993 -399654 -402283 -399381 -396131 -396112 -397088 -398271 -397805 -396409 -393183 -389926 -390169 -393654 -396440
6425 -396440 -395737 -393560 -390865 -390423 -391097 -390434 -387702 -385319 -385206 -385281 -387736 -390999 -391945 -391327 -386736 -384779 -389208
6408 -389208 -390428 -388623 -386497 -384955 -386780 -389894 -392474 -390478 -392036 -394012 -390989 -387873 -387400 -389569 -391071
6393 -391071 -390907 -388578 -387515 -387864 -389837 -388792 -387248 -387825 -385730 -385649 -389124 -389147 -392128 -392481 -388148 -386280
6377 -386280 -385349 -383697 -385533 -388827 -387338 -388509 -390489 -389823 -387391 -388964 -390715 -390855 -387215 -382622 -382953
6362 -382953 -383348 -385461 -379693 -379638 -383407 -385453 -385580 -381124 -379186 -381767 -381629 -381174 -379193 -378826 -378657 -378487 -380798
6345 -380798 -382633 -383736 -383300 -383906 -382825 -380627 -383612 -385610 -384590 -383313 -381219 -381436 -379615 -379660 -379650 -380438
6329 -380438 -381969 -381786 -383645 -383742 -383915 -384311 -383137 -382394 -380609 -377128 -378558 -378147 -378517 -380145 -382309 -383138 -384667
6312c84667J602n08Q82j877j72L926O17Q91J11J206l144k656m219K84L959K053
6296c81712K905J621j556l03r46k447J836K182l201l15J296J246R60K75j140o42
6280c79941k427k401J333o12k364K38K226Q41l62K92k43K324n14M56J449K067
6264c77638k08p30L251J250K298K763K3k979k0O59j097j530r44l121j128L106
6248c76045j716J165K015Q86m81K68J846P36k728q66J555j110j243l90J060O36
6232c74412j070o28r09K81J830M23j354L593K982j900j464L06k210L57M23r0j994
6215c75836L38M625J091J168j606o06m97o09o6k600m133j606L407N785J162k278
6199c72261m469M32K426M006J545j661j890J543M18J59P51j17q44M38J800j232
$$ plain form
6312 -384667 -383065 -383573 -382691 -384568 -384740 -380814 -380197 -379306 -379195 -377989 -381133 -383789 -388008 -387724 -383765 -381712
6296 -381712 -378807 -377186 -378742 -379045 -379991 -382438 -380602 -378420 -381621 -381936 -380640 -379394 -378434 -378159 -379299 -379941
6280 -379941 -382368 -384769 -383436 -384048 -386412 -386174 -383948 -383107 -383469 -383177 -383420 -381096 -381610 -381154 -379705 -377638
6264 -377638 -377846 -378576 -375325 -374075 -371777 -369014 -368991 -371970 -371990 -371331 -372428 -373958 -374902 -378023 -379151 -376045
6248 -376045 -377761 -376596 -374581 -373695 -374176 -373908 -372062 -371326 -374054 -374920 -373365 -374475 -375718 -376108 -375048 -374412
6232 -374412 -375482 -376110 -377019 -376738 -374908 -374485 -375839 -372246 -369264 -371164 -372628 -372322 -374532 -374175 -373752 -373842 -375836
6215 -375836 -375498 -370873 -369782 -368614 -370220 -370826 -371323 -371932 -371998 -374598 -378731 -380337 -376930 -371145 -369983 -372261
6199 -372261 -376730 -376298 -373872 -369866 -368321 -369982 -371872 -370329 -369911 -369752 -369001 -369118 -369962 -369524 -367724 -368956
6183c68956J54j851j151J351j12J077J67N91m27N03k242M76L03k01j684l208J208
6166c74002J269m81l516k262J630P39J863L160k020J357J379K919J909j117R03
6151c66270P29l039J342L080j596j163j936J016R86r25J771j627L5l5k494j685
6135c71811q22j827J296M727ON26K140J482m45J309o14k121j149j88k028J439
6119c68080J939Q83O29M76K854J460L54l896J597J84m388J871K12L67O12m85L65
6102c63046j363j272P39K569m66j321J762j932Q24K279k60L657N00l325k928j115
6086c64698L61J415l041n29M078q41m02L290k734m377j20m23K822n91k421O32
6070c67579O503J934j511k44k958m157M63K325J256j640j271Q18J758J750K049
$$ plain form
6183 -368956 -368802 -370653 -371804 -370453 -370565 -369488 -369321 -368730 -369157 -368654 -370896 -370420 -370117 -370318 -372002 -375210 -374002
6166 -374002 -372733 -373214 -376730 -378992 -377362 -376623 -374760 -371600 -373620 -372263 -370884 -367965 -366056 -367173 -366270
6151 -366270 -365541 -368580 -367238 -364158 -365754 -366917 -368853 -367837 -366851 -367776 -366005 -367632 -367597 -367632 -370126 -371811
6135 -371811 -372633 -374460 -373164 -368437 -368431 -367905 -365765 -364283 -364728 -363419 -364033 -366154 -367303 -367491 -369519 -368080
6119 -368080 -366141 -365258 -364629 -364153 -361299 -359839 -359485 -363381 -361784 -361600 -365988 -364117 -363905 -363538 -362926 -363411 -363046
6102 -363046 -364409 -365681 -364942 -362373 -362839 -364160 -362398 -364330 -363506 -361227 -361487 -357830 -357330 -360655 -363583 -364698
6086 -364698 -364337 -362922 -365963 -366492 -362414 -363255 -363657 -360367 -363101 -367478 -367598 -368021 -365199 -365790 -368211 -367579
6070 -367579 -361076 -359142 -360653 -360897 -363855 -368012 -367549 -365224 -363968 -365608 -366879 -366061 -364303 -362553 -360504
6055c60504M178J155J326k968l321k085j219J913M659o05K355l114j354L368K243
6040c53973J320k509m77m626j744P34l32J325J553q02j577o62k221J67j423k031
6024c67278l49M090L082K938K802j804k711m037j121L817J927l326k10K407L852
6009c55921k35rL479p56n542j064O14n81j02l372j591j426M10N094K071J688J518
5992c55725o55K000k88k912l024K411J620q47j404j380M154L705Q88K63n9n517
5976c56770p215p58K134J254J542P05J64j089j852J383K470N138J837m639j676
5961c57372K86O79J816P83J173O26J050j298j967q16j7k681k838j973K355L547
5945c56647K887K046L151J061j948k663k051M36J158m08l037j267J338K350J491
$$ plain form
6055 -360504 -356326 -355171 -353845 -356813 -360134 -362219 -363438 -361525 -356866 -357471 -355116 -358230 -359584 -356216 -353973
6040 -353973 -352653 -355162 -355639 -360265 -362009 -361275 -361607 -360282 -358729 -359531 -361108 -361770 -363991 -363824 -365247 -367278
6024 -367278 -367627 -363537 -360455 -357517 -354715 -356519 -359230 -363267 -364388 -360571 -358644 -361970 -362180 -359773 -355921
6009 -355921 -356156 -356165 -352686 -353442 -358984 -360048 -359434 -360015 -360117 -363489 -365080 -366506 -366096 -361002 -358931 -357243 -355725
5992 -355725 -356380 -354380 -354668 -357580 -360604 -358193 -356573 -357420 -358824 -360204 -356050 -352345 -351457 -351194 -351253 -356770
5976 -356770 -363985 -364743 -362609 -361355 -359813 -359108 -358944 -360033 -361885 -360502 -358032 -352894 -351057 -355696 -357372
5961 -357372 -357086 -356407 -354591 -353808 -352635 -352009 -350959 -352257 -354224 -355040 -355057 -357738 -360576 -362549 -360194 -356647
5945 -356647 -353760 -351714 -348563 -347502 -349450 -352113 -354164 -353728 -352570 -352978 -356015 -357282 -355944 -353594 -352103
5930c52103k58j466Q13Q96j293j159j54L041j608j950L148K634j381j442K494
5915c49788N97j014J624j088M59k11J232p96j730j216O08n10k183J747L064l50
5899c49555o71j284J311K917O46k062M2J770J809K66k52Q91j116l651K79O01K15
5882c47844j288N77L114L050l231L97Mj35l025J531K096q6k574J104j415K625
5866c45100n33o98l148R9Rj924L686L635L590K775n349m632k356J089K333m02
5850c46926R99R35J597k4k588k216n34J422Q00j112K269M019L057K06m692j498
5834c44286J294j049r43P76M076k91L40j698P69M16J337j475l017j268J462k01
5818c43758R29L679l274J993J798K06k083k10L70j879k736K199L00q68K862o94
$$ plain form
5930 -352103 -352361 -353827 -353014 -352118 -353411 -354570 -354724 -351683 -353291 -355241 -352093 -349459 -350840 -352282 -349788
5915 -349788 -349191 -350205 -348581 -349669 -349210 -349421 -348189 -348985 -350715 -351931 -351323 -351833 -354016 -352269 -349205 -349555
5899 -349555 -350226 -351510 -350199 -347282 -346636 -348698 -348656 -346886 -345077 -344811 -345063 -344172 -345288 -348939 -348660 -348059 -347844
5882 -347844 -349132 -348555 -345441 -342391 -345622 -345225 -345221 -345356 -348381 -346850 -344754 -344840 -347414 -346310 -347725 -345100
5866 -345100 -345633 -346331 -349479 -349380 -349371 -351295 -347609 -343974 -340384 -337609 -342958 -347590 -349946 -348857 -346524 -346926
5850 -346926 -345927 -344992 -343395 -343419 -346007 -348223 -348757 -347335 -346535 -347647 -345378 -341359 -338302 -338096 -342788 -344286
5834 -344286 -342992 -344041 -344984 -344208 -340132 -340423 -340083 -341781 -341012 -340596 -339259 -340734 -343751 -345019 -343557 -343758
5818 -343758 -342829 -339150 -342424 -340431 -338633 -338427 -340510 -340720 -340350 -342229 -344965 -342766 -342466 -343334 -340472 -341166
5802c41166j236N01L000K75l045l868p94K005L471l95l04J177J646j869k719j94
5786c43515j215Q38J266J894Q4j039L180R7J162j066j316j60J462j052R71J342
5770c37067m84l85J089m77l837l60K255P34P12N81J583j851l026M388J697l85
5754c34833K52l749k510R42R83J125J159n89PJ090j557j587J406K746P9j827Q59
5737c36004K483n83n81j330L55L99K446J151n40j714k656j945L64J97O86J381
5721c35891l07l89l63j862q21J635L750n11o82r41m76K060K78K356P31j861K309
5704c30985j690l105J360o46L98J39K443o275r36K048m0L71J852J951k11k617
5688c35943j58L91J893K637k189j529M842j973J671q83k628J062J062J032K838
$$ plain form
5802 -341166 -342402 -341901 -338901 -338626 -341671 -345539 -346333 -344328 -340857 -341252 -341556 -340379 -338733 -340602 -343321 -343515
5786 -343515 -344730 -343892 -342626 -340732 -340648 -341687 -338507 -338410 -337248 -338314 -339630 -339790 -338328 -339380 -338409 -337067
5770 -337067 -337551 -337936 -336847 -337324 -341161 -341521 -339266 -338532 -337820 -337239 -335656 -337507 -340533 -336145 -334448 -334833
5754 -334833 -334581 -338330 -340840 -339898 -338915 -337790 -336631 -337220 -337213 -336123 -337680 -339267 -337861 -335115 -335036 -336863 -336004
5737 -336004 -333521 -334104 -334685 -336015 -335660 -335261 -332815 -331664 -332204 -333918 -336574 -338519 -338155 -337958 -337272 -335891
5721 -335891 -336198 -336587 -336950 -338812 -339633 -337998 -334248 -334759 -335441 -336382 -336858 -334798 -334520 -332164 -331433 -333294 -330985
5704 -330985 -332675 -335780 -334420 -335066 -334668 -334529 -332086 -338361 -339297 -337249 -337289 -336918 -335066 -333115 -333326 -335943
5688 -335943 -336101 -335710 -333817 -331180 -333369 -334898 -330056 -332029 -330358 -331241 -333869 -332807 -331745 -330713 -327875
5673c27875n77J880Q89k494l660J035P31l587k976J396p07J680l273O56M147K778
5657c29957K287j608J103m3k833k408k111K985R31j368M3J10J685L158j0k486
5641c30522j103j707l105K503J420L310j008r24K732j734j426K883J141k378j367
5626c31285j565k807l578J482L919K855K695L81j682K48J089j482J101j36k247
5611c31012N8K244L02k522Mj025j265L486J981L380j62l069J724K449J696j897
5595c23628l215l675k499M489K453k043j356L526M889p71k186n078m345O74L447
5580c29318M084J50K31k963l396K74K155J692j299J48J260r46N354K710m058o591
5564c30513o43K803L662K670L47j300J651m67l194K918K60r82J257K269n102n498
$$ plain form
5673 -327875 -328452 -326572 -325683 -328177 -331837 -330802 -330071 -333658 -336634 -335238 -335945 -334265 -337538 -336882 -332735 -329957
5657 -329957 -327670 -329278 -328175 -328218 -331051 -333459 -335570 -332585 -331654 -333022 -332979 -332869 -331184 -328026 -328036 -330522
5641 -330522 -331625 -333332 -336437 -333934 -332514 -329204 -330212 -331136 -328404 -330138 -331564 -328681 -327540 -329918 -331285
5626 -331285 -332850 -335657 -339235 -337753 -333834 -330979 -328284 -327903 -329585 -329337 -328248 -329730 -328629 -328765 -331012
5611 -331012 -330954 -328710 -328408 -330930 -330926 -331951 -333216 -329730 -327749 -324369 -324531 -327600 -325876 -323427 -321731 -323628
5595 -323628 -326843 -330518 -333017 -328528 -326075 -328118 -329474 -325948 -321059 -321830 -324016 -329094 -333439 -332765 -329318
5580 -329318 -325234 -325084 -324853 -327816 -331212 -330938 -328783 -327091 -328390 -328242 -326982 -327928 -322574 -319864 -323922 -330513
5564 -330513 -331156 -328353 -324691 -322021 -321674 -322974 -321323 -321790 -324984 -322066 -321806 -322788 -321531 -319262 -324364 -329862
5548c29862k51N193p08m166j066K475Q19J913p29l695J175K872m12j687J118j996
5532c29007m386j406J645L505K851j36M024k80Q28J884L510l213j709r03l030
5517c25823L678j227l421P95K80L628L66k969P53l363j804LK529L634K913K82
5501c19746k289j16m04l29J496j273m76K974k145N24q12j070l172k01L876p95
5485c23958k8p99j03K931K466j686j802k910l248J773k57J202K113n17L977j03
5469c20949R98P60l46k001l8j265O06K203J616k488k171l074k889p47K409K504
5453c24872r38k263J221J982K170K1K357L337l030K24O35j664N11r6M30K417J209
5436c16349m098j262J607j777J344O78j683q07J237K60j631o82J707J912l714
$$ plain form
5548 -329862 -330113 -324920 -325628 -329794 -330860 -328385 -327566 -325653 -326382 -330077 -328902 -326030 -326442 -328129 -327011 -329007
5532 -329007 -333393 -334799 -333154 -329649 -326798 -326934 -322910 -323190 -322362 -320478 -316968 -320181 -321890 -322793 -325823
5517 -325823 -322145 -323372 -326793 -325998 -325718 -322090 -321724 -324693 -323940 -327303 -329107 -329104 -326575 -322941 -320028 -319746
5501 -319746 -322035 -322151 -322555 -322884 -321388 -322661 -323137 -320163 -322308 -321784 -322596 -323666 -326838 -327039 -323163 -323958
5485 -323958 -323986 -324785 -324888 -321957 -319491 -321177 -322979 -325889 -329137 -327364 -327621 -326419 -324306 -324823 -320846 -320949
5469 -320949 -319951 -319191 -319537 -321538 -321576 -322841 -322235 -320032 -318416 -320904 -323075 -326149 -329038 -329785 -327376 -324872
5453 -324872 -325810 -328073 -326852 -324870 -322700 -322679 -320322 -316985 -320015 -319791 -319156 -320820 -320309 -320405 -319975 -317558 -316349
5436 -316349 -320447 -321709 -320102 -321879 -320535 -319857 -321540 -322347 -321110 -320850 -322481 -323163 -321456 -319544 -323258
5421c23258k33K929K895k193K683K022k988m003Q21J948M99k458k97K321K767
5406c16545L6k48l68K382K95j201J826K05k84k443j881J364J038j084k41r89J079
5389c17059N33m84J121l009j837J540J248m33P65M382j183m066K846N10r51K295
5373c13782l61k204j361j162N44l622K099J647k541N319Q05j087r6L111J712L12
5357c10667l244k039K332L234k24l003J519k64j817J26k535k158K655N572J864
5342c08649j66k46n41l27j236P0J445j723l62K154l809J141L245J002k299k759
5326c13060l84m69l216O75L502J337K808j182k463l278r51r05Q30p93J600L021
5310c12928J969j357j479K932J106k026P95j203j056q88J7L98M09l86R07n29K73
$$ plain form
5421 -323258 -323491 -320562 -317667 -319860 -317177 -315155 -318143 -322146 -321325 -319377 -318878 -321336 -321633 -319312 -316545
5406 -316545 -316509 -316757 -317125 -314743 -314448 -315649 -313823 -313618 -313902 -316345 -318226 -316862 -315824 -316908 -317149 -318138 -317059
5389 -317059 -316526 -317010 -315889 -318898 -320735 -319195 -317947 -318380 -317615 -313233 -314416 -318482 -315636 -315126 -316077 -313782
5373 -313782 -314143 -316347 -317708 -318870 -318326 -321948 -319849 -318202 -320743 -315424 -314619 -315706 -315802 -312691 -310979 -310667
5357 -310667 -313911 -315950 -313618 -310384 -310608 -313611 -312092 -312356 -314173 -314047 -316582 -318740 -316085 -310513 -308649
5342 -308649 -308815 -309061 -309602 -309929 -311165 -311095 -309650 -311373 -311735 -309581 -313390 -312249 -309004 -308002 -310301 -313060
5326 -313060 -313444 -313913 -317129 -316454 -312952 -311615 -308807 -309989 -312452 -315730 -316681 -317586 -316756 -317549 -315949 -312928
5310 -312928 -310959 -312316 -313795 -310863 -309757 -311783 -310988 -312191 -313247 -314135 -314118 -313720 -313311 -313697 -312790 -313319 -313046
5293c13046J236m783j167L368M246L346j766J564j32k027M45j813M67j390k322
5278c13774K34K594J237Q17J791L031q14n83j116J503o33j035l91j053J769L9
5262c06384q09j654j236L418K381J510J799J193l175m805M72J29N62Q0p34k034
5246c09287K97K73l447M560j396j947K727J462K375m22l464j457j212j362J913
5231c10387k006J223Q53l194K810L167N57J314L785j481j212p0l808K525J854
5216c04070M81k970k881K817L450Q65j600J24k730q77L179k131k673L960j943
5201c06999k410q87M030M906N68R60j493k076J669m467p41P2K44L043P29P32k578
5184c04698j875l642p40K654P38j650K381J163J442N376M16l948j367l575l438
$$ plain form
5293 -313046 -311810 -316593 -317760 -314392 -310146 -306800 -308566 -307002 -307134 -309161 -308716 -310529 -310062 -311452 -313774
5278 -313774 -313540 -310946 -309709 -308892 -307101 -304070 -304884 -305467 -306583 -305080 -305713 -306748 -307139 -308192 -306423 -306384
5262 -306384 -307193 -308847 -310083 -306665 -304284 -302774 -300975 -299782 -302957 -307762 -307290 -307161 -306599 -306519 -307253 -309287
5246 -309287 -308990 -308717 -312164 -307604 -309000 -310947 -308220 -306758 -304383 -304805 -308269 -309726 -310938 -312300 -310387
5231 -310387 -312393 -311170 -310317 -313511 -310701 -307534 -306977 -305663 -301878 -303359 -304571 -304641 -308449 -305924 -304070
5216 -304070 -303589 -306559 -309440 -306623 -303173 -302308 -303908 -303784 -306514 -307391 -304212 -306343 -309016 -305056 -306999
5201 -306999 -309409 -310296 -306266 -301360 -300792 -299832 -301325 -303401 -301732 -306199 -306940 -306868 -306624 -303581 -302852 -302120 -304698
5184 -304698 -306573 -310215 -310955 -308301 -307563 -309213 -306832 -305669 -304227 -298851 -298435 -302383 -303750 -307325 -310763
5169c10763O18J499J642j720K76K840K045J572l61k525J009J811k377j169K78
5154c05325M994j2k198j97k981R0K623r10n24K665Q90j752K232O33P43L745j277
5137b96561l473l406L271N91j852m358K95J639L362J163l9J23R19R09j308j10
5121b98835j980j004J950L905J294k54j216K079k301m581p72o21k309j645k309
5106c08599J773J009l04J312R44L670K477j769M67J874j593L155Q33j875J164
5091b95462l614o10l29j402Q99J403J060q45K811K838l913l054k091J760J975
5076b98574l42K735K358k14k002l892j941j472J993L596m66P5l630l951j014K443
5060c04298M063L637j761l783n33L682R67l200k518j908J321L299L070Q2L146
$$ plain form
5169 -310763 -310145 -308646 -307004 -308724 -308448 -305608 -303563 -301991 -302352 -304877 -303868 -302057 -304434 -305603 -305325
5154 -305325 -300331 -300343 -302541 -302738 -305719 -305629 -303006 -303916 -304440 -301775 -300885 -302637 -300405 -299772 -299029 -295284 -296561
5137 -296561 -300034 -303440 -300169 -299578 -301430 -305788 -305493 -303854 -300492 -299329 -299368 -299245 -298326 -297417 -298725 -298835
5121 -298835 -300815 -301819 -299869 -295964 -294670 -294924 -296140 -294061 -296362 -300943 -301715 -302336 -304645 -306290 -308599
5106 -308599 -306826 -305817 -306121 -304809 -303865 -300195 -297718 -299487 -299020 -297146 -298739 -295584 -294751 -296626 -295462
5091 -295462 -299076 -299686 -300015 -301417 -300518 -299115 -298055 -298900 -296089 -293251 -297164 -300218 -302309 -300549 -298574
5076 -298574 -298916 -296181 -293823 -294037 -296039 -299931 -301872 -303344 -301351 -297755 -298221 -298146 -301776 -305727 -306741 -304298
5060 -304298 -300235 -296598 -298359 -302142 -302675 -298993 -298026 -301226 -303744 -305652 -304331 -301032 -297962 -297880 -294734
5045b94734r50k623J163R16l89J31l529k625K096m89k95O14L565L316P20j043
5029b94156m40p10j114k128K338N042j877k70J957j231j612k316j952QQ13J922
5013b95726j66Q5j685M217k867j917j189KK280J740k398n37K300J421J974m66
4997b92932j188J939o22k601N06L051J090j649l210J697K064K094l426l579J990
4982b94776K30L12J539r67j725m6n20K739J014j481k226p96J567J762J346j124
4966b93152p06j800o1L123k372Q40k967l743K256K895J214O44J099l92k61j795
4950b95178K808J951J011m031k844L259L276J182k214j976K59m24k555R68P69
4935b93739j778k68k34N98R86K832K644k163k124P28J404M28k29K272n23N00K098
$$ plain form
5045 -294734 -295684 -298307 -297144 -296228 -296617 -296486 -300015 -302640 -300544 -301033 -301328 -300714 -297149 -293833 -293113 -294156
5029 -294156 -294596 -295306 -296420 -298548 -296210 -291168 -293045 -293315 -291358 -292589 -294201 -296517 -298469 -298461 -297648 -295726
5013 -295726 -295892 -295807 -297492 -293275 -296142 -298059 -299248 -299246 -296966 -295226 -297624 -298161 -295861 -294440 -292466 -292932
4997 -292932 -294120 -292181 -292803 -295404 -294898 -291847 -290757 -292406 -295616 -293919 -291855 -289761 -293187 -296766 -294776
4982 -294776 -294546 -294234 -292695 -293662 -295387 -295433 -295953 -293214 -292200 -293681 -295907 -296703 -295136 -293374 -292028 -293152
4966 -293152 -293858 -295658 -295719 -292596 -294968 -294128 -297095 -300838 -298582 -295687 -294473 -293829 -292730 -293122 -293383 -295178
4950 -295178 -292370 -290419 -289408 -293439 -296283 -293024 -289748 -288566 -290780 -292756 -292497 -292921 -295476 -294508 -293739
4935 -293739 -295517 -295785 -296019 -295421 -294435 -291603 -288959 -291122 -293246 -292518 -291114 -290686 -290915 -288643 -289166 -288666 -286568
4918b86568K56j550j296l26n2p29m57r82k934J536Q14J584k071K7R48j88n63l839
4900b96390O64K874M674p9l438K377K313J758P53j883k32k01J76K764K3k159l487
4883b89493j073o44J294K838L95j469L84k326R09j254P63J967k540j042P98N725
4867b84768J811o030j889L891k146k401L542K368k369l807J081M244r14k347k492
4852b92226k20K920q82j492k720K222L528K923l8M87k849R41L560k315l163p01
4836b90025K437q72m49J910L106O5l804k915K426j37j355l50K441J692K420o62
4820b84072k033J466L149j31m25N95m076k817L09J842K728k61l707j282p72q90
4804b90377J237l205k44L439K094p45P43K537J108j390j555J315J036O92k144
$$ plain form
4918 -286568 -286312 -287862 -289158 -289484 -289536 -290265 -290722 -291704 -294638 -293102 -292288 -290704 -292775 -292748 -291800 -291988 -292551 -296390
4900 -296390 -295726 -292852 -288178 -288257 -291695 -289318 -287005 -285247 -284494 -286377 -286609 -286810 -286634 -283870 -283847 -286006 -289493
4883 -289493 -290566 -291210 -289916 -287078 -286683 -288152 -287768 -290094 -289185 -290439 -289676 -287709 -290249 -291291 -290493 -284768
4867 -284768 -282957 -288987 -290876 -286985 -289131 -291532 -287990 -285622 -287991 -291798 -290717 -286473 -287387 -289734 -292226
4852 -292226 -292446 -289526 -290408 -291900 -294620 -292398 -288870 -285947 -285985 -285498 -288347 -287406 -283846 -286161 -289324 -290025
4836 -290025 -287588 -288460 -288909 -286999 -283893 -283828 -287632 -290547 -288121 -288258 -289613 -289963 -287522 -285830 -283410 -284072
4820 -284072 -286105 -284639 -281490 -281621 -282046 -281451 -285527 -288344 -288035 -286193 -283465 -283726 -287433 -288715 -289487 -290377
4804 -290377 -289140 -292345 -292589 -289150 -287056 -287801 -287058 -284521 -283413 -284803 -286358 -285043 -284007 -283315 -285459
4789b85459m03K109k465j771j448L526j038J47K503K111n0R52l997j880J045J584
4773b84534k983R8k93M325k2j857N00Q70J82j298N17K126m13j180l74j912K131
4756b84117J729M35J80m33Q62K672k781l136p31J228Q253J459K514k398j516j874
4740b77654r83q59k326k17O52o3K538K057L758k078k285k21j947M26O92J796j044
4723b77758k1j292k734J808j36o30Q98p68p28k813q13K296L773J425K344m138
4707b79287n179J082P66J873J437k367R52k495q9M694N672M11j657N6k973j979
4691b79083o27K386j100k460p64K219L088J09l358j618O79K761o75j254n91Q63
4675b79425k497j423j233K43k39J205K306J88K632k15o1K725J466j664q86m18
$$ plain form
4789 -285459 -285862 -283753 -286218 -287989 -289437 -285911 -286949 -286802 -284299 -282188 -282238 -281286 -285283 -287163 -286118 -284534
4773 -284534 -287517 -287419 -287712 -283387 -283409 -285266 -284766 -283896 -283714 -285012 -284495 -282369 -282782 -283962 -284336 -286248 -284117
4756 -284117 -282388 -281953 -281773 -282206 -281344 -278672 -281453 -284589 -285320 -284092 -275839 -274380 -271866 -274264 -275780 -277654
4740 -277654 -278637 -279496 -281822 -282039 -281387 -281450 -278912 -276855 -273097 -275175 -277460 -277681 -279628 -279202 -278510 -276714 -277758
4723 -277758 -277779 -279071 -281805 -279997 -280133 -280763 -279865 -280633 -281361 -284174 -284987 -282691 -278918 -277493 -275149 -279287
4707 -279287 -284466 -283384 -282618 -280745 -279308 -281675 -280723 -283218 -283307 -278613 -272941 -272530 -274187 -274131 -277104 -279083
4691 -279083 -279710 -277324 -278424 -280884 -281648 -279429 -276341 -276232 -279590 -281208 -280529 -277768 -278443 -279697 -280288 -279425
4675 -279425 -281922 -283345 -284578 -284335 -284574 -283369 -281063 -280875 -278243 -278458 -278519 -275794 -274328 -275992 -276878 -277296
4659b77296j110J077O85M10j916l18p2K61K685j372J846J350k883k437j382K31
4643b80241L84n09J452J159j01j055J59P83K207K53q8R3o26o11J276k248R58M912
4625b71843j749j319j104j957k47K263K133l200J717J347k178K549L408n12J2
4610b70680j802l973j283J84j01l12K522K7o36m303q82K046p69J174J493K48R42
4593b76105O97J389l67K54K30k53j89K062L17k038j622J121P00J583o37j859P30
4576b73987R76L256L625q09k027O82k749j191l368M36J009K376P65m044j561j2
4560b76623O106K850k037J34L069K192j486Q15Q2k501q78j440j821k160k25l00
4544b74223l665p33K285J155P74J947P2m373r15J435R98L217j456j800l199R31
$$ plain form
4659 -277296 -278406 -277329 -276644 -276234 -278150 -278468 -278540 -278279 -275594 -276966 -275120 -273770 -276653 -279090 -280472 -280241
4643 -280241 -279857 -280366 -278914 -277755 -277856 -278911 -278752 -277969 -275762 -275509 -275597 -275504 -276130 -276741 -275465 -277713 -276755 -271843
4625 -271843 -273592 -274911 -276015 -277972 -278219 -275956 -273823 -277023 -275306 -273959 -276137 -273588 -270180 -270692 -270680
4610 -270680 -272482 -276455 -277738 -277554 -277655 -277967 -275445 -275418 -276054 -280357 -281239 -279193 -279962 -278788 -277295 -277047 -276105
4593 -276105 -275408 -274019 -274386 -274132 -273902 -274155 -274344 -272282 -271965 -274003 -275625 -274504 -273804 -272221 -272858 -274717 -273987
4576 -273987 -273011 -269755 -266130 -266939 -268966 -268284 -271033 -272224 -275592 -275156 -274147 -271771 -271006 -275050 -276611 -276623
4560 -276623 -270517 -267667 -269704 -269570 -266501 -264309 -265795 -264980 -264898 -267399 -268277 -269717 -271538 -273698 -273923 -274223
4544 -274223 -277888 -278621 -276336 -275181 -274407 -272460 -272388 -276761 -277676 -276241 -275243 -272026 -273482 -275282 -278481 -277550
$$ [...]
##END NTUPLES=NMR SPECTRUM
##END=
