##TITLE=Analysis number 328198
Compound Code cc 00703
Book Reference lab3
Project Code adrs
Chemist Name stores
##JCAMPDX= 6.0         $$ Bruker NMR JCAMP-DX V2.0
##DATA TYPE= NMR SPECTRUM
##DATA CLASS= NTUPLES
##ORIGIN= Bruker BioSpin GmbH
##OWNER= nmr
$$ XWIN-NMR		Version 3.5
$$ Fri May 11 11:20:13 2007 GMT Daylight Time (UT+1h)  MAYBRIDGE\nmr@NMR_250MHZ
##.OBSERVE FREQUENCY= 250.131544655141
##.OBSERVE NUCLEUS= ^1H
##.ACQUISITION MODE= SIMULTANEOUS (DQD)
##.ACQUISITION SCHEME= undefined
##.AVERAGES= 16
##.DIGITISER RES= 18
##SPECTROMETER/DATA SYSTEM= dpx250
##.PULSE SEQUENCE= zg30
##.SOLVENT NAME= CDCl3
##.SHIFT REFERENCE= (INTERNAL, CDCl3, 0, 16.4278)
##AUDIT TRAIL= $$ (NUMBER, WHEN, WHO, WHERE, WHAT)
$$ ##TITLE= Audit trail, XWIN-NMR		Version 3.5
$$ ##JCAMPDX= 5.01
$$ ##ORIGIN= Bruker BioSpin GmbH
$$ ##OWNER= nmr
$$ C:\u/data/dgb/nmr/ADRS/890/pdata/1/auditp.txt
$$ ##AUDIT TRAIL=  $$ (NUMBER, WHEN, WHO, WHERE, WHAT)
(   1,<2007-05-11 11:19:44.33 +100>,<MAYBRIDGE\nmr>,<NMR_250MHZ>,
      <created by zg, POWCHK disabled, PULCHK disabled
       configuration hash MD5:
       76 6E 9A 78 1E 09 19 81 EC 84 63 8F B0 6A 59 2D
       data hash MD5: 64K
       EA C4 8D 4E FA 1A 49 18 FF 78 FF C7 8C D8 EE 2E>)
(   2,<2007-05-11 11:20:02.11 +100>,<MAYBRIDGE\nmr>,<NMR_250MHZ>,
      <Start of raw data processing
       ef LB = 0.3 FT_mod = 6 PKNL = 1 SI = 32K 
       data hash MD5: 32K
       EB 54 A6 32 91 2C 12 D3 B1 F8 27 FD 66 BE CC 18>)
(   3,<2007-05-11 11:20:04.05 +100>,<MAYBRIDGE\nmr>,<NMR_250MHZ>,
      <apk 
       data hash MD5: 32K
       A9 F1 63 DE 3B C1 F0 41 BC A6 4C 70 38 21 5D 52>)
(   4,<2007-05-11 11:20:04.74 +100>,<MAYBRIDGE\nmr>,<NMR_250MHZ>,
      <abs ABSG = 5 
       data hash MD5: 32K
       3E 02 9F 9B 03 24 F7 10 37 A0 01 C6 F0 E0 9F 33>)
$$ ##END=
$$ 
$$ hash MD5
$$ 20 6E 4C 6E D8 13 4B 90 A9 21 E3 FA 61 B9 8F 30
##$RELAX= 
##$RELAX= 
##$RELAX= 
##$RELAX= 
##$RELAX= 
##$RELAX= 
##$RELAX= 
$$ Bruker specific parameters
$$ --------------------------
##$DU= <C:\u>
##$EXPNO= 890
##$NAME= <ADRS>
##$PROCNO= 1
##$TYPE= <nmr>
##$USER= <dgb>
##$AMP= (0..31)
100 100 100 100 100 100 100 100 100 100 100 100 100 100 100 100 100 100 
100 100 100 100 100 100 100 100 100 100 100 100 100 100 
##$AQSEQ= 0
##$AQ_mod= 3
##$AUNM= <au_zg>
##$AUTOPOS= <13 >
##$BF1= 250.13
##$BF2= 250.13
##$BF3= 250.13
##$BF4= 250.13
##$BF5= 500.13
##$BF6= 500.13
##$BF7= 500.13
##$BF8= 500.13
##$BYTORDA= 1
##$CFDGTYP= 0
##$CFRGTYP= 5
##$CHEMSTR= <none>
##$CNST= (0..31)
1 1 145 1 1 1 1 1 1 1 1 1 1 1 1 1 1 1 1 1 1 1 1 1 1 1 1 1 1 1 1 1 
##$CPDPRG= <>
##$CPDPRG1= <>
##$CPDPRG2= <>
##$CPDPRG3= <>
##$CPDPRG4= <mlev>
##$CPDPRG5= <mlev>
##$CPDPRG6= <mlev>
##$CPDPRG7= <mlev>
##$CPDPRG8= <mlev>
##$CPDPRGB= <>
##$CPDPRGT= <>
##$D= (0..31)
0 1 0 0 0 0 0 0 0 0.06 0 0 0 0 0 0 0.0002 0 0 0 0 0 0 0 0 0 0 0 0 0 0 
0 
##$DATE= 1178878783
##$DBL= (0..7)
120 120 120 120 120 120 120 120 
##$DBP= (0..7)
150 150 150 150 150 150 150 150 
##$DBP07= 0
##$DBPNAM0= <>
##$DBPNAM1= <>
$$ [...]
##$SUBNAM7= <"">
##$SUBNAM8= <"">
##$SUBNAM9= <"">
##$SW= 20.6930455092707
##$SWIBOX= (0..15)
0 0 3 0 0 0 0 0 0 0 0 0 0 0 0 0 
##$SW_h= 5175.983436853
##$TD= 65536
##$TD0= 1
##$TE= 683.16
##$TE2= 300
##$TE3= 300
##$TEG= 300
##$TL= (0..7)
0 120 120 120 120 120 120 120 
##$TP= (0..7)
150 150 150 150 150 150 150 150 
##$TP07= 0
##$TPNAME0= <>
##$TPNAME1= <>
##$TPNAME2= <>
##$TPNAME3= <>
##$TPNAME4= <>
##$TPNAME5= <>
##$TPNAME6= <>
##$TPNAME7= <>
##$TPOAL= (0..7)
0.5 0.5 0.5 0.5 0.5 0.5 0.5 0.5 
##$TPOFFS= (0..7)
0 0 0 0 0 0 0 0 
##$TUNHIN= 0
##$TUNHOUT= 0
##$TUNXOUT= 0
##$USERA1= <user>
##$USERA2= <user>
##$USERA3= <user>
##$USERA4= <user>
##$USERA5= <user>
##$V9= 5
##$VALIST= <valist>
##$VCLIST= <CCCCCCCCCCCCCCC>
##$VD= 0
##$VDLIST= <DDDDDDDDDDDDDDD>
##$VPLIST= <PPPPPPPPPPPPPPP>
##$VTLIST= <TTTTTTTTTTTTTTT>
##$WBST= 1024
##$WBSW= 4
##$XGAIN= (0..3)
0 0 0 0 
##$XL= 0
##$YL= 0
##$YMAX_a= 457808
##$YMIN_a= -472324
##$ZGOPTNS= <>
##$ZL1= 120
##$ZL2= 120
##$ZL3= 120
##$ZL4= 120
##$ABSF1= 16.42783
##$ABSF2= -4.265341
##$ABSG= 5
##$ABSL= 3
##$ALPHA= 0
##$AQORDER= 0
##$ASSFAC= 0
##$ASSFACI= 0
##$ASSFACX= 0
##$ASSWID= 0
##$AUNMP= <proc_1d>
##$AZFE= 0.1
##$AZFW= 0.1
##$BCFW= 0
##$BC_mod= 0
##$BYTORDP= 0
##$COROFFS= 0
##$CY= 12.5
##$DATMOD= 1
##$DC= 0
##$DFILT= <>
##$DTYPP= 0
##$F1P= 14.0000005364418
##$F2P= -0.99999901652339
##$FCOR= 0.5
##$FTSIZE= 32768
##$FT_mod= 6
##$GAMMA= 0
##$GB= 0
##$INTBC= 1
##$INTSCL= 1
##$ISEN= 128
##$LB= 0.3
##$LEV0= 0
##$LPBIN= 0
##$MAXI= 10000
##$MC2= 0
##$MEAN= 0
##$ME_mod= 0
##$MI= 0
##$NCOEF= 0
##$NC_proc= -2
##$NLEV= 6
##$NOISF1= 0
##$NOISF2= 0
##$NSP= 0
##$NTH_PI= 0
##$NZP= 0
##$OFFSET= 16.42783
##$PC= 1
##$PHC0= -60.36818
##$PHC1= 14.37994
##$PH_mod= 1
##$PKNL= yes
##$PPARMOD= 0
##$PSCAL= 4
##$PSIGN= 0
##$REVERSE= no
##$SF= 250.130023552514
##$SI= 32768
##$SIGF1= 0
##$SIGF2= 0
##$SINO= 400
##$SIOLD= 32768
##$SREGLST= <1H.CDCl3>
##$SSB= 0
##$STSI= 32768
##$STSR= 0
##$SW_p= 5175.98343685301
##$SYMM= 0
##$S_DEV= 0
##$TDeff= 65536
##$TDoff= 0
##$TI= <Analysis number 999999
Compound Code 99
Book Reference 9
Project Code 9>
##$TILT= no
##$TM1= 0
##$TM2= 0
##$TOPLEV= 0
##$USERP1= <user>
##$USERP2= <user>
##$USERP3= <user>
##$USERP4= <user>
##$USERP5= <user>
##$WDW= 1
##$XDIM= 32768
##$YMAX_p= 399448604
##$YMIN_p= -156995
$$ End of Bruker specific parameters
$$ ---------------------------------
##NTUPLES= NMR SPECTRUM
##VAR_NAME=  FREQUENCY,     SPECTRUM/REAL,   SPECTRUM/IMAG
##SYMBOL=    X,             R,               I
##VAR_TYPE=  INDEPENDENT,   DEPENDENT,       DEPENDENT
##VAR_FORM=  AFFN,          ASDF,            ASDF
##VAR_DIM=   32768,         32768,           32768
##UNITS=     HZ,            ARBITRARY UNITS, ARBITRARY UNITS
##FACTOR=    0.157963299565203, 1,           1
##FIRST=     4109.09344039112, 0,            0
##LAST=      -1066.88999646189, 0,           0
##MIN=       -1066.88999646189, -156995,     0
##MAX=       4109.09344039112, 399448604,    0
$$ Real data points
##PAGE= N=1
##DATA TABLE= (X++(R..R)), XYDATA
$$ [...]
$$ plain form
17554 28755 20614 23729 30625 38874 64137 95613 104628 77642 55455 26494 -5782 -16769 -16824
17541 -16824 -19992 -24229 -23165 -8206 4239 3250 5847 14270 11961 18775 11255 -4085 -12256 -14540
17527 -14540 -28739 -31022 -33019 -40911 -42898 -42188 -41015 -41898 -43027 -40947 -41098 -31134 -24414 -25505 -24534
17512 -24534 -28558 -32260 -40859 -37258 -37956 -28785 -24077 -19957 -10880 -4127 1199 19877 24162 38491
17498 38491 44789 39138 41445 38079 27880 16699 14378 9642 5003 869 -8460 -8168 -2364 -2122
17484 -2122 206 -11832 -16975 -9231 2172 -725 -6776 -11753 -12050 -12692 -13289 -20893 -17385 -17517 -23162
17469 -23162 -24401 -16517 -15647 -15368 -19816 -30925 -37020 -29808 -23327 -26223 -23981 -18316 -24644 -30172 -36731
17454 -36731 -44598 -48318 -43618 -32717 -24656 -21304 -30448 -30274 -26843 -22589 -13717 16570 67357 94756
$$ packed form
17554B8755q141L115O896Q249K5263L1476R015k6986k2187k8961l2276j0987n5
17541a6824l168m237J064J4959J2445r89K597Q423k309O814p520j5340q171k284
17527a4540j4199k283j997p892j987P10J173q83j129K080j51R964O720j091R71
17512b4534m024l702q599L601o98R171M708M120R077O753N326J8678M285J4329
17498C8491O298n651K307l366j0199j1181k321m736m639m134r329K92N804K42
17484b122K328j2038n143P744J1403k897o051m977k97o42n97p604L508j32n645
17469b3162j239P884Q70K79m448j1109o095P212O481k896K242N665o328n528o559
17454c6731p867l720M700J0901Q061L352r144J74L431M254Q872L0287N0787K7399
$$ plain form
17440 94756 63020 22599 -8389 -19760 -16287 -13947 -13125 -16419 -5718 -12004 -18283 -18195 -27093 -35149
17426 -35149 -39594 -38061 -34849 -42273 -44576 -55030 -55174 -52847 -59465 -53599 -43705 -43776 -43989 -36443 -27079
17411 -27079 -20988 -25494 -30530 -33935 -26540 -27845 -28610 -32728 -33566 -35347 -36615 -33097 -26054 -22939 -28625
17396 -28625 -35341 -38190 -32547 -27267 -13751 -12467 -9853 4648 7194 9605 14279 7331 2335 6581
17382 6581 11687 14395 21974 21368 19590 16700 822 63 7228 19905 33645 45283 42546 41672
17368 41672 43736 43929 48351 50327 43070 40427 29244 31398 44317 48299 48207 42294 39334 40343 43276
17353 43276 54042 67737 90389 109444 126998 151544 175282 203766 241403 276291 312883 359704
17341 359704 398837 416321 428548 433152 429467 420293 418222 440164 438226 425684 405813 356487
$$ packed form
17440I4756l1736m0421l0988j1371L473K340Q22l294J0701o286o279Q8q898q056
17426c5149m445J533L212p424k303j0454j44K327o618N866R894p1k13P546R364
17411b7079O091m506n036l405P395j305p65m118q38j781j268L518P043L115n686
17396b8625o716k849N643N280J3516J284K614J4501K546K411M674o948m996M246
17382F581N106K708P579o06j778k890j5878p59P165J2677J3740J1638k737q74
17368D1672K064J93M422J976p257k643j1183K154J2919L982r2n913k960J009K933
17353D3276J0766J3695K2652J9055J7554K4546K3738K8484L7637L4888L6592M6821
17341C59704L9133J7484J2227M604l685r174k071K1942j938j2542j9871m9326
$$ plain form
17329 356487 312730 273863 238183 205715 170523 147667 120095 91197 72263 54752 50760 36425
17317 36425 16981 6421 9862 19958 27973 26606 23548 14222 10851 9246 -222 1291 -226 3483
17303 3483 -2477 -8758 2335 5594 2639 -2842 -1013 -1853 762 -8862 -14613 -14551 -18314 -21147 -21114 -13875
17287 -13875 -11147 -7916 -3519 -3657 -5718 -11593 -17626 -21607 -33517 -32897 -34114 -33832 -31390 -32312 -32904
17272 -32904 -33310 -28847 -30668 -33858 -33403 -33193 -37271 -37370 -36187 -34963 -38324 -39193 -40628 -38254 -34274 -29222
17256 -29222 -17429 -11245 -22237 -26621 -19826 -9021 -11867 -11858 -9497 -16785 -14288 -16770 -13804 -6913
17242 -6913 -1008 -11418 -20085 -23292 -21758 -13619 -19653 -31786 -34424 -36430 -34940 -22850 -17131 -15491
17228 -15491 -16857 -15203 -18420 -27782 -31417 -43118 -41466 -44591 -46982 -38858 -26357 -31457 -39562 -34089
$$ packed form
17329C56487m3757l8867l5680l2468l5192k2856k7572k8898j8934j7511l992j4335
17317C6425j9444j0560L441J0096Q015j367l058r326l371j605r468J513j517L709
17303C483n960o281J1093L259k955n481J829q40K615r624n751O2l763k833L3P239
17287a3875K728L231M397j38k061n875o033l981j1910O20j217K82K442r22n92
17272c2904m06M463j821l190M55K10m078r9J183J224l361q69j435K374L980N052
17256b9222J1793O184j0992m384O795J0805k846RK361p288K497k482K966O891
17242f913N905j0410q667l207J534Q139o034j2133k638k006J490J2090N719J640
17228a5491j366J654l217r362l635j1701J652l125k391Q124J2501n100q105N473
$$ plain form
17214 -34089 -25089 -29041 -34720 -32551 -31521 -31554 -33421 -22121 -27372 -25840 -22908 -22163 -21432 -19174 -12076
17199 -12076 -9092 -7070 -12494 -715 28214 63919 86599 117089 140830 151249 145962 154527 162718
17186 162718 144577 121498 104797 91616 91988 71731 37713 22018 20283 28250 22055 2236
17174 2236 -3123 -3819 -5242 -6234 -4841 3098 2199 1668 4028 11338 19040 26059 31902 42465 48727
17159 48727 46842 42801 32000 26927 34039 43893 55671 62601 77602 92490 104875 94521 87326
17146 87326 80880 85046 105285 148802 204848 241471 212241 187887 206438 240972 232836 191983
17134 191983 168128 174594 211068 240515 216257 174103 172726 209424 206360 140592 80323 45595
17122 45595 25258 17372 11597 12316 14351 13983 25642 43633 61941 70058 68737 54039 34603
$$ packed form
17214c4089R000l952n679K169J030l3j867J1300n251J532K932P45P31K258P098
17199a2076K984K022n424J1779K8929L5705K2680L0490K3741J0419n287Q565Q191
17186A62718j8141k3079j6701j3181L72k0257l4018j5695j735P967o195j9819
17174B236n359o96j423r92J393P939q99n31K360P310P702P019N843J0563O262
17159D8727j885m041j0801n073P112R854J1778O930J5001J4888J2385j0354p195
17146H7326o446M166K0239M3517N6046L6623k9230k4354J8551L4534q136m0853
17134A91983k3855O466L6474K9447k4258m2154j377L6698l064o5768o0269l4728
17122D5595k0337p886n775P19K035l68J1659J7991J8308Q117j321j4698j9436
$$ plain form
17109 34603 14096 -700 -15429 -21076 -21931 -13628 -8202 -4963 -9625 -20198 -30331 -29985 -27966 -29680
17095 -29680 -27153 -22734 -27547 -38008 -46364 -41732 -40408 -32863 -29342 -26141 -18698 -22743 -17310 -17161
17081 -17161 -23450 -29318 -24530 -10906 -8872 -18343 -24417 -27454 -21937 -12890 -4956 -14563 -26487 -33583
17067 -33583 -25179 -19188 -22081 -27452 -42127 -46354 -34705 -24456 -21642 -8174 -14806 -26575 -24979
17054 -24979 -32696 -35579 -29757 -24520 -26090 -27145 -22672 -14796 -14583 -22748 -30174 -34012 -26729 -21441 -17122
17039 -17122 -9026 -15037 -26152 -31428 -29403 -36214 -35697 -38886 -30576 -19711 -22247 -22852 -18822 -19324 -25640
17024 -25640 -25626 -27693 -27334 -23087 -21005 -17174 -27478 -34951 -39727 -37788 -35038 -38650 -31551 -27482 -29249
17009 -29249 -24614 -19445 -17584 -20273 -24558 -26304 -25230 -20551 -24832 -24509 -25326 -23237 -25575 -32358 -31708
$$ packed form
17109C4603k0507j4796j4729n647q55Q303N426L239m662j0573j0133L46K019j714
17095b9680K527M419m813j0461q356M632J324P545L521L201P443m045N433J49
17081a7161o289n868M788J3624K034r471o074l037N517R047P934r607j1924p096
17067c3583Q404N991k893n371j4675m227J1649J0249K814J3468o632j1769J596
17054b4979p717k883N822N237j570j055M473P876K13q165p426l838P283N288M319
17039a7122Q096o011j1115n276K025o811N17l189Q310J0865k536o05M030n02o316
17024b5640J4k067L59M247K082L831j0304p473m776J939K750l612P099M069j767
17009b9249M635N169J861k689m285j746J074M679m281L23q17K089k338o783O50
$$ plain form
16994 -31708 -35708 -26191 -10867 -1868 -3716 -9340 -15072 -19798 -12516 -3917 10029 11746 -3963 -11271
16980 -11271 -8282 -4528 -4735 -10706 -15728 -25336 -27103 -23427 -16708 -16981 -21117 -19316 -24625 -23555 -28439
16965 -28439 -32549 -37122 -41856 -35985 -21577 -19716 -28255 -30134 -23689 -22733 -26725 -23189 -20983 -27778
16951 -27778 -22719 -27456 -38068 -33291 -22712 -22049 -15964 -15577 -16332 -11927 -758 -8973 -13827 -19014
16937 -19014 -21764 -23691 -23499 -23269 -19633 -18522 -19297 -15436 -22445 -34499 -34108 -29517 -34445 -30064 -22635
16922 -22635 -27670 -22024 -9700 -2518 -8562 -16591 -11528 -12554 -16002 -20436 -28513 -25847 -23934 -13003
16908 -13003 -3682 -10138 -20727 -21591 -24112 -27981 -23380 -13454 -8512 -8153 -12470 -22096 -30501 -23664 -13338
16893 -13338 -6955 -10959 -18701 -19633 -13216 -20065 -28051 -32829 -38408 -43030 -47877 -40933 -29570 -30767
$$ packed form
16994c1708m000R517J5324Q999j848n624n732m726P282Q599J3946J717j5709p308
16980a1271K989L754k07n971n022r608j767L676O719k73m136J801n309J070m884
16965b8439m110m573m734N871J4408J861q539j879O445R56l992L536K206o795
16951b7778N059m737j0612M777J0579O63O085L87p55M405J1169q215m854n187
16937a9014k750j927J92K30L636J111p75L861p009j2054L91M591m928M381P429
16922b2635n035N646J2324P182o044q029N063j026l448m434q077K666J913J0931
16908a3003R321o456j0589q64k521l869M601R926M942L59m317r626q405O837J0326
16893a3338O383m004p742r32O417o849p986m778n579m622m847O944J1363j197
$$ plain form
16879 -30767 -26048 -16077 -8683 -6839 -10997 -6093 -7383 -10315 -14234 -30693 -32534 -32872 -29119 -17708
16865 -17708 -12983 -15369 -15692 -15199 -11645 -20582 -26663 -28315 -29513 -30129 -31401 -22465 -21193 -13262 -7416
16850 -7416 -2005 6433 4729 4152 4996 12276 8110 4499 6054 298 11941 17357 13243 10180 14833
16835 14833 17638 13588 3867 2351 196 -7166 -17573 -19367 -17033 -13725 -11205 -22012 -14233 -8365
16821 -8365 -5037 -4807 4138 15007 27618 19183 11605 24378 30814 29146 24484 17554 6689 2249
16807 2249 -3269 -10977 -19057 -21122 -21896 -23502 -11912 -10306 -17867 -27487 -25323 -24125 -26019 -17263 -13837
16792 -13837 -20934 -19956 -11208 -7795 -24 2072 -8749 -20416 -18428 -271 12665 8749 -7966
16779 -7966 -21061 -32297 -33458 -27345 -27956 -21972 -10636 -6036 -3735 -9091 -16791 -20687 -22722 -21396
$$ packed form
16879c0767M719R971P394J844m158M904j290k932l919j6459j841l38L753J1411
16865a7708M725k386l23M93L554q937o081j652j198o16j272Q936J272P931N846
16850g416N411Q438j704n77Q44P280m166l611J555n756J1643N416m114l063M653
16835A4833K805m050r721j516k155p362j0407j794K334L308K520j0807P779N868
16821h365L328K30Q945J0869J2611q435p578J2773O436j668m662o930j0865m440
16807B249n518p708q080k065p74j606J1590J606p561r620K164J198j894Q756L426
16792a3837p097R78Q748L413P771K096j0821j1667J988J8157J2936l916j6715
16779g966j3095j1236j161O113o11N984J1336M600K301n356p700l896k035J326
$$ plain form
16765 -21396 -30664 -30127 -24644 -16020 -14560 -13867 -15764 -11720 -3263 -178 -7959 -16350 -10795 -9217 -11997
16750 -11997 -17956 -21633 -26408 -24449 -23117 -22112 -21657 -27976 -25644 -20441 -18743 -22175 -22925 -23401 -24792
16735 -24792 -19808 -12229 -14798 -21063 -20383 -17690 -11877 -12177 -21133 -18525 -19266 -18888 -23347 -22880 -20997 -21944
16719 -21944 -16012 -13689 -10411 -6093 6892 13630 13104 6015 12536 14681 10402 -4693 -9837 -14096
16705 -14096 -12685 -15593 -13886 -12785 -10102 -14053 -13876 -3378 -2925 -4926 -1438 15198 36185 55530
16691 55530 83323 116955 136931 129940 115377 112246 111036 112091 90606 62605 26810 7774
16679 7774 8296 8222 11373 16997 13197 9598 5033 6921 5350 5752 5068 1309 -11140 -20075 -24804 -24962
16663 -24962 -15347 -9325 -16607 -12746 -9913 -10873 -13945 -13409 -10658 -7165 -12544 -14523 -17107 -24088 -29735
$$ packed form
16765b1396r268N37N483Q624J460O93j897M044Q457L085p781q391N555J578k780
16750a1997n959l677m775J959J332J005M55o319K332N203J698l432p50m76j391
16735b4792M984P579k569o265O80K693N813l00q956K608p41L78m459M67J883r47
16719b1944N932K323L278M318J2985O738n26p089O521K145m279j5095n144m259
16705a4096J411k908J707J101K683l951J77J0498M53k001L488J6636K0987J9345
16691E5530K7793L3632J9976o991j4563l131j210J055k1485k8001l5795j9036
16679G774N22p4L151N624l800l599m565J888j571M02o84l759j2449q935m729j58
16663b4962R615O022p282L861K833r60l072N36K751L493n379j979k584o981n647
$$ plain form
16648 -29735 -13827 -14269 -20845 -14397 -11191 -18261 -20336 -12333 -7122 -1359 -6867 -13184 -10851 -3930
16634 -3930 93 -7186 -16495 -9078 -5576 -9327 -13313 -8337 -16150 -28874 -28597 -18710 -15364 -12597 -8492
16619 -8492 -10078 -7172 7255 2457 -10306 -15195 -11870 -10053 -6774 -9303 -9888 -14548 -19856 -17671
16605 -17671 -18261 -22355 -15081 -12097 -13526 -10009 -15240 -22877 -22410 -26192 -27695 -14660 -6301 -8663 -10914
16590 -10914 -14913 -16168 -10183 -15303 -14563 690 -155 -9638 -16751 -16468 -15683 -20337 -13035 -6223 -10130
16575 -10130 -14190 -12051 -12624 -19487 -19848 -18776 -18572 -15211 -12642 -1546 2596 -4727 -3573 -6261 -7199
16560 -7199 -2356 -7268 -4363 -10589 -8350 -1897 -14509 -19939 -19288 -20620 -16382 -20671 -29637 -31734 -28212
16545 -28212 -15739 -13754 -12140 -9042 -11186 -24524 -35926 -23694 -2956 847 -7831 -19960 -28171
$$ packed form
16648b9735J5908m42o576O448L206p070k075Q003N211N763n508o317K333O921
16634c930M023p279r309P417L502l751l986M976p813j2724K77R887L346K767M105
16619h492j586K906J4427m798j2763m889L325J817L279k529n85m660n308K185
16605a7671n90m094P274K984j429L517n231p637M67l782j503J3035Q359k362k251
16590a0914l999j255N985n120P40J5253q45r483p113K83P85m654P302O812l907
16575a0130m060K139n73o863l61J072K04L361K569J1096M142p323J154k688r38
16560g199M843m912K905o226K239O453j2612n430O51j332M238m289q966k097L522
16545b8212J2473J985J614L098k144j3338j1402J2232K0738L803q678j2129q211
$$ plain form
16532 -28171 -28546 -25422 -13949 -12604 -12200 -11196 -14946 -15995 -11012 -8266 -5173 -2973 -11195 -15814 -7514
16517 -7514 2451 -6749 -11561 -17085 -19255 -21410 -21206 -22642 -24547 -15514 -10449 -19870 -24946 -16168 -14934
16502 -14934 -17769 -16124 -15840 -23243 -21822 -29036 -23895 -17524 -7719 -328 -1178 -10680 -20282 -18453 -21445
16487 -21445 -23502 -22664 -18463 -16016 -17131 -16558 -12793 -14503 -19713 -19621 -21029 -23257 -18592 -19283 -25307 -24194
16471 -24194 -29895 -26477 -18682 -18485 -17149 -14078 -14600 -6280 -1411 -8607 -16570 -17936 -17526 -17139 -15913
16456 -15913 -14702 -14726 -24556 -26858 -26818 -34247 -28826 -19325 -8745 -12199 -23938 -22171 -24032 -21334 -24098
16441 -24098 -15382 -13390 -6967 -8352 -11709 -14685 -18393 -16115 -11015 -20291 -18202 -14085 -20704 -20629 -11282
16426 -11282 -3617 -3874 -10767 -6927 -6265 -9033 -5723 -6154 -14217 -15851 -19440 -25008 -27970 -30904 -14381
$$ packed form
16532b8171l75L124J1473J345M04J004l750j049M983K746L093K200q222m619Q300
16517g514R965r200m812n524k170k155K04j436j905R033N065r421n076Q778J234
16502a4934k835J645K84p403J421p214N141O371R805P391q50r502r602J829k992
16487b1445k057Q38M201K447j115N73L765j710n210R2j408k228M665o91o024J113
16471b4194n701L418P795J97J336L071n22Q320M869p196p963j366M10L87J226
16456a5913J211k4r830k302M0p429N421R501J0580l454j1739J767j861K698k764
16441b4098Q716J992O423j385l357k976l708K278N100r276K089M117o619P5R347
16426a1282P665k57o893L840O62k768L310m31q063j634l589n568k962k934J6523
$$ plain form
16411 -14381 3735 3498 -8262 -8721 -16030 -29066 -30869 -21759 -11272 -16350 -17604 -11005 -4321 -4283
16397 -4283 -1603 -9945 -15996 -21111 -23603 -21981 -26117 -20171 -16522 -18725 -12032 -15107 -14253 -10628 -6871
16382 -6871 -10556 -11337 -651 -143 5946 6389 -751 -4609 -10673 -4863 -2845 -11834 -10568 -12130 -13244
16367 -13244 -19876 -22357 -26423 -23051 -13805 -14608 -14955 -19277 -17991 -10611 -21006 -27329 -19720 -14362 -15798
16352 -15798 -9607 -14088 -17946 -18395 -17903 -6019 -9753 -24788 -25422 -18390 -20043 -25529 -22905 -9328
16338 -9328 -1424 -8466 -18754 -19642 -25528 -20865 -20697 -22870 -29135 -26358 -20913 -19804 -17461 -18922 -28424
16323 -28424 -29200 -16190 -1401 9957 5623 548 -5637 -13110 -14033 -12371 -13969 -16915 -14973 -10696
16309 -10696 -2663 -3646 -9389 -19435 -17530 -20754 -23671 -24664 -23933 -21251 -20376 -17604 -3336 7770 4263
$$ packed form
16411a4381J8116k37j1760m59p309j3036j803R110J0487n078j254O599O684L8
16397d283K680q342o051n115k492J622m136N946L649k203O693l075Q54L625L757
16382f871l685p81J0686N08O089M43p140l858o064N810K018q989J266j562j114
16367a3244o632k481m066L372R246q03l47m322J286P380j0395o323P609N358j436
16352a5798O191m481l858m49M92J1884l734j5035o34P032j653n486K624J3577
16338i328P904p042j0288q88n886M663J68k173o265K777N445J109K343j461r502
16323b8424p76J3010J4789J1358m334n075o185p473r23J662j598k946J942M277
16309a0696Q033r83n743j0046J905l224k917r93P31K682Q75K772J4268J1106l507
$$ plain form
16294 4263 1918 616 -9763 -18708 -13812 -21558 -20706 -6032 520 5169 -5858 -19335 -28517 -33854
16280 -33854 -35543 -32744 -25751 -21081 -20792 -24530 -13068 -10163 -16614 -14544 -12604 -5017 -7541 -16717
16266 -16717 -11557 -11595 -5640 -2705 3400 6684 -4974 -15783 -18434 -20129 -27704 -13640 -5520 -6792
16252 -6792 -8597 -12968 -14344 -21806 -31761 -27702 -15249 -16932 -19627 -17800 -19951 -16370 -14242 -14423 -10284
16237 -10284 -8054 -12428 -10781 -8085 -13738 -10548 -9504 -11064 -20911 -14092 -6166 -5848 -10834 -8797 -9436
16222 -9436 -11887 -10384 -5469 -2989 -11973 -9478 -3487 -4677 -7332 -15515 -13001 -8208 -4790 -11893 -18335
16207 -18335 -17971 -14714 -16967 -17582 -25690 -31654 -24620 -6457 -3293 -7158 -21245 -24802 -18257 -7627
16193 -7627 2445 3995 970 -1958 3621 5296 1214 -13396 -25315 -19777 -19411 -15402 -13911 -6740
$$ packed form
16294D263k345j302j0379q945M896p746Q52J4674O552M649j1027j3477r182n337
16280c3854j689K799O993M670K89l738J1462K905o451K070J940P587k524r176
16266a6717N160l8N955K935O105L284j1658j0809k651j695p575J4064Q120j272
16252f792j805m371j376p462r955M059J2453j683k695J827k151L581K128j81M139
16237a0284K230m374J647K696n653L190J044j560r847O819P926L18m986K037o39
16222i436k451J503M915K480q984K495N991j190k655q183K514M793L418p103o442
16207a8335L64L257k253o15q108n964P034J8163L164l865j4087l557O545J0630
16193g627J0072J550l025k928N579J675m082j4610j1919N538L66M009J491P171
$$ plain form
16179 -6740 -7081 -8570 -16145 -12431 -10904 -6714 -2179 2525 -3628 -13417 -12771 -12669 -13084 -10956 -368
16164 -368 2460 -722 -9486 -12981 -9365 -5154 -3812 -9815 -12703 -23442 -28514 -25471 -30849 -29034 -27758
16149 -27758 -27159 -16201 -12906 -13957 -12739 -16053 -32519 -34149 -24497 -11883 -2572 -3443 -6958 -19863
16135 -19863 -25556 -17533 -13695 -12754 -12571 -12414 -11017 -6489 -10802 -16933 -17795 -17480 -10628 -10618 -9778 -6728
16119 -6728 -14835 -15026 -6941 -9526 -10443 -26911 -30462 -31475 -27198 -21806 -11324 -2982 2810 -2697 -7301
16104 -7301 -14111 -15997 -13905 -15222 -23626 -25922 -26052 -30022 -31296 -30404 -31423 -22274 -13040 -18642 -10682
16089 -10682 2504 3565 -6200 -10888 -17837 -17943 -11681 -10171 -7503 -7886 -16496 -14853 -5568 -619 3065
16074 3065 6172 3435 2247 -4135 -7914 -12801 -19255 -14078 -12296 -16335 -1991 4336 2968 501
$$ packed form
16179f740l41j489p575L714J527M190M535M704o153r789O46J02m15K128J0588
16164c68K828l182q764l495L616M211J342o003k888j0739n072L043n378J815J276
16149b7758N99J0958L295j051J218l314j6466j630R652J2614R311q71l515j2905
16135a9863n693Q023L838R41J83J57J397M528m313o131q62L15O852J0Q40L050
16119f728q107j91Q085k585r17j6468l551j013M277N392J0482Q342N792n507m604
16104g301o810j886K092j317q404k296j30l970j274Q92j019R149R234n602P960
16089a0682J3186J061r765m688o949j06O262J510K668l83q610J643R285M949L684
16074C065L107k737j188o382l779m887o454N177J782m039J4344O327j368k467
$$ plain form
16060 501 -2415 -9047 -11646 -16515 -28477 -27312 -29783 -35218 -27712 -22534 -11702 -14996 -7852 -10298
16046 -10298 -11869 -5646 -9147 -8578 -9476 -10648 -11168 -3607 -7321 -17038 -18937 -13628 -16838 -10033 631
16031 631 1994 5177 6638 -5708 -13818 -21111 -25443 -21451 -20052 -19944 -10199 -13048 -18791 -16175 -10456
16016 -10456 -8132 -12115 -10725 -14160 -13423 -15844 -14439 -11049 -2392 -8241 -14686 -19176 -16349 -13490 -4739
16001 -4739 -8249 -9626 -9188 -14625 -12032 -2295 5327 6170 -390 -5289 -485 -3967 7944 10221 -4116
15986 -4116 -11394 -14018 -16027 -19679 -21197 -13508 -13865 -15224 -20614 -23839 -20185 -16050 -16043 -13138 -10640 -9377
15970 -9377 -5729 -3462 6653 8105 2042 -1532 -12812 -20502 -19993 -8952 -1545 -1860 518 -6455
15956 -6455 -23441 -23610 -19336 -15800 -4994 -11942 -17078 -19044 -13962 -13402 -11402 -22731 -24742 -24070 -24033
$$ packed form
16060E01k916o632k599m869j1962J165k471n435P506N178J0832l294P144k446
16046a0298j571O223l501N69q98j172n20P561l714r717j899N309l210O805J0664
16031F31J363L183J461j2346q110p293m332L992J399J08R745k849n743K616N719
16016a0456K324l983J390l435P37k421J405L390Q657n849o445m490K827K859Q751
16001d739l510j377M38n437K593R737P622Q43o560m899M804l482J1911K277j4337
15986d116p278k624k009l652j518P689l57j359n390l225L654M135PK905K498J263
15970i377L648K267J0115J452o063l574j1280p690N09J1041P407l15K378o973
15956f455j6986j69M274L536J0806o948n136j966N082N60K000j1329k011O72L7
$$ plain form
15941 -24033 -27011 -21151 -22339 -25794 -23327 -11145 -3617 3599 1027 -3872 1959 -6238 -13006 -15740
15927 -15740 -23550 -19020 -13981 -8238 -1356 6456 4666 9725 10247 8153 -471 -10609 -15464 -14564 -7923
15912 -7923 -3903 5497 -8537 -20653 -26764 -26603 -15161 -7711 -3599 -6148 -12019 -6313 -9673 -9222
15898 -9222 -6085 -2511 2514 5839 -5687 -3609 -3899 -10550 -13510 -4764 -2806 -6128 -3728 -12144 -16508
15883 -16508 -13287 -9302 -7433 -8674 -9385 -1106 -751 -3769 -1284 -8019 -14369 -8606 -3512 -8364 -8741
15868 -8741 -11062 -8431 -1049 1866 3309 -1379 6088 4662 -3159 719 -5141 -11662 -21380 -16794 -9081
15853 -9081 -6478 -14767 -17629 -17401 -22741 -20112 -23230 -21043 -8768 5001 1530 -5393 3629 10122
15839 10122 10739 4850 4507 -289 -16038 -12076 -2570 -3180 -8367 -19603 -25111 -22377 -20462 -14767 -13755
$$ packed form
15941b4033k978N860j188l455K467J2182P528P216k572m899N831q197o768k734
15927a5740p810M530N039N743O882P812j790N059N22k094q624j0138m855R00O641
15912g923M020R400j4034j2116o111J61J1442P450M112k549n871N706l360M51
15898i222L137L574N025L325j1526K078k90o651k960Q746J958l322K400q416m364
15883a6508L221L985J869j241p11Q279L55l018K485o735o350N763N094m852l77
15868h741k321K631P382K915J443m688P467j426p821L878n860o521r718M586P713
15853i081K603q289k862K28n340K629l118K187J2275J3769l471o923R022O493
15839A0122O17n889l43m796j5749L962R506o10n187j1236n508K734J915N695J012
$$ plain form
15824 -13755 -17206 -18858 -13224 -8654 -5269 -6557 -7858 -2329 -10198 -8122 -1494 -7649 -14253 -6049
15810 -6049 -4987 -9427 -10996 -14240 -15178 -7316 1174 3276 -86 2256 9067 7264 -3579 -4405 -1253
15795 -1253 5306 5702 5658 4894 6958 8676 1417 -10997 -9682 -15742 -13037 -11889 -9821 -16628 -17548 -7510
15779 -7510 -2924 -10701 -7106 1310 6067 -3568 -5882 -323 2538 7968 9705 1205 -6475 -13827 -17991
15764 -17991 -1468 4727 -280 422 -12903 -19956 -15655 -3235 5535 9469 2768 -1293 -6987 -13494
15750 -13494 -10928 4348 783 -4092 -6678 -9089 -1721 -1988 -2352 -6928 -15886 -17506 -13918 -17565 -17599
15735 -17599 -6627 -8669 -16749 -22941 -13756 -4563 -7213 -8039 -7390 -311 7089 10279 4756 -825 5057
15720 5057 15154 9942 33 -4516 -2018 -7617 -20940 -12791 -18861 -21383 -17714 -17498 -21894 -15308
$$ packed form
15824a3755l451j652N634M570L385j288j301N529p869K076O628o155o604Q204
15810f049J062m440j569l244r38P862Q490K102l362K342O811j803j0843q26L152
15795a253O559L96m4p64K064J718p259j2414J315o060K705J148K068o807r20J0038
15779g510M586p777L595Q416M757r635k314N559K861N430J737q500p680p352m164
15764a7991J6523O195n007P02j3325p053M301J2420Q770L934o701m061n694o507
15750a3494K566J5276l565m875k586k411P368k67l64m576q958j620L588l647l4
15735a7599J0972k042q080o192R185R193k650q26O49P079P400L190n523n581N882
15720E057J0097n212r909m549K498n599j3323Q149o070k522L669K16m396O586
$$ plain form
15706 -15308 -8585 -3691 -15267 1261 9742 6036 -1827 -14068 -14240 -14707 -8264 -3128 -12941 -20165
15692 -20165 -17342 -6285 -5642 -6170 -14171 -22426 -19038 -14183 -10492 -917 -8416 -17429 -11180 -3953 3188
15677 3188 -8305 -12720 -11867 -10347 -7178 -2967 -2012 -197 -9197 -22403 -25121 -22333 -11161 -3282
15663 -3282 -7422 -12246 -23667 -25955 -25880 -21362 -7153 2560 2231 -7445 -6310 -9271 -10767 -7379 -5667
15648 -5667 -8579 -6321 -9005 -23366 -27237 -19436 -12208 -7733 -6866 -5080 -3119 272 -8328 -8550 -13275
15633 -13275 -20340 -22152 -18806 -16979 -10288 -14313 -14599 -7596 692 -1896 -3760 -267 2777 -3140 -8718
15618 -8718 -8934 -13022 -19053 -19501 -3574 3415 11346 5077 -3108 -4283 -11145 -12894 1807 -3469 -14060
15603 -14060 -20499 -19713 -16808 -10181 -6946 -7455 -6137 -9582 -6240 -6853 -7507 -5317 -6402 -4635 -8852
$$ packed form
15706a5308O723M894j1576J6528Q481l706p863j2241j72m67O443N136r813p224
15692b0165K823J1057O43n28q001q255L388M855L691R575p499r013O249P227P141
15677C188j1493m415Q53J520L169M211R55J815r000j3206k718K788J1172P879
15663c282m140m824j1421k288P5M518J4209R713l29r676J135k961j496L388J712
15648e667k912K258k684j4361l871P801P228M475Q67J786J961L391q600k22m725
15633a3275p065j812L346J827O691m025k86P003Q288k588j864L493L044n917n578
15618h718k16m088o031m48J5927O989P931o269q185j175o862j749J4701n276j0591
15603a4060o439P86K905O627L235n09J318l445L342o13o54K190j085J767m217
$$ plain form
15588 -8852 -15459 -28921 -18303 -11873 -13837 -15333 -20985 -27614 -22421 -3487 1091 -979 -10335 -6414
15574 -6414 -420 -8136 -20112 -17026 -16226 -25832 -20607 -14215 -14391 -6677 -1495 5884 11733 13219 11451
15559 11451 10836 10529 15759 18830 12961 8205 352 -4418 -3858 -11263 -17788 -17770 -16447 -9471 -7951 -4612
15543 -4612 -3079 -4549 -5151 -9529 -10384 4570 3461 -8342 -12211 -9351 -1826 -1494 -5297 -6349 -3222
15528 -3222 7881 -1203 -10608 -9833 1633 3942 -1170 -7643 -5149 -6595 -12967 -9234 -9100 -12487 -9333
15513 -9333 -4841 -3952 -133 -210 -1801 -181 1776 -4 -9882 -12700 -9867 -7113 -6272 397 -2390 -2385
15497 -2385 -808 -5355 -7198 4211 8232 6674 684 8074 14974 14060 8711 -1013 -5435 -2935 5144
15482 5144 6928 8253 -4985 -9596 -10360 -8685 -4656 4676 2895 -1859 -16691 -26580 -21250 -21832 -18490
$$ packed form
15588h852o607j3462J0618O430j964j496n652o629N193J8934M578k070r356L921
15574f414N994p716j1976L086Q00r606N225O392j76P714N182P379N849J486j768
15559A1451o15l07N230L071n869m756p853m770N60p405o525J8J323O976J520L339
15543d612J533j470o02m378q55J4954j109j1803l869K860P525L32l803j052L127
15528c222J1103r084r405P75J1466K309n112o473K494j446o372L733J34l387L154
15513i333M492Q89L819p7j591J620J957j780r878k818K833K754Q41O669k787N
15497b385J577m547j843J1409M021j558n990P390O900r14n349r724m422K500Q079
15482E144J784J325j3238m611p64J675M029R332j781m754j4832r889N330n82L342
$$ plain form
15467 -18490 -9288 -13799 -15334 -20245 -24941 -18767 -9660 -4861 -7555 -11473 -11975 -4455 -2487 -14546
15453 -14546 -9923 -10138 -7145 -5367 -13375 -18554 -20625 -22154 -16207 -2333 4992 5774 3517 -8173
15439 -8173 -10156 -10403 -6510 -2513 -5346 -7940 -17949 -17432 -18634 -7800 -1838 -5769 -4638 645 690
15424 690 -7435 -12939 -11850 -8264 -6495 -11386 -11877 -10275 -12629 -13126 -269 7041 -1937 -7186 -813
15409 -813 -1743 -1525 -2242 -7427 -10031 -9949 -5704 -960 760 -2467 -10311 -13962 -6518 -9443 -5097 -960
15393 -960 5658 3886 -2376 2207 3693 2589 4274 2925 -4421 -13185 -16347 -15598 -411 -3023 -10331
15378 -10331 -4849 2480 9412 7224 2102 2315 5093 -1137 -12153 -11655 1848 1162 -9816 -16244
15364 -16244 -5700 -2654 -9597 -13965 -629 12397 21510 4513 -7496 -8268 -6117 -3231 5034
$$ packed form
15467a8490R202m511j535m911m696O174R107M799k694l918n02P520J968j2059
15453a4546M623k15K993J778q008n179k071j529N947J3874P325P82k257j1690
15439h173j983k47L893L997k833k594j0009N17j202J0834N962l931J131N283M5
15424F90q125n504J089L586J769m891m91J602k354m97J2857P310q978n249O373
15409h13r30K18p17n185k604Q2M245M744J720l227p844l651P444k925M346M137
15393i60O618j772o262M583J486j104J685j349p346q764l162P49J5187k612p308
15378a0331N482P329O932k188n122K13K778o230j1016M98J3503o86j0978o428
15364a6244J0544L046o943m368J3336J3026R113j6997j2009p72K151K886Q265
$$ plain form
15351 5034 4525 -2313 -6969 -3738 -6635 -22241 -18238 -15236 -20309 -19659 -16439 -20156 -23383 -17710 -16620
15336 -16620 -11729 -8321 -4890 3576 5746 8565 -3441 -15251 -18991 -11095 -15268 -20613 -13352 -493
15322 -493 5149 1563 7872 8134 4603 -358 4099 1161 -5527 -5636 1154 -2586 -3917 -10856 -12415
15307 -12415 -9202 -13543 -19410 -15131 -13222 -11149 -5536 1429 4370 4265 2574 1442 -5387 -9773 -14450
15292 -14450 -16002 -16297 -12257 -13237 -19506 -12643 -2793 -10962 -4373 1700 3615 10746 8338 -481 -3211
15277 -3211 9400 9556 -7926 -17096 -18670 -6648 4142 -2503 -6075 -9732 -10647 -14279 -19868 -16622
15263 -16622 -12685 -4046 -1906 -8688 -20779 -21166 -14113 -13843 -14107 -3936 -4729 -13612 -13280 -12608 -15755
15248 -15755 -20783 -11655 -12169 -11190 -18631 -20514 -9966 331 3307 -7534 -11798 -10736 -2271 6775
$$ packed form
15351E034n09o838m656L231k897j5606M003L002n073O50L220l717l227N673J090
15336a6620M891L408L431Q466K170K819j2006j1810l740P896m173n345P261J2859
15322d93N642l586O309K62l531m961M457k938o688j09O790l740j331o939j559
15307a2415L213m341n867M279J909K073N613O965K941j05j691j132o829m386m677
15292a4450j552k95M040r80o269O863R850q169O589O073J915P131k408q819k730
15277c211J2611J56j7482r170j574J2022J0790o645l572l657r15l632n589L246
15263a6622L937Q639K140o782j2091l87P053K70k64J0171p93q883L32O72l147
15248a5755n028R128n14R79p441j883J0548J0297K976j0841m264J062Q465R046
$$ plain form
15234 6775 12368 8782 -923 -12146 -16312 -8291 -6973 -12178 -15400 -22974 -24387 -20363 -9481 -1468
15220 -1468 4461 2578 4974 7044 6054 12912 10663 12652 14422 10264 14586 21012 23284 17741 7998
15205 7998 2743 6812 7055 2914 5699 4067 6137 5426 1283 -11593 -4593 2290 3934 -3724 -1683
15190 -1683 350 -4526 -2363 -4198 -10204 -13329 -10196 -8452 -11569 -4027 -7153 -9211 -3278 130 -425
15175 -425 -354 -2559 -1998 3423 12708 10398 2259 -247 -10444 -11103 -4674 -720 4709 8176 6855 167
15159 167 1330 -3276 -3174 -6039 -4001 3251 -2035 -130 770 -4545 -6037 -4477 -6477 -9696 -10270 -8758
15143 -8758 -903 2773 8050 14406 7870 5121 12483 8877 -1812 -5978 -5957 281 -5241 -7001 -2674
15128 -2674 2624 6507 6156 3795 8403 14754 3114 -10619 -9000 -7271 -7949 280 -5244 -6889 -9736
$$ packed form
15234F775N593l586r705j1223m166Q021J318n205l222p574j413M024J0882Q013
15220a468N929j883K396K070r90O858k249J989J770m158M322O426K272n543r743
15205G998n255M069K43m141K785j632K070p11m143j2876P000O883J644p658K041
15190a683K033m876K163j835o006l125L133J744l117P542l126k058N933L408n55
15175d25P1k205N61N421R285k310q139k506j0197o59O429L954N429L467j321o688
15159A67J163m606J02k865K038P252n286J905R00n315j492J560k000l219n74J512
15143h758P855L676N277O356o536k749P362l606j0689m166K1O238n522j760M327
15128b674N298L883l51k361M608O351j1640j3733J619J729o78Q229n524j645k847
$$ plain form
15113 -9736 -16561 -8087 -3725 -4053 9 8355 6810 3304 -5771 -6089 -7289 -20047 -17453 -5666 2143
15098 2143 4225 6503 4614 -32 -7900 -9216 -8472 -9674 -9309 -17796 -19188 -9308 -497 2405 5470
15083 5470 -3550 -6195 -10608 -18220 -15079 -10506 -3836 4448 3467 -6438 -3234 715 -560 -3792 7301
15068 7301 6046 11508 8263 -3212 -5842 5157 8782 1982 -1640 -4098 447 8140 5564 8114
15054 8114 6716 3813 3619 4815 2454 6126 12292 11078 9761 2474 -7635 -1389 4706 7137 9582
15039 9582 5741 8165 10209 11610 9864 10560 8499 7578 7554 8555 19809 20049 14075 10357 14866 8460
15023 8460 8709 8896 10942 26367 36473 44569 43459 43168 43773 50747 56681 62008 67189 73260 94824
15008 94824 129301 164218 209840 303104 446306 684873 1136349 1960889 3123064 3150796
$$ packed form
15113i736o825Q474M362l28M062Q346j545l506r075l18j200j2758K594J1787P809
15098B143K082K278j889m646p868j316P44j202L65q487j392R880Q811K902L065
15083E470r020k645m413p612L141M573O670Q284r81r905L204L949j275l232J1093
15068G301j255N462l245j1475k630J0999L625o800l622k458M545P693k576K550
15054H114j398k903j94J196k361L672O166j214j317p287j0109O246O095K431K445
15039I582l841K424K044J401j746O96k061r21k4J001J1254K40n974l718M509o406
15023H460K49J87K046J5425J0106Q096j110k91O05O974N934N327N181O071K1564
15008I4824L4477L4917M5622R3264J43202K38567M51476Q24540J162175K7732
$$ plain form
14998 3150796 1941381 1027989 586640 376019 255463 183710 132969 102879 87777 77516
14988 77516 65758 55548 44061 32701 21301 14897 15248 15361 16931 22153 12346 8536 4808 2384
14974 2384 -5856 -2614 -8802 -9562 -1088 -6022 -6894 -7292 -5349 -517 -715 -4105 -2530 -10630 -14743 -12214
14958 -12214 -9614 -3409 1701 4034 -5693 251 -382 -4578 -11191 -9013 -8019 -9052 -13670 -12412 -5834
14943 -5834 6568 7161 3755 -4190 -5841 5829 14456 20735 13460 817 2074 430 5511 13551
14929 13551 15413 1879 706 -3683 -7441 2996 2612 -4497 -9900 -16975 -11557 -8639 1161 1622
14915 1622 1917 6102 8350 4026 2322 -2790 -9546 -9848 -8487 -12872 -12866 -3483 2701 1560 1233 551
14899 551 -5937 -12051 -10804 -5581 -1528 3703 5963 11501 5149 -2313 -10123 -13082 -14821 -16847 -14443
$$ packed form
14998C150796j209415r13392m41349k10621j20556p1753n0741l0090j5102j0261
14988G7516j1758j0210j1487j1360j1400o404L51J13J570N222r807l810l728k424
14974B384q240L242o188p60Q474m934q72l98J943M832j98l390J575q100m113K529
14958a2214K600O205N110K333r727N944o33m196o613K178R94j033m618J258O578
14943e834J2402N93l406p945j651J1670Q627O279p275j2643J257j644N081Q040
14929A3551J862j3534j173m389l758J0437l84p109n403p075N418K918R800M61
14915A622K95M185K248m324j704n112o756l02J361m385OR383O184j141l27o82
14899E51o488o114J247N223M053N231K260N538o352p462p810k959j739k026K404
$$ plain form
14884 -14443 -19487 -16853 -7553 -4551 -2068 5078 4642 -6157 -9776 -7120 -6128 -1495 -14064 -15742
14870 -15742 -13082 -3327 553 2955 -2247 -3649 -2058 1785 -1861 7415 8309 3623 -129 6515 3832
14855 3832 -5129 -14804 -9036 2597 -4786 917 -792 -4781 -13599 -20146 -16436 -9685 -16438 -21122
14841 -21122 -19216 -13691 -20349 -18664 -9616 -72 4694 8998 -5740 -13492 -7232 -4482 819 2700
14827 2700 -10643 -7272 -8008 -18082 -18907 -18155 -19126 -14457 -13965 -16806 -10014 -6677 -7477 -17962 -27836
14812 -27836 -18348 -3980 -6422 -18307 -17341 -3704 -2211 -9961 -11446 -7691 80 13370 14410 5513
14798 5513 7104 1929 -8679 -9023 2824 12674 9374 2014 -1976 -6792 -14152 -13667 -12962 -12394 -782
14783 -782 2816 -5467 -5786 -6206 -6618 -11271 -17352 -10061 -5336 -1622 482 976 7888 5913 -6150 -6234
$$ packed form
14884a4443n044K634R300L002K483P146m36j0799l619K656R92M633j2569j678
14870a5742K660R755L880K402n202j402J591L843l646R276Q94m686l752O644k683
14855C832q961r675N768J1633p383N703j709l989q818o547L710O751o753m684
14841b1122J906N525o658J685R048R544M766M304j4738p752O260K750N301J881
14827B700j3343L371p36j0074q25P52r71M669M92k841O792L337q00j0485r874
14812b7836R488J4368k442j1885R66J3637J493p750j485L755P771J3290J040q897
14798E513J591n175j0608l44J1847R850l300p360l990m816p360M85P05N68J1612
14783g82L598q283l19m20m12m653o081P291M725L714K104M94O912j975j2063q4
$$ plain form
14767 -6234 -1530 7181 8748 10981 9861 5633 1953 -2472 -365 929 -432 -6741 -3840 -1545 3432
14752 3432 10651 2667 3995 3574 -1819 5518 16860 20571 16744 17334 18932 15339 5629 2323 -3127
14737 -3127 -7825 -14063 -18138 -10784 -8520 -3823 -3551 344 4577 4470 -85 688 4799 7180 8085 2714
14721 2714 5020 5400 6770 13356 3563 2968 2905 -10588 -14130 -6126 -1693 -2192 -4791 -9305 -8504 3893
14705 3893 7488 4519 -9939 -7776 -5702 2409 5933 -1399 -2352 -7920 -10959 -11096 -9742 -1990 -2883
14690 -2883 -18768 -28681 -20086 -12341 -16637 -16258 -11191 -7361 -3364 -521 -11716 -17733 -17266 -14496 -1921
14675 -1921 4080 -2754 2174 1881 -3277 24 8782 20695 24416 11659 9032 7557 205 927 1810
14660 1810 10979 11374 19861 13475 5386 869 -962 -2568 3991 7727 8957 3463 -6193 -7892 3477
$$ packed form
14767f234M704Q711J567K233j120m228l680m425K107J294j361o309K901K295M977
14752C432P219p984J328m21n393P337J1342L711l827N90J598l593r710l306n450
14737c127m698o238m075P354K264M697K72L895M233j07m555P73M111K381R05n371
14721B714K306L80J370O586r793n95o3j3493l542Q004M433m99k599m514Q01J2397
14705C893L595k969j4458K163K074Q111L524p332r53n568l039j37J354P752q93
14690b883j5885r913Q595P745m296L79N067L830L997K843j1195o017M67K770J2575
14675a921O001o834M928k93n158L301Q758J1913L721j2757k627j475p352P22Q83
14660A810R169L95Q487o386q089m517j831j606O559L736J230n494r656j699J1369
$$ plain form
14645 3477 13854 12359 9086 -3290 -6664 -2413 803 542 -2175 -1887 -1723 -988 3712 3683 650 -4045
14629 -4045 -9403 -14494 -15502 -7925 23 3444 -2533 -1925 3257 6596 4550 1590 2103 2083 9329 4814
14613 4814 -695 -2457 -4658 -8362 -1961 1475 -2952 -4323 -14408 -16722 -14000 -14539 -16976 -11157 -9937
14598 -9937 -13210 -9938 2105 4472 -6483 -7019 1745 5094 4443 3447 3282 6028 -165 -8815 -3720
14583 -3720 2205 8978 4029 9588 5179 -1438 -3242 -7603 -9717 -8792 -12953 -12852 -13575 -8420 -3140
14568 -3140 -9225 -14951 -10903 -6855 -14003 -12286 -14127 -17389 -10706 -8689 -10300 -5282 -12506 -9547 1736
14553 1736 7404 11654 5075 668 -685 162 -1338 1051 5217 7996 7385 6155 5347 12122 15632
14538 15632 8035 -7436 -4043 1968 3946 3470 1070 -10052 -12299 -9434 -3122 -2533 -7270 -140
$$ packed form
14645C477J0377j495l273j2376l374M251L216k61k717K88J64P35M700k9l033m695
14629d045n358n091j008P577P948L421n977O08N182L339k046k960N13k0P246m515
14613D814n509j762k201l704O401L436m427j371j0085k314K722n39k437N819J220
14598i937l273L272J2043K367j0955n36Q764L349o51r96j65K746o193q650N095
14583c720N925O773m949N559m409o617j804m361k114R25m161J01p23N155N280
14568c140o085n726M048M048p148J717j841l262O683K017j611N018p224K959J1283
14553A736N668M250o579m407j353Q47j500K389M166K779o11j230q08O775L510
14538A5632p597j5471L393O011J978m76k400j1122k247K865O312N89m737P130
$$ plain form
14524 -140 -3133 -9551 -2621 -840 -6113 -12352 -13630 -6786 -10905 -16714 -17080 -13467 -7758 -7924 -1545
14509 -1545 -4882 -7025 -5456 -689 12891 12155 1649 -3792 -6193 -11485 -3437 199 61 -5112 -3449
14494 -3449 -4517 -10008 -5331 969 -3400 3738 12366 24057 32176 37711 34625 22164 10446 5557
14480 5557 6205 204 -760 8088 11968 2371 5574 6847 8859 2331 2048 -1396 -11321 -11410 -4483 3557
14464 3557 5570 3811 7600 8595 9447 2302 -726 -3934 -4542 -20663 -22290 -12838 -5508 -4209 7009
14449 7009 15826 17169 21174 14088 6429 1585 7998 12079 7809 15357 24142 15171 10994 8290 10457
14434 10457 -162 3032 868 -170 7152 6144 9532 12767 3570 -1002 -146 5331 7487 6814 -1280
14419 -1280 -5396 -1732 1782 5922 12560 18993 15614 3990 -4027 -6305 1543 -7944 -10509 487
$$ packed form
14524a40k993o418O930J781n273o239j278O844m119n809l66L613N709j66O379
14509a545l337k143J569M767J3580p36j0506n441k401n292Q048L636j38n173J663
14494c449j068n491M677O300m369P138Q628J1691Q119N535l086j2461j1718m889
14480E557O48o001r64Q848L880r597L203J273K012o528k83l444r925q9O927Q040
14464C557K013j759L789R95Q52p145l028l208o08j6121j627R452P330J299J1218
14449G009Q817J343M005p086p659m844O413M081m270P548Q785q971m177k704K167
14434A0457j0619L194k164j038P322j008L388L235r197m572Q56N477K156o73q094
14419a280m116L664L514M140O638O433l379j1624q017k278P848r487k565J0996
$$ plain form
14405 487 7769 7062 2727 -9615 -10938 -4422 -1987 1520 -1679 844 8727 7367 3558 308 7896
14390 7896 -16 -9931 -5396 -4767 -2343 5675 -2805 -11690 -5893 -1539 3742 -292 -1970 5357 12501
14375 12501 5172 -3056 -9883 -14103 -12889 -8501 -8018 -922 5056 644 -802 -6729 -3860 -3403 -1577
14360 -1577 15731 16013 6955 3357 6579 14195 18711 19063 8902 12697 3494 -3046 -4000 -2511 -8521
14345 -8521 -11624 -19335 -13429 2068 -1438 -11591 -15422 -12664 -12218 -4194 6812 13787 11299 1942
14331 1942 -7313 -7398 -4624 -2673 -1092 3140 -1011 -1169 8501 -421 -954 10871 15008 9954 -4440
14316 -4440 -3659 -2886 5708 4591 6009 5815 2496 16386 25205 18818 8229 4682 3263 861 -9705
14301 -9705 -12195 -6904 -1677 7203 4004 -350 -8180 -3191 2169 -2635 3210 14151 9904 877
$$ packed form
14405D87P282p07m335j2342j323O516K435L507l199K523P883j360l809l250P588
14390G896p912r915M535O29K424Q018q480q885N797M354N281m034j678P327P144
14375A2501p329q228o827m220J214M388M83P096N978m412j446n927K869M57J826
14360a577J7308K82r058l598L222P616M516L52j0161L795r203o540r54J489o010
14345h521l103p711N906J5497l506j0153l831K758M46Q024J1006O975k488r357
14331A942r255q5K774J951J581M232m151j58R670q922n33J1825M137n054j4394
14316d440P81P73Q594j117J418j94l319J3890Q819o387j0589l547j419k402j0566
14301i705k490N291N227Q880l199m354p830M989N360m804N845J0941m247r027
$$ plain form
14287 877 -5027 7087 12428 3814 9076 7954 -3246 -1675 -255 676 -2208 -13 -2882 3756 1099
14272 1099 -6187 -6105 -1243 -1556 2025 5878 1649 2915 11661 5885 8039 1291 -14333 -15946 -8019
14257 -8019 2628 5573 5082 2693 2147 1202 -3555 -985 2872 5440 10287 14609 12731 7259 2648
14242 2648 5871 4007 1885 8857 10398 236 -2239 2160 365 -95 -2781 -5146 -6629 -2412 2360
14227 2360 4228 4269 -4486 -6040 1176 15178 12494 8161 11171 15290 9633 3539 -866 -2140 -7525
14212 -7525 -16552 -21251 -18595 -8295 1693 6069 11586 14713 7749 8143 9047 11518 14553 9834 2725
14197 2725 2499 5276 1799 -936 1593 -4984 673 6340 130 -392 859 2778 5604 4800 -5610
14182 -5610 -11198 -2969 8411 6342 2199 8580 17251 12435 10105 7836 2712 3497 30 -3735 -1159
$$ packed form
14287H77n904J2114N341q614N262j122j1200J571J420R31k884K195k869O638k657
14272A099p286Q2M862l13L581L853m229J266Q746n776K154o748j5624j613P927
14257h019J0647K945m91k389n46r45m757K570L857K568M847M322j878n472m611
14242B648L223j864k122O972J541j0162k475M399j795m60k686k365j483M217M772
14227B360J868M1q755j554P216J4002k684m333L010M119n657o094m405j274n385
14212g525r027m699K656J0300R988M376N517L127o964L94R04K471L035m719p109
14197B725k26K777l477k735K529o577N657N667o210n22J251J919K826q04j0410
14182e610n588Q229J1380k069m143O381Q671m816k330k269n124P85l467l765K576
$$ plain form
14167 -1159 -5549 -7416 -7956 -2427 4546 6616 4892 -574 4707 9965 -1630 -3847 2437 3336 2142
14152 2142 288 -6503 -4686 8596 8211 10063 17576 17532 7268 13058 22659 20901 14461 12457 22747
14137 22747 21661 14273 11360 7556 -482 7494 10102 8739 2923 -2448 -8278 -15271 -9458 -2036
14123 -2036 6784 10568 5150 6291 6096 1593 -4817 -5095 -4817 -6840 1820 3635 14086 21753 20455
14108 20455 8926 9313 8848 3564 -2936 -700 5390 5134 3824 894 -2120 5947 15383 13288 17052
14093 17052 18334 11604 3662 10708 8340 5010 5761 8649 6251 5027 12555 12131 13469 13457 5008
14078 5008 8377 10608 6086 3817 8237 14015 12343 5092 -4411 -4110 1676 4613 5585 2162 -766
14063 -766 -10629 -8205 -4702 -2655 3685 -1241 -14537 -18893 -14374 -5126 5075 2142 5191 12112
$$ packed form
14167a159m390j867n40N529O973K070j724n466N281N258j1595k217O284Q99j194
14152B142j854o791J817J3282l85J852P513m4j0264N790R601j758o440k004J0290
14137B2747j086p388k913l804q038P976K608j363n816n371n830o993N813P422
14123b036Q820L784n418J141j95m503o410k78K78k023Q660J815J0451P667j298
14108B0455j1529L87m65n284o500K236O090k56j310k930l014Q067R436k095L764
14093A7052J282o730p942P046k368l330P51K888k398j224P528m24J338j2q449
14078E008L369K231m522k269M420N778j672p251r503L01N786K937R72l423k928
14063g66r863K424L503K047O340m926j3296m356M519R248J0201k933L049O921
$$ plain form
14049 12112 16309 18072 11399 2029 1118 -1944 -4714 384 11000 13184 6893 12156 6335 -4948
14035 -4948 -2026 -1667 -4064 -7356 1109 7025 6951 3315 4220 5159 10859 5270 -1091 -4209 4912 25723
14019 25723 24340 19809 11458 1165 1280 4957 184 -9290 -2646 -2046 1950 10068 21626 24471
14005 24471 16001 12519 20646 18112 14868 17605 16545 7898 2945 9222 15446 18466 10235 10416 5552
13990 5552 -3565 8337 18185 17808 9812 7072 4878 4220 7570 2247 -1933 -1341 13609 19867 30417
13975 30417 36132 41951 50987 48642 41899 40279 41511 32731 24002 17796 15814 10957 879 -5128
13961 -5128 337 13427 17092 -858 -11511 -13670 -6830 -2298 -4725 -5037 -10267 -9356 -4961 8557
13947 8557 11061 13766 16771 17490 13518 7242 19218 14223 12706 15020 8915 -4692 -1578 11618
$$ packed form
14049A2112M197J763o673r370r11l062k770N098J0616K184o291N263n821j1283
14035d948K922L59k397l292Q465N916p4l636R05R39N700n589o361l118R121K0811
14019B5723j383m531q351j0293J15L677m773r474O644O00L996Q118J1558K845
14005B4471q470l482Q127k534l244K737j060q647m953O277O224L020q231J81m864
13990E552r117J1902R848l77p996k740k194o58L350n323m180N92J4950O258J0550
13975C0417N715N819R036k345o743j620J232q780q729o206j982m857j0078o007
13961e128N465J3090L665j7950j0653k159O840M532k427l12n230R11M395J3518
13947H557K504K705L005P19l972o276J1976m995j517K314o105j3607L114J3196
$$ plain form
13933 11618 24293 26583 28899 26264 29074 29408 36111 47936 62776 62793 44959 31692 19471 11253
13919 11253 16340 16948 19620 19742 7336 -1299 8252 8739 17116 24479 26537 21750 14484 15262 13871
13904 13871 11256 17736 18726 5573 1956 2393 10850 8449 1666 -1551 3627 2549 -68 12501
13890 12501 23930 22050 19997 13232 11965 7876 -725 -1352 227 2892 4559 8670 15179 16858
13876 16858 10072 16245 20731 15031 15463 20493 30794 42365 51368 69495 89167 95921 122714
13863 122714 149324 165662 203087 229955 234097 236535 235044 225928 207156 189087 161922 123022
13851 123022 95625 70262 55835 45571 40085 39448 39023 32177 30275 24850 22754 23103 14236 7557
13837 7557 13847 25877 21759 15603 20275 14337 10070 3907 7148 5687 3450 -3183 -2466 6237 9262
$$ packed form
13933A1618J2675K290K316k635K810L34O703J1825J4840J7j7834j3267j2221q218
13919A1253N087O08K672J22j2406q635R551M87Q377P363K058m787p266P78j391
13904A3871k615O480R90j3153l617M37Q457k401o783l217N178j078k617J2569
13890A2501J1429j880k053o765j267m089q601o27J579K665J667M111O509J679
13876A6858o786O173M486n700M32N030J0301J1571R003J8127J9672O754K6793
13863A22714K6610J6338L7425K6868M142K438j491r116j8772j8069k7165l8900
13851A23022k7397k5363j4427j0264n486o37m25o846j902n425k096L49q867o679
13837G557O290J2030m118o156M672n938m267o163L241j461k237o633P17Q703L025
$$ plain form
13822 9262 7497 4073 -1314 -1253 4032 15218 13700 4188 3474 12791 21486 20536 18449 15387 16052 20554
13806 20554 10743 12999 12627 14978 11807 3573 -3048 42 12120 16547 14530 18829 21651 15133
13792 15133 22125 28516 29120 17019 13224 13610 12350 6808 12765 13369 16154 10373 8960 13124 15236
13777 15236 13247 6746 -128 -3388 -7975 -3794 -6012 -2482 -1115 -498 1679 15033 24269 22707
13763 22707 16154 12517 3002 -6300 -5867 3684 12994 17907 18374 14827 13798 13998 5857 -5762 -8622
13748 -8622 -2138 -2012 1190 4357 -1863 -2309 -3707 464 -9168 -2916 12119 10092 6084 6050 -6317
13733 -6317 -20099 -20732 -6494 2199 1509 -2625 -9779 -5424 405 2638 912 3029 11430 10433 8660
13718 8660 16137 17762 3739 3970 3456 6903 12622 16828 18369 21464 15046 11155 20080 19546 23906
$$ packed form
13822I262j765l424n387O1N285J1186j518r512p14R317Q695r50k087l062O65M502
13806B0554r811K256l72K351l171q234o621L090J2078M427k017M299K822o518
13792A5133O992O391O04j2101l795L86j260n542N957O04K785n781j413M164K112
13777A5236j989o501o874l260m587M181k218L530J367O17K177J3354R236j562
13763B2707o553l637r515r302M33R551R310M913M67l547j029K00q141j1619k860
13748h622O484J26L202L167o220m46j398M171r632O252J5035k027m008l4j2367
13733f317j3782o33J4238Q693o90m134p154M355N829K233j726K117Q401r97j773
13718H660P477J625j4023K31n14L447N719M206J541L095o418l891Q925n34M360
$$ plain form
13703 23906 24441 6279 5781 4578 2723 -1061 7666 10445 3292 2950 4313 5701 7822 8665 10646
13688 10646 9116 2480 5070 10152 12716 10660 6863 1159 6244 9886 2930 942 4654 48
13674 48 1442 5716 7280 7692 810 8951 3005 -7158 -14428 -14170 -283 5379 3953 -3557 -4055
13659 -4055 -5151 -1590 4976 10395 2586 -2192 -3246 -477 9491 11650 16807 14650 11665 7779 13829
13644 13829 20154 20491 26913 33475 29356 32692 28685 22260 18864 19465 22874 27749 25561 15471 6284
13629 6284 3509 4886 11273 9505 -3549 6614 18591 27202 32964 30383 34205 21512 15477 15269
13615 15269 14878 12340 12846 10716 7184 5501 8161 13079 11056 5519 9900 10087 7094 10837 6360
13600 6360 4791 6047 6621 10867 26037 30057 24367 16987 16474 13515 6816 11644 16809 15683 11998
$$ packed form
13703B3906N35j8162m98j203j855l784Q727K779p153l42J363J388K121Q43J981
13688A0646j530o636K590N082K564k056l797n704N085L642o956j988L712m606
13674D8J394M274J564M12o882Q141n946j0163p270K58J3887N662j426p510m98
13659d055j096L561O566N419p809m778j054K769R968K159N157k157k985l886O050
13644A3829O325L37O422O562m119L336m007o425l396O01L409M875k188j0090r187
13629F284k775J377O387j768j3054J0163J1977Q611N762k581L822j2693o035k08
13615A5269l91k538N06k130l532j683K660M918k023n537M381J87k993L743m477
13600F360j569J256N74M246J5170M020n690p380n13k959o699M828N165j126l685
$$ plain form
13585 11998 15894 21155 22374 10444 2403 2199 3205 8532 16062 17354 5518 6547 2236 3925
13571 3925 3610 4286 7101 5232 3151 -6649 -12692 -12955 -9132 -5704 -2216 4735 13938 21881 27395
13556 27395 16889 13459 14516 17846 21454 18368 18333 15623 15602 8121 6150 6174 8649 10744 11553 10842
13540 10842 12771 15842 27531 21546 14990 17241 16311 12915 16445 15225 14586 21769 24693 25312 19940
13525 19940 9364 4305 18545 21538 21123 19264 14726 18029 10644 4470 2788 6303 15068 9772
13511 9772 2390 6573 11193 7346 7290 14230 10619 20504 16310 17678 17012 16272 20670 19181 11735 8844
13495 8844 7854 6347 -2279 -4557 -2940 513 -1779 -9799 -11988 -16890 -12670 -5886 -4040 -3104 6689
13480 6689 10225 5433 -4437 -7229 4365 10914 14625 8215 5664 -3847 -7638 -3681 11166 19750
$$ packed form
13585A1998L896N261J219j1930q041k04J006N327P530J292j1836J029m311J689
13571C925l15O76K815j869k081r800o043k63L823L428L488O951R203P943N514
13556B7395j0506l430J057L330L608l086l5k710k1p481j971K4K475K095Q09p11
13540A0842J929L071J1689n985o556K251r30l396L530j220o39P183K924O19n372
13525A9940j0576n059J4240K993m15j859m538L303p385o174j682L515Q765n296
13511I772p382M183M620l847n6O940l611R885m194J368o66p40M398j489p446k891
13495H844r90j507q626k278J617L453k292q020k189m902M220O784J846R36R793
13480F689L536m792r870k792J1594O549L711o410k551r511l791L957J4847Q584
$$ plain form
13466 19750 23592 21430 8921 206 -4498 -3749 -3467 -11715 -11015 -9078 1252 5119 6445 8032 12815
13451 12815 11779 11298 8148 4551 -860 -7962 5295 5361 -5208 -13303 -9423 -4311 -4909 -7427 2249
13436 2249 14408 7571 980 1435 -14849 -11653 -1957 4467 9294 7289 12440 14167 17398 14957
13422 14957 13793 14072 30248 27686 21161 16329 3645 -3001 3323 1008 -391 -7678 -1322 5988
13408 5988 12876 18562 21365 9554 12391 19552 20351 14971 12053 4832 1182 3516 -2701 2911 2768
13393 2768 10850 11414 8064 4587 -62 -8755 -4234 -659 4716 12513 8605 7518 11234 18011 19880
13378 19880 20609 10864 -1779 -1463 4058 3516 161 7903 14702 16096 21148 17251 16922 15834 12585
13363 12585 15392 16991 15129 20474 13714 13398 13425 3067 -3879 -2712 5766 11047 16515 14630 12920
$$ packed form
13466A9750L842k162j2509q715m704P49K82q248P00J937J0330L867J326J587M783
13451A2815j036m81l150l597n411p102J3257O6j0569q095L880N112n98k518R676
13436B249J2159o837o591M55j6284L196R696O424M827k005N151J727L231k441
13422A4957j164K79J6176k562o525m832j2684o646O324k315j399p287O356P310
13408E988O888N686K803j1811K837P161P99n380k918p221l650K334o217N612j43
13393B768Q082N64l350l477m649q693M521L575N375P797l908j087L716O777J869
13378A9880P29r745j2643L16N521n42l355P742O799J394N052l897l29j088l249
13363A2585K807J599j862N345o760l16K7j0358o946J167Q478N281N468j885j710
$$ plain form
13348 12920 12588 11947 19123 16634 16572 23483 22740 19880 12666 13372 18113 10532 1444 2604 16188 17893
13332 17893 12281 12804 14676 24825 27031 20734 18464 18299 19697 11891 11777 16398 25455 21656 14490
13317 14490 18312 17528 17186 21050 22658 27451 24054 19823 10385 3211 -3715 1470 8190 20179 16304
13302 16304 8399 3994 733 5244 7024 10704 18798 23354 16857 2211 -1798 -3914 -10842 -15826
13288 -15826 -3668 3504 6069 16013 14597 10375 8851 -433 5452 5487 -1743 1240 11175 19772 18656
13273 18656 12671 10901 4152 6104 1814 -2921 6541 16060 25277 23257 18168 11724 15168 12596
13259 12596 15370 21926 20996 12841 3922 18458 33764 32939 27324 27063 28948 20475 15648 24199 14866
13244 14866 5996 2361 -5133 -2299 -114 -10521 -5529 1663 -3650 -3998 -6154 -10844 -9024 6
$$ packed form
13348A2920l32o41P176k489o2O911p43k860p214P06M741p581r088J160J3584J705
13332A7893n612N23J872J0149K206o297k270j65J398p806j14M621R057l799p166
13317A4490L822p84l42L864J608M793l397m231r438p174o926N185O720J1989l875
13302A6304p905m405l261M511J780L680Q094M556o497j4646m009k116o928m984
13288a5826J2158P172K565R944j416m222j524r284N885L5p230K983R935Q597j116
13273A8656n985j770o749J952m290m735R462R519R217k020n089o444L444k572
13259A2596K774O556r30q155q919J4536J5306q25n615k61J885q473m827Q551r333
13244A4866q870l635p494K834K185j0407M992P192n313l48k156m690J820R030
$$ plain form
13230 6 -885 1548 14578 23545 25694 27648 31589 37305 32303 24584 13990 7773 8754 9762 11472
13215 11472 13665 17863 16149 11031 20904 17051 10501 7218 6664 15462 23694 11542 5168 11191
13201 11191 14534 13161 13076 12893 9322 9072 22612 24184 23913 21144 19650 22193 5746 -2062 -4522
13186 -4522 2231 71 4912 1566 -4841 -6813 -11030 -14834 -16400 -7009 -1889 8456 5505 3050
13172 3050 7085 9160 1504 1731 4116 7923 7188 15443 20717 24106 21562 16254 11880 14477 35673
13157 35673 37064 40620 43275 50239 51298 34569 22900 22094 14108 2776 -1543 -8898 -16820 8613
13143 8613 20194 24047 8930 -10250 -8635 -4820 4710 8543 2068 9797 14093 5576 1914 4842
13129 4842 10410 5244 6975 -932 -7590 8644 12377 9896 924 -3197 -1178 1947 1414 8584 18878
$$ packed form
13230Fq91K433J3030Q967K149J954L941N716n002p719j0594o217R81J008J710
13215A1472K193M198j714n118R873l853o550l283n54Q798Q232j2152o374O023
13201A1191L343j373q5j83l571k50J3540J572k71k769j494K543j6447p808k460
13186d522O753k160M841l346o407j972m217l804j566R391N120J0345k951k455
13172C050M035K075p656K27K385L807p35Q255N274L389k544n308m374K597K1196
13157C5673J391L556K655O964J059j6729j1669q06p986j1332m319p355p922K5433
13143H613J1581L853j5117j9180J615L815R530L833o475P729M296q517l662K928
13129D842N568n166J731p907o658J6234L733k481q972m121K019L125n33P170J0294
$$ plain form
13114 18878 19070 25699 43100 44348 41198 37262 27660 16461 27685 37521 31099 20840 14393 5235
13100 5235 6868 8857 7399 13040 17683 15706 6343 2629 -1415 -137 1294 -488 9682 25498
13086 25498 22427 14664 5355 9299 8720 3330 3341 4511 289 -4619 -893 643 3205 3954 7283
13071 7283 7172 5835 16006 24843 25470 26515 28516 28421 25537 16287 7002 343 -5640 -4509 -1651
13056 -1651 2909 -133 -1985 8602 14811 23509 25192 29783 29789 18802 8955 2484 9679 16915 16118
13041 16118 7339 4117 -4208 -8689 -10116 -97 11648 20941 20816 26769 21693 8641 1793 6912
13027 6912 13174 10965 2746 1802 1924 8279 -632 -7424 -477 5088 7609 -1151 2338 6198 1529
13012 1529 -2544 -6458 3173 5215 -3309 -8260 -2998 -76 4212 -2176 -212 1983 10313 11114 7116
$$ packed form
13114A8878J92O629J7401J248l150l936r602j1199J1224R836o422j0259o447r158
13100E235J633J989j458N641M643j977r363l714m044J278J431j782J0170J5816
13086B5498l071p763r309L944n79n390J1J170m222m908L726J536K562P49L329
13071G283j11j337J0171Q837O27J045K001r5k884r250r285o659n983J131K858
13056a651M560l042j852J0587O209Q698J683M591Oj0987r847o471P195P236p97
13041A6118q779l222q325m481j427J0019J1745R293j25N953n076j3052o848N119
13027F912O262k209q219r44J22O355q911o792O947N565K521q760L489L860m669
13012A529m073l914R631K042q524m951N262K922M288o388J964K195Q330Q01l998
$$ plain form
12997 7116 10690 17141 12602 4162 11618 18016 13764 12203 14335 9057 11669 9335 4915 12661 5996
12982 5996 729 2329 4305 3823 879 2368 3235 154 5475 4082 2605 1706 -13590 -19998 -6947
12967 -6947 -3923 -5551 -2968 -4514 6958 14527 20519 21898 21782 17066 3081 4295 10330 9710 11691
12952 11691 9517 11133 3687 5578 10456 10178 12805 19005 23866 15118 6167 1168 -513 6248 4668
12937 4668 3009 5001 3008 5223 14758 21392 12228 10666 18501 14713 18010 17316 3763 2211 6785
12922 6785 7608 8525 13851 14552 12345 11103 7717 -531 2528 10637 15872 13665 16723 17119 14386 8525
12906 8525 7771 13581 21493 16891 16455 17231 23251 18206 17204 15745 3758 2266 11352 9285 4232
12891 4232 3840 5645 4900 5945 9283 7278 6540 6049 3480 -1784 1627 9073 13101 19089 18425 10131
$$ packed form
12997G116L574O451m539q440P456O398m252j561K132n278K612k334m420P746o665
12982E996n267J600J976m82k944J489Q67l081N321j393j477q99j5296o408J3051
12967f947L024j628K583j546J1472P569N992J379j16m716j3985J214O035o20J981
12952A1691k174J616p446J891M878k78K627O200M861q748q951m999j681O761j580
12937D668j659J992j993K215R535O634r164j562P835l788L297o94j3553j552M574
12922F785Q23R17N326P01k207j242l386q248L059Q109N235k207L058L96k733n861
12906H525p54N810P912m602m36P76O020n045j002j459j1987j492R086k067n053
12891D232l92J805p45J045L338k005p38m91k569n264L411P446M028N988o64q294
$$ plain form
12875 10131 8322 17951 21316 20114 25945 23861 12479 385 2024 12115 18183 11786 7388 4654
12861 4654 6343 7088 13484 3150 -7039 -433 -588 3432 12009 5064 2837 1939 -3445 -5855 -2380
12846 -2380 10057 19752 11992 9910 8477 8366 7029 2561 7203 1000 4083 2688 1067 2502 5419
12831 5419 10637 14882 13264 15255 15413 23805 19242 18339 18413 15083 8454 7818 13207 15765 10057 21347
12815 21347 23032 18230 18879 13445 12370 17432 11178 7454 13129 15094 13245 13651 15994 25542 24477
12800 24477 16908 7847 5401 17476 12922 12833 10384 6399 6879 18267 18292 10297 9213 8549 829
12785 829 3147 3237 4728 -4855 628 6081 14379 13444 15856 14246 19722 8843 -8042 -3844 3056
12770 3056 -3280 -5730 -8915 -12715 -9366 -3928 -371 -1968 -7063 -4248 3612 4438 373 -10812 -13258
$$ packed form
12875A0131j809R629L365j202N831k084j1382j2094J639J0091O068o397m398k734
12861D654J689P45O396j0334j0189O606j55M020Q577o945k227q98n384k410L475
12846b380J2437R695p760k082j433j11j337m468M642o203L083j395j621J435K917
12831E419N218M245j618J991J58Q392m563r03P4l330o629o36N389K558n708J1290
12815B1347J685m802O49n434j075N062o254l724N675J965j849M06K343R548j065
12800B4477p569r061k446J2075m554q9k449l985M80J1388K5p995j084o64p720
12785H29K318R0J491r583N483N453Q298r35K412j610N476j0879j6885M198O900
12770C056o336k450l185l800L349N438L557j597n095K815P860Q26m065j1185k446
$$ plain form
12755 -13258 -10951 -8848 -3899 14275 18081 17591 12003 977 3770 6285 18662 19460 12756 13306
12741 13306 21205 23103 24296 15248 10682 8321 9510 13745 6544 1378 10380 6390 910 6961
12727 6961 8420 -1373 -7796 -6481 332 4271 3481 5514 2155 7031 11233 16466 16457 14147 19298 16358
12711 16358 9431 19097 25119 16050 19528 11023 9904 23276 29156 23966 28289 29395 33598 56980
12697 56980 78478 70978 52913 37204 23352 21769 33035 37725 42088 41685 31940 29167 20722
12684 20722 17334 8340 2945 3608 9317 15868 15942 3849 -10297 -5171 245 -4153 411 3441 1611
12669 1611 5033 9597 19077 18249 19039 29326 24848 15787 15403 18516 9533 9699 15878 16483 7519 4733
12653 4733 9566 10777 7101 11756 12609 6261 8647 10616 10445 6048 2277 6258 15127 21714 24519
$$ packed form
12755a3258K307K103M949J8174L806m90n588j1026K793K515J2377P98o704N50
12741A3306P899J898J193r048m566k361J189M235p201n166R002l990n480O051
12727F961J459r793o423J315O813L939p90K033l359M876M202N233rk310N151k940
12711A6358o927R666O022r069L478q505j119J3372N880n190M323J106M203K3382
12697E6980K1498p500j8065j5709j3852j583J1266M690M363m03r745k773q445
12684B0722l388q994n395O63N709O551P4j2093j4146N126N416m398M564L030j830
12669A611L422M564R480q28P90J0287m478r061l84L113q983J66O179O05q964k786
12653D733M833J211l676M655Q53o348K386J969j71m397l771L981Q869O587K805
$$ plain form
12638 24519 21420 15752 9709 11315 10695 16704 24812 24069 15206 10143 6014 10154 21230 21770 16746
12623 16746 23209 22400 14643 8283 4646 14170 17650 13906 9877 164 -1054 225 -9478 -8361 -6158
12608 -6158 -2042 -5842 -8037 -3365 -3423 2283 7062 5775 4365 7022 14828 8765 6875 12086 11383
12593 11383 14691 27704 34778 31647 26928 25627 15955 14725 21747 15130 15833 18837 21702 26435
12579 26435 23790 18724 14885 19127 11676 6838 17448 26046 27498 30508 24643 13511 1306 4493
12565 4493 13084 17560 18713 16998 13094 14315 15027 16592 16040 13810 9645 1449 3121 2992 7286
12550 7286 14466 15485 15020 18338 17874 12033 5900 -2579 680 10120 10573 3799 5669 7871 9587
12535 9587 12456 7484 11950 9839 9662 9738 16040 13918 10181 5763 10733 20759 20109 14310 9555
$$ packed form
12638B4519l099n668o043J606o20O009Q108p43q863n063m129M140J1076N40n024
12623A6746O463q09p757o360l637R524L480l744m029r713j218J279r703J117K203
12608f158M116l800k195M672n8N706M779j287j410K657P806o063j890N211p03
12593A1383L308J3013P074l131m719j301r672j230P022o617P03L004K865M733
12579B6435k645n066l839M242p451m838J0610Q598J452L010n865j1132j2205L187
12565D493Q591M476J153j715l904J221P12J565n52k230m165q196J672j29M294
12550G286P180J019m65L318m64n841o133q479L259R440M53o774J870K202J716
12535I587K869m972M466k111j77P6O302k122l737m418M970J0026o50n799m755
$$ plain form
12520 9555 2344 5404 8999 12799 17563 16873 17133 11418 13558 13709 17314 15199 15140 23521 27980 24261
12504 24261 16515 8867 10673 26753 30043 34004 28727 17837 17911 16702 21085 24752 21068 17287
12490 17287 15947 22526 22722 15751 11978 11335 13017 18142 24172 22705 27148 37902 38849 27680 19848
12475 19848 4470 -2083 5162 12002 10705 17298 19473 14387 25325 28444 33348 34960 38582 33269
12461 33269 33390 35813 26621 11426 4311 -769 4763 12592 9461 6479 12115 15542 24632 28944
12447 28944 26917 22813 23161 31356 28445 28240 26029 28255 28710 15875 8972 22680 30983 16961
12433 16961 17999 22123 33080 29965 11276 4353 15918 23417 30654 25088 22160 24692 23390 19009
12419 19009 15353 17763 24584 29002 32570 30671 28693 23656 15157 7966 11289 13462 22696 22490 14638
$$ packed form
12520I555p211L060L595L800M764o90K60n715K140J51L605k115n9Q381M459l719
12504B4261p746p648J806J6080L290L961n277j0890P4j209M383L667l684l781
12490A7287j340O579J96o971l773o43J682N125O030j467M443J0754R47j1169p832
12475A9848j5378o553P245O840j297O593K175n086J0938L119M904J612L622n313
12461C3269J21K423r192j5195p115n080N532P829l131k982N636L427R090M312
12447B8944k027m104L48Q195k911k05k211K226M55j2835o903J3708Q303j4022
12433A6961J038M124J0957l115j8689o923J1565P499P237n566k928K532j302m381
12419A9009l656K410O821M418L568j899j978n037q499p191L323K173R234k06p852
$$ plain form
12404 14638 9739 7208 6825 10894 7141 12048 20049 22788 13197 3808 12683 28127 30785 19821
12390 19821 23897 25963 21950 21578 25242 27241 16497 18866 25894 35632 30790 28647 23759 10618
12376 10618 10700 11200 10153 18455 27493 28451 25121 16510 15241 14417 13808 24389 21951 14642 7547 5722
12360 5722 6824 12853 10138 11528 7720 9748 17384 11761 19110 27823 16657 9432 16119 13937
12346 13937 16634 21998 29157 21850 7967 -339 -381 -610 11992 22805 28630 19460 16145 18091
12332 18091 20420 16427 11959 9830 5023 4906 -2110 -6923 12 3519 -1036 5336 12572 23521
12318 23521 21575 6396 -23 -2986 1850 4007 4001 3294 7901 8094 14791 16843 11491 4320 11542
12303 11542 6505 6348 12644 14719 14481 14509 19545 19386 22658 18578 12151 15371 14244 19596 28650 33348
$$ packed form
12404A4638m899k531l83M069l753M907Q001K739r591r389Q875J5444K658j0964
12390A9821M076K066m013l72L664J999j0744K369P028R738m842k143m888j3141
12376A0618Q2N00j047Q302R038R58l330q611j269q24o09J0581k438p309p095j825
12360E722J102O029k715J390l808K028P636n623P349Q713j1166p225O687k182
12346A3937K697N364P159p307j3883q306m2k29J2602J0813N825r170l315J946
12332A8091K329l993m468k129m807j17p016m813O935L507m555O372P236J0949
12318B3521j946j5179o419k963M836K157op07M607J93O697K052n352p171P222
12303A1542n037j57O296K075k38K8N036j59L272m080o427L220j127N352R054M698
$$ plain form
12287 33348 30416 33556 34925 34519 38359 29777 25264 24438 18782 11761 16772 19815 25108 19842 22535
12272 22535 19886 19395 20657 25234 24780 14624 14160 13966 11638 14836 13291 14729 16234 19937 29606
12257 29606 35355 35500 23290 13100 12778 17745 20876 25901 32582 38416 33626 27416 30387 30302 21572
12242 21572 20298 20953 24535 33983 34728 30513 27507 28961 29885 31598 36416 29587 22160 23376 27214
12227 27214 20726 25348 30368 25137 27353 39645 32045 26584 20202 12807 21692 11287 5839 14915
12213 14915 16514 9610 15551 26282 21433 13695 15501 10282 6328 13370 18214 9245 5461 2724
12199 2724 13235 16030 15273 17864 18843 6745 -258 4427 16255 21934 25603 31391 18930 17660
12185 17660 23268 20910 19726 17522 24940 29634 32606 30687 21787 29724 36072 30057 16956 5306
$$ packed form
12287C3348k932L140J369m06L840q582m513q26n656p021N011L043N293n266K693
12272B2535k649m91J262M577m54j0156m64j94k328L198j545J438J505L703R669
12257B9606N749J45j2210j0190l22M967L131N025O681N834m790o210K971q5q730
12242B1572j274O55L582R448P45m215l006J454R24J713M818o829p427J216L838
12227B7214o488M622N020n231K216J2292p600n461o382p395Q885j0405n448R076
12213A4915J599o904N941J0731m849p738J806n219l954P042M844q969l784k737
12199B724J0511K795p57K591R79j2098p003M685J1828N679L669N788j2461j270
12185A7660N608k358j184k204P418M694K972j919q900P937O348o015j3101j1650
$$ plain form
12171 5306 7308 15508 25305 28097 34189 31750 27665 31907 33473 29335 24847 14398 19992 23828
12157 23828 23521 23791 23602 19855 13820 6873 2926 6756 11513 8423 9053 20897 27671 28346 31125
12142 31125 26710 14014 15295 23072 21542 20165 7991 1087 7644 9929 16228 16755 17672 17309 22660
12127 22660 24527 17708 15373 17377 29224 34833 35358 32151 28948 25046 21297 23517 21818 12980
12113 12980 7860 9896 8833 9338 20307 24994 29856 28576 27903 30867 26401 28982 32669 41319 38064
12098 38064 32808 29782 17667 20584 27448 37423 39456 36886 40317 35051 21827 16632 23855 33952
12084 33952 32650 28459 18108 17568 17146 23634 21927 20880 33326 37074 32162 27356 29898 27591
12070 27591 23874 18993 21410 27214 26661 33466 38404 47836 39980 24047 17119 16924 18173 19452 29102
$$ packed form
12171E306K002Q200R797K792O092k439m085M242J566m138m488j0449N594L836
12157B3828l07K70j89l747o035o947l947L830M757l090O30J1844O774O75K779
12142C1125m415j2696J281P777j530j377j2174o904O557K285O299N27R17l63N351
12127B2660J867o819k335K004J1847N609N25l207l203l902l749K220j699q838
12113A2980n120K036j063N05J0969M687M862j280o73K964m466K581L687Q650l255
12098C8064n256l026j2115K917O864R975K033k570L431n266j3224n195P223J0097
12084C3952j302m191j0351n40m22O488j707j047J2446L748m912m806K542k307
12070B7591l717m881K417N804n53O805M938R432p856j5933o928j95J249J279R650
$$ plain form
12055 29102 15491 5335 4374 16070 24188 26264 22970 30188 33029 21784 23351 28885 32950 28649
12041 28649 18938 24095 27605 26833 21531 15292 20128 21835 20600 16362 19216 19640 25317 28695 20475
12026 20475 23640 26166 22420 21767 20484 30347 31631 25131 16389 11918 19861 21693 14715 21603 33367
12011 33367 32676 17114 8129 14158 28823 32611 25729 18088 16528 30098 39458 41585 41028 37359
11997 37359 25525 25119 21048 15516 12791 15625 21356 28219 27216 26537 35256 39837 39286 50518 61015
11982 61015 54565 46439 34587 32895 23544 18656 27930 34002 31359 28005 39270 34640 23638 13371
11968 13371 15234 24754 33013 25284 21317 19087 25832 31498 34019 32901 29591 17604 16271 18930
11954 18930 27841 32647 28972 33792 33193 25087 27587 29670 29717 26448 34766 32901 29912 26889 24343
$$ packed form
12055B9102j3611j0156r61J1696Q118K076l294P218K841j1245J567N534M065m301
12041B8649r711N157L510p72n302o239M836J707j235m238K854M24N677L378q220
12026B0475L165K526l746o53j283R863J284o500q742m471P943J832o978O888J1764
12011C3367o91j5562q985O029J4665L788o882p641j560J3570R360K127n57l669
11997C7359j1834m06m071n532k725K834N731O863j003o79Q719M581n51J1232J0497
11982F1015o450q126j1852j692r351m888R274O072k643l354J1265m630j1002j0267
11968A3371J863R520Q259p729l967k230O745N666K521j118l310j1987j333K659
11954A8930Q911M806l675M820n99q106K500K083M7l269Q318j865k989l023k546
$$ plain form
11939 24343 31245 35731 28625 26745 22730 20239 21520 25569 25122 18161 22603 31241 32912 27674 25675
11924 25675 22060 27035 40200 44197 42536 47123 47136 37177 27031 27548 27024 25240 24543 30700 36654
11909 36654 31391 24421 23082 24019 24158 21751 24129 23402 26157 34091 38515 42116 40922 25721 16524
11894 16524 13990 19739 27569 33690 45864 40874 41182 40547 36186 37434 35512 33695 41211 37973 39188
11879 39188 41870 37427 36710 33620 25967 22745 32388 37879 33157 29178 19335 16277 17704 22143 31831
11864 31831 44418 44108 32979 24970 19388 18771 21923 22504 27907 24519 17155 31882 47006 52847
11850 52847 46285 42001 44522 43353 43711 49567 45749 31585 29343 28421 24476 29122 34350 44247 40560
11835 40560 42061 38539 37264 39279 37222 36333 32703 26815 31454 34564 31845 30450 42880 42622 26872
$$ packed form
11939B4343O902M486p106j880m015k491J281M049m47o961M442Q638J671n238j999
11924B5675l615M975J3165L997j661M587J3r959j0146N17n24j784o97O157N954
11909C6654n263o970j339R37J39k407K378p27K755P934M424L601j194j5201r197
11894A6524k534N749P830O121J2174m990L08o35m361J248j922j817P516l238J215
11879C9188K682m443p17l090p653l222R643N491m722l979r843l058J427M439R688
11864C1831J2587l10j1129q009n582o17L152N81N403l388p364J4727J5124N841
11850E2847o562m284K521j169L58N856l818j4164k242r22l945M646N228R897l687
11835D0560J501l522j275K015k057q89l630n888M639L110k719j395J2430k58j5750
$$ plain form
11820 26872 20840 12497 17115 21159 26080 27007 21630 25174 32076 29154 26671 34777 31948 32227 22985
11805 22985 19095 27012 34807 35875 46635 41851 31878 36262 33028 34954 35321 39493 45821 49656
11791 49656 44888 41320 33379 24047 28937 26900 27940 23938 27456 35304 33735 37151 34868 25182
11777 25182 18719 21862 38319 52287 51359 46124 43111 33144 35405 30397 21238 16848 17973 16463
11763 16463 15257 15783 22844 40266 50945 46355 40417 44595 36543 31763 32692 39332 47328 42853
11749 42853 43286 42294 45643 44028 44420 44699 44043 30743 26152 29632 36229 34019 35863 37851 37863 35165
11733 35165 36634 39393 39682 40120 43157 43647 42961 45277 38067 29729 38284 46091 38493 40474 42995
11718 42995 41699 41894 40875 39949 37595 33105 36391 41425 44042 42920 44214 41965 39323 38534 33403
$$ packed form
11820B6872o032q343M618M044M921R27n377L544O902k922k483Q106k829K79r242
11805B2985l890P917P795J068J0760m784r973M384l234J926L67M172O328L835
11791D9656m768l568p941r332M890k037J040m002L518P848j569L416k283r686
11777B5182o463L143J6457J3968r28n235l013r967K261n008r159m390J125j510
11763A6463j206N26P061J7422J0679m590n938M178q052m780R29O640P996m475
11749D2853M33r92L349j615L92K79o56j3300m591L480O597k210J844J988J2k698
11733C5165J469K759K89M38L037M90o86K316p210q338Q555P807p598J981K521
11718D2995j296J95j019r26k354m490L286N034K617j122J294k249k642p89n131
$$ plain form
11703 33403 29258 32686 40503 41608 43820 48932 44671 36869 29539 28265 35131 26277 25874 23640 29548
11688 29548 35709 35412 41471 38016 38223 42005 45994 41815 47129 51053 49066 54057 54409 49760 40526
11673 40526 35505 41719 39480 30852 37609 36499 27685 22983 29786 30809 28912 29915 28495 36118
11659 36118 45072 54587 49822 37939 40553 49950 40247 35538 37201 37956 39111 42439 48676 47513
11645 47513 53453 53963 43315 32962 31704 40790 32878 29794 36489 33054 27164 22358 30934 32807
11631 32807 32828 37375 44851 53688 51922 45353 36164 34182 37761 35010 31221 31781 34863 39293 37392
11616 37392 38877 42035 36951 31275 33457 33566 35766 38387 28362 24965 27841 39562 48546 48969
11602 48969 47359 43000 46573 47021 46706 49168 51639 53217 48435 52078 50196 45332 35727 23572 29859
$$ packed form
11703C3403m145L428P817J105K212N112m261p802p330j274O866q854m03k234N908
11688B9548O161k97O059l455K07L782L989m179N314L924j987M991L52m649r234
11673D0526n021O214k239q628O757j110q814m702O803J023j897J003j420P623
11659C6118Q954R515m765j1883K614R397r703m709J663P55J155L328O237j163
11645D7513N940N10j0648j0353j258R086p912l084O695l435n890m806Q576J873
11631C2807K1M547P476Q837j766o569r189j982L579k751l789N60L082M430j901
11616C7392J485L158n084n676K182J09K200K621j0025l397K876J1721Q984M23
11602D8969j610m359L573M48l15K462K471J578m782L643j882m864r605j2155O287
$$ plain form
11587 29859 44058 40370 37091 41029 38464 42764 49812 50899 49901 45806 47856 50742 50246 50281 45448
11572 45448 40750 40373 43913 50963 51161 45901 45259 42910 45288 44555 49292 48892 52864 58874 57823 61825
11556 61825 66914 66539 64933 56292 57151 60394 57660 50352 55204 58723 55841 47663 55001 63258 54673
11541 54673 59200 67571 58664 58504 58582 58921 54192 51919 56059 54066 57255 61054 49970 33803 39115
11526 39115 49414 49635 38300 32475 44453 41517 39531 46726 50988 52873 52390 51824 62658 71972
11512 71972 84607 79823 73602 59009 53639 59223 69113 72025 66967 54592 52130 48034 48750 59204
11498 59204 60875 53094 46187 45208 51601 63429 64114 63464 58198 56378 63646 73979 71241 62125 69602
11483 69602 74036 72860 64092 64626 64368 66538 66831 79352 85571 77948 71786 74813 76770 69825 72029
$$ packed form
11587B9859J4199l688l279L938k565M300P048J087r98m095K050K886m96L5m833
11572D5448m698l77L540P050J98n260o42k349K378p33M737m00L972O010j051M002
11556F1825N089l75j606q641Q59L243k734p308M852L519k882q178P338Q257q585
11541E4673M527Q371q907j60P8L39m729k273M140j993L189L799j1084j6167N312
11526C9115J0299K21j1335n825J1978k936j986P195M262J885m83n66J0834R314
11512G1972J2635m784o221j4593n370N584R890K912n058j2375k462m096P16J0454
11498E9204J671p781o907r79O393J1828O85o50n266j820P268J0333k738r116P477
11483F9602M434j176q768N34k58K170K93J2521O219p623o162L027J957o945K204
$$ plain form
11468 72029 78488 86713 86363 79963 77650 92857 97212 92196 88546 92933 96059 94038 83742 80692
11454 80692 84352 84785 79639 72906 77832 84541 78952 72482 81471 92918 90355 80961 80344 78330 79733
11439 79733 75295 69709 74563 81887 87400 87040 77737 71788 78270 79463 65910 74706 70263 65477
11425 65477 69605 79732 80786 77956 86347 84923 94621 101995 93948 99760 97097 92861 93934 93961 90160
11410 90160 87192 80047 64397 51787 43864 45452 43768 27854 11223 -3573 -17712 -28242 -30906
11397 -30906 -36677 -47774 -56940 -39422 -24778 -14235 -4211 2421 13672 33057 48855 66052
11385 66052 78174 89703 100570 98398 94633 98448 102832 108698 117272 121347 137929 144314 156491
11372 156491 184579 206205 229900 268857 325183 415592 550073 719628 907064 1117162 1379327
$$ packed form
11468G2029O459Q225l50o400k313J5207M355n016l650M387L126k021j0296l050
11454H0692L660M33n146o733M926O709n589o470Q989J1447k563r394o17k014J403
11439G9733m438n586M854P324N513l60r303n949O482J193j3553Q796m443m786
11425F5477M128J0127J054k830Q391j424R698P374q047N812k663m236J073K7l801
11410I0160k968p145j5650j2610p923J588j684j5914j6631j4796j4139j0530k664
11397c0906n771j1097r166J7518J4644J0543J0024O632J1251J9385J5798J7197
11385F6052J2122J1529J0867k172l765L815M384N866Q574M075J6582O385J2177
11372A56491K8088K1626K3695L8957N6326R0409J34481J69555J87436K10098K62165
$$ plain form
11361 1379327 1678274 1903629 2020815 2181132 2288259 2233400 2056064 1915739 1727567 1425435
11351 1425435 1127818 904364 735591 567709 422075 331998 268000 221670 198797 188341
11341 188341 177007 161312 158071 146395 130308 118401 117458 122323 120254 112351 95614 92589 101549
11328 101549 103266 94820 91712 94597 94673 91449 80999 76250 81352 88420 81290 80461 88710 95531 92336
11313 92336 88201 97019 99904 101795 100002 101728 109685 102553 102004 112827 124867 124762 120015 120288 121112
11298 121112 108710 99766 104298 107605 110172 112755 109228 105954 111438 115205 108185 105463 103219 103977
11284 103977 105262 103935 109042 113104 115747 114349 119856 124560 118771 111155 113943 112103 106190 108726
11270 108726 114298 125010 117097 111811 120658 124220 130566 136159 149906 168438 170465 176667 188651
$$ packed form
11361A379327K98947K25355J17186J60317J07127n4859j77336j40325j88172l02132
11351A425435k97617k23454j68773j67882j45634r0077o3998m6330k2873j0456
11341A88341j1334j5695l241j1676j6087j1907r43M865k069p903j6737l025Q960
11328A01549J717q446l108K885P6l224j0450m749N102P068p130q29Q249O821l195
11313I2336m135Q818K885J891j793J726P957p132n49J0823J2040j05m747K73Q24
11298A21112j2402q944M532L307K567K583l527l274N484L767p020k722k244P58
11284A03977J285j327N107M062K643j398N507M704n789p616K788j840n913K536
11270A08726N572J0712p913n286Q847L562O346N593J3747J8532K027O202J1984
$$ plain form
11257 188651 207156 218687 224100 200529 185384 176670 163159 136153 110292 87269 76638 59968
11245 59968 50791 39327 32734 35748 48675 64439 69360 78423 80883 85509 88271 92302 91563 103638
11231 103638 110740 117864 129479 137418 134991 132870 127669 124667 134013 134686 139861 157934 167643 166995
11217 166995 176363 179575 191591 195451 195421 210523 230030 246465 258971 278621 300409 308516 303291
11204 303291 299101 302042 309851 315246 322845 320958 322420 324230 331513 333492 319806 300711 298678 299218
11190 299218 292848 281956 266067 238789 221317 200258 189590 176885 169588 166148 152626 142489
11178 142489 133446 129575 126406 133653 137734 143423 143698 137000 135633 131431 132347 133098 132184 137592 149905
11163 149905 151873 160206 168643 172075 183814 188104 187004 193177 196569 195125 193240 203346 211299 211656
$$ packed form
11257A88651J8505J1531N413k3571j5145q714j3511k7006k5861k3023j0631j6670
11245E9968r177j1464o593L014J2927J5764M921R063K460M626K762M031p39J2075
11231A03638P102P124J1615P939k427k121n201l002R346O73N175J8073R709o48
11217A66995R368L212J2016L860l0J5102J9507J6435J2506J9650K1788Q107n225
11204C03291m190K941P809N395P599j887J462J810P283J979j3686j9095k033N40
11190B99218o370j0892j5889k7278j7472k1059j0668j2705p297l440j3522j0137
11178A42489r043l871l169P247M081N689K75o698j367m202R16P51r14N408J2313
11163A49905J968Q333Q437L432J1739M290j100O173L392j444j885J0106P953L57
$$ plain form
11149 211656 204708 194145 187269 176879 166774 180212 189402 187068 197086 213748 228374 234618
11137 234618 248016 250871 252702 259311 268731 277017 278836 260093 241548 229977 213462 196773 178101
11124 178101 170711 170126 166884 160793 175962 195293 201342 203096 217261 232478 248151 273118 284382
11111 284382 295510 297487 303881 317893 342152 363921 389130 401836 416359 441505 461157 477270
11099 477270 477948 469345 452281 438078 418934 400026 360108 323159 289683 254825 224642 203453
11087 203453 185514 182404 182378 176963 176405 175810 180673 202853 223414 238386 261719 298116 343857
11074 343857 391925 426812 463847 503621 535177 560961 583657 599372 593353 583778 570501 562986
11062 562986 547965 520660 507260 500808 492091 481023 470914 475410 483953 494178 500567 498022 508236
$$ packed form
11149B11656o948j0563o876j0390j0105J3438R190k334J0018J6662J4626O244
11137B34618J3398K855J831O609R420Q286J819j8743j8545j1571j6515j6689j8672
11124A78101p390n85l242o091J5169J9331O049J754J4165J5217J5673K4967J1264
11111B84382J1128J977O394J4012K4259K1769K5209J2706J4523K5146J9652J6113
11099D77270O78q603j7064j4203j9144j8908l9918l6949l3476l4858l0183k1189
11087B03453j7939l110k6n415n58n95M863K2180K0561J4972K3333L6397M5741
11074C43857M8068L4887L7035L9774L1556K5784K2696J5715o019r575j3277p515
11062E62986j5021k7305j3400o452q717j1068j0109M496Q543J0225O389k545J0214
$$ plain form
11049 508236 516262 532151 539669 536737 545779 554874 569038 586186 585904 592719 608122 616396 631467
11036 631467 649171 648684 654417 656757 657367 662187 670160 673351 682950 695845 715398 724854 735758 752249
11022 752249 763454 774706 788420 807392 828216 844543 860608 877236 903452 923021 947890
11011 947890 968603 999575 1021534 1044267 1081831 1102499 1117267 1132159 1148824 1169892 1201266
11000 1201266 1225539 1254505 1294909 1336761 1358375 1392136 1445740 1485241 1535479 1594830 1650669
10989 1650669 1718434 1806868 1903678 2011189 2125947 2256880 2407639 2579327 2774146 2983047
10979 2983047 3218542 3462722 3739978 4048361 4389300 4783042 5243445 5745520 6278249
10970 6278249 6874588 7572304 8312448 8958546 9614172 10379048 11140715 11858881 12673052
$$ packed form
11049E08236Q026J5889P518k932R042R095J4164J7148k82O815J5403Q274J5071
11036F31467J7704m87N733K340O10M820P973L191R599J2895J9553R456J0904J6491
11022G52249J1205J1252J3714J8972K0824J6327J6065J6628K6216J9569K4869
11011I47890K0713L0972K1959K2733L7564K0668J4768J4892J6665K1068L1374
11000A201266K4273K8966M0404M1852K1614L3761N3604L9501N0238N9351N5839
10989A650669O7765Q8434R6810J07511J14758J30933J50759J71688J94819K08901
10979B983047K35495K44180K77256L08383L40939L93742M60403N02075N32729
10970F278249N96339O97716P40144O46098O55626P64876P61667P18166Q14171
$$ plain form
10961 12673052 13765068 15055182 16596837 18638018 21434761 25204302 30237639 37252309
10953 37252309 47725676 63649535 87529965 119702532 153811030 190082617 238083513
10946 238083513 293681011 334588808 353856480 379770190 399448604 392577532 362131449
10939 362131449 337401385 309548447 259024710 205321253 164501433 132830200 99717156
10932 99717156 71305424 52135853 39822265 31627027 25991150 21852008 18633954 16110581
10924 16110581 14148266 12620934 11429736 10454203 9544900 8790506 8207158 7607449 6908776
10915 6908776 6265146 5718978 5124022 4527702 4038991 3667245 3318852 3007173 2781294
10906 2781294 2602613 2465696 2358820 2280040 2206095 2135431 2054955 1973061 1892880 1825220 1752514
$$ packed form
10961A2673052J092016J290114J541655K041181K796743L769541N033337P014670
10953C7252309J0473367J5923859K3880430L2172567L4108498L6271587M8000896
10946B38083513N5597498M0907797J9267672K5913710J9678414o871072l0446083
10939C62131449k4730064k7852938n0523737n3703457m0819820l1671233l3113044
10932I9717156k8411732j9169571j2313588q195238n635877m139142l218054k523373
10924A6110581j962315j527332j191198r75533r09303p54394n83348n99709o98673
10915F908776o43630n46168n94956n96320m88711l71746l48393l11679k25879
10906B781294j78681j36917j06876p8780p3945p0664q0476q1894q0181o7660p2706
$$ plain form
10895 1752514 1678757 1603517 1525600 1450486 1381260 1311336 1245257 1181046 1123433 1064356 1023774
10884 1023774 981633 942237 901465 855065 806375 769864 733624 695337 664551 637621 619346
10873 619346 596559 571309 559824 549478 541840 532704 525141 512840 501349 502062 486374 476119
10861 476119 482131 481067 488893 525507 588123 662946 745613 841065 942897 1072652 1206488
10850 1206488 1277051 1329888 1386701 1400812 1352864 1261511 1184351 1074638 935834 789527 674364
10839 674364 580968 491318 413453 348770 312839 294680 275649 263118 245379 219840 216651 217166
10827 217166 222767 221626 218468 212451 210538 218863 230617 250845 282468 318850 353402 390054 417831
10814 417831 452956 486635 507367 523314 533870 538903 538356 526511 498093 472387 445639 419634
$$ packed form
10895A752514p3757p5240p7917p5114o9226o9924o6079o4211n7613n9077m0582
10884A023774m2141l9396m0772m6400m8690l6511l6240l8287l0786k6930j8275
10873F19346k2787k5250j1485j0346p638r136p563j2301j1491P13j5688j0255
10861D76119O012j064P826L6614O2616P4823Q2667R5452J01832J29755J33836
10850A206488P0563N2837N6813J4111m7948r1353p7160j09713j38804j46307j15163
10839F74364r3396q9650p7865o4683l5931j8159j9031j2531j7739k5539l189N15
10827B17166N601j141l158o017j913Q325J1754K0228L1623L6382L4552L6652K7777
10814D17831L5125L3679K0732J5947J0556N033n47j1845k8418k5706k6748k6005
$$ plain form
10802 419634 392220 365336 343028 320144 293984 269802 243297 213739 179954 152252 121018
10791 121018 90407 50997 27534 6741 -23961 -56609 -77444 -72007 -64343 -57848 -48754 -47741
10779 -47741 -47368 -30277 -12896 -9404 -4313 8216 15044 16901 27165 45607 54829 67819 83330
10766 83330 95479 104495 113783 119201 112502 102251 88515 80166 71015 44464 26694 10510 1198
10753 1198 -11874 -21720 -21584 -31944 -46788 -47135 -25447 404 10909 17041 28960 34262 34378 26125
10739 26125 30053 26329 22473 18026 20521 3425 -19599 -27472 -24293 -17585 -15663 -24370 -25038 -9022
10725 -9022 2990 2644 8097 24009 28064 29339 36287 44357 39117 29321 37153 52733 63057 64167
10711 64167 49757 44681 40739 41616 47098 41389 36281 37114 36889 27395 23055 18247 21175 23969 29020
$$ packed form
10802D19634k7414k6884k2308k2884k6160k4182k6505k9558l3785k7702l1234
10791A21018l0611l9410k3463k0793l0702l2648k0835N437P664O495R094J013
10779d7741L73J7091J7381L492N091J2529O828J857J0264J8442R222J2990J5511
10766H3330J2149R016R288N418o699j0251j3736q349r151k6551j7770j6184r312
10753A198j3072r846J36j0360j4844l47K1688K5851J0505O132J1919N302J16q253
10739B6125L928l724l856m447K495j7096k3024p873L179O708J922q707o68J6016
10725i022J2012l46N453J5912M055J275O948Q070n240r796P832J5580J0324J110
10711F4167j4410n076l942Q77N482n709n108Q33k25r494m340m808K928K794N051
$$ plain form
10696 29020 34094 25104 13876 13409 21624 20021 20353 9039 1036 4107 10819 9822 6042 -2198 -4230
10681 -4230 2911 4847 22312 26224 15450 14911 11504 11498 17415 26287 17004 522 -6484 -5450 1521
10666 1521 -2613 6753 22002 24904 22867 17130 13576 7295 4265 4842 12544 15226 17257 25209 34726
10651 34726 41353 36457 30996 36986 43127 47857 54544 64305 83819 101964 103064 106217 111711 105707
10637 105707 88346 57480 31553 -3685 -47695 -74109 -97079 -117196 -131513 -130147 -130853 -131251
10625 -131251 -123274 -103287 -84818 -63755 -45649 -41608 -31296 -22693 -13812 -8472 -12669 -15774 -16682
10612 -16682 -25993 -29594 -29319 -29666 -28588 -29420 -25137 -26404 -31043 -33041 -16678 -9035 -18217 -7879 -1789
10597 -1789 -5831 -10051 -9931 -13918 -12912 -9026 -8386 -10584 -15764 -11704 -12139 -24486 -32953 -32729 -28433
$$ packed form
10696B9020N074q990j1228m67Q215j603L32j1314q003L071O712r97l780q240k032
10681d230P141J936J7465L912j0774n39l407oN917Q872r283j6482p006J034O971
10666A521m134R366J5249K902k037n737l554o281l030N77P702K682K031P952R517
10651C4726O627m896n461N990O141M730O687R761J9514J8145J100L153N494o004
10637A05707j7361l0866k5927l5238m4010k6414k2970k0117j4317J366p06l98
10625a31251P977J9987J8469K1063J8106M041J0312Q603Q881N340m197l105r08
10612a6682r311l601K75l47J078q32M283j267m639j998J6363P643r182J0338O090
10597a789m042m220J20l987J006L886O40k198n180M060m35j2347q467K24M296
$$ plain form
10582 -28433 -28207 -23990 -21074 -18362 -13383 -8484 -4261 -647 2625 -6255 -7788 5313 20258 36468
10568 36468 50394 83439 116180 138487 141214 133425 129690 137794 149203 155803 144435 122510 100768
10555 100768 80848 72470 60416 51607 48253 44539 46024 51963 52222 41829 36144 41827 44994 49477
10541 49477 54679 61536 72058 84993 100273 116301 134310 165532 205304 259198 351563 479732
10529 479732 642409 825401 1039265 1320056 1634534 1854034 1983315 2148231 2238557 2166690
10519 2166690 1989228 1852228 1670738 1377834 1090442 880937 698630 509184 371894
10510 371894 283631 235079 203108 173786 148975 136805 129623 130737 131114 129491 120395 108736 115489
10497 115489 119399 127045 131364 147036 169122 185423 187419 176657 176683 187758 194403 206314 224896
$$ packed form
10582b8433K26M217K916K712M979M899M223L614L272q880j533J3101J4945J6210
10568C6468J3926L3045L2741K2307K727p789l735Q104J1409O600j1368k1925k1742
10555A00768j9920q378j2054q809l354l714J485N939K59j0393n685N683L167M483
10541D9477N202O857J0522J2935J5280J6028J8009L1222L9772N3894R2365J28169
10529D79732J62677J82992K13864K80791L14478K19500J29281J64916R0326p1867
10519B166690j77462j37000j81490k92904k87392k09505j82307j89446j37290
10510C71894q8263m8552l1971k9322k4811j2170p182J114L77j623r096j1659O753
10497A15489L910P646M319J5672K2086J6301J996j0762K6J1075O645J1911J8582
$$ plain form
10484 224896 221551 203200 182004 158346 113815 80186 62158 43389 24562 4274 -1540 5007
10472 5007 4064 -1550 -7299 -3268 -6145 -16080 -22098 -27178 -25056 -18859 -9985 -4056 5160 7324 7768
10457 7768 -8173 -22853 -8308 11335 23127 16594 4268 -6406 -10411 -7911 -789 -2469 -1463
10444 -1463 -5690 -7341 -13072 -17648 -22238 -20029 -19043 -16846 -16387 -18201 -20153 -15010 -2260 1055 -3431
10429 -3431 -11615 -9542 -1368 -10651 -15530 -17859 -26108 -30478 -32310 -31792 -17314 -8010 -13687 -16354 -17291
10414 -17291 -12522 -16775 -24781 -19701 -19888 -33678 -36968 -25370 -17341 -15214 -13381 -11746 -14165 -15489
10400 -15489 -21014 -25396 -25526 -17705 -13749 -8653 -11282 -1098 11128 12513 3097 2174 8587 19141
10386 19141 19175 15638 13034 5345 -5435 -12456 -8560 -2810 3368 -256 -15375 -16531 -19978 -19172 -12108
$$ packed form
10484B24896l345j8351k1196k3658m4531l3629j8028j8769j8827k0288n814O547
10472E007r43n614n749M031k877r935o018n080K122O197Q874N929R216K164M44
10457G768j5941j4680J4545J9643J1792o533j2326j0674m005K500P122j680J006
10444a463m227j651n731m576m590K209R86K197M59j814j952N143J2750L315m486
10429c431q184K073Q174r283m879k329q249m370j832N18J4478R304n677k667r37
10414a7291M769m253q006N080j87j3790l290J1598Q029K127J833J635k419j324
10400a5489n525m382j30P821L956N096k629J0184J2226J385r416r23O413J0554
10386A9141L4l537k604p689j0780p021L896N750O178l624j5119j156l447Q06P064
$$ plain form
10371 -12108 -14286 -25657 -25623 -25266 -18549 -6735 -4070 -3664 -6410 -3355 -6396 -11470 -21412 -19606 -18613
10356 -18613 -19018 -22268 -17681 -20645 -21711 -23957 -23974 -13255 -11481 -18928 -17253 -10983 -6056 -6381 -9844
10341 -9844 -122 3528 406 -6057 -15221 -17823 -20121 -13355 -9677 -19384 -9845 -6370 -21195 -21521 -17422
10326 -17422 -12846 -13266 -20645 -15165 -11721 -13759 -19024 -9715 -5900 -8253 2733 2827 -366 4158 11265
10311 11265 3063 3542 18373 29130 28021 29441 23042 15598 19766 15785 5661 3782 16158 11726
10297 11726 -5121 -7518 -9578 -11011 -7485 -11554 -22777 -27937 -20066 -20720 -20548 -22880 -19622 -12527
10283 -12527 -9443 -6140 -6210 -12389 -9048 -9687 -19193 -17406 -15205 -10595 -14586 -16748 -9790 -8933 -11829
10268 -11829 -11124 -10448 -8774 -2743 -1716 -2169 -2625 -2365 985 -1435 546 -2548 -4316 -1224 415 -11260
$$ packed form
10371a2108k178j1371L4L57O717J1814K665M06k746L055l041n074r942J806R93
10356a8613m05l250M587k964j066k246j7J0719J774p447J675O270M927l25l463
10341i844R722L650l122o463r164k602k298O766L678r707R539L475j4825l26M099
10326a7422M576m20p379N480L444k038n265R309L815k353J0986R4l193M524P107
10311A1265q202M79J4831J0757j109J420o399p444M168l981j0124j879J2376m432
10297A1726j6847k397k060j433L526m069j1223n160P871o54J72k332L258P095
10283a2527L084L303p0o179L341o39r506J787K201M610l991k162O958Q57k896
10268a1829P05O76J674O031J027m53m56K60L350k420J981l094j768L092J639j1675
$$ plain form
10252 -11260 -16683 -8891 6500 2602 -1530 -10697 -13649 -13632 -16626 -12386 -13169 -19442 -17168 -20780 -19435
10237 -19435 -16094 -18421 -20120 -18924 -15834 -8889 -10046 -6555 -10846 -16840 -11885 -13738 -19191 -15106
10223 -15106 -12083 -9937 -11105 -13744 -21975 -21345 -22699 -19789 -10463 -9008 -8913 -11715 -23348 -29464 -32122
10208 -32122 -22158 -12725 -12621 -9898 -19846 -31485 -31048 -28743 -20904 -17555 -22532 -16223 -21366 -16766 -13309
10193 -13309 -23113 -18262 -18017 -22348 -19107 -9842 -3890 -6243 -6445 -3017 -2873 -2705 -4515 -6449 -6627 -20517
10177 -20517 -25219 -22181 -21864 -20421 -18979 -7438 -3384 -13739 -16985 -10861 -14883 -22359 -23769 -22480
10163 -22480 -16061 -6456 -11037 -18373 -13769 -8226 -12989 -6714 -15422 -27505 -23443 -13737 -14399 -26165
10149 -26165 -27009 -22356 -19009 -20689 -24865 -18512 -7634 -6541 -15444 -16550 -16883 -13761 -10768 -7529 -4643
$$ packed form
10252a1260n423P792J5391l898m132r167k952J7k994M240p83o273K274l612J345
10237a9435L341k327j699J196L090O945j157L491m291n994M955j853n453M085
10223a5106L023K146j168k639q231O30j354K910R326J455R5k802j1633o116k658
10208c2122R964R433J04K723r948j1639M37K305P839L349m977O309n143M600L457
10193a3309r804M851K45m331L241R265N952k353k02L428J44J68j810j934j78j3890
10177b0517m702L038L17J443J442J1541M054j0355l246O124m022p476j410J289
10163b2480O419R605m581p336M604N543m763O275q708j2083M062R706o62j1766
10149b6165q44M653L347j680m176O353J0878J093q903j106l33L122K993L239K886
$$ plain form
10134 -4643 -5096 -10524 -11389 -16047 -17243 -11547 -16916 -13459 -10933 -13860 -13125 -17715 -15325 -17515 -22664
10119 -22664 -17753 -15468 -5497 -5917 -4088 -1408 -5420 -2997 -6138 -15581 -15983 -17453 -21595 -24868 -34915
10104 -34915 -36948 -28033 -16998 -11591 -20136 -13722 -7918 -5169 4215 -810 -7939 -8310 -8253 2501 1320
10089 1320 -6962 -2399 -887 -2670 -6314 -11637 -9819 -6747 -8992 -16734 -13440 -14817 -15833 -21429 -26992
10074 -26992 -20432 -14635 -10633 -8872 -15749 -15678 -10910 -5964 -7923 -1805 -492 1599 -5355 -8551 -6518
10059 -6518 -7341 -3838 -436 2677 3232 4103 1036 -5996 1511 11974 32429 56527 101676 167477
10045 167477 144343 84607 41848 18265 7994 -6080 -6308 5519 2759 384 757 -1792 7496
10032 7496 -1076 -2990 -9848 -9369 -7546 -5471 -1739 -9122 -7803 -24594 -31168 -23242 -13644 -14734 -13335
$$ packed form
10134d643m53n428q65m658j196N696n369L457K526k927P35m590K390k190n149
10119b2664M911K285R971m20J829K680m012K423l141r443m02j470m142l273j0047
10104c4915k033Q915J1035N407q545O414N804K749R384n025p129l71N7J0754j181
10089A320q282M563J512j783l644n323J818L072k245p742L294j377j016n596n563
10074b6992O560N797M002J761o877P1M768M946j959O118J313K091o954l196K033
10059f518q23L503L402L113N55Q71l067p032P507J0463K0455K4098M5149O5801
10045A67477k3134n9736m2759k3583j0271j4074k28J1827k760k375L73k549R288
10032G496q572j914o858M79J823K075L732p383J319j6791o574P926R598j090J399
$$ plain form
10017 -13335 -7518 -913 -7991 -5123 375 650 -12229 -20288 -25031 -20078 -19815 -17994 -13695 -6492 -12909
10002 -12909 -9913 -12037 -14326 -24824 -29400 -27433 -24729 -24278 -16225 -11244 -12568 -12288 -22 621 11670
9987 11670 17966 9610 -1780 -4850 -7103 -5324 -5379 -4845 -15215 -23895 -20606 -18202 -13419 -9601 1925
9972 1925 2763 -2957 -11955 -8871 -8963 -11300 -11840 -11112 -12425 -17248 -26881 -32840 -19719 -15278 -25684 -22642
9956 -22642 -16071 -14368 -19354 -19047 -12416 -7546 -5787 -9540 -13348 -11011 -15539 -23306 -22906 -15352 -11820
9941 -11820 -13899 -10856 1846 4581 15478 46422 100854 180467 246763 199730 120965 59820
9929 59820 31243 15156 2776 -354 -3015 -5441 1726 -2277 -1217 -6987 -12128 -10254 3885 11233
9915 11233 5785 7640 12443 9444 389 12581 33900 56834 74751 81759 73795 51967 29455
$$ packed form
10017a3335N817O605p078K868N498K75j2879q059m743M953K63J821M299P203o417
10002a2909K996k124k289j0498m576J967K704M51Q053M981j324K80J2266O43J1049
9987A1670O296q356j1390l070k253J779n5N34j0370q680L289K404M783L818J1526
9972A925Q38n720q998L084r2k337n40P28j313m823r633n959J3121M441j0406L042
9956b2642O571J703m986L07O631M870J759l753l808K337m528p767M00P554L532
9941a1820k079L043J2702K735J0897L0944N4432P9613O6296m7033p8765o1145
9929E9820k8577j6087j2380l130k661k426P167m003J060n770n141J874J4139P348
9915A1233n448J855M803k999r055J2192K1319K2934J7917P008p964k1828k2512
$$ plain form
9902 29455 13854 7829 3066 -292 4727 4648 4239 4525 8597 6478 461 11104 18689 14325 7228
9887 7228 6593 3206 1927 -7687 2782 3021 6781 -5644 -13872 -12873 -2043 -4710 -9099 -7085 -5800
9872 -5800 -1972 -4445 -4491 6894 11435 2024 -1473 797 5283 5617 -1942 -7896 -14812 -12376 -925
9857 -925 -3091 -10131 -11590 7404 19800 21287 9972 -5425 -3699 14489 40404 66442 98691
9844 98691 138902 140584 104564 63732 26088 3722 2018 8373 176 -5418 -15870 -19107 -9909
9831 -9909 911 -1577 -8407 -16454 -16147 -9076 -2611 -7084 -21337 -26302 -25657 -16706 -14529 -9594 -3610
9816 -3610 149 11145 10718 7734 6210 6789 9325 -635 -445 4975 -6098 -16308 -11828 -8622 -1624
9801 -1624 -2551 -11472 -9557 -6183 -15418 -17040 -4931 1703 -4328 -4884 -3113 -3026 -3115 7030 7561 -3138
$$ packed form
9902B9455j5601o025m763l358N019p9m09K86M072k119o017J0643P585m364p097
9887G228o35l387j279r614J0469K39L760j2425q228R99J0830k667m389K014J285
9872e800L828k473m6J1385M541r411l497K270M486L34p559n954o916K436J1451
9857i25k166p040j459J8994J2396J487j1315j5397J726J8188K5915K6038L2249
9844I8691M0211J682l6020m0832l7644k2366j704O355q197n594j0452l237R198
9831i909J0820k488o830q047L07P071O465m473j4253m965O45Q951K177M935N984
9816c610L759J0996m27k984j524N79K536r960J90N420j1073j0210M480L206O998
9801a624r27q921J915L374r235j622J2109O634o031n56J771Q7q9J0145N31j0699
$$ plain form
9785 -3138 -11481 -13228 -9679 -11030 -10886 -14556 -16574 -6481 -7467 -5603 -9925 -12486 -18413 -25626 -19776
9770 -19776 -15794 -19059 -23497 -21577 -20258 -15193 -17219 -19457 -25056 -25812 -24950 -27629 -19303 -4057 -2816
9755 -2816 -7596 -8093 -7483 -9693 -15961 -29145 -21316 -9339 -13827 -16401 -16032 -9844 -14932 -16339 -17181
9740 -17181 -16718 -15433 -13519 -3127 4852 -905 4062 10730 7857 4635 -5274 -7102 -16134 -25518 -23799
9725 -23799 -9731 -4383 -11752 -15676 -10644 -7825 -5149 -11376 -13011 -5268 -2767 -4165 -7779 -8836
9711 -8836 -8594 -14791 -22099 -25466 -26839 -19101 -14061 -10070 -4805 -3603 -3711 -2840 -1048 -1871 -796 -10295
9695 -10295 -12058 -16073 -18247 -21445 -27107 -21648 1701 5798 3124 1520 8697 2652 6759 12365
9681 12365 7795 2273 -10563 -17578 -13656 -6642 -13579 -19442 -17322 -14297 -11226 -11603 -3198 5125 93
$$ packed form
9785c138q343j747L549j351J44l670k018J0093r86J864m322k561n927p213N850
9770a9776L982l265m438J920J319N065k026k238n599p56Q62k679Q326J5246J241
9755b816m780m97O10k210o268j3184P829J1977m488k574L69O188n088j407q42
9740a7181M63J285J914J0392P979n757M967O668k873l222r909j828r032r384J719
9725b3799J4068N348p369l924N032K819K676o227j635P743K501j398l614j057
9711h836K42o197p308l367j373P738N040L991N265J202j08Q71J792q23J075r499
9695a0295j763m015k174l198n662N459K3349M097k674j604P177o045M107N606
9681A2365m570n522j2836p015L922P014o937n863K120L025L071l77Q405Q323n032
$$ plain form
9666 93 -11130 -13592 -6002 -16323 -14849 -11478 -9870 -7237 -1511 7556 14338 14764 17691 4768 -2605
9651 -2605 -827 -7490 688 5303 3922 692 -416 -6207 -6512 -9710 -14409 -12068 -5131 -1995 5237
9636 5237 10866 11608 1278 -8336 -4103 8489 1182 -7278 -11485 -17657 -14400 -6975 2354 -2478 -8993
9621 -8993 -8451 -11521 1135 12907 7056 416 -3304 -2930 -3692 4363 961 -10719 -14980 -5587 -6777
9606 -6777 -12730 -5656 -4989 -6156 -10803 -7109 -1560 -7846 -11086 -395 4975 5934 -1562 -3312 -5318
9591 -5318 -3209 -7239 -9076 -11174 -4198 1159 -830 -2468 -1139 8373 6094 7961 118 -9285 -12569
9576 -12569 -11136 -3090 221 98 -5277 -9042 -14198 -9868 -3352 4585 9844 5205 5009 -7175 -10113
9561 -10113 -3473 976 -1389 1299 4460 -5503 -14881 -11732 -6707 -438 4557 3476 -3042 -2346 3049
$$ packed form
9666I3j1223k462P590j0321J474L371J608K633N726R067O782M26K927j2923p373
9651b605J778o663Q178M615j381l230j108n791l05l198m699K341O937L136P232
9636E237N629P42j0330r614M233J2592p307q460m207o172L257P425R329m832o515
9621h993N42l070J2656J1772n851o640l720L74p62Q055l402j1680m261R393j190
9606f777n953P074O67j167m647L694N549o286l240J0691N370R59p496j750k006
9591e318K109m030j837k098O976N357j989j638J329R512k279J867p843r403l284
9576a2569J433Q046L311j23n375l765n156M330O516P937N259m639j96j2184k938
9561a0113O640M449k365K688L161r963r378L149N025O269M995j081o518O96N395
$$ plain form
9546 3049 -945 1282 2275 5994 10454 9997 4018 6167 2582 815 2140 4979 956 -13405 -12404
9531 -12404 -4013 -6279 -14505 -15429 -9966 -55 1537 -4511 -3343 2898 1095 266 4342 1210 -11777
9516 -11777 -20908 -27490 -15927 -14907 -18171 -24439 -19976 -12616 -11194 -12257 -16226 -23279 -22027 -25949
9502 -25949 -22572 -16124 -12871 -14522 -10986 -4734 -4645 -2120 -5021 -12703 -11201 -7343 -5895 -9673 -4189
9487 -4189 2664 740 8466 12954 12487 8601 5955 -6853 -18970 -15974 -2625 -679 -5232 4744
9473 4744 12473 7525 6008 -4144 -3994 -1859 -2496 -4486 -1734 566 -4945 -6891 -2960 400 5442
9458 5442 12901 6101 4772 6252 -867 -4773 -10530 -4879 -332 -5938 -10834 -16400 -13457 -9760 373
9443 373 3719 5035 1178 -305 2059 9659 13166 11133 9999 2954 9944 13934 6373 4908 -1683
$$ packed form
9546C049l994K227R93L719M460m57n979K149l585j767J325K839m023j4361J001
9531a2404Q391k266q226r24N463R911J592o048J168O241j803q29M076l132j2987
9516a1777r131o582J1563J020l264o268M463P360J422j063l969p053J252l922
9502b5949L377O448L253j651L536O252Q9K525k901p682J502L858J448l778N484
9487d189O853j924P726M488m67l886k646j2808j2117K996J3349J946m553R976
9473D744P729m948j517j0152J50K135o37j990K752K300n511j946L931L360N042
9458E442P459o800j329J480p119l906n757N651M547n606m896n566K943L697J0133
9443C73L346J316l857j483K364P600L507k033j134p045O990L990p561j465o591
$$ plain form
9428 -1683 -4685 -5100 1784 1115 -4324 -2780 7332 9832 10941 9997 2051 -112 -4935 -11844 -3561
9413 -3561 -974 -2827 -4283 390 -5296 -7956 -7923 -11627 -9103 3902 3907 -3574 5353 3728 9490 14428
9397 14428 12500 5699 -4487 -1659 -4031 4243 3911 1981 7113 5740 576 -3391 -7717 -2863 -4080
9382 -4080 -3515 612 -2392 -13703 -11437 -2165 3373 501 3517 539 -869 -5112 -6714 5315 8981
9367 8981 9204 3430 106 3718 4935 -8804 -19657 -21350 -10932 -6074 7394 16265 18963 13580
9353 13580 12682 5529 -287 1422 10391 3305 3242 16570 23309 25234 23671 28755 23398 8420 3321
9338 3321 10754 16230 14186 9621 5255 6719 2845 596 5585 6858 9524 6201 185 -2770 -1267
9323 -1267 14018 12822 8387 2650 5938 7683 15185 19822 16671 8336 2021 3696 4952 11409 17394
$$ packed form
9428a683l002m15O884o69n439J544J0112K500J109r44p946k163m823o909Q283
9413c561K587j853j456M673n686k660L3l704K524J3005Np481Q927j625N762M938
9397A4428j928o801j0186K828k372Q274l32j930N132j373n164l967m326M854j217
9382d080N65M127l004j1311K266R272N538k872L016k978j408m243j602J2029L666
9367H981K23n774l324L612J217j3739j0853j693J0418M858J3468Q871K698n383
9353A3580q98p153n816J709Q969p086o3J3328O739J925j563N084n357j4978n099
9338C321P433N476k044m565m366J464l874k249M989J273K666l323o016k955J503
9323a267J5285j196m435n737L288J745P502M637l151q335o315J675J256O457N985
$$ plain form
9308 17394 15640 19051 29545 33398 28767 25152 30268 39507 32070 19796 19950 17746 15404 10551
9294 10551 13852 15991 18290 16676 19920 16733 12916 11798 17735 21623 13313 13844 18493 11573 5586
9279 5586 5515 430 4223 6883 6957 6606 8815 3169 4485 9825 4861 -298 -4616 7384 6052 1390
9263 1390 3236 11282 10777 16275 25674 31305 35273 28139 23229 24670 23856 21208 16699 16126 24113 24384
9247 24384 24635 24061 17954 18309 22570 27007 17584 22814 22677 18961 23884 33446 27789 11483 16278
9232 16278 18840 21161 34416 38596 35636 28575 24292 27994 37247 37559 33204 32509 29836 30996 32056
9217 32056 34842 36262 30511 37571 48232 47359 35471 36476 45961 48839 48014 34519 37419 42595
9203 42595 42321 43905 52623 59212 53407 56504 56796 57033 53897 66784 72273 67904 59689 61695 58261
$$ packed form
9308A7394j754L411J0494L853m631l615N116R239p437j2274J54k204k342m853
9294A0551L301K139K299j614L244l187l817j118N937L888q310N31M649o920n987
9279E586p1n085L793K660P4l51K209n646J316N340m964n159m318J2000j332m662
9263A390J846Q046n05N498R399N631L968p134m910J441q14k648m509n73P987K71
9247B4384K51n74o107L55M261M437r423N230j37l716M923R562n657j6306M795
9232A6278K562K321J3255M180k960p061m283L702R253L12m355o95k673J160J060
9217C2056K786J420n751P060J0661q73j1888J005R485K878q25j3495K900N176
9203D2595k74J584Q718O589n805L097K92K37l136J2887N489m369q215K006l434
$$ plain form
9188 58261 50912 54313 57258 52672 51761 49180 47303 49639 50760 56771 54270 51852 59259 71353 77382
9173 77382 79158 75219 68012 60967 58276 69199 74905 72913 71605 74659 74831 84261 96076 100391
9159 100391 99870 96613 93912 105589 111841 102902 105196 108628 112676 115427 120957 133905 134996 130656
9145 130656 128543 136490 142652 144020 146067 152912 161607 172456 182764 185899 182995 193907 201805 216486
9131 216486 234295 237670 229531 231957 235086 235469 237741 249361 261530 283169 301277 318789 338158
9118 338158 356705 368585 392420 400807 404406 416687 439344 471481 498673 522982 557853 585922
9106 585922 613099 639180 665485 692919 736507 773773 806728 835710 874174 910026 952391 987475
9094 987475 1014079 1058421 1106518 1139836 1169034 1193371 1208033 1216611 1218464 1211449 1202082 1196478 1183148
$$ packed form
9188E8261p349L401K945m586r11k581j877K336J121O011k501k418P407J2094O029
9173G7382J776l939p207p045k691J0923N706j992j308L054J72R430J1815M315
9159A00391n21l257k701J1677O252q939K294L432M048K751N530J2948J091m340
9145A30656k113P947O162J368K047O845Q695J0849J0308L135k904J0912P898J4681
9131B16486J7809L375q139K426L129L83K272J1620J2169K1639J8108J7512J9369
9118C38158J8547J1880K3835Q387L599J2281K2657L2137K7192K4309L4871K8069
9106E85922K7177K6081K6305K7434M3588L7266L2955K8982L8464L5852M2365L5084
9094I87475K6604M4342M8097L3318K9198K4337J4662Q578J853p015r367n604j3330
$$ plain form
9081 1183148 1162754 1139054 1120196 1097930 1059795 1018279 978028 938135 904214 868402 819281
9070 819281 782049 742137 697574 667693 632622 598700 576414 550941 518423 484098 462391 443867
9058 443867 433770 419436 397786 385058 372373 353940 336266 323056 303601 290118 276647 255110
9046 255110 244937 245850 247549 226923 210672 211276 212182 199782 202749 190392 168171 162853 170148 169480
9032 169480 165543 160328 153707 152940 149338 144325 144092 140941 136209 129526 121492 106799 101037 102104 104015
9017 104015 110513 107736 99504 89329 92937 84650 79975 78872 81180 82259 81900 74414 57910 62194
9003 62194 64302 61585 57939 58373 61705 61207 59253 48210 50102 52693 47272 39534 48630 52960 58803
8988 58803 56836 50699 51808 48517 38664 38649 41500 40701 36053 28715 25134 25987 32497 43192 56136
$$ packed form
9081A183148k0394k3700j8858k2266l8135m1516m0251l9893l3921l5812m9121
9070H19281l7232l9912m4563k9881l5071l3922k2286k5473l2518l4325k1707j8524
9058D43867j0097j4334k1650j2728j2685j8433j7674j3210j9455j3483j3471k1537
9046B55110j0173R13J699k0626j6251O04R06j2400K967j2357k2221n318P295o68
9032A69480l937n215o621p67l602n013k33l151m732o683q034j4693n762J067J911
9017A04015O498k777q232j0175L608q287m675j103K308J079l59p486j6504M284
9003F2194K108k717l646M34L332m98j954j1043J892K591n421p738R096M330N843
8988E8803j967o137J109l291r853j5K851p99m648p338l581Q53O510J0695J2944
$$ plain form
8973 56136 50484 45758 36075 35160 34987 34559 30746 28143 24082 24839 31607 31189 40014 35304 26738 29081
8957 29081 27876 24751 35730 37895 34561 35455 29956 23158 19208 18175 18770 26045 37663 36435 35517
8942 35517 25788 19239 13946 21342 32289 26316 22430 23004 27005 22938 16000 9092 7019 5353 3581
8927 3581 -4209 -1611 -1323 2860 6588 10865 11664 15541 12254 21679 15528 9157 10272 15110 13403
8912 13403 7606 3205 6406 7641 3220 -1101 5812 13359 7484 16112 19576 13840 9990 6377 2049
8897 2049 4057 10217 11369 13873 10403 18833 20278 23102 27466 35293 36451 34763 28609 27353 20802
8882 20802 9765 11856 15577 14154 15075 11643 9202 17422 17671 32039 45371 40358 32566 28449
8868 28449 18605 18304 17703 12876 12092 16893 12512 13076 22930 21514 16353 17782 15315 17357 25298 25647
$$ packed form
8973E6136n652m726r683r15j73m28l813k603m061P57O768m18Q825m710q566K343
8957B9081j205l125J0979K165l334Q94n499o798l950j033N95P275J1618j228r18
8942C5517r729o549n293P396J0947n973l886N74M001m067o938o908k073j666j772
8927C581p790K598K88M183L728M277P99L877l287R425o151o371J115M838j707
8912A3403n797m401L201J235m421m321O913P547n875Q628L464n736l850l613m328
8897B049K008O160J152K504l470Q430J445K824M364P827J158j688o154j256o551
8882B0802j1037K091L721j423R21l432k441Q220K49J4368J3332n013p792m117
8868B8449r844l01o01m827p84M801m381N64R854j416n161J429k467K042P941L49
$$ plain form
8852 25647 19565 19564 16482 9211 12336 13179 14702 13936 11754 15518 6751 5086 1669 -24 2965 -6462
8836 -6462 -11813 -5017 5624 13491 9027 1031 -302 2499 10663 21172 29566 25045 18097 17178 13797
8821 13797 13042 21991 21452 21997 16489 15715 14804 9565 7918 9153 7865 11338 20462 20814 20741 22602 18874
8804 18874 11575 18954 25281 21584 17152 13849 17262 12919 2841 3214 6944 12196 13369 18535 21684
8789 21684 11500 11566 16042 9459 4961 4144 5779 12017 19115 22657 21014 15419 14098 17171 15672
8774 15672 12618 15946 20243 19833 15700 -1869 -6951 -6621 -1758 4007 480 -984 3457 8364 17765
8759 17765 27910 32462 28986 9943 -765 -1728 -6143 2955 4437 14157 11360 5297 7204 11772
8745 11772 3271 13300 27693 19063 -2307 -14629 -12493 -10555 272 2155 4560 10310 9800 10470
$$ packed form
8852B5647o082jl082p271L125Q43J523p66k182L764q767j665l417j693K989r427
8836f462n351O796J0641P867m464p996j333K801Q164J0509Q394m521o948r19l381
8821A3797p55Q949n39N45n508p74r11n239j647J235j288L473R124L52p3J861l728
8804A8874p299P379O327l697m432l303L413m343j0078L73L730N252J173N166L149
8789B1684j0184O6M476o583m498q17J635O238P098L542j643n595j321L073j499
8774A5672l054L328M297m10m133j7569n082L30M863N765l527j464M441M907R401
8759A7765J0145M552l476j9043j0708r63m415R098J482R720k797o063J907M568
8745A1772q501J0029J4393q630k1370j2322K136J938J0827J883K405N750n10O70
$$ plain form
8731 10470 15702 9012 2730 -4808 -687 8060 10053 11660 13272 15888 1776 -8350 -2759 2035
8717 2035 4223 6367 6882 9857 21760 18483 13027 15912 9533 3720 7756 8377 5321 5629 7847
8702 7847 11113 7719 2566 4467 7587 14455 16820 16560 21886 27059 24418 18091 22763 17460 14272
8687 14272 9226 3409 1787 -432 5534 1944 -9286 -4941 6831 11002 21230 27262 30515 18774
8673 18774 10251 6631 13844 14349 4767 13152 15840 16031 14364 5698 -5166 3768 22069 31465 24881
8658 24881 25474 15201 6927 4089 3994 16893 20989 17629 12837 19531 23742 40051 58466 62486
8644 62486 60589 39811 29431 28561 30202 22225 27414 33477 36638 35210 37432 39197 27729 20082
8630 20082 26448 27784 25723 22379 28539 24310 20646 21736 25039 25999 28031 34013 32373 17679 12282
$$ packed form
8731A0470N232o690o282p538M121Q747J993J607J612K616j4112j0126N591M794
8717B035K188K144N15K975J1903l277n456K885o379n813M036O21l056L08K218
8702G847L266l394n153J901L120O868K365k60N326N173k641o327M672n303l188
8687A4272n046n817j622k219N966l590j1230M345J1772M171J0228O032L253j1741
8673A8774q523l620P213N05r582Q385K688J91j667q666j0864Q934J8301R396o584
8658B4881N93j0273q274k838r5J2899M096l360m792O694M211J6309J8415M020
8644F2486j897k0778j0380q70J641p977N189O063L161j428K222J765j1468p647
8630B0082O366J336k061l344O160m229l664J090L303R60K032N982j640j4694n397
$$ plain form
8615 12282 20787 29796 39891 42420 29228 26948 30322 26976 28802 37264 42779 63085 79822 110800
8601 110800 149926 173837 163101 137481 126969 118938 114963 114009 111450 109167 96925 86024 74388
8588 74388 59844 46658 40503 36920 27534 23034 13364 9548 9388 21063 22003 25404 19836 22822
8574 22822 30543 28955 15540 17904 13498 4868 4266 13023 25003 31114 22746 1648 -1995 1759
8560 1759 264 4021 13263 25728 39309 61303 70928 56553 39047 28571 13906 -2995 -7100
8547 -7100 -564 10009 5880 8315 9777 4698 3150 -2507 1430 9930 12682 13435 1143 -1000 8657
8532 8657 16487 18395 11572 6205 10311 636 -1210 -4800 -6968 -7693 -864 10614 18654 6789 1573
8517 1573 11079 15170 14507 7894 13086 5919 422 -8437 -8092 -6826 -1063 -1742 -1113 658 1736 -5345
$$ packed form
8615A2282Q505R009J0095K529j3192k280L374l346J826Q462N515K0306J6737L0978
8601A10800L9126K3911j0736k5620j0512q031l975r54k559k283j2242j0901j1636
8588G4388j4544j3186o155l583r386m500r670l816j60J1675R40L401n568K986
8574B2822P721j588j3415K364m406q630o02Q757J1980O111q368k1098l643L754
8560A759j495L757R242J2465J3581K1994R625j4375j7506j0476j4665j6901m105
8547g100O536J0573m129K435J462n079j548n657L937Q500K752P53j2292k143R657
8532H657P830J908o823n367M106r675j846l590k168p25O829J1478Q040j1865n216
8517A573R506M091o63o613N192p167n497q859L45J266N763o79O29J771J078p081
$$ plain form
8501 -5345 -1195 4072 2134 -490 -1957 -7999 -11843 -800 2802 -6987 -6774 -2307 -1214 -9500 -11105
8486 -11105 -6618 -270 -3443 -1256 -157 -1698 -4630 -376 -9110 -14594 -12185 -4933 -2010 6904 376
8471 376 -1174 2943 -37 -5713 -4577 -404 9564 2736 842 7084 4881 13342 24829 20079 11078
8456 11078 5028 -4860 -3600 -3869 -2643 -4420 208 -2894 -4022 1227 11109 7549 2925 -1273 -6647
8441 -6647 -5744 4871 5304 4921 -2215 -6017 -8588 -3361 -2024 -437 -1830 -2752 355 9099 8759 3261
8425 3261 -2567 1535 -4809 -5833 -14644 -16209 -9790 -202 -1437 -1065 6717 -201 3534 5183 -8236
8410 -8236 -1133 15043 5426 5111 7664 13790 18707 16532 15290 8133 3554 11795 12766 8788 10146
8395 10146 9239 8298 6548 7882 6580 7635 14369 12008 7573 12237 -269 -2610 3023 -9055 -9482
$$ packed form
8501e345M150N267j938k624j467o042l844J1043L602r789K13M467J093q286j605
8486a1105M487O348l173K187J099j541k932M254q734n484K409P252K923Q914o528
8471C76j550M117k980n676J136M173R968o828j894O242k203Q461J1487m750r001
8456A1078o050r888J260k69J226j777M628l102j128N249R882l560m624m198n374
8441f647R03J0615M33l83p136l802k571N227J337J587j393r22L107Q744l40n498
8425C261n828M102o344j024q811j565O419R588j235L72P782o918L735J649j3419
8410h236P103J6176r617l15K553O126M917k175j242p157m579Q241R71l978J358
8395A0146r07r41j750J334j302J055O734k361m435M664j2506k341N633j2078m27
$$ plain form
8380 -9482 -1851 14672 23384 19714 16389 5253 2476 2631 -8443 -13009 -8447 -2342 2913 -2290
8366 -2290 -8172 -3074 -1209 7546 13484 3781 -8715 -11591 -6847 -5143 -7578 -2369 8820 11274
8352 11274 7466 -2176 -1525 -1944 -2823 7477 15536 14045 4645 -3962 -9299 -15327 -16419 -16563 -15975 -12101
8336 -12101 -11754 -8172 -5651 -13600 -21612 -19973 -16699 -12699 -10870 -7550 -11429 -4604 102 -2647 -10349
8321 -10349 -7675 -9215 -3713 -1872 -1911 -2460 -697 7515 3258 7415 6865 13105 12739 10096 17470 22069
8305 22069 9775 -6049 -2456 5136 519 -3900 -8541 -12350 -6758 3943 3117 -7876 -5759 8534
8291 8534 18076 8325 -8141 -15573 -16640 -9809 -3049 -646 -6577 -11720 -8896 6650 16139 9093
8277 9093 -396 1455 2771 5947 12701 5161 -1254 -4445 -8389 -3580 7686 10680 8519 7677 12237
$$ packed form
8380i482P631J6523Q712l670l325j1136k777J55j1074m566M562O105N255n203
8366b290n882N098J865Q755N938r703j2496k876M744J704k435N209J1189K454
8352A1274l808r642O51m19q79J0300Q059j491r400q607n337o028j092j44N88L874
8336a2101L47L582K521p949q012J639L274M000J829L320l879O825M706k749p702
8321a0349K674j540N502J841l9n49J763Q212m257M157n50O240l66k643P374M599
8305B2069j2294j5824L593P592m617m419m641l809N592J0701q26j0993K117J4293
8291H534R542r751j6466p432j067O831O760K403n931n143K824J5546R489p046
8277I093r489J851J316L176O754p540o415l191l944M809J1266K994k161q42M560
$$ plain form
8262 12237 10535 7398 3933 5423 7229 8008 -64 -4399 -12282 -2772 3680 -6644 -15012 -9298 1635
8247 1635 9089 1466 -1171 8021 6722 -10230 -14169 -6832 -7341 -10817 -14240 -15382 -13785 -11012 -2059
8232 -2059 4254 12045 9773 13336 20434 13946 13026 6127 -1950 66 5301 16176 19241 13193 6462
8217 6462 7039 6943 5493 5466 7717 2905 -3383 2455 -1590 177 13999 10625 1882 -6129 -7289 -7929
8201 -7929 -3675 1932 2854 5957 9241 10799 10768 12284 18162 15364 -720 -13457 -9934 -4487 -6256
8186 -6256 -9372 -5537 -6053 -7561 -8971 -5005 -1401 -7880 -9995 -9855 -1446 -5339 -9753 -4578 746
8171 746 6440 4684 -7429 -17046 -5573 -481 7193 15092 6302 -4469 -12587 -10782 -11314 -5286 4933
8156 4933 14561 22565 11086 2921 4072 2371 9049 10319 4925 3076 7086 7358 -4979 -10840 -9601
$$ packed form
8262A2237j702l137l465J490J806P79q072m335p883R510O452j0324q368N714J0933
8247A635P454p623k637R192j299j6952l939P337n09l476l423j142J597K773Q953
8232b059O313P791k272L563P098o488r20o899q077K016N235J0875L065o048o731
8217F462N77r6j450k7K251m812o288N838m045J767J3822l374q743q011j160o40
8201g929M254N607R22L103L284J558l1J516N878k798j6084j2737L523N447j769
8186f256l116L835n16j508j410L966L604o479k115J40Q409l893m414N175N324
8171G46N694j756j2113r617J1473N092P674P899q790j0771q118J805n32O028J0219
8156D933R628Q004j1479q165J151j701O678J270n394j849M010K72j2337n861J239
$$ plain form
8141 -9601 3577 -658 -7515 -8853 -4577 325 6761 6859 8898 8696 -2260 -12500 -10971 -10728 -21515
8126 -21515 -24439 -18380 -14024 -11874 -1631 791 -3437 1591 -2816 -1951 -4738 -11220 -7235 -5650 -9493
8111 -9493 -12378 -3241 568 3113 -565 1221 185 553 1776 1920 8595 -3616 -2664 -733 -2751
8096 -2751 -4307 -3138 -6381 -18572 -26503 -26549 -22601 -12683 -4702 3666 942 2180 1741 4372 9900
8081 9900 10812 2755 -14181 -19053 -24169 -19194 -3018 4972 6386 -1150 381 1156 -748 1904 7184
8066 7184 4243 -3598 2557 5881 -2733 -5790 1936 1331 974 -5446 -10619 -11155 -10666 -12740 -18381 -17248
8050 -17248 -6734 -5837 -9118 -1704 -606 -2985 -8090 -12014 -12954 -4384 11302 18262 19214 18410 20393
8035 20393 21307 14100 8725 16111 20284 15426 13660 16948 12749 15163 17768 20070 23575 17662 12772
$$ packed form
8141i601J3178m235o857j338M276M902O436R8K039k02j0956j0240J529K43j0787
8126b1515k924O059M356K150J0243K422m228N028m407Q65k787o482L985J585l843
8111i493k885R137L809K545l678J786j036L68J223J44O675j2211R52J931k018
8096b751j556J169l243j2191p931m6L948R918P981Q368k724J238m39K631N528
8081I900R12q057j6936m872n116M975J6176P990J414p536J531P75j904K652N280
8066G184k941p841O155L324q614l057P726o05l57o420n173n36M89k074n641J133
8050a7248J0514Q97l281P414J098k379n105l924r40Q570J5686O960R52q04J983
8035B0393R14p207n375P386M173m858j766L288m199K414K605K302L505n913m890
$$ plain form
8020 12772 11152 9195 1765 206 5764 17627 18151 17332 6617 -658 1185 3121 15953 25556
8006 25556 33539 32047 21505 23852 20831 23341 14096 14578 9573 17452 22002 16366 18999 18068 23501
7991 23501 27485 29201 26309 26818 24014 20710 16443 7939 5098 10165 13654 8510 6020 3033 2138
7976 2138 -5511 -11404 -13068 -5233 3097 13060 17280 14246 10828 14406 17107 8768 15174 20793 16794
7961 16794 17271 22060 19670 12188 9174 13712 18861 21425 24576 29852 19044 12540 12163 12110 15648
7946 15648 18110 25522 29831 21666 31081 24377 18703 14911 23076 19810 16070 15301 18487 18557 15599
7931 15599 8264 10459 17099 18629 13892 12522 15553 12403 9317 17317 16338 28185 32786 29513 28600
7916 28600 32851 25392 19020 13924 13467 8975 12362 13116 2443 -2924 -1108 5116 -2417 -3163 2888
$$ packed form
8020A2772j620j957p430j559N558J1863N24q19j0715p275J843J936J2832R603
8006B5556P983j492j0542K347l021K510r245M82n005P879M550n636K633r31N433
7991B3501L984J716k892N09k804l304m267q504k841N067L489n144k490k987q95
7976B138p649n893j664P835Q330R963M220l034l418L578K701q339O406N619l999
7961A6794M77M789k390p482l014M538N149K564L151N276j0808o504l77n3L538
7946A5648K462P412M309q165R415o704n674l792Q165l266l740p69L186P0k958
7931A5599p335K195O640J530m737j370L031l150l086Q000r79J1847M601l273r13
7916B8600M251p459o372n096m57m492L387P54j0673n367J816O224p533p46O051
$$ plain form
7901 2888 16890 17085 15659 16625 4266 -7490 -1176 1088 166 -5633 -4529 -354 -5639 -9758 -8026
7886 -8026 6131 17071 17745 8583 5092 9379 2930 -4703 -9694 -17515 -16569 -6009 3650 3939 8058
7871 8058 5548 2625 7104 2791 1393 14796 23612 25604 12166 -1114 5063 13357 11864 10445
7857 10445 11240 3496 -6843 -7701 -2032 5765 10049 9569 3869 -407 105 -5365 -21698 -20744 -6163
7842 -6163 4858 8403 4246 -4657 -9488 -6481 -1226 4116 -8610 -11397 -4613 -3911 -12018 -6531 4650
7827 4650 3912 521 4972 12905 18569 12048 4054 -6180 -8334 -983 7868 12212 -737 -12695
7813 -12695 -7622 -9309 -3017 2780 2602 -2984 409 6335 3880 -6066 -6595 2269 6156 4011 2612
7798 2612 11014 5773 1044 -2382 -5283 -82 5399 5549 1708 12230 18581 15559 10360 5019 -2288
$$ packed form
7901B888J4002J95j426R66j2359j1756O314K264r22n799J104M175n285m119J732
7886h026J4157J0940O74r162l491M287o449p633m991p821R46J0560R659K89M119
7871H058k510k923M479m313j398J3403Q816J992j3438j3280O177Q294j493j419
7857A0445P95p744j0339q58N669P797M284m80n700m276N12n470j6333R54J4581
7842f163J1021L545m157q903m831L007N255N342j2726k787O784P02q107N487J1181
7827D650p38l391M451P933N664o521p994j0234k154P351Q851M344j2949j1958
7813a2695N073j687O292N797j78n586L393N926k455r946n29Q864L887k145j399
7798B612Q402n241m729l426k901N201N481J50l841J0522O351l022n199n341p307
$$ plain form
7783 -2288 -2816 -6326 -10877 -8133 -4392 -9031 -9205 -4133 -5198 -5734 -2579 -10419 -9392 -5073 4164 14866
7767 14866 10024 -2382 99 -6745 -7113 -8859 -10891 -5750 -2220 -7606 -8804 -7109 -7826 -14405 -14077
7752 -14077 -10587 -7645 -11221 -6712 -10328 -7794 -475 1526 -3281 -4999 -9121 -16330 -20487 -16846 -4507
7737 -4507 -2712 -1468 -7612 -11495 -8791 5386 9174 -2151 -6198 -4806 -12044 -11753 -10168 -3366 -5451
7722 -5451 -6889 -8281 -6095 -4803 -10131 -11577 -4863 -8530 -20861 -11248 -1871 -6516 -16300 -26377
7708 -26377 -22678 -20320 -13362 -7871 -2711 -7187 -3157 90 3633 1383 2440 -4815 -1252 -5685 -352
7693 -352 5415 -5880 -1424 1428 -18208 -15468 -6544 -2861 13433 17068 5238 -4994 -2716 -1561
7679 -1561 4775 2522 -7229 -14991 -11332 -14891 -19307 -15075 -5058 -691 -5048 -12414 -15932 -15052 -1171
$$ packed form
7783b288n28l510m551K744L741m639j74N072j065n36L155p840J027M319R237J0702
7767A4866m842j2406K481o844l68j746k032N141L530n386j198J695p17o579L28
7752a4077L490K942l576M509l616K534P319K001m807j718m122p209m157L641J2339
7737d507J795J244o144l883K704J4177L788j1325m047J392p238K91J585O802k085
7722e451j438j392K186J292n328j446O714l667j2331R613R377m645r784j0077
7708b6377L699K358O958N491N160m476M030L247L543k250J057p255L563m433N333
7693c52N767j1295M456K852j9636K740Q924L683J6294L635j1830j0232K278J155
7679a561O336k253r751p762L659l559m416M232J0017M367m357p366l518Q80J3881
$$ plain form
7664 -1171 10619 11289 8679 -370 -2453 -8165 -16110 -14515 -12259 -950 -777 -2937 888 -6239 -5176
7649 -5176 -7751 -11487 -14418 -8316 -18132 -20451 -17072 -11825 -11510 -16370 -5348 1782 -2119 -8161 -3491
7634 -3491 -10674 -12418 -13985 -10961 -4366 -3501 -4875 -12941 -8576 3769 5239 -413 -405 4837 2613 -640
7618 -640 497 7702 3129 -8383 -12061 -13928 -6765 3905 -1828 -2921 182 2281 -11915 -12679 -6040
7603 -6040 -4515 514 1117 -4069 -5109 -11005 -20421 -23480 -15629 -11672 -6326 -4847 660 8016 6800
7588 6800 10125 17058 13474 7746 8807 -751 -3867 4428 9566 10681 5522 877 -365 -4064 -4939
7573 -4939 -3473 -3537 -6515 -6320 -14089 -18427 -7317 2967 2039 2357 4377 -974 -7309 -4497 -4731 -3177
7557 -3177 5802 9158 6338 8962 18141 14614 9320 154 -11862 -17891 -17246 -12365 945 -3055 -12328
$$ packed form
7664a171J1790O70k610r049k083n712p945J595K256J1309J73k160L825p127J063
7649e176k575l736k931O102r816k319L379N247L15m860J1022P130l901o042M670
7634c491p183j744j567L024O595Q65j374q066M365J2345J470n652QN242k224l253
7618f40J137P205m573j1512l678j867P163J0670n733j093L103K099j4196p64O639
7603f040J525N029O03n186j040n896r416l059P851L957N346J479N507P356j216
7588F800L325O933l584n728J061r558l116Q295N138J115n159m645j242l699q75
7573d939J466o4k978J95p769m338J1110J0284r28L18K020n351o335K812k34J554
7557c177Q979L356k820K624R179l527n294r166j2016o029O45M881J3310m000r273
$$ plain form
7542 -12328 -18454 -10513 -9032 -4129 -9201 -11428 -11140 -2738 -5148 -6067 -12109 -13735 -9992 -15557 -15381
7527 -15381 -13318 -13719 -21592 -13600 -7530 -13344 -17067 -9890 -6271 3129 10013 6619 -2457 -10671 -8886
7512 -8886 -7777 -1826 -5481 -7961 -8627 -21654 -19166 -6639 438 -6341 -1500 6463 10949 80
7498 80 -7074 5110 5946 6275 -910 -2935 2359 1041 259 2460 2627 1657 8348 2954 -5967 -16745
7482 -16745 -16691 -12801 -5109 -2506 -1540 -5869 -5367 3631 4476 -4103 -6521 -10726 544 14202 7958
7467 7958 -1675 2395 908 -313 47 1475 5079 13033 14062 11658 11562 4219 2641 -6942 -10724 -12857
7451 -12857 -9904 -12567 1242 1348 -8471 -11009 -11957 -11288 -12071 -13883 -8350 2217 7093 -291 -5875
7436 -5875 -6562 -911 3341 616 -3446 -13414 -23735 -26158 -23901 -23939 -25963 -18367 -22895 -23735 -14379 -15378
$$ packed form
7542a2328o126P941J481M903n072k227K88Q402k410r19o042j626L743n565J76
7527a5381K063m01p873P992O070n814l723P177L619R400O884l394r076q214J785
7512h886J109N951l655k480o66j3027K488J2527P077o779M841P963M486j0869
7498H0p154J2184Q36L29p185k025N294j318p82K201J67r70O691n394q921j0778
7482a6745N4L890P692K603R66m329N02Q998Q45q579k418m205J1270J3658o244
7467G958r633M070j487j221L60J428L604P954J029k404r6p343j578r583l782k133
7451a2857K953k663J3809J06r819k538r48O69p83j812N533J0567M876p384n584
7436e875o87N651M252k725m062r968j0321k423K257l8k024P596m528q40R356r99
$$ plain form
7420 -15378 -7363 -8487 -2723 653 4900 -663 -1863 -5209 -6657 -2129 -7010 -17497 -22968 -16825
7406 -16825 -5367 7843 7376 3183 -2940 -4247 1426 17400 21807 17081 8489 2205 -1918 3644
7392 3644 8864 -287 -10202 -17536 -20689 -11923 2522 3990 -1379 -9467 -13067 -7303 -2002 807 3398
7377 3398 4653 7633 7258 4920 2043 5742 8800 15107 15949 14053 14236 12606 8337 3718 -3482 -15666
7361 -15666 -13506 -4025 4745 4850 12252 20593 13984 2615 569 -6216 -7812 1952 5040 2084 -10620
7346 -10620 -8127 -7272 -15460 -15220 -14615 -16419 -15717 -18083 -12270 -5572 -657 -2019 -1860 -5148 -4373 1980
7330 1980 -7413 -7784 -6038 -10111 -15151 -14847 -14999 -11561 -10282 -16289 -9597 8498 7876 -159 -1566 -3283
7314 -3283 -10837 -2929 4062 3130 4944 1911 10734 9906 38 9522 11399 1945 -2567 -827 -1592 -7159
$$ packed form
7420a5378Q015j124N764L376M247n563j200l346j448M528m881j0487n471O143
7406a6825J1458J3210m67m193o123j307N673J5974M407m726q592o284m123N562
7392C644N220r151r915p334l153Q766J4445J468n369q088l600N764N301K809K591
7377C398J255K980l75k338k877L699L058O307Q42j896J83j630m269m619p200j2184
7361a5666K160R481Q770J05P402Q341o609j1369k046o785j596R764L088k956j2704
7346a0620K493Q55q188K40O05j804P02k366N813O698M915j362J59l288P75O353
7330A980r393l71J746m073n040L04j52L438J279o007O692J8095o22q035j407j717
7314c283p554P908O991r32J814l033Q823q28r868R484J877r454m512J740p65n567
$$ plain form
7298 -7159 -12036 -17973 -13349 -21262 -20052 -7669 4070 12128 13862 12573 8018 -3797 -10586 -1619
7284 -1619 3314 -1944 -6416 -10916 -7408 -12015 -12451 -13171 -6903 -1864 3702 -1385 -6532 -17920 -24626
7269 -24626 -24483 -27699 -24232 -24145 -22844 -11164 4001 3824 6260 7858 5438 9794 3602 -14404 -18465
7254 -18465 -25886 -22789 -17476 -14755 -11516 216 11251 2387 -1806 -1349 -626 -5415 -3614 -8804 -11170
7239 -11170 -3874 2697 4556 -3400 -2421 -2243 -12889 -22313 -15570 -933 3631 -781 1364 380 -8676
7224 -8676 -10994 -22612 -21089 -3305 5500 9961 6726 314 -13114 -20472 -20829 -13188 -11597 -5940
7210 -5940 -6194 -6727 -11929 -17797 -13909 -3801 7917 16949 1350 -5175 -409 4252 2453 -3547 -5427
7195 -5427 -3889 1135 1326 10071 11229 5761 5916 4958 5474 7836 2501 188 809 -7837 -6245 3279
$$ packed form
7298g159m877n937M624p913J210J2383J1739Q058J734j289m555j1815o789Q967
7284a619M933n258m472m500L508m607m36p20O268N039N566n087n147j1388o706
7269b4626J43l216L467Q7J301J1680J5165j77K436J598k420M356o192j8006m061
7254a8465p421L097N313K721L239J1732J1035q864m193M57P23m789J801n190k366
7239a1170P296O571J859p956R79J78j0646r424O743J4637M564m412K145r84r056
7224h676k318j1618J523J7784Q805M461l235o412j3428p358l57P641J591N657
7210e940k54n33n202n868L888J0108J1718R032j5599o525M766M661j799o000j880
7195e427J538N024J91Q745J158n468J55r58N16K362n335k313O21q646J592R524
$$ plain form
7179 3279 3184 -2935 216 6781 11416 -1144 -9091 -10182 -6869 -441 -5208 -17350 -18752 -28987 -25311
7164 -25311 -12984 -11132 -8357 -11801 -16251 -9642 -13616 -15728 -12151 -6308 4140 13569 8443 -10587
7150 -10587 -17944 -11398 3272 10558 8644 6923 1199 -8694 -15699 -11534 -503 6676 3442 -1941
7136 -1941 -5050 -2220 -1283 8751 12144 12886 10280 7345 9015 8266 3799 11452 4707 5472 5791 6389
7120 6389 7864 2643 -17843 -12519 2055 2008 7858 4826 627 -6392 -1643 -8694 -9413 -10328 -12989
7105 -12989 -12210 -10242 -5211 -2356 -280 -5103 -5444 -10128 -17885 -20125 -11225 -6751 -5504 -8905 1948
7090 1948 -349 -769 6530 6695 11709 13950 10280 708 1811 2183 2327 2469 3147 -893 -6259 -2091
7074 -2091 1769 3274 -3645 -17193 -14382 -967 364 -9748 -14534 -16854 -17710 -22587 -17831 -7613
$$ packed form
7179C279r5o119L151O565M635j2560p947j091L313O428m767j2142j402j0235L676
7164b5311J2327J852K775l444m450O609l974k112L577N843J0448R429n126j9030
7150a0587p357O546J4670P286j914j721n724r893p005M165J1031P179l234n383
7136a941l109K830R37J0034L393P42k606k935J670p49m467P653o745P65L19N98
7120F389J475n221k0486N324J4574m7N850l032m199p019M749p051p19r15k661
7105a2989P79J968N031K855K076m823l41m684p757k240Q900M474J247l401J0853
7090A948k297m20P299J65N014K241l670r572J103L72J44J42O78m040n366M168
7074b091L860J505o919j3548K811J3415J331j0112m786k320q56m877M756J0218
$$ plain form
7060 -7613 -4337 -2155 247 -1453 2076 8035 8691 -644 -9207 -9177 -6964 -2710 6071 5742 120 -6780
7044 -6780 -1373 1804 -4485 -469 5728 12665 6702 -8353 -6190 -2162 -928 3163 2773 3999 7097
7029 7097 4027 -4717 -11197 -12601 -8763 -6466 -893 4565 1857 6235 8106 5676 -649 -1191 9933
7014 9933 16113 17304 13852 19802 29476 34486 30543 23050 10008 1925 -4735 3536 9897 7976 9247
6999 9247 16206 16375 16207 15529 18739 18205 18128 18227 10755 7343 1481 -5939 -7297 -813 -5025 3309 10379
6982 10379 10985 21695 21071 5333 -9272 -8556 -6133 -1076 -29 -3371 9659 8544 15483 16160 4455
6967 4455 433 1510 -3701 -2967 2167 6998 5658 4652 1651 856 1087 422 -5489 4286 14986 17847
6951 17847 19602 21409 21574 13855 3134 -5097 -9441 -6702 -11104 -10458 1197 6633 6379 4106 1544
$$ packed form
7060g613L276K182K402j700L529N959O56r335q563L0K213M254Q781l29n622o900
7044f780N407L177o289M016O197O937n963j5055K163M028J234M091l90J226L098
7029G097l070q744o480j404L838K297N573N458k708M378J871k430o325n42J1124
7014I933O180J191l452N950R674N010l943p493j3042q083o660Q271O361j921J271
6999I247O959J69j68o78L210n34p7R9p472l412n862p420j358O484m212Q334P070
6982A0379O06J0710o24j5738j4605P16K423N057J047l342J3030j115O939O77j1705
6967D455m022J077n211P34N134M831j340j006l001p95K31o65n911R775J0700K861
6951A7847J755J807J65p719j0721q231m344K739m402O46J1655N436k54k273k562
$$ plain form
6936 1544 7978 4498 1109 -4254 -1703 -3616 -13467 -16602 -16133 -9215 -1422 -2008 -13256 -11438 3404
6921 3404 10266 8682 -6126 -11410 -7565 12033 13832 10857 -647 -5448 -5729 2279 -2401 -8795
6907 -8795 -5293 -1622 3630 -3667 -9898 -1573 -5879 -5837 -6337 -6170 -2356 4906 6848 -612 4571 8241
6891 8241 -3504 -3568 -2126 -4963 306 8994 19810 19141 4807 1263 1277 3789 5230 11170 25718
6876 25718 20830 7889 -988 -786 5589 7007 -1942 1428 2925 -990 2829 -3104 -1743 -13409
6862 -13409 -20480 -18433 -13485 -15159 -17439 -4062 1933 8391 19002 26119 23069 18997 15881 5787
6848 5787 -60 -3595 -5917 -6581 -11086 -5732 -12097 -7594 -1771 -4964 -7047 -2635 -1393 1118 10098
6833 10098 13102 5325 3662 4260 -1995 -1156 322 -2974 1797 -876 -9662 -6244 -8974 -12948 -14484
$$ packed form
6936A544O434l480l389n363K551j913r851l135M69O918P793n86j1248J818J4842
6921C404O862j584j4808n284L845J9598J799k975j1504m801k81Q008m680o394
6907h795L502L671N252p297o231Q325m306M2n00J67L814P262J942p460N183L670
6891H241j1745o4J442k837N269Q688J0816o69j4334l544J4K512J441N940J4548
6876B5718m888j2941q877K02O375J418q949L370J497l915L819n933J361j1666
6862a3409p071K047M948j674k280J3377N995O458J0611P117l050m072l116j0094
6848E787n847l535k322o64m505N354o365M503N823l193k083M412J242K511Q980
6833A0098L004p777j663N98o255Q39J478l296M771k673q786L418k730l974j536
$$ plain form
6818 -14484 -9342 -5963 -10034 -4909 -1858 3215 19966 22182 16314 6195 -5613 -8319 -2873 7498
6804 7498 1762 6999 13709 17439 13908 360 4154 7258 6533 8029 18535 21263 12772 4552 4563
6789 4563 4372 -2047 7333 17627 15188 21380 28887 28731 31645 38210 45582 58785 64419 46110 38308
6774 38308 31577 25276 29566 29734 26898 32556 35123 47086 60731 73203 90459 110503 135740
6761 135740 162522 210713 291359 444607 734181 1227490 1938300 2163991 1527172 893712
6751 893712 538106 352181 252466 191834 156649 123290 110485 98665 85039 71798 78221
6740 78221 77060 73632 75075 83755 103443 147392 210845 322612 493684 598678 478025 317780
6728 317780 220900 145807 105152 85126 58901 37846 24276 24030 25827 24652 22574 20195 21221
$$ packed form
6818a4484N142L379m071N125L051N073J6751K216n868j0119j1808k706N446J0371
6804G498n736N237O710L730l531j3548L794L104p25J496J0506K728q491q220J1
6789D563j91o419R380J0294k439O192P507j56K914O565P372J3203N634j8309p802
6774C8308o731o301M290J68k836N658K567J1963J3645J2472J7256K0044K5237
6761A35740K6782M8191Q0646J53248K89574M93309P10810K25691o36819o33460
6751H93712l55606j85925r9715o0632l5185l3359j2805j1820j3626j3241O423
6740G8221j161l428J443Q680J9688M3949O3453J11767J71072J04994j20653j60245
6728C17780r6880p5093m0655k0026k6225k1055j3570k46J797j175k078k379J026
$$ plain form
6715 21221 9912 12294 15459 11526 16935 18651 21695 40181 44500 38950 38373 33312 27963 13255
6701 13255 -3003 5618 8043 3017 3167 15190 14871 918 -11536 -8455 -3549 -2161 -6196 3007
6687 3007 10301 11057 8845 12864 16755 14509 12434 6270 -5368 -19758 -18998 -10857 219 10055 10370
6672 10370 4556 7241 9332 5479 2994 6767 3939 5373 4867 7446 7578 5351 -1205 6479 13603
6657 13603 9215 5335 12961 14632 6453 1926 -4670 -10074 -6924 -1235 1664 4946 -1720 -7798 -317
6642 -317 9922 14511 10098 2986 5599 1002 5265 7256 12256 12259 7696 4099 4096 2848 9688 13693
6626 13693 9939 12295 9656 2608 4881 -8525 -6316 -2976 -11609 -4675 1694 -845 -7201 -7070 -1888
6611 -1888 8602 9655 3934 1849 -5408 -5283 -9895 -19356 -16467 -10476 -10497 -9174 -3373 -1230 -3351
$$ packed form
6715B1221j1309K382L165l933N409J716L044J8486M319n550n77n061n349j4708
6701A3255j6258Q621K425n026J50J2023l19j3953j2454L081M906J388m035R203
6687C007P294P56k212M019L891k246k075o164j1638j4390P60Q141J1076R836L15
6672A0370n814K685K091l853k485L773k828J434n06K579J32k227o556P684P124
6657A3603m388l880P626J671q179m527o596n404L150N689K899L282o666o078P481
6642c17J0239M589m413p112K613m597M263J991N000Lm563l597lj248O840M005
6626A3693l754K356k639p048K273j3406K209L340q633O934O369k539o356J31N182
6611a888J0490J053n721k085p257J25m612r461K889N991k1J323N801K143k121
$$ plain form
6596 -3351 -3926 -13698 -12884 -15473 -12383 -6519 -6618 -8655 -7976 -4334 -2740 1238 -5245 1957 11915 6401
6580 6401 4166 1719 -1929 -5881 -3178 -197 1676 4430 755 -11675 -19765 -23022 -20664 -17146 -17637
6565 -17637 -16689 -845 -243 -1298 -171 -4120 -109 -9278 -19256 -13307 -3881 -3701 -13212 -12778 -18200
6550 -18200 -19591 -9796 -2040 -3244 -1932 -413 -2331 3662 7980 5472 4452 3779 11575 9981 16758
6535 16758 13727 14345 9741 7351 8332 8480 8858 6381 8546 10582 1925 566 -119 -409 -6526 -2573
6519 -2573 2279 4934 270 1029 5310 2678 -783 1156 10392 19301 9926 4660 -2745 1167 3096
6504 3096 -4936 -12397 -18175 -17619 -10412 -324 -892 -6101 -4880 2449 -3767 -1832 -2980 -4925 -2581
6489 -2581 5245 -5392 -8341 -4954 -923 -392 -705 9479 6954 -7385 -10169 -5559 -11561 -14183 -5443
$$ packed form
6596c351n75r772Q14k589L090N864r9k037O79L642J594L978o483P202R958n514
6580F401k235k447l648l952K703K981J873K754l675j2430q090l257K358L518m91
6565a7637R48J5844O02j055J127l949M011r169r978N949R426J80r511M34n422
6550a8200j391R795P756j204J312J519j918N993M318k508j020o73P796j594O777
6535A6758l031O18m604k390R81J48L78k477K165K036q657j359o85k90o117L953
6519b573M852K655m664P59M281k632l461J939R236Q909r375n266p405L912J929
6504C096q032p461n778N56P207J0088n68n209J221P329o216J935j148j945K344
6489b581P826j0637k949L387M031N31l13J0184k525j4339k784M610o002k622Q740
$$ plain form
6474 -5443 -4192 8802 8708 3950 8588 12617 11494 5617 6259 -710 620 755 -2548 -3789 -5757 1353
6458 1353 9907 17891 17212 9924 8942 1333 -5432 3249 11265 7131 7230 2502 3679 -1997 -7419 -480
6442 -480 5017 4019 -530 -952 -1898 3456 6397 -3585 -11789 -4495 -1499 -7186 -17070 -16408 -15714 -9738
6426 -9738 -1996 80 -3001 -7364 -1061 -7531 -4271 -9752 -7899 -1455 2999 7815 286 -27543 -30980
6411 -30980 -19088 -13449 -5275 -3565 -1131 -304 -3188 -7190 -9206 -2881 4400 1358 -1587 198 -5227
6396 -5227 431 7561 10395 11376 10617 1439 1026 -3343 -8371 -6553 -7713 -1051 9914 17288 17190 12177
6380 12177 14729 16080 13063 11991 1387 5868 9150 5499 15377 11197 3533 -5367 -12216 -4917
6366 -4917 8228 5028 2913 2451 -1223 2945 17535 22520 11350 14829 15705 5990 -49 -5270 -2491
$$ packed form
6474e443J251J2994r4m758M638M029j123n877O42o969J330J35l303j241j968P110
6458A353Q554P984o79p288r82p609o765Q681Q016m134R9m728J177n676n422O939
6442d80N497r98m549m22r46N354K941r982q204P294K996n687r884O62O94N976
6426i738P742K076l081m363O303o470L260n481J853O444M454M816p529k7829l437
6411c0980J1892N639Q174J710K434Q27k884m002k016O325P281l042k945J785n425
6396e227N658P130K834R81p59r178m13m369n028J818j160O662J0965P374r8n013
6380A2177K552J351l017j072j0604M481L282l651R878m180p664q900o849P299
6366d917J3145l200k115m62l674M168J4590M985j1170L479Q76r715o039n221K779
$$ plain form
6351 -2491 -1157 -3043 1336 2262 5554 11530 6338 6472 11022 12828 6579 4232 6032 8613 2546
6336 2546 -3431 -3881 2432 -169 -6746 -10674 -11401 -11204 -3072 6579 1069 -4364 -4082 -1417 -4751 -5839
6320 -5839 -13779 -7837 -1056 2649 12625 10114 6334 9735 2495 4023 8167 3339 -3955 -6165 -1902
6305 -1902 1648 4429 10237 10487 -5910 -5913 -5563 -4716 -1034 4115 -1343 -9779 -6108 -4041 268 227 -3223
6288 -3223 -6293 -15205 -12551 -8603 -17031 -14781 -10139 -12511 -12202 -10545 -7222 -9626 -4003 -383 -943
6273 -943 736 7717 7649 595 -7588 -4014 -1409 4975 9711 3229 -2141 -6546 -6290 1119 -366 -4304
6257 -4304 -4911 3712 9168 13759 10224 8342 7053 5782 3983 2001 -2703 -7532 -8011 -10767 -6845
6242 -6845 742 3210 1499 -2464 -3053 -3362 -5572 1787 4986 -4820 -11792 -6772 -1581 -5862 -9026
$$ packed form
6351b491J334j886M379R26L292N976n192J34M550J806o249k347J800K581o067
6336B546n977m50O313k601o577l928p27J97Q132R651n510n433K82K665l334j088
6320e839p940N942O781L705R976k511l780L401p240J528M144m828p294k210M263
6305a902L550K781N808K50j6397lL50Q47L682N149n458q436L671K067M309m1l450
6288c223l070q912K654L948q428K250M642k372L09J657L323k404N623L620n60
6273i43J679O981o8p054q183L574K605O384M736o482n370m405K56P409j485l938
6257d304o07Q623N456M591l535j882j289j271j799j982m704m829m79k756L922
6242f845P587K468j711l963n89l09k210P359L199r806o972N020N191m281l164
$$ plain form
6227 -9026 -5650 -9445 -8106 -3242 6826 10425 668 -8787 -19428 -23277 -18603 -12412 -14586 -23488
6213 -23488 -19549 -16855 -15303 -17350 -8191 -5712 238 3485 8709 2746 -1147 3419 -3045 -4884 -519
6198 -519 3564 1203 -1174 -23 -9431 -10446 26 5467 5026 -8202 -13494 -3703 1129 3595 26
6183 26 -24 309 -3545 2210 10869 17697 14231 11577 1430 -2954 -7282 -5855 -8205 -4026 -4616 -10609
6167 -10609 -8042 -7803 -7422 -8023 762 10823 10185 1455 -3834 -4152 -4242 -3430 1242 -2080 -13908 -5976
6151 -5976 -6378 -1130 5726 1831 -786 -1739 -4740 575 2644 -4785 -5906 -1908 -5677 -13990 -13416 -4129
6135 -4129 9181 12091 7054 1879 -2996 -6034 -9070 -8106 -12585 -10150 -12416 -16876 -10386 -3343 -7492
6120 -7492 -8530 -7344 -12667 -9904 -11616 -10727 -2032 -1746 -1320 -3690 -8868 -9820 -5127 -6978 -14497 -8689
$$ packed form
6227i026L376l795J339M864J0068L599r757r455j0641l849M674O191k174q902
6213b3488L939K694J552k047R159K479N950L247N224n963l893M566o464j839M365
6198e19M083k361k377J151r408j015J0472N441m41j3228n292R791M832K466l569
6183B6n0L33l854N755Q659O828l466k654j0147m384m328J427k350M179n90n993
6167a0609K567K39L81o01Q785J0061o38q730n289l18r0Q12M672l322j1828P932
6151e976m02N248O856l895k617r53l001N315K069p429j121L998l769q313N74R287
6135d129J3310K910n037n175m875l038l036R64m479K435k266m460O490P043m149
6120g492j038J186n323K763j712Q89Q695K86M26k370n178r52M693j851p519N808
$$ plain form
6104 -8689 -3562 -7747 -9104 -2614 1701 732 -4695 -3082 2576 -471 718 3781 -857 -3690 8380
6089 8380 17493 8428 -445 -13205 -15158 -14477 -6687 6357 15082 15393 419 -5378 -942 1905 2431
6074 2431 11551 10957 1126 -6367 -9624 310 10054 2881 -3952 -2287 4531 7378 7614 10436 9050
6059 9050 -568 -11829 -5922 322 3962 6981 14265 10553 -1239 -13289 -24281 -21485 -9146 -8728
6045 -8728 -15803 -17565 -14319 -12334 -1292 1526 2229 2377 -1386 -1010 3588 3042 5174 10596 6717 1396
6029 1396 -291 664 -4417 -4713 5368 7287 12455 9069 355 10140 9846 4372 6446 9374 9069 7677
6013 7677 -3221 -5825 -1691 528 -147 -555 8356 8034 2656 690 6846 -3556 -15806 -16161 -14655
5998 -14655 -11990 -6125 -6674 -10948 -5300 -2488 -909 -1570 -2007 -1055 2769 -8310 -16097 -13624 -9037
$$ packed form
6104h689N127m185j357O490M315r69n427J613N658l047J189L063m638k833J2070
6089H380R113r065q873j2760j953O81P790J3044Q725L11j4974n797M436K847N26
6074B431R120n94r831p493l257R934R744p173o833J665O818K847K36K822j386
6059I050r618j1261N907O244L640L019P284l712j1792j2050j0992K796J2339M18
6045h728p075j762L246J985J1042K818P03J48l763L76M598n46K132N422l879n321
6029A396j687R55n081k96J0081J919N168l386q714R785k94n474K074K928l05j392
6013G677j0898k604M134K219o75m08Q911l22n378j966O156j0402j2250l55J506
5998a4655K665N865n49m274N648K812J579o61m37R52L824j1079p787K473M587
$$ plain form
5983 -9037 -5595 -4546 -11743 -13988 -11135 -1606 -665 -3369 -13112 -13372 -11554 -6847 -2337 9690 12748
5968 12748 7186 389 2450 1032 -2655 -13008 -15415 -16521 -3923 4294 6559 4140 8756 15147
5954 15147 3312 -3219 -2745 -2510 -7187 -5739 -2623 2523 585 -3311 -3994 -4855 38 -2116 -4054
5939 -4054 -7777 -4194 -2202 -6485 -7632 -13126 -14059 -3356 -2690 -2498 -899 -8281 -8965 265 4645 3933
5923 3933 445 56 6213 -621 -10846 -6915 6726 15159 14892 13651 945 -7380 -9366 -8894 -11842
5908 -11842 -16395 -5185 -4189 -11870 -20423 -10277 -3181 7189 12806 8552 1701 -6342 -6691 -4191
5894 -4191 2280 4904 720 -1070 -1361 -4621 -7849 1535 4785 -139 -7524 351 5996 11051 13789
5879 13789 6605 2619 -4691 -10138 -1516 3985 6884 8107 10562 6090 8528 5279 61 -735 5622
$$ packed form
5983i037L442J049p197k245K853R529R41k704r743k60J818M707M510J2027L058
5968A2748n562o797K061j418l687j0353k407j106J2598Q217K265k419M616O391
5954A5147j1835o531M74K35m677J448L116N146j938l896o83q61M893k154j938
5939d054l723L583J992m283j147n494r33J0703O66J92J599p382o84R230M380p12
5923C933l488l89O157o834j0225L931J3641Q433k67j241j2706q325j986M72k948
5908a1842m553J1210R96p681q553J0146P096J0370N617m254o851q043l49K500
5894d191O471K624m184j790k91l260l228R384L250m924p385P875N645N055K738
5879A3789p184l986p310n447Q622N501K899J223K455m472K438l249n218p96O357
$$ plain form
5864 5622 9992 5800 7704 13641 9070 2435 -4427 -4076 1718 2271 -2260 -3617 -1856 2389 5210
5849 5210 8765 2488 -4942 -8569 -4848 5701 2971 -108 12643 9244 11999 7089 -3708 -502
5835 -502 -2885 -5689 -1377 949 2215 11545 8437 2102 -8207 -13856 -7056 -3123 -11948 -18200 -19436
5820 -19436 -14886 -7562 -869 -439 -8248 -3804 2271 7817 9751 13344 10527 4978 -3984 -3886 -6027
5805 -6027 -8155 -8639 -7851 -5448 -6318 -6986 -3806 9030 5988 3069 4410 7836 10864 20424 18130 14151
5789 14151 8032 5505 8801 13325 13006 2702 14410 21676 12614 4721 3267 -3222 -5864 -892
5775 -892 -9706 -10800 1082 802 4176 1894 3401 4711 11647 17679 13637 7920 8224 7900 3611 -3257
5759 -3257 2025 5204 -454 4913 -469 -9129 -9757 -10668 -9653 -3274 -3423 -714 -3228 -3927 182 -3787
$$ packed form
5864E622M370m192J904N937m571o635o862L51N794N53m531j357J761M245K821
5849E210L555o277p430l627L721J0549k730l079J2751l399K755m910j0797L206
5835e02k383k804M312K326J266R330l108o335j0309n649O800L933q825o252j236
5820a9436M550P324O693M30p809M444O075N546J934L593k817n549q962R8k141
5805f027k128m84P88K403q70o68L180J2836l042k919J341L426L028R560k294l979
5789A4151o119k527L296M524l19j0304J1708P266r062p893j454o489k642M972
5775h92q814j094J1882k80L374k282J507J310O936O032m042n717L04l24m289o868
5759c257N282L179n658N367n382q660o28r11J015O379j49K709k514o99M109l969
$$ plain form
5743 -3787 -7568 -170 -3479 475 7384 12438 8592 -117 -10404 -10415 -1631 4736 -694 514 1493
5728 1493 3275 -219 -52 -2836 -14003 -18640 -14287 -8620 -3326 2603 -9034 -4481 1714 1486 5433
5713 5433 4937 -310 -2466 -2743 -3706 2690 9056 13160 4307 -5495 -7685 529 7811 -18 -710 5780
5697 5780 9086 13692 19572 18904 5345 -1607 -11879 -10303 2451 6894 3410 2872 6670 7069 7567
5682 7567 10584 5069 -1744 -10257 -8256 -7391 -17088 -16410 -7722 6500 11057 692 -1046 4306 2329
5667 2329 2510 616 -3086 -6104 -5473 -655 -168 1635 9153 16438 12950 12266 20078 15595 9818 3652
5651 3652 10513 9154 -1796 -9937 -7125 -6783 -8771 -10175 -6705 -4195 3533 11219 7410 6235 -434
5636 -434 -451 -50 4039 5445 7805 10334 11356 4313 -593 -5454 -9401 -15497 -19926 -12437 -2610 -1351
$$ packed form
5743c787l781P398l309L954O909N054l846q709j0287j1Q784O367n430J208R79
5728A493J782l494J67k784j1167m637M353N667N294N929j1637M553O195k28L947
5713E433m96n247k156k77r63O396O366M104q853r802k190Q214P282p829o92O490
5697E780L306M606N880o68j3559o952j0272J576J2754M443l484n38L798L99M98
5682G567L017n515o813q513K001Q65r697O78Q688J4222M557j0365j738N352j977
5667B329J81j894l702l018O31M818M87J803P518P285l488o84P812m483n777o166
5651C652O861j359j0950q141K812L42j988j404L470K510P728P686l809j175o669
5636d34j7M01M089J406K360K529J022p043m906m861l947o096m429P489R827J259
$$ plain form
5620 -1351 -5371 -3762 -2780 -5856 -3481 -8725 -8465 -15193 -20167 -18229 -10030 1452 5523 5952 -6181
5605 -6181 -11428 -5392 293 -6882 -7878 -3833 -4848 2648 7785 13390 4758 -2486 -5247 -3520 -2761
5590 -2761 -6697 -15789 -12193 -1727 -6566 132 2863 -425 1466 -6636 -13720 -8626 -6288 -2330 -1708
5575 -1708 9375 16957 6538 10727 7037 3147 964 -5986 -15376 -10449 -4388 -7412 -16744 -14335
5561 -14335 -9030 736 2375 -4341 3095 3011 -2004 2956 9430 8692 8691 5407 -4578 -11867 -10336 -4170
5545 -4170 -604 -14480 -13816 -6808 -3592 -6419 -10445 3965 2563 5014 10281 5647 350 -5725 -9053
5530 -9053 -5028 -10170 -19002 -20599 -11182 -746 5119 4582 9163 5694 1557 751 1933 6421 7830
5515 7830 12351 13700 10010 11488 10201 10041 -3768 -12834 -12704 -11213 -2081 -7735 -2496 -8742 -7607
$$ packed form
5620a351m020J609R82l076K375n244K60o728m974J938Q199J1482M071M29j2133
5605f181n247O036N685p175r96M045j015P496N137N605q632p244k761J727P59
5590b761l936r092L596J0466m839O698K731l288J891q102p084N094K338L958O22
5575a708J1083P582j0419M189l690l890k183o950r390M927O061l024r332K409
5561a4335N305R766J639o716P436q4n015M960O474p38jl284r985p289J531O166
5545d170L566j3876O64P008L216k827m026J4410j402K451N267m634n297o075l328
5530i053M025n142q832j597R417J0436N865n37M581l469m137q06J182M488J409
5515G830M521J349l690J478j287j60j3809r066J30J491R132n654N239o246J135
$$ plain form
5500 -7607 1196 -405 1417 -542 -8682 -12706 665 -738 -1830 466 645 -7024 -11105 -760 -2556
5485 -2556 -5370 -3278 -1511 -11687 -18608 -12160 -6982 -11878 -11152 -2926 -1421 3498 15671 12102 3703
5470 3703 -4091 -4297 -3214 -2927 -3908 -2343 8863 15110 10743 11480 16391 8876 -3993 -4065 6198 3173
5454 3173 -6213 -7840 -9534 -8320 -3475 1727 732 -648 -8137 -4689 276 -2057 -4448 -10966 -8912
5439 -8912 -2518 5769 -331 -1148 2568 5133 -2962 -6255 -3100 -5084 -8882 -6895 -4920 -2952 -2431
5424 -2431 -3192 -1002 -2829 2370 3636 -6610 -3425 8699 10448 7557 -1308 1903 3767 -933 4579
5409 4579 5352 3831 1909 7937 11998 12912 21299 26228 28306 25494 12452 5057 1704 1910 8771
5394 8771 7662 -1901 -4860 817 -1415 -4250 -11134 -13750 -5789 -355 3646 -796 -776 -563 7482 18296
$$ packed form
5500g607Q803j601J822j959q140m024J3371j403j092K296J79p669m081J0345j796
5485b556k814K092J767j0176o921O448N178m896P26Q226J505M919J2173l569q399
5470C703p794k06J083K87r81J565J1206O247m367P37M911p515j2869p2J0263l025
5454C173r386j627j694J214M845N202r95j380p489L448M965k333k391o518K054
5439h912O394Q287o100q17L716K565q095l293L155j984l798J987J975J968N21
5424b431p61K190j827N199J266j0246L185J2124J749k891q865L211J864m700N512
5409D579P73j521j922O028M061R14Q387M929K078k812j3042p395l353K06O861
5394H771j109r563k959N677k232k835o884k616P961N434M001m442K0K13Q045J0814
$$ plain form
5378 18296 14690 15472 9348 5788 3412 4065 -4680 -10201 734 6048 204 6250 6652 -72 2524
5363 2524 12776 21519 14537 1567 9620 3852 1316 -4120 -4937 -7977 -8673 -11360 -18040 -1709 -1458
5348 -1458 -15096 -10747 1798 6811 2181 3181 4457 -9431 -12752 -17628 -16332 -6048 -5698 4423
5334 4423 1328 -298 2794 3903 3944 -2389 -6626 2930 12362 14099 11406 9780 10764 2368 -6286 -6379
5318 -6379 3321 3428 1745 1876 6510 14403 4502 -7633 -3310 -1275 -4974 -3474 -2129 9486 15030
5303 15030 7981 -813 -646 -7939 -8855 -7030 -10726 -8260 3741 10814 10435 -38 1538 10747 16477
5288 16477 16449 8170 4489 8808 15988 14905 13928 13926 -1447 -5197 -7201 -3229 696 6151 1062 -12483
5272 -12483 -14910 -16847 -2549 3749 -680 -3736 -2086 -7969 -7445 -4154 -1421 -12974 -9021 -2132
$$ packed form
5378A8296l606P82o124l560k376O53q745n521J0935N314n844O046M02o724K596
5363B524J0252Q743o982j2970Q053n768k536n436q17l040o96k687o680J6331K51
5348a458j3638M349J2545N013m630J000J276j3888l321m876J296J0284L50J0121
5334D423l095j626L092J109M1o333m237R556R432J737k693j626R84q396q654r3
5318f379R700J07j683J31M634P893r901j2135M323K035l699J500J345J1615N544
5303A5030p049q794J67p293r16J825l696K466J2001P073l79j0473J576R209N730
5288A6477k8q279l681M319P180j083r77kj5373l750k004L972L925N455n089j3545
5272a2483k427j937J4298O298m429l056J650n883N24L291K733j1553L953O889
$$ plain form
5258 -2132 96 -10347 -18564 -23045 -12210 -3041 -5151 -10547 -2017 -698 -2418 3726 12223 13044 3210
5243 3210 -1278 -6134 -2013 384 8580 14771 5194 -6164 -9994 -3181 9625 17306 8216 4577
5229 4577 8053 12190 2269 -9389 -10359 -7788 812 6644 -4228 -12507 -10092 3833 -2910 -5265
5215 -5265 -6512 -3061 597 4601 10331 6654 90 -918 -12130 -10452 -805 11584 5984 413
5201 413 990 -4963 -10932 -7368 2275 1440 -2630 -2841 4510 5152 -5618 -14550 -8441 -3216 -5397 -10709
5185 -10709 -14619 -18826 -15419 -8655 -8364 -7780 -11083 -13532 -5837 -11583 -11015 -12419 -10940 -3375 5754
5170 5754 9169 12728 8109 4607 2103 -2601 3719 3341 -5948 -6350 -7670 -12780 -3521 2331 6332
5155 6332 3731 2660 3286 9715 10922 7452 -582 -1560 5081 7701 1541 5020 6588 -494 -5425
$$ packed form
5258b132K228j0443q217m481J0835R169k110n396Q530J319j720O144Q497Q21r834
5243C210m488m856M121K397Q196O191r577j1358l830O813J2806P681r090l639
5229D577L476M137r921j1658r70K571Q600N832j0872q279K415J3925o743k355
5215e265j247L451L658M004N730l677o564j008j1212J678R647J2389n600n571
5201D13N77n953n969L564R643q35m070k11P351O42j0770q932O109N225k181n312
5185a0709l910m207L407O764K91N84l303k449P695n746N68j404J479P565R129
5170E754L415L559m619l502k504m704O320l78r289m02j320n110R259N852M001
5155F332k601j071O26O429J207l470q034r78O641K620o160L479J568p082m931
$$ plain form
5140 -5425 6355 14967 12507 694 1708 -783 877 -459 -3760 -4072 -6172 -6845 -2871 212 993
5125 993 -6994 -9374 -11246 -276 14317 18727 8414 -6093 -5956 -2546 3459 4162 1967 -3919 646
5110 646 3405 -4506 -1467 -1071 -4230 -4934 -17642 -24922 -17720 -16271 -12686 -16033 -7599 -11575 -12388 -5686
5094 -5686 7890 8509 6579 10846 14783 11266 11459 7339 7652 12129 7052 3832 4674 6807 1938 -6565
5078 -6565 -3925 -3530 3341 2251 6095 3725 -6198 -9337 -10874 -17666 -16904 -16283 -9870 -8486 -5407 -5851
5062 -5851 -9514 -16377 -14439 -13660 -13458 -14420 -8300 -5770 -6712 -1458 -447 2119 3477 -6941 -8995 -4498
5046 -4498 -5285 7490 11452 5773 9842 12647 3699 -4351 -9841 -3711 -5824 -4601 7859 19141
5032 19141 20844 13764 6244 9898 4726 3285 -10675 -10813 -3488 7341 8917 3466 -1462 -5435
$$ packed form
5140e425J1780Q612k460j1813J014k491J660j336l301l12k100o73L974L083P81
5125I93p987k380j872J0970J4593M410j0313j4507J37L410O005P03k195n886M565
5110F46K759p911L039L96l159p04j2708p280P202J449L585l347Q434l976q13O702
5094e686J3576O19j930M267L937l517J93m120L13M477n077l220Q42K133m869q503
5078f565K640L95O871j090L844k370r923l139j537o792P62O21O413J384L079m44
5062e851l663o863J938P79K02r62O120K530r42N254J011K566J358j0418k054M497
5046d498p87J2775L962n679M069K805q948q050n490O130k113J223J2460J1282
5032A9141J703p080p520L654n172j441j3960j38P325J0829J576n451m928l973
$$ plain form
5018 -5435 -1838 -875 -1035 -8635 -9896 -5487 -91 1757 9179 6661 -1853 -3914 -8857 -10561 -7487
5003 -7487 -3638 -5754 -9961 -11777 -11788 -22814 -17837 -6859 -8045 -6572 150 2207 -7081 -10957 -7696
4988 -7696 -3952 -4368 -7701 -13405 -6201 1569 -873 -3475 -3450 -8238 7990 10698 -5000 -8873 -8211
4973 -8211 -3230 -25 -8430 -5076 5475 7932 -221 756 -595 -973 4765 7586 685 -1215 8714
4958 8714 14381 15496 1897 -7763 -5715 -6963 -9834 -13691 -9788 -2864 6282 6493 5307 -355 -3008
4943 -3008 -3841 -4484 -7776 -4417 -177 1990 234 6938 8111 7215 8523 1155 -4624 -5699 -4824 -928
4927 -928 -3 2085 6087 5849 1447 -728 -565 -7942 -11891 -3472 538 -5419 -8736 -6304 5392 9043
4911 9043 13253 13257 14864 15480 12271 7995 5247 15500 13888 14665 11962 6002 5751 -1863 -5995 -97
$$ packed form
5018e435L597R63j60p600j261M409N396J848P422k518q514k061m943j704L074
5003g487L849k116m207j816j1j1026M977J0978j186J473O722K057r288l876L261
4988g696L744m16l333n704P204P770k442k602K5m788J6228K708j5698l873O62
4973h211M981L205q405L354J0551K457q153R77j351l78N738K821o901j900R929
4958H714N667J115j3599r660K048j248k871l857L903O924R146K11j186n662k653
4943c008q33o43l292L359M240K167j756O704J173q96J308p368n779j075Q75L896
4927i28R25K088M002k38m402k175J63p377l949Q419M010n957l317K432J1696L651
4911I043M210MJ607O16l209m276k748J0253j612P77k703n960k51p614m132N898
$$ plain form
4895 -97 3851 -4144 -3683 2026 -1956 5284 3086 -3601 4655 2506 -10066 -16688 -12260 -11650 -5708 -10658
4879 -10658 -19035 -16497 -13987 -12037 -2156 3330 8125 8072 3812 -10048 -12935 -10735 -9149 -5394 -11692
4864 -11692 -8076 -3112 -1155 -656 -24 5241 7802 2772 3310 2007 4721 6906 -457 -200 222 -7256
4848 -7256 -11835 -14367 2211 5805 4055 6972 11445 5198 -5128 -14035 -13643 -12199 -14529 -12080 -9838
4833 -9838 -13226 -4759 1826 9238 8140 2252 -4185 407 1379 -7364 -7367 -1933 -5961 -8530 -7801 11552
4817 11552 25735 16661 3886 -2804 -8575 -7222 -7004 -9938 -7827 -8349 -909 11449 2515 -2404
4803 -2404 10885 7143 3611 1748 3306 11617 16172 17797 15494 12703 3795 -17931 -19840 -6089
4789 -6089 -5387 -1161 4637 1363 -9187 3149 8981 907 4022 6698 7030 -2675 -7507 -6069 -15626
$$ packed form
4895i7L948p995M61N709l982P240k198o687Q256k149j2572o622M428O10N942m950
4879a0658q377K538K510J950R881N486M795n3m260j3860k887K200J586L755o298
4864a1692L616M964J957M99O32N265K561n030N38j303K714K185p363K57M22p478
4848g256m579k532J6578L594j750K917M473o247j0326q907L92J444k330K449K242
4833i838l388Q467O585P412j098n888o437M592R72q743lN434m028k569P29J9353
4817A1552J4183r074j2775o690n771J353K18k934K111n22P440J2358q934m919
4803b404J3289l742l532j863J558Q311M555J625k303k791q908k1726j909J3751
4789f089P02M226N798l274j0550J2336N832q074L115K676L32r705m832J438r557
$$ plain form
4774 -15626 -17307 -16262 -17089 -14361 -12725 -18070 -19287 -7117 -1520 -4587 -720 -3446 -7070 -7494 -2132
4759 -2132 -69 1104 -496 904 8718 10248 9240 11984 5285 11818 20066 7024 53 -7309 -12845
4744 -12845 -13718 -9891 -9880 -12623 -4942 3258 2317 1521 -5217 -10051 -9342 -4363 -6359 -2192 2196 5685
4728 5685 3343 -2563 -10848 -14438 -8981 -8349 -4387 158 3186 -3019 -8848 -908 2694 -2083 -10649
4713 -10649 -10707 -6344 -6631 -5515 -6374 -10606 -4847 -5855 -12626 -9117 -7374 -6141 -11451 -13060 -9317 -4944
4697 -4944 -2831 3628 276 -5521 -2413 -3884 -5569 -3845 -12058 -9769 -7836 -13017 -14976 -14133 -12436
4682 -12436 -2449 483 1728 1218 -3127 -3241 -8198 -15814 -9570 -16007 -16364 -5794 -832 -2661 -13475
4667 -13475 -4998 -2473 -570 2646 5475 76 1620 -1355 -9556 -4983 -6450 -7689 -7998 -7610 -2289
$$ packed form
4774a5626j681J045q27K728J636n345j217J2170N597l067L867k726l624m24N362
4759b132K063J173j600J400P814J530j008K744o699O533Q248j3042o971p362n536
4744a2845q73L827J1k743P681Q200r41p96o738m834P09M979j996M167M388L489
4728E685k342n906q285l590N457O32L962M545L028o205n829P940L602m777q566
4713a0649n8M363k87J116q59m232N759j008o771L509J743J233n310j609L743M373
4697d944K113O459l352n797L108j471j685J724q213K289J933n181j959Q43J697
4682a2436R987K932J245n10m345j14m957p616O244o437l57J0570M962j829j0814
4667a3475Q477K525J903L216K829n399J544k975q201M573j467j239l09L88N321
$$ plain form
4652 -2289 -4990 -10115 -11468 -11685 -9423 -4003 -11618 -9786 -2221 -212 -1483 -3208 -125 -1268 -6361
4637 -6361 -5372 -7651 -9514 -2033 -7348 -10570 -6734 974 -1757 -7739 -7954 -12442 -9694 -5608 -8548
4622 -8548 -8483 -4150 -3918 -7413 -7380 -10205 -2801 10182 15697 285 -7766 -6123 -5565 -395 -3555 -6879
4606 -6879 -7466 -13793 -5245 -5544 -2793 -2290 -6033 -13433 -13513 -8468 -9786 -5710 -15186 -8286 -2933 -11311
4590 -11311 -16148 -19895 -14254 -6647 3774 14763 7012 4555 5107 2660 -10031 -17057 -18387 -14717
4576 -14717 -8299 3396 5531 5052 -6589 -9637 -5609 -3900 -2529 3828 -5061 -2798 -2645 -1440 4443
4561 4443 7597 -670 -1815 -3525 -1111 -3066 3650 1326 -1774 -9546 -5889 -5416 -3022 290 -672
4546 -672 2008 6588 8029 8583 12578 10335 12720 18414 6927 -6783 -14472 -18855 -15911 -8567 -2494
$$ packed form
4652b289k701n125j353k17K262N420p615J832P565K009j271j725L083j143n093
4637f361R89k279j863P481n315l222L836P708k731n982k15m488K748M086k940
4622h548O5M333K32l495L3k825P404J2983N515j5412q051J643N58N170l160l324
4606f879n87o327Q548k99K751N03l743p400q0N045j318M076r476O900N353q378
4590a1311m837l747N641P607J0421J0989p751k457N52k447j2691p026j330L670
4576a4717O418J1695K135m79j1641l048M028J709J371O357q889K263J53J205N883
4561D443L154q267j145j710K414j955O716k324l100p772L657M73K394L312r62
4546f72K680M580J441N54L995k243K385N694j1487j3710p689m383K944P344O073
$$ plain form
4531 -2494 -3232 -6669 -13676 -17426 -4504 5548 16514 17129 9495 -2668 -13267 -9173 -11577 -16902
4517 -16902 -20772 -14365 -11174 -12378 -5314 6744 20527 14727 -2325 -17524 -13477 3988 7931
4504 7931 -1051 -9136 -8405 -12850 -11242 -4151 -6026 -6531 -4853 -4924 393 3080 5450 6574 5710 8617
4488 8617 10148 11909 11694 -836 -6633 2349 -1734 -5502 3989 13136 14876 8361 7842 8955 14672
4473 14672 9540 4958 4211 7322 6567 5527 12352 15140 7363 5268 9830 5462 9327 8311 14740
4458 14740 10379 11341 17488 16026 15424 10337 5322 2553 -4963 -4588 910 5252 9997 7383 7335 -3941
4442 -3941 -4591 4427 6239 1897 -4031 2596 1653 1441 -7919 -10109 -7042 587 5261 6354 8314 -1677
4426 -1677 -11918 -7960 -2222 -2485 7785 9696 2732 -8598 -6752 -10996 -13284 -7009 -630 -5395
$$ packed form
4531b494p38l437p007l750J2922J0052J0966O15p634j2163j0599M094k404n325
4517a6902l870O407L191j204P064J2058J3783n800j7052j5199M047J7465L943
4504G931q982q085P31m445J608P091j875n05J678p1N317K687K370J124q64K907
4488H617J531J761k15j2530n797Q982m083l768R491R147J740o515n19J113N717
4473A4672n132m582p47L111p55j040O825K788p777k095M562m368L865j016O429
4458A4740m361R62O147j462o02n087n015k769p516L75N498M342M745k614m8j1276
4442c941o50R018J812m342n928O627r43k12r360k190L067P629M674J093J960r991
4426a677j0241L958N738k63J0270J911o964j1330J846m244k288O275O379m765
$$ plain form
4412 -5395 -7101 -6831 235 9447 11893 10935 5596 10485 4645 5764 3738 7376 10049 4537 -1251
4397 -1251 -6512 2502 4386 9898 12299 11084 797 -3524 1845 -2277 -7618 -10535 -11814 -9874 -17800
4382 -17800 -19603 -15475 -12760 -8044 364 7930 10052 9729 9810 12580 8677 12042 5333 2900 -5116
4367 -5116 -364 -1119 -2353 -7294 -12827 -16952 -15815 -6719 1790 -1831 -3153 -5799 -7493 -4782 11233
4352 11233 19075 17052 9733 3176 6126 11782 9912 2057 -4155 -2048 216 1389 2836 7157 7406
4337 7406 13347 21889 21317 16399 10748 11726 5746 -1156 -12085 -9761 -487 -1291 1664 7599 8524 13310
4321 13310 11937 12035 17914 4274 -8680 -13338 -7810 -5655 -13105 -9839 -1632 -306 -4508 -7268 -6553
4306 -6553 -5558 -11465 -11917 -12910 -9189 -8361 -11928 -14077 -18140 -7888 516 -273 7657 10363 11118 11106 13094
$$ packed form
4412e395j706K70P066R212K446r58n339M889n840J119k026L638K673n512n788
4397a251n261R014J884N512K401j215j0287m321N369m122n341k917j279J940p926
4382a7800j803M128K715M716Q408P566K122l23Q1K770l903L365o709k433q016
4367e116M752p55j234m941n533m125J137R096Q509l621j322k646j694K711J6015
4352A1233P842k023p319o557K950N656j870p855o212K107K264J173J447M321K49
4337G406N941Q542n72m918n651R78n980o902j0929K324R274q04K955N935R25M786
4321A3310j373R8N879j3640j2954m658N528K155p450L266Q207J326m202k760P15
4306f553R95n907m52r93L721Q28l567k149m063J0252Q404p89P930K706P55j2J988
$$ plain form
4289 13094 13494 11579 13671 5643 3918 -113 -9232 -11341 -17931 -16725 -15766 -2028 4835 8557 3870
4274 3870 4655 7442 6376 9401 7720 11972 10553 6393 1721 -3996 -5705 3977 2220 -17680 -21803
4259 -21803 -21171 -11042 2259 6833 6627 10488 9015 7205 7951 5336 14266 8489 4845 678 -2426
4244 -2426 -5945 -1122 -5176 -7449 -5314 -8894 -15688 -10759 -697 -9166 -8192 46 8282 6928 14422
4229 14422 9415 -8440 -9362 -14885 -6857 -153 5965 12663 10814 8487 7285 8271 345 -3177 3497
4214 3497 9154 11724 9663 250 -1577 -3113 -10116 -7595 -8250 -17898 -17611 -5736 1631 9371 14
4199 14 -4823 -2928 -532 -1003 4304 1481 3783 9644 16278 5958 8909 6631 3168 2365 8411 7691
$$ packed form
4289A3094M00j915K092q028j725m031r119k109o590J206R59J3738O863L722m687
4274C870P85K787j066L025j681M252j419m160m672n717j709R682j757j9900m123
4259b1803O32J0129J3301M574k06L861j473j810P46k615Q930n777l644m167l104
4244b426l519M823m054k273K135l580o794M929J0062q469R74Q238Q236j354P494
4229A4422n007j7855r22n523Q028O704O118O698j849k327j202R86p926l522O674
4214C497N657K570k061r413j827j536p003K521o55r648K87J1875P367P740r357
4199A4m837J895K396m71N307k823K302N861O634j0320K951k278l463q03O046p20
$$ [...]
##END NTUPLES=NMR SPECTRUM
##END=
