##TITLE=Analysis number 328181
Compound Code cc 00813
Book Reference lab3
Project Code adrs
Chemist Name stores
##JCAMPDX= 6.0         $$ Bruker NMR JCAMP-DX V2.0
##DATA TYPE= NMR SPECTRUM
##DATA CLASS= NTUPLES
##ORIGIN= Bruker BioSpin GmbH
##OWNER= nmr
$$ XWIN-NMR		Version 3.5
$$ Thu May 10 13:33:55 2007 GMT Daylight Time (UT+1h)  MAYBRIDGE\nmr@NMR_250MHZ
##.OBSERVE FREQUENCY= 250.131544655141
##.OBSERVE NUCLEUS= ^1H
##.ACQUISITION MODE= SIMULTANEOUS (DQD)
##.ACQUISITION SCHEME= undefined
##.AVERAGES= 16
##.DIGITISER RES= 18
##SPECTROMETER/DATA SYSTEM= dpx250
##.PULSE SEQUENCE= zg30
##.SOLVENT NAME= DMSO
##.SHIFT REFERENCE= (INTERNAL, DMSO, 0, 16.522)
##AUDIT TRAIL= $$ (NUMBER, WHEN, WHO, WHERE, WHAT)
$$ ##TITLE= Audit trail, XWIN-NMR		Version 3.5
$$ ##JCAMPDX= 5.01
$$ ##ORIGIN= Bruker BioSpin GmbH
$$ ##OWNER= nmr
$$ C:\u/data/dgb/nmr/ADRS/780/pdata/1/auditp.txt
$$ ##AUDIT TRAIL=  $$ (NUMBER, WHEN, WHO, WHERE, WHAT)
(   1,<2007-05-10 13:33:32.82 +100>,<MAYBRIDGE\nmr>,<NMR_250MHZ>,
      <created by zg, POWCHK disabled, PULCHK disabled
       configuration hash MD5:
       76 6E 9A 78 1E 09 19 81 EC 84 63 8F B0 6A 59 2D
       data hash MD5: 64K
       FE A1 3F 3E 7E C0 8D 86 C5 48 C2 21 F7 53 09 6D>)
(   2,<2007-05-10 13:33:47.11 +100>,<MAYBRIDGE\nmr>,<NMR_250MHZ>,
      <Start of raw data processing
       ef LB = 0.3 FT_mod = 6 PKNL = 1 SI = 32K 
       data hash MD5: 32K
       79 15 D5 EF 0B C3 86 70 40 86 99 4B CF 4B B0 D4>)
(   3,<2007-05-10 13:33:48.72 +100>,<MAYBRIDGE\nmr>,<NMR_250MHZ>,
      <apk 
       data hash MD5: 32K
       F6 22 62 65 EF E2 61 3A 1C 4E 5E B8 88 53 7B A5>)
(   4,<2007-05-10 13:33:49.44 +100>,<MAYBRIDGE\nmr>,<NMR_250MHZ>,
      <abs ABSG = 5 
       data hash MD5: 32K
       E6 22 90 66 81 D3 BA B3 E7 A8 59 82 71 08 CC 43>)
$$ ##END=
$$ 
$$ hash MD5
$$ FC 14 14 82 A9 11 C8 28 2A 3C 16 23 99 CC A0 7B
##$RELAX= 
##$RELAX= 
##$RELAX= 
##$RELAX= 
##$RELAX= 
##$RELAX= 
##$RELAX= 
$$ Bruker specific parameters
$$ --------------------------
##$DU= <C:\u>
##$EXPNO= 780
##$NAME= <ADRS>
##$PROCNO= 1
##$TYPE= <nmr>
##$USER= <dgb>
##$AMP= (0..31)
100 100 100 100 100 100 100 100 100 100 100 100 100 100 100 100 100 100 
100 100 100 100 100 100 100 100 100 100 100 100 100 100 
##$AQSEQ= 0
##$AQ_mod= 3
##$AUNM= <au_zg>
##$AUTOPOS= <27 >
##$BF1= 250.13
##$BF2= 250.13
##$BF3= 250.13
##$BF4= 250.13
##$BF5= 500.13
##$BF6= 500.13
##$BF7= 500.13
##$BF8= 500.13
##$BYTORDA= 1
##$CFDGTYP= 0
##$CFRGTYP= 5
##$CHEMSTR= <none>
##$CNST= (0..31)
1 1 145 1 1 1 1 1 1 1 1 1 1 1 1 1 1 1 1 1 1 1 1 1 1 1 1 1 1 1 1 1 
##$CPDPRG= <>
##$CPDPRG1= <>
##$CPDPRG2= <>
##$CPDPRG3= <>
##$CPDPRG4= <mlev>
##$CPDPRG5= <mlev>
##$CPDPRG6= <mlev>
##$CPDPRG7= <mlev>
##$CPDPRG8= <mlev>
##$CPDPRGB= <>
##$CPDPRGT= <>
##$D= (0..31)
0 1 0 0 0 0 0 0 0 0.06 0 0 0 0 0 0 0.0002 0 0 0 0 0 0 0 0 0 0 0 0 0 0 
0 
##$DATE= 1178800411
##$DBL= (0..7)
120 120 120 120 120 120 120 120 
##$DBP= (0..7)
150 150 150 150 150 150 150 150 
##$DBP07= 0
##$DBPNAM0= <>
##$DBPNAM1= <>
$$ [...]
##$SUBNAM7= <"">
##$SUBNAM8= <"">
##$SUBNAM9= <"">
##$SW= 20.6930455092707
##$SWIBOX= (0..15)
0 0 3 0 0 0 0 0 0 0 0 0 0 0 0 0 
##$SW_h= 5175.983436853
##$TD= 65536
##$TD0= 1
##$TE= 683.16
##$TE2= 300
##$TE3= 300
##$TEG= 300
##$TL= (0..7)
0 120 120 120 120 120 120 120 
##$TP= (0..7)
150 150 150 150 150 150 150 150 
##$TP07= 0
##$TPNAME0= <>
##$TPNAME1= <>
##$TPNAME2= <>
##$TPNAME3= <>
##$TPNAME4= <>
##$TPNAME5= <>
##$TPNAME6= <>
##$TPNAME7= <>
##$TPOAL= (0..7)
0.5 0.5 0.5 0.5 0.5 0.5 0.5 0.5 
##$TPOFFS= (0..7)
0 0 0 0 0 0 0 0 
##$TUNHIN= 0
##$TUNHOUT= 0
##$TUNXOUT= 0
##$USERA1= <user>
##$USERA2= <user>
##$USERA3= <user>
##$USERA4= <user>
##$USERA5= <user>
##$V9= 5
##$VALIST= <valist>
##$VCLIST= <CCCCCCCCCCCCCCC>
##$VD= 0
##$VDLIST= <DDDDDDDDDDDDDDD>
##$VPLIST= <PPPPPPPPPPPPPPP>
##$VTLIST= <TTTTTTTTTTTTTTT>
##$WBST= 1024
##$WBSW= 4
##$XGAIN= (0..3)
0 0 0 0 
##$XL= 0
##$YL= 0
##$YMAX_a= 345465
##$YMIN_a= -306232
##$ZGOPTNS= <>
##$ZL1= 120
##$ZL2= 120
##$ZL3= 120
##$ZL4= 120
##$ABSF1= 16.522
##$ABSF2= -4.171173
##$ABSG= 5
##$ABSL= 3
##$ALPHA= 0
##$AQORDER= 0
##$ASSFAC= 0
##$ASSFACI= 0
##$ASSFACX= 0
##$ASSWID= 0
##$AUNMP= <proc_1d>
##$AZFE= 0.1
##$AZFW= 0.1
##$BCFW= 0
##$BC_mod= 0
##$BYTORDP= 0
##$COROFFS= 0
##$CY= 12.5
##$DATMOD= 1
##$DC= 0
##$DFILT= <>
##$DTYPP= 0
##$F1P= 14.0000005364418
##$F2P= -0.99999901652339
##$FCOR= 0.5
##$FTSIZE= 32768
##$FT_mod= 6
##$GAMMA= 0
##$GB= 0
##$INTBC= 1
##$INTSCL= 1
##$ISEN= 128
##$LB= 0.3
##$LEV0= 0
##$LPBIN= 0
##$MAXI= 10000
##$MC2= 0
##$MEAN= 0
##$ME_mod= 0
##$MI= 0
##$NCOEF= 0
##$NC_proc= -5
##$NLEV= 6
##$NOISF1= 0
##$NOISF2= 0
##$NSP= 0
##$NTH_PI= 0
##$NZP= 0
##$OFFSET= 16.522
##$PC= 1
##$PHC0= -62.31915
##$PHC1= -0.6743256
##$PH_mod= 1
##$PKNL= yes
##$PPARMOD= 0
##$PSCAL= 4
##$PSIGN= 0
##$REVERSE= no
##$SF= 250.13
##$SI= 32768
##$SIGF1= 0
##$SIGF2= 0
##$SINO= 400
##$SIOLD= 32768
##$SREGLST= <1H.DMSO>
##$SSB= 0
##$STSI= 32768
##$STSR= 0
##$SW_p= 5175.98343685301
##$SYMM= 0
##$S_DEV= 0
##$TDeff= 65536
##$TDoff= 0
##$TI= <Analysis number 999999
Compound Code 99
Book Reference 9
Project Code 9>
##$TILT= no
##$TM1= 0
##$TM2= 0
##$TOPLEV= 0
##$USERP1= <user>
##$USERP2= <user>
##$USERP3= <user>
##$USERP4= <user>
##$USERP5= <user>
##$WDW= 1
##$XDIM= 32768
##$YMAX_p= 382260435
##$YMIN_p= -366394
$$ End of Bruker specific parameters
$$ ---------------------------------
##NTUPLES= NMR SPECTRUM
##VAR_NAME=  FREQUENCY,     SPECTRUM/REAL,   SPECTRUM/IMAG
##SYMBOL=    X,             R,               I
##VAR_TYPE=  INDEPENDENT,   DEPENDENT,       DEPENDENT
##VAR_FORM=  AFFN,          ASDF,            ASDF
##VAR_DIM=   32768,         32768,           32768
##UNITS=     HZ,            ARBITRARY UNITS, ARBITRARY UNITS
##FACTOR=    0.157963299565203, 1,           1
##FIRST=     4132.6476996994, 0,             0
##LAST=      -1043.33573715361, 0,           0
##MIN=       -1043.33573715361, -366394,     0
##MAX=       4132.6476996994, 382260435,     0
$$ Real data points
##PAGE= N=1
##DATA TABLE= (X++(R..R)), XYDATA
$$ [...]
19311D27692k9530P8677K4762k1184p3210k010L5783M3204m7896l4180m0632k0606
$$ 427692 398162 476839 501601 480417 407207 405197 440980 484184 436288 402108 361476 340870
19299C40870J934O5870M1595P141k6624O4389o680o9969k9224l5039j2079L808
$$ 340870 342804 408674 450269 457410 430786 495175 488495 418526 389302 354263 342184 345992
19287C45992j7403Q132M6333r720j9915K5585N4512P0170k5723m7399l0120O294
$$ 345992 328589 336721 383054 373334 353419 379004 433516 503686 477963 430564 400444 406738
19275D06738O6765O6654J3744j5469n8855p3633N8101R1159L4953o0261o5301
$$ 406738 473503 540157 553901 538432 479577 405944 464045 555204 590157 529896 464595
19264D64595j7192K1806k4706k9247j0959j4401l43j1219l3532k401O279m2477
$$ 464595 447403 469209 444503 415256 404297 389896 389553 378334 344802 342401 348680 306203
19252C06203o6525k1996N4351M3996L261K389K4495o406K582j2178m8310L3211
$$ 306203 239678 217682 272033 316029 319290 321679 346174 339768 342350 330172 281862 315073
19240C15073J6687M6939J699k857j2469j5619m093m1712m136Q71O690J3926J4927
$$ 315073 331760 378699 380398 377541 365072 349453 345360 303648 299512 300383 307073 320999 335926
19227C35926J4937P3269p707j8144P454m8233l3661J013j1540j2992L9435M9140
$$ 335926 350863 424132 416425 398281 405735 357502 323841 324854 313314 300322 339757 388897
19215C88897N7146L4588l8264m3507n9979q1166j4874K4890j8607n4610L1095
$$ 388897 446043 480631 442367 398860 338881 257715 242841 267731 249124 194514 225609
19204B25609M3390K113j6813k0421M875K2654k7496k6806r223M0839k1444j3739
$$ 225609 268999 271112 254299 233878 238753 261407 233911 207105 197882 238721 217277 203538
19192B03538J9500k855n1972J8011N0303O2568l5480m6941l3468k13M4941M4650
$$ 203538 223038 220183 168211 186222 236525 299093 263613 216672 183204 182991 227932 272582
19180B72582l8462m5728k0433k590L4275L7107J7122N1488O242m7561o6583m9040
$$ 272582 234120 188392 167959 165369 199644 236751 253873 305361 311603 264042 197459 148419
19168A48419j60P4204Q0462J5183k5375j6555j5354j6700o854L5931r935k5869
$$ 148419 148259 222463 302925 318108 292733 276178 260824 244124 237270 273201 263266 237397
19156B37397K4118P371l3861l0936K7518K9988r218J35m909p39p9433J8292N4218
$$ 237397 261515 268886 235025 204089 231607 261595 252377 252512 247603 246864 167431 185723 239941
19143B39941J9608O9541J6475o6386k5424j8498R75K2588n0283j7197q19Q680
$$ 239941 259549 329090 345565 279179 253755 235257 236232 258820 208537 191340 190521 199201
19131A99201j244J2073R663Q650j4277L0211Q868J154K4838j7388j9446k7126
$$ 199201 197957 210030 219693 228343 214066 244277 253145 254299 279137 261749 242303 215177
19119B15177J8869K2146J5463L3579j2742m3699l3382l9803K5904L1640K6548
$$ 215177 234046 256192 271655 305234 292492 248793 215411 175608 201512 233152 259700
19108B59700p026n906p113q927J6976R863n6982m3544J6533Q060m7906O7004l447
$$ 259700 252674 246768 239655 230728 247704 257567 200585 157041 173574 181634 133728 200732 197285
19095A97285K0362l1174K8298j5849p3519j3065O258K6094Q5860L010L8859J5751
$$ 197285 217647 186473 214771 198922 125403 112338 118596 144690 230550 233560 272419 288170
19083B88170K4710J3341j6779j1909l0036o6363j08745M3392L5895J2208l8088
$$ 288170 312880 326221 309442 297533 267497 201134 92389 135781 171676 183884 145796
19072A45796J2012k6354K9408M441j9508K5895j4689j9525j7107J3797M2994P404
$$ 145796 157808 131454 160862 165303 145795 171690 157001 137476 120369 134166 177160 184564
19060A84564o841m2363m224m543K053J8263J3668l126m2090k1998K049M3065j6223
$$ 184564 177723 135360 131136 126593 128646 146909 160577 157451 115361 93363 95412 138477 122254
19047A22254p4769p838R543L6876L2158K4237R475P002j974K5458K9099N756Q573
$$ 122254 47485 39647 49190 86066 118224 142461 151936 158938 156964 182422 211521 217277 225850
19034B25850L1434K0841n957k7655k6180K9819k2845q0471k2416j155J8120J7462
$$ 225850 257284 278125 272168 244513 218333 248152 225307 144836 122420 121265 139385 156847
19022A56847J8440l0462m1548k2370N3884K5856Pk0150o0713j8993L9597r076
$$ 156847 175287 144825 103277 80907 134791 160647 160654 140504 79791 60798 100395 91319
19010I1319K0345l6272K1588n016o817j066j0245l8576K3952M2043l8148r151
$$ 91319 111664 75392 96980 91964 85147 84081 73836 35260 59212 101255 63107 53956
18998E3956M397K2062J00229K3931o1054k5002J1714K5624J4164R684k2829M195
$$ 53956 58353 80415 180644 204575 143521 118519 130233 155857 170021 179705 156876 161071
18986A61071k7565k3959J7668o194j6601P75q518o480j0629J6273J3016N669L4665
$$ 161071 133506 109547 127215 121021 104420 105195 96677 90197 79568 95841 108857 114526 149191
18973A49191k0815j797o939Q547N5468j8204l2936l5010o1518K7532L8401L444
$$ 149191 128376 126579 119640 128187 183655 165451 132515 97505 35987 63519 101920 105364
18961A05364j9328k900J2119K7346J772J2557J5408k3039J5734l8552J0054L9465
$$ 105364 86036 83136 95255 122601 124373 136930 152338 129299 145033 106481 116535 156000
18949A56000j1628P108l13L0120j1623l5827k3406K2206M1653K6778k4149K1424
$$ 156000 144372 151480 151167 181287 169664 133837 110431 132637 174290 201068 176919 198343
18937A98343j0708l9795j0657k5885j1086L6793j6002j4119o920j3104r494j5650
$$ 198343 187635 147840 137183 111298 100212 137005 121003 106884 99964 86860 77366 61716
18925F1716L6156L7204J4626R085k9632j9929p456k4618k1742m0605P061Q8087
$$ 61716 97872 135076 149702 158787 129155 109226 101770 77152 55410 14805 21866 109953
18913A09953J9930k9621k5581l327L5443K3909l8936m238j7861M5085Q2819l8423
$$ 109953 129883 100262 74681 71354 106797 130706 91770 87532 69671 114756 197575 159152
18901A59152L313J2322j05282m1886J9456j7452N6465M3611m4547O027R851J0776
$$ 159152 162465 174787 69505 27619 47075 29623 86088 129699 85152 91179 101030 111806
18889A11806j9631l4579J2039J5623M0176l9949l3473j6807K5536P3149O540M8305
$$ 111806 92175 57596 69635 85258 125434 85485 52012 35205 60741 133890 140430 188735
18877A88735k2054K2515M4378m7533k8969M5143o8052o1998J8081M3701m9448
$$ 188735 166681 189196 233574 186041 157072 202215 134163 72165 90246 133947 84499
18866H4499L718K2280o9379q279R782M1645L3473P148m8782j5730K1986j0602
$$ 84499 88217 110497 41118 32839 42621 84266 117739 124887 76105 60375 82361 71759
18854G1759P0954j053l1205l804j7331q5481k0663M7525k4366l8000K1242M6268
$$ 71759 142713 141660 110455 106651 89320 3839 -16824 30701 6335 -31665 -10423 35845
18842C5845J3308J4318K5533k3890N7735J0764K7860J7249J9829l1896m5665l4996
$$ 35845 49153 63471 89004 65114 122849 133613 161473 178722 198551 166655 120990 85994
18830H5994j8935M4790Q0886J2466O7950N677Q742O5789P0354N2391P7296J01261
$$ 85994 67059 111849 192735 205201 273151 278828 287570 353359 423713 476104 553400 654661
18818F54661O1996M6352k1219J3503K7994L155m7189J0808L7496R271L1137M6099
$$ 654661 716657 763009 741790 755293 783287 786442 739253 750061 787557 796828 827965 874064
18806H74064p282P4339J4765j7703n1857r1307l2907p4492k6408l2848m2253l3364
$$ 874064 866782 941121 955886 938183 886326 795019 762112 687620 661212 628364 586111 552747
18794E52747n4233m1489m5252j20877q8323q3560r0475J2272L0979m751P0709
$$ 552747 498514 457025 411773 290896 202573 119013 28538 40810 71789 67038 137747
18783A37747J05898m1053k7349k2235n0136j9034P213o7K2257K0823K6706j00466
$$ 137747 243645 202592 175243 153008 102872 83838 91051 90984 113241 134064 160770 60304
18771F0304l6382Q180K2403q240J653J884L4197J2691K1132M4144j7915m3453
$$ 60304 23922 32102 54505 46265 47918 49802 83999 96690 117822 161966 144051 100598
18759A00598k7355J8626p317j962N8813L4509l2496l2057O3387m6884j3915O415
$$ 100598 73243 91869 84552 82590 141403 175912 143416 111359 174746 127862 113947 120362
18747A20362J8233J0029N221j9799n8105m9967p3117N0571R1303j4082j9973N437
$$ 120362 138595 148624 153845 134046 75941 25974 -47143 3428 94731 80649 60676 66113
18735F6113m387P010k2216k0407K0237R2565L2137k3425l5427n9686l7333k2848
$$ 66113 61726 68736 46520 26113 46350 138915 171052 147627 112200 52514 15181 -7667
18723g667o911j5537j0391M3942M59L4751O1157j9387n1469j4629R272j2251O5214
$$ -7667 -14578 -30115 -40506 3436 3895 38646 99803 80416 28947 14318 23590 11339 76553
18710G6553Q2240l0357n7087O964K0332n068R99M229J773j3980O6486J689k5779
$$ 76553 158793 128436 71349 78313 98645 93577 94576 98805 100578 86598 153084 154773 128994
18697A28994m3131K1652l5847o3593O678j0738l965K5344K5053r72k8829m1833
$$ 128994 85863 107515 71668 8075 14753 4015 50 25394 50447 49475 20646 -21187
18685b1187J2393L7631j4710k7197l0701O825K3488k2049n9325k026M1129L0191
$$ -21187 -8794 28837 14127 -13070 -43771 -36946 -13458 -35507 -94832 -96858 -55729 -25538
18673b5538R4945L2543Q245J7182K7130l3558r0520p3540M1056L9719l2920j3009
$$ -25538 69407 101950 110195 127377 154507 120949 30429 -43111 -2055 37664 4744 -8265
18661h265K9747K7459k2035k4988p527N627O884m6830j8757N2498K0343L1881
$$ -8265 21482 48941 26906 1918 -5609 18 6902 -39928 -58685 -6187 14156 46037
18649D6037L1229l2839k5061k6652K1203k0665K2495M8228o138k7234l7196k3952
$$ 46037 77266 44427 19366 -7286 13917 -6748 15747 63975 57837 30603 -6593 -30545
18637c0545J2712K7635O175R725O550Q023l8202o9246k2652j4964J0849J3805
$$ -30545 -17833 9802 15977 25702 32252 40275 2073 -67173 -89825 -104789 -93940 -80135
18625h0135J3265j8219p3494q0120j947K4203J2342j6393L676J0527Q135L4787
$$ -80135 -66870 -85089 -158583 -238703 -240650 -216447 -204105 -220498 -216822 -206295 -198160 -163373
18613a63373m553L234m6977J9880K9172l530k7948L8744Q7236K7378r56L980L3621
$$ -163373 -167926 -164692 -211669 -191789 -162617 -166147 -194095 -155351 -68115 -40737 -41693 -37713 -4092
18600d092p913N8550O0022N1290P5426N0034N722J5508j274J7194l297J8342J4957
$$ -4092 -12005 46545 106567 157857 233283 283317 289039 304547 303273 320467 317170 335512 350469
18587C50469k9244j1042O8135J9367K9519J9627k6314l8315J1113m4038n2278
$$ 350469 321225 310183 378318 397685 427204 446831 420517 382202 393315 349277 296999
18576B96999m8591Q931J3712l5440m5856j740l5747o9493o7906k0388M2531o731
$$ 296999 248408 257339 271051 235611 189755 188015 152268 82775 14869 -5519 37012 30281
18564C0281J8260J4597J3825l7517o0445J4091O440p445J9963L2381P820M2430
$$ 30281 48541 63138 76963 39446 -20999 -6908 -468 -7913 12050 44431 52251 94681
18552I4681K3749k8224M2689O4390Q1148J1871M1695K4957k0708M0877L0110L1206
$$ 94681 118430 90206 132895 197285 278433 290304 331999 356956 336248 377125 407235 438441
18540D38441l8448l5819j2211j8080K5860K386j4468J9613k8657L0809N4503l1996
$$ 438441 399993 364174 351963 333883 359743 362129 347661 367274 338617 369426 423929 391933
18528C91933j1194m8616j7179j713n1802j1424l9610p6945k7816K0911n131L4914
$$ 391933 380739 332123 314944 313231 261429 250005 210395 133450 105634 126545 121414 156328
18516A56328Q1168J023L154Q3535O8973P7334O9912P7367J6933k2271K7022L4108
$$ 156328 237496 238519 241673 325208 394181 471515 541427 618794 635727 613456 640478 674586
18504F74586M0444n642k2107N1818P1154K0614o6993j5308N3472R89j427n1173
$$ 674586 715030 709388 687281 739099 810253 830867 763874 748566 802038 803027 801600 750427
18492G50427j16055q1208j15920q1471l1833k4985O607o4252r5333k7132K5383
$$ 750427 634372 553164 437244 355773 323940 298955 305562 241310 145977 118845 144228
18481A44228k7691K360n5122r0840q4875k7378j232K3485L9928M3622O2888j5003
$$ 144228 116537 118897 63775 -27065 -111940 -139318 -140550 -117065 -77137 -33515 29373 14370
18469A4370n655n7254n2153J1877k6571m7558M4552L0395L7004n5123o3068m714
$$ 14370 8715 -48539 -100692 -88815 -115386 -162944 -118392 -87997 -50993 -106116 -169184 -173898
18457a73898j6473M3524M8166K6173Q255K7049M341K4776q900K4253j3810k6413
$$ -173898 -190371 -146847 -98681 -72508 -64253 -37204 -32863 -8087 -16987 7266 -6544 -32957
18445c2957m203N6558k4708M5703M9553K9616j0369o0713J0125J1235M1247K6275
$$ -32957 -37160 19398 -5310 40393 89946 119562 109193 48480 58605 69840 111087 137362
18433A37362K1428m3490l9937p0793m4142J9526M2267J4660N0099M4487n9792
$$ 137362 158790 115300 75363 4570 -39572 -20046 22221 36881 86980 131467 71675
18422G1675n9627K3490N2815K1528m8132m7395l1955K7324K5868M0328j312k5150
$$ 71675 12048 35538 88353 109881 61749 14354 -17601 9723 35591 75919 74607 49457
18410D9457m8875j8147l9714m366J1364m2429j6141P6479J9228N3866P0693L7553
$$ 49457 582 -17565 -57279 -61645 -50281 -92710 -108851 -32372 -13144 40722 111415 148968
18398A48968J913M9834K6959J1114R0397M5229J06950J92098J21046Q1841Q2894
$$ 148968 150881 200715 227674 238788 329185 374414 481364 673462 794508 876349 959243
18387I59243R2394Q6188J60078J85269J28460O4783N1704o751n5134n6684r561
$$ 959243 1051637 1137825 1297903 1483172 1611632 1676415 1728119 1721368 1666234 1609550 1599989
18376A599989P6945P8572P6111L4904p8086o5076l9628m2642n8328j26605j19470
$$ 1599989 1676934 1755506 1831617 1866521 1788435 1723359 1683731 1641089 1582761 1456156 1336686
18365A336686p3847m5678q4118j07500l1191l2765n9300n1856j9117K2805O9898
$$ 1336686 1262839 1217161 1133043 1025543 994352 961587 902287 850431 831314 854119 924017
18354I24017N7420Q331N1007M9738O3469P8408J71450K02799K88180L18607L18666
$$ 924017 981437 989768 1040775 1090513 1153982 1232390 1403840 1606639 1894819 2213426 2532092
18343B532092L35657L51558L45719L22064M38221N57711O46289O91604P47719
$$ 2532092 2867749 3219307 3565026 3887090 4325311 4883022 5529311 6220915 6968634
18334F968634Q23688J017059J355682J866562K355576L109515M066258N109664
$$ 6968634 7792322 8809381 10165063 12031625 14387201 17496716 21562974 26672638
18326B6672638O277347P404474Q356410R013115R383550R761777J0242199J0892634
$$ 26672638 32949985 40354459 48710869 57723984 67107534 76869311 87111510 98004144
18318I8004144J1592784J1810809J1165371R752644P784701N554925L378515J434176
$$ 98004144 109596928 121407737 132573108 142325752 150110453 155665378 159043893 160478069
18310A60478069M16022M23351J059565J717344K070286J792612N13416j819096
$$ 160478069 160894091 161317442 162377007 164094351 166164637 167957249 168470665 166651569
18302A66651569m606991p350985r654088j1377744j2354369j2211952j1455448
$$ 166651569 162044578 154693593 145039505 133661761 121307392 109095440 97639992
18295I7639992j0772511j0314712r974824r577574r095341q170187p007017n666865
$$ 97639992 86867481 76552769 66577945 57000371 47905030 39734843 32727826 27060961
18287B7060961m535052l526309k710935k150580j697566j312344j104574r52113
$$ 27060961 22525909 18999600 16288665 14138085 12440519 11128175 10023601 9071488
18279I071488q03429o75147n64417n12289m67781l85689l68764l77034m04116
$$ 9071488 8268059 7592912 7028495 6516206 6048425 5662736 5293972 4916938 4512822
18270D512822l26573k74386k57427k37627k45305k58816j57117o2741p4738j18166
$$ 4512822 4186249 3911863 3654436 3416809 3171504 2912688 2755571 2692830 2618092 2499926
18260B499926q5918j14451j32112j09488k2275n9237j00259j22804o5047q7830
$$ 2499926 2414008 2299557 2167445 2057957 2035682 1976445 1876186 1753382 1688335 1600505
18250A600505p5532l5935q3019o6746l8587k2558l2528l0193m394o1728j04764
$$ 1600505 1524973 1489038 1406019 1339273 1300686 1278128 1245600 1215407 1211013 1149285 1044521
18239A044521o1466l8938m9127K1279L3870p34m2393j06189q3972N809K477l8088
$$ 1044521 983055 944117 894990 916269 950139 949405 907012 800823 716851 722660 725137 687049
18227F87049J3356K2501K0865J1002L596O8036J0041J8464O9571N9304J028k6314
$$ 687049 700405 722906 743771 754773 758369 826405 836446 854910 924481 983785 984813 958499
18215I58499n9296J720l5067m3002L3599P882m4684j0407r560k005M7067j1565
$$ 958499 899203 900923 865856 822854 856453 864335 819651 809244 799684 797679 844746 833181
18203H33181m5217M101K780j21298K0974M930j1559M1058J3609J1639K0185j7914
$$ 833181 787964 792065 794845 673547 694521 699451 687892 728950 742559 754198 774383 756469
18191G56469o2772j5833O7980L3368m2957l1748k5249K0478M0491J3722k0594
$$ 756469 693697 677864 745844 779212 736255 704507 679258 699736 740227 753949 733355
18180G33355l0214P1138J9597l8832o5859k8332o724O6235Q973L2481P3051K5914
$$ 733355 703141 774279 793876 755044 689185 660853 654129 720364 729337 761818 834869 860783
18168H60783M6557N1074R0718J22408L6437N2986P6056O863o3683j15672m0984
$$ 860783 907340 958414 1049132 1171540 1207977 1260963 1337019 1343882 1280199 1164527 1123543
18157A123543p698J0759R9163O9219P633N3097O5953M9333k0531l395o1346p2492
$$ 1123543 1115845 1126604 1225767 1294986 1302619 1355716 1421669 1471002 1450471 1447076 1385730 1313238
18145A313238k8502p6140o7937p3487m192O6970J778K4827m9450p3826q540K0227
$$ 1313238 1284736 1208596 1140659 1067172 1062980 1129950 1131728 1156555 1107105 1033279 1024739 1044966
18133A044966Q2523O6067Q9378j804L2537O7633N6195R4690J24691Q2559J21318
$$ 1044966 1127489 1193556 1282934 1281130 1313667 1381300 1437495 1532185 1656876 1739435 1860753
18122A860753J03847R4616J27627K07487K17180K57592K69771K44067L17423L48853
$$ 1860753 1964600 2059216 2186843 2394330 2611510 2869102 3138873 3382940 3700363 4049216
18112D049216M25466M75784N82859P18549R44637J224670J676556K396601L220889
$$ 4049216 4474682 4950466 5533325 6251874 7196511 8421181 10097737 12494338 15715227
18103A5715227M273289N372561O576297P558289Q212452Q499765Q411980P980935
$$ 15715227 19988516 25361077 31937374 39495663 47708115 56207880 64619860 72600795
18095G2600795O746221M377155J347691j290989k625550k540609j881064j318878
$$ 72600795 79347016 83724171 85071862 83780873 81155323 78614714 76733650 75414772
18087G5414772p13277q1389O43855J325588J681014J178014p20019l379301n715470
$$ 75414772 74701495 74620106 75263961 76589549 78270563 79448577 78728558 75349257 69633787
18078F9633787o994037p298386p354276p213196o762766n963661n023346l896313
$$ 69633787 62639750 55341364 47987088 40773892 34011126 28047465 23024119 19127806
18070A9127806l054591k227863j657885j239676r09675n89006l97978k63209j56484
$$ 19127806 16073215 13845352 12187467 10947791 10038116 9449110 9051132 8787923 8631439
18061H631439m1622J8259K19383L91925M98168Q07535J349278K041110K718562
$$ 8631439 8589817 8608076 8827459 9219384 9717552 10525087 11874365 13915475 16634037
18052A6634037L751453N020815O349785P606281Q576712R213239R399398R211510
$$ 16634037 20385490 25406305 31756090 39362371 47939083 57152322 66551720 75763230
18044G5763230Q705540P229412M509277J095915j838867k971335k614645j833481
$$ 75763230 84468770 91698182 96207459 97303374 95464507 92493172 89878527 88045046
18036H8045046j141994k93113M18657J078623J752974K042652J038335j457106
$$ 88045046 86903052 86609939 87028596 88107219 89860193 91902845 92941180 91484074
18028I1484074m604851p259351q529699q900347q894490q535198p871950o962123
$$ 91484074 86879223 79619872 71090173 62189826 53295336 44760138 36888188 29926065
18020B9926065n747189m518450l502526k731552k050384j465136j076243r00998
$$ 29926065 24178876 19660426 16157900 13426348 11375964 9910828 8834585 7933587
18012G933587p42597n94637n07535m16891m10782l43125l47726k75319k53743
$$ 7933587 7190990 6596353 6088818 5671927 5261145 4918020 4570294 4294975 4041232
18003D041232k49262j76336j51645j75326j84723r6639j44831j22051j47031j91794
$$ 4041232 3791970 3615634 3463989 3288663 3103940 3007301 2862470 2740419 2593388 2401594
17993B401594j50585q7639q6900j19422j59577j64776q4216n2539n962m0630p5948
$$ 2401594 2251009 2163370 2076470 1957048 1797471 1632695 1548479 1495940 1489978 1449348 1373400
17982A373400q3746k1775q7778j0838K4814j6655r29K1838q3388k8691K6415q870
$$ 1373400 1289654 1267879 1180101 1169263 1194077 1177422 1176493 1198331 1114943 1086252 1112667 1103797
17970A103797l2120k4905l6549o3620o0896l9942o8771l2496K0061R9614L4327
$$ 1103797 1071677 1046772 1010223 946603 885707 845765 776994 744498 764559 864173 898500
17959H98500o7406k8418l9500N416r038J1944N1390J0209m2914p4132p371n451
$$ 898500 831094 802676 763176 768592 759554 771498 822888 833097 790183 716051 708680 703229
17947G03229L5835N397n2746n2344o3711L2329K6712K7582K1084j1028j9805m6294
$$ 703229 739064 744461 691715 639371 575660 607989 634701 662283 683367 672339 652534 606240
17935F06240K8882l632j4332m9798j2693j0646k4455k9542m1312l6836K4602N1572
$$ 606240 635122 631490 617158 567360 554667 544021 519566 490024 448712 411876 436478 488050
17923D88050l3703o3112N974Q034M2712K7985J1325j6245k1348K6484L7775q529
$$ 488050 454347 391235 397209 405243 447955 475940 487265 471020 449672 476156 513931 505402
17911E05402M3263L9092O975j0553q522J3418L9230J4214M649k4717M801J0919
$$ 505402 548665 587757 594732 584179 575657 589075 628305 642519 647168 622451 627252 638171
17899F38171K9987m0871O424o270R695J0127N9796K7621n274M1975Q76M3202O3617
$$ 638171 668158 627287 633711 627441 637136 647263 707059 734680 729406 771381 772257 815459 879076
17886H79076M5123l9811K2772N9451Q1139N2240J00493J59680P4490Q2626P1206
$$ 879076 924199 884388 907160 966611 1047750 1099990 1200483 1360163 1434653 1517279 1588485
17875A588485J01792M3026q6420j24862j53311j79275j23750j45109p1013j27288
$$ 1588485 1690277 1733303 1646883 1522021 1368710 1189435 1065685 920576 849563 722275
17865G22275q0244m5575o9159l5474k5924J0680n0285l6334j2376K5053L7117
$$ 722275 642031 596456 527297 491823 465899 476579 426294 389960 377584 402637 439754
17854D39754K5626K2816J2520j7104k608J1271L9258L5919m184l7837l3421o2261
$$ 439754 465380 488196 500716 483612 481004 492275 531533 567452 563268 525431 492010 429749
17842D29749k1552j2056L9848N308J516N7999L5328J0028K9977K8765l8690Q897
$$ 429749 408197 396141 435989 441297 442813 500812 536140 546168 576145 604910 566220 575117
17830E75117R0924J07566Q6535M5503Q2355K7654M5863J5902J9731N815l6359
$$ 575117 666041 773607 860142 905645 988000 1015654 1061517 1077419 1097150 1102965 1066606
17819A066606p4632p9894l6574j4409L4784Q027o4297l5682P5362J19216J07688
$$ 1066606 991974 912080 875506 861097 895881 903908 839611 803929 879291 998507 1106195
17808A106195K3523K8247J587P503o9662l2159n2490l1502q621L7577L5527L1040
$$ 1106195 1129718 1157965 1159552 1167055 1097393 1065234 1012744 981242 972621 1010198 1045725 1076765
17796A076765m2035k7600m1213m1015n8577j9962m6176p5932n1860l1558k9679
$$ 1076765 1034730 1007130 965917 924902 866325 846363 800187 724255 672395 640837 611158
17785F11158n0579m6924K0986l723o0172o1685r0254r9783J1477N4922M6762n3282
$$ 611158 560579 513655 534641 530918 470746 409061 318807 219024 230501 285423 332185 278903
17773B78903j0095N1705P880k4456j0594j122n1761j9222N2641n721j015k6426
$$ 278903 268808 320513 328393 303937 293343 292221 240460 221238 273879 268158 267143 240717
17761B40717L0044O6313p3675j0925M0632J2990P512n2239n0044N776Q963j0007
$$ 240717 270761 337074 263399 252474 293106 306096 313608 261369 211325 217101 226064 216057
17749B16057m7367q122q896l5373L8759M0244L3577O785l1965n9013N7485L7443
$$ 216057 168690 160568 151672 116299 155058 195302 228879 235664 203699 144686 202171 239614
17737B39614K9556j559L1082O3987l8623l7922j3755n1956m7610l7458K6227M0186
$$ 239614 269170 267611 298693 362680 324057 286135 272380 220424 172814 135356 161583 201769
17725B01769k4895K7267J5464L1237l0078l5784m797l6629K3282j3347k7546K4553
$$ 201769 176874 204141 219605 250842 220764 184980 180183 143554 166836 153489 125943 150496
17713A50496L3995K8217k0816l9257K8229K9680j1538m0830n3656m4352L8887
$$ 150496 184491 212708 191892 152635 180864 210544 199006 158176 104520 60168 99055
17702I9055P9949P490L5267K878j0424l3548n2799l1360j4802k6739J8513J3180
$$ 99055 179004 186494 221761 224639 214215 180667 127868 96508 81706 54967 73480 86660
17690H6660l4669k6015M5686j7858M655J989M5116K1036l4797k6614K0243k4169
$$ 86660 51991 25976 71662 53804 58459 60448 105564 126600 91803 65189 85432 61263
17678F1263o8395n9087r857L1451J9733m2847n1128j6221M6516M6370R0365O3033
$$ 61263 -7132 -66219 -76076 -44625 -24892 -67739 -118867 -135088 -88572 -42202 48163 111196
17666A11196J0358M3023J8295L1792o488j0647L3251K1930k7681o8749o891K4494
$$ 111196 121554 164577 182872 214664 208176 197529 230780 252710 225029 156280 149389 173883
17654A73883K9965K2746L8966k8705j2762o3318k3584j8975m0118K0424M0731
$$ 173883 203848 226594 265560 236855 224093 160775 137191 118216 78098 98522 139253
17643A39253L5344j4851N228o775j4252J4211j1451M2829j9310j3277R032k5831
$$ 139253 174597 159746 164974 158199 143947 158158 146707 189536 170226 156949 165981 140150
17631A40150L3634Q16n2948m1965l2214j8873q3254r5029J3419L4276L5838R1357
$$ 140150 173784 174600 121652 79687 47473 28600 -54654 -149683 -136264 -101988 -66150 25207
17619B5207P2709L4777Q494n778K9461L7486P824j6208K8819N9203J6044J6333
$$ 25207 97916 132693 141187 135409 164870 202356 210180 193972 222791 281994 298038 314371
17607C14371j0942l0239k3809K9783O684J3484J3836l6835o4730L4893J01519
$$ 314371 303429 273190 249381 279164 285848 299332 313168 276333 211603 246496 348015
17596C48015o94J7907J777N0017K9167k4141K5266k977m0114p6221r489N9323
$$ 348015 347321 365228 367005 417022 446189 422048 447314 444337 404223 328002 318513 377836
17584C77836L3689P102J1066k0087m4993m4107L5581K1176M1866j7996o8263o0056
$$ 377836 411525 418627 429693 409606 364613 320506 356087 377263 419129 401133 332870 272814
17572B72814n9420m1963k8358K3260j4111j5326k5380k2539M3810M3154N156l9749
$$ 272814 213394 171431 143073 166333 152222 136896 111516 88977 132787 175941 181097 141348
17560A41348j6253j6202k5633l9870k8378M4893L6542K4389j1344m3195J5056
$$ 141348 125095 108893 83260 43390 15012 59905 96447 120836 109492 66297 81353
17549H1353O3874O4276K1440o404M4816L8672O298J16551J46287K0307o817M1790
$$ 81353 145227 209503 230943 224539 269355 308027 314325 430876 577163 597470 590653 632443
17537F32443r331n586j0938j5183L854j7140k2723L6628M1196J3238o162l951
$$ 632443 623112 617526 606588 591405 595259 578119 555396 592024 633220 646458 640296 636345
17525F36345k1873j7435l1079k8774p1600p1895p2459j04357j9677J5491m3653
$$ 636345 614472 597037 565958 537184 465584 393689 321230 216873 197196 212687 169034
17514A69034m3924L9455j3639k7219N3733J6812n4989p1960k9780j3514N54M8379
$$ 169034 125110 164565 150926 123707 177440 194252 139263 67303 37523 24009 24563 72942
17502G2942J1920K3422M8095M400L8215o479o960P750J0130j319j8654M203K479
$$ 72942 84862 108284 156379 160779 198994 192515 185555 193305 203435 202116 183462 187665 190144
17489A90144N4340O889p2602J3963M6167k7485o7566M1278L7176N6737O6321J5419
$$ 190144 244484 251373 178771 192734 238901 211416 143850 185128 222304 279041 345362 360781
17477C60781p715k6013o5500j09152k8914n2820m4854K687j7385j126K8639L8553
$$ 360781 353066 327053 261553 152401 123487 70667 25813 28500 11115 9989 38628 77181
17465G7181K5289L3162m144L0398l9736l1933N2903L6535J6198k6461j883p0424
$$ 77181 102470 135632 131488 161886 122150 90217 143120 179655 195853 169392 167509 97085
17453I7085R634J2227j2011P614k5086j3942N1933P964J838J6181o158j0090K1237
$$ 97085 106719 118946 106935 114549 89463 75521 127454 135418 137256 153437 147279 137189 158426
17440A58426J5609K246K944m4887n1820r809M6163Q81P4549K9706L0760j2427
$$ 158426 174035 176281 179225 134338 82518 72709 118872 119753 194302 224008 254768 242341
17428B42341l3891j1427J04928P0728l6504K2926k4733R835L718r317R121j7657
$$ 242341 208450 197023 301951 372679 336175 359101 334368 344203 347921 338604 347725 330068
17416C30068m0143Q161M7915L8008J6131J4262p773k7925M396O054k4950M1172
$$ 330068 289925 298086 346001 384009 400140 414402 406629 378704 383100 389154 364204 405376
17404D05376M0361L0306P6417J03425Q5255J56399K10207J88773K26599K65617
$$ 405376 445737 476043 552460 655885 741140 897539 1107746 1296519 1523118 1788735
17394A788735L57740M58659N21912N94920N53086N18428M42429K72127K62491
$$ 1788735 2146475 2605134 3127046 3721966 4275052 4793480 5235909 5508036 5770527
17385E770527K33182J52001J88915L51131N78086Q59125J238829J832103K756444
$$ 5770527 6003709 6155710 6344625 6695756 7273842 8132967 9371796 11203899 13960343
17376A3960343M062740O095002Q869363J2712588J7641763K3067449K8130547
$$ 13960343 18023083 24118085 32987448 45700036 63341799 86409248 114539795
17369A14539795L1245482L0207596K3600815J2375094j352838j4543734k4672051
$$ 114539795 145785277 175992873 199593688 211968782 210615944 196072210 171400159
17362A71400159l0322278l0406785k6312729k0999915j5733047j1153890p754194
$$ 171400159 141077881 110671096 84358367 63358452 47625405 36471515 28717321
17355B8717321n353805l797332k801749k175356j685674j373494j156914r29614
$$ 28717321 23363516 19566184 16764435 14589079 12903405 11529911 10372997 9443383
17347I443383p59605n52740m35560k90701j36945p5188k3530L3374K05833J89921
$$ 9443383 8683778 8131038 7695478 7404777 7267832 7192644 7169114 7202488 7408321 7598242
17337G598242P0887K0362j0080l8245l5223J0367P8067K95127N12071P54671J157610
$$ 7598242 7669129 7689491 7679411 7641166 7605943 7616310 7694377 7989504 8501575 9256246 10413856
17326A0413856J699422K556638L848866N728299Q452723J2152272J6657063K1496457
$$ 10413856 12113278 14669916 18518782 24247081 32699804 44852076 61509139 83005596
17318H3005596K5724866K7706211K5226790J7963504P129336n105688j6075184
$$ 83005596 108730462 136436673 161663463 179626967 186756303 181650615 165575431
17311A65575431k4010854k7354160k5882775k1731030j6983083j2344809q638421
$$ 165575431 141564577 114210417 88327642 66596612 49613529 37268720 28630299
17304B8630299o006421m104118k843063k125215j528957j250887r60851p16589
$$ 28630299 22623878 18519760 15676697 13551482 12022525 10771638 9810787 9094198
17296I094198n06814l88229m20313m45003m44629n08717o64390o69552n57476
$$ 9094198 8587384 8199155 7778842 7333839 6889210 6380493 5716103 5046551 4489075
17287D489075n34684m82943l75377l13210k63813k19762j62193r4797p5910j34839
$$ 4489075 3954391 3471448 3096071 2782861 2519048 2299286 2137093 2042296 1966386 1831547
17277A831547o0750l6903m2285o9546j06409o7654p1152j10587n5943j4236n3864
$$ 1831547 1770797 1733894 1691609 1622063 1515654 1448000 1376848 1266261 1210318 1196082 1142218
17266A142218n923J3032J2324j460n5581k5822j3126k0016j0000p982l3410o0772
$$ 1142218 1136295 1149327 1161651 1160191 1104610 1078788 1065662 1045646 1035646 1027664 994254 933482
17254I33482m5157l9705k7273J551j1067j8786L3488J42152R4885J55892K14556
$$ 933482 888325 848620 821347 822898 811831 793045 826533 968685 1063570 1219462 1434018
17243A434018K53008K56175J21844J52911L7039j54058k24849l01143k90973k08194
$$ 1434018 1687026 1943201 2065045 2217956 2254995 2100937 1876088 1574945 1283972 1075778
17233A075778j66343n8907n7897m0786m3609o7192N522L955n7486j6076J2283
$$ 1075778 909435 850528 792631 751845 708236 641044 646566 650521 593035 576959 589242
17222E89242K7948L7471K9404j3770o140J1771L9961P0186L2210m2613k1503K7040
$$ 589242 617190 654661 684065 670295 664155 675926 715887 786073 818283 775670 754167 781207
17210G81207r4424q1596n0859j7084L2035l3593m4867m2937m482j7712K8670k0830
$$ 781207 686783 605187 554328 537244 569279 535686 490819 447882 443400 425688 454358 433528
17198D33528p5018l7332K9350M6266M9279n6449R53M7918j5938k72J5495k062
$$ 433528 358510 321178 350528 396794 446073 389624 390577 438495 422557 422285 437780 435718
17186D35718J2242P144j0690k2324l7722J626J1400r930L5783O7754K4217j2583
$$ 435718 447960 455104 444414 422090 384368 385994 397394 387464 423247 491001 515218 502635
17174E02635m8253j2449K9503J0621l3406o518K7548M6052M7497J9696J6065K0941
$$ 502635 454382 441933 471436 482057 448651 442133 469681 515733 563230 582926 598991 619932
17162F19932K5903j8483p7003n5883k9312O317J1312R905K592j3379o9021r9808
$$ 619932 645835 627352 550349 494466 465154 471471 482783 492688 495280 481901 412880 313072
17150C13072k4942L972j5983j2925J7944J260K9485j1826L4892J8884o1050m8815
$$ 313072 288130 292102 276119 263194 281138 282398 311883 300057 334949 353833 292783 243968
17138B43968j7065K6074M0586j6383l0662l8332k6494k2991K3096M8674k690l1695
$$ 243968 226903 252977 293563 277180 246518 208186 181692 158701 181797 230471 227781 196086
17126A96086q242O0048K4354P595l1590O279J9626n211J779J3510M2861l7708
$$ 196086 187844 247892 272246 279841 248251 254530 274156 268945 270724 284234 327095 289387
17114B89387n6710o0999q186K1835M6505j9493k1041M195l5383K3208L565K1941
$$ 289387 232677 171678 163492 185327 231832 212339 191298 195493 160110 183318 186883 208824
17102B08824L7823p6870j5534j0629M1856L0363O1341K369j9212k8245L6941j6299
$$ 208824 246647 169777 154243 143614 185470 215833 277174 279543 260331 232086 269027 252728
17090B52728l4273j2543Q575m2193k9690L5691O8087J8218J5523k6008o0280j3962
$$ 252728 218455 205912 214487 172294 142604 178295 246382 264600 280123 254115 193835 179873
17078A79873k3984K6085j1334j9708J0307L6880O0664o715J6763P982L1560j8425
$$ 179873 155889 181974 170640 150932 161239 198119 258783 252068 268831 276813 308373 289948
17066B89948m1111K9237R307L1526O9631N0150k6671j2412J5458k2287q2726o4566
$$ 289948 248837 278074 287381 318907 388538 438688 412017 399605 415063 392776 310050 245484
17054B45484l4642j2336j9214K1453N7543m709n5836k0475k1285k0665j3261K5242
$$ 245484 210842 198506 179292 200745 258288 253579 197743 177268 155983 135318 122057 147299
17042A47299L5590k2781j2723N5180q347q6963j3445K0791L5760L0398O252l329
$$ 147299 182889 160108 147385 202565 194218 107255 93810 114601 150361 180759 187011 183682
17030A83682K1340J7955k1089p4827l0575j2418q184K5976J5642J3110J4724J7915
$$ 183682 205022 222977 201888 127061 96486 84068 75884 101860 117502 130612 145336 163251
17018A63251k9737j3857L5656L1685J7955L4636M4952J695M8436L2143J733J1406
$$ 163251 133514 119657 155313 186998 204953 239589 284541 286236 334672 366815 368548 379954
17006C79954l3650j1257m8849p7633m5512j5541l044m5258K6288N221J3129o716
$$ 379954 346304 335047 286198 208565 163053 147512 144468 99210 125498 130719 143848 137132
16994A37132k5721l2885K3422l169J1817o2178j13019M7585P7734L3513O9224
$$ 137132 111411 78526 101948 98779 110596 48418 -64601 -17016 60718 94231 163455
16983A63455q001l6779l7678K7939k1519N419M1151j7298l2488J2022M1022K7615
$$ 163455 155454 118675 80997 108936 87417 92836 133987 116689 84201 96223 137245 164860
16971A64860j618n9042m2748m9476P337N8188o108K6849J4252l5J577l4325l689
$$ 164860 163242 104200 61452 11976 19313 77501 71393 98242 112494 112459 114036 79711 76022
16958G6022P87q65L9908J5288n2763q3860n590N3296L6644L859j1280L7144K4715
$$ 76022 76809 75944 115852 131140 78377 -5483 -11073 42223 78867 82726 71446 108590 133305
16945A33305K6551l046k5133J6404l181j0670m3869L6645k4673n2254l1444L4643
$$ 133305 159856 156810 131677 148081 144900 134230 90361 127006 102333 50079 18635 53278
16933E3278n702j2142j7380K5967j731R6119J07000P411k4725l756j4648m0141
$$ 53278 47576 35434 18054 44021 42290 138409 245409 252820 228095 224339 209691 169550
16921A69550n2978m565K558p3057m7893l011K4358N4235L2963k9179k8408o79
$$ 169550 116572 112007 114565 41508 -6385 -9396 14962 69197 102160 72981 44573 43894
16909D3894J0773M4590P2493K2478M410M3174J851k291j3828k5473l2359j2461
$$ 43894 54667 99257 171750 194228 198638 241812 243663 241372 227544 202071 169712 157251
16897A57251j5731J3273L761P674k6112K442K2099Q71p3075l1386J914M7578k4768
$$ 157251 141520 154793 158554 166228 140116 142558 164657 165528 92453 61067 62981 110559 85791
16884H5791o846K5252R766M808k1400n4608l1924n3540N2756N0633J6076n602
$$ 85791 78945 104197 113963 118771 97371 42763 10839 -42701 10055 60688 76764 71162
16872G1162N143Q1989l884m8780j2392k1599k4613N0160K295l5912j6875j6469
$$ 71162 76305 158294 154410 105630 93238 71639 47026 97186 99481 63569 46694 30225
16860C0225J3670Q1086R3455L4196R2476J11008J65037J09510N5028J47693Q4963
$$ 30225 43895 124981 218436 252632 345108 456116 621153 730663 785691 933384 1018347
16849A018347J8137k41q1760j29377r9174j12311j34658q1603n7156j02569l981
$$ 1018347 1036484 1036243 954483 825106 725932 613621 478963 397360 340204 237635 233654
16838B33654M119m9130m3732n852p694j4692m5166L7702J7294J3182q001L2960
$$ 233654 237773 188643 144911 139059 131365 116673 71507 109209 126503 139685 131684 164644
16826A64644J6377m219m6650m6297m0074j6379K2513Q858J0200J2463k3451n1991
$$ 164644 181021 176802 130152 83855 43781 27402 49915 58773 68973 81436 57985 5994
16814E994J23496P8595r9104n4233L9107L9533N5963M1699j7443O3038O5072O3077
$$ 5994 129490 208085 108981 54748 93855 133388 189351 231050 213607 276645 341717 404794
16802D04794N3663R1534J71157Q7304P6907J05721k9237j03784p2901j35544j75385
$$ 404794 458457 549991 721148 808452 885359 991080 961843 858059 785158 649614 474229
16791D74229p2596q9210o9814m5921r235J1243j6911j112l2211n9737k7875K696
$$ 474229 401633 312423 242609 196688 187453 198696 181785 180673 148462 88725 60850 63546
16779F3546j8946k1263j0214J6657K5084j3566p93l0730J1402j6747r601j5954
$$ 63546 44600 23337 13123 29780 54864 41298 40505 9775 21177 4430 -5171 -21125
16767b1125L2440o439J3659P1848j40j3124O2546O3024k0886n0515l1624o889
$$ -21125 11315 4876 18535 90383 90243 77119 139665 202689 181803 131288 99664 92775
16755I2775p102J5813l4451l942q603L1972P6750K1771j04357n0023O0092r989
$$ 92775 85673 101486 67035 63093 54490 86462 163212 184983 80626 30603 90695 80706
16743H0706k8533k0729k5514J6399R39l11P899M8704j1646j9996j4911J921M9955
$$ 80706 52173 31444 5930 22329 23268 22957 30856 79560 67914 47918 33007 34928 84883
16730H4883M7995N6799n7470m2857m682m5184M0783K4005j9029l3311R683L1232
$$ 84883 132878 189677 132207 89350 84668 39484 80267 104272 85243 51932 61615 92847
16718I2847L2576j9263q154k3897j369J312J0696l886j0258n6902l5805Q093K4390
$$ 92847 125423 106160 98006 74109 72740 74052 84748 80862 70604 13702 -22103 -14010 10380
16705A0380M7822l2217J566J6394q0421q682L8278L2771j3556k172L550m7088
$$ 10380 58202 25985 27551 43945 -36476 -45158 -6880 25891 12335 10163 13713 -33375
16693c3375K0472N8404K3148k0767m4932L9236K0378l8871m3216J9542k80p470
$$ -33375 -12903 45501 68649 47882 2950 42186 62564 23693 -19523 19 -261 -7731
16681g731M4118M3448m7424N477M6623K5873m4016K0799l1543k555j47j6599q4761
$$ -7731 36387 79835 32411 37888 84511 110384 66368 87167 55624 53069 52922 36323 -48438
16668d8438l2536L5827Q4085M793m3714m9158J7351J6973K6025m070k169k392
$$ -48438 -80974 -45147 38938 43731 17 -49141 -31790 -14817 11208 7138 4969 2577
16656B577L6720M1381l132m0558J8807M490m033m0586L4277j6722j8143m9592
$$ 2577 39297 80678 77546 36988 55795 60285 56252 15666 49943 33221 15078 -34514
16644c4514L269m245m6793k5389K7978J23019N3308N94j8046k1015K3249L1695
$$ -34514 -31245 -35490 -82283 -107672 -79694 43325 96633 97227 79181 58166 81415 113110
16632A13110N1230o8122n8704J7963L2183l5683j8408n497J8691Q3699j6007q6033
$$ 113110 164340 96218 37514 55477 87660 51977 33569 28072 46763 130462 114455 28422
16620B8422L3906J8190n7222q9888l8592N7827l3599j3999p668N4038M0669M3364
$$ 28422 62328 80518 23296 -66592 -105184 -47357 -80956 -94955 -102623 -48585 -7916 35448
16608C5448O071j4452O11J0942j1310O5346K3810j9829k4356l627j4660m3563
$$ 35448 41519 27067 27678 38620 27310 92656 116466 96637 72281 68654 53994 10431
16596A0431m913L6137k0452K6664K0473K4865L1496M055n3760k4435k5405l9879
$$ 10431 5518 41655 21203 47867 68340 93205 124701 128756 74996 50561 25156 -14723
16584a4723J4281O1906m6946m4595O6580J4335n5330k671K7105L9063j2337l8514
$$ -14723 -442 61464 14518 -30077 36503 50838 -4492 -7163 19942 59005 46668 8154
16572H154L7905K0147j2338m2534L5672M6893n1320k8272j537j5839N4037J5270
$$ 8154 46059 66206 53868 11334 47006 93899 42579 14307 12770 -3069 50968 66238
16560F6238n3821o5032Q887M3361O0918Q616p4874k5914L3206M5734Q357K1241
$$ 66238 12417 -52615 -43728 -367 60551 69167 -5707 -31621 1585 47319 55676 76917
16548G6917O97j3427j4676j7634j3108m2787L9460M1103k4655n5770n4268m0666
$$ 76917 77614 64187 49511 31877 18769 -24018 15442 56545 31890 -23880 -78148 -118814
16536a18814P367N7548J6249M2695l608l1036l7011N162J8290K4241R229q157
$$ -118814 -111447 -53899 -37650 5045 1437 -29599 -66610 -61448 -43158 -18917 -9688 -17845
16524a7845J4947K5395L8883j4037k8543p461M5152j1966j7650J7446k5602k4884
$$ -17845 -2898 22497 61380 47343 18800 11339 56491 44525 26875 44321 18719 -6165
16512f165P448O391l0252j4104l3378N845P5751K1326K0967j8047M722l743l9104
$$ -6165 1283 7674 -22578 -36682 -70060 -64215 11536 32862 53829 35782 40504 36761 -2343
16499b343n325J8913m4569L1911J3197l7908l2214k9455N3371O2228J4511k3143
$$ -2343 -7668 11245 -33324 -1413 11784 -26124 -58338 -87793 -34422 27806 42317 19174
16487A9174J5799q952l1755j6967K8779J233j485k3723M9l647K071P888P329N1555
$$ 19174 34973 26021 -5734 -22701 6078 7311 5826 -17897 -17848 -21495 -19424 -11536 -4207 47348
16473D7348p51l2224j02896m8569N6416Q0166L615J5042J0882k8420k2537J0597
$$ 47348 46597 14373 -88523 -137092 -80676 -510 3105 18147 29029 609 -21928 -11331
16461a1331N9388L0950n8144o7731K4081L0933L0395J759J2773R482k7826j9664
$$ -11331 48057 79007 20863 -46868 -22787 8146 38541 40300 53073 62555 34729 15065
16449A5065m5733o2124K5070M1961L4494R010J1984K3983q922o5573M9753M2502
$$ 15065 -30668 -92792 -67722 -25761 8733 17743 29727 53710 44788 -20785 28968 71470
16437G1470r005K981o653K5961K5191K4672j5923k9501j8684J1079k1068l7289
$$ 71470 62465 65446 58793 84754 109945 134617 118694 89193 70509 81588 60520 23231
16425B3231L442K2382O3864N100k7441k5958J6421j4923J9872j4926l9728q1644
$$ 23231 26673 49055 112919 118019 90578 64620 81041 66118 85990 71064 31336 -50308
16413e0308l911L7678P4706O003l2911n469k1625K484N6959k9133J7557j318j5711
$$ -50308 -54219 -16541 58165 64168 31257 25788 4163 6647 63606 34473 52030 50712 35001
16400C5001k9462M0492j979K2279m184l5167O699l0907j4456j9983J3466K9505
$$ 35001 5539 46031 44052 66331 62147 26980 33679 2772 -11684 -31667 -18201 11304
16388A1304K6240j6912r49k5693k5407q543m251J329Q2795O1043l5424p925j1759
$$ 11304 37544 20632 19683 -6010 -31417 -39960 -44211 -42882 39913 100956 65532 57607 45848
16375D5848L0243j5203O348r717l0911N936j7653K4455j011n8639l1422J6641
$$ 45848 76091 60888 67236 57519 26608 32544 14891 39346 38335 -20304 -51726 -35085
16363c5085J9690J1095n2076l740k3058L4127p044P321L0779k8571n6301k6887
$$ -35085 -15395 -4300 -56376 -60116 -83174 -49047 -56091 -48770 -17991 -46562 -102863 -129750
16351a29750K1418q313l12N2570N0409J4902k38K0420L6538l3890m5233l1444
$$ -129750 -108332 -116645 -116957 -64387 -13978 924 686 21106 57644 23754 -21479 -52923
16339e2923O7615M6866k5816M998N3563Q167m8944o1880l7544M5722K7289l236
$$ -52923 14692 61558 35742 40740 94303 102470 53526 -8354 -45898 -176 27113 23877
16327B3877J6335K5334K2151J5040M130l3453n7876K6088r658L2844J7536m9090
$$ 23877 40212 65546 87697 102737 106867 73414 15538 41626 31968 64812 82348 33258
16315C3258o2697j210M5456M4822K0470n9823m4765K7281K0091k758j4777J0131
$$ 33258 -29439 -30649 14807 59629 80099 20276 -24489 2792 22883 20125 5348 15479
16303A5479M0844K4436m6963l3003k9947j9764Q068O9904K9783P8029q300l3810
$$ 15479 56323 80759 33796 793 -29154 -48918 -40850 29054 58837 136866 128566 94756
16291I4756m3668k449q9151o0963m594J3676M3881J3673J7031o295O5424j4486
$$ 94756 51088 48639 -40512 -101475 -106069 -92393 -48512 -34839 -17808 -24103 41321 26835
16279B6835n6387l0468m393N945p356K3336o365J6465Q574k8943P638N4577M6166
$$ 26835 -29552 -60020 -64413 -58468 -65824 -42488 -48853 -32388 -23814 -52757 -45119 9458 55624
16266E5624L669M2613j4950l3434r863m0483n6214k055M3607J0931j6449J2234
$$ 55624 59293 101906 86956 53522 43659 3176 -53038 -55093 -11486 -555 -17004 -4770
16254d770q328j7326L9281P373n410P1270n570m1643K2023L2330m2537j3611l024
$$ -4770 -13098 -30424 8857 16230 10820 82090 76520 34877 56900 89230 46693 33082 30058
16241C0058j3449j2122n416l9058m1819M4184j7864J2942K2124J139L7822O7924
$$ 30058 16609 4487 -929 -39987 -81806 -37622 -55486 -42544 -20420 -19281 18541 86465
16229H6465j2675n2091j9964l05J4261J0104j3472k321l6039m2412K4952N763
$$ 86465 73790 21699 1735 1430 15691 25795 12323 10002 -26037 -68449 -43497 -37734
16217c7734l5748J419M944j7670N8399P6911K6414j7490k2598l1500k6670M3225
$$ -37734 -73482 -72063 -67119 -84789 -26390 50521 76935 59445 36847 5347 -21323 21902
16205B1902j7783j6478j9664k7283J5730j9392k6440j388O6023N6281m3176k8138
$$ 21902 4119 -12359 -32023 -59306 -43576 -62968 -89408 -90796 -24773 31508 -11668 -39806
16193c9806M21p690o889J085n3659j2018L6236K2469m2312l5615K9749K9043M6120
$$ -39806 -39385 -47075 -53964 -52879 -106538 -118556 -82320 -59851 -102163 -137778 -108029 -78986 -32866
16180c2866L1270L2843L0794p1728l134k5431L850L3217M1440K3146k2423k4803
$$ -32866 -1596 31247 62041 -9687 -12821 -38252 -34402 -1185 40255 63401 40978 16175
16168A6175l4027k457J3747L0852J1047K3914K3389j5997o5155k6203m8488L586
$$ 16175 -17852 -20309 -6562 24290 35337 59251 82640 66643 1488 -24715 -73203 -69617
16156f9617J2478j0817O3435M4840j807L4536j9508j3844j8172l445j8354k2915
$$ -69617 -57139 -67956 -4521 40319 38512 73048 53540 39696 21524 18079 -275 -23190
16144b3190m7922J8226L4788L8737j0746Q981K9904o717j5061P796K7970P36P234
$$ -23190 -71112 -52886 -18098 20639 9893 18874 48778 42061 27000 34796 62766 63502 70736
16131G0736K4382j4723m2012n3021K1878L9748j339k5378l0772r547Q706N0845
$$ 70736 95118 80395 38383 -14638 7240 46988 45649 20271 -10501 -20048 -11342 39503
16119C9503O4397k8113r9794l5043J3013J4167K5165K7207J5292r047j4878n1781
$$ 39503 103900 75787 -24007 -59050 -46037 -31870 -6705 20502 35794 26747 11869 -39912
16107c9912K5283K5153L5571n7422m2678n454P1172j8725k3845K5028J750j0079
$$ -39912 -14629 10524 46095 -11327 -54005 -59459 11713 -7012 -30857 -5829 -4079 -14158
16095a4158n5726O464j031J9517j719J8985L7120Q928j0556m611M5598L2503o9387
$$ -14158 -69884 -63420 -64451 -44934 -46653 -27668 9452 18380 7824 3213 48811 81314 11927
16082A1927l2041j758M8537o973m1014j584k8975l9681q449K5878L7672M1408
$$ 11927 -20114 -21872 26665 19692 -21322 -22906 -51881 -91562 -100011 -74133 -36461 4947
16070D947M955p756j7417M9007L1018Q191o7589J4238M1795j6124k9003J744K5749
$$ 4947 9902 2146 -15271 33736 64754 72945 5356 19594 61389 45265 16262 18006 43755
16057D3755p2404j6559J687P326n297k2245L2352r500L1200L8030J1164J2812
$$ 43755 -28649 -45208 -43521 -36195 -41492 -63737 -31385 -40885 -9685 28345 39509 52321
16045E2321k1511K1920O493j1558j0438J3783j1276k0059r266l8116j0567l6085
$$ 52321 30810 52730 59223 47665 37227 51010 39734 19675 10409 -27707 -38274 -74359
16033g4359j0282M0769O0941O0990O237Q640n7831m337j2954J4017L324k3123
$$ -74359 -84641 -43872 17069 78059 84296 92936 35105 30768 17814 31831 35155 12032
16021A2032k4038L7318j2599l3666k9565j6720j6552J2888J0881j265L5040K623
$$ 12032 -12006 25312 12713 -20953 -50518 -67238 -83790 -70902 -60021 -61286 -26246 -23623
16009b3623l6974L8341p920j5657M956m6396J2680K3589Q557j9654M1124M0670
$$ -23623 -60597 -22256 -30176 -45833 -40877 -87273 -74593 -51004 -42447 -62101 -20977 19693
15997A9693k206L3461K0905l3613l0156k1167J1432P969K518O757l663r958J2826
$$ 19693 17487 50948 71853 38240 8084 -13083 -1651 6318 8836 15593 11930 1972 14798
15984A4798J9974k6146m4772l8578P704J028m833L2617M8827O8473k1150k4805
$$ 14798 34772 8626 -36146 -74724 -67020 -65992 -70825 -38208 10619 79092 57942 33137
15972C3137J1924J4406k4945j8070J7685K4626k6538k0073O039J7106K50O639
$$ 33137 45061 59467 34522 16452 34137 58763 32225 12152 18191 35297 35547 42186
15960D2186j0891n1901p85K9436L9657n1523l8585L6697J0255n5405P224J6924
$$ 42186 31295 -20606 -21391 8045 47702 -3821 -42406 -5709 4546 -50859 -43635 -26711
15948b6711k3949l099k8123j857n356n8823K6171P1304M6985M1404j8108J4353
$$ -26711 -50660 -53759 -81882 -83739 -89095 -147918 -121747 -50443 -3458 37946 19838 34191
15936C4191J0952q5902J9002J4976J1922k3952K9481R040k2059Q964K3348R635
$$ 34191 45143 -40759 -21757 -6781 5141 -18811 10670 19710 -2349 6615 29963 39598
15924C9598J2277j0610j1858k3175K8186J296j2638l8190k0749l8610K3346J9880
$$ 39598 51875 41265 29407 6232 34418 35714 23076 -15114 -35863 -74473 -51127 -31247
15912c1247K4281J3665J8999k6342O730R748j4915m990P878K2604m97m1953j4158
$$ -31247 -6966 6699 25698 -644 6086 15834 919 -4071 3807 26411 25914 -16039 -30197
15899c0197m725p273j9515K9553j703J951N1935K7534k068r375n0883j3323K7776
$$ -30197 -34922 -42195 -61710 -32157 -33860 -31909 20026 47560 45492 36117 -14766 -28089 -313
15886c13k7351L9484l401j6581J5263J5563L282k5170l791l2791P010k1304K0995
$$ -313 -27664 11820 8419 -8162 7101 22664 25946 776 -3015 -35806 -28796 -50100 -29105
15873b9105O186n7655J0415O6458j8276j963k9358L048K306K4298j4960j1434
$$ -29105 -22919 -80574 -70159 -3701 -21977 -23940 -53298 -50250 -47944 -23646 -38606 -50040
15861e0040P33j5118N1567L9506l5216l3968o681j9495k4863L5962K0258m877
$$ -50040 -49307 -64425 -12858 26648 -8568 -42536 -49217 -68712 -93575 -57613 -37355 -42232
15849d2232M28k1141k2790k3627m8329J9012O0970M6013K1750K6508l0830K5809
$$ -42232 -41804 -62945 -85735 -109362 -157691 -138679 -77709 -31696 -9946 16562 -14268 11541
15837A1541l7360P60o298K7199K3283J7295N472j4846r204j5435l7805o6407n83
$$ 11541 -25819 -25059 -31357 -4158 19125 36420 41892 27046 17842 2407 -35398 -101805 -102388
15824a02388K3056J5248r657J6005K671n284n3882M0475J01484J3376k1799o6523
$$ -102388 -79332 -64084 -73741 -57736 -55065 -60349 -114231 -73756 27728 41104 19305 -47218
15812d7218m2171M254J8310M9822J3131m928l8442k7482j0053j096L4508L9306
$$ -47218 -89389 -85135 -66825 -17003 -3872 -8800 -47242 -74724 -84777 -85873 -51365 -12059
15800a2059J2133M1701J0000m7579m996J1251R926n1260l5312n8171Q444M9291
$$ -12059 74 41775 51775 4196 -800 10451 20377 -30883 -66195 -124366 -115922 -66631
15788f6631j0713K367N455j5173M3540M2386K3300Q800l7148n3590k768J4204
$$ -66631 -77344 -74977 -69522 -84695 -41155 1231 24531 33331 -3817 -57407 -60175 -45971
15776d5971J751n724l8834K3134J7870r897m1622l1848J8098J9208J7990O4384
$$ -45971 -44220 -49944 -88778 -65644 -47774 -57671 -99293 -131141 -113043 -93835 -75845 -11461
15764a1461j9931o0369L669M8880R927j5895k6190K8046N5171J5850l0998k9085
$$ -11461 -31392 -91761 -88092 -39212 -29285 -45180 -71370 -43324 11847 27697 -3301 -32386
15752c2386n904L9251P731m9157K0397m561n8066L1254M2285J510j3910J1274
$$ -32386 -38290 961 8692 -40465 -20068 -24629 -82695 -51441 -9156 -7646 -21556 -10282
15740a0282K4904r443J5208n7091j7065K0238q516l916l5744L6085P5286m395
$$ -10282 14622 5179 20387 -36704 -53769 -33531 -42047 -45963 -81707 -45622 29664 25269
15728B5269k3644M7290L4269k5252p2876j9565p034L827N0805P248l8522m4601
$$ 25269 1625 48915 83184 57932 -14944 -34509 -41543 -37716 13089 20337 -18185 -62786
15716f2786M5775M5159K128j2547M4822J3624n9086l285m4908k6669j4408m5943
$$ -62786 -17011 28148 30276 17729 62551 76175 17089 13804 -31104 -57773 -72181 -118124
15704a18124M6622L855m2318n6688L1647K0824M8929L3351R509Q037M2312K1609
$$ -118124 -71502 -67647 -109965 -166653 -135006 -114182 -65253 -31902 -22393 -14356 27956 49565
15692D9565n3534o1449k4771N7899M0178j1417j494l0400n3889K6410N9619n719
$$ 49565 -3969 -65418 -90189 -32290 7888 -3529 -5023 -35423 -89312 -62902 -3283 -9002
15680i002k77m1591n943Q3382M2980L076M948k148j3741n2715q749L3134l770
$$ -9002 -9279 -50870 -56813 26569 69549 72625 77573 75425 61684 8969 220 33354 29584
15667B9584l09j2513M204K0114r44J4015O318j5357J5373K7410k6670k2736o1386
$$ 29584 29275 16762 20966 41080 40136 54151 60469 45112 60485 87895 61225 38489 -22897
15654b2897l7099j6011p768j9910J8924L2160r980m9228Q318J7852K5365m5481
$$ -22897 -59996 -76007 -83775 -103685 -84761 -52601 -62581 -111809 -103491 -85639 -60274 -105755
15642a05755K0584M8737K0337j7149J3782J4383l646J1690l2344j2664q788L5259
$$ -105755 -85171 -36434 -16097 -33246 -19464 -5081 -8727 2963 -29381 -42045 -50833 -15574
15630a5574K3017m6211m5099K0614L8032Q69K4098L6001R552k9801K4439k6781
$$ -15574 7443 -38768 -83867 -63253 -25221 -24352 -254 35747 45299 15498 39937 13156
15618A3156o1184N2672K1561j8196l5583l1401M9184N4389j54p0887k0296k0760
$$ 13156 -48028 4644 26205 8009 -27574 -58975 -9791 44598 44444 -26443 -46739 -67499
15606f7499M540r058q901J26K0187K343l794K4462J3060J5675o1772l7240O8538
$$ -67499 -62959 -72017 -80918 -80792 -60605 -58262 -62056 -37594 -24534 -8859 -70631 -107871 -39333
15593c9333L1728n1860k7986M5928O1366J3253n1124m0034J3647K640k1760m3773
$$ -39333 -7605 -59465 -87451 -41523 19843 33096 -18028 -58062 -44415 -41775 -63535 -107308
15581a07308n362L8579P8467L4149Q88j775J1233L1737j6912m2667k2286j861
$$ -107308 -112670 -74091 4376 38525 39413 37638 48871 80608 63696 21029 -1257 -3118
15569c118J702M8952k2108o6353O014l2498o1009O395N9197k2052M6595L5982
$$ -3118 -1416 47536 25428 -40925 -34911 -67409 -128418 -122023 -62826 -84878 -38283 -2301
15557b301L7668l259l9923j8970J5762r913m0287q736j852j6346K1648M7141K5567
$$ -2301 35367 32108 -7815 -26785 -11023 -20936 -61223 -69959 -71811 -88157 -66509 -19368 6199
15544F199r245R342M2202l5960l579Q1995l181k8525l252L1105l4406p3246o8544
$$ 6199 -3046 6296 48498 12538 8959 90954 87773 59248 55996 87101 52695 -20551 -89095
15531h9095p8565j7865K3405N6230K6172q413K129K5643Q063R543q212K1314L1857
$$ -89095 -167660 -185525 -162120 -105890 -79718 -88131 -86002 -60359 -52296 -42753 -50965 -29651 2206
15518B206L8303Q648m9622n3844m2307p845j8914L9355M4765M4981M4086L2574
$$ 2206 40509 49157 -465 -54309 -96616 -104461 -123375 -84020 -39255 5726 49812 82386
15506H2386j0502k7253l2051m1044k9252N3839N419j8375M394o1682N455J196
$$ 82386 71884 44631 12580 -28464 -57716 -3877 1542 -16833 -12439 -74121 -68666 -67470
15494f7470q073j4297J7300J3214j90K7677m2291j0150J6132L536J4874M5727
$$ -67470 -75543 -89840 -72540 -59326 -59516 -31839 -74130 -84280 -68148 -64612 -49738 -4011
15482d011P424m9891p0054M6347Q0651p365J2141M3j5526K1458k1636l2213r477
$$ -4011 3413 -46478 -116532 -70185 10466 3101 15242 15285 -241 21217 -419 -32632 -42109
15469d2109M7020j1785n3360j3338N2584N010l6310L639P64J1114p31O3207K0680
$$ -42109 4911 -6874 -60234 -73572 -20988 -15978 -52288 -48649 -47885 -36771 -37502 25705 46385
15456D6385l1585n9261q313M05m939M0252M6556K3836j10m5559o9284J7250M964
$$ 46385 14800 -44461 -52774 -52369 -57308 -17056 29500 53336 53226 7667 -61617 -44367 -39403
15443c9403k3014N8247J8978l9071J818o836J7208p2877j7951P1683K5882k0138
$$ -39403 -62417 -4170 14808 -24263 -22445 -29281 -12073 -84950 -102901 -31218 -5336 -25474
15431b5474K420j2336m1793q009K067L0819K0740L044m6541l0608k1041L1644
$$ -25474 -23054 -35390 -77183 -85192 -83125 -52306 -31566 -28522 -75063 -105671 -126712 -95068
15419i5068l025j3791J5320K9360J5772j18O3975J7995n6443k8602q947p608l2412
$$ -95068 -98093 -111884 -96564 -67204 -51432 -51550 12425 30420 -26023 -54625 -63572 -71180 -103592
15406a03592j1265L2497M9382K7595j4681k128J6951M714j678m954k0561J298
$$ -103592 -114857 -82360 -32978 -5383 -20064 -22192 -5241 -527 -2205 -7159 -27720 -26422
15394b6422j6763n6205K0189J5006Q2544J2003k4630n3587j76P5537p49l8181
$$ -26422 -43185 -99390 -79201 -64195 18349 30352 5722 -47865 -48041 27496 26747 -11434
15382a1434k1448L1514M3429m2602j5013O0873n5609o3243J0161L0020M6363P443
$$ -11434 -32882 -1368 42061 -541 -15554 45319 -10290 -73533 -63372 -33352 13011 20454
15370B0454m3041J10N3544J0144M0451o481n4500p4973j0265N4989L6107k0305
$$ 20454 -22587 -22477 31067 41211 81662 75181 20681 -54292 -64557 -9568 26539 6234
15358F234m5230L7917r74k0929j0012J9806j674K6851n27O698m0332j5786q00
$$ 6234 -38996 -1079 -2053 -22982 -32994 -13188 -14862 11989 11462 18160 -22172 -37958 -38758
15345c8758J8367N7605J0645M0852K821m6124m0221K0641J8390l5199q4003L1090
$$ -38758 -20391 37214 47859 88711 91532 45408 5187 25828 44218 9019 -74984 -43894
15333d3894n640p8534K3247O0035J7508k122j1835j7995J3440j7481p7037k496
$$ -43894 -49534 -128068 -104821 -44786 -27278 -29400 -41235 -59230 -45790 -63271 -140308 -142804
15321a42804M1233M9936L1866n345j7198k6871r122K6679k4771j260M3227l936
$$ -142804 -101571 -51635 -19769 -25114 -42312 -69183 -78305 -51626 -76397 -77657 -34430 -38366
15309c8366j269K8154j3726p36j8259k7047K3972L4021N207n5706o4639M6944
$$ -38366 -39635 -11481 -25207 -25943 -44202 -71249 -47277 -13256 -8049 -63755 -128394 -81450
15297h1450K6179K9793l6145j0602N7864J0104J4464M1047l0443l9829K3011J3204
$$ -81450 -55271 -25478 -61623 -72225 -14361 -4257 10207 51254 20811 -19018 3993 17197
15285A7197l0252J5828l7111k2006M428J4001j832J6339k218j5477j6300j7809
$$ 17197 -13055 2773 -34338 -56344 -51916 -37915 -39747 -23408 -25626 -41103 -57403 -75212
15273g5212K1261O2116K5381q6777m0031N9389K3193j4351k1380k9762O807L7399
$$ -75212 -53951 8165 33546 -53231 -93262 -33873 -10680 -25031 -46411 -76173 -69366 -31967
15261c1967M2466O2981l4261o4459k2730K4244J4278J5335J925j8158J5770q966
$$ -31967 10499 73480 39219 -25240 -47970 -23726 -9448 5887 7812 -10346 5424 -3542
15249c542M0144L492p5655p4303K2426N1220r760j0431O7694O426j0068k8541
$$ -3542 36602 40094 -35561 -109864 -87438 -36218 -45978 -56409 11285 17711 7643 -20898
15237b0898N1054p672p2232l2335K9364K0568L4095R505m3709j77J3538j1492
$$ -20898 30156 22484 -49748 -82083 -52719 -32151 1944 11449 -32260 -32437 -18899 -30391
15225c0391k3507n339m862j7537p196J2443R150k6133k3343J6798N4135O386p1498
$$ -30391 -53898 -59237 -64099 -81636 -88832 -76389 -67239 -93372 -116715 -99917 -45782 -39396 -110894
15212a10894N038J13527J7864k2225N814j3438j8158m4228o3155k6892L7630L9264
$$ -110894 -105856 7671 25535 3310 9124 -4314 -22472 -66700 -129855 -156747 -119117 -79853
15200g9853l651J4888L5019m9572j2982L8561K0928o991j9818l0604l3046N6745
$$ -79853 -83504 -68616 -33597 -83169 -96151 -57590 -36662 -43653 -63471 -94075 -127121 -70376
15188g0376N1451L9057K6769L3258m068q2850j6888k0380m8158k2692K4538K311
$$ -70376 -18925 20132 46901 80159 76091 -6759 -23647 -44027 -92185 -114877 -90339 -88028
15176h8028J811K8851L5846J7166J4831n0466q337K7172j1865L0374n231l5831
$$ -88028 -86217 -57366 -21520 -4354 10477 -39989 -48326 -21154 -33019 -2645 -7876 -43707
15164d3707J4683N2998l373n8787M195K2384q740j4628N5384m8242j226O9627
$$ -43707 -29024 23974 20601 -38186 -33991 -11607 -20347 -34975 20409 -27833 -29059 40568
15152D0568Q5039k9893m6202o0319M302M9829j4242n3953o979j1983l0916J5552
$$ 40568 125607 95714 49512 -10807 -6505 43324 29082 -24871 -31850 -43833 -74749 -59197
15140e9197Q7798N1691n4056l4985M134m0211j1667j0798K9881R137j8534O809
$$ -59197 28601 80292 26236 -8749 -4615 -44826 -56493 -67291 -37410 -28273 -46807 -39998
15128c9998K4938K3298j8758Q787j1808j8408k6099n815O8398R3482j6770m1652
$$ -39998 -15060 8238 -10520 -1733 -13541 -31949 -58048 -63863 4535 98017 81247 39595
15116C9595J129j7845o073J9335j0653j0525M2743L1373n4185n7687m3780L5164
$$ 39595 40724 22879 16806 36141 25488 14963 57706 89079 34894 -22793 -66573 -31409
15104c1409N1602J5665j0912o664l1643k3762p158J0198J4484J0049L1107J1922
$$ -31409 20193 35858 24946 18282 -13361 -37123 -44281 -34083 -19599 -9550 21557 33479
15092C3479r908o0085K881M5713j7514j3172j6750L2809m0727l0055J4378L3244
$$ 33479 23571 -36514 -33633 12080 -5434 -18606 -35356 -2547 -43274 -73329 -58951 -25707
15080b5707p424K8189P681m0104k2503K0749m833j078j9426j1720J7050K832q718
$$ -25707 -33131 -4942 2739 -37365 -59868 -39119 -43952 -45030 -64456 -76176 -59126 -56294 -65012
15067f5012J6997m2464o8495J0732L7334n56J7563L4209l2940p5534J7711L4369
$$ -65012 -48015 -90479 -158974 -148242 -110908 -111464 -93901 -59692 -92632 -168166 -150455 -116086
15055a16086q490K3895M5566L4981l2549l4937M7419R463K4548j6089j847m3067
$$ -116086 -124576 -100681 -55115 -20134 -52683 -87620 -40201 -30738 -6190 -22279 -24126 -67193
15043f7193j7392L3349K7632q837j9643j7514k9012N0114J4004l8292N0868J3120
$$ -67193 -84585 -51236 -23604 -32441 -52084 -69598 -98610 -48496 -34492 -72784 -21916 -8796
15031h796J7506k4233o724L211K3600J5822R964m1886J3007p898n7825L7992L1686
$$ -8796 8710 -15523 -22247 -19036 4564 20386 30350 -11536 1471 -6427 -64252 -26260 5426
15018E426k1114J0752K3553k2050p2937L9431L5808R775l228L2443l3632p9236
$$ 5426 -15688 -4936 18617 -3433 -76370 -36939 -1131 8644 5416 37859 4227 -75009
15006g5009K1301M3736n37o7174j0217j0087l8268K7184N6293N2909m1433n2598
$$ -75009 -53708 -9972 -10509 -77683 -87900 -97987 -136255 -109071 -52778 131 -41302 -93900
14994i3900L8157J4037j124m4446n8943R532J0713q761J6357P9394L052j6818
$$ -93900 -55743 -41706 -42830 -87276 -146219 -136687 -125974 -134735 -118378 -38984 -35932 -52750
14982e2750l2547N4437j8284l5558M117l577j5999M3610P076l3192P5021J1496
$$ -52750 -85297 -30860 -49144 -84702 -80585 -84162 -100161 -56551 -49475 -82667 -7646 3850
14970C850o7259o3605L4293L2258M8503k6480j9437l7014L864N3526J2237K6234
$$ 3850 -63409 -127014 -92721 -60463 -11960 -38440 -57877 -94891 -91027 -37501 -25264 970
14958I70J2127M338q215k7276L7261L0410n9850m1447O1005Q5799k4420k9566
$$ 970 13097 17435 9220 -18056 19205 49615 -10235 -51682 9323 95122 70702 41136
14946D1136j6422L3333m0506k7345M8164k8765j7575o0164M4290L7563J9741r458
$$ 41136 24714 58047 17541 -9804 38360 9595 -7980 -68144 -23854 13709 33450 23992
14934B3992m530n6642k3195O6330j6058p5973m5802K6134M8579K2137n4261m4421
$$ 23992 19462 -37180 -60375 5955 -10103 -86076 -131878 -105744 -57165 -35028 -89289 -133710
14922a33710L2669R9705L851j2821l6782P647N6451j3144o0618J7898j2051l1731
$$ -133710 -101041 -1336 2515 -10306 -47088 -39441 17010 3866 -56752 -38854 -50905 -82636
14910h2636k9672K5642K6532L5708m4415k6611K9397m197o3689q103K8024J3088
$$ -82636 -112308 -86666 -60134 -24426 -68841 -95452 -66055 -70252 -133941 -142044 -114020 -100932
14898a00932k5103P80k0158k152O2492J340r590q864j8554m046j8376N1863P2493
$$ -100932 -126035 -125255 -145413 -147565 -85073 -83733 -93323 -102187 -120741 -124787 -143163 -91300 -18807
14885a8807n842n1225m4680N5172P1740o5759k2650J8167K0882L711j8237j7266
$$ -18807 -24649 -75874 -120554 -65382 6358 -59401 -82051 -63884 -43002 -39291 -57528 -74794
14873g4794o386j108k3035L731O1763N3111N4401n270j8708l2781n8768k4631
$$ -74794 -81180 -82288 -105323 -101592 -39829 13282 67683 62413 43705 10924 -47844 -72475
14861g2475k1953O35k449J1819J5232J1237q835k7763k2295M5082M0099k3473
$$ -72475 -94428 -93793 -96242 -84423 -69191 -57954 -66789 -94552 -116847 -71765 -31666 -55139
14849e5139J6718P664l7243m1086L759K3259l615L975O4044p592K0098L7692k1746
$$ -55139 -38421 -30757 -68000 -109086 -105327 -82068 -85683 -81708 -17664 -25256 -5158 32534 10788
14836A0788l4206n8325k681K0089N8173j7698R524k8805N9043L6698k9555j6397
$$ 10788 -23418 -81743 -84424 -64335 -6162 -23860 -14336 -43141 15902 52600 23045 6648
14824F648k2918m4091K7924k62k4585k0785K7452K3549M133n011K2978L6856l5953
$$ 6648 -16270 -60361 -32437 -32699 -57284 -78069 -50617 -27068 -22935 -27946 -4968 31888 -4065
14811d065n8148j9301m1036J6525P2232k6554k4675K0702p941r871l321N6299
$$ -4065 -62213 -81514 -122550 -106025 -33793 -60347 -85022 -64320 -72261 -82132 -85453 -29154
14799b9154L8806j4699l6593l8455L7109L4997l5489k2735J6754o3508j4792O2731
$$ -29154 9652 -5047 -41640 -80095 -42986 -7989 -43478 -66213 -49459 -112967 -127759 -65028
14787f5028j6158K8341J02020K0826l0565L985J4817j6030p4965k7405J2781K2881
$$ -65028 -81186 -52845 49175 70001 39436 43421 58238 42208 -32757 -60162 -47381 -24500
14775b4500K996j3059n0748K265L6044M3j2936L3179N0838m067k1819n7974j1479
$$ -24500 -21504 -34563 -85311 -83046 -47002 -46959 -59895 -26716 24122 20055 -1764 -59738 -71217
14762g1217p658P83L6611L469P066K9909K1080o484K2366K0787j3948o1088k8020
$$ -71217 -78875 -78092 -41481 -38012 -30946 -1037 20043 13559 35925 56712 42764 -18324 -46344
14749d6344J3759L3614n125k6948o450J6356n696j9517K7327J0053K1895Q606
$$ -46344 -32585 1029 -4096 -31044 -37494 -21138 -26834 -46351 -19024 -8971 12924 21530
14737B1530k844o415l7775j332j6303L9527J739K1890k8018o1996m0557l7484
$$ 21530 18686 12271 -25504 -26836 -43139 -3612 -1873 20017 -8001 -69997 -110554 -148038
14725a48038j2427M748K4988N3393Q0880K4807J5458m3263n4799k0901m65O6572
$$ -148038 -160465 -155717 -130729 -77336 3544 28351 43809 546 -54253 -75154 -75619 -9047
14713i047j5352k1630m88M4379l9607k6891p148j4589j1759m128N4513K2590l0951
$$ -9047 -24399 -46029 -46517 -2138 -41745 -68636 -75784 -90373 -102132 -106260 -51747 -29157 -60108
14700f0108L1260K9643j1295N396l6839j0380j5929J6127M4920K9181J213p9521
$$ -60108 -28848 795 -10500 -5104 -41943 -52323 -68252 -52125 -7205 21976 23189 -56332
14688e6332r613l446k5343J1557K0052k443R168k3414Q4867N5112J4255L283n1183
$$ -56332 -65945 -69391 -94734 -83177 -63125 -65568 -56400 -79814 5053 60165 74420 77703 26520
14675B6520m0429p8693J9012L5279L3815j991k7285l6549K2161L5625J2633Q8
$$ 26520 -13909 -92602 -73590 -38311 -4496 -6487 -33772 -70321 -48160 -12535 98 186
14663A86m1326k1991j2820K298R310O8235J8935k4852J45l5467k9755q480M001
$$ 186 -41140 -63131 -75951 -73653 -64343 3892 22827 -2025 -1880 -37347 -67102 -75582 -71581
14650g1581O0213J9173O499j3254K137K7628n6303M681N1229J9810p8430k9833
$$ -71581 -11368 7805 14304 1050 3187 30815 -25488 -20807 30422 50232 -28198 -58031
14638e8031M2999K8468l6958j2764k1039o0260l7835M5281L5948J3475j7651n2809
$$ -58031 -15032 13436 -23522 -36286 -57325 -117585 -155420 -110139 -74191 -60716 -78367 -131176
14626a31176L8624L4240J7978l9154j6066L8360M716N7452k0298n1935j6632K8787
$$ -131176 -92552 -58312 -40334 -79488 -95554 -57194 -52478 4974 -15324 -67259 -83891 -55104
14614e5104K7859J9073o917Q410k77l47n901O545m2352o2315j2992O49k84M0362
$$ -55104 -27245 -8172 -15089 -6679 -6956 -7303 -13204 -6659 -49011 -111326 -124318 -123669 -123953 -83591
14600h3591Q9234m5084l6023N0683p689J8446Q554J054M749M290M7285K7559l1046
$$ -83591 5643 -39441 -75464 -24781 -32470 -14024 -5470 -4416 333 4623 51908 79467 48421
14587D8421p5297n0297m0491K7010N7531J9510P458k0351k1809M442K1011J7273
$$ 48421 -26876 -77173 -117664 -90654 -33123 -13613 -6155 -26506 -48315 -43873 -22862 -5589
14575e589j0768j4203J4921k808n482R802j407j5314J1266K5306l2469o0407L3961
$$ -5589 -16357 -30560 -15639 -18447 -23929 -14127 -15534 -30848 -19582 5724 -26745 -87152 -53191
14562e3191M9648l7158m2706J5992r360o930P1241K8135m4150n4610K1677L5286
$$ -53191 -3543 -40701 -83407 -67415 -76775 -83705 -12464 15671 -28479 -83089 -61412 -26126
14550b6126l0839O598K4416L0525N668n1204K9580J1979k4711J6539M2579n312
$$ -26126 -56965 -50367 -25951 4574 10242 -40962 -11382 597 -24114 -7575 35004 29692
14538B9692j2795k4879J6283m9820j4848L4662K0337o672K2849l9256o8133L3666
$$ 29692 16897 -7982 8301 -41519 -56367 -21705 -1368 -8040 14809 -24447 -92580 -58914
14526e8914P3546L382o7874J9573M4168j288K102M6468n4689m7624K8417J721
$$ -58914 14632 18014 -49860 -30287 13881 12593 14695 61163 6474 -41150 -12733 -11012
14514a1012l6660l856K6221l1341o062N6837j8785p465j1206l0893m7028L399
$$ -11012 -47672 -51528 -25307 -56648 -62710 -5873 -24658 -32123 -43329 -74222 -121250 -117851
14502a17851O6134L609j0164K1609Q652O7999K0790p093r173L154J8249J0834
$$ -117851 -51717 -48108 -58272 -36663 -28011 39988 60778 53685 44512 47666 65915 76749
14490G6749q2845k3968K797j1202j8969o569L7197L1692R994m2307n2507K6173
$$ 76749 -6096 -30064 -27267 -38469 -57438 -64007 -26810 4882 14876 -27431 -79938 -53765
14478e3765M9875N2124k0127m1708n1075K041L9302p1362m3076N0933L8410L3118
$$ -53765 -3890 48234 28107 -13601 -64676 -62635 -23333 -94695 -137771 -86838 -48428 -15310
14466a5310J0022q151R675J6542j1655j14134J4344K2952N0223J3730l287J23
$$ -15310 -5288 -13439 -3764 12778 1123 -113011 -98667 -75715 -25492 -11762 -15049 -14926
14454a4926J5617J6401j5443k6538m9400K7138J1710j7856m8886K9653O296j9455
$$ -14926 691 17092 1649 -24889 -74289 -47151 -35441 -53297 -102183 -72530 -66234 -85689
14442h5689M017J2568K8877M8057Q094k8308M3718l3876J7845O744k7526j0648
$$ -85689 -81672 -69104 -40227 7830 15924 -12384 31334 -2542 15303 22047 -5479 -16127
14430a6127m0527R490K1120l6258J2945J2353r833J1667K3271J7749P331L166
$$ -16127 -56654 -47164 -26044 -62302 -49357 -37004 -46837 -35170 -11899 5850 13181 16347
14418A6347o5944j8728L0086K462M499k4326K2573l915k411k5537r363J1386N3185
$$ 16347 -49597 -68325 -38239 -35777 -31278 -55604 -33031 -36946 -39357 -64894 -74257 -62871 -9686
14405i686l1215K7602J5799k8472k953n5439j6134L6370L434M863N1062M4093
$$ -9686 -40901 -13299 2500 -25972 -28925 -84364 -100498 -64128 -60694 -55831 -4769 39324
14393C9324J6199N0392k8757m7262m8386l0631k7639M1555K0427k9902k368l4541
$$ 39324 55523 105915 77158 29896 -18490 -49121 -76760 -35205 -14778 -44680 -47048 -81589
14381h1589M2291L7490l1414N1816L3812r607m3449K0286L2797O6311p4200r4575
$$ -81589 -39298 -1808 -33222 18594 52406 42799 -650 19636 52433 118744 44544 -50031
14369e0031k821P22K1759J0660n8904j7731O3339R3798L5643K671k5072l0508
$$ -50031 -52852 -52130 -30371 -19711 -78615 -96346 -33007 60791 96434 99105 74033 43525
14357D3525J1002J618n1270j8234j9206k9651k5379L67L5520N8716l1695k7599
$$ 43525 54527 56145 4875 -13359 -32565 -62216 -87595 -87228 -51708 7008 -24687 -52286
14345e2286J4861M4159Q7069K9529j1698J2686O9746K9157L8726J8733R3630J14073
$$ -52286 -37425 6734 93803 123332 111634 124320 194066 223223 261949 280682 374312 488385
14333D88385J28712J40092M9664n5993K7156m309j08715j44326m8050q185m2233
$$ 488385 617097 757189 806853 750860 778016 773707 664992 520666 472616 464431 422198
14322D22198j01410r2131l0729o5620l6328K1767J6760M8279L989k8213k3571
$$ 422198 320788 228657 197928 132308 95980 117747 134507 182786 186775 158562 134991
14311A34991n4529j7447J0010K4251n5n0111j9169M379R637L6527J2604j5089
$$ 134991 80462 63015 73025 97276 97221 47110 27941 32320 41957 78484 91088 75999
14299G5999k6906O4495L0971n965K4439m1475k8776J8771J0537K2295P775M4877
$$ 75999 49093 113588 144559 138594 163033 121558 92782 111553 122090 144385 152160 197037
14287A97037K545j109N3101Q5978R6246O4006R8081J44197K10703K19476J79127
$$ 197037 199582 198473 251574 337552 433798 497804 595885 740082 950785 1170261 1349388
14276A349388J58621J04302l4015j09957j89803k21440j40975j89880j59813j04218
$$ 1349388 1508009 1612311 1578296 1468339 1278536 1057096 916121 726241 566428 462210
14266D62210j05345j10700o970K4910p242l3296o7733n8457M5643k2044o2074
$$ 462210 356865 246165 239195 264105 256863 223567 155834 97377 143020 120976 58902
14255E8902L6295N0449k3936J6826k0170o2415M8988L964N316m1830j20105M4730
$$ 58902 95197 145646 121710 138536 118366 55951 104939 108903 114219 72389 -47716 -2986
14243b986N7414J7786Q804k289K4460j2898R917m596j7804M4052O7344J3461l3120
$$ -2986 54428 72214 81018 78729 103189 90291 100208 95612 77808 121860 189204 202665 169545
14230A69545L9701J37L6331M4301N6387J06321J11949M9635Q2202O2974K8643
$$ 169545 209246 209383 245714 290015 346402 452723 564672 614307 696509 759483 788126
14219G88126Q452n1474j12333q9875p4917o7061m2587m4638r6696o6531Q234k8117
$$ 788126 796578 745104 632771 542896 467979 400918 358331 313693 216997 150466 158700 130583
14207A30583n3480r483K6671K8811n531J2152M0954R095p192n8859J4544N2342
$$ 130583 77103 67620 94291 123102 117571 129723 170677 179772 172580 113721 128265 180607
14195A80607n0289l6657K9891j9613n3329k6495j2006j8375j3636O1838R047l3071
$$ 180607 130318 93661 123552 103939 50610 24115 12109 -6266 -19902 41936 50983 17912
14183A7912o1908k6398L6077J1657p939J7894L6714N2561N848l4549p2664o7311
$$ 17912 -43996 -70394 -34317 -22660 -30599 -12705 24009 76570 82418 47869 -24795 -92106
14171i2106j4349K4464L4636P496p6392n9327l1826p266J1845N2460L8649j228
$$ -92106 -106455 -81991 -47355 -39859 -116251 -175578 -207404 -214670 -202825 -150365 -111716 -112944
14159a12944Q251M1411l181N0192R816J970K280K3273o6393m3490N082K8159M5005
$$ -112944 -104693 -63282 -66463 -16271 -6455 -4485 -2205 21068 -45325 -88815 -83733 -55574 -10569
14146a0569J0137n528K9632N0299J6914l9728L0043K4295K8316l9002J0935j0957
$$ -10569 -432 -5960 23672 73971 90885 51157 81200 105495 133811 94809 105744 94787
14134I4787l2860o5786j1568M7146K0734J1306k1068k2705J5126k3049J4806O8348
$$ 94787 61927 -3859 -15427 31719 52453 63759 42691 19986 35112 12063 26869 95217
14122I5217N77M897j1163N4610k6937p8284J186o824r2642q1720j41947o3483
$$ 95217 95794 100691 89528 144138 117201 38917 40103 33279 -59363 -141083 -283030 -346513
14110c46513r99J0257k1210p929O8298J02010O5139L3809N3271N6632N3413J1615
$$ -346513 -347512 -337255 -358465 -366394 -298096 -196086 -130947 -97138 -43867 12765 66178 77793
14098G7793j4731j0713j3937L0392Q2155J9201l9767o1360K5583K8038K4980l1028
$$ 77793 63062 52349 38412 68804 150959 170160 130393 69033 94616 122654 147634 116606
14086A16606m0547K2619m4116j5423O7910L8240k1101n429L3304l755l5496k4655
$$ 116606 76059 98678 54562 39139 107049 145289 124188 118759 152063 148308 112812 88157
14074H8157J5380J9575j8747j0235J226N8016J2544k6810k8392J3027m7330o8957
$$ 88157 103537 123112 104365 94130 95356 153372 165916 139106 110714 123741 76411 7454
14062G454j5413K9474k379Q12n718o7363p5557o9623L6789K8431P744M7199M4982
$$ 7454 -7959 21515 19136 19948 14230 -53133 -128690 -198313 -161524 -133093 -125349 -78150 -33168
14049c3168N1615K7630R373N668O9406K8528R1007L3882m3865m2608o733j12l4524
$$ -33168 18447 46077 55450 61118 130524 159052 250059 283941 240076 197468 190735 190623 156099
14036A56099q6693j2697N4361l031k4419M2531L7456r946m8351O4581O3608o370
$$ 156099 69406 56709 111070 108039 83620 126151 163607 153661 105310 169891 233499 227129
14024B27129k2031n3831j1421N7521J5844M9490M320l4798n2695R707l2933m7793
$$ 227129 205098 151267 139846 197367 213211 262701 267021 232223 179528 189235 156302 108509
14012A08509M3680J5421j7067j4358r670M6066k9040Q714m312k1768J0261K7511
$$ 108509 152189 167610 150543 136185 126515 172581 143541 152255 147943 126175 136436 163947
14000A63947K4383N936l1543j3479R721L1998m0746L6148J23721M6560j3435P322
$$ 163947 188330 194266 162723 149244 158965 190963 150217 186365 310086 356646 343211 350533
13988C50533R5489J09838N2223M189P7346j9439J4359q483j6684N6761j1716j0417
$$ 350533 446022 555860 608083 612272 689618 670179 684538 676055 659371 716132 704416 693999
13976F93999M8850O1995m5401k5836p840p3808m8893m6284o9172n0522K2764R298
$$ 693999 742849 804844 759443 733607 725767 651959 603066 556782 487610 437088 459852 469150
13964D69150p588J596J0046J8057Q9800K3988j6430L190L0898k4356k8332m0104
$$ 469150 461562 463158 473204 491261 581061 605049 588619 591809 622707 598351 570019 529915
13952E29915K2457m3844m4045j9890j6976N3117k2911n6792N0081Q4500K7818
$$ 529915 552372 508528 464483 444593 427617 480734 457823 401031 451112 535612 563430
13941E63430k5075J8157O4376J0864O1175L9850M3797J04799J25386J44607J06777
$$ 563430 538355 556512 620888 631752 692927 732777 776574 881373 1006759 1151366 1258143
13930A258143J05062P6892M1990j4551l2112k0157J4406K7901N7497M7881P6276
$$ 1258143 1363205 1440097 1482087 1467536 1435424 1415267 1429673 1457574 1515071 1562952 1639228
13919A639228Q0204M8158K5641m8926r3281p3228p7538p3688q2476p8729j9629
$$ 1639228 1719432 1767590 1793231 1744305 1651024 1577796 1500258 1426570 1344094 1265365 1245736
13908A245736J8738l1790j9990k0734J3182N2962M5789N3926M1842L8314N9938
$$ 1245736 1264474 1232684 1212694 1191960 1205142 1258104 1303893 1357819 1399661 1437975 1497913
13897A497913M1823J04856J07784P2211J36961J07409R5334J41051J54512J60669
$$ 1497913 1539736 1644592 1752376 1824587 1961548 2068957 2164291 2305342 2459854 2620523
13887B620523J83787K44911K26364K76712K77254L45901M34782N11501N74706
$$ 2620523 2804310 3049221 3275585 3552297 3829551 4175452 4610234 5121735 5696441
13878E696441O91770Q70002R56665J024646J203055J249012J281167J545668J878124
$$ 5696441 6388211 7258213 8214878 9239524 10442579 11691591 12972758 14518426 16396550
13869A6396550K384600L137898M077354N472568P324531R836565J3247652J7770579
$$ 16396550 18781150 21919048 25996402 31468970 38793501 48630066 61877718 79648297
13861G9648297K2990553K6832545K6211534J8636313M917664j0398425k1638190
$$ 79648297 102638850 129471395 155682929 174319242 179236906 168838481 147200291
13854A47200291k5842788k4176079j9622538j4669801j0559841p616996n619159
$$ 147200291 121357503 97181424 77558886 62889085 52329244 44712248 39093089
13847C9093089m594957m161844l870909l483868k848883k184671j724895j304027
$$ 39093089 34498132 30336288 26465379 22981511 20132628 17947957 16223062 14919035
13839A4919035j096337r33217o99953n33011l39424k49036k09201j38870m7107
$$ 14919035 13822698 12889481 12189528 11656517 11317093 11068057 10858856 10719986 10672879
13830A0672879M7450R1193K62866M06871N14226P18184Q78056J076990J331712
$$ 10672879 10720329 10811522 11074388 11481259 11995485 12713669 13591725 14668715 16000427
13821A6000427J636511J797359J924782K100521K331756K867495L566115M547615
$$ 16000427 17636938 19434297 21359079 23459600 25791356 28658851 32224966 36772581
13813C6772581N905024P750637J0246261J3771815J8837756K6129922L6159624
$$ 36772581 42677605 50428242 60674503 74446318 93284074 119413996 155573620
13806A55573620M8095402N8312668N9184609M4112090J6982046j2445661l5849426
$$ 155573620 203669022 261981690 321166299 365278389 382260435 369814774 333965348
13799C33965348m9619100n5491269n3086657m2521050l0355353k1107142j5050696
$$ 333965348 284346248 228854979 175768322 133247272 102891919 81784777 66734081
13792F6734081j1204400q661689o825635n472873m441732l583660k814624k267159
$$ 66734081 55529681 46867992 40042357 34569484 30127752 26544092 23729468 21462309
13784B1462309j975628j609116j349471j115289q80493p08874n82693n39428m90901
$$ 21462309 19486681 17877565 16528094 15412805 14532312 13823438 13240745 12701317 12210416
13775A2210416l99615k06966j23129K3645R1227K54409L51652M40535O36216Q21488
$$ 12210416 11810801 11603835 11480706 11504351 11595578 11849987 12201639 12642174 13278390 14099878
13765A4099878R08993J060416J218324J455772J789998K246109K938611L789764
$$ 14099878 15008871 16069287 17287611 18743383 20533381 22779490 25718101 29507865
13757B9507865M762584N631057O617540Q126384J0975488J5210974K0713416K6360058
$$ 29507865 34270449 39901506 46519046 54645430 65620918 80831892 101545308 127905366
13749A27905366K9665038K6942600J5726379j678614j8861147k9298389l0755020
$$ 127905366 157570404 184513004 200239383 198560769 179699622 150401233 119646213
13742A19646213k6414493k0391898j4977584j0959445q234652o440177n081892
$$ 119646213 93231720 72839822 57862238 46902793 38668141 32227964 27146072
13735B7146072m061082l244792k631927k124007j730091j409342j240917j046530
$$ 27146072 23084990 19840198 17208271 15084264 13354173 11944831 10703914 9657384
13727I657384q04096o93427n83327n09237m75731m85923n09686n32268m12120
$$ 9657384 8853288 8159861 7576534 7067297 6591566 6105643 5595957 5063689 4651569
13718D651569l43827k61066k00576j80230j92453k29635k39870j11679j46936
$$ 4651569 4307742 4046676 3846100 3665870 3473417 3243782 3003912 2892233 2745297
13709B745297j52784q8775l0928j14237p2806l7966j28402j35768j11656m4344
$$ 2745297 2592513 2503738 2472810 2358573 2285767 2247801 2119399 1983631 1871975 1827631
13699A827631l3563p8086N292l676j24143p0478L2645K2461m7035j9288m1067
$$ 1827631 1794068 1715982 1721274 1717598 1593455 1522977 1555622 1578083 1531048 1511760 1470693
13688A470693l2263r1404p9921m2561o4341n2154l0788J6265M3797j3164j1818
$$ 1470693 1438430 1347026 1267105 1224544 1160203 1108049 1077261 1093526 1137323 1124159 1112341
13677A112341M3065l2957p0653N0371L8577m837M5781J29741P4936q7879o4598
$$ 1112341 1155406 1122449 1051796 1102167 1140744 1135907 1181688 1311429 1386365 1298486 1233888
13666A233888p3890n6619p8302q1040o1925o2106l0737j9270K4440K4051J2749
$$ 1233888 1159998 1103379 1025077 944037 882112 820006 789269 769999 794439 818490 831239
13655H31239j1150J7704J4867n14O2535R4065L6544M6355k7503p6210q9148r6551
$$ 831239 820089 837793 852660 852146 914681 1008746 1045290 1091645 1064142 987932 898784 802233
13643H02233r8249p4366m8654n2775o9929n3083M547O7117L9711k283n427m6312
$$ 802233 703984 629618 580964 528189 458260 405177 409724 476841 516552 514269 508842 462530
13631D62530j0361K2031L492j8271l4647n200K0644m077r792J5202J5377m93J7974
$$ 462530 452169 474200 477692 459421 424774 419574 440218 436141 426349 441551 456928 456435 474409
13618D74409M589r72P423k9040L0788L3849L1222k9106l804K1447l1485k0993
$$ 474409 478998 478026 485449 456409 487197 521046 552268 523162 519358 540805 509320 488327
13606D88327k2595m8919j3372M5495K948m0872k3473K6190L998K583K1743J5987
$$ 488327 465732 416813 403441 448936 451884 411012 387539 413729 417727 420310 442053 458040
13594D58040q342j1263m3103m0826M9247Q99Q080l5441o1098P912L289M940J2786
$$ 458040 449698 438435 395332 354506 403753 404652 412732 377291 316193 324105 327394 332334 345120
13581C45120k8511m1358K41r932k9969j4220M8952K9022j5324j7507k8078p44
$$ 345120 316609 275251 275492 265560 235591 221371 270323 299345 284021 266514 238436 237692
13569B37692l376j8927M9081J2733j6612p8041l4656L772k6910J4619N4449P9069
$$ 237692 234316 215389 264470 277203 260591 182550 147894 151666 124756 139375 193824 272893
13557B72893N2918K9271Q841k6060M9573J8260L8721M4540R373m2083k2129j8366
$$ 272893 325811 355082 363923 337863 387436 405696 444417 488957 498330 456247 434118 415752
13545D15752o8055N591m3840k5475m7264j2119j9774N118K2952R965l8740J6331
$$ 415752 347697 353288 309448 283973 236709 224590 204816 209934 232886 242851 204111 220442
13533B20442K9481J936j1657k5094K4736J2872J9540k8295k6868J2439L2255l6208
$$ 220442 249923 251859 240202 215108 239844 252716 272256 243961 217093 229532 261787 225579
13521B25579r152k6574j5843k3344j5519M4907L9280k8272k7643R176M064J0504
$$ 225579 216427 189853 174010 150666 135147 180054 219334 191062 163419 172595 176659 187163
13509A87163L1460n209J3296j2346j8423N681K0042M3527L0406P5948R8715Q9166
$$ 187163 218623 213414 226710 214364 195941 201622 221664 265191 295597 371545 470260 559426
13497E59426M2702O7205N2686r6164q1983q7804j07787r9388j6212K6275j7422
$$ 559426 602128 669333 722019 625855 543872 456068 348281 248893 232681 258956 241534
13486B41534M238r984j5580L8176L2879l9769k5453r378k8944J7181M2767O863
$$ 241534 245772 235788 220208 258384 291263 251494 226041 216663 187719 204900 247667 254530
13474B54530n1360o247k441Q070p07n6151m8276l8765J7241O4833L46K4166K8254
$$ 254530 203170 196923 194482 202552 201845 145694 97418 58653 75894 140727 141073 165239 193493
13461A93493l2429J6269k4839L7129p954r617l8995n352l861J2284J05537J3107
$$ 193493 161064 177333 152494 189623 181669 172052 133057 127705 123844 136128 241665 254772
13449B54772l7180J3857j6296m7613l7516L3259J22447J12560R1909j9478k7420
$$ 254772 217592 231449 215153 167540 130024 163283 285730 398290 490199 470721 443301
13438D43301r5162r0637n8801j131L7199j7774p2029j8932j7856j3138n9887q325
$$ 443301 348139 257502 198701 197570 234769 216995 144966 126034 108178 95040 35153 26828
13426B6828Q7330j7752q201j4511l425N4646J05K086J3423l2963J1610J4413M595
$$ 26828 114158 96406 88205 73694 70269 124915 125020 127106 140529 107566 119176 133589 138184
13413A38184m3360k3638M8266j8368m427J0423K1983n473k6939j329p042J1312
$$ 138184 94824 71186 119452 101084 96657 107080 129063 123590 96651 95322 88280 99592
13401I9592L7076K8266K2193j1996o7215N158j3803L1130O7099J5924l56k1876
$$ 99592 136668 164934 187127 175131 107916 113074 99271 130401 197500 213424 213068 191192
13389A91192O843J7752O4033Q3572M5181m3625P0678Q7162P749M3014O1757Q3277
$$ 191192 198035 215787 279820 363392 408573 364948 435626 522788 530537 573551 635308 718585
13377G18585J16632K1663n1274o3282j72453j10980r4153m5267K2454K9461m5560
$$ 718585 835217 856880 805606 742324 569871 458891 364738 319471 341925 371386 325826
13366C25826n6459l6799p127o946m0707k8170M5403J2857J1401l2317o7014n6300
$$ 325826 269367 232568 225441 218495 177788 149618 195021 207878 219279 186962 119948 63648
13354F3648m3268m459K8416L0230J7816N6100J6676m1040L2796P208O4093M7427
$$ 63648 20380 15921 44337 74567 92383 148483 165159 124119 156915 164123 228216 275643
13342B75643k5201j5771K2690O0076J3569j5452o044O444K059J818O2417N8854
$$ 275643 250442 234671 257361 317437 331006 315554 309510 315954 318013 319831 382248 441102
13330D41102L4426N8384J20178J34842J04475J83801K72157K04024J28993N9553
$$ 441102 475528 533912 654090 788932 893407 1077208 1349365 1553389 1682382 1741935
13320A741935j7589n8102j28706j99640k26924k47592j69912j21485l1645m7769
$$ 1741935 1724346 1666244 1537538 1337898 1110974 863382 693470 571985 540340 492571
13310D92571p0654k2744m1606k8463p3685L4746J7834o7876n9450l8943k274M642
$$ 492571 421917 399173 357567 329104 255419 290165 307999 240123 180673 141730 139456 144098
13298A44098k6075r309K8252N6548n134p3039N4180N8137j6143n5005q94K1871
$$ 144098 118023 108714 136966 193514 188380 115341 169521 227658 211515 156510 155616 177487
13286A77487K3610K7021J3056J415k113L1917K8013L8887K3809K3447K318N9852
$$ 177487 201097 228118 241174 242589 240476 272393 300406 339293 363102 386549 388867 448719
13274D48719M4952L2722N0987N6710O4589N8821J05680R7429O5452L9537O977
$$ 448719 493671 526393 577380 634090 698679 757500 863180 960609 1026061 1065598 1072575
13263A072575j05171j05275q0878j11820p9394j5250j8678j2452p8283k8464k5852
$$ 1072575 967404 862129 781251 669431 590037 574787 556109 543657 465374 436910 411058
13252D11058J787M9760R4628P1024N80J2998M904k373O2682M2126q303L0193J04170
$$ 411058 412845 462605 557233 628257 628837 641835 646739 644366 707048 749174 740871 771064 875234
13239H75234K9736K0722L0729M3891M3325M755K3119J6832P1898O657L9295L1868
$$ 875234 904970 925692 956421 1000312 1043637 1048392 1071511 1088343 1160241 1166898 1206193 1238061
13227A238061k4695k9974k9791J0055k4151K9390p498n5368p9419n8493m8339
$$ 1238061 1213366 1183392 1153601 1163656 1139505 1168895 1161397 1106029 1026610 968117 919778
13216I19778j6021n0473l0154m1443m4786m7947n089m844n4184n4027M21M1707
$$ 919778 903757 853284 823130 781687 736901 688954 683865 679021 624837 570810 571231 612938
13204F12938K043n3304m2402n1832m1782j1738J5234K5156K5142P906k0937J35
$$ 612938 614981 561677 519275 467443 425661 413923 429157 454313 479455 487361 466424 466559
13192D66559L7503k2009O4825K0496k5735K3752j0340K3753N2387L7031L8189
$$ 466559 504062 482053 546878 567374 541639 565391 555051 578804 631191 668222 706411
13181G06411J5442j1448j22961r5930l1512J5700o1652m9716o2781n8422k9402
$$ 706411 721853 710405 587444 491514 460002 475702 414050 364334 301553 243131 213729
13170B13729O41K7507j5137L84L8769l513l1458K8619K2724J554l2208m1549k820
$$ 213729 214370 241877 226740 227124 265893 262380 230922 259541 282265 283819 251611 210062 207242
13157B07242K8416M1334j1280K1773R48M9058P626O0315L3607K6691J8438J4059
$$ 207242 235658 276992 265712 287485 288433 337491 345117 405432 439039 465730 484168 498227
13145D98227R07J0573l4105r08N522l4104l9660n0209j4791k8125m931o0710j7869
$$ 498227 499134 509707 475602 474694 480216 446112 406452 356243 341452 313327 308396 247686 229817
13132B29817K4053m3275j9112j5022J6614r778l5371L3331J4674L021k9111P435
$$ 229817 253870 210595 191483 176461 193075 183297 147926 181257 195931 198952 169841 177276
13120A77276N2057j6171n0025n1706k0214L7386K9022k9030j6119J7197L2329
$$ 177276 229333 213162 163137 111431 91217 128603 157625 128595 112476 129673 162002
13109A62002L1918k2213k9242k1290j8631j136m369j1177L34n1775m350k2909
$$ 162002 193920 171707 142465 121175 102544 101408 97039 85862 86196 34421 30071 7162
13097G162o9936k6160K7641P3114J3301m2279j3499R721J8792k790K522L4100
$$ 7162 -62774 -88934 -61293 11821 25122 -17157 -30656 -20935 -2143 -4933 -2411 31689
13085C1689M549Q973o889j0773j5452l3882L4682L7948Q2174K7492m7574K9756
$$ 31689 36238 45211 38322 27549 12097 -21785 12897 50845 133019 160511 112937 142693
13073A42693M9442J2498l5055J4435J8140J0228m7209o2574j8644J1324Q9039
$$ 142693 192135 204633 169578 184013 202153 212381 165172 102598 83954 95278 184317
13062A84317J06669Q8107K6678l1788p924m8432L659J2678n855r334k0286k0000
$$ 184317 290986 379093 405771 373983 366059 317627 321286 333964 328109 318775 298489 278489
13050B78489Q809O2103K5716j1834J4688J6631n404l0730K1183l510q850m8029
$$ 278489 287298 349401 375117 363283 377971 394602 389198 358468 379651 376141 367291 319262
13038C19262L8623q526o5771J4369M3439M107L2423M7611n9492j0234K612K712
$$ 319262 357885 349359 283588 297957 341396 345503 377926 425537 366045 355811 358423 361135
13026C61135K1541K7532j4454M2212l0727p360N270m190j8445j1951m449L4412
$$ 361135 382676 410208 395754 437966 407239 399879 405149 400959 382514 370563 366114 400526
13014D00526j0443n1168P483L2644M7800K2259p9717R873K5990n0878O853M3243
$$ 400526 390083 338915 346398 379042 426842 449101 369384 379257 405247 354369 361222 404465
13002D04465M5978K9812J125l9125j7960K4726Q069Q387L1282K2893O327K1752
$$ 404465 450443 480255 481380 442255 424295 449021 457090 465477 496759 519652 525979 547731
12990E47731j8382J6917j331k5266k58o6206M2648P8631J7089m5219k1982M2956
$$ 547731 529349 546266 544935 519669 519411 453205 495853 574484 591573 546354 524372 567328
12978E67328O4564N2261P042J110k7208N420O5327M1767M2215l411K4448P9566
$$ 567328 631892 684153 691195 692305 665097 670517 735844 777611 819826 816415 840863 920429
12966I20429N4401L0930j7926Q106N042K9251J32543L9685m8790j0148N6410M9630
$$ 920429 974830 1005760 987834 995940 1000982 1030233 1162776 1202461 1153671 1143523 1199933 1249563
12954A249563k5750k872O3451P3333P231N4627K7161l628k1977L4245K1255M2772
$$ 1249563 1223813 1220941 1284392 1357725 1364956 1419583 1446744 1443116 1421139 1455384 1476639 1519411
12942A519411M6360K2598L0806P7115P9993L2440Q6325J31881J18339J14290P8348
$$ 1519411 1565771 1588369 1619175 1696290 1776283 1808723 1895048 2026929 2145268 2259558 2337906
12931B337906J22836R7673K09160K41428J25492P4041J85639K14995P9039L0342
$$ 2337906 2460742 2558415 2767575 3009003 3134495 3208536 3394175 3609170 3688209 3718551
12921C718551N5743N0122k1723r3908p2787j09446j02849j25829p4151r4478o4259
$$ 3718551 3774294 3824416 3802693 3708785 3635998 3526552 3423703 3297874 3223723 3129245 3064986
12910C064986j08720j71263j04009k3915j3432n4584o3429k0939M5527p106l3580
$$ 3064986 2956266 2785003 2680994 2657079 2643647 2589063 2525634 2504695 2550222 2543116 2509536
12899B509536k4177M094l33K433L2726M2313J0552M7758J3064j4559Q140q470
$$ 2509536 2485359 2489453 2489120 2491553 2524279 2566592 2577144 2624902 2637966 2623407 2631547 2623077
12887B623077Q0116J04437M2735N9540M7232N8992J33296Q8928M3037O6668N4508
$$ 2623077 2703193 2807630 2850365 2909905 2957137 3016129 3149425 3238353 3281390 3348058 3402566
12876C402566L5164N7288P9514J07392P5308O0528J43166Q4430J28853J60717
$$ 3402566 3437730 3495018 3574532 3681924 3757232 3817760 3960926 4045356 4174209 4334926
12866D334926J05396J69815J82487R7555J17947J24734J73822J44822J88446J95653
$$ 4334926 4440322 4610137 4792624 4890179 5008126 5132860 5306682 5451504 5639950 5835603
12856E835603K39335J40142J91844K42729K79750K74391K25678K10862K61718
$$ 5835603 6074938 6215080 6406924 6649653 6929403 7203794 7429472 7640334 7902052
12847G902052L06385K58572L14548L59271L61822L23206L08984M19771M52046
$$ 7902052 8208437 8467009 8781557 9140828 9502650 9825856 10134840 10554611 11006657
12838A1006657M46040M73806N47169N44104N31037N04804N73455O11365P34935
$$ 11006657 11452697 11926503 12473672 13017776 13548813 14053617 14627072 15238437 15973372
12829A5973372P39582P15263P97022Q44289R12347R48951R47249J054306J130043
$$ 15973372 16712954 17428217 18225239 19069528 19981875 20930826 21878075 22932381 24062424
12820B4062424J257023J282962J413880J527055J592649J707885J798784J978562
$$ 24062424 25319447 26602409 28016289 29543344 31135993 32843878 34642662 36621224
12812C6621224K113758K225380K377889K549803K837482L101041L250728L502224
$$ 36621224 38734982 40960362 43338251 45888054 48725536 51826577 55077305 58579529
12804E8579529L726010M026933M358554M679871M981104N345588N663391O080096
$$ 58579529 62305539 66332472 70691026 75370897 80352001 85697589 91360980 97441076
12796I7441076O493630O918874P324675P647559P950447Q220190Q408719Q510815
$$ 97441076 103934706 110853580 118178255 125825814 133776261 141996451 150405170 158915985
12788A58915985Q418735Q238090P816205P198694O431817N478023M270188K950647
$$ 158915985 167334720 175572810 183389015 190587709 197019526 202497549 206767737 209718384
12780B09718384J535848R5802j393151k780999m128898n348312o291395p095647
$$ 209718384 211254232 211350034 209956883 207175884 203046986 197698674 191407279 184311632
12772A84311632p687324q061380q269163q428218q292390q096333p876910p624586
$$ 184311632 176624308 168562928 160293765 151865547 143573157 135476824 127599914 119975328
12764A19975328p235007o865311o449966o098164n764218n416689n058763m717765
$$ 119975328 112740321 105875010 99425044 93326880 87562662 82145973 77087210 72369445
12756G2369445m393265m074559l788915l538131l280295l108406k869713k627355
$$ 72369445 67976180 63901621 60112706 56574575 53294280 50185874 47316161 44688806
12748D4688806k448007k252728k133174k050137j947117j738822j629155j513384
$$ 44688806 42240799 39988071 37854897 35804760 33857643 32118821 30489666 28976282
12740B8976282j376617j326913j293180j242260j111551r83999r86368q93021
$$ 28976282 27599665 26272752 24979572 23737312 22625761 21641762 20655394 19762373
12732A9762373p97620q52200q49721p42258o84527o98598o24464n88669n57292
$$ 19762373 18964753 18112553 17262832 16520574 15836047 15137449 14512985 13924316 13367024
12723A3367024n34926n55744m90359l87378m26694m33401m05952l39454k96605
$$ 13367024 12832098 12276354 11785995 11398617 10971923 10538522 10132570 9793116 9496511
12714I496511l42251l70645l43084l46895k49786k20443k99500k54653k27518
$$ 9496511 9154260 8783615 8440531 8093636 7843850 7623407 7323907 7069254 6841736
12705F841736k20604k58608j84145j98227j90165k23873j78536j45958j17160
$$ 6841736 6621132 6362524 6178379 5980152 5789987 5566114 5387578 5241620 5124460
12696E124460j11714j52545j68418j59621j51730j42276j01898j03854j29940
$$ 5124460 5012746 4860201 4691783 4532162 4380432 4238156 4136258 4032404 3902464
12687C902464o8983k2031r3928j35474j87418j10247r3831o0266q6323q2284r9169
$$ 3902464 3833481 3811450 3717522 3582048 3394630 3284383 3190552 3130286 3043963 2961679 2862510
12676B862510j03502m6631K078k3o8626p9933p3140n3622l7333o1772m6903l6155
$$ 2862510 2759008 2712377 2714455 2714432 2645806 2565873 2492733 2439111 2401778 2340006 2293103 2256948
12664B256948l6918j5829J105l1464q8899r2069k9376n7807m0636M8599n3393
$$ 2256948 2220030 2204201 2205306 2173842 2084943 1992874 1963498 1905691 1865055 1913654 1860261
12653A860261p9541m8731m1984o6900j1232L6989l0097n5563p3831j0255r744
$$ 1860261 1780720 1731989 1690005 1623105 1611873 1648862 1618765 1563202 1489371 1479116 1469372
12642A469372l447m6455n0498j3203J525q8298p9260O517K1309m9374m5825o1078
$$ 1469372 1465925 1419470 1368972 1355769 1357294 1268996 1189736 1196253 1217562 1168188 1122363 1061285
12630A061285k260J1045k0094J5136j2899j2850o9063p8413O815m9836K925M2150
$$ 1061285 1059025 1070070 1049976 1065112 1052213 1039363 970300 891887 898702 848866 851791 893941
12618H93941L9767K1978n897o6872n0429L252L7102k09m4522p5480k8536O071
$$ 893941 933708 955686 949789 882917 832488 835740 872842 872633 828111 752631 724095 730166
12606G30166N0221j9682p0529p492k1811m1722n7624M4947P7163l6238l0670k1915
$$ 730166 780387 760705 690176 682684 660873 619151 561527 606474 683637 647399 616729 594814
12594E94814R429J6837k6191M013J5569L6778N276m3417K3867R690j6505j8956
$$ 594814 604243 621080 594889 598902 614471 651249 656525 613108 636975 646665 630160 611204
12582F11204m6472J8100N6094M4599j656o7423m257k2740J6844j0939m1114o4414
$$ 611204 564732 582832 638926 683525 681869 614446 610189 587449 604293 593354 552240 487826
12570D87826m8595O164m920L1860J4642k376L400P415K9518q354n1979k2975n3639
$$ 487826 439231 445395 440475 472335 486977 484601 488001 495416 524934 516580 464601 441626 387987
12557C87987l9479M2426M2105J8911l7810M64k6447l794L7998O9344k315n3166
$$ 387987 348508 390934 433039 451950 414140 414604 388157 384363 422361 491705 489390 436224
12545D36224J2422K857j4110n622k2534L1948K7017j3438l690n9877k14o5080
$$ 436224 448646 451503 437393 431771 409237 441185 468202 454764 451074 391197 390983 325903
12533C25903n9599o5465R883L0655K0476J1063j6j8680K368N9261K4743p361O0900
$$ 325903 266304 200839 210722 241377 261853 272916 272900 254220 256588 315849 340592 333231 394131
12520C94131l4514n7339j0051l1908P472l7644J7679M0527P5279j1352K0602K378
$$ 394131 359617 302278 292227 260319 267791 230147 247826 288353 363632 352280 372882 375260
12508C75260l4541m2069k3175N1254p857k3240p125J5218K0962M1103j7819q1976
$$ 375260 340719 298650 275475 326729 318872 295632 288507 303725 324687 365790 347971 265995
12496B65995k4916J696R729J2089k3770L0936P7672L7738l0958K2396j8148J4785
$$ 265995 241079 242775 252504 264593 240823 271759 349431 387169 356211 378607 360459 375244
12484C75244J6456o362M068k8483L3017j0396k0160L5242J3118m111m1385K4550
$$ 375244 391700 385338 389406 360923 393940 383544 363384 398626 411744 407633 366248 390798
12472C90798M3061J0496q604m6433O755o4441L1193O5203l1322j02465N659L5304
$$ 390798 433859 444355 435751 389318 396073 331632 362825 428028 396706 294241 299900 335204
12460C35204M041j6603o1016n5576K470K1152M318j7172J9902J567o8030K1511
$$ 335204 339245 322642 261626 206050 208520 229672 233990 216818 236720 238287 170257 191768
12448A91768K6309J9435Q874J7168N689n5604n2682N519L460k4650n283L7361
$$ 191768 218077 237512 246386 263554 269243 213639 160957 166476 169936 145286 140003 177364
12436A77364J0456M273J818J4368K0694r648j0251m4101k9856J0434Q596j3610
$$ 177364 187820 192093 193911 208279 228973 219325 209074 164973 135117 145551 154147 140537
12424A40537N5276J2501J991J0784L0295M2137k1837n8825p498j6743j9620j5166
$$ 140537 195813 208314 210305 221089 251384 293521 271684 212859 205361 188618 168998 153832
12412A53832J354K3379J1814O668k5197l5150j6587L5866j639J1065L7697M283
$$ 153832 155186 178565 190379 197047 171850 136700 120113 155979 154340 165405 203102 207385
12400B07385n5498k2766p715P6103M7749J3024k2204j2398q707M292l4276l1563
$$ 207385 151887 129121 121406 197509 245258 258282 236078 223680 214973 219265 184989 153426
12388A53426K4088J5682P222J7389j8948j1580k9606j8531j4385K3036J5467N0544
$$ 153426 177514 193196 200418 217807 198859 187279 157673 139142 124757 147793 163260 213804
12376B13804K5554K3064q915m0085J1416j3526M0681K240j8243k9014L6779N6231
$$ 213804 239358 262422 253507 213422 224838 211312 251993 254233 235990 206976 243755 299986
12364B99986n3287l559j1524N0287N9030n667J0074K4752N4937O404j3365j1427
$$ 299986 246699 243140 231616 281903 340933 335266 345340 370092 425029 431433 418068 406641
12352D06641k4008J3393M7983J40899L9773n764l4816L7345L1821O4166L8461
$$ 406641 382633 396026 444009 584908 624681 618917 584101 621446 653267 717433 755894
12341G55894J1582M3023j2874K49N7251N4457j9402N7945N7755j09o4797R0976
$$ 755894 767476 810499 797625 797874 855125 909582 890180 948125 1005880 1005771 940974 1031950
12329A031950L8042J5395J9385K6132L8687L2118l1523k4480n0768k4191j748
$$ 1031950 1069992 1085387 1104772 1130904 1169591 1201709 1170186 1145706 1094938 1070747 1068999
12318A068999k9964r3613o2258j6561R266j2319m0684n9805l1025l4339l1067
$$ 1068999 1039035 945422 883164 866603 875869 863550 822866 763061 732036 697697 666630
12307F66630m9611o7643M930J9361k0243O177k6005l8888j1647q4023l2573l507
$$ 666630 617019 549376 554306 573667 553424 559601 533596 494708 483061 399038 366465 362958
12295C62958O358J4482J5495O946n7317n7189j4160M2855l7580J0918j016n5073
$$ 362958 369316 383798 399293 406239 348922 291733 277573 320428 282848 293766 292750 237677
12283B37677p4604L1844K0363o1731j0824J9181k682j2475k752L8015k5030l2499
$$ 237677 163073 194917 215280 153549 142725 161906 159224 146749 143997 182012 156982 124483
12271A24483K9755J2847l2137L6446N0288l2965l4418J5453R275K0118m2973l1386
$$ 124483 154238 167085 134948 171394 221682 188717 154299 169752 179027 199145 156172 124786
12259A24786k938K5395M7227r033m9134m657l984m1134m1659Q5822p245k9439
$$ 124786 121848 147243 194470 185437 136303 131646 127662 86528 44869 130691 123446 94007
12247I4007O928O2640R201l6475L4577J2584j5402J8414m512J8088J317k1494
$$ 94007 100935 163575 172776 136301 170878 183462 168060 186474 181962 200050 201367 179873
12235A79873J5302J4013l1561l228k602n5938k6702j248K2452L7664J7861M4058
$$ 179873 195175 209188 177627 174399 171797 115859 89157 87909 110361 148025 165886 209944
12223B09944k4435q0016j0183O2560O0806l7756p6343J9470j036j7903J5974M3103
$$ 209944 185509 105493 95310 157870 218676 180920 104577 124047 123011 105108 121082 164185
12211A64185J9698M079k8852j7028r797l8046R513L3731r060l0855n9881J027
$$ 164185 183883 187962 159110 142082 132285 94239 103752 137483 128423 97568 37687 38714
12199C8714M2280k5066K4328n247K4931j9841o046M302k0154j7272j8815N6733
$$ 38714 80994 55928 80256 75009 99940 80099 74053 78355 58201 40929 22114 78847
12187G8847N4992L3898N810m6546j6140j1203j059P917l9984k5202k7926O2476
$$ 78847 133839 167737 173547 127001 110861 99658 98599 106516 66532 41330 13404 75880
12175G5880J11908o66p5890l6718L533L3377L0959Q0557m10r9499l8442O2762
$$ 75880 187788 187122 111232 74514 78047 111424 142383 222940 222530 123031 84589 147351
12163A47351m8261j4531m1941N239J8965M3871L1041Q0551L5016n1200m7463L5445
$$ 147351 99090 84559 42618 47857 66822 110693 141734 222285 257301 206101 158638 194083
12151A94083P8977K0358j5380k8351j8464m5127O878L2725K1914p45K2527K3100
$$ 194083 273060 293418 278038 249687 231223 186096 192974 225699 247613 246868 269395 292495
12139B92495k0487k5509L4352j5328l8869r071K0030k3114J2614O2864N298K1886
$$ 292495 272008 246499 280851 265523 226654 217583 237613 214499 227113 289977 295275 317161
12127C17161P93O857K0996k6833M177R9356J39031L9157O913J4335M1701P8990
$$ 317161 317954 324811 345807 318974 323151 422507 561538 600695 607608 621943 663644 742634
12115G42634M7685K7420n6329m6939M7153L9373l5925r8610q239j6198k5172j3908
$$ 742634 790319 817739 761410 714471 761624 800997 765072 666462 658223 642025 616853 602945
12103F02945l9961j4011m4027o2301n6815m6360k9898O7041N9752N541r227j1066
$$ 602945 562984 548973 504946 442645 385830 339470 309572 376613 436365 441906 432679 421613
12091D21613m596O104n0625m3198l3282L0968P0654L6299j3098r662K7614n05
$$ 421613 417017 423121 372496 329298 296016 326984 397638 433937 420839 411177 438791 438286
12079D38286K9867K397J046M2622K2467J4463K0455K3256R0582K0606O2226M1511
$$ 438286 468153 470550 471596 514218 536685 551148 571603 594859 685441 706047 768273 809784
12067H09784Q1950L2857J09368R8820N7519J19419Q8587L6101K6895J4930q321
$$ 809784 891734 924591 1033959 1132779 1190298 1309717 1398304 1434405 1461300 1476230 1467909
12056A467909k5235J1777p8160p2324q0634r3201j25087o0880k7512k3141J9433
$$ 1467909 1442674 1454451 1376291 1303967 1223333 1130132 1005045 944165 916653 893512 912945
12045I12945n5007n4572Q0785p502K2406L0740m2151m1664r946l4865O0868j4363
$$ 912945 857938 803366 884151 876649 899055 929795 887644 845980 836034 801169 862037 847674
12033H47674m4395L9839K4347j776K7844J0873O5261R1291R4868J3404j1104j3949
$$ 847674 803279 843118 867465 865689 893533 904406 969667 1060958 1155826 1169230 1158126 1144177
12021A144177o187K1977K5092M8527J2766M8256J00163k3673R0236J10835O0035
$$ 1144177 1137990 1159967 1185059 1233586 1246352 1294608 1394771 1371098 1461334 1572169 1632204
12010A632204Q3350J28624J25754J22278R8968J26170J17815J04893J47572J81406
$$ 1632204 1715554 1844178 1969932 2092210 2191178 2317348 2435163 2540056 2687628 2869034
12000B869034K34497L01960K88335L05739K40659J89552J42181J93965L00739
$$ 2869034 3103531 3405491 3693826 3999565 4240224 4429776 4571957 4765922 5066661
11991E066661L80623N60100O68622P98936R47637J067286J259894J644636K099750
$$ 5066661 5447284 6007384 6676006 7474942 8422579 9489865 10749759 12394395 14494145
11982A4494145K650342L254172M188238N405491O895485Q710034J0728222J2489820
$$ 14494145 17144487 20398659 24586897 29992388 36887873 45597907 56326129 68815949
11974F8815949J3228024J1672305P270659P99373o090573j1116892j3142251j2702869
$$ 68815949 82043973 93716278 100986937 101786310 95695737 84578845 71436594 58733725
11966E8733725j1001257q960545o956097n406458m235208l302055k685794k186388
$$ 58733725 47732468 38771923 31815826 26409368 22174160 18872105 16186311 13999923
11958A3999923j762956j443741j187588r34798p56212o40518n80333o23774o72056
$$ 13999923 12236967 10793226 9605638 8670840 7914628 7274110 6693777 6070003 5397947
11949E397947n67741m24431l96854l55485l30693k96639k68480j88653j79796
$$ 5397947 4830206 4405775 4008921 3653436 3322743 3026104 2757624 2568971 2389175
11940B389175j34754j72498j22154p6953q5377j31744j07141p0652J766l8183
$$ 2389175 2254421 2081923 1959769 1882816 1797439 1665695 1558554 1487902 1489668 1451485
11930A451485n0677R56m7277l9534m2147o3528k2305l6525n3140K0940k5653o7323
$$ 1451485 1400808 1401764 1354487 1314953 1272806 1209278 1186973 1150448 1097308 1118248 1092595 1025272
11918A025272l5004o488j6146k7075j2112N6237J5207q953r718K1378q142k4753
$$ 1025272 990268 983780 967634 940559 928447 984684 999891 990938 981220 1002598 994456 969703
11906I69703p1490q7369m9121l2885l9822k2745L0825j3489L0652K0523r74m1055
$$ 969703 898213 810844 761723 728838 689016 666271 697096 683607 714259 734782 733808 692753
11894F92753q1078o4780l8981l9256n430K1878j8839q656m7623k70m5691M592
$$ 692753 611675 546895 507914 468658 463228 485106 466267 457611 409988 409718 364027 368619
11882C68619N1372J1181K2978o114J8497k5552k0640r454k101J6824R53K192Q836
$$ 368619 419991 431172 454150 448036 466533 440981 420341 410887 408786 425610 426563 428755 437591
11869D37591N3628l7332K8348L2723k3638j4096l031j6351J1522L0373l1551j3354
$$ 437591 491219 453887 482235 514958 491320 477224 474193 457842 469364 499737 468186 454832
11857D54832p172R772K1623L0328J8107j206K401k4928m2327q2334K0087K2332
$$ 454832 447660 457432 479055 509383 527490 526284 528685 503757 461430 379096 399183 421515
11845D21515j1284J9547N080j0373K848J2053k0295K5013P1714r108l3437j1040
$$ 421515 410231 429778 434858 424485 427333 439386 419091 444104 515818 506710 473273 462233
11833D62233J6506L7251j720k247J1315j4062J9408L2944J1358R177K2237O2531
$$ 462233 478739 515990 514270 512023 523338 509276 528684 561628 572986 582163 604400 666931
11821F66931k0528J152L3776J1749N332L8821J6672k0529O270q085j8635J8254
$$ 666931 646403 647555 681331 693080 698412 737233 753905 733376 739646 731561 712926 731180
11809G31180J0331J9319j6131l8318j2159M1592R5891j3305N0311O8711k1124
$$ 731180 741511 760830 744699 706381 694222 735814 831705 818400 868711 937422 916298
11798I16298L8203J09563K0788N859K3165R0081L5581P054M6041l7333k3276j6244
$$ 916298 954501 1064064 1084852 1090711 1113876 1203957 1239538 1246592 1292633 1255300 1232024 1215780
11786A215780l4141o5413j4249J3070n1733k8842K8380N2499K9018P130k0706
$$ 1215780 1181639 1116226 1101977 1115047 1063314 1034472 1062852 1115351 1144369 1151499 1130793
11775A130793K9749k7648m1596L0474N486n511L6227J3817J7803p0436L0773R6527
$$ 1130793 1160542 1132894 1091298 1121772 1127258 1121747 1157974 1171791 1189594 1119158 1149931 1246458
11763A246458P8270R951N024K1606N1269l1245k4154J4732J8125J07217N8404
$$ 1246458 1324728 1334679 1339703 1361309 1412578 1381333 1357179 1371911 1390036 1497253 1555657
11752A555657O2781N5880L4723P6816N2476P4925Q2944R5305L7253L5041Q2221
$$ 1555657 1618438 1674318 1709041 1785857 1838333 1913258 1996202 2091507 2128760 2163801 2246022
11741B246022L5726J33989J16395R2651O8272M1417M8330J03638J33150J57551
$$ 2246022 2281748 2415737 2532132 2624783 2693055 2734472 2782802 2886440 3019590 3177141
11731C177141J43997R1950J65575K09796K07438J94834K21829L02675L09620K89010
$$ 3177141 3321138 3413088 3578663 3788459 3995897 4190731 4412560 4715235 5024855 5313865
11721E313865L00379K87366L55338L83705M01086M74490N22935O59271P79449
$$ 5313865 5614244 5901610 6256948 6640653 7041739 7516229 8039164 8698435 9477884
11712I477884Q80199J032654J222837J505734J809588K260007K858485L489382
$$ 9477884 10358083 11390737 12613574 14119308 15928896 18188903 21047388 24536770
11704B4536770M400666N536060O738917P845381Q739234R274759R389605R074911
$$ 24536770 28937436 34473496 41212413 49057794 57797028 67071787 76461392 85536303
11696H5536303Q496283P639992O593365N114304L403164J443528p12209k851794
$$ 85536303 94032586 101672578 108265943 113380247 116783411 118226939 117514730 114662936
11688A14662936m568214n871669p070004q014669q721672r014061r047011q646528
$$ 114662936 110094722 104223053 97153049 89138380 80416708 71402647 62355636 53709108
11680E3709108p829760o575223n313632m280473l357282k659261k070090j621584
$$ 53709108 45879348 39304125 33990493 29710020 26352738 23693477 21623387 20001803
11672B0001803j271988j037006q48652n89336l75132k24271n8725M9296J87909
$$ 20001803 18729815 17692809 16844157 16254821 15879689 15655418 15596693 15645989 15833898
11663A5833898K21265K75476L62248N45232P81976J008733J265423J568168J953292
$$ 15833898 16055163 16330639 16692887 17238119 18020095 19028828 20294251 21862419 23815711
11654B3815711K368450K876503L754614M810133O203225P994257J0039651J2247383
$$ 23815711 26184161 29060664 32815278 37625411 43828636 51822893 61862544 74109927
11646G4109927J4308807J6204619J7632174J8325007J8110757J7097198J5439745
$$ 74109927 88418734 104623353 122255527 140580534 158691291 175788489 191228234
11639A91228234J3244736J0355753O761058K931580j117287n225034r141762j2421172
$$ 191228234 204472970 214828723 221589781 224521361 223404074 218179040 209037278 196616106
11631A96616106j4838729j6535860j7651724j8107123j7820811j6845444j5308118
$$ 196616106 181777377 165241517 147589793 129482670 111661859 94816415 79508297
11624G9508297j3289391j0928231q624848o710033n283335m152288l299397k648867
$$ 79508297 66218906 55290675 46665827 39955794 34672459 30520171 27220774 24571907
11616B4571907k139816j751339j503330j278614j013188p73188o08748n20699
$$ 24571907 22432091 20680752 19177422 17898808 16885620 16112432 15503684 14982985
11608A4982985m65928l15395j15646K783J71486K61853M27238P01896R18785J141311
$$ 14982985 14517057 14201662 14086016 14088799 14260285 14522138 14949376 15651272 16570057 17711368
11598A7711368J383594J745770K148044K663752L430263M312256N212113O249785
$$ 17711368 19094962 20840732 22988776 25652528 29082791 33395047 38607160 44856945
11590D4856945P214621P859781Q121842Q038002P624758O899597N972740M863267
$$ 44856945 52071566 59931347 68053189 76091191 83715949 90615546 96588286 101451553
11582A01451553L413416J704597j68981k119549l824868n379603o588594p422945
$$ 101451553 104864969 106569566 106400585 104281036 100456168 95076565 88487971 81065026
11574H1065026p977462q364491q505663q212095p575221o643929n492669m405644
$$ 81065026 73087564 64723073 56217410 48005315 40430094 33786165 28293496 23887852
11566B3887852l530312k883089k275196j858633j569514j295963j048448q92985
$$ 23887852 20357540 17474451 15199255 13340622 11771108 10475145 9426697 8533712
11558H533712p66238o59011n69713n19992m69717m35910l75886l94061l07924
$$ 8533712 7767474 7108463 6538750 6018758 5549041 5113131 4737245 4343184 4035260
11549D035260k69252k20069k76169k13402j53935j75347k28047j20860o5543q5412
$$ 4035260 3766008 3545939 3269770 3056368 2902433 2727086 2499039 2378179 2312636 2227224
11539B227224j00296o9487q9052l1267o176q3552p8508l2642m3178n2113n0295
$$ 2227224 2126928 2057441 1968389 1937122 1930946 1847394 1768886 1736244 1693066 1640953 1590658
11528A590658k8655n1034l8374o1414n2664n8351q3979j192m2434n7221K6979
$$ 1590658 1562003 1510969 1472595 1411181 1358517 1300166 1216187 1214995 1172561 1115340 1142319
11517A142319n012L241r907n4478o3484l1460k5716N523o593l2019k8573R001
$$ 1142319 1137307 1140548 1130641 1076163 1012679 981219 955503 961026 954433 922414 893841 902842
11505I02842K4756J2684k1908m6549J5910j3448n8388l9497N919j9139n2824K7074
$$ 902842 927598 940282 918374 871825 887735 874287 815899 776402 782321 763182 710358 737432
11493G37432N251n3641k801N2164o76n305J5204M3778m5866j5287J9479O1386
$$ 737432 742683 689042 686241 738405 737729 732424 747628 791406 745540 730253 749732 811118
11481H11118K7191n8638l0015j5962o5941q0888m360l474n3867k3855j5277j9746
$$ 811118 838309 779671 749656 733694 667753 586865 582505 579031 525164 501309 486032 466286
11469D66286L501j9311n7488M6628K4380o4296l5529n9622r880O5448J6806k724
$$ 466286 469787 450476 392988 439616 463996 399700 364171 304549 294669 360117 376923 374199
11457C74199R055Q316j7927l7577L7902J9718k038K4894p354j2183K1256k4452
$$ 374199 383254 391570 373643 336066 373968 393686 391648 416542 409188 397005 418261 393809
11445C93809n5171l3672j0514L6036L4724M176L317j6291m9942j9491J96N6910
$$ 393809 338638 304966 294452 330488 365212 369388 372705 356414 306472 286981 287177 344087
11433C44087M4372L4614l4456k8206k2122M989k2375K6503k9359o7972K3089L1424
$$ 344087 388459 423073 388617 360411 338289 343278 320903 347406 318047 250075 273164 304588
11421C04588l1957j0160n410j1124l4272o4633k2094N1874K2021M0905k1712n4683
$$ 304588 272631 262471 257061 245937 211665 147032 124938 176812 198833 239738 218026 163343
11409A63343l1281N5297l2791l274j9556J976K5421L0330N1765J210J6174j5003
$$ 163343 132062 187359 154568 151294 131738 133714 159135 189465 241230 242440 258614 243611
11397B43611l6030L5312M6529N966m3979o963m834j9549J4341N3909P6174N2868
$$ 243611 207581 242893 289422 295388 251409 244446 239612 220063 234404 288313 364487 417355
11385D17355L7139k2038k7142m1579p8220R465L9839J9496l6445o8618j4245M669
$$ 417355 454494 432456 405314 363735 285515 294980 334819 354315 317870 249252 235007 239676
11373B39676l115q118l3595K1279M7584N895n6774k0515M1837J8826q614O465
$$ 239676 236561 228443 194848 216127 263711 269606 212832 192317 234154 252980 244366 250831
11361B50831k6147m2386o8158k2601K0768J431k9026k2224N6793M5223j8634k2461
$$ 250831 224684 182298 114140 91539 112307 113738 84712 62488 119281 164504 145870 123409
11349A23409L7580O4266J4254m5487r8j3360m4446K6244J0164j074J3750K3529
$$ 123409 160989 225255 239509 194022 193924 180564 136118 162362 172526 171452 185202 208731
11337B08731O69O4499N4866K6933j9718Q004O341k9986J3533M1340k0964k9221
$$ 208731 209400 273899 328765 355698 335980 343984 350325 320339 333872 375212 354248 325027
11325C25027m135o4418n2284j5277M1054j2960l8541o0752l9492M6221P3146m9281
$$ 325027 320892 256474 204190 188913 229967 217007 178466 117714 78222 124443 197589 148308
11313A48308n0029n1P3781O1534k7325m3406j4181n2706k7408K6736N2020n394
$$ 148308 98279 98228 172009 233543 206218 162812 148631 95925 68517 95253 147273 141879
11301A41879J6703K2257k1333o5321n8658J942k6590M2762M9785R057L1595j1266
$$ 141879 158582 180839 159506 94185 35527 37469 10879 53641 103426 112483 144078 132812
11289A32812k9790J5044N9639O827l2873j0317L4957Q153l962M8952O0846O8725
$$ 132812 103022 118066 177705 184532 151659 141342 176299 184452 180490 229442 290288 359013
11277C59013J5974K4052N1918M468k1880Q310M5183L032Q109M5306N8537K5846
$$ 359013 374987 399039 450957 455425 433545 441855 487038 490070 498179 543485 602022 627868
11265F27868o19J5029n068J3191k2636o3794k1341m4832o6860k1235l3848j8795
$$ 627868 627249 642278 637210 650401 627765 563971 542630 497798 430938 409703 375855 357060
11253C57060k5279k2567l4181o6754k192r646j8522n4244j6701J882N3533j54
$$ 357060 331781 309214 275033 208279 206087 196441 177919 123675 106974 108856 162389 162235
11241A62235j5882J8166J064j2109m3564o8270r567M8903N2601J1858l386L8619
$$ 162235 146353 164519 165583 153474 109910 41640 32073 80976 133577 145435 142049 180668
11229A80668o668K0156j5396L6015P267M441P1620L8508M06K1787O1701Q0888
$$ 180668 174000 194156 178760 214775 222042 226483 298103 336611 337017 358804 420505 501393
11217E01393J44406O6723N8007M6240J25025J13926P8690N3038o5824l615R601
$$ 501393 645799 712522 770529 816769 941794 1055720 1134410 1187448 1121624 1118009 1127610
11206A127610l4677k4930n8508j5757q0979j54481o5683m1251p6100k5165l8005
$$ 1127610 1092933 1068003 1009495 993738 912759 758278 692595 651344 575244 550079 512074
11195E12074j11811p1334j7580r4559n4430j7160j5634k4256p579Q241k7916M404
$$ 512074 400263 328929 311349 216790 162360 145200 129566 105310 97731 105972 78056 82460
11183H2460l0712l6518K5973M8914K8561K5028N396P118J6945j4178k5053N3927
$$ 82460 51748 15230 41203 90117 118678 143706 149102 156220 173165 158987 133934 187861
11171A87861M594K8796l4109J8414j2207M725J4578N426k5370K38P4303Q3485
$$ 187861 192455 221251 187142 205556 193349 198074 212652 218078 192708 192946 267249 350734
11159C50734L7822L2803P0336K5745K7749Q2730j7879p133n179p8395o2338Kk4711
$$ 350734 388556 421359 491695 517440 545189 627919 610040 602907 597728 519333 456995 456997 432286
11146D32286r6452p249o1n2409n504j596j8811n7748p3902j4395J7310J9042j2625
$$ 432286 335834 328585 328524 276115 270611 269015 250204 192456 118554 104159 121469 140511 127886
11133A27886l4594M5519j845k6590Q580o04N683k7050k1329K6470k7767j8736
$$ 127886 93292 138811 136966 110376 118956 118352 124035 96985 75656 102126 74359 55623
11121E5623L5771k0325k7888J1026M5658j1318n3751M619L7416J4575j228m2248
$$ 55623 91394 71069 43181 54207 99865 88547 34796 39415 76831 91406 90178 47930
11109D7930l806J0119M7892j9622n4817j1302L9923q864l799K4564L8172N117
$$ 47930 44124 54243 102135 82513 27696 16394 56317 47453 43654 68218 106390 111507
11097A11507K5024m6851p9247n301M5784N6800r717l8485j491R772o3057q462
$$ 111507 136531 89680 10433 5132 50916 107716 97999 59514 58023 67795 4738 -3724
11085c724J7404L6863n653j558j4267k9397j0347K3754P2822k0171o3576j6539
$$ -3724 13680 50543 44890 43332 29065 -332 -10679 13075 85897 65726 2150 -14389
11073a4389J5303m2302L8630K6647j425l6278K2995J2568Q201L910J0717j0906
$$ -14389 914 -41388 -2758 23889 22464 -13814 9181 21749 29950 33860 44577 33671
11061C3671k672l5309p683l4338J7630N214M7144O8290K7245K0755j5258j3183
$$ 33671 30999 -4310 -11993 -46331 -28701 -23487 23657 91947 119192 139947 124689 111506
11049A11506l155l791O110N1002n014M911N1054n936n837o4426l1821L5909M6548
$$ 111506 108351 104560 110670 161672 156658 161569 212623 206687 200850 136424 104603 140512 187060
11036A87060k42J920Q5503M1318K4272j5037P9325J760n4294p7272k4644O5948
$$ 187060 186818 188738 274241 315559 339831 324794 404119 405879 351585 274313 249669 315617
11024C15617N2256l413L9852J7316k837P686m8900m0589n91o7330o1007L160L1045
$$ 315617 367873 364460 404312 421628 418791 426477 377577 336988 336397 269067 208060 211220 242265
11011B42265K8060J3374K3559K9441m017p3934p0088j8408r978j65M0860N8407
$$ 242265 270325 283699 307258 336699 332682 258748 188660 170252 160274 160109 200969 259376
10999B59376J1574J6941K3259n2119j31357l6296j8245o8574K0520L3935K3419
$$ 259376 270950 287891 311150 259031 127674 91378 73133 4559 25079 59014 82433
10988H2433k257j1853o3126o9036N1556L1939j9232l6630j3868M7629J1989P073
$$ 82433 80176 68323 5197 -63839 -12283 19656 424 -36206 -50074 -2445 9544 16617
10976A6617N5211N20l3503o8516K7043O6273p770L7194j0495o7451j6835M9926
$$ 16617 71828 72348 38845 -29671 -2628 63645 55875 93069 82574 15123 -1712 48214
10964D8214l183k5407J5169K3059m2929m6986k2700K0203N2713K2818j6215K9406
$$ 48214 45031 19624 34793 57852 14923 -32063 -54763 -34560 18153 40971 24756 54162
10952E4162q744J7655Q3692M1600m829m7793m7276p3615l9153j4511j3815M5843
$$ 54162 45418 63073 146765 188365 183536 135743 88467 14852 -24301 -38812 -52627 -6784
10940f784L3368k655j7341K4547k2825k4451L8724N372q3503n3746K89J6125M7719
$$ -6784 26584 23929 6588 31135 8310 -16141 22583 27955 -55548 -109294 -109005 -92880 -45161
10927d5161m643K0636K6325N1460k2667k1319N047J4146j1484n796N625L8908
$$ -45161 -49804 -29168 -2843 48617 25950 4631 9678 23824 12340 6544 12169 51077
10915E1077k5682k5514q1047k6185k2078j3448O5644N9759M9363j4763l1085k4718
$$ 51077 25395 -119 -81166 -107351 -129429 -142877 -77233 -17474 31889 17126 -13959 -38677
10903c8677K4640J6992n4187o4431J0115M8559J3443j3778l2264m0642L8284N8558
$$ -38677 -14037 2955 -51232 -115663 -105548 -56989 -43546 -57324 -89588 -130230 -91946 -33388
10891c3388L6188O965j542l60j4848K3010K3140k3543j05338m7037N8194K1732
$$ -33388 2800 9765 8223 7863 -6985 16025 39165 15622 -89716 -136753 -78559 -56827
10879e6827K559N6990M9881N0843P357R754m6815m6052l6048O2893K0660l9551
$$ -56827 -54268 2722 52603 103446 110803 120557 73742 27690 -8358 54535 75195 35644
10867C5644J5601N4779j1038l4940m5879K4184P7968j6576l4518q0116M960O972
$$ 35644 51245 106024 94986 60046 14167 38351 116319 99743 65225 -14891 -9931 -2959
10855b959O215L2397N4362O3307M8761k3261m2106m1638k9415j3176n671K7116
$$ -2959 3256 35653 90015 153322 202083 178822 136716 95078 65663 52487 46816 73932
10843G3932l873K8164K0119Q8958K0047n9595p2184n7858k6077L1051P509k2976
$$ 73932 70059 98223 118342 207300 227347 167752 95568 37710 11633 42684 50193 27217
10831B7217K8479m7586K588j4652j279j1530L0092o701j9155O6520R878m525k307
$$ 27217 55696 8110 10698 -3954 -5233 -16763 13329 6628 -12527 53993 63871 59346 57039
10818E7039o114J6358o525l916k3674L504K2705J5134k4729j7731l6750k0740
$$ 57039 50925 67283 60758 56842 33168 36672 59377 74511 49782 32051 -4699 -25439
10806b5439P447m5667j4047P3999L2670M2161k2432m2461l5005J1520K3432J7228
$$ -25439 -17992 -63659 -77706 -3707 28963 71124 48692 6231 -28774 -17254 6178 23406
10794B3406Q01k3594J3384j9115R458P2852K2106l0648j8458K8399k5913J1018
$$ 23406 24207 613 13997 -5118 4340 77192 99298 68650 50192 78591 52678 63696
10782F3696k3204j5243M1358K5271K8563J0177J0804k5155k1680o031l2410K3868
$$ 63696 40492 25249 66607 91878 120441 130618 141422 116267 94587 88556 56146 80014
10770H0014L115O622p579k8440l4958O081L1469N9965J4865L0637l2025l8076
$$ 80014 83129 89751 82172 53732 18774 24855 56324 116289 131154 161791 129766 91690
10758I1690k2515n4608r216j8987j8411L6228K5395O107l895k3235n2163m9655
$$ 91690 69175 14567 5351 -13636 -32047 4181 29576 35683 31788 8553 -43610 -93265
10746i3265J10O4046R206K8833J0881Q279j9213O9856L0005l5165r271M8855K3524
$$ -93265 -93155 -29109 -19903 8930 19811 28090 8877 78733 108738 73573 64302 113157 136681
10733A36681L7060k1948l5268N4372K7598r060l6571k2361J5501K7933J2909j5001
$$ 136681 173741 151793 116525 170897 198495 189435 152864 130503 146004 173937 186846 171845
10721A71845m1081L5717l9863k5256j5462J2906j655K488J0234Q469l220k2086
$$ 171845 130764 166481 126618 101362 85900 98806 97151 99639 109873 118342 115122 93036
10709I3036r648L0502O1976K0862N510l4746P397K4723l3785m3073j3289K2290
$$ 93036 83388 113890 175866 196728 202238 167492 174889 199612 165827 122754 109465 131755
10697A31755R112N0786k9801n3455k0421P772L4542q633k273J8343p155M722j5408
$$ 131755 140867 191653 161852 108397 87976 95748 130290 121657 119384 137727 130572 135294 119886
10684A19886R697P6632M4234N635j4057j3016J6641n806J4282k5199o721m3586
$$ 119886 129583 206215 250449 256084 242027 229011 245652 239846 254128 228929 222208 178622
10672A78622l6705L7839o488n4531Q420N7927l1688k5450O675p848J4632N3923
$$ 178622 141917 179756 173268 118737 127157 185084 153396 127946 134621 126773 141405 195328
10660A95328J712k4662L9312P0207M8157J2410j4521m1513L1693J7583k0529k6880
$$ 195328 197040 172378 211690 281897 330054 342464 327943 286430 318123 335706 315177 288297
10648B88297J1298L8101j4917L9113O6895j2774K2226Q7345P4623M4133k1734
$$ 288297 299595 337696 322779 361892 428787 416013 438239 525584 600207 644340 622606
10637F22606P878J25740J13643Q4463J33387J12907J15144J35821O9730N7562
$$ 622606 630484 756224 869867 954330 1087717 1200624 1315768 1451589 1521319 1578881
10627A578881J95040K27067L00116M50942N63141P52489J036076J396102J900619
$$ 1578881 1773921 2000988 2301104 2752046 3315187 4067676 5103752 6499854 8400473
10618H400473K530524L203052L602659L410235K396843R43010m41095j187295
$$ 8400473 10930997 14134049 17736708 21146943 23543786 24486796 24045701 22858406
10610B2858406r52701q8119J179129K757222M535190O238456P183426O535699
$$ 22858406 21905705 21817586 22996715 25753937 30289127 36527583 43711009 50246708
10602E0246708L733646k53403l618306m793257l964294j908115N52978L121978
$$ 50246708 53980354 53726951 50108645 45315388 41351094 39442979 39995957 43117935
10594D3117935N755106Q056579R054391P274910K538098l392503p939487r332007
$$ 43117935 48873041 56929620 65984011 73258921 75797019 72404516 64465029 55133022
10586E5133022p889688n168634k383319J85541K473122M134850M547005L039668
$$ 55133022 47243334 42074700 39691381 39876922 42350044 46484894 51031899 54071567
10578E4071567k82459m213211o858541p370964o065080m137771k303257q26193
$$ 54071567 53789108 49575897 42717356 35346392 29281312 25143541 22840284 22014091
10570B2014091K26042R69476J041483L04726j115689k602122l477413l657988
$$ 22014091 22240133 23209609 24251092 24555818 23440129 20838007 17360594 13702606
10562A3702606l150747k400385j795933j251370r57648p17946n34497m24304k97436
$$ 13702606 10551859 8151474 6355541 5104171 4146523 3428577 2894080 2469776 2172340
10553B172340k29821k05061k37136j59590j21701j13625r0532j60313j00918p8492
$$ 2172340 1942519 1737458 1500322 1340732 1219031 1105406 1014874 854561 753643 675151
10543F75151J3831k8919n7100j5835p28j6966l5174J9686J402m1581p0041r89
$$ 675151 688982 660063 602963 587128 586400 569434 534260 553946 555348 513767 443726 442737
10531D42737M2181o295N937o844n5814k6123K8587N93L1492M9129p036N415J5920
$$ 442737 484918 478623 484560 477716 421902 395779 424366 424959 456451 505580 498544 503959 519879
10518E19879K5081M415J1490K0632R2243M1978K5013N1145M5748J20171R5163
$$ 519879 544960 549375 560865 581497 673740 715718 740731 791876 837624 957795 1052958
10507A052958J34309J60013J79920K02404K22231J77232K40800K77181L21150
$$ 1052958 1187267 1347280 1527200 1729604 1951835 2129067 2369867 2647048 2968198
10498B968198L40673L51930L62564K89383J82836P5245r4178j41705k66325l42530
$$ 2968198 3308871 3660801 4023365 4312748 4495584 4570829 4476651 4334946 4068621 3726091
10488C726091l12913k73976l33546l51570l42739l01575j98649j92871j53879
$$ 3726091 3413178 3139202 2805656 2454086 2111347 1809772 1611123 1418252 1264373
10479A264373r4255j20003j39563j01708o0130k3035n1488o9048k0866J920k4979
$$ 1264373 1170118 1050115 910552 808844 748714 725679 674191 605143 584277 586197 561218
10468E61218m3310o8567n7306p8559j0193K7067j7446P384J2478j1536j990k5419
$$ 561218 517908 449341 392035 313476 303283 330350 312904 320288 332766 321230 319240 293821
10456B93821p4156l5680P7792j2302l4788L09K0455k0578n2111q369L1259J7051
$$ 293821 219665 183985 261777 249475 214687 214996 235451 214873 162762 154393 185652 202703
10444B02703n9605l1549n4460m7048J8130M0956L3486M1574m518J7712j7660j2749
$$ 202703 143098 111549 57089 10041 28171 69127 102613 144187 139669 157381 139721 126972
10432A26972K2337J5881k8318m1830K5194k9987o4458l4113L2166J2019L4521
$$ 126972 149309 165190 136872 95042 120236 90249 25791 -8322 23844 35863 70384
10421G0384J8889n3221K315k7994n154L3143K5066J6028J8476p984K1204k0291
$$ 70384 89273 36052 38367 10373 5219 38362 63428 79456 97932 89948 111152 90861
10409I0861l6793k1393K5145J671n1989m6431j9435j48l9872M5718O657L4307
$$ 90861 54068 32675 57820 59491 7502 -38929 -58364 -58512 -98384 -52666 -46009 -11702
10397a1702P1707k5541l0778K0724l2675n9272P4412L6149l3908j5052K5382n6678
$$ -11702 60005 34464 3686 24410 -8265 -67537 6875 43024 9116 -5936 19446 -37232
10385c7232J0448Q191l9743j7804N4178O1236o6843r280K3487N7018R711l41r183
$$ -37232 -26784 -18593 -58336 -76140 -21962 39274 -27569 -36849 -13362 43656 53367 53026 43843
10372D3843L1757m921j3703j9798l6261k961J672m3056M307P711L2529m632L7176
$$ 43843 75600 70679 56976 37178 917 -2044 -372 -43428 -39121 -31410 1119 -3513 33663
10359C3663J2967M5015p696n8466R627l8726l3194K1264P1927k535n3027n524
$$ 33663 46630 91645 83949 25483 35110 -3616 -36810 -15546 56381 53846 819 -4705
10347d705p776L553K2478k7128M752K8508k4785m8664J2929J0349l8234l5223
$$ -4705 -12481 -8928 13550 -13578 -8826 19682 -5103 -53767 -40838 -30489 -68723 -103946
10335a03946k091J9936L1174L9086j5500l3053m6753K1053L7765L4439m6896M807
$$ -103946 -106037 -86101 -54927 -15841 -31341 -64394 -111147 -90094 -52329 -17890 -64786 -59979
10323e9979J3012N9258M0652J5621j7734J3981O461k6288J0962L016k1310J586
$$ -59979 -46967 12291 52943 68564 50830 64811 71272 44984 55946 58962 37652 39238
10311C9238n9072m8354J7383M810M3411N8036J4636k5587l3065J5K298m4202K794
$$ 39238 -19834 -68188 -50805 -45995 -2584 55452 70088 44501 11436 11451 13749 -30453 -27659
10298b7659L2174M1587J3560J8739O6272n0334m1110q282M013j7L7271j4962Q412
$$ -27659 4515 46102 59662 78401 144673 94339 53229 44947 48960 48943 86214 71252 79664
10285G9664k9037K052M3846L428m3154m4095L8178j0604k8917m5M8621j7269j9031
$$ 79664 50627 52679 96525 99953 56799 12704 50882 40278 11361 11316 59937 42668 23637
10272B3637K5048l362J1991l6565k9666j5998L9112N8676j147j0519o3279l0193
$$ 23637 48685 45323 57314 20749 -8917 -24915 14197 72873 71726 61207 -2072 -32265
10260c2265j6355j2958j370J3675n182n5093j3736k2658J0066K3299r925j086
$$ -32265 -48620 -61578 -62948 -49273 -54455 -109548 -123284 -145942 -135876 -112577 -122502 -123588
10248a23588J8117J1721R386m3430j4374P1219J23115M4564k6064J8316m739m0959
$$ -123588 -105471 -93750 -84364 -127794 -142168 -70949 52166 96730 70666 88982 84243 43284
10236D3284j9922m7612o5231M454j4122J1183N0383J5446J8673l0540l9677j8496
$$ 43284 23362 -24250 -89481 -85027 -99149 -87966 -37583 -22137 -3464 -34004 -73681 -92177
10224i2177J6958L5317j9788l6111n019K6528Q393j1166K7583K0896m3719r535
$$ -92177 -75219 -39902 -59690 -95801 -100820 -74292 -65899 -77065 -49482 -28586 -72305 -81840
10212h1840J5928N504L1663N786K3916n087j4265l6915k3291n374N1996K1251
$$ -81840 -65912 -60408 -28745 -22959 957 -4130 -18395 -55310 -78601 -83975 -31979 -10728
10200a0728j1561J4590o654j2226o8639k1109R342L3835l1787j732J2230L8122
$$ -10728 -22289 -7699 -14353 -26579 -95218 -116327 -106985 -73150 -104937 -106669 -94439 -56317
10188e6317M439J3570P5942L160J428K5138P611J7023o590K2014l983o745l8524
$$ -56317 -51878 -38308 37634 40794 42222 67360 74971 91994 85404 107418 103435 96690 58166
10175E8166J044K0552J4336L689j8690K0401M8861O7578M4559J9553J9247K1m4161
$$ 58166 59210 79762 94098 97787 79097 99498 148359 215937 260496 280049 299296 299317 255156
10162B55156q5359l8330M7685L6827q76j9483K1543O6517R832L2780K539k2058
$$ 255156 169797 131467 179152 215979 215103 195620 217163 283680 293512 326292 328831 306773
10150C06773p7929k7020n190j8638L449K9966L5333N0025L8451l4702q5318p4818
$$ 306773 228844 201824 196634 177996 181445 211411 246744 296769 335220 300518 215200 140382
10138A40382k4254N6677L7694q161n765m9067m6062L1151k6555N999N183k4896
$$ 140382 116128 172805 210499 202338 196573 147506 101444 132595 106040 112039 117222 92326
10126I2326L284n6935o612M946k0854p302J9247q78J5242o411j5186j5853R188
$$ 92326 95610 38675 32063 37009 16155 8853 28100 27222 42464 36053 20867 5014 14202
10113A4202n1384l6227K6294M1525o254J5466J3661n5178o3958o801N5957R8442
$$ 14202 -37182 -73409 -47115 -5590 -11844 3622 17283 -37895 -101853 -108654 -52697 45745
10101D5745K8887m9759J2010m3669j0740l6386q235o017L4059J2100K7714R295
$$ 45745 74632 24873 36883 -6786 -17526 -53912 -62147 -68164 -34105 -22005 5709 15004
10089A5004K3216j7144l4105O140o106Q711J1437j7747K3812M415o535j6877J5662
$$ 15004 38220 21076 -13029 -6889 -12995 -4284 7153 -10594 13218 17633 11098 -5779 9883
10076I883j6053n1508q8537K6982K6202R30Q8139L2975p9195l7099J9056p5080
$$ 9883 -6170 -57678 -146215 -119233 -93031 -92101 -3962 29013 -50182 -87281 -68225 -143305
10064a43305P868k4035N9874O9846L1865J7038j9968K0037O2942q7454p7645M8953
$$ -143305 -135437 -159472 -99598 -29752 2113 19151 -817 19220 82162 -5292 -82937 -33984
10052c3984L8358K4356J2895K2425k6695r047n038O028Q2324l6433m2742k2721
$$ -33984 4374 28730 41625 64050 37355 28308 23270 29298 111622 75189 32447 9726
10040I726k2206m2552k319n4K9848J8579L840k9310K533j2567q503k1044O974
$$ 9726 -12480 -55032 -57351 -57405 -27557 -8978 -5138 -34448 -31915 -44482 -52985 -74029 -67055
10027f7055M7504L8629n9735k2191N3342J9729O0856j81m8831r9089j3271J7066
$$ -67055 -19551 19078 -40657 -62848 -9506 10223 71079 70898 22067 -77022 -90293 -73227
10015g3227J0717o430N2711L2910o081p2307j3618L5118q368J2840J1625P6083
$$ -73227 -62510 -68940 -16229 16681 10600 -61707 -75325 -40207 -48575 -35735 -24110 51973
10003E1973M9361j8968l0681L5970L6965n4346l8843n314j3836J4665k9905k9551
$$ 51973 101334 82366 51685 87655 124620 70274 31431 26117 12281 26946 -2959 -32510
9991c2510n5378L2604M2329n287M6396M4974l3238K3949L2907l3606j02961j131
$$ -32510 -87888 -55284 -12955 -18242 28154 73128 39890 63839 96746 63140 -39821 -40952
9979d0952J8809M69L2991k3002J2956J4699j0934m557K8891k7259m0570j9069
$$ -40952 -22143 -21674 11317 -11685 1271 15970 5036 479 29370 2111 -38459 -57528
9967e7528K8196N5972M0199K2457r679m1089m3778m3491o0242L659L4633K9072
$$ -57528 -29332 26640 66839 89296 79617 38528 -5250 -48741 -108983 -105324 -70691 -41619
9955d1619M6236o756k0596p194o932L9125K4282r516L7086k4174k7346M8544l791
$$ -41619 4617 -2139 -22735 -29929 -36861 2264 26546 17030 54116 29942 2596 51140 47349
9942D7349R946J9179q261k9910m3583m380L6049r023n0848l4747k5008N2010J4074
$$ 47349 57295 76474 68213 38303 -5280 -9660 26389 17366 -33482 -68229 -93237 -41227 -27153
9929b7153n418L032O0518R1944M4480q5612n1747R80o6482m1558P468J4711k4586
$$ -27153 -32571 -29539 30979 122923 167403 81791 30044 31024 -35458 -77016 -69548 -54837 -79423
9916g9423k6722j6093J5252L2921P0768N4809r896k3935p4410l2149q866m941
$$ -79423 -106145 -122238 -106986 -74065 -3297 51512 41616 17681 -56729 -88878 -97744 -102685
9904a02685K1363j5006r353M679k381k777J6296L2533p602M278K041R324l635
$$ -102685 -81322 -96328 -105681 -101002 -103383 -106160 -89864 -57331 -64933 -60655 -58614 -49290 -52925
9891e2925k3238J6608N4165o167m7478N43J0445J9537k8050k5619L1128J5810
$$ -52925 -76163 -59555 -5390 -11557 -59035 -58492 -48047 -28510 -56560 -82179 -51051 -35241
9879c5241J1609l821M5608M4372j064m0821o9326M13M915J6780j1870j1980p065
$$ -35241 -23632 -27453 18155 62527 61463 20642 -48684 -48271 -43356 -26576 -38446 -50426 -57491
9866e7491p303J3970L6459M952L660j7742J3948K2474l4025R985j4816Q149j9787
$$ -57491 -64794 -50824 -14365 -9413 -5753 -23495 -9547 12927 -21098 -11113 -25929 -17780 -37567
9853c7567l5921k8690r000M5489L0959k629K1166K3764m1525J5640M3289o4830
$$ -37567 -73488 -102178 -111178 -65689 -34730 -37359 -16193 7571 -33954 -18314 24975 -39855
9841c9855o8849N0226M8538l826l538K7750l6863q2588l7582j0052M549N9730
$$ -39855 -108704 -58478 -9940 -13766 -17304 10446 -26417 -109005 -146587 -156639 -152090 -92360
9829i2360M8216j8353l5181k2308m4033N7704P4184L3945p5665l7789K4708J2295
$$ -92360 -44144 -62497 -97678 -119986 -164019 -106315 -32131 1814 -73851 -111640 -86932 -74637
9817g4637N6349J9689K7468l6711J935k3795P790p461K3886N058M081J2497j8953
$$ -74637 -18288 1401 28869 -7842 -5907 -29702 -21912 -29373 -5487 -429 3652 16149 -2804
9804b804k6967L015J5797j9888k2788j1750J2121L068n3983K4982O2039L7320
$$ -2804 -29771 -26756 -10959 -30847 -53635 -65385 -53264 -50196 -104179 -79197 -17158 20162
9792B0162k795n617k8021K5062K4609m8320m6453n9105J5809J3436k3116M0492
$$ 20162 17367 11750 -16271 8791 33400 -14920 -61373 -120478 -104669 -91233 -114349 -73857
9780g3857K8344l0765j43N7518K0709N023J5184J5459j6709p195k3468j6596j5619
$$ -73857 -45513 -76278 -76421 -18903 1806 6829 22013 37472 20763 13568 -9900 -26496 -42115
9767d2115p6354J0858O4995L4044j7867k808L5964J1789n5252l1906R200K5177
$$ -42115 -118469 -107611 -42616 -8572 -26439 -29247 6717 18506 -36746 -68652 -59452 -34275
9755c4275k7765k160J1359N5533K1646m7395m1946J9791J3671L7335j9902q731
$$ -34275 -62040 -64200 -52841 2692 24338 -23057 -65003 -45212 -31541 5794 -14108 -22839
9743b2839j5320j2622J1857L1937M5000P038j2451j4847K0867j6167R305L5084
$$ -22839 -38159 -50781 -38924 -6987 38013 45051 32600 17753 38620 22453 31758 66842
9731F6842p4110q4458J3625N652j0306K707L5394K7735j5576o2003L3699J7094
$$ 66842 -7268 -91726 -78101 -72449 -82755 -80048 -44654 -16919 -32495 -94498 -60799 -43705
9719d3705m490K3350O5194R32n1263L760M97K3969J7392K8671n7419o59J7573
$$ -43705 -48195 -24845 40349 41281 -9982 -6222 -5725 18244 35636 64307 6888 6229 23802
9706B3802l0835N26p267m3891j8996q729l4L5429J5126L6944l2171k8081M6263
$$ 23802 -7033 -6507 -13774 -57665 -76661 -85390 -85424 -49995 -34869 2075 -30096 -58177 -11914
9693a1914J3931n1400m8648M121o903n710j988L0878M6223m2308J8083M8517L3240
$$ -11914 2017 -49383 -98031 -93910 -100813 -106523 -108511 -77633 -31410 -73718 -55635 -7118 26122
9680B6122M3444k9828l2806j8203j122K4668O6201J4711l727j4677M405L7390
$$ 26122 69566 39738 6932 -11271 -12393 12275 78476 93187 89460 74783 79188 116578
9668A16578l4977r8614P182L9788l0620r0407l1691Q8823N0821l9481J0361J20330
$$ 116578 81601 -17013 -9831 29957 -663 -91070 -122761 -33938 16883 -22598 -12237 108093
9656A08093J27479K14070K50216K73702M83509N49542K78824j91259n87789n88490
$$ 108093 235572 449642 699858 973560 1457069 2006611 2285435 2094176 1506387 917897
9646I17897l92826j67188j26536o6910p0541l738L0184m4355m0938p310p351M021
$$ 917897 525071 357883 231347 164437 93896 90158 120342 75987 35049 27739 20388 24409
9634B4409j7968n1062K3653L115j7989N1350M2170o4358k5683n7792k1707Q510
$$ 24409 6441 -44621 -20968 -17853 -35842 15508 57678 -6680 -32363 -90155 -111862 -103352
9622a03352Q9211K5984M260L8570K6520q02p0877l1700K3627k7774j9674L7619
$$ -103352 -14141 11843 16103 54673 81193 80391 9514 -22186 1441 -26333 -46007 -8388
9610h388O3831K9728k6028j2979l1271k6405l320p953N6481k4683k2010n682L6118
$$ -8388 55443 85171 59143 46164 14893 -11512 -14832 -22785 33696 9013 -12997 -18679 17439
9597A7439P080k6258J3921K7304K1508p8730p5942J9674L3207j371k0291k5832
$$ 17439 24519 -1739 12182 39486 60994 -17736 -93678 -74004 -40797 -42168 -62459 -88291
9585h8291p730L1942O2201L2436n1268K4966j1801K4329n70j9458j0699J5213
$$ -88291 -96021 -64079 -1878 30558 -20710 4256 -7545 16784 16214 -3244 -13943 1270
9573A270m2902K1218J4583m902M3325M47j7762L6356M3089k9438L419j4887l0791
$$ 1270 -41632 -20414 -5831 -10733 32592 33039 15277 51633 94722 65284 68703 53816 23025
9560B3025j9390J6735L869r7533k2060M7526J1709j2834J0169P5597L525o2500
$$ 23025 3635 20370 24239 -73294 -95354 -47828 -36119 -48953 -38784 36813 40338 -22162
9548b2162j010O4m6986M6343L4352K2540j139O648L316R7187J06694R8796J18779
$$ -22162 -23172 -23108 -70094 -23751 10601 33141 32002 38650 41966 139153 245847 344643 463422
9535D63422K41372L87309M50394L43475J67559n4783l08884l83543k90079k84223
$$ 463422 704794 1092103 1542497 1885972 2053531 1998748 1689864 1306321 1016242 732019
9525G32019k54290j42076j18920j32306n2393K099L4307P373l0077j8124N6273
$$ 732019 477729 335653 216733 84427 32034 34133 68440 75813 45736 27612 83885
9514H3885M0298p6552n2470j768j210M2385J1708l6624j2396J6565k3233J2524
$$ 83885 124183 47631 -4839 -6607 -7817 34568 46276 9652 -2744 13821 -9412 3112
9502C112m143k890j0012k0327n314m2218K5002O2304j6506n99J2086Q83J460j7809
$$ 3112 -1031 -3921 -13933 -34260 -39574 -81792 -56790 5514 -10992 -11591 495 1378 2838 -14971
9488a4971K3236O461k546l9579J569m491J8158L2569L2543J6966J8112L2042p4738
$$ -14971 8265 14726 12180 -27399 -25830 -30321 -12163 20406 52949 69915 88027 120069 45331
9475D5331m5425J0050K9936J1934M0086O3609j940r1684j6032K2666O725m1694
$$ 45331 -94 9956 39892 51826 91912 155521 153581 61897 45865 68531 75256 33562
9463C3562J349m1262j7719P098k9768j9918j2381j4786L5386R880L7820k134J1560
$$ 33562 34911 -6351 -24070 -16972 -46740 -66658 -79039 -93825 -58439 -48559 -10739 -12873 -1313
9450a313k2112k6391m7242K4728O4441j9256m88j0957L3048l0834L5811L8310
$$ -1313 -23425 -49816 -97058 -72330 -7889 -27145 -27633 -38590 -5542 -36376 -565 37745
9438C7745N452K865J188k6787o6538m8741Q094O0082P3805P109L8497j9816J892
$$ 37745 43197 46062 47250 20463 -46075 -94816 -86722 -26640 47165 54274 92771 72955 74847
9425G4847R238o3677j6066j8850m9160M0765O1637L7599l5221m8040K5071r915
$$ 74847 84085 20408 4342 -14508 -63668 -22903 38734 76333 41112 -6928 18143 8228
9413H228l7187K3070J0012l1842o7543P7025R9792q019n3933k3860l4392O633
$$ 8228 -28959 -5889 4123 -27719 -95262 -18237 81555 73536 19603 -4257 -38649 -32016
9401c2016l7416L3145j4259k6419O8368N3569P855r277Q527L0750p8625o3823
$$ -32016 -69432 -36287 -50546 -76965 -8597 44972 52827 43550 52077 82827 4202 -59621
9389e9621L0057Q202L9181k2901l5541J6020L9031L4047j6027J3428j2205j973
$$ -59621 -29564 -21362 17819 -5082 -40623 -24603 14428 48475 32448 45876 33671 31698
9377C1698m4216J8812J6676k6717j8352k6668J9764r235j5841R544K4979J0052
$$ 31698 -12518 6294 22970 -3747 -22099 -48767 -29003 -38238 -54079 -44535 -19556 -9504
9365i504N7641N261l8971l8096o5278p768P5078M8200j0207j4545L0196P326o4451
$$ -9504 48137 53398 14427 -23669 -88947 -96715 -21637 26563 16356 1811 32007 39333 -25118
9352b5118Q239p671O370k3391o1865J3855O1957k0514K326m0263M3888P8809L5282
$$ -25118 -16879 -24550 -18180 -41571 -103436 -89581 -27624 -48138 -45812 -86075 -42187 36622 71904
9339G1904j3812K6039j8440p0708p0196J3569j861n715K2011M2745k8034l6802
$$ 71904 58092 84131 65691 -5017 -75213 -61644 -63505 -69220 -47209 -4464 -32498 -69300
9327f9300J4078k9196k6888M8178M9370J7127P334k3597p3848j2364j0746L5702
$$ -69300 -55222 -84418 -111306 -63128 -13758 3369 10703 -12894 -86742 -99106 -109852 -74150
9315g4150N7715R837J2720j0683l6393k0458J9721J9903N4345N4459j5891m0204
$$ -74150 -16435 -6598 6122 -4561 -40954 -61412 -41691 -21788 32557 87016 71125 30921
9303C0921N598l6225n4523J7391N6893j8458l1717Q476J3907R312O0269O1993
$$ 30921 36519 294 -54229 -36838 20055 1597 -30120 -21644 -7737 1575 61844 123837
9291A23837N421o2546j5718m7865L371N078M3576L13O707N321q198q345J9813
$$ 123837 129258 66712 50994 3129 6500 11578 55154 55467 62174 67495 59297 50952 70765
9278G0765k3433n731M274O358K2616l3627q696L9759j4169m0088m228J0301K2045
$$ 70765 47332 41601 45875 52233 74849 41222 32526 72285 58116 18028 13800 24101 46146
9265D6146o0032o7735j1747Q90o1599m64L6432R3096O9342j8387n8397n9263J870
$$ 46146 -13886 -81621 -93368 -92478 -154077 -154541 -118109 -25013 44329 25942 -32455 -91718 -89848
9252h9848k7081M5556j4938l0773J02639K162o6275O09J5062k924K5514N5176
$$ -89848 -116929 -71373 -86311 -117084 -14445 -12283 -78558 -77949 -62887 -65811 -40297 14879
9240A4879n4891r1775n247l5798r906K9372O3259L1673l1293k5065J5362J2483
$$ 14879 -40012 -131787 -137034 -172832 -182738 -153366 -90107 -58434 -89727 -114792 -99430 -86947
9228h6947M8935M5734o0579n2305j8805J8650N4520L5947Q5992J4950m9582o2017
$$ -86947 -38012 7722 -52857 -105162 -123967 -105317 -50797 -14850 71142 86092 36510 -25507
9216b5507o7678K6617N9672j6244N0429K2662l1331k4330j9675L4106O357k8034
$$ -25507 -93185 -66568 -6896 -23140 27289 49951 18620 -5710 -25385 8721 15078 -12956
9204a2956m391k6979r508r6j4860n3081j542J5827M648j5658J0688o050J0458
$$ -12956 -17347 -44326 -53834 -53930 -68790 -121871 -123413 -107586 -102938 -118596 -107908 -113958 -103500
9191a03500L7225J3298Q9J5966j6365k8913J7620J6454k7323M1846L6834R633
$$ -103500 -66275 -52977 -52888 -36922 -53287 -82200 -64580 -48126 -75449 -33603 3231 12864
9179A2864j3184l3518k1626j0640k1768j3724M2424k970k260l2035J9855m768
$$ 12864 -320 -33838 -55464 -66104 -87872 -101596 -59172 -62142 -64402 -96437 -76582 -81350
9167h1350o803l514J5269m0296k0440j8287J2920K0357L6812L3201m129q25M2360
$$ -81350 -88153 -91667 -76398 -116694 -137134 -155421 -142501 -122144 -85332 -52131 -56260 -57085 -14725
9154a4725j871n1251M120L9927K6218N8309l0395k2759P431O483m0778k4032J5583
$$ -14725 -16596 -67847 -63727 -23800 2418 60727 30332 7573 15004 21487 -19291 -43323 -27740
9141b7740L085R845M850J5598L3571m5356K0830L2981r551k2829J9157j7344l9586
$$ -27740 -24655 -14810 -9960 5638 39209 -6147 14683 47664 38113 15284 34441 17097 -22489
9128b2489L5180M4921j9539m5614m9113j4849J6002n678l9445L885N5762L2920
$$ -22489 12691 57612 38073 -7541 -56654 -71503 -55501 -61179 -100624 -96739 -40977 -8057
9116h057L933j3202n3358m343L9715J7788k7166j4103j1237L4003j5084k4043
$$ -8057 -4124 -17326 -70684 -75027 -35312 -17524 -44690 -58793 -70030 -36027 -51111 -75154
9104g5154K5211k7638M9938L0904j0525j0360J7307P304K6218M6961J2842q9346
$$ -75154 -49943 -77581 -27643 3261 -7264 -17624 -317 6987 33205 80166 93008 3662
9092C662m2056j8386K2593M1688J0975k1995L4614j3843K4242K877l163m4996
$$ 3662 -38394 -56780 -34187 7501 18476 -3519 31095 17252 41494 44371 41208 -3788
9080c788k3983j3282l5650n9207J7278Q0307K1116l6991J030j3334l2081J0165
$$ -3788 -27771 -41053 -76703 -135910 -118632 -38325 -17209 -54200 -53170 -66504 -98585 -88420
9068h8420O5607n5159l3277N2156K6362k3013L0293N896m0292K523K5150K504
$$ -88420 -22813 -77972 -111249 -59093 -32731 -55744 -25451 -19555 -59847 -57324 -32174 -29670
9056b9670M4367J0799k9755J4019L8244l3754m8280k6271n9962K7005N9969K0426
$$ -29670 14697 25496 -4259 9760 48004 14250 -34030 -60301 -120263 -93258 -33289 -12863
9044a2863k6071k130p722K3189j3661m1506l3480P1309Q0680j9831j3071L3767
$$ -12863 -38934 -41064 -48786 -25597 -39258 -80764 -114244 -42935 37745 17914 4843 38610
9032C8610m2530n4799j4024j7022K9905j8070k0446l7972k7665L2642P6741o1057
$$ 38610 -3920 -58719 -72743 -89765 -59860 -77930 -98376 -136348 -164013 -131371 -54630 -115687
9020a15687J1087O5111k8960L1929O1857k8256p4344k3747j3754O1599L9726O5094
$$ -115687 -104600 -39489 -68449 -36520 25337 -2919 -77263 -101010 -114764 -53165 -13439 51655
9008E1655P939j5777m6416m1494M8041L8989N7870N185n121m7282J3074n1567
$$ 51655 59594 43817 -2599 -44093 3948 42937 100807 105992 100871 53589 66663 15096
8996A5096m9090k2920q863J1196k6375j2816k322j452O0286L0147l8235k3330
$$ 15096 -33994 -56914 -65777 -54581 -80956 -93772 -96094 -97546 -37260 -7113 -45348 -68678
8984f8678M7064K4800K6163k1424r560J2160L9002k4032m7722L5702l0860n2855
$$ -68678 -21614 3186 29349 7925 -1635 10525 49527 25495 -22227 13475 -17385 -70240
8972g0240j9151m954N0084M0092K1503J4497Q339o899j8226k7551P0231K2200
$$ -70240 -89391 -94345 -44261 -4169 17334 31831 40170 33271 15045 -12506 57725 79925
8960G9925M9963k0015j3526k0020j4962J9561M653l5266L3215M1160k7899l2791
$$ 79925 129888 109873 96347 76327 61365 80926 85579 50313 83528 124688 96789 63998
8948F3998K810j4480J6012p370m1968j9167J3281k0112k172L3498o1639p9851
$$ 63998 66808 52328 68340 60970 19002 -165 13116 -6996 -9168 24330 -37309 -117160
8936a17160J8167O9708k370m6068l2881L7405N0728j3923N7845K0424p2617K9007
$$ -117160 -98993 -29285 -31655 -77723 -110604 -73199 -22471 -36394 21451 41875 -30742 -1735
8924a735M5626L0989K0030k9388l0652L0222N126J6233o1469l2655R703l0455
$$ -1735 43891 74880 94910 65522 34870 65092 70218 86451 24982 -7673 2030 -28425
8912b8425M446l4915M534N4674j3368m599K3207k18L1891L880n2917M465r613
$$ -28425 -23979 -58894 -54360 314 -13054 -17653 5554 5336 37227 41107 -11810 -7345 -16958
8899a6958N305O737J6086m3868j7316L9941r732o1485R579M6382r490k2101p082
$$ -16958 -11653 -4916 11170 -32698 -50014 -10073 -19805 -81290 -71711 -25329 -34819 -56920 -64002
8886f4002J7653K9593K4325N4683k323O578J3461p7572l5573k5324N690o712L170
$$ -64002 -46349 -16756 7569 62252 59929 66507 79968 2396 -33177 -58501 -52811 -59523 -56353
8873e6353j1552K215L7615M7J5151j2303k2334N4976l0281j3312N64j765n064
$$ -56353 -67905 -65690 -28075 -28028 -12877 -25180 -47514 7462 -22819 -36131 -35567 -37332 -42396
8860d2396P0925L2260r476J6786p4215M00L2034L0702L6995J144j4432k3326l9582
$$ -42396 28529 60789 51313 68099 -6116 -5716 26318 57020 94015 95159 80727 57401 17819
8847A7819l7004l6692k9720k8669K2804L9997N0313l3050m1713K1783O400j6119
$$ 17819 -19185 -55877 -85597 -114266 -91462 -51465 -1152 -34202 -75915 -54132 -47732 -63851
8835f3851M8926N9372p909J6892N6541J0576j4961k4368n1457m1827k9608j5394
$$ -63851 -14925 44447 36538 53430 109971 120547 105586 81218 29761 -12066 -41674 -57068
8823e7068J1164L8267J9123N37Q544O6940l2438m1955m4650j7678N7240j4178
$$ -57068 -45904 -7637 11486 12023 20567 87507 55069 13114 -31536 -49214 8026 -6152
8811f152j7488L2771l4066p0897J2573l8132K0423J1828O3375K8383K093M2481
$$ -6152 -23640 9131 -24935 -95832 -83259 -121391 -100968 -89140 -25765 2618 4711 47192
8799D7192j8483O053n9207m1645M0028L5566j6852r349K0794j596j1727L7391
$$ 47192 28709 34762 -24445 -66090 -26062 9504 -7348 -16697 4097 2501 -9226 28165
8787B8165m0277m0828k7982L6829N9344l3966n190j8555M645J8298M6189j0477
$$ 28165 -12112 -52940 -80922 -44093 15251 -18715 -23905 -42460 -37815 -19517 26672 16195
8775A6195n6608K5783L5593p436j6373m972M7363J6394M0180n450n2994k4905
$$ 16195 -40413 -14630 20963 13527 -2846 -7818 39545 55939 96119 90669 37675 12770
8763A2770k7769k2883r367j3750Q1769J8088o5262k5368J1834N835k446N542j3343
$$ 12770 -14999 -37882 -47249 -60999 20770 38858 -26404 -51772 -39938 -34103 -36549 -31007 -44350
8750d4350J2451K4883J8433m3984L2216J8685J4271r991n090R38J3144l5603K0513
$$ -44350 -31899 -7016 11417 -32567 -351 18334 32605 22614 17524 18462 31606 -3997 16516
8737A6516L058M2300j5678l5090l7338Q471m086L9758j2208N421k4840l1519P1013
$$ 16516 19574 61874 46196 11106 -26232 -17761 -21847 17911 5703 11124 -13716 -45235 25778
8724B5778M7514p601k60j9982p2737k6119L6930N7222j2640l4651J431L588K9221
$$ 25778 73292 65691 65431 45449 -27288 -53407 -16477 40745 28105 -6546 -5115 -1527 27694
8711B7694Q2336N6319l1435o7780n9064N0912L8637k369L9496N1657K7895J0511
$$ 27694 110030 166349 134914 67134 8070 58982 97619 95250 134746 186403 214298 224809
8699B24809J3784R2622Q0942L3849J06719J02824J74352J90826K29879L18699
$$ 224809 238593 331215 412157 446006 552725 655549 829901 1020727 1250606 1569305
8689A569305K48378K36909J50256l7707j83057k90549k77263j85262k47476j53497
$$ 1569305 1817683 2054592 2204848 2167141 1984084 1693535 1416272 1231010 983534 830037
8679H30037j05156j10977p9815n5303q5764l6952J58j8159j1989n6750o1040o5528
$$ 830037 724881 613904 534089 478786 393022 356070 356228 338069 326080 269330 208290 142762
8667A42762L8094Q3963K060P521J841m572K644j617R993M9196N8149O1417L3880
$$ 142762 180856 264819 266879 274400 276241 271669 274313 272696 282689 331885 390034 451451 485331
8654D85331J17644J85685J43076J62830K25678K58889K93491K21500P0660l0541
$$ 485331 602975 788660 931736 1094566 1320244 1579133 1872624 2094124 2164784 2134243
8644B134243j78012k13615k68510k71410k48890j94251j19708q9188n9917n4358
$$ 2134243 1956231 1742616 1474106 1202696 953806 759555 639847 550659 490742 436384
8634D36384n2727j09991o2572k4372J253J0697j2352m1596n7921j1530m9878l0827
$$ 436384 383657 273666 211094 186722 187975 198672 186320 144724 86803 75273 25395 -5432
8622e432o2269N6100J2500l2685L2008N2592k8472o9811L119L3530o034L2265
$$ -5432 -67701 -11601 899 -31786 222 52814 24342 -45469 -42350 -8820 -14854 17411
8610A7411P427J519J8900J0379m742l770j2236J7227q266M949M6970K705j4109
$$ 17411 24838 26357 45257 55636 50894 47124 34888 52115 43849 48798 95768 98473 84364
8597H4364n1135k7781n016M4348l8062m4601O8881j4968k6516N0337L0933J0754
$$ 84364 33229 5448 432 44780 6718 -37883 30998 16030 -10486 39851 70784 81538
8585H1538K3004J7009J7222J0191l1301j6548M2371j190l0493k3396p090J2629
$$ 81538 104542 121551 138773 148964 117663 101115 143486 142296 111803 88407 81317 93946
8573I3946L349r471j6963M8028L9511m0450k3650l087j6534l4469k2851Q216q502
$$ 93946 97295 87824 70861 118889 158400 117950 94300 91213 74679 40210 17359 25575 17073
8560A7073L4993q212j1672j4135R287L4634L3650J2683l5303l2745o5372j5425
$$ 17073 52066 43854 32182 18047 27334 61968 95618 108301 72998 40253 -25119 -40544
8548d0544N4038M6554j7287k3629J9990j5404j7383n902j1569k0249j583M4883
$$ -40544 13494 60048 42761 19132 39122 23718 6335 433 -11136 -31385 -32968 11915
8536A1915O6736l8637l3517j3172l0582M5490O4295J0012K5769k0450l4284L3337
$$ 11915 78651 40014 6497 -6675 -37257 8233 72528 82540 108309 87859 53575 86912
8524H6912j8778J0622J8433P184m6862k4779q218m2985k0305J3428K6249M4630
$$ 86912 68134 78756 97189 104373 57511 32732 24514 -18471 -38776 -25348 901 45531
8512D5531N3134k056J0510P353L2964J852l3930o1200O855N1690K9998l7239m0012
$$ 45531 98665 96609 107119 114472 147436 149288 115358 54158 61013 112703 142701 105462 65450
8499F5450n3918q224k7587n4837l4443J3683M1471M5847N5943K8032q6195K7570
$$ 65450 11532 3308 -24279 -79116 -113559 -99876 -58405 -12558 43385 71417 -14778 12792
8487A2792J3471K3825o47j4540M2680J2175q621l0439l3975P846P508l6631J9152
$$ 12792 26263 50088 49441 34901 77581 89756 81135 50696 16721 24567 32075 -4556 14596
8474A4596J7862O843j3916l1005J3787O126k6013l0329K4359m3764n6517j6931
$$ 14596 32458 39301 25385 -5620 8167 14293 -11720 -42049 -17690 -61454 -117971 -134902
8462a34902L2286m38l81L456J4913l9413K6562k4382P9026J8069Q579r0287n638
$$ -134902 -102616 -103054 -103435 -99979 -85066 -124479 -97917 -122299 -43273 -25204 -16625 -106912 -112550
8449a12550J00517Q7561L1581l9623m7228l399j5697L342K9444j4576j54N9097
$$ -112550 -12033 75528 107109 67486 20258 16859 1162 4504 33948 19372 19218 78315
8437G8315L5867J3637k9804o6240J9069n506p229N061O3453p598n4359l2470n0536
$$ 78315 114182 127819 98015 31775 50844 45338 38109 43170 106623 99025 44666 12196 -38340
8424c8340l7663l1357M629L2600N8146K9438M1952j3469j2246j8425J117J7522
$$ -38340 -76003 -107360 -102731 -70131 -11985 17453 59405 45936 33690 15265 16382 33904
8412C3904k8938K6414L2716J5001j8289j8621K4545p7111m3292K875R874j0586
$$ 33904 4966 31380 64096 79097 60808 42187 66732 -10379 -53671 -50796 -40922 -51508
8400e1508l6310M6496P3458M9747p440j5260J1258O6279J62987J77698J06384
$$ -51508 -87818 -41322 32136 81883 74443 59183 70441 136720 299707 477405 583789
8389E83789J6324j05846j72614j60232q0681l5368k5283n3188J0832l7400J1682
$$ 583789 600113 494267 321653 161421 80740 45372 20089 -33099 -22267 -59667 -47985
8378d7985L8983j0486n5444j3453L4302R817k1522K346M0960L7655K6882m6283
$$ -47985 -9002 -19488 -74932 -88385 -54083 -44266 -65788 -63442 -22482 15173 42055 -4228
$$ [...]
##END NTUPLES=NMR SPECTRUM
##END=
