##TITLE=Analysis number 328163
Compound Code cc 01113
Project Code adrs
Chemist Name stores
cloudy
##JCAMPDX= 6.0         $$ Bruker NMR JCAMP-DX V2.0
##DATA TYPE= NMR SPECTRUM
##DATA CLASS= NTUPLES
##ORIGIN= Bruker BioSpin GmbH
##OWNER= nmr
$$ XWIN-NMR		Version 3.5
$$ Wed May  9 12:00:11 2007 GMT Daylight Time (UT+1h)  MAYBRIDGE\nmr@NMR_250MHZ
##.OBSERVE FREQUENCY= 250.131544655141
##.OBSERVE NUCLEUS= ^1H
##.ACQUISITION MODE= SIMULTANEOUS (DQD)
##.ACQUISITION SCHEME= undefined
##.AVERAGES= 16
##.DIGITISER RES= 18
##SPECTROMETER/DATA SYSTEM= dpx250
##.PULSE SEQUENCE= zg30
##.SOLVENT NAME= CDCl3
##.SHIFT REFERENCE= (INTERNAL, CDCl3, 0, 16.4424)
##AUDIT TRAIL= $$ (NUMBER, WHEN, WHO, WHERE, WHAT)
$$ ##TITLE= Audit trail, XWIN-NMR		Version 3.5
$$ ##JCAMPDX= 5.01
$$ ##ORIGIN= Bruker BioSpin GmbH
$$ ##OWNER= nmr
$$ C:\u/data/dgb/nmr/ADRS/660/pdata/1/auditp.txt
$$ ##AUDIT TRAIL=  $$ (NUMBER, WHEN, WHO, WHERE, WHAT)
(   1,<2007-05-09 11:59:41.96 +100>,<MAYBRIDGE\nmr>,<NMR_250MHZ>,
      <created by zg, POWCHK disabled, PULCHK disabled
       configuration hash MD5:
       76 6E 9A 78 1E 09 19 81 EC 84 63 8F B0 6A 59 2D
       data hash MD5: 64K
       CC 8C D8 68 28 03 7D 11 B9 14 19 11 0A 53 BC A3>)
(   2,<2007-05-09 11:59:59.60 +100>,<MAYBRIDGE\nmr>,<NMR_250MHZ>,
      <Start of raw data processing
       ef LB = 0.3 FT_mod = 6 PKNL = 1 SI = 32K 
       data hash MD5: 32K
       3E AE CF 57 CD 4A 15 08 79 04 C2 14 A9 46 DC DC>)
(   3,<2007-05-09 12:00:01.94 +100>,<MAYBRIDGE\nmr>,<NMR_250MHZ>,
      <apk 
       data hash MD5: 32K
       A7 78 A4 42 C5 39 72 45 E0 88 27 B4 5C 15 50 9F>)
(   4,<2007-05-09 12:00:02.64 +100>,<MAYBRIDGE\nmr>,<NMR_250MHZ>,
      <abs ABSG = 5 
       data hash MD5: 32K
       87 93 85 66 7C 6A 91 91 29 B8 F0 97 14 1C 44 52>)
$$ ##END=
$$ 
$$ hash MD5
$$ 17 4C AF 1E 18 4C A8 84 79 B1 12 6D 26 BB DC 43
##$RELAX= 
##$RELAX= 
##$RELAX= 
##$RELAX= 
##$RELAX= 
##$RELAX= 
##$RELAX= 
$$ Bruker specific parameters
$$ --------------------------
##$DU= <C:\u>
##$EXPNO= 660
##$NAME= <ADRS>
##$PROCNO= 1
##$TYPE= <nmr>
##$USER= <dgb>
##$AMP= (0..31)
100 100 100 100 100 100 100 100 100 100 100 100 100 100 100 100 100 100 
100 100 100 100 100 100 100 100 100 100 100 100 100 100 
##$AQSEQ= 0
##$AQ_mod= 3
##$AUNM= <au_zg>
##$AUTOPOS= <21 >
##$BF1= 250.13
##$BF2= 250.13
##$BF3= 250.13
##$BF4= 250.13
##$BF5= 500.13
##$BF6= 500.13
##$BF7= 500.13
##$BF8= 500.13
##$BYTORDA= 1
##$CFDGTYP= 0
##$CFRGTYP= 5
##$CHEMSTR= <none>
##$CNST= (0..31)
1 1 145 1 1 1 1 1 1 1 1 1 1 1 1 1 1 1 1 1 1 1 1 1 1 1 1 1 1 1 1 1 
##$CPDPRG= <>
##$CPDPRG1= <>
##$CPDPRG2= <>
##$CPDPRG3= <>
##$CPDPRG4= <mlev>
##$CPDPRG5= <mlev>
##$CPDPRG6= <mlev>
##$CPDPRG7= <mlev>
##$CPDPRG8= <mlev>
##$CPDPRGB= <>
##$CPDPRGT= <>
##$D= (0..31)
0 1 0 0 0 0 0 0 0 0.06 0 0 0 0 0 0 0.0002 0 0 0 0 0 0 0 0 0 0 0 0 0 0 
0 
##$DATE= 1178708381
##$DBL= (0..7)
120 120 120 120 120 120 120 120 
##$DBP= (0..7)
150 150 150 150 150 150 150 150 
##$DBP07= 0
##$DBPNAM0= <>
##$DBPNAM1= <>
##$DBPNAM2= <>
$$ [...]
##$SUBNAM7= <"">
##$SUBNAM8= <"">
##$SUBNAM9= <"">
##$SW= 20.6930455092707
##$SWIBOX= (0..15)
0 0 3 0 0 0 0 0 0 0 0 0 0 0 0 0 
##$SW_h= 5175.983436853
##$TD= 65536
##$TD0= 1
##$TE= 683.16
##$TE2= 300
##$TE3= 300
##$TEG= 300
##$TL= (0..7)
0 120 120 120 120 120 120 120 
##$TP= (0..7)
150 150 150 150 150 150 150 150 
##$TP07= 0
##$TPNAME0= <>
##$TPNAME1= <>
##$TPNAME2= <>
##$TPNAME3= <>
##$TPNAME4= <>
##$TPNAME5= <>
##$TPNAME6= <>
##$TPNAME7= <>
##$TPOAL= (0..7)
0.5 0.5 0.5 0.5 0.5 0.5 0.5 0.5 
##$TPOFFS= (0..7)
0 0 0 0 0 0 0 0 
##$TUNHIN= 0
##$TUNHOUT= 0
##$TUNXOUT= 0
##$USERA1= <user>
##$USERA2= <user>
##$USERA3= <user>
##$USERA4= <user>
##$USERA5= <user>
##$V9= 5
##$VALIST= <valist>
##$VCLIST= <CCCCCCCCCCCCCCC>
##$VD= 0
##$VDLIST= <DDDDDDDDDDDDDDD>
##$VPLIST= <PPPPPPPPPPPPPPP>
##$VTLIST= <TTTTTTTTTTTTTTT>
##$WBST= 1024
##$WBSW= 4
##$XGAIN= (0..3)
0 0 0 0 
##$XL= 0
##$YL= 0
##$YMAX_a= 439073
##$YMIN_a= -411686
##$ZGOPTNS= <>
##$ZL1= 120
##$ZL2= 120
##$ZL3= 120
##$ZL4= 120
##$ABSF1= 16.44237
##$ABSF2= -4.250803
##$ABSG= 5
##$ABSL= 3
##$ALPHA= 0
##$AQORDER= 0
##$ASSFAC= 0
##$ASSFACI= 0
##$ASSFACX= 0
##$ASSWID= 0
##$AUNMP= <proc_1d>
##$AZFE= 0.1
##$AZFW= 0.1
##$BCFW= 0
##$BC_mod= 0
##$BYTORDP= 0
##$COROFFS= 0
##$CY= 12.5
##$DATMOD= 1
##$DC= 0
##$DFILT= <>
##$DTYPP= 0
##$F1P= 14.0000005364418
##$F2P= -0.99999901652339
##$FCOR= 0.5
##$FTSIZE= 32768
##$FT_mod= 6
##$GAMMA= 0
##$GB= 0
##$INTBC= 1
##$INTSCL= 1
##$ISEN= 128
##$LB= 0.3
##$LEV0= 0
##$LPBIN= 0
##$MAXI= 10000
##$MC2= 0
##$MEAN= 0
##$ME_mod= 0
##$MI= 0
##$NCOEF= 0
##$NC_proc= -3
##$NLEV= 6
##$NOISF1= 0
##$NOISF2= 0
##$NSP= 0
##$NTH_PI= 0
##$NZP= 0
##$OFFSET= 16.44237
##$PC= 1
##$PHC0= 150.9259
##$PHC1= 8.539342
##$PH_mod= 1
##$PKNL= yes
##$PPARMOD= 0
##$PSCAL= 4
##$PSIGN= 0
##$REVERSE= no
##$SF= 250.130019916384
##$SI= 32768
##$SIGF1= 0
##$SIGF2= 0
##$SINO= 400
##$SIOLD= 32768
##$SREGLST= <1H.CDCl3>
##$SSB= 0
##$STSI= 32768
##$STSR= 0
##$SW_p= 5175.98343685301
##$SYMM= 0
##$S_DEV= 0
##$TDeff= 65536
##$TDoff= 0
##$TI= <Analysis number 999999
Compound Code 99
Book Reference 9
Project Code 9>
##$TILT= no
##$TM1= 0
##$TM2= 0
##$TOPLEV= 0
##$USERP1= <user>
##$USERP2= <user>
##$USERP3= <user>
##$USERP4= <user>
##$USERP5= <user>
##$WDW= 1
##$XDIM= 32768
##$YMAX_p= 271794204
##$YMIN_p= -63630
$$ End of Bruker specific parameters
$$ ---------------------------------
##NTUPLES= NMR SPECTRUM
##VAR_NAME=  FREQUENCY,     SPECTRUM/REAL,   SPECTRUM/IMAG
##SYMBOL=    X,             R,               I
##VAR_TYPE=  INDEPENDENT,   DEPENDENT,       DEPENDENT
##VAR_FORM=  AFFN,          ASDF,            ASDF
##VAR_DIM=   32768,         32768,           32768
##UNITS=     HZ,            ARBITRARY UNITS, ARBITRARY UNITS
##FACTOR=    0.157963299565203, 1,           1
##FIRST=     4112.73020076737, 0,            0
##LAST=      -1063.25323608564, 0,           0
##MIN=       -1063.25323608564, -63630,      0
##MAX=       4112.73020076737, 271794204,    0
$$ Real data points
##PAGE= N=1
##DATA TABLE= (X++(R..R)), XYDATA
$$ [...]
$$ plain form
16381 -5099 -6835 -6182 -6842 -8795 -12528 -14170 -10198 -12084 -16669 -22653 -26558 -22829 -21602 -20047 -19203
16366 -19203 -18895 -15833 -13596 -14516 -11058 -8166 -9433 -12456 -10284 -8793 -3406 1793 4000 3876 1355
16351 1355 -4787 -10096 -11740 -15855 -21750 -21802 -15830 -12991 -12745 -15425 -14340 -11693 -11017 -7973 -7678 -10418
16335 -10418 -8066 -4683 -4504 -1520 -12 1663 72 -4157 -10806 -11900 -11484 -12351 -12740 -13773 -14343 -13136
16319 -13136 -11135 -10940 -7085 -5200 -8512 -8217 -6032 -5535 -2621 -238 1419 3344 4792 3581 7161
16304 7161 12637 20389 27519 36309 40520 40872 39652 38192 37147 41704 44273 43072 43634 40673 37111
16289 37111 33353 24972 19147 18732 16141 10699 2530 -88 -543 -2639 351 -1603 73 1422 -821
16274 -821 -4147 -6461 -4553 -3988 -2547 -4872 -5320 -4613 -3216 -417 -518 -2986 -2757 -1067 489 295
$$ packed form
16381e099j736O53o60j953l733j642L972j886m585n984l905L729J227J555Q44
16366a9203L08L062K237r20L458K892j267l023K172J491N387N199K207j24k521
16351A355o142n309j644m115n895n2N972K839K46k680J085K647O76L044K95k740
16335a0418K352L383J79K984J508J675j591m229o649j094M16q67l89j033n70J207
16319a3136K001J95L855J885l312K95K185M97K914K383J657J925J448j211L580
16304G161N476P752P130Q790M211L52j220j460j045M557K569j201N62k961l562
16289C7111l758q381n825m15k591n442q169k618m55k096K990j954J676J349k243
16274h21l326k314J908N65J441k325m48P07J397K799j01k468K29J690J556j94
$$ plain form
16258 295 -1801 -2778 264 -810 -3874 -6929 -8576 -2163 -4794 -9425 -9241 -9072 -10217 -8649 -5817 -3626
16242 -3626 -3313 -2617 -1399 -2526 -3391 -4050 -6766 -7203 -4957 -2264 -3179 -8910 -10745 -9216 -5190 -2288
16226 -2288 -713 2408 1775 -116 -474 291 -647 -1012 -2162 -4872 -5536 -7698 -3917 -2196 -8758 -10434
16210 -10434 -5829 -4918 -4450 -3884 -130 2710 1029 -2191 -6373 -7535 -5814 -5674 -4641 -7135 -4679
16195 -4679 -517 -167 -3175 -4119 -1282 -320 636 182 4006 4497 5456 3177 962 1766 1748 1828 4261 7227
16177 7227 5977 4084 -538 -1533 1142 1010 1030 -1080 -1961 -5130 -7340 -9993 -12366 -14668 -10766 -4370
16161 -4370 -1835 -1557 -2327 -3742 -6941 -8758 -3155 -856 1733 3809 4758 11581 19085 21390 25578
16146 25578 26229 25979 27613 29610 30402 33546 38559 40401 46036 49954 52961 55436 52828 56406 55479
$$ packed form
16258B95k096r77L042j074l064l055j647O413k631m631J84J69j145J568K832K191
16242c626L13O96J218j127q65o59k716m37K246K693r15n731j835J529M026K902
16226b288J575L121o33j891l58P65r38l65j150k710o64k162L781J721o562j676
16210a0434M605R11M68N66L754K840j681l220m182j162J721J40J033k494K456
16195d679M162L50l008r44K837R62R56m54L824M91R59k279k215Q04j8Q0K433K966
16177G227j250j893m622r95K675j32K0k110q81l169k210k653k373k302L902O396
16161d370K535K78p70j415l199j817N603K299K589K076R49O823P504K305M188
16146B5578O51k50J634J997P92L144N013J842N635L918L007K475k608L578r27
$$ plain form
16131 55479 58776 65523 69572 73286 71900 75311 85805 101510 120409 152596 201996 266230 343319
16118 343319 415817 469020 520371 573831 664138 790144 949511 1089657 1150114 1171593 1115113
16107 1115113 1065017 1063621 1117135 1181557 1176518 1129400 996723 835803 705680 614789 558148
16096 558148 506875 452816 379353 296668 222931 166055 126297 96325 83152 73131 61618
16085 61618 55820 49412 41365 34957 29818 29371 30250 28906 27675 21921 24649 30865 35811 43542 48003
16070 48003 51595 57750 67834 82746 99381 118442 128894 132526 136074 131165 124529 124952 127100
16057 127100 130045 126314 119261 101707 78547 61678 50163 42604 37155 28037 20133 12442 4764
16044 4764 1419 -114 -4124 -5822 -2057 679 2329 2374 1320 -652 1674 1512 -782 -5937 -8529
$$ packed form
16131E5479L297O747M049L714j386L411J0494J5705J8899L2187M9400O4234P7089
16118C43319P2498N3203N1351N3460R0307J26006J59367J40146O0457K1479n6480
16107A115113n0096j396N3514O4422n039m7118j32677j60920j30123r0891n6641
16096E58148n1273n4059p3463q2685p3737n6876l9758k9972j3173j0021j1513
16085F1618n798o408q047o408n139m47Q79j344j231n754K728O216M946P731M461
16070D8003L592O155J0084J4912J6635J9061J0452L632L548m909o636M23K148
16057A27100K945l731p053j7554k3160j6869j1515p559n449r118p904p691p678
16044D764l345j533m010j698L765K736J650M5j054j972K326j62k294n155k592
$$ plain form
16029 -8529 -9780 -11768 -15254 -18387 -19702 -18699 -18481 -16776 -16362 -15393 -12897 -11693 -13412 -14386 -10317 -3802
16013 -3802 2565 6736 13151 19126 23966 29701 32831 30140 26583 25951 27956 28345 29207 29061 27137 24248
15997 24248 20961 16225 11674 10187 10201 14617 14706 12878 12601 10080 10948 8339 6535 12616 15405 16879
15981 16879 17236 18991 24951 28377 31219 37660 50869 66926 83554 108714 133775 156293 174758
15968 174758 185315 191080 187238 171824 154903 135783 121164 109047 94798 85998 81102 77208
15956 77208 73215 72315 73667 77654 84996 93163 107122 122036 138070 163286 192671 224228 267847
15943 267847 321216 384909 461037 553831 651266 729243 809055 899375 992616 1093825 1234539
15932 1234539 1411216 1539530 1499462 1354565 1217754 1138492 1091015 1026153 940257 864899
$$ packed form
16029h529j251j988l486l133j315J003K18J705M14R69K496J204j719r74M069O515
16013c802O367M171O415N975M840N735L130k691l557o32K005L89Q62j46j924k889
15997B4248l287m736m551j487J4M416Q9j828k77k521Q68k609j804O081K789J474
15981A6879L57J755N960L426K842O441J3209J6057J6628K5160K5061K2518J8465
15968A74758J0557N765l842j5414j6921j9120j4619j2117j4249q800m896l894
15956G7208l993r00J352L987P342Q167J3959J4914J6034K5216K9385L1557M3619
15943B67847N3369O3693P6128R2794R7435P7977P9812R0320R3241J01209J40714
15932A234539J76677J28314m0068j44897j36811p9262m7477o4862q5896p5358
$$ plain form
15922 864899 807797 739293 666381 609856 566594 539198 528930 532093 548950 570311 600699 645438
15910 645438 701265 769984 848378 937513 1028308 1122221 1224487 1335032 1443712 1571226 1719802
15899 1719802 1870887 2041785 2240374 2481172 2809680 3273833 3952410 4939132 6345896
15890 6345896 8263168 10788683 13741666 17142236 20970963 24887459 29277351 34259538
15882 34259538 39688916 45034162 50775296 55550473 58569352 61367936 62574746 62948930
15874 62948930 63133533 63204739 61771812 59425342 56362606 51263244 45944485 40612409
15866 40612409 35385406 30603514 26398917 22405910 18555995 15135360 12110484 9638665
15858 9638665 7773689 6410138 5430424 4724303 4194104 3789031 3471385 3208643 2987686
$$ packed form
15922H64899n7102o8504p2912n6525m3262k7396j0268L163J6857K1361L0388M4739
15910F45438N5827O8719P8394Q9135R0795R3913J02266J10545J08680J27514J48576
15899A719802J51085J70898J98589K40798L28508M64153O78577R86722J406764
15890F345896J917272K525515K952983L400570L828727L916496M389892M982187
15882C4259538N429378N345246N741134M775177L018879K798584J206810L74184
15874F2948930J84603P1206j432927k346470l062736n099362n318759n332076
15866D0612409n227003m781892m204597l993007l849915l420635l024876k471819
15858I638665j864976j363551r79714p06121n30199m05073l17646k62742k20957
$$ plain form
15849 2987686 2789906 2607754 2427134 2269473 2129188 1996859 1873382 1760607 1657373
15840 1657373 1561257 1475281 1394745 1320626 1250120 1181114 1110290 1045146 980775 920700 865542
15829 865542 816376 770403 724017 683970 650682 621901 597134 578720 566042 555179 550112 555009
15817 555009 556833 559975 561699 568987 579366 587746 593010 598948 602287 604246 602000 601179 597705 596612
15803 596612 599368 601949 597005 587023 580222 575633 576349 572032 563479 556448 546183 535118 517196 494415
15789 494415 476048 474456 480452 492431 507685 527788 551330 578752 612311 652575 697796 742218
15777 742218 772111 793649 807160 811582 814608 818799 814442 800175 783489 750902 708168 669446
15765 669446 635549 606350 577040 539663 512541 490666 472939 455148 440686 432432 431656 429187
$$ packed form
15849B987686j97780j82152j80620j57661j40285j32329j23477j12775j03234
15840A657373r6116q5976q0536p4119p0506o9006p0824o5144o4371o0075n5158
15829H65542m9166m5973m6386m0047l3288k8781k4767j8414j2678j0863n067M897
15817E55009J824L142J724P288J0379Q380N264N938L339J959k246q21l474j093
15803E96612K756K581m944r982o801m589P16m317q553p031j0265j1065j7922k2781
15789D94415j8367j592N996J1979J5254K0103K3542K7422L3559M0264M5221M4422
15777G42218K9893K1538J3511M422L026M191m357j4267j6686l2587m2734l8722
15765F69446l3897k9199k9310l7377k7122k1875j7727j7791j4462q254p76k469
$$ plain form
15753 429187 433400 436816 442421 453645 469600 486428 509611 530981 546897 552466 552284 548968 544102
15740 544102 536868 528495 516594 490626 454778 417678 383378 348037 313062 285016 260928 238308
15728 238308 220458 204956 194873 185705 175531 166996 159358 153010 148688 141790 135450 128657 126941
15715 126941 127038 124148 119271 114298 110721 108556 112073 115773 116167 113154 116055 118714 117201 113340 115102
15700 115102 116072 117778 118689 113288 108077 106275 108689 114698 117670 118713 115878 115161 119040 121183 121570
15685 121570 118543 112962 109925 111494 111162 106291 101807 103870 101892 102036 102766 100686 99339 98212 99563
15670 99563 100208 95731 89062 86961 89159 92261 90092 87051 83261 80699 75385 73002 71273 70792 70088
15655 70088 66389 61569 61301 65188 64338 61149 59676 60567 61913 59269 53784 57783 60266 55888 53359
$$ packed form
15753D29187M213L416N605J1224J5955J6828K3183K1370J5916N569j82l316m866
15740E44102p234q373j1901k5968l5848l7100l4300l5341l4975k8046k4088k2620
15728B38308j7850j5502j0083r168j0174q535p638o348m322o898o340o793j716
15715A26941R7k890m877m973l577k165L517L700L94l013K901K659j513l861J762
15700A15102R70J706R11n401n211j802K414O009K972J043k835p17L879K143L87
15685A21570l027n581l037J569l32m871m484K063j978J44P30k080j347j127J351
15670I9563O45m477o669k101K198L102k169l041l790k562n314k383j729m81p04
15655G0088l699m820k68L887q50l189j473Q91J346k644n485L999K483m378k529
$$ plain form
15640 53359 51820 56686 51564 47377 49577 53128 53223 48360 49239 52277 53597 47612 44714 46431 52049
15625 52049 50387 52560 52555 51090 49105 48776 49025 52449 52897 53865 55466 53820 51636 50292 51930 50563
15609 50563 48205 47227 48331 46538 51414 50454 50029 47811 43238 43283 44318 43120 40407 43324 43151 41978
15593 41978 43574 45185 48273 49657 51003 52653 51767 51583 51467 52773 54412 52878 53204 53370 55013 55400
15577 55400 55677 56223 52888 52126 52228 44978 46526 45988 47825 45973 42367 35117 35261 37347 42207 43128
15561 43128 39598 37028 35560 34062 33555 34042 32525 31206 25870 23663 26871 26264 29179 31040 31621
15546 31621 34543 35352 37536 40327 38693 40994 45606 47597 50297 55062 53359 52291 53637 56638 56316
15531 56316 51582 48005 43550 40995 40091 35880 31916 27720 22634 21294 21882 18784 20491 22735 23224
$$ packed form
15640E3359j539M866n122m187K200L551R5m863Q79L038J320n985k898J717N618
15625E2049j662K173nj465j985l29K49L424M48R68J601j646k184j344J638j367
15609E0563k358r78J104j793M876r60m25k218m573M5J035j198k713K917j73j173
15593D1978J596J611L088J384J346J650q86j84j16J306J639j534L26J66J643L87
15577E5400K77N46l335p62J02p250J548n38J837j852l606p250J44K086M860R21
15561D3128l530k570j468j498n07M87j517j319n336k207L208o07K915J861N81
15546C1621K922Q09K184K791j634K301M612J991K700M765j703j068J346L001l22
15531E6316m734l577m455k555r04m211l964m196n086j340N88l098J707K244M89
$$ plain form
15516 23224 23071 23059 20550 18964 17632 16708 16458 16176 10359 9830 6016 9685 12498 11731 10728 11534 14343
15499 14343 15369 17507 14558 12729 10308 11604 14915 18067 20592 13558 8412 8503 3988 98 5674
15484 5674 6037 5973 6170 5132 9156 11469 11237 12479 10969 6700 5031 6093 8821 8939 6027 5801
15468 5801 4527 6791 8365 7093 7523 8541 10223 15481 13857 14439 15474 11218 10276 11764 11763 9264
15452 9264 10117 14031 17561 17796 14938 14470 15572 13477 13323 16759 17499 16959 17452 17477 13014 10131 14280
15435 14280 15781 14477 12527 14047 16729 17311 10396 5115 6402 5400 7419 9281 6278 6751 8967
15420 8967 10187 8353 8356 8845 6458 5308 6724 8104 8792 3036 1147 5435 4723 9012 11734 9333
15404 9333 7195 4541 6472 11732 9668 8036 13230 14227 12118 14115 15389 10285 9313 10744 15440
$$ packed form
15516B3224j53j2k509j586j332r24k50k82n817n29l814L669K813p67j003Q06K809
15499A4343J026K138k949j829k421J296L311L152K525p034n146R1m515l890N576
15484E674L63o4J97j038M024K313k32J242j510m269j669J062K728J18k912k26
15468E801j274K264J574j272M30J018J682N258j624N82J035m256r42J488jk499
15452I264Q53L914L530K35k858m68J102k095j54L436P40n40M93K5m463k883M149
15435A4280J501j304j950J520K682N82o915n281J287j002K019J862l003M73K216
15420H967J220j834LM89k387j150J416J380O88n756j889M288p12M289K722k401
15404I333k138k654J931N260k064j632N194R97k109J997J274n104r72J431M696
$$ plain form
15389 15440 17390 15635 16794 18661 15678 16084 16998 13893 16482 16628 17105 16846 14783 8871 5390 7689
15373 7689 10118 10464 11423 11566 11180 7975 7808 9579 10749 13885 13200 12270 11531 10749 10788 13060 19074
15356 19074 23847 20827 19212 22384 23874 27939 30625 41361 59603 74760 93450 118413 142536
15343 142536 164021 193024 224831 253169 281822 310970 331863 346184 352228 358289 363210 361219
15331 361219 356357 347967 329503 301552 268162 232294 202150 175908 155104 132326 104702 84314
15319 84314 70000 56922 47708 44176 41527 39789 34963 32731 30523 29526 28006 29231 34345 34526
15305 34526 33531 34661 37645 37169 37286 38043 36653 39235 40323 43356 46041 48260 58525 73196 85653
15290 85653 99071 115850 138226 163715 190931 219189 246305 269063 290482 308226 322116 331096
$$ packed form
15389A5440J950j755J159J867k983M06R14l105K589J46M77k59k063n912l481K299
15373G689K429L46R59J43l86l205j67J771J170L136o85r30p39p82L9K272O014
15356A9074M773l020j615L172J490M065K686J0736J8242J5157J8690K4963K4123
15343A42536K1485K9003L1807K8338K8653K9148K0893J4321O044O061M921j991
15331C61219m862q390j8464k7951l3390l5868l0144k6242k0804k2778k7624k0388
15319H4314j4314j3078r214l532k649j738m826k232k208r97j520J225N114J81
15305C4526r95J130K984m76J17P57j390K582J088L033K685K219J0265J4671J2457
15290H5653J3418J6779K2376K5489K7216K8258K7116K2758K1419J7744J3890Q980
$$ plain form
15278 331096 338859 338197 340192 339500 327226 310598 296340 278251 259903 246867 236156 228925 223328
15265 223328 220142 217690 217931 213886 210506 207031 204857 203996 200723 194413 184644 175919 165569 151733
15251 151733 138554 122168 108860 100393 92069 85561 74405 63502 55580 50121 44417 42230 39959
15238 39959 36150 33175 34554 32652 29795 27346 26447 27096 22354 19244 15752 12182 13909 17733 20673
15223 20673 21910 21322 20218 17194 12802 13064 15954 18449 14878 11991 13230 8383 8947 12643 15782
15208 15782 17517 19070 18868 15668 14608 12014 10786 13542 13040 17644 19472 20789 19000 19112 17083
15193 17083 16135 21365 27346 25981 22247 17546 18934 22291 24077 26155 27107 25747 30370 24103 18533
15178 18533 16500 15949 8169 2869 5652 8956 9739 10166 11656 15759 15132 11171 9597 7068 4933
$$ packed form
15278C31096P763o62J995o92j2274j6628j4258j8089j8348j3036j0711p231n597
15265B23328l186k452K41m045l380l475k174q61l273o310r769q725j0350j3836
15251A51733j3179j6386j3308q467q324o508j1156j0903p922n459n704k187k271
15238C9959l809k975J379j902k857k449q99O49m742l110l492l570J727L824K940
15223B0673J237n88j104l024m392K62K890K495l571k887J239m847N64L696L139
15208A5782J735J553k02l200j060k594j228K756n02M604J828J317j789J12k029
15193A7083r48N230N981j365l734m701J388L357J786K078R52j360M623o267n570
15178A8533k033n51p780n300K783L304P83M27J490M103o27l961j574k529k135
$$ plain form
15163 4933 -231 4280 5656 7465 6090 8341 6415 4162 3407 1627 1649 2083 4004 4103 -24 3067
15147 3067 7810 6156 7284 5926 8817 10650 9931 10483 8864 7784 6699 4940 3677 2612 3055
15132 3055 4915 3996 779 227 1444 4330 4234 2600 86 -625 338 2257 4001 6596 7662 4499
15116 4499 4310 1794 -322 368 -2037 -3696 -5956 -5880 -3330 -3360 -2065 467 2790 4967 3871 5011
15100 5011 6672 5601 1656 1906 2087 2155 -728 -7140 -10460 -6687 -5864 -234 4470 9885 10644 7823
15084 7823 8155 12095 12881 11354 9039 8142 9511 13348 12144 11486 13053 10007 8357 7611 6909 5404
15068 5404 8292 6023 5354 6606 527 1730 2433 2913 1107 1592 3316 1300 2237 2046 3081 4441
15052 4441 5376 1618 1443 3140 1527 3507 400 14 2664 4681 6203 5735 7842 12373 14827 15366
$$ packed form
15163D933n164M511J376J809j375K251j926k253p55j780K2M34J921R9m127L091
15147C067M743j654J128j358K891J833p19N52j619j080j085j759j263j065M43
15132C055J860r19l217n52J217K886r6j634k514p11R63J919J744K595J066l163
15116D499j89k516k116O90k405j659k260P6K550l0J295K532K323K177j096J140
15100E011J661j071l945K50J81O8k883o412l320L773Q23N630M704N415P59k821
15084G823L32L940P86j527k315q97J369L837j204o58J567l046j650p46p02j505
15068E404K888k269o69J252o079J203P03M80j806M85J724k016R37j91J035J360
15052D441R35l758j75J697j613J980l107l86K650K017J522m68K107M531K454N39
$$ plain form
15036 15366 12086 9794 8328 4263 3937 6327 8508 10641 15718 19093 17678 19606 18409 9944 6287
15021 6287 6032 7920 13210 8162 7414 7746 8267 11076 13021 11914 10439 9607 8623 9928 12526 9206
15005 9206 6461 6963 6258 5869 5974 10565 14788 13093 8468 3488 -2876 -4625 -2522 -306 2071 1055
14989 1055 561 -583 -2707 -3330 -2403 -3469 -1451 4055 5735 6463 5738 4548 4538 3489 -418 -3069
14973 -3069 -4641 -3653 -1837 1421 -320 3060 1114 -3751 -1701 -1564 -4247 -515 1431 2233 -1487
14958 -1487 -4442 -2810 -3492 -2806 -497 4656 3098 1235 -206 1042 2834 -757 -991 1307 281
14943 281 -3657 -4334 -2077 -1366 -3875 -546 549 -614 1578 6795 6345 7133 8932 8983 12374 16393
14927 16393 19759 21703 19172 16358 16616 12563 12177 12994 15289 19896 21095 17812 14581 16391 16824
$$ packed form
15036A5366l280k292j466m065l26K390K181K133N077L375j415J928j197q465l657
15021F287k55J888N290n048p48L32N21K809J945j107j475q32r84J305K598l320
15005I206k745N02p05l89J05M591M223j695m625m980o364j749K103K216K377j016
14989A055m94j144k124o23R27j066K018N506J680P28p25j190j0j049l907k651
14973c069j572R88J816L258j741L380j946m865K050J37k683L732J946Q02l720
14958a487k955J632o82O86K309N153j558j863j441J248J792l591k34K298j026
14943B81l938o77K257P11k509L329J095j163K192N217m50P88J799N1L391M019
14927A6393L366J944k531k814K58m053l86Q17K295M607J199l283l231J810M33
$$ plain form
14912 16824 12940 13079 12171 8087 2196 2528 5645 3211 -1537 -5456 -8764 -8505 -856 2876 -87
14897 -87 -2565 -2179 653 4242 2726 -717 689 371 1518 2694 2915 -856 -839 487 -655 -419 3012
14880 3012 6881 8969 7301 6501 7239 3551 1316 -3523 -3598 2250 6832 7930 6184 1534 616 170
14864 170 3616 2996 1313 199 1396 550 5586 3361 2379 4708 5545 6468 7659 10039 7385 7239
14848 7239 3804 219 -1289 -1011 271 -105 2671 2655 807 913 1980 -975 -868 4356 -1147 -4283
14832 -4283 -3728 334 2663 3715 8247 5739 5429 4650 2608 6562 4902 2779 2098 6058 3470 6545
14816 6545 10257 8592 5080 5226 4129 85 -1715 -1079 -367 -334 368 3255 5204 5280 4818 5939 9679
14799 9679 12830 11030 10133 7391 5615 5587 6521 7794 7725 5628 6233 7774 7881 8081 5653 6191 7437
$$ packed form
14912A6824l884J39r08m084n891L32L117k434m748l919l308K59P649L732k963
14897h7k478L86K832L589j516l443J406l18J147J176K21l771J7J326j142K36L431
14880C012L869K088j668q00P38l688k235m839p5N848M582J098j746m650r18m46
14864A70L446o20j683j114J197q46N036k225r82K329Q37R23J191K380k654j46
14848G239l435l585j508K78J282l76K776j6j848J06J067k955J07N224n503l136
14832d283N55M062K329J052M532k508l10p79k042L954j660k123o81L960k588L075
14816F545L712j665l512J46j097m044j800O36P12L3P02K887J949P6m62J121L740
14799I679L151j800q97k742j776k8R34J273o9k097O05J541J07K00k428N38J246
$$ plain form
14782 7437 9198 6582 8813 7589 10063 6210 2300 1546 4923 5939 3414 1459 3329 7170 8865
14767 8865 10679 11817 8211 9547 8674 7846 10476 11691 9319 7001 9934 8092 7138 8588 7965 8410
14751 8410 4620 2110 5631 6930 5627 5944 5160 3051 6451 10240 11702 11962 9923 7978 9130
14736 9130 8553 9262 12648 14788 16566 19653 14420 7346 6056 5914 8749 11247 10378 10374 8023 5541
14720 5541 8286 9925 8228 11545 14351 11715 7536 2043 1471 4471 5923 5487 7378 7981 12015
14705 12015 12769 12754 13071 9404 9505 11448 15716 18298 17208 18434 16016 10601 6079 6828 10123 9077
14689 9077 6895 8347 7476 9001 11895 9877 8128 11059 12988 12656 7261 9245 8929 10682 13341
14674 13341 16065 16581 18808 19568 17525 13883 12682 14030 13755 12608 15053 13454 9143 8734 4463
$$ packed form
14782G437J761k616K231j224K474l853l910p54L377J016k525j955J870L841J695
14767H865J814J138l606J336q73q28K630J215k372k318K933j842r54J450o23M45
14751H410l790k510L521J299j303L17p84k109L400L789J462K60k039j945J152
14736I130n77P09L386K140J778L087n233p074j290j42K835K498q69mk351k482
14720E541K745J639j697L317K806k636m179n493n72L000J452m36J891O03M034
14705A2015P54j5L17l667J01J943M268K582j090J226k418n415m522P49L295j046
14689I077k182J452q71J525K894k018j749K931J929l32n395J984l16J753K659
14674A3341K724N16K227P60k043l642j201J348k75j147K445j599m311m09m271
$$ plain form
14659 4463 2420 6807 10435 8962 7623 8370 8937 10304 7930 5751 7917 12619 17906 18935 20427
14644 20427 18331 14685 13703 12785 10094 11903 10538 12208 13688 14498 13516 17524 20285 19803 20980 18949
14628 18949 16313 18366 21309 23490 21091 23873 21481 20604 23581 21267 19948 16339 17488 22106 24834
14613 24834 23581 23895 21184 18863 18282 19506 20520 17966 14791 13926 22604 20914 17998 17460 15518
14598 15518 14243 13691 15351 18339 20788 22450 26122 28851 27267 26204 26561 25799 22762 24698 28590
14583 28590 25258 20861 20168 20116 19548 19225 18177 19605 23552 21451 20187 18085 19277 19428 23342 26645
14567 26645 23394 19935 20306 20580 17827 17470 21747 21028 21695 22612 24302 22390 20145 20655 21049 22857
14551 22857 24948 25338 22180 22720 28193 24860 25252 27421 28374 28461 29840 33464 34108 39698 40888 37611
$$ packed form
14659D463k043M387L628j473j339P47N67J367k374k179K166M702N287J029J492
14644B0427k096l646r82r18k691J809j365J670J480Q10r82M008K761m82J177k031
14628A8949k636K053K943K181k399K782k392q77K977k314j319l609J149M618K728
14613B4834j253L14k711k321n81J224J014k554l175q65Q678j690k916n38j942
14598A5518j275n52J660K988K449J662L672K729j584j063L57p62l037J936L892
14583B8590l332m397o93n2n68l23j048J428L947k101j264k102J192J51L914L303
14567B6645l251l459L71K74k753l57M277p19O67R17J690j912k245N10L94J808
14551B2857K091L90l158N40N473l333L92K169R53Q7J379L624O44N590J190l277
$$ plain form
14535 37611 39226 37460 32940 31029 32268 30129 26249 23247 21370 24714 27496 26858 24820 24523 24699
14520 24699 24466 27283 30228 31682 28873 31541 28730 25388 25928 26873 27863 26874 25859 23784 20708 22506
14504 22506 26348 27376 31504 37293 36805 35768 30970 25999 28776 28653 28364 30408 29451 25826 24014
14489 24014 27320 29677 33120 33502 35392 33967 28457 29552 28526 26753 26714 29856 31090 31117 32081 33739
14473 33739 33786 28811 26433 27107 28773 31927 32136 34097 33036 35615 36271 37080 40625 40310 40100 40435 40021
14456 40021 34205 33877 33939 32397 34574 36627 38664 39850 37502 34868 34644 42662 46125 47083 45290 45831
14440 45831 49156 50674 48975 45462 44108 46720 49510 49306 50056 52065 53350 56931 57329 58040 58725 60290
14424 60290 60898 60584 59284 60390 58965 57247 55473 57382 60274 60725 54194 54216 56317 56653 56567 57051 52591
$$ packed form
14535C7611J615j766m520j911J239k139l880l002j877L344K782o38k038k97J76
14520B4699k33K817K945J454k809K668k811l342N40R45R90r89j015k075l076J798
14504B2506L842J028M128N789m88j037m798m971K777j23k89K044r57l625j812
14489B4014L306K357L443L82J890j425n510J095j026j773l9L142J234K7R64J658
14473C3739M7m975k378O74J666L154K09J961j061K579O56Q09L545l15k10L35m14
14456D0021n816l28O2j542K177K053K037J186k348k634k24Q018L463R58j793N41
14440D5831L325J518j699l513j354K612K790k04P50K009J285L581L98P11O85J565
14424F0290O08l14j300J106j425j718j774J909K892M51o531K2K101L36q6M84m460
$$ plain form
14407 52591 50132 51214 52186 53574 58146 61165 66173 74052 86308 96576 108500 120783 134950
14394 134950 141799 141514 135896 125930 110153 96950 85634 74024 64185 65086 65698 62803 60634 58216
14380 58216 56376 57781 57797 58942 64694 66596 66388 61668 58784 59670 56233 53405 52018 50843 49318
14365 49318 49712 53561 54553 54003 51197 50511 49920 53002 54462 53312 49887 49060 53409 58594 67509 68396
14349 68396 67476 65753 63553 61974 62105 62028 60808 57282 56004 57820 59326 57933 54230 47189 44209
14334 44209 47531 46363 44623 44447 46196 47103 54228 60479 69648 74810 77395 78582 73493 70520 64787
14319 64787 63421 64165 67579 71138 71608 76116 82002 87330 91846 91537 87248 85605 82233 76693 72441
14304 72441 72030 66849 66771 73020 80161 87461 95423 102623 103917 101673 96102 85859 76935 73591 69779
$$ packed form
14407E2591k459J082R72J388M572L019N008P879J2256J0268J1924J2283J4167
14394A34950O849k85n618r966j5777j3203j1316j1610r839R01O12k895k169k418
14380E8216j840J405J6J145N752J902k08m720k884Q86l437k828j387j175j525
14365D9318L94L849R92n50k806o86n91L082J460j150l425q27M349N185Q915Q87
14349F8396r20j723k200j579J31p7j220l526j278J816J506j393l703p041k980
14334D4209L322j168j740j76J749R07P125O251R169N162K585J187n089k973n733
14319F4787j366P44L414L559M70M508N886N328M516l09m289j643l372n540m252
14304G2441m11n181p8O249P141P300P962P200J294k244n571j0243q924l344l812
$$ plain form
14289 69779 65036 63849 61360 60015 64280 66764 68002 74092 80038 87102 91405 90940 90213 87412 79406
14274 79406 72612 69298 74188 72664 73919 80228 86871 90237 89486 91119 90397 90507 90386 93970 97960
14259 97960 96082 99575 104934 103949 103863 100641 97860 93746 93086 95363 100500 110189 120885 124079 118137
14244 118137 114695 109739 106290 100790 95960 101897 110793 115307 118034 117271 113037 107631 106146 103441
14230 103441 105481 106465 109081 116344 116543 115593 113680 107905 100221 96166 96276 101792 104231 103516 104526
14215 104526 107134 107245 106349 112269 115915 120080 119602 120994 123955 127386 128110 127399 130665 133726 139065
14200 139065 138021 134684 138058 139825 141052 141282 144755 145461 149213 150487 150731 153666 157805 164348 169886
14185 169886 170815 171522 173138 177999 180215 185851 191457 194015 199793 202959 199273 198166 197909 199362 201035
$$ packed form
14289F9779m743j187k489j345M265K484J238O090N946P064M303m65p27k801q006
14274G9406o794l314M890j524J255O309O643L366p51J633p22J10j21L584L990
14259I7960j878L493N359r85q6l222k781m114o60K277N137R689J0696L194n942
14244A18137l442m956l449n500m830N937Q896M514K727p63m234n406j485k705
14230A03441K040R84K616P263J99r50j913n775p684m055J10N516K439p15J010
14215A04526K608J11q96N920L646M165m78J392K961L431P24p11L266L061N339
14200A39065j044l337L374J767J227K30L473P06L752J274K44K935M139O543N538
14185A69886R29P07J616M861K216N636N606K558N778L166l686j107k57J453J673
$$ plain form
14170 201035 200429 207335 210436 213570 224501 234228 243886 260162 277882 295701 316891 338236 353614
14157 353614 368918 379708 382747 382282 378830 376205 372992 361847 346553 327632 309981 299089 285129
14144 285129 273898 267189 258190 251321 245250 238712 235636 231569 228956 229258 228143 229451 231908 229033
14130 229033 224357 226595 231931 236007 240035 246661 253248 263240 274167 289943 305844 321835 341188
14117 341188 365473 397807 426199 449195 472056 491999 505290 509072 511139 506049 504333 498038
14105 498038 483331 456002 426399 399578 377336 351193 327774 303080 283198 272754 261816
14094 261816 246845 238693 234046 232023 230974 229583 226512 219721 216322 215386 213371 209328 208860 207371
14080 207371 208903 210207 208839 201906 198621 199477 204377 207555 204919 200010 197579 194018 190681 193257
$$ packed form
14170B01035o06O906L101L134J0931R727R658J6276J7720J7819K1190K1345J5378
14157C53614J5304J0790L039m65l452k625l213j1145j5294j8921j7651j0892j3960
14144B85129j1231o709q999o869o071o538l076m067k613L02j115J308K457k875
14130B29033m676K238N336M076M028O626O587R992J0927J5776J5901J5991J9353
14117C41188K4285L2334K8392K2996K2861J9943J3291L782K067n090j716o295
14105D98038j4707k7329k9603k6821k2242k6143k3419k4694j9882j0444j0938
14094B61816j4971q152m647k023j049j391l071o791l399r36k015m043m68j489
14080B07371J532J304j368o933l285Q56M900L178k636m909k431l561l337K576
$$ plain form
14066 193257 191569 183941 187674 188577 187983 186888 186981 185238 184167 186275 188280 182628 178499 181805 186837
14051 186837 183645 179410 179763 180011 181015 176310 176130 179491 180835 180488 180220 177588 177182 178469 177533 178173
14035 178173 178538 175565 174385 177067 176053 178601 179211 180039 174944 173985 173630 172342 171504 168300 167209 166891
14019 166891 172153 171741 172490 170129 166884 172807 176391 176917 173429 169215 164136 164598 168890 172388 175471
14004 175471 175135 175129 174699 174948 176890 175973 176210 171668 168850 167139 167887 165147 162946 165044 165792 167703 169640
13987 169640 172374 171035 164527 163354 163926 164791 165089 166443 163554 162046 156802 161950 164707 161589 161672
13972 161672 163147 161558 162782 164824 165375 166369 167537 164210 161507 162594 168284 167829 169188 174087 177840
13957 177840 179546 182440 191440 197386 201984 206603 207233 212290 217600 226394 234325 242353 254655 270975
$$ packed form
14066A93257j688p628L733R03n94j095R3j743j071K108K005n652m129L306N032
14051A86837l192m235L53K48J004m705j80L361J344l47k68k632m06J287r36O40
14035A78173L65k973j180K682j014K548O10Q28n095r59l55j288q38l204j091l18
14019A66891N262m12P49k361l245N923L584N26l488m214n079M62M292L498L083
14004A75471l36om30K49J942r17K37m542k818j711P48k740k201K098P48J911J937
13987A69640K734j339o508j173N72Q65K98J354k889j508n244N148K757l118Q3
13972A61672J475j589J224K042N51R94J168l327k703J087N690m55J359M899L753
13957A77840J706K894R000N946M598M619O30N057N310Q794P931Q028J2302J6320
$$ plain form
13943 270975 293442 321730 355113 394139 433611 472717 510082 539190 561353 571811 575365 576414
13931 576414 569172 555819 534258 502935 463229 427209 390755 357847 329565 300227 270692 250823
13919 250823 231000 215968 206356 195910 187751 185356 186112 182125 182018 179054 176295 173789 171850 171757
13905 171757 173687 175049 174400 173650 173059 176059 173085 167397 161001 155246 152009 147401 142540 139335 138760
13890 138760 137236 134860 135404 135939 137203 139496 140630 139023 136141 132396 128667 128319 127749 124411 123258
13875 123258 124428 126945 124484 121214 125150 125184 126403 130802 130392 128701 127049 126930 132923 134485 134407 128597
13859 128597 127089 125946 125486 128155 127487 123230 121655 121931 116902 120370 124147 121457 119686 121051 122355
13844 122355 120335 121163 119277 118694 117824 116881 118836 117443 115593 114840 113643 109867 109532 113351 113158 109669
$$ packed form
13943B70975K2467K8288L3383L9026L9472L9106L7365K9108K2163J0458L554J049
13931E76414p242j3353k1561l1323l9706l6020l6454l2908k8282k9338k9535j9869
13919B50823j9823j5032r612j0446q159k395P56l987j07k964k759k506j939r3
13905A71757J930J362o49p50n91L000k974n688o396n755l237m608m861l205n75
13890A38760j524k376N44N35J264K293J134j607k882l745l729l48n70l338j153
13875A23258J170K517k461l270L936L4J219M399m10j691j652j19N993J562p8n810
13859A28597j508j143m60K669o68m257j575K76n029L468L777k690j771J365J304
13844A22355k020Q28j886n83q70r43J955j393j850p53j197l776l35L819j93l489
$$ plain form
13828 109669 105666 109923 115596 115391 111885 108021 110963 108452 104962 107429 105114 107318 108649 109383 106623
13813 106623 105573 106740 107240 106866 109969 109425 106228 104099 106105 110865 111993 112085 108655 104978 99586
13798 99586 98880 98110 99250 104170 103791 104642 109973 106889 101345 97299 98725 94753 92495 92796 93641 97028
13782 97028 96922 99999 101650 103820 109642 111004 107073 105328 103296 105894 105865 103022 100910 100500 98846
13767 98846 98480 98806 95764 96146 100706 101672 98005 93104 94165 94935 93597 93023 94315 96089 96568 96392
13751 96392 95980 94828 93752 88999 89562 91737 91004 95825 97517 96098 91713 92823 96280 97475 96377
13736 96377 95112 96475 99312 99215 98824 98844 98502 94313 92127 90653 90724 92999 90093 89895 89701 93115 94730
13719 94730 97346 99202 100065 108360 118955 121998 121564 119391 113976 109091 104635 103739 102126 97284 93383
$$ packed form
13828A09669m003M257N673k05l506l864K942k511l490K467k315K204J331P34k760
13813A06623j050J167N00l74L103n44l197k129K006M760J128R2l430l677n392
13798I9586p06p70J140M920l79Q51N331l084n544m046J426l972k258L01Q45L387
13782I7028j06L077J651K170N822J362l931j745k032K598k9k843k112m10j654
13767I8846l66L26l042L82M560R66l667m901J061P70j338n74J292J774M79j76
13751I6392m12j152j076m753N63K175p33M821J692j419m385J110L457J195j098
13736I6377j265J363K837r7l91K0l42m189k186j474P1K275k906j98j94L414J615
13719I4730K616J856Q63Q295J0595L043m34k173n415m885m456q96j613m842l901
$$ plain form
13704 93383 93770 90503 86261 88618 89245 85835 85952 85687 85244 84639 82382 82456 81365 82994 87094 87972 88361
13687 88361 90091 88886 87336 85308 85403 89893 90844 86184 87453 91877 91718 87070 86251 86749 81415 81628
13671 81628 83997 86824 89233 90537 89868 87578 89663 88551 89508 92802 93603 91184 87142 83174 82911
13656 82911 83008 84168 82661 82428 85337 88145 88023 92227 95640 95473 95368 92136 91523 98040 103277 103626
13640 103626 105266 110418 117103 121454 130831 132761 133082 134294 134371 134440 135442 137880 136591 134265 129719
13625 129719 126912 124808 122457 118296 110785 108961 110156 113941 115787 115308 112414 111483 109810 108605 107754
13610 107754 109677 107361 95797 88612 85074 82936 79450 78491 80118 83273 86994 87199 84226 85173 80850
13595 80850 77011 78031 77352 74581 70642 70220 68960 75646 79423 80497 79760 78711 77663 78115 76372
$$ packed form
13704I3383L87l267m242K357O27l410J17k65m43o05k257P4j091J629M100Q78L89
13687H8361J730j205j550k028R5M490R51m660J269M424j59m648q19M98n334K13
13671H1628K369K827K409J304o69k290K085j112R57L294Q01k419m042l968k63
13656H2911R7J160j507k33K909K808j22M204L413j67j05l232o13O517N237L49
13640A03626J640N152O685M351R377J930L21J212P7O9J002K438j289k326m546
13625A29719k807k104k351m161p511j824J195L785J846m79k894r31j673j205q51
13610A07754J923k316j1564p185l538k138l486r59J627L155L721K05k973R47m323
13595H0850l839J020o79k771l939m22j260O686L777J074p37j049j048M52j743
$$ plain form
13580 76372 69173 64263 65354 68425 66622 63248 67466 71171 72642 74147 77302 79931 79724 75701 72397
13565 72397 77106 76871 76876 79906 82725 88713 86209 85308 87374 87954 88905 92613 94575 96458 95954 103100
13549 103100 108715 112671 117889 124276 132194 139661 149758 166865 189727 224688 273078 333841 407403
13536 407403 498742 606367 714056 820556 921365 1004761 1068469 1111872 1139776 1152504 1158424
13525 1158424 1162116 1159498 1150113 1128624 1086450 1022563 940574 844776 743181 640116 539333
13514 539333 448338 372773 314480 269993 233956 210236 195349 182027 168432 155264 149813 147210
13502 147210 142591 139919 139152 140162 140997 141952 146846 152565 156382 163353 181306 205467 229953 257969
13488 257969 291939 332747 374562 411450 445159 472931 494550 509544 519173 523477 524475 526854
$$ packed form
13580G6372p199m910J091L071j803l374M218L705J471J505L155K629k07m023l304
13565G2397M709k35NL030K819N988k504r01K066N80R51L708J962J883n04P146
13549A03100N615L956N218O387P918P467J0097J7107K2862L4961M8390O0763P3562
13536D07403R1339J07625J07689J06500J00809Q3396O3708M3403K7904J2728N920
13525A158424L692k618r385k1489m2174o3887q1989r5798j01595j03065j00783
13514E39333r0995p5565n8293m4487l6037k3720j4887j3322j3595j3168n451k603
13502A47210m619k672p67J010Q35R55M894N719L817O971J7953K4161K4486K8016
13488B57969L3970M0808M1815L6888L3709K7772K1619J4994R629M304R98K379
$$ plain form
13476 526854 526108 518363 510727 501365 492370 482783 467044 450598 448507 455787 477792 517734 594187
13463 594187 730818 960308 1309315 1789093 2441557 3285527 4150253 4827480 4998478 4590152
13453 4590152 3909538 3100471 2349990 1766751 1315649 985333 765466 623253 531045 468928
13443 468928 422476 386664 356400 329285 305542 280663 254611 233109 215544 192609 172976
13432 172976 162497 152089 143001 135104 128597 122286 119959 116718 111630 108782 104039 99143 92306 87618
13418 87618 84135 88447 91539 88636 88663 92749 94797 94955 95178 94979 93738 91938 93709 94414 95626 96783
13402 96783 98676 99282 99211 98902 98225 94957 87581 84083 81745 81775 82192 77807 71742 67455 64363 62933
13386 62933 61594 61098 54351 55523 56163 55941 61563 64912 66099 68679 68490 65501 65498 64738 62702 62113 59843
$$ packed form
13476E26854p46p745p636r362q995r587j5739j6446k091P280K2005L9942P6453
13463E94187J36631K29490L49007M79778O52464Q43970Q64726O77227J70998m08326
13453D590152o80614q09067p50481n83239m51102l30316k19867j42213r2208o2117
13443D68928m6452l5812l0264k7115k3743k4879k6052k1502j7565k2935j9633
13432A72976j0479j0408r088p897o507o311k327l241n088k848m743m896o837m688
13418H7618l483M312L092k903K7M086K048J58K23j99j241j800J771P05J212J157
13402I6783J893O06p1l09o77l268p376l498k338L0M17m385o065m287l092j430
13386F2933j339m96o747J172O40k22N622L349J187K580j89k989lp60k036n89k270
$$ plain form
13369 59843 59258 58542 53970 54978 54117 53784 49914 46496 44617 44827 46554 48426 46741 45795 46329 47639
13353 47639 46369 40807 39226 41702 45015 48962 49179 49153 48348 50092 47761 47996 48598 48259 47622 45808
13337 45808 45375 44076 43635 45737 52396 48196 47351 47055 45801 47075 47190 46662 49030 47479 44055 43212
13321 43212 42638 45849 50387 48549 42343 40071 41821 45608 50578 53024 51696 51944 48868 44331 45680
13306 45680 47337 46867 45819 45522 44181 42700 43943 42301 39569 40403 43288 42827 37886 35852 38040
13291 38040 41355 41528 43771 43761 42663 45924 45520 45579 49796 52954 50452 51663 57480 59150 61241 65950
13275 65950 69340 73769 74982 72782 74026 73387 72860 75557 76060 76391 78574 73137 63238 59433 61371
13260 61371 63089 59920 61015 58042 55482 54042 52888 52793 54355 53292 51110 48121 45592 44476 43141
$$ packed form
13369E9843n85p16m572J008q61l33l870l418j879K10J727J872j685r46N34J310
13353D7639j270n562j581K476L313L947K17k6q05J744k331K35O02l39o37j814
13337D5808m33j299m41K102O659m200q45k96j254J274J15n28K368j551l424q43
13321D3212n74L211M538j838o206k272J750L787M970K446j328K48l076m537J349
13306D5680J657m70j048k97j341j481J243j642k732Q34K885m61m941k034K188
13291C8040L315J73K243j0j098L261m04N9M217L158k502J211N817J670K091M709
13275F5950L390M429J213k200J244o39n27K697N03L31K183n437r899l805J938
13260F1371J718l169J095k973k560j440j154r5J562j063k182k989k529j116j335
$$ plain form
13245 43141 45815 47266 48686 46655 48128 49889 54447 52690 46586 45489 46328 46816 45963 45457 42732
13230 42732 41206 37941 41908 42702 40373 36433 31087 34170 37609 41071 44690 42355 43061 41405 37547
13215 37547 35356 35050 38013 35633 34367 36201 36174 37534 33998 39217 42319 41334 38916 38665 35873 36150
13199 36150 39568 41552 38040 38683 37581 39008 42026 40569 39699 39380 41006 40016 40965 41068 40069 37382
13183 37382 38286 35679 33196 35023 34851 31132 31202 29120 30397 32056 30884 28875 29427 29475 30371 32210
13167 32210 34284 35825 34727 36288 37142 40158 40070 43239 46668 49898 54535 52530 53303 57196 56635 57305
13151 57305 61498 64799 70573 77574 91527 105102 113958 117423 123364 125876 125606 129175 130416 124842
13137 124842 116844 114887 112077 110070 110842 112974 114417 115087 117129 116736 111656 101132 93978 87534 86692
$$ packed form
13245D3141K674J451J420k031J473J761M558j757o104j097Q39M88q53n06k725
13230D2732j526l265L967P94k329l940n346L083L439L462L619k335P06j656l858
13215C7547k191l06K963k380j266J834k7J360l536N219L102r85k418k51k792K77
13199C6150L418J984l512O43j102J427L018j457q70l19J626r90R49J03r99k687
13183C7382R04k607k483J827j72l719P0k082J277J659j172k009N52M8Q96J839
13167C2210K074J541j098J561Q54L016q8L169L429L230M637k005P73L893n61O70
13151E7305M193L301N774P001J3953J3575Q856L465N941K512k70L569J241n574
13137A24842p998j957k810k007P72K132J443O70K042l93n080j0524p154o444q42
$$ plain form
13122 86692 87910 80982 76436 75898 75147 79389 82105 88069 96899 105986 114305 123602 132311 139166 140180
13107 140180 142150 143475 143135 135226 125010 117400 113049 116048 118456 120258 126961 136783 138173 133918
13093 133918 133002 130070 122022 113749 106117 96904 87439 84273 81486 77919 76574 78965 83755 90596
13079 90596 97209 98432 100551 112559 124394 133457 144084 158366 172936 183820 199889 212868
13067 212868 227467 244415 261495 275806 284179 284068 276343 258497 239561 215584 189476 167554
13055 167554 149503 136877 127764 121777 115052 113123 106024 101907 99479 99564 97853 94689 99557 106758
13041 106758 113666 118633 126712 133457 141558 151078 166036 183101 197829 211283 222778 233802 239301
13028 239301 234127 213835 191847 163475 136911 116721 101114 83824 69359 62165 60445 57794
$$ packed form
13122H6692J218o928m546n38p51M242K716N964Q830R087Q319R297Q709O855J014
13107A40180J970J325l40p909j0216p610m351K999K408J802O703R822J390m255
13093A33918r16k932q048q273p632r213r465l166k787l567j345K391M790O841
13079I0596O613J223K119J2008J1835R063J0627J4282J4570J0884J6069J2979
13067B12868J4599J6948J7080J4311Q373j11p725j7846j8936k3977k6108k1922
13055A67554j8051j2626r113n987o725j929p099m117k428Q5j711l164M868P201
13041A06758O908M967Q079O745Q101R520J4958J7065J4728J3454J1495J1024N499
13028B39301n174k0292k1988k8372k6564k0190j5607j7290j4465p194j720k651
$$ plain form
13016 57794 53145 48272 44420 43162 42164 42164 44013 44672 44836 45580 52053 59171 59337 54280 48185 45930
13000 45930 46906 44811 38086 32714 33752 38224 43659 44279 41065 40678 38156 36164 37664 35777 32045
12985 32045 32987 38014 38162 35781 32102 24700 22200 23034 19915 21936 20458 16720 19474 26591 27738
12970 27738 27569 25983 23811 25961 25590 27131 28996 30146 28256 27109 27510 30209 30956 28424 30726
12955 30726 35180 37000 36806 40259 44256 42246 38749 37801 34691 33602 29998 27430 29051 28612 27449
12940 27449 26456 27757 24174 20449 24137 26367 26396 28028 25081 25397 28158 29502 30203 31774 30804 32185
12924 32185 33618 31324 26986 27663 33652 34779 35703 35304 35556 35807 37052 32464 25960 27337 28764 30031
12908 30031 29981 27783 26538 23675 25278 26095 26585 25074 22986 27388 27119 26504 28817 31358 31036 30239
$$ packed form
13016E7794m649m873l852j258r98%J849O59J64P44O473P118J66n057o095k255
13000D5930R76k095o725n372J038M472N435O20l214l87k522j992J500j887l732
12985C2045R42N027J48k381l679p402k500Q34l119K021j478l738K754P117J147
12970B7738j69j586k172K150l71J541J865J150j890j147M01K699P47k532K302
12955C0726M454J820j94L453L997k010l497r48l110j089l604k568J621m39j163
12940B7449r93J301l583l725L688K230K9J632k947L16K761J344P01J571r70J381
12924C2185J433k294m338O77N989J127R24l99K52K51J245m588o504J377J427J267
12908C0031n0k198j245k863J603Q17M90j511k088M402k69o15K313K541l22p97
$$ plain form
12892 30239 31797 32763 32649 32591 28832 25703 25087 27231 25612 29793 31571 33611 34805 34935 33709 32364
12876 32364 32505 37350 37600 38230 38908 36658 35642 41145 43200 45659 50449 56577 61038 59159 59778 64002
12860 64002 70522 71992 73206 77499 80219 80734 87235 89467 92408 97849 102553 109045 109150 115984 127617
12845 127617 130718 133547 130295 122524 112685 105495 94953 76766 59446 43916 36280 34142 35765
12832 35765 36001 33511 30818 31179 28122 28005 31006 35076 35832 38012 42951 48258 53388 60810 72015
12817 72015 79894 84712 89830 86612 85156 78017 68763 59761 46484 32626 25639 20990 18244 12932
12803 12932 10613 9090 8475 7364 9233 10430 6148 239 -1256 -501 -1022 -332 -893 1185 8414 9828
12787 9828 9699 7268 8277 5931 3093 6729 7151 5315 9181 9367 4893 4275 4071 775 -2200 -869
$$ packed form
12892C0239J558R66j14n8l759l129o16K144j619M181J778K040J194J30j226j345
12876C2364J41M845K50O30O78k250j016N503K055K459M790O128M461j879O19M224
12860F4002O520J470J214M293K720N15O501K232K941N441M704O492J05O834J1633
12845A27617L101K829l252p771r839p190j0542j8187j7320j5530p636k138J623
12832C5765K36k490k693L61l057j17L001M070P56K180M939N307N130P422J1205
12817G2015P879M818N118l218j456p139r254r002j3277j3858o987m649k746n312
12803A2932k319j523o15j111J869J197m282n909j495P55n21O90n61K078P229J414
12787I828j29k431J009k346k838L636M22j836L866J86m474o18k04l296k975J331
$$ plain form
12771 -869 1817 -1674 -5464 -5037 -5264 -5903 -3433 -2679 -4339 -3078 -2010 -5185 -4418 -1670 -4686 -6529
12755 -6529 -6743 -6482 -4716 -4114 -3965 -1094 1664 -1028 -125 4780 530 -2382 -711 -2367 -6463 -4612
12739 -4612 -3956 -2245 -1 -719 -1188 1927 6053 5140 2816 1055 36 -419 -3007 -4619 -8349 -12817
12723 -12817 -11183 -4548 -938 1578 2020 3783 943 521 3987 2407 864 -824 -3225 -4495 -3933
12708 -3933 -3805 -570 -1141 -2752 -593 4169 5849 4943 5779 3668 2910 5591 1216 -836 1282 3198
12692 3198 851 -4866 -5030 -675 3655 3073 3307 2277 5259 5801 9024 8102 3126 -790 2518 5460
12676 5460 8733 8355 6329 7487 7378 8265 7465 4992 597 -4950 -3646 -2420 -1816 556 1601 4246
12660 4246 6812 14245 20066 26881 35032 39907 42688 46825 48783 50280 47688 42488 30795 19043
$$ packed form
12771h69K686l491l790M27k27o39K470P54j660J261J068l175P67K748l016j843
12755f529k14K61J766O02J49K871K758k692R03M905m250k912J671j656m096J851
12739d612O56J711K244p18m69L115M126r13k324j761j019m55k588j612l730m468
12723a2817J634O635L610K516M42J763k840m22L466j580j543j688k401j270N62
12708c933J28L235n71j611K159M762J680r06Q36k111p58K681m375k052K118J916
12692C198k347n717j64M355M330n82K34j030K982N42L223r22m976l916L308K942
12676E460L273l78k026J158j09Q87q00k473m395n547J304J226O04K372J045K645
12660D246K566P433N821O815Q151M875K781M137J958J497k592n200j1693j1752
$$ plain form
12646 19043 16729 9992 607 -621 -40 -4323 -7899 -8598 -10266 -5182 -4676 -3826 -2235 -6284 -4113
12631 -4113 584 1833 -88 -3363 -3669 6060 16567 24124 30282 33957 41028 46886 51378 56188 54959
12616 54959 50554 44599 36537 27197 20927 15352 11084 4828 -1370 -3240 -4480 -6200 -5447 -1473 2399
12601 2399 10935 17091 25403 32694 40687 42995 50765 60870 71349 92335 122626 162828 226428
12588 226428 325016 447348 600222 778511 941572 1064271 1164434 1202612 1148637 1055900
12578 1055900 922795 754248 593962 456757 342575 256908 199037 161074 135169 119177
12568 119177 103065 89319 77786 65916 54533 45198 39349 33551 30211 30349 29676 28360 25176
12555 25176 26462 31825 27720 26027 21823 18900 19652 18289 16533 15499 17846 25945 36649 48957
$$ packed form
12646A9043k314o737r385j228N81m283l576o99j668N084N06Q50J591m049K171
12631d113M697J249j921l275l06R729J0507P557O158L675P071N858M492M810j229
12616E4959m405n955q062r340o270n575m268o256o198j870j240j720P53L974L872
12601B399Q536O156Q312P291P993K308P770J0105J0479K0986L0291M0202O3600
12588B26428R8588J22332J52874J78289J63061J22699J00163L8178n3975r2737
12578A055900j33105j68547j60286j37205j14182q5667n7871l7963k5905j5992
12568A19177j6112j3746j1533j1870j1383r335n849n798l340J38o73j316l184
12555B5176J286N363m105j693m204k923P52j363j756j034K347Q099J0704J2308
$$ plain form
12541 48957 63142 68569 72225 71693 65425 58274 48790 32930 21311 13665 6916 5569 2964 2664
12527 2664 10444 12634 10460 14389 15921 13786 12986 15538 13786 9089 6358 2280 2432 3595 4428
12512 4428 4561 9922 17656 13882 10193 8515 8361 11397 10162 9620 8186 5412 -2737 -6938 -4535
12497 -4535 -5425 -5982 -8119 -11603 -15106 -20899 -18227 -17744 -20126 -19317 -16514 -12100 -10145 -9236 -6427 -5973
12481 -5973 -4964 -7119 -8336 -7858 -4681 -555 951 2206 918 2700 3705 6885 12410 20244 23401
12466 23401 16797 3572 -7178 -11999 -16102 -20754 -29192 -33301 -37768 -42736 -41456 -41731 -39529 -34732
12452 -34732 -33843 -35851 -35766 -27046 -20076 -17354 -16575 -17163 -18878 -18189 -15347 -12988 -14397 -15912 -14251 -8500
12436 -8500 -8473 -9708 -7191 4802 16340 18318 18975 22896 21668 30321 43179 54028 54607 55961 56069
$$ packed form
12541D8957J4185N427L656n32o268p151r484j5860j1619p646o749j347k605l00
12527B664P780K190k174L929J532k135q00K552j752m697k731m078J52J163Q33
12512D428J33N361P734l774l689j678j54L036j235n42j434k774q149m201K403
12497d535q90n57k137l484l503n793K672M83k382Q09K803M414J955R09K809M54
12481e973J009k155j217M78L177M126J506J255j288J782J005L180N525P834L157
12466B3401o604j3225j0750m821m103m652q438m109m467m968J280k75K202M797
12452c4732Q89k008Q5Q720O970K722P79n88j715O89K842K359j409j515J661N751
12436h500K7j235K517J1993J1538J978O57L921j228Q653J2858J0849N79J354J08
$$ plain form
12421 56069 57114 61429 62553 63450 65160 66300 64272 63170 64074 64341 67105 70183 70390 65600 56249
12406 56249 41977 26890 15262 2479 -8497 -16453 -20750 -25620 -27212 -27962 -28079 -25152 -26981 -28398
12392 -28398 -24828 -19514 -18152 -20147 -22977 -25576 -23987 -23588 -21833 -20521 -20073 -19665 -15399 -10838 -7724
12377 -7724 -1523 -2004 -4534 -4309 417 5733 10006 17049 19511 17330 12126 2651 -3654 -6801 -11970
12362 -11970 -17826 -15714 -14156 -10784 -4062 -2677 -5829 -9105 -14605 -23067 -30838 -35808 -41257 -46049
12348 -46049 -49072 -51618 -53576 -53435 -44934 -35397 -26583 -21309 -17735 -20688 -25587 -34653 -41919 -49359 -56080
12333 -56080 -58646 -62980 -63630 -60246 -57739 -57764 -54985 -46652 -34026 -19319 -11241 -9327 -6037 -1176 1750
12318 1750 5439 7654 10017 10033 10913 13568 14384 13859 11389 11135 17373 25565 29420 32328 41073 56936
$$ packed form
12421E6069J045M315J124Q97J710J140k028j102R04K67K764L078K07m790r351
12406E6249j4272j5087j1628j2783j0976p956m297m870j592p50j17K927j829j417
12392b8398L570N314J362j995k830k599J589L99J755J312M48M08M266M561L114
12377g724O201m81k530K25M726N316M273P043K462k181n204r475o305l147n169
12362a1970n856K112J558L372O722J385l152l276n500q462p771m970n449m792
12348d6049l023k546j958J41Q501R537Q814N274L574k953m899r066p266p440o721
12333e6080k566m334o50L384K507k5K779Q333J2626J4707Q078J914L290M861K926
12318A750L689K215K363J6Q80K655Q16n25k470k54O238Q192L855K908Q745J5863
$$ plain form
12302 56936 75434 96153 120283 143424 164198 206521 275118 366308 485894 611854 723117
12291 723117 814897 885172 925930 928145 888600 835397 803211 801370 808539 805808 787315 747457
12279 747457 691181 624997 558346 494884 433277 386244 349152 324151 312729 316737 335038 368890
12267 368890 422697 488134 563474 636317 674910 672819 630391 553479 462558 380670 315552 266944
12255 266944 230582 209462 199051 189522 181051 176206 173284 168100 157804 148337 136846 128559 119877
12242 119877 118176 113995 101809 94903 89927 74644 63954 68357 68343 62351 66814 83456 110034
12229 110034 134619 166655 199960 222564 230042 221417 211870 199644 195114 191903 191288 204363 211172
12216 211172 213081 223500 233380 242074 251367 262715 273297 284192 298720 309557 323983 350077
$$ packed form
12302E6936J8498K0719K4130K3141K0774M2323O8597R1190J19586J25960J11263
12291G23117R1780P0275M0758K215l9545n3203l2186j841P169k731j8493l9858
12279G47457n6276o6184o6651o3462o1607m7033l7092k5001j1422M008J8301L3852
12267C68890N3807O5437P5340P2843L8593k091m2428p6912r0921q1888o5118m8608
12255B66944l6362k1120j0411r529q471m845k922n184j0296r467j1491q287q682
12242A19877j701m181j2186o906m976j5283j0690M403j4n992M463J6642K6578
12229A10034K4585L2036L3305K2604P478q625r547j2226m530l211o15J3075O809
12216B11172J909J0419R880Q694R293J1348J0582J0895J4528J0837J4426K6094
$$ plain form
12204 350077 376644 412488 463907 516084 569585 625260 684039 732206 774312 814428 849422
12193 849422 885997 938463 1004072 1087998 1191459 1317183 1460959 1626552 1810651 2008231
12183 2008231 2239095 2515800 2857337 3300966 3875497 4572208 5418113 6393127 7421497
12174 7421497 8513404 9673286 10894642 12316900 14164662 16727623 20594650 26729471
12166 26729471 36549771 51641679 71973014 96525439 126566594 158401764 182761674
12159 182761674 201553390 215156783 213353891 199945614 182317395 156100245 125051211
12152 125051211 97349322 73716100 54359354 40437960 31253471 25276667 21295370
12145 21295370 18583902 16593420 14997165 13678767 12417098 11121683 9884154 8684872
$$ packed form
12204C50077K6567L5844N1419N2177N3501N5675N8779M8167M2106M0116L4994
12193H49422L6575N2466O5609Q3926J03461J25724J43776J65593J84099J97580
12183B008231K30864K76705L41537M43629N74531O96711Q45905R75014J028370
12174G421497J091907J159882J221356J422258J847762K562961L867027O134821
12166B6729471R820300J5091908K0331335K4552425L0041155L1835170K4359910
12159A82761674J8791716J3603393j802892j3408277j7628219k6217150l1049034
12152A25051211k7701889k3633222j9356746j3921394r184489n976804l981297
12145B1295370k711468j990482j596255j318398j261669j295415j237529j199282
$$ plain form
12137 8684872 7546255 6547089 5712757 5034040 4493328 4072704 3741119 3468943 3246023
12128 3246023 3061315 2894989 2743500 2605212 2467705 2335684 2221992 2120022 2027322 1959719
12118 1959719 1911463 1870628 1847217 1829160 1794145 1746934 1691243 1613805 1526182 1438143 1346733
12107 1346733 1260586 1194655 1136264 1085460 1043632 1008786 971828 938834 912923 883758 852979
12096 852979 827133 798030 778854 760600 737578 718770 704722 689421 672119 663375 656307 642248
12084 642248 633414 622176 612234 596655 576762 560583 547982 529979 511559 502138 488088 473467
12072 473467 464773 459002 449838 442393 440428 438492 432742 431751 434353 438090 444929 451462 458026 465219
12058 465219 467045 466966 463169 459978 451572 445503 442360 445905 456801 473017 491733 515548 547517
$$ packed form
12137H684872j138617r99166q34332o78717n40712m20624l31585k72176k22920
12128C246023j84708j66326j51489j38288j37507j32021j13692j01970r2700o7603
12118A959719m8256m0835k3411j8057l5015m7211n5691p7438q7623q8039r1410
12107A346733q6147o5931n8391n0804m1828l4846l6958l2994k5911k9165l0779
12096H52979k5846k9103j9176j8254k3022j8808j4048j5301j7302q744p068j4059
12084F42248q834j1238r942j5579j9893j6179j2601j8003j8420r421j4050j4621
12072D73467q694n771r164p445j965j936n750r91K602L737O839O533O564P193
12058D65219J826p9l797l191q406o069l143L545J0896J6216J8716K3815L1969
$$ plain form
12045 547517 576889 602922 621179 629846 622955 613881 602490 588405 569823 560178 555192 551653 542480
12032 542480 526916 513601 493878 468547 453597 448864 443056 447718 471883 501605 543208 594877
12020 594877 651209 703299 745440 771431 778551 767956 740913 700474 646804 595317 546313 496682
12008 496682 456449 423896 396079 377047 362222 348082 341862 342001 340371 347244 373457 421464
11996 421464 496635 595737 721863 858903 990730 1100569 1175105 1190600 1142853 1055465 934487
11985 934487 794661 663717 558808 475843 417041 377026 341911 314016 300008 290885 285976
11974 285976 283772 278757 275445 269703 260725 251380 241972 234470 222224 211724 205377 192790 185514
11961 185514 176989 170370 163126 158057 159729 159962 156873 154651 152042 148918 149012 143333 137302 131165 125162
$$ packed form
12045E47517K9372K6033J8257Q667o891r074j1391j4085j8582r645m986l539r173
12032E42480j5564j3315j9723k5331j4950m733n808M662K4165K9722M1603N1669
12020E94877N6332N2090M2141K5991P120j0595k7043m0439n3670n1487m9004m9631
12008D96682m0233l2553k7817j9032j4825j4140o220J39j630O873K6213M8007
11996D21464P5171R9102J26126J37040J31827J09839P4536J5495m7747q7388j20978
11985I34487j39826j30944j04909q2965n8802m0015l5115k7895j4008r123m909
11974B85976k204n015l312n742q978r345r408p502j2246j0500o347j2587p276
11961A85514q525o619p244n069J672K33l089k222k609l124R4n679o031o137o003
$$ plain form
11946 125162 119786 117974 114484 113378 115296 119408 117831 119192 124971 122869 122377 120175 121613 125466
11932 125466 127255 123744 123878 126065 128169 132469 132855 135889 149024 168622 199189 233344 240242 209006
11918 209006 172804 153657 141979 130647 122104 115503 109495 108730 108189 100858 99638 102681 102574 103512
11904 103512 107866 109675 115570 118122 118823 121252 117978 117695 117233 116569 114190 107854 105383 104408 102209
11889 102209 104089 105497 105510 105849 103061 102718 102428 102994 102696 102820 103214 101174 99114 98039 99046 100754
11873 100754 97851 94550 101589 105881 107628 106335 106070 103058 106989 114136 115721 121723 127909 129077
11859 129077 126349 117352 109332 105590 100204 96940 94267 88852 84443 83021 78590 73954 70201 64195
11845 64195 58535 57272 61711 65739 67012 65099 63424 66985 67989 66273 69127 68835 68281 72414 76785
$$ packed form
11946A25162n376j812l490j106J918M112j577J361N779k102m92k202J438L853
11932A25466J789l511J34K187K104M300L86L034J3135J9598L0567L4155O898l1236
11918B09006l6202j9147j1678j1332q543o601o008p65n41p331j220L043j07R38
11904A03512M354J809N895K552P01K429l274k83m62o64k379o336k471r75k199
11889A02209J880J408J3L39k788l43k90N66k98J24L94k040k060j075J007J708
11873A00754k903l301P039M292J747j293k65l012L931P147J585O002O186J168
11859A29077k728q997q020l742n386l264k673n415m409j422m431m636l753o006
11845F4195n660j263M439M028J273j913j675L561J004j716K854k92n54M133M371
$$ plain form
11830 76785 82750 88661 89784 83251 76261 71927 65443 61172 56128 58129 57920 60655 58108 59777 57565
11815 57565 60590 57052 53279 53893 55094 54932 54017 49796 48963 51915 57197 59933 59856 61088 55985 52572
11799 52572 53002 52820 51970 54575 59427 59611 60233 59615 58672 55946 54557 58774 56323 53509 47304 43007
11783 43007 41983 38757 39434 39463 41952 41107 37188 40733 43199 45121 43889 46720 43130 36414 32928
11768 32928 35800 37883 38169 36583 42369 50727 52954 53522 56421 59475 68242 71029 70644 72301 71735
11753 71735 66967 64719 63399 65226 68117 73212 77507 78028 81207 88681 93696 95618 100200 102268 116263
11738 116263 138162 166652 208215 277615 381506 512961 673086 853451 1013431 1136113
11728 1136113 1231764 1250760 1189075 1090401 941578 761856 599142 463104 348409 263767
$$ packed form
11830G6785N965N911J123o533o990m334o484m271n044K001k09K735k547J669k212
11815E7565L025l538l773O14J201j62r15m221q33K952N282K736p7J232n103l413
11799E2572M30j82q50K605M852J84O22o18r43k726j389M217k451k814o205m297
11783D3007j024l226O77K9K489q45l919L545K466J922j232K831l590o716l486
11768C2928K872K083K86j586N786Q358K227N68K899L054Q767K787l85J657n66
11753G1735m768k248j320J827K891N095M295N21L179P474N015J922M582K068J3995
11738A16263K1899K8490M1563O9400J03891J31455J60125J80365J59980J22682
11728A136113R5651J8996o1685r8674j48823j79722j62714j36038j14695q4642
$$ plain form
11718 263767 211952 183355 161880 143643 127643 119624 116510 111620 104846 97721 87962 78868 70853
11705 70853 59731 50988 44834 41177 38712 38216 37490 36251 38501 38357 36668 38206 35948 32483 29932
11690 29932 27894 29504 32640 33148 32437 34529 34758 36023 37529 36780 35252 31668 30404 29589 30520 30264
11674 30264 33088 36093 38858 36048 32392 33811 34358 29989 26917 28581 32514 33882 31716 31997 27736
11659 27736 27003 29609 35134 33201 27790 28058 26049 25415 29279 32974 35148 32137 31540 28802 28951 26705
11643 26705 23544 19791 15878 14826 14624 10377 10244 13799 16852 20876 22413 18631 16919 17843 22377
11628 22377 27713 28492 25587 21675 15488 15287 17090 17950 17102 18248 20664 21541 20842 20061 22944 19784
11612 19784 17686 21469 27993 24955 22096 23387 22665 26048 25846 20530 17799 17226 18735 21647 22178
$$ packed form
11718B63767n1815k8597k1475j8237j6000q019l114m890o774p125r759r094q015
11705G0853j1122q743o154l657k465m96p26j239K250j44j689J538k258l465k551
11690B9932k038J610L136N08p11K092K29J265J506p49j528l584j264q15R31k56
11674C0264K824L005K765k810l656J419N47m369l072J664L933J368k166K81m261
11659B7736p33K606N525j933n411K68k009o34L864L695K174l011n97k738J49k246
11643B6705l161l753l913j052k02m247j33L555L053M024J537l782j712R24M534
11628B2377N336P79k905l912o187k01J803Q60q48J146K416Q77o99p81K883l160
11612A9784k098L783O524l038k859J291p22L383k02n316k731n73J509K912N31
$$ plain form
11597 22178 19255 15991 16705 19342 19344 23147 22887 19861 16543 16131 17862 17326 16780 16784 18731 18719 16235 18317
11579 18317 15725 17113 20185 18672 14077 12804 14875 15408 12705 12631 11320 9739 13398 17378 17773
11564 17773 20411 22581 20534 17281 17588 19135 18847 20713 21502 23000 19813 13609 11644 17929 21485
11549 21485 20925 19232 21308 23930 24179 18716 14797 13830 13836 11658 8251 6898 6393 6294 8149 11008 9735
11532 9735 9340 7031 5107 4768 7167 11629 8163 6914 6019 3920 1200 -2762 -1695 1182 8091
11517 8091 11872 11457 8826 13560 14002 12929 10355 8449 8951 8752 12763 14596 10943 8365 4971 5852
11501 5852 8275 4835 6827 7306 4966 4958 4233 4383 9516 10902 4027 1359 5546 8529 5001 6581
11485 6581 5937 7062 9638 7579 7214 8313 9614 7488 4469 -664 698 3645 1973 1373 3655
$$ packed form
11597B2178k923l264P14K637KL803k60l026l318m12J731n36n46MJ947j2k484K082
11579A8317k592J388L072j513m595j273K071N33k703p4j311j581L659L980L95
11564A7773K638K170k047l253L07J547k88J866P89J498l187o204j965O285L556
11549B1485n60j693K076K622K49n463l919r67Ok178l407j353n05r9J855K859j273
11532I735l95k309j924l39K399M462l466j249q95k099k720l962J067K877O909
11517H091L781m15k631M734M42j073k574j906N02j99M011J833l653k578l394Q81
11501E852K423l440J992M79k340qp25J50N133J386o875k668M187K983l528J580
11485F581o44J125K576k059l65J099J301k126l019n133J362K947j672o00K282
$$ plain form
11470 3655 -555 -6167 -8886 -7281 -3524 -983 1788 867 1025 2810 3000 864 -782 1975 80
11455 80 1057 -1467 -2418 1042 -1116 -5267 -4484 -926 374 -3298 -2014 406 501 -1933 -4296 -5944
11439 -5944 -5324 -6667 -6106 -4666 -2798 -2841 -5125 -6077 -6535 -6565 -3544 -3886 -2657 739 3343 3133 2271
11422 2271 -218 -2590 -5468 -2618 -120 3240 2425 -575 -8556 -9402 -8534 -8402 -10062 -8529 -7654 -7785
11406 -7785 -3867 -2001 -2896 -6798 -4769 -2481 -7328 -9579 -8658 -5447 -6374 -7042 -5975 -9043 -15212 -14998
11390 -14998 -14264 -12497 -9019 -7505 -5583 -7473 -8351 -8889 -10044 -11853 -7044 -3526 -5008 -5409 -1268
11375 -1268 838 -856 -3387 -8165 -9726 -3583 2796 2818 -1840 -2559 -4940 -10413 -5018 -177 -1313
11360 -1313 -3723 -4631 -4455 -4929 -5175 -6529 -7402 -7255 -6431 -4005 -6320 -7796 -8554 -8908 -6706 -6502 -7683
$$ packed form
11470C655m210n612k719J605L757K541K771r21J58J785J90k136j646K757j895
11455H0R77k524r51L460k158m151P83L558J300l672J284K420R5k434k363j648
11439e944O20j343N61J440J868m3k284r52m58l0L021l42J229L396K604k10q62
11422B271k489k372k878K850K498L360q15l000p981q46Q68J32j660J533Q75j31
11406g785L918J866q95l902K029K288m847k251R21L211r27o68J067l068o169K14
11390a4998P34J767L478J514J922j890q78n38j155j809M809L518j482m01M141
11375a268K106j694k531m778j561O143O379K2m658p19k381n473N395M841j136
11360a313k410r08J76m74k46j354q73J47Q24K426k315j476p58l54K202K04j181
$$ plain form
11343 -7683 -8663 -8447 -11069 -10486 -6089 -5815 -7282 -5402 -1658 -4339 -11252 -11763 -9952 -10873 -12154 -11083
11327 -11083 -10252 -11623 -12146 -7363 -7126 -6431 -7283 -8284 -7607 -3123 -6246 -11119 -11091 -12221 -13103 -9860 -7544
11310 -7544 -8746 -8136 -6687 -8863 -11125 -11202 -12161 -11243 -12672 -13594 -11872 -11945 -13269 -12764 -12911 -12952 -10271 -7019
11292 -7019 -6812 -8904 -8077 -11705 -10952 -7237 -8186 -14513 -17615 -15296 -12570 -11967 -11619 -11205 -14119 -15471
11276 -15471 -17454 -14995 -8626 -5401 -3395 -4364 -8450 -10414 -13910 -11144 -10731 -11108 -11800 -10290 -7424
11261 -7424 -7729 -9382 -10869 -11123 -4796 -3566 -7084 -12039 -12221 -12729 -14782 -15496 -15290 -18610 -16058 -15140
11245 -15140 -14108 -12177 -11899 -12505 -13631 -11694 -11538 -11859 -10221 -8224 -11690 -12642 -8659 -10101 -13671 -12517
11229 -12517 -13251 -14627 -15986 -14921 -14256 -12975 -13711 -10825 -5842 -6181 -7632 -5669 7478 20264 25022
$$ packed form
11343g683r80K16k622N83M397K74j467J880L744k681o913n11J811r21j281J071
11327a1083Q31j371n23M783K37O95q52j001O77M484l123m873K8j130q82L243K316
11310g544j202O10J449k176k262p7r59R18j429r22J722p3j324N05j47m1K681L252
11292g019K07k092Q27l628P53L715r49o327l102K319K726O03L48M14k914j352
11276a5471j983K459O369L225K006r69m086j964l496K766M13l77o92J510K866
11261g424l05j653j487k54O327J230l518m955j82n08k053p14K06l320K552R18
11245a5140J032J931K78o06j126J937J56l21J638J997l466r52L983j442l570J154
11229a2517p34j376j359J065O65J281p36K886M983l39j451J963J3147J2786M758
$$ plain form
11214 25022 26026 27364 26888 16802 3982 -2944 -5157 -5619 -5755 -8617 -13890 -17033 -11936 -10136 -9379
11199 -9379 -8764 -9354 -9404 -10329 -13911 -17196 -15997 -15018 -11428 -12141 -8116 -3544 -7844 -8877 -8336 -10497 -12164
11182 -12164 -11811 -13313 -16574 -15270 -13242 -12187 -12519 -8804 -15142 -20660 -23796 -22418 -22668 -23015 -22717 -21175
11166 -21175 -13571 -11212 -14186 -15780 -16550 -17665 -19848 -25108 -26175 -25853 -22298 -21244 -20217 -18551 -19419
11151 -19419 -22481 -21310 -26218 -26106 -19154 -14230 -14159 -13615 -10561 -7913 -6562 -8094 -7142 -11819 -13665 -13913
11135 -13913 -21500 -23134 -19945 -17284 -15146 -15332 -15767 -15313 -19440 -20402 -17025 -14374 -14949 -18366 -20300 -19150
11119 -19150 -16735 -15132 -10859 -8023 -8192 -10472 -9124 -5692 -9477 -11880 -9559 -3827 -1386 -1616 -587
11104 -587 732 4367 12375 11617 4439 2794 8013 10755 6145 -1975 -4923 -11461 -15974 -17928 -18669
$$ packed form
11214B5022J004J338m76j0086j2820o926k213m62j36k862n273l143N097J800P57
11199i379O15n90n0r25l582l285J199R79L590p13M025M572m300j033N41k161j667
11182a2164L53j502l261J304K028J055l32L715o338n518l136J378k50l47K98J542
11166b1175P604K359k974j594p70j115k183n260j067L22L555J054J027J666q68
11151a9419l062J171m908J12O952M924P1N44L054K648J351j532R52m677j846k48
11135a3913p587j634L189K661K138j86m35M54m127r62L377K651n75l417j934J150
11119a9150K415J603M273K836j69k280J348L432l785k403K321N732K441k30J029
11104e87J319L635Q008p58p178j645N219K742m610q120k948o538m513j954p41
$$ plain form
11089 -18669 -19787 -16887 -18569 -19257 -16973 -12076 -11018 -12063 -14446 -11612 -12465 -13162 -15723 -23801 -25143
11074 -25143 -26355 -25626 -21259 -22239 -18578 -15089 -17437 -19511 -17926 -19029 -18474 -18138 -17578 -19733 -21239 -19251
11058 -19251 -18760 -15495 -11724 -8218 -8362 -9886 -12285 -9765 -8640 -10199 -15241 -18764 -15282 -13038 -15154
11043 -15154 -16147 -17742 -20265 -15727 -14554 -19924 -20839 -19067 -20444 -18081 -18073 -22817 -20231 -21020 -22177 -19367
11027 -19367 -14409 -15695 -17226 -16823 -16292 -13818 -14369 -21656 -20595 -15215 -17041 -20969 -18181 -14313 -15109
11012 -15109 -13000 -11584 -16917 -16703 -13036 -12505 -14057 -11148 -11715 -9998 -8715 -12659 -12343 -7242 -5725
10997 -5725 -7024 -11738 -14063 -14406 -12194 -7485 -8365 -8474 -6121 -1276 -3062 -8585 -8284 -9002 -14241 -16773
10981 -16773 -17822 -18038 -17595 -17295 -15453 -14989 -15896 -20394 -19651 -17566 -18331 -17865 -16898 -14184 -10899 -11127 -15863
$$ packed form
11089a8669j118K900j682o88K284M897J058j045k383K834q53o97k561q078j342
11074b5143j212P29M367r80L661L489k348k074J585j103N55L36N60k155j506J988
11058a9251M91L265L771L506j44j524k399K520J125j559n042l523L482K244k116
11043a5154r93j595k523M538J173n370r15J772j377K363Qm744K586p89j157K810
11027a9367M958j286j531M03N31K474n51p287J061N380j826l928K788L868p96
11012a5109K109J416n333K14L667N31j552K909n67J717J283l944L16N101J517
10997e725j299m714k325l43K212M709q80j09K353M845j786n523L01p18n239k532
10981a6773j049k16M43L00J842M64r07m498P43K085p65M66R67K714L285k28m736
$$ plain form
10964 -15863 -17447 -13995 -9032 -6322 -5744 -5268 -4345 -6830 -10982 -6199 -2753 -397 1929 3202 -2193
10949 -2193 -3472 -6750 -3573 2057 8036 12114 17278 22323 31526 46001 59104 66880 78729 87797
10935 87797 85451 75929 63518 48513 35911 27898 19765 10622 2724 -3746 -5024 -4592 -10435 -12482
10921 -12482 -13725 -14212 -13133 -8268 -7653 -1013 5147 12955 17800 25323 38963 50608 67228 79690
10907 79690 89442 94774 94878 83812 71995 54139 38282 22691 5809 -3407 -6633 -8099 -7951
10894 -7951 -13518 -13142 -13356 -18117 -20427 -19818 -20709 -14627 -17300 -18961 -23063 -21754 -22214 -21857 -24674 -20498
10878 -20498 -15054 -17174 -18167 -17251 -17069 -18511 -21132 -22804 -22355 -23083 -24694 -22742 -21519 -19722 -20136 -18776
10862 -18776 -19862 -21430 -22371 -21497 -19448 -17814 -20440 -22051 -24972 -24838 -22948 -27677 -32378 -30721 -24467
$$ packed form
10964a5863j584L452M963K710N78M76R23k485m152M783L446K356K326J273n395
10949b193j279l278L177N630N979M078N164N045R203J4475J3103P776J1849R068
10935H7797k346r522j2411j5005j2602q013q133r143p898o470j278M32n843k047
10921a2482j243m87J079M865O15O640O160P808M845P523J3640J1645J6620J2462
10907G9690R752N332J04j1066j1817j7856j5857j5591j6882r216l226j466J48
10894g951n567L76k14m761k310O09q91O082k673j661m102J309m60L57k817M176
10878b0498N444k120r93R16J82j442k621j672M49p28j611J952J223J797m14J360
10862a8776j086j568r41Q74K049J634k626j611k921J34J890m729m701J657O254
$$ plain form
10847 -24467 -21753 -24805 -26227 -26268 -26613 -24587 -20092 -22412 -21101 -23505 -26371 -26567 -26360 -26392 -24284 -23669
10831 -23669 -22454 -21869 -22662 -25008 -23232 -21767 -22338 -23037 -20161 -20643 -23208 -27216 -34330 -34071 -31729 -26578
10815 -26578 -24956 -28454 -29730 -24847 -22723 -22046 -22540 -20388 -19737 -20120 -20380 -20812 -18968 -22785 -23399 -22934
10799 -22934 -25145 -27441 -27436 -23944 -20822 -19670 -19062 -20734 -23544 -24111 -24254 -26470 -26332 -23365 -20820 -20929
10783 -20929 -19798 -18117 -18183 -16252 -11789 -5944 3008 10763 9917 11807 16907 17859 9336 -2112 -6435
10768 -6435 -9505 -12800 -16592 -17730 -20588 -23005 -22233 -24105 -25392 -23994 -19372 -13026 -12303 -15420 -17204
10753 -17204 -20348 -19654 -19641 -21387 -22945 -23742 -21108 -17217 -15492 -17448 -20103 -22778 -23724 -22456 -25696 -31414
10737 -31414 -31541 -32726 -34071 -33844 -31115 -28258 -24747 -26468 -25798 -25842 -27362 -28512 -28498 -24236 -22660 -23954
$$ packed form
10847b4467K714l052j422m1l45K026M495k320J311k404k866j96K07l2K108O15
10831b3669J215N85p93k346J776J465n71o99K876m82k565m008p114K59K342N151
10815b6578J622l498j276M883K124O77m94K152O51l83k60m32J844l817o14M65
10799b2934k211k296NL492L122J152O08j672k810n67j43k216J38K967K545j09
10783b0929J131J681o6J931M463N845Q952P755q46J890N100R52q523j1448m323
10768f435l070l295l792j138k858k417P72j872j287J398M622O346P23l117j784
10753a7204l144O94J3j746j558p97K634L891J725j956k655k675r46J268l240n718
10737c1414j27j185j345K27K729K857L511j721O70m4j520j150J4M262J576j294
$$ plain form
10721 -23954 -26591 -26044 -24298 -27156 -28761 -30237 -29856 -33368 -33163 -30487 -28827 -32844 -35085 -31034 -30652
10706 -30652 -32025 -28609 -25327 -26143 -23425 -20682 -13014 -10101 -17775 -26145 -31642 -29306 -23230 -20439 -17539
10691 -17539 -18286 -15999 -12273 -6543 -4657 -6056 -8557 -12721 -15921 -21017 -23360 -19916 -20592 -15818 -1934
10676 -1934 19430 50572 57882 39118 15724 -1005 -8894 -17454 -26512 -33263 -38023 -38829 -38472 -39626
10662 -39626 -43551 -41661 -40071 -38605 -33767 -30593 -30708 -32517 -33670 -33950 -33760 -34410 -41883 -40382 -37488
10647 -37488 -37421 -36303 -35646 -30569 -28802 -26602 -24860 -28195 -33284 -32526 -28541 -27488 -31984 -37310 -36926 -36897
10631 -36897 -39678 -40567 -38582 -38437 -33773 -28227 -26417 -23564 -21962 -20826 -18858 -20689 -22844 -24747 -25709
10616 -25709 -28002 -32401 -35313 -36308 -32667 -30922 -34069 -35937 -36244 -37072 -32883 -31455 -30971 -38147 -41280
$$ packed form
10721b3954k637N47J746k858j605j476L81l512K05K676J660m017k241M051L82
10706c0652j373L416L282q16K718K743P668K913p674q370n497K336O076K791K900
10691a7539p47K287L726N730J886j399k501m164l200n096k343L444o76M774J3884
10676a934K1364L1142P310j8764k3394j6729p889q560r058o751m760q06L57j154
10662c9626l925J890J590J466M838L174j15j809j153k80J90o50p473J501K894
10647c7488O7J118O57N077J767K200J742l335n089P58L985J053m496n326L84K9
10631c6897k781q89J985J45M664N546J810K853J602J136J968j831k155j903r62
10616b5709k293m399k912r95L641J745l147j868l07q28M189J428M84p176l133
$$ plain form
10601 -41280 -38347 -35776 -37941 -34594 -31177 -31090 -26612 -25162 -28088 -26658 -27138 -26883 -25680 -23600 -23160 -24207
10585 -24207 -21600 -18108 -15929 -15530 -15875 -13548 -10327 -7354 -5485 -1912 2417 1967 -983 -2458 -6711
10570 -6711 -8261 -5160 -2256 5058 9274 13029 21885 34284 51223 79274 133576 211073 300745
10557 300745 416170 547050 643971 722946 792946 777256 712897 639070 515158 387414 284395
10546 284395 199143 132658 90230 63218 47427 31736 14711 5247 -53 -3522 -9762 -13071
10534 -13071 -13084 -15825 -18396 -18897 -19224 -15375 -10641 -8738 -6420 -5733 -7264 -8721 -4886 782 670 -961
10518 -961 -1523 1938 6241 6211 6113 4025 -1799 -5563 -8880 -13241 -21429 -24321 -21551 -23178 -24866 -22370
10502 -22370 -24032 -27148 -26715 -23118 -17091 -12259 -10661 -11064 -13656 -17818 -14826 -9213 -7904 -9461 -7946
$$ packed form
10601d1280K933K571k165L347L417Q7M478J450k926J430m80K55J203K080M40j047
10585b4207K607L492K179L99l45K327L221K973J869L573M329m50k950j475m253
10570f711j550L101K904P314M216L755Q856J2399J6939K8051N4302P7497Q9672
10557C00745J15425J30880R6921P8975P0000j5690o4359p3827j23912j27744j03019
10546B84395q5252o6485m2428k7012j5791j5691j7025r464n300l469o240l309
10534a3071j3k741k571n01l27L849M734J903K318O87j531j457L835N668j12j631
10518i61n62L461M303l0r8k088n824l764l317m361q188k892K770j627j688K496
10502b2370j662l116M33L597O027M832J598m03k592m162K992N613J309j557J515
$$ plain form
10487 -7946 -3573 1312 3161 9641 19792 30417 39564 52651 68522 81010 96074 116581 146977
10474 146977 191937 251045 343778 453325 553019 681637 864664 1027065 1102491 1184126 1316424
10463 1316424 1387372 1385820 1406030 1392827 1283661 1189330 1141978 1022520 840953 690529 576606
10452 576606 467374 362584 280543 230539 197725 173571 161004 151449 143115 138263 133974 126506
10440 126506 124054 124483 124127 124089 132539 149026 175907 218315 274231 350657 457027 601389 755034
10427 755034 916346 1113181 1290923 1398680 1499894 1586182 1566898 1481293 1405708 1278110
10417 1278110 1085260 902857 746763 590353 454541 354040 279287 222708 175104 140802
10407 140802 118086 102585 93642 87250 84813 81380 72519 67639 64833 62146 58513 57610 56594 59000
$$ packed form
10487g946M373M885J849O480J0151J0625R147J3087J5871J2488J5064K0507L0396
10474A46977M4960N9108R2733J09547R9694J28618J83027J62401P5426Q1635J32298
10463A316424P0948j552K0210j3203j09166r4331m7352j19458j81567j50424j13923
10452E76606j09232j04790q2041n0004l2814k4154j2567r555q334m852m289p468
10440A26506k452M29l56l8Q450J6487K6881M2408N5916P6426J06370J44362J53645
10427G55034J61312J96835J77742J07757J01214Q6288j9284q5605p5585j27598
10417A278110j92850j82403j56094j56410j35812j00501p4753n6579m7604l4302
10407A40802k2716j5501q943o392k437l433q861m880k806k687l633r03j016K406
$$ plain form
10393 59000 62732 66144 71619 80583 84323 91868 99903 103591 108471 113920 122924 137319 157554 181812
10379 181812 214083 255160 305702 377956 483561 639882 887526 1291671 1887572 2604196
10369 2604196 3533135 4675133 5516294 6152789 6737919 6630823 6098472 5527506 4535415
10360 4535415 3458087 2621791 1916845 1360988 992474 752754 596025 489273 417533
10351 417533 368294 338471 322327 317736 328456 349473 388472 466324 599754 825724 1217440
10340 1217440 1819514 2449175 2568743 2063447 1438157 990284 714080 541590 431349
10331 431349 357296 306461 269803 244233 218167 197072 185099 182132 179162 173983 172099 165865
10319 165865 160329 158276 152896 144446 143534 141406 137133 137485 133977 130675 133156 134376 129604 121610 114631
$$ packed form
10393E9000L732L412N475Q964L740P545Q035L688M880N449R004J4395K0235K4258
10379A81812L2271M1077N0542P2254J05605J56321K47644M04145N95901P16624
10369B604196R28939J141998Q41161O36495N85130j07096n32351n70966r92091
10360D535415j077328q36296p04946n55857l68514k39720j56729j06752p1740
10351D17533m9239k9823j6144m591J0720K1017L8999P7852J33430K25970L91716
10340A217440O02074O29661J19568n05296o25290m47873k76204j72490j10241
10331D31349p4053n0835l6658k5570k6066k1095j1973k967k970n179j884o234
10319A65865n536k053n380q450r12k128m273L52l508l302K481J220m772p994o979
$$ plain form
10304 114631 111625 108495 108999 107614 112057 127652 147140 186668 249490 344841 511583 706538
10292 706538 768206 732647 769650 921237 1164527 1487659 1873477 2275312 2621814 2881638
10282 2881638 3020399 2981856 2804337 2519690 2148541 1763653 1407383 1100821 861750 685415
10272 685415 549920 453795 379267 325840 282049 241433 208741 181968 163194 143119 117919
10261 117919 98092 87942 77112 68106 53387 37887 27309 25647 24395 24186 32137 47749 67592
10248 67592 72265 57701 48628 52593 69903 93183 107637 119349 132456 135575 128294 116831 90732
10235 90732 61925 45205 32120 16789 12420 13749 10322 5639 4300 5180 5804 8606 16425 23299
10221 23299 28099 30138 26867 19280 12238 6640 -2874 -12491 -24475 -32254 -37551 -39379 -33948 -25458
$$ packed form
10304A14631l006l130N04j385M443J5595J9488L9528O2822R5351J66742J94955
10292G06538O1668l5559L7003J51587K43290L23132L85818M01835L46502K59824
10282B881638J38761l8543j77519k84647l71149l84888l56270l06562k39071j76335
10272F85415j35495r6125p4528n3427m3791m0616l2692k6773j8774k0075k5200
10261A17919j9827j0150j0830r006j4719j5500j0578j662j252k09P951J5612J9843
10248F7592M673j4564r073L965J7310K3280J4454J1712J3107L119p281j1463k6099
10235I0732k8807j6720j3085j5331m369J329l427m683j339Q80O24K802P819O874
10221B3299M800K039l271p587p042n598r514r617j1984p779n297j828N431Q490
$$ plain form
10207 -25458 -14315 3739 23757 41464 47646 53973 71258 94493 125862 154999 175845 193793
10195 193793 212576 221597 220328 238844 261382 270941 291426 342343 396934 446892 540199 684715
10183 684715 840778 1003197 1146756 1226800 1226056 1152186 1019631 848801 680283 547390
10173 547390 450058 384528 341143 326678 333075 350809 363232 379915 395521 389674 369800 346824
10161 346824 320970 293324 279523 276626 288859 309309 327764 352355 380378 387303 379014 383902
10149 383902 383739 360544 341504 340085 322892 300399 301253 307814 298908 295323 308468 320724 323594
10136 323594 332334 346704 359766 370156 395793 419718 437134 458069 488731 525014 558939 595144
10124 595144 636304 677417 724170 780165 849000 935535 1050510 1218026 1479461 1888377 2407474
$$ packed form
10207b5458J1143J8054K0018J7707O182O327J7285K3235L1369K9137K0846J7948
10195A93793J8783R021j269J8516K2538R559K0485N0917N4591M9958R3307J44516
10183F84715J56063J62419J43559Q0044p44p3870j32555j70830j68518j32893
10173E47390r7332o5530m3385j4465O397J7734J2423J6683J5606n847j9874k2976
10161C46824k5854k7646j3801k897J2233K0450J8455K4591K8023O925q289M888
10149C83902j63k3195j9040j419j7193k2493Q54O561q906l585J3145J2256K870
10136C23594Q740J4370J3062J0390K5637K3925J7416K0935L0662L6283L3925L6205
10124E95144M1160M1113M6753N5995O8835Q6535J14975J67516K61435M08916N19097
$$ plain form
10113 2407474 2924907 3565783 4354089 4773599 4988131 5474371 5773186 5672494 5745785 6027013
10103 6027013 5919225 5579355 5496188 5244807 4658309 4184659 3850351 3579685 3439381 3437030
10093 3437030 3584592 3848627 4154794 4527201 4995466 5536019 6166739 6853343 7575942
10084 7575942 8390683 9317388 10259309 11210350 12229460 13310713 14544051 16077908 17980506
10075 17980506 20356460 23602413 28424096 35686611 46488194 61559157 78654726 96117226
10067 96117226 119283046 150508060 175823161 187469622 203026526 227546676 241360286
10060 241360286 242493266 246795176 245275027 230333203 218772650 213020488 192732929
10053 192732929 160543516 135256123 115925629 94274327 72735410 56266993 45389561
$$ packed form
10113B407474N17433O40876P88306M19510K14532M86240K98815j00692P3291K81228
10103F027013j07788l39870q3167k51381n86498m73650l34308k70666j40304k351
10093C437030J47562K64035L06167L72407M68265N40553O30720O86604P22599
10084G575942Q14741R26705R41921R51041J019110J081253J233338J533857J902598
10075A7980506K375954L245953M821683P262515J0801583J5070963J7095569J7462500
10067I6117226K3165820L1225014K5315101J1646461J5556904K4520150J3813610
10060B41360286J132980M301910j520149j4941824j1560553n752162k0287559
10053A92732929l2189413k5287393j9330494k1651302k1538917j6468417j0877432
$$ plain form
10046 45389561 38392090 33705386 30583486 28566281 27125816 25928927 25115673 24771743
10038 24771743 24756751 25100641 25858540 27012120 29046191 32756706 39008819 48669173 61899439
10029 61899439 78850219 101759855 129862600 156762440 184151287 216052036 240242398
10022 240242398 252051262 264466952 271794204 261830367 245300388 230501233 207259209
10015 207259209 176622211 149306107 124975047 100549534 79163214 62919356 50393232
10008 50393232 40535933 33250523 28011323 24146498 21236814 18992040 17207472 15780117
10000 15780117 14580269 13527272 12645171 11868692 11097493 10388466 9775177 9171352 8590677
9991 8590677 8098491 7662249 7264136 6944651 6691255 6467259 6287866 6159261 6036040 5913414
$$ packed form
10046D5389561o997471m686704l121900k017205j440465j196889q13254l43930
10038B4771743j4992L43890P57899J153580K034071L710515O252113R660354J3230266
10029F1899439J6950780K2909636K8102745K6899840K7388847L1900749K4190362
10022B40242398J1808864J2415690P327252r963837j6529979j4799155k3242024
10015B07259209l0636998k7316104k4331060k4425513k1386320j6243858j2526124
10008E0393232r857299p285410n239200l864825k909684k244774j784568j427355
10000A5780117j199848j052997q82101p76479p71199p09027o13289o03825n80675
9991H590677m92186m36242l98113l19485k53396k23996j79393j28605j23221j22626
$$ plain form
9981 5913414 5812246 5710481 5610245 5532933 5460774 5386538 5315171 5234195 5165052 5137214 5019218
9970 5019218 4788178 4605226 4494709 4428822 4393932 4339827 4219991 4046903 3902057 3834879
9960 3834879 3825071 3806261 3743090 3657064 3570501 3485154 3437916 3434763 3426866 3395262 3369545 3332955
9948 3332955 3260793 3192169 3145552 3088618 3016044 2950512 2911229 2892608 2884457 2889066 2914411 2937637
9936 2937637 2925808 2902197 2893230 2862194 2802159 2742498 2665994 2570903 2483992 2406719 2320023 2227084
9924 2227084 2145505 2069593 1998025 1939781 1889293 1852121 1827934 1809610 1803666 1814171 1831408 1859724
9912 1859724 1905950 1974458 2036174 2072214 2070070 2014283 1912990 1801147 1711876 1641719 1588836
9901 1588836 1555242 1540265 1526891 1516987 1509707 1503543 1488868 1473216 1464026 1446509 1415791 1396062
$$ packed form
9981E913414j01168j01765j00236p7312p2159p4236p1367q0976o9143k7838j17996
9970E019218k31040j82952j10517o5887l4890n4105j19836j73088j44846o7178
9960C834879r808j8810o3171q6026q6563q5347m7238l153p897l1604k5717l6590
9948C332955p2162o8624m6617n6934p2574o5532l9283j8621q151M609K5345K3226
9936B937637j1829k3611q967l1036o0035n9661p6504r5091q6911p7273q6696r2939
9924B227084q1579p5912p1568n8244n0488l7172k4187j8324n944J0505J7237K8316
9912A859724M6226O8508O1716L6040k144n5787j01293j11843q9271p0157n2883
9901A588836l3594j4977j3374r904p280o164j4675j5652r190j7517l0718j9729
$$ plain form
9889 1396062 1386388 1364598 1349572 1348285 1336394 1321952 1315854 1310151 1299015 1284079 1274547 1267507 1259183
9876 1259183 1251231 1242081 1228291 1217878 1209661 1201578 1187280 1167482 1149500 1135505 1118571 1099244
9864 1099244 1081176 1063854 1058846 1060354 1068540 1084533 1108856 1141890 1189275 1251308 1320729 1395507
9852 1395507 1471860 1555026 1629554 1682921 1718735 1741980 1735073 1704906 1668104 1612176 1539589 1460493
9840 1460493 1384228 1317814 1254661 1197568 1150435 1115233 1087126 1062358 1040075 1020666 1007351
9829 1007351 995223 976445 963763 957515 950493 944478 942819 947709 953303 963891 979756 1001112 1028257
9816 1028257 1056370 1085462 1117048 1154555 1186074 1202285 1213983 1223778 1223572 1221421 1221510 1220337 1220519
9803 1220519 1222414 1234193 1260070 1288979 1318422 1351079 1380840 1406280 1420883 1427104 1412761 1383783
$$ packed form
9889A396062r674k1790j5026j287j1891j4442o098n703j1136j4936r532p040q324
9876A259183p952r150j3790j0413q217q083j4298j9798j7982j3995j6934j9327
9864A099244j8068j7322n008J508Q186J5993K4323L3034M7385O2033O9421P4778
9852A395507P6353Q3166P4528N3367L5814K3245o907l0167l6802n5928p2587p9096
9840A460493p6265o6414o3153n7093m7133l5202k8107k4768k2283j9409j3315
9829A007351j2128j8778j2682o248p022o015j659M890N594J0588J5865K1356K7145
9816A028257K8113K9092L1586L7507L1519J6211J1698R795k06k151Q9j173J82
9803A220519J895J1779K5877K8909K9443L2657K9761K5440J4603O221j4343k8978
$$ plain form
9791 1383783 1348881 1301372 1246882 1190830 1137162 1087334 1042298 1002062 965128 936146 914083
9780 914083 895752 885854 887125 893343 890879 882915 880871 873381 869013 883786 902535 925455 932645
9767 932645 924695 910849 903843 902735 903641 906041 909749 908119 897585 883641 870009 857518 850691
9754 850691 845324 844784 848300 851586 849222 847622 844945 839786 823920 814922 810628 805339 803776 804998
9740 804998 805331 803084 810376 817841 828312 835751 845048 859659 875791 892713 914173 933003 954576
9727 954576 985831 1033370 1103183 1197629 1323387 1480993 1639110 1727146 1726856 1650370 1510713
9716 1510713 1339034 1185367 1079238 1013265 970819 942863 924901 910176 896153 888766 883876
9705 883876 877579 874407 873264 875441 888835 915616 932992 916948 895077 887857 882315 884315 890689
$$ packed form
9791A383783l4902m7509n4490n6052n3668m9828m5036m0236l6934k8982k2063
9780I14083j8331r898J271O218k464p964k044p490m368J4773J8749K2920P190
9767I32645p950j3846p006j108R06K400L708j630j0534j3944j3632j2491o827
9754H50691n367n40L516L286k364j600k677n159j5866q998m294n289j563J222
9740H04998L33k247P292P465J0471P439R297J4611J6132J6922K1460J8830K1573
9727I54576L1255M7539O9813R4446J25758J57606J58117Q8036k90p6486j39657
9716A510713j71679j53667j06129o5973m2446k7956j7962j4725j4023p387m890
9705H83876o297l172j143K177J3394K6781J7376j6044k1871p220n542K000O374
$$ plain form
9692 890689 899357 908688 914978 923114 932336 948747 975670 1013384 1057117 1099822 1132313 1148409 1142053
9679 1142053 1106521 1060000 1018233 989187 965769 947295 936075 929702 927570 927794 936082 948266
9667 948266 961188 981443 1012461 1057331 1128577 1230338 1345519 1455412 1598511 1791783 1947897
9656 1947897 2022837 2122951 2271102 2355660 2369620 2405790 2399370 2327447 2302225 2352564 2376079
9645 2376079 2363449 2372180 2347811 2213542 1996208 1778293 1595837 1466314 1395791 1377760 1387410
9634 1387410 1402869 1405810 1396481 1377295 1340217 1295113 1259242 1233835 1222012 1230049 1267652 1328170
9622 1328170 1402129 1507762 1647370 1795897 1951911 2143704 2325595 2436743 2539096 2633404
9612 2633404 2624852 2537876 2456787 2335663 2155388 1984672 1834969 1686004 1553489 1456058
$$ packed form
9692H90689Q668R331O290Q136R222J6411K6923L7714M3733M2705L2491J6096o356
9679A142053l5532m6521m1767k9046k3418j8474j1220o373k132K24Q288J2184
9667I48266J2922K0255L1018M4870P1246J01761J15181J09893J43099J93272J56114
9656A947897P4940J00114J48151Q4558J3960L6170o420p1923k5222N0339K3515
9645B376079j2630Q731k4369j34269k17334k17915j82456j29523p0523j8031R650
9634A387410J5459K941r329j9186l7078m5104l5871k5407j1823Q037L7603O0518
9622A328170P3959J05633J39608J48527J56014J91793J81891J11148J02353R4308
9612B633404q552q6976q1089j21124j80275j70716j49703j48965j32515r7431
$$ plain form
9602 1456058 1384010 1331338 1293129 1268751 1256498 1248942 1242818 1239517 1240159 1242433 1244821 1248003 1250984
9589 1250984 1253415 1254514 1256808 1257076 1260728 1263905 1267898 1271056 1277396 1287303 1298600 1318594 1345511 1367331
9575 1367331 1386113 1404469 1425571 1450625 1468316 1465853 1454062 1448094 1446618 1437292 1426323 1421901
9563 1421901 1420131 1421288 1424414 1433373 1442182 1449254 1457900 1470096 1478738 1486329 1499302 1508064 1517147 1527079
9549 1527079 1537481 1552657 1564646 1573409 1582437 1595535 1608510 1617461 1627808 1634607 1641977 1653939
9537 1653939 1663216 1671691 1684189 1695367 1712779 1729390 1745239 1763728 1792941 1823754 1845685 1859276
9525 1859276 1867850 1869407 1874079 1884966 1894955 1905793 1921920 1937189 1951804 1970256 1991185 2015412
9513 2015412 2030535 2043640 2054800 2071818 2095978 2118806 2147393 2176111 2198785 2219734 2235248
$$ packed form
9602A456058p2048n2672l8209k4378j2253p556o124l301O42K274K388L182K981
9589A250984K431J099K294K68L652L177L993L158O340R907J1297J9994K6917K1820
9575A367331J8782J8356K1102K5054J7691k463j1791n968j476r326j0969m422
9563A421901j770J157L126Q959Q809P072Q646J2196Q642P591J2973Q762R083R932
9549A527079J0402J5176J1989Q763R028J3098J2975Q951J0347O799P370J1962
9537A653939R277Q475J2498J1178J7412J6611J5849J8489K9213L0813K1931J3591
9525A859276Q574J557M672J0887R989J0838J6127J5269J4615J8452K0929K4227
9513B015412J5123J3105J1160J7018K4160K2828K8587K8718K2674K0949J5514
$$ plain form
9502 2235248 2243447 2249109 2262650 2283576 2307819 2333985 2358337 2384184 2410030 2433759 2451721 2466876
9490 2466876 2484936 2506850 2523675 2547497 2574767 2599445 2627916 2652701 2675421 2702824 2729660
9479 2729660 2758347 2787743 2817107 2848636 2882306 2920500 2963055 3008264 3047984 3070120 3087171
9468 3087171 3111016 3140589 3174149 3206539 3242338 3273246 3308820 3346896 3386976 3432130 3474773
9457 3474773 3513181 3556312 3603601 3650004 3693489 3737336 3782215 3830245 3880653 3929090 3975017
9446 3975017 4027477 4078631 4129565 4178906 4236526 4293348 4346947 4402227 4458835 4516304 4577113
9435 4577113 4640332 4706361 4772551 4841979 4910218 4980903 5050483 5119347 5189405 5260898 5330249
9424 5330249 5407124 5484392 5563867 5643947 5727458 5813352 5900817 5988199 6079270 6174935 6269837
$$ packed form
9502B235248Q199N662J3541K0926K4243K6166K4352K5847K5846K3729J7962J5155
9490B466876J8060K1914J6825K3822K7270K4678K8471K4785K2720K7403K6836
9479B729660K8687K9396K9364L1529L3670L8194M2555M5209L9720K2136J7051
9468C087171K3845K9573L3560L2390L5799L0908L5574L8076M0080M5154M2643
9457C474773L8408M3131M7289M6403M3485M3847M4879M8030N0408M8437M5927
9446C975017N2460N1154N0934M9341N7620N6822N3599N5280N6608N7469O0809
9435D577113O3219O6029O6190O9428O8239P0685O9580O8864P0058P1493O9351
9424E330249P6875P7268P9475Q0080Q3511Q5894Q7465Q7382R1071R5665R4902
$$ plain form
9413 6269837 6370496 6471548 6568662 6668044 6774820 6881450 6989022 7105275 7220712 7334653
9403 7334653 7449814 7568942 7689199 7812667 7941343 8072914 8206447 8340711 8482521 8628032
9393 8628032 8772847 8920863 9074819 9237052 9401920 9563264 9726116 9888815 10059566 10237443
9383 10237443 10414236 10596187 10779808 10970889 11165992 11363888 11560734 11759935 11969003
9374 11969003 12179648 12393813 12610402 12829057 13050486 13279705 13511400 13744091 13982906
9365 13982906 14224787 14471237 14721401 14969967 15223030 15476394 15733167 15991035 16256377
9356 16256377 16523700 16791222 17064469 17337358 17606235 17873964 18140921 18413320 18682262
9347 18682262 18945564 19206469 19469588 19729924 19987446 20239444 20482488 20718780 20947730
$$ packed form
9413F269837J00659J01052R7114R9382J06776J06630J07572J16253J15437J13941
9403G334653J15161J19128J20257J23468J28676J31571J33533J34264J41810J45511
9393H628032J44815J48016J53956J62233J64868J61344J62852J62699J70751J77877
9383A0237443J76793J81951J83621J91081J95103J97896J96846J99201K09068
9374A1969003K10645K14165K16589K18655K21429K29219K31695K32691K38815
9365A3982906K41881K46450K50164K48566K53063K53364K56773K57868K65342
9356A6256377K67323K67522K73247K72889K68877K67729K66957K72399K68942
9347A8682262K63302K60905K63119K60336K57522K51998K43044K36292K28950
$$ plain form
9338 20947730 21167695 21380347 21587943 21781247 21959328 22126628 22283073 22421064 22542250
9329 22542250 22648249 22741129 22819362 22879481 22920987 22946313 22947270 22934127 22903717 22850160 22780206
9318 22780206 22690860 22585355 22466932 22330847 22175034 22006945 21823061 21627586 21426349 21213796
9308 21213796 20986367 20753148 20514985 20267961 20018925 19766613 19505165 19240949 18969216
9299 18969216 18697881 18432327 18164556 17892072 17620459 17356521 17089529 16826410 16558642
9290 16558642 16280727 16011371 15752259 15484670 15214618 14956350 14700468 14450085 14201360
9281 14201360 13951858 13703244 13462440 13223488 12990157 12759403 12533495 12313875 12099827
9272 12099827 11888370 11681906 11479631 11283978 11089913 10894097 10707397 10524430 10349436
$$ packed form
9338B0947730K19965K12652K07596J93304J78081J67300J56445J37991J21186
9329B2542250J05999R2880P8233O0119M1506K5326R57j3143l0410n3557o9954
9318B2780206q9346j05505j18423j36085j55813j68089j83884j95475k01237k12553
9308B1213796k27429k33219k38163k47024k49036k52312k61448k64216k71733
9299A8969216k71335k65554k67771k72484k71613k63938k66992k63119k67768
9290A6558642k77915k69356k59112k67589k70052k58268k55882k50383k48725
9281A4201360k49502k48614k40804k38952k33331k30754k25908k19620k14048
9272A2099827k11457k06464k02275j95653j94065j95816j86700j82967j74994
$$ plain form
9263 10349436 10177220 10005113 9833159 9662144 9502782 9345247 9187572 9034971 8888259
9254 8888259 8739490 8595420 8451132 8307204 8170059 8040923 7912540 7784543 7663998 7542589
9244 7542589 7426307 7309170 7195531 7084150 6975705 6870170 6764509 6661735 6560366 6463507
9234 6463507 6365587 6275176 6184585 6095333 6006211 5919496 5833856 5746436 5660531 5578688 5502150
9223 5502150 5422998 5345648 5275660 5206623 5135364 5065684 4997395 4930544 4869225 4802232 4737716
9212 4737716 4674107 4611129 4556842 4500861 4445219 4390821 4334334 4278231 4228110 4175722 4124331
9201 4124331 4072942 4021652 3968671 3923685 3882235 3842959 3800564 3760746 3720518 3684412 3647753
9190 3647753 3608617 3566807 3526689 3485982 3446442 3409048 3365592 3323522 3280332 3242570 3207792
$$ packed form
9263A0349436j72216j72107j71954j71015j59362j57535j57675j52601j46712
9254H888259j48769j44070j44288j43928j37145j29136j28383j27997j20545j21409
9244G542589j16282j17137j13639j11381j08445j05535j05661j02774j01369r6859
9234F463507r7920r0411r0591q9252q9122q6715q5640q7420q5905q1843p6538
9223E502150p9152p7350o9988o9037p1259o9680o8289o6851o1319o6993o4516
9212D737716o3609o2978n4287n5981n5642n4398n6487n6103n0121n2388n1391
9201D124331n1389n1290n2981m4986m1450l9276m2395l9818m0228l6106l6659
9190C647753l9136m1810m0118m0707l9540l7394m3456m2070m3190l7762l4778
$$ plain form
9179 3207792 3172970 3139057 3104322 3071091 3042757 3020957 2993875 2962652 2932138 2900897 2873116
9168 2873116 2842567 2812731 2783173 2751832 2728113 2700336 2674667 2647574 2626167 2608315 2582408
9157 2582408 2557165 2538313 2520662 2503575 2487927 2470313 2449834 2429290 2408087 2382345 2353005
9146 2353005 2323804 2297077 2273684 2246685 2217521 2192825 2173688 2153908 2135092 2114314 2098023
9135 2098023 2081260 2064957 2044523 2025625 2002659 1984377 1965024 1948486 1933507 1916120 1896330
9124 1896330 1879863 1869544 1859020 1844417 1825107 1814009 1802113 1790927 1780642 1763546 1746988
9113 1746988 1731609 1715763 1701250 1683881 1667393 1652324 1637475 1621379 1604466 1587436 1575344
9102 1575344 1563063 1548627 1537520 1523469 1507757 1493613 1482757 1474417 1464549 1452135 1443085 1436835
$$ packed form
9179C207792l4822l3913l4735l3231k8334k1800k7082l1223l0514l1241k7781
9168B873116l0549k9836k9558l1341k3719k7777k5669k7093k1407j7852k5907
9157B582408k5243j8852j7651j7087j5648j7614k0479k0544k1203k5742k9340
9146B353005k9201k6727k3393k6999k9164k4696j9137j9780j8816k0778j6291
9135B098023j6763j6303k0434j8898k2966j8282j9353j6538j4979j7387j9790
9124A896330j6467j0319j0524j4603j9310j1098j1896j1186j0285j7096j6558
9113A746988j5379j5846j4513j7369j6488j5069j4849j6096j6913j7030j2092
9102A575344j2281j4436j1107j4051j5712j4144j0856q340r868j2414r050o250
$$ plain form
9090 1436835 1425151 1407661 1396715 1383974 1373265 1364814 1359973 1353424 1347001 1341750 1331073 1320070
9078 1320070 1311317 1306128 1297855 1289099 1285908 1279971 1270835 1259818 1249747 1241556 1232649 1221765 1212078
9065 1212078 1204398 1194539 1185902 1177535 1167034 1159643 1150125 1144215 1133976 1124175 1114555 1104792 1099746 1095339
9051 1095339 1089266 1081296 1075144 1069283 1062549 1054822 1048345 1043404 1038595 1033115 1028406 1022175 1019559 1013307
9037 1013307 1008741 1003524 997073 996232 989467 980625 972892 967773 959470 949555 941886 937396 931944 927085
9023 927085 926970 922327 917959 911157 903122 896042 891307 891506 883591 876720 873739 867664 863473 857775 854116
9008 854116 850039 847151 845465 842364 836107 829017 820138 816699 808590 798229 799554 800823 796538 796198
8994 796198 793443 790822 786370 784215 778911 772141 762803 759815 756586 753335 748534 744937 741618 741601 741477
$$ packed form
9090A436835j1684j7490j0946j2741j0709q451m841o549o423n251j0677j1003
9078A320070q753n189q273q756l191n937r136j1017j0071q191q907j0884r687
9065A212078p680r859q637q367j0501p391r518n910j0239r801r620r763n046m407
9051A095339o073p970o152n861o734p727o477m941m809n480m709o231k616o252
9037A013307m566n217o451q41o765q842p733n119q303r915p669m490n452m859
9023I27085j15m643m368o802q035p080m735J99p915o871k981o075m191n698l659
9008H54116m077k888j686l101o257p090q879l439q109j0361J325J269m285l40
8994G96198k755k621m452k155n304o770r338k988l229l251m801l597l319j7j24
$$ plain form
8979 741477 738846 735199 732357 731150 725481 720818 718643 713347 710251 708184 703893 699443 695307 687334
8965 687334 682047 676033 669196 666688 667207 667326 668820 661165 660804 660416 656199 650527 647229 649703 647064
8950 647064 640152 633237 630876 629648 624761 622951 619264 616891 616070 612599 606753 602644 602462 601382 598270
8935 598270 596156 600002 597633 594689 589784 585199 581781 579735 575968 573581 577047 578171 579804 580800 576108
8920 576108 573510 569744 562459 558856 554831 551257 549300 546277 543352 547084 548224 546502 542264 541007
8906 541007 541900 542241 542723 549843 559651 560700 557535 551329 543415 533738 529259 520819 516290 509147 510462
8891 510462 511263 507824 503268 500014 501537 502771 502268 505327 505634 505022 505220 509490 513597 514736 506729 498428
8875 498428 492276 488337 482519 477730 467627 463842 462931 462191 464723 466209 465087 464463 459804 458763 455431
$$ packed form
8979G41477k631l647k842j207n669m663k175n296l096k067m291m450m136p973
8965F87334n287o014o837k508N19J19J494p655l61l88m217n672l298K474k639
8950F47064o912o915k361j228m887j810l687k373q21l471n846m109j82j080l112
8935E98270k114L846k369k944m905m585l418k046l767k387L466J124J633R96m692
8920E76108k598l766p285l603m025l574j957l023k925L732J140j722m238j257
8906E41007Q93L41M82P120R808J049l165o206p914r677m479q440m529p143J315
8891E10462Q01l439m556l254J523J234n03L059L07o12J98M270M107J139q007q301
8875D98428o152l939n818m789j0103l785r11p40K532J486j122o24m659j041l332
$$ plain form
8860 455431 452149 451215 450386 448106 451659 450278 445202 440706 439670 443203 440247 435839 433264 434447 431274
8845 431274 428278 427608 427487 431499 429851 428661 434229 437510 438636 436152 431283 424780 421911 418492 416509
8830 416509 414776 410861 409469 407465 404751 400498 395783 396343 395857 399924 401285 396433 394256 398136 399924
8815 399924 402602 401842 397225 397200 396985 395420 389983 384366 379942 377323 373538 373306 375867 378876 377407 378359
8799 378359 375816 369372 368312 367030 366985 367234 364550 361734 359287 357218 360268 359662 358738 359519 361075 363047
8783 363047 360875 359939 354587 349161 345342 344413 345408 343660 341224 344361 348962 346159 342235 344383 348437
8768 348437 349118 351105 350622 353395 355927 355058 346110 343187 341351 335385 331176 330562 331401 331434 330470 330074 329785
8751 329785 329127 330108 326536 322160 323466 324641 326924 329899 328970 322712 320372 321688 320264 318686 317398
$$ packed form
8860D55431l282r34q29k280L553j381n076m496j036L533k956m408k575J183l173
8845D31274k996o70j21M012j648j190N568L281J126k484m869o503k869l419j983
8830D16509j733l915j392k004k714m253m715N60m86M067J361m852k177L880J788
8815C99924K678p60m617k5k15j565n437n617m424k619l785k32K561L009j469R52
8799C78359k543o444j060j282m5K49k684k816k447k069L050o06r24P81J556J972
8783C63047k172r36n352n426l819r29R95j748k436L137M601k803l924K148M054
8768C48437O81J987m83K773K532q69q948k923j836n966m209o14Q39L3r64l96k89
8751C29785o58R81l572m376J306J175K283K975r29o258k340J316j424j578j288
$$ plain form
8736 317398 317152 319435 318571 317046 317053 314934 313444 314838 318150 319184 314484 312990 317103 319581 323066 323988
8720 323988 322125 318019 313621 312960 312362 307389 303224 303920 303205 303151 299429 293309 294116 294591 295918 299567
8704 299567 297779 291951 290256 292103 289441 292555 294677 294279 294336 294581 297592 296128 293649 293143 294431 296244
8688 296244 299137 298502 294236 289386 285452 287408 287708 283859 285927 295822 308781 321543 321462 315601 311283
8673 311283 306096 295647 288582 277207 274207 274426 269943 266240 266767 265049 265103 263821 261467 263238 262836
8658 262836 261326 260066 264950 270306 272447 272139 265741 264757 265646 264442 263816 266044 263562 264100 263242 264395
8642 264395 260561 255156 256194 257589 261040 265698 269760 275279 283250 293739 300948 289275 274027 267228
8628 267228 262406 255651 252885 252872 254005 252608 251484 249500 248644 246751 246128 247558 247653 251407 256133 259319
$$ packed form
8736C17398k46K283q64j525Pk119j490J394L312J034m700j494M113K478L485R22
8720C23988j863m106m398o61n98m973m165O96p15n4l722o120Q07M75J327L649
8704B99567j788n828j695J847k662L114K122l98N7K45L011j464k479n06J288J813
8688B96244K893o35m266m850l934J956L00l849K068R895J2959J2762q1n861m318
8673C11283n187j0449p065j1375l000K19m483l703N27j718N4j282k354J771m02
8658B62836j510j260M884N356K141l08o398r84Q89j204o26K228k482N38q58J153
8642B64395l834n405J038J395L451M658M062N519P971J0489P209j1673j5248o799
8628B67228m822o755k766j3J133j397j124j984q56j893o23J430R5L754M726L186
$$ plain form
8612 259319 261634 265849 269430 270804 271862 273336 272882 274276 277269 271524 267826 265133 261889 257734 252661
8597 252661 254001 252230 249724 247879 249542 250765 252036 253254 254189 259193 263897 269870 278072 285891 296222
8582 296222 303060 307146 305637 305073 302589 290704 282886 275192 264664 254451 248526 246118 246778 243175
8568 243175 238126 234588 232436 237268 238345 238440 237545 233134 230598 227082 225876 224727 227780 228779 230400
8553 230400 228992 229904 232705 232067 229336 232457 239444 244585 248428 251828 253735 254400 261279 267757 272655
8538 272655 272376 274270 271940 266538 264820 262221 257226 254098 244828 236004 232611 232019 230176 228142 223022
8523 223022 219839 219616 221662 222624 223412 221988 216805 211022 211895 213897 213794 211801 211037 213349 214959 212208
8507 212208 208296 200684 196500 197586 202578 206217 205224 205189 205112 204926 202054 200443 201367 205304 215228 218075
$$ packed form
8612B59319K315M215L581J374J058J474m54J394K993n745l698k693l244m155n073
8597B52661J340j771k506j845J663J223J271J218R35N004M704N973Q202P819J0331
8582B96222O838M086j509n64k484j1885p818p694j0528j0213n925k408O60l603
8568B43175n049l538k152M832J077R5q95m411k536l516j206j149L053R99J621
8553B30400j408R12K801o38k731L121O987N141L843L400J907O65O879O478M898
8538B72655k79J894k330n402j718k599m995l128r270q824l393n92j843k034n120
8523B23022l183k23K046R62P88j424n183n783Q73K002j03j993p64K312J610k751
8507B12208l912p612m184J086M992L639r93l5p7j86k872j611R24L937R924K847
$$ plain form
8491 218075 224780 229010 222801 216270 206832 197251 196631 199622 201483 202793 206327 213157 216276 217365 220128
8476 220128 223180 233382 246852 253169 261678 268794 270197 268741 269903 271280 269980 262014 259947 263466
8462 263466 261544 264454 274538 284934 296275 299545 308453 322520 325198 305633 280256 259291 243554
8449 243554 226488 215860 208876 207633 210343 221863 231997 231047 224883 215438 209554 211464 216099 224559
8435 224559 235625 244405 249823 258349 264884 261143 244647 228984 221176 219942 224174 227371 231452 229439
8421 229439 236346 246297 255983 252220 240894 234074 228478 221031 213245 211727 217228 230664 254520 311439
8407 311439 366613 362499 310763 257535 221379 203636 192018 186436 181738 176163 174933 181061 189205
8394 189205 191992 198518 214722 221512 217267 204867 195937 190188 184222 177240 176624 177195 183507 186261
$$ packed form
8491B18075O705M230o209o531r438r581o20K991J861J310L534O830L119J089K763
8476B20128L052J0202J3470O317Q509P116J403j456J162J377j300p966k067L519
8462B63466j922K910J0084J0396J1341L270Q908J4067K678j9565k5377k0965j5737
8449B43554j7066j0628o984j243K710J1520J0134r50o164r445n884J910M635Q460
8435B24559J1066Q780N418Q526O535l741j6496j5663p808j234M232L197M081k013
8421B29439O907R951R686l763j1326o820n596p447p786j518N501J3436K3856N6919
8407C11439N5174m114n1736n3228l6156j7743j1618n582m698n575j230O128Q144
8394A89205K787O526J6204O790m245j2400q930n749n966o982o16N71O312K754
$$ plain form
8380 186261 186119 184309 183118 186453 186110 185126 190027 199921 204799 204967 204697 207325 212036 208435 197581
8365 197581 187208 183778 186995 194842 206091 220557 238190 235638 214107 193278 182640 179704 172312
8352 172312 167799 168113 169107 172921 174941 177308 174311 174956 182856 188919 190839 184603 180297 173339 166999
8337 166999 163926 160483 163665 171529 176900 174245 170594 162582 161555 161968 164948 167419 172991 173089 170261
8322 170261 164264 159211 156840 154253 151253 151499 154583 149596 147727 145010 143082 143810 147750 154226 165134
8307 165134 176368 184688 185712 180275 185016 186833 178260 166370 158630 155156 153966 155386 152238 148138
8293 148138 146343 145013 144576 144553 146478 144422 139611 143115 145313 140910 142343 142629 144656 144278 143781 142633
8277 142633 142486 140491 143307 143528 143924 145172 151301 156396 151370 146994 147196 148034 146900 150068 147985 141027
$$ packed form
8380A86261j42j810j191L335l43r84M901R894M878J68k70K628M711l601j0854
8365A97581j0373l430L217P847J1249J4466J7633k552k1531k0829j0638k936p392
8352A72312m513L14R94L814K020K367k997O45P900O063J920o236m306o958o340
8337A66999l073l443L182P864N371k655l651q012j027M13K980K471N572R8k828
8322A70261n997n053k371k587l000K46L084m987j869k717j928P28L940O476J0908
8307A65134J1234Q320J024n437M741J817q573j1890p740l474j190J420l148m100
8293A48138j795j330m37k3J925k056m811L504K198m403J433K86K027l78m97j148
8277A42633j47j995K816K21L96J248O129N095n026m376K02Q38j134L168k083o958
$$ plain form
8261 141027 138378 138891 144153 142927 143864 140115 137593 135967 132223 132186 132977 134620 135601 129796 127795 130365
8245 130365 128336 122398 120336 121903 125501 124990 121847 116490 116813 120687 116694 112247 116303 117412 118384
8230 118384 123026 122686 123308 123543 126280 128097 129084 126210 117043 117262 120804 119097 115326 117654 120062 123419
8214 123419 121237 117781 122591 124714 123545 121751 120385 121629 120246 120030 119303 116261 114179 113497 114609
8199 114609 116947 116132 113887 113344 113890 112226 108591 104966 105756 107104 105796 109423 110858 114705 117818
8184 117818 112610 114103 114515 112867 109602 107379 104091 105124 107714 108333 107544 109813 117070 116411 110446
8169 110446 111538 112795 111154 109355 109899 112165 111232 107918 110857 113303 111563 111423 110610 110040 111205 106985
8153 106985 107957 107048 102339 105398 108880 110571 111652 109586 109102 105779 102687 102437 102632 100112 101715 102147
$$ packed form
8261A41027k649N13N262j226R37l749k522j626l744l7P91J643R81n805k001K570
8245A30365k029n938k062J567L598n11l143n357L23L874l993m447M056J109R72
8230A18384M642l40O22K35K737J817R87k874r167K19L542j707l771K328K408L357
8214A23419k182l456M810K123j169j794j366J244j383k16p27l042k082o82J112
8199A14609K338q15k245n43N46j664l635l625P90J348j308L627J435L847L113
8184A17818n208J493M12j648l265k223l288J033K590O19p89K269P257o59n965
8169A10446J092J257j641j799N44K266r33l314K939K446j740j40q13n70J165m220
8153A06985R72r09m709L059L482J691J081k066m84l323l092k50J95k520J603M32
$$ plain form
8137 102147 100617 100406 100469 102201 104409 101568 100928 97035 95750 93115 93036 99396 102588 102276 102568 100419
8121 100419 97660 95652 96149 97678 101447 106263 110316 109546 106636 104770 105403 103911 103314 104621 103898 99887
8105 99887 100423 103522 101521 101242 101979 99600 99436 100591 97764 96932 100564 102986 102298 99930 102003 103272
8089 103272 101541 102263 104072 105028 103795 105311 109120 111206 112437 113183 114885 113302 107629 104030 104110 103312
8073 103312 103523 106571 109824 114652 113145 110411 111924 114997 119094 123930 127135 131552 136303 135059 136472
8058 136472 136170 136677 136797 131916 127626 123001 119299 116507 115672 116396 116607 120986 120817 119652 116695 110855
8042 110855 110090 110975 108394 105313 107807 109880 111818 114985 112387 113164 112275 111796 113144 114530 110443 111309
8026 111309 110249 107643 112217 116457 118383 119981 125456 139768 147718 150831 149833 152260 155934 156868 161526
$$ packed form
8137A02147j530k11O3J732K208k841o40l893j285k635p9O360L192l12K92k149
8121A00419k759k008M97J529L769M816M053p70k910j866O33j492n97J307p23m011
8105I9887N36L099k001k79P37k379j64J155k827q32L632K422o88k368K073J269
8089A03272j731P22J809R56j233J516L809K086J231P46J702j583n673l599Q0p98
8073A03312K11L048L253M828j507k734J513L073M097M836L205M417M751j244J413
8058A36472l02N07J20m881m290m625l702k792q35P24K11M379j69j165k957n840
8042A10855p65Q85k581l081K494K073J938L167k598P77q89m79J348J386m087Q66
8026A11309j060k606M574M240J926J598N475J4312P950L113r98K427L674R34M658
$$ plain form
8011 161526 164543 159994 156542 156282 149833 141028 141336 146235 143331 151521 166920 168541 152649 137868
7997 137868 130798 124215 119644 119567 116442 108583 106289 112453 115646 117083 125529 131448 131253 126185 126258 122345
7981 122345 123133 124435 126310 124467 119782 114035 114095 113999 116404 115732 121145 130419 135962 142961 149387 151204
7965 151204 151796 148584 138257 134358 141105 147693 157443 167242 162567 146068 132870 124816 123812 125402
7951 125402 122449 119357 120834 118790 118416 115742 118767 114828 113369 114918 116574 117888 119278 122898 122476
7936 122476 118253 109812 98122 97328 96431 96173 102177 110242 116137 121418 127048 126827 127729 134312 136306
7921 136306 130089 130600 130898 117706 105222 98548 92995 85536 79390 73894 73034 76528 81931 81038 89674
7906 89674 98393 94868 97513 103257 101391 104576 104473 98370 96203 97686 93985 92660 96658 94039 89193
$$ packed form
8011A61526L017m549l452k60o449q805L08M899k904Q190J5399J621j5892j4781
7997A37868p070o583m571p7l125p859k294O164L193J437Q446N919j95n068P3l913
7981A22345P88J302J875j843m685n747O0r6K405o72N413R274N543O999O426J817
7965A51204N92l212j0327l899O747O588R750R799m675j6499j3198q054j004J590
7951A25402k953l092J477k044l74k674L025l939j459J549J656J314J390L620m22
7936A22476m223q441j1690p94q97k58O004Q065N895N281N630k21R02O583J994
7921A36306o217N11K98j3192j2484o674n553p459o146n496q60L494N403q93Q636
7906H9674Q719l525K645N744j866L185j03o103k167J483l701j325L998k619m846
$$ plain form
7891 89193 91469 95742 94567 95099 97210 100887 100548 99447 98847 95551 86952 78932 76628 73168 68303
7876 68303 69831 65322 64068 65087 70279 73488 76544 79599 85785 89742 85748 84175 81646 81450 84975
7861 84975 83342 82804 83065 80152 74670 74017 74777 74349 77377 76065 71796 70397 66573 66073 67070 64904
7845 64904 66031 69656 68263 66745 68122 69757 72820 74690 77101 78922 79303 80264 79808 80980 82936
7830 82936 81650 78911 77354 72606 67757 64998 61557 62184 63646 62004 62518 64917 64685 65740 68746
7815 68746 65595 62663 63026 60280 59720 61872 64360 66422 67982 67607 69435 71096 70859 70775 73358 68810
7799 68810 63704 63251 61956 63847 63279 63453 65467 64038 58610 59747 60281 53383 49342 52208 55161 53715
7783 53715 52170 55621 57655 58387 58082 58244 61033 56184 57915 58630 59649 59349 60048 61949 60324 58356
$$ packed form
7891H9193K276M273j175N32K111L677l39j101o00l296q599q020k304l460m865
7876F8303J528m509j254J019N192L209L056L055O186L957l994j573k529j96L525
7861H4975j633n38K61k913n482o53P60m28L028j312m269j399l824n00R97k166
7845F4904J127L625j393j518J377J635L063J870K411J821L81R61m56J172J956
7830H2936j286k739j557m748m849k759l441O27J462j642N14K399k32J055L006
7815F8746l151k932L63k746n60K152K488K062J560l75J828J661k37q4K583m548
7799F8810n106m53j295J891n68J74K014j429n428J137N34o898m041K866K953j446
7783E3715j545L451K034P32l05J62K789m849J731P15J019l00O99J901j625j968
$$ plain form
7767 58356 55038 54847 56210 54364 56388 56461 54762 56140 54525 51570 53686 52661 53257 53696 51230 51586
7751 51586 53834 57111 57082 56093 56983 58390 58341 57747 55217 56209 59682 59421 57813 59014 61282 61705 55619
7734 55619 51820 52262 51013 51171 50177 49494 51986 51584 50622 52938 56247 57138 56661 55651 51063 51730 53131
7717 53131 56528 56826 55752 53400 53617 54415 57911 56738 56839 55009 55118 53823 49816 49093 52427 50831
7701 50831 49909 52818 52024 53744 56376 57751 59763 59363 56990 54532 50272 46538 44843 47573 54200
7686 54200 51363 50100 49932 49699 52293 50417 50131 49050 49913 52081 51449 53633 51247 49103 52214 56672
7670 56672 57513 55234 52753 46621 46480 53965 60421 60533 54456 51592 51334 50027 48858 47598 52856 55119
7654 55119 48976 45754 48782 49246 45120 45427 45772 47327 46183 43801 43692 44803 47696 53094 55862 55044
$$ packed form
7767E8356l318j91J363j846K024P3j699J378j615k955K116j025N96M39k466L56
7751E1586K248L277k9r89Q90J407m9n94k530R92L473k61j608J201K268M23o086
7734E5619l799M42j249J58r94o83K492m02r62K316L309Q91m77j010m588O67J401
7717E3131L397K98j074k352K17P98L496j173J01j830J09j295m007p23L334j596
7701E0831r22K909p94J720K632J375K012m00k373k458m260l734j695K730O627
7686E4200k837j263j68k33K594j876k86j081Q63K168o32K184k386k144L111M458
7670E6672Q41k279k481o132j41P485O456J12o077k864k58j307j169j260N258K263
7654E5119o143l222L028M64m126L07L45J555j144k382j09J111K893N398K768q18
$$ plain form
7638 55044 53111 49475 46657 47917 48222 45680 42536 40461 37493 37947 44551 47907 49328 48935 47293
7623 47293 47732 47164 46095 45999 48489 50272 46555 45101 42719 41725 46264 47158 45683 46499 48246 45753
7607 45753 42347 42880 44236 46581 47184 48720 51795 48669 45554 49202 52258 51147 49207 44106 46314
7592 46314 51453 53815 52609 50647 50352 50134 48894 46946 44745 42637 45465 50101 49257 46674 45339
7577 45339 46040 50532 48286 46013 51417 52089 49953 48861 47822 47783 45210 46559 46059 44857 43112 43255
7561 43255 47964 44407 42503 44230 45461 49121 49085 45849 44454 43995 40847 40221 41425 42806 41626 42443
7545 42443 43355 41598 39459 36411 38070 44032 46126 47496 44927 43417 40280 43258 44435 44391 42463
7530 42463 41541 43146 42969 40162 39726 40511 38977 37092 36049 35391 34420 33198 35223 35949 34933 38597
$$ packed form
7638E5044j933l636k818J260L05k542l144k075k968M54O604L356J421l93j642
7623D7293M39n68j069r6K490J783l717j454k382r94M539Q94j475Q16J747k493
7607D5753l406N33J356K345O03J536L075l126l115L648L056j111j940n101K208
7592D6314N139K362j206j962k95k18j240j948k201k108K828M636q44k583j335
7577D5339P01M492k246k273N404O72k136j092j039l9k573J349n00j202j745J43
7561D3255M709l557j904J727J231L660l6l236j395m59l148o26J204J381j180Q17
7545D2443R12j757k139l048J659N962K094J370k569j510l137K978J177m4j928
7530D2463r22J605j77k807m36P85j534j885j043o58r71j222K025P26j016L664
$$ plain form
7514 38597 39931 39010 39680 42336 43614 38209 40337 41656 40654 37143 37177 37601 38094 39352 41310 45352
7498 45352 46677 47917 44593 40396 42395 45456 46055 41776 45433 48648 48221 44471 39828 37553 39166
7483 39166 40408 40790 43236 39929 37611 40520 42882 40997 40361 41330 42080 43094 43654 41614 42221 43431
7467 43431 43470 42761 43241 43278 44851 44598 42481 40908 36874 31560 34080 40214 41162 39410 39627 39869 40584
7450 40584 44647 49566 50320 47633 45883 44762 44863 46050 40529 35935 36571 37017 34995 36201 34545 33240
7434 33240 37515 40485 41481 37690 36323 36080 34087 36144 37893 35910 34101 35560 34547 32321 31210
7419 31210 32559 31278 26142 27505 32253 33133 33735 33751 29191 26577 27089 29223 32439 33967 33811 33925
7403 33925 31473 32656 34442 35855 38908 37257 35832 37478 36639 36436 35447 33647 31895 30513 35268
$$ packed form
7514C8597J334r21O70K656J278n405K128J319j002l511L4M24M93J258J958M042
7498D5352J325J240l324m197J999L061N99m279L657L215m27l750m643k275J613
7483C9166J242L82K446l307k318K909K362j885o36R69P50J014N60k040O07J210
7467D3431L9p09M80L7J573k53k117j573m034n314K520O134R48j752K17K42P15
7450D0584M063M919P54k687j750j121J01J187n521m594O36M46k022J206j656j305
7434C3240M275K970R96l791j367k43j993K057J749j983j809J459j013k226j111
7419C1210J349j281n136J363M748Q80O02J6m560k614N12K134L216J528j56J14
7403C3925k452J183J786J413L053j651j425J646q39k03r89j800j752j382M755
$$ plain form
7388 35268 40935 40426 38533 38659 36868 34302 35216 40230 42112 40222 39897 38178 39519 43069 39506 38009
7372 38009 36430 36114 36164 37061 35711 31228 30532 33988 38504 38198 39967 40833 38131 37288 36515 33529 30097
7355 30097 27438 26981 25710 24586 26593 29889 32384 34469 32189 30585 29713 33266 34310 32493 32935
7340 32935 31074 32492 32006 33435 34683 36280 38925 37234 36575 38268 40442 39529 36879 35849 37901
7325 37901 37702 36317 35586 38430 43104 38463 37216 37529 36343 34689 31494 33955 31180 27176 27228 27041
7309 27041 28511 30644 35368 34998 32842 31666 37010 37286 39011 36202 32019 33865 35092 35830 32297
7294 32297 31498 33241 37329 36786 35017 33227 35321 36660 32710 33393 30245 30323 31235 31305 32026 32006 34138
7277 34138 31955 33325 33824 35499 35237 31233 28412 26655 22737 28750 33624 34356 33632 34594 32542 29927
$$ packed form
7388C5268N667n09j893J26j791k566R14N014J882j890l25j719J341L550l563j497
7372C8009j579l16N0Q97j350m483o96L456M516l06J769Q66k702q43p73k986l432
7355C0097k659m57j271j124K007L296K495K085k280j604q72L553J044j817M42
7340C2935j861J418m86J429J248J597K645j691o59J693K174r13k650j030K052
7325C7901j99j385p31K844M674m641j247L13j186j654l195K461k775m004N2j87
7309B7041J470K133M724l70k156j176N344K76J725k809m183J846J227P38l533
7294C2297p99J743M088n43j769j790K094J339l950O83l148P8R12P0P21k0K132
7277C4138k183J370M99J675k62m004k821j757l918O013M874P32p24R62k052k615
$$ plain form
7261 29927 32139 32565 30543 30084 29473 32469 33426 38184 35015 30229 29881 30470 32069 30775 32927 35391
7245 35391 37106 40514 36736 31931 27831 25587 29962 30708 28347 31876 33087 35358 33890 28948 28881
7230 28881 34033 35232 34840 30736 29412 27765 24698 23921 22547 24588 23590 28901 31216 28932 31586
7215 31586 30579 30498 29367 25402 23330 25379 28374 29979 28839 28754 25541 22644 24723 26551 26013 24592
7199 24592 23172 26572 25225 28265 29047 25737 29928 29019 24161 26897 30690 29664 27755 24176 23022
7184 23022 25258 27905 26564 24614 22165 24368 28224 27639 29130 26718 24477 24225 25222 27325 30608
7169 30608 28453 28920 27286 30292 31528 28574 26963 23210 22842 24101 24114 26825 26565 26603 26938 24778 27343
7152 27343 30988 30010 26972 23425 19920 16484 22355 22835 22624 23005 22360 24030 26904 25937 28155 27986
$$ packed form
7261B9927K212M26k022m59o11K996R57M758l169m786l48N89J599j294K152K464
7245C5391J715L408l778m805m100k244M375P46k361L529J211K271j468m942o7
7230B8881N152J199l92m104j324j647l067p77j374K041r98N311K315k284K654
7215C1586j007q1j131l965k072K049K995J605j140q5l213k897K079J828n38j421
7199B4592j420L400j347L040P82l310M191r09m858K736L793j026j909l579j154
7184B3022K236K647j341j950k449K203L856n85J491k412k241k52R97K103L283
7169C0608k155M67j634L006J236k954j611l753l68J259J3K711k60L8L35k160K565
7152B7343L645r78l038l547l505l436N871M80k11L81o45J670K874r67K218j69
$$ plain form
7136 27986 21744 20646 19130 21153 24339 24855 23034 25163 27235 30264 25322 22316 18991 19671 20517
7121 20517 22743 26354 25461 22195 26629 28176 30130 31775 30510 29523 29092 28267 28687 29373 27972 25697
7105 25697 24503 25219 28148 31057 29447 30151 32318 29884 22820 21513 19585 20318 21233 19998 21592 25304
7089 25304 25607 22327 20046 18539 19682 23064 24652 23283 20700 20561 20916 19626 20693 24371 23936 23855
7073 23855 22616 22010 20729 21404 24957 26346 27714 27715 26830 27179 22456 22298 22277 24219 23889 21572 18960
7056 18960 18960 23325 23737 25878 24222 20598 20168 20672 24907 27532 28235 24330 23168 24084 19643 19188 22611
7039 22611 26391 25801 25571 24250 21450 23784 26704 26420 29702 31439 28666 20212 20970 25882 26784 23645
7023 23645 20951 20427 22545 21439 21721 21869 22489 26490 26781 27320 25278 22735 23578 24528 22989 20025 16886
$$ packed form
7136B7986o242j098j516K023L186N16j821K129K072L029m942l006l325O80Q46
7121B0517K226L611q93l266M434J547J954J645j265r87m31q25M20O86j401k275
7105B5697j194P16K929K909j610P04K167k434p064j307j928P33R15j235J594L712
7089B5304L03l280k281j507J143L382J588j369k583j39L55j290J067L678m35q1
7073B3855j239o06j281O75L553J389J368Jq85L49m723j58k1J942l30k317k612
7056A8960%M365M12K141j656l624m30N04M235K625P03l905j162R16m441m55L423
7039B2611L780n90k30j321k800K334K920k84L282J737k773q454P58M912R02l139
7023B3645k694n24K118j106K82J48O20M001K91N39k042k543Q43R50j539k964l139
$$ plain form
7006 16886 17892 21083 18845 16917 17811 22490 27540 26995 22707 24629 28016 26330 25078 21660 21905
6991 21905 23552 25939 28086 30234 28721 26541 27770 26828 23908 19461 16158 16275 18096 21786 22096
6976 22096 20906 20364 21056 20869 21913 23759 26274 31601 33466 30829 30065 25508 24590 26850 27058 25830
6960 25830 25817 24721 21033 22295 23286 21072 23418 27324 23433 17235 21081 16648 18252 19545 20273 21091
6944 21091 21194 19598 19915 19839 18876 18493 21429 21786 21156 23217 21680 20844 21370 21326 20930 21545 24234 24321 19301
6925 19301 16162 18181 22499 22993 21318 16181 13476 17113 14557 14915 16465 20382 21228 20567 18510 18683
6909 18683 18738 16053 16203 15111 17844 16145 17809 23737 25559 25719 19962 20316 18969 18885 20761 20725 21176
6892 21176 19966 19399 21867 26019 24923 22066 18622 15949 12721 15150 14559 9791 10807 16322 19438
$$ packed form
7006A6886J006L191k238j928Q94M679N050n45m288J922L387j686j252l418K45
6991B1905J647K387K147K148j513k180J229r42k920m447l303J17J821L690L10
6976B2096j190n42O92j87J044J846K515N327J865k637p64m557r18K260K08j228
6960B5830j3j096l688J262R91k214K346L906l891o198L846m433J604J293P28Q18
6944B1091J03j596L17p6r63l83K936L57o30K061j537q36N26m4l96O15K689Q7n020
6925A9301l139K019M318M94j675n137k705L637k556L58J550L917Q46o61k057J73
6909A8683N5k685J50j092K733j699J664N928J822J60n757L54j347q4J876l6M51
6892B1176j210n67K468M152j096k857l444k673l228K429n91m768J016N515L116
$$ plain form
6877 19438 19472 18165 16837 17847 19846 19434 20165 21054 22227 21419 20201 18958 15209 14710 16571 18110
6861 18110 18345 18668 21593 23210 22392 16914 12718 12884 11315 12091 15704 14648 11327 11335 14146 17623 16416
6844 16416 14925 17791 21129 20900 21944 21035 20507 23237 23413 22060 17896 18813 19775 17583 17214 18382
6828 18382 21612 23077 25302 26038 23925 19085 17150 15055 20553 22349 20505 20683 20809 19757 19407 18927
6812 18927 19440 22386 25462 22743 18432 19888 20966 16818 16027 16597 18099 21577 22057 22422 22611 22820
6796 22820 21304 20347 19977 20018 20015 19234 21670 22991 19484 19695 18943 15167 12750 13058 12905 13606 14431 14833
6778 14833 17252 22267 22324 19699 18933 19461 15497 16565 19070 20837 22119 22402 21810 19997 15782 19745
6762 19745 19318 16461 13690 12916 14956 19064 18678 15819 17058 18750 21398 24544 23905 21294 22350 18908
$$ packed form
6877A9438L4j307j328J010J999m12P31Q89J173q08j218j243l749m99J861J539
6861A8110K35L23K925J617q18n478m196J66j569P76L613j056l321QK811L477j207
6844A6416j491K866L338k29J044r09n28K730J76j353m164R17R62k192l69J168
6828A8382L230J465K225P36k113m840j935k095N498J796j844J78J26j052l50m80
6812A8927N13K946L076k719m311J456J078m148p91N70J502L478M80L65J89K09
6796B2820j516r57l70M1lp81K436J321l507K11p52l776k417L08j53P01Q25M02
6778A4833K419N015N7k625p66N28l964J068K505J767J282K83n92j813m215L963
6762A9745m27k857k771p74K040M108l86k859J239J692K648L146o39k611J056l442
$$ plain form
6746 18908 17473 18460 21056 23309 22621 25135 28195 32844 36352 39101 52731 78974 117579 180273
6732 180273 274939 307783 224002 138485 91688 68634 54383 45876 39727 36961 34157 35167 32562
6719 32562 28689 27730 30571 38501 50378 56011 46076 38894 32953 33310 30009 23287 17214 18343 22629
6704 22629 19055 18476 21541 20907 19324 22792 25089 25437 25503 28116 21233 18918 18487 17066 16569 18149
6688 18149 17287 16121 13695 16754 20274 22809 24293 21088 17902 14911 16575 21210 26321 27312 29589
6673 29589 28069 23657 18710 20082 21742 21628 18530 16747 15230 12461 15663 16913 18739 15919 17494
6658 17494 14958 10770 12570 14599 19733 17957 15192 18140 19323 16790 16439 18411 16073 17275 17924
6643 17924 13708 12593 14797 18212 20234 21305 19779 16227 12180 9941 11454 14299 17813 19115 18919
$$ packed form
6746A8908j435R87K596K253o88K514L060M649L508K749J3630K6243L8605O2694
6732A80273R4666L2844q3781q5517m6797k3054j4251q507o149k766k804J010k605
6719C2562l873r59K841P930J1877N633r935p182n941L57l301o722o073J129M286
6704B2629l574n79L065o34j583L468K297L48O6K613o883k315m31j421m97J580
6688A8149q62j166k426L059L520K535J484l205l186k991J664M635N111R91K277
6673B9589j520m412m947J372J660j14l098j783j517k769L202J250J826k820J575
6658A7494k536m188J800K029N134j776k765K948J183k533l51J972k338J202O49
6643A7924m216j115K204L415K022J071j526l552m047k239J513K845L514J302j96
$$ plain form
6628 18919 16362 15323 12126 12591 14708 14285 12003 12868 16702 19293 18117 13500 11820 11870 14327 17046
6612 17046 22296 23801 21841 18952 19745 17514 15026 17551 17414 13996 12873 12826 13553 14759 12913 11047
6596 11047 12461 16627 16358 12458 9251 12203 15041 16716 15783 19059 17584 15447 15428 16585 16104 14547
6580 14547 10116 10688 14584 15457 13643 17510 19226 17721 16176 14633 16156 13463 14186 13873 13643 14463
6564 14463 16196 18846 18759 18932 16986 17697 18547 16115 12587 13357 14324 17151 20384 20629 22599 19843 18444
6547 18444 18202 15376 13812 13860 17065 20357 20366 15611 13946 14885 15408 11513 12444 14896 14831 12244 12747 15291
6529 15291 18375 15420 12950 12534 11791 10435 10206 11582 14573 16546 17120 17354 17843 19829 20175 18933
6513 18933 16003 18059 19120 19363 19636 18928 18977 20418 21246 19184 16750 16154 15849 14728 14849 16254 17929
$$ packed form
6628A8919k557j039l197M65K117m23k282Q65L834K591j176m617j680N0K457K719
6612A7046N250J505j960k889P93k231k488K525j37l418j123m7P27J206j846j866
6596A1047J414M166k69l900l207K952K838J675r33L276j475k137j9J157m81j557
6580A4547m431N72L896Q73j814L867J716j505j545j543J523k693P23l13k30Q20
6564A4463J733K650q7J73j946P11Q50k432l528P70R67K827L233K45J970k756j399
6547A8444k42k826j564M8L205L292Rm755j665R39N23l895R31K452o5k587N03K544
6529A5291L084k955k470m16p43j356k29J376K991J973N74K34M89J986L46j242
6513A8933k930K056J061K43K73p08M9J441Q28k062k434n96l05j121J21J405J675
$$ plain form
6496 17929 13622 12610 13499 15158 19360 19784 19006 16118 14863 19479 15742 12248 14003 14538 12707 11977
6480 11977 15325 13200 13654 12819 13652 11205 10264 15035 15839 11241 8328 11393 14126 15345 10510 7664
6464 7664 3442 7057 12783 16440 10366 7990 9910 8496 3486 3451 8059 9894 9725 7306 5714 6594
6448 6594 8595 12748 17142 15294 15168 14652 12395 11471 9406 8840 7587 8858 13193 16064 14601 6599
6432 6599 2508 2472 5464 10360 13970 19916 18146 11789 13436 19433 21141 19929 17092 15017 17367
6417 17367 17743 12674 11262 12054 9954 9159 9932 11434 11274 11884 9235 5237 11176 14555 10674 6563
6401 6563 8030 9187 8840 8019 5955 6428 9274 10832 10697 8968 9466 9419 8391 10074 8873 7272 5124
6384 5124 7150 3545 219 -865 2475 2215 -1056 410 5714 6988 7296 5126 2110 5414 4232
$$ packed form
6496A7929m307j012Q89J659M202M24p78k888j255M616l737l494J755N35j831p30
6480A1977L348k125M54q35Q33k447r41M771Q04m598k913L065K733J219m835k846
6464G664m222L615N726L657o074k376J920j414n010l5M608J835j69k419j592Q80
6448F594K001M153M394j848j26n16k257r24k065n66j253J271M335K871j463q002
6432F599m091l6K992M896L610N946j770o357J647N997J708j212k837k075K350
6417A7367L76n069j412P92k100p95P73J502j60O10k649l998N939L379l881m111
6401F563J467J157l47q21k064M73K846J558j35j729M98m7j028J683j201j601k148
6384E124K026l605l326j084L340k60l271J466N304J274L08k170l016L304j182
$$ plain form
6369 4232 8559 11320 9354 8920 9703 9881 8323 9876 14471 14637 15729 17117 13967 14226 16578 14692
6353 14692 9651 7916 12104 12120 13376 14703 14359 13281 12076 11953 9141 7798 9345 11868 12128 11402
6337 11402 12030 11355 8942 10216 9585 8993 8050 10539 11375 6478 4562 2932 2615 3222 5095 6382 7335
6320 7335 4468 5336 8867 11554 11053 8685 6728 8099 11606 14377 13334 13464 16929 17752 17327 11740
6304 11740 7470 11025 13516 13414 13034 12495 12043 12265 13410 12110 10521 8463 6040 9331 12894 11957
6288 11957 14540 15725 16302 14200 7555 3725 9127 13714 15956 16372 12523 9904 9365 9399 10779 11483
6272 11483 8029 4780 3033 579 21 -610 -680 -1410 2967 7955 4570 4093 4414 4744 6935 11419 14638
6255 14638 10781 4903 5508 7176 5269 4747 6083 8464 8007 3743 3155 1762 1657 2912 3545 947
$$ packed form
6369D232M327K761j966m34P83J78j558J553M595J66J092J388l150K59K352j886
6353A4692n041j735M188J6J256J327l44j078j205j23k812j343J547K523K60p26
6337A1402O28o75k413J274o31n92r43K489Q36m897j916j630l17O07J873J287R53
6320G335k867Q68L531K687n01k368j957J371L507K771j043J30L465Q23m25n587
6304A1740m270L555K491j02l80n39m52K22J145j300j589k058k423L291L563r37
6288A1957K583J185N77k102o645l830N402M587K242M16l849k619n39L4J380P04
6272A1483l454l249j747k454n58o31p0p30M377M988l385m77L21L30K191M484L219
6255A4638l857n878O05J668j907n22J336K381m57m264n88j393j05J255O33k598
$$ plain form
6239 947 -1220 -947 3158 9266 17109 19566 18082 18526 17444 12868 12991 10960 8429 4485 2142 8442
6223 8442 10966 10395 9255 7540 5565 5859 7103 9831 11558 14434 10627 8556 5318 4287 5903
6208 5903 9791 11319 10736 10734 12286 8351 5202 6022 2827 1264 4596 7971 9145 12306 17628 15068
6192 15068 12019 5138 727 5908 6857 2991 2670 2966 3106 6256 7304 3513 3272 5951 7037 5977
6176 5977 5739 5180 5461 12246 15823 14493 11023 8427 5699 6254 10251 8575 7938 10995 11447 11162 7660
6159 7660 7497 8172 4987 5426 3948 374 -1527 963 4841 7259 6321 7692 10903 9717 8896 4944
6143 4944 6346 7805 6541 5763 4742 4711 9243 8623 4436 1627 2762 5285 7812 6767 5176 6556
6127 6556 8459 9924 7630 3067 2042 4992 4677 7424 7195 9867 7171 582 -426 551 395 -431
$$ packed form
6239I47k167K73M105O108P843K457j484M44j082m576J23k031k531l944k343O300
6223H442K524n71j140j715j975K94J244K728J727K876l807k071l238j031J616
6208E903L888J528n83kJ552l935l149Q20l195j563L332L375J174L161N322k560
6192A5068l049o881m411N181R49l866l21K96J40L150J048l791k41K679J086j060
6176E977k38n59K81O785L577j330l470k596k728N55L997j676o37L057M52k85l502
6159G660j63O75l185M39j478l574j901K490L878K418r38J371L211j186q21l952
6143D944J402J459j264p78j021l1M532o20m187k809J135K523K527j045j591J380
6127F556J903J465k294m563j025K950l15K747k29K672k696o589j008R77j56q26
$$ plain form
6111 -431 654 739 -95 684 3121 9017 9676 9702 7704 5576 2018 5926 5633 5212 9363 9421 7449 8184
6093 8184 9151 4646 5040 7468 6012 2610 -2459 -690 3322 5612 6011 1002 -4167 -1105 3743 7900
6077 7900 11678 11919 11752 8057 4419 5800 6016 6415 6481 5454 8080 10815 10023 7732 4819 3752 3021
6060 3021 2868 4775 6459 6604 10364 5365 919 4141 5474 4243 6064 8826 8241 7435 7247 6635
6044 6635 6233 9639 11795 10164 12676 13525 6449 5129 5909 6026 2955 3967 4379 5339 5474 3300 3717
6027 3717 6654 6385 6795 7834 8002 6272 6586 3034 6623 13082 12079 12672 11048 10299 11068 7018 6374
6010 6374 6136 5333 8470 9672 8535 8123 2409 1767 3839 3491 7301 9095 11335 10095 7327 4787
5994 4787 5405 7310 7318 11516 8264 4447 6714 5570 9154 12039 13276 9449 3167 3674 3955 4068 7606
$$ packed form
6111d31J085Q5q34P79K437N896O59K6j998k128l558L908k93m21M151N8j972P35
6093H184R67m505L94K428j456l402n069J769M012K290L99n009n169L062M848M157
6077G900L778K41j67l695l638J381K16L99O6j027K626K735p92k291k913j067p31
6060C021j53J907J684J45L760m999m446L222J333j231J821K762n85q06j88o12
6044F635m02L406K156j631K512Q49p076j320P80J17l071J012M12R60J35k174M17
6027C717K937k69M10J039J68j730L14l552L589O459j003N93j624p49P69m050o44
6010F374k38q03L137J202j137m12n714o42K072l48L810J794K240j240k768k540
5994D787O18J905QM198l252l817K267j144L584K885J237l827o282N07K81J13L538
$$ plain form
5977 7606 5896 -847 -2674 -2198 2365 4699 4659 1884 -1100 -1355 -1246 -579 5201 6625 4411 4532 4085
5960 4085 5108 5838 4060 5170 9619 14566 12926 8097 6523 7438 9902 7976 2440 -5106 -4370 -2128
5944 -2128 -1454 -755 -1948 6092 7075 3062 3218 7409 7992 6552 7000 9742 8358 5459 7366 7122 9654
5927 9654 10422 9042 13551 13921 12134 8970 5309 2142 2185 3186 7397 7136 7018 7478 5097 2956 138
5910 138 3404 7700 12805 12547 13957 12174 12217 11157 7616 4889 5172 7175 6216 2749 1819 2603 3631
5893 3631 2367 -150 -562 4425 5125 2976 3961 2396 1955 807 2879 8274 9960 9867 7665 4627
5877 4627 6325 5695 2732 3684 7996 6813 5862 7931 11332 15216 15577 12131 12187 13292 14057 14774 15237
5860 15237 16685 16465 14036 14506 15530 13095 9658 10437 9167 5122 3793 4947 5329 5902 1918 -1831
$$ packed form
5977G606j710o743j827M76M563K334m0k775k984k55J09O67N780J424k214J21m47
5960D085J023P30j778J110M449M947j640m829j574R15K464j926n536p546P36K242
5944b128O74O99j193Q040R83m013J56M191N83j440M48K742j384k899J907k44K532
5927I654P68j380M509L70j787l164l661l167M3J001M211k61j18M60k381k141k818
5910A38L266M296N105k58J410j783M3j060l541k727K83K003r59l467r30P84J028
5893C631j264k517m12M987P00k149R85j565m41j148K072N395J686r3k202l038
5877D627J698o30k963R52M312j183r51K069L401L884L61l446N6J105P65P17M63
5860A5237J448k20k429M70J024k435l437P79j270m045j329J154L82N73l984l749
$$ plain form
5844 -1831 -5792 -6650 -6661 -529 5362 7924 9533 10896 11144 9365 4069 2606 3547 862 -1676 -4686
5828 -4686 -4746 -4575 -8660 -8805 -8142 -6844 -5872 -2518 861 2979 4511 10052 9525 7994 6723 5409 8425
5811 8425 4320 3526 4717 3691 4358 3871 -1263 -3405 -2357 1831 1951 5126 10259 11642 10534 11079
5795 11079 13059 9536 7183 4074 1477 -5048 -10471 -11162 -10788 -10613 -8884 -3510 -5052 -7018 -8816
5780 -8816 -5256 -348 5604 8301 11349 11119 12588 10740 8542 8695 7419 4756 229 1313 -275
5765 -275 -3328 -3280 -2864 -1676 -2104 535 2699 5460 7795 7842 13386 12545 12322 11997 9350 9048 9308 6629
5747 6629 2978 3203 6110 6327 9190 10854 9029 7400 8469 8188 8827 8385 4836 2065 -624 -2209
5731 -2209 1812 6 -1680 -4973 -7241 -4792 -3662 104 1890 4838 8384 5828 2901 3580 3704
$$ packed form
5844a831l961q58j1O132N891K562J609J363K48j779n296j463R41k685k538l010
5828d686o0J71m085j45O63J298R72L354L379K118J532N541n27j531j271j314L016
5811H425m105p94J191j026O67m87n134k142J048M188J20L175N133J383j108N45
5795A1079J980l523k353l109k597o525n423o91L74J75J729N374j542j966j798
5780h816L560M908N952K697L048k30J469j848k198J53j276k663m527J084j588
5765b75l053M8M16J188m28K639K164K761K335M7N544q41k23l25k647l02K60k679
5747F629l651K25K907K17K863J664j825j629J069k81O39m42l549k771k689j585
5731b209M021j806j686l293k268K449J130L766J786K948L546k556k927O79J24
$$ plain form
5716 3704 4290 6707 7155 7581 9717 11935 10229 7891 5777 3591 -261 -1420 3341 6540 5224 3758
5700 3758 7848 9164 4374 3928 6508 7610 4928 3646 4100 5278 7171 11454 13651 9570 2504
5685 2504 185 -1240 1752 11154 11363 4106 -390 -514 3515 4981 4568 2165 4477 3264 672 1291
5669 1291 148 865 2231 -894 -1775 -786 -1402 -2385 -2562 -483 1379 2135 3431 679 2111 1634 4524
5652 4524 8488 9698 11680 12091 7904 2774 -1962 2279 5021 36 -1971 3187 5124 4941 4603 4831
5636 4831 2701 5398 5643 4290 2629 -1036 -5001 -3460 573 4929 3831 653 751 1426 1925 1828 7372
5619 7372 8174 4071 1152 2302 888 1256 -1699 -529 1840 5182 5467 2684 1585 847 1917 1164
5603 1164 430 -850 -539 1615 2785 1887 4482 4079 1479 224 101 -1284 -659 -334 -1578 1392 1210
$$ packed form
5716C704N86K417M48M26K136K218j706k338k114k186l852j159M761L199j316j466
5700C758M090J316m790m46K580J102k682j282M54J178J893M283K197m081p066
5685B504k319j425K992R402K09p257m496j24M029J466m13k403K312j213k592O19
5669A291j143P17J366l125q81R89o16r83j77K079J862P56J296k752J432m77K890
5652D524L964J210J982M11m187n130m736M241K742m985k007N158J937j83l38K28
5636D831k130K697K45j353j661l665l965J541M033M356j098l178R8O75M99r7N544
5619G372Q02m103k919J150j414L68k955J170K369L342K85k783j099p38J070p53
5603A164p34j280L11K154J170q98K595m03k600j255j23j385O25L25j244K970j82
$$ plain form
5586 1210 1695 -2350 -1001 6403 4520 2622 2825 4109 3901 511 1245 3221 1456 -2683 -2118 -796
5570 -796 -1121 897 4919 3647 169 3167 -151 188 119 465 1879 1955 2766 5785 4563 2145 2872
5553 2872 -1346 -2604 505 753 3735 3043 1380 27 -4248 -5612 -5530 -1960 805 3838 4814 4339
5537 4339 3708 3132 4754 2638 1005 -2317 -509 -592 -3159 -1616 4137 10118 4851 -1845 -6414 -5611
5521 -5611 -6324 -2782 396 2234 5236 5679 3310 3068 2383 -1164 -1945 -1551 6 902 1995 3208 3859
5504 3859 6807 8085 3854 1414 1749 4290 4233 7434 6946 3985 1974 1939 4951 4325 3753 -770 -1784
5487 -1784 -1984 -1891 -1241 -912 2303 3621 877 58 -9 1790 2592 1567 -414 1340 2012 838 2329
5470 2329 1568 1227 -855 224 2351 2321 177 1270 511 861 313 180 199 -2070 -5195 -9783 -11950
$$ packed form
5586A210M85m045J349P404j883j898K03J284k08l390P34J976j765m139N65J322
5570g96l25K018M022j272l478K998l318L39o9L46J414P6Q11L019j222k418P27
5553B872m218j258L109K48K982o92j663j353m275j364Q2L570K765L033R76m75
5537D339o31n76J622k116j633l322J808q3k567J543N753N981n267o696m569Q03
5521e611p13L542L178J838L002M43k369k42o85l547p81L94J557Q96J093J213O51
5504C859K948J278m231k440L35K541n7L201m88k961k011l5L012o26n72m523j014
5487a784k00R3O50L29L215J318k744q19o7J799Q02j025j981J754O72j174J491
5470B329p61l41k082J079K127l0k144J093p59L50n48j33J9k269l125m588k167
$$ plain form
5453 -11950 -8373 -3744 -2958 -1448 1970 -1777 -1899 -1660 696 710 -70 -2449 -3900 318 1095 559 2472
5436 2472 1812 -2347 -4360 1066 2826 -592 222 1146 -1637 -3245 -1114 -651 1486 2609 994 -446
5420 -446 -818 268 -1095 2050 4238 4015 6388 3366 322 -1208 -2934 -2305 -247 252 2144 -935
5404 -935 -4200 -3214 -1779 -1479 -1786 -5520 -8466 -9468 -5406 -1926 -1751 -3516 2442 2071 -1341 -1065 405
5387 405 251 -2338 4595 7645 8046 4143 806 -1971 -2092 -687 -948 2561 206 -1164 177 5289
5371 5289 5325 1017 420 4075 3035 5034 4493 4295 2642 1572 -998 -3784 -4975 -1756 -2064 -2440 -1065
5354 -1065 -4588 -2359 2866 170 -3652 -3803 -3485 -591 -298 -1827 -3925 -4567 -3146 -2373 -2865 700
5338 700 8042 7406 4814 433 -3399 -5123 -3850 590 -2468 -1080 1597 3397 2024 809 2650
$$ packed form
5453a1950L577M629P86J510L418l747j22K39K356J4p80k379j451M218P77n36J913
5436B472o60m159k013N426J760l418Q14R24k783j608K131M63K137J123j615j440
5420d46l72J086j363L145K188k23K373l022l044j530j726O29K058M99J892l079
5404i35l265R86J435L00l07l734k946j002M062L480J75j765N958l71l412K76J470
5387D05j54k589O933L050M01l903l337k777j21J405k61L509k355j370J341N112
5371E289L6m308n97L655j040J999n41j98j653j070k570k786j191L219l08l76J375
5354a065l523K229N225k696l822j51L18K894K93j529k098o42J421P73m92L565
5338G00P342o36k592m381l832j724J273M440l058J388K677J800j373j215J841
$$ plain form
5323 2650 3047 1906 429 -1188 -1718 -782 -3788 -5380 -4684 1391 944 522 3430 1167 563 1782 -3308
5306 -3308 -4355 -1489 -1199 -4049 -3148 1129 2263 -735 -4118 -2171 -629 469 -19 1322 -1593 -6005
5290 -6005 -6310 -4862 -7270 -7688 -6907 -7189 -6247 -6873 -4851 -1402 -2040 -2255 -1003 -1893 4092 8553 4391
5273 4391 5874 3827 -111 476 2251 -1314 -1644 50 1194 884 1237 4480 6134 4118 941 -1861
5257 -1861 -4915 -5466 -5700 -9722 -4576 -759 3519 1288 -627 1312 -2596 -4636 -4958 -2840 -30 -2787
5241 -2787 -4438 -3515 -158 991 1745 4332 2609 1083 -3867 -4406 -2929 -1986 -847 -3404 -6364 -3518
5225 -3518 -181 876 -958 -5324 -3273 -2774 -2944 -913 -2797 -2916 -2137 -2813 -3261 237 -1222 -4765
5209 -4765 -3298 -4060 -4014 -4078 -3974 -202 1898 3096 2186 -309 242 3517 302 -2329 -6600 -10253 -8162
$$ packed form
5323B650L97j141j477j617n30R36l006j592O96O075m47m22K908k263o04J219n090
5306c308j047K866K90k850R01M277J134k998l383J947J542J098m88J341k915m412
5290f005l05J448k408m18P81k82R42o26K022L449o38k15J252q90N985M461m162
5273D391J483k047l938N87J775l565l30J694J144l10L53L243J654k016l177k802
5257a861l054n51k34m022N146L817M278k231j915J939l908k040l22K118K810k757
5241b787j651R23L357J149P54K587j723j526m950n39J477R43J139k557k960K846
5225c518L337J057j834m366K051M99j70K031j884j19P79o76m48L498j459l543
5209d765J467p62M6o4J04L772K100J198r10k495N51L275l215k631m271l653K091
$$ plain form
5192 -8162 -3822 -1910 66 2316 211 -12 -84 -4022 -1363 873 1291 -1922 -3677 -1676 -1222 365
5176 365 -778 -1996 -2832 -2731 -3128 -3460 -1298 -4705 -5999 -2267 1959 3658 4361 -665 -3489 -1715
5160 -1715 -4113 -6756 -7647 -4367 -5092 -4036 -2537 -2250 -2701 -1903 -481 -1448 -310 816 -150 -1720 -2903
5143 -2903 -3719 -1051 -1622 -3152 -2535 -4432 -7057 -5552 -5685 -8466 -6587 -3937 -3570 -5674 -7993 -8246
5127 -8246 -6123 -5482 -8236 -8660 -5609 -2885 -2906 2194 6268 4729 860 -4042 -4720 -3249 -2534 344
5111 344 306 -2277 -2647 -1509 -3816 -2474 1956 631 334 -1023 2298 5581 3800 950 2240 4786
5095 4786 4805 2794 -793 228 5071 3719 693 -2788 -7842 -6677 -4106 -3140 -560 -5991 -9256 -5158
5079 -5158 -84 -288 -1620 -3119 -5426 -3790 -235 449 -2170 -7411 -8006 -6266 -3623 -2310 739 -436
$$ packed form
5192h162M340J912J976K250k105k23p2l938K659K236M18l213j755K001M54J587
5176C65j143j218q36J01l97l32K162l407j294L732M226J699P03n026k824J774
5160a715k398k643q91L280p25J056J499K87m51P98J422r67J138J126r66j570j183
5143b903q16K668n71j530O17j897k625J505j33k781J879K650L67k104k319k53
5127h246K123O41k754m24L051K724k1N100M074j539l869m902o78J471P15K878
5111C44l8k583l70J138k307J342M430j325k97j357L321L283j781k850J290K546
5095D786J9k011l587J021M843j352l026l481n054J165K571R66K580n431l265M098
5079e158N074k04j332j499k307J636L555O84k619n241n95J740K643J313L049j175
$$ plain form
5063 -436 -2509 -2344 723 -1195 -1014 -2586 -5270 -9967 -8606 -7704 -2287 -340 -3832 -4104 -4131 609 4463
5046 4463 3608 2965 967 -277 3324 2673 2050 1640 3116 7875 9545 9731 3682 -2926 -4922 -4862 -3555
5029 -3555 -5542 -3320 -211 369 2105 576 -693 -5002 -6183 -5664 -7962 -9542 -5927 -2833 -4006
5014 -4006 -5920 -3817 -3460 -369 -837 -3213 -2464 -2475 -3378 -2476 -1769 -2760 -2929 -3999 -552 529 -1390
4997 -1390 -1545 -1911 -2101 -4800 -4695 -3157 -2335 -3512 -8767 -11260 -7908 -9473 -5840 -1421 -4629 -11732
4981 -11732 -10902 -5562 -6274 -5967 443 5807 2323 247 1890 1263 -1774 -2218 -5063 -7758 -9793 -7410
4965 -7410 -5509 -6603 -4263 -4805 -5260 -4235 -10572 -15311 -16046 -14937 -14617 -12527 -8255 -5618 -1721 -1603
4949 -1603 -1065 -4415 -6446 -4455 -6064 -7150 -8049 -8621 -7299 -6411 -5904 -6143 -4527 -2012 -3591 -1559
$$ packed form
5063d36k073J65L067j918J81j572k684m697J361R02N417J947l492k72k7M740L854
5046D463q55o43j998j244L601o51o23m10J476M759J670J86o049o608j996O0J307
5029c555j987K222L109N80J736j529j269m309j181N19k298j580L615L094j173
5014d006j914K103L57L091m68k376P49j1r03R02P07r91j69j070L447J081j919
4997a390j55l66j90k699J05J538Q22j177n255k493L352j565L633M419l208p103
4981a1732Q30N340p12L07O410N364l484k076J643o27l037m44k845k695k035K383
4965g410J901j094K340n42m55J025o337m739p35J109L20K090M272K637L897J18
4949a603N38l350k031J991j609j086q99n72J322Q88N07k39J616K515j579K032
$$ plain form
4933 -1559 -3233 -4210 -2517 122 2755 3360 2064 3428 1170 -1750 -3508 -4388 -1965 2707 393 -857
4917 -857 -1602 -2830 -3882 -2036 -1875 -2872 -5433 -6096 -7196 -7891 -6730 -1734 3447 6954 1477 -4716
4901 -4716 -1675 332 -2100 -2348 -1154 -1285 -3235 -8512 -8283 -6523 -5921 -4029 -5493 -4742 -6153 -4731
4885 -4731 -3597 -4196 -2578 -4088 -725 1225 -421 129 -407 -1897 -3282 -2951 -1235 -4398 -1040 1136
4869 1136 -66 2953 3711 1453 28 2551 5452 6506 6451 3811 -1203 -2849 -3808 -4086 -3528 -4377 -3460
4852 -3460 -3175 -1544 37 3382 3722 2385 291 -1242 -2812 -1848 -726 -341 -120 3678 1210 -534
4836 -534 -2368 -4035 -6167 -8337 -3048 -1349 -1919 -1288 -4578 -3465 -7619 -6862 -4179 -3817 -7155 -7675
4820 -7675 -4972 -4112 -7882 -4040 -2385 -3154 -2985 -371 -145 -5507 -8552 -7839 -7304 -8302 -6505 -3667 -3601
$$ packed form
4933a559j674r77J693K639K633O05j296J364k258k920j758q80K423M672k314j250
4917h57p45j228j052J846J61r97k561o63j100o95J161M996N181L507n477o193
4901d716L041K007k432k48J194j31j950n277K29J760O02J892j464P51j411J422
4885d731J134n99J618j510L363J950j646N50n36j490j385L31J716l163L358K176
4869A136j202L019P58k258j425K523K901J054n5k640n014j646r59k78N58q49R17
4852c460K85J631J581L345L40j337k094j533j570R64J122L85K21L798k468j744
4836e34j834j667k132k170N289J699n70O31l290J113m154P57K683L62l338n20
4820g675K703Q60l770L842J655p69J69K614K26n362l045P13N35r98J797K838O6
$$ plain form
4803 -3601 -5222 -2850 -1279 -1269 -3097 -3201 -5017 -5612 -4457 -4978 -4387 -4170 -7434 -8884 -6981 -6810 -9794
4786 -9794 -11711 -7056 -5812 -6442 -5635 -4777 -123 -2461 -1084 1311 -4145 -8447 -5898 608 1683 -603
4770 -603 -4264 -7180 -6519 -3876 -4104 -3268 -2359 -3085 -3146 -4577 -6262 -5102 -4647 -1521 887 -787 -3385
4753 -3385 -5705 -3991 -1742 -931 -1411 -4397 -6979 -9444 -10660 -7387 -5060 -5119 -4050 -4223 -6991 -8709
4737 -8709 -5878 -5690 -6507 -2743 -1010 -5819 -7256 -5900 -3270 -2972 -8006 -11732 -14067 -11683 -6917 -3772
4721 -3772 -5843 -9081 -9033 -6974 -6725 -4408 571 -1983 -4721 -6422 -5319 -2431 -3154 -4636 -2047 -2496
4705 -2496 -4599 -4072 -7081 -8596 -6130 -4067 -1342 141 3447 4741 1444 69 -229 -1401 -3402
4690 -3402 -5393 -6266 -3661 -1867 -4632 -5529 -5084 -6303 -5958 -5981 -5770 -6783 -4425 -4111 -3052 -714 -2227
$$ packed form
4803c601j621K372J571J0j828j04j816n95J155n21N91K17l264j450J903J71k984
4786i794j917M655J244o30Q07Q58M654k338J377K395n456m302K549O506J075k286
4770f03l661k916O61K643k28Q36R09p26o1j431j685J160M55L126K408j674k598
4753c385k320J714K249Q11m80k986k582k465j216L273K327n9J069j73k768j718
4737h709K831J88q17L764J733m809j437J356K630K98n034l726k335K384M766L145
4721c772k071l238M8K059K49K317M979k554k738j701J103K888p23j482K589m49
4705b496k103N27l009j515K466K063K725J483L306J294l297j375k98j172k001
4690c402j991q73K605J794k765q97M45j219L45k3K11j013K358L14J059K338j513
$$ plain form
4673 -2227 -5316 -8096 -6745 -6264 -9835 -8574 -6420 -2715 -1841 -851 -624 428 32 397 -3595 -5307
4657 -5307 -5654 -3869 -160 2213 1567 -1964 -4901 -8106 -9437 -7559 -1772 1879 1753 521 572 645 1197
4640 1197 982 -1950 -4035 -5396 -7237 -6803 -4951 -4576 -6311 -3903 -774 -1781 -2391 -4991 -6455 -5255
4624 -5255 -7205 -4360 -2603 -3438 -4368 -4501 -3541 -1582 -3834 -4800 -6058 -8042 -4125 -2110 -2853 -2064 3727
4607 3727 5300 1340 -3383 -3129 -2819 -1886 -3195 -7436 -7246 -2099 -326 -2517 -3792 -3601 -2775 -1617
4591 -1617 -1602 -2030 -3147 -6096 -9380 -8173 -7070 -9359 -7521 -8672 -4405 -1943 -5552 -6658 -6693 -3944
4575 -3944 -3279 -4519 -3166 -1449 -4376 -11098 -7702 -2615 -859 -2511 -6267 -6602 -5662 -4591 -503 -274
4559 -274 89 -193 45 -1050 -5085 -10771 -9565 -6198 -8834 -10722 -5685 -2621 -851 -2734 -3567 -2487
$$ packed form
4673b227l089k780J351M81l571J261K154L705Q74R90K27J052l96L65l992j712
4657e307l47J785L709K373o46l531k937l205j331J878N787L651j26j232N1P3N52
4640A197k15k932k085j361j841M34J852L75j735K408L129j007o10k600j464J200
4624e255j950K845J757q35r30j33R60J959k252r66j258j984L917K015p43P89N791
4607C727J573l960m723K54L10R33j309m241J90N147J773k191j275J91Q26J158
4591a617J5m28j117k949l284J207J103k289J838j151M267K462l609j106l5K749
4575c944O65j240J353J717k927o722L396N087J756j652l756l35R40J071M088K29
4559b74L63k82K38j095m035n686J206L367k636j888N037L064J770j883q33J080
$$ plain form
4543 -2487 -1930 -1012 -3500 -6337 -4397 -97 -1478 -5353 -7396 -4419 -3832 -677 2196 94 -2480 -1192
4527 -1192 -1221 -4798 -9177 -10067 -8396 -8447 -7812 -5097 -4408 -5233 -4675 -6558 -8095 -7218 -1509 2337 2000 72
4509 72 -3212 -4511 -6836 -8327 -9917 -7374 -7673 -7496 -8087 -6486 -6352 -7602 -8804 -7903 -7050 -2670 422
4492 422 2773 2042 25 -2495 -4277 -9530 -10676 -8489 -9601 -8394 -8406 -7943 -5641 -3936 -1925 -3115
4476 -3115 -5524 -5698 -7719 -9352 -10970 -10367 -7406 -4593 -6161 -4305 -3358 -6931 -8346 -6694 -11 1417
4460 1417 -391 -3249 -4474 -7121 -7727 -4757 -3176 996 338 -2512 -3682 -2079 -702 -2198 -1039
4445 -1039 -605 -225 -1856 -6328 -5818 -5515 -5483 -8751 -8860 -3113 -676 -4718 -2309 -49 -8022 -6881 -3007
4428 -3007 -3185 -4940 -8253 -11779 -11877 -9577 -8351 -9972 -10310 -11255 -8040 -7309 -8174 -7978 -10232 -11715 -11033
$$ packed form
4543b487N57R18k488k837J940M300j381l875k043K977N87L155K873k102k574J288
4527a192k9l577m379q90J671n1O35K715O89q25N58j883j537Q77N709L846l37j928
4509G2l284j299k325j491j590K543k99J77n91J601J34j250j202R01Q53M380L092
4492D22K351p31k017k520j782n253j146K187j112J207j2M63K302J705K011j190
4476c115k409j74k021j633j618O03K961K813j568J856R47l573j415J652O683J428
4460A417j808k858j225k647o06K970J581M172o58k850j170J603J377j496J159
4445a039M34L80j631m472N10L03L2l268j09N747K437m042K409K260p973J141L874
4428c007j78j755l313l526r8K300J226j621l38r45L215P31q65J96k254j483O82
$$ plain form
4411 -11033 -9854 -7353 -3950 -2606 -6570 -10944 -9282 -7599 -3748 -3765 -2749 -2171 -4238 -10002 -14901
4396 -14901 -12105 -8213 -9355 -10294 -8313 -6081 -7334 -8823 -8763 -11545 -11766 -12976 -9603 -5447 -3777 -2798
4380 -2798 -4446 -6555 -3334 -3611 -8181 -8006 -8207 -6871 -4133 -4491 -6151 -6840 -6839 -6945 -8539 -8520 -9189 -7481
4362 -7481 -4754 -5683 -8628 -8189 -4328 -1253 -4625 -6151 -957 -538 -764 -4749 -7212 -6334 -5961 -5134 -7426
4345 -7426 -4780 -7415 -7738 -4358 -5637 -7939 -3184 1366 639 -3547 -1187 772 -3628 -4371 2488 3042
4329 3042 -434 -3320 -4537 -5416 -6964 -6910 -7800 -7889 -8344 -6974 -4556 -4578 -4337 -3278 -952 -3619 -3516 -1486
4311 -1486 -2031 -5214 -8230 -7212 -5555 -7161 -6634 -6257 -2322 1252 3980 350 -4270 -6081 -7037 -4310
4295 -4310 -341 -4485 -9037 -6351 -4550 -6568 -7059 -6185 -7525 -6509 -5673 -8068 -7674 -8931 -14410 -12537
$$ packed form
4411a1033J179K501L403J344l964m374J662J683L851j7J016N78k067n764m899
4396a4901K796L892j142r39J981K232j253j489O0k782k21j210L373M156J670R79
4380b798j648k109L221k77m570J75k01J336K738l58j660o89Jj06j594J9o69J708
4362g481K727r29k945M39L861L075l372j526N194M19k26l985k463Q78L73Q27k292
4345g426K646k635l23L380j279k302M755M550p27m186K360J959m400p43O859N54
4329C042l476k886j217q79j548N4q90q9m55J370K418k2K41J059K326k667J03K030
4311a486n45l183l016J018J657j606N27L77L935L574K728l630m620j811r56K727
4295d310L969m144m552K686J801k018m91Q74j340J016Q36k395L94j257n479J873
$$ plain form
4279 -12537 -10504 -12408 -14575 -13836 -9098 -9356 -8804 -5526 -6411 -8909 -6124 -2681 -2413 -6672 -7229 -773
4263 -773 1142 1712 -1908 -5494 -5063 -845 2841 2574 1416 -2785 -5269 -5423 -4571 -3627 564 3023 -2148
4246 -2148 -3836 -1147 -2676 -3326 -5220 -8788 -8059 -9461 -5616 -2520 -5695 -5870 -3989 -2794 -5405 -8235
4230 -8235 -7637 -10784 -11551 -10186 -5856 -7526 -7892 -9863 -13666 -14952 -10806 -6217 -5249 -7201 -6934 -8451
4214 -8451 -5391 -2756 -295 -290 -474 -1391 -929 2682 2668 324 482 2161 3900 2268 -559 3958 6740
4197 6740 5135 175 -2115 -5562 -7651 -12553 -15693 -16412 -10771 -5219 -7645 -7230 -5280 -3813 -3568 -2734
4181 -2734 -1279 -1934 -4072 -4026 289 -408 -4144 -4202 -3849 -2338 -462 -6135 -6965 -4166 -3764 -804 1910
4164 1910 439 -2717 -6234 -6195 -4933 -7009 -10025 -7545 -7411 -10020 -10452 -9882 -7703 -3313 -1594 -8800
$$ packed form
4279a2537K033j904k167P39M738k58N52L278q85k498K785L443K68m259n57O456
4263g73J915N70l620l586M31M218L686k67j158m201k484j54Q52R44M191K459n171
4246b148j688K689j529o50j894l568P29j402L845L096l175j75J881J195k611k830
4230h235N98l147p67J365M330j670l66j971l803j286M146M589R68j952K67j517
4214h451L060K635K461Nj84r17M62L611j4k344J58J679J739j632k827M517K782
4197F740j605m960k290l447k089m902l140p19N641N552k426M15J950J467K45Q34
4181b734J455o55k138M6M315o97l736n8L53J511J876n673q30K799M02K960K714
4164A910j471l156l517L9J262k076l016K480J34k609m32N70K179M390J719p206
$$ plain form
4148 -8800 -12342 -8619 -10431 -11448 -9300 -11578 -12723 -11254 -8461 -7238 -7903 -5085 -6623 -11574 -12696
4133 -12696 -12225 -9523 -6092 -4399 -3755 -4831 -5244 -6143 -6424 -4722 -6135 -3800 -3284 -2090 -3733 -4108
4117 -4108 -5729 -9879 -9266 -9566 -11515 -10609 -7953 -6476 -5681 -6491 -7199 -9776 -10370 -8049 -6936 -4762 -6869
4100 -6869 -5973 -9520 -8495 -7696 -6814 -6249 -6259 -9558 -9382 -9563 -9409 -8098 -6693 -4717 -5340 -6862 -6867 -3601
4082 -3601 -5928 -7856 -10459 -11929 -10605 -7003 -5699 -5803 -6701 -9838 -10267 -9155 -7188 -3314 -2040 393
4066 393 -3107 -9035 -9421 -6870 -5715 -7149 -5734 -1754 -2301 -6018 -8422 -9061 -10053 -4546 -4912 -6609
4050 -6609 -6121 -6803 -8331 -8337 -5028 -4731 -2980 -2816 -4177 -6110 -6926 -5314 -3314 -1732 -2079 -1581 -2533 -6078
4032 -6078 -4292 -4340 -7155 -8373 -8555 -7266 -8476 -9479 -8652 -5268 -2881 -3853 -4639 -6091 -6987 -7276 -9478
$$ packed form
4148h800l542L723j812j017K148k278j145J469K793J223o65K818j538m951j122
4133a2696M71K702L431J693O44j076m13q99k81J702j413K335N16J194j643l75
4117d108j621m150O13l00j949R06K656J477P95q10p08k577n94K321J113K174k107
4100f869Q96l547J025P99Q82N65j0l299J76j81J54J311J405J976o23j522nL266
4082c601k327j928k603j470J324L602J304j04q98l137m29J112J967L874J274K433
4066C93l500n928l86K551J155j434J415L980n47l717k404o39r92N507l66j697
4050f609M88o82j528oL309K97J751J64j361j933q16J612K000J582l47M98r52l545
4032f078J786m8k815j218j82J289j210j003Q27L384K387r72p86j452q96k89k202
$$ plain form
4015 -9478 -8283 -7901 -10005 -10516 -8555 -6608 -6650 -5020 -1275 -2928 -1406 -1380 -600 -5416 -6281 -5945 -5037
3998 -5037 -7245 -5464 -5406 -4073 -5073 -7737 -9653 -8472 -9447 -8790 -6254 -4484 -6006 -7778 -6261 -5477
3982 -5477 -3926 -5602 -9753 -10492 -7124 -4404 -7781 -8109 -4858 -1788 1754 -1698 -7099 -8374 -5394
3967 -5394 -2297 -4391 -10776 -11540 -7753 -2651 -655 -1442 -4688 -9812 -7419 -5525 -7420 -11247 -15253
3952 -15253 -10806 -6013 -5726 -1772 -1809 -3003 -4915 -4085 -5348 -5795 -6689 -6036 -8895 -8447 -5473 -5853 -5718
3935 -5718 -5050 -3849 -5747 -7255 -8648 -9190 -6109 -528 -729 -4785 -7367 -4232 -3953 -1042 -564 -1390
3919 -1390 -695 1148 1207 -1651 -3266 -4544 -7534 -10984 -11147 -11399 -10615 -6304 -7555 -6403 -5405 -7388 -8533
3902 -8533 -8052 -9554 -9319 -6199 -1110 -2555 -3719 -2931 -4452 -5358 -7329 -5767 -7341 -5515 -3461 -1387
$$ packed form
4015i478J195L82k104n11J961J947m2J630L745j653J522K6P80m816q65L36R08
3998e037k208J781N8J333j000k664j916J181r75O57K536J770j522j772J517P84
3982e477J551j676m151p39L368K720l377l28L251L070L542l452n401j275K980
3967e394L097k094o385p64L787N102J996p87l246n124K393J894j895l827m006
3952a5253M447M793K87L954l7j194j912Q30j263m47q94O53k859M48K974l80J35
3935e718O68J201j898j508j393n42L081N581k01m056k582L135K79K911M78q26
3919a390O95J843N9k858j615j278k990l450j63k52P84M311j251J152R98j983j145
3902h533M81j502K35L120N089j445j164P88j521r06j971J562j574J826K054K074
$$ plain form
3886 -1387 -3475 -7932 -8532 -6198 -4689 -7373 -7667 -4827 -1523 1725 2786 1258 -3527 -8491 -10132
3871 -10132 -11415 -7165 -102 -355 -1320 -4974 -7102 -8806 -7029 -8796 -11985 -6410 -1422 1072 1941
3856 1941 -1187 -4597 -4930 -5265 -3457 -4052 -5135 -7945 -4960 -3844 -7687 -9059 -10746 -9467 -3158 -574
3840 -574 -4728 62 3239 3482 5643 3798 1071 355 -2214 -6898 -5476 -446 1362 -1351 -6207 -8724
3824 -8724 -6458 -559 1927 2856 -1552 -3230 -2665 -1601 -2485 -5388 -3673 -3683 -778 -2436 -5701 -5352
3808 -5352 -6010 -5478 -1145 1804 3864 3370 -3905 -5011 -6484 -6382 -3062 -325 -3290 -2662 -631 -1254
3792 -1254 -423 -1122 -1579 -1854 -2096 -137 654 803 1453 534 -1535 -3754 -3376 -2486 -2743 -4421 -7905 -7608
3774 -7608 -5330 -4172 -5977 -8840 -8878 -8368 -7330 -5835 -6703 -3803 -1012 -1371 2723 2848 748 -2812
$$ packed form
3886a387k088m457o00K334J509k684k94K840L304L248J061j528m785m964j641
3871a0132j283M250P063k53r65l654k128j704J777j767l189N575M988K494Q69
3856A941l128l410l33l35J808n95j083k810K985J116l843j372j687J279O309K584
3840e74m154M790L177K43K161j845k727p16k569m684J422N030J808k713m856k517
3824h724K266N899K486R29m408j678N65J064q84k903J715j0K905j658l265L49
3808e352o58N32M333K949K060m94p275j106j473J02L320K737k965O28K031o23
3792a254Q31o99m57k75k42J959P91J49O50r19k069k219L78Q90k57j678l484K97
3774g608K278J158j805k863l8N10J038J495q68K900K791l59M094J25k100l560
$$ plain form
3758 -2812 -5532 -4579 -5673 -1316 -123 -3368 -4515 -3481 -848 -2947 -5345 -2720 -2995 -153 -1376
3743 -1376 -4359 -3499 -5201 -4525 -184 -3594 -8471 -7833 -5729 -3390 -2655 -4340 -5452 -6116 -6916 -3035
3727 -3035 -1776 -4285 -3703 -2878 -4213 -4354 -3571 -5437 -4648 -8044 -11143 -13903 -8729 -5418 -6681 -7749
3711 -7749 -6303 -2563 -4084 -3025 -344 -953 -2796 -4176 -7909 -12698 -8300 -10268 -13273 -11095 -8934
3696 -8934 -9413 -10305 -9613 -3092 4530 3042 -2605 -5776 -6546 -2299 3220 5180 499 -4953 -6732 -2745
3680 -2745 -3349 -8878 -12046 -8880 -10425 -11914 -9558 -9186 -6479 -2344 -494 -628 1741 4089 -577 -2290
3664 -2290 1805 3949 3045 -62 -8027 -15725 -17014 -14647 -10271 -12107 -14605 -11798 -7671 -7735 -854 1220
3648 1220 -1978 -5411 -4841 -3037 -3071 -6643 -8361 -7971 -8437 -8355 -10056 -10920 -7158 -6034 -5368 -4271 -3951
$$ packed form
3758b812k720R53j094M357J193l245j147J034K633k099k398K625k75K842j223
3743a376k983Q60j702O76M341l410m877O38K104K339P35j685j112o64q00L881
3727c035J259k509N82Q25j335j41P83j866P89l396l099k760N174L311j263j068
3711g749J446L740j521J059K681o09j843j380l733m789M398j968l005K178K161
3696h934m79q92O92O521P622j488n647l171p70M247N519J960m681n452j779L987
3680b745o04n529l168L166j545j489K356L72K707M135J850j34K369K348m666j713
3664b290M095K144r04l107p965p698j289K367M376j836k498K807M127o4O881K074
3648A220l198l433N70J804l4l572j718L90m66Q2j701q64L762J124O66J097L20
$$ plain form
3631 -3951 -1267 -535 -1214 -1342 2504 -276 -3718 -7119 -11782 -9445 -5661 -6912 -7767 -7733 -6430 -6603 -12087
3614 -12087 -12404 -13747 -12520 -8634 -8297 -4032 -2433 -4272 -4323 -2123 -3285 -3516 -4745 -5877 -3766 -961
3598 -961 -1374 -440 -3470 -6363 -4678 -4454 -96 -1242 -7171 -14734 -15333 -13626 -12000 -12117 -11730 -8321 -7353
3581 -7353 -8482 -11492 -14533 -15102 -14096 -10411 -7726 -10582 -6521 -7201 -7361 -6920 -5896 -9438 -13052 -12384
3565 -12384 -6494 -5022 -4849 -3589 -159 -2032 -1532 -498 -2428 -6579 -9952 -10920 -11153 -14881 -16280 -14298
3549 -14298 -13342 -14172 -9124 -2194 -1198 -7249 -7449 -7773 -6997 -7310 -4580 -4357 -1084 -300 -4686 -4879 -5516
3532 -5516 -5930 -4014 -2352 -7082 -6436 -5573 -1692 -3131 -7532 -12361 -14289 -12276 -9873 -9186 -13270 -14957
3516 -14957 -10282 -7771 -4615 -311 -2987 -6409 -7795 -11019 -9411 -9049 -9224 -3213 2525 1225 -1187
$$ packed form
3631c951K684P32o79j28L846k780l442l401m663K337L784j251q55L4J303j73n484
3614a2087l17j343J227L886L37M265J599j839n1K200j162k31j229j132K111K805
3598i61m13R34l030k893J685K24M358j146n929p563n99J707J626j17L87L409R68
3581g353j129l010l041n69J006L685K685k856M061o80j60M41J024l542l614O68
3565a2384N890J472J73J260L430j873N00J034j930m151l373r68k33l728j399J982
3549a4298R56q30N048O930R96o051k00l24P76l13K730K23L273P84m386j93o37
3532e516m14J916J662m730O46Q63L881j439m401m829j928K013K403O87m084j687
3516a4957M675K511L156M304k676l422j386l224J608L62j75O011N738j300k412
$$ plain form
3501 -1187 -7245 -9575 -7752 -5172 -6996 -8791 -9014 -8776 -11303 -11809 -11917 -9503 -6405 -2391 -664 -2026
3485 -2026 -2405 1497 -176 -2943 -5285 -5787 -8992 -10320 -12600 -13770 -7798 -6966 -8273 -9128 -7062 -3279
3469 -3279 -3825 -3108 -7564 -8153 -6477 -5719 -4430 -4120 -6222 -8995 -8398 -7042 -3902 -4265 -5946 -5887 -3137
3452 -3137 -2425 -6177 -8201 -10264 -6992 -7617 -9217 -8582 -9163 -8941 -7588 -6963 -1897 -3619 -8043 -9053
3436 -9053 -10665 -12988 -14879 -15969 -17268 -14505 -12994 -12681 -12060 -13198 -11977 -13018 -15560 -12558 -10242
$$ packed form
3501a187o058k330J823K580j824j795k23K38k527n06j08K414L098M014J727j362
3485b026l79L902j673k767k342n02l205j328k280j170N972Q32j307q55K066L783
3469c279n46P17m456n89J676P58J289L10k102k773N97J356L140l63j681N9K750
3452c137P12l752k024k063L272o25j600O35n81K22J353O25N066j722m424j010
3436i053j612k323j891j090j299K763J511L13O21j138J221j041k542L002K316
$$ [...]
##END NTUPLES=NMR SPECTRUM
##END=
