##TITLE=Analysis number 328396
Compound Code cc 01901
Book Reference lab3
Project Code adrs
Chemist Name stores
##JCAMPDX= 6.0         $$ Bruker NMR JCAMP-DX V2.0
##DATA TYPE= NMR SPECTRUM
##DATA CLASS= NTUPLES
##ORIGIN= Bruker BioSpin GmbH
##OWNER= nmr
$$ XWIN-NMR		Version 3.5
$$ Tue May 29 09:08:04 2007 GMT Daylight Time (UT+1h)  MAYBRIDGE\nmr@NMR_250MHZ
##.OBSERVE FREQUENCY= 250.131544655141
##.OBSERVE NUCLEUS= ^1H
##.ACQUISITION MODE= SIMULTANEOUS (DQD)
##.ACQUISITION SCHEME= undefined
##.AVERAGES= 16
##.DIGITISER RES= 18
##SPECTROMETER/DATA SYSTEM= dpx250
##.PULSE SEQUENCE= zg30
##.SOLVENT NAME= DMSO
##.SHIFT REFERENCE= (INTERNAL, DMSO, 0, 16.522)
##AUDIT TRAIL= $$ (NUMBER, WHEN, WHO, WHERE, WHAT)
$$ ##TITLE= Audit trail, XWIN-NMR		Version 3.5
$$ ##JCAMPDX= 5.01
$$ ##ORIGIN= Bruker BioSpin GmbH
$$ ##OWNER= nmr
$$ C:\u/data/dgb/nmr/ADRS/1530/pdata/1/auditp.txt
$$ ##AUDIT TRAIL=  $$ (NUMBER, WHEN, WHO, WHERE, WHAT)
(   1,<2007-05-29 09:07:44.46 +100>,<MAYBRIDGE\nmr>,<NMR_250MHZ>,
      <created by zg, POWCHK disabled, PULCHK disabled
       configuration hash MD5:
       76 6E 9A 78 1E 09 19 81 EC 84 63 8F B0 6A 59 2D
       data hash MD5: 64K
       9D F7 53 26 56 DD 83 E9 63 13 5F 33 1B E9 A1 4B>)
(   2,<2007-05-29 09:07:55.63 +100>,<MAYBRIDGE\nmr>,<NMR_250MHZ>,
      <Start of raw data processing
       ef LB = 0.3 FT_mod = 6 PKNL = 1 SI = 32K 
       data hash MD5: 32K
       A0 D1 30 4C 6B 9E 27 7D CB 46 99 9D 63 3E 1F A0>)
(   3,<2007-05-29 09:07:57.21 +100>,<MAYBRIDGE\nmr>,<NMR_250MHZ>,
      <apk 
       data hash MD5: 32K
       CE 89 75 28 2B 41 E6 B5 50 A3 13 FC 5B 47 CC 2D>)
(   4,<2007-05-29 09:07:57.92 +100>,<MAYBRIDGE\nmr>,<NMR_250MHZ>,
      <abs ABSG = 5 
       data hash MD5: 32K
       A3 C9 24 CB 7D 78 BA 73 CA 14 D5 7C B8 F6 D8 E3>)
$$ ##END=
$$ 
$$ hash MD5
$$ 55 A0 3A 3B DF BE BA 1E 07 C9 7D AD D6 BF 2F A8
##$RELAX= 
##$RELAX= 
##$RELAX= 
##$RELAX= 
##$RELAX= 
##$RELAX= 
##$RELAX= 
$$ Bruker specific parameters
$$ --------------------------
##$DU= <C:\u>
##$EXPNO= 1530
##$NAME= <ADRS>
##$PROCNO= 1
##$TYPE= <nmr>
##$USER= <dgb>
##$AMP= (0..31)
100 100 100 100 100 100 100 100 100 100 100 100 100 100 100 100 100 100 
100 100 100 100 100 100 100 100 100 100 100 100 100 100 
##$AQSEQ= 0
##$AQ_mod= 3
##$AUNM= <au_zg>
##$AUTOPOS= <4 >
##$BF1= 250.13
##$BF2= 250.13
##$BF3= 250.13
##$BF4= 250.13
##$BF5= 500.13
##$BF6= 500.13
##$BF7= 500.13
##$BF8= 500.13
##$BYTORDA= 1
##$CFDGTYP= 0
##$CFRGTYP= 5
##$CHEMSTR= <none>
##$CNST= (0..31)
1 1 145 1 1 1 1 1 1 1 1 1 1 1 1 1 1 1 1 1 1 1 1 1 1 1 1 1 1 1 1 1 
##$CPDPRG= <>
##$CPDPRG1= <>
##$CPDPRG2= <>
##$CPDPRG3= <>
##$CPDPRG4= <mlev>
##$CPDPRG5= <mlev>
##$CPDPRG6= <mlev>
##$CPDPRG7= <mlev>
##$CPDPRG8= <mlev>
##$CPDPRGB= <>
##$CPDPRGT= <>
##$D= (0..31)
0 1 0 0 0 0 0 0 0 0.06 0 0 0 0 0 0 0.0002 0 0 0 0 0 0 0 0 0 0 0 0 0 0 
0 
##$DATE= 1180426063
##$DBL= (0..7)
120 120 120 120 120 120 120 120 
##$DBP= (0..7)
150 150 150 150 150 150 150 150 
##$DBP07= 0
##$DBPNAM0= <>
##$DBPNAM1= <>
$$ [...]
##$SUBNAM7= <"">
##$SUBNAM8= <"">
##$SUBNAM9= <"">
##$SW= 20.6930455092707
##$SWIBOX= (0..15)
0 0 3 0 0 0 0 0 0 0 0 0 0 0 0 0 
##$SW_h= 5175.983436853
##$TD= 65536
##$TD0= 1
##$TE= 683.16
##$TE2= 300
##$TE3= 300
##$TEG= 300
##$TL= (0..7)
0 120 120 120 120 120 120 120 
##$TP= (0..7)
150 150 150 150 150 150 150 150 
##$TP07= 0
##$TPNAME0= <>
##$TPNAME1= <>
##$TPNAME2= <>
##$TPNAME3= <>
##$TPNAME4= <>
##$TPNAME5= <>
##$TPNAME6= <>
##$TPNAME7= <>
##$TPOAL= (0..7)
0.5 0.5 0.5 0.5 0.5 0.5 0.5 0.5 
##$TPOFFS= (0..7)
0 0 0 0 0 0 0 0 
##$TUNHIN= 0
##$TUNHOUT= 0
##$TUNXOUT= 0
##$USERA1= <user>
##$USERA2= <user>
##$USERA3= <user>
##$USERA4= <user>
##$USERA5= <user>
##$V9= 5
##$VALIST= <valist>
##$VCLIST= <CCCCCCCCCCCCCCC>
##$VD= 0
##$VDLIST= <DDDDDDDDDDDDDDD>
##$VPLIST= <PPPPPPPPPPPPPPP>
##$VTLIST= <TTTTTTTTTTTTTTT>
##$WBST= 1024
##$WBSW= 4
##$XGAIN= (0..3)
0 0 0 0 
##$XL= 0
##$YL= 0
##$YMAX_a= 245280
##$YMIN_a= -215644
##$ZGOPTNS= <>
##$ZL1= 120
##$ZL2= 120
##$ZL3= 120
##$ZL4= 120
##$ABSF1= 16.522
##$ABSF2= -4.171173
##$ABSG= 5
##$ABSL= 3
##$ALPHA= 0
##$AQORDER= 0
##$ASSFAC= 0
##$ASSFACI= 0
##$ASSFACX= 0
##$ASSWID= 0
##$AUNMP= <proc_1d>
##$AZFE= 0.1
##$AZFW= 0.1
##$BCFW= 0
##$BC_mod= 0
##$BYTORDP= 0
##$COROFFS= 0
##$CY= 12.5
##$DATMOD= 1
##$DC= 0
##$DFILT= <>
##$DTYPP= 0
##$F1P= 14.0000005364418
##$F2P= -0.99999901652339
##$FCOR= 0.5
##$FTSIZE= 32768
##$FT_mod= 6
##$GAMMA= 0
##$GB= 0
##$INTBC= 1
##$INTSCL= 1
##$ISEN= 128
##$LB= 0.3
##$LEV0= 0
##$LPBIN= 0
##$MAXI= 10000
##$MC2= 0
##$MEAN= 0
##$ME_mod= 0
##$MI= 0
##$NCOEF= 0
##$NC_proc= -4
##$NLEV= 6
##$NOISF1= 0
##$NOISF2= 0
##$NSP= 0
##$NTH_PI= 0
##$NZP= 0
##$OFFSET= 16.522
##$PC= 1
##$PHC0= -59.06101
##$PHC1= 9.421455
##$PH_mod= 1
##$PKNL= yes
##$PPARMOD= 0
##$PSCAL= 4
##$PSIGN= 0
##$REVERSE= no
##$SF= 250.13
##$SI= 32768
##$SIGF1= 0
##$SIGF2= 0
##$SINO= 400
##$SIOLD= 32768
##$SREGLST= <1H.DMSO>
##$SSB= 0
##$STSI= 32768
##$STSR= 0
##$SW_p= 5175.98343685301
##$SYMM= 0
##$S_DEV= 0
##$TDeff= 65536
##$TDoff= 0
##$TI= <Analysis number 999999
Compound Code 99
Book Reference 9
Project Code 9>
##$TILT= no
##$TM1= 0
##$TM2= 0
##$TOPLEV= 0
##$USERP1= <user>
##$USERP2= <user>
##$USERP3= <user>
##$USERP4= <user>
##$USERP5= <user>
##$WDW= 1
##$XDIM= 32768
##$YMAX_p= 352849444
##$YMIN_p= -317776
$$ End of Bruker specific parameters
$$ ---------------------------------
##NTUPLES= NMR SPECTRUM
##VAR_NAME=  FREQUENCY,     SPECTRUM/REAL,   SPECTRUM/IMAG
##SYMBOL=    X,             R,               I
##VAR_TYPE=  INDEPENDENT,   DEPENDENT,       DEPENDENT
##VAR_FORM=  AFFN,          ASDF,            ASDF
##VAR_DIM=   32768,         32768,           32768
##UNITS=     HZ,            ARBITRARY UNITS, ARBITRARY UNITS
##FACTOR=    0.157963299565203, 1,           1
##FIRST=     4132.6476996994, 0,             0
##LAST=      -1043.33573715361, 0,           0
##MIN=       -1043.33573715361, -317776,     0
##MAX=       4132.6476996994, 352849444,     0
$$ Real data points
##PAGE= N=1
##DATA TABLE= (X++(R..R)), XYDATA
$$ [...]
$$ plain form
20553 94583 65558 52955 36249 16455 -23391 -49586 6402 41564 40675 30717 57699 80597
20541 80597 58431 41847 8756 -101250 -117862 -72059 12975 3744 -44107 -53459 -44369 -69368
20529 -69368 -9652 -48404 -102443 -158790 -60767 62141 46485 -4418 -69236 -61010 5719 51122
20517 51122 25782 60980 -22193 -31320 41461 53049 -54489 -106525 -120261 -117713 -142546 -87795
20505 -87795 -11477 66744 43649 -54306 14084 66375 -30211 -35016 32960 16471 6683 48680
20493 48680 72507 99941 95179 66870 24306 14313 21105 -2074 -15317 -14093 33 -26114
20481 -26114 -25860 10946 46784 -7653 -59688 -108767 -97172 -64269 -104853 -171994 -148831 -103244
20469 -103244 -92086 -106078 -99889 3933 23224 30374 -116 26670 11717 6704 -24294 47096
$$ packed form
20553I4583k9025j2603j6706j9794l9846k6195N5988L5162q89r958K6982K2898
20541H0597k2166j6584l3091j10006j6612M5803Q5034r231m7851r352R090k4999
20529f9368N9716l8752n4039n6347R8023J22908j5656n0903o4818Q226O6729M5403
20517E1122k5340L5198q3173r127P2781J1588j07538n2036j3736K548k4833N4751
20505h7795P6318P8221k3095r7955O8390N2291r6586m805O7976j6489r788M1997
20493D8680K3827K7434m762k8309m2564r993O792k3179j3243J224J4126k6147
20481b6114K54L6806L5838n4437n2035m9079J1595L2903m0584o7141K3163M5587
20469a03244J1158j3992O189J03822J9291P150l0490K6786j4953n013l0998P1390
$$ plain form
20457 47096 31491 20551 49084 92055 138685 123651 142417 94294 10175 50522 81038 69017
20445 69017 115885 84184 -12759 -54867 -57399 20872 47684 88026 70036 5336 -5610 -37792
20433 -37792 1572 -51113 -67199 -24753 -23927 19956 -44071 -91658 -100489 -78137 -74597 -31337
20421 -31337 -10648 -100291 -99770 -105650 -141325 -153232 -101584 13778 -14654 -49238 -12877 -2736
20409 -2736 18781 131093 146744 109409 42629 -2200 4356 -29102 4052 -23031 21613 75369
20397 75369 44720 -36151 -116440 -109186 -30196 22720 -59644 -17205 4167 2947 13096 61648
20385 61648 14366 -39342 8304 37799 22680 79555 154989 98797 -13735 -124473 -129830
20374 -129830 -146147 -164435 -129994 -10433 43600 96521 95719 1072 -93145 -6988 5070 -38050
$$ packed form
20457D7096j5605j0940K8533M2971M6630j5034J8766m8123q4119M0347L0516j2021
20445F9017M6868l1701r6943m2108k532P8271K6812M0342j7990o4700j0946l2182
20433c7792L9364n2685j6086M2446Q26M3883o4027m7587q831K2352L540M3260
20421c1337K0689q9643N21n880l5675j1907N1648J15362k8432l4584L6361J0141
20409b736K1517J12312J5651l7335o6780m4829O556l3458L3154k7083M4644N3756
20397G5369l0649q0871q0289P254P8990N2916q2364M2439K1372j220J0149M8552
20385F1648m7282n3708M7646K9495j5119N6875P5434n6192j12532j10738n357
20374a29830j6317j8288L4441J19561N4033N2921q02r4647r4217Q6157J2058m3120
$$ plain form
20362 -38050 10184 7330 -14587 -41194 8377 9369 -60647 -93523 -92752 -23390 19492 46811 -17035
20349 -17035 -64918 -60493 2996 38403 23794 35856 106546 148631 177071 137488 102479 37646
20337 37646 2274 -30187 -41165 -77167 -8185 29542 58901 34598 -70966 -4075 12164
20326 12164 -54623 4135 208394 188079 59527 -23986 -93917 -87580 -83510 -66499 42656
20315 42656 41472 -52796 -143296 -91839 -80129 -62537 -107597 -178652 -143864 -108803 -37933 50340
20303 50340 141698 174557 111851 23136 27235 45238 -324 31171 28028 16194 15650 100377
20291 100377 50902 -40066 -101416 -112804 -67755 -45659 -17617 25678 110729 54497 -29676
20280 -29676 -53025 -52845 -17314 15953 104869 133382 79035 99163 129710 125767 98856 -100679
$$ packed form
20362c8050M8234k854k1917k6607M9571R92p0016l2876P71O9362M2882K7319o3846
20349a7035m7883M425O3489L5407j4609J2062P0690M2085K8440l9583l5009o4833
20337C7646l5372l2461j0978l6002O8982L7727K9359k4303j05564O6891J6239
20326A2164o6787N8758K04259k0315j28552q3513o9931O337M070J7011J09155
20315D2656j184r4268r0500N1457J1710J7592m5060p1055L4788L5061P0870Q8273
20303E0340R1358L2859o2706q8715M099J8003m5562L1495l143j1834n44Q4727
20291A00377m9475r0968o1350j1388M5049K2096K8042M3295Q5051n6232q4173
20280b9676k3349J80L5531L3267Q8916K8513n4347K0128L0547l943k6911j99535
$$ plain form
20268 -100679 -98420 12109 29710 43610 35177 3313 -80926 -94317 -56316 -37368 -52624 -14688
20256 -14688 27933 -656 -21361 8380 74445 46978 5631 5360 495 -22676 -26431 -91985
20244 -91985 -66722 -12730 -65473 -105690 -16206 -11330 -66054 -10093 -3976 -2818 46093 50323
20232 50323 58101 -39646 -151594 -118700 -66480 -34059 -54594 -32377 -630 -73837 -78594 -130655
20220 -130655 -38047 55748 66475 -2925 -166 -13770 -16839 31254 -23183 -78880 -96986 -210190
20208 -210190 -246313 -101980 -21441 -46372 -78963 44515 113147 123853 83691 -12817 -81329
20197 -81329 -122546 -78049 -20613 -67596 -104348 -118683 -105384 -10021 -3322 -42806 -92598 -39000
20185 -39000 -7497 -72125 -119467 -61133 -28796 14449 54395 148387 116826 29994 -48762 -64062
$$ packed form
20268a00679K259J10529J7601J3900q433l1864q4239j3391L8001J8948j5256L7936
20256a4688M2621k8589k0705K9741O6065k7467m1347k71m865k3171l755o5554
20244i1985K5263N3992n2743m0217Q9484M876n4724N5961O117J158M8911M230
20232E0323P778r7747j11948L2894N2220L2421k0535K2217L1747p3207m757n2061
20220a30655R2608R3795J0727o9400K759j3604l069M8093n4437n5697j8106j13204
20208b10190l6123J44333Q0539k4931l2591J23478O8632J0706m0162r6508o8512
20197h1329m1217M4497N7436m6983l6752j4335J3299R5363O699l9484m9792N3598
20185c9000L1503o4628m7342N8334L2337M3245L9946R3992l1561q6832p8756j5300
$$ plain form
20173 -64062 -33944 -22848 -53477 -128085 -179611 -187849 -110312 39511 102324 -18090 -74533
20162 -74533 -88281 -79760 -73885 -77083 -32257 -67537 -31588 -72244 -105244 -58301 -62568 -79004
20150 -79004 -55358 -60614 -4620 -21489 -16645 -37341 -19358 -6356 18773 28750 59787 45858
20138 45858 -26606 -75886 -30678 -24507 -19510 17482 76278 79628 149883 143562 108310 30327
20126 30327 -45251 -25238 -16683 -79607 -36556 -47226 -120810 -124061 -46326 38510 69712 14830
20114 14830 -14619 80169 36269 -2237 -11763 32007 68148 70672 12195 -55392 -106519 -89771
20102 -89771 -51422 -7753 -22830 84618 113901 53738 -2517 -91211 -122340 -59294 -2142
20091 -2142 31480 1459 -5168 32825 40757 39116 28328 -46652 -30914 -8893 -43188 -79287
$$ packed form
20173f4062L0118J1096l0629p4608n1526q238P7537J49823O2813j20414n6443
20162g4533j3748Q521N875l198M4826l5280L5949m0656l3000M6943m267j6436
20150g9004K3646n256N5994j6869M844k0696J7983J3002K5129R977L1037j3929
20138D5858p2464m9280M5208O171M997L6992N8796L350P0255o321l5252p7983
20126C0327p5578K0013Q555o2924M3051j0670p3584l251P7735Q4836L1202n4882
20114A4830k9449R4788m3900l8506r526M3770L6141K524n8477o7587n1127J6748
20102h9771L8349M3669j5077J07448K9283o0163n6255q8694l1129O3046N7152
20091b142L3622l0021o627L7993P932j641j0788p4980J5738K2021l4295l6099
$$ plain form
20079 -79287 -100727 -83955 -6943 26308 35417 -10553 -78426 -94451 -88355 -110997 -93090 27733
20067 27733 -47177 -85146 -57469 -7288 -58500 -133899 -53153 31441 38554 34478 41773 74337
20055 74337 -35353 -68392 -88362 -35519 5743 -19308 56087 145317 26539 -6486 33492
20044 33492 41899 -1789 -66784 -74507 -89255 -52854 12816 9783 61776 -14260 -155753 -248899
20032 -248899 -207359 -155376 -200099 -240301 -154950 -154956 -201275 -150347 -60835 -16827 27494 -106579
20020 -106579 -169834 -61117 53505 85413 69404 16767 -104676 -175996 -149665 -100508 -143856
20009 -143856 -80065 -59054 -61417 -29882 -66611 -149175 -156856 -105282 -29863 87513 98828 55118
19997 55118 30740 43457 45221 47389 55602 47804 44890 76227 34608 19218 44600 -18900 -60220
$$ packed form
20079g9287k1440J6772P7012L3251R109m5970o7873j6025O096k2642J7907J20823
20067B7733p4910l7969K7677N0181n1212p5399Q0746Q4594P113m076P295L2564
20055G4337j09690l3039j9970N2843M1262k5051P5395Q9230j18778l3025L9978
20044C3492Q407m3688o4995p723j4748L6401O5670l033N1993p6036j41493r3146
20032b48899M1540N1983m4723m0202Q5351om6319N0928Q9512M4008M4321j34073
20020a06579o3255J08717J14622L1908j6009n2637j21443p1320K6331M9157m3348
20009a43856O3791K1011k363L1535l6729q2564p681N1574P5419J17376J1315m3710
19997E5118k4378J2717J764K168Q213p798k914L1337m1619j5390K5382o3500m1320
$$ plain form
19984 -60220 -50386 -23677 -36496 23046 103691 141759 135603 38407 -27 -26903 -51486 -85370
19972 -85370 -53651 -65816 -34531 35193 85295 -32038 28592 133673 188325 182937 74144
19961 74144 -33140 13267 62085 4573 55071 31765 -83163 -127225 10913 104923 38892
19950 38892 46390 -22268 -29285 -78016 3802 68135 61480 59210 23859 73858 65697 13113 -56319
19937 -56319 -95201 -59538 -64240 -60584 -55278 -81525 -65320 -75572 -153439 -240310 -259756 -212038
19925 -212038 -180018 -194846 -99392 -49954 -70673 -67811 -129287 -218114 -230372 -140878 -78678 -130911
19913 -130911 -79457 -36428 -35881 -23504 13180 24603 -1347 -45318 13247 -62471 -36789 -83896
19901 -83896 -150431 -155126 -111200 -78456 -77344 -101941 -94945 -16101 50261 55098 -733 -39935
$$ packed form
19984f0220R834K6709j2819N9542Q0645L8068o156r7196l8434k6876k4583l3884
19972h5370L1719j2165L1285O9724N0102j17333O0630J05081N4652n388j08793
19961G4144j07284M6407M8818n7512N0498k3306j14928m4062J38138R4010o6031
19950C8892P498o8658p017m8731Q1818O4333o655k270l5351M9999q161n2584o9432
19937e6319l8882L5663m702L656N306k6247J6205j0252p7867q6871j9446M7718
19925b12038L2020j4828R5454M9438k0719K862o1476q8827j2258Q9494O2200n2233
19913a30911N1454M3029N47J2377L6684J1423k5950m3971N8565p5718K5682m7107
19901h3896o6535m695M3926L2744J112k4597O996P8844O6362M837n5831l9202
$$ plain form
19889 -39935 -27244 -21818 -9693 -72682 -199611 -174443 -33889 70374 46366 -51416 -52610
19878 -52610 -91752 -43224 -53708 -28400 -14926 -56629 -24137 -9922 26269 -6301 -32165 47357
19866 47357 -20604 -108382 -69803 30145 -10238 30541 -25632 -85152 -73244 -26027 73643 32804
19854 32804 -117461 -125415 -50599 -47454 -153867 -151925 -176091 -191406 -157586 -122978 -84184 -69479
19842 -69479 -115774 -162564 -150403 -56440 -40329 -57993 -109698 -77859 -33115 -15198 -2381 20863
19830 20863 10024 34823 -26979 -66837 36350 113685 126524 102220 69121 73966 77229 82421
19818 82421 60884 4358 23868 49009 52236 -42760 -60723 -45684 -80019 -42103 -17618 -32878
19806 -32878 4808 119436 159743 150227 143969 150958 126582 207752 206882 120352 111188 137212 103264
$$ packed form
19889c9935J2691N426J2125o2989j26929K5168J40554J04263k4008r7782j194
19878e2610l9142M8528j0484K5308J3474m1703L2492J4215L6191l2570k5864P9522
19866D7357o7961q7778L8579R9948m0383M0779n6173n9520J1908M7217R9670m0839
19854C2804j50265p954P4816L145j06413J942k4166j5315L3820L4608L8794J4705
19842f9479m6295m6790J2161R3963J6111j7664n1705L1839M4744J7917J2817K3244
19830B0863j0839K4799o1802l9858J03187P7335J2839k4304l3099M845L263N192
19818H2421k1537n6526J9510K5141L227r4996j7963J5039l4335L7916K4485j5260
19806c2878L7686J14628M0307r516o258O989k4376Q1170q70q6530r164K6024l3948
$$ plain form
19793 103264 83715 7421 -1891 103297 232954 166067 105386 21767 443 4052 59965
19782 59965 99392 161861 147106 61579 -24911 10508 41671 42965 760 22792 95177 92099
19770 92099 23770 1879 75073 103258 67222 -24603 -56137 -62682 -23542 -4318 9565 11495
19758 11495 -80098 -116968 -141595 -138300 -85107 -17488 -45596 -151376 -173244 -126474 16153
19747 16153 96996 -354 -93269 -119761 -128646 -74080 -14641 106407 36097 -92180 -126526
19736 -126526 -164142 -101900 -1641 20275 -20636 -33106 29321 72006 87117 38984 24857
19725 24857 10073 10381 -11767 -16001 23499 -12647 16852 19095 20695 71128 47076 7317 -42104
19712 -42104 -76972 -63189 -64827 -43626 -48034 -59926 -35943 -36078 15460 7355 23257 71098 100555
$$ packed form
19793A03264j9549p6294r312J05188J29657o6887o0681q3619k1324L609N5913
19782E9965L9427O2469j4755q5527q6490L5419L1163J294m2205K2032P2385l078
19770I2099o8329k1891P3194K8185l6036r1825l1534o545L9140J9224J3883J930
19758A1495r1593l6870k4627L295N3193O7619k8108j05780k1868M6770J42627
19747A6153Q0843r7350r2915k6492q885N4566N9439J21048p0310j28277l4346
19736a26526l7616O2242J00259K1916m0911j2470O2427M2685J5111m8133j4127
19725B4857j4784L08k2148m234L9500l6146K9499K243J600N0433k4052l9759m9421
19712d2104l4868J3783j638K1201m408j1892K3983j35N1538q105J5902M7841K9457
$$ plain form
19699 100555 -15125 -40803 39909 26567 7389 22846 59958 60299 35967 -46613 -34288 -19177
19687 -19177 26818 -29789 -67997 -79531 -33719 -2940 -59654 -130538 -120095 -82027 -56859 -94070
19675 -94070 -7031 34833 -34067 -53911 -8850 -28337 -5338 51358 172533 159264 33956
19664 33956 -2465 22299 76015 72095 62333 2655 3702 64997 91412 164944 94940 -6688
19652 -6688 48716 61844 35254 48133 -9941 -24812 7722 39940 110352 147967 73395 -14918
19640 -14918 -30441 -80445 -49752 -98993 -97717 -140976 -216234 -281049 -290842 -185448 -148038 -73184
19628 -73184 -49346 -22148 -13187 -55732 -108405 -128305 -54585 38919 134190 66698 16406 -26429
19616 -26429 -12137 -98986 -84396 -35138 -6125 1531 -31966 -34719 6601 -45354 9548 91667
$$ packed form
19699A00555j15680k5678Q0712j3342j9178J5457L7112L41k4332q2580J2325J5111
19687a9177M5995n6607l8208j1534M5812L0779n6714p0884J0443L8068K5168l7211
19675i4070Q7039M1864o8900j9844M5061j9487K2999N6696J21175j3269j25308
19664C3956l6421K4764N3716l920r762n9678J047O1295K6415P3532p0004j01628
19652f688N5404J3128k6590J2879n8074j4871L2534L2218P0412L7615p4572q8313
19640a4918j5523n0004L0693m9241J276m3259p5258o4815r793J05394L7410P4854
19628g3184K3838K7198Q961m2545n2673j9900P3720R3504R5271o7492n0292m2835
19616b6429J4292q6849J4590M9258K9013P656l3497k753M1320n1955N4902Q2119
$$ plain form
19604 91667 115698 115128 66698 -16115 -50028 -23595 -19253 -66590 -85345 -21195 55021 140064
19592 140064 71406 -121558 -153881 -115988 -83902 -92001 -50443 -43801 11715 93148 -11141
19581 -11141 22302 77051 29319 -57269 -55011 -153287 -233431 -286476 -174231 -13557 66777
19570 66777 116528 39729 21810 -16105 -34918 -8140 33958 82420 88256 50463 49997 -13680
19558 -13680 -59921 -111656 -77558 1462 16502 -35932 -21858 12882 2422 -65025 32341 91395
19546 91395 148519 177603 89052 -58945 -107998 -96063 -41787 -6859 -32514 -67601 -67849 -90283
19534 -90283 -149077 -111197 -30275 7683 40667 58710 54085 47649 25354 -33410 -86078 -22441
19522 -22441 -119411 -91614 -55620 -52392 -64360 -46670 -51190 -73661 39737 59148 42185 -22544
$$ packed form
19604I1667K4031n70m8430q2813l3913K6433M342m7337j8755O4150P6216Q5043
19592A40064o8658j92964l2323L7893L2086q099M1558O642N5516Q1433j04289
19581a1141L3443N4749m7732q6588K258r8276q0144n3045J12245J60674Q0334
19570F6777M9751p6799j7919l7915j8813K6778M2098M8462N836l7793m66o3677
19558a3680m6241n1735L4098P9020J5040n2434J4074L4740j0460o7447R7366N9054
19546I1395N7124K9084q8551j47997m9053J1935N4276L4928k5655l5087k48k2434
19534i0283n8794L7880Q0922L7958L2984J8043m625o436k2295n8764n2668O3637
19522b2441r6970K7797L5994L228j1968J7690m520k2471J13398J9411j6963o4729
$$ plain form
19510 -22544 -97682 -79350 -22730 -3133 -24802 -19562 36813 36946 14711 13567 -19411 -33406
19498 -33406 -94630 -59679 32921 48174 55048 13204 -21425 34766 23736 -21892 28756 -6127
19486 -6127 47091 115233 141950 89268 -77060 -173239 -165013 -93166 -74853 -60721 2540 25650
19474 25650 47794 52933 55273 -15279 30446 44397 9337 -66230 -94414 -88679 -50443 -106981
19462 -106981 -143654 -186304 -168468 -56245 8369 35015 92757 64421 35690 -112401 -177469
19451 -177469 -125323 -103243 -50526 30099 70770 127885 127956 28023 -51615 -96900 -157712 -179770
19439 -179770 -161194 -118564 -126517 3522 3459 -103616 -127623 -25394 33797 84552 173127 192572
19427 192572 161209 119337 138102 128059 124333 131533 71808 3629 -21390 45709 37929 -34247
$$ packed form
19510b2544p5138J8332N6620J9597k1669N240N6375J33k2235j144l2978j3995
19498c3406o1224L4951R2600J5253O874m1844l4629N6191j1030m5628N0648l4883
19486f127N3218O8142K6717n2682j66328r6179Q226P1847J8313J4132O3261K3110
19474B5650K2144N139K340p0552M5725J3951l5060p5567k8184N735L8236n6538
19462a06981l6673m2650J7836J12223O4614K6646N7742k8336k8731j48091o5068
19451a77469N2146K2080N2717Q0625M0671N7115P1r9933p9638m5285o0812k2058
19439a79770J8576M2630p953J30039o3j07075k4007J02229N9191N0755Q8575J9445
19427A92572l1363m1872J8765j0043l726P200n9725o8179k5019O7099p780p2176
$$ plain form
19415 -34247 -90865 -87272 -57923 -34268 -5416 -12312 -64811 -70029 -120870 -35393 21852 -11626
19403 -11626 -63393 -82576 -109956 -101775 -101056 -49740 -74855 -114713 -75926 -77907 -77184 -7602 -71321
19390 -71321 -101977 -12913 35358 -33902 -27655 -20198 3994 -49792 -33361 23511 99748 145135
19378 145135 106814 -16282 -23093 11815 35961 40404 83299 37211 -21340 -7570 -77627 -95678
19366 -95678 -38516 36480 69124 71541 57615 -7394 -17908 32188 27523 -18699 1957 44681
19354 44681 26390 -40983 -39184 -40806 -24087 -50567 -90123 -73335 -96203 -3888 54883 -21063
19342 -21063 -119560 -173975 -155549 -123222 -83121 -33614 -18132 69928 115900 69890 9191 -11377
19330 -11377 -9057 -23335 -60527 -56057 -91843 -53021 -45387 4089 112239 125992 121728 80897
$$ packed form
19415c4247n6618L593K9349K3655K8852o896n2499n218n0841Q5477N7245l3478
19403a1626n1767j9183k7380Q181P19N1316k5115l9858L8787j981P23O9582o3719
19390g1321l0656Q9064M8271o9260O247P457K4192n3786J6431N6872P6237M5387
19378A45135l8321j23096o811L4908K4146M443M2895m6088n8551J3770p0057j8051
19366i5678N7162P4996L2644K417j3926o5009j0514N0096m665m6222K0656M2724
19354D4681j8291o7373J799j622J6719k6480l9556J6788k2868R2315N8771p5946
19342b1063r8497n4415J8426L2327M0101M9507J5482Q8060M5972m6010o0699k0568
19330a1377K320j4278l7192M470l5786L8822P634M9476J08150J3753m264m0831
$$ plain form
19318 80897 52385 -57118 -75324 -60021 -79594 -58183 -63011 -63949 -50620 -44716 -21076 -27675
19306 -27675 -13134 -22249 48342 48566 -33686 -17772 -28545 -1677 38382 43343 -3814 -1671 11487
19293 11487 -68554 -11719 -10807 29288 53425 -21957 -8986 -62851 -86037 -66873 80502 139084
19281 139084 44609 -64839 -157898 -151533 -32637 26784 37672 110588 73532 60380 46620
19270 46620 41003 -23293 -156702 -156781 -5425 20889 61103 81615 84813 56015 48530 13628
19258 13628 8905 -50631 -78193 -88091 9324 84276 81187 61549 43091 -17891 -63164 -25855
19246 -25855 -43586 -50654 23143 32767 18618 29055 13600 -30019 -52872 -66202 -21598 46655
19234 46655 33690 -56326 -87401 -94087 -123774 -38107 71467 41507 16253 -37595 -33639 9327
$$ packed form
19318H0897k8512j09503j8206J5303j9573K1411m828r38J3329N904K3640o599
19306b7675J4541r115P0591K24q2252J5914j0773K6868M0059M961m7157K143J3158
19293A1487q0041N6835R12M0095K4137p5382J2971n3865k3186J9164J47375N8582
19281A39084r4475j09448r3059O365J18896N9421J0888P2916l7056j3152j3760
19270D6620n617o4296j33409p9J51356K6314M0214K0512L198k8798p485l4902
19258A3628m723n9536k7562r898R7415P4952l089j9638j8458o0982m5273L7309
19246b5855j7731p068P3797R624j4149J0437j5455m3619k2853j3330M4604O8253
19234D6655j2965r0016l1075o686k9687Q5667J09574k9960k5254n3848L956M2966
$$ plain form
19222 9327 25934 55208 48199 -16856 -15707 -9393 4939 31337 35959 3561 -8750 -17547 1997
19209 1997 -47028 11937 67281 7440 40544 165720 198931 111470 13619 39603 19881 -34085
19197 -34085 -18829 31737 37976 91712 80216 68023 -58189 -118344 -42123 -14631 -37466 -32828
19185 -32828 86500 119430 149270 128433 37173 15744 93378 80650 112527 159295 155571 95710
19173 95710 59764 10841 61938 89868 51994 37476 14939 61641 70831 64806 -1485 -40241
19161 -40241 25700 89740 86155 100802 58138 -40507 -48626 -31655 -5275 10280 17805 5668
19149 5668 6575 7495 63464 25096 -8935 -50818 -108367 -79510 -27388 1763 -12251 -50926 -60887
19136 -60887 -67918 -66999 8170 -32450 -131384 -135541 -90346 -133684 -64184 5206 -4863 -68191
$$ packed form
19222I327J6607K9274p009o5055J149O314J4332K6398M622l2398j2311q797J9544
19209A997m9025N8965N5344n9841L3104J25176L3211q7461r7851K5984j9722n3966
19197c4085J5256N0566O239N3736j1496j2193j26212o0155P6221K7492k2835M638
19185c2828J19328L2930K9840k0837r1260k1429P7634j2728L1877M6768l724n9861
19173I5710l5946m8923N1097K7930l7874j4518k2537M6702R190o025o6291l8756
19161d0241O5941O4040l585J4647m2664r8645q119J6971K6380J5555P525j2137
19149E668R07R20N5969l8368l4031m1883n7549K8857N2122K9151j4014l8675r961
19136f0887p031R19P5169m0620r8934m157M5195m3338O9500O9390j0069o3328
$$ plain form
19124 -68191 -102276 -175915 -223892 -136249 -43535 78864 186921 115169 100529 21085 67
19113 67 -35323 -57262 -75720 -47172 527 -20211 6767 31054 12798 -17590 -107067 -139804
19101 -139804 -72307 31567 33178 18230 70992 57483 83098 35062 -49442 -87308 -18417
19090 -18417 16196 37845 28466 42205 83831 59476 34467 91507 104614 30007 -15248 -34613
19078 -34613 -123592 -110545 29202 61439 49728 -63121 -88150 -66573 -31102 -91232 -72305
19067 -72305 3739 11397 37723 70163 162895 85795 58299 92727 144407 225396 221527 38444
19055 38444 38930 29956 10764 5202 86527 79986 24598 16565 -23106 -91436 -143028 -78699 26587
19042 26587 87593 72497 67021 14516 -18145 8972 40714 53216 31044 8931 -29676 -43157
$$ packed form
19124f8191l4085p3639m7977Q7643R2714J22399J08057p1752j4640p9444k1018
19113F7l5390k1939j8458K8548M7699k0738K6978K4287j8256l0388q9477l2737
19101a39804O7497J03874J611j4948N2762j3509K5615m8036q4504l7866O8891
19090a8417L4613K1649r379J3739M1626k4355k5009N7040J3107p4607m5255j9365
19078c4613q8979J3047J39747L2237j1711j12849k5029K1577L5471o0130J8927
19067g2305P6044P658K6326L2440R2732p7100k7496L4428N1680Q0989l869j83083
19055C8444M86q974j9192n562Q1325o541n5388q033l9671o8330n1592O4329J05286
19042B6587O1006j5096n476n2505l2661K7117L1742J2502k2172k2113l8607j3481
$$ plain form
19030 -43157 -99278 -58548 -91494 -139674 -79247 -59633 -33339 -10158 28755 14845 -39535 757
19018 757 44847 2607 -39310 -166525 -68584 -20223 -15421 -27786 -17337 -40364 52791 41405
19006 41405 -70127 -40941 -34754 55919 89294 -444 37834 8189 -95964 -107431 -68351
18995 -68351 -65129 -67921 26642 -12283 -74946 -25949 -6062 -10908 -37671 -80379 -32163 -60026
18983 -60026 -130145 -133713 -140399 -78711 -25196 17592 35887 26860 41908 2891 -1634 53194
18971 53194 45048 7289 -1869 -9680 -8786 -20883 -15482 -70569 -56068 -131121 -175835 -159158 -83203
18958 -83203 -119973 -51988 11972 41541 21800 -69531 -22417 36062 53500 88968 59476 33961
18946 33961 5202 -18032 -57419 -43214 -18570 -32400 -38845 -3267 -42348 -89298 -97584 -53473
$$ packed form
19030d3157n6121M0730l2946m8180O0427J9614K6294K3181L8913j3910n4380M0292
19018G57M4090m2240m1917j27215R7941M8361M802j2365J0449k3027R3155j1386
19006D1405j11532K9186O187R0673L3375q9738L8278k9645j04153j1467L9080
18995f8351L222k792R4563l8925o2663M8997J9887m846k6763m2708M8216k7863
18983f0026p0119l568o686O1688N3515M2788J8295r027J5048l9017m525N4828
18971E3194q146l7759r158p811Q94j2097N401n5087J4501p5053m4714J6677P5955
18958h3203l6770O7985O3960K9569j9741r1331M7114N8479J7438L5468k9492k5515
18946C3961k8759k3234l9387J4205K4644j3830o445L5578l9081m6950q286M4111
$$ plain form
18934 -53473 -64054 -102444 -159284 -207739 -186389 -113813 17967 30479 81120 92843 64402
18923 64402 113665 82629 43780 -94921 -153860 -53158 -36033 -44427 -43830 -64802 1050 88173
18911 88173 61954 11401 32993 73884 55529 89250 88103 100868 72201 83449 3463 -30896
18899 -30896 -17787 -8766 35401 19096 -31277 -18062 -64246 -63895 -15803 -31464 -67410 -15235
18887 -15235 -22821 -47145 -54791 10126 29369 27931 84107 159273 89201 -18585 7053 56518
18875 56518 22812 -50500 -16828 57636 2034 -11984 20584 5083 -13173 -62940 -29563 -12885
18863 -12885 33806 5655 -37173 -97198 -131594 -144248 -160830 -154304 -56842 -32591 -36999 -81757
18851 -81757 -15666 62313 79275 73887 119770 107418 55238 96213 74476 -13192 49390 165015
$$ packed form
18934e3473j0581l8390n6840m8455K1350P2576J31780J2512N0641J1723k8441
18923F4402M9263l1036l8849j38701n8939J00702J7125q394N97k0972O5852Q7123
18911H8173k6219n0553K1592M0891j8355L3721j147J2765k8667J1248p9986l4359
18899c0896J3109R021M4167j6305n0373J3215m6184L51M8092j5661l5946N2175
18887a5235p586k4324p646O4917J9243j438N6176P5166p0072j07786K5638M9465
18875E6518l3706p3312L3672P4464n5602j4018L2568j5501j8256m9767L3377J6678
18863a2885M6691k8151m2828o0025l4396j2654j6582O526R7462K4251m408m4758
18851h1757O6091P7979J6962n388M5883j2352n2180M0975k1737q7668O2582J15625
$$ plain form
18839 165015 151480 54679 51161 116129 160526 169301 135749 158445 174373 111618 192894 91996
18827 91996 39623 102346 156442 142674 178534 157460 76417 62490 79574 2523 56821 122557
18815 122557 128843 76490 105198 161904 226007 185074 301417 377078 343342 283548 226636
18804 226636 239861 152820 176658 139354 26742 -9447 67615 55941 -34674 -80702 -15357
18793 -15357 55414 29443 80745 41073 31572 61654 33595 -15100 -59226 -17806 13288 30833
18781 30833 67899 133137 122330 141156 99702 118806 144535 228902 229969 246057 274482 274333
18769 274333 172951 128453 173713 194747 160211 79564 37781 77196 134540 115310 70857
18758 70857 65658 168641 246543 202542 151578 220919 215660 251679 308184 288629 230710 183673
$$ packed form
18839A65015j3535r6801l518O4968M4397Q775l3552K2696J5928o2755Q1276j00898
18827I1996n2373O2723N4096j3768L5860k1074q1043j3927J7084p7051N4298O5736
18815A22557O286n2353K8708N6706O4103m0933J16343P5661l3736n9794n6912
18804B26636J3225q7041K3838l7304j12612l6189P7062j1674r0615m6028O5345
18793a5357P0771k5971N1302l9672r501L0082k8059m8695m4126M1420L1094J7545
18781C0833L7066O5238j0807J8826m1454J9104K5729Q4367J067J6088K8425j49
18769B74333j01382m4498M5260K1034l4536q0647m1783L9415N7344j9230m4453
18758G0857n199J02983P7902m4001n0964O9341n259L6019N6505j9555n7919m7037
$$ plain form
18746 183673 86269 68723 64341 92835 28766 -79034 -59669 -36858 -53499 -75679 -97648
18735 -97648 -132197 -67869 32331 89033 90189 108146 160722 119949 77243 116575 105296 26989
18723 26989 10231 17375 99863 65051 54839 134674 219571 183914 124200 90999 5507 -11022
18711 -11022 47196 62755 89256 30134 -13129 34287 20711 -9012 22189 -12096 -28456 -56288
18699 -56288 -72531 -38886 16918 56263 -52920 -57958 -40652 27865 63826 69714 43455 95665
18687 95665 183548 201271 242950 184378 140200 118957 114392 18521 -10565 47245 61888 45604
18675 45604 20747 -5315 -78586 -63021 847 9310 61593 137945 118401 16982 -16319 -68211
18663 -68211 -60424 -37499 -23422 27681 73117 126065 166325 162592 100943 28959 -9758 17351
$$ packed form
18746A83673r7404j7546m382K8494o4069j07800J9365K2811j6641k2180k1969
18735i7648l4549O4328J00200N6702J156J7957N2576m0773m2706L9332j1279p8307
18723B6989j6758P144Q2488l4812j0212P9835Q4897l5657n9714l3201q5492j6529
18711a1022N8218J5559K6501n9122m3263M7416j3576k9723L1201l4285j6360k7832
18699e6288j6243L3645N5804L9345j09183n038J7306O8517L5961N888k6259N2210
18687I5665Q7883J7723M1679n8572m4178k1243m565r5871k9086N7810J4643j6284
18675D5604k4857k6062p3271J5565O3868Q463N2283P6352j9544j01419l3301n1892
18663f8211P787K2925J4077N1103M5436N2948M0260l733o1649p1984l8717K7109
$$ plain form
18651 17351 76523 138377 70889 32001 63288 -47925 -69476 36846 80547 94241 57437
18640 57437 34499 -26314 31563 122760 103668 -6233 27439 72131 80485 118524 39215 41030
18628 41030 41712 37544 83442 89774 29886 61137 26789 18582 -48307 -52940 -37321 -7702 34827
18615 34827 106059 144935 114295 97317 60091 95511 55485 -69416 -64443 -29632 20453 90
18603 90 -25070 -20164 84538 135696 93031 100808 112407 104484 84045 22065 4344 -38296 -81897
18590 -81897 -33564 25504 133101 214974 123317 46131 -7870 -1051 84729 109823 176454 192533
18578 192533 138526 106904 94318 86790 62579 45880 64419 114229 164873 221363 191814 183611
18566 183611 198279 164631 229294 227582 170615 140314 226073 167854 142786 209782 253994 266701
$$ packed form
18651A7351N9172O1854o7488l8888L1287j11213k1551J06322M3701J3694l6804
18640E7437k2938o0813N7877R1197j9092j09901L3672M4692Q354L8039p9309J815
18628D1030O82m168M5898O332n9888L1251l4348q207o6889m633J5619K9619M2529
18615C4827P1232L8876l0640j6978l7226L5420m0026j24901M973L4811N0085k0363
18603I0k5160M906J04702N1158m2665P777J1599p923k0439o1980j7721m2640m3601
18590h1897M8333N9068J07597Q1873r1657p7186n4001O819Q5780K5094O6631J6079
18578A92533n4007l1622j2586p528k4211j6699J8539M9810N0644N6490k9549q203
18566A83611J4668l3648O4663j712n6967l0301Q5759n8219k5068O6996M4212J2707
$$ plain form
18554 266701 195140 204963 250205 152234 193760 211464 174533 84827 -22915 -18428 -18054 -17465
18542 -17465 -34361 44383 66996 -15232 24362 47882 23079 -84831 -143992 -41262 24814
18531 24814 53193 121763 150209 167858 83432 22714 79757 139444 198065 169051 245318 245602
18519 245602 264610 347024 298868 293308 298675 211489 90082 106173 88451 79631 80778 106149
18507 106149 163351 229812 232464 223367 126833 84154 90060 198492 222820 146091 87683 105716
18495 105716 192550 212959 105449 7881 -30730 -29972 -65410 -61765 26832 105100 79070 55531
18483 55531 154985 234768 206967 122921 73563 49398 86758 84232 153066 129947 93709 97128
18471 97128 81658 100835 130473 71947 20915 -30241 -97612 -73540 14064 -10146 3829 50079
$$ packed form
18554B66701p1561R823M5242r7971M1526J7704l6931q9706j07742M487L74N89
18542a7465j6896P8744K2613q2228L9594K3520k4803j07910n9161J02730O6076
18531B4814K8379O8570K8446J7649q4426o0718N7043N9687N8621k9014P6267K84
18519B45602J9008Q2414m8156n560N367q7186j21407J6091j7722q820J147K5371
18507A06149N7202O6461K652r097r6534m2679N906J08432K4328p6729n8408J8033
18495A05716Q6834K0409j07510r7568l8611P58l5438L645Q8597P8268k6030k3539
18483E5531R9454P9783k7801q4046m9358k4165L7360k526O8834k3119l6238L419
18471I7128j5470J9177K9638n8526n1032n1156o7371K4072Q7604k4210J3975M6250
$$ plain form
18459 50079 44323 24984 53730 77094 85222 72197 86063 60739 55166 51562 79591 54479
18447 54479 23857 65054 23654 2227 -14148 55985 88894 94096 49488 2886 -22599 -24610
18435 -24610 -49651 -1790 54996 52744 64503 52632 57922 118048 171602 190475 148292 172185
18423 172185 173654 67930 -16969 71586 41548 -63056 -57916 -37558 3259 7541 92979 95785
18411 95785 129019 113932 34979 4229 25771 43253 29137 56451 40563 76838 104333 131529
18399 131529 113947 124459 143444 155797 164415 155521 54706 49076 89965 146390 129092 135711
18387 135711 111536 152037 248131 254959 261880 224221 187975 178662 175401 245040 292223 275255
18375 275255 237192 224841 146831 136046 164144 160678 162928 108717 89797 118566 205761 317194
$$ packed form
18459E0079n756j9339K8746K3364Q128j3025J3866k5324n573l604K8029k5112
18447E4479l0622M1197m1400k1427j6375P0133L2909N202m4608m6602k5485k011
18435b4610k5041M7861N6786k252J1759j1871N290O0126N3554J8873m2183K3893
18423A72185J469j05724q4899Q8555l0038j04604N140K0358M0817M282Q5438K806
18411I5785L3234j5087p8953l0750K1542J7482j4116K7314j5888L6275K7495K7196
18399A31529j7582J0512J8985J2353Q618q894j00815n630M0889N6425j7298O619
18387A35711k4175M0501R6094O828O921l7659l6246r313l261O9639M7183j6968
18375B75255l8063j2351p8010j0785K8098l466K250n4211j8920K8769Q7195J11433
$$ plain form
18363 317194 330329 215492 122167 93100 20268 14757 46209 104929 131361 102167 97273 183863
18351 183863 180042 199018 182159 228465 300252 375932 409060 439531 455402 497441 536584 518163
18339 518163 462026 505306 568971 628122 732793 756513 739044 838340 926127 975310 1135527
18328 1135527 1171372 1213135 1365245 1512918 1665180 1807780 2023748 2337460 2657144 3007804
18318 3007804 3551139 4340674 5519085 7238193 9778843 12833650 15904465 18891425
18310 18891425 22287999 26636274 31258577 33680719 33694669 32834892 31223945 28153524
18302 28153524 24538632 21433974 18756928 16384574 14288682 12777698 12058881 12598811
18294 12598811 14317605 16949464 19885921 22802187 26050479 30275976 35549263 39631150
$$ packed form
18363C17194J3135j14837r3325k9067p2832n511L1452N8720K6432k9194m894Q6590
18351A83863l821J8976j6859M6306P1787P5680L3128L0471J5871M2039L9143j8421
18339E18163n6137M3280O3665N9151J04671K3720j7469R9296Q7787M9183J60217
18328A135527L5845M1763J52110J47673J52262J42600K15968L13712L19684L50660
18318C007804N43335P89535J178411J719108K540650L054807L070815K986960
18310A8891425L396574M348275M622303K422142J3950q59777j610947l070421
18302B8153524l614892l104658k677046k372354k095892j510984p18817N39930
18294A2598811J718794K631859K936457K916266L248292M225497N273287M081887
$$ plain form
18286 39631150 40554646 39514951 37812977 34748885 30329143 25949112 22037665 18441284
18278 18441284 15089644 12172413 9761638 7972128 6796226 5919208 5277506 4906774
18270 4906774 4657497 4420200 4202513 4064121 4045456 4174978 4263186 4400061 4628771 4993518
18260 4993518 5583073 6499792 7947556 10215607 13130403 16134028 18899765 22136059
18252 22136059 26324814 31330963 34725929 35056043 34100239 32662530 29909233 26200008
18244 26200008 22712169 19858119 17437185 15245582 13433089 12484347 12539611 13904027
18236 13904027 16306206 19090561 21844022 24892971 28809071 33761937 38281668 39915226
18228 39915226 39103536 37529945 34887422 30740756 26348680 22314847 18632562 15232335
$$ packed form
18286C9631150R23496j039695j701974l064092m419742m380031l911447l596381
18278A8441284l351640k917231k410775j789510j175902q77018o41702l70732
18270D906774k49277k37297k17687j38392j8665J29522Q8208J36875K28710L64747
18260D993518N89555R16719J447764K268051K914796L003625K765737L236294
18252B2136059M188755N006149L394966L30114r55804j437709k753297l709225
18244B6200008l487839k854050k420934k191603j812493r48742N5264J364416
18236A3904027K402179K784355K753461L048949L916100M952866M519731J633558
18228C9915226q11690j573591k642523m146666m392076m033833l682285l400227
$$ plain form
18220 15232335 12086307 9417037 7482778 6039646 5170036 4506570 3985312 3500898 3133342
18211 3133342 2839349 2590125 2354699 2159527 1927978 1818156 1687333 1618943 1544011 1406745
18201 1406745 1292747 1269854 1292511 1280852 1116499 1003588 938696 849555 819685 766300 727049
18190 727049 703946 658997 663465 616567 609805 615404 619732 575514 560999 604874 580403 512825
18178 512825 452757 372856 359742 376720 346097 321603 360117 373195 302850 319618 422313
18167 422313 424585 406317 355968 409925 440011 412916 450552 468439 407696 463588 405388 348134
18155 348134 267555 192083 223949 207021 274219 294636 263748 184637 125510 128085 106076 31565
18143 31565 98241 150240 200074 226714 173362 177010 203474 213253 236654 343799 369725 352949
$$ packed form
18220A5232335l146028k669270j934259j443132q69610o63466n21258m84414l67556
18211C133342k93993k49224k35426j95172k31549j09822j30823o8390p4932j37266
18201A406745j13998k2893K2657j1659j64353j12911o4892q9141k9870n3385l9251
18190G27049k3103m4949M468m6898o762N599M328m4218j4515M3875k4471o7578
18178E12825o0068p9901j3114J6978l0623k4494L8514J3078p0345J6768J02695
18167D22313K272j8268n0349N3957L0086k7095L7636J7887o0743N5892n8200n7254
18155C48134q0579p5472L1866j6928O7198K0417l0888p9111n9127K575k2009p4511
18143C1565O6676N1999M9834K6640n3352L648K6464R779K3401J07145K5926j6776
$$ plain form
18131 352949 359222 334953 272589 278833 350906 420689 408247 308870 352062 429059 428255 397254
18119 397254 252146 189000 243285 286413 305138 239972 173627 198312 276582 335452 371153
18108 371153 353380 415126 530835 498437 415458 389456 311316 319109 417968 411644 402044 569039
18096 569039 642581 644768 577703 636626 670857 771870 901391 939629 1025834 1119020 1145608
18085 1145608 1124336 1220789 1328832 1409192 1525394 1724839 1914204 2121604 2394473 2668534
18075 2668534 3011292 3488861 4147028 5239285 7007375 9353985 12258055 15121421 17462994
18066 17462994 19606571 22033331 25477010 30441913 35226446 36888240 36168612 34779375
18058 34779375 32315617 28827460 25998094 23719850 21537105 19496450 17573538 16029079
$$ packed form
18131C52949O273k4269o2364O244P2073O9783j2442r9377M3192P6997q04l1001
18119C97254j45108o3146N4285M3128J8725o5166o6345K4685P8270N8870L5701
18108C71153j7773O1746J15709l2398q2979k6002p8140P793R8859o324r600J66995
18096E69039P3542K187o7065N8923L4231J01013J29521L8238Q6205R3186K6588
18085A145608k1272R6453J08043Q0360J16202J99445J89365K07400K72869K74061
18075B668534L42758M77569O58167J092257J768090K346610K904070K863366K341573
18066A7462994K143577K426760L443679M964903M784533J661794p19628j389237
18058C4779375k463758l488157k829366k278244k182745k040655j922912j544459
$$ plain form
18050 16029079 15386037 15862540 17137652 18560973 19739665 21023455 22904083 26033013
18042 26033013 30023254 32479233 32490119 31344899 29506602 26603493 23619218 21240395
18034 21240395 19081232 17029805 14794923 12412690 10287499 8653524 7452098 6614903
18026 6614903 6082323 5822532 5667385 5586126 5629806 5858622 6317485 7264020 8643461 10705839
18016 10705839 13499303 16374110 18710996 20747915 23014721 26331264 31452971 36670994
18008 36670994 38441789 37603008 36171325 33681036 30084747 27095076 24765985 22553217
18000 22553217 20346163 18154730 16283462 15450830 15845518 16946566 18277776 19445642
17992 19445642 20700256 22605304 25529573 29257535 31645888 31567860 30363861 28491310
$$ packed form
18050A6029079o43042M76503J275112J423321J178692J283790J880628L128930
18042B6033013L990241K455979J0886j145220j838297k903109k984275k378823
18034B1240395k159163k051427k234882k382233k125191j633975j201426q37195
18026F614903n32580k59791j55147q1259M3680K28816M58863R46535J379441K062378
18016A0705839K793464K874807K336886K036919K266806L316543N121707N218023
18008C6670994J770795q38781j431683k490289l596289k989671k329091k212768
18000B2553217k207054k191433j871268q32632L94688J101048J331210J167866
17992A9445642J254614J905048K924269L727962K388353p8028j203999j872551
$$ plain form
17984 28491310 25660423 22684530 20226039 18015841 15764803 13367573 10947740 8786461
17976 8786461 7029304 5749385 4807684 4104303 3548287 3189312 2819116 2451801 2212030
17967 2212030 2006808 1856780 1703287 1534569 1403272 1350182 1342569 1220854 1092414 1043481
17957 1043481 990985 954523 930442 847445 722877 670135 639996 639474 689134 624887 560955
17946 560955 545101 499402 489823 544337 549211 496818 414826 400437 413809 407608 350455 274463
17934 274463 240701 170762 190731 260377 288908 272332 299972 247968 141375 174838 301851
17923 301851 341695 348699 336891 289208 273565 303651 275494 198251 86164 22897 85523
17912 85523 98925 61972 104818 142176 125758 61477 44421 62606 166620 243363 154274
$$ packed form
17984B8491310k830887k975893k458491k210198k251038k397230k419833k161279
17976H786461j757157j279919r41701p03381n56016l58975l70196l67315k39771
17967B212030k05222j50028j53493j68718j31297n3090p613j21715j28440m8933
17957A043481n2496l6462k4081q2997j24568n2742l0139n22M9660o4247o3932
17946E60955j5854m5699r579N4514M874n2393q1992j4389J3372o201n7153p5992
17934B74463l3762o9939J9969O9646K8531j6576K7640n2004j06593L3463J27013
17923C01851L9844P004j1808m7683j5643L0086k8157p7243j12087o3267O2626
17912H5523J3402l6953M2846L7358j6418o4281j7056J8185J04014P6743q9089
$$ plain form
17901 154274 86641 35406 74679 130282 127402 94373 66706 81891 141927 177368 204285 109716
17889 109716 4983 -40761 -34896 8079 32813 6024 14169 80852 79238 70947 132161 93452
17877 93452 169015 178443 190772 147632 73437 31798 22525 -31452 -101680 -97347 -25857 -6649
17865 -6649 8477 -4869 -734 8527 -1665 97023 124471 172464 212544 149636 82987 89842
17853 89842 158330 128505 16317 21836 95407 113838 94743 86893 122093 93284 90435 128514
17841 128514 80067 -57926 -130590 -68363 -4534 -19503 -1721 -15622 -44156 3094 43526
17830 43526 18654 24770 37702 -13859 -19535 48972 23615 -424 18870 76789 109843 68522
17818 68522 -17176 -6268 8120 14062 73520 126130 138281 98675 47346 58215 66860 86022
$$ packed form
17901A54274o7633n1235L9273N5603k880l3029k7667J5185O0036L5441K6917r4569
17889A09716j04733m5744N865M2975K4734k6789Q145O6683j614q291O1214l8709
17877I3452P5563R428J2329m3140p4195m1639r273n3977p0228M333P1490J9208
17865f649J5126j3346M135R261j0192R8688K7448M7993M0080o2908o6649O855
17853H9842O8488k9825j12188N519P3571J8431j9095p850L5200k8809k849L8079
17841A28514m8447j37993p2664O2227O3829j4969J7782j3901k8534M7250M0432
17830D3526k4872O116J2932n1561n676O8507k5357k4039J9294N7919L3054m1321
17818F8522q5698J0908J4388N942N9458N2610J2151l9606n1329J0869Q645J9162
$$ plain form
17806 86022 75507 38101 57832 70144 17708 23480 36891 -47796 -38882 -17739 -21845 -24347
17794 -24347 45534 154214 156997 69058 -16802 6436 94972 845 33170 -4804 3614 76131
17782 76131 104496 36620 60419 106072 223120 278902 259867 209488 105567 129789 92680
17771 92680 95458 141390 106386 -47529 -51755 -48295 -44005 95894 145700 172965 92755 11563
17759 11563 20670 -3529 964 30858 84280 96765 85566 80831 47141 -45631 -32624 18743
17747 18743 -22507 -128925 -197509 -193362 -107650 -85623 -89242 -99704 -153863 -108956 -61065 -78242
17735 -78242 -134387 -96071 14394 40667 164646 181038 209653 112643 76053 128094 120189
17724 120189 150194 192442 165405 178068 212903 228433 214962 181527 143935 183655 150903
$$ packed form
17806H6022j0515l7406J9731J2312n2436N772J3411q4687Q914K1143m106k502
17794b4347O9881J08680K783q7939q5860K3238Q8536r4127L2325l7974Q418P2517
17782G6131K8365o7876K3799M5653J17048N5782j9035n0379j03921K4222l7109
17771I2680K778M5932l5004j53915m226L460M290J39899M9806K7265q0210q1192
17759A1563R107k4199M493K9894N3422J2485j1199m735l3690r2772J3007N1367
17747A8743m1250j06418o8584M147Q5712K2027l619j0462n4159M4907M7891j7177
17735g8242n6145L8316J10465K6273J23979J6392K8615r7010l6590N2041p905
17724A20189L0005M2248k7037J2663L4835J5530j3471l3435l7592L9720l2752
$$ plain form
17713 150903 74274 51047 13821 46795 49875 57524 53120 84598 184864 247744 311801 231759
17701 231759 83276 58485 116942 101312 11628 1617 92136 22325 -23457 56949 72647
17690 72647 28852 12414 50456 -4318 -49364 -68155 -130233 -136823 -103892 -35619 38034 -20736
17678 -20736 -126610 -154814 -146929 -109894 -97171 -41264 6377 26076 14571 -1620 -19715 -104865
17666 -104865 -73033 -26592 -45978 -57491 30924 -58711 -64977 -106056 -103441 -97174 -80465 -123760
17654 -123760 -195868 -132509 -85881 -46395 -39834 -36742 -93858 -167479 -176534 -125229 -111393 -68869
17642 -68869 -47241 -102907 -68825 -3458 -29305 -21281 -73450 -95442 -97919 -62696 22180 79655
17630 79655 17347 -87176 -113013 -135203 -165415 -110886 -79856 -51412 -51502 -2560 80850 77763
$$ packed form
17713A50903p6629k3227l7226L2974L080P649m404L1478J00266O2880O4057q0042
17701B31759j48483k4791N8457j5630q9684j0011R0519o9811m5782Q0406J5698
17690G2647m3795j6438L8042n4774m5046j8791o2078o590L2931O8273P3653n8770
17678b0736j05874k8204P885L7035J2723N5907M7641J9699j1505j6191j8095q5150
17666a04865L1832M6441j9386j1513Q8415q9635o266m1079K615O267J6709m3295
17654a23760p2108O3359M6628L9486O561L092n7116p3621r055N1305J3836M2524
17642f8869K1628n5666L4082O5367k5847Q024n2169k1992k477L5223Q4876N7475
17630G9655o2308j04523k5837k2190l0212N4529L1030K8444r0M8942Q3410l087
$$ plain form
17618 77763 -19716 -38930 -29000 -41405 -60086 -49744 -74822 -51647 -50200 -138822 -60004 -41596
17606 -41596 -14840 21022 -1215 -36404 -35604 2229 13755 8315 -22615 -51068 -29252 -61842
17594 -61842 -161760 -113037 22042 22667 -1486 -21026 -52045 -21264 -30229 -73168 -234797 -240904
17582 -240904 -115255 -46658 -52895 -72930 -51779 -94574 -144338 -162910 -224947 -280090 -306935
17571 -306935 -236728 -219833 -174226 -12351 23696 -33538 -68666 -97871 -149983 -152906 -107251
17560 -107251 -51470 -6175 30835 39281 48101 32514 -21516 -40014 -10927 -10405 -22317 -59418
17548 -59418 -3538 -4879 15145 -2406 25119 40868 91795 125911 77176 54772 80009 90381
17536 90381 50177 35003 -33847 -106808 -92491 -88938 -44766 20481 -28487 32589 151422 135482
$$ packed form
17618G7763r7479j9214R930j2405j8681J0342k5078K3175J447q8622P8818J8408
17606d1596K6756L5862k2237l5189Q00L7833J1526n440l0930k8453K1816l2590
17594f1842r9918M8723J35079O25k4153j9540l1019L0781q965m2939j61629o107
17582b40904J25649O8597o237k0035K1151m2795m9764j8572o2037n5143k6845
17571c06935P0207J6895M5607J61875L6047n7234l5128k9205n2112k923M5655
17560a07251N5781M5295L7010Q446Q820j5587n4030j8498K9087N22j1912l7101
17548e9418N5880j341K0024j7551K7525J5749N0927L4116m8735k2404K5237J0372
17536I0381m0204j5174o8850p2961J4317L553M4172O5247m8968O1076J18833j5940
$$ plain form
17524 135482 182103 117539 37350 13814 82046 171960 170381 126278 157858 50060 3859
17513 3859 -22234 -49109 -111906 -105720 -90949 -83556 -33168 -34250 -2218 -33558 -53280 -8239
17501 -8239 16026 -19082 -85360 -111223 -146047 -76261 -1169 6457 -41127 -16546 18311 93771
17489 93771 143269 203538 185067 133628 123869 54724 24209 42637 104143 120338 92467 68179
17477 68179 64182 27302 -14092 -28594 28096 15425 -14045 -30547 -7374 -47490 -39000 54433
17465 54433 187516 98223 48835 61666 12685 -91 50094 82158 46424 -2854 -35531
17454 -35531 -40958 -60497 -40035 821 64777 16642 -52131 -43721 -82006 -103142 -96431 -47427
17442 -47427 -26944 399 50992 53722 -8835 -93379 -63088 -45473 38039 -81016 -129314 -136214
$$ packed form
17524A35482M6621o4564q0189k3536O8232Q9914j579m4103L1580j07798m6201
17513C859k6093k6875o2797O186J4771P393N0388j082L2032l1340j9722M5041
17501h239K4265l5108o6278k5863l4824O9786P5092P626m7584K4581L4857P5460
17489I3771M9498O0269j8471n1439r759o9145l0515J8428O1506J6195k7871k4288
17477F8179l997l6880m1394j4502N6690j2671k9470j6502K3173m0116Q490R3433
17465E4433J33083q9293m9388J2831m8981j2776N0185L2064l5734m9278l2677
17454c5531n427j9539K0462M0856O3956m8135o8773Q410l8285k1136O711M9004
17442d7427K0483K7343N0593K730o2557q4544L0291J7615Q3512j19055m8298o900
$$ plain form
17430 -136214 -151423 -35806 14394 -22904 -53277 -136179 -113097 -44879 -63790 -69712 -49498
17419 -49498 2380 53883 93812 109015 73413 73598 1 -31171 -21156 55049 23744 20060
17407 20060 30157 -5364 -14268 38847 -18413 -88648 -99667 -89465 -93413 -117482 -70019 -17458
17395 -17458 -7020 16591 309 -129945 -209441 -126404 -28647 57765 58941 -384 -94907 -185026
17383 -185026 -121759 -80027 -91882 -109964 -112968 -91703 -61539 48828 -17234 -59038 -58148 -32422
17371 -32422 -89827 -20697 -26245 -49632 -79030 -98907 -69416 -8925 -15305 -71837 -89741 -83193
17359 -83193 -110835 -110964 -43394 -46359 -67882 -36365 39222 48304 -27497 -25022 -4441 -60379 -42367
17346 -42367 835 -64202 -46281 -70912 -151868 -105944 -36454 -108601 -86239 -33261 -4693 52918
$$ packed form
17430a36214j5209J15617N0200l7298l0373q2902K3082O8218j8911n922K0214
17419d9498N1878N1503L9929J5203l5602J85p3597l1172J0015P6205l1305l684
17407B0060J0097l5521q904N3115n7260p0235j1019J0202l948k4069M7463N2561
17395a7458J0438K3611j6282j30254p9496Q3037R7757Q6412J176n9325r4523r0119
17383a85026O3267M1732j1855j8082l004K1265L0164J10367o6062m1804Q90K5726
17371c2422n7405O9130n548k3387k9398j9877K9491O0491o380n6532j7904O548
17359h3193k7642j29O7570k965k1523L1517P5587R082p5801K475K0581n5938J8012
17346d2367M3202o5037J7921k4631q0956M5924O9490p2147K2362N2978K8568N7611
$$ plain form
17334 52918 -46577 -118019 -81006 -107120 -186485 -192563 -115879 -49886 -39941 1011 -32739 -82427
17322 -82427 -115546 -60530 -17435 -54501 -38951 -58835 -68949 -82231 -126403 -78932 -48549 -88286
17310 -88286 -109425 -164922 -159313 -151357 -29295 -65063 -99736 -19948 16477 -77653 -105292 -140024
17298 -140024 -105940 -119841 -166458 -151843 -200246 -165304 -100256 -41493 38418 -83138 -134876
17287 -134876 -47555 -17126 33182 22955 -3876 -84244 -94656 -19664 -32450 -2034 19226
17276 19226 -3304 -94903 -102779 -13630 -17082 -79061 -119484 -95149 -45628 -42634 60309 33525
17264 33525 62237 -29783 -137101 -129380 -121767 -121305 -28775 -79831 -142670 -120977 -148855 -146386
17252 -146386 -129981 -160748 -132516 -127136 -100967 -61093 -56522 -110530 -96241 -68521 -53474 -15971
$$ packed form
17334E2918r9495p1442L7013k6114p9365o078P6684O5993R945M0952l3750m9688
17322h2427l3119N5016M3095l7066J5550j9884j0114j3282m4172M7471L0383l9737
17310h8286k1139n5497N609P956J22062l5768l4673P9788L6425r4130k7639l4732
17298a40024L4084j3901m6617J4615m8403L4942O5048N8763P9911j21556n1738
17287a34876Q7321L0429N0308j0227k6831q0368j0412P4992j2786L0416K1260
17276A9226k2530r1599p876Q9149l452o1979m0423K4335M9521K994J02943k6784
17264C3525K8712r2020j07318P721P613M62R2530n1056o2839K1693k7878K469
17252a46386J6405l0767K8232N380K6169L9874M571n4008J4289K7720J5047L7503
$$ plain form
17240 -15971 27688 -50090 -87178 -72489 -8529 10371 12913 -43212 22244 58066 51124 147037
17228 147037 101438 -40839 -167654 -177732 -62290 -17753 40069 13679 -101652 -166572 -58038
17217 -58038 -54463 -69258 -67639 -88962 -115989 -148149 -187659 -199987 -244823 -258705 -211175 -214329
17205 -214329 -156605 -97846 -9248 -17827 -100201 -128739 -149432 -118018 -73655 -71323 -17402 -24387
17193 -24387 -42382 -11664 -25382 42124 125347 84703 67154 44573 -5346 -56136 -24664 -78149
17181 -78149 -67719 -114264 -42915 -59593 -27780 -38425 -27661 14470 60432 41943 22823 22016
17169 22016 11160 -10057 2111 73615 190774 255004 144050 77001 59735 40743 -334
17158 -334 -48942 -134009 -120325 -94403 -85029 -9863 -20231 114283 94063 38460 -27629 12563
$$ packed form
17240a5971M3659p7778l7088J4689O3960J8900K542n6125O5456L5822o942R5913
17228A47037m5599j42277j26815j0078J15442M4537N7822k6390j15331o4920J08534
17217e8038L575j4795J619k1323k7027l2160l9510j2328m4836j3882M7530l154
17205b14329N7724N8759Q8598q579q2374k8538k0693L1414M4363K332N3921o985
17193b4387j7995L0718j3718O7506Q3223m0644j7549k2581m9919n0790L1472n3485
17181g8149J0430m6545P1349j6678L1813j0645J0764M2131M5962j8489j9120q07
17169B2016j0856k1217J2168P1504J17159O4230j10954o7049j7266j8992m1077
17158c34m8608q5067J3684K5922R374P5166j0368J34514k0220n5603o6089M0192
$$ plain form
17146 12563 -13567 42901 58370 36978 -29208 -39368 -112059 -91321 -146446 -143705 -142472 -108830
17134 -108830 -104533 -160046 -135829 -78614 -96610 -95680 -81897 -88159 -123100 -110674 -108894 -32720
17122 -32720 -31245 -102076 -65521 -82762 -70956 -89014 -88278 -82556 -76186 -70415 -82221 -117076 -173457
17109 -173457 -233915 -183914 -108512 -55952 -96918 -95631 -84472 -99333 -143517 -152909 -113283 -126466
17097 -126466 -133921 -187861 -179510 -152067 -107439 -92540 -79203 -80068 -25043 -56230 -148980 -115981
17085 -115981 -14726 -47469 -95309 -127819 -133851 -144389 -81954 -91167 -119088 -110529 -148121 -155521
17073 -155521 -141385 -201064 -116892 -10264 36945 38650 -40615 -42618 -98031 -102266 -117379 -31063
17061 -31063 -6381 -116611 -12418 -6098 674 53327 11485 29505 14802 -35820 -85000 -105375
$$ packed form
17146A2563k6130N6468J5469k1392o6186j0160p2691K0738n5125K741J233L3642
17134a08830M297n5513K4217N7215j7996R30J3783o262l4941J2426J780P6174
17122c2720J475p0831L6555j7241J1806j8058P36N722O370N771j1806l4855n6381
17109a73457o0458N0001P5402N2560m0966J287J1159j4861m4184r392L9626j3183
17097a26466p455n3940Q351K7443M4628J4899J3337q65N5025l1187r2750L2999
17085a15981J01255l2743m7840l2510o032j0538O2435r213k7921Q559l7592p400
17073a55521J4136n9679Q4172J06628M7209J705p9265k003n5413m235j5113Q6316
17061c1063K4682j10230J04193O320O772N2653m1842J8020j4703n0622m9180k0375
$$ plain form
17049 -105375 -113100 -102831 -130635 -79274 -95038 -125938 -156720 -152039 -106344 19233 58750 30944
17037 30944 -21228 86477 154005 97248 86825 39406 21302 47561 43843 36038 60123 36044
17025 36044 -19948 -63339 -39483 -62517 -95658 -104049 -131025 -172273 -180571 -84448 -126571 -78424
17013 -78424 -71297 -105893 -128423 -34675 -12433 -19979 -98816 -165861 -131315 -132267 -86318 -52084
17001 -52084 -16301 26497 -32748 -21870 -36664 -25190 108570 116237 88101 29641 34 -4705
16989 -4705 -20310 -65826 -87876 -170214 -170284 -165238 -147472 -29926 -25012 -89861 -181718 -165409 -69864
16976 -69864 -17425 -35208 -44113 -95386 -94405 -41097 3142 37031 -17791 -25788 -5802 -33916
16964 -33916 -123254 -128401 -139492 -88748 -86157 4338 57380 16585 -954 36882 43528 54204
$$ packed form
17049a05375p725J0269k7804N1361j5764l0900l0782M681M5695J25577L9517k7806
17037C0944n2172J07705O7528n6757j0423m7419j8104K6259l718p805K4085k4079
17025C6044n5992m3391K3856k3034l3141q391k6976m1248q298R6123m2123M8147
17013g8424P127l4596k2530R3748K2242p546p8837o7045L4546r52M5949L4234
17001e2084L5783M2798n9245J0878j4794J1474J33760P667k8136n8460k9607m739
16989d705j5605m5516k2050q2338p0N046J7766J17546M914o4849r1857J6309R5545
16976f9864N2439j7783q905n1273R81N3308M4239L3889n4822p997J9986k8114
16964c3916q9338n147j1091N0744K591R0495N3042m0795j7539L7836O646J0676
$$ plain form
16952 54204 -19288 -108093 -138832 -148130 -102092 33894 97576 -17949 -104221 -122944 -129900 -116593
16940 -116593 -86111 -65797 -70290 -136730 -122318 -29634 53983 97164 181868 207686 93312
16929 93312 2759 -91761 -49730 -33278 -69046 -151184 -193015 -221004 -189718 -118275 -62652 -29442
16917 -29442 -6604 -72276 -74415 -87194 -87063 -85642 -87330 -5082 35162 137595 156744 48509
16905 48509 -39536 -85792 -57192 -123503 -203557 -212146 -150451 -116045 -78157 -36446 -41399 -53664
16893 -53664 -45953 -2643 -36956 -93758 -118068 -119091 -35741 -31638 -69148 -106301 -102992 -76905
16881 -76905 10637 83837 112396 66258 -61303 -41072 127302 149523 53034 -21127 -38824
16870 -38824 -38860 -99031 -144593 -189275 -163275 -37441 -90536 -113079 -80128 -45837 26627 72120
$$ packed form
16952E4204p3492q8805l0739r298M6038J35986O3682j15525q6272j8723o956J3307
16940a16593L0482K0314m493o6440J4412R2684Q3617M3181Q4704K5818j14374
16929I3312r0553r4520M2031J6452l5768q2138m1831k7989L1286P1443N5623L3210
16917b9442K2838o5672k139j2779J31J421j688Q2248M0244J02433J9149j08235
16905D8509q8045m6256K8600o6311q0054q589O1695L4406L7888M1711m953j2265
16893e3664P711M3310l4313n6802k4310j023Q3350M103l7510l7153L309K6087
16881g6905Q7542P3200K8559m6138j27561K0231J68374K2221r6489p4161j7697
16870c8824l6o0171m5562m4682K6000J25834n3095k2543L2951L4291P2464M5493
$$ plain form
16858 72120 65005 46732 23485 34492 6839 -28636 23905 47441 37967 -30756 -8573 53476
16846 53476 58792 -2607 -26768 7728 10028 25277 -22422 -131175 -81930 -7417 24169 -8909
16834 -8909 -36660 -25958 -91150 -101257 -50215 -59027 35159 8364 -87659 -110930 -73639 -95638
16822 -95638 -90069 29639 61167 28371 14223 3671 -62514 -67847 13393 9056 -24705 -135484
16810 -135484 -113530 -8446 22601 -53582 -36846 -19537 -87503 -194201 -185653 -151675 -135480
16799 -135480 -1681 10880 -50771 -34924 58456 80681 34145 59766 2747 4400 65293
16788 65293 4739 -89042 -67016 36350 65441 77507 57769 -2056 -17129 -73005 -96205
16777 -96205 -47549 56859 51361 29823 -18305 -90698 9445 23654 61725 92473 106402
$$ packed form
16858G2120p115j8273k3247J1007k7653l5475N2541K3536r474o8723K2183O2049
16846E3476N316o1399k4161L4496K300J5249m7699j08753M9245P4513L1586l3078
16834h909k7751J0702o5192j0107N1042q812R4186k6795r6023k3271L7291k1999
16822i5638N569J19708L1528l2796j4148j0552o6185n333Q1240m337l3761j10779
16810a35484K1954J05084L1047p6183J6736J7309o7966j06698Q548L3978J6195
16799a35480J33799J2561o1651J5847R3380K2225m6536K5621n7019J653O0893
16788F5293o0554r3781K2026J03366K9091J2066j9738n9825j5073n5876k3200
16777i6205M8656J04408n498k1538m8128p2393J00143J4209L8071L0748J3929
$$ plain form
16766 106402 32687 52750 62684 24107 -15334 -76075 -128517 -96786 -39437 -58947 -66768 1925
16754 1925 30677 36864 -73077 -78636 28542 65055 -14856 -23858 -57086 -117507 -96065 -75826
16742 -75826 -50321 -101651 -128150 -89117 -30637 -3144 8197 11424 -25638 -97018 -85409 -79909
16730 -79909 -69660 -30938 -35936 -89638 -97057 -16768 56664 54525 -29615 -29410 -36168 -48016 -79352
16717 -79352 -65118 32563 18995 -13256 -50714 -38856 -82868 -46292 29155 77655 103436 88049
16705 88049 104506 118911 80164 55335 69854 83994 48459 -61506 -112679 -90635 -55332
16694 -55332 -14889 18630 -710 -34592 2324 56419 15683 -127090 -158702 -162497 -144834 -146129
16682 -146129 -119410 -100958 -88804 -8956 -1146 -80975 -128899 -73715 10549 -6951 -85244 -138536
$$ packed form
16766A06402p3715K0063R934l8577l9441o0741n2442L1731N7349j9510p821O8693
16754A925K8752O187j09941n559J07178L6513p9911r002l3228o0421K1442K0239
16742g5826K5505n1330k6499L9033N8480K7493J1341L227l7062p1380J1609N500
16730g9909J0249L8722m998n3702p419Q0289P3432k139q4140K05o758j1848l1336
16717g9352J4234R7681j3568l2251l7458J1858m4012L6576P5447M8500K5781j5387
16705H8049J6457J4405l8747k4829J4519J4140l5535j09965n1173K2044L5303
16694e5332M0443L3519j9340l3882L6916N4095m0736j42773l1612l795J7663j295
16682a46129K6719J8452J2154P9848P810p9829m7924N5184Q4264j7500p8293n3292
$$ plain form
16670 -138536 -102748 -75390 -47300 -101192 -14227 49766 90440 130211 124691 46835 20036 16987
16658 16987 3575 -3502 -5565 -31399 -88741 -116884 -82388 -170906 -167435 -56006 -33089 -96492
16646 -96492 -98817 -75158 -81260 -109287 -169043 -185945 -149874 -51024 15633 97380 132604 75374
16634 75374 73897 24538 -87708 -40720 -19533 -51434 -101010 -102815 -40647 -7920 -58828 -69393
16622 -69393 -59524 -90719 -121719 -137575 -60795 -85432 -94493 -201734 -175147 -134617 -171966 -136086
16610 -136086 -105544 -108807 -146002 -173687 -98534 -76775 -57862 -77945 -95848 -69810 -52276 19181
16598 19181 81995 67274 -13248 -77430 -51605 -38733 -37827 -151195 -164419 -134036 -59061 4409
16586 4409 -18461 -108704 -90032 -21003 -64792 -148272 -200424 -211596 -208729 -217496 -87289 -37278
$$ packed form
16670a38536L5788K7358K8090n3892Q6965O3993M0674L9771n520p7856k6799l049
16658A6987j3412p077k063k5834n7342k8143L4496q8518L471J11429K2917o3403
16646i6492k325K3659o102k8027n9756j6902L6071R8850O6657Q1747L5224n7230
16634G5374j477m9359j12246M6988K1187l1901m9576j805O2168L2727n0908j0565
16622f9393R869l1195l1000j5856P6780k4637r061j07241K6587M0530l7349L5880
16610a36086L0542l263l7195k7685P5153K1759J8913k0083j7903K6038J7534P1457
16598A9181O2814j4721q0522o4182K5825J2872R06j13368j3224L0383P4975O3470
16586D409k2870r0243J8672O9029m3789q3480n2152j1172K867q767J30207N0011
$$ plain form
16574 -37278 -36679 -12481 -93715 -110975 -72348 -32140 -3676 -18433 83567 27397 35755 -41957
16562 -41957 -107178 -96986 -30765 24151 43253 12580 -12114 -68130 -11428 84111 164879 214658
16550 214658 162309 59932 -111403 -212758 -180062 -133979 -116377 -130099 -115134 -126407 -115614
16539 -115614 -125150 -146043 -26162 12521 -14423 -153152 -130404 -79516 -110782 -76514 -68978
16528 -68978 -31837 -34590 -67778 -50203 -94693 -153932 -139262 -63218 3387 -10467 -19795 -95223
16516 -95223 -100947 -35761 28087 -2818 -40413 -44779 6942 73562 91487 95862 61878 71226
16504 71226 86324 402 -24051 -50648 -62139 -91128 -67046 -44666 -12550 26902 -23233 -104165
16492 -104165 -129136 -79547 -100977 -134498 -152160 -44310 47479 41624 34145 -43371 -27537 -91125
$$ packed form
16574c7278N99K4198q1234j7260L8627M0208K8464j4757J02000n6170Q358p7712
16562d1957o5221J0192O6221N4916J9102l0673k4694n6016N6702R5539Q0768M9779
16550B14658n2349j02377j71335j01355L2696M6083J7602j3722J4965j1273J0793
16539a15614r536k0893J19881L8683k6944j38729K2748N0888l1266L4268P536
16528f8978L7141k753l3188J7575m4490n9239J4670P6044O6605j3854r328p5428
16516i5223n724O5186O3848l0905l7595m366N1721O6620J7925M375l3984R348
16504G1226J5098q5922k4453k6597j1491k8989K4082K2380L2116L9452n0135q0932
16492a04165k4971M9589k1430l3521j7662J07850R1789n855p479p7516J5834o3588
$$ plain form
16480 -91125 -141871 -132322 -106520 -54375 -25930 -51733 -123558 -157659 -118448 -98389 -43937 -9746
16468 -9746 32246 -27097 51900 49047 28945 5694 -18705 -43194 -40088 4299 -8981 -106479
16456 -106479 -65385 -41779 17841 -74660 -137459 -134729 -90724 -44488 8187 -32108 -128980 -189083
16444 -189083 -160499 -77035 -132217 -97708 -51414 18133 26123 53409 45357 10641 48909 101587
16432 101587 4878 -18666 36604 58471 -4830 -45388 5276 37469 -829 27143 -6421
16421 -6421 -37985 -118588 -143069 -114393 -142429 -125169 -114304 -127039 -158117 -38948 -27174 21405
16409 21405 57151 31652 -32919 -95900 -72631 -29302 -163427 -181661 -106124 -100306 -84623 -59034
16397 -59034 -26688 24636 87323 87302 -9606 -87329 -79832 -119336 -129921 -85930 -83085 -145178 -142186
$$ packed form
16480i1125n0746R549K5802N2145K8445k5803p1825l4101L9211K0059N4452L4191
16468i746M1992n9343P8997k853k0102k3251k4399k4489L106M4387j3280r7498
16456a06479M1094K3606N9620r2501o2799K730M4005M6236N2675m0295r6872o0103
16444a89083K8584Q3464n5182L4509M6294O9547P990K7286q052l4716L8268N2678
16432A01587r6709k3544N5270K1867o3301m0558N0664L2193l8298K7972l3564
16421f421l1564q0603k4481K8676k8036J7260J0865j2735l1078J19169J1774M8579
16409B1405L5746k5499o4571o2981K3269M3329j34125j8234P5537N818J5683K5589
16397e9034L2346N1324O2687k1r6908p7723P497l9504j0585M3991K845o2093K992
$$ plain form
16384 -142186 -64178 -100433 -181418 -157344 -59759 -85026 -143787 -117186 -38725 2151 9915 -5439
16372 -5439 -8322 -48000 -95042 -135563 -66449 -29960 -25899 -14415 -29911 -115648 -231574 -277209
16360 -277209 -172740 -74252 -84373 -13485 24985 34916 26945 13991 40447 54569 91809 64841
16348 64841 17952 48096 75097 94277 111818 92041 126871 122085 136078 152926 98808 50437
16336 50437 24624 23375 -33524 -107738 -109822 -97700 -102990 -153686 -89401 -1475 77556 57936
16324 57936 36420 18623 18432 44492 84749 34938 -772 3028 -20803 -22633 24404 -890
16312 -890 24548 11427 -50418 -2049 35692 -16889 -48590 -98249 -80427 -15613 -25387 -31714
16300 -31714 14860 6704 -51557 -127726 -165409 -221272 -223243 -76521 -44623 -81212 -29863 42841
$$ packed form
16384a42186P8008l6255q0985K4074R7585k5267n8761K6601P8461M0876P764j5354
16372e439k883l9678m7042m0521O9114L6489M061J1484j5496q5737j15926m5635
16360b77209J04469R8488j0121P0888L8470R931p971j2954K6456J4122L7240k6968
16348F4841m6889L0144K7001J9180J7541j9777L4830m786J3993J6848n4118m8371
16336E0437k5813j249n6899p4214k084J2122n290n0696O4285Q7926P9031j9620
16324E7936k1516j7797j91K6060M0257m9811l5710L800k3831j830M7037k5294
16312h90K5438j3121o1845M8369L7741n2581l1701m9659J7822O4814r774o327
16300c1714M6574q156n8261p6169l7683n5863j971J46722L1898l6589N1349P2704
$$ plain form
16288 42841 36642 25617 -80838 -109960 -30030 -69779 -133766 -100858 -29515 -18561 -5449 11992
16276 11992 51273 45132 40594 -25534 -114637 -86771 -86834 -117262 -39964 11974 -41693 -19415 77854
16263 77854 72375 33953 85200 37254 -148578 -162883 -115521 -39714 100687 83393 -28482
16252 -28482 -40882 -38492 -102350 -96191 12497 58951 91647 123098 109805 148450 97482 29609
16240 29609 -18944 -16805 -30640 34896 37714 -10412 -19378 -16281 -26137 19439 74563 -13307 -6346
16227 -6346 -21371 9963 75077 37328 -4195 -13538 -9683 -14460 -53928 -99297 -58648 -32168
16215 -32168 -22666 -20015 -29358 -30313 59069 93634 19178 41605 41762 -9655 46956 150703 67682
16202 67682 -40691 -43823 13943 29312 45079 28347 15765 41952 36170 -4899 -8262 8094
$$ packed form
16288D2841o199j1025j06455k9122P9930l9749o3987L2908P1343J0954J3112J7441
16276A1992L9281o141m538o6128q9103K7866o3l0428P7298N1938n3667K2278R7269
16263G7854n479l8422N1247m7946j85832j4305M7362P5807J40401j7294j11875
16252b8482j2400K390o3858O159J08688M6454L2696L1451j3293L8645n0968o7873
16240B9609m8553K139j3835O5536K818m8126q966L097r856M5576N5124q7870O961
16227f346j5025L1334O5114l7749m1523r343L855m777l9468m5369M0649K6480
16215c2168R502K651r343r55Q9382L4565p4456K2427J57n1417N6611J03747q3021
16202F7682j08373l132N7766J5369J5767j6732j2582K6187n782m1069l363J6356
$$ plain form
16190 8094 -23373 -72758 -56711 -35616 -4160 23952 -26310 -51144 -127910 -90715 35618 47121
16178 47121 73931 67001 -13513 -45611 -70535 -14776 12386 7323 -20352 -82990 -15901 -22136
16166 -22136 -93795 -83776 -60644 -131795 -83294 -66578 -44775 -39361 -108240 -121094 -77967 46449
16154 46449 90589 30891 -115515 -137607 -52208 -49461 -59857 -55877 -74966 -120413 -79763 -73737
16142 -73737 -73147 -61545 -54972 -114248 -147774 -84338 -62476 -61145 -45280 -25327 -80455 -116159
16130 -116159 -152445 -117724 -134170 -192756 -189709 -223700 -191611 -131193 -145425 -182415 -184126 -217478
16118 -217478 -214034 -108726 -72972 -91258 -57226 3060 17186 28926 -6594 59288 18759
16107 18759 48369 38378 67759 93731 53987 42365 -15064 -112891 -93905 -11693 8798 16866
$$ packed form
16190H094l1467m9385J6047K1095L1456K8112n0262k4834p6766L7195J26333J1503
16178D7121K6810o930q0514l2098k4924N5759K7162n063k7675o2638O7089o235
16166b2136p1659J0019K3132p1151M8501J6716K1803N414o8879j2854M3127J24416
16154D6449M4140n9698j46406k2092Q5399K747j0396L980j9089m5447M0650O026
16142g3737N90J1602O573n9276l3526O3436K1862J331J5865J9953n5128l5704
16130a16159l6286L4721j6446n8586L047l3991L2089O0418j4232l6990j711l3352
16118b17478L444J05308L5754j8286L4032O0286J4126J1740l5520O5882m0529
16107A8759K9610r991K9381K5972l9744j1622n7429r7827J8986Q2212K0491Q068
$$ plain form
16095 16866 -25701 -80725 -128935 -200597 -190978 -49800 -57214 -25409 -17706 -92667 -173131 -185369
16083 -185369 -188084 -194921 -171282 -85442 -82321 -120023 -84950 -5483 65899 33236 41340 53938
16071 53938 169120 241763 130349 26464 12728 -76360 -164866 -161946 -107080 -78927 -51373
16060 -51373 54249 70719 36611 -11509 -55684 -78349 -32150 -59972 -12384 6911 44985
16049 44985 73212 32054 70544 23637 79743 76354 46486 -4692 10324 36277 12337 -82998
16037 -82998 -90970 -13457 29604 81908 110766 57336 -57469 -23712 -60907 -77513 7978 78020
16025 78020 133381 124006 34899 46711 21392 -38387 -100049 -125141 -160546 -200257 -218501 -214472
16013 -214472 -98301 -56146 -29257 -33581 -48575 -42254 -60169 -60681 -43225 -10732 1869 56509
$$ packed form
16095A6866m2567n5024m8210p1662R619J41178p414L1805P703p4961q0464j2238
16083a85369k715o837K3639Q5840L121l7702L5073P9467P1382l2663Q104J2598
16071E3938J15182P2643j11414j03885j3736q9088q8506K920N4866K8153K7554
16060e1373J05622J6470l4108m8120m4175k2665M6199k7822M7588J9295L8074
16049D4985K8227m1158L8490m6907N6106l389k9868n1178J5016K5953k3940r5335
16037h2998p972P7513M3061N2304K8858n3430j14805L3757l7195j6606Q5491P0042
16025G8020N5361r375q9107J1812k5319n9779o1662k5092l5405l9711j8244M029
16013b14472J16171M2155K6889m324j4994O321j7915n12J7456L2493J2601N4640
$$ plain form
16001 56509 27795 -57312 -28366 -28715 -70 88062 59231 6265 5630 -52042 -42839 -33701 -136180
15988 -136180 -106454 19039 27861 15806 20191 55184 47876 40226 -13750 -12751 -21391 72362 47444
15975 47444 67056 149420 124151 28542 -19849 2153 79560 112751 129819 -1306 -89110
15964 -89110 -87367 -70281 -2062 77906 11434 14576 -4851 -28283 -22599 52914 83614 9109
15952 9109 -43781 -48910 16239 20378 -16200 -87070 -57690 -35917 -18551 -54720 -21324 -25096
15940 -25096 -55068 -92776 -69088 -26363 20245 88048 43784 3166 10493 97337 139864 96246
15928 96246 72589 -42919 -98896 -36789 -77494 -52216 -69144 -142028 -175083 -192806 -158129
15917 -158129 -72599 -84245 -85984 -45761 -40296 -56657 -124790 -49237 4320 -7125 3322 69980
$$ packed form
16001E6509k8714q5107K8946l49K8645Q8132k8831n2966o35n7672R203R138j02479
15988a36180K9726J25493Q822j2055M385L4993p308p650n3976R99q640R3753k4918
15975D7444J9612Q2364k5269r5609m8391K2002P7407L3191J7068j31125q7804
15964h9110J743J7086O8219P9968o6472L142j9427k3432N684P5513L0700p4505
15952I109n2890n129O5149M139l6578p0870K9380K1773J7366l6169L3396l772
15940b5096k9972l7708K3688M2725M6608O7803m4264m0618P327Q6844M2527m3618
15928I6246k3657j15508n5977O2107m0705K5278j6928p2884l3055j7723L4677
15917a58129Q5530j1646j739M0223N465j6361o8133P5553N3557j1445J0447O6658
$$ plain form
15905 69980 89374 45412 19168 41370 85088 65527 51817 29540 -24475 -42452 -111130 -69243
15893 -69243 5962 50133 44298 71482 130883 147938 98399 14026 -12025 -13935 -128437 -69961
15881 -69961 71897 93366 -33103 -146439 -102240 58524 93208 67192 71891 73848 54269
15870 54269 37093 -32513 -83284 -45312 -41219 -81832 -70968 -14956 54832 65385 63250 56426
15858 56426 67810 7629 -17264 -13923 -88774 -108851 -41204 3881 13866 -6640 32152 101265
15846 101265 98475 114301 52013 33029 -1096 -87053 -206138 -291596 -215085 -198914 -132158
15835 -132158 -61262 -41557 24663 75071 -14510 -45140 -9461 -30031 -89665 -94788 -76792 -77769
15823 -77769 -70818 -19391 2654 -18522 -45202 -16959 23511 44671 57869 61864 49802 72642
$$ packed form
15905F9980J9394m3962k6244K2202M3718j9561j3710k2277n4015j7977o8678M1887
15893f9243P5205M4171n835K7184N9401J7055m9539q4373k6051j910j14502N8476
15881f9961J41858K1469j26469j13336M4199J60764L4684k6016M699J957j9579
15870E4269j7176o9606n0771L7972M093m0613J0864N6012O9788J0553k135o824
15858E6426J1384o0181k4893L341p4851k0077O7647M5085R985k0506L8792O9113
15846A01265k790J5826o2288j8984l4125q5957j19085q5458P6511J6171O6756
15835a32158P0896J9705O6220N0408q9581l0630L5679k0570n9634n123J7996r77
15823g7769O951N1427K2045k1176k6680K8243M0470K1160J3198L995j2062K2840
$$ plain form
15811 72642 159036 147452 84325 47320 60563 4760 -116910 -93320 -17754 -18745 18244 107151
15799 107151 57504 -23417 -23954 -25817 7128 124016 151318 65459 -3129 -28598 5824 68987
15787 68987 103254 82996 55327 50394 19905 47082 45652 -26294 -96751 -27728 13333 -70229
15775 -70229 -17154 -12732 31031 34912 32588 74093 103039 7285 -14959 -18035 -81893 -112402
15763 -112402 -41475 1296 -16469 -66116 -91452 -57492 -14568 -89359 -60948 24744 102602
15752 102602 101312 89161 101828 117256 158377 180327 174534 185205 114049 56856 25359 23113
15740 23113 11304 1705 -17644 -15822 -25883 38791 3533 -97055 -6855 85926 153129 80290
15728 80290 67918 42096 -6136 20751 -9255 31166 96730 127317 130596 -18102 -51197 -47566
$$ packed form
15811G2642Q6394j1584o3127l7005J3243n5803j21670K3590P5566r91L6989Q8907
15799A07151m9647q0921n37j863L2945J16888K7302q5859o8588k5469L4422O3163
15787F8987L4267k0258k7669m933l0489K7177j430p1946p0457O9023M1061q3562
15775g0229N3075M422M3763L881k324M1505K8946r5754k2244l076o3858l0509
15763a12402P0927M2771j7765m9647k5336L3960M2924p4791K8411Q5692P7858
15752A02602j290j2151J2667J5428M1121K1950n793J0671p1156n7193l1497k246
15740B3113j1809r599j9349J822j0061O4674l5258j00588R0200R2781O7203p2839
15728H0290j2372k5822m8232K6887l0006M0421O5564L0587L279j48698l3095L631
$$ plain form
15716 -47566 -51301 -18807 20461 49618 -10637 17880 36524 41525 80298 19020 -67856 -93665
15704 -93665 -59818 -43203 -21916 20749 80668 61229 10979 -25332 16024 54373 80447 32897
15692 32897 48950 48860 25180 -4643 -19596 53807 49209 8965 30372 9272 -6789 -43120
15680 -43120 -61543 -51199 -42286 -37766 -70003 42880 108666 106593 118754 103610 136460 134264
15668 134264 121764 36243 36675 34218 -9372 8683 39943 -20388 -67384 -51649 -25709 -119344
15656 -119344 -104903 42540 35807 45435 -53660 -47106 33417 43848 -4255 -8023 25918 -45758
15644 -45758 -2324 41942 33368 69621 22862 5149 60261 44619 -28698 -83328 -54926 -9213
15632 -9213 76151 130172 61721 59957 125820 139011 77788 61891 146662 194916 150089 134238
$$ packed form
15716d7566l735L2494L9268K9157o0255K8517J8644N001L8773o1278q6876k5809
15704i3665L3847J6615K1287M2665N9919j9439n0250l6311M1356L8349K6074m7550
15692C2897J6053r0k3680k9823j4953P3403m598m0244K1407k1100j6061l6331
15680d3120j8423J0344Q913M520l2237J12883O5786k073J2161j5144L2850k196
15668A34264j2500q5521M32k457m3590J8055L1260o0331m6996J5735K5940r3635
15656a19344J4441J47443o733R628r9095O554Q0523J0431m8103l768L3941p1676
15644d5758M3434M4266q574L6253m6759j7713N5112j5642p3317n4630K8402M5713
15632i213Q5364N4021o8451j764O5863J3191o1223j5897Q4771M8254m4827j5851
$$ plain form
15620 134238 55249 75406 70575 50577 96318 74001 66413 144617 178333 157993 71309 19125
15608 19125 10862 40099 64223 104950 53861 -41545 11794 18713 44526 32706 49267 125072
15596 125072 115261 122761 131466 105158 92160 -7333 -21836 -30154 60493 42475 -18616 -5288
15584 -5288 4925 -30414 -54981 -16631 -83347 -55710 54888 28579 56137 46808 24817 -28104
15572 -28104 -41573 15192 66108 69969 -134 -7179 40776 33889 -9098 -67909 -18689 36073
15560 36073 93207 136348 200239 218911 196022 279780 319784 295334 271395 350937 470638
15549 470638 538958 666887 872096 1157738 1356112 1377924 1515186 1559187 1477510 1321007
15539 1321007 1119070 968009 823969 721885 610753 562337 516171 404146 286633 201784
$$ packed form
15620A34238p8989K0157m831j9998M5741k2317p588P8204L3716k0340q6684n2184
15608A9125q263K9237K4124M0727n1089r5406N3339O919K5813j1820J6561P5805
15596A25072r811P500Q705k6308j2998r9493j4503q318R0647j8018o1091J3328
15584e288J0213l5339k4567L8350o6716K7637J10598k6309K7558r329k1991n2921
15572b8104j3469N6765N0916L861p0103p045M7955o887m2987n8811M9220N4762
15560C6073N7134M3141O3891J8672k2889Q3758M0004k4450k3939P9542J19701
15549D70638O8320J27929K05209K85642J98374K1812J37262M4001q1677j56503
15539A321007k01937j51061j44040j02084j11132m8416m6166j12025j17513q4849
$$ plain form
15529 201784 172836 190778 202214 232818 175630 164411 121320 48821 21997 64863 151945
15518 151945 255440 222104 194377 256535 260603 272304 256386 202648 66788 43517 11973
15507 11973 -11305 -19135 33559 66728 28220 36337 -1614 -9942 30754 -35084 -34658 -38443 12616
15494 12616 492 2945 35889 25772 14140 44961 58887 93707 104953 74659 67696 97741
15482 97741 124300 87485 21162 -51622 -92455 -36323 1788 15748 56278 78768 24077 109416
15470 109416 242628 199883 136028 112481 120178 133706 97406 147034 158902 133156 103589
15459 103589 43190 -5629 -32708 15154 80626 179415 183402 186771 207155 158246 190795 203726
15447 203726 183108 146536 162659 103891 21200 -22734 22700 86807 71471 -10690 22020
$$ packed form
15529B01784k8948J7942J1436L0604n7188j1219m3091p2499k6824M2866Q7082
15518A51945J03495l3336k7727O2158M068J1701j5918n3738j35860k3271l1544
15507A1973k3278p830N2694L3169l8508Q117l7951q328M0696o5838M26l785N1059
15494A2616j2124K453L2944j0117j1632L0821J3926L4820J1246l0294o963L0045
15482I7741K6559l6815o6323p2784m0833N6132L8111J3960M0530K2490n4691Q5339
15470A09416J33212m2745o3855k3547P697J3528l6300M9628J1868k5746k9567
15459A03589o0399m8819k7079M7862O5472R8789L987L369K0384m8909L2549J2931
15447B03726k0618l6572J6123n8768q2691m3934M5434O4107j5336q2161L2710
$$ plain form
15436 22020 53803 76523 78582 106804 123263 48817 16933 94642 118936 193430 171005 81019
15424 81019 122897 152863 128897 111243 125647 88545 103312 17938 -50091 -57118 -75438 -181955
15412 -181955 -159380 -56140 32996 106482 134148 93397 142023 147937 111424 -28169 -86111
15401 -86111 -69342 -19354 49503 138040 95197 93482 108947 27168 -58922 -121218 -103269 -36270
15389 -36270 14291 51963 136588 205558 126375 49164 -3138 3464 -22326 10193 38191 90312
15377 90312 44640 -8807 -33550 16813 22313 -7585 23470 78962 95326 113428 85932 37057
15365 37057 18429 -25342 -32590 72363 149903 17953 26988 17729 23094 101736 88622 111839
15353 111839 134031 123348 76590 46334 53499 75034 99431 64915 79070 132599 207811 139269
$$ packed form
15436B2020L1783K2720K059K8222J6459p4446l1884P7709K4294P4494k2425q9986
15424H1019M1878K9966k3966j7654J4404l7102J4767q5374o8029p027j8320j06517
15412a81955K2575J03240Q9136P3486K7666m0751M8626N914l6513j39593n7942
15401h6111J6769M9988O8857Q8537m2843j715J5465q1779q6090o2296J7949O6999
15389c6270N0561L7672Q4625O8970p9183p7211n2302O602k5790L2519K7998N2121
15377I0312m5672n3447k4743N0363N500k9898L1055N5492J6364J8102k7496m8875
15365C7057j8628m3771p248J04953P7540j31950R035r259N365P8642j3114K3217
15353A11839K2192j0683m6758l0256P165K1535K4397l4516J4155N3529P5212o8542
$$ plain form
15341 139269 4284 -80486 -70518 36045 68872 56374 53642 102825 86217 34267 -35008
15330 -35008 -14656 5682 71308 175147 227605 189809 152538 89866 100266 51997 -40242
15319 -40242 -47112 -53429 -26697 -131728 -178429 -199016 -160927 -164218 -162108 -151975 -122092 -120743
15307 -120743 -40761 -23207 -77633 -56500 -51487 -57859 26200 67610 70224 71961 99382 107392
15295 107392 -5738 -75060 23634 -7863 -100806 -63897 -42598 -87779 -105506 7844 3048
15284 3048 -39673 8365 126639 109336 164121 199906 157913 85297 53528 44837 3512 -30083
15272 -30083 25770 98685 145046 145511 41019 23757 70435 46815 -479 41609 124724 184075
15260 184075 133300 158251 234237 228105 197356 158645 82539 102423 182815 163370 144397 169656
$$ packed form
15341A39269j34985q4770R968J06563L2827j2498k732M9183j6608n1950o9275
15330c5008K0352K0338O5626J03839N2458l7796l7271o2672J0400m8269r2239
15319d0242o870o317K6732j05031m6701k0587L8089l291K110J0133K9883J349
15307a20743P9982J7554n4426K1133N013o372Q4059M1410K614J737K7421Q010
15295A07392j13130o9322R8694l1497r2943L6909K1299m5181j7727J13350m796
15284C048m2721M8038J18274j7303N4785L5785m1993p2616l1769q691m1325l3595
15272c0083N5853P2915M6361M65j04492j7262M6678k3620m7294M2088Q3115N9351
15260A84075n0775K4951P5986o132l0749l8711p6106J9884Q0392j9445j8973K5259
$$ plain form
15248 169656 185862 159118 121819 105144 172389 131903 118310 110247 120474 114673 150735 94067
15236 94067 2821 -6981 -53935 -36502 68794 99781 39643 64796 103062 123382 119662 174688
15224 174688 169539 131422 176296 130110 95193 80260 127203 228099 265199 220701 138151
15213 138151 60342 -14854 -51805 -26568 -52 32917 40403 106142 127451 51098 -35117 -27049
15201 -27049 44886 68442 116247 41692 34714 74243 123863 127170 109753 121411 132700 109755
15189 109755 126719 193668 152926 143509 98828 61574 50472 97420 87309 94810 101368 147854
15177 147854 226084 239575 274198 326389 270113 245116 264697 215281 276228 281422 214174 199975
15165 199975 208379 167294 157940 166369 182419 185785 160940 190989 287813 330093 246138 155687
$$ packed form
15248A69656J6206k6744l7299j6675O7245m0486j3593q063J0227n801L6062n6668
15236I4067r1246r802m6954J7433J05296L0987o0138K5153L8266K0320l720N5026
15224A74688n149l8117M4874m6186l4917j4933M6943J00896L7100m4498q2550
15213A38151p7809p5196l6951K5237K6516L2969P486O5739K1309p6353q6215Q068
15201b7049P1935K3556M7805p4555o978L9529M9620L307j7417J1658J1289k2945
15189A09755J6964O6949m0742r417m4681l7254j1102M6948j0111P501O558M6486
15177A47854P8230J3491L4623N2191n6276k4997J9581m9416O0947N194o7248j4199
15165A99975Q404m1085r354Q429J6050L366k4845L0049R6824M2280q3955r0451
$$ plain form
15153 155687 260295 419740 382863 310903 328097 337103 344147 354427 370388 340307 331733 228689
15141 228689 202938 332848 383749 297210 195948 143628 192272 269512 332955 257607 163973
15130 163973 193180 280740 344618 453870 456421 371337 290259 204953 216670 344962 486086
15119 486086 545741 559198 539105 499203 627198 612018 599006 578590 591591 596330 607349
15108 607349 652928 607445 550868 463029 531277 582583 542233 490256 535183 545405 468953
15097 468953 413177 417054 455346 477933 461053 444940 466535 533864 556033 591729 635171 629774
15085 629774 632562 631616 643814 646591 671199 717323 678858 719272 815027 796218 741236 759373
15073 759373 803476 875622 990203 978696 1030283 1133601 1129866 1084043 1105903 1211810 1363625
$$ packed form
15153A55687J04608J59445l6877p1960J7194R006P044J0280J5961l0081q574j03044
15141B28689k5751J29910N0901q6539j01262n2320M8644P7240O3443p5348r3634
15130A63973K9207Q7560O3878J09252K551q5084q1078q5306J1717J28292J41124
15119D86086N9655J3457k0093l9902J27995j5180j3012k0416J3001M739J1019
15108F07349M5579m5483n6577q7839O8248N1306m0350n1977M4927J0222p6452
15097D68953n5776L877L8292K2587j6880j6113K1595O7329K2169L5696M3442n397
15085F29774K788r46J2198K777K4608M6124l8465M0414R5755j8809n4982J8137
15073G59373M4103P2146J14581j1507N1587J03318l735m5823K1860J05907J51815
$$ plain form
15062 1363625 1452310 1520502 1571070 1624886 1686132 1673217 1743553 1862058 1970151 1991382 2017811
15051 2017811 2046992 2123935 2231030 2460278 2619058 2631534 2778150 3048348 3409611 3697699
15041 3697699 3978522 4294927 4609640 5021501 5465081 5963530 6528167 7265705 8130832
15032 8130832 9004207 9860161 10844241 11836024 12915786 14328796 16120471 18296462 20767641
15023 20767641 23705528 27248267 31902939 38045176 46561988 58865887 76688671 103189829
15015 103189829 142775749 199075443 266936058 325468399 352849444 348306281 320670833
15008 320670833 273718963 216026842 163104175 123058939 94993658 75344441 61435777
15001 61435777 51352474 43823136 38006657 33457364 29562101 26341297 23602353 21169639
$$ packed form
15062A363625Q8685O8192N0568N3816O1246j2915P0336J18505J08093K1231K6429
15051B017811K9181P6943J07095K29248J58780J2476J46616K70198L61263K88088
15041C697699K80823L16405L14713M11861M43580M98449N64637P37538Q65127
15032H130832Q73375Q55954R84080R91783J079762J413010J791675K175991K471179
15023B0767641K937887L542739M654672O142237Q516812J2303899J7822784K6501158
15015A03189829L9585920N6299694O7860615N8532341K7381045m543163k7635448
15008C20670833m6951870n7692121n2922667m0045236k8065281j9649217j3908664
15001F1435777j0083303p529338n816479m549293l895263l220804k738944k432714
$$ plain form
14993 21169639 19152563 17413518 15788747 14263741 12986772 11877794 10768920 9860825
14985 9860825 9158581 8475996 7832078 7272609 6763648 6385602 5976083 5646974 5359543
14976 5359543 5083311 4812826 4659783 4476849 4243525 4094083 3902600 3654999 3406719
14967 3406719 3181700 3097371 3012002 2866224 2745868 2647353 2574250 2475386 2303156 2138501
14957 2138501 2091435 2057753 1999982 2030500 2031238 1980735 1918884 1918184 1846665 1737808 1704476 1668737
14945 1668737 1592067 1600049 1463085 1347227 1282909 1198984 1148827 1172164 1137998 1118379 996042
14934 996042 995077 1017796 958622 952587 868745 814013 762236 798704 827727 771968 692546 714682
14922 714682 765461 812065 785054 687746 575149 483776 490251 518749 474560 392645 375851
$$ packed form
14993B1169639k017076j739045j624771j525006j276969j108978j108874r08095
14985I860825p02244o82585o43918n59469n08961l78046m09519l29109k87431
14976E359543k76232k70485j53043j82934k33324j49442j91483k47601k48280
14967C406719k25019q4329q5369j45778j20356r8515p3103r8864j72230j64655
14957B138501m7066l3682n7771L0518P38n0503o1851p00p1519j08857l3332l5739
14945A668737p6670P982j36964j15858o4318q3925n0157K3337l4166j9619j22337
14934I96042r65K2719n9174o035q3842n4732n1777L6468K9023n5759p9422K2136
14922G14682N0779M6604k7011r7308j12597r1373O475K8498m4189q1915j6794
$$ plain form
14911 375851 426907 444996 504181 516068 477839 444459 445442 420195 436309 380943 380297 412540
14899 412540 492581 534295 501299 453437 513084 558110 568306 541862 544303 586714 601854 599312
14887 599312 628428 734547 758552 738551 666092 694307 721882 791148 908521 1040878 1038017
14876 1038017 1011266 1083140 1160322 1102719 1176700 1278955 1264795 1192098 1183799 1119415 1023158
14865 1023158 916338 898002 844458 821185 603032 509683 530911 549756 533395 473803 382934
14854 382934 354543 432151 463721 513623 503236 424991 339412 334528 349828 371991 290083 186478
14842 186478 134300 162765 193275 156321 176593 202664 190452 184852 153055 158009 254802 287395
14830 287395 307060 243230 134882 92873 107108 87283 138029 254757 290351 238568 170788
$$ packed form
14911C75851N1056J8089N9185J1887l8229l3380R83k5247J6114n5366o46L2243
14899D12540Q0041M1714l2996m7862N9647M5026J0196k6444K441M2411J5140k542
14887E99312K9116J06119K4005k0001p2459K8215K7575O9266J17373J32357k861
14876A038017k6751P1874P7182n7603P3981J02255j4160p2697q299o4384r6257
14865A023158j06820j8336n3544k3273k18153r3349K1228J8845j6361n9592r0869
14854C82934k8391P7608L1570M9902j0387p8245q5579m884J5300K2163q1908j03605
14842A86478n2178K8465L0510l6954K0272K6071j2212n600l1797M954R6793L2593
14830B87395J9665o3830j08348m2009J4235j9825N0746J16728L5594n1783o7780
$$ plain form
14819 170788 138179 197874 251904 234192 139168 147470 194587 214456 272172 389529 507344
14808 507344 456282 420760 376510 292856 246583 243474 290199 323630 334408 320347 267403 169618
14796 169618 112578 124687 110597 92469 174760 176297 141660 225154 235148 145168 172286 180698
14784 180698 124973 168296 214173 134664 175205 134767 115791 137204 83780 146073 168623
14773 168623 150823 93548 63856 150094 264562 270862 185891 118398 159951 117450 -887
14762 -887 -23211 -70706 -51642 -62515 -5511 76734 144527 155376 149518 118558 129514 122118
14750 122118 85589 -31115 -88842 -71884 -42805 26164 100517 174299 202137 233507 245007
14739 245007 175896 186912 215274 141127 203077 273315 213505 198135 189312 158781 237889 255212
$$ packed form
14819A70788l2609N9695N4030j7712r5024Q302M7117J9869N7716J17357J17815
14808E07344n1062l5522m4250q3654m6273l109M6725L3431J0778j4061n2944r7785
14796A69618n7040J2109j4090j8128Q2291J537l4637Q3494R994q9980K7118Q412
14784A80698n5725M3323M5877p9509M0541m0438j8976K1413n3424O2293K2550
14773A68623j7800n7275k9692Q6238J14468O300q4971o7493M1553m2501j18337
14762h87k2324m7495J9064j0873N7004Q2245O7793J0849n858l0960J0956p396
14750A22118l6529j16704n7727J6958K9079O8969P4353P3782K7838L1370J1500
14739B45007o9111J1016K8362p4147O1950P0238n9810j5370q823l0531P9108J7323
$$ plain form
14727 255212 106986 73890 102025 70425 54948 139517 221013 360984 332144 180220 115379
14716 115379 148891 164381 168662 309998 275698 222326 239769 273397 211068 139838 182959
14705 182959 122787 85325 81858 72394 75685 78381 86878 73642 39354 10073 1079 -50011 -18279
14692 -18279 -70 23778 126160 120069 140004 56619 -32094 -742 32037 17353 71952 88641
14680 88641 127217 143929 92061 126068 90223 150225 134942 104563 132915 151127 91091 122012
14668 122012 83723 20804 8991 55071 18891 21199 -17786 17559 18347 -25058 -21907 113063
14656 113063 142796 47860 1555 43741 125077 153208 111109 113214 131497 78756 49325 69421
14644 69421 174002 239642 158232 22293 -951 21400 134727 149894 2706 -43991 -46596
$$ packed form
14727B55212j48226l3096K8135l1600j5477Q4569Q1496J39971k8840j51924o4841
14716A15379L3512J5490M281J41336l4300n3372J7443L3628o2329p1230M3121
14705A82959o0172l7462l467r464L291K696Q497j3236l4288k9281q994n1090L1732
14692a8279J8209K3848J02382o091J9935q3385q8713L1352L2779j4684N4599J6689
14680H8641L8576J6712n1868L4007l5845O0002j5283l0379K8352J8212o0036L0921
14668A22012l8289o2919j1813M6080l6180K308l8985L5345P88m3405L151J34970
14656A13063K9733r4936m6305M2186Q1336K8131m2099K105J8283n2741k9431K0096
14644F9421J04581O5640q1410j35939k3244K2351J13327J5167j47188m6697k605
$$ plain form
14633 -46596 18925 -18572 -27077 -62261 -86214 20966 15739 53634 91416 94042 80858 59287
14621 59287 57275 1887 34775 69995 56070 46276 57402 52104 47156 67141 75658 15652 32284
14608 32284 105236 63042 55847 145021 141789 145071 169765 205742 241518 234646 280157 196678
14596 196678 180154 124975 39573 -28786 -33127 -23557 -65555 16888 41863 115016 130244 104941
14584 104941 125778 165284 89603 57785 135880 181606 240517 280742 283267 275336 186455 165291
14572 165291 135475 154705 189894 207290 134306 46999 57270 52099 154037 218859 209934 217094
14560 217094 221141 191513 177110 223370 246073 162512 98997 109222 112525 226674 293134 230329
14548 230329 175617 167566 256724 379297 342933 219954 155605 251565 318251 297774 261935
$$ packed form
14633d6596O5521l7497q505l5184k3953J07180n227L7895L7782K626j3184k1571
14621E9287k012n5388L2888L5220j3925r794J1126n298m948J9985Q517o0006J6632
14608C2284P2952m2194p195Q9174l232L282K4694L5977L5776o872M5511q3479
14596A96678j6524n5179q5402o8359m341R570m1998Q2443K4975P3153J5228k5303
14584A04941K0837L9506p5681l1818P8095M5726N8911M0225K525p931q8881k1164
14572A65291k9816J9230L5189J7396p2984q7307J0271n171J01938O4822q925P160
14560B17094M047k9628j4403M6260K2703q3561o3515J0225L303J14149O6460o2805
14548B30329n4712q051Q9158J22573l6364j22979o4349R5960O6686k0477l5839
$$ plain form
14537 261935 225599 108966 38272 144520 154334 189052 247052 325225 343486 334400 254328
14526 254328 224169 271313 255037 211095 261489 229735 229222 285686 251622 280904 277987 289619
14514 289619 394229 477360 461011 326540 273104 336264 344590 365451 336793 365887 405505
14503 405505 343199 336057 399877 339731 416585 493043 548733 589798 658450 648465 675259 647491
14491 647491 625469 721201 779688 741609 724483 684916 750611 878691 930025 848177 846672
14480 846672 779000 771143 893146 1063055 1241644 1390187 1564365 1788078 1994937 2115467
14470 2115467 2217173 2307426 2268216 2083775 1924238 1817542 1682662 1523923 1483398 1385692
14460 1385692 1358973 1425893 1435073 1380271 1547495 1581461 1533762 1546332 1702982 1780130 1818457
$$ packed form
14537B61935l6336j16633p0694J06248R814L4718N8000P8173J8261r086q0072
14526B54328l0159M7144j6276m3942N0394l1754n13N6464l4064K9282k917J1632
14514B89619J04610Q3131j6349j34471n3436O3160Q326K0861k8658K9094L9618
14503D05505o2306p142O3820o0146P6854P6458N5690M1065O8652r985K6794k7768
14491F47491k2022R5732N8487l8079j7126l9567O5695J28080N1334q1848j505
14480H46672o7672p857J22003J69909J78589J48543J74178K23713K06859J20530
14470B115467J01706R0253l9210j84441j59537j06696j34880j58739m0525r7706
14460A385692k6719O6920R180n4802J67224L3966m7699J2570J56650P7148L8327
$$ plain form
14449 1818457 1895084 1962976 2068846 2169891 2275811 2400789 2499074 2678044 2772584 2944582
14439 2944582 3187039 3451736 3627306 3808877 4037234 4359330 4739840 5161832 5605914
14430 5605914 6140549 6755642 7545836 8372726 9286041 10350456 11666861 13295935 15263055
14421 15263055 17598916 20495736 24090003 28839118 35110823 43189610 53458270 65592611
14413 65592611 78711403 92581637 107774487 125157725 144219825 162315319 176455555
14406 176455555 186190630 192844907 197604682 200344625 199389394 193419845 183071784 169712485
14398 169712485 154239697 137715435 121429804 106149668 92088013 78899566 66548135
14391 66548135 55464851 46242690 39053455 33336015 28779864 25142296 22157496 19718993
$$ packed form
14449A818457P6627O7892J05870J01045J05920J24978R8285J78970R4540J71998
14439B944582K42457K64697J75570J81571K28357L22096L80510M21992M44082
14430E605914N34635O15093P90194Q26890R13315J064415J316405J629074J967120
14421A5263055K335861K896820L594267M749115O271705Q078787J0268660J2134341
14413F5592611J3118792J3870234J5192850J7383238J9062100J8095494J4140236
14406A76455555R735075O654277M759775K739943r55231n969549j0348061j3359299
14398A69712485j5472788j6524262j6285631j5280136j4061655j3188447j2351431
14391F6548135j1083284r222161p189235n717440m556151l637568k984800k438503
$$ plain form
14383 19718993 17564606 15678561 14109523 12833870 11716125 10689533 9838447 9076017
14375 9076017 8302712 7647111 7165626 6782851 6384397 5975119 5652826 5345766 5024012
14366 5024012 4754848 4489800 4305249 4116610 3885052 3659116 3539914 3404444 3303805
14357 3303805 3191406 3016335 2801530 2653618 2584415 2661282 2652021 2526035 2453649 2399391
14347 2399391 2234533 2110302 2021027 1902657 1782299 1769085 1847921 1802619 1662473 1612501
14337 1612501 1565667 1521600 1471079 1426217 1348730 1243382 1196352 1135740 1088982 1059355 1035006
14326 1035006 1075857 1182823 1112114 1041587 965990 910925 858657 792092 749158 764588 770034
14315 770034 716795 663394 620162 664281 678128 739824 751028 742450 767734 686189 552723
$$ packed form
14383A9718993k154387j886045j569038j275653j117745j026592q51086p62430
14375I076017p73305o55601m81485l82775l98454m09278l22293l07060l21754
14366E024012k69164k65048j84551j88639k31558k25936j19202j35470j00639
14357C303805j12399j75071k14805j47912o9203P6867r261j25986p2386n4258
14347B399391j64858j24231q9275j18370j20358j3214P8836m5302j40146m9972
14337A612501m6834m4067n0521m4862p7487j05348m7030o0612m6758k9627k4349
14326A035006M0851J06966p0709p0527p5597n5065n2268o6565m2934J5430N446
14315G70034n3239n3401m3232M4119J3847O1696J1204q578K5284q1545j33466
$$ plain form
14304 552723 567933 616775 632947 559001 492455 439549 439308 376583 355490 363942 354831 342721
14292 342721 396100 340516 358480 405846 372613 366517 380682 469667 456274 421718 420367 426016
14280 426016 411951 337631 288761 204843 217952 348571 477982 478127 402666 437227 389694
14269 389694 255691 209350 233565 272976 319465 361371 322026 225465 188356 183360 184969 132381
14257 132381 199048 202380 230838 262955 308399 302113 289356 324935 332494 271125 292401 291115
14245 291115 230725 188578 250492 271238 236771 140680 197618 233212 309364 220054 130527
14234 130527 137493 61943 57590 195834 229377 187613 167088 152970 192616 261746 278436 244299
14222 244299 254944 263359 208055 161489 115505 170322 136494 103413 104847 145554 190265 131107
$$ packed form
14304E52723J5210M8842J6172p3946o6546n2906k41o2725k1093Q452r111j2110
14292C42721N3379n5584J7964M7366l3233o096J4165Q8985j3393l4556j351N649
14280D26016j4065p4320m8870q3918J3109J30619J29411J45p5461L4561m7533
14269C89694j34003m6341K4215L9411M6489M1906l9345r6561l7109m996J609n2588
14257A32381O6667L332K8458L2117M5444o286j2757L5579P559o1369K1276j286
14245B91115o0390m2147O1914K0746l4467r6091N6938L5594P6152q9310q9527
14234A30527O966p5550m353J38244L3543m1764k0525j4118L9646O9130J6690l4137
14222B44299J0645Q415n5304m6566m5984N4817l3828l3081J434M0707M4711n9158
$$ plain form
14210 131107 116674 150536 174730 134047 154223 127599 67267 1917 -13178 30439 110948
14199 110948 95133 103289 139327 140327 149102 147183 146793 165477 173606 168573 145896 72518 -4798
14186 -4798 11106 109152 136285 156372 159757 76468 54217 96462 105720 121463 101154 48355
14174 48355 110553 114743 94868 122013 172206 227005 251820 203174 149729 150979 195329 156642
14162 156642 107271 177854 168738 110848 102214 96618 105222 68964 91599 125895 154003 195334
14150 195334 185168 47464 51538 78031 93516 119382 42918 15178 -17727 -45532 63302
14139 63302 31467 33957 110359 100293 43982 148945 201998 159549 156138 139958 88734 30829
14127 30829 12225 -9367 13129 72294 85256 90001 126001 117980 151777 187945 119529 71286
$$ packed form
14210A31107j4433L3862K4194m0683K0176k6624o0332o5350j5095M3617Q0509
14199A10948j5815Q156L6038J000Q775j919l90J8684Q129n033k2677p3378p7316
14186d798J5904R8046K7133K0087L385q3289k2251M2245R258J5743k0309n2799
14174D8355O2198M190j9875K7145N0193N4799K4815m8646n3445J250M4350l8687
14162A56642m9371P0583r116n7890q634n596Q604l6258K2635L4296K8108M1331
14150A95334j0166j37704M074K6493J5485K5866p6464k7740l2905k7805J08834
14139F3302l1835K490P6402j0066n6311J04963N3053m2449l411j6180n1224n7905
14127C0829j8604k1592K2496N9165J2962M745L6000q021L3797L6168o8416m8243
$$ plain form
14115 71286 52541 134416 213443 187511 132954 73763 111295 75895 201141 257165 238787
14104 238787 199107 204393 232499 181577 119229 119368 165595 110724 99762 105676 117854 147584
14092 147584 82486 30035 -8628 -45730 4289 22556 45296 157152 137124 50918 45256
14081 45256 31363 74144 134800 51913 67422 -2055 -42284 -29339 100945 137194 181928
14070 181928 87616 10870 -27604 45746 10559 -108769 -181365 -51081 45585 79317 77048
14059 77048 65389 49110 47674 103490 142494 102317 89213 39202 -21052 -25067 39474 8853
14047 8853 -50363 -73023 -80383 -94393 47162 84092 36312 54464 29418 -12577 35042 67892
14035 67892 78435 57126 58715 6347 -8951 -27332 -44184 -5498 27053 4712 -11771 -96990
$$ packed form
14115G1286j8745Q1875P9027k5932n4557n9191L7532l5400J25246N6024j8378
14104B38787l9680N286K8106n0922o2348J39M6227n4871j0962N914J2178K9730
14092A47584o5098n2451l8663l7102N0019J8267K2740J11856k0028q6206n662
14081D5256j3893M2781O0656q2887J5509o9477m0229J2945J30284L6249M4734
14070A81928r4312p6746l8474P3350l5187j19328p2596J30284R6666L3732k269
14059G7048j1659j6279j436N5816L9004m0177j3104n0011o0254m015O4541l0621
14047H853n9216k2660p360j4010J41555L6930m7780J8152k5046m1995M7619L2850
14035F7892J0543k1309J589n2368j5298j8381j6852L8686L2551k2341j6483q5219
$$ plain form
14023 -96990 -98004 -136953 -100576 -76049 -49569 -100128 -137072 -82410 -24180 20557 4309 27377
14011 27377 59706 122788 16964 -28097 -31236 -79002 -53103 -28784 24699 33237 86508 58285
13999 58285 -4640 -46260 -59665 -31562 -46544 -42688 -31125 36340 55936 39593 -7595 -33388
13987 -33388 -113797 -106212 -68402 -40388 42676 96331 108190 74518 33546 -38175 -73518 -82986
13975 -82986 -25094 -19522 -106264 -9937 107159 133798 17881 8417 6460 -134337 -160413 -103415
13963 -103415 -20568 97516 130487 59551 44015 51482 118785 82705 39490 43162 80772 65274
13951 65274 25876 -30635 -18247 62379 42991 91215 124215 176720 263650 292053 365054 446064
13939 446064 497165 563674 621175 629736 563887 679740 821839 842099 853489 834167 827506
$$ packed form
14023i6990j014l8949L6377K4527K6480n0559l6944N4662N8230M4737j6248K3068
14011B7377L2329O3082j05824m5061l139m7766K5899K4319N3483Q538N3271k8223
13999E8285o2925m1620j3405K8103j4982L856J1563O7465J9596j6343m7188k5793
13987c3388q0409P585L7810K8014Q3064N3655J1859l3672m0972p1721l5343r468
13975h2986N7892N572q6742R6327J17096K6639j15917r464j957j40797k6076N6998
13963a03415Q2847J18084L2971p0936j5536P467O7303l6080m3215L672L7610j5498
13951F5274l9398n6511J2388Q0626j9388M8224L3000N2505Q6930K8403P3001Q1010
13939D46064N1101O6509N7501Q561o5849J15853J42099K0260J1390j9322o661
$$ plain form
13928 827506 784697 809968 846770 823838 792053 685021 621698 557986 488116 502740 432832
13917 432832 269731 264930 228721 194783 197488 165876 72545 51308 65543 68020 72633 101963
13905 101963 126952 157217 134486 87371 -32250 -127827 -132492 -129600 -84002 -52330 -53599 -110606
13893 -110606 -103914 -44711 80540 63414 368 -21909 1107 34658 -53658 -151658 -68155
13882 -68155 -8204 51865 89440 76865 167174 235787 97161 -22596 -217 -9363 -97348
13871 -97348 -115311 -68955 -3326 63836 44932 20220 -7889 53155 89443 37841 36789 67061
13859 67061 96572 112103 80874 80692 33791 10502 -10410 -106784 -128110 -107422 -53614 -56861
13847 -56861 -96042 -61840 10655 -19701 -113871 -151512 -87687 -6458 -14531 -118356 -44074 -22294
$$ packed form
13928H27506m2809K5271L6802k2932l1785j07032o3323o3712o9870J4624o9908
13917D32832j63101m801l6209l3938K705l1612r3331k1237J4235K477M613K9330
13905A01963K4989L0265k2731m7115j19621r5577m665K892M5598L1672j269n7007
13893a10606O692N9203J25251j7126o3046k2277K3016L3551q8316r8000Q3503
13882f8155N9951O0069L7575j2575R0309O8613j38626j19757K2379r146q7985
13871i7348j7963M6356O5629O7162j8904k4712k8109O1044L6288n1602j052L0272
13859F7061K9511J5531l1229j82m6901k3289k0912r6374k1326K0688N3808l247
13847e6861l9181L4202P2495l0356r4170l7641O3825Q1229q073j03825P4282K1780
$$ plain form
13835 -22294 6542 49362 72469 37086 3861 56085 82789 110280 33285 -64325 -9557 44269
13823 44269 5598 18806 -10639 -71501 -176157 -215013 -181780 -214067 -179471 -146198 -119336
13812 -119336 -148769 -45769 -1664 33384 40959 72316 125284 61742 57216 171028 234111
13801 234111 127459 73803 131217 54477 -76794 -59893 20490 68798 35397 -22886 -88402
13790 -88402 -75100 -37345 -49608 35315 -9224 -79765 -80106 -105938 -74499 -82323 -108133 -160163
13778 -160163 -103395 -121424 -168678 -120761 -63799 -11750 -33841 -2048 -10394 -87772 -21383 36712
13766 36712 -20071 -10417 -25347 -56688 -7819 35669 22170 -14861 49061 -2740 -96360 -80946
13754 -80946 55185 64086 83218 39092 -25043 -46299 -117529 -103201 -59198 -66387 -2145 -11457
$$ packed form
13835b2294K8836M2820K3107l5383l3225N2224K6704K7491p6995r7610N4768N3826
13823D4269l8671J3208k9445o0862j04656l8856L3233l2287L4596L3273K6862
13812a19336k9433J03000M4105L5048P575L1357N2968o3542m526J13812O3083
13801B34111j06652n3656N7414p6740j31271J6901Q0383M8308l3401n8283o5516
13790h8402J3302L7755j2263Q4923m4539p0541l41k5832L1439p824k5810n2030
13778a60163N6768j8029m7254M7917N6962N2049k2091L1793q346p7378O6389N8095
13766C6712n6783R654j4930l1341M8869M3488j3499l7031O3922n1801r3620J5414
13754h0946J36131Q901J9132m4126o4135k1256p1230J4328M4003p189O4242r312
$$ plain form
13742 -11457 -66086 -46924 -47342 -12642 5796 44987 120338 82755 37844 72553 93280 110696
13730 110696 73931 124149 123415 90019 13915 -35783 -66640 -67544 -29265 34192 11572 -25063
13718 -25063 22425 119301 148137 81927 15815 9874 -29747 -108013 -109519 2877 37635 -45951
13706 -45951 -52904 88838 110539 56821 50132 68613 38269 7127 -39419 -52657 -45132 -43252
13694 -43252 -55933 -25627 -66720 -66324 -58822 -426 40250 58095 100733 97494 111125 111997 120907
13681 120907 116518 133403 123085 90111 88517 66668 83426 136860 158842 128251 -1101 -44832
13669 -44832 -22209 -8545 47572 47395 43914 90336 183091 172191 48360 25456 21630 -44693
13657 -44693 -51727 -43967 33752 13691 -15009 -34308 -49551 -55303 -15393 64041 19814 26306
$$ packed form
13742a1457n4629J9162m18L4700J8438L9191P5351l7583m4911L4709K0727J7416
13730A10696l6765N0218p34l3396p6104m9698l0857r04L8279O3457k2620l6635
13718b5063M7488R6876K8836o6210o6112n941l9621p8266j506J12396L4758q3586
13706d5951o953J41742K1701n3718o689J8481l0344l1142m6546j3238P525J880
13694d3252j2681L0306m1093L96P502N8396M0676J7845M2638l239J3631Q72Q910
13681A20907m389J6885j0318l2974j594k1849J6758N3434K1982l0591j29352m3731
13669d4832K2623J3664N6117j77l481M6422R2755j0900j23831k2904l826o6323
13657d4693p034P760P7719k0061k8700j9299j5243n752L9910P9434m4227O492
$$ plain form
13645 26306 -4315 -31604 25648 -4411 -63684 -48562 -49791 -30043 -105124 -209592 -129828 -55741
13633 -55741 -71689 -101513 -22629 121854 212648 190032 126961 64956 -15334 -21731 -11933 59248
13621 59248 98999 110550 110672 121172 47710 -33711 -10450 -16802 -61857 -23404 67601 -45025
13609 -45025 -138534 -88854 -44860 5540 5354 7784 -42189 -17268 1242 27461 99493 90212
13597 90212 15355 41149 75051 52078 69698 61739 86260 -621 -54009 -100700 -96990 -78814
13585 -78814 -82724 -20640 8122 -34125 -12527 10133 -9370 -249 -3985 -15632 -69461 -111695
13573 -111695 -92532 -102450 -49137 -3711 -15965 16726 760 -13157 24135 7845 54888 47643
13561 47643 54340 125410 237276 259959 213775 197826 194106 232900 258520 249071 158863 103075
$$ packed form
13645B6306l0621k7289N7252l0059n9273J5122j229J9748p5081j04468P9764P4087
13633e5741j5948k9824P8884J44483R0794k2616o3071o2005q0290o397R798P1181
13621E9248L9751J1551J22J0500p3462q1421K3261o352m5055L8453R1005j12626
13609d5025r3509M9680M3994N0400j86K430m9973K4921J8510K6219P2032r281
13597I0212p4857K5794L3902k2973J7620p959K4521q6881n3388m6691L710J8176
13585g8814l910O2084K8762m2247K1598K2660j9503R121l736j1647n3829m2234
13573a11695J9163r918N3313M5426j2254L2691j5966j3917L7292j6290M7043p245
13561D7643O697P1070J11866K2683m6184j5949l720L8794K5620r449r0208n5788
$$ plain form
13549 103075 217078 236017 150260 138483 180244 178844 90687 166001 213634 214690 227046 186621
13537 186621 125590 69459 89173 71015 157145 201098 191684 221393 201664 127451 137006 181996
13525 181996 183319 177610 213090 203626 158493 117622 47413 -24811 -18649 23157 62047 81690
13513 81690 25291 27323 38846 80238 101152 107269 91339 68852 -42151 20646 97588 45278
13501 45278 52753 25554 8391 13383 -72334 -103282 23763 -39423 -3555 64667 105631 146185
13489 146185 134860 74396 112593 147093 102274 28666 -13220 23891 -3291 -11051 27610 18278
13477 18278 4433 33155 88353 21722 8758 24375 30703 -15304 -78954 -49437 9635 -43772
13465 -43772 -26253 -22267 -46024 -71345 -19653 -30455 -42262 -29794 -35783 13646 51301 55465
$$ packed form
13549A03075J14003J8939q5757j1777M1761j400q8157P5314M7633J056J2356m0425
13537A86621o1031n6131J9714j8158Q6130M3953r414K9709j9729p4213R555M4990
13525A81996J323n709L5480r464m5133m0871p0209p2224O162M1806L8890J9643
13513H1690n6399K032J1523M1392K0914O117j5930k2487j11003O2797P6942n2310
13501D5278P475k7199j7163M992q5717l0948J27045o3186L5868O8222M0964M0554
13489A46185j1325o0464L8197L4500m4819p3608m1886L7111k7182p760L8661r332
13477A8278j3845K8722N5198o6631j2964J5617O328m6007o3650K9517N9072n3407
13465d3772J7519L986k3757k5321N1692j0802j1807J2468n989M9429L7655M164
$$ plain form
13453 55465 -29846 17630 48108 20636 21653 113801 131393 56502 25808 65917 132579 116675
13441 116675 109637 108369 130869 119300 94648 6029 -51035 -73463 -57523 -50258 -14018 -40101
13429 -40101 -45244 13229 37514 19003 68190 31617 10218 -108692 -108307 -3479 7570 65534
13417 65534 86744 66915 56390 150482 181228 116746 80723 142152 134447 55852 82050 59330
13405 59330 45784 94435 113391 148418 153208 167262 98201 24358 15401 43707 37758 10844
13393 10844 31059 46451 -4085 -79099 -167269 -217705 -176561 -67959 10466 50797 9822
13382 9822 -72493 -24584 46193 75550 102275 62296 23148 -77354 -110557 -60454 4855 12306
13370 12306 15136 -10001 -109063 -79927 -66356 -573 -19558 -55198 -23497 28240 22197 -89651
$$ packed form
13453E5465q5311M7476L0478k7472J017R2148J7592p4891l0694M0109O6662j5904
13441A16675p038j268K2500j1569k4652q8619n7064k2428J5940P265L6240k6083
13429d0101n143N8473K4285j8511M9187l6573k1399j18910L85J04828J1049N7964
13417F5534K1210j9829j0525R4092L0746o4482l6023O1429p705p8595K6198k2720
13405E9330j3546M8651J8956L5027M790J4054o9061p3843q957K8306n949k6914
13393A0844K0215J5392n0536p5014q8170n0436M1144J08602P8425M0331m0975
13382I822q2315M7909P0777K9357K6725l9979l9148j00502l3203N0103O5309P451
13370A2306K830k5137r9062K9136J3571O5783j8985l5640L1701N1737o043j11848
$$ plain form
13358 -89651 -108294 1756 78617 25597 58957 326 -44272 -33621 14641 68881 19640
13347 19640 -95217 -90065 -34796 -20803 -60735 -94193 -98189 -75043 -137736 -133706 -109998 -107780
13335 -107780 -26961 -28492 6485 91352 194779 272639 229330 159496 192372 125754 14367
13324 14367 23326 116261 130564 164482 159788 144661 162675 90359 -40373 -109159 -160670 -79669
13312 -79669 -8742 4738 -22974 -44882 -8201 16174 71395 60431 125158 94693 4663 -528
13300 -528 -46532 -9560 36311 50289 37390 -9732 22162 33943 8745 -14832 -24790 -12404
13288 -12404 -8575 34761 47366 58139 145472 196981 105490 16973 20325 65076 57256 53722
13276 53722 -4158 -13393 -56620 22252 105258 163580 100131 36892 21706 56313 51855 -2561
$$ packed form
13358h9651j8643J10050P6861n3020L3360n8631m4598J0651M8262N4240m9241
13347A9640j14857N152N5269J3993l9932l3458l996K3146o2693M030K3708K218
13335a07780Q0819j531L4977Q4867J03427P7860m3309o9834L2876o6618j11387
13324A4367Q959R2935J4303L3918m694j5127J8014p2316j30732o8786n1511Q1001
13312g9669P0927J3480k7712k1908L6681K4375N5221j0964O4727l0465r0030n191
13300e28m6004L6972M5871J3978j2899m7122L1894J1781k5198k3577r958J2386
13288a2404L829M3336J2605J0773Q7333N1509r1491q8517L352M4751p820l534
13276E3722n7880r235m3227P8872Q3006N8322o3449o3239j5186L4607m458n4416
$$ plain form
13264 -2561 -67189 -67846 -65213 19186 22940 -17460 40353 84183 -11761 -91708 -105264 2586
13252 2586 57726 -21898 -29229 32699 35595 -9032 -18042 -16701 51930 65540 61702 129300 94620
13239 94620 94676 135211 121316 -34144 -119650 -80728 -3454 13423 85544 59971 55402 50453
13227 50453 1805 2565 36670 69389 100294 123969 86474 84676 51362 82970 150728 84668
13215 84668 52781 5762 49279 71866 6156 72010 119804 12676 -84939 -123629 -69332
13204 -69332 868 80060 124171 74750 116782 36323 -132583 -100056 -81729 -95385 -33313
13193 -33313 -6298 56899 43290 -62926 -110641 -94754 -38765 25643 -42102 -61537 -34244
13182 -34244 3591 2457 19164 63366 142095 39797 -35148 -10434 42633 11084 25103 -18146
$$ packed form
13264b561o4628o57K633Q4399L754m0400N7813M3830r5944p9947j3556J07850
13252B586N5140p9624p331O1928K896m4627r010J341O8631J3610l838O7598l4680
13239I4620N6M0535j3895j55460q5506L8922P7274J6877P2121k5573m569m949
13227E0453m8648P60L4105L2719L0905K3675l7495j798l3314L1608O7758o6060
13215H4668l1887m7019M3517K2587o5710O5854M7794j07128r7615l8690N4297
13204f9332P0200P9192M4111m9421M2032q0459j68906L2527J8327j3656O2072
13193c3313K7015O3197j3609j06216m7715J5887N5989O4408o7745j9435K7293
13182c4244L7835j134J6707M4202P8729j02298p4945K4714N3067l1549J4019m3249
$$ plain form
13170 -18146 -9678 55124 44719 -55410 -30336 -951 57731 37456 18187 88343 77827 111681
13158 111681 147757 184499 195568 104096 32286 71044 35453 -2904 61582 91249 51800
13147 51800 23637 50316 111981 90849 11717 13339 -12642 -25026 34435 83772 19360 -75793
13135 -75793 -13613 6804 14247 78694 98449 92905 58352 18780 3927 16471 55361 70284
13123 70284 53053 28514 31668 37900 -7972 -163394 -236980 -166070 -83423 -62549 20118 34419
13111 34419 -51206 -86082 -60355 -16311 -52031 2892 60720 84867 -25256 -36405 37072
13100 37072 181938 125938 125012 184486 180017 128666 128801 171383 169027 248 -123563 -53036
13088 -53036 -11393 49582 35824 -37432 -56690 -39548 -67096 -99996 -88023 -18665 -19663 -98489
$$ packed form
13170a8146Q468O4802j0405j00129K5074K9385N8682k0275j9269P0156j0516L3854
13158A11681L6076L6742J1069r1472p1810L8758l5591l8357O4486K9667l9449
13147E1800k8163K6679O1665k1132p9132J622k5981j2384N9461M9337o4412r5153
13135g5793O2180K0417P443O4447J9755n544l4553l9572j4853J2544L8890J4923
13123G0284j7231k4539L154O232m5872j55422p3586P0910Q2647K0874Q2667J4301
13111C4419q5625l4876K5727M4044l5720N4923N7828K4147j10123j1149P3477
13100C7072J44866n6000r26N9474m469n1351J35M2582k356j68779j23811P0527
13088e3036M1643O0975j3758p3256j9258J7142k7548l2900J1973O9358r98p8826
$$ plain form
13076 -98489 -116465 -153285 -93842 3981 13452 26400 1906 50221 44139 27004 34990 113234
13064 113234 58591 11410 89873 116404 78413 80905 111977 149331 63894 -3384 -28439 -39818
13052 -39818 -60090 -39557 -103443 -74335 -54519 -77402 -24610 26842 22388 -45288 -125733 -160906
13040 -160906 -148702 -144176 -140615 -83186 -21912 -21269 -23136 -13486 -81710 -27221 9387 -46075 282
13027 282 55332 -8489 -15369 -1018 -16312 9194 54145 82408 131244 67992 -33683 61960
13015 61960 153516 161151 26105 -114059 -67324 -8461 72970 50718 76745 43664 68726
13004 68726 123654 68001 -34227 8984 -13483 -25181 19426 80391 53971 76548 49267
12993 49267 42837 81818 67446 56106 86999 111381 109585 117450 34711 -25564 -46564 -59150
$$ packed form
13076i8489j7976l6820N9443R7823R471J2948k4494M8315o082j7135P986P8244
13064A13234n4643m7181P8463K6531l7991K492L1072L7354q5437o7278k5055j1379
13052c9818k0272K0533o3886K9108J9816k2883N2792N1452m454o7676q0445l5173
13040a60906J2204M526L561N7429O1274O43j867R650o8224N4489L6608n5462M6357
13027B82N5050o3821o880J4351j5294K5506M4951K8263M8836o3252j01675R5643
13015F1960R1556P635j35046j40164M6735N8863Q1431k2252K6027l3081K5062
13004F8726N4928n5653j02228M3211k2467j1698M4607O0965k6420K2577k7281
12993D9267o430L8981j4372j1340L0893K4382j796P865q2739o0275k1000j2586
$$ plain form
12981 -59150 -62935 -96359 -134177 -102287 -65075 1979 20869 -1243 252 9872 -48443 -12190
12969 -12190 56416 55890 86150 79493 76833 99154 55389 -18929 -74978 -4376 66239 117518
12957 117518 91771 -31389 -71276 -28817 20167 111475 143550 45125 -27277 35487 25134
12946 25134 30837 57960 7925 -7162 -100353 -95634 -31772 70655 106040 79574 80485 37270
12934 37270 -25824 -6060 -61469 -21389 24690 -34802 -45713 -36356 -143183 -149860 -76928 -11675
12922 -11675 38378 59351 51418 8947 69113 47130 -24308 -44416 -31998 -19769 -82164 -132569
12910 -132569 -155296 -99757 -52694 -22268 30094 68093 8212 6745 20176 19059 114956 146336
12898 146336 166038 214204 192529 182054 165065 125370 108105 72202 63604 58660 43759 96682
$$ packed form
12981e9150l785l3424l7818L1890L7212O7054J8890k2112J495R620n8315L6253
12969a2190O8606n26L0260o657k660K2321m3765p4318n6049P0602P0615N1279
12957A17518k5747j23160l9887M2459M8984R1308L2075r8425p2402O2764j0353
12946B5134N703K7123n0035j5087r3191M719O3862J02427L5385k6466R11m3215
12934C7270o3094J9764n5409M0080M6079n9492j0911R357j06827o677P2932O5253
12922a1675N0053K0973p933m2471O0166k1983p1438k0108J2418J2229o2395n0405
12910a32569k2727N5539M7063L0426N2362L7999n9881j467J3431j117R5897L1380
12898A46336J9702M8166k1675j0475j6989l9695j7265l5903q598m944j4901N2923
$$ plain form
12886 96682 167731 194988 264949 252555 125229 53298 22117 -17150 -113823 -160171 -148245
12875 -148245 -181840 -146691 -115978 -162503 -78277 -19217 -18312 -40516 49805 39370 -3546 109279
12863 109279 118743 102842 59474 68957 28228 -55755 -83933 -28992 24260 40286 -5031 -17749
12851 -17749 31230 23278 -20568 -9470 -1149 64710 117220 86630 70603 60121 114954 146620
12839 146620 128428 129502 28602 -43110 -28126 -25434 -44291 -24564 18054 45189 -51651 -93883
12827 -93883 -74156 -38713 -3619 42129 47444 76313 116307 97095 138528 146587 157030 151890
12815 151890 116958 143338 27631 -61603 -58926 -63193 -65356 30659 41381 -10737 -71558 -63213
12803 -63213 -63293 -46049 30126 -846 -31556 -60417 -51920 -65223 -67510 -37370 -53790 -107118 -175752
$$ packed form
12886I6682P1049K7257O9961j2394j27326p1931l1181l9267r6673m6348J1926
12875a48245l3595L5149L0713m6525Q4226N9060R05k2204R0321j0435m2916J12825
12863A09279R464j5901m3368R483m0729q3983k8178N4941N3252J6026m5317j2718
12851a7749M8979p952m3846J1098Q321O5859N2510l0590j6027j0482N4833L1666
12839A46620j8192J074j00900p1712J4984K692j8857J9727M2618K7135r6840m2232
12827i3883J9727L5443L5094M5748N315K8869L9994j9212M1433Q059J0443n140
12815A51890l4932K6380j15707q9234K677m267k163R6015J0722n2118o0821Q345
12803f3213q0J7244P6175l0972l0710k8861Q497j3303k287L0140j6420n3328o8634
$$ plain form
12790 -175752 -127656 -30881 6302 56749 -10444 59183 35005 -7464 45304 133865 144377
12779 144377 85588 94303 142092 159638 203692 123771 19884 -20099 -28791 -102604 -103525 -45129
12767 -45129 -5964 102066 75846 -22147 25356 -11414 -141464 -55264 -2583 35393 50419
12756 50419 23234 9558 23892 11985 -35483 -37882 -44207 -31541 -31814 -34255 2803 108945
12744 108945 105666 74658 72013 98404 32078 68996 124199 152964 98487 16293 -60711 -22202
12732 -22202 12120 40264 20079 30591 20857 55737 118459 83840 -1986 30324 62090 88901
12720 88901 39821 24506 106254 102386 -61731 -97391 -123260 -104449 -94049 -106497 14437
12709 14437 83553 46376 -23522 24395 44777 -81432 -78970 -106620 -80401 -81343 27003 39480
$$ packed form
12790a75752M8096R6775L7183N0447o7193O9627k4178m2469N2768Q8561J0512
12779A44377n8789Q715M7789J7546M4054p9921j03887l9983q692p3813r21N8396
12767d5129L9165J08030k6220r7993M7503l6770j30050Q6200N2681L7976J5026
12756E0419k7185j3676J4334j1907m7468k399o325J2666k73k441L7058J06142
12744A08945l279l1008k645K6391o6326L6918N5203K8765n4477q2194p7004L8509
12732b2202L4322K8144k0185J0512r734L4880O2722l4619q5826L2310L1766K6811
12720H8901m9080j5315Q1748l868j64117l5660k5869J8811J0400j2448J20934
12709A4437O9116l7177o9898M7917K0382j26209K462k7650K6219r42J08346J2477
$$ plain form
12697 39480 -37637 -46150 -73171 -68194 -21548 -10992 -49028 -107045 -99174 -52188 -42194 14204
12685 14204 -7865 -17045 -67206 -109702 -57629 -9688 47997 53014 56340 5004 -56414 -50596
12673 -50596 -73791 -27660 -17595 -53252 -39672 -9255 -18556 -62060 -64653 -5463 24857 -38693
12661 -38693 -63026 8235 19928 -107572 -140972 -34669 -17375 -85086 -49310 48412 -2831
12650 -2831 -18832 29491 98150 91911 -7387 66397 137499 211041 183877 110616 41621 -5333
12638 -5333 -22339 70577 100507 115758 105611 109398 72641 50293 -92420 -81029 -25078 20760
12626 20760 92352 34306 3345 81548 82627 53329 42444 93971 57938 50378 158078 147147
12614 147147 130854 80436 119283 174044 47897 -33438 -3158 4435 20835 9617 25564
$$ packed form
12697C9480p7117q513k7021M977M6646J0556l8036n8017P871M6986R994N6398
12685A4204k2069r180n0161m2496N2073M7941N7685N017L326n1336o1418N818
12673e0596k3195M6131J0065l5657J3580L0417r301m3504k593N9190L0320o3550
12661c8693k4333P1261J1693j27500l3400J06303J7294o7711L5776R7722n1243
12650b831j6001M8323O8659o239r9298P3784P1102P3542k7164p3261o8995m6954
12638e333j7006R2916K9930J5251j0147L787l6757k2348j42713J1391N5951M5838
12626B0760P1592n8046l0961P8203J079k9298j0885N1527l6033p560J07700j0931
12614A47147j6293n0418L8847N4761j26147q1335L0280P593J6400j1218J5947
$$ plain form
12603 25564 -10149 -29520 -26395 -82774 -35130 -32415 -76620 -102041 -85883 -3113 78550 154706
12591 154706 134976 65262 20760 -53149 -64365 27615 107278 89112 51567 50567 98662 110814
12579 110814 77750 106416 193139 253920 118767 48919 35056 37116 -30703 -80617 -77607 -2442
12567 -2442 104186 123737 108097 66937 -8255 -35620 -37110 -54220 -312 63656 65991 160557
12555 160557 242708 215583 174735 199999 213635 159803 178764 131655 53833 42103 63395
12544 63395 6629 -42337 44362 111937 111228 106684 63580 90905 171275 144231 131788 146803
12532 146803 199313 168301 52255 -40609 13281 31599 66292 96253 93299 68717 1841
12521 1841 58276 110978 156188 163356 164797 163245 128994 142044 175856 127539 38264 -20417
$$ packed form
12603B5564l5713j9371L125n6379M7644K715m4205k5421J6158Q2770Q1663P6156
12591A54706j9730o9714m4502p3909j1216R1980P9663j8166l7545j000M8095J2152
12579A10814l3064K8666Q6723O0781j35153o9848j3863K060o7819m9914L010P5165
12567b442J06628J9551j5640m1160p5192k7365j490j7110N3908O3968K335R4566
12555A60557Q2151k7125m0848K5264J3636n3832J8961m7109p7822j1730K1292
12544F3395n6766m8966Q6699O7575p09m544m3104K7325Q0370k7044j2443J5015
12532A46803N2510l1012j16046r2864N3890J8318L4693K9961k954k4582o6876
12521A841N6435N2702M5210P168J441j552l4251J3050L3812m8317q9275n8681
$$ plain form
12509 -20417 1648 -10182 56353 52248 -8612 -5211 -39193 -40706 -100084 -72194 -270 82824
12497 82824 77500 58965 85890 128087 127015 97242 61426 -72196 -112251 -96293 -52222 19602
12485 19602 78794 48992 54223 126838 174853 161592 195311 188330 136457 118753 98663 124987
12473 124987 80972 71835 60288 62423 46087 3471 10383 -8450 -51443 -90501 -45123 36196
12461 36196 88087 56726 31807 -12351 -28072 47827 74158 33048 85428 105773 119126 147103
12449 147103 45289 129706 151495 105602 -33103 -80606 -18311 107509 125004 185484 141086
12438 141086 42860 20607 -95445 -114751 -22350 19197 49599 63860 13284 40452 33275
12427 33275 31843 109983 122245 45948 -8028 -55052 -106010 -79508 33662 27414 53478 34422
$$ packed form
12509b0417K2065j1830O6535m105o0860L401l3982j513n9378K7890P1924Q3094
12497H2824n324j8535K6925M2197j072k9773l5816j33622m0055J5958M4071P1824
12485A9602N9192k9802N231P2615M8015j3261L3719o981n1873j7704k0090K6324
12473A24987m4015r137j1547K135j6336m2616O912j8833m2993l9058M5378Q1319
12461C6196N1891l1361k4919m4158j5721P5899K6331m1110N2380K0345J3353K7977
12449A47103j01814Q4417K1789m5893j38705m7503O2295J25820J7495O0480m4398
12438A41086r8226k2253j16052j9306R2401M1547L0402J4261n0576K7168p177
12427C3275j432P8140J2262p6297n3976m7024n0958K6502J13170o248K6064j9056
$$ plain form
12415 34422 20067 40305 114544 143331 107313 63376 30576 86474 111641 119714 82033 93839
12403 93839 121112 119159 131723 119596 59598 47066 64764 77098 84023 49745 134396 206078
12391 206078 121639 60251 60139 42569 75600 80845 112757 101789 109134 107232 127252 109874
12379 109874 70553 77397 86918 56793 73565 30026 41834 126206 147923 108513 169966 119373
12367 119373 49314 70932 85474 46916 44349 53038 88390 115218 108254 114695 19460 59440
12355 59440 56481 47344 66620 153360 144751 103319 29328 11515 50110 72536 100504 193060
12343 193060 118101 -79665 -96373 2993 48185 87167 60562 -4676 -19059 -54031 28693
12332 28693 150506 148600 142146 158167 212836 172807 196281 213798 175718 146358 73655 37246
$$ packed form
12415C4422j4355K0238P4239K8787l6018m3937l2800N5898K5167Q073l7681J1806
12403I3839K7273j953J2564j2127n9998j2532J7698J2334O925l4278Q4651P1682
12391B06078q4439o1388j12j7570L3031N245L1912j0968P345j902K0020j7378
12379A09874l9321O844R521l0125J6772m3539J1808Q4372K1717l9410O1453n0593
12367A19373p0059K1618J4542l8558k567Q689L5352K6828o964O441r5235L9980
12355E9440k959r137J9276Q6740q609m1432p3991j7813L8595K2426K7968R2556
12343A93060p4959j97766j6708R9366M5192L8982k6605o5238j4383l4972Q2724
12332B8693J21813j906o454J6021N4669m0029K3474J7517l8080k9360p2703l6409
$$ plain form
12320 37246 23303 -3404 47510 53966 84614 89679 78926 69400 87028 90478 64974 43110
12308 43110 87699 173462 196326 152749 136622 188951 215821 183406 16136 -96679 -88151
12297 -88151 -39244 -42753 9455 28437 4635 4432 -8768 -5171 17696 25546 101259 123966 60848
12284 60848 54455 45428 35964 3831 17084 85651 152525 126750 97285 102311 66565 -30127
12272 -30127 -26231 -63577 -107811 -26433 25022 28717 20724 16063 43132 -30662 -116141 -80448
12260 -80448 -23601 23382 42656 102065 138201 230746 266456 261043 274232 296198 248939 104455
12248 104455 25102 27849 93901 152035 156651 168760 122161 100509 87458 98480 145736 194561
12236 194561 159428 61270 70482 31896 76084 124926 75749 67720 147180 178658 109815 95914
$$ packed form
12320C7246j3943k6707N0914O456L0648N065j0753r526J7628L450k5504k1864
12308D3110M4589Q5763K2864m3577j6127N2329K6870l2415j67270j12815Q528
12297h8151M8907l509N2208J8982k3802k03j3200L597K2867P850P5713K2707o3118
12284F0848o393r027r464l2133J3253O8567O6874k5775k9465N026l5746r6692
12272c0127L896l7346m4234Q1378N1455L695p993m661K7069p3794q5479L5693
12260h0448N6847M6983J9274N9409L6136R2545L5710n413J3189K1966m7259j44484
12248A04455p9353K747O6052N8134M616J2109m6599k1652j3051J1022M7256M8825
12236A94561l5133r8158R212l8586M4188M8842m9177q029P9460L1478o8843j3901
$$ plain form
12224 95914 97017 107120 100567 38324 45100 122520 210659 168986 44802 16389 26179 76879
12212 76879 130027 174754 242404 234992 166865 151921 195430 206788 211540 179921 185733 92109
12200 92109 101731 188180 239399 300532 246628 236222 280687 223578 199176 94704 166191 158268
12188 158268 119977 67543 21397 87018 86627 173754 261091 204739 199669 249720 288732 183153
12176 183153 216429 152320 93393 83765 90243 117101 203995 230181 258050 215318 195267 154882
12164 154882 123221 126963 202310 326163 351337 226710 198631 229037 200045 194002 181118
12153 181118 248705 262036 289342 278064 212617 296725 401653 397547 395898 382200 315603 349191
12141 349191 248595 234855 222553 265779 264041 253624 285846 315130 350317 367948 430749
$$ packed form
12224I5914J103J0103o553o2243O776P7420Q8139m1673j24184k8413R790N0700
12212G6879N3148M4727O7650p412o8127j4944M3509J1358M752l1619N812r3624
12200I2109R622Q6449N1219O1133n3904j0406M4465n7109k4402j04472P1487p923
12188A58268l8291n2434m6146O5621l91Q7127Q7337n6352n070N0051L9012j05579
12176A83153L3276o4109n8927r628O478K6858Q6894K6186K7869m2732k0051m0385
12164A54882l1661L742P5347J23853K5174j24627k8079L0406k8992o043j2884
12153A81118O7587J3331K7306j1278o5447Q4108J04928m106j649j3698o6597L3588
12141C49191j00596j3740j2302M3226j738j0417L2222K9284L5187J7631O2801
$$ plain form
12130 430749 357014 262892 205668 167782 225189 318626 294119 280730 261228 261888 260826 241923
12118 241923 320913 406278 451072 457346 412604 470602 587262 578719 572289 577633 614582 643880
12106 643880 613592 536743 518135 567204 612685 525606 517050 512125 546592 578828 562518 649836
12094 649836 684306 655938 596515 657209 711265 696355 596669 528408 456117 584968 567835
12083 567835 544403 542611 496066 451277 482135 530563 599989 660181 662657 650580 677969 662216
12071 662216 618878 626896 589382 581409 613687 685794 741859 754385 725023 680867 773735 861455
12059 861455 936620 916026 997848 1053747 1047461 1025365 974497 957179 968355 962317 992951 1000253
12047 1000253 966040 919140 935577 999165 980726 1001306 1007924 1019754 1018937 1003318 1087093 1191314
$$ packed form
12130D30749p3735r4122n7224l7886N7407R3437k4507j3389j9502O60j062j8903
12118B41923P8990Q5365M4794O274m4742N7998J16660q543o430N344L6949K9298
12106F43880l0288p6849j8608M9069M5481q7079q556m925L4467L2236j6310Q7318
12094F49836L4470k8368n9423O0694N4056j4910r9686o8261p2291J28851j7133
12083E67835k3432j792m6545m4789L0858M8428O9426O0192K476j2077K7389j5753
12071F62216m3338Q018l7514p973L2278P2107N6065J2526k9362m4156R2868Q7720
12059H61455P5165k0594Q1822N5899o286k2096n0868j7318J1176o038L0634P302
12047A000253l4213m6900J6437O3588j8439K0580O618J1830q17j5619Q3775J04221
$$ plain form
12035 1191314 1210380 1181728 1081494 1050939 1020542 1151306 1188124 1185411 1150296 1183267 1212136
12024 1212136 1238558 1209256 1155691 1167715 1195894 1247819 1375980 1493968 1439465 1411776 1456413
12013 1456413 1491363 1448455 1394359 1413603 1541542 1612437 1592724 1678993 1834389 1931687 1977041
12002 1977041 1994962 1991710 1970322 2009616 2014692 2056642 2225014 2314919 2394782 2443801 2467763
11991 2467763 2547799 2528354 2544633 2637438 2672690 2709999 2771446 2867137 2932673 3031420 3195084
11980 3195084 3199985 3187819 3334389 3454880 3522353 3609119 3717062 3853568 4049759 4277541
11970 4277541 4478053 4702349 4902823 4995438 5085164 5270451 5574385 5874683 6068277 6280515
11960 6280515 6623179 6989645 7312739 7569761 7850872 8193074 8641487 9088197 9506374
$$ packed form
12035A191314J9066k8652j00234l0555l0397J30764L6818k713l5115L2971K8869
12024A212136K6422k9302n3565J2024K8179N1925J28161J17988n4503k7689M4637
12013A456413L4950m2908n4096J9244J27939P0895j9713Q6269J55396R7298M5354
12002A977041J7921l252k1388L9294N076M1950J68372Q9905P9863M9019K3962
11991B467763Q0036j9445J6279R2805L5252L7309O1447R5691O5536R8747J63664
11980C195084M901j2166J46570J20491O7473Q6766J07943J36506J96191K27782
11970D277541K00512K24296K00474R2615Q9726J85287L03934L00298J93594K12238
11960F280515L42664L66466L23094K57022K81111L42202M48413M46710M18177
$$ plain form
11951 9506374 9985243 10430405 10961181 11488265 12092049 12755900 13361679 14050069 14871692
11942 14871692 15711804 16559749 17528024 18547679 19538692 20677582 21862667 23154360 24531303
11933 24531303 25960910 27425690 28924278 30443523 31964156 33425763 34900326 36342647
11925 36342647 37636082 38837460 39923210 40776416 41314668 41796069 42072252 41991745 41641334
11916 41641334 41105702 40406102 39467909 38303376 37070817 35836775 34385686 32899668
11908 32899668 31463082 30039524 28697983 27384846 25992003 24655721 23388105 22130392
11900 22130392 21063089 20019258 18927679 17966287 17092467 16256581 15339555 14560761 13964432
11891 13964432 13444552 12871360 12204978 11589695 11045188 10590401 10106747 9667171 9277075
$$ packed form
11951I506374M78869M45162N30776N27084O03784O63851O05779O88390Q21623
11942A4871692Q40112Q47945R68275J019655R91013J138890J185085J291693J376943
11933B4531303J429607J464780J498588J519245J520633J461607J474563J442321
11925C6342647J293435J201378J085750Q53206N38252M81401K76183q0507l50411
11916D1641334n35632o99600r38193j164533j232559j234042j451089j486018
11908C2899668j436586j423558j341541j313137j392843j336282j267616j257713
11900B2130392j067303j043831j091579r61392q73820q35886r17026p78794n96329
11891A3964432n19880n73192o66382o15283n44507m54787m83654m39576l90096
$$ plain form
11882 9277075 8960942 8679587 8297053 7909323 7576130 7345120 7054067 6760625 6507974
11873 6507974 6350541 6087973 5810341 5603029 5452065 5281343 5059460 4928685 4747959
11864 4747959 4621174 4498686 4328367 4220750 4087198 3970815 3873856 3736934 3675123 3594782
11854 3594782 3446478 3372519 3284909 3106830 3007777 2888231 2845307 2796628 2694060 2639410
11844 2639410 2509493 2458578 2428747 2380379 2372591 2327763 2308018 2200107 2155572 2066221 1986175
11833 1986175 1966351 1886318 1896843 1893800 1809681 1827365 1738928 1690581 1707713 1670703 1619723
11822 1619723 1612788 1622963 1619402 1581572 1511159 1410864 1286011 1307017 1264662 1236080 1219104
11811 1219104 1121049 1096583 1096129 1218983 1204231 1114521 1091325 1047705 1064203 1094502 1091568 1062267
$$ packed form
11882I277075l16133k81355l82534l87730l33193k31010k91053k93442k52651
11873F507974j57433k62568k77632k07312j50964j70722k21883j30775j80726
11864D747959j26785j22488j70319j07617j33552j16383r6959j36922o1811q0341
11854C594782j48304p3959q7610j78079r9053j19546m2924m8679j02568n4650
11844B639410j29917n0915k9831m8368p788m4828j9745j07911m4535q9351q0046
11833A986175j9824q0033J0525l043q4119J7684q8437m8347J7132l7010n0980
11822A619723o935J0175l561l7830p0413j00295j24853K1006m2355k8582j6976
11811A219104r8055k4466m54J22854j4752q9710k3196m3620J6498L0299k934k9301
$$ plain form
11799 1062267 1056021 1091130 1052911 1057775 1049692 1052892 1034590 1002732 973335 910412 809320 776391
11787 776391 774862 787438 819299 836457 752113 715413 716692 754024 805853 786728 753142 719419
11775 719419 646925 638019 669428 628002 640516 688985 671510 603995 523509 459312 519434 510395
11763 510395 564694 603005 643874 657372 619975 613601 603909 568478 487589 502495 492560 540270
11751 540270 652510 633396 576695 544598 398454 355049 401690 445384 412510 392589 459909
11740 459909 444563 450607 510096 416486 361771 315285 229832 191888 262221 332352 313866 335216
11728 335216 351691 358743 333332 344409 341316 303566 198395 208294 236319 290747 310896 366464
11716 366464 285969 257680 240284 232323 310965 270488 288973 315070 309320 297596 315318 333388
$$ packed form
11799A062267o246L5109l8219M864q083L200j8302l1858k9397o2923j01092l2929
11787G76391j529J2576L1861J7158q4344l6700J279L7332N1829j9125l3586l3723
11775G19419p2494q906L1409m1426J2514M8469j7475o7515q0486o4197O0122r039
11763E10395N4299L8311M0869J3498l7397o374r692l5431q0889J4906r935M7710
11751E40270J12240j9114n6701l2097j46144m3405M6641M3694l2874j9921O7320
11740D59909j5346O044N9489r3610n4715m6486q5453l7944P0333P0131j8486K1350
11728C35216J6475P052k5411J1077l093l7750j05171R899K8025N4428K0149N5568
11716C66464q0495k8289j7396p961P8642m0477J8485K6097n750j1724J7722J8070
$$ plain form
11704 333388 323522 285231 211957 185842 222678 186898 262827 346750 375400 410265 347248 295112
11692 295112 242670 263071 356158 363823 308903 233703 117556 211519 249418 212557 200164
11681 200164 132577 186402 200294 214941 220890 274582 292280 231228 202721 181266 228143 193512
11669 193512 115092 168232 218208 234397 210207 173272 180615 175980 159335 157880 144691 213026
11657 213026 228243 244769 197857 197759 222030 229874 102691 82426 111861 159545 206542 299716
11645 299716 280431 245779 223682 179095 221771 276016 205515 193671 234211 298184 295095 320537
11633 320537 270342 165274 217283 306547 326416 266587 274343 300236 288522 289427 261874 216875
11621 216875 164449 218183 257177 353653 299999 275080 292402 275676 218923 149955 271159
$$ packed form
11704C33388r866l8291p3274k6115L6836l5780P5929Q3923K8650L4865o3017n2136
11692B95112n2442K0401R3087P665n4920p5200j16147R3963L7899l6861j2393
11681B00164o7587N3825J3892J4647N949N3692J7698o1052k8507k1455M6877l4631
11669A93512p8420N3140M9976J6189k4190l6935P343m635j6645j455j3189O8335
11657B13026J5217J6526m6912r8K4271P844j27183k0265K9435M7684M6997R3174
11645B99716j9285l4652k2097m4587M2676N4245p0501j1844M0540O3973l089K5442
11633C20537n0195j05068N2009Q9264J9869n9829P756K5893j1714R05k7553m4999
11621B16875n2426N3734L8994R6476n3654k4919J7322j6726n6753o8968J21204
$$ plain form
11610 271159 291492 154471 113307 160763 209707 145356 143351 186886 146051 116593 121868 77215
11598 77215 128693 179656 235458 272218 241381 209436 135811 136524 1674 -21217 12970 35404
11586 35404 61226 185303 213600 171776 12525 -54719 -19976 72102 117150 109375 107836 24504
11574 24504 -53571 -16500 -3736 68207 101528 111981 132605 44951 -26394 79407 90188
11563 90188 123489 159900 199888 141245 191033 140456 188492 205283 246867 205102 64185
11552 64185 17640 -15408 -81609 -63643 55561 147286 128488 95539 103427 101567 105109 128531
11540 128531 86669 27202 -39932 -87949 -106032 -81049 -26564 -25995 -6581 -62138 36586 74247
11528 74247 44428 27954 17313 43931 53851 64025 96321 108315 49121 -24325 -25972 13291
$$ packed form
11610B71159K0333j37021m1164M7456M8944o4351k005M3535m0835k9458N275m4653
11598G7215N1478N0963N5802L6760l0837l1945p3625P13j34850k2891L4187K2434
11586C5404K5822J24077K8297m1824j59251o7244L4743R2078M5048p775j539q3332
11574B4504p8075L7071J2764P1943L3321J0453K0624q7654p1345J05801J0781
11563I0188L3301L6411L9988n8643M9788n0577M8036J6791M1584m1765j40917
11552F4185m6545l3048o6201J7966J19204R1725j8798l2949P888j860L542K3422
11540A28531m1862n9467o7134m8017j8083K4983N4485N69J9414n5557R8724L7661
11528G4247k9819j6474j0641K6618R920J0174L2296J1994n9194p3446j647L9263
$$ plain form
11516 13291 15093 26246 7961 -4466 -2307 116258 80705 82715 137689 260648 234262 141702
11504 141702 114767 74400 54336 90298 178251 160848 121127 102608 75767 71281 123216 133835
11492 133835 153038 191950 200815 137464 81900 121693 96592 88145 49357 65377 84717 101713
11480 101713 90218 98170 93827 -23230 -106092 -44251 -781 33241 116920 39867 97 -51513
11468 -51513 -43711 -32920 -55990 -65788 -40638 -13295 -5215 20972 50519 18274 67489 96456
11456 96456 91777 77806 92289 150507 174408 131917 110186 50345 28227 38143 21196 2283
11444 2283 -17890 -102418 -37267 51548 116634 140156 114091 101155 90642 160851 176586 96151
11432 96151 57025 60785 21214 14918 2359 44955 29460 103389 69491 89817 82122 94209
$$ packed form
11516A3291J802J1153j8285j2427K159J18565l5553K010N4974J22959k6386r2560
11504A41702k6935m0367k0064L5962Q7953j7403l9721j8519k6841m486N1935J0619
11492A33835J9203L8912Q865o3351n5564L9793k5101q447l8788J6020J9340J6996
11480A01713j1495P952m343j17057q2862O1841M3470L4022Q3679p7053l9770n1610
11468e1513P802J0791k3070r798K5150K7343Q080K6187K9547l2245M9215K8967
11456I6456m679j3971J4483N8218K3901m2491k1731n9841k2118R916j6947j8913
11444B283k0173q4528O5151Q8815O5086K3522k6065j2936j0513P0209J5735q0435
11432I6151l9126L760l9571o296j2559M2596j5495P3929l3898K0326p695J2087
$$ plain form
11420 94209 34572 11716 32345 14318 -29737 -77398 50719 136881 171300 71894 62563 6420
11408 6420 -83178 -54699 38123 85690 124317 132199 140778 185795 170325 173317 139923 75342
11396 75342 41916 -53256 -27447 -34176 61815 33089 28341 51207 65839 164930 112583 -5561
11384 -5561 -28715 8963 -86406 -79151 -59888 -89535 -130555 -125655 -67565 6260 138183 163111
11372 163111 83655 -17627 -62504 -20802 102201 123337 103755 119911 101872 67468 118902
11361 118902 160855 88780 54022 100462 82578 40168 16971 -9650 53828 109718 138014
11350 138014 142022 161069 102717 60264 117233 154283 92139 33201 26668 96914 48865 60767
11338 60767 41708 75685 108034 86159 69672 169470 161575 147365 133722 106871 120840 90821
$$ packed form
11420I4209n9637k2856K0629j8027m4055m7661J28117Q6162L4419r9406r331n6143
11408F420q9598K8479R2822M7567L8627P882Q579M5017j5470K992l3394o4581
11396G5342l3426r5172K5809o729R5991k8726m748K2866J4632R9091n2347j18144
11384e561k3154L7678r5369P255J9263k9647m1020M900N8090P3825J31923K4928
11372A63111p9456j01282m4877M1702J23003K1136j9582J6156j8039l4404N1434
11361A18902M1953p2075l4758M6440j7884m2410k3197k6621O3478N5890K8296
11350A38014M008J9047n8352m2453N6969L7050o2144n8938o533P0246m8049J1902
11338F0767j9059L3977L2349k1875j6487R9798p895j4210j3643k6851J3969l0019
$$ plain form
11326 90821 -27504 -22203 -11098 53712 79253 75171 52783 92316 116638 156208 181778 136821
11314 136821 113504 168605 79906 -428 101671 223670 250105 212114 127577 58483 74565
11303 74565 155570 204043 134962 39394 21092 -29011 -28347 25387 37060 52268 46160 -8520
11291 -8520 32806 46099 37501 34499 -55925 -18278 4048 55074 92912 63196 20085 -21403
11279 -21403 -37858 32284 67780 126339 73338 1223 54894 205104 172010 117454 36044
11268 36044 48401 -61431 778 87079 -12469 -94108 -74629 -33397 -2764 46148 18713
11257 18713 -6319 -84629 -103849 -20617 67163 47374 -13899 7814 -4595 29461 92705 59111
11245 59111 66961 51785 74375 39979 -57640 -93482 -75404 -26814 22474 69362 69333 40159
$$ packed form
11326I0821j18325N301J1105O4810K5541m082k2388L9533K4322L9570K5570m4957
11314A36821k3317N5101q8699q0334J02099J21999K6435l7991q4537o9094J6082
11303G4565Q1005M8473o9081r5568j8302n0103O64N3734J1673J5208o108n4680
11291h520M1326J3293q598l002r0424L7647K2326N1026L7838k9716m3111m1488
11279b1403j6455P0142L5496N8559n3001p2115N3671J50210l3094n4556q1410
11268C6044J2357j09832O2209Q6301r9548q1639J9479M1232L0633M8912k7435
11257A8713k5032p8310j9220Q3232Q7780j9789o1273K1713j2409L4056O3244l3594
11245E9111P850j5176K2590l4396r7619l5842J8078M8590M9288M6888k9k9174
$$ plain form
11233 40159 -75533 -48775 18267 72480 90651 35132 7033 29919 90522 104201 146199
11222 146199 96377 9307 -4552 3691 19389 14208 62356 115649 115917 13738 -60735 -84363
11210 -84363 -30708 -51943 -151387 -190679 -163455 -99961 51821 81816 7775 35206 95321
11199 95321 51020 -16215 -58434 -79630 -17271 21221 80897 90250 121262 125169 88005 25746
11187 25746 54725 69687 145958 159069 35093 51223 56842 -65637 -79920 -39950 -53449
11176 -53449 10749 8620 -110092 -104564 -109200 -50064 14841 45143 24699 15172 -3124 -10251
11164 -10251 24412 7827 -33167 33606 24501 -88573 -13853 17038 51088 79100 97364 64774
11152 64774 -32146 -109618 -18407 10057 -52623 -109378 -93913 -80497 -27428 70337 83620 78852
$$ packed form
11233D0159j15692K6758O7042N4213J8171n5519k8099K2886O0603J3679M1998
11222A46199m9822q7070j3859Q243J5698n181M8148N3293K68j02179p4473k3628
11210h4363N3655k1235r9444l9292K7224O3494J51782K9995p4041K7431O0115
11199I5321m4301o7235m2219k1196O2359L8492N9676R353L1012L907l7164o2259
11187B5746K8979J4962P6271J3111j23976J6130N619j22479j4283L9970j3499
11176e3449O4198k129j18712N528m636N9136O4905L0302k0444r527j8296p127
11164a0251L4663j6585m0994O6773r105j13074P4720L0891L4050K8012J8264l2590
11152F4774r6920p7472R1211K8464o2680n6755J5465J3416N3069R7765J3283m768
$$ plain form
11140 78852 35115 19457 30826 -22603 -52540 68881 104014 -3580 -58005 -21390 -35385
11129 -35385 -78 7805 46436 79591 114293 86901 -20796 -38019 16654 -23148 1148 44936
11117 44936 33378 -44871 -4077 2170 839 -33092 -31878 -7926 56488 35556 36116 -56350 -126734
11104 -126734 -37637 -22584 -134051 -152313 -171625 -193449 -130272 -82386 -41230 34733 -1943
11093 -1943 -145456 -178103 -61462 -43109 -59457 -86280 -121897 -146371 -97821 -84218 -23620
11082 -23620 -5677 55123 49932 39894 51946 117260 67458 7478 25069 -4466 -22043 -90331
11070 -90331 -101825 -20821 -25431 17930 -17575 -39286 -19917 -110566 -120301 -126408 -99875 -50916
11058 -50916 28729 118978 75022 4134 -6352 -47572 -112711 -85407 -56378 -38727 16650 93978
$$ packed form
11140G8852m3737j5658J1369n3429k9937J21421L5133j07594n4425L6615j3995
11129c5385L5307P883L8631L3155L4702k7392j07697j7223N4673l9802K4296M3788
11117D4936j1558p8249M0794O247j331l3931J214K3952O4414k0932N60r2466p0384
11104a26734Q9097J5053j11467j8262j9312k1824O3177M7886M1156P5963l6676
11093a943j43513l2647J16641J8353j6348k6823l5617k4474M8550J3603O0598
11082b3620J7943O0800n191j0038J2052O5314m9802n9980J7591k9535j7577o8288
11070i0331j1494Q1004m610M3361l5505k1711J9369r0649r735o107K6533M8959
11058e0916P9645R0249m3956p0888j0486m1220o5139K7304K9029J7651N5377P7328
$$ plain form
11046 93978 145474 166730 196993 183366 160550 101408 98548 114404 182879 255135 295912 340508
11034 340508 374325 429715 490235 507040 508108 474009 390400 322797 366317 428653 526867 572033
11022 572033 560486 572689 633406 627032 530035 357054 322488 325177 329788 289869 338831 386705
11010 386705 384197 415918 477133 454989 358032 276630 339146 335978 310806 218934 156771 133404
10998 133404 171418 220603 178469 116706 149345 250842 320475 298219 203978 118694 98489
10987 98489 34500 18630 36409 55928 141442 139944 24563 -13693 49639 104544 99727 79045
10975 79045 11934 43477 33980 39797 40873 4933 30720 77193 88818 66870 14579 -6954
10963 -6954 -28333 -9726 -8642 -69814 -109005 2855 78678 42407 25030 76763 110700 42855
$$ packed form
11046I3978N1496K1256L0263j3627k2816n9142k860J5856O8475P2256M0777M4596
11034C40508L3817N5390O0520J6805J068l4099q3609o7603M3520O2336R8214M5166
11022E72033j1547J2203O0717o374r6997j72981l4566K689M611l9919M8962M7874
11010C86705k508L1721O1215k2144r6957q1402O2516l168k5172r1872o2163k3367
10998A33404L8014M9185m2134o1763L2639J01497O9633k2256r4241q5284k0205
10987I8489o3989j5870J7779J9519Q5514j498j15381l8256O3332N4905m817k0682
10975G9045o7111L1543r497N817J076l5940K5787M6473J1625k1948n2291k1533
10963f954k1379J8607J084o1172l9191J11860P5823l6271j7377N1733L3937o7845
$$ plain form
10951 42855 -6369 -82380 16722 92517 25301 -190864 -255070 -186435 -9249 113167 146350
10940 146350 137651 43328 51970 64225 27144 104861 108603 49643 -8732 -29577 20308 -14830
10928 -14830 -56989 -77787 -92396 -12960 77498 130655 46484 54259 95211 51752 -27678 -85803
10916 -85803 -84435 -91704 -111734 -136770 -99958 -94089 -131163 -103308 -10196 3438 -82436 -124424
10904 -124424 -138291 -114377 -104786 -41949 15723 94285 6345 -50602 -101905 -25330 16516 52114
10892 52114 53007 28061 -60728 -65580 -19717 -34812 -12716 25520 64777 23722 5934 -13594
10880 -13594 -91050 -120683 -29838 -35883 -53363 -32878 -5346 9267 42062 41789 -4270 -4576 4143
10867 4143 -69823 -31032 16665 -11757 -54971 -45998 -43939 1417 -64611 -347 101273 135265
$$ packed form
10951D2855m9224p6011R9102P5795o7216k16165o4206O8635J77186J22416L3183
10940A46350q699r4323Q642J2255l7081P7717L742n8960n8375k0845M9885l5138
10928a4830m2159k0798j4609P9436R0458N3157q4171P775M0952m3459p9430n8125
10916h5803J368p269k0030k5036L6812N869l7074K7855R3112J3634q5874m1988
10904a24424j3867K3914R591O2837N7672P8562q7940n6947n1303P6575M1846L5598
10892E2114Q93k4946q8789m852M5863j5095K2096L8236L9257m1055j7788j9528
10880a3594p7456k9633R0845o045j7480K0485K7532J4613L2795k73m6059l06Q719
10867D143p3966L8791M7697k8422m3214Q973K059M5356o6028O4264J01620L3992
$$ plain form
10855 135265 99444 62977 54267 46789 86384 100452 88159 108359 120388 74395 53696 -15235
10843 -15235 -44523 -66534 -139351 -181590 -115332 -52766 -32805 -52330 -82064 -119260 -118313 -65555
10831 -65555 -20580 14161 37680 31451 -25296 -102886 -106196 -90408 -11032 126043 126356 100256
10819 100256 40587 17081 21048 21997 97422 173921 128163 68318 95158 89706 70374 66480
10807 66480 63784 44093 26416 13687 -6179 61639 80406 -13135 -165626 -153965 -135383 -47327
10795 -47327 -62462 -81390 -26852 -9502 7097 30093 -2543 -68105 -84710 -12118 64726 83225
10783 83225 10748 -5963 -56123 -60367 3607 53763 -30779 -46224 -67730 8610 -78261 -167505
10771 -167505 -160651 -156047 -205615 -185905 -114182 -130308 -57518 26082 48230 2825 -12579 -106608
$$ packed form
10855A35265l5821l6467q710p478L9595J4068j2293K0200J2029m5993k0699o8931
10843a5235k9288k2011p2817m2239O6258O2566J9961j9525k9734l7196R47N2758
10831f5555M4975L4741K3519o229n6747p7590l310J5788P9376J37075L13k6100
10819A00256n9669k3506L967R49P5425P6499m5758n9845K6840n452j9332l894
10807F6480k696j9691j7677j2729j9866O7818J8767r3541j52491J1661J8582Q8056
10795d7327j5135j8928N4538J7350J6599K2996l2636o5562j6605P2592P6844J8499
10783H3225p2477j6711n0160m244O3974N0156q4542j5445k1506P6340q6871q9244
10771a67505O854M604m9568J9710P1723j6126P2790Q3600K2148m5405j5404r4029
$$ plain form
10759 -106608 -117710 -165403 -172178 -78529 3820 25649 53068 96258 18815 -33657 -66878 -88422
10747 -88422 -101851 -75795 -49189 -116377 -100888 -37639 -23251 -82517 -174131 -196761 -129601 -132060
10735 -132060 -38664 6140 -27077 -43636 -22793 -69692 -59652 -43920 49074 58833 110969 188405
10723 188405 131665 155024 130315 -18152 -19961 22684 71275 143236 117417 83874 46153
10712 46153 34992 14509 -28303 20485 47913 15583 46053 121541 201988 178322 223252 221767
10700 221767 185925 188595 94044 42687 33869 33435 13895 30354 119024 103789 22420 -40822
10688 -40822 -17923 -57212 -47206 -15998 -6889 12038 55192 64336 -20751 22688 50792 63077
10676 63077 125585 102862 74631 33121 70438 175574 153746 132423 122001 129959 175200 188434
$$ packed form
10759a06608j1102m7693o775R3649Q2349K1829K7419M3190p7443n2472l3221k1544
10747h8422j3429K6056K6606o7188J5489O3249J4388n9266r1614k2630O7160k459
10735a32060R3396M4804l3217j6559K0843m6899J0040J5732R2994R759N2136P7436
10723A88405n6740K3359k4709j48467j809M2645M8591P1961k5819l3543l7721
10712D6153j1161k0483m2812M8788K7428l2330L0470P5488Q0447k3666M4930j485
10700B21767l5842K670r4551n1357q818m34j9540J6459Q8670j5235q1369o3242
10688d0822K2899l9289J0006L1208R109J8927M3154R144q5087M3439K8104J2285
10676F3077O2508k2723k8231m1510L7317J05136k1828k1323j0422P958M5241J3234
$$ plain form
10664 188434 177490 253822 392605 403156 295803 255895 249570 263891 217092 156795 159383
10653 159383 189890 206454 242617 246628 260173 253318 301585 356388 411607 357974 421092 525951
10641 525951 514745 577712 662156 651570 759550 930742 1021772 1037450 1172789 1333647 1596991
10630 1596991 1765618 1913769 2134542 2416054 2800013 3204001 3657718 4376755 5416630
10621 5416630 6951507 9190734 12350009 16585750 21763579 27021196 31253078 33855289
10613 33855289 34713101 34213920 33008311 31975757 32025670 34050745 38689206 46373929 56556170
10604 56556170 67053600 74491668 77423108 76445238 72451011 66730444 61529526 59014868
10596 59014868 60268332 65737210 75681367 88930711 101530917 108816466 109184775 104125405
$$ packed form
10664A88434j0944P6332J38783J0551j07353l9908o325J4321m6799o0297K588
10653A59383L0507J6564L6163M011J3545o855M8267N4803N5219n3633O3118J04859
10641E25951j1206O2967Q4444j0586J07980J71192R1030J5678J35339J60858K63344
10630A596991J68627J48151K20773K81512L83959M03988M53717P19037J039875
10621E416630J534877K239227L159275M235741N177829N257617M231882K602211
10613C3855289Q57812m99181j205609j032554M9913K025075M638461P684723J0182241
10604E6556170J0497430P438068K931440r77870l994227n720567n200918k514658
10596E9014868J253464N468878R944157J3249344J2600206P285549L68309n059370
$$ plain form
10588 104125405 94931503 83387368 72600753 65132391 61894304 62640715 67134566 73726869
10580 73726869 79559001 81691493 79298636 73340609 64990993 55598048 47213132 41160574
10572 41160574 37681969 36560143 37222906 38637747 39661866 39128096 36740861 33092771
10564 33092771 28503691 23540707 18975439 15353010 12556473 10510693 8857787 7694157
10556 7694157 6765822 6015125 5464361 5022689 4569826 4171864 3821517 3498982 3273425
10547 3273425 3042789 2861368 2698204 2527614 2393418 2294614 2235201 2130299 2065177 1935001
10537 1935001 1869339 1722204 1549475 1486214 1488566 1486168 1371609 1226604 1149105 1119378 1094271
10526 1094271 1082820 1110873 1118017 1103242 1028536 975634 925078 879265 830480 777247 751324
$$ packed form
10588A04125405r193902j1544135j0786615p468362l238087P46411M493851O592303
10580G3726869N832132K132492k392857n958027q349616r392945q384916o052558
10572D1160574l478605j121826O62763J414841J024119n33770k387235l648090
10564C3092771m589080m962984m565268l622429k796537k045780j652906j163630
10556G694157r28335p50697n50764m41672m52863l97962l50347l22535k25557
10547C273425k30636j81421j63164j70590j34196r8804n9413j04902o5122j30176
10537A935001o5662j47135j72729o3261K352k398j14559j45005p7499k9727k5107
10526A094271j1451K8053P144j4775p4706n2902n0556m5813m8785n3233k5923
$$ plain form
10515 751324 771568 761469 711905 711705 723718 777273 753724 672194 604379 604081 601601 614391
10503 614391 667686 669604 673270 625191 542864 521723 487438 462419 492180 493357 480391 509314
10491 509314 510705 505495 498481 434912 352491 324813 261633 259241 225176 232484 280214 358301
10479 358301 334517 324084 339031 365247 330770 324403 292911 316829 368122 361805 432508 384364
10467 384364 300419 280118 177204 128933 205127 231689 198643 219273 178693 181825 218311
10456 218311 253037 243279 189263 163806 141269 156925 242122 164773 115043 48622 143401 289082
10444 289082 279194 208544 159691 217229 266843 263283 189439 119833 174714 198023 156106 261456
10432 261456 263253 172288 187685 218308 189588 155508 40660 57411 86960 130641 208595
$$ packed form
10515G51324K0244j0099m9564k00J2013N3555k3549q1530o7815k98k480J2790
10503F14391N3295J918L666m8079q2327k1141l4285k5019K9761J177j2966K8923
10491E09314J391n210p014o3569q2421k7678o3180k392l4065P308M7730P8087
10479C58301k3784j0433J4947K6216l4477o367l1492K3918N1293o317P0703m8144
10467C84364q3945k0301j02914m8271P6194K6562l3046K0630m0580L132L6486
10456B18311L4726r758n4016k5457k2537J5656Q5197p7349m9730o6421R4779J45681
10444B89082r888p0650m8853N7538M9614l560p3844o9606N4881K3309m1917J05350
10432B61456J797r0965J5397L0623k8720l4080j14848J6751K9549M3681P7954
$$ plain form
10421 208595 206340 202086 141701 120112 130818 140534 47020 -21715 -12272 37999 60933 81544
10409 81544 12996 -24168 -15428 40265 10255 51045 35314 6165 -6437 4492 4821 -22605
10397 -22605 7894 -8452 -37570 22476 63138 84674 90529 35250 7720 14857 8908 57520
10385 57520 55174 73393 78019 113500 63646 -35525 -7062 -33492 6306 -9843 40354 70782
10373 70782 52483 49046 86729 109313 48178 95450 160560 164349 43326 -11449 69048 84394
10361 84394 103604 92456 110634 38715 -37982 24332 72933 57365 89356 127122 156075 146488
10349 146488 210991 241566 264417 274663 193067 135950 85688 4119 -11710 62992 40413
10338 40413 66253 60354 123351 107974 103505 77640 87815 110269 102684 72970 -19917 -84047
$$ packed form
10421B08595k255m254o0385k1589J0706R716r3514o8735R443N0271K2934K0611
10409H1544o8548l7164Q740N5693l0010M0790j5731k9149j2602J0929L29k7426
10397b2605L0499j6346k9118O0046M0662K1536N855n5279k7530P137n949M8612
10385E7520k346J8219M626L5481m9854r9171K8463k6430L9798j6149N0197L0428
10373G0782j8299l437L7683K2584o1135M7272O5110L789j21023n4775Q0497J5346
10361H4394J9210j1148J8178p1919p6697O2314M8601j5568L1991L7766K8953r587
10349A46488O4503L0575K2851J0246q1596n7117n0262q1569j5829P4702k2579
10338D0413K5840n899O2997j5377m469k5865J0175K2454p585k9714r2887o4130
$$ plain form
10326 -84047 43041 82279 101612 121539 142684 180988 183290 105926 78135 192617 301234
10315 301234 279157 261296 171142 170587 189275 189295 148189 187521 219619 212185 150029 108665 115501
10302 115501 118888 218955 240806 150518 207203 312411 349828 301250 306991 290615 280585
10291 280585 233062 178782 108548 49151 33043 20134 24033 143457 155417 107274 119526
10280 119526 -2357 -52721 -20953 -80294 -79047 -51874 -39250 -46933 -33730 21729 62010 53508
10268 53508 41210 -3259 -2686 12752 -48651 -77931 -65030 -75977 -45020 -77761 -44369 46253
10256 46253 107282 99577 69322 14536 45189 118761 178980 255705 230365 37701 -120430
10245 -120430 -146318 -150493 -114671 -114688 -67467 503 70259 150749 83063 52725 56988 78990
$$ packed form
10326h4047J27088L9238J9333J9927K1145L8304K302p7364k7791J14482J08617
10315C01234k2077j7861r0154n55J8688K0m1106L9332L2098p434o2156m1364O836
10302A15501L387J00067K1851r0288N6685J05208L7417m8578N741j6376j0030
10291B80585m7523n4280p0234n9397j6108j2909L899J19424J1960m8143J2252
10280A19526j21883n0364L1768n9341J247K7173J2624p683J3203N5459M0281q502
10268E3508j2298m4469N73J5438o1403k9280J2901j0947L0957l2741L3392R0622
10256D6253O1029p705l0255n4786L0653P3572O0219P6725k5340j92664j58131
10245a20430k5888m175L5822j7M7221O7970O9756Q0490o7686l0338M263K2002
$$ plain form
10233 78990 33947 20641 -3811 -11323 5384 5856 -35369 22512 37795 15289 52075 98987
10221 98987 97371 42465 5115 46061 115689 74586 55197 149223 86481 -25227 -42226 8559
10209 8559 2510 25510 62730 62255 18015 56986 92826 105281 130469 121814 76623 -1267 -14485
10196 -14485 -22989 20003 141066 81392 44460 19601 -19041 -15758 28651 8424 -14434 -10577
10184 -10577 -5318 -15920 -60132 -4500 82503 120961 174800 194169 246772 265107 182415 195548
10172 195548 257451 289136 279644 282973 392166 470619 535384 564416 538244 447181 398833 404420
10160 404420 420778 435951 423077 408562 452464 558975 569904 587953 560553 511191 432850
10149 432850 365269 297671 303520 362392 439802 501258 515253 433412 343702 308449 258403 202671
$$ packed form
10233G8990m5043j3306k4452p512J6707M72m1225N7881J5283k2506L6786M6912
10221I8987j616n4906l7350M0946O9628m1103j9389R4026o2742j11708j6999N0785
10209H559o049K3000L7220m75m4240L8971L5840J2455K5188q655m5191p7890j3218
10196a4485q504M2992J21063n9674l6932k4859l8642L283M4409k0227k2858L857
10184a0577N259j0602m4212N5632Q7003L8458N3839J9369N2603J8335q2692J3133
10172A95548O1903L1685r492L329J09193P8453O4765K9032k6172r1063m8348N587
10160D04420J6358J5173j2874j4515M3902J06511J0929J8049k7400m9362p8341
10149D32850o7581o7598N849N8872P7410O1456J3995q1841q9710l5253n0046n5732
$$ plain form
10137 202671 182264 205900 236754 196824 206802 238256 170630 132168 121287 81607 67612 54584
10125 54584 37188 8359 -20127 -36765 57469 116854 81600 36322 -7719 -43997 -3390 79394
10113 79394 -4738 -98386 -116764 -73419 17422 102061 134621 92357 87429 56986 1670 -41949
10101 -41949 -9687 44311 -28825 -76267 -91315 -120665 -96824 -4790 58659 10796 2932 68045
10089 68045 70251 2599 -39909 -27400 -4270 21255 42046 54721 51100 104715 130278 158017
10077 158017 94141 26930 1141 -40911 -10806 118963 162391 93426 121078 75402 41049
10066 41049 -2755 -40857 -28544 -18956 -11296 -96201 -8249 -14947 -23645 43902 69663 84958
10054 84958 79777 -63491 -120242 -86811 -94206 -40245 -25120 -15692 -20731 -67616 -82393 -86166
$$ packed form
10137B02671k0407K3636L0854l9930R978L1454o7626l8462j0881l9680j3995j3028
10125E4584j7396k8829k8486j6638R4234N9385l5254m5278m4041l6278M0607Q2784
10113G9394q4132r3648j8378M3345R0841Q4639L2560m2264m928l0443n5316m3619
10101d1949L2262N3998p3136m7442j5048k9350K3841R2034O3449m7863p864O5113
10089F8045K206o7652m2508J2509K3130K5525K0791J2675l621N3615K5563K7739
10077A58017o3876o7211k5789m2052L0105J29769M3428o8965K7652m5676l4353
10066D1049m3804l8102J2313R588P660q4905Q7952o698q698O7547K5761J5295
10054H4958n181j43268n6751L3431p395N3961J5125R428n039m6885j4777l773
$$ plain form
10042 -86166 -184270 -81551 65624 29144 87990 137899 159418 65391 62478 50949 -62256
10031 -62256 -146802 -91515 68536 35521 -39282 -63637 -49180 -17739 -83844 -75961 31514
10020 31514 99281 50306 -61419 -83324 -65431 -101957 -137733 -105137 -115709 -101162 -137233
10009 -137233 -81865 -1308 8900 84993 55858 30051 29350 84931 37476 95922 133773 106567
9997 106567 17039 5598 -7026 38235 39311 16384 84412 110304 28704 19364 63380 61599
9985 61599 5297 -84788 -123728 -96269 -27961 -15188 -44383 -83851 -91613 -891 22788 -33246
9973 -33246 98895 142930 104338 28233 46767 74463 52605 17306 5207 -21076 -81815 -223205
9961 -223205 -266426 -192147 -198272 -232000 -206482 -132121 -163059 -184086 -82963 -27948 8971 -23103
$$ packed form
10042h6166r8104J02719J47175l6480N8846M9909K1519r4027k913j1529j13205
10031f2256q4546N5287J60051l3015p4803k4355J4457L1441o6105P883J07475
10020C1514O7767m8975j11725k1905J7893l6526l5776L2596j0572J4547l6071
10009a37233N5368Q0557J0208P6093k9135k5807p01N5581m7455N8446L7851k7206
9997A06567q9528j1441j2624M5261J076k2927O8028K5892q1600r340M4016j781
9985F1599n6302r0085l8940K7459O8308J2773k9195l9468p762R0722K3679n6034
9973c3246J32141M4035l8592p6105J8534K7696k1858l5299j2099k6283o0739j41390
9961b23205m3221P4279o125l3728K5518P4361l0938k1027J01123N5015L6919l2074
$$ plain form
9949 -23103 -46519 -69991 -11307 10904 29138 67740 26413 5211 14311 -59865 -24976 -20759
9937 -20759 -273 -49881 -233374 -175851 8472 13311 -72919 -87579 -25244 -63609 -21662 5947
9925 5947 -49655 -85044 -83156 -139803 -128263 -107924 -62111 -8627 -45946 -47092 -68715 -105156
9913 -105156 -123245 -167054 -69713 -106613 -113526 -49339 -33858 37069 85486 78606 70098 81014
9901 81014 6193 -72402 -35759 28960 -20794 -67526 -79736 -62690 -69484 -103019 -142752 -91238
9889 -91238 -135391 -92130 -85123 -129883 -151156 -21401 91153 -15344 -77455 -65293 -23511
9878 -23511 77324 -6489 -21682 11183 -27002 -68394 -63952 -73801 -48269 -101629 -120599 -60663
9866 -60663 -13893 -2657 8004 26357 23074 8984 31681 -41934 -49800 10583 43250 28105
$$ packed form
9949b3103k3416k3472N8684K2211J8234L8602m1327k1202R100p4176L4889M217
9937b0759K0486m9608j83493N7523J84323M839q6230j4660O2335l8365M1947K7609
9925E947n5602l5389J888n6647J1540K0339M5813N3484l7319j146k1623l6441
9913a05156j8089m3809R7341l6900o913O4187J5481P0927M8417o880q508J0916
9901H1014p4821p8595L6643O4719m9754m6732j2210J7046o794l3535l9733N1514
9889i1238m4153M3261P007m4760k1273J29755J12554j06497o2111J2162M1782
9878b3511J00835q3813j5193L2865l8185m1392M442r849K5532n3360j8970N9936
9866f0663M6770J1236J0661J8353l283j4090K2697p3615p866O0383L2667j5145
$$ plain form
9854 28105 -29873 -42966 11546 42492 58387 48254 -4228 -62481 -37192 -27233 -81325 -59267
9842 -59267 -38058 -7720 -4071 26887 64351 -7984 -91328 -37000 -51556 -47291 -36862 33492
9830 33492 37094 5323 -12877 -130044 -124375 -144697 -134851 -30784 109761 105089 88202 80298
9818 80298 17772 -95183 -99632 -127142 -125447 -114179 -44644 -73382 -129545 -104116 -103633 -157730
9806 -157730 -256503 -172657 -23503 -30903 -82874 -60662 -26445 -21855 -113724 -123952 -58805 5097
9794 5097 28756 -428 67888 53722 -55371 -95001 -41858 -35994 -26846 -3768 20910 23472
9782 23472 20409 -40853 -57984 -23078 23418 52613 17220 -23613 20439 73580 -22655 -2189
9770 -2189 13379 20605 16496 25031 42572 -38651 -30660 -10838 -14020 14510 -4115 -71404 -82158
$$ packed form
9854B8105n7978j3093N4512L0946J5895j0133n2482n8253K5289R959n4092K2058
9842e9267K1209L0338L649L0958L7464p2335q3344N4328j4556M265J0429P0354
9830C3492L602l1771j8200j17167N669k0322R846J04067J40545m672j6887p904
9818H0298o2526j12955m449k7510J695J1268O9535k8738n6163K5429M83n4097
9806a57730r8773Q3846J49154p400n1971K2212L4217M590r1869j0228O5147O3902
9794E097K3659k9184O8316j4166j09093l9630N3143N864R148K3078K4678K562
9782B3472l063o1262j7131L4906M6496K9195l5393m0833M4052N3141r6235K0466
9770b189J5568P226m109Q535J7541q1223P991J9822l182K8530j8625o7289j0754
$$ plain form
9757 -82158 -47957 46094 66637 58073 -17303 -8976 27700 15372 -46928 21663 132580 63666
9745 63666 -3289 -29566 -37715 -34033 32635 70058 33918 25169 20785 25692 -22537 -11213 -23405
9732 -23405 -26959 -21132 27634 36138 41864 3412 -33513 -69809 -90483 -186019 -162164 -128775 -28935
9719 -28935 -73881 -50112 5365 -3366 -129850 -183265 -130181 -89425 -101365 -143018 -101054 -55436
9707 -55436 -29722 -83166 -143927 -112407 -116672 -120347 -87644 -67215 -116231 -111150 -94901 -31997
9695 -31997 -112474 -133570 -147360 -112769 -60772 -30758 -32813 1210 -49064 -33854 -57807 -109880
9683 -109880 -187750 -206571 -142130 23565 97028 4610 -62602 -81764 -99785 -114650 -107066 -110597
9671 -110597 -73940 -1892 -6544 -28254 -19573 -100088 -121461 -109215 -92848 -72951 -82858 -52887
$$ packed form
9757h2158L4201R4051K0543q564p5376Q327L6676j2328o2300O8591J10917o8914
9745F3666o6955k6277q149L682O6668L7423l6140q749m384M907m8229J1324j2192
9732b3405l554N827M8766Q504N726l8452l6925l6296k0674r5536K3855L3389R9840
9719b8935m4946K3769N5477q731j26484n3415N3084M0756j1940m1653M1964M5618
9707e5436K5714n3444o0761L1520m265l675L2703K0429m9016N081J6249O2904
9695c1997q0477k1096j3790L4591N1997L0014k055L4023n0274J5210k3953n2073
9683a09880p7870j8821O4441J65695P3463r2418o7212j9162j8021j4865P584l531
9671a10597L6657P2048m652k1710Q681q0515k1373J2246J6367J9897r907K9971
$$ plain form
9659 -52887 -62855 -64912 -75224 -44918 -5624 -38248 -10477 87469 130191 4785 -93178 -136259
9647 -136259 -103702 -99834 -77910 14657 79208 -10201 -100649 -147582 -138821 -110766 -71925 -48706
9635 -48706 -14645 -25379 33718 34740 28278 -74177 -162574 -141436 -32551 -43722 -92447 -88350
9623 -88350 -56799 1884 29754 38892 -1135 -89536 -105633 -79414 -28960 120575 208052 108399
9611 108399 -41620 -154789 -84024 41874 17047 -2865 44355 49969 54898 95851 172461
9600 172461 149226 19011 -87041 -85421 -140950 -136405 -84446 -49464 -42618 -22435 -74555 -14563
9588 -14563 -19130 -116953 -60924 -130973 -104237 -66803 -50820 -115237 -122863 -113303 -62120 -86815
9576 -86815 -47007 -61159 -18781 57673 72333 26493 54932 89355 62259 84784 28989 15037
$$ packed form
9659e2887r968k057j0312L0306L9294l2624K7771R7946M2722j25406r7963m3081
9647a36259L2557L868K1924R2567O4551q9409r0448m6933Q761K8055L8841K3219
9635d8706L4061j0734N9097J022o462j02455q8397K1138J08885j1171m8725M097
9623h8350L1551N8683K7870R138m0027q8401j6097K6219N0454J49535Q7477r9653
9611A08399j50019j13169P0765J25898k4827j9912M7220N614M929M0953P6610
9600A72461k3235j30215j06052J620n5529M545N1959L4982O846K0183n2120N9992
9588a4563m567r7823N6029p0049K6736L7434J5983o4417p626R560N1183k4695
9576h6815L9808j4152M2378P6454J4660m5840K8439L4423k7096K2525n5795j3952
$$ plain form
9564 15037 -14386 -36846 -47139 1724 34 -34900 -27770 -21847 -16236 -11659 -109094 -81822 -26443
9551 -26443 17740 63436 92084 29010 40368 80777 31533 -46020 -97602 -39386 54611 150248
9539 150248 120216 110087 145761 116664 34227 16381 -22615 -49642 -83599 -72643 10726 33523
9527 33523 -48281 -80977 -121943 -183045 -134005 -122226 -164873 -148438 -186570 -123581 -65030 -51262
9515 -51262 -31865 -95733 -140203 -49611 -13928 -76665 -171673 -203257 -82627 -103722 -155732 -106260
9503 -106260 -60723 51733 139115 187510 110352 34971 -33200 -29636 46913 -38211 -78890 -73039
$$ packed form
9564A5037k9423k2460j0293M8863j690l4934P130N923N611M577r7435K7272N5379
9551b6443M4183M5696K8648o3074J1358M0409m9244p7553n1582N8216R3997R5637
9539A50248l0032j0129L5674k9097q2437j7846l8996k7027l3957J0956Q3369K2797
9527C3523q1804l2696m0966o1102M9040J1779m2647J6435l8132O2989N8551J3768
9515e1262J9397o3868m4470R0592L5683o2737r5008l1584J20630k1095n2010M9472
9503a06260M5537J12456Q7382M8395p7158p5381o8171L564P6549q5124m0679N851
$$ [...]
##END NTUPLES=NMR SPECTRUM
##END=
