##TITLE=Analysis number 328397
Compound Code cc 02701
Book Reference lab3
Project Code adrs
Chemist Name stores
##JCAMPDX= 6.0         $$ Bruker NMR JCAMP-DX V2.0
##DATA TYPE= NMR SPECTRUM
##DATA CLASS= NTUPLES
##ORIGIN= Bruker BioSpin GmbH
##OWNER= nmr
$$ XWIN-NMR		Version 3.5
$$ Tue May 29 09:15:11 2007 GMT Daylight Time (UT+1h)  MAYBRIDGE\nmr@NMR_250MHZ
##.OBSERVE FREQUENCY= 250.131544655141
##.OBSERVE NUCLEUS= ^1H
##.ACQUISITION MODE= SIMULTANEOUS (DQD)
##.ACQUISITION SCHEME= undefined
##.AVERAGES= 16
##.DIGITISER RES= 18
##SPECTROMETER/DATA SYSTEM= dpx250
##.PULSE SEQUENCE= zg30
##.SOLVENT NAME= DMSO
##.SHIFT REFERENCE= (INTERNAL, DMSO, 0, 16.522)
##AUDIT TRAIL= $$ (NUMBER, WHEN, WHO, WHERE, WHAT)
$$ ##TITLE= Audit trail, XWIN-NMR		Version 3.5
$$ ##JCAMPDX= 5.01
$$ ##ORIGIN= Bruker BioSpin GmbH
$$ ##OWNER= nmr
$$ C:\u/data/dgb/nmr/ADRS/1540/pdata/1/auditp.txt
$$ ##AUDIT TRAIL=  $$ (NUMBER, WHEN, WHO, WHERE, WHAT)
(   1,<2007-05-29 09:14:47.46 +100>,<MAYBRIDGE\nmr>,<NMR_250MHZ>,
      <created by zg, POWCHK disabled, PULCHK disabled
       configuration hash MD5:
       76 6E 9A 78 1E 09 19 81 EC 84 63 8F B0 6A 59 2D
       data hash MD5: 64K
       49 64 74 BE 1B 5F 47 D0 3C 45 D4 44 A1 02 02 FA>)
(   2,<2007-05-29 09:15:01.30 +100>,<MAYBRIDGE\nmr>,<NMR_250MHZ>,
      <Start of raw data processing
       ef LB = 0.3 FT_mod = 6 PKNL = 1 SI = 32K 
       data hash MD5: 32K
       B2 A5 DE 75 1D 38 71 C6 EC 5E 79 59 E2 32 2A 7F>)
(   3,<2007-05-29 09:15:02.96 +100>,<MAYBRIDGE\nmr>,<NMR_250MHZ>,
      <apk 
       data hash MD5: 32K
       1A E4 62 F0 97 0A 82 E2 93 9F 3B F1 5A 11 E6 8C>)
(   4,<2007-05-29 09:15:03.80 +100>,<MAYBRIDGE\nmr>,<NMR_250MHZ>,
      <abs ABSG = 5 
       data hash MD5: 32K
       4E 06 4A 2D 3B BA 14 72 38 A5 44 13 7E F8 A6 06>)
$$ ##END=
$$ 
$$ hash MD5
$$ 24 02 DC A8 36 6F AE 96 4B D2 AA 67 C1 7B A7 20
##$RELAX= 
##$RELAX= 
##$RELAX= 
##$RELAX= 
##$RELAX= 
##$RELAX= 
##$RELAX= 
$$ Bruker specific parameters
$$ --------------------------
##$DU= <C:\u>
##$EXPNO= 1540
##$NAME= <ADRS>
##$PROCNO= 1
##$TYPE= <nmr>
##$USER= <dgb>
##$AMP= (0..31)
100 100 100 100 100 100 100 100 100 100 100 100 100 100 100 100 100 100 
100 100 100 100 100 100 100 100 100 100 100 100 100 100 
##$AQSEQ= 0
##$AQ_mod= 3
##$AUNM= <au_zg>
##$AUTOPOS= <5 >
##$BF1= 250.13
##$BF2= 250.13
##$BF3= 250.13
##$BF4= 250.13
##$BF5= 500.13
##$BF6= 500.13
##$BF7= 500.13
##$BF8= 500.13
##$BYTORDA= 1
##$CFDGTYP= 0
##$CFRGTYP= 5
##$CHEMSTR= <none>
##$CNST= (0..31)
1 1 145 1 1 1 1 1 1 1 1 1 1 1 1 1 1 1 1 1 1 1 1 1 1 1 1 1 1 1 1 1 
##$CPDPRG= <>
##$CPDPRG1= <>
##$CPDPRG2= <>
##$CPDPRG3= <>
##$CPDPRG4= <mlev>
##$CPDPRG5= <mlev>
##$CPDPRG6= <mlev>
##$CPDPRG7= <mlev>
##$CPDPRG8= <mlev>
##$CPDPRGB= <>
##$CPDPRGT= <>
##$D= (0..31)
0 1 0 0 0 0 0 0 0 0.06 0 0 0 0 0 0 0.0002 0 0 0 0 0 0 0 0 0 0 0 0 0 0 
0 
##$DATE= 1180426486
##$DBL= (0..7)
120 120 120 120 120 120 120 120 
##$DBP= (0..7)
150 150 150 150 150 150 150 150 
##$DBP07= 0
##$DBPNAM0= <>
##$DBPNAM1= <>
$$ [...]
##$SUBNAM7= <"">
##$SUBNAM8= <"">
##$SUBNAM9= <"">
##$SW= 20.6930455092707
##$SWIBOX= (0..15)
0 0 3 0 0 0 0 0 0 0 0 0 0 0 0 0 
##$SW_h= 5175.983436853
##$TD= 65536
##$TD0= 1
##$TE= 683.16
##$TE2= 300
##$TE3= 300
##$TEG= 300
##$TL= (0..7)
0 120 120 120 120 120 120 120 
##$TP= (0..7)
150 150 150 150 150 150 150 150 
##$TP07= 0
##$TPNAME0= <>
##$TPNAME1= <>
##$TPNAME2= <>
##$TPNAME3= <>
##$TPNAME4= <>
##$TPNAME5= <>
##$TPNAME6= <>
##$TPNAME7= <>
##$TPOAL= (0..7)
0.5 0.5 0.5 0.5 0.5 0.5 0.5 0.5 
##$TPOFFS= (0..7)
0 0 0 0 0 0 0 0 
##$TUNHIN= 0
##$TUNHOUT= 0
##$TUNXOUT= 0
##$USERA1= <user>
##$USERA2= <user>
##$USERA3= <user>
##$USERA4= <user>
##$USERA5= <user>
##$V9= 5
##$VALIST= <valist>
##$VCLIST= <CCCCCCCCCCCCCCC>
##$VD= 0
##$VDLIST= <DDDDDDDDDDDDDDD>
##$VPLIST= <PPPPPPPPPPPPPPP>
##$VTLIST= <TTTTTTTTTTTTTTT>
##$WBST= 1024
##$WBSW= 4
##$XGAIN= (0..3)
0 0 0 0 
##$XL= 0
##$YL= 0
##$YMAX_a= 340089
##$YMIN_a= -313153
##$ZGOPTNS= <>
##$ZL1= 120
##$ZL2= 120
##$ZL3= 120
##$ZL4= 120
##$ABSF1= 16.522
##$ABSF2= -4.171173
##$ABSG= 5
##$ABSL= 3
##$ALPHA= 0
##$AQORDER= 0
##$ASSFAC= 0
##$ASSFACI= 0
##$ASSFACX= 0
##$ASSWID= 0
##$AUNMP= <proc_1d>
##$AZFE= 0.1
##$AZFW= 0.1
##$BCFW= 0
##$BC_mod= 0
##$BYTORDP= 0
##$COROFFS= 0
##$CY= 12.5
##$DATMOD= 1
##$DC= 0
##$DFILT= <>
##$DTYPP= 0
##$F1P= 14.0000005364418
##$F2P= -0.99999901652339
##$FCOR= 0.5
##$FTSIZE= 32768
##$FT_mod= 6
##$GAMMA= 0
##$GB= 0
##$INTBC= 1
##$INTSCL= 1
##$ISEN= 128
##$LB= 0.3
##$LEV0= 0
##$LPBIN= 0
##$MAXI= 10000
##$MC2= 0
##$MEAN= 0
##$ME_mod= 0
##$MI= 0
##$NCOEF= 0
##$NC_proc= -3
##$NLEV= 6
##$NOISF1= 0
##$NOISF2= 0
##$NSP= 0
##$NTH_PI= 0
##$NZP= 0
##$OFFSET= 16.522
##$PC= 1
##$PHC0= -64.62756
##$PHC1= 9.150573
##$PH_mod= 1
##$PKNL= yes
##$PPARMOD= 0
##$PSCAL= 4
##$PSIGN= 0
##$REVERSE= no
##$SF= 250.13
##$SI= 32768
##$SIGF1= 0
##$SIGF2= 0
##$SINO= 400
##$SIOLD= 32768
##$SREGLST= <1H.DMSO>
##$SSB= 0
##$STSI= 32768
##$STSR= 0
##$SW_p= 5175.98343685301
##$SYMM= 0
##$S_DEV= 0
##$TDeff= 65536
##$TDoff= 0
##$TI= <Analysis number 999999
Compound Code 99
Book Reference 9
Project Code 9>
##$TILT= no
##$TM1= 0
##$TM2= 0
##$TOPLEV= 0
##$USERP1= <user>
##$USERP2= <user>
##$USERP3= <user>
##$USERP4= <user>
##$USERP5= <user>
##$WDW= 1
##$XDIM= 32768
##$YMAX_p= 531540165
##$YMIN_p= -94916
$$ End of Bruker specific parameters
$$ ---------------------------------
##NTUPLES= NMR SPECTRUM
##VAR_NAME=  FREQUENCY,     SPECTRUM/REAL,   SPECTRUM/IMAG
##SYMBOL=    X,             R,               I
##VAR_TYPE=  INDEPENDENT,   DEPENDENT,       DEPENDENT
##VAR_FORM=  AFFN,          ASDF,            ASDF
##VAR_DIM=   32768,         32768,           32768
##UNITS=     HZ,            ARBITRARY UNITS, ARBITRARY UNITS
##FACTOR=    0.157963299565203, 1,           1
##FIRST=     4132.6476996994, 0,             0
##LAST=      -1043.33573715361, 0,           0
##MIN=       -1043.33573715361, -94916,      0
##MAX=       4132.6476996994, 531540165,     0
$$ Real data points
##PAGE= N=1
##DATA TABLE= (X++(R..R)), XYDATA
$$ [...]
$$ plain form
18634 23066 20314 10901 -7239 -2075 -710 4385 11534 11609 20998 17941 28985 23439 11366 12794
18620 12794 8457 9212 -8285 -6935 -17178 -21059 -20476 -37885 -18780 -3274 9361 8202 -6576
18607 -6576 -4815 7905 -9408 -8233 -14825 -41610 -40591 -15678 -8347 -19453 -13983 -13489 -26178
18594 -26178 -43604 -28793 3964 24663 37130 12035 -12813 -8929 -10674 11061 33983 27340
18582 27340 14015 18710 11114 19990 10762 10500 17237 12981 3780 8611 -14371 -11532 -4722 -19552
18568 -19552 -15266 -20351 -43405 -30638 -39343 -26335 5438 20035 18258 13418 -16573 -25239 -7372
18555 -7372 -9003 -30009 -13942 -2717 -3987 5186 23775 39127 44203 39278 27840 9936 -2167
18542 -2167 -1366 1043 5557 16924 9800 7292 3632 17337 27583 23715 27783 11779 -4451 -20664
$$ packed form
18634B3066k752r413j8140N164J365N095P149P5R389l057J1044n546j2073J428
18620A2794m337P55j7497J350j0243l881N83j7409J9105J5506J2635j159j4778
18607f576J761J2720j7313J175o592k6785J019K4913P331j1106N470M94j2689
18594b6178j7426J4811L2757K0699J2467k5095k4848L884j745K1735K2922o643
18582B7340j3325M695p596Q876r228k62O737m256r201M831k2982K839O810j4830
18568a9552M286n085k3054J2767q705J3008L1773J4597j777m840k9991q666J7867
18555g372j631k1006J6067J1225j270R173J8589J5352N076m925j1438j7904j2103
18542b167Q01K409M514J1367p124k508l660J3705J0246l868M068j6004j6230j6213
$$ plain form
18528 -20664 -27278 -8739 15458 21040 27935 10216 -9707 -4540 -1540 -16644 -17961 -7259 -10240
18515 -10240 -18584 -32469 -13722 3761 9478 31818 28272 -6125 -3677 -18819 -31086 -37388 -39906
18502 -39906 -21529 -9035 -11435 -6627 23603 21982 13807 -8040 -23628 -25430 -25450 -52779 -49601
18489 -49601 -46400 -27925 -17814 -23147 -6190 22975 29577 9017 -4547 -177 3159 -13793 -12665
18476 -12665 -13272 -40026 -38557 -31815 -31956 -32079 -32644 -38329 -31886 -6235 -13782 -47856 -19124 7196
18462 7196 12826 13344 6750 4509 -8096 -10352 1989 5603 4250 12092 9615 21003 21883 -6916
18448 -6916 -16513 -8696 -9444 -17066 -18142 -5728 2470 -6683 -1285 -6579 6705 12386 -1461 -14602
18434 -14602 -47026 -56911 -30418 -18754 -13166 -18255 -4247 16206 7662 -12420 3421 16473
$$ packed form
18528b0664o614J8539K4197N582O895j7719j9923N167L000j5104j317J0702k981
18515a0240q344j3885J8747J7483N717K2340l546l4397K448j5142j2267o302k518
18502c9906J8377J2494k400M808L0230j621q175k1847j5588j802k0k7329L178
18489d9601L201J8475J0111n333J6957K9165O602k0560j3564M370L336j6952J128
18476a2665o07k6754J469O742j41j23n65n685O443K5651p547l4074K8732K6320
18462G196N630N18o594k241j2605k256J2341L614j353P842k477J1388Q80k8799
18448f916r597P817p48p622j076J2414Q198r153N398n294J3284N681j3847j3141
18434a4602l2424r885K6493J1664N588n089J4008K0453q544k0082J5841J3052
$$ plain form
18422 16473 40944 30240 4331 9789 26498 38331 22144 4022 8723 14634 2655 3995
18410 3995 6666 19024 14115 2363 23518 17369 15900 -6604 -20334 -34883 -27832 -7198 -26024
18397 -26024 -16914 317 -4635 -6489 10121 22701 25858 26270 -2305 5346 25581 9597 20272
18384 20272 23123 39138 41534 44064 41324 42045 39013 23098 12958 25611 6674 11190 50335
18371 50335 55946 44718 46318 64414 72309 101285 143799 179043 199354 225386 209186 226460
18359 226460 222694 229051 238347 220408 202176 204136 215538 231811 263583 302438 331785 345263
18347 345263 355870 372281 374086 358134 340362 327276 317408 304993 249278 215047 206696 194110
18335 194110 213683 228901 229491 219313 227543 210104 178212 137791 103464 98957 56524 30285
$$ packed form
18422A6473K4471j0704k5909N458J6709J1833j6187j8122M701N911j1979J340
18410C995K671J2358m909j1752K1155o149j469k2504j3730j4549P051K0634j8826
18397b6024R110J7231m952j854J6610J2580L157M12k8575P651K0235j5984J0675
18384B0272K851J6015K396K530k740P21l032j5915j0140J2653j8937M516L9145
18371E0335N611j1228J600J8096P895K8976M2514L5244K0311K6032j6200J7274
18359B26460l766O357R296j7939j8232J960J1402J6273L1772L8855K9347J3478
18347C45263J0607J6411J805j5952j7772j3086r868j2415n5715l4231q351j2586
18335A94110J9573J5218N90j0178Q230j7439l1892m0421l4327m507m2433k6239
$$ plain form
18323 30285 29874 47360 47116 34156 44235 51185 22205 976 10349 1811 26397 7061 28126
18310 28126 60600 57306 49942 27240 23161 12663 5946 19581 30295 35495 26188 18897 11449
18297 11449 41467 42025 42855 41353 24592 29782 26633 46869 35497 4835 13781 40866 22018
18284 22018 -4895 -11457 -17991 -9297 -4214 598 4332 6960 2281 2089 18401 4641 12941 13909
18270 13909 3502 24478 6373 32858 49733 64585 66753 53340 38184 39847 74390 67625
18258 67625 54023 35286 42950 48550 46656 40660 6801 -12928 -708 -18176 -11956 10259 17762
18245 17762 492 -19354 8829 44085 54859 40295 5449 10906 12184 -4456 -9899 107
18233 107 2883 18278 21908 24422 37813 19969 8375 16523 21853 5683 15686 10406 9150
$$ packed form
18323C0285m11J7486k44j2960J0079O950k8980k1229R373q538K4586j9336K1065
18310B8126L2474l294p364k2702m079j0498o717J3635J0714N200r307p291p448
18297A1449L0018N58Q30j502j6761N190l149K0236j1372l0662Q946K7085j8848
18284B2018k6913o562o534Q694N083M812L734K628m679j92J6312j3760Q300R68
18270A3909j0407K0976j8105K6485J6875J4852K168j3413j5156J663L4543o765
18258F7625j3602j8737P664N600j894n996l3859j9729J2220j7468O220K2215P503
18245A7762j7270j9846K8183L5256J0774j4564l4846N457J278j6640n443J0006
18233A07K776J5395L630K514J3391j7844j1594Q148N330j6170J0003n280j256
$$ plain form
18220 9150 12795 37454 43295 15253 -26248 -28001 -7639 970 10001 3921 -22844 -19184 -46156
18207 -46156 -46490 -322 4221 15620 16668 -18693 -29941 -16514 -7285 4535 -5879 -14962 -16048
18194 -16048 -11541 -1962 -14474 -33149 -27184 -12393 -12488 -1728 14622 -3767 -24433 -28600 6382
18181 6382 4356 -4065 6675 2933 1940 3359 -18318 -42299 -30407 2167 -4101 -19866 -6763
18168 -6763 14567 22524 31776 18308 10003 -5435 17564 6323 -10471 15265 16286 12862 20431
18155 20431 25427 27962 27971 27039 3417 14560 39016 30008 6846 -4605 -10688 12813 21053 11146
18141 11146 10870 -2594 -1881 -2120 12998 30204 37265 12496 865 16022 25751 34502 24927 36786
18127 36786 27591 7318 -24778 -16085 12894 32784 35697 54538 43406 14243 -3393 19363
$$ packed form
18220I150L645K4659N841k8042m1501j753K0362Q609R031o080k6765L660k6972
18207d6156l34M6168M543J1399J048l5361j1248J3427R229J1820j0414r083j086
18194a6048M507R579j2512j8675N965J4791r5J0760J6350j8389k0666m167L4982
18181F382k026q421J0740l742r93J419k1677k3981J1892L2574o268j5765J3103
18168f763K1330P957R252j3468q305j5438K2999j1241j6794K5736J021l424P569
18155B0431M996K535Rr32k3622J1143K4456r008k3162j1451o083K3501Q240r907
18141A1146k76j3464P13k39J5118J7206P061k4769j1631J5157R729Q751r575J1859
18127C6786r195k0273l2096Q693K8979J9890K913J8841j1132k9163j7636K2756
$$ plain form
18115 19363 20484 25562 44737 32763 16946 12171 8181 -2626 20330 28727 10298 20990 22096
18102 22096 2336 4315 15380 1490 3915 35701 39951 16114 19878 27231 29672 36443 23784
18089 23784 19031 26419 35357 31200 31901 63072 59268 35829 29802 2627 -7524 -789 19306
18076 19306 30546 53394 70670 89690 92976 79913 78822 92659 86441 66739 35674 50695
18064 50695 32605 4101 -13913 -23988 -15457 2246 17023 27477 50977 71881 68117 66623
18052 66623 70881 63904 42617 54055 59968 52188 48627 28006 24309 23071 32999 35862 41543 52970
18038 52970 70949 65844 60505 50633 43932 38153 47990 76556 95162 67766 49681 95167 111182
18025 111182 106385 101583 92861 85796 87032 82602 92615 87947 60844 56651 75002 71007 68359
$$ packed form
18115A9363J121N078J9175j1974j5817m775l990j0807K2956Q397j8429J0692J106
18102B2096j9760J979J1065j3890K425L1786M250k3837L764P353K441O771j2659
18089B3784m753P388Q938m157P01L1171l804k3439o027k7175j0151O735K0095
18076A9306J1240K2848J7276J9020L286j3063j091J3837o218j9702l1065J5021
18064E0695j8090k8504j8014j0075Q531J7703J4777J0454K3500K0904l764j494
18052F6623M258o977k1287J1438N913p780l561k0621l697j238R928K863N681J1427
18038E2970J7979n105n339r872o701n779R837K8566J8606k7396j8085M5486J6015
18025A11182m797m802q722p065J236m430J0013m668k7103m193J8351l995k648
$$ plain form
18012 68359 80697 101894 81003 67155 51095 60804 79414 80911 54820 44862 33610 46219
18000 46219 46518 42387 35158 23799 18748 25588 26373 25670 1670 -267 -6392 8359 19111 5546
17986 5546 -5096 4979 15005 5114 20289 24994 24263 19140 408 -10741 6644 32761 41250
17973 41250 33056 33727 25662 34405 38471 35339 48934 68294 77945 66386 63146 50014 45471 50892
17959 50892 48476 50533 81406 118061 115152 89239 82899 72852 65716 90046 93768 91708 92071
17946 92071 81557 71411 80160 106839 129588 143923 150206 148306 133092 141954 148415 167108 185783
17933 185783 216254 236838 248121 298850 338909 339234 346514 323748 284497 266418 241554 254694
17921 254694 261979 276308 313531 366835 412804 415771 390073 387284 341173 289174 280998 293212
$$ packed form
18012F8359J2338K1197k0891j3848j6060R709J8610J497k6091r958j1252J2609
18000D6219K99m131p229j1359n051O840P85p03k4000j937o125J4751J0752j3565
17986E546j0642J0075J0026r891J5175M705p31n123j8732j1149J7385K6117Q489
17973D1250q194O71q065Q743M066l132J3595J9360R651j1559l240j3132m543N421
17959E0892k416K057L0873L6655k909k5913o340j0047p136K4330L722k060L63
17946I2071j0514j0146Q749K6679K2749J4335O283j900j5214Q862O461J8693J8675
17933A85783L0471K0584J1283N0729M0059L25P280k2766l9251j8079k4864J3140
17921B54694P285J4329L7223N3304M5969K967k5698k789m6111n1999q176J2214
$$ plain form
17909 293212 285082 287779 297857 342567 382857 410518 435675 436845 396705 361682 323057 304284
17897 304284 332912 365161 392812 432024 437003 473755 504752 485160 419600 394009 351349 338954
17885 338954 283403 260670 242341 218634 206028 232095 229565 230543 207350 208424 188916 185841
17873 185841 178763 180796 202055 201622 207088 207759 202933 205216 210534 222938 200535 180527 172245 150592
17859 150592 140160 143081 156592 161418 145997 126382 105998 124815 142417 177830 198310 201128
17847 201128 190001 204161 207089 201564 213594 229870 234673 234403 237152 231109 244932 253393 259626
17834 259626 267452 282322 281624 279253 274896 298882 312992 324794 353413 384454 391007 379864 387247
17821 387247 395088 413046 417427 414304 417599 441374 485218 526571 565775 616175 652919 690392
$$ packed form
17909B93212q130K697J0078M4710M0290K7661K5157J170m0140l5023l8625j8773
17897C04284K8628L2249K7651L9212M979L6752L0997j9592o5560k5591m2660j2395
17885C38954n5551k2733j8329k3707j2606K6067k530R78k3193J074j9508l075
17873A85841p078K033K1259m33N466O71m826K283N318J2404k2403k0008q282k1653
17859A50592j0432K921J3511M826j5421j9615k0384J8817J7602L5413K0480K818
17847B01128j1127J4160K928n525J2030J6276M803k70K749o043J3823Q461O233
17834B59626P826J4870o98k371m357K3986J4110J1802K8619L1041O553j1143P383
17821C87247P841J7958M381l123L295K3775M3844M1353L9204N0400L6744L7473
$$ plain form
17809 690392 757795 810592 872398 972309 1054101 1159844 1293633 1442337 1568063 1696850
17799 1696850 1826005 1938459 2060314 2192139 2297339 2463962 2742211 3100149 3552411
17790 3552411 4105242 4858206 5923956 7336851 9170449 11534625 14448651 17882790
17782 17882790 21817333 26309877 31126412 35996739 40167378 42805394 43563189 42642588
17774 42642588 41123063 38750726 36810160 36935226 39125813 43408414 49409061 56370208
17766 56370208 63027817 68488181 71845340 73016281 72166285 68041344 61711802 54993700
17758 54993700 48855686 42768158 37965554 35606891 35275520 36695321 39292269 42328907
17750 42328907 44502321 44911700 42879963 38806099 33670404 27068983 20561919 15466366
$$ packed form
17809F90392O7403N2797O1806R9911Q1792J05743J33789J48704J25726J28787
17799A696850J29155J12454J21855J31825J05200J66623K78249L57938M52262
17790C552411N52831P52964J065750J412895J833598K364176K914026L434139
17782A7882790L934543M492544M816535M870327M170639K638016P57795r20601
17774D2642588j519525k372337j940566J25066K190587M282601O000647O961147
17766E6370208O657609N460364L357159J170941q49996m124941o329542o718102
17758E4993700o138014o087528m802604k358663l31371J419801K596948L036638
17750D2328907K173414M09379k031737m073864n135695o601421o507064n095553
$$ plain form
17742 15466366 11645072 8945053 7123302 5867916 4966913 4281897 3753960 3312149 2894105
17733 2894105 2585681 2340185 2145305 2006218 1899369 1805029 1716451 1636221 1559374 1455108
17723 1455108 1307848 1172808 1033525 936970 840007 764570 713665 682194 631148 577577 537876
17712 537876 521494 501885 463780 436340 431817 399247 367621 341646 345080 353812 344150 341729
17700 341729 321856 299447 312616 312088 286827 275411 271505 289625 295969 265326 254784 242967
17688 242967 227441 204954 200203 201342 208420 190681 182554 185133 184976 157451 135061 133669 138554
17675 138554 151310 154381 176138 179904 186677 184948 149834 126759 101524 104843 129926 122912 119469
17662 119469 117478 106784 112474 101053 94493 98605 85673 100947 105408 111808 97539 92097 82590
$$ packed form
17742A5466366l821294k700019j821751j255386r01003o85016n27937m41811m18044
17733B894105l08424k45496j94880j39087j06849r4340q8578q0230p6847j04266
17723A455108j47260j35040j39283r6555r6963p5437n0905l1471n1046n3571l9701
17712E37876j6382j9609l8105k7440m523l2570l1626k5975L434Q732r662k421
17700C41729j9873k2409J3169n28k5261j1416l906J8120O344l0643j0542j1817
17688B42967j5526k2487m751J139P078j7739q127K579j57k7525k2390j392M885
17675A38554J2756L071K1757L766O773j729l5114k3075k5235L319K5083p014l443
17662A19469j991j0694N690j1421o560M112j2932J5274M461O400j4269n442r507
$$ plain form
17649 82590 73263 71843 67333 51136 50702 74736 109221 134469 141591 131246 73995 60343 52564
17636 52564 55983 77236 90710 82403 77092 63185 83364 103245 90976 60473 68409 76007 78221
17623 78221 70618 66730 54585 35570 47101 50679 67166 73322 82865 68021 34102 17037 38405
17610 38405 61100 56985 23317 11716 21340 39058 41806 58911 55500 48644 56979 45528 -877
17597 -877 -37523 -15723 -10956 -8593 -13320 -10550 -1078 15414 27154 32336 26712 14244 -9652
17584 -9652 -18178 -3442 -19245 14091 42380 42850 42064 47347 51335 34299 24056 38392 33339
17571 33339 25795 25235 18870 40215 53407 60112 39791 46795 65858 77189 95729 93599 89199
17558 89199 84752 84197 71124 77873 72389 58691 73347 76199 86192 78228 73906 62582 57989 54143
$$ packed form
17649H2590r327j420m510j6197m34K4034L4485K5248P122j0345n7251j3652p779
17636E2564L419K1253J3474q307n311j3907K0179J9881j2269l0503P936P598K214
17623G8221p603l888j2145j9015J1531L578J6487O156R543j4844l3919j7065K1368
17610C8405K2695m115l3668j1601R624J7718K748J7105l411o856Q335j1451m6405
17597h77l6646K1800M767K363m727K770R472J6492J1740N182n624j2468k3896
17584i652q526J4736j5803L3336K8289M70p86N283L988j7036j0243J4336n053
17571C3339p544n60o365K1345J3192O705k0321P004J9063J1331J8540k130m400
17558H9199m447n55j3073O749n484j3698J4656K852R993p964m322j1324m593l846
$$ plain form
17544 54143 71075 86781 107776 114611 95943 99959 93277 110759 116232 129522 126068 115636 124330
17531 124330 151162 138441 121326 96033 100596 109619 89070 71336 75396 90239 103371 118326
17519 118326 152907 157781 155529 169832 176558 189264 206258 219412 200608 194435 202580 208494 188509
17506 188509 159810 148341 143298 150745 165515 190517 196275 166733 152455 158223 162305 172698
17494 172698 163672 170453 176925 182924 206470 227988 220800 201284 162694 150079 167656 172666 142431
17481 142431 134643 153326 140824 136812 161496 195705 180198 149734 128757 136795 144037 140687
17469 140687 144779 145302 165172 144165 123724 119427 131079 112531 105968 126973 127741 109439 102710
17456 102710 97033 122773 128483 115934 110590 124983 138339 171410 186836 189381 190630 203012
$$ packed form
17544E4143J6932J5706K0995O835j8668M016o682J7482N473J3290l454j0432Q694
17531A24330K6832j2721j7115k5293M563R023k0549j7734M060J4843J3132J4955
17519A18326L4581M874k252J4303O726J2706J6994J3154j8804o173Q145N914j9985
17506A88509k8699j1469n043P447J4770K5002N758k9542j4278N768M082J0393
17494A72698r026O781O472N999K3546K1518p188j9516l8590j2615J7577N010l0235
17481A42431p788J8683j2502m012K4684L4209j5507l0464k0977Q038P242l350
17469A40687M092N23J9870k1007k0441m297J1652j8548o563K1005P68j8302o729
17456A02710n677K5740N710j2549n344J4393J3356L3071J5426K545J249J2382
$$ plain form
17444 203012 197108 160169 163127 190532 224934 246807 268082 281313 273308 288318 316914 316248
17432 316248 305122 333018 340645 332165 328277 330759 380038 424833 436877 443273 480807 535337
17420 535337 570317 590568 621380 656818 708874 761413 836078 896035 967565 1042537 1125919
17409 1125919 1240799 1359055 1461681 1558894 1654528 1764778 1858737 1959258 2133234 2354848
17399 2354848 2660207 3019827 3468427 4049318 4798685 5869685 7487248 9925140 13419538
17390 13419538 17884459 22621473 27139885 32187132 38991624 47586891 54593050 55209379
17382 55209379 47579484 36294718 28497728 25776937 26439998 28634013 31440227 35320312
17374 35320312 41200884 48736243 54294690 53264118 44371975 32709585 24922169 22092980
$$ packed form
17444B03012n904l6939K958K7405L4402K1873K1275J3231q005J5010K8596o66
17432C16248j1126K7896P627q480l888K482M9279M4795J2044O396L7534N4530
17420E35337L4980K0251L0812L5438N2056N2539P4665N9957P1530P4972Q3382
17409A125919J14880J18256J02626R7213R5634J10250R3959J00521J73976K21614
17399B354848L05359L59620M48600N80891P49367J071000J617563K437892L494398
17390A3419538M464921M737014M518412N047247O804492Q595267P006159O16329
17382E5209379p629895j1284766p796990k720791O63061K194015K806214L880085
17374C5320312N880572P535359N558447j030572q892143j1662390p787416k829189
$$ plain form
17366 22092980 22830252 25727754 29346208 33222582 38241504 45593616 54415309 60134227
17358 60134227 57937570 47375870 35312089 28242363 26304033 27411911 29698978 32563103
17350 32563103 36746581 43045806 50169644 53677459 49462033 37743880 24923480 16155714
17342 16155714 11068009 8120569 6307821 5140726 4353674 3840619 3510753 3254084 2995132
17333 2995132 2688090 2336923 2015588 1773936 1627531 1532510 1459271 1402132 1394333 1384977 1338748
17322 1338748 1242752 1098015 955500 805125 706374 644419 594746 557773 542695 499304 452875
17311 452875 448877 449075 420647 421051 417673 404464 392633 371870 362355 333724 302810 273057 252517
17298 252517 221216 205530 216281 218624 216206 227965 237712 219037 184688 186182 184030 174026
$$ packed form
17366B2092980P37272K897502L618454L876374N018922P352112Q821693N718918
17358F0134227k196657j0561700j2063781p069726j938330J107878K287067K864125
17350C2563103M183478O299225P123838L507815m215426j1718153j2820400q767766
17342A6155714n087705k947440j812748j167095p87052n13055l29866k56669k58952
17333B995132l07042l51167l21335k41652j46405r5021p3239n7139p799r356m6229
17322A338748r5996j44737j42515j50375r8751o1955m9673l6973j5078m3391m6429
17311D52875l998J98k8428M04l378j3209j1831k0763r515k8631l0914k9753k0540
17298B52517l1301j5686J0751K343k418J1759R747j8675l4349J494k152j0004
$$ plain form
17286 174026 177457 175271 158122 166637 170258 188156 173038 151935 134572 121112 112742 124705
17274 124705 128954 124741 95918 116482 118574 119455 127395 112553 84479 58862 53303 41797 50364
17261 50364 59365 51807 64553 91013 101899 73607 72948 63486 41527 36544 55248 72075 54140
17248 54140 52952 62011 49750 42793 34059 28501 36326 53244 41734 47455 61493 73000 60156
17235 60156 31352 4987 16465 17934 1958 -13781 -25308 -292 39055 57622 52015 24584
17223 24584 1179 -11107 -12735 -6145 -11583 -24130 -14521 25908 51528 54911 43344 25785 26793
17210 26793 34430 21109 26439 12610 16186 38455 64111 84300 89304 101234 120130 150378
17198 150378 175975 201311 214133 195174 195689 217495 241672 271461 303207 346274 377862 411127
$$ packed form
17286A74026L431k186j7149Q515L621J7898j5118k1103j7363j3460q370J1963
17274A24705M249m213k8823K0564K092Q81P940j4842k8074k5617n559j1506Q567
17261E0364R001p558J2746K6460J0886k8292o59r462k1959m983J8704J6827j7935
17248E4140j188R059j2261o957q734n558P825J6918j1510N721J4038J1507j2844
17235F0156k8804k6365J1478J469j5976j5739j1527K5016L9347J8567n607k7431
17223B4584k3405j2286j628O590n438j2547R609M0429K5620L383j1567j7559J008
17210B6793P637j3321N330j3829L576K2269K5656K0189N004J1930J8896L0248
17198A50378K5597K5336J2822j8959N15K1806K4177K9789L1746M3067L1588L3265
$$ plain form
17186 411127 472255 489175 526278 518753 479231 420692 387688 375669 377579 397017 424074 431523
17174 431523 461663 491222 506423 520830 519770 485350 444885 402248 368160 310277 279794 259576
17162 259576 261365 278045 285742 278379 248253 202569 169626 149215 142464 126617 114890 112016
17150 112016 82220 80983 60167 64451 83453 84792 81754 46537 22564 3039 27758 69594
17138 69594 83995 80074 91167 67428 22057 13159 46858 50079 45172 41639 32424 35761 22149
17125 22149 23771 6771 -1938 38900 72284 73371 72936 59920 42537 19305 37493 42232 35248
17112 35248 17134 18371 17678 8296 13288 12921 8577 20263 21854 41905 30172 30752 28203 38347
17098 38347 34017 35804 26074 35117 -837 -30633 -12874 -91 5418 -4554 -16631 -12800 -11121
$$ packed form
17186D11127O1128J6920L7103p525l9522n8539l3004j2019J910J9438K7057P449
17174D31523L0140K9559J5201J4407j060l4420m0465m2637l4088n7883l0483k0218
17162B59576J789J6680P697p363l0126m5684l2943k0411o751j5847j1727k874
17150A12016k9796j237k0816M284J9002J339l038l5217k3973j9525K4719M1836
17138F9594J4401l921J1093k3739m5371q898L3699L221m907l533r215L337j3612
17125B2149J622j7000q709M0838L3384J087m35j3016j7383k3232J8188M739o984
17112C5248j8114J237o93r382M992l67m344J1686J591K0051j1733N80k549J0144
17098C8347m330J787r730R043l5954k9796J7759J2783N509r972j2077L831J679
$$ plain form
17085 -11121 -16551 -18857 -14689 -17524 -37083 -12509 -9566 -24023 -32415 -40677 -28744 -22460 -29635
17072 -29635 -24992 -27605 -19113 -18689 -17871 -29127 -46311 -39722 -16433 1603 17677 34501 24937
17059 24937 9042 10434 10203 20821 20514 -10703 -36142 -28662 -6119 14643 3982 -11170 -16672
17046 -16672 -25311 -25945 -32846 -23437 -18938 -21624 -45381 -68221 -34710 -425 15711 -7216 -19009
17033 -19009 -15076 -19433 -11209 32818 48936 44474 33089 10073 -7414 -9135 -9871 2041 20668
17020 20668 22100 1059 -7884 -5716 -11576 -8811 -29420 -34318 -11653 -25944 -49185 -23927 -25239
17007 -25239 -26204 -23345 -11981 10270 -357 3074 3757 -20822 -42385 -49105 -34750 -3805 -3922
16994 -3922 9774 -1748 -1534 4408 -26128 -48503 -46861 -20828 -2578 -7456 -30221 -23041 -16218
$$ packed form
17085a1121n430k306M168k835j9559K4574K943j4457q392q262J1933O284p175
17072b9635M643k613Q492M24Q18j1256j7184O589K3289J8036J6074J6824r564
17059B4937j5895J392k31J0618l07l1217k5439P480K2543K0762j0661j5152n502
17046a6672q639o34o901R409M499k686k3757k2840L3511L4285J6136k2927j1793
17033a9009L933m357Q224M4027J6118m462j1385k3016j7487j721p36J1912J8627
17020B0668J432k1041q943K168n860K765k0609m898K2665j4291k3241K5258j312
17007b5239r65K859J1364K2251j0627L431O83k4579k1563o720J4355L0945j17
16994c922J3696j1522K14N942l0536k2375J642K6033J8250m878k2765P180O823
$$ plain form
16981 -16218 -9420 1857 43040 52453 25405 -2829 -4644 3574 3475 19470 23733 18489 -12165
16968 -12165 -29589 5342 17942 19111 21711 13045 -13482 -13951 3520 -4699 -30041 -38837 -14631
16955 -14631 1650 9426 13032 3394 -10069 -19446 -24782 -32475 -25705 -26822 -4657 -7195 -15845 2001
16941 2001 15450 5501 -277 -988 -12694 -17897 -15686 -19116 -1090 2548 -5843 -1916 -5751 3958
16927 3958 -3749 -7134 -8615 3347 8136 7872 -5016 -18193 -44549 -30527 -33496 -45175 -64011
16914 -64011 -56337 -35614 -28643 -21733 9176 5714 -3348 -614 -9680 -23851 -22492 -23438 -18503 -15637
16900 -15637 -3881 526 -14248 6475 21850 15885 21287 3894 -13337 -13504 -8386 -6358 -5691
16887 -5691 -4007 1789 9222 27002 1280 787 -1585 -6357 4286 -14341 -8483 -1363 865 22034
$$ packed form
16981a6218O798J1277M1183R413k7048k8234j815Q218r9J5995M263n244l0654
16968a2165j7424L4931J2600J169K600q666k6527m69J7471q219k5342q796K4206
16955a4631J6281P776L606r638j3463r377n336p693O770j117K2165k538q650J7846
16941B001J3449r949n778p11j1706n203K211l430J8026L638q391L927l835R709
16927C958p707l385j481J1962M789k64j2888j3177k6356J4022k969j1679j8836
16914f4011P674K0723O971O910L0909l462r062K734r066j4171J359r46M935K866
16900a5637J1756M407j4774K0723J5375n965N402j7393j7231j67N118K028O67
16887e691J684N796P433J7780k5722m93k372m772J0643j8627N858P120K228K1169
$$ plain form
16873 22034 10462 -10961 -24075 -44195 -46096 -50403 -71561 -68272 -54208 -46293 -22797 2
16861 2 -8995 -38377 -35421 -10263 3041 -6741 264 28546 26673 28195 15506 15140 29901 25850
16847 25850 37688 53262 24258 13930 3525 34325 76324 92727 121925 154427 175920 179517
16835 179517 221539 260400 262978 209768 158320 143747 136607 126194 139654 177320 193252 211807
16823 211807 218461 244817 249474 234137 198387 170502 166417 165286 193605 196964 207243 214460 236084
16810 236084 293128 320560 314337 288281 236494 188744 170490 191369 214359 234120 270650 291215
16798 291215 290564 282411 235840 156828 93000 69341 55284 42912 39799 37270 -149 -8105 9372
16785 9372 9931 3112 -1969 11046 16570 6224 18980 41837 61709 83386 121826 142179 171018
$$ packed form
16873B2034j1572k1423j3114k0120j901m307k1158L289J4064P915K3496K2799
16861Bq997k9382K956K5158J3304r782P005K8282j873J522j2689l66J4761m051
16847B5850J1838J5574k9004j0328j0405L0800M1999J6403K9198L2502K1493L597
16835A79517M2022L8861K578n3210n1448j4573p140j0413J3460L7666J5932J8555
16823B11807O654K6356M657j5337l5750k7885m085j131K8319L359J0279P217K1624
16810B36084N7044K7432o223k6056n1787m7750j8254K0879K2990J9761L6530K0565
16798B91215o51q153m6571p9012o3828k3659j4057j2372l113k529l7419p956J7477
16785I372N59o819n081J3015N524j0346J2756K2857J9872K1677L8440K0353K8839
$$ plain form
16772 171018 184657 191773 250495 295488 321372 314084 272432 219745 155922 125658 110225 119118
16760 119118 124116 128810 160999 194909 188473 189445 209746 222553 244919 259214 242892 226305
16748 226305 208532 218713 221716 250827 280274 278733 232724 213376 198600 160421 126597 116100
16736 116100 138912 153974 149756 134367 147996 164893 192597 226534 280711 284820 243753 199059
16724 199059 136563 75836 53878 25621 28236 36570 27558 25300 35930 16223 29666 13785
16712 13785 -25229 -16409 5764 12170 8074 19646 -2240 -2247 5725 6799 15466 13570 31541 41756
16698 41756 51955 33756 12608 21232 27451 5694 21862 22060 26253 7389 682 3977 9396
16685 9396 2883 585 8761 6055 11006 -12773 -27877 -31184 -8151 -32245 -49638 -40985 -33239
$$ packed form
16772A71018J3639P116N8722M4993K5884p288m1652n2687o3823l0264j5433Q893
16760A19118M998M694L2189L3910o436R72K0301J2807K2366J4295j6322j6587
16748B26305j7773J0181L003K9111K9447j541m6009j9348j4776l8179l3824j0497
16736A16100K2812J5062m218j5389J3629J6897K7704L3937N4177M109m1067m4694
16724A99059o2496o0727k1958k8257K615Q334r012k258J0630j9707J3443j5881
16712A3785l9014Q820K2173O406m096J1572k1886pP972J074Q667j896J7971J0215
16698D1756J0199j8199k1148Q624O219k1757J6168J98M193j8864o707L295N419
16685I396o513k298Q176k706M951k3779j5104l307K3033k4094j7393Q653P746
$$ plain form
16672 -33239 -22342 -6179 8942 27098 5003 -1921 34807 37138 13131 28152 32641 25721
16660 25721 16335 -2489 2248 2683 9476 26562 47740 36424 11826 9606 19916 12547 1328
16647 1328 3653 -23453 -35921 -12884 10942 -1746 -13430 -8910 -4937 -4520 -15188 -20775 -15003
16634 -15003 -24294 -12961 3106 24420 37706 26854 25170 25205 34869 26550 -8774 -30181 -19170
16621 -19170 3041 12051 26740 4630 -2023 -12557 -32802 -24921 -15601 -2761 3141 -20723 -8336
16608 -8336 -23975 -39721 -25360 -11733 24647 31143 9863 -2662 -12329 3354 22570 -979
16596 -979 -11655 -11682 -11670 -8666 -3643 -2151 -12532 -30615 -23991 -21154 -32537 -21356 -12171 4819
16582 4819 17033 32189 29789 32967 17250 12925 24098 6684 -6033 -14663 -4513 12694 -391
$$ packed form
16672c3239J0897J6163J5121J8156k2095o924L6728K331k4007J5021M489o920
16660B5721r386j8824M737M35O793J7086K1178j1316k4598k220J0310p369j1219
16647A328K325k7106j2468K3037K3826j2688j1684M520L973M17j0668n587N772
16634a5003r291J1333J6067K1314J3286j0852j684L5R664q319l5324k1407J1011
16621a9170K2211R010J4689k2110o653j0534k0245P881R320J2840N902k3864J2387
16608h336j5639j5746J4361J3627L6380O496k1280j2525r667J5683J9216k3549
16596i79j0676k7J2L004N023J492j0381j8083O624K837j1383J1181R185J6990
16582D819J2214J5156k400L178j5717m325J1173j7414j2717q630J0150J7207j3085
$$ plain form
16569 -391 -721 37 26957 33316 15714 -20960 -20451 872 -11846 6403 28881 35973 48110 27879
16555 27879 12742 21901 35453 15331 11262 11272 28841 30608 35564 33059 5469 -25391 -37765
16542 -37765 -37516 -19304 -1319 14876 28977 35887 17502 5026 -2827 -10270 -4887 -1374 11747
16529 11747 17603 19752 38133 38315 15589 30836 55783 49843 21723 26872 13058 14192 35691
16516 35691 38426 37080 27486 14609 -9487 -8869 4831 14362 27359 57641 56963 29518 18780
16503 18780 34077 64674 70684 56162 58305 72478 50352 36688 44822 47446 54251 60033 67505
16490 67505 73956 78584 67414 53492 32951 19142 23310 23378 20172 14365 27267 25598 36447
16477 36447 48300 27806 -2833 19248 54355 64756 65716 65133 51386 34736 27499 41456 55655
$$ packed form
16569c91l30P58K6920O359j7602l6674N09K1323j2718J8249K2478P092J2137k0231
16555B7879j5137R159J3552k0122m069J0J7569J767M956k505k7590l0860j2374
16542c7765K49J8212J7985J6195J4101O910j8385j2476p853p443N383L513J3121
16529A1747N856K149J8381J82k2726J5247K4947n940k8120N149j3814J134K1499
16516C5691K735j346r594j2877k4096O18J3700R531J2997L0282o78k7445j0738
16503A8780J5297L0597O010j4522K143J4173k2126j3664Q134K624O805N782P472
16490F7505O451M628j1170j3922k0541j3809M168O8l206n807J2902j669J0849
16477C6447J1853k0494l0639K2081L5107J0401R60n83j3747j6650p237J3957J4199
$$ plain form
16464 55655 61230 66974 33290 43274 76221 68008 58976 58370 41950 33252 46818 49194 33416
16451 33416 32739 38988 37571 16149 17039 36938 60765 55638 61798 50952 52554 34294 22784
16438 22784 16621 -1439 -18694 4923 28092 25760 26491 29165 16780 7758 17755 14367 28361
16425 28361 37815 33713 47792 60068 29252 42795 60572 59632 51959 42724 47754 39472 23715
16412 23715 25385 32952 46442 38575 33534 30452 36623 58663 65256 67881 84675 64161 83001
16399 83001 83331 72908 62866 64211 52504 42043 54628 53625 49259 52656 47552 43007 61024
16386 61024 63024 62404 53450 31886 27290 38377 65592 54661 50521 34719 49738 55229 73439
16373 73439 69881 78430 86839 78885 86603 74911 71471 70009 68212 76046 109761 143378 132132
$$ packed form
16464E5655N575N744l3684R984L2947q213r032o06j6420q698J3566K376j5778
16451C3416o77O249j417k1422Q90J9899K3827n127O160j0846J602j8260j1510
16438B2784o163j8060j7255K3617K3169k332P31K674j2385r022R997l388J3994
16425B8361R454m102J4079J2276l0816J3543J7777r40p673r235N030q282j5757
16412B3715J670P567J3490p867n041l082O171K2040O593K625J6794k0514J8840
16399H3001L30j0423j0042J345j1707j0461J2585j003m366L397n104m545J8017
16386F1024K000o20q954k1564m596J1087K7215j0931m140j5802J5019N491J8210
16373G3439l558Q549Q409p954P718j1692l440j462j797P834L3715L3617j1246
$$ plain form
16360 132132 111423 94082 99471 121980 166091 198626 209454 187201 178466 177843 178919 157046
16348 157046 119653 99959 101759 104892 100939 93749 106734 111225 121384 147171 162844 163771 146579
16335 146579 154598 150139 151243 152025 166036 196646 188546 179112 197128 203933 165746 126780 134123
16322 134123 147255 152171 146913 131567 112332 80774 86185 137041 175729 183969 151876 146548
16310 146548 169246 170085 170777 137994 119054 120826 136819 152542 160968 166158 154273 147334 113913
16297 113913 134817 163974 166431 185965 196704 202319 185253 185990 189286 180636 180949 174975 189224
16284 189224 204976 223641 232284 234238 247774 255124 225625 219627 230906 235043 247581 283301
16272 283301 313727 343103 346656 359413 361021 367595 387768 405954 438742 451175 483394 523947
$$ packed form
16360A32132k0709j7341N389K2509M4111L2535J0828k2253q735o23J076k1873
16348A57046l7393j9694J800L133l953p190J2985M491J0159K5787J5673R27j7192
16335A46579Q019m459J104P82J4011L0610q100r434J8016O805l8187l8966P343
16322A34123J3132M916n258j5346j9235l1558N411N0856L8688Q240l2093n328
16310A46548K2698Q39O92l2783j8940J772J5993J5723Q426N190j1885o939l3421
16297A13913K0904K9157K457J9534J0739N615j7066P37L296q650L13n974J4249
16284A89224J5752J8665Q643J954J3536P350k9499n998J1279M137J2538L5720
16272B83301L0426K9376L553J2757J608O574K0173J8186L2788J2433L2219M0553
$$ plain form
16260 523947 543065 600163 670255 712749 759113 852652 928779 1008475 1117565 1214563 1309098
16249 1309098 1413947 1488796 1539527 1570927 1617163 1756553 1943697 2172447 2459306 2771363
16239 2771363 3177428 3745184 4495944 5535318 7080131 9491719 13013655 17708411 22702078
16230 22702078 27053865 31696896 38230963 47538290 56143835 57763388 48998992 33958122
16222 33958122 22874067 17057956 14446890 13885107 15030687 17787763 21918181 26462635
16214 26462635 30695180 35527529 42381371 51882801 60633128 63229448 57142509 46914314
16206 46914314 40651076 38594987 39818806 44488762 52019425 57614173 55801513 44640628
16198 44640628 30589286 21409984 16629815 14372215 13825292 14894004 17523102 21360840
$$ packed form
16260E23947J9118N7098P0092M2494M6364R3539P6127P9696J09090R6998R4535
16249A309098J04849P4849N0731L1400M6236J39390J87144K28750K86859L12057
16239B771363M06065N67756P50760J039374J544813K411588L521936M694756M993667
16230B2702078M351787M643031O534067R307327Q605545J619553q764396j5040870
16222C3958122j1084055n816111k611066n61783J145580K757076M130418M544454
16214B6462635M232545M832349O853842R501430Q750327K596320o086939j0228195
16206D6914314o263238k056089J223819M669956P530663N594748j812660j1160885
16198D4640628j4051342r179302m780169k257600n46923J068712K629098L837738
$$ plain form
16190 21360840 25270951 28825106 33178362 39698924 48251235 53936902 51564850 39532828
16182 39532828 25176173 16030742 11029278 8147534 6339138 5148795 4285662 3642929
16174 3642929 3202794 2883015 2654970 2477913 2288460 2051128 1810063 1594301 1460182
16165 1460182 1367538 1305729 1277055 1216369 1133532 1023511 936127 899876 883577 872154 823646
16154 823646 752952 684317 625558 566876 511470 469401 468052 460420 442698 415950 393812 372842
16142 372842 353077 325562 286500 277859 272787 261073 250987 262344 279356 267780 257803 238865
16130 238865 223510 200198 191362 191416 174303 186510 165009 130455 123432 130742 147945 144126 154088
16117 154088 153208 148009 153933 145421 143000 145112 152267 152149 133954 133055 137419 114868 94773 99750
$$ packed form
16190B1360840L910111L554155M353256O520562Q552311N685667k372052j2032022
16182C9532828j4356655r145431n001464k881744j808396j190343q63133o42733
16174C642929m40135l19779k28045j77057j89453k37332k41065k15762j34119
16165A460182r2644o1809k8674o0686q2837j10021q7384l6251j6299j1423m8508
16154H23646p0694o8635n8759n8682n5406m2069j349p632j7722k6748k2138k0970
16142C72842j9765k7515l9062q641n072j1714j0086J1357J7012j1576r977j8938
16130B38865j5355k3312q836N4j7113J2207k1501l4554p023P310J7203l819R962
16117A54088q80n199N924q512k421K112P155j18j8195q99M364k2551k0095M977
$$ plain form
16103 99750 94066 103227 116930 120983 103647 57204 50352 78316 95845 86285 92128 97668 94194
16090 94194 80613 85476 100642 96086 84038 76671 76187 89966 101272 99424 80484 83604 114486
16077 114486 153578 154400 152909 163477 175627 175385 166146 147446 132805 164357 165381 165452 164036 152299
16063 152299 166583 214184 292811 348628 339449 299799 231125 146881 94506 90779 131385 156706
16051 156706 167098 151128 161522 171447 190901 218545 192037 140844 136282 109088 91022 96701
16039 96701 81933 43524 28069 18084 37018 38084 38154 39629 39528 45269 66097 58473 28791 17374
16025 17374 17851 25435 20919 36383 29830 14242 18887 33578 48787 51435 43023 40529 11942
16012 11942 -5459 -6487 -7675 15815 10461 2524 10337 2280 16069 17414 24037 36486 36357 42717
$$ packed form
16103I9750n684R161J3703M053j7336m6443o852K7964J7529r560N843N540l474
16090I4194j3581M863J5166m556j2048p367m84J3779J1306j848j8940L120L0882
16077A14486L9092Q22j491J0568J2150k42r239j8700j4641L1552J024P1j416j1737
16063A52299J4284M7601P8627N5817r179l9650o8674q4244n2375l727M0606K5321
16051A56706J0392j5970J0394R925J9454K7644k6508n1193m562k7194j8066N679
16039I6701j4768l8409j5455r985J8934J066P0J475j01N741K0828p624k9682j1417
16025A7374M77P584m516J5464o553j5588M645J4691J5209K648q412k494k8587
16012A1942j7401j028j188K3490n354p937P813q057J3789J345O623J2449j29O360
$$ plain form
15998 42717 43854 21874 10901 -7344 -17698 -3762 19178 21563 44713 36394 35926 33593 9255
15985 9255 5445 2877 11731 11036 33740 43794 69352 78975 77487 51417 38072 35126 28779 32116
15971 32116 32965 48751 68175 49578 39572 49060 23821 19249 -3059 1012 16509 27547 31071
15958 31071 20793 27501 26110 11500 19759 10314 -3108 858 6061 12007 21903 18388 3722
15945 3722 -183 -1797 -25146 -38921 -32770 -23270 -16796 -2660 24270 27085 25504 16537 2765
15932 2765 -8520 -14206 -26041 -25493 -32043 -30534 -33113 -10309 12354 -34493 -47433 -21617 -32873
15919 -32873 -57643 -58842 -38862 -17032 1491 6634 -13579 -34043 -22869 11735 13173 -11146
15907 -11146 -16627 -24865 -35482 -17976 -19098 -13537 -8450 -2158 -17221 5388 6410 2465 6348
$$ packed form
15998D2717J137k1980j0973j8245j0354J3936K2940K385K3150q319m68k333k4338
15985I255l810k568Q854o95K2704J0054K5558R623j488k6070j3345k946o347L337
15971C2116Q49J5786J9424j8597j0006R488k5239m572k2308M071J5497J1038L524
15958C1071j0278O708j391j4610Q259r445j3422L966N203N946R896l515j4666
15945C722l905j614k3349j3775O151R500O474J4136K6930K815j581q967j3772
15932B765j1285n686j1835N48o550J509k579K2804K2663m6847j2940K5816j1256
15919c2873k4770j199J9980K1830J8523N143k0213k0464J1174L4604J438k4319
15907a1146n481q238j0617J7506j122N561N087O292j5063K2609J022l945L883
$$ plain form
15894 6348 -837 12413 1242 -27956 -12214 15822 5413 16061 32165 3374 -26314 -27594
15882 -27594 -9348 -25645 -53267 -51271 -49678 -36759 -5131 16377 2784 -2678 -19211 -18448 -32284
15869 -32284 -40827 -36145 -23028 -28696 -8615 751 -14320 4069 -7682 -7566 -12593 -4761 8473
15856 8473 -2098 -10046 -7746 -26841 -27357 -13426 9890 30619 -349 -18890 -13307 -26720 -31661
15843 -31661 -32556 -30094 2715 15285 36985 46062 34266 2085 -6722 6867 10314 15199 10689
15830 10689 19389 38987 38561 16358 30468 55583 42755 58324 39973 -8266 -10269 -5113 11022
15817 11022 5180 -9362 -477 27979 25657 19663 5146 -13229 -15296 12900 4541 -3061 878
15804 878 3030 -17863 -17060 23606 61623 54297 32361 24059 24796 12119 15246 22320 31000 38616
$$ packed form
15894F348p185J3250j1171k9198J5742K8036j0409J0648J6104k8791k9688j280
15882b7594J8246j6297k7622J996J593J2919L1628K1508j3593n462j6533P63j3836
15869c2284q543M682J3117n668K0081R366j5071J8389j1751J16n027P832J3234
15856H473j0571p948K300j9095n16J3931K3316K0729l0968j8541N583j3413m941
15843c1661q95K462L2809J2570K1700R077j1796l2181q807J3589L447M885m510
15830A0689Q700J9598m26k2203J4110K5115j2828J5569j8351m8239k003N156J6135
15817A1022n842j4542Q885K8456k322n994j4517j8375k067K8196q359p602L939
15804H78K152k0893Q03M0666L8017p326k1936q302P37j2677L127P074Q680P616
$$ plain form
15790 38616 19764 -7516 -14041 -11274 6578 17173 25945 38466 20419 9974 12944 12270 -942
15777 -942 -9428 -9126 -12006 -2719 4606 -6687 -5198 13811 33949 43217 48481 34081 15809 -1179
15763 -1179 -2412 9430 13992 24553 36011 30275 26724 13786 26926 47375 48491 13887 456
15750 456 -21831 -26256 18616 24896 14580 29676 10679 -11060 -9758 -11083 3490 3303 21185
15737 21185 30639 33584 26699 -12508 -23878 -40279 -43573 -36194 -46834 -55970 -7570 21995 -258
15724 -258 -5204 -15444 -28846 -47182 -11444 18331 3907 -14105 8866 13023 3996 9590 5431
15711 5431 20958 6233 6085 -10100 -20787 4410 25692 3581 -22971 -27069 -11758 -19042 -23439
15698 -23439 -21394 -40405 -37456 -9254 12651 33262 46173 34937 6315 6672 24153 39466
$$ packed form
15790C8616j8852k7280o525K767J7852J0595Q772J2521j8047j0445K970o74j3212
15777i42q486L02k880R287P325j1293J489J9009K0138R268N264j4400j8272j6988
15763a179j233J1842M562J0561J1458n736l551j2938J3140K0449J116l4604j3431
15750D56k2287m425M4872O280j0316J5096j8997k1739J302j325J4573j87J7882
15737B1185R454K945o885l9207j1370j6401l294P379j0640r136M8400K9565k2253
15724b58m946j0240j3402j8336L5738K9775j4424j8012K2971M157r027N594m159
15711E431J5527j4725j48j6185j0687K5197K1282k2111k6552m098J5311p284m397
15698b3439K045j9011K949K8202K1905K0611J2911j1236k8622L57J7481J5313
$$ plain form
15686 39466 26053 26952 66737 109740 131713 148853 167007 201374 254646 274356 266297 238516
15674 238516 198488 128584 101946 116956 118140 124034 120891 126693 155940 177118 190875 230859
15662 230859 249111 282757 305301 302655 264110 231224 217986 232042 240028 266463 275812 236110
15650 236110 184985 119686 89737 67945 57467 51244 31660 51488 107081 122155 129723 189501
15638 189501 248844 270596 272270 245164 171567 120155 80634 53257 39897 43226 53062 62129
15626 62129 42960 18165 15914 -6176 -20867 -21563 -34286 -29276 -20533 -45595 -65651 -71650 -51265
15613 -51265 -40613 -44632 -35166 -49255 -64250 -54270 -51234 -36834 -20124 8894 16685 9215 24599
15600 24599 8635 -7323 10526 2684 -7216 -5545 -13171 -7195 994 10292 26569 34391 7003
$$ packed form
15686C9466j3413Q99L9785M3003K1973J7140J8154L4367N3272J9710q059k7781
15674B38516m0028o9904k6638J5010J184N894l143N802K9247K1178J3757L9984
15662B30859J8252L3646K2544k646l8545l2886j3238J4056P986K6435R349l9702
15650B36110n1125o5299k9949k1792j0478o223j9584J9828N5593J5074P568N9778
15638A89501N9343K1752J674k7106p3597n1412l9521k7377j3360L329R836R067
15626F2129j9169k4795k251k2090j4691o96j2723N010Q743k5062k0056n999K0385
15613e1265J0652m019R466j4089j4995R980L036J4400J6710K9018P791p470J5384
15600B4599j5964j5958J7849p842r900J671p626N976Q189R298J6277P822k7388
$$ plain form
15587 7003 -4686 -1662 -11358 8664 23855 32617 14227 -902 -23491 -49030 -46658 -33026 -9313
15574 -9313 -18515 -127 16571 16697 19983 5686 -1501 -10466 -9497 -6181 -11188 -18757 -22360 -25449
15560 -25449 -67724 -62378 -36304 -30302 -37627 -45959 -19397 11657 -294 -2743 -19994 -7127 -212
15547 -212 -5590 -3617 7118 19467 16486 15671 36668 59893 50493 28633 26022 13938 12885 7030
15533 7030 28262 23820 -19096 -40949 -50333 -32686 -14505 7480 -2399 9330 1809 1165 9418
15520 9418 -10699 -23603 -25943 -24907 -37131 -29159 -34401 -32890 -11266 27811 51142 21150 8618
15507 8618 6220 4828 30525 36461 18103 4132 10822 -11261 -23909 -25324 -28816 -26165 -32870
15494 -32870 -14267 -7345 -3566 -8083 -10734 2279 11015 7044 -615 6422 1932 17331 26305 14001
$$ packed form
15587G003j1689L024r696K0022J5191Q762j8390j5129k2589k5539K372J3632K3713
15574i313r202J8388J6698J26L286j4297p187q965R69L316n007p569l603l089
15560b5449m2275N346K6074O002p325q332K6562L1054j1951k449j7251J2867O915
15547b12n378J973J0735J2349k981q15K0997K3225r400k1860k611j2084j053n855
15533G030K1232m442m2916k1853r384J7647J8181K1985r879J1729p521o44Q253
15520I418k0117j2904k340J036j2224P972n242J511K1624L9077K3331k9992j2532
15507H618k398j392K5697N936j8358j3971O690k2083j2648j415l492K651o705
15494c2870J8603O922L779m517k651J3013Q736l971p659P037m490J5399Q974j2304
$$ plain form
15480 14001 3461 2396 11876 -3154 -14752 -18965 -15530 -13023 -10211 -15416 -23592 -9080 -9917 -15215
15466 -15215 -830 -9536 -51973 -51779 -31803 -32234 -36481 -14179 8133 -541 -21665 -34504 -53240
15453 -53240 -36912 -16076 -4964 -23208 -35601 -14331 -1992 3768 27912 21370 13026 11098
15441 11098 12336 6687 11387 -18944 -43663 -37752 -34109 -27949 -12045 -14893 -29616 -10435 10874
15428 10874 6007 -13698 -12831 -2183 -6814 1282 12497 6979 -11340 -20250 -5715 -6811 -20900
15415 -20900 -16547 -1040 8058 14562 11665 -8242 -4499 -24844 -27830 -40385 -29818 384 15946
15402 15946 22181 27957 20747 14814 7428 -2875 4693 -11541 -25379 -19883 4176 -3816 -2556
15389 -2556 8012 -17329 -50799 -36261 -17429 -32241 -42936 -44138 -14491 9142 -12282 -15094
$$ packed form
15480A4001j0540j065R480j5030j1598m213L435K507K812n205q176J4512q37n298
15466a5215J4385q706m2437J94J9976m31m247K2302K2312q674k1124j2839j8736
15453e3240J6328K0836J1112j8244j2393K1270J2339N760K4144o542q344j928
15441A1098J238n649M700l0331k4719N911L643O160J5904k848j4723J9181K1309
15428A0874m867j9705Q67J0648m631Q096J1215n518j8319q910J4535j096j4089
15415b0900M353J5507R098O504k897j9907L743k0345k986j2555J0567L0202J5562
15402A5946O235N776p210n933p386j0303P568j6234j3838N496K4059p992J260
15389b556J0568k5341l3470J4538J8832j4812j0695j202K9647K3633k1424k812
$$ plain form
15377 -15094 -10035 -27612 -50872 -32799 -3614 -15806 -50682 -27844 -4649 -14360 -29516 -27612
15365 -27612 -21203 -22046 -5093 15628 -5649 -15438 -5314 -3636 12554 13008 -1424 3538 57
15352 57 -23483 -18726 -34872 -45380 -35509 3922 13150 -4588 -13577 -29579 -35847 1927 13104
15339 13104 7304 -6347 8557 -4956 -13719 -2253 -779 7900 10996 20188 559 -21567 -19142
15326 -19142 -25316 -30255 -26416 -36389 -38185 -21728 -4387 -14636 -13472 -34308 -51433 -31203 -19971
15313 -19971 -2644 22069 19739 -1482 -6525 -5585 -4671 -7543 -8767 -22808 -9070 -808 -2391 1364
15299 1364 16810 8189 -14055 -35957 -30630 -19900 -31568 -22336 -7637 -22703 -54539 -45662 -41556
15286 -41556 -41233 -37342 -21931 -28863 -46817 -40196 -29911 -26362 -57650 -56334 -50894 -23677 -12206
$$ packed form
15377a5094N059j7577k3260J8073K9185j2192l4876K2838K3195r711j5156J904
15365b7612O409q43J6953K0721k1277r789J0124J678J6190M54j4432M962l481
15352E7k3540M757j6146j0508R871L9431R228j7738q989j6002o268L7774J1177
15339A3104n800j3651J4904j3513q763J1466J474Q679L096R192j9629k2126K425
15326a9142o174m939L839r973j796J6457J7341j0249J164k0836j7125K0230J1232
15313a9971J7327K4713k330k1221n043R40R14k872j224j4041J3738Q262j583L755
15299A364J5446q621k2244k1902N327J0730j1668R232J4699j5066l1836Q877M106
15286d1556L23L891J5411o932j7954O621J0285L549l1288J316N440K7217J1471
$$ plain form
15273 -12206 6257 14888 8666 -12420 -19585 -16096 -23029 -8973 1594 -20915 -31768 -4131 20700
15260 20700 15020 14828 9358 -6006 4252 20716 17015 -7077 -18029 2944 1458 18110 6496
15247 6496 -14956 -9402 -913 12857 14901 9042 14770 3024 719 7957 -637 8347 3852 -4446
15233 -4446 -3310 4058 -8055 -13367 -26333 -19531 -11773 -13823 941 3135 429 13950 20237 -15020
15219 -15020 -26842 -17303 -12415 -10375 17366 36507 19452 -25005 -31122 -31037 -9627 6549 -892
15206 -892 759 -9521 -40591 -40346 -20105 -32619 -31763 -19303 -6169 5851 -2172 -13886 8340
15193 8340 11645 2346 -43631 -66135 -51310 -25968 -17186 2851 24208 9954 -21856 -6463
15181 -6463 6331 -15039 -2840 13558 5655 12337 7307 9214 -7587 -33518 -27426 -27236 -32813
$$ packed form
15273a2206J8463Q631o222k1086p165L489o933J4056J0567k2509j0853K7637K4831
15260B0700n680j92n470j5364J0258J6464l701k4092j0952K0973j486J6652j1614
15247F496k1452N554Q489J3770K044n859N728j1746k305P238q594Q984m495q298
15233d446J136P368j2113n312j2966O802P758k050J4764K194k706J3521O287l5257
15219a5020j1822R539M888K040K7741J9141j7055m4457o117Q5K1410J6176p441
15206h92J651j0280l1070K45K0241j2514Q56J2460J3134J2020q023j1714K2226
15193H340L305r299m5977k2504J4825K5342Q782K0037K1357j4254l1810J5393
15181f463J2794k1370J2199J6398p903O682n030J907j6801k5931O092J90n577
$$ plain form
15168 -32813 -43647 -42595 -34003 -12092 -5080 -10236 10986 22307 9900 520 -11096 5398 9338
15155 9338 -1222 18612 34078 22602 2189 -3912 11554 -8880 -19504 3536 15600 15554 7213
15142 7213 -5979 -20601 -38455 -31614 -19955 -18818 -15313 -26560 -2095 11275 -2499 -14299
15130 -14299 -27081 -13371 -16359 -22461 -24586 -11326 7731 35164 19203 5598 15752 36743
15118 36743 37146 27502 6442 -11416 2614 13329 1019 15685 -3959 -24921 -21512 -11069
15106 -11069 -13030 10931 16917 17262 12124 24279 18797 187 -23820 -4155 3331 -9790 -10744
15093 -10744 -11981 7767 -5107 -29313 -15543 19716 29545 14453 4504 -20667 -32697 -13016
15081 -13016 -20243 -14690 -11758 -36227 -30538 -26217 -14950 -17711 -8067 -19011 -20768 -17142 -42886
$$ packed form
15168c2813j0834J052Q592K1911P012n156K1222J1321j2407r380j1616J6494L940
15155I338j0560J9834J5466j1476k0413o101J5466k0434j0624K3040J2064m6q341
15142G213j3192j4622j7854O841J1659J137L505j1247K4465J3370j3774j1800
15130a4299j2782J3710k988o102k125J3260J9057K7433j5961j3605J0154K0991
15118C6743M03r644k1060j7858J4030J0715j2310J4666j9644k0962L409J0443
15106a1069j961K3961N986L45n138J2155n482j8610k4007J9665P486j3121r54
15093a0744j237J9748j2874k4206J3770L5259R829j5092r949k5171j2030J9681
15081a3016p227N553K932k4469N689M321J1267k761R644j0944j757L626k5744
$$ plain form
15068 -42886 -48224 -27776 -14783 -20036 -7786 -6623 -4273 18829 31040 24276 3212 -5175 -19941
15055 -19941 -31527 -30328 -69804 -55527 -11018 16208 14194 16050 -1670 -12186 -25816 -28222
15043 -28222 -21494 -59811 -45854 -5513 3472 -3942 -2220 4329 -16962 -10608 20543 18697 -19135
15030 -19135 -19869 -9017 1709 -8361 -21242 -12081 -16464 -15603 -31252 -11094 35381 44616 46532
15017 46532 35455 53656 27710 -8538 -27810 935 24460 24060 14985 28950 38489 9139
15005 9139 -18635 -7351 14865 -6232 -12689 16647 25493 -4862 -232 7167 -6933 14186 29183
14992 29183 25546 9044 9975 22717 16841 30821 12518 -6681 -12091 -8221 -22991 -28532 -10861
14979 -10861 13963 17793 25257 11937 20350 3871 -11869 -23832 -37137 -789 24818 27407
$$ packed form
15068d2886n338K0448J2993n253J2250J163K350K3102J2211o764k1064q387j4766
15055a9941j1586J199l9476J4277M4509K7226k014J856j7720j0516j3630k406
15043b8222O728l8317J3957M0341Q985p414J722O549k1291O354L1151j846l7832
15030a9135p34J0852J0726j0070j2881R161m383Q61j5649K0158M6475R235J916
15017D6532j1077J8201k5946l6248j9272K8745K3525m00r075J3965R539k9350
15005I139k7774J1284K2216k1097o457K9336Q846l0355M630P399j4100K1119J4997
14992B9183l637j6502R31J2742n876J3980j8303j9199n410L870j4770n541J7671
14979a0861K4824L830P464j3320Q413j6479j5740j1963j3305L6348K5607K589
$$ plain form
14967 27407 7679 -14968 -21708 -16959 -26832 -32915 -24269 -30383 -24744 -10673 9538 3329 9426
14954 9426 18950 -5506 -25967 -12715 -5578 -10691 -15727 -7226 -1584 1232 -2394 -17924 -23126 -41642
14940 -41642 -51803 -63586 -43145 -30034 -50815 -80097 -67525 -34740 -21426 -15127 -1533 3004
14928 3004 6379 -16235 -23556 -23175 -11098 -4863 -18426 -29237 -38495 -34425 -30514 -23686 -10491 -19495
14914 -19495 -9939 -11811 -21924 -10745 -2777 -18079 -1436 12443 23306 7860 -2256 -30711
14902 -30711 -48409 -42058 -19478 18495 44676 26727 -140 -17032 -3 26870 15055 9967
14890 9967 5359 1877 17366 52345 33970 20383 -12434 -33857 -57094 -49152 -9217 890
14878 890 10150 19158 19521 8719 -4449 -7509 -19040 -20928 -14746 -10576 -7748 -5771 -6427 -7977 -6972
$$ packed form
14967B7407j9728k2647o740M749r873o083Q646o114N639J4071K0211o209O097
14954I426R524k4456k0461J3252P137n113n036Q501N642K816l626j5530n202j8516
14940d1642j0161j1783K0441J3111k0781k9282J2572L2785J3314O299J3594M537
14928C004L375k2614p321L81J2077O235j3563j0811r258M070L911O828J3195r004
14914a9495R556j872j0113J1179P968j5302J6643J3879J0863j5446j0116k8455
14902c0711j7698O351K2580L7973K6181j7949k6867j6892J7029K6873j1815n088
14890I967m608l482J5489L4979j8375j3587l2817k1423k3237P942L9935J0107
14878H90R260R008L63j0802j3168l060j1531j888O182M170K828J977o56j550J005
$$ plain form
14863 -6972 -12910 -21278 -29142 -18656 -8319 24551 29451 13059 3184 3343 4333 6053 5548 -18250
14849 -18250 -19835 7231 32970 36834 45541 44772 28267 38213 27370 19258 3444 -4303 -14398
14836 -14398 -12331 -2353 6185 8007 3792 11379 3321 -6786 -1160 9512 -7638 -303 2808 -1007
14822 -1007 -13264 -27156 -23579 -37550 -30238 -13668 -10682 11178 27362 34762 10656 -12258 -11093
14809 -11093 -7187 -10662 -412 8008 -1832 -14170 -4674 26563 46064 48782 43062 30135 23115
14796 23115 29554 32162 44272 34013 6665 2135 -568 -3922 -7614 -2046 3745 10295 20767
14783 20767 31703 11045 14931 27763 16964 23164 17833 3424 19033 29708 38571 29308 -9557
14770 -9557 -15018 -7147 -1737 4409 -3229 18337 31543 16133 18198 28856 16391 -939 27426
$$ packed form
14863f972n938q368p864J0486J0337L2870M900j6392r875J59R90J720n05k3798
14849a8250j585K7066K5739L864Q707p69j6505R946j0843q112j5814p747j0095
14836a4398K067R978Q538J822m215P587q058j0107N626J0672j7150P335L111l815
14822a007j2257j3892L577j3971P312J6570K986K1860J6184P400k4106k2914J165
14809a1093L906l475J0250Q420r840j2338R496L1237J9501K718n720j2927p020
14796B3115O439K608J2110j0259k7348m530k703l354l692N568N791O550J0472
14783B0767J0936k0658L886J2832j0799O200n331j4409J5609J0675Q863r263l8865
14770i557n461P871N410O146p638K1566J3206j5410K065J0658j2465j7330K8365
$$ plain form
14757 27426 36438 8057 -9080 13086 607 -13499 -3584 382 3357 4200 11235 -15436 -24901
14744 -24901 -36411 -31036 -4334 -15337 -28565 -19872 -8824 6922 17451 1999 -5219 -4532 -16531
14731 -16531 -16408 -9946 -12089 -32457 -39808 -31158 -14386 -22679 -14793 1884 11800 6338 5150 -8318
14717 -8318 -3064 7579 25441 12660 -19481 -13323 2079 4958 -1874 12481 13287 17783 4415
14704 4415 1602 -11144 -14668 -25455 -31217 -29347 -11637 -13110 -17917 -16927 -22603 -12575 -2168 -9133
14690 -9133 -5595 -8086 7559 5129 -1471 -8987 522 -11297 -8476 -6328 -15343 341 19640 33935
14676 33935 52836 31672 5460 -5329 -23333 -2258 17125 -3348 -18148 -2103 -2779 -6398
14664 -6398 1093 -45 -3484 -2742 -15207 -18090 1004 9344 23613 9543 -16758 -6068 -2369
$$ packed form
14757B7426R012k8381j7137K2166j2479j4106R915L966K975Q43P035k6671r465
14744b4901j1510N375K6702j1003j3228Q693J1048J5746J0529j5452p218O87j1999
14731a6531J23O462k143k0368p351Q650J6772q293P886J6677R916n462j188j3468
14717h318N254J0643J7862j2781l2141O158J5402K879o832J4355Q06M496j3368
14704D415k813j2746l524j0787n762J870J7710j473m807R90n676J0028J0407o965
14690i133L538k491J5645k430o600p516R509j1819K821K148r015J5684J9299J4295
14676C3935J8901k1164k6212j0789j8004K1075J9383k0473j4800J6045o76l619
14664f398P491j138l439P42j2465k883J9094Q340J4269j4070k6301J0690L699
$$ plain form
14651 -2369 -2960 16704 25672 2185 -16538 -33035 -44483 -24147 -2549 11586 2705 -18622 -7477
14638 -7477 11137 -3692 -18742 -18653 -23732 -35902 5390 28626 19079 -7609 -18271 -24666 1483
14625 1483 16575 10257 6688 7451 8054 -2173 -9958 -10800 -24 -4931 -9085 -4582 -1850 -1513 -23969
14610 -23969 -29226 -4670 -16384 -33460 -27018 -5633 10117 25040 36570 32605 46740 51700
14598 51700 -617 -31079 -15839 -7235 -15206 -16525 -8380 -3986 1025 -3113 -17423 -5451 -20616
14585 -20616 -2533 13223 10422 -20347 -12924 -20912 -30043 -40742 -29499 -15043 -9403 3286 -8231
14572 -8231 -17883 -4308 10036 15643 -7903 -53 13265 23945 11144 2672 -12923 2049 -821
14559 -821 2850 16157 8329 15361 11594 13148 -6598 1669 22752 25546 -828 -21757 -24608 -20011
$$ packed form
14651b369n91J9664Q968k3487j8723j6497j1448K0336K1598J4135q881k1327J1145
14638g477J8614j4829j5050Q9n079j2170M1292K3236r547k6688j0662o395K6149
14625A483J5092o318l569P63O03j0227p785q42J0776m907m154M503K732L37k2456
14610b3969n257K4556j1714j7076O442K1385J5750J4923J1530l965J4135M960
14598E1700n2317l0462J5240Q604p971j319Q145M394N011m138j4310J1972j5165
14585b0616J8083J5756k801l0769P423p988r131j0699J1243J4456N640J2689j1517
14572h231r652J3575J4344N607k3546P850J3318J0680j2801q472j5595J4972k870
14559h21L671J3307p828P032l767J554j9746Q267K1083K794k6374k0929k851M597
$$ plain form
14545 -20011 4984 1543 -12397 -24282 -44933 -27774 -10998 -2255 -3464 -20524 -17257 -19659 -20857
14532 -20857 2925 10197 -21544 -10568 7031 20736 18780 -2978 2325 9156 4354 1657 -26643
14519 -26643 -78310 -68827 -53668 -50816 -41130 -17299 -15267 -41171 -48906 -32538 -36815 -43762 -46847
14506 -46847 -17884 12908 29806 15620 -5759 -14153 -5042 5225 7653 -3547 -20244 -34367
14494 -34367 -43463 -29859 -20181 -21736 -19947 6426 24587 17786 -1741 -5772 -4715 -9747 -34397
14481 -34397 -25933 -1314 21446 28784 14454 6130 -3202 17321 6821 19389 42099 45232 37717
14468 37717 13674 3825 -8136 -25786 -30542 -9632 6690 1247 1436 6206 15940 11781 13471
14455 13471 2986 -27042 -48253 -42179 -27721 -27192 -9384 -16171 6996 7727 12823 12497 13543 11760
$$ packed form
14545b0011K4995l441j3940j1885k0651J7159J6776Q743j209j7060L267k402j198
14532b0857K3782P272l1741J0976J7599J3705j956k1758N303O831m802k697k8300
14519b6643n1667R483J5159K852R686K3831K032k5904p735J6368m277o947l085
14506d6847K8963L0792J6898j4186k1379q394R111J0267K428j1200j6697j4123
14494c4367r096J3604R678j555J789K6373J8161o801j9527m031J057n032k4650
14481c4397Q464K4619K2760P338j4330q324r332K0523j0500J2568K2710L133p515
14468C7717k4043r849j1961j7650m756K0910J6322n443J89M770R734m159J690
14455A3471j0485l0028k1211O074J4458N29J7808o787K3167P31N096l26J046j783
$$ plain form
14441 11760 -1979 7138 -1010 -6953 -23874 -25657 3766 -1175 11325 16970 9347 -17094 -14604
14428 -14604 -20411 -28055 -20996 -16843 -2238 -6525 -17353 -28792 -13605 -19507 103 4280 -3218
14415 -3218 -9483 4530 29819 36761 26426 10515 -15236 -41388 -44102 -7870 -7361 -4049 15308
14402 15308 8774 4644 21578 38788 54934 39331 34211 11774 -11086 -16217 -22322 -2180 11280
14389 11280 13235 6208 -1488 1886 -16493 -45295 -35555 -4737 4034 -2670 -21298 -3655 -4526
14376 -4526 -3198 -18838 -40971 -26583 -29672 -18981 -5275 -27610 -57886 -40336 -29400 -20085
14364 -20085 -11463 -10641 -21341 -26454 -19081 -20587 -38280 -51267 -22464 590 -4511 -3473 -15992
14351 -15992 -31833 -27097 -26622 -9873 5690 14804 15882 4565 -38356 -47846 -46093 -54398 -43794
$$ packed form
14441A1760j3739R117q148n943j6921j783K9423m941J2500N645p623k6441K490
14428a4604n807p644P059M153J4605m287j0828j1439J5187n902J9610M177p498
14415c218o265J4013K5289O942j0335j5911k5751k6152k714L6232N09L312J9357
14402A5308o534m130J6934J7210J6146j5603n120k2437k2860n131o105K0142J3460
14389A1280J955p027p696L374j8379k8802R740L0818Q771o704j8628J7643q71
14376d526J328j5640k2133J4388l089J0691J3706k2335l0276J7550J0936R315
14364b0085Q622Q22j0700n113P373j506j7693j2987K8803K3054n101J038j2519
14351a5992j5841M736M75J6749J5563R114J078j1317m2921r490J753q305J0604
$$ plain form
14338 -43794 -43339 -59149 -55364 -32253 -42322 -21849 8358 13017 -2758 -12795 -8907 -7398 -2734
14325 -2734 -24314 -21117 -16229 -14888 -12336 -18915 -3738 -5756 -15307 -11009 -971 -1161 -10397 5286
14311 5286 18427 4432 -434 14320 41144 31380 14453 14862 2523 5110 -1137 4336 18349
14298 18349 19628 23267 32684 25624 4298 -1945 -22963 -12119 6444 24807 4733 5961 22548
14285 22548 -4854 -2855 -7476 -30548 -13541 8276 -12410 -23831 -1556 11809 9251 2354
14273 2354 -13297 -41048 -49876 -27569 6600 16169 19814 1619 -26601 -34612 -31985 674 31776
14260 31776 23825 17762 29616 20625 4 -8693 -6919 10366 33194 16902 -16042 -30986 -7845
14247 -7845 10983 14637 17081 41112 56175 48893 17735 7779 20015 32482 20654 -265 -1434
$$ packed form
14338d3794M55j5810L785K3111j0069K0473L0207M659j5775j0037L888J509M664
14325b734k1580L197M888J341K552o579J5177k018r551M298J0038j90r236J5683
14311E286J3141j3995m866J4754K6824r764j6927M09j2339K587o247N473J4013
14298A8349J279L639R417p060k1326o243k1018J0844J8563J8363k0074J228J6587
14285B2548k7402J999m621k3072J7007K1817k0686j1421K2275J3365k558o897
14273B354j5651k7751q828K2307L4169R569L645j8195k8220q011K627L2659L1102
14260C1776p951o063J1854q991k0621q697J774J7285K2828j6292l2944j4944K3141
14247g845J8828L654K444K4031J5063p282l1158r956J2236J2467j1828k0919j169
$$ plain form
14234 -1434 11010 15639 10589 1824 13380 12176 8459 -10579 -15308 -24285 -25479 -11266 -22153
14221 -22153 -8264 -14439 -19180 -19139 -30135 -15617 2754 2749 -11599 -36764 -27364 -16404 -11297 832
14207 832 -407 9565 12126 26751 16469 14642 23204 25098 27675 16302 18991 3194 7208 -10560
14193 -10560 -6318 20124 29437 33895 42457 32003 9815 -904 -5820 -16498 -13774 -17647 -8571
14180 -8571 13748 -8920 -19483 -3439 30875 36358 32189 25719 20890 720 -19516 -2153 6784
14167 6784 -10380 -1530 -22905 -24105 -37337 -45631 -2165 12581 -15107 -15171 -423 1261 -8539
14154 -8539 1796 12911 -12396 -27142 -37966 -28906 -3482 22885 15668 -21190 -23156 -16219 5655
14141 5655 -9537 -39958 -37989 -21760 -20211 -7908 -12499 -22288 -16585 -18089 -28097 -24848 10611
$$ packed form
14234a434J2444M629n050q765J1556j204l717j9038m729q977j194J4213j0887
14221b2153J3889o175m741M1j0996J4518J8371nj4348k5165R400J0960N107J2129
14207H32j239R972K561J4625j0282j827Q562J894K577j1373K689j5797M014j7768
14193a0560M242K6442R313M458Q562j0454k2188j0719m916j0678K724l873R076
14180h571K2319k2668j0563J6044L4314N483m169o470m829k0170k0236J7363Q937
14167F784j7164Q850k1375j200j3232q294M3466J4746k7688o4J4748J684r800
14154h539J0335J1115k5307j4746j0824R060K5424K6367p217l6858j966O937K1874
14141E655j5192l0421J969J6229J549J2303m591r789N703j504j0008L249L5459
$$ plain form
14128 10611 31026 50545 58114 24846 -10576 -9933 -4580 -3639 8088 23757 10856 -8834 -15509
14115 -15509 -58 9380 -2809 -640 -10302 -29137 -38391 -33150 -38311 -9786 42454 58740 49394
14102 49394 23502 -6173 -24254 -46693 -40514 -2992 10868 16019 12908 11867 29902 39577 17467
14089 17467 17495 7954 4895 5411 19481 13054 4493 -14706 -11579 2329 -1525 10955 24560 44698
14075 44698 52675 44984 23994 26036 29186 2054 988 -3903 -12061 -18652 -33310 -34978 -21408
14062 -21408 -8790 -20733 -42088 -34520 -7075 -4307 25644 73968 53669 34918 32862 23809
14050 23809 19546 28426 8686 2026 12949 8585 8022 27013 25127 12036 16600 24057 41501
14037 41501 40747 32388 14943 24142 14449 28928 36559 44084 25444 2419 8040 19914 5280
$$ packed form
14128A0611K0415J9519P569l3268l5422O43N353R41J1727J5669j2901j9690o675
14115a5509J5451R438j2189K169r662j8835r254N241n161K8525N2240J6286r346
14102D9394k5892k9675j8081k2439O179L7522J3860N151l111j041J8035R675k2110
14089A7467K8r541l059N16J4070o427q561j9199L127J3908l854J2480J3605K0138
14075D4698P977p691k0990K042L150k7132j066m891q158o591j4658j668J3570
14062b1408J2618j1943k1355P568K7445K768K9951M8324k0299j8751k056r053
14050B3809m263Q880j9740o660J0923m364n63J8991j886j3091M564P457J7444
14037D1501p54q359j7445R199r693J4479P631P525j8640k3025N621J1874j4634
$$ plain form
14024 5280 113 9340 10943 -1082 -17482 -368 7309 1675 1850 20835 29076 33921 18116 -4423
14010 -4423 -12333 -17071 -3805 131 18258 25977 24943 17818 -712 26660 32081 28355 21556 22759
13996 22759 17453 -4513 -21893 -31909 -29239 -8486 13743 18221 6917 16606 28472 24981 9850
13983 9850 -2563 1129 22404 33215 25414 14687 -9811 -11523 -933 687 7428 5257 -9080
13970 -9080 -16601 -11988 -13823 -18502 -44436 -37766 -1629 31414 17729 -20233 -14756 -8505 -991
13957 -991 6287 9631 -3914 -12968 -18123 -6452 -7541 -30101 -5126 14666 3450 732 -24898
13944 -24898 -18716 -18578 -20049 -6396 4849 11388 -404 -21948 -40595 -41419 -38970 -26278 -25273
13931 -25273 -20828 -15303 3574 1837 -7503 7007 4787 -2437 -7605 -16675 -13065 -17368 -34507 -31710
$$ packed form
14024E280n167R227J603j2025j6400J7114P677n634J75J8985Q241M845j5805k2539
14010d423p910m738J3266L936J8127P719j034p125j8530K7372N421l726o799J203
13996B2759n306k1966j7380j0016K670K0753K2229M478j1304R689J1866l491j5131
13983I850j2413L692K1275J0811p801j0727k4498j712J0590J620O741k171j4337
13970i080p521M613j835m679k5934O670L6137L3043j3685l7962N477O251P514
13957i91P278L344j3545r054n155J1671j089k2560K4975J9792j1216k718k5630
13944b4898O182J38j471J3653J1245O539j1792k1544j8647q24K449J2692J005
13931b5273M445N525J8877j737r340J4510k220p224n168r070L610m303j7139K797
$$ plain form
13917 -31710 -13997 -5033 -7174 -12813 -20200 -29249 -18590 -2579 -27020 -18173 -17479 -17148 -298 9854
13903 9854 1399 7258 -2311 -31103 -26116 -2255 18758 15023 -11198 -17738 2528 -5618 -12914
13890 -12914 -38297 -27685 -8232 -19348 -7800 -3060 5417 -5106 -27066 -5865 28731 44694
13878 44694 37482 33174 27260 15567 -1220 -5395 2371 -7070 6881 26096 -1436 -8298 -14830
13865 -14830 -5889 -1396 -5308 -3671 -1469 -11583 -20744 -13244 4385 3148 13312 32920 17660
13852 17660 -6245 -20843 -13742 26960 62190 71899 40351 15527 20010 16218 -6259 -19530
13840 -19530 -24051 -11879 -6064 -20440 -5999 -5909 15012 13847 212 1986 8433 27139 19277
13827 19277 17920 -2136 -13595 -767 3658 15394 20523 27646 16072 1783 34800 50017
$$ packed form
13917c1710J7713Q964k141n639p387r049J0659J6011k4441Q847O94L31J6850J0152
13903I854q455N859r569k8792M987K3861K1013l735k6221o540K0266q146p296
13890a2914k5383J0612J9453j1116J1548M740Q477j0523k1960K1201L4596J5963
13878D4694p212m308n914j1693j6787m175P766r441J3951J9215k7532o862o532
13865a4830Q941M493l912J637K202j0114r161P500J7629j237J0164J9608j5260
13852A7660k3905j4598P101M0702L5230R709l1548k4824M483l792k2477j3271
13840a9530m521J2172N815j4376J4441R0K0921j165j3635J774O447J8706p862
13827A9277j357k0056j1459J2828M425J1736N129P123j1574j4289L3017J5217
$$ plain form
13815 50017 10083 4607 16496 10372 23130 30931 34912 21668 2298 -3568 -12333 -14992 -12944
13802 -12944 9626 7845 12529 28983 25526 31604 23480 20712 23542 7350 16024 17157 19385 1858
13788 1858 8651 5611 4904 16403 16286 25429 28816 14534 -5213 -17757 -4533 -6912 -9666 -23646
13774 -23646 -12778 4962 -6220 11595 25578 39139 55842 61756 53306 29660 39460 11809
13762 11809 -20234 -33052 -21916 -17703 -19251 403 32653 57645 36507 -1974 -4697 -11163
13750 -11163 -32696 -31064 -22552 -11365 -23114 -47046 -23128 -11115 -29542 -43655 -11006 -14153
13738 -14153 -12456 22370 28711 16091 -1605 -15226 9092 12565 -1865 -17003 -34140 -18185
13726 -18185 7530 3444 -9890 -9802 -10643 -12210 18996 36992 38581 31082 22032 18220 -2455 -7806
$$ packed form
13815E0017l9934n476J1889o124J2758P801L981j3244j9370n866q765k659K048
13802a2944K2570j781M684J6454l457O078q124k768K830j6192Q674J133K228j7527
13788A858O793l040p07J1499j17R143L387j4282j9747j2544J3224k379k754j3980
13774b3646J0868J7740j1182J7815J3983J3561J6703N914q450k3646R800k7651
13762A1809l2043j2818J1136M213j548J9654L2250K4992k1138l8481k723o466
13750a1163k1533J632Q512J1187j1749k3932K3918J2013j8427j4113L2649l147
13738a4153J697L4826O341j2620j7696j3621K4318L473j4430j5138j7137J5955
13726a8185K5715m086j3334Q8q41j567L1206J7996J589p499r050l812k0675n351
$$ plain form
13712 -7806 -9097 1312 13299 20697 35382 31092 14877 20761 24761 20303 2366 9394 17427
13699 17427 28704 30947 26830 35764 42000 49426 59325 38583 21956 40018 32307 10773 -2339
13686 -2339 15048 28707 13157 -6510 -23492 -22058 -26543 -47701 -33662 -27921 -29538 -18224 3297
13673 3297 26775 25840 12142 28452 28235 13994 -5189 -14801 -13577 -7493 3320 12481 34204
13660 34204 15538 -9331 -15704 -6032 -21221 -28451 -13970 -1211 -3364 -14527 7967 3174 -11817
13647 -11817 -11743 -33813 -26857 -6249 -9227 -12344 -5674 -19799 -10366 -22562 -13197 -16076 -36044 -34772
13633 -34772 -21817 19190 32332 49730 33726 32548 29644 46310 41296 8268 17475 48366
13621 48366 65610 69297 63541 45186 50092 49509 26256 7508 5153 -1123 -14135 -12572 -21904
$$ packed form
13712g806j291J0409J1987P398J4685m290j6215N884M000m458j7937P028Q033
13699A7427J1277K243m117Q934O236P426R899k0742j6627J8062p711k1534j3112
13686b339J7387J3659j5550j9667j6982J434m485k1158J4039N741j617J1314K1521
13673C297K3478r35j3698J6310k17j4241j9183r612J224O084J0813R161K1723
13660C4204j8666k4869o373R672j5189p230J4481J2759k153j1163K2494m793j4991
13647a1817P4k2070O956K0608k978l117O670j4125R433j2196R365k879j9968J272
13633c4772J2955M1007J3142J7398j6004j178k904J6666n014l3028R207L0891
13621D8366J7244L687n756j8355M906n83k3253j8748k355o276j3012J563r332
$$ plain form
13608 -21904 -1502 7178 2082 7355 13767 19936 33439 37594 22284 10046 3336 -17910 -27040
13595 -27040 -39802 -43754 -27031 -7781 666 -5259 -3296 -16570 -9003 -7741 -5253 -15499 -1710
13582 -1710 -10779 -3259 14410 13571 30578 35875 27978 29563 31714 37304 49387 60825 59882 38599
13568 38599 37818 26178 36136 31015 32416 22704 8892 -7298 6632 14757 11046 117 214 -10287
13554 -10287 -9558 1733 4345 15655 35623 6819 4926 -2555 -30223 -40862 -37586 -34320 -15589
13541 -15589 -13725 -8588 8273 -1280 -10751 -22880 -31136 -6387 12156 12682 -3092 -26623 -43655
13528 -43655 -38159 -42026 -20467 -6927 -6602 -4226 -4086 5533 -8960 -7300 7576 43327 30824
13515 30824 28557 28085 27956 35102 34204 16235 18104 19745 44988 64892 31897 -4123 14232 24781
$$ packed form
13608b1904K0402Q680n096N273O412O169J3503M155j5310j2238o710k1246r130
13595b7040j2762l952J6723J9250Q447n925J963j3274P567J262K488j0246J3789
13582a710r069P520J7669q39J7007N297p897J585K151N590J2083J1438r43k1283
13568C8599p81j1640R958n121J401r712j3812j6190J3930Q125l711j0929R7j0501
13554a0287P29J1291K612J1310J9968k8804j893p481k7668j0639L276L266J8731
13541a5589J864N137J6861r553r471j2129q256K4749J8543N26j5774k3531j7032
13528d3655N496l867K1559J3540L25K376J40R619j4493J660J4876L5751j2503
13515C0824k267m72j29P146q98j7969J869J641K5243J9904l2995l6020J8355J0549
$$ plain form
13501 24781 -276 6837 31267 46001 46527 31380 23613 33121 15065 -2221 -3310 1624 -13427
13488 -13427 16572 27021 12017 24486 32727 26645 29532 9924 -9900 -11409 -17984 5085 21771
13475 21771 11970 -6414 1089 6367 -3274 -1452 1653 -7566 -13343 6973 -4544 641 5733 16124
13461 16124 9255 -7447 5938 651 2315 12530 34219 16947 -5380 -1089 1512 -4390 -4231
13448 -4231 1015 3608 17213 45335 26735 14315 18728 8458 28049 46683 47782 36677 6580
13435 6580 7233 513 -7105 10315 32237 22251 24277 28008 30515 25565 14062 3503 26144 39917
13421 39917 25293 28161 28989 29299 30310 6405 -24761 -36024 13170 39440 43670 32934 18413
13408 18413 20520 13353 -103 -9631 -18468 -22905 -33312 -34957 -40936 -2557 -7630 -26927 -34800
$$ packed form
13501B4781k5057P113K4430J4734N26j5147p767R508j8056j7286j089M934j5051
13488a3427K9999J0449j5004J2469Q241o082K887j9608j9824j509o575K3069J6686
13475B1771r801j8384P503N278r641J822L105r219n777K0316j1517N185N092J0391
13461A6124o869j6702J3385n287J664J0215K1689j7272k2327M291K601n902J59
13448d231N246K593J3605K8122j8600j2420M413j0270J9591J8634J099j1105l0097
13435F580O53o720p618J7420K1922r986K026L731K507m950j1503j0559K2641J3773
13421C9917j4624K868Q28L10J011k3905l1166j1263M9194K6270M230j0736j4521
13408A8413K107p167j3456r528q837m437j0407j645n979L8379n073j9297p873
$$ plain form
13395 -34800 -18779 11885 20787 6386 -8616 -6919 -7573 8435 22479 24990 21178 22959 22897 18669
13381 18669 -6112 -1747 1988 12545 31121 39408 13620 -7971 -2839 7657 6025 2409 15928
13368 15928 8620 16010 23697 26236 13600 4203 10360 -9552 -4445 28785 37909 11242 8817
13355 8817 13277 -36 -20801 -22503 12440 14132 4862 6263 -5482 -1539 3573 20876 32751
13342 32751 17586 25729 32004 12987 5609 15826 28143 16989 18196 11881 40681 63911 51396
13329 51396 40899 20512 2895 19363 -549 -5020 8164 2187 -17178 -11124 20424 24407
13317 24407 23143 8593 791 10726 9436 3108 -2076 8571 11616 6960 6832 21049 33081 36612
13303 36612 24694 2317 -20224 -18107 -9715 3034 25743 42241 42329 50067 37285 15165 16531
$$ packed form
13395c4800J6021L0664Q902j4401j5002J697o54J6008J4044K511l812J781o2m228
13381A8669k4781M365L735J0557J8576Q287k5788k1591N132J0496j632l616J3519
13368A5928p308P390P687K539j2636r397O157j9912N107L3230R124k6667k425
13355H817M460j3313k0765j702L4943J692r270J401j1745L943N112J7303J1875
13342C2751j5165Q143O275j9017p378J0217J2317j1154J207o315K8800K3230j2515
13329E1396j0497k0387j7617J6468j9912m471J3184n977j9365O054L1548L983
13317B4407j264j4550p802R935j290o328n184J0647L045m656j28J4217J2032L531
13303C6612j1918k2377k2541K117Q392J2749K2709J6498Q8P738j2782k2120J366
$$ plain form
13290 16531 42861 32702 34895 47747 47843 35329 4663 12046 45422 58339 32467 29780 35680
13277 35680 17977 12619 16009 18441 7933 7929 -5348 -7353 -10834 -11148 12095 6769 -12835 -5650
13263 -5650 -9931 -14884 -1155 -8671 -31526 3393 38699 54931 53280 30425 13716 18346 33134
13250 33134 21299 28888 36214 53298 47456 39805 11455 -17060 -3949 28785 33604 7174 -14709
13237 -14709 -4319 14526 -2226 12305 22243 -2283 -4916 -2346 34898 43001 29928 53427
13225 53427 70581 33528 -8962 4070 19978 25012 18943 33080 70253 58657 18489 15809
13213 15809 28033 20150 18593 14611 20465 25964 27075 10600 2653 549 31921 42442 44705
13200 44705 38211 25646 32410 20919 10273 17576 25409 19572 33709 31934 39509 50114 36750
$$ packed form
13290A6531K6330j0159K193J2852R6j2514l0666P383L3376J2917k5872k687N900
13277C5680j7703n358L390K432j0508mj3277k005l481l14K3243n326j9604P185
13263e650m281m953J3729p516k2855L4919L5306J6232j651k2855j6709M630J4788
13250C3134j1835P589P326J7084n842p651k8350k8515J3111L2734M819k6430k1883
13237a4709J0390J8845j6752J4531R938k4526k633K570L7244Q103j3073K3499
13225E3427J7154l7053m2490J3032J5908N034o069J4137L7173j1596m0168k680
13213A5809J2224p883j557l982N854N499J111j6475p947k104L1372J0521K263
13200D4705o494j2565O764j1491j0646P303P833n837J4137j775P575J0605j3364
$$ plain form
13187 36750 15746 12270 21673 25351 28986 30660 35921 34686 -5943 -22342 224 31632 33369
13174 33369 46556 52137 27559 9854 34495 59625 54265 39123 27570 17517 10438 -2761
13162 -2761 -1836 17715 30872 21036 42152 65162 82610 109764 105789 119774 152186 181140 230996
13149 230996 301597 383774 498468 668764 895981 1128865 1385492 1698108 2038011 2415879
13139 2415879 2703933 2813339 2674925 2339634 1850838 1329662 928186 670706 493286
13130 493286 384712 312937 249438 199923 157592 158172 132486 108441 75193 64809 62435 64889
13118 64889 53662 37368 43662 66426 53515 61165 74138 74203 59649 35082 32213 20691 8448
13105 8448 25712 29585 22870 24131 15826 3556 6250 20661 8716 16427 15581 31839 52140
$$ packed form
13187C6750k1004l476R403L678L635J674N261j235m0629j6399K2566L1408J737
13174C3369J3187N581k4578j7705K4641K5130n360j5142j1553j0053p079j3199
13162b761R25J9551J3157r836K1116K3010J7448K7154l975J3985L2412K8954M9856
13149B30996P0601Q2177J14694J70296K27217K32884K56627L12616L39903L77868
13139B415879K88054J09406j38414l35291m88796n21176m01476k57480j77420
13130D93286j08574p1775o3499m9515m2331N80k5686k4045l3248j0384k374K454
13118F4889j1227j6294O294K2764j2911P650J2973O5j4554k4567k869j1522j2243
13105H448J7264L873o715J261q305j2270K694J4411j1945P711q46J6258K0301
$$ plain form
13092 52140 42139 38144 42574 33452 27207 44666 43655 23596 -956 -8037 2079 9753 21239
13079 21239 30331 43120 39471 42126 49233 58199 57174 60858 56037 63883 45829 40398 51062 57954
13065 57954 45689 44698 22538 7442 19966 32434 38748 52893 42457 46560 50516 65844 72111
13052 72111 91795 87176 49171 38251 63812 44280 50510 47113 52840 64387 74873 53863
13040 53863 31169 10366 14491 2421 -4961 21319 57389 63714 36390 15672 28335 24406
13028 24406 32991 31406 41668 10596 -17023 -4127 -5863 10263 15025 17021 14473 16272 2661
13015 2661 -10902 25442 33414 36801 53656 76987 102904 112780 130363 185185 228657 273655
13003 273655 336228 340837 320052 270930 192917 157198 154249 145842 122477 108946 128577 112994
$$ packed form
13092E2140j0001l995M430r122o245J7459j011k0059k4552p081J0116P674J1486
13079B1239R092J2789l649K655P107Q966j025L684m821P846j8054n431J0664O892
13065E7954j2265r91k2160j5096J2524J2468O314J4145j0436M103L956J5328O267
13052G2111J9684m619l8005j0920K5561j9532O230l397N727J1547J0486k1010
13040E3863k2694k0803M125j2070p382K6280L6070O325k7324k0718J2663l929
13028B4406Q585j585J0262l1072k7619J2896j736J6126M762J996k548J799j3611
13015B661j3563L6344P972L387J6855K3331K5917R876J7583N4822M3472M4998
13003B73655O2573M609k0785m9122p8013l5719k949q407k3365j3531J9631j5583
$$ plain form
12991 112994 80004 50162 30150 35135 48839 70867 59393 51225 60004 63176 63325 79551 73477
12978 73477 60519 70265 77542 91002 103806 110966 118205 132949 153321 168593 193473 204455
12966 204455 219977 216357 205264 234124 268235 278879 276899 283042 270081 263663 275937 242455
12954 242455 192897 193007 183895 183480 178342 182250 198276 207550 203077 182586 187286 177652 177494 163021
12940 163021 138456 124209 114984 102317 110303 84003 42376 22198 11127 31037 43086 37838
12928 37838 20542 21182 11473 1155 -15513 4094 887 -9342 16305 -2123 -19380 -15624 -14285
12915 -14285 -10415 -2972 11672 5155 -6987 -16757 9332 8734 22083 82680 104742 133640 129795
12902 129795 122796 132464 158955 172914 174878 164527 179540 192821 200615 211120 185504 198271
$$ packed form
12991A12994l2990k9842k0012M985J3704K2028j1474q168Q779L172J49J6226o074
12978G3477j2958R746P277J3460J2804P160P239J4744K0372J5272K4880J0982
12966B04455J5522l620j1093K8860L4111J0644j980O143j2961o418J2274l3482
12954B42455m9558J10r112m15n138L908J6026R274m473k0491M700r634j58j4473
12940A63021k4565j4247r225j2667P986k6300m1627k0178j1071J9910J2049n248
12928C7838j7296O40r709j0318j6668J9607l207j0229K5647j8428j7257L756J339
12915a4285L870P443J4644o517j2142r770K6089n98J3349O0597K2062K8898l845
12902A29795o999R668K6491J3959J964j0351J5013J3281P794J0505k5616J2767
$$ plain form
12890 198271 216011 229514 221103 193395 189703 206016 211384 196108 164358 153193 138819 142361
12878 142361 165615 160113 155771 162881 179146 193440 195162 179973 166056 168712 175950 186104 189220
12865 189220 168076 184637 205803 214291 216366 229253 249593 257858 234852 237823 236669 223901
12853 223901 245524 270224 268306 264093 258286 227981 214994 232302 236266 228205 247561 258227
12841 258227 289652 292305 255954 256094 252417 295553 342517 386351 415064 404920 381552 400374
12829 400374 482385 618670 755910 869369 959261 968137 915338 853640 778032 702642 657989
12818 657989 615329 596374 559322 545670 529376 506948 452475 414366 422436 438599 432743 413686
12806 413686 392869 367246 382251 380800 371236 357028 343876 356246 328759 318665 331764 327319
$$ packed form
12890A98271J7740J3503q411k7708l692J6313N368j5276l1750j1165j4374L542
12878A42361K3254n502m342P110J6265J4294J722j5189j3917K656P238J0154L116
12865A89220k1144J6561K1166Q488K075J2887K0340Q265k3006K971j154j2768
12853B23901K1623K4700j918m213n807l0305j2987J7308L964q061J9356J0666
12841B58227L1425K653l6351J40l677M3136M6964M3834K8713j0144k3368J8822
12829D00374Q2011J36285J37240J13459Q9892Q876n2799o1698p5608p5390m4653
12818F57989m2660j8955l7052j3652j6294k2428n4473l8109Q070J6163n856j9057
12806D13686k0817k5623J5005j451r564j4208j3152J2370k7487j0094J3099m445
$$ plain form
12794 327319 323696 333710 346853 365616 367039 364509 378235 380733 392762 397178 407706 425938
12782 425938 440794 426754 432144 423278 456456 499567 526850 549589 560937 572771 579664 588706
12770 588706 594928 610982 635034 658892 675972 686421 722854 758814 818061 857615 901071 942432
12758 942432 930227 943889 951968 974092 1003883 1038053 1073750 1121912 1167695 1190243 1218257 1292036
12746 1292036 1380790 1485575 1568305 1654196 1707405 1778146 1894579 1977891 2049884 2150047 2279272
12735 2279272 2447653 2605127 2773745 2990912 3273931 3531035 3788077 4075588 4377131
12726 4377131 4736235 5112854 5529197 6047521 6605661 7242495 7990672 8896381 10011164
12717 10011164 11343057 12895907 14772481 17081636 19946067 23571138 28252099 34329487
$$ packed form
12794C27319l623J0014J3143J8763J423k530J3726K498J2029M416J0528J8232
12782D25938J4856j4040N390q866L3178M3111K7283K2739J1348J1834O893R042
12770E88706O222J6054K4052K3858J7080J0449L6433L5960N9247L9554M3456M1361
12758I42432j2205J3662Q079K2124K9791L4170L5697M8162M5783K2548K8014P3779
12746A292036Q8754J04785Q2730Q5891N3209P0741J16433Q3312P1993J00163J29225
12735B279272J68381J57474J68618K17167K83019K57104K57042K87511L01543
12726D377131L59104L76619M16343N18324N58140O36834P48177R05709J114783
12717A0011164J331893J552850J876574K309155K864431L625071M680961O077388
$$ plain form
12709 34329487 42588808 54506250 72308901 98294490 133676453 176441540 223197504
12702 223197504 275292706 335430922 404842821 474689375 523195410 531540165 493248141
12695 493248141 422317719 325957532 224500894 150333819 105480738 78435184 60962539
12688 60962539 48954125 40224789 33692426 28686166 24686042 21341541 18438785 15992984
12680 15992984 14000934 12407680 11117275 10013797 9097067 8281917 7572156 6957556 6427273
12671 6427273 5950893 5520414 5142726 4827801 4549488 4302216 4074835 3855570 3658398
12662 3658398 3467076 3308635 3168073 3052045 2925824 2778611 2652139 2533484 2404286
12653 2404286 2293161 2218730 2176626 2129665 2066665 2012400 1938740 1890269 1843945 1746619 1640271
$$ packed form
12709C4329487Q259321J1917442J7802651K5985589L5381963M2765087M6755964
12702B23197504N2095202O0138216O9411899O9846554M8506035Q344755l8292024
12695D93248141p0930422r6360187j01456638p4167075m4853081k7045554j7472645
12688F0962539j2008414q729336o532363n006260m000124l344501k902756k445801
12680A5992984j992050j593254j290405j103478r16730q15150p09761o14600n30283
12671F427273m76380m30479l77688l14925k78313k47272k27381k19265j97172
12662C658398j91322j58441j40562j16028j26221j47213j26472j18655j29198
12653B404286j11125p4431m2104m6961o3000n4265p3660m8471m6324r7326j06348
$$ plain form
12642 1640271 1556461 1498302 1444955 1397875 1356412 1319721 1290066 1255085 1223498 1200869 1192670
12631 1192670 1160219 1131177 1112450 1094260 1076999 1036860 1005970 987400 938270 908424 906820
12620 906820 891541 902174 887607 865241 840481 827886 798659 777872 752895 733293 709371
12609 709371 668421 678363 690871 685612 680122 700992 683726 628092 595488 587052 604012 633057
12597 633057 634952 614012 556768 532464 517438 491330 478175 476662 496388 477395 448150 446641
12585 446641 478011 477431 453262 412294 360887 330414 319581 319682 286727 248360 225174 237855
12573 237855 267344 273465 242081 187625 136339 94186 75096 146945 280360 384777 425841
12562 425841 444462 424299 366947 306390 268170 268691 268239 265573 260077 260818 256264 241977 230511
$$ packed form
12642A640271q3810n8159n3347m7080m1463l6691k9655l4981l1587k2629q199
12631A192670l2451k9042j8727j8190j7261m0139l0890j8570m9130k9846j604
12620I06820j5279J0633j4567k2366k4760j2595k9227k0787k4977j9602k3922
12609G09371m0950R942J2508n259n490K0870j7266n5634l2604q436J6960K9045
12597F33057J895k0940n7244k4304j5026k6108j3155j513J9726j8993k9245j509
12585D46641L1370n80k4169m0968n1407l0473j0833J01l2955l8367k3186J2681
12573B37855K9489O121l1384n4456n1286m2153j9090P1849J33415J04417M1064
12562D25841J8621k0163n7352o0557l8220N21m52k666n496P41m554j4287j1466
$$ plain form
12549 230511 216381 202620 192075 182780 181796 178394 183814 201091 165985 163408 188953 198814 200222
12536 200222 174376 161302 170604 168642 176038 173421 173386 199409 217340 221106 232785 229733 219178
12523 219178 213966 231211 216135 189828 194599 185145 172760 178460 178248 162547 152421 146431 136856
12510 136856 116711 107361 96815 93547 78328 74892 93392 86373 110210 137761 124227 108213
12498 108213 111364 136887 154927 170786 196146 219900 207625 210976 220022 213528 245880 281190
12486 281190 271223 260051 244663 259411 276766 253737 261888 265295 278586 268525 240237 229817
12474 229817 224343 207974 216044 208875 207908 200113 238765 258171 211392 171163 191672 218722 217258
12461 217258 204017 207800 234978 243619 255780 263834 259288 268722 253390 236760 233006 231736 210477
$$ packed form
12549B30511j4130j3761j0545r295r84l402N420J7277l5106k577K5545R861J408
12536B00222k5846j3074R302j962P396k617l5K6023J7931L766J1679l052j0555
12523B19178n212J7245j5076k6307M771r454j2385N700k12j5701j0126n990r575
12510A36856k0145r350j0546l268j5219l436J8500p019K3837K7551j3534j6014
12498A08213L151K5523J8040J5859K5360K3754j2275L351R046o494L2352L5310
12486B81190r967j1172j5388J4748J7355k3029Q151L407J3291j0061k8288j0420
12474B29817n474j6369Q070p169r67p795L8652J9406m6779m0229K0509K7050j464
12461B17258j3241L783K7178Q641J2161Q054m546R434j5332j6630l754j270k1259
$$ plain form
12448 210477 198119 198953 195556 187150 174242 153265 138890 142682 148847 134102 121534 101227 106222
12435 106222 105602 129201 131489 117496 122685 138589 140930 141039 148678 153347 148103 160169 162645 171304
12421 171304 170833 141688 150426 163008 163535 174917 174760 170457 156437 166039 133798 84602 83002
12408 83002 115844 130359 122958 105743 109282 108424 92845 63186 20246 7344 7101 -12317 -13747
12395 -13747 4310 -29399 -42792 -61500 -87019 -63877 -34114 36978 121495 151796 174530 204214
12383 204214 209988 194737 189955 207093 222566 202132 177719 182680 177247 185022 177628 193101 176090
12370 176090 162363 180492 217868 216540 210621 199316 184176 168205 147177 125756 116024 125333
12358 125333 122206 126588 135276 144594 140804 132243 150314 142230 144020 151896 147993 163361 179167
$$ packed form
12448B10477j2358Q34l397q406j2908k0977j4375L792O165j4745j2568k0307M995
12435A06222o20K3599K288j3993N189J5904K341J09P639M669n244J2066K476Q659
12421A71304m71k9145Q738J2582N27J1382j57m303j4020R602l2241m9196j600
12408H3002L2842J4515p401j7215L539q58j5579k9659m2940j2902k43j9418j430
12395a3747J8057l3709j3393j8708k5519K3142K9763P1092Q4517L0301K2734K9684
12383B04214N774j5251m782J7138J5473k0434k4413M961n433P775p394J5473j7011
12370A76090j3727J8129L7376j328n919j1305j5140j5971k1028k1421r732R309
12358A25333l127M382Q688R318l790q561J8071q084J790P876l903J5368J5806
$$ plain form
12345 179167 177844 180714 192650 171990 151148 177120 195565 199781 190220 174646 182262 219076
12333 219076 233784 271360 330896 417545 491394 566982 655570 758962 885271 1034310 1111066
12322 1111066 1093327 986685 762345 546686 398071 323410 270716 271064 268878 237564 226716
12311 226716 215383 217377 207497 188770 176538 191003 183465 196809 194934 180186 173894 176733 190189
12298 190189 212614 226398 234971 245668 234740 216473 191894 189716 200391 207030 204180 202211
12286 202211 213573 205567 175003 175275 178149 190781 206702 224135 222259 218197 229930 240381 234870
12273 234870 212701 199704 224956 276297 306041 283945 265153 287265 299449 302604 303352 341037
12261 341037 420627 494588 596133 742501 936673 1145994 1384388 1658261 1994555 2354882
$$ packed form
12345A79167j323K870J1936k0660k0842K5972J8445M216r561j5574P616L6814
12333B19076J4708L7576N9536Q6649P3849P5588Q8588J03392J26309J49039P6756
12322A111066j7739j06642k24340k15659j48615p4661n2694L48k186l1314j0848
12311B26716j1333J994r880j8727j2232J4465p538J3344j875j4748o292K839J3456
12298A90189K2425J3784Q573J0697j0928j8267k4579k178J0675O639k850j969
12286B02211J1362q006l0564K72K874J2632J5921J7433j876m062J1733J0451n511
12273B34870k2169j2997K5252N1341K9744k2096j8792K2112J2184L155P48L7685
12261C41037P9590P3961J01545J46368J94172K09321K38394K73873L36294L60327
$$ plain form
12251 2354882 2710452 2943234 2955666 2742739 2352875 1830493 1335707 985714 771152 628564
12241 628564 538398 482706 449042 414382 386031 362877 361481 354494 341844 319008 294030 273436
12229 273436 259022 259971 268886 272337 247534 231858 246656 250508 265782 255265 232588 228775 245184
12216 245184 259914 256274 257905 272340 280568 267547 270120 271096 260992 260073 253930 264675 261687
12203 261687 240661 217199 238456 248900 268614 257354 245392 291941 314729 285668 295989
12192 295989 294941 285996 302458 317852 320592 312983 303886 305860 297832 293569 283506 263217 270535
12179 270535 295363 302531 288516 274539 268118 282870 291002 321581 325951 292124 301155 318447
12167 318447 305332 299401 292141 301644 322961 330148 325102 329343 316958 317636 325688 323573 336619
$$ packed form
12251B354882L55570K32782J2432k12927l89864n22382m94786l49993k14562j42588
12241F28564r0166n5692l3664l4660k8351k3154j396o987j2650k2836k4978k0594
12229B73436j4414R49Q915L451k4803j5676J4798L852J5274j0517k2677l813J6409
12216B45184J4730l640J631J4435Q228j3021K573R76j0104r19o143J0745k988
12203B61687k1026k3462K1257J0444J9714j1260j1962M6549K2788k9061J0321
12192B95989j048q945J6462J5394K740p609r097J974q028m263j0063k0289P318
12179B70535K4828P168j4015j3977o421J4752Q132L0579M370l3827R031J7292
12167C18447j3115n931p260R503K1317P187n046M241j2385O78Q052k115J3046
$$ plain form
12154 336619 343580 366244 384753 388625 396508 412832 397335 385656 392079 389450 375676 380555 405396
12141 405396 407856 404915 408200 392543 385719 386640 378036 376019 382720 392581 394132 398803 385751 369849
12127 369849 387883 403301 395581 363875 379866 402397 418366 417518 423067 417560 431894 436942 441305
12114 441305 458967 466609 484123 463681 465684 462231 444163 456162 468839 489580 487761 493081
12102 493081 531253 541294 558047 562385 570049 563402 545699 578867 582308 556050 553688 554294 566859
12089 566859 566951 569284 587882 582346 598646 588154 579264 585793 593686 602577 604619 595153 597705 607913
12075 607913 620874 607976 589097 620979 652813 647132 678293 699643 688508 692018 697147 699546
12063 699546 706982 709370 727448 760688 771061 777454 792188 816198 837859 846370 843953 842881 837071
$$ packed form
12154C36619O961K2664J8509L872P883J6324j5497j1679O423k629j3774M879K4841
12141D05396K460k941L285j5657o824R21q604k017O701R861J551M671j3052j5902
12127C69849J8034J5418p720l1706J5991K2531J5969q48N549n507J4334N048M363
12114D41305J7662P642J7514k0442K003l453j8068J1999J2677K0741j819N320
12102D93081L8172J0041J6753M338P664o647j7703L3168L441k6258k362O06J2565
12089E66859R2K333J8598n536J6300j0492q890O529P893Q891K042r466K552J0208
12075F07913J2961j2898j8879L1882L1834n681L1161K1350j1135L510N129K399
12063F99546P436K388J8078L3240J0373O393J4734K4010K1661Q511k417j072n810
$$ plain form
12050 837071 824863 828493 847859 848324 862576 852170 859937 861242 880240 891544 898495 891575 886813
12037 886813 892234 935682 948508 948408 976757 998327 1009587 1025076 1035856 1049008 1041178 1054390
12025 1054390 1073843 1095179 1092790 1104621 1136587 1162380 1156705 1153009 1156853 1167449 1172718 1193992
12013 1193992 1191458 1210390 1248928 1257923 1276474 1286435 1297726 1340177 1377271 1396158 1389783 1367345
12001 1367345 1374630 1386458 1387400 1431859 1461399 1472730 1486208 1502442 1514299 1535785 1548618 1546479
11989 1546479 1548069 1597552 1627740 1606943 1621604 1630782 1662362 1671117 1689616 1716688 1733798 1743219
11977 1743219 1765887 1784078 1815900 1845550 1878165 1895409 1888460 1898426 1875783 1889474 1903795 1925299
11965 1925299 1945018 1959747 1971633 1968512 1987288 1995559 1999258 2009630 2047436 2085601 2111698 2124007
$$ packed form
12050H37071j2208L630J9366M65J4252j0406P767J305J8998J1304O951o920m762
12037H86813N421M3448J2826j00K8349K1570J1260J5489J0780J3152p830J3212
12025A054390J9453K1336k389J1831L1966K5793n675l696L844J0596N269K1274
12013A193992k534J8932L8538Q995J8551R961J1291M2451L7094J8887o375k2438
12001A367345P285J1828R42M4459K9540J1331J3478J6234J1857K1486J2833k139
11989A546479J590M9483L0188k0797J4661R178L1580Q755J8499K7072J7110R421
11977A743219K2668J8191L1822K9650L2615J7244o949R966k2643J3691J4321K1504
11965A925299J9719J4729J1886l121J8776Q271L699J0372L7806L8165K6097J2309
$$ plain form
11953 2124007 2132497 2132228 2113670 2110500 2117413 2127168 2161667 2165205 2152384 2146949 2157761 2165838 2168620
11940 2168620 2197579 2188509 2174596 2177269 2183326 2185999 2148158 2119658 2117950 2136602 2140754 2146168 2154483
11927 2154483 2155279 2142684 2128382 2120607 2106013 2081759 2063719 2065376 2081018 2090169 2077444 2069519
11915 2069519 2048869 2013461 1983219 1982060 1975992 1945672 1937339 1906468 1881178 1866207 1867534 1861907
11903 1861907 1859883 1873596 1866276 1854658 1817728 1782714 1782399 1772838 1752260 1732739 1720545 1714744
11891 1714744 1703550 1705100 1669926 1609056 1582210 1570553 1563833 1543741 1513008 1498989 1497759 1506000
11879 1506000 1507677 1473346 1453485 1446068 1439110 1407422 1393769 1379639 1348861 1319676 1309254 1311653
11867 1311653 1289681 1250047 1233094 1230366 1218960 1216538 1197575 1188331 1170452 1154826 1132607 1138257
$$ packed form
11953B124007Q490k69j8558l170O913R755L4499L538j2821n435J0812Q077K782
11940B168620K8959r070j3913K673O057K673l7841k8500j708J8652M152N414Q315
11927B154483P96j2595j4302p775j4594k4254j8040J657J5642R151j2725p925
11915B069519k0650l5408l0242j159o068l0320q333l0871k5290j4971J327n627
11903A861907k024J3713p320j1618l6930l5014l15r561k0578j9521j2194n801
11891A714744j1194J550l5174o0870k6846j1657o720k0092l0733j4019j230Q241
11879A506000J677l4331j9861p417o958l1688j3653j4130l0778k9185j0422K399
11867A311653k1972l9634j6953k728j1406k422j8963r244j7879j5626k2219N650
$$ plain form
11855 1138257 1141781 1137601 1130944 1095285 1055915 1044216 1052455 1043170 1032401 1014977 978179 981100
11843 981100 967134 925426 910068 906150 888479 899999 921482 926824 873018 851053 867595 843273
11831 843273 826375 802961 819233 831495 816573 778105 759139 774796 787247 792338 772038 731544
11819 731544 706794 722559 737851 735067 718949 712670 695935 690101 703808 688431 665102 669761
11807 669761 674920 662516 653737 659362 645543 630630 621509 613722 609812 622354 618662 595127 605239
11794 605239 582085 541124 508909 497305 523526 537078 539472 524619 509511 485518 502091 534255
11782 534255 533153 515110 509734 484826 466970 442244 456013 463035 445469 442525 448457 438974 431464
11769 431464 446112 455254 462791 437657 423195 407632 380933 379085 387484 386903 390059 377233 385736
$$ packed form
11855A138257L524m180o657l5659l9370j1699Q239r285j0769j7424l6798K921
11843I81100j3966m1708j5358l918j7671J1520K1483N342n3806k1965J6542k4322
11831H43273j6898k3414J6272J2262j4922l8468j8966J5657J2451N091k0300m0494
11819G31544k4750J5765J5292k784j6118o279j6735n834J3707j5377k3329M659
11807F69761N159j2404q779N625j3819j4913r121p787l910J2542l692k3535J0112
11794F05239k3154m0961l2215j1604K6221J3552K394j4853j5108k3993J6573L2164
11782E34255j102j8043n376k4908j7856k4726J3769P022j7566k944N932r483p510
11769D31464J4648R142P537k5134j4462j5563k6699j848Q399n81L156j2826Q503
$$ plain form
11756 385736 362314 362652 365165 379639 380836 367065 379125 364489 330383 325663 326785 343805 358887
11743 358887 351308 353843 338344 335649 341304 334391 318615 307774 305643 293171 307329 339084 340709
11730 340709 307606 272210 266240 292820 311002 316264 311074 312057 308766 286683 246339 237945 247034
11717 247034 241527 262855 269531 277634 291841 290241 276991 277372 289435 301346 297300 264604 258620
11704 258620 238386 235251 233562 248973 237406 230482 251204 239313 212237 207799 232348 250720
11692 250720 235977 218257 223673 220039 225790 233661 238202 215575 214225 226233 218334 216259 206329
11679 206329 184530 178281 164067 168259 184680 184082 157903 180558 221202 200512 181578 176468
11667 176468 187692 167549 186351 193526 184033 199505 201051 214029 206301 189277 195773 220502
$$ packed form
11756C85736k3422L38K513J4474J197j3771J2060j4636l4106m720J122J7020J5082
11743C58887p579K535j5499k695N655o913j5776j0841k131j2472J4158L1755J625
11730C40709l3103l5396n970K6580J8182N262n190R83l291k2083m0344q394R089
11717B47034n507K1328O676Q103J4207j600j3250L81J2063J1911m046l2696n984
11704B58620k0234l135j689J5411j1567o924K0722j1891k7076m438K4549J8372
11692B50720j4743j7720N416l634N751P871M541k2627j350J2008p899k075r930
11679B06329k1799o249j4214M192J6421n98k6179K2655M0644k0690j8934n110
11667A76468J1224k0143J8802P175r493J5472J546J2978p728j7024O496K4729
$$ plain form
11655 220502 216518 183239 175381 165263 169726 187317 190619 187359 190410 197783 197002 192948 177080
11642 177080 171532 148508 139534 137341 146233 140099 123892 132020 135432 147961 139306 141614 146915
11629 146915 136013 127679 136913 141225 129092 126358 139891 134345 139476 156287 163428 134917 138681
11616 138681 132439 129688 143461 151844 169825 160792 159441 164801 161643 163269 156458 167818 163775
11603 163775 144397 152705 162040 159398 165541 143896 111469 92539 95877 101043 115619 100034 92125
11590 92125 94240 96361 129079 151451 132600 103449 88694 90104 126013 144873 132193 97725
11578 97725 94981 103663 114821 107661 94810 109966 122185 137821 150343 171278 164823 143992
11566 143992 121279 90817 100324 111445 114056 120086 122953 113817 110229 114250 128083 139210 146482
$$ packed form
11655B20502l984l3279p858j0118M463J7591L302l260L051P373p81m054j5868
11642A77080n548k3024q974k193Q892o134j6207Q128L412J2529q655K308N301
11629A46915j0902q334R234M312j2133k734J3533n546N131J6811P141k8511L764
11616A38681o242k751J3773Q383J7981r033j351N360l158J626o811J1360m043
11603A63775j9378Q308R335k642O143k1645l2427j8930L338N166J4576j5585p909
11590I2125K115K121L2718K2372j8851k9151j4755J410L5909J8860j2680l4468
11578I7725k744Q682J1158p160j2851J5156J2219J5636J2522K0935o455k0831
11566A43992k2713l0462R507J1121K611O030K867r136l588M021J3833J1127P272
$$ plain form
11553 146482 130868 135952 136848 115510 119086 108352 70613 68882 102035 109715 95775 86089 110290
11540 110290 92239 78149 81588 88947 77933 79653 76591 86865 97032 100658 124377 117652 95633
11527 95633 82767 72556 54030 45084 38897 39144 35654 58291 92346 79561 83137 80758 71214
11514 71214 91330 123798 109544 103889 88143 93698 108485 92652 63988 38360 61965 64168
11502 64168 60792 71821 89034 86291 75995 74371 54046 24378 38928 61113 53349 54491 64741
11489 64741 70769 71925 90631 99805 110920 97871 75028 80394 75335 71148 49451 38744 54259
11476 54259 62985 39108 23180 51354 60953 69727 79413 71563 57574 62264 51224 45324 44242
11463 44242 30828 15017 35006 40354 35283 27865 30004 41200 76410 104536 112735 122770 94731
$$ packed form
11553A46482j5614N084Q96k1338L576j0734l7739j731L3153P680j3940r686K4201
11540A10290j8051j4090L439P359j1014J720l062J0274J0167L626K3719o725k2019
11527I5633j2866j0211j8526q946o187K47l490K2637L4055j2785L576k379r544
11514G1214K0116L2468j4254n655j5746N555J4787j5833k8664k5628K3605K203
11502F4168l376J1029J7213k743j0296j624k0325k9668J4550K2185p764J142J0250
11489F4741O028J156J8706R174J1115j3049k2843N366n059m187k1697j0707J5515
11476E4259Q726k3877j5928K8174R599Q774R686p850j3989M690j1040n900j082
11463D4242j3414j5811J9989N348n071p418K139J1196L5210K8126Q199J0035k8039
$$ plain form
11450 94731 82504 97136 100622 105847 122585 114453 86070 77626 80938 84681 78850 65781 77346
11437 77346 90768 86765 65649 47936 46980 43589 29271 13789 49525 55098 42777 55226 73173
11424 73173 65942 71550 75155 46802 25478 26448 52389 72967 82544 64854 41729 37364 62930
11411 62930 73700 52113 41605 16602 3613 34356 46658 23117 27169 58532 59120 52460
11399 52460 46802 62518 60655 49395 41149 46465 59452 57030 71524 94266 84517 60321 76731
11386 76731 65282 40385 58101 95026 121294 81385 58692 72425 83427 82069 75733 54800
11374 54800 43141 52964 32518 18790 55117 53591 35174 44823 57377 38645 19310 27240
11362 27240 58686 65258 59512 56204 46170 29896 31960 31056 32473 36254 10081 -4774 15121
$$ packed form
11450I4731j2227J4632L486N225J6738q132k8383q444L312L743n831j3069J1565
11437G7346J3422m003k1116j7713r56l391j4318j5482L5736N573j2321J2449J7947
11424G3173p231N608L605k8353k1324R70K5941K0578R577j7690k3125m365K5566
11411F2930J0770k1587j0508k5003j2989L0743J2302k3541M052L1363N88o660
11399E2460n658J5716j863j1260q246N316J2987k422J4494K2742r749k4196J6410
11386G6731j1449k4897J7716L6925K6268l9909k2693J3733J1002j358o336k0933
11374E4800j1659R823k0446j3728L6327j526j8417R649J2554j8732j9335P930
11362B7240L1446O572n746l308j0034j6274K064r04J417L781k6173j4855J9895
$$ plain form
11349 15121 33689 55509 63353 66159 79791 56227 36960 58841 70484 48370 44030 54870
11337 54870 57755 59112 42126 48860 26791 41245 48572 52244 62572 84033 88823 96029 87029
11324 87029 77718 69867 60295 18969 11538 6970 23165 50591 58327 49647 55178 38986 41958
11311 41958 56471 65319 46989 43007 53242 57557 53887 55109 26269 5975 1550 37285 40474
11298 40474 44965 33756 37905 44795 47838 24439 44424 55636 24034 7831 10205 16355 4493
11285 4493 13583 24715 31183 22742 15959 42609 51886 29298 2639 -15442 -5107 19776 24613
11272 24613 27737 12246 -14999 -6706 -4226 18332 27126 34927 32096 28719 31389 25682 38462
11259 38462 51036 59862 54066 56017 67095 53089 22805 19096 17704 32483 18402 25638 37392
$$ packed form
11349A5121J8568K1820P844K806J3632k3564j9267K1881J1643k2114m340J0840
11337E4870K885J357j6986O734k2069J4454P327L672J0328K1461M790P206r000
11324H7029r311p851r572m1326p431m568J6195K7426P736q680N531j6192K972
11311D1958J4513Q848j8330l982J0235M315l670J222k8840k0294m425L5735L189
11298D0474M491j1209M149O890L043k3399J9985J1212l1602j6203K374O150j1862
11285D493R090J1132O468q441o783K6650R277k2588k6659j8081J0335K4883M837
11272B4613L124j5491k7245Q293K480K2558Q794P801k831l377K670n707J2780
11259C8462J2574Q826n796J951J1078j4006l0284l709j392J4779j4081P236J1754
$$ plain form
11246 37392 49176 39751 28672 28539 29870 24328 11677 25509 21281 19373 18771 4877 7182 12679
11232 12679 47268 51765 31497 31884 38720 65662 89880 70429 53294 42079 25855 15971 53430
11219 53430 68533 40946 18888 16497 24556 15480 16593 52794 45913 21068 -258 21132 48937
11206 48937 33152 -3506 -4306 11749 13948 6441 7353 36623 23302 5673 -821 -15632 -1569
11193 -1569 -7200 9781 19691 37085 46820 14667 12398 17728 21046 18156 8061 3077 -853 1867
11179 1867 -41885 -50339 -28115 -18194 -3846 14400 16862 6049 -14679 3925 8557 26199 28755
11166 28755 30588 31968 19487 -2167 -3060 26543 10849 -19218 -11317 18178 37226 32460 35152
11153 35152 49521 32037 17425 2068 -585 -17641 -19288 -4373 14474 31686 44243 45118
$$ packed form
11246C7392J1784r425j1079j33J331n542j2651J3832m228j908o02j3894K305N497
11232A2679L4589M497k0268L87O836K6942K4218j9451j7135j1215j6224r884L7459
11219E3430J5103k7587k2058k391Q059r076J113L6201o881k4845k1326K1390K7805
11206D8937j5785l6658q00J6055K199p507R12K9270j3321j7629o494j4811J4063
11193a569n631J6981R910J7394R735l2153k269N330L318k890j0095m984l930K720
11179A867m3752q454K2224R921J4348J8246K462j0813k0728J8604M632J7642K556
11166B8755J833J380j2481k1654q93K9603j5694l0067P901K9495J9048m766K692
11153C5152J4369j7484j4612j5357k653j7056j647J4915J8847J7212J2557Q75
$$ plain form
11141 45118 38322 12919 16153 23643 15296 20464 54465 48633 33134 17693 27358 32469 25715
11128 25715 27747 34241 22328 18494 21629 8495 -9788 -13054 -2792 17203 24066 9693 -100
11115 -100 10217 54214 71510 38318 20793 23762 15121 -7150 -179 2504 2165 34374 37856
11102 37856 35784 34501 20775 16256 29335 18961 22758 38206 38192 38010 39711 34419 34263 37511
11088 37511 45256 32120 24048 24123 29912 4885 5343 19809 27399 27819 30913 42783 45166 30518
11074 30518 3134 -3279 -4126 -583 16912 40092 47154 32072 15977 4124 18099 24897 28703
11061 28703 22684 12076 -7528 -27901 -4980 11593 25552 19642 27684 31327 22411 26123 25634
11048 25634 14713 6642 10266 39414 64057 89497 86367 88762 105485 89596 89752 95523 122175
$$ packed form
11141D5118o796k5403L234P490q347N168L4001n832j5499j5441R665N111o754
11128B5715K032O494j1913l834L135j3134j8283l266J0262J9995O863j4373r793
11115a00J0317M3997J7296l3192j7525K969q641k2271O971K683l39L2209L482
11102C7856k072j283j3726m519J3079j0374L797J5448j4j82J701n292j56L248
11088C7511P745j3136q072P5N789k5027M58J4466P590M20L094J1870K383j4648
11074C0518k7384o413q47L543J7495K3180P062j5082j6095j1853J3975O798L806
11061B8703o019j0608j9604k0373K2921J6573J3959n910Q042L643q916L712m89
11048B5634j0921q071L624K9148K4643K5440l130K395J6723j5889J56N771K6652
$$ plain form
11035 122175 111998 94571 90044 113953 125555 160207 170184 142526 102835 124077 143603 142827
11023 142827 133886 127594 135021 151811 171331 161165 143097 132400 126608 123760 147654 170646
11011 170646 155882 157494 176117 180965 155578 162120 153020 149353 134357 116526 102410 92136
10999 92136 105331 88642 90483 91683 58899 39046 38856 27473 12372 7040 17497 26110 43942
10986 43942 72661 63331 50926 41306 32606 22154 21136 37446 20569 9989 20675 12741 16268
10973 16268 18053 11166 26417 35986 21675 9027 9143 23785 25769 25982 35971 36760 37823 36212
10959 36212 44603 39806 34605 36178 31344 39191 66011 62402 31700 25309 26252 20093 26066 39957
10945 39957 48793 45886 38473 11186 -1907 8963 9978 -13260 -26347 -39577 -21373 834
$$ packed form
11035A22175j0177j7427m527K3909J1602L4652R977k7658l9691K1242J9526p76
11023A42827q941o292P427J6790J9520j0166j8068j0697n792k848K3894K2992
11011A70646j4764J612J8623M848k5387O542r100l667j4996j7831j4116j0274
10999I2136J3195j6689J841J200l2784j9853j90j1383j5101n332J0457Q613J7832
10986D3942K8719r330j2405r620q700j0452j018J6310j6877j0580J0686p934L527
10973A6268J785o887J5251R569j4311j2648J16J4642J984K13R989P89J063j611
10959C6212Q391m797n201J573m834P847K6820l609l0702o391R43o159N973J3891
10945C9957Q836k907p413k7287j3093J0870J015k3238j3087j3230J8204K2207
$$ plain form
10933 834 15509 10745 -13056 -15713 -9131 -8823 7296 14728 14463 4070 -8965 -7603 -6076 -4086
10919 -4086 14439 44499 46482 15369 -25714 -43939 -65346 -64517 -30270 18162 24266 29223 35290
10906 35290 34702 37393 15463 897 -3226 -120 -6149 -14425 -5037 3624 21565 12618 11346 30953
10892 30953 52237 55953 49069 72343 62804 51752 54125 52611 48957 48102 30307 27413 15746
10879 15746 10239 22865 55538 73255 35408 26822 46296 54896 52040 26855 25243 15257 20167
10866 20167 34684 14251 12721 35406 49468 38207 36741 68724 59646 61596 54534 44152 40291
10853 40291 55050 58556 33756 24062 20279 25502 39891 38051 38028 44372 51446 45930 56204 55565
10839 55565 57575 49515 18115 9296 21566 34173 34232 60717 48834 20140 16175 29027 64018
$$ packed form
10933H34J4675m764k3801k657O582L08J6119P432k65j0393j3035J362J527J990
10919d086J8525L0060J983l1113m1083j8225k1407Q29L4247M8432O104M957O067
10906C5290n88K691k1930j4566m123L106o029q276R388Q661J7941q947j272J9607
10892C0953K1284L716o884K3274r539j1052K373j514l654q55j7795k894j1667
10879A5746n507J2626L2673J7717l7847q586J9474Q600k856k5185j612r986M910
10866B0167J4517k0433j530K2685J4062j1261j466L1983r078J950p062j0382l861
10853D0291J4759L506k4800r694l783N223J4389j840k3O344P074n516J0274o39
10839E5565K010q060l1400q819J2270J2607N9K6485j1883k8694l965J2852L4991
$$ plain form
10826 64018 71202 55418 54114 42908 46737 47357 27769 22013 46637 33333 15834 -25668 -35078
10813 -35078 -38094 -25251 14517 22595 9288 13148 39293 18138 -17678 -39506 -43599 -20876
10801 -20876 14456 29340 21588 13240 11897 27611 42297 69998 81073 59153 47122 44882
10789 44882 50642 44923 16495 -5186 -19736 -7365 -8763 -1324 5605 26854 48277 27100 17803
10776 17803 25183 38783 17900 8764 8512 29956 33194 28880 29249 21892 14535 30471 44738 47122
10762 47122 34637 43799 17998 26285 41115 50403 43455 15044 26533 29693 37390 25701 14513
10749 14513 18469 33824 31205 23857 29941 33541 33263 44346 42338 42052 15310 36118 53668 80527
10735 80527 82924 63051 38252 17668 29829 23536 44314 83230 96139 86802 52376 52581 65742
$$ packed form
10826F4018P184j5784j304j1206L829O20j9588n756K4624j3304j7499m1502r410
10813c5078l016J2843L9768Q078j3307L860K6145k1155l5816k1828m093K2723
10801b0876L5332J4884p752q348j343J5714J4686K7701J1075k1920j2031k240
10789D4882N760n719k8428k1681j4550J2371j398P439O929K1249K1423k1177r297
10776A7803P380J3600k0883r136k52K1444L238m314L69p357p357J5936J4267K384
10762D7122j2485R162k5801Q287J4830R288o948k8411J1489L160P697j1689j1188
10749A4513L956J5355k619p348O084L600k78J1083k008k86k6742K0808J7550K6859
10735H0527K397j9873k4799k0584J2161o293K0778L8916J2909r337l4426K05J3161
$$ plain form
10722 65742 60775 61782 72017 92730 71424 59176 53755 50061 48971 58789 65344 48583 26928
10709 26928 40254 67891 66386 82742 92084 73524 57758 52167 47010 51706 55236 55842 34591
10696 34591 41295 48106 42966 938 5784 35913 61005 69035 40768 15780 27473 37925 31304
10683 31304 43605 54526 56413 56889 50893 43794 58146 76859 71476 62628 53957 69674 82015
10670 82015 62797 45241 36102 46029 52808 73224 92920 105584 108770 110425 83470 70296 66616
10657 66616 72297 99856 108488 118166 110251 122791 128240 116978 123049 147235 154152 166434 181547
10644 181547 182862 199515 190147 183445 212986 257357 283616 306795 337786 380897 418279 441748
10632 441748 512889 588581 638968 720540 785558 904980 1058470 1233004 1446345 1749150
$$ packed form
10722F5742m967J007J0235K0713k1306j2248n421l694j090R818O555j6761k1655
10709B6928J3326K7637j505J6356R342j8560j5766n591n157M696L530O06k1251
10696C4591O704O811n140m2028M846L0129K5092Q030k8267k4988J1693J0452o621
10683C1304J2301J0921J887M76n996p099J4352J8713n383q848q671J5717J2341
10670H2015j9218j7556r139R927O779K0416J9696J2664L186J655k6955j3174l680
10657F6616N681K7559Q632R678p915J2540N449j1262O071K4186O917J2282J5113
10644A81547J315J6653r368o702K9541M4371K6259K3179L0991M3111L7382K3469
10632D41748P1141P5692N0387Q1572O5018J19422J53490J74534K13341L02805
$$ plain form
10622 1749150 2157093 2706604 3410004 4234138 5175583 6205572 7321568 8534826 9772367
10613 9772367 10830879 11461799 11642880 11605469 11687933 12186632 13139815 14468177 16044191
10604 16044191 17875281 19985570 22125136 23730142 24244610 23522112 22183667 21119126
10596 21119126 20921329 21572312 22831464 24546439 26657620 29068328 31325525 32567079
10588 32567079 31959817 29401907 25979921 23006895 21071339 20154861 20007739 20376049 21119290
10579 21119290 22107241 22947089 23023078 21798689 19384704 16509773 14017521 12283393 11235013
10570 11235013 10675344 10451668 10460975 10544996 10482012 10053245 9120107 7752861 6221193 4840103
10560 4840103 3758415 2957974 2392130 1956946 1615559 1399575 1229668 1067461 953808
$$ packed form
10622A749150M07943N49511P03400Q24134R41445J029989J115996J213258J237541
10613I772367J058512O30920J81081l7411Q2464M98699R53183J328362J576014
10604A6044191J831090K110289K139566J605006N14468p22498j338445j064541
10596B1119126j97797O50983J259152J714975K111181K410708K257197J241554
10588C2567079o07262k557910l421986k973026j935556r16478j47122L68310P43241
10579B1119290R87951Q39848P5989j224389k413985k874931k492252j734128j048380
10570A1235013n59669k23676R307Q4021o2984m28767r33138j367246j531668j381090
10560D840103j081688q00441n65844m35184l41387k15984j69907j62207j13653
$$ plain form
10551 953808 863162 794142 727133 664877 611039 587887 561541 505228 461764 423140 396788
10540 396788 387166 371297 331204 309320 292208 289182 275417 278706 289303 279556 258963 258901 248824
10527 248824 235412 228489 222699 203713 185511 192525 198355 203364 209809 187982 160342 135709 124766
10514 124766 152357 182881 192219 168450 175365 172654 155160 124906 116868 117454 159720 156332 141480
10501 141480 140287 123748 122242 145813 132345 110686 105437 111253 112203 121588 118626 113598 113464 133045
10487 133045 109753 84868 81433 85152 83414 66039 50330 49412 60036 63034 50752 34990 35867
10474 35867 46201 89819 75353 58757 70510 85379 86555 89689 84669 86105 70958 56491
10462 56491 37933 9015 9532 13250 33031 53634 69638 59598 58020 51040 13702 2403 17426
$$ packed form
10551I53808r0646o9020o7009o2256n3838k3152k6346n6313m3464l8624k6352
10540C96788r622j5869m0093k1884j7112l026j3765L289J0597r747k0593o2j0077
10527B48824j3412o923n790j8986j8202P014N830N009O445k1827k7640k4633j0943
10514A24766K7591L0524R338k3769O915k711j7494l0254q038N86M2266l388j4852
10501A41480j193j6539j506K3571j3468k1659n249N816R50R385k962n028j34J9581
10487A33045k3292k4885l435L719j738j7375j5709r18J0624K998j2282j5762Q77
10474C5867J0334M3618j4466j6596J1753J4869J176L134n020J436j5147j4467
10462E6491j8558k8918N17L718J9781K0603J6004j0040j578o980l7338j1299J5023
$$ plain form
10449 17426 34851 54558 64418 45628 22392 14151 16293 30928 44871 44488 35605 47413 48075
10436 48075 46014 35431 30876 21422 10690 52475 55598 39260 44716 16781 10486 52626 64394
10423 64394 66631 69910 82472 61956 55585 48444 42037 28806 1782 14354 50205 41405 21497
10410 21497 25731 33826 42025 51599 79935 74822 54228 63739 75811 52770 42921 40258 24556
10397 24556 33425 37805 25207 27873 30862 41741 43212 39663 62362 77709 42550 27545 24934
10384 24934 43680 84159 41438 10987 15544 42598 42194 49554 60295 55135 64190 61573 53446
10371 53446 57867 63975 41383 16263 2130 -7971 -32005 -19172 16615 46067 37371 27941
10359 27941 41114 48899 39537 31602 16513 20321 29517 19641 34096 33354 26735 21575 242 3797
$$ packed form
10449A7426J7425J9707R860j8790k3236q241K142J4635J3943l83q883J1808O62
10436D8075k061j0583m555r454j0732M1785L123j6338N456k7935o295M2140J1768
10423F4394K237L279J2562k0516o371p141o407j3231k7024J2572L5851q800j9908
10410B1497M234Q095Q199R574K8336n113k0594R511J2072k3041r849k663j5702
10397B4556Q869M380j2598K666K989J0879J471l549K2699J5347l5159j5005k611
10384B4934J8746M0479m2721l0451M557K7054m04P360J0741n160R055k617q127
10371E3446M421O108k2592k5120j4133j0101k4034J2833L5787K9452q696r430
10359B7941J3173P785r362p935j5089L808R196r876J4455p42o619n160k1333L555
$$ plain form
10345 3797 25064 28797 40371 39726 43906 33396 29742 25991 755 -8464 -4700 -3363 9110 9503
10331 9503 18299 17750 18613 22429 20909 10515 12078 26203 314 -10654 -9331 -8213 -6848 -22910
10317 -22910 -31223 -29542 -10817 4593 16787 -1137 -14639 -5961 1770 15568 24933 29022 19873
10304 19873 1838 -9149 -18839 -11269 -26113 -9375 11574 20139 44460 70158 49478 16267
10292 16267 -6479 5935 -4847 -29625 -19812 -11620 -3256 13526 3853 -16682 -6314 10774
10280 10774 12524 20492 35092 61224 66005 58572 70477 77986 69029 42883 43353 27981 24739
10267 24739 40889 43030 27701 4419 11451 15765 -644 -10122 10955 15127 7934 1868 13351
10254 13351 23196 31035 32887 26333 37019 32796 14855 9601 -11321 -11938 6187 15645 16711 25758
$$ packed form
10345C797K1267L733J1574o45M180j0510l654l751k5236r219L764J337J2473L93
10331I503Q796n49Q63L816j520j0394J563J4125k5889j0968J323J118J365j6062
10317b2910q313J681J8725J5410J2194j7924j3502Q678P731J3798R365M089r149
10304A9873j8035j0987r690P570j4844J6738K0949Q565K4321K5698k0680l3211
10292A6267k2746J2414j0782k4778R813Q192Q364J6782r673k0535J0368J7088
10280A0774J750P968J4600K6132M781p433J1905P509q957k6146M70j5372l242
10267B4739J6150K141j5329k3282P032M314j6409r478K1077M172p193o066J1483
10254A3351R845P839J852o554J0686m223j7941n254k0922o17J8125R458J066R047
$$ plain form
10240 25758 47650 49730 46301 38377 32680 10285 -19242 -6279 7193 245 573 2589 -1565
10227 -1565 -17367 -12246 -8408 6344 -8687 -42291 -47448 -31888 -838 -509 12263 22836 8728
10214 8728 -5891 18244 44045 43078 29558 20299 20755 12151 -2848 -4883 7783 19709 19573 8121
10200 8121 24326 36395 47693 70200 68769 60946 41801 4446 -6393 -1743 21483 15772 10826
10187 10826 -11640 1567 -3812 -9371 31011 49186 43671 25525 19273 58506 75347 71595 69747
10174 69747 66969 76189 66905 67214 91102 97684 96676 94190 89399 128911 177887 197761 189063 147666
10160 147666 134089 128519 123185 166184 197665 198031 196172 184783 162630 155422 151834 131836 139369
10147 139369 140159 145318 152274 149141 161683 160185 156071 142331 150767 124748 106527 102195 82591
$$ packed form
10240B5758K1892K080l429p924n697k2395k9527J2963J3472o948L28K016m154
10227a565j5802N121L838J4752j5031l3604n157J5560L1050L29J2772J0573j4108
10214H728j4619K4135K5801r67j3520r259M56q604j4999k035J2666J1926j36j1452
10200H121J6205J2069J1298K2507j431p823j9145l7355j0839M650K3226n711m946
10187A0826k2466J3207n379n559M0382J8175n515j8146o252L9233J6841l752j848
10174F9747k778R220r284L09K3888O582j008k486m791L9512M8976J9874q698m1397
10160A47666j3577n570n334M2999L1481L66j859j1389k2153p208l588j9998P533
10147A39369P90N159O956l133J2542j498m114j3740Q436k6019j8221m332j9604
$$ plain form
10134 82591 103394 85936 69558 84687 90488 89377 65505 45689 55757 46331 29556 17587
10122 17587 31402 32824 31847 34926 4025 -8400 7195 19698 11365 -1053 -12403 -16663 -20734
10109 -20734 21934 25677 -9219 -34654 -52465 -37381 1280 34284 35159 29019 42122 45553 25659
10096 25659 26867 49213 42995 38329 32542 6377 10762 31461 42224 29756 11498 -350 -6103
10083 -6103 9279 9075 7192 8244 33628 16883 18890 27715 34869 12278 -12974 -10971 -5325 20297
10069 20297 47124 49014 47443 60390 50128 34847 22153 22562 27276 22674 37828 38219 10028
10056 10028 11639 35599 46367 47064 31565 29483 29596 29384 22656 12225 24106 15213 -10989 -19846
10042 -19846 4576 -1620 3492 -4196 -7125 -2098 19281 5637 4649 21947 9028 4559 -1129
$$ packed form
10134H2591K0803j7458j6378J5129N801j111k3872j9816J0068r426j6775j1969
10122A7587J3815J422r77L079l0901j2425J5595J2503q333j2418j1350m260m071
10109b0734M2668L743l4896k5435j7811J5084L8661L3004Q75o140J3103L431j9894
10096B5659J208K2346o218m666n787k6165M385K0699J0763j2468j8258j1848n753
10083f103J5382k04j883J052K5384j6745K007Q825P154k2591k5252K003N646K5622
10069B0297K6827J890j571J2947j0262j5281j2694M09M714m602J5154L91k8191
10056A0028J611K3960J0768O97j5499k082J13k12o728j0431J1881q893k6202q857
10042a9846K4422o196N112p688k929N027K1379j3644r88J7298j2919m469n688
$$ plain form
10029 -1129 34313 43859 19730 22713 40411 19171 -8888 2396 25903 10490 1202 36267
10017 36267 32946 2583 -13624 22592 38686 36581 40361 38611 17599 10520 11231 14012 14950 5357
10003 5357 -17105 -12019 57 -732 3425 6047 -14599 -22257 -23090 -15954 2014 3821 -227 22522
9989 22522 26013 11586 -9291 9993 16379 14546 16724 5947 -12272 -10958 -34392 -26898 -21694
9976 -21694 1888 9431 7539 2111 -4577 -14911 -2131 1295 6217 18662 13778 22577 -5935
9963 -5935 -22819 -6132 7487 -14801 -21539 -14207 -19199 -39003 -11067 15278 16218 3499 7694
9950 7694 24165 30680 27845 25052 8677 4163 -18767 -23303 4486 19846 9292 4130 11954
9937 11954 6939 -160 -4084 -17272 -5394 16457 18446 19745 -7863 -37643 -42221 -44858 -25897
$$ packed form
10029a129L5442R546k4129K983J7698k1240k8059J1284K3507j5413r288L5065
10017C6267l321l0363j6207L6216J6094k105L780j750k1012p079P11K781R38r593
10003E357k2462N086J2076p89M157K622k0646p658q33P136J7968J807m048K2749
9989B2522L491j4427k0877J9284O386j833K178j0777j8219J314k3434P494N204
9976b1694K3582P543j892n428o688j0334J2780L426M922J2445m884Q799k8512
9963e935j6884J6687J3619k2288o738P332m992j9804K7936K6345R40j2719M195
9950G694J6471O515k835k793j6375m514k2930m536K7789J5360j0554n162P824
9937A1954n015p099l924j3188J1878K1851J989J299k7608k9780m578k637J8961
$$ plain form
9924 -25897 -9555 -5973 -9250 7268 7474 -4919 -16537 -11623 -8594 27043 36788 9544 833
9911 833 35361 58274 48282 41525 33013 26263 2581 -1824 20204 44982 33835 16735 2909
9898 2909 -18664 2381 7745 -19248 -19951 -10407 -11309 -17936 6008 8560 2486 -6641 5098 20712
9884 20712 21906 27680 116 -25358 -23132 -1475 -14892 -12162 8542 7270 11660 28581 55420
9871 55420 53032 44806 14642 -343 31829 55105 42327 19941 22116 25394 8695 5829 -12311
9858 -12311 3413 13432 10016 12789 18770 21234 22838 22589 16038 21864 27910 24064 -1202 8992
9844 8992 -493 -1293 -5901 -5723 5997 -1026 -1464 -6054 -20626 -12721 4637 1490 4211 -8737 -3691
9829 -3691 2325 3725 9652 34748 28629 15764 12390 302 6849 -560 2594 22719 15417 -15367
$$ packed form
9924b5897J6342L582l277J6518K06j2393j1618M914L029L5637R745k7244q711
9911H33L4528K2913r992o757q512o750k3682m405K2028K4778j1147j7100j3826
9898B909k1573K1045N364k6993p03R544r02o627K3944K552o074r127J1739J5614
9884B0712J194N774k7564k5474K226K1657j3417K730K0704j272M390J6921K6839
9871E5420k388q226l0164j4985L2172K3276j2778k2386K175L278j6699k866j8140
9858a2311J5724J0019l416K773N981K464J604k49o551N826O046l846k5266J0194
9844H992r485q00m608J78J1720p023m38m590j4572P905J7358l147K721j2948N046
9829c691O016J400N927K5096o119j2865l374j2088O547p409L154K0125p302l0784
$$ plain form
9815 -15367 -8631 1926 -5345 -10171 11330 586 -21743 -19642 6931 24409 28634 12230 9799
9802 9799 -9858 -3827 3905 13012 17107 10198 14559 16404 23700 15159 -5180 -33258 -46113 -28606
9788 -28606 -7614 2492 -11855 -17024 645 13189 24433 33514 35653 11702 -6833 -8096 -13367
9775 -13367 462 10679 4430 258 12478 -1722 4297 10302 10426 19806 11570 -11489 -8005 -3067
9761 -3067 9761 11838 13013 30994 43952 29176 24156 46619 46085 31945 8342 -5577 -14818
9748 -14818 -19836 -14893 -945 18886 18178 14204 14185 6753 -1487 11205 20137 16602 31312 45093
9734 45093 40073 9064 -27061 -30537 -32069 -18448 -26625 -12711 5076 6858 12818 7723 -5984
9721 -5984 -15155 -7746 32446 62293 49282 32074 20486 6229 -12293 -9193 -17350 -19528 10245
$$ packed form
9815a5367O736J0557p271m826K1501j0744k2329K101K6573J7478M225j6404k431
9802I799j9657O031P732R107M095o909M361J845P296q541k0339k8078j2855J7507
9788b8606K0992J0106j4347n169J7669J2544J1244R081K139k3951j8535j263n271
9775a3367J3829J0217o249m172J2220j4200O019O005J24R380q236k3059L484M938
9761c067J2828K077J175J7981J2958j4776n020K2463n34j4140k3603j3919r241
9748a4818n018M943J3948J9831p08l974j9p432q240J2692Q932l535J4710J3781
9734D5093n020l1009l6125l476j532J3621q177J3914J7787J782N960n095j3707
9721e984r171P409M0192K9847j3011j7208j1588j4257j8522L100q157k178K9773
$$ plain form
9708 10245 33680 50112 44214 26185 22451 29408 46933 47591 16300 18076 15823 -12960 -13574 -1218
9694 -1218 1212 -12665 -3715 7764 -17191 -33086 -29324 -32593 -27504 -22890 9932 21398 -2201
9681 -2201 4757 24747 7991 3413 -11838 -12193 -39397 -55416 -29067 -13640 1788 3816 -1550
9668 -1550 -7982 -3898 5042 12597 1044 1803 1797 20305 30427 27925 -3907 -10981 -878 -7234 -15993
9653 -15993 3475 40787 60440 78178 65620 40040 20534 9733 -4686 -11141 -2660 -5798
9641 -5798 10094 12788 11259 -3556 -21709 -13853 9709 -5059 -3775 20175 34778 2898 -9016
9628 -9016 1169 6622 -11106 -7760 10206 1624 15240 13662 23335 14968 5779 2398 13325 23209
9614 23209 8815 -22339 -28848 -33631 -40783 -47840 -27445 -28406 -7563 7528 5327 27983 -39
$$ packed form
9708A0245K3435J6432n898j8029l734O957J7525O58l1291J776k253k8783o14J2356
9694a218K430j3877Q950J1479k4955j5895L762l269N089M614L2822J1466k3599
9681b201O958J9990j6756m578j5251l55k7204j6019K6349J5427J5428K028n366
9668a550o432M084Q940P555j1553P59oJ8508J0122k502l1832p074J0103o356q759
9653a5993J9468L7312J9653J7738j2558k5580j9506j0801j4419o455Q481l138
9641e798J5892K694j529j4815j8153P856K3562j4768J284K3950J4603l1880j1914
9628i016J0185N453j7728L346J7966q582J3616j578R673q367r189l381J0927R884
9614B3209j4394l1154o509m783p152p057K0395r61K0843J5091k201K2656k8022
$$ plain form
9601 -39 -8072 3571 22149 35945 46986 48435 44303 32231 10385 19876 17537 10171 24220 36814
9587 36814 46999 34018 23587 15823 19898 13765 1998 17484 8578 -8294 10371 28286 32833
9574 32833 44111 24971 25676 10743 -3384 4886 37087 42478 56459 54759 15327 -11328 -12674
9561 -12674 -3236 17863 43098 51844 47681 4882 -13506 -13358 -19394 -17226 -36528 -32318 -17976
9548 -17976 -33331 -34734 2909 25501 24270 7311 -37976 -56516 -11711 -17369 -17366 -19451 -18014 -23958
9534 -23958 -17588 -13259 -15638 -14372 -17911 -16941 -31882 -18916 -9504 -2808 -7700 -24921 -666 19166
9520 19166 9357 -11333 -33728 -44230 -49398 -44071 -33623 -35288 -51376 -45087 -26289 -7181 2913
9507 2913 1765 -19071 -26764 -14831 -22968 -61281 -63632 -52824 -34965 -34449 -35156 -35694 -25908 -33034
$$ packed form
9601c9q033J1643J8578J3796J1041J449m132j2072k1846R491k339p366J4049J2594
9587C6814J0185j2981j0431p764M075o133j1767J5486q906j6872J8665J7915M547
9574C2833J1278j9140P05j4933j4127Q270L2201N391J3981j700l9432k6655j346
9561a2674R438K1099K5235Q746m163m2799j8388J48o036K168j9302M210J4342
9548a7976j5355j403L7643K2592j231j6959m5287j8540M4805n658Lk085J437n944
9534b3958O370M329k379J266l539R70j4941J2966R412O696m892j7221K4255J9832
9520A9166r809k0690k2395j0502n168N327J0448j665j6088O289J8798J9108J0094
9507B913j148k0836p693J1933q137l8313k351J0808J7859N16p07n38R786p126
$$ plain form
9493 -33034 -40895 -30725 -17712 -27218 -18309 -23022 -28673 -14784 689 -4082 3410 26560 41891
9480 41891 30411 32265 8767 -8499 -12749 -15676 -9041 -4405 14022 22854 6586 6930 3278 -6921
9466 -6921 -6507 5015 18346 27175 16881 -8286 10999 21019 5637 -3863 -12750 -7467 9879
9453 9879 15626 -15690 -20488 970 8969 19851 20502 19921 -15256 -26939 -22013 -36511 -37174 -17459
9439 -17459 16441 12798 -7115 9295 27068 12389 -15078 -14423 10836 5831 2361 3492 13759
9426 13759 9280 10245 -4243 -10118 -18548 -11929 -16472 -32749 -30421 -17747 -13052 -23143 8288 19851
9412 19851 8274 -15782 -35474 -34560 -22232 8048 6536 -30523 -39033 -30007 1053 18219 18690
9399 18690 23450 1494 771 -5235 -9659 -13664 -11481 -7764 -21771 -26249 -4666 2894 7449 35440
$$ packed form
9493c3034p861J0170J3013r506Q909m713n651J3889J5473m771P492K3150J5331
9480D1891j1480J854k3498j7266m250k927O635M636J8427Q832j6268L44l652j0199
9466f921M14J1522J3331Q829j0294k5167J9285J0020j5382r500q887N283J7346
9453I879N747l1316m798K1458P999J0882O51n81l5177j1683M926j4498o63J9715
9439a7459L3900l643j9913J6410J7773j4679k7467O55K5259n005l470J131J0267
9426A3759m479R65j4488n875q430O619m543j6277K328J2674M695j0091L1431J1563
9412A9851j1577k4056j9692R14J2328L0280j512l7059q510R026L1060J7166M71
9399A8690M760k1956p23o006m424m005K183L717j4007m478K1583P560M555K7991
$$ plain form
9385 35440 59925 65199 57143 34112 25762 17750 28664 29034 -326 3469 27656 16706 -16921
9372 -16921 -16238 23940 33679 29672 28331 37316 14222 -11251 -3432 38742 58466 30539 27878
9359 27878 43416 39782 25298 7789 -183 12819 15105 20516 15954 1535 -19422 -21010 -9135
9346 -9135 -8697 9070 4006 16631 24140 42258 44248 29381 11438 -974 -26195 -16011 -5571
9333 -5571 10027 12842 -12936 -22408 3395 3046 -623 -581 -15204 -6790 28747 43943 35629 40634
9319 40634 49873 45820 49173 36480 8485 -12041 -21306 -3543 1759 6857 3586 -8194 -18054
9306 -18054 -14986 -202 -3762 -7450 -10870 -2686 3260 6548 4944 -8645 -9757 -2529 3707 14372
9292 14372 -1773 -19346 -14732 -17244 3054 -12937 -22553 -19842 -8751 -3264 -10461 -39961 -43191
$$ packed form
9385C5440K4485N274q056k3031q350q012J0914L70k9360L795K4187j0950l3627
9372a6921O83M0178R739m007j341Q985k3094k5473P819M2174J9724k7927k661
9359B7878J5538l634j4484j7509p972J3002K286N411m562j4419k0957j588J1875
9346i135M38J7767n064J2625P509J8118J990j4867j7943j2412k5221J0184J0440
9333e571J5598K815k5778r472K5803l49l669M2j4623Q414L5537J5196q314N005
9319D0634R239m053L353j2693k7995k0526r265J7763N302N098l271j1780r860
9306a8054L068J4784l560l688l420Q184N946L288j604j3589j112P228O236J0665
9292A4372j6145j7573M614k512K0298j5991r616K711J1091N487p197k9500l230
$$ plain form
9279 -43191 -30990 -31984 -30629 -24240 3301 12745 2431 -2394 -8266 -17807 -256 170 -852 27147
9265 27147 29903 16254 5184 -668 -11790 -33543 -25236 -21355 713 13102 7369 -5743 -19115
9252 -19115 -45281 -49005 -30820 -6176 -1695 -23092 -37144 -38977 -24142 -47584 -54011 -55410 -52055
9239 -52055 -33245 7013 -968 -12119 -7097 -24696 -19295 -9693 -19168 -16292 -11385 -11849 9237 20650
9225 20650 38219 15409 15808 14177 -15397 -11146 -11636 -7774 7987 23288 12691 2047 -6607
9212 -6607 -19515 -26911 -14749 -3271 -6185 2632 14101 14956 27091 44133 49388 49811 33011 32789
9198 32789 47305 21075 7978 23305 21255 26527 26242 12124 -6363 -20205 -32380 -6908 9501
9185 9501 -6669 9842 28302 21741 3164 -15966 -11377 -4122 7384 10744 8367 14636 31568
$$ packed form
9279d3191J2201r94J355O389K7541R444j0314m825n872r541J7551M26j022K7999
9265B7147K756j3649j1070n852j1122k1753Q307L881K2068J2389n733j3112j3372
9252a9115k6166l724J8185K4644M481k1397j4052j833J4835k3442o427j399L355
9239e2055J8810M0258p981j1151N022j7599N401R602r475K876M907m64K1086J1413
9225B0650J7569k2810L99j631k9574M251m90L862J5761J5301j0597j0644q654
9212f607j2908p396J2162J1478k914Q817J1469Q55J2135J7042N255M23j6800k22
9198C2789J4516k6230j3097J5327k050N272k85j4118j8487j3842j2175K5472J6409
9185I501j6170J6511J8460o561j8577j9130M589P255J1506L360k377O269J6932
$$ plain form
9172 31568 13614 -8541 -11408 -3103 -3185 -11798 -27054 -36069 -32622 -30462 -19954 -13260 -11592 -8128
9158 -8128 -15087 -9997 -15766 -36171 -19137 -27845 -35235 -24576 -18190 -8577 -9255 -11883 22163 13276
9144 13276 8907 10935 1437 1970 19548 25171 -2786 -12045 -8763 -25028 -30538 -30165 -52545 -71982
9130 -71982 -51282 -7628 24835 36884 11395 -14651 -7110 15039 12209 19856 45065 37852 20392
9117 20392 19645 13176 5740 12743 22537 13727 10667 34409 28035 18878 18290 18919 24182 14107 -14869
9102 -14869 -30577 -30260 -32260 -28239 -18442 -14580 14971 11118 7387 -9062 -22711 -28912 -8799 -18392
9088 -18392 -33441 -3143 4690 66 -657 -5054 -2047 4062 20291 31705 32173 21079 19416 14177
9074 14177 16008 2209 -25823 -17524 18595 24018 3095 -25633 -22891 7702 21784 11495 -21489
$$ packed form
9172C1568j7954k2155k867Q305q2q613j5256r015L447K160J0508O694J668L464
9158h128o959N090n769k0405J7034q708p390J0659O386R613o78k628L4046q887
9144A3276m369K028r498N33J7578N623k7957r259L282j6265n510L73k2380j9437
9130g1982K0700M3654L2463J2049k5489k6046P541K2149k830P647K5209p213j7460
9117B0392p47o469p436P003R794q810l060K3742o374r157n88O29N263j0075k8976
9102a4869j5708L17k000M021R797L862K9551l853l731j6449j3649o201K0113r593
9088a8392j5049L0298P833m624p23m397L007O109J6229J1414M68j1094j663n239
9074A4177J831j3799k8032Q299L6119N423k0923k8728K742L0593J4082j0289l2984
$$ plain form
9061 -21489 -8197 9603 -5119 -5688 2496 -3036 -10972 -10853 -1690 8689 -1192 -5225 0 9221
9047 9221 -756 -10277 -24245 -35947 -55238 -42799 -18903 -5483 -3973 -5801 -5149 5291 17349
9034 17349 19537 18420 10132 -27812 -22702 -9321 -16664 -2733 16707 25181 17238 15710 7558 14930
9020 14930 2736 -13010 -36731 -43233 -26501 -15185 -4888 9070 24963 4150 4735 14522 15826
9007 15826 8564 13591 -2788 6425 8761 12089 9625 -5076 -3375 -15113 -27651 -17235 -17335 -21982
8993 -21982 -8420 -8510 6012 19250 10006 -2862 -9526 -6226 -7380 497 -4830 -11202 -20265 -23048
8979 -23048 -14121 -25500 -26660 -10449 -24478 -4344 10507 15579 21599 20937 13201 8670 17669 -4192
8965 -4192 -655 1979 -70 12718 14442 3567 -668 -31793 -24810 10278 36851 40964 10516
$$ packed form
9061b1489J3292J7800j4722n69Q184n532p936J19R163J0379r881m033N225R221
9047I221r977r521j3968j1702j9291J2439K3896J3420J510j828O52J0440J2058
9034A7349K188j117q288l7944N110J3381p343J3931J9440Q474p943j528q152P372
9020A4930j2194j5746k3721o502J6732J1316J0297J3958J5893k0813N85R787J304
9007A5826p262N027j6379R213K336L328k464j4701J701j1738j2538J0416j00m647
8993b1982J3562r0J4522J3238r244j2868o664L300j154P877n327o372r063k783
8979b3048Q927j1379j160J6211j4029K0134J4851N072O020o62p736m531Q999k1861
8965d192L537K634k049J2788J724j0875m235l1125O983L5088K6573M113l0448
$$ plain form
8952 10516 5748 13290 1802 -22531 -21227 -23587 -36768 -18043 6247 20826 -15679 -29323 -2805
8939 -2805 17396 30586 21892 27897 24080 -4472 -7879 -12753 -1064 19465 11044 -4129 605
8926 605 19702 28521 31350 19284 7662 -2550 -38 7321 1559 16989 27425 17428 8228 14541
8912 14541 -4537 5037 34183 34595 17393 -12726 -26005 -17958 -9250 -28163 -32870 -8631 -12352
8899 -12352 -29987 -21700 3812 -7555 10220 535 -15675 -12811 17026 43831 59661 43751
8887 43751 13473 -8613 3260 11299 -38120 -66782 -60579 -75529 -83352 -67661 -60586 -50896 -21445
8874 -21445 5758 6805 -14753 -17686 -10163 -5187 -2666 -15664 -28703 -39063 -42542 -36699 -18987
8861 -18987 -9694 19216 20998 16796 792 -19719 -37951 -47783 -49055 -41164 -17804 -19780 -23233
$$ packed form
8952A0516m768P542j1488k4333J304k360j3181J8725K4290J4579l6505j3644K6518
8939b805K0201J3190q694O005l817k8552l407m874J1689K0529q421j5173M734
8926F05J9097Q819K829j2066j1622j0212K512P359n762J5430J0436r997r200O313
8912A4541j9078R574K9146M12j7202l0119j3279Q047Q708j8913m707K4239l721
8899a2352j7635Q287K5512j1367J7775r685j6210K864K9837K6805J5830j5910
8887D3751l0278k2086J1873Q039m9419k8662O203j4950p823J5691P075R690K9451
8874b1445K7203J047k1558k933P523M976K521j2998j3039j0360l479N843J7712
8861a8987R293K8910J782m202j6004k0511j8232r832j272P891K3360j976l453
$$ plain form
8848 -23233 -23580 -14610 -25861 -33387 -17687 -288 -28261 -26568 15 9387 14732 2707 6531
8835 6531 24718 31412 8095 5787 8291 10535 -8631 -15149 -7752 6249 19550 10591 -30280
8822 -30280 -44809 -35578 -12093 8318 17441 23324 15973 18306 12874 11331 1766 8228 18380 23852
8808 23852 45851 31302 18505 3820 -13121 -28854 -40325 -35883 -34354 -36290 -38201 -38819 -18640
8795 -18640 -19848 -39821 -43060 -17432 -13354 -17084 -13330 4589 26398 34156 -7594 -32169 -25637
8782 -25637 -39526 -52740 -48316 -26541 -5096 -617 -1429 19731 19994 3458 8558 12933 -1685
8769 -1685 -1770 10682 1500 24344 24896 16974 -4803 -29774 -46969 -43955 -8232 13681 22170 13662
8755 13662 7351 -20819 -26873 -7923 2009 -18566 -27241 1071 18744 -7166 -18261 -13962 -17926
$$ packed form
8848b3233l47Q970j1251p526J5700J7399k7973J693K6583R372N345j2025L824
8835F531J8187O694k3317k308K504K244j9166o518P397J4001J3301q959m0871
8822c0280j4529R231K3485K0411R123N883p351K333n432j543r565O462J0152N472
8808B3852K1999j4549j2797j4685j6941j5733j1471M442J529j936j911o18K0179
8795a8640j208j9973l239K5628M078l730L754J7919K1809P758m1750k4575O532
8782b5637j3889j3214M424K1775K1445M479q12K1160K63j6536N100M375j4618
8769a685q5J2452r182K2844N52p922k1777k4971j7195L014L5723K1913Q489q508
8755A3662o311k8170o054J8950R932k0575q675K8312J7673k5910j1095M299l964
$$ plain form
8742 -17926 -14935 22214 46179 33912 -906 -40931 -31144 -12505 -21360 -13800 1752 -5247 -18169
8729 -18169 -8504 -12088 -151 11030 24323 813 -9531 -2669 1687 -16931 2470 -3348 -12756
8716 -12756 -15255 -30429 -465 403 2573 4395 -13308 -56 9147 -5989 -5924 3596 12178 8372
8702 8372 -11407 -22385 10348 22550 6522 -7874 14592 16082 8950 -6089 -1426 -2895 -3105
8689 -3105 -10289 -20596 -28250 5510 27018 28264 28167 24745 13 3229 -7095 22325 35013 35918
8675 35918 49675 26967 2099 -2467 838 6535 3265 14234 6095 26857 40780 29441 19324
8662 19324 26987 1517 7879 14411 7198 8439 -277 -7983 -26256 -35360 -20844 14246 -490
8649 -490 -6505 -667 18431 29975 12774 -4791 -8901 -14998 -21610 17582 24529 3857 26349
$$ packed form
8742a7926K991L7149K3965j2267l4818m0025R787J8639q855P560J5552o999j2922
8729a8169R665l584J1937J1181J3293k3510j0344O862M356j8618J9401n818r408
8716a2756k499j5174K9964Q68K170J822j7703J3252R203j5136O5R520Q582l806
8702H372j9779j0978L2733J2202j6028j4396K2466J490p132j5039M663j469k10
8689c105p184j0307p654L3760K1508J246r7l422k4732L216j0324K9420J2688R05
8675C5918J3757k2708k4868m566L305N697l270J0969q139K0762J3923j1339j0117
8662A9324P663k5470O362O532p213J241q716p706j8273r104J4516L5090j4736
8649d90o015N838J9098J1544j7201j7565m110o097o612L9192O947k0672K2492
$$ plain form
8636 26349 30827 26935 14663 18618 -4128 -4516 -5422 362 21630 22038 30875 45450 45751 47741 57326
8621 57326 38346 17312 23242 25699 17736 13028 2500 5376 2471 -4433 -24485 -44424 -7806
8608 -7806 41186 49834 27088 44 -8903 10775 11318 -1224 -1024 -2366 579 1533 9043 -6449
8594 -6449 655 1624 -804 8724 -8953 -11824 -452 15103 18163 20081 49837 41082 43087 36281
8580 36281 48528 72812 70185 70968 88722 88806 39004 7162 -14468 -25767 -37089 -34920 -3800
8567 -3800 5937 31527 55267 53173 38509 19245 17206 40742 40460 44 -27798 -24562 14155
8554 14155 19992 27052 28532 8774 -4794 11315 13527 13897 -24397 -39917 -28439 -9579 10000
8541 10000 22099 33142 25185 12928 10743 28056 14936 3612 -1336 8796 24616 -559
$$ packed form
8636B6349M478l892j2272L955k2746l88r06N784K1268M08Q837J4575L01J990R585
8621E7326j8980k1034N930K457p963m708j0528K876k905o904k0052j9939L6618
8608g806M8992Q648k2746k7044q947J9678N43j2542K00j342K945R54P510j5492
8594f449P104R69k428R528j7677k871J1372J5555L060J918K9756q755K005o806
8580C6281J2247K4284k627P83J7754Q4m9802l1842k1630j1299j1322K169L1120
8567c800R737K5590K3740k094j4664j9264k039K3536k82m0416k7842L236L8717
8554A4155N837P060J480j9758j3568J6109K212L70l8294j5520J1478J8860J9579
8541A0000J2099J1043p957j2257k185J7313j3120j1324m948J0132J5820k5175
$$ plain form
8529 -559 -12363 17871 26034 21467 6323 8255 10513 -9836 3410 17991 10568 935 -25082
8516 -25082 -40913 -50498 -44595 -37363 -22341 -16348 -24631 -20898 -23017 -16544 1151 16199 11157 4875
8502 4875 -6209 -10729 -23269 -16827 6676 28790 32261 26980 5680 -19707 -26492 8236 20815
8489 20815 23100 29240 39579 28769 8557 1151 2161 -2570 -18114 -29200 -23840 -21176 -31438
8476 -31438 -12264 -13827 20043 19720 13835 18326 39407 23034 -5622 -16855 -8646 11624 14629
8463 14629 17502 -7523 -23026 -26013 -7068 14640 30720 31397 15667 14747 27532 20232 24289
8450 24289 8699 -16604 -13091 8899 6340 -6106 4166 -8285 5283 4121 13645 22052 6657
8437 6657 -23996 -29317 -27671 -18412 -41376 -43535 -37001 -8207 7680 14619 -3759 -7153 13079
$$ packed form
8529e59j1804L0234Q163m567j5144J932K258k0349J3246J4581p423r633k6017
8516b5082j5831r585N903P232J5022N993q283L733k119O473J7695J5048n042o282
8502D875j1084m520j2540O442K3503K2114L471n281k1300k5387o785L4728J2579
8489B0815K285O140J0339j0810k0212p406J010m731j5544j1086N360K664j0262
8476c1438J9174j563L3870l23n885M491K1081j6373k8656j1233Q209K0270L005
8463A4629K873k5025j5503k987J8945K1708J6080O77j5730r20J2785p300M057
8450B4289j5590k5303L513K1990k559j2446J0272j2451J3568j162R524Q407j5395
8437F657l0653n321J646R259k2964k159O534K8794J5887O939j8378l394K0232
$$ plain form
8424 13079 30933 18044 28103 22663 12333 9816 3967 11537 6317 5538 26006 34042 42328 14268
8410 14268 -16752 -43008 -44843 -23629 -22126 -17663 -21802 -7990 24460 20396 842 19487 8105
8397 8105 -9020 -7771 -6135 7333 7618 12300 25238 17290 5274 4527 14860 7656 3788 298
8383 298 -10280 10447 18994 22967 10222 -18424 -16108 -15627 -1802 16654 -1901 -8268 -19470
8370 -19470 -38191 -41151 -31739 -31139 -31077 -17997 -25264 -19706 12061 28662 26584 975 7500 17814
8356 17814 38767 31273 19493 5896 6833 -780 6590 17300 25660 27668 58359 72891 107541
8343 107541 125626 150094 166951 179132 152974 91873 48517 21423 15820 13425 -19575 -42822
8331 -42822 -24095 -20845 -33627 -44481 -34892 -16704 -8578 -6960 3686 10519 -4443 4882 -6609
$$ packed form
8424A3079J7854j2889J0059n440j0330k517n849P570n220p79K0468Q036Q286k8060
8410A4268l1020k6256j835K1214J503M463m139J3812L2450m064j9554J8645j1382
8397H105j7125J249J636J3468K85M682J2938p948j2016p47J0333p204l868l490
8383B98j0578K0727Q547L973j2745k8646K316M81J3825J8456j8555o367j1202
8370a9470j8721k960R412O00O2J3080p267N558L1767J6601k078k5609O525J0314
8356A7814K0953p494j1780j3597R37p613P370J0710Q360K008L0691J4532L4650
8343A07541J8085K4468J6857J2181k6158o1101m3356k7094n603k395l3000k3247
8331d2822J8727L250j2782j0854R589J8188Q126J618J0646O833j4962R325j1491
$$ plain form
8318 -6609 12884 38236 26841 12940 8984 12437 10716 -8903 -14422 -1259 12047 31186 42233
8305 42233 48288 73248 81165 115905 120994 133406 181976 245281 302022 296552 234034 138594 58227
8292 58227 8654 20120 27539 24609 16205 33550 42487 17576 30765 35908 34118 18529 21749
8279 21749 32857 46978 65860 40160 7957 -6413 -20962 -28209 -11423 10852 17151 5033
8267 5033 6029 481 -11222 -7796 -13083 4821 13214 17396 12633 27576 56139 71684 81548 86036
8253 86036 108074 113768 112964 62208 3945 -9939 -13652 14916 21021 25132 37219 41259 40340 35807
8239 35807 23773 5160 -19419 -15778 -1172 3224 -168 2970 -424 -225 5239 -7855 -34051
8226 -34051 -38849 -13303 12374 20497 25477 5896 -8081 -15662 -14638 -21991 -21329 -21922 -11014 -2346
$$ packed form
8318f609J9493K5352j1395j3901l956L453j721j9619n519J3163J3306J9139J1047
8305D2233O055K4960P917L4740N089J2412M8570O3305N6741n470o2518r5440q0367
8292E8227m9573J1466P419k930q404J7345Q937k4911J3189N143j790j5589L220
8279B1749J1108J4121J8882k5700l2203j4370j4549p247J6786K2275O299j2118
8267E033R96n548j1703L426n287J7904Q393M182m763J4943K8563J5545R864M488
8253H6036K2038N694q04n0756n8263j3884l713K8568O105M111J2087M040r19m533
8239C5807j2034j8613k4579L641J4606M396l392L138l394J99N464j3094k6196
8226c4051m798K5546K5677Q123M980j9581j3977p581J024p353O62n93J0908Q668
$$ plain form
8212 -2346 -7118 8265 -5433 -26941 -15960 -8314 4458 41093 32810 25496 25106 19468 -7031
8199 -7031 -23908 -4217 -15146 -17905 -32344 -44277 -39789 -13641 -9013 -18062 -18916 -32762 -35233
8186 -35233 -21266 -11226 -15864 -14497 -22933 -28937 -19445 1799 -14897 -11336 -15419 -8538 -17065 -13173
8172 -13173 -21758 -14013 989 5522 -945 -2333 -17867 -13705 -2672 34140 36333 14059 495
8159 495 -9314 -2693 21826 13586 -11164 -20122 -15392 -13143 -10843 -6002 519 24045 20260 5940
8145 5940 -8286 2975 18539 28386 13627 23738 37212 49040 35888 22077 20723 -13515
8133 -13515 -30830 -23062 -9433 4919 23242 12014 841 -16247 -9565 -5066 -23268 -31971 -33313
8120 -33313 -36641 -44286 -25467 -7321 -8856 -36269 -35015 -14923 -15608 -13964 -12741 -22835 -39664
$$ packed form
8212b346m772J5383j3698k1508J0981P646J2772L6635q283p314l90n638k6499
8199g031j6877J9691j0929k759j4439j1933M488K6148M628r049q54j3846k471
8186c5233J3967J0040m638J367q436o004R492K1244j6696L561m083O881q527L892
8172a3173q585P745J5002M533o467j388j5534M162J1033L6812K193k2274j3564
8159D95r809O621K4519q240k4750q958M730K249K300M841O521K3526l785j4320
8145E940j4226J1261J5564R847j4759J0111J3474J1828j3152j3811j354l4238
8133a3515j7315P768J3629J4352J8323j1228j1173j7088O682M499j8202q703j342
8120c3313l328p645J8819J8146j535k7413J254K0092o85J644J223j0094j6829
$$ plain form
8107 -39664 -42389 -13962 -4007 4369 -24098 -23294 -22576 -55769 -49001 -50553 -63853 -56082 -46851 -69699
8093 -69699 -60280 -21652 -14884 -31219 -11851 -10472 -2257 18863 4895 -15301 -20553 7581 27883
8080 27883 32895 21989 9115 1957 -18642 -18375 -6862 -13429 13747 39316 22873 31220 38024
8067 38024 39458 24676 -5881 -16940 -4313 10085 27761 34728 14261 17628 13718 10605 22404
8054 22404 7438 -14170 -40541 -42041 -12625 -11725 -42187 -31230 -6824 -9795 -23928 -23935 -18371 -40425
8040 -40425 -48838 -27979 -10026 4120 24659 19854 8952 4385 -22712 -42824 -36917 -18492 11085
8027 11085 271 -28952 -39844 -45543 -20801 2474 15913 35940 7536 -147 10918 21059
8015 21059 7604 7813 12892 37477 42828 12357 -868 1202 -6469 -23102 -26107 -4592 3186
$$ packed form
8107c9664k725K8427R955Q376k8467Q04P18l3193O768j552j3300P771R231k2848
8093f9699R419L8628O768j6335J9368J379Q215K1120j3968k0196n252K8134K0302
8080B7883N012j0906j2874p158k0599K67J1513o567K7176K5569j6443Q347O804
8067C8024J434j4782l0557j1059J2627J4398J7676O967k0467L367l910l113J1799
8054B2404j4966k1608k6371j500K9416R00l0462J0957K4406k971j4133pN564k2054
8040d0425q413K0859J7953J4146K0539m805j0902m567k7097k0112N907J8425K9577
8027A1085j0814k9223j0892n699K4742K3275J3439K0027k8404p683J1065J0141
8015B1059j3455K09N079K4585N351l0471j3225K070p671j6633l005K1515P778
$$ plain form
8002 3186 -10322 -11558 -3667 11164 14337 11370 -22671 -22090 -13548 5323 21478 4472 -9450
7989 -9450 -5128 -3400 -27804 -29327 -18449 -25146 -38601 -34901 -14070 4466 6963 -1088 -5881 2546
7975 2546 18329 23307 16809 -8715 -37172 -43987 -60045 -65805 -54631 -42616 -12275 -5377 -4325
7962 -4325 -3311 -10552 11120 28592 33404 39660 33538 8682 11643 18645 -2144 -17299 -22830 -17551
7948 -17551 12856 21906 -1299 -2690 19096 36255 20565 8365 5443 -1166 -5085 17937 38334
7935 38334 25571 17181 27560 13086 -7769 -8101 8915 28811 19571 29836 15191 -16215 -20316
7922 -20316 -36803 -36698 -18147 -11198 -151 26851 32949 21518 -4623 -18417 -18826 -5317 -10123
7909 -10123 -19750 -37166 -30851 -31461 -39276 -48449 -65117 -68552 -35189 -30883 -35167 -24394 -72 8092
$$ packed form
8002C186j3508j236P891J4831L173k967l4041N81Q542J8871J6155j7006j3922
7989i450M322J728k4404j523J0878o697j3455L700K0831J8536K497q051m793Q427
7975B546J5783M978o498k5524k8457o815j6058n760J1174J2015L0341O898J052
7962d325J014p241K1672J7472M812O256o122k4856K961P002k0789j5155n531N279
7948a7551L0407R050k3205j391K1786J7159j5690j2200k922o609l919K3022K0397
7935C8334j2763q390J0379j4474k0855l32J7016J9896r240J0265j4645l1406m101
7922b0316j6487J05J8551O949J1047K7002O098j1431k6141j3794m09J3509m806
7909a0123r627j7416O315o10p815r173j6668l435L3363M306m284J0773K4322Q164
$$ plain form
7895 8092 12977 128 5850 -1659 -16813 -7829 -19559 -22101 -281 870 -12783 -4278 14847
7882 14847 38626 38489 51988 70452 67390 42891 11186 15431 10664 -15181 -18588 3344 4777
7869 4777 -6127 -9294 -16977 -11814 -5146 18087 8354 -1709 -15086 -19476 -32972 -51599 -53955
7856 -53955 -44142 -9321 35871 48661 29081 3716 -7913 -13325 -24421 -11539 -8613 -863 15085
7843 15085 5840 -14677 -8778 -324 8116 6336 -6443 -18548 -47733 -27717 -6468 -5029 -7679
7830 -7679 7066 21147 25570 25607 -8970 -17786 -18554 -12159 6463 10063 -289 -17118 -8156 19180
7816 19180 15502 -5952 -27883 -25679 -29090 -35010 -13384 6725 6461 12741 -4503 -23953 -19693
7803 -19693 -23655 -3490 -8576 -10255 -1169 10130 -8216 -33236 -53248 -65111 -54722 -20619 -14663
$$ packed form
7895H092M885j2849N722p509j5154Q984j1730k542K1820J151j3653Q505J9125
7882A4847K3779j37J3499J8464l062k4499l1705M245m767k5845l407K1932J433
7869D777j0904l167p683N163O668K3233r733j0063j3377m390j3496j8627k356
7856e3955R813L4821M5192J2790j9580k5365j1629n412j1096J2882K926P750J5948
7843A5085r245k0517N899Q454Q440j780j2779j2105k9185K0016K1249J439k650
7830g679J4745J4081M423L7l4577q816p68O395J8622L600j0352j6829Q962K7336
7816A9180l678k1454k1931K204l411n920K1626K0109k64O280j7244j9450M260
7803a9693l962K0165n086j679R086J1299j8346k5020k0012j1863J0389L4103N956
$$ plain form
7790 -14663 -33607 -40892 -23783 -13984 -19314 -9976 7476 21044 37764 38632 36913 21606 22261 38708
7776 38708 34734 24613 27320 33800 41733 28828 13307 9575 10990 13739 37453 26163 24462
7763 24462 23104 31164 34934 25054 10405 -6183 -15420 -20431 -27767 -5159 26620 30641 11310
7750 11310 12942 3479 -7870 -2220 -1525 -18431 -13026 -7680 -12652 -21037 3865 12859 -6260 -12799
7736 -12799 10380 14279 15198 11621 14431 16293 13405 13064 6190 28073 30874 28757 17598 13971
7722 13971 12564 23259 2696 16504 26850 -2046 -29681 -45577 -44500 -20631 -18041 -32202
7710 -32202 -12397 15516 2271 -7931 -20944 -29282 -29571 -29400 -19154 -12616 4896 -6800 4221
7697 4221 10425 -9387 -14484 -3724 20013 29298 13235 12044 4977 -16808 -32317 -25677 -13270
$$ packed form
7790a4663j8944p285J7109R799n330R338J7452J3568J6720Q68j719j5307O55J6447
7776C8708l974j0121K707O480P933j2905j5521l732J415K749K3714j1290j701
7763B4462j358Q060L770r880j4649j6588r237n011p336K2608L1779M021j9331
7750A1310J632r463j1349N650O95j6906N405N346m972q385K4902Q994j9119o539
7736a2799K3179L899R19l577K810J862k888l41o874K1883K801k117j1159l627
7722A3971j407J0695k0563J3808J0346k8896k7635j5896J077K3869K590j4161
7710c2202J9805K7913j3245j0202j3013q338k89J71J0246O538J7512j1696J1021
7697D221O204j9812n097J0760K3737R285j6063j191p067k1785j5509O640J2407
$$ plain form
7684 -13270 -14908 -20389 -26088 -9685 -7442 2123 3702 -866 -19242 -31215 -32093 -13528 16552 2675
7670 2675 -28028 -21223 -16123 -14691 -8551 -3523 -7539 -6970 2611 12112 -856 14147 14173 2445 2112
7655 2112 9130 -19905 -9241 15474 26853 10820 -12528 -7463 3952 3481 -4023 -17424 -41180
7642 -41180 -18201 21344 16673 -4566 -14231 -16875 5620 23472 31869 21437 -4301 -20566 -18736
7629 -18736 2871 -12676 -22813 -21782 -28348 -14476 -1894 15420 20345 34485 33582 39774 52386
7616 52386 55976 36806 23164 41472 39204 2058 4190 8302 583 -4512 -5430 8830 -3238
7603 -3238 -2845 -32620 -46681 -2740 36458 51924 18218 3475 -58 -11855 -2914 -12740 -22423
7590 -22423 -11727 4058 5628 10455 7821 -492 -7324 -2919 -13751 -3005 26466 22333 3149
$$ packed form
7684a3270j638n481n699J6403K243R565J579m568j8376j1973q78J8565L0080j3877
7670B675l0703O805N100J432O140N028m016N69R581R501j2968J5003K6j1728l33
7655B112P018k9035J0664K4715J1379j6033k3348N065J1415m71p504j3401k3756
7642d1180K2979L9545m671k1239r665k644K2495J7852Q397j0432k5738j6265J830
7629a8736K1607j5547j0137J031o566J3872J2582J7314M925J4140r03O192J2612
7616E2386L590j9170j3642J8308k268l7146K132M112p719n095r18J4260j2068
7603c238L93k9775j4061M3941L9198J5466l3706j4743l533j1797Q941r826r683
7590b2423J0696J5785J570M827k634q313o832M405j0832J0746K9471m133j9184
$$ plain form
7577 3149 -7891 10752 25335 44429 41895 23698 3285 -2995 4399 6640 1877 -4491 5112
7564 5112 5863 22475 19821 19755 6910 -13567 -22713 -39445 -36319 -18882 2561 -3349 -18249 -16444
7550 -16444 -6742 -18716 -18702 -22815 -39120 -15251 -1252 -31204 -37100 -47945 -37242 -12600 -28225
7537 -28225 -21459 -22664 -11013 -8494 -16531 -17565 75 2141 13693 3887 1796 -5745 -6164 -9838
7523 -9838 12113 23718 31842 41659 11612 -5173 -19221 -24156 -19161 -19892 -22971 -17136 -5703 -3832
7509 -3832 4676 11517 -9494 -21005 -11224 -6706 -11987 -21336 -32474 -37589 -4160 -3962 -14569 -32007
7495 -32007 -55099 -52421 -39200 -12165 12418 8331 7913 14490 39409 38145 22199 -1696 -19451
7482 -19451 -599 26678 16029 -5518 4947 806 22339 40748 26830 29497 29155 30675 22854
$$ packed form
7577C149j1040J8643J4583J9094k534j8197k0413o280P394K241m763o368R603
7564E112P51J6612k654o6j2845k0477r146j6732L126J7437K1443n910j4900J805
7550a6444R702j1974J4m113j6305K3869J3999k9952n896j0845J0703K4642j5625
7537b8225O766j205J1651K519q037j034J7640K066J1552r806k091p541m19l674
7523i838K1951J1605Q124R817l0047j6785j4048m935M995p31l079N835J1433J871
7509c832Q508O841k1011j1511R781M518n281r349j1138n115L3429J98j0607j7438
7495c2007k3092K678J3221K7035K4583m087m18O577K4919j264j5946k3895j7755
7482a9451J8852K7277j0649k1547J0465m141K1533J8409j3918K667l42J520p821
$$ plain form
7469 22854 -3477 -14981 -15274 6852 362 -4758 -19702 -15738 -7940 -26619 -21700 -23344 -13102
7456 -13102 20219 7467 -2643 13997 16403 4883 8126 14998 25329 13733 5963 24253 16483
7443 16483 -3184 -10764 14502 14621 20219 23317 21166 -225 703 147 -14138 -21544 3349 27971
7429 27971 31386 18219 6925 18814 9911 607 -22664 1696 -3485 -22291 -29926 -20570 -35442
7416 -35442 -1819 39104 61802 44607 21406 -7296 -416 9073 14404 11991 691 -4321 -2379
7403 -2379 -5469 14982 30419 12695 -15282 -9037 -3143 -7800 -26968 -26337 -30773 -37520 -32029 -17585
7389 -17585 -11439 -16305 -19875 -16082 2253 14149 5491 -4253 -10471 -6507 -24819 -6268 3477 1724
7375 1724 24777 26437 23977 16617 27446 46609 35451 3845 -5332 6986 -17957 -26669 -17712
$$ packed form
7469B2854k6331j1504k93K2126o490n120j4944L964P798j8679M919j644J0242
7456a3102L3321j2752j0110J6640K406j1520L243O872J0331j1596p770J8290p770
7443A6483j9667p580K5266J19N598L098k151k1391R28n56j4285p406K4893K4622
7429B7971L415j3167j1294J1889q903r304k3271K4360n181j8806p635R356j4872
7416c5442L3623M0923K2698j7195k3201k8702O880R489N331k413j1300n012J942
7403b379l090K0451J5437j7724k7977O245N894m657j9168O31m436o747N491J4444
7389a7585O146m866l570L793J8335J1896q658r744o218L964j8312J8551R745j753
7375A724K3053J660k460p360J0829J9163j1158l1606r177J2318k4943q712Q957
$$ plain form
7362 -17712 -17049 -14880 -28287 -14453 -8024 -31864 -32728 -25551 -29389 -48238 -51612 -8799 18496 17811
7348 17811 16334 11931 20973 20629 9717 -25609 -26506 -28424 -53336 -40846 -9718 -16936 -65 29742
7334 29742 19472 1447 -798 10413 11775 -2622 -1527 -15686 -27113 -25068 -35427 -47918 -55535
7321 -55535 -52001 -21581 -6492 -3979 1215 8613 15572 7023 2073 -10292 -10544 -12291 -51066 -37473
7307 -37473 -6391 -4005 -11075 -15512 -15597 -23353 -4564 22288 8847 20996 44952 42319 32921 30221
7293 30221 18153 20674 57791 51317 25330 29318 28356 22323 13743 -761 -7965 -23768 -28712 -11276
7279 -11276 -6117 10952 12200 8430 -8509 -17677 -9034 -7976 -30589 -47671 -34387 -9340 -4284
7266 -4284 10603 11566 -890 -24265 -49449 -45443 -27408 -31313 -34001 -42756 -47385 -33545 -28109 -40800
$$ packed form
7362a7712O63K169j3407J3834O429k3840q64P177l838j8849l374M2813K7295o85
7348A7811j477m403R042l44j0912l5326q97j918k4912J2490L1128p218J6871K9807
7334B9742j0270j8025k245J1211J362j4397J095j4159j1427K045j0359j2491p617
7321e5535L534L0420J5089K513N194P398O959q549m950j2365k52j747l8775J3593
7307c7473L1082K386p070m437q5p756J8789K6852j3441J2149K3956k633r398k700
7293C0221j2068K521L7117o474k5987L988r62o033q580j4504p204j5803m944J7436
7279a1276N159J7069J248l770j6939r168Q643J058k2613j7082J3284K5047N056
7266d284J4887R63j2456k3375k5184M006J8035l905k688q755m629J3840N436j2691
$$ plain form
7252 -40800 -40966 -37754 -52371 -31033 -12196 -14438 -11043 -10952 -5527 -12669 -23676 -36310 -48265 -42463
7238 -42463 -52652 -29451 -27528 -30894 -6171 -22390 -33386 -10171 12274 20000 -3578 -13251 28641
7225 28641 39590 25636 25054 16137 -8201 -23044 -26432 -27891 -41810 -32778 -5065 15183 13471
7212 13471 3988 -13641 -16351 -15722 -36602 -45953 -41248 -31522 -33279 -33078 -23077 -9175 1415 11814
7198 11814 12265 -9387 -32813 -37256 -48091 -32188 -29054 -43778 -22684 1189 -4366 -22053 -28647
7185 -28647 -15379 -10841 -4394 -27126 -36706 -7723 16622 28428 22485 -2482 -17721 -11327 -11722
7172 -11722 -152 -12975 -9057 -4459 -15708 -23374 -7371 6736 8411 22810 6859 670 13313
7159 13313 43770 52384 34532 19073 29565 33126 1906 8385 12377 -3970 -17805 -43963 -68954
$$ packed form
7252d0800j66L212j4617K1338J8837k242L395R1N425p142j1007j2634j1955N802
7238d2463j0189K3201J923l366K4723j6219j0996K3215K2445P726k3578r673M1892
7225B8641J0949j3954n82q917k4338j4843l388j459j3919R032K7713K0248j712
7212A3471r483j7629k710O29k0880r351M705R726j757K01J0001J3902J0590J0399
7198A1814M51k1652k3426m443j0835J5903L134j4724K1094K3873n555j7687o594
7185b8647J3268M538O447k2732r580K8983K4345J1806n943k4967j5239O394l95
7172a1722J1570j2823L918M598j1249p666J6003J4107J675J4399j5951o189J2643
7159A3313L0457Q614j7852j5459J0492L561l1220O479L992j6347j3835k6158k4991
$$ plain form
7146 -68954 -71172 -53377 -25885 -15030 -3312 8304 26904 36599 21215 -16679 -17777 17096
7134 17096 41514 17245 -311 4254 11345 13377 14608 4178 -10163 -13758 2516 7 12010
7121 12010 9754 -27652 -53883 -30303 -20755 -17657 -24194 -40562 -37857 -28427 -30988 -25045 -27311 -26917
7107 -26917 1658 20044 32128 22862 8432 12891 18247 -497 -1497 -8551 1050 17304 2199
7094 2199 14223 29443 47894 5428 -30188 -53715 -49736 -27469 -33585 -15457 11828 13271 21257
7081 21257 31993 3485 -33011 -49198 -34476 -20644 -8951 -4743 17508 15871 12371 2351
7069 2351 -7883 -11932 -23861 -23162 -14760 -15576 9423 17969 14148 15612 4167 -26336 -21492 4940
7055 4940 13376 19430 38178 25832 14461 7359 21287 17042 5673 6648 14967 -8350 -31048
$$ packed form
7146f8954k218J7795K7492J0855J1718J1616J8600R695j5384l7894j098L4873
7134A7096K4418k4269j7556M565P091K032J231j0430j4341l595J6274k509J2003
7121A2010k256l7406k6231K3580R548L098o537j6368K705R430k561N943k266L94
7107b6917K8575J8386J2084r266j4430M459N356j8744j000p054R601J6254j5105
7094B199J2024J5220J8451m2466l5616k3527L979K2267o116J8128K7285J443P986
7081B1257J0736k8508l6496j6187J4722J3832J1693M208K2251j637l500j0020
7069B351j0234m049j1929O99Q402q16K4999Q546l821J464j1445l0503M844K6432
7055D940Q436O054J8748j2346j1371p102J3928m245j1369R75Q319k3317k2698
$$ plain form
7042 -31048 -36869 -32427 -20708 -20218 -12578 -10938 -6562 10904 27517 12328 -453 7910 3791 -10221
7028 -10221 -12466 -5663 12426 17713 5677 26487 26660 13584 -5230 -23033 -141 8553 -4576
7015 -4576 -4908 8185 10197 9481 -20512 -14839 -14554 -32128 -29660 -3384 7805 12659 21282 29359
7001 29359 -8533 -32172 -17907 -6398 11310 35958 37443 17533 -5241 -3958 -9865 -3198 -17189
6988 -17189 -33438 -38754 -44710 -50636 -56932 -44227 -28065 -26705 -17010 -837 19595 32031 21543
6975 21543 -20375 -27696 -33528 -21582 -7744 -16817 -38401 -32617 -6251 -8436 -32950 -32308 -9467
6962 -9467 -5125 -25017 -15952 -24057 -34314 -39082 -41517 -31989 -17108 -17459 3107 16619 18405 40125
6948 40125 26852 4792 5551 13588 28301 26572 948 553 13133 8675 -67 4432 17563 24747
$$ packed form
7042c1048n821M442J1719M90P640J640M376J7466J6613j5189j2781Q363m119j4012
7028a0221k245O803J8089N287j2036K0810J73j3076j8814j7803K2892Q694j3129
7015d576l32J3093K012p16k9993N673K85j7574K468K6276J1189M854Q623Q077
7001B9359l7892k3639J4265J1509J7708K4648J485j9910k2774J283n907O667j3991
6988a7189j6249n316n956n926o296J2705J6162J360R695J6173K0432J2436j0488
6975B1543m1918p321n832J1946J3838r073k1584N784K6366k185k4514O42K2841
6962i467M342j9892R065q105j0257m768k435R528J4881l51K0566J3512J786K1720
6948D0125j3273k2060P59Q037J4713j729k5624l95J2580m458q742M499J3131P184
$$ plain form
6934 24747 18894 12447 -3520 -15064 11750 21742 21221 27710 9925 -26766 -28646 -19102 -65
6921 -65 15257 17030 6642 -8309 -32452 -34527 -34824 -35837 -9004 -2115 -12954 -17508 -10348 -6751
6907 -6751 4722 -17472 -16938 -11993 -350 -8014 -858 3331 6215 -2769 -8597 -20673 -23734 -9125
6893 -9125 -24375 -30728 -23723 -16103 -18618 -35219 -15846 -22371 -26016 8848 18969 -2739 -36693
6880 -36693 -32473 -40563 -58054 -60659 -58124 -47749 -55345 -53338 -39779 -15029 -10749 -3512 2678 4516
6866 4516 15206 9287 -27823 -42387 -23942 -29065 -16354 7474 -7135 -35937 -26692 2858 6387
6853 6387 18219 15756 -555 -13678 -9346 -34668 -54798 -40136 -22443 -20717 5706 3312 1429
6840 1429 17087 22429 15941 19509 9759 3333 7306 -20184 -15245 -1537 369 -5469 5084 17276
$$ packed form
6934B4747n853o447j5967j1544K6814R992n21O489j7785l6691j880R544J9037
6921f5J5322J773j0388j4951k4143k075k97j013K6833O889j0839m554P160L597
6907f751J1473k2194N34M945J1643p664P156M189K884q984n828j2076l061J4609
6893i125j5250o353P005P620k515j6601J9373o525l645L4864J0121k1708l3954
6880c6693M220q090j7491k605K535J0375p596K007J3559K4750M280P237O190J838
6866D516J0690n919l7110j4564J8445n123J2711K3828j4609k8802R245K9550L529
6853F387J1832k463j6311j3123M332k5322k0130J4662J7693J726K6423k394j883
6840A429J5658N342o488L568r750o426L973k7490M939J3708J906n838J0553J2192
$$ plain form
6826 17276 18814 -5479 -19397 -15897 4359 31058 20575 -5372 -7736 773 5931 -2232 7638
6813 7638 -1933 -12118 -7569 2294 25426 28332 -2084 -31630 -30076 -20637 -3697 8277 8124 -4444
6799 -4444 17612 -7535 -14389 -9122 -29200 -18764 -3106 -6348 -38233 -48728 -29314 7691 31778
6786 31778 30525 41016 53889 43112 19281 33734 271 -23313 -27833 -24735 -25277 -16572 -23157
6773 -23157 -21766 -7020 -17524 -275 9256 16185 -367 -27302 -42384 -14662 -14828 -6004 -12137
6760 -12137 -7940 1419 -12229 -32804 -55257 -56055 -45146 -14457 6756 -3119 -5909 -24932 -41672
6747 -41672 -31147 -17058 -13596 -11775 5531 -834 17784 27807 13071 -9647 -692 4574 6134
6734 6134 3949 -10028 -19213 -18993 1245 31676 38026 4671 -17492 -23765 -28443 -11677 -1925 -1079
$$ packed form
6826A7276J538k4293j3918L500K0256K6699j0483k5947k364Q509N158q163R870
6813G638r571j0185M549R863K3132K906l0416k9546J554R439J6940J1974j53j2568
6799d444K2056k5147o854N267k0078J0436J5658l242l1885j0495J9414L7005K4087
6786C1778j253J0491J2873j0777k3831J4453l3463k3584m520L098n42Q705o585
6773b3157J391J4746j0504J7249R531O929j6552k6935j5082K7722j66Q824o133
6760a2137M197R359j3648k0575k2453p98J0909L0689K1213r875k790j9023j6740
6747d1672J0525J4089L462J821J7306o365J8618J0023j4736k2718Q955N266J560
6734F134k185j3977r185K20K0238L0431O350l3355k2163o273m678J6766R752Q46
$$ plain form
6720 -1079 687 -1725 30699 50978 45916 50238 46303 25341 20657 40110 27449 -2618 -24681
6707 -24681 -19939 -11101 -27708 -44472 -16398 7487 -1277 -1145 -11571 -23107 -32477 -38196 -43700
6694 -43700 -53092 -45708 -30750 -62606 -75592 -56002 -31846 -24099 -36672 -36227 -37463 -43957 -35446
6681 -35446 -18706 -5632 -2075 -1973 7919 -4097 -26309 -6878 15257 22631 26379 23402 -2654
6668 -2654 5542 21917 5790 12143 13524 13003 27652 31072 14355 -768 -8492 -7300 19955 17196
6654 17196 6225 6445 23490 20849 20272 3232 -1516 2558 19894 196 -13496 -12839 -29310 -23714
6640 -23714 -43350 -64979 -65032 -41425 -34569 -16409 -18336 -16669 -20002 -14543 -2049 -25654 -35144 -32023
6626 -32023 -14113 19434 33876 55076 58984 81113 74051 37422 22676 1957 -7983 3800
$$ packed form
6720a079J766k412L2424K0279n062M322l935k0962m684J9453j2661l0067k2063
6707b4681M742Q838j6607j6764K8074K3885q764J32j0426j1536r370n719n504
6694d3700r392P384J4958l1856j2986J9590K4156P747j2573M45j236o494Q511
6681c5446J6740J3074L557J02R892j2016k2212J9431K2135P374L748k977k6056
6668b654Q196J6375j6127O353J381n21J4649L420j6717j5123p724J192K7255k759
6654A7196j0971K20J7045k641n77j7040m748M074J7336j9698j3692O57j6471N596
6640b3714j9636k1629n3K3607O856J8160j927J667l333N459J2494k3605r490L121
6626c2023J7910L3547J4442K1200L908K2129p062l6629j4746k0719r940J1783
$$ plain form
6614 3800 26258 18325 7918 4272 -10386 -10089 2203 -785 -1903 -17533 -60 3625 9032 40334
6600 40334 65234 50921 37853 29212 -1382 -20383 -27105 -24017 -26437 -8764 -15904 -16382 6645
6587 6645 -573 -20215 -47165 -28693 5109 28629 25207 17531 24898 13043 2274 -14040 -22792
6574 -22792 -22898 -18663 -24677 -17466 8021 -6419 -31958 -15981 -2483 5310 -1190 -23367 -21250
6561 -21250 4522 6525 -4041 -6286 -22217 -22789 8387 14322 18192 16499 10278 9067 21361 23229
$$ packed form
6614C800K2458p933j0407l646j4658K97J2292k988j118j5630J7473L685N407L1302
6600D0334K4900j4313j3068q641l0594j9001o722L088k420J7673p140m78K3027
6587F645p218j9642k6950J8472L3802K3520l422p676P367j1855j0769j6314q752
6574b2792j06M235o014P211K5487j4440k5539J5977J3498P793o500k2177K117
6561b1250K5772K003j0566k245j5931n72L1176N935L870j693o221j211J2294J868
$$ [...]
##END NTUPLES=NMR SPECTRUM
##END=
