##TITLE=Analysis number 328472
Compound Code cc 04501
Book Reference lab3
Project Code adrs
Chemist Name stores
##JCAMPDX= 6.0         $$ Bruker NMR JCAMP-DX V2.0
##DATA TYPE= NMR SPECTRUM
##DATA CLASS= NTUPLES
##ORIGIN= Bruker BioSpin GmbH
##OWNER= nmr
$$ XWIN-NMR		Version 3.5
$$ Thu Jun  7 10:54:46 2007 GMT Daylight Time (UT+1h)  MAYBRIDGE\nmr@NMR_250MHZ
##.OBSERVE FREQUENCY= 250.131544655141
##.OBSERVE NUCLEUS= ^1H
##.ACQUISITION MODE= SIMULTANEOUS (DQD)
##.ACQUISITION SCHEME= undefined
##.AVERAGES= 16
##.DIGITISER RES= 18
##SPECTROMETER/DATA SYSTEM= dpx250
##.PULSE SEQUENCE= zg30
##.SOLVENT NAME= DMSO
##.SHIFT REFERENCE= (INTERNAL, DMSO, 0, 16.5226)
##AUDIT TRAIL= $$ (NUMBER, WHEN, WHO, WHERE, WHAT)
$$ ##TITLE= Audit trail, XWIN-NMR		Version 3.5
$$ ##JCAMPDX= 5.01
$$ ##ORIGIN= Bruker BioSpin GmbH
$$ ##OWNER= nmr
$$ C:\u/data/dgb/nmr/ADRS/470/pdata/1/auditp.txt
$$ ##AUDIT TRAIL=  $$ (NUMBER, WHEN, WHO, WHERE, WHAT)
(   1,<2007-06-07 10:54:10.94 +100>,<MAYBRIDGE\nmr>,<NMR_250MHZ>,
      <created by zg, POWCHK disabled, PULCHK disabled
       configuration hash MD5:
       76 6E 9A 78 1E 09 19 81 EC 84 63 8F B0 6A 59 2D
       data hash MD5: 64K
       4D FE FC 45 66 92 AC 8C AA AE 9B 85 B1 C4 9D BD>)
(   2,<2007-06-07 10:54:27.42 +100>,<MAYBRIDGE\nmr>,<NMR_250MHZ>,
      <Start of raw data processing
       ef LB = 0.3 FT_mod = 6 PKNL = 1 SI = 32K 
       data hash MD5: 32K
       45 F3 A1 88 45 A7 BD 5E 0F 3F 39 2A 91 6A 4E 10>)
(   3,<2007-06-07 10:54:29.36 +100>,<MAYBRIDGE\nmr>,<NMR_250MHZ>,
      <apk 
       data hash MD5: 32K
       50 E9 48 B2 47 66 F6 DA 5E 08 95 64 EC 2D 8C 82>)
(   4,<2007-06-07 10:54:30.20 +100>,<MAYBRIDGE\nmr>,<NMR_250MHZ>,
      <abs ABSG = 5 
       data hash MD5: 32K
       5B 72 CE 93 67 39 73 16 0F DF 8B 87 D6 A9 05 63>)
$$ ##END=
$$ 
$$ hash MD5
$$ 63 C0 6B 8E 92 F4 4F EE 2C 4A AD 30 F8 3C C1 75
##$RELAX= 
##$RELAX= 
##$RELAX= 
##$RELAX= 
##$RELAX= 
##$RELAX= 
##$RELAX= 
$$ Bruker specific parameters
$$ --------------------------
##$DU= <C:\u>
##$EXPNO= 470
##$NAME= <ADRS>
##$PROCNO= 1
##$TYPE= <nmr>
##$USER= <dgb>
##$AMP= (0..31)
100 100 100 100 100 100 100 100 100 100 100 100 100 100 100 100 100 100 
100 100 100 100 100 100 100 100 100 100 100 100 100 100 
##$AQSEQ= 0
##$AQ_mod= 3
##$AUNM= <au_zg>
##$AUTOPOS= <11 >
##$BF1= 250.13
##$BF2= 250.13
##$BF3= 250.13
##$BF4= 250.13
##$BF5= 500.13
##$BF6= 500.13
##$BF7= 500.13
##$BF8= 500.13
##$BYTORDA= 1
##$CFDGTYP= 0
##$CFRGTYP= 5
##$CHEMSTR= <none>
##$CNST= (0..31)
1 1 145 1 1 1 1 1 1 1 1 1 1 1 1 1 1 1 1 1 1 1 1 1 1 1 1 1 1 1 1 1 
##$CPDPRG= <>
##$CPDPRG1= <>
##$CPDPRG2= <>
##$CPDPRG3= <>
##$CPDPRG4= <mlev>
##$CPDPRG5= <mlev>
##$CPDPRG6= <mlev>
##$CPDPRG7= <mlev>
##$CPDPRG8= <mlev>
##$CPDPRGB= <>
##$CPDPRGT= <>
##$D= (0..31)
0 1 0 0 0 0 0 0 0 0.06 0 0 0 0 0 0 0.0002 0 0 0 0 0 0 0 0 0 0 0 0 0 0 
0 
##$DATE= 1181210049
##$DBL= (0..7)
120 120 120 120 120 120 120 120 
##$DBP= (0..7)
150 150 150 150 150 150 150 150 
##$DBP07= 0
##$DBPNAM0= <>
##$DBPNAM1= <>
$$ [...]
##$SUBNAM7= <"">
##$SUBNAM8= <"">
##$SUBNAM9= <"">
##$SW= 20.6930455092707
##$SWIBOX= (0..15)
0 0 3 0 0 0 0 0 0 0 0 0 0 0 0 0 
##$SW_h= 5175.983436853
##$TD= 65536
##$TD0= 1
##$TE= 297.16
##$TE2= 300
##$TE3= 300
##$TEG= 300
##$TL= (0..7)
0 120 120 120 120 120 120 120 
##$TP= (0..7)
150 150 150 150 150 150 150 150 
##$TP07= 0
##$TPNAME0= <>
##$TPNAME1= <>
##$TPNAME2= <>
##$TPNAME3= <>
##$TPNAME4= <>
##$TPNAME5= <>
##$TPNAME6= <>
##$TPNAME7= <>
##$TPOAL= (0..7)
0.5 0.5 0.5 0.5 0.5 0.5 0.5 0.5 
##$TPOFFS= (0..7)
0 0 0 0 0 0 0 0 
##$TUNHIN= 0
##$TUNHOUT= 0
##$TUNXOUT= 0
##$USERA1= <user>
##$USERA2= <user>
##$USERA3= <user>
##$USERA4= <user>
##$USERA5= <user>
##$V9= 5
##$VALIST= <valist>
##$VCLIST= <CCCCCCCCCCCCCCC>
##$VD= 0
##$VDLIST= <DDDDDDDDDDDDDDD>
##$VPLIST= <PPPPPPPPPPPPPPP>
##$VTLIST= <TTTTTTTTTTTTTTT>
##$WBST= 1024
##$WBSW= 4
##$XGAIN= (0..3)
0 0 0 0 
##$XL= 0
##$YL= 0
##$YMAX_a= 345974
##$YMIN_a= -263425
##$ZGOPTNS= <>
##$ZL1= 120
##$ZL2= 120
##$ZL3= 120
##$ZL4= 120
##$ABSF1= 16.52264
##$ABSF2= -4.170532
##$ABSG= 5
##$ABSL= 3
##$ALPHA= 0
##$AQORDER= 0
##$ASSFAC= 0
##$ASSFACI= 0
##$ASSFACX= 0
##$ASSWID= 0
##$AUNMP= <proc_1d>
##$AZFE= 0.1
##$AZFW= 0.1
##$BCFW= 0
##$BC_mod= 0
##$BYTORDP= 0
##$COROFFS= 0
##$CY= 12.5
##$DATMOD= 1
##$DC= 0
##$DFILT= <>
##$DTYPP= 0
##$F1P= 14.0000005364418
##$F2P= -0.99999901652339
##$FCOR= 0.5
##$FTSIZE= 32768
##$FT_mod= 6
##$GAMMA= 0
##$GB= 0
##$INTBC= 1
##$INTSCL= 1
##$ISEN= 128
##$LB= 0.3
##$LEV0= 0
##$LPBIN= 0
##$MAXI= 10000
##$MC2= 0
##$MEAN= 0
##$ME_mod= 0
##$MI= 0
##$NCOEF= 0
##$NC_proc= -5
##$NLEV= 6
##$NOISF1= 0
##$NOISF2= 0
##$NSP= 0
##$NTH_PI= 0
##$NZP= 0
##$OFFSET= 16.52264
##$PC= 1
##$PHC0= -68.20032
##$PHC1= 12.89849
##$PH_mod= 1
##$PKNL= yes
##$PPARMOD= 0
##$PSCAL= 4
##$PSIGN= 0
##$REVERSE= no
##$SF= 250.129999839614
##$SI= 32768
##$SIGF1= 0
##$SIGF2= 0
##$SINO= 400
##$SIOLD= 32768
##$SREGLST= <1H.DMSO>
##$SSB= 0
##$STSI= 32768
##$STSR= 0
##$SW_p= 5175.98343685301
##$SYMM= 0
##$S_DEV= 0
##$TDeff= 65536
##$TDoff= 0
##$TI= <Analysis number 999999
Compound Code 99
Book Reference 9
Project Code 9>
##$TILT= no
##$TM1= 0
##$TM2= 0
##$TOPLEV= 0
##$USERP1= <user>
##$USERP2= <user>
##$USERP3= <user>
##$USERP4= <user>
##$USERP5= <user>
##$WDW= 1
##$XDIM= 32768
##$YMAX_p= 284844263
##$YMIN_p= -467156
$$ End of Bruker specific parameters
$$ ---------------------------------
##NTUPLES= NMR SPECTRUM
##VAR_NAME=  FREQUENCY,     SPECTRUM/REAL,   SPECTRUM/IMAG
##SYMBOL=    X,             R,               I
##VAR_TYPE=  INDEPENDENT,   DEPENDENT,       DEPENDENT
##VAR_FORM=  AFFN,          ASDF,            ASDF
##VAR_DIM=   32768,         32768,           32768
##UNITS=     HZ,            ARBITRARY UNITS, ARBITRARY UNITS
##FACTOR=    0.157963299565203, 1,           1
##FIRST=     4132.80799764755, 0,            0
##LAST=      -1043.17543920546, 0,           0
##MIN=       -1043.17543920546, -467156,     0
##MAX=       4132.80799764755, 284844263,    0
$$ Real data points
##PAGE= N=1
##DATA TABLE= (X++(R..R)), XYDATA
$$ [...]
12006G753153J82469K23603Q8364J01241K25204J35304R7426J64910N9061J47534
$$ 7753153 7935622 8159225 8247589 8348830 8574034 8709338 8806764 8971674 9030735 9178269
11996I178269K17350P3498J85711J76419J57271J62092L30R7705R7705K85618
$$ 9178269 9395619 9469117 9654828 9831247 9988518 10150610 10150940 10248645 10346350 10631968
11986A0631968L18401K18159P0828P6434J26328J30596K18214K86555J58655J16559
$$ 10631968 10950369 11168528 11239356 11315790 11442118 11572714 11790928 12077483 12236138 12352697
11976A2352697J38385K82297J70655M6818J28461K42320L76384J87364J17920
$$ 12352697 12491082 12773379 12944034 12990852 13119313 13361633 13738017 13925381 14043301
11967A4043301J98431O0732J03985J97899J28974J85359J98400J64651J94467
$$ 14043301 14241732 14302464 14406449 14604348 14733322 14918681 15117081 15281732 15476199
11958A5476199K55979J79752J26883J54294n583J07605N3742J10524K43604J96214
$$ 15476199 15732178 15911930 16038813 16193107 16187524 16295129 16348871 16459395 16702999 16899213
11948A6899213J21163J55271J90424J40029J39991J08334K8587Q5622Q7957J11983
$$ 16899213 17020376 17175647 17366071 17506100 17646091 17754425 17783012 17868634 17956591 18068574
11938A8068574M3601k9162J69665J23192r3808O151L6148j39262j2457O1273J08309
$$ 18068574 18112175 18083013 18252678 18375870 18282062 18288213 18324361 18185099 18172642 18233915 18342224
11927A8342224J01822P7531j5129j02111k26253j37403j43513p6856k6964o3247
$$ 18342224 18444046 18521577 18506448 18404337 18178084 18040681 17897168 17820312 17793348 17730101
11917A7730101O487j1995o9123j04895j22169k09029k1710L6128j62664p2042
$$ 17730101 17736588 17724593 17655470 17550575 17428406 17219377 17197667 17233795 17071131 16999089
11907A6999089k01272l05369k91377n3999j19959k15351k89641k72124j72059
$$ 16999089 16797817 16492448 16201071 16147072 16027113 15811762 15522121 15249997 15077938
11898A5077938j58628k30659p8585j07517j46373j90234k04203j51093r2459j82048
$$ 15077938 14919310 14688651 14610066 14502549 14356176 14165942 13961739 13810646 13718187 13536139
11888A3536139k48883k03654j34252k2930k50369j83045q3410k19579j09360k54504
$$ 13536139 13287256 13083602 12949350 12926420 12676051 12493006 12409596 12190017 12080657 11826153
11878A1826153k11011m8163N6588j74130k83317k18875j63545k3761q4498j36378
$$ 11826153 11615142 11566979 11623567 11449437 11166120 10947245 10783700 10759939 10675441 10539063
11868A0539063j44797j88496j99077k15346k33920j95692k52682j05243l9190
$$ 10539063 10394266 10205770 10006693 9791347 9557427 9361735 9109053 9003810 8964620
11859H964620k0254o4394r5653k16295j50243j50223l00859j24779k3726J2274
$$ 8964620 8944366 8879972 8784319 8568024 8417781 8267558 7966699 7841920 7818194 7830468
11849G830468j84448j90201J2905r0063j83242j69995J4995R706J7765j14076
$$ 7830468 7646020 7455819 7468724 7378661 7195419 7025424 7040419 7050125 7067890 6953814
11839F953814j52273m3407j86863j95125j60011j10693Q4820j15894j40298k7771
$$ 6953814 6801541 6758134 6571271 6376146 6216135 6105442 6190262 6074368 5934070 5906299
11829E906299o682n2975j35746k06573r2040J14985N1409n3391r6994j54881k30956
$$ 5906299 5899617 5846642 5710896 5504323 5412283 5527268 5578677 5525286 5428292 5273411 5042455
11818E042455o4836j50222m4985J3705l2698r3071j79703j9764m5965j492k6180
$$ 5042455 4977619 4827397 4782412 4796117 4763419 4670348 4490645 4470881 4424916 4423424 4397244
11807D397244m2582N4686o879k1228k0119j43952l6261j07736q8899O6222J9670
$$ 4397244 4354662 4409348 4402469 4381241 4361122 4217170 4180909 4073173 3984274 4050496 4070166
11796D070166j15818r6091P3001j37723j67338o6975K2845P5667K063j28780r1142
$$ 4070166 3954348 3858257 3931258 3793535 3626197 3559222 3582067 3657734 3659797 3531017 3439875
11785C439875q9027K9532k2176l9025J17460o9877j28638o5166m940p0645m2472
$$ 3439875 3350848 3380380 3358204 3319179 3436639 3366762 3238124 3172958 3168018 3097373 3054901
11774C054901k6314L242L9821j38879j38149j6317K6990m7554P1944k7396j06152
$$ 3054901 3028587 3031829 3071650 2932771 2794622 2778305 2805295 2757741 2829685 2802289 2696137
11763B696137p1991m2860j52469p9844K4577N2478R2056P6M8888l7405o3533k9510
$$ 2696137 2624146 2581286 2428817 2348973 2373550 2426028 2518084 2518160 2567048 2529643 2466110 2436600
11751B436600p3188j7058j32271M1470o1751O7298M2167j50076r2025N015l1385
$$ 2436600 2363412 2346354 2214083 2255553 2193802 2261100 2303267 2153191 2061166 2066181 2034796
11740B034796K0117L3846r939N6587L8068m7745n879o8529j02612j40933K5813
$$ 2034796 2054913 2088759 2078820 2135407 2173475 2125730 2119851 2051322 1948710 1807777 1833590
11729A833590o67N1795k1064o2476j8980N9195K8067K933K259j40596K4952J00553
$$ 1833590 1832923 1884718 1863654 1801178 1782198 1841393 1869460 1872393 1874652 1734056 1759008 1859561
11717A859561R5608p6361j03136n7038K3557J0210n7960k05487p6992J13388l4768
$$ 1859561 1955169 1878808 1775672 1718634 1742191 1752401 1694441 1488954 1411962 1525350 1490582
11706A490582J9029N5919P1824l7206j22123M2450K5430j26669L2970J65136P2999
$$ 1490582 1509611 1565530 1637354 1600148 1478025 1520475 1545905 1419236 1452206 1617342 1690341
11695A690341m2949o8073r9164r7351m6934k47550m833P0177J43910n620m8288
$$ 1690341 1647392 1579319 1480155 1382804 1335870 1088320 1083487 1153664 1297574 1291954 1243666
11684A243666n7005L0895L3039p1129l5673q4216M1216J58041Q6395N0200J406
$$ 1243666 1186661 1217556 1250595 1179466 1143793 1059577 1100793 1258834 1345229 1395429 1396835
11673A396835j5028K2876m5850k09438p2880J73045O6979L7091k9932r0536j66181
$$ 1396835 1381807 1404683 1358833 1149395 1076515 1249560 1316539 1353630 1323698 1233162 1066981
11662A066981n3353M1276N1685l4579P2665j26254k559n2271m5909j5754j6797
$$ 1066981 1013628 1054904 1106589 1072010 1144675 1018421 1015862 963591 917682 901928 885131
11651H85131k2172K0873o1534N2422l6858o5741J04261O2649n7673q5483k272
$$ 885131 862959 883832 822298 874720 837862 772121 876382 939031 881358 795875 793603
11640G93603N6159R3086N5890L8824p697n6897k311N2614o2658n4873q6386m2118
$$ 793603 849762 942848 998738 1037562 1029865 972968 970657 1023271 960613 905740 819354 777236
11628G77236j874l1175R1301J71002p3726q1268j1179j06479p4648k5524L0513
$$ 777236 775362 744187 835488 1006490 932764 851496 840317 733838 659190 633666 664179
11617F64179M3859K0810q3558p4319O6323O2770J31769q2994J875Q4808r4062
$$ 664179 708038 728848 645290 570971 637294 700064 831833 748839 750714 835522 741460
11606G41460l8951M703m415K2698O9988P3401p5272Q6777P9600o1929n9384p4410
$$ 741460 702509 707212 702797 725495 795483 868884 793612 880389 959989 898060 838676 764266
11594G64266l1864N014L5549l2335K821O2338R337n6615r607j8544j33573o9774
$$ 764266 732402 737416 772965 740630 743451 805789 815126 758511 748904 730360 596787 527013
11582E27013l1456M5315R2163k151K7673k3401L4767k8201M4329p2462Q967o153
$$ 527013 495557 540872 633035 630884 658557 635156 669923 641722 686051 613589 622556 616403
11570F16403k8205m3546j102L9848J45092l7253K7602P0728m4239L8994r057m1577
$$ 616403 588198 544652 543550 583398 728490 691237 718839 789567 745328 784322 775265 733688
11558G33688j24935N313M4822p0568q5531L4831n7583j86888M6282J88740J01891
$$ 733688 608753 614066 658888 588320 502789 537620 480037 293149 339431 528171 630062
11547F30062R0831R650m7270j01160j13109p5303m5086j4701J46821J23328O005
$$ 630062 720893 730543 683273 582113 469004 393701 348615 333914 480735 604063 610068
11536F10068J0021N4656j0278L7551j07746r5007L3244P7396j8372j33868n1148
$$ 610068 620089 674745 664467 702018 594272 499265 532509 609905 591533 457665 406517
11525D06517q460q04o5866K313Q1800L7687P8188r3717Q0190J17605j29098n1517
$$ 406517 398057 397253 331387 333700 415500 453187 531375 437658 517848 635453 506355 454838
11513D54838J07732r5984o2665M8363J2381n0471o2936O6604q512J04809m0977
$$ 454838 562570 466586 403921 452284 464665 414194 351258 417862 409350 514159 473182
11502D73182L2839P1716L9918j36380j06232M691N3480K8946j2161q6917N4867
$$ 473182 506021 577737 617655 481275 375043 379734 433214 462160 449999 363082 417949
11491D17949J03596p7829j24163l5009M2105j7246K9826m3695j9085J37701L8684
$$ 417949 521545 443716 319553 284544 326649 309403 339229 295534 276449 414150 452834
11480D52834K5958j6499k9730r0883j59030J1503J31263K2991K918J719k4937
$$ 452834 478792 462293 432563 341680 182650 194153 325416 348407 351325 353044 328107
11469C28107j0007R2679j6343n6186J31890q8011j04562J8036Q6844K1654j08777
$$ 328107 318100 410779 394436 338250 470140 382129 277567 295603 382447 404101 295324
11458B95324l1078m9668M3196L7404n6290L5139j7556O988m8439k3899J07669
$$ 295324 264246 214578 257774 295178 238888 274027 256471 263459 215020 191121 298790
11447B98790J14148o4635L0733p2274q3418J03232M0476n7393K848m6579n8892
$$ 298790 412938 348303 379036 306762 223344 326576 367052 309659 312507 265928 207036
11436B07036J9988L094K4719O339m120J6966O3883n4384N5365j357n9182p2687
$$ 207036 227024 230118 254837 261176 257056 274022 337905 283521 338886 337529 278347 205660
11424B05660K5419L8505k4765J9455R6799J6907m3852k8814O0562m8649M699P0273
$$ 205660 231079 269584 244819 264274 361073 377980 334128 305314 365876 317227 321926 392199
11412C92199j03767n8727M4768l0034O2804J47083l0959J0803j23201k2410q2093
$$ 392199 288432 229705 274473 244439 307243 454326 423367 434170 310969 288559 206466
11401B06466J6422J60224q573j08843j2512Q575L7582O0977o3308j35187l6061
$$ 206466 222888 383112 374539 265696 253184 261759 299341 360318 297010 161823 125762
11390A25762Q9566M6154M9330q120r9809J5572J34397n9715m6488P342L0321j0020
$$ 125762 215328 261482 310812 302692 202883 218455 352852 293137 246649 253991 284312 274292
11378B74292o6581L4145l6218j8765m7665j3238M2349P0750m5519l087J12524
$$ 274292 207711 241856 205638 186873 139208 125970 168319 239069 193550 190463 302987
11367C02987l9715j13137l4677J69159N5235j01112j948k6084k4060J27076j2869
$$ 302987 263272 150135 115458 284617 339852 238740 236792 210708 186648 313724 300855
11356C00855j24804j9864j8222O125j01014o6700J01971K13525J16145k2259r6193
$$ 300855 176051 156187 137965 144090 43076 -23624 78347 291872 408017 385758 289565
11345B89565q879P4770J3481j1374J3514J8419L1244K2243j6922N9463L8515j4653
$$ 289565 280686 355456 368937 357563 371077 389496 420740 442983 426061 485524 524039 509386
11333E09386L0226j25636r8246q2596j33209Q740J11251J05701j22106p2744P533
$$ 509386 539612 413976 315730 233134 99925 108665 219916 325617 203511 130767 138300
11322A38300r286q234r075k6608q961j9944P7512j05531O7782N8912n9397P515
$$ 138300 129014 120780 111705 85097 76136 56192 133704 28173 95955 154867 95470 102985
11310A02985k523q0800M3085J49154L5985j7806l2501j26701J8943P8362L2404
$$ 102985 100462 19662 62747 211901 247886 230080 197579 70878 89821 168183 200587
11299B00587M2905P2315p1596l4401l8778k1358k7976J07462P7426m0901j35227
$$ 200587 243492 315807 244211 209810 171032 149674 121698 229160 306586 265685 130458
11288A30458n988K7817M4685j2309p2296l7404O1209R2345J4716o6013k2687m424
$$ 130458 124470 152287 196972 184663 112367 74963 136172 228517 243233 177220 154533 150109
11276A50109j28967n9257k9464Q2492k4333K7633L7309r7988p296M8891L6538
$$ 150109 21142 -38115 -67579 14913 -9420 18213 55522 -42466 -49762 -871 35667
11265C5667N6633Q4820J9355l6629K9273m6515q2361m07l5404j32071o6862N7585
$$ 35667 92300 177120 196475 159846 189119 142604 60243 59836 24432 -107639 -174501 -116916
11253a16916J53793R6510P5353m8362N3402J06915o1002p567J7642p5622m8948
$$ -116916 36877 133387 208740 160378 213780 320695 259693 252126 269768 194146 145198
11242A45198J3635j21964q2757O4151k0536n8311l1999O8181k7448j1750J21841
$$ 145198 158833 36869 -45888 18263 -2273 -60584 -92583 -24402 -51850 -63600 58241
11231E8241Q0374l2839N7454N4858j26075n2628l7433n6402J1657n7679K0424
$$ 58241 138615 105776 163230 218088 92013 39385 1952 -54450 -42793 -100472 -80048
11220h0048J25213K6236j0554O397L4341Q3901P67m9569L2062r298M0666L3687
$$ -80048 45165 71401 60847 67244 101585 185486 186253 136684 168746 159448 200114 233801
11208B33801J19913P0754Q8260j53844r3875L6083n908J56295K63604M23526O06967
$$ 233801 353714 424468 512728 358884 265009 301092 295184 451479 715083 1138609 1745576
11197A745576P95839O71460J97211J0191k13587n45316p50883o62882l48352k31694
$$ 1745576 2541415 3212875 3410086 3420277 3206690 2661374 1910491 1247609 899257 667563
11187F67563j98530n6229j9040k5814N5053n6696l6475j18373j19631K8037L6382
$$ 667563 469033 412804 393764 367950 423003 366307 329832 211459 91828 119865 156247
11176A56247J2546M0385o4786q339J9724j2283j32988m8091J3712M6728m8774
$$ 156247 168793 209178 144392 136053 155777 143494 10506 -37585 -23873 22855 -25919
11165b5919O8979L5543N278K6690p0497k8447j4241J0837N5602n2496j17901q9027
$$ -25919 43060 78603 83881 110571 40074 11627 -2614 8223 63825 11329 -106572 -195599
11153a95599K3123O1893O6346M8364k6235R7913n7266n5915m6453j5909P5765
$$ -195599 -172476 -110583 -44237 4127 -22108 75805 18539 -37376 -83829 -99738 -23973
11142b3973M8901N7598k9269j03694n7840J45983L0256m7950o95p56J26702J47556
$$ -23973 24928 82526 53257 -50437 -108277 37706 67962 20012 19317 18561 145263 292819
11130B92819p7026l9025l9676N8186K8218L9521N1080q0139p1572M4912j13011
$$ 292819 215793 176768 137092 195278 223496 263017 314097 233958 162386 207298 94287
11119I4287j89900p6807o0187N5167N7281P6622j342K0983J9411L2955o2600r7154
$$ 94287 -95613 -172420 -232607 -177440 -120159 -43537 -44879 -23896 -4485 28470 -34130 -131284
11107a31284K0679L5218O2168J16117R159m315j08610N0038P4521o3548K0041
$$ -131284 -110605 -75387 -13219 102898 112057 107742 -868 49170 123691 60143 80184
11096H0184N8994m7451p0406L3572J16304q4383J3490J7646m8944l5149j02538
$$ 80184 139178 91727 21321 54893 171197 86814 100304 117950 69006 33857 -68681
11085f8681p8009J6498J4896K0167N6542R0901q6539j26844N252Q811M1275L7030
$$ -68681 -146690 -130192 -115296 -95129 -38587 52314 -34225 -161069 -155817 -147006 -105731 -68701
11073f8701r6434j04213M8119M4611O3305J7443m4093M482R1574P3062L3758l4011
$$ -68701 -165135 -269348 -221229 -176618 -113313 -95870 -139963 -135481 -43907 29155 62913 28902
11061B8902Q321N1498N385m1282o4910q23K1037o0707m9258o590m5207p915J67812
$$ 28902 37223 88721 94106 52824 -12086 -12909 8128 -52579 -101837 -108427 -153634 -161549 6263
11048F263J55073M3320L8548N1918L5695j1305J27676L0006j07620j9839j14597
$$ 6263 161336 204656 243204 295122 330817 319512 447188 477194 369574 349735 235138
11037B35138k9944k5914N3975L07042L15567J26327p823n8412p5809j53235n0105
$$ 235138 205194 179280 233255 540297 855864 982191 974368 915956 840147 686912 636807
11026F36807J1424P4002J67390M7744J4989K41135J32596r9743j62259j67440
$$ 636807 648231 722233 889623 937367 952356 1193491 1326087 1226344 1064085 896645
11016H96645o5697r2104q2260p440N3389J41354J25772J38647j54113r6917r7861
$$ 896645 830948 738844 656584 649144 702533 843887 969659 1108306 954193 857276 759415
11005G59415j16579p5009l9508n7038m3601o1890o1036J0806O6145l594j2216
$$ 759415 642836 567827 528319 471281 427680 365790 304754 315560 381705 378111 365895
10994C65895q2477j20843o3870k5566L419J172q1526j35935K6402R2925m323J2292
$$ 365895 283418 162575 98705 73139 76558 77730 -3796 -139731 -113329 -20404 -24727 -12435
10982a2435O5270K9603K3600K7832K5507J7262J4956m4292r5958m6265q2077m4976
$$ -12435 52835 82438 106038 133870 159377 176639 191595 147303 51345 5080 -76997 -121973
10970a21973k1473J01064n339k9540N8336o4196O7756N8833k6789m5026L3683
$$ -121973 -143446 -42382 -47721 -77261 -18925 -83121 -15365 43468 16679 -28347 5336
10959E336J84391P1828m0997n0904m196J31770l034P2577K03936L27003M33549
$$ 5336 189727 261555 220558 169654 165458 297228 294194 366771 570707 897710 1331259
10948A331259O76549N26816J18379p7406J6725M6987l29556p59784o57104l60476
$$ 1331259 2007808 2534624 2653003 2575597 2592322 2639309 2309753 1549969 892865 532389
10938E32389j29651j24853k11130j06539p3160J400r5052m441O915n9355o1941
$$ 532389 402738 277885 66755 -39784 -112944 -111544 -206596 -211037 -204122 -263477 -325418
10927c25418K2779k320J9405K2701J03396R7197J52903q9824m0326K2953L7555
$$ -325418 -302639 -304959 -285554 -262853 -159457 -62260 90643 819 -39507 -16554 21001
10916B1001J16567m6517q7463m1941r1653j6401M1505Q1150j8740m0004Q9937
$$ 21001 137568 91051 3588 -38353 -130006 -146407 -104902 -23752 -42492 -82496 7441
10905G441Q7646p6134l9769n8401j13523M5819K8597J8308J8478p5115O2676j1932
$$ 7441 95087 18953 -20816 -79217 -192740 -146921 -118324 -100016 -81538 -156653 -93977 -105909
10893a05909P9798n5355L4934P3157O614r5729R7795O7554Q1825L2649q116j39396
$$ -105909 -26111 -81466 -46532 26625 33239 -62490 35305 102859 184684 217333 209217 69821
10881F9821j08508n7945r6839l5396J29766Q425j20004J19581k9328k5887Q5934
$$ 69821 -38687 -96632 -193471 -228867 -99101 -90676 -210680 -91099 -120427 -146314 -60380
10870f0380L3588j07977l9742J59916N6674j2561p558P3434q6183J3840l4274
$$ -60380 -26792 -134769 -174511 -14595 42079 29518 21960 95394 9211 23051 -11223
10859a1223j8111j14466L7853n4087o939K06466R4051j02604p0703j05359J1073
$$ -11223 -29334 -143800 -105947 -160034 -166973 39493 133544 30940 -39763 -145122 -134049
10848a34049L2230J09803J74513Q0753p3028r4118o1757N7103N3125j25773k11815
$$ -134049 -101819 7984 182497 263250 190222 96104 34347 91450 144575 18802 -193013
10837a93013j3501J02487J22996M2433l1618q2158p110J03966k6572j72486P0685
$$ -193013 -206514 -104027 18969 61402 29784 -52374 -59484 44482 17910 -154576 -83891
10826h3891o8008J50927J2078J0359R3331j19258o0645j76669j13757m4723J24155
$$ -83891 -151899 -972 11106 21465 114796 -4462 -65107 -241776 -355533 -400256 -276101
10815b76101J8446P7056l1698r6107l9009o288K6773P8359Q4738J3428M6467J759
$$ -276101 -257655 -180599 -212297 -308404 -347413 -353701 -326928 -248569 -163831 -150403 -103936 -102177
10803a02177p3012j18667j25108J30881O5868m4070O4313n79j15467l5468m624
$$ -102177 -175189 -293856 -418964 -288083 -222215 -266285 -201972 -202551 -318018 -353486 -358110
10792c58110j04311m735J21555P2591Q963K9021N4146J9256o5615m3898l6431
$$ -358110 -462421 -467156 -345601 -273010 -264047 -235026 -180880 -161624 -227239 -271137 -307568
10781c07568J5784J07945j697j16741m481p6L0549O3546J5290L6044m9565n2706
$$ -307568 -291784 -183839 -185536 -302277 -306758 -306834 -276285 -212739 -197449 -161405 -210970 -263676
10769b63676l8290r835J14363m4242r9503l1808O4618j2126N7987l119N1659M5660
$$ -263676 -301966 -311801 -197438 -241680 -341183 -372991 -308373 -320499 -262512 -265631 -213972 -168312
10757a68312o6874q1729K0037O058M6973N7106L7993j3708J8429J34263O1099
$$ -168312 -235186 -316915 -296878 -290820 -243847 -186741 -148748 -162456 -144027 -9764 51335
10746E1335p1703q218j4816P7487m7963q2699J8612O640J75800K1859j06768K2465
$$ 51335 -20368 -28586 -43402 34085 -13878 -96577 -77965 -71325 104475 126334 19566 42031
10734D2031j0289m1080L5218Q7593k9044P0407M6061k4198Q4676l6093q740n7074
$$ 42031 31742 -9338 25880 113473 84429 154836 200897 176699 261375 225282 216542 159468
10722A59468J7452n8304K568J12888R4052P2790O1546j8715p5577p8759O1049
$$ 159468 176920 118616 121184 234072 328124 400914 462460 443745 368168 289409 350458
10711C50458m6006q1561j74593J440L5013R7024O5546J3565M4981j16720N1250
$$ 350458 304452 222891 48298 49738 84751 181775 247321 260886 305867 189147 240397
10700B40397n8152L0774k1957j13491N4817m1092l0156p7876M0043L9783j38438
$$ 240397 182245 213019 191062 77571 132388 91296 61140 -16736 23307 63090 -75348
10689g5348j22128r0540N1529J1275J31678n2321p5598l1167J28558p493M4364
$$ -75348 -197476 -288016 -236487 -225212 -93534 -145855 -221453 -252620 -124062 -131555 -87191
10678h7191J74070p0424r931J05649l7305j04256L5225Q1075r0543k3831L7823
$$ -87191 86879 16455 6524 112173 74868 -29388 5837 86912 -3631 -27462 10361
10667A0361N1020r334J3565o247P5429K0186o7573o8588j31164n3605o826N374
$$ 10361 61381 52047 65612 59365 134794 154980 87407 18819 -112345 -165950 -172776 -167402
10655a67402o9645O1568R0569J58400K20806O2411l7595k2912j31144q6411j7349
$$ -167402 -237047 -175479 -84910 73490 294296 356707 319112 296200 165056 78645 61296
10644F1296J27728J61329J38776J04002Q4479L7236J38282K73424J30109J39723
$$ 61296 189024 350353 489129 593131 677610 714846 853128 1126552 1256661 1396384
10634A396384K05590L69274N13744N15762M97470M11014L69968L10219M94178
$$ 1396384 1601974 1971248 2484992 3000754 3498224 3909238 4279206 4589425 5083603
10625E083603O90888J017707J371272J762335K523076L629622N078260O911033
$$ 5083603 5774491 6792198 8163470 9925805 12448881 16078503 21156763 28067796
10617B8067796R339027J1728976J3226454J1832365O693342k72370m585831n178402
$$ 28067796 37406823 49135799 62362253 74194618 80887960 80615590 76029759 70851357
10609G0851357l067060L91105N007648J0683655J7213805K3648254K7350874K3313991
$$ 70851357 67784297 68175402 73183050 83866705 101080510 124728764 152079638 175393629
10601A75393629Q714043q984196j8568657j7936142j1796103l992153M285790
$$ 175393629 184107672 175123476 156554819 138618677 126822574 122830421 127116211
10594A27116211J3304009K2759275L1314106L4769191K5957373K809784k2574139
$$ 127116211 140420220 163179495 194493601 229262792 255220165 258029949 235455810
10587B35455810l4309936l1757977k2963261j3433881m777909L440294J1045769
$$ 235455810 201145874 169387897 146424636 132990755 128212846 131653140 142698909
10580A42698909J7161367J8534197J1004763n397513k1674055k7725945k4427832
$$ 142698909 159860276 178394473 189399236 184001723 162327668 134601723 110173891
10573A10173891j7615911j0999290n438181r51116K616733M853575M634958R28050
$$ 110173891 92557980 81558690 76120509 75169393 77786126 82639701 87274659 88202709
10565H8202709n627433j1493751j3603339j2273032r524662o913974n155180l792498
$$ 88202709 82575276 71081525 57478186 45205154 35680492 28766518 23611338 19818840
10557A9818840k836404k221436j694518j314415j189814j067784r73726q23528
$$ 19818840 16982436 14761000 13066482 11752067 10562253 9494469 8520743 7697215
10549G697215n51916m01468m19787l97345l72873k58583k34472k85686j52787
$$ 7697215 7145299 6743831 6324044 5926699 5553826 5295243 5060771 4775085 4622298
10540D622298j72087k28803p6251j37891k56806k49273j84944l1125N821j0692
$$ 4622298 4450211 4221408 4145157 4007266 3750460 3501187 3316243 3285118 3290939 3280247
10530C280247k45495j51498j08240j77619m1172l9122l241j07356n0442k1510
$$ 3280247 3034752 2883254 2775014 2597395 2556223 2517101 2513860 2406504 2356062 2334552
10520B334552l0925l8044j28386n5048o1511P5650m2995m2704j27360N138m8245
$$ 2334552 2303627 2265583 2137197 2082149 2020638 2096288 2053293 2010589 1883229 1888367 1840122
10509A840122r9789l7519J0829J04203R449o4706J2858r3405j42508q9695j35875
$$ 1840122 1740333 1702814 1713643 1817846 1827295 1762589 1775447 1682042 1539534 1449839 1313964
10498A313964O6000R9179n220r6500j2135j49482q3609o6558K3460J30600Q9688
$$ 1313964 1379964 1479143 1473923 1377423 1365288 1215806 1132197 1065639 1089099 1219699 1309387
10487A309387n123M4224n726r8108o5561J6173K9385m6940j23475j00464j1465
$$ 1309387 1304264 1348488 1342762 1244654 1179093 1195266 1224651 1177711 1054236 953772 942307
10476I42307l914O6732j01155N7896P4255n1962j00388r5568q0940J5156K2700
$$ 942307 938393 1005125 903970 961866 1036121 984159 883771 788203 707263 722419 745119
10465G45119L232m1270j2226R2315N2274L7873n757n729o1071j03851j2628N5663
$$ 745119 748351 707081 694855 787170 839444 877317 871560 865831 804760 700909 688281 743944
10453G43944J7205m317J24846L1068L9572n7240p199m4458m5295k9889O88J00643
$$ 743944 761149 756832 881678 912746 952318 895078 887879 843421 798126 768237 768925 869568
10441H69568J7015l4573m0064p6047m1367N289q5081O5571K4892j26446L7157
$$ 869568 886583 852010 811946 735899 694532 699821 614740 680311 705203 578757 615914
10430F15914J78316j3582n1839O95q9127n9057j09401p1667J23209K04919L7350
$$ 615914 794230 780648 728809 729504 640377 581320 471919 400252 523461 728380 765730
10419G65730L891J4440k0328j46016k3351j2048L6314J50445J411n8946L6498
$$ 765730 769621 784061 763733 617717 594366 582318 618632 769077 770488 711542 748040
10408G48040P0915j3459r0054o6460m6478R1493L4p067m7073R3676j9853j09601
$$ 748040 818955 805496 715442 648982 602504 693997 694031 686964 639891 733567 713714 604113
10396F04113N3799P464J3480q4150q116L2337N291L0114l7801Q2441k8257M4422
$$ 604113 657912 665376 678856 594706 586590 618927 624218 654332 616531 698972 670715 715137
10384G15137k4773n1664J61001L0378q1244O0796J3364j50443j47696Q093J8896
$$ 715137 690364 638700 799701 830079 748835 809631 822995 672552 524856 532949 551845
10373E51845O521k1991p2986J16133M1828l0493j8517l0636p696L1328q9267L9883
$$ 551845 558366 536375 463389 579522 621350 590857 572340 541704 534008 565336 476069 515952
10361E15952J5445j04395p0476Q7921j8456j47603J7234K05275k3677j04000l3549
$$ 515952 531397 427002 356526 444447 425991 278388 295622 500897 477220 373220 339671
10350C39671J08107J9268p0250p909O8683L5123k9807n4140K6280o5784r5191
$$ 339671 447778 467046 396796 388887 457570 492693 462886 408746 435026 369242 274051
10339B74051L7584Q5483K2285r2595K1989j02155M1383J81208q1019m7519j1689
$$ 274051 311635 397118 419403 326808 348797 246642 288025 469233 388214 340695 329006
10328C29006J5901P920M7081k7402m7433L1559J61860O6246r8899j11620p6363
$$ 329006 344907 352827 399908 372506 325073 356632 518492 584738 485839 374219 297856
10317B97856j6498M8206p2401p0870m1214J04801J06510J12572N2672p2291p8237
$$ 297856 281358 329564 257163 186293 145079 249880 356390 468962 521634 449343 371106
10306C71106j36223J18890J7098M202n4764k9560J6465k419r9112J08555n8587
$$ 371106 234883 353773 370871 375073 320309 290749 307214 304795 205683 314238 255651
10295B55651K5729N4853l0040q6760k3740j0553l778Q0516R566O9444r67m1865
$$ 255651 281380 336233 306193 219433 195693 185140 181362 261878 271444 340888 339921 298056
10283B98056j79064M5650J27187j90n2307l9736q9305J7097m8278j4498l1487
$$ 298056 118992 164642 291829 291639 239332 199596 110291 127388 79110 64612 33125
10272C3125P3275j1230q7373K7141M7833K2347P1084J06885M662j27256j5342
$$ 33125 106400 95170 7797 34938 82771 105118 176202 283087 287749 160493 145151
10261A45151J64227Q4592P055j8648m7478m5326M2806N0536M9206l7069m8412
$$ 145151 309378 393970 401025 382377 334899 289573 332379 382915 432121 395052 346640
10250C46640p4966Q2808n0143j05182M1299J71339m3380j84061n4706K3073O0807
$$ 346640 271674 354482 304339 199157 240456 411795 368415 184354 129648 152721 213528
10239B13528m0849q0286K5797M1033r5024m9619L8283J17877l412n8424m3514
$$ 213528 172679 92393 118190 159223 64199 14580 52863 170740 167328 108904 65390
10228F5390L6738J07776N192r8947M5313K0723o2222l2382P0012p844O7065n4863
$$ 65390 102128 209904 215096 116149 161462 182185 119963 87581 157593 149749 216814 161951
10216A61951J6293K9663j7870r5557l5937J9713J29685L3868j6202J31082L4827
$$ 161951 178244 207907 190037 94480 58543 78256 207941 241809 225607 356689 391516
10205C91516j37044r2420l1994J3133O825m2879n4684j4832k3334j4886J52255
$$ 391516 254472 162052 130058 143191 150016 107137 52453 37621 14287 -599 151656
10194A51656J55748Q7874o2438p9747l9838q0469k8152J6750K3366l5230M4014
$$ 151656 307404 395278 332840 253093 213255 132786 104634 121384 144750 109520 153534
10183A53534M3865J50929P2564p646M8020M1436J05496J2781O9002P650l2274
$$ 153534 197399 348328 420892 413246 461266 502702 608198 620979 689981 697631 665357
10172F65357r7913j09162O2869J00037K62101K39942J35487O3357J4311q6971
$$ 665357 567444 458282 521151 621188 883289 1123231 1258718 1322075 1336386 1249415
10162A249415j53623j43343q5949l160j9031Q3593J01139J70554K79798J48905
$$ 1249415 1095792 952449 866500 863340 844309 927902 1029041 1199595 1479393 1628298
10152A628298j06100k05168j51349j05278j06309N8041L5193q0169J0326P2936
$$ 1628298 1522198 1317030 1165681 1060403 954094 1012135 1047328 967159 977485 1050421
10142A050421P0506J07245L5690j04166m7914j47973o6550j15731j1489m7614
$$ 1050421 1120927 1228172 1263862 1159696 1111782 963809 897259 781528 770039 722425
10132G22425M7090j2777j99546o3464n2974n162j8838o2041l4190J6990N2230
$$ 722425 769515 756738 557192 493728 440754 435592 416754 354713 320523 337513 389743
10121C89743k3962l7960J2268q1826o2331j21514L4495J47718L6995J3729q0232
$$ 389743 365781 327821 340089 258263 195932 74418 108913 256631 293626 307355 227123
10110B27123r7113M6764m2308l2068P4983M8632m5874l5110j6696L5644k9121
$$ 227123 130010 176774 134466 102398 177381 226013 180139 145029 128333 163977 134856
10099A34856L5476M9954J1039j7554k2576l5161J9962l8382l6686o778o9389j0974
$$ 134856 170332 220286 231325 213771 191195 156034 175996 137614 100928 94150 24761 13787
10087A3787J8722J7599P7928l3238p2681k7372N2291l9891l0589J24538K6312
$$ 13787 32509 50108 128036 94798 22117 -5255 47036 7145 -23444 101094 127406
10076A27406K4731N930l6411n1390l1971k8095j0321q4567O3412M0821j0533L1750
$$ 127406 152137 158067 121656 70266 38295 10200 -121 -84688 -21276 19545 9012 40762
10064D0762J36020M5479L7180K5621R4156P4699o3077q3008k3093N4217J1195
$$ 40762 176782 222261 259441 285062 379218 453917 390840 307832 284739 338956 350151
10053C50151m8731j41419o8608r3836p9176R1934J67215J00857J04207j1342n2085
$$ 350151 301420 160001 91393 -2443 -81619 10315 177530 278387 382594 371252 319167
10042C19167k3279O1728Q2718o4615j14618n7312L8280m3940m4419n8679K1449
$$ 319167 295888 357616 440334 375719 261101 203789 242069 198129 153710 95031 116480
10031A16480L1775Q3961R3210P641K1317q5947j11754O6362N9626l4025n0944
$$ 116480 148255 232216 325426 333067 354384 268437 156683 223045 282671 248646 197702
10020A97702P0490J1032n0992J9465J7821M561m1756r3044J40944J3587m3481
$$ 197702 268192 279224 228232 247697 265518 270079 228323 135279 276223 289810 246329
10009B46329o3288o3221M3231j25796k5277J56368N3072O5386o3139J2319j7320
$$ 246329 183041 119820 163051 37255 11978 168346 221418 286804 223665 235984 218664
9998B18664k9896J12016p9856L0574N4490r5279j274m291j0290q7996o4277N887
$$ 218664 188768 300784 220928 251502 305992 210713 209439 205148 194858 106862 42585 48472
9986D8472L9038j08617O098K6275P0806J3115K7357p2701R0701J5087j13873j20399
$$ 48472 87510 -21107 -15009 11266 82072 95187 122544 49843 140544 155631 41758 -78641
9974g8641m5866O1837J84165P3878K9319q7504o3549k1044o0478Q9157K89o1103
$$ -78641 -124507 -62670 121495 195373 224692 137188 73639 52595 -7883 81274 81563 20460
9962B0460l5685N4145J2349L462j1704j2907J19071N7441N4536j0164o0127o087
$$ 20460 -15225 38920 51269 54731 43027 30120 149191 206632 261168 251004 190877 184790
9950A84790l778N8396O5483q664m4964j7796o9553j5630K0064L780K8657M5021
$$ 184790 181012 239408 304891 296227 251263 233467 163914 148284 168348 172128 200785 245806
9938B45806l8040n346J7208j6679r2059n8311J6396P6863J24786o9247K7296p9257
$$ 245806 207766 202420 219628 202949 110890 52579 68975 145838 270624 201377 228673 149416
9926A49416p7699k1484l4903l2492m360l3234J0071M5295J05837n4944l5694n6293
$$ 149416 71717 50233 15330 -17162 -21522 -54756 -44685 610 106447 51503 15809 -40484
9914d0484O522O3516j4756Q3847Q3600K7093o7633r545l1456j6073P3895Q4307
$$ -40484 -33962 29554 14798 98645 182245 209338 141705 132160 100704 84631 158526 242833
9902B42833m42m0685l8682r3088j8792N7190K8508J6684m4863P5972O4837m9685
$$ 242833 242391 201706 163024 69936 51144 108334 136842 153526 108663 184635 249472 199787
9890A99787P1218J7051J0294k5717n5479q4121k0545L2744q5701J8586j6171j18181
$$ 199787 271005 288056 298350 272633 217154 133033 112488 145232 59531 78117 61946 -56235
9878e6235P063J49432J55943P3296j12572m8574J45030l4353r5323k7144r5433
$$ -56235 -49172 100260 256203 329499 216927 168353 313383 279030 183707 156563 61130
9867F1130l3981P4518k7152J4924Q4112l3658q5431j12811j7421P8971M9514P9008
$$ 61130 27149 101667 74515 89439 173551 139893 54462 -58349 -75770 3201 52715 131723
9855A31723M7228K6743j6409l6027l1703k2970k131m1598l2089k418J17944O9627
$$ 131723 178951 205694 189285 153258 121555 98585 96454 54856 22767 20349 138293 207920
9843B07920l2453j2816R2633M1654R5085O4412j02180j43844j37708l9379L6292
$$ 207920 175467 162651 255284 296938 392023 456435 354255 210411 72703 33324 69616
9832F9616N6898O2403j3108M3610R4358J3962p7904j33112L9680M0536O1018k636
$$ 69616 126514 188917 175809 219419 313777 327739 249835 116723 156403 196939 257957 255321
9820B55321p9848K7102N9849P6719k2521k2565k6593n9986j0519L9808O182k1780
$$ 255321 175473 202575 262424 339143 316622 294057 267464 207478 196959 236767 242949 221169
9808B21169l5339n7139j4484n1364o6246Q9546P1204J03558J4139j01921j37851
$$ 221169 185830 128691 114207 62843 -3403 86143 157347 260905 275044 173123 35272
9797C5272j549J31112n1560j07913l4910J03863O6693J07729N7925M837j32002
$$ 35272 33723 164835 113275 5362 -29548 74315 141008 248737 306662 311499 179497
9786A79497n294P1283j9451J6525p1866P013k5418m5970k6114k9185R037q2056
$$ 179497 174203 245486 226035 242560 170694 177707 152289 106319 80205 51020 60057 -21999
9774b1999M8826k5857m8065N7840j3534m1717n9684R6136M987m9170k9047R9570
$$ -21999 26827 970 -47095 10745 -2789 -44506 -104190 -8054 -3067 -52237 -81284 18286
9762A8286j6506l7583M4879P5699N9846M7300K4649k7719k912R374o3302r2804
$$ 18286 1780 -35803 9076 84775 144621 191921 216570 188851 185939 195313 132011 39207
9750C9207o3779J7317M3382K6498L7904Q1615n7100j6669K5603K5825J6597Q1855
$$ 39207 -24572 -7255 36127 62625 100529 182144 125044 108375 133978 159803 176400 258255
9738B58255O036o0365p4812L4453o2938j21856M6444l8346m1320J59130l5759
$$ 258255 264291 203926 129114 163567 100629 -21227 25217 -13129 -54449 104681 68922
9727F8922o7343K3662K9632J9192N9087O1541K1096m4410m8558K9602P6990n3132
$$ 68922 1579 25241 54873 74065 133152 194693 215789 171379 122821 152423 229413 176281
9715A76281n0108M4368j12937j40195L0453L4630J7196L3920N3479N3155J23563
$$ 176281 126173 170541 57604 -82591 -52138 -17508 -312 33608 87087 140242 263805
9704B63805l5183j12038L5192n6446l2635M4791m2519j3783J5238L4051m3077
$$ 263805 228622 116584 151776 95330 62695 107486 64967 51184 66422 100473 57396
9693E7396P017m9416p888Q7087k1243Q3713k1832q8830n0770p5214J62965Q136
$$ 57396 64413 14997 7109 94196 72953 156666 134834 46004 -4766 -79980 82985 91121
9681I1121M1599k2226L0472o2811R1685j18814J2164M4421O4131m4145l1145N4350
$$ 91121 132720 110494 140966 78155 169840 51026 63190 107611 171742 127597 96452 150802
9669A50802l2979r0295L5176p5695p9745l784P5304N1288J10691o9389r3917r3396
$$ 150802 117823 27528 62704 -12991 -92736 -96520 -21216 30072 140763 71374 -22543 -115939
9657a15939M7098O7687j2573L8658o232L0300l8509J8087P2525r0281K3665M1010
$$ -115939 -68841 -1154 -13727 24931 18699 48999 10490 28577 101102 10821 34486 75496
9645G5496j02677J500J27762l4457k0029J7336p4628j21130J2124J15146J35784
$$ 75496 -27181 -25681 102081 67624 47595 64931 -9697 -130827 -118703 -3557 132227
9634A32227J08415J2657o7156k5773n3257j14402n1755M6320k8517N8586J40982
$$ 132227 240642 253299 186143 160370 107113 -7289 -59044 -12724 -41241 17345 158327
9623A58327k2077Q0372J7913j00997m1478O3664k6464k7254l1261r4433K4466
$$ 158327 136250 216622 234535 133538 92060 155724 129260 102006 70745 -23688 778
9612G78l3790m0264J4822K8435R0279k3358R2163R560l6007o5216n4422K713J11762
$$ 778 -33012 -73276 -58454 -30019 60260 36902 129065 138625 102618 37402 -17020 -14307 97455
9599I7455L6132J6358m855K5346j8880n5996j03986n5355N2916k038k3143L5980
$$ 97455 133587 149945 145090 170436 151556 95560 -8426 -63781 -10865 -12903 -36046 -66
9587f6k4772o6525O0202r7179o3325Q9755Q8147K7948L0149n6273P125K3370J7354
$$ -66 -24838 -91363 -31161 -128340 -191665 -101910 -13763 14185 44334 -11939 -4814 18556 35910
9574C5910M2069N6168J3999n5726j24536p4711l7988P6816j4301L7908M5513q79
$$ 35910 77979 134147 148146 92420 -32116 -106827 -144815 -67999 -82300 -44392 1121 242
9562B42k1728p1047m7860O2489P4949l4718j09700j3755N7653j4676j08931n2190
$$ 242 -21486 -92533 -140393 -77904 -2955 -37673 -147373 -161128 -103475 -118151 -227082 -279272
9550b79272J11751L4026n7286J01225J18956O9401j15868m8224N6028Q390m4831
$$ -279272 -167521 -133495 -190781 -89556 29400 98801 -17067 -65291 -9263 -873 -45704
9539d5704L7130K3682j1266M9965l9544n4349m0934K5116J0927O1051O4942n7484
$$ -45704 -8574 15108 3842 53807 14263 -40086 -81020 -55904 -44977 16074 81016 23532
9527B3532K3764M7869L802j4703j00604o5281Q040L6826m1570J5732J9166j07120
$$ 23532 47296 95165 98967 84264 -16340 -81621 -73581 -36755 -78325 -62593 -43427 -150547
9515a50547J777J05208P2068l4955k331j6410o2675O7602Q9266p6031k398J10954
$$ -150547 -148770 -43562 28506 -6449 -8780 -25190 -87865 -20263 69003 -7028 -9426 101528
9503A01528N9632k0007o3192J9502o1983k2237J11563J21758K7535q7621j12024
$$ 101528 161160 141153 77961 97463 35480 13243 124806 246564 274099 186478 74454
9492G4454j370r9439q326J8961K7746j5186o5377R2324M3111J2522M2652L899
$$ 74454 73084 -26355 -34681 -15720 12026 -3160 -68537 23787 66898 79420 122072 125971
9480A25971j9406r679Q7505r688l159L2674j64564p0133J9791M6267N2301J8574
$$ 125971 106565 96886 184391 174703 171544 204218 39654 -30479 -10688 35579 87880 106454
9468A06454L4250k4151p4038J28N1584R6829n0214n3231n9431K6886l1763R380
$$ 106454 140704 116553 42515 42643 94227 191056 140842 87611 28180 55066 23303 32683
9456C2683q664Q4631q6712j58112P9472J29551J4969K3827n26o2147L2256J5055
$$ 32683 24019 108650 21938 -136174 -56702 72849 87818 111645 111119 48972 81228 96283
9444I6283k8792N0685j6085l3503M0622j30823J4316O5132R6225M5880j3246k0393
$$ 96283 67491 118176 102091 68588 109210 -21613 -7297 57835 154060 199940 186694 166301
9432A66301j52216j22733O7447l8747Q7565R5840n2328j08136N1661p5337o3418
$$ 166301 14085 -108648 -41201 -79948 7617 103457 51129 -57007 -5346 -80683 -144101
9421a44101m9878P7279J41317J35231l7680L1460P7493q2687J0249M8653q7379
$$ -144101 -193979 -116700 24617 159848 122168 153628 231121 148434 158683 207336 119957
9410A19957m5564m0028j78829n4938J74809N9815j18707O5175K7012J2019n048
$$ 119957 74393 34365 -144464 -199402 -24593 35222 -83485 -18310 8702 20721 15673
9399A5673q6922m3876K5432m3803L6118K9894n348J3344m5169K3110j5048J3282
$$ 15673 -71249 -115125 -89693 -133496 -97378 -67484 -72832 -59488 -104657 -81547 -96595 -83313
9387h3313R757j4580J41959O2034j09550L912Q3936N5149k5307o2784L9629p2447
$$ -83313 -73556 -88136 53823 115857 6307 10219 94155 149304 123997 61213 100842 28395
9375B8395r3533M7329Q1864m6487j31692q9564K8037O3330p154K1583J0177P4329
$$ 28395 -65138 -17809 64055 17568 -114124 -203688 -175651 -112321 -119475 -97892 -87715 -13386
9363a3386J96678q497n035M3221p996j24952o3830n395R1870k0728N7907P727
$$ -13386 183292 174795 169760 212981 204985 80033 16203 10808 102678 81950 139857 147584
9351A47584K6638l4080O8690j29694j07532j37589M3181O4716J36805K4994R107
$$ 147584 174222 140142 208832 79138 -28394 -165983 -122802 -58086 78719 103713 112820
9340A12820Q609q0021l0247M266q8963k6880Q6613J00768k3413K4988k5797k4404
$$ 112820 121429 41408 11161 15427 -73536 -100416 -13803 86965 63552 88540 62743 38339
9328C8339K0794P0862j07032j54887O0217q960l6655L4869Q6937K8760n4126M2377
$$ 38339 59133 129995 22963 -131924 -71707 -80667 -117322 -82453 4484 33244 -20882 21495
9316B1495p4537P5058K1420r605k4662j13450P0552P1948R6406P1616j10283j34822
$$ 21495 -53042 22016 43436 33831 9169 -104281 -33729 38219 134625 206241 95958 -38864
9304c8864m0362M8448O950j04310q6544P3031J17363n5643Q4216M7903j1872j19367
$$ -38864 -79226 -30778 -23828 -128138 -214682 -141651 -24288 -79931 4285 52188 40316 -79051
9292g9051O435O4385J00963n7381l2171J00501j6494r9912p8351m7779N0027P1161
$$ -79051 -72616 -8231 92732 35351 3180 103681 87187 -12725 -91076 -138855 -88828 -17667
9280a7667o1087o9921L2545O3018J10170R892J2772m2498j71722o5885L2895o3457
$$ -17667 -78754 -148675 -116130 -53112 57058 66950 79722 37224 -134498 -200383 -167488 -230945
9268b30945r4338J63321J22224O152q0490m2589Q5196J39211k5605j82882k3948
$$ -230945 -325283 -161962 -39738 -33586 -114076 -156665 -71469 67742 42137 -140745 -164693
9257a64693j50296p3230J84265J64683M8829p4063k6874M7020l2431q9076Q3466
$$ -164693 -314989 -388219 -203954 -39271 9558 -64505 -91379 -44359 -76790 -165866 -82400
9246h2400M8301l4718n1906J66735N162m1381K8221j48826j0462J00609J6636
$$ -82400 -34099 -68817 -120723 46012 51174 9793 38014 -110812 -121274 -20665 -4029
9235d029J26977j7346n3509m1873j60771n55J58846O5138J4253j15529l2975N9430
$$ -4029 122948 105602 52093 10220 -150551 -151106 7740 72878 87131 -28398 -61373 -1943
9223a943N1177j0054q0860L4460n5032o2621J9625R5551R6767K6922Q0242N223
$$ -1943 49234 39180 -41680 -7220 -62252 -124873 -105248 -9697 87070 113992 194234 199457
9211A99457N712o7664k17620j35666j4768N7677J98993m6274m3199M8832J5544
$$ 199457 205169 137505 -80115 -215781 -230549 -172872 26121 -20153 -63352 -14520 1024
9200A024N8664m2539R5739m7892q6662K8097N9992P209n524j39707k6476L5632
$$ 1024 59688 17149 112888 64996 -21666 6431 66423 73632 68108 -71599 -98075 -62443
9188f2443J3776n2812p9956n3162K1355J5610K4024M9815M9111J07850J24438
$$ -62443 -48667 -101479 -181435 -234597 -213242 -197632 -173608 -123793 -74682 33168 157606
9177A57606K5600J0430m255j10833O560J02551k5165j56307K0115Q7147K795j2198
$$ 157606 183206 193636 189381 78548 85108 187659 162494 6187 26302 113449 116244 104046
9165A04046M4982O283R311j9999N1109n1697n4424o3787n0175j4786Q3690L8596
$$ 104046 149028 155311 164622 144623 195732 144035 89611 25824 -24351 -39137 44553 83149
9153H3149O5143K6267M2627p8104J9301N7221k7125L806j9461M1199r2639K3185
$$ 83149 148292 174559 217186 139082 158383 215604 188479 192285 172824 214023 121384 144569
9141A44569L4200N3322j05555q1611P904R8399o8540o3776R752J4072J6956N5950
$$ 144569 178769 232091 126536 44925 52829 151228 82688 18912 28664 42736 59692 115642
9129A15642j08775J8660N8946J3576j11005O366n6126q9079J9929L744O5607k1153
$$ 115642 6867 25527 84473 98049 -12956 -6590 -62716 -151795 -131866 -128122 -62515 -83668
9117h3668J13171J15261L0466j27876k0064K3963j54814p4591J55489J10055j23247
$$ -83668 29503 144764 175230 47354 27290 51253 -103561 -178152 -22663 87392 -35855
9106c5855N561n295q0082Q5550j3204j2209j4567p2946O0909J1290L2068p8272
$$ -35855 -30294 -35589 -115671 -30121 -43325 -55534 -70101 -143047 -82138 -70848 -38780 -117052
9094a17052l6509L6911M4981K8040N9037l4416j98J2695K0458P0649j6576n3002
$$ -117052 -153561 -116650 -71669 -43629 15408 -19008 -19206 -6511 13947 84596 68020 15018
9082A5018j18347J6372R483J4213K7496M0694m2596n9029j5568P6416N6677R4325
$$ 15018 -103329 -86957 -77474 -63261 -35765 4929 -37667 -96696 -112264 -35848 20829 115154
9070A15154M6242q0743n7139p3068R5783J15993L420p7688r1361l1025R3546j0376
$$ 115154 161396 80653 23514 -49554 46229 162222 165642 87954 -3407 -34432 59114 48738
9058D8738L3664n3513j02004n2817J5651Q5610R04o659J12583J36566l1016j55332
$$ 48738 82402 28889 -73115 -125932 -110281 -24671 -23767 -30426 82157 218723 187707 32375
9046C2375K491l4693J903j73756L104J50609l7922n5881J10762Q7241n1229j9474
$$ 32375 34866 173 2076 -171680 -168576 -17967 -55889 -111770 -1008 86233 35004 15530
9034A5530j55508m3545L7350J5744j9880J7286J04975P9155M0506O0199n2385
$$ 15530 -139978 -183523 -146173 -130429 -150309 -133023 -28048 51107 91613 151812 99427
9023I9427o2013k6711O8974k6320r9341j24852L4013P3940J34581J03812N2225
$$ 99427 37414 10703 79677 53357 -45984 -170836 -136823 -62883 71698 175510 227735
9012B27735K8452j10400o3967j7400J08003j9153j02554m7569K935n3728K6720
$$ 227735 256187 145787 81820 64420 172423 153270 50716 3147 6082 -47646 -20926
9001b0926j8390o3200R4670N7404m4479j18922O3521J01125m0202l0958k7010
$$ -20926 -39316 -102516 -7846 49558 5079 -113843 -50322 50803 10601 -20357 -47367
8990d7367k669Q1171j0788p7404P5435Q8323k9583r6982M0374K3993o0889K5190
$$ -47367 -50036 31135 20347 -57057 18378 106701 77118 -19864 20510 44503 -16386 8804
8978H804o7480J0591L9017Q7730p880M5198O7921k5988l4605j13248n2488l2404
$$ 8804 -58676 -48085 -9068 78662 70782 115980 183901 157913 123308 10060 -42428 -74832
8966g4832q6933P270J33453n9383j09743K2332J15788R2957j35300l8771n297
$$ -74832 -161765 -154495 -21042 -80425 -190168 -167836 -52048 40909 -94391 -133162 -138459
8955a38459n1946O2282M0751K2677n5341J2210j05024q636M5099P4736R2503k843
$$ -138459 -190405 -128123 -87372 -64695 -120036 -107826 -212850 -221486 -176387 -101651 -9148 -11991
8943a1991L0993J29671o2296p0432L1076k1934k1359M1668O1479L2231k4579j18179
$$ -11991 19002 148673 86377 15945 47021 25087 3728 45396 106875 139106 114527 -3652
8931c652p7920L7334M9918j0105r6999M4629o8346j05211L7170J31783O6576K3747
$$ -3652 -81572 -44238 5680 -4425 -101424 -56795 -125141 -230352 -193182 -61399 5177 28924
8919B8924R9960M477j24565l9322L5549P7861m7693n010p8286m6418l5127p2061
$$ 28924 128884 133361 8796 -30526 5023 82884 35191 30181 -48105 -94523 -129650 -201711
8907b01711P984L5348O2253L0550o0748n1166J82749J33543k23929j04825J85663
$$ -201711 -193727 -158379 -96126 -65576 -126324 -177490 5259 138802 -85127 -189952 -4289
8896d289N9242m8650M4658l842J1459J61536l030j4280n669K1273l4070P5616
$$ -4289 54953 6303 50961 47119 58578 220114 217084 202804 197135 218408 184338 259954
8884B59954k0796q3278l1383L5362P1064r0205m5285j26124j27466L3939O8121
$$ 259954 239158 155880 124497 159859 230923 140718 95433 -30691 -158157 -124218 -56097
8873e6097N1282K5067J7250P4912n9409q4951P0623N3826k7301l3310J40753K5382
$$ -56097 -4815 20252 37502 112414 53005 -31946 38677 92503 65202 31892 172645 198027
8861A98027J8691j21189p6057J0941L0760k1415l4456J46230k5145j27403M0669
$$ 198027 216718 95529 19472 30413 61173 39758 5302 151532 126387 -1016 39653
8850C9653n3015k5342M1260K0485K9670p3278n5318O6421n5877l9569K6616Q5479
$$ 39653 -13362 -38704 2556 23041 52711 -20567 -75885 -9464 -65341 -104910 -78294 7185
8838G185k079n1356L2954L8057J7317j79668J3895J08048o5084o2301m2149L978
$$ 7185 5106 -46250 -13296 24761 42078 -137590 -123695 -15647 -80731 -143032 -185181 -181203
8826a81203L7233l0487m0892L9338P6616R6041J20485K8086j49666p2820P5481
$$ -181203 -143970 -174457 -215349 -176011 -99395 -3354 117131 145217 -4449 -77269 -1788
8815a788M8915J695R568K4573l1563J21581J5537p5935l0399j0841r3119m362
$$ -1788 47127 48822 58390 82963 51400 172981 188518 112583 82184 71343 -21776 -26138
8803b6138r660N0531Q083M1231p740m6808j19642n6837R6786n1519K185Q7368
$$ -26138 -35798 14733 22816 64047 56307 9499 -110143 -166980 -70194 -121713 -119528 -32160
8791c2160J05174k7783K7889k896o7183o0445j5108M5235N6092R3370O625k7992
$$ -32160 73014 45231 73120 70224 3041 -57404 -72512 -27277 28815 122185 128810 100818
8779A00818k4665r453Q6454L280m578p6721j47912j03800N8555J66852J93890
$$ 100818 76153 66700 153154 156434 151856 75135 -72777 -176577 -118022 48830 242720
8768B42720M5950l4443r6055j41943p134l4946N4595J18215J55075p772M655j45887
$$ 242720 288670 254227 158172 16229 9095 -25851 28744 146959 302034 294262 298917 153030
8756A53030K9064J014o1480o3796j07828j4743K0028N4017K4597R3384P8664R2932
$$ 153030 182094 183108 121628 57832 -49996 -64739 -44711 9306 33903 127287 205951 298883
8744B98883m1588j44450j85720o1478n5178N3990M8173Q560n6597n2120O7853
$$ 298883 257295 112845 -72875 -134353 -189531 -135541 -87368 -78808 -135405 -187525 -119672
8733a19672j4672M4997Q8557O1603j9895q4410n5176k5490P9987L563K053j4360
$$ -119672 -134344 -89347 -790 60813 40918 -43492 -98668 -124158 -44171 -40608 -38555 -52915
8721e2915k0501L189K3858N5406n7424M7838l473N8011N9448L4573j04020k2143
$$ -52915 -73416 -70227 -46369 9037 -48387 -549 -4022 53989 113437 148010 43990 21847
8709B1847N6474K2076l1941o03o606m7444m8594O1457N1393q7856P1842j4035
$$ 21847 78321 100397 68456 67853 61247 13803 -34791 26666 78059 -9797 62045 48010
8697D8010L5828J1691l6603m9810j7102p6390q5545p664Q3043J04558O5952P5263
$$ 48010 83838 95529 58926 9116 -7986 -84376 -169921 -177585 -94542 10016 75968 151231
8685A51231r6803J6033K0245M6206j21110j36761n3424O5453N2530l6483m0822
$$ 151231 54428 70461 90706 136912 15802 -120959 -174383 -108930 -56400 -92883 -133705
8674a33705R5784l949j18890m8611J43759J10768k7301m5883J22381m2291j30919
$$ -133705 -37921 -41870 -160760 -209371 -65612 45156 17855 -28028 94353 52062 -78857
8663g8857l4277J0222p8388Q2385l2721n8340K3195J2494M3115O3060j4301o8987
$$ -78857 -113134 -102912 -181300 -98915 -131636 -189976 -166781 -154287 -111172 -48112 -62413 -131400
8651a31400l1487J32099Q5581J5962l7329M8181L2105m8648K765P4688l9504n1231
$$ -131400 -162887 -30788 54793 70755 33426 81607 113712 65064 67829 142517 103013 51782
8639E1782p0653m0329r0327K3263P4861m6999J6465J3269j41372O5247R2283l6997
$$ 51782 -18871 -59200 -149527 -126264 -51403 -98402 -81937 -68668 -210040 -144793 -52510 -89507
8627h9507J01984Q4410J05145n5088j42995P763M6816j41441p1838Q1097O2806
$$ -89507 12477 96887 202032 146944 3949 11712 58528 -82913 -154751 -73654 -10848
8616a0848r7884j81290p5359J94722J63914N9380M9273l6806r0859N0360L1372
$$ -10848 -108732 -290022 -365381 -170659 -6745 52635 101908 65102 -25757 24603 55975
8605E5975K6622L9319J08522R9681j25443j08903R2966r0480m8410j02608k4071
$$ 55975 82597 121916 230438 330119 204676 95773 188739 98259 49849 -52759 -76830
8594g6830J32371q8899r0257M4702r15M2095m3096Q876K9641n007k1795J0806
$$ -76830 55541 -33358 -123615 -78913 -79828 -37733 -80829 -71953 -42312 -47319 -69114 -58308
8582e8308J2360n8831j8861j05731R8786Q366J55397k3944j49408j00522n586
$$ -58308 -45948 -104779 -123640 -229371 -130585 -122219 33178 9234 -140174 -240696 -246282
8571b46282M4829Q8005O2497M6623N9854q0021R620l5599K2805m5023j24042l8944
$$ -246282 -201453 -113448 -50951 -4328 55526 -24495 -14875 -50474 -27669 -72692 -196734 -235678
8559b35678J11735J9368K888J9090L2827J20405j3971l8366J00870k6230j18682
$$ -235678 -123943 -104575 -101687 -82597 -49770 70635 56664 18298 119168 92938 -25744
8548b5744m6182l2457L9349J09795m1797P3180j3141p2013j5334R278Q0697k9697
$$ -25744 -71926 -104383 -65034 44761 2964 76144 63003 -9010 -24344 -15066 65631 35934
8536C5934M931o5780n122j4343r148n4578N7163J32698o3381q8440N9197p472
$$ 35934 40865 -24915 -30037 -44380 -53528 -108106 -50943 81755 18374 -70066 -10869 -18341
8524a8341J7678M4539o5070k0704r1310k9716J18001J46881J86685J8092j31238
$$ -18341 -663 43876 -21194 -41898 -133208 -162924 -44923 101958 288643 306735 175497
8513A75497j02556L058K1120j03242j17508M3889O4885L6956P108m3975O3977
$$ 175497 72941 75999 97119 -6123 -123631 -79742 -14857 22099 29207 -14768 49209
8502D9209O844j12789p8417K3662J54545l4509p6896l734P9675O1020j83791q7207
$$ 49209 56053 -56736 -135153 -111491 43054 8545 -68351 -72085 7590 68610 -115181 -202388
8490b02388O6771J997M5847J11897n235o4622k5263r3897p9205j0538k194J51058
$$ -202388 -135617 -133620 -87773 24124 18889 -45733 -70996 -164893 -244098 -254636 -256830 -105772
8478a05772J51355o7698k29014m9155J95959J34701l8082l3401k8240k5061J13905
$$ -105772 45583 -22115 -251129 -300284 -104325 30376 -7706 -41107 -69347 -94408 19497
8467A9497o9393l06p203J5373L4759m2184P6179L0408o9805J22019m1817k5394
$$ 19497 -49896 -50202 -57405 -42032 -7273 -49457 26722 57130 -12675 109344 67527 42133
8455D2133P373q4122k8757O6888M2254r5488k9047r239J0516N1100J04003O7374
$$ 42133 49506 -34616 -63373 3515 45769 -49719 -78766 -88005 -77489 -26389 77614 144988
8443A44988J4706O0281M2726n1375j02617o9578P3386R9897R1764N9492n8961
$$ 144988 159694 219975 262701 211326 108709 39131 112517 212414 304178 363670 304709
8432C04709m8221l5681k0424n6827J1791m0567p4895k0153n8556j48299J11230
$$ 304709 256488 220807 200383 143556 155347 114780 39885 19732 -38824 -187123 -75893
8421g5893J49331p851k4843j3331M3370K5726j85328q1530R9240P142M8657l7653
$$ -75893 73438 65587 40744 27413 70783 96509 -88819 -170349 -71109 -63967 -15310 -52963
8409e2963r9483J58775R1522p1816K8637J7098n4908n1620J34648n214m8723n7104
$$ -52963 -152446 6329 97851 26035 54672 71770 16862 -34758 99890 94676 45953 -11151
8397a1151l8048p2423O7038J36668N5188j48598m8411K3372K273R0M9013j27687
$$ -11151 -49199 -121622 -54584 82084 137272 -11326 -59737 -36365 -34092 -34002 15011 -112676
8385a12676J2274J74120o5285L9327R4693n6000q9009n2676m1098J3654n0532
$$ -112676 -100402 73718 8433 47760 142453 86453 -2556 -55232 -96330 -82676 -133208
8374a33208J3237M7478J12797l3906Q139M5406r1660p591J7058P6728p6400r0108
$$ -133208 -119971 -72493 40304 6398 14537 59943 -31717 -39308 -22250 54478 -21922 -112030
8362a12030K9438l5313M633n3800l0621J39572R0450L5402r098J7502O0840M8628
$$ -112030 -82592 -117905 -113272 -167072 -197693 -58121 32329 67731 58633 76135 136975 185603
8350A85603j46364j14862L9819P5978M5311Q346R5739j2744n9210r9107l5821
$$ 185603 39239 -75623 -35804 40174 85485 93831 189570 176826 117616 18509 -17312
8339a7312R6851K7960Q6113p4716o3633l4409M030j60588p5856l7015k3441M0090
$$ -17312 79539 107499 193612 118896 55263 20854 24884 -135704 -211560 -248575 -272016 -231926
8327b31926n2661p9329J73262J54668J15881L4609j5752m6276J9002K4037J403
$$ -231926 -284587 -363916 -190654 -35986 79895 114504 98752 52476 71478 95515 96918
8316I6918J10753N6058j04301l0573j7276j02342M7344O386j06255R520Q702j04115
$$ 96918 207671 263729 159428 128855 111579 9237 56581 62967 -43288 -33768 -25066 -129181
8304a29181j1421m7811R1963J50650J5932m1358m4468j6711k4925k2577l5769
$$ -129181 -140602 -188413 -96450 54200 70132 28774 -15694 -32405 -57330 -79907 -115676
8293a15676k8226J44198n5391j03740J6661O3205R6195J0609q6535L1096k7467
$$ -115676 -143902 296 -55095 -158835 -142174 -78969 17226 27835 -58700 -27604 -55071
8282e5071Q956n481j1547P9307Q4253p1365O533k8897k5224M5279K7834J07603
$$ -55071 -46115 -51596 -63143 16164 100417 29052 35585 6688 -18536 26743 54577 162180
8270A62180n3557k3140P2506p1515J9025l3264n1708l82j19232K8998J50049Q8359
$$ 162180 108623 85483 157989 86474 105499 72235 20527 20145 -99087 -70089 79960 168319
8258A68319J03181K7689n503l9012j81048k5232J29741k8313j22100q7359J1597
$$ 168319 271500 299189 293686 254674 73626 48394 178135 149822 27722 -59637 -48040
8247d8040P0764k0382l4632j08709k5439J51468M8212m2024j9815K0317O1738
$$ -48040 22724 2342 -32290 -140999 -166438 -14970 33242 -8782 -28597 -8280 53458
8236E3458j9438J8152P0q9816m1360J6012m1829q6839m494P1199n7911P1480R967
$$ 53458 34020 52172 52242 -37574 -78934 -62922 -104751 -191590 -196084 -124885 -182796 -111316 -101349
8223a01349N3106o7986J20618M9040M2456O2338N2630k1245n4863Q0364J06059
$$ -101349 -48243 -116229 4389 53429 95885 158223 210853 189608 134745 215109 321168
8212C21168m5059o1300J9740q5278m6566j24284o8908m8232j62476k9745J14788
$$ 321168 276109 214809 234549 149271 102705 -21579 -90487 -138719 -301195 -330940 -216152
8201b16152N0089L6892L7443K8232P3904J04677k5559j05893L8580P6480P0104
$$ -216152 -166063 -129171 -91728 -63496 10408 115085 89526 -16367 22213 98693 168797
8190A68797k5374j47102O6465m6688r8221Q9551M9251L9131q6814r8694P9468
$$ 168797 143423 -3679 62786 16098 -82123 7428 56679 95810 8996 -89698 -10230
8179a0230R5315o9528j4751n5369m9872O8500N154J28165K0185q0916q2777Q1042
$$ -10230 85085 15557 806 -54563 -104435 -35935 -30781 97384 117569 36653 -46124 34918
8167C4918J2711J02373p1894M50K6762K698L0439q2274q9431L5475K0921K1471
$$ 34918 47629 150002 78108 78558 105320 108018 138457 56183 -33248 2227 23148 44619
8155D4619M9168o93L9797k1965P128j4161k0537k1174p9663l042O9763J738m798
$$ 44619 93787 93094 132891 110926 118054 103893 83356 62182 -17481 -20523 49240 50978 46180
8142D6180j14587n7944M917P0786J42957L6099j9724j62099l9754m2963l1624
$$ 46180 -68407 -126351 -121434 -50648 92309 128408 108684 -53415 -93169 -136132 -167756
8131a67756J3381P867L333L1968q447R8013Q8596j6369k0849l9202N6689J8378
$$ -167756 -154375 -146508 -143175 -111207 -119654 -21641 66955 50586 29737 -9465 47224 65602
8119F5602k7729J9816J8336M7025K2528p3434j13403p7203J21130J4382m3041
$$ 65602 37873 57689 76025 123050 145578 72144 -41259 -118462 2668 17050 -25991
8108b5991q130K3902j888j57168N3932J82296J9787J4370k0482O475k214m9573
$$ -25991 -34121 -10219 -12107 -169275 -115343 66953 86740 101110 80628 87103 84889 35316
8096C5316l9105n3943n1694K3967J17355O3007q4516j9168Q8902J07906N771j18600
$$ 35316 -3789 -57732 -109426 -85459 31896 94903 10387 -8781 80121 188027 193798 75198
8084G5198j35809j33889Q5928J9788J46099M3697o0745m3998R7033R1192j6796
$$ 75198 -60611 -194500 -108572 -88784 57315 101012 40267 -3731 93302 184494 167698
8073A67698n4935p1593m1700p4403N5876N356P9410o677n0977j06822k8240J9252
$$ 167698 112763 41170 -530 -74933 -19057 -13701 65709 59032 8055 -98767 -127007 -107755
8061a07755K1799O9815L0961O2408j4788m7390j39407J6124J33753J87000l9810
$$ -107755 -85956 -16141 14820 77228 62440 15050 -124357 -108233 25520 212520 172710
8050A72710j02749O783l7329j2830L3691J7715j9486K1402j0016O382j04036o2010
$$ 172710 69961 76744 39415 26585 60276 77991 58505 79907 69891 76273 -27763 -89773
8038h9773M7459J3963J40437J3057r630p5903o1789N2186k803L2189q2422P135
$$ -89773 -42314 -28351 112086 125143 115513 39610 -22179 30007 27204 59393 -23029 -15894
8026a5894k3943P7486j08077k8259J99757q5040p9496k9373r6293J17491L7631
$$ -15894 -39837 37649 -70428 -98687 101070 16030 -63466 -92839 -189132 -71641 -34010
8015c4010k048m3890K9484R9763M2454L9165O6439j7038j0792j8658q4229q9433
$$ -34010 -36058 -79948 -50464 49299 91753 130918 197357 180319 169527 150869 66640 -22793
8003b2793q0526P0477l6243l6843J70225n070K7432j31150M8384J45326k5815
$$ -22793 -103319 -32842 -69085 -105928 64297 59227 86659 -44491 3893 149219 123404
7992A23404r8616J8964j8255k5180o239n4787p0688P2779J28230R4118K6045p1187
$$ 123404 24788 43752 25497 317 -5922 -60709 -131397 -58618 69612 163730 189775 118588
7980A18588n1737n8852J2723k408j5082o8235q3710q9311L8650k8252J4135J56410
$$ 118588 66851 7999 20722 18314 3232 -65003 -148713 -238024 -199374 -227626 -213491 -57081
7968e7081K3996J15616n9574j05988Q9128j3277k1649o5154l5672q299L4195l5862
$$ -57081 -33085 82531 22957 -83031 6097 -7180 -28829 -93983 -129655 -137954 -103759 -139621
7956a39621M8992o8062j0369L0622R1290O6887l8085o1412Q6912M2414J1853o5470
$$ -139621 -90629 -158691 -169060 -138438 -47148 19739 -18346 -79758 7154 49568 61421 -4049
7944d049j05134p6200j06321J46473J30915J19081O7892N6742j3849q4778q1210
$$ -4049 -109183 -185383 -291704 -145231 -14316 104765 172657 229399 215550 130772 49562
7933D9562P647L5343j10553l9644p9826k2284J01278O0768r1139J6924L8639N5596
$$ 49562 57209 92552 -18001 -57645 -137471 -159755 -58477 2291 -88848 -71924 -33285 22311
7921B2311N3470P0599L7807n0203j19307j856o9079l6696J12091n5886j4736k8900
$$ 22311 75781 146380 184187 133984 14677 12821 -56258 -92954 19137 -36749 -51485 -80385
7909h0385M5856n5829j5617O2918J5294l2343K126o008O9895j797r3402J01126
$$ -80385 -34529 -90358 -105975 -43057 -27763 -60106 -57980 -63988 5907 4110 -89292 11834
7897A1834J88060J04019R3153o1674m1868k6119p5587q0131j53927j4021J17750
$$ 11834 199894 303913 397066 335392 293524 267405 191818 111687 -42240 -56261 61489
7886F1489l671n1459k1650n360L6546N4847K8023J7126j8675N5013N9872l3929
$$ 61489 57818 6359 -15291 -20651 15895 70742 98765 115891 97216 152229 212101 178172
7874A78172L230r8042j21973K4974M4432p80p6875p5155n38N7830k0041K0901
$$ 178172 181402 83360 -38613 -13639 30793 30013 -46862 -122017 -122555 -64725 -84766 -63865
7862f3865j5068L0690P837Q5242m4082J2057R903r6733J0783J5952r5511j45782
$$ -63865 -78933 -48243 -40406 44836 754 12811 22714 -74019 -63236 -47284 -142795 -288577
7850b88577l1091P6733O4511K3255j8375n147O654M3696N8217P4555Q6077j4662
$$ -288577 -319668 -242935 -178424 -155169 -173544 -178691 -172037 -128341 -70124 4431 90508 75846
7838G5846o6305j07296p6923n6096J0746q779n1016N1650J59089J18695q464j7708
$$ 75846 9541 -97755 -174678 -230774 -220028 -228807 -279823 -228173 -69084 49611 41147 23439
7826B3439m1250n8130j7640m2922M378J24049p7488p9769r5556N5691P5844O5035
$$ 23439 -17811 -75941 -93581 -136503 -132125 -8076 -85564 -165333 -260889 -205198 -129354 -64319
7814f4319r4322Q6745K4773m7379p360J1665Q2664M4870p9796L7005k3898P9377
$$ -64319 -158641 -71896 -47123 -94502 -101862 -90197 -7533 37337 -42459 -5454 -29352 50025
7802E0025K104r4580m1429J52735m2891N3852q4792j3847j1693r4508O0177J02482
$$ 50025 52129 -42451 -83880 68855 25964 79816 -4976 -18823 -30516 -125024 -64847 37635
7790C7635J4482j76825o9947J34294J6482J515l8599j451m3722P2260m1583L1927
$$ 37635 52117 -124708 -194655 -60361 -43879 -42364 -80963 -82414 -126136 -53876 -95459 -63532
7778f3532Q0176k7243j444j860L2178l5426p724r1376M1476O3306o3004j05149
$$ -63532 16644 -10599 -12043 -13903 18275 -17151 -24875 -116251 -74775 -11469 -74473 -179622
7766a79622M4932J26632j9203p9335m4875J5413O9371J9912J7954J1652j2637
$$ -179622 -134690 -8058 -27261 -106596 -151471 -136058 -66687 -46775 -28821 -17169 -29806
7755b9806n5862L4175J06700n0616r5048j3870n5403L4291J26996K8782j80032
$$ -29806 -85668 -51493 55207 4591 -90457 -104327 -159730 -125439 1557 30339 -149693
7744a49693k2688K0671L6952J3941j3176k3342P7026Q9151R6331O5412m9794j35757
$$ -149693 -172381 -151710 -114758 -100817 -113993 -137335 -60309 28842 125173 190585 140791 5034
7732E034l3068p509k2769k2523n3681K7646j19843m6622P0988P3368p5630p56
$$ 5034 -28034 -35543 -58312 -80835 -134516 -106870 -226713 -273335 -202347 -128979 -204609 -205365
7720b05365k5713Q7228k0765m8825J6792J60329O4346m2040O445l179l5085m7706
$$ -205365 -231078 -143850 -164615 -213440 -196648 -36319 28027 -14013 -7568 -10747 -45832 -93538
7708i3538k4282K8421J3119n1161j69912O2814K25490J65537m8500l3744J4621
$$ -93538 -117820 -89399 -76280 -127441 -297353 -234539 -9049 156488 107988 74244 88865
7697H8865j2505M5352j14683l5836j27999j1256O3633k9893p0443r8015L1284
$$ 88865 76360 121712 7029 -28807 -156806 -168062 -104429 -134322 -204765 -302780 -271496
7686b71496Q5786O1068J56216q1181j10877O956R0109J13338M3811r3732j00425
$$ -271496 -185710 -124642 31574 -49607 -160484 -153528 -63419 49919 93730 -2 -100427
7675a00427n3111K692L3567J46447P1995j3571o9939j8106P1174l5806n4102n9502
$$ -100427 -153538 -150846 -117279 29168 101163 87592 17653 -453 70721 34915 -19187 -78689
7663g8689L2743j3032m8608J41371J3435k2983L2573m2137m2311j65922Q2848
$$ -78689 -45946 -58978 -107586 33785 47220 24237 56810 14673 -27638 -193560 -110712
7652a10712O6762j1521K40027N987r0571l3899j30183j08489m1048p1035J5103
$$ -110712 -43950 -55471 184556 190543 99972 66073 -64110 -172599 -213647 -284682 -269579
7641b69579J34082m7596l4177j6594N5499N4136k1491R4856j8301r7582O0590
$$ -269579 -135497 -183093 -217270 -233864 -178365 -124229 -145720 -50864 -69165 -166747 -106157
7630a06157Q059L8005J1280O5823q4850R837N5688q1291k9494J2627q5741l2733
$$ -106157 -98098 -60093 -48813 17010 -67840 -58003 -2315 -83606 -113100 -100473 -186214 -218947
7618b18947J21747P2561m2941N8074Q5716L4981n7959k5234p1063o2531r5331
$$ -218947 -97200 -24639 -67580 -9506 76210 111191 53232 27998 -43065 -105596 -200927
7607b00927N814Q9005r0026j6584K00501J65208J7174n5554q6212J5495M1435
$$ -200927 -195113 -106108 -196134 -212718 -12217 152991 170165 114611 28399 43894 85329
7596H5329p4392K0649K1744j37534L9120J6874N3119l0617n831j5362J6073N3862
$$ 85329 10937 31586 53330 -84204 -45084 -28210 24909 -5708 -11539 -26901 -10828 43034
7584D3034J59002R3606j36842j50200Q681J14446K596j02290k0773O2711j6173
$$ 43034 202036 295642 158800 8600 17281 131727 134323 32033 11260 73971 57798
7573E7798p1210o648n4446K8939J9268j15168o4420J26571L0949N810P4554m0970
$$ 57798 -13412 -20060 -74506 -45567 -26299 -141467 -205887 -79316 -48367 -42557 31997 -8973
7561h973q7006j6702j4968L7433K6668P140r4539m0905n1706L1884Q6847p679
$$ -8973 -95979 -112681 -127649 -90216 -63548 -56408 -150947 -191852 -243558 -211674 -124827 -132506
7549a32506K6071M4359q549j09906j50707M3891P6328q440n396K4458m2525J06524
$$ -132506 -106435 -62076 -70625 -180531 -331238 -287347 -211019 -219459 -224855 -200397 -242922 -136398
7537a36398N7077L3554r7860P5787L6736j3150p9631k5019j9994O0497P3512n3205
$$ -136398 -79321 -45767 -143627 -67840 -31104 -44254 -123885 -148904 -168898 -108401 -34889 -88094
7525h8094J3192k9661n9577k3356p3935k424J42393l3600K9961R9213K1624j4877
$$ -88094 -74902 -104563 -164140 -187496 -261431 -263855 -121462 -155062 -125101 -25888 -4264 -19141
7513a9141p010l205p9505P6243J24203p4814j80040j13369j18351J43199K11567
$$ -19141 -26151 -29356 -108861 -32618 91585 16771 -163269 -276638 -394989 -251790 -40223
7502d0223j6948R1671M8895K794l5528K0789O6310j19598j56837n8727L6206M5330
$$ -40223 -57171 34500 83395 86189 50661 71450 137760 18162 -138675 -197402 -161196 -115866
7490a15866P9352o2083N3723J8962m2058n9440n42M7252K0384m7893J01364N3924
$$ -115866 -36514 -98597 -44874 -25912 -67970 -127410 -127952 -80700 -60316 -108209 -6845 47079
7478D7079n2393n3331k7989r0646q6939O5050R6364n9341j3473l7608J05819J70256
$$ 47079 -5314 -58645 -86634 -177280 -264219 -199169 -102805 -162146 -175619 -213227 -107408 62848
7466F2848l2355n1271o458o9474j3992P3569R7649L1401M991k9731j73445J089
$$ 62848 30493 -20778 -27236 -96710 -110702 -37133 60516 91917 96908 67177 -106268 -105179
7454a05179m5666n4979J6882L1913P1444k0232r907J14581l3866O0199J390j18279
$$ -105179 -150845 -205824 -188942 -157029 -85585 -105817 -115724 -1143 -35009 25190 26580 -91699
7442i1699j19296O4483J60206J6270j4192r1014K9194K10023L5837j4906L1529
$$ -91699 -210995 -146512 13694 29964 15772 -75242 -46048 163975 199812 184906 216435
7431B16435k9123j63595o1227M2622k9731l547j0474Q2643l1760m7988L6713J1639
$$ 216435 187312 23717 -37510 5112 -24619 -28166 -38640 44003 12243 -35745 968 12607
7419A2607R553o6487n7651p7378J0613J36146L9360K8677n3034k1544O8891O6023
$$ 12607 22160 -44327 -101978 -179356 -168743 -32597 6763 35440 -17594 -39138 29753 95776
7407I5776j06350n1081q347p2903j1536M581l0286P0478J07140J2145L0868L3449
$$ 95776 -10574 -61655 -70002 -142905 -154441 -149860 -180146 -109668 -2528 9617 40485 73934
7395G3934j2719m9664j35329M799r570l278M3490q088k278j7501J02691J2158
$$ 73934 61215 11551 -123778 -118979 -128549 -131827 -88337 -96425 -98703 -116204 -13513 -1355
7383a355k8920p0787j02201Q322j02233M5245J11331J07389r697j01853O4233
$$ -1355 -30275 -101062 -203263 -194941 -297174 -251929 -140598 -33209 -42906 -144759 -80526
7372h0526J8474R2158J08255j34091j15056k3721Q2671j3395n480O8385j40008
$$ -80526 -62052 30106 138361 4270 -110786 -134507 -51836 -65231 -70711 -2326 -142334
7361a42334n3975J12627N895O3997L9760m2826k2782J02690L0512m7003j17766
$$ -142334 -196309 -83682 -77787 -13790 25970 -16856 -39638 63052 93564 46561 -71205
7350g1205L7082J0803j06096j19225k5406j0262Q8780M6860N0711k1201M8081
$$ -71205 -34123 -23320 -129416 -248641 -274047 -284309 -195529 -148669 -97958 -119159 -71078
7339g1078K3891L594k1253l9642l8035p8043N0368J72407J0177N2190j17484j8959
$$ -71078 -47187 -43593 -64846 -104488 -142523 -220566 -170198 2209 12386 64576 -52908 -71867
7327g1867K6851J47300O3537p3701j23020m5120k7589n8520o6885K7905n3813
$$ -71867 -45016 102284 165821 92120 -30900 -76020 -103609 -162129 -229014 -201109 -254922
7316b54922J69007M9983j1149O859P9344O584n7994q3071o5772O9716N6013k6154
$$ -254922 -85915 -35932 -47081 -40222 39122 45706 -12288 -95359 -161131 -91415 -35402 -61556
7304f1556m5187k7205m4194o0050L1045k2502l852J06767J39797n6796l0359P2232
$$ -61556 -106743 -133948 -178142 -238192 -207147 -229649 -233501 -126734 13063 -43733 -74092 -1860
7292a860N3260j9329j5836L2249L2071l0674o8022r2919k2617O8987m3042r5131
$$ -1860 51400 32071 16235 48484 80555 49881 -18141 -111060 -133677 -64690 -107732 -202863
7280b02863k035J07229M7650o6235j8755J02466J24668J15882P475K0565J0153
$$ -202863 -204898 -97669 -50019 -116254 -135009 -32543 92125 208007 215482 236047 246200
7269B46200j0688p2627p4685j00322m3159O8891J14112Q1331L5041j03009J2148
$$ 246200 235512 162885 88200 -12122 -55281 13610 127722 209053 244094 141085 153233
7258A53233M2437m7217j04944j24310o2272L6549J07469l5013K2911j08307j03654
$$ 153233 195670 148453 43509 -80801 -143073 -106524 945 -34068 -11157 -119464 -223118
7247b23118q5136m8048J03458J33206K5828Q8662K4699k7137R5355k2926l8683
$$ -223118 -308254 -356302 -252844 -119638 -93810 -5148 19551 -7586 87769 64843 26160
7236B6160m4211n6864j44078j4965O9110M7151j3124J3974l4988K0242p981n6655
$$ 26160 -18051 -74915 -218993 -233958 -164848 -117697 -130821 -116847 -151835 -131593 -139574 -196229
7224a96229L7655n0816l1728J23355Q1725N472K7386j9094q3761q5919l7241p8673
$$ -196229 -158574 -209390 -241118 -117763 -36038 -30566 -3180 -22274 -106035 -191954 -229195 -307868
7212c07868n7156P0311K2162n7307K9784J64576J62910Q2006q57j61758N3793
$$ -307868 -365024 -294713 -272551 -329858 -300074 -135498 27412 109418 108561 -53197 596
7201E96M5628J432P5034K522m0682p3360q8327L7265Q1202j08431K5266q084r6549
$$ 596 46224 47656 122690 125212 84530 11170 -77157 -39892 41310 -67121 -41855 -49939 -146488
7188a46488m8557q0603k752k8844Q1722N7151Q7773L3712P2192q0355o6936K3103
$$ -146488 -195045 -275648 -278400 -307244 -225522 -168371 -80598 -46886 25306 -55049 -121985 -98882
7176i8882Q14R208m1859j33401j54310m410R5799J11533L3099Q9762K7074P8876
$$ -98882 -98068 -88860 -130719 -264120 -418430 -422840 -327041 -215508 -182409 -92647 -65573 13303
7164A3303q672j25054o445R272n9576N2148O5027M101J5955M370j6148j35885
$$ 13303 4631 -120423 -126868 -117596 -177172 -125024 -59997 -55896 -39941 -35571 -51719 -187604
7152a87604m4870N0730L6871K5181M3001R3322j8905r2578j88966p9234m1565
$$ -187604 -232474 -181744 -144873 -119692 -76691 16631 -2274 -94852 -283818 -363052 -404617
7141d04617N9828N9529J42359P4678j03233p2959M1277J04183N5562n0219O3826
$$ -404617 -344789 -285260 -142901 -68223 -171456 -244415 -203138 -98955 -43393 -93612 -29786
7130b9786N8916j26392p6645O1091l8131R1819m2206J35374J19150j27015j79631
$$ -29786 29130 -97262 -173907 -112816 -150947 -59128 -101334 34040 153190 26175 -153456
7119a53456M1964O8058L4110o3951r6787l1105L1187K6200M4390N8477J08847
$$ -153456 -111492 -43434 -9324 -73275 -170062 -201167 -169980 -143780 -99390 -40913 67934
7108F7934l0255J06758N5581j11282m5002j4841n6488n587k8577L5331N8013j53664
$$ 67934 37679 144437 200018 88736 43734 28893 -27595 -33182 -61759 -26428 31585 -122079
7096a22079n5377r2279R272P6740O2849M7330l4237N8687P8590M5584r4243m0933
$$ -122079 -177456 -269735 -260463 -183723 -120874 -73544 -107781 -49094 29496 75080 -19163 -60096
7084f0096O996J11719J74339q090l9514n3112M1083q5708j25376j4433r7870j8406
$$ -60096 -53100 58619 232958 224868 185354 132242 173325 87617 -37759 -52192 -150062 -168468
7072a68468Q9859m5959J777M5974R7659j44457j7551L4325J0114l1988J991M4106
$$ -168468 -78609 -124568 -122791 -76817 20842 -123615 -141166 -106841 -96727 -128715 -126724 -82618
7060h2618n201j28604j5005J29958N8875O3265Q895N6629l0570j37014r3037p6671
$$ -82618 -87819 -216423 -231428 -101470 -42595 20670 29565 86194 55624 -81390 -174427 -251098
7048b51098O5290K8432J1912r8730O3782K1711K7641J6391k19q8557R9692j9349
$$ -251098 -185808 -157376 -145464 -244194 -180412 -158701 -131060 -114669 -114888 -203445 -103753 -123102
7036a23102q1829L2637K7591m0513j6159P2040P8142J00824P4909K793o1604k7171
$$ -123102 -204931 -172294 -144703 -185216 -201375 -129335 -51193 49631 124540 127333 65729 38558
7024C8558L6077l9407N339l3378K0104J4590l2865J0933j29937r7829k4906R9193
$$ 38558 74635 35228 40567 7189 27293 41883 9018 19951 -109986 -207815 -232721 -133528
7012a33528R5827j8229L5017l1645j03617m0209J14195N0120N4650K4419n2508
$$ -133528 -37701 -55930 -20913 -52558 -156175 -196384 -82189 -32069 22581 47000 -5508
7001e508p016K1322K9623j2533Q20q6714k4067L2790M7597n9924p4468J12697
$$ -5508 -12524 8798 38421 25888 26708 -60006 -84073 -51283 -3686 -63610 -138078 -25381
6989b5381j0424l5732j12236Q0036J42679J0278P6014M0594N165J31476K17710
$$ -25381 -35805 -71537 -183773 -103737 38942 49220 125234 165828 170993 302469 520179
6978E20179K48344Q8090n521k4596q0578k96849k01540o6589j27768j35727K895
$$ 520179 768523 856613 851092 826496 745918 449069 247529 180940 53172 -82555 -79660
6967g9660L0155j1302l0503l2353q747k3930p7897J14935R8177o945R153l2513
$$ -79660 -49505 -60807 -91310 -123663 -132410 -156340 -234237 -119302 -21125 -28070 -18917 -51430
6955e1430M0253J6505J60591j1843j70675m1136J8982l7412O6423J56673N2394
$$ -51430 -11177 5328 165919 154076 -16599 -57735 -38753 -76165 -9742 146931 199325
6944A99325j15337r4385k1802K100j36068K1400j4661p154J30923L9683m8391
$$ 199325 83988 -10397 -32199 -30099 -166167 -144767 -159428 -166582 -35659 4024 -44367
6933d4367l5270j02994o9245m5751j378L7973J6093j0122o032J05958P9519P2830
$$ -44367 -79637 -182631 -251876 -297627 -299005 -261032 -244939 -255061 -261093 -155135 -75616 -2786
6921b786J14225K2962O1354k0877o6691o8759k20966k15423J9304R9970N2990
$$ -2786 111439 134401 195755 174878 108187 39428 -181538 -396961 -377657 -277687 -224697
6910b24697N6478Q7458Q1255k3405j04872l5407k938n9928J5496m9904L0572R7755
$$ -224697 -168219 -80761 494 -22911 -127783 -163190 -166128 -226056 -210560 -260464 -229892 -132137
6898a32137R8659K6797j37927m9094O0399J71962K2239j20979j9534k6374o5761
$$ -132137 -33478 -6681 -144608 -193702 -133303 38659 60898 -60081 -79615 -105989 -171750
6887a71750j49123j09720J49733J55540M6255Q708M9910L4169m4610l5992N4730
$$ -171750 -320873 -430593 -280860 -125320 -79065 -70357 -20447 13722 -30888 -66880 -12150
6876a2150M107k9406l7254r1256M650L1736m9814l9970K5446O7464Q3639l8481
$$ -12150 -8043 -37449 -74703 -165959 -161309 -129573 -179387 -219357 -193911 -126447 -42808 -81289
6864h1289r7705J2463N5978O062K0806N0148K2397m009l8878L223n2232j27089
$$ -81289 -178994 -166531 -110553 -104491 -83685 -33537 -11140 -15149 -54027 -50804 -103036 -230125
6852b30125p956N9603J52270j5106j10293L3535N3578M0645q6931j42078k9557
$$ -230125 -238081 -178478 -26208 -41314 -151607 -118072 -64494 -23849 -110780 -252858 -282415
6841b82415M0919N1315J10937q4258K3372j05531j5316K6810j08352J2438M963
$$ -282415 -241496 -190181 -79244 -163502 -140130 -245661 -260977 -234167 -342519 -330081 -325118
6830c25118J49304O1383l6501o6061n8748j5228J01050O9704n5609j7692p7717
$$ -325118 -175814 -114431 -150932 -216993 -275741 -290969 -189919 -120215 -175824 -193516 -271233
6819b71233j01976J50932M7311J809k3531r2949J8304K8532L1650M3285P6530
$$ -271233 -373209 -222277 -174966 -173157 -196688 -289637 -271333 -242801 -211151 -167866 -91336
6808i1336J11529p3420q8677j09095j0716R1054M2489n2666n6369L1383L8043
$$ -91336 20193 -53227 -141904 -250999 -261715 -170661 -128172 -180838 -237207 -205824 -167781
6797a67781m0298L6671J02432L4547k0747k4451P2830j2025j72333m6385n7174
$$ -167781 -208079 -171408 -68976 -34429 -55176 -79627 -6797 -18822 -191155 -237540 -294714
6786b94714j15279M0265J39095J32493J6542j20488O5491N2975O1985m7675J0431
$$ -294714 -409993 -369728 -230633 -98140 -81598 -202086 -136595 -83620 -21635 -69310 -58879
6775e8879j47207r593o9327K7691R6603Q3774m0515Q8813P3975q6580q3489K8440
$$ -58879 -206086 -215679 -285006 -257315 -160712 -76938 -117453 -28640 45335 -41245 -124734 -96294
6763i6294m5485j23738n2223j3247O9170m5387L2745k2822O6245K0701j0072J77635
$$ -96294 -141779 -265517 -317740 -330987 -261817 -307204 -274459 -297281 -231036 -210335 -220407 -42772
6751d2772M1261j5927j47897k4442J13045Q7588j6491j40305j21498j7975J00525
$$ -42772 -1511 -17438 -165335 -189777 -76732 10856 -5635 -145940 -267438 -285413 -184888
6740a84888M7279Q6269N0464r9797l4907m2236o9772J36971K77635J47225P5115
$$ -184888 -137609 -51340 -876 -100673 -135580 -177816 -247588 -110617 167018 314243 389358
6729C89358o8314k57007n8925J01703o426Q2525p4646j20957j39500j32532k9971
$$ 389358 321044 64037 5112 106815 100389 182914 108268 -12689 -152189 -284721 -314692
6718c14692O0293N4491k1721J02499P8393J20549j1959o0702j68914o5494J9874
$$ -314692 -254399 -199908 -221629 -119130 -40737 79812 67853 7151 -161763 -227257 -207383
6707b07383j57185p7223J36852J95519j1148n3028J7671J8280Q4328m5347j37322
$$ -207383 -364568 -441791 -304939 -109420 -120568 -173596 -155925 -137645 -53317 -98664 -235986
6696b35986r9258j5819o513M1357N1881R5384Q4719r7492l8819R5631m3518j9715
$$ -235986 -335244 -351063 -357576 -316219 -264338 -168954 -84235 -181727 -220546 -124915 -168433 -188148
6684a88148m511q3194J13090J98012m7511p8194j12214K1239K0334L6751k4743
$$ -188148 -192659 -275853 -162763 35249 -12262 -90456 -202670 -181431 -161097 -124346 -149089
6673a49089o2958j5017Q1998J45602p1259j29095P7185K9551m6621J4486j1978
$$ -149089 -212047 -227064 -145066 536 -70723 -199818 -122633 -93082 -139703 -125217 -137195
6662a37195l4657J12385R0160n7031k0180O9474l299j16793m8515k129N076r6991
$$ -137195 -171852 -59467 30693 -26338 -46518 22956 19657 -97136 -145651 -147780 -142704 -239695
6650b39695n2818M5640K6740j5660J7409K4396q75Q5884R9739p1349L5110P2310
$$ -239695 -292513 -246873 -220133 -235793 -218384 -193988 -194863 -108979 -9240 -80589 -45479 26831
6638B6831M9925L8283K6945J14443J45457J39117J27006J78474K68420N89980
$$ 26831 76756 115039 141984 256427 401884 541001 668007 846481 1114901 1704881
6628A704881Q17322J241621K121558J469972j217315j994142j026721m26805p9412
$$ 1704881 2522203 3763824 5885382 7355354 6138039 4143897 3117176 2690371 2610959
6619B610959J86613M20677N60008P38349J057891J419121K272588L231222M160480
$$ 2610959 2797572 3218249 3778257 4516606 5574497 6993618 9266206 12497428 16657908
6610A6657908N783891R324957J7870710L4668261N9520597Q2899495L9686687
$$ 16657908 22441799 31766756 49637466 84305727 143826324 226725819 266412506
6603B66412506o3796135q2666371m7680175k3630795j2469408p217728n148706
$$ 266412506 202616371 119950000 72269825 48639030 36169622 28951894 23803188
6596B3803188m424385l551585k864231k285778j677702j130888r06228o39247
$$ 23803188 19378803 15827218 12962987 10677209 8999507 7868619 6962391 6323144
6588F323144m12861j77224M07157J151296J713816R97206j527000k395231j506686
$$ 6323144 5910283 5733059 6140216 7291512 9005328 10002534 8475534 6080303 4573617
6579D573617q35759m12992l19089k82684k96286l28304j84279j8331j67004j59688
$$ 4573617 3737858 3324866 3005777 2723093 2426807 2098503 1914224 1895893 1728889 1569201
6569A569201j07992L979n8923m8881m8634m3451k06262k9140J2022N6694n7572
$$ 1569201 1461209 1465188 1406265 1357384 1308750 1265299 1059037 1029897 1041919 1098613 1041041
6558A041041n2910M365Q486j44987j05570j0752R2576J61231J03332J3217j29626
$$ 1041041 988131 992496 1000982 855995 750425 739673 832249 993480 1096812 1110029 980403
6547I80403j41482N4052o8190q9715j20258j36911k5603m1309q7940J68553Q2583
$$ 980403 838921 892973 824783 735068 614810 477899 452296 410987 323047 491600 574183
6536E74183q6358k723J03988p302P710m4314j03608m2503O5194J78219k5970j79499
$$ 574183 487825 485102 589090 581788 589498 545184 441576 399073 464267 642486 616516 437017
6524D37017j58496M107L4622j1122J3657L3177L0771p9451J2286J27505J70355
$$ 437017 278521 282628 317250 306128 319785 352962 383733 304282 316568 444073 614428
6513F14428J8049j9819K2283j20782j62114O1632L247O58k7332L4612L479l9181
$$ 614428 632477 612658 634941 514159 352045 413677 416924 417582 390250 424862 428341 389160
6501C89160o8734o1683N1812L5621L2930m3762L3925p6506j6257p8929l6736p9490
$$ 389160 320426 258743 310555 346176 379106 335344 369269 292763 276506 197577 160841 81351
6489H1351k5063n772N8844L9998P6388n8058k1926j472l0899o0803j74892M4082
$$ 81351 56288 50516 109360 149358 225746 167688 145762 144290 113391 52588 -122304 -78222
6477g8222R2131o7249k3499J65846J64920P0449L5000J7368j07240p8287j156
$$ -78222 13909 -53340 -76839 89007 253927 324376 359376 376744 269504 191217 190061
6466A90061J7212m4123j09124N0997O8902L5892q4654n3186k0635K0102r7322
$$ 190061 207273 163150 54026 105023 173925 209817 125163 71977 51342 71444 -25878
6455b5878k7780p9190n7784R6816J9933K5454J73825J05763L9264j3590n6403
$$ -25878 -53658 -132848 -190632 -93816 -73883 -48429 125396 231159 270423 256833 200430
6444B00430k7880q7658j02807N9640j6579o0611n6267Q7290R9476N3214J8001
$$ 200430 172550 84892 -17915 41725 25146 -35465 -91732 -4442 95034 148248 166249
6433A66249n3372P414l0690l4313P1776K6024j7836O8184q7470n0140q8158J41170
$$ 166249 112877 120291 89601 55288 127064 153088 135252 203436 115966 65826 -22332 118838
6421A18838l9496p1405P3397M6370L9409k497L5143m4820P2631P5097q0363n4590
$$ 118838 79342 7937 81334 127704 167113 164616 199759 154939 227570 302667 222304 167714
6409A67714O7936j36899p2252p60Q9638P1582R128O7144K1672J25329k9073j06885
$$ 167714 235650 98751 26499 25739 115377 186959 196087 263231 284903 410232 381159 274274
6397B74274q383p0063m9179p091k014L0563j0152N9484R619j2681J12514j84603
$$ 274274 265891 195828 146649 139558 137544 168107 157955 217439 227058 214377 326891 142288
6385A42288j41510n8512j0267k4393O6443K2034J36432r141J4411L6089p760p1223
$$ 142288 778 -57734 -68001 -92394 -25951 -3917 132515 123374 137785 173874 166114 94891
6373I4891J28406J70904L4028m5163j34929l3537k8109p950j9283M1833n5527
$$ 94891 223297 394201 428229 383066 248137 214600 186491 178541 159258 201091 145564
6362A45564k8856k1808R4803l9046q9851L6611R7428k9467m5598q204k0302j31271
$$ 145564 116708 94900 189703 150657 60806 97417 194845 165378 119780 111576 91274 -39997
6350c9997M2620P3091o7957j3561N3554J71520n9530p3537Q1748q9884n0181L9366
$$ -39997 2623 75714 7757 -5804 47750 219270 159740 86203 167951 78067 27886 67252
6338F7252J33256j6721l8845Q454o7741N2050K7106P5171P7654j03338q6791j6574
$$ 67252 200508 183787 144942 153396 85655 137705 164811 239982 317636 214298 127507 110933
6326A10933m0835l0813J06157O8725j16839l4038M9198o8060q4332k735R1175
$$ 110933 70098 39285 145442 214167 97328 63290 112488 44428 -39904 -42639 48536
6315D8536K8940o2031R2908J33478M385m3482l381Q3845j88599j18496K3234N2081
$$ 48536 77476 15445 108353 241831 246216 202734 199353 283198 94599 -23897 -663 51418
6303E1418J7503O5213L5172o3442n2341o7554N2256J64078P1079k9714j9014L1390
$$ 51418 68921 134134 169306 105864 53523 -14031 38225 202303 273382 243668 224654 256044
6291B56044K4835j81164j16715Q1077j35545j3079k3227k9650J16631R593j11
$$ 256044 280879 99715 -17000 64077 -71468 -84547 -107774 -137424 -20793 -11200 -11311
6280a1311j6406o0930p656J3054K0940K1098l5035p7970k7483J46409O3659k9062
$$ -11311 -27717 -88647 -96303 -83249 -62309 -41211 -76246 -154216 -181699 -35290 28369 -693
6268f93L1300J9659J24927J4387r400L497N588M3440n9071j36195j2806K4903
$$ -693 30607 50266 175193 189580 180180 183677 189265 232705 173634 37439 24633 49536
6256D9536J61208K9773r8716p796m1134r5554j45831n694R4070P1504J49770Q0582
$$ 49536 210744 240517 141801 134005 92871 -2683 -148514 -154208 -60138 11366 161136 241718
6244B41718q5125o7510O873M3422L600o4924l3246Q7933k7820m2398Q2432J56267
$$ 241718 156593 89083 95956 139378 142978 78054 44808 132741 104921 62523 144955 301222
6232C01222J79963J04604J71090J25123K8795Q6636l2615j42660k05337k20029
$$ 301222 481185 585789 756879 882002 910797 997433 964818 822158 616821 396792
6222C96792o0174o2911m2976m2652q8129j08916K8416m423N2470O6710l7818J5745
$$ 396792 336618 273707 230731 188079 99950 -8966 19450 15027 67497 134207 96389 112134
6210A12134N2746k1743j08654K6394R8952k0792p510J9963j90227r0476L605K3831
$$ 112134 164880 143137 34483 60877 159829 139037 131527 151490 -38737 -129213 -125608 -101777
6198a01777J7036Q878Q6858O4520N0426p5741q1464r4776p0337l876Q3868L9930
$$ -101777 -84741 -75863 10995 75515 125941 50200 -31264 -126040 -196377 -200253 -116385 -76455
6186g6455n4045j33174j7870N4014R2477R255L2632N7123l9124M0838O5201J47848
$$ -76455 -130500 -263674 -281544 -227530 -135053 -125798 -93166 -36043 -75167 -34329 30872 178720
6174A78720m4332P3692k7468k7444l2569n6840O1915L8898P6948k5507k272K3245
$$ 178720 134388 208080 180612 153168 120599 63759 125674 164572 241520 216013 213741 236986
6162B36986K1897j62605m5862R3859J14606j36971r8882J28334n9677j38321M8547
$$ 236986 258883 96278 50416 144275 258881 121910 23028 151362 91685 -46636 1911
6151A911l8847M6053R7827l7895l8914O1547m14L6774p454j19510O7464J9091
$$ 1911 -36936 9117 106944 69049 30135 91682 91268 128042 120588 1078 68542 87633
6139H7633k0586l8837R343M4546p3634n1598J2602J21326o1302o2832K8957k1213
$$ 87633 67047 28210 37553 82099 8465 -43133 -30531 90795 29493 -33339 -4382 -25595
6127b5595l0620N5621O5595K4798K2330j17541N0800j0809J4951K1574j01934
$$ -25595 -56215 -594 65001 89799 112129 -5412 45388 34579 49530 71104 -30830
6116c0830N0646j1470r6997r4277K7940K11022K35m4670N7586j16479k7102k9106
$$ -30830 19816 8346 -88651 -182928 -154988 56034 56269 11599 69185 -47294 -74396 -103502
6104a03502K0511K5491O6661N5696l7977J1995Q1642J6468J1137n2127m8069l617
$$ -103502 -82991 -57500 9161 64857 26880 38875 120517 136985 148122 95995 47926 44309
6092D4309n6542l785K7578J18703O5327k7348k5968N2967o9384k3193N1430k8167
$$ 44309 -12233 -16018 11560 130263 195590 168242 142274 195241 125857 102664 154094 125927
6080A25927o7171j09191j24847L5539L1125J2432R7556j7274j19013N9673J19022
$$ 125927 58756 -50435 -175282 -139743 -108618 -96186 1370 -15904 -134917 -75244 43778
6069D3778J62757j0611p7905o473r156m7883k1652N267J30537j360j4572j1458
$$ 43778 206535 195924 118019 111546 102390 54507 32855 38122 168659 167299 152727 141269
6057A41269n2495j8365o9490m4185j3537j1311n3483J4876N5240K4687n7702J9500
$$ 141269 88774 70409 919 -43266 -56803 -68114 -121597 -106721 -51481 -26794 -84496 -64996
6045f4996q354N8542N880J50206M6037r2845L1535M1240J4072Q3191j3960K9806
$$ -64996 -73350 -14808 -8928 141278 187315 94470 126005 167245 181317 264508 250548 280354
6033B80354M7671n3121R28k5261q6207R293m5073q4719K8864J42379M4880m4823
$$ 280354 328025 274904 275832 250571 164364 173657 128584 43865 72729 215108 259988 215165
6021B15165j55540K425R1391M5638q8324j03586j6695m0284q741L931L7255Q5975
$$ 215165 59625 62050 153441 199079 110755 7169 -9526 -49810 -58551 -54620 -17365 68610
6009F8610R2387r7950o6868m6632L8836R4161N2589o6958l246M6233n4726J6407
$$ 68610 160997 63047 -3821 -50453 -11617 82544 135133 68175 64929 111162 56436 72843
5997G2843O4369N3026l3495J8379q1397O8253k1206j70913m888M9400J01339k6101
$$ 72843 137212 190238 156743 175122 93725 161978 140772 -30141 -35029 14371 115710 89609
5985H9609j24576j5645K1942o2405K5125o8384j76j03393R5838J63231R7996Q4624
$$ 89609 -34967 -50612 -28670 -91075 -65950 -134334 -134510 -237903 -142065 21166 119162 203786
5973B03786j3859j08365j64792j32661j7091K01939j9357j22794O3819L1552l1054
$$ 203786 189927 81562 -83230 -215891 -232982 -31043 -50400 -173194 -109375 -77823 -108877
5962a08877j6076j16309l9330O8821J98781J8694j22691j00455J03964J26082
$$ -108877 -124953 -241262 -280592 -211771 -12990 5704 -116987 -217442 -113478 12604
5952A2604K2981r332J9132L4364k5675K6703m2553r4226l667M6603n349R8109
$$ 12604 35585 26253 45385 79749 54074 80777 38224 -56002 -59669 -13066 -18415 79694
5940G9694j9777o5243O1871Q6699r278n6848k3287O3460P703k7274M2609l80L7631
$$ 79694 59917 -5326 56545 143244 133966 77118 53831 117291 124994 97720 140329 139949 177580
5927A77580k7309k2228q0985j33387L1547R0095M9696L8016j9127L1466J4600
$$ 177580 150271 128043 47058 -86329 -54782 35313 85009 123025 103898 135364 149964
5916A49964k367L7828M9412q7161q8352j9745j00421R547l368n5319j277P9524
$$ 149964 147597 185425 234837 147676 59324 39579 -60842 -51295 -54663 -109982 -111259 -31735
5904c1735J08152P4894k273L954P0652N7913L299p6406j24926o016n1520j08299
$$ -31735 76417 151311 149038 152992 223644 281557 284856 208450 83524 77508 25988 -82311
5892h2311O4174J8588p4733r6801K3308M5364O0338o6903p2593l0588J24161J03432
$$ -82311 -18137 451 -74282 -171083 -147775 -102411 -42073 -108976 -181569 -212157 -87996 15436
5880A5436J01505J781o9842j54514j0383J50646R7211J26874J7446j10693q2852
$$ 15436 116941 118722 48880 -105634 -116017 34629 131840 258714 276160 165467 82615
5869H2615k6924j15145J47687M6916j44922m4646J0899n9871m7818K8767N583
$$ 82615 55691 -59454 88233 135149 -9773 -54419 -43520 -103391 -151209 -122442 -116859
5858a16859N6922o7758l3359J3914N6306j30367K9097J24554J63736P2410L7795
$$ -116859 -59937 -127695 -161054 -147140 -90834 -221201 -192104 -67550 96186 168596 206391
5847B06391M274j00367N8872L2317q5056j24589j60680M7244O2717K1149M0181
$$ 206391 210665 110298 169170 201487 116431 -8158 -168838 -121594 -58877 -37728 2453
5836B453O0313R0621K1441p3895n3859O6801o1394j4892M7136Q850K2820m2277
$$ 2453 62766 153387 174828 100933 47074 113875 52481 37589 84725 93575 116395 74118
5824G4118p1449j974J0566n8899p7994j09369K6869K9317k7827J8795J53289J07459
$$ 74118 2669 695 11261 -47638 -125632 -235001 -208132 -178815 -206642 -187847 -34558 72901
5812G2901r0255j03154J30830k520p8335P6396J8079K0898P2494K8924p3544n5207
$$ 72901 -17354 -120508 10322 7802 -70533 5863 23942 44840 117334 146258 72714 17507
5800A7507j15614l7567L8694M6830N8578N3764n5434j5450k7103K6224J06584
$$ 17507 -98107 -135674 -96980 -50150 8428 62192 6758 -8692 -35795 -9571 97013
5789I7013j4897Q10l0946L8016p1946j5139O8632J05442j18911j30779m2744j2216
$$ 97013 82116 82926 51980 89996 18050 2911 71543 176985 58074 -72705 -115449 -127665
5777a27665O9645J40048r1587j14702J05772J7778O2470m8987k069j6329j8736
$$ -127665 -58020 82028 -9559 -124261 -18489 -711 61759 12772 10703 -5626 -24362
5766b4362J8972l1373m7102n9302j5208o0185P7874J25933J1030m8107l3392o2868
$$ -24362 -5390 -36763 -83865 -143167 -158375 -218560 -140686 -14753 -3723 -51830 -85222 -148090
5754a48090N4590L8776j9042L5065l2724k720R0719p8593J19393P8241r2269m3239
$$ -148090 -93500 -54724 -73766 -38701 -71425 -74145 16574 -62019 57374 135615 43346 107
5742A07P4455L2623J40073J4592j20467j02909O9057J696J6221J22611j06757
$$ 107 74562 107185 247258 261850 141383 38474 107531 109227 125448 248059 141302
5731A41302j58098K2491j6115j31107j2879J44616R414q1953M9480P1325J1528
$$ 141302 -16796 5695 -10420 -141527 -154406 -9790 -376 -82329 -32849 38476 50004
5720E0004p4679m8849O1974q441j0990k3533O4243J06885O2444n9626o2926J8617
$$ 50004 -24675 -73524 -11550 -19991 -30981 -54514 9729 116614 179058 119432 56506 75123
5708G5123r1296o2685J57975m3731n0444K340N9893O6386j00356m5190m5615O1304
$$ 75123 -16173 -78858 79117 35386 -15058 -12718 47175 113561 13205 -31985 -77600 -16296
5696a6296O7239m045l0799J8852J14021j46290o1760J8774L0584L1448R0982N2454
$$ -16296 50943 46898 16099 34951 148972 2682 -59078 -40304 -9720 21728 112710 165164
5684A65164n243q2956r949P1890o4023r88o0182k4469j1865J6493Q069o6214o2505
$$ 165164 159921 76965 67016 138906 74883 73895 13713 -10756 -22621 -6128 1941 -64273 -126778
5671a26778N3991K1754J1261L4262K9170n5234n3837N9209N5337p6953J880K4338
$$ -126778 -72787 -51033 -39772 -5510 23660 -31574 -85411 -26202 29135 -47818 -45938 -21600
5659b1600O7661k5563o3684o4244R719P4845Q1493l8875K6153n7125j33656j5038
$$ -21600 46061 20498 -43186 -107430 -97711 -22866 58627 19752 45905 -11220 -144876 -159914
5647a59914N7531J49765m4837r7087j0530k0480L4777J32501R3095L8638J4497
$$ -159914 -102383 47382 2545 -94542 -105072 -125552 -90775 41726 134821 173459 187956
5636A87956o6414l9801J797m2841r191j6490k424R0778m9278j6010j0566m8850
$$ 187956 121542 81741 83538 40697 31506 15016 12592 103370 54092 38082 27516 -21334
5624b1334l7220m8374m4139R3800J16888K4598p6620N2314m7751j15830q590l7675
$$ -21334 -58554 -106928 -151067 -57267 59621 84219 7599 59913 12162 -103668 -112258 -149933
5612a49933o6537P200N1917l1976R6583M0559k6582n3060m1697M8992K09041L6778
$$ -149933 -216470 -209270 -157353 -189329 -92746 -52187 -78769 -131829 -173526 -124534 84507 121285
5600A21285n5594N5481N0876j34201j12854M1682J97703K207k3021J9868o1303
$$ 121285 65691 121172 172048 37847 -75007 -33325 164378 166585 143564 163432 102129
5589A02129n7091L866K7147j14771k5739L3045J7228l576j09861j17813L8897
$$ 102129 45038 48904 76051 -38720 -64459 -31414 -14186 -17762 -127623 -245436 -206539
5578b06539J33255l1096L1334p7538Q9226Q664J22882l9706n6766k8121o923O845
$$ -206539 -73284 -104380 -73046 -150584 -61358 -52694 70188 30482 -26284 -54405 -61328 -54483
5566e4483J01090n875j699R2708L0788M3289n3285j03402p69Q8233j91637l7549
$$ -54483 46607 40732 39033 131741 162529 205818 152533 49131 48362 136595 -55042 -92591
5554i2591M8003M2254n5112o7255j4006J04038M3834j15204Q401O0133r0666M727
$$ -92591 -44588 -2334 -57446 -124701 -138707 -34669 9165 -106039 -97638 -37505 -128171 -123444
5542a23444L8126R0929m30K704l5181K5392j8022n753O1307l7885k5639J07240
$$ -123444 -85318 5611 5181 7885 -27296 -1904 -19926 -25679 35628 -2257 -27896 79344
5530G9344j5105r9290j02045q2867R3550J86506O9467n0163q0497J24072L0412
$$ 79344 64239 -35051 -137096 -219963 -126413 60093 129560 79397 -1100 122972 153384
5519A53384j09211l0698N0198K3369l0940j05014P0999M5014M8959J0171P488
$$ 153384 44173 13475 63673 87042 56102 -48912 22087 67101 116060 126231 133719
5508A33719j01346J5728M3670n0809m115l368j0915m3947K0897n6912q2848P129
$$ 133719 32373 48101 91771 40962 36847 33479 22564 -21383 -486 -57398 -140246 -133117
5496a33117j5561J00007l9990l7595j796k5627n897J10195P5224L6066o4906n0164
$$ -133117 -148678 -48671 -88661 -126256 -128052 -153679 -159576 -49381 25843 61909 -2997 -53161
5484e3161J11888k7245L4221l2191J240J35317P9126m7074q3693k9316L608N8006
$$ -53161 58727 31482 65703 33512 34752 170069 249195 202121 118428 89112 92720 150726
5472A50726m9446J422j5623k2208n9894L4939k6308M9944k0379K324j02010L1128
$$ 150726 101280 102702 87079 64871 4977 39916 13608 63552 43173 45497 -56513 -25385
5460b5385j9163j4643K0515J00779L8130J0920M5464r7581M9713J9563j01344
$$ -25385 -44548 -59191 -38676 62103 100233 111153 156617 59036 108749 128312 26968
5449B6968j89741p3925Q2703O3734L0592p6487l4064j7564O5067J29506L7169
$$ 26968 -162773 -236698 -153995 -90261 -59669 -136156 -170220 -187784 -122717 6789 43958
5438D3958N3430o1882J4844N6126j19079q9764j53485l3595J71426L2603N4367
$$ 43958 97388 35506 50350 106476 -12603 -102367 -255852 -289447 -118021 -85418 -31051
5427c1051M5542M0700N0128N7845J7635j82025q0707j9887K4466m938r2783l207
$$ -31051 14491 55191 105319 163164 180799 -1226 -81933 -101820 -77354 -82292 -175075 -178282
5415a78282N4327J3738J13200J04332n7239K008P5690O0936O596m9120j18363
$$ -178282 -123955 -110217 2983 107315 50076 52084 127774 188710 195306 146186 27823
5404B7823n4068K305K763M8742k0640q7975J18677N5962j32938o9710k0189L4428
$$ 27823 -26245 -23940 -21177 27565 6925 -81050 37627 93589 -39349 -109059 -129248 -94820
5392i4820J94764R3981r3498r0859j0225l3969m2692k4157Q7901J08591k7756
$$ -94820 99944 193925 100427 9568 -657 -34626 -77318 -101475 -13574 95017 67261
5381F7261o5324k803j19036j0765M0718k0124o7789j29949M0240R5563R5436K3224
$$ 67261 1937 -866 -119902 -130667 -89949 -110073 -177862 -307811 -267571 -172008 -76572 -53348
5369e3348q5994j04547J063J03779J47570K07482L7799q4026n2234j0480r1332
$$ -53348 -139342 -243889 -242826 -139047 8523 216005 253804 169778 117544 107064 15732
5358A5732m1934J1363J32414L1877q823N02p4686O1488k2363L0785L2160N5521
$$ 15732 -26202 -14839 117575 149452 140629 141131 66445 127933 105570 136355 168515 224036
5346B24036J0646r8043j99061o4939J27401Q5074l785K5581q1397r6831j41881
$$ 224036 234682 136639 -62422 -127361 40 85114 81329 106910 25513 -71318 -213199
5335b13199l1265N9388N8758P6612l1931r4044j6663k2139M5681J67378L9277
$$ -213199 -244464 -185076 -126318 -49706 -81637 -175681 -192344 -214483 -168802 -1424 37853
5324C7853l9293r7926M3498J33457J01285q6611r9234M3531R6793l8038j7651
$$ 37853 -1440 -99366 -55868 77589 178874 92263 -6971 36560 133353 95315 77664
5313G7664k6209l6793j07264l3889Q6834K216m9022K4472p4506k7579m7127q5
$$ 77664 51455 14662 -92602 -126491 -39657 -37441 -86463 -61991 -136497 -164076 -211203 -211288
5301b11288P3660j8187l5782M0381J80287Q4630M0988j04489j68957O8149Q2320
$$ -211288 -137628 -155815 -191597 -151216 29071 113701 154689 50200 -118757 -50608 31712
5290C1712Q1323j284j40533L0925K0952k3145k9091M2108j4396Q9230N5919J0199
$$ 31712 113035 111751 -28782 2143 23095 -50 -29141 12967 -1429 87801 143720 153919
5278A53919M0912j85809j45384j3418J41293J14018q4883P557r1053j08188n995
$$ 153919 194831 9022 -136362 -149780 -8487 105531 20648 28205 -62848 -171036 -177031
5267a77031N2484J38904P6105O3692O6200l1570p6921p1522q3301M5947J3904
$$ -177031 -124547 14357 90462 154154 220354 188784 111863 40341 -42960 2987 16891
5256A6891J8700j32298m0180M2880O2139Q521n8943K2522k6406k4444P2564J5492
$$ 16891 35591 -96707 -136887 -94007 -31868 -23347 -82290 -59768 -86174 -110618 -38054 -22562
5244b2562j12270l5356P8293L7409K2451R9485j0751j1016L8600N1819J8422r823
$$ -22562 -134832 -170188 -91895 -54486 -32035 67450 56699 45683 84283 136102 154524 144701
5232A44701j95841j68761Q5363J27426l1775k4454Q4111K1575O5451k8326M8988
$$ 144701 -51140 -219901 -134538 -7112 -38887 -63341 20770 42345 107796 79470 128458
5221A28458j5840M6683j3773j06682R680l5266K5196J4148j1063q2434q954k4060
$$ 128458 112618 159301 145528 38846 48526 13260 38456 52604 41541 -40893 -49847 -73907
5209g3907r5621J03891K4112N8661l4226O4789M3499K4790j17015n1700R252N9469
$$ -73907 -169528 -65637 -41525 17136 -17090 47699 91198 115988 -1027 -52727 -43475 15994
5197A5994Q6560Q7459O078q3736j10484n9737p224O0262N0554J9695j18238O5104
$$ 15994 102554 190013 196091 112355 1871 -57866 -65090 -4828 45726 65421 -52817 12287
5185A2287m1353j03382L4326N8683k624O9940Q7724n6304m6387J03721Q1518m4637
$$ 12287 -29066 -132448 -98122 -39439 -42063 27877 115601 59297 12910 116631 198149 153512
5173A53512j0070K4395j40954o4857J7289Q3768Q973n4139o509p3459K1574O6296
$$ 153512 143442 167837 26883 -37974 -20685 63083 72056 17917 11408 -62051 -40477 25819
5161B5819N241N8594p0608j36168K2110j5980j1424Q3371k9233L3165n7672j4208
$$ 25819 31060 89654 19046 -117122 -95012 -110992 -122416 -39045 -68278 -35113 -92785 -106993
5149a06993p2707m9677M8345P5179O771P0268L1128l8405K6783J17017K2128M5156
$$ -106993 -179700 -229377 -181032 -105853 -99082 -28814 2314 -36091 -9308 107709 129837 174993
5137A74993p9755n5823l0234M9421j9038m7689M4075O3129P5665K2487K3376Q2244
$$ 174993 95238 39415 9181 58602 39564 -8125 35950 99079 174744 197231 220607 302851
5125C02851o1518m3917j40842j18881Q7711r7665j3868K1408N1714R307K5343
$$ 302851 241333 197416 56574 -62307 25404 -72261 -86129 -64721 -13007 -3700 21643
5114B1643N7084J9913n5697J2942N2023Q8809r0937r0775j5118l3294M812j7490
$$ 21643 78727 98640 42943 55885 107908 196717 105780 15005 -113 -33407 -28595 -46085
5102d6085m9934q0402j8911M1876L6277l3238M3109P2493j1120m5068O5235N3095
$$ -46085 -96019 -176421 -195332 -153456 -117179 -150417 -107308 -34815 -45935 -91003 -25768 27327
5090B7327k6804n9326j29848q7061L1576J35903J24687K9748N8718j9736K7005
$$ 27327 523 -58803 -188651 -275712 -244136 -108233 16454 46202 104920 85184 112189
5079A12189J2985l7571o027n7598r1425M3278K1839p5388m9799n236J7653k43
$$ 112189 125174 87603 81576 23978 -67447 -24169 -2330 -77718 -127517 -132753 -115100 -115343
5067a15343R3626J42784R9550q040j63188k42728p9383P7360N6651P6667N0603
$$ -115343 -21717 121067 220617 212577 49389 -193339 -272722 -195362 -138711 -62044 -11441
5056a1441K0174P4347j1885M1730M6817R764l2468o0401k3656j7131j2264J3142
$$ -11441 8733 83080 71195 112925 159742 169506 137038 76637 52981 35850 23586 36728
5044C6728p5021j0428p1275L916Q3266j0200K1135J44965J1623o7920N5938N5448
$$ 36728 -38293 -48721 -119996 -116080 -32814 -43014 -21879 123086 134709 66789 122727 178175
5032A78175K7314j26858q0210p4249j13608N2699N7608M1236L2257K4961L2339
$$ 178175 205489 78631 -1579 -75828 -189436 -136737 -79129 -37893 -5636 19325 51664
5021E1664q5476O7216k6099k6660j52170l7540O0406O3530N8157L2997O0305P1119
$$ 51664 -33812 33404 7305 -19355 -171525 -209065 -148659 -85129 -26972 6025 66330 137449
5009A37449O9968m3517j50409q1372J25445K0340r104j01163j07556n577o460
$$ 137449 207417 163900 13491 -67881 57564 77904 68800 -32363 -139919 -145496 -151956
4998a51956L4220K5179j2210M4362O771L4649j9653L4143M0662k137q2244J19922
$$ -151956 -117736 -92557 -104767 -60405 -53634 -18985 -38638 -4495 36167 34030 -48214 71708
4986G1708k792P1637j7111l1296j12965p2631l0908P7509R818N0299l3048l9789
$$ 71708 68916 140553 123442 92146 -20819 -93450 -124358 -46849 -37031 13268 -19780 -59569
4974e9569Q823j9350Q5202J4082q8066L2980K656k014L9337M7351k6190m1747
$$ -59569 -50746 -70096 15106 29188 -58878 -25898 -23242 -25256 14081 61432 35242 -6505
4962f505j1249r1246J8371J02931j48308p2211m021O9516J27419J4029o9515o513
$$ -6505 -17754 -109000 -90629 12302 -136006 -208217 -212238 -142722 -15303 -1274 -70789 -77302
4950g7302J78004O4882j06891j23105k3292j3201J52766R5212P7392k505j03842
$$ -77302 100702 165584 58693 -64412 -87704 -100905 51861 147073 224465 221960 118118
4939A18118j45486r0924J26005O8281o8379k8260K7666m6686P8147K3172Q1450
$$ 118118 -27368 -118292 7713 75994 7615 -20645 7021 -39665 38482 61654 143104
4928A43104O3889j11925o1512J9189P8717j1482o0989N0655Q9901m485J415j53586
$$ 143104 206993 95068 33556 52745 131462 119980 58991 109646 199547 195062 196477 42891
4916D2891r3020m9622j8737P8077m4969P6886Q7715n8989q8249N864Q0931j8598
$$ 42891 -50129 -99751 -118488 -40411 -85380 -8494 79221 20232 -68017 -62153 18778 180
4904A80m1765n2378J6682P818L3231K097N6542O8170J2942n7011M8547M9139K7962
$$ 180 -41585 -93963 -77281 -69463 -36232 -34135 22407 90577 103519 46508 95055 144194 172156
4891A72156R317n4359o8527j09126k2507L8832p9177q1332p1629N5204M7706j2859
$$ 172156 181473 127114 58587 -50539 -73046 -34214 -113391 -194723 -266352 -211148 -163442 -176301
4879a76301J2035N5495j127L8279J09060M6299q3759j02702m6989K8478Q3759
$$ -176301 -164266 -108771 -109898 -71619 37441 83740 -19 -102721 -149710 -121232 -37473
4868c7473o867j5284n4726J01394P8715J31k7281L3646n2414r2376L7348k7684
$$ -37473 -44340 -59624 -114350 -12956 65759 65890 38609 72255 19841 -72535 -35187 -62871
4856f2871L7484K5144j12268q5030j0673P306Q6010J29752m1006J03307n1489
$$ -62871 -25387 -243 -112511 -197541 -208214 -200908 -114898 14854 -26152 77155 25666
4845B5666k17217n7623R9274J34376R4097j21213r5578O052L9541M231N8609J2292
$$ 25666 -191551 -249174 -149900 -15524 78573 -42640 -138218 -132166 -92625 -88394 -29785 -17493
4833a7493j9247L9718k4913J7563Q2480P8676J8975j46883q4963M9440N4221p1969
$$ -17493 -36740 2978 -21935 -4372 78108 156784 175759 28876 -56087 -6647 47574 -24395
4821b4395O1977K8077m9676l7901M0414o844m960q1436j06253O8816J86640M4979
$$ -24395 37582 65659 15983 -21918 18496 11652 6692 -74744 -180997 -112181 74459 119438
4809A19438j9148K1308k3348p2641n8557j62113J18303O3252j14048J1114R3696
$$ 119438 100290 121598 98250 25609 -32948 -195061 -76758 -13506 -127554 -116440 -22744
4798b2744m642L2777m5422L1674j30568o5391K9935R1713N3611N6863q0438p9451
$$ -22744 -27386 5391 -40031 -8357 -138925 -204316 -174381 -82668 -29057 27806 -52632 -132083
4786a32083J06963R6447J02932p8811j34048L3155j8813J606Q6887Q9163L042
$$ -132083 -25120 71327 174259 95448 -38600 -5445 -24258 -22652 64235 153398 156440
4775A56440j13015q138N1811J12736J2426k5362j21932j06585k0977N5045q2122
$$ 156440 43425 35287 87098 199834 212260 186898 64966 -41619 -62596 -7551 -89673
4764h9673r0228M3537Q7358l8692j10256o5220Q8131R9170J17285q7047j57925
$$ -89673 -179901 -136364 -49006 -87698 -197954 -263174 -175043 -75873 41412 -45635 -203560
4753b03560Q3638J34033p045J64468P9070j13940j36394Q9416L9128K8715p2222
$$ -203560 -119922 14111 7066 171534 250604 136664 270 89686 128814 157529 85307
4742H5307M743j2539k6923J15893l0481j07693m0892K7949Q5448N1884n3875j27708
$$ 85307 90050 77511 50588 166481 136000 28307 -12585 15364 100812 152696 98821 -28887
4730b8887q7828M8130k0545J219Q5449r3262k9899J2796q0284k5056P9358o0125
$$ -28887 -116715 -68585 -89130 -87911 -2462 -95724 -125623 -112827 -193111 -218167 -138809 -198934
4718a98934q5810N6041l3886N9065R9476O9349n0494K73N3305L4205o9841l1418
$$ -198934 -284744 -228703 -262589 -203524 -104048 -34699 -85193 -84920 -31615 2590 -67251 -98669
4706i8669N9871k4272P6918M4025k0264J06144K2213k50829j20109J30485J00657
$$ -98669 -38798 -63070 13848 57873 37609 143753 165966 -84863 -204972 -74487 26170
4695B6170O9056M8804J5221O424p8778N0797k2135n7447j336o7145j12218J425
$$ 26170 95226 144030 159251 165675 86897 137694 115559 58112 56776 -10369 -122587 -121162
4683a21162M9552L3156L2091o3339j6654O5698Q7181k5487m0254m4121m3290K7230
$$ -121162 -71610 -38454 -6363 -69702 -86356 -20658 66523 41036 782 -43339 -86629 -59399
4671e9399R4605j649o8183j841j5583Q3867k9920n9566K7956j7541R064k5463
$$ -59399 35206 33557 -34626 -36467 -52050 31817 1897 -57669 -29713 -47254 -38190 -63653
4659f3653L4148Q646r8348l5641N4393J1412J3480q969m7921r5385l9590R8013
$$ -63653 -29505 -20859 -119207 -154848 -100455 -89043 -75563 -84532 -132453 -227838 -267428 -169415
4647a69415L9644L8997K6683J03874O18l0654m4410r2425L5911J0415q1706K1298
$$ -169415 -129771 -90774 -64091 39783 40401 9747 -34663 -127088 -91177 -80762 -162468 -141170
4635a41170M090O8907N8641k6272p3827N3624N2862j8943O7321M3479Q4854o1728
$$ -141170 -137080 -68173 -9532 -35804 -109631 -56007 -3145 -22088 45233 88712 173566 111838
4623A11838q5496j24631O739l6925R9764Q5270k4475l7010j0128K8815q9786m1759
$$ 111838 26342 -98289 -91550 -128475 -28711 56559 32084 -4926 -15054 13761 -76025 -117784
4611a17784J1528J62437q1377l7480N441j6539m5600K0737K1911j864p705M2730
$$ -117784 -106256 56181 -25196 -62676 -57235 -73774 -119374 -98637 -76726 -78590 -86295 -43565
4599d3565J0923O9101m8474K4104J15555L6211O376n6126n1378j08997j20125
$$ -43565 -32642 36459 -12015 12089 127644 163855 170231 114105 62727 -46270 -166395
4588a66395P0166K5887L456N532q5733k855k3790m1371Q4200l5818q3366J50127
$$ -166395 -96229 -70342 -66886 -61354 -147087 -149942 -173732 -215103 -130903 -166721 -250087 -99960
4576i9960k7745K8221L9635L9714n3265k5688O221N4572N478j8637Q9713J3755
$$ -99960 -127705 -99484 -59849 -20135 -73400 -99088 -92867 -38295 -32817 -51454 38259 52014
4564E2014l4241m0304o8005j3135L4018J71670R5058J14924j39927j43386k23168
$$ 52014 17773 -22531 -90536 -103671 -69653 102017 197075 311999 172072 28686 -194482
4553a94482l9288J4966m2656l1130O1350M3611P8401J51151L2231j02432j36144
$$ -194482 -233770 -218804 -261460 -292590 -231240 -187629 -109228 41923 74154 -28278 -164422
4542a64422j77522L2841J12770O2435O7706q0039J0084j3448P6102O4329N432
$$ -164422 -341944 -309103 -196333 -133898 -66192 -146231 -136147 -149595 -73493 -9164 -3732
4531c732O9142L4771j42615j14272J0125K47622J33119q4125p9970J03613L2018
$$ -3732 65410 100181 -42434 -156706 -146581 101041 234160 150035 70065 173678 205696
4520B05696l0940j01475n6360J19783J1437j04881j7786m0353o1101J10728j11332
$$ 205696 174756 73281 16921 136704 148141 43260 25474 -14879 -75980 34748 -76584
4509g6584j38021M798M469M5485R0082j47029q5424K28555J52554j8847R7737
$$ -76584 -214605 -209807 -205338 -159853 -69771 -216800 -302224 -73669 78885 60038 157775
4498A57775J5015N144J7828j79019M0983O1073l2043p7480k428P1780J16639p7031
$$ 157775 172790 177934 195762 16743 57726 118799 86756 9276 6848 78628 195267 118236
4486A18236k31617m5J27971L9054M8369l5889j17204m9021k2511Q5843J56351
$$ 118236 -113381 -113426 14545 53599 101968 66079 -51125 -100146 -122657 -36814 119537
4475A19537M3673k5236P3206j66180q8205k0514o7106m720O4190P3992p894j44433
$$ 119537 163210 137974 211180 45000 -43205 -63719 -130825 -135545 -71355 2637 -5257 -149690
4463a49690o7355K8912R7698N1787j12387j14741P4305J05943J19565P650j2359
$$ -149690 -217045 -188133 -90435 -38648 -151035 -265776 -191471 -85528 34037 41687 29328
4452B9328l9062P1036J06663N4218k208r5481n2370J08290j02814p955J2886m1173
$$ 29328 -9734 61302 167965 222183 219975 124494 72124 180414 77600 69645 82531 41358
4440D1358L844K1170n7654n0105K0562O3213J71781o9645o6995K6946k6832O006
$$ 41358 45202 66372 8718 -41387 -20825 42388 214169 144524 77529 104475 77643 83649
4428H3649m4080k3390O8562k6885j0956m2882j8533l3512O0007N1187p8816N4034
$$ 83649 39569 16179 84741 57856 46900 4018 -14515 -48027 11980 63167 -15649 38385
4416C8385M8455o1401j33536N5972K9238m5269J5128Q0954J7780q1401l7145Q4281
$$ 38385 86840 25439 -108097 -52125 -22887 -68156 -53028 27926 45706 -35695 -72840 11441
4404A1441K9352K9641k010L6456K8545J3989J1200l8566n3983j22128r203J53599
$$ 11441 40793 70434 68424 104880 133425 147414 158614 120048 66065 -56063 -65266 88333
4392H8333L6363j12829j0673Q1131N879j7452Q1133l0315j08005q3599j8828N4137
$$ 88333 124696 11867 1194 82325 88204 70752 151885 121570 13565 -70034 -88862 -34725
4380c4725J1279j1511m3811J1359Q7851N7122p7917j15677M5673Q0229j5145K2664
$$ -34725 -23446 -34957 -78768 -67409 20442 77564 -353 -116030 -70357 9872 -5273 17391
4368A7391r8523R527K2959N982J26402J24916j21849o8022k7223J565J52827J02857
$$ 17391 -81132 -71605 -48646 -42664 83738 208654 86805 18783 -8440 -6875 145952 248809
4356B48809j71783j226P2609Q164N9877r1380r1758J00260O7245o2023j33681
$$ 248809 77026 75800 148409 156573 216450 125070 33312 133572 200817 138794 5113
4345E113j59486M8327J2100l198J22630J00656J2504K5994O9294n7139L4304q6228
$$ 5113 -154373 -106046 -93946 -97144 25486 126142 138646 164640 233934 176795 211099 124871
4333A24871q3781l0830j7125P0432O5129N7804l0389L7546p0563j4061j04394
$$ 124871 41090 10260 -6865 63567 128696 186500 156111 193657 123094 109033 4639
4322D639m6330J23056o9635o7667K8178J760l7036J6848j5980m030L1761L6943
$$ 4639 -41691 81365 11730 -55937 -27759 -25999 -63035 -46187 -62167 -66197 -34436 2507
4310B507L3535N8254p0297K0700O4811Q770L0365j26438M2845M3079n9240j07051
$$ 2507 36042 94296 23999 44699 109510 118280 148645 22207 65052 108131 48891 -58160
4298e8160J0154p7875o5944L6881N3672L2635k8584k6450n5804R8915J37531J7824
$$ -58160 -48006 -125881 -191825 -154944 -101272 -68637 -97221 -123671 -179475 -80560 56971 74795
4286G4795m042K3539P6018Q8816M2570j49460j69888r9461q1700J3322J8752l7172
$$ 74795 70753 94292 170310 259126 301696 152236 -17652 -117113 -198813 -185491 -166739 -203911
4274b03911N9650P2144O6789n5865J3598R3804J656j86700K1185R8702m9920Q8611
$$ -203911 -144261 -72117 -5328 -61193 -47595 46209 47865 -138835 -117650 -18948 -68868 19743
4262A9743n793j2257k783j01039j0716P0626J82737j5492l3702o6894L3288k0030
$$ 19743 13950 1693 -1090 -102129 -112845 -42219 140518 125026 91324 24430 57718 37688
4250C7688j1408l425j3042M0984J9746n7443K7376N5634J5645j01497o7603N6197
$$ 37688 26280 22855 9813 50797 70543 13100 40476 96110 111755 10258 -57345 -1148
4238a148K6031k9151L1103j1752l9689j14064P3153J28633O1555j8583k973P5118
$$ -1148 24883 -4268 26835 15083 -24606 -138670 -65517 63116 124671 106088 103115 178233
4226A78233M7357J0379j69387j37950N8640J15761p7497m4311o829k9118o407
$$ 178233 225590 235969 66582 -71368 -12728 103033 25536 -18775 -25604 -54722 -61129
4215f1129j3650L2623R209p2699Q681M9160q0967k8278Q9976q8908P3260N9742
$$ -61129 -74779 -42156 -32947 -105646 -96965 -47805 -128772 -157050 -67074 -155982 -82722 -22980
4203b2980l7202m9739J37234J5575j10572q5357L7566J32179Q3474L6418p1507
$$ -22980 -60182 -109921 27313 42888 -67684 -153041 -115475 16704 100178 136596 65089
4192F5089r4314k9200J8573l3237L177N0959J04900k2450l1221j11771j04094
$$ 65089 -29225 -58425 -39852 -73089 -69912 -18953 85947 63497 32276 -79495 -183589
4181a83589J0259J15183K475k6858J06892L9125n1904n6775m4275J73324J76248
$$ -183589 -173330 -58147 -55672 -82530 24362 63487 11583 -45192 -89467 83857 260105
4170B60105k0805j55161j47885q5081L8807O8070l2828L3081j8223l735J305j8752
$$ 260105 239300 84139 -63746 -148827 -110020 -41950 -74778 -41697 -59920 -63655 -62350 -81102
4158h1102L0934O4078L3771Q4719n0169J4957n9959l2023N3619P3977l8289p4121
$$ -81102 -50168 13910 47681 132400 82231 97188 37229 5206 58825 132802 94513 20392
4146B0392j1874R3932l810r6425j5386P1531L049l8035N7440p2479o3562J71964
$$ 20392 8518 102450 98640 2215 -13171 58360 61409 23374 80814 8335 -55227 116737
4134A16737J12684j48889j26365M1698L8653K1275O3182N034q0485q9376N2161
$$ 116737 229421 80532 -45833 -4135 34518 55793 118975 124009 43524 -45852 6309
4123F309K4536j9573j6521n5271l0078J25335L0937o3929j01773J8733K0190L7429
$$ 6309 30845 11272 -5249 -60520 -90598 34737 65674 1745 -100028 -81295 -61105 -23676
4111b3676j5634O1552j5984L0836J37679k3814j67513j15297M2404J1810n8642
$$ -23676 -39310 22242 6258 37094 174773 150959 -16554 -131851 -89447 -77637 -136279
4100a36279q2419J0441K3431p485J03412Q0291J9599J9937m5904j91892L4141
$$ -136279 -218698 -208257 -184826 -192311 -88899 -8608 10991 30928 -14976 -206868 -172727
4089a72727O2164M5770k039k2196j118m5217P2729n8883o2078O4730J05271o8631
$$ -172727 -110563 -64793 -66832 -89028 -90146 -135363 -62634 -121517 -183595 -118865 -13594 -82225
4077h2225R1238P0681K1221N5901Q6489q8068j54925q8769p2196K6535J24928
$$ -82225 9013 79694 100915 156816 243305 155237 312 -88457 -160653 -134118 -9190
4066i190R1951N419n5382J6281k0175o4540J3730P1729o4392J6886q2505l9792
$$ -9190 82761 88180 32798 49079 28904 -35636 -21906 49823 -14569 2317 -80188 -119980
4054a19980m3993K8969J51874O4497Q3039j628n5958j23765j45589n69m494J12398
$$ -119980 -163973 -135004 16870 81367 164406 162778 106820 -16945 -162534 -163103 -167597 -55199
4042e5199M1352J9579j0291O59m7326K0384k6371n4051K0808P8973J1074o1513
$$ -55199 -13847 5732 -4559 -3900 -51226 -30842 -57213 -111264 -90456 -11483 -409 -61922
4030f1922j14657P1039J07044J8974k79K3054k2979o3037j8928n5112l6325J8887
$$ -61922 -176579 -105540 1504 20478 20199 43253 20274 -42763 -61691 -116803 -153128 -134241
4018a34241P4563J0736k4020O8559K1082k8644j4111J525l3050q1423J0910M6980
$$ -134241 -59678 -48942 -72962 -4403 16679 -11965 -26076 -24551 -57601 -139024 -128114 -81134
4006h1134l3894j01274K7513J00299l5102J41429R8154j56326n2784k475m3966
$$ -81134 -115028 -216302 -188789 -88490 -123592 17837 115991 -40335 -93119 -95594 -139560
3995a39560q546L4072J2040N4248O7534O749J153k1519j04676j44194o2449O3778
$$ -139560 -148106 -114034 -101994 -47746 19788 26537 27690 6171 -98505 -242699 -305148 -241370
3983b41370N8545M4599k850J0348R6308M8147j5339j1535J8243j15179N8702P1607
$$ -241370 -182825 -138226 -141076 -130728 -34420 13727 -1612 -13147 5096 -110083 -51381 20226
3971B0226N6966p1410m1216k1403n7681n2300J9099J9656L216K9070J42019L0244
$$ 20226 77192 5782 -35434 -56837 -114518 -166818 -147719 -128063 -124847 -95777 46242 76486
3959G6486n1770j20460J952k7568J3713j5299p1592J5883N7143j02599j2753L2048
$$ 76486 24716 -95744 -93792 -121360 -107647 -122946 -194538 -178655 -121512 -224111 -236864 -204816
3947b04816J11947M9886J2865R0235n5942k2885N7825Q711m4033J10312O7197
$$ -204816 -92869 -42983 -30118 60117 4175 -18710 39115 47826 3793 114105 181302
3936A81302n402K691J0087O6660M627j03570p1939q6774k2224k3466p1192k1111
$$ 181302 175900 178591 188678 255338 259965 156395 84456 -2318 -24542 -48008 -119200 -140311
3924a40311k4491N3091K7826R4804p260n8120j52975q2581L9079R9023J33317
$$ -140311 -164802 -111711 -83885 10919 3659 -54461 -207436 -290017 -250938 -151915 -18598
3913a8598n203j6480m9972k5454O7690M0364k731K018P5407k7374n1709q3913
$$ -18598 -23801 -40281 -90253 -115707 -48017 -7653 -10384 -8366 67041 39667 -12042 -95955
3901i5955O6423J2915K1252k6969L4956R954k6257P9960J46338r100p1376j15043
$$ -95955 -29532 -16617 4635 -22334 12622 22576 -3681 76279 222617 213517 142141 27098
3889B7098p5420l0215m8758J00037j3720l6960j11550l5580m0146M2447J68987
$$ 27098 -48322 -78537 -127295 -27258 -40978 -77938 -189488 -225068 -265214 -222767 -53780
3878e3780O7406q1746R2581M2134r1532J2861L5925Q3483L4057q1235L2575p3798
$$ -53780 13626 -68120 24461 66595 -24937 -12076 23849 107332 141389 60154 92729 18931
3866A8931J8866J08518q6046N4786O8840m9681m7398q4658n6152K4415N2944O410
$$ 18931 37797 146315 60269 115055 183895 134214 86816 2158 -53994 -29579 23365 29775
3854B9775j18955n6161K5319K4127k1853R2525J112m2657M912m2167O7882J07267
$$ 29775 -89180 -145341 -120022 -95895 -117748 -25223 -24111 -66768 -61856 -104023 -36141 71126
3842G1126k2501m4200M3326Q389j55320J3840n2108n7859m5343K7804J12895n3178
$$ 71126 48625 4425 47751 56140 -99180 -85340 -137448 -195307 -240650 -212846 -99951 -153129
3830a53129j31058M4900O4143J08688q624l9835n351q3685p6339P7320R3929K6301
$$ -153129 -284187 -239287 -175144 -66456 -75080 -114915 -120266 -203951 -280290 -202970 -109041 -82740
3818h2740m113q0795J30679j1734m0056p040L8711K04304O3642j31537j41138
$$ -82740 -86853 -167648 -36969 -48703 -88759 -95799 -57088 147216 210858 79321 -61817
3807f1817l9086P346n6952n975J23202M5966j04186l1551O934r4575L8732J60465
$$ -61817 -100903 -93557 -150509 -156484 -33282 12684 -91502 -123053 -116119 -210694 -171962 -11497
3795a1497J22968m5230P6836J16895m9268j4473k3720j82662L1915J71275p8774
$$ -11497 111471 66241 143077 259972 210704 196231 172511 -10151 21764 193039 114265
3784A14265j70331K313M9682m1031J743m147k3118Q6954K2717j37316j05905N2912
$$ 114265 -56066 -53753 -4071 -45102 -43359 -47506 -70624 16330 39047 -98269 -204174 -151262
3772a51262M9248L8262K4589M3719J01868K0798j57256m1904R4084l0225o2810
$$ -151262 -102014 -63752 -39163 4556 106424 127222 -30034 -71938 22146 -8079 -70889
3761g0889N6559R5544J11573n2326M3648P8214o7045j35964J5340l1369j14069
$$ -70889 -14330 81214 192787 140461 184109 262323 195278 59314 74654 43285 -70784
3750g0784r8282q7786P757p915J7470J18886J7939p5443m8692J12373R4502m27
$$ -70784 -169066 -256852 -249095 -257010 -239540 -120654 -102715 -178158 -226850 -114477 -19975 -20402
3738b0402K7834l5953j0425O4527o4167O002q534L6483J0665P9730K6229n9526
$$ -20402 7432 -28521 -38946 25581 -38586 -32584 -41118 -4635 6030 85760 111989 52463
3726E2463j7165J42964R0170m8281q8618r9037k1408J7036l2976l6140O8399L9718
$$ 52463 35298 178262 268432 220151 131533 32496 11088 28124 -4852 -40992 27407 67125
3714F7125o9243q9960K2736N7282L8162r21K2073o428M0821p1631q1618K5106
$$ 67125 -2118 -92078 -69342 -12060 26102 25181 47254 40826 81647 10016 -71602 -46496
3702d6496O5626m4706P8028r4935o5026Q1730J42737J0517o6122N3054J5881L3317
$$ -46496 19130 -25576 52452 -42483 -107509 -25779 116958 127475 61353 114407 130288 163605
3690A63605r4315q1053r2011o7992j4996J95813Q8934p8555n7077p0721M1415
$$ 163605 69290 -11763 -103774 -171766 -186762 9051 97985 19430 -37647 -108368 -66953
3679f6953P6806j47383L2452J27696K6750j01425l5593o2576k19j8372J9561L9395
$$ -66953 9853 -137530 -105078 22618 49368 -52057 -87650 -150226 -150445 -168817 -149256 -109861
3667a09861J15051K2990J4998m2542n5533Q4104N3114J622l3643L4348j658j8329
$$ -109861 5190 28180 43178 636 -54897 29207 82321 83943 50300 84648 82990 64661
3655F4661K1726p0784j1998k3287k7343m4946N9119P3584k5622k7696j53254J9545
$$ 64661 86387 15603 3605 -19682 -47025 -91971 -32852 40732 15110 -12586 -165840 -146295
3643a46295M3641L9226K4433k9283p5795Q5191N9507L2523r5940n8935M8574M1824
$$ -146295 -102654 -63428 -38995 -68278 -144073 -58882 625 33148 -62792 -121727 -73153 -31329
3631c1329k3659r0556M8310P6756n6892n8489L1802P0777j384k6755M6790Q9065
$$ -31329 -54988 -145544 -97234 -20478 -77370 -135859 -104057 -33280 -34664 -61419 -14629 74436
3619G4436l5205r4947R426j04898o8017M9128Q4780J9730m4887q1338R6916J33018
$$ 74436 39231 -55716 -46290 -151188 -219205 -170077 -85297 -65567 -110454 -191792 -94876 38142
3607C8142q1454j26645J16879L4867n1691J9473M7242r6650j27179J8500J73979
$$ 38142 -43312 -169957 -53078 -18211 -69902 -50429 -3187 -99837 -227016 -208516 -34537
3596c4537k747q4400L5064J12743K5896Q769j4607K8531Q588o7311m4297L4638
$$ -34537 -37284 -121684 -86620 26123 52019 60788 46181 74712 83300 15989 -28308 6330
3584F330Q6551O2629N3633r243n8338j51204q3845j379l1307O903L541n1860J18667
$$ 6330 92881 155510 209143 199900 141562 -9642 -93487 -94866 -126173 -119270 -115729 -167589 -48922
3571d8922J4611N018K96q6535N8674J33095O8870L3911j09619j40860k6046j8734
$$ -48922 -34311 -29293 -28997 -115532 -56858 76237 145107 179018 69399 -71461 -97507 -116241
3559a16241P3163N3537Q5281J714r9314o1261l4073o2800j4578J27714k0302k602
$$ -116241 -43078 10459 95740 97454 -1860 -63121 -97194 -159994 -174572 -46858 -67160 -69762
3547f9762K8239M9458l1639m8527m9749L8728J08277J13031j03652j45100J7766
$$ -69762 -41523 7935 -23704 -72231 -121980 -83252 25025 138056 34404 -110696 -92930
3536i2930J10035J4507J4921Q9027Q3343k3510k3988K5145p8168J21112J6105
$$ -92930 17105 31612 46533 135560 218903 195393 171405 196550 118382 239494 255599
3525B55599j30311j4903m158L7135J0232N74K0604M117q6849q6007J8441o443
$$ 255599 125288 110385 106227 143362 153594 154168 174772 178889 92040 6033 24474 18031
3513A8031r7972M6848j16030q196K7705M6103J12252R6225o1952M6694p8420q3708
$$ 18031 -79941 -33093 -149123 -157319 -129614 -83511 28741 124966 63014 109708 31288 -52420
3501e2420k8242l9646p2688q7485j59615J13840J47960L1114Q5015n771p6477
$$ -52420 -80662 -120308 -192996 -280481 -440096 -326256 -178296 -147182 -62167 -67938 -144415
3490a44415P4346J32844J64851L8584j26864j31248o9213K5101Q4313M2046j03319
$$ -144415 -70069 62775 227626 266210 139346 8098 -61115 -36014 48299 90345 -12974
3479a2974k8475Q195R4615M9034k8545P6442J2015q1335n7876J947O9581l588
$$ -12974 -41449 -33254 61361 110395 81850 158292 170307 88972 31096 33043 102624 99036
3467I9036O8296K4334q3517l899P8254Q0400j18857n4100p0838j23310J28549
$$ 99036 167332 191666 108149 104250 182504 262904 144047 89947 19109 -104201 24348
3456B4348J02764P5432j51678J4828L9765n8831r7212q540J50932N6120j11982
$$ 24348 127112 202544 50866 65694 105459 46628 -50584 -59124 91808 147928 35946
3445C5946j80998n3086K0980k0604N613J7005J9946J37331R2540J02809L9941
$$ 35946 -145052 -198138 -177158 -197762 -192149 -175144 -155198 -17867 74673 177482 217423
3434B17423L4639M736n0426k24690q230J9252k2254n6296p4524L3198J09250m1696
$$ 217423 252062 256798 206372 -18318 -26548 -7296 -29550 -85846 -160370 -127172 -17922 -59618
3422e9618M0263J11268j3397o9430n5150N5835O1964J9042J03846p2063j02704
$$ -59618 -19355 91913 78516 9086 -46064 9771 71735 90777 194623 122560 19856
3411A9856n9358L595O344O5544K1763j4969j44028j31073K9310L3870N2017j9839
$$ 19856 -39502 -35907 -29563 35981 57744 42775 -101253 -232326 -203016 -169146 -117129 -136968
3399a36968L723O2828N4215J4326N544Q6772J20386K9091p2504j06592j14199
$$ -136968 -133245 -70417 -16202 -1876 3668 90440 210826 239917 167413 60821 -53378
3388e3378l3218k8542k723J37514J12895j5493l7969Q2634k5253j16371j50296
$$ -53378 -86596 -115138 -117861 19653 132548 117055 79086 161720 136467 20096 -130200
3377a30200n0388j429L8742N7338K0061J0485j0760k4513L5599m4973l5480j7617
$$ -130200 -180588 -182017 -143275 -85937 -65876 -55391 -66151 -90664 -55065 -100038 -135518 -153135
3365a53135K0753O7171L4625j08905M5151P3439R3555r1857P8709l858j7912J62466
$$ -153135 -132382 -65211 -30586 -139491 -94340 -20901 72654 -19203 59506 55648 37736 200202
3353B00202r1871o8849L632J01370j02587o4028k0702J51259N7777J371R5805
$$ 200202 108331 39482 43114 144484 41897 -22131 -42833 108426 166203 167574 263379
3342B63379j9581j43816j40124j59185N4005J0093M480j5853J65689J05355l662
$$ 263379 243798 99982 -40142 -199327 -145322 -135229 -130749 -146602 19087 124442 120780
3331A20780n6543j2985o1632q6785l8919Q4487J25368J19965q6448j14764p3292
$$ 120780 64237 51252 -10380 -97165 -136084 -51597 73771 193736 107288 -7476 -80768
3320h0768k0354k9892J20476J04832J35913j6661J305k7389m4233k8531k7621
$$ -80768 -101122 -131014 -10538 94294 230207 213546 214851 187462 143229 114698 87077
3309H7077K6897q572j02799K8713P1769N702q2267j23320q3789L7583J08609Q0158
$$ 87077 113974 105402 2603 31316 103085 108787 26520 -96800 -180589 -143006 -34397 45761
3297D5761k015l7687Q689R8388p0016j56520j02771n5210M5276P7969R2078Q290
$$ 45761 43746 6059 14748 113136 43120 -113400 -216171 -271381 -226105 -148136 -56058 -47768
3285d7768J8901j3170O7047j601j16980P5295J22032K5349r0773r6178q1851Q4668
$$ -47768 -28867 -42037 25010 23409 -93571 -18276 103756 129105 38332 -57846 -139697 -55029
3273e5029J09782J15694m5134k620m7122j27913r7002O6187J09517J16614o5939
$$ -55029 54753 170447 125313 122693 75571 -52342 -149344 -83157 26360 142974 77035
3262G7035n5567K6271R2967m1049r3559L1323J7332q1537q5628N9320L8122q7438
$$ 77035 21468 47739 140706 99657 6098 37421 54753 -26784 -112412 -53092 -14970 -102408
3250a02408o001j9999L0375J05870j3777J28279K4934j25811j37473j0722K5219
$$ -102408 -108409 -128408 -98033 7837 -5940 122339 147273 21462 -116011 -126733 -101514
3239a01514O8183O7073j2747L3374p732L2666K9056j8295j73879q4596O0149N7928
$$ -101514 -33331 33742 20995 54369 46637 79303 108359 90064 -83815 -168411 -108262 -50334
3227e0334K6009p2534l3314O0145J38744p1592k34614p7672J14927J35978J6846
$$ -50334 -24325 -96859 -130173 -70028 68716 -2876 -237490 -315162 -200235 -64257 -47411
3216d7411j4761K8052R9850J5927j30121r4109J11124R4750L410l2258p2086r4544
$$ -47411 -62172 -34120 65730 81657 -48464 -142573 -31449 63301 66711 34453 -37633 -132177
3204a32177o4990K2240m6134n496K8420l1390N2107l1j4136J17o5384l3817P6241
$$ -132177 -197167 -174927 -221061 -226557 -198137 -229527 -177420 -177451 -191587 -191470 -256854 -290671 -214430
3191b14430Q6731J06878J43100j9144j17375m6503J29749P4966M7919L6044j1654
$$ -214430 -127699 -20821 122279 103135 -14240 -60743 69006 143972 191891 227935 216281
3180B16281j06779j46034j09577l3317L3349M1760J8620N6023J4294J41129J3729
$$ 216281 109502 -36532 -146109 -179426 -146077 -104317 -85697 -29674 -15380 125749 139478
3169A39478o7887L5221j0904k7955j8879p0232j4032m9177N8525j5552j05684
$$ 139478 71591 106812 95908 67953 49074 -21158 -35190 -84367 -25842 -41394 -147078
3158a47078P5736J52144J13974J1057p6567m0095p7164P8459l0342P699o2856
$$ -147078 -71342 80802 194776 205833 129266 89171 12007 90466 60124 67823 4967
3147D967l5790Q8759J649p2665l8843R0786O185l9850J3897Q0670L8982n7849
$$ 4967 -30823 57936 59585 -13080 -51923 38863 45048 5198 19095 99765 138747 80898
3135H0898k3421M9887j8737K2594j7926O6856J9683K2598K3471k6711k6524L1311
$$ 80898 57477 107364 88627 111221 93295 160151 179834 202432 225903 199192 172668 203979
3123B03979O6520P347q458L6022p0041q8118J6693r4662o1557j8979q0388J5498
$$ 203979 270499 277846 269388 305410 235369 147251 163944 69282 7725 -11254 -91642 -76144
3111g6144K0131K0038P2204Q7712J5620k0580J13998J7964j57728o4817m0697
$$ -76144 -56013 -35975 36229 123941 139561 118981 232979 250943 93215 28398 -12299
3100a2299j7658J11883K1012m8981L4992J34394J2830j05237j52938O1858O2291
$$ -12299 -29957 81926 102938 53957 88949 223343 236173 130936 -22002 39856 102147
3089A02147k8019j8060K869K1212r9533r1291R022K1229n611J33767l0127j21359
$$ 102147 74128 56068 58937 80149 -19384 -110675 -101653 -80424 -86035 47732 17605 -103754
3077a03754N105J36007P956q7293J8082r7879j48991M0549J05187J06180L4461
$$ -103754 -98649 37358 45314 -41979 -23897 -121776 -270767 -230218 -125031 -18851 15610
3066A5610p948K4099j07232l5566J30635M2822Q5625O947q1463n2896K4684m6897
$$ 15610 7662 31761 -75471 -111037 19598 62420 148045 154992 73529 20633 45317 -1580
3054a580r295Q0130J51225O9859o559k0200n622j85283j10274k8465M6037J33525
$$ -1580 -10875 69255 220480 290339 283780 263580 257958 72675 -37599 -66064 -20027 113498
3042A13498m0927j13032l877J23621o5199r4130J12698Q8948J02121l2522l4320
$$ 113498 72571 -40461 -44338 79283 14084 -80046 32652 121600 223721 191199 156879
3031A56879k7537J6026j25842k4433O495j9588P3037K9902O0598j2256l7303n445
$$ 156879 129342 145368 19526 -4907 1588 -18000 55037 84939 145537 133281 95978 90533
3019I0533o057j24960l5698j19604M1253P6284K5224N740O4428J06974J06863
$$ 90533 84476 -40484 -76182 -195786 -154533 -78249 -53025 -47285 17143 124117 230980
3008B30980N0711q1317J6312r229q0103j00731p7370R393k0347l0295P3600K1802
$$ 230980 281691 200374 216686 207457 127354 26623 -50747 -41354 -61701 -91996 -18396 3406
2996C406N6671O6325O7951J4873o8903q6923j38560n2719K7859K9052j9540R284
$$ 3406 60077 126402 194353 209226 140323 53400 -85160 -137879 -110020 -80968 -100508 -91224
2984i1224O9027j5992P3912M8914P5733K4355n5519P900K6861k4671k9304k5796
$$ -91224 -22197 -38189 35723 84637 160370 184725 129206 137106 163967 139296 109992 84196
2972H4196j62594q5438L3776J74131p2289l9609K8363J17114R816j22386k9904
$$ 84196 -78398 -163836 -130060 44071 -28218 -67827 -39464 77650 87466 -34920 -64824
2961f4824J57173M1202j409o6620k6407k4756J22749L5092N832M4420J2900p5111
$$ -64824 92349 133551 132142 65522 39115 14359 137108 172200 178032 222452 235352 160241
2949A60241n1431m6498k0704M5868J0849r7310K1212L6556P5265K4840j0151o2293
$$ 160241 108810 62312 41608 87476 98325 1015 22227 58783 134048 158888 148737 86444
2937H6444m174J7710j42017r1378j7144J26453J05945M5670j81334o2882J49187
$$ 86444 82270 99980 -42037 -133415 -150559 -24106 81839 127509 -53825 -116707 32480
2926C2480O809j00379l8104M0248l0295j57400J12779J05059p3099K8507Q1626
$$ 32480 39289 -61090 -99194 -58946 -89241 -246641 -133862 -28803 -101902 -73395 8231
2915H231q7551j5437J12083N411m7283j11562R1038K0398r4392Q6593J19168j2479
$$ 8231 -79320 -94757 17326 22737 -24546 -136108 -45070 -24672 -119064 -32471 86697 74218
2903G4218n8258M8839L0513N897j8149P22q9746L9782K5946q3696q1030j24377
$$ 74218 15960 64799 95312 101209 83060 83782 -5964 33818 59764 -23932 -104962 -229339
2891b29339m304J79620J12433q1445j07098j21278j18889J26699J71820j03114
$$ -229339 -233643 -54023 58410 -23035 -130133 -251411 -370300 -243601 -71781 -174895
2881a74895J2231R1146l3050l3708J3381M1375P514M5138p961k0209L0430K9477
$$ -174895 -162664 -71518 -104568 -138276 -124895 -83520 -76006 -30868 -38829 -59038 -28608 869
2869H69M6300p012j35488k156J09107j339o8885j2800O274L8913N2661N630l5377
$$ 869 47169 40157 -95331 -97487 11620 10281 -58604 -71404 -65130 -26217 26444 32074 -3303
2856c303M3160J9554m6918K8173q805jm3924k1305p3611o8484Q3041R8409J2466
$$ -3303 39857 59411 12493 40666 31861 31860 -12064 -33369 -106980 -175464 -92423 5986 18452
2843A8452P9394Q027n4597o8261j9020L6083Q0701K1304m0934j44539r445O0027
$$ 18452 97846 105873 51276 -16985 -36005 78 80779 102083 61149 -83390 -92835 -32808
2831c2808K7791J02418M1313k0274O0358j42134j3949J25347p9687q423M2997
$$ -32808 -5017 97401 138714 118440 178798 36664 22715 148062 68375 59952 102949
2820A02949k3011l3928R164P3557j4393m6017n0961o201p9395j48244J4487M630
$$ 102949 79938 46010 55174 128731 114338 68321 17360 11159 -68236 -216480 -201993 -197363
2808a97363O2988J7391K9049p481J9998r4611r1675O0655L8283j4961R773P2766
$$ -197363 -134375 -116984 -87935 -95416 -75418 -170029 -261704 -201049 -162766 -177727 -167954 -95188
2796i5188J74152J00458p6926p5069n3182P5245m0091o7209O524M9814O394q3303
$$ -95188 78964 179422 102496 27427 -25755 49490 9399 -57810 -51286 -1472 4922 -78381
2784g8381J2127l0752k4547M4491k9636p0700L8555J9722j33894L1441K19525
$$ -78381 -66254 -97006 -121553 -77062 -106698 -177398 -138843 -119121 -253015 -221574 -2049
2773b049M8178K9654n9104L1656J4087r204j9607O2829q859n0799l5923P113J02884
$$ -2049 46129 75783 16679 48335 62422 53218 33611 96440 87581 36782 859 7972 110856
2760A10856N7175j26928j49058J9354l3946j1999L1980J3724R7560R3917J08545
$$ 110856 168031 41103 -107955 -88601 -122547 -134546 -102566 -88842 8718 102635 211180
2749B11180M503M2446p6957n1101O0891o6067o4161J6494o2224m4349q9874r0917
$$ 211180 215683 258129 181172 130071 190962 124895 60734 77228 15004 -29345 -119219 -210136
2737b10136k6619n7309P1446O1200L3890R0677J31544n075q0210j09628k38P6268
$$ -210136 -236755 -294064 -222618 -161418 -127528 -36851 94693 89618 9408 -100220 -100458 -24190
2725b4190r9631q4303N4921p8818R721J56477K10413P8588j26427j40839L2899
$$ -24190 -123821 -208124 -153203 -232021 -222300 -65823 144590 223178 96751 -44088 -11189
2714a1189N4861K662q0921j02931J9510N2313K6881p716M2810l5747n6903J01853
$$ -11189 43672 46334 -34587 -137518 -118008 -65695 -38814 -46530 -3720 -39467 -96370 5483
2702E483O2640m911J79N1608m6366j22946j41739M8195Q0301J620J4359R9518
$$ 5483 68123 63212 63391 114999 68633 -54313 -196052 -147857 -67556 -65936 -51577 47941
2690D7941J8136M9854K12p6669m5936k8461J9374J0056J2209J5401L923O5739
$$ 47941 66077 115931 116143 39474 -6462 -34923 -15549 -5493 6716 22117 26040 91779
2678I1779l0981m4530k6660l727j7106P1373R4721p3991n0060p402J28707N3632
$$ 91779 60798 16268 -10392 -14119 -31225 40148 134869 60878 10818 3416 132123 185755
2666A85755O7270n4338m5163r3701M0704K7441J00949Q8084j15945j29616p7196
$$ 185755 253025 198687 153524 59823 100527 127968 228917 317001 201056 71440 -5756
2655e756j39555q6081R9172J3597k2730o0673K7393P5740O3207j4038Q2103m1234
$$ -5756 -145311 -231392 -132220 -118623 -141353 -202026 -174633 -98893 -35686 -49724 32379 -8855
2643h855K7084m8812P8368q3386P2673M8796o2825r8624M4444j4443M2027Q2387
$$ -8855 18229 -30583 47785 -35601 37072 85868 23043 -75581 -31137 -45580 -3553 78834
2631G8834k4340j88957M031R7890Q7289M8319q4656p8493n3731J52666M9900O2400
$$ 78834 54494 -134463 -130432 -32542 54747 103066 18410 -60083 -113814 38852 88752 151152
2619A51152p1839l7171k287J31750N3900p4298j31240Q636M4443N9207J8306J3482
$$ 151152 79313 42142 39855 171605 225505 151207 19967 28603 73046 132253 150559 164041
2607A64041k2927j6972o330o053n1088r7749m1263O1785K5611L9392m9209j50178
$$ 164041 141114 124142 117812 111759 60671 -37078 -78341 -16556 9055 48447 -762 -150940
2595a50940P6970p9773q5937R1105L7564j9891K0648o0089l3794P0311P8629p7770
$$ -150940 -73970 -153743 -239680 -148575 -111011 -130902 -110254 -170343 -204137 -133826 -55197 -132967
2583a32967J1141j0639m7106j6798L5791J50101O2493m362j1755m3299J9203k5150
$$ -132967 -121826 -132465 -179571 -196369 -160578 -10477 52016 47654 35899 -7400 11803 -13347
2571a3347k986J8895o8379k8202l0894M8491Q0706O4075M6709m5683Q9247O3744
$$ -13347 -16333 2562 -65817 -94019 -124913 -76422 4284 68359 115068 69385 158632 222376
2559B22376j22135j96168m3184P5361j0225o0614j717N593o9035m4156J10377
$$ 222376 100241 -95927 -139111 -63750 -73975 -134589 -136306 -130713 -199748 -243904 -133527
2548a33527N8867N2683L5948j24470j09291K3661J37303M0935J16347l6729M6284
$$ -133527 -74660 -21977 13971 -110499 -219790 -196129 -58826 -17891 98456 61727 108011
2537A08011O7324m537j00668J9462Q8694L1595L2716O363k0266q2888o6007j4006
$$ 108011 175335 170798 70130 89592 178286 209881 242597 248960 228694 145806 79799 65793
2525F5793q1507l4392j03601N7899L4579Q7911m8772j75044n7849J00537J0887
$$ 65793 -15714 -50106 -153707 -95808 -61229 26682 -22090 -197134 -254983 -154446 -143559
2514a43559K6426n4803K4414Q158J54696J41075l7018p4951p8618J0438R8886
$$ -143559 -117133 -171936 -147522 -139364 15332 156407 119389 44438 -34180 -23742 75144
2503G5144r2153k0324Q0521m776n8521j307N3414J00304m7434j08541J230Q1385
$$ 75144 -17009 -37333 43188 38412 -20109 -21416 31998 132302 84868 -23673 -22443 58942
2491E8942L2061m9968j26360o1924n5925Q3440P9305L3183k9148M9739L236k8838
$$ 58942 91003 41035 -85325 -147249 -203174 -119734 -40429 -7246 -36394 13345 16581 -12257
2479a2257J6500J807o4942P6428J16531N9786m763k0996M0531l4394n8202J894
$$ -12257 4243 6050 -58892 17536 134067 193853 189090 168094 208625 174231 116029 117923
2467A17923k0066K224n8585r782k9870m0580L5458M2590k5835J8022M7795q2890
$$ 117923 97857 100081 41496 31714 1844 -38736 -3278 39312 13477 31499 79294 -3596
2455c596L7164K9518M5409q3455j20955k0990M046N1278n9560o8897K6761J3824
$$ -3596 33568 63086 108495 25040 -95915 -116905 -112859 -61581 -121141 -190038 -163277 -149453
2443a49453K3668N3010Q097L1667J30914O0494J6566j57765j01101L6490O2523
$$ -149453 -125785 -72775 -64678 -33011 97903 158397 174963 17198 -83903 -47413 15110
2432A5110Q5219R860r1427j21936J05232K1847j04260K4185k4009N0859J64483
$$ 15110 100329 110189 18762 -103174 2058 23905 -80355 -56170 -80179 -29320 135163
2421A35163k0800p8966l1199M8570Q2635j76686p6915j6987N9593O2494o9416
$$ 135163 114363 35397 4198 52768 135403 -41283 -118198 -135185 -75592 -13098 -82514
2410h2514p8274r8409K4318R3640J60361J35617L9617n1688p4240M4753j5176
$$ -82514 -160788 -259197 -234879 -141239 19122 154739 194356 142668 68428 113181 98005
2399I8005l9756l1656M2013L5821j00639j49266L974J31039M2093J2080J1815
$$ 98005 58249 26593 68606 104427 3788 -145478 -141504 -10465 31628 43708 55523
2388E5523j01689n094M3775O5767o7502P3688j6898j24083K6231K02435l8236
$$ 55523 -46166 -51260 -7485 58282 -9220 64468 47570 -76513 -50282 152153 113917
2377A13917q9256j8224l3196o2378p2288P6602J17184K2153N8811j09710j21302
$$ 113917 24661 6437 -26759 -89137 -161425 -84823 32361 54514 113325 3615 -117687
2366a17687N6968J5938k3675J2220K8587j4364l2068j8530K3624K8330L6815Q323
$$ -117687 -60719 -44781 -68456 -56236 -27649 -42013 -74081 -92611 -68987 -40657 -3842 4481
2354D481N4721J5653j06294j3575o2645n2675N1697J08954K53416J11468j18409
$$ 4481 59202 74855 -31439 -45014 -107659 -160334 -108637 317 253733 365201 246792
2343B46792j50253r7471Q1080L0351n5603K1189J27402m7564k02690o926O8886
$$ 246792 96539 -932 80148 110499 54896 76085 203487 155923 -46767 -53693 15193
2332A5193L1288p1386m8058L9057J00846O555P433N9771O6480M8104K7686j36668
$$ 15193 46481 -24905 -72963 -33906 66940 73495 80928 140699 207179 255283 282969 146301
2320A46301k10159q9285J58406R6770K3484m6799n2115k1535o9313p3794O0561
$$ 146301 -63858 -153143 5263 102033 125517 78718 26603 5068 -64245 -138039 -77478
2309g7478J47563J60476k0164j11184m7655J0817q9696r0194k2716l6333J21548
$$ -77478 70085 230561 210397 99213 51558 62375 -27321 -117515 -140231 -176564 -55016
2298e5016J8832j57610J6367R1642N2737n735p3384m0473J03351J5143l5824J35954
$$ -55016 -36184 -193794 -177427 -85785 -33048 -38783 -112167 -152640 -49289 -34146 -69970 65984
2286F5984L3921n6269p4848n5946O4116m8750n8176M0330O2835N0362J03034l7112
$$ 65984 99905 43636 -31212 -87158 -23042 -71792 -129968 -89638 -26803 23559 126593 89481
2274H9481r4443M502q0818m6159K4619K1657j31m4431n6490j2036R2182L1066
$$ 89481 -4962 -460 -81278 -127437 -102818 -81161 -81292 -125723 -182213 -194249 -102067 -71001
2262g1001p970J21848O9159N0789n7583l8557M9337J3574n3028L6949o9020n277
$$ -71001 -78971 42877 112036 162825 105242 66685 116022 129596 76568 113517 44497 39220
2250C9220P1942O3470Q404k6574m6893L8868n0640Q310K0815j9746J2919K0100
$$ 39220 111162 174632 183036 156462 109569 148437 97797 106107 126922 107176 120095 140195
2238A40195j86458j68746J1573J5673J18924P0697P2854M1424j44016m2417R2243
$$ 140195 -46263 -215009 -203436 -187763 -68839 1858 74712 116136 -27880 -70297 21946
2227B1946J19840j2172l9104j5889M0857K8606l0052o1377l2982M2066J6924J8073
$$ 21946 141786 129614 90510 74621 115478 144084 114032 52655 19673 61739 78663 96736
2215I6736q6077m3197J35251j8701j16893j26357K5491L9729M8992k7030j7367
$$ 96736 10659 -32538 102713 84012 -32881 -159238 -133747 -94018 -45026 -72056 -89423
2204h9423N5896m0176R2324J27587m8570n8982m5797j7682L6706k4832M6160O425
$$ -89423 -33527 -73703 18621 146208 97638 38656 -7141 -24823 11883 -12949 33211 39636
2192C9636j89644n4251K6441L1531m2184J4007K6635J06548J01059l4403J08769
$$ 39636 -150008 -204259 -177818 -146287 -188471 -174464 -147829 -41281 59778 25375 134144
2181A34144K6794r5194O866K8848l7008m4742M6605r442l3270o936q7091o2001
$$ 134144 160938 65744 72610 101458 64450 19708 66313 56871 23601 16665 -70426 -132427
2169a32427J3392N2014J27837q9685j26109J2584R5196O1038m265m8137k4135
$$ -132427 -119035 -67021 60816 -28869 -154978 -142394 -47198 13840 9575 -38562 -62697
2158f2697K7134l1409n2234j6892P7420J24309j6782q855p7458K4244N0566q5398
$$ -62697 -35563 -66972 -119206 -136098 -58678 65631 48849 39994 -37464 -13220 37346 -48052
2146d8052N820M5514M8851L5137m8953J5202o002R479J50655N2137j69113j71216
$$ -48052 -42232 3282 52133 87270 38317 53519 47517 56996 207651 259788 90675 -80541
2134h0541Q5538J49804O2335k4386m8737M6752K4318k2804n3833L2101p4592q0668
$$ -80541 4997 154801 217136 192750 144013 190765 215083 192279 138446 170547 95955 15287
2122A5287K5442L7558m7558k8731L3549J55703J0020j40558j80057J1368j3895
$$ 15287 40729 78287 30729 1998 35547 191250 201270 60712 -119345 -107977 -121872
2111a21872L8961R7284K3899M7703j4895q736J8899j13825p942o8932k0078P0982
$$ -121872 -82911 14373 38272 85975 71080 62344 81243 -32582 -40524 -109456 -129534 -58552
2099e8552J63916L4245J0148l2421N7775m1746m7210J9166k1246o6496J35330
$$ -58552 105364 139609 149757 117336 175111 133365 86155 105321 84075 17579 152909
2088A52909J58547l1718M439j4525r5188o9794L8912L7825m8572j33487q6907
$$ 152909 311456 279738 284177 269652 174464 104670 143582 181407 132835 -652 -87559
2077h7559j0249P1208L1963Q9284N6692M5796J4596j69650n4748O6764j8371r1231
$$ -87559 -97808 -26600 5363 94647 151339 197135 211731 42081 -12667 54097 35726 -55505
2065e5505j1397L262m0474N4711j4998j1173p8193J2681m7461O941J05578J8280
$$ -55505 -66902 -63640 -104114 -49403 -64401 -75574 -153767 -141086 -188547 -181606 -76028 -57748
2053e7748L4129j11268N7709n9844j04015R1457J20544m8938K7643O1623M1857
$$ -57748 -23619 -134887 -77178 -137022 -241037 -149580 -29036 -77974 -50331 11292 53149
2042E3149J8157P9636m0630L6766j10713j34984K0540M8129j3576L7371p3296
$$ 53149 71306 150942 110312 147078 36365 -98619 -78079 -29950 -43526 -6155 -79451
2031g9451P9777M7905L7589J737j13930j50415J20016N2066R70k862J7582J9973
$$ -79451 326 48231 85820 87557 -26373 -176788 -56772 -4706 -3736 -6598 10984 30957
2019C0957J2586r5116M784J30686K6194L8108j2273l6659j22343m0411K297r2238
$$ 30957 43543 -51573 -46789 83897 110091 148199 135926 99267 -23076 -63487 -61190 -153428
2007a53428O5684J48297n442o9121l3587P4256r8693j30382P6125P4646l3662
$$ -153428 -87744 60553 55111 -14010 -47597 26659 -72034 -202416 -126291 -51645 -85307
1996h5307k3424L9993K5993j1543R094q593Q7060R7744k1536N50l5290R1464M820
$$ -85307 -108731 -68738 -42745 -54288 -45194 -53787 33273 131017 109481 110031 74741 166205 171025
1983A71025n3531j26274J0817K141n2194k3201J1070J5903O2444K1076K9494j93169
$$ 171025 117494 -8780 2037 4178 -48016 -71217 -60147 -44244 18200 39276 68770 -124399
1971a24399j22203l5862J46185P7213J29806K5973l5952k2902L6402k8798q6827
$$ -124399 -246602 -282464 -136279 -59066 70740 96713 60761 37859 74261 45463 -41364
1960d1364j4801Q5534M0152l8280n1007n4283q5083m6436Q8305K01529m377j2640
$$ -41364 -56165 29369 69521 31241 -19766 -74049 -159132 -205568 -117263 84266 79889 67249
1948F7249o5564L012Q6595q6380r0717P5653M3615m6491m3237M9774l0031j71440
$$ 67249 1685 4697 91292 4912 -85805 -10152 33463 -13028 -56265 -6491 -36522 -207962
1936b07962n1715q953J27928J34705L3849q7168J9071Q5002P7566O6251j9584
$$ -207962 -259677 -268630 -140702 -5997 27852 -59316 -40245 44757 122323 188574 168990
1925A68990K5845m5682L1596p828j5020p7652k9367N7776k9838K2077M9822J3025
$$ 168990 194835 149153 180749 172921 157901 80249 50882 108658 78820 100897 150719 163744
1913A63744L1557n4210j49364j0055o406M17o3314J10304L8137N862k1165q6791
$$ 163744 195301 141091 -8273 -18328 -24734 -24317 -87631 22673 60810 66672 45507 -41284
1901d1284q8198p787J21142o100o6418J0974j01946n9107P6548P9957K2696L3015
$$ -41284 -129482 -137269 -16127 -22227 -88645 -77671 -179617 -238724 -162176 -82219 -59523 -26508
1889b6508L8928j367k4084n584K2202P911m5056P8346Q6095n8860k1400M877l2729
$$ -26508 12420 11053 -13031 -18615 3587 11498 -33558 44788 130883 72023 50623 55500 22771
1876B2771N0861K8258m3093L341m9833o6115O4348o4417l2612Q028j535J10808
$$ 22771 73632 101890 58797 62138 12305 -53810 10538 -53879 -86491 -78463 -79998 30810
1864C0810P0394j02347r1680N6696J20246o805p7620j09550M5215J63142O6655
$$ 30810 101204 -1143 -92823 -36127 84119 77314 -306 -109856 -64641 98501 165156
1853A65156k0790k3696j36003K9893q974l6646r2055l6833J4161N8586k0419j2627
$$ 165156 144366 120670 -15333 14560 5586 -31060 -123115 -159948 -145787 -87201 -107620 -120247
1841a20247n9202J05665J1256Q7413J74333m5699q8744j52343N1931j9294M6103
$$ -120247 -179449 -73784 -62528 24885 199218 153519 64775 -87568 -35637 -54931 -8828
1830h828O9832J51416k2998r9130M785j1997j6684j06947n9387Q9696P7474j00314
$$ -8828 61004 212420 189422 90292 95077 83080 66396 -40551 -99938 -10242 67232 -33082
1818c3082M5517R8097j337j19809J3125R7537M4442k1564m4749p608r0230n426
$$ -33082 12435 110532 109195 -10614 2511 100048 144490 122926 78177 70569 -19661 -25087
1806b5087J8006L0565N7318q404J2889r146J5572j5498n3750Q002J0001N273p5555
$$ -25087 -7081 23484 80802 72398 85287 76141 91713 76215 22465 30467 40468 45741 -29814
1793b9814L0539M9115l495J00994j6146j01728Q3032k0762l3505N2000o8404o2914
$$ -29814 725 49840 46345 147339 131193 29465 112497 91735 58230 110230 41826 -21088
1781b1088J18951k9508o5826m1931m3892Q1972J0207m0591Q555n5156n7315L9189
$$ -21088 97863 68355 2529 -39402 -83294 -1322 8885 -31706 -23151 -78307 -135622 -96433
1769i6433P8828K2756J1214j38097p794J69155Q2638L0224j39956K7212O7181
$$ -96433 -17605 5151 16365 -121732 -129526 39629 122267 152491 12535 39747 106928
1758A06928r4189l1372M014j9406j3642j517q8148o5517O5063J29568J07970O6960
$$ 106928 12739 -18633 -14619 -34025 -47667 -49184 -137332 -202849 -137786 -8218 99752 166712
1746A66712o0158j82437q2146j312R235M218J91223M9745k2451j32630l9654N8264
$$ 166712 106554 -75883 -158029 -159341 -150106 -145888 45335 95080 72629 -60001 -99655 -41391
1734d1391J9059m9066q1497j13062J6812J48079M1122M0777n9636K9050k7129
$$ -41391 -22332 -71398 -152895 -265957 -249145 -101066 -59944 -19167 -78803 -49753 -76882
1723g6882l5240R3634j0119l7422K0860l7385Q8565J09338j512p3425k4632J24642
$$ -76882 -112122 -18488 -28607 -66029 -45169 -82554 6011 115349 113837 40412 15780 140422
1711A40422P5455J8132j7872k2159n4806o1180r82n6049j07552R797R1676L495
$$ 140422 215877 234009 216137 193978 139172 77992 77010 20961 -86591 -76794 14882 18377
1699A8377k05818M5163J86143K4485P9803m9888K0715j12264j32156l9597L7723
$$ 18377 -187441 -142278 43865 68350 148153 98265 118980 6716 -125440 -165037 -127314
1688a27314O2617M3765l9913N272J06544Q7142r2613j04340l2850R9222P2602
$$ -127314 -64697 -20932 -60845 -55573 50971 138113 45500 -58840 -91690 7532 80134
1677H0134J3447m9340J02532r4630o345r3246k6356K4405M0126M8480n768Q382
$$ 80134 93581 44241 146773 52143 45798 -47448 -73804 -49399 -9273 39207 33439 41821
1665D1821p076K4121K3071j0126n6289j20893j20604J2683J28252R509j1027P3425
$$ 41821 34745 58866 81937 71811 15522 -105371 -225975 -213292 -85040 -75531 -86558 -13133
1653a3133m097p6689m6407R306O8128O9877L875p1099J18534O7452Q3450L9071
$$ -13133 -17230 -93919 -140326 -131020 -62892 6985 10860 -60239 58295 125747 209197 248268
1641B48268m410l8265J68832j6498j18657p4623q6083r4183k0258J6125O9336
$$ 248268 243858 205593 374425 357927 239270 164647 78564 -15619 -35877 -19752 49584
1630D9584M1345Q8917m1467j21070k6330J57899K5212m2815O0848P8632J3821
$$ 49584 90929 179846 138379 17309 -9021 148878 174090 131275 192123 270755 284576
1619B84576n5620j07848r8452l1356K3756N7110m5817l7091p8531m568Q511r371
$$ 284576 228956 121108 22656 -8700 15056 72166 26349 -10742 -89273 -93841 -85330 -94701
1607i4701L1537L9230N7122r4878P798k3469P6588l2268j34611l1958K0232j2780
$$ -94701 -63164 -23934 33188 -61690 -53892 -77361 -773 -33041 -167652 -199610 -179378 -192158
1595a92158Q8413J44950o415k5102p3492K2152J6439q2830q095R4886M6363k9219
$$ -192158 -103745 41205 34790 9688 -63804 -41652 -25213 -108043 -116138 -21252 25111 -4108
1583d108l0462l8753P5616O9789M3701Q5817n9612p7754n3060p8947o5760P0368
$$ -4108 -34570 -73323 2293 72082 115783 201600 141988 64234 11174 -67773 -133533 -63165
1571f3165N2577L4880p6148J9468j5299m169L2243l5635N3026L8380N8797L8297
$$ -63165 -10588 24292 -51856 -32388 -47687 -51856 -19613 -55248 -2222 36158 94955 133252
1559A33252N353q1694M0560R4755j77421j22203L106J56904P8337l8329j3489
$$ 133252 138605 56911 97471 192226 14805 -107398 -104292 52612 130949 92620 79131
1548G9131L1286n3404q0622q4906j08025J06017J99665J1921r2884j64701p3599
$$ 79131 110417 57013 -23609 -108515 -216540 -110523 89142 101063 8179 -156522 -230121
1537b30121L694J42472M3502K2911n5914k12655q1422O5171J91400J04524l6650
$$ -230121 -226427 -83955 -40453 -17542 -73456 -286111 -367533 -302362 -110962 -6438 -43088
1526d3088K8387J1113N818P6663m4381p6119L085Q3216L7683n188L5346j03927
$$ -43088 -14701 -3588 2230 78893 34512 -41607 -38522 44694 82377 77189 112535 8608
1514H608j28572j7722r262N320N8475L4463q6120m542J08233J09163J26308j37855
$$ 8608 -119964 -137686 -146948 -141628 -83153 -48690 -134810 -139352 -31119 78044 204352 66497
1502F6497l6210m3023k4897M4963M5878P150J6937R5310j0137o5569m5960j569
$$ 66497 30287 -12736 -37633 7330 53208 60358 77295 172605 162468 96899 50939 49370
1490D9370j6769k7081m4540L7355J734j3341R5791n7391m4097P9740p7174m608
$$ 49370 32601 5520 -39020 -1665 69 -13272 82519 25128 -18969 60771 -16403 -21011
1478b1011N1844N124R837J698j8497n4109N4349n823m603N9269o3162m902N4874
$$ -21011 30833 35957 45794 47492 28995 -25114 29235 23412 18809 78078 14916 10014 64888
1465F4888o015k0635J39476m5050j86645k0641Q5366J28737n663j03151P3053
$$ 64888 58873 38238 177714 132664 -53981 -74622 10744 139481 133818 30667 103720
1454A03720k8384l7563j78125j05096N4560L614J42716k0663m2184J6163L4026
$$ 103720 75336 37773 -140352 -245448 -190888 -187274 -44558 -65221 -107405 -91242 -57216
1443e7216l2510k3422M6061L3138k1697Q510J21025k5514k3318K5679j77577P958
$$ -57216 -89726 -113148 -67087 -33949 -55646 -47136 73889 48375 25057 50736 -126841 -118883
1431a18883J42439R9041j452j84831l7255M7612R6572n8926q7402j2397L7916
$$ -118883 23556 122597 121145 -63686 -100941 -53329 43243 -15683 -103085 -115482 -77566
1420g7566P6810P483N7475j61828M0101J91171N2283j07049n529P82j38631P2684
$$ -77566 -756 6727 64202 -97626 -57525 133646 185929 78880 73351 74133 -64498 8186
1408H186Q7759J4305p1907j13052m0881R2151O8150m452k6422J69391L1662N6726
$$ 8186 95945 110250 38343 -74709 -115590 -23439 44711 40259 13837 183228 214890 271616
1396B71616l3501j33296O880R598n9632j62448K6504J98449m0118o5476l1159
$$ 271616 238115 104819 111699 121297 61665 -100783 -74279 124170 84052 18576 -12583
1385a2583l9895r535m8038l2135J38362J5709O7345o3641P809q3469J02361m307
$$ -12583 -52478 -62013 -110051 -142186 -3824 11885 79230 15589 23398 -60071 42290 37983
1373C7983P3003J15417n8356j45045k3955o8132m7110R9568N8152N0675K0712
$$ 37983 110986 226403 168047 23002 -953 -69085 -116195 -16627 41525 92200 112912
1362A12912N306j05402m3314O1685R3475J2045q3704K1663n7568J0251K3713n8967
$$ 112912 118218 12816 -30498 31187 124662 136707 53003 74666 17098 27349 51062 -7905
1350g905J5946R888j68502J7563J72923K3712n5413j16123O2902O2027n9849o3152
$$ -7905 8041 17929 -150573 -133010 39913 63625 8212 -107911 -45009 17018 -42831 -105983
1338a05983M4530J36650Q6196m5594j06530p5401m0453J57079J14525N525o7834
$$ -105983 -61453 75197 161393 115799 9269 -66132 -106585 50494 165019 170544 102710
1327A02710o1562m4818K9743P6549k1457o4620K6773o6642m8699L0508k8713j57139
$$ 102710 41148 -3670 26073 102622 81165 16545 43318 -23324 -72023 -41515 -70228 -227367
1315b27367k7643L517J17699J45033l1318j5707N5701J1024k6851k0135N5749
$$ -227367 -255010 -251493 -133794 11239 -20079 -35786 19915 30939 4088 -16047 39702
1304C9702O9225j5719L958l972l0389q131p6788m6640J3477J62150p1898j68961
$$ 39702 108927 93208 97166 93194 62805 54674 -22114 -68754 -55277 106873 34975 -133986
1292a33986K4758M7745q2028p2384J70196J06367j7322L287Q7009J33356l5830
$$ -133986 -109228 -61483 -143511 -215895 -45699 60668 43346 46633 133642 266998 231168
1281B31168l6576k07052r5616j7853K2660M313o305J49602m56q5705P8644O5001
$$ 231168 194592 -12460 -108076 -125929 -103269 -98956 -105261 44341 43885 -41820 36824 101825
1269A01825M6244M0424P320q0646m3340L3287J350o5169n8403J63742N7574r5005
$$ 101825 148069 188493 195813 115167 71827 105114 106464 41295 -17108 146634 204208 109203
1257A09203q0319k4881O9644J8830j04554j10018j117K1263R3576r4223N1989
$$ 109203 28884 4003 73647 92477 -12077 -122095 -123212 -101949 -8373 -102596 -50607
1246e0607m4905J6851K51456N3181K516j68343j15359J7330k422M9249j15628
$$ -50607 -95512 -78661 172795 225976 228492 60149 -55210 -37880 -40302 8947 -106681
1235a06681R3960M8172R1017P9897p7309j7185J04114P0872p6881j12960j999
$$ -106681 -12721 35451 126468 206365 129056 111871 215985 286857 209976 97016 95017
1224I5017j35634k6864M6031J07494J3082p7972j37073O9182q8626n6169O6970
$$ 95017 -40617 -67481 -21450 86044 99126 21154 -115919 -46737 -135363 -191532 -124562
1213a24562R0505P7879Q1381J786O21j05925j4626l6526j12631P5953R9116Q1862
$$ -124562 -34057 43822 125203 126989 127610 21685 7059 -29467 -142098 -66145 32971 114833
1201A14833N85j41926k8299q6524j03546N4349N3287L8622j9820M2893Q0355P3634
$$ 114833 115418 -26508 -54807 -141331 -244877 -190528 -137241 -98619 -118439 -75546 4809 78443
1189G8443K6313o9187j6082J7213M6529L6014p0956N612l4259j37395J1645l7115
$$ 78443 104756 35569 19487 36700 83229 119243 48287 53899 19640 -117755 -106110 -143225
1177a43225l7793j8718P788J00055R2235J65212O381o3374j13170O897M0012R9605
$$ -143225 -181018 -199736 -191948 -91893 342 165554 171935 108561 -4609 2288 42300 141905
1165A41905J0675K2622k9373n9822j33899P5845m2613M463J31657n80m5640m5227
$$ 141905 152580 175202 145829 86007 -47892 27953 -14660 -10197 121460 120880 75240 30013
1153C0013L3735j7208J7341P9209n0131j64082L1760J89754N635K1173J1547n3115
$$ 30013 63748 46540 63881 143090 92959 -71123 -39363 150391 156026 177199 188746 135631
1141A35631j31875j19394j23633k5685J32837R9854J31702q8375l8057l2140O480
$$ 135631 3756 -115638 -239271 -264956 -132119 -32265 99437 11062 -26995 -59135 -52655
1130e2655J56925l7913j09495R1671O9063o6922p0091n3693n796J17524m24n9416
$$ -52655 104270 66357 -43138 48533 117596 50674 -19417 -73110 -78906 38618 38194 -21222
1118b1222M2083Q7161Q1764j06492K0140m0788o5138q8963q1924P8067K1020m4626
$$ -21222 20861 108022 189786 83294 103434 62646 -2492 -91455 -173379 -95312 -74292 -118918
1106a18918j08771J9046Q0940M2283Q4293J1615o204J3352q5248m6827N8154K2783
$$ -118918 -227689 -208643 -127703 -85420 -1127 10488 4284 17636 -67612 -114439 -56285 -33502
1094c3502m1134P7280J4966q008o5824l8357L3436J21058n7301K8460J0116j15856
$$ -33502 -74636 2644 17610 9602 -56222 -94579 -61143 59915 2614 31074 41190 -74666
1082g4666l0519J04686J45877R1938n4394L8253l9835M1053o422k03070j06176
$$ -74666 -105185 -499 145378 237316 182922 221175 181340 222393 215971 12901 -93275
1071i3275Q7268J03097Q9782r1437L14P6011K1569r2673K7015j6566j5728Q1740
$$ -93275 -6007 97090 186872 95435 95749 171760 193329 100656 127671 111105 95377 177117
1059A77117j554j5345q0472p2278J00994N8455n0234p3353L015l7348q2516j1591
$$ 177117 175563 160218 79746 7468 108462 166917 116683 43330 46345 8997 -73519 -85110
1047h5110k112n3955n5373M6386L1684P5739p545r4734p3971K7799J0688J03717
$$ -85110 -87222 -141177 -196550 -150164 -118480 -42741 -50286 -145020 -218991 -191192 -180504 -76787
$$ [...]
##END NTUPLES=NMR SPECTRUM
##END=
