##TITLE=Analysis number 328474
Compound Code cc 04601
Book Reference lab3
Project Code adrs
Chemist Name stores
##JCAMPDX= 6.0         $$ Bruker NMR JCAMP-DX V2.0
##DATA TYPE= NMR SPECTRUM
##DATA CLASS= NTUPLES
##ORIGIN= Bruker BioSpin GmbH
##OWNER= nmr
$$ XWIN-NMR		Version 3.5
$$ Thu Jun  7 11:10:13 2007 GMT Daylight Time (UT+1h)  MAYBRIDGE\nmr@NMR_250MHZ
##.OBSERVE FREQUENCY= 250.131544655141
##.OBSERVE NUCLEUS= ^1H
##.ACQUISITION MODE= SIMULTANEOUS (DQD)
##.ACQUISITION SCHEME= undefined
##.AVERAGES= 16
##.DIGITISER RES= 18
##SPECTROMETER/DATA SYSTEM= dpx250
##.PULSE SEQUENCE= zg30
##.SOLVENT NAME= DMSO
##.SHIFT REFERENCE= (INTERNAL, DMSO, 0, 16.5148)
##AUDIT TRAIL= $$ (NUMBER, WHEN, WHO, WHERE, WHAT)
$$ ##TITLE= Audit trail, XWIN-NMR		Version 3.5
$$ ##JCAMPDX= 5.01
$$ ##ORIGIN= Bruker BioSpin GmbH
$$ ##OWNER= nmr
$$ C:\u/data/dgb/nmr/ADRS/490/pdata/1/auditp.txt
$$ ##AUDIT TRAIL=  $$ (NUMBER, WHEN, WHO, WHERE, WHAT)
(   1,<2007-06-07 11:09:50.25 +100>,<MAYBRIDGE\nmr>,<NMR_250MHZ>,
      <created by zg, POWCHK disabled, PULCHK disabled
       configuration hash MD5:
       76 6E 9A 78 1E 09 19 81 EC 84 63 8F B0 6A 59 2D
       data hash MD5: 64K
       E7 C0 80 7D 9D 6F D0 8B AF 1F CC F1 5A E9 B3 22>)
(   2,<2007-06-07 11:10:03.23 +100>,<MAYBRIDGE\nmr>,<NMR_250MHZ>,
      <Start of raw data processing
       ef LB = 0.3 FT_mod = 6 PKNL = 1 SI = 32K 
       data hash MD5: 32K
       56 7A EB 7D 92 CE 6B D1 86 A9 4D 51 C0 31 04 91>)
(   3,<2007-06-07 11:10:04.89 +100>,<MAYBRIDGE\nmr>,<NMR_250MHZ>,
      <apk 
       data hash MD5: 32K
       01 B4 CC FE CB C7 04 36 C8 13 08 E6 78 29 96 87>)
(   4,<2007-06-07 11:10:05.58 +100>,<MAYBRIDGE\nmr>,<NMR_250MHZ>,
      <abs ABSG = 5 
       data hash MD5: 32K
       56 DE 27 97 6B CD 1D CF C5 E6 17 83 B1 FC 8A 8A>)
$$ ##END=
$$ 
$$ hash MD5
$$ 50 0C A3 31 12 77 B0 CA 39 ED 2E DB 31 08 52 11
##$RELAX= 
##$RELAX= 
##$RELAX= 
##$RELAX= 
##$RELAX= 
##$RELAX= 
##$RELAX= 
$$ Bruker specific parameters
$$ --------------------------
##$DU= <C:\u>
##$EXPNO= 490
##$NAME= <ADRS>
##$PROCNO= 1
##$TYPE= <nmr>
##$USER= <dgb>
##$AMP= (0..31)
100 100 100 100 100 100 100 100 100 100 100 100 100 100 100 100 100 100 
100 100 100 100 100 100 100 100 100 100 100 100 100 100 
##$AQSEQ= 0
##$AQ_mod= 3
##$AUNM= <au_zg>
##$AUTOPOS= <13 >
##$BF1= 250.13
##$BF2= 250.13
##$BF3= 250.13
##$BF4= 250.13
##$BF5= 500.13
##$BF6= 500.13
##$BF7= 500.13
##$BF8= 500.13
##$BYTORDA= 1
##$CFDGTYP= 0
##$CFRGTYP= 5
##$CHEMSTR= <none>
##$CNST= (0..31)
1 1 145 1 1 1 1 1 1 1 1 1 1 1 1 1 1 1 1 1 1 1 1 1 1 1 1 1 1 1 1 1 
##$CPDPRG= <>
##$CPDPRG1= <>
##$CPDPRG2= <>
##$CPDPRG3= <>
##$CPDPRG4= <mlev>
##$CPDPRG5= <mlev>
##$CPDPRG6= <mlev>
##$CPDPRG7= <mlev>
##$CPDPRG8= <mlev>
##$CPDPRGB= <>
##$CPDPRGT= <>
##$D= (0..31)
0 1 0 0 0 0 0 0 0 0.06 0 0 0 0 0 0 0.0002 0 0 0 0 0 0 0 0 0 0 0 0 0 0 
0 
##$DATE= 1181210989
##$DBL= (0..7)
120 120 120 120 120 120 120 120 
##$DBP= (0..7)
150 150 150 150 150 150 150 150 
##$DBP07= 0
##$DBPNAM0= <>
##$DBPNAM1= <>
$$ [...]
##$SUBNAM7= <"">
##$SUBNAM8= <"">
##$SUBNAM9= <"">
##$SW= 20.6930455092707
##$SWIBOX= (0..15)
0 0 3 0 0 0 0 0 0 0 0 0 0 0 0 0 
##$SW_h= 5175.983436853
##$TD= 65536
##$TD0= 1
##$TE= 297.16
##$TE2= 300
##$TE3= 300
##$TEG= 300
##$TL= (0..7)
0 120 120 120 120 120 120 120 
##$TP= (0..7)
150 150 150 150 150 150 150 150 
##$TP07= 0
##$TPNAME0= <>
##$TPNAME1= <>
##$TPNAME2= <>
##$TPNAME3= <>
##$TPNAME4= <>
##$TPNAME5= <>
##$TPNAME6= <>
##$TPNAME7= <>
##$TPOAL= (0..7)
0.5 0.5 0.5 0.5 0.5 0.5 0.5 0.5 
##$TPOFFS= (0..7)
0 0 0 0 0 0 0 0 
##$TUNHIN= 0
##$TUNHOUT= 0
##$TUNXOUT= 0
##$USERA1= <user>
##$USERA2= <user>
##$USERA3= <user>
##$USERA4= <user>
##$USERA5= <user>
##$V9= 5
##$VALIST= <valist>
##$VCLIST= <CCCCCCCCCCCCCCC>
##$VD= 0
##$VDLIST= <DDDDDDDDDDDDDDD>
##$VPLIST= <PPPPPPPPPPPPPPP>
##$VTLIST= <TTTTTTTTTTTTTTT>
##$WBST= 1024
##$WBSW= 4
##$XGAIN= (0..3)
0 0 0 0 
##$XL= 0
##$YL= 0
##$YMAX_a= 254117
##$YMIN_a= -163116
##$ZGOPTNS= <>
##$ZL1= 120
##$ZL2= 120
##$ZL3= 120
##$ZL4= 120
##$ABSF1= 16.51484
##$ABSF2= -4.178333
##$ABSG= 5
##$ABSL= 3
##$ALPHA= 0
##$AQORDER= 0
##$ASSFAC= 0
##$ASSFACI= 0
##$ASSFACX= 0
##$ASSWID= 0
##$AUNMP= <proc_1d>
##$AZFE= 0.1
##$AZFW= 0.1
##$BCFW= 0
##$BC_mod= 0
##$BYTORDP= 0
##$COROFFS= 0
##$CY= 12.5
##$DATMOD= 1
##$DC= 0
##$DFILT= <>
##$DTYPP= 0
##$F1P= 14.0000005364418
##$F2P= -0.99999901652339
##$FCOR= 0.5
##$FTSIZE= 32768
##$FT_mod= 6
##$GAMMA= 0
##$GB= 0
##$INTBC= 1
##$INTSCL= 1
##$ISEN= 128
##$LB= 0.3
##$LEV0= 0
##$LPBIN= 0
##$MAXI= 10000
##$MC2= 0
##$MEAN= 0
##$ME_mod= 0
##$MI= 0
##$NCOEF= 0
##$NC_proc= -5
##$NLEV= 6
##$NOISF1= 0
##$NOISF2= 0
##$NSP= 0
##$NTH_PI= 0
##$NZP= 0
##$OFFSET= 16.51484
##$PC= 1
##$PHC0= -64.96035
##$PHC1= 8.356025
##$PH_mod= 1
##$PKNL= yes
##$PPARMOD= 0
##$PSCAL= 4
##$PSIGN= 0
##$REVERSE= no
##$SF= 250.130001789723
##$SI= 32768
##$SIGF1= 0
##$SIGF2= 0
##$SINO= 400
##$SIOLD= 32768
##$SREGLST= <1H.DMSO>
##$SSB= 0
##$STSI= 32768
##$STSR= 0
##$SW_p= 5175.98343685301
##$SYMM= 0
##$S_DEV= 0
##$TDeff= 65536
##$TDoff= 0
##$TI= <Analysis number 999999
Compound Code 99
Book Reference 9
Project Code 9>
##$TILT= no
##$TM1= 0
##$TM2= 0
##$TOPLEV= 0
##$USERP1= <user>
##$USERP2= <user>
##$USERP3= <user>
##$USERP4= <user>
##$USERP5= <user>
##$WDW= 1
##$XDIM= 32768
##$YMAX_p= 295752035
##$YMIN_p= -576299
$$ End of Bruker specific parameters
$$ ---------------------------------
##NTUPLES= NMR SPECTRUM
##VAR_NAME=  FREQUENCY,     SPECTRUM/REAL,   SPECTRUM/IMAG
##SYMBOL=    X,             R,               I
##VAR_TYPE=  INDEPENDENT,   DEPENDENT,       DEPENDENT
##VAR_FORM=  AFFN,          ASDF,            ASDF
##VAR_DIM=   32768,         32768,           32768
##UNITS=     HZ,            ARBITRARY UNITS, ARBITRARY UNITS
##FACTOR=    0.157963299565203, 1,           1
##FIRST=     4130.85675174022, 0,            0
##LAST=      -1045.12668511279, 0,           0
##MIN=       -1045.12668511279, -576299,     0
##MAX=       4130.85675174022, 295752035,    0
$$ Real data points
##PAGE= N=1
##DATA TABLE= (X++(R..R)), XYDATA
$$ [...]
15912I5733O4628j27582j56010J12978P6668p164j449q2075J3947k0603o0174
$$ 95733 160361 32779 -123231 -10253 66415 59251 57802 -24273 -10326 -30929 -91103
15901i1103J57356M7810J03183K1794k84770j00342p9719K4087P2875O7468J26519
$$ -91103 66253 114063 217246 239040 -45730 -146072 -225791 -201704 -128829 -61361 65158
15890F5158N1391J7911o1127j85386n6297K35183L5778o5326j4808o024n5034
$$ 65158 116549 134460 73333 -112053 -168350 66833 102611 37285 22477 16453 -38581
15879c8581r5884M8004M0616n11J47527L4091j03539j5624m8365j09777P525M0560
$$ -38581 -134465 -86461 -45845 -46356 101171 135262 31723 16099 -32266 -142043 -134518 -93958
15867i3958N4288M3637J07876l1481K65l1334R53J5532k0896q610p3038j8795
$$ -93958 -39670 3967 111843 80362 80627 49293 50246 65778 44882 36272 -36766 -55561
15855e5561o1172r375j8070j29275Q9379O4116N5546J423j25107p4482R3269J91812
$$ -55561 -116733 -126108 -144178 -273453 -184074 -119958 -64412 -62989 -188096 -262578 -169309 22503
15843B2503Q0283J28948p0843j86855j0070j38091p3585O8425J18880k3190l3238
$$ 22503 102786 231734 160891 -25964 -36034 -174125 -247710 -179285 -60405 -83595 -116833
15832a16833M3029O2316j5375N5332k1702m3979P4853r3074L0723N2592M2370
$$ -116833 -73804 -11488 -26863 28469 6767 -37212 37641 -55433 -24710 27882 70252
15821G0252j59791M9795Q3629r5022m1686J50234J72344l0274k64571r3202N9188
$$ 70252 -89539 -39744 43885 -51137 -92823 57411 229755 199481 -65090 -158292 -99104
15810i9104J13202M071j61697o3631L2084L6703J59625P3828k9934Q7792M8296
$$ -99104 14098 18169 -143528 -207159 -175075 -138372 21253 95081 65147 152939 201235
15799B01235p2634j28677q0882k77o209J7591p812M7330N2121j15567j12685k1131
$$ 201235 128601 -76 -80958 -81235 -87444 -69853 -77665 -30335 21786 -93781 -206466 -227597
15787b27597K1865L6252r8522k4877J23881k1845n5764K7308J4484Q0079P9720
$$ -227597 -205732 -169480 -268002 -292879 -168998 -190843 -246607 -219299 -204815 -124736 -45016
15776d5016L270J52355l7855n9786O0179p5445j83393j09505p4227p119L0090
$$ -45016 -41746 110609 72754 12968 73147 -2298 -185691 -295196 -369423 -376542 -346452
15765c46452J67674J60044J61599j5089q5895j19142j25405r9073Q456N5161K5497
$$ -346452 -178778 -18734 142865 127776 41881 -77261 -202666 -301739 -293283 -238122 -212625
15754b12625M3720N9606j01428k1628J62511J16564J7270j4951o2725r6989M3036
$$ -212625 -168905 -109299 -210727 -232355 -69844 46720 63990 49039 -13686 -110675 -67639
15743f7639K6113m7083J0292J2196r324J44310N4988l7734l6007M6975L507M4797
$$ -67639 -41526 -88609 -78317 -66121 -75445 68865 123853 86119 50112 97087 100594 145391
15731A45391p106o82j3864P5432P1203j12384k50657P297K6778k8428K4330M6155
$$ 145391 138285 137603 123739 199171 270374 157990 -92667 -85370 -58592 -87020 -62690 -16535
15719a6535M6945j16603L8041O5205m5729j03020M9267R6748j51586o8919O746
$$ -16535 30410 -86193 -48152 17053 -28676 -131696 -82429 14319 -137267 -206186 -199440
15708a99440J00827J07435m474k6765j6282q6181n2503L6901M0796O2733K4933
$$ -199440 -98613 8822 4348 -22417 -38699 -124880 -177383 -140482 -99686 -36953 -12020
15697a2020M2580K8903r9942j65587O0378M1280j23809k2402J06033P2349j66615
$$ -12020 30560 59463 -40479 -206066 -145688 -104408 -228217 -250619 -144586 -72237 -238852
15686b38852o475O1693n2124k6917M5530P1931P5168l586N8578k6630k0097N6069
$$ -238852 -245327 -183634 -235758 -262675 -217145 -145214 -70046 -73632 -15054 -41684 -61781 -5712
15674e712J32272P947j36766k20208k3476J01701j88m8327Q61k8592K9235J44557
$$ -5712 126560 134507 -2259 -222467 -245943 -144242 -144430 -192757 -191896 -220488 -191253 -46696
15662d6696k05179k4503J256m19J70928P9952J44358N5009L0876R702O9838p1504
$$ -46696 -251875 -276378 -275122 -275541 -104613 -24661 119697 174706 205582 215284 285122 213618
15650B13618k3868j01055j40134N512j5316Q335N8113K3343J62790q1352p4072
$$ 213618 189750 88695 -51439 -45927 -61243 -52908 5205 28548 191338 109986 35914
15639C5914l6923r4799m7244J06501O5678J778p221n0726q1915Q1088r5665n989
$$ 35914 -1009 -95808 -143052 -36551 29127 30905 23684 -27042 -108957 -27869 -123534 -129523
15627a29523m4934L7455M6329N5664N0345N1335M6024q4991j14849l0228P8910
$$ -129523 -174457 -137002 -90673 -35009 15336 66671 112695 27704 -87145 -117373 -38463
15616c8463P4438K9510j5257N5032M4231k3078j38412j37373m2031l6131m1742
$$ -38463 35975 65485 50228 105260 149491 126413 -11999 -149372 -191403 -227534 -269276
15605b69276Q8246J98782J02350k5873j10774K2321j0311o2517k12677J3022l0373
$$ -269276 -181030 17752 120102 94229 -16545 5776 -4535 -67052 -279729 -266707 -297080
15594b97080P8481R6144J25056M6002o4361J84086J34598q9202p7531j47138q4333
$$ -297080 -218599 -122455 2601 48603 -15758 168328 302926 213724 136193 -10945 -95278
15583i5278k1703j73097J5033R1632N1420J20400l5268j12441K5123k497P0743
$$ -95278 -116981 -290078 -275045 -183413 -131993 -11593 -46861 -159302 -134179 -136676 -65933
15572f5933M0766O4066K7626q7062M198m6539n0199n7055N3837R2144L435o3532
$$ -65933 -25167 38899 66525 -20537 -16339 -62878 -113077 -170132 -116295 -24151 -20716 -84248
15560h4248J06301J52890P4982K6349k38478j57729r2612J00324N7461j1932M719
$$ -84248 22053 174943 249925 276274 37796 -119933 -212545 -112221 -54760 -66692 -61973
15549f1973n7243k9636Q2464M0433J4618j314O7915M730r3974J2120P1007p512
$$ -61973 -119216 -148852 -66388 -25955 -11337 -12651 55264 59994 -33980 -21860 49147 41635
15537D1635m3075n3944j607O3099M9065q4822q4195K5477q8614j2555L98J48059
$$ 41635 -1440 -55384 -56991 6108 55173 -29649 -113844 -88367 -176981 -189536 -189138 -41079
15525d1079Q0279P6409m8384j69032l15J53096j8341o3525O0461r4661o9622K5544
$$ -41079 39200 115609 67225 -101807 -102122 50974 32633 -30892 29569 -65092 -134714 -109170
15513a09170K5620j23811M605k5968L9319P2563K5380Q0602k514j34041k795J18826
$$ -109170 -83550 -207361 -202756 -228724 -189405 -116842 -91462 -10860 -13374 -147415 -150210 -31384
15501c1384K8124L84O6901j312j41512j68053p9663J8206J51205L3409L2399O5584
$$ -31384 -3260 -2876 64025 62713 -78799 -246852 -326515 -308309 -157104 -123695 -91296 -25712
15489b5712O6462m9796k14822L7700Q5897L1142Q8138k2878m2756j51720q4316
$$ -25712 40750 -9046 -223868 -186168 -100271 -69129 19009 -3869 -46625 -198345 -282661
15478b82661M4524L6600P9892k7360l5609P715R0695O3258j89470o9922J14740
$$ -282661 -238137 -201537 -121645 -149005 -184614 -176899 -86204 -22946 -212416 -282338 -167598
15467a67598J15921P7351m1532R8687P5139K7246l9374j41507k346O0785p3754
$$ -167598 -51677 25674 -15858 82829 157968 185214 145840 4333 1987 62772 -10982
15456a0982n9713L2951Q4426K9573j23416j5175K9468N1053Q4961R4222l6867
$$ -10982 -70695 -37744 46682 76255 -47161 -62336 -32868 18185 103146 197368 160501
15445A60501j96807o0007M0625n5570n3417R4069J24807k4900m9611J09464N5264
$$ 160501 -36306 -96313 -55688 -111258 -164675 -70606 54201 29301 -20310 89154 144418
15434A44418M4887n6092j21458j33452q5597M2767O9161q8834l5127J06604Q7564
$$ 144418 189305 133213 11755 -121697 -207294 -164527 -95366 -184200 -219327 -112723 -25159
15423b5159K5993R107J02476Q0266Q9681l9215j20384j6874K0141r1829l8171
$$ -25159 834 9941 112417 192683 282364 243149 122765 105891 126032 34203 -3968
15412c968j28965k2750N2736J2887j81586L3708n0717m1075O6454l8521J35843
$$ -3968 -132933 -155683 -102947 -90060 -271646 -237938 -288655 -329730 -263276 -301797 -165954
15401a65954L00486J16179j90705k01446m0599R478P0801Q2930J7013p1174n1508
$$ -165954 134532 250711 60006 -141440 -182039 -172561 -101760 -18830 -1817 -72991 -124499
15390a24499L5937O9125j4530p27K7898L1764n3562n684j09176j2853K8408n508
$$ -124499 -88562 -19437 -33967 -34694 -6796 24968 -28594 -34278 -143454 -156307 -127899 -133407
15378a33407J04562j3701N2286O4299j1942m3858L1396o5178J5191r921M1368
$$ -133407 -28845 -42546 9740 74039 62097 18239 49635 -15543 -352 -10273 31095
15367C1095M7947m9676k9159j66458j2374J18794L4665Q5836J83779j13132k29958
$$ 31095 79042 29366 207 -166251 -178625 -59831 -25166 60670 244449 131317 -98641
15356i8641L1264Q5984R328j22166j69760M5882J89175k7586N9244Q6754p5140
$$ -98641 -67377 18607 27935 -94231 -263991 -218109 -28934 -56520 2724 89478 14338
15345A4338J2210J16822m7888q2110K4058K7886p7517O897n9619K1397J75155
$$ 14338 26548 143370 95482 13372 37430 65316 -12201 -5304 -64923 -43526 131629
15334A31629K2672o4473l0201k2414o4629j3539M1792r6164O56P2896J684m9545
$$ 131629 154301 89828 59627 37213 -27416 -40955 837 -95327 -94671 -21775 -20091 -69636
15322f9636J32561J2239p6908Q8246l3660q9460N4162Q6457L6855n6944o2618
$$ -69636 62925 75164 -1744 86502 52842 -36618 17544 104001 140856 83912 21294
15311B1294Q06j30124M8044L3050O0818k7465M551J32236k2162J828k5434j33960
$$ 21294 22100 -108024 -59980 -26930 33888 6423 10974 143210 121048 122876 97442 -36518
15299c6518j36618r8139m1975J5423M1353J12397N2453n23j08773j45262j8857
$$ -36518 -173136 -271275 -313250 -297827 -256474 -144077 -91624 -92147 -200920 -346182 -365039
15288c65039J33791R2949m6650o1314Q0289R8943J28619K2528m6574L2377o2426
$$ -365039 -231248 -138299 -184949 -246263 -165974 -67031 61588 84116 37542 69919 7493
15277G493J03150j02279q7292J7398n6138k3554j12247j01097J8726N9192M5714
$$ 7493 110643 8364 -78928 -61530 -117668 -141222 -253469 -354566 -335840 -276648 -230934
15266b30934J21096J31786m5768M4293r3247r8433o5843O442L4524L9680m1091
$$ -230934 -109838 21948 -23820 20473 -72774 -171207 -237050 -230608 -196084 -156404 -197495
15255a97495L5144m706P8883l400J860n579K8900j6106J2143Q4336J32422Q7770
$$ -197495 -162351 -167057 -88174 -91574 -89714 -95293 -66393 -82499 -70356 13980 146402 234172
15243B34172l3769j47711n4606K9767M604o6241J23356M8108K2821n6664m6652
$$ 234172 200403 52692 -1914 27853 32457 -33784 89572 137680 160501 103837 57185
15232E7185p6386n6232P2983j6499k3710J8029l320l6406K7698k494M5788k2532
$$ 57185 -19201 -75433 -2450 -18949 -42659 -24630 -27950 -64356 -36658 -39152 6636 -15896
15220a5896o5844m7414O3216M6539k2938o283O3220R1292m0197q1047r1589O8017
$$ -15896 -81740 -129154 -65938 -19399 -42337 -48620 14600 105892 65695 -15352 -106941 -38924
15208c8924N1960n2905N0460o1858o7748L1001k7550n305Q9634N0653r6554j42388
$$ -38924 13036 -39869 10591 -51267 -119015 -88014 -115564 -120869 -31235 19418 -77136 -219524
15196b19524N2945l1168k4108J17683Q9943P9426r5713q2436J5819n704J4716
$$ -219524 -166579 -197747 -221855 -104172 -14229 65197 -30516 -112952 -97133 -102837 -88121
15185h8121Q6065P0112P8605Q1896j37951k7034j14723j4044O3294J06342J19660
$$ -88121 -2056 68056 146661 228557 90606 63572 -51151 -65195 -1901 104441 224101
15174B24101j7988j58290l6257k6166n0569p9205q3860n0415J23098J08414L8656
$$ 224101 206113 47823 11566 -14600 -65169 -144374 -228234 -278649 -155551 -47137 -8481
15163h481o9662J9472N4968R3762r8570q1811J53638K7359n8740r0509N3204k0095
$$ -8481 -78143 -58671 -3703 90059 -8511 -90322 63316 90675 31935 -58574 -5370 -25465
15151b5465n5950j00204r6543J60657k0445p5777n1496j6578J75693O7962n9403
$$ -25465 -81415 -181619 -278162 -117505 -137950 -213727 -265223 -281801 -106108 -38146 -97549
15140i7549k5440J28412N8383J104o2101j05196j19711M9903N1102k1929J42990
$$ -97549 -122989 5423 63806 64910 2809 -102387 -222098 -172195 -121093 -143022 -32
15129c2J07086P6017j52062r4940j6537J22057L9418p9074j14266K2574K1845
$$ -32 107054 183071 31009 -63931 -80468 41589 81007 1933 -112333 -89759 -67914
15118f7914P477M6374M0198r5147p0177j8241O2001j10604r9380O7071j6096J08550
$$ -67914 -60437 -14063 26135 -69012 -139189 -157430 -95429 -206033 -305413 -238342 -254438 -145888
15106a45888K5025N8003R7101j01696l5715Q8229n9735o5051P8366M1288n4965
$$ -145888 -120863 -62860 34241 -67455 -103170 -14941 -74676 -139727 -61361 -20073 -75038
15095g5038o9492J65500P827o7542n2565N169N5689O1892j9685m6578j3086J9458
$$ -75038 -144530 20970 28797 -38745 -91310 -86141 -30452 31440 11755 -34823 -47909 -28451
15083b8451K41K5357q8966o2840l1477J8577o8854l2370Q1017n5901J88438j6109
$$ -28451 -28210 -2853 -91819 -154659 -186136 -167559 -236413 -268783 -187766 -243667 -55229 -71338
15071g1338j1819o0154N1941J82807R2646m9547j08196o8608o2014R39K1851M7345
$$ -71338 -83157 -143311 -91370 91437 184083 134536 26340 -42268 -104282 -103343 -81492 -34147
15059c4147K4078L860M6382k6431j0208o462p4786p3548J39285N7758o5089M84
$$ -34147 -10069 -6209 40173 13742 3534 -2928 -77714 -151262 -11977 45781 -19308 -18824
15047a8824o3527k0797L8854k5799J07034M4599j15892p760j27149P870q3831
$$ -18824 -82351 -103148 -64294 -90093 16941 61540 -54352 -62112 -189261 -181391 -265222
15036b65222o4888J75089J05117N7528N5198o4445K17k521j4795J54883o7914
$$ -265222 -330110 -155021 -49904 7624 62822 -1623 -1406 -3927 -18722 136161 68247
15025F8247L5266j53230r7584J42974K9295R1739j54775o8460K1922J29518J7815
$$ 68247 103513 -49717 -147301 -4327 24968 116707 -38068 -106528 -84606 44912 62727
15014F2727l6281r4075j3067o5900O4165R8201O049l6791N1550N2661L5868r8382
$$ 62727 26446 -67629 -80696 -146596 -82431 15770 21819 -14972 36578 89239 125107 26725
15002B6725j2188j36299L2533K46433N8430j8463j37131j86549M3585J97623q112
$$ 26725 14537 -121762 -89229 157204 215634 197171 60040 -126509 -82924 114699 106587
14991A06587j14753j27309n2927J20706K0858r0810r437k0213N1847J01325l6854
$$ 106587 -8166 -135475 -188402 -67696 -46838 -137648 -147085 -167298 -115451 -14126 -50980
14980e0980k9799Q928n6827J44145J16936m8821r2396l8181o2248P5677J10378
$$ -50980 -80779 -71851 -128678 15467 132403 83582 -8814 -46995 -109243 -33566 76812
14969G6812o4828O0684k0037o805q9257j5860J39388M824m0848K5017K6429J1643
$$ 76812 11984 72668 52631 45826 -43431 -59291 80097 84921 44073 69090 95519 107162
14957A07162j5070j1723l505Q7793k9164j96624L8083j01410J1932j5526M9856
$$ 107162 92092 80369 76864 164657 135493 -61131 -23048 -124458 -112526 -128052 -78196
14946g8196j6258m1322J1223o7935L4777J7799r0650K4303J31786P376j39504
$$ -78196 -94454 -135776 -124553 -192488 -157711 -139912 -230562 -206259 -74473 -67097 -206601
14935b06601P0065J0651r171K127J4470L8912P1721p8482j15732q217K9584O3563
$$ -206601 -136536 -125885 -135056 -132929 -118459 -79547 -7826 -86308 -202040 -210257 -180673 -117110
14923a17110Q4876J21324L8302j14504O5587k3097O9956K9215j5146j08342o2800
$$ -117110 -32234 89090 127392 12888 78475 55378 125334 154549 139403 31061 -31739
14912c1739q4004L6443n5002n4029p2350n7967P2734Q4597k4547k143L0005m6548
$$ -31739 -115743 -79300 -134302 -188331 -260681 -318648 -245914 -161317 -185864 -188007 -158002 -204550
14900b04550K5115K079j3519J13811R6102j36608j41923L2665J41986R2147J6311
$$ -204550 -179435 -177356 -190875 -77064 19038 -117570 -259493 -226828 -84842 7305 23616
14889B3616P3816m8223q4033O927P1963k2678M5345Q0070m0146m0208j44567m8809
$$ 23616 97432 49209 -34824 -27897 44066 21388 66733 146803 106657 66449 -78118 -126927
14877a26927r8694r7869j5295J63247K11627N2635j6804n1422j4171M7568j7670
$$ -126927 -225621 -323490 -338785 -175538 36089 88724 71920 20498 6327 53895 36225
14866C6225n2905L953j9621k4631Q1208K0672q1376N6697O5830k4138K5815j50500
$$ 36225 -16680 -12727 -32348 -56979 24229 44901 -36475 20222 86052 61914 87729 -62771
14854f2771p236N3191n7750L4223L4557J0197J29754L6800j40342j77897k7240
$$ -62771 -70007 -16816 -74566 -40343 -5786 4411 134165 170965 30623 -147274 -174514
14843a74514L7659K6588Q0006K7992L3195R0294L335k7840J07702m784j77165
$$ -174514 -136855 -110267 -30261 -2269 30926 121220 124555 96715 204417 199633 22468
14832B2468j14632J474P6964Q1798n4080j33836j1611O7199K1336l096K5101j26260
$$ 22468 -92164 -90690 -13726 68072 13992 -119844 -131455 -64256 -42920 -46016 -20915 -147175
14820a47175O767J17178M8673q0041q3532L5114R3361k068j03894n0435K8339
$$ -147175 -140408 -23230 25443 -54598 -138130 -103016 -9655 -11723 -115617 -166052 -137713
14809a37713Q6732O3630L4361N9230k24868J1l135O5370M1333o2439MJ4092r88
$$ -137713 -50981 12649 47010 106240 -118628 -118617 -121752 -56382 -15049 -77488 -77484 -63392 -64380
14796f4380L4331L0089J7092Q0047r8566j1371P6833Q6541q9107j32572O8436
$$ -64380 -30049 40 17132 97179 -1387 -12758 64075 150616 61509 -71063 -2627
14785b627j83162j07873J50781j2965o6067K3653J0345l0554n9821Q4401J59594
$$ -2627 -185789 -293662 -142881 -155846 -221913 -198260 -187915 -218469 -278290 -193889 -34295
14774c4295Q0822p7615O358L9851p4720j59329Q6147N4136p9339L4945J03472
$$ -34295 46527 -31088 -24730 15121 -59599 -218928 -132781 -78645 -157984 -123039 -19567
14763a9567l0623j24854k6750Q9592M3381O5445R8810o1533N2920j06226j1909
$$ -19567 -50190 -175044 -201794 -112202 -68821 -3376 95434 33901 86821 -19405 -31314
14752c1314J94495P0263j76638j23213M4687O201K9413l5841o1338K0784n8437
$$ -31314 163181 233444 56806 -66407 -21720 -15519 13894 -21947 -83285 -62501 -120938
14741a20938o4797K1345O8254N4696O7347R2786J24153q2197K7815p2206p8794
$$ -120938 -185735 -164390 -96136 -41440 25907 118693 242846 160649 188464 116258 37464
14730C7464j19496J9782K3882m1160l3876K511j1216J32064n1540R9307Q7875
$$ 37464 -82032 -62250 -38368 -79528 -113404 -110893 -122109 9955 -41585 57722 145597
14719A45597Q583j54362k3087j1412j58777K5084J54341J2996l1384m1537m231
$$ 145597 154180 -182 -23269 -34681 -193458 -168374 -14033 -1037 -32421 -73958 -78189
14708g8189P8395n0930P4701J34992l8377k11358r3708K0737O8487k7247K2846
$$ -78189 206 -50724 23977 158969 120592 -90766 -184474 -163737 -95250 -122497 -99651
14697i9651O1953l1502j17392n7599L6408N5897N1172P2862J97930m0829j05761
$$ -99651 -37698 -69200 -186592 -244191 -207783 -151886 -100714 -27852 170078 129249 23488
14686B3488k20786j38n6320k3277K12000J64476M4124j3266j44825l4440l568
$$ 23488 -197298 -197436 -253756 -277033 -65033 99443 143567 130301 -14524 -48964 -52532
14675e2532M1389j1766m7566q0158r580J92610J72575m4103m1803j4066N3651
$$ -52532 -11143 -22909 -70475 -150633 -160213 32397 204972 160869 119066 105000 158651
14664A58651N7172k5401j57483j11129L8602Q6277M252p6893k03398l5857O6348
$$ 158651 215823 190422 32939 -78190 -39588 46689 50941 -25952 -229350 -265207 -198859
14653a98859O6412Q8126N9148R8135N6573j33928o0088K9033n6146m8230q012
$$ -198859 -132447 -44321 14827 112962 169535 35607 -24481 4552 -51594 -99824 -107836
14642a07836J971n430J21809M8390L5669j25881j57762J20715R9840R2028n739
$$ -107836 -105865 -111295 10514 58904 94573 -31308 -189070 -68355 31485 123513 117774
14631A17774o5167q3975j22690M3172K1190J11135K03549n4191j15888r1586K1831
$$ 117774 52607 -31368 -154058 -110886 -89696 21439 224988 170797 54909 -36677 -14846
14620a4846O7987n7968k4506j54262p5291J60785K25658J33004o1109j24849q8347
$$ -14846 53141 -4827 -29333 -183595 -258886 -98101 127557 260561 199452 74603 -13744
14609a3744J38661m477o1499j50118j47753J08365Q1578M984j05245r1507K9046
$$ -13744 124917 120440 58941 -91177 -238930 -130565 -48987 -44003 -149248 -240755 -211709
14598b11709J9359J8270M8472J30600m849j29391o4979J10929J08384O8509K236
$$ -211709 -192350 -174080 -125608 4992 143 -129248 -194227 -83298 25086 93595 95831
14587I5831O62J06888n5808q4179m442L7483P5k7395l5203P7691Q0477j52446
$$ 95831 96493 203381 147573 63394 58952 96435 96510 69115 33912 111603 192080 39634
14575C9634l7896N226M7707P5053P9120k9831j44101m6818L4805O5999M6711r1213
$$ 39634 1738 6964 54671 129724 208844 179013 34912 -11906 22899 88898 135609 44396
14563D4396j18069j09430Q7N8185k5282k7006j00160Q2482P1913J20284m0705
$$ 44396 -73673 -183103 -183016 -124831 -150113 -177119 -277279 -194797 -122884 -2600 -43305
14552d3305j8747P5398Q8024J68196j1917j95670r9827K3651L7537o6000j41839
$$ -43305 -62052 13346 101370 269566 257649 61979 -37848 -14197 23340 -42660 -184499
14541a84499l294j0262R40J26590J50513j8920j59567q1624l0041J03371J49089
$$ -184499 -187793 -198055 -197115 -70525 79988 61068 -98499 -180123 -210164 -106793 42296
14530D2296K2000k2452J08325O2739l0969n7065m8047j00642J02828J67761J13917
$$ 42296 64296 41844 150169 212908 181939 124874 76827 -23815 79013 246774 360691
14519C60691l7695k2342k8047j33912k4939j044p8534j00543r0165J06857J1582
$$ 360691 322996 300654 272607 138695 113756 112712 34178 -66365 -156530 -49673 -38091
14508c8091J6414P0827P5037q9k2083m5923m4989R2646K00592l0404m0455m0220
$$ -38091 -21677 49150 124187 124098 102015 56092 11103 103749 304341 273937 233482 193262
14496A93262n5069O3744J22645K3577j66282j61504j0300o4076n5445L1528J48047
$$ 193262 138193 201937 324582 348159 181877 20373 10073 -54003 -109448 -77920 70127
14485G0127K6995o9172J27138n0568J07612l0510n1084j34928j33269O6599M5148
$$ 70127 97122 27950 155088 104520 212132 181622 130538 -4390 -137659 -71060 -25912
14474b5912m3723l1424l5398J4388P9268K6644k1628k9056J5287O605r894O9562
$$ -25912 -69635 -101059 -136457 -122069 -42801 -16157 -37785 -66841 -51554 -44949 -54843 14719
14462A4719m8070J2806k0298j14870P1044m002k8999J64827n5408n2072J03761
$$ 14719 -33351 -20545 -40843 -155713 -84669 -88671 -117670 47157 -8251 -60323 43438
14451D3438J10093L3137r4782j34932o7336l8352m3798M7124L8826Q3282O90R8680
$$ 43438 153531 186668 91886 -43046 -110382 -148734 -192532 -145408 -106582 -23300 -22610 76070
14439G6070k9312n521k4179j07851n3094R6937R5162M7279n0860q1835J0292o0858
$$ 76070 46758 41237 17058 -90793 -143887 -46950 48212 95491 44631 -37204 -26912 -87770
14427h7770L6294R6700j60215M0464L1370q1961j02710J72141J54123j9877n3276
$$ -87770 -51476 45224 -114991 -74527 -43157 -125118 -227828 -55687 98436 78559 25283
14416B5283K2582l9769J704Q7070j25087J6618j05513L9483L0615j07521J29731
$$ 25283 47865 8096 9800 96870 -28217 -11599 -117112 -77629 -47014 -154535 -24804
14405b4804O6209J8503q3110M8025q8594L0129O8861k66339j36815J24556k7234
$$ -24804 41405 59908 -23202 24823 -63771 -33642 35219 -231120 -367935 -243379 -270613
14394b70613J07512J02317r481P6396L1729K9749J4816K661Q0939m3036j53274
$$ -270613 -163101 -60784 -70265 6131 37860 67609 82425 85086 166025 122989 -30285
14383c0285k4276n5900n2405J13124q6292n7253K06508j668j19749l4982l9904
$$ -30285 -54561 -110461 -162866 -49742 -136034 -193287 13221 11553 -108196 -143178 -183082
14372a83082k8561M3935K1302O2259J00994j7539p4624m2614M4828K9760m9157
$$ -183082 -211643 -167708 -146406 -84147 16847 -692 -75316 -117930 -73102 -43342 -92499
14361i2499n6664P6456K9655m1327L9464M9513o8179q0875k7092m9532m5644p8329
$$ -92499 -149163 -72707 -43052 -84379 -44915 4598 -63581 -144456 -171548 -221080 -266724 -345053
14349c45053p6952J99731Q9836J80669L8956K4319L9185m6696j9503q4812J3103
$$ -345053 -422005 -222274 -132438 48231 87187 111506 150691 103995 84492 -320 12783
14338A2783J16798j11563j17042J5888K4820K3584p688J7693P3454p5514j32217
$$ 12783 129581 18018 -99024 -83136 -58316 -34732 -42420 -24727 48727 -26787 -159004
14327a59004q9461o5713J80939K13016j3834o9299n8352j0232k9868q876J69736
$$ -159004 -248465 -314178 -133239 79777 65943 -3356 -61708 -71940 -101808 -110684 59052
14316E9052K19952j1371j7177j6379N0401N7544j49910j05300j88236o3530N9552
$$ 59052 279004 267633 250456 234077 284478 342022 192112 86812 -101424 -164954 -105402
14305a05402J82743J03042l4899k6257r776j2672N7376j00815j72430q5437j281
$$ -105402 77341 180383 145484 119227 109451 96779 154155 53340 -119090 -204527 -205808
14294b05808Q5911K8801n254k8021p4186R7174P7640j4511J11478O2898j34731
$$ -205808 -119897 -91096 -96350 -124371 -198557 -101383 -23743 -38254 73224 136122 1391
14283A391J4939J1015N1875n7941p6231K088L9914Q7430N185n9109n8301J32795
$$ 1391 16330 27345 79220 21279 -54952 -52864 -12950 74480 79665 20556 -37745 95050
14271I5050k2250j78989J8230o6290q745O7596J19229J11148J38520N3876l0565
$$ 95050 72800 -106189 -87959 -154249 -162994 -95398 23831 134979 273499 327375 296810
14260B96810k02158j41371j48581J1408j04854J4636O3465K8576J38070K9773
$$ 296810 94652 -46719 -195300 -183892 -288746 -274110 -210645 -182069 -43999 -14226
14250a4226p2927N9108M4008M2368n9155o5722M2039R2779L631K9695j26352j85218
$$ -14226 -87153 -28045 15963 58331 -824 -66546 -24507 68272 71903 101598 -24754 -209972
14238b09972R6379J0438j40350l1989J26577J28671k0876N895L6592Q7810q339
$$ -209972 -113593 -103155 -243505 -275494 -148917 -20246 -41122 -35227 1365 89175 80836
14227H0836j9552J68560J07202Q806k0657j50292o7251K0652J7069Q5265l074
$$ 80836 61284 229844 337046 345852 325195 174903 107652 128304 145373 230638 227564
14216B27564q9203j40666k0185l7575r5832J09517k6273l2865J123J3734N6975
$$ 227564 138361 -2305 -22490 -60065 -155897 -46380 -72653 -105518 -104395 -90661 -33686
14205c3686j7707L331n3203n6548R0335N7407m7825n6547k4921J45820K84204
$$ -33686 -51393 -48062 -101265 -157813 -67478 -10071 -57896 -114443 -139364 6456 290660
14194B90660m7113p2298J3604k094m3530r8727j08607J07248J58540j2991P985
$$ 290660 243547 171249 184853 182759 139229 40502 -68105 39143 197683 184692 192677
14183A92677J01492J32581j79997k37576M7563O4754j08004m6445J38708j72538
$$ 192677 294169 426750 246753 9177 56740 121494 13490 -32955 105753 -66785
14173f6785j51345R2136P2274l2638k5659l9124Q4907K23739P6549p7274j4039
$$ -66785 -218130 -125994 -53720 -86358 -112017 -151141 -66234 157505 234054 156780 142741
14162A42741r4900J5559j91267j66819Q5936P2939J06494J13838J03436j9390
$$ 142741 47841 63400 -127867 -294686 -208750 -135811 -29317 84521 187957 168567
14152A68567p4385j7732j00184l179J4925o985n6718J69280J24555j02050j25942
$$ 168567 94182 76450 -23734 -26913 -11988 -18973 -75691 93589 218144 116094 -9848
14141i848o61N6820M0651n9459k2930O3587K0497j4532n0911N3580n1726j25115
$$ -9848 -10509 46311 86962 27503 4573 68160 88657 74125 23214 76794 25068 -100047
14129a00047j3011j82443j16850J98421J27561P4880K05333l940j92910k7118
$$ -100047 -113058 -295501 -412351 -213930 -86369 -11489 193844 189904 -3006 -30124
14119c0124N6757k917m6035J17010O7765q5464k4310M8138J27330k5394r1622
$$ -30124 26633 23716 -22319 94691 162456 76992 52682 100820 228150 202756 111134
14108A11134J14463m0999o4571m9360p9675L718O1855K620p6720L2590j9998k6554
$$ 111134 225597 184598 120027 70667 -9008 -5290 56565 59185 -17535 15055 -4943 -31497
14096c1497L9191k7210J3985M2730Q5445o966o5181l712n0164J8561q456m5658
$$ -31497 7694 -19516 -5531 37199 122644 115678 50497 46785 -3379 15182 6726 -38932
14084c8932k0167M6231K2142J03986R3416J244j07041k51371l09J65577J2383
$$ -38932 -59099 -12868 9274 113260 206676 207920 100879 -150492 -150801 14776 27159
14073B7159p3632j53573l5104L4978k6892J5488L9514j7110J68011K8467j25973
$$ 27159 -46473 -200046 -235150 -200172 -227064 -211576 -172062 -189172 -21161 7306 -118667
14062a18667O9467R3450K5260l6490l5718K6546k1892p8749R6409N5807k9922
$$ -118667 -49200 44250 69510 33020 -2698 23848 1956 -76793 19616 75423 45501
14051D5501j4706j29670m6668J53771N220k5204K8536J7299N7025k1727k3468
$$ 45501 30795 -98875 -145543 8228 13448 -11756 16780 34079 91104 69377 45909
14040D5909O760J54050J2287P6438j5761p750n1062r4492k3661o2915j59720j62452
$$ 45909 52669 206719 219006 295444 279683 271933 220871 126379 102718 39803 -119917 -282369
14028b82369k6103K03580J4181j5607J07431J34928r2688r5800N0581P9953P4946
$$ -282369 -308472 -104892 -90711 -106318 1113 136041 43353 -52447 -1866 78087 153033
14017A53033n5252j27187J0453J29384N1408p4683J2103M0556j18669j20571o516
$$ 153033 97781 -29406 -18953 110431 161839 87156 99259 139815 21146 -99425 -105941
14006a05941L1524K41578m3059j22072J0488k4168l6865j4090R5170J18094K4202
$$ -105941 -74417 167161 124102 2030 12518 -11650 -48515 -62605 32565 150659 174861
13995A74861m5062K6283n6442j57064k8979j5252k8614j14361K285N9998k8133
$$ 174861 129799 156082 99640 -57424 -86403 -101655 -130269 -244630 -242345 -182347 -210480
13984b10480J7558k9198k4175K16763J23846j53808j23685J29200M3676j1769
$$ -210480 -192922 -222120 -246295 -29532 94314 -59494 -183179 -53979 -10303 -22072
13974b2072J49243J37461r2776j31882r0120M6915L3987r74o7490P3000m2686
$$ -22072 127171 264632 171856 39974 -50146 -3231 30756 29782 -37708 35292 -7394
13963g394j68419n2184J98939R05j7402J0142k2664l5587R5289O2538p2686n5612
$$ -7394 -175813 -227997 -29058 -28153 -45555 -35413 -58077 -93664 1625 64163 -8523 -64135
13951f4135o309j09856O4208J43867J21330k4590r456p347J00108j02891N1372
$$ -64135 -70444 -180300 -116092 27775 149105 124515 115059 107712 207820 104929 156301
13940A56301M5581l1448j22413q1241K0955J0077J6153l4241n522j61789r1868
$$ 156301 201882 170434 48021 -33220 -12265 -2188 13965 -20276 -25798 -187587 -279455
13929b79455N8213K27100m5009p3706N1986r0269o6245N8694J61846J53736p9706
$$ -279455 -221242 5858 -39151 -112857 -60871 -151140 -217385 -158691 3155 156891 77185
13918G7185m5836J5088K7511K4563L6338o2336j6632k2369m9430R9289J06596
$$ 77185 31349 46437 73948 98511 134849 72513 55881 33512 -15918 83371 189967
13907A89967n6636p4684N2545N6319L3926p6552j82097q3484J4704K15608L5462
$$ 189967 133331 58647 111192 167511 201437 124885 -57212 -140696 -125992 89616 125078
13896A25078k1425j9606o7126j3087N6339M2454n949m3241k9470q2863L5673N3345
$$ 125078 103653 84047 16921 3834 60173 102627 96678 53437 23967 -58896 -23223 30122
13884C0122m4344q4929K7062J08821L6653o3585L4249J08725J87863j01807j20501
$$ 30122 -14222 -99151 -72089 36732 73385 9800 44049 152774 340637 238830 118329
13873A18329n0086l8456k05251K6141R1375O0597k3557l7986Q5830k7545j11300
$$ 118329 68243 29787 -175464 -149323 -57948 2649 -20908 -58894 26936 -609 -111909
13862a11909m9124j5259O0668J20094Q3307j4211o5051J6604n5236j52115N8980
$$ -111909 -161033 -176292 -115624 4470 87777 73566 8515 25119 -30117 -182232 -123252
13851a23252J70945R6951j00977r4234J35269R5466o9657p2026J3886M6168K4255
$$ -123252 47693 144644 43667 -50567 84702 180168 110511 38485 52371 98539 122794
13840A22794J22124o2578p6298j04850n9416l107n0524J27624J26771q2843j24448
$$ 122794 244918 182340 106042 1192 -58224 -61331 -111855 15769 142540 59697 -64751
13829f4751K5860J9381O8225j71147j6989K2041R2005K6576n6044O8847J5093
$$ -64751 -38891 -19510 48715 -122432 -139421 -117380 -25375 1201 -54843 14004 29097
13818B9097Q7889N4039Q797j21951p2441r0362N7718J71697k3772r672J5146m9777
$$ 29097 116986 171025 179822 57871 -14570 -104932 -47214 124483 100711 91039 106185 56408
13806E6408L5324j05190k327K4892N4722m6657j7282p3787o403L1760K0958j35186
$$ 56408 91732 -13458 -15785 9107 63829 17172 -110 -73897 -80300 -48540 -27582 -162768
13794a62768n1847K33805J81105n692j10030j10628m1291l4357j7671O7242J71416
$$ -162768 -214615 19190 200295 194603 84573 -26055 -67346 -101703 -119374 -52132 119284
13783A19284J05973n8088m6966j58416q47J1705M2279J77561l2143p9245K4429
$$ 119284 225257 167169 120203 -38213 -39060 -27355 14924 192485 160342 81097 105526
13772A05526k1584j37962j5200J51198J51374J1623j08979j8733q4649q2641N3983
$$ 105526 83942 -54020 -69220 81978 233352 244975 135996 117263 32614 -50027 3956
13761C956o3104j7253R3276J8343j71L3933j9412O920P7645R955j70980l7464
$$ 3956 -59148 -76401 16875 35218 35047 68980 49568 56488 134133 144088 -26892 -64356
13749f4356k4909R2074K9974J29321j1230k38260l658J41923q133Q6409q3326
$$ -64356 -89265 2809 32783 162104 150874 -87386 -91044 50879 42746 129155 45829
13738D5829j30846l3261J24690M3271p2710k8130k399L5783R9868J18493J19009
$$ 45829 -85017 -118278 6412 49683 -23027 -51157 -53556 -17773 82095 200588 319597
13727C19597P318n1996j36802r3329j44349M3265J67897M7758O7346M770o9175
$$ 319597 326915 274919 138117 44788 -99561 -56296 111601 159359 226705 231475 162300
13716A62300m8614j74046m3660K4609K2495r164l104N3334k2012j63735p7949
$$ 162300 113686 -60360 -104020 -79411 -56916 -66080 -69184 -15850 -37862 -201597 -279546
13705b79546J35620Q1795J5751n4038l207K11835Q4339j36865k3968n835q4339
$$ -279546 -143926 -62131 -46380 -100418 -103625 108210 192549 55684 31716 25881 -58458
13694e8458j31722J07509K20357Q0481Q1116j23328j96740K6743p2020m6445J6630
$$ -58458 -190180 -82671 137686 218167 299283 175955 -20785 5958 -66062 -112507 -95877
13683i5877p113o8720m7951O1411J92797m4506j39815M6125N0650R7501k8852
$$ -95877 -102990 -171710 -219661 -158250 34547 -9959 -149774 -103649 -52999 44502 15650
13672A5650n6295J28725P5125P9986O2195j1962L8655j15299r9432j14150J35827
$$ 15650 -40645 88080 163205 243191 305386 293424 332079 216780 117348 3198 139025
13661A39025N2071q4375m2998n8496r0303K4493J16826J30024k9843j19413j6970
$$ 139025 191096 106721 63723 5227 -85076 -60583 56243 186267 156424 37011 20041
13650B0041J9204o770P23o9217p0315P1793N8893j4864p3656l2169r9122n7077
$$ 20041 39245 32475 33198 -36019 -106334 -34541 24352 9488 -64168 -96337 -195459 -252536
13638b52536P4474J01517J55988J1673l3762L8853m2138J01407o834p1994J66226
$$ -252536 -178062 -76545 79443 91116 57354 96207 54069 155476 148642 76648 242874
13627B42874R8618j5377j30935P5417n7176j03205j52466j53144O1768M6522n3384
$$ 242874 341492 326115 195180 270597 213421 110216 -42250 -195394 -133626 -87104 -140488
13616a40488n2031N8148O3966N3552J5041O1254k0737J03431k7150j10490j1606
$$ -140488 -192519 -134371 -70405 -16853 -1812 59442 38705 142136 114986 4496 -7110
13605g110m3649r0955j37324N3575Q5806J31758O9334J7302o8087q3457j33371
$$ -7110 -50759 -141714 -279038 -225463 -139657 -7899 61435 78737 10650 -72807 -206178
13594b06178k6156N7182O8232L8658J6314L9927R2497L3176O044O9155n6248j28949
$$ -206178 -232334 -175152 -106920 -68262 -51948 -12021 80476 113652 119696 188851 132603 3654
13582C654j00854Q0008j0025J28246P9503k3584k5018p0983q7507O7421K9232
$$ 3654 -97200 -17192 -27217 101029 180532 156948 131930 60947 -26560 40861 70093
13571G0093j55510o1714J25454J72419l5929o8134m1289P7032n0515o7029R8592
$$ 70093 -85417 -147131 -21677 150742 114813 46679 5390 82422 31907 -35122 63470
13560F3470l1190j50157R8010J4075J0562j8165j0187L6796O4900K6649J6236
$$ 63470 32280 -117877 -19867 -5792 4770 -13395 -23582 13214 78114 104763 120999
13549A20999j8794O9980m9161o7056M6915J28977Q5057r6486n4066j7353P753
$$ 120999 102205 172185 123024 55968 102883 231860 316917 220431 166365 149012 156765
13538A56765o9534J42016J7704j09188q8160P80k0233J11489N6073M31k5103k0692
$$ 156765 87231 229247 246951 137763 49603 50383 30150 141639 197712 198143 173040 152348
13526A52348J42200O3732j50489j50112M4128k5401j6013M2171P683l1639n4918
$$ 152348 294548 358280 207791 57679 101807 76406 60393 102564 110247 78608 23690
13515B3690M532j02662J54248J78012l7350j6780P206j06035j07212k4636J98269
$$ 23690 28222 -74440 79808 257820 220470 203690 210896 104861 -2351 -26987 171282
13504A71282R3208o9805p7101J19187r0900j7422M8208o0841n0418j9894P6959
$$ 171282 264490 194685 117584 236771 145871 128449 176657 115816 65398 45504 122463
13493A22463J13279N7789j06620j02853p4583M7435m0913N2241J59372Q2197o1560
$$ 122463 235742 293531 186911 84058 9475 56910 15997 68238 227610 309807 248247
13482B48247p0533j20540l9575R6907J17944M6713l7389j96243o6348P6150J60134
$$ 248247 177714 57174 17599 114506 232450 279163 241774 45531 -20817 55333 215467
13471B15467m560j23920P805J25643J1856j400o9163n5423j20725J6338P9628
$$ 215467 210907 86987 94792 220435 232291 230891 161728 106305 -14420 1918 81546
13460H1546n0405j07304J5196R8090m065K402l4812Q9178l2729k0449K4327L3991
$$ 81546 31141 -76163 -60967 37123 33058 35460 648 89826 57097 36648 60975 94966
13448I4966q4903o8761P8113J9318n3664j24361O3619N2891K0041n7328J05376
$$ 94966 10063 -58698 19415 38733 -14931 -139292 -75673 -22782 -2741 -60069 45307
13437D5307N6641O897r8531J17902J44139j133q4370n7995n5286L3456m8252J4428
$$ 45307 101948 108845 10314 128216 272355 271222 186852 128857 73571 107027 58775 73203
13425G3203M8641n566k587l9666L3489l746R149p5969j58663k3179L1362j887
$$ 73203 121844 116278 113691 74025 107514 103768 112917 36948 -121715 -144894 -113532 -115419
13413a15419N1979J75645J15993K7134q1175j14049r6734L9434P4351J8315p9875
$$ -115419 -63440 112205 228198 255332 174157 60108 -36626 2808 77159 95474 15599
13402A5599n7732l3775N222M6822l409j9618J4014K5323m4236j29530M9173P3534
$$ 15599 -42133 -75908 -70686 -23864 -27273 -46891 -32877 -7554 -51790 -181320 -132147 -58613
13390e8613J31326K7249o4170l1852J10702P3469K876o7229p8064L7722j6197
$$ -58613 72713 99962 35792 3940 114642 188111 190987 123758 45694 83416 67219
13379F7219k0310L2229K6851L2533M6825n2207N1419L9353m4713J4519K7057j1636
$$ 67219 46909 79138 105989 138522 185347 133140 184559 223912 179199 193718 220775 209139
13367B09139p326N3430j47071J1903M4896r7660j97068p847R4453P2977J7084
$$ 209139 201813 255243 108172 120075 164971 67311 -129757 -137604 -43151 29826 46910
13356D6910l8043Q233J086L6886J26065K3384l7663q6559j89737L4542N523j1802
$$ 46910 8867 17100 18186 55072 181137 204521 166858 80299 -109438 -74896 -69373 -81175
13344h1175k9639N0322L9630M5857O717P6928J22697J29707l4311j68215j20654
$$ -81175 -110814 -60492 -20862 24995 31712 108640 231337 361044 326733 158518 37864
13333C7864l3345l2794Q8040n6980l585R8041k0172N0628q2948o970J5490O09
$$ 37864 4519 -28275 59765 2785 -800 97241 77069 127697 44749 37779 53269 53878
13321E3878M975K3661k1315m1015k4443J7095r8576p2708K488P6314J37789O4378
$$ 53878 58853 82514 61199 20184 -4259 12836 -85740 -158448 -155960 -79646 58143 122521
13309A22521r7131N2868p0002l2389P4484N6354k9381j08480j11469j5575K0590
$$ 122521 25390 78258 8256 -24133 50351 106705 77324 -31156 -142625 -158200 -137610
13298a37610Q2735J8995p600k6506j29281L1477R2974q7984L5463J73372l4017
$$ -137610 -54875 -35880 -43480 -69986 -199267 -167790 -74816 -162800 -127337 46035 12018
13287A2018R0530Q2023k38714m1566R3562M8932J9608j10235j52089Q5044L498
$$ 12018 102548 184571 -54143 -95709 -2147 46785 66393 -43842 -195931 -110887 -107389
13276a07389n7173J02655n9875k9338j831K03886J07210j2781j414j1445K2548
$$ -107389 -164562 -61907 -121782 -151120 -152951 50935 158145 145364 143950 132505 155053
13265A55053k665M317m9160J50860J62358j56147l1651j39439j22445o5518K9807
$$ 155053 152388 156705 107545 258405 420763 264616 232965 93526 -28919 -94437 -64630
13254f4630M8366R2480k606j37848j2548Q1860K1561m6444j2896J09444L5505
$$ -64630 -16264 76216 73610 -64238 -76786 5074 26635 -19809 -32705 76739 112244
13243A12244j11199m8521o5047k1791N1735J39850J07049N7582j49882q0794L1209
$$ 112244 1045 -47476 -112523 -134314 -82579 57271 164320 221902 72020 -8774 22435
13232B2435k6850M7545J3905j183m177P1933J99998k2164j64423r0737O462p6440
$$ 22435 -4415 43130 57035 55852 51675 123608 323606 301442 137019 46282 52744 -23696
13220b3696K0626J17008J30548L4468j89572j12199N1445P22J822M2944J74212
$$ -23696 -3070 113938 244486 278954 89382 -22817 28628 29350 31172 74116 248328
13209B48328p7774j35687N3602N6075j267o4925o2766J28822R3013O4039q1918
$$ 248328 170554 34867 88469 144544 143277 78352 15586 144408 237421 301460 219542
13198B19542o3138l9885k3545m9273M1584m4930l7346q3776P7288O7475k5305
$$ 219542 156404 116519 92974 43701 85285 40355 3009 -80767 -3479 63996 38691
13187C8691J00290M577J2065k438L1247p0620p4315j0537J30457m4890k2223p7558
$$ 38691 138981 143558 155623 153185 184432 113812 39497 28960 159417 114527 92304 14746
13175A4746M2719k8129l5041J5415q5689O2971J27779j0438q6030k8329n3284
$$ 14746 57465 29336 -5705 9710 -75979 -13008 114771 104333 18303 -10026 -63310
13164f3310J8086l7178r3153j22624M5816O5936Q9422P1376R2229Q1530j1607
$$ -63310 -45224 -82402 -175555 -298179 -252363 -186427 -97005 -25629 66600 148130 136523
13153A36523o9533k2344P5735P2793m516k02570r0644o9672J15706J30566Q2119
$$ 136523 66990 44646 120381 193174 188658 -13912 -104556 -174228 -58522 72044 154163
13142A54163p0280L1855o771P3222n8294p9922j37275m4113J6127l2941J2314
$$ 154163 83883 115738 108967 182189 123895 43973 -93302 -137415 -121288 -154229 -141915
13131a41915K7369R8672J28518j52038n6773K7857J18463l699K5045J45386j11492
$$ -141915 -114546 -15874 112644 -39394 -96167 -68310 50153 46454 71499 216885 105393
13120A05393j03974J02604j04q0627J41285K8415J4950p4917j04611N5722q3769
$$ 105393 1419 104023 103919 23292 164577 192992 207942 133025 28414 84136 367
13109C67l1366J09690j530l3314J8120j2244Q616l9788q4191K1520N2767J03790
$$ 367 -30999 78691 77161 43847 61967 49723 58339 18551 -65640 -44120 8647 112437
13097A12437O8925n6578q6479j3423j1434q8244L5148o3564k0195J38630M4349
$$ 112437 181362 124784 38305 24882 13448 -74796 -39648 -103212 -123407 15223 59572
13086E9572q457j35296N735o044j8311R9386P7292J8496l4244P8746k1948j1738
$$ 59572 51115 -84181 -78446 -84490 -102801 -3415 73877 92373 58129 136875 114927 103189
13074A03189P4653K2706n6623m7533J3108M5027J12779K2647j32069q5674n3858
$$ 103189 177842 200548 143925 96392 109500 154527 267306 289953 157884 72210 18352
13063A8352m2540j90931K2134N7005K1499J84330P7315k7007o6690j10554J34035
$$ 18352 -24188 -215119 -192985 -135980 -114481 69849 147164 120157 53467 -57087 76948
13052G6948J8264j22606J10326Q5147o5331j50288o6637J48407J691O844J4838
$$ 76948 95212 -27394 82932 168079 102748 -47540 -114177 34230 35921 42765 57603
13041E7603j03346J4512J93945O7973j70616l9734p960m2804J9k0052k9514L9942
$$ 57603 -45743 -31231 162714 230687 60071 20337 12377 -30427 -30408 -50460 -79974 -40032
13029d0032Q1295r6469j53773m3013J13200J41607J04868q0041Q7932L8639j54675
$$ -40032 41263 -55206 -208979 -251992 -138792 2815 107683 27642 115574 154213 -462
13018d62n7067j9029j3809r8656N1469J72922J05805L5376n6802L7521J39725
$$ -462 -57529 -76558 -90367 -189023 -137554 35368 141173 176549 119747 157268 296993
13007B96993k12n3168J433j17735k6479N0192K4059r708k3473q6901r9708j40210
$$ 296993 296781 243613 245046 127311 100832 151024 175083 165375 141902 55001 -44707 -184917
12995a84917j0908J17941O8702P4697K5605R1122O110J40527k9618p1184l3959
$$ -184917 -195825 -77884 -9182 65515 91120 182242 188352 328879 299261 228077 194118
12984A94118K2806j23720n4087M0323O3120J62j4009R0521j5249k5919l9607o6857
$$ 194118 216924 93204 39117 79440 142560 142722 128713 219234 203985 178066 138459 71602
12972G1602j7492P6061J4572o6450q2390K6033J12080p7404n0969k8750J3193
$$ 71602 54110 130171 144743 78293 -4097 21936 134016 56612 5643 -23107 -9914
12961i914N7638M5339j6684j396O955p0212j20892m8147K02511L4187o2544J9984
$$ -9914 47724 93063 76379 74983 81938 11726 -109166 -157313 45198 79385 16841 36825
12949C6825j2967M8649N4775j09090K5653P7227k3121M0172m4939q4324o728l5487
$$ 36825 23858 72507 127282 18192 43845 121072 97951 138123 93184 8860 2132 -33355
12937c3355j13883j883R8323Q09n333k3044j41557K1518N0948N2089R8549L2181
$$ -33355 -147238 -149121 -50798 -49989 -55322 -78366 -219923 -198405 -147457 -95368 3181 35362
12925C5362j475N8144m1663l2679k4977P9378r9386K1123k3121q3070p9307N6546
$$ 35362 33887 92031 50368 17689 -7288 72090 -27296 -6173 -29294 -112364 -191671 -135125
12913a35125l2293P4429L7798n096j2479N4196l8796j45990M9722K41638J72312
$$ -135125 -167418 -92989 -55191 -60287 -72766 -18570 -57366 -203356 -153634 88004 260316
12902B60316r6662J8623J8138R4789J5620j11130p5066j2807n2020k9986k3672
$$ 260316 163654 182277 200415 295204 310824 199694 124628 111821 59801 29815 6143
12891F143O945o1022J4775m724Q6427J5634p4790l8573J58136J05308l2826j7214
$$ 6143 13088 -47934 -33159 -37883 48544 64178 -10612 -49185 108951 214259 181433 164219
12879A64219q4188O9863M1587j57834k915R3705N9304j0727j1168k1023n4396
$$ 164219 80031 149894 191481 33647 30732 124437 183741 173014 161846 140823 86427
12868H6427j54674l3470q8006k4327J06113N4753J0040m0262J76828K3734j24157
$$ 86427 -68247 -101717 -189723 -214050 -107937 -53184 -43144 -83406 93422 117156 -7001
12857g001J06862O6999J0458l7208r102M5330J01755j3398n0872o3613k011l3882
$$ -7001 99861 166860 177318 140110 131008 176338 278093 264695 213823 150210 148199 114317
12845A14317N2057n9097k7884P2702K3992O706q1104j31359o3464L4680o7378
$$ 114317 166374 107277 79393 152095 176087 182793 101689 -29670 -93134 -58454 -125832
12834a25832J8099K68504P5225p1960p9130P0192q0365m2909K744m5554O331K0333
$$ -125832 -107733 160771 235996 164036 84906 155098 74733 31824 34568 -10986 -4655 15678
12822A5678k7287q337j3343P6861J24215J65638n5493o5726m4796j9144N8795
$$ 15678 -11609 -19946 -33289 43572 167787 333425 277932 212206 167410 148266 207061
12811B07061P0019n0379r0205j02561j07505O5018Q0277Q0034J8359o3493o6879
$$ 207061 277080 226701 136496 33935 -73570 -8552 71725 151759 170118 106625 39746
12800C9746M4545O7343r7729j93353K1060J78933K40248L3827k3286j26803j48589
$$ 39746 84291 151634 53905 -139448 -118388 60545 300793 334620 311334 184531 35942
12789C5942m9838m1088N1693j19843K6284N9503K5441J56499O8586r6114J5069
$$ 35942 -13896 -54984 -3291 -123134 -96850 -37347 -11906 144593 213179 117065 132134
12778A32134J52745O3470q650j36157j93356J6125m3033p9160J31234R8231L7004
$$ 132134 284879 348349 339699 203542 10186 26311 -16722 -95882 35352 133583 170587
12767A70587M1810j78783p1983J21920J01667j3159m0988K1720j6050j54995m6397
$$ 170587 212397 33614 -38369 83551 185218 172059 131071 152791 136741 -18254 -64651
12756f4651K8934P7682M2490J426M0053j65459j53229Q3643O7155M3165j7841
$$ -64651 -35717 41965 84455 85881 125934 -39525 -192754 -109111 -41956 1209 -16632
12745a6632O6307Q8173M6086o2428p3419n7498J9278J92557j5962j40532J021
$$ -16632 49675 137848 183934 121506 48087 -9411 9867 202424 186462 45930 46951
12734D6951J27395m0170r5489j41866O1023J78138J03290p6649j2702o796n100
$$ 46951 174346 134176 38687 -103179 -42156 135982 239272 162623 149921 143125 138025
12723A38025q688r1637J34579M4566p1880k8679r618q1119J16991J62156q0915
$$ 138025 129337 37700 172279 216845 144965 116286 106668 25549 142540 304696 223781
12712B23781L255M0106J0781O6247m1723r1654q5234J25112J14805k6093o5597
$$ 223781 227036 267142 277923 344170 302447 210793 125559 250671 365476 339383 273786
12701B73786j06706j2881O8744n2172r4896K1001J27032r743k07223j5293o8832
$$ 273786 167080 154199 222943 170771 75875 96876 223908 214165 6942 -8351 -77183
12690g7183M3726L0861J6272O2413M8700Q2719P697m8377n9658p7814q307J10260
$$ -77183 -33457 -2596 13676 76089 124789 207508 215205 166828 107170 29356 21049 131309
12678A31309j0873q7224R794J14159l908j05235k052j1946J03099M1082K4708
$$ 131309 120436 33212 43006 157165 153257 48022 45970 34024 137123 178205 202913
12667B02913p2690N877M4875J41567q9257j97967J0794J04604J38950r1318o3381
$$ 202913 130223 136100 180975 322542 233285 35318 46112 150716 289666 198348 134967
12656A34967P5805J78469r731j38722o4305j9899K9394M5913J6802j6841j5766
$$ 134967 210772 389241 379510 240788 176483 156584 185978 231891 248693 231852 216086
12645B16086p507P2790k7706K090N2959J16734j30737j7926Q1292N6872j3468
$$ 216086 208579 281369 253663 255753 308712 425446 294709 276783 358075 414947 401479
12634D01479j67397M9436o2896j69636n5524L7747J4132k9857J60147O3888M4037
$$ 401479 234082 283518 220622 50986 -4538 33209 47341 17484 177631 241519 285556
12623B85556Q7223j02728j41160P3733m5794j33758o0744J10297P0749N4158L2715
$$ 285556 372779 270051 128891 202624 156830 23072 -37672 72625 143374 197532 230247
12612B30247J21821k1523p0274q5355j60102l6547J58564J19869o5685N6875j4518
$$ 230247 352068 330545 260271 174916 14814 -21733 136831 256700 191015 247890 233372
12601B33372j49152M3553J22254n4393o520J4771Q7282q6775p3815j22268J18184
$$ 233372 84220 127773 250027 195634 189114 203885 291167 204392 130577 8309 126493
12590A26493j8720p9903p9340J717J35143j6450k40360q0686K0196P620J13073
$$ 126493 107773 27870 -51470 -49753 85390 68940 -171420 -252106 -231910 -224290 -111217
12579a11217J32623J50609J62107m3479n1830k3540P8630q5142p0916J39088J18511
$$ -111217 21406 172015 334122 290643 238813 215273 293903 208761 137845 276933 395444
12568C95444J13440j9395r2531k24949j45973Q0106J31013P4299j25962o013R9444
$$ 395444 508884 489489 396958 172009 26036 106142 237155 311454 185492 179479 278923
12557B78923Q4310o4069J9753%J6738n6913q9910J28278n2686j66734L6019R5299
$$ 278923 363233 299164 318917 318917 335655 278742 188832 317110 264424 97690 133709 229008
12545B29008m07q1277R1670J35453j03361N3605J26054k4913j04195O2493R2972
$$ 229008 228601 147324 238994 374447 271086 324691 450745 425832 321637 384130 477102
12534D77102J3196l2371O1928j0768O1726q4052j34759J23949p5329k3846J4138
$$ 477102 490298 457927 519855 509087 570813 486761 352002 475951 400622 376776 390914
12523C90914O7067j148j60341O1189j6104L0362k7851j55240o3681J32080j3236
$$ 390914 457981 456833 296492 357681 341577 371939 344088 188848 125167 257247 244011
12512B44011L088k7166n1338l9100J77861J01263Q7665l574R1655p4734l7699
$$ 244011 247099 219933 168595 129495 307356 408619 496284 492710 584365 509631 471932
12501D71932p2575r5527n8839o7018J14618Q2704q9240o7070J4813P4012Q9127
$$ 471932 399357 303830 244991 177973 292591 375295 286055 218985 233798 307810 396937
12490C96937P2507j4808J7866J36975j41456j56999L8275Q9074m9786o6211q1550
$$ 396937 469444 454636 472502 609477 468021 311022 349297 438371 388585 322374 240824
12479B40824M6947k0831R4831K9866j02794R548l8570O8481N9748P7047J47980
$$ 240824 287771 266940 361771 391637 288843 298391 259821 328302 388050 465097 613077
12468F13077q6209q1497q0193p3978L6433N3520J641J6927q613O4987k9883M3814
$$ 613077 526868 445371 365178 291200 327633 381153 382794 399721 391108 456095 426212 470026
12456D70026l558r9080N478J22204O2275j04864o849l3365p1234m8104L1715p6628
$$ 470026 466468 367388 372866 495070 557345 452481 445632 412267 341033 292929 324644 248016
12444B48016l5910K5440J47858n2491k02101p1939J60405R3652k7234P2816J39129
$$ 248016 212106 237546 385404 332913 130812 58873 219278 312930 285696 358512 497641
12433D97641k987l4166K1221J52900L4922p0070j9917o232J7229j36088K8634
$$ 497641 494654 460488 481709 634609 669531 599461 579544 573312 590541 454453 483087
12422D83087L8667n6005m3659j16083J02595J85694n1357j02573q881O1917m5459
$$ 483087 521754 465749 422090 306007 408602 594296 542939 440366 431485 493402 447943
12411D47943p5052K880k9758K9033N7723O2799j6514o3971O3719M3918l0709J8022
$$ 447943 372891 375771 346013 375046 432769 495568 479054 415083 478802 522720 492011 510033
12399E10033O4945q3627o0687m0106j13973m1343l6277J523J08293J39766J759
$$ 510033 574978 491351 430664 390558 276585 235242 198965 200488 308781 448547 450306
12388D50306r6944M4368J04672r37J03015K8790P976N970j7743N1148N3144Q5886
$$ 450306 353362 397730 502402 501465 604480 633270 641246 647216 629473 680621 733765 819651
12376H19651m0460j47893q9260J36305j0577o1767K1313K3906n7855o4803O004
$$ 819651 779191 631298 542038 678343 667766 605999 627312 651218 593363 528560 534564
12365E34564n8266k0315R6164R2802l693p8444j0961M5220N2192J08035k124l5808
$$ 534564 476298 455983 552147 644949 641256 562812 551851 597071 649263 757298 755174 719366
12353G19366M2212j3812l4948N728J855r5707p3271n2624M6164R2400O0961j16526
$$ 719366 761578 747766 712818 718546 720401 624694 551423 498799 544963 637363 698324 581798
12341E81798p512L4418q4274P6492N9776l6091j24166M8427P6814o6235J5525
$$ 581798 574286 608704 524430 600922 660698 624607 500441 548868 625682 559447 574972
12330E74972N3088j0945n0278p6830p0792j5092P0159J17760J8178j1483J9659
$$ 574972 628060 617115 566837 490007 419215 404123 474282 592042 610220 598737 618396
12319F18396j56934o6688J45467m4893l9298J16771q172m228J16544Q8232l7814
$$ 618396 461462 394774 540241 495348 456050 572821 564649 560421 676965 765197 727383
12308G27383j52576k8523M8772m332M8270q9802p8335Q6037J81167L2130l8585
$$ 727383 574807 546284 595056 590724 638994 549192 470857 556894 738061 770191 731606
12297G31606N58M675K9089J8095O5446R1988M8677q9652l15221J6735J65437N1752
$$ 731606 732164 736839 765928 784023 849469 941457 990134 900482 585261 601996 767433 819185
12285H19185j40600L4885m9791O6206N1436j0052j54929R6237R0907k8184r6728
$$ 819185 678585 713470 663679 729885 781321 771269 616340 712577 803484 775300 678572
12274F78572k4944O5051K1015M089l7012J10583J44700q2504j9562l5330l4512
$$ 678572 653628 718679 739694 743783 706771 817354 962054 879550 859988 824658 790146
12263G90146J03549M5500j32549O1839J69067J9296o7904q425r9416r7084M6590
$$ 790146 893695 939195 806646 868485 1037552 1056848 988944 980519 881103 784019 830609
12252H30609R3843Q0683Q487N3826p8241j94134o1378J39957J58477P9832j51041
$$ 830609 924452 1005135 1013622 1067448 989207 795073 733695 873652 1032129 1111961 960920
12241I60920j67010k4584J03125K692M6278J95515Q9685q9984j14306M8267R7868
$$ 960920 793910 769326 872451 875143 921421 1116936 1206621 1116637 1002331 1050598 1148466
12230A148466Q9873j2504K5567Q8422k35860j20198q9249l981O7579J62251j2167
$$ 1148466 1238339 1225835 1251402 1339824 1103964 983766 894517 890536 958115 1120366 1108199
12219A108199j35811L2865J53738J33145k9073j94403j52545O8715J59820K7206
$$ 1108199 972388 1005253 1158991 1292136 1263063 1068660 916115 984830 1144650 1171856
12209A171856M6207J8472K9547R1286J08117q3470o3734o312j68089q211m1475
$$ 1171856 1218063 1236535 1266082 1357368 1465485 1382015 1318281 1311969 1143880 1135669 1094194
12198A094194O4301O6002P822k7552L220M8479Q1800O1593J6830q997J10549k98
$$ 1094194 1158495 1224497 1232319 1204767 1207987 1256466 1338266 1399859 1416689 1407692 1518241 1517943
12186A517943o7035N2299j2837o908L8056K7123o4732p7676N4862L890L1432M0059
$$ 1517943 1450908 1503207 1490370 1483462 1521518 1548641 1483909 1406233 1461095 1464985 1496417 1536476
12174A536476L7527j8665j92117N3153L0491Q3888Q1440R9970k2681R836O5858
$$ 1536476 1574003 1555338 1363221 1416374 1446865 1530753 1612193 1712163 1689482 1699318 1765176
12163A765176P5433n2836N0908n6988j7687r8214L7853L2233P5532J6164o779
$$ 1765176 1840609 1787773 1838681 1781693 1764006 1665792 1703645 1735878 1811410 1827574 1820795
12152A820795r1707o8571J01783J05329m3370J681J61327P5169J25750O1158m0631
$$ 1820795 1729088 1660517 1762300 1867629 1824259 1825940 1987267 2062436 2188186 2249344 2208713
12141B208713k2496k4942n0596P061K5551O2961o4165j9331n436J7424L5887J02090
$$ 2208713 2186217 2161275 2110679 2117740 2143291 2206252 2142087 2122756 2117320 2134744 2170631 2272721
12129B272721J27912l4015o3375N3222M7422N4408j6826J67976Q1137r3160p9869
$$ 2272721 2400633 2366618 2303243 2356465 2403887 2458295 2441469 2609445 2690582 2597422 2517553
12118B517553j18983K3983K27239j019p9173J08399J10482j7467k9148m7299j2504
$$ 2517553 2398570 2422553 2649792 2648773 2569600 2677999 2788481 2771014 2741866 2694567 2682063
12107B682063O6550J6713l2421m7158L3069R2217Q8435J74930K16132J72336K04143
$$ 2682063 2748613 2765326 2732905 2685747 2718816 2811033 2899468 3074398 3290530 3462866 3667009
12096C667009P7308j56435j05185J7492O2413O3290j68056r2231M4970K3786j4654
$$ 3667009 3744317 3587882 3482697 3500189 3562602 3625892 3457836 3365605 3410575 3434361 3419707
12085C419707L0059M0849M9575O2826M3448N2262J04835J31595P9248n500p171
$$ 3419707 3449766 3490615 3540190 3603016 3646464 3698726 3803561 3935156 4014404 4008904 4001733
12074D001733o4312n1129P4361l0939J6174P5742N9972J82702O6758K19475J09134
$$ 4001733 3937421 3886292 3960653 3929714 3945888 4021630 4081602 4264304 4331062 4550537 4659671
12063D659671n7410j10228J18333P4633P9039J0871J8882J13074P8671J20474
$$ 4659671 4602261 4492033 4610366 4684999 4764038 4774909 4793791 4906865 4985536 5106010
12053E106010J68330L1879J30135R1813m6406Q4936O1885o6631j3502J33453K66245
$$ 5106010 5274340 5306219 5436354 5528167 5481761 5566697 5628582 5561951 5548449 5681902 5948147
12042E948147j8898l8419Q7110j1198P9944Q2696J63380K35213k1542p3913P7128
$$ 5948147 5929249 5890830 5977940 5966742 6046686 6129382 6292762 6527975 6506433 6432520 6509648
12031F509648R8582M2837K01401L4350j0916L0275J30212J12234J41942K11261
$$ 6509648 6608230 6651067 6852468 6886818 6875902 6906177 7036389 7148623 7290565 7501826
12021G501826l6194L8476l2490K5029J94900J92515J46703K10980K30706L0525
$$ 7501826 7465632 7504108 7471618 7496647 7691547 7884062 8030765 8241745 8472451 8502976
12011H502976n6097R9234Q1390J40936K65180K06464j1377R4830J52205J58958
$$ 8502976 8446879 8546113 8627503 8768439 9033619 9240083 9228706 9323536 9475741 9634699
12001I634699Q7413P3280K42335J92824Q2787J03868L1804K60819K00994L4289
$$ 9634699 9722112 9795392 10037727 10230551 10313338 10417206 10449010 10709829 10910823 10945112
11991A0945112L7871J86581J83429J23809J12188K71443M39368K04057J25047
$$ 10945112 10982983 11169564 11352993 11476802 11588990 11860433 12299801 12503858 12628905
11982A2628905K9886K09071J92433J38454J98590K05903J43801J75873K33182
$$ 12628905 12658791 12867862 13060295 13198749 13397339 13603242 13747043 13922916 14156098
11973A4156098J37690K51131P4337J63542L42541L13635J57129J33311K14121
$$ 14156098 14293788 14544919 14619256 14782798 15125339 15438974 15596103 15729414 15943535
11964A5943535J57274K07994J85487K57603L75247J56941R2188O5722K68340L12761
$$ 15943535 16100809 16308803 16494290 16751893 17127140 17284081 17376269 17441991 17710331 18023092
11954A8023092K15377J65133K53316K28899K20273J55406J77255J75837K20919
$$ 18023092 18238469 18403602 18656918 18885817 19106090 19261496 19438751 19614588 19835507
11945A9835507L01668J65554l2644J59088K24527J89081J75907J86636J25242
$$ 19835507 20137175 20302729 20270085 20429173 20653700 20842781 21018688 21205324 21330566
11936B1330566K73958K36654M3301J27847J64261N3543J28541P0439J85001N6261
$$ 21330566 21604524 21841178 21884479 22012326 22176587 22230130 22358671 22429110 22614111 22670372
11926B2670372k0222K2478J90256J87739R4625P0509R0270M9764q7347j6013r4941
$$ 22670372 22650150 22672628 22862884 23050623 23145248 23215757 23306027 23355791 23268444 23252431 23157490
11915B3157490J9458J29466q467q2098p8263k11356K2173J6972k13638j68162
$$ 23157490 23176948 23306414 23297947 23215849 23137586 22926230 22948403 22965375 22751737 22583575
11905B2583575n4412n1503j93966K6075j46396k08060j17260k29456j44511j25146
$$ 22583575 22529163 22477660 22283694 22309769 22163373 21955313 21838053 21608597 21464086 21338940
11895B1338940j95281k04496j76787j53640k46065k42430k13500j68481k07708
$$ 21338940 21143659 20939163 20762376 20608736 20362671 20120241 19906741 19738260 19530552
11886A9530552k38294n4383j76027j78635k58659j64907j10044o5177k18059k75332
$$ 19530552 19292258 19237875 19061848 18883213 18624554 18459647 18349603 18284426 18066367 17791035
11876A7791035k79829k78275q4481q6228j82820m00121k80874k04384k30289k26125
$$ 17791035 17511206 17232931 17148450 17062222 16879402 16479281 16198407 15994023 15763734 15537609
11866A5537609r7271k09363k80154k42559j94098k20697j47625j51345k26927
$$ 15537609 15440338 15230975 14950821 14708262 14514164 14293467 14145842 13994497 13767570
11857A3767570j46101R954j82847j49893k00740j86433k53132k45399l09365j90878
$$ 13767570 13621469 13631423 13448576 13298683 13097943 12911510 12658378 12412979 12103614 11912736
11847A1912736p5977j28032j05090k60728r2651j76506j56395j69548k22593j42226
$$ 11912736 11836759 11708727 11603637 11342909 11250258 11073752 10917357 10747809 10525216 10382990
11837A0382990q0926k67413j57843j75795r269j0123o6302j87588j26371j22314
$$ 10382990 10302064 10034651 9876808 9701013 9691744 9681621 9615319 9427731 9301360 9179046
11827I179046j62249o8581k28300j78509j32064j31050j61853j42042o8722j01045
$$ 9179046 9016797 8948216 8719916 8541407 8409343 8278293 8116440 7974398 7905676 7804631
11817G804631l8385k7351j01181m1181j6597j34770q4151m9636r6074r4370p3764
$$ 7804631 7766246 7738895 7637714 7596533 7579936 7445166 7361015 7311379 7215305 7120935 7047171
11806G047171J8818j20781j58632p4057R540j46791r8156j7199j27503M851j66985
$$ 7047171 7065989 6945208 6786576 6712519 6722059 6575268 6477112 6459913 6332410 6337261 6170276
11795F170276k31328r2376j33580j38328o7873M8757N1843r9803j05805m0134
$$ 6170276 5938948 5846572 5712992 5574664 5506791 5555548 5607391 5507588 5401783 5361649
11785E361649M1492j25922q6801n2444k2747o2281J3379m5633k00871j22228L6771
$$ 5361649 5403141 5277219 5190418 5137974 5115227 5052946 5066325 5020692 4819821 4697593 4734364
11774D734364O5309o2746L8568j13779r7149j18221j04660J5164L201l0052j56285
$$ 4734364 4799673 4736927 4775495 4661716 4564567 4446346 4341686 4356850 4360051 4329999 4173714
11763D173714p2937M8823K2544j5733p0749o528r653n9979j12734m1070j40366
$$ 4173714 4100777 4149600 4172144 4156411 4085662 4079134 4069481 4009502 3896768 3855698 3715332
11752C715332n21p1694j5921n0410k6237l1076j10102j02247j7397L8052K3029
$$ 3715332 3714811 3643117 3627196 3576786 3550549 3519473 3409371 3307124 3289727 3327779 3350808
11741C350808n8626l2675k4406j8256M0081j52063j65665R3171P5328j6735j16127
$$ 3350808 3292182 3259507 3235101 3216845 3256926 3104863 2939198 3032369 3107697 3090962 2974835
11730B974835q1899R536M5781M6061q6181j02282j67924N192M3604J12299N2639
$$ 2974835 2892936 2902472 2948253 2994314 2908133 2805851 2637927 2643119 2686723 2799022 2851661
11719B851661p7405l4821j1338o7393P9929P689k03645j25882M3575k4708r2632
$$ 2851661 2774256 2739435 2728097 2660704 2740633 2748322 2544677 2418795 2462370 2437662 2345030
11708B345030J0310m3956Q6148P4185p3144k6221p7283l671n1124l1341k8953
$$ 2345030 2355340 2311384 2397532 2471717 2398573 2372352 2295069 2291398 2240274 2208933 2179980
11697B179980N1546P7384j24847l0956P8400M6792N2151n0855j64494n3897j71761
$$ 2179980 2231526 2308910 2184063 2153107 2231507 2278299 2330450 2279595 2115101 2061204 1889443
11686A889443j09457K5118N6633k6471N7609j02535K6477J10408m0875M2604Q9343
$$ 1889443 1779986 1805104 1861737 1835266 1892875 1790340 1816817 1927225 1886350 1928954 2018297
11675B018297r9642k0422R5416P4500m2790j02444j54418n6447p3401L7040J27972
$$ 2018297 1918655 1898233 1993649 2068149 2025359 1922915 1768497 1712050 1638649 1675689 1803661
11664A803661J17098n863n2771o0961L0343p1888m5174M994j34090N727N4407
$$ 1803661 1920759 1914896 1862125 1801164 1831507 1759619 1714445 1719439 1585349 1591076 1645483
11653A645483M9515j1462m3661k958p4487n7670N8934m6950K9877r4520l6002
$$ 1645483 1694998 1683536 1639875 1636917 1562430 1504760 1563694 1516744 1546621 1452101 1416099
11642A416099J69019K045n7351O0506K8115r655j14149j05924Q3188P9255o7145
$$ 1416099 1585118 1587163 1529812 1590318 1618433 1608778 1494629 1388705 1471893 1551148 1484003
11631A484003M8079J09592R2595j13398K0335p6379o4138j33541r5962O1363N6546
$$ 1484003 1532082 1641674 1734269 1620871 1641206 1564827 1500689 1367148 1271186 1332549 1389095
11620A389095L8607N3858n4218m9103J5520o3106j62352r7809M1313J34708M3058
$$ 1389095 1427702 1481560 1427342 1378239 1393759 1330653 1168301 1070492 1111805 1246513 1289571
11609A289571m0400p0994q7019j29622N2743J09379R9907m1066j32097r9027R5693
$$ 1289571 1249171 1178177 1091158 961536 1014279 1123658 1223565 1182499 1050402 951375 1047068
11598A047068P5049Q5894n917l2439K3007j46375P615m9431o5657J17092J56190
$$ 1047068 1122117 1208011 1202094 1169655 1192662 1046287 1053902 1004471 938814 1055906 1212096
11587A212096j0993j7020J0436j45163r5232o9634j1022o2786L8945R4505N0649
$$ 1212096 1201103 1184083 1194519 1049356 954124 884490 873468 810682 849627 944132 994781
11576I94781k1673J861k7024P4388K17044J36580j01638j76080m0679k6282j26665
$$ 994781 973108 974969 947945 1022333 1239377 1375957 1274319 1098239 1057560 1031278 904613
11565I04613r9919j36776o9274O1052Q7993M9367M3279O7887j5001p3318J2743
$$ 904613 804694 667918 598644 659696 747689 797056 840335 908222 893221 819903 832646
11554H32646R3936p6458r4081q9260j2626J2065L3191O3971q2026r9976J8727
$$ 832646 926582 850124 756043 666783 654157 666222 699413 763384 681358 581382 600109
11543F00109M8961N4921j561N5149L6539J25713j3015q6410l9375l427P6477N3488
$$ 600109 649070 703991 702430 757579 794118 919831 906816 820406 781031 777604 854081 907569
11531I07569L1628p0018j65585o4474l529M6176j0449N648M1417P5013r450j02872
$$ 907569 939197 869179 703594 639120 635591 681767 671318 676966 718383 793396 783946 681074
11519F81074j13609O3151J14590J01984r1315j35992M1634M6404o0778J28217
$$ 681074 567465 630616 745206 847190 755875 619883 661517 707921 647143 775360
11509G75360J07825o7487k00267n0219k524P3384L9899j6948n0544L9999N7588
$$ 775360 883185 815698 615431 565212 562688 636072 675971 659023 608479 648478 706066
11498G06066j43244l8399J25182J26906o431j46391j60552P8994k8669r8529Q4788
$$ 706066 562822 524423 649605 776511 770080 623689 463137 542131 513462 414933 499721
11487D99721P5320N1178p8904J6749J1261O878N348R64n3446O7464J21672P36
$$ 499721 575041 626219 547315 564064 575325 582203 587551 588515 535069 602533 724205 724941
11475G24941l6572K4354K4018j56585j44683q9201j23655j3070J88293k9356J02531
$$ 724941 688369 712723 736741 580156 435473 346272 222617 209547 397840 368484 471015
11464D71015P8796q049m3634p2477l658l8366m1856R2902n5500Q0146J82383K1764
$$ 471015 549811 541762 498128 425651 421993 383627 341771 434673 379173 459319 641702 663466
11452F63466j61637j34042r9639l2957p6100M0486O8413M1007J01748q0001P8022
$$ 663466 501829 367787 268148 235191 159091 199577 267990 308997 410745 330744 408766
11441D08766J11373p2471o036K7133j3124k7703p1855M0435j581k9157L2497K3360
$$ 408766 520139 447668 441632 468765 455641 427938 356083 396518 394937 365780 398277 421637
11429D21637r703k8714j35481J16532r871p4086O2350K6971l827M1668M8425j13232
$$ 421637 411934 383220 247739 364271 354400 280314 342664 369635 365808 407476 455901 342669
11417C42669K8075J22184o026K3462k331r1871n7621m1525o908n2099L7940J20970
$$ 342669 370744 492928 486902 510364 508033 416162 358541 317016 310108 258009 295949 416919
11405D16919K7247j4822n0668j04385N9187M4248J01035j14684K2126P255J52497
$$ 416919 444166 429344 378676 274291 333478 377726 478761 364077 386203 393458 545955
11394E45955k5400j49482j38938p9106R433K5949J10321P534n4568k5957l9088
$$ 545955 520555 371073 232135 153029 162462 188411 298732 306266 251698 225741 186653
11383A86653O6052R4610L0693q6400J38335L1665n0909L1137p4777k06201P1789
$$ 186653 252705 347315 378008 291608 429943 461608 410699 441836 367059 160858 232647
11372B32647O1518Q78P3736P75o3712J76335P3702j6079P3934o2419j28533O8159
$$ 232647 294165 295043 368779 369554 305842 482177 555879 539800 613734 551315 422782 490941
11360D90941k2867R7176L0835j13647o1780P2282M6456p3439p2168j29095K9732
$$ 490941 468074 565250 596085 482438 420658 492940 539396 465957 393789 264694 294426
11349B94426J87962k7680m6742j6289m8567j53140J2371N6717O7519L1612r1196
$$ 294426 482388 454708 407966 391677 343110 189970 202341 259058 326577 358189 266993
11338B66993p9638J17674N9960j37193k6505r7131r3853O1371J00921M1767P7751
$$ 266993 187355 305029 364989 227796 201291 104160 10307 71678 172599 214366 292117
11327B92117N3988r1151k8111J16375j20828j29389J09466J38861j9623N639k54985
$$ 292117 346105 254954 226843 343218 222390 93001 202467 341328 321705 327344 72359
11316G2359l8622k7688O6973O9257Q6411J8383q3115J0463j6210j094J54753q1866
$$ 72359 33737 6049 73022 142279 228690 247073 163958 174421 158211 157117 311870 230004
11304B30004J05669P8140M3296p6287k07342P1750O5843j9108j32481R4360J53349
$$ 230004 335673 413813 457109 380822 173480 245230 311073 291965 159484 253844 407193
11293D07193k08634o0529n1863l961J41086K4923m2196n4156m2266k721N0164
$$ 407193 198559 138030 86167 82206 223292 248215 206019 151863 109597 106876 157040
11282A57040L1679J42647M4445j68264p4757P8635L8837l8959n5078l1553j51118
$$ 157040 188719 331366 375811 207547 132790 211425 250262 211303 156225 124672 -26446
11271b6446j71859J1171J35729R0927J22696M4796r6670j13001j7393J1404J24116
$$ -26446 -198305 -187134 -51405 39522 162218 207014 110344 -2657 -20050 -8646 115470
11260A15470J12194p7679L4274L2149O1875R0147J08480K0768r6434l3508j0164
$$ 115470 227664 149985 184259 216408 278283 368430 476910 497678 401244 367736 357572
11249C57572L382k3505k10369m6418Q9585k5487o471K0634R2653J85274K1932
$$ 357572 360954 337449 127080 80662 170247 144760 138289 158923 251576 436850 458782
11238D58782j25311j23141n8784j05514j5776L9749N3059J4476q3048l8334P9594
$$ 458782 333471 210330 151546 46032 30256 70005 123064 137540 54492 16158 95752
11227I5752O5984j14344n2992J12535L9641J06954J0775L6786p5861P0636k2906
$$ 95752 161736 47392 -5600 106935 146576 253530 264305 301091 225230 295866 272960
11216B72960m8516o0387m1734m734l4908m6604J874J51628L8015j22784j91378
$$ 272960 224444 164057 122323 117589 82681 36077 37951 189579 227594 104810 -86568
11205h6568k9762M6737l5225m3011J5675m6708J77236J64728L8006R3735n6864
$$ -86568 -116330 -69593 -104818 -147829 -132154 -178862 -1626 163102 201108 294843 237979
11194B37979r8262k8261R4166O475N949J5603n2338l6525l9030J00536K0211K544
$$ 237979 139717 111456 205622 212097 218046 233649 181311 144786 105756 206292 226503 229047
11182B29047l2666o9233R0809J12953o0916j18820n7965N8724Q777j7808P721
$$ 229047 196381 127148 217957 330910 269994 151174 93209 151933 160710 142902 150623
11171A50623p490Q8602K3412o8610q927m3167P4786L7015q7369J7448n4604L5435
$$ 150623 143133 231735 255147 186537 177610 134443 209229 246244 158875 176323 121719 157154
11159A57154J9318q6942J8991M6863J9020L543K7175k3984N5567J13n9439J42636
$$ 157154 176472 89530 108521 155384 174404 177947 205122 181138 236705 236818 177379 320015
11147C20015J19878l3462n6234n2492J81j8625m7126N7190q9569O660P3781m5449
$$ 320015 439893 406431 350197 297705 297886 279261 232135 289325 199756 206416 280197 234748
11135B34748j77657o7346J05235J77760O3336j03928j28772j98309M9961O1210
$$ 234748 57091 -10255 94980 272740 336076 232148 103376 -94933 -44972 16238
11125A6238J8330N452o9407j23875q0501Q1340K55473J05241j40450r4769J73419
$$ 16238 34568 40020 -29387 -153262 -233763 -152423 103050 208291 67841 -26928 146491
11114A46491o4007k7157N9196j02041M3091J42005n6246q7189N4309m2527j34517
$$ 146491 82484 55327 114523 12482 55573 197578 141332 54143 108452 65925 -68592
11103f8592K8155O9286j3160l5091J24366O7451o3084m7869K4239K7367r3411
$$ -68592 -40437 28849 15689 -19402 104964 172415 109331 61462 85701 113068 19657
11092A9657p019l6323o6344l0366J43604M1931j7966m4968o1139j03272J36132
$$ 19657 12638 -23685 -90029 -120395 23209 65140 47174 2206 -58933 -162205 -26073
11081b6073J26813M835p1092K155m1827j60562r3477M4155J5291n501l0662K9476
$$ -26073 100740 105575 34483 36638 -5189 -165751 -259228 -215073 -199782 -205283 -235945 -206469
11069b06469J57713L2218q2481P7517P8649m9535N6107m7430k747j8876o5879
$$ -206469 -48756 -16538 -99019 -21502 57147 7612 63719 16289 13542 -5334 -71213
11058g1213N6570K8759j15765R1360J3505K8155j6940Q0279N3357M0663J60955
$$ -71213 -14643 14116 -101649 -10289 3216 31371 14431 94710 148067 188730 349685
11047C49685Q8752P494J07510l6291p319Q4002N7131j34437r4066q6114r3006
$$ 349685 438437 445931 553441 517150 509831 593833 650964 516527 422461 336347 243341
11036B43341N0365K26075K42174J22323J58098R3441j44215o5013p7149O263m3082
$$ 243341 293706 519781 761955 884278 1042376 1135817 991602 926589 849440 855703 812621
11025H12621M7846J81784R0493Q1135K65448J00215P3354j13781j39194j19710
$$ 812621 860467 1042251 1132744 1213879 1479327 1579542 1652896 1539115 1399921 1280211
11015A280211k14093j14029P1410M4319P9274P2298J13819M2840j33175j97034
$$ 1280211 1066118 952089 1023499 1067818 1147092 1219390 1333209 1376049 1242874 1045840
11005A045840j13331j49596j77292j10535K9192n4983j50502J67649K15663O842
$$ 1045840 932509 782913 605621 495086 524278 469295 318793 486442 702105 708947
10995G08947k16653j99278r0081L1890j63o9298j81389N8089Q8805k7143J4104
$$ 708947 492294 293016 202935 234825 234662 165364 -16025 42064 130869 103726 117830
10984A17830k6521l2739N0174j1602o1979j44311k7814n8521P7931J53844k4058
$$ 117830 91309 58570 108744 97142 35163 -109148 -136962 -195483 -117552 36292 12234
10973A2234R9623j9580P981K576p8614P556J80727o6375q4322l9281l7212q1696
$$ 12234 111857 92277 100258 102834 24220 31776 212503 146128 61806 22525 -14687 -96383
10961i6383j61237Q2249R8657k8039J15890j29602n9332R3823K1060Q3746J43963
$$ -96383 -257620 -175371 -76714 -104753 11137 -118465 -177797 -83974 -62914 20832 164795
10950A64795J91932m6552k84937m1864k6097Q0254R8707l9723O1736r9702j00898
$$ 164795 356727 310175 25238 -16626 -42723 37531 136238 96515 158251 58549 -42349
10939d2349O3331k3988K6835M6262j04776o8860J28681J13693P5156r0700n9867
$$ -42349 20982 -3006 23829 70091 -34685 -103545 25136 138829 213985 123285 63418
10928F3418J8518N8010P7407l5465q7525K5104M335o4679m1717R2617N262m1696
$$ 63418 81936 139946 217353 181888 94363 119467 123802 59123 17406 110023 115285 73589
10916G3589M6356N0207q6092l8057L2115L1214o5965M4454q510M4841J3678J00656
$$ 73589 119945 170152 84060 46003 78118 109332 43367 87821 79311 124152 137830 238486
10904B38486o3752o3869m3890l693J06598P0506k3889K805o1318P0272j67680
$$ 238486 174734 110865 66975 63282 169880 240386 216497 219302 157984 228256 60576
10893F0576j15991o8692j04234M9412R5276R4956k4035J17775K6913q7242m9754
$$ 60576 -55415 -124107 -228341 -178929 -83653 11303 -12732 105043 131956 44714 -5040
10882e040J0283l8534m6436k5371J05933O6022M6115j40931r2540O9538P4182
$$ -5040 5243 -33291 -79727 -105098 835 66857 112972 -27959 -120499 -50961 23221
10871B3221J4481J2505Q5937l7982k9618O1607Q7239r3973j36032o3J2641J10682
$$ 23221 37702 50207 136144 98162 68544 130151 217390 123417 -12615 -12678 -37 110645
10859A10645J24112p5996l5955l2468j31946L7145P8778L7368M1182k2567r7359
$$ 110645 234757 158761 122806 90338 -41608 -4463 74315 111683 152865 130298 32939
10848C2939N253J16560j1750Q5306N4967p027R4422q0776n1270m3986m7576k4642
$$ 32939 38192 154752 143002 228308 283275 276248 370670 289894 238624 194638 147062 122420
10836A22420l1542r2050J2529O9942O6291j17099J7142R7594J0774n9618m1455
$$ 122420 90878 -1172 11357 81299 147590 30491 47633 145227 156001 96383 54928
10825E4928k508P382M5819m981j22947j15829K952P2094J4943j7907Q1998O5019
$$ 54928 52420 59802 105621 100640 -22307 -138136 -135184 -63090 -48147 -66054 15944 80963
10813H0963n7065j54824L747O0745K5917N7127L994j32366j20750N5037J07816
$$ 80963 23898 -130926 -127179 -66434 -40517 16610 20604 -111762 -232512 -177475 -69659
10802f9659J05803J19577m9054k36709p3352K9551L588q0230L1014L8131j6420
$$ -69659 36144 155721 106667 -130042 -203394 -173843 -170255 -250485 -219471 -181340 -197760
10791a97760O2947R5376K0053J85270j1511j47752k4298L886m8229j15931n3621
$$ -197760 -134813 -39437 -19384 165886 154375 6623 -17675 -13789 -62018 -177949 -231570
10780b31570q0915N4966J89680J00125j70182k0599K13694R3190m2483j42149
$$ -231570 -312485 -257519 -67839 32286 -137896 -158495 55199 148389 105906 -36243
10770c6243L7738k5696p1746j47301L1216K72229l019j05977j16437O396N5673
$$ -36243 1495 -24201 -95947 -243248 -212032 60197 57178 -48799 -165236 -158840 -103167
10759a03167Q3063P6268N9027q6084o9464j66677k2194r942Q8788n4806j21500
$$ -103167 -20104 56164 115191 29107 -40357 -207034 -229228 -239170 -150382 -205188 -326688
10748c26688O101P9982O6132L3075J13733J21527L5220j42829o0864l4135j25005
$$ -326688 -320587 -240605 -174473 -141398 -27665 93862 129082 -13747 -74611 -108746 -233751
10737b33751O3122J20639o6507j38503p8592J30611J93740K4865j64340j15238
$$ -233751 -170629 -49990 -116497 -255000 -333592 -202981 -9241 15624 -148716 -263954
10727b63954J73643R2811R5281j4218q6990j90898j24667K6364J26456O3261O3923
$$ -263954 -90311 2500 97781 83563 -3427 -194325 -318992 -292628 -166172 -102911 -38988
10716c8988N2606M3115M9138j47951j98457L9818J7248M071P2017J32020l401
$$ -38988 13618 56733 105871 -42080 -240537 -200719 -183471 -179400 -107383 24637 21236
10705B1236q3766r7161k8155l007p4805L1680Q8550j1925K844J12578J0467j0608
$$ 21236 -62530 -159691 -187846 -190853 -265658 -233978 -145428 -157353 -154509 -41931 -31464 -42072
10693d2072p7165j957P1672l2613k6549L2161J6873N2133K696N4318m9155q0243
$$ -42072 -119237 -121194 -49522 -82135 -108684 -76523 -59650 -7517 -4821 49497 342 -79901
10681g9901q197n6892J37732k008o3161J3311M4595j51394j78438R8071J42061
$$ -79901 -88098 -144990 -7258 -9266 -72427 -59116 -14521 -165915 -344353 -246282 -104221
10670a04221l6281j04832N1941K1991j5925k5930J7086P3829k5352j5599J08212
$$ -104221 -140502 -245334 -193393 -171402 -187327 -213257 -196171 -122342 -147694 -163293 -55081
10659e5081N2336N0505j0115Q6803J46902J15283J10453L8816j47069j41828j27396
$$ -55081 -2745 47760 37645 124448 271350 386633 497086 535902 388833 247005 119609
10648A19609J24315J93521J60976Q1062K6357M3341n9730k8378Q2590J37404J1136
$$ 119609 243924 437445 598421 679483 705840 749181 689451 661073 743663 881067 892203
10637H92203J41054K61844K43822L58887N25094O00910O17387O85322L76861K86565
$$ 892203 1033257 1295101 1538923 1897810 2422904 3023814 3641201 4326523 4703384 4989949
10627D989949L93361M61206P55031J142110J642230K142059L019270M270632N818536
$$ 4989949 5383310 5844516 6599547 7741657 9383887 11525946 14545216 18815848 24634384
10618B4634384P724184J0564685J3727071J5528981J3509817O594880j403389
$$ 24634384 32358568 42923253 56650324 72179305 85689122 92284002 90880613
10611I0880613o136920o261511l421795Q93583O098545J2350222J9881929K7942658
$$ 90880613 84743693 78482182 75060387 75953970 82052515 94402737 114284666 142227324
10603A42227324L2572136K6599456P519137j3158777k2751118k0785500j3128191
$$ 142227324 174799460 201398916 208918053 195759276 173008158 152222658 139094467
10596A39094467m142403N340608J5548253K6741668L7361292M1419996K9444216
$$ 139094467 134952064 140292672 155840925 182582593 219943885 261363881 290808097
10589B90808097n89224k9934768m1027654l6364097k5667914j4669106m745361
$$ 290808097 290218873 260284105 219256451 182892354 157224440 142555334 137809973
10582A37809973M585138J3633593K1138867K2689522J2439940q289848k6744830
$$ 137809973 142395111 156028704 177167571 199857093 212297033 204007185 177262355
10575A77262355l2260025k7380521j9363441j1798852n506498m88011L715937
$$ 177262355 145002330 117621809 98258368 86459516 80953018 80465007 84180944
10568H4180944O381475O035078R18058p245445j3868477j5665230j3741668j0560406
$$ 84180944 90562419 96597497 97515555 90270110 76401633 60736403 46994735 36434329
10560C6434329p703072n534043m037061k932081k231415j699650j444697j099343
$$ 36434329 28731257 23197214 19160153 16228072 13996657 12297007 10852310 9752967
10552I752967q37612p80325p32481n74916o18499n06097l65338k60588k40212
$$ 9752967 8915355 8135030 7402549 6827633 6209134 5703037 5337699 5077111 4836899
10543D836899k61181k26870n8110k01816k71245l80389j83740k27923o4819l4038
$$ 4836899 4575718 4348848 4290738 4088922 3817677 3437288 3253548 3025625 2960806 2926768
10533B926768j0857k13777j93639n6793N5485n1217j50511J8636r9556k25152
$$ 2926768 2915911 2702134 2508495 2451702 2507187 2455970 2305459 2324095 2224539 1999387
10523A999387L2475J42299j01471p6196r2430j46547j29307l3845J39425L4430
$$ 1999387 2031862 2174161 2072690 1996494 1904064 1757517 1628210 1594365 1733790 1768220
10513A768220J049p9001j30212j38282q0825J1595p5708l9713j26379p24K7056
$$ 1768220 1769269 1690268 1560056 1421774 1340949 1352544 1276836 1237123 1110744 1110020 1137076
10502A137076P7102j2558q6350N0310j31548j49243K4492O5042R9817J3531L2118
$$ 1137076 1214178 1201620 1115270 1165580 1034032 884789 909281 974323 1074140 1087671 1119789
10491A119789N0204Q2656j85419j50912P6969J06615j9219k858N5383J1586o7425
$$ 1119789 1169993 1252649 1067230 916318 993287 1099902 1080683 1077825 1133208 1144794 1077369
10480A077369j18679P4595j0968r9782K2912K059J345N3523P4446j22617K3459
$$ 1077369 958690 1033285 1022317 922535 945447 947506 948851 1002374 1076820 954203 977662
10469I77662R5164J08315J6249q6154K2043J01009J10823l1015n9818o5107r410
$$ 977662 1072826 1181141 1197390 1111236 1133279 1234288 1345111 1314096 1254278 1189171 1179761
10458A179761j5016j23023j07797p9065q8654q1067J29258J04740R7780M1308
$$ 1179761 1164745 1041722 933925 854860 766206 685139 814397 919137 1016917 1058225
10448A058225M7933p9480j58817j4018J3411L4002o9786L5031L906J50603j396
$$ 1058225 1106158 1026678 867861 853843 867254 901256 831470 866501 870407 1021010 1019614
10437A019614k21217J6627J9552M037j4160R763p2014K9670q7652o4016q5235
$$ 1019614 798397 815024 834576 838613 824453 834216 762202 791872 704220 640204 554969
10426E54969j8194l6700J35153J07585p9002l3342R0029Q5563j54660j9395L5438
$$ 554969 536775 500075 635228 742813 663811 630469 720498 806061 651401 632006 667444
10415F67444q4875J8792J6554p0987n7146J7786L1116l2845k0852j44976K4628
$$ 667444 582569 601361 617915 546928 489782 507568 538684 505839 484987 340011 364639
10404C64639R9004O6326q276r002j09055j12832M8849J18244J03147n9006k8642
$$ 364639 463643 529969 521693 512691 403636 290804 339653 457897 561044 502038 473396
10393D73396j621p7997L1043J8562J27373L9965J22668r92k22328k1588P3589
$$ 473396 471775 393778 424821 443383 570756 610721 733389 732397 510069 488481 562070
10382E62070j6889j35551j06145q7088J1354P8538J1936j8522L7331l6077L8074
$$ 562070 545181 409630 303485 216397 227751 306289 318225 299703 337034 300957 339031
10371C39031k5205o0075o9490J51174L5912R8669J17827j02781L7513o2540n4433
$$ 339031 313826 253751 184261 335435 371347 470016 587843 485062 522575 460035 405602
10360D05602m9821j17826j9559j5148R7352O7029J4194j1253j4387p3485J0849
$$ 405602 355781 237955 218396 203248 300600 367629 381823 370570 356183 282698 293547
10349B93547N9577k972N6930N8050j44127o1968L700j8108J44866J39750O813
$$ 293547 353124 350152 407082 465132 321005 259037 262737 244629 389495 529245 536058
10338E36058k03102r7570L2406K2975m3128J02294R3507R1316J9169j27526q940
$$ 536058 332956 235386 267792 290767 247639 349933 443440 534756 553925 426399 417459
10327D17459o6700R952p5839j47086l1529J31472j14055k0664o4499M807J40155
$$ 417459 350759 360711 284872 137786 106257 237729 123674 103010 38511 43318 183473
10316A83473K56187j3755m9912J47866R8574o2579n3443j34687j47660L0714K3259
$$ 183473 439660 425905 375993 523859 622433 559854 506411 371724 224064 254778 278037
10305B78037p2556r4018J734R8551M0635j7229N1972l4337o6491R2602Q0384n1102
$$ 278037 205481 111463 113197 211748 252383 235154 287126 252789 186298 278900 359284 308182
10293C08182R902J7046j8099k7544p5282p9385P545J07076P867J16918q1009k7267
$$ 308182 318084 335130 317031 289487 214205 134820 142365 249441 257308 374226 293217 265950
10281B65950J8454j78857m9802M7902K5926J5808R2852J06277j04653k4622k1033
$$ 265950 284404 105547 55745 103647 129573 145381 238233 344510 239857 215235 194202
10270A94202p6184l8673O6048M0119m8759l9779P1642R4958J39033p6198p2188
$$ 194202 118018 79345 145393 185512 136753 96974 168616 263574 402607 326409 254221
10259B54221K172O5758r0157q4745j1944k6816J6487j24442Q3199J94696j22617
$$ 254221 256393 322151 231994 147249 135305 108489 124976 534 83733 278429 155812
10248A55812n4881J8594Q7121L770l14280j34585J80095J16290j0830M3616j7197
$$ 155812 100931 119525 206646 210416 -103864 -238449 -58354 57936 47106 90722 73525
10237G3525k0025O0310l3455Q6809M2894m6792j2407n9655o1631L015l7405J6824
$$ 73525 53500 113810 80355 167164 210058 163266 150859 91204 29573 32588 -4817 12007
10225A2007n0814Q2497J38113Q2824j7202j19268M6654j02311j05770p1954J2061
$$ 12007 -38807 43690 181803 264627 247425 128157 174811 72500 -33270 -105224 -93163
10214i3163R4023n9969N2544J03162R4023K5767l187m4623m6260r3025j20341
$$ -93163 860 -59109 -6565 96597 190620 216387 213200 168577 122317 29292 -91049
10203i1049N9587N4696J3983L2662J3078L1875J02910M3208k7102k3871k4923
$$ -91049 -31462 23234 37217 69879 82957 114832 217742 260950 233848 209977 185054
10192A85054k1448j19779p983L6209P7296L4717R135j4229P0694Q9618J870N2954
$$ 185054 163606 43827 35844 72053 149349 184066 193201 178972 249666 339284 341154 394108
10180C94108J0830M6101P3701L8196R4002P2864L0751m1727j56019q1945n5516
$$ 394108 404938 451039 524740 562936 656938 729802 760553 718826 562807 480862 425346
10169D25346K05615K32537J45615K09565M8720J5816o8712j66411m6924q6028
$$ 425346 630961 863498 1009113 1218678 1267398 1283214 1214502 1048091 1001167 915139
10159I15139j0764m4065o7146K58451K66073K60459J04023j43957j80566j93397
$$ 915139 904375 860310 793164 1051615 1317688 1578147 1682170 1538213 1357647 1164250
10149A164250j09905o5911Q8385J7734M4438o3575J4670N9928m6717j12281j55793
$$ 1164250 1054345 988434 1076819 1094553 1138991 1075416 1090086 1150014 1103297 991016 835223
10138H35223j35039k42525l07074n7368K1565K59402L06996k2801M4841J32968
$$ 835223 700184 457659 150585 93217 114782 374184 681180 658379 703220 836188
10128H36188M0929q3430k22028k62741r0902j3099K4482j0398m1404j02557R805
$$ 836188 877117 793687 571659 308918 218016 204917 229399 219001 177597 75040 84845
10117H4845J43622m5519o8376n6799K3114J4978n5814j5638K5381J0221k2550
$$ 84845 228467 182948 114572 57773 80887 95865 40051 24413 49794 60015 37465
10106C7465m2784L7308J57003k8136N2923K2102k41702M2327N8394r0705J03894
$$ 37465 -5319 31989 188992 160856 213779 235881 -5821 36506 94900 4195 108089
10095A08089M7598J35062m3895m4050j9170o2872R537K2058J01660n0215n8163
$$ 108089 155687 290749 246854 202804 183634 120762 130299 152357 254017 203802 145639
10084A45639j2888p218K8236j11641k9903J25570M1968L796l8138J0315k4345
$$ 145639 132751 125533 153769 42128 12225 137795 179763 183559 145421 155736 131391
10073A31391M7622J77121J8089p7750p0286L6810P5636j8144n6311O5614K5024
$$ 131391 179013 356134 374223 296473 226187 262997 338633 320489 264178 329792 354816
10062C54816n0951j24898j81806k5358J11467Q211P3732m5872o8106M6575N0860
$$ 354816 303865 178967 -2839 -28197 83270 91481 165213 119341 51235 97810 148670
10051A48670J4863p0561K2751P7358r8934M3115o0160M9962Q6054P5598Q6684
$$ 148670 163533 92972 115723 193081 94147 137262 77102 127064 213118 288716 375400
10040C75400L8172R2475r5281r6624j46250p0738O355k0466J34015K7858m1710
$$ 375400 413572 506047 410766 314142 167892 97154 103509 83043 217058 244916 203206
10029B03206j61146q6906J04324K04750l1948j44417J1125N7177J3560j8224n413
$$ 203206 42060 -44846 59478 264228 232280 87863 98988 156165 169725 151501 146088
10018A46088j06561j00985j0391J97020J90826m4300m6692q9244R2230o9057j08067
$$ 146088 39527 -61458 -71849 125171 315997 271697 225005 135761 227991 158934 50867
10007E0867J28915O2526j23808n2212J2977K4145l7544o1365l7170m1225L4380
$$ 50867 179782 242308 118500 66288 79265 103410 65866 4501 -32669 -73894 -39514
9996c9514J08415J97726J41143q1029j18292J4413R030K6984j25867L034K3991
$$ -39514 68901 266627 407770 326741 208449 222862 231892 258876 133009 136043 160034
9985A60034o9089j03785J7847P6477K9636l2782J4945k1814P810J00876k8174
$$ 160034 90945 -12840 5007 81484 111120 78338 93283 71469 79279 180155 151981
9974A51981r8684N2359l3598k13214k9661J60335M0764M2545K7846M5591j3592
$$ 151981 53297 105656 72058 -141156 -170817 -10482 30282 72827 100673 146264 132672
9963A32672j5079K1587k9736j9441l4980J22948M3698K166j26444k3444n2260
$$ 132672 117593 139180 109444 90003 55023 177971 221669 223835 97391 73947 21687
9952B1687J04534p7079j80880m4866R6160N4392N9437j6035L1309K07793Q4287
$$ 21687 126221 49142 -131738 -176604 -80444 -26052 33385 17350 48659 256452 340739
9941C40739j03630M3900p8209j24487J0229J7748n4196K2921m5426M2009J52532
$$ 340739 237109 281009 202800 78313 88542 106290 52094 75015 29589 71598 224130
9930B24130m4406k7377j475o5819j07375n4859O7620J00890P5430m0385m6057
$$ 224130 179724 152347 150872 85053 -22322 -77181 -9561 91329 166759 126374 80317
9919H0317r2675n1762n4459m7910R1027n5210m9309J07053J70823j01149j3377
$$ 80317 -12358 -64120 -118579 -166489 -75462 -130672 -179981 -72928 97895 -3254 -16631
9908a6631N7666p2759j27367M5132K7167j2181M6993J50019P0286j07538N0290
$$ -16631 41035 -31724 -159091 -113959 -86792 -98973 -51980 98039 168325 60787 111077
9897A11077O4374M9080q4249l9256k8752L837M3969N1075j4858k3426K0465j78623
$$ 111077 175451 224531 140282 101026 72274 76111 120080 171155 156297 132871 153336 -25287
9885b5287j36387L6805J18986L4074p2446K8812K7117N8339P0649N2751p5020
$$ -25287 -161674 -124869 -5883 28191 -44255 -15443 11674 70013 140662 193413 118393
9874A18393K1607L1754n388N7535m7382q2940N322R9588m4646O496k7864J5272
$$ 118393 140000 171754 166366 223901 176519 93579 98901 198489 153843 160339 132475 147747
9862A47747j26862q1445P8580O4731N8847p5679n9340j20976M953p1181L6690
$$ 147747 20885 -60560 18020 82751 141598 65919 6579 -114397 -109444 -180625 -143935
9851a43935Q5638J09748M7708J6710j14461m189M7512j40677k9057L3560J7474
$$ -143935 -58297 51451 99159 115869 1408 -2781 44731 -95946 -125003 -91443 -73969
9840g3969M1878n4447P293J49062L6869M3106O5267l731k5657n3167j6828p8505
$$ -73969 -32091 -86538 -79245 69817 106686 149792 215059 211328 185671 132504 115676 37171
9828C7171N9397o4252j5411J51970r671k1280j82041n5493k3190l0434j7153Q4851
$$ 37171 96568 32316 16905 168875 159204 137924 -44117 -99610 -122800 -153234 -170387 -85536
9816h5536J70473N6032j09541p7153n3029l1659l4013Q7724M0217k9211p8324
$$ -85536 84937 140969 31428 -45725 -98754 -130413 -164426 -76702 -36485 -65696 -144020
9805a44020J56535Q8559n2070M5411n214K0345L8277l2457M2528L8615j04516
$$ -144020 12515 101074 49004 94415 89201 109546 147823 115366 157894 196509 91993
9794I1993j9717j8966o8047J0463N7118J10799P4254k12880q0297J04064O0535
$$ 91993 72276 53310 -14737 -4274 52844 163643 237897 25017 -55280 48784 109319
9783A09319n6342J377j35513j6436N105J84249l0827j14038L374K9505q4218l217
$$ 109319 52977 54354 -81159 -97595 -92490 91759 60932 -53106 -49732 -20227 -104445 -107662
9771a07662J47099M5485n3667N2467K1035j03898k02890l1032R7951O9316J19397
$$ -107662 39437 84922 31255 83722 104757 859 -202031 -233063 -135112 -65796 53601
9760E3601O6544j0022J6945O2250N3206N2324k11966j22234l0325O440K7409P752
$$ 53601 120145 110123 127068 189318 242524 294848 82882 -39352 -69677 -63237 -35828 -28076
9748b8076q0071q1136j1534R4747r007p2892J10008J76476J0304r5090r6801J59038
$$ -28076 -108147 -189283 -200817 -106070 -115077 -187969 -77961 98515 108819 13729 -83072 75966
9736G5966j2986q3056L5925L2907O7453N0345O0422N5901K0716l983m3552J2401
$$ 75966 62980 -20076 15849 48756 116209 166554 226976 282877 303593 299610 256058 268459
9724B68459p2933q4100K4N940M9964o338l9091r4708r5954N2974q4743L1899K3660
$$ 268459 195526 111426 111450 117390 167354 161016 121925 27217 -68737 -15763 -100506 -68607 -44947
9711d4947Q2830J8796m0375J2850M2575O4737m4651O5411O2112j45834K8421l1084
$$ -44947 37883 56679 16304 29154 71729 136466 91815 157226 219338 73504 101925 70841
9699G0841j57124J36243K0608M3041j63367N0762O6911j29724q7052J5734p1486
$$ 70841 -86283 49960 70568 113609 -49758 1004 67915 -61809 -148861 -133127 -204613
9688b04613Q9230j21434o8955L0O8562Q8755N6224J00838P4873J7877L3817l8993
$$ -204613 -115383 -236817 -305772 -305742 -237180 -148425 -92201 8637 83510 101387 135204 96211
9676I6211p2987n7893Q3886j07385p0111J19164J59275n594L0639r6269j9360
$$ 96211 23224 -34669 49217 -58168 -128279 -9115 150160 144566 175205 78936 59576
9665E9576m3635j00243N1832J49488L8975n5599l7283k0155j8644Q1218J16188
$$ 59576 15941 -84302 -32470 117018 155993 100394 63111 42956 24312 105530 221718
9654B21718N5080L8123J95361J931k20436j74994q6971j22776q669K6275K4343
$$ 221718 276798 314921 510282 512213 291777 116783 29812 -92964 -101633 -75358 -51015
9643e1015L1612L9047J02983n0309j19823j66456N4962R3250r892L2128J32305
$$ -51015 -19403 19644 122627 72318 -47505 -213961 -158999 -65749 -75641 -43513 88792
9632H8792J25521J4372l0901r3340j02919k8519r3156K8008J31961P29n8712j07995
$$ 88792 214313 228685 197784 104444 1525 -26994 -120150 -92142 39819 40548 -18164 -126159
9620a26159m0839R1984Q7393J63876o8491l8348l1142j47672K1012O83n4350J04605
$$ -126159 -166998 -75014 12379 176255 107764 69416 38274 -109398 -88386 -87703 -142053 -37448
9608c7448M7693o7559p7173Q6409J7813k0828J4281k0190L1789Q4097j5464O2495
$$ -37448 10245 -57314 -134487 -48078 -30265 -51093 -36812 -57002 -25213 58884 43420 105915
9596A05915P0255l5887j06320m1874j7221j03173r4058K4978O2429j8205J21550
$$ 105915 176170 140283 33963 -7911 -25132 -128305 -222363 -197385 -134956 -153161 -31611
9585c1611J41784r6557q0442N4596l5643J521J27830p19M616M9019m6314n556
$$ -31611 110173 13616 -66826 -12230 -47873 -46352 81478 80759 85375 134394 88080 82524
9573H2524L5904O6086j42849j61623l9857M0631P2566Q3822j4601K2631O2790
$$ 82524 118428 184514 41665 -119958 -159815 -119184 -46618 37204 22603 45234 108024
9562A08024L4905r7866J374k0480N5290P64j08930o4001m7561K26637o8528p3753
$$ 108024 142929 45063 46437 25957 81247 82011 -26919 -90920 -138481 88156 19628 -54125
9550e4125j38400q4582P7826Q6368p3712J08431k7088m1445J07512J3431J4038
$$ -54125 -192525 -277107 -199281 -112913 -186625 -78194 -105282 -146727 -39215 -25784 -11746
9539a1746K1119M5497N6676Q033j00455j09312J9150J19080J83761j38129r8890
$$ -11746 9373 54870 111546 119579 19124 -90188 -71038 48042 231803 93674 -5216
9528e216Q0098R4606O8635J0281j22796p0348o9815j23074J1029j8544R0117Q2998
$$ -5216 74882 169488 238123 248404 125608 55260 -14555 -137629 -126600 -145144 -55027 27971
9516B7971M9754j01081J49983L0980m8693j46868R1029L7373m6617M1949M8683
$$ 27971 77725 -23356 126627 157607 108914 -37954 53075 90448 43831 85780 134463
9505A34463q8443n6902N5688l395o2576r075J88108J08606p8281q9110L883l1678
$$ 134463 46020 -10882 44806 41411 -21165 -30240 157868 266474 188193 99083 102966 71288
9493G1288j03978o3033J00644R5074q6653q8597J3513P1806j45674p9101J48660
$$ 71288 -32690 -95723 4921 99995 13342 -75255 -61742 10064 -135610 -214711 -66051
9482f6051P6602L8504r5707j19104O2250K2439J34145P4309j54540j16462l1349
$$ -66051 10551 49055 -46652 -165756 -103506 -81067 53078 127387 -27153 -143615 -174964
9471a74964R9425N3777K7026l4215L3737Q1856r4172l7568J49866M8238p6566
$$ -174964 -75539 -21762 5264 -28951 4786 86642 -7530 -45098 104768 153006 76440
9460G6440j49325l8188L4983M3297J66828O6099j50685M1024K1623n9038j2126
$$ 76440 -72885 -111073 -76090 -32793 134035 200134 49449 90473 112096 53058 40932
9449D0932k1435K0913M2655R704j49769l3986J7276J0642l7978q9505J31393j10552
$$ 40932 19497 40410 83065 92769 -57000 -90986 -73710 -63068 -101046 -190551 -59158 -169710
9437a69710o9198l5178J92356J499m9511J52232P1726j30599q5624j31196k371
$$ -169710 -238908 -274086 -81730 -80231 -129742 22490 94216 -36383 -122007 -253203 -255574
9426b55574K44698N8495p7983M9617O5076j3656m4783p6592k3232R446j840J40898
$$ -255574 -10876 47619 -30364 19253 84329 70673 25890 -50702 -73934 -64488 -66328 74570
9414G4570J39263n1399o5547j8166J5609q430M019M1397j03530j88899m8110J2769
$$ 74570 213833 162434 96887 78721 94330 85900 89919 131316 27786 -161113 -209223 -196454
9402a96454p0131J6172L8420K07048L8032K8595J14527r1274o8896P4464m7607
$$ -196454 -266585 -250413 -211993 -4945 33087 61682 176209 84935 16039 90503 42896
9391D2896j46948l3115P6405J45627M0919k0658j57258l5604J98624J52578j05847
$$ 42896 -104052 -137167 -60762 84865 125784 105126 -52132 -87736 110888 263466 157619
9380A57619n2676r5120o2008j09039L477J3322j11906q5615k5005J45195K13321
$$ 157619 104943 9823 -52185 -161224 -157747 -144425 -256331 -341946 -366951 -221756 -8435
9369h435J36781q2405j51250J1174R8634j37980j02094J10372J7093j42527O0304
$$ -8435 128346 45941 -105309 -94135 4499 -133481 -235575 -125203 -108110 -250637 -190333
9358a90333l0002Q5534M7346O2745J09187L870K0388j53270M998R2196k8853j39060
$$ -190333 -220335 -134801 -87455 -24710 84477 88347 108735 -44535 -39537 52659 23806 -115254
9346a15254p5097L8289J72559P2854R1772n0124k2054j04798j20380J37481J03602
$$ -115254 -190351 -152062 20497 93351 185123 134999 112945 8147 -112233 25248 128850
9335A28850L0264P635J13536Q4853m7030K7677J6236p1940k7261J36463j27431
$$ 128850 159114 166749 280285 365138 318108 345785 362021 290081 262820 399283 271852
9324B71852L635J9725j01583q9300r7268J38979J94274J6088m5123p2114l6653
$$ 271852 275487 295212 193629 104329 7061 146040 340314 356402 311279 239165 202512
9313B02512k3219r3330o1529M3249o2424K6253j5821M4126J51419o0762j12797
$$ 202512 179293 85963 24434 67683 5259 31512 15691 59817 211236 150474 37677
9302C7677l1670n2774J35940R133R185m0140j5618j08620J4152k5716q0465Q5354
$$ 37677 6007 -46767 89173 98306 107491 67351 51733 -56887 -42735 -68451 -148916 -63562
9290f3562J303p8162n3866J2441P9091M8698K7319J23772l3982P8807N2953J2208
$$ -63562 -62259 -140421 -194287 -181846 -102755 -54057 -26738 97034 63052 141859 194812 207020
9278B07020j28581Q860N5001l5390K8424M9427o5733r9062j95623M7101J22382
$$ 207020 78439 87299 142300 106910 135334 184761 119028 19966 -175657 -128556 -6174
9267f174J62146l4709p0008O1886n8213j07759K3919j8553K0344K0431q0124m8091
$$ -6174 155972 121263 51255 113141 54928 -52831 -28912 -47465 -27121 -6690 -86814 -134905
9255a34905K4458K7021k0390J0965l6104r5412J21080R7907K1148k3585k3547
$$ -134905 -110447 -83426 -103816 -92851 -128955 -224367 -103287 -5380 15768 -7817 -31364
9244c1364r5068j494J82058N025m7018M4088O8814m2773m562J13486M6276j43234
$$ -31364 -126432 -127926 54132 59157 12139 56227 125041 82268 77706 191192 237468 94234
9232I4234r4511r5300r1422j130l2320J16918Q2626O9357N1311p1203j11899k9617
$$ 94234 -277 -95577 -186999 -188129 -220449 -103531 -20905 48452 99763 28560 -83339 -112956
9220a12956M9798N4338J02807l4137l0883j53672j51162J7859J94144r36n2248
$$ -112956 -63158 -8820 93987 59850 28967 -124705 -275867 -258008 -63864 -64800 -117048
9209a17048j7458l2960L5812P328O7956l3942K4682j138R2628M9926O0006O6928
$$ -117048 -134506 -167466 -131654 -124326 -56370 -90312 -65630 -66768 25860 75786 135792 202720
9197B02720N6569K4573k2025l8151p9804j3291o5547o4301n3327l5967O4713P2048
$$ 202720 259289 283862 261837 223686 143882 130591 65044 743 -52584 -88551 -23838 48210
9185D8210L6550L3337j0925m4288n5874M7442L8626q456p7187m5886j26390m2579
$$ 48210 84760 118097 107172 62884 7010 54452 93078 84622 7435 -38451 -164841 -207420
9173b07420r9594k726J87870P4849P5328m938k2016J5771M5299j16127M3934J03230
$$ -207420 -307014 -309740 -121870 -47021 28307 23369 1353 17124 62423 -53704 -9770 93460
9161I3460l5794L69l2800Q09p7615J7546J6949j04317j21757N5610m456m4147
$$ 93460 57666 58035 25235 26044 -51571 -34025 -17076 -121393 -243150 -187540 -191996 -236143
9149b36143K0167r215M6768m2451J6519M6550J11604J2732q7485l7777l117L9688
$$ -236143 -215976 -225191 -178423 -220874 -204355 -157805 -46201 -33469 -120954 -158731 -161848 -122160
9137a22160j2157j7692n3172J04608J01062m0153N8863N7422M243o728P9860r9985
$$ -122160 -134317 -152009 -205181 -100573 489 -39664 19199 76621 80864 74136 153996 54011
9125E4011l4949q692J0410J64451J2369j69012k403O3968j40466o6500N6478J18753
$$ 54011 19062 10370 20780 185231 197600 28588 26185 90153 -50313 -116813 -60335 58418
9113E8418j8094o0379q2767o6515L2378R1458k4971P9069l3252O3922r7062j14067
$$ 58418 40324 -20055 -102822 -169337 -136959 -45501 -70472 8597 -24655 39267 -57795 -171862
9101a71862R2798K02590q5113n3099J04476O3336J21778n2600j70410j06917M7051
$$ -171862 -79064 123526 38413 -14686 89790 153126 274904 222304 51894 -55023 -7972
9090g972m9926L329q3585M918J01952o273J5314J04386m3141q4775j671p5835
$$ -7972 -57898 -54569 -138154 -133236 -31284 -37557 -22243 82143 39002 -45773 -47444 -123279
9078a23279j12614j8291p662K17107N3772q6682J5023Q3240O142k6388m4819j1395
$$ -123279 -235893 -254184 -261846 -44739 9033 -77649 -62626 20614 26756 368 -44451 -55846
9066e5846M6146j10545l2593m3974N244O4937M6127J83225Q885j65327m1973J2335
$$ -55846 -9700 -120245 -152838 -196812 -191568 -126631 -80504 102721 111606 -53721 -95694 -83359
9054h3359L1439R889K6542K7960R3222J2428m5126K125o3734m8641Q514p0518
$$ -83359 -51920 -42031 -15489 12471 105693 118121 72995 75120 11386 -37255 -28741 -99259
9042i9259J200m7547m4923M5875j9214M4623M3958P0176O3002O1713j1505j43893
$$ -99259 -98059 -145606 -190529 -144654 -163868 -119245 -75287 -5111 57891 119604 108099 -35794
9030c5794M8072p3918j57989j62142k4258R9208J56564K06755Q1523M4829Q4497
$$ -35794 12278 -61640 -219629 -381771 -406029 -306821 -150257 56498 138021 182850 267347
9019B67347o0582p7425k7368o5520k6513J00391j8244j17281j2067k8867L3800
$$ 267347 206765 129340 101972 36452 9939 110330 92086 -25195 -37262 -66129 -32329
9008c2329N0941l0230q4747m6441K8710j22383r6961j18583K3863N3174K70742
$$ -32329 18612 -11618 -96365 -142806 -114096 -236479 -333440 -452023 -428160 -374986 -104244
8997a04244J5690K0124l9338m1582K1711L1623M4182J20923P1383j06426k6411
$$ -104244 -88554 -68430 -107768 -149350 -127639 -96016 -51834 69089 140472 34046 7635
8986G635J7939j1681J1402m3367J90218n4953n7400j45244J7169Q2578j733r2148
$$ 7635 25574 13893 25295 -18072 172146 117193 59793 -85451 -68282 14296 12563 -79585
8974g9585L2561Q2666O7206J43798O4600j27471j71290o5599L820M2500j25950
$$ -79585 -47024 35642 102848 246646 311246 183775 12485 -53114 -49294 -6794 -132744
8963a32744q1218Q8089m043l1679o0660n0942J417N4163K6618Q1879J39892l7677
$$ -132744 -213962 -125873 -129916 -161595 -222255 -273197 -271780 -217617 -190999 -109120 30772 -6905
8951f905j18761j6488N6062l2875R1060J6098j36967p5651P9798J08250R6394
$$ -6905 -125666 -142154 -86092 -118967 -27907 -11809 -148776 -224427 -144629 -36379 60015
8940F0015N8870j11311m1500P0150j5475q9659K8319M6613l2302m5144n7988j09913
$$ 60015 118885 7574 -33926 36224 20749 -68910 -40591 6022 -26280 -71424 -129412 -239325
8928b39325p2923J60176O1437J08148p994n9011k6413O6461N8873l0791M3269
$$ -239325 -312248 -152072 -90635 17513 9519 -49492 -75905 -9444 49429 18638 61907
8917F1907n0273N1197Q3179k8303j0398K9437J26393k8612j14651j41461L8563
$$ 61907 11634 62831 146010 117707 107309 136746 263139 234527 119876 -21585 16978
8906A6978k542q0848K3290m9531K592L1428o2499N573K9021n4825j6421J6293
$$ 16978 14436 -66412 -43122 -92653 -90061 -58633 -121132 -115559 -86538 -141363 -157784 -141491
8894a41491J10113Q2706l1570P2762R4324K4588j8603m5533j35367j25406q8527
$$ -141491 -31378 51328 19758 92520 186844 211432 192829 147296 11929 -113477 -202004
8883b02004l1985M0748J9778O5695k117Q6862Q0101k5329n6473L6180L1963j26924
$$ -202004 -233989 -193241 -173463 -107768 -109885 -23023 57078 31749 -24724 11456 43419 -83505
8871h3505l5786L4621M611l1719Q3391Q0205Q6851J1570L199m0994j43220P0352
$$ -83505 -119291 -84670 -80059 -111778 -28387 51818 138669 150239 153438 112444 -30776 39576
8859C9576j1465J8251O5410Q6284L3060M1079n2191j88718O3428J34004K5051
$$ 39576 28111 46362 111772 198056 231116 272195 220004 31286 94714 228718 253769
8848B53769k2689j13055l3414o9061l0536r0814J879R7868R2133O5064L3466p2313
$$ 253769 231080 118025 84611 15550 -14986 -105800 -103921 -6053 86080 151144 184610 112297
8836A12297k1439j9089o3306J9533k8607J25164k814Q5184n5082r8521k0423L1127
$$ 112297 90858 71769 8463 27996 -611 124553 121739 206923 151841 53320 32897 64024
8824F4024O24L085n7605k14402Q7222N7685k0323n8432P4377K9566j7389p37q5228
$$ 64024 64648 67733 10128 -204274 -117052 -59367 -79690 -138122 -63745 -34179 -51568 -52305 -137533
8811a37533o9585K2381p2319M9689N0452R2778r144l3604j4094J6362L9681n9685
$$ -137533 -207118 -184737 -257056 -207367 -156915 -64137 -73281 -106885 -120979 -104617 -64936 -124621
8799a24621J66507q361j51980J1917Q6765j30929n7707j7181J06668o0579K164
$$ -124621 41886 33525 -118455 -106538 -19773 -150702 -208409 -225590 -118922 -179501 -177337
8788a77337l8293n4275N170J5506j3122R7132L2556J7331o4447o2633O3027O8242
$$ -177337 -215630 -269905 -264735 -249229 -262351 -165219 -132663 -115332 -179779 -242412 -179385 -111143
8776a11143m6889j8368j9633L6482o8038R7248R4144N8185k6116M8835j0528J2334
$$ -111143 -158032 -176400 -196033 -159551 -227589 -130341 -36197 21988 -4128 44707 34179 46513
8764D6513j6595n1010r508j9279R6354J18278N7479k587r3571J9959J49018j05792
$$ 46513 29918 -21092 -30600 -49879 46475 164753 222232 219645 126074 146033 295051 189259
8752A89259j23839m1967j3951m9268K5715k9027O6251J20747o8814M0732O1481
$$ 189259 65420 23453 9502 -39766 -14051 -43078 23173 143920 75106 115838 177319
8741A77319n0848l8234o7048p1623j01297O1800N5717l6776j9768k5545r5590
$$ 177319 126471 88237 21189 -50434 -151731 -89931 -34214 -70990 -90758 -116303 -211893
8730b11893o1264O9473J87320J01903o3324j45100l6127N5390M552J51840L7830
$$ -211893 -273157 -203684 -16364 85539 22215 -122885 -159012 -103622 -99070 52770 90600
8719I0600J6728L641N7062n1948p6352J27920r4805n1124L5354P9898M7594n1919
$$ 90600 107328 110969 168031 116083 39731 167651 72846 21722 57076 136974 184568 132649
8707A32649o3349J12101K5587j61375j34419J8126m9583O0643J91878o7400j67364
$$ 132649 69300 181401 206988 45613 -88806 -70680 -120263 -59620 132258 64858 -102506
8696a02506n5887Q6773q2057N3873j5123o8135L1482k1655q608l9857J38835M862
$$ -102506 -158393 -71620 -153677 -99804 -114927 -183062 -151580 -173235 -181843 -221700 -82865 -78003
8684g8003J8376J14719J76416p7471j02218j04629l7028M8279n2707k9200L6643
$$ -78003 -59627 55092 231508 154037 51819 -52810 -89838 -41559 -94266 -123466 -86823
8673h6823O2143J23103o0470j40973O5811J68186M7898M3897p5938j40921l1291
$$ -86823 -24680 98423 37953 -103020 -37209 130977 178875 222772 146834 5913 -25378
8662b5378K6447Q0928j05604q895N9383P3630l2786O2940M1881j50586j54020
$$ -25378 1069 81997 -23607 -32502 26881 100511 67725 130665 172546 21960 -132060
8651a32060J4220Q6455M6228j300j4842L9368K5955m4116q9467Q3965L34j19414
$$ -132060 -117840 -31385 14843 13543 -1299 38069 64024 19908 -69559 14406 14740 -104674
8639a04674k7106O8549J13634j12418N1810p613P756q2615O0010K6228O2779R4199
$$ -104674 -131780 -63231 50403 -62015 -10205 -17818 -10062 -92677 -32667 -6439 56340 150539
8627A50539J10516k1801j17894o9089J23648k4147K6445L4055o3543j54421o7543
$$ 150539 261055 239254 121360 52271 175919 151772 178217 212272 148729 -5692 -73235
8616g3235j4o3698j8655K15420J44478M9761p6447q7572l2715m3269N2713O2138
$$ -73235 -73249 -136947 -155602 59818 204296 254057 177610 90038 57323 14054 66767 128905
8604A28905r6491m1060L4349N3898n0702J5962M0893r341r962J9582K1752j12130
$$ 128905 32414 -8646 25703 79601 28899 44861 85754 76413 66451 86033 107785 -4345
8592d345k1600o213N9491O2420k6535Q228Q62o1374m8122n4096M1554n7176K5559
$$ -4345 -25945 -32158 27333 89753 63218 71446 72308 10934 -37188 -91284 -49730 -106906 -81347
8579h1347Q9516k9515m6310Q9150P0729r7222L7223N0168l9483M3130o905j30757
$$ -81347 8169 -21346 -67656 21494 92223 -4999 32224 82392 42909 86039 79134 -51623
8567e1623m3169L4712N6841J03537J0017q5289l4724l6180L8431K3326K8151J08685
$$ -51623 -94792 -60080 -3239 100298 110315 25026 -9698 -45878 -7447 15879 44030 152715
8555A52715n6411m1197J7799n8469o5687r1875M7329J21801O1503j06333r4087
$$ 152715 96304 55107 72906 14437 -51250 -143125 -95796 26005 87508 -18825 -112912
8544a12912l9498L8648K137M6725K2458r5462M4668m530L5767M4426j7374n5560
$$ -112912 -152410 -113762 -111625 -64900 -42442 -137904 -93236 -97766 -61999 -17573 -34947 -90507
8532i0507K6329Q1325r0171M1329J71m414N5453O9299l2973r2229n3636O7240
$$ -90507 -64178 17147 -73024 -31695 -31524 -35938 19515 88814 55841 -36388 -90024 -22784
8520b2784O2412l2127O547O0912P1408o062q6602o7688j15995k7627J67565R3569
$$ -22784 39628 7501 14048 74960 146368 140306 53704 -13984 -129979 -157606 9959 103528
8508A03528j13168j12478J09462J14477K6938p3276j10364j5078Q3542j0733m1787
$$ 103528 -9640 -122118 -12656 101821 128759 55483 -54881 -69959 13583 2850 -38937
8497c8937m8826r9515P9863Q3693J59818K9873j1792P8799o9067l2731p0019M6081
$$ -38937 -87763 -187278 -107415 -23722 136096 165969 154177 232976 163909 131178 61159 107240
8485A07240m6877j18683M6662k5173P4067K0998P4685N9484j41933j92005K4015
$$ 107240 60363 -58320 -11658 -36831 37236 58234 132919 192403 50470 -141535 -117520
8474a17520o5713J3990J59534J704j6339p3735q0873J7227k6044l4721N6276K9354
$$ -117520 -183233 -169243 -9709 -8005 -24344 -98079 -178952 -161725 -187769 -222490 -166214 -136860
8462a36860Q8864O0115J32463J77494K6485p4740j40634o0436j18975k3362K06097
$$ -136860 -47996 12119 144582 322076 348561 273821 133187 72751 -46224 -69586 136511
8451A36511O3109n6288J6989n3210J2691J24103m245m5518P592p6338n2810m2789
$$ 136511 199620 143332 160321 107111 119802 243905 239660 194142 201734 125396 72586 29797
8439B9797o2493j04591O6207M7510R3909L6051o0826J5739J39289r4633n7403
$$ 29797 -32696 -137287 -71080 -23570 70339 106390 45564 61303 200592 105959 48556
8428D8556Q9869J33475j4448n7229j14290k4596L709q7374q7482K8115M1567n6042
$$ 48556 138425 271900 257452 200223 85933 61337 65046 -22328 -109810 -81695 -40128 -96170
8416i6170j09010J08465R5350L9326P6256J4970r7618j71359k7257J07693J37665
$$ -96170 -205180 -96715 -1365 37961 114217 129187 31569 -139790 -167047 -59354 78311
8405G8311J7143k7170q4640p4541j00224q0708L3047P5864K822k3044j9198M7767
$$ 78311 95454 68284 -16356 -90897 -191121 -271829 -238782 -162918 -160096 -183140 -202338 -154571
8393a54571O279J38472J41730o203n3694j41267K0358K325K1125l0107L508J16510
$$ -154571 -148292 -9820 131910 125707 72013 -69254 -48896 -46571 -25446 -55553 -52045 64465
8381F4465Q2117N0340N2616j8393J20545o5795r1462m3596L1242q6659l1306q6545
$$ 64465 146582 196922 249538 231145 351690 285895 194433 150837 182079 95420 64114 -22431
8369b2431j6275m1029M4460J15314L3476j473J0410q9063P6846j8121o8344k511
$$ -22431 -38706 -79735 -35275 80039 113515 112042 122452 33389 110235 92114 23770 21259
8357B1259o489O7463J4370o9937m7483r3053j07755Q233m6585J4688N7982J59727
$$ 21259 14770 82233 96603 26666 -20817 -113870 -221625 -213392 -259977 -245289 -187307 -27580
8345b7580J41134L4939J53135K77881K45555R6114k08807k86933j00610j37279
$$ -27580 113554 148493 301628 579509 825064 921178 712371 425438 324828 187549
8335A87549j00728l5989j30728j00181M6822O4407J18274L3203j59653q8792P9007
$$ 187549 86821 50832 -79896 -180077 -133255 -68848 49426 82629 -77024 -165816 -86809
8324h6809J10231j5558J3766K4346l261j9079L491J04238p3035o8405P3498Q5610
$$ -86809 23422 7864 21630 45976 42715 23636 27127 131365 58330 -10075 63423 149033
8312A49033l5896p2029j01860j02991o3596M9554J00100L0440P7780K1580J26148
$$ 149033 113137 41108 -60752 -163743 -227339 -177785 -77685 -47245 30535 52115 178263
8301A78263J90691J81050K00565N04325N40692N6706m84767m89476k53266j14742
$$ 178263 368954 550004 750569 1254894 1795586 1852292 1367525 878049 624783 510041
8291E10041j1749L3100J66016M21282N60317N03468k68394o90001o06133l13166
$$ 510041 498292 531392 697408 1118690 1679007 2182475 1914081 1224080 617947 304781
8281C04781o6494q3392j07499O889L21o9740J16116R3665Q9835k2345p7621m7540
$$ 304781 238287 154895 47396 54285 54606 -15134 100982 194647 284482 262137 184516 136976
8269A36976j16980k7089J76978l270J7159j00820l5313r12M5050J78987l9898
$$ 136976 19996 -7093 169885 166615 183774 82954 47641 46729 91779 270766 230868
8258B30868j19055m5477J61326K16456L03407J86617K47045r605J46768J91770
$$ 230868 111813 66336 227662 444118 747525 934142 1181187 1171582 1318350 1510120
8248A510120N28069J65337n43468n30513l96258l38812j82849r0121O515m6156
$$ 1510120 2038189 2203526 1660058 1129545 733287 394475 211626 121505 128020 81864
8238H1864j7243j17820k6288L8780M2863P4614o7369j0107L6923r4246o9859J2138
$$ 81864 64621 -53199 -79487 -40707 2156 76770 9401 -706 36217 -58029 -127888 -115750
8226a15750j9380L7932K6357M6140M2227j09594J0463M8544p1681p3231j30340
$$ -115750 -135130 -97198 -70841 -24701 17526 -92068 -81605 -33061 -104742 -177973 -308313
8215c08313J1390r134o2789J57257P2889o2674m7371J06851J21913j0319l3857
$$ -308313 -296923 -306057 -368846 -211589 -138700 -201374 -248745 -141894 -19981 -30300 -64157
8204f4157o3086P4304J01309m6634M0267M8567o6159n4753N0891o999l5129k4470
$$ -64157 -127243 -52939 48370 1736 42003 90570 24411 -30342 20549 13550 -21579 -46049
8192d6049p8363k4153o1400J61711R5606l7302k3651o6805l0061J02806O0769
$$ -46049 -124412 -148565 -209965 -48254 47352 10050 -13601 -80406 -110467 -7661 53108
8181E3108j43666j02706J60665m1492M5361P7980O8996p6604O7096Q9794q5962
$$ 53108 -90558 -193264 -32599 -74091 -28730 49250 118246 41642 108738 198532 112570
8170A12570o3245J86083L4522j22495j86997k122o0952O0441O4994L5997k3879
$$ 112570 49325 235408 269930 147435 -39562 -41684 -102636 -42195 22799 58796 34917
8159C4917m8045k9772J0086J08929O1147N1148K5895j43614k680M9376k9019j78725
$$ 34917 -13128 -42900 -32814 76115 137262 188410 214305 70691 68011 117387 88368 -90357
8147i0357j02629n4850O4698J17748o8768n6956j3389K8100J76467M6720j7921
$$ -90357 -192986 -247836 -183138 -65390 -134158 -191114 -204503 -176403 64 46784 28863
8136B8863r0185O3636Q490N379r808N3339R5075L2120q0808j25846m8278N9096
$$ 28863 -61322 2314 10804 16183 6375 59714 154789 186909 106101 -19745 -68023 -8927
8124h927L9273m9941m0709K5609J63721o3566j23811o6698j23415j4439L0919
$$ -8927 30346 -19595 -60304 -34695 129026 65460 -58351 -125049 -248464 -262903 -231984
8113b31984Q496K27213J59180q1217r8383m0082L4349k7282M2338m9795L3185
$$ -231984 -223488 3725 162905 81688 -16695 -56777 -22428 -49710 -7372 -57167 -23982
8102b3982P6201L6817o2357q3321n2773j08824O35L8403R4624J17075r3519o1813
$$ -23982 52219 89036 26679 -56642 -109415 -218239 -217604 -179201 -84577 32498 -61021 -122834
8090a22834P5092n694K5246K7305j9470J5088R4965M893j0037l6709j21748r252
$$ -122834 -47742 -53436 -28190 -885 -20355 -5267 89698 94591 84554 47845 -73903 -83155
8078h3155J24676O7487N0936q2278j10217M3809J25782m799j87555n6841p2217
$$ -83155 41521 109008 159944 77666 -32551 11258 137040 132241 -55314 -112155 -184372
8067a84372r0959l1091P9010M4720P2716j6957K8274R6827M8726N5008J6686J5249
$$ -184372 -275331 -306422 -227412 -182692 -109976 -126933 -98659 -1832 46894 101902 118588 133837
8055A33837P968j21758N183L9853k2250p2301L3767j3352k3654L9057p3344M6364
$$ 133837 141805 20047 25230 65083 42833 -29468 4299 -9053 -32707 6350 -66994 -20630
8043b0630L5926m9459k065N810p6794k2094O4494N5125k4527k6948J0060K4296
$$ -20630 15296 -34163 -36228 -30418 -107212 -129306 -64812 -9687 -34214 -61162 -51102 -26806
8031b6806n0837j1950p769k2339p0903j0078o0112p9353M1101R2385J67293R3778
$$ -26806 -77643 -89593 -97362 -119701 -190604 -200682 -260794 -340147 -299046 -206661 -39368 54410
8019E4410r8608j09179L1417m0313N786O4089J02012R238q7700l0081k6867p8453
$$ 54410 -44198 -153377 -121960 -162273 -156487 -92398 9614 18852 -68848 -98929 -125796 -204249
8007b04249P1211P6018k9269l7120R2657m0427o0734J79481J7609J53071K2716
$$ -204249 -133038 -57020 -86289 -123409 -30752 -71179 -131913 47568 65177 218248 240964
7996B40964P820J01037N1224Q0011J60280O5173r3717k44746O4429j12310k55257
$$ 240964 248784 349821 401045 481056 641336 706509 612792 368046 432475 320165 64908
7985F4908j34486K0712N1466j2453j54824K2328J53164N6095R6012J92454k0890
$$ 64908 -69578 -48866 2600 -9853 -164677 -142349 10815 66910 162922 355376 334486
7974C34486j47020l4674n3356k5700J494N1986r862r2858r7387n8092k5501K9813
$$ 334486 187466 152792 99436 73736 75230 127216 117354 24496 -72891 -130983 -156484 -126671
7962a26671j5229K3612j8820J0648J93289Q0878M1493l2313M8100J13930Q9382
$$ -126671 -141900 -118288 -137108 -126460 66829 147707 189200 156887 204987 318917 408299
7951D08299Q0321K46216J59030J26465p3769n4614K139R3551m550j75872k17741
$$ 408299 488620 734836 893866 1020331 946562 891948 894087 987638 983088 807216 589475
7940E89475j23391O286m8191q6110n8067j21797j4111N4582n4501q8161r155K9563
$$ 589475 466084 472370 424179 338069 280002 158205 144094 198676 144175 56014 46859 76422
7928G6422j12777J8035R4471K855j223n8549o4645K5155K0948r0038O5902J63608
$$ 76422 -36355 -18320 76151 79006 77783 19234 -45411 -20256 692 -89346 -23444 140164
7916A40164J11638k1205j4085j19276L5165J02426L3407l9403Q4015N2030j56646
$$ 140164 251802 230597 216512 97236 132401 234827 268234 228831 312846 364876 208230
7905B08230L8113J82268J96055J28861j14816l10504k16798j82563j7507j4287
$$ 208230 246343 428611 624666 753527 638711 328207 111409 -71154 -88661 -102948
7895a02948J13924k4406J43633K2843n6564N5851k6547m9112p6731n0091K9996
$$ -102948 10976 -13430 130203 153046 96482 152333 125786 76674 -57 -50148 -20152
7884b0152Q5644m7885M5776J00668M1791q8581j46025j15742k3585J80739O3524
$$ -20152 65492 17607 63383 164051 205842 117261 -28764 -144506 -168091 12648 76172
7873G6172r6852j43550l345Q2422Q7697L764L6797Q853m7095n6477l4775R919
$$ 76172 -20680 -164230 -167575 -85153 2544 6308 43105 51958 4863 -51614 -86389 -76470
7861g6470Q1947K7602k5661M3917L6139q4680m9557N6814r436P0932L89l6643
$$ -76470 5477 33079 7418 51335 87474 2794 -46763 10051 615 71547 71936 35293
7849C5293o4102r1052o9044P6616K8680K686m3671o470k3494L249N0182r734n3412
$$ 35293 -28809 -119861 -188905 -112289 -83609 -80923 -124594 -131064 -154558 -151309 -101127 -110861 -164273
7836a64273J4337K7610O8542M2162l168o8640J40354J7739O7322R725L9918J9904
$$ -164273 -149936 -122326 -53784 -11622 -14790 -83430 56924 74663 141985 151710 191628 211532
7824B11532q546r5636L2894L9386j0188j10975k1833M1388j01615r8086k0716
$$ 211532 202986 107350 140244 179630 169442 58467 36634 78022 -23593 -121679 -142395
7813a42395O3051P1454l223n5537o8738l5236k3934P4297J1901j03871O0161R2225
$$ -142395 -79344 -7890 -11113 -66650 -135388 -170624 -194558 -120261 -108360 -212231 -152070 -59845
7801e9845n502O1855R3511q7943j22528l8224Q4747L7276J15154J5066r7643n4561
$$ -59845 -65347 -3492 90019 2076 -120452 -158676 -73929 -36653 78501 93567 -4076 -58637
7789e8637L6538J00054j42815j07175j5802R8493J07096j21249m5617J84019J43333
$$ -58637 -22099 77955 -64860 -172035 -187837 -89344 17752 -103497 -149114 34905 178238
7778A78238P5002p1189k28313p8488J7345O7690O8304M1152q1822r0836q2591
$$ 178238 253240 182051 -46262 -124750 -107405 -39715 28589 69741 -12081 -102917 -185508
7767a85508N710K3793J22921N4608j90443r5147N5826m2075O494o775M4614P0023
$$ -185508 -179798 -156005 -33084 21524 -168919 -264066 -208240 -250315 -243821 -250596 -205982 -135959
7755a35959j846k2425j02026j3343P2936L3689J8367L8299j1153O0961j6111M133
$$ -135959 -137805 -160230 -262256 -275599 -202663 -168974 -150607 -112308 -123461 -62500 -78611 -74478
7743g4478O1106j17175j66991O6121j1182j00563n6504J59006R4907j3508m212
$$ -74478 -13372 -130547 -297538 -231417 -242599 -343162 -399666 -240660 -145753 -159261 -163473
7732a63473O493N4998J04310P0323n166j46827J04975K01047j03769o3883m650
$$ -163473 -156980 -101982 2328 72651 67485 -79342 25633 226680 122911 59028 54378
7721E4378j6103p085Q5814o017n2744j30186L4365Q4741L7987J33857j31791k11403
$$ 54378 38275 31190 117004 110987 58243 -71943 -37578 47163 85150 219007 87216 -124187
7709a24187P0950J54616M7436K5222q4801P4658P282k97623j90056q9709J17290
$$ -124187 -53237 101379 148815 174037 89236 163894 171176 -126447 -316503 -406212 -288922
7698b88922J38784R549N5641k757M8589l1035R6280L035L5316p2839K7285M9138
$$ -288922 -150138 -140589 -84948 -87705 -39116 -70151 26129 29164 64480 -8359 18926 68064
7686F8064p576o4267n6060Q3506k7993j14624K9221k657O0835k4867m5954j88148
$$ 68064 60488 -3779 -59839 23667 -4326 -118950 -89729 -92386 -31551 -56418 -102372 -290520
7674b90520J06905K05374M2170r4537p4020m5542O7846Q842N9311j3120k58592
$$ -290520 -183615 21759 63929 -30608 -104628 -150170 -82324 -73482 -14171 -27291 -285883
7663b85883n1227N2538k8339L7033j7795J0894j33088j0605P0973J14306K5343
$$ -285883 -337110 -284572 -312911 -275878 -293673 -282779 -415867 -426472 -355499 -241193 -215850
7652b15850J09084L5059N660o9964q1492P0236K9991R547n1805r0979O7916J23785
$$ -215850 -106766 -71707 -66047 -136011 -217503 -147267 -117276 -107729 -159534 -250513 -182597 -58812
7640e8812L0105p3671M7487Q3514p3051j9689P3297R9576m5406k18580n2528J0355
$$ -58812 -28707 -102378 -54891 28623 -44428 -64117 9180 108756 63350 -155230 -207758 -197403
7628a97403J147M7991k3864K3974j8837J25129K5640j6878J13621P9709l1570
$$ -197403 -196256 -148265 -172129 -148155 -166992 -41863 -16223 -33101 80520 160229 128659
7617A28659J8780r6848j76025j00203J12157j07780r0539J99907J26324L3024
$$ 128659 147439 50591 -125434 -225637 -113480 -221260 -311799 -111892 14432 47456
7607D7456k8601O107O9487J6980K8222q7367j13364j19144o8814L5355J21890
$$ 47456 18855 24962 94449 111429 139651 52284 -61080 -180224 -249038 -213683 -91793
7596i1793J33503l7884k2325r2968l720M6731R7412j3719L3471l1732m2973l7254
$$ -91793 41710 3826 -18499 -111467 -115187 -68456 28956 15237 48708 16976 -25997 -63251
7584f3251J0749o285N221J12372P4052m4580k5247K8702O56l8084L5725K0797
$$ -63251 -52502 -58787 -53566 58806 132858 88278 63031 91733 92389 54305 90030 110827
7572A10827j5688n9644p1909j4505k0626L3941L6586O1398K9942j12148j34294
$$ 110827 95139 35495 -36414 -50919 -71545 -37604 -1018 60380 90322 -21826 -156120
7561a56120O0826M5656l3125l5646L8157J05879O8702k1598k1087M2853N1221
$$ -156120 -95294 -49638 -82763 -118409 -80252 25627 94329 72731 51644 94497 145718
7550A45718n3391j81679M1366N4049n1267l3922P6310J38797M4044j6558k3109
$$ 145718 92327 -89352 -47986 6063 -45204 -79126 -2816 135981 180025 163467 140358
7539A40358j9086N7968j01066m3561j08522q0778j612L7842K6394k972J02224
$$ 140358 121272 179240 78174 34613 -73909 -154687 -156299 -118457 -92063 -95035 7189
7528G189L9407K0181Q5657j21778j13420j18336R856J92405M3937K2162j98717
$$ 7189 46596 66777 152434 30656 -82764 -201100 -191244 1161 45098 67260 -131457
7517a31457P5566m600p7359M2427q211M0008p4456L927N4057o6866m2582k1978
$$ -131457 -55891 -60491 -137850 -95423 -103634 -63626 -138082 -134155 -80098 -146964 -189546 -211524
7505b11524n6994J05606n1281K647n1271L3291N7060O4292K6870n2652j06925
$$ -211524 -268518 -162912 -214193 -211546 -262817 -229526 -172466 -108174 -81304 -133956 -240881
7494b40881n568m3835l7048k8254J40986l9107J71890J04627K8423L6352N6997
$$ -240881 -246449 -290284 -327332 -355586 -214600 -253707 -81817 22810 51233 87585 144582
7483A44582j13097j24207J4764L3963o7438k5481j08822P1137Q954j13167L2918
$$ 144582 31485 -92722 -77958 -43995 -111433 -136914 -245736 -174599 -165645 -278812 -245894
7472b45894N5928O9598R4227K18125P5756o7110j79646r1650J52908R3793J7204
$$ -245894 -189966 -120368 -26141 191984 267740 200630 20984 -70666 82242 176035 193239
7461A93239l5424j14132N6735j741j0017n6962j46934m7759Q1632M6493O7687
$$ 193239 157815 43683 100418 98677 88660 31698 -115236 -162995 -81363 -34870 32817
7450C2817j38345o1102L2046j6515k0561J12031J83944p1564p258j11157l9014
$$ 32817 -105528 -166630 -134584 -151099 -171660 -59629 124315 52751 45493 -65664 -104678
7439a04678P3076k0852L8648L2210J44218P7136M1466q269p1673j06273o2748
$$ -104678 -31602 -52454 -13806 18404 162622 239758 281224 272955 201282 95009 32261
7428C2261q3225p3460K18811J13171m5893j14908p7043M5113J09083o9171l8617
$$ 32261 -50964 -124424 94387 207558 161665 46757 -30286 14827 123910 54739 16122
7417A6122J22841m0703o982q0890K2454m2194o0664N5645m9044n5626n1971K4262
$$ 16122 138963 98260 91278 10388 32842 -9352 -70016 -14371 -63415 -119041 -171012 -146750
7405a46750J9951l8115N2587k4459Q8060N5432M7666N67q7788Q136J25631M454
$$ -146750 -126799 -164914 -112327 -136786 -48726 6706 54372 54939 -32849 -24713 100918 105372
7393A05372q2450m9948q6721o0075K5828M5904M9067J26737P7134j512o4074n906
$$ 105372 22922 -27026 -113747 -173822 -147994 -102090 -53023 73714 150848 149336 85262 79356
7381G9356j08303q1918j34995J11416M9193P6435m0318k8749L2552k1369l1653
$$ 79356 -28947 -110865 -245860 -134444 -85251 -8816 -49134 -77883 -45331 -66700 -98353
7370i8353j4155j6217Q7142m9921j3267J30374N3009O8646m6752j3780k1092l090
$$ -98353 -112508 -128725 -41583 -91504 -104771 25603 78612 147258 100506 86726 65634 62544
7358F2544j97528j25132J59k7513R0893J34449o5967m1757l951J82258M3468J2551
$$ 62544 -134984 -260116 -259957 -287470 -196577 -62128 -128095 -169852 -173803 8455 51923 64474
7346F4474j7447N6386L3148r5184l9641Q0063L8357r1288o8482R373n4460j53849
$$ 64474 47027 103413 136561 41377 1736 81799 120156 28868 -39614 -30241 -84701 -238550
7334b38550k7819k8095O5763N8879L4815N1233N6459R0027N247R0379m2568j37883
$$ -238550 -266369 -294464 -228701 -169822 -135007 -83774 -27315 62712 67959 158338 115770 -22113
7322b2113n088K4497n3401o5400k141R1547J08432J72875K765j47548j01591j05228
$$ -22113 -27201 -2704 -56105 -121505 -123646 -32099 76333 249208 251973 104425 2834 -102394
7310a02394J06839l659M4195K4544l3357j12098K6064P8021j07k8264J7170p2097
$$ -102394 4445 786 44981 69525 36168 -75930 -49866 28155 28048 -216 16954 -55143
7298e5143m1477N267j05767N25R1482q187R1048m7233l7288l4543M6837J3941
$$ -55143 -96620 -91353 -197120 -196595 -105113 -113300 -22252 -69485 -106773 -141316 -94479 -80538
7286h0538n0358m6639Q850N3904o0630J03854o3322n6954j041k2242m3585O3809
$$ -80538 -130896 -177535 -168685 -114781 -175411 -71557 -134879 -191833 -192874 -215116 -258701 -194892
7274a94892j8463M3744M0424k5345M9390j7755J5162J2786J18955R168J2156M5474
$$ -194892 -213355 -169611 -129187 -154532 -105142 -122897 -107735 -94949 24006 33174 45330 90804
7262I0804l0336j8522k4400q2679J35030J287q0310m5239P988J43115p9008m9920
$$ 90804 60468 41946 17546 -65133 69897 71184 -9126 -54365 -46377 96738 17730 -32190
7250c2190m4491o2393j8999o0546j08453K8958J16973k9942l3984K0956K1904
$$ -32190 -76681 -139074 -158073 -218619 -327072 -298114 -181141 -211083 -245067 -224111 -202207
7239b02207J5732o13j29480m5272K17448j4835m244l7002O079M9161L8017O6771
$$ -202207 -186475 -187088 -316568 -361840 -144392 -159227 -163471 -200473 -194394 -145233 -107216 -40445
7227d0445O5184j43786j04797L7162O4339O9427Q9116l3849N1384n3897j23228
$$ -40445 24739 -119047 -223844 -186682 -122343 -52916 36200 2351 53735 -162 -123390
7216a23390J03489J0465p7030L5180L4322p9698L8908m4671p1090J49766J48378
$$ -123390 -19901 -9436 -86466 -51286 -16964 -96662 -57754 -102425 -173515 -23749 124629
7205A24629K817n8595j39074k272N2153P0510j6782m2395n1208l021j44283j17759
$$ 124629 127446 68851 -70223 -72495 -20342 50168 33386 -9009 -60217 -63238 -207521 -325280
7193c25280J13180K06903K8348Q4037R2435n5006j80107J6560R3119j24156M3226
$$ -325280 -212100 -5197 23151 107188 199623 144617 -35490 -18930 74189 -49967 -6741
7182f741P3822m7257J4250M2126m8553j96136p0143R9038J75152n829j1687p5643
$$ -6741 67081 19824 34074 76200 27647 -168489 -238632 -139594 35558 29729 18042 -57601
7170e7601l5819p7068l2082K0067K627P3196R8556n8072m3457j7406J06306J36490
$$ -57601 -93420 -170488 -202570 -182503 -179876 -106680 -8124 -66196 -109653 -127059 -20753 115737
7158A15737o6728r5260o510O9108m5013j01545l7937J64737Q2214O390j74428
$$ 115737 49009 -46251 -52761 16347 -28666 -130211 -168148 -3411 78803 85193 -89235
7147h9235q126j03207P2150J45231N4388j00356q8132O899N9908o9237n4515J49224
$$ -89235 -97361 -200568 -128418 16813 71201 -29155 -117287 -110388 -50480 -119717 -174232 -25008
7135b5008R0479K2361J4551q585j02312O299l9003K9000l2130n6920l6677q8951
$$ -25008 65471 87832 102383 93798 -8514 -2215 -41218 -12218 -44348 -101268 -137945 -226896
7123b26896L7545Q4298M4511K1365J53996K4396q7585r6125q9925J059l5412j2547
$$ -226896 -189351 -105053 -60542 -39177 114819 139215 51630 -44495 -134420 -133361 -168773 -181320
7111a81320K8913N2041J22990J12154P3349j65834k07027m1032l7410J31203R9937
$$ -181320 -152407 -100366 22624 134778 208127 42293 -164734 -205766 -243176 -111973 -12036
7100a2036r218o2338l8711j29906k2595J79522J31390J8609j51621m0289K2077
$$ -12036 -21254 -83592 -122303 -252209 -274804 -95282 36108 54717 -96904 -137193 -115116
7089a15116j02302J6535K0046q6019J41690l0372j3056Q2485J44715J72368n2523
$$ -115116 -217418 -200883 -180837 -266856 -125166 -155538 -168594 -86109 58606 230974 178451
7078A78451j41190q706o3230J9611K5492J8764K2340k8627r9180k1935j6522K521
$$ 178451 37261 28555 -34675 -15064 10428 29192 51532 22905 -76275 -98210 -114732 -112211
7066a12211K2118J7005q722l2712m0094J05313N0432M2862O6599p7301p2081q7827
$$ -112211 -90093 -73088 -81810 -114522 -154616 -49303 1129 43991 110590 33289 -38792 -126619
7054a26619p3420j63858q9241J05474J11124J175j6552J97043K6324J12608J04127
$$ -126619 -200039 -363897 -453138 -347664 -236540 -235365 -251917 -54874 -28550 84058 188185
7043A88185k1427n9823r8554o7230P1136k7468j37245L0562j95J53469O9427r1414
$$ 188185 166758 106935 8381 -58849 12287 -15181 -152426 -121864 -122059 31410 100837 9423
7031I423L5182k6489l6142N2958K7261P7474q1349q1529J04337J0321N624r5532
$$ 9423 44605 18116 -18026 34932 62193 139667 58318 -23211 81126 91447 97071 1539
7019A539j54143r8463Q4094J22300Q5894j52372j91823L9554R7974j6875N9518
$$ 1539 -152604 -251067 -166973 -44673 41221 -111151 -302974 -263420 -165446 -182321 -122803
7008a22803J24237m078j52846l7783L7337o847K4420J870p3417R6454K1700J02638
$$ -122803 1434 -2644 -155490 -193273 -155936 -162783 -138363 -136493 -209910 -113456 -91756 10882
6996A0882J28630N0445o0655j15706J97041J58849K63086K72878J58776K4179
$$ 10882 139512 189957 129302 13596 210637 369486 632572 905450 1064226 1088405
6986A088405j10204k85006l45799j98556n6689K1161q6166n6913K4501K120N7726
$$ 1088405 978201 693195 347396 148840 92151 113312 27146 -29767 -5266 -3146 54580
6975E4580N2543l8101j33678j09261J07834J26489L2890l4328p9620L3067j588
$$ 54580 107123 69022 -64656 -173917 -66083 60406 93296 58968 -20652 12415 10827
6964A0827J6675J04777o7230j6747j9854m9498r5278p6016L6437L1860O4770J7306
$$ 10827 27502 132279 65049 48302 28448 -21050 -116328 -192344 -155907 -124047 -59277 -41971
6952d1971J4901M1601n4909n0885l4530n4410J34127N5658n5863m2049M510L2869
$$ -41971 -27070 14531 -40378 -91263 -125793 -180203 -46076 9582 -46281 -88330 -83820 -50951
6940e0951L8096k1561j71828j29949m9890J5263Q2647R1616P4544J66798k4035
$$ -50951 -12855 -34416 -206244 -336193 -386083 -370820 -288173 -196557 -122013 44785 20750
6929B0750k4746j8249P6120K7546j33179j3467k2455Q5336R1699j82708j34568
$$ 20750 -3996 -22245 53875 81421 -51758 -65225 -87680 -2344 89355 -93353 -227921
6918b27921k3447J43378J67006k5572j81532m8193k2977m0685K5485Q4204R6978
$$ -227921 -251368 -107990 59016 33444 -148088 -196281 -219258 -259943 -234458 -150254 -53276
6907e3276J6904q7695R1704n802l7056l6176L3653L8111J34086q6278k09363j77886
$$ -53276 -36372 -124067 -32363 -38165 -75221 -111397 -77744 -39633 94453 8175 -201188 -379074
6895c79074Q237Q9357J06070p1788p6306J68356J04832k7611m6032K315j07933
$$ -379074 -370837 -281480 -175410 -247198 -323504 -155148 -50316 -77927 -123959 -121644 -229577
6884b29577J18712J31470j42665r9076Q1070r915j08022J42241j8498n320O6417
$$ -229577 -110865 20605 -122060 -221136 -140066 -149981 -258003 -115762 -134260 -139580 -73163
6873g3163J93942R1417r859l9800j25894j28107o550j3714J14299N9727O0236
$$ -73163 120779 212196 202337 162537 36643 -91464 -98014 -111728 2571 62298 122534
6862A22534j12420j35182o9901j85593l4941R6476j8373k0066R1008O5848N3654
$$ 122534 10114 -125068 -194969 -380562 -415503 -319027 -337400 -357466 -266458 -200610 -146956
6851a46956P9388o4420J03346R1944j211L7695o4879r3578j15159m7793J19604
$$ -146956 -67568 -131988 -28642 63302 62091 99786 34907 -58671 -173830 -221623 -102019
6840a02019P2787l3480R9846j25857j1981j2200j8977J25888L3990j58264J3131
$$ -102019 -29232 -62712 37134 -88723 -100704 -112904 -131881 -5993 27997 -130267 -117136
6829a17136Q7227Q1923j14193n2185J19528P5128j62330m9030J1513Q9278j2763
$$ -117136 -29909 52014 -62179 -114364 5164 80292 -82038 -131068 -119555 -30277 -43040
6818d3040j8411j2186k5798p9533P6999L8106j30317j00743J7785J30836J10022
$$ -43040 -61451 -73637 -99435 -178968 -101969 -63863 -194180 -294923 -277138 -146302 -36280
6807c6280N4625q3022m6489N0818J95347o4563k5442L4962k630m0006J5019m3742
$$ -36280 18345 -64677 -111166 -60348 134999 70436 44994 79956 77326 37320 52339 8597
6795H597J5500k7960K4459M9248n3759p2236k7445L0727Q9082M357j05116K3986
$$ 8597 24097 -3863 20596 69844 16085 -56151 -83596 -52869 36213 40570 -64546 -40560
6783d0560J47161O4483n121o4955j52830M3912J78271m0808j06750n585n2817
$$ -40560 106601 171084 165963 101008 -51822 -7910 170361 129553 22803 17218 -35599
6772c5599L0049K4785j12757o382j7729p1119j44210m1559Q8160Q6013r4976l4484
$$ -35599 -5550 19235 -93522 -99904 -117633 -188752 -332962 -374521 -286361 -200348 -295324 -329808
6760c29808M706J78800Q7694K8405K1689N3259q5548m3842J20736j5558r7511
$$ -329808 -325102 -146302 -58608 -30203 -8514 44745 -40803 -84645 36091 20533 -76978
6749g6978o5088k5990j8458J51411J91359m0194o2381Q2475l8618k04149l2470
$$ -76978 -142066 -168056 -186514 -35103 156256 116062 53681 136156 97538 -106611 -139081
6738a39081P8976K09071n4306k19048J4786l8207m1899J00596P9101m8090j59535
$$ -139081 -60105 148966 94660 -124388 -109602 -147809 -189708 -89112 -10011 -58101 -217636
6727b17636r1996J8539L0299K2849R5961J30601j26307Q4940L8111l6537j06421
$$ -217636 -309632 -291093 -260794 -237945 -141984 -11383 -137690 -52750 -14639 -51176 -157597
6716a57597o2697R1643J08681J1490r9621j9944L0748n8967M590j7385l6863J09225
$$ -157597 -220294 -128651 -19970 -8480 -108101 -128045 -97297 -156264 -151674 -169059 -205922 -96697
6704i6697m1781J41941m9660M1955O8678L5638r7280j76089o1314J54912K2270
$$ -96697 -138478 3463 -46197 -4242 64436 100074 2794 -173295 -234609 -79697 -57427
6693e7427K5595m2891J9887q1907q134N1429l0902r3452j4070J20295J56973J41396
$$ -57427 -31832 -74723 -54836 -136743 -144877 -93448 -124350 -217802 -231872 -111577 45396 186792
6681A86792P616j8368o4248o8339j8737p9509j0030J08417q5541J22109R1901
$$ 186792 194408 176040 111792 43453 24716 -54793 -64823 43594 -41947 80162 172063
6670A72063J3573R2040j04158k08636q2803o5862K43653J41456j65691j14428
$$ 172063 185636 277676 173518 -35118 -117921 -183783 59870 201326 35635 -78793
6660g8793J83383J36834n5069j20701q5499K7546Q616J4141O4512J23110k5182
$$ -78793 104590 241424 186355 65654 -19845 7701 16317 30458 94970 218080 192898
6649A92898j9273J40311J80593J41838J85753K21777K97426L45207M28900Q84350
$$ 192898 173625 313936 494529 636367 822120 1043897 1341323 1686530 2115430 2999780
6639B999780J922415K812696P54432k077803j863656q97221l32598J50642K86126
$$ 2999780 4922195 7734891 8489323 6411520 4547864 3650643 3318045 3468687 3754813
6630C754813N52420P43687R00547J305439K027639L031507M292352N320911P216055
$$ 3754813 4307233 5050920 5951467 7256906 9284545 12316052 16608404 21929315 29145370
6621B9145370J1923029K2321045M3775291Q1412727J03410301L764272r9301578
$$ 29145370 41068399 63389444 107164735 188577462 291987763 295752035 196450457
6614A96450457q2980853m4814855k2518093j1971139p365889n255581m313072
$$ 196450457 113469604 68654749 46136656 34165517 26799628 21544047 17230975
6607A7230975l578105k655577j839259j309597r91384p91358m61478j92569L1583
$$ 17230975 13652870 10997293 9158034 7848437 6857053 6065695 5604217 5411648 5443231
6598E443231O78296J654432K253693M08116k283361k339663j470740q27012n14325
$$ 5443231 6121527 7775959 10029652 10437768 8154407 5814744 4344004 3516992 3002667
6589C002667k97248l17295l42171j39077o2259p5552p7353j30627j63041n2416
$$ 3002667 2705419 2388124 2045953 1906876 1844617 1769065 1691712 1561085 1398044 1345628
6579A345628n9199j9537j20726j76742J6768l8469l3581o9968j14847k0757m1920
$$ 1345628 1286429 1266892 1146166 969424 986192 947723 914142 844174 729327 708570 666650
6568F66650r7891O9112r7975n9555Q5890r9528L4066M6995m4825k2299o3198L1426
$$ 666650 568759 637871 539896 480341 566231 466703 500769 547764 502939 480640 417442 448868
6556D48868J24015k3262j05337L2849J21185q1800k5396j7469j09562j05855M1130
$$ 448868 572883 549621 444284 477133 598318 516518 491122 473653 364091 258236 299366
6545B99366N1843o4110p2792n9425l6031K29373P3847n2208J75013L2337J4664
$$ 299366 351209 287099 214307 154882 118851 348224 422071 369863 544876 577213 591877
6534E91877j12891J0662r0887j24151q8084l4363J0704j6247l8412M6139O7674
$$ 591877 478986 489648 398761 274610 186526 152163 162867 146620 108208 154347 222021
6523B22021P8400L6644j27492l0783N954q7689j4592o2256L1578R3204j0551r636
$$ 222021 300421 337065 209573 178790 184744 97055 82463 20207 51785 144989 134438 124802
6511A24802q0439k4357L7779K6661n4206k1469K5144L9351Q5047L6847k7498R2659
$$ 124802 44363 20006 57785 84446 30240 8771 33915 73266 158313 195160 167662 260321
6499B60321K57393J40938j19816j97768O0063N2236l4384m1292q6371j2463M2258
$$ 260321 517714 658652 538836 341068 401131 453367 418983 377691 291320 278857 321115
6488C21115O5695n2170r538j1236n8305j54584q2731J6076K9346J26173k3230
$$ 321115 386810 334640 325102 313866 255561 100977 18246 34322 63668 189841 166611
6477A66611M5045J81021J65282p7093j50788p3764j33302m3208k924O2373O9992
$$ 166611 211656 392677 557959 480866 330078 256314 123012 79804 76880 139253 209245
6466B09245j2891o6422l1831J1232N8399m9926M7903N0314M3442k793P9534j04457
$$ 209245 196354 129932 98101 109333 167732 117806 165709 216023 259465 256672 336206 231749
6454B31749p59k7430R1391Q396r0390j27892n1061n2590O049P6901N9459P8754
$$ 231749 230990 203560 294951 303347 212957 85065 34004 -18586 -12537 64364 123823 202577
6442B02577J09990o0437m2956J831J284k00j36291J8234o269k6560N4442J02480
$$ 202577 312567 252130 209174 211005 212289 212089 75798 94032 87763 61203 115645 218125
6430B18125O69r6625m8108j2278R336N4933J7506j45421J41322P6990o4657j00431
$$ 218125 218794 122169 74061 61783 71119 126052 143558 -1863 139459 216449 151792 51361
6418E1361p604j2193r102l3566l8363m3109O0158Q6958J31154j2669L6661L3242
$$ 51361 43757 31564 22462 -11104 -49467 -92576 -32418 54540 185694 173025 209686 242928
6406B42928l9848m9000j1548J8040o8190l2001J51608l3895j06727m1912k761
$$ 242928 203080 154080 142532 160572 92382 60381 211989 178094 71367 29455 26694
6395B6694J25745m2430j74126J7562O4857o2789K14894M4359j06921l7162J61681
$$ 26694 152439 110009 -64117 -46555 18302 -44487 170407 214766 107845 70683 232364
6384B32364K6253j21086m9859j05770N9040J12450r1420j56642J1470J8713O6735
$$ 232364 258617 137531 87672 -18098 40942 153392 61972 -94670 -83200 -64487 2248
6373B248K7320P3518l1326o2317j31975o9684J31388P6440l7134J30390K0476
$$ 2248 29568 103086 71760 9443 -122532 -192216 -60828 15612 -21522 108868 129344
6362A29344j57016p1806J43856N8746j58976M5838O6647j1741J4881O7775m3554
$$ 129344 -27672 -99478 44378 103124 -55852 -10014 56633 44892 59773 127548 83994
6351H3994R805M3368m3565O5118n1041m9714j0832k0625M6553O9964r0735l8845
$$ 83994 93799 137167 93602 158720 107679 57965 47133 26508 73061 143025 52290 13445
6339A3445J66531M6179o5996k5427j4780k6147J01535J18821n9797m9801n1085
$$ 13445 179976 226155 160159 134732 119952 93805 195340 314161 254364 204563 153478
6328A53478M1162k9330q5904k50313q5758K27171J27994r76J4656K8154o7581
$$ 153478 194640 165310 79406 -170907 -256665 -29494 98500 97524 112180 140334 72753
6317G2753l4812J39096n5798J29226j01457P021r3344m5043r9620m7267m1780
$$ 72753 37941 177037 121239 250465 149008 156029 62685 17642 -81978 -129245 -171025
6306a71025k363k3301m7617M4125k0206N2024R1437M5030J38409L1401j69107
$$ -171025 -173388 -196689 -244306 -200181 -220387 -168363 -76926 -31896 106513 137914 -31193
6295c1193n6887P1060O6747m6997q8239q6168q5638Q17J10404R2117P795j4206
$$ -31193 -88080 -17020 49727 2730 -85509 -171677 -257315 -256498 -146094 -53977 -46182 -60388
6283f0388p456P2176N6087j06656k7618P7552J31094k2812J10361k6356j08537
$$ -60388 -67844 4332 60419 -46237 -73855 3697 134791 111979 222340 195984 87447
6272H7447j20766M4852m8432r8468p6750N4912J9991J2492m3893Q5868J22505
$$ 87447 -33319 11533 -36899 -135367 -212117 -157205 -137214 -124722 -168615 -82747 39758
6261C9758r31l6405L6077k9084n5021l5535l6352L1259l5863L0016J96471Q5971
$$ 39758 38827 2422 38499 9415 -45606 -81141 -117493 -86234 -122097 -92081 104390 190361
6249A90361O28n8714l9981L4141J55578K3308L00636L04207J61362J9910j70137
$$ 190361 190989 132275 92294 126435 282013 305321 605957 910164 1071526 1091436 921299
6238I21299k32136k94204k19057j66510p6705p8593l528J04841J50809j3481P346
$$ 921299 689163 394959 175902 9392 -67313 -145906 -149434 -44593 106216 92735 100081
6227A00081k17711J4842l722j2867j2086l8806k4230N4238J08000P2571q9475
$$ 100081 -117630 -102788 -106510 -119377 -131463 -170269 -194499 -140261 -32261 40310 -49165
6216d9165O1057J52137J45513j3400k712n8836k9332j59867j98521j10524M1872
$$ -49165 11892 164029 309542 296142 293430 234594 205262 45395 -153126 -263650 -221778
6205b21778K8730K6104R0684R9283J45738N7264j8880j01509j48495l2741k7721
$$ -221778 -193048 -166944 -76260 23023 168761 226025 207145 105636 -42859 -75600 -103321
6194a03321M9055M4766j4572n0205N2776L6538r5456n5760l7955J16553O4775
$$ -103321 -54266 -9500 -24072 -74277 -21501 15037 -80419 -136179 -174134 -57581 7194
6183G194K2021j3156M6377l1949J8363l2436q0730j7000L4134j5335j5986o0773
$$ 7194 29215 16059 62436 30487 48850 16414 -64316 -81316 -47182 -62517 -78503 -139276
6171a39276R8256J40831o5161n1736J05903j16733m0594p8894q0919J18972K5510
$$ -139276 -41020 99811 34650 -17086 88817 -27916 -68510 -147404 -228323 -109351 -83841
6160h3841O1042J37023R068j9281M396m7883Q4732K8481n3343n2734M94R2947
$$ -83841 -22799 114224 123292 104011 108407 60524 145256 173737 120394 67660 68154 161101
6148A61101j43711l1491J25962P963r1452o7000j3577m2257N2762J10885j11792
$$ 161101 17390 -14101 111861 119824 28372 -38628 -52205 -94462 -41700 69185 -42607
6137d2607j12319j7935O0229o6442N966J63121J04123M2437r5705j24117P467
$$ -42607 -154926 -172861 -112632 -179074 -173108 -9987 94136 136573 40868 -83249 -75782
6126g5782q9428J03954J83032k6727j1583l6246r3150K2931M3678l758J2643r3875
$$ -75782 -165210 -61256 121776 95049 83466 47220 -45930 -22999 20679 16921 29564 -64311
6114f4311k6222n6721K9728R9423K2724M5537R3261k6991n2623k5376N363J7037
$$ -64311 -90533 -147254 -117526 -18103 4621 50158 143419 116428 63805 38429 43792 60829
6102F0829j1893j46138m9826J6541o0447K13455J48981Q3808m832L6536j90123
$$ 60829 48936 -97202 -147028 -130487 -190934 22521 171502 255310 250478 287014 96891
6091I6891k45599M3599L3080P0176q3049N1545N4218j35799j29352J46172J54899
$$ 96891 -148708 -105109 -72029 -1853 -84902 -33357 20861 -114938 -244290 -98118 56781
6080E6781P609k747o9568J1942N8563p679l4925J466Q5377l3078j09524p3588
$$ 56781 64390 61643 -7925 4017 62580 54901 19976 21442 106819 73741 -35783 -109371
6068a09371m7844N3209r7433n2981l5981L2393K15139L4019J2191j20730r7558
$$ -109371 -157215 -104006 -201439 -254420 -290401 -258008 -42869 -8850 3341 -117389 -214947
6057b14947J23958O9643r7420q3871K6465k6933N9168J19816N0616J8266j5207
$$ -214947 -90989 -21346 -118766 -202637 -176172 -203105 -143937 -24121 26495 44761 29554
6046B9554j30979N9256J21844k6923M010M8173j09226l6207m6797q722m357J20805
$$ 29554 -101425 -42169 79675 52752 56762 104935 -4291 -40498 -87295 -96017 -100374 20431
6034B0431Q8470k06560j18818l317Q9894N1314k2298L4408m666K1863N1212L2724
$$ 20431 108901 -97659 -216477 -219794 -129900 -78586 -100884 -66476 -71142 -49279 1933 34657
6022C4657L7282P8381P1070K154j52940j9580J0805o5230k1574k5147L1321J12837
$$ 34657 71939 150320 221390 223544 70604 51024 61829 -3401 -24975 -50122 -18801 94036
6010I4036K1239j03908O419Q1720k290k1488Q9221q9624j92045M9666N2803j3959
$$ 94036 115275 11367 17786 99506 97216 75728 164949 75325 -116720 -67054 -14251 -28210
5998b8210P9816O6119L3128o4268q6868K339k1380l5929j5152R635O4732l6615
$$ -28210 51606 117725 150853 86585 -283 2056 -19324 -55253 -70405 -60770 3962 -32653
5986c2653k1463N9189K09627O1249j21944j58744j36777k3054Q7571n9510L3156
$$ -32653 -54116 5073 214700 275949 154005 -4739 -141516 -164570 -76999 -136509 -103353
5975a03353K2156K5809O858P8739j273L8251r1863m7204j6966L3247o5198M9404
$$ -103353 -81197 -55388 -48530 30209 28936 67187 -24676 -71880 -88846 -55599 -120797 -71393
5963g1393O9340L8887q3824j18242l0598N0144O0941j1058R494p3180p4410J5128
$$ -71393 -2053 36834 -46990 -165232 -195830 -145686 -84745 -95803 -86309 -159489 -233899 -218771
5951b18771j771P0417N7619M7828k681J7567Q221k6569M4000p943R8471l5865
$$ -218771 -220542 -150125 -92506 -44678 -47359 -29792 -21571 -48140 -4140 -12083 86388 50523
5939E0523r3675o1097P1728j03120K9522N3802J20941j9820P1473m4103o9257
$$ 50523 -43152 -104249 -32521 -135641 -106119 -52317 68624 48804 120277 76174 6917
5928F917J167J48816P2522p2374N3755P9318o0287j2873o3424j11650k0471O6256
$$ 6917 8084 156900 229422 157048 210803 290121 229834 216961 153537 41887 21416 87672
5916H7672n4977N0489M4706m464R6292l974p4880q2916Q5523P7864j06453m7058
$$ 87672 32695 83184 127890 123426 219718 215744 140864 57948 143471 221335 114882 67824
5904F7824j10079Q955J47516J4356r123k8153j5011j36502o8081l500K6106j0158
$$ 67824 -42255 -33300 114216 128572 119449 91296 76285 -60217 -128298 -131798 -105692 -115850
5892a15850N6293O4525j50973M9528J18448N2945l8068j11742K3403J15503j6330
$$ -115850 -59557 4968 -146005 -96477 21971 74916 36848 -74894 -51491 64012 47682
5881D7682M1847J25575l419o1886j55740j44849J17997k5601m1643k5733J713
$$ 47682 89529 215104 211685 149799 -5941 -150790 -32793 -58394 -100037 -125770 -124057
5870a24057Q2092j36579m9479L2909J77989J99720P8693k10519p6743l9945o1579
$$ -124057 -41965 -178544 -228023 -195114 -17125 182595 261288 50769 -25974 -65919 -127498
5859a27498R6293M7785j8665j07102j0465N3239M1606K7725j64688l8565M5222
$$ -127498 -31205 16580 -2085 -109187 -119652 -66413 -24807 2918 -161770 -200335 -155113
5848a55113J08340P6232O3477n0126j50845r9194O8309J28015R8964J7306P4321
$$ -155113 -46773 29459 92936 42810 -108035 -207229 -138920 -10905 88059 105365 179686
5837A79686o6435L0737P6162Q282r6695J02715j2345m0446j37543q8326r7016
$$ 179686 113251 143988 220150 228432 131737 234452 222107 181661 44118 -44208 -141224
5826a41224k0283J76327M7785O1568K6034j63500O5966l9k2574j3653j35018j8782
$$ -141224 -161507 14820 62605 124173 150207 -13293 52673 52634 30060 16407 -118611 -137393
5814a37393N2548k405r574J11610J97461J6305k06542q3703j6514N1003O6815
$$ -137393 -84845 -87250 -96824 14786 212247 228552 22010 -61693 -78207 -27204 39611
5803C9611j13066j4403J05103o8945L9753O5555k1776l4610p0967n28q428R1769
$$ 39611 -73455 -87858 17245 -51700 -11947 53608 31832 -2778 -73745 -74273 -82701 9068
5791I068N8814n1109j25070o3808Q9571m6314K6562p9204q2422l3407O3080J98580
$$ 9068 67882 16773 -108297 -172105 -82534 -128848 -102286 -181490 -263912 -297319 -234239 -35659
5779c5659O2598N0785R4630n6824p9790l8720q5531m7124q9822m0763n0481J210
$$ -35659 26939 77724 172354 115530 35740 -2980 -88511 -135635 -225457 -266220 -316701 -315491
5767c15491L6833P8417M4143j7068J23362K51738k6126j99431K1193k9345M3438
$$ -315491 -278658 -200241 -156098 -173166 -49804 201934 175808 -23623 -2430 -31775 11663
5756A1663Q240o4152P9537q758j12896N8757M4484k6684r099j7141l1068Q6860
$$ 11663 19903 -44249 35288 26530 -86366 -27609 16875 -9809 -18908 -36049 -67117 19743
5744A9743P072K7582N0433j12957k1221J03627p4683j21709n3990K3091k9080
$$ 19743 26815 54397 104830 -8127 -29348 74279 -404 -122113 -176103 -153012 -182092
5733a82092j396J42950r2469r2548r029J06327M0412o008Q2615K8346j29922q2135
$$ -182092 -183488 -40538 -133007 -225555 -234584 -128257 -87845 -93853 -11238 17108 -112814 -194949
5721a94949M1129O5603k2241P1468O0464R0171Q197R6931K1080q0775r910r7397
$$ -194949 -153820 -88217 -110458 -38990 21474 111645 119842 216773 237853 157078 147168 49771
5709D9771o255j7618q9838j029j51155M4604J14590q129o5193R5072L5363l6098
$$ 49771 43516 25898 -63940 -64969 -216124 -171520 -56930 -65059 -130252 -35180 183 -35915
5697c5915n760r0542N930k8162l287J64599K3298o5964q3142o3046K9007K1236
$$ -35915 -41675 -132217 -126287 -154449 -157736 6863 30161 -35803 -118945 -181991 -152984 -131748
5685a31748M4415P9811M5091j14589N2095O5128J46404j27095r7321j37j41763
$$ -131748 -87333 -7522 37569 -77020 -24925 40203 186607 59512 -37809 -37946 -179709
5674a79709j4561M5810J06243o1085k458m1875K7745M2868o6333M6234L3292J62604
$$ -179709 -194270 -148460 -42217 -103302 -105760 -147635 -119890 -77022 -143355 -97121 -63829 98775
5662I8775P9992r0608M1597Q1204N6017J6278n0147r9422q948J641n6551l3641
$$ 98775 178767 88159 129756 210960 266977 283255 233108 133686 124738 126379 69828 36187
5650C6187P3953j25432r4983J89406J04473J1320N656q7928j45200J5276Q0733
$$ 36187 110140 -15292 -110275 79131 183604 194924 200580 112652 -32548 -17272 63461
5639F3461l7975n9278L9613L2038K0000j33446q5233L8516N2125j8174P5038Q6731
$$ 63461 25486 -33792 5821 37859 57859 -75587 -160820 -122304 -70179 -88353 -13315 73416
5627G3416m9371N3823Q7651j35320k20037m3214M6206r057J31046l2868J4780
$$ 73416 24045 77868 165519 30199 -189838 -233052 -186846 -195903 -64857 -97725 -82945
5616h2945l7283n7036J53932Q6121K4243j5274o8371o8086l4950J7592N9171K5552
$$ -82945 -120228 -177264 -23332 62789 87032 71758 3387 -64699 -99649 -82057 -22886 2666
5604B666q6439k7410p6612J385m0981L9250K8202O8938k68m5566O8810O7442r2619
$$ 2666 -83773 -111183 -187795 -186410 -227391 -188141 -159939 -91001 -91269 -136835 -68025 -583 -93202
5591i3202j0030Q7194J52816l6567n5599j14030p3704J45190Q9868o0798j35895
$$ -93202 -103232 -16038 136778 100211 44612 -69418 -143122 2068 91936 31138 -104757
5580a04757L3859K5571j56819p6501J81211J12949l1519M0982M7600J0065j22343
$$ -104757 -70898 -45327 -202146 -278647 -97436 15513 -16006 24976 72576 82641 -39702
5569c9702J374j8554J5411J45074R9749j03583j21571j04516l2197R0010J5845
$$ -39702 -38328 -56882 -41471 103603 203352 99769 -21802 -126318 -158515 -68505 -52660
5558e2660p0642J38185J13834m5780m3877j8950J17679J00401j51589j27676O3274
$$ -52660 -123302 14883 128717 82937 39060 20110 137789 238190 86601 -41075 22199
5547B2199k1808N265r1618j0934M8940l4411q263k349M9181p9959l7843n2985
$$ 22199 391 5656 -85962 -96896 -47956 -82367 -90630 -92979 -43798 -123757 -161600 -214585
5535b14585q4997J43647J56606P5398j4633r5688R9115N0206j5309L5322l0747
$$ -214585 -299582 -155935 671 76069 61436 -34252 64863 115069 99760 135082 104335
5524A04335k3891L4822n3993J1907J18793q451j65656k3642J76143l3404q0630
$$ 104335 80444 115266 61273 73180 191973 183522 17866 -5776 170367 136963 56333
5513E6333P6238L0227r1152k0490N7109j4611q9535p7550M7702q1523j54433j7840
$$ 56333 132571 162798 71646 51156 108265 93654 4119 -73431 -25729 -107252 -261685 -279525
5501b79525J2883N2606J31183J46912O175j8069J21005m1868K9804M7829O71j9416
$$ -279525 -266642 -214036 -82853 64059 70234 52165 173170 131302 161106 208935 209606 190190
5489A90190j26027r8411R2269m8953j46884M6808J2079N8797O6965j15786K4911
$$ 190190 64163 -34248 58021 9068 -137816 -91008 -78929 -20132 46833 -68953 -44042
5478d4042k796k4943Q0249K701q6637O4419J60949q5817k2911J80875J394j69386
$$ -44042 -46838 -71781 8468 11169 -75468 -11049 149900 64083 41172 222047 223441 54055
5466E4055O9921L6903j14622p1113m7479n7060L3578J32614P5939m8478p259j85759
$$ 54055 123976 160879 46257 -24856 -72335 -129395 -95817 36797 112736 64258 56999 -128760
5454a28760j18478M2725Q2964j0044O7813Q7348L2426L4983o9119K5049j346l1504
$$ -128760 -247238 -204513 -121549 -131593 -63780 23568 55994 90977 21858 46907 45561 14057
5442A4057K5186N9755j2810o1275j32158j89980j964R4488K6286N1838J8625J11229
$$ 14057 39243 98998 86188 24913 -107245 -297225 -299189 -204701 -178415 -126577 -107952 3277
5430C277k9734J02278q1816n2272l5794Q953J0185k2088n0372r4537L6625J91770
$$ 3277 -26457 75821 -5995 -58267 -94061 -85108 -74923 -97011 -147383 -241920 -205295 -13525
5418a3525P0663l3909r7208J6770j1681J03031N6861P7614q1577r9485j44281
$$ -13525 57138 23229 -73979 -57209 -68890 34141 91002 168616 87039 -12446 -156727
5407a56727k416Q9523L2086Q926Q689o7268L9458J46528k5717r5689j32314L7549
$$ -156727 -159143 -69620 -37534 -28608 -19919 -87187 -47729 98799 73082 -22607 -154921 -117372
5395a17372l3498J29196J14638N0427k2473j02263l0796m8480L0916J42805k0213
$$ -117372 -150870 -21674 92964 143391 120918 18655 -12141 -60621 -29705 113100 92887
5384I2887j11633r653J581L4067J0540P2146L280j75927J442J4129L8770o87k2362
$$ 92887 -18746 -28399 -26818 7249 17789 89935 93215 -82712 -81270 -67141 -28371 -29058 -51420
5371e1420M9550o4262K4607K6032j06116P253K50608J06577j08585j45431N9984
$$ -51420 -1870 -66132 -41525 -15493 -121609 -114356 136252 242829 134244 -11187 48797
5360D8797J263n3427p1140L4776p2798n6435o4261J00267J05476k4584L9699n7931
$$ 48797 50060 -3367 -74507 -39731 -112529 -168964 -233225 -132958 -27482 -52066 -12367 -70298
5348g0298J01009P4316m5403n5169J9356k0698j63429m9086J03748J8476n459
$$ -70298 30711 105027 59624 4455 23811 3113 -160316 -209402 -105654 -87178 -92637
5337i2637j052N5225j15467j41418J8471J01868J46741l4502k1663J09809J7620
$$ -92637 -93689 -38464 -153931 -295349 -276878 -175010 -28269 -62771 -84434 25375 42995
5326D2995n6842N7456K3780j19522r723o5291J17064J47826k8739Q5234L3826
$$ 42995 -13847 43609 67389 -52133 -61856 -127147 -10083 137743 109004 194238 228064
5315B28064k2159p8433p0275M2988K8414j04527j8581O336j8602m2349N5179p4700
$$ 228064 205905 127472 57197 100185 128599 24072 5491 11827 -6775 -49124 6055 -68645
5303f8645k5761n0229L4458R2602J68330M2121q5273p8503q1329j1635o259K5393
$$ -68645 -94406 -144635 -110177 -17575 150755 192876 107603 29100 -52229 -63864 -70123 -44730
5291d4730L2779M2821k1630O3509j2500j8110J46935l738r5210N3911k1589j4107
$$ -44730 -11951 30870 9240 72749 60249 42139 189074 185336 90126 144037 122448 108341
5279A08341o8275k6551j08758O8562J99047P8102r4980J4928k3186n1757j54251
$$ 108341 40066 13515 -95243 -26681 172366 250468 155488 170416 147230 95473 -58778
5268e8778j01785K6429J18913J28275J74336Q122k93719j55426O963J66961N4137
$$ -58778 -160563 -134134 -15221 113054 287390 295512 1793 -153633 -146670 20291 74428
5257G4428p4511M345L128q7237n2528N9551O7761n7531k4574N7290n852r0265
$$ 74428 -83 4262 7390 -79847 -132375 -72824 -5063 -62594 -87168 -29878 -35730 -125995
5245a25995m0053o1901K6055K8421o5565J09150k217k297Q5582l8874L4125R5179
$$ -125995 -166048 -227949 -201894 -173473 -239038 -129888 -132105 -134402 -48820 -87694 -53569 41610
5233D1610M5502P8522N3212k2689l1400O1638q3391r2082j17652K9928m5805j0934
$$ 41610 87112 165634 218846 196157 164757 226395 143004 50922 -66730 -36802 -82607 -93541
5221i3541l7425p1948P8482P0694L0906O2161j09533M2187J226j00617m0795N0295
$$ -93541 -130966 -202914 -124432 -53738 -22832 39329 -70204 -28017 -26791 -127408 -168203 -117908
5209a17908J58551J37246j23881j68245j2120o9578Q0476J32100J371l6212p109
$$ -117908 40643 177889 54008 -114237 -126357 -195935 -115459 16641 18012 -18200 -25309
5198b5309K3584J03177k4529k5613j1642O2189J14112m0700k49309l0607K2288
$$ -25309 -1725 101452 76923 51310 39668 101857 215969 175269 -74040 -104647 -82359
5187h2359n022L4896O5448k4594R2970K0984N6993j6280K1115L606j27412k4613
$$ -82359 -87381 -52485 12963 -11631 81339 102323 159316 143036 164151 167757 40345 15732
5175A5732q1110P428R8130j5464j10340l0921m4353m812O0617K2125J2405K0341
$$ 15732 -65378 -57950 40180 24716 -85624 -116545 -160898 -165710 -105093 -82968 -70563 -50222
5163e0222p9953q8945N9325M3839l2316M901N4182K00337L4258j03998r0214o7969
$$ -50222 -130175 -219120 -159795 -115956 -148272 -143371 -89189 111148 145406 41408 -48806 -116775
$$ [...]
##END NTUPLES=NMR SPECTRUM
##END=
