##TITLE=Analysis number 328455
Compound Code cc 10201
Project Code adrs
Chemist Name fudan
##JCAMPDX= 6.0         $$ Bruker NMR JCAMP-DX V2.0
##DATA TYPE= NMR SPECTRUM
##DATA CLASS= NTUPLES
##ORIGIN= Bruker BioSpin GmbH
##OWNER= nmr
$$ XWIN-NMR		Version 3.5
$$ Wed Jun  6 14:12:01 2007 GMT Daylight Time (UT+1h)  MAYBRIDGE\nmr@NMR_250MHZ
##.OBSERVE FREQUENCY= 250.131544655141
##.OBSERVE NUCLEUS= ^1H
##.ACQUISITION MODE= SIMULTANEOUS (DQD)
##.ACQUISITION SCHEME= undefined
##.AVERAGES= 16
##.DIGITISER RES= 18
##SPECTROMETER/DATA SYSTEM= dpx250
##.PULSE SEQUENCE= zg30
##.SOLVENT NAME= DMSO
##.SHIFT REFERENCE= (INTERNAL, DMSO, 0, 16.522)
##AUDIT TRAIL= $$ (NUMBER, WHEN, WHO, WHERE, WHAT)
$$ ##TITLE= Audit trail, XWIN-NMR		Version 3.5
$$ ##JCAMPDX= 5.01
$$ ##ORIGIN= Bruker BioSpin GmbH
$$ ##OWNER= nmr
$$ C:\u/data/dgb/nmr/ADRS/390/pdata/1/auditp.txt
$$ ##AUDIT TRAIL=  $$ (NUMBER, WHEN, WHO, WHERE, WHAT)
(   1,<2007-06-06 14:11:38.55 +100>,<MAYBRIDGE\nmr>,<NMR_250MHZ>,
      <created by zg, POWCHK disabled, PULCHK disabled
       configuration hash MD5:
       76 6E 9A 78 1E 09 19 81 EC 84 63 8F B0 6A 59 2D
       data hash MD5: 64K
       41 23 EC 84 F1 9A AF 59 51 05 59 89 68 94 2C 1F>)
(   2,<2007-06-06 14:11:52.01 +100>,<MAYBRIDGE\nmr>,<NMR_250MHZ>,
      <Start of raw data processing
       ef LB = 0.3 FT_mod = 6 PKNL = 1 SI = 32K 
       data hash MD5: 32K
       74 4E A4 AF 2F FA A6 6F 93 41 90 26 11 19 04 97>)
(   3,<2007-06-06 14:11:53.67 +100>,<MAYBRIDGE\nmr>,<NMR_250MHZ>,
      <apk 
       data hash MD5: 32K
       80 F5 B3 BE 6A 57 A8 4F 25 8E 2A 15 F3 FD C5 FA>)
(   4,<2007-06-06 14:11:54.47 +100>,<MAYBRIDGE\nmr>,<NMR_250MHZ>,
      <abs ABSG = 5 
       data hash MD5: 32K
       BE A1 BA 05 AC 1E 8D 9E 17 B0 30 99 A0 CC 4D B0>)
$$ ##END=
$$ 
$$ hash MD5
$$ 0D B8 30 E7 19 72 29 2F FF 9B 0D 92 1C DE E8 18
##$RELAX= 
##$RELAX= 
##$RELAX= 
##$RELAX= 
##$RELAX= 
##$RELAX= 
##$RELAX= 
$$ Bruker specific parameters
$$ --------------------------
##$DU= <C:\u>
##$EXPNO= 390
##$NAME= <ADRS>
##$PROCNO= 1
##$TYPE= <nmr>
##$USER= <dgb>
##$AMP= (0..31)
100 100 100 100 100 100 100 100 100 100 100 100 100 100 100 100 100 100 
100 100 100 100 100 100 100 100 100 100 100 100 100 100 
##$AQSEQ= 0
##$AQ_mod= 3
##$AUNM= <au_zg>
##$AUTOPOS= <37 >
##$BF1= 250.13
##$BF2= 250.13
##$BF3= 250.13
##$BF4= 250.13
##$BF5= 500.13
##$BF6= 500.13
##$BF7= 500.13
##$BF8= 500.13
##$BYTORDA= 1
##$CFDGTYP= 0
##$CFRGTYP= 5
##$CHEMSTR= <none>
##$CNST= (0..31)
1 1 145 1 1 1 1 1 1 1 1 1 1 1 1 1 1 1 1 1 1 1 1 1 1 1 1 1 1 1 1 1 
##$CPDPRG= <>
##$CPDPRG1= <>
##$CPDPRG2= <>
##$CPDPRG3= <>
##$CPDPRG4= <mlev>
##$CPDPRG5= <mlev>
##$CPDPRG6= <mlev>
##$CPDPRG7= <mlev>
##$CPDPRG8= <mlev>
##$CPDPRGB= <>
##$CPDPRGT= <>
##$D= (0..31)
0 1 0 0 0 0 0 0 0 0.06 0 0 0 0 0 0 0.0002 0 0 0 0 0 0 0 0 0 0 0 0 0 0 
0 
##$DATE= 1181135497
##$DBL= (0..7)
120 120 120 120 120 120 120 120 
##$DBP= (0..7)
150 150 150 150 150 150 150 150 
##$DBP07= 0
##$DBPNAM0= <>
##$DBPNAM1= <>
##$DBPNAM2= <>
##$DBPNAM3= <>
$$ [...]
##$SUBNAM7= <"">
##$SUBNAM8= <"">
##$SUBNAM9= <"">
##$SW= 20.6930455092707
##$SWIBOX= (0..15)
0 0 3 0 0 0 0 0 0 0 0 0 0 0 0 0 
##$SW_h= 5175.983436853
##$TD= 65536
##$TD0= 1
##$TE= 296.16
##$TE2= 300
##$TE3= 300
##$TEG= 300
##$TL= (0..7)
0 120 120 120 120 120 120 120 
##$TP= (0..7)
150 150 150 150 150 150 150 150 
##$TP07= 0
##$TPNAME0= <>
##$TPNAME1= <>
##$TPNAME2= <>
##$TPNAME3= <>
##$TPNAME4= <>
##$TPNAME5= <>
##$TPNAME6= <>
##$TPNAME7= <>
##$TPOAL= (0..7)
0.5 0.5 0.5 0.5 0.5 0.5 0.5 0.5 
##$TPOFFS= (0..7)
0 0 0 0 0 0 0 0 
##$TUNHIN= 0
##$TUNHOUT= 0
##$TUNXOUT= 0
##$USERA1= <user>
##$USERA2= <user>
##$USERA3= <user>
##$USERA4= <user>
##$USERA5= <user>
##$V9= 5
##$VALIST= <valist>
##$VCLIST= <CCCCCCCCCCCCCCC>
##$VD= 0
##$VDLIST= <DDDDDDDDDDDDDDD>
##$VPLIST= <PPPPPPPPPPPPPPP>
##$VTLIST= <TTTTTTTTTTTTTTT>
##$WBST= 1024
##$WBSW= 4
##$XGAIN= (0..3)
0 0 0 0 
##$XL= 0
##$YL= 0
##$YMAX_a= 294097
##$YMIN_a= -193368
##$ZGOPTNS= <>
##$ZL1= 120
##$ZL2= 120
##$ZL3= 120
##$ZL4= 120
##$ABSF1= 16.522
##$ABSF2= -4.171173
##$ABSG= 5
##$ABSL= 3
##$ALPHA= 0
##$AQORDER= 0
##$ASSFAC= 0
##$ASSFACI= 0
##$ASSFACX= 0
##$ASSWID= 0
##$AUNMP= <proc_1d>
##$AZFE= 0.1
##$AZFW= 0.1
##$BCFW= 0
##$BC_mod= 0
##$BYTORDP= 0
##$COROFFS= 0
##$CY= 12.5
##$DATMOD= 1
##$DC= 0
##$DFILT= <>
##$DTYPP= 0
##$F1P= 14.0000005364418
##$F2P= -0.99999901652339
##$FCOR= 0.5
##$FTSIZE= 32768
##$FT_mod= 6
##$GAMMA= 0
##$GB= 0
##$INTBC= 1
##$INTSCL= 1
##$ISEN= 128
##$LB= 0.3
##$LEV0= 0
##$LPBIN= 0
##$MAXI= 10000
##$MC2= 0
##$MEAN= 0
##$ME_mod= 0
##$MI= 0
##$NCOEF= 0
##$NC_proc= -5
##$NLEV= 6
##$NOISF1= 0
##$NOISF2= 0
##$NSP= 0
##$NTH_PI= 0
##$NZP= 0
##$OFFSET= 16.522
##$PC= 1
##$PHC0= -62.97046
##$PHC1= 11.49552
##$PH_mod= 1
##$PKNL= yes
##$PPARMOD= 0
##$PSCAL= 4
##$PSIGN= 0
##$REVERSE= no
##$SF= 250.13
##$SI= 32768
##$SIGF1= 0
##$SIGF2= 0
##$SINO= 400
##$SIOLD= 32768
##$SREGLST= <1H.DMSO>
##$SSB= 0
##$STSI= 32768
##$STSR= 0
##$SW_p= 5175.98343685301
##$SYMM= 0
##$S_DEV= 0
##$TDeff= 65536
##$TDoff= 0
##$TI= <Analysis number 999999
Compound Code 99
Book Reference 9
Project Code 9>
##$TILT= no
##$TM1= 0
##$TM2= 0
##$TOPLEV= 0
##$USERP1= <user>
##$USERP2= <user>
##$USERP3= <user>
##$USERP4= <user>
##$USERP5= <user>
##$WDW= 1
##$XDIM= 32768
##$YMAX_p= 527552231
##$YMIN_p= -724817
$$ End of Bruker specific parameters
$$ ---------------------------------
##NTUPLES= NMR SPECTRUM
##VAR_NAME=  FREQUENCY,     SPECTRUM/REAL,   SPECTRUM/IMAG
##SYMBOL=    X,             R,               I
##VAR_TYPE=  INDEPENDENT,   DEPENDENT,       DEPENDENT
##VAR_FORM=  AFFN,          ASDF,            ASDF
##VAR_DIM=   32768,         32768,           32768
##UNITS=     HZ,            ARBITRARY UNITS, ARBITRARY UNITS
##FACTOR=    0.157963299565203, 1,           1
##FIRST=     4132.6476996994, 0,             0
##LAST=      -1043.33573715361, 0,           0
##MIN=       -1043.33573715361, -724817,     0
##MAX=       4132.6476996994, 527552231,     0
$$ Real data points
##PAGE= N=1
##DATA TABLE= (X++(R..R)), XYDATA
$$ [...]
25414c35191P7373p372o8723J20217K6905J07387R4730O4785r0625K0667q5812
25403g5659j73745m6860Q172J00882J26271j8182m0902Q0340M7993J10441R0953
25392B09704N271p1077k1796J323K2193q1607l4864j79442j07823K02558O0341
25381D781j53044r894P4549L6004K0748m5049q480j01422j22132m0630O1635j9449
25369c02383j2402k0534L9909K6386M9351J49430K12917q380r2713q8629J8511
25358b8537J42611J94821J72026J1379j43718k09246p0317j77785q4091m3777
25348b36634Q6383K23217j1652j990r2200k1271J80344j8809j63537j89238m9677
25337b95064J64447J59043M527M0744l9341K9292O9351j92386O8140J08981J75980
$$ y = [-335191, -257818, -265190, -333913, -213696, -186791, -79404, 15326, 80111, -10514, 10153, -75659, -249404, -296264, -288092, -187210, -60939, -79121, -120023, -39683, 8310, 118751, 209704, 214975, 143898, 122102, 123425, 145618, 64011, 29147, -150295, -258118, -55560, 4781, -148263, -158157, -83608, -47604, -26856, -71905, -80385, -181807, -303939, -344569, -282934, -302383, -314785, -335319, -295410, -269024, -219673, -70243, 142674, 134294, 41581, -47048, -28537, 114074, 308895, 480921, 492300, 348582, 139336, 69019, -108766, -192857, -236634, -150251, 72966, 61314, 59324, -32876, -54147, 126197, 107388, -56149, -245387, -295064, -130617, 28426, 32953, 73697, 34356, 63648, 132999, -59387, 8753, 117734, 293714]
25326B93714M2433j95445k25902o7036M9119k6839n166O4377k1690J58488n434
25315F0619k4952n2571K6704J4542M6159o0185Q1j21587P5160j62565k42353J49939
25303b91009K37694K8448k24211N7140J4870l5974r4780N7534J51871M1680j51347
25292b08084q1055K3877j1975J27729N7970K10901J21889j12455j37602p7631
25282h6436P8941M4810P231J55576L7496k16350n9173l9053l5244o1432J13316
25271f0318m4406J475K0782J0714j6588m0374P9499J62724o7635k24669r4839
25260b73635O3866J97093K6091m5705p2938n0396J18897J65882J36049L6321j42896
25249A58629j76037j64513j5969N3690o3629J30265K49031K09012r0937k52670
$$ y = [293714, 336147, 140702, -85200, -152236, -103117, -129956, -135122, -70745, -92435, 66053, 60619, 35667, -16904, 9800, 24342, 70501, 10316, 10397, -111190, -36030, -198595, -440948, -291009, -53315, -24867, -249078, -191938, -177068, -213042, -307822, -250288, -98417, -56737, -208084, -289139, -265262, -277237, -149508, -91538, 119363, 241252, 128797, -8805, -86436, -7495, 37315, 44546, 200122, 237618, 21268, -37905, -76958, -112202, -173634, -60318, -104724, -103249, -82467, -71753, -88341, -128715, -49216, 113508, 45873, -178796, -273635, -209769, -12676, 13415, -32290, -105228, -155624, -36727, 129155, 265204, 301525, 158629, -17408, -181921, -197890, -144200, -207829, -77564, 171467, 380479, 289542, 36872]
25239C6872k19457k6280J25256P559n4485p1849J73320Q7446M8757J07267k1961
25228A92445m8318K4194n7820k3344K6279M5727j4541M6989M1023p8502j23798
25217C0334k24829Q1148K28717J16001k4451j69017k17559Q6348R8394J71566
25207A76652P2239j29579j75849Q3348J34709m0373J11222j26338j19834M6724
25197C2921n3035Q946J559j6628j4114L999L7145j52355L5981J70927m7654k2470
25185a4778l4660Q6904p2368q3279o3623q5114M5078m6867J31072j8424K9798
25174a26261J49992N7950k2220j04725L4087n412J70087j03298j09462M0152j35545
25163a54655O4461J49122j19097j29385R2653J08597K0337Q9684N569J3881j42377
$$ y = [36872, -182585, -208865, -83609, -76050, -130535, -202384, -29064, 58382, 107139, 214406, 192445, 144127, 168321, 110501, 87157, 113436, 159163, 144622, 191611, 232634, 154132, 30334, -194495, -113347, 115370, 231371, 206920, 37903, -179656, -93308, 5086, 176652, 248891, 119312, -56537, 26811, 161520, 121147, 232369, 106031, -13803, 32921, -20114, -11168, -9609, -26237, -40351, -36352, 793, -151562, -115581, 55346, 7692, -14778, -49438, 37466, -34902, -118181, -181804, -266918, -221840, -268707, -137635, -156059, -126261, 23731, 81681, 59461, -45264, -11177, -16589, 153498, 50200, -59262, -19110, -154655, -90194, 58928, -60169, -189554, -96901, 11696, 32033, 121717, 127286, 141167, -1210]
25152a210m969J98361q4323j74077P825O4271J13889r7933j10866M5161N4011
25141A0140q935J28780N0895j3663j12170m6451j53708j14282j775k9652M8539
25130b42282J34546m829j43582J11777K48207l7416N739j12877p499j8369r5411
25119a61996J8986Q1073J49219Q7499r9n8542n4775l6050k1712J1320K6059j59042
25107a18060j3093J40291n06o5189L3013r7662K7851J22045Q5359o480j2482j51998
25095e6911r8081O4416N8647l5690J8877O5085N0373j8720q3284N4407K5144K6919
25083G1182J14822p7139k1600q8314k5125J41045k5334j54767L4232J12519l3218
25072D8303L0837L1022J69932n9402k70907r3773l3164J28468l3396R0735R446
$$ y = [-1210, -6179, 192182, 107859, -66218, -58393, 5878, 119767, 21834, -89032, -43871, 10140, 1205, 129985, 180880, 167217, 55047, 8596, -145112, -259394, -261169, -290821, -242282, -107736, -112565, -256147, -144370, 103837, 66421, 72160, -40717, -48216, -66585, -161996, -143010, -61937, 87282, 174781, 174682, 116140, 61365, 25315, 3603, 14923, 40982, -118060, -131153, 9138, 8632, -56557, -23544, -121206, -93355, 28690, 114049, 107569, 95087, -56911, -154992, -90576, -31929, -67619, -48742, 16343, 66716, 47996, -35288, 19119, 44263, 71182, 186004, 108865, 87265, -1049, -26174, 114871, 89537, -65230, -30998, 81521, 48303, 79140, 110162, 280094, 220692, -50215, -143988, -177152, -48684, -82080, 8655, 18101]
25061A8101n379J9090J03323r192k2783j64341l9262j7989L5956r3173j0228L3743
25049a52134J67006k6697k38576j41302r099J05163J37044l9365K3965o0570k1586
25038b56151J24221J92621j4425j54988n1008P543J25516J15088j4171k08189
25028a33943j18339p710K9892N2172L226r4558k3422J2946k5663J62407Q9975
25017e3017L0622k4628J11075L4425j24040q3828r616O7531J23833n6108j05879
25006h9630j37284q2607R836Q6839K03139L3975j5017Q0417K56204n6145k7601
24995B62126r6977k05964m1838Q8661P4272J36604j85722j80215J01894J62378
24985A15219N3801J14695o7024o4619j30808j8281J3583j66696m722J18374L3122
$$ y = [18101, 12722, 31812, 135135, 125943, 103160, -61181, -100443, -118432, -82476, -175649, -185877, -152134, 14872, -11825, -250401, -391703, -400802, -295639, -158595, -197960, -173995, -234565, -256151, -131930, 60691, 46266, -108722, -159730, -152187, -26671, 88417, 74246, -133943, -252282, -259992, -230100, -177928, -174702, -269260, -292682, -279736, -305399, -142992, -53017, -22395, -47023, 64052, 98477, -25563, -109391, -119007, -51476, 72357, 16249, -89630, -226914, -309521, -299685, -212846, -9707, 24268, 9251, 89668, 345872, 289727, 262126, 165149, -40815, -82653, 6008, 80280, 216884, 31162, -149053, -47159, 115219, 169020, 283715, 216691, 152072, 21264, 2983, 16566, -150130, -154852, -36478, -3356]
24974c356m857K1440l2258j45604Q280Q1615R1116M0874R9817K03581K7084j28732
24962B59000r7212K6452j44552n3442Q2467l1843r5406M1935O6948j05718j25785
24951a77156r3211J71031K4310J2919J74025N4224o5029j65931j6934l0066L4956
24940g6862J76170J68918p2777j91061j03588k2036N3958l55J26206J19157j04913
24929G2817p2430P0323J42605O2964l17506j54818M4437J77078Q7064j07993j41130
24918a36589l3229J8977K9820N7064R0980N9684j44711o2872L6505n8075K25261
24907H2815J26467L0641j31982j99787l2875K9018m0824k8941R2536J53873m3028
24896C7913l7699J79844m9209q7272k4162K3904p7946J10622q5311r0390R893
$$ y = [-3356, -8213, 13227, -19031, -164635, -156355, -74740, 16376, 57250, 157067, 360648, 387732, 259000, 161788, 188240, 43688, -9754, 72713, 40870, -54536, -12601, 54347, -51371, -177156, -270367, -99336, -75026, -62107, 111918, 166142, 101113, -64818, -81752, -111818, -76862, 99308, 268226, 195449, 4388, -99200, -121236, -67278, -67633, 58573, 177730, 72817, 387, 70710, 213315, 276279, -41227, -196045, -151608, 25470, 112534, 4541, -136589, -169818, -150841, -121021, -63957, 27023, 86707, -58004, -120876, -84371, -142446, 82815, 209282, 239923, 107941, -91846, -124721, -95703, -136527, -165468, -72932, 80941, 37913, 214, 180058, 130849, 43577, 19415, 43319, -34627, 75995, -9316, -99706, -89813]
24885h9813N7842L2622l3737L7586J00832Q6885r1874r4872j6292k0040J3867
24874a6994q1608m2687n311q3889J83487J32552j64292o618K34729M4736j4234
24863A79871j32624j02717k8780j16475J00114J43208l9583J6456N4098J0398
24853H3966J6543L0067m2245o4872J18321R5935j99695o282J48621j76172j9618
24842a5431j25126j9572J87760J02051j1720j16434k2N8916J825P4417j18031
24831A8633q4541J14032J64284j57038k4415L7409m4074r0726R0486J57244P4863
24820B56157m5459k09891j14093J63314m8289o0074M6855q0049p4055K47449j2548
24809F9317R7821M5757j52384q1327J91395j03895k05442P239l3670M2071l0694
$$ y = [-89813, -31971, 651, -33086, 4500, 105332, 192217, 100343, 5471, -10821, -30861, -16994, -98602, -141289, -146600, -230489, -47002, 85550, -78742, -85360, 149369, 194105, 179871, 47247, -55470, -84250, -200725, -100611, 42597, 3014, 19470, 73568, 83966, 100509, 130576, 88331, 23459, 141780, 237715, 38020, 31738, 180359, 4187, -15431, -140557, -160129, 27631, 129682, 117962, 1528, 1506, 60422, 62247, 136664, 18633, -65908, 48124, 212408, 55370, 30955, 68364, 24290, -66436, 24050, 181294, 256157, 210698, 807, -113286, 50028, 1739, -58335, -11480, -91529, -165584, 81865, 69317, 167138, 212895, 60511, -20816, 170579, 66684, -138758, -131519, -165189, -123118, -153812]
24798a53812j03438J39147J63654J34354j62064q0596K9832L5754J29795p4132
24788E8494j44034j02489k5055O2387J49827j9319L5617K8436N1621j448R1865
24777A85902J6668r5578j58432q7993K573Q8714K1944k7054r489o2588p2137J51153
24765d6317l4270j12222P3764J34674J8618k03346K9605J17134K4972p6447J08087
24754C4252J57074N8654k05992m4537p4999p2688o2064O3554m9657K6997Q0218
24743h9188Q2181J77518J20843j99736j05435J52513Q4187l67r3701q7117p4617
24732c2919K824L1837p796J47332q8185L8981o7042n1698j21691J68278N4810
24721G4731R562o6726Q5027J44995k16041r1034m8503j61459P9003P2219K5913
$$ y = [-153812, -257250, -118103, 45551, 179905, 17841, -62755, -32923, 2831, 132626, 58494, -85540, -188029, -213084, -150697, -870, -20189, 15428, 43864, 95485, 94037, 185902, 202570, 106992, -51440, -139433, -136860, -48146, -26202, -53256, -62745, -125333, -197470, -46317, -80587, -192809, -119045, 15629, 34247, -169099, -139494, -22360, 2612, -73835, 34252, 191326, 249980, 43988, -549, -75548, -148236, -210300, -146746, -196403, -169406, -89188, -7007, 170511, 291354, 91618, -13817, 138696, 222883, 222516, 128815, 41698, -32919, -30095, 1742, -6054, 141278, 53093, 92074, 25032, -26666, -148357, 19921, 74731, 84293, 17567, 102594, 247589, 31548, -59486, -107989, -269448, -190445, -118226, -92313]
24710i2313n3403N1001P0832M0525r1640j0759N1456p1560n0683q1820j0641J34873
24698a14132j560j04969N7675J46428M113p9497q264L1967J58680j1184j49753
24687g0496R4803j97470r6952N9222K5419p4276j32989P5973J16919J4238R6749
24676h8860r1019p2125p378p5172J42297R2771P6869R7793j8891r1094m6706j9214
24664a00729k4762p7044J36755n5701K9862J46217Q9900m0268j64708J08992O7865
24653A16379j92748k0622M1136J53550J06174Q1916j79234K1721Q0545j65396
24643D3421l15786J33073K1797Q6814P7914p7851k243r7012k0325L3008J46839
24632B9649j8841j44375m8918M8471J10270k0672j833N9054J36105J4072j10072
$$ y = [-92313, -145716, -94715, -23883, 16642, -74998, -85757, -34301, -105861, -156544, -238364, -249005, -114132, -115692, -220661, -162986, -16558, -12445, -91942, -100206, -68239, 90441, 79257, -70496, 24307, -173163, -270115, -210893, -185474, -259750, -392739, -316766, -199847, -185609, -88860, -179879, -252004, -259382, -334554, -192257, -99486, -22617, 75176, 56285, -34809, -81515, -100729, -125491, -202535, -65780, -121481, -91619, 54598, 144498, 104230, -60478, 48514, 116379, -76369, -96991, -55855, 97695, 203869, 285785, 106551, 128272, 208817, 43421, -272365, -139292, -117495, -30681, 47233, -30618, -32861, -129873, -150198, -117190, 29649, 10808, -133567, -182485, -134014, -23744, -44416, -46249, 12805, 148910, 162982, 52910]
24621E2910r6105N7686L0127N3610K9174j40697j14784Q8433O2406j26929O2697
24610d1472J50475q2587j1868o8063k43562J33489R8947J26256J02886m4044J3900
24599A34357m5398o8276k9068q9140m6300p9665K1019l601R0566J12478n2005
24588e5033j59416m6960J28964J2360O6791r1996p9937J16206m8567q5645l4397
24577b77630L0838l9005J02289N1954J42698K15161R7919j55606J3684N4041j65458
24566G0885k11453k8915N2585K5891o4219k9531j2330M7145J63978J51712L0216
24555A95964k7687q9508K8337O1475J5588J6086M7734o8989j77674k33961j13447
24544c46082J84598j2128p5240P1026N340O4610j36742N9941l8079m704N7546
$$ y = [52910, -43195, 14491, 44618, 98228, 127402, -13295, -128079, -39646, 22760, -104169, -41472, 109003, 26416, 14548, -53515, -297077, -163588, -64641, 61615, 164501, 120457, 134357, 88959, 20683, -8385, -97525, -143825, -223490, -202471, -206072, -115506, -3028, -55033, -214449, -261409, -132445, -120085, -53294, -145290, -225227, -109021, -157588, -243233, -277630, -246792, -285797, -183508, -131554, 11144, 226305, 324224, 168618, 182302, 236343, 70885, -140568, -169483, -116898, -91007, -155226, -184757, -197087, -149942, 14036, 165748, 195964, 168277, 78769, 107106, 168581, 184169, 200255, 247989, 179000, 1326, -232635, -346082, -161484, -173612, -248852, -177826, -172486, -107876, -244618, -184677, -222756, -227460, -169914]
24533a69914j09392K0095Q2565R2518m7015J8108O4945j00770M2304L7267p4401
24522a43690o899J21450K6498j05725N2280Q2401j14664j60596n3291O558O3178
24511b32500K14924O7244m4763J9031p2643j30740n0376j32746J38393K76021
24501E1845J24371o9481p0549n5504j0826J54460n0725j34805L0860n9513m8500
24490a38367P2054r8674J11153J53733M5985M3131q7702j97138k1978N6876N4161
24479f766k276j58490k3650p004M0292M5929P0055J40763p8525n6005j69454j3909
24467b19040J13214J8546M8320J49264N7055n3163P3950j90608j14441j48677
24457b65580J04703J83891K077J44575j80P3800k2367K2281o5913q6996j96923
$$ y = [-169914, -279306, -259211, -176646, -84128, -131143, -113035, -48090, -148860, -106556, -69289, -143690, -150589, -29139, -2641, -108366, -56086, 26315, -88349, -248945, -302236, -295678, -232500, -17576, 49668, 4905, 23936, -48707, -179447, -229823, -362569, -224176, 51845, 176216, 106735, 36186, -19318, -30144, 124316, 73591, -61214, -30354, -89867, -138367, -66313, -164987, -53834, 99899, 145884, 189015, 101313, -95825, -117803, -60927, -6766, -9042, -167532, -191182, -198186, -157894, -111965, -41910, 98853, 20328, -35677, -205131, -219040, -105826, -87280, -38960, 110304, 167359, 114196, 188146, -2462, -116903, -265580, -160877, 23014, 25091, 169666, 169486, 243286, 220919, 243200, 177287, 90291, -106632]
24446a06632n6876J44927P7288P3534o7250J16135m1220j53087m2514j24054Q7
24435a79662k2529o402k7147M3773R9765l5048J23272l5757K6512m491l3376M7280
24423c810j16839m8784N5056K922m2441j29741N7428J68562K3998J37093K4715
24412A28159j343Q1698Q8999n7160j01380j63803l3758l8416J32774N8951j1580
24401H3141q2680r1597m4460J21146J90157m4328j61503P361k1210j07612j6213
24390a67798J17056O6686O9660K4980j35642m2468J12490M1262k7664l2799m7394
24379b1631J21936R2410o4066j42226k08792R6381Q6032j29056K1701Q4786J16305
24368E3780M0110J06104M914j15047q4348P229J0413k0243j09157j48899Q7711
$$ y = [-106632, -163508, -18581, 58707, 132241, 64991, 181126, 139906, -13181, -55695, -179749, -179662, -202191, -208593, -235740, -191967, -92202, -127250, -3978, -39735, -13223, -17714, -51090, -3810, -120649, -169433, -114377, -111455, -153896, -283637, -226209, -57647, -33649, 103444, 128159, 126816, 208514, 297513, 240353, 138973, -24830, -58588, -97004, 35770, 94721, 83141, 461, -91136, -135596, -14450, 175707, 131379, -30124, -22763, -43973, -151585, -167798, -50742, 15944, 85604, 110584, -25058, -67526, 44964, 86226, 58562, 25763, -21631, 100305, 192715, 128649, -13577, -222369, -125988, -39956, -169012, -147311, -62525, 53780, 93890, 199994, 204908, 89861, 5513, 12742, 23155, 2912, -106245, -255144, -167433]
24357a67433J61933Q307N7791r1897n8356J37307J51460Q9413p1330l7853r6227
24346H3115q3178j02912n9607j12035P9499M7848q7149l9547O0379J12691J87343
24335H6447J61226J5801j77159m7946J17932N3190r4953n5230m7628m6054N4154
24324A9780J3030N8258P5000j94641L8570K10821l6106k30242k20596J1063J33272
24313a21791N3517N2669k4801k7423O0373j58262n6305J07865K12322j8276q6975
24302g087R8547J74096j2395j79654j6475Q0274j64906j02988J42184p534k0359
24291a6297j47684M7989J239M6287j59868j92059J33887J63214J28400o8596m3961
24280a07449j8642o509q95O961m4112o450J75440J19832L7612k1909L8296N9797
$$ y = [-167433, -5500, 2807, 60598, -31299, -89655, 47652, 199112, 288525, 217195, 179342, 83115, -63, -102975, -162582, -274617, -195118, -147270, -234419, -273966, -213587, -100896, 86447, 247673, 263474, 86315, 38369, 156301, 209491, 114538, 59308, 11680, -34374, 19780, 32810, 91068, 166068, -28573, 9997, 220818, 184712, -45530, -266126, -255063, -121791, -68274, -15605, -40406, -67829, -7456, -165718, -222023, -114158, 98164, 79888, -7087, 91460, 265556, 253161, 73507, 57032, 137306, -27600, -130588, 11596, 4062, -16297, -163981, -115992, -114753, -68466, -228334, -420393, -286506, -123292, 5108, -63488, -107449, -126091, -132600, -133495, -126534, -170646, -177096, -1656, 118176, 155788, 133879, 172175, 231972]
24268B31972j02797j15852q5697J69776O5313q6959k4266l1771Q4553j0323K7134
24257A21083L1663M987J8826Q1742j84813j06719L7851L0916j87290q2329R6325
24246a37758J06357j34601J5044J03913l5265K5904q5507k31483J28784K18634
24236b5978J16079m2043m324m8974j67600K2555J72328m8668R466o8611k0631
24225a06401J69315j19558j57859O9366j1156n2154M7676J47396m6227O0798Q1432
24214H2628j25943j11705O9087J06811p4758l312o2969j09547j30852k2001J63677
24203b18884K11831M1337l858J1428j75018k46276J48425J04097P0597j07672
24193a63993o2540J02148M8805q7486R933O1592k8414M7768n7996o1844J09126
$$ y = [231972, 129175, 13323, -72374, 97402, 162715, 75756, 51490, 19719, 104272, 93949, 121083, 152746, 157733, 176559, 258301, 73488, -33231, 4620, 35536, -151754, -234083, -137758, -31401, -166002, -150958, -47045, -82310, -56406, -141913, -373396, -244612, -25978, 90101, 48058, 43734, -5240, -172840, -150285, 22043, -26625, -17159, -85770, -106401, 62914, -56644, -214503, -145137, -156293, -208447, -160771, -13375, -59602, 1196, 82628, -43315, -155020, -85933, 20878, -53880, -57192, -120161, -229708, -360560, -382561, -218884, -7053, 34284, 30426, 41854, -133164, -379440, -231015, -126918, -56321, -163993, -226533, -124385, -75580, -163066, -153133, -91541, -119955, -72187, -130183, -192027, -82901]
24182h2901N969N3664o2270L3734O9790l7795N3859k8692o3061j50456J53657
24171e4502K02890J808r403m7280q1036p7868j8872l7860J19270n8107j83151
24160b44111J029K11399o9246J3721m1046o9018K35418R4053q8815j68885O7127
24149e8374L2196m1131j52667l1882J40311J06251j4831m0652n966O5921r952
24138a0776j43412j96538K09953n8353R092K2699O01P7546j1294J62019J1687
24127G3224j51338k9386J34392J5455j07320p1868J22951J65079j1647j54880
24117a5338Q8650K38334j6094j48989p9075j67919o9600N776O2342J30999l9921
24106a0835K366j9983l2950L7158Q6161n0018j32442j4835m8232j5518K2677J28478
$$ y = [-82901, -76932, -23268, -85538, -51804, 17986, -19809, 34050, 5358, -57703, -208159, -54502, 148388, 150196, 140793, 93513, 12477, -65391, -84263, -122123, -2853, -60960, -244111, -243082, -31683, -100929, -87208, -128254, -197272, 38146, 132199, 43384, -125501, -58374, -26178, -67309, -219976, -251858, -111547, -5296, -20127, -60779, -66745, -824, -10776, -154188, -350726, -140773, -199126, -190034, -167335, -166734, -89188, -100482, 61537, 73224, -78114, -107500, 26892, 42347, -64973, -136841, -13890, 151189, 139542, -15338, 73312, 311646, 295552, 146563, 67488, -100431, -170031, -164255, -101913, 29086, -10835, -8469, -28452, -61402, -24244, 61917, 11899, -120543, -135378, -183610, -199128, -176451, -47973]
24094d7973J35408j22270j94351K47600J3017j88545k0812P4431n640N6320n7082
24083a09897j58625j40255Q6903K00546p4015J51806K55251M1505j17021p3862
24073F2336N381Q169k3752L8680j53656p48J87518J1568n9761j42461j35256j00636
24061c02618q0035N0055J30170N1958j4816j20617p606O3057Q2057N6024L6210
24050e6161L352o7131m1836K04365M3Q989J15452r2855p822j12433j44590o3766
24038b54393m6592J00007n1968L1480O2496K7647p4385q9295q9002J48741m976
24027b40240O2930k9415p4213N3265j2386J14549l0096J8518R626l3233J57853
24016b842P8659o9818K2788P1961j00802j66104j17489J61021J37751p2557M0386
$$ y = [-47973, 87435, -34835, -229186, 18414, 31431, -157114, -177926, -103495, -109135, -52815, -109897, -268522, -408777, -321874, -121328, -195343, -43537, 211714, 253219, 136198, 62336, 67717, 75886, 52134, 90814, -62842, -63590, 123928, 135496, 75735, -66726, -201982, -302618, -382653, -332598, -202428, -150470, -165286, -285903, -293509, -230452, -148395, -92371, -56161, -52809, -119940, -161776, 42589, 42632, 51621, 167073, 74218, 66396, -46037, -190627, -254393, -300985, -200978, -252946, -221466, -158970, -131323, -205708, -295003, -384005, -235264, -240240, -177310, -206725, -280938, -227673, -240059, -125510, -155606, -137088, -127462, -160695, -2842, 75817, 5999, 28787, 100748, -54, -166158, -283647, -122626, 15125, -57432, -17046]
24005a7046L5353K0966m9440q1391L829O094J237p6090J31920J75829j03561k6716
23993B0984P7495Q605j12950n812p6310j44649p414J52281M8020j57811K3390
23982a74171P2763o3058p3459K7613N2741J91692K27423m9475j76994q0931l5752
23971h1608j05772K4278J20540J39735l602j7628o1276l0731K7394j4111M685
23960A904k3130l0354J98337R4920q5604J49974M3824k3663j81108j42313m2020
23949c9233j62250l4262p3729n894P0195J0959k3886O555k7066N9604j1883l3398
23937b64288o532J99537J42533J08403j3491j94928j7082J09318j20926j03891
23927a61347N6476L9450M6575l7394j7665J95790n3718K3804M5873j84689K9601
$$ y = [-17046, 18307, 39273, -10167, -91558, -87729, -81635, -80398, -156488, -24568, 151261, 47700, 20984, 98479, 107084, -5866, -11678, -87988, -232637, -240051, -87770, -39750, -197561, -174171, -101408, -164466, -237925, -210312, -157571, 34121, 261544, 212069, 35075, -45856, -81608, -187380, -163102, -42562, 97173, 93571, 75943, 14667, -16064, 11330, -2781, 1904, -21226, -51580, 146757, 241677, 156073, 306047, 349871, 326208, 145100, 2787, -39233, -201483, -235745, -309474, -315368, -245173, -234214, -258100, -251545, -278611, -219007, -230890, -264288, -270820, -71283, 71250, 179653, 166162, -28766, -45848, 63470, -57456, -161347, -104871, -65421, -18846, -56240, -73905, 121885, 68167, 91971, 137844, -46845, -17244]
23916a7244n8556K0507j4556j9169k2368j4550j05156m2635n260J74713p144k533
23904a13951J16907k9470K8770O2670J5331r8676j78313l776Q6307j9955k8179
23893a62335l8432P5481q1075q7827K6265n7665R2096M3624j00361m2699K07908
23882a25020N1295Q421j94047J17498Q3319j03476j31499N4069J38323M0494o884
23871f7507L2986p6388M3131j7749j92479L2074Q691j11454J01448K23568J46825
23860A23146J49248L8682k21193L2252J33553J29736j40271l20808j19084p5093
23850b69832j0384o352K07699O1245l7281J52053N6982o1028k23976j07030K1030
23839b16874K4709R362J40754J41750m8263r2426J03837q344L2947j7186j57096
$$ y = [-17244, -75800, -55293, -69849, -89018, -111386, -125936, -231092, -273727, -278987, -104274, -111418, -113951, 2956, -26514, 2256, 64926, 80257, -18419, -196732, -200508, -114201, -134156, -162335, -200767, -125286, -206361, -294188, -267923, -325588, -233492, -189868, -290229, -332928, -125020, -73725, -65304, -259351, -141853, -58534, -162010, -293509, -239440, -101117, -60623, -67507, -34521, -110909, -67778, -85527, -278006, -245932, -237241, -348695, -247247, -23679, 123146, 272394, 311076, 89883, 122135, 255688, 385424, 245153, -75655, -194739, -269832, -280216, -286568, -78869, -17624, -54905, 97148, 154130, 93102, -130874, -237904, -216874, -192165, -182803, -42049, 99701, 51438, -40988, 62849, 54505, 87452, 70266, -86830]
23828h6830m017J40130k22502j36407J49713J53616J41382N500j75205P7289J35492
23817A78161m6744M5255m7948n0962j83849K5208J79089P1508p7145Q197j45094
23806d4324J1548J3361R8400k3818m5645p1882K0941l2917r5934j01967J6140
23795b56097P8753Q7236j2158k44195K4623J51705q737n4801j15786J29612P044
23784b12801J11772L12378P9886j65929j2708M3310N8501l2993l06712m5229J54332
23773a6193R3211o3616O8211Q0894n9473j64655M2170j2831J21318J57813J17679
23762C64528j47255j71873l460L5163p4819l0638m9422m8026p9868n4749J64676
23751i5743M6148O8038J3337j09257l5586J5782O073N9031o6042l8228j54418
$$ y = [-86830, -90847, 49283, -173219, -309626, -159913, -6297, 135085, 140585, -34620, 42669, 178161, 131417, 176672, 128724, 77762, -106087, -80879, 98210, 169718, 92573, 100770, -44324, -32776, -19415, 78985, 55167, 9522, -62360, -41419, -74336, -170270, -272237, -256097, -177344, -90108, -102266, -346461, -321838, -170133, -178870, -233671, -349457, -219845, -212801, -101029, 211349, 291235, 125306, 112598, 155908, 214409, 181416, -125296, -170525, -16193, 77018, 13402, 81613, 162507, 103034, -61621, -19451, -32282, 89036, 246849, 364528, 217273, 45400, 41940, 77103, 2284, -28354, -77776, -125802, -205670, -260419, -95743, -49595, 18443, 31780, -77477, -113063, -97281, -91208, -32177, -98219, -136447, -290865]
23740b90865N6754O0766o3725J52405J86411R6485j9518j65747l19355j73481
23730d79870J78262J29240p3251o3472J27175l9723R363N1027J158Q6401L9973
23719c3717O6094N4187r4402l9405j12284k4046J65961J98071J34755r970j60523
23708A44721j12020j3757l6089O8015J19579J35007j62084m5235N2210N8740J73150
23697C82237N6738j29247j34537J09689r8082K5466m0928N2129r3572k14863j84552
23686b69522K91489P6158J55153m9347m8554p118n0564j05672j06712N1620J19035
23675E5966L1697P0133m0847M5663M089m7265j03413Q3823m0113l6899n3860R9817
23663F8791o6698j40154m9851J98367J57076Q5148j91270Q81n6315J60832Q4617
$$ y = [-290865, -234111, -173345, -237070, -84665, 101746, 198231, 178713, 12966, -306389, -479870, -301608, -172368, -245619, -309091, -181916, -221639, -212276, -161249, -160091, -73690, -33717, 32377, 86564, -7838, -47243, -159527, -183573, -17612, 180459, 315214, 305244, 144721, 32701, 18944, -17145, 50870, 170449, 305456, 143372, 98137, 150347, 209087, 382237, 438975, 309728, 175191, 284880, 186798, 212264, 171336, 223465, 129893, -84970, -269522, 21967, 98125, 253278, 203931, 155377, 148259, 97695, -7977, -114689, -63069, 55966, 87663, 157796, 116949, 162612, 166701, 119436, 16023, 99846, 59733, 22834, -31026, 68791, 2093, -138061, -187912, 10455, 167531, 252679, 61409, 62290, 5975, 166807, 251424]
23652B51424n976p8956r7864J28176l0558n9274m2777K6674m5587n9543j17813
23641a32074Q9833L2492k12636m0845J93371r5j88192R7559J99191l574o3496
23630b8466L2431L6425L418O51q5316J1827o8675q6461K182M8662k8597k0677
23618a82596M4859J94787m1919l5879l8192J3300J11564P3174m9313o1316l9699
23607a1230J00123j50509p4268J62135l7228j49393m9940J23446P2961N3633Q0495
23596A20225p3622o8421P5660q379k5634j76697p4427k4059k421Q5353Q4537K4855
23584f3030r3094J8569L7390j51215p5861k7343N8110M3006K02313p1361m7679
23573a70195R6869K30713k8433M6681J17632j69210j1647r5298l2013O8286l568
$$ y = [251424, 245448, 166492, 68628, 196804, 166246, 106972, 64195, 90869, 45282, -14261, -132074, -42241, -9749, -222385, -263230, -69859, -69954, -258146, -160587, 38604, 35030, -28466, 3965, 40390, 43808, 44459, -40857, -29030, -97705, -184166, -181984, -133322, -161919, -182596, -137737, 57050, 15131, -20748, -58940, -45640, 65924, 139098, 89785, 28469, -11230, 88893, -61616, -135884, 26251, -10977, -160370, -210310, -86864, -13903, 39730, 120225, 46603, -21818, 53842, 45463, 19829, -156868, -231295, -255354, -257775, -172422, -87885, -63030, -156124, -137555, -100165, -251380, -327241, -354584, -296474, -253468, -51155, -122516, -170195, -73326, 157387, 128954, 175635, 293267, 124057, 112410, 17112, -14901, 53385, 49817]
23562D9817P8565r3531p0036j16382P001p2523O5801n6002J60468K09719L2031
23551A94928k03122J15728Q5383o0861j32383k5137m836J43228N5825N2700j5002
23540B06451k40394n5957l7404n5951j2522P9674K09009J55743j25199r3024j00375
23529f9949p7834K0291J1085m8749q4983k47251P3796K7077J15156J05833m1057
23518b16585K7718R4080j23520j33424J41555q392K4228J00246J02125l4418j78173
23507b04560n0630r4461R7385J70571J37988n6911j84563p214J8795j16059O6824
23496b22835J88933n7978j0995o7696l1016J67170J48663R3306m2459k12255k39409
23485b86571n9306P2287J9152J0563Q0218j8576N8073J60597l7131j66810P9727
$$ y = [49817, 128382, 34851, -35185, -151567, -144566, -217089, -151288, -207290, -46822, 162897, 194928, -8194, 107534, 192917, 132056, -327, -25464, -30300, 112928, 168753, 221453, 206451, -33943, -89900, -127304, -183255, -195777, -116103, 92906, 248649, 123450, 30426, -69949, -147783, -127492, -116407, -165156, -250139, -497390, -423594, -396517, -281361, -175528, -216585, -188867, -94787, -218307, -351731, -210176, -218568, -194340, -94094, 8031, -26387, -204560, -255190, -349651, -252266, -81695, 56293, -618, -185181, -192395, -173600, -289659, -222835, -33902, -91880, -102875, -170571, -201587, -34417, 114246, 207552, 165093, -47162, -286571, -345877, -273590, -254438, -243875, -163657, -182233, -124160, 36437, -694, -167504, -87777]
23474h7777J42560o3816k05409j20936n8542j4780J15784Q5106J42876N7704q8795
23463i6025j6836j4898P2716j68831r0982Q9224J14786N6931l5521l7266o3056
23452a89758J16762P2465J54138P162m4436j00937n1510Q0036L7231M6937R1884
23441B19974J4654p0346j08780m7833m4387n9694J53229O5616J861J7256j5763
23430A25787j53009j85768r7747J92990N0600K9854q5164l7112q687J46080q572
23419c0748j90509O2149J84778j01776j7506R0905p2723p5651j25940j76271K1596
23408d31696K3325J37574m7159J62481J09165q099N9407J7385J03619k5419l7240
23397F3343p9000n0833J07568R3181O810N6790L6740j48914j08678J04479K3696
$$ y = [-87777, 54783, -9033, -214442, -335378, -393920, -408700, -292916, -207810, -64934, -7230, -96025, -112861, -127759, -55043, -223874, -314856, -225632, -110846, -53915, -89436, -126702, -189758, -72996, -531, 153607, 160769, 116333, 15396, -36114, 43922, 81153, 128090, 219974, 234628, 164282, 55502, 7669, -36718, -96412, 56817, 122433, 124294, 141550, 125787, -27222, -212990, -310737, -117747, -67147, -37293, -122457, -159569, -168256, -22176, -30748, -221257, -159108, 25670, -76106, -93612, -2707, -75430, -151081, -277021, -453292, -431696, -408371, -270797, -317956, -155475, -46310, -54409, 4998, 22383, 126002, 100583, 63343, -15657, -66490, 41078, 134259, 141069, 197859, 234599, 85685, -22993, 81486, 105182]
23386A05182J03111j14949j49721p7331n0590P2843P44j21052l9411L6108Q9076
23375a45990N1940p1455j19974o3370M9435l3513J13802K11156J08285m8064o4984
23364a2732m5256m081J6876j27314N8059M8482n7823m8885K2362J66472K33803
23353B49963k0828N0041l2341k7368j09852j09494R5888J74716o7547k19321o9643
23342h5786J9031Q4348M4546M6192j07182m3283j05279n7283N0033L3101J0438
23331a11124P3743J2749j6678k01675j6996J17557P9013J01373p9985k05797p3116
23320c20936Q4715J28534j824K4223L1111n2988J10325J23673j87951j45869M4303
23309a62684j1375j0908N8910J22462Q2997j2287l8532J1111N2079k794j47688
$$ y = [105182, 208293, 93344, -56377, -133708, -184298, -111455, -110711, -231763, -271174, -235066, -145990, -94050, -165505, -285479, -348849, -299414, -332927, -219125, -7969, 100316, 52252, -12732, -57988, -62069, -45193, -172507, -114448, -65966, -123789, -172674, -150312, 16160, 249963, 229135, 279176, 246835, 219467, 109615, 121, 96009, 270725, 203178, -16143, -85786, -66755, 17593, 62139, 108331, 1149, -42134, -147413, -204696, -154663, -121562, -111124, -37381, -24632, -41310, -242985, -259981, -142424, -63411, 37962, -42023, -247820, -320936, -236221, -107687, -109511, -85288, -54177, -107165, 3160, 126833, -61118, -206987, -162684, -174059, -184967, -126057, -3595, 79402, 67115, 28583, 39694, 91773, 88979, -58709]
23298e8709l7114Q8791Q626N0786q2025j8396J07479J7761m9269J67188l92k22340
23286b7614j54144k7830l8844L7019J53654J49673J4980m0332m0752j62822o4309
23275b01321P1998m4542j02614J49339N4633k768r6821n5208n5238J69709R1102
23264b1731N5320m2150k0197J9138l6534l6003j00758K6523J48064J8126k0950
23253a1152n8163k4074M316n2398K48056J27847k6606r6531j63580j20503K9290
23242a43498m5508m6075j80236J03821J88697o0874j23211M3811J08571J20960
23232c3542K0330o7044j14473R6018O9657p3704q090J53480n7612j2553Q1706
23221E4173l27691N5273P1138K4543P8394K6217L6636n0387N5870j33445n3037
$$ y = [-58709, -95823, -7032, 1594, 52380, -29645, -48041, 59438, 77199, 27930, 195118, 194726, -27614, -181758, -209588, -248432, -211413, -57759, 91914, 106894, 66562, 25810, -137012, -201321, -129323, -173865, -276479, -127140, -72507, -75275, -172096, -227304, -282542, -112833, -21731, 33589, -8561, -28758, -9620, -46154, -82157, -182915, -156392, -8328, 9798, -11152, -69315, -93389, -89073, -141471, 106585, 234432, 207826, 111295, -52285, -172788, -143498, -189006, -235081, -415317, -311496, -122799, -183673, -306884, -263073, -154502, -33542, -13212, -80256, -194729, -98711, -29054, -102758, -110848, 42632, -14980, -27533, 54173, -273518, -218245, -147107, -122564, -44170, -17953, 18683, -31704, 24166, -109279, -162316]
23210a62316R1653K9297O5516N7782N9776O4002k267j63706m9512k0252j45103
23199a75130l136Q4810j1720J20043J10587j14600j6727K14313k8275k82288l9733
23188a41856R3255q9482J07297K6271p9105O3860R1241p9764J16768J92788J8520
23177C19793m6897j123m6841q2446q7566l6725N2069r6812k14154j46037J11314
23166b75425K61157J58809j67426j67243J08462J87517k0190j20925J3074L0053
23156G863N2013l4738o9583j37369k1264K5218o7725j08620J10588J59796K13356
23145A29535n4244o984j17412m6106J47595J30070l1169p3700j6671Q1161o6895
23134G5180q9941M6859j32066n9043P257K6071M1013Q2678k4063m9061n7069O2122
$$ y = [-162316, -70663, -41366, 24150, 81932, 141708, 205710, 203443, 39737, -9775, -30027, -175130, -178266, -93456, -105176, 14867, 125454, 10854, -5873, 208440, 180165, -102123, -141856, -48601, -138083, -30786, -4515, -83620, -19760, 71481, -8283, 108485, 301273, 319793, 272896, 271773, 224932, 142486, 54920, 18195, 70264, -26548, -240702, -386739, -275425, -14268, 144541, -22885, -190128, -81666, 105851, 85661, -35264, -22190, 7863, 59876, 25138, -44445, -181814, -203078, -177860, -245585, -354205, -243617, -83821, 129535, 75291, 68307, -49105, -95211, 52384, 182454, 151285, 77585, 60914, 142075, 75180, -14761, 32098, -99968, -159011, -151754, -125683, -84670, -1992, -26055, -75116, -132185, -70063]
23122g0063L4527J18655N837m0605J25053q4288j54095k52091J71490K10040N8073
23111A22533K4627o3975l7157J1005j07392r8286P9423J28540P0341j27205j18905
23100a16451o8470o0998n5354Q6881O9523K23297N6536J4220o1798J2870q4398
23089A5858J26672J41000N1273j37779n3585P4425P7373Q41j93994j90569j54254
23078b42739j34744J350N1033J09182P0028m6160q4169J61781J70169K5503p6684
23067D550k4722j0922j8457K39809N3907j60257K5549M1723o5170j52495p1034
23056a37519j37734O4921J06156O4899J441l8182J41955k27221j27506O8656q5494
23045c05628R530P4123j27501R9105J48673J1861j23459P9208J99031K8467K5562
$$ y = [-70063, -35536, 83119, 88956, 48351, 173404, 89116, -64979, -317070, -145580, 64460, 122533, 147160, 83185, 46028, 57033, -50359, -148645, -69222, 59318, 129659, 2454, -116451, -184921, -245919, -301273, -214392, -144869, 78428, 134964, 149184, 87386, 100256, 15858, 142530, 283530, 334803, 197024, 143439, 217864, 295237, 296078, 102084, -88485, -242739, -377483, -376133, -325100, -215918, -145890, -192050, -276219, -114438, 55731, 81234, 4550, -20172, -31094, -49551, 190258, 244165, 83908, 109457, 151180, 86010, -66485, -137519, -275253, -210332, -104176, -39277, -37836, -76018, 65937, -161284, -288790, -220134, -305628, -296098, -221975, -349476, -250371, -101698, -89837, -213296, -134088, 64943, 93410, 118972]
23034A18972j65971J50363q2899j61999L6967O8229P1108J45994Q1271p9338J07297
23023B89994q2331j20002R4619J23234P888k58627k94685l0633J36171k3903k0068
23012a78343O6855O017q7575P810l5672o3387L5569J16436J1913k1313P4701k0237
23000h7226M8699J21063J09267j7450j49648l0399O6112J5029J2687p7507o2085
22989e1458p4938l7281m2557K1853J62409P4780N3536j43543r6622n928J64856
22978B5107J02785j03305q5031j01671o2960O6744J11543k299m565K8343m6889
22967g2198r2307J24543R9471R1525O1967n0374L5791M5199q7201p2935k5133
22956E8348j47141o5917P1077p9503J76261J89993M5332j18417j21715j22261
$$ y = [118972, -46999, 103364, 20465, -141534, -104567, -36338, 34770, 180764, 262035, 182697, 289994, 207663, 87661, 182280, 305514, 313402, 54775, -239910, -270543, -134372, -158275, -178343, -111488, -105471, -193046, -185236, -220908, -284295, -248726, -132290, -120377, -141690, -66989, -87226, -38527, 82536, 191803, 174353, 24705, -5694, 60418, 75447, 88134, 10627, -51458, -126396, -163677, -206234, -184381, -21972, 52808, 106344, -37199, -133821, -139749, 25107, 127892, 24587, -60444, -162115, -225075, -158331, -46788, -49087, -53652, -25309, -72198, -164505, -39962, 59509, 151034, 213001, 162627, 198418, 243617, 156416, 83481, 58348, -88793, -154710, -83633, -163136, 13125, 203118, 248450, 130033, 8318, -113943]
22946a13943Q5083Q6704M6189j39063j3829N1805j4960p4918m8061n1406J53652
22935c2747L5133L459M0886P6492K3321J6199q2407r6367R7552L4638K1454K5558
22923A63171M7386n9756j03952p8948j7244o194J43653M4062K5667J5739k26132
22912e2548j51129R726n4936N2912R8618M6780l7873J9463n2125M1828J0228k35415
22900c04471j52373j6310J00435J80245J20164P0180k9451j66443j58138M8379
22890c07783J74428o6083n263r6142m1119J22987j506K7743J94823J02816k90300
22879a85399J1062J42396R9512K8559n1145L5990p1566J6349N8373J41952O4325
22868B90408j39156p4181j95131O4837J27289j10921o9914m1186r4622N9901J83999
$$ y = [-113943, -28860, 57844, 104033, -35030, -48859, 2946, -12014, -86932, -134993, -186399, -32747, 2386, 5845, 46731, 123223, 146544, 162743, 80336, -16031, 81521, 116159, 137613, 163171, 210557, 150801, 46849, -32099, -49343, -55537, 88116, 132178, 157845, 173584, -52548, -203677, -193951, -248887, -195975, -97357, -50577, -88450, -68987, -121112, -79284, -69056, -304471, -456844, -473154, -372719, -192474, -72310, -2130, -31581, -198024, -356162, -307783, -133355, -199438, -204701, -300843, -341962, -218975, -220481, -192738, 2085, 104901, -185399, -174337, -31941, 67571, 96130, 44985, 80975, 9409, 25758, 84131, 226083, 290408, 151252, 77071, -118060, -53223, 74066, -36855, -106769, -147955, -242577, -182676, 1323]
22857A323K9507j14512o8775J7289n9767R4812J74698j58033l9727J03120j37030
22846a57095j41920j24142L4274R8687J70352J22092J52115l0381m1595j14064
22836c1677p7244K9522Q0309o9296j32787J0919j08113o585L1433K65236N7129
22825D8846j23516R7207N1922Q7686r7549j43271k2777Q0092k7904K7030J62301
22814A40067Q7849q2562N6115k0388M5670R427L1086j36064j18886K8242p8574
22803c8018K5695J57774r1633j76916j37772J60683L0616M640j20960p5979l9737
22792c01607R5750K1468k9370N8734M6001j66408M8705J243J74363J21772N9799
22781A30450p700J90658J4876j74359j28287j50279m2326P6651R9333j35250j24566
$$ y = [1323, 30830, -83682, -152457, -135168, -194935, -100123, 74575, -83458, -123185, -20065, -157095, -299015, -423157, -388883, -290196, -119844, 2248, 154363, 123982, 82387, -31677, -108921, -79399, 910, -68386, -201173, -190254, -298367, -304952, -273519, -8283, 48846, -74670, 22537, 74459, 162145, 64596, -78675, -101452, -21360, -49264, -22234, 140067, 227916, 145354, 201469, 181081, 226751, 236178, 267264, 131200, 12314, 40556, -38018, -12323, 145451, 53818, -123098, -260870, -100187, -69571, -64931, -185891, -261870, -301607, -205857, -184389, -213759, -155025, -109024, -275432, -226727, -225484, -51121, 70651, 130450, 122750, 313408, 328284, 153925, 25638, -124641, -166967, -90316, 9017, -126233, -250799]
22770b50799J20747J36686Q0175n2064L9288m9137j87237j0816J0025j98908j4131
22759c76171L0498m8142L9207K5560L6941J49975R3350Q030j9318p3866J6359
22748a17577J61901q7628m8071J58310N8668j04410n8272q3785j7916R5252J26134
22737H2606l086J1783j32596o8713J71149K00086j60346j94637P8342l301j03800
22726a22513J2648Q9922Q3412n8841j78060L5713R012n2781j48958M6503J82273
22715a01670J21373J78371p8867r9336J4644l7836n5379J12842J44653m3241j80772
22704b5218j03018m7803J48087K41600m3500j75519K986j30853R8398j770k39797
22693b76407m9794J43138o793Q5773N9714R5600p7798p1508L9727j05899J00169
$$ y = [-250799, -130052, 6634, 86809, 34745, 74033, 24896, -162341, -173157, -163132, -362040, -376171, -345673, -393815, -354608, -329048, -292107, -142132, -48782, -40752, -60070, -133936, -117577, 44324, -43304, -91375, 66935, 125603, 21193, -37079, -120864, -138780, -43528, 82606, 79520, 91303, -41293, -110006, 61143, 261229, 100883, -93754, -15412, -18713, -122513, -109865, -19943, 63469, 4628, -173432, -137719, -128707, -181488, -330446, -283943, -101670, 19703, 198074, 119207, 19871, 34515, -3321, -58700, 54142, 198795, 155554, -25218, -128236, -176039, -27952, 213648, 170148, -5371, -2385, -133238, -34840, -36610, -276407, -326201, -183063, -189856, -104083, -44369, 51231, -26567, -98075, -58348, -164247, -64078]
22682f4078l2808J08186k29130k31126k4099N7747J17795J68521Q9030j6164L7126
22671a9000N5901Q5047j3873q3240p0841l599r384j26502l2226k6201J01075J45158
22659B315k7945K8920k0213l4827n3530p1010O8545J83j13473J29874J28361P7154
22647A14354p6684j83241J1198j1329K48821R0575j85417j30795O9003P5250K0244
22636D1979K0673K8365p9785P6681M9555q3923j19973p3613J04954M3853l7945
22625b9179m3854n424N3995l2808P9709N9723j23779m896K847R7202R9129k2788
22613A29877j48592j00515R0538Q8430J08343m9930j60950j10418j04040p622
22603b64879K28776J00975j38753k2622n992j01579p8982Q0722J19653M9253M1169
$$ y = [-64078, -96886, 11300, -217830, -448956, -473055, -415308, -297513, -128992, -39962, -56126, -19000, 36901, 121948, 108075, 24835, -46006, -49605, -58989, -185491, -217717, -243918, -142843, 2315, -25630, 3290, -16923, -51750, -105280, -176290, -107745, -107562, -221035, -91161, 37200, 114354, 37670, -145571, -134373, -145702, 103119, 193694, 8277, -122518, -53515, 21735, 41979, 62652, 91017, 11232, 87913, 137468, 53545, -66428, -140041, -35087, 8766, -29179, -73033, -78457, -24462, -57270, 22439, 82162, -41617, -46513, -43666, 53536, 152665, 129877, -18715, -119230, -28692, 59738, 168081, 118151, -42799, -153217, -257257, -264879, -36103, 64872, -73881, -96503, -102495, -204074, -283056, -202334, -82681, -33428, 7741]
22592G741O566q0852m3297J7631J1299P5678Q1216j08087j27690M5361M3780K02402
22580A31748r9980n4267m9884M0723q4859J11998P0825n0669k8034J37137J80573
22569C05311J44922j05753n5528j92968k40940L2058J21534N1280r1289j8747
22559e0120L9592N2565j8021L4462k1278j27490m664j7085J6531j09483J8750
22548a86241o580k7429J732k15027j1744R6040N7286J09732R4131L6616N2925
22537A441l2405j7711L5188L9077Q2190j9775J54791r3073k53292n1930J12596
22526d2903j27888j35370N9495J9801L4863j04678k6117q5387J02026M5423P0867
22515a89868J62439J22672J63771j6799j11354J1474j49185k32805O6032J29551
$$ y = [7741, 14307, -66545, -109842, -92211, -80912, -5234, 75982, -32105, -159795, -114434, -70654, 131748, 31768, -22499, -72383, -31660, -116519, -4521, 66304, 15635, -12399, 124738, 305311, 450233, 344480, 288952, 95984, -144956, -112898, 8636, 59916, -31373, -50120, -10528, 42037, 24016, 58478, 37200, -90290, -94954, -112039, -95508, -204991, -186241, -192821, -220250, -218518, -433545, -445289, -349249, -291963, -182231, -88100, -51484, 1441, -30964, -48675, -13487, 25590, 107780, 88005, 242796, 149723, -103569, -155499, -42903, -170791, -306161, -246666, -226865, -192002, -296680, -322797, -408184, -306158, -260735, -189868, -27429, 95243, 259014, 242215, 130861, 142335, -6850, -239655, -173623, -44072]
22505d4072j1452J0514n0498M6989M478r2403K18437K94101M9757j65172j96175
22494F4504n9042P7927k9559J6078J71599J5512L6956m3267j43598o2816J30973
22483A75267n6127J12288O4367j02643o0334r9542r3621R3332P4714J29661j11194
22472A26168l08386q9217J53116j2647j92256R8264L4880o2063J09478J73055
22462C0392p8184q0545Q2480j18441q4162J28387p8117K44544K04851j07441J03373
22451B47137o663j85477k4343J41844o8411k27602M606k2226R3562L7970n5556
22440f5159n0927r2925M142J7661K4865J6759M3996l0914J00182r2941J30470
22429E209K16292n6809K582j5025j16332l0932l3584r5585m6006L0345J43785
$$ y = [-44072, -55524, -45010, -95508, -48519, -44041, -136444, 81993, 376094, 425851, 260679, 64504, 5462, 83389, 53830, 69908, 241507, 257019, 293975, 250708, 107110, 44294, 175267, 119140, 231428, 295795, 193152, 132818, 33276, -60345, 32987, 107701, 237362, 126168, -182218, -271435, -118319, -130966, -323222, -224958, -190078, -252141, -142663, 30392, -47792, -128337, -45857, -164298, -248460, -120073, -198190, 46354, 251205, 143764, 247137, 240474, 54997, 30654, 172498, 104087, -123515, -118909, -141135, -47573, -9603, -65159, -116086, -209011, -204869, -187208, -162343, -145584, -101588, -132502, -32320, -125261, 5209, 221501, 164692, 167274, 152249, 35917, 4985, -28599, -124184, -170190, -139845, 3940]
22418C940M2218l6437o4762K09433P8210J8201M1009m7249r3707j24179j4040
22407A2637J06830l3955m1905K5250P8718j40723r1672Q4434J54942k4512o9247
22396F0797N0615j83633j07480j43602p9871K86751J21764J29491o5407l5599
22386C3826J05975L9967P1104q231k6085j62758j91011m9923j56001J84564Q8434
22375g0139o0895j46608m4575O7418k6148P1628R2808o2639j5001J01261M5568
22364d7322O196l5235j02389p9250l360J10303K6302N9058J42134J1695j40027
22353e1895j19152K0167J11864j1140j129j12301j9363j86307j52353Q2299J88737
22342b50573J93656K9879M2267k06975j8112O0612p9855Q8382J442L9945P1959
$$ y = [3940, 46158, 9721, -55041, 154392, 232602, 250803, 291812, 244563, 150856, 26677, 12637, 119467, 85512, 43607, 68857, 147575, 6852, -84820, -386, 154556, 130044, 60797, 111412, -72221, -179701, -323303, -403174, -116423, 5341, 134832, 69425, 33826, 139801, 179768, 250872, 242641, 216556, 53798, -137213, -187136, -343137, -158573, -70139, -131034, -277642, -322217, -254799, -280947, -209319, -116511, -179150, -194151, -92890, -47322, -41126, -76361, -178750, -258000, -261360, -151057, -124755, -65697, 76437, 88132, -51895, -171047, -150880, -39016, -50156, -51285, -163586, -182949, -369256, -521609, -439310, -250573, -56917, -27038, 15229, -191746, -209858, -149246, -229101, -140719, -139277, -99332, -27373]
22331b7373J50866j22949n2144J31047R3987J1407O3559r4791O92j08303p9198
22320c3200k53j18495m7569J80996J23250l9397j21025N0787N5291j12793K00410
22309A38002k2732j19009L164J70578J7454p5723K418M8784J8994r7734r1376
22298g180r1287M9913P3256M3365j8055r1097k505m0072j52062J13241J49390
22287B6907J02449j16283j87036J885K25998N8131j35041m704L5512R8646j54834
22276d8370j29229j201R0611J11289J20077j31290n3261K276k35410j21307J30457
22265b65358Q6883J78259O8747j20674j40931O4037j8225R5541N8237Q029J31600
22254A46145Q8202j29481j60852J4168J07483J07884j01488j38026n2142O5653
$$ y = [-27373, 123493, 544, -51600, 79447, 173434, 184841, 248400, 153609, 154301, 45998, -33200, -33453, -151948, -199517, -18521, 104729, 65332, -55693, -4906, 50385, -62408, 138002, 115270, -3739, -575, 170003, 187457, 111734, 114152, 162936, 181930, 84196, -7180, -98467, -48554, 24702, 68067, 50012, -41085, -43590, -83662, -235724, -122483, 26907, 129356, 13073, -173963, -172078, 53920, 112051, -22990, -27694, 7818, 106464, -48370, -177599, -178800, -88189, 23100, 143177, 11887, -41374, -39098, -274508, -395815, -265358, -178475, -216, 68531, -52143, -193074, -129037, -147262, -51721, 6516, 14545, 146145, 234347, 104866, -55986, -41818, 65665, 173549, 72061, -65965, -118107, -52454]
22244e2454K694o1805n9958Q291J0409J20444P3593J39505j32514q0595L4032
22233A642P279k4069j73182R9131J98006j2046q2747P8901m7915P6949J25870
22222B47819j42453n0259M0158q714r566l4406k3216L4507j51161j20932l9564
22211b57787J8983J40268J42740J41712J39177j35149j51557Q8851j1524l9312
22201G6402J13880K1793J15409p2398k60748l9905J68015p2145J4209M359l1643
22190C7228j11785j7908O5322k4723k9144P806o0558q7890n0737m9874j15523
22179d37786R4526K97074l8930j23033J44731M7942J73305o4850k04726j16683
22169b28430P5007j03378J06754J77033K5539j23733j74875M2698j27768J1368
$$ y = [-52454, -49760, -111565, -171523, -163232, -152823, -32379, 41214, 180719, 48205, -32390, 1642, 8921, -15148, -188330, -89199, 108807, 96761, 14014, 92915, 45000, 121949, 247819, 105366, 55107, 95265, 86551, 76985, 42579, 19363, 53870, -97291, -218223, -257787, -238804, -98536, 44204, 185916, 325093, 189944, 38387, 127238, 115714, 76402, 190282, 212075, 327484, 255086, -5662, -45567, 122448, 50303, 64512, 68871, 37228, -74557, -92465, -27143, -51866, -81010, -73204, -133762, -221652, -272389, -322263, -437786, -343260, -46186, -85116, -208149, -63418, -15476, 157829, 92979, -111747, -228430, -153423, -256801, -150047, 26986, 52525, -71208, -246083, -203385, -331153, -319785]
22159c19785K96386L9050r9505m2729M1353m5422Q8915o4390J77567l6351K7175
22148F2264K2834o7525n5616j5129J68667j47963o4560P0434L6441K3580o5729
22137c2302J53523M1096l2701r571R3323Q9423q5032p5056p6828K7942J60784
22126B54601N9749N6289m3240l34589q1347j5015n438J0343N5461J0869j42188
22115a74505M7305m4179J4910J19363j8137J45796k5763j6117P5557K18011j0617
22104C31624j20692j38859J08162J14623j16039k03084q9362J5061K3971J67093
22094I2498m9907r9559l1148P6015j38473j95818j5075Q846J26935P8495Q6850
22083f0341k2429K8376M5216n1163J10554J43635q8470k0224n0326R8472J39845
$$ y = [-319785, -23399, 15651, -83854, -126583, -85230, -130652, -41737, -106127, 71440, 35089, 62264, 85098, 17573, -38043, -53172, 115495, -32468, -97028, -26594, 9847, 33427, -32302, 121221, 162317, 129616, 120045, 213368, 302791, 217759, 142703, 65875, 93817, 254601, 314350, 370639, 327399, -7190, -88537, -103552, -108990, -98647, -43186, -32317, -174505, -127200, -171379, -156469, -37106, -55243, 90553, 64790, 48673, 124230, 342241, 331624, 210932, 72073, 180235, 294858, 178819, -24265, -113627, -98566, -74595, 92498, 42591, -56968, -88116, -12101, -150574, -346392, -361467, -352621, -225686, -147191, -60341, -82770, -54394, -9178, -60341, 50213, 193848, 105378, 85154, 34828, 133300, 273145]
22072B73145p1209k31168j39599J8696L6917K7647J34534J26803P9404p9305p1662
22061A04203K7432p329p6659n2265O3918j50181j36411l2258K44854r4811n1229
22050a60736N1170l6020j7409r3974J05454Q5270J36275p1285J63231R8930q8261
22039A72645k2828p1399m5393M9015Q7503O6125j7198O8763Q539R003j53341k57382
22027a05948j20462R7958M9800Q355J2940j6731O0533J06606K010j28224j60108
22016a93271k1227J46603J02131j88643m7238m7491J4462J04815Q3249M0750N9070
22005E3210K1142J9651R5094m8335l7520L96j07130k2814k21780j61858N4955
21994c54989K85120K07993Q1072j09519R674j46919l5221M5678p7557j12632p3103
$$ y = [273145, 201936, -29232, -168831, -150135, -113218, -85571, 48963, 175766, 255170, 175865, 104203, 131635, 124306, 47647, -4618, 59300, -90881, -227292, -259550, -14696, -109507, -160736, -109566, -145586, -162995, -256969, -151515, -66245, 70030, -1255, 161976, 260906, 172645, 149817, 78418, 33025, 82040, 169543, 235668, 218470, 287233, 295772, 304775, 151434, -105948, -226410, -128452, -78652, -70297, -57357, -74088, -13555, 93051, 95061, -33163, -193271, -214498, -67895, 34236, -154407, -201645, -249136, -234674, -129859, -46610, -5860, 53210, 74352, 94003, 189097, 140762, 103242, 103638, -3492, -26306, -248086, -409944, -354989, -69869, 138124, 219196, 109677, 119351, -27568, -62789, -17111, -94668, -207300, -280403]
21983b80403P2388N0933O810M3325K8750j28093L1366r375p6540L3684P618p1814
21971b91351K15127O0776j03153J9624j21771R533O5238P5336J00958n2322n1720
21960g3725R2495N6276J00878j13103j51861n1196J3451r3189q4184J15781J76921
21949a1456o9238j21154j05862L2783J54462O8491n8297O9527J29563j480k38247
21938a50908l1740j2051K24321K37112J32289l11403j38178l8728l1087m893n3886
21927a79152o188R3401L6146O9344L9187O8154j62886j76353q2536N2408m82K7542
21915b21415Q8934j98466J27102P6524j49021L2430Q8942J5209M3118k3799o4279
21904a84721o2159M9611K35540J02287j5542j24206j39794j5768J51896J39463
$$ y = [-280403, -208015, -157082, -150272, -106947, -78197, -206290, -174924, -184299, -260839, -227155, -219537, -291351, -76224, -15448, -118601, -98977, -220748, -211215, -145977, -70641, 30317, -22005, -73725, 18770, 75046, 175924, 62821, -89040, -140236, -126785, -219974, -304158, -188377, -11456, -80694, -201848, -307710, -274927, -120465, -51974, -110271, -40744, 88819, 87339, -150908, -182648, -194699, 29622, 266734, 399023, 87620, -50558, -89286, -120373, -125266, -179152, -185340, -91939, -55793, 13551, 52738, 120892, -41994, -218347, -300883, -248475, -248957, -221415, -132481, -330947, -203845, -127321, -276342, -243912, -154970, -139761, -96643, -120442, -184721, -246880, -197269, 38271, 140558, 125016, 810, -138984, -154752, -2856, 136607]
21894A36607M6164L8632k6803j34226q7634n0961j09977l2114j40372n159J17587
21883b48256r9076K309K26383J23973J61361m9503k6720l6365l7326k521r2054
21872g7795k3736r5551L5488K18081J15057O4972j47310q330j01806q3208j9705
21861a23843l008M8187J34510J09868j21488n2992J93214n2977J33596J17088
21851C82155j08233p9507k00703j8524L9685m7945k22988n2368J33543J22610
21841e2275K04318j5107n3977m7209m0141J08245r235p3740J3565Q3465l1871
21830H6038k4253l7950N3234J458j90717q1043o7698P3390K4055o9731j23880
21819c57097K9557K04462J51266K1814p5885K1450O1865j0304J2029q1290R1051
$$ y = [136607, 182771, 221403, 194600, 60374, -27260, -78221, -188198, -220312, -360684, -365843, -248256, -347332, -345023, -118640, 5333, 166694, 117191, 90471, 54106, 16780, 14259, -77795, -101531, -197082, -161594, 56487, 171544, 236516, 89206, 80876, -20930, -104138, -123843, -126851, -78664, 55846, 165714, 44226, -8766, 184448, 131471, 265067, 382155, 273922, 194415, -6288, -24812, 14873, -33072, -256060, -308428, -174885, -52275, 152043, 136936, 82959, 35750, -4391, 103854, 94619, 20879, 34444, 117909, 86038, 61785, 23835, 77069, 78527, -112190, -193233, -260931, -187541, -163486, -233217, -357097, -327540, -123078, 28188, 50002, -25883, -4433, 57432, 47128, 59157, -22133, 68918]
21808F8918j80954k42910J19246K84565O7105j05445m8357J6332J7101m6437k8694
21797g9530q3780k0357j1766n6556l3830J45135M1974J01828n0619n8708l1666
21786a37875l2163j73081q3367M2720k4008J54455O1532l2074Q1790O8395K2143
21775e1533J4970N788k5212J225j06697Q5345O7792q0159J11915k8765n3599m1358
21763a00288J31282J71696k4342q1541J66250J14112r9254j37575m9280J47330
21753B38390K8616J8946j61231j32681N7180R3612l2782p7986M7801m8131n4919
21742b3185L8701l58q0094j45037q3469R6891j4965j8002K09323K23287J10223
21731C13315j03912o8901j72424k4071q8541k8194J22228k1055J08577P2599j29714
$$ y = [68918, -112036, -354946, -235700, 48865, 115970, 10525, -37832, -21500, -4399, -50836, -79530, -163310, -183667, -195433, -251989, -285819, -140684, -98710, 3118, -47501, -106209, -137875, -170038, -343119, -426486, -383766, -407774, -253319, -191787, -223861, -142071, -73676, -51533, -36563, -30775, -55987, -54762, -161459, -76114, -8322, -88481, 23434, -5331, -58930, -100288, 30994, 202690, 178348, 96807, 263057, 377169, 277915, 140340, 91060, 238390, 267006, 285952, 124721, -7960, 49220, 142832, 110050, 32064, 79865, 31734, -23185, 15516, 15158, -64936, -209973, -293442, -196551, -211516, -229518, -20195, 203092, 313315, 209403, 140502, -31922, -55993, -144534, -172728, -50500, -71555, 37022, 109621, -20093]
21720b0093J04579J58242M9074n7088j04481p0639k7431o5509L1218j6640n0687
21709f9455j89235O7166K05538L3543j92931k3659J2336l0028K6070J9826k8167
21698a68996o906J18171J92770k6465k30579N115m7118j12011o3822J47060J5731
21687a77050k36800Q8023P8209J23905R5914K4029P7990j40908k06023L1809j5521
21676b56423L4082R6045l60q3821L4620J3637L6767O1032L2745L6328M1898J2733
21664E9283q1767L7211J3824R7308n320J39607k309n3216L6341M228m8365j27583
21652F9242N3419L3058R5169P621m7663n2081j45161k37167j41660J05759K97491
21641C8027j9159j13569N0845Q283M001q236M376Q0922K6911M945j95698j52759
$$ y = [-20093, 84486, 242728, 291802, 234714, 130233, 59594, 32163, -33346, -2128, -18768, -69455, -258690, -191524, 14014, 47557, -145374, -169033, -156697, -186725, -160655, -140829, -168996, -175902, -57731, 135039, 108574, -122005, -116890, -164008, -276019, -339841, -192781, -177050, -413850, -325827, -247618, -123713, -27799, -3770, 74220, -66688, -272711, -240902, -256423, -222341, -126296, -126656, -210477, -175857, -162220, -125453, -64421, -31676, 4652, 46550, 59283, -22484, 14727, 28551, 125859, 120539, 260146, 257837, 204621, 240962, 245190, 196825, 69242, 122661, 155719, 250888, 258509, 210846, 158765, 13604, -223563, -365223, -259464, 38027, 18868, -94701, -43856, -35573, -31572, -39808, -35432, 45490, 72401, 77346, -118352, -271111]
21629b71111K67390J10751m2356k51068r6809q768O8290J72394Q8741R7009K2647
21618A57110O22p4948j59400n9864k7444n0685J42932J45869J8967p7356j15370
21607i9567j04730P940J33395J84850N1035l5956K2631K1782j37615j05902o8738
21596a30875j69951J31278P1213J10517l6304j48007O7481P5385r0770J0719O3145
21585d6169P6313k09384j69980l858O6700P80M8587n3569N7624K9736J758J15788
21573h5674J75091J93J2788O0336j93101k1593m7011j19532j15326m0617p3680
21562d48126J4826J99606K12589L7078j81051j25053J32210N6905m982j04485
21552b10483K6949O2063j31559K3309P304J32J35323R6008m4166j04258l2334
$$ y = [-271111, -3721, 107030, 64674, -186394, -283203, -291971, -223681, -51287, 37454, 134463, 157110, 157732, 82784, -76616, -136480, -163924, -214609, -71677, 74192, 93159, 15803, -99567, -204297, -196357, -62962, 121888, 172923, 136967, 159598, 181380, 43765, -62137, -130875, -300826, -169548, -98335, 12182, -24122, -172129, -104648, -29263, -120033, -109314, -46169, 30144, -179240, -349220, -353078, -286378, -285598, -237011, -290580, -232956, -203220, -201462, -85674, 89417, 89610, 102398, 162734, -30367, -51960, -98971, -218503, -333829, -374446, -448126, -433300, -233694, -21105, 15973, -165078, -290131, -157921, -101016, -105998, -210483, -183534, -121471, -253030, -229721, -222417, -222285, -86962, 9046, -35120, -139378, -171712]
21541a71712J06947K18669J4424p8197J59016Q2053m249j92671n0825L3576k12676
21530i5645k6938J05393O5129M3875M338k77279j16193p6800J06164K19776L3041
21519a5139o4911K9690n6391o2860l2377R8004N2276j22972p3123l4678Q6067
21508a96414J42580J24965j47879j60323r0935n859k0195R8022P7547O5750J77808
21497F5067j30769j18077K2125r3639R8698l0284M5471M9586j12663p6880J6037
21486b65328N5470j0708M4825l7005o226J30231P3918L8474j3389j65952M1782
21475a13908R6098K769j26599j30082P4613Q8020l0220R3869j2348Q024K082k0232
21463f7914P1513J86483m3105j47752o1300p9940j09847J92151J02444k5799m5722
$$ y = [-171712, -64765, 153904, 168328, 90131, 249147, 331200, 326951, 134280, 83455, 117031, -95645, -122583, -17190, 47939, 91814, 96152, -181127, -297320, -374120, -267956, -48180, -15139, -80050, -50360, -106751, -169611, -201988, -103984, -51708, -174680, -247803, -282481, -196414, -53834, 71131, -76748, -237071, -328006, -333865, -354060, -256038, -178491, -112741, 65067, -65702, -183779, -161654, -255293, -156595, -186879, -141408, -91822, -204485, -281365, -265328, -209858, -220566, -175741, -212746, -218972, -88741, -14823, 23651, 10262, -155690, -113908, -17810, -15041, -141640, -271722, -197109, -109089, -139309, -45440, -57788, -49764, -47682, -67914, 3599, 190082, 146977, -775, -62075, -142015, -251862, -59711, 42733, 16934, -28788]
21452b8788o567q0437R6512K6595R0519N9405j63523p1800J49660M8228k08206
21441h8402q304Q1495l3088k3034J4977j05029P3581R9111K2988j4510j6295j67676
21429a64186m7883J47732K11582J35712k7408p7053L510N4738j4574j69900O1539
21418A13809P0451J78505P1629k59862o3473M8253j83085l7987j31268j64968
21408c57996L5474J57527J67193l3877M9168J19346J33259P5621k3683p7437l7453
21397B07142k1310m5732p1620j49483n0108L187K4369R3925p1174l1296j05322
21386b17422J24739Q4364K7762o2494J24029j012m6395r12j10120r7780J27043
21375d8198J3022K917K2796Q0463J84827j5402k658j72020j58882n0161N2462
$$ y = [-28788, -35355, -115792, -19280, 7315, 97834, 157239, -6284, -78084, 71576, 119804, -88402, -96706, -15211, -48299, -71333, -56356, -161385, -87804, 11307, 34295, 19785, 3490, -164186, -212069, -64337, 147245, 282957, 255549, 178496, 182006, 236744, 222170, 52270, 113809, 184260, 362765, 434394, 174532, 111059, 159312, -23773, -61760, -193028, -357996, -322522, -164995, 2198, -31679, 17489, 136835, 270094, 345715, 322032, 244595, 207142, 185832, 140100, 68480, -81003, -131111, -127924, -103555, -9630, -80804, -112100, -217422, -92683, -8319, 19443, -43051, 80978, 79966, 33571, 32659, -77461, -175241, -48198, -35176, -32259, -9463, 71000, 255827, 240425, 237767, 65747, -93135, -143296, -90834]
21364i0834n8470J00365J2580J33510O6006m2858J25559K9022j11328p2214p0846
21353B0492J37551L091j81334j69826M016k3101J2653k2103K8923k3649J07636
21342a05651k5065q935j26283r7057K17699J34466O5712q2240j9916m5528N6766
21331c6032J4657N9472n4659p1632o771n787J65723r9328j5213J03823P0967r7478
21319B7742r7837K09803m893m4321P0124j13810K348K450P4946j05050n2275L8398
21307G625o4106m8481Q450m7844K6238J01990l8773k6776q4422m5840J44751K55966
21295A88778j9571N4066J53142j36176k58800j01101J0300n5578j49909j64127
21285d78976Q3134J73646J52904J00008j66998L4098J29660J07887j0632r3772
$$ y = [-90834, -149304, -48939, -36359, 97151, 163157, 120299, 245858, 274880, 163552, 91338, 20492, 158043, 161134, -20200, -190026, -186010, -209111, -196458, -218561, -189638, -213287, -105651, -130716, -139651, -265934, -362991, -145292, -10826, 54886, -27354, -47270, -92798, -36032, -21375, 38097, -16562, -88194, -94965, -100752, 64971, -34357, -49570, 54253, 125220, 27742, -70095, 139708, 134815, 90494, 160618, 46808, 49156, 51606, 126552, 21502, -30773, 7625, -56481, -104962, -96512, -144356, -118118, -16128, -54901, -81677, -166099, -211939, -67188, 188778, 169207, 223273, 376415, 240239, -18561, -119662, -109362, -164940, -314849, -478976, -395842, -222196, -69292, 30716, -136282, -102184, 27476, 135363, 124731, 30959]
21275C0959j17302n2618L2399L726j5538J21398J18638J40720j40025k20466j46518
21264b44627j13365Q4745q3701Q6193P9710O6704J09664P4505N5533j01194k71712
21253b57545n0868K76911L4179J02877J0j40904M1155J09805K2203p0986o5209
21242A628n2743n3795k836m5069J08652n0499L4674p349O9407o6251R5024j0991
21230A9852r5885p2584J5767J77649j39501r8898K28672J20398j6890O212j18137
21219B6655k46912p0600R5545M4465K5257J21974O3086m556o9450K1694o2744
21208e5586k9280q2576L9198O3218M1404j13508r7097o4014l1608q677o6299l5458
21196d40283J38148J92632J28506P4004K37807L5987j89334m9806k5280L7606
$$ y = [30959, -86343, -138961, -106562, -102836, -118374, 3024, 121662, 262382, 122357, -98109, -244627, -357992, -273247, -356948, -270755, -191045, -124341, -14677, 59828, 115361, 14167, -257545, -308413, -31502, 2677, 105554, 105564, -35340, 5815, 115620, 137823, 66837, 1628, -51115, -104910, -107746, -152815, -44163, -94662, -59988, -67337, 2070, -64181, 30843, 19852, -76033, -148617, -132850, 44799, -94702, -193600, 35072, 155470, 138580, 144792, 26655, -220257, -290857, -195312, -150847, -125590, -3616, 59470, 54914, -14536, 7158, -55586, -84866, -167442, -128244, -65026, -23622, -137130, -234227, -298241, -329849, -338526, -404825, -440283, -302135, -109503, 19003, 93007, 330814, 366801, 177467, 127661, 102381, 139987]
21186A39987k39578p7737J73129N8529o782l9407p2301k2381m8477q726k5594
21175a69338Q4222J22624l8398R6717L6505J9771k0557o0264k12707J64692K9106
21164E2373j6274Q8895J33857j46498J4591r2062j46810l6439m3672m2945L1365
21153b03619J66894Q2795j35764k26794j44731o5335J13446K03264K84487M5617
21143A20260j21157n3079q1791J77121J28967k3668m8870K6772j04725J01382
21133A21212j51035p5171R2800j9205N1321R5597q7175O2655q199o163o0357j0040
21121F240k4033N3237N0393Q2642k4932j1636j33046k1257j60570p957J23858
21110f7061J02475O8005r8765p8468N6146N4481q366j47908j28540O1403q804
$$ y = [139987, -99591, -177328, -4199, 54330, 47548, 8141, -64160, -86541, -135018, -143744, -169338, -85116, 37508, -890, 95827, 132332, 152103, 131546, 71282, -141425, 23267, 52373, 36099, 124994, 258851, 112353, 126944, 34882, -111928, -148367, -192039, -234984, -203619, -36725, 46070, -89694, -316488, -461219, -526554, -413108, -209844, 74643, 120260, -897, -53976, -135767, 41354, 170321, 146653, 97783, 124555, 19830, 121212, -29823, -104994, -12194, -31399, 19922, 115519, 28344, 90999, 82800, 76637, 16280, 6240, -17793, 35444, 85837, 168479, 143547, 131911, -1135, -22392, -182962, -190919, -67061, 35414, 103419, 4654, -73814, -17668, 36813, 28447, -119461, -248001, -186598, -195402]
21099a95402p768L8171O1768m9040O8852K06205n8866j21155j32914j23243J08847
21088b04545J29555j6584L6199N5956k31977r6360N8293K9050J29526n971J38518
21077B1660n2661j23008L6754J2535J42847o4161j07358J98377N7741l7106O579
21066I2199p0026j44904K1360k1666N9565O8437O7314R0241j8654p5766O0293
21055A28393k225j19393o5693L3143j5674j99963N4787J85397R506l8300q8699
21044a18721j06022J50471J35312J27643J59083m8060j10979q2670j58950j24198
21034a77091N6334l8913J76712J89495O3487j84041K544L2057j47357K6350p5864
21023g6287l5845K955n0160j0387J93356J42529K1067J6336j22695O2627r2655
$$ y = [-195402, -203170, -164999, -103231, -152271, -83419, 122786, 63920, -57235, -190149, -313392, -204545, -74990, -91574, -55375, 581, -231396, -327756, -269463, -240413, -110887, -116858, 21660, -31001, -154009, -117255, -104720, 38127, -26034, -133392, 64985, 122726, 85620, 92199, 22173, -122731, -101371, -123037, -63472, 4965, 72279, 162520, 143866, 68100, 128393, 126168, 6775, -58918, -25775, -41449, -241412, -186625, -1228, 8278, -30022, -118721, -224743, -74272, 61040, 188683, 347766, 299706, 188727, 106057, -52893, -177091, -120757, -159670, 17042, 206537, 270024, 85983, 88527, 120584, -26773, -423, -76287, -112132, -109177, -159337, -169724, 23632, 166161, 187228, 203564, 80869, 143496, 50841]
21012E0841k0041j16150k1030M4600j13562M8456q811J0268q369J17183n5954
21001g2569o9091R6062J40301r1467k2582J10825J32935R7228J7737q0926R1124
20990C49577j270j21526k32757j4989J88875O6413L9272q8660j31306j2246J45648
20979A87031o4084o0614l3155j29889j34459M83J71135J65807j50403N4114J48405
20968A54371o3135j31323j45473L678J45423j7802p608J19638j6236r4376q9092
20957a41935o5947r6482J49147o8258j8410P8048k6018j6635k1193q1949M5096
20946b64536J70795R8081P308n8986m3930N9767p4532P7956N3934J02732o2681
20935F5908P502J168j03655j18068j6129j4444K64373J79274L2013L7933k7421
$$ y = [50841, 30800, -85350, -106380, -61780, -175342, -126886, -135697, -125429, -133798, -16615, -72569, -141660, -45598, 94703, 3236, -19346, 91479, 224414, 321642, 339379, 258453, 349577, 348307, 226781, -5976, -20965, 167910, 234323, 273595, 184935, 53629, 41383, 187031, 122947, 62333, 29178, -100711, -235170, -234687, -63552, 102255, -48148, 5966, 154371, 91236, -40087, -185560, -181882, -36459, -54261, -61869, 57769, 41533, -52843, -141935, -207882, -304364, -155217, -223475, -241885, -163837, -189855, -206490, -227683, -309632, -264536, -93741, 4340, 11648, -47338, -91268, -31501, -106033, -28077, 25857, 128589, 65908, 73410, 74578, -29077, -147145, -163274, -177718, 86655, 265929, 297942, 335875, 308454]
20924C08454j67944n0340M913P4779j29191n0805J3666N4145M4043N2226n6211
20913I7735o5642R0463n5631J51106p1372k43960k2188Q1046M3607p7499L8274
20902c4061J8636J39516O235j339j3214K4880K76337J4636p0405J08114M2576
20891E11911N460J92947J65282L02561M87149M15630J92189j36985l32048m00051
20881A404045n35095j99229j54960j55425k4415K02824q2842j64493j19491k5936
20871A44983j21143l0981M5628o4550N763j06655M1107K6264N4320J12073N4669
20860A61478N2387n1034j99124k02130O7281K17332R8962K0913o2260j84857j63020
20849b44072J10332K23997j5313r2292n2810Q9665J33858N8054O5676J45466m6209
$$ y = [308454, 140510, 90170, 95083, 169862, 40671, -10134, 3532, 57677, 101720, 153946, 97735, 32093, 122556, 66925, 218031, 146659, -97301, -119489, -38443, 5164, -72335, -34061, -15425, 124091, 130326, 128987, 115773, 140653, 416990, 431626, 361221, 469335, 511911, 517371, 710318, 875600, 1178161, 1665310, 2080940, 2273129, 2136144, 1804096, 1404045, 868950, 669721, 514761, 359336, 334921, 537745, 454903, 290410, 170919, 144983, 23840, -7141, 38487, -26063, -20300, -126955, -85848, -59584, -5264, 106809, 161478, 213865, 162831, -36293, -238423, -171142, 46190, 145152, 166065, 103805, -81052, -244072, -133740, 90257, 74944, -17348, -70158, 19507, 153365, 211419, 277095, 422561, 376352]
20838C76352o4152j31162m1881m5012j6178j22855m5701P6055Q9848p0739J5589
20827B0164j75741q8997P4272j8752r9072J06750Q4330J9078P8325j20119k0241
20816a40003n0462N4968P6118J31806R6333M1723j6445j80290j78270N8507P1927
20805c4088k967N0267J37728O8126M9244j13403j42684m423J04062L5878n5158
20794I2582j01202o0816N1608R8367o1254n2834r9268n2148k01098L2410J03413
20783b50240R3295Q5365J9356l6119k6658J43713k4897l8903P2893m142J75242
20772B08905J41008j30642o2169k25995k31423j50553K09703K27146O6839j9525
20762C3294p3564R704P2702l0449J5895J16530N2018r0590q8290L8261n0322m1241
$$ y = [376352, 312200, 181038, 139157, 94145, 77967, -44888, -90589, -14534, 75314, 4575, 20164, -155577, -244574, -170302, -189054, -288126, -181376, -97046, -77968, 357, -119762, -140003, -190465, -135497, -59379, 72427, 168760, 210483, 194038, 13748, -164522, -106015, -34088, -37055, 13212, 150940, 219066, 268310, 154907, 12223, 7800, 111862, 147740, 92582, -8620, -69436, -17828, 80539, 19285, -33549, -132817, -184965, -386063, -353653, -250240, -156945, -71580, -52224, -88343, -115001, 28712, 3815, -35088, 37805, 33663, 208905, 349913, 219271, 157102, -68893, -300316, -450869, -241166, -14020, 52819, 33294, -40270, -30566, 42136, 11687, 27582, 144112, 196130, 105540, 17250, 55511, 5189, -36052]
20750c6052J06341P5399n6650k83796l7789j36694J62274K31062o3772r3161Q4515
20739d8323M7515P955n3081j60565j09273K02515K07711j14276q2448p4046K5080
20728a51236J87092J8537j5538k7761R557l0363j62404J7180K8107r622O4735
20717g1716J57827J62639p5548l53572j71374Q2637J33761Q5594J12226L4167
20707I6641q5940K0083L3620J35609j21357j55684L7187J20848P64l6106k6269
20696A9396J47948j11798o2067J11274J54101l9058n6621j31517q8590p3353o3032
20685a93317K35011K67397j84406l0403O0151Q6887m3001j03370K399J12170J42904
20674C52422k4294j84251k62372j97527J23230K05854p9987p6875J49237N2375
$$ y = [-36052, 70289, 145688, 89038, -194758, -232547, -369241, -206967, 24095, -39677, -132838, -48323, -808, 7147, -45934, -206499, -315772, -113257, 94454, -19822, -102270, -176316, -151236, 35856, 54393, 38855, 11094, 20651, -9712, -172116, -154936, -126829, -136451, -71716, 86111, 248750, 173202, -180370, -351744, -269107, -135346, -49752, 62474, 96641, 10701, 30784, 64404, 200013, 78656, -77028, -39841, 81007, 81771, 45665, 19396, 167344, 55546, -6521, 104753, 258854, 219796, 163175, 31658, -56932, -130285, -193317, 41694, 309091, 124685, 94282, 154433, 241320, 198319, 94949, 97348, 209518, 352422, 328128, 143877, -118495, -316022, -192792, 13062, -66925, -143800, 5437, 57812]
20664E7812j7121o3867o6462n1298j0668K19072K42766K6548j25050k5257J34188
20653C20663P7930j23543n2245j11035l1844J11357Q3911n1182P394n0963j50949
20642B9494l4578j06319K1690K6886k2183m501Q3931J99978p7206J4241N8530
20631A89963m9435j15888r8921o8308J71931Q1353j0714L0337r9308j26766m7806
20620a43562q2877J82369M2271k7096j01059j03279j03270J48329Q5701M798J6746
20609h0929j41493J34143J17015l462o527m5217j10740r9672N0936P5115m3429
20598a54260l8357J51934J40149j29601j06475j23741P0158M8245J6949j36137
20588b61136P3656J67564N6644N7720M1264j6215q278k04703M3727J80490j03551
$$ y = [57812, 40691, -23176, -89638, -140936, -151604, 67468, 310234, 336782, 211732, 186475, 320663, 398593, 275050, 222805, 111770, 79926, 191283, 275194, 224012, 231406, 180443, 29494, -5084, -111403, -89713, -62827, -85010, -89511, -5580, 194398, 117192, 131433, 189963, 140528, 24640, -74281, -142589, 29342, 110695, 99981, 130318, 31010, -95756, -143562, -226439, -44070, -1799, -28895, -129954, -233233, -336503, -188174, -102473, -97675, -80929, -222422, -88279, 28736, 25274, 18747, -26470, -137210, -236882, -185946, -110831, -154260, -192617, -40683, 99466, -30135, -136610, -260351, -190193, -141948, -124999, -261136, -187480, -19916, 36728, 94448, 135712, 119497, 111219, -93484, -49757, 130733, 27182]
20577B7182q3343n7701q1973m0048O4066J85165L0931o3229L5612m2205m1571
20566f7114N2005J72156R5564j75221n5550Q6870q4734j49326J79516J41150j38070
20555E7246k7239J81257m6540n1908O3709j90317r8746q579K13485J14868o8170
20544A39066n7903j00296M1388m3621J04732p539j9339j47055p5356k9329K1521
20533a73731M0394J99202J19319P9140J75593n5094n0650r0773L0733M778Q412
20522B87323j8082j62241k09529m2020J51534L3631J63749L9140k6191j1898J00990
20511C06406o3731m5438r2360L5123K6203J2895m2028j01495m5397q2265k8249
20500a20336M6437Q1748J26374P0459j9660J28564r541k0374J14968q88j35919
$$ y = [27182, -56161, -113862, -195835, -235883, -171817, 13348, 44279, -18950, 16662, -25543, -67114, -15109, 157047, 252611, 77390, 21840, 108710, 23976, -125350, 54166, 195316, 57246, 30007, 211264, 164724, 112816, 176525, -13792, -112538, -121117, 92368, 207236, 139066, 81163, -19133, 22255, -21366, 83366, 75827, 56488, -90567, -165923, -195252, -173731, -133337, 65865, 185184, 264324, 439917, 384823, 334173, 243400, 274133, 278911, 287323, 269241, 107000, -102529, -144549, 6985, 40616, 204365, 243505, 217314, 205416, 306406, 242675, 197237, 104877, 140000, 166203, 179098, 137070, 35575, -9822, -92087, -120336, -73899, 7849, 134223, 204682, 185022, 313586, 304045, 283671, 398639, 397751, 261832]
20489B61832o2800k01738n8195J13732q8639j05374k552l7803J08112r942q3738
20478a67105j65303j11220J02395J44568p9853P7161K26130o4747k02510j38080
20468c78564J2542J19309J76175J84559J16018k64531k19271o7077Q8521K6041
20458b06278K30202O3223J16808O6205n4016o6854R1878J39498j46718j47543
20448H6405n4019N2727j0561r5596j80202P3594J56070j09579q1173O3434K0459
20437g8441r3800k1229N6902J20256M7761k8319m7581P992R018r4554L1727P4679
20425a5589j43560Q3489m0296O6925K28662O4773q5503r6659p8343N3599O6649
20414A04147l2361n3238o684r4536j1057L9662L0979J16480Q9649K730J50824
$$ y = [261832, 199032, -2706, -60901, 52831, -35808, -141182, -143734, -181537, -73425, -83367, -167105, -332408, -443628, -341233, -196665, -276518, -199357, 26773, -37974, -240484, -378564, -366022, -246713, -70538, 114021, 230039, -34492, -253763, -320840, -232319, -206278, 23924, 87147, 203955, 270160, 216144, 149290, 241168, 380666, 233948, 86405, 32386, 85113, 74552, -21044, -201246, -127652, 28418, -81161, -162334, -98900, -78441, -172241, -193470, -136568, -16312, 31449, 3130, -44451, -36459, -27441, -121995, -90268, -15589, -159149, -75660, -115956, -49031, 179631, 244404, 158901, 62242, -16101, 37498, 104147, 71786, 18548, 11864, -82672, -93729, -54067, -23088, 93392, 183041, 185771, 336595]
20403C36595K3885j09184r9729K7213O4851r1763o7661j08613Q9397L85971L34859
20392G85821k12861j22515j77889l11322j67608L7057K65445J00178J21061o2571
20382B54796p728n1649j15147M7985n6661K4782o7942L8156k4435M8412m1721
20371D8848k3096q1743M2217n463J22480k634K4672J6360j40676k1114L6460j0846
20359E465J60757k986j76704O2017l9613O7884R8487J06794k1031l1233q348m810
20347B16679j3829j25590p3618m9388J02075n360m1403j08955p7257R7261P0597
20336h788J9979k5435r4505l9281J90224L8136K7910O9333j52219j45088j44458
20325b64192L1259J80680O3044j4674j54188R4131p6127m9645J05646N1287p3826
$$ y = [336595, 360480, 251296, 151567, 178780, 243631, 151868, 84207, -24406, 64991, 450962, 785821, 572960, 450445, 272556, -38766, -206374, -169317, 96128, 196306, 317367, 254796, 247068, 195419, 80272, 128257, 71596, 96378, 28436, 66592, 42157, 90569, 48848, 25752, -55991, -13774, -19237, 103243, 100609, 125281, 141641, 965, -20149, 16311, 5465, 166222, 163236, -13468, 48549, 8936, 76820, 175307, 282101, 261070, 229837, 221489, 216679, 202850, 77260, 3642, -45746, 56329, 50969, 9566, -99389, -176646, -79385, -8788, 11191, -14244, -108749, -148030, 42194, 80330, 108240, 177573, 25354, -119734, -264192, -232933, -52253, 10791, -3883, -158071, -63940, -140067, -189712, -84066, -32779, -106605]
20314a06605k1035O4804J15869J81734P0410l9485r512l7678o1585l3809m930
20303A18178j3639M363K2898J5050K2020k888q647j88661O0363Q7585p2426Q5149
20291A29345R2509j68047j33328K18201J30428J84187J08534J4937j00418o1405
20281D14943L362l0606r707j02994l1602J13243J04666Q073J44563J01457K6762
20270G42160O2982q6260k14409k66997j07458L7570Q1414Q432j10281j1227J1797
20259A47723j25069J10522R1111j53334l4171j27591J74354J49221J40474J70487
20249E43727p1926j94229j0367r6849m5102j1230L7894q1354j56587k043J12552
20238B4486J01686K48j0885J5712j55131j18077O3979K52063R6683K7088J24708
$$ y = [-106605, -127640, -62836, 53033, 234767, 305177, 265692, 256180, 218502, 156917, 123108, 118178, 104539, 108902, 131800, 146850, 168870, 165982, 157335, -31326, 29037, 116622, 44196, 129345, 221854, 53807, -79521, 138680, 269108, 453295, 561829, 576766, 476348, 414943, 418305, 387699, 377992, 274998, 243396, 356639, 461305, 469378, 613941, 715398, 742160, 805142, 718882, 504473, 237476, 130018, 167588, 249002, 257434, 147153, 135926, 147723, 22654, 133176, 224287, 70953, 36782, -90809, 83545, 232766, 373240, 543727, 471801, 277572, 267205, 170356, 125254, 114024, 151918, 70564, -86023, -88066, 24486, 126172, 126420, 115535, 131247, -23884, -141961, -77982, 174081, 270764, 297852, 422560]
20227D22560P7011J2178j6074j26014j26363J2268j1453p7785N9732K54293Q1403
20216E61756J12140m59O248Q2589j09521m9419J4995k6198m7364q5031M0101P5933
20204E75770r0281o4734r1212L0314J36591m9723J74361J19751R3250K55360P2864
20193A162311j28028K993P8429R5285K01655J27654O9690R0028K42672M54897
20183B397586J38295k29072k34313j29634j40358J80615Q6389J85045K67368K85921
20173B807842K47892M16714P15800Q10393L31275k05410n05777l84535j01155
20164D133039L59163M51430N42018P12947P77777Q43687J440167J968923K193699
20155A3422850K016522J783419K237908K985334M580481P039780J1454363J8776123
$$ y = [422560, 499571, 511749, 495675, 369661, 243298, 255566, 244113, 166328, 226060, 480353, 561756, 673896, 673437, 679685, 762274, 652753, 603334, 618329, 592131, 544767, 459736, 499837, 575770, 485489, 420755, 329543, 359857, 496448, 446725, 621086, 740837, 834087, 1089447, 1162311, 1034283, 1037276, 1115705, 1210990, 1412645, 1540299, 1609989, 1700017, 1942689, 2397586, 2535881, 2306809, 2072496, 1942862, 1802504, 1983119, 2069508, 2254553, 2521921, 2807842, 3055734, 3472448, 4188248, 4998641, 5329916, 5124506, 4618729, 4234194, 4133039, 4492202, 4943632, 5485650, 6198597, 6976374, 7820061, 9260228, 11229151, 13422850, 15439372, 17222791, 19460699, 22446033, 27026514, 34066294, 45520657, 64296780]
20147F4296780L1907033N6159812R6925292J43159769J33216196J887349r8132563
20140D29419668j34269267j13436793o8050088l6913052k1381495j3464033q855685
20133C3049255n768000l794294k555281k278743k362019k132721j986718j659838
20125A0511641j321474r97933p96105n73291o96283m36699k47435r7468L54330
20116E699283L03212l88467o89725j010281p75996n61323j27157j95337l23090
20107A931119p8454j69639j34267k43478j39923O3848j6383J07649K43920m9011
20097A515381j46920k88684j44586j26385N6818m5618j59528j54279j32304L917
20087C77812J54588J48612R4925J27624r7566j07761j71313J73306L7563j58851
$$ y = [64296780, 96203813, 152363625, 249288917, 392448686, 525664882, 527552231, 429419668, 295150401, 181713608, 113663520, 76750468, 55368973, 41904940, 33049255, 27281255, 23486961, 20931680, 18652937, 16290918, 14158197, 12171479, 10511641, 9190167, 8192234, 7396129, 6822838, 6126555, 5689856, 5442421, 5344953, 5699283, 6002495, 5614028, 4924303, 3914022, 3138026, 2576703, 2449546, 2254209, 1931119, 1852665, 1683026, 1548759, 1305281, 1165358, 1229206, 1212823, 1320472, 1564392, 1515381, 1368461, 1079777, 935191, 808806, 865624, 820006, 660478, 506199, 373895, 377812, 532400, 681012, 775937, 903561, 805995, 698234, 526921, 700227, 737790, 578939]
20077E78939j68334j71209l4928P8077q8841j11442o5661J23852m5512k9894L9388
20066A04435l2734J42880J3135M5904L2936n3204q2432n1217K2080J06564j99495
20055D8852q709J21621P6614Q2684l9278L334o9897r7198j3029K29247L70811
20044G05052k4348j05747j42113j80083j09408M5745J58458n3886j15901N086
20034A82855M1041Q1440k6480j84029J37560N1328L9093o1821J0931O8044o8399
20023B71563j16780j0166K37143J58819K9604j14820k91839J0241j7685n9015
20013I7065Q5994l6421J10360J11818j30379j68994M0926Q6578J35542J35251
20003D67740o4995k8827k0809N036L9547J20064j31893k44131q3046k6754l0025
$$ y = [578939, 410605, 239396, 204468, 282545, 193704, 82262, 16601, 140453, 94941, 65047, 104435, 71701, 214581, 227716, 273620, 306556, 253352, 170920, 119703, 141783, 248347, 48852, 40143, 161764, 238378, 321062, 281784, 285118, 215221, 118023, 104994, 334241, 705052, 680704, 574957, 432844, 252761, 143353, 189098, 347556, 293670, 177769, 182855, 223896, 305336, 278856, 94827, 232387, 283715, 322808, 260987, 271918, 339962, 271563, 154783, 144617, 381760, 540579, 570183, 455363, 163524, 173765, 156080, 97065, 183059, 146638, 256998, 368816, 238437, 69443, 110369, 196947, 332489, 467740, 402745, 373918, 353109, 358145, 397692, 517756, 385863, 141732, 58686, 31932, 1907]
19992A907l5905j51741N0741J33469j1433j16643J4904J97872J47111j02533J04955
19981B32704m2872k20084j68656R3336K36075O1800l39968r4601j3658p8036P407
19970c26553J71118P6278L8371n2189m0342L0r0365m8623J43087J48533P7736
19959I7081L0108J09241p5873J6478K7642L9506l4945k3173j1596j61411j31558
19948a18500J07131J43241k4086j97926j8931J80866n132j24273m2017L493J37649
19937D1515M892P94K01135k4872j4866m8700K705R0053O3554m76n0793p2486q008
19924A84447m8089j64939J27235O4366M020L0597q9038j37498l9217Q8293J42441
19913A62618O7359l9095k08972M0651J01985k81852j16403o2930j66443L9765
$$ y = [1907, -33998, -185739, -134998, -1529, -12962, -129605, -114701, 83171, 230282, 127749, 232704, 189832, -30252, -198908, -105572, 130503, 192303, -147665, -242266, -255924, -333960, -326553, -155435, -79157, -40786, -92975, -133317, -133287, -223652, -272275, -129188, 19345, 97081, 127189, 236430, 160557, 177035, 204677, 244183, 209238, 186065, 174469, 13058, -118500, -11369, 131872, 107786, -90140, -109071, 71795, 66663, -57610, -99627, -96134, 41515, 46407, 47201, 248336, 223464, 208598, 159898, 162603, 252656, 316210, 315734, 264941, 192455, 184447, 136358, -28581, 98654, 163020, 167040, 197637, 108599, -28899, -68116, 20177, 162618, 229977, 190882, -18090, 22561, 124546, -157306, -273709, -336639, -503082, -463317]
19903d63317J15427K13793J37052M8391k6199l8860K2003p0203n6278k4182R9162
19892d3211j5362j19370l987j18398K9548Q6695p3678q5203K8199P3041L9035
19881b02691J18836O588k57154K8729J62557k7125j33572m5481l5692K29318Q5928
19870f9759J46154J82941J39823o0517o8095O6219q8153j23040k1513K04168q9766
19859B18462j83140J34432j31961q4566j22178N4495j9788J24034K33731j9259
19849B04262j03643K67k8261M9689R3678J53533J1098J7327N5842n4278r2947
19838C06567j842j05601k77895j8556K13249n0165J01561j3711j97213K5710N8388
19827D0492o8276l4939J31704K08812O4736j58461K3526k0260j53135l4447K25726
$$ y = [-463317, -347890, -134097, 2955, 51346, 25147, -13713, 8290, -61913, -118191, -142373, -43211, -58573, -177943, -181930, -300328, -270780, -184085, -257763, -342966, -314767, -241726, -202691, -83855, -77267, -334421, -305692, -143135, -170260, -303832, -349313, -385005, -155687, -69759, 76395, 259336, 399159, 338642, 270547, 336766, 248613, 125573, 104060, 308228, 218462, 35322, 169754, 37793, -46773, -168951, -114456, -134244, -10210, 223521, 204262, 100619, 100886, 72625, 122314, 215992, 369525, 380623, 397950, 453792, 399514, 306567, 304725, 199124, -78771, -97327, 115922, 65757, 167318, 153607, -43606, -17896, 40492, -27784, -62723, 68981, 277793, 342529, 184068, 207594, 187334, 34199, -248, 225478]
19816B25478J80881J41575j09723K4875P0336q9118r4315j19049L9354p331J4088
19805B77051P0318J79288N2280j30056j98738n9920K24601J99551q6023j38447
19795C89905J7215J0189J44218K86679J77552j40365o7007k001p9965r9005r6421
19784E40994J4289Q4141M6485r553p3730j0239k9001j5679m2546O0797L9524J4126
19772F19608Q3233J74798J85288J11650j16223o3627n1008j7778m9674j73601
19762G02666j74944j3115k8298L6002k582k56875m9922J54953l3301J47165N0438
19751E32187n5172q3880j14847J23588k7390l2735P372J01282J87557P408j97936
19740D47434l6239M0239j05900l1884O6244l2785q9920M2988K6676N1757j27432
$$ y = [225478, 406359, 547934, 438211, 463086, 533422, 444304, 349989, 230940, 270294, 262963, 277051, 347369, 526657, 578937, 448881, 250143, 190223, 414824, 614375, 528352, 389905, 407120, 417309, 561527, 848206, 1025758, 885393, 818386, 816385, 736420, 637415, 540994, 555283, 639424, 685909, 676356, 602626, 592387, 563386, 547707, 505161, 565958, 605482, 619608, 702841, 877639, 1062927, 1174577, 1058354, 994727, 943719, 925941, 876267, 702666, 527722, 514607, 486309, 522311, 519729, 262854, 212932, 367885, 334584, 481749, 532187, 477015, 393135, 278288, 401876, 374486, 341751, 349123, 450405, 637962, 645370, 447434, 411195, 451434, 345534, 313650, 379894, 347109, 257189, 300177, 326853, 378610, 251178]
19729B51178j56544m3755J14457K62908q4348j16443j4712J9045L7726j8792p9554
19718A71166M594n8873j14461J02759j3935q415K3666r5199O1999j07494o4491
19707i8684J65944r3286j3720P6193p2313n4871K222K4450J70229L1678j72242
19696c4400q0002l3978N7639J41104j7238J33325m7664l6483J02515M3985J42742
19685C71545k61567j12841K2914m4094k9447J53647o4977l4847N6107L2868o3322
19674B5986m4865q168j39731K7389l3196J00750J72793R1798r870q8046m9425
19663D5415r5030r2571P0133j465R4179r5526l7984K760M2846n4226m2732o758
19651a70959J07021J40031n6087J07381l7487J5989K27581R9868j32868j68606
$$ y = [251178, 94634, 50879, 165336, 428244, 343896, 227453, 212741, 231786, 269512, 250720, 171166, 175760, 116887, 2426, 105185, 91250, 82835, 106501, 11302, 73301, -34193, -98684, 67260, -26026, -39746, 36447, -35866, -90737, -88515, -64065, 106164, 137842, -34400, -114402, -148380, -90741, 50363, 33125, 166450, 118786, 82303, 184818, 228803, 371545, 109978, -2863, 20051, -24043, -53490, 100157, 35180, 333, 56440, 89308, 25986, -18879, -27047, -166778, -139389, -172585, -71835, 100958, 192756, 182886, 94840, 45415, -49615, -142186, -72053, -73518, 20661, -74865, -112849, -110089, -67243, -121469, -164201, -170959, -63938, 76093, 20006, 127387, 89900, 105889, 333470, 433338, 300470, 131864]
19641A31864j67847j46475j07204Q9029J65910L8499M6198J44896P0575o5704
19631A99741o9909o3659l9029p4053O8927n0942Q2202J27404j01270O723J25088
19620B11223o0189r9678K9572O7096J27132j30861q0799j04943o4634M1792M187
19609f0102N8428j1258N7730Q046M8910j35638P99K2284L4977J3291q064j252
19597B8151n2371j7627q388Q4405m8788m6408j41819n2502o3814K9939K16802
19586g2420N7296n1684l0285J43034k4300L4302n0816Q1621L5806n4520R4710
19575A62744j30438k20668j31445o5009P8356K36672L3578Q225j19648j948K35422
19564H5841o8079j22930o2391J50317N6839k995j97395n8728l2639K63271J55732
$$ y = [131864, -35983, -182458, -289662, -200633, -34723, 3776, 49974, 194870, 265445, 199741, 129832, 66173, 27144, -46909, 22018, -28924, 53278, 180682, 79412, 86135, 211223, 151034, 51356, 80928, 148024, 275156, 144295, 63496, -41447, -106081, -64289, -60102, -1674, -12932, 44798, 52844, 101754, -33884, -33085, -10801, 24176, 37467, 29403, 28151, -24220, -41847, -50235, 34170, -14618, -61026, -202845, -255347, -319161, -289222, -72420, -15124, -66808, -97093, 45941, 21641, 55943, 5127, 86748, 122554, 68034, 162744, 32306, -188362, -319807, -384816, -306460, -69788, -36210, -27985, -147633, -149581, 85841, 17762, -105168, -167559, -17242, 39597, 36602, -160793, -219521, -252160, 11111, 166843]
19553A66843J69448K7034o7966r0686n9343J87311M738j34575P5081m9550k0618
19542B07717M0693O3349J9571j72953n5859j34677M6181L1709K19825J0637j04098
19531A72095l8830K4293R7220k9480L7581K4748j17389l2489r213j46936r9091
19520a17491O1905J36943J62978q8907j0869N4534Q1904M9680K03J0070j41299
19509A99651r681N2431P7866m7656j36932K6470J1339Q2355l8293L7322m165L3227
19497B83934K15156j9713k19044j65078J08015p0834q4291j88590J70619N9829
19487I0003R3026l021J46641n7886q8024o5559j193J6552o2664J03475J16637
19476B87987O5511l603L8943j65373j07093j6908K0085J81601Q8753L4493J8870
$$ y = [166843, 336291, 363325, 295359, 204673, 145330, 332641, 337379, 202804, 277885, 228335, 207717, 248410, 311759, 331330, 158377, 102518, -32159, 14022, 45731, 265556, 276193, 172095, 133265, 157558, 254778, 225298, 262879, 287627, 170238, 137749, 128536, -18400, -117491, -55586, 81357, 244335, 155428, 144559, 199093, 280997, 330677, 330880, 340950, 199651, 189970, 242401, 320267, 272611, 135679, 162149, 173488, 255843, 217550, 254872, 250707, 283934, 499090, 479377, 260333, 95255, 203270, 132436, 48145, -140445, 30174, 90003, 183029, 180008, 326649, 268763, 180739, 115180, 113987, 130539, 67875, 171350, 287987, 353498, 349895, 388838, 223465, 116372, 99464, 119549, 301150, 389903, 424396, 443266]
19465D43266J37202k97k31132q7979o6867K7832K19086p356r2901P0515J10026
19454E21395q1669j94121k6920j2449m4227L6862p9850j314o4456Q2084J05074
19443B40409P4195n1481l8868J1722l7930J08887R7161j10792j24699q0403L8037
19432A26238K0390R5706J7166J50476q0110k9877J19581M4371J55495P4867j17669
19421E76634o6115M056N083Q0110j57493j61449j65797J6650K11444K59979J22853
19410G25955j96548j49106k6967j02591K07302J24291Q970n7416L4968N5581J4077
19399F38516j4738K9819J51610O5567K01650R6315K74502M68131K42152k764j49336
19388B001424j22427k53029l12281k63875j26549k9019j39637r5352l3423j64940
$$ y = [443266, 580468, 580171, 349039, 261060, 194193, 222025, 441111, 433755, 340854, 411369, 521395, 439726, 245605, 218685, 206236, 162009, 198871, 119021, 117707, 53251, 135335, 240409, 314604, 263123, 224255, 235977, 198047, 306934, 404095, 293303, 168604, 88201, 126238, 146628, 242334, 259500, 409976, 329866, 299989, 419570, 463941, 619436, 694303, 576634, 510519, 514575, 519658, 599768, 442275, 280826, 115029, 131679, 343123, 603102, 725955, 529407, 380301, 353334, 250743, 458045, 582336, 591306, 533890, 568858, 624439, 638516, 623778, 653597, 805207, 870774, 1072424, 1168739, 1443241, 1911372, 2153524, 2150760, 2001424, 1878997, 1625968, 1313687, 1049812, 923263, 894244, 754607, 659255, 625832, 460892]
19378D60892j55728R2425K02552K57880R1072k63398k17555j09028Q2208J01327
19368E42647O1875P2355j4195L4551J03880J86685J17935L9711j09079n8175Q5827
19357A064017m5513n1891Q2034N0237J20329N3756n8051O6286N6951M0018J59258
19346A537431K27723K78564J88181J72407J06136J77177K1164j4716Q2722J09544
19336B886333J19958L67993M43460M00902K78402M46009O00185J057306J037302
19327G637850J83623m98844j009426q15003n39007p2754J99864L07635K79069
19318E673007M36250N74124Q68510J354945K067208K993511L388417K423527J319973
19309B1099472J190081R93451O53421M43743J345523K762217M215397N968300
$$ y = [460892, 305164, 397589, 600141, 858021, 949093, 685695, 468140, 359112, 441320, 542647, 604522, 676877, 662682, 697233, 801113, 987798, 1105733, 1145444, 1036365, 978190, 1064017, 1018504, 966613, 1048647, 1098884, 1219213, 1272969, 1214918, 1281204, 1338155, 1378173, 1537431, 1765154, 2043718, 2231899, 2404306, 2510442, 2687619, 2708783, 2694067, 2776789, 2886333, 3006291, 3374284, 3817744, 4218646, 4497048, 4943057, 5543242, 6600548, 7637850, 7821473, 7322629, 6313203, 5498200, 4959193, 4886439, 5086303, 5393938, 5673007, 6109257, 6683381, 7551891, 8906836, 10974044, 13967555, 17355972, 19779499, 21099472, 22289553, 23283004, 23936425, 24380168, 25725691, 28487908, 32703305, 38671605]
19301C8671605Q894175J3067694J6952327K0603441K3552946J6992054j589859
19294A37144383j5154920j8029248j1234544j323473J509130m768817r971132
19287G8171379j0494956o369630j75528N479944Q448187O255374M63261k613378
19279G9164653j149867M737907J1630918J3571235O908222l728346q773503n430470
19271I6930749M474611J6086688K0979760J3137332L639334o204348j8651601
19264A30392525k4583618k3787708j8306467j1077171n148486p59695K066945
19257D8796325K588603N67530j191314n09042K497376P291622J4273291K2849211
19249I7163602L0938419L2595422K1106158P73941j0844341j7855258k4725584
$$ y = [38671605, 47565780, 60633474, 77585801, 98189242, 121742188, 138734242, 137144383, 121989463, 103960215, 92725671, 91402198, 92911328, 88142511, 78171379, 67676423, 61306793, 61131265, 66611209, 75059396, 81314770, 81778031, 79164653, 78014786, 82752693, 94383611, 107954846, 114863068, 111134722, 102361219, 96930749, 101405360, 117492048, 138471808, 151609140, 155248474, 149044126, 130392525, 105808907, 82021199, 63714732, 52637561, 47489075, 46729380, 48796325, 51384928, 51952458, 50761144, 50252102, 52749478, 60041100, 74314391, 97163602, 128102021, 160697443, 181803601, 182577542, 171733201, 153877943, 129152359]
19242A29152359k5092960k1390275j4020425n311662L221311J2492139K3238431
19235A02288918L2254801K8179753N817120j5366985k7008122k7982671k2893471
19228G5289343j6396695j0725503p311597o416814o131829n093700l916019k623502
19220A6673684j552997j001768o45124n52880j74088M87575J451321K011204J875847
19211A8572774L92452j109888j832247j557472m32820k6839q90584j725399j992309
19202I397668j672983r66201l11684J97706K86199K8696l54323q84664r85494
19193D734920p06335m13505m7352J06369J80739j99060m72309m39283l60079l97134
19183A986971j55508l4569k73721j32232j887l2152M8877l3391m2561k7668r4350
$$ y = [129152359, 104059399, 82669124, 68648699, 63337037, 66558348, 79050487, 102288918, 134543719, 162723472, 168540592, 153173607, 126165485, 98182814, 75289343, 58892648, 48167145, 40855548, 34438734, 28306905, 23213205, 19297186, 16673684, 15120687, 14118919, 13473795, 12920915, 12746827, 13234402, 14685723, 16696927, 18572774, 18965226, 17855338, 16023091, 14465619, 14032799, 14005960, 13115376, 11389977, 9397668, 7724685, 6758484, 6446800, 6644506, 6930705, 6959401, 6605078, 5720414, 4734920, 4028585, 3615080, 3567728, 3674097, 3854836, 3655776, 3183467, 2744184, 2384105, 1986971, 1831463, 1796894, 1523173, 1390941, 1389054, 1356902, 1405779, 1372388, 1329827, 1302159, 1207809]
19172A207809R6368q5277k27886j50329O1554J33270J32358j5491K8687k65267
19162I15796k61960j09674L6958Q3866J1248M2126r029M2109L7947J2667J18342
19151I20396J1022j47852j19799m3907M4609q8915p1200q7123K8032N902j1336
19140D39829J5885J2919Q9715j30856j03026J96204J85402R1967j32271j78105
19130D87663j11632j56837K5643J59280l8156l1974k01670R8064J30037N9281
19120D19699O2287j33416q26J68356j02866R8343M7606j28304j4999p9516K9111
19109C65475R8143P6714p511J3507O7723L6329J01938j7717n3140O0558l3119
19098G08900r8525j03594j38482j39373J19570L64116J21614k9168N7825J2586
$$ y = [1207809, 1304177, 1218900, 991014, 840685, 902239, 1035509, 1167867, 1152376, 1181063, 915796, 653836, 544162, 581120, 664986, 676234, 718360, 709331, 751440, 789387, 802054, 920396, 931418, 783566, 663767, 619860, 664469, 575554, 504354, 417231, 445263, 451165, 439829, 455714, 468633, 558348, 427492, 324466, 520670, 706072, 798039, 665768, 487663, 376031, 219194, 244837, 404117, 365961, 333987, 132317, 230381, 360418, 419699, 481986, 348570, 347744, 516100, 413234, 511577, 559183, 430879, 415880, 336364, 365475, 463618, 540332, 532821, 546328, 614051, 650380, 752318, 734601, 681461, 742019, 708900, 610375, 506781, 368299, 228926, 348496, 712612, 834226, 805058, 862883, 875469]
19088H75469Q1434L8731k63055j42541j23328N6642R7105j85470j86419K8363
19078B76931r292R1665J79896l4583L1798R8277N0526k5695K4427j71939M222
19067E16233J48804M5699k1707J87533K46355r0504P4431l7692k19389K5485P8304
19056I53552K962r6716j49385n288l0950R4917P3218k3566j0393K0307R6641r7134
19044H28165j14934j05267J09818N159j01519r2072J39739L3462l5485J37706
19034H04772J4641L3125j55j00098n68J6694n149K02740J13778j04076r6541J23196
19022A002359l7095q9605j83955k2662j06920q8839Q2175O2983l7330J06271m3353
19011F44029J3349J7586l09738j61041K17427J78300K08713m5777l06980n3100
$$ y = [875469, 956903, 995634, 732579, 590038, 466710, 523352, 620457, 434987, 248568, 276931, 267639, 359304, 539200, 504617, 536415, 634692, 685218, 659523, 683950, 512011, 516233, 665037, 710736, 689029, 876562, 1122917, 1032413, 1106844, 1069152, 849763, 875248, 953552, 956514, 859798, 710413, 705125, 674175, 769092, 842310, 818744, 808351, 828658, 925299, 828165, 713231, 607964, 717782, 722941, 621422, 529350, 669089, 702551, 667066, 804772, 819413, 852538, 852383, 752285, 751717, 768411, 763262, 966002, 1079780, 975704, 879163, 1002359, 965264, 875659, 691704, 669042, 562122, 473283, 555458, 618441, 581111, 687382, 644029, 657378, 674964, 365226, 204185, 421612, 599912, 808625, 762848, 455868, 402768]
19001D02768Q0273J19914M199k6555q1423J20107R4865m6593m0417j51421j8748
18990D56969q5450O7623k0441j04835J7914J52925J04146j57405j87071Q248q954
18979B43669K4425K10420p3838j97542J01378J094o3531J34301j31689p9604K4046
18968A93129M7965k21328p4281J16284J43313o6940K2501k25799j25312j9407
18958b09875k4984r557J09288J55047q6029J2407J12069l8632o413J15510J69733
18947B98564L9351P9154r4180m9083n9824j57808j09612J29705p595p8397O3995
18936E4270m5691K0146K01105r685j4270n9579j23454k5088O1784j25128J25837
18925F0247K687m0179k7144K6640P8407J28885p9439O2344j0215p8449p3068q6266
$$ y = [402768, 483041, 602955, 607154, 580599, 499176, 619283, 714148, 667555, 627138, 475717, 456969, 371519, 439142, 418701, 313866, 331780, 484705, 588851, 431446, 244375, 252623, 243669, 268094, 478514, 404676, 207134, 308512, 309606, 246075, 380376, 248687, 169083, 193129, 241094, 19766, -54515, 61769, 205082, 138142, 160643, -65156, -190468, -209875, -234859, -244416, -135128, 19919, -66110, -53703, 58366, 19734, 13321, 128831, 298564, 337915, 417069, 322889, 273806, 213982, 56174, -53438, 76267, 68672, -9725, 54270, 8579, 28725, 229830, 220145, 205875, 146296, 22842, -2246, 59538, -65590, 60247, 62934, 22755, -4389, 22251, 100658, 229543, 150104, 212448, 202233, 123784, 50716, -35550]
18913c5550j33495J43139Q8556q0596J8893j43651o5929q3690Q0837j00207k2029
18902c33722K21367J64264O2478j55451P2970J65131J113k50502j03033L5787
18892a19598Q5228O6809j28114J5176O9225k0771J6534j0590m6746O1346q0106
18881i1607J7310L98902k4474j14152R2370J80Q0478j4382J1191L838j2788K4571
18869C71437r8451j39677j78396q3684J8579K26355P3407k07272M9016J36306
18859A67620j3779J03350K6356k10721j65238J5275J24407N0452r47J81130K3940
18848C01845k13818m2317m3789l1362r8810R226J06262K16505J08143K12622m871
18837E19636q8472m4036j44005o4556j45808j40494k9315M1811L2684j05145r8525
$$ y = [-35550, -169045, -25906, 62650, -17946, 947, -142704, -208633, -292323, -211486, -311693, -333722, -112355, 51909, 114387, -41064, 31906, 197037, 198150, -52352, -155385, -119598, -34370, 32439, -95675, -80499, -11274, -32045, -15511, -26101, -72847, -11501, -91607, -74297, 324605, 300131, 185979, 278349, 278529, 359007, 344625, 355816, 359654, 346866, 371437, 272986, 133309, -45087, -128771, -110192, 116163, 189570, -17702, 31314, 167620, 153841, 257191, 283547, 72826, -92412, -77137, 47270, 97722, 96775, 277905, 301845, 88027, 45710, 1921, -29441, -128251, -119025, -12763, 203742, 311885, 524507, 519636, 431164, 387128, 243123, 178567, 32759, -107735, -137050, -95239, -62555, -167700, -266225]
18826b66225n4961O4225K08504Q6317j54968J13538K00307N887j41816N1584j04774
18815G618l7891L2240L8172l8256L1392j6160K26219R0998N8317L2031j42088
18804B82592j15817j3627L2531k1521J84711q5311k39786j6501M1279j0299n4613
18793a6362L4057k1957J78182K406N0633K59891q1182N9667K28477j04432N2991
18782F42371r1886K20k5334k3778o3248L391N0011J51557P6678Q6019J75053l1927
18770I49127j46297k1582O3958j7359k24180N3128J41895j55026o6492n0197p3214
18759D53761n0006k36115j05820L52444J68765j03865M2464O6897j96519P32P0090
18748D62828l6268J71599K19709J4153j20009j97104j03852K54962j8978j57736
$$ y = [-266225, -321186, -256961, -48457, 37860, -117108, -3570, 196737, 202624, 60808, 112392, 7618, -30273, 1967, 40139, 1883, 33275, 17115, 243334, 334332, 392649, 424680, 282592, 166775, 153148, 185679, 164158, 348869, 263558, 23772, 7271, 48550, 38251, -16362, 17695, -4262, 173920, 176326, 226959, 486850, 405668, 465335, 693812, 589380, 642371, 550485, 550705, 525371, 501593, 438345, 441736, 491747, 643304, 719982, 806001, 981054, 949127, 802830, 781248, 845206, 827847, 603667, 656795, 798690, 643664, 577172, 526975, 453761, 403755, 167640, 61820, 414264, 583029, 479164, 521628, 588525, 392006, 392738, 462828, 426560, 598159, 817868, 832021, 712012, 514908, 411056, 666018, 647040, 489304]
18738D89304j50840K5775L41821K25946K1959j3373J43555n3059j52303k06472
18728F72313r5820J98027J96064J90126J26623Q5052r0208k84610j42409m8529
18718H06629p3271j73221o4074L9579J0270j24070L4365J88038J99324P186J15675
18707I66430j19932m1118p1504j8820N4139M0310j69398K2192k3163j75552j65849
18696B97735j60159n9363P8516Q6307P8261k6296L783M5225R716P0817P545M3844
18684D75931M1714m9697k4270K308P5590l6733N533L9037N7597J8957J3821J31582
18672G51370M1060q6483Q6440M2453r9709j52041J35516J8856l1308j46915l1221
18661E28018J04965J28172L7704J31003n09j40374j7157N6518J58375K66619n0170
$$ y = [489304, 338464, 364239, 706060, 932006, 953965, 940592, 1084147, 1031088, 878785, 672313, 576493, 774520, 970584, 1160710, 1287333, 1372385, 1282177, 997567, 855158, 806629, 733358, 560137, 496063, 535642, 545912, 421842, 456207, 644245, 843569, 850755, 966430, 846498, 805380, 733876, 715056, 769195, 809505, 640107, 662299, 639136, 463584, 297735, 137576, 78213, 156729, 243036, 321297, 295001, 298784, 344009, 353725, 424542, 432087, 475931, 517645, 467948, 443678, 445986, 521576, 484843, 490376, 529413, 587010, 605967, 619788, 751370, 792430, 705947, 792387, 834840, 735131, 583090, 718606, 737462, 706154, 559239, 528018, 632983, 761155, 798859, 929862, 929353, 788979, 771822, 828340, 986715, 1253334, 1203164]
18650A203164o6287k09873j30859l2846j29792m4876Q5645m7746J01092J56794
18640H84416O4351J68535K51071P0224k3353N3730N243j93822K7157j1196J59127
18629A455483K49998K92573L58412N04075M27083K91201K02201K29209L77950
18620D388185O51409J162462J734821K647213K619989P82590p68088j315171p37095
18611A1166315K60612P93272p9296q91123j158255l19188N46247Q69205j63808
18602A1023981j173766j529310j520066p94362l56953k15527N8825K90940N27094
18593F310856N18583O16313Q62235J338603K148829K968680L960157M227791L297818
18584B6249865M321839P290933J0529696J0418715K232426o516260r736588q636182
$$ y = [1203164, 1136877, 927004, 796145, 763299, 633507, 588631, 674276, 626530, 727622, 884416, 948767, 1117302, 1368373, 1438597, 1415244, 1468974, 1474217, 1280395, 1307552, 1296356, 1455483, 1705481, 1998054, 2356466, 2860541, 3287624, 3578825, 3781026, 4010235, 4388185, 5039594, 6202056, 7936877, 10584090, 13204079, 13986669, 13218581, 11903410, 11166315, 11426927, 12220199, 12140903, 11249780, 10091525, 9772337, 10318584, 11187789, 11023981, 9850215, 8320905, 6800839, 6006477, 5649524, 5433997, 5492822, 5783762, 6310856, 6829439, 7445752, 8307987, 9646590, 11795419, 14764099, 18724256, 22952047, 26249865, 30571704, 37862637, 48392333, 58811048, 61043474, 54527214, 44790626, 36154444]
18576C6154444n334634k361983K85685K716088M609356M339226J847691O84570
18568D2940443J197251J542787L12807l70159O60283L896467Q787245J3963309
18560G2930433J9380158K6845418L0898969K5150977J6694280O857541q759070
18553A89998706k0218123k0622129j1976215p08107L928131L327146O914338J4844707
18545A65488454K0735155J4948249j320805k0977696l0617445k8703079k0614933
18538I8937900j2555617q668349o322762l837080m73149M289256J0377257J8146461
18530I9893917K7681619L7275237M2439982L8325012L1036841K6145490J5854045
18523C18652143k451071k3719873m3989933m7765321l8600189k2618566n993137
$$ y = [36154444, 30819810, 28457827, 28743512, 31459600, 36068956, 40408182, 42255873, 42940443, 44137694, 45680481, 45993288, 45623129, 46283412, 50179879, 58967124, 72930433, 92310591, 119156009, 150054978, 175205955, 191900235, 198757776, 189998706, 169780583, 149158454, 137182239, 136474132, 140402263, 143729409, 150643747, 165488454, 186223609, 201171858, 199851053, 178873357, 148255912, 119552833, 98937900, 86382283, 77713934, 71391172, 67554092, 67080943, 71370199, 81747456, 99893917, 127575536, 164850773, 207290755, 245615767, 276652608, 302798098, 318652143, 316201072, 292481199, 248491266, 200725945, 162125756, 139507190, 133514053]
18516A33514053N891809J2920820K5094033M5146136O3875448N0450129o674599
18509C30217829m6532340n6673872m3443827k9458511k6842863k5772502k2810183
18502G8683731j6527535j0347597n456219j854729J018083K198512o09257m213858
18494D2891131n866740n497478k965574m39945J870412K753370J960531O27909
18486C5333616L31659p00245l066672m708656n395925m578927l523004k568939
18478A1122907j787244j232401r69344o21983l82591l46699n92239l70712k14474
18469D605220k2736j83695k53602r9213K99210N75884Q49471R48193R32468J38915
18459G790115q16523j452005j208258p41676n75988k67397R4619Q4338p553K56613
$$ y = [133514053, 139405862, 152326682, 177420715, 222566851, 286442299, 336892428, 330217829, 283685489, 227011617, 183567790, 154109279, 127266416, 101493914, 78683731, 62156196, 51808599, 46352380, 44497651, 45515734, 47714246, 47104989, 42891131, 37024391, 31526913, 28561339, 28121394, 29991806, 32745176, 34705707, 35333616, 35665275, 34965030, 31898358, 27189702, 21793777, 17214850, 13691846, 11122907, 9335663, 8103262, 7133918, 6511935, 6129344, 5782645, 5190406, 4819694, 4605220, 4582484, 4398789, 4145187, 4045974, 4345184, 4921068, 5770539, 6718732, 7651200, 7790115, 6973592, 5521587, 4313329, 3571653, 2995665, 2728268, 2822887, 2907225, 2899672, 3156285]
18449C156285M19613M37058N5415l69666n36858m73171k64253p1188j28326j63125
18439B061784j15002o2058k4225l825k06568l30459j22701K46509k0551O4405
18429A487309k19571j71071l0057o985M3824J7730q3642o8815k9427J15783J60040
18418A215118j10461k84476q5163M4749R1404j01591k0075n1669J5197J3876j22134
18407F04775M2089l0298q4265Q930j7224n3165M8962Q7451J99439M0214j33219
18396G13689k57863K2027P7708n6399j10069m1755R475J04161R0068o4698J57182
18385F43526J69242n9859j15088n2641M4888J28017P6743l8489P6804Q3751K9406
18374I86300j67119l7456r8686M7701r5595j85293k20080n7712J97314J48138
$$ y = [3156285, 3575898, 4012956, 4068371, 3698705, 3161847, 2688676, 2424423, 2353235, 2224909, 2061784, 1946782, 1884724, 1860499, 1856674, 1650106, 1319647, 1196946, 1443455, 1422904, 1487309, 1267738, 1096667, 1066610, 1059625, 1103449, 1121179, 1037537, 968722, 939295, 1055078, 1215118, 1104657, 820181, 735018, 779767, 871171, 769580, 749505, 697836, 713033, 726909, 604775, 646864, 616566, 532301, 541231, 524007, 470842, 519804, 607255, 806694, 846908, 713689, 455826, 477853, 555561, 499162, 389093, 347338, 356813, 460974, 551042, 486344, 643526, 812768, 752909, 637821, 585180, 630068, 758085, 834828, 796339, 873143, 956894, 986300, 819181, 781725, 683039, 730740, 635145, 449852, 229772, 172060, 369374, 517512]
18364E17512m6171P9776p3320q128k03327L6218j3689j65959j25303J39084K7953
18353A64646J9237L867J06231O897n6900j01325K43852J34069j36815k5121j88513
18342A70125j5692j07815N6435p138p1809J57939P5437n9225Q929q3212p8281
18331D5693N5752K163j4137k6818L6519j8605Q802j0774J09007J98968J31175
18320E17745m9602j09964q1606J4244M1432k5935p5750O0910J37498N4683j8236
18309D65419j96373k69042n2072P3320J23777L7914o1241l8456K13324K23111
18299E19681J145j67362j10633j96663j0099L8372N9758J3543O9465K5301m8262
18288A94246J0925j53741j01762j2733J07699Q4343j14271m7913P2672m8175j15617
$$ y = [517512, 471341, 551117, 477797, 469669, 266342, 302560, 288871, 122912, -2391, 136693, 164646, 183883, 187750, 293981, 300878, 243978, 142653, 386505, 520574, 383759, 358638, 170125, 154433, 46618, 103053, 95915, 24106, 182045, 257482, 198257, 207186, 123974, 45693, 101445, 103608, 89471, 62653, 99172, 80567, 89369, 78595, 187602, 386570, 517745, 468143, 358179, 276573, 290817, 332249, 306314, 230564, 291474, 428972, 483655, 465419, 269046, 4, -52068, 21252, 145029, 182943, 121702, 83246, 296570, 519681, 520826, 353464, 242831, 46168, 36069, 74441, 134199, 147742, 217207, 242508, 194246, 205171, 51430, -50332, -63065, 44634, 128977, 14706, -33207, 39465, -8710, -124327]
18277a24327K5711Q7870k3644j715j40516j946J32901K02717O4772O8556K6497
18266C16876j01374j37742o0798k4923J08927m2100l8557q2685M2412n5779p0742
18255a46485l4292j1551J61982J02916j8274M441q7708r6233N0212J04042J28395
18244A57445J42152k0120r8555p4353k6462J11803R6183k56N0928j9181q0898
18233B38686q6712L6780k1611q6489O7714p429K26773N8567K9962r7249j28523
18222B30469k7678p5216o2165J4225J19125k08332q4519j09202K4033J57304L9657
18211A7701J66654J97773n0362k32574j22828P9959J55729q0552m9807j63404
18201h1711j31956j70387R0649R9166L9886J50706J92921j2061r6977j0667j45585
$$ y = [-124327, -98616, -10746, -34390, -36105, -176621, -178567, -45666, 157051, 221823, 290379, 316876, 215502, 77760, 16962, -7961, 100966, 58866, 20309, -62376, -19964, -75743, -146485, -180777, -192328, -30346, 72570, 54296, 58737, -28971, -125204, -74992, 29050, 157445, 299597, 279477, 180922, 106569, 80107, 191910, 288093, 287837, 338765, 319584, 238686, 151974, 188754, 167143, 80654, 148368, 140939, 367712, 426279, 456241, 358992, 230469, 202791, 127575, 65410, 79635, 198760, -9572, -94091, -203293, -179260, -21956, 17701, 184355, 382128, 331766, 99192, -23636, 56323, 212052, 131500, 81693, -81711, -213667, -384054, -293405, -194239, -154353, -3647, 189274, 177213, 80236, 69569, -76016]
18190g6016m544l3580l0324K08036K07963R6417j38502N0731J9278l4072j58094
18179A07293j66139n3832n1280J35743J70449j15894j53274p5611J01980L11694
18169B11129J1343j68893j08383q2569j26373J58999J78646J03949k794Q7194
18159B62248J5352j6508P4671j28351p7059j8144L8703j53891o6726M0293R6199
18148F6787J17183l8336l3167P0043j20822k34845r1066N4767P3758o9629K0402
18137a84925O5595J16130L0508j451k7217k940J1834P1491j35241r5098R1895
18126e9419R1843p2215o8667Q1788J10182m0463Q129N798O7043j21742r9509J70798
18114G3566J25947P5940j04908j91151m8423L16397N5148j69106j2971O989l9534
$$ y = [-76016, -80560, -114140, -144464, 63572, 271535, 367952, 229450, 280181, 299459, 265387, 107293, -58846, -112678, -163958, -28215, 142234, 26340, -126934, -202545, -100565, 211129, 222472, 53579, -54804, -137373, -263746, -104747, 73899, 177848, 175054, 262248, 277600, 261092, 335763, 207412, 130353, 112209, 150912, -2979, -69705, -29412, 66787, 183970, 145634, 112467, 182510, 61688, -173157, -264223, -209456, -135698, -205327, -184925, -119330, -3200, 27308, 25857, -1360, -4300, 7534, 79025, -56216, -151314, -59419, 32424, -39791, -108458, -26670, 83512, 43049, 51178, 56976, 124019, 2277, -97232, 73566, 199513, 275453, 170545, -20606, -69029, 247368, 302516, 133410, 120439, 127428, 87894]
18103H7894P620l9054p5595J5876P3869l417Q8358k9429Q2228J16403M0330q4966
18091B80117k5572M8529k0101m5614k0840K7623o4388j03807J94643R5885n1741
18080C14734K8335P2842j28694j66898j04292O4512K27466L4863J76861J6702
18070E36431k53063m11907k26986J99089K54345K00093J20059q7203K8505P2850
18060D32213J04822k2640j06781N6266J05268l5658M1027j55903J3611J2703N3578
18049D98506Q6394J3345O0567J19332k4885k15178k46665m8304p3k12668J26966
18038A57337K29215K50325O9790m1772k9043k2542Q1929k3762o9371J62562j60862
18027F03806J5749n8145J25318k38041k11717l7759J9796J3193R2436q6810Q922
$$ y = [87894, 95514, 56460, -19135, -3259, 70610, 67193, 155551, 126122, 208350, 324753, 365083, 280117, 254545, 303074, 282973, 237359, 216519, 244142, 179754, 75947, 270590, 366475, 314734, 343069, 415911, 287217, 120319, 16027, 80539, 308005, 342868, 519729, 536431, 283368, -128539, -355525, -156436, 97909, 298002, 418061, 330858, 359363, 432213, 537035, 514395, 407614, 463880, 569148, 533490, 574517, 418614, 432225, 444928, 498506, 584900, 598245, 658812, 778144, 753259, 538081, 291416, 243112, 243039, 30371, 157337, 386552, 636877, 706667, 664895, 635852, 613310, 695239, 671477, 602106, 764668, 603806, 619555, 561410, 686728, 448687, 236970, 199211, 219007, 232200, 324636, 237826, 246748]
18016B46748J267o862Q9601Q5365O8218Q7265J36256n1210m4897P8964k17911
18005D72804j7701J2014J38854M7957m9214O4223J66877J4915J8120L3072k1774
17994H80147o8216l4551L9792n3622p1378p025j73794r6258l3823L1672j6382
17983C96562R1813j2197n5691o5934j00805r7165k3131K2688Q8533j88157j23928
17972f7412K36020L36798K35181o6733k23020j60570q8746k51695p5114J18130
17962g161J80019J73572j09281r0959O1002n214p4614m4133O4052J96527Q828
17951C52638M5116r221j65943J03844O113m816l3262j30762j99766J9791j4134
17940c0402J53560L2889O0470j30079k44686o3030J40870Q4008J66746p8022p8001
$$ y = [246748, 248015, 241153, 330754, 416119, 484337, 571602, 707858, 656648, 611751, 690715, 472804, 455103, 467117, 605971, 653928, 604714, 668937, 835814, 850729, 868849, 901921, 880147, 811931, 777380, 817172, 763550, 692172, 685147, 511353, 415095, 381272, 412944, 396562, 488375, 476178, 420487, 354553, 253748, 156583, 133452, 156140, 244673, 56516, -67412, 168608, 505406, 740587, 673854, 450834, 290264, 201518, -50177, -125291, -7161, 172858, 346430, 237149, 146190, 207192, 201978, 127364, 83231, 147283, 343810, 352638, 397754, 388533, 222590, 326434, 332547, 327731, 294469, 163707, -36059, -16268, -30402, 123158, 156047, 216517, 86438, -158248, -221278, -80408, 3600, 170346, 92324, 14323]
17929A4323P7657l0134k41566M0462J9402K12847J02736j96968m3682r7972m0898
17918a83793L5721n8303j6589Q8896J2044o9025J19455M3558j2017O9776K2539
17907E2262n9367l6521j60496j9047J72000j25035j97704J38424J58499K29057
17897A52072R6398r9377k86159j30773L5632J39620j0645J7268o6432q25J4724
17886a38497j63486J14071K6396J8779Q9451N8127o9083j76774M1100K22064m5863
17875b3715k11525j7046J10291L9321J28036K25227j7031k678q467n1166L6916
17864B08163l1678j9497n1264K7850J5201p4553j16230L244o6831k01436L4397
17853b72634J08070M2542l0388J8321Q0163N9389K2381j25797J10329Q7355k3302
$$ y = [14323, 91980, 61846, -179720, -139258, -119856, 92991, 195727, -1241, -44923, -142895, -183793, -148072, -206375, -222964, -134068, -122024, -191049, -71594, -28036, -40053, 29723, 52262, -7105, -43626, -204122, -223169, -51169, -176204, -373908, -235484, -76985, 152072, 248470, 149093, -137066, -267839, -232207, -92587, -103232, -85964, -152396, -153221, -138497, -301983, -187912, -161516, -142737, -53286, 4841, -64242, -241016, -199916, 22148, -23715, -235240, -252286, -141995, -102674, 25362, 250589, 233558, 230880, 222413, 171247, 208163, 176485, 156988, 105724, 133574, 148775, 74222, -42008, -38764, -105595, -307031, -272634, -164564, -122022, -152410, -134089, -53926, 5463, 27844, -97953, 12376, 99731, 76429]
17842G6429N6357j46487m7464J17196J37944j34718r9419l9878k6732n2652o0106
17831b19530R6867k6597J5907k36080m2867J06791J64329k6460N2019k20175J1634
17820c24162K37404J28130P918o6726o7288J51792j35647P317J29324J2600L762
17809H4424L0159k7804k60980K4866J33704k24558k63309J89191L32789J48202
17799A66684r6339k26120K200J76618Q7325k08882k31481j28198m6751N3153K27710
17788b24081L5362J02542J06134n029j00388j47991j5676r4659q0674J43192L58758
17777G7490O2897j60339o0657J5031R6497l8847j04008j24411Q0999k5591p3003
17766b53942l5144k0023O1274J12185K1727m0660j80638p3569J94551J99282K5169
$$ y = [76429, 132786, -13701, -61165, 56031, 193975, 59257, -40162, -80040, -106772, -159424, -219530, -122663, -149260, -133353, -369433, -412300, -305509, -141180, -167640, -115621, -335796, -324162, -86758, 41372, 49290, -17436, -84724, 67068, -68579, -61262, 68062, 80662, 84424, 114583, 86779, -174201, -149335, -15631, -240189, -503498, -314307, 18482, 166684, 70345, -155775, -153575, 23043, 110368, -98514, -329995, -458193, -504944, -451791, -224081, -188719, -86177, 19957, 14928, -85460, -233451, -249127, -343786, -424460, -281268, 77490, 140387, -19952, -80609, -65578, 30919, -7928, -111936, -236347, -155348, -180939, -253942, -289086, -309109, -247835, -135650, -113923, -154583, -335221, -408790, -214239, -14957, 10212]
17755A0212l5670p3077M7872Q0359J4230p8858O3903Q3976L6209J22966m1677
17744B30445j64995j29442J10538R3470L0044l4755l6194n0150n2647r0471m9269
17733a43426l5542o519j0936R2938J225p2562j88429L7666K64082L44011L6465
17722C18973j59278j44561j35040O8177Q372o2936l4743M8891K624N9926K3329
17711f266j8035N3776K8337q9959j38880J02146l9182k26544J05860J57979L8826
17700c1942j45513p4752J26P9190N3855j6905m8285K075J49477M6786r8754l7989
17688a22631k4968l0215j37678R2365J66239J71367r5015k1244Q2128J81569L5044
17677B96961j15454n7022j59164l8473O9692j08626m8241Q1024j17405k5492L4734
$$ y = [10212, -25458, -98535, -50663, 29696, 43926, -34932, 28971, 112947, 149156, 272122, 230445, 65450, -63992, 46546, 140016, 170060, 135305, 99111, 48961, -3686, -94157, -143426, -178968, -185487, -196423, -103485, -102260, -174822, -363251, -325585, -61503, 282508, 318973, 159695, 15134, -119906, -51729, -43357, -106293, -141036, -92145, -89521, -29595, -6266, -24301, 29475, 57812, -32147, -171027, -68881, -108063, -334607, -228747, -70768, -31942, -177455, -252207, -252081, -172891, -119036, -135941, -184226, -182151, -32674, 14112, -84642, -122631, -147599, -177814, -315492, -223127, -56888, 114479, 19464, -1780, 80348, 261917, 296961, 181507, 124485, -34679, -73152, -3460, -112086, -160327, -79303, -196708, -222200, -187466]
17666a87466L27m9574K0321o2841l6856K55996J28578M1105M386j00673n8058
17655d4755M1422k8988m0757r9336j22257J84056j2042m5512n4099N6002K06919
17644D0653o0728j42748j1520k0694P2843Q3138j17719K1002M6753R9095J0015
17633B0090Q7130K0203j46664K5151K0026Q6395k0909k9701J1161n2489k01024
17622a80631K1686M2851J823q7097J18047J22266K57164P4279k09566k00301q8871
17611a28350L2220J51238J53789j27990j58514j89820j25312n4659K5823L9371
17601c82204N8033O4892l9576O2892l2896K00189J08147l9997m9249l2120K79751
17590A97862M8743k4710j43797k48574o9599j0155J00990J2227j31545J68929
$$ y = [-187466, -187139, -236713, -216392, -279233, -316089, -60093, 68485, 109590, 113976, 13303, -44755, -3333, -32321, -73078, -172414, -294671, -110615, -122657, -168169, -222268, -166266, 40653, -20075, -162823, -174343, -195037, -122194, -39056, -156775, -135773, -89020, 10075, 20090, 107220, 127423, -19241, 5910, 25936, 112331, 91422, 61721, 72882, 20393, -180631, -158945, -116094, -114271, -201368, -83321, 38945, 296109, 370388, 160822, -39479, -128350, -96130, 55108, 208897, 80907, -77607, -267427, -392739, -447398, -421575, -382204, -324171, -259279, -298855, -235963, -268859, -68670, 39477, -520, -49769, -81889, 197862, 246605, 221895, 78098, -170476, -240075, -250230, -149240, -137013, -268558, -99629]
17580i9629K51543j32418L3472o7203k25367j1656Q1046R9230j47798J06228R8849
17569a3703K3464J8871J18315l3782k24913O2645J14387k1909J043L5295R0257
17558A69970j5894j09640J11555M9754q9060q1345j19394l8984J6679k06694q8486
17547d01539J74345K10300K9230M591p0917j25821j50609p0483o3296p2167M4203
17536d92163M6325n2986q1410Q1177J94936O6399Q4857M8293j83664k9346J51367
17525a66215M8729P5500J20419Q7726J8772j21772j82876J01314L4117q9496J7825
17514e5957O2247J2353J44511l5566j04898j7509j79103J912J54679j7536O0366
17503B5499N4118j71939j74047J75814M4235q7292J77358n0175r3805N8605J37209
$$ y = [-99629, 151914, 19496, 52968, -14235, -239602, -251258, -170212, -70982, -218780, -112552, -13703, 9761, 28632, 146947, 113165, -111748, -49103, 65284, 43375, 44418, 79713, 169970, 154076, 44436, 155991, 205745, 116685, 35340, -84054, -123038, -106359, -313053, -401539, -227194, -16894, 12336, 16927, -53990, -179811, -330420, -400903, -464199, -536366, -492163, -445838, -498824, -580234, -499057, -304121, -237722, -152865, -104572, -288236, -317582, -166215, -117486, -41986, 78433, 166159, 184931, 63159, -119717, -18403, 15714, -73782, -55957, 6290, 18643, 163154, 127588, 22690, 5181, -173922, -172010, -17331, -34867, 25499, 79617, -92322, -266369, -90555, -46320, -133612, 43746, -6429, -100234, -41629, 95580]
17492I5580J74372o6250j66449j09158q4335K923P8650J9567o3558J07264Q1971
17481G0577m1838j6989K4230L948l0568j90225K28752k6535j89863J84998J46774
17470A63261k08652r2298O73m9933J2026L6676J00543O2747j21593k02548J14246
17459a84852L3413k8925j04227M0133K5375P1625p65r063J65732L3122n5275n233
17447a8940r8865n2188J6169L8452l780O150K28113l491k5049j36832k00052j01812
17435c52125J18770R5814K7886J8590N5105r0045j46j8448M7824O985r7184l5438
17423b22412o6032K22993j51449j22976N0186J63477M0047L5977j01435q7482
17413b39106K0266O1472J8092M0055O8181o5078j4019q1813K8115N2988p0389
$$ y = [95580, 269952, 203702, 37253, -71905, -156240, -153317, -74667, -55100, -118658, -11394, 70577, 28739, 11750, 35980, 39928, 9360, -180865, 47887, 21352, -168511, 16487, 163261, -45391, -137689, -137016, -186949, -174923, -138247, -37704, 25043, -96550, -299098, -184852, -151439, -180364, -284591, -244458, -219083, -147458, -148223, -157286, 8446, 41568, -13707, -18940, -117805, -169993, -153824, -115372, -119152, -113002, 115111, 111620, 86571, -50261, -250313, -352125, -233355, -137541, -109655, -91065, -35960, -126005, -126151, -144599, -96775, -89790, -186974, -222412, -288444, -65451, -216900, -339876, -289690, -126213, -86166, -50189, -151624, -239106, -218840, -157368, -139276, -99221, -31040, -96118, -110137, -191950, -163835, -110847, -181236]
17402a81236J9730Q0165N1751J33215O7970l4368k7227n9169k11528j26922N8874
17391b28745m7619p8429J94395j09069j16159l5133R5860Q6121J17672M7348R594
17380f4164j8199M3969J17685R7734k789j84768j3334K8811R0905L1610k60652
17369a33192N126K4985p9544J06171M0332n541K4768p3925J46916J9933j14323
17358c8294p2952L5824P8880J57691K00044j2333k35773p3448j65432l1564J40983
17347a6374k0279M6906J07375M0203r58j73721J8060Q9579J60033K8030j30392
17336A48462M3713m0532j71808J1838R8393j11297k5074J36046O4891j66306j50679
17325a62353J6992r7674j00715j47849K9662K46761J52855j42925M9010J19588
$$ y = [-181236, -161506, -81341, -29590, 103625, 171595, 137227, 110000, 50831, -160697, -287619, -228745, -276364, -354793, -160398, -269467, -385626, -420759, -324899, -238778, -121106, -73758, -64164, -82363, -38394, 79291, 177025, 174236, -10532, -23866, 4945, 95850, 127460, -133192, -128066, -103081, -182625, -76454, -36122, -41663, -16895, -90820, 56096, 76029, -38294, -111246, -75422, 3458, 161149, 361193, 348860, 113087, 39639, -125793, -157357, -16374, -36653, 10253, 117628, 157831, 156873, -16848, 1212, 90791, 250824, 278854, 148462, 192175, 151643, -20165, -8327, 90066, -21231, -46305, 89741, 154632, -11674, -162353, -145361, -243035, -343750, -491599, -461937, -215176, -62321, -205246, -156236, -36648]
17315c6648J32382m1469j29257j23315K9954K55164m8690l8519j4759J2573r7632
17304a00216p9064N4284J40755P1907j402L7998n4375K4469P855N1418J1948m8557
17292A17020R80J3572j53192j27807m2518o2916j00354o2964M7413K53951R7524
17281a9291j49508j48186J91623J35607p2778k1067o642j68383L6447J33063K1950
17270f7165J17750Q9532P21k9484j47322l286n858N2682j214k17511k607Q7022
17258a26740J72561K76562p2927j38596r0013p4678K7318n9337J48799n9140j50144
17247a46335r0969N2506J4721J8237k6261J43866l5800j05022j8212l5004k2391
17236b50664k0085m7226p566M3132K40036K11664n276k50978j37596j6498N2547
$$ y = [-36648, 95734, 54265, -74992, -198307, -168353, 86811, 38121, -398, -15157, -2584, -100216, -179280, -124996, 15759, 87666, 86264, 124262, 69887, 94356, 102211, 153629, 165577, 117020, 118000, 131572, -21620, -149427, -191945, -254861, -355215, -418179, -370766, -116815, -19291, -168799, -316985, -125362, 10245, -62533, -83600, -90242, -258625, -222178, -89115, -67165, 50585, 140117, 140838, 111354, -35968, -39254, -45112, 7570, 6356, -211155, -213762, -126740, 45821, 322383, 249456, 110860, 20847, -53831, -26513, -85850, 62949, 3809, -146335, -237304, -184798, -170077, -151840, -178101, -34235, -70035, -175057, -193269, -228273, -250664, -270749, -317975, -325541, -282409, -42373, 169291, 164015, -86963, -224559, -241057, -188510]
17225a88510J02730P3117L8681j55324K2053J75238J24428M9277q1607j8335k00040
17214e8292j31433r3382l5454J78908J85166K9616k9957n2615K5453o8210j55183
17203b05383k2157J10898M1887j3346j7576m8900J00474j5367K5684j403n1214
17192i6403m610K9124P3178p1851o4589r6450o4313J82266k7191l5348N80J321
17180a74286M1429j3474M9079k2322M6204j9371j3403M890j36820m7093J44906
17169a40261K0955j82352j6076O623J5331n2425O692N3884p1539P1524J98777
17158h8867O0560J8590J9416M5202k1646N2975j2079j32576l5620J9849n0321
17147a24517m6778j98848l7965K26695J84562J4848N8964j26654j36952r2227
$$ y = [-188510, -85780, -12663, 26018, -129306, -107253, 67985, 192413, 241690, 160083, 141748, -58292, -189725, -283107, -318561, -139653, 45513, 75129, 45172, -7443, 18010, -50200, -205383, -227540, -116642, -74755, -88101, -105677, -154577, -54103, -69470, -43786, -45189, -96403, -101013, -71889, 1289, -70562, -135151, -231601, -295914, -113648, -140839, -176187, -175607, -174286, -132857, -146331, -97252, -119574, -73370, -92741, -106144, -101254, -238074, -285167, -140261, -119306, -301658, -317734, -311111, -295780, -348205, -341513, -287629, -359168, -287644, -88867, -28307, -9717, 9699, 54901, 33255, 86230, 74151, -58425, -94045, -74196, -124517, -171295, -370143, -408108, -181413, 3149, 17997, 76961, -49693, -186645, -278872]
17137b78872K68095K43883q1997k33421j16434R4875Q1144o3456N1047p8872r4906
17126b08914k4659J50815J3766j2993m3836K2814J62171k8245N5625k3180N6168
17115A19532p602k01552j08869P0800J10231L0897l5392k02850M9951L4018O2642
17104g8194L7327p6457O8443R2966L4056n3868j9286M346O9544n7467q1352j81861
17092b41803J16973p466J06562R8874K7654j18572j06409J00880J33010J40074
17082B49777j62854k02547n7350J526j57772Q396J09330O2131J66192L8530j0489
17071D4870j18075j33735Q4134P7875J50231Q4963j54517m6108J4308J12011m3052
17060G2905k36849l8168R2755J23018k441J01301J95401j24404P3207J27707o1422
$$ y = [-278872, -10777, 233106, 151109, -82312, -198746, -103871, -22727, -86183, -35136, -114008, -208914, -233573, -82758, -68992, -81985, -125821, -103007, 59164, 30919, 86544, 63364, 119532, 111930, -89622, -198491, -127691, -17460, 13437, -21955, -224805, -174854, -140836, -78194, -40867, -117324, -48881, 44085, 78141, 24273, 4987, 9333, 78877, 21410, -59942, -241803, -124830, -132296, -25734, 73140, 100794, -17778, -124187, -23307, 109703, 249777, 86923, -115624, -172974, -171448, -329220, -320824, -211494, -149363, 16829, 55359, 44870, -73205, -206940, -122806, -44931, 105300, 190263, 35746, -10362, 3946, 115957, 72905, -163944, -202112, -109357, 13661, 11220, 112521, 307922, 183518, 256725, 384432, 323010]
17049C23010J2186k7909L6841l4861j54304p8676J1600j11918k93069j67216J66444
17038c17872J88120m1009j42664q036L1176O7844r6886l151M3638Q0276K1668
17027a76896K32116j6430j9783j18940K1340J37498Q2878R1368j60742j20319
17017d7910L3608L8735M989j38229r6783K4047K5k7158J52693k1356p9199k9595
17005a86133p7914j25612J35909K75741J98630j41092r1276L457P9315n1080P4705
16994I4650q3791j29950r8353J62806K41431J08353k5501M8670j16145l11897
16984a09727j19709J04693P6380J61866o150j12211R1022m6195m4736J20744j3817
16973A02160k92257J08398K49685j36982m6385r1204l5806M7868o9390l4155O8944
$$ y = [323010, 335196, 307287, 344128, 309267, 154963, 76287, 87887, -24031, -317100, -484316, -317872, -129752, -170761, -313425, -321461, -290285, -222441, -319327, -322478, -278840, -198564, -176896, 55220, 38790, 19007, -99933, -78593, 58905, 141783, 233151, 72409, -47910, -14302, 24433, 29422, -108807, -205590, -181543, -181518, -208676, -55983, -77339, -156538, -186133, -264047, -389659, -253750, 21991, 220621, 79529, -11747, -8290, 71025, 19945, 94650, 10859, -119091, -217444, -54638, 186793, 295146, 269645, 318315, 202170, -109727, -229436, -124743, -48363, 113503, 107353, -4858, 86164, 39969, -4767, 115977, 102160, -190097, -81699, 167986, 31004, -15381, -106585, -142391, -94523, -163913, -198068, -129124]
16962a29124j29311O4590J04762N2583K25111j16042j61243n9347j16485n9827
16952c24333k16548P3837L16334J10703J1411q5712K4798r9719O007N4873m360
16941a32709Q057O9098K45358K8787j03084j10229o862R1575J23550k9178p422
16930A76941j88992r2771K0522L098Q3710M789r9941J7243J86811O2309O0500
16919B34219k671r4796j90968j8949K9054m8538j03538O877J48021J15141N2076
16908A25928r7362j4607n2579n5653j8357Q3441Q5352r4560K3846j38658j54017
16897c07226J7723Q1879Q418J27467l0609J01576r2779n0404R6756J28165J0753
16886I1719n3215q7571p2647j13887r6909J7941O9025J9543J7199M1131J34172
$$ y = [-129124, -258435, -193845, -89083, -36500, 188611, 72569, -88674, -148021, -264506, -324333, -540881, -467044, -150710, -40007, -28596, -114308, -89510, -189229, -183222, -128349, -132709, -124652, -55554, 189804, 218591, 115507, 5278, -1584, 89991, 213541, 184363, 176941, -12051, -104822, -84300, -81202, 2508, 7297, -92644, -75401, 111410, 173719, 234219, 231548, 136752, -54216, -73165, -44111, -92649, -196187, -189310, -41289, 73852, 125928, 28566, 13959, -38620, -94273, -112630, -29189, 56163, -38397, -14551, -153209, -307226, -289503, -207624, -199206, -71739, -102348, -772, -93551, -143955, -47199, 80966, 91719, 38504, -49067, -121714, -235601, -332510, -314569, -245544, -226001, -208802, -167671, -33499]
16875c3499q3573j6331L8935Q7131J50723j3084j13895p5898P0750j32481j00924
16864b22146P1789j74248l9692O5905K4256n8312k48976l3872K45397k6536l8950
16853d35385R2261O6888j08758M4417L2918j01955Q5933R1296j8456j6195k6279
16842b93315J14308J61916J22108n1655j48922o1964J92467j03473j12668K9308
16832a51890K1709j6252M8265K53264J49204j13048j42157K4853K3106J28562
16822B25616J6637j46688j43254m145N5432q3224n0191J28345R760K4602r705
16811B3185o031L3263Q8874N9678j88703j55903j9144O0410q1903j0182L3825
16800a62631M5609L291Q8037m0378k67954j18920J16107J68417P2286P2620m10
$$ y = [-33499, -117072, -133403, -94468, -7337, 143386, 130302, 16407, -59491, 11259, -121222, -222146, -150357, -324605, -364297, -298392, -274136, -332448, -581424, -615296, -369899, -396435, -435385, -343124, -276236, -384994, -340577, -307659, -409614, -323681, -232385, -250841, -267036, -293315, -179007, -17091, 105017, 53362, -95560, -157524, 34943, -68530, -181198, -151890, -130181, -146433, -98168, 155096, 304300, 191252, 49095, 73948, 97054, 225616, 242253, 95565, -47689, -51834, 3598, -79626, -129817, -1472, 8288, 32890, 23185, 17154, 50417, 139291, 198969, 10266, -145637, -164781, -104371, -186274, -196456, -162631, -117022, -113731, -25694, -66072, -334026, -452946, -336839, -168422, -96136, -23516, -23926]
16789b3926k34755j27888j1405J29523J60875m2181N2933P3024j053q1205r1791
16778a97849J62017j26811p546j6214j2548K5263N9484j1851r814J07811q8229
16767a16287j487k3961o133O6956L4056K4969r9249l5997J22280r6064k1622L5318
16755a17221O2239M7665Q8064n5156O8797o105k2636r4776J17139o4217J12397
16744A36190J02548q7115q7305j11321p4974J7169m863J58765Q3171j28474k43904
16733b40113m408P7965O9198K28576O6317j07768J8004r2973j62250q8808k76070
16722e12330m147L4044N8313L35183K18022j49990j98946m6078P2721N4923m2195
16711a80480R8711o930r9509Q70J07534Q0783j5799j5526k1481O9346k9385k30355
$$ y = [-23926, -258681, -386569, -397974, -268451, -107576, -149757, -96824, -23800, -24853, -106058, -197849, -35832, -162643, -170189, -186403, -198951, -173688, -114204, -126055, -135869, -28058, -116287, -117774, -141735, -147868, -80912, -46856, -21887, -121136, -157133, -34853, -130917, -152539, -117221, -54982, -7317, 80747, 25591, 94388, 88283, 65647, -29129, 88010, 23793, 136190, 238738, 151623, 64318, -47003, -121977, -104808, -109671, 49094, 132265, 3791, -240113, -244521, -166556, -97358, 131218, 197535, 89767, 107771, 14798, -147452, -236260, -512330, -516477, -482433, -424120, -88937, 129085, -20905, -219851, -265929, -193208, -138285, -180480, -81769, -88699, -188208, -187338, -79804, 979, -14820, -30346, -51827, 17519, -11866, -242221]
16699b42221N0029L2809q3853N9807J61217N0645m0818j21159O7328L7681j47467
16688a76002p4018N4584N0441L8632j96126O105O4647J01527K10040M099j27612
16677d3683j41326N9675j2570N1752N9717J4210r3966O8681j20991l482R6973
16666f5010P2107j41318o516o1565J12239J26041m4714P0152o653n0961k0846
16655a7044q1333j27970L0433L07807Q8186j07037j32111j8097k4922o8828J09189
16644d1727J21228l3552j56703m5078l0232J34865J39657j45022j61160J31435
16634h6289J16343p0340p4537n7000o541K72O8672j11976N1839J28872R4329j0360
16622D3284l5444k9302j51377N4473J3621M1162J8715O8804m9126j20376J61282
$$ y = [-242221, -192192, -159383, -243236, -183429, -22212, 28433, -12385, -133544, -66216, -28535, -176002, -250020, -195436, -144995, -106363, -302489, -296384, -231737, -130210, 79830, 83929, -43683, -185009, -125334, -137904, -86152, -26435, -12225, -106191, -37510, -158501, -161983, -65010, 7097, -134221, -140737, -202302, -90063, 35978, -8736, 61416, 54763, 3802, -17044, -98377, -226347, -195914, 111893, 200079, 93042, -39069, -57166, -82088, -150916, -41727, 79501, 45949, -110754, -155832, -186064, -51199, 88458, -56564, -217724, -86289, 30054, -40286, -114823, -171823, -178364, -178092, -109420, -221396, -169557, -40685, 53644, 43284, 7840, -21462, -172839, -118366, -104745, -63583, -44868, 23936, -25190, -145566, 15716]
16611A5716K01884j28575L1519J23619k5314l29192r5630L7402j26243N5690k0060
16600b59184J46737K554j16221p6898N1358K77721J13508j95240m4016M3964l8888
16589i4605j9600R267M7629O2674j083K1776j44738j80386k50396k6188J99607
16578c76043Q3208J17282J15891j14503j79054J06248n7726l3162P4996J11975
16568a50888K61971n7727j01545j09723j01566O784J23445P4808m7015R2741n8916
16557f7631j24730p0588p7240o2472J90816J589J31840J22473m5622O3307N0166
16546A11908j12756J55602J4357j40784k21912l0507N311o3907J45034K0221m8681
16535a66114q7902j03131N4477J37744J14258j34168m7404P0262K32280L8007
$$ y = [15716, 217600, 89025, 120544, 244163, 218849, -110343, -205973, -168571, -294814, -239124, -259184, -112447, -109893, -226114, -303012, -251654, 26067, 139575, -55665, -99681, -55717, -94605, -114205, -104938, -57309, 5365, 4282, 26058, -118680, -299066, -549462, -575650, -376043, -292835, -175553, -59662, -174165, -353219, -246971, -304697, -337859, -262863, -150888, 111083, 53356, -48189, -157912, -259478, -252694, -129249, -54441, -101456, -8715, -67631, -192361, -262949, -340189, -402661, -211845, -210256, -78416, 44057, -1565, 61742, 111908, -848, 154754, 169111, 28327, -193585, -224092, -218781, -282688, -137654, -117433, -166114, -254016, -357147, -302670, -164926, -50668, -184836, -232240, -161978, 70302, 108309]
16525A08309j21421O9517m2484J63648O5910j79671n1664J33815l3271j77875
16515f5187l9805K4880n7978J7774M8220J0674j0659m9560j03856L9595J49217
16504c6685O5654n1993j4823p251m5208k8642j3677p5155o456r0486R8767l6087
16492b42042r074L5842k2601P3099K30004N5736n1893j07511o6283M4834Q8908
16481B9019P6952j19851k25926P5133J93798J78242L6789j3246j74598j61800
16471a05488p644p2482l5996l7721p3359J02778N8194j22711p5552M7265J28500
16460a94216O6264J92988N1235J04854M1523j27854k93843n8428J8981n6311K2585
16449b32222K51029M3047K6214P1712p2349j55458q1378K0607k4283Q5065Q440
$$ y = [108309, -13112, 56405, 13921, 177569, 243479, 63808, 12144, 145959, 112688, -65187, -104992, -80112, -138090, -120316, -72096, -61422, -72081, -121641, -225497, -185902, -36685, 28969, -23024, -37847, -45098, -90306, -118948, -132625, -207780, -214236, -304722, -205955, -242042, -251116, -215274, -237875, -164776, 65228, 120964, 69071, -38440, -104723, -59889, 29019, 105971, -13880, -239806, -164673, 29125, 207367, 244156, 230910, 56312, -105488, -113132, -185614, -221610, -259331, -332690, -229912, -171718, -294429, -369981, -322716, -194216, -127952, 65036, 116271, 221125, 262648, 134794, -159049, -217477, -198496, -254807, -232222, 18807, 61854, 88068, 159780, 87431, -68027, -149405, -128798, -153081, -68016, -59576]
16438e9576o4083o478Q4017J1796J7585k06166O1720J76209p7779j17999r082
16427a89836Q0288o195L9164J6411K7864P5888j01520j69913k4439k2130L1677
16416b42741R5053J7732q652n2L4590K0093p360j63417j8083J44902Q0256O7761
16404B0082Q866o8143M5765M6337r5773j17282q5858j8743J33784J10527N9348
16393C8910N2093O7114J7663q4002k00711j12855r0997Q0477K7726K938J43737
16382e7907K46409m4560n2782r4879J2781k3062m4854J48363N4892K1511Q5419
16371B51331j09117j33563j41863k9973K3061K7126L5851l2616n1510j15250L5221
16360b41302R4113O5818m1775N125j4012j11298q1263n318J57267J7701k65675
$$ y = [-59576, -123659, -130137, -46120, -34324, -16739, -222905, -161185, 15024, -62755, -180754, -189836, -109548, -115743, -76579, -60168, -32304, 43584, -57936, -227849, -252288, -274418, -242741, -147688, -129956, -138608, -138660, -104070, -83977, -91337, -254754, -272837, -127935, -47679, 20082, 28948, -39195, 6570, 52907, -42866, -160148, -246006, -264749, -130965, -20438, 38910, 91003, 158117, 175780, 91778, -108933, -221788, -312785, -232308, -204582, -201644, -57907, 188502, 143942, 91160, -3719, 9062, -14000, -58854, 89509, 144401, 165912, 251331, 142214, 8651, -133212, -163185, -140124, -112998, -77147, -109763, -161273, -276523, -241302, -147189, -81371, -123146, -118021, -132033, -243331, -324594, -329912, -172645, -154944, -420619]
16349d20619J63038K74758o9735j8617J04479Q136j13694Q8861N9428n6725j02138
16338h2828j01937J8731J2691L4866q4631O1605J61811Q9385k5857j05928n4980
16327g7072r1310o8514Q0582J25000j29489k40842p7042L8110K02352J70788j14348
16316a81785J77675O4072N7M8844l6146j05366m8027j10842l2482J26577l1993
16305a29416j46669K755J41723J58172K071k1187l9170m8448m9379M4197j76048
16294b61399j50047Q6412Q9184j8223R575j00423P6088P9089j01503l5260L7486
16283b89021J05764J04309Q9713j01033p8042j7808L6857J56506o76j07552j00981
16272b01964N9408K5543j10930J15159Q1269q4407K1690K25315J41869n9371j36715
$$ y = [-420619, -257581, 17177, -52558, -71175, 33304, 41440, -72254, 16607, 76035, 19310, -82828, -184765, -166034, -153343, -118477, -203108, -141503, 20308, 109693, 83836, -22092, -77072, -168382, -236896, -156314, -31314, -160803, -401645, -478687, -440577, -238225, -67437, -181785, -4110, 59962, 60019, 108863, 72717, -32649, -80676, -191518, -224000, -97423, -129416, -276085, -273330, -131607, 26565, 28636, 7449, -31721, -80169, -129548, -85351, -261399, -411446, -325034, -235850, -254073, -244498, -344921, -268833, -189744, -291247, -326507, -289021, -183257, -78948, 10765, -90268, -168310, -186118, -149261, 7245, 6569, -100983, -201964, -142556, -117013, -227943, -112784, -31515, -115922, -94232, 131083, 272952, 213581, 76866]
16261G6866j6538j70899l6442m5306N5488Q376j37397L3441L9224J21983N6099
16250a5105L077l3450k0537J66744J081k1293j0291N5351j57096n0052J73943
16239I2372n0121j74633M9982j12527k8477K53724K10566o2784m2817j9850P8122
16228A93557j31482j11103J155k4605j09554N978J64052Q1297J060j13499k18210
16217b61354o6140J43565J61358l3376j37567j21807L4455M3998k5059J56404
16207a05523O2951k4280l3011l595Q4829M1238j36396n9622Q2387j56497l6094
16196b83613O7628j0293K8629J1305J20447M9944N205k7254j61712l7259J69324
16185f7649J51300o6510L0071M0773J36428r2350j06421j07962Q8495n9854o5502
$$ y = [76866, 60328, -110571, -147013, -192319, -136831, -128455, -265852, -232411, -193187, -71204, -15105, -12028, -45478, -66015, 100729, 101810, 80517, 70226, 125577, -31519, -81571, 92372, 42251, -132382, -82400, -194927, -223404, 30320, 240886, 178102, 135285, 115435, 193557, 62075, -49028, -47873, -72478, -182032, -176054, -12002, 69295, 70355, -43144, -261354, -327494, -183929, -22571, -55947, -193514, -315321, -280866, -236868, -261927, -105523, -42572, -66852, -99863, -103458, -18629, 22609, -113787, -173409, -91022, -247519, -283613, -215985, -226278, -197649, -186344, -65897, -15953, -10748, -38002, -199714, -236973, -67649, 83651, 17141, 47212, 87985, 224413, 132063, 25642, -82320, 6175, -53679, -119181]
16174a19181P7470R1659m4540Q847J01702J0158j9871j8800m0577j8982o2498
16163c4613R2344r7132p4706p7278k4412o8727J12827J44961J37738n0889J11243
16152A71356K01315l6503l0182K9767n5101k56960j50479M6935J33226L9954m9969
16141D3359j60661j39184K1200M3550J66725J58149O972K9730R547n4459n9654
16130F5274m0671r1873L107O6467n4119N8959Q354N7541k3601j13795r1827q4092
16118b40276J8718K26916J19950P712r688j32480k4909M5712M1776n8859L6746
16107C1318n2890q4060M5780j03286q7526k3940J88645N1079r1547k3390p1711
16096b21528L9369O3421J3664M1326R2742Q2968J05130k17165R1357J84230k5207
$$ y = [-119181, -41711, 49948, 5408, 14255, 115957, 126115, 106244, 87444, 46867, 27885, -34613, 57731, -39401, -114107, -191385, -215797, -284524, -171697, -26736, 111002, 60113, 171356, 372671, 336168, 305986, 335753, 280652, 23692, -126787, -79852, 53374, 93328, 43359, -117302, -256486, -235286, -191736, -25011, 133138, 140110, 169840, 179387, 124928, 65274, 24603, -67270, -64163, 2304, -51815, 7144, 15498, 73039, 49438, -64357, -156184, -240276, -221558, 5358, 125308, 133020, 123332, -9148, -34057, 11655, 53431, -5428, 31318, -21572, -105632, -59852, -163138, -250664, -274604, -85959, -34880, -126427, -149817, -221528, -182159, -118738, -105074, -63748, 28994, 111962, 217092, -73, 91284, 275514, 250307]
16085B50307q2269j81559O2232J62429m521r8157J119K3202J7851M9778j90606
16074I806r0067J06003j42283j19444N3372O8484P308l381l5828J22379k3059
16063d6710j04770r4023P2693J33950m1958j15358P2148M1550M258K8032J51931
16052A01743M1285r3776l3118J9290N2304L9507n9652k27134j02855J5890N9353
16041a87163N5743O0668K03260k361p2816N7856R3495K0506R8089k31574q8524
16030G179N933R3629k2658q3018p9876q7711J19772j4705n0565M5549k2347J65590
16018G6772J14323j67106j55651j15998J48500K29851k0753o2333J1965m2955
16008A6615j08651m6758J91353r7103o3440K33095M6122j35441j78853j49017
$$ y = [250307, 168038, -13521, 48711, 211140, 206619, 108462, 109581, 132783, 150634, 200412, 9806, -80261, 25742, -116541, -235985, -182613, -114129, -106821, -110202, -146030, -23651, -46710, -151480, -245503, -172810, -38860, -80818, -196176, -124028, -82478, -78220, -50188, 101743, 143028, 49252, 16134, 35424, 87728, 127235, 67583, -159551, -262406, -246516, -187163, -131420, -70752, 132508, 130147, 57331, 115187, 208682, 229188, 327277, 95703, 7179, 13112, 106741, 84083, 1065, -78811, -166522, -46750, -61455, -112020, -66471, -88818, 76772, 191095, 23989, -131662, -247660, -99160, 130691, 109938, 47605, 59570, 16615, -92036, -138794, 52559, -44544, -107984, 125111, 171233, 35792, -143061, -292078]
15998b92078P4192K19573K7917r8302m1268m0353M0597L676J28989J60561n9832
15987A23672J33583N5419J10672K6164j19258j18023Q0426k3971o0993k092r522
15976A96077j13564n4607P5217j7877P4713k9021J0122j11558p5766L8625J41896
15965A34257O4682j54450M5140M0027P0214j83617l2531j66861J8881J1995j3153
15954a65416J95633l5771j41301r8087r9855o1103M400p6404r4621M3372j95664
15943g24817J25542K78934K22590R8140k9929l8746k128j435K26592R6334j50598
15932A00479p4397K9677k0086Q5716o093j64318K9941L119j27459j38788n5349
15921c37558J95596J07282O6639P2506j7176k6752k4363R190q1103q8324M2227
$$ y = [-292078, -217886, 1687, 29604, -68698, -109966, -150319, -109722, -106046, 22943, 183504, 123672, 257255, 312674, 423346, 449510, 330252, 212229, 292655, 268684, 207691, 205599, 196077, 82513, 27906, 103123, 85246, 159959, 130938, 141060, 29502, -46264, -7639, 134257, 198939, 44489, 89629, 129656, 199870, 16253, -16278, -183139, -164258, -152263, -165416, 30217, -5554, -146855, -244942, -344797, -405900, -401500, -477904, -572525, -529153, -724817, -599275, -320341, -97751, 389, -29540, -68286, -70414, -71849, 154743, 251077, 100479, 26082, 55759, 35673, 121389, 115296, -49022, -19081, -15962, -143421, -282209, -337558, -141962, -34680, 31959, 104465, 87289, 60537, 36174, 45364, -35739, -124063, -81836]
15910h1836K8640k1863M8277j02437Q2469J62787O004j56148J37673K06983O6925
15899C77474j86490k76652p3987J7711L7543j6843P2980K7288n8588n0893L5281
15888i5176O501L2050L9797j33824K2408n733J46892q1838l3641O3322J40901
15877A01659N7210q9983o7399j69861o9305J05261N1510m2567K3369p7047K9415
15866a47738M724o2455R0072j0233m8893J30135o1508Q3232k3543J01235O6604
15855A21632k01658j21197J2314P125p3381J09576l8989j27730j6371J34106R4480
15844a00093M7364o8879J1256J36333K817j39583j10964l66n3590k3854n3373
15833c52932l6338J88679J55476O0405J6365j90449k2326Q1302L6674k6865o3255
$$ y = [-81836, -53196, -75059, -26782, -129219, -46750, 116037, 122041, -34107, 103566, 310549, 377474, 190984, -85668, -159655, -141944, -104401, -121244, -48264, -20976, -79564, -130457, -95176, -88675, -56625, -16828, -150652, -128244, -133977, 12915, -68923, -102564, -39242, 101659, 158869, 68886, 1487, -168374, -237679, -132418, -80908, -123475, -100106, -177153, -147738, -143014, -205469, -115397, -125630, -174523, -44388, -105896, -22664, -46207, 55028, 121632, -80026, -201223, -188909, -181784, -255165, -145589, -184578, -312308, -328679, -194573, -100093, -52729, -121608, -110352, 25981, 28798, -110785, -221749, -222115, -275705, -299559, -352932, -389270, -200591, -45115, 15290, 31655, -158794, -181120, -99818, -63144, -90009, -153264]
15822a53264o5658Q5740J28878M6871r5720K1547N000K21311j89323j21591r3325
15811b09534J4572J23729O9463N3422L9453k31013o1002J98448M3493J5350l7331
15800A9050p0614J06220O8704j17069m084j5036M6588J17860J6619R880R212l3784
15788A53546j57010j06376l6741j23096N2904k9372j74618J60290K21222k0403
15778e9654m4810M5334O8365p5968j6850q320L1062j6051K5442O9506M9078k1475
15766D5659K054j135J12702J14989J14644o5412k93468j46855n7665Q1507J6336
15755g6644J64126K7360K098j37899m5526J76526J38853K7555J04987o934j30453
15744B44049r9652j91383j47908n1081K17531J28813J01625k1880n7015q1661
$$ y = [-153264, -218922, -133182, -4304, 42567, -53153, -31606, -26606, 194705, 5382, -116209, -209534, -194962, -71233, -1770, 51652, 91105, -139908, -200910, -2462, 41031, 56381, 19050, -51564, 54656, 123360, 6291, 2207, -12829, 33759, 151619, 168238, 178118, 187330, 153546, -3464, -109840, -146581, -269677, -216773, -246145, -420763, -260473, -39251, -59654, -104464, -59130, 9235, -66733, -83583, -91903, -60841, -76892, -51450, 18056, 67134, 45659, 47713, 46578, 159280, 274269, 388913, 323501, 30033, -116822, -174487, -92980, -76644, 87482, 114842, 116940, -20959, -66485, 110041, 248894, 276449, 381436, 374502, 244049, 144397, -46986, -194894, -245975, -28444, 100369, 201994, 180114, 123099, 41438]
15734D1438p2495j49412m3495j24971o5274J41180M3611J19779J50600J52778
15724A93739R9341j41060r6818o6972n6980j11318j54221j38918O1964J61488
15714b49755J20309P1931r2940K4793R3584J25382j32006j40369J13772L2430
15704c2869j13359k0836J01422l5784R4793P6495l1040j00168L996J14148L4220
15693I1018n4897j57783J42693q2336N4630Q078o3043J48364J9508j50079o4829
15682a08676J54384j59991j95789L8543M3665K5428k2636J21045o4057M6012J56664
15671C4592L1825j59055J289J6519r9147M7250Q1820Q7111j2762j23191q5834
15660a79583o9397R2643l8925P8059M9561q1793Q3581P1111J1777m9975M560o5969
$$ y = [41438, -31057, -180469, -223964, -348935, -414209, -273029, -229418, -109639, 40961, 193739, 293080, 152020, 55202, -11770, -68750, -180068, -334289, -473207, -411243, -249755, -129446, -57515, -150455, -125662, -32078, 93304, -38702, -179071, -65299, -32869, -146228, -167064, -65642, -101426, -6633, 69862, 38822, -61346, -57350, 56798, 91018, 36121, -121662, 21031, -61305, -6675, 1403, -61640, 86724, 106232, -43847, -108676, 45708, -114283, -310072, -271529, -227864, -202436, -225072, -104027, -168084, -122072, 34592, 66417, -92638, -91349, -74830, -173977, -126727, -44907, 42204, 29442, -93749, -179583, -248980, -156337, -195262, -117203, -67642, -149435, -65854, 5257, 17034, -32941, -28381, -94350]
15648i4350L1435K15862j2185j10643L3535J80521J24129j41568O062k4536j78113
15637C0149P7951o8622r0125J9882O2246l3773q6214J70301J09k15318q0156j9861
15625b33431J36792J97695K9261q7879k9838J65466j39272k9181J51681l4984
15615A26310l1026j1366j51148J9034L7949j56336M8356J46355J06422n0560M1136
15604A25126j01467j83044j4388J99841j6925r668O8111j0131j23754Q3256Q681
15593B5638J1851M1643r405l1273Q185j54937r4684j20315M5072J96258j4616
15582i6583N830O3278J01020m344j81246P8327K56413J1648l3552j41803N2096
15571A11084P5324r607o4128j99274o5134O4249J28511J59489O7645O0605r7908
$$ y = [-94350, -62915, 152947, 140762, 30119, 63654, 244175, 368304, 226736, 232798, 208262, 30149, 108100, 39478, -50647, -30765, 31481, -2292, -88506, 81795, 81904, -133414, -213570, -233431, -96639, 101056, 130317, 42438, 12600, 178066, 38794, 9613, 161294, 126310, 95284, 83918, -67230, -48196, -10247, -166583, -118227, 28128, 134550, 83990, 125126, 23659, -159385, -173773, 26068, 9143, -525, 67586, 57455, -66299, 16957, 25638, 37489, 79132, 69727, 38454, 46639, -108298, -202982, -323297, -278225, -81967, -96583, -90753, -27475, 73545, 69201, -112045, -33718, 222695, 234343, 200791, 58988, 111084, 186408, 176801, 112673, -86601, -151735, -87486, 41025, 200514, 268159, 328764, 230856]
15560B30856j36817m2583o2629n8845J31556K15394l5913j4060j03128n6419l9837
15549B7575L7602r1114j01185J39871M9644k2126m9122N682M7303J00380N747
15538A50257K0663k2586j38217j3794P1000n4844n4184K5376j6183j28225k1774
15527a82511N1145O125J33546R6309l9705Q73J60137J16790o8467K882j94338
15516H2786Q502J49334k05549j92360j76391J09466K07194M7608k0734p4347r1715
15505a56206k94705P9365K61144L6085m5166k14837j2155J02315J61517L1338
15495e1305j06174O129M9207K3759k7639m7104J48852L8770N0466l6329M4659
15484I3291j49168k1424J26085k2837j27446o0548L8606K25167m2486j51142J0289
$$ y = [230856, 94039, 51456, -11173, -70018, 61538, 276932, 241019, 226959, 123831, 67412, 27575, 65177, -25937, -127122, 12749, 62393, 40267, -8855, -3173, 44130, 144510, 150257, 170920, 148334, 10117, -3677, 67323, 12479, -41705, -16329, -32512, -160737, -182511, -131366, -125241, 8305, 104614, 64909, 65782, 225919, 342709, 274242, 277124, 82786, 91288, 240622, 35073, -157287, -333678, -224212, -17018, 30590, 9856, -64491, -156206, -450911, -371546, -110402, -74317, -119483, -334320, -346475, -244160, -82643, -51305, -157479, -151350, -102143, -78384, -106023, -153127, -4275, 34495, 84961, 48632, 93291, -55877, -77301, 48784, 25947, -101499, -162047, -123441, 101726, 59240, -91902, -81613]
15473h1613J31148Q7804q137j47837j02061J19717J2809L8854N1281P6798j44116
15462C4647k4381R770k9920J6720m404k1578k7199K8156p7787J08758m7427m0432
15450g5077j7233r2863R9479J22928o6157j7484J08228j01643J11286R3402j68226
15439c360l119J45206p5116q1693o5461N6026p791R3314J00782J72824j98929
15428A32683j65500K1683n4676l6943j02858N3176J3118m7361m0233R4308J75935
15417D3332j4983M9633k4711o2438j50559j6042K06355R5094m8722M5684J6012
15406A38655l4804k0528j41149r8808J80718k6604j53341J2683J38681m491K8929
15395A9941J12119j9556k3077m3656L7833k3559o9040n7141J06739P2829L8997
$$ y = [-81613, 49535, 137339, 129202, -18635, -120696, -979, 11830, 50684, 101965, 178763, 34647, 10266, 20036, -9884, 6836, 2432, -19146, -46345, -18189, -95976, 12782, -34645, -75077, -92310, -185173, -85694, 37234, -28923, -46407, 61821, -39822, 71464, 164866, -3360, -6479, 138727, 63611, -18082, -83543, -27517, -35308, 58006, 158788, 331612, 132683, -32817, -11134, -65810, -102753, -205611, -152435, -139317, -186678, -226911, -132603, 43332, 28349, 77982, 53271, -9167, -159726, -175768, 30587, 125681, 76959, 122643, 138655, 103851, 83323, -57826, -156634, 24084, -2520, -155861, -143178, -4497, -8988, 19941, 132060, 112504, 89427, 45771, 83604, 60045, -8995, -66136, 40603, 113432, 152429]
15384A52429m4666Q896j02791j79376J14151q2083j06107q2296Q9515l3977q1762
15373c48067o842J23847N80l4856J06381l841L937Q6309K40168R7834j33424j07551
15361B4475J6259m1186J44905J38815r0929o552L4969o1088l00729l2340J27555
15350d5846K8433L0585q9949j1467j20643J1000L6732m1941J14994K0486r7392
15339a65008O118q2598J46647M8420J27395N8499p506j56384j83188P2640R7098
15328c7867r64p814K3318l3368m0664m3377j85358n7893K59413J09516j38695
15317a53753k3476K7678K1073L7284J22213Q6344R4551p4034j07857M6799L5023
15306A11845l7379j1436j81489m1164l6693j32815K8855K22029L9842K2402j6482
$$ y = [152429, 107763, 116659, 13868, -165508, -51357, -133440, -239547, -321843, -232328, -266305, -348067, -354909, -231062, -230482, -265338, -158957, -162798, -158861, -72552, 167616, 265450, 132026, 24475, 40734, -452, 144453, 283268, 192339, 185787, 220756, 159668, -141061, -173401, -45846, -17413, 13172, -76777, -88244, -208887, -197887, -161155, -203096, -88102, -67616, -165008, -158890, -241488, -94841, -46421, 80974, 139473, 131967, -24417, -207605, -134965, -37867, -38831, -46645, -23327, -56695, -97359, -140736, -326094, -383987, -124574, -15058, -153753, -177229, -149551, -128478, -91194, 31019, 117363, 211914, 137880, 30023, 76822, 111845, 74466, 63030, -118459, -159623, -196316, -329131, -300276, -78247, -38405, -16003, -32485]
15295c2485j18038J23038R1107k653j55101j12029J8774O6291J28331P7604p9646
15284E193n0007J7327p3597p1097O5829R0733p4222p0349n8643j06941k8315J59693
15272a94396K13377j25875k2580J52388j3411j9657o8821K3290k7369L2325Q7645
15261C6916m5395q1410k8751l3846j08819N3748K0971l3372M7803J56867N4171
15250C8883k9122J34071Q2639j03426r1573J82987m8288k9710j41983j58430Q7471
15239g6481J46687j83099r4626J02267K27336j9645j43961J9651Q0653K0969j41330
15228f1579j27074m8958K8104j8123L5735j19294j02334J20216J31241O8176J40443
15217D6553j5617r5202J19854K87125n3349m8909K3861k44667o0408k6866J9838
$$ y = [-32485, -150523, -27485, 63622, 60969, -94132, -206161, -187387, -121096, 7235, 84839, 5193, -44814, -27487, -101084, -172181, -106352, -15619, -89841, -160190, -218833, -325774, -354089, -194396, 18981, -106894, -129474, 22914, 9503, -10154, -78975, -55685, -83054, -50729, 36916, -8479, -89889, -118640, -152486, -261305, -207557, -186586, -219958, -172155, -15288, 38883, 9761, 143832, 226471, 123045, 31472, 214459, 166171, 136461, -5522, -163952, -76481, 70206, -112893, -207519, -105252, 122084, 102439, -41522, -21871, 58782, 79751, -61579, -188653, -237611, -209507, -227630, -191895, -311189, -413523, -293307, -162066, -93890, 46553, 30936, -64266, 55588, 342713, 289364, 240455, 264316, 19649, -40759, -67625, -47787]
15206d7787P4459m6088j27277j12135l4093k4431J15861N8246n5515M2155j7669
15195a74274l8833m5920j2680R3419m2959K0900j28793Q4238J3340j3608o2280
15184c07450j2478J84785J40166K8789O465O0051P0300n3649k08503j28860n0833
15173b71217N7517J80484J18655J08543k6322j4725O993j04976j22624J5654J50923
15162I8905L4402j0254j0753Q795P3452L1830J10963K5999j14831j06342j94000
15151e1834n316j4456n8303J48006L8788o9323R531k3179j21861r6923p0772J01206
15139b14436K17871J01052n4657j90452j04239L2751k8680j40631J28411M2129
15129b10881j70106K59160K73142o2738j28255J815L820j09171L4851J23624Q4222
$$ y = [-47787, 26672, -19416, -146693, -258828, -292921, -317352, -201491, -143245, -198760, -156605, -174274, -213107, -259027, -271707, -178288, -221247, -200347, -329140, -244902, -231562, -245170, -307450, -319928, -135143, 5023, 33812, 40277, 100328, 170628, 116979, -91524, -220384, -271217, -213700, -33216, 85439, 193982, 167660, 152935, 159928, 54952, -67672, -52018, 98905, 133307, 123053, 112300, 121095, 194547, 226377, 337340, 363339, 248508, 142166, -51834, -57150, -71606, -129909, 18097, 56885, -12438, -2907, -26086, -147947, -244870, -315642, -214436, 3435, 104487, 49830, -140622, -244861, -212110, -240790, -381421, -253010, -210881, -380987, -121827, 151315, 88577, -39678, -37863, -34043, -143214, -108363, 15261, 99483]
15118I9483q1177L7361O1596o9145j39951j21843R1291L6646q390J13230K36695
15107B55796k09958k74291J02597J51116J25301J64317j00978k55991j50613N7416
15097a35288m1603l6908n1612j45356p6573J24763K31177K39463k9257k84662
15087b05856J16689k2510j7345M4880N0818O3468l3219j39279O2281o3203j24259
15076b67535R9321J10183P0l3384j33320N4127K218J03392J20482n3637k30994
15065b29077j05140K29810J30526J05343j4404O6151l1287k49102j04565J93753
15055g992Q7913K8807p8539Q0814M5495l7631j31183j60262O4370M8170J41215
15044H1177J69573O261j2163j91828k30806j90460p9332J95049J04220p7599n0610
$$ y = [99483, 18306, 55667, 117263, 48118, -91833, -213676, -122385, -85739, -94129, 19101, 255796, 45838, -228453, -125856, 25260, 150561, 314878, 213900, -42091, -192704, -135288, -176891, -213799, -265411, -410767, -487340, -362577, -131400, 108063, 78806, -205856, -89167, -111677, -129022, -84142, -33324, 30144, -3075, -142354, -80073, -143276, -267535, -168214, -58031, -57961, -91345, -224665, -170538, -168320, -64928, 55554, 1917, -229077, -334217, -104407, 26119, 131462, 117058, 183209, 151922, -97180, -201745, -7992, 79921, 108728, 30189, 111003, 156498, 118867, -12316, -172578, -108208, -60038, 81177, 250750, 257011, 244848, 53020, -177786, -368246, -447578, -252529, -148309, -225908, -276518]
15033b76518J04026M4851n6764o594q3333j7232L7447j92882n4229J49684P0781
15022b80763L02105q1444o6609J28179K22644j57849p7826l5392j39195l4843
15012b20993N9509n8147q3996P54K5447K00736Q5009j28161Q3659J9109j5986
15001c3060j37600k4090j382n5707J71109K02059j49474J13371K11236o3738j50532
$$ y = [-276518, -172492, -127641, -184405, -190999, -274332, -291564, -254117, -446999, -501228, -351544, -280763, 21342, -60102, -126711, 1468, 224112, 66263, -11563, -46955, -186150, -220993, -161484, -219631, -303627, -302873, -277426, -76690, 8319, -119842, -36183, -17074, -33060, -170660, -194750, -196132, -251839, -80730, 121329, -28145, 85226, 296462, 232724, 82192]
$$ [...]
##END NTUPLES=NMR SPECTRUM
##END=
