##TITLE=Analysis number 328692
Compound Code cc 10202
Book Reference 513/97/28
Project Code adrs
Chemist Name ronp
##JCAMPDX= 6.0         $$ Bruker NMR JCAMP-DX V2.0
##DATA TYPE= NMR SPECTRUM
##DATA CLASS= NTUPLES
##ORIGIN= Bruker BioSpin GmbH
##OWNER= nmr
$$ XWIN-NMR		Version 3.5
$$ Tue Jun 26 13:04:59 2007 GMT Daylight Time (UT+1h)  MAYBRIDGE\nmr@NMR_250MHZ
##.OBSERVE FREQUENCY= 250.131544655141
##.OBSERVE NUCLEUS= ^1H
##.ACQUISITION MODE= SIMULTANEOUS (DQD)
##.ACQUISITION SCHEME= undefined
##.AVERAGES= 16
##.DIGITISER RES= 18
##SPECTROMETER/DATA SYSTEM= dpx250
##.PULSE SEQUENCE= zg30
##.SOLVENT NAME= CDCl3
##.SHIFT REFERENCE= (INTERNAL, CDCl3, 0, 16.4494)
##AUDIT TRAIL= $$ (NUMBER, WHEN, WHO, WHERE, WHAT)
$$ ##TITLE= Audit trail, XWIN-NMR		Version 3.5
$$ ##JCAMPDX= 5.01
$$ ##ORIGIN= Bruker BioSpin GmbH
$$ ##OWNER= nmr
$$ C:\u/data/dgb/nmr/ADRS/2020/pdata/1/auditp.txt
$$ ##AUDIT TRAIL=  $$ (NUMBER, WHEN, WHO, WHERE, WHAT)
(   1,<2007-06-26 13:04:32.79 +100>,<MAYBRIDGE\nmr>,<NMR_250MHZ>,
      <created by zg, POWCHK disabled, PULCHK disabled
       configuration hash MD5:
       76 6E 9A 78 1E 09 19 81 EC 84 63 8F B0 6A 59 2D
       data hash MD5: 64K
       14 BE 80 56 8C DF 7D 7E 61 C5 D3 A8 90 16 56 8A>)
(   2,<2007-06-26 13:04:48.45 +100>,<MAYBRIDGE\nmr>,<NMR_250MHZ>,
      <Start of raw data processing
       ef LB = 0.3 FT_mod = 6 PKNL = 1 SI = 32K 
       data hash MD5: 32K
       ED 35 EE 36 9F DD DE DF 3C 5B DE A8 88 1A D5 F9>)
(   3,<2007-06-26 13:04:50.17 +100>,<MAYBRIDGE\nmr>,<NMR_250MHZ>,
      <apk 
       data hash MD5: 32K
       50 B1 CF 80 8E 83 94 27 2F 96 9A 80 AF B9 47 84>)
(   4,<2007-06-26 13:04:50.85 +100>,<MAYBRIDGE\nmr>,<NMR_250MHZ>,
      <abs ABSG = 5 
       data hash MD5: 32K
       20 47 9D 98 7C 2F 19 70 B8 06 56 3C 6D D1 AA A4>)
$$ ##END=
$$ 
$$ hash MD5
$$ 21 88 E8 2D EE 38 4D 43 3F 76 1F 34 BF EB D1 F6
##$RELAX= 
##$RELAX= 
##$RELAX= 
##$RELAX= 
##$RELAX= 
##$RELAX= 
##$RELAX= 
$$ Bruker specific parameters
$$ --------------------------
##$DU= <C:\u>
##$EXPNO= 2020
##$NAME= <ADRS>
##$PROCNO= 1
##$TYPE= <nmr>
##$USER= <dgb>
##$AMP= (0..31)
100 100 100 100 100 100 100 100 100 100 100 100 100 100 100 100 100 100 
100 100 100 100 100 100 100 100 100 100 100 100 100 100 
##$AQSEQ= 0
##$AQ_mod= 3
##$AUNM= <au_zg>
##$AUTOPOS= <30 >
##$BF1= 250.13
##$BF2= 250.13
##$BF3= 250.13
##$BF4= 250.13
##$BF5= 500.13
##$BF6= 500.13
##$BF7= 500.13
##$BF8= 500.13
##$BYTORDA= 1
##$CFDGTYP= 0
##$CFRGTYP= 5
##$CHEMSTR= <none>
##$CNST= (0..31)
1 1 145 1 1 1 1 1 1 1 1 1 1 1 1 1 1 1 1 1 1 1 1 1 1 1 1 1 1 1 1 1 
##$CPDPRG= <>
##$CPDPRG1= <>
##$CPDPRG2= <>
##$CPDPRG3= <>
##$CPDPRG4= <mlev>
##$CPDPRG5= <mlev>
##$CPDPRG6= <mlev>
##$CPDPRG7= <mlev>
##$CPDPRG8= <mlev>
##$CPDPRGB= <>
##$CPDPRGT= <>
##$D= (0..31)
0 1 0 0 0 0 0 0 0 0.06 0 0 0 0 0 0 0.0002 0 0 0 0 0 0 0 0 0 0 0 0 0 0 
0 
##$DATE= 1182859471
##$DBL= (0..7)
120 120 120 120 120 120 120 120 
##$DBP= (0..7)
150 150 150 150 150 150 150 150 
##$DBP07= 0
##$DBPNAM0= <>
##$DBPNAM1= <>
$$ [...]
##$SUBNAM7= <"">
##$SUBNAM8= <"">
##$SUBNAM9= <"">
##$SW= 20.6930455092707
##$SWIBOX= (0..15)
0 0 3 0 0 0 0 0 0 0 0 0 0 0 0 0 
##$SW_h= 5175.983436853
##$TD= 65536
##$TD0= 1
##$TE= 296.16
##$TE2= 300
##$TE3= 300
##$TEG= 300
##$TL= (0..7)
0 120 120 120 120 120 120 120 
##$TP= (0..7)
150 150 150 150 150 150 150 150 
##$TP07= 0
##$TPNAME0= <>
##$TPNAME1= <>
##$TPNAME2= <>
##$TPNAME3= <>
##$TPNAME4= <>
##$TPNAME5= <>
##$TPNAME6= <>
##$TPNAME7= <>
##$TPOAL= (0..7)
0.5 0.5 0.5 0.5 0.5 0.5 0.5 0.5 
##$TPOFFS= (0..7)
0 0 0 0 0 0 0 0 
##$TUNHIN= 0
##$TUNHOUT= 0
##$TUNXOUT= 0
##$USERA1= <user>
##$USERA2= <user>
##$USERA3= <user>
##$USERA4= <user>
##$USERA5= <user>
##$V9= 5
##$VALIST= <valist>
##$VCLIST= <CCCCCCCCCCCCCCC>
##$VD= 0
##$VDLIST= <DDDDDDDDDDDDDDD>
##$VPLIST= <PPPPPPPPPPPPPPP>
##$VTLIST= <TTTTTTTTTTTTTTT>
##$WBST= 1024
##$WBSW= 4
##$XGAIN= (0..3)
0 0 0 0 
##$XL= 0
##$YL= 0
##$YMAX_a= 298844
##$YMIN_a= -216380
##$ZGOPTNS= <>
##$ZL1= 120
##$ZL2= 120
##$ZL3= 120
##$ZL4= 120
##$ABSF1= 16.44943
##$ABSF2= -4.243742
##$ABSG= 5
##$ABSL= 3
##$ALPHA= 0
##$AQORDER= 0
##$ASSFAC= 0
##$ASSFACI= 0
##$ASSFACX= 0
##$ASSWID= 0
##$AUNMP= <proc_1d>
##$AZFE= 0.1
##$AZFW= 0.1
##$BCFW= 0
##$BC_mod= 0
##$BYTORDP= 0
##$COROFFS= 0
##$CY= 12.5
##$DATMOD= 1
##$DC= 0
##$DFILT= <>
##$DTYPP= 0
##$F1P= 14.0000005364418
##$F2P= -0.99999901652339
##$FCOR= 0.5
##$FTSIZE= 32768
##$FT_mod= 6
##$GAMMA= 0
##$GB= 0
##$INTBC= 1
##$INTSCL= 1
##$ISEN= 128
##$LB= 0.3
##$LEV0= 0
##$LPBIN= 0
##$MAXI= 10000
##$MC2= 0
##$MEAN= 0
##$ME_mod= 0
##$MI= 0
##$NCOEF= 0
##$NC_proc= -4
##$NLEV= 6
##$NOISF1= 0
##$NOISF2= 0
##$NSP= 0
##$NTH_PI= 0
##$NZP= 0
##$OFFSET= 16.44943
##$PC= 1
##$PHC0= -44.42749
##$PHC1= 4.613581
##$PH_mod= 1
##$PKNL= yes
##$PPARMOD= 0
##$PSCAL= 4
##$PSIGN= 0
##$REVERSE= no
##$SF= 250.130018149532
##$SI= 32768
##$SIGF1= 0
##$SIGF2= 0
##$SINO= 400
##$SIOLD= 32768
##$SREGLST= <1H.CDCl3>
##$SSB= 0
##$STSI= 32768
##$STSR= 0
##$SW_p= 5175.98343685301
##$SYMM= 0
##$S_DEV= 0
##$TDeff= 65536
##$TDoff= 0
##$TI= <Analysis number 999999
Compound Code 99
Book Reference 9
Project Code 9>
##$TILT= no
##$TM1= 0
##$TM2= 0
##$TOPLEV= 0
##$USERP1= <user>
##$USERP2= <user>
##$USERP3= <user>
##$USERP4= <user>
##$USERP5= <user>
##$WDW= 1
##$XDIM= 32768
##$YMAX_p= 310080224
##$YMIN_p= -310727
$$ End of Bruker specific parameters
$$ ---------------------------------
##NTUPLES= NMR SPECTRUM
##VAR_NAME=  FREQUENCY,     SPECTRUM/REAL,   SPECTRUM/IMAG
##SYMBOL=    X,             R,               I
##VAR_TYPE=  INDEPENDENT,   DEPENDENT,       DEPENDENT
##VAR_FORM=  AFFN,          ASDF,            ASDF
##VAR_DIM=   32768,         32768,           32768
##UNITS=     HZ,            ARBITRARY UNITS, ARBITRARY UNITS
##FACTOR=    0.157963299565203, 1,           1
##FIRST=     4114.49634093457, 0,            0
##LAST=      -1061.48709591844, 0,           0
##MIN=       -1061.48709591844, -310727,     0
##MAX=       4114.49634093457, 310080224,    0
$$ Real data points
##PAGE= N=1
##DATA TABLE= (X++(R..R)), XYDATA
$$ [...]
28402 -5592 33863 39450 -46494 -70585 -51099 -38999 -20469 -34371 11850 33209 -47136 -81520
28390 -81520 -31387 -48220 -92373 -10336 -9664 -66024 -45556 5607 70460 -2814 13024 68777
28378 68777 31065 36926 48846 34387 96297 134040 190505 212717 232200 162237 152760 127091
28366 127091 38924 8766 25972 30765 52115 28605 72340 139529 120983 29922 -35159 -61592
28354 -61592 -53116 -5807 67802 101204 45848 -15501 2576 -4421 -6317 30398 26627 56730
28342 56730 83419 69142 19791 17795 -69686 -144376 -176500 -132266 -90018 -74804 -43509 -83978
28330 -83978 -92254 -188248 -128865 15617 19566 26511 24736 54586 11075 13140 57679 73290
28318 73290 -7276 -22163 21191 48022 101911 65066 -13016 -46668 -43396 -54421 -80404 -93095
28306 -93095 -10865 42408 2763 -79563 -44672 -102650 -153492 -102902 -54270 -16621 62730 152249
28294 152249 127698 93320 77289 42780 29818 95918 133434 105933 -21357 -70213 -21732
28283 -21732 63590 104416 47246 -13432 45437 108655 61344 -16305 -116492 -106867 -162359 -166459
28271 -166459 -40545 50827 114361 139109 139977 119062 71968 33653 33226 47603 55705 89056
28259 89056 119714 137162 157057 139608 177784 152058 169676 205486 150521 43616 25371
28248 25371 50983 43412 -61216 -96305 -12309 118805 68569 19859 -45367 -114856 -50180
28237 -50180 16234 35997 72689 135115 65700 109251 139820 147228 134704 115139 117856 -291
28225 -291 9282 5101 -39757 -67502 -21190 25044 41131 52334 57228 95900 129613 130624 236206
28212 236206 235764 270525 232748 200818 196585 109591 -42344 -47462 -1368 83628 42725 100351
28200 100351 66838 81015 117143 198175 246924 151736 76435 -3173 -42080 62 16118
28189 16118 43300 44458 61556 60755 52682 40388 69175 79165 33851 13568 -11682 -78337 -66623
28176 -66623 -97202 -33463 -33236 -117496 -167589 -86070 -63196 -56952 66450 92500 24144 -17052
28164 -17052 -2040 34658 22763 -58345 8247 74332 62324 90082 36693 21740 65898 99214
28152 99214 107614 36114 23897 3237 10225 79602 72440 27691 88801 96199 113427 86597
28140 86597 82971 21560 -21306 -61496 -36131 -80819 -67413 62167 83190 66517 138958 85897
28128 85897 -79324 -85566 2058 89444 42208 -33519 -44465 -2107 -48022 -88725 -139839 -45142
28116 -45142 -8623 -56849 -131560 -117238 -82872 -46788 43949 92968 84930 51986 57097 30843
28104 30843 96410 108107 63254 10412 30523 -8628 -42340 -49278 39479 38560 17335 -35605
28092 -35605 -96647 -107778 -166362 -136943 -35309 25492 84388 141227 144899 183514 156344 108707
28080 108707 118021 25690 -55096 38571 26124 16634 67429 121194 -11666 -103447 -60124 -52272
28068 -52272 -61884 -47559 -110320 -162032 -89869 -24843 -16489 8914 -6590 -79933 -31374 -43237
28056 -43237 -18410 -27956 -15868 -27432 -106764 -147444 -90317 -43126 -37901 18937 63874 46885
28044 46885 -6500 -45829 182 41714 -25664 -12513 22606 2050 -3368 -4863 13329 738
28032 738 -55145 -26557 -52957 -106778 -81207 -48401 -27493 -20097 -49591 -55150 -25019 25932
28020 25932 80263 120295 81542 56439 -2618 98800 100900 106578 122669 117013 94718 59023
28008 59023 14035 53631 105879 171522 129983 17091 -21592 -61614 -43517 42218 48350 69465
27996 69465 69021 -12759 -73260 -110380 -125456 -81916 -13247 101206 12306 -84714 -28209 -483
27984 -483 5184 -11419 15117 4800 -28343 -53866 -70546 -89637 -22192 38949 55554 34552
27972 34552 7342 77935 100638 57296 66644 101262 24358 -52389 -40234 61476 57151 75688
27960 75688 28387 38432 104669 142307 108404 120712 74094 119269 133677 32273 2018
27949 2018 81730 128433 153648 54294 -30016 -14012 -29626 -33861 -4707 -25011 -9838 -38202
27937 -38202 -13283 -35552 -21474 -124600 -142042 -55866 -94224 -132936 -137625 -127366 -43080 15578
27925 15578 -16091 -51058 -45668 21847 41114 8569 -57645 -77890 -85026 -76995 -77307 -116428 -110687
27912 -110687 -122593 -93575 61777 55667 28596 48208 50293 99156 84474 53135 139737 133613
27900 133613 117032 80994 124911 187180 174976 90708 -46094 -98617 -82118 -20160 -47531
27889 -47531 -13153 9104 -87862 -169692 -128689 36719 130522 87186 39079 31754 43125 -3965
27877 -3965 18232 127274 100419 -46646 -38282 20234 65491 42903 21436 80812 70255 28784
27865 28784 69079 70500 16991 -25551 -9866 9975 60112 -7807 -41207 -7015 -21085 24497
27853 24497 42533 65493 52443 64631 49337 -2841 -103903 -105298 -65056 -34403 1595 14278
27841 14278 -64390 -92527 -50520 -88443 28226 10954 10576 44854 10744 -3909 -9093 103872
27829 103872 192978 143476 68413 92109 80338 100165 43695 -22278 -3988 -6557 8290 12915
27817 12915 -6583 86089 72362 6354 7408 891 -42176 -58021 -88435 -48644 -11954 -54828
27805 -54828 -30121 -71893 -167353 -170353 -138031 -103849 -92113 -75763 -84595 -65601 -17983 48659
27793 48659 34569 -35315 24596 23370 11454 23484 -10815 -44590 26633 65844 59988 7302
27781 7302 6760 98104 111867 108290 137107 99802 43636 -64813 -69346 -46313 82552 71074
27769 71074 16220 -32746 -22813 -32846 -42681 -44011 -63343 -35049 -15127 -55196 -87796 -35524
27757 -35524 23194 32632 -9780 -58843 -93727 -71977 -40846 24436 -4408 -70875 -71137 -69045
27745 -69045 -35339 51863 1437 -31581 -17673 94897 205822 165678 49666 18515 -32456
27734 -32456 15521 72428 8222 5364 -13086 -9914 42822 64982 37070 112654 184353 188114
27722 188114 91300 117602 44826 43522 71210 66260 -20784 -89620 -67877 -20463 -50948 -72187
27710 -72187 72645 128242 97768 119141 178613 70671 17951 16692 76450 75802 42216 10918
27698 10918 -66560 -104713 -44332 26336 13908 266 -9003 -66878 -20443 27981 -12089 -78615
27686 -78615 -137254 -22419 55521 -55055 -114074 -103321 -43243 -51990 -168683 -103654 47252
27675 47252 25474 28870 74431 91836 68929 48025 -20867 -36878 -63329 -74080 -8948 83958
27663 83958 112444 93225 86018 52855 47682 48239 37830 131003 81014 28732 -23544 -44679
27651 -44679 -67706 13578 91160 34203 -34449 45094 57051 5784 14390 60601 131605 88911
27639 88911 65826 100792 56118 5553 72075 95386 68490 20950 -79840 -150741 -111260
27628 -111260 -142984 -122200 -46330 -4524 -16459 44341 94948 61488 78469 70343 71426 56824
27616 56824 -2196 -4278 -45605 -4495 32411 5720 -49297 -65381 -45259 -36390 -29597 27276
27604 27276 68487 31718 107375 201454 112461 80078 94940 85221 36998 -826 -30827 8917
27592 8917 10108 17623 -42071 -103389 -124085 -84824 20408 -23549 -57573 -24005 50958 143221
27580 143221 114515 -7839 -30494 -15689 -42998 -1546 -12072 -4434 -44399 -38867 8235 74832
27568 74832 52055 34179 148202 175941 115075 105063 103782 79623 86678 10981 -68597 26365
27556 26365 88090 44891 23060 -16857 -57240 -36298 -141800 -192972 -219006 -162162 -75233
27545 -75233 -159435 -146844 -19161 35586 72165 -11833 -66717 -16857 6258 -40700 -75898
27534 -75898 -79173 -5791 16088 25989 11789 -3130 55442 87783 55245 6915 -8593 13034
27522 13034 -11348 18500 20339 44611 44042 74387 -19640 -138705 -148805 -124475 -86293 -7664
27510 -7664 -55377 -45329 -27696 12209 27814 -83086 -103571 -34382 -33304 -42085 -56816 -68313
27498 -68313 -113912 -108112 -42788 -59594 -52868 7063 -20851 -12681 -20481 -157383 -167138 -13739
27486 -13739 -377 -19771 25287 146014 81120 14263 -55914 -56817 -98176 -88066 -44847 26012
27474 26012 49838 32569 36320 -13575 -36991 5814 7999 11708 16439 4897 62053 55478 -69703
27461 -69703 -109895 -81675 -68524 -101918 -88394 -36498 8018 -8205 -35509 4547 -52372 -76204
27449 -76204 -130146 -152304 -148966 -63453 -5430 -75297 -117001 -57415 -40775 -93453 -85232 -101609
27437 -101609 -96046 -100677 -102831 -112935 -110924 -83581 -102118 -75670 -80704 -88370 -94386 -95369 -20951
27424 -20951 -7873 -14373 24813 87908 105511 42401 -56641 -87989 -12672 85060 46849 8612
27412 8612 36636 -36340 -143757 -124740 -141813 -96446 27769 13179 4892 -40169 -74329 -69493
27400 -69493 -60171 -26729 24764 66874 52446 16477 -7313 -22060 -44991 -59149 -66017 -19156
27388 -19156 44385 36064 44820 -4542 -47832 -68741 -7717 -52791 -72403 -92772 -159334 -122227
27376 -122227 -90852 -157745 -183268 -112286 -126150 -97390 47395 20405 10257 -13729 -94639
27365 -94639 -137654 -139235 -197488 -199589 -185986 -154367 -40043 59225 3757 -45585 -10129 27629
27353 27629 14331 24781 -4614 -81384 -134146 -109809 -72059 -57578 27535 77604 73046 62804
27341 62804 147521 122982 -30672 -19990 7919 -38125 -30815 -49325 -25667 840 -43744 -55020
27329 -55020 -59151 -81693 -68630 -62502 -52898 -77442 -103256 -43663 42081 -5819 -27731 -26135
27317 -26135 15665 27465 46837 120393 54417 -50759 -72344 -53108 -38517 -36796 14733 -13030
27305 -13030 -97681 -141021 -99370 -110588 -126578 -67682 -34910 27772 67474 18289 -51357 -98060
27293 -98060 -78053 -104720 -49413 -96802 -67472 -96307 -93202 -60432 -23334 -11328 -28301 -74921
27281 -74921 -139783 -131223 -78777 -73827 -67605 -10620 54053 111094 114241 -11004 -108233 -85678
27269 -85678 -140853 -165227 -100322 -13095 126346 177359 95700 16015 -6141 -1027 68345 75776
27257 75776 17339 41266 68604 95962 78735 80891 4275 -39531 -19085 2706 -26321 -65554
27245 -65554 -27288 18866 28907 78727 94515 40717 2382 10861 6893 47907 125828 151530
27233 151530 95215 63897 -322 -5649 -13651 -59551 -15176 67879 72815 68657 39037 50287
27221 50287 13177 -57717 -92319 -34541 38000 113094 59970 -64914 -144160 -106487 31963
27210 31963 44589 35991 55885 16859 12875 -9396 -18828 3509 21383 57274 50931 144482
27198 144482 176281 178776 118159 137975 123154 24389 26262 3395 -49448 -15616 38177 150008
27186 150008 207716 67427 1385 7152 -21618 -28393 -27363 1399 50868 115571 121476 68303
27174 68303 118704 158249 141591 121343 70525 -67279 -93620 -45008 -39634 -36825 -52738 -65676
27162 -65676 64709 103484 62571 10622 14457 19895 -33864 -39729 -47574 -49039 22823 21031 -10339
27149 -10339 12767 60835 113961 108153 39744 9128 46130 66991 -97871 -113741 -106573 -83209
27137 -83209 -58674 51089 2006 -41908 -48076 -83447 -102774 -84778 51087 99637 65331
27126 65331 38983 -35171 -47477 -23575 5581 18067 -11776 57952 87703 -24809 -83189
27115 -83189 -123194 -125010 -77852 -23630 45778 46121 69742 58743 -14175 -29670 -27771 28310
27103 28310 55821 9958 -11006 -34710 9079 -650 -30510 9467 24552 30376 66350 30256
27091 30256 38973 104785 125305 138258 80523 20154 99439 134616 58130 -16999 -44852 28180
27079 28180 33539 -25091 -71519 -87048 -49008 -17420 -12400 -65531 -100238 -31352 85794 97951
27067 97951 -41911 -125559 -73941 -131674 -60527 55223 33817 86135 102772 -5154 -77209
27056 -77209 -71560 -3492 -36781 42513 83769 -247 -74457 -66560 -91589 -129483 -62485 9362
27044 9362 52322 -4410 -30164 -73440 -73760 70984 118117 54634 180294 264229 230151 139573
27032 139573 45649 73385 18103 -20059 23732 1446 -16465 31050 -18639 -94865 -97564 -70555
27020 -70555 15446 25212 8007 -6071 -14297 -55569 -148624 -111506 -67548 30001 76968 -39901
27008 -39901 -16939 69050 16596 -54058 80084 190941 127571 76367 56737 -19204 -70378
26997 -70378 -45227 3243 -49129 -103717 -121641 -131195 -104549 -75177 9286 40179 15418 -20953
26985 -20953 45523 34488 25450 1909 -63916 -90443 -64605 -43587 7435 61189 155446 165573
26973 165573 46292 -46050 -5911 -36938 -82405 -44148 40620 114367 106494 40505 12433
26962 12433 33370 15609 4612 -2330 60768 94900 77148 6929 -31456 12162 83621 86222
26950 86222 3526 17180 65117 21514 17161 37383 60395 24727 -29840 -57754 -87866 -70236
26938 -70236 -40448 -40787 -119810 -183787 -125458 -32432 -58673 -38291 -24998 8581 3461 51526
26926 51526 14816 -16268 49550 77867 -78752 -159507 -144732 -71896 17136 84843 18482
26915 18482 -62560 -73273 17658 59812 43292 123697 114891 -2176 -44814 -7758 19435 42663
26903 42663 -93018 -95741 -132358 -119918 15726 -48874 -106611 -70753 29111 92660 48423
26892 48423 -8328 -80556 -38077 -28741 -101515 -184718 -173272 -96024 7974 20939 -42348 50627
26880 50627 109478 32479 -12914 6032 41015 -1151 23972 -9675 -9190 123887 42031 11167
26868 11167 -105344 -159444 -219815 -243299 -105060 -74428 -50229 -122132 -136904 -101207 -26580
26857 -26580 48294 27934 -21520 -17275 26416 34875 -1044 -765 66574 78097 45385 -14136
26845 -14136 52431 64812 50428 10813 -38151 -95112 -130530 -90196 -17676 -25683 -54479 -12735
26833 -12735 28486 79680 52105 -20894 -132543 -121402 -65315 -25652 60322 32048 -611
26822 -611 -65223 -40230 -20699 -103169 -68257 -9689 -25006 11169 -21717 -88146 -49147 2402
26810 2402 11553 -81263 -101585 -46723 -27213 -13126 12812 10442 18980 -13376 -93675 -102953 -116576
26797 -116576 -122423 -138759 -122914 -122627 -155035 -155756 -174363 -169987 -147729 -132399 -95971 -57926 -73996
26784 -73996 -136897 -200379 -179887 -143871 -130343 -44123 -87040 -77123 -122199 -79650 -57346 -37633
26772 -37633 -47005 -125640 -145525 -103002 -112304 -182533 -101945 8656 -40240 -68542 1519 -9007
26760 -9007 -42946 -113355 -164196 -161374 -101469 11426 105244 71939 -7674 -27611 15377 51850
26748 51850 109392 104264 34710 3917 66678 57331 -470 -5008 35949 46343 -38309 -112723
26736 -112723 -12230 -15338 -10647 -32150 32160 83468 76536 -2502 -9303 44786 88847 112329
26724 112329 166669 112152 109185 100420 147328 214575 153087 65666 3909 -41499 -3574 86941
26712 86941 107882 91251 23871 -42714 -41275 3154 54386 170250 89980 -77207 -174265
26701 -174265 -168362 -118619 -81513 -17555 3385 -47241 5737 44428 11846 63161 68895 -27763
26689 -27763 36495 44824 2232 22284 45958 141191 204947 165625 31433 -116116 -124024 -76556
26677 -76556 21522 95859 142688 96003 -27665 -80309 -57249 -27892 -16643 -45956 -13079
26666 -13079 -31756 -16934 -35809 -33892 -55724 -81548 -55002 -32122 -93955 -164990 -168793 -25126
26654 -25126 23788 -8861 37072 39019 70559 39299 34627 26386 66252 73922 54280 40208
26642 40208 90515 120254 83417 57694 16010 54024 35584 2459 36191 -1020 -12645 14383
26630 14383 26903 73072 146271 3408 -46520 80440 123226 24104 61290 37804 -14044
26619 -14044 -58886 -36942 51625 61663 111143 74459 71548 199495 209845 84713 17303
26608 17303 343 -33936 -77029 -56216 -65106 -18995 41267 57833 50996 62223 833 -37288
26596 -37288 -45403 29360 28930 39190 43673 -19091 4095 48048 -14218 24663 101299 85531
26584 85531 36308 -23063 -55548 -88136 -78416 38441 137272 186177 91075 -19497 -42167
26573 -42167 -9321 -49838 -33376 -36500 5481 30104 65191 85692 107631 -8246 -52907 -23148
26561 -23148 34422 36638 27937 5431 21485 32197 104218 109225 59752 43127 602 -26608
26549 -26608 -43455 -35234 36506 24009 66063 167950 205235 206933 172161 148397 145107 116498
26537 116498 94880 -15438 -48710 46030 51974 -8348 778 -4762 -55947 -73466 -27766 28543
26525 28543 15759 3874 8958 28467 96076 117329 53129 -11660 -48141 -87855 -117638 -70705
26513 -70705 -76715 -28132 898 4205 -32645 -52240 -56056 -70521 -23603 -47840 -161279 -128512
26501 -128512 -169692 -117207 -49845 -33860 10685 77085 43680 26818 -35469 -84057 -98600
26490 -98600 -95474 -30147 44773 46752 9578 13233 -31464 -65811 -108775 -92446 -30491 -99974
26478 -99974 -95934 -33968 -87357 -79445 -18005 68702 103730 62138 95028 169887 188733 131323
26466 131323 164905 148101 91687 98284 103043 104830 99659 2528 -124597 -71877 -15829 -11698
26454 -11698 -16751 56514 3523 -46288 20421 65423 24516 7825 47806 4332 -49111 -76173
26442 -76173 -63394 -11532 -13818 -64873 -102378 -103513 -107228 -64032 -7221 53584 27917 -26610
26430 -26610 -33016 -10456 42750 99047 32302 88120 12829 16780 -17959 -29418 -31379 -2020
26418 -2020 44491 42646 7638 14976 20157 48682 97629 186133 149693 151683 127796 77193 106291
26405 106291 138137 163383 128911 13891 -9257 -10439 132276 203040 97972 141862 129437
26394 129437 32908 -22024 57437 94938 88043 173163 221572 147766 37162 16827 -22237
26383 -22237 -102545 -104958 -44573 -7979 30224 -31342 -70081 -66435 -22458 11291 11451 41336
26371 41336 42931 71332 63493 55226 47257 15951 -51107 -117717 -142318 -202542 -152863 -35445
26359 -35445 48049 39949 56451 91355 123883 75613 -9642 4757 -23895 -27353 -62909 -59820
26347 -59820 -17559 -43721 -48509 -6077 58385 64417 132391 149738 53887 -4624 96135 31147
26335 31147 -94304 -93206 -54958 21856 45517 31789 69158 34104 38713 18705 4935 -7905
26323 -7905 10805 18622 101549 68296 38343 62194 -21438 -97737 -113678 -77799 -80491 -16050
26311 -16050 51458 51574 97662 91759 17670 -69400 -133971 -118298 -59579 -10094 39373 50827
26299 50827 34063 59268 19771 -68623 -41712 50266 16748 -25222 -30997 -26324 81045 27824
26287 27824 -47085 -14996 -23435 3676 -5682 -48283 -77725 1270 19038 -24012 21794 78100
26275 78100 15275 -79313 -84627 -17174 47614 55246 -60525 -65922 -28985 -88759 -88966 -74584
26263 -74584 -26810 60824 74766 83011 117798 83462 27948 -74504 -124575 -121665 -43602 60600
26251 60600 52197 83980 -14574 -129342 -57661 -9623 74502 132244 173093 153822 117196 54088
26239 54088 7174 53341 169342 195551 80811 11938 72510 22778 -35274 -112996 -133550
26228 -133550 -186304 -238076 -186718 -124350 -81753 -47560 -37234 -34398 34450 72224 72732 86901
26216 86901 -65709 -177713 -102462 3635 8477 13651 54485 59046 -904 -33659 -100545 -71047
26204 -71047 -65212 -45196 -73340 -56472 -66039 -94279 -114881 -131707 -33453 77045 177330 149014
26192 149014 44418 3493 -37664 -22358 -40269 -94668 -90527 -144579 -99388 -32678 -44332
26181 -44332 -18881 38742 98845 107577 128664 184176 117625 106976 104055 41165 -57568 -34228
26169 -34228 -4673 24383 67135 98295 17191 4713 -34044 -165242 -129233 -47166 10555
26158 10555 -7043 -15987 -16056 -529 16711 34478 85937 96805 89211 11776 20442 -10157 5109
26145 5109 6007 87971 134965 115205 1400 -66063 -72343 -94345 -57041 -11518 -22270 -22518 60115
26132 60115 58071 69610 86746 95387 84781 7545 1852 39911 147679 158140 116731 59270
26120 59270 27296 50412 32991 25132 28994 77562 144410 118800 21198 0 9725 29944
26108 29944 43321 63394 -2410 -16191 60541 115986 -1247 8188 59014 -20972 -69195 -46943
26096 -46943 -67169 -34821 -43504 -61551 -48807 7020 62055 -61782 -23164 -20434 19455 54703
26084 54703 3410 -5832 13877 426 36776 21365 -3231 -21364 -56765 -34610 22527 -74425
26072 -74425 -61487 -5710 -481 -26131 -17721 43767 86394 81257 84387 102998 85050 24142
26060 24142 2233 -45806 -60714 13 -72458 -124347 -208028 -214711 -184599 -109110 -69281 -31308
26048 -31308 -4610 75505 137891 163988 126778 95908 100723 52314 -60383 -19273 69705 12792
26036 12792 -3211 -25260 -1720 -524 -113657 -85222 -60649 -93724 -126378 -138086 -121577 -36774
26024 -36774 25368 60197 140921 207936 192133 43554 -49270 -56731 1510 -113860 -104292 -37671
26012 -37671 -10407 -24189 -13581 -14480 -57039 -27497 165391 156790 77227 -47451 -133932 -147195
26000 -147195 -136498 -86762 -76419 -42665 -50048 -148644 -137466 -81039 -93602 -138351 -108589 -51905
25988 -51905 -47294 -88313 -49384 43020 -46519 -121669 -104108 -115870 -160808 -167737 -71757 -24137
25976 -24137 23155 65657 -41860 -67245 -55291 -43927 -100760 -102983 -48784 115734 206281
25965 206281 119666 95985 44021 -15684 12519 3368 60619 118012 125810 -3209 -101669 -134716
25953 -134716 -159104 -120322 -17261 93967 105528 105659 27494 -77340 -2847 70292 77612
25942 77612 56728 21423 -136567 -172222 -42819 81715 -24696 43519 110991 97586 52753
25931 52753 64139 34538 -26984 -8359 -53647 -139058 -252627 -117249 -111120 -109507 -98830 -168620
25919 -168620 -170825 -100003 -76466 -127424 -126478 -67723 -304 26984 29475 -51270 -141404 -131237
25907 -131237 -105759 -71114 -84707 -51766 -8652 17994 41367 54604 8697 -77703 -58547
25896 -58547 18308 -51825 -116104 -116241 -163407 -149805 -95139 -69253 -151871 -230091 -233206 -133802
25884 -133802 24447 69807 67471 48820 -8939 -35047 -6833 63514 74636 40691 94409
25873 94409 81208 108450 68346 -8551 -2581 28281 54525 93855 102786 48636 41727 10194
25861 10194 -40889 -37791 70890 87672 66874 42505 -11255 -87802 -62936 29949 87198 52779
25849 52779 -59802 -53710 32864 78809 109322 45992 9656 8346 -36486 -36968 9683 120218
25837 120218 89164 100583 -35618 -110350 -103365 -42873 -60756 -119241 -75688 -47041 -82510
25826 -82510 -52419 -42932 -21874 -21107 -84497 -49358 -12741 -31767 -65738 -73962 -49304 59199
25814 59199 41456 -76875 -112182 -62581 67957 26592 70450 16113 -53235 -16251 169484
25803 169484 169279 33725 -14807 -17052 5 -14205 -104615 -168890 -114669 -51227 -36579 -30532
25791 -30532 -100325 -71799 16805 -22699 -91023 -88050 -199435 -244996 -228914 -132749 -93674 -126486
25779 -126486 -112064 -55245 -24233 30588 55550 40661 70982 44555 -5868 -20164 -24967 -9869
25767 -9869 -51387 -7628 23503 71812 183422 171568 35202 30496 52596 17075 5715 18274
25755 18274 45121 61696 61872 65848 29071 -7636 20282 -38019 -101992 -22364 7458 74662
25743 74662 107605 112314 150308 13159 -42007 -674 -33129 -79508 -11625 4606 67781 25804
25731 25804 -8030 44498 60435 62145 56917 -19376 -55080 37709 37797 48740 -10829 -76262 -82261
25718 -82261 -157061 -99342 33278 55999 -10324 -40078 -75789 -89145 -117924 -109094 -22987 44907
25706 44907 42801 107332 216586 261522 278034 276148 207982 73712 -54794 -44445 102117
25695 102117 130968 107790 100472 38269 79558 9059 -67545 -47576 -14433 33466 19005 152851
25683 152851 137256 34482 36442 83987 131113 144770 135974 139899 77161 62845 111947 107470
25671 107470 -40925 -115941 -153419 -121356 -70879 -43103 22324 14941 -16820 -55613 -127801
25660 -127801 -84847 -56822 80171 142734 108808 163763 90302 647 -8565 11636 -29632
25649 -29632 26646 89252 72005 26077 -1070 31960 11272 -16864 1439 112928 114374 24543
25637 24543 29475 49073 32291 -51659 -15243 -1337 -70259 -72591 1960 -80841 -79854 -60462
25625 -60462 -55438 -28158 -53295 -40727 -29552 -30029 -23008 -58189 -14022 -3790 -50198 -35883
25613 -35883 -77269 -109254 -131969 -120025 -96174 -54617 12560 34669 35561 -15591 -100594 -138056
25601 -138056 -157192 -136055 -40440 -9391 -36428 -46478 -29662 -58278 -77511 -116669 -81327
25590 -81327 -21089 76922 70839 5874 -54689 -8587 78027 15140 -95364 -99234 -42252 -83775
25578 -83775 -61350 38452 78624 -3845 5686 105111 143388 151789 18245 -44066 -13447 57043
25566 57043 -3710 -10863 1921 -2083 45378 10941 8719 311 64875 -26265 21443 1447
25554 1447 36552 10683 13117 -4178 -3925 -35588 -4194 48097 27859 -2115 13542 14656 31898
25541 31898 9086 -15662 48242 53955 126523 132091 48100 45981 49926 -9904 14920 35032
25529 35032 15175 35077 76288 43168 43611 15497 42038 8844 -2591 15388 -14638 -48773
25517 -48773 -15751 -45563 -89004 -61077 -19577 -57425 -163486 -232119 -208439 -203167 -101224
25506 -101224 -58676 -66895 -54570 -14604 11627 100979 118880 127005 22553 -60175 -43040 23729
25494 23729 66739 138106 151418 155102 133899 61828 32987 62242 6061 27621 92051 138783
25482 138783 78333 3084 -17318 -4665 -7047 -50619 -61709 -54830 -34033 -72335 -69581 -55796
25470 -55796 -81812 -82096 -73121 -139301 -141848 -103902 -50367 -14678 -62751 -25556 -16945 47003 94679
25457 94679 48002 168812 139086 79917 36870 12631 -6216 -65887 -109288 -63426 5092
25446 5092 -49625 -56473 13346 38800 40171 76592 135448 118801 117715 12802 6451 38495
25434 38495 -15075 -53798 -90717 -123118 -117833 -83063 23232 75555 109843 25230 -39049 -40853
25422 -40853 12296 37022 60344 112307 103790 8864 8809 -28611 -98030 -90671 -47623 -4074 22349
25409 22349 7965 -19751 -36428 -63243 -66394 -27798 -45329 -26458 -35164 -130311 -115385 -48303
25397 -48303 3676 56033 47351 4955 111424 144084 141314 214774 137220 5292 -657 29621
25385 29621 47593 12276 27598 -31129 -99900 -138899 -155171 -132204 -54382 29191 91943 115805
25373 115805 132417 117686 38582 -64533 -98837 -104728 -75018 -80646 -85934 -55162 74156 67170
25361 67170 -51249 -6712 -19292 -32109 -107177 -170749 -95425 -392 61913 -27989 -56987
25350 -56987 63634 104925 110338 22497 -33328 -89966 -90095 -63130 -66403 -93427 -94904 -64771
25338 -64771 -17005 53051 27064 -35120 -22230 -19791 47561 17938 32444 55624 65673 85113
25326 85113 108336 55472 -13634 4790 119254 883 -59985 -76904 -49789 47406 55144
25315 55144 3668 -36812 -118354 -141668 -22089 41718 15820 -58398 -47395 -43097 -34721 -89988
25303 -89988 -15204 -51099 -33411 -145118 -172312 -124945 -83334 -67131 -45175 -53755 -6899 -31943
25291 -31943 -65174 -26407 -54140 -65804 -13453 -85935 -77367 -23994 -59879 -12505 52887 4474
25279 4474 -51649 -21957 -38644 -31327 20216 135145 155416 79389 43125 10966 -3943 -22979
25267 -22979 -8042 51333 93479 23546 -151043 -212120 -164118 -120726 -54445 -41023 -110876
25256 -110876 -50797 70178 110774 78893 76966 53397 41307 -20409 -29194 145177 176171
25245 176171 66507 5250 -15656 -16361 -10653 -45991 -16601 -65285 -82984 -34711 103735 47700
25233 47700 87837 162424 82417 1369 50896 27660 -68930 -112694 -33578 -34451 -15894 104643
25221 104643 134005 94011 99604 29633 -64692 -41641 11894 -25198 -37553 31766 -59230 -88253
25209 -88253 -81122 -40031 -19835 38550 55748 11687 4751 46173 50430 76690 136778 58956
25197 58956 5139 -8848 27243 63768 75881 24455 -25578 16660 99063 130792 92008 73954
25185 73954 165158 201568 134718 110423 62652 -10232 -27514 -3384 14145 -34949 -104709 -136401
25173 -136401 -48241 70210 120119 152892 47256 -72655 -47984 -34869 -80320 -60837 11443
25162 11443 34635 -45888 -55310 -13566 -84602 -135306 -116013 -58488 -32232 7802 118504 99283
25150 99283 93302 39620 -28582 -7089 14131 5005 56062 -3279 -29442 -59098 -47211 9066
25138 9066 120080 113772 78894 29414 23782 24666 -48854 -40433 -15374 7215 31864 -79402
25126 -79402 -102047 -30386 -54843 -102668 -82372 -46340 -10483 -51182 -60048 -17595 8668 39997
25114 39997 45903 6951 -83078 -75811 -79084 -49248 -12216 4573 -57516 2787 136399 129186
25102 129186 45718 -47737 47371 80406 5249 -105298 -37282 -61863 -37192 -70673 -22007
25091 -22007 -13307 -64338 -86139 -57814 -58198 -80009 -52700 16873 78562 -7097 -108617 -37663
25079 -37663 39665 16778 -16946 110625 136844 87424 60856 -71382 -89700 -40714 -75763
25068 -75763 -56600 591 -26356 -157191 -154895 -127473 14632 61429 -3075 -81789 -87101 -16998
25056 -16998 15708 -30747 -89387 -15015 66915 88998 105502 79731 32203 -51867 -132073 -162169
25044 -162169 -201610 -201687 -132171 -67447 -88061 -32679 5873 48330 10657 -50504 -134421 -172493
25032 -172493 -113161 -74672 -39587 -80055 -109058 -107357 -61688 -65777 -119910 -191546 -132216 17118
25020 17118 -64406 -54925 -53744 -83280 -82572 -64845 23128 66981 -20624 -60444 -48438 22635
25008 22635 53289 -28038 -12424 13155 -7781 -50293 -71360 -54709 -9095 44570 72971 94943
24996 94943 63486 35820 22819 5398 -41868 41126 33925 37049 24625 56948 7116 -162426
24984 -162426 -127545 -81916 -17752 19858 98893 170594 165035 200217 243537 174468 141946 131016
24972 131016 95762 108096 81996 56956 797 -86145 -53056 -78743 -44000 -22890 3758
24961 3758 103818 125648 138728 148832 100022 128200 130421 104412 119454 120012 106547 60176
24949 60176 64105 -3068 7544 -17091 1389 -40209 -69120 -83714 -97773 -32509 34053 11898
24937 11898 -48952 -46136 -12743 32834 695 30599 29469 -28702 -51468 -103952 -103875 -36508 9027
24924 9027 16471 -2085 -4918 -5660 -64615 -93798 -145265 -79119 -2862 -41429 -36249 -67031 -115577
24911 -115577 -53559 31774 67109 97180 19689 -104533 -150187 -143219 -79134 -64385 -22878
24900 -22878 -46666 -71423 -37174 -43359 -93122 -108574 -14086 40614 -8443 -12030 -18294 18782
24888 18782 108344 -3613 -42271 22600 17877 -93638 -108771 -90605 -95011 -28085 -88681 -78361
24876 -78361 -12062 74629 74080 67393 53106 48302 64334 -74468 -97430 -89822 -16636 68951
24864 68951 132907 21433 -79607 -49876 -34665 -56128 -47235 -36811 9552 -32929 -65469
24853 -65469 -24131 28818 79422 83927 100120 102738 140898 110588 100241 105537 4444 -75327
24841 -75327 -28722 106909 179524 194227 87135 92898 92849 110289 114738 25820 -123067 -121677
24829 -121677 -16685 -32602 -67534 -75196 -106059 -90976 -24361 734 28802 87620 95955 60298
24817 60298 -25507 -80757 -50705 -11365 -36043 -50756 26992 98165 77796 -55040 -56514 6830
24805 6830 23914 50296 55423 340 57395 38913 32451 55286 76646 159040 162552 71621
24793 71621 79607 99265 65368 61348 65235 15604 -35627 -133657 -122197 30409 51967 56957
24781 56957 2610 44025 136607 53409 -25486 -112312 -95340 -85852 -101342 -114247 -62185 -89168
24769 -89168 -1413 70754 71538 55070 9472 -4748 70265 65429 56924 5002 15044 40264
24757 40264 53419 67565 72800 66144 59893 30585 -1125 6805 59709 14744 6480 116305
24745 116305 118101 66065 18045 69179 47781 -90492 -115426 -99621 -156163 -58374 10738
24734 10738 -70298 -83906 -41147 -87369 -102697 -84391 -81762 -97938 35188 81526 38933 -11320
24722 -11320 -10721 -19338 -68661 -14325 57750 38731 -30975 -38573 13800 8490 22966 64504 62590
24709 62590 83010 120946 153564 122918 126028 78174 108703 133903 110586 112272 113197 93137
24697 93137 75043 66693 130436 148279 82364 109543 152374 125490 93466 35168 1149 -19897
24685 -19897 -49150 -110298 -176666 -119188 -49494 -83583 -87084 -56943 -8319 -118816 -81300 -6209
24673 -6209 83488 61994 -6619 -66389 -99096 -85546 -44098 36360 57064 -14398 -94856 -113272
24661 -113272 -157276 -148381 -101227 -103376 -125694 -113155 43897 119924 129830 115644 76689 48457
24649 48457 3959 59269 102566 133024 141088 130232 86265 50150 36207 76798 118712 130205
24637 130205 177380 156899 14799 6328 14947 76313 80119 -14178 28893 161445 134159 174454
24625 174454 129694 -34755 -195751 -153802 -76887 -36388 50866 78807 97143 57501 -24540
24614 -24540 -47614 -6479 -10607 -32724 -109727 -23834 50679 12489 -23583 -53377 -48257 -39500
24602 -39500 -13690 934 -26456 -10118 49101 138532 111884 55271 -25848 -45001 -74095 -31051
24590 -31051 53469 52141 29551 91983 59050 140507 174690 45769 -40562 -29827 -15384 1167
24578 1167 31980 30656 26102 27328 -15852 -23488 -58564 -91924 -102839 -97586 -35938 -52018 -12414
24565 -12414 21839 60327 16853 -7894 4330 -8999 -2559 78907 41882 18876 23080 50875
24553 50875 136896 112633 138213 172214 134214 82022 113036 128727 86976 10865 -15381 -10867
24541 -10867 -15699 19245 65435 56956 3199 -83791 -54355 -27745 905 73846 89863 42971
24529 42971 28574 54043 28040 -37109 -80999 -114008 -106355 -60719 -35246 -11179 18303 -52334
24517 -52334 -93176 10674 99000 98444 66855 -27903 -58770 -3202 93755 55599 20492 23518
24505 23518 28848 -7792 -28115 26375 36383 -3253 10298 52168 62993 67602 30370 -65292
24493 -65292 -59032 7607 68136 65323 75321 74953 64269 -13969 25609 60815 -21941 1525 39117
24480 39117 109282 159631 187567 206233 164169 51101 34467 -41636 -28636 -16526 -18511 -1731
24468 -1731 12340 12706 83192 104474 121785 84256 104339 115322 52733 -43149 -131223 -150126
24456 -150126 -137372 -93497 -86376 -72201 -3422 127144 151673 45110 -37318 -13540 -81065
24445 -81065 -70591 -119285 -122469 -7258 43519 -18431 -82501 -79834 -99009 -43056 -24536 -65597
24433 -65597 -29570 -9695 37123 93255 109914 102672 134449 79664 33354 35323 13640 -11612
24421 -11612 -30863 -30206 17940 41695 135035 126516 43333 -46571 -157670 -155290 -118908 -143054
24409 -143054 -69221 -63743 -85972 -109955 -70559 -104968 -66390 -42786 -50359 -44743 -143717 -168813
24397 -168813 -48490 9534 -22756 -138377 -130382 -80129 -61608 -97829 -123059 -84006 -26551
24386 -26551 -23026 -49162 -99438 -196380 -175055 -181002 -130252 -97832 -88844 -25016 -41166 -63532
24374 -63532 13833 47713 82691 74864 4656 63509 74349 59541 123988 178523 167583 74513
24362 74513 28164 59713 98292 31048 -74565 -174801 -124989 11767 51171 -95698 -95661
24351 -95661 -35772 4372 41400 -4194 -16709 31481 41434 -92732 -181928 -141394 -49160 76316
24339 76316 90990 55057 -102266 -142810 -102306 -66954 -64676 -28254 6214 60370 77818 -6564
24327 -6564 -7774 -72873 -14309 41857 47376 1778 -105855 -79903 -20197 4770 -70453 -58936
24315 -58936 -124207 -45126 37955 70815 92552 52727 105308 81220 68883 95835 55871 -26732
24303 -26732 -51969 -50352 21547 42249 11669 8935 46346 117973 181531 63132 33073 54586
24291 54586 20419 -16878 61438 60368 48444 65455 87657 194608 147607 89242 112863 180542
24279 180542 141507 76051 113126 87125 3712 15398 96706 92356 88270 26703 -51428 -76062
24267 -76062 -31373 31142 35116 80656 40278 2560 -30580 -27090 47669 129452 29794 -71899
24255 -71899 -105929 -8001 93704 60811 644 -47887 22618 61354 35677 -41868 -95225
24244 -95225 -105212 -90693 -100356 4930 139230 187155 161211 184151 82512 45156 23776
24233 23776 54443 64978 77954 45378 50371 13873 54824 111796 163338 81021 35494 88618
24221 88618 38303 -3771 -14243 -17376 -75119 -116283 -179354 -139450 -85810 -84603 -28765 -1841
24209 -1841 37728 85833 56639 1589 13043 -14456 -30098 -13674 -35362 -66201 -80843 -93028
24197 -93028 -73654 -128257 -192746 -139230 -79596 -59575 -109966 -96827 -34396 33901 57564 1650
24185 1650 -20647 14905 2996 5137 30656 76043 65924 67404 79036 3461 -80802 -24963
24173 -24963 18819 -47663 -63470 -40701 22249 63890 99101 111994 92819 75950 82567 76021
24161 76021 -77972 -167298 -107189 -75326 -93041 -87982 -116083 -83715 22230 52202 38535
24150 38535 -653 -15760 -38486 -8960 -23771 -9965 57575 39435 2206 79544 70279 67050
24138 67050 86283 90857 16519 3723 1752 -66097 -113829 -104425 -67455 -66973 -35272 -67894 -32414
24125 -32414 42347 31290 -10061 -60253 -64654 -84557 -68503 -92681 -109799 -66380 -10887 407
24113 407 -17289 -92706 -100647 -115819 -125068 -131873 -131105 -46138 67224 77128 -45368 -122016 -77139
24100 -77139 -103099 -150406 -58474 49140 99400 41754 -50609 -94722 54074 129396 133747
24089 133747 19972 19504 14831 31093 71443 76833 72630 52886 21505 -65228 -31432 110263
24077 110263 150739 72374 77772 76428 92182 85312 159574 195964 113055 120 -269 29625
24065 29625 13299 -49298 -41822 -33780 2621 91537 35112 24552 -4986 -57576 -9742 47096
24053 47096 -15387 -89518 -53234 44972 73176 158232 189046 105423 2877 71446 43052
24042 43052 3649 87090 170125 152999 124501 103387 64980 33480 19571 -26520 -21740 52780
24030 52780 24083 53276 82250 11883 -1773 24109 60118 95383 75996 18919 58280 62994
24018 62994 -11592 -69358 -87268 -104456 -129928 -134787 -151971 -118252 -28569 49151 41071 14757
24006 14757 -35274 3025 99971 108044 16025 -27913 31488 -72742 -99532 -38233 -62438 -25740
23994 -25740 -17040 31555 76613 29369 -31522 -127926 -86375 -5110 26943 -46512 -129075 -108989
23982 -108989 -8321 -15382 -85483 -130265 -145486 -72622 -78938 -95497 -85805 -25837 69668 86423
23970 86423 64012 9407 -31612 -567 35700 -22556 -24457 -11397 2726 -106888 -104020 -80297
23958 -80297 -93410 -57469 -17998 -67039 -10189 4186 -54101 12005 59350 41608 8440 -10852
23946 -10852 15974 -19406 18717 31972 -41993 16042 51494 45124 -5178 -55911 -46302 49365
23934 49365 50192 9837 -25762 -27235 -3454 -42548 -62065 -31336 -41077 -24260 36178 39546 41793
23921 41793 -4846 -24157 -48435 -73997 1253 89525 135904 42874 12965 -36599 -80577 -17014
23909 -17014 -19242 -86149 -46476 -14965 -67819 -134507 -74937 42124 103060 128844 32952 -61586
23897 -61586 -121877 -133079 -82478 -92701 -116651 -55406 50603 25802 45510 38188 72208 50699
23885 50699 63059 96018 147747 130748 53115 80477 83554 -37189 -42804 -5774 -63657 5035
23873 5035 14253 31116 138524 94818 68289 68647 -37916 -72288 -24952 91194 57970 45857
23861 45857 103164 67601 32514 43327 -17399 -38157 -75858 -24124 51197 134628 187397 124052
23849 124052 56819 -2364 22095 48176 73317 16019 27001 7872 -11059 41091 12028
23838 12028 20498 19982 -45287 -33713 -37123 8081 57182 32955 -5339 44344 30999 -40282
23826 -40282 42932 78128 117525 184804 117631 23425 -57290 -35782 4054 928 -40502 -60818
23814 -60818 -32802 8235 -17560 -61213 -54087 -58852 -78651 -57484 -32412 17526 -8353 -31891
23802 -31891 -93903 -112824 -116213 -83681 -37296 112432 111528 157500 88242 589 -74224 -34480
23790 -34480 107100 106795 148845 151101 70571 10416 -5314 16367 37817 35411 -23661 -16833
23778 -16833 -46936 24971 -5919 -27472 -61773 -78737 -105080 -155648 -99671 -8847 -38664 -53179
23766 -53179 35352 -5830 232 38403 11179 20821 -15295 20952 4870 -60302 -6183 52197
23754 52197 2714 -132734 -149045 -76145 -19892 -13241 -72419 -110740 -97961 -59083 -20746 -97720
23742 -97720 -143839 -75695 -130573 -154374 -160575 -68192 -29867 -75551 -100423 -75135 -86817 -68026
23730 -68026 -30083 -82001 -56939 -20632 -82335 -166224 -126776 -65149 -91926 -142415 -85175 27855
23718 27855 10220 -42345 -39624 -69886 -101126 -121250 -47689 18787 2457 8452 -48893 -16455
23706 -16455 55553 87583 72922 22558 -17577 -509 29030 62306 57750 112122 119725 59537
23694 59537 22083 18442 -32518 -118000 -134880 -76361 -48760 -107897 -95862 -118355 -86570 -38963
23682 -38963 12987 91288 123341 96348 121972 91281 25531 -62375 -75615 -56752 -97036 -137431
23670 -137431 -134724 -115563 -142851 -71360 16442 -54521 -13598 16146 42562 48205 34698 19818
23658 19818 -50921 -106443 -107554 -103256 -175473 -147661 -93650 -52648 -34641 -49353 3352 5643
23646 5643 54910 134665 88747 6589 -4198 -26544 -33623 55435 21616 -44398 -54510 2770
23634 2770 25018 25651 87482 85643 16730 -51197 -121403 -161577 -105219 -15063 35144 82119
23622 82119 33077 40799 -3568 32945 38831 35066 76079 34692 38858 75502 89076 36299
23610 36299 -34780 -69525 -98076 -20201 -11699 -467 -12280 -5072 51300 11259 -66115 -12801
23598 -12801 7417 22274 6652 6641 65530 101505 96460 111430 102743 82113 39080 39167 29590
23585 29590 -23560 -7377 -21922 -30505 -33939 -23642 -19838 -95005 -2091 129167 146047 135060
23573 135060 90735 105638 86283 75202 60349 -1810 21715 11513 -37756 -124538 -133012 -126358
23561 -126358 -75975 -25993 21099 -17311 -34986 -43645 -35322 -21867 26971 62952 -19948 -3851
23549 -3851 70805 49396 -49860 19468 31880 8226 -79545 -154839 -194150 -99438 -42997 41660
23537 41660 125261 93880 106142 63739 28917 26270 93060 158419 173556 137461 143859 172130
23525 172130 126865 66984 64840 137730 107484 84251 16340 18052 80757 -8696 75245 102955
23513 102955 128023 80267 27925 -55037 -72215 64272 39707 31385 71107 104048 68155
23502 68155 47012 48914 99668 68650 73485 37997 49055 102090 74821 6068 -37279 -8261
23490 -8261 105866 -13869 -120619 -143312 -137124 -88462 -46894 -27099 17114 80031 144944
23479 144944 114316 14156 -92245 5709 38406 -11453 31258 -10687 -3489 -29833 -35271
23468 -35271 -27532 -62265 -30379 61909 13242 16047 46755 122171 91794 64562 -9837 -96537
23456 -96537 -137237 -116735 -17405 27547 71441 73606 -1783 -1241 -11689 -58077 -86847 -47137
23444 -47137 -41998 16179 39060 45168 52294 69050 70170 102356 160835 153828 126812 168401 175425
23431 175425 148181 144533 59241 -113277 -58261 -19801 20741 30687 -949 -7848 -83576 -104199
23419 -104199 -142202 -90068 -24446 -41915 444 46270 27693 -14027 -31797 50036 77917
23408 77917 19424 31140 80453 32520 41640 15013 -7745 35647 124223 100500 3876 -58203
23396 -58203 -85958 -52825 -130598 -250487 -152770 -95740 -82335 -135341 -184293 -135556 -32596
23385 -32596 -93712 -44933 81888 55926 74788 134773 149046 170207 214804 108798 116399
23374 116399 37600 18662 -13133 -7776 11108 12528 92026 105324 9405 -42172 -40617 -67738
23362 -67738 -137751 -73197 -38895 -44755 -14862 -24709 -27977 -74682 -106814 -111239 -47840 29858
23350 29858 48871 73217 80309 50301 43552 26700 87091 169244 149697 19335 -46661 -78644
23338 -78644 -31246 -1600 -38279 -3150 46851 43863 83294 94319 -63194 -124940 -62688 -32846
23326 -32846 -75549 38299 82424 -9072 -45284 -6635 -11707 -830 -15773 18348 5951 -84556
23314 -84556 -72017 -27832 24605 27249 -68968 -166426 -105054 32390 72351 18822 29295 -3887
23302 -3887 -90706 -117299 -132470 -128480 -82237 -71003 -69960 -156465 -83405 11780 29707 86766
23290 86766 118440 24500 -22498 -50070 -79605 -96402 -106281 -26962 19148 44331 37009 -26329
23278 -26329 56419 64605 83217 93302 89815 65607 68974 -6527 12163 -27107 -61718 -24739
23266 -24739 -15041 9461 -16707 -83976 -128697 -125235 -138896 -102218 -8386 13723 -82142 -126651
23254 -126651 -100512 -11087 67421 -37803 -12127 68663 97734 101752 118615 98642 64963
23243 64963 117084 182692 203649 218673 166658 104709 38794 89209 89856 169909 145825 56606
23231 56606 89844 66552 63323 70804 89905 123312 115035 129632 79683 41092 -39533 -89697
23219 -89697 -17326 -47441 -123111 -54567 -24981 -74516 -82153 -45962 43771 67919 46763 80142
23207 80142 107687 76376 16190 64892 81731 34956 38496 91372 31322 -81491 -88953 -31190
23195 -31190 -26820 23130 65157 45398 67286 141941 104251 94598 37589 62997 58544 12134
23183 12134 100116 65113 63945 104470 79562 61264 6858 -74248 -50428 64909 109073 20157
23171 20157 -25299 -50136 8764 86933 133574 168891 100347 32813 -5550 -31401 1402 83444
23159 83444 64158 75149 61149 -4455 23838 51614 84025 71386 51567 -17210 -19095 -38938
23147 -38938 -101944 -78085 -101135 -139857 -214903 -185570 -111065 -75897 -84283 -31904 10418 -53001
23135 -53001 -145043 -130422 -96995 -65909 -71484 8735 47715 73180 137145 108599 -100225 -122394
23123 -122394 -36728 -62957 -106976 -39870 -30119 97110 63757 78336 88529 92298 -35569
23112 -35569 -118274 -131692 -43718 -120183 -80799 -34456 37277 34228 2296 87027 62024 -21084
23100 -21084 -42229 -79721 -46819 89043 46370 13266 30817 -26561 -1589 82614 88169 70161
23088 70161 128834 73895 13008 16257 65660 -17951 -110527 -139200 -120986 -61029 26958 15886
23076 15886 -30052 18016 27923 2273 -17838 -12253 -76147 -163690 -176397 -106360 -68130 -62133
23064 -62133 -43333 -11212 24515 -13965 -63071 -38736 -36382 -2032 -63453 -107606 -129300 -97271
23052 -97271 9872 133082 174993 105888 91625 -14451 -19519 -30206 -68463 -103793 -136275
23041 -136275 -54660 -39144 -30676 8079 -9945 -11268 -75519 -54496 20818 33511 -13905 47193
23029 47193 128243 89167 2175 -11379 -12436 -103084 -99123 -113919 -96374 -78603 -67809 -7542
23017 -7542 68914 95620 104811 129298 105964 83505 35972 96996 106257 4232 -10819 39482
23005 39482 59029 82040 104381 135835 107522 111259 72933 23488 15241 -33433 16939 30576
22993 30576 14773 -7277 53233 -73521 -101985 -59558 -4725 28890 54425 78687 25880
22982 25880 3580 21641 27851 -33863 -3036 -39116 -14100 67829 158512 121796 71386 74517
22970 74517 82134 76088 -7359 -76977 -84684 -83624 -65259 14279 65068 168103 164051 33706
22958 33706 -42145 -89779 4357 87550 81017 60479 4660 -20078 10190 -62047 -67586 -69028
22946 -69028 33366 40336 -23715 -82941 -125671 -116945 -99682 -20111 866 28270 62275 45366
22934 45366 -22670 -59916 -23082 6316 -28527 -53662 -123316 -95731 -11584 -73492 -112152 -47474
22922 -47474 -33524 -61951 -105358 -81027 -24372 -39048 -63432 -75169 -72816 -79292 -70220 -44171
22910 -44171 -34705 -82086 -70593 -140899 -88826 -58068 -44159 -5984 -18500 -9244 -63315 -105622
22898 -105622 -96105 -151176 -200729 -30857 76882 75180 88823 -13473 -55554 -85688 -112407
22887 -112407 -53971 -78240 -121803 -109838 -84298 -32024 -4137 -48747 -49493 -57412 -114215 -133089
22875 -133089 -38745 48013 36540 85915 109169 104812 61038 -16092 -2410 -19315 -18408 -60893
22863 -60893 -77465 -81566 -17509 20219 86978 -19820 -95614 -120940 -76596 -13693 31130 2159
22851 2159 54696 82806 23255 -39225 -27135 47769 55898 96328 46574 36953 -41488 -68175
22839 -68175 -41234 12598 147936 174568 77720 -42290 -118484 -107176 -60717 18423 7867
22828 7867 -41290 -4141 21480 56403 -2348 -12547 -60839 -148803 -148671 -95386 -97980 -71765
22816 -71765 -41809 76814 101232 40345 7601 69575 77611 99546 145493 114210 83844 6706
22804 6706 6919 19346 29831 72466 -15016 -66754 -35146 -71116 -154299 -138507 -76636 -9755
22792 -9755 -6978 -17240 -34190 -29874 20793 73235 87640 -9159 -101623 -26155 79009 113572
22780 113572 55704 12543 -53365 -115558 2113 126147 134209 132937 87621 28375 -57233
22769 -57233 -21021 4426 16793 64679 127018 100147 36123 92554 64565 -27002 16694 52415
22757 52415 -12690 -22195 -13412 20363 31401 -71551 -92815 -75085 -11522 48957 82281 65508
22745 65508 9569 -71626 -127024 -90995 -96515 -67763 5437 -51693 -125323 -140811 -119438 -830
22733 -830 -16468 -62990 -58657 -20947 -94918 -135100 -94761 -73464 -10142 114298 115166 104154
22721 104154 99075 94633 170573 106205 41606 37295 -18428 -55497 -38458 -67848 -45011 -43534
22709 -43534 -16270 73214 22358 -11585 15263 23781 27737 -35699 -87949 -149277 -86048 -139524
22697 -139524 -94504 -57483 -6906 116616 76665 -64974 -114076 -121861 -53503 30927 6321
22686 6321 -84595 -63269 -62969 -78800 -57996 2117 -10861 -44219 -42340 -109206 -104501 -62489 38159
22673 38159 33941 -14719 -136648 -162196 -185902 -175769 -206881 -291814 -184868 -96727 5695
22662 5695 1470 42486 87892 -4052 18232 69671 73687 42044 2579 17465 25582 38718
22650 38718 34365 -17236 -138313 -181205 -137082 -144909 -69947 68014 133417 78935 90127 116383
22638 116383 92128 -21377 27985 108999 153990 200295 233427 198169 167033 56959 28885
22627 28885 -1734 -40040 -67055 -31400 30126 116040 103172 -19202 -18420 51421 112546 97631
22615 97631 82392 66546 17359 -31252 -34078 18668 -26450 -35650 -111806 -82503 -37596 -55634
22603 -55634 -38882 -13674 -37433 -44356 -34621 -56408 -76982 46327 102786 67775 46401 -82795
22591 -82795 -179218 -222562 -206197 -93460 -42994 1669 -42486 -17858 -50348 -65387 -15781
22580 -15781 38969 16244 -59456 -18201 56920 49219 46332 -48523 -122665 -137602 -29054 -11080
22568 -11080 -54511 -70831 -57291 -82811 -137535 -188413 -215481 -223745 -163298 -121642 -73326 -28779
22556 -28779 36434 63531 27039 -41096 -14823 -3490 444 11442 -19380 -15895 1193 -43337
22544 -43337 -36120 -13947 -50003 -114802 -74694 -20133 26637 10182 -54112 -30071 60575 103782
22532 103782 110914 116712 176689 215581 173777 62244 4657 -15657 -119396 -101375 -30289
22521 -30289 -15657 -53390 -63294 -26022 -55220 -59628 -39122 37569 15277 -34696 -31718 -57166
22509 -57166 -89439 -85702 40737 112183 79832 103139 176977 195378 158585 91163 -17134
22498 -17134 -43882 -28975 46939 151179 116271 51778 56582 16519 -84608 -82307 -60817 -35998
22486 -35998 -31798 -1062 -54852 -127805 -98193 -52530 -75667 -112644 -132819 -136102 -139893 63335
22474 63335 169467 215796 140695 114865 88121 49998 37791 67623 49054 77224 67057
22463 67057 19330 23341 -9338 15984 20925 -19675 -23756 -53100 17426 -14883 -116953 -136609
22451 -136609 -70682 -20059 79142 174075 182468 200493 220561 185415 162214 183897 109584 13708
22439 13708 -35168 5636 18425 -45275 -21741 -27494 -29357 22164 2851 24276 38088 -20604
22427 -20604 -84914 -52124 -28543 -12635 68853 51386 21210 28206 -4135 276 3158 23223
22415 23223 -4443 -2694 -25357 -30951 -35812 33152 9668 -30083 64542 191662 221007 116167
22403 116167 58240 39403 -45480 -140273 -143053 -138621 -33144 32175 19318 -14768 -107642 -137070
22391 -137070 -64162 -18976 49084 36801 34532 21391 -56414 -94689 -32824 13635 -37491 -87904
22379 -87904 -142967 -122445 -72643 -27649 -33365 -5569 -25903 -38338 -96173 -76296 -65352 -65947
22367 -65947 -24088 37128 134295 100058 3427 -51640 -145318 -252830 -206182 -130089 -39617
22356 -39617 -29729 -52241 -36333 -48879 -55615 -60241 -53095 -37463 11225 -26093 -1342 35644
22344 35644 60697 30186 2838 67316 121578 64349 23804 11232 -64274 -133280 -93840 -99868
22332 -99868 -119748 -78111 -14872 8235 -60761 -126912 -103885 -44807 24436 42289 -15149 32895
22320 32895 97824 37176 53825 105958 72839 52705 -27659 -79062 -110394 -87963 -87735 -151192
22308 -151192 -213866 -168071 -86585 -21875 -20786 9459 36855 -58108 -102105 -66901 -89687 -130888
22296 -130888 -127378 -119077 -145629 -94831 -64875 -53049 20614 32556 39875 14863 -18571 60881
22284 60881 74237 67953 36006 -17810 505 -51723 -68111 -21293 -124 19899 67945 -3025
22272 -3025 -58182 -283 -63266 1192 73492 77724 21662 33900 46298 -24 14451 5702
22260 5702 -50802 -1308 30944 3316 -45214 -29555 -81682 -146259 -177566 -168758 -83865 10643
22248 10643 47819 -12714 -124634 -180060 -103355 -93816 -81873 -85201 -55949 -2974 -14987 -19092
22236 -19092 34682 40994 79926 102295 73069 16234 25130 -10669 -99005 -100895 -1627 55597
22224 55597 92152 -8643 -109912 -138711 -103720 -157567 -161606 -49956 13759 -13416 -46397
22213 -46397 -7285 39872 4640 28453 41895 -7273 -4141 63596 99735 165050 148454 78915
22201 78915 16695 -64383 -89670 -47965 -98046 -86055 -83443 -65502 28428 73559 90036 31096
22189 31096 6195 -26002 -101234 -112450 -54611 19422 52497 142376 105904 83853 -13272 -136018
22177 -136018 -116022 -60776 33138 59961 -71966 -13453 90799 106854 77057 29960 -91554
22166 -91554 -51719 47283 11892 -45344 -7498 45049 85796 106376 9791 -62499 -48779 -20533
22154 -20533 -45614 -123388 -118216 -28344 8028 -25835 -86446 -36692 31358 -2555 -4292 -7250
22142 -7250 -77942 -59506 -13060 -29529 -6201 23853 26021 -20334 14198 -56172 -66979 -71398
22130 -71398 -94837 -29390 2282 -55727 -46719 -37541 25066 27496 -58343 -170687 -136372 -125126
22118 -125126 -117804 -39734 -28493 9257 75149 23548 -16548 -40906 -40998 -80992 -25010 41697
22106 41697 125767 197599 224888 181957 117626 -7908 -103866 -88371 4560 9208 16916 53442
22094 53442 104909 85726 76165 67054 15751 -40024 -14729 44867 91467 77197 6526 -42976
22082 -42976 -55555 -95153 -124906 -72834 -21611 6098 5299 55495 -24416 -75393 -30770 70737
22070 70737 8591 -86261 -70861 19600 98661 40770 -12694 -40620 12309 40364 -4985 -66166
22058 -66166 -58075 -22438 50256 83707 59878 42368 -7648 -54078 -56387 -39021 -55041 -139799
22046 -139799 -157271 -80386 -44641 -119324 -140187 -93359 -65925 -29265 -34546 -40988 -22471 17395
22034 17395 22355 -4178 -71092 -33864 17183 16160 -8592 -49455 -76633 -136232 -63202 74744
22022 74744 148715 109852 43370 21651 33974 -74589 -124777 -18606 -48625 -38945 -56534
22011 -56534 -82878 -72046 -29772 29785 23333 57425 20352 -4212 -37893 -49625 -39841 -36661
21999 -36661 -34235 -70083 -74208 -9808 8581 33836 -50249 -57984 -64061 -34907 29950 25441 -22941
21986 -22941 -64319 -130584 -99772 -86083 -29158 12100 21368 16342 61980 49678 22147 23311
21974 23311 49119 -18238 -92238 -72204 -39018 10753 17073 20620 71072 57353 16267 -36133
21962 -36133 -58435 -43619 -29814 -70121 -98851 -91465 -31606 -17355 14073 46485 -59643 -206133
21950 -206133 -113284 -57492 -30379 -28558 -3274 -123099 -179811 -141112 -74712 -48872 -45931 -8780
21938 -8780 46379 50920 3232 -92645 -126324 -50488 -29838 -41167 -36110 23961 -19230 -58643
21926 -58643 -84483 -105820 -16690 20161 65086 25664 -33011 6673 -25498 -66512 -48100 78021
21914 78021 69497 40106 -19151 -16155 -31829 26435 80035 29902 -99735 -108105 -55098 -15024
21902 -15024 -940 -44873 -55297 -31477 27545 106753 58141 17369 54214 -19838 -112111 -4366
21890 -4366 41721 145796 140012 59029 89536 55990 42701 88162 125656 132789 42427 -11623
21878 -11623 46484 58132 -14640 18286 9606 -80073 -53091 122910 144644 83929 60047 68347
21866 68347 101404 96447 130227 113482 90454 52527 10869 -15198 39665 85005 88531 97916
21854 97916 72842 -11287 17572 64382 20886 -37530 -55691 -90948 -77856 -110133 -72139 14502
21842 14502 76135 35612 -13072 -91872 -118838 -135378 -18729 108908 27621 -113402 -119264
21831 -119264 -75059 -13527 69519 48304 -18206 -140171 -114708 -55238 -98909 -127658 -201924
21820 -201924 -179493 -194288 -58312 40187 26451 -7560 -52591 -88496 -10623 30862 95903
21809 95903 79513 73930 53221 83296 113237 54521 51097 101338 151178 186332 128407 33450
21797 33450 -4705 14128 8630 -46693 -80135 -107051 -62853 -82868 -40824 65594 153935 142008
21785 142008 96989 64016 85784 218618 165013 40720 8416 -5735 9337 -10720 -31650
21774 -31650 -5482 -4424 -32938 -6056 41790 23689 15150 24130 82797 170453 234833 346538
21762 346538 400830 345729 271063 160934 46918 -73752 -115154 -91775 18786 -23701 -94470
21751 -94470 -85049 -50825 -51879 103919 145911 5142 14890 8045 -39171 -40666 -1930 17469
21739 17469 52861 16532 -32906 28887 36658 16508 -97205 -79389 -44286 -24628 30336 67614
21727 67614 146396 157243 63432 24467 12817 46311 -105691 -151716 -85063 -29063 -75830
21716 -75830 -67452 -91783 -79840 -37926 -71049 -70545 -23510 66006 -11819 -31334 -50825 -588
21704 -588 35603 -2651 -841 2097 11877 16255 98714 96546 31324 35069 42974 56392 -15717
21691 -15717 -54406 -119541 -160060 -129024 -13063 11115 5858 23322 50080 27115 22603 102882
21679 102882 105647 87553 20364 -17681 -40139 -39185 -31353 7973 -50494 -18152 39177 41285
21667 41285 -35924 -65802 5343 -14357 -62990 -28509 -10012 -43584 -50699 29671 102840 78361
21655 78361 -3534 27706 54772 20988 135272 173520 122573 127008 148817 64403 21462 44895
21643 44895 4564 -71206 -157907 -80427 65368 85254 15982 30752 56413 53303 74257 83401
21631 83401 48830 68428 77503 -28485 12526 20193 -15731 -38648 -95324 9857 39648 69336
21619 69336 102325 47987 137924 178389 122786 106837 103607 52682 56193 46652 54472 154762
21607 154762 89586 -77299 -147832 -164685 -139527 -10176 57086 55669 36102 48271 91402
21596 91402 80759 93474 17979 4568 10129 31046 55587 18719 105393 88036 10177 -38389
21584 -38389 33945 96186 21351 -50395 -21323 -28484 52705 140720 88108 -59133 -46473 -62527
21572 -62527 19259 90767 73661 18990 -86965 -126436 -65673 -31328 -19404 13922 7370 -787
21560 -787 7758 203 55404 6643 -13990 -102166 -176074 -134055 -160340 -159530 -132660 -82195 -16041
21547 -16041 -20835 -46683 -25041 -50339 -129410 -62903 7351 -12021 -75779 -14709 -19266 -85167
21535 -85167 -29130 29402 10814 -38507 -82027 -112345 -88453 -59181 -49030 -95002 -47020 -77062
21523 -77062 -118740 -54767 58825 47750 47595 -11857 -126606 -226294 -146047 -63541 -71480 -39546
21511 -39546 39139 68486 -45114 -130584 -155485 -62221 -47837 -40785 -47031 -60447 -133460 -183352
21499 -183352 -142944 -83527 -14837 16066 -62292 -2857 -15666 -111893 -99754 -46545 26973
21488 26973 72173 127150 146455 160944 88241 3750 -76837 -63535 27295 51132 -24624 -28529
21476 -28529 1 19269 -8173 -53956 -128522 -63151 -114593 -152761 -153604 -43713 69544 77885
21464 77885 86209 126499 126170 77817 120762 138856 147010 117102 88230 93506 192371 220448 207928
21451 207928 138212 68781 117524 161984 158254 167364 187270 94724 15405 -16059 -72338 -81885
21439 -81885 -32433 83878 124349 166217 83654 23144 30333 32487 96888 120108 110632 9804
21427 9804 -76080 -23616 -8589 4680 8102 -57125 -119115 -81046 -20323 -1895 -5988 28857
21415 28857 26771 15018 40511 14346 -30565 3423 4520 -40381 -94851 -167315 -95019 -108555
21403 -108555 -25768 29218 -2228 -36472 -56236 65861 134218 34490 65733 103970 67459
21392 67459 56800 53601 22211 -52639 -36294 -19682 -64956 -57220 -27381 -11314 -26537 -28120
21380 -28120 -11630 -79383 -54312 34627 95127 33552 -36149 -37051 10038 -63266 -20676 11135
21368 11135 42663 57791 -4733 -47744 -12860 -18891 24723 -17714 -56497 -45624 -85131 -59969
21356 -59969 -66653 -163183 -82466 20699 11825 34420 -17490 -61101 -92322 -132934 48 42474
21344 42474 13604 -25219 -86915 -133145 -137820 -109110 1233 88107 111855 67220 81677 -19178
21332 -19178 -148479 -74816 62819 121853 61149 85163 97553 24756 -8341 -22562 12160
21321 12160 -36692 -48449 -124207 -109578 -14799 75898 139538 129596 128840 -143 -70288 -64227
21309 -64227 -84329 -17161 17724 18181 6903 281 66833 93000 108036 99599 97070 113858 126823
21296 126823 156151 118112 88935 70312 64559 -34465 -56025 -1399 71762 33655 -25612 -96835
21284 -96835 -52716 -7482 -27915 6699 -16199 -35901 -48687 -32725 -32841 -52090 -83243 -81591
21272 -81591 -68558 -58488 -37813 -8391 -74927 -119140 -95638 -97558 -26067 -87210 -186688 -286619
21260 -286619 -233098 -135143 -124230 -107931 -133106 -27200 173874 185114 106975 25983 -38427
21249 -38427 -53223 -34173 -11966 114389 176128 22136 -15741 -42731 -53351 12174 40921
21238 40921 23124 36648 23419 36676 41208 105269 94334 39522 -18872 -25579 -49527 34681
21226 34681 7771 -75275 -38337 -16987 -115834 -96099 -57673 -44330 -56822 -41679 -20238 85088
21214 85088 26472 -127651 -115726 -36393 63403 95394 57671 25937 -77787 -98551 -78882
21203 -78882 -76641 39217 67777 -10265 -81954 -43598 43830 62254 97524 9555 -39257 -96878
21191 -96878 -46730 6632 10536 -175 -27203 936 -11746 -74260 -127623 -44726 54024 61428
21179 61428 25271 -58093 -57195 -83461 -64280 -38620 -2129 26854 -12198 -77861 -77846 -1459 -10869
21166 -10869 -92506 -66870 -25113 12132 -33764 -6293 5197 -12174 -24234 -66781 -81138 -106020
21154 -106020 -127194 -20035 59879 88473 59487 25442 -22869 -44343 -13619 -61093 -60087
21143 -60087 -159002 -156190 -11619 -32017 -71885 -20877 -24573 -76751 -56808 -55053 -79064 18845
21131 18845 -7768 -18259 -2129 -39934 17069 -23578 -56588 -44137 -36949 -99147 -101771 1672
21119 1672 -63269 -121981 -122508 -48604 -95292 -76392 36915 166384 154422 151366 68760 71261
21107 71261 28279 12328 85226 179634 183085 191838 58024 -25199 -79151 -97205 -77846 -19644
21095 -19644 -26776 2688 -482 -53025 -108989 -17657 72679 -18583 -43382 -74721 -12186 51654
21083 51654 -5815 -48106 -32529 42891 65964 93189 21157 -4493 6755 -16430 -44576 -2399
21071 -2399 -28407 -17770 -13561 -46830 8138 59540 21882 61046 38545 -74854 -94870 -13715
21059 -13715 120234 126346 83872 54925 -15974 21642 118577 59123 46907 45573 24898 11650
21047 11650 2809 102501 80624 27526 41748 45650 71755 102795 15694 22165 -9497 -80663
21035 -80663 -166345 -108590 -59551 -14934 31220 55425 81194 5744 30834 -20132 -95640 -60994
21023 -60994 -56615 -55086 -23993 -3522 -13828 -18946 -47721 -137117 -159515 -98188 -47225 -42668
21011 -42668 -35062 -19388 -10557 12884 -30189 28138 48600 68114 38493 -23636 7160 68320
20999 68320 63175 39534 31374 94705 111784 69875 71552 48042 30437 -9438 -46789 -65851
20987 -65851 -103433 -144506 -52406 -6008 -13073 -35080 -86012 -113259 -135615 -151615 -101043 -36913
20975 -36913 -37262 -46558 12904 -4975 31033 -17876 -26650 -9769 23128 52547 61845 44617 27137
20962 27137 -38254 -73313 -92321 -70378 -68223 -11795 21143 90892 29332 55090 13660 -81213
20950 -81213 -80820 -34074 -25331 2347 85180 99336 8924 -89580 -129999 -163138 -177002 -144640
20938 -144640 -65082 -13209 36758 70441 17879 -21783 26373 -34974 -46513 -3871 35641
20927 35641 3584 93896 100050 88053 89466 88128 36074 12918 -63053 -126433 -82267 -13537
20915 -13537 883 -61827 -34293 -14428 59524 93970 98822 112618 38233 28438 115058 59578
20903 59578 18636 114653 180915 142797 140815 28869 -27125 63039 67010 94166 134393 14549
20891 14549 -18239 72406 176232 174478 125610 52389 37218 19625 -50718 -63880 -47725 -18841
20879 -18841 -35069 -35669 10230 42931 -45951 -21560 15907 82734 126670 138992 157258 137368
20867 137368 161618 154185 131778 46426 -8508 -62478 -42387 6920 -11167 -15103 42903 59648
20855 59648 -10297 58448 124472 85102 49136 92125 51407 30703 10025 -11959 45169 113327
20843 113327 99873 56563 67659 65813 67655 -30165 -25791 -15760 -33385 -34723 -50957 -1416
20831 -1416 28325 -40940 37105 -1996 16716 213171 277400 158006 45584 100717 129268
20820 129268 138280 136097 32081 43197 87705 88007 -827 -55673 60173 123357 71071 51052
20808 51052 90002 100185 101399 -8893 -55007 -89248 -101385 -4196 88289 53397 51452 72214
20796 72214 65517 64368 40409 63286 60503 -35543 -77832 33349 74292 99485 56080 84001
20784 84001 171169 96834 90875 135833 51040 -8609 -80499 -97628 -49407 48039 21637 -79411
20772 -79411 -69437 9226 26658 76807 72661 87195 78361 23831 50742 40673 33702 13345
20760 13345 8843 46371 128341 108355 135102 143170 209401 144291 73551 -20781 -41883 -29331
20748 -29331 54205 57460 -10753 -31025 21705 58162 9715 -33438 -72451 -35743 -28616 20173
20736 20173 -10174 10238 37909 30988 -6704 -18944 17913 1851 -11273 -12531 90370 151142
20724 151142 114279 37474 549 20064 27789 50756 22816 13293 62224 52866 18957 -39677
20712 -39677 -5154 41874 -5322 -30734 -20540 35851 69797 87636 75452 90682 8465 -21715
20700 -21715 -50496 -1025 113483 50416 61495 151166 247806 243553 269632 240958 121944
20689 121944 8547 -118644 -163616 -135679 -55256 80449 104494 126566 120784 95073 -9178
20678 -9178 6330 11385 23425 -40913 -8172 1054 13044 -40276 -101162 -85652 -2565 44717
20666 44717 8885 -89677 -20007 3500 -19875 -50356 5538 64870 132117 85551 1033 -27865
20654 -27865 -34398 2825 50834 136862 87956 17152 -24992 -168999 -190284 -118518 -76643 -4188
20642 -4188 -7889 -45355 -81203 -23490 -13430 -99609 -65897 -19923 -27152 -17487 -26626 -9683 -22476
20629 -22476 -103448 -69388 -61907 -48762 -15110 -11908 -23970 -54568 -11007 -27486 -12562 79938
20617 79938 96157 24792 -68919 33819 52972 -28309 -95260 -108685 -42279 -43967 -39400 -25290
20605 -25290 -31819 19468 -8693 50803 45785 -35408 -36902 16936 -70700 -62791 -49896 -68845
20593 -68845 -27322 3332 -51412 -57388 36107 83190 76793 36236 17290 72648 96838 56070
20581 56070 16168 -20461 -14144 -61417 -131693 -77398 -57819 -140565 -90306 -70350 -17002 50185
20569 50185 96038 141729 117087 177018 135769 137401 155718 158468 114297 78558 54352 3615
20557 3615 26002 68453 105275 86770 103872 128695 123066 82564 -11467 8929 1156 -47939
20545 -47939 -51617 -61492 -48137 33608 66815 67537 22334 28361 73519 54356 14156 -37959 -5049
20532 -5049 5953 -35298 -83418 -16562 8057 65668 88935 74725 72128 95423 17870 -30935
20520 -30935 -46488 -26455 23488 53203 -22057 -50011 -21467 -58228 -78298 -43634 -15450 65868
20508 65868 44724 109805 196513 211169 150033 41795 35420 133197 110742 58487 56965 -15889
20496 -15889 -15387 71070 59022 -64845 -77421 -32421 -44910 -72322 -95152 -57853 467 -31069
20484 -31069 -35006 55537 -22020 -106711 -73640 -7209 19024 70275 41801 -39050 -78100 -118222
20472 -118222 -132045 -39798 -13507 42508 2431 106736 131005 55092 41866 52845 72980
20461 72980 49415 83726 106968 32976 -69863 -57421 -25014 -28202 -45885 -13128 65630 74706
20449 74706 10036 -6198 -130671 -128787 -115953 -118658 -111394 -55445 -47481 -82329 -86620 -102823
20437 -102823 -68277 57556 157695 127722 121793 172079 93141 71708 60768 40834 -38066
20426 -38066 -57202 -11435 58614 26158 -59989 -3141 112681 141919 143040 110821 3586
20415 3586 -24446 -33087 -18441 -22978 -77059 -111409 -69859 -97240 -126462 -79570 -69743 -73441 -51062
20402 -51062 36501 139878 157175 180651 175536 121344 100856 90909 110928 98326 124525 59490
20390 59490 -56172 -79868 -8018 115992 105567 34749 26360 45410 77318 105986 151488
20379 151488 205061 161348 91993 36695 29753 44295 637 71078 87514 44984 -12970 -11579
20367 -11579 45953 42328 -20427 -30591 1081 40841 9858 -57432 9271 74383 52089 -25021
20355 -25021 -67427 -109784 -55227 -2864 -13552 -51596 19346 32106 25723 94445 143615 106665
20343 106665 40567 36480 68237 2963 -10335 -1166 20101 33847 -32850 -63031 -7088 -6689
20331 -6689 -13056 -35866 -53451 -52444 -32547 20787 91536 97854 60300 37028 -56526 -129572
20319 -129572 -108230 -99530 -60697 85978 133372 111053 35799 -32561 12541 -36232 -3411
20308 -3411 -31888 -51805 -33731 20796 90623 59284 106510 150143 145522 28954 24604 16208
20296 16208 -43539 -7580 124055 186032 98600 36657 -28407 -81880 -67003 32647 79358
20285 79358 92297 31783 22905 29654 41688 98583 85109 123722 92932 115775 136207 142940
20273 142940 42455 -37111 -9350 -12365 -14641 -46997 -88216 -49259 68652 65217 23179 531
20261 531 15819 23110 92751 136057 83822 84258 55101 -20260 -4994 -18573 8890 -14473 -19310
20248 -19310 66672 18356 3825 -28005 -28166 -23015 21882 60891 61022 43507 -32760 -18863 22310
20235 22310 78922 166855 176520 156286 114359 -13877 -106725 -53409 60524 126045 113638
20224 113638 57639 27314 38669 97889 177066 172421 218576 217685 90326 -18872 -49427 21575
20212 21575 85731 55791 108887 135358 82090 -8091 -6382 24853 30328 -10555 -3986 81341
20200 81341 110401 86356 -13755 -22364 4648 64386 147439 170000 76509 26570 -64200 -130378
20188 -130378 -120222 -37220 -8958 -21662 21869 -49958 -94211 -130843 -63182 -6600 -8662 -28734
20176 -28734 -26303 2614 65513 110371 67932 -51470 -25794 -5997 53386 143030 163578 138984
20164 138984 42106 -45676 -27188 961 -2753 -11278 3311 -14087 -96880 -164730 -124670 47136
20152 47136 47234 -1059 77540 85168 -15164 -104709 -56050 -37205 18566 25840 24799 20198 -63377
20139 -63377 -68481 -58854 7879 74166 99242 78428 166955 214861 171440 156283 93642 88531
20127 88531 122022 120525 60436 95035 129654 52979 29543 72598 62458 -6720 37544 127406
20115 127406 104290 72674 88109 43928 37210 93839 72987 57621 107509 188701 191434 141186
20103 141186 111048 109721 92867 38206 82444 111460 128841 197089 166410 135965 87152 82951
20091 82951 -2177 -29488 -27799 37006 106869 75673 35851 -12028 -28925 -47481 -78148 -62673
20079 -62673 12250 62476 -10734 -101 14268 -5052 17639 33635 16816 -52086 -152098
20068 -152098 -114881 -67054 48373 56296 107296 115863 65449 69111 103523 146998 139111 148707
20056 148707 111992 61602 40690 62378 -17324 100202 201309 187719 163750 143694 150389
20045 150389 208462 225572 160948 94703 29651 44161 91357 126116 71428 51048 107806
20034 107806 177048 125737 110398 48323 61344 156502 281547 259252 164125 64518 54467
20023 54467 57044 37695 -41189 -31671 -38265 -54918 -12576 81160 54234 -17196 15499 91943
20011 91943 131430 95831 -20673 -179467 -165937 -59594 10221 36607 93312 91833 103979
20000 103979 104065 58156 96348 62566 -29742 19895 78453 125640 85796 107844 96164 123006
19988 123006 149035 177679 110670 77693 -47631 -87053 -117559 -28839 -29589 -59827 14591 17382
19976 17382 39325 106510 177671 191159 233357 252670 231540 233185 120570 60770 49499 76628
19964 76628 -58361 -58664 -12724 18668 -54165 -85253 -33390 123461 147978 105105 137423 127524
19952 127524 173576 281971 330728 470530 684844 896522 1171785 1489110 1425872 1109107
19942 1109107 861860 661044 451736 369483 339273 236346 171998 223225 237908 181395
19932 181395 81238 109492 183698 246566 152260 40516 64081 31266 50798 51018 50342 66636
19920 66636 85071 101562 154409 108221 54693 39608 104447 119001 81030 29819 -31082 -22996
19908 -22996 -27428 -58268 -128264 -45440 48949 42120 -40315 -21077 31956 -50829 -104822 -118712
19896 -118712 -86663 -48614 -29743 29218 42907 19774 65775 194384 193787 120684 88627 33018
19884 33018 97690 159716 196417 133288 98534 110723 170462 119147 148094 279717 394843
19873 394843 467022 438610 333333 284906 316956 269786 182877 202410 204583 233435 304738
19862 304738 241070 206941 243301 319781 361317 358340 313270 275416 201673 192725 187956 272237
19850 272237 376071 355838 334634 508223 542300 487656 450301 331216 278548 299828 323387
19839 323387 376229 483381 565978 584481 602541 580691 546674 538589 445320 380393 339894
19828 339894 311129 407829 472790 410925 431813 479344 411704 394116 312090 185120 174233
19817 174233 234394 287630 333609 393784 402406 441561 377296 312362 301512 372817 448890 425571
19805 425571 366230 404921 458304 513194 568341 525485 577522 695882 750663 811896 794479
19794 794479 744585 630557 517576 546759 488612 427320 481378 539608 522639 533267 621785
19783 621785 703529 627827 532919 573984 537894 489287 482405 427380 334954 291074 282517 357980
19771 357980 339688 314219 281987 329257 394098 377668 318476 266687 270513 287802 326233 263647
19759 263647 204003 257750 246163 202986 201759 276169 309574 299702 325630 383120 409472 331621
19747 331621 326053 298593 240863 247100 145409 144902 174480 233546 214240 219571 155854 145260
19735 145260 171200 206944 271476 307361 338955 338724 381659 384232 341681 379629 394033 459343
19723 459343 376002 305462 300167 326021 359773 377495 368925 341562 295679 287171 346294 437011
19711 437011 520153 546308 545556 501600 492726 508129 471465 499585 510648 429728 339601 354600
19699 354600 355930 336378 312476 247483 281072 324184 380343 458617 439330 431479 595661 616965
19687 616965 552092 520993 540414 552952 563276 478843 486221 482668 443846 486518 426077 329376
19675 329376 293456 294704 342437 320893 342480 308392 306372 338415 283097 320311 399323 374938
19663 374938 314381 311147 334065 321813 275976 210247 115083 170270 339192 438520 388610
19652 388610 307545 387942 483731 522659 475472 336231 297193 324828 300602 362104 381001
19641 381001 276004 177634 233458 303419 303197 255748 283365 270929 317619 275117 214915 224524
19629 224524 162227 146599 217922 272276 271706 214577 196984 250430 184146 148874 150632 132021
19617 132021 103057 66093 130443 206961 311485 223500 205254 278002 252294 178128 221294
19606 221294 254347 186917 106708 52159 130203 192972 231540 258301 247789 134548 117565
19595 117565 173614 188713 227208 201440 226150 249796 293868 258103 249524 214807 196765 226795
19583 226795 282015 354620 349231 392582 433289 497295 398953 274750 266161 345725 341696 353789
19571 353789 460947 502356 488678 497221 483316 459089 425370 350668 266488 234515 245681
19560 245681 361374 384288 349074 333036 297325 335146 348135 415273 416604 415136 462378 506016
19548 506016 504056 554949 553420 455646 462985 545579 577294 518224 470231 493655 364636 263717
19536 263717 283728 381582 469151 525334 585897 672473 758631 700365 577529 550809 547139
19525 547139 476955 365693 380358 416846 564033 705362 712389 706557 736831 759697 717153
19514 717153 687432 702402 661272 550664 481138 565347 552630 442247 492306 519116 547041
19503 547041 516565 537461 595423 604259 616523 597632 657586 658324 607689 671580 703558 705272
19491 705272 745276 700064 654580 603698 538379 484039 529158 558173 566500 541038 574987 553958
19479 553958 488895 502438 638077 692114 666174 687485 646721 680784 695173 764981 812856
19468 812856 846350 899493 918201 897436 880647 872369 851112 831533 822706 800132 791453 935696
19456 935696 972814 956983 971510 943173 883395 828870 740400 704355 679442 627826 727966
19445 727966 703651 734525 723243 762645 822937 715116 682114 630853 651518 521294 550468
19434 550468 590120 581735 598262 656095 686939 716380 704964 626897 532675 648748 766265
19423 766265 738237 664472 735696 775145 763806 846568 844116 836864 789494 774690 784334 731722
19411 731722 681021 738376 788614 895774 1027116 1116276 1116892 1114371 1134487 1191639 1211060 1111372
19399 1111372 1023494 1016775 1045074 1162956 1216500 1295646 1277514 1128318 1147247 1290541 1418540
19388 1418540 1330005 1272700 1361211 1456420 1496903 1610066 1788592 2078844 2537154 3130943
19378 3130943 3570123 3672668 3431699 2943515 2563927 2445884 2426856 2557002 2769870 3006090
19368 3006090 2964145 2814746 2836371 2965822 3301858 3792078 4413989 5216146 6545687 8251699
19358 8251699 9772300 9826790 8630720 7532746 6990332 6961940 7127271 7483417 8018293
19349 8018293 8875016 10396665 11962353 12918840 13810771 15721140 19376431 25429757 33815772
19340 33815772 44575100 61144856 85080819 101759957 92272140 67646620 48145688
19333 48145688 37771770 33911930 34837557 40704236 53075276 72971149 94773283 108568503
19325 108568503 108888841 96122882 79459071 63902727 49269516 37907497 30969943
19318 30969943 27736078 27539096 30421098 34750249 36883403 36598418 37946319 41715539
19310 41715539 43045176 41377893 42425629 48813699 56168797 58767184 58175964 55579122
19302 55579122 49759317 44222584 43188066 47582951 54361957 57184365 56312079 59314735
19294 59314735 68411647 77145380 78520214 72846537 67007485 65683184 64636407 57899762
19286 57899762 48290307 41604439 39825429 42219369 46038607 48789096 52980614 61629667
19278 61629667 71831222 84126970 105148558 127604518 124017214 93032908 61913794
19271 61913794 42981345 33297057 28602871 25272576 21602549 18464265 17055401 17689992
19263 17689992 18865982 17920629 15124689 12817022 11799781 11592839 11451944 10574954 8880101
19254 8880101 7332612 6310728 5625919 5243128 4969822 4795672 4619566 4510556 4506186
19245 4506186 4523696 4362000 4210868 4355908 4735832 5287758 6148307 7002801 7050261 6396784
19235 6396784 5885105 5741175 5920314 6146023 6008396 5580963 5331967 5394495 5699502 6191652
19225 6191652 6658107 7025585 7308585 7740031 8340711 8976229 9695768 10858669 12447529
19216 12447529 14072957 15627152 17527880 20345479 24302910 30207702 39314115 53703652
19208 53703652 76780661 114477138 173857126 252675793 310080224 289184773 210955651
19201 210955651 138016422 91356970 63667192 46715662 35730863 28193497 22738839
19194 22738839 18907398 16394508 14628139 13133152 11533619 9966876 8639536 7675097
19186 7675097 6944248 6448027 6067347 5710728 5286933 4830319 4478708 4315749 4324842 4443642
19176 4443642 4612729 4478335 4069247 3789980 3588189 3294632 2968284 2662320 2404508
19167 2404508 2248179 2068020 1890391 1869552 1918964 2005018 2162617 2098798 1863343 1623747
19157 1623747 1499283 1390550 1416102 1600543 1599780 1509706 1377818 1360848 1271091 1137212 1080890
19146 1080890 983833 910439 799223 649149 569503 555499 641316 655343 610466 559636 625694
19135 625694 639391 617357 656961 673252 652568 623218 629865 671480 652194 617754 617103 758219
19123 758219 895489 917916 835975 825698 818743 788548 707820 706656 776626 725386 636178 551360
19111 551360 508922 545147 634097 697397 650594 614371 590601 569272 620890 692586 639012
19100 639012 540819 524192 440308 532139 572760 566937 598473 540317 503874 523530 492311 496756
19088 496756 522036 608772 653176 658657 719092 882983 966631 1009869 997214 989216 955572 910006
19076 910006 871486 850137 833082 838803 906752 987769 956789 827683 797425 818459 948276
19065 948276 914165 789093 616091 568046 508556 498969 572038 638145 627181 643681 677829
19054 677829 777532 875833 852435 793325 623055 532925 474438 460283 385150 417324 464430
19043 464430 461541 474582 479389 524451 571664 533237 461494 443163 466352 508320 506333 539203
19031 539203 554590 617262 702772 792495 844089 899928 850139 860391 834796 833452 877933 862639
19019 862639 818069 854498 856642 859691 738452 583083 601166 493658 413552 451807 480425
19008 480425 475546 496626 489366 401887 361474 393258 446249 505154 562303 532142 465645 448820
18996 448820 432399 370514 366292 402297 434722 447912 494729 601986 628915 609846 578575
18985 578575 501370 444858 387191 350480 381124 404175 437661 432906 432017 489152 493056 438998
18973 438998 463976 440895 446715 509421 493154 407244 434450 450564 390545 375492 281967 237127
18961 237127 192311 170070 243323 194760 211383 292123 293627 299229 255690 234129 287041 329875
18949 329875 374261 406816 369770 342321 285822 257542 325372 362896 341735 237399 162900
18938 162900 176697 164893 157216 169223 202452 199937 155267 136641 153092 177401 224270 182979
18926 182979 97513 95966 167855 197840 161547 198338 239796 290253 281517 239421 191903 267113
18914 267113 251858 256224 280058 287218 286277 230001 204801 202519 172799 80283 124290 88783
18902 88783 116408 216484 180243 195931 148269 112584 162699 228579 186178 164912 192132
18891 192132 224822 214627 88819 123799 214433 260653 265311 206988 159260 45488 -1470
18880 -1470 10892 48646 57889 117064 155595 117096 51440 69139 121235 82321 87891 156194
18868 156194 244624 287530 322061 320619 226253 87307 111020 136704 215008 222552 213536 261040
18856 261040 185794 168332 222515 224326 185738 181463 288025 213379 277417 285628 225001 242947
18844 242947 248306 241287 223940 210774 224446 197379 192812 240946 264996 333784 346438 228667
18832 228667 214520 197133 179458 228967 269993 347189 459279 459324 375053 314741 267648 314829
18820 314829 386544 338320 268644 285517 350067 448777 505970 520165 545709 473626 506727
18809 506727 531975 454853 409035 425342 513984 561458 523017 553413 527739 495996 389890
18798 389890 400967 544755 546162 491773 450046 498274 565288 613364 742863 783568 727242
18787 727242 702834 691786 651544 541814 495895 519000 531133 469912 438483 523862 604759
18776 604759 715404 791568 822856 897781 927242 849203 901367 1016084 1113049 1400808 1888326
18765 1888326 1884575 1552898 1321528 1132262 950396 756426 652310 641651 557681 585941
18755 585941 576743 602151 589951 624759 655373 737820 722251 646885 610346 582938 602184 626320
18743 626320 624253 593898 604151 609287 535572 473861 478455 497769 586759 641683 544838 460986
18731 460986 463470 456137 452306 514982 536886 480995 486643 539777 496364 535213 585091 560379
18719 560379 460256 452548 355563 297403 298119 222988 231708 317634 374571 407881 340302 352024
18707 352024 388036 380820 357141 443670 477217 455509 420465 393244 474876 561394 543854 517944
18695 517944 528054 517364 465401 466593 458445 525481 673505 686549 648998 669688 772811
18684 772811 728339 721350 738611 702096 755811 869626 940309 939766 840795 692078 676370 768518
18672 768518 782369 817076 785960 845336 895961 888537 800607 713924 688990 721607 831464
18661 831464 740390 707433 758237 769209 790170 797325 865816 951322 990362 946720 937337 973981
18649 973981 1044379 1003262 1016202 1014140 977276 999084 1055948 1150654 1152102 1147341 1142868 1105893
18637 1105893 1126301 1198355 1320526 1483558 1791465 2135898 2266560 2181485 1978254 1970952
18627 1970952 2113003 2357724 2629153 3073474 3888441 4969204 5711894 5361997 4491255
18618 4491255 3811930 3223389 2870157 2751175 2885007 3319715 4042456 5226704 6562998
18609 6562998 6857896 5781938 4511510 3588169 3110448 2792813 2644778 2695274 2799689
18600 2799689 2827685 2908371 2979310 2995057 3064013 3230330 3313141 3506746 3702232 3951391
18590 3951391 4344049 4754194 5176959 5835070 6916418 8623152 11400151 15576135 20828937
18581 20828937 24093764 22434531 18247933 15241583 13990033 13993353 15494636 19036043
18573 19036043 25130835 33705528 41255646 42936868 39783956 36861682 37379486 39118194
18565 39118194 36897132 31188661 26527418 24508787 24522300 26095215 29283191 34618178
18557 34618178 43179590 57166282 80255145 116238703 161133824 198653300 220809878
18550 220809878 222644212 193997935 147266337 108744005 88359148 83215046 91264772
18543 91264772 113553292 149251792 183524598 195234229 184547876 168234414 157890121
18536 157890121 150088569 132950397 105122065 77694780 58221497 45951239 38591999
18529 38591999 34507018 32726589 33114980 35964388 41765483 51602959 64559043 72938593
18521 72938593 70086332 62286327 56585878 55186723 59779341 68104631 72351944 69410939
18513 69410939 65738624 63478147 61706065 64047948 70120583 73559430 75666090 84336285
18505 84336285 98337914 105355273 102615440 98793161 91616129 75255890 57912065 47436899
18497 47436899 41590565 35386007 28091100 21890483 17761322 15241752 13688634 12848492
18489 12848492 12796183 13523108 14894906 17364119 21112091 24638434 25581304 24134218 22336988
18480 22336988 20052036 17544869 15997199 16065772 18154335 22631452 29044863 32529336
18472 32529336 28621398 22178913 18372480 16346797 14030072 11446995 9601396 8407541
18464 8407541 7677656 7271106 7159933 7286300 7977564 9339395 11239995 12426160 11664466
18455 11664466 10218025 9292844 8703151 8573826 9210856 10654592 12295502 12967422 13306903
18446 13306903 14258076 14223542 11820274 8674418 6514204 5315712 4561101 4126545 3847024
18437 3847024 3604797 3514563 3276201 3034519 2951350 2906182 2909979 3042188 3183211 3198499
18427 3198499 2960240 2751685 2518237 2415309 2452054 2494718 2344980 2203723 2035815 1911054
18417 1911054 1856335 1816672 1706026 1569550 1478879 1389121 1437272 1464715 1491013 1472336 1413896
18406 1413896 1391469 1330720 1227488 1256039 1262364 1315654 1310323 1349828 1353371 1330826 1339243 1335186
18394 1335186 1329962 1377419 1393167 1268701 1175816 1164535 1105135 1119853 1069591 1024364 963912
18383 963912 1001553 1103453 1073486 971139 983525 1030377 1034066 965393 930393 885276 860686
18372 860686 829708 802000 790833 796905 894351 904348 795625 713729 708065 774251 930448 920365
18360 920365 861900 865786 866204 816684 781171 742528 723154 776592 791826 747930 738033 716482
18348 716482 630135 559944 519921 544985 646052 671773 675207 662261 656628 693417 794379
18337 794379 793206 776672 772454 800220 767265 746731 715457 642514 691595 707405 599765 476546
18325 476546 446620 506514 524709 530752 571996 574492 546190 603321 582635 629293 620853 615615
18313 615615 590978 532472 449589 443875 383828 315359 325814 386141 395816 418053 567726 658776
18301 658776 663969 595138 563481 485164 481640 503873 502223 515195 586021 587636 534675 557072
18289 557072 508388 472264 459403 518512 542159 551154 579833 538525 404472 369020 366112 312356
18277 312356 352571 357766 368312 436372 433560 453462 517835 594105 580398 542027 417578 368350
18265 368350 357847 287570 268049 203547 261518 339278 385467 350734 304256 293155 337641
18254 337641 334388 270419 195196 196123 155177 184025 264706 320207 335707 339550 281312 266320
18242 266320 250928 292444 359126 398020 372998 475763 605667 554222 479051 339897 212659
18231 212659 206748 251618 262182 284758 259518 174655 180750 198310 151476 136208 103924 104882
18219 104882 171189 195786 219043 224607 208001 265624 282852 278060 224206 247904 282380 365233
18207 365233 356673 395566 384998 327955 338175 360450 290941 163878 178245 226493 283872
18196 283872 288480 313807 342034 327223 272394 205411 294774 336738 345682 310210 228897 243471
18184 243471 242438 247490 334287 335341 332470 364634 335189 329720 319707 316770 366332 388242 300912
18171 300912 235181 281353 274357 275644 318226 373824 341538 284919 294752 324322 289768 221492
18159 221492 267384 250976 344307 548263 570682 539495 541273 610071 673704 658502 753775
18148 753775 838993 815879 829098 860273 820883 789360 862159 903271 1010845 1127915 1079336
18137 1079336 1043761 1036484 1148540 1179891 1155135 1266824 1393609 1489839 1541443 1548726 1751719
18126 1751719 2039269 2251393 2527228 2927079 3381825 3904412 4543360 5381639 6461822
18117 6461822 7788970 9541028 12029947 15613494 21300734 31192606 48601260 79647248
18109 79647248 133077122 197550483 206491645 146146673 84976031 51124437 33681475
18102 33681475 23879875 17792417 13628653 10749469 8709375 7301190 6260683 5507810
18094 5507810 4987204 4504870 3929441 3385217 3014801 2755503 2579985 2281623 1992698
18085 1992698 1814079 1709567 1631236 1451058 1323597 1243249 1189191 1199975 1074904 1012060
18075 1012060 901492 835022 820260 790496 749900 679258 803011 838781 824346 684103 655162
18064 655162 634805 725606 831581 875232 928726 1007683 1088784 1262656 1360217 1273472 1170281
18053 1170281 1126727 1064809 950396 821273 855492 957116 912840 813934 810664 926743 1079532
18042 1079532 1053891 982103 950616 880979 755461 751205 708842 563441 491789 531940 470618
18031 470618 407602 393869 420229 470176 417984 422870 408104 367804 346773 256548 253336 256299
18019 256299 254078 240765 310444 440932 609986 672197 621894 543188 525753 478128 528317
18008 528317 587515 662072 679363 606573 654158 822897 1035840 1155906 1207172 1227594 1094320
17997 1094320 1020686 1067178 1221829 1299953 1255747 1352055 1375632 1317206 1335370 1368328 1343727
17986 1343727 1245418 1160911 1051553 945975 806156 666505 579907 552050 452883 358841
17976 358841 312530 294564 317511 290069 249822 245299 269805 387997 355756 310117 303362 319276
17964 319276 280765 192501 210892 286044 334951 410864 574937 588900 545071 524359 473942
17953 473942 407934 446818 478017 463204 394511 318964 317128 356272 520435 680089 773613
17942 773613 710453 673535 641501 527063 507325 616485 578336 479298 400900 267740 193313
17931 193313 232935 276014 215403 212725 157682 150638 190440 236052 235602 223066 142685 148212
17919 148212 129394 149557 241694 230298 191039 187623 156898 54002 -20303 -71662 -45985
17908 -45985 25131 -4355 -85175 -91175 -54927 21004 109740 132059 102741 84024 112443 82544
17896 82544 13466 13087 118823 161589 182466 153931 74345 37044 89499 169166 235092 161026
17884 161026 65416 11494 56186 61867 38218 46760 117921 84459 88269 120875 116455 138538
17872 138538 165946 156745 92459 17824 22086 69386 39929 75854 104120 110554 152565 134161
17860 134161 56608 48187 11396 -63731 -74716 -33344 25385 49714 47078 16970 -61581 -106358
17848 -106358 -66711 -33255 64926 154384 159296 198720 96337 125609 111566 62363 -4332
17837 -4332 -29032 16593 69326 79349 95220 97793 160848 160894 110129 124344 113565 -3062
17825 -3062 -77474 6798 55486 115871 149214 159265 88331 29942 -51766 -42618 -32911 -7394
17813 -7394 59767 116971 76927 28695 9448 -34105 4366 -13085 -57047 15477 18159 40868
17801 40868 51540 38252 19390 -5968 -52438 -14870 28120 35338 9975 3167 -13795 34109
17789 34109 73519 30599 49556 110633 121912 112565 131679 144692 66894 -75 -11930 -46875
17777 -46875 -6181 -14868 -45182 -39044 -21590 8917 -17345 -48778 -27423 -25005 26989 94975
17765 94975 122338 -25922 -101405 -78476 24173 146255 133850 99249 58670 -34192 -137552
17754 -137552 -40523 57052 -10355 -95219 -42935 90510 130611 115727 104497 8951 -86861
17743 -86861 -72237 -25612 34880 -35420 -47312 -18052 34452 50007 3055 -18322 -31691 -12956
17731 -12956 -23842 -49818 -126279 -77858 -82368 -77100 -14817 43419 101208 104257 135009 166861
17719 166861 78975 -54791 -93911 4654 69385 -10664 -135747 -160347 -121819 -58174 -97001
17708 -97001 -40990 -36318 -8208 58204 31407 49306 54435 49946 38482 43961 71257 138022
17696 138022 77093 57285 52291 -15950 -61905 -85721 -22227 10254 107315 37850 51522 100285
17684 100285 43281 -43286 -83274 -52813 38554 28339 -11129 -45410 -50926 -35209 -31938 -20459
17672 -20459 19927 28860 43189 14186 -68878 -92258 -78803 -83891 -96170 -77992 -183656 -203360
17660 -203360 -139528 -98187 -8401 62745 66739 74578 -3538 -50914 -138246 -81743 4296 73
17648 73 -9550 3024 96572 59780 301 9087 60888 106469 69100 16344 -9031 61348 61034
17635 61034 85016 32489 -112478 -123517 -90879 -149231 -246614 -279996 -122165 -61770 -76087
17624 -76087 -50639 -3017 42731 62908 91117 97409 25461 77035 68185 47969 31675 54883
17612 54883 84164 37373 -18906 -41903 -68216 -85021 -90231 -22638 105028 65519 6337 15226
17600 15226 -49259 -86563 -72269 -26542 24851 31444 74401 64463 1580 -71144 -46695 -46134
17588 -46134 -97872 -159509 -161850 -121684 -87190 -31828 26998 -11891 35022 24052 -37219 -18176
17576 -18176 107031 95039 42375 -22845 -59173 -4161 -60840 -137486 -166659 -156814 -28465
17565 -28465 23279 24397 5398 44900 32594 54712 24799 -68879 -100260 -108376 -99725 -109032
17553 -109032 -28675 129594 203046 158996 30795 -40619 -71025 -16528 -7017 -82272 -128604
17542 -128604 -65916 767 67009 1903 26125 44423 107974 67171 29940 80251 27131
17531 27131 -67183 -94296 -33077 18024 -19827 25994 5733 15901 -2536 -67439 -44308 6092
17519 6092 -36581 -11312 -45292 -165227 -204481 -184070 -207321 -161222 -81913 -99279 -121152 -139658
17507 -139658 -126713 -63926 -11404 -37617 -3604 -1737 19961 -59551 -94475 -101221 -83749 -106093
17495 -106093 -178978 -135827 -47045 -10616 56496 6144 613 -9905 7188 9500 -50729 -79238
17483 -79238 -32197 -15925 67922 76043 22258 -1595 -85856 -188705 -131384 -24307 -45948
17472 -45948 -79332 -108604 -19484 45183 16049 92799 95175 102975 75353 74229 87632 9824
17460 9824 -64764 -54410 -21100 -47147 30370 105616 102391 48576 17284 -4687 11010 112686
17448 112686 148420 174743 317450 451950 500660 698671 1038697 1187469 901246 512426
17438 512426 281555 187633 101682 67268 57498 62038 79509 65240 -23170 -110538 -69608 -6541
17426 -6541 8592 -56840 -99053 -17356 1099 91185 88528 14278 -858 -39917 -37363 -41209
17414 -41209 45380 146715 129130 61906 7260 21790 67275 110036 89423 69760 66126 41322
17402 41322 119319 162306 84543 84162 54686 50693 10695 -10458 -22401 36101 26060 -15780
17390 -15780 55220 36675 65817 48412 10752 46961 86133 140633 84192 -40753 -130263
17379 -130263 -152450 -97200 -76179 -137346 -212881 -218372 -166133 -97499 -54130 -5312 46549 -7682
17367 -7682 -15331 -14764 114362 106613 51817 26073 -15368 -1398 -60808 -125551 -107361 -51593
17355 -51593 -34767 -34240 -45161 -74500 25205 -35483 -148746 -106808 -28121 -6825 -94441 -109698
17343 -109698 -92443 -156192 -62902 -47191 -102920 -88160 -89957 -102290 -3944 56598 23940 2694
17331 2694 7059 11431 -56082 -49338 58772 123106 8156 -49098 -44707 -54958 -38168 -26780
17319 -26780 -29288 33641 24164 -8587 -48069 -100883 -58140 -14268 34619 6207 -33857 20027
17307 20027 68376 9174 -15385 -37058 -48826 7088 -43668 -83877 -75551 -131899 -93990 -95991
17295 -95991 -148559 -119806 -114569 -170528 -156909 -67015 -31277 31908 5 -70019 -144926 -86914
17283 -86914 7741 -61490 -88003 -1795 20722 13937 -25741 -10276 8380 -66686 -27495 37529
17271 37529 43717 -11666 -97604 -17520 82020 76332 103717 73142 -3759 -50204 1011 48387
17259 48387 85631 79049 57204 -5639 -7622 -35751 -59234 -41053 -46889 -44564 -48287 -16099 -56976
17246 -56976 -13984 36319 34043 58632 23851 40024 19210 37783 42345 103781 101255 115435
17234 115435 123297 112249 41767 12549 -22690 -8532 1155 22889 -11627 48017 103027 88052
17222 88052 31329 25024 17640 37818 54083 23512 75967 68158 -28566 -79148 -63323 -25170
17210 -25170 -13989 -90423 -109661 -34077 31568 33420 39296 -2113 -116763 -118825 -39818 54667
17198 54667 60346 70598 61089 8204 34374 118466 151284 152844 92100 107816 124489 74780
17186 74780 -13102 -11892 12944 55140 27353 -12410 -44539 -22793 -15965 -21695 -39731 -13830
17174 -13830 15917 21363 55528 115086 119835 15423 -112882 -158628 -171636 -198634 -105917 8050
17162 8050 44123 68753 48548 117295 238223 188463 140599 121922 78250 66484 86436 23651
17150 23651 9452 52104 19438 -19273 10138 27689 108821 164932 66842 1790 96282 150103
17138 150103 58855 128072 84938 -75897 -83635 -9532 42462 72857 29889 6614 -44934
17127 -44934 -46865 -13883 65001 58549 103315 114721 62710 70278 81115 100438 110671 58209
17115 58209 122038 134932 81190 55268 76878 61276 38589 25441 34576 -17644 7143 41252
17103 41252 54193 21006 23412 -12719 67498 64621 -46665 -33584 33714 4664 -16364 44938
17091 44938 59903 -11638 -109110 -125901 -101254 -44319 63952 56890 48884 74826 62990 11808
17079 11808 2144 -115426 -166238 -183210 -179294 -154832 -115666 -54328 -58300 -43287 -39250 -7702
17067 -7702 -32052 28520 32006 -11924 -58948 -125439 -115808 -85578 -120541 -119333 -116062 -111207 -76749
17054 -76749 -29987 -38551 64632 127774 101017 -1487 -69439 -4763 32260 20172 -18258
17043 -18258 -90607 -67501 -89937 -71516 -77228 -140417 -108923 -47019 -23551 -17505 -4432 -23386
17031 -23386 -31308 -59987 -66534 -88920 -72108 -22387 52070 87454 21929 -51048 -66836 -113930
17019 -113930 -139950 -94787 -97217 -49289 14889 -29650 20931 20782 -15357 -40636 16047 -49827
17007 -49827 -81359 -51617 -39473 -35058 -73763 -100247 -136434 -131188 -151962 -108816 -57255 -35202
16995 -35202 14579 -8964 22196 -21310 -68023 -23673 6149 26624 2766 -87808 -118028 -214005
16983 -214005 -206386 -147123 -97691 -65455 -44859 -52974 -14038 67791 77913 -33638 -57555 -39832
16971 -39832 -156782 -112550 7850 38532 40095 98437 33442 -2029 34451 50251 4250
16960 4250 10879 53769 24550 -7515 17144 -17261 -132975 -87423 -77058 -107257 -28905 53649
16948 53649 63780 28672 4873 -22473 -43737 22121 97790 95253 108937 122989 129390 148427
16936 148427 139689 250706 293379 249300 241107 214313 146414 116371 19445 -74574 -25472 10588
16924 10588 14565 39927 44059 -2653 -50077 4317 -16691 -17977 27166 27899 -38608 -15704 44227
16911 44227 33167 -10146 -17411 -41783 -4345 1934 -90295 -66304 86905 117467 158154 166876
16899 166876 142262 35428 -31628 29941 49823 93220 58004 71160 120355 1467 -8873
16888 -8873 54428 -31869 -75830 11971 65600 55757 124098 160557 130518 164807 103094 60254
16876 60254 58536 40329 39080 98378 168513 140490 77732 -7616 -125334 -118108 -76082 -20788
16864 -20788 26077 49308 -35425 -58263 -124196 -215398 -192678 -185861 -177582 -281980 -244658 -132532
16852 -132532 -109940 -61436 -26477 -40462 -40846 -88501 -45524 84707 86354 51761 25996 -12731
16840 -12731 3749 16842 -60536 -49954 -25671 -123894 -111652 -15351 25202 29379 10107 38275
16828 38275 70893 -32399 -77618 -95034 -30046 -9836 26915 113926 36058 -726 67162
16817 67162 69292 72586 20470 36240 54311 7234 26087 75114 -20708 11516 106347 19471
16805 19471 -36229 -16661 -85411 -66346 -71667 -93368 -73013 -87386 -90484 9167 7453 -127938
16793 -127938 -145299 -148974 -212986 -117372 -63997 -105068 -77769 -1233 -5313 -22168 -80870 -143860
16781 -143860 -88388 -30258 -2023 -1362 1786 57708 55707 50840 -20118 26701 179039 115894
16769 115894 53350 -4826 -34864 30697 47800 2796 -95412 -145461 -118164 -27809 3483
16758 3483 -54315 -127144 -110830 -44431 -54780 47088 128070 79566 30902 32347 -9916 91024
16746 91024 137513 103936 113155 194105 245401 62311 -78141 -90339 12902 63730 69616
16735 69616 11333 -32488 -25258 -45745 -145321 -128491 -72801 -82703 -59704 18318 48097 45721
16723 45721 170 17345 43104 53411 10323 19069 -31911 9521 38513 -4080 34284 61277
16711 61277 2970 -79481 -86496 39780 111713 141567 122575 57292 -15202 -54691 -75053 -24942
16699 -24942 -8019 16047 75739 113003 48931 27039 66787 84782 86818 107407 40019 -12371
16687 -12371 -51420 -122199 -120497 -147646 -86164 -10186 9097 21844 -24808 1545 84213 92047
16675 92047 49879 7192 76074 99419 50258 56044 111066 95263 142982 144866 79607 -20646
16663 -20646 -56451 -35183 2832 60904 113469 63219 28476 29382 84804 81435 71992 -12185
16651 -12185 -25346 -14183 -69269 5664 -7148 -8437 -31325 -85341 -81053 -44626 -30326 -17663
16639 -17663 -19385 33611 14857 15236 45307 11859 3269 -41683 7985 56366 149660 160570
16627 160570 30427 -52184 -12130 -21543 90555 143384 134290 160686 71416 -24585 -69697
16616 -69697 590 56659 21849 -73005 -142592 -83019 36855 84628 87580 90765 85965 34991
16604 34991 36383 61450 36904 -40108 -86797 -45817 -33811 -16829 23497 -17627 -163063 -48583
16592 -48583 45081 13401 -143228 -154003 -101512 -120911 -87944 11323 79269 108095 61746
16581 61746 77928 92122 94452 56380 37864 -8137 -83640 -75226 -158201 -186297 -126302 -107814
16569 -107814 -67975 -2594 76176 21936 -69567 -26465 -56432 -33734 -46472 -45279 -55868 -110591
16557 -110591 -77328 -117799 -177467 -226284 -276362 -214620 -152445 -66520 -11578 24357 7613
16546 7613 -48794 -22330 -16347 6442 2872 27279 905 -33215 8316 8990 26532 43690 117105
16533 117105 83263 70384 60504 26659 65527 74442 75808 -2306 6031 61476 76129 77013 37715
16520 37715 9313 -7426 -7112 69913 -23073 -101683 -42100 31573 66714 79651 58491 3967
16508 3967 21924 -74343 -83659 -86686 -125205 -80643 -36872 -49943 21840 42267 -1875 -20445
16496 -20445 -44866 -22128 -38093 -43266 8937 -33949 -134417 -146844 -127429 -3616 -76808
16485 -76808 -143290 -58294 -45411 -72399 -86068 -52583 -10425 66704 62710 7553 -61176 11850
16473 11850 90342 16695 -57990 -80210 -45984 -37177 -78755 -98997 -183828 -216469 -199447 -108368
16461 -108368 -10209 20246 27531 44801 68586 64134 -30035 -39138 16310 117422 117406 5684
16449 5684 -111224 -142493 -78140 -105113 -98282 -120274 -146727 -41700 -27824 -78665 -161007 -236797
16437 -236797 -157146 -90826 -71991 -6447 -210 979 -57715 -65187 -67692 25798 70303 3591
16425 3591 -34891 -35126 -18516 -87830 -57978 -78092 -109283 -76406 -97438 -109223 -107500 -64046
16413 -64046 10466 -25095 -282 -17616 -9477 -53123 -55688 49752 3404 -27620 -44145 -88319
16401 -88319 -111614 -153282 -224869 -185393 -75680 -95413 -86934 -36781 16821 -21370 -34663 73016
16389 73016 95604 37329 -16298 -33908 -58802 -53579 -95963 -73094 9489 125399 107740 3770
16377 3770 -62777 15804 67131 76354 124971 149384 166469 93726 90159 69027 -14012 -60622
16365 -60622 -50029 -31207 -13082 779 16512 -76820 -175330 -93924 71156 75060 38369 96445
16353 96445 51291 19523 -35957 -67482 -30137 45111 110997 63067 56630 16460 -29995 34980
16341 34980 129528 128078 134436 57302 -55619 -42517 -23243 -13939 -13511 24848 15543 -44738 -83902
16328 -83902 -46201 63239 -2804 -89960 -37924 15484 -33453 -68962 -52662 -52175 -88464 -167437
16316 -167437 -67161 50786 16678 21631 100299 119324 111101 79576 16919 -28010 -21787 -13515
16304 -13515 -7017 17362 -9759 4321 -15144 -28124 -14959 115413 135450 133271 95837 55819
16292 55819 -8866 -49915 -63746 -50643 -39652 -29830 4342 26 -18672 -75560 -84946 -87617
16280 -87617 -71441 -55811 -58724 -48073 -19683 -65765 -66750 -22196 -134019 -92672 -73646 -46321
16268 -46321 -49899 45524 44653 -22312 1934 130822 87101 91699 59594 -8879 57907 110837
16256 110837 85472 79801 59082 29978 -17973 -30146 -80897 -88075 -18443 669 -59825 -88007
16244 -88007 -58108 -11615 40839 -38903 -193321 -220287 -131694 8823 95244 171876 163007
16233 163007 52141 -33973 -123321 -162307 -187292 -178171 -173626 -152040 -122780 -64930 -43738 8208
16221 8208 -1975 -49185 20805 37280 -17583 -85927 -85870 -88009 -97513 -30276 9076 21693 46820
16208 46820 27675 15113 79903 97090 59180 75378 120805 47295 2210 -29515 -58713 58284
16196 58284 50077 -83807 -84607 -76646 3907 92542 125983 -10001 -95757 -89462 -2672 -3680
16184 -3680 -72852 -31535 -28021 -52370 -20120 79830 84944 -27048 -18067 51815 79234 72544
16172 72544 35763 -34058 -38150 17542 77525 105260 87461 54633 27119 -5628 -30319 -31690
16160 -31690 56147 75285 44539 71275 -49876 -134909 -112528 -81296 -90866 -102029 -88814 -58072
16148 -58072 -43393 -82882 -83625 -54227 -15497 -63516 -49747 -18455 -62404 -78050 -85724 -55839
16136 -55839 -145495 -151603 -135392 -208176 -166522 -149645 -105541 -98669 -206473 -181227 -63719 38128
16124 38128 44965 23121 16993 -2101 -48399 -2541 -7018 -16161 31807 -7448 37688 -57778
16112 -57778 -149428 -215758 -207269 -136805 -40324 25104 144700 134277 32217 -41983 -95561
16101 -95561 -73106 -26671 24601 6164 39251 47534 -27024 -18417 8066 25448 41000 -9189
16089 -9189 -111911 -156269 -116941 -76181 -94444 -67021 -127292 -171269 -93651 -53060 48319
16078 48319 98002 12139 24205 88670 66464 30904 34470 38768 25689 23618 -29200 -51851
16066 -51851 -92751 -85603 -67916 -34917 -64735 -82676 29573 69529 -45523 -91350 -72121
16055 -72121 -4754 -14665 -38494 -15992 -33145 -35229 1636 -10923 -112381 -62043 15923 1629
16043 1629 -21561 -31911 -1513 73348 118166 112413 197995 216743 147657 26460 45548 52021
16031 52021 89156 65821 75301 111504 167011 185184 63407 -8463 -41153 -52768 -66286 -79748
16019 -79748 -69499 -144866 -159109 -89933 -144845 -82849 -43477 -35902 -63778 -41914 9020 -4432
16007 -4432 8144 31012 -27125 -59083 -117852 -102300 -12899 13267 38158 28016 17807 56277
15995 56277 58496 111205 71169 25660 8702 66057 138594 176015 35248 -75829 -103324
15984 -103324 -101139 -53585 -80465 -97232 -130513 -143194 -55645 28012 -15694 -87713 -96799 -80398
15972 -80398 -109382 -90396 -5660 28019 35189 2690 -58769 -117226 -42751 22641 66734 74092
15960 74092 37311 47910 2137 -117157 -57223 -35799 -85920 -177727 -229449 -226497 -193193 -168258
15948 -168258 -138570 -120228 -108992 -124286 -58109 -36533 -39934 -6784 8850 42379 100493 37077
15936 37077 51581 40797 70559 122839 128237 61959 39368 19102 62579 90052 123678 182430
15924 182430 152694 21286 -14238 47223 83448 56362 -20 -5122 -36694 -640 7568 36087
15912 36087 -22975 32448 21006 -28603 -28605 49499 83420 83201 1102 20637 -15378 -65803 -181296
15899 -181296 -151480 -124865 -67050 -71425 -131377 -104188 13945 24851 52543 50938 22431 1445
15887 1445 -26508 -53707 -59382 9619 110081 149081 127636 15019 -30537 7583 33656 17420
15875 17420 32182 33375 19155 78750 89899 9588 10306 -2389 -11549 22624 26488 -14235 -49410
15862 -49410 -70734 73923 102751 6995 4612 86517 164489 176104 152763 160297 43544 -32008
15850 -32008 -43417 -80579 -28409 -46857 -39635 -2460 48639 41594 30950 24840 -68108 -39110
15838 -39110 -55162 -68712 40657 17262 19077 132223 173410 39840 -83022 -69096 -13094
15827 -13094 11895 49893 4025 -55280 -20980 -33456 8462 -16549 -106348 -161217 -113348 -43826
15815 -43826 42904 -26244 -50431 -43552 -137557 -108577 -36041 -41068 -103341 -64242 -49379 -54783
15803 -54783 -93626 -96239 -35737 21718 49365 89084 166738 217444 142577 119337 134730 132856
15791 132856 173000 106212 57509 68791 87453 14747 -80563 -18684 14203 97304 90493 5221
15779 5221 -20014 6363 76092 54149 -8602 -24963 -2381 5756 -38124 -58837 -94494 -15124
15767 -15124 22061 24302 22062 -34248 16792 16587 111858 149266 137218 93642 58160 8116
15755 8116 -20915 23971 35913 16565 60459 96292 78371 85899 34669 10576 -79827 -126382
15743 -126382 -61820 13791 -25696 -13968 -17126 28724 32837 39727 4876 -61499 -9042 -33480
15731 -33480 -93158 -27420 44867 90313 1738 -61393 -24593 4634 -45542 4531 19246 15254
15719 15254 -80718 -67049 -57615 544 28010 -12440 -37814 -5989 -1633 5723 86653 76921
15707 76921 1937 35991 8668 37084 32328 28047 64263 93740 33081 -8007 -21502 7909
15695 7909 -26282 -15148 -91277 -160391 -112189 -72586 22873 35037 33585 28777 -93489 -158018
15683 -158018 -124380 -139709 -95829 -30924 -60945 -23172 32106 69272 114173 117835 43445 2989
15671 2989 1800 -62957 -32002 -15141 -90773 -109865 -86661 -119399 -69975 -58880 -80268 -39692
15659 -39692 -80258 -151922 -135075 -94135 -19498 -22770 -31748 -9986 40671 40847 32703 -688 27050
15646 27050 10640 -22919 -105773 -68526 26151 51731 20891 31802 -17448 -118323 -62561
15635 -62561 -23978 16738 1708 -42631 -25321 -51300 -123852 -139386 -116112 17059 57107
15624 57107 72880 102298 223766 264022 191981 134333 128670 60333 -22677 37152 44527 97314
15612 97314 -10653 -82663 105949 147210 99795 49750 -11081 3638 9180 -45422 -117854
15601 -117854 -127346 -89555 -40990 -16097 23049 -920 -59206 -47172 -60766 -28041 -17195 -82555
15589 -82555 -67993 -2499 9331 44529 130641 90090 124471 118077 48285 -79966 -100808 -35293
15577 -35293 62507 74456 80947 131412 107346 -691 -44872 1099 66660 86386 80721 86069
15565 86069 53220 41219 71562 68764 74345 101996 140624 129378 123407 149115 186672 134035
15553 134035 163611 127047 152942 124513 156859 186121 174038 191836 95733 67397 68271 31384
15541 31384 67207 22105 -23093 45642 33453 -53042 -144057 -73431 48501 -2776 -54283
15530 -54283 -88286 -43887 -118639 -93225 -13923 70544 101760 129235 7829 -74050 -31219
15519 -31219 83549 53143 38743 45706 49385 -31336 -69134 -71137 -153488 -178572 -141596 -99873
15507 -99873 -64598 -43962 -20613 11738 57100 103522 136811 96569 71511 42052 -26292 -89003
15495 -89003 -149929 -182420 -153607 -137583 -65668 14830 58179 75220 85171 165334 216818 234547
15483 234547 160636 11831 37092 44234 -16647 -26450 13713 7554 14454 97025 75600 55040
15471 55040 -12890 -86243 -97015 -11964 6000 668 38217 -4090 -22080 -24692 -37889 42752
15459 42752 36150 -13784 30857 61994 23323 -41686 -20533 -87317 -117068 -117754 -104730 -97551
15447 -97551 -77310 16085 62978 59555 55208 55869 127592 215083 251595 181146 166656 205901
15435 205901 160381 147603 98175 63688 76611 106958 132452 196879 172303 73269 19307
15424 19307 15601 -7121 -19129 17744 4594 16787 73378 160495 71947 -75679 -165537 -84605
15412 -84605 -20707 27606 110561 204318 300267 191858 119788 93489 60409 84012 80421 146420
15400 146420 149696 144276 174019 142848 96902 12983 3284 94249 101009 144871 105310 89208
15388 89208 35878 35986 -4858 -51211 -77635 16114 95494 77978 -4152 -16512 93928 15556
15376 15556 -69132 -83266 -118056 -101545 -65330 -48606 15299 -20754 -56627 -45710 -76859 -71328
15364 -71328 -48837 6527 15121 19723 67956 59681 -6317 -83050 -72953 -40860 -118602 -120510
15352 -120510 38632 135778 71826 -10697 -50021 9554 -15069 -25456 2586 9016 39756
15341 39756 7007 12984 30627 47201 24927 5952 51378 119029 95725 31530 61267 112311
15329 112311 47957 -91595 -153637 -258714 -299590 -220388 -140789 -100922 16916 152567 165110
15318 165110 102179 28824 -49978 -29893 -70217 -176970 -209745 -160989 -92052 21329 24377
15307 24377 33124 100147 45135 12496 77030 132014 117051 104835 177197 190887 84414 1240
15295 1240 50147 52775 70969 166410 230914 165113 67033 52757 -32884 -32542 11118 -57988
15283 -57988 -88188 -35734 -34417 -6231 -39734 -103026 -78622 -94160 -39492 -64555 -100734 -12935
15271 -12935 100716 97807 54441 -19678 -138864 -229652 -173762 -33789 5897 -50255 -85240
15260 -85240 -60992 -21670 11194 102825 42929 -52179 -6271 -12727 -119930 -118898 86012 170295
15248 170295 185274 150162 63117 38346 49643 -7907 -13446 6523 25822 16326 -21534 -59898
15236 -59898 -76284 -177828 -223444 -242882 -208561 -163059 -74484 6481 -2555 55601 44966 53147
15224 53147 17424 -87788 -166774 -204020 -177223 -125796 -28963 -23325 -117399 -160083 -37886
15213 -37886 -347 -92867 -166383 -178050 -135481 -114426 -127681 -92712 -12731 75434 5695 -31448
15201 -31448 4135 -20756 -38339 -119033 -107308 -124033 -60487 -96271 -133062 -104880 41414
15190 41414 106664 -2969 -57306 -104175 -139792 -138485 -52691 -142760 -139480 -102859 -94674 -83729
15178 -83729 8741 -46833 -128973 -226383 -221647 -58291 -63796 -104849 -40380 -85258 -173207 -108185
15166 -108185 -18251 84376 182557 145408 683 7199 72929 9147 21514 66967 77945
15155 77945 119246 114886 91901 86444 40720 39889 31827 16116 3083 -24114 9 -57845 -40876
15142 -40876 10793 25673 -17968 -91238 -117915 -87515 -23640 -123651 -188570 -206702 -144597
15131 -144597 -102879 -69246 -34265 -33287 -11910 -59152 11328 89508 113925 87017 73328 93538
15119 93538 75327 78130 88409 134550 143349 132996 195124 281499 319979 283214 386905 568449
15107 568449 722181 801426 716607 527775 421328 377356 315181 206846 30228 14074
15097 14074 25246 68482 45488 -3436 12900 56863 70729 94662 84717 108665 142336 57385
15085 57385 -13602 -9755 -22844 -166402 -96171 4019 2089 44611 96880 117557 141769 100288
15073 100288 104946 85016 79400 125662 227899 137378 35393 74449 98549 57787 10260
15062 10260 -3611 50545 106052 101053 69498 49279 57907 65949 41219 70071 97225 78258
15050 78258 54026 34525 110651 193652 162358 48350 -624 -10276 4671 -38320 -184526
15039 -184526 -176309 -169517 -166611 -110869 -26477 -13186 56181 63251 50426 1415 -65914 -82876
15027 -82876 -60406 -4160 67485 36985 83302 101948 102414 26921 25037 61076 81593 1790
15015 1790 -49531 55470 166777 234370 171925 55931 -31727 -15150 15714 47320 48258 105499
15003 105499 105192 84645 93206 105330 68624 -3351 15802 127158 164804 107484 1247 -12953
14991 -12953 -41088 -47339 -88133 -116870 -73595 -43068 -113467 -161564 -62124 34064 75709 45867
14979 45867 3577 14995 34424 86992 61534 28075 42434 5397 -67043 -53211 -68023 -135863
14967 -135863 -170460 -58096 24092 42623 66239 9921 -129280 -208212 -210897 -217924 -223493 -185144
14955 -185144 -159776 -225607 -249821 -180856 -5234 20693 26147 -34066 -37754 -66633 -54380 69857
14943 69857 176424 163957 120290 44346 47381 59601 97641 106155 81330 106083 88976 47012
14931 47012 71474 85390 31431 21082 60396 48610 52515 26423 -5455 -36420 -24727 31805
14919 31805 33504 115448 142219 140684 126597 73340 70045 88225 95062 103964 108211 61602 65421
14906 65421 3968 -12978 -63516 -147384 -162774 -112405 -62562 -38256 3146 66722 105084 163052
14894 163052 126039 3610 -75663 -103994 -48555 -41274 -40783 2104 25128 -45231 49105 53136
14882 53136 -13417 -59404 -37636 -54003 -64332 2160 -24349 -21350 26106 38414 33469 -10994
14870 -10994 -12200 57774 28481 4519 50017 153310 264164 247999 193131 209487 220022
14859 220022 105107 27447 6676 31261 -75581 -67468 -30229 -28622 -19344 -52611 -28909 102110
14847 102110 144979 66676 -34434 42648 174532 100917 26969 104370 93300 66199 36610
14836 36610 49006 -38274 -166645 -210569 -194174 -225785 -143407 -116857 -87117 1480 -32010
14825 -32010 -89960 -76374 -119978 -149172 -137675 -110075 -151814 -171742 -95335 32686 17112
14814 17112 -48189 -79403 -8699 58994 105371 9684 -89369 -33001 57401 113913 158556 70051
14802 70051 47500 27003 35752 -2835 53566 30962 -43645 -39657 -12292 30372 28969 37830
14790 37830 -10772 -33110 -6888 -76963 -113653 -137403 -90667 -21298 19528 99860 142747 79551
14778 79551 -73040 -115719 -57704 23782 77960 151928 88670 -8955 -79016 1256 77755
14767 77755 -4352 -12162 12881 -35654 -33603 -40377 -45538 43516 33180 -38376 -11785 46712
14755 46712 102094 67391 31517 54535 39963 27053 -98559 -147122 -158371 -113097 -60328
14744 -60328 -38835 8308 50838 72638 70481 110180 92996 73626 82797 52169 60501 123937
14732 123937 180299 135372 -5211 -18673 41446 36050 -38474 -56347 3985 18156 40943
14721 40943 20836 -5124 93895 105032 53343 46450 37108 -5668 -73058 -47752 20538 91024
14709 91024 54330 50691 37643 96030 52358 49274 23637 -45058 -45104 12710 118184 158527
14697 158527 136129 136441 118582 152530 178042 130860 77726 44168 26943 121195 249388 232423
14685 232423 134580 60591 39259 47482 86869 28840 4864 47781 109874 52287 32623 -3559
14673 -3559 -48606 -40738 -101774 -95773 -95199 -150108 -108522 396 47653 32711 18566 31764
14661 31764 28423 38869 38051 125683 73553 -12760 -55122 -26012 28034 98184 127960 131310
14649 131310 187135 159145 39273 77644 203730 235878 205682 114208 90262 65165 71259
14638 71259 1195 -35473 -23398 25894 -37870 -107622 -144121 -34794 -46054 -60731 7962
14627 7962 5536 -84260 -72925 -69019 -31178 64345 89761 65483 67006 117406 199962 175745
14615 175745 112298 71111 114292 115540 108365 135699 89305 85149 107996 55545 -40501 -84953
14603 -84953 -27179 -22401 -10178 22743 -12524 -22412 -34267 -2626 58832 78786 28744 30157
14591 30157 38604 -18891 12347 -20127 76336 90818 85353 -671 -38735 66730 130825 120395
14579 120395 107032 35746 -31468 66163 32263 -132 62060 80003 27138 -24483 -70517
14568 -70517 -68972 -42034 -37498 71420 136395 200714 174949 126922 96605 -17402 -103098 -92372
14556 -92372 -85925 -37157 -116697 -98952 -64845 -9906 -6666 -17547 22470 -20456 -72081 -139285
14544 -139285 -164155 -123789 -83495 -36348 -8158 66369 80272 69556 18809 42388 -12255
14533 -12255 -113012 -139853 -100873 -30770 52147 147149 122667 -23054 -60459 -52954 -129495
14522 -129495 -61871 68439 127079 90993 49612 34922 73797 122213 126253 56148 -41858
14511 -41858 -8402 75149 48820 62887 46295 31941 46295 32929 25902 -1938 36607 114261
14499 114261 90439 76142 146779 134640 45058 -14565 5762 18321 85281 67071 83349
14488 83349 -13875 -82534 -203 30394 75681 67797 36101 710 -19222 -51948 -7786 49348
14476 49348 56011 61746 94415 133764 69604 92092 111455 74031 51220 74800 63724 81658
14464 81658 110642 53290 63853 26399 -8795 47549 97426 50222 -15621 48715 37865 42131
14452 42131 117246 38299 -12924 -30305 -11317 29945 -42167 66470 214553 214771 212983 252354
14440 252354 215467 201015 143199 116479 97858 65731 5712 5134 -4140 24809 -30043 -24135
14428 -24135 3832 61017 84848 124598 139544 82039 -52941 -79620 -105865 -151488 -140906
14417 -140906 -29623 -6210 19307 150694 155511 145766 164316 134507 90557 74183 100870
14406 100870 33177 -48058 23956 71365 -69967 -54504 -22871 -15197 -15787 -15838 -55027 -64901 -31479
14393 -31479 -54681 -128655 -123994 -104853 -122545 -84068 -117539 -109789 -14764 1373 63600 134311
14381 134311 144772 89826 37207 -43495 -64866 -7083 8918 32958 7490 -61966 -1275
14370 -1275 114333 208059 196057 24605 38484 117094 119784 34225 21119 -23445 45704 20508
14358 20508 -59585 -153943 -159967 -158235 -45734 23765 33130 43212 -7386 -91663 -41543 -48251
14346 -48251 -30986 14950 35128 -35460 -24100 30729 -35469 20627 100775 39108 -21125 -43613
14334 -43613 32274 39954 17061 30146 61440 7616 -34097 -49957 -17281 57862 58959 38068
14322 38068 62303 149245 93151 49428 53593 -73530 -151446 -106770 -140732 -77708 47885
14311 47885 60792 48895 61956 -41386 -55539 -55801 -35464 -1372 25599 -16223 13039 70298
14299 70298 59511 49036 122135 150220 133170 75061 17834 9092 -43374 -49290 -17277 26371
14287 26371 15812 84620 53580 52823 12348 -61527 -113053 -81005 -107469 -56061 -34529 -45600
14275 -45600 -62659 -73087 -55158 -90584 -83517 -56574 -89840 -144671 -67690 -5869 34352 44998
14263 44998 6348 28982 57875 26329 -8400 -25869 -24034 -24224 -21786 10870 -29906 -1065
14251 -1065 104393 40420 -35745 -37657 -40369 -53038 -85211 -81765 -40104 -19850 -52314 -40162
14239 -40162 64555 93373 63887 17401 -29983 -91629 -49721 35797 -24090 -56421 -27989
14228 -27989 -28284 -85626 -124820 -156467 -82831 -28698 -52757 -23232 -48948 -96397 -60870 30695
14216 30695 119060 118924 95773 68624 50150 49308 -4551 -42454 -59018 -56452 10857 80249 89989
14203 89989 52475 17117 36134 -26732 -4911 17258 18080 -48212 -58278 -42654 -36180 -55363
14191 -55363 -143885 -237829 -136798 -138331 -141686 -110876 -52379 30003 91007 75251 -29687 -70016
14179 -70016 -26020 53383 57446 51907 10835 -89585 -59198 -4438 -94715 -181313 -88300 -65748
14167 -65748 -15967 26477 34417 -27177 -63291 -76115 -86773 -101696 -23531 -12282 -20855 -13218
14155 -13218 73926 42760 -51967 -71549 -24403 77983 40628 785 21299 14059 -52862 -24407
14143 -24407 11273 -55467 -78478 -82114 -94519 -157368 -285215 -299752 -212503 -193052 -115617 -57492
14131 -57492 -87415 -108380 -79394 -20605 28394 73580 -56293 -88800 -1681 -39438 -65431
14120 -65431 -37472 106447 143000 49047 -36766 -143778 -243587 -139609 -60787 -94837 -124493
14109 -124493 -47056 30007 69538 18091 3438 10302 113766 120619 74696 17351 -4489 -35159
14097 -35159 -83605 -45363 18549 86781 42724 50711 37317 14468 -89054 -120098 -49449 20466
14085 20466 6818 -71806 -69715 -56422 -108960 -141906 -97574 17268 54586 44653 75652 44306
14073 44306 -15975 59478 93051 142061 117930 81808 -35406 -103077 -163913 -131635 -119950
14062 -119950 -39043 -854 -49663 -67831 -64341 -2795 36306 89324 101046 65321 85504 122392
14050 122392 101532 32848 -46026 -17842 60315 71655 69432 90954 26866 61917 56543 55514
14038 55514 76507 145024 202661 96571 58732 48509 -11791 -41533 -39821 -17646 -65531 -50773
14026 -50773 -85105 -27988 57051 69493 466 15154 48770 36968 26385 6051 -30700 35876
14014 35876 8978 -6020 49424 88403 61955 62064 93202 84697 56558 -4209 -33010 -27781
14002 -27781 -68326 -132580 -155014 -63196 18311 -17585 36476 20256 -34519 -8058 114967
13991 114967 102231 -7029 -49579 -82698 -167448 -169772 -167865 -93579 25502 -58540 -72912
13980 -72912 -53465 -70573 -118884 -45614 37261 57411 -17792 -8367 15858 15756 -9990 28719
13968 28719 48594 84101 43770 -79695 -41789 -4816 -24359 -61487 -121934 -166410 -141152
13957 -141152 -92121 -97822 -108061 -150409 -180491 -228186 -75677 15686 -3750 -41473 -48793 -78693
13945 -78693 -99010 -49495 -71755 -104173 -108999 -54597 70980 138540 195657 160745 75394 -12461
13933 -12461 -60393 -75515 -21213 -27179 -7430 71123 131008 30067 -36849 -31109 -27827 38836
13921 38836 -25482 -127987 -49083 40842 120128 98676 30524 -45481 -73328 -45390 -11838
13910 -11838 14058 -12981 -74486 -102354 -94462 -87610 -148391 -87641 -28394 -80859 -50825 14390
13898 14390 44935 28892 18789 44278 26986 -22732 -25083 44737 20602 20286 46173 52370
13886 52370 44440 38953 20975 29659 59194 77904 35668 13592 72571 62830 57237 72873 129737
13873 129737 131711 78319 84922 132881 100590 90271 71646 -42545 -65982 -71630 -92756 -76501
13861 -76501 31505 83082 64777 115158 146989 98196 80854 65609 113782 145264 126306
13850 126306 114220 153151 136196 127480 88972 90853 26856 -64823 -166755 -120151 56496
13839 56496 78229 7098 -31373 -58893 -97498 -97314 -88255 -69844 -10089 72029 121881 130223
13827 130223 -32171 -101995 -94844 -74262 -62658 -30126 -86403 -126027 -15844 57736 116303
13816 116303 198503 155155 108295 105870 111759 75487 -6004 -45506 -90822 -95533 -67996 7786
13804 7786 6971 84346 162035 73346 -8209 -67049 -82648 -96325 -60293 39381 -8677 -91368
13792 -91368 -76786 -61287 -50393 -45534 -49480 3224 -57467 -16310 -52485 -135422 -104352 -24519
13780 -24519 -99180 -142158 -114433 -187437 -219038 -185493 -87719 -32266 50278 70998 68567 65542
13768 65542 4134 68957 157962 94718 89765 80445 62686 40474 -10643 -104695 -72096 -8000
13756 -8000 45171 73058 187185 162576 70877 70690 15806 -5855 -107389 -83322 -55281 -83615
13744 -83615 -120938 -89442 -36915 -3136 36517 98263 109521 132202 214483 235491 152357 79707
13732 79707 49746 36270 19148 28144 77347 65917 -7882 21483 90698 32071 -7475 -33668
13720 -33668 -45770 11940 -53494 -34889 63840 60275 41585 100737 147213 161160 117527 39673
13708 39673 50730 13475 9122 15863 -10471 -25596 -4213 90145 89818 28957 3514 27138
13696 27138 -40886 -115872 -62593 -21206 -67087 12695 40550 36326 58409 114214 103423 82128
13684 82128 35660 68389 96222 56983 41979 18374 -14732 8251 -50234 -60676 25406 69584
13672 69584 116022 130487 99108 76334 110116 49795 64103 4533 -47990 -5719 -49210 -43556
13660 -43556 -69825 -163981 -225869 -165534 -60481 -35872 29610 75681 66721 98151 112907 80286
13648 80286 57606 33724 101623 136818 100723 51688 48875 32599 29874 32864 -3952 74668
13636 74668 206563 153455 76623 -38970 -70724 -28842 -117145 -167866 -122356 -97191 -77563
13625 -77563 1257 44754 22248 30424 37895 21890 39222 83955 111774 169995 180884 167056
13613 167056 4857 -46825 -1128 24959 85546 60545 -26213 43766 143531 100250 58531
13602 58531 -11547 -59283 -46611 -20167 24473 98059 114687 59984 -9444 -34513 10504 -15424
13590 -15424 6633 29586 50661 66715 51192 -14660 -5158 52443 76229 93217 63747 99567
13578 99567 140327 34023 -89687 -101666 -40381 4806 68508 140304 135259 42705 -3625
13567 -3625 -42959 -5781 -27445 -65063 -28575 79932 237638 273257 186541 74893 31987
13556 31987 -77859 -80993 33937 -3553 -89490 -10830 36388 -15786 11770 84491 64909
13545 64909 37129 85095 85974 497 -73435 -75124 -24571 61938 45826 50145 87278 81042 -20779
13532 -20779 -86843 -52785 23670 114904 118865 72984 66461 55002 44187 -2787 -80657 -50462
13520 -50462 -26226 -144400 -156037 -40385 17088 -79139 -109987 -53379 -83488 -103616 -65949
13509 -65949 -72535 22229 41064 12046 -10549 63340 -30318 -46127 -38269 -68183 -21175 -33271
13497 -33271 -24460 9973 58220 115345 29193 -80486 -2720 104204 61438 -24483 -55497
13486 -55497 -52173 -61910 -92619 -53388 -21836 -45253 -41193 -1300 32409 50625 37764 -10613
13474 -10613 46925 98100 31673 -2431 5459 49302 50096 41259 116213 70121 44461 122734
13462 122734 167737 103867 11416 -23473 -78726 -101301 -122161 -175559 -105224 -122237 -96960
13451 -96960 -75379 28785 79724 24247 -13196 -71483 -21004 -6736 13979 82694 160743
13440 160743 227544 200826 118486 53828 -20749 10477 58776 52691 66897 -4062 22205 59327
13428 59327 73010 -18689 -25614 -72412 -101959 -152119 -59587 127411 155167 92006 80246 27449
13416 27449 69053 92605 58589 -31833 -83218 -30305 47346 69552 36814 74705 67362 7307
13404 7307 -38136 -29019 43626 136421 158308 178795 163693 130644 120289 77495 20133 -16675
13392 -16675 30130 44052 62844 163206 180141 110229 112657 133287 124360 136948 96867 50230
13380 50230 123294 147034 183397 168734 230598 191087 194923 163057 86715 41999 39723 165977
13368 165977 168610 70499 55638 84109 100480 44848 -20045 44981 94776 46285 -18046 -54999
13356 -54999 -72493 -14619 -36122 -54850 -6703 3977 16333 74224 35604 30036 9703 22947
13344 22947 29346 72956 7211 18776 39265 28126 1092 -24152 -72853 -187120 -177590 -95482
13332 -95482 -91346 -47752 3126 106970 46929 28006 77488 17336 -36285 -122274 -120867 -90588
13320 -90588 40972 118085 86329 50199 25587 -28861 -145220 -145058 -90823 -49485 -26014 -49995
13308 -49995 -102338 -132398 -38280 -85843 -128512 -101157 -48781 54582 40395 25635 -315
13297 -315 -39373 9461 9285 -21118 -29038 8008 -12697 -4926 85035 120760 52915 105389 124738
13284 124738 57591 -83209 -74854 -21422 45568 99369 78667 49477 25368 -55032 -119820
13273 -119820 -127223 -150222 -196542 -167540 -140797 -67101 -48835 -58854 -37350 73457 64617 115114
13261 115114 117808 85056 88952 52617 80319 88972 26319 33960 69160 47186 -17083 -57316
13249 -57316 -20552 44960 97341 113613 37569 -56172 -52521 31851 112412 178257 65444 21106
13237 21106 11568 91436 75189 -80121 -180580 -66257 85449 92593 68844 46287 83647
13226 83647 110526 41673 7992 51239 144098 145264 134976 115559 49051 -54162 -59643 -77132
13214 -77132 -52666 -57432 -113158 -124074 -126381 -143007 -60563 -33791 12520 68053 98011 6760
13202 6760 53573 56067 81603 69669 102779 138900 138641 139575 78690 55364 21875 119126 151300
13189 151300 207432 177482 130240 158512 199506 231637 215541 103331 -37487 -81513 -64903
13178 -64903 45393 77689 -11466 11997 60114 96917 129207 78317 16884 22266 -43088 -41144
13166 -41144 -11318 -11528 45574 73380 79468 5798 -38408 -65608 -113042 -107543 -34942 152816
13154 152816 215010 175421 71625 15909 -17597 -19135 -30274 -95557 -54907 59846 5147
13143 5147 -82845 -82636 -36724 -27665 -12446 -5643 -9463 -105154 -97737 -64407 27129 13326 -55815
13130 -55815 -95391 -139726 -273505 -242750 -125882 -149548 -230102 -220996 -116152 -51595 14346
13119 14346 -33440 -141485 -96205 -11358 42847 -3796 -27430 -4531 -73824 -75147 -78710 -85453
13107 -85453 -80810 -52238 -60298 -79154 -79495 -48145 -67734 -66640 -56008 -172399 -172709 -146394 -154960
13094 -154960 -130211 -88319 29993 62100 27823 -48332 -132677 -131734 -83863 -96558 -122948 -95484
13082 -95484 -15389 19234 10843 6669 37689 91531 95954 43236 35221 -14733 -39504 -31665 -46152
13069 -46152 -61107 -70689 -74047 -36079 4565 30459 54769 44587 72203 104680 120627 121542
13057 121542 57006 75149 118250 9880 -48790 -100312 -175456 -153382 -60551 15949 -21329
13046 -21329 30962 66017 11345 -692 -30206 -51174 -19944 -27395 -13584 -23103 23940 63858
13034 63858 78580 18793 -23994 -13374 -17426 6758 12068 71456 199216 223910 233264 175278
13022 175278 113785 94864 43219 14880 39362 53895 71303 46210 -5126 -34979 -77904
13011 -77904 -80665 -94266 -163509 -176511 -22588 -53850 -48519 707 49300 28353 132904 118995
12999 118995 4882 334 -40382 -17689 4210 10659 -37885 -35395 -61711 11936 19924 -15467
12987 -15467 -93919 -96058 -116885 -158556 -134066 -105233 -116820 -49396 48600 73121 82441 87689
12975 87689 23769 52004 11962 7113 28108 4999 26254 6759 -30742 -33707 3566 131581
12963 131581 35783 -69475 -70098 10274 97301 60073 3717 -61323 -86846 -115543 -59582 30575
12951 30575 61442 107574 173667 130941 64311 64853 11211 -28127 -24871 -91755 -206194 -171079
12939 -171079 -83559 -75508 -79816 -65242 -30890 -71609 -140479 -83912 -42610 -74792 -153535 -131761
12927 -131761 -106488 54414 118839 194138 175904 78831 14472 23674 56269 -12222 -84
12916 -84 49834 39031 5347 10191 14749 -19392 -109761 -121187 -95850 -76194 -28558 39627 21926
12903 21926 -20066 -33258 -77142 -87853 -61480 -99433 -27286 -5918 -27068 -85787 -100686 -9400
12891 -9400 -31311 30896 97841 87784 30936 76297 183327 285237 457858 734318 1092416
12880 1092416 1357012 1170684 751907 483044 335263 250131 186459 157868 96758 79692
12870 79692 90576 128528 181112 121232 57120 -24033 -69145 -39320 55138 105012 48202 41106
12858 41106 87214 36763 39832 23057 101211 118047 103027 17837 -95376 -103784 -134739 -103183
12846 -103183 -57538 -102099 -11534 45547 7719 -375 -46823 -63466 -9400 4388 99749 142620
12834 142620 45628 16597 122746 183413 125508 109149 133318 155929 155563 185498 163756 61868
12822 61868 -15393 -52327 51454 85816 97540 22471 1958 -4739 38971 6502 19721 29656
12810 29656 7205 -128586 -111272 26289 58391 88927 46155 24856 -50425 -37869 -31590
12799 -31590 -58563 -95221 -110009 -90778 -47990 -14515 18631 15450 -12912 -46145 -25261 -77886
12787 -77886 -137475 -99862 -121796 -218069 -120346 -21168 -38694 -192008 -191328 -124966 -30424 52305
12775 52305 30120 14628 62243 94076 23602 4469 1749 -18109 -33190 -46193 257 38294
12763 38294 -5332 -76080 -14054 17238 6875 -45793 -32016 23755 -10830 -63166 -66166 19891
12751 19891 20039 62933 32491 9512 3795 -28132 -26082 -1405 55943 24945 -41949 -83081
12739 -83081 -11736 8274 -30891 39811 116431 103135 -10168 -38996 -40093 13296 3901 -12397
12727 -12397 -28208 9566 14140 26881 25265 79941 99152 198076 164830 35555 -39091 -18545
12715 -18545 60105 56860 25849 45114 74398 56399 95706 171654 126027 74050 128985 15997
12703 15997 -147043 -151139 -80391 31700 26865 -17275 66939 88491 76179 16853 -34596 -47668
12691 -47668 -62785 -6249 18626 31081 66858 73830 106340 47451 37521 21447 -6050 16603
12679 16603 -12323 57759 149812 58069 28901 -12237 -69746 -46545 22182 120738 82519 25582
12667 25582 36466 30872 127581 147713 89051 22809 78864 227424 304953 273777 247080 202147
12655 202147 85257 15246 -44705 -55646 -18157 15722 63442 63943 -1478 11096 112552
12644 112552 77417 -51709 -127372 -138961 -71737 -71306 -141294 -169468 -94197 -40426 -14947 15014
12632 15014 13822 -2041 -92795 -32445 44271 60297 48204 -35930 -13624 70753 121950 205623
12620 205623 110469 39305 63815 60763 13409 19820 -6598 89018 97712 54823 172266 275701
12608 275701 243809 160089 123175 87913 139648 71838 7213 54318 74763 76354 77681 46806
12596 46806 41219 102452 71018 -20806 -46292 -84878 -31940 18044 -50014 -71945 -75582 -96994
12584 -96994 -108815 -143885 -49577 -40028 -87696 -84456 6342 95766 102282 -10128 -26863 -40532
12572 -40532 -38192 7983 42894 53792 -19221 -74314 -13583 -27783 -106510 -90661 -34766 29732
12560 29732 97825 93244 35042 -29020 -84454 -7579 -79913 -122090 -73250 -90774 -62644 15026
12548 15026 1888 -12638 -74649 -51709 15911 30712 -12977 -25869 37404 17672 50396 24370
12536 24370 57062 53308 -30303 -42293 6107 22722 -187 -31251 -81485 -25444 -5118 29998
12524 29998 30718 27749 5232 15836 61361 75749 19322 19162 61871 113326 48407 -8033 -9696
12511 -9696 37034 40531 -17920 -19157 32550 149726 147806 33755 87586 114446 26142 22859
12499 22859 35889 54083 29457 4998 -26624 -85799 -106483 -40763 -86146 -52866 78029
12488 78029 51954 -61983 -42690 42368 124982 117086 134437 101110 37487 -13527 -7375 64103
12476 64103 -46391 -55320 4182 45301 9646 3169 6356 63299 128340 12579 -99674 -162679
12464 -162679 -86343 -41996 -64911 -15141 -82714 -51304 17700 10932 63485 50119 19643 -75882
12452 -75882 -117018 -176541 -138800 -23603 59986 -5111 15459 10241 44460 21046 -46679 32218
12440 32218 -11775 -15206 66403 67816 -45728 -49474 -86539 -105115 -125496 -92706 -7878 -12382
12428 -12382 31650 111554 72499 40318 109447 95210 53373 99549 192259 206526 161021 94529
12416 94529 20167 81823 84710 98849 74340 32802 28904 -32900 -54093 -65508 -72199 -32043
12404 -32043 -44835 -43191 7847 108972 92465 102252 81988 15627 -48662 -66660 -54682 -57233
12392 -57233 -63336 -126816 -55120 13116 -53743 -39847 -56187 -145107 -97716 -8514 18526 10766
12380 10766 -32378 -19088 -12728 -41124 -59088 -5298 25614 -65582 -112212 -71065 -106794 2848
12368 2848 126250 159154 138139 62293 84638 47643 -38862 21089 115094 64169 76297 58683
12356 58683 1829 -14713 -21665 82229 150187 83438 29477 63346 114130 81025 27701 -26149
12344 -26149 -65294 -86703 -82886 -138340 -158301 -134210 -78802 -98707 -76881 -126377 -151419 -145953
12332 -145953 16211 108365 74093 -38078 -71652 -7545 30116 -40297 -125489 -138226 -91097
12321 -91097 3615 52427 43672 15491 -27241 18298 27570 -1448 -84512 -66687 -19097 12152
12309 12152 25481 -265 -18803 56698 94732 101126 50149 -3665 -39948 -24625 19341 4282
12297 4282 -16585 41170 -15136 -40689 -53512 -101478 -84991 -56448 -12536 9613 19805 4552
12285 4552 7946 -29074 -74561 9242 61675 55907 -4999 -54683 -78736 -56751 32595 50510
12273 50510 -31735 -90508 -73926 14541 24249 -32900 -6018 53127 61078 35564 22258 -33679
12261 -33679 55250 54532 -45112 -45406 -2208 12035 -102480 -136246 -117632 -92106 -33585 27595
12249 27595 31447 9588 -42126 -156456 -124013 1632 46439 112816 117577 106978 76310 -14522
12237 -14522 -153688 -138599 63984 165488 44935 1891 63222 172234 201116 215455 170203
12226 170203 139721 30171 7385 45441 104095 101739 -3873 19028 -48432 -16751 77065
12215 77065 91339 150613 130841 128490 154412 96794 76826 128564 174706 71273 48915 4266
12203 4266 -48356 24674 98132 151835 159335 138554 136927 118066 99723 76145 9192 -13838
12191 -13838 -9510 40325 -16024 -18982 70101 33761 53042 106128 53694 9978 29367 20287
12179 20287 46481 86715 56013 134669 84010 48456 34115 62375 36517 -12485 9800 16209
12167 16209 41850 118228 100584 58966 6308 -54522 5819 86209 -9145 -77343 629 101521
12155 101521 136188 82613 89915 137321 174364 135145 127648 68305 -33775 -14232 -4488 -26461
12143 -26461 -8593 -50214 -3325 43499 51870 62559 80013 38680 9483 18514 23010 35807
12131 35807 55187 53746 59665 63706 -10422 -36587 -112631 -155755 -206250 -192799 -79323 -11761
12119 -11761 66078 45174 1502 -16567 -14983 35675 93709 78754 11754 -83345 -82953 -45076
12107 -45076 30355 81131 52822 79096 23065 -7771 26696 -33864 -59982 -8351 19847 -46665
12095 -46665 -107986 -193776 -122263 -7564 42046 7705 57249 50714 -69256 -94147 1270
12084 1270 54627 62198 99298 104349 84819 1221 -49519 -62038 -82474 -176250 -131540 -143432
12072 -143432 -65977 -54288 31456 70375 61289 50363 109195 165890 82626 29850 -7650 -45687
12060 -45687 -41310 -84814 -71170 -123936 -77476 -120720 -85134 -50862 -81343 10860 119050 183919
12048 183919 196036 98447 31888 33871 14022 -19699 -19644 -62654 -87110 -35654 -37918 8477
12036 8477 12644 -17243 16681 26008 54633 51984 -53783 -88732 13046 -19104 -36219 -31729
12024 -31729 -18565 -20915 -5448 15376 61510 66268 31033 33843 7482 21153 -21031 -102218
12012 -102218 -84036 2958 -1608 -42013 24370 73012 64683 31672 32450 30912 -7128 -108519
12000 -108519 -182620 -159046 -126039 -96494 -62160 28460 102323 99959 46551 43636 125042 118934
11988 118934 105041 112475 116380 79498 -85758 -183702 -171807 -100294 -60546 -37084 -70544 -64849
11976 -64849 22232 20999 -35301 2467 124235 145570 101655 119375 29958 -210 -56023 -19175
11964 -19175 -51597 -115259 -72782 -44737 -97428 -110022 -26361 42080 99338 17531 -77505 -58298
11952 -58298 27868 59261 44263 -26544 -11996 -4110 -60815 -60846 -86169 -106657 -91652 -9668
11940 -9668 -7682 66004 79269 80120 8989 -26101 -65251 -44475 -97323 -77460 -49690 -104599
11928 -104599 -222675 -196694 -162103 -49792 52301 23164 -38048 -14554 16943 74063 55175
11917 55175 69014 100232 6012 -36169 -12586 -17391 -23033 61881 108548 26719 8376 69548
11905 69548 52653 11391 17616 5204 -16373 -17923 7411 -14142 -4091 65024 134105 133281
11893 133281 31265 -61489 -42756 -61691 23227 29301 -19109 15192 -23836 -72016 -18866
11882 -18866 -30416 -101436 -23887 62545 96960 46922 -26856 -7200 -41921 -32825 -68097 -126685
11870 -126685 -56275 -40885 -43367 -58457 -20372 -78232 -82026 -12027 12057 -16493 12964 6575
11858 6575 5227 -51233 -105924 -73976 -33583 -50263 68025 162260 65424 -52042 -62420 57188
11846 57188 95629 20255 11598 43894 71708 183386 170329 103258 63113 11661 -38354 -73338
11834 -73338 -56769 -29374 43037 998 -93884 -51966 -31282 -58455 -8653 139585 77213
11823 77213 -3285 57075 161552 143332 84892 28627 27061 -4631 -8243 -21535 -21035 -6281
11811 -6281 24033 -7163 -46529 -8904 91635 154781 101434 59875 56393 54047 102663 14687
11799 14687 -70303 -16873 88294 88631 92046 53156 17881 -103647 -125233 -41335 -30641 -53392
11787 -53392 -22549 -96867 -74018 -22789 -12696 -19253 -7922 -35891 -63599 -50400 -78705 -132666
11775 -132666 -128566 -40244 -18568 19680 -6106 -59658 -60141 15709 38843 11842 -54469 -76031
11763 -76031 -119290 -87549 -3921 43135 77458 71433 -18905 -40276 -41163 -128783 -175264 -82185
11751 -82185 -6442 -72850 -90655 -4109 87825 77235 69409 19221 -9246 -13557 47544 128367
11739 128367 117841 37252 -116715 -135287 -76119 -82404 -51984 -7464 42595 50468 -15593 -22693
11727 -22693 -50976 -105943 -126394 -51297 -21221 97027 102795 99492 118500 31812 9195 8562
11715 8562 -89914 -64051 -31248 60833 137861 116970 79278 15178 71294 147270 111382 102588
11703 102588 121965 122758 116573 66235 31970 102370 127122 137240 200027 195900 123757 97868
11691 97868 88781 48848 18479 -18691 -126247 -259754 -301196 -202572 -104251 -35147 -54325
11680 -54325 -158675 -190313 -138592 -97488 4575 126112 108932 21267 23672 -21620 -87892
11669 -87892 -49241 -71765 -59240 -28666 -52821 -69929 -103053 -83279 -5978 52017 88486 -41282
11657 -41282 -195003 -148218 -158944 -95782 -86308 -122498 -153653 -114852 -120298 -106947 -19049 -30664
11645 -30664 -89682 -79155 -74774 -88688 -32195 -29222 -33824 -19049 27325 40088 38015 25006
11633 25006 51690 111544 121213 57989 -40162 -38560 -38741 28156 41265 57452 40640 63516
11621 63516 69374 -71179 -109113 -68773 -114313 -168586 -114529 -100760 -66139 -79222 -198362
11610 -198362 -231440 -224755 -223000 -172084 -122713 -63185 -100371 -160892 -113637 15404 -25359 -58934
11598 -58934 -51626 -25292 -73801 -68354 48234 49113 57824 47123 40239 67132 64980 5689 62331
11585 62331 15873 -38902 -117436 -66667 -65760 -68504 -88219 -137699 -114398 -116007 -74447 11954
11573 11954 -32941 -38619 -87072 -44306 49504 66134 -6440 12238 22002 4931 -27208 -68500
11561 -68500 -122894 -114966 -8253 210 -83698 -136709 -165865 -211679 -182934 -52802 -119663 -227707
11549 -227707 -174031 -127023 -40825 43979 9610 -77704 -186374 -193221 -193008 -202244 -164380 -65218
11537 -65218 -58880 -75210 -40648 -56433 -93307 -33110 -28114 -94257 -83745 -111640 -78837 4779
11525 4779 20747 -31186 -48710 -17163 -52886 -131325 -145801 -46878 -32723 565 19592 -42343
11513 -42343 -36185 1569 -24792 -148630 -176914 -63904 -83080 -119165 -120288 -55602 10 1118
11501 1118 -71738 -99144 -118005 -80723 -51379 -88961 -112894 -58142 20474 52952 49571 2743
11489 2743 49212 152742 111870 17275 -10907 -135261 -116489 -38207 -68802 -19834 30027
11478 30027 -64657 -147778 -143326 -110033 -116792 -68766 27843 10719 -60694 -26923 15305 -5342
11466 -5342 65696 67166 46639 -31253 -98600 -99436 -87614 -84094 -43097 4282 67199 -6076 -97628
11453 -97628 -101991 -55945 -61163 -25076 24160 6384 -38181 -96021 -49459 9509 -33218 -38451
11441 -38451 18756 -34832 -21319 46694 115797 58443 -22619 -10978 15335 35296 79984 41329
11429 41329 102128 121954 71391 60490 78702 89462 91254 100637 44456 -15401 -46380 -24281
11417 -24281 -35681 -60878 -151419 -101985 -6801 12949 70929 37179 57204 68673 8944 -31134
11405 -31134 -40683 -36089 -38634 40881 51482 36451 -6702 16113 35824 62629 26413 19994
11393 19994 19170 19348 4346 -113314 -91907 -49773 27577 55584 30366 -10939 52969 113166
11381 113166 23121 43841 -5546 -37441 -16769 -21259 -3869 -22002 -49488 -59481 -56609 -38173
11369 -38173 -19140 -26364 -61516 -63591 -13800 8470 32061 33492 27312 35256 12595 -33142 -85999
11356 -85999 -105444 -71563 -3681 2254 -37661 216 12387 26520 88277 21760 -34727 -45919
11344 -45919 -68803 -8587 46950 29642 -91727 -165707 -111823 -29526 -11369 -9380 -464 -23922
11332 -23922 -52158 -27191 -56313 -157930 -188415 -106993 -66925 -18781 1189 -9330 -6798 -36619
11320 -36619 -113954 -24978 39626 62257 -18080 -65727 -115657 -215128 -310727 -240914 -106619
11309 -106619 -12259 -20594 -82340 -105681 -114302 -152643 -170001 -150590 -82201 19390 -44002 -147517
11297 -147517 -122426 -76351 -98816 -8750 -36948 -57407 -45476 -50702 -57118 -111872 -105417 -45915
11285 -45915 56 -13823 18205 35281 46567 42114 -1822 -39072 -17393 36038 69839 86379
11273 86379 83773 101725 104494 116312 135656 90260 2398 -85080 -70019 -10857 147 -100859
11261 -100859 -83463 11063 43786 -1178 -17707 103351 70223 -4969 -17307 -34572 -181945
11250 -181945 -211403 -188700 -131470 18124 14477 -806 30036 76468 65410 43954 100320
11239 100320 98765 80407 45328 -36027 26354 75049 13914 -137831 -76179 134299 67094
11228 67094 -15683 8487 -39362 -7620 88968 93304 17957 -96223 -18188 -9519 -19890 -36274
11216 -36274 -34326 3848 -65609 -137284 -77849 25913 63216 6029 -113129 -103508 -43250 -49188
11204 -49188 -33710 -62282 -137400 -94871 -45341 -58996 -115245 -168057 -175536 -142078 -117117 -115338
11192 -115338 -88907 -11511 55180 69987 70818 55632 43700 -54751 -82127 -113381 -162141 -187826
11180 -187826 -141185 -117923 -80648 -113045 -162100 -164361 -147196 -161189 -128304 -119213 -128610 -113727
11168 -113727 -110816 -104625 -50616 39783 101972 13637 -97559 -74378 -74163 -80745 6262 122626
11156 122626 137969 227584 128425 30365 48578 31311 125611 113297 54784 119387 127175 13935
11144 13935 -80639 -34381 -45461 -95286 -114952 -155785 -120437 -123142 -97563 -47272 -20242 29412
11132 29412 131004 96278 69072 78425 87967 52262 25833 -12139 -56014 -23189 19546 -45591
11120 -45591 31648 40311 19450 20823 6843 -33008 -18306 16600 -5270 -20548 -32117 5339
11108 5339 58543 26511 17020 50198 91349 72418 10522 8296 25046 43175 88944 -2314
11096 -2314 -67606 -53783 -109562 -95227 -76091 -12214 29267 14851 -73829 -173887 -207851 -245074
11084 -245074 -168465 -62648 -24962 -42791 4440 17559 -40328 -23232 7722 -27827 -91331
11073 -91331 -13423 13339 61548 133142 106747 14885 -25917 24217 28061 -77376 -128209 -92660
11061 -92660 -37897 -7321 6196 49771 -2095 -10863 -7218 25507 7261 -14362 88709 180435
11049 180435 162590 123840 131098 146153 3904 -106213 -73057 -25772 -31585 -54159 -82699
11038 -82699 -95230 -10885 15820 -48161 -9752 54853 80682 15 -133208 -261683 -224132
11027 -224132 -192169 -180022 -149836 -110104 -64236 -56733 -36677 -47650 -18066 10515 36623 46925
11015 46925 101569 133845 182626 163194 46603 41074 5902 49025 101962 -12426 -97487
11004 -97487 -70707 -149806 -81750 32138 76300 31488 96809 66551 -103488 -139104 -42734
10993 -42734 -23216 -4318 70530 89973 107124 59736 19766 5171 7515 -51889 -28595 -19060
10981 -19060 -30411 -54551 -17980 39533 -57105 -90005 -85138 -71021 -24982 10076 -37236 -39952
10969 -39952 -4054 -17864 -25068 41714 28608 -27255 -13748 -68417 -31988 41264 -28374 -157078
10957 -157078 -103587 -92830 -38204 76204 77387 -13932 12471 -2762 -55118 -89575 -99730
10946 -99730 -43318 -131111 -271519 -280047 -209852 -183326 -177242 -211670 -124529 -39916 -58341 -165861
10934 -165861 -114805 -63301 -100542 -62207 -72681 -56630 16669 52580 51808 145321 144478 52758
10922 52758 88654 169658 84563 100200 41151 17174 67038 60293 56467 100628 89164 131460
10910 131460 114657 47256 21322 -53286 -159291 -171346 -87479 -65654 -97801 -89236 -74075
10899 -74075 -24242 23597 -28392 -50924 -63394 -33459 -75524 -30911 -63744 -86350 -100110 -114282
10887 -114282 -95874 -52788 -109004 -123473 -71263 -31333 6057 15603 -55479 -79838 -49128 -49275
10875 -49275 16220 1192 27253 -21097 -93334 -70805 -103452 -123749 -149702 -133206 -62447 -20706
10863 -20706 -90634 -162524 -219431 -252654 -176720 -224480 -221391 -135630 -129192 -19666 134897 116025
10851 116025 31993 -25819 -66551 -135848 -139096 -79642 -41681 -12495 -3983 -22766 -18633 11206
10839 11206 -8677 -90840 -70489 -28639 -35168 -57820 -6468 -26592 24007 12622 9755 14517
10827 14517 -35779 -173415 -176052 -72350 6661 78885 32894 -10818 -52371 -52058 -28677 -115769
10815 -115769 -171385 -155010 -93938 -94761 -26173 45120 109250 71252 9359 -58006 -134935 -94424
10803 -94424 -28645 -38912 -68271 -85362 -98609 -74868 44298 135718 21730 -34725 -24210
10792 -24210 -107501 -110560 -35943 -9890 -66437 -80980 -62521 36849 45789 -4587 96517 66881
10780 66881 38017 67453 65439 -2575 -64025 -84807 -74057 -125329 -156881 -108618 -81914 -5184
10768 -5184 28983 82823 -7944 -50416 -16716 53744 -202 -12079 -1507 -60383 -68087 1956
10756 1956 109116 119040 75760 1427 19750 17078 -63146 -101368 -114575 -26926 30311 39793
10744 39793 -3477 1157 -131194 -180969 -129823 -90739 -89435 -82198 -124244 -165608 -159860 -136914
10732 -136914 -157115 -95511 -114968 -155323 -118676 -98388 -104619 -107000 -77645 -79744 -87656 -23078
10720 -23078 14525 -6169 -25317 -122205 -126089 -79699 -70300 -60840 5401 -35051 -8067 -34430
10708 -34430 -61992 -85761 -32474 19876 32147 17673 4755 -34636 14496 1086 2887 30489
10696 30489 -17454 -67243 -76910 -65299 25426 -19600 -102302 -66901 -6127 -27310 22543 93858
10684 93858 -1321 -76963 -77989 -32610 22980 28322 -35298 -29974 -14183 -60587 -95268 -185125
10672 -185125 -226361 -101348 -81753 -52531 -45021 -37791 -12703 53548 105330 90485 26745 -12025
10660 -12025 -9278 -334 -62282 -71177 -145654 -119312 35865 32201 -45231 -139798 -104466 89493
10648 89493 123832 57276 51771 -48393 9082 51153 -36499 -29883 -12951 24514 103258 144672
10636 144672 171055 111230 -24711 -131193 -188826 -185826 -103578 -86194 2511 16835 -2486
10625 -2486 44487 88332 144766 117146 57180 -9246 7161 -16797 14453 35643 42129 62679
10613 62679 44799 100483 113151 70309 19091 -29661 -2232 11787 50724 118341 117262 145824
10601 145824 72668 31835 1107 -2705 19036 -216 -11600 52042 43198 78336 -38908 -132376
10589 -132376 -189137 -222409 -174347 -125989 -107244 -90688 -85818 -66544 28314 -62947 -68277 -149305
10577 -149305 -121462 -22339 -10546 -54499 -8704 48665 51236 -38643 -52155 25937 91630 100805
10565 100805 51051 36094 -18899 24034 116408 169325 88761 47287 -42144 -69599 -120669
10554 -120669 -7395 71689 86954 112691 113759 -46517 -166675 -120940 -44347 -13512 26957
10543 26957 42778 44445 -17303 -41371 7152 33284 -1758 -24147 24390 -9947 -110971 -9083
10531 -9083 7287 -67003 -65013 -56809 6337 -17330 -6421 10790 -7658 -45558 -2731 -23952
10519 -23952 -109979 -46790 19337 48828 63587 55864 115511 130511 71140 48267 111403 118470
10507 118470 40512 -33066 -81550 -64074 -14395 65096 139197 62165 -27177 -38451 63256
10496 63256 156374 147486 65435 1446 33526 24714 69729 45241 31842 106469 177515 127122
10484 127122 118492 65126 33430 -24397 36318 17994 -107134 -66260 -49017 -80164 -194227
10473 -194227 -240417 -151910 -36791 -28714 -60966 -15153 13464 57463 87675 86708 100465 54726
10461 54726 10716 37120 5940 20756 -14019 21166 54717 85279 36894 127822 94235 73967
10449 73967 33831 42029 52769 -41201 -78890 -118590 -84791 -8588 21641 27244 44713 121873
10437 121873 135563 152518 176412 118838 101201 135614 64434 -14245 32216 68671 77286 15209
10425 15209 73511 87375 13045 -31372 -45100 -87771 -67531 -49092 -10653 -31676 -64954 -68400
10413 -68400 -103655 -155316 -53727 36762 37235 53339 123280 79250 -26513 -85562 -87229 -46717
10401 -46717 -7033 3026 24210 45397 -33672 -98137 -39624 7525 4483 54832 30377 -39372
10389 -39372 -40708 -99349 -55137 45198 96442 126691 89969 156991 99952 29920 -24145 -53515
10377 -53515 -75464 -67860 10846 67916 -45867 -145803 -111977 -127601 -96850 -48257 -70309 -43422
10365 -43422 -50301 -174657 -191417 -162066 -166422 -127623 -80885 -34808 -22639 36614 126028 181559
10353 181559 224522 280130 237671 278055 395600 406255 437085 562404 759855 960732 1171629
10342 1171629 1481651 1717992 2030087 2158692 2201111 2153744 1994809 1727119 1414032 1129974
10332 1129974 914172 733738 633894 455197 313945 240428 229244 182372 163049 168707 194654
10321 194654 219393 111921 53070 -4229 -82898 -110558 -15730 22274 -82459 -89741 -60257
10310 -60257 21153 5716 -39710 -23304 -19315 -752 47190 4833 -15992 -15607 -17168 -127135
10298 -127135 -193338 -71783 -7109 -58067 11699 -32341 20566 47185 131763 183736 134999
10287 134999 111373 48193 -75476 -116944 11311 54676 55925 80294 109826 66727 -52039
10276 -52039 -73670 -72939 5542 -12088 -75903 -71532 21693 -13229 -76281 -24209 9951 -19683
10264 -19683 -7004 110461 143200 101339 76181 87945 70109 -24273 -51556 -81001 -114385
10253 -114385 -127964 -90863 -98638 -44566 3739 -60724 -56636 -139877 -133000 -67407 -47896 -110054
10241 -110054 -99347 -99393 -169086 -200671 -67613 95232 143818 107476 81411 48158 63041 43058
10229 43058 3092 17322 86724 51940 -21572 -63322 -7935 55713 94360 92863 90287 98579
10217 98579 88767 2082 -7210 -108640 -132452 -95266 -77423 -109054 -153443 -127139 -115785 -134369
10205 -134369 -145031 -154775 -129339 -231612 -201463 -109452 -80681 -146099 -271190 -217745 -118130
10194 -118130 -82700 -81546 -28661 39276 9288 49741 65511 -211 20429 95715 109111 7661
10182 7661 -85921 -51479 -64019 -81525 -56869 -74539 -109012 -70233 -121346 -96755 -61047 -27916
10170 -27916 26726 127774 150816 114582 118283 71281 60433 66155 62629 -29576 -44822 -26264
10158 -26264 -31603 -34975 -70526 -46327 -75682 3987 94345 144702 76398 111700 105516 -35917
10146 -35917 -135685 -117070 -70617 -71771 -98467 -81739 -86038 -91382 -20793 -68476 -32326 -3720
10134 -3720 -78065 -135081 -164703 -137216 -72919 -20338 -70286 -95141 4516 -1865 -7221 68587
10122 68587 43087 34067 53470 62086 57180 32803 -18451 -107337 -71786 -47089 -15713 -70636
10110 -70636 -155041 -101757 -60073 -42930 -74100 9693 29103 77263 57099 33289 -18141 -68830
10098 -68830 -29701 -15431 90495 116201 89956 11471 -61505 -34511 -75596 -78134 -30927 -45472
10086 -45472 -58376 -139687 -105673 -29808 3549 68974 -38416 -49165 -23549 39689 -12738
10075 -12738 -106686 -189058 -259147 -153928 -87347 -125806 -182452 -145586 -81875 -13696 -42836
10064 -42836 -174584 -116874 46168 16283 -76767 -66084 -28114 -29672 7334 46725 46809 73175
10052 73175 79542 77779 95317 125100 92126 91469 67844 98992 91686 47664 66079 86268 94859
10039 94859 91160 148552 98856 37095 -35952 -23128 12265 50668 47627 56880 5827 -78690
10027 -78690 -73137 -36894 -125676 -111826 -71252 -30813 -71374 -151832 -143597 -75259 24788 87174
10015 87174 22223 -3176 48214 50777 -10995 -57503 -148477 -108237 -86843 -118412 -87571 -39976
10003 -39976 -9694 64778 -9856 -63002 -37029 -130376 -191854 -145443 -131865 -64535 -86352 -129315
9991 -129315 -29327 26622 9350 17499 -36383 -21248 25281 7981 -28242 -3837 76740 60237
9979 60237 43172 5242 -9227 -27641 484 -32047 -122466 -177912 -203945 -159865 -158598 -195573
9967 -195573 -193584 -167962 -120674 -67585 -8783 15559 76480 129063 133381 110669 126228 101700
9955 101700 108602 123027 100068 81617 34429 -1237 7921 -1662 69807 64088 32006 -21296
9943 -21296 70733 160189 162111 57495 -51712 -41946 -165362 -166178 -79793 -45941 -100854 -136516
9931 -136516 -209158 -200340 -137740 -140198 -76001 -32034 -10459 -4110 -12946 -2464 -13018 -71472
9919 -71472 -81102 -55800 -47514 3203 50003 3406 -1771 95879 129029 125109 152273 132899 -49389
9906 -49389 -80926 -36774 23162 98924 78331 75462 92510 29803 -35399 40628 194987 278122
9894 278122 304907 285560 179923 63356 14502 25839 86755 49631 -24330 -61573 75838
9883 75838 58330 19994 21196 -1882 52318 136024 118058 114175 138056 110985 75158 54436
9871 54436 76851 -20820 33300 92116 122877 133901 108460 72479 99657 143443 187429 208954
9859 208954 245868 307395 284355 201082 115313 68862 22723 18439 -58169 -44694 -28276 -29710
9847 -29710 -9365 -17043 -9399 -6219 -13617 -34577 -20467 -54079 -58505 -42019 -49639 -74818 -121211
9834 -121211 -167306 -154574 -65402 -16943 41917 71367 131181 72003 -14998 -21390 -3784 55676
9822 55676 111162 22020 -28596 25732 -16375 7413 24152 104324 129598 162486 175430 113142
9810 113142 27942 -76959 -99450 -31094 -93684 -136119 -159580 -180653 -189411 -161331 -29836
9799 -29836 4955 -51853 -17173 1045 4684 27084 40159 37418 -64772 -31137 43867 97007
9787 97007 91907 158272 148349 212550 182281 119314 97230 81462 56456 -50076 3374 55635
9775 55635 73331 24465 -35257 -35215 -66452 -87155 -82107 -47360 -23997 -13993 114051 203197
9763 203197 160495 89793 78579 143326 120902 51631 94449 97989 37346 -37668 -80299 -34436
9751 -34436 26260 63257 5103 -62535 -39006 -49516 -134256 -113735 -75375 -7022 71655 62605
9739 62605 3974 -61271 -112299 -153449 -116875 -94559 -180839 -239431 -186887 -105917 -67058 -73119
9727 -73119 -236 38959 -9 -17900 7880 15124 -2415 8563 -42717 -79083 -58039 -1271
9715 -1271 19532 42991 79522 43300 -67339 -21342 18735 -31272 11002 -18801 -73617 -39861
9703 -39861 -8614 -22627 -55462 -31303 -41095 -42190 -69496 -41999 33597 50416 57167 -1624
9691 -1624 -14094 -24496 -32119 28603 99405 55707 -1932 -9528 -63964 2095 -57854 -100648
9679 -100648 -54134 13048 -32553 -23746 30656 34768 75658 -47225 -146911 -83201 -29063 -95887
9667 -95887 -85315 8255 42170 15622 -88525 -102528 -102217 -48634 -32861 -59275 -60743 1169
9655 1169 17533 -56093 -63895 -84506 -5664 65475 43012 43640 49476 21323 20221 57564 38873
9642 38873 -17354 -23302 23389 64037 112286 20481 -18383 45260 44012 55376 -37406 -94809
9630 -94809 -66134 -109315 -80319 38381 113939 176948 170995 87568 59067 148625 219595 224039
9618 224039 243585 168262 100010 199479 173332 116985 73660 63902 171762 138965 85701 107921
9606 107921 60129 56372 103738 187594 194063 145572 91317 65468 -2868 19958 98968 46029
9594 46029 -37331 -57638 -7687 -20606 -20414 32771 60943 3762 -37625 27113 88065 67599
9582 67599 70243 17300 5917 -44521 -34735 -41090 -46224 -46441 13233 54155 112213 121266 148551
9569 148551 101651 62474 109856 135580 149911 168728 112654 61465 122294 116408 76677 19094
9557 19094 -14722 -7725 -51704 -79159 -33037 -81005 -70839 33983 73474 18382 -42696 -62062
9545 -62062 -31237 -78103 -8719 35256 153777 207212 201120 139635 44116 14698 -43576 -3883
9533 -3883 60750 86466 143228 98435 90306 130213 132030 64180 49889 24794 49658 36327
9521 36327 87403 116336 68261 58451 58126 50473 136141 133905 139794 93725 126744 122008 7536
9508 7536 -9514 23954 5765 15541 34997 111341 112205 157382 164720 101556 45693 -13502 -31227
9495 -31227 -15431 -13488 2185 33730 24095 -24388 29237 83217 68484 11935 13064 -13445
9483 -13445 -62377 -70341 -6201 63577 109932 142559 93461 41343 14596 -46802 -108309 -8646
9471 -8646 51908 51818 91551 87270 -8385 -239 62157 94649 35928 -13069 -21066 -96597 -67407
9458 -67407 -48768 -99508 -35559 -28908 -47403 -45834 17638 66804 43765 -9137 32209 4314
9446 4314 29946 -5024 -95326 -126487 7466 70946 60126 89591 43162 47134 32825 102352
9434 102352 52822 -34444 37018 87845 42195 8027 13000 -8948 25919 23544 -29160 -36100
9422 -36100 -105831 -65873 -11867 8151 30069 7686 -30354 19260 98652 68179 26098 5229
9410 5229 77422 210495 172925 106422 148958 300990 328431 329460 256083 242791 256162 241562
9398 241562 185630 163879 151733 208054 185992 164780 150328 192117 88524 20358 111000
9387 111000 127475 55104 76224 82081 15731 27349 43786 107765 167447 190219 129473 169656
9375 169656 187722 162493 130736 135993 31960 -4055 77332 53421 -143975 -141041 -43914 -43043
9363 -43043 -37297 38177 94173 38241 94692 154160 176496 122494 106824 117014 120043 132265
9351 132265 109314 134652 118019 140719 173665 175712 176932 154295 185534 218238 175782 117933
9339 117933 22581 30214 121761 109206 104983 78349 114808 193004 242468 266236 222770 175984
9327 175984 122084 52993 69207 49209 95272 117770 128259 113599 46926 3934 92465 171054
9315 171054 170986 113486 91393 133592 45254 -39555 -78321 -36212 -5183 28495 12129 63922
9303 63922 129190 172234 138503 201116 192853 158289 108542 60827 34229 -35163 -54154 83348
9291 83348 203690 206335 230102 276423 183408 132610 212332 225655 249565 236357 241329 136398
9279 136398 109635 110532 159496 210434 239378 185136 120122 5004 -18406 5112 28758 75768
9267 75768 94900 71005 64762 91340 156901 128330 81288 75789 209968 235787 204076 217547
9255 217547 231958 122835 132125 226108 168580 103846 102843 155172 199192 262711 258770 248112
9243 248112 247215 242344 144700 129953 188647 212455 195918 222482 189702 182098 230326 280003
9231 280003 335684 323934 284613 343718 421081 438675 404518 423546 397945 380218 417022 450952
9219 450952 518859 598927 522908 405784 350958 381218 426119 387440 404923 471759 461465
9208 461465 388659 416135 366650 281208 326606 353426 349988 370855 430856 434273 452099 513431
9196 513431 604826 599937 499227 439242 476890 599215 649817 652544 589644 560342 483237 478936
9184 478936 442720 401033 471215 528352 553840 588696 654539 688563 664266 592633 651390 742055
9172 742055 811835 811062 856425 799147 791469 831563 867031 895954 905669 966255 959288 897215 884468
9159 884468 925497 921426 866790 757857 779501 907662 930832 909170 859802 865755 943943 991949
9147 991949 980390 937328 948772 1059912 1142468 1205635 1207972 1166913 1221039 1203572 1212868 1251700
9135 1251700 1312371 1402065 1402663 1440874 1421688 1407044 1434929 1461967 1558023 1626702 1691473 1711542
9123 1711542 1630935 1550033 1583615 1629676 1603809 1722064 1726361 1763281 1776453 1811890 1877762
9112 1877762 1945750 1985554 1978756 1957211 1949187 1961528 1998597 2074093 2002144 1930440 1946116 2023659
9100 2023659 2113260 2140308 2145244 2167215 2128507 2110614 2095327 2120712 2115582 2095632 2096939 2131726
9088 2131726 2108056 2037184 1969982 1912027 1912732 1856333 1925355 2017597 2033073 2021409 2011102 1923590
9076 1923590 1830766 1820880 1848473 1755693 1706342 1662931 1615010 1604680 1606874 1669110 1686530 1604718
9064 1604718 1668718 1726109 1698580 1637659 1572896 1464556 1508793 1524768 1514726 1500012 1473090
9053 1473090 1389721 1325145 1291522 1192580 1160885 1234876 1237672 1227318 1156570 1170449 1114087 1035542
9041 1035542 995283 1095276 1182713 1186913 1208604 1158984 987438 971500 1033612 1112650 1093927
9030 1093927 1027897 907190 897929 884662 896142 896377 846317 888165 848670 795933 711519 675541
9018 675541 712625 749691 715790 678049 650679 673550 728059 705252 679412 652902 618289 656322
9006 656322 686694 683783 631918 598155 566641 621081 683553 616477 446232 440195 417161 442039
8994 442039 468151 436023 430293 461510 492739 444480 387472 426517 444150 397645 366422 330543
8982 330543 379310 415527 452757 564006 590105 485942 431064 426877 367491 291360 311806
8971 311806 407439 474663 410351 372700 389777 354234 289707 343146 416099 376509 190273
8960 190273 162860 199004 189507 236596 324852 312439 362494 366889 314192 304550 280496 347880
8948 347880 381103 285233 218279 236977 180235 124391 185987 195216 195499 237468 301889 290237
8936 290237 312588 219872 125749 84922 103234 84348 151408 188878 181609 115821 117845 200334
8924 200334 177214 163968 199700 175769 193075 236024 210919 110324 17106 29785 62411
8913 62411 101085 124608 140099 187936 197678 147077 25571 81137 147641 155423 165889 246521
8901 246521 200399 212977 145832 62158 47315 43268 -4689 87562 227177 256555 223499 222569
8889 222569 248942 171241 32335 -27398 8164 160607 149451 48537 20762 34684 20096
8878 20096 -34710 -18121 -50247 -7848 87822 201748 239969 262891 242315 172452 107628 62328
8866 62328 56189 72984 68081 81502 146230 172788 183161 214677 265514 282051 235508 199776
8854 199776 141839 87345 54583 42565 22018 44277 51642 46904 61295 41070 48801 34533
8842 34533 61998 88579 85725 106249 106988 114327 111920 145973 75522 21277 68575 60162 60720
8829 60720 124455 90816 97446 65032 -16467 -29160 -33354 57063 94908 109250 169656 130601
8817 130601 48337 47886 99831 100261 101468 -13703 -102369 -33552 138185 220803 96033 -10809
8805 -10809 -65888 -21338 16036 92067 45827 -21736 29480 124839 171377 220280 270517 190288
8793 190288 76861 64961 -29858 3078 64396 77767 165587 137424 58796 98531 166292
8782 166292 139324 17640 -57919 -68290 -21872 -10974 36070 46298 80924 74149 10078 18145
8770 18145 6865 6183 42927 163590 111151 117658 151422 144632 93727 45109 16566 28635
8758 28635 36230 -88529 -31394 -4457 4004 -96 17954 11963 -2783 34069 82526 50383
8746 50383 3552 4888 -48216 -12538 22514 -10160 22947 -11077 -35669 72837 159625 99866
8734 99866 82554 119292 89778 56306 90938 18298 -32162 -38107 3418 -1161 41541 42389 67493
8721 67493 22074 -10937 35972 41894 75933 48010 70280 61132 81022 148079 45204 94443
8709 94443 18667 -65147 -85755 -77801 -65638 30606 105609 111593 90937 46740 -2209 32886
8697 32886 83618 138040 40741 60201 -1662 -58152 21557 25712 20590 68893 38267 74592
8685 74592 59586 63594 92057 132236 86143 70936 75483 49151 57212 126435 142448 49617
8673 49617 31796 -56003 -84340 -101760 -50953 -38707 17965 9778 5766 -1597 17240 -5704
8661 -5704 -24878 -44843 -20105 30815 72026 35853 59850 65374 116474 100007 92554 155033
8649 155033 86790 74357 42664 13371 61483 132286 132069 130158 85179 163319 231085 241827
$$ [...]
##END NTUPLES=NMR SPECTRUM
##END=
