##TITLE=Analysis number 328502
Compound Code cc 10302
Book Reference lab3
Project Code adrs
Chemist Name stores
##JCAMPDX= 6.0         $$ Bruker NMR JCAMP-DX V2.0
##DATA TYPE= NMR SPECTRUM
##DATA CLASS= NTUPLES
##ORIGIN= Bruker BioSpin GmbH
##OWNER= nmr
$$ XWIN-NMR		Version 3.5
$$ Mon Jun 11 13:16:12 2007 GMT Daylight Time (UT+1h)  MAYBRIDGE\nmr@NMR_250MHZ
##.OBSERVE FREQUENCY= 250.131544655141
##.OBSERVE NUCLEUS= ^1H
##.ACQUISITION MODE= SIMULTANEOUS (DQD)
##.ACQUISITION SCHEME= undefined
##.AVERAGES= 16
##.DIGITISER RES= 18
##SPECTROMETER/DATA SYSTEM= dpx250
##.PULSE SEQUENCE= zg30
##.SOLVENT NAME= CDCl3
##.SHIFT REFERENCE= (INTERNAL, CDCl3, 0, 16.4456)
##AUDIT TRAIL= $$ (NUMBER, WHEN, WHO, WHERE, WHAT)
$$ ##TITLE= Audit trail, XWIN-NMR		Version 3.5
$$ ##JCAMPDX= 5.01
$$ ##ORIGIN= Bruker BioSpin GmbH
$$ ##OWNER= nmr
$$ C:\u/data/dgb/nmr/ADRS/670/pdata/1/auditp.txt
$$ ##AUDIT TRAIL=  $$ (NUMBER, WHEN, WHO, WHERE, WHAT)
(   1,<2007-06-11 13:15:34.98 +100>,<MAYBRIDGE\nmr>,<NMR_250MHZ>,
      <created by zg, POWCHK disabled, PULCHK disabled
       configuration hash MD5:
       76 6E 9A 78 1E 09 19 81 EC 84 63 8F B0 6A 59 2D
       data hash MD5: 64K
       90 81 C5 73 37 06 EF 4B F7 2A 00 5A C1 F9 E1 D4>)
(   2,<2007-06-11 13:15:58.07 +100>,<MAYBRIDGE\nmr>,<NMR_250MHZ>,
      <Start of raw data processing
       ef LB = 0.3 FT_mod = 6 PKNL = 1 SI = 32K 
       data hash MD5: 32K
       B0 2B 6A 54 C4 51 57 F3 04 5F 7E E2 D1 C8 B8 D9>)
(   3,<2007-06-11 13:16:00.45 +100>,<MAYBRIDGE\nmr>,<NMR_250MHZ>,
      <apk 
       data hash MD5: 32K
       99 CF 98 F7 25 E4 E7 EB A8 0A A8 3E D1 27 7E 00>)
(   4,<2007-06-11 13:16:01.17 +100>,<MAYBRIDGE\nmr>,<NMR_250MHZ>,
      <abs ABSG = 5 
       data hash MD5: 32K
       69 00 D1 57 71 85 D8 73 BB E4 D8 9C F5 88 A6 40>)
$$ ##END=
$$ 
$$ hash MD5
$$ 90 80 20 85 99 BF 07 48 EB 8C FD 91 CD 6C 37 B8
##$RELAX= 
##$RELAX= 
##$RELAX= 
##$RELAX= 
##$RELAX= 
##$RELAX= 
##$RELAX= 
$$ Bruker specific parameters
$$ --------------------------
##$DU= <C:\u>
##$EXPNO= 670
##$NAME= <ADRS>
##$PROCNO= 1
##$TYPE= <nmr>
##$USER= <dgb>
##$AMP= (0..31)
100 100 100 100 100 100 100 100 100 100 100 100 100 100 100 100 100 100 
100 100 100 100 100 100 100 100 100 100 100 100 100 100 
##$AQSEQ= 0
##$AQ_mod= 3
##$AUNM= <au_zg>
##$AUTOPOS= <13 >
##$BF1= 250.13
##$BF2= 250.13
##$BF3= 250.13
##$BF4= 250.13
##$BF5= 500.13
##$BF6= 500.13
##$BF7= 500.13
##$BF8= 500.13
##$BYTORDA= 1
##$CFDGTYP= 0
##$CFRGTYP= 5
##$CHEMSTR= <none>
##$CNST= (0..31)
1 1 145 1 1 1 1 1 1 1 1 1 1 1 1 1 1 1 1 1 1 1 1 1 1 1 1 1 1 1 1 1 
##$CPDPRG= <>
##$CPDPRG1= <>
##$CPDPRG2= <>
##$CPDPRG3= <>
##$CPDPRG4= <mlev>
##$CPDPRG5= <mlev>
##$CPDPRG6= <mlev>
##$CPDPRG7= <mlev>
##$CPDPRG8= <mlev>
##$CPDPRGB= <>
##$CPDPRGT= <>
##$D= (0..31)
0 1 0 0 0 0 0 0 0 0.06 0 0 0 0 0 0 0.0002 0 0 0 0 0 0 0 0 0 0 0 0 0 0 
0 
##$DATE= 1181564133
##$DBL= (0..7)
120 120 120 120 120 120 120 120 
##$DBP= (0..7)
150 150 150 150 150 150 150 150 
##$DBP07= 0
##$DBPNAM0= <>
##$DBPNAM1= <>
$$ [...]
##$SUBNAM7= <"">
##$SUBNAM8= <"">
##$SUBNAM9= <"">
##$SW= 20.6930455092707
##$SWIBOX= (0..15)
0 0 3 0 0 0 0 0 0 0 0 0 0 0 0 0 
##$SW_h= 5175.983436853
##$TD= 65536
##$TD0= 1
##$TE= 297.16
##$TE2= 300
##$TE3= 300
##$TEG= 300
##$TL= (0..7)
0 120 120 120 120 120 120 120 
##$TP= (0..7)
150 150 150 150 150 150 150 150 
##$TP07= 0
##$TPNAME0= <>
##$TPNAME1= <>
##$TPNAME2= <>
##$TPNAME3= <>
##$TPNAME4= <>
##$TPNAME5= <>
##$TPNAME6= <>
##$TPNAME7= <>
##$TPOAL= (0..7)
0.5 0.5 0.5 0.5 0.5 0.5 0.5 0.5 
##$TPOFFS= (0..7)
0 0 0 0 0 0 0 0 
##$TUNHIN= 0
##$TUNHOUT= 0
##$TUNXOUT= 0
##$USERA1= <user>
##$USERA2= <user>
##$USERA3= <user>
##$USERA4= <user>
##$USERA5= <user>
##$V9= 5
##$VALIST= <valist>
##$VCLIST= <CCCCCCCCCCCCCCC>
##$VD= 0
##$VDLIST= <DDDDDDDDDDDDDDD>
##$VPLIST= <PPPPPPPPPPPPPPP>
##$VTLIST= <TTTTTTTTTTTTTTT>
##$WBST= 1024
##$WBSW= 4
##$XGAIN= (0..3)
0 0 0 0 
##$XL= 0
##$YL= 0
##$YMAX_a= 464004
##$YMIN_a= -387707
##$ZGOPTNS= <>
##$ZL1= 120
##$ZL2= 120
##$ZL3= 120
##$ZL4= 120
##$ABSF1= 16.44564
##$ABSF2= -4.247532
##$ABSG= 5
##$ABSL= 3
##$ALPHA= 0
##$AQORDER= 0
##$ASSFAC= 0
##$ASSFACI= 0
##$ASSFACX= 0
##$ASSWID= 0
##$AUNMP= <proc_1d>
##$AZFE= 0.1
##$AZFW= 0.1
##$BCFW= 0
##$BC_mod= 0
##$BYTORDP= 0
##$COROFFS= 0
##$CY= 12.5
##$DATMOD= 1
##$DC= 0
##$DFILT= <>
##$DTYPP= 0
##$F1P= 14.0000005364418
##$F2P= -0.99999901652339
##$FCOR= 0.5
##$FTSIZE= 32768
##$FT_mod= 6
##$GAMMA= 0
##$GB= 0
##$INTBC= 1
##$INTSCL= 1
##$ISEN= 128
##$LB= 0.3
##$LEV0= 0
##$LPBIN= 0
##$MAXI= 10000
##$MC2= 0
##$MEAN= 0
##$ME_mod= 0
##$MI= 0
##$NCOEF= 0
##$NC_proc= -3
##$NLEV= 6
##$NOISF1= 0
##$NOISF2= 0
##$NSP= 0
##$NTH_PI= 0
##$NZP= 0
##$OFFSET= 16.44564
##$PC= 1
##$PHC0= -61.99406
##$PHC1= 18.13276
##$PH_mod= 1
##$PKNL= yes
##$PPARMOD= 0
##$PSCAL= 4
##$PSIGN= 0
##$REVERSE= no
##$SF= 250.130019097591
##$SI= 32768
##$SIGF1= 0
##$SIGF2= 0
##$SINO= 400
##$SIOLD= 32768
##$SREGLST= <1H.CDCl3>
##$SSB= 0
##$STSI= 32768
##$STSR= 0
##$SW_p= 5175.98343685301
##$SYMM= 0
##$S_DEV= 0
##$TDeff= 65536
##$TDoff= 0
##$TI= <Analysis number 999999
Compound Code 99
Book Reference 9
Project Code 9>
##$TILT= no
##$TM1= 0
##$TM2= 0
##$TOPLEV= 0
##$USERP1= <user>
##$USERP2= <user>
##$USERP3= <user>
##$USERP4= <user>
##$USERP5= <user>
##$WDW= 1
##$XDIM= 32768
##$YMAX_p= 526956075
##$YMIN_p= -187357
$$ End of Bruker specific parameters
$$ ---------------------------------
##NTUPLES= NMR SPECTRUM
##VAR_NAME=  FREQUENCY,     SPECTRUM/REAL,   SPECTRUM/IMAG
##SYMBOL=    X,             R,               I
##VAR_TYPE=  INDEPENDENT,   DEPENDENT,       DEPENDENT
##VAR_FORM=  AFFN,          ASDF,            ASDF
##VAR_DIM=   32768,         32768,           32768
##UNITS=     HZ,            ARBITRARY UNITS, ARBITRARY UNITS
##FACTOR=    0.157963299565203, 1,           1
##FIRST=     4113.54838833664, 0,            0
##LAST=      -1062.43504851637, 0,           0
##MIN=       -1062.43504851637, -187357,     0
##MAX=       4113.54838833664, 526956075,    0
$$ Real data points
##PAGE= N=1
##DATA TABLE= (X++(R..R)), XYDATA
$$ [...]
24069E556k554J1431l231L206n212p887k2053Q589M593k647J0644j849L182j7970
24055a6202K123L113n347j1811N727J3093R905J407O606o307k0424k3708O213
24042c5612J1044J6679p51m860J058P95Q29J6540J1532m902j541K213K042R254
24028B4320j0091q022j4351R69K1241o389j0589M743J3365k7135q919Q870J0600
24015a388K766K230o708n65k173j2099N216Q274J6298j2269j4097O006L4811K119
24001B8421l7012j7888J1957j328j0872n536K3094J4953j0195o586L916j030j686
23988i792o258n083L0498J5913j0243j4729N138m213k0312r121K0799J2913o983
23975a473J6149J3165p462k5002L098o252j7836N502N482n601O687J280n784r509
$$ y = [5556, 3002, 14433, 11202, 14408, 9196, 1309, -20744, -12155, -7562, -10209, 435, -1414, 1768, -16202, -14079, -10966, -16313, -28124, -22397, -9304, 601, 2008, 8614, 2307, -18117, -41825, -35612, -24568, -7889, -8640, -13500, -12442, -11647, -10818, 5722, 17254, 12352, 10811, 13024, 15066, 24320, 14229, 6207, -8144, -7175, 14066, 7677, -2912, 1831, 15196, -11939, -20858, -11988, -1388, 1378, 3608, -3100, -3665, -5838, -17937, -12721, -4447, 11851, -418, -14515, -8509, 26302, 28421, -8591, -26479, -14522, -15850, -26722, -32258, -9164, 5789, -4406, -10992, -7076, -8106, -9792, -16050, -21133, 9365, 25278, 15035, 306, 5444, 1231, -19081, -28202, -7403, 5510, -1473, 14676, 27841, 20379, -4623, -1525, -7777, -25613, -20111, -14629, -20230, -13543, -12263, -18047, -27556]
23961b7556R556N982K1049m472j6439j328K4309J0710q07j0564j5621N776n206
23948d611n691k180J1433o709q033J4582M550r287J6785K579k8398M91k495j0457
23934b7441P620o840P848K3255J0453r656r075J349n34j4910J8203o252O55l140
23920h465j4733j1485O73J3048Q729J1876N417m653J504J0990K893p069l382J1354
23906A6697Q115J7051q068k6180j2504j456Q539K0354q771k7707K395J2807J2842
23893A4114J151M464Q819N518m984j6408p071J0245M507j8480k3760o356k253
23880c0494j778L138J4947J0892K857L842j2527k728l846k618p808P135K0112
23867A124L105k0621K668K9083K1620o639j6054l896J0214L242j7505p930j1104
$$ y = [-27556, -18000, -12018, 9031, 4559, -11880, -13208, 11101, 21811, 21004, 10440, -5181, 595, -4611, -10302, -12482, -1049, -7758, -15791, -1209, 3341, -5946, 10839, 13418, -14980, -14489, -16984, -27441, -19821, -26661, -18813, 4442, 14895, 5239, -3836, -2487, -3021, -17931, 272, -5980, -5325, -8465, -23198, -34683, -34010, -20962, -12233, -357, 5060, 407, 1911, 12901, 15794, 8725, 5343, 16697, 24812, 41863, 33795, 7615, -4889, -6345, 2194, 22548, 13777, -13930, -11535, 1272, 14114, 15265, 19729, 28548, 34066, 29082, 12674, 5603, 15848, 20355, 1875, -21885, -28241, -30494, -32272, -29134, -14187, -3295, -438, 3404, -9123, -11851, -15697, -18315, -26123, -18988, 1124, 4229, -16392, -13724, 15359, 36979, 30340, 14286, 10390, 20604, 23846, 6341, -1589, -12693]
23854a2693J502p615J1802O776j768M513N126J1284K555k8828j9258R769J8991
23841B156p60o854J1414r2K634L972n900m953J0609J0740n667k6551J0693J1942
23827A3383M916j0269j4686q109R055M788J4682j1538j5387J1333k71l915P879
23814A861p727k876L551j6491J7394m005Q282K2028j871j9396j4124J7336k860
23801A102q520O410o163n267R553J6674j884m062n188R158j3579j4039J1796J4438
23787A0429j2426N224n22K820M947J0061j473L069j3436L606j3846j2078K0324
23774F699K9934j4928o908r34k759k135K49L410P800j014O735q049N834j879j6455
23759E600j657O358J1076O584j1415k0383j6P653J6264j5038k1034j4550O8K131
$$ y = [-12693, -11191, -18806, -7004, -228, -1996, 2517, 7643, 18927, 21482, -7346, -26604, -16835, 2156, 1396, -5458, 5956, 5864, 8498, 12470, 6570, 1617, 12226, 22966, 17299, -9252, 1441, 13383, 18299, 8030, -6656, -14765, -5710, -922, 13760, 2222, -13165, -1832, -2103, -6018, 1861, -5866, -8742, -5191, -21682, -4288, -8293, -11, 22017, 20146, 750, -13374, 3962, 1102, -7418, -1008, -7171, -12438, -2885, 13789, 11905, 7843, 2655, 11813, -1766, -15805, -4009, 10429, -1997, 3227, 2705, 5525, 10472, 20533, 19060, 22129, 8693, 12299, -1547, -13625, 6699, 36633, 21705, 14797, 13863, 11104, 8969, 9218, 12628, 20428, 19414, 26149, 18100, 23934, 22055, 5600, 3943, 10301, 21377, 27961, 16546, -3837, -3853, 3800, 20064, 5026, -16008, -30558, -30490, -28359]
23745b8359j0282K558N993o663K595K7291J1569O17j4709k0909J4297J6545J3077
23732A3620j5039j5416K3096J3157j7996p391m299R339Q036q388k1206j1702m062
23719c8251J9533J7404Q479r90j3102O911K7386N824P90j1616k1493r531k1J1062
23705B385J5435J706o673k3912j8953J1661K2665L362L321k50o722j4269N057
23692e187R328L818m63j096l162q82m798M839q793q373q502J7780J1614R260r407
23677E976p926O372K091o426m696Q772O275j4135L95N452R58m555j857l848p070
23662a4222j6542R268K1218R602o477J0505O704j3064Q129n590k0061M115J2806
23649F391J6667J653J804n647l5357l516K1996N12j5369p205O608J453K286K798
$$ y = [-28359, -38641, -36083, -30090, -36753, -34158, -6867, 4702, 5319, -9390, -30299, -16002, 543, 13620, -1419, -16835, 6261, 19418, 1422, -5969, -10268, -929, 7107, -1281, -22487, -34189, -38251, -18718, -1314, 7165, 6175, -6927, -16, 27370, 33194, 33984, 22368, 875, -8656, -8677, 2385, 17820, 19526, 12853, -11059, -30012, -18351, 4314, 7676, 10997, 10747, 4025, -10244, -5187, 4141, 7959, 7496, 6400, 3238, 2356, -2442, 2397, -6396, -14769, -23271, -5491, 6123, 15383, 5976, -1950, 4422, 6513, 87, -4609, 4163, 10438, -3697, -3302, 2150, 3108, -1447, -3304, -7152, -14222, -30764, -21496, -278, 9324, 2847, 13352, 20056, 6992, 15121, 9531, -10530, -6415, 6391, 23058, 24711, 26515, 20868, -14489, -18005, 3991, 4503, -10866, -18071, -11463, -10010, -7724, -4926]
23635d926n220k040J0390n82j354Q808R406Q714Q435j4606o549O643r173m336
23621C610N037j2351L762l519o334q070n827Q660J6524J8796M790j1597n451J833
23607I863n279L948j2188k0311k36o901J2319J6736M697k738K553n875m813J7396
23593I171j224k0585k2444k26J769J1707k324K829J414L076O003R865J491q086
23579g564J2955m605J4931M925Q242K0634q205J679L941o098j8115j0715K7000
23566C9005P959k3639j8857l0177r743J6581Q495K6100O53j580j1535k0788j3324
23553c0850K0808J017r193J4071J2637m184O574m372L465J907O510J2080j0399
23540B0071j5932j2647o179K832n841j5086L387L086J6008K1017J542J0678L707
$$ y = [-4926, -10146, -12186, -1796, -2378, -3732, 5076, 14482, 23196, 31631, 17025, 10476, 17119, 7946, 3610, 8647, -3704, 58, -3461, -9795, -17865, -23692, -15032, 1492, 20288, 25078, 13481, 8030, 9863, 4584, 8532, -3656, -23967, -24203, -31104, -18785, -2049, 2648, -90, 2463, -3412, -8225, 9171, 7947, -12638, -35082, -35308, -33539, -21832, -24156, -21327, -19913, -16837, -10834, -969, 522, -7564, 5391, 786, 15717, 20642, 28884, 49518, 41313, 42992, 46933, 40835, 22720, 12005, 39005, 46964, 23325, 4468, -25709, -35452, -18871, -10376, 15724, 16377, 14797, 3262, -17526, -30850, -10042, -9025, -18218, -4147, 8490, 4306, 10880, 6508, 9973, 11880, 18390, 30470, 20071, 4139, -8508, -14687, -11855, -17696, -32782, -29395, -26309, -10301, 10716, 12258, 22936, 26643]
23527B6643J227K74j2566j2638p625J361j0110O853R544k5670l650J5978p01J1229
23513A49j3106j2932J6134J2194n990n905J5692J0298j697j307j6496J866k704
23500c804J3780j4843n215M777k556O230M951j9312j206J3911L041P549j5462
23487h159j0333K3458J3226k5911j1798J1369J0273O148J203R62P900J1661k593
23474B7406j6983k018Q989j0668p171K179j1757M426R690K158l409J2265q012
23461G095j0165N331l583m159k880m601j808K4249L900L878o037l371Q987j4006
23447B830j5206p929J3481J7711J2713q485j473J493j8551r908J1205J7648q236
23434G293l465J5127k384j5835j1413J3285Q515j6714j4868J3507L816K464k766
$$ y = [26643, 27870, 28144, 15578, 2940, -4685, -3324, -13434, -6581, 2963, -22707, -26357, -10379, -11080, 149, -12957, -25889, -9755, 2439, -3551, -9456, 6236, 16534, 14837, 13530, -2966, -1100, -3804, 9976, -4867, -10082, -5305, -7861, -1631, 3320, -15992, -17198, -3287, -246, 7303, -8159, -18492, 4966, 18192, -7719, -19517, -8148, 2125, 8273, 9476, 10438, 18338, 29999, 27406, 10423, 8405, 17394, 6726, -445, 1734, -10023, -5597, 4093, 6251, 2842, 15107, 7095, -3070, 2261, -1322, -5481, -8361, -12962, -14770, 9479, 13379, 17257, 11220, 7849, 16836, 2830, -12376, -20305, -6824, 10887, 23600, 15115, 13642, 15135, -3416, -13324, -2119, 15529, 7293, 3828, 18955, 16571, 736, -10677, 2608, 11123, -5591, -20459, -6952, -3136, -672, -3438]
23421c438j0834k984K4960j332n584n766j392J723j4803n172K086J5423k590j5958
23407b5661J8524M438R93K0733m991r612j0513P784p15j7035P416J5772J3891
23394B1024p156M533j7669j5763L0206R189k2020p464K138k026p695J7801Q859
23381A3957l696k2245l447r331l355o564j091N378J9836L0741M785o076j988K023
23367A8927o318j7561K033J0046J3075k111p555J2538j4520q658o508K165L422
23354a025L153m670j987r267k3718J3307N888R901K1432M938o633L01o021J0760
23340A6359k1494k3817j023J0008J0979N537L31M661o653k316K447J2225o36R348
23326A5956k0648k2316lJ2650J2886J560j5153k275J0177j5792R402J0077j0272
$$ y = [-3438, -14272, -17256, 7704, 6372, 788, -4978, -6370, -4647, -19450, -24622, -22536, -7113, -9703, -25661, -7137, -2699, -1706, 19027, 14036, 4424, -6089, 1695, 980, -16055, -8639, 7133, 21024, 13868, 18401, 732, -15031, 15175, 24364, 2344, -5120, -2982, -5008, -12703, 5098, 13957, 10261, -11984, -15431, -24762, -28117, -34681, -35772, -30394, -10558, 20183, 24968, 18892, 16904, 18927, 12609, -4952, -2919, 7127, 20202, 18091, 10536, 23074, 8554, -104, -6612, -4447, -1025, 2128, -2542, -4529, -13796, -37514, -24207, -18319, -8418, 13014, 17952, 11319, 11620, 5599, 16359, -5135, -28952, -29975, -19967, -8988, -3451, -3120, 1541, -5112, -7428, -4981, 7244, 6608, 15956, -4692, -27008, -27011, -14361, -1475, 85, -15068, -17343, -7166, -22958, -13556, -3479, -13751]
23313a3751j0321P047N873j0909r114k831j7514l596J5859J5310K0459Q777j7430
23300a2141M046P587j0186J04N59Q27J7157J1718n352j2154K320l702j0048k3316
23286c2581N006J6282L058O208R398M04K4207K1233j407k8458j8024q530j358
23273d562j171n474q40l103M757J7916P378j9542j5152o764J4489K3941J8053
23260B9926n17j8231m361j5184J201J0233R949J5185j2246j5986r9j137J8722
23247A7455J5557j0822j9295j4534Q4q609L281J0956L466j4687j0538L9j3555
23234d1202K5391K3592j310r096j0431m935j104K2344K8101J8869r39l77o425
23221D2478k3068k0973j7554Q086J4682Q336J596j6466k7320K617M713J372Q604
$$ y = [-13751, -24072, -17025, -11152, -22061, -31175, -34006, -51520, -55116, -39257, -23947, -3488, 5289, -12141, -8095, -508, -10694, -10590, -10031, -9204, 7953, 19671, 14319, 2165, 4485, 783, -9265, -32581, -27575, -11293, -8235, -2027, 7371, 7775, 31982, 53215, 51808, 23350, 5326, -3204, -4562, -5733, -11207, -12047, -15150, -10393, 7523, 14901, -4641, -19793, -26557, -12068, 11873, 29926, 29409, 11178, 6817, -8367, -7166, 3067, 13016, 28201, 15955, -31, -130, -1267, 17455, 33012, 22190, 2895, -11639, -11555, -20164, -16883, -5927, -2461, -17148, -27686, -27647, -41202, -15811, 7781, 6471, -2625, -13056, -17991, -19095, 3249, 31350, 50219, 49280, 48903, 42478, 19410, -1563, -19117, -11031, 3651, 11987, 13583, -2883, -30203, -27586, -22873, -21501, -12897]
23208a2897O242P448j4178P434J2598J2204R221M915j2218L067L573j2051j344
23195A4014r913p940Q986R958O74o313k0056j5914J40P111K479m714P915J5599
23181B026r449m342L682q050J771p24J558J4305l728M637M302j747Q543n43L790
23166A6031L295l235Q796r016j4147N452N573j2759j2580K835P915J004O121o970
23152a685j7939o985N663N268Q956k617J2207J7171j199r082j3573r267M299P650
23138a133J2432L768k2652l337n409P425M347l996M227J0951r25R23R90K1261
23124B8872o75r181j6976k293R526p292J2317j4271R367K5904P429k532j8920
23111B1275j2392K1717L805j6783J4603K2218j1551k5191j2019L380k618m656
$$ y = [-12897, -6655, 793, -13385, -5951, 6647, 18851, 28072, 32987, 20769, 23836, 27409, 15358, 14014, 4101, -3839, 5147, 15105, 15779, 9466, -10590, -26504, -26364, -19253, -16774, -21488, -13573, 2026, -7423, -11765, -8083, -16133, -14362, -15086, -13528, 777, -2951, 1686, 5988, 4241, 12784, 12241, 16031, 19326, 16091, 24887, 15871, 1724, 7176, 12749, -10, -12590, -9755, -1840, -836, 5285, -1685, -19624, -26609, -20946, -15678, -6722, -9339, 2868, 20039, 18840, 9758, -3815, -13082, -8783, -1133, 11299, 15067, -7585, -10922, -16331, -8906, -4559, -8555, -4328, 6623, 5698, 6621, 7611, 28872, 28197, 19016, 2040, -253, 9273, 1981, 14298, 27, 9394, 35298, 42727, 40195, 21275, 8883, 30600, 34405, 17622, 32225, 54443, 42892, 17701, 5682, 9062, 6444, 1788]
23099A788k6600j1375J1577M163K0387P796M026M753j4773k788K86P403m448q689
23085f494M948j0257p962J1188k843J820K770j5407J456J1681n241J001J7433
23072D093N362j510J140N667k848j4234j113J3465R774l269K702O232o729j7500
23058A232k201K273J4354O319k501k0276P77K891j246J0566J4172m165j7053m202
23044I40L990k016j3214j6037l394l737J5762P119j0024n140m679N436P797M817
23030a2380k807Q6J103N292K094R596K2050Q32m960r970J4758J2797j1526l3957
23016f992j4792K6672R481N162j1254k906J0974M94j596k965o871k1475J080K2835
23002G847M203J3053j732l1669m104N895m707J16m828p6p243J9732J2764m080
$$ y = [1788, -24812, -36187, -24610, -20447, -60, 7736, 11762, 16515, 1742, -1046, -760, 6643, 2195, -6494, -1546, -11803, -19765, -8577, -11420, -9600, -6830, -22237, -20781, -9100, -14341, -13340, 4093, 9455, 7945, 9085, 14752, 11904, -2330, -3443, 10022, 19796, 16527, 19229, 25461, 18732, 1232, -969, 1304, 15658, 21977, 19476, -800, -23, 2868, 1622, 12188, 26360, 22195, 5142, 940, 4930, 2914, -10300, -26337, -29731, -33468, -17706, -10587, -20611, -25751, -30430, -24994, -17197, -12380, -15187, -15101, -13998, -8706, -6612, 2984, 25034, 25866, 20906, 10936, 25694, 38491, 26965, -6992, -21784, 4888, 14369, 19531, 8277, 5371, 16345, 16839, 15243, 12278, 5407, -16068, -14988, 7847, 12050, 25103, 23371, -8298, -12402, -6507, -11214, -11098, -15926, -16002, -23245, -3513, 9251, 5171]
22988E171Q715R135j8281k012M540j4162k0810R860J70l767k335J3477K5779J9661
22974C5141j8749j5218m829P25K995K1396L2310Q899k3791k2641j3193o792Q587
22961D840k941k1678j3977p816Q081J1859N390J3693j5653j3692k3693J4609j675
22948d2653Q075R666J8260j4168p400J3157N96J7362K4588M619j9712r761n464
22935b835o212o798L507j5087l895J8924N152m12o479o957j4345K016r072R263
22921c3230P836J7268O331P491j874J907p113r325N267M534j519J0054J733j6593
22907g233j5482k794J6515m789J6829K190n158j3002k5643J7659K3026l29P693
22894I482P312J1529M804L774m594k4584q134j506J3582p957j5706j4230r604
$$ y = [5171, 13886, 23021, 4740, 2728, 7268, -6894, -27704, -17844, -17674, -21441, -23776, -10299, 15480, 35141, 16392, 1174, -3655, -2930, 65, 21461, 53771, 62670, 38879, 16238, 3045, -3747, 4840, 1899, -19779, -33756, -41572, -33491, -21632, -16242, -2549, -18202, -31894, -55587, -40978, -42653, -34578, -24912, -6652, -20820, -28220, -15063, -14467, 2895, 27483, 32102, 12390, 2629, -2835, -9047, -15845, -12338, -27425, -31320, -12396, -7244, -7656, -14135, -21092, -35437, -33421, -42493, -33230, -25394, -8126, -1795, 5696, 3822, 5729, -1384, -10709, -5442, -908, -2427, 7627, 9360, -7233, -22715, -25509, -8994, -13783, 3046, 5236, 78, -12924, -38567, -20908, 2118, 1789, 9482, 16794, 28323, 33127, 36901, 32307, 7723, -411, -1917, 11665, 3708, -11998, -26228, -35832]
22881c5832j1141L514K1201J2339j488J8762K0504J0044j7296j7833j2558J434
22869h350k80q992L113j017o311J5253O221j4625j3016m424n150O882J5686K2000
22855F990k084o725k97j394M556K3160J4532m914j3947r780R070j9443k2072l814
22841b6162M32K3368J6601j8948j381P157j428k210K3036k218j4087K557l1j9393
22827a2707K921J8552n612j643M300P900k406K1637l286k3166l072m341j7268
22814a8191R133O096J3283J3981j2560O909J055j5518L372o877n573P593l913
22801a210p949j0814L201p824q18J2566K763m624N815j1710O959N700Q541J5026
22787A5622n051J3522M574r90j3853j4576j5288p414m131K3680K2293L661j5832
$$ y = [-35832, -46973, -43459, -22258, -9919, -11407, 7355, 27859, 37903, 20607, 2774, -9784, -8350, -8630, -17622, -14509, -15526, -21837, -6584, -363, -14988, -28004, -32428, -37578, -30696, -15010, 6990, 4906, -1819, -2116, -3510, 1046, 24206, 38738, 33824, 19877, 10097, 19167, -276, -22348, -26162, -25730, -2362, 14239, -4709, -6090, 1067, -361, -2571, 20465, 18247, 4160, 6717, 6686, -12707, -9786, 8766, 3154, 1511, 5811, 13711, 11305, 32942, 29656, 6490, 3418, -923, -18191, -9058, -2962, 10321, 24302, 11742, 18651, 19706, 4188, 7560, 683, -4890, 2703, -1210, -9159, -19973, -16772, -24596, -25414, -12848, -10085, -14709, -8894, -20604, -13645, -7945, 596, 15622, 10571, 24093, 28667, 27677, 13824, -752, -16040, -23454, -27585, -3905, 18388, 22049, 6217]
22774F217L324n870P701M709o560j093N12j4059j2450r27J1623L185Q911J1202
22760A6425j4075j077Q662q912p31j0152q155m65J4579J1356J8072p270k2549
22747d292j9978Q493k942q395k21k305Q429J5291J4644k621J3805P164k3960j0571
22733g459m278j5132K943J0309J4641o523j5732J851L08P798J7133J9756K366
22720B7981j464l1147k1071r563Q998J4615K1696K850j4885m493p030L245J5801
22707E533Q2m754m722j0120l478j6971J2509Q980N038J1540M633j0506k799l070
22693h105m718l877j899O045o919l309J518L167J3534P461P481j2107j2048R332
22679d444J5111J1856o831j2728j5539L667J513O217O420J742K30q201j2824r04
$$ y = [6217, 9541, 3671, 11372, 16081, 9521, 8428, 8940, -5119, -17569, -18496, -6873, -3688, 5223, 16425, 2350, 1273, 9935, 1023, 292, -9860, -18015, -18480, -3901, 7455, 25527, 18257, -4292, -24270, -15777, -18719, -27114, -27335, -29640, -21211, -5920, 8724, 6103, 19908, 27072, 3112, -7459, -11737, -26869, -23926, -13617, 1024, -5499, -21231, -19380, -19072, -11274, 5859, 25615, 27981, 26517, -4630, -25701, -35264, -26266, -11651, 10045, 12895, -1990, -6483, -13513, -10268, 5533, 5615, 861, -3861, -13981, -17459, -34430, -21921, -12941, -7903, 3637, 8270, -2236, -5035, -8105, -12823, -16700, -18599, -12554, -19473, -22782, -21264, -18097, -4563, 2898, 10379, -1728, -13776, -4444, 10667, 22523, 15692, 2964, -12575, -8908, -7395, -1178, 5242, 6984, 7214, -987, -13811, -14715]
22665a4715J9927J5094R616o337K609j543j0860n540n970M274J2848k032k1128
22652c757k169R479M064M284k160j7848N641K43q697K1899J390r395J6863M055
22638B3892l1879j4901J8200J5513J0j5934J1312j382l6934k1583M655N607k763
22625d6187L435R058K6153R640Q601J1951Q20k8736M05J4038J4965O049j2820
22612A7372r048j1933J810J0121j9837P823oo640L057n819K438L632K5971R001
22598B7942K441r816l4586l300J2292p654j4876N856J3374P772P958l250p003
22585b850r467J2060K3929Q681j9361j0775n269k830J5389J3566j7505j1011q3
22572e526J90L639r648N862K0314J1791J223p353L710j207j1771n080r302r317
$$ y = [-14715, 5212, 20306, 29922, 23585, 26194, 24651, 13791, 8251, 2281, 6555, 19403, 17371, -3757, -5926, 3553, 7617, 11901, 9741, -8107, -2466, -2223, -10920, 10979, 12369, 2974, 19837, 23892, -7987, -22888, -4688, 10825, 10835, -5099, 6213, 4831, -32103, -53686, -49031, -43424, -46187, -42752, -33694, -7541, 2099, 10700, 22651, 23471, -5265, -4860, 9178, 24143, 30192, 17372, 8324, -3609, -1799, 8322, -11515, -3692, -3698, -10338, -7281, -13100, -10662, -7030, 18941, 27942, 30383, 20567, -14019, -17319, -5027, -12681, -27557, -21701, -8327, -555, 7403, 4153, -2850, -12317, -257, 23672, 32353, 12992, 2217, -3052, -5882, 9507, 23073, 5568, -5443, -5526, -5336, -1697, -11345, -5483, 14831, 26622, 27845, 20492, 24202, 22995, 11224, 6144, -3158, -12475]
22558a2475r811m897K490J7753N704p997l071J7408J5058j3978j3575k096N105
22545d382J1479q946P435K31r725L383j7334Q221J036J326J5533J995j5404m890
22531a0042j2495N462J8394J9255l508n931m487j6277P211J0120j782p951L579
22518A548n028j2351O793J7481J3568j6731j3256Q72J6058Q128p588J566l1555
22505b0495l453J5261K364P916Q671L192r370j1132J0163J1246r612j4934j0250
22492b0433J921j6808L985R031Q326K9450j3879M424j3333p545J6305O017Q757
22479A6218k934k3933l482J9725q254m380J1126q296p452m061J395P851P23N093
22465f61J4564M470Q77P4j1376j3423J907j0373j083J1874R678M492R571o391
$$ y = [-12475, -22286, -27183, -24693, -6940, -1236, -9233, -12304, 5104, 20162, 6184, -7391, -9487, -4382, 7097, -1849, 5586, 5817, -3908, -525, -17859, -9638, -8602, -7276, 8257, 10252, -5152, -10042, -22537, -17075, 1319, 20574, 17066, 11135, 6648, -9629, -2418, 7702, 5920, -2031, 1548, -3480, -15831, -9038, 8443, 22011, 5280, -7976, -7104, 8954, 17082, 9494, 11060, -20495, -23948, -8687, -6323, 1593, 10264, 13456, 4086, -7046, 3117, 14363, 4751, -10183, -20433, -18512, -35320, -31335, -22304, -13978, 15472, 1593, 6017, -7316, -14861, 1444, 7461, 16218, 13284, -10649, -14131, 5594, -2660, -7040, 4086, -4210, -11662, -15723, -14328, -6477, -5754, -661, 13903, 18373, 19250, 19324, 7948, -5475, -3568, -13941, -15024, -3150, 6528, 11020, 20591, 14200]
22451A4200j7983J3507J6409q605p006P579n827j6155o250j9044m952K5937J4269
22438F079j817m296j6079k0143J1906K5453K457j503J777m915r586k8007m550
22425d3224K3973J6485K0920j1591j1817K190J5813j368m237K656l80J881J373
22412A2674j4521K174K4198r926k690K047j8246j8582K1892J700j0529p702m272
22399b1783K4902j7771j7326K800J8496O330j6269m828J3075M269p34O550J2067
22386I778n450N175j2423L611l109q545j192Q239o676j9707J432P385J5711J3044
22372G273J609j5416p624P132J52k049J5162Q309J1474R79p087j8622j2253R144
22358a817J3289R535m861J807q841n378j6878J205J1203J0376J3330l81j5989
$$ y = [14200, -3783, 9724, 26133, 17528, 10522, 18101, 12274, -3881, -10131, -29175, -34127, -8190, 6079, 4262, -34, -16113, -36256, -24350, 1103, 3560, 2057, 3834, -1081, -10667, -38674, -43224, -19251, -2766, 18154, 6563, -5254, -3064, 12749, 11381, 7144, 9800, 9420, 11301, 12674, -1847, 327, 24525, 14599, 11909, 13956, -4290, -22872, -980, 720, -9809, -17511, -21783, 3119, -14652, -31978, -29178, -10682, -4352, -20621, -25449, -12374, -8105, -8839, -2289, 9778, 4328, 9503, -2920, 691, -2418, -10963, -12155, -3916, -10592, -30299, -28867, -21482, -5771, 7273, 8882, -6534, -14158, -7026, -6874, -8923, 6239, 14548, 26022, 27001, 19914, 1292, -10961, -1817, 11472, 21007, 16146, 17953, 9112, 3734, -13144, -11939, -736, 9640, 22970, 22589, 6600]
22345F600p380O98N78M204J1401m68O181M07K581j7254n638k1107Q097r738j3342
22330c4180L500K52o625N449K0863N549J1333P734K684M381r45k6436o339K9966
22316A7186O513j1947l709L542p073M459K4719K0567j7136r766k7564j9091J525
22303a7775j8577j0867J1274J2271Q615R876M284j1162j3012J6818K445k8655
22291c4465m834O996K2222K2435m208j0786R74R525j6581J805J1374J5159q567
22278A1049K517J2710j0974p168m40l702J5063o11o781K933j1077Q275K652k3264
22264h818j1501J1791n118q897K3824J1928k272j449J991O919p64j0724j9440
22251a2530K880o926j510J499Q763j3645L398J9675J4141p951k4574j9577j5K2295
$$ y = [6600, -780, -82, 496, 4700, 16101, 15633, 21814, 22221, 24802, 7548, 1910, -19197, -11100, -20838, -34180, -30680, -30428, -37053, -31604, -10741, -5192, 6141, 13875, 16559, 20940, 19995, -6441, -12780, 17186, 23699, 11752, 8043, 11585, 4512, 8971, 33690, 54257, 37121, 27355, -209, -19300, -17775, -36352, -47219, -35945, -23674, -15059, -5183, -899, -12061, -25073, -8255, -5810, -34465, -39299, -32303, -10081, 12354, 8146, -2640, -1666, 7859, -8722, -6917, 4457, 19616, 11049, 13566, 26276, 15302, 8134, 7694, 3992, 19055, 18444, 11663, 14596, 3519, 11794, 14446, -8818, -20319, -8528, -13646, -22543, 1281, 13209, 10937, 9488, 11479, 18398, 17634, 6910, -12530, -9650, -16576, -18086, -16587, -7824, -21469, -18071, 1604, 15745, 7794, -16780, -36357, -36372, -14077]
22237a4077K0512K639k1541k08R689K0775J632j3669j8667p810m868j018Q676
22224a7935k1812J1636L2797O266j5003K964l845J5186J0733J6249j004j9305
22212A6927j450j3716j1222o572M104k723m073J1651K0308K333m742r007J5813
22199A7631k886k1629j1651J031J7425R917J8763K640j185M767j1229r344J0094
22186B4344k285j6543N907K159j3597J4840p85r801j8439j6618N026J8782J7592
22173A0582j9245n202R401k366M190r446L763J8974O47q748P31k889J2573J910
22159A4875j8512j8625K723J9484Q402p363j82l375M653j1380Q577J7230J1004
22146B7511P400l501J0621p24j9110j0270r978j9244J0546J0233J2537o232k1053
$$ y = [-14077, 6435, 9074, -12467, -12675, -2986, 17789, 19421, 5752, -12915, -20725, -25593, -26611, -17935, -39747, -28111, 4686, 10952, -4051, -1087, -4932, 10254, 20987, 37236, 36232, 16927, 15477, 1761, -9461, -16033, -11929, -14652, -18725, -7074, 13234, 15567, 10825, 1818, 17631, 14745, -6884, -18535, -17504, -79, 9838, 28601, 31241, 30056, 34823, 23594, 14250, 24344, 22059, 5516, 11423, 13582, -15, 14825, 14040, 4239, -14200, -30818, -25792, -7010, 10582, -8663, -13865, -4464, -6830, -2640, -12086, -8323, 10651, 11298, 2550, 3281, 392, 12965, 14875, -3637, -22262, -19539, -55, 8347, 984, 802, -2573, 2080, -9300, -723, 16507, 27511, 34911, 31410, 42031, 41307, 22197, 11927, 1949, -17295, -6749, 3484, 16021, 9789, -11264]
22133a1264p307Q013j0607r369K2840J7426j0030K176J4175K24k1580j832J4408
22120G273o104J1060q00r558J26K808k0501k238K683j1755M754J1945J7079J0019
22106A6791p449k1171j3907R949M439q929j1459k429K0590p474o907O21J6312
22093a1023N507q593K919n460P342P607J4223q434J0037P567p649l608p685O980
22079I730Q450M438K096L36j8703j1550M07N44J397r43J5257k713k8370j399K6883
22064E860J2014o130m356n22k2225j0306j353m891J4578L2369o475r439M796n699
22050a779K370J9864K45k3536q736K6035n736q776J5559lm539l604m087O638N969
22035A5884l277k860L4929k112Q207j5364J4912L050j8993j2047n342j7833j3235
$$ y = [-11264, -18571, -10558, -21165, -30534, -7694, 9732, -298, 1878, 16053, 16277, -5303, -7135, 7273, 1169, 12229, 11429, 1871, 1997, 4805, -15696, -17934, -15251, -27006, -22252, -10307, 6772, 16791, 9342, -11829, -25736, -15787, -11348, -20277, -31736, -34165, -13575, -21049, -27956, -27335, -11023, -5516, -14109, -11190, -16650, -9308, -1701, 12522, 4088, 14125, 21692, 14043, 10435, 2750, 9730, 18180, 22618, 24714, 25050, 6347, -5203, -4796, -4252, -2855, -3798, 11459, 8746, -19624, -21023, 5860, 17874, 11744, 7388, 6866, -15359, -25665, -27018, -31909, -17331, 15038, 8563, -876, 3920, -1779, 591, 20455, 20700, -2836, -11572, 14463, 8727, -49, 15510, 15507, 10968, 7364, 3277, 9915, 15884, 12607, 9747, 44676, 42564, 50771, 35407, 50319, 53369, 34376, 22329, 16987, -846, -14081]
22022a4081L694j6183K545j6962J1919J6406J0275O673n203j5966J8706J4822
22010A6645j2455j0217j2286P942J1695l13l704Q492k5421n846j782K423M457
21997b0370R161m109j583j3755n961m985K2023J3196K4734n051O249P867l853
21984B3563P633J858J523l554q379j0749j3899R305J8623J6723j1690j1300j4807
21971D850N362J841J503j3475j1184j845J8904J3504j076q628R949j6294o525
21958c114M998J6076N752j2964j1258P940J1059J3137p508k637k179R69k4762
21945d491j0901j392J0272J6539m211q002O986K0L062l532K523P775K1552J5722
21931E1922k1909p548J5243N649j605J514J0642O144j7919j2599k7854j4942j1251
$$ y = [-14081, -10387, -26570, -24025, -40987, -29068, -12662, -2387, 4286, -917, -16883, 1823, 16645, 4190, -6027, -18313, -10371, 1324, 1011, -2693, 5799, -19622, -25468, -27250, -24827, -20370, -11209, -15318, -16901, -30656, -36617, -41602, -19579, -6383, 18351, 13300, 19549, 27416, 23563, 31196, 33054, 34577, 31023, 22644, 11895, -2004, 7301, 25924, 42647, 30957, 19657, 4850, 10212, 12053, 13556, 81, -11103, -12948, 5956, 19460, 18384, 9756, 19705, 3411, -3114, 1884, 17960, 23712, 10748, -510, 7430, 18489, 31626, 24118, 21481, 19302, 20271, -4491, -15392, -16784, -6512, 10027, 5816, -2186, 4800, 4820, 7882, 4350, 6873, 14648, 36200, 51922, 30013, 22465, 37708, 43357, 41752, 43266, 53908, 60052, 42133, 29534, 1680, -13262, -24513]
21918b4513j038l819K0596j0872J4211J6842J0300q400j5108j9277k439j0426
21906c3943L34J2098L0222j310j5708l321J593R472Q221j7284L947O562q661p673
21892a5451K3084j2536n433l543r357J0560j739q564J4109J0451L371n566j2278
21879a2892j2325M718J6160R000J4845P66J340J354m107j7266j2446P960r154
21866a2047j0175K951j443R123K7606j2512K527j848j0302J1591r07l23o063j5866
21852a7688p283K1513M611j0973N560Q135M604K0895J8986j1281k3035j6559j5116
21839a7631j1537j188J3463J5926L375m274j2322Q533K2705m240r139o715j4258
21826a7302J80K843J4390J2623J0414j2045n703J0674o671P08M712m431k382R579
$$ y = [-24513, -25551, -29370, -8774, -19646, -5435, 11407, 21707, 13307, -1801, -21078, -23517, -33943, -33609, -21511, 8711, 7401, -8307, -11628, -10035, -563, 7658, -9626, -5679, 883, -7778, -15451, 7633, -4903, -10336, -13879, -23236, -12676, -14415, -22979, -8870, 1581, 4952, -614, -12892, -25217, -20499, -4339, 4661, 19506, 20272, 21612, 22966, 18859, 1593, -10853, -2893, -12047, -22222, -19271, -20714, -11591, 16015, 3503, 6030, 4182, -6120, 5471, 4564, 4241, -1822, -17688, -24971, -3458, 1153, -9820, -4260, 3875, 8479, 29374, 48360, 37079, 14044, -2515, -17631, -29168, -30356, -16893, -967, 2408, -1866, -14188, -5655, 17050, 12810, 3671, -3044, -17302, -17122, -14279, 111, 12734, 23148, 11103, 5400, 16074, 9403, 10111, 14823, 10392, 8010, 17589]
21812A7589L191k4754j0435J4837J1664L386m889P470l27N419J7626j855r262
21799B9660j4624j0812j2748q64r352O226J0703K367P299J1129j4273R390R793
21786B3894j7782o081M754K481J6429j0313k359Q18j2599q205J1435N055N235
21773A2762J1917P335r659j5120n97K4414k126J1250k292j2541n952o019j2866
21760E06p409J4823j059j2534J6355j707k920l860n457K96J0074J5395K862j1793
21746A3572o987J0823N113k350p862o593P146R140m421J3806n23m1025p679K6054
21732H214J3347M44J4340o80P029k3991k3993m677J1828P636R136L91q215M5L701
21717A4555L291K021k383j5753M70L070M116O737P641j6163j989j8967J074O696
$$ y = [17589, 20780, -3974, -14409, 428, 12092, 15478, 10589, 18059, 17732, 23151, 40777, 38922, 29660, 15036, 4224, -8524, -9388, -18740, -12514, -1811, 556, 7855, 18984, 4711, 14101, 23894, 6112, 31, 4785, 7266, 23695, 13382, 11023, 11841, -758, -8963, 2472, 7527, 12762, 24679, 32014, 22355, 7235, 6638, 31052, 28926, 40176, 37884, 25343, 19391, 13372, 506, -6903, 7920, 6861, -5673, 10682, 8975, 6055, 2195, -3262, -2966, 7108, 22503, 25365, 13572, 6585, 17408, 22521, 20171, 12309, 5716, 12862, 22002, 17581, 31387, 30864, -10161, -17840, 8214, 21561, 22005, 36345, 35665, 42694, 18703, -5290, -9967, 1861, 9497, 18633, 19024, 10809, 10854, 14555, 17846, 19867, 17484, 1731, 2201, 5271, 9387, 16124, 23765, 7602, 5613, -13354, -12280, -5584]
21703e584l438k434p225o29K1287K7624O022j3367l2178K123M055r45J8619q48
21689A3082j4026K115K821J33M819j1305l308k969k808j902n818J0278J5260J7797
21675B4169j794j5848N097K562j498m446r153L550q879n52O464O921O99j2169
21661d877o659j0828J0621Q089n701j2008J3609J6752q788j1998O909N136O721
21648F978N168N495l396J6095p521L542M90o024j7023N992j4747j2655J7765J471
21634A630L96O159k214J5903r954n475j7322k82O359J9017j3286k222P570J115
21620G394k4963o097O540j6630O396J4291L474o869L459m993Q849k1767j3121
21607d4037J0787P420L179L754j9236J2377J8472J1275q168m735L693K676K833
$$ y = [-5584, -9022, -11456, -18681, -19310, 1977, 29601, 35623, 22256, -9922, -7799, -3744, -4689, 13930, 13082, -944, 1171, 3992, 4125, 8944, -2361, -5669, -8638, -11446, -13348, -19166, -8888, 6372, 24169, 22375, 6527, 11624, 14186, 12688, 8242, -911, 2639, -6240, -6792, -328, 6593, 7292, -4877, -11536, -22364, -11743, -3654, -9355, -21363, -7754, 8998, 210, -11788, -4879, 257, 6978, 12146, 17641, 14245, 30340, 22819, 26361, 26851, 20827, 3804, 9796, -4951, -17606, 159, 1630, 2026, 8185, 5971, 21874, 11920, 6445, -10877, -11159, -4800, 14217, 931, -1291, 6279, 7394, -17569, -23666, -17126, -33756, -27360, -13069, -9595, -16464, -13005, -17998, -9149, -30916, -44037, -33250, -25830, -22651, -18897, -38133, -25756, -7284, 3991, -4177, -8912, -5219, -2543, 290]
21594B90j1261q551J256L220J1236j7052O022K2182j1513k0273K474L3949k429
21581I550k4399r885J1587J6240j2456N154J145n585M711K6829K6636l2200k0054
21568b727K550L586q151P108L5343N794j0979k5701j064P610j298r759J102p356
21554c942j7988n122K4407K1004j3363o320K792l867k267l596K6086J8324m377
21541C1771r459k0776m829n109M002j680K310P505r182j041J5676j586j4145K079
21527d464J0474J1518K4701j080l2155k1063J3660R207M4m195L880J9785L609
21514C3921k2014l672J0936j795q728p336q12l101J5208J2717M770M932q624p186
21500A9216j5174l761K3962P992p069r522p143o11P805J0512Q143j5600j2643
$$ y = [290, -10971, -19522, -18266, -15046, -3810, -20862, -14840, 7342, -4171, -24444, -21970, 11979, 9550, -14849, -24734, -13147, 3093, -9363, -4209, -3064, -8649, -3938, 22891, 49527, 17327, -2727, -177, 3409, -4742, 2366, 37709, 43503, 32524, 6823, 5759, 13369, 12071, 2312, 3414, -3942, -21930, -27052, -2645, 18359, 4996, -1324, 1468, -2399, -4666, -8262, 17824, 36148, 31771, 22312, 1536, -3293, -8402, -4400, -6080, -3770, 3735, -5447, -6488, 9188, 7602, -6543, -4464, 6010, 17528, 42229, 41149, 8994, -12069, 1591, 10798, 10842, 6647, 10527, 30312, 33921, 11907, 8235, 19171, 17376, 8648, 1312, 500, -2601, 12607, 25324, 30094, 35026, 26402, 19216, 4042, 281, 24243, 32235, 25166, 15644, 8501, 7890, 15695, 26207, 34350, 18750, 6107]
21487F107j2510k1706Q2J3686K1422J5012O04j5026q877L7n993J1068J8523j5423
21473G006j6008o404J6166K0275p6l021j7515j8353K4744J5505P020M11l131J269
21459B7888k6108k2624J1540J5049l46j2021j5713j0225K9716P153j162j2253
21447i106j7282n906J3778J1583P997O742L423k752R777j4318n164J3892J8967
21434C1631j523L123J216r867j3996m619p561K354j7039l926K3919J7965j0807
21421A0870j5004J3560J788J648N6m76Q776Q991M302k2124n595q145J4809j393
21407A2063j002m568j0892N221n573j9601J2633J0987k222l480J098J1206J5692
21394B1562o040j3445J03Q683o203N324Q743j7976q958J1150k053m588J5785j4314
$$ y = [6107, -6403, -28109, -28027, -14341, 7081, 22093, 22697, 7671, -1206, -1169, -7162, 3906, 22429, 7006, -9002, -15406, 760, 21035, 20959, 17938, 423, -17930, 6814, 22319, 29339, 29750, 26619, 27888, 1780, -20844, -9304, 5745, 5399, -6622, -22335, -32560, -2844, 4309, 3147, -9106, -26388, -32294, -18516, -6933, 1064, 7806, 11229, 8477, 18254, 3936, -1228, 12664, 31631, 30108, 33231, 34447, 24580, 10584, 5965, -1596, 758, -16281, -20207, 3712, 21677, 10870, -4134, 9426, 11214, 12862, 12918, 12442, 21218, 30209, 34511, 12387, 6792, -1353, 13456, 12063, 11061, 6493, -4399, 822, -4751, -24352, -11719, -732, -2954, -6434, -5336, 5870, 21562, 15522, 2077, 2180, 10863, 4660, 9984, 18727, 751, -8207, 2943, 890, -3698, 12087, -2227]
21380b227j5348J0659O618p265l670J8313J9495k946n162j7969m426K63P045J7714
21366B1094j5400j6824q543L731J0192J4791j5284j6557K5024J4378O6j0569k3399
21353a7300j5214J111N992k959J2554J8192J2213J525r451J0340q088q798q91
21340g74Q657J9867J952j3374j4506r02n152k372J9186n795K127K5140N946q113
21326C1887j3402j7435L130K3631J5879m109j6013J2576l592k0978K080J7737
21314C1391r822K165R598n611j2431O28J3453j4988j2573J379J4854j1847J4973
21301B1169K4963q051k2199j5693j802J9181L35K550n984M78Q540j0318o74L52
21287A2847p677Q894J8224J338r248j195p13J2348J2559k3664j3552j2582J5008
$$ y = [-2227, -17575, -6916, -298, -7563, -11233, 7080, 26575, 23629, 18467, 498, -3928, -3665, 3380, 21094, 5694, -11130, -19673, -15942, -5750, 9041, -6243, -22800, 2224, 16602, 16668, 6099, -17300, -32514, -31403, -25411, -28370, -15816, 2376, 14589, 16114, 6663, 17003, 8915, 117, -774, 7883, 27750, 29702, 16328, 1822, 920, -4232, -6604, 12582, 6787, 8914, 34054, 40000, 31887, 18485, 1050, 4180, 27811, 43690, 39581, 23568, 36144, 32552, 11574, 13654, 31391, 21569, 23734, 33332, 27721, 15290, 15918, 29371, 14383, 1810, 3189, 18043, 6196, 21169, 46132, 38081, 15882, 189, -1613, 17568, 17903, 20453, 14469, 14947, 23487, 13169, 12495, 12847, 5170, 14064, 32288, 33626, 24378, 23183, 22470, 34818, 47377, 23713, 10161, -2421, 12587]
21274A2587m762J955L042m226k440j1896j2271J0236n179p669M817M286O757K2167
21260A7404j2996P854J2140K188M341p835M651p617j373j558J106J2251j0390
21247B0166j3452r554k9679J706J2437K9355O839j2313j4955J9316O731j2849
21235C748l895J4687m983O951K3017j741o334k544j3541Q441p253l0105M414q676
21221a7814j6510K8272J6642j5667Q709J3256J4939q105j598R69M102q42p265
21208A9088j4727r975P064R286L077J5300K867j2296Q716j5968p569R624O814
21195B1301N286j1630M772l030n956m937o274J4271l660j5652K9201L4433k236
21182E5889j142k3352j7425k656j7615Q835M598j1652j5069N98J2129K7333M913
$$ y = [12587, 7825, 9780, 12822, 8596, 6156, -5740, -18011, -7775, -12954, -20623, -15806, -11520, -4763, 17404, 4408, 12262, 24402, 26590, 30931, 23096, 27747, 20130, 18757, 17199, 18305, 30556, 20166, 6714, -2840, -32519, -30813, -18376, 10979, 17818, 5505, -9450, 9866, 16597, 3748, -147, 14540, 9557, 16508, 39525, 37784, 31450, 28906, 15365, 23806, 16553, -13552, -9138, -17814, -34324, -6052, 10590, -5077, 3632, 16888, 31827, 23722, 22124, 23093, 27195, 26353, 19088, 4361, -5614, 1450, 10736, 13813, 29113, 31980, 19684, 28400, 12432, 4863, 14487, 21301, 26587, 14957, 19729, 16699, 10743, 5806, -468, 13803, 10143, -5509, 23692, 58125, 55889, 54747, 31395, 13970, 11314, -6301, 2534, 7132, -4520, -19589, -18991, -6862, 20471, 25384]
21169B5384N247N197m325j498j2995o699n312O773J3349O647M093l5807r215P818
21155a343R647J6620P701r890Qk422p515L137M595N471M255J3799l648j1972j9830
21140H613j2635m402J821K835K488l018m006J0378n835R177K1883J0051l402j198
21126C2750j0291m51J382k1243j081j0263M726l618n636m192l378K0765K4828
21113B4298K2326r41l9067k0957J7099J8938P043q035m606L122j0322p425N602
21100G075Q731J3374j5796q866j0867M595K303J3407P486q662j3677J7788K2149
21087C9040j6902r583K766N968K311P261k535j2295m926j9773J144M3630K1276
21074E7382n112M342q590L272L420j0681Q872K0151J3118j02j8433k2036k7176
$$ y = [25384, 30631, 35828, 31503, 30005, 17010, 10311, 4999, 11772, 25121, 31768, 35861, 54, -9161, -1343, 8304, 24924, 32625, 22735, 22743, 20321, 12806, 15943, 20538, 26009, 30264, 44063, 40415, 28443, 8613, -4022, -8424, -6603, -3768, -1280, -4298, -8304, 2074, -3761, 5416, 27299, 37350, 33948, 32750, 22459, 22008, 23390, 2147, 1066, -9197, -4471, -8089, -13725, -17917, -21295, -530, 24298, 46624, 45683, 6616, -14341, 2758, 21696, 28739, 20704, 16098, 19220, 8898, 1473, 7075, 15806, 29180, 13384, 4518, -6349, -1754, 549, 13956, 21442, 12780, -897, 16891, 39040, 22138, 12555, 15321, 21289, 23600, 30861, 28326, 16031, 11105, -8668, -7524, 36106, 57382, 52270, 56612, 48022, 51294, 54714, 44033, 52905, 73056, 86174, 86072, 67639, 45603, 18427]
21061A8427j0264o728L462j8897l845J7204L78j266J0053J4132k286j628M197
21048B2939j402o608J1851J5912k232j090j7563k1763k2926K1834L119m07j920
21035b56K449O247j5157N238Q717J056J2924J2654L112n558j7629O147l57r659
21021I928j3639K0526K2203n478j4692k351j0662k2821n144R276M631N295L1448
21008B8520J764k2819p048P277J2777J0199O396q230j2467J261O798R091k5n02
20994C2992n098R099l591j5358r35p201j8494J5908o926J4253K6734L050j3426
20981C1007N172k1558p730K2192r686o519L099J1046M834M099l431j7238q328
20968F959o41N336N440R636J1730j739k336J1997p353j0824L988j489j1237j3938
$$ y = [18427, 8163, 1435, 4897, -14000, -17845, -641, -263, -1529, 8524, 22656, 20370, 18742, 22939, 21537, 14929, 26780, 42692, 40460, 39370, 21807, 44, -22882, -1048, 2071, 1664, -256, 2193, 8440, -6717, -1479, 7238, 8294, 21218, 33872, 36984, 31426, 13797, 19944, 19587, 9928, -3711, 16815, 39018, 33540, 18848, 16497, 5835, -16986, -22130, -12854, -8223, -2928, 28520, 30284, 7465, 417, 7694, 20471, 30670, 37066, 28836, 16369, 17630, 24428, 33519, 33494, 32992, 27894, 36993, 33402, 18044, 17109, 9908, -8586, 7322, 396, 14649, 41383, 44433, 31007, 36179, 14621, 6891, 29083, 19397, 12878, 15977, 27023, 31857, 35956, 32525, 15287, 6959, 6318, 11654, 17094, 26730, 38460, 36721, 34385, 46382, 39029, 28205, 32193, 30704, 19467, 5529]
20954E529n833M960L8348J0433p409j7655n590J583K0850n955n27N733k00k1689
20940B2578K82m768k927P555o681l601m191J354K340j1888j067r292Q465J3137
20926A1296J4529q525j5556J596r39p150K909L185J1271M086P377R483O498M913
20912D4973m212l480m992p00l220j3154K2606m002r763J284k265j23J3499O38
20898C7089j2300k518J7008J0900k1334j389j4579j1938o413K729K5231J0095
20886C2581j606Q588J6028j3870K648j8422k3841K0508J2053l76m447o782l8518
20873a5456K674R502k4283R525J0593J3853L563j1588q671P714K4772N799j095
20860B6902q110q690L896m948j1859J5871J6066p684j3441k627P720Q617j5712
$$ y = [5529, -304, 4656, 43004, 53437, 46028, 28373, 22783, 24366, 45216, 39261, 38734, 44467, 44267, 22578, 22860, 18092, 15165, 22720, 16039, 12438, 8247, 9601, 11941, 53, -1014, -10306, -1841, 11296, 25825, 17300, 1744, 3340, 2401, -4749, -1840, 1345, 12616, 16702, 24079, 33562, 40060, 44973, 40761, 37281, 32289, 31589, 28369, 15215, 37821, 33819, 24056, 25340, 23075, 22952, 36451, 37089, 24789, 22271, 39279, 50179, 28845, 27456, 12877, 939, -5474, -2745, 22486, 32581, 30975, 39563, 55591, 41721, 44369, 25947, 2106, 22614, 34667, 34291, 29844, 23062, -15456, -12782, -3280, -27563, -18038, -7445, 6408, 9971, -1617, -10288, -2574, 22198, 27997, 26902, 18792, 10102, 13998, 9050, -2809, 13062, 29128, 21444, 8003, 5376, 13096, 21713, 6001]
20847F001r557L692K1364J3116N859J2637k2530j9432J4482J6639o843j2318R704
20834C2814j1599j6936O264K0326J8751j6739j2134l571M427K791J4639K310K45
20821D1588j421k1174m598K052O621J1698Q302r428j4821J2194J8599j2704O96
20808C7604Q93J0203p943j4296j316r180l723K6124m692j2805R472J350j0802
20795B0889j570Q433l812J76j7646j5251K715K4524r270J734P217K698J9429o694
20781C3572j622K3183o320k335p887k3502R902J9209o15M096N824O128P491p280
20767E9844K243L427j6321l3241j516q394j3025r716J4874J3997M401J2698j2929
20754A6342j848n7N90p885j3220j7756J365K0971J1855j4783l258K0323K9900
$$ y = [6001, -3556, 136, 21500, 34616, 40475, 53112, 30582, 11150, 25632, 42271, 35428, 23110, 32814, 21215, 4279, 10543, 30869, 49620, 32881, 20747, 17176, 21603, 24394, 39033, 41343, 41588, 40167, 18993, 14395, 16447, 23068, 34766, 43068, 33640, 18819, 31013, 49612, 36908, 37604, 38497, 48700, 40757, 26461, 25145, 15965, 12242, 38366, 33674, 20869, 30341, 31691, 20889, 19319, 27752, 23940, 24116, 6470, -8781, -6066, 18458, 9188, 10922, 18139, 20837, 40266, 33572, 31950, 55133, 48813, 46478, 38591, 15089, 24991, 44200, 43585, 47681, 53505, 59633, 67124, 59844, 62087, 65514, 49193, 15952, 14436, 6042, -6983, -16699, -1825, 12172, 16573, 29271, 16342, 14494, 14437, 15027, 7142, -6078, -23834, -22469, -1498, 10357, -4426, -7684, 12639, 42539]
20741D2539j4242j1797M617R386R937J2397J5025J221j6874R967j5835r566P821
20728D4596j4195j0715L444J1188Q050J5503j760o554L240J930J060K696m176
20715E4307j6199j8545J358J3540k315k588P78J3206j4279q213L0398J5565l3809
20702C3204k2391J7424K898P260J0944J5576Q193m838p923j4426j6273p161J1629
20689C4116J4796L0829K4870q402j7269j1738o32J9095o353j6397J4424J6989
20677I4328L447J851R480j6715k3394q410J146j463l779J756N656Q519j2192j1620
20663D8610O21O521J8146k078K086J7653Q582r204M561K6726j0766M522j494J9817
20649A34303J0862O523L127L765J9319k58J0507J5720K0401J1399O0243N9629
$$ y = [42539, 28297, 16500, 21117, 30503, 40440, 52837, 67862, 69083, 52209, 62176, 46341, 36775, 44596, 30401, 19686, 23130, 34318, 42368, 57871, 56111, 49557, 52797, 54727, 55787, 58483, 54307, 38108, 19563, 20921, 34461, 32146, 29558, 30336, 43542, 29263, 21050, 51448, 67013, 33204, 10813, 28237, 31135, 38395, 49339, 64915, 73108, 68270, 60347, 45921, 29648, 22487, 34116, 48912, 79741, 104611, 96209, 78940, 67202, 66570, 85665, 79312, 62915, 77339, 94328, 97775, 99626, 109106, 92391, 68997, 60587, 61733, 60270, 56491, 58247, 63903, 72422, 60230, 48610, 49231, 55752, 73898, 71820, 73906, 91559, 100141, 90937, 95498, 122224, 111458, 115980, 114486, 134303, 145165, 151688, 154815, 158580, 177899, 177641, 188148, 203868, 224269, 235668, 295911, 355540]
20637C55540R1152J53597K37803L58109M45367L74679M9788l05827l96071l16579
20627A047558k00405r5080k1339Q3289K09355L14582M19772L23781l8294l64677
20617A678542m35085l32815k44043k00358j17426m7964m4573l2053j3594j4831
20607A95800k9021l1978j1363n017n853R455j970j8789j0538K167J4210r970j6434
20594H0699n852l920J0162O144j0556n319K524j1709J3508J3089P71m310k3232
20581F1999k1120j5872J3158L0484R028j0836m840k795M176K963J9619K1892j317
20568A06539j1200j3405J2983J683m623K4594L000j383o546K282M0Q868j7569
20555A05263j3044j7435n728O961J2583k893l629J2271j2000n696k9525j3317
$$ y = [355540, 446692, 600289, 838092, 1196201, 1641568, 2016247, 2066035, 1760208, 1364137, 1047558, 847153, 752073, 730734, 814023, 1023378, 1337960, 1757732, 2081513, 2043219, 1678542, 1243457, 910642, 666599, 466241, 348815, 300851, 256278, 224225, 210631, 195800, 166779, 134801, 123438, 118421, 112568, 122023, 120053, 101264, 90726, 92893, 107103, 97133, 80699, 74847, 70927, 81089, 87233, 76677, 71358, 73882, 62173, 75681, 88770, 89541, 85231, 61999, 40879, 25007, 38165, 68649, 77677, 66841, 62001, 59206, 63382, 66345, 85964, 107856, 106539, 95339, 81934, 94917, 96600, 91977, 116571, 119571, 118188, 111642, 113924, 113964, 122832, 105263, 92219, 74784, 69056, 76017, 88600, 85707, 82078, 94349, 82349, 76653, 47128, 33811]
20543C3811L357K0428K1955n376j5070m351J2834J6646R111r994k3939k831j2925
20530D3656j2490j1090K1937M358j955J3519K0317m756n884P498J6740J8382J0664
20517A20896P832m572j8034M37k3563j5230J978J39K5050J9051J3219J4511k3129
20504A18585l9029J4352l407k0876K736J0292n492l962p526M021j4809N602j2154
20491D8333p820J8780K1353L773q576j8573k0480M514K566L617P241J2119J1159
20478G8006J5630Q260k416m923j761j5175j3038O391j3186j2946R353P326o023
20465E5498J2554K0719j1917j9196n051J0133m92J1695K2650R738P446j6124n241
20452I2412q678L194J4951r076k4186j7900J0463M158O13M532Q544J425k044N329
$$ y = [33811, 37168, 57596, 79551, 74175, 59105, 54754, 67588, 84234, 93345, 83351, 59412, 56581, 43656, 31166, 20076, 42013, 46371, 44416, 57935, 78252, 73496, 67612, 75110, 91850, 110232, 120896, 128728, 124156, 106122, 106559, 82996, 67766, 69744, 69883, 94933, 113984, 127203, 141714, 118585, 79556, 93908, 90501, 69625, 72361, 82653, 77161, 73199, 65673, 69694, 54885, 60487, 48333, 40513, 59293, 80646, 84419, 75843, 57270, 36790, 41304, 43870, 47487, 54728, 66847, 78006, 93636, 101896, 99480, 94557, 92796, 77621, 64583, 70974, 57788, 44842, 54195, 61521, 55498, 68052, 88771, 76854, 57658, 52607, 62740, 62248, 73943, 96593, 106331, 113777, 97653, 92412, 83734, 86928, 101879, 92803, 68617, 50717, 61180, 65338, 65951, 70483, 79027, 80452, 78408, 83737]
20438H3737j2005m649Q932M895n811Q242J1340j6692k0564J7755L43j8484R262
20425F6301N041m909J9878J0149J234q885k894Q761j0260p048m10K849O65n981
20411G4491L779L424q66r005m916J5019k0j5900j569k277R233J6530K7792L695
20397A19410j2109j0444O108m6J892j4479o941j0429J4351K0030J1026n17k0435
20384I7417k6268k1762p918k189K3728K3135J4284J1916Q325l4170k5808j6597
20372D4093K1941J6831P640J886k0186J1970K5277L816l14j4840j0726M026m024
20359H7390q001q216N164O411o102J4693J3276N259K0496J0914K132l3624l5316
20346G4476j3251J0495o121O907K949K241K351R004J2681J0256Q679j5634j9766
$$ y = [83737, 71732, 67083, 76015, 80910, 75099, 83341, 94681, 77989, 57425, 75180, 75523, 57039, 66301, 71342, 66433, 86311, 96460, 97694, 88809, 85915, 94676, 84416, 77368, 76958, 79807, 80472, 74491, 78270, 81694, 80828, 71823, 66907, 81926, 81906, 66006, 64437, 62160, 71393, 87923, 115715, 119410, 107301, 96857, 102965, 102919, 104811, 90332, 83391, 72962, 87313, 107343, 118369, 117852, 97417, 71149, 49387, 41469, 39280, 63008, 86143, 100427, 112343, 120668, 86498, 60690, 44093, 66034, 82865, 90505, 92391, 72205, 84175, 109452, 113268, 112954, 98114, 87388, 91414, 87390, 79389, 71173, 76337, 82748, 76646, 91339, 104615, 109874, 130370, 141284, 143416, 109792, 74476, 61225, 71720, 65599, 72506, 75455, 77696, 80047, 89051, 101732, 111988, 120667, 105033, 85267]
20333H5267j5101J0712J7585O276j6504k7806k470K9906M6421L7045p415j5326
20321A48590j6239o517m625R150j2290j8923J5089K3085K2325M330j1223J5240
20309A67992J0793M6670Q5610J14553J4895r4341p2755m4784j6092j7274j0979
20298A84288L954O1066J00489J17865K7422q6071j08734p1607l7051k0160m324
20287A67137K5000L0558L573O224L2783N9049N3765J6452j9487l4156m9945l5536
20275B55417k0434J543Q011J9623L7511K8638L1206R412j6007j0595k2134j8053
20263C04138k6167k8292j2697k8088j3805o728q371j945Q380J2009K786N107j0284
20250A96043K9598O858o453K269N240J046Q158R733k123J1963J3187J5950n800
$$ y = [85267, 70166, 80878, 98463, 104739, 88235, 60429, 57959, 87865, 134286, 171331, 163916, 148590, 132351, 125834, 121209, 130359, 118069, 99146, 114235, 137320, 159645, 163975, 152752, 167992, 178785, 225455, 311065, 425618, 440513, 346172, 273417, 228633, 212541, 195267, 184288, 188242, 249308, 349797, 467662, 495084, 409013, 300279, 228672, 191621, 171461, 167137, 192137, 222695, 226268, 232492, 265275, 324324, 378089, 394541, 375054, 340898, 290953, 255417, 234983, 236526, 244537, 264160, 301671, 330309, 361515, 370927, 354920, 344325, 322191, 304138, 277971, 249679, 236982, 208894, 195089, 188361, 179990, 178045, 186425, 198434, 201220, 206327, 196043, 225641, 232499, 226046, 228315, 233555, 234601, 242759, 252492, 250369, 262332, 275519, 291469, 285669]
20237B85669M446m450k4493j872J5216J0523J0745j2439j4898l2472l9920k2609
20225A73446m149k1561j7006k5039P145L395J4060J7561k1484l3370j8959q037
20213F6002J7545J508q807r391j7040J0321K7335n947j693J1935J8782Q058J8963
20200A37571l245k569Q692J5034K4504J97m343N533P465j1047K811J4282o823
20187A88062o30j688J2805L2818J5880q374O115L8589M2301M5420J264p628l660
20174C61274l0577j5115m398P705L516J8290M9546N0952L8858M205k6909n193
20162D52154L20L049O553m294j2563N856N1987J06467J52867P6611n393n2307
20150G81307o7887n2954m0287n4733n0806K5369Q7465J26148J48279Q6164M906
$$ y = [285669, 290115, 285665, 261172, 259300, 274516, 285039, 295784, 283345, 268447, 235975, 196055, 173446, 169297, 147736, 130730, 105691, 112836, 116231, 130291, 147852, 126368, 92998, 74039, 66002, 83547, 85055, 76248, 66857, 49817, 60138, 87473, 81526, 79833, 91768, 110550, 118608, 137571, 134326, 131757, 140449, 155483, 179987, 180184, 175841, 181374, 188839, 177792, 180603, 194885, 188062, 187432, 185744, 198549, 231367, 247247, 238873, 244988, 283577, 325878, 371298, 372562, 364934, 361274, 330697, 315582, 311184, 318889, 322405, 340695, 390241, 441193, 480051, 484256, 457347, 452154, 452474, 455523, 462076, 457782, 445219, 451075, 503062, 609529, 762396, 839007, 833614, 781307, 713420, 660466, 620179, 565446, 514640, 540009, 627474, 753622, 901901, 988065, 992971]
20139I92971p1866r0138l8639j8987l7866j6231J1343M376j2142N748N032n919
20127G27682j4179l220J4182m170J0916J6616J5159K1690Q832J3162O484q271
20115H04883k855J23J481J0994J6359L655K9127J8684L7166L8693N5639K5922
20103A039871K1154O899R883J735J1857M442M5818M0895P6878R7743Q6054J04232
20091A547461J07858J05615J82065L21784N46505R64831J505416J492838Q3342
20082F857715j183671j185116p92359m16891j02451Q8010K49271N48941J076326
20073E139775J658157J437704n1925j125945j286591j037532o04140k68745p3381
20064C787377j9313M9231J62267L01841N21660P95697P86043L95407N856k01965
$$ y = [992971, 921105, 830967, 792328, 773341, 735475, 719244, 730587, 734963, 722821, 728569, 733601, 727682, 713503, 710283, 724465, 720295, 731211, 747827, 762986, 784676, 793508, 806670, 813154, 804883, 802028, 802151, 803632, 814626, 830985, 834640, 863767, 882451, 919617, 958310, 1013949, 1039871, 1061025, 1067924, 1077807, 1079542, 1091399, 1095841, 1141659, 1182554, 1259432, 1357175, 1443229, 1547461, 1655319, 1760934, 1942999, 2264783, 2811288, 3776119, 5281535, 6774373, 6857715, 5674044, 4488928, 3696569, 3279678, 3177227, 3265237, 3514508, 4063449, 5139775, 6797932, 8235636, 8183711, 7057766, 5771175, 4733643, 4129503, 3860758, 3787377, 3768064, 3817295, 3979562, 4281403, 4803063, 5598760, 6384803, 6780210, 6786066, 6584101]
20054F584101j80476k1471J87780L63762N20422O37067P84707R82252J218262
20045A1076406J329580J282069J305132J446476J489207J630952K137080K936772
20037B4633674M026132N461940P579248J0915032J6344125K5461956M0573579
20030A34995686O2552151Q3792706P7128878J7779129n0643792p3655090o2468120
20023A89481548m1572668k1299872m001390J3032885L3736352N9457246Q0231736
20016C09065837O5087107j700727o4628789p9832614o6965769m7801224l1542111
20009H1681710k0620681j3816042r571995o780245m805656l418754k459352j859156
20001A8349829j701172j604588j304828j027991j036583j245724j296252j136193
$$ y = [6584101, 6403625, 6382154, 6569934, 6933696, 7454118, 8091185, 8875892, 9858144, 11076406, 12405986, 13688055, 14993187, 16439663, 17928870, 19559822, 21696902, 24633674, 28659806, 34121746, 41700994, 52616026, 68960151, 94422107, 134995686, 197547837, 281340543, 358469421, 376248550, 325604758, 251949668, 189481548, 147908880, 126609008, 122607618, 135640503, 169376855, 228834101, 309065837, 374152944, 372452217, 307823428, 227990814, 161025045, 113223821, 81681710, 61061029, 47244987, 37672992, 30892747, 26087091, 22668337, 20208985, 18349829, 16648657, 15044069, 13739241, 12711250, 11674667, 10428943, 9132691, 7996498]
19993G996498q96694o38939m57560l20602j70799K2989J62644J85757q622l28178
19983E546494m12771k61057l01952n42931n46610m36481l38706k49483j83768
19974B272735j35841p1800l417J29325K46011P1074k49354k43178j33890j28771
19964A752894j53999j34332j09592q6646o4050m0072l2468j3928K317O270K8536
19953A154930j1566o1042n7015l3977j4187j2540l3683n6437l8085j8440k7330
19942G90628j8119k2959k1518J1128K338K0588K5380L2521M0241N1321L9711K5893
19930I77153N6207O2087P3964J26573K55184L91448O43247J128979K058820L465088
19920I238750M414457K010900k344501l716340k910010j836209q95934k17791
$$ y = [7996498, 7099804, 6460865, 6003305, 5682703, 5511904, 5534893, 5697537, 5883294, 5874672, 5546494, 5133723, 4872666, 4570714, 4027783, 3481173, 3044692, 2705986, 2456503, 2272735, 2136894, 2065094, 2061677, 2191002, 2437013, 2508087, 2258733, 2015555, 1881665, 1752894, 1598895, 1464563, 1354971, 1268325, 1204275, 1164203, 1131735, 1117807, 1120124, 1126394, 1154930, 1143364, 1082322, 1025307, 991330, 977143, 964603, 930920, 874483, 836398, 817958, 790628, 772509, 749550, 728032, 739160, 741498, 762086, 787466, 819987, 860228, 911549, 951260, 977153, 1033360, 1095447, 1169411, 1295984, 1551168, 1942616, 2585863, 3714842, 5773662, 9238750, 13653207, 15664107, 13319606, 9603266, 6693256, 4857047, 3961113, 3743322]
19912C743322M15342J277079K591953M054815L462890p93908l835978l551294
19904G364221k506019j550282r12709n52170l16323k02376j85983j64918j25013
19895H48428r2732n7879n0553L935J7161k1699l915J831j1096o6535p0922n0625
19883D45399l7126k6389l4745j6317r865j9683j4065N258M2191M9702Q3253J08176
19871E75789J40136N4792p6275j38717j00856q5780m4245K4614N8765Q8767J09371
19860F06361J33631J36131j1074j52183j50017j08149n9502m4894l2410j8689
19850B99205l951K6227K0243r443j105p595j5844j4200j6446n068o061R525Q867
19837B84354K0247K3606M860J0132p439j8269m018o666k578P888j0367k8082j4520
$$ y = [3743322, 4158664, 5435743, 8027696, 12082511, 15545401, 14751493, 10915515, 7364221, 4858202, 3307920, 2395211, 1843041, 1526718, 1324342, 1138359, 973441, 848428, 755696, 697817, 647264, 651199, 668360, 646661, 642746, 644577, 633481, 566946, 496024, 445399, 408273, 381884, 347139, 330822, 320957, 301274, 287209, 292467, 334658, 384360, 467613, 575789, 715925, 770717, 694442, 555725, 454869, 369089, 324844, 349458, 408223, 496990, 606361, 739992, 876123, 865049, 712866, 562849, 454700, 395198, 350304, 317894, 299205, 295254, 321481, 341724, 332281, 331176, 323581, 307737, 293537, 277091, 272023, 265962, 275487, 284354, 304601, 328207, 333067, 343199, 335760, 317491, 313473, 306807, 304229, 312117, 301750, 273668, 259148]
19824B59148p382J480l2923m3616m2280k5156m913j6976l432p513j3627o587l3526
19811B2697l2140l0060j3382L343m939J115J2253k114J0787J943p394p758q96
19798d6545Q867P498N746L3884K0885j0117J0662R008P673K813L832K3163L1081
19785A08450J1372N0689J33764J21077M0564n4679q3287q7222n7400l7329R97
19774A46996K9821M8981Q0660J16826R1717k6969j12099j23827p9594l2491l0820
19763A09201j5588j2793n054j0217r633N491m384j4063k7449j2574K289L153J2431
19750B0810j5053j7847J8184J7999J7835j2490r959O310j6198q161J1709o192
19738F947j7938J1808J0348P000k0123k0125L657J5347p242K4167J6629k5622
$$ y = [259148, 251766, 253246, 220323, 176707, 134427, 109271, 104358, 87382, 83950, 76437, 62810, 56223, 22697, -9443, -39503, -52885, -49542, -54481, -53366, -41113, -43227, -32440, -30497, -37891, -45649, -46545, -37678, -30180, -24434, 9450, 30335, 20218, 30880, 39888, 47561, 50374, 54206, 77369, 108450, 119822, 170511, 304275, 425352, 465916, 411237, 327950, 240728, 183328, 145999, 146996, 176817, 225798, 306458, 423284, 515001, 488032, 375933, 252106, 172512, 140021, 109201, 93613, 80820, 75766, 65549, 55916, 61407, 57023, 42960, 15511, 2937, 5226, 8379, 20810, 5757, -12090, 6094, 24093, 41928, 29438, 19479, 25789, 9591, 1430, 13139, 6947, -10991, 817, 11165, 18165, -1958, -22083, -18426, -3079, -10321, 13846, 30475, 4853]
19726D853j4676P33q817P363P314j1329Q994K760p394J0397L9863P417j2631j3275
19712B1572j5157j3207O291O673j5809p73O355m938j072L522J0977m643R917K1172
19698C0880Q317M015k2443j7168j3460j1104n696M281N752p580J0948K6056K673
19685A5471l7419J3410O15O530p331j478J8179p991M991J1548j9431j2903J0166
19672e643j6511j7014k033l819J2516L176N982K351R22j2245r397l0J8499Q632
19658a4614j3497j2662J57J2821J4710r490k5111r064J119L419L6462M728k74
19645a1296r723m419P529P569m941j0863j2378j808P122R347o492M273J2663J0279
19631c138p611k2127q504J4504N125M907j4286j1494q046n824J1818M675o719
$$ y = [4853, -9823, -9090, -17907, -10544, -3230, -14559, -5565, -2805, -10199, 198, 40061, 47478, 34847, 21572, 6415, -6792, -501, 6172, -9637, -10410, -4055, -8993, -10065, -6543, 4434, -209, 9708, 30880, 39197, 43212, 20769, 3601, -9859, -20963, -26659, -22378, -16626, -24206, -13258, 12798, 15471, -21948, -8538, -7923, -1393, -8724, -10202, 7977, -14, 4977, 16525, -2906, -15809, -5643, -22154, -39168, -41201, -45020, -32504, -29328, -23346, -20995, -20073, -32318, -41715, -41745, -23246, -14614, -28111, -40773, -40616, -27795, -13085, -22575, -47686, -56750, -55631, -52212, -15750, -11022, -11296, -21019, -25438, -17909, -10340, -15281, -26144, -38522, -40330, -33208, -23861, -30353, -26080, -13417, -3138, -10749, -32876, -41380, -26876, -21751, -16844, -31130, -42624, -50670, -56494, -44676, -40001, -46720]
19618d6720l742K5097K4273j3949n209q300J4153j6864M400L108J6272j5244k2871
19605d5596r508K1794J3392N237N650q703j8994J199P051J0117K788k606K124
19592a6055q31O983R300R20O478R678j1085k1853n101K0383k784k0771J4439J3492
19578C193j5712j5815M102J1012j6175n723P647O851k2803j2304j140J3057L554
19565d0256J8841O193R007l887j9383k4188Q975J2895k15j3092K738J8414J8838
19552e120Q991K324j4722J5930K6589P606l3501k9440P698O617J0014Q33M451
19539H270r819Q613M979K348j710m620k0906j3127o970J1711n140j719J4310O003
19525g777o553K2101N167k0535j4889P696J1603J9279J2686r224l302J0502n862
$$ y = [-46720, -50462, -25365, -1092, -15041, -20250, -28550, -14397, -31261, -26861, -23753, -7481, -22725, -45596, -55104, -33310, -19918, -14681, -9031, -17734, -36728, -35529, -28478, -18361, -15573, -18179, -16055, -16886, -9903, -603, 317, 6795, 16473, 5388, -16465, -21566, -1183, -3967, -24738, -10299, 3193, -12519, -28334, -24232, -13220, -29395, -35118, -27471, -20620, -43423, -55727, -56867, -43810, -40256, -21415, -15222, -6215, -10102, -29485, -53673, -44698, -31803, -32018, -45110, -42372, -23958, -5120, 3871, 6195, -8527, 7403, 33992, 41598, 8097, -21343, -13645, -7028, 2986, 3819, 8270, -1549, 7064, 12043, 14391, 12681, 8061, -12845, -25972, -32942, -21231, -26371, -28090, -13780, -7777, -14330, 7771, 12938, -7597, -22486, -14790, -3187, 16092, 28778, 19554, 16252, 26754, 20892]
19512B0892J332J0561n71N122m413K389O902L102p723Q254K5431K4884L0700J1323
19498A38185j0970J3462L2290L7227J6352K9484N6557N4033O3455O0166J01273
19487E91514J22076J12221J36441J49475J42404J18974J13239J09730R7623L0517
19477A724214O62j9591n4382q8333r1414j06632j40058j38603j17910j12830j19382
19466G35741j18718r5092p2865n8555m9813k8117r605j2203m1494m4734l3483
19455A71062j4234j5506p857l0358l047n170j2136k0665l780J1897J8638J7657
19443A06501n904k7455j7506j659k818N497J0242J6957M945j1371k7244p938J1777
19430E4024J4056O707L768J6655k128K8233M1339J6697J0968O3881J24161J37495
$$ y = [20892, 22224, 32785, 32214, 37336, 32923, 35312, 42214, 45316, 37593, 45847, 71278, 96162, 126862, 138185, 127215, 140677, 172967, 210194, 226546, 256030, 312587, 366620, 430075, 490241, 591514, 713590, 825811, 962252, 1111727, 1254131, 1373105, 1486344, 1596074, 1693697, 1724214, 1724876, 1705285, 1650903, 1562570, 1471156, 1364524, 1224466, 1085863, 967953, 855123, 735741, 617023, 521931, 449066, 390511, 340698, 312581, 302976, 290773, 249279, 204545, 171062, 156828, 141322, 133465, 103107, 100060, 94890, 82754, 62089, 58309, 70206, 88844, 106501, 100597, 73142, 55636, 53977, 51159, 56656, 66898, 83855, 88800, 77429, 50185, 42247, 54024, 68080, 74787, 78555, 95210, 93082, 121315, 162654, 179351, 190319, 254200, 378361, 515856]
19418E15856J95553L35724M39944M13636J22027k45236l92954l26450k10286j16201
19408G31613l7904M9604J64874L06248M33159L49329k646l31247m18030l59570
19398H85430k73211j87470j19863p3744n1948k6152k0212l1229j992j3022l0675
19387E5912q053k0913j6770j6564J9747o19j3195L872j5319k4594Q311J4332J4283
19374D30n121M606J205m772K696j2012J9701K038j2221m741O816j476J4109N924
19360A7182k4744j0433j718K4247j4111j9099O078R643o197L329M135p997k2757
19347d2442p845O674j5089J632L518k909K7756J7771L62M295m464M089k3107o982
19333c6741J5096J3134K415l384J7216l4133k2535M788J7659Q47R915P082O429
$$ y = [515856, 711409, 1047133, 1487077, 1900713, 2022740, 1777504, 1384550, 1058100, 847814, 731613, 693709, 743313, 908187, 1214435, 1647594, 1996923, 1994277, 1663030, 1245000, 885430, 612219, 424749, 304886, 231142, 179194, 153042, 132830, 101601, 99609, 86587, 55912, 47859, 26946, 10176, -6388, 13359, 12740, -455, 3417, -11902, -36496, -28185, -13853, 430, -4691, -85, 1120, -3652, -956, -12968, 6733, 8771, -3450, -8191, -1375, -2851, 11258, 17182, -7562, -17995, -19713, 4534, -9577, -28676, -22598, -12955, -19152, -15823, -11688, -19685, -42442, -50287, -43613, -58702, -57070, -53552, -56461, -28705, -10934, -10572, -6277, -10741, -6652, -29759, -36741, -21645, -8511, -6096, -9480, 7736, -26397, -48932, -44144, -26485, -25638, -15723, -8641, -2212]
19320b212K985O145l733k0122J2351M3686K1304q007L068j269j5738M032j5072
19307B7418j1724o837J928L7070K5410R579o039k5554k2723j8532j5164j891k1594
19294b8653o702J0738Q552m866k0878n18J2598J7354K7785o108j0295j7373k961
19281b1327P568q604m551j1890K159k801J942J3188N275k033O301l08j6085j0352
19267d1518o999j588K0853J5019k163J4409J031j3431j4495J2221J6398o79j6315
19254a7257o08P676j1822n280K968q808o432q371N521k153J1406p98q778l347
19240d6083J2847K2635O51k0999p760N573p86P424j3405R860K2330j0565j8906
19227c7184K3453k844j0480R433j3165J3652N923j6376j3933p913J8674J2488
$$ y = [-2212, 773, 6918, 3185, -16937, -4586, 39100, 60404, 52397, 55465, 54196, 38458, 42490, 27418, 15694, 8857, 10785, 47855, 73265, 82844, 76805, 51251, 28528, 9996, -5168, -7059, -28653, -35355, -24617, -16065, -20931, -41809, -42327, -29729, -12375, 15410, 9302, -993, -18366, -21327, -13759, -22363, -26914, -38804, -36645, -39446, -37504, -24316, -19041, -21074, -14773, -15081, -31166, -41518, -48517, -50105, -29252, -14233, -16396, -1987, -956, -14387, -28882, -16661, -263, -942, -17257, -17865, -10189, -22011, -27291, -24323, -33131, -39563, -47934, -42413, -44566, -33160, -33958, -42736, -46083, -33236, -10601, -9950, -30949, -38709, -33136, -33922, -26498, -39903, -30043, -7713, -18278, -37184, -13731, -16575, -27055, -17622, -30787, -17135, -11212, -27588, -41521, -49434, -30760, -18272]
19215a8272J3484N265L845k5462j2979l546Q08J6730O734k757Q806J607m560N292
19201e005o794O460K5541r576k7176p346j2248R2M632m387o527o047O50K588J6929
19186b8214P474M26L261k3823n528J0370J1329j3779q503p617l340j5650j5116
19173h8710N043J7916K2498K4101K037o197r115m498r525J3306P271L541J5716
19160f616J273q63q695J617J2773K569j7663r044k261j260j518R751k74j4730
19146c4941k3260M806J5278J7147J4972J2629j5038N863J3275j7190o198N238
19134g419p895k3518m322J9887k34K459L476j762l79L095j37K393L191J3367J4
19119B216m464p948J220l322J2500Q173L995j0424J1765j4947j6644r874o950
$$ y = [-18272, -4788, 477, 4322, -21140, -34119, -37665, -36857, -20127, -13393, -16150, -7344, -5737, -10297, -5005, -11799, -5339, 20202, 10626, -16550, -23896, -36144, -36052, -31420, -35807, -42334, -48381, -47731, -45143, -28214, -20740, -20314, -17053, -40876, -46404, -36034, -24705, -38484, -46987, -54604, -57944, -73594, -88710, -83667, -65751, -43253, -19152, -17115, -23312, -32427, -36925, -46450, -33144, -25873, -22332, -6616, -5343, -6206, -14901, -13284, -511, 2058, -15605, -24649, -26910, -28170, -29688, -19937, -20211, -34941, -58201, -53395, -38117, -20970, -5998, 6631, -8407, -2544, 10731, -6459, -12657, -7419, -15314, -38832, -43154, -23267, -23501, -21042, -17566, -19328, -19707, -16612, -16749, -14356, -11165, 2202, 2216, -2248, -10196, -8976, -12298, 202, 8375, 12370, 1946, 13711, -1236, -17880, -27754, -34704]
19106c4704O99J3410J4441K3710j146l2359n719R205L561j0491L972O739j0265
19093a8947m673m108m362J0944J991k1543J3184L634P93j3249J363p609p877L526
19079d6933Q430n722L988J1220K2337p784K563J7464R356k505j6533j5184J3164
19066f139J0733j9766r51J3609j4752k1921q041k645O657O384j6091J489L3395
19053a8039R359k737O022R629L271j1370m05Q072j3580j1585k5528j3196L48p871
19039f7610J3055o25R753J3992K0547L396O06q792P305R375J6796J0870n097j6887
19025F684j3224j8146j3308j1892K542L731J1219J0115L180M652K732j0831K296
19012b0250N466q028j0579m359K2919K894j3228m144P726J4997p628o424M611
$$ y = [-34704, -34005, -20595, -6154, 17556, 16410, -15949, -21668, -12463, -8902, -19393, -15421, -8682, -18947, -23620, -27728, -32090, -21146, -19155, -40698, -27514, -23880, -23087, -36336, -34973, -42582, -50459, -46933, -38503, -44225, -40237, -29017, -6680, -14464, -11901, 5563, 14919, 12414, -4119, -19303, -6139, 4594, -15172, -16123, -2514, -17266, -39187, -47228, -49873, -43216, -36832, -52923, -51434, -18039, -8680, -11417, -5395, 4234, 7505, -3865, -4270, 3802, -9778, -21363, -46891, -60087, -59739, -67610, -54555, -55180, -45427, -31435, -10888, -7492, -6886, -15678, -8373, 1002, 17798, 28668, 23571, 6684, -6540, -24686, -37994, -49886, -47344, -43613, -32394, -22279, -19099, -14447, -11715, -22546, -20250, -14784, -22812, -33391, -37750, -14831, -11937, -25165, -29309, -21583, -6586, -14214, -20638, -16027]
18999a6027m495J4742Q322N472l437k8908j11J1872N307m223k4594N60L375O941
18985b5204J2707q230j363l579J4770o743j4843l256L977o633j0592J7210k69
18972c2048M574j0669P836J5457o082r992r3J2276n233j0104J2565j741l631j447
18958b8332j701R52j1296l205J3539J1290O413P076k335j0026n622P044M474k3231
18944c4960M415N94o849n11k083L389Q053p224K4154J197q119J8456J034k3028
18930b1482j9533M915J3600j236L044k228q29J8117J1746r077n720j6279m353
18917b9315J1019k253L434P502M155j5534j8178o748N485Q321k311J4352N126
18904a4945j2072N845J1319j22j789j455m669q709K052K1363J943p628k6184k5815
$$ y = [-16027, -20522, -5780, 2542, 8014, 4577, -24331, -24442, -12570, -7263, -11486, -36080, -35520, -32145, -25204, -12497, -20727, -22090, -25669, -10899, -17642, -32485, -35741, -31764, -38397, -48989, -31779, -32048, -27474, -38143, -30307, -14850, -20932, -30924, -31017, -18741, -23974, -34078, -21513, -23254, -26885, -28332, -30033, -29081, -40377, -43582, -30043, -18753, -12340, -5264, -7599, -17625, -23247, -16203, -11729, -34960, -30545, -29951, -36800, -37311, -39394, -36005, -27952, -35176, -11022, -9825, -17944, 512, 1546, -21482, -41015, -36100, -22500, -23736, -20692, -22920, -23749, -5632, 6114, -2963, -8683, -24962, -29315, -18296, -20549, -17115, -9613, -5458, -20992, -39170, -45918, -40433, -32112, -34423, -20071, -14945, -27017, -21172, -9853, -9975, -11764, -13219, -17888, -26597, -24545, -3182, -1239, -8867, -35051, -60866]
18890f0866P41J51J5976l242p453R715J6736J2099J423J9579J5846l205N270l181
18876A9589j0144N182J8292m490l0464j6471K932J6804o798O19j0478k608M304
18863a3731N658o130k542j820J3334M920j622J267j9319j5501j1683J4176J642
18850c1351o319J8969J40R632J1698N868j7580N297m707k3817l350R051J0332
18837a6137n493M34J556J1675R563j0893k479J0031Q478j0954J2487J666k3510
18824a3576j1280M326J7363P219J2149L595Q438N55J667J517k8341j2041k506
18811a0915r939j5744O766p586J243o46O233N080J947J703n316O677j3978j9460
18797e3935j449J1256K7698Q20k5460J969J3962o004j0474n040J5245J7886J6642
$$ y = [-60866, -60125, -59974, -43998, -47240, -54693, -44978, -28242, -16143, -14720, 4859, 20705, 17500, 22770, 19589, 9445, 14627, 32919, 28429, -2035, -18506, -15574, 1230, -5568, -4949, -15427, -18035, -13731, -8073, -14203, -16745, -18565, -5231, -311, -1933, -666, -19985, -35486, -47169, -32993, -31351, -37670, -18701, -18561, -8929, 2769, 8637, -8943, -3646, -8353, -32170, -35520, -26469, -16137, -21630, -21196, -19640, -7965, 1598, -9295, -11774, -1743, 6735, -4219, 8268, 9934, -13576, -24856, -20530, -3167, 4052, 16201, 19796, 28234, 28789, 30456, 31973, 3632, -8409, -10915, -20854, -36598, -29832, -37418, -36175, -36821, -30588, -25508, -23561, -21858, -27174, -20497, -34475, -53935, -55384, -44128, -16430, -15610, -41070, -39101, -25139, -31143, -41617, -46657, -31412, -13526, 3116]
18784C116J5033r657j9946q043Q647K107M991p590j4990l523O726J4314M998K6032
18770B2215P729K5984M2859P0488O3834k4330q2429n6538l7702l1195j0432j196
18758a0713J7736N089j1460j2360N907M817Q451j5194p44N093j5469L483J5561
18745A97K0367K325j4983Q203K1187K3447K3460O5056J37754J81582R3179r5497
18733D66277j67260j40017o1064k4649k7523k7679k0927n190r41O040K3521J060
18721B1648k2648j5521J993K293k131R684Q281j2840j322o947o551L064J7633
18708c364K835J157O846R40K6578M590k2280o728j4444j2406J014O319J1952j0666
18694g657j7334K0560J6204P859j0396r165J7031J2653j3420j8063O915J5849
$$ y = [3116, 18149, 8492, -11454, -19497, -10850, -8743, -3752, -11342, -26332, -29855, -23129, -8815, -3817, 22215, 29944, 55928, 98787, 169275, 233109, 208779, 126350, 69812, 32110, 915, -9517, -10713, 7023, 12112, 652, -11708, -5801, -984, 7467, -7727, -8471, -3378, -18847, -15364, 197, 20564, 22889, 7906, 16109, 37296, 60743, 84203, 149259, 287013, 468595, 561774, 466277, 299017, 159000, 97936, 73287, 45764, 18085, -2842, -8032, -8973, -2933, 20588, 21648, -1000, -16521, -14528, -12235, -14366, -4682, 3599, -9241, -10563, -17510, -24061, -20997, -3364, -529, 628, 7474, 8414, 34992, 39582, 17302, 10574, -3870, -16276, -15262, -8943, 3009, -7657, -24991, -4431, 11773, 19632, 9236, 71, 17102, 29755, 16335, -1728, 5187, 21036]
18682B1036n198L137q252j7083j5927O578J4175J437j3455J116P019o010m328
18669a5755J1495R815j3321k3110j4928k589N214O459l734J1794J6627N391m879
18656a1521m429l048O887q694K312J0526J4587r359j8679J1523J0154J4292P390
18643B1941j9542j6613n394M072N658J3813P398j0564J3457K2349j184k763j2914
18630A9714m839N519K308J2035K0185J6810k872o280n668J5641K0846J3555J6955
18617A23909N1241P0731J04870J99104L60245O46661R11393M00771n53306p28613
18607A587006n27996l30370j62832o6864N9480J47412L55316O68452Q69904J76949
18597B776457o88299p36782n04392l25852j55665p5297q4796q6867l5566K916
$$ y = [21036, 15838, 18975, 10723, -6360, -22287, -15709, -1534, -97, -13552, -12436, -5417, -11427, -15755, -4260, 5555, -7766, -30876, -45804, -48393, -43179, -36720, -40454, -28660, -12033, -6642, -11521, -15950, -18998, -12111, -20805, -18493, -7967, 6620, -2739, -21418, -9895, 259, 14551, 21941, 2399, -14214, -19608, -15536, -9878, 3935, 11333, 769, 14226, 36575, 35391, 32628, 19714, 14875, 20394, 22702, 34737, 54922, 71732, 68860, 62580, 56912, 72553, 93399, 106954, 123909, 175150, 245881, 350751, 549855, 910100, 1556761, 2468154, 2868925, 2315619, 1587006, 1059010, 728640, 565808, 498944, 558424, 705836, 1061152, 1729604, 2599508, 2776457, 2088158, 1351376, 846984, 521132, 365467, 290170, 205374, 118507, 82941, 85857]
18587H5857K309p870j427L419L632j3708j1277n401k5627j6696o144Q102M162
18574A9331q228j2427J6645K2872m056k9112k7792j2915K4110J4008j7083k0823
18562c5470L795k537J5098p309l526K3431N518j885M41J519J4182J6622j6741
18549A3138j4599L064Q303r34q151K7015Q466k2778q247o397j3502J1582J3126
18536A0086k539j4225k1121L494q012N271N26L4n693R913k213P044K855O501n95
18521h674j647r092J8960p80j4839p683o32l664M320O559K0879N153p452O109
18507G517J3441q1j4575j3242n727q82K6996J8423J110p862n463J3854r642j6062
18493G805k286j6490m604K7279K8919L380j5035j2553j6495j1622j6403q868J1225
$$ y = [85857, 88166, 80296, 78869, 82288, 85920, 72212, 60935, 55534, 29907, 13211, 7067, 15169, 19331, 11103, -1324, 15321, 38193, 34137, 5025, -22767, -35682, -11572, 2436, -14647, -35470, -31675, -34212, -19114, -26423, -29949, -6518, -1000, -2885, -2444, -925, 13257, 29879, 13138, -1461, 1603, 9906, 8972, 821, 27836, 36302, 13524, 5277, -1120, -14622, -3040, 10086, 7547, -6678, -27799, -24305, -32317, -27046, -26520, -26486, -32179, -22266, -24479, -17435, -14580, -8079, -8674, -10321, -19413, -453, -1233, -16072, -23755, -24387, -28051, -23731, -17172, 3707, 8860, 1408, 7517, 20958, 20877, 6302, -6940, -12667, -13549, 13447, 31870, 32980, 25118, 19655, 33509, 23867, 7805, 5519, -10971, -15575, 11704, 40623, 44003, 28968, 16415, -80, -11702, -28105, -36973, -25748]
18480b5748J703l11J3864J764j1885J4831J9945J0921j3017k833p784J0536N65
18467A2551m416J1125J7851J3455j0488k3948l527L99L24P513R16j9891K304j306
18453B862J1121J2039n117k1970q881K276l087n237J6748K6279p195j6135j4590
18440a0887n657J4397J6988r276j3435q60P460j2981j9539l504p34K424J1498
18427b4106J8511p626J6063J7050k196Q436n127L840j005k5383o100J5266J8241
18414B5864o543j5819q312P43K1227M48j1704M06K1248j390l3089q467m656Q058
18400a1986P662L692M899O122j698j5169j4360N740m287o580O831J6732K3q548
18386a0927o294K5686J5106q389p357r77K700r105o349J2322J0392o505j7189
$$ y = [-25748, -24045, -24356, -10492, -8728, -20613, -5782, 14163, 25084, 12067, 9234, 1450, 11986, 12551, 8135, 19260, 37111, 50566, 40078, 16130, 12603, 13002, 13326, 20839, 21755, 1864, 4168, 2862, 13983, 26022, 20905, -1065, -9946, -7670, -10757, -15994, 754, 27033, 19838, 3703, -10887, -16544, -2147, 14841, 5565, -7870, -8730, -1270, -14251, -33790, -37294, -38028, -35604, -24106, -5595, -13221, 2842, 19892, 17696, 26132, 21005, 24845, 23840, -1543, -7643, 7623, 25864, 19321, 3502, -4810, -4067, 17160, 17608, 5904, 6310, 27558, 26168, -6921, -15388, -20044, -11986, -4324, -632, 4267, 10389, 8691, -6478, -20838, -15098, -19385, -25965, -19134, -2402, -2379, -10927, -17221, 8465, 23571, 15182, 7825, 6848, 9548, 443, -5906, 6416, 16808, 10303, -6886]
18373f886k1703M159J7178M570j2105N410J0847j9998k460J6669k053j3927p772
18360b8071J6822O077R55O037j117n384k6557j8699P801J2435p39k975j0914J929
18346d2400K6622M0885J6625K9216J4008j5768r169k4055k0955j6218L963O558
18334I312R881P000N509K3956Q647l453k0516n922J0478J643r804K413k2446O153
18320B2851J886k2504j7626K410M59L518J1879J5323L723p528J2979j7017q766
18307A587J0777j0291J0975J3451j578j0013n310K1581k01j7495o513L677J7613
18294B8260N834O444n786j4658O063O348m193k92Q791K0396O173L3729J9927p970
18280A09066j4989m3223j6952R523J2133J7496J2134K6317M6459M9580N0272O5842
$$ y = [-6886, -28589, -24430, -7252, -2682, -14787, -9377, 1470, -18528, -20988, -4319, -6372, -20299, -28071, -11249, -5172, -4217, 1820, 703, -4681, -31238, -49937, -42136, -29701, -30440, -33415, -44329, -42400, -15778, 25107, 41732, 70948, 84956, 69188, 60019, 35964, 15009, -1209, 2754, 9312, 19193, 26193, 31702, 55658, 64305, 60852, 40336, 34414, 44892, 46535, 36731, 39144, 16698, 22851, 24737, 2233, -15393, -12983, -12524, -9006, 2873, 18196, 21919, 14391, 27370, 10353, 1587, 12364, 2073, 13048, 26499, 24921, 14908, 9598, 31179, 30978, 13483, 6970, 10647, 28260, 34094, 40538, 34752, 20094, 26157, 32505, 28312, 28020, 36811, 57207, 63380, 97109, 117036, 109066, 94077, 50854, 33902, 43425, 55558, 73054, 85188, 111505, 157964, 207544, 257816, 323658]
18268C23658M0530k696m8979n8122l2495M429j6864l1970M528N7427N9276O6589
18256C65311K7893j1268m3548o9541n0413o3090l4321j0280J558k96l2493j310
18244G8202o804j0819j1468J3363J9264J8291J6787L7296M5134J8250K8430O860
18232B52786J0809J2807K5051j2640m9771k6724O349l4276l3866j3524j8353J2677
18220A31325L226l798k3027l0893l3088j6275K1140R094l4180l7387l0353k8560
18208g2776l1105j9987j2989k6752k3748J9711K2138L7238K7161l728j7692k4052
18196a26581j6940R888K6946K2012K0303J5443j0615J5365K3171J795l04L4146
18184A4629K7440P386l1361j7292Q711R197k1609j2295o534n383R615K9586J7327
$$ y = [323658, 364188, 361492, 312513, 254391, 221896, 226325, 209461, 177491, 182019, 239446, 298722, 365311, 393204, 381936, 338388, 268847, 218434, 155344, 121023, 110743, 112301, 112005, 79512, 78202, 71398, 60579, 49111, 62474, 81738, 100029, 116816, 154112, 199246, 217496, 245926, 252786, 263595, 276402, 301453, 288813, 239042, 212318, 218667, 184391, 150525, 137001, 118648, 131325, 134551, 130753, 107726, 76833, 43745, 27470, 48610, 57704, 23524, -13863, -44216, -72776, -103881, -123868, -136857, -163609, -187357, -167646, -145508, -108270, -81109, -84837, -102529, -126581, -143521, -133633, -106687, -84675, -64372, -48929, -59544, -44179, -21008, -19213, -19517, 14629, 42069, 49455, 18094, 802, 9513, 18710, -2899, -15194, -21728, -27111, -17496, 12090, 29417]
18171B9417q040j7760K4800N3289M2985M2808P281k1623j3616l3690k5825O719
18159H6745j746j090K3908M6222L7238K6768J170L096o887k6044j2000K2346j9794
18146A79932m5990l1352O8536J13690K72120J73092o430o0296r7374q9481n4564
18135D21883l6181o0539n9796R3036J71312K97369J83845J2536p5410r0713n2738
18124H04604o116O035J0393N9355J08852J35414J67140K26962K88710M04686O59363
18113B865398J107096J952524L703880O765683J0118886J2733716O003007q746662
18105C6503528j2550335q884676n511282k902333j301958j90381Q50128J503974
18097G516665J57571j658837j706398j135782o99645m48937l38583k71738j91751
$$ y = [29417, 21377, 3617, 28417, 81706, 124691, 167499, 174780, 153157, 139541, 105851, 80026, 86745, 84999, 83909, 107817, 154039, 191277, 218045, 219215, 222311, 215424, 189380, 177380, 199726, 179932, 133942, 102590, 171126, 284816, 556936, 730028, 723598, 663302, 565928, 476447, 421883, 385702, 325163, 265367, 358403, 529715, 827084, 1010929, 1023465, 948055, 857342, 804604, 798488, 804523, 814916, 874271, 983123, 1118537, 1285677, 1512639, 1801349, 2206035, 2865398, 3972494, 5925018, 9628898, 16394581, 26513467, 39247183, 45250190, 36503528, 23953193, 15068517, 9557235, 6654902, 5352944, 5162563, 6012691, 7516665, 7674236, 6015399, 4309001, 3173219, 2473574, 2024637, 1686054, 1414316, 1222565]
18088A222565j87207j35109p6615n391J4051N0272J06053N6841j4250m8187n7094
18077I25929p2865o7678l1280k1854J0207K8152K3549L8623P6941O4972M5170
18066A019866L1120J4369K8323Q4309P9381Q8630J20558J12035J30006J30963
18056A839560L0960q0847j24790o3804M3553J22853J51321J54094Q9991P8405
18046B241296Q7765J06535J91917M28555P69007J071490O74468k64801m04606
18037D901626j18506K7416J60372L88420Q45555J484103J939117J531538J175659
18028A2335300Q62064N28599J004034J960618L010492M438869O958206J1173330
18020D2271512J8474230L3243914O3079985J16051744J69425454Q4409236r3571645
$$ y = [1222565, 1035358, 900249, 823634, 818243, 832294, 882566, 988619, 1045460, 1031210, 983023, 925929, 853064, 785386, 754106, 732252, 742459, 770611, 794160, 832783, 909724, 974696, 1019866, 1050986, 1065355, 1093678, 1177987, 1257368, 1345998, 1466556, 1578591, 1708597, 1839560, 1870520, 1789673, 1664883, 1601079, 1644632, 1767485, 1918806, 2072900, 2162891, 2241296, 2329061, 2435596, 2627513, 3056068, 3825075, 4896565, 5571033, 5306232, 4901626, 4783120, 4810536, 4970908, 5359328, 6204883, 7688986, 9628103, 11159641, 12335300, 13197364, 13725963, 14729997, 16690615, 19701107, 24139976, 31098182, 42271512, 60745742, 93989656, 157069641, 273121385, 442546839, 526956075, 433384430]
18013D33384430j39874451j01325751o2692191l0934272j0254315O182430K7561271
18006A22047151O4181600J21941246J63351436M6397878j18397115j36924841
18000B62597355r7738070o0600789l3463258j9405129j2719550q859476o088009
17993B3723074m051760k751070j939849j268262n23039M8695l06521p14999j246587
17984A0969682j863921j653803j153446p45122l67442p9288K69296O48496N23005
17975F547457m59885j014720q11446n87557m25616k94087j90344j32821j29213
17966B501768j21012j17801j11849j30529q8551l1058j2289k5220j8859M1794
17956A886394J09378R7430N5403L5179O1711N7810M0474P2158J26826O5222m9085
$$ y = [433384430, 293509979, 192184228, 129492037, 98557765, 88303450, 94485880, 122047151, 186228751, 308169997, 471521433, 517919311, 399522196, 262597355, 164859285, 104258496, 70795238, 51390109, 38670559, 29811083, 23723074, 19671314, 16920244, 14980395, 13712133, 13189094, 13237789, 12931268, 12216269, 10969682, 9105761, 7451958, 6298512, 5553390, 5185948, 5106660, 5375956, 6024452, 6547457, 6087572, 5072852, 4261406, 3673849, 3248233, 2954146, 2763802, 2630981, 2501768, 2380756, 2262955, 2151106, 2020577, 1932026, 1900968, 1888679, 1863459, 1844600, 1886394, 1995772, 2093202, 2148605, 2183784, 2245495, 2303305, 2343779, 2415937, 2542763, 2607985, 2558900]
17945B558900m2232K588m9784j33422j51823j39507j06076o4693q9491j11365
17935A673095j03786j06865j20643r6481r6210r8739p7178p4758l7505J0933p899
17924H63964k1451o145J266j0875N802J339l2374j5903P391j8642j8831j0515
17912G45026R089N0101O9014P0923M6731K1064L9621M3711J9009m0958m4176M488
17900A033643N763J3330P058k5159k1072P037R330l1825K5040J15891L72r6865
17888A042543J1082q630q5157j47125j43794j32877r1571l4743L9181J04910l630
17877E50189Q623R8028N0230m5015p8561p0055o4750l5366l0410m3515k5981l1660
17865B81757m1013j3776L2221M7833N3377J9222J356J0079j4923k5945l6723k5154
$$ y = [2558900, 2516668, 2519256, 2469472, 2336050, 2184227, 2044720, 1938644, 1873951, 1784460, 1673095, 1569309, 1462444, 1341801, 1245320, 1149110, 1050371, 973193, 898435, 860930, 871863, 863964, 842513, 836368, 837634, 826759, 832561, 833900, 801526, 785623, 793014, 774372, 755541, 745026, 754115, 804216, 873230, 944153, 990884, 1011948, 1051569, 1095280, 1114289, 1073331, 1029155, 1033643, 1039406, 1052736, 1059794, 1034635, 1013563, 1020600, 1029930, 998105, 1023145, 1139036, 1139408, 1042543, 1053625, 1044995, 959838, 812713, 668919, 536042, 444471, 409728, 448909, 553819, 550189, 558812, 656840, 707070, 662055, 583494, 513439, 448689, 413323, 382913, 339398, 313417, 281757, 240744, 226968, 259189, 307022, 360399, 379621, 380977, 391056, 376133, 350188, 313465, 288311]
17853B88311j0909P354O0087M5261K7069n727m589L2779J2190p513J1538j3730
17841D42121p141j6559q670o906j0624o529j0649J8602R209k5336j3187J4035
17829C78366K4528n399r638j035j142J5054L1441L3190J9856j6218k7220R773
17817D51556J3012K144J8427j4474k9468k2024m955j3494l6515l9487m4639k1285
17805B58798p810J4337r76j6197n0473m5508j3932J381L568o89k4799k8285j8971
17792G0444N814L3602J0339r230p611J829K1535p11J6466N201L262J4246K9850
17779A95036L1278K1289L4020O988J0309K1704m999k256J721J3054M4614N0262
17767D23020L9794L0954Q844K1152P6487O0454P4219J23045J50610K01233L16690
$$ y = [288311, 277402, 284756, 344843, 390104, 417173, 411446, 406857, 439636, 451826, 444313, 455851, 442121, 434980, 418421, 409751, 402845, 392221, 385692, 375043, 393645, 402854, 377518, 364331, 378366, 402894, 397495, 387857, 386822, 385680, 400734, 432175, 465365, 485221, 469003, 441783, 451556, 464568, 466712, 485139, 470665, 441197, 419173, 414218, 400724, 364209, 324722, 280083, 258798, 250988, 265325, 264349, 248152, 197679, 152171, 138239, 139620, 143188, 142499, 117700, 89415, 70444, 76258, 109860, 120199, 110969, 103358, 105187, 126722, 126011, 142477, 147678, 150940, 165186, 195036, 226314, 247603, 281623, 288611, 298920, 320624, 315625, 313369, 315090, 328144, 372758, 423020, 462814, 493768, 502612, 523764, 600251, 660705, 734924, 857969, 1008579, 1209812, 1526502]
17756A526502N42305R93013J938002L619514N434156L195350k624601m502754
17748A0121487l350786k050257j014909l09315K68465J128533K540750M502411
17740A1836379M751251l70938m582666m091537k796181j641783q97095n16034
17732A691396l39873k45561j63570j28137j19847n7988n8483n8648N159K9817
17722E54265j8499m8253m6597l8806l9788O389L6407J5698j9604J3357K3452O9220
17710E07241O8511j7168j01013r8240o5286j2625J0458j250j1108j3352K3275
17699B89443P3264Q9092K6616o7357j00804p6435m3410Q806K904q925K912m412
17687A91694j1257j2915n940j2028j4055K9334Q004j4895j4620p070l032J5222
$$ y = [1526502, 2068807, 3061820, 4999822, 8619336, 14053492, 17248842, 14624241, 10121487, 6770701, 4720444, 3705535, 3396220, 3664685, 4793218, 7333968, 11836379, 16587630, 16216692, 11634026, 7542489, 4746308, 3104525, 2207430, 1691396, 1351523, 1105962, 942392, 814255, 694408, 636420, 577937, 519289, 524448, 554265, 535766, 487513, 440916, 402110, 362322, 368711, 405118, 420816, 401212, 414569, 438021, 507241, 575752, 558584, 457571, 359331, 294045, 281420, 291878, 290628, 279520, 266168, 289443, 362707, 451799, 478415, 411058, 310254, 233819, 190409, 199215, 202119, 193194, 196106, 191694, 180437, 167522, 161582, 149554, 135499, 164833, 172837, 157942, 143322, 136252, 133220, 148442]
17675A48442J4107J559j2543K694J2187j5342J354M331J126j2600k38K599q000
17662A39676l942j5417p851K890J8535j634p183k863k9799P13J6181M897K8069
17649A42272Q567p963k3431L981L7247L1614K8529N5940J01330J89655J63431
17638G31172j7487j61694j58673r6570m7457j8227J5101K9330O2966J42353J99924
17627F80738O7407j40384j52296q4120m6720l1303j765k88l0992n0039l4981l9152
17615A36105O22J3684q085J4138K0071J5855K9073J9319j7454j8775k8802j7680
17603A58071j3957j3019j1232n371J598j1177m754P561j1649p757J5235L315N113
17590A11977K938k4824M018J5624J7436J7036M067k4389j4716J659M008N464p9
$$ y = [148442, 162549, 164108, 151565, 154259, 166446, 151104, 152458, 156789, 157915, 145315, 145077, 147676, 139676, 135734, 120317, 112466, 115356, 133891, 132257, 125074, 122211, 92412, 93125, 109306, 114203, 142272, 150839, 142876, 119445, 123426, 160673, 192287, 220816, 276756, 378086, 567741, 731172, 713685, 551991, 393318, 296748, 249291, 231064, 246165, 275495, 338461, 480814, 680738, 748145, 607761, 455465, 371345, 324625, 293322, 291557, 291269, 260277, 210238, 175257, 136105, 136727, 150411, 142326, 156464, 176535, 192390, 221463, 240782, 223328, 204553, 175751, 158071, 144114, 131095, 119863, 114492, 116090, 104913, 100159, 107720, 96071, 88314, 103549, 106864, 111977, 114915, 90091, 94109, 109733, 127169, 144205, 148272, 123883, 109167, 110826, 114834, 120298, 120219]
17577A20219K09J6636J9830J3705K0701j2211j0831k1957j3133n852J292j3499
17565A15109P889L522j9999j6392J0840J5519j3472k294J3173O289j5945r074
17553I5165J2824J8058j231l077J6304k1950j5798k233r413l517J38Q139J9573
17540A12982J2462K4302n727j4318l733j3000l317r610k423O42J8546J0768P006
17527A34580J045k8763J788K7695j143o1J8680K0184N942j747j9735m214p827
17514A46424r759q123l441O209J0170J9715R796r309n30L077j6988q206M350l772
17500A39613m204J5938J4942m92P31J0103J4849m1J5728P5606J09272Q2940l7648
17487D37337q6916q0373o7960m3237J2177L3074L9424P1670J07957P0135o3934
$$ y = [120219, 120428, 137064, 156894, 170599, 191300, 179089, 168258, 146301, 133168, 127316, 128608, 115109, 122998, 126520, 106521, 90129, 100969, 116488, 103016, 100722, 113895, 120184, 104239, 95165, 107989, 126047, 124816, 121739, 138043, 116093, 100295, 98062, 88649, 85132, 85270, 93409, 112982, 125444, 149746, 144019, 129701, 125968, 112968, 109651, 100041, 97618, 98260, 116806, 127574, 134580, 135625, 106862, 108650, 136345, 135202, 135141, 153821, 174005, 179947, 178200, 158465, 154251, 146424, 136665, 128542, 125101, 131310, 141480, 161195, 170991, 161682, 161152, 164229, 147241, 139035, 143385, 139613, 135409, 151347, 166289, 165797, 166528, 176631, 191480, 191439, 207167, 282773, 392045, 474985, 437337, 350421, 270048, 202088, 158851, 171028, 204102, 243526, 315196, 423153, 493288, 429354]
17476D29354q3758p8052o0709l4723k1051L441L870j9148n636P373M826l210K704
17463A45281q66j347k3021k548k1461J3044P446O160J8283L107L359o104J0334
17450A51667J0493n78Q067K302J8272P783J629K9402M6430O9646M8435l0076p8899
17437B84573n2846l4775k6791P278J50R098J4171L095L290O426m157J2242L4451
17424B56205q927k743J2741K6204O8722Q2854J11465J98661M35586P87008R00894
17413B868670Q7306o85101o76328m58279k38787q6415O5207K30118L61500M48515
17403A916406O34032O45670k19329q30657o95179m63816k52475r1251J6829J09128
17393G69358N5007q4189j48417j33312r3885o2665k6735j9234M853j8369j6591
$$ y = [429354, 345596, 267544, 206835, 172112, 151061, 154502, 158372, 139224, 133588, 140961, 145787, 142577, 145281, 144415, 143068, 120047, 117499, 96038, 109082, 116528, 122688, 140971, 144078, 147437, 141333, 151667, 162160, 161582, 169649, 171951, 190223, 198006, 199635, 229037, 275467, 345113, 393548, 363472, 284573, 231727, 196952, 170161, 177439, 177589, 186687, 200858, 203953, 207243, 213669, 209512, 221754, 256205, 247278, 244535, 257276, 283480, 352202, 435056, 546521, 745182, 1180768, 1967776, 2868670, 2955976, 2270875, 1594547, 1136268, 897481, 811066, 876273, 1106391, 1467891, 1916406, 2550438, 3196108, 2976779, 2146122, 1450943, 987127, 734652, 643401, 660230, 769358, 824365, 740176, 591759, 458447, 364562, 301897, 275162, 255928, 260781, 242412, 225821]
17382B25821J1906q0j5944J3153J1109j1537p257p926j8270j8234K0829J1977
17370B15547J792J6478J4582j3850j6212m747J602R843K5475J5631N144K707N620
17357B79612j1812k3436k075N949L451j5297k1000r128j0947J4111N732J7748
17345B32908P193q099N224R358k2701l937J1363L599R971L360j4192p42J4007
17332B47312J571l2190k591J6840J3726O656l714J1777J5264l870j4740O358R902
17319B72301J106n308j6803j0237n085J2197O894M65j0283j5904L978J5573P524
17306B56418J5794J8220K017n26N287N421R299o813J0981K266r150J433n448q220
17292B96979J3097m268q146J8700O812k616N088M219l866L606J359Q65j3708q188
$$ y = [225821, 237727, 237647, 221703, 234856, 245965, 234428, 227171, 219245, 200975, 182741, 203570, 215547, 217339, 233817, 248399, 234549, 218337, 213590, 215192, 225035, 250510, 266141, 271285, 273992, 279612, 267800, 244364, 242289, 248238, 251689, 236392, 215392, 206264, 195317, 209428, 215160, 232908, 240101, 232002, 237226, 246584, 223883, 219946, 231309, 234908, 244879, 248239, 234047, 233305, 247312, 248883, 216693, 214102, 230942, 244668, 251324, 247610, 259387, 274651, 270781, 256041, 262399, 272301, 273407, 268099, 251296, 241059, 235974, 248171, 255065, 255530, 245247, 229343, 233321, 248894, 256418, 272212, 290432, 292449, 291923, 297210, 302631, 311930, 305117, 316098, 318364, 309214, 310647, 305199, 296979, 310076, 305808, 297662, 316362, 323174, 320558, 325646, 329865, 325999, 329605, 330964, 331829, 318121, 309933]
17278C09933K1732L1160K5353j5416j0085J086j2574J58J2089Q423j8724j9640
17266C33495J2291K4587q098N993K1487K177L06P00J5800O454j039k901J1599
17253D22851P668k0141L69l22l505K4989J6214j0456k63L921m936J5004J46K882
17239D54421n597M800J0633J1519O513J1586K7453J6537k9532j4401J8016m312
17227E07636o425R241J8847N843J248J0442M554o532M05j720j5302j0356M784
17214E22665N751J6082J3352J9034p294Q487J8190J011J1446p62j6263j06J2910
17201F04503K8069J7581j3931J6839J3473L759J3j9798J220J3078K4491J3337
17189G02634J4899J3188Q025m0J0061J3725Q861J779n763J6660K2474J8886l960
$$ y = [309933, 331665, 362825, 388178, 372762, 362677, 363763, 351189, 351347, 363436, 371859, 353135, 333495, 345786, 370373, 362275, 368268, 389755, 391932, 392238, 392938, 408738, 415192, 414153, 411252, 422851, 430519, 410378, 410747, 410425, 406920, 431909, 448123, 437667, 437404, 441325, 436389, 451393, 451539, 454421, 448824, 453624, 464257, 475776, 482289, 493875, 521328, 537865, 508333, 493932, 511948, 507636, 501211, 510452, 529299, 535142, 536390, 546832, 551386, 544854, 545259, 543539, 528237, 517881, 522665, 528416, 544498, 557850, 576884, 569590, 578077, 596267, 597278, 608724, 607962, 591699, 591593, 604503, 632572, 650153, 636222, 653061, 666534, 670293, 670306, 650508, 651728, 664806, 689297, 702634, 717533, 730721, 738746, 738706, 748767, 762492, 771353, 773132, 767369, 784029, 806503, 825389, 821429]
17176H21429k6901k4965k685J9430K2863P508P121j0715M457P971J0132J5153
17164H50798R221K0802K4777Q956O736j1937M109J6506L6020M6183K9715J1399
17152A053285j0666k2627k3992n457p158K0012J9904J0151N1578L7149P423r740
17140A119862l1101q125q48J1346q463K0397N501j6761j5420n309K0003L7459
17128A128541L865k4888m415J0048Q476O557J642L068K15L503M060m444Q581J9802
17114A164611l807J980M588R526O610j5086q267J3700J4539M5l225M478K939r79
17100A191652K6938O197p884J195K194J432l965j8757N720n114k6074M302J6050
17087A193886k764J9658Q660K418o893j3744r535q867j6010K662N687J9152n810
$$ y = [821429, 794528, 769563, 766878, 786308, 809171, 816679, 823800, 813085, 817542, 825513, 835645, 850798, 860019, 880821, 905598, 914554, 921290, 909353, 913462, 929968, 965988, 1012171, 1041886, 1053285, 1042619, 1019992, 996000, 990543, 983385, 1003397, 1023301, 1033452, 1085030, 1122179, 1129602, 1119862, 1088761, 1080636, 1079788, 1091134, 1082671, 1103068, 1108569, 1091808, 1076388, 1071079, 1091082, 1128541, 1132406, 1107518, 1103103, 1113151, 1121627, 1128184, 1129826, 1132894, 1133109, 1136612, 1140672, 1136228, 1144809, 1164611, 1160804, 1162784, 1167372, 1176898, 1183508, 1168422, 1160155, 1173855, 1188394, 1188439, 1185214, 1189692, 1192631, 1191652, 1218590, 1224787, 1216903, 1218098, 1220292, 1221724, 1217759, 1199002, 1204722, 1199608, 1173534, 1177836, 1193886, 1191122, 1210780, 1219440, 1221858, 1214965, 1201221, 1191686, 1182819, 1166809, 1169471, 1175158, 1194310, 1188500]
17074A188500j7694k0087j7144N625j726K126J4155P861j2269k7856p834J0004
17062A123661J727j8045j370k0576j7754m083O081M287j2914k0106k912n376n282
17049A027338m780j8495j6387p36O126k239K844J0500k125k1593j3033L274j2529
17036I58165k0874k300r176o166l684p666l265Q355m629J1020j5067l3477n753
17023H65483j4127j9786r659Q71K964o956J820j6789k4845j963J2123k191n291
17010G81654k9614j5581l787q813j221J6127k005k2421n903J052j076q772n633
16997F94007J869j7835j5573L292p373o007r864n649j126k2753n276Q358P356
16984F23426l868j6215j2817M948N874k1222K390k45j2630j5594K959J0940R830
$$ y = [1188500, 1170806, 1150719, 1133575, 1139200, 1137474, 1139600, 1153755, 1161616, 1149347, 1121491, 1113657, 1123661, 1125388, 1107343, 1105973, 1085397, 1067643, 1063560, 1069641, 1073928, 1061014, 1040908, 1037996, 1032620, 1027338, 1022558, 1004063, 987676, 986940, 993066, 990827, 993671, 1004171, 1002046, 980453, 967420, 970694, 958165, 937291, 934991, 925815, 919649, 915965, 908299, 905034, 913389, 908760, 919780, 904713, 871236, 865483, 851356, 831570, 821911, 822782, 825746, 818790, 820610, 803821, 778976, 777013, 789136, 786945, 781654, 752040, 736459, 732672, 723859, 722638, 738765, 736760, 714339, 708436, 709488, 708412, 699640, 694007, 695876, 678041, 662468, 665760, 658387, 652380, 642516, 636867, 635741, 612988, 607712, 616070, 623426, 619558, 603343, 590526, 595474, 601348, 580126, 582516, 582271, 569641, 554047, 557006, 567946, 577776]
16971E77776k246j4013n325m698P65o235k4742q11j041J862o142j1998j2222L048
16957D93978N101r388q320l512J2794j2735n999J465M672j7292l745R48p398p669
16943D42900o657j8217j7980J0132J4097p855r296l280J2704j9945p841n222j8140
16930C65400j0289L575K04m470m931J082k710J2545O128n454k486k4545M673k0
16916C38702m460M509J1512M0j7076j1465J05j5271j1628L357J568K2L0883J0276
16902C41074o713j7193k0719j0093m412l679j0097J1902P024j4190j965l210j286
16889B66443R945j44J303j8142r667J1919j209Q542j0244j9401j7332L718K1268
16876B46999J3136j256q701N886p75o867J1119j0099r852j1155j31J8757j5189
$$ y = [577776, 575530, 561517, 556192, 551494, 552259, 546024, 521282, 520471, 519430, 521292, 515150, 503152, 490930, 493978, 499079, 489691, 481371, 477859, 490653, 477918, 471919, 473384, 478056, 460764, 457019, 457967, 450569, 442900, 436243, 418026, 400046, 410178, 424275, 416420, 407124, 403844, 416548, 396603, 388762, 383540, 365400, 355111, 358686, 358890, 354420, 349489, 350571, 347861, 360406, 366534, 361080, 358594, 334049, 338722, 338702, 334242, 338751, 350263, 350303, 333227, 321762, 321867, 306596, 294968, 298325, 299893, 299915, 330798, 341074, 334361, 317168, 296449, 286356, 281944, 278265, 268168, 280070, 287094, 272904, 270939, 267729, 266443, 276388, 276244, 277547, 259405, 249738, 261657, 260448, 268990, 258746, 239345, 222013, 225731, 246999, 260135, 258879, 250178, 256064, 255289, 248422, 259541, 249442, 239590, 228435, 228304, 247061, 231872]
16863B31872k8954J3005p659L294l225M269N271J5776P745P577j2434k3367L643
16850B16813j08j7686n893q100N478J2074O525j5424j0052j1658J0139Q425K006
16837A92539j4771j258r426P857j4132j5947j542K0010J3064l330N939K5859K554
16824B07416l2438n05m257K207K3439r910p275r872j6499m607k922R715K1032
16811A75524j0291l944n659j4558l557j0367J3668j083r932j5060P926J7992L2870
16798A73529L597p641j5342k1072m672J7083j930J3679J4710k6597j5387j1310
16786A18647k511J3010R121k335j0341J5932R94p068Q375k439j1493M705L824
16773A38421p667j5334L270l41N001p825p087K1149Q076j4505k8069L365J5852
$$ y = [231872, 202918, 215923, 208264, 211558, 208333, 212602, 217873, 233649, 241394, 248971, 236537, 213170, 216813, 216705, 199019, 193126, 185026, 190504, 202578, 209103, 193679, 183627, 171969, 182108, 190533, 192539, 177768, 176510, 167084, 174941, 160809, 144862, 143320, 163330, 176394, 173064, 179003, 204862, 207416, 174978, 174473, 170216, 172423, 195862, 185952, 178677, 168805, 152306, 147699, 144777, 154492, 175524, 165233, 161289, 155630, 141072, 137515, 127148, 140816, 139733, 129801, 114741, 122667, 140659, 173529, 177126, 169485, 154143, 133071, 128399, 145482, 143552, 157231, 171941, 145344, 129957, 118647, 116136, 129146, 138267, 135932, 125591, 141523, 142517, 135449, 143824, 141385, 129892, 134597, 138421, 130754, 115420, 118690, 118349, 123350, 115525, 108438, 129587, 137663, 123158, 95089, 98454, 114306]
16760A14306J1614M281k8696j215m223Q784J5613J7149j2472j710k045P371Q365
16747A37122j7979j9170J0125J96L957R146k7590q160J6304P741M360j5410j2784
16734H7858r70J5663J1300n308j584J3649o807r98q691j4985j039M594J2678j9153
16720H6207o641J2342M368m316J0002j3170p403L996J2537k856l0772J3046J4212
16707I1552j8930q159Q495J3292P101j8075L430n804N079K4550m92j2641r90K68
16693H8676J0574j6994j1764l318K848J9783J1971o2m348k7480j888M792J8064
16680I0854O708m166p230K929P032j0035n773j400L099j2045o539J6152J994J825
16666H3405J3376j5009m661j507N134J400n144O85j1430Q261J8754j1699l0721
$$ y = [114306, 125920, 130201, 101505, 100290, 96067, 104851, 120464, 137613, 125141, 123431, 121386, 128757, 137122, 119143, 99973, 110098, 110294, 114251, 123397, 95807, 87647, 103951, 111692, 116052, 100642, 87858, 86888, 102551, 113851, 108543, 106959, 120608, 113801, 112803, 104112, 89127, 88088, 92682, 105360, 86207, 79566, 91908, 96276, 91960, 101962, 88792, 81389, 85385, 97922, 95066, 64294, 77340, 91552, 72622, 64463, 72958, 86250, 93351, 75276, 78706, 72902, 77981, 102531, 102039, 89398, 88408, 88676, 99250, 82256, 70492, 67174, 70022, 89805, 101776, 101714, 97366, 69886, 67998, 72790, 90854, 97562, 93396, 86166, 89095, 96127, 86092, 80319, 78919, 82018, 69973, 63434, 79586, 81580, 83405, 96781, 81772, 77111, 75604, 80738, 82138, 76994, 77679, 66249, 74510, 93264, 81565, 50844]
16653E0844o314O288J1702J920J8595Q076j265p161P256l441j2793K5700o876
16640I2531k3452j0547K2784q445n391Q118J390J2705o528o972j6321M41P524
16627F7837l361r146N286J1272j0767o922J0863Q534r683p422j7438J9486O103
16614F4642l654o330o023Q743J1199J2717N867o23l0024j8430L626O310J4196
16601F2216j3318p721j723J4033o540N652P630j4313k0913J18J1159R380L540
16588D9200O450k710j4336o633M462P750m458L946k175k242m259K2555J432j3085
16574D5897j939J4764K004j148k3178j1469m102K814j054J3821J3646l379M656
16561E1333p746j021J1341l009n912L400J4867o184k0027l164j626J2126j28R447
$$ y = [50844, 44530, 50818, 62520, 64440, 83035, 91111, 89846, 82685, 89941, 86500, 73707, 99407, 92531, 69079, 58532, 81316, 72871, 67480, 75598, 76988, 89693, 83165, 76193, 59872, 60313, 67837, 64476, 55330, 60616, 71888, 61121, 54199, 65062, 73596, 63913, 56491, 39053, 58539, 64642, 60988, 54658, 48635, 57378, 68577, 81294, 87161, 86538, 56514, 38084, 41710, 48020, 62216, 48898, 41177, 39454, 53487, 46947, 52599, 60229, 45916, 25003, 25121, 36280, 45660, 49200, 55650, 52940, 38604, 31971, 36433, 44183, 39725, 43671, 41496, 39254, 34995, 57550, 58982, 45897, 43958, 58722, 60726, 59578, 36400, 24931, 20829, 23643, 22589, 36410, 50056, 46677, 51333, 43587, 42566, 53907, 50898, 44986, 48386, 63253, 57069, 37042, 33878, 32252, 44378, 44250, 53697]
16547E3697r55j3394l770K0601L484l438n992J721r729k612j5472J669J1288L737
16533D0835j1583M779J1125J3055J0273j639j1633J264O507p563m346p488o57
16520D2929K496L865l152o223O027l885j0709M005M535K6o53k160j4792L033K0403
16505D5745N522j1707P490j916j6963j2927J0071K2411K188p374q469J260N237
16492D0568J0379J1709Q733j0267j3216J891O170O693n207J1299N389r770k0106
16479D4265q374J4650K515n375j0807j4671p994l131n618p467J6969J3860k818
16466B6004o096l232N687R464n638o751J211P449p22K377M744p50n765J5129N450
16451D8561N056j8794L058K713K4801J2091o73L024j9796k8856J491K792K5814
$$ y = [53697, 52742, 39348, 35578, 56179, 59663, 56225, 50233, 51954, 42225, 39613, 24141, 25810, 37098, 40835, 29252, 34031, 45156, 58211, 68484, 66845, 55212, 56476, 62983, 55420, 51074, 43586, 42929, 45425, 49290, 46138, 39915, 45942, 42057, 31348, 35353, 39888, 39914, 39261, 37101, 22309, 25342, 45745, 51267, 39560, 47050, 45134, 28171, 15244, 25315, 47726, 49914, 42540, 34071, 35331, 40568, 50947, 62656, 71389, 61122, 47906, 49797, 55967, 62660, 57453, 68752, 74141, 64371, 44265, 35891, 50541, 53056, 47681, 36874, 22203, 14209, 11078, 5460, -2007, 14962, 28822, 26004, 19908, 16676, 22363, 31827, 26189, 19438, 20649, 28098, 27376, 29753, 34497, 33747, 27982, 43111, 48561, 53617, 34823, 37881, 40594, 65395, 77486, 76813, 79837, 60041, 31185, 32676, 35468, 61282]
16438F1282M979r877j0761O503j6655j5840K7872L294n772k12N484m025L119Q896
16424E8287q186r924j1121o689L500J1345J0467j3692K161p465K412l594j2978
16411A4523P373o196l949J6385l454o213J3149R088j0559o486R11P854K3410K0499
16397G6335j1279k6313j104j4124k5305Q356J0137Q290L584n659M805q005R635
16384B9353L391p221j0842J5885J0754p03j641j1265K70j9995j1700J8007q89
16371A3404J4122N466l67J1987J6311J144j6949k3006k1325J672J7912R484q646
16358B1209o40l277N146j5O368l996n702L023j233J9136q57j7271j2965J0510
16344A9436k485L270r005J2789j592J666n24M980Q169m549j6808j7146N360J5556
$$ y = [61282, 66261, 56384, 45623, 52126, 35471, 19631, 47503, 50797, 45025, 44813, 50297, 46272, 49391, 58287, 50101, 40177, 29056, 22367, 25867, 37212, 47679, 33987, 36148, 28683, 31095, 27501, 14523, 21896, 15700, 11751, 28136, 24682, 18469, 31618, 40706, 30147, 23661, 24572, 32426, 55836, 76335, 65056, 38743, 37639, 23515, -1790, 6566, 16703, 24993, 28577, 22918, 27723, 19718, 29353, 32744, 25523, 14681, 30566, 41320, 40617, 38976, 27711, 27981, 7986, -3714, 14293, 13404, 27526, 32992, 32625, 44612, 60923, 62067, 45118, 22112, 787, 2459, 20371, 29855, 21209, 20569, 17292, 22438, 22423, 28791, 24795, 19093, 22116, 20883, 40019, 39162, 21891, 8926, 19436, 16951, 20221, 11216, 24005, 22413, 24079, 23555, 28535, 36704, 32155, 15347, -1799, 3561, 19117]
16330A9117J5332N64N885K3710Q460k5483L237j7392l951q77j614j727p693j935
16316A5633N193J3648j4569o260q782q523J5535O423j528j0307J3568P579J2307
16303C9917l567j3541l2335M035J2247P15K40J7210J2459j1535j8201J1290J4082
16290C3016m129P520j3884q155n717k3451O206K9046J0066j0691o850J4841K1709
16277D9527l621n037k909L614p410l427p299P545m854p926m521R394J0701N398
16263C9175j2910n026K638o859q748m339l956j7952N811J3287O227j4151j728
16250h531O617m098J1285J1901n104j2547N489k498j4121j3114J8861J1372k550
16237B962J4015J569p257q88P020j0475N889P554o93J6307J3186k3500p973K093
$$ y = [19117, 34449, 35013, 40898, 64608, 73068, 47585, 50822, 33430, 29479, 28602, 26988, 25261, 17568, 15633, 20826, 34474, 19905, 13645, 4863, -3660, 11875, 18298, 16770, 6463, 20031, 27610, 39917, 36350, 22809, -9526, -5491, 6756, 7471, 7711, 24921, 37380, 25845, 7644, 18934, 33016, 28887, 36407, 22523, 14368, 8651, -14800, -8594, 20452, 30518, 19827, 12977, 27818, 49527, 45906, 40869, 37960, 41574, 34164, 30737, 23438, 30983, 26129, 18203, 13682, 23076, 33777, 39175, 26265, 21239, 23877, 17018, 8270, 3931, -25, -17977, -12166, 1121, 7348, -6803, -8531, -1914, -6012, 5273, 17174, 12070, -477, 5012, 2514, -11607, -24721, -5860, 5512, 2962, 16977, 18546, 11289, 10401, 17421, 6946, 12835, 20389, 19696, 36003, 49189, 25689, 17716, 19809]
16223A9809J7538m122j7272R487K1624L176p303l649k6610j4740n277J4119K0884
16210B7664J4595n882j5484j7598M70J9278j792J0621O238j360K034m733k2918
16197A1133j0138k304R683L700j2894K4P627L147p540j8597k828K371M980N825
16183e811P95q317J992J1021Q301P870p042o741j1597o713K0398j915P076J6985
16169B6302k39l0919j5872L600J0896M309K0233J8803O627o626l724l260j9137
16156A0993k4967Q255K9528J3877q940j289M140j0820p817n580L618K2298J984
16143C5280l4360q247m802r332m792m523N258J8822J4720j471Q587R10O443n535
16129A6958r272J2248J0700l68R621q772L243j4641L8J2803J527n65L257n289
$$ y = [19809, 37347, 33225, 15953, 25440, 47064, 50240, 42937, 39288, 12678, -2062, -7339, 6780, 27664, 42259, 36377, 20893, 3295, 3765, 23043, 21251, 31872, 38110, 36750, 38784, 34051, 11133, 995, -1309, 8374, 12074, -820, -796, 6831, 9978, 2438, -16159, -18987, -16616, -11636, -5811, -5016, -13333, -11341, -320, 7981, 15851, 8809, 2068, -9529, -16242, 4156, 2241, 9317, 26302, 26063, -4856, -20728, -17128, -6232, -1923, 18310, 37113, 43740, 37114, 33390, 30130, 10993, -13974, -5719, 23809, 37686, 28746, 27457, 31597, 20777, 12960, 7380, 10998, 33296, 35280, 920, -7327, -12129, -21461, -26253, -30776, -25518, -6696, 8024, 6553, 15140, 16050, 22493, 16958, 7686, 19934, 30634, 30266, 39887, 31115, 34358, 19717, 19755, 32558, 34085, 33520, 36777, 31488]
16115C1488o104j2756Q681m813q388N475J1283n899o298j200K762L90O701q318
16101A3004k0826q46P856J0388K6327J1705r986p413K184l503k996j012j8938
16088E944j8780R10P643N257J606k3883o5J8435J249Q676J1081N090k188j466
16074A9509Q601K755M72o047j4746j2055K1094K1974j112j2062p620L003N875
16061B9641J4445j4344k4758m667J8744J852j7459j3036L49Q06J0631j4807K4659
16048A2056R328L321j1745l607O615k784J5409J2975j9916o025O404j3949l808
16035D274P25L104j389O434j0065r61R095J6473R522j2003m135j0852J0349o053
16021A4518j3417Q487K5785l785j0285j2223P33j4017J469O121o733J7868J4801
$$ y = [31488, 25384, 12628, 21309, 16496, 8108, 13583, 24866, 18967, 12669, 11469, 14231, 14621, 21322, 13004, -7822, -8668, -812, 9576, 35903, 47608, 37622, 30209, 32393, 28890, 25894, 24882, 5944, -12836, -11926, -4283, 974, 2580, -21303, -21368, -2933, -1684, 6992, 18073, 23163, 20975, 19509, 28110, 30865, 31337, 25290, 10544, -1511, 19583, 41557, 40445, 28383, 20763, 23766, 29641, 44086, 29742, 4984, 317, 19061, 20913, 3454, -9582, -9233, -8427, 2204, -12603, 12056, 21384, 24705, 12960, 9353, 15968, 13184, 28593, 41568, 21652, 15627, 22031, 8082, 4274, 4999, 8103, 6714, 13148, 3083, 2122, 11217, 27690, 37212, 25209, 21074, 10222, 20571, 14518, 1101, 9588, 35373, 31588, 21303, 9080, 9813, -4204, -2735, 3386, -3347, 14521, 29322]
16008B9322L9680J2235j8974r233K7035K3064l1637m4313l6994Q975K0552j4726
15996D986j7311Q973J9388K0378M9080K0035l7399n9868k3745J1636L741O133
15984F027m222p897R31k3176j2114j45J0784K4584N787r803J8248j7023j9293
15971b7312R814K1696K0095J4052r235J532j1780M406J5674k4699k4084K7605
15959A7764R630j0209O395R200K650r425j0096J4393O155n61n406L39n10r060
15945B1259J468J4485K303l3410k7673L295o420J456j159R679p088M635J7353
15932A83Q408l600k063O929p919j6945k6278K6567J8864k1104m878J3865J8757
15919A0786J095l3164o893J0782J6944L6667M374K418j5359Q51j7601k5893M402
$$ y = [29322, 69002, 81237, 62263, 53030, 80065, 103129, 71492, 27179, -9815, -840, 19712, 4986, -12325, -3352, 16036, 36414, 85494, 105529, 68130, 8262, -15483, -3847, -106, 6027, 1805, -6092, -5161, -28337, -40451, -40596, -29812, -5228, 559, -9244, 9004, -8019, -27312, -17498, 4198, 24293, 38345, 29110, 30642, 18862, 23268, 38942, 14243, -9841, 17764, 27394, 17185, 23580, 32780, 35430, 26005, 15909, 30302, 36457, 35896, 30490, 30829, 30319, 21259, 22727, 37212, 39515, 6105, -21568, -18273, -24693, -23237, -24396, -14717, -21805, -17170, 183, 8591, 4991, 2928, 9857, 1938, -15007, -41285, -14718, 4146, -16958, -21836, -7971, 10786, 11881, -21283, -28176, -17394, -450, 36217, 40591, 43009, 27650, 28501, 10900, -14993, -10591]
15906a0591M602R332j330J2140J0996J0378m869j6169r70R418J610l290k633j5946
15892B678l056M882m069q101Q045J5853J790R93K379j0016R330k472J1983R937
15878D0156o162O220L908l906k0328k0362o164L058J6871O230J298N884j2582
15865A4121j9582n105j947J0665Q545R103l914r78N908j7550j4109n460m303J0389
15851a4217M463J0132J6583j7799j490N089J1360k151K019M53K05r396q455J2413
15837I209m129n810o39P104o701J397j96J1612J4828J3369p907j8305j0022P472
15823A1282O613O761j2932q799K6012l789n461k178p385j0635N5O040m335r339
15809h090K503J1113J5209Q278L116q600j7626J0927j1611j4461L445L895J2937
$$ y = [-10591, -5989, 3343, 2013, 14153, 25149, 35527, 30658, 14489, 13519, 22937, 24547, 21257, 18624, 2678, -378, 4504, 435, -7666, 379, 16232, 18022, 19015, 21394, 11378, 20708, 18236, 30219, 40156, 33994, 40214, 44122, 40216, 19888, -474, -6638, -3580, 13291, 19521, 20819, 26703, 14121, -5461, -10566, -12513, -1848, 6697, 15800, 11886, 10908, 16816, -734, -14843, -20303, -24606, -14217, -9754, 378, 16961, -838, -2328, 2761, 14121, 11970, 13989, 14442, 14647, 5251, -3204, 9209, 5080, -730, -1369, 5735, -966, 431, 235, 11847, 26675, 40044, 32137, 13832, 3810, 11282, 17895, 24656, 11724, 2925, 28937, 25148, 19687, 17509, 10124, -511, -456, 5584, 1249, -8090, -5587, 5526, 20735, 29013, 32129, 23529, 5903, 16830, 5219, -9242, -5797, -1902, 11035]
15796A1035J4572l013p304o252j7586j7717J1417j3518J1186J1932J1736K05j7855
15783a1162K0952J8537j836k065K124J0631M507M932j3328j5122j6555k4736p345
15770c0466m981k268J3779Q202N496p131o801l959K1976P913j1283L203K1668
15757A5348O032J365M85j873q106j3086m251J4583R553j590L350j1302L264l858
15743I914k8123L435J1838o652P176k745j5740l95L855J9118k4037o168Q427k073
15729b2170J9397J3859M661J1621j53m257j2555q63k827m270n270P264J3200M715
15715B2352j7775k6457k0649j0299K0853K4407O485O799J0450M818Q105r360O12
15702B0341O626j3795o319r519J4592J5775q918j0848J5351j9587j8798K5730
$$ y = [11035, 25607, 22594, 15290, 9038, -8548, -26265, -14848, -28366, -17180, -5248, 6488, 6693, -11162, 9790, 28327, 26491, 24426, 26550, 37181, 41688, 46620, 33292, 18170, 1615, -23121, -30466, -35447, -37715, -23936, -15734, -10238, -17369, -24170, -28129, -6153, 1760, -9523, -6320, 15348, 21380, 22745, 23230, 21357, 13251, 165, -4086, 10497, 20050, 18460, 21810, 10508, 13772, 9914, -18209, -14774, -2936, -9588, -2412, -5157, -20897, -21292, -17437, 1681, -22356, -28524, -20097, -22170, -2773, 11086, 15747, 27368, 27215, 22958, 10403, 9540, 6713, 2443, -2827, 4437, 17637, 22352, 4577, -21880, -42529, -52828, -31975, -7568, -1083, 5716, 16166, 20984, 29089, 19729, 20341, 26967, 13172, 6853, -2666, 11926, 27701, 18783, 7935, 23286, 3699, -15099, 10631]
15690A0631K2531q641o346L6L030J6640N441J7343r728j4917j3634j4991j3826
15677f431j4033J4983K1253K782j2190O979q743M389p122l174l241J3269J0099
15664A8820q124N93j2022j0768L03L607o778M843j95K7429q967k4146K1559P904
15650A4058pM97k866k457q887K069p52J2032p558l310j0005j0882J7969O870N322
15635A2093m841j6848m977L881l101n280L5569J9547J2289l2600k5675k25j145
15622a1313k367j497k571q27K810l708R975m377R323J6421k235j2335p229J3937
15608D007J470Q349P162k1785j4747O596Q882J0430J5584q129j4138m833M203
15595C051j3017q6k440J8385O301N9M399O951j5927K384R372l1919k4812K142
$$ y = [10631, 33162, 24521, 18175, 18211, 21241, 37881, 43322, 60665, 50937, 36020, 22386, 7395, -6431, -20464, -5481, 15772, 18554, 6364, 13343, 4600, 8989, 1867, -1307, -4548, 8721, 18820, 10696, 11289, -733, -11501, -11198, -7591, -14369, -9526, -9721, 17708, 8741, -15405, 6154, 14058, 14051, 14548, 11682, 9225, 338, 2407, 1655, 13687, 6129, 2819, -7186, -18068, -99, 6771, 12093, 7252, -9596, -14573, -10692, -13793, -19073, 16496, 36043, 48332, 15732, -9943, -10168, -11313, -13680, -15177, -17748, -18575, -15765, -19473, -9498, -13875, -4552, 11869, 9634, -2701, -9930, 4007, 5477, 13826, 20988, -797, -15544, -8948, -66, 10364, 25948, 17819, 3681, -1152, 3051, -9966, -10052, -12492, 5893, 12194, 12253, 16652, 23603, 7676, 10060, 19432, -12487, -37299, -35157]
15581c5157J1205K262P205J1200M367P289P299K822K0933j3545n382j5911k269
15568B318j2184M329L684J2371J943o821q424O645J5994m423o187j0553l744Q319
15554C267m281j0002J2119K258n502o630r782L969J6423J5866o323k2189r632
15541b0439O724P565l766n864O476J6929L117j8673J4479J4468R686K90k1611
15528I381j2318J0807j0591R355J3874J413k2342j1382q657r844p696K481p44
15515c6263J2899K3390J7083n915j9574R55J4120o058l004J0825J3690M691L409
15502C0248L512K1614j3384k1293k361m792k36L009K533j2372K653l949j3523
15489h341J4093J678j6661l468K768l963M095l770k074J6422L619k495L997j504
$$ y = [-35157, -23952, -21690, -14485, -3285, 1082, 8371, 15670, 18492, 39425, 25880, 20498, 4587, 2318, -9866, -5537, -1853, 10518, 12461, 5640, -2784, 3861, 19855, 15432, 9245, -1308, -5052, 3267, -1014, -11016, 1103, 3361, -2141, -8771, -18553, -14584, 1839, 17705, 11382, -10807, -20439, -13715, -6150, -9916, -15780, -9304, 7625, 10742, -7931, 6548, 21016, 30702, 30992, 9381, -2937, 7870, -2721, 6634, 20508, 21921, -421, -11803, -20460, -30304, -38000, -35519, -36263, -23364, 26, 17109, 11194, -8380, -7425, 6695, 637, -2367, 8458, 22148, 26839, 30248, 33760, 55374, 41990, 20697, 18336, 13544, 13308, 16317, 18850, 6478, 9131, 5182, -8341, 5752, 7430, -9231, -12699, -9931, -13894, -9799, -13569, -15643, 779, 4398, 1903, 5900, 4396]
15475D396j0554p409o6j2245K39J5562Q992m578k146p39q03J143k347j413N932
15460f036Q2p823p034J4199K274L805j6525J1082O08j432n225p87o022M105K709
15445a2020M601j2855j1194L236J8984J2604m625j4767J962p107Q502K2507J7641
15432B7469J0214j380n375k1720j3931O269m679m063L665r028P240K0537l24j3255
15418A639M939J0033q091j3187j7816j343J8098O23m228J467k2501N994K6733
15405B360P335j0181j5560j16P889P65J5555J306p143p012K673N315n273j7173
15391a9260J0030J8703r516k1010j4380P795M142J7464K2802k604j2266r570K362
15378e308O79K028J1617J49J652L825o740J4245j0942j7955J0100N139o235L857
$$ y = [4396, -6158, -13567, -13633, -25878, -25639, -10077, -1085, -5663, -7809, -8548, -9351, -8208, -10555, -11968, -6036, -5954, -13777, -20811, -6612, -4338, -533, -17058, -5976, -5368, -6800, -12025, -12812, -18834, -14729, -12020, -7419, -20274, -31468, -28232, -9248, 3356, -1269, -16036, -14074, -21181, -12679, 9828, 27469, 37683, 36303, 30928, 9208, -4723, 1546, -3133, -7196, -3531, -12559, -5319, 15218, 14894, 1639, 6578, 16611, 8520, -4667, -22483, -23826, -5728, -5105, -9333, -7866, -30367, -24373, 2360, 9695, -486, -16046, -16162, -8273, -7508, 8047, 9353, 2210, -4802, -2129, 3186, -2087, -19260, -9230, 9473, -43, -21053, -35433, -27638, -23496, -6032, 16770, 14166, 1900, -7670, -5308, -4629, -2601, 9016, 9165, 10817, 14642, 7902, 22147, 11205, -6750, 3350, 8489, 2254, 6111]
15364F111l689j4940J2239N432J45j3706J40J6204R037j8397J6144J7068k9666
15351B122j4768m50J3819J2442K0865N155j5981L047r920m178k620J2574q163
15338A3944j7762P199j68J4596k274j2950p078l828J3015K2334M70k3336r205
15325e043J6713M471o091k4760p84J1197k611j451n657K2156K935l62K0632p669
15311B3676l937N071r958n712Q791k2567k3180j820J733J4993J1710p338o179
15298a4717L131n078j771l528K047j5131j7729K0833O604M944J548M409L061K131
15284i246O710J157j2167M120R228N694M769j6998m9l805O335R423K206J2307
15270A9684O771K353o092j6135j2038J0943n218n307Q130J7827l920k0952J951
$$ y = [6111, 2422, -12518, -279, 5153, 5298, -8408, -8268, 7936, 16973, -1424, 14720, 31788, 2122, -12646, -13096, 723, 13165, 34030, 39185, 23204, 26251, 16331, 12153, 9533, 22107, 13944, -3818, 3381, 3213, 17809, 15535, 2585, -4493, -8321, 4694, 27028, 27498, 4162, -5043, 11670, 16141, 10050, -14710, -15494, -4297, -6908, -8359, -14016, 8140, 11075, 10713, 31345, 23676, 19739, 24810, 14852, 9140, 17931, -4636, -27816, -29636, -27903, -12910, -1200, -8538, -14717, -11586, -16664, -18435, -21963, -19916, -35047, -52776, -31943, -25339, -20395, -18847, -14438, -11377, -9246, -2536, -1379, -13546, -9426, -198, 5496, 10265, -6733, -6782, -10587, -4252, 5171, 7377, 19684, 26455, 28808, 22716, 6581, -5457, 5486, 268, -5039, 3091, 20918, 16998, -3954, -2003]
15257b003R339P882r233l332k213p595L673N288q155m308o975M295P220J7964
15243A1847N814j6018j5591r941j3794q47j859J9705K2108R994M586j268k3006
15230h270j0618L730o761j5536J4766J4801J000J583J7119k693p438o371P737
15217C049P68j693l246j3200p924J2582n891J563J5209O064l977O773K4226j7024
15203A7279k7682j326J2441n217Q469R284N865o591M373l527j9787j0550j952
15190a8921K441J3577J2394n821l144j4457k858K3152j0197j9658P169J7942K1902
15177B3521J4248j865J6481k1502l5052J135K222j1510k040m952J5144O73L280
15164b17L25p095r442p255J0230L9673J3529j1328k72o811r758l678j6926l632
$$ y = [-2003, 7336, 15218, 5985, 2653, 440, -7155, -3482, 1806, -6349, -10657, -17632, -13337, -6117, 11847, 17661, 1643, -13948, -23889, -37683, -38530, -40389, -20684, 1424, 11418, 16004, 14736, -8270, -18888, -15158, -21919, -37455, -22689, -7888, -6888, -5305, 11814, 9121, 1683, -4688, 3049, 3817, 2124, -1122, -14322, -22246, -9664, -15555, -13992, 1217, 7281, 3304, 10077, 34303, 17279, -10403, -11729, 712, -4505, 3964, 13248, 19113, 12522, 16895, 13368, -6419, -16969, -18921, -16480, -2903, 9491, 3670, 526, -13931, -16789, 6363, -3834, -23492, -16323, 1619, 23521, 37769, 35904, 52385, 30883, -4169, -3034, -812, -12322, -14362, -19314, -4170, -3497, -217, 108, -6987, -16429, -23684, -13454, 26219, 39748, 28420, 28148, 21337, 11579, 7901, -9025, -12657]
15150a2657J4965J1151J2765J251m0247j9012J40R659Q323J3372K837O756n050
15137D253j4139k137J2803p393N888K848q000J3808J5598m751k7232M959P325
15124C830J974j0471j1002o330J0328n21J0337K2676Q575k0658j9380Q268J9324
15111A6950k041j6972J2322l660o263L391j0376K338K3136P665P563m085j6492
15098A3476j6631m301J365K468J1661N69q149n757j5297j5939m224J2404J9415
15085h940K4296Q625m654l97j7408j1272J0617L3073k972l0620P244l256j7968
15072a3632j5340J2594Q373J5826J4233Q827p987j8411j3823o014n4J1678J1108
15059G378j1663N338n697q943L560M290M134J6270j0487M313j1283N549q76P988
$$ y = [-12657, 2308, 13459, 26224, 27475, -12772, -31784, -31644, -21985, -13662, -290, 2547, 9303, 4253, -9886, -12023, 780, -6613, -725, 2123, -5877, 7931, 23529, 18778, -8454, -3495, 3830, 5804, -4667, -15669, -21999, -11671, -12192, -1855, 20821, 29396, 8738, -10642, -2374, 16950, 14909, -2063, 10259, 6599, 336, 3727, -6649, -4311, 18825, 26490, 34053, 29968, 13476, -3155, -7456, -6091, -3623, 8038, 8607, 458, -5299, -20596, -36535, -40759, -28355, -8940, 15356, 23981, 19327, 18930, 1522, -9750, 867, 33940, 30968, 348, 7592, 4336, -13632, -28972, -16378, -8005, 7821, 22054, 30881, 22894, 4483, -9340, -15354, -15408, -3730, 7378, -4285, 1053, -4644, -13587, -10027, -5737, -1603, 14667, 4180, 8493, -2790, 2759, 1883, 9871]
15045I871o815R503R622k177k0534n318n692m483Q764j0711n533J4621N072P780
15031C970j473J1624j9151m838Q097Q230m76J4273L188k1466o899O195J2862p339
15017F797j5200J092q303k448J6410K0094N670q964n277l951J0362k4862j9597
15004b8177p00K3918M897J904m710j0154k674L1164M226l15L712j0430j2440Q100
14990H321J9745q107q242m104q294o05r461J062J8432j9721j5943N39P308J9840
14976G70K796j7982j4937Q494l142k432J926N298R411J8225Q05j5255k5005M681
14962b6347L0856J6935K198o957j1613J458j1155P635J4105J0064R923J2524l0138
14949A9488j3006k2301l0765q06J1833J9453K1271J805q573l122M707j5652j4369
$$ y = [9871, 3056, 12559, 22181, 20004, -530, -5848, -11540, -16023, -7259, -17970, -23503, -8882, -3810, 3970, 2497, 14121, -5030, -9868, -1771, 6459, 5983, 20256, 23444, 1978, -4921, 1274, 14136, 6797, -8403, -7311, -15614, -18062, -1652, 18442, 24112, 15148, 9871, 5920, 16282, -8580, -28177, -28877, -4959, -62, 1842, -2868, -13022, -15696, 15468, 19694, 19379, 23091, 12661, 221, 8321, 28066, 19959, 11717, 7613, -681, -1286, -10747, -9685, 8747, -10974, -26917, -26378, -19070, 770, 3566, -14416, -29353, -20859, -24001, -26433, -24507, -19209, -9798, 8427, 9232, -6023, -31028, -26347, 4509, 21444, 23642, 16685, 5072, 6530, -4625, 3010, 17115, 27179, 37102, 49626, 19488, 6482, -15819, -46584, -47390, -35557, -16104, 5167, 6972, -1601, -4723, -16, -15668, -30037]
14936c0037j1348r13K3234Q406j6072n425J6406o85k028N220J0457K2333o806
14923A2742k5265M798J6264J1172n922n759L47O513K4177J2906q378j9777j2771
14910A1047k075J155J5672j3615K0529K0358k1401k5788m600l01Q518K326r115
14897B710J1134j117p468j1630j1332o231O081O215J822J539J702K2361J9127
14884C4913R468J366m42r428j9465l721j5549j0186j1620J1063J480k30P112j9419
14870b4658j5613Q843j356M58P125j722o810M455J2471Q865K282J0380j6646j5411
14856b7337Q394k790k840j559L699j0781n493O678L480k718k104J9031O330P042
14842i68J674L906J6615m052l0101j8607N1K5N323Q341J3840j919q16N128J3883
$$ y = [-30037, -41385, -42298, -19064, -10658, -26730, -32155, -15749, -16434, -18462, -13242, -2785, 19548, 12742, -12523, -7725, 8539, 19711, 13789, 8030, 8377, 14890, 39067, 51973, 43595, 23818, 11047, 8972, 10127, 25799, 12184, 32713, 53071, 31670, 5882, 1282, 981, 9499, 11825, 2710, 13844, 12727, 5259, -6371, -17703, -23934, -17853, -11638, -9816, -8277, -6575, 15786, 34913, 44381, 45747, 45305, 35877, 16412, 12691, -2858, -13044, -24664, -13601, -12121, -12351, -5239, -24658, -40271, -31428, -32784, -32326, -25201, -26923, -33733, -29278, -16807, -7942, -5660, 4720, -11926, -27337, -18943, -21733, -24573, -26132, -22433, -33214, -38707, -32029, -28549, -31267, -33371, -14340, -8010, -968, 706, 4612, 21227, 17175, -12926, -31533, -31482, -31457, -26134, -17793, -3953, -5872, -6688, -1560, 12323]
14827A2323j844K006j574N17J319o143j5062r681j1305k4338J5547J7138M779
14814a6318l74l135M164M751k369O232j4782j1469J0542J4645M626M334O590o472
14800I65N543q16j9369j9159j3377J856K1423J4120P557J3069O425O80O020M623
14786B9560j4394j6628j1819O639J1257L29K2379l203j2839l8246j5050J1998
14774c0017J5457J422r354p116K589R130K348P831J4744J3490j5169o39Q702L41
14760A3759j975j0810j1656q004o099J2541J1403m839O405K4253J4858j1325j5999
14747A2512p399J405N040l783q843q017q784J4440l772L814K700j1691P722J3615
14733H959M435j4509m940K886O456q50q204J2803J206n060R16J107K232J2755
$$ y = [12323, 10479, 12485, 10911, 11428, 12747, 6604, -8458, -18139, -29444, -53782, -38235, -21097, -16318, -16692, -19827, -15663, -10912, -13281, -7049, -21831, -33300, -22758, -8113, -3487, 847, 7437, 965, 6508, 5692, -13677, -32836, -46213, -44357, -22934, -8814, -1257, 11812, 18237, 18917, 24937, 29560, 15166, -1462, -13281, -6642, 4615, 4944, 27323, 24120, 11281, -26965, -42015, -30017, -14560, -13138, -22492, -29608, -27019, -17889, -15541, -7710, 7034, 20524, 5355, 4716, 13418, 13759, 11784, 974, -10682, -18686, -24785, -12244, -841, -5680, 725, 24978, 39836, 28511, 12512, 5113, 6518, 11558, 7775, -1068, -9085, -17869, -3429, -7201, -3387, -687, -12378, -4656, 8959, 13394, -1115, -6055, -3169, 3287, 2437, -5767, 7036, 8242, 3182, 4098, 5205, 7437, 20192]
14719B0192o015j8165L375K1689K0119Q09l139j5220j6495j7521l143j391q40
14706a5745Q266N736q122j2382O570k39k4560j9931P280J5849L627m715L185K0403
14692a4778P117N830N70N198J2053R881K202m782j1957q964k2689m516K992N62
14678b1281J4975m73P418J5950r800q440j8338j3241M666K4661O885J0461o093
14665G350L679j940o524m453J5262k431j298k2046j0403o412J466j0406J0342
14652b7814J0994k108J8132L9761Q713k2746j9736j2281m467k515M845J2343r277
14639f156l302O400J9429k291k3406k4125J8551J4313r571j6573K3671K4370p552
14626A3758j3699j3604N71J0024m421J520J900j5056n771K54J045p633Q456J2019
$$ y = [20192, 14177, -3988, -613, 21076, 41195, 42004, 38865, 23645, 7150, -10371, -13514, -14905, -15745, -7479, -1743, -9865, -22247, -15677, -15916, -40476, -60407, -53127, -37278, -33651, -38366, -35181, -14778, -7661, -1831, -1261, 3937, 15990, 25871, 28073, 23291, 11334, 2370, -20319, -24835, -21843, -21281, -6306, -6779, 639, 16589, 6789, -1651, -19989, -33230, -28564, -3903, 2982, 13443, 7350, 11029, 9089, 2565, -1888, 13374, 10943, 9645, -12401, -22804, -29216, -27750, -38156, -27814, -16820, -18928, -796, 38965, 47678, 24932, 5196, -7085, -11552, -14067, -9222, 3121, -6156, -9458, -3058, 16371, 14080, -9326, -33451, -14900, -587, -10158, -26731, -3060, 21310, 13758, 59, -13545, -12974, -2950, -7371, -5851, -3951, -19007, -24778, -24524, -23479, -31112, -22656, -10637]
14612a0637n555m070N831m263J118J2486M577j285j602M757K5168K636j7968p626
14598C567j0068k558j1J382q402j1045k553j1409N702J5288m115J3253L088N906
14584a975K0178k201J1527m366j3717o386P199L681j1931j3152q287K9986K026
14571A2582P077j1729n901m799J4261j8332k231K2291q318m684J5247l259k1253
14558i048q467m440J5664J2693j0480q651j5007O228P222P019j1992q294R067
14545a8486J1771L3351J8176P43j0474k1347Q431k331j956j8205k6011J0662M338
14532a1338J1408J9908J1274j1183J371J259j3434o084r191o618J2232P231o473
14519C62j5576r024k983R239Q596N443m132M946O298q988k605J4039r788l789
$$ y = [-10637, -16192, -20262, -14431, -18694, -17576, -5090, -513, -1798, -3400, 1357, 26525, 29161, 11193, 3567, -6501, -9059, -9070, -7688, -16090, -27135, -29688, -41097, -35395, -20107, -24222, -10969, -7881, -1975, 18203, 16002, 27529, 23163, 9446, 3060, 10259, 13940, 2009, -11143, -19430, 10556, 12582, 19659, 7930, 2029, -2770, 11491, -6841, -9072, 13219, 4901, 217, 15464, 12205, -9048, -17515, -21955, -6291, 6402, -4078, -12729, -27736, -21508, -14286, -7267, -19259, -27553, -18486, -6715, 26636, 44812, 45555, 35081, 13734, 22165, 19834, 17878, -327, -26338, -15676, -11338, 70, 19978, 31252, 20069, 21440, 22699, 9265, 3181, -6010, -12628, -396, 6835, 362, -15214, -24238, -27221, -17982, -9386, -3943, -8075, -3129, 3169, -5819, -8424, 5615, -4173, -7962]
14505g962J8433P07l187k5060m711M11q030N339K9641J5067p735j9277j490K0303
14491A2449L572q115M234J4073N476m084n996j2581O807O926r822K338j879j2229
14477A169j3637j8883o474p74Q868O427J3414J2875J107j9916o789k024J7881
14464f756M019j492m275j1314J0796Q907l423m851J2456J238Q322j519k2920j333
14450a2145J7060Q223k1786j0020p508K618K377m988R908J4294M266q996n402
14437a2099n585O226o33k5322m35L0454R705Q87j0351j0743q614R005J1757m437
14423a0185J165M948p037j1153j2195J4264K4123K7040q5j7598Q967j3519l1593
14410b2858J624O418R471n350o0p66L016j1183O684J0713j3499K751o734j2269
$$ y = [-7962, 10471, 11178, 7991, -17069, -21780, -21369, -29399, -24060, 5581, 20648, 12913, -6364, -7854, 12449, 16021, 7906, 12140, 26213, 31689, 27605, 21609, 9028, 15835, 22761, 12939, 15277, 13398, 1169, -12468, -31351, -37825, -38599, -29731, -23304, -9890, 2985, 4092, -15824, -22613, -24637, -6756, -2737, -4229, -8504, -19818, -9022, -115, -3538, -8389, 4067, 5305, 13627, 12108, -10812, -12145, 4915, 13138, -8648, -18668, -26176, -23558, -21181, -26169, -16261, -1967, 2299, -6697, -12099, -17684, -11458, -12091, -37413, -37848, -7394, 2311, 3198, -7153, -17896, -26510, -17505, -5748, -10185, -9020, -4072, -11109, -22262, -34457, -20193, 3930, 30970, 30885, 13287, 22254, 8735, -22858, -21234, -14816, -5345, -10695, -10755, -11521, -8505, -19688, -13004, -2291, -15790, -13039, -19773, -32042]
14396c2042j295K3433J6516j5596M18J9036j0000j5907J9410J2928m734j5340
14384c173k8881j3915j952J9530J8410N121J000k274j4736R087q538k052m440
14371b6813P109K5933p423L795M235K023N931k635k842J000K2222O496m493j1944
14357B2594j3259J1312L82r365n198O622r28j9523r974r526J0587K6258K0079
14344C0061k321O826j1912o694k2204K439Q703o831m038J6210K056m61j8479j0506
14330a7151J8367J085j2436N217l787j8536m899J4315j97J2292R730J0974J958
14317A6932j2474J451J28l046R192R618n846K929k438J0111k565j6657N647J0401
14303B3383Q5k646j5558k4286j4047O729J5534j6185J1307J0489j3225P03N338
$$ y = [-32042, -33337, -9904, 6612, -8984, -8566, 10470, 470, -15437, 3973, 16901, 12167, -3173, -32054, -45969, -47921, -28391, -9981, -4860, -3860, -6134, -20870, -11783, -20321, -22373, -26813, -19704, 6229, -1194, 2601, 6836, 8859, 14790, 12155, 9313, 10313, 32535, 39031, 34538, 22594, 9335, 20647, 21029, 11664, 6466, 13088, 12160, -7363, -17337, -26863, -16276, 9982, 30061, 27740, 34566, 22654, 15960, -6244, -3805, 4898, -1933, -5971, 10239, 12295, 11834, -6645, -17151, 1216, 2301, -10135, -4918, -8705, -27241, -32140, -17825, -18022, -5730, 4000, 14974, 16932, 4458, 5909, 6037, 2991, 12183, 21801, 15955, 18884, 16446, 26557, 23992, 7335, 12982, 23383, 23468, 20822, 5264, -19022, -33069, -26340, -10806, -26991, -15684, -5195, -18420, -17717, -12379]
14290a2379j3438j3107J6965J6703N74J893j000k59K0784q503j3440K1164J1063
14277B7020K6426P3076M6472k1597l4152l3232k8611l4751j624j1152j3072r412
14265a4609r769n583N739K352k688J9456R698j9936m964O64k084j1172M598J1213
14251a7085o65l714J3916K5734m060j1628j0768L30K937p213p773k921K2481j238
14237a667J1641J8589o79k2786R234M86O651J5700m70j7390k2685P70N404j389
14223A409K945j1189p633n927M649J0054n610Q736q408o862P083K1494J1762l4240
14209a1737j02o570j4138N100N788M936K6005N906P211K925m756j5796q593j6140
14195a9961k826R431P642N867L893L372j3575j7428k9081k274J0504J4370J6918
$$ y = [-12379, -25817, -38924, -21959, -5256, -4682, -2789, -3789, -4048, 16736, 8233, -5207, 15957, 27020, 53446, 126522, 172994, 151397, 117245, 84013, 55402, 20651, 19027, 7875, -5197, -14609, -24378, -29961, -24222, -21870, -24558, -5102, 4596, -15340, -20304, -19640, -21724, -32896, -28298, -17085, -17750, -21464, -7548, 18186, 14126, 2498, -8270, -7940, -5003, -12216, -19989, -22910, -429, -1667, 9974, 28563, 27884, 5098, 14332, 14818, 21469, 37169, 36699, 19309, -3376, -2606, 2798, 1409, 4354, -6835, -14468, -20395, -15746, -5692, -11302, -2566, -10974, -17836, -10753, 10741, 22503, -11737, -11839, -18409, -32547, -27447, -21659, -16723, 9282, 15188, 22399, 25324, 20568, 4772, -3821, -19961, -22787, -13356, -5714, 153, 4046, 7418, -6157, -23585, -52666, -54940, -44436, -30066, -13148]
14182a3148Q051J0639o9k69j118j8698O670j2317j3558J5123N199k473R682N686
14168f00r370J878J2604R708o319l685L134j2931j3737K87K564P372J0043k220
14154a272m048p472K1557K4073r899l7323p879Q719J5815N50n393j411k376J1631
14140E272j510o258m380p747M65m607o740R765J0672L636o994J1831J1927q339
14126F993n174n959r212j297O787r47J5664O184k7498L387J3723P168O831o782
14112I868q891M399l931m22o282j0627K72l73n273n022O084k740j0779J5066K1852
14097C201L540j1847R669M760j779j5125j0818k085K092N505oL113J8695J0706
14083A9621m792k940k6694M169M961J0863O309l5153M789J0180J008N609l030
$$ y = [-13148, -5097, 5542, 5473, 5204, 4086, -14612, -7942, -20259, -33817, -18694, -13495, -15968, -6286, -600, -9970, -8092, 4512, 14220, 7901, 4216, 7350, -5581, -19318, -19031, -16467, -9095, 948, -1272, -5320, -12792, 8765, 32838, 22939, -14384, -22263, -13544, 2271, 2821, -2572, -3983, -6359, 5272, 3762, -2496, -6876, -14623, -14158, -18765, -25505, -15740, -5068, -1432, -8426, 3405, 15332, 6993, 1819, -4140, -13352, -14649, -7862, -8809, 6855, 13039, -14459, -11072, 2651, 9819, 16650, 9868, 977, 5376, 1445, 1023, -5259, -15886, -15614, -15987, -21260, -26282, -20198, -22938, -33717, -18651, 3201, 6741, -5106, 4563, 9323, 7544, -7581, -18399, -20484, -18392, -12887, -12893, -9780, 8915, 19621, 14829, 11889, -14805, -10636, -5675, 5188, 11497, -23656, -18867, -8687, -7679, -2070, -5100]
14070e100k0052J8853L915r85q152j3886r55k308q070K1644J7361Q154P417J6104
14056C3940j8906o704P941P154j5877k5051N537J3204n24k41J2317n98k6052k5325
14042c9185J865K1259M439O853P649j2656J3348J6782r915j3689j6809M54P338
14029a2267J0377O250J9484l671m116J1271j1855j3920J653k429J791k9308j8363
14016d5103J6355P78j266Q287q058K733o374J2113j826M917J1904L955J213J3677
14002A3305P899m953k981j0666R106K839j3513j6200N767m385p224l2972p829
13989f1807L4740J5336q900o163N233J423J4103P396k0689p880p709l557R690
13976b8784Q720L165J6393J8715J539j1931J0709n798j3277p639J2L226M407Q239
$$ y = [-5100, -25152, -6299, -2384, -3369, -11521, -25407, -26362, -28670, -36740, -15096, 2265, 10419, 17836, 33940, 15034, 8330, 16271, 23425, 7548, -17503, -11966, 1238, 714, 473, 12790, 12192, -13860, -39185, -37320, -16061, -11622, -4769, 2880, -9776, 3572, 20354, 10439, -3250, -20059, -19605, -12267, -1890, 4360, 23844, 20173, 16057, 27328, 15473, 1553, 3206, 777, 2568, -26740, -45103, -28748, -27970, -29236, -20949, -29007, -26274, -32648, -20535, -22361, -17444, -5540, -1585, -372, 13305, 21204, 16251, 13270, 2604, 11710, 14549, 1036, -15164, -9397, -13782, -21006, -53978, -61807, -27067, -11731, -20631, -26794, -21561, -20138, -6035, 1361, -19328, -27208, -34917, -38474, -28784, -20064, -16899, -506, 18209, 19748, 7817, 18526, 12728, -549, -8188, -8176, -4950, -543, 7696]
13962G696J0198m394j8875L953O729j7886Q358L989j3017k997Q441O87l640J30
13948a0628k915j7428J0591L4162M992j5644O582J3801O778j7097j9328Q748O413
13935I027q997p026j4901M890Q978q546r262j6186M284L1725J322j4848J1344
13922h196J2065j2443m066K6523K581j1091P380j254k7420p419K4692K3307J6613
13909D1272k1243l0554l1612Q910J4352K086K2451J4176j6137n117j081j6384
13897a8881j7134L787P102Q393J2961R452L066o715j0794q045j3497M95J3243
13884a6567J4686J601J8240r892m3428r242R216P711K708j673Q809K3793J8455
13871B4417k623j3380p500n008M895M2050J1569O295j31K6050P3302P5164Q0824
$$ y = [7696, 17894, 13500, -5375, -1422, 5307, -12579, -4221, -232, -13249, -16246, -7805, -7118, -10758, -10628, -13543, -30971, -20380, 13782, 18774, 3130, 9712, 23513, 30291, 13194, -6134, 2614, 9027, 30, -6996, -21897, -17007, -8029, -16575, -25837, -42023, -37739, -6014, -4692, -19540, -8196, 3869, -8574, -12640, 13883, 16464, 5373, 12753, 11499, -15921, -23340, 1352, 24659, 41272, 20029, -10525, -42137, -33227, -18875, -16789, 5662, 19838, 3701, -1416, -2497, -18881, -36015, -32228, -25126, -16733, -3772, 5680, 8746, 2031, -8763, -16808, -30305, -29810, -16567, -1881, -280, 17960, 8068, -35360, -44602, -35386, -27675, -24967, -26640, -17831, 5962, 24417, 21794, 8414, 914, -4094, 801, 42851, 54420, 60715, 60584, 86634, 159936, 235100, 315924]
13858C15924O3492J0850n5363p6155q4489o2685k7337m1905j8928m045r896J8660
13846B8123l97j3750j0292J3266Q767p613o606j9651j3324o452Q544J7019p397
13833i763j4111O510M840R763j357n449J1986J3449k2844o245K047M070J4036
13820F932j8172O513K238m178q167l340o955J3409K0128O185k2O026k511k4803
13806f717j546n262R348j805j2321K376j2257j3732J583P012J4599J1865P147
13793B90o709l701K353r339j1079J5377J4523p32P167J3281j3037p004J1743M919
13779A8052k3464j5890n311K4776J4272o419k659l853N764j6187M502r52j5134
13766b2503j2775N650J2215J4119l510n860J0453J1760J3376q503k8095p242J1630
$$ y = [315924, 379416, 390266, 334903, 258748, 174259, 111574, 84237, 42332, 23404, 19359, 9463, 28123, 27726, 13976, 3684, 16950, 25717, 18104, 11498, -8153, -21477, -27929, -19385, -2366, -9763, -23874, -17364, -12524, -2761, -4118, -9567, 2419, 15868, -6976, -13221, -11174, -7104, 6932, -11240, -4727, -2489, -6667, -14834, -18174, -25129, -11720, 8408, 14593, 14571, 20597, 18086, -6717, -8263, -13525, -4177, -5982, -18303, -15927, -28184, -41916, -40333, -33321, -18722, -6857, 290, -6419, -10120, -7767, -17106, -28185, -12808, 1715, 983, 8150, 21431, 8394, 1390, 13133, 18052, -5412, -21302, -26613, -1837, 12435, 6016, 3357, -496, 5268, -10919, -6417, -7369, -22503, -35278, -29628, -17413, -3294, -6804, -12664, -2211, 9549, 22925, 14422, -13673, -20915, -9285]
13753i285N142J2596O765M585L212p078j1140p379m18j3580P789R615o660J841
13739c995j66r280Q86K238k3407j9382K1393K3363M204N355p499k485j997l470
13725a4242k593J2615o242J0977q485r882k254J0230J411J124O58R807q332k3196
13711b8404j2680L318J2219M6Q571J4618O09j6767P650l029O915P254J094j739
13697c25J9042J3989k786j8807j5170j2708O734o680j1074P97L2494N5250K0493
13684H1249m421j5658j7496j2775j4448k5212q22L124Q572l615j4411j8203l252
13671c7368J0853K6992J7134m661o557J0117k5973j9232J2665J3781K0113p731
13659A0133k305Q417K060O012L894o614j5662j012j3556j4400K339N743M03K5160
$$ y = [-9285, -4143, 8453, 15218, 19803, 23015, 15937, 4797, -2582, -3000, -16580, -8791, 824, -5836, -3995, -4161, -13441, -12555, -10317, -33724, -53106, -31713, -8350, -4146, 1209, -6290, -8775, -10772, -14242, -16835, -4220, -10462, 515, -7970, -17852, -20106, -9876, -8465, -7341, -6683, 3124, -5208, -28404, -41084, -37766, -25547, -25501, -16930, -2312, -1703, -18470, -10820, -13849, -6934, 320, 1414, -325, 18717, 32706, 29920, 11113, -4057, -16765, -10031, -16711, -27785, -26988, 5506, 60756, 81249, 76828, 61170, 43674, 30899, 16451, -8761, -9583, -6459, 2113, -1502, -15913, -34116, -37368, -26515, 477, 17611, 12950, 6393, 16510, -9463, -28695, -16030, -2249, 17864, 10133, 7828, 16245, 18305, 24317, 28211, 21597, 5935, 4923, -8633, -23033, -20694, -14951, -14548, 10612]
13645A0612L5865O654K0134K8209M4263L7523o700n5536n6931j9679j5047j2160
13633A7207Q26k913J0983p984j9896j0676J3386J477Q11k203l968j0071K558K615
13619g848m559k28O774M511l394j4934K1674k77j5133j1450K5345J6798n841J3637
13605B5075L119l944q173J747J3517K501m535J0219M9995N8567K0123M88l2035
13592A36664l9660k6715j9880n945L417k810j0841j2344k542p523k170J7721Q351
13579C5723n497j6196n507n542m36p086n265M087N316q903M440J3840P304O99
13565A6977j0388r144M625K2667j8429j2586N699J4646N048j2406k01j2462N522
13552d32J3503K6662K3475j1737k7828n644j7093R439R097p992j1392n200J5187
$$ y = [10612, 46477, 53131, 73265, 101474, 145737, 183260, 176560, 121024, 64093, 44414, 29367, 17207, 18033, 15120, 26103, 18119, -1777, -12453, 933, 2410, 3221, 1018, -2950, -13021, -10463, -7848, -12407, -12635, -5861, -1350, -4744, -19678, 1996, 1719, -13414, -24864, 481, 17279, 11438, 25075, 28194, 24250, 16077, 17824, 31341, 33842, 29307, 39526, 89521, 148088, 168211, 168699, 136664, 97004, 70289, 50409, 44464, 47881, 45071, 34230, 21886, 19344, 11821, 9651, 27372, 35723, 30226, 14030, 8523, 2981, 2545, -4541, -9806, -5719, -403, -9306, -4866, 8974, 16278, 16977, 6589, -2555, 2070, 24737, 6308, -6278, -579, 14067, 19115, 6709, 6508, -5954, -432, 13071, 39733, 63208, 51471, 23643, 17999, 906, 10345, 19442, 11450, 58, -5142, 10045]
13539A0045o150r628K013J1794R217J5883K707m0442l156M050N214M9k1215Q93
13525a8726N566P711K0015r308j3657j7127k5038q139J5097K0581J3930p001J139
13512a4957L026m50o728Q606Q913j0009L569m749j0935J8850J9307k68j712P36
13498A3199p196N441P81j0918k4186j5509j2159R912R150J679J315k991R573J4854
13484g055J0081m325N327r786N514M672p93k2249M47J0198J2139j0003m988K17
13470a0604j111m542j6506J550L4195l56o4j933j4248P3Q273p708k0628P363J3973
13455a2273n813M766L322k0170j3913J9345J8941J7619J874o208k999k464P003
13442I030r285k0461J1802J8999m424n986k5470l716n466K767K73O081M586M300
$$ y = [10045, 3895, -5733, -3720, 8074, 17291, 33174, 35881, -4561, -7717, -3667, 1547, 1596, -19619, -18726, -13160, -5449, 14566, 5258, -8399, -25526, -50564, -58703, -43606, -23025, -9095, -16096, -14957, -11931, -12381, -19109, -10503, -1590, -11599, -8030, -12779, -23714, -4864, 14443, 14175, 12463, 13199, 6003, 11444, 12225, 1307, -22879, -38388, -50547, -40635, -31485, -29806, -28491, -31482, -21909, -7055, 3026, -1299, 4028, -5758, -244, 4428, 3635, -18614, -18167, -7969, 4170, -5833, -10821, -10604, -11715, -16257, -32763, -31213, 2982, 2626, 2562, 629, -13619, -13546, -5273, -12981, -33609, -26246, -12273, -18086, -13320, -9998, -30168, -44081, -24736, -5795, 11824, 13698, 7490, 4491, 2027, 9030, -255, -20716, -8914, 10085, 5661, -325, -25795, -29511, -34977, -32210, -31937, -25856, -21270, -16970]
13428a6970J919r630J9817R895n543l0180r036m345M22L0023K0907n639l317K494
13414H17J235m942j2107N566m453n343l077j265J0387n256N351l080j3928J7062
13400a3033K1779l672p245Q174j4974L02k331j5918K612J3410J1986n660j7491
13387b2061m30L1191J1566J1351J628o801r419j3113n40j553O728L650O363j3555
13373E005r990L058O687P718k0468k325N494J3556L938J790m181k1570m29L4902
13359B3185K1285L368j5023k825k983R524k7650j6912j3497J6447N462j3346r308
13346b2273l445l596K546J388Q358r43p003J6683m74K902k645k2092j0842L959
13332c7477m478J1106J5658J2905J4534m684n966r102k593R589L1925o480p656
$$ y = [-16970, -15051, -24681, -4864, 5031, -512, -30692, -39728, -44073, -43651, -13628, 7279, 1640, -1677, 817, 2052, -2890, -14997, -9431, -13884, -19227, -22304, -23569, -13182, -18438, -13087, -16167, -30095, -13033, 8746, 5074, -2171, 6003, -8971, -8669, -11000, -26918, -24306, -10896, 1090, -4570, -22061, -22491, 8700, 20266, 31617, 33245, 26444, 17025, 3912, 3372, 1819, 8547, 12197, 18560, 5005, -4985, -1927, 4760, 12478, -7990, -10315, -4821, 8735, 12673, 14463, 10282, -11288, -11717, 23185, 44470, 47838, 32815, 29990, 27007, 36531, 8881, -8031, -21528, -5081, 381, -12965, -22273, -25718, -29314, -26768, -25380, -17022, -17965, -24968, -8285, -8759, -5857, -8502, -30594, -41436, -37477, -41955, -30849, -15191, -2286, 12248, 7564, 1598, -7504, -10097, -508, 31417, 24937, 17281]
13319A7281j1637R10l672P639j902k3278n753J0920p58j6271j2250R748K1900
13306g123J2579M80J187j3695N734p201j7358j797J5271J7138N913j518J656j7977
13292f711k401K542k813L329J0550L9970J7617j9708l090J0933j2699k1232p820
13279H467j788Q153L188j3024p800J1637M537k2209J0589j3154L179R463K3474
13266B4712J8059o232k8654j8746r788N481N277k427j5927p46R419K6825J0110
13253A7363j995k2229J947O532j351p834j8838N799Q976J2042j4272M154J8337
13240H631j5473k39r728r93J1757l449K2499R434M611q540j2481j1218o617J7412
13226E606J3157l779n287j3654j3991K185K575J0891J3302n735J5057r316j1423
$$ y = [17281, 5644, 6554, 2882, 10521, 8619, -14659, -20412, -9492, -10250, -26521, -38771, -29023, -7123, 5456, 5936, 7123, -6572, -838, -8039, -25397, -27194, -11923, 5215, 11128, 9610, 11266, -6711, -9112, -6570, -9383, -6054, 4496, 44466, 62083, 42375, 39285, 50218, 37519, 16287, 8467, 6679, 14832, 18020, 4996, -2804, 8833, 13370, -8839, 1750, -11404, -8225, 1238, 24712, 42771, 36539, 7885, -10861, -20649, -15168, -9891, -12318, -28245, -28991, -19572, 7253, 17363, 15368, -6861, -4914, 1618, 267, -7567, -26405, -20606, -11630, 412, -13860, -9706, 8631, -6842, -7081, -16809, -17802, -6045, -9494, 13005, 22439, 27050, 18510, 6029, -5189, -11806, 5606, 18763, 14984, 9697, -3957, -17948, -15763, -13188, -2297, 11005, 5270, 20327, 11011, -412]
13213d12K496j0010q127N017n781k2317N401n29q140J9407K4797J0503q718j8619
13199a5032j4832J596P982R066o999j3262j27J2763j5489Q015M577J5558K935
13186c249r023P183Q989J3915j3427k813l994o263j8618m347J9376K052J7900
13173G681j1909r788J777k887n346P666K2774N93n869J989q59k6611k4728Q930
13159c6587Q729j548L200J6989j144j4043l430K1845o356k691o862p267J578k406
13145b9993L112m541Q573K0618J1986M434n044n92j4208O494j120j0898L867n863
13131a3175m630L554P685r000O24l513P401n246O443r69p737J2505J2683l910
13117B715r107k3347L106Q451n479l838J743J4556k536r989Q163n179j0901j2856
$$ y = [-412, 2084, -7926, -16053, -11036, -16817, -39134, -33733, -34262, -42402, -22995, 1802, 12305, 3587, -15032, -29864, -28268, -20286, -11220, -18219, -31481, -31608, -18845, -34334, -26319, -21742, -6184, -3249, -12272, -5089, 3900, 17815, 4388, 1575, -2419, -8682, -27300, -31647, -12271, -10219, 7681, -4228, -14016, -12239, -15126, -20472, -12806, 9968, 10561, 4692, 6681, 5822, -20789, -45517, -36587, -27858, -29406, -26206, -9217, -10361, -24404, -27834, -5989, -12345, -15036, -21898, -29165, -27587, -29993, -26881, -31422, -22849, -2231, 9755, 14189, 9145, 8553, -5655, 839, -281, -11179, -7312, -13175, -17805, -14251, -6566, -15566, -14942, -18455, -11054, -16300, -9857, -10826, -18563, -6058, 6625, 2715, -6392, -29739, -26633, -18182, -23661, -27499, -25756, -11200, -13736, -23725, -15562, -20741, -31642, -44498]
13103d4498l194P374J3764p419j3359J0497K7800n337q813p713Q85R764J7921
13090b328l276k049J1057l50j5181K153n17J3338R423k319j2057M487j4042j382
13076a3043J6895j9709L107J8129j0768n160O661J334j5315J461J620J0290J0012
13063E514K3039K9623J5209M1849O1850Q5238O9778l802l3763q5883p8718k5782
13051A04152j3310k1060k484m609j5811o928M785k0319j2596j882N4Q639M775
13038B3406j6267k4442l908o745J2775J8077J7865p669j5289j0210J3757q954
13026g604j209L906n582O436K1791J6793J5786q119q573k0779k1793R198J5051
13013A5302j0719k4210J7707J8578Q780O091j6336j08m082j599k7081R454l280
$$ y = [-44498, -47692, -40318, -26554, -33973, -47332, -36835, -9035, -14372, -23185, -30898, -30013, -20249, -2328, -5604, -7653, 3404, 3054, -12127, -9974, -10491, 2847, 12270, 9951, -2106, 2381, -11661, -13043, 3852, -15857, -12750, 5379, -5389, -10549, -3888, -2554, -17869, -16408, -14788, -4498, 5514, 28553, 58176, 73385, 115234, 177084, 262322, 332100, 328298, 294535, 208652, 129934, 104152, 90842, 69782, 67298, 62689, 46878, 39950, 44735, 24416, 11820, 9938, 9992, 18631, 23406, 7139, -17303, -21211, -27956, -15181, 2896, 20761, 13092, -2197, -12407, 1350, -7604, -8813, -4907, -10489, -4053, 17738, 34531, 50317, 42198, 33625, 12846, -8947, 251, 15302, 4583, -19627, -1920, 16658, 25438, 31529, 15193, 15085, 11003, 9404, -17677, -8223, -11503]
13000a1503n454J7155J476J900J025k069j1336j335o372O77Q880R76J6271q83
12986I408q343j5137l818K5090J8796j2747l730K8237J645l2701o300j503j0881
12973a1984J3888J3422j529q583k958p916j877L794O670J6936j780O23j3366j4286
12959h946K578R421j120O079J832K6136r654p83J3803J1913n308K209K983l142
12945D8001L0556O0742M2551K4408K5447J1668K725k0419n416q018j3364l4177
12933A64704k2629l3500l8606j8184j0059r810k6962Q187R590r504n471J0234
12921A7990L515K135R847n564K195J8482j5369Pk679K0756J2492L7419N5270P6338
12907B32834K1917o0647l7925j9213m8407l13J5763K5201M5285N0666J19741K59579
$$ y = [-11503, -16957, 198, 1674, 3574, 4599, 2530, -8806, -10141, -16513, -15836, -6956, -5980, 10291, 9408, 1065, -14072, -17890, 7200, 25996, 13249, 9519, 37756, 39401, 6700, 400, -1103, -11984, 1904, 15326, 13797, 5214, 2256, -5660, -7537, -3743, 2927, 19863, 18083, 18706, 5340, -8946, -6368, 3053, 1933, 8012, 9844, 35980, 26326, 25543, 39346, 51259, 45951, 48160, 51143, 48001, 78557, 139299, 181850, 206258, 231705, 243373, 246098, 225679, 220263, 212245, 198881, 164704, 142075, 108575, 69969, 51785, 41726, 31916, 4954, 13141, 22731, 13227, 7756, 17990, 21505, 23640, 33487, 27923, 30118, 48600, 33231, 33238, 30559, 51315, 63807, 101226, 156496, 232834, 254751, 194104, 156179, 136966, 88559, 88246, 104009, 129210, 174495, 225161, 344902, 604481]
12895F04481M75476Q71506J250596N56788p32183j014797p65848m70310k63126
12886E12583j47998j00165p9086o0317l0967o069M967K137j6220K601j1816k0484
12874D9166j0239r34n577j337P525l587k7072l65J5698K1521L186q804k1920j4104
12860C157J3027J9300M361l7055k817J5347N720J029j0827l242m677N540k434
12847F429j8628M015O789K705J9329Q221k2064k156K37m747J0173K262Q08P562
12833B0935q619J728j8742n840j487m338O926J1415Q528n207k1156M014M999j5613
12819b2457N913k492Q328j3477j372P60N042P421P670j592j0368p762O89m885
12805b8582L091j330P48L80P465L1550J8418N692l558j0140j1641J866J965P096
$$ y = [604481, 1079957, 1951463, 3202059, 3758847, 3026664, 2011867, 1246019, 775709, 512583, 364585, 264420, 185334, 125017, 94050, 87981, 92948, 95085, 78865, 81466, 69650, 49166, 38927, 37993, 32416, 31079, 38604, 35017, 7945, 7580, 23278, 44799, 47985, 39181, 17261, 3157, 16184, 35484, 39845, 2790, -27, 15320, 21040, 22069, 11242, 8000, 3323, 8863, 6429, -12199, -8184, -1395, 1310, 20639, 28860, 6796, 4640, 4877, 130, 10303, 12565, 13373, 20935, 12316, 14044, -4698, -10538, -12025, -16363, -9437, 1978, 10506, 5299, -15857, -11843, -6844, -22457, -16544, -19036, -10708, -24185, -25557, -24797, -19755, -12334, -4664, -6256, -16624, -24386, -23697, -28582, -25491, -26821, -26073, -25693, -18228, 13322, 31740, 37432, 33874, 23734, 12093, 13959, 15924, 23020]
12791B3020L90j9878q450p33K362p482N353m767j3296k473R010k634O724O493
12777f361P711j3005j5051j754q19J5168j82m27M696p458N719J3411n605O819
12763B862K0753m395r896k703n226k1831o922P648J1628m360r310P149K3763p592
12749A568j1018J7625J071n806j6681j5450K2232K2480j432l810k2019M18n42
12736a1364k096K743J2069k967k095j3224j7368K1636K803N71k633M677J6836
12723I588n317p192N55J0482j0099o930j3267k1231M322K6574J6605J0361j0596
12710C855p645P673n271r484J1554J6961J5205J200k1975j0371N697j9486k3810
12697c5897Q842J8907J1476J6979j2871j957j809M636J2101m242j3625J4340J7639
$$ y = [23020, 23410, 3532, -4918, -5651, -3289, -10771, -5418, -10185, -23481, -25954, -16944, -19578, -12854, -6361, 1350, -11655, -26706, -28460, -29279, -14111, -14293, -14720, -10024, -17482, -11763, 1648, -3957, 2862, 23615, 19220, 9324, 6621, 1395, -20436, -27358, -19710, -8082, -12442, -21752, -14603, 9160, 1568, -9450, 8175, 9246, 3440, -13241, -28691, -6459, 16021, 14589, 10779, -11240, -10822, -11364, -13460, -10717, 1352, -1615, -3710, -16934, -34302, -12666, -9863, -9292, -11925, -7248, 9588, 4271, -2921, -2366, 8116, -1983, -8913, -22180, -43411, -39089, -12515, 4090, 14451, 3855, -3790, 3883, -1388, -10872, 682, 17643, 32848, 34048, 12073, 1702, 7399, -12087, -35897, -27055, -8148, 3328, 20307, 7436, 5479, 3670, 8306, 20407, 16165, 2540, 16880, 34519]
12684C4519k6852k1192L225J5954K189j2993j7092j0934J0921l99M723J1802L645
12671b484m500Q896j0096P935M332O756R253j064j6321P006O382J3407l022k2755
12657C725r302Q8J5659Q984J498J758j418j045k128M353j048o237L726L647j5144
12642G116r435j3416J0487J292j649j664J1261J9666j0359j3237n46m95M22n362
12628e919K1183J9060o794M688l168j2795j0444P377J6591k4671j929R919q812
12615D286o538j2344J3633K4756j4432K389K806j7987k1044p429j1005J1919J0858
12602b0132j1620O913O932P13J4619K6291m082j1225J9231j3306q749l3p215M742
12588C079l896K1264J2474k0280k5905j075N657o232K650Q802L722q965J0246
$$ y = [34519, 7667, -13525, -10300, 5654, 7843, -5150, -22242, -33176, -22255, -22654, -17931, -6129, -2484, -6984, 1912, -8184, -249, 4083, 10839, 20092, 19028, 2707, 9713, 16095, 29502, 26480, 3725, -5577, -5489, 10170, 19154, 20652, 22410, 20992, 19947, 17819, 22172, 21124, 14887, 18613, 22260, 7116, -2319, -15735, -5248, -3956, -5605, -7269, 3992, 23658, 13299, 62, -484, -979, -557, -5919, 15264, 34324, 27530, 32218, 29050, 16255, 5811, 13188, 29779, 5108, 3179, 13098, 4286, -2252, -14596, -963, 23793, 9361, 11750, 14556, -3431, -24475, -31904, -42909, -30990, -20132, -31752, -24839, -17907, -17194, -2575, 23716, 19634, 8409, 27640, 14334, 5585, 5552, -1663, 3079, -817, 20447, 32921, 12641, -13264, -14339, -8682, -14914, -12264, -3462, 260, -8705, 1541]
12575A541J5364J3724k815j5359J3270J1244N55k996j1485j193J814j2011n554
12562F099j458j12j98j166j4522j4528n552J7077J2262L0296l89j8194k1353p418
12548a9156m981J3650j0494O276o465j8498L3883J5024j5763N394L409q393K1364
12535A5250L099j1409M117Q45n133J313p019j25M793L114n154M298n723J1832
12521A4098J5306n963j2145J5508L0702K4860M013J6857J8425N5426N3648J5937
12509B46672k3385N62O788K750j350k1544n6307m5503j8610j5593j8154j6621
12497C9705j1922j4580o721J1082O704J6527K051r285j7762j4910J3600J8523
12485C3012j2734n940n108k0973j3812N584J837L563J1059o161j2224J4335q833
$$ y = [1541, 16905, 30629, 27814, 12455, 25725, 36969, 37524, 34528, 23043, 21850, 23664, 11653, 6099, 4641, 4529, 4331, 3165, -11357, -25885, -31437, -14360, -2098, 28198, 27809, 9615, -11738, -19156, -24137, -10487, -20981, -14705, -21170, -39668, -5785, 9239, -6524, -1130, 2279, -6114, 15250, 18349, 6940, 11057, 11902, 6769, 8082, 1063, 938, 5731, 8845, 3691, 7989, 2266, 14098, 29404, 23441, 11296, 26804, 57506, 82366, 86379, 103236, 121661, 177087, 230735, 246672, 223287, 223849, 230637, 233387, 232037, 210493, 154186, 108683, 90073, 74480, 56326, 39705, 27783, 13203, 6482, 17564, 24268, 40795, 42846, 33561, 15799, 889, 14489, 33012, 20278, 14338, 9230, -11743, -25555, -19971, -18134, -14571, -3512, -9673, -21897, -7562, -16395]
12472a6395l405K0981O755j868j0476J7290K2130j7860M290n777l686k1889P17
12459i193j058m356L511K481J1344J9817Q598j815O10q276k6846k9443o404L1628
12445i402J6610P430L9414j77k0866L130k58Q6J1323n516k7270J2458j3398l1174
12431a7610m417Q693m344L333J302m297K9029p292k6729K587K3722J0510J2276
12418B6763q811r118k305l1r548j0775K01J7738R297k646L365N617J4279q250
12404B5776m758m488M800o099K3034O00k5482L532K0408P762j3377j0309Q954
12391C0353o53l646k7769r999J4500K5166L72l526M575j3295j6910k5014K989
12378b2857K2739O763j1652Q364J6144k756j2072o026r399j2667K1076k480K713
$$ y = [-16395, -19800, 1181, 7936, 6068, -4408, 12882, 35012, 17152, 21442, 15665, 11979, -9910, -9193, -10251, -14607, -11096, -8615, 2729, 22546, 31144, 29329, 29939, 21663, -5183, -34626, -41030, -9402, 7208, 14638, 54052, 53875, 33009, 36139, 35881, 35967, 47290, 41774, 14504, 26962, 13564, -17610, -22027, -13334, -17678, -14345, -13043, -17340, 11689, 4397, -22332, -19745, 3977, 14487, 26763, 17952, 8834, 6529, 6498, -3050, -13825, -13624, 4114, 13411, 10765, 14130, 19747, 34026, 25776, 21018, 16530, 21330, 15231, 38265, 38865, 13383, 16915, 37323, 45085, 31708, 21399, 30353, 29700, 26054, -1715, -11714, 2786, 27952, 28324, 24798, 29373, 16078, -832, -25846, -22857, -118, 6645, -5007, 3357, 19501, 16745, 4673, -1353, -10752, -23419, -2343, -4823, -2110]
12365b110J6743p108q778J2107j244k933k1600p860K3797K5173O857j7009j2906
12352C129j5862j1424k93K9625N573j3224m45J643k237R262L463j2016M83R79
12338a344j1279L228K558k975J2662L1128n295j5489k473m374n62k202o241p376
12324a0034J3083M379p168j3295k157P02n238J2495n496o081l125J3208K2260
12311A3533J0471L621o505r568k691j5216O35k873J4421O625j615q570K938J4762
12297A9968m203n534n098l921M5p449J052O056j2299L872M104J9870M098k247
12283A8314j251j308k459P579j4233j218J1449p014r874l2507j1296J1308J6611
12270a5899J3637k76N511L27J211P2m764j3818J0824p317p032o759J1050J519
$$ y = [-2110, 14633, 7525, -1253, 10854, 9610, 6677, -14923, -22783, 1014, 26187, 33044, 16035, 3129, -12733, -24157, -24450, 5175, 10748, -2476, -2921, -1278, -3515, 5747, 9210, -2806, -2323, -1344, -12623, -9395, -6837, -9812, 2850, 33978, 28683, 13194, 10721, 6347, 5785, 3583, -2658, -10034, 3049, 7428, 260, -13035, -15192, -14490, -19728, -7233, -12729, -18810, -21935, -8727, 13533, 24004, 27625, 21120, 11552, 8861, -6355, -5720, -8593, 5828, 12453, 10838, 2268, 5206, 19968, 15765, 10231, 5133, 1212, 1257, -6192, -5140, 916, -11383, -7511, -3407, 16463, 20561, 18314, 17063, 15755, 13296, 20875, 6642, 5424, 16873, 9859, -15, -32522, -43818, -32510, -15899, -2262, -2538, 2973, 3300, 4511, 4583, -181, -13999, -3175, -10492, -17524, -24283, -13233, -11714]
12256a1714l013m39p810Q332J2594p56k2816j6990K6167K0556J6550l646j2475
12243D540j4969R322J8602j0636j6951Q375K34m06q424n907J2685K424j6786j603
12229a9500K1989L0624K7821p10Q388k0899l2674j2969M169J2547R762R433N252
12216D3233N439O815K349j7151J2129k2261k4098j4510K0775J9774m213K895j206
12203B9970N140q971J0295j0144M817J698J5601j787l175j1006N165j314m612
12190C1677j0294J168j0062j7182J3703L869k25R836j1982r640N545N954J0868
12177B3235m217j1154o878j241K1723K3764n719q084k1267j0013O099q279L439
12164A408K6774o065p288R6m360O236J0105k1845N26J7846k88K0592m770j4755
$$ y = [-11714, -14727, -15166, -22976, -14644, -2050, -2806, -25622, -42612, -16445, 4111, 20661, 17015, 4540, -10429, -1107, 17495, 6859, -10092, -1717, -1483, -1889, -10313, -16220, -3535, -1111, -17897, -19500, 2489, 33113, 60934, 60224, 68612, 47713, 15039, 2070, 6239, 18786, 28548, 37981, 43233, 48672, 55487, 57836, 40685, 52814, 30553, 6455, -8055, 12720, 32494, 28281, 31176, 29970, 35110, 26139, 36434, 26290, 31107, 32805, 48406, 46619, 43444, 32438, 37603, 36289, 31677, 21383, 22551, 12489, -4693, 9010, 12879, 12654, 22490, 10508, 868, 6413, 12367, 23235, 19018, 7864, 986, -255, 21468, 45232, 39513, 31429, 10162, 149, 6248, -2031, 1408, 28182, 22117, 14829, 14925, 10565, 16801, 26906, 5061, 5587, 23433, 23145, 43737, 38967, 24212]
12150B4212j1851j0456j0002p334R565N098k829J99k708J0046K254o212o86q271
12136h975J9083P849r238j3565N471L709p765J1919J546n597O804m533k2663j7727
12122c3682J985J5307J5854K532m062r50P188J003k930J1237q306k3860K060K7258
12108A0634K081m381J7542N151k58j6999k3573n319R16J5684n071p205L537J4643
12094G382j4542j332L0795n604j5402J65K108J8290N877j368n925R751r922L936
12080B4209q885m522K508j049q443j282k119K656Q219J4384K057J4637j0913j5097
12066A6360q015p859J925J728o683J0066J3431K965O080m536J076K487O926j5630
12052B0321l3130Q869O949k3914M861J1613Q857j791Q633K071R246O428k2737
$$ y = [24212, 12361, 1905, -8097, -15431, -5866, -768, -3597, -3398, -6106, 3940, 6194, -18, -704, -8975, 10108, 17957, 8719, -4846, 625, 4334, -3431, 8488, 10034, 4437, 11241, 6708, -15955, -33682, -31697, -16390, -536, 1996, -2066, -3016, 4172, 5175, 2245, 13482, 5176, -18684, -16624, 10634, 12715, 8334, 25876, 31027, 30769, 13770, -9803, -15122, -14206, 1478, -3593, -10798, -7261, 7382, -7160, -8492, 22303, 16699, 1297, 1462, 3570, 21860, 27737, 26369, 20444, 30195, 20273, 24209, 15324, 10802, 13310, 12261, 3818, 2536, 417, 3073, 11292, 25676, 27733, 42370, 31457, 16360, 8345, 486, 2411, 4139, -2544, 7522, 20953, 23918, 29998, 25462, 26538, 29025, 35951, 20321, -12809, -3940, 3009, -20905, -16044, -4431, 4426, 2635, 11268, 13339, 22585, 29013, 6276]
12039F276r76K7765j5720o397M291K856K949o316r825o85Q395L405O638o442J9196
12024C5410P407j5897k2243J5732K2817n555m449L456j0956j7325j4258k218l692
12011a1771p73M365P866J1058j493p881L867J987j3235o888n298j0829P37P649
11997b0639L593R328J4414m542l612j6440Q356Q164P708k20j0383m232L012R461
11983C968J660J1190K0992O139r6l363j8249k4445J157J0152P236J5085j4149
11970A7277P370J5857l573q661J75K43P6k0333j5431n445j5769Q72n157j7520
11956e0019R979J6280K245l772N651o3J706r611J8111O189N674j3671l220K842
11942a1679N517J4701N99r083J615J1331j2866j1292N147p533N276K107l615o009
$$ y = [6276, 5300, 33065, 17345, 10948, 15239, 18095, 21044, 14728, 4903, 4218, 12613, 16018, 22656, 16214, 35410, 42817, 26920, 4677, 20409, 43226, 37671, 33222, 36678, 25722, 8397, -5861, -8079, -11771, -12544, -8179, -313, 10745, 9252, 1371, 5238, 7225, -6010, -12898, -18196, -29025, -28288, -20639, -17046, -7718, 6696, 2154, -1458, -17898, -9542, -1378, 6330, 6110, -4273, -8505, -5493, 3968, 5628, 16818, 37810, 43949, 43853, 40490, 22241, -2204, -1047, 9105, 16341, 31426, 17277, 24647, 40504, 36931, 28270, 28445, 28688, 28764, 8431, -7000, -12445, -28214, -27342, -32499, -50019, -40040, -23760, -21515, -25287, -19636, -19699, -17993, -27604, -9493, -3304, 2370, -11301, -14521, -11679, -6162, 8539, 9138, 55, 1670, 13001, 135, -11157, -6010, -13543, -8267, -6160, -9775, -15784]
11928a5784r439p016N895K567K069Q269J9159j096O759l030j6919q367J442O202
11914i289q802N902K3242J395J413l085J0507k738P16N645m768j1293j6164o595
11900a3914J1758J4871j0142k4583k4345m168J5594R004o250K2271L123N333J8231
11887A6783K596j8555J6085n488m018J8010o704k692J864R581K2065j701m288
11874D3538j8960j1088J7314l437k534m997j8902M032J4484r166j580p706k152
11861a154k5576n472K1194N672Q55R804J5098O351J032Q900m96n561j2748k3071
11847e172O718K2207n268q890J3414J6467o035q233j0512j4295j0646L175J1550
11834D480r95J0123p232J383k499q54l86m071L80J3530o104o435K637l222o072
$$ y = [-15784, -25223, -32239, -26344, -23777, -21708, -13439, 5720, 4624, 11383, 8353, -8566, -16933, -15491, -9289, -18091, -12189, 11053, 12448, 13861, 10776, 21283, 18545, 19261, 24906, 20138, 8845, -7319, -13914, -2156, 12715, 2573, -22010, -46355, -50523, -34929, -25925, -32175, -9904, -6781, -1448, 16783, 19379, 824, 16909, 11421, 7403, 25413, 18709, 16017, 17881, 27462, 49527, 47826, 43538, 24578, 13490, 30804, 27367, 24833, 19836, 934, 4966, 19450, 10284, 8704, 998, -1154, -26730, -32202, -11008, -5336, -4481, 5323, 20421, 26772, 27804, 36704, 36208, 30647, 17899, -5172, 1546, 23753, 18485, 9595, 23009, 39476, 33441, 25208, 14696, 401, -10245, -7070, 4480, 3485, 13608, 6376, 7759, 5260, 4406, 4020, -51, 329, 13859, 7755, 1320, 3957, 735, -5337]
11819e337K44L561J6444J8411Q945j0746O02J076o615j183p068j0156Q46l613
11805E411q429Q969L224J0866J5023P908k243J3679p400r610R935L821R789P580
$$ y = [-5337, -5093, -1532, 14912, 33323, 42268, 31522, 32124, 33200, 26585, 25402, 18334, 8178, 9024, 5411, -3018, 5951, 9175, 20041, 35064, 42972, 40729, 54408, 47008, 37398, 47333, 51154, 60943, 68523]
$$ [...]
##END NTUPLES=NMR SPECTRUM
##END=
