##TITLE=Analysis number 328158
Compound Code cc 10402
Project Code adrs
Chemist Name stores
+insols
##JCAMPDX= 6.0         $$ Bruker NMR JCAMP-DX V2.0
##DATA TYPE= NMR SPECTRUM
##DATA CLASS= NTUPLES
##ORIGIN= Bruker BioSpin GmbH
##OWNER= nmr
$$ XWIN-NMR		Version 3.5
$$ Wed May  9 11:26:25 2007 GMT Daylight Time (UT+1h)  MAYBRIDGE\nmr@NMR_250MHZ
##.OBSERVE FREQUENCY= 250.131544655141
##.OBSERVE NUCLEUS= ^1H
##.ACQUISITION MODE= SIMULTANEOUS (DQD)
##.ACQUISITION SCHEME= undefined
##.AVERAGES= 16
##.DIGITISER RES= 18
##SPECTROMETER/DATA SYSTEM= dpx250
##.PULSE SEQUENCE= zg30
##.SOLVENT NAME= CDCl3
##.SHIFT REFERENCE= (INTERNAL, CDCl3, 0, 16.522)
##AUDIT TRAIL= $$ (NUMBER, WHEN, WHO, WHERE, WHAT)
$$ ##TITLE= Audit trail, XWIN-NMR		Version 3.5
$$ ##JCAMPDX= 5.01
$$ ##ORIGIN= Bruker BioSpin GmbH
$$ ##OWNER= nmr
$$ C:\u/data/dgb/nmr/ADRS/620/pdata/1/auditp.txt
$$ ##AUDIT TRAIL=  $$ (NUMBER, WHEN, WHO, WHERE, WHAT)
(   1,<2007-05-09 11:25:59.86 +100>,<MAYBRIDGE\nmr>,<NMR_250MHZ>,
      <created by zg, POWCHK disabled, PULCHK disabled
       configuration hash MD5:
       76 6E 9A 78 1E 09 19 81 EC 84 63 8F B0 6A 59 2D
       data hash MD5: 64K
       70 41 12 44 79 67 D5 D8 1D AE 17 71 CF 32 69 A0>)
(   2,<2007-05-09 11:26:14.55 +100>,<MAYBRIDGE\nmr>,<NMR_250MHZ>,
      <Start of raw data processing
       ef LB = 0.3 FT_mod = 6 PKNL = 1 SI = 32K 
       data hash MD5: 32K
       70 A6 93 15 7B 6D 46 E8 65 D8 EA C8 07 9B FC 97>)
(   3,<2007-05-09 11:26:16.24 +100>,<MAYBRIDGE\nmr>,<NMR_250MHZ>,
      <apk 
       data hash MD5: 32K
       6C 65 81 3C 59 C4 A2 87 7A 12 9D 93 1A 4D D0 E8>)
(   4,<2007-05-09 11:26:16.97 +100>,<MAYBRIDGE\nmr>,<NMR_250MHZ>,
      <abs ABSG = 5 
       data hash MD5: 32K
       E5 64 BD 4B 88 D1 08 CF C8 0D 4D 13 94 37 E8 23>)
$$ ##END=
$$ 
$$ hash MD5
$$ B3 C6 08 9F 22 B1 28 22 3C 2C CA 82 24 3C 3D 38
##$RELAX= 
##$RELAX= 
##$RELAX= 
##$RELAX= 
##$RELAX= 
##$RELAX= 
##$RELAX= 
$$ Bruker specific parameters
$$ --------------------------
##$DU= <C:\u>
##$EXPNO= 620
##$NAME= <ADRS>
##$PROCNO= 1
##$TYPE= <nmr>
##$USER= <dgb>
##$AMP= (0..31)
100 100 100 100 100 100 100 100 100 100 100 100 100 100 100 100 100 100 
100 100 100 100 100 100 100 100 100 100 100 100 100 100 
##$AQSEQ= 0
##$AQ_mod= 3
##$AUNM= <au_zg>
##$AUTOPOS= <17 >
##$BF1= 250.13
##$BF2= 250.13
##$BF3= 250.13
##$BF4= 250.13
##$BF5= 500.13
##$BF6= 500.13
##$BF7= 500.13
##$BF8= 500.13
##$BYTORDA= 1
##$CFDGTYP= 0
##$CFRGTYP= 5
##$CHEMSTR= <none>
##$CNST= (0..31)
1 1 145 1 1 1 1 1 1 1 1 1 1 1 1 1 1 1 1 1 1 1 1 1 1 1 1 1 1 1 1 1 
##$CPDPRG= <>
##$CPDPRG1= <>
##$CPDPRG2= <>
##$CPDPRG3= <>
##$CPDPRG4= <mlev>
##$CPDPRG5= <mlev>
##$CPDPRG6= <mlev>
##$CPDPRG7= <mlev>
##$CPDPRG8= <mlev>
##$CPDPRGB= <>
##$CPDPRGT= <>
##$D= (0..31)
0 1 0 0 0 0 0 0 0 0.06 0 0 0 0 0 0 0.0002 0 0 0 0 0 0 0 0 0 0 0 0 0 0 
0 
##$DATE= 1178706358
##$DBL= (0..7)
120 120 120 120 120 120 120 120 
##$DBP= (0..7)
150 150 150 150 150 150 150 150 
##$DBP07= 0
##$DBPNAM0= <>
##$DBPNAM1= <>
##$DBPNAM2= <>
$$ [...]
##$SUBNAM7= <"">
##$SUBNAM8= <"">
##$SUBNAM9= <"">
##$SW= 20.6930455092707
##$SWIBOX= (0..15)
0 0 3 0 0 0 0 0 0 0 0 0 0 0 0 0 
##$SW_h= 5175.983436853
##$TD= 65536
##$TD0= 1
##$TE= 683.16
##$TE2= 300
##$TE3= 300
##$TEG= 300
##$TL= (0..7)
0 120 120 120 120 120 120 120 
##$TP= (0..7)
150 150 150 150 150 150 150 150 
##$TP07= 0
##$TPNAME0= <>
##$TPNAME1= <>
##$TPNAME2= <>
##$TPNAME3= <>
##$TPNAME4= <>
##$TPNAME5= <>
##$TPNAME6= <>
##$TPNAME7= <>
##$TPOAL= (0..7)
0.5 0.5 0.5 0.5 0.5 0.5 0.5 0.5 
##$TPOFFS= (0..7)
0 0 0 0 0 0 0 0 
##$TUNHIN= 0
##$TUNHOUT= 0
##$TUNXOUT= 0
##$USERA1= <user>
##$USERA2= <user>
##$USERA3= <user>
##$USERA4= <user>
##$USERA5= <user>
##$V9= 5
##$VALIST= <valist>
##$VCLIST= <CCCCCCCCCCCCCCC>
##$VD= 0
##$VDLIST= <DDDDDDDDDDDDDDD>
##$VPLIST= <PPPPPPPPPPPPPPP>
##$VTLIST= <TTTTTTTTTTTTTTT>
##$WBST= 1024
##$WBSW= 4
##$XGAIN= (0..3)
0 0 0 0 
##$XL= 0
##$YL= 0
##$YMAX_a= 308596
##$YMIN_a= -312643
##$ZGOPTNS= <>
##$ZL1= 120
##$ZL2= 120
##$ZL3= 120
##$ZL4= 120
##$ABSF1= 16.522
##$ABSF2= -4.171173
##$ABSG= 5
##$ABSL= 3
##$ALPHA= 0
##$AQORDER= 0
##$ASSFAC= 0
##$ASSFACI= 0
##$ASSFACX= 0
##$ASSWID= 0
##$AUNMP= <proc_1d>
##$AZFE= 0.1
##$AZFW= 0.1
##$BCFW= 0
##$BC_mod= 0
##$BYTORDP= 0
##$COROFFS= 0
##$CY= 12.5
##$DATMOD= 1
##$DC= 0
##$DFILT= <>
##$DTYPP= 0
##$F1P= 14.0000005364418
##$F2P= -0.99999901652339
##$FCOR= 0.5
##$FTSIZE= 32768
##$FT_mod= 6
##$GAMMA= 0
##$GB= 0
##$INTBC= 1
##$INTSCL= 1
##$ISEN= 128
##$LB= 0.3
##$LEV0= 0
##$LPBIN= 0
##$MAXI= 10000
##$MC2= 0
##$MEAN= 0
##$ME_mod= 0
##$MI= 0
##$NCOEF= 0
##$NC_proc= -3
##$NLEV= 6
##$NOISF1= 0
##$NOISF2= 0
##$NSP= 0
##$NTH_PI= 0
##$NZP= 0
##$OFFSET= 16.522
##$PC= 1
##$PHC0= -64.70843
##$PHC1= 20.20669
##$PH_mod= 1
##$PKNL= yes
##$PPARMOD= 0
##$PSCAL= 4
##$PSIGN= 0
##$REVERSE= no
##$SF= 250.13
##$SI= 32768
##$SIGF1= 0
##$SIGF2= 0
##$SINO= 400
##$SIOLD= 32768
##$SREGLST= <1H.CDCl3>
##$SSB= 0
##$STSI= 32768
##$STSR= 0
##$SW_p= 5175.98343685301
##$SYMM= 0
##$S_DEV= 0
##$TDeff= 65536
##$TDoff= 0
##$TI= <Analysis number 999999
Compound Code 99
Book Reference 9
Project Code 9>
##$TILT= no
##$TM1= 0
##$TM2= 0
##$TOPLEV= 0
##$USERP1= <user>
##$USERP2= <user>
##$USERP3= <user>
##$USERP4= <user>
##$USERP5= <user>
##$WDW= 1
##$XDIM= 32768
##$YMAX_p= 506339454
##$YMIN_p= -133892
$$ End of Bruker specific parameters
$$ ---------------------------------
##NTUPLES= NMR SPECTRUM
##VAR_NAME=  FREQUENCY,     SPECTRUM/REAL,   SPECTRUM/IMAG
##SYMBOL=    X,             R,               I
##VAR_TYPE=  INDEPENDENT,   DEPENDENT,       DEPENDENT
##VAR_FORM=  AFFN,          ASDF,            ASDF
##VAR_DIM=   32768,         32768,           32768
##UNITS=     HZ,            ARBITRARY UNITS, ARBITRARY UNITS
##FACTOR=    0.157963299565203, 1,           1
##FIRST=     4132.6476996994, 0,             0
##LAST=      -1043.33573715361, 0,           0
##MIN=       -1043.33573715361, -133892,     0
##MAX=       4132.6476996994, 506339454,     0
$$ Real data points
##PAGE= N=1
##DATA TABLE= (X++(R..R)), XYDATA
$$ [...]
21058 -25764 -16350 -9770 16737 28303 21794 -10546 -32432 -44666 -43800 5414 21727 73367 59308
21045 59308 35355 44250 -2226 -7719 35796 48356 45480 28163 32834 38743 28774 21153 8684
21032 8684 13453 47014 40847 47719 48103 39754 40377 39375 35831 11491 -5131 26266 50341 22195
21018 22195 13433 17149 13862 8008 -7430 -15079 7206 21768 -12237 -23470 4578 -22216 -37464
21005 -37464 -55862 -57159 3535 41879 23038 18311 39204 23667 -4642 7113 1930 -3476
20993 -3476 1058 -15375 704 39440 32814 -24112 -49547 -32186 -15247 10997 42296 20647
20981 20647 28919 35172 9474 -7596 -13324 2158 -26989 -69618 -63809 -39101 4112 5166 -26289
20968 -26289 -37205 -46820 -21552 13382 -2164 -24513 3227 6022 33345 52197 28831 8286
20956 8286 -27356 -30173 -22103 21768 37400 30322 54190 63463 66577 51705 21885 5711 -7562
20943 -7562 8745 24815 -731 -7728 -5464 27151 48599 49168 66257 50105 41240 5723 -39161
20930 -39161 -27098 -6015 13146 48687 34222 26607 47261 38804 15893 26886 16244 6002
20918 6002 28819 45647 70555 27383 20553 6071 -8561 -5858 4164 7662 -15117 -24720 -15959
20905 -15959 -21486 -15828 14816 -12384 -7050 25349 6431 17480 12215 -13649 -7386 -4869 10101
20892 10101 36803 52168 45448 21613 -6037 -26940 -13061 -4127 4719 27120 37663 29996
20880 29996 -17134 -26277 -6015 27224 49681 23130 31048 31852 12429 7614 33131 73552 73137
20867 73137 61739 63907 73004 63751 30784 26061 6650 -15748 6877 38443 11491 7627 44418
20854 44418 47086 64108 87762 26506 20467 -10647 -23125 -10042 -8106 -1856 -16686 -39420
20842 -39420 -24122 10854 33765 36935 17942 46180 42846 14224 23701 21143 42753 44496 64930
20829 64930 33568 -10739 -48595 -43564 1248 38799 34364 41038 44738 50403 27978 24556 32139
20816 32139 72353 61784 7229 -31300 -17835 -19250 15637 48613 39891 44192 22956 35759
20804 35759 29385 27577 43379 46672 33485 30071 15803 -9454 -27186 -18867 -930 -17385 27998
20791 27998 8911 -24294 -27745 5473 7351 -15765 -27932 -29168 -5413 -12354 -4137 12116 -5531
20778 -5531 -18457 -13546 -1770 13370 -5067 -15082 7767 35201 20439 36871 37912 36031
20766 36031 34204 25517 13017 10021 34623 17405 26374 31036 12530 -3459 -18308 -6729 -23477
20753 -23477 -12578 7451 8870 10230 23081 17043 4936 -7307 -3802 28499 22584 -36428 -37108
20740 -37108 -18513 35037 51290 37255 25565 21999 22669 17933 14549 43408 57456 42685 60015
20727 60015 69923 69121 31904 -12599 -2571 6193 17941 9093 -7562 3901 -3912 11571 19519
20714 19519 -3767 -25479 2617 5826 -8989 33630 45399 41328 23837 13701 21373 19853
20702 19853 -430 1220 17185 8509 27752 26957 2036 9054 31963 58142 43859 36867 25055
20689 25055 -36474 -29549 -26169 -34025 159 -12466 2493 3106 -36563 -31329 -12098 -6648 -8563
20676 -8563 -23347 -6226 15628 30185 18228 -28832 -57148 -52392 -5612 41072 36814 27949
20664 27949 -22205 -32138 -5163 13170 16681 -5031 -8854 1498 6278 -2070 -8058 -17046 -7923
20651 -7923 -9686 -7542 -20626 -33395 -38201 -35206 -49240 -73144 -64378 -57399 -89834 -77092 -44863
20638 -44863 -22018 -19618 -17975 -3275 21437 32075 13214 7255 1821 35171 30530 36333 28221
20625 28221 9024 35316 90689 51184 9270 2199 48748 85601 23062 1212 -11684 -11659
20613 -11659 -2459 -26528 -45149 -42558 -19118 11166 22228 -1455 -5080 -10793 -7023 -22953 -12915
20600 -12915 3129 13428 25594 21737 2443 2650 11073 10444 8203 42687 61729 23213 18446
20587 18446 -22534 -60015 -77630 -45124 -16995 7742 24091 20263 15089 27594 36833 17228
20575 17228 6728 -22599 -18763 -15820 -10585 -27266 -10059 -7125 3545 -2897 -28045 -15963 17383
20562 17383 30784 76214 76203 77724 80023 56307 17488 -16942 -43573 -5020 -13271 -34187 -42660
20549 -42660 -11520 404 4055 29910 21820 19827 51894 71210 86433 109783 97678 53314
20537 53314 19696 21048 7497 -44615 -60848 -7950 -99 -16879 12661 24938 22501 55354
20525 55354 34366 12484 10608 57908 75575 45769 -5984 -18839 -14480 9913 17126 4195
20513 4195 -11568 -9797 33990 62467 50421 36679 32891 34350 37225 17494 5225 456 -20521
20500 -20521 -13369 9506 4396 -855 14427 48988 54228 44313 44665 29098 21634 18799 31541
20487 31541 29486 35638 30249 15982 27067 33529 50521 23682 2039 7932 21349 -15302 -30928
20474 -30928 -15774 -26674 -21021 1656 43501 60163 18552 -3261 17943 26005 11308 -4307
20462 -4307 -11097 -1852 16375 38878 57706 75171 29381 -24420 -38587 -28361 27248 13604
20450 13604 -38437 -62854 -61534 -75567 -59477 -5259 2367 -5832 22187 46634 26528 137
20438 137 11004 10647 3254 -5072 12302 57813 70307 83633 99661 74012 24714 28255 44907
20425 44907 84767 82770 49461 22927 18917 33791 30487 42477 49412 54797 29022 26954 48886
20412 48886 49345 51235 57838 62575 33876 30249 22854 17344 23050 5794 -10659 20243 26085 29843
20398 29843 42560 46672 38307 34302 38002 23418 26235 12731 5841 -1055 16245 38791 43318
20385 43318 47394 75016 30085 12273 53695 53840 39887 1686 -4832 26476 89567 85063 80269
20372 80269 76114 67491 75412 81639 64096 1111 -5752 7120 6245 -18620 -22503 -22788 -8202 -8407
20358 -8407 -8243 -12768 -24515 23266 23678 20788 10753 40664 45062 53641 30595 22767 57031 58676
20344 58676 22891 -13217 45265 55839 38564 10230 5883 32658 34454 39607 39870 52617 69741
20331 69741 65583 59470 73145 55503 36618 -2038 28448 77976 72838 41563 9871 -5814
20319 -5814 -14883 -16877 -36012 7848 13895 -19367 -17937 39464 63315 59298 66150 59775 38937
20306 38937 10984 20317 24879 47650 75313 64750 41062 21319 -1853 31675 36152 30043
20294 30043 43600 53897 50419 7799 -20543 3356 56341 39035 11646 3840 1967 20958
20282 20958 17547 7342 1490 -2045 6531 8430 4881 23111 23288 33090 57498 28970 -5943
20269 -5943 4916 -3859 -27370 -14741 -15853 -12278 31778 52450 65502 52430 23478 -8392
20257 -8392 -16318 12857 6953 -3641 -7347 13358 38365 54849 23095 22433 63043 77121 65150
20244 65150 46445 53230 34223 -680 4584 17380 39001 12334 -15884 12723 24893 17542
20232 17542 8845 7889 -8428 -41091 -35276 -28518 -15480 -1038 25706 4972 19323 30698 7165
20219 7165 -10813 -4111 -2779 -451 3475 15349 21658 20533 29002 -5326 -10956 4748 -18726
20206 -18726 -19319 -23524 9222 18262 -27451 -50567 -51778 -38035 -6739 -5106 -18355 -5487 8933
20193 8933 -1297 1379 -4038 671 -9579 -5297 -37769 -49092 -19442 4628 -10439 166 17874
20180 17874 22222 6738 33902 29380 29861 60475 95912 96557 40058 -21707 -54261 -15039 5729
20167 5729 19884 14996 -3304 -9380 19431 6210 20370 8452 -10941 23203 34912 38687
20155 38687 25040 6308 22309 2745 29999 -2264 1880 7811 -16295 -25899 17483 27457
20143 27457 2704 -19486 16364 55650 63296 28278 -7504 -2531 15193 33079 57148 82192
20131 82192 76127 70001 37284 12355 31429 64763 71784 58940 85194 77626 51339 -5191
20119 -5191 -25231 -17281 6954 33518 18114 21249 33182 21856 -2398 -2569 23757 9428 38576
20106 38576 39459 45460 8188 7859 20057 10359 18531 27474 62232 111667 104595 80527 76276 57227
20092 57227 62339 41692 20741 -3275 8865 -4764 -21722 -28746 191 9202 36718 44364
20080 44364 17204 -15967 -26989 -24967 -11329 7515 -1369 -12115 52478 92574 64836 56467
20068 56467 28377 617 19617 4222 -6858 3889 34274 5893 -11109 -9076 180 -23670
20056 -23670 -14422 19770 54100 56740 43697 3010 -555 32787 70339 76331 81972 79223 74774
20043 74774 80796 116407 88144 48678 53001 37038 13421 4129 10957 19052 25625 36589 65841
20030 65841 43746 27796 19656 1711 -1034 21654 22610 32491 66624 84689 59599 51750 30560
20017 30560 6062 19136 28445 38998 54817 48681 22778 9624 12891 9471 17880 26360 16113
20004 16113 19408 45550 23670 14448 1992 27218 59888 53777 10437 -11497 10027 41619
19992 41619 42617 36859 14413 35800 33091 -6244 -14226 9861 20144 23753 54667 36666 386
19979 386 24833 70707 62859 60999 83862 62772 55173 38410 36072 31128 5997 -6494 14990
19966 14990 49771 52474 49987 52365 32578 -2483 11604 24175 32780 45301 224 -13581
19954 -13581 7033 8612 -6094 -2318 8578 18473 13137 -14791 -8231 -415 -3229 24360 41732
19941 41732 20960 23985 30574 -11345 -16852 -19853 -3114 21986 10568 6188 40772 71861 59931
19928 59931 56662 79510 69657 40580 32385 18961 26563 30356 37666 11970 -4282 -1813 21043
19915 21043 51300 70571 44299 42511 34259 36472 25480 20378 23245 -7085 -9484 6103 21138
19902 21138 16592 40227 29770 53927 58190 63028 96067 92445 67767 64965 59717 18416 -3659
19889 -3659 3166 20680 4071 6240 19013 48091 65235 68865 46566 58032 63702 51927 22901
19876 22901 17032 6998 -5938 7064 -2514 -30653 -8342 36531 45889 67291 95704 117216
19864 117216 96369 41016 15296 32016 25991 35873 30799 58376 80746 75955 70095 20060
19852 20060 4573 26125 22987 -5256 -34846 -12493 18684 47738 50499 69702 72053 54816
19840 54816 26486 -8161 -2126 32351 42344 24216 1735 -21792 -40525 -17043 8346 13862
19828 13862 27535 36603 49112 47355 77137 93195 45006 2319 11694 23512 -4800 26886
19816 26886 96234 87818 34725 23135 3459 -16183 -12728 16075 62128 59723 31913 52363
19804 52363 56726 11698 26673 26850 2559 -6487 4987 37527 42068 24056 13069 -17011 -33670
19791 -33670 -15785 2973 30269 65047 68226 65572 43637 37502 34700 26287 37607 43187 57195
19778 57195 69900 55833 45619 63615 94114 58791 58782 28853 34912 48906 34078 26745 36953
19765 36953 34760 38669 29970 6689 10421 33595 42245 19457 16801 19249 37173 26604 38580
19752 38580 25292 7116 22007 59056 59169 33073 24783 -20254 -48600 -30426 5870 19643
19740 19643 -18655 828 13001 25062 32030 37603 55094 63642 35562 11195 40881 44856
19728 44856 53281 44206 32786 66734 97335 88654 39690 5682 32192 72235 106549 105681 89229
19715 89229 103975 70403 38505 27407 23324 31239 51221 71909 50439 7384 -7549 32048
19703 32048 79645 69508 59735 45855 15530 1842 43761 60190 38755 12481 13854 37740
19691 37740 55274 98951 103394 101686 102927 87944 31132 2640 -1481 -21836 2995 25937
19679 25937 15691 15561 24705 18680 13747 25198 45306 33607 17815 4851 3822 -5936 24221
19666 24221 54218 35493 45080 64245 72172 103884 99935 76993 54428 29869 18270 26311
19654 26311 15902 7471 31323 44416 41096 40289 48577 70166 79420 91125 59063 73643 72057
19641 72057 76783 85189 87118 67127 83933 60968 38431 11553 -21381 -3930 25333 -3298
19629 -3298 5829 -10348 -15826 -6643 4246 37273 65659 23525 39906 75635 65427 66357 62983
19616 62983 53951 32050 32282 23473 46801 56966 39434 54768 62481 65465 76356 65442 75186
19603 75186 70091 60194 59993 67180 66919 70507 66844 86433 115683 72249 18710 16211 12844 -6227
19589 -6227 -37953 -18441 33967 32531 31672 40150 45592 43156 36571 67621 124508 126884 111570
19576 111570 90076 64265 25978 22874 7590 16593 47683 87417 87479 80212 74769 53087 61080
19563 61080 77980 45922 35932 63195 64198 54825 72286 104706 121453 138256 90546 57462
19551 57462 36444 31921 45562 35948 27047 32775 63810 57385 19469 10086 27487 31783 37370
19538 37370 36069 21566 64070 47091 45898 76927 97752 79432 47261 21323 43104 53152
19526 53152 9113 9418 20722 14690 3257 12448 34412 72187 95282 83779 55150 34906
19514 34906 53317 63955 94720 114197 99185 98970 104141 90092 82511 72689 73420 72892 69997 87021
19500 87021 109426 99068 90710 69583 33411 18920 38057 23732 39951 46248 14233 -32301
19488 -32301 -36351 18931 29026 13386 40469 75683 93586 81190 52038 52963 80832 60564
19476 60564 38099 54091 30320 35936 25463 9354 -17034 -27377 -4256 6166 10167 56600
19464 56600 105516 99228 99239 116823 108123 59470 32452 40174 42174 46911 19715 11069 33599
19451 33599 66288 104565 122476 82888 103374 102242 71952 60962 60108 56816 73273 83180 92561
19438 92561 60579 44311 52134 64835 51585 47893 16230 26694 61451 71657 50798 39722
19426 39722 47539 56806 32746 33620 43022 49867 66081 51786 40777 43658 32957 28104 44025
19413 44025 41650 46986 46724 50977 27878 9517 -12526 -24250 -24160 -33178 -66840 -64632 -41165 -23967
19399 -23967 4960 28171 43104 26255 24056 19244 26084 54877 108982 110798 80853 96950
19387 96950 64419 29373 40233 21334 -16389 6411 48481 72259 45735 27045 6642 36881
19375 36881 104903 95423 47512 12932 5304 32351 46082 109015 110396 86543 68780 67955 60755
19362 60755 45242 20791 26190 38562 56688 79914 101324 94779 117164 122813 107914 71017
19350 71017 34613 28934 -3852 -9206 38866 39495 49862 60006 62084 51119 22628 3303 -991
19337 -991 -2066 -6029 11808 36077 38447 40390 60341 57796 61162 86525 52837 42119 51777
19324 51777 57774 58406 64004 106523 116669 92885 58360 71528 99568 84400 50807 44357 75496
19311 75496 91137 83317 95402 113285 104567 102138 70173 39036 21308 24492 25416 31824 39405
19298 39405 50009 56793 25028 27737 61593 57519 38653 47584 71003 63330 79251 66616 67722
19285 67722 77918 55778 38951 47983 74432 80991 88961 78121 80418 89905 79726 84782 74743
19272 74743 69658 55931 8913 21354 72571 84846 74162 37089 17110 45815 19109 12898
19260 12898 9337 26056 59266 57873 53490 74726 62031 77185 100269 100002 73776 73258 103470
19247 103470 106832 129776 130664 119057 102594 90116 94096 86487 81890 94323 109816 102072 120287
19234 120287 119687 101221 87773 71454 78012 80998 94749 73190 56662 65055 82398 68998
19222 68998 60546 65404 67712 95972 94057 55073 35684 8498 -14586 -32324 -29105 -39032 7695
19209 7695 60208 90230 83109 58806 60538 91127 45520 -3325 -720 28485 28499 8749 -6348
19196 -6348 41157 82639 126800 125625 78138 40850 33034 34107 56576 78696 108813 156542
19184 156542 129662 121076 102934 82088 71367 40527 5928 7742 30377 72425 81093 71183
19172 71183 45183 60774 100357 114454 122726 117361 110807 112997 143084 121296 110650 153871
19160 153871 135552 127851 100879 60753 57126 68877 68519 63032 70855 59799 45793 29285 21625
19147 21625 17075 27542 61618 100125 114178 132588 126482 114482 107687 114683 133198 159423
19135 159423 149434 143618 119431 66912 31285 61621 87796 77425 81017 60426 53312 46003
19123 46003 61939 46411 15843 59231 103899 112474 102715 83892 63915 46381 55922 53629
19111 53629 27816 19843 14072 46674 45752 33217 43168 51919 61852 83516 89031 109549 117688
19098 117688 100901 90725 101709 84912 88123 77378 109325 141009 144832 125771 93784 86703
19086 86703 130376 137628 130644 108150 95674 69511 90529 120107 113634 119328 149718 169560
19074 169560 142670 132055 93472 59422 81411 64475 21070 8791 -14524 -1769 38307
19063 38307 60613 62092 66342 46530 57910 66419 42300 72460 112570 97778 63281 69793
19051 69793 82235 80389 81852 83661 70539 94403 135601 128130 115195 76032 72377 94505 95723
19038 95723 99899 154165 169502 110992 92880 81820 96879 94586 95733 81637 57818 40293
19026 40293 17474 29572 19732 41306 60832 72847 85424 112363 96106 76258 87444 80407
19014 80407 46012 1918 4042 37127 45599 68545 70089 40734 18201 28513 10254 24038
19002 24038 47109 48867 65952 93515 129751 127788 112643 101254 106549 68508 22685 21523
18990 21523 59532 87497 80550 85809 85963 94993 107709 131299 158652 171598 165725 141303 140574
18977 140574 121964 118657 123784 103357 68840 50007 50071 43738 39690 64060 82291 73910 70195
18964 70195 77290 91995 115218 60147 83494 94860 91091 66222 76078 94475 61800 44261
18952 44261 73789 93921 96325 88377 101437 110548 132810 108102 66876 87233 67761 92902
18940 92902 134983 110161 114734 121769 129327 139790 128432 120472 102386 117459 149360 177168
18928 177168 184831 181018 176080 133891 103982 114185 123825 137691 137035 130736 122894 101615 103072
18915 103072 83929 111450 121738 78421 81811 77869 99788 99581 91745 131374 165188 147455
18903 147455 127397 102458 97471 125499 113334 90833 73214 78017 94303 121428 141093 126989
18891 126989 113684 140511 141239 136164 148165 145038 128808 112318 130891 132655 150778 135731
18879 135731 123613 100072 101172 105126 96711 104220 123319 117836 149840 172351 179829 156258 127127
18866 127127 108012 133480 107685 118609 111356 85500 79566 69072 67327 61240 91249 110863
18854 110863 73225 94157 89667 92071 113262 142105 160526 168243 142164 110646 102684 94217
18842 94217 79474 58569 77564 78923 83481 95692 74414 35553 37579 65627 67742 82968
18830 82968 105393 108448 74633 69109 92399 96439 84719 71950 112398 144651 152704 123314
18818 123314 99914 109502 154588 166579 155966 151384 103836 117314 136347 129730 172496 179116
18806 179116 120976 106036 83092 83103 93876 79932 113550 150016 125948 95396 75979 68805
18794 68805 90877 122094 165137 150048 147485 174682 187695 170538 138395 125733 118522 142475
18782 142475 167616 174439 182495 162152 165993 169717 193274 214772 253258 247330 251219 256475 259365
18769 259365 280107 278033 252650 271624 330256 382000 348438 251080 203736 161233 109562 63410
18757 63410 80288 104955 100491 77986 81335 99895 114419 148263 162483 147848 143105 159248
18745 159248 146703 152959 140246 86839 67630 117246 117891 98561 62273 42160 23323 50815
18733 50815 82480 115973 147942 141694 143542 104467 92266 131829 125993 109281 122115 114589
18721 114589 104598 115205 98426 119845 94060 82926 71164 80077 81505 91737 106804 97957
18709 97957 85424 86306 91376 98967 121971 103597 108914 97272 102874 118275 109789 112009 104769
18696 104769 107707 63621 35310 61635 57616 59144 64109 87739 107943 127569 130973 111858
18684 111858 111291 135287 163742 187456 170550 131805 107120 113282 122059 108638 101612 122168
18672 122168 123113 164238 155547 132757 142005 150574 126748 126686 108094 80421 80200 96123 104396 107204
18658 107204 103223 134791 168355 175438 140686 129060 139066 140424 131314 130286 154668 185583
18646 185583 196627 173834 130698 136814 166105 176591 159206 179889 150342 143969 166345 140184
18634 140184 132882 146083 136252 91417 63797 80420 131713 187911 196099 185374 175438 161422
18622 161422 190041 185170 144423 120366 110111 110909 125289 133532 146980 110915 102319 128700
18610 128700 160562 173810 155087 162805 152464 129731 135611 136029 130355 147167 145021 131762 122501
18597 122501 110647 86642 63002 81669 97902 141021 166878 154764 134254 141333 131638 148218
18585 148218 147834 136302 101198 87959 93407 98885 103007 103777 100988 113559 105707 139628 147829
18572 147829 139083 153032 141130 142464 142796 96994 119000 130025 124131 118886 130706 109899 68153
18559 68153 72519 96886 114839 150598 138922 109353 129955 125907 144687 178478 171704 174958
18547 174958 182021 185765 192825 165719 130798 135978 134866 139058 127617 147480 153641 149936 146270
18534 146270 154173 172206 152026 117549 113628 110905 100156 98251 105991 142435 122699 119748 108932
18521 108932 90069 99347 137529 142118 143389 170990 168200 130776 112595 121263 110525 119866 122890
18508 122890 137867 143328 146062 152672 183503 201153 197416 223321 232701 234679 214821 206728 197470
18495 197470 179593 194060 197557 162008 165779 214000 201091 167524 141837 141578 145393 125602
18483 125602 138399 149463 168422 190479 191322 180526 188419 193312 190281 170180 161235 160887 167779
18470 167779 161221 156996 144025 144626 153463 159753 151592 176913 157718 158336 187012 177938 191556
18457 191556 209143 182326 148908 138195 169002 213319 229132 239382 227326 181051 169709
18446 169709 167320 169503 183176 204087 199107 199003 210840 201223 185252 176309 164643 183278 190723
18433 190723 210320 193725 167613 163185 163017 195017 205114 200824 203144 190930 167648 167924 207391
18420 207391 208185 179675 161809 160105 176711 180214 166792 177091 166448 165729 178492 182805 171470
18407 171470 195824 176520 193761 216926 212917 180840 154248 149525 159001 185017 198155 220244
18395 220244 240495 204119 193771 203576 202746 213489 194311 183313 162223 152685 173543 205580
18383 205580 211070 196957 196488 200773 202583 185407 182215 194178 204247 182983 158046 160293 160799
18370 160799 161286 181764 182838 198667 236720 241296 230453 230971 226273 228258 217715 199448 171221
18357 171221 169915 143478 180631 212631 187129 178785 187387 157879 161869 153297 159016 154437 155819
18344 155819 153338 165705 192734 216433 185428 203002 219158 218164 191909 181908 232315 257846
18332 257846 234802 223997 208130 219654 222216 220737 152726 121080 159458 178253 156323 137956
18320 137956 132874 151880 143447 127294 133074 178030 173208 173622 203013 241689 265039 244640 195390
18307 195390 190301 216055 208576 189200 163143 137934 140293 161915 192390 221231 203721 183555
18295 183555 200053 223776 251722 287839 247238 236772 249613 251162 231831 238207 279908 264705
18283 264705 250283 237692 222441 212452 223177 253534 239161 248613 280647 238958 207918 217609
18271 217609 210531 217682 217170 210250 207943 180102 162189 176112 140475 162041 203584 173245 188773
18258 188773 219124 240872 259175 264968 251203 238440 206591 209447 258231 253052 245888 244243
18246 244243 216622 175862 210037 245033 291152 290875 297687 293216 281952 258915 268529 253263
18234 253263 224649 228014 238877 228282 231636 250739 283636 276993 257692 234621 207708 234951
18222 234951 282999 299336 277629 266048 257046 266996 261868 266482 268362 283683 296604 269501
18210 269501 214050 225608 228206 250433 247715 278899 277396 252361 238021 248457 261980 258002
18198 258002 259582 261241 284276 294705 275756 282901 331598 351991 344216 325321 306308 332136
18186 332136 329658 313669 295210 291018 310463 311233 334098 342023 313094 283138 281079 308236 298470
18173 298470 297100 345328 348335 332615 314400 346420 393766 404531 375327 363679 371312 374091
18161 374091 372070 347605 341897 356427 364179 389542 444529 501851 492367 470175 480079 491603
18149 491603 517860 533414 540253 530066 543279 544153 529771 518506 515880 567845 629765 654712
18137 654712 673517 760528 828684 848455 873841 865936 904236 976970 1045234 1170271 1274261
18126 1274261 1384696 1527192 1710599 1961488 2270206 2712616 3358385 4407669 6142129
18117 6142129 8706104 11934334 15034489 17512122 18861891 19394285 19895009 21251532
18109 21251532 24049949 29198515 38195731 50153114 49274139 29876452 15145121 8402671
18101 8402671 5224250 3565661 2584255 1950295 1558244 1258291 1007493 856261 736440
18092 736440 649930 573890 495433 437605 394476 349165 314677 325392 310869 300449 270653
18081 270653 243519 232609 265552 285723 267429 255388 209676 194095 162130 158380 188048 191358
18069 191358 207584 238210 227911 188296 177461 217591 239782 219482 206202 208218 230093 234802
18057 234802 215953 246231 232147 199116 190135 212081 230814 233343 207402 162000 152381 162549
18045 162549 145758 152576 149841 147741 142558 168263 182285 219701 215418 180895 160253 143200
18033 143200 107702 78652 124752 159335 138945 131873 123398 163561 179019 156042 188451 184121
18021 184121 185377 187833 193322 191769 174868 165769 189849 193585 172868 150925 169434 190090 155541
18008 155541 165933 190595 173463 157475 148530 154785 177276 193590 201646 153922 189246 222716
17996 222716 219003 220192 211796 234769 245147 266915 307203 288477 257462 201556 173618 159207
17984 159207 194487 250086 244353 241611 246069 183033 149913 183376 191883 165819 124766 117401
17972 117401 163567 194438 201917 204534 226161 233090 225739 212201 207887 196383 191174 185602 175162
17959 175162 171697 173369 185517 169621 143802 115873 125569 161273 195802 222355 224443 247828
17947 247828 229898 236528 247799 236548 205953 191942 202637 221506 202600 184711 164385 154977
17935 154977 182303 179601 185669 185191 145375 178887 212066 190526 173257 143519 158544 181253
17923 181253 220117 219777 218766 195266 156236 158793 178011 172241 178413 185495 188576 166526 159220
17910 159220 162442 159185 189397 194425 208761 182546 175886 193715 204145 187744 173935 170039
17898 170039 166213 200578 189594 187898 231333 264900 250059 239992 201830 187480 194920 199514
17886 199514 189716 183916 181672 181938 182001 175566 185109 193050 195084 188531 159742 170032 212043 207461
17872 207461 228364 253276 236237 226081 244669 231436 197054 170739 180649 192498 144751 133305
17860 133305 195304 194802 181872 174908 198001 242523 256717 234917 208773 204750 209130 204780 194162
17847 194162 185237 187521 193074 219644 229942 209816 184482 198362 210137 214948 228821 218116
17835 218116 197107 207920 191087 156660 121695 148056 168939 179038 204276 166675 162492 166945
17823 166945 169154 172295 163003 184225 203649 211239 227726 251149 244891 224696 214647 239869
17811 239869 265970 251605 255699 265490 278876 257486 242183 234864 220345 199823 206752 240219
17799 240219 270830 244526 216695 218571 248446 267348 281624 268215 208463 178651 184926 209885
17787 209885 234061 229108 228242 241762 230804 211656 235136 238390 236593 262267 288918 281245 264812
17774 264812 265644 266517 249468 248062 232575 251176 258086 274780 253967 236713 238879 256347 260820
17761 260820 264737 264666 243763 231350 195093 160648 177894 218826 194677 215159 238030 272098
17749 272098 268079 246046 246436 238041 251248 264571 243031 204559 198106 182741 183293 222556 244251
17736 244251 237311 198963 200966 231773 221272 230275 250326 233413 201987 189990 218516 243753
17724 243753 263415 243949 256579 246619 213742 206803 201566 200832 173787 186129 230533 238643 227712
17711 227712 229664 226989 213757 202478 201684 224325 234279 235441 277894 288884 247311 232470 239884
17698 239884 231130 230585 237462 239008 188713 175418 173591 213283 227957 217860 221601 222985 225994
17685 225994 201848 177254 179769 201088 188463 178778 214567 227488 232203 210869 208996 221218
17673 221218 202190 186454 196930 215002 239011 224604 193587 162846 166503 175362 190264 212928
17661 212928 234773 226291 220224 212974 226996 250873 241252 220099 194099 235610 259143 257133
17649 257133 258732 267718 248522 236141 227632 196584 163331 177351 209255 200504 199321 223741
17637 223741 224539 204398 195722 207570 243032 253798 288406 300902 294811 274904 232945 214305
17625 214305 229382 215561 235928 258680 268632 269411 265760 262701 240528 269837 276093 249155 212408
17612 212408 232647 260976 276335 285222 294219 282445 273120 279862 276702 252317 223876 194091
17600 194091 178324 195023 201652 224376 237048 234712 254340 269220 281688 239799 225800 206931
17588 206931 203566 212245 230434 234988 220129 212747 231180 227763 240314 211740 234559 227512 193010
17575 193010 206947 232244 234957 218468 206502 162531 198946 228097 202218 209653 256975 266881
17563 266881 272150 238324 210912 242142 274780 267970 254787 252034 241496 275239 257591 224373
17551 224373 228474 257684 265962 272545 301574 286223 258451 252965 247543 265476 243558 248382 240202
17538 240202 253515 266658 232908 204838 242297 242265 231053 251392 260739 235924 226110 227769 279119
17525 279119 267491 222935 197601 200509 218329 240442 256848 271687 247376 213970 227422 257642
17513 257642 302296 310681 269070 246798 249523 240165 231448 246447 242344 281618 298769 280223
17501 280223 270822 273795 294535 307703 322113 292197 298747 277313 246403 246216 272180 275227 232891
17488 232891 225622 228455 238718 247504 251586 271560 288834 335968 374506 422699 440182 452219
17476 452219 463091 520919 592471 619549 622914 695243 822302 882128 907478 937988 852822
17465 852822 755439 723973 772516 861496 794565 639096 561325 512574 502249 516914 490727
17454 490727 400701 361672 337942 321946 378478 419143 434482 438609 453026 454106 479365 471540
17442 471540 470936 518219 586195 611531 516262 360653 308818 304252 259598 250069 241342 213652
17430 213652 236270 237185 198929 214652 230982 289666 305436 249540 194412 208471 223054 232392
17418 232392 233197 253176 266730 219613 217532 269136 273894 265144 245799 260304 265658 237460 222481
17405 222481 219754 242562 231848 234249 235916 212905 200712 229665 245105 250532 245419 230949
17393 230949 214822 232555 214637 213740 227691 249408 227044 164002 178761 229772 245335 249806
17381 249806 253545 290345 307656 272914 255876 259239 232933 197712 181004 215601 205697 200400
17369 200400 183968 200780 237093 232951 253614 284577 293556 295060 269037 255019 259861 254629
17357 254629 224413 219606 251258 284978 250485 218368 241450 235540 207231 248677 262449 266417
17345 266417 225736 197275 229674 240288 254434 247787 219075 246892 252966 239270 255991 255546
17333 255546 242886 232339 257148 242969 243267 253302 224529 173320 147040 160861 191886 224348
17321 224348 238920 256212 247326 241586 226973 200815 211334 216177 221637 223930 203820 191092
17309 191092 202610 198297 193344 177440 189855 189838 176972 221146 239725 221937 219416 238620 231953
17296 231953 231711 224729 196675 164193 167576 188811 212273 217683 228652 221986 263696 291132 278707
17283 278707 253621 232842 221763 217322 236296 223865 223005 221265 216091 238714 278052 255869
17271 255869 228382 219946 249026 216613 179177 185493 207511 246412 253420 230553 236000 233436
17259 233436 219006 218003 231226 202027 186868 205974 201807 208588 204472 219079 231580 213273
17247 213273 242914 237286 230927 232246 205815 208363 178325 172562 210332 201009 194866 190297 205511
17234 205511 209576 215111 206994 208878 238878 233000 242560 248794 258095 235520 212319 212255 220076 244883
17220 244883 263110 272173 264921 260105 232441 238797 231784 248029 263072 278092 291751 291171 286996
17207 286996 279398 265571 247332 250150 260821 242430 237231 248759 225244 196209 214223 232532
17195 232532 210046 194864 173939 187828 228125 243474 270970 274883 254293 270644 254433 262261
17183 262261 266238 229619 236321 240811 230636 231785 247014 264456 279796 289580 271600 251991
17171 251991 245058 263552 274129 276421 257424 260634 242246 246134 248840 261343 253114 219474 213341
17158 213341 248573 272480 289769 292607 283187 273354 310869 331857 342722 331105 305178 276473
17146 276473 288719 298964 305821 298836 285808 295525 317126 322533 307617 320498 322164 338286
17134 338286 323251 302159 290125 279864 292865 306615 311983 299488 282467 288466 300235 303047
17122 303047 270666 266277 275499 316054 339739 312382 290942 296254 293992 284620 281244 273476 261819
17109 261819 251634 252806 286033 268249 297802 281069 286576 292035 310728 304468 280487 258272
17097 258272 275047 292147 305871 315510 282812 265031 301021 317246 299499 299864 294403 289826
17085 289826 314229 331373 343105 333259 292397 279467 303668 327968 341822 339654 306652 309428
17073 309428 337669 344745 357288 324446 307728 349429 339136 333721 338144 364755 348035 331159
17061 331159 324679 326925 317601 320689 314943 301588 282804 298171 292549 335665 362242 397823 387124
17048 387124 391898 384724 389564 394387 354495 344071 330274 341842 349312 352372 329580 358709 403565
17035 403565 376758 340279 333088 314181 308870 340891 357850 342403 335583 362339 391147 426199
17023 426199 403013 416040 442493 427191 427640 468462 449310 431739 454574 462646 452107 438809
17011 438809 441651 454198 479067 459997 400117 389805 401034 408606 414484 428438 425034 422602
16999 422602 411583 432016 437372 452700 473315 462219 405963 372206 385677 364753 372492 385975
16987 385975 362041 354131 344278 393208 441331 448404 437316 415687 433478 434263 449173 429499
16975 429499 446128 477942 517300 559219 563802 527390 498394 531080 571033 598113 609001 594310
16963 594310 599334 615814 653285 660433 631798 651596 636367 607397 606734 651593 683239 706682
16951 706682 743378 785708 781265 723702 706997 725750 753635 769047 802184 821473 794619 816600
16939 816600 838049 873737 871874 861420 857203 876680 928125 1018723 1024155 1037380 1058301 1084843
16927 1084843 1136568 1186457 1225375 1277034 1340186 1414314 1485762 1570402 1679330 1779157 1849442
16916 1849442 1964979 2107608 2206902 2301848 2455419 2636960 2881252 3033115 3087015 3228101
16906 3228101 3450187 3753202 4133360 4422767 4716817 5190024 5873679 6904747 8335529
16897 8335529 10197164 12596595 15428195 18518862 21932156 25983924 31327351 38093205
16889 38093205 45763396 54080191 63164330 73377071 80464697 81594372 84755340 93859192
16881 93859192 109250994 126716970 122870606 98547449 85358161 86295234 97672496
16874 97672496 108509442 92873587 64432154 49280669 44736649 45683502 45400501 37893968
16866 37893968 29411961 24610948 22409282 22055122 23097002 24202082 22772118 19596435
16858 19596435 17503299 17174933 18084025 18234685 15464924 11696151 9266755 7996120
16850 7996120 7260894 6357317 5057926 3884681 3094023 2452583 1923393 1585427 1466572
16841 1466572 1432784 1356726 1137248 872853 692595 607612 557483 499716 403131 303604 242273
16830 242273 220686 173275 181304 183394 166433 146966 121579 118164 152031 169755 158039 107189
16818 107189 59263 25246 10293 -1668 -22858 -59641 -77213 -61280 -47440 -23874 6992
16807 6992 44807 40688 37119 8635 -7439 -19313 -21071 -30010 -51033 -84646 -49841 -54690 -92622
16794 -92622 -60951 -8871 -20307 -10241 -10040 14488 26630 15342 4332 16687 6243 -16773
16782 -16773 -12812 -18007 -20355 8835 34622 40770 14432 -20622 -58775 -22329 24481 8073
16770 8073 -10619 -10782 21898 61277 47894 55228 66967 67054 74178 106491 121610 118888 84812
16757 84812 110166 97529 53591 9252 -4610 -6918 22021 46964 50812 21244 6791 27599
16745 27599 12880 -3145 -3840 -5982 -14081 4352 -1639 -23358 -39675 -43150 -3296 11774 21689
16732 21689 -42120 -82955 -93297 -95932 -71995 -65490 -54442 -50451 -46381 -10376 13585 13220 -32501
16719 -32501 -49787 -34270 -27267 -34990 -52058 -24713 -19247 -21709 -3728 8549 4368 -2092 -5989
16706 -5989 -249 -14923 -29098 -23488 -36974 -54640 -82607 -106874 -91296 -49514 -8120 -40277
16694 -40277 -55526 -51251 -50632 -80669 -105259 -88496 -85177 -101949 -118000 -133825 -118995 -83956
16682 -83956 -87783 -88727 -94409 -107892 -115204 -81733 -62059 -56203 -62590 -50286 -37873 -17662 -8968
16669 -8968 -18594 -14989 -44944 -49455 -34926 -19952 -29241 -45417 -67360 -70997 -72571 -85772 -76650
16656 -76650 -64649 -76412 -67862 -63213 -72443 -68852 -31731 -38612 -88820 -66605 -1448 2210 -16350
16643 -16350 -25611 -53194 -58994 -36818 -12513 -18921 -37635 -43104 -64752 -51993 -32531 -43699
16631 -43699 -49114 -54312 -81072 -66260 -59951 -56764 -23017 2770 27688 16905 -3810 -40621
16619 -40621 -82324 -75077 -33738 -4648 -6371 -8452 -10389 -17640 -19562 -14577 1931 -16319 -39145
16606 -39145 -50029 -39452 -1880 13499 8569 1170 1860 -21294 -55189 -51126 -15175 -11420 -32703
16593 -32703 -49727 -37354 -30033 15380 -72 -14271 14797 -2740 -21047 -49857 -61645 -25382
16581 -25382 35313 3539 -13040 3413 -9825 -10372 2261 -11569 -7372 28892 10602 11238 37512
16568 37512 26428 -4946 -16424 -26948 -24286 -29649 -38996 -37382 -5020 37244 66242 66875 47161
16555 47161 28240 -2229 -22195 -48683 -51047 -36177 -9239 -26750 -38842 -42228 -17478 -15407
16543 -15407 -15592 -4191 -19400 -41498 -37704 -19550 -5453 -25946 -19244 -16336 -21339 -17434 -470
16530 -470 -29677 -13370 -6480 12293 5485 -23267 -48410 -19383 10928 -15584 -28363 5694
16518 5694 22034 13973 12612 20238 8604 -6689 -13881 -26642 -16986 -16133 -61302 -55644 -32010
16505 -32010 -19315 -12585 -13610 -29152 -7665 -5267 -710 1505 22605 35745 10914 -6923 -11781
16492 -11781 -14585 -37197 -21680 26942 10680 -1840 8935 2525 -26798 -55724 -54586 -14746
16480 -14746 4710 4020 -18011 -26304 -39417 -18655 -1755 -39890 -64372 -60817 -55762 -53971 -52395
16467 -52395 -52714 -67911 -29384 -3257 -14381 -26744 -25228 -21673 -17304 3427 3769 -276 -13483
16454 -13483 -10240 -25307 722 7164 -3913 -16635 33 20788 24719 3907 -21969 -60579
16442 -60579 -53293 -63157 -42227 -23223 388 33356 26750 25101 22822 -4137 -266 -38930 -63490
16429 -63490 -65719 -65010 -27146 -929 -8428 -3265 -12188 -19222 15822 28576 8608 17753 14021
16416 14021 11077 5496 6991 22092 9370 -12856 -10845 -32791 -42841 -16491 19410 -10909
16404 -10909 -60610 -96470 -97291 -81170 -55592 -22756 11906 4208 -4497 7106 17563 7921 -7327
16391 -7327 -47311 -67665 -49220 -22039 2218 16599 68013 50445 30082 24396 -1887 16579
16379 16579 13937 5597 30052 25398 51613 17528 2224 12311 -19365 -20271 -9138 -17125 12039
16366 12039 49731 54880 58009 48173 52557 37670 17795 27536 30882 44232 6817 -22167 -21319
16353 -21319 -16475 12386 38819 60448 17228 -15703 -34043 -29337 -30998 -36571 -40164 -40099 -14701
16340 -14701 -16705 -8643 2644 -2318 -8178 -40033 -27642 3619 -8942 -3127 31975 60236 44919
16327 44919 6451 -30302 -19839 -16930 -34445 -57639 -39961 -168 7726 2681 5709 45013
16315 45013 44845 35487 40539 44820 35063 -17625 -16092 18123 20386 9501 -2609 -25004 11939
16302 11939 66301 85639 76743 99484 140133 162318 158925 187988 277035 374769 425742 441158
16290 441158 449139 505881 586680 669021 722576 699453 557311 498649 517216 558229 615142
16279 615142 565646 392556 307972 284089 261530 255595 240066 192446 121708 89854 81169 88519
16267 88519 92994 67001 58468 78109 58589 37095 15255 20175 57825 73118 65909 47342
16255 47342 30504 36555 73515 58239 46872 19643 5576 18483 38041 24131 35774 26070
16243 26070 -28352 -48274 -19057 3364 -6600 -18569 -13343 -9079 19132 36728 19181 44522
16231 44522 56534 53086 47185 62865 48909 -2688 -41472 -31138 -22384 -15787 -37508 -18995
16219 -18995 -828 -13244 -47153 -18120 -18994 -44690 -65133 -45668 -41041 -87626 -83381 -62787
16207 -62787 -30992 -11273 -16819 -15560 14288 61 -29871 16874 24564 3744 20865 26401
16195 26401 19065 30981 31262 20491 -40 -11882 -4810 1514 -6251 14093 -20809 -9331 10625
16182 10625 1554 5232 -2852 12450 15768 16618 31652 12827 4359 -1357 -5835 11890 -42960
16169 -42960 -61910 -15597 21713 34474 15245 -27641 -61090 -37341 -10183 -19164 -28851 -34718
16157 -34718 1254 37807 43845 38992 23464 1115 -17679 -24245 -11268 5531 -7716 -23037
16145 -23037 -30286 6348 38472 6382 -12566 -12513 2822 15742 27485 35058 19452 -27681 -24211
16132 -24211 24403 53661 26729 15599 17546 36876 9672 33463 26770 -2002 -20656 -37388
16120 -37388 -31430 -22305 3105 -3524 12553 29722 3252 1795 -26218 -44513 -26037 -9206
16108 -9206 27509 33988 12846 3195 -26544 -34420 -10903 6502 6081 3956 11966 20258 38562
16095 38562 20417 -11682 -23089 -36818 -19955 -17448 -34624 -44149 -47257 3848 49270 61719
16083 61719 72386 55730 43318 46362 792 -5879 9966 1687 22024 -4108 -13878 15178
16071 15178 37762 34077 29085 -10585 -22691 -9502 33252 83947 102113 54749 35743 -19073
16059 -19073 -34992 -31635 -29105 15331 34295 25600 21317 26372 53799 54788 41921 52295 7692
16046 7692 -13671 30316 22272 17124 12321 -17024 -31842 -11520 -33448 -44130 -3116 35818
16034 35818 21058 15720 5281 -10819 17418 27411 36942 61888 -3386 -35079 -16971 -4193
16022 -4193 -2773 23078 2131 -23179 929 2500 -24289 -26365 -16652 4548 21418 8454 -7019
16009 -7019 11 10044 51737 59534 68084 84452 63275 38747 57364 47269 27267 17556 12998
15996 12998 19240 70972 78495 62042 36422 23750 8095 -12567 -24010 -23740 -19408 -3870 14056
15983 14056 36299 17612 -8290 -53138 -62447 -58629 7787 11373 -10190 -19387 -29718 -4481
15971 -4481 4483 34915 33750 -9813 -16838 9645 17661 3582 19026 52770 39217 28501 18781
15958 18781 47248 26370 -8454 -14675 6651 -1260 22345 13710 -7646 -28648 -9567 10901
15946 10901 39998 62748 36022 -8177 3855 19970 50238 68543 66565 28578 29796 46113
15934 46113 42609 41074 23627 23486 5990 26778 -218 -50042 -35602 -14471 -10579 -16164 -27731
15921 -27731 -10401 6264 12024 -362 -5248 16010 5601 -13968 -27686 -52857 -48227 1327
15909 1327 -13109 -14483 43344 58421 46823 36736 57676 63624 13856 20374 18830 10653 2812
15896 2812 4949 3134 -20674 -9219 24478 67306 69207 72672 74353 90708 71979 72936 69374
15883 69374 25507 -8327 3821 -6938 -3037 4782 -7007 -23450 -28487 -13674 -11669 2446
15871 2446 32155 22189 11525 34994 -13361 -47493 -3801 6355 -15852 -24289 3455 23340
15859 23340 22812 21047 61769 35317 29919 68953 59602 24026 12808 8345 11442 19277 27930
15846 27930 41405 51607 11949 -1350 11169 -17206 -29038 -33504 -8141 -4858 -17559 -11648
15834 -11648 -6827 20133 28272 40474 27231 5798 -7612 4099 341 -8710 -24797 -51929
15822 -51929 -30567 -35597 -40328 -44719 -41505 -26004 -27787 -15449 -21612 -35365 -21412 22052 8546
15809 8546 1085 28326 17584 30019 22216 -441 -19941 -13780 7645 1518 14608 -11903 -51137
15796 -51137 -55859 -51120 -45572 -45065 -36134 -10160 21710 -7103 -9567 20916 23075 17559 16930 22270
15782 22270 -27733 -66704 -72041 -15936 17020 26893 42633 38798 9524 7282 10097 16789 879
15769 879 -15893 -14312 -33185 -22117 1692 -18029 7304 35430 38542 -6006 13220 39053
15757 39053 39367 19191 6701 -18305 -29196 -11515 -8843 -5053 -1822 14277 1290 38305 53151
15744 53151 25190 -13990 -26855 -30865 -19171 -46399 -66120 -46083 -20139 -19384 5506 14639
15732 14639 -27915 -51213 5139 14426 10844 -20046 -31148 -30196 -2956 -7009 -11407 -33042 -25663
15719 -25663 6559 13445 28298 44352 29841 7035 -20277 -54582 -12406 -5904 7742 5437
15707 5437 -8388 -8477 9963 28706 14329 -1867 -10864 -16845 -12060 -6574 -24790 -28975 -38185 -22705
15693 -22705 -23467 -18919 -26651 -80860 -83415 -44159 -21762 1904 15543 -596 -28164 -49753 -28086
15680 -28086 -30191 -48453 -30259 -31476 -13821 -256 -6144 2179 271 -19328 -7013 -559 8636
15667 8636 3047 -24152 2004 1745 -334 -2086 -7323 -20991 -1055 9588 8669 12045 -17477 -54130
15653 -54130 -78396 -84403 -75845 -29042 -6211 9740 37804 42107 65220 50465 67731 35960
15641 35960 10839 11510 29857 37292 28005 21919 16380 -10171 3164 9140 -15031 -27242 -22217
15628 -22217 11027 42882 19469 -2814 -11089 -31819 -29506 4258 -4966 -14295 -481 23743
15616 23743 47929 37757 22995 -10466 -32966 -20190 -41235 -39174 -25264 -8593 -26714 -23338
15604 -23338 -42027 -33117 2491 -30456 -39706 -33848 -7395 19448 34043 17506 -6402 -29757
15592 -29757 7942 54042 46268 30886 7413 -14760 -2844 7651 -1677 -33899 -29006 -16468
15580 -16468 -39684 -65792 -65859 -29814 1481 -21657 -55128 -44643 -50434 -28037 17831 25912 9831
15567 9831 12568 27279 27671 12177 -27793 -46594 -48097 -35342 -46744 -39423 -43807 -15461 -46201
15554 -46201 -57264 -48747 -29359 -28221 -21049 -35790 -19488 -8366 10590 6258 -10400 -22839
15542 -22839 -48981 -72008 -68857 -70626 -47024 -31665 -20334 -20412 -17154 -39114 -50332 -28125 -33463
15529 -33463 -54705 -46636 -17340 -2863 15407 -9085 -15142 -18225 -42639 -36684 -20094 -15550 5342
15516 5342 29288 7981 -13887 -6036 13546 9066 20339 20996 1641 -13210 3717 -36185 -39936
15503 -39936 -35757 -14018 21370 29765 20707 69735 67116 35496 41033 62353 74659 57369 49887
15490 49887 3600 -5622 28737 28184 -25919 -71146 -71377 -22254 16632 22143 16428 7819 -20647
15477 -20647 -61400 -66331 -60883 -24266 24664 24993 16805 -8018 -16210 9525 32349 19892 -38793
15464 -38793 -22419 -16181 -8301 19031 50456 27883 -8476 -10272 9173 17953 7469 -12034
15452 -12034 -21496 -11770 15613 15627 -12137 -19147 -1832 20428 32592 14027 -13136 -14085 13983
15439 13983 34573 -820 20021 45923 28957 15749 6326 -6919 -155 -11055 -6227 -21536
15427 -21536 -39598 -28485 -28858 -34189 -38486 -42642 -15144 15495 -597 4250 2083 3519 22
15414 22 9468 30438 11136 -6982 12764 51322 58322 52973 28744 14469 8770 -6635 -2653
15401 -2653 -7188 -10952 26303 39307 18175 4840 20300 33813 36017 49466 2329 -46298
15389 -46298 -64317 -47811 -18608 8561 9327 30417 53737 56579 65795 32465 3183 3588 8586
15376 8586 29722 67480 30922 -4023 -2760 10145 19635 -6647 -25130 -55857 -66469 -46690
15364 -46690 -36120 -35955 -29734 -29396 -7129 15133 33832 36000 -18363 -43902 -29027 -2444 26016
15351 26016 57332 54714 41828 40912 68159 57453 29887 -22747 -17594 -12856 -7098 -13061 -27122
15338 -27122 -35540 2357 26245 5235 -25418 -36188 -34190 8431 -13352 -42652 -34066 -24191
15326 -24191 4392 10504 46317 30861 39455 44785 18471 203 1230 -15661 -21031 1555 31580
15313 31580 52255 45092 45112 57787 51800 57492 31551 27371 6573 -37400 -38063 -39748 -17869 -8878
15299 -8878 -658 31932 22070 20724 -3383 -24358 1007 26483 28212 17382 -11263 2884 26478
15286 26478 -3902 -10463 -15151 -33551 -58329 -81642 -95715 -80472 -67230 -40922 1452 4321
15274 4321 15663 -7613 -18278 -2981 -21651 -14463 2093 -18453 -27719 11063 35346 34609 36792
15261 36792 35057 43991 22706 -4841 -296 12215 36102 49096 23104 -25063 -12842 -6652
15249 -6652 -10301 40521 64199 24173 33788 72354 56313 65134 57036 38347 21387 50805 14144
15236 14144 -16010 -18745 -33409 -13222 -9184 -9465 7596 50404 22764 -41891 -18425 6354
15224 6354 12417 14542 26353 29255 18087 5062 5691 14890 11126 24793 -21926 -40547 -31879
15211 -31879 -33974 -21640 -11278 10324 8436 -166 22402 43617 22732 -2688 -7460 18430
15199 18430 29642 4001 3821 7166 6897 3261 -21745 3400 37999 15539 8562 34238 74871
15186 74871 69424 54800 44855 18935 6739 29566 34669 30849 3056 6108 24271 18383 -1799
15173 -1799 -22844 -39747 -31439 -12502 -14676 -28169 -22155 17962 2528 1505 9704 13516 -2090
15160 -2090 4623 -5762 -38511 -65831 -39080 -25713 -52942 -44686 -43364 -31446 -2690 -8750 -14418
15147 -14418 -17533 17899 -3823 -23697 18444 38717 30568 4510 -3355 34808 36339 33192 36070
15134 36070 61626 40164 29506 -5392 -58684 -29079 4587 -4570 -23950 -47045 -34947 -12961
15122 -12961 -30720 -67126 -81327 -43762 -21933 -25145 -44199 3311 32640 -3119 -33882 -35628
15110 -35628 -49020 -48954 -49515 -37647 -31157 -24138 -18026 -45425 -10253 3280 2923 8933 25802 -2834
15096 -2834 -639 8021 16329 11572 -6242 22533 39198 8202 -5134 2643 18334 3807 6806
15083 6806 6574 -12667 10083 7796 6251 23627 36046 30032 22899 42741 13952 -15673 -65177
15070 -65177 -39909 -23767 -8008 -39375 -31428 -31776 -44517 -43551 -11642 -8501 7939 13754 25784
15057 25784 16515 -18117 -19974 -15058 2605 21196 3663 -14752 -32815 -22557 14615 16926
15045 16926 -6677 -11002 611 -4623 -5970 12193 5036 -15379 -45806 -52113 -17456 -6380 -25014
15032 -25014 -40760 -17478 -2596 7447 -12822 12749 18009 13885 -2882 -4222 -9909 -28806
15020 -28806 -47940 -52855 -34490 -7793 5673 5021 -17564 -25866 -12019 36408 27446 20641 30276
15007 30276 47692 33044 6873 12121 15088 -15264 -31522 -9239 7249 11192 17775 7305
14995 7305 -23295 -16200 2134 -14729 -38970 -33920 -41058 -47477 -61366 -37336 -10127 -25165 -12400
14982 -12400 -1428 -18427 -20241 5315 19501 39759 60669 67569 50979 56798 47359 29709
14970 29709 13095 34766 55247 70238 51118 36048 24683 8775 9824 44691 44662 16106
14958 16106 -20174 -16855 -14093 -4890 6917 43636 49443 24920 9377 -697 -3016 21517 14058
14945 14058 -7311 -5487 -38951 -34741 -53468 -44044 -5508 8404 22912 20258 22019 24187 25646
14932 25646 36388 15530 24984 40669 20094 15681 34097 40285 52933 42996 -8128 -45249
14920 -45249 -59477 -51836 -41092 -36850 -56625 -52178 -50054 -51147 -26937 -24100 14629 44524 31176
14907 31176 -6076 -15153 13707 -5644 -48793 -21540 4945 -5232 9514 15444 17297 12087
14895 12087 8275 7142 16374 11134 31628 21205 -16701 -22044 -40929 -70546 -75359 -70383 -37712
14882 -37712 -18584 -10916 -3048 -1764 -3523 -27937 -27690 -8295 -15704 -8040 15481 2482 -12192
14869 -12192 -17531 -13947 4184 -20618 -23424 -4359 -4780 1210 20033 60052 56141 48487 42926
14856 42926 22581 -21262 -9393 9319 15730 1330 23651 36128 10425 -4210 963 8167
14844 8167 30279 11810 -3432 17015 19249 3809 16743 -4497 -10285 -40871 -30734 -7549
14832 -7549 -8372 5173 43755 39883 42986 39591 21709 16860 3460 -1680 -37669 -28108 754
14819 754 43787 45781 1238 3558 -31571 -37725 -27521 -18544 16140 50962 68358 56683 34400
14806 34400 23443 29130 21165 28917 27853 -15342 21631 22489 25882 39854 22361 4956 34950
14793 34950 65813 53176 10373 -41957 -64869 -55286 -24139 -947 16279 -13815 -5149 -8938
14781 -8938 -44703 -70974 -46277 -23936 5492 -1490 -12692 -21465 1418 24424 40278 44847
14769 44847 -13960 -18513 -1624 243 1895 -3446 1515 12742 -23874 -55501 -61357 -31527 1242
14756 1242 22409 35167 27754 16381 27465 7684 -30884 -18003 1305 35058 15467 6790
14744 6790 20345 22773 31288 20003 17970 -33582 -49400 -51000 -42088 -25684 -27972 -22414 -18397
14731 -18397 -10412 -25699 -22997 27940 9032 -42369 -12452 33438 43756 -8739 -24746 -10566
14719 -10566 18601 41617 -10287 -22709 11131 -9238 -16781 -7104 -24953 -9584 -14479 -21539
14707 -21539 3523 -30970 -35677 -36274 -42873 -49667 -32433 -28453 -24752 -3918 49202 58734 32245
14694 32245 16054 46329 16720 -21030 -3186 487 13156 33923 51595 39842 3275 26274
14682 26274 12861 8174 -3360 -5394 11064 27693 25194 34736 62477 38956 30982 48010 45278
14669 45278 41876 51289 48072 29847 -33716 -20708 19969 39006 10336 13123 16779 25096 29091
14656 29091 19785 22844 28811 9125 -7625 16176 18364 -5066 -41630 -45818 -28176 -10400 -2870
14643 -2870 5490 4113 -42761 -88800 -80007 -42982 -22173 -34374 -25077 -40992 -53758 -27884 792
14630 792 9414 8787 6211 9798 -8645 -34230 -55183 -69002 -48879 -40096 -42810 -37968 -26167 -9883
14616 -9883 3198 -13654 -13037 12747 15656 2551 -14867 -33949 -12585 -3247 -7415 -8996 4013
14603 4013 15573 -12936 -29547 -21030 -10923 -6716 6560 43201 45268 36521 67135 61218 52241
14590 52241 57792 53345 9572 -53902 -63288 -55601 -60128 -18345 -7461 18968 23943 17454 6052
14577 6052 5317 -10884 -14731 -35020 -55665 -45352 -8649 -7549 -18628 -13988 22773 11243 10967
14564 10967 17046 -3178 -23639 -38418 -48769 -50367 -32693 -12659 7220 7850 28689 35213 27731
14551 27731 35895 18990 -7423 14408 11937 17426 5996 29604 57312 76815 67594 25374
14539 25374 -11061 -10229 8995 -15757 1286 -10605 12820 16973 24407 1925 -13836 34696
14527 34696 32963 -810 12061 -6816 -27972 -23976 4137 10205 41057 67044 64714 33458
14515 33458 40039 51967 56876 41184 32814 23264 10351 -18296 1767 8483 7623 -693 -16616
14502 -16616 -39801 -55212 -67698 -81771 -66619 -23310 -26089 -25879 1392 -9575 19264 37259
14490 37259 3399 -4010 -19194 -32951 -7161 1054 1655 1684 -3555 -12932 -7825 -6538 -19818 -48956
14476 -48956 -36940 -54392 -41899 -53258 -46009 -38284 -39443 -48967 -38422 10992 24185 40843
14464 40843 18359 1532 -15615 -14706 -49823 -34692 -20942 -22477 -22619 -12517 -7428 -32680 -21581
14451 -21581 -11581 -3812 -24360 -30271 -2180 12838 -14917 -17117 -24311 -15476 1862 -17662 -10947
14438 -10947 -19699 -49752 -4469 15388 -1337 14574 11639 2742 -240 -12803 10748 35631
14426 35631 41251 27015 -11273 5118 257 -7532 -10135 -18951 -35280 -38166 -12440 29200 51496
14413 51496 54383 15431 -6591 -1540 2869 20456 18108 2196 22809 16416 9943 -5690 11097
14400 11097 29114 161 10060 26348 20841 2646 -7244 14594 21491 34856 48093 25504
14388 25504 -323 16619 39663 40539 15983 -22716 -5503 8586 25297 41566 67575 61848
14376 61848 8161 -3613 7471 -14461 -34201 -7168 28457 43349 34913 26914 13711 -25579
14364 -25579 -60995 -44861 -47419 -50245 -28279 -33477 -32571 -46686 -54650 -22579 17773 18530 13978
14351 13978 6543 -28930 -22104 13867 5451 -17663 -27350 -17036 -4787 248 2016 8112 1222
14338 1222 -20026 -29251 -51787 -67685 -62395 -33463 -6002 -9655 -25144 -18129 -7032 -39739 -61600
14325 -61600 -58835 -29048 10629 -10016 -17133 -14218 1728 16760 28948 11090 -22030 -27748
14313 -27748 -6858 -14348 -28699 -24702 15253 1118 -24897 -9273 -7643 -20204 -44442 -47937
14301 -47937 -14813 -10448 -14778 -22192 -26807 -2864 -1315 5265 8212 16019 41052 -15192 -60153
14288 -60153 -78669 -49494 -13992 -19212 -14945 11949 41072 19980 -11842 -8575 -39433 -38519 -37518
14275 -37518 -20010 -6954 35451 41985 77434 89150 49168 23611 5899 -14797 -18451 5431
14263 5431 6325 -4355 -11527 9358 20411 -126 10887 38316 48115 57004 65521 35182 11900
14250 11900 6030 15026 19211 25734 28742 39237 45759 53512 29393 14037 -8315 2115 4613
14237 4613 6562 -2354 -17232 4085 -14570 -24625 -18953 -22927 1418 -338 -2973 -4262 1058
14224 1058 30013 16743 34384 7381 -19958 -24184 -24483 -32032 -17658 11729 35475 40466 78918
14211 78918 75767 47776 63591 36750 13700 1101 29013 37972 8762 12802 20483 31249
14199 31249 34765 40788 61039 71141 68866 65485 41576 -9905 -32498 -33456 -41917 -54500 -46428
14186 -46428 -58938 -70322 -63020 -61209 -44494 -27810 1615 -6427 -16380 -35412 -43854 -25362 -33509
14173 -33509 -59991 -88828 -65226 -31535 -16318 -15977 -41356 -47938 -1610 33055 35965 8886
14161 8886 -3624 -10281 -29926 -33593 -27015 -36383 -62152 -61953 -39695 -44141 -35779 -28171 -33129 -6285
14147 -6285 16862 47122 54671 59402 68361 67544 48427 27931 8823 -6814 17061 16657 8861
14134 8861 -14816 -37140 -8972 -18240 -8453 38837 65217 50634 19693 10771 -16616 -37864
14122 -37864 -39493 -20654 -36847 -45019 -4208 -3033 -34069 -2868 41842 36896 7317 7211 6714
14109 6714 3361 35678 10713 20028 27187 -1388 27415 14865 -4085 7971 -745 -144 4546
14096 4546 37653 31739 3594 -18488 -26808 -45135 -69738 -72329 -61596 -66120 -23940 -11687 -12664
14083 -12664 -12412 -29464 -25008 -10869 -22819 -60944 -60674 -4331 34055 46602 53791 68018 58798
14070 58798 80114 61580 34979 37376 68402 77372 41472 -4949 -23598 868 6735 21677
14058 21677 23813 25077 30044 43606 29737 41441 38522 28394 8058 -11962 -5571 24124 40049
14045 40049 60033 26084 -31155 -46623 -27252 -9788 16433 -37304 -51861 -44820 -29512 -1759
14033 -1759 30174 4414 -22475 -31183 -42991 -44351 -37264 -58855 -46736 -13071 -1673 -16475
14021 -16475 -20938 -20504 -12054 6209 15215 13399 38673 40504 12946 -18537 -41129 -61406 -35732
14008 -35732 -20578 -24629 -25322 -48876 -58770 -74473 -89179 -63322 -16621 12941 -15907 -4753
13996 -4753 27919 40403 12205 -13301 -16440 -6986 -11437 3783 15628 36125 33338 11462 -2287
13983 -2287 6418 33579 29104 -15974 -9123 -5860 -40818 -61335 -42266 -12933 2134 -5511 -16845
13970 -16845 -9411 10148 18898 -1016 10375 10641 -41819 -60947 -47296 -72889 -55809 -22685
13958 -22685 195 5775 24429 53104 14667 -13102 -23816 -15689 13499 -3287 -11869 -21616
13946 -21616 -18499 4191 8207 1523 -10656 -18454 -12715 -10614 1474 -19139 -26756 -40870 -60970
13933 -60970 -32000 -2609 10072 18154 -24897 -46804 -44879 -34713 -39473 -43287 -37616 2592 36291
13920 36291 41485 -4451 -68654 -54331 4449 38129 -5818 -16131 -14031 14859 8946 -24330
13908 -24330 -44402 18912 39998 43626 45899 49037 25678 -5834 -26123 -29549 7408 40297
13896 40297 20951 19318 17044 23344 3449 4733 -5926 -32131 -32453 -19724 -9117 27867 44027
13883 44027 49709 23749 22160 10735 -9641 -44353 -58994 -27597 -3356 -7435 -23290 -35889
13871 -35889 -29846 -24328 13241 65195 47207 9905 -25812 -23207 -28908 -9498 39985 61045
13859 61045 53975 22032 -11605 11813 5244 -14844 -1260 -17337 -34324 -42187 -41337 -8566 26191
13846 26191 14958 16749 2399 1645 -7303 3564 1423 1774 13423 46980 59409 57866 19456
13833 19456 -6878 -19281 -2268 12134 24865 30877 19395 5609 11525 15569 7023 5226 9553
13820 9553 9850 10074 20118 -7458 -36155 -11143 18336 28834 12614 4151 11247 11787 4785 15852
13806 15852 54752 63501 30952 20042 64795 59680 57434 34792 58644 39325 42278 20732
13794 20732 -15954 -24050 -19723 -27171 8403 65639 50567 8767 24675 14466 -12160 -47347
13782 -47347 -56153 -14955 -17437 -28214 -13757 2962 3075 -5187 -11277 -23844 -29638 -15660 -6995
13769 -6995 -7423 -12435 5340 30077 2679 -26331 5485 33901 30079 12218 -10751 -7308 10048
13756 10048 36467 46471 54204 42347 40234 8721 -27397 -51811 -48782 -63212 -25050 2193
13744 2193 1645 1748 25404 55483 4075 -21946 7281 -8801 -35866 25574 74040 45583 12955
13731 12955 -2225 -39329 -76149 -51918 -23271 -48305 -28756 19167 44660 25325 -2024 11211
13719 11211 7843 -25946 -25571 -20063 24529 20094 -5625 -2166 -3823 -2420 -20506 -26447 -25726 -240
13705 -240 18583 28326 2149 -1006 3617 -7346 -15447 -66008 -42224 10607 53312 64298 7172
13692 7172 -26849 -21491 -23448 -35777 -47833 -33585 -47451 -33974 -18476 -9526 3374 10508 18540
13679 18540 10317 16297 29809 15340 3691 620 18324 -3148 -22837 -56210 -53809 -47793 -45876
13666 -45876 -28027 15104 10876 -22713 -25199 9171 24956 -8747 14329 32230 21497 3235
13654 3235 -4545 32788 25908 5874 -3531 -8703 -17810 -36071 -31925 -24602 6274 12684 4371 18054
13640 18054 23972 14135 5297 -27497 -36694 -19488 -13620 -13508 20812 7537 4969 -19428 -42792
13627 -42792 -44471 -30579 -65439 -71885 -52617 -19594 -3793 6207 -14118 -6676 8215 -3570
13615 -3570 39868 59364 58524 42210 22301 -33524 -57698 -49817 -55361 -57578 -61829 -51926 -38614
13602 -38614 -53391 -25947 -9492 -13202 -27079 -33808 -62608 -96164 -96414 -95361 -74313 -50665 -27442
13589 -27442 -18059 -30024 -31708 4008 2564 3347 -11517 -15758 3995 7722 4567 7746 4569 5933
13575 5933 2955 -12228 -40848 -88188 -89539 -53705 -1275 15653 44721 44933 37057 -3573 -46459
13562 -46459 -63660 -42875 2903 16273 26094 11614 17287 25082 -2212 -9224 -29470 -35907 -38640
13549 -38640 3800 20354 -3150 -5527 -5138 -33003 -7650 3685 2184 -6463 -2042 -20255 -28654
13536 -28654 -31836 -32393 -14451 33936 24610 19811 29510 60639 64856 41682 53357 35845 28564
13523 28564 -24979 -52530 -45300 -26315 -15195 -15286 -3292 -28860 -29850 -28113 -26865 -19840 -14752 2528
13509 2528 14130 20180 13971 7424 -19906 -2238 20750 36566 10981 10336 31795 42327 -4724
13496 -4724 -31167 12933 48077 48225 42200 29899 10611 -6171 3017 -13606 -27935 -44707 -39128
13483 -39128 -22973 -10011 -17682 -13855 -23233 3832 11120 -682 -10461 -13758 -36987 -3383 32428
13470 32428 17023 -15823 -38957 -45514 -26269 -1631 30427 26010 31137 19671 17187 -13597
13458 -13597 -26057 -22627 1498 -18408 -58122 -51266 -43797 -50490 -36148 -17913 10432 16512 51587
13445 51587 65219 56927 20353 18441 14417 -1264 -16299 -31618 -12076 -22232 -23940 -46096
13433 -46096 -40618 -30056 -34855 -16309 7876 30713 -4976 -18801 -17827 -20405 -6463 2037 -22106
13420 -22106 -10360 20707 50135 31175 -50930 -59532 -8045 39723 40279 33608 9090 -1621
13408 -1621 -6953 -45208 -52449 -19893 -14310 -42163 -42372 -24448 -29853 -47872 -33306 -31284 -52757
13395 -52757 -52884 -37131 -8429 -15775 19319 26446 18900 8670 -8756 -3935 19254 24409 24965
13382 24965 17781 -9493 -12797 6850 -11151 -13953 26030 29125 -3849 -25097 -15848 -23092 -10885
13369 -10885 -23032 -52820 -74013 -61469 -40921 -25023 -2389 -2325 -2717 25370 64591 87023 23925
13356 23925 -50163 -50691 -49866 -47721 -19184 -18338 -63041 -81310 -55199 -20926 -18590 -27436 -23987 -6746
13342 -6746 -17807 -19939 -34918 -14501 -6676 -4358 16220 24362 58645 49235 42797 66840 49572
13329 49572 18676 -12378 -48028 -31409 5787 26351 24514 25290 29602 29501 27731 728 -11419
13316 -11419 6702 22232 7899 7494 20782 41125 45343 22063 9469 -3099 27573 21418
13304 21418 1999 8633 9815 9553 2363 8156 -20196 -38614 -51380 -65462 -19605 -25909 -47269
13291 -47269 -61710 -18410 9256 1862 28036 37646 27092 24834 20138 37487 254 -17271
13279 -17271 -41270 -44597 -33474 -8510 7194 7490 3902 -34534 -58901 -9723 18558 33529
13267 33529 43243 36605 45552 75814 62458 49303 18088 1428 33702 76819 61271 11530
13255 11530 -24329 -55156 -35159 -26660 -38752 -40660 -63949 -60675 -64673 -57288 -63615 -48259 -44822
13242 -44822 -38030 -50262 -57305 -35560 -20197 -3920 14341 10426 238 -16610 -6944 32877
13230 32877 33689 15206 19948 10035 5280 23443 50849 15239 -18656 -52667 -37759 -26757 -28145
13217 -28145 -33645 -30600 -10149 -4169 37681 63675 28485 -15459 -22785 -32205 -56050 -39322 1535
13204 1535 3018 10600 25794 21495 25661 26679 34844 6904 -18357 -37785 -56712 -92105 -101738
13191 -101738 -65801 -34823 -24500 -2985 10463 4975 -17607 -13030 251 1752 -7990 -11221
13179 -11221 -10462 -23744 -56043 -30484 -13386 -14814 6576 -9714 -21187 -11723 3163 -16881
13167 -16881 8691 3399 -23622 -532 13900 19613 -17344 -46287 -45392 -58755 -56297 -36560 -2847
13154 -2847 30546 32834 23004 40573 37962 1206 -15383 -35045 -48228 -53501 -33752 -56772 -45287
13141 -45287 -60963 -58659 -35343 -14227 -5631 -1067 -739 -2449 -12676 9039 21615 53882 90224
13128 90224 66855 37289 16058 22799 16411 7207 -11031 -37868 -23004 21322 36817 35427
13116 35427 25837 31550 17429 1598 14927 -6424 -40146 -42736 932 24224 -14401 -18005
13104 -18005 -1303 -24937 -8216 -16038 -9175 -8705 1885 11034 441 -9047 -54735 -51704 -37714
13091 -37714 -28394 -4909 8797 900 1178 24898 6332 24693 27657 30846 9306 7783 18741
13078 18741 10510 3630 40281 29562 11490 -11309 -9388 12022 32763 31883 23707 -6702 -4362
13065 -4362 -30379 -46946 -51951 -51937 -31488 -5942 -45852 -36318 -1555 -5534 -5755 -11641 -7665 -1623
13051 -1623 -846 -21349 -28762 17014 37049 26198 118 -15262 7724 49514 37196 8554
13039 8554 -3489 -14100 -38615 -42827 -40955 -21381 -24595 -16749 -17253 2601 25842 11966 -16232
13026 -16232 -22810 -37069 -57778 -49836 -57660 -58393 -50705 -41004 -20315 -32115 -29223 2220 11924
13013 11924 -2699 -7494 21638 26050 13733 46290 52038 32977 8873 -730 -28352 -50430
13001 -50430 -39919 -18382 26233 42613 60727 65943 34820 29821 44190 27959 2732 17659
12989 17659 14865 -1925 -5915 -4389 -4201 10764 4162 714 20932 28677 -811 -25670 -52125
12976 -52125 -35998 -21562 -42009 -30635 -21420 -2537 4023 -39822 -63887 -20250 4165 8689
12964 8689 2256 12123 7248 2168 16194 38673 24545 -23859 -24499 -8390 3926 6132 6014 9442
12950 9442 -38291 -19826 -12597 8081 -26551 -15245 -34370 -44152 -36791 -6114 5856 5206 36843
12937 36843 9558 -5110 4677 9258 -7042 -11924 -25796 -29686 -4930 -32971 -31645 -19058 -5947
12924 -5947 -17219 -49334 -49445 -41532 -55269 -56604 -28001 10663 -10671 -29213 -59784 -62105 -48453
12911 -48453 -18484 -26543 -47091 -86237 -82321 -61665 -45247 -7504 -7712 -28131 -18995 -4298 -9997
12898 -9997 11520 -4479 -37345 -35212 -29524 -10447 -6217 -20371 -4209 31862 43527 27213
12886 27213 50424 80533 77795 72160 68870 89272 75076 33213 42537 18739 212 -25459
12874 -25459 -47226 -41181 -41815 -53335 -33927 10569 29743 37153 30726 18341 18631 -12542 5142
12861 5142 16990 -5762 -22578 -10521 -6691 -6871 -24851 -6401 2563 21593 -2769 -15421 2787
12848 2787 24805 19006 19072 5800 -17471 -10504 23535 42539 18852 4166 28524 36628 9316
12835 9316 9027 -12734 -61965 -49935 -9227 8884 7679 15836 4027 -22067 -33699 -27633 -52612
12822 -52612 -59166 -36047 -15402 -10353 -32946 -17306 -13596 5872 10674 -32601 -39518 -5038 31844
12809 31844 28182 26510 37056 57830 63196 22830 -16044 -26537 -17727 -13615 -16780 -23271 -38518
12796 -38518 -29991 13305 18693 34935 22909 24893 11336 -13618 -33067 -45782 -55711 -22301
12784 -22301 -10774 6164 10310 -612 -3671 -4543 -6277 -6533 -30332 -27529 -37585 -65575 -47926
12771 -47926 -17567 -10064 -5018 1362 -24948 -26130 -24886 -23925 -3658 16417 20288 5621 -3138
12758 -3138 31709 46038 31015 10084 3016 -20718 -16549 -9534 -37694 -45582 -21620 -12167 -6022
12745 -6022 11758 32300 30872 31273 45479 49343 25729 26772 33145 32165 30480 -23 -10610 -12567
12731 -12567 -24622 -31493 -45052 -57039 -20005 -13313 -3219 9528 -116 -8490 -25314 -74213
12719 -74213 -80582 -31718 -6328 -780 -14473 5764 -10754 -27241 -32679 -38016 -25332 -12539
12707 -12539 11331 20633 40689 32857 17809 37249 73779 68512 42416 17220 -7249 -27290
12695 -27290 -44125 -27382 10310 5246 -12217 -25148 -53902 -83471 -59060 -7604 27202 27118
12683 27118 29847 29186 38505 25975 13813 -13020 -21142 -27854 -33871 -4246 -9869 -33523 -22405
12670 -22405 31495 25053 -5954 1366 -488 -3386 -17246 2701 399 -22742 -53400 -70197 -44948
12657 -44948 -18032 -4591 -21517 -9849 -8892 -10817 -20688 -13919 -21074 -4136 12213 22606 150
12644 150 -17831 -42947 -45359 -4032 25138 19504 31407 36983 17216 21459 11937 -5690 7806
12631 7806 20746 19230 45974 48704 18342 -18201 -39378 -18394 -1524 22124 28701 -6659
12619 -6659 -35810 -31629 -16198 -1757 -15974 -53449 -50891 -53033 -33573 -19072 -29806 -34768 -3316
12606 -3316 21253 22071 19061 37033 32744 45913 34315 5814 -4147 -18898 -17243 178 -10856
12593 -10856 -13715 -3564 -2317 27174 24218 -9212 -7975 -8337 -21467 -2845 6947 10564 -15990
12580 -15990 6395 20989 13502 19273 24301 -6152 -20684 -44972 -41377 -22517 18155 17324 20916
12567 20916 -17636 -36368 -41882 -50659 -43267 -59899 -65287 -68290 -99715 -85363 -62344 -10088 6917
12554 6917 2930 31093 52331 60796 36831 -19181 -57134 -24263 -21620 -32193 -44831 -15585
12542 -15585 -14662 -28358 -40716 -14415 3686 15696 -2368 -2277 -5910 -6634 -10035 1305 10071 18319
12528 18319 2354 5436 38875 51319 67761 108342 74141 81414 92200 67703 24909 -19092
12516 -19092 -4318 1146 -10538 -53090 -76031 -78684 -45930 -25941 -16937 -26210 -51840 -39218
12504 -39218 -52686 -33701 7281 -6099 -34633 -26810 -32792 -15620 7185 -17773 -32677 -21005
12492 -21005 -19705 -38422 -52423 -47761 -11022 -12741 19434 45508 22195 6981 13489 -5801
12480 -5801 -16084 -5800 -44953 -33591 -13227 1021 21030 -21830 -8533 -2298 -35338 -40529
12468 -40529 -8728 -11198 -47133 -11405 1550 -15027 -41035 -84672 -111604 -94513 -47978 -41135
12456 -41135 -27310 -19429 -24657 1918 -5469 2871 12203 7259 7345 15883 15054 -14784 -25761 -13445
12442 -13445 2453 6821 3735 -3391 7119 16472 -8267 28325 31426 17148 -6200 -11306 -17378
12429 -17378 -50497 -41721 -10402 15773 24045 -1799 -10142 -7158 -8755 -5843 -3247 -6677 -17765
12416 -17765 -6977 -16380 334 -4923 -29684 -45280 -36756 -49308 -76370 -56926 -49637 -16246
12404 -16246 -29589 -12344 25195 29854 39999 6734 -26102 -21330 -34802 -42232 -48064 -33876
12392 -33876 -34091 -25787 -46300 -21284 -31080 -54279 -57506 -24425 997 -8212 -14419 -30127 -29288
12379 -29288 -5252 35003 54415 46912 47490 22989 -9368 -23300 -13059 -15042 -2790 44796
12367 44796 34693 30331 29214 38009 42218 10683 22820 10776 2623 -18815 -27486 -928 40196
12354 40196 16508 -21918 -26042 13134 19786 -36071 -71452 -51737 -20531 14454 10002 15885
12342 15885 30994 22795 -226 -21307 -38633 -9347 -22642 -51068 -24832 -4085 24287 55626
12330 55626 50369 51724 48050 35723 25141 -18495 -13511 -8192 -41632 -58716 -29922 8784 43734
12317 43734 21022 16682 32433 8576 -33598 -40660 -33336 -620 -13827 -21966 -16133 -8265 -9905
12304 -9905 6422 39989 59714 32512 -3980 -3758 -3912 -1294 -2793 1163 -18501 -22628 -26838 -11962
12290 -11962 -8186 1682 38611 28104 -17528 -28189 -9510 7879 1850 215 -14632 -7991 5948
12277 5948 6714 -749 34037 17036 2233 -26711 -37039 -44054 -28687 90 7963 6913 1295
12264 1295 9429 35337 55171 29976 10180 -20875 -59882 -58062 -36491 -37392 -21501 -1765 -1906
12251 -1906 -3404 -7456 -27460 -57362 -55560 -6804 24727 2896 -8928 5507 2794 -7834 8561
12238 8561 9345 25151 14396 -7242 -11374 -38524 -65088 -68326 -30607 -15616 -54034 -59415 -27896
12225 -27896 -55969 -59906 -34488 -6645 -11614 -9931 -21045 -60066 -30995 -9737 -28081 -23326
12213 -23326 -9141 5053 -14908 -11477 -6822 11002 19381 440 -16772 -20392 -28698 -43341 -41654
12200 -41654 -39443 -48028 -72956 -64340 -18213 292 251 27939 54090 41140 655 -12347 -13702
12187 -13702 -27350 -33411 -35861 -17750 -19434 -18217 -4317 9037 7538 -29293 -62409 -20652 15484
12174 15484 1833 -37363 -14056 11638 -22844 -45806 -45632 -36235 -27001 153 20985 7294
12162 7294 -13555 -20789 -21480 -4132 -10551 -1891 911 -5098 20434 23283 9911 1873 -20621 -52787
12148 -52787 -43765 -44510 -32832 -36960 -39741 -25896 -23243 -22857 -14980 -27203 -14567 1144 17322
12135 17322 27950 1087 -11913 -6279 7654 9833 -1850 -3461 -19383 -11840 3097 10189 14791
12122 14791 -6459 -18363 -3225 -12128 -16989 4703 -54062 -38877 35824 12106 -32155 -4819
12110 -4819 8471 -14126 -32123 -31333 -40177 -44600 -67169 -94542 -69384 -19632 -948 38753 52121
12097 52121 35859 16210 -961 7934 1178 -15434 -14697 -29493 -35937 5138 35369 17966 49
12084 49 -15538 -24643 14419 3925 -1084 -2177 7142 -8166 -47879 -50319 -15189 -25391 -49641
12071 -49641 -60984 -29967 -6755 -27842 -65224 -53089 -18085 20517 53009 33545 17429 17418
12059 17418 -834 21203 31017 7395 -17793 -13972 -15371 -31464 -20624 -24901 -43842 -29442
12047 -29442 -21057 -39816 -27621 -31416 -19468 -34935 -49509 -35068 -21356 -8463 -8572 10222
12035 10222 32421 41840 53487 56639 70629 68524 34683 3981 9830 9352 15258 -4224 1533
12022 1533 -11822 -18035 -49741 -56751 -70365 -22259 29029 53207 26575 15018 11932 -30847
12010 -30847 -47828 -21300 -19640 -41504 -41625 -41464 -38019 -23510 -27850 -19702 5400 8825 18017 10621
11996 10621 13281 25338 43038 64998 68325 89543 64013 11649 9610 28629 44084 59901
11984 59901 59557 32057 11552 9941 8290 -759 698 34120 32743 2392 -13315 -76181 -87092
11971 -87092 -48510 -19903 -23711 -41119 -8161 -15439 -45932 -37780 -49024 -56689 -60940 -48434 -8794
11958 -8794 -24231 -32788 7657 -12954 -14538 12977 -9196 -15241 -28564 -30983 -16132 27900 44323
11945 44323 34982 7950 295 24678 3707 -59508 -62424 -65404 -56167 -52340 -48309 -43730 -17285
11932 -17285 -37505 -54601 -40468 -15356 -7950 7978 2077 -5474 -4826 12084 50855 42268 5680
11919 5680 -9401 12374 -1694 -26300 -34510 -48455 -71339 -87565 -71321 -34566 -2449 -7258
11907 -7258 -19951 -19310 -13279 -33309 -68785 -30013 35776 9509 7992 -10773 -6959 17945 24360
11894 24360 26796 30027 25369 15495 987 -18906 -24616 -14887 -23564 -28719 -32436 -53767 -41725
11881 -41725 -33214 -7712 -23664 1394 30381 39496 12504 -8871 -11270 4726 -27917 -26972 -23335
11868 -23335 -27613 -2930 14635 33608 -2431 -11483 -2741 2734 22837 32414 -24955 -45667 -46021
11855 -46021 -8405 32034 14191 -13598 -1979 -4668 -34903 -33320 -58085 -82976 -92488 -65961
11843 -65961 -48819 -66609 -81312 -25301 39569 56062 -3265 -31780 -15164 3746 -16211 -20419
11831 -20419 -29502 -21634 22824 66382 47077 34961 30204 34724 -852 -28336 -29235 -13329 -21716
11818 -21716 -56705 -55906 -10231 6813 -19332 -55886 -67741 -32135 -8399 12225 8022 10499
11806 10499 11437 -44206 -69168 -59558 -53237 -65665 -65508 -36020 -10537 -20718 -10547 1964 26899
11793 26899 -12744 -35758 -31683 -30369 -12573 19808 43834 43976 41933 41247 15178 -7696 22323
11780 22323 -1298 -27052 -15951 -21342 -37800 -17094 5505 659 -4607 -60666 -65232 -59643 -60704
11767 -60704 -45702 -3063 18677 3867 3982 -15842 -27461 -29789 -38743 -56678 -24953 -9197
11755 -9197 21636 35069 13799 -25138 -21790 -3585 -10926 -25392 -12520 -11218 -32034 -43775
11743 -43775 -43308 -9863 3593 -31359 -33561 -40746 -28926 -66575 -80618 -69543 -73278 -39918 -8917
11730 -8917 2484 20678 -20161 -56287 -34059 -5387 19802 28562 38848 32596 -3986 -32822
11718 -32822 -43320 -67697 -65000 -32353 -34261 -33254 862 31647 34921 12435 9437 -3388 -53582
11705 -53582 -63029 -54901 -33776 2939 -11737 -25440 -48555 -50019 -53235 -72248 -38820 2353
11693 2353 -21100 -67911 -52358 -11329 12907 -7299 -26654 -27666 -56599 -93471 -96118 -85431
11681 -85431 -102630 -88832 -83532 -84915 -70350 -41941 -18061 -17736 -45793 -76068 -75983 -28240 2968
11668 2968 -14207 -2434 -9154 -5092 -24139 -8681 -20225 -52583 -56066 -42607 11113 8511 -31122
11655 -31122 -61898 -76860 -94252 -80456 -47913 -27586 -6425 -16110 -45661 -29906 26013 35010
11643 35010 26207 16161 11851 18926 3967 -3024 -26850 -24864 -20054 -23622 -50412 -48763 -70440
11630 -70440 -69443 -67499 -56813 -41023 -35581 -32953 -34969 -35531 -33520 -26346 -39140 -44708 -46589 -33435
11616 -33435 -23599 -10644 14737 22786 12391 -27347 -32894 -62773 -49872 -7605 -19214 -66507
11604 -66507 -74049 -43512 -32733 -9772 -19722 -15533 -29608 -34924 -52585 -48460 -19340 -46276 -64342
11591 -64342 -59495 -84188 -110499 -133892 -107336 -68910 -45681 -56056 -67508 -65593 -52930 -40407
11579 -40407 -36059 -62559 -95351 -99307 -77616 -55112 -72429 -59767 -18570 -20070 12636 33339
11567 33339 36912 18409 7498 -3431 11039 -21621 -32200 -14963 -40683 -50502 -40787 -42434
11555 -42434 -41727 -49582 -57659 -58072 -78748 -49159 -37381 -12465 -56190 -66598 -39332 -22163 -18868
11542 -18868 18128 -2363 -31598 -23614 -2930 -4629 -60269 -91540 -81679 -69209 -54231 -12385
11530 -12385 5132 5335 11586 19168 -13006 -27589 -57448 -58021 -39810 -38639 -23389 -16007 -22338
11517 -22338 -20099 9486 -14537 -21725 -37008 -53790 -32397 1763 9496 23324 32223 9703
11505 9703 10514 1882 3983 -106 4552 -27829 -75581 -85651 -81887 -72898 -47259 -36510 -14507
11492 -14507 4070 10027 -14705 -15747 -16669 -45123 -116864 -108466 -83466 -76845 -61218 -45226 -48933
11479 -48933 -40771 -31293 -46647 -38046 -48491 -55221 -83597 -32425 1820 7027 -24207 -14059 13169
11466 13169 13086 13639 9554 26510 9530 6504 14916 -1997 12314 -1275 3246 49949 58127 65246
11452 65246 72667 63972 21929 31243 -8185 -19829 -33487 -65224 -78217 -86049 -81819 -64155 -42160
11439 -42160 -13556 -6391 -59797 -63826 -54406 -18589 26847 38218 30189 22181 -6065 -11199 -1411
11426 -1411 29040 27466 22591 1366 -9449 -26145 -11068 17986 54258 16794 8950 -2260
11414 -2260 -22240 -53450 -77550 -71572 -64618 -55201 -28062 -30367 2495 42070 28343 19285 12811
11401 12811 23028 25107 15460 27322 32491 28664 33816 40870 25649 6110 -24136 -46998 -56296
11388 -56296 -72415 -35740 -14788 -24330 -40403 -68917 -42246 -29825 -10080 -3580 -19255 -37397
11376 -37397 -28774 -12738 -26883 -11416 -2549 -28528 -46399 -16421 24278 27936 -7437 -18923
11364 -18923 -39274 -82252 -81531 -78286 -69673 -59178 -27112 -15286 -24642 -38892 -14922 -626 37460
11351 37460 31753 -16987 -41290 -34589 -25938 -15357 -23487 -20320 -22304 3760 15106 717 -11320
11338 -11320 -33303 -48664 -38383 -32336 -25785 -43484 -67570 -32653 -18370 -18750 -11605 -40871 -57300
11325 -57300 -61825 -52245 -66766 -38031 -18970 -23873 -36788 -67330 -77426 -58616 -16688 -38139
11313 -38139 -55972 -59367 -31721 -32509 -34992 -25429 -32528 -10260 -13549 -32408 -67340 -67314 -72792 -91207
11299 -91207 -78709 -93733 -54933 -30043 -33159 -33256 -13636 30225 41921 22083 -14335 -27444
11287 -27444 -14744 4954 -12652 4394 33735 7243 5873 14946 13673 -10414 -7693 -7838 -8346
11274 -8346 2904 1754 -27736 -36724 -32181 -28374 -2652 -8221 -57001 -45655 -38901 -59413 -49741
11261 -49741 -49714 -36327 -34254 -22116 -19706 -29481 -36313 -49066 -57025 -49680 -47508 -10687 -7224 -29491
11247 -29491 -30511 -5214 -8925 -50514 -50732 -38787 -31622 -39836 -16142 -23449 -28014 -34670 -35920 -37958
11233 -37958 -38199 -28646 -29628 -1447 19114 19917 6180 14990 22737 31233 5036 -22809 -10661 -24937
11219 -24937 -36625 -72942 -82108 -55389 -59371 -31675 -4405 -2162 -20140 -4519 -33288 -61672
11207 -61672 -38542 -24600 -33984 -9690 -14430 -14567 -12173 -33243 -40548 -53527 -54664 -38053 -28682
11194 -28682 -24552 -41399 -68071 -87652 -98275 -71597 -61310 -47203 -5738 4109 -25497 -22328
11182 -22328 12381 43877 -9081 -32064 -29448 -38764 -46211 -67593 -74120 -56476 -49766 -24180 27158
11169 27158 35524 -390 -55062 -89788 -89541 -68560 -97340 -110516 -96809 -100973 -72779 -53346
11157 -53346 -64748 -84953 -96076 -60204 -35556 -60502 -82462 -82264 -67366 -60427 -75549 -49261
11145 -49261 -33430 -52277 -58468 -30165 -30298 -43071 -54880 -22902 -1918 21344 15332 -29592
11133 -29592 -37908 -23105 -33293 -21218 -4836 -20333 -38637 -36912 -62017 -61679 -40753 -31046 -26660
11120 -26660 -14157 -6093 -3294 -11871 -30015 -4747 13693 37861 30026 -9958 -37665 -38529 -29625
11107 -29625 -42451 -41948 -8645 5593 21363 30065 25419 32837 6985 -24051 -31650 -13853 18257
11094 18257 17235 6222 -15132 -4234 -18720 -4488 14462 18826 8793 -25309 -40220 -25187
11082 -25187 -8402 3790 -2620 -29760 -60559 -76961 -58434 -46304 -76399 -66737 -70733 -58780
11070 -58780 -24657 -2089 -37023 -36607 -36612 -47301 -68216 -56923 -59463 -37491 -31557 -7649 15012
11057 15012 -3099 -28357 -24231 -35765 11162 78693 115134 145548 180598 262563 417534 548724
11045 548724 676493 777168 877925 1033990 1195280 1397943 1656143 1963107 2409261 2713970
11035 2713970 2397444 1895331 1677293 1753224 2066299 2106301 1526899 923959 586999 397665
11025 397665 316919 298653 259697 249874 258485 234361 222697 255944 315311 383299 434992 455734
11013 455734 414905 394752 341009 315339 302794 257467 208754 188432 116183 61697 43360
11002 43360 38123 32168 33986 36728 26181 3565 -12056 -17504 7914 23414 4309 -26814 -25267
10989 -25267 -3047 24379 48194 21828 27223 6365 -9481 -13833 -39175 -32516 -13691 -1810
10977 -1810 10158 1530 -13399 -40579 -58518 -43849 -41806 -32848 -21947 -36865 -18090 6395
10965 6395 -4808 -6979 -15137 -27556 -42478 -69816 -50508 -49875 -64187 -57856 -45836 36134 99242
10952 99242 102143 55018 -2199 -24235 -16874 -17088 -60832 -85422 -81724 -82933 -100148 -85898 -60779
10939 -60779 -48798 -58674 -60111 -66647 -90164 -121863 -114930 -79386 -86396 -105018 -92531 -89759 -111112
10926 -111112 -87356 -48496 -50521 -78511 -74497 -67489 -82690 -100662 -93123 -68847 -78708 -75715 -67536
10913 -67536 -44620 -26585 -67066 -90384 -78829 -90420 -112452 -93474 -53978 -80110 -93966 -69308
10901 -69308 -36163 2959 32465 30451 31115 42244 73496 76598 83672 91569 96370 112410 137396
10888 137396 142868 151728 158655 172983 188189 221275 253558 212887 173706 184431 205764 181876
10876 181876 186854 177198 210601 223189 185880 158392 145094 153823 121675 97636 111254 146172
10864 146172 169496 149857 77248 32669 46889 67011 94939 76663 45435 25647 52268
10853 52268 76521 77424 85753 77815 82626 46184 54966 36063 43262 40515 12739 -1445 6961
10840 6961 5218 -13076 -15756 -40405 -49342 -22881 -10112 -15505 -24620 -5483 3952 -626 19537
10827 19537 16601 54232 75015 78833 46709 36000 81692 141249 144054 127985 148352 159681
10815 159681 173852 140682 83264 97701 115442 143405 118100 113132 81768 62642 68223 94058
10803 94058 77445 51042 16802 -20983 -25961 -9835 -7743 8476 48087 74181 73674 49183
10791 49183 35439 15313 32922 56854 47633 24645 13072 -6984 -7229 453 28929 27785 57719
10778 57719 51933 43072 43371 82017 98185 85348 109627 142882 138511 98282 77568 73508 108754
10765 108754 97332 131724 180634 171323 183381 182139 166682 148933 155858 216191 267436 265015
10753 265015 251476 175406 101897 49229 60989 80390 62084 47408 11099 -40576 -68934
10742 -68934 -10568 80401 107794 37623 -40168 -50794 -14544 23166 62016 89295 89523 76128
10730 76128 104421 108736 103364 112943 88221 68205 91009 99469 85974 20533 12812 88326 124120
10717 124120 114593 99022 76694 85339 154819 148959 99814 83713 94814 122148 166351 184899
10705 184899 193238 205606 223432 231217 228262 236131 261434 308465 359409 387015 368683 356721
10693 356721 379743 427010 395792 387003 412303 418761 455457 535058 615596 596310 586920 646469
10681 646469 685166 686230 736159 808826 863013 900510 948097 980666 996877 1070362 1202119
10670 1202119 1296122 1340352 1409380 1474764 1532961 1589017 1619848 1659064 1755041 1945309 2198533
10659 2198533 2472053 2781333 3116264 3523557 3959143 4415580 4935070 5455708 6042310
10650 6042310 6787420 7769526 8918946 10240972 11522281 12318519 13327459 15161581 17838630
10641 17838630 21434497 26077831 32317104 42455912 58465486 80719633 106092407
10634 106092407 130186418 150882903 169414919 190651815 220014086 257964426 304751785
10627 304751785 364780192 446146744 506339454 445794639 344521110 305461146 322964255
10620 322964255 380554626 399638956 294188471 178112652 115703922 84769090 68729567
10613 68729567 60145228 55930903 54289872 54185602 55625791 58287874 62444130 68780191
10605 68780191 76991767 84362495 83790369 74690907 66341095 63409650 65242283 66355896
10597 66355896 58617081 44383160 32042624 23677409 18394543 14943972 12543927 10872056
10589 10872056 9712775 8767193 7901880 7157472 6545972 6076355 5721475 5383079 5087789
10580 5087789 4750404 4431856 4159841 3900676 3699939 3552712 3363693 3182562 3074445
10571 3074445 2938229 2761080 2618011 2523359 2466247 2392972 2342554 2281623 2213662 2096922
10561 2096922 1973311 1892892 1871163 1825528 1779215 1721971 1648573 1584870 1528013 1485713 1478376
10550 1478376 1492373 1460904 1437932 1389311 1353962 1301116 1279866 1273327 1270702 1275015 1256975 1209327
10538 1209327 1168566 1136471 1104439 1105346 1083102 1069647 1061461 1033725 993955 969588 944974 910894
10526 910894 927451 935973 948642 937561 918498 896810 873402 905019 919289 908176 879009 901333
10514 901333 947561 957914 982118 974573 934627 930301 991757 1019704 1003041 988951 978358 1015055
10502 1015055 1072247 1043421 982386 930308 881131 860768 880005 825719 807938 825307 795897
10491 795897 745329 689618 676220 677758 681408 682793 657011 603943 565112 551407 539085 529213
10479 529213 514344 465779 467967 485849 488946 492663 457871 452483 473218 426961 416713 481054
10467 481054 515006 479442 436076 371774 389746 446271 440643 440951 426923 357815 343553 343352
10455 343352 339434 328750 355644 378138 379295 369929 356425 323314 295372 322470 285848 247650
10443 247650 200660 210870 207944 170201 117054 117779 143406 173750 189174 190041 150295 154333 166582
10430 166582 151918 157454 185425 245706 238781 224779 226968 194771 150451 158809 204157 247927
10418 247927 254708 252268 251799 226341 212459 224870 245614 230504 232305 241222 201310 185582 179692
10405 179692 154853 171308 206539 189903 174460 203705 235198 215922 197921 173211 154701
10394 154701 144164 155877 176032 214162 203985 208993 204172 169351 159900 156950 181364 194834
10382 194834 222847 216385 217284 223060 231074 273798 264740 198571 160917 146296 129428 124898 130074
10369 130074 118671 149553 174961 159334 174631 205720 190439 164681 124168 118694 159034 149844
10357 149844 146581 133096 126277 125388 128102 138948 177669 171199 157771 135595 139802 147398 159827
10344 159827 155317 127473 112226 115451 129831 143458 178252 205437 207340 230360 186937 133123
10332 133123 128008 116957 157359 204953 198824 225798 231114 191563 201672 226869 226425 217511 220162
10319 220162 221098 196437 190133 185898 189661 186272 193180 200978 194275 166644 159756 174524 164416
10306 164416 151997 132595 103105 77083 105420 96270 92359 124732 157156 160721 143878 116269
10294 116269 110909 113339 101295 105967 134643 138886 115397 117960 126379 112480 122744 126518 130428
10281 130428 143867 146102 140938 111851 119063 115519 116423 132621 138264 130716 118058 87985 111542
10268 111542 109495 129370 141878 119658 97972 71518 91439 95813 134351 150903 147265 144554
10256 144554 169314 168545 177120 163328 150362 139703 120672 101503 129203 139328 120125 122155
10244 122155 120127 127520 152907 167123 134872 133510 198467 196303 167686 169139 150800 107786
10232 107786 119034 104209 93544 129369 136019 130431 125693 134418 130425 145397 192533 266251
10220 266251 377745 566105 698491 812372 946081 1080467 1224181 1384794 1610430 1880809
10210 1880809 2173963 2606253 2812086 2354894 1884945 1746583 1890114 2192823 2181195 1526345
10200 1526345 931348 608264 461368 419589 415288 395088 392287 404289 425763 408573 451818
10189 451818 505129 531965 484649 412430 379375 390534 421795 412039 363354 333980 286284 242751
10177 242751 209942 157365 139638 159625 156725 160438 159201 127302 86003 77870 115565 142029
10165 142029 174527 152096 106082 113350 112368 85543 79140 79374 107267 131232 121099 120524 125189
10152 125189 84571 84223 83032 125841 111363 89387 87546 81829 81364 96729 98402 122213 142312
10139 142312 105725 75350 76079 77578 82641 93681 73318 96100 80646 35532 37054 36340 50938
10126 50938 31305 46170 78199 107153 100190 73247 37467 47687 37961 67245 52455 48194
10114 48194 57873 64249 87022 104790 95260 90718 79351 77706 55064 23910 54032 126846 97921
10101 97921 42965 32354 34722 40333 61809 41044 60537 48414 51279 24595 32221 58212
10089 58212 58621 65644 84129 96528 92381 79913 76066 91937 97901 108907 84918 75759 69724
10076 69724 69187 74697 75877 100281 88930 69227 50278 19622 2618 8968 18603 23922 -605
10063 -605 10048 39024 67188 74434 89069 94499 84735 91119 95702 80141 101155 94240 73486
10050 73486 87998 117576 115893 100640 98366 73127 67407 83674 85743 61399 67019 83369 94106
10037 94106 72830 56270 41082 -4944 -40681 -499 25877 36751 48777 70885 57967 39744
10025 39744 65922 87863 77780 56059 43328 76118 97310 80078 63535 34355 30463 10412
10013 10412 15022 31096 62833 90972 93818 82931 110792 123675 154503 155947 111190 65191
10001 65191 46471 30865 64778 68461 43855 68580 66098 52574 64403 79999 89356 119562
9989 119562 103163 83568 43463 23447 19500 54246 67874 55263 41463 40204 64091 43331
9977 43331 16570 20082 40315 40938 34242 26252 3608 21551 36199 17361 -38721 -54356 -16283
9964 -16283 -4592 -6737 12616 34718 32398 41783 60301 53846 33856 34401 27404 44616 73270
9951 73270 67117 46766 36588 58220 50663 34914 51858 36876 16737 25324 25268 19699 53629
9938 53629 39696 38469 42133 18466 19773 23392 17090 17891 14390 29003 46440 48794 41237 14143
9924 14143 20100 16099 -324 9532 34535 23211 27495 30328 24342 6153 475 20039 7029
9911 7029 27772 59037 60437 54975 23624 -8687 729 21254 20950 37642 50754 68987 87610
9898 87610 99198 126978 90403 49090 67246 81158 102121 104583 67359 68016 67700 71911 31720
9885 31720 -3667 22913 35600 31283 15041 14050 4196 27503 62247 27668 23360 45991 44342
9872 44342 43717 49907 32316 4842 -30364 -39625 -21020 187 -7434 -6135 -1003 30633 28976
9859 28976 31360 27384 61697 72772 49609 54163 73446 76080 50309 69734 85729 69544 54149
9846 54149 52874 40928 18382 7666 27378 29542 21151 34138 59846 49773 35691 25733 15137
9833 15137 39482 49248 34780 44910 47172 43354 29776 58079 79882 67488 92681 103761
9821 103761 75850 61211 32104 13495 3938 5366 -25176 -32205 4259 41154 68369 73801
9809 73801 66598 38155 3016 -3325 -21120 -10109 32443 44557 59069 73174 77136 62752
9797 62752 19360 15146 17417 8603 27915 62703 91134 78098 67283 66766 50619 34447 24449
9784 24449 43404 80217 92935 70912 68166 32684 18191 29807 24428 32743 22592 7375
9772 7375 -3067 -10962 11363 5733 7421 28407 -4647 8430 37740 54057 123944 113746 69332
9759 69332 42262 14275 45308 76796 50922 43340 37272 26639 29339 22797 25364 26695 12371
9746 12371 7216 25618 6505 -12387 -5751 16219 21579 19322 22190 26893 68186 77871 46526
9733 46526 14849 19110 7839 10473 34410 34688 25640 53533 60219 48666 15210 6401 27774
9720 27774 52586 53283 59532 80938 72524 56311 46741 43116 71295 76875 33462 1256 21724
9707 21724 29906 63142 99590 83322 62367 49581 19871 33051 48813 23097 -904 -35960
9695 -35960 -32711 13743 12925 -4003 12677 48156 81552 79476 37444 27065 37967 47642 51137
9682 51137 72488 66116 66609 68915 59593 59818 56466 28443 6076 10643 25553 3625 -3585 -5503
9668 -5503 4512 7041 3259 33834 32685 12659 -223 -11420 -26067 -33037 -8607 11217 49816
9655 49816 33787 -4543 -19747 -24798 15590 60021 67043 54596 27605 15938 22287 31310 30960
9642 30960 28720 27155 13612 10522 30223 28140 -10001 -8628 -21160 -4200 10282 30343 -7565
9629 -7565 15540 22384 12018 10649 36474 33451 -8966 -7715 20164 1933 30006 67933 54611
9616 54611 -5359 -45685 -50185 -17965 -12285 -3559 29607 24515 30825 32830 39813 28997 21819
9603 21819 18012 -3221 -35626 -26446 -9276 22714 33086 27499 28934 13516 -3799 1495 14050
9590 14050 16172 4559 2919 -12588 -52769 -57236 -44298 -10679 -2291 -5557 27630 25674 21365
9577 21365 19545 17467 -3517 -7450 -9477 8182 -11028 -14067 -19523 -3140 29423 -1199 -23334
9564 -23334 17335 20573 3986 -283 27543 70002 54487 21399 3265 -22749 -1240 -28661
9552 -28661 -6067 32455 33785 10213 -16027 -22621 10457 71962 91080 55750 42483 18424
9540 18424 643 -6306 -14064 13367 16984 32585 72796 55871 38775 42554 52130 48023 33710
9527 33710 62363 72136 39176 29474 12479 32005 32077 6119 6119 3774 -1478 24110 32310 53564
9513 53564 39061 73 -11847 -18693 -18493 -871 1907 -10523 -42916 7005 28510 22407 32544
9500 32544 14337 12533 -13618 -13055 -4124 11637 18730 33318 47418 36199 4512 -19352 7365
9487 7365 29233 33677 15028 45783 65962 54831 37309 18591 18723 6224 -1644 4624 43757
9474 43757 55911 62062 64850 69140 46109 10811 25712 47972 61112 72017 47633 42583 25262
9461 25262 24731 1731 -5905 -12918 12126 39408 36863 38408 1958 -39833 -39362 -169 24404
9448 24404 -6988 -12994 2490 -4467 -29362 -42571 420 7820 -364 -3583 14061 24942 26014
9435 26014 21246 21194 24775 10174 24724 32578 27666 25833 26152 34551 17533 15089 -687 -22742
9421 -22742 -23157 -1188 24405 20783 -3828 -35323 -33938 -22358 -21941 -21652 -3582 -8639 -10511 13289
9407 13289 30542 80127 92353 55949 13834 10056 33779 42401 67422 45569 31255 54582
9395 54582 43239 37364 32260 17807 5937 -5404 5786 30693 27613 39562 66643 44171
9383 44171 13419 4268 -11654 -6373 10228 791 -2038 -38581 -25383 -6073 -7234 30512 33439
9370 33439 35664 9898 -17085 -19628 -42466 -30485 3703 -7704 8318 8937 19274 56575 79395
9357 79395 77449 49888 20840 12022 -826 -10863 -39510 -39903 -20186 9388 45869 57272 21550
9344 21550 23578 30614 56919 53567 22538 48736 49200 14246 -5890 -9356 -4114 -30887 -22744
9331 -22744 3700 8850 22813 18709 8457 -9341 9993 11851 14656 1602 -11216 -26204 -5329
9318 -5329 14178 29166 39425 33280 50327 46825 15906 3026 9331 15922 22271 6891 -10862
9305 -10862 -42338 -49941 -28044 -10629 -14972 -13502 -17337 16101 35871 33929 343 -22738 -35560
9292 -35560 -8331 8036 5701 19837 -33719 -56614 723 7430 30612 32650 53558 25290
9280 25290 -27038 -51978 -53258 -7919 42109 72758 21236 2164 -4588 31538 61968 63981
9268 63981 77174 45060 -622 -30420 -20096 -27435 -17723 -4402 -5527 8162 -6641 -23401
9256 -23401 -34741 -17830 1900 10225 17605 -784 2853 7933 10328 12307 3037 -9160 -15145
9243 -15145 20623 18270 26571 56467 63148 68171 42844 25107 30921 62690 23281 -2397 61531
9230 61531 53284 36844 37351 28592 32545 25789 -3142 -21182 -40123 -15990 32098 60107 58158
9217 58158 56812 59889 51737 21886 17406 36758 29102 20846 37262 41618 13417 -19682 -41244
9204 -41244 -7022 33357 24542 6767 19360 27957 16669 10029 37156 66252 57780 15684 47794
9191 47794 41544 26072 49120 6583 -45946 -49310 -32908 -28878 -3702 24578 36589 -16856
9179 -16856 -41808 -22178 7565 27627 40797 -7726 -48086 -11467 23485 2245 -10624 -21416
9167 -21416 -27259 -34034 -57217 -34292 9121 21517 29225 2519 2470 19458 -7088 -50062 -67189
9154 -67189 -46650 -41614 -18675 -12481 -27965 -37536 -9098 -26393 -34800 -329 -2381 -21047 -30190
9141 -30190 -10602 12213 50658 43292 40107 26250 8409 19704 14570 -14203 -33672 -11806
9129 -11806 13288 24132 53876 51369 3608 20157 12618 -7852 -8230 -7563 23308 24456 -5747
9116 -5747 31677 76594 81040 77805 68116 32272 -16595 -13605 4053 -2276 -16020 36073 74901
9103 74901 44346 -3626 -13995 -10482 -13574 -24941 -28167 -64000 -53111 -9861 9714 29537
9091 29537 25862 16434 40120 57175 92792 48277 7016 20576 34671 7615 -20896 -38154
9079 -38154 -15811 -7896 2913 -3181 -20463 -48466 -20274 -1260 -2869 4586 -3466 -19233 -13866
9066 -13866 -10090 -30164 -45735 -42261 -15964 -23494 -42488 -27138 7342 30213 21420 23947 41320
9053 41320 50218 47332 30944 41570 65585 14024 -941 18589 40118 76289 85185 70269
9041 70269 52383 33995 20655 -680 27340 70665 55266 -7269 -18888 1398 25972 27183
9029 27183 -2699 -30347 7011 -21503 -37494 12826 1942 22574 30714 25089 15126 6174 -29272
9016 -29272 -16808 22927 27792 37117 -9222 -13138 20184 34544 35678 29260 54284 35476 35552
9003 35552 56609 51408 73352 81186 54944 31442 24954 32812 28002 46318 48022 16979 -25886
8990 -25886 -33860 -11505 9660 9830 -10454 -12377 18247 19604 -6618 4424 41170 50292 50929
8977 50929 64191 23598 -19341 -16703 2507 35958 29691 24474 25906 54208 83834 68386 15068
8964 15068 -10038 -20657 -4408 16081 21015 9533 2376 13860 19845 6235 2579 -13568 3734
8951 3734 8303 -4617 16319 13687 2557 -4323 25227 48895 44898 50944 50208 39564 10137
8938 10137 -4524 757 -14597 -40889 -25823 26261 42229 45542 11746 17798 48594 40561 31531
8925 31531 40620 80096 93756 35117 16186 13464 42949 84986 90179 56649 36174 41378 75740
8912 75740 63418 61263 50001 17763 57920 34356 12105 18222 23798 56184 60476 36069 27153
8899 27153 9699 38918 40740 58921 95498 85801 93243 89152 72361 37727 12229 18721 17502
8886 17502 12351 16378 25185 47054 15839 20502 23277 35957 20356 35784 39726 47313 65180
8873 65180 70631 44134 19188 2144 18356 35786 33644 19938 3073 33420 43005 33343 1141
8860 1141 -19758 694 49786 49100 12373 -9918 -6945 2218 49031 57140 29751 29788 36352 55090
8846 55090 63641 53659 47455 50881 3151 -3649 -1755 -901 -16737 25413 44311 40475 28357 -13355
8832 -13355 -37781 -19753 -18858 -24376 -16884 1411 2101 -32150 -57071 -44303 -19240 -34471 -39465
8819 -39465 -10571 7726 -4668 -4092 34594 48081 63391 64461 64266 50930 33346 180 7925
8806 7925 -12084 -13371 2203 20052 31329 29432 36455 25749 45775 19564 32264 36360 33287
8793 33287 42073 19958 -6428 -11912 -1902 10218 12365 12649 42909 69759 63271 19318 838
8780 838 -17025 -37642 -21571 -2426 -4810 -13519 15925 46199 27569 29942 52052 42528 55723
8767 55723 35284 -12676 -26667 -4638 -7267 -7013 -1201 -26073 -22904 -38667 -34890 -6862 -19629
8754 -19629 -29926 -29619 -12845 -26791 -66279 -57475 22291 108406 103133 41113 15859 -2022 -26519
8741 -26519 -51717 -16439 29987 19085 -15714 -6325 -3625 -50285 -69842 -45798 5486 -6345
8729 -6345 2686 7924 22656 48744 51363 55838 40277 42971 14847 -3766 35100 85485 73086
8716 73086 37892 14516 4872 13678 24905 -6136 -19629 6032 -4837 6455 40690 68911
8704 68911 42845 16241 9996 20656 10482 -303 17426 35260 18963 7745 15930 22535
8692 22535 34511 49983 44174 38641 31961 56335 93400 89365 85255 74723 66331 72137 41204
8679 41204 -3086 3238 7155 -6960 -16789 13415 47879 83979 106998 89721 72131 47317
8667 47317 31712 31515 46678 57362 57590 59106 58935 76645 25022 -13828 -24830 577 20149
8654 20149 27744 37701 41482 44084 28644 32217 20192 -14594 1981 11732 49241 50685 67095
8641 67095 65162 51423 26717 7084 26514 34226 31633 24547 32125 15043 -6350 -38519 -46975
8628 -46975 -42051 -12931 1597 11232 10108 5924 2997 29645 34869 23592 55470 46633 17001
8615 17001 -17395 5078 18974 -2465 36411 30430 14146 14433 36061 45213 17457 29529 18366
8602 18366 -6865 -12016 20587 41489 11536 983 20080 21715 44185 65443 58165 60689 28173
8589 28173 -3587 -3798 30002 50580 38303 22122 55083 84498 61320 39132 49095 53377 11848
8576 11848 -15252 -18295 5752 21116 30880 51129 57415 30661 29247 51799 43238 40977 23048
8563 23048 12672 24003 14286 38168 54129 41345 -1086 -32986 533 23869 15291 15729 7281
8550 7281 40271 60999 37501 23941 6998 -17721 -6096 -2623 15160 47382 58410 51188
8538 51188 38378 38994 42433 35121 19002 -12180 -22532 -7181 -17231 -39037 -20599 -1568 3029
8525 3029 13425 -2976 -25356 15744 33764 43951 28761 21142 56008 56797 68004 104350 76647
8512 76647 29465 9283 -20265 -15122 -1532 20037 63834 64811 57284 49930 26968 33689 41672
8499 41672 58533 43829 59026 37166 9546 30008 48294 24300 -552 16439 -2293 -4954
8487 -4954 -43573 -49142 -67097 -48696 -42546 -28516 -6056 -21288 -10230 16233 28299 32918 51819
8474 51819 52973 60804 25192 -14766 -8599 14962 30501 11084 -10979 -46230 -35934 535
8462 535 48580 37764 -3443 -44305 -31255 -18590 6172 23607 37554 48223 31074 12698
8450 12698 25236 22910 22419 -1662 -28816 2887 11030 7291 -18638 -30570 -26651 -16931 -18013
8437 -18013 -25988 -27197 -12894 -13883 -29663 -16960 -1472 28561 20058 -25060 -41252 -33087 -68222
8424 -68222 -74890 -57985 -25209 -12396 -11606 -3103 -23850 -19808 -28314 5985 28801 32562 -2713
8411 -2713 -3769 -8486 -11464 -27834 -44538 -54891 -63133 -35971 -33748 -14558 808 37071 51562
8398 51562 64981 67816 35324 2929 -11059 -31294 -7614 24329 28130 -467 -2825 12314
8386 12314 15436 9663 -6293 -24939 -11579 -10927 -23596 -9998 20486 50941 80845 85499 72093
8373 72093 41918 38171 63487 38512 -3079 -21919 -2418 5749 -5861 -23095 -11666 -16420
8361 -16420 18015 34559 23585 15545 31130 45745 37425 15956 30587 24229 12751 14067 25463
8348 25463 23530 40263 33885 23297 25482 49274 73281 83732 85376 61443 58419 54974 51105
8335 51105 26681 -21322 -4673 -20413 -10598 -16967 3275 32995 31375 18049 20937 22933 -11985
8322 -11985 -23797 -26898 -13289 25899 5705 -19374 -6405 -11859 -8613 20908 27478 23074 66036
8309 66036 70335 17803 26848 61763 28205 -9303 9864 53776 18975 -14032 9188 3476
8297 3476 16741 46275 91889 83655 61425 32270 26673 32694 18113 20744 17096 14289 -20400
8284 -20400 -3466 13268 -1824 -11572 1817 13007 6221 -12865 -35209 -43135 -9589 11748
8272 11748 21540 34197 46745 37483 24242 15880 20366 23856 42584 37936 55864 33446 -12518
8259 -12518 -22513 -28145 -35888 -44928 -51386 -17682 11518 14460 27560 28218 58166 93540 93627 78286
8245 78286 45400 11836 1890 -6232 27875 27700 41014 58069 35406 11771 -12174 4580 17280
8232 17280 37390 50228 46044 24261 6515 18047 17334 3597 16476 7471 -22004 -41464 -4383
8219 -4383 9586 -10373 -22346 -39813 -46982 -16300 1201 -7345 -22611 -35613 -50878 -17839
8207 -17839 -17042 -26772 -17973 -17492 -19797 6906 31441 47866 39717 28776 -2489 7939 29728
8194 29728 -9567 -16207 -1523 8583 29251 43941 27826 34793 44492 18066 20183 53332 70125
8181 70125 87876 82297 64857 29085 23367 -6912 -42893 -40442 -40677 -54466 -18707 9228 18265
8168 18265 22711 21248 18652 3060 -18707 -19087 -8131 -2562 5990 12119 23971 23915 37998 53277
8154 53277 20198 21116 19971 -1320 -14541 9081 31905 29253 1108 11198 28738 24273 30080
8141 30080 11313 20836 2032 -40196 -33802 -5552 -6180 -14312 -3142 35126 39032 17933 -3534
8128 -3534 15187 43568 51282 50796 54643 47537 36425 945 -15725 -22342 16372 18472 12730 32233
8114 32233 16541 -2537 -4161 -22510 -33145 -13753 23341 28645 16302 30176 47253 40461
8102 40461 35629 27408 30051 35098 -1481 -20284 -797 6956 36570 19373 6620 543 -15656
8089 -15656 9417 42660 65016 47464 2058 6912 10412 14089 14027 6772 14884 22005 36890 29804
8075 29804 7524 -9768 14233 34637 42897 19823 21217 24940 50119 37906 22935 -12222
8063 -12222 2248 28052 25223 38163 37412 28341 -1089 5148 14716 43703 45033 20724 5184
8050 5184 26569 68313 73174 72675 30508 1464 -18150 -18035 15747 39669 37201 26250 52940
8037 52940 26324 -3365 -5243 -5168 8718 14574 28082 33525 54285 53911 40312 48408 16822 -40675
8023 -40675 -32830 -27562 -15931 -17425 -42910 -66897 -36705 -16331 -8467 10156 24278 37970 33453
8010 33453 41062 58311 53405 26167 -6027 20800 16431 -196 -5572 13021 -19156 -28050 9471
7997 9471 30431 23576 4643 -2728 9994 -5535 33942 30763 -23632 -64871 -54497 -7221 38056
7984 38056 56180 43436 43047 75789 96335 71463 53282 20161 33416 40924 44883 27586 24517
7971 24517 7600 21095 59902 42473 18988 19874 10151 13520 8587 26918 43868 68282 57669
7958 57669 38109 47513 38789 49733 23808 35096 65178 95917 107766 85886 91265 109968
7946 109968 54940 37486 24581 -2134 -136 -12287 -670 30206 41286 21593 3131 10964
7934 10964 32633 56567 86879 81921 40624 -3837 -27782 -9285 -4192 4651 -1621 -32517 -28374
7921 -28374 2109 -8837 -23360 -16665 13120 15493 29970 40852 56540 72522 80675 32315
7909 32315 5585 1189 17892 63612 85108 79967 76983 43952 38694 40015 34838 19583 40348
7896 40348 45353 39564 27947 28243 37364 43252 62164 49774 67147 76850 42289 51314 64443
7883 64443 72054 88880 57087 19681 -308 -9287 9762 22874 41718 69604 56418 61064
7871 61064 44626 22120 -146 13963 17530 23511 19226 28350 30778 18587 6857 4393 -3397
7858 -3397 4448 -9131 -55 -30044 -28956 -23217 -24545 -20036 -15120 -28303 -38650 4942 25022
7845 25022 17546 476 7048 -10146 -26852 -41162 -54975 -21832 76 4977 19314 -9773
7833 -9773 -22720 -18388 -23293 -9809 1437 8423 16943 6256 -17175 -25416 -21482 -20750 -14983 904
7819 904 -2145 10565 20137 236 3135 20580 14416 3486 12375 20878 -2980 -30129 -9397
7806 -9397 20621 58087 63597 45869 39545 22194 9668 24242 11525 9567 985 -18227 -22137
7793 -22137 -21196 18566 32159 19279 24725 -5259 -21287 -23281 -29082 -38265 -25798 11500 2675
7780 2675 -8270 11833 57825 69306 50909 50264 60690 48707 26120 26044 33892 50352 46557
7767 46557 23279 8138 34572 44417 28688 -13509 -49564 -21103 11947 41575 39804 -2737
7755 -2737 -15691 -39523 -13107 -9080 -4824 -13347 -27599 -14438 782 -13323 -42370 -39182 -30027
7742 -30027 -58311 -29105 -14493 -21901 -42668 -27328 -351 21199 35026 25099 -62 11813
7730 11813 5350 -3150 -240 -25318 -20860 19551 33639 34650 -12518 -41218 -53862 -59785 -38694
7717 -38694 1485 -3558 -8740 1388 -14046 -35049 -5979 10626 24230 17159 13093 6098 46570
7704 46570 71994 61240 11131 -28856 -32242 -10596 27982 26278 29253 20635 -4175 7976 29978
7691 29978 56658 46740 15242 -6593 -13963 -6308 11288 -13174 -4927 28245 34777 9010 2124
7678 2124 -7540 -44891 -45692 -12611 -18683 -12581 1483 -4876 16572 -25934 -20461 -2786 -24667
7665 -24667 -46859 -64946 -60435 -42507 -17354 -33027 -41922 3925 1229 -24475 -43613 -1168
7653 -1168 25899 26057 30638 62837 48358 26535 7068 20077 43337 68454 80477 55011 -3891
7640 -3891 -43215 -25644 -9662 -14099 -48469 -66974 -41161 -15220 -15517 -12205 14095 59240 36747
7627 36747 40952 78799 100670 83399 51066 5299 -24115 -31740 -26413 4938 46243 27217
7615 27217 23265 54503 57750 67308 37087 20276 12379 17235 8603 11357 -3610 -4375 45357 65780
7601 65780 66328 62681 40982 40548 27339 60025 64084 65345 49741 73520 73120 31332 32449 28189
7587 28189 18601 2550 21077 35209 3743 -27959 -11957 33024 40000 29334 39008 15595
7575 15595 -108 -22138 -8453 -9208 -53904 -52719 -50557 -27207 -14169 -9278 -9781 -35330 -15585
7562 -15585 -6442 3233 -1576 -904 27147 23419 19893 -20375 286 18925 18245 2070 8337 -10932
7548 -10932 40967 66768 31452 8663 2941 7721 -16970 -61217 -54113 -62090 -62446 -28556 6668
7535 6668 31357 7027 -16144 -17490 -3138 9573 2798 -16893 -17000 -15528 22441 33888 23036
7522 23036 17463 8923 53718 65802 54924 14172 -18811 18195 24608 33572 12883 -28311 14040
7509 14040 15366 -45143 -67831 -60247 -39460 -30902 -43717 -28141 -9705 -5467 14226 4948 5813
7496 5813 15399 -5041 4016 26719 44275 34897 -7012 -26492 -2444 20388 16966 25359 365
7483 365 -1424 -37496 -55309 -48400 -23264 28912 20919 718 -46077 -89431 -75373 -32696 -29855
7470 -29855 -27405 -25128 -15294 1199 -6143 -14589 -23220 -22560 -16300 -13550 -18501 -24557 -27664 -42093
7456 -42093 -20174 15083 21405 -6301 -11011 -9737 -14992 -13906 192 13804 19063 15772 12742
7443 12742 -25075 -801 32854 57660 52792 34350 21615 15415 10281 32830 26009 4907 -15250
7430 -15250 -12638 -5774 -24956 -55724 -64213 -59365 -34248 -52738 -39888 -28978 -32833 14886 32254
7417 32254 17475 5283 47037 62313 45671 70797 84295 61592 54892 69772 98017 89756
7405 89756 61319 3134 -13867 15463 8632 -13012 -49375 -69776 -36970 -455 -11526 -2453
7393 -2453 -22450 -4833 20193 32751 71991 95903 52600 19418 24819 30129 9612 -2632
7381 -2632 -15763 -32615 -16777 -4320 41008 17597 -16511 -24756 -28387 -38331 -35225 -4687 2806
7368 2806 35000 62786 78626 56257 35015 30424 35141 30507 -17267 -8688 10600 28667 9117
7355 9117 -8323 6437 952 -7502 -29742 -31065 -33259 -55297 -31882 -37073 -15660 23975 30136
7342 30136 25260 865 -20072 -22255 4175 35550 48802 42134 -7160 -12094 21143 10515 -31968
7329 -31968 -27406 -17231 16800 37201 17921 -9116 9306 -12498 -9965 -5129 -30807 -48726
7317 -48726 -66448 -31036 -15375 -5559 -6374 -6498 -11793 -22030 -17030 -6974 24982 38265 47336
7304 47336 49545 47455 38972 45081 37581 41211 31650 -13271 -30581 -39741 -20830 22269 51815
7291 51815 49698 44247 31081 3012 24915 45191 57384 69138 50279 34069 11067 12542
7279 12542 -1652 -12143 -10196 1602 10143 29225 50991 6444 -37759 -2628 -999 -4005 21320
7266 21320 35282 34349 776 -57499 -55120 -17623 21033 50182 51558 81720 60968 46580 60450
7253 60450 30592 70220 73764 59966 26003 14377 13914 -16701 -26564 -12678 3545 -4632 2172
7240 2172 -681 21934 15016 31970 44551 22050 -36102 -53043 -34329 16490 48840 34222
7228 34222 29647 -4328 -1783 21979 50864 55214 44937 37209 16926 -13828 -19163 -15185 -14141
7215 -14141 -9989 23611 14688 17645 2282 7045 8451 -956 -4112 -28015 -29107 -39863 -60017
7202 -60017 -27902 -2802 5940 -13105 -43457 -49722 -42438 -36604 -21106 -23881 -16244 17298 2705
7189 2705 384 12736 18090 -9973 -35244 -29667 14138 25215 34704 29552 21465 9624 16930
7176 16930 20566 14705 27760 18094 511 -8167 -9379 -8550 -13095 -4188 8365 4363 45530 52679
7162 52679 55988 28763 8205 17241 26768 18591 1699 13701 27664 51025 65079 21177 27415
7149 27415 53232 53430 51672 45073 40444 17893 25585 14016 -9165 -2203 26058 43757 5262
7136 5262 -19869 -41538 -58354 -36397 11317 19900 -1325 -3183 30769 16537 28319 31670 56794
7123 56794 49372 -11703 -22183 -7103 -24752 5991 -17364 -34608 -16477 -21627 -34670 17777
7111 17777 47258 8359 -13420 -29010 -4976 6417 -669 -31699 -58408 -34828 -39849 -51233
7099 -51233 -34352 7625 11355 19173 26503 24272 -2579 -20415 -43654 -54391 -42278 -12780 4740
7086 4740 -16274 -41100 -46198 -41411 -16127 6812 8113 38715 31804 1435 32849 19434 9478
7073 9478 15301 -17242 -50803 -44033 -27973 -37080 -37708 -60899 -53422 -31081 -19897 -46481 -90030
7060 -90030 -83031 4117 47508 70867 32643 15238 -7244 3658 30413 27342 21034 12229 43980
7047 43980 87585 100372 62946 22179 19676 28788 26001 16000 -6734 -26145 -26445 -16745 2445
7034 2445 18320 17107 857 17509 28395 29466 30785 55911 52873 35953 25186 3831 -24430
7021 -24430 -22069 11025 -28011 -36213 -36774 -48742 -21092 -20625 -32771 13250 33052 19665 4155
7008 4155 11595 42408 40329 45096 36258 69056 86999 17799 -50681 -43156 -4188 37993 17296
6995 17296 3397 984 -10765 14980 26904 17658 14431 7036 -5209 660 -807 -24812 -39994
6982 -39994 -52062 -23868 -8191 5313 -1868 -4874 -31965 -55587 -22058 -350 23492 14046
6970 14046 -7062 -23695 -38328 -11766 -12859 20403 24719 -1087 -3502 -23386 16828 50736
6958 50736 50827 23573 -10997 -3186 4771 -19679 -7850 -4742 -3386 -28 5479 24788 -5635 -23886
6944 -23886 7734 41061 53851 19357 -16343 -5232 -12983 -18129 -8967 -5476 -6809 9380 6074
6931 6074 -13955 -5020 -250 10153 29116 2257 -357 -2067 -7099 8610 36787 52396 46842
6918 46842 24339 6141 5012 31171 30169 -2297 -23963 -7406 2263 2662 -8409 14291 40380
6905 40380 20891 317 8197 17398 -6873 -24949 -5934 1701 -122 -572 -7637 -12459 -26127
6892 -26127 -32971 -15662 -3741 -4960 -2869 6469 16771 15806 -22884 4101 25221 36926 40716
6879 40716 18733 2016 -42073 -35486 -1926 603 9580 -14490 -9024 -14312 -8767 -6785 -20904
6866 -20904 5546 21758 23813 18001 25058 1566 -6661 -6319 26233 31251 31241 7623 -38653 -64069
6852 -64069 -51017 -27058 -2652 11999 9070 32593 6107 -23414 -58693 -36296 -14289 2293
6840 2293 -1140 5372 16214 26411 19488 24083 12626 24781 14947 -3491 -6959 33904 32462
6827 32462 33343 -5440 -35139 -67236 -72880 -44859 -26314 -538 -508 12341 25614 25541 3593 -25333
6813 -25333 -24820 -29290 -36153 -26041 -3824 12536 13643 14392 22231 39504 19632 1045 -20506
6800 -20506 -7822 8254 7374 3809 7075 15296 -22780 -28651 -5956 13712 39118 68046 44776
6787 44776 -5536 397 -412 8480 5445 -8926 -1991 -4126 -25804 -27637 4010 15995 14424 27880
6773 27880 17072 810 -12355 -25442 181 27702 13151 16972 14723 -16465 -54839 -72166
6761 -72166 -34303 -10803 -14368 -55265 -45494 7531 9023 130 -3543 24736 22615 17718 23973
6748 23973 30693 23832 -638 -3327 -7426 -2622 -321 -16112 -2263 39895 36956 29375 41036
6735 41036 40929 36606 9930 11265 28591 15409 1726 -3599 -7652 -23762 -55985 -39648 -15783
6722 -15783 -23631 -36975 -34549 -44561 -54840 2800 37873 24671 -12046 -21021 -1564 40141
6710 40141 40660 9111 14955 25673 3335 -6128 -25100 -27370 -5816 -28794 -12345 7564 -9816
6697 -9816 -17083 -20441 -36086 -31644 3945 600 -49927 -58811 -36465 -25955 -35835 -19860 -6776
6684 -6776 1246 -21919 -21646 -20148 -18188 26031 30940 20773 11622 -13352 7025 6863 -5910 -16120
6670 -16120 -39830 -16866 -26916 -42273 -8479 34266 37357 17578 10301 24859 14083 -4782
6658 -4782 576 27380 18141 3931 3268 -22740 -49599 -37695 -72388 -87023 -78938 -41648 -12491
6645 -12491 -17586 -3236 3677 -12954 -22451 -23406 -16570 -1305 -7430 -10894 -23876 -9349 -21394
6632 -21394 -24546 -24246 -13125 -26048 616 6141 -5327 -12257 -14843 10743 19043 19634 13760 1682
6618 1682 -3358 30700 41965 37270 7605 -21157 5159 15800 -9293 -5454 -20444 -38361 -68669
6605 -68669 -66496 -49114 -26311 -35026 -22147 -9164 -694 25125 49896 75587 75040 54094 12303
6592 12303 -28739 -32165 -14545 -17347 -14496 20464 -7284 -44785 -55848 -51938 -53625 -36107 -7672
6579 -7672 2192 14980 -7549 -31755 -34435 -4038 13372 12039 18513 35963 33064 -2032 -39830
6566 -39830 -28406 -13356 13802 10304 9285 20389 15856 34097 35053 45867 30707 20894 33901
6553 33901 50707 51075 62393 44639 13185 -12651 -17705 -31536 -16489 -9838 3800 373 -56510
6540 -56510 -81408 -28322 15456 8824 5078 -23672 -46532 -46506 -59654 -53399 -31290 -6517 40368
6527 40368 73065 54006 11401 -27230 -27529 -242 18204 39634 28901 13809 1723 14711
6515 14711 1455 -19796 -21879 -26856 -44848 -49940 -55415 -72858 -75424 -69628 -25560 -22642 -24319
6502 -24319 -52390 -54501 -43246 -17120 -49745 -49928 -23502 -17253 33218 41719 24185 -15203 -40521
6489 -40521 -36104 -6031 35977 23371 19929 8762 -20047 -14878 -37546 -49344 -42203 -19265 2731
6476 2731 -2 2673 22530 22945 6947 31081 65240 33096 -22981 -31546 -901 18028 10024
6463 10024 5504 -14090 -6354 2491 18055 45872 51515 -10843 -36694 -22343 3399 39561 63666
6450 63666 56600 2978 -17121 20951 31797 30165 -895 -26938 -24471 -3038 18371 26476 12634
6437 12634 19037 23087 22845 2097 4058 10235 -24045 -68180 -40971 4581 53565 42704 18545
6424 18545 26011 41694 21384 -7325 -10978 -18539 -15236 8394 19267 44124 56927 24078 19605
6411 19605 50424 40469 40769 26678 11395 -3737 -13202 -16092 -16657 -13433 -2257 -21178 -41380
6398 -41380 -23347 -19478 -23349 -32569 -29135 -16201 -4110 -29893 -26614 -10681 19897 -2969 -2094
6385 -2094 -14305 -20412 39613 66110 46501 28668 30094 22663 51278 51754 14983 4779 -8875
6372 -8875 -26618 -26541 -31097 -57388 -66493 -58008 -30925 -17575 -14974 -8485 564 18084 25058 -7494
6358 -7494 -14684 -4915 -6752 -33007 -55211 -52602 -37937 -29533 9316 -9979 -29898 -28053 -49769
6345 -49769 -17091 30103 16371 18243 -2664 554 16748 8740 10170 17570 2637 -27437 -33320
6332 -33320 -11420 14976 30572 33309 -21965 -30025 -13228 -15411 -1318 10248 10541 1586 3004
6319 3004 1855 -10479 5971 36863 33229 28142 20544 20862 -13796 -20609 -35275 -45038 -32065 -15947
6305 -15947 -55255 -61663 -39890 -32343 -29822 -7023 34742 36063 15639 8374 3249 1683 -9094
6292 -9094 11662 38539 44428 28670 -4081 -18660 -25029 15685 16972 30593 29370 -4660 -5786
6279 -5786 19933 21414 6612 -22184 -41634 -45955 -28184 -40597 -52854 -44347 -882 19862 -7590
6266 -7590 -36205 -3802 -7615 -28290 -15217 -11008 -12886 -17931 -9884 -18720 1388 9962 -28265
6253 -28265 -22845 4990 15027 12994 4666 31882 34196 14950 -6609 6426 -20795 -37477 -36743
6240 -36743 -5937 -2044 -16298 -8619 12091 14678 21852 18843 9882 -5977 -43355 -17712 15839
6227 15839 16974 -10306 -14455 -9824 -14253 -2906 -11304 8389 32942 30030 20286 30799 40076
6214 40076 12031 10344 -3561 -16946 -3149 -20404 -27775 -27541 -54632 -32248 -1861 -20720 -15716
6201 -15716 -8383 -11447 -14128 722 8756 -38793 -44137 -33820 -32481 -41705 -26590 -21558 -12220 -33394
6187 -33394 -49441 -15713 11288 -21395 -20022 -1728 1278 6914 8116 19993 19267 9444 14787
6174 14787 -6977 -18298 -47255 -37962 -40977 -21846 -11311 3766 -11709 -9789 28882 35178 24950
6161 24950 -1435 11136 25506 -7772 -56850 -44997 10837 53131 50002 19481 -15574 -43657
6149 -43657 -62090 -69009 -52083 -36143 -45332 -47612 -35545 -27801 -63335 -58428 -15257 8001 1879
6136 1879 1544 45391 26430 19681 19186 3222 9877 16967 17614 -6726 -1756 26741 -1426 -33634
6122 -33634 -55176 -40760 -15066 -19475 -6309 9336 -2161 -871 -9986 -18569 5650 23386 -14066
6109 -14066 -38996 -32867 -18620 -33966 -64457 -41383 -13260 2770 1097 -666 -6620 -12233 -7810
6096 -7810 11128 -25731 -38252 987 7188 3368 13318 -1938 -3930 1012 9064 -9431 20865
6083 20865 13386 4906 152 -4636 -11776 -28340 -43244 -32785 -17953 -18832 7619 11738 17991 16848
6069 16848 22301 -28042 -48087 -51396 -71469 -76449 -63792 -39240 1939 8861 36543 66154 48370
6056 48370 13306 -18280 -55802 -58317 -38809 -41389 -50205 -9993 20969 -11871 -15207 -8710 -30290
6043 -30290 -10960 20351 -15655 -9801 20879 42225 44339 11128 16174 -13646 3288 8726 -22971
6030 -22971 -30283 -32894 -70957 -76426 -14781 23065 47559 40620 18457 14687 4109 -834 8765
6017 8765 -13496 -41434 -54306 -39901 -12767 11187 19124 37365 32001 21699 28889 43495 29939
6004 29939 27999 13992 -6407 -30679 8807 17336 -13813 -8024 -9353 -28064 -21651 -13683 17783
5991 17783 40058 -10188 -29642 -40071 -41006 -24206 -18762 -36520 -29077 -26246 -27519 -37013 -68462
5978 -68462 -66129 -29217 -10274 2750 -28774 -2725 26539 -2485 -8919 -16911 -33105 -16783
5966 -16783 -6941 -22637 -50983 -47495 -43084 -37450 -42119 -60234 -83726 -103331 -67000 -58695 -63296
5953 -63296 -37392 -7309 27006 35176 -19694 -49084 -29151 15716 17835 -11220 5511 -22375
5941 -22375 -31858 21759 30803 128 -8952 -19207 786 5906 25820 9175 -14304 -33836 17519
5928 17519 60944 46522 53129 57997 60971 8498 -32560 -36251 -57985 -46214 -15502 2952 15486
5915 15486 1680 -25508 9762 22315 13812 -24916 -54537 -55930 -15365 6181 23964 9135
5903 9135 -27776 -47424 -10083 2815 -9691 -32339 -49200 -41296 -55073 -46487 -20709 -14784 -10673
5890 -10673 -23093 -17093 -2904 -27025 -46056 -29172 -36941 -49165 -47501 -35728 -14662 606
5878 606 26396 20990 3192 10143 -12180 -49940 -37565 -3616 -12868 -31434 -23210 -24599 19024
5865 19024 46441 6347 -3617 -2943 19748 7237 17545 1685 -24455 -55546 -53378 -39751 -27870
5852 -27870 -13468 1519 6765 -10522 -17214 -47845 -51951 -22374 -8332 -25 17843 24395 47967
5839 47967 34302 48882 51188 7105 4772 -11799 3148 20108 20047 8512 -2875 19688 -6678
5826 -6678 -50132 -71173 -46621 -13588 -11032 -6897 -3599 17043 16087 -38406 -22405 -20825 -26031
5813 -26031 -32161 -32926 -18605 8455 34857 20202 -10494 -24721 3419 9346 -517 -12953 586
5800 586 -11200 -8952 -5527 -8592 32 -25695 -46690 -8835 34723 16571 1450 -15817 -21362
5787 -21362 -14803 -66091 -89339 -64320 -69403 -44277 -41128 -33437 -78866 -74921 -22854 2775 -21232
5774 -21232 -17684 -20691 -7418 -52374 -69430 -55496 -43111 -1075 11552 17528 -605 4042 -4737
5761 -4737 -11294 -14701 -3436 -17723 -12845 -38626 -34339 -44161 -31616 28468 46486 33087 -18621
5748 -18621 -9720 18054 -764 -40485 -54492 -53013 -20209 12211 11049 4338 -15343 -20628 -12209
5735 -12209 -12491 19137 35179 36888 46396 33539 36894 13035 26279 45322 43397 42410 12423
5722 12423 14480 16213 18957 14101 -739 -7762 18516 42852 36724 2175 4260 7552 18207
5709 18207 490 25992 11331 -1520 -10688 -11828 -26452 -15145 32799 26743 5907 -16532
5697 -16532 -2553 24924 31270 7012 11439 5582 -9030 -24123 -13040 -722 -8293 -11532 -6219
5684 -6219 -23297 -16144 5804 -9526 -35356 -16429 13026 -8796 -25452 -14377 24613 37887
5672 37887 43142 45589 27657 24321 15273 348 4253 12934 8410 8009 -5223 17316 9195 45055
5658 45055 42472 16746 14940 9081 -7274 -15468 12527 21418 4357 11196 -31746 -40541 -24601
5645 -24601 -3034 -14826 -40378 -27457 -4440 21115 87095 54653 25597 28949 34354 18728
5633 18728 8692 -38091 -84003 -94471 -51619 -43036 -36157 -14852 -19396 -19650 -13011 -4321 -14868
5620 -14868 13982 10926 11793 4228 -24800 -24925 -15147 -7280 -8712 15392 43737 20741 -13381 -5190
5606 -5190 26634 18909 26708 19328 21059 28895 7295 -6441 -21737 -4251 -12900 -4296 9757
5593 9757 20575 -28035 -76208 -65642 -37392 -6108 6467 -15114 -9893 -10022 -9549 -22241 -26932
5580 -26932 -12442 4331 29116 39307 34750 10923 3126 -9085 -9699 -4577 -16340 5292 4692
5567 4692 -12205 -14635 26296 38501 19664 5113 13554 29437 62637 51927 15941 -12460
5555 -12460 3034 36712 57187 20785 17341 238 11296 15428 28691 17646 23587 8015
5543 8015 -10134 -27389 -37763 -34828 -13111 -15616 -8944 -3331 -12900 -29667 -22255 -21402 -2388 18715
5529 18715 33292 1545 7002 36208 43935 47380 49843 33592 41523 25855 30453 -25647 -21147
5516 -21147 -5061 -14552 -14747 -29808 11215 3035 -2398 -7838 -23428 -40738 -23495 -3748 11901
5503 11901 7714 789 -29413 -50839 -3343 2716 -1559 8563 10571 24729 19361 9138 3337
5490 3337 1848 -11952 9104 25767 40509 3148 -4434 -18575 -21670 -17649 -30691 -45158 -12732
5477 -12732 -6826 -21749 -30641 -31822 -25065 -48304 -31475 6985 10158 -2861 -27911 -51064 -58515
5464 -58515 -57410 -4592 27934 37957 35498 40958 39724 42777 33363 14732 4836 -4826 -8501 -10022
5450 -10022 -18941 -1054 10778 -29742 -49289 -19327 -14905 -238 3940 -8314 -11276 -357 -2746
5437 -2746 6736 16988 32215 36593 3286 -15246 -31565 -17374 4939 18595 21253 30214 28252
5424 28252 57133 60226 54570 19533 -21647 -14620 -11066 -35503 -57402 -42472 -32460 147 3806
5411 3806 2823 10164 29467 25135 61197 63901 53775 30094 39433 32582 -14827 -20389 -37076 -62434
5397 -62434 -28045 6955 26079 27509 -3939 2120 39745 52975 35922 11753 -2499 -20629
5385 -20629 -25827 -30669 -8124 -22276 -13130 11191 1906 -15094 -11864 -33506 -42099 -38986 -32713
5372 -32713 -21429 -13464 -8587 -7506 20693 60104 76401 61559 38460 7638 -15974 17490
5360 17490 33063 8802 34126 70763 39787 4318 1828 3800 -18481 -27805 -9877 21489
5348 21489 69387 60036 46728 32850 46272 58371 50494 52842 47315 32101 17825 9029 -21966
5335 -21966 -42770 -40799 -29110 -60893 -49222 -18001 -1567 -12581 4206 -8072 -15222 9661
5323 9661 22152 25835 6796 -24007 -19575 -21302 -16343 -16844 -39599 -25615 -18600 -8260 -3189 -19650
5309 -19650 -10369 7539 9899 964 -43912 -66083 -60632 -46531 -38252 -7958 27622 17494 -5235
5296 -5235 -4119 -5253 -19223 -19724 -17072 -24394 -60926 -70798 -52877 -35713 -21612 -28591 -27970 -37842
5282 -37842 -54901 -9167 -3227 -17471 2759 24686 32311 17940 -4687 168 -4028 9764 17139
5269 17139 31388 40181 46423 59377 45161 34314 22140 -8849 -34964 -53366 -33577 -24185
5257 -24185 -26411 -2674 24410 39022 53594 54361 25533 33369 44562 27117 18357 9418 7531
5244 7531 10993 5917 -6361 -7872 -36730 -57050 -27729 20638 39991 37001 7266 -7030 22638
5231 22638 63034 52712 39648 17105 -4745 -43080 -48902 -7923 16347 846 360 13719
5219 13719 5605 2426 -23086 -19601 -20701 -18407 -25063 -1004 -11036 -13453 23198 18622 1932
5206 1932 -24089 -22980 -45313 -26727 -25639 -32553 -6327 -23791 -27807 14375 14482 -14480 -26789
5193 -26789 14263 20481 -7056 -9996 -27328 -43909 -21673 2331 17972 31860 52729 32543
5181 32543 27042 15215 -8478 -36582 -14839 8901 13911 26776 33920 19850 9985 46135 40362
5168 40362 30919 498 6125 17176 -6186 -6617 -4965 -26175 -59576 -35105 14121 23707 6241
5155 6241 4263 11896 37380 20770 12439 40600 85129 65628 26801 -10140 8435 45228 89365
5142 89365 72152 18069 7792 19234 31254 12572 -23956 -28176 -29034 -33504 -24847 -50464 -76555
5129 -76555 -51418 -39841 4231 1415 -9183 6732 53703 40195 -18355 -53086 -51924 -31984
5117 -31984 -21235 -69059 -72066 -59069 -53408 -25263 -5559 -8840 -1613 -26870 -33794 -30792 -49794
5104 -49794 -46496 -55342 -53574 -9705 57682 52191 36018 40672 35567 43238 47335 34148 40852 33543
5090 33543 13715 10811 37119 42428 34635 19722 24248 16391 -282 -1699 -6427 -20087 -12621
5077 -12621 -30224 -55357 -41752 -45534 -46199 -19654 -15433 -1098 -12125 -8033 -6006 -11972 -33881
5064 -33881 -46254 -63520 -57069 -16813 31559 26008 29818 10824 1624 -25658 15026 32050 -6170
5051 -6170 2083 34120 35640 22873 -17747 -38112 -35702 5499 43944 35625 10620 9984 8836
5038 8836 -9440 -5717 -20009 -15704 14976 21787 -4605 27517 28164 22126 30552 7672 -1126 18376
5024 18376 28224 29140 26710 8887 -12856 -17447 715 25307 44948 36380 25362 39380 31549
5011 31549 17032 -25257 -58070 -34666 -20007 -33587 -56960 -52255 -27914 -56676 -54395 -11073
4999 -11073 -43594 -71590 -51918 -21088 -26478 -18931 -47490 -66647 -71230 -81343 -53825 19134
4987 19134 6 -40572 -22146 -27418 5242 10069 1023 30553 30704 -373 -15039 -11240 -17435
4974 -17435 -40394 -1413 28885 -7211 -22122 -49034 -14456 13113 -8637 -32486 -5792 -6998
4962 -6998 -38929 -73547 -53048 -46879 -51068 -73380 -52599 -31952 16465 48095 40439 19690 14329
4949 14329 23861 16990 -9940 -52596 -72751 -60530 -50725 -19441 -15411 -31552 -9503 10104 37303
4936 37303 32427 19122 13816 6311 1857 -18372 -18429 -9000 22335 47872 19548 2249 -17457
4923 -17457 -38273 -33610 -23852 -5277 -1636 -18068 -34725 -10964 3802 8153 4988 10336 -1111
4910 -1111 -17018 -13371 -5157 -2513 -37030 -52016 -39035 -55625 -48084 -65702 -62088 -47981 -42830
4897 -42830 -28271 -23699 -30164 -31008 -31035 -5186 20080 9645 -3748 -51302 -55755 -7370 48966
4884 48966 27485 4510 -6594 17091 23015 47273 42955 9445 -4355 -16868 -4777 12567
4872 12567 5029 24566 44656 69403 59232 28498 22811 10895 15284 28957 21118 10539 14874
4859 14874 38828 37782 4435 -5075 -10943 5660 19968 9547 20974 -3243 -30911 -14856
4847 -14856 -6661 -11134 -19123 -12844 25258 69224 72945 31922 5273 -21926 -7085 15204 7619
4834 7619 6449 6468 -1695 1929 12055 9771 -440 -29507 -37108 -46074 -42942 -36302 -47122 -38841
4820 -38841 -37989 -22294 -30422 -41632 -53747 -49683 -7242 -14149 -33548 -12155 -10952 -11560 -19287 -31163
4806 -31163 -47211 -40610 -14641 -31331 -36554 -29793 -32071 -59168 -30926 5734 -17056 -21225 -18256
4793 -18256 -38163 -60564 -48690 -2460 28651 8974 -21731 1352 5545 -20278 6000 15581
4781 15581 -7749 -32900 -25605 -18037 -27531 -19459 8358 33272 26299 -12734 2715 27425 2814
4768 2814 29262 753 8372 21843 27759 24635 40468 42952 25740 26121 51650 41746 -16823
4755 -16823 -12931 -8982 -1954 25538 12558 -23902 -14615 23453 17532 -20625 -20296 -5265 11444
4742 11444 -39892 -52684 -57692 -38328 4125 55086 72711 47389 10832 7917 606 -26280
4730 -26280 -36119 -39926 -17639 -22336 -28789 -43261 -47251 -33039 -37272 -57555 -33899 -12499 -32998
4717 -32998 -4854 -33984 -31273 19568 42823 27102 18892 -501 -1114 26662 27237 19247 13387
4704 13387 -19359 -27044 -8428 8874 6280 5452 -22060 -27532 -34642 -16671 17565 36815 32635
4691 32635 24422 36541 40542 27727 33792 70648 71280 24659 1014 -30998 -21372 5185 8383
4678 8383 6093 8367 22459 3011 -10869 -25171 -12898 -16760 -40131 -15558 -29392 -40767 -26197
4665 -26197 -39578 -17216 -2930 5635 -7589 -3795 -8211 -19270 -30209 -22494 -5812 21941 80793
4652 80793 88682 58434 33720 62291 72487 67445 55319 18869 -19284 -40745 -47115 -32210
4640 -32210 -14477 -23526 -17826 25564 47697 33085 -5145 -23309 -960 13890 2569 2505 -15813
4627 -15813 -46925 -47874 -28366 -13116 -17563 -20976 -20044 -23320 -15301 17212 26805 -5951 -669 23316
4613 23316 44158 36184 -3043 -20268 -23744 -42546 -32490 -19679 2340 19426 24862 14078
4601 14078 49710 60831 20402 10247 -357 -7655 -20504 -14813 -37073 -50475 -43843 -35415 -44222
4588 -44222 -42329 -11010 -4781 17297 28230 33962 29067 44566 51773 31257 -15287 -32282 3477
4575 3477 51210 63668 70724 28692 -24372 11896 28352 20120 50262 20787 -23724 -41214
4563 -41214 -19598 -2201 -13786 -21475 -32251 -18092 -5910 -13194 2170 3098 16539 2242 -28790
4550 -28790 -38503 -16683 -11685 -7632 -8713 -5414 -16210 -26241 -36452 -17549 -10533 12066 -919
4537 -919 -3440 3216 -5117 -7099 -8532 123 40575 52957 -1457 -1576 6184 -14416 -18562 -46205
4523 -46205 -52445 -22714 -6404 2921 3689 -11890 14020 3894 -13310 -16526 -19831 -38648 -74411
4510 -74411 -79975 -62033 -5159 8915 -22892 7217 49452 59676 42384 18992 52852 95389
4498 95389 103246 85881 70886 53826 28025 38148 11911 8172 29421 34384 7455 -32009
4486 -32009 -34368 -11175 -9485 -16245 -16180 -21870 -60448 -97564 -62044 -65059 -86703 -66022 -40988
4473 -40988 -12479 11906 16141 12978 8232 -791 -32868 -32239 -18841 -27178 -6971 -6170 23413 45069
4459 45069 16230 -7268 747 -10333 -8222 -19717 -39840 -38733 -31833 -17184 -19383 9972 1171
4446 1171 -30308 3667 13479 3123 -24757 -22887 11800 24668 37694 12903 -21972 -19992 -8048
4433 -8048 41414 15014 1126 306 12233 16500 14986 10994 -6650 -24981 -60023 -63999 -53500
4420 -53500 -52044 -42645 -425 28249 40158 31252 41711 29601 44119 44845 10128 -8864 -27185
4407 -27185 742 42162 43368 18688 -13956 -14039 6727 5271 13950 7910 15148 -309 -30467
4394 -30467 -33092 -15284 -19092 -29861 1638 2909 6971 34351 11044 -13968 4035 29451 36891
4381 36891 63058 84836 96489 65396 47993 38840 37235 943 -5672 17729 35624 10730
4369 10730 -38181 -66939 -65471 -46750 -25485 -7863 -5301 3330 18852 23925 -644 -29213 -54691
4356 -54691 -18768 -13856 -12849 -9389 -53077 -51914 -69375 -54357 -38976 -21418 1296 38129 25298
4343 25298 -4358 -9541 21218 19393 27664 2709 1006 1710 -11157 6755 26883 52194 70057
4330 70057 39338 14060 22522 30695 45213 24793 -2498 -2696 -1029 -5922 -10337 -17634 5497
4317 5497 -3801 -10946 2177 2237 -296 -10540 -11566 -15581 1795 12597 1050 10588 -1559 -34497
4303 -34497 -22346 4015 21891 27021 36763 36434 12936 -13995 -14593 -23464 2025 -15242 -36435
4290 -36435 -4667 65 19727 58121 26039 5357 26634 28737 10265 42938 57849 43941
4278 43941 15914 21729 8273 -19850 -36079 -20359 -22229 -29306 -8519 20641 49543 50110 41818
4265 41818 -15349 -48909 -25272 7642 15238 33625 47930 61431 16358 -22487 -17266 -10238
4253 -10238 -6261 -1016 -7922 -1531 40109 31154 38920 22554 22317 12005 17919 9403 2512 10865
4239 10865 -13079 -39348 -21373 -20309 -35190 -20988 -10203 9765 47278 48227 15407 19343 -9955
4226 -9955 2031 12092 35856 31978 -6911 -24664 -23917 -51917 -59337 -60475 -13209 -9023 -9706 -18291
4212 -18291 -13929 -36880 -68105 -66347 -48067 -31388 -19794 4816 -5978 -10804 -23545 -71724
4200 -71724 -60720 -41253 -43284 -27628 5989 43478 61029 63290 66618 55836 44706 23286
4188 23286 17461 -9089 -24412 14416 27987 -3617 -25759 -14954 -17038 11241 18665 -15087
4176 -15087 -15072 -660 -1729 3662 20025 21794 6562 6319 21191 23776 6025 -31378 -47133 -49183
4162 -49183 -37646 -29701 -5067 6684 1253 -3519 -10383 17394 9903 -14633 -5823 14493 -14679
4149 -14679 -37627 -33242 -4214 34669 15083 -16595 -6757 15441 11069 -24144 -44394 -38212 -14126
4136 -14126 -11759 -46358 -50364 -58005 -44810 12933 50078 34024 20636 26395 36736 28586 3390
4123 3390 7228 7368 -19553 7521 22449 -5255 -525 -1175 -43551 -52907 -15553 10120 23748
4110 23748 -11069 -45212 -50197 -24451 -37906 -10312 -10433 -37695 -52666 -22923 4078 1384 -13898
4097 -13898 3448 -633 9811 -18853 -17448 -21528 -4250 -9403 -21923 3909 24105 33903 -11034
4084 -11034 -42228 -21357 -6852 -28714 -23296 -31802 -16348 12438 20034 20044 46860 23664 -103
4071 -103 -22328 -15658 -14398 -27629 -37371 -47214 -35017 -14228 -22703 -25764 -8743 -9477 635 -6200
4057 -6200 1693 -30230 -24245 -2949 -2433 -13862 -34624 -16928 22128 55669 40056 18150 38373
4044 38373 65689 78066 70504 56667 13547 -4196 -41112 -60218 -68151 -64109 -53149 -64193
4032 -64193 -50151 -44525 -55370 -45646 -11446 47777 25651 -9694 -17812 -31117 -36331 -45881 -34089
4019 -34089 -44802 -24761 -4682 -12753 -1485 21734 5093 16426 21886 20992 5637 5077 13922
4006 13922 7691 -13429 -21038 -15627 -13210 -9991 23333 49290 66614 74311 57199 5984 -42397
3993 -42397 -54143 -16441 11416 7769 26300 9761 -42928 -43330 -26166 -54831 -63201 -50587 -42676
3980 -42676 -55860 -5034 38155 10314 9980 33282 23921 13366 25315 26316 23571 8784 -16254
3967 -16254 -17054 3713 28684 41197 33717 29238 7090 -42495 -45688 -41240 -32673 -45973 -17001
3954 -17001 1465 1417 1414 -767 22199 10324 -20310 -48824 -47486 -32827 -25690 -745 12746 -22616
3940 -22616 -43505 2319 -29197 -39286 -30907 -24020 -33825 -44529 -51850 -62805 -51726 -23518 -36103
3927 -36103 -33643 -48106 -49353 -28764 -20302 -20694 -27894 -11113 4909 -15810 -24823 -8573 -11008
3914 -11008 -43224 -63662 -77290 -30930 -20669 -37439 -56152 -40648 -10861 -23112 -42012 -11672
3902 -11672 40165 44447 11246 -3901 -12119 7932 -3809 -21034 -18163 -29248 -23304 -26845 -6265
3889 -6265 24970 44753 27945 20325 40273 38623 27814 18961 11383 47760 79570 74661 59609
3876 59609 38840 1356 1114 -29786 -34114 13917 22318 38163 -4783 -23114 -11015 -20769 -16257
3863 -16257 10898 10866 11946 13767 43408 63447 49439 4271 -18949 -29516 -3527 -2364 5917
3850 5917 -5041 -28891 -65036 -63252 -8808 -9571 -18127 -21014 -17589 2068 -589 14412 -4536
3837 -4536 -3476 24602 28859 2302 -5366 -14412 -16738 -50124 -62770 -16688 20848 57928 66237
3824 66237 45765 20613 -1550 -22095 5031 12670 24159 9473 -33013 -45078 -27669 -5879
3812 -5879 38109 56801 34337 12697 2478 -12190 -1552 -4455 -18098 -7415 10363 14792
3800 14792 6048 -8737 -29223 -22886 -17546 4387 35986 21539 22301 8959 7778 15864 43829
3787 43829 37841 -3857 -52401 -44752 -29180 -29052 -17131 -2739 18754 38885 -9702 125 37182
3774 37182 4848 -15453 -9012 8650 37778 67336 57128 32186 -26580 -47771 -92178 -78844
3762 -78844 -37584 4076 10002 14494 9595 33244 33044 22532 5633 -706 36688 45622 40442
3749 40442 3673 -35162 -46967 -2994 19181 23475 -1226 -31860 -57361 -58262 -44016 2167
3737 2167 8195 4416 -14397 -22568 -9624 -8232 -4016 -14551 2728 9794 -4291 -6666 26206
3724 26206 24733 32987 45536 29087 27554 3751 -23579 -5801 -22280 -35094 9441 10802 839
3711 839 28105 20161 -24630 -47078 -39336 -32972 -4647 -12691 -15046 -25570 -38854 -14275 7064
3698 7064 10004 -18315 -71997 -76621 -63732 -34861 935 -3140 4027 16324 19346 8094 -26786
3685 -26786 -24306 -33991 -4226 39072 50963 22049 1662 -12864 -16561 1968 -755 -18118 -36132
3672 -36132 -33989 -13147 -14242 -19920 -44094 -61721 -57757 -46198 -37892 -26965 -29804 -44250 -55529
3659 -55529 -50519 3725 -13387 -38169 -61966 -60327 -67560 -72868 -58574 -31909 1151 159 -122
3646 -122 -25188 -33103 -1794 10997 10410 10917 7291 -86 11995 -40523 -63324 -40151 -9580 23191
3632 23191 37033 4803 -24815 -34025 -62430 -40436 -22801 -20001 -11047 2406 -22303 7769
3620 7769 -1874 -37557 -40891 -11748 -16182 -11592 -42893 -20574 -3646 -26461 -22286 -2509 1702
3607 1702 40154 24445 19250 21698 19304 7980 6988 19329 11102 -2296 7624 -2207 -27748 -15604
3593 -15604 -13276 -10406 3754 -9119 -16462 10925 47006 30565 50598 19590 -7110 29562
3581 29562 49154 62040 75972 47221 -1715 16444 12525 -41493 -69316 -42669 -14648 -19985
3569 -19985 -20257 -18848 -31132 -9997 275 10946 33781 43097 29344 -7446 -9702 -20625 -21394
3556 -21394 -18023 6907 31169 21504 -14323 -17829 2455 11405 15380 24123 8449 13596 23182
3543 23182 2105 -36489 -26132 3199 2466 24534 23123 24662 31154 21755 -10846 -26083 -1283
3530 -1283 9016 -1459 3616 -15228 -39357 -61119 -36278 -8591 4220 33840 21542 -26915
3518 -26915 -56375 3400 65840 60442 40383 29064 26376 13946 8545 33019 15798 -7089
3506 -7089 11068 17283 -15022 -30860 -29953 -18961 -25253 -5976 31554 25884 13108 12475 24936
3493 24936 10608 23774 28446 39265 50484 18438 -17788 -12389 3410 3321 6961 -9569 -22206
3480 -22206 -37062 -43544 -7364 45982 92051 106700 91418 56874 23215 -11280 -90 1060
3468 1060 -10272 -39225 -39506 4462 55464 77202 77592 33071 1083 -10685 8479 -19211 17421
3455 17421 38271 40008 18574 15178 29843 31813 18235 17900 -22971 -68823 -42427 20352 12747
3442 12747 -10050 -17474 -51458 -46044 2735 24470 -11995 -37859 -50229 -62697 -48764 -45519
3430 -45519 -51058 -27965 -12381 -10975 4457 10423 23081 6310 6619 24106 4355 -6965 -4234
3417 -4234 -10866 -14581 -5219 10882 27953 26218 46523 33430 31526 24129 -6115 -48113 -48727 -25563
3403 -25563 -31334 -22236 3378 6400 -20767 -34758 -18792 -19544 -48019 -27108 7719 41873 43485
3390 43485 47589 42271 2556 -18537 -3073 842 30393 68697 48432 4201 -12724 -2764 18326
3377 18326 15575 -22905 -60369 -42905 -30120 -4870 18774 23221 22659 31338 -4063 -42125 -31359
3364 -31359 -13474 -22158 -62744 -66543 -17036 24634 25140 1012 -6819 -17278 -20256 -26457 -21218
3351 -21218 -30056 18399 21521 1129 598 25010 32357 12853 12904 -11742 -27502 6134 21193
3338 21193 16487 12571 12212 27366 41850 19521 17451 -3323 3220 -7673 -8945 -2097 -16854
3325 -16854 -20675 -23055 -30523 -17760 -24074 -27433 -20487 -34485 -24260 -16137 -3830 -15033 -41046
3312 -41046 -34518 -922 -309 3779 -28199 -51938 -42695 -10924 -9988 -25734 -27974 -20969 -20857 -328
3298 -328 22968 -9284 -49895 -33087 -16148 -44821 -53022 -39982 -31158 -33792 -15869 -799 2661
3285 2661 11334 -31255 -49090 -58368 -46585 -29369 -32876 -30853 -1707 9168 -12502 -15492 12211
3272 12211 26126 -6662 -37986 -15095 -46082 -59971 -28597 -11089 -11387 -2474 -31538 -67461
3260 -67461 -94877 -121530 -104650 -77337 -66389 -51247 -59568 -60108 -32467 -40336 -65606 -48758 -44406
3247 -44406 -41958 8892 51198 72556 92269 81790 40687 45516 38070 31194 28993 32638 -3763
3234 -3763 -39570 -77180 -64424 -25679 -4954 -23850 23887 36980 12067 -5658 -5246 6038
3222 6038 1760 1848 16309 39636 45341 53162 43291 53294 38842 41941 33940 8976 28315 70842
3208 70842 56203 51859 45052 56310 15153 -18665 -26980 -36451 -12383 18842 20879 4247 -50494
3195 -50494 -15139 20215 45537 32976 19481 30709 22310 -12153 -22075 -28523 -32817 -22272 -12086
3182 -12086 11130 10151 -26653 -14937 -35883 -56616 -21736 -39230 -48181 -24384 1184 14165
3170 14165 30508 3080 -19135 -27500 -9760 -307 -14658 -22668 7313 8149 -15545 -45731 -58260
3157 -58260 -53048 -24124 -18741 -41263 -41283 -54322 -72630 -55589 -10827 12298 5034 -14296 -24565
3144 -24565 -21033 -27464 -43751 -38521 33614 64945 40231 13888 -21170 -9334 6784 5337 -28511
3131 -28511 -23012 11825 14404 -15668 18462 25896 39456 48860 60170 56491 36965 29580 528
3118 528 9258 18212 27029 43895 27889 -24010 -45937 -16818 23095 25121 10876 28567 33971
3105 33971 16251 -23368 2461 23996 15070 -3910 -36508 -37111 -14356 -45472 -89739 -77367
3093 -77367 -55275 -26399 -9306 886 -9282 -7027 3104 16812 46987 46183 47693 81552 82526
3080 82526 78148 56142 61180 9533 -31115 -42867 -31553 -7430 -44181 -35001 -31562 -27082 -8814
3067 -8814 -11629 -16499 -17820 -23550 -5864 10387 6173 -21927 -36965 -7997 23848 47911 18096
3054 18096 -17812 -3550 624 13662 52361 24392 27802 36318 45039 30501 28393 14121 -10940
3041 -10940 -18404 -16110 6643 20703 32645 41338 15410 -6589 -10519 -17556 -30247 4563 35294
3028 35294 24496 33263 36303 45451 46552 55111 54207 40535 46436 40669 38251 44410 50020 14336
3014 14336 7044 45 8045 146 23349 20627 20530 2341 8419 -2463 -42619 -79845 -74631 -22362
3000 -22362 2958 -14078 19559 25744 31892 26926 -1236 -18639 -28251 -15976 27051 7720 -33371
2987 -33371 -24829 -11560 -9315 10108 8075 49276 68300 54116 26392 16725 30316 25123 5438
2974 5438 -10124 -14453 -29027 -55742 -28595 866 -10695 -13694 -3365 -11622 -14648 -9073 -36301
2961 -36301 -44712 -44769 -31250 -40284 -56644 -15913 -17122 -3971 23369 33456 43066 35608 41088 44741
2947 44741 34884 24442 14283 4350 -22398 -24966 -13923 -8999 -22496 -5316 -892 -20136 -12985
2934 -12985 -13733 -13747 7943 4409 11347 27883 15853 15552 10644 -26849 -38345 -10303 11578 5892
2920 5892 -13163 -44228 -57555 -34109 -39955 -15437 22305 7845 10947 9118 4495 7719 50588
2907 50588 39974 41514 32226 18629 -1970 -31244 -12008 14361 -17339 -15769 -25163 -41488 -31180
2894 -31180 10599 24683 14722 -10205 -4121 -995 -2571 15980 21728 13438 22199 20470 14211 -2508
2880 -2508 45857 60611 62852 18353 35347 34198 26830 -425 8650 16339 30009 71724 76518
2867 76518 49311 18609 13444 29079 8270 9546 -1628 780 -959 -20850 -45880 -52872 -36675
2854 -36675 -18915 -31673 -12651 2168 -13689 21554 17474 5196 13031 37828 60780 56054
2842 56054 24958 12694 26101 -2690 -5013 -30006 -45161 -11976 -18263 -46053 -59185 -42808
2830 -42808 -6379 20968 37404 29550 13149 18037 32366 25530 27582 2340 -26738 -10414 -927
2817 -927 1898 -5884 30983 34102 45813 43810 16599 14969 28808 54101 20572 -4248 25541
2804 25541 27987 8534 26253 8148 6464 -1586 -1804 -2175 -10738 -41013 -12187 19009 11418 11901
2790 11901 -9963 -17084 27681 42429 18092 16354 43790 39706 -5574 -24684 -20976 -859 -2063
2777 -2063 -14995 -2121 -1206 -41546 -83302 -84911 -80930 -57141 -40890 -43564 -15439 -28491 -50358
2764 -50358 -55925 -44109 -40490 -47652 -32245 -12602 -28188 -38183 -38420 -42994 -24266 -1524 27309
2751 27309 58585 51201 21390 7444 29899 19337 -10196 5128 13227 -1981 -51018 -44888
2739 -44888 -33042 -15682 -28829 -35194 -7327 -37908 -36557 -14128 -22266 -52793 -55684 -32649 -5350
2726 -5350 18727 9727 19798 47269 47145 14847 -41532 -16333 -7917 8530 16112 41368 41139
2713 41139 2527 -16558 -34910 -30334 -18202 -20381 -17374 -8889 -42513 -54572 -58568 -46196 -25547
2700 -25547 -19990 1739 -16357 -14563 4077 -14679 -20034 -8901 -17664 11129 9312 -5399 4776
2687 4776 29307 14142 9045 7496 -47659 -23546 33551 51955 46220 14364 32583 60854 43475
2674 43475 31156 33057 21867 9139 -20661 -24543 -5751 18738 7445 -17236 -50442 -44830
2662 -44830 -56220 -45774 -59990 -39725 15557 50189 43925 26162 11882 26010 45226 39588
2650 39588 26857 7855 -2350 4145 32866 36315 26534 11910 25321 22852 15299 25589 -3767
2637 -3767 -5586 28239 36687 13207 -34965 -36101 -45672 -16185 109 9427 7872 -29389 -42695
2624 -42695 -31752 -1722 14757 -12316 10673 17670 -8530 -13887 -19022 -24117 -40875 -59264 -73386
2611 -73386 -69951 -41293 -12918 -27173 -28823 -49901 -30439 -34655 -7802 8799 -8541 -6331 8016
2598 8016 30267 15440 -23141 1090 20552 20169 25210 15616 -4744 -30015 -36605 -43462 -15482
2585 -15482 6926 28905 26753 11914 -21300 -36749 -16191 -7459 -4372 148 5390 -7189 -37407
2572 -37407 -38968 -31239 -18209 -2043 68 1555 -10014 -6695 15869 15270 1458 -16083 -16530 -16293
2558 -16293 6875 3222 -31538 -22580 24090 47546 44735 43127 56497 17746 -23090 -39774 -59403
2545 -59403 -53587 -19412 17296 28662 40198 81739 40241 -8549 -25885 4516 36819 44756
2533 44756 23084 -3932 -3805 -13303 7916 10393 6905 35922 61877 30361 7254 432 -26790
2520 -26790 -41772 -47758 -50706 -76084 -70986 -68555 -55532 -28893 -155 -6135 -7582 -6043 -14364
2507 -14364 -14110 -9279 -11127 -14620 -18537 6464 11177 11763 19038 25441 36999 20431 -27998 -45647
2493 -45647 -55222 -72792 -39429 14363 13495 9868 11111 23464 17896 4895 20840 3321 -8157
2480 -8157 8617 43937 39446 -8936 -48835 -25119 -17982 -8399 44960 72123 98757 74462 27441
2467 27441 15914 -335 9801 -545 7574 -12379 -11711 -4369 -5703 18079 33027 64581 65031
2454 65031 52337 45585 62944 72546 71838 63983 33794 -4059 -21380 14663 41536 53028 39738
2441 39738 51093 59468 44785 91446 70023 -11252 -12111 20587 14892 -614 -7707 -2450 31439
2428 31439 32391 -3189 -22590 -24299 -21300 26253 38956 28379 453 -4105 -8299 -14111 -28278
2415 -28278 1973 -2866 445 18905 -21275 -17394 23871 35775 16642 10901 -1681 -1434 -5292
2402 -5292 346 -1213 -14842 -11041 -20501 -5687 -45353 -24340 -1918 -3638 19404 4272 -7026
2389 -7026 -22588 -29801 -16791 -6808 -1569 -3433 -19904 -749 -9211 3891 -5646 21455 19256
2376 19256 -21031 -47241 -48513 -34645 176 43423 11880 -18257 -3250 -22213 -38486 -54109
2364 -54109 -40692 5621 27031 -1016 -5109 -9703 -15691 -24764 -41870 -4354 19595 -4174 -57899
2351 -57899 -68109 -33819 -16549 13299 17303 11993 7655 -38811 -51302 -40176 -50609 -37057
2339 -37057 -7240 15680 43128 30512 2894 655 24755 2668 5251 2663 -18162 7006
2327 7006 7865 -15384 17371 23914 4942 1213 -42526 -26676 -14915 -31773 -31017 -19103 -15152
2314 -15152 -28857 -37227 2178 7206 -28630 -13939 24633 44906 37891 12988 -21931 -19466 -22915
2301 -22915 -16192 -5137 -545 -22827 -37893 -19175 27551 14974 -20016 -11759 3115 -27419
2289 -27419 -33410 -29933 3657 -3511 -8437 57280 67121 11947 -21235 -15516 -30956 -28494 -15259
2276 -15259 -11704 1318 1146 -30342 -8961 9502 -30700 -53217 -20196 -3804 -6025 -25249 -45476
2263 -45476 -21818 20452 25064 -8770 -28722 -18977 -14556 -33920 -27120 -24371 19768 20343 12476
2250 12476 -25887 -43360 -30292 -14169 -1634 12998 4881 16492 32828 576 -8964 -40976
2238 -40976 -32232 11744 29374 -2900 -11698 -4632 7212 36375 25106 27365 35966 16035 -25247
2225 -25247 -30121 -13613 -1384 5119 4803 -5083 3417 -42626 -39107 2711 31605 71914 106079
2212 106079 108806 75521 54960 66705 78151 52021 17411 -15103 -8517 12754 298 13371
2200 13371 27881 9088 -29529 -21763 -2396 12277 14071 -16618 -5826 -11765 -17925 -37060 -10236
2187 -10236 -11542 -3933 -5115 -6349 713 -8079 -22684 -46494 -50005 -25938 -47821 -53406 11615
2174 11615 29737 2517 -36478 21532 63468 60019 19831 24341 30730 18781 55519 76490
2162 76490 79728 42144 24676 6909 15978 12054 24472 1395 641 -19367 -34925 -45717 -2482
2149 -2482 16039 2482 -16735 -22403 -37564 -26648 -36925 -23339 -3585 -12080 3580 -4231 -18833
2136 -18833 -9413 2593 6990 -13030 -7728 -8219 18416 29269 1767 -25851 -61537 -49277 -40403
2123 -40403 -22212 -31994 -33120 -24138 -37445 -54182 -42784 6828 18689 15547 628 -24405 -49425
2110 -49425 -44405 -26892 16927 18488 -12291 -48438 -46843 -49813 -27927 -5346 17408 10403 32796
2097 32796 44452 30376 -2323 -19886 -9821 -22429 -18771 -2221 -20611 -15545 -25253 -44199
2085 -44199 -42363 -3195 15827 10433 12451 -4984 -17135 6214 4510 3820 7751 -34066 -44997
2072 -44997 -31404 -7310 23065 22775 45981 33962 29372 49160 54095 76162 73880 44950 24770
2059 24770 20378 5381 20728 48479 35845 18563 34042 39035 44036 11560 -11464 18915
2047 18915 31472 -576 -7453 -13847 3023 20439 -5126 2835 47829 62302 52190 59440 52705
2034 52705 35390 8624 -406 5301 -32107 -27660 16999 18677 26637 12051 -9612 -10440 -26784
2021 -26784 -46784 -60300 -53206 -47442 -27425 -26351 15191 17308 6906 12343 -20450 -18381 -6123
2008 -6123 -14153 -2893 21174 27305 -2837 9263 31917 14262 -2127 3517 24284 30516 28066
1995 28066 29380 -136 -37152 -44820 -7550 19321 13937 18909 24031 51342 30934 -19043 -37706
1982 -37706 -38322 -36821 -63251 -77840 -75910 -46819 -24798 -16918 -6257 10775 18876 24470 18308
1969 18308 32015 60880 58130 35425 17270 -7018 -25790 -18036 11788 16581 11401 -3704 -20828
1956 -20828 -11936 26442 6880 -42854 -78059 -78097 -52320 -32917 -32490 -34085 -59679 -52863 -30878
1943 -30878 -5743 13675 -10772 -25924 8824 10241 -28687 -12781 3632 -13007 -17615 -46043
1931 -46043 -51958 -58361 -35163 -19476 -185 19658 41001 31145 42611 30980 47590 54555 61626
1918 61626 45194 23634 -5704 4073 17850 5306 4328 -1362 -24792 -19206 4470 15409 -3986
1905 -3986 -15441 -13602 -22251 -44012 -23187 7245 10087 20920 -3609 -7857 50631 52312 58738
1892 58738 37833 28872 10239 12725 20163 -8614 -2284 -14042 -49323 -33083 -14108 -6951 -12549
1879 -12549 -15849 -29589 -18589 -6874 1234 10517 -11407 -32933 -12959 21219 38871 14321
1867 14321 -27159 -66383 -109433 -85861 -60705 -45144 -7311 -10774 -31444 -34207 -36203 -60841
1855 -60841 -72794 -36600 -7403 -8397 -12989 20616 28981 -15477 -13817 -10863 -19619 -916 35289
1842 35289 39285 -2040 -11574 1660 12733 32110 24167 -23927 -28110 -3874 -1980 5130 -23295
1829 -23295 -9144 6474 27514 71219 72347 29566 12020 -2454 -8394 -7477 -25472 -48968 -34813
1816 -34813 -32108 -26538 -30395 -29744 -4759 -23432 -4240 10587 34523 56207 60435 12171 14706
1803 14706 31982 20661 1654 21147 -7835 -24104 9722 31744 -3484 -10944 -2807 -4040
1791 -4040 -21673 -11976 -11183 -10334 8835 7348 -6929 -37514 -37056 -15574 -19281 -44606 -32132 -56027
1777 -56027 -64584 -65925 -31496 10768 -1512 -10281 24100 63743 78890 72361 63065 43407 39793
1764 39793 -3199 -7759 10240 2482 3862 -6094 -7865 -7327 4748 16302 13958 -1817 -23087
1751 -23087 -43214 -30923 -25184 -28650 -39345 -20056 16522 -4524 3394 13026 17982 12150 -11979
1738 -11979 -30359 -24521 14234 19700 29941 49380 52508 -188 -19181 -18101 -18367 -22919 4750
1725 4750 31467 21686 12099 13824 6303 -35522 -57858 -28551 -25769 -26659 -17865 7765 -1710 -27857
1711 -27857 -18529 -20987 -50474 -73636 -79843 -76060 -68418 -51168 -41209 -52341 -35347 -36379 6693
1698 6693 85 -26398 -19581 12836 6096 -10451 -18526 -24403 -19295 -34344 -41737 -30084 -42762
1685 -42762 -44588 -45482 -34931 -14353 -34622 -43004 -30283 4525 15124 7833 195 -23616 -2673
1672 -2673 6640 17013 30152 32320 40985 13800 3479 16127 26664 -18654 -69112 -101854 -69433
1659 -69433 -12131 10876 21166 23803 7996 -25464 -15039 -2635 3433 2049 16418 39819
1647 39819 46893 53629 54395 46710 -1360 -15733 8431 45768 69135 106410 71752 19000 8434
1634 8434 13566 -22648 -39904 427 3244 12673 39420 43560 29299 -24873 -20383 10385 8212
1621 8212 28817 32834 8588 -15977 -8141 -8263 -20242 -10682 10410 -29172 -28593 3554 -22072
1608 -22072 -53726 -22899 2102 25394 25513 7697 10402 -18226 -5758 20624 27019 28568 -5508
1595 -5508 8158 -7030 -49608 -27955 5203 5958 -1615 -1632 19050 47046 15277 -18028 -25515
1582 -25515 330 4275 7763 -18571 -6972 8803 -9505 -34509 -44423 -43538 -16308 15682 21427
1569 21427 43664 27596 6148 1439 27956 32021 19628 10881 -14688 -33171 -19385 -15089 -8019
1556 -8019 17543 25546 30066 -6152 -24452 -38881 -38223 -20674 -20109 -6645 -10570 -12406 -3354 13621
1542 13621 31126 20673 -20059 -45901 -26980 8744 9141 -1909 -25229 -43186 -19607 -2621
1530 -2621 1178 8370 32814 12860 -12188 -158 9061 31360 46858 26607 32175 42162 10348
1517 10348 10089 16790 21012 2833 -11860 26094 51838 24832 -14579 -34618 -4958 10319 13264
1504 13264 6703 -24395 -3176 23950 19344 60 -39749 -62137 -39653 7148 66367 85983
1492 85983 64138 57545 35706 7476 16092 17739 30681 35636 11498 -31026 -51163 -25544 -8441
1479 -8441 -6502 20070 21913 6969 25352 20770 12947 -15261 -4439 7857 16002 18617 13323
1466 13323 263 -19282 8990 42379 50112 38038 12289 7841 22636 24566 -6914 2034 35154
1453 35154 34606 34706 31535 27901 16278 6761 21811 8908 27827 38534 16147 -1827 8471
1440 8471 28565 28079 51152 65179 73325 90572 69757 52978 32139 -6030 -14127 -16077 -696
1427 -696 3 -15337 1137 59265 98298 63283 22747 -6656 14248 50661 49736 59129 59017 49946
1413 49946 16767 32693 41668 4646 25662 51717 57851 52878 47593 2476 -22165 -5093 -9603
1400 -9603 -6368 -14470 3239 -4981 5148 23874 33642 48271 29486 49262 79398 40254 -19642
1387 -19642 3893 6411 7119 12349 38904 67032 44544 16811 7450 -9084 -22709 10345 4478
1374 4478 1203 15065 35588 16985 28058 20702 9722 28722 35721 28302 9099 8201 15799
1361 15799 512 -17421 8769 10986 -23768 -5525 31811 14967 13098 -3055 -8897 19026
1349 19026 3948 -42351 -69112 -52639 -16085 13975 15303 -19975 -33518 34909 43163 31640
1337 31640 54973 32196 16181 4009 -779 -8347 -49512 -66382 -26238 8557 29381 48179
1325 48179 49263 41705 16140 5690 -11608 -24304 -14861 15015 10251 -13293 -13604 -6809 11331
1312 11331 -17890 -36404 -62113 -39107 -15116 -4992 3900 5448 9430 -20344 -33218 -45302
1300 -45302 -50872 -55397 -27566 29823 69514 65640 45054 -1415 6874 15618 13337 6065 -4137
1287 -4137 6379 43329 67208 84952 67905 34170 21788 15731 12460 13711 -5077 20525 39280
1274 39280 18588 42371 36863 44908 78345 84515 55816 36904 21948 29612 48430 42002 28366
1261 28366 15550 3470 117 -12786 -18261 -37512 -19490 -12527 -4494 -10484 -33408 -38573 9434
1248 9434 23269 12795 -19401 -51801 -83798 -90630 -57545 -33957 -29877 -24474 -9569 -23568 -30950
1235 -30950 -14399 -23056 -26286 -21839 15000 25530 7269 -34685 -52910 -25406 -420 27641
1223 27641 39127 28608 26697 23725 46834 44661 21983 -203 -14606 -42182 -49606 -42042 -8156
1210 -8156 8815 5754 -16225 -2584 12152 21837 15123 15080 32318 23414 4464 4188 -6718 21872
1196 21872 45333 12631 -3898 -32187 683 8011 -29515 -53867 -33515 -56152 -42824 -20229
1184 -20229 6566 7745 -36082 -40130 -52908 -26590 -16269 -20781 -12456 -21147 -32733 -26401 -9126
1171 -9126 -21573 -1529 -28992 -19867 14272 5699 17520 19078 -3247 2432 2625 -5686 46368
1158 46368 80494 107861 99860 96238 59407 41505 46907 63303 6675 416 27458 23777 -7317
1145 -7317 -12060 2090 20853 26561 33498 24535 20308 -1864 7487 2093 -193 -10787 -4659 13157
1131 13157 39328 45062 50915 46356 44576 37112 22030 -8000 -31651 -30082 -30937 -22700 -18791 -25274
1117 -25274 -17929 -33078 1172 51476 30543 19817 -1537 -36821 -28478 38908 49575 -1840
1105 -1840 -28349 -8905 8932 7305 -4163 -8959 12212 -21508 -26218 -35260 -11479 13856 11026
1092 11026 8720 38702 37371 27945 27212 29586 -18293 -46567 -21726 10593 30306 37004 7505
1079 7505 3290 6450 9792 -14060 -50717 -60604 -34745 -11048 -11573 8153 11690 6729 -10912 14561
1065 14561 24981 5049 3904 -735 -15073 -41782 -33907 -25774 13352 15660 33599 29540 28847
1052 28847 16231 -8067 8325 55951 88623 58164 39968 8329 12990 5355 5463 11527 1655
1039 1655 -35841 -31669 -42467 -28263 -6960 21976 26131 14128 44593 40355 11443 -15090 -216
1026 -216 6769 -5830 9140 50158 15860 -33894 -53700 -50950 -49999 -11458 18279 12706 -6482
1013 -6482 -37507 -57089 -55010 -35798 -29071 -18184 -21132 -9749 16438 10971 23606 51205 47648
1000 47648 23364 -10220 -19728 -6424 -22445 -38707 -11923 -14272 -10946 -11164 -26782 -21514 -15556
987 -15556 -10331 13409 15070 23005 22141 9310 7096 21624 42504 33085 5461 -24412 -29065 -19700
973 -19700 -23545 -1429 -6115 -14274 -27348 -20596 -8424 -17276 -41187 -52453 -32962 2361 11292
960 11292 4979 -6119 -7866 249 10552 19478 -13541 -11477 10188 19559 14695 13349 -18448 -35810
946 -35810 -44219 -10957 29204 16953 1083 -13669 -1220 32888 45257 55915 49704 41714 9180
933 9180 -11987 -43804 -43712 -15448 -10052 3970 60227 75465 64149 18656 6842 1134 12280
920 12280 11734 1391 25380 34181 29981 35351 40931 41685 34172 12200 23213 50321 42360 57420
906 57420 42092 29413 20932 38569 28738 -27929 -42221 -48257 -7783 15282 17657 21816 25715
893 25715 40984 30863 21541 12190 -7169 -900 -28313 -33466 -44346 -41830 -10247 -6814 23836
880 23836 31378 16739 28082 19756 11703 -10237 -35214 -9 12430 -33293 -52720 -58340 -46777
867 -46777 -28728 -38849 -14835 11502 10546 18160 27647 71101 43223 291 -53489 -62150 -29668
854 -29668 -29832 -35378 -51462 -954 1229 -11108 17848 40804 18999 8279 24490 20930 10839
841 10839 -7791 -40113 -25748 13668 55835 62648 41412 35406 20077 18165 10403 -8857 8016
828 8016 24693 58764 83058 63089 18319 4166 11213 22072 51704 44854 25211 47258 25324
815 25324 -1137 -14493 -18492 -8593 25833 54077 74019 48859 8533 -1484 2255 4652 -4240
802 -4240 -50326 -44987 15677 16416 25095 20195 26823 -14469 -89728 -81504 -36397 -5976 -28025 -23062
788 -23062 -40215 -43750 -29052 -32891 -19292 -3328 1228 -29656 -41582 -50623 -34061 3734 28326
775 28326 9543 -7585 13649 4429 -3762 11159 -2844 -6762 -5406 15153 12353 53895 60921
762 60921 26061 22495 51887 49988 2140 -11269 -15461 -15129 496 49090 71811 59158 4958
749 4958 -16559 34025 36323 15906 25093 10920 23291 46609 28825 2828 10341 -517 4198
736 4198 7859 -7862 -13058 -9056 17056 42733 31220 20138 11759 -3409 -6126 15829 7328
723 7328 -37744 -6505 8723 8137 17930 18953 14908 28308 47920 51990 51747 31288 15911 28453
709 28453 30101 36573 41194 37391 19460 -4232 39029 53035 50023 14468 10524 20376 11566 -17739
695 -17739 12948 43819 55217 37873 17381 -22656 -57129 -54809 -42348 -19012 2576 -27247
683 -27247 -28550 -53421 -88709 -87791 -64529 -50111 -17092 -1003 -1133 12303 16546 14573 30983
670 30983 49784 42572 15208 3318 -1826 9279 16421 10265 -20816 -25980 -33404 -17757 4250
657 4250 31809 32490 31619 17184 837 2738 12652 22306 10583 15138 9223 806 -13301 -33692
643 -33692 -28760 -17214 19775 438 -31373 24980 18614 3431 -5031 17562 -18857 1281 21550
630 21550 -4934 -32939 -52046 -17155 112 9543 247 -2421 -26957 -29594 -41637 -35370 -32303
617 -32303 -32379 -28884 28771 -4026 -21044 -8499 -8887 -25338 4383 21926 32417 31530 33055 33964
603 33964 7131 -11277 22523 44874 32206 21254 32372 23106 18848 16154 780 29254 19164
590 19164 -2774 7660 29515 24281 29397 23158 7012 7309 18080 30146 20542 26331 29218 40079
576 40079 36254 13173 -2584 13201 -2872 12939 21521 33036 49122 19474 396 -11535
564 -11535 6144 23085 31473 37887 -3869 -12051 5897 8278 8755 -11102 10424 21268 4763
551 4763 3157 8354 13072 24669 -805 -27272 -67915 -38236 4404 -1961 -23091 -9208 47476
538 47476 63387 9208 -28967 -5101 -8075 54 -6155 7457 29755 -1770 -10095 1827 9238
525 9238 -3334 11965 -10757 1603 20652 15591 -8997 -51730 -61037 -54453 -40728 -31523 -14949
512 -14949 -29462 -9962 -4793 -9282 -29955 -49459 -42303 -38881 -29667 -7887 -12065 14390 32149
499 32149 51556 43799 46124 47882 28040 39786 55317 59382 71054 97585 56534 2065 -12832
486 -12832 22744 4405 -9911 1616 23654 3078 -9584 -2525 -3754 6642 17730 5429
474 5429 -4123 -5037 13665 24615 13159 -1723 7558 -21378 -20034 -34838 -25754 20002 42766
461 42766 30421 29415 53877 12479 5983 34141 59693 27509 24535 15710 -30663 -18496 8865
448 8865 10400 33498 20197 -27977 -31014 -6708 24955 8188 23759 15303 -10549 -29817 -15222
435 -15222 -6547 -45692 -54173 -47370 -42519 -22483 -20284 -2734 8214 10262 28559 58653 52929
422 52929 31752 -3044 -949 4153 16208 8873 27225 19105 -22738 -24071 3607 558 -15649
409 -15649 -27788 -40808 -29382 -18065 -20972 -3898 -8845 -3597 4612 2542 28114 32502 10934
396 10934 -6791 -19959 -44076 -37361 -2074 -12104 7118 23739 34079 33561 38430 29867 29025
383 29025 16136 -12928 -9310 -37419 -5880 30566 28661 -22185 -68763 -56810 -32201 -43149
371 -43149 -35093 -27748 -23174 -6448 -1130 -1508 36369 17369 -38241 -36700 -33336 -34333 -16074 5034
357 5034 8347 -3228 -2266 -585 29563 14536 4043 -5429 -2536 5769 -6915 479 10011 -3179
343 -3179 -3227 -14485 -14989 -19582 -32558 -36215 -26388 -28671 -1541 15637 11711 25206 29193 12095
329 12095 -5059 -12417 28753 28819 -1906 12082 48239 74869 71075 51616 41261 15361 15666
316 15666 1596 -2704 -6161 2691 21028 21163 33365 8110 -7492 16915 48104 27151 8399
303 8399 -7957 -29751 -37288 -49205 -40758 -7498 16304 6873 14149 13213 -22512 -8227 16892
290 16892 47430 61018 39150 -7405 -19953 -15354 -5672 -1837 -3194 -12592 -16582 -16058 -17598 -39699
276 -39699 -26506 11831 31221 34249 21042 4822 9700 11636 -8943 47153 70985 77601 41833
263 41833 -12805 -23357 -359 27480 34146 28412 28035 21867 1400 -28890 -24080 -8404 305
250 305 19079 35339 4921 12764 21767 10733 28725 53957 72405 83282 80432 56656 60383
237 60383 54503 22572 25858 20347 13331 -14573 -29117 -29844 -30695 -3588 22715 32569 36519 39294
223 39294 60271 53013 21619 -2881 1282 -27749 -45426 -45000 -3491 10969 -17128 -30696 -18669
210 -18669 11334 35346 52297 73655 60434 6933 -31745 -33484 -20264 -14951 16429 56932
198 56932 58025 63509 52218 32183 11294 -9403 11309 14772 -18450 -11288 -24732 -41830 -36125
185 -36125 -15116 -6173 10080 31139 16782 -145 -17012 -8402 -13694 -4858 13442 23064 13758
172 13758 7925 24477 25884 30766 53628 20379 -6656 -3587 -7205 2053 4729 -8270 -7144 -19106
158 -19106 -29069 -30766 -25739 -1904 12004 18791 -7682 -16495 -10050 -11378 -15601 -18716 -7531 -3551
144 -3551 -22208 -35987 -28528 -28813 -15784 -30183 -6463 16005 10942 6494 -10718 -37631 -22681
131 -22681 -11888 -12360 621 -8886 -27155 -27380 -14720 -8176 396 2930 -3602 -18539 -25136 -16318
117 -16318 -14045 6415 25692 27430 31623 -23692 -48011 -35268 -9396 5007 -3333 14659 28329
104 28329 35421 17116 -408 -377 11487 -6267 -29505 -31741 -13127 2083 -8790 -7159 -573
91 -573 5329 -1800 10719 19700 36426 34322 23551 26578 18180 842 -26640 -6677 24785 21240
77 21240 16717 -2764 470 2334 5021 -746 -26750 -46114 -31080 -29408 -46879 -77810 -50856
64 -50856 -1291 -11109 -11357 -1523 -1309 -5926 -31539 -37790 -29010 -15091 -5469 1561 35505 45066 42010
49 42010 44063 33706 15536 12547 27863 17503 7072 18920 23121 20578 15382 30400 30668 21517
35 21517 -7882 -4110 1999 -539 -31299 -30562 -7 1261 6596 -214 -3685 1703 23244 17581
21 17581 -13914 -13699 -3210 11095 5864 -28961 -20745 932 15689 21070 54627 53705 40234 13268
7 13268 1502 -11645 -11063 -9183 -11682 11732 37183
0 37183
$$ Imaginary data points
##PAGE= N=2
##DATA TABLE= (X++(I..I)), XYDATA
32767 12613 25697 50347 57178 61507 63019 76430 62597 48520 56134 76011 100119 89308
32755 89308 83088 86143 82413 84766 65564 62395 44759 63495 92909 111886 110437 89369 90296
32742 90296 94388 109699 135762 118424 85204 64472 62702 42936 1205 -8489 27587 44356
32730 44356 61482 90023 88052 77683 85383 109078 116235 129146 124843 135363 151916 165138
32718 165138 152169 142600 116986 121502 130209 117558 95909 98931 88792 64520 80843 103111
32706 103111 107586 84094 102830 104798 94525 102001 88173 89719 103775 81920 77002 71731 70033
32693 70033 89855 80417 45526 26802 47564 54229 30587 25817 21190 68040 103259 137116
32681 137116 130760 120839 138458 150042 122698 95452 72278 70238 86720 90347 88160 92464 76295
$$ [...]
##END NTUPLES=NMR SPECTRUM
##END=
