##TITLE=Analysis number 328543
Compound Code cc 12602
Project Code adrs
Chemist Name ugmt
##JCAMPDX= 6.0         $$ Bruker NMR JCAMP-DX V2.0
##DATA TYPE= NMR SPECTRUM
##DATA CLASS= NTUPLES
##ORIGIN= Bruker BioSpin GmbH
##OWNER= nmr
$$ XWIN-NMR		Version 3.5
$$ Thu Jun 14 10:04:08 2007 GMT Daylight Time (UT+1h)  MAYBRIDGE\nmr@NMR_250MHZ
##.OBSERVE FREQUENCY= 250.131544655141
##.OBSERVE NUCLEUS= ^1H
##.ACQUISITION MODE= SIMULTANEOUS (DQD)
##.ACQUISITION SCHEME= undefined
##.AVERAGES= 16
##.DIGITISER RES= 18
##SPECTROMETER/DATA SYSTEM= dpx250
##.PULSE SEQUENCE= zg30
##.SOLVENT NAME= CDCl3
##.SHIFT REFERENCE= (INTERNAL, CDCl3, 0, 16.522)
##AUDIT TRAIL= $$ (NUMBER, WHEN, WHO, WHERE, WHAT)
$$ ##TITLE= Audit trail, XWIN-NMR		Version 3.5
$$ ##JCAMPDX= 5.01
$$ ##ORIGIN= Bruker BioSpin GmbH
$$ ##OWNER= nmr
$$ C:\u/data/dgb/nmr/ADRS/890/pdata/1/auditp.txt
$$ ##AUDIT TRAIL=  $$ (NUMBER, WHEN, WHO, WHERE, WHAT)
(   1,<2007-06-14 10:03:45.92 +100>,<MAYBRIDGE\nmr>,<NMR_250MHZ>,
      <created by zg, POWCHK disabled, PULCHK disabled
       configuration hash MD5:
       76 6E 9A 78 1E 09 19 81 EC 84 63 8F B0 6A 59 2D
       data hash MD5: 64K
       4D C9 9B B6 AE 96 18 28 B7 19 B7 8F BE 61 71 6A>)
(   2,<2007-06-14 10:03:59.57 +100>,<MAYBRIDGE\nmr>,<NMR_250MHZ>,
      <Start of raw data processing
       ef LB = 0.3 FT_mod = 6 PKNL = 1 SI = 32K 
       data hash MD5: 32K
       55 C3 D9 E5 58 E9 39 EA 74 F4 A4 4C 4B 50 43 BA>)
(   3,<2007-06-14 10:04:01.23 +100>,<MAYBRIDGE\nmr>,<NMR_250MHZ>,
      <apk 
       data hash MD5: 32K
       C0 D4 B1 BB D5 A8 E3 59 BF 02 D7 98 AD 19 E6 E0>)
(   4,<2007-06-14 10:04:01.99 +100>,<MAYBRIDGE\nmr>,<NMR_250MHZ>,
      <abs ABSG = 5 
       data hash MD5: 32K
       26 C5 84 0E CD 14 99 45 C2 59 81 04 FB 38 23 1F>)
$$ ##END=
$$ 
$$ hash MD5
$$ A0 6E DF 6E 95 9D CD 0D D9 4C 9C 82 55 BA AC 42
##$RELAX= 
##$RELAX= 
##$RELAX= 
##$RELAX= 
##$RELAX= 
##$RELAX= 
##$RELAX= 
$$ Bruker specific parameters
$$ --------------------------
##$DU= <C:\u>
##$EXPNO= 890
##$NAME= <ADRS>
##$PROCNO= 1
##$TYPE= <nmr>
##$USER= <dgb>
##$AMP= (0..31)
100 100 100 100 100 100 100 100 100 100 100 100 100 100 100 100 100 100 
100 100 100 100 100 100 100 100 100 100 100 100 100 100 
##$AQSEQ= 0
##$AQ_mod= 3
##$AUNM= <au_zg>
##$AUTOPOS= <7 >
##$BF1= 250.13
##$BF2= 250.13
##$BF3= 250.13
##$BF4= 250.13
##$BF5= 500.13
##$BF6= 500.13
##$BF7= 500.13
##$BF8= 500.13
##$BYTORDA= 1
##$CFDGTYP= 0
##$CFRGTYP= 5
##$CHEMSTR= <none>
##$CNST= (0..31)
1 1 145 1 1 1 1 1 1 1 1 1 1 1 1 1 1 1 1 1 1 1 1 1 1 1 1 1 1 1 1 1 
##$CPDPRG= <>
##$CPDPRG1= <>
##$CPDPRG2= <>
##$CPDPRG3= <>
##$CPDPRG4= <mlev>
##$CPDPRG5= <mlev>
##$CPDPRG6= <mlev>
##$CPDPRG7= <mlev>
##$CPDPRG8= <mlev>
##$CPDPRGB= <>
##$CPDPRGT= <>
##$D= (0..31)
0 1 0 0 0 0 0 0 0 0.06 0 0 0 0 0 0 0.0002 0 0 0 0 0 0 0 0 0 0 0 0 0 0 
0 
##$DATE= 1181811824
##$DBL= (0..7)
120 120 120 120 120 120 120 120 
##$DBP= (0..7)
150 150 150 150 150 150 150 150 
##$DBP07= 0
##$DBPNAM0= <>
##$DBPNAM1= <>
##$DBPNAM2= <>
##$DBPNAM3= <>
$$ [...]
##$SUBNAM7= <"">
##$SUBNAM8= <"">
##$SUBNAM9= <"">
##$SW= 20.6930455092707
##$SWIBOX= (0..15)
0 0 3 0 0 0 0 0 0 0 0 0 0 0 0 0 
##$SW_h= 5175.983436853
##$TD= 65536
##$TD0= 1
##$TE= 296.16
##$TE2= 300
##$TE3= 300
##$TEG= 300
##$TL= (0..7)
0 120 120 120 120 120 120 120 
##$TP= (0..7)
150 150 150 150 150 150 150 150 
##$TP07= 0
##$TPNAME0= <>
##$TPNAME1= <>
##$TPNAME2= <>
##$TPNAME3= <>
##$TPNAME4= <>
##$TPNAME5= <>
##$TPNAME6= <>
##$TPNAME7= <>
##$TPOAL= (0..7)
0.5 0.5 0.5 0.5 0.5 0.5 0.5 0.5 
##$TPOFFS= (0..7)
0 0 0 0 0 0 0 0 
##$TUNHIN= 0
##$TUNHOUT= 0
##$TUNXOUT= 0
##$USERA1= <user>
##$USERA2= <user>
##$USERA3= <user>
##$USERA4= <user>
##$USERA5= <user>
##$V9= 5
##$VALIST= <valist>
##$VCLIST= <CCCCCCCCCCCCCCC>
##$VD= 0
##$VDLIST= <DDDDDDDDDDDDDDD>
##$VPLIST= <PPPPPPPPPPPPPPP>
##$VTLIST= <TTTTTTTTTTTTTTT>
##$WBST= 1024
##$WBSW= 4
##$XGAIN= (0..3)
0 0 0 0 
##$XL= 0
##$YL= 0
##$YMAX_a= 404096
##$YMIN_a= -401517
##$ZGOPTNS= <>
##$ZL1= 120
##$ZL2= 120
##$ZL3= 120
##$ZL4= 120
##$ABSF1= 16.522
##$ABSF2= -4.171173
##$ABSG= 5
##$ABSL= 3
##$ALPHA= 0
##$AQORDER= 0
##$ASSFAC= 0
##$ASSFACI= 0
##$ASSFACX= 0
##$ASSWID= 0
##$AUNMP= <proc_1d>
##$AZFE= 0.1
##$AZFW= 0.1
##$BCFW= 0
##$BC_mod= 0
##$BYTORDP= 0
##$COROFFS= 0
##$CY= 12.5
##$DATMOD= 1
##$DC= 0
##$DFILT= <>
##$DTYPP= 0
##$F1P= 14.0000005364418
##$F2P= -0.99999901652339
##$FCOR= 0.5
##$FTSIZE= 32768
##$FT_mod= 6
##$GAMMA= 0
##$GB= 0
##$INTBC= 1
##$INTSCL= 1
##$ISEN= 128
##$LB= 0.3
##$LEV0= 0
##$LPBIN= 0
##$MAXI= 10000
##$MC2= 0
##$MEAN= 0
##$ME_mod= 0
##$MI= 0
##$NCOEF= 0
##$NC_proc= -2
##$NLEV= 6
##$NOISF1= 0
##$NOISF2= 0
##$NSP= 0
##$NTH_PI= 0
##$NZP= 0
##$OFFSET= 16.522
##$PC= 1
##$PHC0= -56.1771
##$PHC1= 7.482593
##$PH_mod= 1
##$PKNL= yes
##$PPARMOD= 0
##$PSCAL= 4
##$PSIGN= 0
##$REVERSE= no
##$SF= 250.13
##$SI= 32768
##$SIGF1= 0
##$SIGF2= 0
##$SINO= 400
##$SIOLD= 32768
##$SREGLST= <1H.CDCl3>
##$SSB= 0
##$STSI= 32768
##$STSR= 0
##$SW_p= 5175.98343685301
##$SYMM= 0
##$S_DEV= 0
##$TDeff= 65536
##$TDoff= 0
##$TI= <Analysis number 999999
Compound Code 99
Book Reference 9
Project Code 9>
##$TILT= no
##$TM1= 0
##$TM2= 0
##$TOPLEV= 0
##$USERP1= <user>
##$USERP2= <user>
##$USERP3= <user>
##$USERP4= <user>
##$USERP5= <user>
##$WDW= 1
##$XDIM= 32768
##$YMAX_p= 390342141
##$YMIN_p= -149987
$$ End of Bruker specific parameters
$$ ---------------------------------
##NTUPLES= NMR SPECTRUM
##VAR_NAME=  FREQUENCY,     SPECTRUM/REAL,   SPECTRUM/IMAG
##SYMBOL=    X,             R,               I
##VAR_TYPE=  INDEPENDENT,   DEPENDENT,       DEPENDENT
##VAR_FORM=  AFFN,          ASDF,            ASDF
##VAR_DIM=   32768,         32768,           32768
##UNITS=     HZ,            ARBITRARY UNITS, ARBITRARY UNITS
##FACTOR=    0.157963299565203, 1,           1
##FIRST=     4132.6476996994, 0,             0
##LAST=      -1043.33573715361, 0,           0
##MIN=       -1043.33573715361, -149987,     0
##MAX=       4132.6476996994, 390342141,     0
$$ Real data points
##PAGE= N=1
##DATA TABLE= (X++(R..R)), XYDATA
$$ [...]
16649a3293j8083j0765J5828N05L121J4389L176l165j7264J0113O74o559K272
16636a9051P756N08K761p261K22N897n532O931J3737J0876q998P425J1528m247
16622B2552j5555p154l460J7025k892r594K789K3069K3233J0441J7315L649r684
16609G1734J7439K7842K6772K3589K7699M3259M2662K4710m374o168p031O75k0713
16596B68095k1043l6820l7942k8684k7190j8537k2346k5692k4869j3464m06K614
16584A3716j1026K769m180J3136J1652M677j1605k5282j0841R867J4536o930j2096
16571a1607n004J279J725l636R127P431n048j3366Q787J20J114J7911M35n797
16557C471r129K495J9405j0557k4054m811O474K390q707j781R709j3067j4910
$$ plain form
16649 -13293 -31376 -42141 -26313 -25808 -22687 -8298 -5122 -8287 -25551 -15438 -14764 -21323 -19051
16636 -19051 -11295 -10787 -8026 -15287 -15065 -9168 -14700 -7769 5968 16844 7846 15271 26799 22552
16622 22552 6997 -157 -3617 13408 10516 922 3711 26780 50013 60454 77769 81418 71734
16609 71734 89173 117015 143787 167376 195075 238334 280996 305706 301332 295164 288133 288808 268095
16596 268095 247052 210232 172290 143606 116416 97879 75533 49841 24972 11508 11102 13716
16584 13716 2690 5459 1279 14415 26067 30744 19139 -6143 -16984 -7117 7419 489 -11607
16571 -11607 -16611 -15332 -13607 -17243 -8116 -685 -5733 -19099 -10312 -10192 -9078 8833 9268 3471
16557 3471 -5658 -3163 16242 5685 -18369 -23180 -16706 -14316 -23023 -24804 -15095 -28162 -43072
16544d3072P724R460k078N211J970J0195J8133P745j104j3746j1000J782m6R879
16530A053o302J2389K417j9235l073m092K743J324O63R614p58n54j1595m106J693
16515a7819P323O090J0027K873o022K186q869p122O043j259k409J2170m691l822
16501e301L139m133J0855J4090L933j5756j495N838p915J287J642j0164p067J0219
16487h28J7174j868j7157p850r26R69L542J8965J2531J5195P852r041q859j8011
16473A1688r874N959N79M029j9106l200M29j7024P638L868J0654O797j6781j696
16459a6040p096j755K153j176m671P155Q508M851k105R949J0209l377k110m86
16445D009r702M739J8524l570k666k145o194J462N449j0948m54l639J104j6860
$$ plain form
16544 -43072 -35348 -25888 -27966 -22755 -20785 -10590 7543 15288 14184 438 -10562 -8780 -8826 1053
16530 1053 -5249 7140 9557 -9678 -12751 -16843 -14100 -12776 -12113 -2499 -3257 -3811 -15406 -19512 -17819
16515 -17819 -10496 -4406 5621 8494 2472 4658 -4211 -11333 -5290 -6549 -8958 3212 -1479 -5301
16501 -5301 -2162 -6295 4560 18650 22583 6827 5332 11170 3255 4542 6184 -3980 -11047 -828
16487 -828 16346 14478 -2679 -10529 -11455 -10486 -6944 12021 24552 39747 47599 38558 29699 11688
16473 11688 1814 7773 8352 12381 -6725 -9925 -9496 -26520 -18882 -15014 -4360 2437 -14344 -16040
16459 -16040 -23136 -24891 -22738 -23914 -28585 -21430 -12922 -8071 -10176 -227 9982 6605 4495 4009
16445 4009 -5693 -954 17570 14000 11334 9189 2995 4457 9906 -1042 -1496 -5135 -4031 -20891
16431b0891o74n511L223l257N797j183l35J5824q024j3345J2583P482M812j8284
16417b1783n76l387N645M275J510J4099K017M943J641j4023m788L512J4629N751
16403A3465n762L005m231j9810m1M418J1287L18j0042j4232p75J7081K5083j3967
16389E797l624m771k184o190L131M663L663P863r860k0323J055Q621J62M71j934
16374a3460L630Q223l845N4Q452r43k0365j5293J8573R365L802P641p109n277
16360f552p860r605P128Q114L283R775O683j4796j7832L183m758k946M865N710
16346a5608m364q338O997J1777M600j810J86M13M579N288J6027P576L356j3787
16332A6892k2776J0225l911o649K727l243L899q39J0968k1426l291M286N099J7797
$$ plain form
16431 -20891 -21565 -27076 -23853 -27110 -21313 -22496 -22831 -7007 -15031 -28376 -15793 -8311 -3499 -21783
16417 -21783 -22359 -25746 -20101 -15826 -14316 -217 1800 6743 8384 -5639 -10427 -6915 7714 13465
16403 13465 7703 10708 6477 -13333 -13374 -8956 2331 2649 -7393 -21625 -22400 -5319 19764 5797
16389 5797 2173 -2598 -4782 -10972 -7841 -3178 485 8348 -1512 -21835 -20780 -12159 -11997 -11526 -13460
16374 -13460 -9830 -1607 -5452 -5398 3054 2111 -18254 -33547 -14974 -5609 -1807 5834 -1275 -6552
16360 -6552 -14412 -24017 -16889 -8775 -5492 4283 10966 -3830 -21662 -18479 -23237 -26183 -21318 -15608
16346 -15608 -19972 -28310 -21313 -9536 -4936 -6746 -6560 -6147 -1568 3720 19747 27323 30679 16892
16332 16892 -5884 4341 430 -6219 -3492 -6735 -2836 -3675 7293 -14133 -17424 -13138 -8039 9758
16318I758P233m556o752j1584r839J867J0825J0872o79p144P227o198j008p784
16304g762k544m497J0924O371j0144j6645m191J3119n212r952J36J3008R399L807
16290d183J3421m901K681p112j0079Q394Q041m014j8267r961N002J6034O954o462
16276d452j6759N086l901O068L929n924M496k235R610O876k0828l590J5271j859
16262h212o856p964J7682m452j1852P3M256Q443N694j2312j1113J6381J9703M568
16248A4039k683k2096j2416J1683J3311p67j3572j1763n422j2547n887L0685J114
16235a6321n494K878J894K416p63j0741L361M344J7279J6766j2061k4596J2458
16222h580J6055r604j1390l95K636p183p473P285J0616M969L848j4350r373O832
$$ plain form
16318 9758 16991 12435 5683 -5901 -15740 -13873 -3048 7824 7145 1 7228 1030 22 -7762
16304 -7762 -10306 -14803 -3879 2492 -7652 -24297 -28488 -15369 -20581 -30533 -30397 -17389 -7990 -4183
16290 -4183 9238 4337 7018 -94 -10173 -1779 6262 2248 -16019 -25980 -20978 -4944 2010 -4452
16276 -4452 -21211 -16125 -20026 -13958 -10029 -15953 -11457 -13692 -4082 2794 -18034 -21624 -6353 -8212
16262 -8212 -15068 -23032 -5350 -9802 -21654 -21581 -17325 -8882 -3188 -15500 -26613 -10232 9471 14039
16248 14039 11356 -10740 -23156 -11473 1838 1071 -12501 -24264 -29686 -42233 -48120 -17435 -16321
16235 -16321 -21815 -18937 -17043 -14627 -15390 -26131 -22770 -18426 -1147 15619 3558 -21038 -8580
16222 -8580 7475 -2129 -13519 -13914 -11278 -18461 -25934 -18649 -8033 -3064 784 -13566 -22939 -16107
16208a6107J2484j0476o109k343J1648L203j5094J0422J6496J0786l318N76j271
16195A0897j0097k429K571J432M686j2472k2636M690J5629O304j4574j5275p71
16182c2045L615R653K2205P077j373K38n664m951N992p15K584r986j1291J568
16168a3093l483j0653M708J8182p209l70O493N00N782J000o228R544J8424J788
16154B5385M445m682j8125j2744P295O971J3068N630j3614j0245j3516j9184J1554
16141a7762K075R064Q104p122J919K1743N318j5707k0750p76O67J76P855K0685
16127A5489o92j0235q421l327j2108P158J685j3759j2974R793J4971K361j0041
16114b0100J0558K857k898J0876l78Q491l114q569L804L038q397j2294j0453L780
$$ plain form
16208 -16107 -3623 -14099 -20208 -22551 -10903 -7700 -22794 -12372 4124 14910 11592 12168 10897
16195 10897 800 -1629 942 2374 7060 -5412 -28048 -23358 -7729 -1425 -15999 -31274 -32045
16182 -32045 -28430 -18777 3428 10505 9132 9370 3706 -1245 4747 4032 6616 -3370 -14661 -13093
16168 -13093 -16576 -27229 -22521 -4339 -11548 -11918 -5425 -4925 857 1857 -4371 5173 23597 25385
16154 25385 29830 25148 7023 -5721 1574 8545 21613 27243 13629 3384 -10132 -29316 -17762
16141 -17762 -15687 -6623 1481 -5641 -3722 18021 23339 7632 -13118 -13894 -13227 -13051 -5196 15489
16127 15489 14797 4562 -3859 -7186 -19294 -12136 -10451 -24210 -37184 -27391 -12420 -10059 -20100
16114 -20100 -9542 -6685 -9583 1293 915 9406 6292 -2277 1527 4565 -3832 -16126 -26579 -22799
16100b2799K5007R944o269N182r796j857M441K220n482j967q396O214O398M659
16086G499j141j2522O42J1920m385j4105J152m573j1272O255R272J1173K4303
16073B4218P176o854q762q887l952o165l102P857P060L728l244k5601L4k923l243
16058b2660M620J556J13O05K488J866J610j4424q506R692J1550m571j823Q773
16044i111o388J2589Q87n188O695o473k2895R602J4665J6183Q624p212o351j2089
16030f462j0041K673P191N889j2598J545J0858l176q482j0330n869o24N926K167
16016b1333O839P771Q283J709j8101m605J4168P549k109K984K879m316l613O273
16002D378P046q326k1245k2208k744Q352O258J082N964R048K489N558O868L727
$$ plain form
16100 -22799 2208 12152 5883 11065 1269 -588 3853 6073 591 -1376 -9772 -3558 2840 7499
16086 7499 6358 -6164 -5522 6398 2013 -12092 -10940 -15513 -26785 -20530 -11258 -85 24218
16073 24218 31394 24540 15778 6891 2939 -3226 -6328 1529 8589 12317 9073 -16528 -16494 -19417 -22660
16058 -22660 -18040 -16484 -16371 -15766 -13278 -11412 -9802 -24226 -32732 -23040 -11490 -16061 -17884 -9111
16044 -9111 -15499 -2910 -2023 -7211 -516 -6989 -29884 -20282 -5617 10566 19190 11978 5627 -6462
16030 -6462 -16503 -13830 -6639 -750 -13348 -11803 -945 -4121 -12603 -22933 -28802 -29426 -23500 -21333
16016 -21333 -14494 -6723 1560 3269 -14832 -19437 -5269 2280 171 3155 6034 1718 -1895 4378
16002 4378 11424 3098 -18147 -40355 -43099 -34747 -28489 -27407 -21443 -12395 -9906 -4348 2520 6247
15988F247l738J678O95o190r868q36J9212P584q215n561J177r408r490M271K1673
15973I231Q182j3187n146J0777K004p706k1703q042j820l575J8155N817p98R315
15959A504R13j7429l041J1527j813L872M455k030l869j996o30P961L861R868l16
15944A2837j474p950j32Q27k365J274J0887l880n487K611J588Q553n360N691j0141
15929G479j1604o137j572o14p487P015O409L365p662j4194j05J5820J3543O968
15915A1224j9591q358P664R359N759j109q728R942K555M747j5348j3662Q551P72
15901f223L686L080J889j07J101l899j2232j1198J2338J5753j406Q995K141n388
15887H530o96M576j8113o393l554M504j8596R374P711M353m108p983J6277N803
$$ plain form
15988 6247 2509 4187 4882 -1308 -11176 -12012 7200 14784 6569 1008 2185 -7223 -16713 -12442 9231
15973 9231 17413 4226 -920 9857 11861 4155 -17548 -25590 -27410 -30985 -12830 -7013 -7811 1504
15959 1504 2417 -15012 -18053 -6526 -8339 -4467 -12 -2042 -5911 -7907 -8537 -576 3285 13153 12837
15944 12837 11363 3413 3281 4108 1743 3017 13904 10024 4537 7148 8736 17289 11929 17620 7479
15929 7479 -4125 -10262 -11834 -12448 -19935 -12920 -6511 -3146 -10808 -25002 -25107 -9287 4256 11224
15915 11224 -8367 -16725 -9061 298 6057 4948 -3780 6162 8717 13464 -1884 -15546 -6995 -6223
15901 -6223 -2537 543 2432 2325 3426 -473 -12705 -23903 -11565 4188 2782 11777 13918 8530
15887 8530 7834 12410 -5703 -12096 -15650 -11146 -29742 -20368 -12657 -8304 -12412 -20395 -4118 1685
15873A685j0575K344N372n232r950N762Q794j3675m96Q085R469Q59j0836P048
15859a346N351L498j8437j0242J0047R648k830O102J5839R511l63P22j8379k0572
15845a1451j0764j8915P0M891J2009j410p874J0899R094Q746j512l291M073k230
15831g665p937J3760m567j3075k939j414o377n159J2151J3837J3754L217j636
15818E950L78k574p040J3249P918k349k0185j7771J0332J2917j395Q928j5492
15805g134q829L728m72O033J3494l0260j8397L074j543m39N755j52J0363J5140
15791i639L079L803J163j07P898K1020l863j0641r044q434M562J1487O989j6874
15777A399o826J732j989J1573J1295j2660j811N015Q264n473N399M183n080q125
$$ plain form
15873 1685 -8890 -6546 -1174 -6406 -16356 -10594 -1800 -15475 -15971 -7886 1583 2442 -8394 -1346
15859 -1346 4005 7503 -10934 -21176 -11129 -1481 -4311 1791 17630 27141 26778 27500 9121 -11451
15845 -11451 -22215 -41130 -41060 -36169 -24160 -25570 -33444 -22545 -13451 -4705 -6217 -9508 -5435 -7665
15831 -7665 -15602 -1842 -6409 -19484 -22423 -23837 -30214 -35373 -23222 -9385 4369 7586 5950
15818 5950 6328 3754 -3286 9963 17881 15532 -4653 -22424 -12092 825 -570 8358 -7134
15805 -7134 -15963 -12235 -12707 -6674 6820 -23440 -41837 -38763 -40306 -40745 -34990 -35142 -24779 -9639
15791 -9639 -6560 -2757 -1594 -1701 6197 27217 23354 12713 3669 -4765 -203 11284 18273 1399
15777 1399 -5427 -3695 -5684 5889 17184 4524 2713 7728 15992 10519 15918 20101 15021 6896
15763F896N691N481m783j4361Q377J1495j709M566J2477r709r10p802j4098Q620
15749A0231K2570q17o250j5492o970r114R153K2776o960r016j994n796n305L047
15735F3j57L220l487j0841j4190O781J833P724M395q829k328O240j833O01p423
15720a8231N29N916Q737J3843M305j754q036j650n699l332k99k43r732N026J5991
15705E371L606j97m539j0202j3501J0167J7998M426k1922j716O174J4403j1601
15692a533j2072J441j49N100J5749j26j0470k44j533p822M890l248O349M402K319
15677C053m396j7258j4573J9473J5067O192j4517r496P726j26j6032j084R833
15664a6138M683J2640J0952N22rj1030n691m688O984k931j3911j4394M07Q665
$$ plain form
15763 6896 12587 18068 13285 -1076 7301 18796 17087 21653 34130 24421 23511 15709 1611 10231
15749 10231 32801 31984 25734 10242 3272 -5842 3311 26087 19127 10111 8117 2321 -2984 63
15735 63 -94 3126 -361 -11202 -25392 -18611 -16778 -9054 -4659 -13488 -15816 -9576 -11409 -10808 -18231
15720 -18231 -17702 -11786 -3049 10794 15099 13345 5309 3659 -2040 -5372 -5671 -5914 -15646 -10620 5371
15705 5371 8977 8780 4241 -5961 -19462 -9295 8703 13129 -8793 -10509 -4335 10068 -1533
15692 -1533 -13605 -12164 -12313 -7213 8536 8410 -2060 -2304 -3837 -11659 -6769 -10017 -3668 734 3053
15677 3053 -1343 -18601 -33174 -13701 1366 7558 -6959 -16455 -8729 -8855 -24887 -25971 -16138
15664 -16138 -11455 1185 12137 12659 12650 1620 -4071 -8759 -1775 -4706 -18617 -33011 -32604 -23939
15650b3939R891J5885o96l219k04j3276J575N643J5765n924j6776J7761J9034
15637B1520p426k1850k154J9039J1077j0451k1607K731K620l309J781N023J2457
15624I451R841r340q339J048J0875j8898j220Q543J878J388j741j1191l464Q497
15610b672R769N920k044J707j085j3225J3560P742j0608M518n189j0112N247j06
15596C422p417L188J9670Q656N15k312l5929q753J0117J0147J0480o195O20k008
15582D201m350j0746j6645k19J3275J1053j3270p422P46O131O796J450j382j6750
15568b7132o215J6685r8o114L654Q566P450K244J5195O309j2232n229K2438O107
15554C1628j7968j0120j1583r696K232J5678o80L36P378O645l479K714N117K151
$$ plain form
15650 -23939 -14048 1837 1141 -2078 -2282 -15558 -13983 -8340 7425 1501 -15275 2486 21520
15637 21520 14094 -7756 -9910 9129 20206 9755 -11852 -9121 -6501 -9810 -8029 -3006 9451
15624 9451 19292 9952 1613 2661 13536 -5362 -6582 1961 3839 5227 3486 -7705 -11169 -2672
15610 -2672 7097 13017 10973 12680 11595 -1630 11930 19672 9064 13582 8393 -1719 3528 3422
15596 3422 -3995 -807 18863 27519 28034 25722 -10207 -18960 -8843 1304 11784 5589 6209 4201
15582 4201 -149 -10895 -27540 -27759 -14484 -3431 -16701 -24123 -23377 -17246 -10450 -9000 -10382 -27132
15568 -27132 -33347 -16662 -16760 -22874 -19220 -10654 -3204 -960 14235 20544 8312 3083 25521 31628
15554 31628 13660 3540 -8043 -17739 -15507 171 -509 -173 7205 13850 10371 13085 18202 20353
15540B0353l238P574J0062j3679q804Q962j6528O49J5866j0458j2026o209l02
15527g778J4788J199o760M439L242M726M252m839j2859m38o52r59r904R363p991
15512a0171r452L860K512K438J770O43j2506o6J0263L703r181m505O360j3952
15498b8284n580R180P851K632O326k904j2712R759J1187j0076J4641N304p115
15485B09k728n472r896J046L399p904P922J6273J343q521L041L722j6106J0001
15471c671K1708M157k696k818J424l419k719q254k217j2971p003J3756p603j044
15457a3370K67Q71o924L098J5209k233o526J4914Q432K272k925r964n610Q606
15443F117P58N189Q183q82j2567l4604k5682L190j0226J8990O910O111Q020J4304
$$ plain form
15540 20353 17115 24689 34751 21072 12268 21230 4702 5351 21217 10759 -1267 -7476 -7778
15527 -7778 7010 8209 1449 5888 9130 13856 18108 13269 410 -28 -680 -1639 -11543 -2180 -10171
15512 -10171 -19623 -15763 -13251 -10813 -9043 -8400 -20906 -20972 -10709 -7006 -16187 -20692 -14332 -28284
15498 -28284 -33864 -24684 -16833 -14201 -7875 -10779 -23491 -13732 -2545 -12621 2020 7324 209
15485 209 -2519 -7991 -17887 -16841 -13442 -21346 -13424 2849 4192 -4329 -1288 2434 -13672 -3671
15471 -3671 18037 22194 19498 16680 18104 14685 11966 3712 1495 -11476 -18479 -4723 -12326 -13370
15457 -13370 -13103 -12232 -19156 -16058 -849 -3082 -9608 5306 13738 16010 13085 3121 -2489 6117
15443 6117 6875 12064 20247 19365 6798 -27806 -53488 -50298 -60524 -41534 -34624 -28513 -20493 -6189
15429f189J1436P11j478O77k971o653l439p821r80J6777K017k367M636P337K761
15414A4454k0373P756j365k2615R22K3073J7973j520j67J92J4316p126l4685q522
15400a7687K0977K667j374l814k716N131j909J915n10p350j1346O49O022O320
15386c025l917l215k211O031J9732J36j806k509O046j403o748k980l730l718j4118
15371a7435P09P791K079n320J402J171K703N175Q79o670l170o704K556Q646R884
15356C696j553P541n244O00m149m873n486n80o736j321M241O400n793n706J760
15341a7203J2451J2406J3376n246j6008r960M24j872J2467k394j1384J6586O115
15328I758J1840J235j3742j3722r724J3868q707J874P956o780l191k516R618j3171
$$ plain form
15429 -6189 5247 5958 4480 5157 2186 -4467 -7906 -15727 -16707 70 2087 -280 4356 11693 14454
15414 14454 -5919 1837 472 -22143 -21221 1852 19825 18305 18138 18330 32646 25520 -9165 -17687
15400 -17687 3290 5957 4583 769 -1947 3184 1275 3190 2680 -4670 -16016 -15367 -9345 -3025
15386 -3025 -6942 -10157 -12368 -6337 13395 13531 11725 9216 15262 13859 7111 4131 401 -3317 -17435
15371 -17435 -16726 -8935 -6856 -12176 -10774 -9603 -6900 -1725 -846 -7516 -10686 -17390 -14834 -6188 3696
15356 3696 2143 9684 4440 5040 891 -3982 -9468 -10048 -16784 -18105 -13864 -7464 -13257 -18963 -17203
15341 -17203 -4752 7654 21030 15784 -224 -10184 -9760 -11632 835 -1559 -12943 3643 9758
15328 9758 21598 22833 9091 -4631 -14355 -487 -9194 -7320 636 -6144 -9335 -11851 -2233 -15404
15314a5404R176K2343l847j7143q995l995K7J2148L8150N939j8612k3423n017
15301h653O185M304p2p94o045l195J269L059P210J4728j163j3259j0891q564J2268
15286c613R874K754p060l244l142R471O326j5181j4465O318p946N981J2269N349
15272C691P191K4325K1795j8889j5907L37p69L74R837p923j4730j6555J355O550
15258F82J153J5544q999k0200J321l085j8173m981J6601P128J0744N438K4666
15245B7839M076j8831r321k618l181O132R118J5977j3123r598J2189j1355J367
15232H671K793j111L672J0357M132q721j4472k257O461j4166m430k11J1412K2698
15218B4828J225K100j2283O278M110j863j641P028m52j4927j0089P78J246l035
$$ plain form
15314 -15404 -6228 16115 12268 -4875 -13870 -17865 -17838 -5690 32460 38399 19787 -3636 -8653
15301 -8653 -2468 1836 1764 970 -5075 -8270 -7001 -3942 3268 17996 16833 3574 -7317 -15881 -3613
15286 -3613 6261 9015 1955 -1289 -4431 5040 11366 -3815 -18280 -11962 -19908 -13927 -1658 3691
15272 3691 10882 35207 57002 38113 22206 22543 21774 22148 31985 24062 9332 -7223 -5868 682
15258 682 1835 17379 8380 -11820 -10499 -13584 -31757 -36738 -20137 -13009 -2265 3173 27839
15245 27839 31915 13084 3763 1145 -2036 4096 13214 29191 16068 6470 18659 7304 8671
15232 8671 11464 10353 14025 24382 28514 19793 5321 3064 9525 -4641 -9071 -9282 2130 24828
15218 24828 26053 28153 15870 22148 26258 24395 22754 29782 29330 14403 4314 5092 6338 3303
15204C303j2525m896R611q885Q037O499M91N00j6827k069Q437O900J82Q764Q944
15189A6466l451j6396L540O616o060m804K342M280O74o391P598N060r894m343
15175d763r467J6837N189j3042q193J1078m724m854J3056q338K690J0904J026
15162G399j2699o46J489p818o785J2671n872n02m591J1129J5605K408q196j0810
15148g218L398L365j242n69r31n17J966M949l081k541l679k930j843K764R677
15133A568J8719K207L174l218j4142j894o196j7878P206R983J4739p375Q630N648
15119B1171r263k231k271K595m508l733K344n486J248L29n644J4030Q745j0270
15105G056j796l795l977L422P93O805J690O437L893r476r480J053K298j857j0667
$$ plain form
15204 3303 -9222 -14118 -4507 -13392 -5355 1144 1635 2135 -14692 -16761 -8324 -1424 -1242 7522 16466
15189 16466 13015 -3381 159 6775 715 -4089 -1747 2533 3207 -3184 4414 9474 -420 -4763
15175 -4763 -14230 2607 7796 -5246 -13439 -2361 -7085 -11939 1117 -7221 -4531 6373 7399
15162 7399 -5300 -5946 -4457 -12275 -19060 -6389 -12261 -12763 -17354 -6225 9380 11788 3592 -7218
15148 -7218 -3820 -455 -1697 -2266 -3197 -3714 -1748 3201 120 -2421 -6100 -9030 -10873 -8109 1568
15133 1568 20287 22494 25668 22450 8308 6414 218 -17660 -10454 -471 14268 6893 15523 21171
15119 21171 11908 9677 7406 10001 5493 1760 4104 -1382 -134 195 -5449 8581 17326 7056
15105 7056 5260 1465 -2512 910 1703 8508 10198 16635 20528 11052 1572 2625 4923 3066 -7601
15090g601N811o234j2303O175n08Q588J3328j776Q64j031j4702J0046O055P726
15076A4438m032j6569N762J7454P130p669r940J510M286J0729k977l939l515j2266
15062D02m934J805n491O34q898L243J0665j1014j0260R800M236l587K704Q370
15048b325P768N414j4201n579L736O525k840o476j96m955j0735k084J9673j4205
15034b0480N75O321k948P458J270r807j3149J3556J4128J9187n99l974l520j1273
15020c255j133J0438p568n286l530Q795J2890O37j0814r362Q722J2289R756j195
15006B1384m183j1062k279r230n450l341J634m584J778R821J0396j260P690N594
14992A6908n29j3130Q904J0508L99j422J3486n493o469m493r002p598r250m727
$$ plain form
15090 -7601 -1790 -8024 -20327 -14152 -14660 -6072 7256 5480 6344 5313 -9389 657 6712 14438
15076 14438 10406 -6163 -401 17053 24183 16514 6574 8084 12370 23099 20122 16183 12668 402
15062 402 -4532 -2727 -8218 -7584 -16482 -13239 -2574 -13588 -23848 -14048 -9812 -13399 -10695 -2325
15048 -2325 5443 10857 -3344 -8923 -5187 1338 -1502 -7978 -8174 -13129 -23864 -25948 -6275 -20480
15034 -20480 -19905 -13584 -16532 -9074 -7804 -17611 -30760 -17204 -3076 16111 15512 11538 8018 -3255
15020 -3255 -4388 6050 -1518 -6804 -10334 -1539 11351 11988 1174 -8188 534 12823 22579 21384
15006 21384 17201 6139 3860 -5370 -10820 -14161 -12527 -17111 -15333 -5512 4884 3624 11314 16908
14992 16908 16379 3249 12153 22661 23060 21638 35124 29631 23162 18669 9667 2069 -7181 -11908
14978a1908O281J2217j417n668j8p51J39L497o34Q327m344q359O607R912K759
14963A6640o779j1580m916M458K569j464j222P626P852J546J00J118j3384j1289
14949h725o693o046P614N149n500r199j1380J566J0725J9594J1709J529m702j3171
14935g530M588J218r419L96m673j3105k328J7482N106m015L212j657O823k291
14921f193P93r30n334n05L719O68l551M333J41j164j575J1385J882L221Q366Q83
14905A6139n810Q75m471j3636M035l259K282J5494k609k1915j5905J050J9800
14892g930P449k888L782R175N636l154j2635l758P187Q895n685m144L134k608
14878B456K133r310p707r660L678J7596J0689l461n177n912n030O348N068L079
$$ plain form
14978 -11908 -5627 6590 5173 -495 -513 -1264 -1125 2372 1738 10065 5721 -2638 3969 13881 16640
14963 16640 9861 -1719 -6635 -2177 392 -1072 -2294 5332 13184 14730 14830 15948 2564 -8725
14949 -8725 -15418 -21464 -13850 -8701 -14201 -23400 -34780 -33214 -22489 -2895 8814 10343 5641 -7530
14935 -7530 -2942 -1724 -11143 -10747 -15420 -28525 -30853 -13371 -8265 -12280 -9068 -10725 -3902 -6193
14921 -6193 -5400 -6330 -11664 -12169 -8450 -7782 -11333 -7000 -6859 -8023 -9598 1787 3669 6890 15256 16139
14905 16139 10329 11204 6733 -6903 -2868 -6127 -3845 11649 9040 -12875 -28780 -27730 -7930
14892 -7930 -481 -3369 413 9588 15224 12070 -565 -4323 2864 11759 6074 1930 5064 2456
14878 2456 4589 -4721 -12428 -22088 -18410 -814 9875 6414 1237 -4675 -9705 -3357 1711 4790
14864D790Q916P389j1391P36j890j560K51r530L845j633m207j634N714O114m819
14849A091j0856O167m190L662M675k96K263k487n167R859Q052J1781m196j2189
14835H169k658O248k937q694q437Q096j1930r79J2630k605j8590L063N258Q619
14821d747K802R42l634n695J0207J2836M771J1002R606k671j2332j8860L403L185
14807A0815j876j1347J297O017O388L132n841o086q108J4378P585r922Q503L633
14793A8568q202P326J3876j0346p601P481j5951j1389M828J9204Q644p289K538
14780B1687M318j8022j1852j639K531K899l165M386J0936j502M850j721m813R704
14766A8597j0793O440O267o832n794Q679j6507j9980K939j949J1466P895l609
$$ plain form
14864 4790 13706 21095 9704 10440 8550 6990 7241 -2289 1556 -77 -4284 -5918 -204 5910 1091
14849 1091 -9765 -3598 -7788 -4126 549 253 2516 29 -5138 4721 12773 24554 20358 8169
14835 8169 5511 11759 8822 128 -8309 -213 -12143 -13122 -492 -3097 -21687 -18624 -13366 -4747
14821 -4747 -1945 -1003 -4637 -10332 -125 12711 17482 28484 38090 35419 23087 4227 7630 10815
14807 10815 8939 -2408 -1111 4906 11294 14426 8585 2499 -5609 8769 16354 6432 14935 18568
14793 18568 10366 17692 31568 21222 13621 21102 5151 -6238 -1410 17794 26438 19149 21687
14780 21687 26005 7983 -3869 -5508 -2977 -78 -3243 1143 12079 10577 15427 13706 8893 18597
14766 18597 7804 14244 20511 13679 7885 16564 57 -19923 -16984 -18933 -7467 428 -3181
14753c181k571Q936j1664j8048L567J6995J913J316n649l206j986n230q02J4277
14739e333M130j2824m223L083K278r508M62J5080J2364m165p221O990M548Q4Q292
14724A4037j089k2219j9629l092J3578Q802k949k44n091p622k200k63J4460M954
14710h567o101l411O016N453M132r580p931O010J7451K587j103n651J809K252
14696C366J8042j436m860k948n670o275o343m97N030K172Q199K901q308J830j025
14681D178j1119O756J5326q24r078l710J2706M047q718j043n692j6931j0376p654
14667c2132O0J0984K2585J0183Q766j2428k94K204k762O054j5293m586O563j8348
14653a8444k397K6030j358j4917n354K3383J239q59m207j899o516R449n920l426
$$ plain form
14753 -3181 -5752 3184 -8480 -26528 -22961 -5966 -4053 -2737 -8386 -11592 -13578 -18808 -19610 -5333
14739 -5333 -1203 -14027 -18250 -15167 -12889 -22397 -21935 -6855 5509 1344 -5877 1113 5661 5745 14037
14724 14037 12948 -9271 -28900 -31992 -18414 -9612 -12561 -12805 -17896 -25518 -27718 -27981 -13521 -8567
14710 -8567 -14668 -18079 -12063 -6610 -2478 -12058 -19989 -13979 3472 6059 4956 -695 1114 3366
14696 3366 21408 19972 15112 12164 6494 219 -6124 -6621 -1591 581 8780 11681 3373 5203 4178
14681 4178 -6941 -185 15141 14317 5239 1529 14235 18282 9564 8521 2829 -14102 -24478 -32132
14667 -32132 -32072 -21088 1497 11680 20446 8018 7724 9928 7166 13220 -2073 -6659 -96 -18444
14653 -18444 -20841 5189 3831 -11086 -16440 6943 8182 7323 3116 1217 -5299 4150 -1770 -5196
14639e196J2386j7726P874J2073M112J2062O893k6944j3288J6465p796Q85k394
14626e94q468O852Q459m465l869k313j068L652J790m854o915J460q429J025Q044
14611i693R072r329o486M624J0809J998k582m860j5167j3654P714K5745R231r992
14597b570o297j719j2708J0532R851j2405N272K0705R455M56L048q162q571M953
14583A1840O381r528j0210K840N493k656n51J151J4393p838l473o068M15j977
14569B12P323M790J5708J6701k1526j4129p942j265O296P223P939j8289p650l156
14555g765m164J4291J7467r807N389j1841n275q060j0377l708J3422J9649M589
14542A3810K258j745q824L073Q318j1809O351J4817J311q047j643O595p424k4819
$$ plain form
14639 -5196 7190 -10536 -2662 9411 13523 25585 32478 5534 -7754 8711 915 1800 -594
14626 -594 -9062 -2210 6249 1784 -2085 -4398 -5466 -1814 -24 -4878 -11793 -10333 -18762 -17737 -9693
14611 -9693 -621 -9950 -16436 -11812 -1003 995 -1587 -6447 -21614 -35268 -27554 -1809 7422 -2570
14597 -2570 -8867 -10586 -23294 -12762 -2911 -15316 -10044 10661 20116 20572 23620 15458 6887 11840
14583 11840 18221 8693 -1517 1323 6816 4160 3609 4760 19153 11315 7842 1774 2189 212
14569 212 7535 12325 28033 44734 23208 9079 1137 -128 6168 13391 21330 3041 -4609 -7765
14555 -7765 -11929 2362 19829 10022 15411 3570 -1705 -9765 -20142 -23850 -10428 9221 13810
14542 13810 16068 14323 5499 8572 16890 5081 11432 26249 27560 19513 17870 24465 17041 -7778
14528g778J3931J4245J4343J474j5698r247l632q558M430k010M094n530j4494
14515a4430j269O315J4193j145M301j481j4936j1443J257n312J0989K4515k451
14502I103j3967L41j2567J069J0913J4628J1722j5234j440Q839j278j2843J963
14489A249L654N120q38j4886j1326J9403p578M643n503j139j3p827O720R69r636
14474a6988N862J4068J0392R847l650r231j2013q890N794J2317o314J0353l526
14461H021o565N056L261J0883j597j0525n815J373P522k885r258j2042O201k887
14447i257l120k849K714Q208Q8R360L733J7714L45k1083j8599O254k193L536Q543
14432C394n16j0569L98M33n789J2132O543M043m274k775o631j2671q62j496L688
$$ plain form
14528 -7778 6153 20398 34741 36215 20517 11270 7638 -920 3510 1500 5594 64 -14430
14515 -14430 -15699 -9384 4809 3664 7965 6484 -8452 -19895 -18638 -23950 -12961 11554 9103
14502 9103 -4864 -4523 -17090 -16021 -5108 9520 21242 6008 4568 13407 12129 -714 1249
14489 1249 4903 10023 9185 -5701 -17027 2376 -5202 -559 -6062 -7201 -7214 -15041 -8321 -7352 -16988
14474 -16988 -11126 2942 13334 23181 19531 10300 -1713 -10603 -4809 7508 1194 11547 8021
14461 8021 1456 6512 9773 20656 19059 8534 2719 4092 11614 8729 -529 -12571 -6370 -9257
14447 -9257 -12377 -15226 -12512 -4304 -4216 5144 8877 26591 26936 5853 -12746 -6492 -8685 -5149 3394
14432 3394 2878 -7691 -7293 -6860 -12649 -517 6026 10069 5795 3020 -3611 -16282 -17144 -18640 -14952
14417a4952R375Q036l365j5929k309J7269j647Q46J1772J4309j4271p896O901
14404H139P420M434j429j5747N275P876j1374O57L187j151Q810m517j6970N456
14390F6K5301k410j4530j1400P208N184j157L188j714q527l308q047M796L394
14376a956Q14P270j3329j3518n73J796R963P423M044k437j8982k388r942Q238
14362b3577R386q119J797Q839l984J3014J783R811P005j2430j2302N101J835N729
14348C888l389K821l494k967k439j013q812o860N217J769j803J3589K192q645
14334i946K72k06k064O910O188m358l104R686J682j059j532L246j715j117k431
14319D52J679O106N354M751o540J095N913r544n201n172m370O986O229P492J758
$$ plain form
14417 -14952 -5577 2459 -906 -16835 -19144 -1875 -3522 -2676 9096 23405 9134 1238 8139
14404 8139 15559 19993 18564 2817 8092 15968 4594 5251 8438 7287 16097 11580 -5390 66
14390 66 25367 22957 8427 -2973 4235 9419 8262 11450 9736 1209 -2099 -10146 -5350 -1956
14376 -1956 -1142 6128 -7201 -20719 -21292 -19496 -9533 -2110 1934 -503 -19485 -21873 -31815 -23577
14362 -23577 -14191 -22310 -20513 -11674 -15658 -2644 -861 8950 15955 3525 -8777 -3676 -1841 3888
14348 3888 499 3320 -174 -3141 -5580 -6593 -15405 -22265 -17048 -15279 -17082 -3493 -1301 -9946
14334 -9946 -9674 -9880 -11944 -5034 1154 -3204 -6308 3378 5060 4001 2469 5715 4000 2883 452
14319 452 2131 8237 13591 18342 11802 12897 18810 9266 4065 -1107 -5477 1509 7738 15230 16988
14304A6988p312j1014j4345N715J7696J5329J3202r700q819q494j6139j278J7161
14291H990N499K994l2j3126m980K362P690P659m199j1549k587q040N433n638J1804
14276B280J1828j4684n051M580J0405n545q032N084j061j3317j241J2965P491
14263E702J580r986r389P82N008O745J2616Q428j3506o779m828r097R406K0453
14249A7135j3305m253J1112J0973J576j2173k7912J085J2080l946k452o147O437
14236i790J393J2471J0934J215n777J1387L013j4929m088P22O372j8329N58Q025
14222C177j451k538j9839j3465M170Q77O249O475M289p411o501L030J8374L97
14208d167j230M915J6023N268m723k372r612J605R92j132n148R379P572p016J0996
$$ plain form
14304 16988 9676 -1338 -15683 -9968 7728 23057 36259 26559 17740 9246 -6893 -8171 8990
14291 8990 14489 17483 17451 4325 -655 1707 9397 17056 12857 1308 -1279 -9319 -3886 -9524 2280
14276 2280 14108 -576 -5627 -1047 9358 3813 -4219 865 -196 -13513 -14754 -1789 5702
14263 5702 7282 -2704 -12093 -11311 -6303 442 13058 21486 7980 1201 -3627 -12724 -3318 17135
14249 17135 3830 -423 10689 21662 23238 11065 -16847 -15762 -3682 -7628 -10080 -16227 -9790
14236 -9790 -8397 4074 15008 16223 10446 21833 24846 9917 5829 6551 12923 -5406 -4848 3177
14222 3177 1726 -812 -20651 -34116 -29946 -29069 -22820 -16345 -12056 -19467 -25968 -22938 -4564 -4167
14208 -4167 -5397 -482 15541 20809 16086 13714 4102 5707 6699 5567 419 9798 17370 10354 21350
14193B1350k367j3899o503J229N313n485p154R12J7774Q134j7569k51J5737J152
14179A8373j464J3212J158j5555l664N565Q29O425j008j9578M60J41P635q480
14165D049p552J0410j1686j9273J0916R651o382k83L908J5028J3494m34r670j0642
14151A534J2793K126n084j326m076P706J563p172O359l59O154J1236R545j9562
14137B1437l022j5717n05O277J0727j1816O437N526j623O492O255J0508n117p759
14123B8100j0843j0008j0950j824J2475r098l590o874k329J0645K653M024k680
14110b99r915J0592o438n642j0579J8765Q334m371J311m775M139j3469j6616O688
14096b2275k279m559J1696O990J2130J923R180k502K862l894j3109J3440R28o796
$$ plain form
14193 21350 18983 5084 -1419 -190 5123 -362 -7516 -6604 11170 19304 1735 1484 17221 18373
14179 18373 16909 30121 31279 15724 12060 17625 18454 24879 23871 4293 4753 4894 12529 4049
14165 4049 -3503 6907 -4779 -24052 -13136 -3485 -9867 -10150 -6242 8786 22280 21846 12176 1534
14151 1534 14327 16453 11369 10043 5967 13673 15236 8064 14423 14064 20218 31454 40999 21437
14137 21437 18415 2698 2193 8470 19197 7381 13818 19344 17721 24213 30468 40976 35859 28100
14123 28100 17257 7249 -3701 -5525 6950 -2148 -5738 -12612 -14941 -4296 -1643 2381 -299
14110 -299 -10214 378 -6060 -11702 -22281 -3516 4818 447 1758 -3017 1122 -12347 -28963 -22275
14096 -22275 -24554 -29113 -17417 -10427 1703 3626 12806 10304 13166 9272 -3837 9603 10531 3735
14082C735R962n369k395O62R616J9541j4170j3076n392k1286n188J9832j1005
14069a4533j0276O834J2185J5175r727J512Q94J3614L489j1572O916R921p079
14056A7353j2575q361L076o333M84N353Q70J160j508N646J25j4416r109j909k043
14041b2187j0641M553K1239k550M16J1834R489k548l903J3415j796j3360j1281
14028g320J5574k361K89O927J2989o707K325k930k526P728j1852j3813j2211N791
14014h097K0275L918n31M137q505p784p126n753N567M359m513M680J3359M042
14000A8028N15o516n540n091m472N136l858k164J1428N643o560Q126J041j0731
13986D985k4001K425O442J1123L577Q982J7223J362o257q212j7017N165J3029
$$ plain form
14082 3735 13697 8328 5933 6595 16211 35752 21582 8506 3114 -18172 -23360 -3528 -14533
14069 -14533 -24809 -17975 -5790 9385 -342 1170 2064 15678 19167 7595 14511 24432 17353
14056 17353 4778 -3583 -507 -6840 -6356 -1003 -133 1027 -481 5165 5290 -9126 -18235 -20144 -22187
14041 -22187 -32828 -28275 -7036 -9586 -9170 2664 12153 9605 5702 19117 17321 3961 -7320
14028 -7320 8254 5893 6182 13109 26098 19391 21716 18786 16260 23988 12136 -1677 -13888 -8097
14014 -8097 12178 16096 15565 19702 11197 3413 -3713 -9466 -3899 460 -4053 627 13986 18028
14000 18028 18543 12027 6487 1396 -3076 2060 -1798 -3962 7466 13109 6549 14675 15716 4985
13986 4985 -19016 -16591 -10149 974 4551 13533 30756 32118 25861 17649 632 5797 18826
13973A8826R024j3826j0688n344J200R627j569O49N365J0017q589n57o634J584
13959I085k97r141R105q915q187L81J0345l160j074J477j659N515M615L994J2034
13944B4118N27n904O22q262m406l377o197r70J120q35o019O266J4069J968L684
13929A6404P531j2604J784o560p437M412K58k988P81L668n174j945j0551J6748
13915D327J0410O3k4332j542O613L074J1448o604n1j738j2466K774j880l279l953
13900a7136L943Q857K532k01K2295J8720n389j1333l218n069j0608M382K548N814
13886A6137N557q146j3960o569L282J0762K835j4687m640L417P774n903P005R704
13872A2568Q158N783j6022j0478K870K673l281j6033n863j319J4244Q066l269
$$ plain form
13973 18826 27850 14024 3336 -2008 -808 8819 7250 7899 13264 23281 14692 14135 7501 9085
13959 9085 8788 -353 8752 -163 -8350 -7969 2376 -784 -1858 -381 -2040 3475 8090 12084 24118
13944 24118 24645 18741 19363 11101 6695 3318 -2879 -3849 -2729 -3564 -9583 -3317 10752 12720 16404
13929 16404 23935 11331 13115 6555 -882 3530 3788 800 1581 5249 75 -1870 -12421 4327
13915 4327 14737 14800 -9532 -11074 -4461 -1387 10061 3457 3406 1668 -10798 -8024 -9904 -13183 -17136
13900 -17136 -13193 -4336 -1804 -2005 20290 39010 33621 22288 19070 14001 3393 7775 10323 16137
13886 16137 21694 13548 -412 -6981 -3699 7063 9898 -4789 -9429 -6012 1762 -4141 2864 12568
13872 12568 20726 26509 10487 9 2879 5552 2271 -13762 -19625 -20944 -6700 1366 -1903
13859a903k078o650o326N425l699N38J776j120J0204J5091M280m180J5305K1991
13845D8654p44j4140j2469l147J06r793j0449Q834k148m783P944P379L953N005
13831B4202p196j9321j3894J103R784Q114j901M639j3534L896L935L770J513j1644
13817f534j0089N131J8008R377L017N390j8268j5822P89n76m762j2108J434J1003
13803a4010L311J3850J5882j900m593j262m488k4246k401P327R587K739O153P731
13789A3680K4641O380r448k505j4103o934l062p867O055J2047Q117N59o698O328
13775B7190q993j0790j077P005J204J1863J7870j5900j8626K645o668r024k123
13762e424m929P544K1385P344m052l460k130n460j686o725r26M434O377O493j2457
$$ plain form
13859 -1903 -3981 -10631 -16957 -11532 -15231 -14693 -12917 -14037 -3833 11258 15538 11358 26663 48654
13845 48654 47910 33770 21301 18154 18260 8467 -1982 6852 4704 -79 7865 15244 19197 24202
13831 24202 17006 -2315 -16209 -15106 -5322 2792 891 5530 -8004 -4108 -173 3597 5110 -6534
13817 -6534 -16623 -11492 6516 15893 18910 24300 6032 -9790 -9001 -9577 -14339 -26447 -25013 -14010
13803 -14010 -10699 3151 19033 17133 12540 11278 6790 -17456 -19857 -12530 -2943 -204 5949 13680
13789 13680 38321 44701 35253 32748 18645 11711 8649 782 6837 18884 27001 27560 20862 27190
13775 27190 18197 7407 6330 13335 14539 26402 44272 28372 9746 12391 5723 -3301 -5424
13762 -5424 -10353 -2809 18576 25920 21868 18408 16278 10818 9132 2407 1481 5915 12292 18785 6328
13747F328l202J0755k471J137K467J0588R486J5178m769q299o815r87n938l176
13733B0282k13j2674J054M162j090m099K828J7965n345k0887j4676J9728J3475
13720B0510M687l477n981Q692k748q687r640k758L646Q355n862j6541o518J1472
13706d850R894n571k002m479j799K468J4208J1371M118N386M832m253j0506q708
13692A0109j7891Q414P708k703Q412j981q0l699p204N852L39k2487L24N381O048
13677c458P908M738L972q952n99L189o507O466J2811n34j5482k603J8109r685
13663I373j4749K488K776Q051n849J684J3031K814o588j7693M196J0351M016L47
13649A4248M425o938q0R401P974R800J915j5041q532k834r226P412L263j111J960
$$ plain form
13747 6328 3126 13881 11410 12547 15014 25602 35088 50266 45497 37198 30383 29396 23458 20282
13733 20282 20069 7395 8449 12611 11521 7422 10250 28215 22870 1983 -12693 7035 20510
13720 20510 25197 21720 15739 24431 21683 12996 3356 598 4244 12599 6737 -9804 -16322 -4850
13706 -4850 5044 -527 -2529 -7008 -8807 -6339 7869 19240 23358 28744 33576 29323 18817 10109
13692 10109 -7782 632 8340 5637 14049 12068 11988 8289 1085 6937 7276 -15211 -14887 -9506 -3458
13677 -3458 4450 9188 13160 4208 3609 6798 291 6757 19568 19034 3552 949 19058 9373
13663 9373 -5376 -2888 -112 7939 2090 3774 16805 19619 13031 -4662 -466 9885 13901 14248
13649 14248 18673 11735 11655 21056 29030 38830 40745 25704 17172 14338 5112 12524 15787 14676 16636
13634A6636L6q68K089j0568L844J9234l887j0109P903N134J736j0572j3031N620
13620A3197M909o441J2192L214j4681J252j691N702O974n00O984j628L961N705
13606C9149j0461j2643l346M783J5603p848j1063M274q205R807P721j1220k0783
13593d232n302k312n590O256J7018K417o734M834K201j4438P40J9529M533j4026
13579D894J131J4231q478l565J1896J1638R19j3141p089L378n536p157L091J292
13565G504M287m55k604J763J2090q649l220J0165L675j243m210p006j1074l119
13551b096J9172J0544l957j1122O458M447K532L127K201n500J0978j0784j8912
13538G088j0203J649j0101p53N892J2432J8327J4794p923j3601m552j057J1017
$$ plain form
13634 16636 16672 15804 17893 7325 11169 30403 26516 16407 24310 29444 31180 20608 7577 13197
13620 13197 18106 11665 23857 27071 12390 13642 11951 17653 24627 24127 31111 29483 33444 39149
13606 39149 28688 16045 12699 17482 33085 25237 14174 18448 10243 20050 27771 16551 -4232
13593 -4232 -9534 -11846 -17436 -11180 5838 8255 1521 6355 8556 -5882 -5142 14387 18920 4894
13579 4894 6025 20256 11778 8213 20109 31747 32666 19525 12436 15814 10278 3121 6212 7504
13565 7504 11791 11336 8732 10495 22585 13936 10716 20881 24556 23313 19103 12097 1023 -2096
13551 -2096 17076 27620 23663 12541 18999 23446 25978 29105 31306 25806 36784 26000 7088
13538 7088 -3115 -1466 -11567 -12320 -6428 6004 24331 39125 31202 17601 13049 11992 23009
13525B3009Q233j0288K947K247J133N729n03m654L470N986j8027o665k384J1M548
13510A4792L282k23J3614P849q852l3938o648Q038J7251L305P271K704J894k903
13496B7436j601N598Q072J123K824J013j6577o397M595r163j5420M33M254K233
13482H423J1377j647p263J1739r471j3255P959O87j0061j71l426o870N824Q544
13468B389Q340J0563M359o467M950L256o205J808j69N141q188K395J2908P330
13454D2410j5568p952n495J723K192r101m800K295N112j0049N595n933N2J1589
13440A2070K0985L852j8240j7591J1076k364l270P432R416J7080k324k0395j0354
13427G373k299L98K580q887j645j682K272o537L845J9522R1q463Q375l678n473
$$ plain form
13525 23009 31242 20954 23901 26148 27281 33010 32507 27853 31323 37309 19282 12617 10233 10244 14792
13510 14792 18074 17851 31465 39314 30462 -3476 -10124 -2086 15165 18470 25741 28445 30339 27436
13496 27436 25835 31433 39505 40628 43452 44465 27888 21491 26086 16923 1503 1936 6190 8423
13482 8423 19800 18153 10890 22629 13158 -97 7862 8549 -1512 -1683 -5109 -11979 -6155 2389
13468 2389 10729 21292 25651 19184 24134 27390 21185 22993 22824 27965 19777 22172 35080 42410
13454 42410 26842 18890 13395 15118 17310 8209 3409 5704 10816 767 6362 429 481 12070
13440 12070 33055 36907 18667 1076 12152 9788 6518 13950 23366 40446 38122 17727 7373
13427 7373 5074 5472 8052 -835 -2480 -4162 -1890 -8427 -4582 14940 15031 6568 14943 11265 5792
13412E792m430j4829k066J8810O600J018L192m22p310J0034M884O733n674j144
13398B1188O42j0212n093J8131L344o695j4384O721n053p340K2856R782k1410
13385A2477r909J1494J4610L919j1053j0280j882j6074O077K1747J2552o417j57
13372B7104j786k624n507R77R030J17j4419R313O741o282J717r851Q928Q021M003
13357C5482O142j5730j3739m62N76k924O643N066n933m19L217m041p545J7494
13343B3827J2261j5337j9356j0475j2047L092K3787j653j908K5274R642M471j280
13330D0298j3481j7092J3404P226m658q931m194P611K567l068j6312j1844J0826
13317B352K7073N118K828L484O704j0203j708k64j0365M188q219j0149j198O956
$$ plain form
13412 5792 1362 -13467 -15533 3277 9877 10895 14087 13665 6355 16389 21273 28006 22332 21188
13398 21188 21830 11618 6525 24656 28000 21305 6921 13642 8589 1249 24105 33887 12477
13385 12477 2568 14062 28672 32591 21538 11258 9376 -6698 -621 21126 33678 27261 27104
13372 27104 25318 22694 17187 18164 27194 27311 12892 22205 28946 22664 24381 14530 23458 31479 35482
13357 35482 41624 25894 12155 11693 12269 9345 15988 21054 15121 14702 17919 13878 6333 23827
13343 23827 36088 20751 1395 -9080 -21127 -18035 5752 4099 2191 27465 37107 41578 40298
13330 40298 26817 9725 23129 30355 25697 16766 12572 20183 22750 19682 3370 -8474 2352
13317 2352 29425 34543 37371 40855 47559 37356 35648 35384 25019 29207 20988 10839 9641 16597
13303A6597Q320l681j0133j5202P677J3591J9793o981q004J1070L785N930J2825
13290E5587j0616k245O362N0j63l731P07K2266M565k4700j1331J1544R420L452
13276F1167n042k4881j6659L974L082o569k117K357p143r958k979j588j74N177
13262a353J4125J2673m561L170N010L101M678Q662j598j474j3485q55n577J7537
13248D0053J5728R944N30O353p080n32K920J0812O294P346P640K2009J9019J6931
13234A57967L2082N9144Q5566P7942N7838N7457K4412m639L859N7183J47873K78966
13222A035650M29245M88390K56096j57257m88489n23062l77270k25594j23314
13213C14395n7890m8953m6616l0970j4842k0607k1847k882r304o501n60L337J1477
$$ plain form
13303 16597 24917 21236 11103 -4099 3578 17169 36962 29981 21977 33047 36832 42762 55587
13290 55587 44971 42726 49088 49138 48975 45244 45951 68217 72782 48082 36751 48295 57715 61167
13276 61167 56125 31244 14585 18559 21641 15072 12955 15312 8169 -1789 -4768 -6356 -6530 -1353
13262 -1353 12772 25445 20884 24054 29064 32165 36843 45505 43907 42433 28948 28093 22516 40053
13248 40053 55781 65725 66255 72608 65528 64996 67916 78728 85022 92368 100008 122017 141036 157967
13234 157967 190049 249193 334759 412701 470539 527996 552408 547769 551628 608811 756684 1035650
13222 1035650 1464895 1953285 2209381 2052124 1563635 1040573 663303 437709 314395
13213 314395 256505 207552 160936 129966 115124 94517 72670 69788 60484 53983 53423 56760 68237
13200F8237L238j906k1465M291J8399n950k202R714q024p080q724j0045j833M991
13186D1641R198p444m90M032M721j0383m662l130O899J0j1254L96J6539J7107
13172F3180k0757p127K395r486l091J2249J1085K113j8433L119J3953m399j0053
13159C4748R493j1742l901o076J5299J5836R61n297j4276o052o701J7555J161
13146D1008R471j3039n076M170J5692k117j4865N861q750J910m744q592n930p428
13132G571R375R250K5265J7466r401K634L451M268p629j1933j585k735m742Q253
13118D9508P199k88M428m161o49k405Q702m039k0967k847J5040j891M44J016l192
13103D5898n302j0267k266P522M487M949J3950K758k4427r914J0756L257J08K401
$$ plain form
13200 68237 71475 69569 48104 52395 70794 64844 62642 72356 64332 57252 48528 38483 36650 41641
13186 41641 50839 43395 42905 46937 51658 41275 36613 33483 40382 40392 29138 29534 46073 63180
13172 63180 42423 35296 37691 28205 25114 37363 48448 50561 32128 35247 49200 44801 34748
13159 34748 44241 32499 28598 22522 37821 53657 54618 49321 35045 28993 22292 39847 41008
13146 41008 50479 37440 32364 36534 52226 50109 35244 41105 32355 34265 29521 20929 14999 7571
13132 7571 16946 26196 51461 68927 59526 62160 65611 69879 62250 50317 48732 45997 41255 49508
13118 49508 56707 56419 60847 56686 56037 53632 62334 58295 37328 34481 49521 47630 48074 49090 45898
13103 45898 40596 30329 28063 35585 40072 45021 58971 61729 37302 27388 38144 41401 41509 43910
13089D3910O518J4277q721r201p035J3130J2203K1343J2089p345r767j6226r830
13076E5345j5578j2904K203P127j964J5700j3645p735J3970J4573J1876J386J187
13063G1541J444p60k787K731j7056j5300o717j150M833k984j35J6634k1902j6482
13049A1910Q509N044L714J5637R706L49Q800r343O138J7648J0917P75J3802N586
13035A09192P779L4024N0152M8267L7708J9106j0189n0183n3508l7442n2838k5506
13023G6562k456n698k698K3632J2296P776r906j9753j1727J638OP519M772J060
13009H3023j8901p54N391j2748k471L576Q95o097R58L654m606P812J2608J3690
12995H6030N796M979j2861m601M69m376k536r319q558N209N422J6660K489J8683
$$ plain form
13089 43910 50428 64705 55984 46783 39748 52878 65081 86424 98513 91168 81401 65175 55345
13076 55345 39767 26863 29066 36193 34229 49929 36284 28549 42519 57092 68968 70354 71541
13063 71541 72985 72225 69438 72169 55113 39813 33096 31946 36779 33795 33660 50294 28392 11910
13049 11910 20419 25463 29177 44814 54520 54869 63669 54326 60464 78112 89029 89804 103606 109192
13035 109192 116971 150995 201147 249414 287122 306228 296039 245856 192348 154906 102068 76562
13023 76562 74106 68408 65710 89342 101638 109414 99508 79755 68028 69666 69672 77191 81963 83023
13009 83023 64122 63368 68759 56011 53540 57116 58011 51914 52872 56526 51920 59732 72340 86030
12995 86030 91826 96805 83944 79343 79812 75436 72900 63581 55023 60232 65654 82314 84803 103486
12981A03486Q389N057R082m681P470Q624k735j1575k4561p904J5721M1643K6158
12968A74174j684j3491M411N684j4216k7198m2765l3784l3917n960P340m120K955
12955A7429P368J6226Q703K1468k0943M375N529N588O095K1849M765j301j0944
12942H6207L255L661r380l730M918q333J1755L2601L2914J7181J5974J1204L352
12929B01579l0337n1806l8823l4634k2284q878L84K2698o290j9578o364p228p513
12916i074L175n689k0472j5257k3043l2686j2604l4337R45Q4942K07783K96435
12904D40118K56138J17954K68q2261r9945j06253o1553m7170l6967l1019l1167
12893C18143r370o459j5139q33l268K267Q068j1122r032j1388J7m782P314M246
$$ plain form
12981 103486 111875 116932 126014 121333 128803 137427 134692 123117 98556 90652 106373 148016 174174
12968 174174 172490 158999 163410 169094 154878 127680 84915 51131 17214 11254 18594 14474 17429
12955 17429 24797 41023 49726 71194 50251 54626 60155 65743 71838 93687 98452 97151 86207
12942 86207 89462 93123 83743 80013 84931 76598 88353 120954 153868 171049 187023 198227 201579
12929 201579 171242 119436 80613 45979 23695 14817 15201 37899 31609 12031 5667 -1561 -9074
12916 -9074 -5899 -11588 -32060 -47317 -70360 -103046 -115650 -149987 -149042 -64100 143683 440118
12904 440118 696256 814210 814478 732217 632272 526019 464466 417296 380329 349310 318143
12893 318143 308773 302314 287175 286342 283074 285341 293409 282287 273255 261867 261884 257102 264416 268662
12879B68662J3575p3o341J8421J6508j209Q7j4732p784o325m494R359J602J3807
12865C01063K265M734K3764K3794K211J545j5792j1557J7752K288K943j7015q716
12852C29279J6545K4434J9518K0740J0178J9392J3045j6899j0454j546o251R305
12840D27286R444O24L20K7043K7380K9711K9132K2070J6982K2991K5938J0498
12828F49419P071K8548M0666N6856N4171P2001P0670M7613j2555k8309J9819M4003
12816A049973O5478O1565N4477M5539N4270K8958L6379Q2763R7334J14663J52396
12805A843795J66627J91919K03846K09472K14076K20977K48762K67943K95992
12796C863409L51849M58855O29400Q23871J017411J228850J538880K061003K787241
$$ plain form
12879 268662 282237 282164 275823 294244 310752 309543 309630 294898 287114 280789 276295 285654 287256 301063
12865 301063 303328 308062 331826 355620 357831 359376 343584 332027 349779 352067 355010 337995 329279
12852 329279 345824 370258 389776 410516 420694 440086 453131 436232 425778 424232 417981 427286
12840 427286 436730 437354 437674 464717 492097 521808 550940 573010 589992 612983 638921 649419
12828 649419 656490 685038 725704 782560 836731 908732 979402 1027015 1014460 986151 1005970 1049973
12816 1049973 1115451 1177016 1231493 1277032 1331302 1360260 1396639 1479402 1576736 1691399 1843795
12805 1843795 2010422 2202341 2406187 2615659 2829735 3050712 3299474 3567417 3863409
12796 3863409 4215258 4674113 5303513 6127384 7144795 8373645 9912525 11973528 14760769
12787A4760769L804863N220763P244845J0669240J7491619L0844092N2822278
12780A42858469Q0363334R6450886P0669452k385786p6269873j00912539p9480218
12773A31293725m8185894k6837716j5370143r834263p217955n490935l965258
12766A4391561k762121k001714j495520j123527q50873o95377o13320n76391n08131
12757C764587m30411l63997l16313k76723k18499j60569j23764r1904q8820r2607
12747A600980r1267q0324r5324j21982j20591p5056l2788k0729j1185R011L7418
12736I98163M4025K86l7779o5477q6478o7848p3964p7068n9474n0214m3931k7640
12724D52601k2856q434j7760l1646j4212J3818J0642j5732k3396j9743k6783o29
$$ plain form
12787 14760769 18565632 23786395 31031240 41700480 59192099 90036191 142858469
12780 142858469 223221803 319672689 390342141 387956355 311686482 210773943 131293725
12773 131293725 83107831 56270115 40899972 31065709 23847754 18356819 14391561
12766 14391561 11629440 9627726 8132206 7008679 6157806 5462429 4849109 4272718 3764587
12757 3764587 3334176 2970179 2653866 2377143 2158644 1998075 1874311 1782407 1693587 1600980
12747 1600980 1509713 1429389 1334065 1212083 1091492 1016436 983648 962919 951734 960745 998163
12736 998163 1042188 1042474 1004695 939218 852740 784892 710928 633860 574386 524172 480241 452601
12724 452601 429745 421311 403551 371905 357693 371511 382153 366421 343025 323282 296499 295870
12712B95870j9920j3712j0959l775J0891J0896K5089J8722M1227N2981O8062J52406
12700F27778K36855L25733L58672K40261o4779l40857m06158l05516j97746j16460
12690C57783p2765n2538n4373k6645q579j659l8234l7138j0581k4285j6332P101
12678B1755P59L765J0301J6609M476l202j0496j8214j3976k0028k1695k306l227
12665c5479K991J6004Q46q08j6110l7669j2165o63O602N839L0034N2426P1769
12652H3617P3859Q9245Q8986M2482L202k2391l8300l9849l3084m4468j1999n702
12640A85598j078k765j6111q378J0243n76j1014K214j4921o170j1400l2564m3599
12627D9479n0209l5933k0607J180J0847M4654K6424Q549J4196J3583j0621k0680
$$ plain form
12712 295870 275950 262238 251279 247504 258395 269291 294380 313102 354329 407310 475372 627778
12700 627778 864633 1190366 1549038 1789299 1724520 1383663 977505 671989 474243 357783
12690 357783 285018 232480 178107 151462 142883 141224 102990 65852 55271 30986 14654 21755
12678 21755 22514 26279 36580 53189 57665 54463 43967 25753 11777 -8251 -29946 -32252 -35479
12665 -35479 -32488 -16484 -15638 -16446 -32556 -70225 -82390 -83053 -76451 -70612 -40578 11848 83617
12652 83617 157476 246721 335707 378189 381391 359000 320700 280851 247767 203299 191300 185598
12640 185598 184520 181755 165644 157266 167509 166933 155919 158133 143212 137042 125642 93078 49479
12627 49479 -730 -36663 -57270 -56090 -45243 -589 25835 34384 48580 62163 51542 30862
12615C0862j1702K7725K743o865q098J2211K4416l050j447N54n85j5106j4559
12602C7099r489O608J6907K1594J3680J2606K0764j1717m4060m4973l4156k4355
12590c9492r584r74M055j652M334J5523K4740J2506M750k1380k4865j3127O512
12577c8654K4285J6905p830j0123r929Q943J9186M888P592N550l441Q313m6l590
12563B2049m486j3959m861l523J24l632p733M987J3392K1488J3384N366o481p046
12549B9069j8248j9731j5749p395J769N925K099J3167p808m638m479o195N028
12536b7186l438J0225J4768P217K11P676J0383J7059J1957J0056j676k8627n267
12523B3358P307m499p99l555j9225j0836r223J1010J3842M699k2591j8491R641
$$ plain form
12615 30862 19160 46885 49628 42763 34665 46876 71292 68242 66795 67349 66764 51658 37099
12602 37099 27610 34218 51125 72719 86399 99005 119769 108052 63992 19019 -15137 -39492
12590 -39492 -49076 -50050 -45995 -47647 -43313 -27790 -3050 9456 14206 -7174 -32039 -45166 -38654
12577 -38654 -14369 2536 -5294 -15417 -25346 -16403 2783 7671 15263 20813 17372 25685 25639 22049
12563 22049 17563 3604 -1257 -4780 -4656 -8288 -16021 -11034 2358 23846 37230 42596 36115 29069
12549 29069 10821 -8910 -24659 -32054 -30285 -24360 -22261 -9094 -16902 -21540 -26019 -32214 -27186
12536 -27186 -30624 -20399 -5631 1586 1797 9473 19856 36915 48872 58928 57252 28625 23358
12523 23358 30665 26166 25367 21812 2587 -8249 -17472 -6462 7380 12079 -10512 -29003 -19362
12510a9362K4551M351M28N732J3830R90N518j735j8939j9943o422J833R164R44
12496I40M835j357j5373j8448n360J1637P416P951K9241M291j5549j7905k534
12483a0215p092K22J6903O965J2229k298j5144j4118K555q916n232l725j387K373
12469b6880J3722J2335K534p489l960m217K993O822m53j2697Q410J1098l435o389
12455g606n499k043o52o142j5715m831Q610R072Q462Q752K9o954m44Q730n298
12440a1529p5n00o269j1324L524J3112o7j3630k697K475q161j1862J8392K6652
12426a959P781q1l160k325N974n736j213o011j5164k0664J2551J3037j1563q156
12412c6689J7439J7025J2474O130N356j2653p558P835k968j5202o738J1874Q685
$$ plain form
12510 -19362 5189 9540 9968 15700 29530 30520 36038 34303 15364 -4579 -11001 -9168 -4 940
12496 940 5775 4418 -10955 -29403 -34763 -23126 -15710 -7759 21482 25773 10224 -7681 -10215
12483 -10215 -17307 -17085 -182 6783 19012 16714 1570 -12548 -9993 -18909 -24141 -27866 -29253 -26880
12469 -26880 -13158 -823 1711 -5778 -9738 -13955 -10962 -4140 -4593 -17290 -8880 2218 -1217 -7606
12455 -7606 -13105 -15148 -15800 -21942 -37657 -42488 -33878 -24806 -16344 -7592 -7563 -14517 -14961 -6231 -11529
12440 -11529 -11604 -12104 -18373 -29697 -26173 -13061 -13128 -26758 -29455 -26980 -35141 -47003 -28611 -1959
12426 -1959 5822 5741 2581 256 6230 494 -719 -6730 -21894 -42558 -30007 -16970 -28533 -36689
12412 -36689 -19250 -2225 10249 16379 21735 9082 1524 9359 6391 -8811 -15549 -3675 5010
12399E010j0244k1301j3207J3454M797J3049J1083l591m298J1627m16j1707K586
12386c158N068k6130p980m237k179J1545J1648J7247K67k9475j6278J3889J1738
12373a8035J98P636J5165o642j1474Q522J2074L95j0427n060l327k361m411J7099
12359f48J4721O012m895j206p94K444J1537O292r970J5052J220r54j2746P283
12345C3348J5247j3527j4150Q11P449N557J4971L0375M5469K5846M3305R1157
12333B85858J41768K35811L88789N13051M54498J05199l60966n40434m62005k89097
12323D72472j57063q0262n9951n3400l9593k6127k3093j9650q149j0742Q626o492
12311c424m936k118n819j823K733j58O22Q47O331j9555n785O951k32O853J3578
$$ plain form
12399 5010 -5234 -26535 -39742 -26288 -21491 -8442 2641 -950 -5248 6379 5963 -5744 -3158
12386 -3158 1910 -24220 -32200 -36437 -38616 -27071 -15423 1824 2091 -27384 -43662 -29773 -18035
12373 -18035 -17837 -10201 4964 -1678 -13152 -4630 7444 7839 -2588 -7648 -10975 -13336 -17747 -648
12359 -648 14073 20085 15190 13984 13190 15634 27171 33463 23493 38545 39765 38811 26065 33348
12345 33348 48595 35068 20918 21729 29178 34735 49706 80081 125550 151396 194701 285858
12333 285858 427626 663437 1052226 1565277 2019775 2124974 1764008 1223574 761569 472472
12323 472472 315409 235147 175196 121796 82203 56076 32983 13333 5184 -5558 3068 -3424
12311 -3424 -8360 -10478 -16297 -18120 -15387 -15545 -14923 -14076 -7745 -27300 -33085 -26134 -26366 -19513 -5935
12296e935J1439J886k000j4160o347J1375n399k0614K880Q006L816J2120J2213
12283I280j78j87j2085j0453j1793J6141J1474j4365M980k166l070q077J085J0944
12269h470L866n404p41M487o797p911N30j330L822J2777J0041k243L164n156o190
12254e555m193K328P979Q04k822j2665N09j0949Q94k139J3643R549J3250m299
12240F334r19O345j355L103q474L688k2j7541J895J544r868j318L282R739J4037
12225A0470N100k1946O650J1946K461o600q087M575J678M331n43K676k143J0460
12211B1028j7441j7851N222o593P492R438p381M739M569J3299M751M707j6697
12198I282l174J1622J0762R16j0414j2398j6859j4066m055J851Q693L242J5628
$$ plain form
12296 -5935 5504 7390 5390 -8770 -15117 -3742 -9141 -29755 -26875 -18869 -15053 -2933 9280
12283 9280 9102 8915 -3170 -13623 -25416 -9275 2199 -12166 -7186 -9352 -12422 -20499 -19414 -8470
12269 -8470 -4604 -10008 -10749 -6262 -13059 -20970 -20440 -21770 -17948 -5171 4870 2627 5791 635 -5555
12254 -5555 -9748 -7420 559 1363 -1459 -14124 -13615 -24564 -23670 -25809 -12166 -2617 10633 6334
12240 6334 5415 11760 10405 13508 5034 8722 8700 -8841 -6946 -5402 -15270 -16588 -13306 -3567 10470
12225 10470 15570 -6376 274 12220 14681 8081 -6 4569 6247 10578 10035 12711 10568 21028
12211 21028 3587 -14264 -9042 -15635 -8143 1295 -6086 -1347 3222 16521 21272 25979 9282
12198 9282 6108 17730 28492 29408 18994 6596 -10263 -24329 -28384 -26533 -17840 -14598 1030
12185A030j4782j781M234K0671J1502r113j0524q277j9840p959J2346K5960r87
12172B480j2808j9663j3149P871J5181N98K350k051J3061J0197p087o425J897
12159g548J4676P254n244k97j8782k01k978m960J095R739J204m136P053M155q777
12144g747q585L501j845l182P692k0874O631J1369P606k830P116p366j3721O812
12130a5423k115m194K1912j797k2065k5943L432k637P766J167K1961P577K378
12117g981K743Q3o793k852O776J0181o452m49K2933j225K638k8493k5830J2297
12103b2424J3068r41M124L758Q282J0820j1129j3789O60O859p021N98J3585l419
12089C031n92o928j2902N30J6712j1893j413n721K843J4039M211o491j3989O629
$$ plain form
12185 1030 -13752 -15533 -11299 9372 20874 11761 1237 -7040 -26880 -34839 -22493 3467 2480
12172 2480 -10328 -29991 -43140 -35269 -20088 -19490 -17140 -19191 -6130 4067 -3020 -9445 -7548
12159 -7548 7128 14382 9138 8841 -9941 -10142 -13120 -18080 -16985 -7246 -6042 -10178 -3125 1030 -7747
12144 -7747 -16332 -12831 -14676 -17858 -10166 -31040 -24409 -13040 -5434 -8264 -1148 -8514 -22235 -15423
12130 -15423 -17538 -21732 180 -1617 -23682 -49625 -46193 -48830 -41064 -39897 -17936 -10359 -7981
12117 -7981 -5238 -5155 -11948 -14800 -8024 2157 -4295 -4744 18189 16964 19602 -8891 -34721 -22424
12103 -22424 -9356 -10297 -6173 -2415 5867 16687 5558 -8231 -7571 -712 -7733 -7135 6450 3031
12089 3031 2439 -4489 -17391 -16861 -149 -12042 -13455 -19176 -16333 -2294 1917 -4574 -18563 -11934
12075a1934J2164o020n722K649M731P86N618O574j0174p159J2820N891m652o651
12061a079L438J6037r130j2078N957P772J0625j981J301q596j2842J7840J48j156
12047A6256J1330k47j4062k1250r199R318Q23j1945O403J6048P117l99j0778j7071
12033a7656L326P547K7836K794j3836p469J273k78p236J1803k892r263l859L654
12019d256o764r992M007N307K4344O514m476j432k628J663j3426o177J5147O370
12005A4201k1449k79J0159l748J1200P507j5620k2422k132L438J5700Q379l969
11992I65j1946L334k106j712n424r175P237P587M104R24J6156O800j2210p575
11978c041m232j8088J1291k286r081L844L808j968n240N530K751K4718J2782n488
$$ plain form
12075 -11934 230 -5790 -11512 -8863 -4132 -3346 2272 8846 -1328 -8487 4333 10224 5572 -1079
12061 -1079 2359 18396 9266 -2812 3145 10917 21542 19561 20862 12266 -576 17264 17412 16256
12047 16256 27586 27339 13277 -7973 -17172 -7854 -7031 -18976 -12573 3475 10592 10193 -585 -17656
12033 -17656 -14330 -6783 21053 23847 10011 2542 3815 3537 -3699 8104 5212 -4051 -7910 -4256
12019 -4256 -11020 -21012 -17005 -11698 12646 19160 14684 13252 10624 12287 -1139 -7316 7831 14201
12005 14201 -7248 -7527 2632 -1116 10084 17591 1971 -20451 -22583 -19145 -3445 4934 965
11992 965 -10981 -7647 -9753 -11465 -16889 -26064 -18827 -11240 -7136 -6212 9944 16744 4534 -3041
11978 -3041 -7273 -25361 -14070 -16356 -25437 -21593 -17785 -19753 -24993 -19463 -16712 8006 20788 15300
11964A5300j6842o075J0420j3806k1983M319R767J6050N191P330J338K083m39
11951A2653j7125j509j0229j2546n602J3270L210l595P559Q556r526O880l647
11938a1651q048J1906j1077n418J646M281J4999n206m739j0P473Q254N155m88
11924G077K368R76q207q369K150J2534J8j4573j6241m362L584j938R875J2788
11910b320J0135K856k0040K177J2118q943m970q957j0221O596J7821J4236P549
11897A8037r336L789m640j6596o631O389P823l563r885K080J23p598P065l338
11883a6281J9173Q403j7114m095L676p616o23j1311j1540n443J6793J4738J5370
11870D130O662o742j0536J016J9434R714j9278j6258r219M029M050O43m089J35
$$ plain form
11964 15300 -1542 -7617 2803 -11003 -32986 -28667 -18900 -2850 2341 9671 11009 13092 12653
11951 12653 -4472 -5981 -16210 -28756 -34358 -21088 -17878 -21473 -13914 -5358 -14884 -8004 -11651
11938 -11651 -19699 -7793 -18870 -24288 -22642 -18361 -3362 -8568 -13307 -13317 -5844 2410 7565 7077
11924 7077 9445 10421 2214 -6155 -4005 8529 8547 -6026 -22267 -26629 -23045 -24983 -15108 -2320
11910 -2320 7815 10671 -9369 -7192 4926 -4017 -8987 -17944 -28165 -21569 -3748 10488 18037
11897 18037 8701 12490 7850 -8746 -15377 -8988 -1165 -4728 -14613 -12533 -12410 -20008 -12943 -16281
11883 -16281 2892 11295 -5819 -9914 -6238 -13854 -14477 -25788 -37328 -42771 -25978 -11240 4130
11870 4130 10792 4050 -6486 -5470 13964 23678 4400 -11858 -21077 -17048 -12998 -12355 -16444 -16309
11856a6309j570O273J2122L000N216N306l89q374j4187o25K2549J0747l316j3478
11842F965r331m834R777o447j2123l297r4P741Q491Q939k430o060l0848j3975
11828d7526K2792J5360J196R928k614L550L611m651o019J1193m331m992p050O128
11814c425l279N443R744P533j9441j5794L990j3224k011J2358L644k506n662K7017
11800D387K0956J328j4725o198j365j8920j4725n44M124J1742J8788m532q46J1164
11786A0634J667N109k095k960j3386n498j3117j534q718M492J4475J1113Q61k747
11772a704J048m622J908O494K385J685p492l732Q759Q482K185j2676L90J94J480
11757D784l235N643k715n198J702p172J5924l784n414J9003k734m357o220q319
$$ plain form
11856 -16309 -17879 -11606 516 3516 8732 14038 13649 5275 -8912 -9537 13012 23759 20443 6965
11842 6965 -2366 -7200 2577 -3870 -15993 -19290 -19384 -11643 -3152 5787 3357 -2703 -33551 -47526
11828 -47526 -24734 -9374 -8178 1750 -864 2686 6297 1646 -4373 6820 2489 -2503 -9553 -3425
11814 -3425 -6704 -1261 8483 16016 -3425 -19219 -15229 -28453 -30464 -18106 -14462 -16968 -22630 4387
11800 4387 25343 26671 11946 5748 4383 -14537 -29262 -29806 -25682 -13940 4848 316 -530 10634
11786 10634 12301 17410 15315 12355 -1031 -6529 -19646 -21180 -29898 -25406 -10931 182 1043 -1704
11772 -1704 -656 -5278 -3370 3124 5509 7194 -298 -4030 4729 13211 15396 2720 3110 3304 4784
11757 4784 1549 7192 4477 -721 981 -6191 9733 5949 535 19538 16804 12447 6227 -2092
11743b092m490k586R767J0919M451l438M438n702J220j488j2450j2837K140O267
11729e881K530o07j857N356J4293J5444P26r082j2037j1076o35o335J999J948
11715e214j21P583J0724R081n906j2498m835j2777k323K317j296M481L382J0683
11701C281l493r806J1205P059j407o607M334j0041j1436l305K8189K1084k1583
11688G474j1408n404L561J1496r538J4319R417L242J1972k34l614q214o782j9603
11674c316O336J4004L616j2766j2844j4059o603O276J5770m431j4505k569J662
11661b3429j113J3471J6421K0345P224j0369p918M187j0246L538K201o983K409
11648I738M556j853n548L53j835o391N043j756J1118J4976j617j2631k904n152
$$ plain form
11743 -2092 -6582 -9168 599 11518 15969 12531 16969 11267 12487 10999 -1451 -14288 -12148 -5881
11729 -5881 -3351 -3958 -5815 -459 13834 29278 30004 20922 8885 -2191 -2826 -9161 -7162 -5214
11715 -5214 -5335 2248 12972 22053 16147 3649 -1186 -13963 -16286 -13969 -15265 -10784 -7402 3281
11701 3281 -212 -10018 1187 8246 6839 232 4566 -5475 -16911 -20216 7973 29057 7474
11688 7474 -3934 -9338 -5777 5719 -3819 10500 19917 23159 35131 34897 31283 23069 16287 -3316
11674 -3316 3020 17024 20640 7874 -4970 -19029 -25632 -19356 -3586 -8017 -22522 -25091 -23429
11661 -23429 -24542 -11071 5350 25695 32919 22550 14632 18819 8573 12111 14312 7329 9738
11648 9738 14294 12441 6893 7246 5411 -980 4063 2307 13425 28401 26784 14153 11249 6097
11634F097n058m449J8060J9587J718r300k3143k4462R469J0599j478o077K582
11621e855M02j8n220j4903o243P43M075k2L693K425L972l134J1357m53N145Q996
11605D960K059M89j463K04J0233K213q859j3967O614R239j770j1556j5657n084
11591b2345R655N872j007N272J2466P617r661j2772r510J1696L120q183j0142
11578a7922P444J0699J5054J236p447r737p93k033m809P302J2425L135M35M300
11564A9289p225j4858j4733j0433M042k534J2453J5003l238j2005M706K786J0040
11551C293L352J823M532M823R50j1275j7048j948N658L935j3465j6004R192m737
11537b6919N80J5168J3620J6534l567n9J8819o020p650L009j2993j4291K216J3109
$$ plain form
11634 6097 1039 -3410 14650 34237 35955 26655 3512 -20950 -11481 -882 -2360 -8437 -5855
11621 -5855 -5453 -5471 -10691 -25594 -31837 -31094 -27019 -27041 -23348 -20923 -16951 -20085 -8728 -9181 -4036 4960
11605 4960 7019 7508 6045 6249 16482 18695 9836 -4131 2483 11722 9952 -1604 -17261 -22345
11591 -22345 -12690 -6818 -7825 -2553 9913 17530 7869 -4903 -14413 -2717 403 -7780 -17922
11578 -17922 -10478 221 15275 16511 9064 -673 -1466 -3499 -8308 -1006 11419 14554 14989 19289
11564 19289 12064 -2794 -17527 -27960 -23918 -26452 -13999 1004 -2234 -14239 -9533 -6747 3293
11551 3293 6645 8468 13000 17823 18773 7498 -9550 -11498 -5840 -1905 -15370 -31374 -22182 -26919
11537 -26919 -26339 -11171 2449 18983 15416 15357 34176 28156 20506 23515 10522 -3769 -1553 11556
11523A1556O290m436l479J0156M726j0883M412R116j4879n464K093o867n133J633
11509a159m729M271J5052R089L165q182j6191j950K553N713L738m676l325j7875
11495a4506j045p524O039K6122J1470J165j0593j8989N616J1470j0323k471N662
11482B093J9240O966m071J61j3320o089M096j7198j8003K180L993R765L378Q868
11468B059K418n00j3839j1746P196J7045R168N373Q520O9k251m937l192K237K277
11453A9897p759q247j4879j6062m705p238O178J5854J7813J3015L088q603m599
11440C753J3894N309m063R118o665j6945j1670j123l472k376O40L245R72J0518
11426A135K463j410J3491Q876r573j3540j8985K11k596M457n615q368j9493P413
$$ plain form
11523 11556 17846 13410 9931 20087 24813 13930 18342 27458 12579 7115 9208 2341 -2792 -1159
11509 -1159 -5888 -1617 13435 22524 25689 17507 1316 -634 1919 7632 11370 6694 3369 -14506
11495 -14506 -15551 -23075 -17036 9086 20556 21721 11128 -7861 -2245 9225 -1098 -3569 2093
11482 2093 21333 28299 24228 24389 11069 4980 9076 -8122 -26125 -23945 -19952 -10187 -6809 2059
11468 2059 4477 3977 -9862 -21608 -14412 2633 11801 17174 25694 25763 23512 18575 15383 17620 19897
11453 19897 12138 3891 -10988 -27050 -31755 -38993 -32815 -16961 852 13867 16955 8352 3753
11440 3753 17647 22956 18893 28011 21346 4401 -7269 -8392 -11864 -14240 -13600 -10355 -9383 1135
11426 1135 3598 2188 15679 24555 14982 1442 -17543 -17332 -19928 -15471 -21086 -29454 -48947 -41534
11412d1534J9831L131j600k791K7121J788J310O216J115M639r657r902O444R432
11398A5543q250n083n879J6471K724R167o603j9374j1357J912Q195N702P929J6397
11384B7494o909j4838j20J890J7990m939k2605R211J8903n770k0836K583P478
11371I532L317l15r665q557Q947j030L063J1544J0860j876L608o089j846r098
11357A2395j12O324P300J0474J0966j1236k4819j7565J3080N316M287O324j5499
11344G235j4461N318J3300Q632R067j1686o83M388j960q845j345N750j1425J551
11330D836J157j0796O150P786j1933l438j664q059K475L0469k517j2527o549J6280
11316A1670J7385j816j8279J232Q02L113l696q052L135j3710o728J1592l212L650
$$ plain form
11412 -41534 -21703 -18572 -20172 -22963 4158 5946 7256 13472 14587 19226 9569 -333 6111 15543
11398 15543 7293 2210 -3669 12802 15526 24693 18090 -1284 -12641 -10729 -2534 3168 11097 27494
11384 27494 20585 5747 5627 7517 25507 20568 -2037 7174 26077 20307 -529 2054 9532
11371 9532 12849 12534 2869 -5688 3259 2229 5292 16836 27696 25820 29428 23339 21493 12395
11357 12395 12283 18607 25907 36381 47347 36111 11292 -6273 6807 12123 16410 22734 7235
11344 7235 -7226 -1908 11392 20024 29091 17405 16722 21110 19150 10305 8960 14710 3285 4836
11330 4836 5993 -4803 1347 9133 -2800 -6238 -7902 -15961 -13486 16983 14466 1939 -4610 11670
11316 11670 29055 27239 8960 10192 10994 14107 10411 2359 5494 -8216 -14944 -3352 -6564 -2914
11302b914J2222J2428K08n369K320m930L306P359n471J0228n852q262j1447p480
11288c654o347m87j2975j226P407J1732N656J1595q775j962K3770j2688p724l726
11274E96j2634o98m876Q447m125o722P279J2742M231o448j1597J0208p710L596
11260g711M246L900M882j581P27j6170j1427m102k012L32J1886J3557J4028N92
11246A1147p394J716J6164Q196L274L768L711o507K426j5797l193M189k076p490
11232A2134j6985j7777O653J3859K40L722P403N370N359Mk9176j36J1110O535
11218H315O630M497j3041J91m721r462P118o322o846P556O710l166o395K038J5139
11203H241J3044q610K629j1003k410Q822J0284o728q170l361l978J020L783j410
$$ plain form
11302 -2914 9308 21736 21944 16575 18895 13965 17271 24630 19159 29387 23535 15273 3826 -3654
11288 -3654 -10001 -10488 -23463 -24689 -17282 -5550 106 11701 2926 964 24734 12046 4322 596
11274 596 -12038 -12736 -17612 -9165 -13290 -20012 -12733 9 4240 -2208 -13805 -3597 -11307 -7711
11260 -7711 -3465 435 5317 3736 4463 -11707 -23134 -27236 -29248 -28916 -17030 -3473 10555 11147
11246 11147 3753 5469 21633 29829 33103 36871 40582 34075 36501 20704 17511 21700 19624 12134
11232 12134 -4851 -22628 -15975 -2116 -1876 1846 9249 14619 19978 19982 -9194 -9330 1780 8315
11218 8315 14945 19442 6401 6592 1871 -7591 -473 -6795 -13641 -6085 625 -2541 -8936 -6898 8241
11203 8241 21285 12675 15304 4301 1891 10713 20997 14269 6099 2738 -1240 -220 3563 2153
11189B153L978n265o726m915P177o986j5775n335J2843J1034K959L699J5578p519
11175F900j7700j390J1523K3237J272L591P118l946q630L601n237n423j8977n329
11161i390r54j1050N042Q556Q532Q936J248M878l786j734l045J0533O49n994n811
11146F610J2048j0533j6696O675k842k908Q540J1727J3080l913j9840p437J4917
11133I428p299j2771j277j742k146P628K6657m918n668O934k3739o560P993J1049
11119C569K644n308J785J8620r991l675j0700l122O898J4361k714m994K378P546
11105A7297K281q159N121J1288l204L856q819k491L577P36K0002R23n525j6052
11091B0831N794J9487k55L615j4711j9715N15p309j157k620n527Q498J6548j5065
$$ plain form
11189 2153 6131 866 -5860 -10775 -3598 -10584 -26359 -31694 -18851 -7817 -4858 -1159 14419 6900
11175 6900 -10800 -12190 -667 22570 23842 27433 34551 30605 21975 25576 20339 14916 -4061 -9390
11161 -9390 -10344 -21394 -16352 -7796 736 9672 10920 15798 12012 10278 7233 17766 18415 12421 6610
11146 6610 18658 8125 -8571 -1896 -4738 -7646 894 12621 25701 21788 1948 -5489 9428
11133 9428 2129 -10642 -11919 -13661 -15807 -8179 18478 13560 7892 14826 -8913 -15473 -7480 3569
11119 3569 6213 905 2690 21310 11319 7644 -3056 -6178 720 15081 12367 7373 9751 17297
11105 17297 19578 11419 16540 27828 24624 28480 19661 17170 20747 21483 41485 42408 36883 20831
11091 20831 26625 46112 45857 49472 34761 15046 15561 8252 7095 4475 -1052 7446 23994 8929
11077H929o221p627J3900L267j0970j1183Q298J6896o898m712n731M608K194q62
11063C888K090P373R307l270R261p448j5986q585p00K085o955j7059J6150K9372
11049A9523j779j3777k006M653L146j5106L683n2J0270J2102l499J9657j3117
11036B3698j3425j494j7406P164Q525k250m033q112j961j504L429r465o26l906
11022b1366j031Q431J3951k716l279J6014J6194J2418l433j4759j1545N969J7500
11009C2348P851p125p112L357r51j628j7539r298m5j660J9963J3200p890r360
10995A4111p926j473J1680l831q113J1392o70P625M007m146j2221k909o453P347
10981H420J735q114j629L892K039J5303J051q044R148j439l619J6761j447M075
$$ plain form
11077 8929 2708 -4919 8981 12248 1278 -9905 -1607 15289 8391 3679 -2052 2556 4750 3888
11063 3888 5978 13351 22658 19388 28649 21201 5215 -3370 -4070 -1985 -8940 -25999 -9849 19523
11049 19523 17744 3967 1961 6614 9760 -5346 -1663 -1715 8555 20657 17158 36815 23698
11036 23698 10273 8779 -8627 -1463 7062 4812 779 -7333 -9294 -10798 -7369 -16834 -17460 -21366
11022 -21366 -22397 -13966 -15 -2731 -6010 10004 26198 38616 35183 20424 8879 14848 32348
11009 32348 40199 33074 25962 29319 28368 26740 9201 -97 -142 -1802 18161 31361 23471 14111
10995 14111 6185 4712 16392 12561 4448 15840 15170 22795 26802 22656 10435 7526 1073 8420
10981 8420 10155 2041 412 4304 6343 21646 22697 14653 23801 22362 18743 35504 34057 38132
10967C8132M386o030q766j5050M226o960P67K374j1437p071j1436J1129K2451
10954A6715O898r640Q942K0467j1729k4615j4012l472J414K9728J080K733N853
10941C0362j2365k677l621n76N620Q381o207k5426k051N221L343j5199q415N332
10927a8278R158N601j0003m522p520J6820K1605J0382p037m953J1457N074j8178
10914I606j0950L330o657J2349L015p204o099k815p915K3516p139o465m511j3012
10900b0951R38K0335J0846K743P160l137j4535j0794j0499R404K2227Q871m849
10887A7759o370P506l267j982J5379j3170r221j184P625J2583k64J8760m051j1908
10873B8195J720l865q792J1579k745Q73L656J336k503O892o523p695R331J2668
$$ plain form
10967 38132 42518 36488 27722 12672 16898 9938 10705 13079 1642 -5429 -16865 -5736 16715
10954 16715 23613 13973 22915 43382 31653 7038 -6974 -10446 -9032 20696 21776 24509 30362
10941 30362 17997 15320 11699 11123 16743 25124 18917 -6509 -8560 -3339 4 -15195 -23610 -18278
10927 -18278 -9120 -3519 -13522 -18044 -25564 -8744 12861 23243 16206 11253 22710 27784 9606
10914 9606 -1344 1986 -4671 7678 10693 3489 -2610 -5425 -13340 10176 3037 -3428 -7939 -20951
10900 -20951 -20013 322 11168 13911 21071 17934 3399 -7395 -17894 -8490 13737 22608 17759
10887 17759 11389 18895 15628 13646 29025 15855 6634 5450 13075 25658 25394 44154 40103 28195
10873 28195 29915 26050 17258 28837 26092 26965 30621 31957 29454 36346 29823 22128 31459 44127
10859D4127j475j970j2044j1052M700N281M694j5023q007J2883J0341j915j5389
10846A5151j2110K0741M531l706m485n458L056J034J805P675o085j1281q71O821
10832A6818K2614M778j3430j1249J0030K1782q961j188j3678N923l295L381K491
10819C6016p535m161J2051J5971K236j5723j3268qP487o640o520J4283O202M5
10805D0436j171J918l29k459k710J3099Q121J7164k70p801j2010j346j157j6307
10791C5178m51J6137j785j8540k094J3471j077r579p159J9187M789n005j0405
10778C2667q453r910N544j0475q230l02K2134J7981j489o620j128J11M31M468
10764C6729j1160r691n362P74M132J9848M233N950Q148j8871k5819J729J672J7526
$$ plain form
10859 44127 42652 40682 28638 17586 22286 27567 32261 17238 9231 22114 32455 30540 15151
10846 15151 3041 23782 28313 24607 20122 14664 17720 18754 20559 28234 22149 10868 9997 16818
10832 16818 39432 44210 30780 19531 29561 51343 42382 41194 27516 33439 30144 33525 36016
10819 36016 28481 24320 36371 52342 54578 38855 25587 25579 33066 26426 19906 34189 40391 40436
10805 40436 39265 41183 40854 38395 35685 48784 56905 74069 73799 65998 53988 52642 51485 35178
10791 35178 34727 50864 49079 30539 28445 41916 40839 31260 24101 43288 48077 43072 32667
10778 32667 24214 14304 19848 9373 1143 841 22975 40956 39467 32847 31719 31830 32261 36729
10764 36729 25569 15878 10516 11290 15422 35270 39503 45453 53601 34730 8911 10640 12312 29838
10750B9838K694m872n588n436M749P89O696r301j086p38p349q022R690J521k132
10735A1453R990O920n625N860O460P578N584K264j2231J836p03R563J0661n310
10721E4300j0458P92l343M474M080O960P992j2281j3443j0473K0151Q202M304
10708F1257J9189J0946N153J7716K9523K8184K9611O7357J45634J78094K53285
10697H45949K84798J80478k2001q7624j1847Q3881K6454j64617k89346k69766
10687E76359j83336r9228o8567n9946l2269j6682J100l362j6917k1587j4639q650
10675E2276K919O921M589j0755k173Q547K295j0066M802j0910J1063K263j9866
10662D1905j2235P658J0711l06j1658J0921j13j862K3568r835o081l362p645P692
$$ plain form
10750 29838 32532 27660 22072 16636 21385 22174 28870 19569 18483 17745 10396 2374 12064 13585 11453
10735 11453 21443 28363 22738 28598 35058 42636 48220 50484 38253 40089 39386 48949 59610 54300
10721 54300 43842 44634 41291 45765 49845 56805 64797 52516 39073 28600 48751 56953 61257
10708 61257 80446 91392 96545 114261 143784 171968 201579 268936 414570 592664 845949
10697 845949 1130747 1311225 1289224 1201600 1189753 1273634 1300088 1135471 846125 576359
10687 576359 393023 293795 225228 165282 133013 116331 117431 114069 97152 75565 60926 52276
10675 52276 55195 62116 66705 55950 53777 62324 64619 54553 59355 48445 59508 61771 41905
10662 41905 29670 37328 48039 47733 36075 46996 46883 45021 68589 58754 52673 49311 41666 49358
10648D9358J2227P806o908j2116k373P036n129j9578O857j2429P996J2475j504
10635D3718j9133o90K1603K459k5336m280l24K0080J5832J0403J5807j6986j2565
10622E0588l26P632J278j7066j5404j2141J2291K2557J1032O791r937j6985N151
10609D5461J3733M903P06r70o79j0647k27R068N961l140O118J2327O002Q55p167
10594H2304k31K817n072m996R589M216j8108j3408m370k445m423L378M279L244
10580E6774o850n296M851P594J8773j2049o601q094j2368q110J528K787P724J1116
10566E1779L256o650Q386J854j1706k0013N792J0156k019K643n020N232J1287
10553E4977J4811m258M566J4218P239J8413K3605J9980J2678L3860L3054J5348
$$ plain form
10648 49358 61585 69391 62483 50367 47994 55030 49901 30323 37180 24751 32747 45222 43718
10635 43718 24585 23895 45498 47957 22621 18341 18017 38097 53929 64332 80139 63153 50588
10622 50588 50262 57894 59172 42106 26702 14561 26852 49409 60441 67232 57295 40310 45461
10609 45461 59194 64097 64803 63833 63154 52507 52280 61348 67309 64169 70287 82614 88616 89471 82304
10594 82304 82073 84890 79818 74822 84411 88627 70519 57111 52741 50296 45873 49251 53530 56774
10580 56774 49924 44628 49479 57073 75846 63797 57196 49102 36734 28624 30152 32939 40663 51779
10566 51779 55035 48385 56771 58625 46919 26906 32698 42854 40835 43478 38458 43690 54977
10553 54977 69788 65530 70096 84314 91553 109966 133571 153551 166229 200089 233143 248491
10541B48491m695j9804o043K436j9659j5491q120q911k2780j9808R967r212n150
10528A21221n266K259o636K357n322K95j7011k3552R065n729M99O972P456K396
10514H9004j1660m364j0643J410J5924o657q526M417J2750L865j0950p372P412
10501G4610J6246o838r596m375K4933J2546L170n563j795P484P723m361M483o701
10487A11966j2875K18j1153J4354L3554J9008l606k0831J85J0810J066q907n185
10474A28604j5053j8622o347N888k4515k6925j2406m608M786J1911J4117L960
10462F0790J0617R299j2903r736L237J832j2342P388J9284R699k523q889k853
10449G2900L642K177m711J5995K9013J8430k797m906l310n136m409k0668o150
$$ plain form
10541 248491 243796 223992 217949 220385 200726 185235 177115 168204 145424 125616 135583 126371 121221
10528 121221 115955 118214 111578 113935 108613 108908 91897 68345 77410 71681 72180 79152 86608 89004
10514 89004 77344 72980 62337 63747 79671 73014 64488 68905 81655 85520 74570 67198 74610
10501 74610 90856 84018 74422 70047 94980 107526 110696 105133 103338 110822 118545 114184 118667 111966
10487 111966 99091 99309 88156 102510 136064 155072 151466 130635 130820 141630 142696 133789 128604
10474 128604 113551 94929 88582 94470 69955 43030 30624 26016 30802 42713 56830 60790
10462 60790 71407 80706 67803 58067 61304 63136 50794 58182 77466 87165 84642 75753 72900
10449 72900 76542 78719 74008 90003 119016 137446 134649 129743 126433 121297 116888 96220 90070
10436I0070r426k1237k8864k3182r121R102K8772r973m594j7273j8309m236j2451
10423c0722j7426j9955j9105L95N0109J15100J36221Q3637M4398K9872P4505J19636
10411E66665P5670O398m8072n6481p3103o2204k5737k2079j9685r633n896j1636
10399C14207o069j0963n079R692m046p272q808p134m00K271K2441J1306l520N305
10385C11931o209l607n233p15p759K488P49o9N391M453J6779O997M711j041O365
10370C35231J0559O69L400k80m665n438l860J3112J3297m269r632R226N175Q089
10356C70614J4950K0680J2756L077q241P3P959L008N159L3847K7035J0665J8177
10343E19759K8947J8626J9549L3996K2596J9558K5219K9046K0742J3335L9060
$$ plain form
10436 90070 80644 59407 30543 7361 -1760 7342 36114 26141 21547 4274 -14035 -18271 -30722
10423 -30722 -48148 -68103 -87208 -86813 -36704 78396 214617 298254 342652 372524 447029 566665
10411 566665 642335 648733 600661 544180 471077 408873 383136 361057 341372 331739 325843 314207
10399 314207 308138 297175 292096 301788 297742 290470 281662 274528 274128 276399 298840 310146 306626 311931
10385 311931 305722 302115 296882 296167 288408 290896 291645 291576 296967 301420 318199 325196 329907 328866 335231
10370 335231 345790 346459 349859 349579 344914 339476 335616 348728 362025 357756 348124 357350 362525 370614
10356 370614 385564 406244 419000 422077 413836 413909 421868 424876 430035 463882 490917 501582 519759
10343 519759 548706 567332 586881 620877 643473 663031 688250 717296 738038 751373 790433
10332G90433L8433L0527M1399N9044N4392N9659N2793O5699O4216N3101O2121
10321A371817Q5993R0976Q8558J17421J45894J89222K35432K84178L89378M97184
10311C496053N48182M53460K92315K52892M35670O73269Q06568P93915Q63294
10302H615618J078883J335500J671082K267024L232269M770427P297048J2075152
10294D2343003K0667858L3750559M8776912N4847957L4836064k930146k0494753
10287B11797454m015947J7755223J0359863k6388146n5197763n3215626l5831125
10280F5263933k1059462j2259222p529929n097976l641597k452525j559455j106502
10272A0557265r67521r08458p47270n10238m45012n54799o52658n98629m65719
$$ plain form
10332 790433 828866 859393 900792 959836 1014228 1073887 1126680 1192379 1256595 1309696 1371817
10321 1371817 1457810 1548786 1637344 1754765 1900659 2089881 2325313 2609491 2998869 3496053
10311 3496053 4044235 4497695 4790010 5042902 5478572 6151841 6958409 7752324 8615618
10302 8615618 9694501 11030001 12701083 14968107 18200376 22970803 30267851 42343003
10294 42343003 63010861 96761420 145538332 200386289 235222353 232292207 211797454
10287 211797454 207781507 225536730 235896593 209508447 154310684 101095058 65263933
10280 65263933 44204471 31945249 24415320 19317344 15675747 13223222 11663767 10557265
10272 10557265 9589744 8681286 7934016 7423778 6978766 6423967 5771309 5172680 4706961
10263D706961m51279n46986n70073m48036l06227j95627j41066j12370j32367
10254A802930j49062j59858j46425j13742q8530p0973n6691m3874m4560k2233
10244I06982k8698l0498n5511m8005m1110m7362l3127k5023l97k6548k7413k7732
10232E15558l4840j2698m68j9584k1387l638l777j4011j8470j6719l0536r150
10220C30280P999j5040o139k5061k2326l3879p195R194j206p504j3463k1535j4242
10207A79883M429n11r423j2825l986j33P256P312m515k2136j0033m688k0205j0500
10193I9925j5447o779K826N803l07k5651j0709K1144K313q139j152j3420r100
10180D1307J541l204q186k0202R253Q444J5180m524k3266j1625j4234j0199K950
$$ plain form
10263 4706961 4255682 3708696 3138623 2690587 2384360 2188733 2047667 1935297 1802930
10254 1802930 1653868 1494010 1347585 1233843 1145313 1074340 1017649 973775 929215 906982
10244 906982 878284 847786 792275 744270 703160 655798 622671 597648 597251 570703 543290 515558
10232 515558 480718 468020 467552 447968 426581 422943 419166 405155 386685 369966 339430 330280
10220 330280 338279 323239 317100 292039 269713 235834 228639 237833 236627 229123 215660 194125 179883
10207 179883 184312 183801 174378 161553 157567 157434 164690 172002 167487 145351 135318 130630 110425 99925
10193 99925 84478 77699 80525 86328 86021 60370 49661 70805 73118 64979 63827 50407 41307
10180 41307 42848 39644 31458 11256 20509 28953 44133 39609 16343 4718 -9516 -19715 -16765
10167a6765Q165J1484L1501M4582M2666P1735O0241L2930J4433K6349K0122r918
10155C37525j9495q696r926j1060j3440j4907k6507k9402q221n8j3674q160j5751
10142A58228K854n131M59j4133k1084j5820j8551j607j0603j0456l745J3177Q909
10129H2497Q568O333o559J097K7309M767O842K704j8276q824q564o642J6570J7328
10115A25150l522k0834j8721J64J2255J7431k763K542p911j7562j4682o162l347
10102F2038r851r092j0110j0537q641J2638J0935j351P03n042K764J9089L2510
10089H6053M639k9024m1700k0251O228J9325P027M796J885J8502O858K3861J6832
10076A05031m570j219m266o45k1400p003M933M958j339K032N2K44J439M376j12
$$ plain form
10167 -16765 -8600 2884 34385 78967 121633 193368 253609 286539 300972 327321 347443 337525
10155 337525 318030 309334 299408 288348 274908 260001 233494 204092 195871 195813 182139 173979 158228
10142 158228 161082 155951 156410 142277 121193 105373 86822 85215 74612 64156 60411 73588 82497
10129 82497 91065 97398 90839 91936 119245 124012 130854 133558 115282 106458 97894 91252 107822 125150
10115 125150 121628 100794 82073 82237 94492 111923 109160 111702 103791 86229 71547 65385 62038
10102 62038 52187 43095 32985 22448 13807 26445 37380 36029 36732 31690 34454 53543 86053
10089 86053 90692 61668 19968 -283 5945 25270 32297 37093 38978 57480 64338 88199 105031
10076 105031 100461 99242 94976 94331 72931 65928 70861 75819 74480 76512 76564 76808 78247 82623 82511
10061H2511q279O376L082j1400j8226J959K236m672n038l243k170o371j811N368
10047D0322m135L09J7934J1376K2429J4090P074P507K9582L4344M2604j996m7453
10034A73987n3323j5155Q6j1953k5848k1236m484J9938J6347J498P518j9730j0494
10021E7151K865O700L924r603Q231J8048O930L397j0871p13j1077r674J829K397
10007F9534m331K638R862n552Q767m214r001O891R845r878N161o646j369Q719
9993H0426J4052J2208n770k584q496j4010M716j3437q170j2063q582R516J1953
9980E9759Q458J936q460rK531J6183k583r752k199Q086k146P522J471n58n953
9965G4286J6017J8314q128j0380J42J3239L898l283j9685m52J7279m916j3722
$$ plain form
10061 82511 74232 80608 83690 72290 54064 56023 58259 53587 48549 45306 43136 36765 34954 40322
10047 40322 36187 36496 54430 65806 88235 102325 109399 116906 146488 180832 223436 221440 173987
10034 173987 120664 105509 105595 93642 67794 46558 42074 62012 78359 79857 87375 67645 57151
10021 57151 60016 66716 70640 61037 69268 87316 94246 97643 86772 86059 74982 65308 67137 69534
10007 69534 65203 67841 77703 72151 80918 76704 67703 74594 84439 74561 79722 73076 71707 80426
9993 80426 94478 106686 100916 98332 89836 75826 80542 67105 58935 46872 38290 47806 59759
9980 59759 68217 70153 61693 61684 64215 80398 77815 68063 65864 73950 71804 79326 80797 80239 74286
9965 74286 90303 108617 100489 90109 90251 103490 107388 104105 84420 83968 101247 96331 82609
9952H2609L884j2624j0096l94M559R130O97K532j247J956J964k956O473J4152
9938A00639M877p254j7302Q541J4662O697J3720L910q876j4035l109N47n091L961
9924A01887L608r827J3111J2910K143j8926r331K2413j4493p760k50n247r274
9911H0964N749N484j397k185M269J8181L157o217j984R718M001J3804K0978j969
9897A52553L62q26j532j4110O227J8693J0675J1413L284L824O247L4004L0305
9884B61119M4797P8420J17814J95528K74677K68770J53712l9946q6521J5647R3498
9873A377515l479j89633l02737k61476j65967q7733o2408l8146k0658j7646K228
9862B29860m569j7365l0562m576R740L66j5011j1965l354j4857L515Q207j1429
$$ plain form
9952 82609 86493 73869 63773 63379 67938 77068 77765 80297 79050 81006 82970 80014 86487 100639
9938 100639 105516 98262 80960 89501 104163 110860 124580 128490 119614 105579 102470 103017 97926 101887
9924 101887 105495 95668 108779 121689 123832 104906 95575 117988 103495 95735 95485 90238 80964
9911 80964 86713 92197 90800 88615 92884 111065 114222 108005 106021 115739 119740 133544 154522 152553
9897 152553 152915 152089 150557 136447 142674 161367 172042 183455 186739 190563 196810 230814 261119
9884 261119 305916 384336 502150 697678 972355 1241125 1394837 1354891 1268370 1284017 1377515
9873 1377515 1374036 1184403 881666 620190 454223 366490 304082 265936 245278 227632 229860
9862 229860 225291 207926 177364 172788 182528 182894 167883 155918 152564 137707 141222 149429 138000
9849A38000J6814K7042O549m209O481J6007j4673k7094k2363Q602J4407K366N577
9836A73506L577p169m154J0609J111k050N429Q183j299p557j8064Q939o325J668
9822A66404J2345P051j3086j2758Q309r806j0883J8512J9003j1823j2117l619
9810A57532j562K387R0M794J821j1086L516P868J0326O522l978p149N079K722
9796A78882R014L240o280q511j3502J3245J1757o299o332J910o801j150m984J8618
9782A82807K828K99p894q167m9O347P594M442P208o186j1183K495L170j3520j3739
9767A56452P420J5028j009K410j660O545Q912L700J7398p122q996n735k444P911
9753A98810j080j6515o682Q373L064Q045O523p921M82Q542k869k314N636K932
$$ plain form
9849 138000 154814 181856 188405 184196 190677 206684 192011 164917 142554 151156 165563 167929 173506
9836 173506 177083 169914 165760 176369 177480 175430 180859 189042 187743 180186 162122 171061 164736 166404
9822 166404 178749 185800 172714 159956 168265 158459 147576 166088 185091 173268 161151 157532
9810 157532 155970 158357 158447 163241 165062 153976 157492 165360 175686 182208 178230 171081 176160 178882
9796 178882 187896 191136 184856 176345 162843 176088 187845 181546 175214 177124 170323 169173 164189 182807
9782 182807 185635 185934 178040 169873 169824 176171 183765 188207 195415 189229 178046 180541 183711 170191 156452
9767 156452 163872 178900 177891 180301 178641 185186 194098 197798 215196 208074 199078 193343 190899 198810
9753 198810 197730 181215 174533 182906 185970 194015 200538 192617 193099 201641 198772 196458 202094 205026
9739B05026o693Q92p99j382M393N623k706k985j498l210L177K881l096J1483Q65
9724B11971j272Q451J039j6795k2640O376p94J3786N242m737n462j6417L385J451
9710A83584k89k114R71J3747O997r40J015j3016O487o947j1700k256J9512M863
9696A99914J204Q162l020k526N088N269o643M954o591J268P455l209k3008k308
9682A86009O077J6228j0219j2214m008O27Q967K713m147J137q010k881K489P558
9668A90326J900j1590k993M117J1958P935m074m433r79o126l00j4705j2589N01
9654A58948M579Q207K3976O8N354q552q144N184O882k397j1602j4690J4478J6112
9640A98403r108M704O856r492p054N861Q344n758j6670k0655l323K1533P874n472
$$ plain form
9739 205026 198333 199225 198426 197044 201437 207060 204354 201369 199871 196661 199838 202719 199623 211106 211971
9724 211971 210699 219150 220189 203394 180754 187130 186336 200122 205364 200627 195165 178748 182133 183584
9710 183584 183295 181181 182152 195899 202896 201956 202971 189955 196442 189495 177795 175539 195051 199914
9696 199914 201118 209280 206260 203734 208822 214091 207448 212402 205811 207079 214534 211325 188317 186009
9682 186009 192086 208314 198095 185881 181873 182500 191467 194180 190033 191170 183160 180279 182768 190326
9668 190326 192226 180636 177643 181760 193718 201653 197579 193146 192167 186041 185741 171036 158447 158948
9654 158948 163527 171734 195710 195778 201132 192580 184436 189620 196502 194105 182503 167813 182291 198403
9640 198403 189295 193999 200855 191363 184309 190170 198514 192756 176086 155431 152108 173641 181515 176043
9626A76043o716J7l834o073P631L694r387p606K794P593l467p656J877m73m707
9611A49730k00R241P880J726p783n406L692J3092j0050r237K737L167p776k063
9597A48750n80J7889q497j2069R06J2059P327j1645j5360J249P140j578R797n913
9583A49475j9866j1488J2860J7527k764q15R290j2106p287j1063q200J4705j958
9570A28310M10M501j060q54L093o113k494J5723J2257o727k673j4788j0787m210
9556A14588mM751N126P322p649j7298j1623J3958J601k941p062N989m551L095
9542A05302N485J4139L301M732k2293p882q295j2099j0889L658J8082R078J7734
9529A20053m614l197j3340r900K264N039j1188O483J728R154K422j8377K144J392
$$ plain form
9626 176043 169327 169344 165510 159437 167068 170762 161375 153769 156563 164156 160689 153033 154910 154437 149730
9611 149730 149530 158771 166651 168377 160594 155188 158880 171972 161922 152685 155422 158589 150813 148750
9597 148750 148170 166059 157562 145493 146399 158458 165785 154140 138780 140029 147169 145591 155388 149475
9583 149475 129609 118121 130981 148508 145744 144929 154219 142113 134826 123763 115563 130268 128310
9570 128310 128720 133221 132161 131307 134400 128287 125793 141516 153773 147046 144373 129585 118798 114588
9556 114588 114584 119335 124461 131783 124134 106836 95213 109171 110772 107831 100769 106758 102207 105302
9542 105302 110787 124926 128227 132959 110666 102784 94489 82390 71501 75159 93241 102319 120053
9529 120053 115439 112242 98902 89002 91266 96305 85117 91600 93328 102482 104904 86527 88671 90063
9515I0063n580q171Pp687O967P092R29k591n242L269j302p91J2441L142o963q792
9499G6791p256N96P099J7823P57j6290p673r261k144R107R548Q580l788o403K942
9484H0428K521J093r319r25o593P492m530Q99J7496j0334j1091q672j2092n187
9470D1186P169R002k543N731l121M933J5171L697J2866j653k1772j1532J9165
9457G8299p165j2541O99N684J956l054j1939K710r887j0473J6604j024l226K3416
9443G0059O982n769m522j3192M484r848j4064l309J750J1604l384o852J1391J3078
9429E8408q60j6298p488r657p116O973j1683r361K9602K5537R13n615O152J081
9415F0588l425r901J1217m778j6458j1508l750R429L836K305n93J0777p005r844
$$ plain form
9515 90063 84483 76312 76319 68632 75599 82691 83620 81029 75787 79056 77754 76963 89404 92546 85583 76791
9499 76791 69535 70131 77230 95053 95810 79520 71847 62586 60442 69549 79097 87677 83889 77486 80428
9484 80428 82949 84042 74723 73798 67205 74697 70167 71066 88562 78228 67137 58465 46373 41186
9470 41186 48355 57357 54814 60545 57424 62357 77528 81225 94091 92438 70666 59134 78299
9457 78299 71134 58593 59292 64976 66932 63878 51939 54649 44762 34289 50893 49869 46643 70059
9443 70059 77041 71272 66750 53558 58042 48194 34130 30821 32571 44175 40791 33939 45330 58408
9429 58408 57548 41250 33762 24105 16989 23962 12279 2918 32520 58057 58970 53355 59507 60588
9415 60588 57163 47262 58479 53701 37243 25735 21985 31414 35250 37555 36962 47739 40734 30890
9401C0890L785J2408J4728O491Q13M652j4282J394j297l232n308p679r400K7820
9387F1783J5773K68j0573j0470P525j117j8274j0441N891J5863l761j2452n975
9374C4040J4804P797n67k377K319J009L385J193j3890o792K046l103R63n569K576
9359C7834P139p021M456R53Q043M544m739J384o740j1534J3281N00n381M899p85
9344D6833o642m806n944K295j0483J8282J2999j0583m021m924J026K193O997j3973
9330B9249m72K653K644O679Q996l751j2687j8749J1996J5548j822j4122j5101
9317A1061J2439o283j3168p17J3573J2024O889l189n748N113Q107p781k702J5374
9303D4992l103k874K0342N681N84j200j8393j4955k791o024j0638J480J9413J483
$$ plain form
9401 30890 34675 47083 61811 68302 69115 73767 59485 60879 59582 56350 51042 43363 33963 61783
9387 61783 77556 77824 67251 56781 64306 63189 44915 34474 40365 56228 52467 40015 34040
9374 34040 48844 56641 56074 53697 56016 57025 60410 61603 47713 40921 42967 39864 40827 35258 37834
9359 37834 44973 37952 42408 43361 51404 55948 51209 52593 45853 34319 47600 48100 42719 47618 46833
9344 46833 40191 35385 29441 31736 21253 39535 52534 41951 37930 33006 34032 36225 43222 29249
9330 29249 28777 31430 34074 40753 49749 45998 33311 14562 26558 42106 40284 26162 11061
9317 11061 23500 17217 4049 3332 16905 28929 35818 32629 26881 31994 40101 32320 29618 44992
9303 44992 41889 39015 59357 65038 65622 64422 46029 31074 28283 22259 11621 13101 32514 33997
9289C3997j8831j6690Q096R593J3331L246O653q920k2453L703J2055q666J6174
9276C1288J0279r092L986p123j0351j343K187n898k542N319j3975O0j428O419
9262G786J2741j167J5276o088j1529J5435J2652j941j1036k0547N137J0574n322
9249B1971L785l126Q511Q266q943j9557k194j863K754J0163L975r10m402o937
9235A1493Q084O011K437K488k094j7801m467J5584K633k843p91L607J53J8684
9221D3178O380m404j2758n200m993M705n15o90l080K078k177O525K187j1849R821
9206B9208J6098K728k0901J033L618J1785n486j2367P277o378K708Q717j4073
9193B3967l090N261N748M712R680r942k3045k2992j4894L5639K169n303k44n281
$$ plain form
9289 33997 15166 -1524 6572 16165 29496 32742 39395 30475 8022 11725 23780 15114 31288
9276 31288 41567 32475 36461 29338 18987 17644 19831 13933 11391 16710 2735 2795 1367 7786
9262 7786 20527 19360 34636 28548 17019 32454 45106 43165 32129 11582 16719 27293 21971
9249 21971 25756 22630 31141 39407 30464 10907 8713 6850 9604 19767 23742 22832 18430 11493
9235 11493 19577 25588 28025 30513 28419 10618 6151 21735 24368 21525 20734 24341 24494 43178
9221 43178 49558 45154 32396 27196 22203 26908 26393 25703 22623 24701 22524 29049 31236 19387 29208
9206 29208 45306 48034 27133 28166 31784 43569 38083 25716 32993 26615 29323 38040 23967
9193 23967 20877 26138 31886 36598 46278 36336 13291 -9701 -24595 11044 13213 7910 7666 2385
9179B385m667J4217J7649J713r597L549m367m487l987K35Q904m065l545o542O219
9164A3614M147R515r411n381k952Q511N918N15p869q934k678L500Q654K4577M104
9149D5830j5849k577j4301j0784J6881J0141J743l948l151R30j387o790j253m004
9135A1481r072j341O187P958K386l306O521j0671n000J1804J0663k23j9687m835
9121B865R402l847j1967J3785J0309N257m301n658j295k731O774J0458J0936P15
9107D0702J828N937j0881j9109j6545j050Q586Q088k833q48J2338J3695L218j6029
9093B7097j2034N138j3030r385n668q009P498J3968R697p19n27J0329J3842L457
9079D1654p597j8720q785m353J8369n04p388q751J914o999M476J4924J0141K283
$$ plain form
9179 2385 -2282 11935 29584 31297 21700 25249 20882 16395 12408 12643 21547 17482 13937 7395 13614
9164 13614 17761 27276 17865 12484 9532 18043 23961 24476 16607 7673 4995 8495 17149 41726 45830
9149 45830 29981 27404 13103 2319 19200 29341 31084 27136 23985 24915 23528 16738 15485 11481
9135 11481 2409 1068 7255 15213 17599 14293 20814 10143 5143 16947 27610 27387 7700 2865
9121 2865 12267 8420 -3547 10238 20547 25804 21503 15845 14550 11819 18593 29051 39987 40702
9107 40702 42530 48467 37586 18477 1932 882 9468 17556 14723 13875 26213 39908 43126 27097
9093 27097 15063 20201 7171 -2214 -7882 -15891 -8393 5575 15272 14553 14026 24355 38197 41654
9079 41654 34057 15337 6552 2199 20568 20064 12676 3925 5839 -1160 3316 18240 28381 30664
9065C0664M697J414r280k146n806K65q256k0107n390J5723R147J2646n497J614
9051A9688O280M177j4855j2137j7952r136j2750P410J8667J2313k992m294K332
9038c249N32P290K917L933K0807k712j6204k4115J2680J8570l626p719m213N621
9024A0512J143j0975m296J2006k313r506j7594j3467Q836J7029J0832P397J989
9011A1593J2719Q447N46n747m323j6648q459j1788J261J1653J5447j0383p288
8998b970L622j0189K481N037M610P422j0926j1757j948R055J6667N96j4765R315
8984F250n129r654m731J7J5657Q106j0545l737K836L124N14N47j1746j0588R185
8969i894J2123R481L960r247j45k663K921Q619K544K457j8924j3309J492J2409
$$ plain form
9065 30664 35361 36775 27495 25349 19543 19808 11552 -8555 -13945 1778 10925 23571 18074 19688
9051 19688 25968 30145 15290 3153 -14799 -23935 -36685 -29275 -10608 1705 -1287 -5581 -3249
9038 -3249 -2717 4573 7490 11423 32230 29518 13314 -10801 1879 20449 16823 9104 4891 10512
9024 10512 11655 680 -3616 8390 6077 -3429 -21023 -34490 -25654 -8625 2207 9604 11593
9011 11593 24312 32759 33305 27558 23235 6587 -1872 -13660 -12399 -746 14701 4318 -2970
8998 -2970 652 -9537 -7056 -2019 2591 10013 -913 -12670 -14618 -5563 11104 11700 -3065 6250
8984 6250 1121 -8533 -13264 -13247 2410 10516 -29 -3766 -930 2194 2708 3255 -8491 -19079 -9894
8969 -9894 2229 11710 15670 6423 6278 3615 6536 15155 17699 20156 1232 -12077 -10585 1824
8955A824K4620J5596J0598p852j4793j9225j0019k902L064J7725L96o697p4P434
8941A9695o958l094m259r105l750J757O318j47p453K959j047O466J0808J5154
8927B7344N171Q850j0456k3316j6369J2891J137m485K6868m769N58j2787j0724
8914h7j4044l534m956L2322J2169j1692j9086k578J0098k34K863R398n713o262
8900a336l305K716K293J796P420P352N745k1128j83n90L769K668o706q398M469
8885c418L183j1173n155l149M105J0181m894P25l955J566K4303K970j2337L36
8871C288l188k2869o693P701R415L094l31J775J0744n239J2899J1016j173J599
8857B2038j155j3889M052Q190R951J486j1035O316J2257j2348j0522q309k5302
$$ plain form
8955 1824 26444 42040 52638 44786 29993 10768 749 -2153 911 18636 19032 12335 12261 19695
8941 19695 12737 9643 5384 -3721 -7471 -5714 604 457 -6996 -4037 -5084 1382 12190 27344
8927 27344 32515 41365 30909 7593 -8776 4115 5252 767 27635 22866 23424 10637 -87
8914 -87 -14131 -17665 -22621 9701 21870 10178 -8908 -11486 -1388 -1622 1241 10639 4926 -1336
8900 -1336 -4641 -1925 368 2164 9584 16936 22681 1553 1370 780 4549 7217 511 -7887 -3418
8885 -3418 -235 -11408 -16563 -19712 -15607 -5426 -10320 -9595 -13550 -11984 12319 15289 2952 3288
8871 3288 100 -22769 -29462 -21761 -12346 -9252 -9583 -7808 2936 -2303 10596 21612 20439 22038
8857 22038 20883 6994 11046 19236 29187 30673 19638 25954 38211 25863 15341 7032 -18270
8844a8270l465O097J1656j383j0613l05R941m336m603L003L948J4161J0065m654
8830A1242L525o552k077j262m85O704p15o578O500R59L28P011N740j1907k4329
8815a1896P975j4313j2290J2271J8245R330N5P666J2890k78q652n004m94o435
8801I070n904l900M944q659j090J9049O054J650r42j4064n072j5005l69O628K399
8786e211r97J1260M011r936P286M888o759j3139N02J6568Q190j0645j3739J3543
8772E822J3831k1831q845p450j6109K248J7246J0525l076l654K767O32o165n470
8758a9529l225J088K0788O515J895J5312L542j1867L80m30j0556k207l069L399
8744B036n069j0424J7263M006k743o893j2499L641L821m751l271O3J0816O331
$$ plain form
8844 -18270 -21735 -15638 -3982 -5365 -15978 -16283 -6342 -10678 -15281 -12278 -8330 5831 15896 11242
8830 11242 14767 8215 6138 4876 4391 11095 10380 3802 10302 11261 11589 18600 24340 12433 -11896
8815 -11896 -3921 -18234 -30524 -18253 -8 9322 9377 17043 29933 29655 21003 15999 15505 9070
8801 9070 3166 -734 4210 -4449 -5539 13510 19564 21214 20272 6208 1136 -13869 -14238 -7610 -5211
8786 -5211 -6208 5052 9063 -873 6413 11301 4542 -8597 -8095 8473 16663 6018 -7721 5822
8772 5822 19653 -2178 -11023 -18473 -34582 -32334 -15088 -4563 -7639 -11293 -8526 -7894 -14059 -19529
8758 -19529 -22754 -21666 -878 5637 7532 22844 26386 14519 14899 14469 3913 1706 -1363 2036
8744 2036 -3033 -13457 3806 7812 5069 -1824 -14323 -10682 -6861 -11612 -14883 -14820 -4004 2327
8730B327o676j8555j5819J246J1346N292p661o270J0642N277L007L060J2013J6311
8716A5540R051n524J032N841N172r161k3140r462J174m684j1422P234R968p913
8702a6294k265J457K1796O861J4702M845r21j7182q224M360o466j0578L399J017
8688c493Q381J118m764O966k110j5371k041L528M284K80p631K55P122J073N709
8673C306N61L325J4249L978K067o800M648L945j653q38m009r63n898n516R822
8658B0224J9352L544j9432m276p740k284J782j4705P256o860m494o65J986J2630
8644F318J6560j183k633K744P023O312L417j3179q234m043J919L221m966J0332
8630B3608L229r439n300J0377J1713q696j4773J1830J2251m065O458J835O96k002
$$ plain form
8730 2327 -4349 -22904 -38723 -37477 -26131 -20839 -28500 -34770 -24128 -18851 -15844 -12784 -771 15540
8716 15540 24591 19067 20099 25940 31112 21951 -1189 -10651 -9477 -14161 -25583 -18349 -8381 -16294
8702 -16294 -18559 -17102 4694 11555 26257 31102 30181 12999 4775 9135 2669 -7909 -4510 -3493
8688 -3493 4888 6006 1242 8208 6098 -9273 -11314 -7786 -3502 -3222 -10853 -10598 -3476 -2403 3306
8673 3306 3867 7192 21441 25419 27486 20686 25334 29279 27626 26788 22779 21816 15918 10402 20224
8658 20224 39576 43120 23688 19412 11672 9388 11170 -3535 3721 -3139 -7633 -8298 -6312 6318
8644 6318 22878 21695 19062 21806 28829 35141 38558 25379 17145 13102 15021 18242 13276 23608
8630 23608 26837 17398 12098 22475 34188 25492 10719 22549 34800 30735 37193 39028 39724 37722
8616C7722r456N130J0776M99m719J563K520L702Q416N058O64l947Q432j244Q018
8601G3134L852K961J571j589k0929P349J06l986k1398j6660K080O56L597J173
8587C1917N392J1607J4434R965l806j7502m470q950J0672L128q855j3858j4724
8574A4950J0712Q765J2738l071p562J872r080k1194J573J6032P722n734m470o095
8560A7158j0210o792L538q699o879J2530M715j0649j1802Q527J732j7077q058
8547c1966K2711J5055J943L685p114m924l375k430N534Q166k905j2633j212J5529
8533F064j601m266l575j0634R145K2766J105j1991Q924J245l901k878L073m707
8519H769q818J5123M416p908P244O139L398m48r27m428q056M853q506O327k603
$$ plain form
8616 37722 28266 33396 44172 44671 39952 41515 44035 47737 56153 61211 61875 57928 66360 65116 73134
8601 73134 76986 79947 81518 79929 59000 66349 66455 62469 41071 24411 26491 27147 30744 31917
8587 31917 37309 48916 63350 73315 69509 52007 47537 38587 49259 52387 43532 29674 14950
8574 14950 25662 34427 47165 44094 36532 38404 29324 8130 9703 25735 33457 27723 23253 17158
8560 17158 6948 156 3694 -5005 -11884 646 5361 -5288 -17090 -8563 -6831 -23908 -31966
8547 -31966 -9255 5800 7743 11428 4314 -610 -3985 -6415 -881 7285 4380 -8253 -9465 6064
8533 6064 4463 197 -3378 -14012 -4867 17899 19004 7013 15937 17182 13281 10403 13476 8769
8519 8769 -49 15074 19490 11582 18826 24965 28363 27915 26988 22560 14504 19357 10851 17178 14575
8504A4575R20j5398j4894J1421P508p030n339N4J2535Q081K694j227k014P22r637
8489B971l551M887j2677m206J4418J1089J1885p255k2547K096L92m294O762N423
8475E393Q67O886j388m887j2568l584N968r343p891J6798Q203M098k394N658k888
8460H928j7817J723K531q423j073L008P909R821j2803j6651J0784R563P746l473
8446A773p420L998j6642J0111N505O547M717P23q447j740Q317J0830j243l94j9302
8431b667o771N951n583K67N009n590L217M441m590l392O904P17q49J6444j20j7157
8415c769p369j0711P986L816n923j2885J888J2392R253J5707j686p823J751Q769
8401A1396j0625r835k931M245K188J4493Q850j3587k0154L260L943R890q65o737
$$ plain form
8504 14575 15495 97 -14797 -3376 4132 -2898 -8237 -8183 4352 12433 15127 13900 11886 12608 2971
8489 2971 -580 4307 -8370 -12576 1842 12931 24816 17561 -4986 -2890 -2498 -6792 -30 5393
8475 5393 6260 13146 11758 6871 -5697 -9281 -3313 -12656 -20547 -3749 4454 8552 6158 11816 8928
8460 8928 -8889 -7166 -4635 -13058 -14131 -11123 -3214 6607 -6196 -22847 -12063 -2500 5246 1773
8446 1773 -5647 -1649 -18291 -8180 -2675 3872 8589 9312 865 -875 7442 18272 17029 16635 -2667
8431 -2667 -9438 -3487 -9070 -8803 -3794 -9384 -6167 -1726 -6316 -9708 -2804 -2087 -2936 13508 13388 -3769
8415 -3769 -11138 -21849 -13863 -10047 -15970 -28855 -26967 -14575 -5322 10385 8699 876 2627 11396
8401 11396 771 -9064 -11995 -7750 -5562 8931 17781 4194 -15960 -12700 -8757 1133 268 -6469
8387f469n122J783O284M803N777M117J4809K169O993k577j5956j1102J0603n419
8373A0693j1335J0544n249p746J2273K97k150j708N284R303p681k385R945r017
8359A1068K695K59k474p860l272J198J670L17N645k319l106P884R374K224j8280
8344E023q978n059K727Q619n595j1203N13K450J997J253p599j3478J6366p063
8330b0027l269n273r900J5176J3535J3434J6011m337l305K38j5799p223N532N875
8316F68l075o606O108Rj1996m778L876M725K846P726o049Q656P05K520L078l524
8300D889R508p971o870Q539K152r912n54O564l56j067n359j4189P08j1569j8903
8285d4390J1150J1761O147o776R702J7330l922k063l642J080j2158J3481J7357
$$ plain form
8387 -6469 -11591 -9808 -3524 1279 7056 11173 25982 28151 35144 32567 16611 5509 16112 10693
8373 10693 -642 9902 4653 -3093 9180 9477 7327 5619 10903 20206 12525 10140 20085 11068
8359 11068 13763 14022 11548 3688 416 1614 3284 3601 9246 6927 3821 11705 21079 23303 5023
8344 5023 -3955 -9014 -6287 2332 -3263 -14466 -13953 -11503 -9506 -8253 -15852 -29330 -12964 -20027
8330 -20027 -23296 -28569 -38469 -23293 -9758 3676 19687 15350 12045 12283 -3516 -10739 -5207 668
8316 668 -2407 -9013 -2905 -2896 -14892 -19670 -15794 -11069 -8223 -497 -6546 2110 2815 5335 8413 4889
8300 4889 14397 6426 -444 8095 10247 335 -219 6345 5989 4922 -437 -14626 -13918 -25487 -44390
8285 -44390 -33240 -21479 -15332 -22108 -12406 4924 1002 -1061 -4703 -3623 -15781 -2300 15057
8272A5057l057j524l882K871o506K543j3678j3413l614N951Q838j935N115J7179
8258I945p578l690j724l987J2083P386m414j0120J653J0658O507j0941K333n442
8244B669n482n544k529m669J0J3376J4564Q65k261j124Q292j734m520j7383j3199
8229a8669K975J6928o078j4811q564k890K413P798o322j3589J618K0215J1363
8216g613n605r544N715J4904N654j0225J857M357j1020M372K1085j2901n390k866
8202g220j2492j2311J625O530L398K735R338P666Q007R273J780l67j5565j8049
8188a5652q0J979q146K125O682j2019K348l976o695M459Q161j1674Q436J9213
8174d839J926L373Q650n810n018P583J5131p066j0367K095N031o274N667R516
$$ plain form
8272 15057 12000 10476 6594 9465 2959 5502 -8176 -21589 -25203 -19252 -10414 -12349 -7234 9945
8258 9945 2367 -1323 -3047 -7034 5049 12435 8021 -2099 -446 10212 16719 5778 8111 2669
8244 2669 -2813 -8357 -10886 -15555 -15545 -2169 12395 13260 10999 9875 18167 16433 11913 -5470 -18669
8229 -18669 -15694 1234 -4844 -19655 -28219 -31109 -28696 -20898 -27220 -40809 -39191 -18976 -7613
8216 -7613 -13218 -22762 -17047 -2143 3511 -6714 -4857 -500 -11520 -7148 13937 1036 -4354 -7220
8202 -7220 -19712 -32023 -30398 -23868 -20470 -17735 -8397 -731 7276 16549 18329 17962 2397 -15652
8188 -15652 -15732 -13753 -21899 -19774 -13092 -25111 -22763 -26739 -33434 -28975 -20814 -32488 -24052 -4839
8174 -4839 -2913 460 9110 3300 -1718 5865 20996 13930 3563 5658 10689 4415 10082 19598
8160A9598l526m23N71j426J2337j2792j7705P546J0522q841m822n041p273m191
8146a5466O760J2525J1067L665L82l450j2071j3941M47K842j6534k485N532N080
8132a5647K675Q469J3451n75M029O239K772r699q999r783j2298N374Q435p296
8118a2853N872O246K0938O281j6702o723q882J4357j901k225L271N629K819O598
8104B2725P593j1393L010p555k493L700k263j7526q619O699J1198N085j8595l120
8090a1554K0338J000k15J191q976Q200o226k6192j2736J0487o913J3408N997n130
8076a7321K917J246J8549P186j1917l120l494N825J363r651m809R277J2633L417
8062A2101m090j3369K729O293J1288M567j1846l462n571J533M408J0372J6576
$$ plain form
8160 19598 16072 15649 16220 14794 27131 14339 -3366 4180 14702 5861 1039 -4002 -11275 -15466
8146 -15466 -8706 3819 14886 18551 18933 15483 3412 -10529 -10082 -7240 -23774 -26259 -20727 -15647
8132 -15647 -12972 -4503 8948 8373 12402 18641 21413 11714 2715 -7068 -19366 -13992 -5557 -12853
8118 -12853 -6981 -735 20203 26484 9782 3059 -5823 8534 6633 4408 7679 13308 16127 22725
8104 22725 30318 18925 21935 14380 11887 15587 13324 -4202 -12821 -6122 5076 10161 -8434 -11554
8090 -11554 8784 9784 9569 10760 1784 9984 3758 -22434 -35170 -24683 -31596 -18188 -12191 -17321
8076 -17321 -14404 -13158 5391 12577 660 -2460 -5954 -129 1234 -8417 -13226 -3949 8684 12101
8062 12101 8011 -5358 -2629 3664 14952 19519 7673 4211 -1360 173 4581 14953 31529
8049C1529q268j6649J3254j405l348r005J57J0462J671j8486j8982M877K4472
8036A0279J6073o605j448O289n606n255l946k2489n184Q017R014O291J0765j745
8022A4450q971J3804J2794m241o148r961J0526j0342k2825N027J4805K704J2547
8009B4169J385N156n653J3328O988j9827m904J3909M649j1759J1852J1352k442
7996D8203R959O885P533K0118j0717k9813j5479o951J7805J4692o171j3335m821
7983C7908J6352J3472M232j1017j1358j1656k7184q225J8162l992p722n400j2114
7970h542M717K679l659Q424P562L310L079J4557K3153J3530p875r657n103j6737
7956B9438j0171P263J1997J2374J783k559M052L643p61O236k47K206k6047k6921
$$ plain form
8049 31529 23261 6612 19866 18461 15113 6108 6265 16727 18398 -88 -19070 -14193 10279
8036 10279 26352 19747 18299 24588 18982 13727 9781 -12708 -17892 -9875 -861 5430 16195 14450
8022 14450 5479 19283 32077 27836 21688 11727 22253 11911 -10914 -5887 8918 11622 24169
8009 24169 25554 30710 25057 38385 45373 25546 20642 34551 39200 27441 39293 50645 48203
7996 48203 58162 65047 72580 92698 81981 52168 36689 29738 47543 62235 56064 42729 37908
7983 37908 54260 67732 71964 60947 49589 37933 10749 2524 20686 16694 8972 3572 -8542
7970 -8542 -3825 -1146 -4805 3619 11181 14491 17570 32127 55280 68810 60935 51278 46175 29438
7956 29438 19267 26530 38527 50901 52684 50125 54177 57820 57059 63295 63048 65254 39207 12286
7942A2286o40J1633J1270m715o091L460m285j4177N677j1429n071L444P87j241
7928I08L794R142n293j2827m876l975K0141P141k059k077j3159k622P705R555
7914A1498O737j8767K34J3550j0464J603Q428J7777J1327p809j3126r580p990
7901C418K1311R167k222q293k579K841r496L653k605j2574j50J9157p134k112
7887A2382j0606m038J5753N937n529j4121j1130k185j709Q049Q481k015o672K245
7873e158n643L425m369O20R512k251L812O735o465j3404J6027J643p032j88P46
7858a990N11k09j0075J3526l654m612l704r26k889K122K740k403Q600J6071n997
7843G111r425P108Q498l861p507R682l89O253j0535q269M075J8978j2503j7993
$$ plain form
7942 12286 11646 23279 34549 29834 23743 27203 22918 8741 14418 2989 -2082 1362 2149 908
7928 908 4702 13844 8551 -4276 -9152 -13127 7014 14155 12096 10019 -3140 -5762 1943 11498
7914 11498 18235 -532 -298 13252 2788 4391 12819 30596 41923 34114 20988 11408 3418
7901 3418 24729 33896 31674 23381 20802 23643 14147 17800 15195 2621 2471 21628 14494 12382
7887 12382 1776 -2262 13491 19428 13899 -222 -11352 -13537 -15246 -7197 1284 -731 -7403 -5158
7873 -5158 -10801 -7376 -11745 -11125 -1613 -3864 -52 6683 218 -13186 2841 4484 -2548 -2736 -1990
7858 -1990 -1479 -1688 -11763 1763 -1891 -6503 -10207 -11133 -14022 -11900 -9160 -11563 -2963 13108 7111
7843 7111 -2314 4794 13292 9431 1924 11606 11217 17470 6935 -1334 2741 21719 9216 -8777
7829h777o53K658P323Q085Q493M014L939L782j0641j4114J090j1447m521n78J725
7814i622M617O839j590o098j4656L075m190K167J2103L91J5276R804j307j5509
7800A300k4583J9937K1382J210n739j6245o601O602O990j5310k1222m111J98O931
7786b9261O756N778N222P55J547N183j0372n579k988p843J1569M556k090Q142
7772h625J078m563M050q344r893L909J3146J8508j0142Q51j0095o026m769j1556
7758c2471J7903J1699L860K859P57j9086r250J771j2439l521R878J4115L733m906
7744a5098n555Q821l835m398J3754L599j1348L299r650J1243J1013R462J610j0638
7730B279n458j0853m906O9O104k91L404K3464j521j1431j4635j0239J3752K1056
$$ plain form
7829 -8777 -9430 -6772 551 8636 17129 21143 25082 28864 18223 4109 5199 -6248 -10769 -11347 -9622
7814 -9622 -5005 1834 244 -5854 -20510 -17435 -21625 -19458 -7355 -6964 8312 18116 16809 1300
7800 1300 -23283 -3346 18036 19246 13507 -2738 -9339 -2737 4253 -11057 -32279 -36390 -36192 -29261
7786 -29261 -22505 -16727 -11505 -10750 -9203 -4020 -14392 -19971 -22959 -30802 -19233 -14677 -16767 -8625
7772 -8625 -7547 -12110 -8060 -16404 -26297 -22388 -9242 9266 -876 -25 -10120 -16146 -20915 -32471
7758 -32471 -14568 -2869 991 3850 4607 -14479 -23729 -21958 -34397 -37918 -28040 -13925 -10192 -15098
7744 -15098 -20653 -11832 -15667 -20065 -6311 -2712 -14060 -10761 -20411 -9168 1845 11307 12917 2279
7730 2279 -3179 -14032 -18938 -18869 -12765 -13056 -9652 13812 12291 860 -13775 -24014 -10262 10794
7716A0794J847j6939n768K809M804N67M447k088j76j0096p276q665R642J5962
7702a36R734k946L396j4204q235R295j69J0468J5229o325j2630j4376r088L685
7688a6302J36J8632P797k7311j8225p07J1373J5772N201K993R224R073L885O086
7674B7627j0831q774k2794j1630J547P172N782P735J1363m897j3071R501J3411
7661A2141J279n430j2058j0272J493J1217L836m234o874j1225l448M367P957K969
7647h282l504L280l225n423Q374J0355j4558j4396J3091L574r193J0013J4563
7634D669j915M66J865o95J926j4382K1120J0181k3964r889j4940j983n215K0934
7620a1822L946j1335M971J3838j743p612m830o227J0305L397J365m342l519K610
$$ plain form
7716 10794 12641 -4298 -10066 -7257 -2453 -1886 2561 473 297 -9799 -17075 -25740 -16098 -136
7702 -136 9598 6652 10048 -4156 -12391 -3096 -3265 7203 22432 16107 3477 -10899 -19987 -16302
7688 -16302 -16166 2466 10263 -17048 -35273 -35980 -24607 -8835 -3634 -641 8583 17656 21541 27627
7674 27627 16796 8022 -14772 -26402 -24855 -17683 -11901 -4166 7197 2300 -10771 -1270 12141
7661 12141 13420 7990 -4068 -14340 -12847 -1630 2206 -2028 -8902 -20127 -23575 -19208 -11251 -8282
7647 -8282 -11786 -8506 -11731 -17154 -8780 1575 -12983 -27379 -14288 -10714 -19907 -9894 4669
7634 4669 2754 3220 5085 4390 6316 -8066 13054 23235 -729 -10618 -25558 -27541 -32756 -11822
7620 -11822 -7876 -19211 -14240 -402 -2145 -9757 -14587 -20814 -10509 -7112 -5747 -10089 -13608 -10998
7606a0998l69r556n147k390K161K2520Q010n284N730K628K831rk958j1617o275
7591a0723J254k0666k726J7265J0749K080p916R776K369j1076j0484L850J5912
7578c36J521K179N294J388j3236j3550J5011J2565j882p321o04J1100j4072j9421
7564b1364n503M805Q677J34P628r213J3572J0487J766n06J0201J018j3330j2061
7550c689N473M914q534j3763m907J6703Q748P786o617j9310O9K4900P300j9642
7536e69J302K325J0031M483n969j0832n039j2083N297k024P583O038l350n390
7522h197j0009O686q476L34M067Q942K1028p43j1445r245J2510J26r393j1668
7508a5483K413K928K720L090p451J1899P430m716r538l372j2548K448P439M557
$$ plain form
7606 -10998 -11367 -20923 -26070 -28460 -26299 -3779 4231 -1053 4677 7305 10136 10127 7169 -4448 -10723
7591 -10723 -9469 -30135 -32861 -15596 -4847 -2767 -10683 -907 1462 -9614 -20098 -16248 -336
7578 -336 1185 3364 8658 10046 -3190 -16740 -1729 10836 8954 1633 1029 12129 -1943 -21364
7564 -21364 -26867 -22062 -13385 -13251 -5623 -14836 -1264 9223 10989 10483 20684 21702 8372 -3689
7550 -3689 1784 6698 -1836 -15599 -20506 -3803 4945 12731 6114 -13196 -13127 11773 19073 -569
7536 -569 733 3058 13089 17572 11603 771 -4268 -16351 -11054 -13078 -5495 543 -2807 -8197
7522 -8197 -18206 -11520 -19996 -19662 -15595 -6653 14375 13632 2187 -7058 5452 5578 -3815 -15483
7508 -15483 -13070 -10142 -7422 -4332 -11783 116 7546 2830 -6708 -10080 -22628 -20180 -12741 -8184
7494h184P267P409O28j6433r227m029p91Q82N581L763p49L588P839j2931L46m030
7478a9071l385J6954K4886j202k3030k3979n693L858O185J4571J1378J1170j2443
7465A99k2111l979J1834R070K43k923j6030N675J4923Q988k722q329j2286j252
7451a8700P79J6686M647J25O850j1665q39j4084q591R167Q289J3901o390o649
7437f474L779R186J109r454j224j0984n662L715n097K448J6354P620o004r723
7423a0411J376m377p503k372M627L065K198L441j731q2O94j9259n977M562O182
7408b5567M180J8432n155j4487R314J8924j085l929J848J637P25o917M791J0128
7394A2839p866m115p959N058L375L421j1111j3285j716J2477m150L091O699p890
$$ plain form
7494 -8184 -917 6492 7120 -9313 -18540 -22569 -23360 -22478 -16897 -13134 -13883 -10295 -2456 -15387 -15041 -19071
7478 -19071 -22456 -5502 19384 18182 -4848 -28827 -34520 -30662 -24477 -9906 1472 12642 199
7465 199 -21912 -25891 -14057 -4987 -4744 -7667 -23697 -18022 -3099 5889 3167 -5162 -17448 -18700
7451 -18700 -17921 -1235 3412 3537 10387 -1278 -2117 -16201 -24792 -15625 -7336 6565 175 -6474
7437 -6474 -2695 6491 7600 -1854 -3078 -14062 -19724 -16009 -21106 -18658 -2304 5316 -688 -10411
7423 -10411 -9035 -13412 -20915 -23287 -18660 -15595 -13397 -9956 -11687 -11769 -11075 -30334 -36311 -31749 -25567
7408 -25567 -21387 -2955 -8110 -22597 -13283 5641 4556 627 2475 4112 4837 -2080 2711 12839
7394 12839 4973 858 -7101 -2043 1332 4753 -6358 -19643 -21359 -8882 -13032 -9941 -3242 -11132
7380a1132j2659N217M304j0221O537K3371J9487N962j7943o455J31J1698R71J02
7366A9370L119j5998j4764J0263m843k1265jQ017m80K236m627j2586j936J1598
7352b1897J2210m802L766J5170K904k965Q985l146p056j0652l231P44L739K706
7338c525J2061J7134J6j5647j1800m695M50J359n110L274Q233K318j246M588L40
7323G750L403J1184q120j3091m779R437P566j352J772J523J252r337j2004L082
7309a714M606J1150q204j5061r514L532L30J2898o623j4143j4944R98J0356J9297
7295g036J4982n52r006M621P553l733L185p481O680O806j2059k209K1813n66j8648
7280D350M70J2024J739J4162R642n000k9900j9050J2676j2078p187J0950k531
$$ plain form
7380 -11132 -23791 -18574 -14270 -24491 -17954 5417 24904 30866 12923 6468 6599 18297 19268 19370
7366 19370 22489 6491 -8273 1990 -2853 -24118 -24119 -16102 -16582 -14346 -18973 -31559 -33495 -21897
7352 -21897 -9687 -14489 -10723 4447 7351 4386 13371 10225 3169 -7483 -10714 -9970 -6231 -3525
7338 -3525 8536 25670 25686 10039 -1761 -6456 -6006 -4647 -9757 -6483 1750 4068 2822 7410 7750
7323 7750 11153 22337 14217 1126 -3653 5784 13350 11998 13770 15293 16545 7208 -4796 -1714
7309 -1714 2892 14042 5838 -9223 -18737 -15205 -14875 -1977 -8600 -22743 -37687 -36689 -26333 -7036
7295 -7036 7946 7394 -1612 3009 10562 6829 10014 2533 9213 16019 3960 1751 23564 22998 4350
7280 4350 4820 16844 18583 32745 42387 37387 7487 -11563 1113 -10965 -18152 -7202 -9733
7267i733k0994r824L693J4487J8741m55o47R118M724L642o562O716k965j6074
7253f133j5818J6252Q832K324J0020K116o015k1755r785J5976J9977J0606n712
7240B0885j098j3405j124R439O755N770Q144p979q778p448j0826j2028p472p087
7226b6252K393N096J0578Q160j8348j3160J0944o968M146Q053l902K206j649j7293
7212c5996Q574k853P22J0888J7280j850j1969K703j240j3241J2622O180Q977J128
7198A925n774J151J636N816Q074k250j7260j1682J0472J3317J301o233k7q819
7184h353j0132K068P123J3026J5159m194j210j612j0700m042o252l453L110p643
7170a7105P14J3892L255J0314O652j4665r274K980L921M386l76J3260p024j4559
$$ plain form
7267 -9733 -30727 -40551 -36858 -22371 -3630 -4085 -4732 4386 9110 12752 6190 12906 9941 -6133
7253 -6133 -21951 -5699 3133 5457 15477 17593 11578 -10177 -19962 -3986 15991 26597 20885
7240 20885 19787 6382 5258 14697 21452 27222 35366 27387 18609 11161 335 -11693 -19165 -26252
7226 -26252 -23859 -18763 -8185 -25 -18373 -31533 -20589 -27557 -23411 -15358 -19260 -17054 -18703 -35996
7212 -35996 -27422 -30275 -29553 -18665 -1385 -3235 -15204 -12501 -13741 -26982 -14360 -8180 797 1925
7198 1925 -3849 -2698 -1062 4754 12828 10578 -6682 -18364 -7892 5425 6726 493 466 -8353
7184 -8353 -18485 -16417 -9294 3732 18891 14697 13487 11875 1175 -2867 -9119 -12572 -9462 -17105
7170 -17105 -16391 -2499 756 11070 17722 3057 -6217 -3237 684 5070 4694 17954 10930 -3629
7156c629r570J3732P462k100K547J7522K091j4143n471K426O609m823p457n480
7142b84N157j0850q605m132O41l994n591M987j66J236Q824K740J2571M839L265
7127A0638k129j0186O79j4726J222J1454j714N873R507m252N133j214Q10n440
7113E655j1412j1303n989R058M091N793p440J2694k199l88O750j261j588n733
7099c272m230j0347J1393L805j0413J682J899L543J3466J9178J2848j3280j3892
7086A2380j0241n298j697L044j0036j5835J9872q66j7215O971m74j1882j1220
7073d2497J3151J5958R697J3800Q60q185l056n821o227j1051K776J7781J907k035
7059b942m828n891J4855J2624m097r109q81nL827O807j0089r696J2p663M426J5870
$$ plain form
7156 -3629 -13199 533 7995 5895 8442 25964 28055 13912 8441 10867 17476 12653 5196 -284
7142 -284 4873 -5977 -14582 -18714 -18073 -22067 -27658 -22671 -22837 -21601 -12777 -10037 2534 7373 10638
7127 10638 8509 -1677 -998 -15724 -14502 -3048 -4762 1111 10618 6366 11499 10285 11095 5655
7113 5655 -5757 -17060 -23049 -13991 -9900 -4107 -11547 1147 -1052 -1440 5310 4049 2461 -3272
7099 -3272 -7502 -17849 -6456 -2651 -13064 -11382 -9483 -5940 7526 26704 39552 26272 12380
7086 12380 2139 -3159 -4856 -1812 -11848 -27683 -7811 -8677 -25892 -18921 -19395 -31277 -42497
7073 -42497 -29346 -13388 -3691 10109 10969 2784 -272 -6093 -12320 -23371 -20595 -2814 -907 -2942
7059 -2942 -7770 -13661 1194 13818 9721 612 -269 -274 3553 10360 271 -9425 -9413 -17076 -12650 3220
7043C220N827J2643m028j5113j7495k626J0507J1437M868P7j8467n464J500N806
7029g308O266J4205M512r275p383J3365J0792j93j0765k823j0403J738o509j4820
7015a8601K250L552l614J1759q888J1581J1179N286J2955k6184j1606O359R937
7002E965J0423J301o869o933j1602Q69j750O151j3935m762L622o449M402Q398
6988a1169J177J722L258K3050N98j4754l150q58N577Q946l135m330J973o997M159
6973F067P42j3130m238m993k089o260l303J2982J2253Q776m677r771o768j105
6959a5514J5646O633J8224K970j4881o412N459O473m709N696k4492j6783j0022
6946c1712J2868J7947m652k179L211J6465P4j9052m762O839K143j1581o305J2350
$$ plain form
7043 3220 9047 21690 17662 2549 -14946 -17572 -7065 4372 9240 9317 -9150 -14614 -13114 -7308
7029 -7308 -1042 13163 17675 8400 1017 14382 25174 24981 14216 11393 990 2728 -3781 -18601
7015 -18601 -16351 -12799 -16413 -4654 -13542 -1961 9218 14504 27459 1275 -10331 -3972 5965
7002 5965 16388 17689 10820 3887 -7715 -6846 -8596 -2445 -16380 -21142 -17520 -23969 -19567 -11169
6988 -11169 -9992 -8270 -5012 18038 18636 3882 732 -126 5451 14397 11262 6932 8905 1908 6067
6973 6067 6809 -6321 -10559 -15552 -17641 -23901 -27204 -14222 -1969 6807 2130 -7641 -14409 -15514
6959 -15514 132 6765 24989 27959 13078 6666 12125 18598 13889 19585 -4907 -21690 -31712
6946 -31712 -18844 -897 -5549 -7728 -4517 11948 12022 -7030 -11792 -4953 -2810 -14391 -20696 -8346
6932h346R789o79J660P322K950o471j0527M96q500M815J836J2523K984P798m491
6917A3159j3782m983O390J209l336r444J38J2786j3154M126j5429K367K3265q83
6903B429o299j6320j4387J1732k348J1661J9574j0014j6051N414O985j0871L320
6890a5175N359n344j2266J1038J6042P652j8569k173P626o768k685R513J6160
6877A0410O930r172q911J533m332q966K816Q463q706L518K863j6069j2095O522
6863b5196J5286O468O588q505L67p038J8059J5771k233M632q712L328J7133j924
6849C4024k6052o777j3077j1432q470J7067J0123J2867N214r507j4494j1974p309
6836b9797J0417J3150m601P743l63q959q946j17k663q253o857N668J5985J4095
$$ plain form
6932 -8346 1443 764 2424 9746 12696 6225 -4302 -3806 -12306 -7491 -5655 6868 9852 17650 13159
6917 13159 -623 -5606 784 1993 -1343 -10787 -10649 2137 -11017 -6891 -22320 -19953 3312 2429
6903 2429 -3870 -20190 -34577 -22845 -25193 -13532 6042 -3972 -20023 -14609 -7624 -18495 -15175
6890 -15175 -9816 -15160 -27426 -16388 -346 7306 -11263 -13436 -5810 -12578 -15263 -5750 10410
6877 10410 17340 8168 -743 790 -3542 -12508 -9692 -1229 -9935 -6417 -3554 -19623 -31718 -25196
6863 -25196 -9910 -3442 3146 -5359 -4992 -12030 6029 21800 19567 24199 15487 18815 35948 34024
6849 34024 7972 1195 -11882 -23314 -31784 -14717 -4594 8273 13487 3980 -10514 -22488 -29797
6836 -29797 -19380 -6230 -10831 -3088 -3451 -12410 -21356 -21473 -24136 -32389 -39246 -33578 -17593 -3498
6822c498P350O072J370J1505n463j2907o278q226J4565K5658r421j6179R479n181
6808H846q808J1480R722j0468j9257p377J690N499R721J0106n518M393k0894j1303
6794b2168R956Q774k183j0167j1900P296P054P553j2949J87K95R843k043k2175
6780c2627q330J4871K3644P8P679o988J387M901k673L211L716r179j2585J1186
6766a709K399R088j3197j2470J1208R298k985n002l720r409L858Q745L604R533
6752I241L964p769J224n485K495K714M48J722j073j2787j049N695r432r060P547
6737a1605o633r298L052J2276P461J1065J783K457K091J467j966p91l172J508
6723I695K326o566r163l270L076J2218M172o343j5313N44K753J124O321k1092
$$ plain form
6822 -3498 3852 9924 11294 22799 17336 4429 -1849 -10075 4490 30148 20727 4548 14027 8846
6808 8846 38 11518 21240 10772 -8485 -15862 -14172 -8673 1048 11154 5636 10029 -10865 -22168
6794 -22168 -12212 -3438 -5621 -15788 -27688 -20392 -13338 -5785 -18734 -18547 -18252 -8409 -10452 -32627
6780 -32627 -40957 -26086 -2442 -2364 5315 -1673 -286 4615 1942 5153 8869 -310 -12895 -1709
6766 -1709 690 9778 -3419 -15889 -4681 4617 1632 -3370 -7090 -16499 -12641 -3896 -292 9241
6752 9241 13205 5436 6660 1175 3670 6384 6832 8554 7481 -5306 -6355 -660 -10092 -19152 -11605
6737 -11605 -18238 -27536 -24484 -12208 -4747 6318 8101 10558 12649 14116 12150 11359 8187 9695
6723 9695 12021 5455 -3708 -6978 -3902 8316 12488 6145 -9168 -8624 -5871 -4747 1574 -19518
6709a9518m812m17L60Q068J7289K05k554j5519j0115O323Q440j733M966L539K627
6694b851J1793l632k1151L223r895l578K80R776J5720k460p697J020n008l329
6680a7789R588J1792q240o536L306o693O686J1614j595j2649m71J5046L877j9559
6666a1623L810k265L16J2596J0091k606o826l630O701Q108k427q4j0188k623R048
6651H398n668j8204R347J1643J2108J2687n956j4497p09R073K519j0687j9478
6638i424L303P858n90J1138k460N208L104j7856k002j2549l948L806J2674J099
6624f39j2571k2124P446J8781o05O23l032R602J6820k648n813q858n871O195m55
6609c149j4220J898K4946J0311L56k0679q271Q236L622O130q196o58O39j0174
$$ plain form
6709 -19518 -24330 -24747 -24387 -16319 970 1175 -1379 -16898 -27013 -20690 -12250 -13983 -9017 -5478 -2851
6694 -2851 8942 5310 -15841 -12618 -22513 -26091 -25811 -16035 -315 -2775 -10472 -9452 -14460 -17789
6680 -17789 -8201 3591 -4649 -11185 -7879 -14572 -7886 3728 2133 -10516 -10987 4059 7936 -11623
6666 -11623 -7813 -10078 -9762 2834 12925 10319 3493 -137 6564 14672 12245 12161 1973 -650 8398
6651 8398 2730 -15474 -6127 5516 17624 30311 24355 9858 9149 18222 20741 10054 -9424
6638 -9424 -6121 1737 1147 12285 9825 15033 18137 281 -1721 -14270 -18218 -14412 -1738 -639
6624 -639 -13210 -35334 -27888 -9107 -9712 -9089 -12121 -2519 14301 11653 5840 -3018 -8889 -2694 -3149
6609 -3149 -17369 -15471 9475 19786 20142 -537 -8808 -572 3050 9180 984 326 965 -9209
6595i209o275n973O403R965O191N981k416Q17p230k1535N74O324r303k931n227
6580c3844q730K4150J2685J407J1794J3076m202j0572L309p364M030n39n952j1553
6566a2305Q346R468K777r401p067k593k163J4157J2713k710O747J2524o145j0984
6552A3364r989n356m33r45j952p241n143k386K332Q642j1424o644Q475K1843P393
6537A0536M94n990l416J135m048J8654J1514j0985k798r447p759j1618O556k528
6523i700r756J624K517O040J0214L814j6163n234M550o7Q30K580q65o259J157
6508a4718J292K191N364l631k369N141J0685J3977j8358k4388p806M939R475J2519
6494e687L985M053Q48p133j863j2107o601J1831J0838K035j717L355m819p559
$$ plain form
6595 -9209 -15484 -21457 -15054 -5089 1102 7083 4667 5484 -1746 -23281 -22707 -16383 -25686 -28617 -33844
6580 -33844 -42574 -18424 -5739 -4332 7462 20538 16336 5764 9073 1709 5739 5200 -752 -12305
6566 -12305 -3959 5509 8286 -1115 -8182 -10775 -12938 1219 13932 11222 17969 30493 24348 13364
6552 13364 3375 -1981 -2414 -3359 -5311 -12552 -17695 -20081 -17749 -9107 -20531 -27175 -18700 3143 10536
6537 10536 11030 5040 1624 2759 -1289 17365 28879 17894 15096 5649 -2110 -13728 -7172 -9700
6523 -9700 -19456 -17832 -15315 -9275 939 4753 -11410 -16644 -12094 -12161 -11331 -8751 -9616 -15875 -14718
6508 -14718 -13426 -11235 -5871 -9502 -11871 -6730 3955 17932 -426 -24814 -32620 -27681 -18206 -5687
6494 -5687 -1702 2351 3199 -3934 -5797 -17904 -24505 -12674 -1836 199 -1518 1837 -2982 -10541
6480a0541P378o044j5945Q134J3244O309q475m381P03n281N954k179L336L423
6466d365m094n659P311K593J0433k753L909l93p982K865Q199K443L544j4245n233
6451c427r803L686J29M825l566N180R885l246n405j2101j5685O76K244J9349r887
6436a7146j3836J735J5481J522J2129Q355J0777n044j3060j7056l639M524Q310
6423f948P070N748o69R680o538j2027J3104J5626m229j3585j2727j8832j727k43
6409b6297o014J3031K4547L502j2365o126m552n174q671J4992J2070N561j740
6396B764M006p507O490k056r977j9988Q56J2159Q613P757n438l430L472J492J0641
6381I854n024r788M716l78P038J1149K23j6783j5782J5905J3920o346r696j052
$$ plain form
6480 -10541 -3163 -9207 -25152 -17018 -3774 2535 -5940 -10321 -9618 -14899 -8945 -11124 -7788 -4365
6466 -4365 -8459 -14118 -6807 -4214 6219 3466 7375 6982 -1000 1865 10064 12507 16051 1806 -3427
6451 -3427 -13230 -9544 -9415 -4590 -8156 -2976 6909 3663 -1742 -13843 -29528 -28852 -26608 -7259 -17146
6436 -17146 -30982 -29247 -13766 -12244 -115 8240 19017 13973 913 -16143 -19782 -15258 -6948
6423 -6948 122 5870 5201 14881 8343 -3684 9420 25046 20817 7232 -5495 -24327 -26054 -26297
6409 -26297 -32311 -19280 5267 8769 -3596 -9722 -14274 -19448 -28119 -13127 -1057 4504 2764
6396 2764 6770 -737 5753 3697 -6280 -26268 -25412 -13253 -4640 3117 -2321 -5751 -2279 -787 9854
6381 9854 4830 -4958 -242 -620 6418 17567 17790 1007 -14775 1130 15050 8704 -992 -2044
6367b044O169n798l518J2296Q083p966r92M149J474M923N396j0074j6226o249
6353a0377O730K0050p132j4936J259q29J4092M356r098o669m179j5833K225J0469
6339i872N631N99N89K023k831J3589O518l061j4358m733q0J3464J0799q003j6989
6324f715r45Q465O374K155j958K808J0624j442k4725l389P240J3643q279j2680
6310h824l89Q454J1142J3622j973j2364m449N102j890r138j2774O08J2618j136
6296a391q93O672j997j3373r342j394l406P028K0240J1707K88j793q141j2618
6282h413M10q808J3630Q585j2993o561p275K435n185J1519o724q85L027R597M497
6267c144q210J2189P121O21l373p806l784m199l80j0808j0266j2210q56L213k349
$$ plain form
6367 -2044 4125 -1673 -5191 7105 15188 7222 6230 10379 11853 16776 22172 12098 -4128 -10377
6353 -10377 -3647 16403 9271 -5665 -4406 -5235 8857 13213 4115 -2554 -6733 -22566 -20341 -9872
6339 -9872 -4241 -3642 -3053 -1030 -3861 9728 16246 13185 -1173 -5906 -5986 7478 18277 10274 -6715
6324 -6715 -7660 805 7179 9334 7376 10184 20808 19366 -5359 -8748 -1508 12135 3856 -8824
6310 -8824 -9213 -759 10383 24005 22032 9668 5219 10321 8431 -707 -13481 -12873 -255 -1391
6296 -1391 -2284 4388 2391 -10982 -20324 -21718 -25124 -18096 2144 13851 14139 12346 4205 -8413
6282 -8413 -8003 -16811 -3181 5404 -7589 -14150 -21425 -18990 -24175 -12656 -19380 -20265 -17238 -7641 -3144
6267 -3144 -11354 835 7956 8577 5204 -2602 -6386 -10585 -10965 -21773 -32039 -44249 -45105 -41892 -44241
6252d4241R400J8703L781N65J655r331m935r92K767R216J0302M903j723M587k926
6237A731o021L04N550j243K153k94j2856p86k0174J777N722J408Q813m63J071
6222a3308J6050n237r830K851J1910M426m569j599N825N153j1171k4307m399K6223
6208a982Q189K999K558l585n28M163n080J030R894l891K644P725L005K876j4891
6193A5126o968j1379p475J6286Q289j1259k087J7403k987j18Q944O633j0578q126
6179A1704M262n987m259L616j152p757M314Q685J801M85j755j1483l175Q94k179
6164a986Q383J018O31m065J297m788N633O834j786j3486o921j0248j370j811o35
6149b3300J3069m859J0724J4017J7107j2923o764j2386o115q194R872J6069l809
$$ plain form
6252 -44241 -34841 -16138 -12357 -11792 -10137 -19468 -24403 -25395 -22628 -13412 -3110 1793 70 4657 1731
6237 1731 -4290 -3986 1564 321 2474 2180 -10676 -11462 -31636 -29859 -24137 -22729 -13916 -14379 -13308
6222 -13308 2742 -2495 -12325 -9474 2436 6862 2293 694 6519 11672 501 -23806 -28205 -1982
6208 -1982 6207 9206 11764 8179 7651 11814 6734 7764 17658 13767 16411 24136 27141 30017 15126
6193 15126 8158 -3221 -10696 5590 13879 2620 533 17936 14949 14831 23775 30408 19830 11704
6179 11704 15966 9979 5720 9336 8184 427 4741 13426 15227 15712 13957 2474 -701 193 -1986
6164 -1986 6397 7415 8046 3981 5278 490 6123 12957 11171 -2315 -9236 -19484 -20854 -22665 -23300
6149 -23300 -10231 -15090 -4366 9651 26758 13835 7071 -5315 -11430 -19624 -9752 6317 2508
6136B508j4031O06R125m534K834J6835J0146o235l716M292j1205o876R945N289
6122A4983p991j6561l89K1571R386J262K738n794j0926K371M071j317n001k315
6108F088P433j3819q642p53j59k410K271Q684k296M16J2919j2570j4750K129J0177
6093e282L504o660M933l542j214R374K3702l018j5357j0029k033n730P89j050
6079a1613K513Q857P522N29n813j5833K620J990N479K864J016l387M670P731o562
6064B583j0661r036k894J1368Q776J2159o577j3995j9832J1448J6924P264k51
6051G276k27k3155o135Q142r17P497M237j3411J986M383J0085L018m780N012J1260
6036A4271K652j8223j5813k747J3177J5615J933q570j845K790M933m600l029K1266
$$ plain form
6136 2508 -11523 -10917 -1792 -6326 -3492 13343 23489 17254 13538 17830 6625 -251 9694 14983
6122 14983 6992 -9569 -9958 11613 20999 22261 24999 19205 8279 10650 14721 13404 8403 6088
6108 6088 13521 -298 -8940 -9693 -9852 -12262 -9991 -1307 -3603 -3187 9732 -2838 -17588 -15459 -5282
6093 -5282 -1778 -8438 -3505 -7047 -8261 1113 24815 21797 6440 -3589 -5622 -11352 -10563 -11613
6079 -11613 -9100 -243 7279 7808 1995 -13838 -11218 -9228 -3749 -885 131 -3256 1414 9145 2583
6064 2583 -8078 -17114 -20008 -8640 136 12295 5718 -8277 -28109 -16661 263 7527 7276
6051 7276 7049 -16106 -22241 -14099 -15016 -7519 -3282 -16693 -14707 -10324 -239 2779 -2001 3011 14271
6036 14271 16923 -1300 -17113 -19860 -6683 8932 10865 2295 450 3240 8173 3573 544 21810
6022B1810Q34j5306j3615o717n109J0993k639k342k414O933K584j829p277R54
6008a3140Q171Q687l694l991j215P204M568j6034r505K112j2332K105Q427r003
5994b7640Q460J2185J2438j8535q321J3178k577j4087R696N682N082L928k834
5981c345m776k682J0455J0009j64m174O338j5472p032j2221m061J896P261J0995
5967f973m651n80J6354k082o308J174l191J222p622j8647j246Q213K809P179O253
5952h096j1449m905J1462L2N572Q456N777M83L94l293l131j476j3789l252J5978
5937a237n236k967J0649R240j566r895o714n616O266J4287o006R11O52n292r494
5922a2018q25J933j505j0031j2865M660J4887J2990J9784k112j8564j0039O733
$$ plain form
6022 21810 22644 7338 -6277 -12994 -18103 -7110 -9749 -12091 -14505 -7572 -4988 -6817 -14094 -13140
6008 -13140 -4969 3718 24 -3967 -5182 2022 6590 -9444 -18949 -16837 -29169 -27064 -18637 -27640
5994 -27640 -19180 -6995 5443 -13092 -21413 -8235 -10812 -24899 -15203 -9521 -4439 -511 -3345
5981 -3345 -8121 -10803 -348 9661 9497 5323 11661 -3811 -10843 -23064 -27125 -25229 -17968 -6973
5967 -6973 -11624 -12204 4150 2068 -4240 -3066 -6257 -5035 -12657 -31304 -32550 -24337 -21528 -14349 -8096
5952 -8096 -19545 -24450 -12988 -12956 -7384 1072 6849 7332 7726 4433 1302 -174 -13963 -17215 -1237
5937 -1237 -6473 -9440 1209 10449 8883 -1012 -7726 -13342 -7076 7211 1205 2116 2768 -2524 -12018
5922 -12018 -12843 -10910 -12415 -22446 -35311 -30651 -15764 -2774 17010 14898 -3666 -13705 -6972
5909f972J233R484O965O225N541j9688r844M146n564O844o218o296N66J1003M03
5894b172p323J1101R950N994l395j3923j498l321k0990n677P493J1858L315R45
5880g643j0095p324J4151Q320L912o930N146J6937n617p356J2975l924k578n506
5866D468j328O2K537k5792O912J750r696R241J4661j1428j4019N153J4584q943
5852a1838N772O514J9071p117l581k556j7567j1175J6276R818j1213K189J801
5839c606O410P232o561j6434L128o345L566K186o025Q711M272m143j4487n853
5825b7949Q414J5310k713K025N557q277O823o823o349Q122K6008J92r022J1732
5811B3050l648k873m746j1986j9096J254m677N198n101K0909O813j0560j0695
$$ plain form
5909 -6972 -5739 3745 10710 16935 22476 2788 -7056 -2910 -8474 -1630 -7848 -14144 -13578 -2575 -2172
5894 -2172 -9495 1606 11556 17550 14155 232 -1266 -4587 -25577 -31254 -23761 -11903 -8588 -7643
5880 -7643 -17738 -25062 -10911 -2591 1321 -5609 -463 16474 10857 3501 16476 12552 9974 4468
5866 4468 3140 3202 5739 -20053 -13141 -11391 -21087 -11846 2815 -8613 -22632 -17479 -2895 -11838
5852 -11838 -6066 448 19519 12402 8821 6265 -11302 -22477 -6201 3617 -7596 -5407 -3606
5839 -3606 2804 10036 3475 -12959 -9831 -16176 -12610 -10424 -16449 -7738 -3466 -7609 -22096 -27949
5825 -27949 -19535 -4225 -6938 -4913 644 -7633 -810 -7633 -13982 -5860 20148 20340 11318 23050
5811 23050 19402 16529 11783 -203 -19299 -18045 -22722 -17524 -22625 -1716 5097 -5463 -16158
5798a6158l713M296k131Q335O874j039J2537j074j5496L983J6035K006J2702n259
5784B1898j8446l656J4617J425r352j7156J409q011O892O179J2791j074l728J6644
5770B0432P954n142o435m123o626m12P779K342J517j3837l675r365l893J8277
5756D793J0466K880m964q729m955k594p36L811n293Q085P07m250j593J193o730
5741g909K374n376J071J0248r19q42O608P58J705j3424j8330O375O471J5385O126
5726A0321j0542j4668K288R187N852r074J7266N49j7710R071J0468j2032P283
5713H259O354q582j1246j2830N91J0907O443Q588q591m361J1221J561K270n249
5699E335r302o012j8709o551K62O064J542J4062J0153J181r943k515j9073j0865
$$ plain form
5798 -16158 -19871 -15575 -17706 -9371 -2497 -3536 9001 7927 -7569 -3586 12449 14455 27157 21898
5784 21898 3452 -204 14413 15838 6486 -10670 -9261 -17272 -10380 -4201 8590 7516 3788 20432
5770 20432 28386 23244 16809 12686 6060 5648 13427 15769 17286 3449 -226 -9591 -13484 4793
5756 4793 15259 18139 13175 4446 -509 -3103 -3839 -28 -5321 2764 3471 -779 -2372 -1179 -7909
5741 -7909 -5535 -10911 -9840 408 -511 -1353 5255 6013 7718 -5706 -24036 -17661 -11190 4195 10321
5726 10321 -221 -14889 -12601 -3414 2438 -6636 10630 11179 -6531 2540 13008 976 8259
5713 8259 14613 6031 -5215 -18045 -17454 -6547 -104 8484 -107 -4468 6753 8314 10584 5335
5699 5335 -3967 -9979 -28688 -35239 -34977 -28913 -27371 -13309 -3156 -1975 -11918 -14433 -33506 -44371
5685d4371J5620J4793n813m156J284J6448P532L093j796j8855P065j408J715r5
5671h944j78j3291p603K4333P256r356R243o441j2948Q322J0233J2352k521Q133
5657A8590j0783j4509K131l59o336K432N762O660R329q658r646o600L924O11P929
5642D77O287M190J0623r711q025P791j6226J6712r355k0089k740J9863J4070k238
5628A1629k1169j1932P131O066R853q91m760J0597j0262J371L212N17Q613J3284
5614B3259o230j6113m274l088R142r715j449O074Q455k50J905p972p505j5388
5600b3149n393J1070O559Q958L4086K343j3480j0286j2585J5238J7759K743N62
5587C4425J71m896k1887j2273O398P264l048j958j1068j9594L123K1179L68O382
$$ plain form
5685 -44371 -28751 -13958 -19771 -23927 -22643 -6195 1337 4430 2634 -16221 -9156 -10564 -8849 -8944
5671 -8944 -9122 -22413 -30016 -5683 1573 -7783 1460 -4981 -17929 -9607 626 12978 10457 18590
5657 18590 7807 -6702 -4571 -4930 -11266 -8834 -3072 3588 12917 4259 -5387 -11987 -8063 -7452 477
5642 477 6764 10954 21577 11866 3841 11632 -4594 12118 2763 -17326 -20066 -203 13867 11629
5628 11629 -9540 -21472 -14341 -8275 1578 687 -4073 6524 -3738 -2367 845 1362 9975 23259
5614 23259 17029 916 -3358 -6446 2696 -7019 -8468 -2394 6061 5811 7716 -256 -7761 -23149
5600 -23149 -28542 -17472 -10913 -1955 32131 34474 20994 10708 -1877 13361 31120 33863 34425
5587 34425 34596 29700 7813 -4460 1938 9202 6154 4196 -6872 -26466 -23343 -2164 -1796 4586
5573D586m859r232K767J2457j4820k2090J1997J5663R338l775o27J1315R007p853
5559A3874j778Q126K996j5042l225L402l332k952j1728l800m904M615P488J0835
5545D575j415j1119k740j451q091o140M063K1980o348q267J02J3949O548O427
5531A2073N55q330l020n586O360L057J815J9118R357m02j2216j5681k513J631
5517F218j0188m674J4178Q305k589J365o021m480J2035K43K334j0346o349l892
5503c861n122O034J3869Q596k639m686k1251N600J4525Q93j907m845Q97k5521
5489a9418p139J4019N738p515K371j0603n423K720M491q92O793j674j147m906
5475b2585n402P039J4669K1954m08K69P91q305o223j9345Q95J3390O932Q084j537
$$ plain form
5573 4586 -273 -9505 -6738 5719 -9101 -31191 -19194 -3531 5807 2032 1405 12720 21727 13874
5559 13874 12096 20222 23218 8176 4951 8353 5021 2069 -9659 -13459 -18363 -13748 -6260 4575
5545 4575 3160 -7959 -10699 -12150 -20241 -26381 -22318 -338 -6686 -14953 -14851 -902 5646 12073
5531 12073 12628 4298 1278 -4308 2052 5109 6924 26042 35399 34997 22781 7100 4587 6218
5517 6218 -3970 -8644 5534 13839 11250 12615 6594 2114 14149 14392 16726 6380 31 -3861
5503 -3861 -8983 -2949 10920 19516 16877 12191 -9060 -3460 11065 11958 10051 5206 6103 -19418
5489 -19418 -26557 -12538 -6800 -14315 -11944 -22547 -27970 -25250 -20759 -21651 -14858 -16532 -17679 -22585
5475 -22585 -27987 -20948 -6279 15675 15267 15536 16327 8022 1799 -17546 -16651 -3261 3671 11755 10218
5460A0218n587j0182o788J0034L837r204K930J5645Q907j4468l909J0252n44m344
5446F797q542J8468N669K538K850j1895M502K817K431M700j1826j5205M397K37
5432G938r680j4748l380J1213L316L806O499J242j2376k263M509Q357J2919J212
5418A8564K825J188k784L995j3624j1073O624r719J319J9477O351j8300m991O796
5404F648L677J3688l953k5273k59m29L180P978l00N459q263j4390M563P578m544
5389d640j1546j0063l31J4422J9381p005N298M812n401L209j2714j2167K501j016
5375a5260j040j0325J2682J3122O252M965j0329l2145m203P906J2513J3233N114
5362B485J0001K668j1288j5221p509Q367R138K652j2607J335k527j6188q109J7745
$$ plain form
5460 10218 4631 -5551 -12339 -2305 1532 -7672 -4742 10903 19810 5342 1433 11685 11141 6797
5446 6797 -1745 16723 22392 24930 27780 15885 20387 23204 25635 30335 18509 3304 7701 7938
5432 7938 -1742 -16490 -19870 -8657 -5341 -1535 4964 6206 -6170 -8433 -3924 4433 17352 18564
5418 18564 21389 22577 19793 23788 10164 -909 5715 -4004 -2685 16792 23143 4843 -148 6648
5404 6648 10325 24013 20060 -5213 -5472 -5901 -2721 5257 4957 10416 2153 -12237 -7674 -96 -4640
5389 -4640 -16186 -26249 -26580 -12158 7223 218 5516 10328 4927 8136 -4578 -16745 -14244 -15260
5375 -15260 -16300 -26625 -13943 -821 5431 10396 67 -32078 -36281 -28375 -15862 -2629 2485
5362 2485 12486 15154 3866 -11355 -18864 -10497 -1359 1293 -11314 -9979 -12506 -28694 -36803 -19058
5348a9058R868q167J449j917q248J5148J2926M600J2903N624k9j8300q898l098
5334e197j2041M983Q323R598J285l363J515R05k476J941N863m02m878n937j3485
5319a3366J0273J5870k0406j0368N012m463O46J7379P480K140j1496p202p950
5306a6451O902n217p38O693R113P316j1301j2380l665J762M61N25J418J066J3355
5291a141R750m794L853o940j2899N914j968k009j1189q405K102N833o018J0621
5277a7290J7566j6550k739Q485P327l872r710L735M384R476r58R488J8763P892
5263C5997j4943k1412o237l145K226J355J4908L844J209l362n13K660j6884j4673
5249a8970M985P776M61o290n218M984n561J3540k408l39j033P215l301q727l523
$$ plain form
5348 -19058 -9190 -17357 -15908 -17825 -26073 -10925 2001 6601 19504 25128 25099 6799 -2099 -5197
5334 -5197 -17238 -12255 -3932 5666 6951 3588 5103 6008 3532 5473 11336 10934 6056 119 -13366
5319 -13366 -3093 12777 -7629 -17997 -12985 -17448 -16802 577 8057 10197 -1299 -8501 -16451
5306 -16451 -9549 -14766 -15504 -8811 302 7618 -3683 -16063 -19728 -17966 -17505 -16980 -15562 -14496 -1141
5291 -1141 8609 3815 7668 728 -12171 -6257 -8225 -10234 -21423 -29828 -27726 -21893 -27911 -17290
5277 -17290 276 -16274 -19013 -10528 -3201 -7073 -16783 -13048 -8664 812 -146 9342 28105 35997
5263 35997 21054 -358 -6595 -9740 -7514 -6159 8749 12593 13802 10440 9927 12587 -4297 -18970
5249 -18970 -13985 -6209 -5748 -12038 -17256 -12272 -17833 -4293 -6701 -7040 -8073 -858 -4159 -12886 -16409
5234a6409R526N137j888M168m492j458J7875J3143q143j8683j0114Q911M592J8740
5220B0905q142o793j5092M67J4554J1368q973K180r845p875K073K7176m159l456
5206A4388k416q742j0287J4190J272M927K240j0013r200J175Q466m478R12j675
5192G59o610N709P311J570L034p245j0927J3758J2923J275J2441j9799l2312L158
5178a4955J6411Q930j2347q807p05P462K106J3988m599k58K340j096j887j1205
5164d622j718q907j323R731P769O198n602j2236L347n345o423L341l104O789J1620
5149d85J2217L644p92q986K034j002j1244n349j5676K142J6590n25L351M435M893
5134E247o017M526p947k148M855j3518L011K15L226J366P80m286o37Q511N749
$$ plain form
5234 -16409 -6883 -1746 -3634 534 -3958 -5416 12459 25602 17459 -1224 -11338 -2427 2165 20905
5220 20905 12763 5970 -9122 -8655 5899 17267 8294 10474 629 -7246 -5173 22003 17844 14388
5206 14388 11972 3230 -7057 7133 8405 13332 15572 5559 -3641 -2466 6000 1522 2434 759
5192 759 -5851 -142 7169 8739 11773 4528 -6399 7359 20282 21557 33998 14199 -18113 -14955
5178 -14955 1456 10386 -1961 -10768 -11473 -4011 -1905 12083 7484 7226 9566 8470 6583 -4622
5164 -4622 -6340 -15247 -16570 -6839 930 7128 1526 -10710 -7363 -12708 -19131 -15790 -18894 -12105 -485
5149 -485 11732 15376 14584 5598 7632 6630 -4614 -9963 -25639 -23497 -6907 -7432 -4081 354 5247
5134 5247 -770 3756 -4191 -6339 -1484 -15002 -11991 -11776 -8550 -7184 -6404 -10690 -11327 -2816 2933
5119B933K836K831j2404j0783j1149K610J9754j267n239N818k128J3178J6050
5106B3040j672j8281r699k901j5403J913O197P248R556m544j6038L622J3202k853
5092f613j0351o177k187M770J4302J4374J0158p543q64K370k163p425r729J0755
5078C677Q902k4701O306M097k950R171O294r357J1210K861J0324J0414j5723k920
5064A7605j889j040j5554Q37m135P891p444q145J168r557k1246O890J4825R320
5050a0474r709M865J3707M603J0673k491J929m199N675J0493j729j4376j015p555
5036C97K860j927j041N110p828q382J2273J1045j227M288P267l81k5032j294J647
5021b225M678j3086o784J66l341J6080J5063k32k0004q775M563J439l137l735
$$ plain form
5119 2933 5769 8600 -3804 -14587 -25736 -23126 -3372 -4639 -9878 -4060 -6188 6990 23040
5106 23040 21368 3087 -6612 -9513 -24916 -23003 -16806 -9558 -2 -4546 -20584 -16962 -3760 -6613
5092 -6613 -16964 -23141 -25328 -20558 -6256 8118 18276 10733 9869 12239 10076 2651 -7078 3677
5078 3677 12579 -12122 -5816 -1719 -4669 4502 10796 1439 12649 15510 25834 36248 20525 17605
5064 17605 15716 14676 -878 -41 -4176 3715 -3729 -11874 -10706 -20263 -41509 -34619 -19794 -10474
5050 -10474 -20183 -15318 -1611 2992 13665 11174 13103 8904 14579 25072 23343 8967 7952 397
5036 397 3257 1330 289 5399 -2429 -10811 1462 12507 11280 15568 22835 22454 -2578 -3872 -2225
5021 -2225 2453 -10633 -17417 -17251 -20592 -4512 10551 10319 -9685 -18460 -13897 -12458 -15595 -19330
5007a9330K795O396J2392m061k390J876k927q402k298Q574L086J2198j1448q447
4993a1986L358J5966k156j1747j395j1007j0506j3261n29K7143J5043L414L551
4980E888J377j0027j1161j0444J2249K1740M851k917n393j1618j1418K0655K2477
4967B6259j5457q251M661j1336l032J2418M712J887J1912n002n519R701j878k2451
4953a376n657P207L160j0450Q116K3512M745r515n774J5888j729l742p842j989
4939A4554J0631M7J910n946j5819j8328k472J1889Q175m739m23o851j18J7947
4925A0457Mk974J4114j291j2680j1664j9037n29K3614J2772j3016p32N952J4633
4911A9623O952k405l223P955j2437j7376M273p288j0773p604R923N651O13J030
$$ plain form
5007 -19330 -16535 -10139 2253 -1808 -4198 -2322 -5249 -13651 -15949 -7375 -4289 7909 -3539 -11986
4993 -11986 -8628 7338 5182 -6565 -7960 -18967 -29473 -42734 -43263 -16120 -1077 2337 5888
4980 5888 7265 -2762 -13923 -24367 -12118 9622 14473 11556 6163 -5455 -16873 3782 26259
4967 26259 10802 2551 7212 -4124 -7156 5262 9974 11861 23773 18771 13252 22953 21075 -1376
4953 -1376 -7033 174 3334 -7116 1000 24512 29257 19742 13968 29856 28127 24385 16543 14554
4939 14554 25185 25232 27142 21196 5377 -12951 -15423 -3534 4641 -98 -521 -7372 -7490 10457
4925 10457 10461 7487 21601 20310 7630 -4034 -23071 -23600 14 12786 -230 -962 4990 19623
4911 19623 26575 24170 20947 28902 16465 -911 3362 -3926 -14699 -22303 -12380 -6729 -6116 -5086
4897e086J181R468R555r935j4316J903J2968Q515j553j0587J841m10j154q072
4883e682m948r050p120Q610L482J0655J2126N496j140J81k968J125J0418j146
4869B0039L755J935o215k5122j5513j1464Q886K039Q139m42O713J2173Q495J0318
4855B3736p501j6216k208K961J469o294J004N578j2128J3872J3184n953j3184
4842a680j1638j2891J762J1564j7281q174J3616J1822N456o151O870P080j917
4829a562n389R094J3127q580q083m082j855r582R145J4676l053j0168j925k578
4815a0815m054k507L80J0943K2017L551j6324j912O590l051q495j4328l938p8
4801b2021J6474P798n437q312P690L618L329O460j4330k9789Q67J856M621l328
$$ plain form
4897 -5086 -3905 5563 15118 5183 -9133 -7230 5738 14253 12700 2113 3954 3544 2390 -5682
4883 -5682 -10630 -19680 -26800 -18190 -14708 -4053 8073 13569 12429 12610 9642 10767 21185 20039
4869 20039 23794 25729 19514 -5608 -21121 -32585 -23699 -21660 -13521 -13963 -7250 4923 13418 23736
4855 23736 16235 19 -2189 772 2241 -4053 -3049 2529 -9599 4273 17457 11504 -1680
4842 -1680 -13318 -26209 -24447 -12883 -30164 -38338 -24722 -12900 -7444 -13595 -6725 355 -1562
4829 -1562 -6951 2143 15270 6690 -1393 -5475 -7330 -16912 -7767 6909 3856 -6312 -8237 -10815
4815 -10815 -14869 -17376 -16996 -6053 15964 19515 3191 1279 7869 4818 -3677 -18005 -21943 -22021
4801 -22021 -5547 2251 -3186 -11498 -3808 -190 3139 9599 -4731 -34520 -33653 -31797 -27176 -30504
4787c0504q70n90J5045O656J642J858P859J0439K901R732l894p408n348J17p344
4772B91m880j5833J334J8608n46Q093N26j3895M052J7930o150j9949q514N917
4758a3016M211m018N267m108p270O690n271k154R786J1379M563J9499J695j6214
4744A1039k2079j365l208J413m77l079O310p790J270N483J4002N190k882r3N477
4729I211J1322k807m627p797k69M492L38n996o147J371J525j4365Q48N606j237
4714h532k447L035j0685m91O724j645K967k847Q791Q326j692j4176j516N274O057
4699b857l103o470j1698Q33K5044O183K758K179n821p293J548M89q486J3876R123
4684A6305K239q148n688m848j989k797N736K249N148m478j2099K272l350L543
$$ plain form
4787 -30504 -31374 -31964 -16919 -10263 -8621 -6763 1096 11535 14436 24168 20274 12866 7518 7635 291
4772 291 -4589 -20422 -19088 -480 -1026 7067 7593 -6302 -2250 15680 9530 -10419 -18933 -13016
4758 -13016 -8805 -12823 -7556 -11664 -18934 -12244 -17515 -19669 -9883 1496 6059 25558 27253 11039
4744 11039 -11040 -12405 -15613 -14200 -14677 -17756 -11446 -19236 -17966 -12483 1519 6709 3827 3734 9211
4729 9211 20533 17726 13099 5302 5033 9525 9863 3867 -2280 -909 616 -13749 -12901 -7295 -8532
4714 -8532 -10979 -7944 -18629 -19120 -12396 -14041 -11074 -13921 -5130 3196 1504 -12672 -14188 -8914 -2857
4699 -2857 -5960 -12430 -24128 -23295 1749 7932 10690 12869 7048 -245 1303 1792 -6694 7182 16305
4684 16305 18544 10396 4708 -140 -2129 -4926 810 3059 8207 3729 -8370 -6098 -9448 -5905
4670e905p685j905J5977p48J371m372L588o665l394L381m690n531R233J0208Q345
4655A1208m820O19J0766l279o429p428j6526J3778K7722J077j7556r816N321R382
4641A4019K489p833j4756m892J0640J0052p821L59j410n260K2817n62r538L907
4627A2211r353m641M695K3467j350j0142N035K832j6651j8099M070J9542O623
4614A8239J1501J8512j4200j2304k737p619Q014j0795j0811n4J009o764j0239
4601a8248R452J2110j3879k736k641j5736J3279K2608r547K671K08j2581k2691
4588c7731k420j862J8088K0710r56J1903R202n595O1L853p572P809j5422o844
4574f776J6139J591l1415m115K447O032N953l944m697N754K3381j486l394k856
$$ plain form
4670 -5905 -13590 -15495 482 -266 1105 -3267 321 -6344 -9738 -6357 -11047 -16578 -7345 2863 11208
4655 11208 6388 7007 17773 14494 8065 637 -15889 -2111 25611 26688 9132 -684 4637 14019
4641 14019 16508 8675 -6081 -10973 -333 9719 1898 2257 847 -4413 18404 17842 8304 12211
4627 12211 2858 -1783 2912 26379 25029 14887 19922 22754 6103 -11996 -7926 11616 18239
4614 18239 29740 48252 34052 21748 19011 11392 19406 8611 -2200 -2254 -1245 -8009 -18248
4601 -18248 -8796 3314 -10565 -13301 -15942 -31678 -18399 4209 -5338 -2667 -2459 -15040 -37731
4588 -37731 -40151 -42013 -23925 -3215 -4171 7732 16934 11339 11400 15253 7681 15490 68 -6776
4574 -6776 9363 10954 -20461 -24576 -22129 -16097 -10144 -14088 -18785 -13031 10350 8864 5470 2614
4560B614r387o387k677N912J3230J222Q950M420n277j3740l080Q0n315J328P667
4545d40J676Q113M25j1767l11P201J1485j0816J674j1209m508K892Q822m504j9873
4530b1140M675J2306L290L984L419l017n920p360n026J65L607J492J436J0352
4516B263q493L775l343l36J2314J1023K486l569k4983k877J4751J671n990j2278
4502a3586n572M340J0932R616N585K612j6896o695J1494J7402J1428L182l127
4489C0715j7383p890Q351J1310m816j8902j9064o545q89j979J0599J4478N325
4476C310j3312n038k807J1351J6898O09k0994R671K484p091P053J0161r788j508
4462I99j295j5270N97M78L331j1175j3713R677J2494K265J4258L831K523O593
$$ plain form
4560 2614 -6773 -13160 -15837 -9925 3305 4527 13477 17897 12620 -1120 -4200 -4120 -9435 -8107 -440
4545 -440 1236 9349 9774 -1993 -2304 4897 16382 5566 7240 -3969 -8477 -5585 3237 -1267 -21140
4530 -21140 -16465 -4159 -869 3115 6534 3517 -2403 -9763 -14789 -14624 -11017 -9525 -8089 2263
4516 2263 -6230 -2455 -5798 -6134 6180 17203 19689 16120 -8863 -11740 3011 4682 -1308 -13586
4502 -13586 -19158 -14818 -3886 5730 11315 13927 -2969 -9664 1830 19232 30660 33842 30715
4489 30715 13332 5442 13793 25103 20287 1385 -17679 -24224 -25113 -27092 -16493 -2015 3310
4476 3310 -10002 -15040 -17847 -6496 10402 11011 -9983 -312 2172 -4919 2134 12295 2507 999
4462 999 -296 -15566 -14969 -14491 -11160 -22335 -36048 -26371 -13877 -11612 2646 6477 9000 15593
4448A5593q783p777j0517j3438J5560l28L224J519K109l463J527l24J071J0830
4434F803R860J3074j6936j0747J448q031j3070N643M115p34j761J89J2901J818
4420D572p63P672M387o249r863r178M675J099p248Q734J9863R697j1868q823j0007
4405c300o627L289J651l245m358J8535K081J96j2999j1629J2813K387J209R432
4391I435l565j2666m138O299k941o118J909J2176o520L738M688l181K499k916
4377a301J2972O035L212j7507n088r015j3572J6200K0174m496p640m709j2532
4364a7267J4120N270l205R9r20j547j6578J347K3647N145L797p921j5193q303
4350a7509J96r802M84K733M172q739P730l673j38m015k512J3318J2842M729p422
$$ plain form
4448 15593 6810 -967 -11484 -24922 -9362 -9690 -6466 -4947 -2838 -6301 -4774 -5098 -4027 6803
4434 6803 16663 29737 12801 2054 3502 -4529 -17599 -11956 -7841 -8575 -10336 -10147 2754 4572
4420 4572 3809 11481 15868 9619 -244 -9422 -4747 -3648 -10896 -2162 17701 27398 15530 6707 -3300
4405 -3300 -9927 -6638 -4987 -8232 -12590 5945 8026 8222 -4777 -16406 -3593 -1206 3 9435
4391 9435 5870 -6796 -10934 -4635 -7576 -13694 -11785 391 -6129 -2391 2297 -884 1615 -1301
4377 -1301 11671 17706 20918 3411 -1677 -10692 -24264 -8064 12110 7614 -26 -4735 -17267
4364 -17267 -3147 2123 -1082 -983 -1903 -3450 -20028 -18681 4966 10111 13908 5987 -9206 -17509
4350 -17509 -17313 -27115 -26631 -23898 -19726 -28465 -20735 -24408 -24546 -28561 -31073 -17755 -4913 -184 -7606
4335g606o37O658j960O289K136P828N68j5655j6016J138J0503k519O828N919l414
4320F0j0728K860n554k048J0221R812j4579o985L268M67l311o210K039j1828J495
4305c1021K3704J3440N3K950L898k072J058K6311l608k8977j1137j721L337J2583
4291H798m907O849N516j1309o004j7471m022O184J5823J487j92o072K478J478
4277a364M371P043O304n518j1565k234J021R415j370O01k753n121p830J952J0107
4262C059Q347P392j2002n819L835j5795j88P595J1422J2569p680j3141L518l019
4248I3j4142n861m294m346n472J827O695M448O840j09k2977K599J4005R491J3278
4233B075l83J0320k96N67P328J898l385k1588l769M432j131J0677K59n018p708
$$ plain form
4335 -7606 -8243 -1585 -3545 2744 4880 12708 13276 -2379 -18395 -17257 -6754 -9273 -2445 3474 60
4320 60 -10668 -7808 -13362 -15410 -5189 4623 -9956 -16941 -13673 -13206 -16517 -22727 -20688 -32516 -31021
4305 -31021 -7317 6123 6176 9126 13024 10952 12010 38321 34713 5736 -5401 -7122 -3785 8798
4291 8798 3891 10740 16256 4947 -1057 -18528 -22550 -16366 -543 944 752 -5320 -2842 -1364
4277 -1364 3007 10050 16354 10836 -729 -2963 -1942 7473 6103 6704 3951 -1170 -9000 -7048 3059
4262 3059 11406 18798 6796 977 4812 -10983 -11171 -3576 7846 20415 12735 -406 3112 93
4248 93 -14049 -19910 -24204 -28550 -34022 -32195 -25500 -21052 -14212 -14321 -37298 -34699 -20694 -11203 2075
4233 2075 1692 12012 11716 12283 19611 21509 18124 -3464 -7233 -2801 -3932 6745 7004 1986 -5722
4218e722j2274R47J4804N020L646J0109l933j3091o517K938j0944M264O739L636
4204c78K240J6107J1644o987o53O37p464k745J9519j0735r712r766j0200p816
4190a6309n053K427k020l284J262N241J2870j093m130J0706L573q755k1341l403
4176b9309J9306J0364o310k507O920o710q23J4052L519q637k328l762p764n979
4162a9968l51K146P402O241K431M194j586M411P114p299m769q55n286J259K035
4147b881Q868J243J242r2k397M806q849r597N797N318j001j6725j893O524k070
4132a1707n145M939j1448k263P218K2733K836L036L313J3160J8675j4909k2270
4119H168p398k068K899N563R33l306l82o826k177K443j0973o75n496r6K695N007
$$ plain form
4218 -5722 -17996 -17049 -2245 2775 6421 16530 12597 -494 -7011 -4073 -15017 -10753 -4014 -378
4204 -378 1862 17969 29613 22626 21973 22610 15146 12401 31920 21185 11473 1707 -8493 -16309
4190 -16309 -21362 -18935 -20955 -24239 -22977 -17736 -4866 -5959 -10089 617 4190 -4565 -25906 -29309
4176 -29309 -10003 361 -5949 -8456 -1536 -8246 -9069 4983 8502 -135 -2463 -6225 -13989 -19968
4162 -19968 -20319 -18173 -10771 -4530 -2099 2095 509 4920 12034 4735 -34 -889 -6175 -4916 -2881
4147 -2881 5987 7230 8472 8380 5983 10789 1940 -7657 -1860 3458 2457 -14268 -16161 -9637 -11707
4132 -11707 -16852 -11913 -23361 -25624 -18406 4327 7163 10199 13512 26672 45347 30438 8168
4119 8168 770 -1298 1601 7164 8097 4791 4409 -2417 -4594 -2151 -13124 -13799 -19295 -19391 -16696 -11689
4103a1689J3433j970k169n434R769l540R81j23J840K263K894J3706N45l5175n315
4088a9984J3719K562M81J4155J0728J225k916q686k4813q283J9472R147l918J4536
4074A7425j3608L298L736r593q553R278K632j1855K122j0006P15j228j1858J0045
4060a7450K38k837p221k564N751J2057n297K463m377m358P755P587J1857m065
4046d61K678J4927m727l116l144J178o731j2466M971N947j1455L909M152j1361
4032a5699J030N153j712P938J9137O653k3615j4465j5635K863J2765K5393L789
4019A3595q098q044J983j683m75M615j632j1140r162L04K4231J0252q59J6Q207
4004B2110o071p325j7337j2445J0193k10J6999J2553J307j7530j0990j579J2144
$$ plain form
4103 -11689 1744 -226 -2395 -7829 1940 -1600 -619 -742 1098 3361 6255 19961 20506 -14669 -19984
4088 -19984 -6265 -3703 -3222 10933 21661 22886 19970 11284 -13529 -21812 -2340 6807 2889 17425
4074 17425 3817 7115 10851 1258 -7295 1983 4615 -7240 -5118 -15124 -14409 -15637 -27495 -17450
4060 -17450 -17212 -20049 -27270 -29834 -24083 -12026 -17323 -14860 -19237 -23595 -15840 -8253 3604 -461
4046 -461 2217 17144 12417 9301 6157 7335 604 -11862 -6891 -944 -12399 -8490 -4338 -15699
4032 -15699 -14669 -9516 -11228 -3290 15847 22500 -1115 -15580 -31215 -28352 -15587 9806 13595
4019 13595 5497 -2547 -564 -2247 -2722 1893 261 -10879 -20041 -19737 4494 14746 13887 13903 22110
4004 22110 16039 8714 -8623 -21068 -10875 -11085 5914 18467 19774 2244 -8746 -10325 1819
3991A819J4552K819k14o65o698p584L560l331K332J805q805j7817K725M952j979
3976a2529R306j543M353P378j1428o38O873N314M13j035o139l992j607K0344J4184
3961B9254j5136j1504k2899N653N664q412Q337L125k4543K777K1759R455q225
3948d695k8485n243J6493J2462m831P728j16j2834L680J2474k368m340o025l778
3934a9878j020R430J2845M656n115J799J73L547K25l252m146q069j3054O946J5519
3919F06N148o491p342P969O904j1654R96R753j4542k056Q594J1121j354j0233
3905b581j397R527j131j2433m688K666n594O229J0361R215l761j2633k496r27
3891i643o916K6J7118O60l579j0060o427q760P803Q202k369O812N583L096N770
$$ plain form
3991 1819 16371 19190 18976 18311 11613 4029 7589 4258 6590 8395 -410 -18227 -15502 -10550 -12529
3976 -12529 -3223 -4766 -413 6965 -4463 -5101 1772 7086 7499 6464 325 -3667 -5274 15070 29254
3961 29254 14118 2614 -20285 -14632 -8968 -17380 -9043 -5918 -30461 -27684 -5925 3530 -4695
3948 -4695 -33180 -38423 -21930 -9468 -14299 -6571 -6687 -19521 -15841 -3367 -5735 -10075 -16100 -19878
3934 -19878 -20898 -11468 1377 6033 918 2717 2890 6437 6662 3410 -736 -8805 -21859 -14913 606
3919 606 5754 -737 -8079 -110 6794 -4860 -3864 5889 -8653 -10709 -2115 9006 7652 -2581
3905 -2581 -3978 5549 4418 -8015 -12703 -10037 -15631 -9402 959 10174 6413 -6220 -8716 -9643
3891 -9643 -16559 -16533 585 1245 -2334 -12394 -18821 -27581 -19778 -11576 -13945 -7133 -1550 1546 7316
3876G316j5330l613O299k043N074J7437J2177N13o734j6472J0005p443j9063N407
3862f470J1363P087j553p772j1294q72m255N680J223o366Q187O771j80J4422l495
3847A2476r944N570L927l30p143k5165l648J9698N06O673k68l233j4577p578J4693
3832h343J0038M049Q208p775p111j090q102k399K0957J739p292O63L512K104o875
3817B283n080L071n41J6296Q04o719m474o512k949K225N307J3465j695M298P555
3802B7334k2822j5740m940N521k450J1472M907j1168M490J0282M791K822j0457
3789D042k070l306m650M812J0557l954l526k986q667n107O012l0l580j228L190
3774a0491l480r88J3917J0749K151j4343r485Q58J2964J7260m682q831r169O71
$$ plain form
3876 7316 -8014 -11627 -5328 -7371 -2297 15140 27317 27830 21096 4624 14629 7186 -11877 -6470
3862 -6470 4893 11980 10427 2655 -8639 -9511 -13766 -8086 -6863 -13229 -5042 1729 1549 15971 12476
3847 12476 2532 8102 12029 11699 4556 -20609 -24257 -4559 -4053 2620 2352 -881 -15458 -23036 -8343
3832 -8343 1695 5744 13952 6177 -934 -2024 -10126 -12525 8432 10171 2879 3542 7054 9158 2283
3817 2283 -2797 274 -267 16029 16833 10114 5640 -872 -3821 -1596 3711 17176 15481 19779 27334
3802 27334 4512 -11228 -16168 -10647 -13097 -1625 3282 -7886 -3396 6886 11677 14499 4042
3789 4042 1972 -1334 -5984 -1172 9385 5431 1905 -1081 -9748 -14855 -8843 -8873 -12453 -13681 -10491
3774 -10491 -13971 -14959 -1042 9707 11858 -2485 -11970 -11112 1852 19112 14430 5599 -3570 -2899
3760b899O904J2831J304j699r473k4083N814Q989L065n374J26n046o708R225N912
3745a112q267q822K2569N175l477j8677n00P567M489P045K638j8276j9924N712
3731b3860N900J3364K16n573QJ451Q134j4839j2094J1886J5989q969N310P390
3717D313j730J1357o085M328j590N241j1744l722k546J308N157M703k879J2715
$$ plain form
3760 -2899 4005 16836 18140 16441 6968 -17115 -11301 -2312 753 -4621 -4495 -9541 -16249 -7024 -1112
3745 -1112 -9379 -18201 4368 9543 6066 -12611 -13111 -5544 -1055 5990 8628 -9648 -29572 -23860
3731 -23860 -17960 -4596 -4380 -9953 -9945 -8494 -360 -15199 -27293 -15407 582 -8387 -3077 4313
3717 4313 2583 13940 7855 12183 10593 15834 4090 368 -2178 -870 4287 8990 6111 18826
$$ [...]
##END NTUPLES=NMR SPECTRUM
##END=
