##TITLE=Analysis number 328316
Compound Code cc 13623
Book Reference 521/65
Project Code adrs
Chemist Name evam
##JCAMPDX= 6.0         $$ Bruker NMR JCAMP-DX V2.0
##DATA TYPE= NMR SPECTRUM
##DATA CLASS= NTUPLES
##ORIGIN= Bruker BioSpin GmbH
##OWNER= nmr
$$ XWIN-NMR		Version 3.5
$$ Thu May 24 08:57:36 2007 GMT Daylight Time (UT+1h)  MAYBRIDGE\nmr@NMR_250MHZ
##.OBSERVE FREQUENCY= 250.131544655141
##.OBSERVE NUCLEUS= ^1H
##.ACQUISITION MODE= SIMULTANEOUS (DQD)
##.ACQUISITION SCHEME= undefined
##.AVERAGES= 16
##.DIGITISER RES= 18
##SPECTROMETER/DATA SYSTEM= dpx250
##.PULSE SEQUENCE= zg30
##.SOLVENT NAME= CDCl3
##.SHIFT REFERENCE= (INTERNAL, CDCl3, 0, 16.522)
##AUDIT TRAIL= $$ (NUMBER, WHEN, WHO, WHERE, WHAT)
$$ ##TITLE= Audit trail, XWIN-NMR		Version 3.5
$$ ##JCAMPDX= 5.01
$$ ##ORIGIN= Bruker BioSpin GmbH
$$ ##OWNER= nmr
$$ C:\u/data/dgb/nmr/ADRS/1410/pdata/1/auditp.txt
$$ ##AUDIT TRAIL=  $$ (NUMBER, WHEN, WHO, WHERE, WHAT)
(   1,<2007-05-24 08:57:15.54 +100>,<MAYBRIDGE\nmr>,<NMR_250MHZ>,
      <created by zg, POWCHK disabled, PULCHK disabled
       configuration hash MD5:
       76 6E 9A 78 1E 09 19 81 EC 84 63 8F B0 6A 59 2D
       data hash MD5: 64K
       28 19 93 C4 6E 03 81 5A 5D FE 2A 3D 5E 7A 01 DF>)
(   2,<2007-05-24 08:57:27.81 +100>,<MAYBRIDGE\nmr>,<NMR_250MHZ>,
      <Start of raw data processing
       ef LB = 0.3 FT_mod = 6 PKNL = 1 SI = 32K 
       data hash MD5: 32K
       7E EA 42 45 2A 51 DD 9E AB C3 55 9C EB 4D 5A 6B>)
(   3,<2007-05-24 08:57:29.48 +100>,<MAYBRIDGE\nmr>,<NMR_250MHZ>,
      <apk 
       data hash MD5: 32K
       43 ED 59 5E 98 A9 06 A4 61 E7 CF 55 1B 74 9E 6D>)
(   4,<2007-05-24 08:57:30.17 +100>,<MAYBRIDGE\nmr>,<NMR_250MHZ>,
      <abs ABSG = 5 
       data hash MD5: 32K
       77 B7 7B 8B 69 66 3E 08 06 99 D1 54 66 98 67 BA>)
$$ ##END=
$$ 
$$ hash MD5
$$ B8 73 42 9B FD 51 29 4A F2 29 4E 44 F4 35 31 14
##$RELAX= 
##$RELAX= 
##$RELAX= 
##$RELAX= 
##$RELAX= 
##$RELAX= 
##$RELAX= 
$$ Bruker specific parameters
$$ --------------------------
##$DU= <C:\u>
##$EXPNO= 1410
##$NAME= <ADRS>
##$PROCNO= 1
##$TYPE= <nmr>
##$USER= <dgb>
##$AMP= (0..31)
100 100 100 100 100 100 100 100 100 100 100 100 100 100 100 100 100 100 
100 100 100 100 100 100 100 100 100 100 100 100 100 100 
##$AQSEQ= 0
##$AQ_mod= 3
##$AUNM= <au_zg>
##$AUTOPOS= <55 >
##$BF1= 250.13
##$BF2= 250.13
##$BF3= 250.13
##$BF4= 250.13
##$BF5= 500.13
##$BF6= 500.13
##$BF7= 500.13
##$BF8= 500.13
##$BYTORDA= 1
##$CFDGTYP= 0
##$CFRGTYP= 5
##$CHEMSTR= <none>
##$CNST= (0..31)
1 1 145 1 1 1 1 1 1 1 1 1 1 1 1 1 1 1 1 1 1 1 1 1 1 1 1 1 1 1 1 1 
##$CPDPRG= <>
##$CPDPRG1= <>
##$CPDPRG2= <>
##$CPDPRG3= <>
##$CPDPRG4= <mlev>
##$CPDPRG5= <mlev>
##$CPDPRG6= <mlev>
##$CPDPRG7= <mlev>
##$CPDPRG8= <mlev>
##$CPDPRGB= <>
##$CPDPRGT= <>
##$D= (0..31)
0 1 0 0 0 0 0 0 0 0.06 0 0 0 0 0 0 0.0002 0 0 0 0 0 0 0 0 0 0 0 0 0 0 
0 
##$DATE= 1179993434
##$DBL= (0..7)
120 120 120 120 120 120 120 120 
##$DBP= (0..7)
150 150 150 150 150 150 150 150 
##$DBP07= 0
##$DBPNAM0= <>
##$DBPNAM1= <>
$$ [...]
##$SUBNAM7= <"">
##$SUBNAM8= <"">
##$SUBNAM9= <"">
##$SW= 20.6930455092707
##$SWIBOX= (0..15)
0 0 3 0 0 0 0 0 0 0 0 0 0 0 0 0 
##$SW_h= 5175.983436853
##$TD= 65536
##$TD0= 1
##$TE= 683.16
##$TE2= 300
##$TE3= 300
##$TEG= 300
##$TL= (0..7)
0 120 120 120 120 120 120 120 
##$TP= (0..7)
150 150 150 150 150 150 150 150 
##$TP07= 0
##$TPNAME0= <>
##$TPNAME1= <>
##$TPNAME2= <>
##$TPNAME3= <>
##$TPNAME4= <>
##$TPNAME5= <>
##$TPNAME6= <>
##$TPNAME7= <>
##$TPOAL= (0..7)
0.5 0.5 0.5 0.5 0.5 0.5 0.5 0.5 
##$TPOFFS= (0..7)
0 0 0 0 0 0 0 0 
##$TUNHIN= 0
##$TUNHOUT= 0
##$TUNXOUT= 0
##$USERA1= <user>
##$USERA2= <user>
##$USERA3= <user>
##$USERA4= <user>
##$USERA5= <user>
##$V9= 5
##$VALIST= <valist>
##$VCLIST= <CCCCCCCCCCCCCCC>
##$VD= 0
##$VDLIST= <DDDDDDDDDDDDDDD>
##$VPLIST= <PPPPPPPPPPPPPPP>
##$VTLIST= <TTTTTTTTTTTTTTT>
##$WBST= 1024
##$WBSW= 4
##$XGAIN= (0..3)
0 0 0 0 
##$XL= 0
##$YL= 0
##$YMAX_a= 361691
##$YMIN_a= -324794
##$ZGOPTNS= <>
##$ZL1= 120
##$ZL2= 120
##$ZL3= 120
##$ZL4= 120
##$ABSF1= 16.522
##$ABSF2= -4.171173
##$ABSG= 5
##$ABSL= 3
##$ALPHA= 0
##$AQORDER= 0
##$ASSFAC= 0
##$ASSFACI= 0
##$ASSFACX= 0
##$ASSWID= 0
##$AUNMP= <proc_1d>
##$AZFE= 0.1
##$AZFW= 0.1
##$BCFW= 0
##$BC_mod= 0
##$BYTORDP= 0
##$COROFFS= 0
##$CY= 12.5
##$DATMOD= 1
##$DC= 0
##$DFILT= <>
##$DTYPP= 0
##$F1P= 14.0000005364418
##$F2P= -0.99999901652339
##$FCOR= 0.5
##$FTSIZE= 32768
##$FT_mod= 6
##$GAMMA= 0
##$GB= 0
##$INTBC= 1
##$INTSCL= 1
##$ISEN= 128
##$LB= 0.3
##$LEV0= 0
##$LPBIN= 0
##$MAXI= 10000
##$MC2= 0
##$MEAN= 0
##$ME_mod= 0
##$MI= 0
##$NCOEF= 0
##$NC_proc= -3
##$NLEV= 6
##$NOISF1= 0
##$NOISF2= 0
##$NSP= 0
##$NTH_PI= 0
##$NZP= 0
##$OFFSET= 16.522
##$PC= 1
##$PHC0= -55.3572
##$PHC1= 8.090893
##$PH_mod= 1
##$PKNL= yes
##$PPARMOD= 0
##$PSCAL= 4
##$PSIGN= 0
##$REVERSE= no
##$SF= 250.13
##$SI= 32768
##$SIGF1= 0
##$SIGF2= 0
##$SINO= 400
##$SIOLD= 32768
##$SREGLST= <1H.CDCl3>
##$SSB= 0
##$STSI= 32768
##$STSR= 0
##$SW_p= 5175.98343685301
##$SYMM= 0
##$S_DEV= 0
##$TDeff= 65536
##$TDoff= 0
##$TI= <Analysis number 999999
Compound Code 99
Book Reference 9
Project Code 9>
##$TILT= no
##$TM1= 0
##$TM2= 0
##$TOPLEV= 0
##$USERP1= <user>
##$USERP2= <user>
##$USERP3= <user>
##$USERP4= <user>
##$USERP5= <user>
##$WDW= 1
##$XDIM= 32768
##$YMAX_p= 390061235
##$YMIN_p= -111245
$$ End of Bruker specific parameters
$$ ---------------------------------
##NTUPLES= NMR SPECTRUM
##VAR_NAME=  FREQUENCY,     SPECTRUM/REAL,   SPECTRUM/IMAG
##SYMBOL=    X,             R,               I
##VAR_TYPE=  INDEPENDENT,   DEPENDENT,       DEPENDENT
##VAR_FORM=  AFFN,          ASDF,            ASDF
##VAR_DIM=   32768,         32768,           32768
##UNITS=     HZ,            ARBITRARY UNITS, ARBITRARY UNITS
##FACTOR=    0.157963299565203, 1,           1
##FIRST=     4132.6476996994, 0,             0
##LAST=      -1043.33573715361, 0,           0
##MIN=       -1043.33573715361, -111245,     0
##MAX=       4132.6476996994, 390061235,     0
$$ Real data points
##PAGE= N=1
##DATA TABLE= (X++(R..R)), XYDATA
$$ [...]
18655F042L8031J6463P90j0008k5481K462p61j7919k6017M839K7134P013P717
$$ 6042 44073 60536 61326 51318 25837 28299 27538 9619 -16398 -11559 15575 22588 30305
18642C0305J5678r01q512L668j2775k3012k4327K5417K9305k0533J8029K8625
$$ 30305 45983 45082 36570 40238 27463 4451 -19876 5541 34846 14313 32342 60967
18630F0967p802l0033p072L5715K2602Q158m3344l0311R516k4892n167Q712P229
$$ 60967 53165 23132 16060 51775 74377 82535 39191 8880 18396 -6496 -11663 -2951 4278
18617D278K1635k5907j5160M0979j1006m302P323R560J794L733q804Q239J1547
$$ 4278 25913 6 -15154 25825 14819 10517 17840 27400 29194 32927 24123 32362 43909
18604D3909o174k1832j5579Q22J6279R969N595n058p820O138J75K3012m641l1592
$$ 43909 37735 15903 324 1146 17425 27394 32989 27931 20111 26249 26424 49436 44795 13203
18590A3203R418l7630j5796P56J448J9914J1993n625J9615K0933p02k2192l541
$$ 13203 22621 -15009 -30805 -30049 -28601 -8687 3306 -2319 17296 38229 37527 15335 11794
18577A1794O600P336k1769j136j4001m1294k3251N154j2844L5188M4974J2163
$$ 11794 18394 25730 3961 2825 -11176 -52470 -75721 -70567 -83411 -48223 -3249 8914
18565H914O470K1755N197k4692j2632P729J0612K835J5913J5380l114Q404l3955
$$ 8914 15384 37139 42336 17644 5012 12741 23353 26188 42101 57481 54367 62771 28816
18552B8816l203J5237k7276O738K6798l134n0384J1901n559L1435L6788l981j1644
$$ 28816 25613 40850 13574 20312 47110 43976 -6408 5493 -66 31369 68157 64176 52532
18539E2532K5305K9771J984J6048K2779J6521J4208L5616L7026M7163O1523M4873
$$ 52532 77837 107608 109592 125640 148419 164940 179148 214764 251790 298953 360476 405349
18527D05349L534N543M251l5773p9712r0237q1205p414m4922l1643j0427k4077
$$ 405349 408883 414426 418677 382904 303192 212955 131750 124336 79414 47771 37344 13267
18515A3267j848J5244J9382k6241q422R473o319k2069o630k347O16J8480j943
$$ 13267 11419 26663 46045 19804 11382 20855 14536 -7533 -14163 -16510 -15894 2586 643
18502F43j8000O068L6145J1790l380l7631r148L2696J9651J5111r367j1489j5357
$$ 643 -17357 -11289 24856 36646 33266 -4365 -13513 19183 38834 53945 44578 33089 17732
18489A7732J59N014j8016J253j4099J8919J8795K8983J0369K6621k8319l7379
$$ 17732 17891 22905 4889 6142 -7957 10962 29757 58740 69109 95730 67411 30032
18477C0032m471o033L5363K6359k1402r063J6210j0391m5652q415K8882L4577
$$ 30032 25561 19528 54891 81250 59848 50785 66995 56604 10952 2537 31419 65996
18465F5996J6358m2930K1764L1488M765j6860j3718k0304j0830j3047J1902J1339
$$ 65996 82354 39424 61188 92676 97441 80581 66863 46559 35729 22682 34584 45923
18453D5923K1691M052k9277l692L6000k3022j4261l360J9964j1046M329J6580
$$ 45923 67614 71666 42389 38697 74697 51675 37414 34054 54018 42972 47301 63881
18441F3881n93j5741J465L1721J2522K990P425o241R400j0617l010j4272J7451
$$ 63881 63288 47547 49012 80733 93255 96245 103670 97429 106829 96212 93202 78930 96381
18428I6381j1792J0575O860j1357L252k1266j1222K461p462J8949L4840p534J599
$$ 96381 84589 95164 102024 90667 93919 72653 61431 63892 56430 75379 110219 102685 104284
18415A04284p38K7913K6809J1426j13m456J2517J9045J3552K378P469J9074K5706
$$ 104284 103546 131459 158268 169694 169581 165125 177642 196687 210239 212617 220086 239160 264866
18402B64866M1177k7547m5572o854L1327K3719J6265Q476M014j419K6693N3832
$$ 264866 306043 278496 232924 226070 257397 281116 297381 305857 309871 308452 335145 388977
18390C88977P2228Q7251O3110Q6191Q6190J6871L1733R8987J35743J01986P8155
$$ 388977 461205 548456 611566 697757 783947 800818 832551 931538 1067281 1169267 1247422
18379A247422M2093K3464J07956K14098K30743K48989L03937M27891N10559N69498
$$ 1247422 1289515 1312979 1420935 1635033 1865776 2114765 2418702 2846593 3357152 3926650
18369C926650P98291J277149J914749K931380M829127Q221444J2193516J1699276
$$ 3926650 4724941 6002090 7916839 10848219 15677346 23898790 36092306 47791582
18361D7791582L666831l173422j063284L188832p91177r757847j2893653r705000
$$ 47791582 51458413 48284991 47221707 50410539 49619362 39861515 26967862 17262862
18353A7262862n875931l409814k137283j395840q90288n85437m20298k89797k14822
$$ 17262862 11386931 7977117 5839834 4443994 3553706 2968269 2547971 2258174 2043352
18344B043352j25702p8438j11915r5680m4176m0738n3419o6708p2095j7879K1450
$$ 2043352 1917650 1839212 1727297 1631617 1587441 1546703 1493284 1426576 1354481 1336602 1358052
18333A358052L5373K0059n4187k3214L3036L5818L3063P7080O9045K3321K6592
$$ 1358052 1393425 1413484 1359297 1336083 1369119 1404937 1438000 1515080 1584125 1607446 1634038
18322A634038J22813J63343K01088K40299L87944M76321N45220O85704J111486
$$ 1634038 1756851 1920194 2121282 2361581 2749525 3225846 3771066 4456770 5568256
18313E568256J755079K659851M275297P232354J0825597J0750723L741293k949114
$$ 5568256 7323335 9983186 14258483 21490837 32316434 43067157 46808450 43859336
18305D3859336j487599K719829k66374q527273j1899617r018189n340190l090234
$$ 43859336 42371737 45091566 44825192 36297919 24398302 15380113 10039923 6949689
18297F949689j890860j209431p97168n44759l55606k35559j82763j25318j35444
$$ 6949689 5058829 3849398 3052230 2507471 2151865 1916306 1733543 1608225 1472781
18288A472781j49173r2450n8691k4736p0713q0368r8152r9538q8425j5579n2574
$$ 1472781 1323608 1231158 1172467 1147731 1077018 996650 898498 798960 710535 694956 642382
18277F42382q8989o2240n0419l5178j5878o735n7536l6792n131M025j5560l0433
$$ 642382 553393 491153 440734 405556 389678 382943 325407 288615 283484 287509 271949 241516
18265B41516j8716J3607R082p921k4695l2494r608L697m678k1157k6688j6155
$$ 241516 222800 236407 245489 237568 212873 180379 170771 174468 169790 148633 121945 105790
18253A05790K541J1679L1702J6264l9793l4447J1858L982J270k0487k8134r964
$$ 105790 108331 120010 151712 167976 128183 93736 105594 109576 110846 90359 62225 52261
18241E2261K7179L2660M5282l598l037j4279m9864j9068L9904M2299K287Q51m307
$$ 52261 79440 112100 157382 153784 150747 136468 86604 67536 107440 149739 152026 152877 148570
18228A48570j2398L3950K008k6106J397Q193l022j5466R989L528j5244k3825j6941
$$ 148570 136172 170122 172130 146024 147421 155614 152592 137126 147115 150643 135399 111574 94633
18215I4633j3625K1096L2779R682j3754m3934l8725J5087J4691M590l4078k314
$$ 94633 81008 102104 134883 144565 130811 86877 48152 63239 77930 82520 48442 46128
18203D6128j7094j4076K0149m091J194K5215K0278l7064j8119J6000K418K2902
$$ 46128 29034 14958 35107 31016 32210 57425 77703 40639 22520 38520 40938 63840
18191F3840M2625Q045l5165j8429j9429n3260J6728K1365J7083K1081N09K389
$$ 63840 106465 114510 79345 60916 41487 -11773 4955 26320 43403 64484 64993 67382
18179F7382O366K6232Q767J1035j6842j4895K0273K2400R058j4546k9982j0645
$$ 67382 73748 99980 108747 119782 102940 88045 108318 130718 139776 125230 95248 84603
18167H4603K6388J8706l581j2837k0395J0859M664P156l556L3239l1222m2605
$$ 84603 110991 129697 126116 113279 92884 103743 108407 115563 112007 145246 114024 71419
18155G1419M989J4138o912J6227q79q039R917o650n174o454K3817l355L6866J0606
$$ 71419 76408 90546 83634 99861 98982 90943 100860 94210 89036 82582 106399 103044 139910 150516
18141A50516j2622J4590K3391J4855O5481J4234J5051L5065L2386M4279L6215
$$ 150516 137894 152484 175875 190730 256211 270445 285496 320561 352947 397226 433441
18130D33441R104J1461J7000M4202J00672Q5782N7408R8778J30312J88641K13770
$$ 433441 442545 454006 471006 515208 615880 701662 759070 857848 988160 1176801 1390571
18119A390571K84335L75634M89919O18790Q48895J303323K040645L336191O008883
$$ 1390571 1674906 2050540 2540459 3159249 4008144 5311467 7352112 10688303 16697186
18110A6697186J1367860K0617318K3329289J94046k3874546k1851848j1440874
$$ 16697186 28065046 48682364 72011653 72205699 48331153 26479305 15038431
18103A5038431n647630l001601j769388j163913p99336n44467l87778l03213k08980
$$ 15038431 9390801 6389200 4619812 3455899 2656563 2112096 1724318 1421105 1212125
18094A212125j46680r2508q6846p3268n9505o1122n9735m2225p3715r3576p0201
$$ 1212125 1065445 972937 886091 812823 753318 692196 632461 590236 516521 422945 352744
18083C52744j8382j2256o745l5863l7314j4067R14k38j0459o069R218k0622k3726
$$ 352744 334362 322106 315361 279498 242184 228117 229031 228793 218334 212265 221483 200861 177135
18070A77135k682J5748j4363k4804J0452R546k277J058m6895l34Q677J3949J6081
$$ 177135 174453 190201 175838 151034 161486 171032 168755 169813 122918 122584 131261 145210 161291
18057A61291j022j4197j5949L505K771k0599j9846r171N885J3759k4953q171l147
$$ 161291 160269 146072 130123 133628 136399 115800 95954 86783 92668 106427 81474 73303 70156
18044G0156J34N941k4539j308P86k6476L0855L3272K416l1691j8133j2688j2752
$$ 70156 70290 76231 51692 50384 51170 24694 55549 88821 91237 59546 41413 28725 15973
18031A5973j805K5648l671r470O967J4277J5032K87j6323j769K444j3131j4392
$$ 15973 14168 39816 36145 26675 33642 47919 62951 63238 46915 45146 47590 34459 20067
18018B0067k0427l619K2187l413j0118Q445K5083l2531k1916J1548k225J8072
$$ 20067 -360 -3979 18208 14795 4677 13122 38205 5674 -16242 -4694 -6919 11153
18006A1153K4628L307j8836J806j7232n314j440p62j8524j7385j3038R459J9414
$$ 11153 35781 39088 20252 22058 4826 -488 -1928 -2690 -21214 -38599 -51637 -42178 -22764
17993b2764j215l999n461l610q293R645L1844L4098m719r234J3315J0382q82l8677
$$ -22764 -23979 -27978 -33439 -37049 -45342 -35697 -3853 30245 25526 16292 29607 39989 39107 430
17979D30k516R861m525r888N041K5612K9968J6704k607K2964J1287m0831m9157
$$ 430 -2086 7775 3250 -6638 -1597 24015 53983 70687 68080 91044 102331 61500 12343
17966A2343j7304m297j4458j6888K6608N2348j251K524N569R30Q394j4632J86
$$ 12343 -4961 -9258 -23716 -40604 -13996 38352 37101 39625 45194 46124 54518 39886 40072
17953D0072O625k607j6610q631N553j9760p812L587J9240j5769j2435J3482L9532
$$ 40072 46697 44090 27480 18849 24402 4642 -3170 417 19657 3888 -8547 4935 44467
17940D4467j2812l1134j8824l871J5542K2383J2378q660j4287j4195K0173J0843
$$ 44467 31655 521 -18303 -22174 -6632 15751 28129 19469 5182 -9013 11160 22003
17928B2003J9623K0059k0565l2059R785J560m6013j8336J4293M3205K8959k3808
$$ 22003 41626 61685 41120 9061 18846 20406 -25607 -43943 -29650 13555 42514 18706
17916A8706j7826o160m359K071j1414Q263p143j4375l0691o410J0120L356N726
$$ 18706 880 -5280 -9639 -7568 -18982 -10719 -17862 -32237 -62928 -69338 -59218 -55862 -50136
17903e0136M1660L5921L612l5681Q502J2555j6026r886O039R804O87Q003r753
$$ -50136 -8476 27445 31057 -4624 3878 16433 407 -9479 -3440 6364 7051 15054 5301
17890E301k3806n199r846J4772R227J6896m090k3626j4753J4201K9407R922K693
$$ 5301 -18505 -23704 -33550 -18778 -9551 7345 3255 -20371 -35124 -20923 8484 18406 21099
17877B1099N372J9658m134k0710J9567O720J1323k3914k9278o179K9392R226j3651
$$ 21099 26471 46129 41995 21285 40852 47572 58895 34981 5703 -476 28916 38142 24491
17864B4491j0890J7453K046k2841j7395j4066J3038j108j1498J0173J5219J7773
$$ 24491 13601 31054 33100 10259 -7136 -21202 -8164 -9272 -20770 -10597 4622 22395
17852B2395J3289J857J8398J4002K607P663P636O1817Q0692M7644R505k6165j0269
$$ 22395 35684 37541 55939 69941 72548 80211 87847 149664 230356 278000 287505 261340 251071
17839B51071n27M662l8241o6914o1828m9112j6985J1486j9862l1343M2161J7405
$$ 251071 250544 255206 216965 150051 88223 39111 22126 33612 13750 -17593 24568 41973
17827D1973l1K4127O890m3688l2431L564L4787j9519k4797q839J6936K5055j8254
$$ 41973 41942 66069 72959 29271 -3160 404 35191 15672 -9125 -17964 -1028 24027 5773
17814E773m210k2641J3380L6933R303k4388r86J8762l3540j1592L000L6142J4675
$$ 5773 1563 -21078 -7698 29235 38538 14150 13164 31926 -1614 -13206 -10206 25936 40611
17801D0611J1795j4292k0047L1677O472N6k5094J2164K7404J7831M3661L6622
$$ 40611 52406 38114 18067 49744 56216 56272 31178 43342 70746 88577 132238 168860
17789A68860K1196R363n284k115J1707j0302m2111l3057j8941p386p331l1333
$$ 168860 190056 199419 194135 192020 203727 193425 151314 118257 99316 91930 84599 53266
17777E3266m695J3820R316j0592k3764J162K9150N5750r886j397n0r935k6420
$$ 53266 48571 62391 71707 61115 37351 38513 67663 123413 113527 112130 112080 102145 75725
17764G5725k4625j5962k0115j6720j3989L288L9672l646J2935J3044j3745j0056
$$ 75725 51100 35138 15023 -1697 -15686 -12398 27274 23628 36563 49607 35862 25806
17752B5806l0609J5985M967j3988l765o70k2988j567l2699J2700J5978J166j7516
$$ 25806 -4803 11182 16149 2161 -1604 -2274 -25262 -26829 -59528 -46828 -30850 -29684 -47200
17739d7200m1407N1139L5343o217l0951j9014K5107O664o621M961j2607L628K129
$$ -47200 -88607 -37468 -2125 -8342 -39293 -58307 -33200 -26536 -33157 -28196 -40803 -37175 -35046
17726c5046p864j0160L6160J3430j811Q233j8705l9331n0L1138J0617J6309L4418
$$ -35046 -42910 -53070 -16910 -3480 -5291 2942 -15763 -55094 -55144 -24006 -13389 2920 37338
17713C7338j2442j7517K597N365K2814p308n5606m7235o40J1188K6775J7817k1208
$$ 37338 24896 7379 9976 15341 38155 30847 -24759 -71994 -72634 -61446 -34671 -16854 -38062
17700c8062o149K1639o140J9403J7087P176Q392J5879p825k3633l920k3225j53
$$ -38062 -44211 -22572 -28712 -9309 7778 14954 23346 39225 31400 7767 3847 -19378 -19531
17687a9531K6215J0115j3236j0782j9199l247L554L8108q368l0269J5034k203
$$ -19531 6684 16799 3563 -7219 -26418 -29665 -26111 11997 3629 -26640 -11606 -13809
17675a3809m463K1789L164j6533l2740L016J0246K288j3956J6246J6868K925Q092
$$ -13809 -18272 3517 6681 -9852 -42592 -39576 -29330 -27042 -40998 -24752 -7884 -4959 3133
17662C133O663o283p348K0323L4869j5550m1834M378K1043J5763k3053k7506j7343
$$ 3133 9796 3513 -3835 16488 51357 35807 -6027 -1649 19394 35157 12104 -15402 -32745
17649c2745l3211J750O000Q011J7284J5415J6401J1839K4416j1693k8277j4423
$$ -32745 -65956 -64206 -58206 -50195 -32911 -17496 -1095 10744 35160 23467 -4810 -19233
17637a9233p856L5158J7267k1469n5115j7936J6305P379K1562K4116k7561R0L41
$$ -19233 -27089 8069 25336 3867 -51248 -69184 -52879 -45500 -23938 178 -27383 -27293 -26952
17624b6952K8889J8539k5593k227j237o388J6855K2078q163k2591l4628J1615
$$ -26952 1937 20476 -5117 -7344 -8581 -14969 1886 23964 15801 -6790 -41418 -29803
17612b9803r741K1072J1945j0739M052j8609k28L773l852L027n920r821J4176
$$ -29803 -39544 -18472 -6527 -17266 -13214 -31823 -32051 -28278 -32130 -29103 -35023 -44844 -30668
17599c0668J52L0826K1960Q3L622J5745k0364j0271j1o346K2331j9569q274K8252
$$ -30668 -30516 310 22270 22353 25975 41720 21356 11085 11074 4728 27059 7490 -784 27468
17585B7468j4558r97l4575o68Q187K0020L2350n584j2903p978L207k1451l5684
$$ 27468 12910 11913 -22662 -23330 -15143 4877 37227 31643 18740 10762 13969 -7482 -43166
17572d3166Q317K5637K051k35J1789K0117L759l9631m0474J2673J9040J5039J5134
$$ -43166 -34849 -9212 -7161 -7396 4393 24510 28269 -11362 -51836 -39163 -20123 -5084 10050
17559A0050l3526J166k420N428k3743J4396R80Q637P064k3952p707k0367K8108
$$ 10050 -23476 -22310 -24730 -19302 -43045 -28649 -27669 -19032 -11968 -35920 -43627 -63994 -35886
17546c5886L0919l166j0684J0703k0310j2537K4075k996k270j1955n805J8424
$$ -35886 -4967 -8133 -18817 -8114 -28424 -40961 -16886 -19882 -22152 -34107 -39912 -21488
17534b1488K1164J9204k4404p519L2098K4001M243J1343l2757k0845l8205J2001
$$ -21488 -324 18880 -5524 -13043 19055 43056 47299 58642 25885 5040 -33165 -21164
17522b1164M5647K4446L336k8477n2480N702J9080L2023K3027j8575j4414j6035
$$ -21164 24483 48929 52265 23788 -28692 -22990 -3910 28113 51140 32565 18151 2116
17510B116o871J5160P301K3044K6233j2149k7411k2996k9104L795J4529l080j2760
$$ 2116 -4755 10405 17706 40750 66983 54834 27423 4427 -24677 -20882 -6353 -9433 -22193
17497b2193o733j3802J1331J1764M0197K5997Q818J378l4527l1518J554M280r614
$$ -22193 -28926 -42728 -31397 -19633 20564 46561 55379 56757 22230 -9288 -7734 -3454 -13068
17484a3068L0869R741j1710l3499J4516j118Q746J4992q277J7628o343l4086k7842
$$ -13068 17801 27542 15832 -17667 -3151 -4269 4477 19469 11192 28820 22477 -11609 -39451
17471c9451Q392N884L3493R037k3234J5233J350k9627o685K5923L1770O350j3876
$$ -39451 -31059 -25175 8318 17355 -5879 9354 10704 -18923 -25608 315 32085 38435 24559
17458B4559k9533m731L830j9027m218L1295R565l1947m891K6984L1744J7250K2372
$$ 24559 -4974 -9705 -5875 -24902 -29120 2175 11740 -20207 -25098 1886 33630 50880 73252
17445G3252J6237J8975J22110J34423O7149j01154j37223q1426m4864m8256j7927
$$ 73252 89489 108464 230574 364997 432146 330992 193769 112343 67479 19223 1296
17434A296K491k3751p720M410J0557J5218o922p139M4636N454j3623L443k8730
$$ 1296 3787 -19964 -27684 -23274 -12717 2501 -4421 -11560 33076 38530 24907 28350 -380
17421c80r107K3059K3532M076K3993J4439j5045k7500l0585J1152j4903l5922
$$ -380 -9487 13572 37104 41180 65173 79612 64567 37067 6482 17634 2731 -33191
17409c3191J7845O64j871K175P957R206M0629j2305l9609m596K602P426K3137
$$ -33191 -15346 -14682 -16553 -14378 -6421 2785 43414 31109 -8500 -13096 -10494 -3068 20069
17396B0069l555o556m5716J7015J6558R228l3252J695M993J7264J9695r089q419
$$ 20069 16514 9958 -35758 -18743 -2185 7043 -26209 -24514 -19521 -2257 17438 8349 -70
17383g0j9939n342L0420o602m0438j6585M98o322l342K0407K7044J5438O635J2220
$$ -70 -20009 -25351 5069 -1533 -41971 -58556 -58058 -64380 -67722 -47315 -20271 -4833 1802 14022
17369A4022o931j3955K147p043J4947N239J0880K2594L809n5673j4938N477M777
$$ 14022 7091 -6864 -4717 -11760 3187 8426 19306 41900 45709 -9964 -24902 -19425 -14648
17356a4648q319J1013j3955n747K9836J9507J0889m437n66J6154j0844k8072k7942
$$ -14648 -22967 -11954 -25909 -31656 -1820 17687 28576 24139 23573 39727 28883 811 -27131
17343b7131o72j4914J2738P748m160R708J0033j6488j2369P187K1542J9232q245
$$ -27131 -27803 -42717 -29979 -22231 -26391 -16683 -6650 -23138 -35507 -28320 -6778 12454 4209
17330D209k8083j5136m602L2718Q610l4210R125M0742j162J8966p161k8137k987
$$ 4209 -23874 -39010 -43612 -10894 -2284 -36494 -27369 13373 12211 31177 24016 -4121 -7108
17317g108K7622J5029Q509j2922k6628k1502K0194o523N762K787m244J0428m360
$$ -7108 20514 35543 44052 31130 4502 -17000 3194 -3329 2433 5220 976 11404 7044
17304G044l3040k178J472J2323K4430l461j8999O540j480J3432O67J0670k422
$$ 7044 -25996 -28174 -26702 -14379 10051 6590 -12409 -5869 -7349 6083 6750 17420 14998
17291A4998P194l0632q374l967R397J7574r36K458j6845j3502j0722j6573k9336
$$ 14998 22192 -8440 -16814 -20781 -11384 6190 5254 7712 -9133 -22635 -33357 -49930 -79266
17278g9266R74J1677K2194J8274L3190M4201j6096l0819k2609j5220J5553l297
$$ -79266 -78292 -66615 -44421 -26147 7043 51244 35148 4329 -18280 -33500 -17947 -21244
17266b1244J0978M358j8182j1051j1107K1050M663j300o120J3494j2570k6811
$$ -21244 -10266 -5908 -24090 -35141 -46248 -25198 -20535 -21835 -27955 -14461 -27031 -53842
17254e3842n482j64J7446J1273K906k857k194N819L3604k7486k3353M156M9500
$$ -53842 -59324 -59488 -42042 -30769 -27863 -30720 -32914 -27095 6509 -20977 -44330 -40174 9326
17241I326J2513J2952r032l057M001k4597k4006K3150k0199j2485o254l96J2835
$$ 9326 21839 34791 25759 22702 26703 2106 -21900 1250 -18949 -31434 -37688 -38084 -25249
17228b5249n794j5159K4996Q147j670J1547K0290K7628j2207l1475j4938o332
$$ -25249 -31043 -46202 -21206 -13059 -14729 -3182 17108 44736 32529 1054 -13884 -20216
17216b0216Q04k996J0239L105N669K7416J1454k5120L04J6126o024q547k5121
$$ -20216 -19412 -22408 -12169 -9064 -3395 24021 35475 10355 10659 26785 20761 12214 -12907
17203a2907o646O609J8244j2731R887p884o612L580K4103J5142R516r539M30l0605
$$ -12907 -19553 -12944 5300 -7431 2456 -5428 -12040 -8460 15643 30785 40301 30762 31192 587
17189E87j7496o42k4420L6653K2869O262O830K4374j9104J71j8845m8639k5235
$$ 587 -16909 -17551 -41971 -5318 17551 23813 30643 55017 35913 36084 17239 -31400 -56635
17176e6635K1575L0548L315L0485L5409j3100j0332j4705l2012K016K9919m814
$$ -56635 -35060 -4512 -1197 29288 64697 51597 41265 26560 -5452 -3436 26483 21669
17164B1669J0725j3203J5749K9108k4921k3126r776K973p818k0230k191k043K9958
$$ 21669 32394 19191 34940 64048 39127 16001 6225 9198 1380 -18850 -21041 -23084 6874
17151F874M789m67J5998l0334l0229N989n113Q249j019L8148M3651Q853k3555
$$ 6874 11663 11196 27194 -3140 -33369 -27380 -32493 -24244 -25263 12885 56536 65389 41834
17138D1834k1278j2722k2112o149j5776M695k822K509L5850L355j7480j4836K649
$$ 41834 20556 7834 -14278 -20427 -36203 -31508 -34330 -31821 4029 7384 -10096 -24932 -22283
17125b2283k1291k0635Q154r167M8126L3550q207Q82j3307j0252O912j975k6812
$$ -22283 -43574 -64209 -56055 -65222 -17096 16454 8247 9129 -4178 -14430 -7518 -9493 -36305
17112c6305j6513J9594k173K3696j1130k4258K8171m532M6801L0260k6795j2502
$$ -36305 -52818 -33224 -35397 -11701 -22831 -47089 -18918 -23450 23351 53611 26816 14314
17100A4314q137n077j4160l3097j0479O667K4113L311K058N522q206L543m4251
$$ 14314 6177 1100 -13060 -46157 -56636 -49969 -25856 -22545 -20487 -14965 -23171 -19628 -63879
17087f3879K8871K0489p005j2927k1819K2299R235m991K1236Q897k956J766J9007
$$ -63879 -35008 -14519 -21524 -34451 -56270 -33971 -24736 -29727 -8491 406 -2550 -784 18223
17074A8223m191j3925Q866L8999k426n314k4284P084R882j0060k7763k3692L499
$$ 18223 14032 107 8973 47972 45546 40232 15948 23032 32914 22854 -4909 -28601 -25102
17061b5102K1798k0623k3114q792J3087K1283N794K05M741J6633P321n987j137
$$ -25102 -3304 -23927 -47041 -55833 -42746 -21463 -15669 -15464 -10723 5910 13231 7244 6107
17048F107k4130m5r776n811J4467P986o423p134J331L611k1202N389M5082J0851
$$ 6107 -18023 -18068 -27844 -33655 -19188 -11202 -17625 -24759 -23428 -19817 -41019 -35630 9452 20303
17034B0303q897K164j143j9270J844K932P457l4393r665J7126j1481K908J8117
$$ 20303 11406 13570 12427 -6843 -4999 -2067 5390 -29003 -38668 -21542 -33023 -30115 -11998
17021a1998O263J9737L769l004r821j0329q921n771M511n933K508J978L1697j1939
$$ -11998 -5735 14002 17771 14767 4946 -5383 -14304 -20075 -15564 -21497 -18989 -17011 14686 2747
17007B747k2956K1821M1564j114k3394j1336o577n123J4100J0428l7663l7065
$$ 2747 -20209 1612 43176 42062 18668 7332 755 -4368 9732 20160 -17503 -54568
16995e4568p563J6007K4135P378J3816j2865K7221J275l5143l4694K7621K4555
$$ -54568 -62131 -46124 -21989 -14611 -795 -13660 13561 14836 -20307 -55001 -27380 -2825
16983b825k8344p669j2541n721K568p667M131K719r540n782j0511P30J7756L6362
$$ -2825 -31169 -38838 -51379 -57100 -54532 -62199 -58068 -55349 -64889 -70671 -81182 -80452 -62696 -26334
16969b6334K46L1404L1738j6063O003n939j1635R036M100j6614m759K3855j9340
$$ -26334 -26088 5316 37054 20991 26994 21055 9420 18456 22556 5942 1183 25038 5698
16956E698j3625N843K4988J7553k149O58k3831P194J0694k0704L058O212r167
$$ 5698 -7927 -2084 22904 40457 38308 38966 15135 22329 33023 12319 15377 21589 12422
16943A2422n018m525r596j4693J6726J5247J091J7967k2958l0851J2740L059p441
$$ 12422 7404 2879 -6717 -21410 -4684 10563 11654 29621 6663 -24188 -11448 -8389 -15830
16930a5830R088J0021J860k1885J6421J610j8100J1632l8142n052J4835J8415
$$ -15830 -6742 3279 5139 -16746 -325 1285 -16815 -5183 -43325 -48377 -33542 -15127
16918a5127l302K1436J4562k3240q163K0077K2690J6259j6528k0239L887J5019
$$ -15127 -18429 3007 17569 -5671 -13834 6243 28933 45192 28664 8425 12312 27331
16906B7331N434L706j6130q045m0573k370L3657J8546l5366k0663J0989J7131
$$ 27331 32765 36471 20341 12296 -28277 -30647 3010 21556 -13810 -34473 -23484 -6353
16894f353N46N259J9809J7968M0486J1852m3589l9867k1979j9728R079J6913K6328
$$ -6353 -5807 -548 19261 37229 77715 89567 45978 6111 -15868 -35596 -26517 -9604 16724
16881A6724j0838J800K47J9525J4275M995q753J0960k3679k2428k8567j8048J9219
$$ 16724 5886 7686 7933 27458 41733 46728 37975 48935 25256 2828 -25739 -43787 -24568
16868b4568P842L6488J0164k0834k8014J2144K3346K0205r113k510j3335k0582
$$ -24568 -16726 19762 29926 9092 -18922 -6778 16568 36773 27660 25150 11815 -8767
16856h767j2050k3724J6722K5809j0396N434p297j2634J9123k0778q863J5748
$$ -8767 -20817 -44541 -27819 -2010 -12406 -6972 -14269 -26903 -7780 -28558 -37421 -21673
16844b1673R646j9108j160O601K255J6390O845L2631M851j0843K975k4898j6784
$$ -21673 -12027 -31135 -32295 -25694 -23439 -7049 -204 32427 37278 26435 29410 4512 -12272
16831a2272J9330J4766p144J540j8322l3723m212j1716K435M6325L837j471l335
$$ -12272 7058 21824 14680 16220 -2102 -35825 -40037 -51753 -49318 -2993 844 -627 -3962
16818c962P211j8588j6996J840J8832Q485j3126l4049J7371K7233M991l255j530
$$ -3962 3249 -15339 -32335 -30495 -11663 -3178 -16304 -50353 -32982 -5749 -758 -4013 -5543
16805e543j5946Q851K946j7555j9043J7090o881Q639j1591K2366K7732k442j1508
$$ -5543 -21489 -12638 -9692 -27247 -46290 -29200 -36081 -27442 -39033 -16667 11065 8623 -2885
16792b885J0468k91J2423j2516K9024r304n6067j2297K1288J899o96n192P089
$$ -2885 7583 7292 19715 7199 36223 26919 -29148 -41445 -20157 -18258 -18954 -24146 -17057
16779a7057J3127j0994j1422o484J0613O945Q366j4479J265K3674k7772o645J0288
$$ -17057 -3930 -14924 -26346 -32830 -22217 -15272 -6906 -21385 -20120 3554 -24218 -30863 -20575
16766b0575P140K2022j3754m822L380P514M838M816k506j9791K207p810q373r756
$$ -20575 -13435 8587 -5167 -9989 -6609 905 5743 10559 8053 -11738 -9531 -17341 -25714 -35470
16752c5470K4060J7898r334m6961r99K4531M0770K6355Q636J84k2084m5247k8678
$$ -35470 -11410 6488 -2846 -49807 -50806 -26275 14495 40850 49486 49670 27586 -17661 -46339
16739d6339l6078J0813J8498j0966j702P664J2665K0646L1265j0444q301j9267
$$ -46339 -82417 -71604 -53106 -64072 -65774 -58110 -45445 -24799 6466 -3978 -12279 -31546
16727c1546K0935J2197N513P723K0680j5428m7927j0428m562r1J5338N999j0060
$$ -31546 -10611 1586 7099 14822 35502 20074 -27853 -38281 -42843 -42934 -27596 -21597 -31657
16714c1657n169P248o06j5127k735J3689J0043j1131j216R904L4422R080O22o176
$$ -31657 -36826 -29578 -30184 -45311 -48046 -34357 -24314 -35445 -36661 -26757 7665 16745 17367 11191
16700A1191o703J6849K1470j1806l689k4613j7149K0759K7258k9887k7109K061
$$ 11191 4488 21337 42807 31001 27312 2699 -14450 6309 33567 3680 -23429 -21368
16688b1368j4114K0160L6374k4190n262n305j9382J2149K920R58J9779K7813p47
$$ -21368 -35482 -15322 21052 -3138 -8400 -13705 -33087 -20938 -18018 -17060 2719 30532 29785
16675B9785j8108l5105j2225J3819o095j4160L735K6890J3989k575k2395k083
$$ 29785 11677 -23428 -35653 -21834 -27929 -42089 -38354 -11464 2525 -50 -22445 -24528
16663b4528J9573J4792N144L980J1874l168j4450o305k428K171K1599k0472j8697
$$ -24528 -4955 9837 14981 18961 30835 27667 13217 6912 4484 6655 28254 7782 -10915
16650a0915J5396J8875J386j9860j00j0058K480j9611k9877k078J8969R390m298
$$ -10915 4481 23356 24742 4882 4782 -5276 -2796 -22407 -52284 -54362 -35393 -26003 -30301
16637c0301j2208n00J1952P38j6947J0038N39K2074j6846m362L0968J0461M873
$$ -30301 -42509 -43009 -31057 -30319 -47266 -37228 -36689 -14615 -31461 -35823 -4855 5606 10479
16624A0479j6012J0362J4924j6336j737n61m9946k2059J749L9742K1655k0011
$$ 10479 -5533 4829 19753 3417 1680 1119 -48827 -70886 -69137 -29395 -7740 -27751
16612b7751r976k142K258p459J8518J4710j6890M891J065K6693K8540P102n612
$$ -27751 -37727 -39869 -37611 -45070 -26552 -11842 -28732 -23841 -22776 3917 32457 39559 33947
16599C3947j9075K79O872p362k651J6191J7338M046n693K6504J8046n8969l1223
$$ 33947 14872 15151 22023 14661 12010 28201 45539 49585 43892 70396 88442 29473 -1750
16586a750k6180J3708K4571K2022q598l0876J5729J4188j2961r879k8562J4520
$$ -1750 -27930 -14222 10349 32371 23773 -7103 8626 22814 9853 -26 -28588 -14068
16574a4068K6577L3585j9417l8386J0412j996K2785R257j6377k5552j9592K6674
$$ -14068 12509 46094 26677 -11709 -1297 -3293 19492 28749 12372 -13180 -32772 -6098
16562f098j2952k5524R356L4790k866r143K5435K319J6406K5423M331l9101j5577
$$ -6098 -19050 -44574 -35218 -428 -3294 -12437 12998 15317 31723 57146 61477 22376 6799
16549F799k928k4245J3990Q963M658k2941J793M235j0788l0299K1198L1247J5648
$$ 6799 3871 -20374 -6384 2579 7237 -15704 -13911 -9676 -20464 -50763 -29565 1682 17330
16536A7330o998k1058l1534P425k4065j2120K9301K2696Q347J9879k0989k5523
$$ 17330 10332 -10726 -42260 -34835 -58900 -71020 -41719 -19023 -10676 9203 -11786 -37309
16524c7309J3040L9590J4432M477p745j1963o610K0764P899j5340Q113l9165j6037
$$ -37309 -24269 15321 29753 34230 26485 14522 7912 28676 36575 21235 29348 -9817 -25854
16511b5854p21j2386j3457K0289J7346J4638K076J1313L080l36j277o078j9181
$$ -25854 -26575 -38961 -52418 -32129 -14783 -145 1931 13244 16324 15988 14711 8633 -10548
16498a0548k579J534m993j4645j0749Q319k5276n95J7565j6803J4520R688j7123
$$ -10548 -13127 -11593 -16586 -31231 -41980 -33661 -58937 -59532 -41967 -58770 -44250 -34562 -51685
16485e1685O071j8401M3184k6850r59J943l212j1960N9358M6630j6651j6250j5431
$$ -51685 -45614 -64015 -20831 -47681 -48640 -46697 -49909 -61869 -2511 44119 27468 11218 -4213
16472d213q332P571L1411k783l8221k1109J3952k0278m12K7352J9698J4529k525
$$ -4213 -12545 -4974 26437 23654 -14567 -35676 -21724 -42002 -42414 -15062 4636 19165 16640
16459A6640m368j4561k4054n571n076Q019M345J2675K2147N759j4227j0930k4207
$$ 16640 12272 -2289 -26343 -31914 -36990 -28971 -24626 -11951 10196 15955 1728 -9202 -33409
16446c3409j898R937J4761L91j403j1231r220k8789m17R040J1231O223q55k6921
$$ -33409 -35307 -25370 -10609 -10218 -11621 -22852 -32072 -60861 -61278 -52238 -41007 -34784 -35639 -62560
16432f2560l2852j0585K0814K4574J0760r735r711K2853R005m747J4766l245J678
$$ -62560 -95412 -105997 -85183 -60609 -49849 -59584 -69295 -46442 -37437 -42184 -27418 -30663 -28985
16419b8985j1793j1192l99K4706J1624J4057L750k688m3685M469K7846O272l5740
$$ -28985 -40778 -51970 -52369 -27663 -16039 -1982 1768 -920 -44605 -40136 -12290 -6018 -41758
16406d1758j6303o734p874K5585L7637k980k0658o537K9389k6653k8269J9145
$$ -41758 -58061 -64795 -72669 -47084 -9447 -12427 -33085 -39622 -10233 -36886 -65155 -46010
16394d6010L3864k3980J6683M0952k9619k1411J3857L1759n759L607j6511k6584
$$ -46010 -12146 -36126 -19443 21509 -8110 -29521 -15664 16095 10336 13943 -2568 -29152
16382b9152O797K9133m771M793j2049K532K650k6998P283K1960J843j0271J0461
$$ -29152 -22355 6778 2007 6800 -5249 -2717 -67 -27065 -19782 2178 4021 -6250 4211
16369D211K370l3378m494K8864K2103m076j214m653k347R311k0540J6622L144
$$ 4211 6581 -26797 -31291 -2427 19676 15600 14386 9733 7386 16697 -3843 12779 15923
16356A5923j4929j2596l5804J6773q924J7745n209q85L906K1011R146n586m2781
$$ 15923 994 -11602 -47406 -30633 -39557 -21812 -27021 -27906 -24000 -2989 6157 571 -42210
16343d2210k7305J5109L7565J3913p320Q746L1835K236J5108l1898q420o956k1215
$$ -42210 -69515 -54406 -16841 -2928 -10248 -1502 30333 32569 47677 15779 7359 403 -20812
16330b0812j0215J5541K4187k0635J3513l961k5493j4197L8037J3788o1542j6665
$$ -20812 -31027 -15486 8701 -11934 1579 -2382 -27875 -42072 -4035 9753 -51789 -68454
16318f8454J3010L4283j2125q817P870N2186J871l4016j381j74O141q78j28K1534
$$ -68454 -55444 -21161 -33286 -42103 -34233 17953 19824 -14192 -15573 -15747 -9606 -10484 -10612 10922
16304A0922J6699j9950j4658J4300j3778j292K1826J8690p505r720M012l0824
$$ 10922 27621 7671 -6987 7313 -6465 -7757 14069 32759 25254 15534 19546 -11278
16292a1278N884Q967k1968k2286q11K3777K0459k8503j9351J2054J0529q822p251
$$ -11278 -5394 3573 -18395 -40681 -41492 -17715 2744 -25759 -45110 -33056 -22527 -31349 -38600
16279c8600q864O485O751L748R663L1579R311J2631k886k3929l6637k5740J0560
$$ -38600 -47464 -40979 -34228 -30480 -20817 10762 20073 32704 29818 5889 -30748 -56488 -45928
16266d5928K2338J0060l4193j2414K3431L2653J7082j6588j6417L2467L9626l1042
$$ -45928 -23590 -13530 -47723 -60137 -36706 -4053 13029 -3559 -19976 12491 52117 21075
16254B1075j6964o04j2063J1454J3990k5553r921r61Q951K0551j613r333Q01K866
$$ 21075 4111 3507 -8556 2898 16888 -8665 -18586 -19547 -10596 9955 8342 -991 -190 2676
16240B676J3090l496j0062m124M085o418j3642k3488k1172Q924J7452P957j2879
$$ 2676 15766 12270 2208 -1916 2169 -4249 -17891 -41379 -62551 -53627 -36175 -28218 -41097
16227d1097m625K2564L7675n766k3796P511K7560j0248k6001j2728J9872L2599
$$ -41097 -45722 -23158 14517 8751 -15045 -7534 20026 9778 -16223 -28951 -9079 23520
16215B3520n27j740k1930Q397J0053j5751l747k7092j1888R122O897J8182K6179
$$ 23520 22993 21253 -677 7720 17773 2022 -1725 -28817 -40705 -31583 -24686 -6504 19675
16202A9675J8119K9355o558j3123l8075j79J8583j8382j1685J1781j135k0955
$$ 19675 37794 67149 60591 47468 9393 9214 27797 9415 -2270 9511 8376 -12579
16190a2579j6633m812K4665l955k4730R432M67j7114K9703Q314J3629K693n688
$$ -12579 -29212 -34024 -9359 -13314 -38044 -28612 -28145 -45259 -15556 -7242 6387 9080 3392
16177C392k682J7974j194o386l8113q370j1031j22K4688k3622N377O981K9160
$$ 3392 710 18684 17490 11104 -27009 -35379 -46410 -46532 -21844 -45466 -40089 -33108 -3948
16164c948M6263j3920j0419M602k7943k7148N561Q296j2365k3512j1471P632J4942
$$ -3948 42315 28395 17976 22578 -5365 -32513 -26952 -18656 -31021 -54533 -66004 -58372 -43430
16151d3430J6623P22M563J2743O144l3685r613j2570N106j0997J0405O4155J4462
$$ -43430 -26807 -26085 -21522 -8779 -2635 -36320 -45933 -58503 -53397 -64394 -53989 10166 24628
16138B4628l212j7967k7109p069L756J165j166J612J941q492j60M055J0109M88
$$ 24628 21416 3449 -23660 -30729 -26973 -25808 -26974 -25362 -23421 -31913 -32073 -28018 -17909 -17421
16124a7421J8905m403o82K3874J4800k5538j4872K8609J8442j6850j813J4171
$$ -17421 1484 -2919 -3601 20273 35073 9535 -5337 23272 41714 24864 23051 37222
16112C7222j7397p207j8583j5758Q891J4301N043j9837m401R065j2017j8386K0562
$$ 37222 19825 12618 -5965 -21723 -12832 1469 6512 -13325 -17726 -8661 -20678 -39064 -18502
16099a8502J1960l0476o563j3890Q129Q164K0288N376k4978k034K0759K1534l0507
$$ -18502 -6542 -37018 -43581 -57471 -49342 -41178 -20890 -15514 -40492 -42526 -21767 -233 -30740
16086c0740r558M0j2263N612K3756L0149L35j1578j9156j0146J3190J5626l611
$$ -30740 -40298 -40258 -52521 -46909 -23153 6996 7331 -4247 -23403 -33549 -20359 -4733 -8344
16073h344r400n663J8346J7384J4028l1294r208K5968K5903j9766k0304N1l625
$$ -8344 -17744 -23407 -5061 12323 26351 -4943 -14151 11817 37720 17954 -2350 -2299 -5924
16060e924J4277O804k0023q513j4609J1466J6360r145j5960N371Q797L561L784
$$ -5924 8353 15157 -4866 -13379 -27988 -16522 -162 -9307 -25267 -19896 -11099 -7538 -3754
16047c754J8521j0716m1249m35K0119J9756K2620k820Q724j0785n2012L369r286
$$ -3754 14767 4051 -37198 -37633 -17514 2242 24862 22042 30766 19981 -32031 -28662 -37948
16034c7948P976J0317P996j7953N621L8409K5386K3278n1350j8343k988r599p270
$$ -37948 -29972 -19655 -11659 -29612 -23991 14418 39804 63082 11732 -6611 -9599 -19198 -26468
16021b6468J9647j9486k4650N151K1550M184q218n228J7435j7028O081l0316J3053
$$ -26468 -6821 -26307 -50957 -45806 -24256 -20072 -28290 -33518 -16083 -33111 -27030 -57346 -44293
16008d4293r237j0599K010K3735P836j8766q907J2911R039j674m884k208k5825
$$ -44293 -53530 -64129 -62119 -38384 -30548 -49314 -58221 -45310 -36271 -37945 -42829 -45037 -70862
15995g0862L3990J9854K454j0290M413R549M752K4724m337j7218P586m350m2508
$$ -70862 -36872 -17018 -14564 -24854 -20441 -10892 -6140 18584 14247 -2971 4615 265 -42243
15982d2243k3496k8374J8169L2397J0142j5402j766J2626j4587L458R396K6465
$$ -42243 -65739 -94113 -75944 -43547 -33405 -48807 -50573 -37947 -52534 -49076 -39680 -13215
15970a3215P424j6159J6699r079K1700r888K8811j7452l9140j688N3901K3168
$$ -13215 -5791 -21950 -5251 -14330 7370 -2518 26293 8841 -30299 -31987 21914 45082
15958D5082R91l9032j6935K0328R259J764K478J7707M666K5911k9419k3553J2810
$$ 45082 46073 7041 -9894 10434 19693 21457 23935 41642 46308 72219 42800 19247 32057
15945C2057p301k8419J7921K4643o757j491j7051L622j14k0140J3383o615j1298
$$ 32057 24756 -3663 14258 38901 32144 30653 13602 17224 17110 -3030 10353 3738 -7560
15932g560j8597j7978j0971q865J0886L7997P400O832L4320p091j5889j6863m511
$$ -7560 -26157 -44135 -55106 -63971 -53085 -15088 -7688 -856 33464 26373 10484 -6379 -10890
15919a0890k9609N512k7411K0308L7590l524q427Q268k46m567q979k3880j1387
$$ -10890 -40499 -34987 -62398 -42090 -4500 -8024 -16451 -8183 -8429 -12996 -21975 -45855 -57242
15906e7242j260o038L486L0240J0910k501j6012j7476L414Q016J6048J0227j3210
$$ -57242 -58502 -64540 -61054 -30814 -19904 -22405 -38417 -55893 -52479 -44463 -28415 -18188 -31398
15893c1398r472L607k4295j8213n53J8534J4668j378J8369K4010p69L795J3664
$$ -31398 -40870 -37263 -61558 -79771 -80324 -61790 -47122 -48500 -30131 -6121 -6890 -3095 10569
15880A0569K2013n101o556j6787m8292j3924O899J6975J8003K6357n18j5187J9498
$$ 10569 32582 27481 20925 4138 -44154 -58078 -51179 -34204 -16201 10156 9638 -5549 13949
15867A3949o753J6075l3057j7643k071J453q423J2702J910P918J6850j2147j2231
$$ 13949 7196 23271 -9786 -27429 -29500 -28047 -36470 -23768 -21858 -13940 2910 -9237 -21468
15854b1468L4671j9241j4682j718P267M16j0921r695K6803k838J1269k3970j1324
$$ -21468 13203 -6038 -20720 -22438 -15171 -14755 -25676 -35371 -8568 -11406 -137 -24107 -35431
15841c5431o657r599K3088P701l447K5706P595l2226J456j9529j3878K0722M851
$$ -35431 -42088 -51687 -28599 -20898 -24345 1361 8956 -23270 -21814 -41343 -55221 -34499 -29648
15828b9648j7454J8080P736K0287K3302l57q381j6723k0889J0337j934p775J027
$$ -29648 -47102 -29022 -21286 -999 22303 21946 13565 -3158 -24047 -13710 -15644 -23419 -22392
15815b2392J9807m943J1832k9329J056L3055j374q705L2097Q024r651j6737o958
$$ -22392 -2585 -7528 4304 -25025 -23969 9086 7712 -993 31104 39128 29477 12740 5782
15802E782j3057k1904r399j3594K0990J121J9633J8713j4842j0399O216J9331
$$ 5782 -7275 -29179 -38578 -52172 -31182 -30061 -10428 8285 -6557 -16956 -10740 8591
15790H591M04k5156k3358J0044q420o983J3903j076k0616K2114J8524M711J4855
$$ 8591 8995 -16161 -39519 -29475 -37895 -44878 -30975 -32051 -52667 -30553 -12029 -7318 7537
15777G537J1964j4071m4408Q514L3284J0659n305j2601J1250k654k8240l227L2297
$$ 7537 19501 5430 -38978 -30464 2820 13479 8174 -4427 6823 4169 -24071 -27298 4999
15764D999r302j5693Q190J7902J9468K0680Q229j0225k1348P732J283j2118k881
$$ 4999 -4303 -19996 -11806 6096 25564 46244 54473 44248 22900 30632 31915 19797 16916
15751A6916J153K1135l8575k8282N559K634Q350j1345k9318o296M3937J7155K161
$$ 16916 18069 39204 629 -27653 -22094 -19460 -11110 -22455 -51773 -58069 -14132 3023 5184
15738E184j225J3310k024l6613K361k5143J49J8167j6278k0163J0817K8627N1492
$$ 5184 3959 17269 15245 -21368 -19007 -44150 -44001 -25834 -42112 -62275 -51458 -22831 28661
15725B8661J5683p346k345l1048L975J1096J2775m873k8435j2669j2401R610J6652
$$ 28661 44344 36998 34653 3605 7580 18676 31451 26578 -1857 -14526 -26927 -17317 -665
15712f65j7836p019K0196J3458j978j9553o470O676k2071L9036K6727J2968j27
$$ -665 -18501 -25520 -5324 8134 6156 -13397 -19867 -13191 -35262 3774 30501 43469 43342
15699D3342m7041r715J483K1996%O290K390p394l1531P528L0672l466k864J292
$$ 43342 -3699 -13414 -11931 10065 10065 16355 18745 11351 -20180 -12652 18020 14554 11690 12982
15685A2982q956j5900k424J0713q47j9005J4274m167M776O216K014J9666L588
$$ 12982 4026 -11874 -14298 -3585 -4432 -23437 -9163 -13330 -8554 -2338 -324 19342 22930
15672B2930R560J493l4760j6071n995K3115K1101j3893m422lj2620l215J710o216
$$ 22930 32490 33983 -777 -16848 -22843 272 21373 7480 3058 3055 -9565 -12780 -11070 -17286
15658a7286M594J4673q578n105M389j4476m326n682q491Q446J0213p014J3641
$$ -17286 -12692 1981 -6597 -11702 -7313 -21789 -26115 -31797 -40288 -31842 -21629 -28643 -15002
15645a5002L830P642l7020m939J1095M737J8930Q840n11j4533P404j2300j650
$$ -15002 -11172 -3530 -40550 -45489 -34394 -29657 -10727 -1887 -2398 -16931 -9527 -21827 -23477
15632b3477J7933N713j9768L855J8760K1980j5421j9555M34J8281L3870l497l962
$$ -23477 -5544 169 -19599 -15744 3016 24996 9575 -9980 -9546 8735 42605 39108 35146
15619C5146q610k8172m5166J4636n834j7659L710R148J8470P921o687J4223N550
$$ 35146 26536 -1636 -46802 -32166 -38000 -55659 -51949 -42801 -24331 -16410 -23097 -8874 -3324
15606c324j0279n253J5775j3404m448J1687K1539j8122k2869j9921J3780j0376
$$ -3324 -13603 -18856 -3081 -16485 -20933 -9246 12293 -5829 -28698 -48619 -34839 -45215
15594d5215Q115J7279j0062K1076L5798j3716j5142L213m163K456K2651j3457
$$ -45215 -37100 -19821 -29883 -8807 26991 13275 -1867 1346 -2817 -361 22290 8833
15582H833o396J1462k9818J93k4036j6973K347K5315L1423P805l8238m578O318
$$ 8833 2437 13899 -15919 -15726 -39762 -56735 -54388 -29073 2350 10155 -28083 -32661 -26343
15569b6343p999J042j039J8851J5761o811r583J573K4589l1879o26K5785L0958
$$ -26343 -34342 -33300 -34339 -15488 273 -6538 -16121 -14548 10041 -21838 -22464 3321 34279
15556C4279l9565j3930J0633J3036j5947j4711J7607K1821J820j2597j0335R005
$$ 34279 -5286 -19216 -8583 4453 -11494 -26205 -8598 13223 15043 2446 -7889 1116
15544A116N075K4136N674j6018j7442O319k6371m5777J566P238J9328m219j3017
$$ 1116 6191 30327 36001 19983 2541 8860 -17511 -63288 -61722 -54484 -35156 -39375 -52392
15531e2392k5378j5654K8152L3216Q687m849R09K1220O736J049o377k2619K813
$$ -52392 -77770 -93424 -65272 -32056 -23369 -28218 -27309 -6089 647 1696 -4681 -27300 -24487
15518b4487K1656m933j8456j1431J8198q711J5879N4k054J1082R557J1186N833
$$ -24487 -2831 -7764 -26220 -37651 -19453 -28164 -12285 -12231 -14285 -3203 6354 17540 23373
15505B3373l5045m9455l218K6158K4339O709p375J3901J5282P418j5505k2316
$$ 23373 -11672 -61127 -64345 -38187 -13848 -7139 -14514 -613 14669 22087 6582 -15734
15493a5734l3007K6320l980K523j996O951k0323M155K6732J7434J1205J0512k0545
$$ -15734 -48741 -22421 -26401 -23878 -25874 -18923 -39246 -35091 -8359 9075 20280 30792 10247
15480A0247n3229j9453M5949M3659J3273k0823m205k2658r859N70K3698K3027
$$ 10247 -42982 -62435 -16486 27173 40446 19623 15418 -7240 -17099 -16529 7169 30196
15468C0196O991R191j693j6432J5053R281j0889j6987j2104k5209j3586K2777
$$ 30196 37187 46378 44685 28253 43306 52587 41698 24711 12607 -12602 -26188 -3411
15456c411J2095k0139k4872K6090L9851J2343j1991j0427K0246J0131K310k6312
$$ -3411 8684 -11455 -36327 -10237 29614 41957 29966 19539 39785 49916 52226 25914
15444B5914l6408L8689p839J978O782k9610p385M938o564m781O796Q170Q062O753
$$ 25914 -10494 28195 20356 22334 29116 -494 -7879 -2941 -9505 -14286 -7490 680 8742 15495
15430A5495j423r092m657o981j4350k559O270J7980k19n618M465k307m2578k6957
$$ 15495 14072 4980 323 -6658 -21008 -23567 -17297 683 464 -5154 -689 -2996 -45574 -72531
15416g2531j7682J1613L0030K027O947J638n66j0980R238J7098J5774j1671q88
$$ -72531 -90213 -78600 -48570 -46543 -39596 -37958 -38524 -49504 -40266 -23168 -7394 -19065 -19953
15403a9953m56j2819k6930J9911J6869J4932q759M307J0855J4933k6109r334j7928
$$ -19953 -20409 -33228 -60158 -40247 -23378 -8446 -17205 -12898 -2043 12890 -13219 -22553 -40481
15390d0481l1591O684L7397O488j2969K194K1975L2797M079l2993k5463J2851
$$ -40481 -72072 -65388 -27991 -21503 -34472 -32278 -10303 22494 26573 -6420 -31883 -19032
15378a9032K3667j3871k2270J0481o908n297J0066n196J5714j2023J0631J1368
$$ -19032 4635 -9236 -31506 -21025 -27933 -33230 -23164 -28360 -12646 -24669 -14038 -2670
15366b670K442j1585m553J3483q598Q96L193q189j0515L928J2734J1944n825K875
$$ -2670 -228 -11813 -16366 -2883 -11481 -10585 -7392 -15581 -26096 -22168 -9434 2510 -3315 -440
15352d40j1078K0766L5176j6951q054j3357j7364o032J6236P637j3937P198j531
$$ -440 -11518 9248 44424 27473 19419 6062 -11302 -17334 -1098 6539 -7398 -200 -1731
15339a731K667J1505k7256j2009j5916K4406R392K738K114R740K6393p51k8944
$$ -1731 936 12441 -14815 -26824 -42740 -18334 -8942 -6204 -4090 5650 32043 31292 2348
15326B348J7065J09j7296K564K5355j8995J6976q011k2147j5623L1051J6888J311
$$ 2348 19413 19522 2226 4790 30145 11150 28126 20115 -2032 -17655 13396 30284 31595
15313C1595J91j6651k4739q893m229p437p511o02J766L3847K6872k2766O856j3283
$$ 31595 31786 15135 -9604 -18497 -22726 -30163 -37674 -38276 -36510 -2663 24209 1443 8299 -4984
15299d984k2091m502K6822K517l6422J9856J035k3875o68J5660J3959j4866J3317
$$ -4984 -27075 -31577 -4755 -2238 -38660 -18804 -17769 -41644 -42312 -26652 -12693 -27559 -14242
15286a4242J3140j2661Q923J1879J037j897p404j9404j4295J0296K0882j7558
$$ -14242 -1102 -13763 -4840 7039 8076 6179 -1225 -20629 -34924 -24628 -3746 -21304
15274b1304J8843J3632R722j930q805k9393j0708L102K4970R372M630j43j1632
$$ -21304 -2461 11171 20893 18963 10158 -19235 -29943 -26841 -1871 7501 12131 11988 356
15261C56p455K3063L420J0112O57j4225K2269K2000j9787l1043j4188J471j6188
$$ 356 -7099 15964 19384 29496 30153 15928 38197 60197 40410 9367 -4821 -3350 -19538
15248a9538j5812l988M749K9451R596L963o167J1766K2727L513j6449l066l0017
$$ -19538 -35350 -39338 -34589 -5138 4458 8421 2254 14020 36747 40260 23811 20745 -9272
15235i272k2497k3142m56L7872J9426j6231j2647j2177j100K8035J5095j6177
$$ -9272 -31769 -54911 -55367 -17495 1931 -14300 -26947 -39124 -40224 -12189 2906 -13271
15223a3271j9211p446M0869N826o11k9609k2515J2031K0241L1580M238j8438q947
$$ -13271 -32482 -39928 941 6767 6156 -23453 -45968 -33937 -13696 17884 22122 3684 -5263
15210e263L7068K360k0667m7466q234M9199N0016p905j7799o767l071m0517l525
$$ -5263 31805 34165 13498 -33968 -42202 6997 57013 49108 31309 24542 21471 -19046 -22571
15197b2571K9113L8417J4112k1756k8548L367R873l4551K2446K1868k2087k8596
$$ -22571 6542 44959 59071 37315 8767 12134 22007 -12544 9902 31770 9683 -18913
15185a8913o112L1585K4691j1324j2803k3243l509J7233J425Q273J7967L422O378
$$ -18913 -25025 6560 31251 19927 7124 -16119 -19628 -2395 -970 7303 25270 28692 35070
15172C5070l6926j9539J4335K7131q215l550j1980l6807k484k206K8617J6380
$$ 35070 -1856 -21395 -7060 20071 11856 8306 -3674 -40481 -42965 -45171 -16554 -174
15160a74j7190j0425j7026k9196J1267M0976J9287L3768j2849l1127K2172N89
$$ -174 -17364 -27789 -44815 -74011 -62744 -21768 -2481 31287 18438 -12689 9483 10072
15148A0072j3489Q281p810j1263R364n582k521k3289j7529J3308J4696j6699l6700
$$ 10072 -3417 4864 -2946 -14209 -4845 -10427 -12948 -36237 -53766 -40458 -25762 -42461 -79161
15135g9161J2347M7782J8689o174n59r530j0003J552l272K1091J3153N642K3783
$$ -79161 -66814 -19032 -343 -6517 -7076 -16606 -26609 -25057 -28329 -7238 5915 11557 35340
15122C5340J1627j1875j2976J3415Q70j2506r941j1796K3373j1113k3300R310
$$ 35340 46967 35092 22116 35531 36401 23895 13954 2158 25531 14418 -8882 428
15110D28K9985p254j4220k6587J5890J5966J1094n079O791K9200j3831m1918l2667
$$ 428 30413 23159 8939 -17648 -1758 14208 25302 20223 27014 56214 42383 465 -32202
15097c2202l710j0593J3116J495J9254K0599j6952j0039r024J7818L8722n838
$$ -32202 -35912 -46505 -33389 -31894 -12640 7959 -8993 -19032 -28056 -10238 28484 22646
15085B2646l2282p660J1512k624k6117N432o185o730J0297r3L4772J6685j9460
$$ 22646 -9636 -17296 -5784 -8408 -34525 -29093 -35278 -42008 -31711 -31804 2968 19653 193
15072A93k9106q56j5282L4464k622j8801r719o701q814K4406L3717J0257R847
$$ 193 -28913 -29769 -45051 -10587 -13209 -32010 -41729 -48430 -57244 -32838 879 11136 20983
15059B0983q03j7348k3103l4842q478J9018J1217p751J7295J5344k445k8241j2248
$$ 20983 20180 2832 -20271 -55113 -63591 -44573 -33356 -41107 -23812 -8468 -10913 -39154 -51402
15046e1402j3013J6732K2880K5160J1896J1201M35j3236M968r513l9911m5443
$$ -51402 -64415 -47683 -24803 357 12253 23454 23889 10653 15621 6108 -33803 -79246
15034g9246R411M0089M4163K3008j9901J516n2057Q153J8796K1703n174j0537
$$ -79246 -69835 -29746 14417 37425 17524 19040 -33017 -24864 -6068 15635 10461 -76
15022g6L632L016N694j0199L1364j2628j3472L316K566l6835j3440l081J8694
$$ -76 3556 6572 12266 2067 33431 20803 7331 10647 13213 -23622 -37062 -40143 -21449
15009b1449R529P65K9853K7830k2409j3924M794K390j8512n484j2494j6081O323
$$ -21449 -11920 -11155 18698 46528 24119 10195 14989 17379 -1133 -6617 -19111 -35192 -28869
14996b8869R930k2726l4985k169L5071K613j0306L3113K996j5542P400o060M000
$$ -28869 -18939 -41665 -76650 -78819 -43748 -41135 -51441 -18328 -15332 -30874 -23474 -29534 -25534
14983b5534L6870N705l1097k8359J2653J8659J093J2465L1968O174l0994j7471
$$ -25534 11336 17041 -14056 -42415 -29762 -11103 -10010 2455 34423 40597 9603 -7868
14971g868j0693l6452q560K3153J3886j0934L304J9013k0571k0696J5566j4449
$$ -7868 -18561 -55013 -63573 -40420 -26534 -37468 -34164 -15151 -35722 -56418 -40852 -55301
14959e5301J5319J5567R463L446j4126J6098J9586J8540k117l7452j8366N388
$$ -55301 -39982 -24415 -14952 -11506 -25632 -9534 10052 28592 26475 -10977 -29343 -23955
14947b3955J03l881J2002p180k2533J1920M5040J2794k4399J937L243P12j1720
$$ -23955 -23852 -27733 -15731 -22911 -45444 -33524 11516 24310 -89 1848 5091 5803 -5917
14934e917j100K7851q870n3176r003L0220J5331J72J0929K8976K435k1002j3023
$$ -5917 -7017 20834 11964 -41212 -50215 -19995 -4664 -4492 6437 35413 37848 16846 3823
14921C823j0876l31K2332N382L144K173l757N833J438n897J895q345k7488J5575
$$ 3823 -7053 -7384 14948 20330 23474 25647 21890 27723 29161 23264 25159 16814 -10674 4901
14907D901l691J3407K0991l7287l9804l2412P454M8556J3065j9938l049Q610j7670
$$ 4901 1210 14617 35608 -1679 -41483 -73895 -66441 -17885 -4820 -24758 -27807 -19197 -36867
14894c6867O377N023K758J3152n800L632o860j693L7032j6133j4490q037O716
$$ -36867 -30490 -25467 -22709 -9557 -15357 -11725 -18585 -20278 16754 621 -13869 -21906 -15190
14881a5190j4584J8960l119j9031r961n648r947k7596O263L7269J3387K8706j7841
$$ -15190 -29774 -10814 -13933 -32964 -42925 -48573 -58520 -86116 -79853 -42584 -29197 -491 -18332
14868a8332p070J3288M429K2178N809m464k0239m982K0378J7497j6576j2952m879
$$ -18332 -25402 -12114 -7685 14493 20302 15838 -4401 -9383 10995 28492 11916 -1036 -5915
14855e915J6988J8233M514P228j0093k6315j7854j7733K4673J6192L323m750J3412
$$ -5915 11073 29306 33820 41048 30955 4640 -13214 -30947 -6274 9918 13241 8491 21903
14842B1903J2078j9958j4460M276j5803k3127L69K0826R853J8350J3383l5945
$$ 21903 33981 14023 -437 3839 -11964 -35091 -34722 -13896 -4043 14307 27690 -8255
14830h255k7313J022J5225k968J1267Q223L2757K4494j2357N735j8991o239k3205
$$ -8255 -35568 -34546 -19321 -22289 -11022 -2799 29958 54452 42095 47830 28839 22600 -605
14817f05M1K202R528n615j8827R568N731J8R68p603k7074j7054J3938O3781j1157
$$ -605 -564 1638 11166 5551 -13276 -3708 2023 2041 3009 -4594 -31668 -48722 -34784 28997 17840
14802A7840k6189j6625k0682j7275l370Q636J8243J7444J4044j0641M7259K926
$$ 17840 -8349 -24974 -45656 -62931 -66301 -57665 -39422 -21978 -7934 -18575 28684 31610
14790C1610k4211K4907J3779j2818n6687l183O945L319J2107J6125N23L525K4704
$$ 31610 7399 32306 46085 33267 -23420 -26603 -19658 -16339 -4232 11893 12416 15941 40645
14777D0645r658m2518k0887K4011J3941j0515P709N9271j0721k7946k146R579
$$ 40645 30987 -11531 -32418 -8407 5534 -4981 2728 61999 51278 23332 21186 30765
14765C0765k9449m9602n852O142Q967j058j856n155R063J7178M0903K6602j0739
$$ 30765 1316 -48286 -54138 -47996 -39029 -40087 -41943 -47098 -38035 -20857 20046 46648 35909
14752C5909m0594o194j8804o08K6242q982j9238J7835l7841n443N0956J7502O748
$$ 35909 -4685 -10879 -29683 -30291 -4049 -13031 -32269 -14434 -52275 -57718 -6762 10740 17488
14739A7488m565q560K5337n804k3265p963K5653j9125n032K0383M037Q762l238
$$ 17488 12923 4363 29700 23896 631 -7332 18321 -804 -5836 14547 18584 27346 24108
14726B4108L882K549j5110j9358Q432J3121n08j968M123k6907j2852l1869r234
$$ 24108 27990 30539 15429 -3929 4503 17624 17116 15148 19271 -7636 -20488 -52357 -61591
14713f1591J0283N0982L1987q296q030K24k1040K2349l133j862k95p237J1200
$$ -61591 -51308 -326 31661 23365 15335 15559 -5481 16868 13735 11873 11578 4341 15541
14700A5541J5373k4601l6040J441K2881j0604j014j130K5234p171j6510L2369
$$ 15541 30914 6313 -29727 -28286 -5405 -16009 -17023 -18153 7081 -90 -16600 15769
14688A5769K3109j0608k0901j2347j6913n845k706K3783O371o22J2826n193q21
$$ 15769 38878 28270 7369 -4978 -21891 -27736 -30442 -6659 -288 -910 11916 6723 5902
14675E902J7027M973J925p125r411r334J6079O244p403o456k524r318p859q775
$$ 5902 22929 27902 29827 22702 13291 3957 20036 26280 18877 12421 9897 579 -7280 -16055
14661a6055K0783p473J1571J004L643k459Q693J4209n225j9138k6121p814L977
$$ -16055 4728 -2745 8826 9830 13473 11014 19707 33916 28691 9553 -16568 -24382 -20405
14648b0405N091k100l568j038j7028K224K1142k6925j5413J1276K3672M2533Q168
$$ -20405 -15314 -17414 -20982 -22020 -39048 -36824 -15682 -42607 -58020 -46744 -23072 19461 27629
14635B7629k5161j6196N258N729K5227P105j2450j2481K796J978j2393J2826J1566
$$ 27629 2468 -13728 -8470 -2741 22486 29591 17141 4660 7456 9434 -2959 9867 21433
14622B1433O724j1819j5699Q460L7206J769l329o766k1862m8048J95K7129q650
$$ 21433 28157 16338 639 9099 46305 48074 44745 37979 16117 -31931 -31736 -4607 -13257
14609a3257j6036K494J4164j902N091j4084Q872J357p047O459k1715k079L052
$$ -13257 -29293 -26799 -12635 -14537 -9446 -23530 -14658 -13301 -20348 -13889 -35604 -37683 -34631
14596c4631P328K8060M2565L345k6957j093L951k2160j6263K0753Q559n528k3742
$$ -34631 -27303 757 43322 46667 19710 18617 22568 408 -15855 4898 13457 7929 -15813
14583a5813j7360Q765M2685L0848l1223l9399J1233M503m2643j7000L118K3785
$$ -15813 -33173 -24408 18277 49125 17902 -21497 -10264 -5761 -48404 -65404 -62286 -38501
14571c8501K3387l277L3672l613J2456K5409j3324j3649j1719k2897j3135j6873
$$ -38501 -15114 -18391 15281 11668 24124 49533 36209 22560 10841 -12056 -25191 -42064
14559d2064J5325j7908j0964L1693K8736P101l9847N097J1076J5156k173J7073
$$ -42064 -26739 -44647 -55611 -23918 4818 11919 -27928 -22831 -11755 3401 1228 18301
14547A8301j0678K463J0369R651o15K22k7675J0580m053J8828j5229r148J5255
$$ 18301 7623 10086 20455 30106 29491 29713 2038 12618 8565 27393 12164 3016 18271
14534A8271j5014p576j0879k707j6433l2841L4561N261M971o545k0600K35J1549
$$ 18271 3257 -4319 -15198 -17905 -34338 -67179 -32618 -27357 -22386 -28931 -49531 -49296 -37747
14521c7747J474P277O782J01P052r804k1251p903Q772k66q895R044Q820J0913
$$ -37747 -36273 -28996 -22214 -22113 -15061 -24865 -46116 -54019 -45247 -45513 -54408 -45364 -36544 -25631
14507b5631Q825n010j9547k1571K8253K5880k4789k5591J782K9942J5815j5399
$$ -25631 -16806 -21816 -41363 -62934 -34681 -8801 -33590 -59181 -57399 -27457 -11642 -27041
14495b7041j4798Q537M1846L7887j7421l6453j2668m637n323k1862J37L115K3528
$$ -27041 -41839 -33302 8544 46431 29010 -7443 -20111 -24748 -30071 -51933 -51796 -48681 -25153
14482b5153J8643K9349J4619j5425k8519o44J4824K359j7545p289J0204k3643
$$ -25153 -6510 22839 37458 22033 -6486 -7130 7694 10053 -7492 -14781 -4577 -28220
14470b8220q063K8192O835q662J6241K9494l4599r902k136J9356J4261R787j2716
$$ -28220 -36283 -8091 -1256 -9918 6323 35817 1218 -8684 -10820 8536 22797 32584 19868
14457A9868k732q548m2540j4071K8060K5803p489l0106n544k1132L2735P290M2660
$$ 19868 17136 8588 -33952 -48023 -19963 5840 -1649 -31755 -37299 -58431 -25696 -18406 24254
14444B4254K9833o640k8408k7275o175J7194Q706J0954J0942j093k3387m0046
$$ 24254 54087 47447 19039 -8236 -14411 2783 11489 22443 33385 32292 8905 -31141
14432c1141o179N938L1369J43P073k6860p815K2513o593J7386q364O040K5020
$$ -31141 -37320 -31382 -13 130 7203 -19657 -27472 -4959 -11552 5834 -2530 3510 28530
14419B8530J940k7707q78J1849n462l8005N048K1344J2949j2072n150j6555k1194
$$ 28530 30470 2763 1885 13734 8272 -29733 -24685 -3341 9608 -2464 -7614 -24169 -45363
14406d5363l097R322L9943J9064O834k3014L77j887j4824j3503k1630j635J2265
$$ -45363 -48460 -39138 805 19869 26703 3689 4066 2179 -12645 -26148 -47778 -49413 -37148
14393c7148J477K210R66R220k812M205M373l0213M737L995p806n513k232O36J4987
$$ -37148 -35671 -33461 -32495 -23275 -26087 -21882 -17509 -47722 -42985 -38990 -46796 -52309 -54541 -53905 -38918
14378c8918R214J708L1177K1823j9366l1898J8363J8970k1562Q546q088l8327
$$ -38918 -29704 -27996 3181 25004 5638 -26260 -7897 11073 -10489 -1943 -10031 -48358
14366d8358j4757L0148K8193L3034K8030r470j392k2866l3513j311L180Q748j9892
$$ -48358 -63115 -32967 -4774 28260 56290 46820 45428 22562 -10951 -12262 -9082 -334 -20226
14353b0226J9109L8199J7486n2716l8818q638J0660J6933Q225j7152K770K0045
$$ -20226 -1117 37082 54568 1852 -36966 -45604 -34944 -18011 -9786 -26938 -24168 -4123
14341d123p04M932Q31J6512l0149p864j9379l752q136K0409J7810q226J6575k0411
$$ -4123 -4827 105 936 17448 -12701 -20565 -39944 -43696 -51832 -31423 -13613 -21839 -5264 -25675
14327b5675j5446j4617r49J8754J8013J4025m140k8750K3065J6274m1590J6542
$$ -25675 -41121 -55738 -56687 -37933 -19920 -5895 -10035 -38785 -15720 554 -41036 -24494
14315b4494K9174O41O493L607J0582j2404m8088m6260j0208K441L9151j9219K994
$$ -24494 4680 5321 11814 15421 26003 13599 -34489 -80749 -90957 -88516 -49365 -68584 -65590
14302f5590P1650J6136n423q46j4354l9789l3734K0643K9618Q237R513j4826J8193
$$ -65590 6060 22196 16773 15927 1573 -38216 -71950 -51307 -21689 -13452 -3939 -18765 -572
14289e72r802k0546r424o112M0136O527p62n150R390p966R985L5879j6853l018
$$ -572 -10374 -30920 -40344 -46456 -6320 207 -555 -5705 3685 -4281 5704 41583 24730 21712
14275B1712R716K990j2925m2921o489J3197L0267K1513l9301k3935k0630J4311
$$ 21712 31428 34418 21493 -21428 -27917 -14720 15547 37060 -2241 -26176 -46806 -32495
14263c2495L434J2496L2064L0880j2203k5464j5094k515O613n045j4440r42K7425
$$ -32495 -29061 -16565 15499 46379 34176 8712 -6382 -8897 -2284 -7329 -21769 -22711 4714
14250D714L0908o423k3699l5571K674J1535L997k8103j240P771J1123k8565l9376
$$ 4714 35622 29199 5500 -30071 -27397 -15862 -11865 -39968 -41208 -33437 -22314 -50879 -90255
14237i0255N0570L2873Q573j588J7341J9455m9180k1461J0863j1286J108K4327
$$ -90255 -39685 -6812 1761 173 17514 36969 -12211 -33672 -22809 -34095 -32987 -8660
14225h660J4551j0650k4715r483L1176j5311j0277m426m626J4873K3513K148K1915
$$ -8660 5891 -4759 -29474 -38957 -7781 -23092 -33369 -37795 -42421 -27548 -4035 -1887 20028
14212B0028J4295J9317j7865k7992J8550J2581j4521p307K6342L439r403J2365
$$ 20028 34323 53640 35775 7783 26333 38914 24393 17086 43428 46867 37464 49829
14200D9829j6732l3782k7981k3182o304R036J9497j6678M291n17J3046K9155J5497
$$ 49829 33097 -685 -28666 -51848 -58152 -49116 -29619 -46297 -42006 -42523 -29477 -322 15175
14187A5175K1064Q32j6141j7828N420J4072J9861j4973K167k7914l8371j041K5351
$$ 15175 36239 37071 20930 3102 8522 22594 42455 27482 29649 1735 -36636 -37677 -12326
14174a2326J8621P110j4409m6784j5365o049L7303N0260J0195j1616k4431L585
$$ -12326 6295 13405 -1004 -47788 -63153 -69202 -31899 18361 28556 16940 -7491 -3906
14162c906M050N225L433J5384l864O115k6277L125P405l851j8034k9191PK088
$$ -3906 144 5369 8802 24186 20322 26437 160 3285 10690 6839 -11195 -40386 -40379 -38291
14148c8291o958M1047K3412k2640M558J9149n207j4557L658p711M420O102l758
$$ -38291 -45249 -4202 19210 -3430 1128 20277 15070 513 4171 -3540 880 6982 3224
14135C224J1379J7003J2558k2397l793L801K029P572N035o994l6173J9311L4093
$$ 3224 14603 31606 44164 21767 17974 21775 23804 31376 36411 29417 -6756 12555 46648
14122D6648O68O569J6382O1917L6002j3922n8899k8006p650o485k5843k540K425
$$ 46648 47316 53885 70267 132184 168186 154264 95365 67359 59709 53224 27381 24841 27266
14109B7266L8908q545k4376N186q300j5394O292k1716j0370J2771L6803m252l322
$$ 27266 66174 57629 33253 38439 30139 14745 21037 -679 -11049 1722 38525 34273 30951
14096C0951Q603L616j7436j3125J4776N560l5995k8355J5572K9239L5734R635
$$ 30951 39554 43170 25734 12609 27385 32945 -3050 -31405 -15833 13406 49140 58775
14084E8775l0877l807J8015N76K7818J8123J2080M5411J00985Q7221R7609Q5632
$$ 58775 27898 24091 42106 42682 70500 88623 100703 146114 247099 334320 431929 517561
14072E17561J0140j03945j24085r0016o6112o6144p8769J1915R05O612P848J5682
$$ 517561 527701 423756 299671 209655 143543 77399 -1370 10545 11450 18062 25910 41592
14060D1592K053j2283m1996O168L2879L4910J927p199j1625L556r584k7490j1371
$$ 41592 43645 31362 -10634 -4466 28413 63323 65250 58051 46426 49982 40398 12908 1537
14047A537k4228k595K0279J7073L696l0168L7941J7816J7566j829k3972k2373
$$ 1537 -22691 -25286 -5007 12066 15762 -14406 23535 41351 58917 57088 33116 10743
14035A0743L6099N1668K5799M9062O4708R8263J35269P3835l166j05941j50957
$$ 10743 46842 98510 124309 173371 238079 336342 471611 545446 542280 436339 285382
14024B85382r9000o5008m4878l9213L770P855q676j244r10r93j4135J6323J0051
$$ 285382 186382 121374 76496 37283 41053 48908 40232 38988 38078 37085 22950 39273 49324
14011D9324L536N709k267k5143R439M244l8452k2300J5064m40m381K9942J8568
$$ 49324 52860 58569 56302 31159 40598 44842 6390 -15910 -846 -1286 -5667 24275 42843
13998D2843k0431k7968l2911J1434K8200L9695J2906j2938j9190J3250J9859K0031
$$ 42843 22412 -5556 -38467 -27033 1167 40862 53768 40830 21640 34890 54749 74780
13986G4780j5764M3460M4289K6851j0138m7746j4600n224l5949l9858k9560L3059
$$ 74780 59016 102476 146765 173616 163478 115732 101132 95908 59959 20101 -9459 23600
13974B3600L7628M029j643O31k1943r546j055q794J4609k4162j8042k872J7712
$$ 23600 61228 65257 63614 64245 42302 32756 31701 22907 37516 13354 -4688 -7560 10152
13961A0152Q907J3394M430j8041k6160q950R995j8084M69L3586J3950l2170k5750
$$ 10152 19059 32453 36883 18842 -7318 -16268 -6273 -24357 -23888 9698 23648 -8522 -34272
13948c4272J3985M430J9801P093J3381n225m5350J7934K0063j3562r678K7836
$$ -34272 -20287 -15857 3944 11037 24418 19193 -26157 -8223 11840 -1722 -11400 16436
13936A6436L2229Q162m5204j6056L4456J4622J2214P474j0978p347q862k0012
$$ 16436 48665 56827 11623 -4433 30023 44645 56859 64333 53355 46008 37146 17134
13924A7134Q933L31n339R160j6296l9559k625L174j6739P13L72K5651j0212p163
$$ 17134 26067 26398 21059 30219 13923 -25636 -28261 -25087 -41826 -41113 -40741 -15090 -25302 -32465
13910c2465R684O91l765O897J6539r36J0903M4721M1661j5695m1357n2326J6537
$$ -32465 -22781 -22090 -25855 -18958 -2419 -3355 7548 52269 93930 78235 36878 -15448 1089
13897A089J6858k9185j3050o767k1853L3846L5714L216K3251L1419R496j0650
$$ 1089 17947 -11238 -24288 -31055 -52908 -19062 16652 19868 43119 74538 84034 73384
13885G3384j2447j8117r618J1520j398r266P844K2256p0m567J2422j966j2644
$$ 73384 60937 42820 33202 44722 43324 34058 41902 64158 64088 59521 71943 69977 57333
13872E7333j3751k8926K83J0900K3611J3687k205J6089l0513j5414P900j4317
$$ 57333 43582 14656 14939 25839 49450 63137 60932 77021 46508 31094 38994 24677
13860B4677L739J4268J4112K2812k2167j0945j3165k6615k461J7616Q762p245
$$ 24677 28416 42684 56796 79608 57441 46496 33331 6716 4255 21871 30633 23388
13848B3388j1277j9012L146L8848J8463J9515j8764l2835j8154m7692J1625O042
$$ 23388 12111 -6901 -3755 35093 53556 73071 54307 21472 3318 -44374 -32749 -26707
13836b6707J4135j9294J6046M3085K3047J3825J4841k4525k1049l0093P259m528
$$ -26707 -12572 -31866 -15820 27265 50312 64137 78978 54453 33404 3311 10570 6042
13824F042K232K4627k950j2030N269K6978j8650Q830K8369o943j4983L232L168
$$ 6042 8274 32901 29951 17921 23190 50168 31518 40348 68717 61774 46791 50023 53191
13811E3191n78K0928O231j4770j6736k6454j4632m187j8605k4249q560M610M237
$$ 53191 52613 73541 79772 65002 48266 21812 7180 2993 -15612 -39861 -48421 -43811 -39574
13798c9574J0798j145O031J650L260O956M407l799K9706p494j0428J7177K1810
$$ -39574 -28776 -29921 -23890 -22240 -18980 -12024 -7617 -11416 18290 10796 368 17545 39355
13785C9355J888Q986l575q494l594P321L850j1549L0087K4219j9511j7561J945
$$ 39355 41243 50229 46654 38160 34566 41887 45737 34188 64275 88494 68983 51422 53367
13772E3367N659j457k3753J546q909K0914J2036l7690K873k511j2202j6379q823
$$ 53367 59026 57569 33816 35362 26453 47367 59403 21713 24586 22075 9873 -6506 -15329
13759a5329m924J4337K0379r558l5597j1569N806K0054Q005J7384M958k0510J4240
$$ -15329 -20253 -5916 14463 4905 -30692 -42261 -36455 -16401 -8396 8988 13946 -6564 7676
13746G676J5379j6904j2822L96J8154L3851M3855L0824k0637k2697k0395q464
$$ 7676 23055 6151 -6671 -6275 11879 45730 89585 120409 99772 77075 56680 48216
13734D8216j6296m251Q411K1526L3171K110n424K8804j7375k1786Q672l770j4422
$$ 48216 31920 27669 36080 57606 90777 92887 87463 116267 98892 77106 85778 82008 67586
13721F7586m870J7419k0177j2851j1108K217J0813K2201K953n829r879j4007K2348
$$ 67586 62716 80135 59958 47107 35999 38216 49029 71230 74183 68354 58475 44468 66816
13708F6816L1934J9857K443j5201j6578j7079L5966L1424J3811k0343k345J031
$$ 66816 98750 118607 121050 105849 89271 72192 108158 139582 153393 133050 130705 131736
13696A31736R484J7383j524N1522O760l1335J4486j040K0383K8104N7737K6465
$$ 131736 141220 158603 157079 208601 215361 184026 198512 197472 217855 245959 303696 330161
13684C30161L9960J0520Q992J3087L3049Q05K4809K4160M7078L9771M0277O9501
$$ 330161 370121 380641 389633 402720 435769 436574 461383 485543 532621 572392 612669 682170
13672F82170Q5506R2848J41096J77719K00001L12462L65130M49300N60338O74162
$$ 682170 767676 860524 1001620 1179339 1379340 1691802 2056932 2506232 3066570 3740732
13662C740732R41467J448135K276206L670248N865232P900440O828804L36858
$$ 3740732 4682199 6130334 8406540 12076788 17942020 25842460 32671264 33008122
13654C3008122o591263q131265n976935l720857k258125j404723r19105o05398
$$ 33008122 26416859 18285594 12308659 8587802 6329677 4924954 4005849 3400451
13646C400451m32245l67413k87133k37986j67150r8846o6552l6757o9275J29R806
$$ 3400451 2968206 2600793 2313660 2075674 1908524 1809678 1743126 1706369 1637094 1637223 1647029
13635A647029J9897q73K7795M3253Q4996R9224J46789J80926K26087K73766L51372
$$ 1647029 1666926 1666053 1693848 1737101 1822097 1921321 2068110 2249036 2475123 2748889 3100261
13624C100261M89932O13968P79905J008085J315419J606171J888542K592217L959086
$$ 3100261 3590193 4204161 4984066 5992151 7307570 8913741 10802283 13394500 17353586
13615A7353586O363777J0393199J6874447K4739216K5760088O782577k0252119
$$ 17353586 23717363 34110562 50985009 75724225 101484313 108266890 88014771
13608H8014771k8817700k1068759j2514433p307087m411734k797414j809750j337182
$$ 88014771 59197071 38128312 25613879 18306792 13895058 11097644 9287894 7950712
13600G950712j142419r78682p99463o24930m47727l19218k34683j92743j70198
$$ 7950712 6808293 5829611 5030148 4405218 3957491 3638273 3403590 3210847 3040649
13591C040649j00046p0992q3110o4483o8834R167O6690J02882J66301K06732K23529
$$ 3040649 2940603 2869611 2786501 2722018 2653184 2662351 2729041 2831923 2998224 3204956 3428485
13580C428485L02942M42023N89453P53711R84462J258382J587094J875434K538905
$$ 3428485 3731427 4173450 4762903 5516614 6501076 7759458 9346552 11221986 13760891
13571A3760891L844286O061661R852097J5980224K4071713K7204486J0841371
$$ 13760891 17605177 23666838 33518935 49499159 73570872 100775358 111616729
13564A11616729j7809333k9980514k3005647j3791453p989876m760253l005866
$$ 111616729 93807396 63826882 40821235 27029782 19039906 14279653 11273787
13557A1273787j961117j370905j131503j035568q88862o64413n09019l90355l44371
$$ 11273787 9312670 7941765 6810262 5774694 4885832 4221419 3712400 3322045 2977674
13548B977674k73686j93140j66704j40360j24468j05572p8609m7883k2717j5823
$$ 2977674 2703988 2510848 2344144 2203784 2079316 1973744 1895135 1847252 1824535 1808712
13538A808712j0061L0768M9456J07032J30289J82051K34926L01653L99467N31805
$$ 1808712 1798651 1829419 1878875 1985907 2116196 2298247 2533173 2834826 3234293 3766098
13528C766098O37244Q57898J272503J976465L138896N060057P532610Q392844
$$ 3766098 4403342 5261240 6533743 8510208 11649104 16709161 24241771 32634615
13520C2634615L764611m648671r015710p672961m898616k947544j784071j127192
$$ 32634615 36399226 31750555 22734845 15061884 10163268 7215724 5431653 4304461
13512D304461p25893n15433m24774l89239l51090k61023k12908j37022j28522
$$ 4304461 3578568 3063135 2638361 2249122 1898032 1637009 1424101 1287079 1158557
13503A158557p9691r4612r9821p4671p6668p6978o1981j0104k5212l9788m7952
$$ 1158557 1078866 984254 884433 809762 733094 656116 594135 584031 558819 519031 471079
13492D71079N4q64k0355j7963J2838K312l020j6548L3906K352j1994n12J1448
$$ 471079 471133 470269 449914 431951 444789 447101 444081 427533 461439 463791 451797 451285 462733
13479D62733l2421k9671j8693K529j8434j0382L0080j9836n4792o2228k2930J7168
$$ 462733 430312 400641 381948 384477 366043 355661 385741 365905 311113 248885 225955 243123
13467B43123m18j1464J9251K4081Q167k7385l6048k4482j6105j3230K1184K8848
$$ 243123 242705 231241 250492 274573 282740 255355 219307 194825 178720 165490 186674 215522
13455B15522M61p824k0540n006o193j4012J4016k0224k9790j9954K4302M3101
$$ 215522 215983 208159 187619 182613 176420 162408 176424 156200 126410 106456 130758 173859
13443A73859J626J4658M6697N8592k060n2689j7603J7944J453j741K6035J1787
$$ 173859 175485 190143 236840 295432 293372 240683 223080 241024 242477 240736 266771 278558
13431B78558n051J288P013k7238m6805k0733j5707j4299J8047M644m472L655J789
$$ 278558 273507 274795 281808 254570 207765 187032 171325 157026 175073 179717 175245 178900 180689
13418A80689R36j4116l3799j2876j8386r222j7681j8221L750J2297m763j7328
$$ 180689 181625 167509 133710 120834 102448 93226 75545 57324 61074 73371 68608 51280
13406E1280J5535K2766L0735M709O026l2115j2869K8227N4274J8460l309M1459
$$ 51280 66815 89581 120316 125025 131051 98936 86067 114294 168568 187028 183719 225178
13394B25178L215m6110l6993l2359N523J5810j1599j3330j7149r968M4144P843
$$ 225178 228393 182283 145290 112931 118454 134264 122665 109335 92186 82218 126362 134205
13382A34205j6996r002p44J470k6825k7606o010K8750o683j6758K6262K4548j1763
$$ 134205 117209 108207 107463 108933 82108 54502 48492 77242 70559 53801 80063 104611 92848
13369I2848k0651m2286r980J5850L9254q711J6M123j8948l1408j3453J2129J7670
$$ 92848 72197 29911 19931 35781 75035 66324 66340 70463 51515 20107 6654 18783 36453
13356C6453L538j0395O749L2148L5108K0586j4747r111J171m28j3817j959j6536
$$ 36453 39991 29596 36345 68493 103601 124187 109440 100329 101500 101072 87255 85296 68760
13343F8760k3274k1149k690J4325k725P926K3371J8833n977m0967J9211J5351
$$ 68760 45486 24337 21647 35972 33247 41173 64544 83377 77400 36433 55644 70995
13331G0995J1155M834P137N329k6335n031R698l41j2389j4401m0178O029K9325
$$ 70995 82150 86984 94121 99450 73115 68084 77782 77441 65052 50651 10473 16502 45827
13318D5827O149K104J7305j8822o732m48m320k1115k59J6092p214Q432L7741K7102
$$ 45827 51976 54080 71385 52563 45831 45383 41063 19948 19689 35781 28567 36999 74740 101842
13304A01842J9622k6712l9118k0775r791j8605Q585K5389J4989m272O616j5331
$$ 101842 121464 94752 55634 34859 25068 6463 15048 40437 55426 51154 57770 42439
13292D2439k7683r584j2721K9201j3948q65j8566j3150L2680K9305K947j0272
$$ 42439 14756 5172 -7549 21652 7704 6839 -11727 -24877 7803 37108 40055 29783
13280B9783k9124j6342K2469j8470j3480M306R984J6232K2433P912K6899j0718
$$ 29783 659 -15683 6786 -11684 -25164 -20858 -10874 5358 27791 35703 62602 51884
13268E1884K4359j2436k3901O503K1033L7849k458k0347R746q465k0827k3153
$$ 51884 76243 63807 39906 46409 67442 105291 102833 82486 92232 83767 62940 39787
13256C9787J7144k9082k7485m385M422m165O544P641m30p247n306J0831J439R916
$$ 39787 56931 27849 364 -4021 401 -3764 2780 10421 9991 2744 -2562 8269 9708 19624
13242A9624l0514j585j9974J7389J6820K2409K143J956L4697P120k6386k7679
$$ 19624 -10890 -12475 -32449 -15060 1760 24169 26312 28268 62965 70085 43699 16020
13230A6020L4522M9546n794j0713l7688P618p015R363L4145N366l0892n181R253
$$ 16020 50542 100088 94294 83581 45893 53511 46496 55859 90004 95370 64478 59297 68550
13217F8550j6491O631j320M719l1645k1781O817L781q325j180M602j189k535Q00
$$ 68550 52059 58690 57370 62089 30444 8663 15480 19261 10936 9756 14358 13169 10634 11434
13203A1434r162J4681N301K4994M917R775L0222J7086J1486R729N2018M9435O635
$$ 11434 2272 16953 22254 47248 52165 61940 92162 109248 120734 130463 182481 231916 238551
13190B38551M724L0515P5234R1983J34514J96099K69766L34492M15327K77058
$$ 238551 243275 273790 349024 441007 575521 771620 1041386 1375878 1791205 2068263
13180B068263K8237k26951m11024m38964l27760j87875j20621j10001p1807o8871
$$ 2068263 2096500 1869549 1458525 1019561 691801 503926 383305 273304 201497 132626
13170A32626M735J123j5034k0946j266j9883k9045j3400j1604J1K0256k0000M734
$$ 132626 137361 138484 123450 102504 101238 81355 52310 38910 27306 27317 47573 27573 32307
13157C2307J2717m082J0638J1866L547P576o158J5899M2851N3804L3338M6707
$$ 32307 45024 40942 51580 63446 66993 74569 68411 84310 127161 180965 214303 261010
13145B61010L6529R33J2162Q9354R9630J01186K6813r6741j44546j08601p8733
$$ 261010 297539 298472 310634 399988 499618 600804 627617 530876 386330 277729 198996
13134A98996o0393m5750j7717K121r683P234J2495K0167k6467l9496l1900j9005
$$ 198996 138603 92853 75136 77257 67574 74808 87303 107470 81003 41507 9607 -9398
13122i398N676J6651J8168o306j606k4027j6228Q541K8664K4308J83K467K3861
$$ -9398 -3722 12929 31097 24791 23185 -842 -17070 -8529 20135 44443 44626 47093 70954
13109G0954N426K4336O857j5922J6020N9869M3419r65J0958Q405O226J1128R8317
$$ 70954 76380 100716 107573 91651 107671 167540 210959 209994 220952 229357 235583 246711 345028
13096C45028J27896R9745J4894p3783j36391j03298o4200m8017j5195j8439l7384
$$ 345028 472924 572669 587563 513780 377389 274091 209891 161874 146679 128240 90856
13085I0856k9582m3830k8065M7624l0868L38K688j4433l006P592j680O97j425
$$ 90856 61274 17444 -10621 37003 6135 6473 9161 -5272 -8278 -686 -2366 -1669 -3094
13072c094k2409k6127K8368O8241O081K989J3061j9839j9069L2692j9627j4981
$$ -3094 -25503 -51630 -23262 44979 51060 54049 67110 47271 28202 60894 41267 26286
13060B6286K9287L1799K2643N6763K5795k3368k3529J2j864L4344J6178n6531
$$ 26286 55573 87372 110015 166778 192573 169205 145676 145688 143824 178168 194346 137815
13048A37815m4079m9435l8959n19j6165j662K3977M606J659L0055j6197k6247
$$ 137815 93736 44301 5342 4823 -11342 -13004 10973 15579 17238 47293 31096 4849
13036D849j0782J0285J7005K8196K7424j7889p609O00M07j823j5060q658j8040
$$ 4849 -5933 4352 21357 49553 76977 59088 51479 52079 52486 50663 35603 26945 8905
13023H905R593J2796J0063n489j6115J3474J780J0469J6994L4586j6423k3050
$$ 8905 18498 31294 41357 35868 19753 33227 35007 45476 62470 97056 80633 57583
13011E7583j9239K4545K0550J4254Q599r83P526L265O807K159K2464m90K9515
$$ 57583 38344 62889 83439 97693 106292 105309 112835 116100 122907 125066 147530 147040 176555
12998A76555k7890l0770M991k0396m549L340O32m655j2028L7365L129j8608l3334
$$ 176555 148665 117895 122886 102490 97941 101281 101913 97258 85230 122595 125724 107116 73782
12985G3782l4418l4986p17K9980M4437P171k0802j5829m430J2648M030L5702J6423
$$ 73782 39364 4378 3661 33641 78078 85249 64447 48618 44188 56836 60866 96568 112991
12972A12991m443l5867L425J8057R69j4104n0623j8212K1318K2567L7601j8770
$$ 112991 108548 72681 76106 94163 95132 81028 30405 12193 33511 56078 93679 74909
12960G4909k7045j8271K736n723j7428R52n653M262M402M618K0134L1994J7019
$$ 74909 47864 29593 32329 26606 9178 10130 4477 8739 13141 17759 37893 69887 86906
12947H6906k7088L712N4211N1638K8285k2616m4066m16L4739K3147j7493j6922
$$ 86906 59818 63530 117741 169379 197664 175048 130982 130566 165305 188452 170959 154037
12935A54037k6735n0933l3875l7796L031M400J4084J939K5992J4435j5953j855
$$ 154037 127302 76369 42494 4698 7729 12129 26213 28152 54144 68579 52626 50771
12923E0771j7322j3534j1949J3282K1427K2605r288m0409l2166l928n862l2017
$$ 50771 33449 19915 7966 21248 42675 65280 55992 15583 -16583 -20511 -26373 -58390
12911e8390j5554l3059K6411P372K641N0190P934j5835J7151J4237n206K457o536
$$ -58390 -73944 -107003 -80592 -73220 -70579 -20389 -12455 -28290 -11139 3098 -2108 349 -6187
12898f187j0821Q239k0878j5811q409k131N875j5549j6360J0750j6999K3208N6560
$$ -6187 -17008 -8769 -29647 -45458 -53867 -55998 -50123 -65672 -82032 -71282 -88281 -65073 -8513
12885h513K8894L7902K2024k1824l4111M643k5690n6725J156L3146P2481J24238
$$ -8513 20381 58283 80307 58483 24372 29015 3325 -53400 -52244 -19098 53383 177621
12873A77621J27025R5046Q4140M0789M5790R6026J76612L12272N51240R94824
$$ 177621 304646 399692 483832 524621 570411 666437 843049 1155321 1706561 2701385
12863B701385J417131R35732o23493j421550j063900o61140l90399k39260j57583
$$ 2701385 4118516 5054248 4430755 3009205 1945305 1284165 893766 654506 496923
12854D96923p9125o9398n7022m220j9079K3069j1184l7183j984o725r602r681
$$ 496923 417798 348400 291378 287158 268079 291148 279964 242781 240797 234072 224470 214789
12842B14789J3722l522j8106m2530k8917K6563K2951j4450J707M579m325N87K2950
$$ 214789 228511 224989 206883 164353 135436 161999 184950 170500 172207 176786 172461 173048 195998
12829A95998K8634J1913j9026J571K7704L881J110N848L772K2731M3079K412n089
$$ 195998 224632 236545 217519 219090 246794 250675 251785 257633 261405 284136 327215 329627 324538
12816C24538j058R599L247j568j0853o295q527P838P178p556K8256M657K1669
$$ 324538 323480 333079 336326 334758 323905 317610 309083 316921 324099 316543 344799 349456 371125
12803C71125K9577K0948K0042J9470L5290O3923O9358K8049N1522K3451M0945
$$ 371125 400702 421650 441692 461162 496452 560375 629733 657782 709304 732755 773700
12792G73700J5256R294k2077k3369L5697K8940L0103m65J1584K5631K7762O6762
$$ 773700 788956 798250 776173 752804 788501 817441 847544 847079 858663 884294 912056 978818
12780I78818K4936O9643J13098J14843O5419P9164J03237J19707J08047J52395
$$ 978818 1003754 1073397 1186495 1301338 1366757 1445921 1549158 1668865 1776912 1929307
12770A929307K11119K04979K37051K40313K67433K60971K29703K59353L08569
$$ 1929307 2140426 2345405 2582456 2822769 3090202 3351173 3580876 3840229 4148798
12761D148798L75435M80508O64593Q11784R63085J287177J684986K171022K730999
$$ 4148798 4524233 5004741 5669334 6481118 7444203 8731380 10416366 12587388 15318387
12752A5318387L278081L923771M665841N871917Q294132J2616503K0327654L4279748
$$ 15318387 18596468 22520239 27186080 33057997 41352129 53968632 74296286 108576034
12744A08576034N7636265Q5732329Q8957104M9159503j226194n0137440q9467268
$$ 108576034 166212299 251944628 340901732 390061235 388835041 338697601 249230333
12737B49230333q7333727n7811518l3248364j9316986j1902288p928013n561909
$$ 249230333 161896606 104085088 70836724 51519738 39617450 31689437 26127528
12730B6127528m212154l448408k871350k382281j901539j484519j192582r63185
$$ 26127528 21915374 18466966 15595616 13213335 11311796 9827277 8634695 7671510
12722G671510q14646o74428o11242n61727m98205m22544l67674l17683k54708
$$ 7671510 6856864 6182436 5571194 5009467 4511262 4088718 3721044 3403361 3148653
12713C148653j96631j47451j04968r3465j32129j28802j44979j46216l3641m4404
$$ 3148653 2952022 2804571 2699603 2606138 2474009 2345207 2200228 2054012 2020371 1975967
12703A975967j04794o0736r8039o9505m7534p5603m9217k7308q4708r2282r9701
$$ 1975967 1871173 1810437 1712398 1642893 1595359 1519756 1470539 1443231 1358523 1266241 1166540
12692A166540q5194q3192m5265j9015m2958l0233l1903J402J1587P730j2360j8035
$$ 1166540 1081346 998154 952889 933874 890916 860683 828780 830182 841769 849499 837139 819104
12680H19104j2739k2841m4414q104j1524l85n804n7771k7471o0632m461K6358
$$ 819104 806365 783524 739110 731006 719482 719097 713293 655522 628051 567419 562958 589316
12668E89316j3939m971l4325l4359k9016k7400j8848K5196L0311J939K0511J2649
$$ 589316 575377 570406 536081 501722 472706 445306 426458 451654 481965 483904 504415 517064
12656E17064P298r780j7309m6832m5564l1952k0406K8483J2064l2529k3125n502
$$ 517064 524362 514582 497273 450441 404877 372925 352519 381002 393066 360537 337412 331910
12644C31910l483k8935j1150j1085p847k819K6070j4497j42J8910j5496k9284
$$ 331910 328427 299492 288342 277257 269410 266591 292661 278164 278022 296932 281436 252152
12632B52152J944q743J5461J3534j4076j9252l9936m284j6079l0773q189J9823
$$ 252152 254096 245353 260814 274348 260272 241020 201084 196800 180721 149948 141759 161582
12620A61582K8489K2840L9506N9303O5440N6033K4710l52N077k8342J2785L8934
$$ 161582 190071 212911 252417 311720 377160 433193 457903 457551 462628 434286 447071 486005
12608D86005j3924N116k5000k0880j4281m84k6977k8432r303l7442k2259j0526
$$ 486005 472081 477197 452197 431317 417036 416552 389575 361143 351840 314398 292139 281613
12596B81613l7917O172L6390k089k553j752k4634k7359j1941K718k819P000m6354
$$ 281613 243696 249868 286258 284169 281616 279864 255230 227871 215930 218648 215829 222829 176475
12583A76475J3139N121k380q382K1212J1789j949k0708M392k4928j6140L010L3985
$$ 176475 189614 194735 192355 183973 205185 216974 215025 194317 198709 173781 157641 160651 194636
12570A94636J5548k2022j4547j902M429k4549k1725L321L6012k2582j4238L2307
$$ 194636 210184 188162 173615 171713 176142 151593 129868 133189 169201 146619 132381 164688
12558A64688J8890M595m0144l5230J7672M9479J8091n1735l8120N641p198l2421
$$ 164688 183578 188173 148029 112799 130471 179950 198041 146306 108186 113827 106629 74208
12546G4208m7923j2935o930L776L734K1200M1505M5121K1065k0799j8360J1374
$$ 74208 26285 13350 6420 10196 13930 35130 76635 121756 142821 122022 103662 115036
12534A15036k0494k190N369J7418J5828J1290k7051j5322j8669J830O37j4072
$$ 115036 94542 92352 97721 115139 130967 142257 115206 99884 81215 83045 83682 69610
12522F9610j6647M613K339K5179k1163l0457q89r894l1791M123J1087o307K3427
$$ 69610 52963 57576 59915 85094 63931 33474 32585 22691 -9100 -4977 6110 -197 23230
12509B3230j4989j8694M9109M6578P667p292k77p295l7813r898o765J5357L9116
$$ 23230 8241 -10453 38656 85234 92901 85609 85332 78037 40224 30326 23561 38918 78034
12496G8034K1115L516M260m135j265M0598N1868J7552o888p445l829K5394K6009
$$ 78034 99149 102665 106925 102790 101525 142123 193991 211543 204655 197210 193381 218775 244784
12483B44784O7295L8631R774K4923O951l9662j9525k9550o3550p8960k7807j3138
$$ 244784 312079 350710 360484 385407 392358 352696 333171 303621 240071 161111 133304 120166
12471A20166k1006l0412J1113N408l358J049J441O52j5797j2877j4884r125M6276
$$ 120166 99160 68748 79861 85269 81911 82960 84401 85053 69256 56379 41495 32370 78646
12458G8646K021k9492O368r031n934J126R418N109L5990K3847q828q675j0816
$$ 78646 80667 51175 57543 48512 42578 43704 53122 58231 94221 118068 109240 100565 89749
12445H9749P651P324Q432O617j829m371l378K7600K6749J2358j2225j3357k3497
$$ 89749 97400 104724 113156 119773 117944 113573 110195 137795 164544 176902 164677 151320 127823
12432A27823n3445l9356k0988J6229K1269l5537k2545p721Q092j2684K1340Q509
$$ 127823 74378 35022 14034 30263 51532 15995 -6550 -14271 -6179 -18863 2477 10986
12420A0986k756j9053L859L8024L1297q31J5783J649j8432Q191J5032J5684M908
$$ 10986 8230 -10823 -6964 31060 62357 61526 77309 78958 60526 68717 83749 99433 104341
12407A04341j1053R006L1125J7478j0604l8330k6877K7637J9998P117M101j6581
$$ 104341 93288 102294 133419 150897 140293 101963 75086 102723 122721 129838 133939 117358
12395A17358r975M602k6024k0404p861l3564k0917J8660J2354K157R228l2152
$$ 117358 107383 111985 85961 65557 57696 24132 3215 21875 34229 36386 45614 13462
12383A3462l0169J4557L7226k3218k7009R484L3893J0908m427l650o644J7644
$$ 13462 -16707 -2150 35076 11858 -15151 -5667 28226 39134 34707 31057 24413 42057
12371D2057l884j75J1056j4588k5882J2390j591K2124J1872p86j7122j5504J8271
$$ 42057 38173 37998 49054 34466 8584 20974 19383 41507 53379 52593 35471 19967 38238
12358C8238Q313j5200J0529L158R883j1641j6670k471M268J9092j2290k0596p061
$$ 38238 46551 31351 41880 45038 54921 43280 26610 24139 28407 47499 35209 14613 7552
12345G552L1788N763l1037l136N949K25N648m545l6991j3681P046K2549j132J9935
$$ 7552 39340 45103 14066 10930 16879 17104 22752 18207 -18784 -32465 -25419 -2870 -4002 15933
12331A5933J1163j1526L399j1964O499l904j0164K6218K8362k506r24r889J3805
$$ 15933 27096 15570 18969 7005 13504 9600 -564 25654 54016 51510 50586 40697 54502
12318E4502J8281K4106J6479k7094m8490j5302K0452K8367M5580K4861j0421n825
$$ 54502 72783 96889 113368 86274 37784 22482 42934 71301 116881 141742 131321 125496
12306A25496K8640j436N419L0251N5479P3611L8367J05459K51203L28231M37304
$$ 125496 154136 152700 158119 188370 243849 317460 355827 461286 712489 1040720 1478024
12295A478024L70303J58941j05216l46208m46583l73893k57483j22556q6358l4606
$$ 1478024 1848327 2007268 1902052 1555844 1109261 735368 477885 355329 268971 234365
12285B34365j2028m07l1807k6931N450K3305K5041M8661N7404j4734m5006m4155
$$ 234365 222337 221930 190123 163192 168642 191947 216988 265649 323053 308319 263313 219158
12273B19158l8560k8779k2784J7088q861k7660l1597l0702J9290L6842j1898m7241
$$ 219158 180598 151819 129035 146123 137262 109602 78005 47303 66593 103435 91537 44296
12261D4296j3447n02J7964M273L782k964L140J5553j7695N182q597L0185p345
$$ 44296 30849 30347 48311 52584 56366 53402 56542 72095 54400 59582 50985 81170 73825
12248G3825m5385O636L036J2680j1305m4149J6052N4135J2201j2191j2133j6827
$$ 73825 28440 35076 38112 50792 39487 -4662 11390 65525 77726 65535 53402 36575
12236C6575p38J6205M220k6280j5501K12O336J1604n95k964k7319k2544j3292
$$ 36575 35837 52042 56262 29982 14481 14693 21029 32633 32038 29074 1755 -20789 -34081
12223c4081L9663L5113K1733J636j7394m646L4252L330k0008M999j8375p592K4881
$$ -34081 5582 40695 62428 64064 46670 42024 76276 79606 59598 64597 46222 38630 63511
12210F3511Q269j3567k3133q625J6321J3981m770j7045L2409j8266j3725o159
$$ 63511 71780 58213 35080 26455 42776 56757 51987 34942 67351 49085 35360 29201
12198B9201J9455J5299p737j805J6830n272J0305N742j6387l1323j6524k6807
$$ 29201 48656 63955 56218 54413 71243 65971 76276 82018 65631 34308 17784 -9023
12186i023K5352j1943l656j5033j0619L8745M7780j0803Q270j6583k2729j9246
$$ -9023 16329 4386 730 -14303 -24922 13823 61603 50800 59070 42487 19758 512
12174E12K6413L5201m134o477K514J067k1245r641J147j7927k166j9689m782J4988
$$ 512 26925 62126 57992 51515 54029 55096 33851 24210 25357 7430 5264 -14425 -19207 -4219
12160d219j8701o700j73O672J5608O325j7443J8427J2267R068j5572q686Q505
$$ -4219 -22920 -29620 -29793 -23121 -7513 -1188 -18631 -204 12063 21131 5559 -3127 5378
12147E378k5631K3732K7420J5572m712M793P656k3009j4860l0552l4424j598J7274
$$ 5378 -20253 3479 30899 46471 41759 46552 54208 31199 16339 -14213 -48637 -50235 -32961
12134c2961R488J9163l691O927j719l277N382J1050R131o894J6852K2785j7840
$$ -32961 -23473 -4310 -8001 -1074 -2793 -6070 -688 10362 19493 12599 29451 52236 34396
12121C4396R189K2880j8779l3257j6182j1879k408J5454K0557p07j0200P216J7578
$$ 34396 43585 66465 47686 14429 -1753 -13632 -16040 -586 19971 19264 9064 16280 33858
12108C3858R345q524J767n690J2899k1056J5902m520k5553O308J6467k1791k6931
$$ 33858 43203 34679 36446 30756 43655 22599 38501 33981 8428 14736 31203 9412 -17519
12095a7519N637K1797J4378N065p554j8880k8406J2989k7042R746L4011K243L639
$$ -17519 -11882 9915 24293 29358 21804 2924 -25482 -12493 -39535 -29789 4222 6465 10104
12082A0104p473o0056P637K0768K5289k21K891m474J6849P579R956K7907J6001
$$ 10104 2631 -57425 -49788 -29020 -3731 -3952 -1061 -5535 11314 18893 28849 56756 72757
12069G2757O778n9686j6411N618l3799k534o817K564M6311K0623K4143J5304j8207
$$ 72757 79535 19849 3438 9056 -24743 -27277 -34094 -31530 14781 35404 59547 74851 56644
12056E6644k2504n530j2884k2627J1101n006J2249P240j0946L353J277K842K6518
$$ 56644 34140 28610 15726 -6901 4200 -806 11443 18683 7737 11090 12367 15209 41727
12043D1727p170j4829r703j4606k081L2688k325l5614r860M090J9230j0344J9484
$$ 41727 34557 19728 10025 -4581 -6662 26026 23701 -11913 -21773 -17683 1547 -8797 10687
12030A0687N691J5044n646j5577L128j8669j4083L3546J9671Q00j7347q959O381
$$ 10687 16378 31422 25776 10199 13327 -5342 -19425 14121 33792 34592 17245 8286 14667
12017A4667n679l0810K9021M9533k2175k4129K738R673J6918K2210M316j2918
$$ 14667 8988 -21822 7199 56732 34557 10428 13166 22839 39757 61967 66283 53365
12005E3365m860l52N993l424n486K1125j2315l6090N382j9696Q464N145l2545
$$ 53365 48505 48153 54146 50722 45236 66361 54046 17956 23338 3642 12106 17251 -15294
11992a5294p242k0932J0932M3222J8806J211j0113P715J5581l3992j6205J8165
$$ -15294 -22536 -43468 -32536 10686 29492 30703 20590 28305 43886 9894 -6311 11854
11980A1854J1368k1090l2736l1281J2079K2613K7246J3811Q26m690r461p416J446
$$ 11854 23222 2132 -30604 -61885 -49806 -27193 53 13864 14690 10000 539 -6877 -5431
11967e431o173j7418L714L6600Q493q879q761r001R752j5550j4746L1189J858
$$ -5431 -11604 -29022 -25308 11292 19785 10906 2145 -6856 2896 -12654 -27400 3789 5647
11954E647j0101O351M295M768q021K765j6798j4424j5521p428K0854P59K7532
$$ 5647 -4454 1897 6192 10960 2939 5704 -11094 -25518 -41039 -48467 -27613 -26854 678
11941F78J3218k2968J3454J2235O445P602j3741k2716j2622p438J7489k755l8860
$$ 678 13896 -9072 4382 16617 23062 30664 16923 -5793 -18415 -25853 -8364 -11119 -49979
11928d9979m815K7146K2196j7270P592J3271J3182q042j3888j3025n264J6031
$$ -49979 -54794 -27648 -5452 -22722 -15130 -1859 11323 3281 -10607 -23632 -28896 -12865
11916a2865j1157k0250N769R205p705j5557K1502J1220o288m522K1015J3254k279
$$ -12865 -24022 -44272 -38503 -29298 -37003 -52560 -31058 -19838 -26126 -30648 -9633 3621 1342
11903A342j0795Q819M186J1084K2697r246m2734J3321L5119L7098J5234k5728
$$ 1342 -9453 -634 3552 14636 37333 28087 -14647 -1326 33793 70891 86125 60397
11891F0397m9828l4159J1876O937K6709j0337j799n484J097P727L031j8863J6588
$$ 60397 10569 -23590 -11714 -4777 21932 11595 9796 4312 5409 13136 16167 -2696 13892
11878A3892k8181m126L0316J4533o500j4248K412K413k5104l931J2634J1105m360
$$ 13892 -14289 -18415 11901 26434 19934 5686 8098 10511 -14593 -18524 -5890 5215 855
11865H55J79n957k410O480J500l66j0527j2796L1546K609J519M529j9383o099
$$ 855 1034 -4923 -7333 -853 647 281 -10246 -23042 8504 11113 12632 17161 -2222 -8321
11851h321n968K850r951n875J566J2479P114j761j8131J3499J2409q920N339K3042
$$ -8321 -14289 -11439 -21390 -27265 -25699 -13220 -6106 -7867 -25998 -12499 -90 -9010 -3671 19371
11837A9371j5686j8207k443R723K925k9715M577j8794J0175K0693l042J2657J2004
$$ 19371 3685 -14522 -16965 -7242 -4317 -34032 -29455 -48249 -38074 -17381 -20423 -7766 4238
11824D238J2707o773M045J3632M761J654l5013q99K1255J8492J5436j3985J467
$$ 4238 16945 10172 14217 27849 32610 34264 -749 -1648 19607 38099 53535 39550 41017
11811D1017j0543M991J7744k963q921R309J204L761q897K830n063r111O569K772
$$ 41017 30474 35465 53209 50246 41325 50634 51838 55599 46702 49532 44469 35358 41927 44699
11797D4699J6906P478Q652k1898k8549K519J3134j5662Q234j6469k4819K9899
$$ 44699 61605 69083 77735 55837 27288 29807 42941 27279 35513 19044 -5775 24124
11785B4124m979m2428j6671J9J9914L6270N311J576J2475K1860j1823K0132N703
$$ 24124 19145 -23283 -39954 -39935 -20021 16249 21560 23136 35611 57471 45648 65780 71483
11772G1483k6149Q198k051k6774Q99N1J0462o481M674Q809R646K5219L928j3473
$$ 71483 45334 53532 51481 24707 25606 25657 36119 29638 34312 43121 52767 77986 81914 68441
11758F8441j353j6063k8501L72Q085M533P385L62L1785j123k8825j4042l2156
$$ 68441 67088 51025 22524 22896 30981 35514 42899 43261 75046 73923 45098 31056 -1100
11745a100N667J5895j2171N94M104L3883J3854l535J3009K9651M546j1791J1197
$$ -1100 4567 20462 8291 8885 12989 46872 60726 57191 70200 99851 104397 92606 103803
11732A03803l277l521L4388K8446O8343N2075K528M421K3286j0095m1090p0202
$$ 103803 100526 97005 131393 159839 228182 280257 282785 287206 310492 300397 259307 189105
11720A89105n6884n340J6606J6329k0760K9669p808m907j7052j0835l6665r703
$$ 189105 132221 126881 143487 159816 139056 168725 160917 156010 138958 128123 91458 81755
11708H1755K6093j2289j3289N604Q510J9430j8100m6322m1007J2328M210j35l910
$$ 81755 107848 95559 82270 87874 96384 115814 97714 51392 10385 22713 26923 26788 22878
11695B2878j3995L413M2718j3503l623k2701q119M091J6589J288k0318p918l011
$$ 22878 8883 12296 55014 41511 37888 15187 7068 11159 27748 29036 8718 800 -2211
11682b211j4494j9613j2402O794N013J85K4471P029K8176J1935O19l3710k3083
$$ -2211 -16705 -36318 -48720 -41926 -36913 -36728 -12257 -5228 22948 34883 35502 1792 -21291
11669b1291K4209J2451J9979K490o641P114n163K0577m785q846M965j5066l4486
$$ -21291 2918 15369 35348 37838 31197 38311 33148 53725 48940 40094 45059 29993 -4493
11656d493k625O060K957k0291J11K2257K3941M310r384m071p922K9568j6902l645
$$ -4493 -7118 -1058 1899 -18392 -18281 3976 27917 32227 22843 18772 10850 40418 23516 19871
11642A9871o463m8212r659M2018M8092O64k9495J4215k4065j0555n99j3024j7574
$$ 19871 13408 -34804 -44463 -2445 45647 46311 16816 31031 6966 -3589 -4188 -17212 -34786
11629c4786j607L1014L2585J7793l099k9518m251M546J1763n655J86J5613j0701
$$ -34786 -36393 -5379 27206 44999 41900 12382 8131 12677 24440 18785 18971 34584 23883
11616B3883k7656j7004j521L351j1820j1754j409k3q896Q263K550K2530J9581
$$ 23883 -3773 -20777 -22298 -18947 -30767 -42521 -43930 -43953 -52849 -44586 -42036 -19506 75
11603G5l1681p563J2385k5175N119J4977M218K9871L145Q98k6076J6935L4115
$$ 75 -31606 -39169 -26784 -51959 -46840 -31863 -27645 2226 5371 6269 -19807 -2872 31243
11590C1243j2699j7921j1129j4597R979J1899J0052K9645J1037J254l5567k4914
$$ 31243 18544 623 -10506 -25103 -15124 -3225 6827 36472 47509 48763 13196 -11718
11578a1718J7507M522j7356J9074k1832j9443k04K675J8613o012N872J8561M4383
$$ -11718 5789 10311 -7045 12029 -9803 -29246 -29450 -26775 -8162 -14174 -8302 10259 54642
11565E4642J055k4799J3676Pj066k0270Q974n118k8182j5143j750K0660K6990
$$ 54642 55697 30898 44574 44581 43515 23245 32219 27101 -1081 -16224 -17974 2686 29676
11552B9676p664j0686J6703K6180j7761l8500j1063k266q444K560N748J6915n148
$$ 29676 22012 11326 28029 54209 36448 -2052 -13115 -15381 -23825 -21265 -15517 1398 -3750
11539c750J7079O582l516j5800O308L4257J9446j3144j6561J5250p144n4695j3888
$$ -3750 13329 19911 16395 595 6903 41160 60606 47462 30901 46151 39007 -15688 -29576
11526b9576L6212M1951K0543k7068j8170k0500j7513Q187L021P604j7138J6235
$$ -29576 6636 48587 69130 42062 23892 3392 -14121 -5934 -2913 4691 -12447 3788
11514C788M633q403m1389Q35M508N633K5072J3877M082k687k1166m3507J0339
$$ 3788 8421 18 -41371 -40536 -36028 -30395 -5323 8554 12636 9949 -11217 -54724 -44385
11501d4385j5372K5337N1111P898j3590J5245k3151K684K0704L6616R707l6967
$$ -44385 -59757 -34420 16691 24589 10999 26244 3093 5777 26481 63097 72804 35837
11489C5837j5294J1833J0899o284J1532l1867k8732j0841J1021K8268Q137n968
$$ 35837 20543 32376 43275 36991 48523 16656 -12076 -22917 -11896 16372 24509 18541
11477A8541m31K006J4722p659N79j2324q123k3551l2751p510Q746K3145L2391
$$ 18541 18110 20116 34838 27179 27758 15434 7311 -16240 -48991 -56501 -47755 -24610 7781
11464G781j131k6535K8186L0830n076J1280O583n349l6015j2916Q825m955P177
$$ 7781 6650 -19885 8301 39131 34055 45335 51918 46569 10554 -2362 6463 1508 8685
11451H685p881L1025k771k1300j4642p401K712j9726J4199J5750L9488J0057j3517
$$ 8685 804 31829 29058 7758 -6884 -14285 -11573 -31299 -17100 -1350 38138 48195 34678
11438C4678j6233o553j4785j6697N160q924K0704R261j0715j3985j3294k9846
$$ 34678 18445 11892 -2893 -19590 -14430 -23354 -2650 6611 -4104 -18089 -31383 -61229
11426f1229J3401K9085q562k2723J3659N6347L5417l493k4064j1045J9968k3609
$$ -61229 -47828 -18743 -27305 -50028 -36369 19978 55395 51902 27838 16793 36761 13152
11414A3152j5915J5763J0025n196j9417n962k9837Q542K1368L1776q711l0120
$$ 13152 -2763 13000 23025 17829 -1588 -7550 -37387 -28845 -7477 24299 15588 -14532
11402a4532M080J0069k9967r345K3496M7606o103k8066j3003k0096N815J5739
$$ -14532 -10452 -383 -30350 -39695 -16199 31407 25304 -2762 -15765 -35861 -30046 -14307
11390a4307K9815J9672k3564l6767J9254M9841k3916l3949j7126J8131J2577K5788
$$ -14307 15508 35180 11616 -25151 -5897 43944 20028 -13921 -31047 -12916 -339 25449
11378B5449J8693O421j5388k0038l9046L538Q766J1077N652j631k3209j2543R297
$$ 25449 44142 50563 35175 15137 -23909 -20371 -11605 -528 5124 3493 -19716 -32259 -22962
11365b2962L9094J6391j2020l1570j533Q945J1266n798R48j531p573M416J7214
$$ -22962 16132 32523 20503 -11067 -12600 -3655 7611 1813 2761 1230 -6343 -1927 15287
11352A5287K0029m380J6494j5913j2726j5774k511m697R066q481k1044R851J5187
$$ 15287 35316 30936 47430 31517 18791 3017 506 -4191 4875 -3606 -24650 -14799 388
11339C88J758J333K1715P037r023j0507J743K2646J0860P014j7418k6112k303
$$ 388 2146 3479 25194 32231 23208 12701 14444 37090 47950 54964 37546 11434 9131
11326I131r137J7856M765k3423j4430j965K7447j6676j8533J3089J1708J6357
$$ 9131 -6 17850 22615 -808 -15238 -17203 10244 -6432 -24965 -11876 -168 16189
11314A6189O223O644R958J1571j2442j9103k0220m5397j0471q614N714K1026Q990
$$ 16189 22412 29056 39014 50585 38143 19040 -1180 -46577 -57048 -65662 -59948 -38922 -29932
11301b9932J6449J716m183J3655O405L3617J7157J9919O54l2184j4576J5828J2382
$$ -29932 -13483 -11767 -15950 -2295 4110 37727 54884 74803 75457 43273 28697 44525 56907
11288E6907j9268l967k3501O933K6510K8095j7090j3772J3879j4292j8794p405
$$ 56907 37639 33672 10171 17104 43614 71709 54619 40847 54726 40434 21640 14235
11276A4235l2176j1495M7081N6068p57k0278j9033l6553j3775L2120J3344p641
$$ 14235 -17941 -29436 17645 73713 72956 52678 33645 -2908 -16683 15437 28781 21140
11264B1140p670n492j1748j5693K6373J8802N502J4056K40j9497l3231j2205K4712
$$ 21140 13470 7978 -3770 -19463 6910 25712 31214 45270 45510 26013 -7218 -19423 5289
11251E289J7563K0314j3365j003L8658J7442m3833k0788k285N485l9948J2376
$$ 5289 22852 43166 29801 28798 67456 84898 41065 20277 17992 23477 -16471 -4095
11239d095J1693m765L265J509j1054p995M441R28J3185K0797j5212l2540q114
$$ -4095 7598 2833 6098 7607 -3447 -11442 -7001 -6073 7112 27909 12697 -19843 -27957
11226b7957J395K6394K3593j1223r47l6116K4513J1233j4907q443J1922N65L735
$$ -27957 -26562 -168 23425 12202 11255 -24861 -348 10885 -4022 -12465 -543 22 3757
11213C757k34J5369k784J8268k9866k4577M280K4964M1020j2104k9983K3547K0149
$$ 3757 3523 18892 16108 34376 4510 -20067 -15787 9177 50197 38093 8110 31657 51806
11200E1806L861N345j2309r322K5634M228o041l1905n8606O65J7121J2464J5972
$$ 51806 55667 61012 48703 39381 65015 69243 63202 31297 -27309 -26644 -9523 2941 18913
11187A8913K3592k6613N9J8284j3850k3751J1185k0018N29p64n006J8381M4472
$$ 18913 42505 15892 15951 34235 20385 -3366 7819 -12199 -11670 -12434 -17440 941 45413
11174D5413K4702r533k4091k1494O306l1354J0340J7915M705K9442K0206j16j4054
$$ 45413 70115 60582 36491 14997 21303 -10051 289 18204 22909 52351 72557 72441 58387
11161E8387P036l233j20N698p973j5208J0653j8278j1298N146p852K641j2110
$$ 58387 65423 62190 62070 67768 59795 44587 55240 36962 25664 30810 22958 25599 13489
11148A3489L918R337J3855k4577j5987J7006k0420j1520j609q318o82O055J1209
$$ 13489 17407 26744 40599 16022 35 17041 -3379 -14899 -16508 -24826 -25508 -19453 -8244
11135h244j7468J7289J4158J5639P942j3883j4575J4171K4275M280k1973m675
$$ -8244 -25712 -8423 5735 21374 29316 15433 858 15029 39304 43584 21611 16936
11123A6936j7653j2600l3808p228j0638L1431M9980N787j5448j2099k5743L530
$$ 16936 -717 -13317 -47125 -54353 -64991 -33560 16420 22207 6759 -5340 -31083 -27553
11111b7553L1269j3805J4620L2488j8576l7435J1429O383j7435L0574j3953n39
$$ -27553 3716 -10089 4531 37019 18443 -18992 -7563 -1180 -18615 11959 -1994 -2533
11099b533m3552j5847J1204L0382L5563k8522k2873M791K0433N5723K783k1046
$$ -2533 -46085 -61932 -50728 -20346 15217 -13305 -36178 -31387 -10954 44769 47552 26506
11087B6506k8833q27J300j1909J1382P501p870P281o402M724j3740m057J6593
$$ 26506 -2327 -3154 -1854 -13763 -2381 5120 -2750 4531 -1871 2853 -10887 -14944 1649
11074A649K9158j3839l0940j4660O420oj0005m910n031K1786l6261J3757N1045
$$ 1649 30807 16968 -13972 -28632 -22212 -22218 -32223 -37133 -42164 -20378 -56639 -42882 8163
11061H163L2321j5695l2588L7269q687l5196J1738L2028L0885M597J3285r159
$$ 8163 40484 24789 -7799 29470 20783 -14413 -2675 29353 60238 64835 78120 68961
11049F8961k5170N957r691l7749j2246J9435J5280K141J0496J876m0715m105j1972
$$ 68961 43791 49748 40057 2308 -9938 9497 24777 26918 37414 39290 -1425 -5530 -17502
11036a7502j6302Q100K335P93p335M991M6162M669o888o788J1212k6542k2133
$$ -17502 -33804 -25704 -23369 -22576 -29911 -24920 21242 25911 19023 12235 23447 -3095 -25228
11023b5228j8106M8315K0375J7160J0279k2805j0032j4432q283j7447L186J3058
$$ -25228 -43334 4981 25356 42516 52795 29990 19958 5526 -2757 -20204 -17018 -3960
11011c960r989j7389q48L1784L582Q087J2075j3640l6545j3426L3882L021k2353
$$ -3960 -13949 -31338 -32186 -402 3180 11267 23342 9702 -26843 -40269 -6387 -3366 -25719
10998b5719P461J0966m744r626K2216j2669J9677J8393j8078l058n922m153k727
$$ -25719 -18258 -7292 -12036 -21662 554 -12115 7562 25955 7877 4819 -1103 -5256 -7983
10985g983L895n113N856L565P228J7596K6887k0851l1504J274J7602o455l517
$$ -7983 -4088 -9201 -3345 220 7448 25044 51931 31080 -424 850 18452 11997 8480
10972H480j5415Q159p446j1963J4510Q890J621L9725p078l6773k9199J0898K1579
$$ 8480 -6935 1224 -6222 -18185 -3675 5215 6836 46561 39483 2710 -26489 -15591 5988
10959E988Q380j7565l687J2977K3538j9306K4364k312N304j1930o398m453K1217
$$ 5988 14368 -3197 -6884 6093 29631 10325 34689 32377 37681 25751 19353 14900 36117
10946C6117j299j9849j4444l1982j80K1630J5683P012k189L737R082J2218L288
$$ 36117 34818 14969 525 -31457 -31637 -10007 5676 12688 10499 14236 23318 35536 38824
10933C8824J4265m0794l3087j0517J3219j905k991q788L2491K6865k1262j264
$$ 38824 53089 12295 -20792 -31309 -18090 -19995 -22986 -31774 717 27582 6320 5056
10921E056Q925J5683j5802l9522R299J5860M6R202P116j2670k3128P294J5638
$$ 5056 13981 29664 13862 -25660 -16361 -501 -455 8747 15863 3193 -19935 -12641 2997
10908B997j9181n4088m21J3992N7214P678l7157j2282P138L012j6662n690j543
$$ 2997 -16184 -70272 -70693 -56701 513 8191 -28966 -41248 -34110 -31098 -47760 -53450 -54993
10895e4993j206K1111K6115O151J9977k5762l6302j9714K1817K7154m835K342
$$ -54993 -56199 -35088 -8973 -2822 17155 -8607 -44909 -64623 -42806 -15652 -20487 -18145
10883a8145K2500O78j3895j8782j7260J9265m082K7415J8128j1078L1900J1311
$$ -18145 4355 5033 -8862 -27644 -44904 -25639 -29721 -2306 15822 4744 36644 47955
10871D7955o466l234n1356J2739L543q963j7647j8565J6678J8646J3428j6763
$$ 47955 41489 38255 -13101 -362 3181 -5782 -23429 -41994 -25316 -6670 6758 -10005
10859a0005k4062J691n986j4238k757N3135j058j0299J7029L2703j127P473j7865
$$ -10005 -34067 -32376 -38362 -52600 -55357 -2222 -3280 -13579 3450 36153 35026 42499 24634
10846B4634j3065k8369j1184m283Q09j4162M3383L8747j6425l7448Q568M0q047
$$ 24634 11569 -16800 -27984 -32267 -31458 -45620 -2237 36510 20085 -17363 -8795 -8755 -16802
10833a6802n289q746j0680K6702M5211j0667J7413k69l4827m5079j3190n387K5867
$$ -16802 -22091 -30837 -41517 -14815 30396 19729 37142 36873 2046 -43033 -56223 -61610 -35743
10820c5743K2804K8454J3001N539J0854J3758J0709m409k6330j0718l3937l6103
$$ -35743 -12939 15515 28516 34055 44909 58667 69376 64967 38637 27919 -6018 -42121
10808d2121K510L9510j0107j0454M810Q885Q822L1263J4800R147l5256k1354L074
$$ -42121 -39611 -101 -10208 -20662 -15852 -6967 1855 33118 47918 57065 21809 455 3529
10795C529O332J1954j019N048j6209q433j3806N077J3700J335M0241O77k1818
$$ 3529 9861 21815 20796 25844 9635 1202 -12604 -7527 6173 7508 47749 48426 26608
10782B6608M280p778k0971j5131l5725J7397L9709q012m0293j7509P268o1088
$$ 26608 30888 23110 2139 -12992 -48717 -31320 8389 377 -39916 -57425 -50157 -111245
10770a11245Q941M0592M9442K8675j9125K334j3532P814J3319J2509K1602J9686
$$ -111245 -102304 -61712 -12270 16405 -2720 -386 -13918 -6104 7215 19724 41326 61012
10758F1012L6158J2840j7643k4604m8426m9371M535L070n566r841K0398K6274
$$ 61012 97170 110010 92367 67763 19337 -30034 -25499 -22429 -27995 -37836 -17438 8836
10746H836N153J2067Q518k0080l456j6044O748O010K592q092Q993k4311q562L395
$$ 8836 13989 26056 34574 14494 11038 -5006 1742 7752 10344 2252 11245 -13066 -21628 -18233
10732a8233P014M831m759m333L054O944k8225j2884J5383J788J195L882J9741
$$ -18233 -11219 -6388 -11147 -15480 -12426 -5482 -33707 -46591 -31208 -29420 -28225 -24343 -4602
10719d602K3988r724k159k0477J8407K2820K957j675j0968M652j5319j9356j4466
$$ -4602 19386 9662 7503 -12974 5433 28253 31210 29535 18567 23219 7900 -11456 -25922
10706b5922M66q376J0181J5085k9830r560M3573J4689J3176M743k4670k4023M894
$$ -25922 -25456 -33832 -23651 -8566 -38396 -47956 -4383 10306 23482 28225 3555 -20468 -15574
10693a5574j8056m5715m090M3303M2695J7489J744j6659r503L1143j303k6298
$$ -15574 -33630 -79345 -83435 -40132 2563 20052 21796 5137 -4366 26777 25474 -824
10681h24j4190K2878L7413K4385k6848n3651k3314L9849K3417j3910l4929j86
$$ -824 -15014 7864 45277 69662 42814 -10837 -34151 5698 29115 15205 -19724 -19910
10669a9910J9678L771q0o683k06J5526n140k0531j5280J1381j0292j2176q059
$$ -19910 -232 3539 3459 -3224 -3430 12096 6956 -13575 -28855 -17474 -27766 -39942 -48001
10656d8001K8270K308P637K9599n760m6372m2310P668P480j2878J3642J7536M456
$$ -48001 -19731 -17423 -9786 19813 14053 -32319 -74629 -66961 -59481 -72359 -58717 -41181 -36725
10643c6725J0732L2104n90P658J5600k9715k903j51l008j4921j197k7843P386
$$ -36725 -25993 6111 5521 13179 28779 -936 -3839 -3990 -6998 -21919 -23116 -50959 -43573
10630d3573j6791j3643J6945K3685J0244m859J6303K2711o882j4655J3946j2525
$$ -43573 -60364 -74007 -57062 -33377 -23133 -27992 -11689 11022 4140 -10515 3431 -9094
10618i094k6059j7802l135L5794j654r890K4094R119o309j3736n525J3324K2019
$$ -9094 -35153 -52955 -56090 -20296 -21950 -31840 -7746 1373 -4936 -18672 -24197 -10873 11146
10605A1146j1601r488J011j0018k938l82r39J6346J3806r644J3205k9786l7492
$$ 11146 -455 -9943 -8932 -18950 -21888 -22270 -23209 -6863 6943 -2701 10504 -19282 -56774
10592e6774J7937o520K3973r919K3365l371l010K9394O648J820J6348j3543l5266
$$ -56774 -38837 -45357 -21384 -31303 -7938 -11309 -14319 15075 21723 23543 39891 26348 -8918
10579h918k1138J2547M821j4209n695J1218J2613j2366K4760K0298N784k2839
$$ -8918 -30056 -17509 -12688 -26897 -32592 -21374 -8761 -21127 3633 23931 29715 6876
10567F876r607j6904L0947J3932j1980J5216L482j1155j2977j1978J7728k12l9901
$$ 6876 -2731 -19635 11312 25244 13264 28480 31962 20807 7830 -4148 13580 13368 -26533
10554b6533l6399J7701J1379j098J5336j1673O81J929Q919L4943J8245k1564l9907
$$ -26533 -62932 -45231 -33852 -34950 -19614 -31287 -30606 -28677 -19758 15185 33430 11866 -28041
10541b8041l0088K3249k969J909p018l6329j110K9948J4012l3221Q358L7099K5811
$$ -28041 -58129 -34880 -37849 -35940 -42958 -79287 -80397 -50449 -36437 -69658 -61300 -24201 1610
10528A610m485l5973j1553L8709K8566M299j4535j1583o518k1507o287J169J9146
$$ 1610 -2875 -38848 -50401 -11692 16874 21173 6638 -4945 -11463 -32970 -39257 -38088 -18942
10515a8942K8993r817m1035j3445N0580M640M176R018k5357n32k9923m413K197
$$ -18942 10051 234 -40801 -54246 -3666 974 5150 14168 -11189 -11721 -41644 -46057 -43860
10502d3860j0938J8276J9311q764o331r229q821J2910J3627j1017N060L4371j2498
$$ -43860 -54798 -36522 -17211 -25975 -32306 -41535 -50356 -37446 -23819 -34836 -29776 4595 -7903
10489g903l049j7449J3598R911k093k382N4235L4264k3367j7277l3785K2145j5401
$$ -7903 -10952 -28401 -14803 -4892 -6985 -9367 44868 79132 55765 38488 4703 26848 11447
10476A1447o1155j2445K7939N898j0964J579m441J8544J7184J3728l2397O418
$$ 11447 -49708 -62153 -34214 -28316 -39280 -37701 -42142 -23598 -6414 7314 -25083 -18665
10464a8665J473k3l5890M53O883K2455p460j61k058j5043N601J1707K260R353
$$ -18665 -17192 -17215 -53105 -52652 -45769 -23314 -30774 -30935 -32993 -48036 -42435 -30728 -28468 -19115
10450a9115j906J1141k0474j5504j8282j1905J9193L3182j9088Q634J8436k892
$$ -19115 -21021 -9880 -30354 -45858 -64140 -76045 -56852 -23670 -42758 -34124 -15688 -18580
10438a8580k7927K5370K2988j0788j3462l3806j0359J0451P359N974L061Q842
$$ -18580 -46507 -21137 1851 -8937 -22399 -56205 -66564 -56113 -48754 -42780 -39719 -30877
10426c0877J9082Q390k974j262J8733J0848j3394k9166M642J6752j0045o104j7888
$$ -30877 -11795 -3405 -6379 -7641 11092 21940 8546 -20620 -15978 774 -9271 -15375 -33263
10413c3263j4784J3638J1506L3643J8636p785l140k1247k209l3043m4126n400
$$ -33263 -48047 -34409 -22903 10740 29376 21591 18451 -2796 -5005 -38048 -82174 -87574
10401h7574K2399N93j8050j1299J8318K9347J5185J7019N059J4948k557o400j402
$$ -87574 -65175 -64582 -82632 -93931 -75613 -46266 -31081 -14062 -9003 5945 3388 -3012 -4414
10388d414l3417n427J8341K345k7472l982K5434J2198j4809m203L9930K3084m163
$$ -4414 -37831 -43258 -24917 -22572 -50044 -54026 -28592 -16394 -31203 -35406 4524 27608 23445
10375B3445l261j0557M860J7858j5613l2316k845J8933k0553j0266J3737K6806
$$ 23445 20184 9627 14487 32345 16732 -15584 -18429 504 -20049 -30315 -16578 10228
10363A0228j5469j2545K7114j5059Q664L712P596j3201j3474p359r821l4925j0551
$$ 10228 -5241 -17786 9328 -5731 2933 6645 14241 1040 -12434 -19793 -29614 -64539 -75090
10350g5090J3652M2700J6164J6075J3972n028j3317k1617j8068k0871J230j4662
$$ -75090 -61438 -18738 -2574 13501 27473 22445 9128 -12489 -30557 -51428 -50198 -64860
10338f4860Q671N818N0000L2181J3159J1293n378L88j4697l853L996k4074M428
$$ -64860 -56189 -50371 -371 31810 44969 56262 50884 51272 36575 32722 36718 12644 17072
10325A7072K0169j8125p529k344l1689j3660J5475K4074j652m133o151J7917j5476
$$ 17072 37241 19116 11587 9243 -22446 -36106 -20631 3443 1791 -2342 -8493 9424 -6052
10312f052k4635j764J2151o433R786L6510j434j8374M92J5937j2009l3673j1722
$$ -6052 -30687 -32451 -20300 -26733 -16947 19563 18129 -245 247 16184 4175 -29498 -41220
10299d1220J3463K5472O150m0338k8720j6168K7871M7140Q170J310j2492n130
$$ -41220 -27757 -2285 3865 -36473 -65193 -81361 -53490 -6350 1820 3130 -9362 -14492
10287a4492p371J2217K8688l2924Q870L845l2549K150l454K1815M1902k5005j4075
$$ -14492 -21863 -9646 19042 -13882 -5012 -1167 -33716 -31566 -35020 -13205 28697 3692 -10383
10274a0383K0150L6161J16j3730j8826j4039J1883j197O964j6849M408J1661l3933
$$ -10383 9767 45928 46044 32314 13488 -551 11332 10135 17099 250 4658 16319 -17614
10261a7614l8711j55k6115j8890K2531J7405Q217M0984L2745m88j9428l4667K253
$$ -17614 -56325 -56480 -82595 -101485 -78954 -61549 -53332 -12348 20397 19909 481 -34186 -31933
10248c1933K2432J090n213k589q259k2110k2897j636J4680L4794N0304O979l8513
$$ -31933 -9501 -8411 -13624 -16213 -24472 -46582 -69479 -71115 -56435 -21641 28663 35642 -2871
10235b871j3571k7554J7600O766j1403j7744J5268k556K673L7913l408j6993R790
$$ -2871 -16442 -43996 -26396 -19630 -31033 -48777 -33509 -36065 -33392 4521 1113 -15880 -6090
10222f090J4989j8562o882l135K175K0595j247j2591k44L628J250K9083l526k408
$$ -6090 8899 -9663 -16545 -19680 -17505 3090 1843 -10748 -10992 -7364 -6114 22969 19443 17035
10208A7035K4110l5364l7911l262K1905M818M141K2483J9706j4345k2769o411
$$ 17035 41145 5781 -32130 -35392 -13487 -8669 -4528 17955 37661 23316 547 -5864
10196e864k5130j4941J7364j9858j984j0090k3666P497J9354j681K2682j1785
$$ -5864 -30994 -45935 -28571 -48429 -50413 -60503 -84169 -76672 -57318 -58999 -36317 -48102
10184d8102p848k1564J2583J9349j0745N320L7934O939J8843q374l7937k0508
$$ -48102 -55950 -77514 -64931 -45582 -56327 -51007 -13073 -6134 12709 4335 -33602 -54110
10172e4110J5810J7263q663r857j0253J4561L2834R923p730o509j979j5907J5156
$$ -54110 -38300 -21037 -29700 -39557 -49810 -35249 -2415 7508 -222 -6731 -8710 -24617 -9461
10159i461L8542Q318n747k7185L055K3998R044j6841k716k5955r149l223k727
$$ -9461 29081 37399 31652 4467 7522 31520 40564 23723 21007 -4948 -14097 -17320 -20047
10146b0047p199O922j6499M993L9576k1154o240J8587l1696j4388K6081m906k8468
$$ -20047 -27246 -20324 -36823 -31830 7746 -13408 -19648 -1061 -32757 -47145 -21064 -25970 -54438
10133e4438k4208J5328M1955M856r681J7967M045j5413P537K747K3241K863l467
$$ -54438 -78646 -63318 -21363 -16507 -26188 -8221 -4176 -19589 -12052 -9305 13936 16799 13332
10120A3332p329l0448j3273n604j1851q90L0917j494J8415J6218k9400q565K9396
$$ 13332 6003 -24445 -37718 -43322 -55173 -56063 -25146 -26640 -8225 7993 -21407 -29972 -576
10107e76Q947k1982k106k1599k2027K9360O966J8845j5194j100k1397J1209K4057
$$ -576 8371 -13611 -15717 -37316 -59343 -29983 -23017 -4172 -19366 -20466 -41863 -30654 -6597
10094f597j7961k3245L524N592J6512M922j6955J343j3641J9060r414O628O022
$$ -6597 -24558 -47803 -44279 -38687 -22175 -17253 -34208 -32865 -46506 -27446 -36860 -30232 -24210
10081b4210j7514L01p235K3967K8407l345Q105J4817J050j5262j0570L553j7269
$$ -24210 -41724 -41423 -48658 -24691 3716 371 8476 23293 24343 9081 -1489 2064 -15205
10068a5205j633P508L1351J0023n414K3470J4234K05J751j566j401j7001l603
$$ -15205 -16838 -9330 22021 32044 26630 50100 64334 64539 66290 64724 63323 46322 42719
10055D2719J723k8407l0149n905m998K666k2476r693Q270L5239l731m027j8401
$$ 42719 44442 16035 -14114 -20019 -25017 -22351 -44827 -54520 -46250 -11011 -14742 -18769 -37170
10042c7170j3866J5257M1812j0351n556p173j5934k0196N218L3353K4438k5186
$$ -37170 -51036 -35779 6033 -4318 -9874 -17047 -32981 -53177 -47959 -14606 9832 -15354
10030a5354o155L9591J2784n456K19K066k8899r941q282P09m031R191l912q898
$$ -15354 -21509 18082 30866 25410 25629 27695 -1204 -11145 -19427 -18718 -22749 -13558 -17470 -26368
10016b6368p656j835J9745L1532l479j8944m7584l6310J1130q21K4073L7601J9529
$$ -26368 -34024 -35859 -16114 15418 11939 -7005 -54589 -90899 -79769 -80590 -56517 -18916 613
10003F13j009m711J7479R024K526m0885q832m974J3681K1696m011j1040K3800
$$ 613 -396 -5107 12372 21396 23922 -16963 -25795 -30769 -17088 4608 597 -10443 13357
9990A3357J606m005N485Q017r219k3432k5716r272R613J5197J7132R420K473N96
$$ 13357 14963 10958 16443 24460 15241 -8191 -33907 -43179 -33566 -18369 -1237 8183 10656 11252
9976A1252J5553K5694k4753m0592l1459R453J7026L740K2869j9492o484K9774
$$ 11252 26805 52499 27746 -12846 -44305 -34852 -17826 -14086 8783 -10709 -17193 12581
9964A2581N558j135M774k7832r499j4144R735O809r103o368q236M121L4590m007
$$ 12581 18139 17004 21778 -6054 -15553 -29697 -19962 -13153 -22256 -28624 -36860 -32739 1851 -2156
9950b156j2343l51l0009L109j401n310j463R565J7062L578Q450n900l878P432
$$ -2156 -14499 -14850 -44859 -41750 -43151 -48461 -49924 -40359 -23297 -19719 -11269 -17169 -21047 -13615
9936a3615J4707J217k7426J654J6301n537k902N25K220k3284k3475P369K0605
$$ -13615 1092 2309 -25117 -23463 -7162 -12699 -15601 -15076 -12856 -36140 -59615 -52246 -31641
9923c1641K0059j6735P608J2587l1169l5496n13K8266j1890k1423K4577J6703
$$ -31641 -11582 -28317 -20709 -8122 -39291 -74787 -75300 -47034 -58924 -80347 -55770 -39067
9911c9067L064N318M151k766n581q83J2484k280N152K7751j1247K439m750Q915
$$ -39067 -36003 -30685 -26534 -29300 -34881 -35764 -23280 -25560 -20408 7343 -3904 -1465 -6215 2700
9897B700N435k1482j5036j8093K3695K1708J0917J1332O749o297k4578K665j1615
$$ 2700 8135 -13347 -28383 -46476 -22781 -1073 9844 21176 27925 21628 -2950 -285 -11900
9884a1900L0156M9671J586k4302n680P007l1408k4443j2369L516K0162K1490J4453
$$ -11900 18256 67927 69513 45211 39531 46538 15130 -9313 -21682 -18166 1996 23486 37939
9871C7939m815J3436J5831j2302j5602o337k4777n083p732Q643q659K1247l5400
$$ 37939 33124 46560 62391 50089 34487 28150 3373 -1710 -9442 -799 -9458 11789 -23611
9858b3611j7245J0718R734Q904q592j9517K9342K7139K8335p454j7583r100M750
$$ -23611 -40856 -30138 -20404 -11500 -20092 -39609 -10267 16872 45207 37753 20170 11070 15820
9845A5820L0846K8875K2075L6365Q2548Q1034J06469J04979o201j07579j14501
$$ 15820 46666 75541 97616 133981 216529 297563 404032 509011 502810 395231 280730
9834B80730r9365p3669k7667k2937N891k0865m3747o161J3984J6027o125k2230
$$ 280730 181365 107696 80029 57092 62983 42118 -1629 -7790 6194 22221 16096 -6134
9822f134J4701K7056k0567j332j9872j9011n297M747L2287J5832l2815l3046o913
$$ -6134 8567 35623 15056 13724 -6148 -25159 -30456 -25709 6578 22410 -10405 -43451 -50364
9809e0364J3278J4563L397p514l083J5760K3122K5364Q480o964l0899J2481j3566
$$ -50364 -37086 -22523 -19126 -26640 -29723 -13963 9159 34523 43003 36039 5140 17621 4055
9796D055n3717Q200J2009K043m403L7906K417k3917k2882p276K230K4478j0071
$$ 4055 -49662 -41462 -29453 -27410 -31813 6093 8510 -15407 -38289 -45565 -43335 -18857 -28928
9783b8928J3320J6208L568K2400k1266k2431P653L2918j1879l8507J5927P185
$$ -28928 -15608 600 4168 26568 5302 -17129 -9476 23442 11563 -26944 -11017 -3832
9771c832L0181j6514m7639r953N362l002K331j8115L552J1689R615j3984J906
$$ -3832 26349 9835 -37804 -47757 -42395 -45397 -43066 -61181 -57629 -45940 -36325 -50309 -48403
9758d8403M0419K2347O540k0812k1232J7771K606j5620j1095J1260j6960j3585
$$ -48403 -7984 14363 20903 91 -21141 -3370 -764 -16384 -27479 -16219 -33179 -46764
9746d6764k225O499M907P28k936n17L2237J7122l054j7564r057J4009J6457M443
$$ -46764 -48989 -42490 -37583 -36855 -39791 -40308 -8071 9051 5997 -11567 -20624 -6615 9842 14285
9732A4285J9898k1751j2043p160K1234K0852r989l0738j0619n287k2368k5189
$$ 14285 34183 12432 389 -6771 14463 35315 25326 -5412 -16031 -21318 -43686 -68875
9720f8875M968J7635Q325K1296K5589K7361J6855k3012k1525j051j6496P205k3851
$$ -68875 -63907 -46272 -37947 -16651 8938 36299 53154 30142 8617 7566 -8930 -1725 -25576
9707b5576k6669n963J0394J6219K895K1046L0675K1969o234m2647k0589j6298
$$ -25576 -52245 -58208 -47814 -31595 -28700 -7654 23021 44990 38756 -3891 -24480 -40778
9695d0778p549j356R51o371p238K8202K7914k0880j4289K2214J4856l493m1237
$$ -40778 -48327 -49683 -48732 -55103 -62341 -34139 -6225 -27105 -41394 -19180 -4324 -7817 -49054
9682d9054k4570k7056J820O2519L5786M793j7457m3243n919J7274j1652m428N204
$$ -49054 -73624 -100680 -98860 -36341 -555 4238 -13219 -56462 -62381 -45107 -56759 -61187 -55983
9669e5983M1737M6404J4809k3625m463o763j9699k6477o800R794j1844J5878L9670
$$ -55983 -14246 32158 46967 23342 18879 12116 -7583 -34060 -40860 -31066 -42910 -27032 12638
9656A2638j0243L651M883j4110J6049o424k0783k5910K283J1283k470R469N4253
$$ 12638 2395 6046 10929 -3181 12868 6444 -14339 -40249 -37966 -26683 -29153 -19684 34569
9643C4569j3581j7379j4435j4805Q579K4915R204l1463p468J9462j0096j0223
$$ 34569 20988 3609 -10826 -25631 -17052 7863 17067 -14396 -21864 -2402 -12498 -22721
9631b2721R656K750J1154j0117k3378k0064K8995P032j114N316o995j6750j1641
$$ -22721 -13065 -10315 839 -9278 -32656 -52720 -23725 -16693 -17807 -12491 -19486 -36236 -47877
9618d7877K0772J0219K020q641j6380R986K7413P125m18K0617k4423q055L3083
$$ -47877 -27105 -16886 -14866 -23507 -39887 -29901 -2488 4637 4219 24836 413 -7642 25441
9605B5441R152l793J970J6264k3334m6258j9878N375L086J7517K9063N939j8535
$$ 25441 34593 30800 32770 49034 25700 -20558 -40436 -35061 -31975 -14458 14605 20544 2009
9592B009k7566Q251j1216L1017j4357J751J9478K5864K077j7121j5528J5374M703
$$ 2009 -25557 -17306 -28522 2495 -11862 -10111 9367 35231 37308 20187 4659 20033 24736
9579B4736P30N720j1115k6814j3534J6013J4755k9520l2152R109K6843J9136n69
$$ 24736 25466 31186 20071 -6743 -20277 -4264 10491 -19029 -51181 -42072 -15229 3907 3338
9566C338j5641J2028J8331P225K159k0514j8728K3565q120j4334j6337N157J3202
$$ 3338 -12303 -275 18056 25281 27440 6926 -11802 11763 3643 -10691 -27028 -21871 -8669
9553h669k273j8556J1419K785k3458q72Q557J8094J639Q692J5083P116K4544K073
$$ -8669 -10942 -29498 -18079 -15294 -38752 -39624 -31067 -12973 -11334 -2642 12441 19557 44101 46174
9539D6174J606n267k0627k7024o364J4879M8792J0200k3668k0959P218J991L894
$$ 46174 47780 42513 21886 -5138 -11502 3377 52169 62369 38701 17742 24960 26951 30845
9526C0845j984J7791K1173k0890k1820Q990K639j613N960N73k2293P965J2149
$$ 30845 28861 46652 67825 46935 25115 34105 36744 35131 41091 41664 19371 27336 39485
9513C9485K3964K0476j256j0347k5987k3454J6717J2747J617p916R144J8839J5365
$$ 39485 63449 83925 82669 72322 46335 22881 39598 52345 53962 46046 55190 74029 89394
9500H9394j2157N069K6283L5045l429p907l878j4137K0119j5250q890k4699j621
$$ 89394 77237 82306 108589 143634 140205 132298 128420 114283 134402 119152 110262 85563 83942
9487H3942L3716K1709k0024p386j4927L024K2180K1827k793o428K7771M5732J2638
$$ 83942 117658 139367 119343 111957 97030 100054 122234 144061 141268 134840 162611 208343 220981
9474B20981J8629J3223K8296M5797Q176P494M6783N2656M2370M0910J7574K3220
$$ 220981 239610 252833 281129 326926 335102 342596 389379 442035 484405 525315 542889 566109
9462E66109O6865P5876N4397Q5782J18136J34188J22406J26403J71131K09124
$$ 566109 632974 708850 763247 849029 967165 1101353 1223759 1350162 1521293 1730417
9452A730417K76983L36334M47685N17402O45098P89358J072097J320818J558657
$$ 1730417 2007400 2343734 2791419 3308821 3953919 4743277 5815374 7136192 8694849
9443H694849J691988J648966J187446L45093o39059j414832j753923j691979j491241
$$ 8694849 10386837 12035803 13223249 13568342 12929283 11514451 9760528 8068549 6577308
9434F577308j206636r18260p72415o06381m70335l79330l15087k42787j77381
$$ 6577308 5370672 4452412 3679997 3073616 2603281 2223951 1908864 1666077 1488696
9425A488696j37064j42181j15459j00189r2212q0958p8033o1833p2903m1696j0114
$$ 1488696 1351632 1209451 1093992 993803 901591 820633 742600 680767 607864 566168 556054
9414E56054k3761l1598m8468l7307N234n974k1751m8312l1336k4123m1794k8086
$$ 556054 532293 500695 452227 414920 420154 414180 392429 344117 312781 288658 246864 218778
9402B18778j0282j5081K0269K528l6869P036r102o222j7517Q669r541k866l3438
$$ 218778 208496 193415 213684 216212 179343 186379 177277 171055 153538 162207 152666 149800 116362
9389A16362n5381k604J2553r985J8999o958j0105K6984J6147J337k3116R427N33
$$ 116362 60981 58377 70930 60945 79944 72986 62881 89865 106012 107349 84233 93660 94193
9376I4193l5440k452K4394N804k001j2763j0628P640J0624j7903p41k1135l4625
$$ 94193 58753 56301 80695 86499 84498 71735 61107 68747 79371 61468 60727 39592 4967
9363D967L4921L0446l1468k0946J6738P637j3377K4974L1189P486k0640q764k1130
$$ 4967 39888 70334 38866 17920 34658 42295 28918 53892 85081 92567 71927 63163 42033
9350D2033j5645L5025n278k1209k2230j3943M295J2919O906j6678j0338j837j2507
$$ 42033 26388 61413 56135 34926 12696 -1247 3048 15967 22873 6195 -4143 -5980 -18487
9337a8487k9239p784L5845K3603J4823j3746L482J6975r936N76o187j6549K0124
$$ -18487 -47726 -55510 -19665 3938 18761 5015 8497 25472 15536 16112 9925 -6624 13500
9324A3500K0672J3615J7598L8662n387n252p879o345k3656j6485n40L946J8706
$$ 13500 34172 47787 65385 104047 98660 93408 85529 79184 55528 39043 38503 42449 61155
9311F1155M8974J0281K7747L9728N4010J06200J67015Q5596n8028j21626j27588
$$ 61155 110129 120410 148157 187885 241895 348095 515110 600706 542678 421052 293464
9300B93464r5614o1808l2012p353m125k1012l9132L285N867o009k2219N388L8373
$$ 293464 197850 136042 104030 96677 92552 71540 32408 35693 41560 35551 13332 18720 57093
9287E7093m22l0540p211k1282K0418O18j3214j484Q921o456J3543J5700j0698
$$ 57093 56671 26131 18920 -2362 18056 18674 5460 3976 12897 6441 19984 35684 24986
9274B4986N077K1438K6623K945l822j7214l759J997M0759M2211Q1547Q3689J25840
$$ 24986 30063 51501 78124 81069 77247 60033 56274 58271 99030 141241 222788 306477 432317
9261D32317K14076L14603K61800P905l01119l07058j96145j26112q3519o3805
$$ 432317 646393 960996 1222796 1230701 929582 622524 426379 300267 216748 152943
9251A52943l6748n5517j5305m041L5k1028k44M6664K827l5572J0924j1407j5062
$$ 152943 116195 60678 45373 41332 41367 20339 20095 66759 69586 34014 44938 33531 18469
9238A8469k1192k5501J5310O345k2043O979l4k98P930L4748J9265J868P573N311
$$ 18469 -2723 -28224 -12914 -6569 -28612 -21633 -21667 -21965 -14035 20713 39978 41846 49419 54730
9224E4730k2153j2761K4196K0500J0609L4296L1092L0765J19863J31362J21213
$$ 54730 32577 19816 44012 64512 75121 109417 140509 171274 291137 422499 543712
9213E43712j640j02015j51967j27304m8381l6456m2208m5456M10J0734J792j3475
$$ 543712 542072 440057 288090 160786 112405 75949 33741 -11715 -11305 -571 1221 -12254
9201a2254o101l869R107p226J4374q391k0584J3616K5355K4629O462k358j4516
$$ -12254 -18355 -22224 -13117 -20343 -5969 -14360 -34944 -21328 4027 28656 35118 32760 18244
9188A8244J4159J4220j6497J4326J5699k9181m725l246Q826q908j4099l1890r451
$$ 18244 32403 46623 30126 44452 60151 30970 26245 22999 31825 22917 8818 -23072 -32523
9175c2523J3326K7132J1866k0786K5215N39j3426P024k9997l5150R665L2391j33
$$ -32523 -19197 7935 19801 -985 24230 24769 11343 18367 -11630 -46780 -37115 -4724 -4857
9162d857P231j4616R451M171J0515p557p319K5656Q025j0777k5699k0513K3614
$$ -4857 2374 -12242 -2791 1380 11895 4338 -2981 22675 30700 19923 -5776 -26289 -2675
9149b675O90k654l074j5751o843K3531K8013M3621L200n2870n3236j3009K2404
$$ -2675 -1985 -4639 -7713 -23464 -30307 -6776 21237 64858 68058 15188 -38048 -51057 -28653
9136b8653L7065M037L7083K8866j4106j8460j4476j421K6424L411L234j2194P46
$$ -28653 8412 12449 49532 78398 64292 45832 31356 29935 56359 59770 63004 50810 51556
9123E1556j4062j474R142k6629j8206J122r011l3K7909K9398J8480j5823L710
$$ 51556 37494 36020 45162 18533 327 1449 -7562 -7595 20314 49712 68192 52369 56079
9110E6079J6322K0558j0517j8564n682J1704l4200l9063M3895M4851M780l0716
$$ 56079 72401 92959 82442 63878 58196 69900 35700 -3363 40532 85383 90163 59447
9098E9447l0545l1642k0452k1360J7700K5234K2659N683M456j9688j2294J978
$$ 59447 28902 -2740 -23192 -44552 -26852 -1618 21041 26724 31180 11492 -802 1176
9086A176l829p510q108L7622Q854L6609o422M005L1614k6782n1505p132N639j4742
$$ 1176 -2653 -10163 -18271 19351 28205 64814 58392 62397 94011 67229 15724 8592 14231 -511
9072e11p830q184Q370J6273M93k3643J5750K1618Q018k978n043o85J3553J1764
$$ -511 -8341 -16525 -8155 8118 8611 -15032 718 22336 30354 27376 22333 21648 35201 46965
9058D6965n059N814r33j1291k2223n1295k9540L9736P186K429o295M662N837N66
$$ 46965 41906 47720 46787 35496 13273 -38022 -67562 -27826 -20640 -18211 -24506 -19844 -14007 -13441
9044a3441l592N268O824j3950j3117r780K4519m380J7906L5480j6239k5679p05
$$ -13441 -17033 -11765 -4941 -18891 -32008 -41788 -17269 -21649 -3743 31737 15498 -10181 -10886
9031a0886j1722K6829M1002K2211j6003j6791J0395o987j904J1090J599j8075
$$ -10886 -22608 4221 45223 67434 51431 34640 45035 38048 36144 47234 48833 30758
9019C0758J142K1754j6021j553J0425J343J3031m903m813l6644n0630m4175k9719
$$ 30758 31900 53654 37633 36080 46505 47848 60879 55976 51163 14519 -36111 -80286 -110005
9006a10005M6956K8014M351J4848J0698J0317J0944k0953k5243m718k6508j8911
$$ -110005 -63049 -35035 -30684 -15836 -5138 5179 16123 -4830 -30073 -34791 -61299 -80210
8994h0210L6456N5464M6737M2054J8529j1340j7342k7862k0370K1338K6046L051
$$ -80210 -43754 11710 58447 100501 119030 107690 90348 62486 42116 63454 89500 92551
8982I2551J7683L3167k762O65J2006p610O710k3547k7744J133j502j4729K111
$$ 92551 110234 143401 140639 141304 153310 145700 152410 128863 101119 102252 100750 86021 88132
8969H8132J8830j861M1507J8195J8392J436m6908j5202L9225J1871K1042J8508
$$ 88132 106962 105101 146608 164803 183195 184631 137723 122521 161746 173617 194659 213167
8957B13167k770J0030K4348M154K094L40n167j2753K111k0240R749K4194N1061
$$ 213167 210397 220427 244775 248929 251023 251363 246196 233443 235554 215314 225063 249257 300318
8944C00318K8406O0845P088J3595O6164P9328M8967l221K686L9769N7184L4296
$$ 300318 328724 389569 396657 410252 476416 555744 604711 601490 604176 643945 701129 735425
8932G35425L6597Q2354N9829M3868P1424N9313Q3580O6663J33574K21082K80065
$$ 735425 772022 854376 914205 958073 1029497 1088810 1172390 1239053 1372627 1593709 1873774
8921A873774L00923M18288N07381N41471N51646N63303P13769J076797J432216
$$ 1873774 2174697 2592985 3100366 3641837 4193483 4756786 5470555 6547352 7979568
8912G979568J998053L056448M697318P450841J2252324K0013351K8521669K5086450
$$ 7979568 9977621 13034069 17731387 25182228 37434552 57447903 85969572 111056022
8904A11056022j46904k5478266k8862087j9783131j1753011p001835m388092k894160
$$ 111056022 110909118 85430852 56568765 36785634 25032623 18030788 13642696 10748536
8896A0748536j950161j305510r10987p41165n57725l66803j73199j54745k22733
$$ 10748536 8798375 7492865 6581878 5840713 5282988 4916185 4742986 4588241 4365508
8887D365508k23923k23673j61224j22717n3785l1215r07P0439J96279K50688L50856
$$ 4365508 4141585 3917912 3756688 3633971 3580186 3548971 3548064 3618503 3814782 4065470 4416326
8876D416326M98779O65538Q90268J119279J040151R45609J249781J839631K560475
$$ 4416326 4915105 5580643 6470911 7590190 8630341 9575950 10825731 12665362 15225837
8867A5225837L612749N408256Q349000J3318657K2310749L7989982N9328621N9720503
$$ 15225837 18838586 24246842 32595842 45914499 68225248 106215230 165543851 225264354
8859B25264354O205073n3828279o2468327m1968803k4432979j4361704q840039
$$ 225264354 231469427 177641148 115172821 73204018 48771039 34409335 25569296
8852B5569296n808004m007349k757636j925409j387280j009543o43249l21508
$$ 25569296 19761292 15753943 12996307 11070898 9683618 8674075 8030826 7709318
8844G709318l80701o43603o94282n58071m57372l73241l27910k68621j78369j09597
$$ 7709318 7328617 6685014 5990732 5432661 4975289 4602048 4274138 4005517 3827148 3717551
8834C717551J1932R7694J57335J77822K38705L46007M07566M41417M58562O11232
$$ 3717551 3729483 3827177 3984512 4162334 4401039 4747046 5154612 5596029 6054591 6665823
8824F665823Q77830J299540J813517K616408L948374O213187J0156995J6684087
$$ 6665823 7543653 8843193 10656710 13273118 17221492 23434679 33591674 50275761
8816E0275761K5281539K7113616P982615j9946053k9424531k1997840j3236801
$$ 50275761 75557300 102670916 110653531 90707478 61282947 39285107 26048306
8809B6048306p793031m801286l115700k143921j490027j032013p13497n07786
$$ 26048306 18255275 13453989 10338289 8194368 6704341 5672328 4958831 4451045
8801D451045l30091k25358k14573l08534l63094l41217k58476k15107j86841j74357
$$ 4451045 4120954 3895596 3681023 3372489 3009395 2668178 2409702 2194595 2007754 1833397
8791A833397j57333j00582n2319k6047l0363r2693j00592p4294l8711m9672n6960
$$ 1833397 1676064 1575482 1523163 1497116 1466753 1374060 1273468 1199174 1160463 1110791 1053831
8780A053831m9672j7935j3182r119k0893j6048k6040l3258k8242k5179O387j4500
$$ 1053831 1004159 986224 973042 963923 943030 926982 900942 867684 839442 814263 820650 806150
8768H06150o1324n3255n9394l3648j0668j5216l3700j2576Q288J7651j9045j3987
$$ 806150 744826 691571 632177 598529 587861 572645 538945 526369 534657 552308 533263 519276
8756E19276j449l836k6448m8257R684N897K8755N0658j046l2636l4274j0892j842
$$ 519276 517827 513991 487543 439286 448970 454867 483622 534280 533234 500598 466324 455432 453590
8743D53590Q883M235k9578l6733j1669L2348r08k0438L5773N4677K0828j7192
$$ 453590 462473 466708 437130 400397 388728 421076 420168 399730 435503 490180 511008 493816
8731D93816q577N6338J5981j3099l3001l4838p042k9902m4832o825M843k6865
$$ 493816 485239 541577 557558 544459 511458 476620 469578 439676 394844 388019 392862 365997
8719C65997j0039j5827J221K3799n165p799j4606n6409o366J8016K285l1289J342
$$ 365997 355958 340131 341352 365151 359986 352187 337581 281172 274806 292822 295107 263818 265160
8706B65160J0636N715J3275J3346P929o778q410L603k2308m3648m0144Q674K6049
$$ 265160 275796 281511 294786 308132 316061 309283 300873 304476 282168 238520 198376 207050 233099
8693B33099J2418J5589J0080K8123M9004m986m8816k4245N841Q881J4648l019
$$ 233099 245517 261106 271186 299309 348313 343327 294511 270266 276107 284988 299636 296617
8681B96617J339n417M757l2277l3281j5626k045J1095k103J0814Q327k0846l1469
$$ 296617 297956 292539 297296 265019 231738 216112 214067 225162 223059 233873 242200 221354 189885
8668A89885k2412n976L889k525j6812j7549M873j0011k0834j8011l614K0562J6041
$$ 189885 167473 161497 165386 162861 146049 128500 133373 123362 102528 84517 80903 101465 117506
8655A17506J9060J6726K1144J016K290j155r779N950O273J1979K363l8902j3748
$$ 117506 136566 153292 174436 175452 177742 176587 166808 172758 179031 191010 193373 154471 140723
8642A40723j1253m855M0778L8156M7887J2178j4252m6695o1606j6382j9536l709
$$ 140723 129470 124615 165393 203549 251436 263614 249362 202667 141061 124679 105143 101434
8630A01434J2450o948p427N840K7686j6562j973J6694O906N421l7854j5482k937
$$ 101434 113884 106936 99509 105349 133035 116473 114500 131194 138100 143521 105667 90185 87248
8617H7248J7403M1242k432l9545q856j6365j1301l091L4500R774M639K5076O718
$$ 87248 104651 145893 143461 103916 95060 78695 67394 64303 98803 108577 113216 138292 145010
8604A45010j936O234q070j2926j4199M059K211L913J0080M2303N7148Q0473L9046
$$ 145010 143074 149308 141238 128312 114113 118172 120383 124296 134376 176679 233827 314300 353346
8591C53346k7532p6296n5200n2963m3610j0569J4647K5017j7844l3801j3157L4473
$$ 353346 325814 249518 194318 141355 97745 87176 101823 126840 108996 75195 62038 96511
8579I6511L3487M089J0455j9578j6844k5754j9825J0598P574n235O176m988M0427
$$ 96511 129998 134087 144542 124964 108120 82366 62541 73139 80713 75478 81654 76666 117093
8566A17093J3402j8598l1485J3586R951k4715j2833Q942J5162j2644J4581K6659
$$ 117093 130495 111897 80412 93998 103949 79234 66401 75343 90505 77861 92442 119101
8554A19101K6875J8760l8877J022L0122L9622L2377K9144l3019o0237q1441m3295
$$ 119101 145976 164736 125859 126881 157003 196625 229002 258146 225127 164890 83449 40154
8542D0154J093J3202J9911O606m324J475j3692l260l3669j5889J1193J7563L9516
$$ 40154 41247 54449 74360 80966 76642 78117 64425 61165 27496 11607 22800 40363 79879
8529G9879K8500J2835Q13n0891m0411J669q52J7857P761R331R109j2156K1633
$$ 79879 108379 121214 122027 71136 30725 32394 31542 49399 57160 66491 75600 63444 85077
8516H5077K4426l260o503n185n66j0227J3291L2870K084L6669K1687m058J1526
$$ 85077 109503 106243 99740 94555 93989 83762 97053 129923 132007 168676 190363 186305 197831
8503A97831R2068J44700J29534P8098o7124j40798j34916r2596m3688l1105m5005
$$ 197831 289899 434599 564133 642231 575107 434309 299393 206797 163109 132004 86999
8492H6999k5566j180l4180p441J0706L9870M423j1561J9635P002l397j7779k679
$$ 86999 61433 60253 26073 18632 29338 69208 73631 62070 81705 88707 85310 67531 64852
8479F4852K7965J6984k0652j769N4350J2784l8339k4352l055R548L2803K385j1760
$$ 64852 92817 109801 89149 87380 141730 154514 116175 91823 88768 98316 131119 133504 121744
8466A21744M768L84p734J682M1141K2802N7128Q5105J47557K56793K98367J96651
$$ 121744 126512 126896 119162 120844 161985 184787 241915 327020 474577 731370 1029737 1226388
8454A226388r1689k84580k61690j64750j18775o8839j9765m6296l5615r472k0082
$$ 1226388 1134699 850119 588429 423679 304904 236065 216300 170004 134389 124917 104835
8443A04835k0111r189j2098o577J0254K1105L1518k6161J6160L351M549k9965
$$ 104835 84724 75535 63437 56860 67114 88219 119737 93576 109736 113087 117636 87671
8431H7671k3269K5030j2670r708J3452k632j2825k5141Q801K4612j2750l6192
$$ 87671 64402 89432 76762 67054 80506 77874 65049 39908 48709 73321 60571 24379
8419B4379J6179N9300M273q540J5485O1611P2176J01194J30792R9339k4057j35052
$$ 24379 40558 99858 104131 95591 111076 172687 244863 346057 476849 576188 552131 417079
8407D17079j36988j07985m0691L596j0336l8436k3540k127j510J5190J2558k4104
$$ 417079 280091 172106 131415 135011 124675 86239 62699 60572 59062 74252 86810 62706
8395F2706R948l2032j4262J0710l049q098n54j4386J4803K5052K8982j1009j2495
$$ 62706 72654 40622 26360 37070 34021 25923 25369 10983 25786 50838 79820 68811 56316
8382E6316j7671k7682l769J3221J4340K0778P657J268k314k1289R846K3917k8661
$$ 56316 38645 10963 7194 20415 34755 55533 63190 64458 62144 40855 50701 74618 45957
8369D5957k647J2500k017J1265J7455j4055L184j01q171K1539j2259N458k9475
$$ 45957 43310 55810 53793 65058 82513 68458 71642 71541 63370 84909 72650 78108 48633
8356D8633l5038K0297Q420k0910Q983k2942p017k2187L3023L5325k20m191l2315
$$ 48633 13595 33892 42312 21402 30385 7443 426 -21761 11262 46587 46367 42176 9861
8343I861r684R550j0749l0409P593L1164L7308p12k9893K0871N319j1353J119
$$ 9861 177 9727 -1022 -31431 -23838 7326 44634 43922 14029 34900 40219 28866 29985
8330B9985J3810m960l399k0702k4640K5463l867R164n266J7182k0592j4319R142
$$ 29985 43795 38835 35436 14734 -9906 15557 11690 20854 15588 32770 12178 -2141 7001
8317G001J6118j5424K6222l153j8806R878J7759k6899Q77j6099m1604j828L7947
$$ 7001 23119 7695 33917 30764 11958 21836 39595 12696 13573 -2526 -44130 -45958 -8011
8304h011J8865R824j072r256J5918L303K3706p176q507l468L497J0966J1892l0805
$$ -8011 10854 20678 19606 10350 26268 29571 53277 46101 37594 34126 37623 48589 60481 29676
8290B9676k8642J755L6667K9545k6300q866O39N35P455L945j1790L371j5018n783
$$ 29676 1034 2789 39456 69001 42701 33835 34474 35009 42464 46409 34619 37990 22972 17189
8276A7189j3868J3419L5817K0539j9613m2795L8540L9542K5852k0068k0861j4441
$$ 17189 3321 16740 52557 73096 53483 10688 49228 88770 114622 94554 73693 59252
8264E9252n830j6519m406m473L924N312J5086K4454N410M191k2054j7234l1453
$$ 59252 53422 36903 32497 28024 31948 37260 52346 76800 82210 86401 64347 47113 15660
8251A5660m4291k0998K2784L5212J2373Q583j529K7554K37l2648k0628k585k643
$$ 15660 -28631 -49629 -26845 8367 20740 29323 27794 55348 55585 22937 2309 -276 -2919
8238b919L7213L4619j9255l7639o927L6370K8669j2525l231j1944j4123p449J7125
$$ -2919 34294 68913 49658 12019 5092 41462 70131 57606 54375 42431 28308 20859 37984
8225C7984j0040m2774J2071M3812K8750k4304J3213K9745j1861n2259k6642L019
$$ 37984 27944 -14830 -2759 41053 69803 45499 58712 88457 76596 24337 -2305 714
8213G14J4493K5426n971J8748p913n0313j1484L5162J7085j3518N343r038P98
$$ 714 15207 40633 34662 53410 45497 -4816 -16300 18862 35947 22429 27772 18734 19532
8200A9532j7959l574L3915K3544k7462k3199R438J6497K6162l015L542j9379k0880
$$ 19532 1573 -2001 31914 55458 27996 4797 14235 30732 56894 53879 57421 38042 17162
8187A7162O619r925k5886K0630j7269j9968L927M3867J6112k391l2994k4754L6948
$$ 17162 23781 13856 -12030 8600 -8669 -28637 -24710 19157 35269 32878 -116 -24870 12078
8174A2078J3593p805P434m0450m185J5189K8497o719J9191K0910j3450l4319j2230
$$ 12078 25671 17866 25300 -15150 -19335 -4146 24351 17632 36823 57733 44283 9964 -2266
8161b266J0833J1543J8155j180j8882L271K1513O027K8309P755m3338m3202j446
$$ -2266 8567 20110 38265 37085 18203 21474 42987 49014 77323 85078 41740 -1462 -2908
8148b908K3124J7705k463k9460n655K634J890J3274J261p144J6628R639j2228
$$ -2908 20216 37921 35458 5998 343 2977 4867 18141 19402 12258 28886 38525 26297
8135B6297j4336l632P079j4053j0299M4875L1069q873M882Q890k7038k2906J8898
$$ 26297 11961 8329 15408 1355 -8944 35931 67000 58127 63009 71899 44861 21955 40853
8122D0853m961j5229m813p687j277J3995p359J0024J1960K7554K1190k2472n1035
$$ 40853 35892 20663 15850 8163 6886 20881 13522 23546 35506 63060 84250 61778 10743
8109A0743k5031L846J0807o10L9800K4182j8808m710K159m2298j6888J8617K1302
$$ 10743 -14288 -10442 365 -245 39555 63737 44929 40219 42378 80 -16808 1809 23111
8096B3111J9967L469L7959K4070k7877k0600K730k2018j5448Q081j4645o799p368
$$ 23111 43078 46547 84506 108576 80699 60099 62829 40811 25363 33444 18799 12000 4632
8083D632L1485L7988j4124l5187k0182J248Q335R915l509j0802j0336K8270L762
$$ 4632 36117 74105 59981 24794 4612 5860 14195 24110 20601 9799 -537 27733 31495
8070C1495o145k5572k0334N022L3812l492p266k5239p766M688K0157o235R007
$$ 31495 25350 -222 -20556 -15534 18278 14786 7520 -17719 -25485 -20797 -640 -6875 2132
8057B132J1316N093j8001j9237j2588K1276k914j2351O7O48j2402j4422J3422
$$ 2132 13448 18541 540 -18697 -31285 -10009 -12923 -25274 -25207 -24559 -36961 -51383 -37961
8044c7961J9956Q489L2107K3746m327N348j4613O277K810P9j4270P465j0421j0645
$$ -37961 -18005 -9516 22591 46337 42010 47358 32745 39022 41832 41911 27641 35106 24685 14040
8030A4040j1792j2253m364J7491J2786K3704j3407r251l0907N335J1962M079K2932
$$ 14040 2248 -10005 -14369 3122 15908 39612 26205 16954 -13953 -8618 3344 7423 30355
8017C0355J2186j041K1946P833m941L341j0478l4941m2558J1577M662M562J5543
$$ 30355 42541 41500 63446 71279 66338 69679 59201 24260 -18298 -6721 -2059 2503 18046
8004A8046j4890K2284J9399k3202n890J3778j344m8940O432r83J7002J4351J1372
$$ 18046 3156 25440 44839 21637 15747 29525 28181 -20759 -14327 -15310 1692 16043 27415
7991B7415M1792J7663r817k0114k3987j5595j9620K057J5819K53j6520r06L7747
$$ 27415 69207 86870 77053 56939 32952 17357 -2263 -206 15613 15866 -654 -1560 36187
7978C6187l8768k1100J1685k54R304M312k0759J4992J1002J0173k7887j9130J4506
$$ 36187 -2581 -23681 -11996 -12250 -2946 1366 -19393 -4401 6601 16774 -11113 -30243 -15737
7965a5737M4725K5086K8858j4350l5706j2045j3883p428N382k567j700J620L728
$$ -15737 28988 54074 82932 68582 32876 20831 6948 -480 4902 2335 635 2255 5983
7952E983K0717K3518j1279j2896M456j8020l563J5643K0265j0670k8973J3767
$$ 5983 26700 50218 38939 26043 30499 12479 8916 24559 44824 34154 5181 18948
7940A8948K8079N267k8417n745L1003R847r310k0571l0426j5424L038K0560j0346
$$ 18948 47027 52294 23877 18132 49135 58982 49672 29101 -1325 -16749 -13711 6849 -3497
7927c497K4727J3455J5010j3147k3896j1942k142r682k2680J8541L5674J5407
$$ -3497 21230 34685 49695 36548 12652 710 -1432 -11114 -33794 -15253 20421 35828
7915C5828j3353N114l1195k0394r194j2485m622K6544O5474M8010j0983k6799
$$ 35828 22475 27589 -3606 -24000 -33194 -45679 -50301 -23757 41717 89727 78744 51945
7903E1945j8134l2424l9141M2405K80l7203j835K5221Q589K856k0813j382j3353
$$ 51945 33811 1387 -37754 4651 4931 -32272 -34107 -8886 -297 2559 -18254 -19636 -32989
7890c2989k727K0895L470j2543j5161R529L1112N312n776O094J5067m0241n2784
$$ -32989 -35716 -14821 -11351 -23894 -39055 -29526 1586 6898 1122 7216 22283 -17958 -70742
7877g0742J3888K5923j6399m018j8284K125K3370J7482K1908Q480p775m04k6827
$$ -70742 -56854 -30931 -47330 -51348 -69632 -67507 -44137 -26655 -4747 3733 -4042 -4446 -31273
7864c1273r359J5557R266K1679K7615j0175m182n800P097l944K677J9165j7226
$$ -31273 -40632 -25075 -15809 5870 33485 23310 19128 13328 20425 16481 19158 38323 21097
7851B1097m709K8790P387j7844k8292k7337N495K8176J9461K0701o184j5730m130
$$ 21097 16388 45178 52565 34721 6429 -20908 -15413 12763 32224 52925 46741 31011 26881
7838B6881J2724k2383N172J8552p69l7446k4792J80K3843J9849q572q831M0918
$$ 26881 39605 17222 22394 40946 40177 2731 -22061 -21881 1962 21811 13239 4408 45326
7825D5326J1992j8421k3206p868j2597j6006J1291r904M829J3276j5574j2611
$$ 45326 57318 38897 15691 7823 -4774 -20780 -9489 -19393 -14564 -1288 -16862 -29473
7813b9473j295o679j5961j8214J2274K7856n72L0358o273J6192J2844o805q749
$$ -29473 -30768 -37447 -53408 -71622 -59348 -31492 -32064 -1706 -7979 8213 21057 14252 5503
7800E503J044k0303L1896j2407j0566J5991M046J5320k312J0948J1725n318j3691
$$ 5503 6547 -13756 18140 5733 -4833 11158 15204 30524 28212 39160 50885 45567 31876
7787C1876l3103m349M393J737K3342p185j4106L84K0459L0905k0263m0035L198
$$ 31876 -1227 -5576 -1183 554 23896 16711 2605 2989 23448 54353 34090 -5945 -2747
7774b747j1325N768J7313K5145k2701P603J8334q302j8881j5202K2161L190K4326
$$ -2747 -14072 -8304 9009 34154 11453 19056 37390 29088 10207 -4995 17166 20356 44682
7761D4682J761n147n0727j8383L6324J1099j4095O349M148J155L1321L411j8770
$$ 44682 46443 41296 -9431 -27814 8510 19609 5514 11863 16011 17166 48487 51898 33128
7748C3128k0357J1625n665k8309J797j760j0555j4539L2090M781L5670J9729k9778
$$ 33128 12771 24396 18731 -9578 -7781 -9541 -20096 -34635 -2545 2236 37906 57635 27857
7735B7857k1602J7177N421N583j5181j1171J5773n19J4490J3171M300l7337Q156
$$ 27857 6255 23432 28853 34436 19255 8084 23857 23338 37828 50999 55299 17962 26118
7722B6118Q313k1318J239R602k8935j9895Q736J1987K9868j9297j2556P644l2602
$$ 26118 34431 13113 14352 23954 -4981 -24876 -16140 -4153 25715 6418 -6138 1506 -31096
7709c1096j066K6449J3662j5949N0K4390j254K3577o738J1976J0929K854j3179
$$ -31096 -32162 -5713 7949 -8000 -7950 16440 15186 38763 32025 44001 54930 57784 44605
7696D4605k1644j8423p39M460j1202J9103P091Q770m091l4136j2050J2040M70
$$ 44605 22961 4538 3799 8259 -2943 16160 23251 32021 27930 -6206 -18256 -6216 -5746
7683e746J1697J9219k54N479M749j3122j6966M838J646N442j1493q848k90N2839
$$ -5746 5951 25170 24916 30395 35144 22022 5056 9894 11540 16982 5489 -3359 -3649 49190
7669D9190L1570q828l9306r467m670k289K84k085k7406j6336K6897l20j6988R509
$$ 49190 80760 71932 32626 23159 18489 16200 16484 14399 -13007 -29343 -2446 -2766 -19754 -10245
7655a0245J7791l0882m8428j760L4608R748K792l085J6236M6637p164K896l5928
$$ -10245 7546 -23336 -71764 -73524 -38916 -29168 -26376 -29461 -13225 33412 26248 29144 -6784
7642f784j0651K1080K2983O796k0698m243o434k1092l49r838N075L034K8281M2463
$$ -6784 -17435 3645 26628 33424 12726 8483 2049 -19043 -19392 -29230 -24155 -21121 7160 49623
7628D9623P001k564N676j9589m608r887K0592L1004O933j5993j0318n250o592
$$ 49623 56624 54060 59736 40147 35539 25652 46244 77248 84181 68188 57870 52620 46028
7615D6028K1541k7886m3499j4490J3460k504q454l9802K296M615J0718j340J2967
$$ 46028 67569 39683 -3816 -18306 -4846 -7350 -15804 -55606 -53310 -48695 -37977 -39317 -26350
7602b6350L0166Q012J882J5636p533r103N378j1811k3145P029L3843j8085J0327
$$ -26350 3816 11828 13710 29346 21813 12710 18088 6277 -16868 -9839 24004 5919 16246
7589A6246J6223J3295O929j9559l1368k8516K4198M8200J0890p83k8121l2173
$$ 16246 32469 45764 52693 33134 1766 -26750 -2552 45648 56538 55755 27634 -4539
7577d539k5772j09J3623l128L4864J639N672k673K0418J6874k3597l2426J677
$$ -4539 -30311 -30420 -16797 -19925 14939 16578 22250 19577 39995 56869 33272 846 2523
7564B523p197k2212p040J3138K1589J0303j6055j1450P951j813L196M726K1136
$$ 2523 -4674 -26886 -33926 -20788 801 11104 -4951 -16401 -8450 -10263 -7067 -2341 18795
7551A8795m599j3412J5556J1674J1750j7502J2642m855j1646k565j0338J9722
$$ 18795 14196 784 16340 28014 39764 22262 34904 30049 18403 15838 5500 25222
7539B5222j3761j401q940j497l6920m163L2797J8582P537p079j2213j9635m1018
$$ 25222 11461 10060 1120 -377 -37297 -41460 -8663 9919 17456 10377 -1836 -21471 -62489
7526f2489K6048M6692n702M410l559j0254P147l402l417N963l3719p780L4594
$$ -62489 -36441 10251 4549 8959 5400 -4854 2293 -1109 -4526 1437 -32282 -40062 -5468
7513e468K5629m6014l6505L2640K0147j2185J6449M112k1569k3689R031J9254
$$ -5468 20161 -25853 -62358 -29718 -9571 -21756 -5307 -1195 -22764 -46453 -37422 -18168
7501a8168O763Q277J5618j2433K189j4520j4752J3188J5821J0404q834j4182p760
$$ -18168 -11405 -3128 12490 57 2246 -12274 -27026 -13838 1983 12387 3553 -10629 -18389
7488a8389L807J0446k1829l0363J3403P8265K3630m7873r355r351J4260J1220
$$ -18389 -14582 -4136 -25965 -56328 -42925 35340 58970 11097 1742 -7609 6651 17871
7476A7871q810P728r53k0354k0696J734m092O380m247j2500l350R809K8070K0103
$$ 17871 9061 16789 15836 -4518 -25214 -23480 -27572 -21192 -25439 -37939 -41289 -31480 -3410 16693
7462A6693K950k2217l2280K1639k28L6434J0508j8221j2907p889j7506j0120J1152
$$ 16693 19643 -2574 -34854 -13215 -13443 22991 33499 15278 2371 -5518 -23024 -33144 -21992
7449b1992J353N109j2063J0187j8372J8628M9999L38j6355J4990k9854k9897L0024
$$ -21992 -20639 -15530 -27593 -17406 -35778 -17150 32849 33187 16832 31822 1968 -27929 2095
7436B095M747o337K0319K6990j246n929m3169j5574J1298m797j4324p52M124Q011
$$ 2095 6842 505 20824 47814 46568 40639 -2530 -18104 -6806 -11603 -25927 -26679 -22555 -14544
7422a4544n486L4281P232p497k2450k1387o417L7041K0968K2621k372m5768m242
$$ -14544 -20030 14251 21483 13986 -8464 -29851 -36268 773 21741 44362 41990 -3778 -8020
7409h020J0655j5390k3035O475N0934M965j3714m247P398l1234o775j9160j3657
$$ -8020 2635 -12755 -35790 -29315 21619 26584 12870 8623 16021 -15213 -21988 -41148 -54805
7396e4805N672L3355K4190r729k1461j713j3637L8407K6796j5960r47k2916R529
$$ -54805 -49133 -15778 8412 -1317 -22778 -24491 -38128 279 27075 11115 10168 -12748 -3219
7383c219M5568M4k0093k1570p542K714n598P167J1888k0503k879K2370M187l5249
$$ -3219 42349 42393 22300 730 -6812 -4098 -9696 -2529 9359 -11144 -14023 8347 12534 -22715
7369b2715k4046r761L0938J22K344K3044J4810J0271k4705l1745p004M560o082
$$ -22715 -46761 -56522 -25584 -25462 -23118 -74 14736 25007 302 -31443 -38447 -33887 -39969
7356c9969R513L3666k2219k4685m655m441J9810K4262j1711j6598M7428J7024
$$ -39969 -30456 3210 -19009 -43694 -48349 -52790 -32980 -8718 -20429 -37027 10401 27425
7344B7425o322j3167j914K4490J2352m311l8638j8381j437o443J4794L9452r530
$$ 27425 21103 7936 6022 30512 42864 38553 -85 -18466 -19903 -26346 -11552 27900 18370
7331A8370j1918k5376r85k0559j687L7054J1246l6292M638K6604Q873J5900R910
$$ 18370 6452 -18924 -19909 -40468 -42155 -5101 6145 -30147 -25509 1095 9968 25868 35778
7318C5778l818k8061k6245r608J3618N973k4218k1970R20J3779R358k6309J5745
$$ 35778 31960 3899 -22346 -31954 -18336 -12363 -36581 -58551 -57631 -43852 -34494 -60803 -45058
7305d5058K4693L009K2725P787k8184l9590J7512J4975J3940J2608J2530K012
$$ -45058 -20365 -17356 5369 13156 -15028 -54618 -37106 -22131 -8191 4417 16947 18959
7293A8959P3P123j9317r750o40K8360p081o308j3383o111N085J0726R869L2911
$$ 18959 19032 26155 6838 -2912 -3552 24808 17727 11419 -1964 -8075 -2990 7736 17605 50516
7279E0516j7481k0692K0725l551k947K654M184j1518o083J0817q381l950j6567
$$ 50516 33035 12343 33068 29517 26570 29224 33408 21890 15807 26624 18243 14293 -2274
7266b274J996K0435p189Q441K7335J233k5037M666j996n263k046j9121J3656P525
$$ -2274 -278 20157 12968 21409 48744 49977 24940 29606 27610 22347 20301 1180 14836 22361
7252B2361l172P611l6893K3653Q899l5221j6217k828k3545n196J3393P29J5206
$$ 22361 19189 26800 -10093 13560 22459 -12762 -28979 -31807 -55352 -60548 -47155 -46426 -31220
7239c1220K7878K3006j631j6283K5674r756m236J6037J5279k8833k4312o145n165
$$ -31220 -3342 19664 18033 1750 27424 17668 13432 29469 44748 15915 -8397 -14542 -19707
7226a9707Q821J8720j6417j5534r521L286J9100k532j0108n908k1316K6590L9049
$$ -19707 -10886 7834 -8583 -24117 -33638 -30352 -11252 -13784 -23892 -29800 -51116 -24526 14523
7213A4523J4688K711L123k431k2032j0226n804k0762j007O205J1756P776K2711
$$ 14523 29211 31922 35045 32614 10582 356 -5448 -26210 -27217 -21012 -9256 -1480 21231
7200B1231J1506j362j4997K2128m275j9223j4984k2529J2486j8065j0867m975
$$ 21231 32737 31375 16378 38506 34231 15008 24 -22505 -10019 -28084 -38951 -43926
7188d3926j072J8165L095K3526N590O816J5645J4846Q143m5498l558m765L845
$$ -43926 -44998 -26833 -23738 -212 5378 12194 27839 42685 50828 5330 1772 -2993 852
7175H52L637j5324j6606J5420Q454k9406j600P613K2967N806o41l1745J9919L2917
$$ 852 4489 -10835 -27441 -12021 -3567 -32973 -34573 -26960 -3993 1813 1172 -30573 -10654 22263
7161B2263m0292q035j6771J0129M9099k6992l5278K0886Q562M441M67L266K9669
$$ 22263 -18029 -26064 -42835 -32706 16393 -10599 -45877 -24991 -16429 -11988 -11521 -8255 21414
7148B1414J7312q017p111J8035j5422k1086k0898j1244N946k4024n200K7891O3762
$$ 21414 38726 30709 23598 41633 26211 5125 -15773 -27017 -21071 -45095 -50295 -22404 41358
7135D1358K0165k8082l4329K789J9739J9632O188k2743Q804J6065r845l977j4842
$$ 41358 61523 33441 -888 1901 21640 41272 47460 24717 33521 49586 39741 35764 20922
7122B0922j4874K835j4569j1823k0994J13P421K1153K0040j9080J5349p916N343
$$ 20922 6048 8883 -5686 -17509 -38503 -38390 -30969 -9816 10224 -8856 6493 -1423 3920
7109C920k05l1715N499J5029K0680j6504j5116J0407J77o17J8560o099p811K1412
$$ 3920 3715 -28000 -22501 -7472 13208 -3296 -18412 -8005 -7828 -8445 10115 4016 -3795 17617
7095A7617P33r412j5629j1777m358k794j7818L0347j3055k1479K7763K7626K3895
$$ 17617 18350 8938 -6691 -18468 -22826 -25620 -43438 -13091 -26146 -47625 -19862 7764 31659
7082C1659M20K071q797m4427k3865J8925K3333j9671l0j1459j0516l01j6939r122
$$ 31659 32079 34150 25353 -19074 -42939 -24014 -681 -20352 -20382 -31841 -42357 -42658 -59597 -68719
7068f8719l36J9805L5848N0398K6168m550l2046k826L8299k2257j9505j7774K6926
$$ -68719 -69055 -49250 -13402 36996 63164 58614 26568 23742 62041 39784 20279 2505 29431
7055B9431K3187k8695k8361J7092J1213L926j5583j9675L05L2189M2k004M0285
$$ 29431 52618 23923 -4438 12654 23867 27793 12210 -7465 -7160 25029 25071 23067 63352
7042F3352j3235r555j1037J83K0755J1541J897l1444r792Q066j5149l9969j1339
$$ 63352 50117 40562 29525 29708 50463 62004 63901 32457 22665 30731 15582 -24387 -35726
7029c5726L3934L0023J237p807j8197j5492J9736m371j5682Q811L384K6134N254
$$ -35726 -1792 28231 29468 21661 3464 -12028 7708 3337 -12345 -3534 -150 25984 31238
7016C1238j5242k9867n50J5092K6517P35j8223k0884J3523j4590j5682J4762l7127
$$ 31238 15996 -13871 -14421 671 27188 27923 9700 -11184 2339 -12251 -27933 -13171 -50298
7003e0298K2628J4496J8539j4200j0211L2513J1924j6439p511j7645J8194p306
$$ -50298 -27670 -13174 5365 -8835 -19046 13467 25391 8952 1441 -16204 1990 -5316
6991e316j8531J0354P872l927q634r450J4713J9061l896P844j1641k5177k802
$$ -5316 -23847 -13493 -5621 -9548 -18182 -27632 -12919 6142 2246 10090 -1551 -26728 -29530
6978b9530N138j428J3610K764q719J2555J6729j4267j1546K9644j2682k2623K0162
$$ -29530 -24392 -25820 -12210 -9446 -18165 -5610 11119 -3148 -14694 14950 2268 -20355 -193
6965a93L3968P703k7397Q548N965j3792j4164q342j9165J6030K2637J2761k870
$$ -193 33775 41478 14081 22629 28594 14802 638 -7704 -26869 -10839 11798 24559 21689
6952B1689M181m655k683k0845j4050k282K2927K5402P025k6564p961l5420k9704
$$ 21689 25870 21215 18532 -2313 -16363 -18645 4282 29684 36709 10145 2184 -33236 -62940
6939f2940J7795J8922j3456J0753L104R860J2900O420M691K703k4463j4868n69
$$ -62940 -45145 -26223 -39679 -28926 -25822 -15962 -3062 3358 8049 10752 -13711 -28579 -29148
6926b9148M5790M471o890p416K9197j2122j3895q708j1581N936k0873j4115J8092
$$ -29148 16642 21113 14223 6807 36004 23882 9987 1279 -10302 -4366 -25239 -39354 -21262
6913b1262l976m758j7065N625k226o910J2163L9104J0220O47o471j8034K691K4639
$$ -21262 -25238 -29996 -47061 -41436 -43662 -50572 -38409 695 10915 11562 5091 -12943 -10252 14387
6899A4387J6762j4133l5366l7397n036Q829J4122k260j1931O2706K6884p378j7304
$$ 14387 31149 17016 -18350 -55747 -60783 -51954 -37832 -40092 -52023 10683 37567 30189 12885
6886A2885L66L9240j8792o214j2842N482k7167P410J0120k9085l436j9523O832
$$ 12885 13251 52491 33699 27485 14643 20125 -7042 368 10488 -18597 -22033 -41556 -34724
6873c4724K7510K4172p471k0684P754Q969Q128L275l0405j1835M029k0719o396
$$ -34724 -7214 16958 9487 -11197 -3443 5526 13654 16929 -13476 -25311 -21282 -42001 -48397
6860d8397k136K9835K4145j0310m2558K1183M7727R758k4467P914K6775J7974
$$ -48397 -50533 -20698 3447 -6863 -49421 -28238 19489 29247 4780 12694 39469 57443
6848E7443M601j2217k9804k8985l5417k752J526J292p369J2687O551J8791p99
$$ 57443 62044 49827 20023 -8962 -44379 -47131 -45605 -44313 -51682 -38995 -32444 -13653 -14452
6835a4452R93J4620L563m051j0639l0807k5877K7530J8409J2227O2962O035j2090
$$ -14452 -13459 1161 4724 673 -9966 -40773 -66650 -39120 -20711 -8484 54478 60513 48423
6822D8423j376o186p375J6157l5743j0648J5717K7463q323k5570m0364k475M353
$$ 48423 47047 40861 33486 49643 13900 3252 18969 46432 38109 12539 -27825 -30300 -25947
6809b5947J4757K3749m015J1758P743j1400o256l574J525Q450J768J468j6017
$$ -25947 -11190 12559 8544 20302 28045 16645 10389 6815 8340 16790 18558 20026 4009
6796D009o234J2379j2641l22J8061j133R275J886K9556j2634j6255l3787K9935
$$ 4009 -2225 10154 -2487 -2809 15252 14119 23394 25280 54836 42202 25947 -7840 22095
6783B2095M4084Q738J1505j7834m3899j2952q866J2298J0796r717k3197j8947
$$ 22095 66179 74917 86422 68588 24689 11737 2871 15169 25965 16248 -6949 -25896
6771b5896L745m03l538p183o953J3394J1215J6774k2480j8114K200q504m729L0614
$$ -25896 -22151 -22554 -26092 -33275 -40228 -26834 -15619 1155 -21325 -39439 -37239 -45743 -50472 -19858
6757a9858L8871j46r394P690j744J5219r466l0531j6717p093J8807M7065L9386
$$ -19858 19013 18867 9473 17163 15419 30638 21172 -9359 -26076 -33169 -14362 32703 72089
6744G2089m46j4623j1317O5O465l4223k3644j0923j5318K6075m254j1737K3493
$$ 72089 71643 57020 45703 45768 52233 18010 -5634 -16557 -31875 -5800 -10054 -21791 1702
6731A702O984r005J9870J7731k2608l3022J682O397j6429m433j1512J1869M0310
$$ 1702 8686 -319 19551 37282 14674 -18348 -16666 -10269 -26698 -31131 -42643 -30774 9536
6718I536J4873j5733O635L4630L3045Q611q216j548l2980k9783m878j2031j4372
$$ 9536 24409 8676 15311 49941 82986 91597 83381 81833 48853 19070 14192 2161 -12211
$$ [...]
##END NTUPLES=NMR SPECTRUM
##END=
