##TITLE=Analysis number 328460
Compound Code cc 16413
Project Code adrs
Chemist Name stores
##JCAMPDX= 6.0         $$ Bruker NMR JCAMP-DX V2.0
##DATA TYPE= NMR SPECTRUM
##DATA CLASS= NTUPLES
##ORIGIN= Bruker BioSpin GmbH
##OWNER= nmr
$$ XWIN-NMR		Version 3.5
$$ Thu Jun  7 08:56:01 2007 GMT Daylight Time (UT+1h)  MAYBRIDGE\nmr@NMR_250MHZ
##.OBSERVE FREQUENCY= 250.131544655141
##.OBSERVE NUCLEUS= ^1H
##.ACQUISITION MODE= SIMULTANEOUS (DQD)
##.ACQUISITION SCHEME= undefined
##.AVERAGES= 16
##.DIGITISER RES= 18
##SPECTROMETER/DATA SYSTEM= dpx250
##.PULSE SEQUENCE= zg30
##.SOLVENT NAME= DMSO
##.SHIFT REFERENCE= (INTERNAL, DMSO, 0, 16.522)
##AUDIT TRAIL= $$ (NUMBER, WHEN, WHO, WHERE, WHAT)
$$ ##TITLE= Audit trail, XWIN-NMR		Version 3.5
$$ ##JCAMPDX= 5.01
$$ ##ORIGIN= Bruker BioSpin GmbH
$$ ##OWNER= nmr
$$ C:\u/data/dgb/nmr/ADRS/430/pdata/1/auditp.txt
$$ ##AUDIT TRAIL=  $$ (NUMBER, WHEN, WHO, WHERE, WHAT)
(   1,<2007-06-07 08:55:35.00 +100>,<MAYBRIDGE\nmr>,<NMR_250MHZ>,
      <created by zg, POWCHK disabled, PULCHK disabled
       configuration hash MD5:
       76 6E 9A 78 1E 09 19 81 EC 84 63 8F B0 6A 59 2D
       data hash MD5: 64K
       C5 2E AD 26 C0 0E 7A 1B 84 84 37 5B 6D CE 34 CC>)
(   2,<2007-06-07 08:55:48.56 +100>,<MAYBRIDGE\nmr>,<NMR_250MHZ>,
      <Start of raw data processing
       ef LB = 0.3 FT_mod = 6 PKNL = 1 SI = 32K 
       data hash MD5: 32K
       63 17 92 3A C6 39 F5 68 8B 4D 02 F6 49 62 FA B2>)
(   3,<2007-06-07 08:55:50.28 +100>,<MAYBRIDGE\nmr>,<NMR_250MHZ>,
      <apk 
       data hash MD5: 32K
       3D 5D FE E6 F3 7B 26 6F 36 B3 44 7E 5B D2 11 45>)
(   4,<2007-06-07 08:55:51.11 +100>,<MAYBRIDGE\nmr>,<NMR_250MHZ>,
      <abs ABSG = 5 
       data hash MD5: 32K
       C2 8E E5 A1 CA B7 80 3A EE 1C D3 69 21 07 12 9F>)
$$ ##END=
$$ 
$$ hash MD5
$$ 37 08 AB 8A 56 97 07 A2 AC A9 02 FD 51 87 4F F7
##$RELAX= 
##$RELAX= 
##$RELAX= 
##$RELAX= 
##$RELAX= 
##$RELAX= 
##$RELAX= 
$$ Bruker specific parameters
$$ --------------------------
##$DU= <C:\u>
##$EXPNO= 430
##$NAME= <ADRS>
##$PROCNO= 1
##$TYPE= <nmr>
##$USER= <dgb>
##$AMP= (0..31)
100 100 100 100 100 100 100 100 100 100 100 100 100 100 100 100 100 100 
100 100 100 100 100 100 100 100 100 100 100 100 100 100 
##$AQSEQ= 0
##$AQ_mod= 3
##$AUNM= <au_zg>
##$AUTOPOS= <1 >
##$BF1= 250.13
##$BF2= 250.13
##$BF3= 250.13
##$BF4= 250.13
##$BF5= 500.13
##$BF6= 500.13
##$BF7= 500.13
##$BF8= 500.13
##$BYTORDA= 1
##$CFDGTYP= 0
##$CFRGTYP= 5
##$CHEMSTR= <none>
##$CNST= (0..31)
1 1 145 1 1 1 1 1 1 1 1 1 1 1 1 1 1 1 1 1 1 1 1 1 1 1 1 1 1 1 1 1 
##$CPDPRG= <>
##$CPDPRG1= <>
##$CPDPRG2= <>
##$CPDPRG3= <>
##$CPDPRG4= <mlev>
##$CPDPRG5= <mlev>
##$CPDPRG6= <mlev>
##$CPDPRG7= <mlev>
##$CPDPRG8= <mlev>
##$CPDPRGB= <>
##$CPDPRGT= <>
##$D= (0..31)
0 1 0 0 0 0 0 0 0 0.06 0 0 0 0 0 0 0.0002 0 0 0 0 0 0 0 0 0 0 0 0 0 0 
0 
##$DATE= 1181202933
##$DBL= (0..7)
120 120 120 120 120 120 120 120 
##$DBP= (0..7)
150 150 150 150 150 150 150 150 
##$DBP07= 0
##$DBPNAM0= <>
##$DBPNAM1= <>
##$DBPNAM2= <>
##$DBPNAM3= <>
$$ [...]
##$SUBNAM7= <"">
##$SUBNAM8= <"">
##$SUBNAM9= <"">
##$SW= 20.6930455092707
##$SWIBOX= (0..15)
0 0 3 0 0 0 0 0 0 0 0 0 0 0 0 0 
##$SW_h= 5175.983436853
##$TD= 65536
##$TD0= 1
##$TE= 296.16
##$TE2= 300
##$TE3= 300
##$TEG= 300
##$TL= (0..7)
0 120 120 120 120 120 120 120 
##$TP= (0..7)
150 150 150 150 150 150 150 150 
##$TP07= 0
##$TPNAME0= <>
##$TPNAME1= <>
##$TPNAME2= <>
##$TPNAME3= <>
##$TPNAME4= <>
##$TPNAME5= <>
##$TPNAME6= <>
##$TPNAME7= <>
##$TPOAL= (0..7)
0.5 0.5 0.5 0.5 0.5 0.5 0.5 0.5 
##$TPOFFS= (0..7)
0 0 0 0 0 0 0 0 
##$TUNHIN= 0
##$TUNHOUT= 0
##$TUNXOUT= 0
##$USERA1= <user>
##$USERA2= <user>
##$USERA3= <user>
##$USERA4= <user>
##$USERA5= <user>
##$V9= 5
##$VALIST= <valist>
##$VCLIST= <CCCCCCCCCCCCCCC>
##$VD= 0
##$VDLIST= <DDDDDDDDDDDDDDD>
##$VPLIST= <PPPPPPPPPPPPPPP>
##$VTLIST= <TTTTTTTTTTTTTTT>
##$WBST= 1024
##$WBSW= 4
##$XGAIN= (0..3)
0 0 0 0 
##$XL= 0
##$YL= 0
##$YMAX_a= 296495
##$YMIN_a= -213018
##$ZGOPTNS= <>
##$ZL1= 120
##$ZL2= 120
##$ZL3= 120
##$ZL4= 120
##$ABSF1= 16.522
##$ABSF2= -4.171173
##$ABSG= 5
##$ABSL= 3
##$ALPHA= 0
##$AQORDER= 0
##$ASSFAC= 0
##$ASSFACI= 0
##$ASSFACX= 0
##$ASSWID= 0
##$AUNMP= <proc_1d>
##$AZFE= 0.1
##$AZFW= 0.1
##$BCFW= 0
##$BC_mod= 0
##$BYTORDP= 0
##$COROFFS= 0
##$CY= 12.5
##$DATMOD= 1
##$DC= 0
##$DFILT= <>
##$DTYPP= 0
##$F1P= 14.0000005364418
##$F2P= -0.99999901652339
##$FCOR= 0.5
##$FTSIZE= 32768
##$FT_mod= 6
##$GAMMA= 0
##$GB= 0
##$INTBC= 1
##$INTSCL= 1
##$ISEN= 128
##$LB= 0.3
##$LEV0= 0
##$LPBIN= 0
##$MAXI= 10000
##$MC2= 0
##$MEAN= 0
##$ME_mod= 0
##$MI= 0
##$NCOEF= 0
##$NC_proc= -5
##$NLEV= 6
##$NOISF1= 0
##$NOISF2= 0
##$NSP= 0
##$NTH_PI= 0
##$NZP= 0
##$OFFSET= 16.522
##$PC= 1
##$PHC0= -65.18362
##$PHC1= 6.690986
##$PH_mod= 1
##$PKNL= yes
##$PPARMOD= 0
##$PSCAL= 4
##$PSIGN= 0
##$REVERSE= no
##$SF= 250.13
##$SI= 32768
##$SIGF1= 0
##$SIGF2= 0
##$SINO= 400
##$SIOLD= 32768
##$SREGLST= <1H.DMSO>
##$SSB= 0
##$STSI= 32768
##$STSR= 0
##$SW_p= 5175.98343685301
##$SYMM= 0
##$S_DEV= 0
##$TDeff= 65536
##$TDoff= 0
##$TI= <Analysis number 999999
Compound Code 99
Book Reference 9
Project Code 9>
##$TILT= no
##$TM1= 0
##$TM2= 0
##$TOPLEV= 0
##$USERP1= <user>
##$USERP2= <user>
##$USERP3= <user>
##$USERP4= <user>
##$USERP5= <user>
##$WDW= 1
##$XDIM= 32768
##$YMAX_p= 478528986
##$YMIN_p= -622972
$$ End of Bruker specific parameters
$$ ---------------------------------
##NTUPLES= NMR SPECTRUM
##VAR_NAME=  FREQUENCY,     SPECTRUM/REAL,   SPECTRUM/IMAG
##SYMBOL=    X,             R,               I
##VAR_TYPE=  INDEPENDENT,   DEPENDENT,       DEPENDENT
##VAR_FORM=  AFFN,          ASDF,            ASDF
##VAR_DIM=   32768,         32768,           32768
##UNITS=     HZ,            ARBITRARY UNITS, ARBITRARY UNITS
##FACTOR=    0.157963299565203, 1,           1
##FIRST=     4132.6476996994, 0,             0
##LAST=      -1043.33573715361, 0,           0
##MIN=       -1043.33573715361, -622972,     0
##MAX=       4132.6476996994, 478528986,     0
$$ Real data points
##PAGE= N=1
##DATA TABLE= (X++(R..R)), XYDATA
$$ [...]
18530G1940J07090m62k1588r6304j13234J29148n824m2204J11787J4809k0497
18519A34661j13115J553L9688L8219M9130m4415O5624J9800j0760r7009n8202
18508B5174O5569J6668j3452j2168J07354J77787J06981j60739m5407n6370j27455
18497H3942j37437n838J08569Q2409j25566j50641k2376O3073n2730Q5314N3744
18486a7537j6080n9932q868n118l4373N4884L4348R3438P2316k536j58854k8280
18474g6592L1456J56045o6649j7935L7619k849l2537M6422r1060q9651P3544L9770
18462G583Q1840j4169j82014p050L1638N3364J02655Q2109L5094R8312j3157o5329
18450B10876k6036p2915m3832O4769J6481N9251o2218n5550M1644J33117N7120
$$ plain form
18530 71940 179030 178568 156980 60676 -52558 76590 70766 28562 140349 155158 134661
18519 134661 21546 23099 62787 101006 150136 105721 171345 191145 180385 83376 25174
18508 25174 90743 107411 93959 81791 189145 366932 473913 313174 267767 211397 83942
18497 83942 -53495 -59333 49236 131645 6079 -144562 -166938 -103865 -156595 -71281 -17537
18486 -17537 -33617 -93549 -102417 -107535 -141908 -87024 -52676 40762 113078 110542 -48312 -76592
18474 -76592 -45136 110909 44260 26325 63944 61095 28558 74980 -16080 -105731 -32187 7583
18462 7583 89423 75254 -106760 -113810 -82172 -28808 73847 155956 191050 289362 276205 210876
18450 210876 184840 111925 68093 132862 149343 208594 146376 90826 132470 265587 322707
18439C22707j95650M0723p2435m2183M685J16941k0942k8439J8291q6622j4438
18428D2638p5655j6911l9658j8056M7971J45573j4283m2069R3298M5194q9000
18417G9042j1420J33654M1558M8552n5144r7854j21714n5772L9371O1329J6631
18406G8233K7692k3638q9785k1375l6196j5769Q9290J24475m3537j17491j3033
18395d1134M616J4853J29631M6201Q7015m9494j24710m6243N9472m075Q8838O3337
18383B28307n0714j32205k7997J01021M7926o4122l5063L4831M6364n1090j34324
18372c7066o3293p1756j9701n4167O6595O1450J30313j0709o2348o7925O9453
18361e9154k0328j0628l1457m2918Q4737J47529J13282r3642M7321M7053l4317
$$ plain form
18439 322707 127057 167780 95345 53162 57847 174788 153846 125407 143698 57076 42638
18428 42638 -33017 -49928 -89586 -107642 -59671 85902 71619 29550 122848 168042 79042
18417 79042 67622 201276 242834 291386 236242 138388 16674 -39098 273 61602 78233
18406 78233 105925 82287 -7498 -28873 -65069 -80838 8452 132927 89390 -28101 -41134
18395 -41134 -36518 -21665 107966 154167 241182 191688 66978 20735 80207 76132 164970 228307
18383 228307 177593 45388 17391 118412 166338 102216 67153 101984 148348 97258 -37066
18372 -37066 -100359 -172115 -191816 -245983 -179388 -117938 12375 1666 -60682 -128607 -59154
18361 -59154 -79482 -90110 -121567 -164485 -79748 67781 181063 87421 134742 181795 147478
18350A47478l1423L0798m4561j24315l1711Q6087O1125J5365k1430J6521m3677
18339F0257n2652o031P1877j2094N724j13427N7564J56879P5063O6275j14655
18328A94780n0063J39368O9037J32700k2991n0715J13956J77793J6407p2216P1209
18317G19265q60j11371J3977R2670q049K8226l4638P3138l6515j24341p2668k7295
18305E11539j83640k5051l6090m5133J4707M1302J9232m3206r3722N1M6401J0591
18293B16981j1826j24836q1769K7928m7434m2649J25902r792p3481Q298o7571
18282h0249r679m02N6765N4836J64643K17632n0399m6928K1436Q7903J56903J78819
18270G51280J73360K9791j25404n5531Q879j26687o3576k3902r1027j03939o4886
$$ plain form
18350 147478 116055 146853 102292 -22023 -53734 32353 93478 108843 87413 103934 60257
18339 60257 7605 1574 73451 61357 67081 -46346 11218 168097 243160 309435 194780
18328 194780 144717 284085 353122 485822 462831 412116 526072 703865 720272 648056 719265
18317 719265 718405 607034 621011 713681 705632 733858 699220 772358 735843 611502 538834 511539
18305 511539 327899 302848 266758 221625 236332 277634 296866 253660 159938 159989 206390 216981
18293 216981 205155 80319 -1450 26478 -20956 -63605 62297 52505 -20976 -12678 -80249
18282 -80249 -89928 -90330 -33565 21271 185914 403546 353147 306219 327655 415558 572461 751280
18270 751280 924640 954431 829027 773496 782375 655688 592112 568210 477183 373244 308358
18259C08358J8753J80628J03646N68l0819j1594O9954o2892j47974n153j02590
18248C20885q0196n6363j10005r2002K5213J00685J4448l4354m3912J9854N2852
18237A17105n2168q3038q9138M8537k6764l1494J1486l2336O6148p9068P7685
18226g3045j9215o6049J898j22049k8743N2491M6542J0984P8611n1897n729j847
18214a78048n9661K2729j3264N6027J09847Q545l5435q2634j17169J09590R2029
18203h7444k741p68k6595O4932P4082m8154k2534L5462j48813J053J61458N7384
18191E7322j792o0164m9588j21511J9092P3239j21599Q3865M5160m5617k9237
18180a50830m5155N2976J04137Q1035J04001n311r16m2876n5144j29861p8867
$$ plain form
18259 308358 327111 507739 611385 611953 581134 569540 639494 576602 428628 423475 320885
18248 320885 240689 184326 74321 -17681 7532 108217 122665 88311 44399 64253 117105
18237 117105 64937 -18101 -107239 -58702 -85466 -116960 -105474 -137810 -71662 -150730 -73045
18226 -73045 -92260 -158309 -156411 -278460 -307203 -254712 -208170 -197186 -118575 -170472 -176201 -178048
18214 -178048 -237709 -214980 -228244 -172217 -62370 -53825 -89260 -171894 -289063 -179473 -87444
18203 -87444 -90185 -90953 -117548 -52616 21466 -26688 -49222 -13760 -162573 -161520 -62 57322
18191 57322 55530 -4634 -54222 -175733 -156641 -83402 -205001 -121136 -75976 -121593 -150830
18180 -150830 -195985 -143009 -38872 42163 146164 140853 139937 97061 41917 -87944 -166811
18169a66811N4165N4081J7003P8306J8670l0045k4516j1038J0823P0070J4742
18158H5450m8015m5694p5760m7581o3564K2342O8822O4432o4635n6126R8028P5582
18146A3281L6723j7794k10007p6425L0227J5868Q2486k602k4494q6226J1687N0668
18134a76608K6947L944J6368J8695J00729M380o5532k469J29944O9412j36338
18123a0528K2240Q730j4803n2833j1600N0874O2458K3325n9077n6458p0114j5410
18111a23196l4369Q0528J14713k7240M4644n4799L8045O3499N3986n1244m1253
18100F3314N9245k8828p22m6394r8403j27934j02056Q5837J07003L3317R013l345
18088d9953L3117j4963K5392L6398j45554n8137N3193J5286n94M5957O6342k4883
$$ plain form
18169 -166811 -112646 -58565 -41562 36744 55414 25369 853 -10185 638 70708 85450
18158 85450 37435 -8259 -84019 -131600 -195164 -172822 -104000 -39568 -104203 -160329 -62301 13281
18146 13281 50004 32210 -177797 -254222 -223995 -208127 -125641 -128243 -152737 -238963 -227276 -176608
18134 -176608 -149661 -145717 -129349 -110654 -9925 -5545 -71077 -73546 56398 125810 -10528
18123 -10528 11712 20442 5639 -47194 -58794 -7920 54538 77863 18786 -37672 -107786 -123196
18111 -123196 -157565 -77037 37676 10436 55080 281 38326 101825 155811 104567 63314
18100 63314 122559 93731 93009 46615 -51788 -179722 -281778 -195941 -88938 -55621 -46608 -49953
18088 -49953 -16836 -31799 -6407 29991 -115563 -173700 -120507 -105221 -105815 -59858 6484 -18399
18076a8399P9270N3765r5687n5031K8132m9178n6411J0945N901j34776K8226J91512
18064a1731J00872p3793o4186N862n7631J09425k1913m3488J6647o240J1247n1427
18052h6356J6058K090q3271J55147J79384q0270j21023r755m005m6821l631J640
18040h0813O869l345O1236o1509q6167J0074J18086j5035n8672k4028K1142q735
18028a20897K7762J10623N8147l476n9495o0542l4133M2336N1699j6827j09811
18017a14614n8761N3043M2301M8195K2107L5840K3460r9227j02108k5430O8128
18006a07066K0462R3185M0107r1082j25403j4085p1246j19593J23761P5964J3929
17995a61067j0462j6165M8153M9742o2797o6788J3730r6837p7464N4756J05008
$$ plain form
18076 -18399 60871 114636 18949 -36082 -7950 -57128 -113539 -102594 -96693 -231469 -203243 -11731
18064 -11731 89141 15348 -48838 -42976 -100607 8818 -13095 -56583 -39936 -46176 -34929 -86356
18052 -86356 -70298 -68208 -151479 3668 183052 102782 -18241 -27996 -32001 -78822 -82453 -80813
18040 -80813 -73944 -77289 -16053 -77562 -163729 -153655 -35569 -50604 -109276 -133304 -112162 -120897
18028 -120897 -93135 17488 75635 72159 12664 -47878 -82011 -39675 12024 -4803 -114614
18017 -114614 -173375 -120332 -78031 -29836 -7729 28111 51571 -47656 -149764 -175194 -107066
18006 -107066 -86604 6581 46688 -44394 -169797 -183882 -255128 -374721 -250960 -174996 -161067
17995 -161067 -171529 -187694 -139541 -89799 -152596 -219384 -205654 -302491 -379955 -325199 -220191
17984b20191Q0770J36090J92069L4124j35413K0814M8807q4180j05122k132Q2530
17973D8166k5287N5322O6496n0266k3441K1029p9988M4189M0083K4571P3125K1316
17961B15315n107j5991j20162n0118p0791R0655M5975j67160j05548J1661K0992
17950a50279r5034P7076O1771Q0504K934J08218J11610l05n1700j18701r1401
17939f5307O714N5048o0764K1467M3524J87354Q4374r7786j46022L486k7848J3463
17927A7703J69283P341q2430o341m5604J540r7148m0115j0593Q3705j5857R633
17915h883O6784k7528l3743p0143k3938K4210J1541P796M7178L64N13N4829O157
17902E5137o0135k1629Q4514p3769r2262J3860j02090J2525m0706O4872k1860
$$ plain form
17984 -220191 -139421 -3331 188738 222862 87449 108263 157070 72890 -32232 -34364 48166
17973 48166 22879 78201 144697 94431 70990 92019 12031 56220 96303 120874 193999 215315
17961 215315 210208 194217 74055 23937 -46854 43801 89776 -77384 -182932 -171271 -150279
17950 -150279 -245313 -168237 -106466 -25962 -23028 85190 196800 196495 144795 26094 -65307
17939 -65307 -58593 -3545 -64309 -42842 682 188036 272410 174624 28602 32088 4240 17703
17927 17703 186986 194327 111897 105556 59952 61492 -35656 -75771 -86364 -2659 -18516 -8883
17915 -8883 57901 30373 -3370 -73513 -97451 -73241 -61700 -53904 -6726 -6362 -5849 48980 55137
17902 55137 -4998 -26627 57887 -15882 -108144 -94284 -196374 -183849 -224555 -159683 -181543
17891a81543L6114M4320r4199l0905J98712O6972r1971q4833j7011R220K5208
17880a19916j01085k3136K5688J9664P1975J02454L3411n0369n0038J8526R6747
17869B3921J01661K1800K1952o409k6445K5487j11663q9072k7808J10579N0100
17858I4103j3397k2128j61399m5386O377l5620M8058n056k9712r5194j0797Q2813
17846a87338N5335Q139N9927k2427L2551N7090p0038Q4000J07957l3665l1802
17835E9729J229K3879k5778P6900K1892n8200K1575M7737q2536j42440J48019
17824I2006J62928j50759j50910l0605K9236m8039R5066o9204N2124J29425R757
17813A21025q8609j35943l3965k4523J10856j6857o1317K2385K4690k0019K8132
$$ plain form
17891 -181543 -145429 -101109 -195308 -226213 -27501 39471 -52500 -137333 -154344 -145124 -119916
17880 -119916 -221001 -244137 -218449 -198785 -126810 -24356 9055 -41314 -91352 -72826 23921
17869 23921 125582 147382 169334 162925 136480 161967 50304 -38768 -66576 44003 94103
17858 94103 80706 58578 -102821 -148207 -141830 -177450 -129392 -134448 -164160 -259354 -270151 -187338
17846 -187338 -132003 -123864 -63937 -86364 -53813 3277 -66761 17239 125196 91531 59729
17835 59729 60958 84837 59059 135959 157851 99651 121226 168963 86427 -56013 92006
17824 92006 254934 104175 -46735 -77340 -48104 -96143 -1077 -70281 -18157 111268 121025
17813 121025 32416 -103527 -137492 -162015 -51159 -68016 -129333 -106948 -82258 -102277 -74145
17802g4145M4455k2793k6007j37460N232J70297q537j6245R1204L604j54104P768
17790a16731O5326l4808p9005P2100M4738J14285P6935o5288p9471l6222K8805
17779i336j02965j19308M8156M7783K5746Q6805o6753j84158K541J54470L9033
17768g7986m7168m103L504p1288J82287O7674m2184O841n5630p2702p2518m439
17756a87712p6065P64R2929M3649N2126J07580J6072k5829L5472p0495j23906
17745a35415M9452Q3462J8246o3178J721K0459K2676n848J9722r2719o2597M0357
17733a03662j1665P3176M8193M3198j1427l9455N5227M0708R929j71906j27095
17722a94779j0974J3228Q3180L5732K0789r044J1758R6592N3892Q7563j1033n7275
$$ plain form
17802 -74145 -29690 -52483 -78490 -215950 -210718 -40421 -48958 -65203 26001 29605 -124499 -116731
17790 -116731 -51405 -86213 -165218 -93118 -48380 65905 142840 77552 -1919 -38141 -9336
17779 -9336 -112301 -231609 -183453 -135670 -109924 -23119 -89872 -274030 -271489 -117019 -77986
17768 -77986 -125154 -129257 -125753 -197041 -14754 52920 10736 17577 -38053 -110755 -183273 -187712
17756 -187712 -263777 -263013 -170084 -126435 -74309 33271 49343 23514 58986 -11509 -135415
17745 -135415 -85963 -2501 15745 -47433 -45712 -25253 -2577 -8425 11297 -81422 -144019 -103662
17733 -103662 -115327 -42151 6042 49240 37813 -1642 53585 94293 104222 -67684 -194779
17722 -194779 -205753 -192525 -109345 -73613 -52824 -61868 -50110 46482 100374 187937 176904 119629
17710A19629n5012n0260j14739j35415j7777J3810m4058J36019Q9580P8322q3694
17699f3595p764j02071L438R2658Q6526k5141q6204J67276P6022n9882m6084J09448
17687A44627j46589j14365k8846o1619p8541j09135J7286J15749N1088k1779J27984
17676a04140J27954p8357j43642P2432J54391Q671k7075N412K265K8952j13845
17665f6982j34302m4311N9724J12465J91768J2418r5129r487J10672k9824q1169
17654B5843j0870L1260k582q2930J1461k4057n7173L8802j0321n2561K6695p0080
17642a76513J58817R1692P6912J1601L3596p9409l9591N1772j2873k576r0202
17631B3226r2432j3526q7342Q8276Q6301M5447K8589L1746n1713n9543k5933P9252
$$ plain form
17710 119629 64617 14357 -100382 -235797 -253574 -239764 -283822 -147803 -58223 20099 -63595
17699 -63595 -71359 -173430 -169992 -77334 9192 -15949 -102153 65123 141145 81263 35179 144627
17687 144627 -1962 -116327 -145173 -206792 -285333 -394468 -377182 -261433 -210345 -232124 -104140
17676 -104140 23814 -54543 -198185 -125753 28638 37309 10234 15646 17911 46863 -66982
17665 -66982 -201284 -245595 -185871 -73406 118362 130780 35651 26164 136836 107012 25843
17654 25843 14973 46233 43651 -39279 -27818 -51875 -109048 -70246 -80567 -133128 -106433 -176513
17642 -176513 -17696 73996 150908 162509 196105 116696 77105 128877 116004 113428 23226
17631 23226 -69206 -82732 -170074 -81798 4503 49950 78539 110285 58572 -971 -26904 52348
17619E2348J8712J5160O3074p2562j53576j19848l6452j321O4493Q3165J05996
17608A9189j35793p4057M4580R2277J04492q1777j9142P5331k1999j4528L7525
17597B6098L5589O057l5465m526m297l4261m435J21161k41R2698M9899o9917j34422
17584D3938q5540L2207N4006j33580j57542L1997Q9524k4116m9660j4588J08949
17573a04405K0179r5646L8121N5155K7935J9121L8329K6843N1350o7106m4371
17562c4495Q1382K6369J0348Q5866l4986j09820r9807q635O9195k6245J7632k5691
17550d8887m3310p6810N4700K1963K212N7576J04755j81605j56431K0808N1614
17539a93415J75202Q8891l7602j7743Q035M9088L6150L6018n0556j16594n5553
$$ plain form
17619 52348 71060 86220 149294 76732 -76844 -196692 -233144 -234465 -169972 -86807 19189
17608 19189 -116604 -190661 -146081 -53804 50688 -31089 -50231 25100 3101 -11427 26098
17597 26098 61687 67744 32279 27753 23456 -10805 -15240 105921 105680 198378 248277 178360 43938
17584 43938 -41602 -9395 44611 -88969 -246511 -214514 -124990 -149106 -198766 -213354 -104405
17573 -104405 -84226 -179872 -141751 -86596 -58661 -39540 -1211 25632 76982 9876 -34495
17562 -34495 46887 73256 83604 169470 134484 24664 -75143 -83778 -14583 -40828 -23196 -48887
17550 -48887 -92197 -169007 -114307 -92344 -90132 -32556 72199 -109406 -265837 -245029 -193415
17539 -193415 -18213 70678 33076 15333 23368 72456 108606 144624 94068 -22526 -78079
17528g8079N2710L3143L0015j13186K1343l34p0005k9009P2331p1977p0384J44159
17516g9273J07387m472K4806m1969j54691r7841N9607R185R0018P3621P1543j06181
17504d8260K0563R7726P4998o5193j3739j15850m3101n526N809o3852m2876J17771
17492h1530K07371K6063m5690j26209p3400l8866J3477J31408Q1527k2733J0325
17481H1743o4926r8051K2409K3739l0469M7968o1314j4353K2491m7330j08612
17470b26705k169O6269p708j7845O7525k1360j4522m0869M4886k4380q0133j38498
17458c95509M8541J27603J84564j4469r8161J36683P2888q1629j81332k2475R6426
17447a26870j0344M1528l297L1311P1130r6358M6625M1771j3059n5649M2560p5701
$$ plain form
17528 -78079 -25369 7774 37789 -75397 -54054 -54388 -124393 -153402 -81071 -153048 -223432 -79273
17516 -79273 28114 23642 48448 6479 -148212 -246053 -186446 -177261 -87243 -13622 57921 -48260
17504 -48260 -27697 70029 145027 79834 66095 -49755 -92856 -98382 -92573 -156425 -199301 -81530
17492 -81530 125841 151904 106214 -19995 -93395 -132261 -118784 12624 94151 71418 81743
17481 81743 16817 -81234 -58825 -35086 -65555 -17587 -78901 -93254 -70763 -118093 -226705
17470 -226705 -228874 -162605 -170313 -188158 -120633 -141993 -156515 -197384 -152498 -176878 -257011 -395509
17458 -395509 -346968 -219365 -34801 -49270 -147431 -10748 62140 -19489 -200821 -223296 -126870
17447 -126870 -137214 -95686 -98983 -67672 3458 -92900 -46275 -4504 -17563 -73212 -30652 -106353
17435a06353k36440J03865L4947P4530k9530n2425K0942M5511j4534J3333L433
17424a42721o963J41153K0395m9309P3066j2136k1179M9162o3932l3493n4769
17413a00726n473N9685n6507J00317L4949m2844o1975l2040L9584o526K8305n261
17401d8512j3496j1322M6932p5990k1319m6840p0804J9274O8597J4710J19683
17390a9087j5531j35069K5013L7930q4256O3184M2977Q5608M54m3995J16604O952
17378H0784p02j42472l075J26806L4235N0978p1200r7459L7478L7740M9654L4383
17366A37150K618M6385M9612l6225o2124l6566M2574k6995L092q3234l6812m7861
17354d8386p6235k7306j23044L3232J3635P9993J18138K1850J13977m9196q6733
$$ plain form
17435 -106353 -342793 -238928 -203981 -129451 -158981 -211406 -190464 -144953 -159487 -146154 -142721
17424 -142721 -149684 -8531 11864 -37445 35621 23485 2306 51468 -12464 -45957 -100726
17413 -100726 -106199 -46514 -103021 -2704 32245 -10599 -72574 -104614 -65030 -71556 -43251 -48512
17401 -48512 -62008 -73330 -26398 -102388 -123707 -170547 -241351 -222077 -153480 -138770 -19087
17390 -19087 -34618 -169687 -144674 -106744 -191000 -127816 -84839 769 1223 -42772 73832 80784
17378 80784 80082 -62390 -65465 61341 95576 146554 75354 -22105 15373 53113 102767 137150
17366 137150 139768 186153 235765 199540 137416 100850 143424 116429 119521 36287 -525 -48386
17354 -48386 -124621 -151927 -274971 -241739 -228104 -148111 -29973 -8123 105854 56658 -30075
17343c0075J7849n890L7255M9167K8274k15153j31401K1439P8766o653J7882J95426
17331E6886k7820o5917N7260K5897J5355n8608l1572N6825n4000K5048k4618m3342
17319f8606Q3638P7301M8788q2545L9553P5871q086j35177j5516L9741j8357M9293
17307H5898j7688j50518j3985k1676l2986j6957p7852K582p974J11467J90868
17296E1179J76780K5340j63676j97822O1298p0632J1689M7378Q0967N8511M3872
17285A24884n2175o7156L2906n0363k0457M9525k0701j00128O8904J14754l5246
17274D4747j7188j2645n6578R110K2798j26206n7878O9905R5466j6659M5741J20101
17262A20714r791p1846n5857o8678l9216p3444j3319o16J71491J11859K7890n2389
$$ plain form
17343 -30075 -12226 -18116 19139 68306 96580 -118573 -249974 -228535 -149769 -156422 -138540 56886
17331 56886 29066 -36851 20409 46306 61661 3053 -28519 28306 -25694 -646 -25264 -68606
17319 -68606 15032 92333 141121 58576 98129 174000 165914 30737 15221 54962 36605 85898
17307 85898 68210 -82308 -96293 -117969 -150955 -167912 -245764 -243182 -251156 -139689 51179
17296 51179 227959 253299 89623 -108199 -46901 -117533 -105844 -58466 22501 81012 124884
17285 124884 72709 5553 38459 -11904 -32361 17164 -3537 -103665 -34761 79993 44747
17274 44747 27559 14914 -41664 -32554 -9756 -135962 -193840 -123935 -28469 -45128 613 120714
17262 120714 110923 39077 -16780 -85458 -124674 -198118 -211437 -212053 -40562 71297 99187 46798
17250D6798j00986k512R3917J3340P716J1422J1682J7804j10066k3266Q4044M568
17238E4461j9607o1355l4738l0427q2459k9532J11536l3040j25095J07198K0547
17227a22511P667L1814m5274r345n4762M6360o5057r6897J92427J39744m4516
17216b0350o8123j7007N6329O7182J71574k4281l4645j08918J2808L0926l4536
17205C0959j22163r6245n357J515J37867l3629k5903J72021P3578j56110q4681
17194a08148L5957K8876J49904j7051M6077k9004k68616j8778J01416M6728j04159
17183a36798M0800Q671l385j14828p4217k1591Q4122J63148J80790J983m1064
17172H7631p5958j7362N6022N7100L9096k1025k2191r3243k0613J7686J09300
$$ plain form
17250 46798 -54188 -56700 37217 50557 58273 69695 81377 99181 -10885 -34151 49893 54461
17238 54461 34854 -26501 -61239 -91666 -174125 -203657 -92121 -125161 -250256 -143058 -122511
17227 -122511 -114844 -83030 -128304 -137649 -192411 -146051 -211108 -308005 -115578 24166 -20350
17216 -20350 -88473 -105480 -49151 18031 189605 165324 130679 21761 34569 65495 30959
17205 30959 -91204 -187449 -192806 -191291 -53424 -87053 -112956 59065 132643 -23467 -108148
17194 -108148 -72191 -43315 106589 89538 135615 106611 -162005 -180783 -79367 -32639 -136798
17183 -136798 -95998 -87327 -90712 -205540 -279757 -301348 -217226 -54078 126712 128695 87631
17172 87631 11673 -5689 50333 107433 146529 125504 103313 10070 -10543 7143 116443
17161A16443J7941j40787l5366O5376N0833j25827j24688k9508O4577R5807o7671
17150a12870p1393R1321N4806m6332M0343R5793N8398j06049j9301J3509m2117
17139d3892j0119j8058p3624k3404p2313j02695r4225J11317J17499J6969q8318
17128b80863R0170P3140L380K4391L1169n794j14159n2741M9686R1315K2378o1466
17116a29394o2372K7460N5634O9541m9768r774N7872K307M3663l6042j11301K2358
17104a19816k7835o0063j14542K4618J01261K35768R0758L774L2272J2529j52088
17093B6636l5393k6768L1943o4214M7965J32397J0635j46765j7604p5507L6605
17082h0070O4719n0381r1762J10707Q7675l1358k0890m6803J963m6877J2531J7887
$$ plain form
17161 116443 134384 -6403 -41769 23607 74440 -51387 -176075 -205583 -141006 -45199 -112870
17150 -112870 -184263 -92942 -38136 -84468 -44125 51668 110066 4017 -15284 -1775 -43892
17139 -43892 -54011 -72069 -145693 -169097 -241410 -344105 -438330 -327013 -209514 -192545 -280863
17128 -280863 -190693 -117553 -114173 -89782 -58613 -64407 -178566 -231307 -181621 -90306 -67928 -129394
17116 -129394 -191766 -164306 -108672 -39131 -88899 -98673 -40801 -38494 5169 -30873 -142174 -119816
17104 -119816 -147651 -207714 -322256 -297638 -196377 39391 130149 133923 166195 178724 26636
17093 26636 -8757 -35525 -3582 -67796 -19831 112566 123201 -23564 -41168 -116675 -80070
17082 -80070 -15351 -65732 -157494 -46787 40888 9530 -11360 -58163 -56200 -103077 -90546 -72659
17070g2659M495n1011j27101k3746P8421N3643m0667l0303J9712J39394J24253
17059G4431q6039j12583j50927J8571J58836L6523p0211l8473q400L6243J08896
17048c3133R1633k9541O4318p6042j666p520j5156j01893r0518r816N0208o6602
17036b25728n0501J23784Q6094l6723j5700R4553O4j022M8568p3174n9094L1426
17024g7453L5678Q9256k0471m7357j3241M546n8336k9004P0097N1074L4994q9437
17012d9654q5140P3003L2875n0393P3832O8939m7374m008K5637N4734M014O3140
17000A59605r0497O3171M7386p7677j14161n4357J33062K3982n571J9768l2380
16989G2331L682J16180O9299j33415m8600m4263m7544j1933n7128K0744J83614
$$ plain form
17070 -72659 -68164 -119175 -246276 -270022 -191601 -137958 -178625 -208928 -189216 -49822 74431
17059 74431 -11608 -124191 -275118 -256547 -97711 -61188 -131399 -169872 -178272 -142029 -33133
17048 -33133 58500 28959 93277 17235 15569 8049 -7107 -109000 -199518 -209334 -159126 -225728
17036 -225728 -276229 -152445 -66351 -103074 -118774 -24221 -24157 -25179 23389 -49785 -108879 -77453
17024 -77453 -41775 47481 27010 -20347 -33588 -29042 -87378 -116382 -46285 4789 39783 -49654
17012 -49654 -134794 -61791 -28916 -79309 -5477 63462 16088 12080 37717 92451 96465 159605
17000 159605 69108 132279 179665 101988 -12173 -66530 66532 90514 84943 104711 72331
16989 72331 76013 192193 261492 128077 79477 35214 -12330 -24263 -81391 -60647 122967
16978A22967q905r8629j23791j15934J07475l9544j81548P1115Q4280M0010J27859
16967a4645J19j0135j8246m1291r0434j7141M4959L5219r3811K1330J03910l8442
16955a18608m2926m800K9796J80323l977o3576p3447k1106J26696n3541q7095
16944a32261L7966L9071k7605k2392m3438L5663L0677m2515n1807P6122M4252
16933e6267J79045k3141n1218q3748K9931r5814n186m0622k4926m9545p499M5271
16921a83719K2893p5278q8827q3984k9954J15929K34201n3528r3373K2503J01760
16910a11377o9038N3091J998o7568Q2560M9127N0359j44788l4687O6853O1595
16899f1875L0258L1335m995l0194O3271J61898j4349k8223m6234O8123l0771o1233
$$ plain form
16978 122967 114062 15433 -108358 -224292 -116817 -156361 -337909 -266794 -182514 -142504 -14645
16967 -14645 -14526 -24661 -42907 -84198 -174632 -191773 -146814 -111595 -205406 -184076 -80166 -118608
16955 -118608 -161534 -166334 -136538 43785 39808 -23768 -97215 -118321 8375 -45166 -132261
16944 -132261 -94295 -55224 -82829 -105221 -148659 -112996 -82319 -124834 -176641 -100519 -56267
16933 -56267 122778 99637 48419 -35329 -5398 -101212 -106398 -147020 -171946 -221491 -228990 -183719
16921 -183719 -160826 -236104 -324931 -408915 -438869 -322940 -88739 -142267 -235640 -213137 -111377
16910 -111377 -180415 -127324 -125326 -192894 -110334 -61207 -10848 -155636 -190323 -123470 -61875
16899 -61875 -31617 -282 -5277 -35471 27800 189698 175349 147126 100892 169015 138244 77011
16887G7011n9743j02046j92903P879J23000L3944R2323J7686L3888L811k7868
16876F982O7148R095j01038p9078l5664O0230p46j6693N5563M6484R453J4549
16864C6285j87793K4004R6476L9463k4437q7639O6633J65394N6037k94516j04712
16853b14805O8167p860j17128o472Q8832l2037M459j00815o2296N0468J16145
16842b13342L7239L0880L350j1487k539J16821m7547l655N1180O9056o7708Q6567
16830D8815n7048j25836m9233K4096m939m420p5085p0175p2642N4023O6693Q551
16818b57200J55082J03835n7129p8177K9213r2726n7907O4564O4933J46513L51
16807B1352r2922o5697L5230Q020J54138P2909j02930J8228j0430j8588j9082
$$ plain form
16887 77011 17268 -84778 -277681 -269802 -146802 -112858 -20535 -2849 31039 34850 6982
16876 6982 74130 83225 -17813 -96891 -132555 -72325 -73071 -89764 -34201 12283 21736 36285
16864 36285 -151508 -127504 -31028 8435 -16002 -103641 -37008 128386 184423 -110093 -214805
16853 -214805 -146638 -154498 -271626 -278098 -189266 -221303 -216844 -317659 -379955 -329487 -213342
16842 -213342 -176103 -145223 -141873 -153360 -155899 -39078 -86625 -90280 -39100 29956 -37752 48815
16830 48815 -8233 -134069 -183302 -159206 -164145 -168565 -243650 -313825 -386467 -332444 -265751 -257200
16818 -257200 -102118 1717 -55412 -133589 -104376 -197102 -255009 -190445 -125512 21001 21352
16807 21352 -71570 -137267 -102037 -94017 60121 133030 30100 48328 37898 19310 228
16796B28r7182j14981m3160K4055J32258L8386j1142J3046Q2875L2685Q8688J00533
16784B46289j33340n3663j38173J9707J30972M435n2008O8443j7392l997K9838
16773A01111Q7390j39993j00629O4487l4548R0365J1922j07024j07580j7579J6522
16762a35556j4895m5922k394L2362Q7146N1210m355L8353n8355m7378j9794N8185
16750f1393j5989k0618j3788p4368l2404J22260J15669J02572j64457k2809R9920
16739C4595k9263q3128P3272L9981J6267r5805q6139J1299J20243M0275P4190
16728A15787o2538j00223k8159N8942J6640L7329N8691n7825q4562o7505N539
16717a07884l2175L0579m3554O3884M6804k6244K0162Q71p6263O922K9448o933
$$ plain form
16796 228 -96954 -211935 -255095 -231040 -98782 -60396 -71538 -58492 24383 57068 145756 246289
16784 246289 112949 59286 -78887 -59180 71792 76227 24219 92662 75270 71273 101111
16773 101111 188501 48508 -52121 12366 -22182 68183 80105 -26919 -134499 -152078 -135556
16762 -135556 -150451 -196373 -198767 -166405 -79259 -28049 -32404 5949 -52406 -99784 -119578 -61393
16750 -61393 -77382 -98000 -111788 -186156 -218560 -96300 19369 121941 -42516 -65325 34595
16739 34595 5332 -77796 -4524 35457 51724 -44081 -130220 -118921 1322 41597 115787
16728 115787 53249 -46974 -75133 -16191 449 37778 96469 38644 -45918 -113423 -107884
16717 -107884 -140059 -109480 -153034 -89150 -42346 -68590 -48428 -47557 -123820 -116898 -87450 -94383
16705i4383n6978j01803P1419L0539p6743p1908j2430J6797J01936J11152K8487
16694e3915J599R7643M5764q5631j18553N749N7319R4096j18025r2372J24768
16683d1558P392k5501q9022O1710J22889N4684J06858r5869j21125j05737j12796
16672b38075o855J05903P3887P9965K7929j96142j39858K3265J03925J32611j8870
16661e2315P2120K2714j06336L0702N3623l6286M4100j24733m5011n7146N8658
16650a39910J29038J13838j32923o5328O1551J62870K0577L3130R7j95718r0344
16639a03122n2451q6966O0159O6465R4477L4312k8961L8556r9470l1739j63212
16628b71952l4549M2918N0599M0592k3573l2103R5744J15713N379o096j54803
$$ plain form
16705 -94383 -151361 -253164 -181745 -151206 -227949 -299857 -312287 -295490 -193554 -82402 -53915
16694 -53915 -52316 45327 91091 5460 -113093 -107344 -50025 44071 -73954 -166326 -41558
16683 -41558 -34166 -59667 -148689 -86979 35910 90594 197452 101583 -19542 -125279 -238075
16672 -238075 -244930 -139027 -65140 14825 42754 -153388 -293246 -269981 -166056 -33445 -52315
16661 -52315 19805 42519 -63817 -33115 20508 -15778 28322 -96411 -141422 -198568 -139910
16650 -139910 -10872 102966 -29957 -95285 -33734 129136 149713 182843 182940 -12778 -103122
16639 -103122 -155573 -242539 -182380 -115915 -21438 12874 -16087 22469 -77001 -108740 -271952
16628 -271952 -306501 -263583 -212984 -172392 -195965 -228068 -132324 -16611 -11232 -17328 -172131
16617a72131j40561m6325J53203J55396l4820o640J03189N7251j0429K7067j7959
16606F7241j11210m0540k9491J6711j12653O844J2447j23515o4708J2014J34859
16595b32001K00620J89651j4326j96787m6485K4679R8416J07358o4747m3651L8375
16584F1102j3592q4976p5920K0406O976J18387R6714l9418j75185m4853J4327
16573a16032P0468J05049q3239j20458k2604P1130J49908P2992K7397j41201o8805
16562e5395r3243j01464K0191o1971Q963R9807J05265o9180j10852L3139O0434
16551a64306K7905P2777L8321o852M5739J8548P389K6047j6778r2626m6464P1462
16539a8838L3398p6355m9513o6710j4394n3907j02678p67R3566M055J637Q0422
$$ plain form
16617 -172131 -312692 -359017 -205814 -50418 -85238 -91878 11311 68562 58133 85200 67241
16606 67241 -43969 -84509 -114000 -97289 -209942 -203098 -190651 -314166 -378874 -366860 -232001
16595 -232001 -31381 158270 143944 -52843 -99328 -74649 23767 131125 66378 22727 61102
16584 61102 47510 -37466 -113386 -92980 -86004 32383 129097 89679 -85506 -130359 -116032
16573 -116032 -45564 59485 -23754 -144212 -166816 -95686 54222 127214 154611 13410 -55395
16562 -55395 -148638 -250102 -229911 -291882 -282919 -183112 -77847 -147027 -257879 -224740 -164306
16551 -164306 -136401 -63624 -25303 -32155 13584 32132 39521 65568 48790 -43836 -90300 -18838
16539 -18838 14560 -61795 -111308 -178018 -192412 -246319 -348997 -349764 -256198 -252143 -250506 -170084
16527a70084M4860J1994j3410J7013k8225j8234N2792P0537R141j9766p1013o7193
16515a81588j55177M4229J51823l6563J9441m0361j58198M3804R8829J24942Q334
16504h0485K5732J9506k3240o0699n0352p0280R9277M5648l5355k3834n5908j497
16492b11487N6254k8343j16657m2235N9115J00525N3081j01793k443O265O617
16481b21101K7250P217O1272K430Q5060n4108l3911O3067R6322j734P0726m4742
16469E7748p7983o7484q0459j06129L88J50364J41097j2248l8397L9314m9234
16458d3023J0215L7030j19016j18626r8049n1388J74496J03679o7035K3893L4904
16447a12920J20109j7384n238p6712r7557R3803K0138j487Q932n6285k8834J2252
$$ plain form
16527 -170084 -125224 -113230 -126640 -109627 -137852 -156086 -103294 -32757 -23616 -43382 -114395 -181588
16515 -181588 -336765 -292536 -140713 -177276 -157835 -198196 -356394 -312590 -213761 -88819 -80485
16504 -80485 -54753 -35247 -58487 -119186 -169538 -239818 -140541 -94893 -130248 -154082 -209990 -211487
16492 -211487 -155233 -183576 -300233 -342468 -283353 -182828 -129747 -231540 -233983 -227718 -221101
16481 -221101 -193851 -186634 -125362 -122932 -37872 -91980 -125891 -62824 33498 31764 102490 57748
16469 57748 -20235 -87719 -168178 -274307 -273919 -123555 17542 5294 -33103 6211 -43023
16458 -43023 -32808 4222 -114794 -233420 -331469 -382857 -208361 -104682 -171717 -147824 -112920
16447 -112920 7189 -10195 -15433 -92145 -189702 -95899 -75761 -77248 -68316 -124601 -153435 -141183
16435a41183L9505J14967j7482p1754q6254m2463P6870o5583j07221j1228J13563
16424a98263J39824O2428J31997J27928j31968l1077L0162J731R295j69481j5870
16413d3294J68837M8443p200l9400q7185o4980m8432j67262j442K685p1524M0201
16401b70553Q8231J10670N6120l0413L3521R3131o033N1974n2846J7320r7836
16390f714p7631j0680r768l6216L9322J81974j22264l6974J7779Q6464O1526l3743
16378E3075q8862L0232q2699p112P5008O2139N101J57N7547j06956j38371n6096
16366a96837l7668O6007J08277K136J45005K0418r6693N5989Q0945n484m6806
16355I5289j15775r4460P0999m1945r8471r5092r2403O816J47832J48220P9025
$$ plain form
16435 -141183 -101678 13289 -4193 -75947 -162201 -204664 -127794 -193377 -300598 -311826 -198263
16424 -198263 -58439 3989 135986 263914 131946 100869 131031 132762 142057 -27424 -43294
16413 -43294 125543 173986 166786 127386 40201 -24779 -73211 -240473 -241915 -239230 -310754 -270553
16401 -270553 -182322 -71652 -15532 -45945 -12424 80707 74674 126648 73802 91122 -6714
16390 -6714 -84345 -95025 -104793 -141009 -101687 80287 -41977 -78951 -61172 25292 86818 53075
16378 53075 -35787 -5555 -88254 -95366 -20358 41781 46882 47039 104586 -2370 -140741 -196837
16366 -196837 -234505 -168498 -60221 -58085 86920 107338 10645 66634 147579 142095 95289
16355 95289 -20486 -114946 -43947 -85892 -184363 -279455 -371858 -365042 -217210 -68990 10035
16344A0035M3332J9787j12691q8417J747N942j9614j30502L625R0407N258m9578
16332b20669M7144J5872j6175M9355P0659k8048N8069N6598m0785k2367J2290
16321a8057l1436p2064M3741J0477J04758J35637o5974r651p5349O997J70796
16310A99875R6860m2415j78325o6768N1466p6545K5254j03268j59951k7872Q2160
16299a99529J43601p3501p3420J87331J58877q7354K1178m6080m8950Q7146j5850
16288E3449j05127j02195N3999J47818J07508j02792o4657o3551J8635p1295j427
16277a29635O8110O8375p3599j7171n1168q5724N7713R6282Q245R9850K0622k0809
16265D1091j24862q8769l0632j148J6835J4911q016R1074J07338K3296k2432l6964
$$ plain form
16344 10035 53367 73154 -39537 -127954 -126207 -120265 -139879 -270381 -266756 -176349 -171091 -220669
16332 -220669 -173525 -157653 -173828 -124473 -53814 -81862 -23793 32805 -7980 -30347 -18057
16321 -18057 -49493 -121557 -77816 -67339 37419 173056 107082 97431 22082 29079 199875
16310 199875 296735 254320 75995 9227 60693 -15852 9402 -93866 -253817 -281689 -199529
16299 -199529 -55928 -129429 -202849 -15518 143359 56005 77183 31103 -17847 69299 53449
16288 53449 -51678 -153873 -99874 47944 155452 52660 -11997 -75548 -56913 -128208 -129635
16277 -129635 -61525 6850 -66749 -83920 -135088 -220812 -163099 -66817 -58572 41278 61900 41091
16265 41091 -83771 -172540 -203172 -204320 -187485 -172574 -180590 -89516 17822 41118 18686 -18278
16253a8278r9425K3158m2444O0583n5909n4541J06197J36485k4522j35362j6498
16242a20556P5910k1699P9199Q1839j5543J1754n930j00702J7770J38251o0905
16231G9388j18553K9511K5049K6781J9903K1463K5691n63r9047j22869m3899K5613
16219a31532J759N9650P7500J10832j14040j58665r61K0615l1255j2004L9291
16208a38810N1814Q4211k1563J4106P3556k7063q756O52O8367O8548L7893o1496
16196A41459j19761L0037k9246j2266J339n9538J6022q616m908m4848O1692o9477
16184i8111n6180o3460n567M519k7727J17126K73033J08778j8962p6529k14056
16173e7136j75977q9364O5124Q0386J06156J24925P0084j59540m801J65063o7425
$$ plain form
16253 -18278 -117703 -94545 -136989 -76406 -132315 -186856 -80659 55826 31304 -104058 -120556
16242 -120556 -44646 -66345 12854 94693 79150 90904 84974 -15728 2042 140293 79388
16231 79388 -39165 -9654 15395 42176 62079 83542 109233 108670 9623 -113246 -157145 -131532
16219 -131532 -129773 -70123 7377 118209 4169 -154496 -155457 -134842 -166097 -178101 -138810
16208 -138810 -86996 -2785 -24348 -10242 63314 36251 27495 28147 96514 165062 202955 141459
16196 141459 21698 51735 22489 10223 11562 -47976 -31954 -40570 -45478 -90326 -28634 -98111
16184 -98111 -154291 -217751 -223318 -218799 -246526 -129400 143633 252411 233449 156920 -57136
16173 -57136 -233113 -322477 -257353 -176967 -70811 54114 124198 -35342 -40143 124920 57495
16162E7495q2559k276j3616o6513K0759n2272m6651J10088M3255m0619P6342M3011
16150D6444q4549l4143O2698k8959o3921j4731p2218L9771p8340R19O2860r1747
16138b55916O2137L3787n4933n1257J3672p86o143K5687o8231J9466J26620P5129
16126h0768M3461J44102l757m5754j32625l5404k4190l1077N1911P5642l1640
16115g0099j49353o7646r853J23479J07634j7981M290O1175j11259R6409O347
16104b6857P1573n4727J0925L2634m7321r632n0564K8012O295K7114J1046J27314
16092A25812L3423p7602L9559j6556L4323M9135l7204r9319j02768n5544P8314
16081b8427J47570P6307q9345J5369m4456o4644n8786J932O7393k4827M0931j7037
$$ plain form
16162 57495 -25064 -27340 -40956 -107469 -86710 -138982 -185633 -75545 -32290 -72909 3433 46444
16150 46444 -38105 -72248 -9550 -38509 -102430 -117161 -189379 -149608 -227948 -227029 -164169 -255916
16138 -255916 -193779 -159992 -214925 -266182 -252510 -253296 -259439 -233752 -301983 -282517 -155897 -80768
16126 -80768 -37307 106795 103038 57284 -75341 -110745 -134935 -166012 -114101 -38459 -70099
16115 -70099 -219452 -287098 -296951 -173472 -65838 -83819 -79529 -18354 -129613 -33204 -26857
16104 -26857 44716 -10011 914 33548 -13773 -23405 -73969 -45957 -39662 -12548 -1502 125812
16092 125812 159235 81633 121192 104636 138959 188094 150890 51571 -51197 -106741 -28427
16081 -28427 119143 195450 106105 121474 77018 12374 -46412 -44480 22913 -1914 39017 21980
16069B1980r7609J13104J06946J4162r2848j0119r6923j97193p287J23692J39931
16058A7836j6177n1922J2009K6272R527n0036j92628O2708P9725j8548L6840P553
16046g6841J8572q242q9390q8833J4948O712Q2898J11117p2619l5519O1132M7706
16034b8359j44441p2870k7832K3677Q4771L4574Q2137Q2523N3262q8019o8208
16023f8785l1103J9726j9026L7096n2278J4463j3465K061R0376k7830L2073J530
16011a5162o6635j47433M7844M8052Q8184J00690q7811m8838O0192J66721L3341
16000A79145j25869q8815j61071m2081J22103l4755Q8109k6467J4784k5075r0988
15989a90980m4065J0801R7594M3194p0142j31032n4789J4116J6097R4583J51145
$$ plain form
16069 21980 -75629 37475 144421 158583 65735 55616 -41307 -238500 -245787 -122095 17836
16058 17836 1659 -50263 -38254 -11982 -2455 -52491 -245119 -182411 -102686 -121234 -84394 -76841
16046 -76841 -58269 -66511 -155901 -244734 -229786 -223074 -140176 -29059 -101678 -137197 -76065 -28359
16034 -28359 -172800 -245670 -273502 -249825 -165054 -130480 -48343 34180 87442 -577 -68785
16023 -68785 -99888 -80162 -99188 -62092 -114370 -99907 -113372 -111311 -20935 -48765 -16692 -15162
16011 -15162 -81797 -229230 -181386 -133334 -45150 55540 -32271 -81109 -20917 145804 179145
16000 179145 53276 -35539 -196610 -238691 -116588 -151343 -63234 -89701 -74917 -99992 -190980
15989 -190980 -235045 -224244 -126650 -83456 -153598 -284630 -339419 -325303 -309206 -214623 -63478
15978f3478n2099j52409l4182R8752J32588P9955K0100m6823K909o3978R1905
15967A3240Q7445r0431K6404j1537J6363p2097j8213j04658j35479J74110J13360
15956a493j18879j116l4878L5625n7884j406J91562K00771J2077j6806j66458
15945D1115j42848o2201J94694J04951r2887j10364l0005K2293O4213L0240m2699
15934b3498j06128N5646L7429O6561k1663K5445M6392k138j87059k0975J36999
15923G011R0892p7924K9041k631L8603L3906r5574k8813P6089O6873k3673o318
15911A07482K5486j46349J6462O5146j06566l3693l6291N2907L2942Q9871J3053
15900H0450m3207J800O8698P0966r3114M1729k7091j52060n4359m9769L6834J9039
$$ plain form
15978 -63478 -115577 -267986 -302168 -203416 -70828 9127 29227 -17596 -14687 -78665 13240
15967 13240 100685 10254 36658 25121 41484 -30613 -48826 -153484 -288963 -114853 -1493
15956 -1493 -120372 -121488 -156366 -120741 -178625 -180031 11531 212302 224379 207573 41115
15945 41115 -101733 -163934 30760 135711 42824 -67540 -97545 -75252 -11039 19201 -23498
15934 -23498 -129626 -73980 -36551 30010 8347 33792 80184 78046 -109013 -129988 7011
15923 7011 97903 19979 49020 46389 84992 118898 23324 -5489 70600 137473 113800 107482
15911 107482 132968 -13381 3081 68227 -38339 -72032 -108323 -55416 -22474 67397 80450
15900 80450 37243 39043 107741 178707 85593 127322 100231 -51829 -106188 -155957 -119123 -100084
15888a00084J9664Q5780j4714Q7209J9567o4746j27692L9263l803J06589N0554
15877I7587n4097o6801L3283k3056O0844n093m0198j5314j3392k22758K9096J06727
15865a13172l1482L5551m5751J7101J52836J9316J30825k2683r8264j3546K3383
15854E4114K1528O115K8251j07005p6246K0302m500j1490M3756J40333j475j857
15842A11826j12385j9102R963O485j5426q1915q998Q249k2878L7455N1709n6076
15830i1093l5479K4269J2209l0152o718M4416j2807L3069R9577r1616j01084j08203
15818b63612q5485N6604J36135Q3949L9658N1181L3077j0323l6820j8906j6958
15807c1500N5878J01420N1274M5004M3107o0984r5754j3217r3802o1213L0310
$$ plain form
15888 -100084 -80420 5360 -9354 77855 97422 32676 -95016 -55753 -59556 47033 97587
15877 97587 43490 -23311 9972 -13084 47760 42667 2469 -12845 -26237 -248995 -219899 -113172
15865 -113172 -144654 -109103 -154854 -137753 15083 34399 165224 142541 44277 30731 54114
15854 54114 75642 81757 110008 3003 -73243 -52941 -57441 -68931 -25175 115158 113683 111826
15842 111826 -559 -19661 -9698 -3213 -18639 -100554 -109552 -101303 -124181 -86726 -35017 -91093
15830 -91093 -126572 -102303 -90094 -120246 -126964 -82548 -95355 -62286 37291 -54325 -155409 -263612
15818 -263612 -349097 -292493 -156358 -72409 -32751 18430 51507 41184 4364 -14542 -31500
15807 -31500 24378 125798 177072 222076 265183 204199 108445 95228 1426 -59787 -29477
15796b9477L7156j562j9541M0574k2927j71505j7022J5193k6287k769K8475J0640
15784a59052J5171R0258P0273q086q1140m0336O4923m2489n8143l9673M3772m3175
15772a87697L5874J2795M4852p8821O7743P6197j13546j30621o0360O1332M6755
15761b25497K01054O4348l6124O4520K7083j05741j5473L5459N5119L5207j5740
15750H4215m0073q5340p1839j03791p6250K2680J25068M8688J22895O6319k1999
15739G0573J32052n3497j44673K8001n7716o3038k7599M1488N638P8923m6792
15728c6640j14191n166P9325K9925q0656m7530j1173M1493l3775J189K0064R7099
15716f0036Q0385O523N0335n0660q9547J0472r8766j6566M2309J33520J1709l9586
$$ plain form
15796 -29477 7679 6117 -13424 27150 4223 -167282 -184304 -169111 -195398 -198167 -169692 -159052
15784 -159052 -143881 -53623 16650 8564 -72576 -112912 -47989 -90478 -148621 -188294 -144522 -187697
15772 -187697 -151823 -139028 -94176 -172997 -105254 -29057 -142603 -273224 -333584 -272252 -225497
15761 -225497 -24443 39905 3781 68301 95384 -10357 -25830 9629 64748 99955 84215
15750 84215 44142 -41198 -113037 -216828 -293078 -270398 -145330 -96642 26253 92572 70573
15739 70573 202625 149128 4455 32456 -25260 -88298 -115897 -74409 -68771 10152 -36640
15728 -36640 -150831 -155997 -76672 -46747 -127403 -174933 -186106 -144613 -178388 -177199 -157135 -60036
15716 -60036 20349 26872 77207 26547 -63000 -52528 -151294 -167860 -125551 7969 19678 -19908
15704a9908k00815o1323J15672L8653M7904O211p3420l6624L093L5968J14501
15693c0088L3151R0913k4746n3683l6339R5112M1916n5902k9414J35318j3358
15682A52880m4933k8788j08601N6689n6712j23945j19575J16731K13962j1937
15672D5771p9703k8353L9110N5407n4319r9903K0137Q198O0116K6438Q4269l3163
15660D4005o1990j13154k9560k0387M7620l510j55339P8809J27469q8652p0077
15649b44766R7646M7690N3581J02015J25048K2301j53168l0160J68935L8698j74920
15638E2900k27695j01446J16350k7467M7926j6592J3139R3085l3567l9956K7399
15627i5924q5195l4362O0236Q8321o4668q8986j18662r583M5911O8157J09154
$$ plain form
15704 -19908 -220723 -282046 -166374 -127721 -79817 -73606 -147026 -183650 -180557 -144589 -30088
15693 -30088 3063 93976 69230 15547 -20792 74320 116236 60334 30920 166238 152880
15682 152880 107947 79159 -29442 27247 -29465 -153410 -272985 -156254 57708 45771
15672 45771 -33932 -62285 -23175 32232 -22087 -121990 -101853 -93655 -33539 -7101 77168 44005
15660 44005 -17985 -131139 -160699 -181086 -133466 -136976 -292315 -213506 -86037 -174689 -244766
15649 -244766 -147120 -99430 -45849 56166 181214 203515 50347 20187 189122 227820 52900
15638 52900 -174795 -276241 -159891 -187358 -139432 -156024 -142885 -49800 -83367 -123323 -95924
15627 -95924 -181119 -215481 -155245 -66924 -131592 -220578 -339240 -348823 -302912 -234755 -125601
15616a25601J93666j20505l6489K00609m1099j07964O1293o868o2791M5111o3808
15605f4446j6742K0363Q8530n1069j41993R586Q9152Q3583Q50K7312l1401J0020
15593B3745M1548J1305J7173j58987m7179M2004O5941j7538R811R6886j0525k04668
15581a30484p1277M5790O7694L578O3812l9760j1054M2102j430R636K976k0540
15569c8957K2141P2546P0326k9382p0742P1573o7361l9812k8599L9660l1813K0383
15557a0037l4771j16847m7173l4708p3305R2300J7531Q015N0616K51Q0716L0852
15545c6560j4649L7589j00437L5409l5923j2735O0028J7772L8757q3207M6952
15534d7004O6414J3127R686k5607J18823l8751M9294j9919L991P4143M112j09598
$$ plain form
15616 -125601 68065 -52440 -88929 111680 70581 -37383 23910 17042 -45749 -638 -64446
15605 -64446 -81188 -60825 27705 -23364 -165357 -155771 -66619 16964 17814 45126 13725 23745
15593 23745 65293 76598 93771 -65216 -112395 -70391 -4450 -21988 -12177 84709 74184 -130484
15581 -130484 -201761 -155971 -88277 -84699 -20887 -60647 -71701 -29599 -31029 -21393 -18417 -38957
15569 -38957 -16816 55730 126056 96674 25932 97505 30144 -9668 -38267 1393 -30420 -10037
15557 -10037 -44808 -161655 -208828 -243536 -316841 -224541 -207010 -198995 -148379 -148128 -67412 -36560
15545 -36560 -51209 -13620 -114057 -78648 -114571 -127306 -67278 -49506 -10749 -93956 -47004
15534 -47004 19410 32537 42223 16616 135439 96688 145982 126063 130054 204197 208309 98711
15522I8711j8554j0961j04464m3991K7704k2866r0927J8215N7139N8757m7660
15511g8897r1757o785k8227l1178R7029R1726j07813M1254l3930j60732R620P2758
15499b26932J00534K4891j34054J9958J30901m3569J2496m0126Q624l3459J27165
15488e3571k9018m9224M7293J4969L414r2622o9856m8640J494Q2132R6472M3466
15476e3691q0313L4758O1680O2140R6905m5374o8124q7701P1208N4641K5637j51010
15464g9244o1485J07823L3579r9411q6112P6491J8087m3909n8547L0981N6260
15453a05487R5385k0425m7845j3745j03066o0424j4343N6594P6689J22946Q293
15442e428r2109m0070P7411l2329L7184K2043m3587r8558M5865Q8139l1021p6299
$$ plain form
15522 98711 80157 69196 -35268 -79259 -51555 -74421 -165348 -147133 -89994 -31237 -78897
15511 -78897 -170654 -177439 -205666 -236844 -139815 -48089 -155902 -114648 -148578 -309310 -299690 -226932
15499 -226932 -126398 -101507 -235561 -215603 -84702 -128271 -115775 -155901 -147277 -180736 -53571
15488 -53571 -82589 -131813 -84520 -69551 -66137 -158759 -228615 -277255 -275761 -193629 -97157 -53691
15476 -53691 -134004 -99246 -37566 24574 121479 76105 7981 -79720 -8512 46129 71766 -79244
15464 -79244 -140729 -32906 673 -98738 -184850 -108359 -90272 -134181 -192728 -161747 -105487
15453 -105487 -10102 -30527 -78372 -92117 -195183 -255607 -269950 -213356 -136667 -13721 -5428
15442 -5428 -97537 -137607 -60196 -92525 -55341 -33298 -76885 -175443 -129578 -41439 -72460 -148759
15430a48759O3088J38690J0965j12200q2218M690M2506k8138m2838J8617K4835
15419a10762M4302Q808l6974L020l7704P7760m305m3256M2050J1514L8976r3900
15407a00471r8373K3228Q3479R3107l2744j01505p4363N3953p4848Q2519l2837
15396a78855P0935J07074J13460M1340r1050r0761j12080J22748k6080j4241o1685
15385a19195l5824K660M682J04739O1379k4990j9771M4645O1328n123n7691l2680
15373a5841K5086o6876n3789L9643m3555J3937o3115P3865N8174j00524l7369
15362a70364R8468N7633P8723J6704O2976j44817k04834j34596J79742J61509
15352A144K4223j4037r9828n3222J3917J01613m8271N1735j0928o8484k0598q214
$$ plain form
15430 -148759 -85671 53019 63984 -48216 -130434 -125744 -83238 -111376 -154214 -135597 -110762
15419 -110762 -66460 -57652 -94626 -91606 -129310 -51550 -55855 -99111 -57061 -45547 -6571 -100471
15407 -100471 -198844 -175616 -92137 970 -31774 -133279 -207642 -153689 -228537 -146018 -178855
15396 -178855 -107920 -846 112614 153954 62904 -27857 -139937 -17189 -43269 -57510 -119195
15385 -119195 -155019 -152359 -147677 -42938 18441 -6549 -26320 18325 79653 74530 16839 -15841
15373 -15841 9245 -57631 -111420 -71777 -115332 -101395 -164510 -90645 -32471 -132995 -170364
15362 -170364 -71896 -14263 64460 81164 144140 -677 -205511 -340107 -160365 1144
15352 1144 25367 11330 -88498 -141720 -127803 -26190 -74461 -22726 -33654 -102138 -122736 -130950
15340a30950J06610k0289N7786n182k8571K872p6757k365J0871J9951O5100o3386
15328f4310p4835p5275Q5165n459M1926j9969j4203n4943K4969M3920O1655m0510
15316i1869J5097P8019j08229P0354J36822Q8410o7530o9988n0236J5192j2107
15305C935O9126r0850n9807P1503P4744N1383m4409n9676J4469j0288P383R7860
15293A25373l1712j14928o6502L4546k0851j2786M9077L6878q9692k9265K3980
15282i5882J4209j06260O907j7258N5603Q8791m5757O7205l6830q5778Q3743q197
15270g9504L6677N8904l7016P4794j7716j7563l4586J02540K049q1814k2500q8781
15258a04516J0481q310J00506O6011N792j21230P7603J51364Q021j62224l4577
$$ plain form
15340 -130950 -24340 -44629 13157 7975 -20596 -17724 -94481 -96846 -85975 -66024 -924 -64310
15328 -64310 -139145 -214420 -129255 -134714 -92788 -112757 -126960 -181903 -156934 -113014 -51359 -91869
15316 -91869 -76772 1247 -106982 -36628 100194 188604 121074 51086 850 16042 3935
15305 3935 73061 -17789 -77596 -6093 68651 120034 75625 15949 30418 20130 27513 125373
15293 125373 93661 -21267 -87769 -53223 -74074 -86860 -37783 -905 -90597 -119862 -95882
15282 -95882 -81673 -187933 -181026 -198284 -142681 -53890 -99647 -32442 -69272 -155050 -71307 -79504
15270 -79504 -42827 16077 -20939 53855 36139 18576 -16010 86530 88579 6765 -15735 -104516
15258 -104516 -94035 -102345 -1839 64172 69964 -51266 26337 177701 185722 23498 -11079
15247a1079p96p91K2295J8998l0143l8253l3039M3105k3476M8488j7795n9642
15235h2128q3992l9103J41615J26699J80360j51382o6693R6458m9188j65945j24664
15224b17963R4156P7544p0737l3135J03577O7912J08013Q0364o3545l0352m9475
15213F6359m5949o4593Q9927P8611m0612k9395j4569j02645m733n7069K3983R8067
15201b618m9172k9724m7649k0923L7241j6568m3872J58236m2040L3798K7658l6524
15189c2157k9379M4416j6143J1916J2359N689j20488l2638O0268J10877n3105
15178c8385p2266k3035R2102J04863M6601n6155n4743q5904l4582L1609O2896
15167b6999J18113M2725M537J0512K1979p9940j0556j29683j84731k7921J16071
$$ plain form
15247 -11079 -11875 -12666 9629 28627 -1516 -39769 -72808 -29703 -53179 -4691 -22486 -82128
15235 -82128 -166120 -205223 -63608 63091 243451 92069 25376 121834 72646 -93299 -217963
15224 -217963 -123807 -46263 -117000 -150135 -46558 21354 129367 209731 146186 115834 66359
15213 66359 20410 -44183 45744 124355 83743 54348 39779 -62866 -67599 -124668 -100685 -2618
15201 -2618 -51790 -81514 -129163 -150086 -112845 -129413 -173285 -15049 -57089 -23291 4367 -32157
15189 -32157 -61536 -17120 -33263 -21347 -8988 -3299 -123787 -156425 -96157 14720 -38385
15178 -38385 -110651 -133686 -41584 63279 109880 53725 -1018 -86922 -121504 -89895 -26999
15167 -26999 91114 133839 138376 148888 170867 90927 80371 -49312 -234043 -261964 -145893
15156a45893J87087j5716p227n4316N0365L3916J5906m6562K6174m3043P8533
15145G9224o1375j01049n5667N1475K0462m6838l3446r1062o348P1293O1760M3773
15133f7798k8866M611q1676l6191o782J70136L7708K0818p3476Q3348L020k11227
15121a86375K3624J21132l6249l6860P9779R4600q4840j8311N9857j07987m2227
15110a33857N8434K0762P7239J61366j11688l3402M8945m1193N549p1109N3612
15099C4658J00364J931j38518m3769L1924j8632l1776m6688m800J16509J24226
15088A25429k5806q5711k6179L0101m6993J02044Q1451j10635j19734k3567L7233
15077f2367K4579J14667L9622j32225j00931j23798r01l1844M1798N7160N1912
$$ plain form
15156 -145893 41194 25478 18251 -36065 14300 48216 64122 17560 43734 691 79224
15145 79224 17849 -83200 -138867 -87392 -66930 -113768 -147214 -238276 -244624 -173331 -111571 -67798
15133 -67798 -96664 -92053 -173729 -209920 -216702 -46566 -8858 11960 -61516 21832 24852 -186375
15121 -186375 -162751 -41619 -77868 -114728 -34949 59651 -25189 -43500 16357 -91630 -133857
15110 -133857 -75423 -54661 22578 183944 72256 38854 87799 46606 52155 -18954 34658
15099 34658 135022 136953 -1565 -45334 -13410 -32042 -63818 -110506 -115306 1203 125429
15088 125429 99623 13912 -12267 17834 -29159 72885 154336 43701 -76033 -99600 -62367
15077 -62367 -37788 76879 116501 -15724 -116655 -240453 -241354 -273198 -231400 -174240 -122328
15066a22328n3066m4639O8831J1317l6625k2320J21053L1447n7540r3095m3544
15055b40509N7384O2310L1131l8147k6331k430m083l0780O7591k5756M7944j1060
15043a12736j6446R5229J18378O0788k2680K3229j59404k39P79K5410J52919K1543
15031A86770j53250j00160k4407J52862O0236q6884r0546L3560L9187J1943q6224
15020e6913J1477L3428J05796O878l2238K0978M1095o8899L6621o6933j35467
15009a04177J2548N5378M1190q7212j42237n7892l6447R6851J32141J57465L4680
14998A02288j3112q0114p9690q0444n075J12293N1864n6815l6377J1811o3641
14987a37012r0309r7714O320J00663J1021M8054O7025J268O590j6964m0232k1154
$$ plain form
15066 -122328 -175394 -220033 -151202 -139885 -176510 -198830 -77777 -46330 -103870 -196965 -240509
15055 -240509 -183125 -120815 -89684 -127831 -154162 -156592 -160675 -191455 -123864 -149620 -101676 -112736
15043 -112736 -129182 -33953 84425 145213 122533 145762 -13642 -13881 -13102 12308 165227 186770
15031 186770 33520 -66640 -91047 61815 122051 35167 -55379 -21819 17368 29311 -56913
15020 -56913 -45436 -12008 93788 100666 68428 89406 130501 61602 98223 31290 -104177
15009 -104177 -91629 -36251 4939 -82273 -224510 -282402 -318849 -221998 -89857 67608 102288
14998 102288 89176 9062 -70628 -151072 -156147 -43854 8010 -48805 -85182 -73371 -137012
14987 -137012 -227321 -325035 -318715 -218052 -207031 -158977 -91952 -90684 -84094 -101058 -141290 -162444
14975a62444o629j7245J8149o665J18617J97276R254K8176j0080p2825m0004m0771
14963A4809q216Q7138K2492p2691n2670k6777J23671Q4390n2947j37618m6269
14952f4688M4606r2337n5840R4542R3905q5775J9521J50391L4952j10180j52516
14941a23419r2868L8707k9860J13799J23117n6735N7318K7143j4096L1893M5176
14930A20175l3845r0786M2094M0527O6193j5396j41455j65236n2048J33185J33172
14919C6580j16225l6498J4624k843o4742k4062M2926o4495j1124J04283k4667
14908a46243K7936K1647j3868Q5823L868Q0240J16445r7438p4205q3166l590M7679
14896c4872o9263R551R4917n0279P4010O1184J5808R085n0554j563M4903q6938
$$ plain form
14975 -162444 -169073 -186318 -168169 -174834 -56217 141059 150313 178489 168409 95584 55580 14809
14963 14809 6593 93731 116223 43532 -9138 -35915 87756 172146 119199 -18419 -64688
14952 -64688 -20082 -112419 -168259 -73717 20188 -65587 -46066 104325 139277 29097 -123419
14941 -123419 -216287 -177580 -207440 -93641 29476 -27259 30059 57202 43106 74999 120175
14930 120175 86330 -4456 37638 78165 144358 128962 -12493 -177729 -229777 -96592 36580
14919 36580 -79645 -116143 -101519 -104362 -169104 -193166 -150240 -214735 -225859 -121576 -146243
14908 -146243 -118307 -96660 -110528 -24705 -20837 59403 175848 78410 4205 -78961 -82551 -34872
14896 -34872 -104135 -94584 333 -49946 24064 85248 101056 110141 59587 58024 102927 15989
14884A5989n5479L536Q1378O0429k7937P153L9378l0436q0745k6319R1545J25089
14872B03581N9835j49873j2364k1229j44495Q3537P6823M8307l9784m3520l9687
14861B1131J3701k5030o317J582K5626Q840n8891q2412l4339J2096J04786R4337
14849G5110P4173q7684K2813O5138k3650j07020m8789J8188p401O6918K5360l0188
14837D2968p7857O677J0715j32515J5790Q2036J1168Q1627J0290m0811j12478
14826a02390p8040j6043M0955J27784N3635j53335R779J58461O5679l2784r3069
14815a9368m4604l5202o9134M6560R5367j22734r9500O2625J88279J08490j03106
14804G673p2796m0065L4007j2830n5275N5240j9737P7296K6343p1832o206j6870
$$ plain form
14884 15989 -39490 -35954 45424 105853 77916 85069 124447 94011 13266 -13053 78492 203581
14872 203581 263416 113543 101179 79950 -64545 18992 95815 144122 104338 60818 21131
14861 21131 34832 9802 3485 5067 30693 39533 -19358 -101770 -136109 -124013 -19227 75110
14849 75110 149283 61599 84412 149550 125900 18880 -29909 -11721 -19122 47796 73156 42968
14837 42968 -34889 -28212 -17497 -150012 -134222 -52186 -41018 40609 50899 10088 -102390
14826 -102390 -180430 -196473 -155518 -27734 25901 -127434 -117655 40806 106485 73701 -19368
14815 -19368 -63972 -99174 -168308 -121748 -26381 -149115 -248615 -185990 2289 110779 7673
14804 7673 -65123 -105188 -71181 -84011 -139286 -84046 -103783 -26487 -144 -71976 -78182 -95052
14792i5052p6966j8333M8146J25766J04995N8230o75k7026L032n9180m4523M7517
14780F5931N392K2460J6605q0722m8466J7848j07680j5913J8957K9956P2890L9115
14768C6373N4133M4687L1873m7476p0735r7859O2846M9016Q8949l6375l4252N0864
14756A32044J21532L3261l5631j22873o5760j02777J9095J7782O4380L1764m3154
14745D9663m488O2109J01747j19622j42142L2767M7792K6632j05050L1068Q0808
14734F1284n7039j29004N9819P9686q3506n9126P7445n7813N1446O3956q6512
14723g9364L8307M0171M8391j20575r9283J1426M9624m165J60466k6716j32189
14712a13907N7630P9280K01564n1238k39434r9005j7291O2434O9545M908l5178
$$ plain form
14792 -95052 -172018 -190351 -142205 -16439 88556 146786 146111 119085 122117 62937 18414 65931
14780 65931 71323 93783 110388 29666 -18800 -952 -108632 -124545 -105588 -75632 -2742 36373
14768 36373 90506 135193 167066 119590 48855 -49004 13842 62858 151807 115432 81180 132044
14756 132044 253576 286837 251206 128333 62573 -40204 -21109 -3327 61053 92817 49663
14745 49663 45175 107284 209031 89409 -52733 -19966 27826 54458 -50592 -19524 61284
14734 61284 4245 -124759 -64940 14746 -68760 -127886 -50441 -108254 -56808 7148 -79364
14723 -79364 -41057 -886 47505 -73070 -172353 -160927 -111303 -115468 44998 18282 -113907
14712 -113907 -56277 23003 224567 173329 -66105 -165110 -182401 -119967 -50422 -45514 -80692
14701h0692j0182N9833K4985J3157q7794m9988J23460O5314J0625K2063r8476
14690g695o8815k6829Q9814P5771N3985J08782O5742k12924Q446P701o5604p988
14678B0386P974n9212R9058j6956j00621l9861r805o8711J0248P0251Q2020K2497
14666A7268J7546Q9404j0756j32393o4170n0099O8507J52511n4967R401K2587
14655F4839n1868k5470J91798j8258k21319M7303o14l5798M3863J6742J1031L0758
14643E3007P285k6799n7445p9929p8236M5072p391k0898R3946N6978k4408j46929
14631a85747m0307J05286R625q93O8698M4252O3702J32223j04232M582J0849k8263
14619G9775l5364l986J0954j21503J1329l9996j95900Q4549K27814J04908r628
$$ plain form
14701 -80692 -90874 -31041 -6056 7101 -80693 -130681 -7221 58093 68718 90781 -7695
14690 -7695 -76510 -103339 -13525 62246 116231 225013 290755 77831 86277 93978 28374 20386
14678 20386 28360 -30852 68206 51250 -49371 -89232 -99037 -167748 -157500 -87249 -5229 17268
14666 17268 34814 124218 113462 -18931 -83101 -133200 -64693 87818 32851 42252 64839
14655 64839 12971 -12499 179299 161041 -60278 -12975 -13589 -49387 -5524 11218 22249 53007
14643 53007 60292 33493 -23952 -103881 -182117 -137045 -144436 -165334 -71388 -14410 -38818 -185747
14631 -185747 -226054 -120768 -111143 -112036 -43338 914 64616 196839 92607 97189 108038 79775
14619 79775 44411 40425 51379 -70124 -58795 -98791 -294691 -210142 17672 122580 112952
14608A12952j01761n4080J23668M741p4580J06983P9627n7409k7268K6397M1107
14597A80377j6316n8748o5051k6132R39P9522k8449l2502K5530Q407p3406l5192
14585d1021J20827Q6604l4282k3370r734o1987P4711L6627j0296m7636m5189o3833
14573a8579R2069l32o4864o6263n0227J22487j2378N2929m2461n4263M9690R2132
14561I9940l1605K1532n9729n2832m2437k4886Q977k3491N4066n8060j6429Q4688
14549d0266N4291j5728Q067O0145p356o6664j3243Q6054k9316K6087m1296o0061
14537c9286m5579j18128l2516m1065q9605R5608J29601j1378l9611Q9225J95868
14526I3134J29422m8895P2472P6616l9517k13658n4803r955l7811m8970j74149
$$ plain form
14608 112952 11191 -42889 80779 85520 10940 117923 197550 140141 112873 139270 180377
14597 180377 164061 105313 40262 14130 15069 94591 66142 33640 59170 67577 -5829 -41021
14585 -41021 79806 166410 132128 108758 99024 37037 111748 148375 138079 90443 45254 -18579
14573 -18579 73490 73158 8294 -57969 -108196 14291 1913 54842 12381 -41882 7808 99940
14561 99940 68335 89867 30138 -22694 -65131 -90017 -81040 -104531 -50465 -108525 -124954 -40266
14549 -40266 14025 -1703 6364 66509 59153 -7511 -20754 65300 35984 62071 20775 -39286
14537 -39286 -84865 -202993 -235509 -276574 -366179 -270571 -140970 -152348 -191959 -102734 93134
14526 93134 222556 173661 246133 322749 283232 69574 14771 4816 -32995 -81965 -256114
14515b56114n9104Q2072M6123P7777L1395R2504o7466j27067k5428L2733R0262
14504h2313O357j43619J467J14637K1479j7558M9619L0354N4346J13241R5278
14493B43288o6170l9502K7591R189k1086m6674j16237p8825Q0943K6675P835j18632
14481i1605j5919O0515N0282J203L2022M4097K0246L987J3937o7824q4089P6473
14469D3325M7177R2990J1750r3864r4050m8162P9297J67468J3536m8655m5165
14458A25647j5933l0799o221J14112P7417m9731j60583L3769j20195m1596n2367
14447a26480K3853O9027m5063j10166q4938K12467J10719o7143Q6691L8913j27021
14436a9141r3537L1398N1142K4089J02329k0943q2648Q785p011p9500n8922J30996
$$ plain form
14515 -256114 -315218 -233146 -187023 -109246 -77851 14653 -52813 -179880 -205308 -172575 -82313
14504 -82313 -75956 -219575 -218108 -103471 -81992 -99550 -49931 -19577 34769 148010 243288
14493 243288 177118 137616 165207 174396 153310 106636 -9601 -88426 -7483 19192 27027 -91605
14481 -91605 -107524 -47009 3273 4476 36498 80595 100841 104828 118765 50941 -33148 43325
14469 43325 90502 183492 195242 101378 7328 -40834 38463 205931 219467 170812 125647
14458 125647 109714 78915 72694 186806 264223 214492 53909 87678 -32517 -74113 -126480
14447 -126480 -102627 -33600 -78663 -188829 -273767 -61300 49419 -17724 68967 107880 -19141
14436 -19141 -112678 -81280 -30138 -6049 96280 75337 -7311 1474 -5537 -85037 -143959 -12963
14424a2963J44733k1155r826P3970q2530j49122j2535R074J11537Q489O9252j15765
14412A3159j5749k1089O8368R0113j10259j74829o6141P4657J78726L7712o5707
14401H961m812J59262Q8583k0647o1610j49981R1494o5896j05136J41677l6313
14390D5582J8376M1375O3626J2841J3231p8317j32454M7457p9569m2058M5280
14379d4630J34930O6036j06157n7957P4935L0785k9667n2379M172O5069L0055
14368A15192L0212J08927K4775k8925k2438n7275j17378j37073p9293o4120R0040
14357a37356O2147n7951k066J12947n2420O1425K6490j24878N6671J76933L623
14346A25565j30221P294L905j40390j05678K4196P5954N9971n4800p8538J11845
$$ plain form
14424 -12963 131770 110615 100789 174759 92229 -56893 -69428 -60354 51183 59672 128924 13159
14412 13159 -2590 -23679 44689 134802 24543 -150286 -216427 -141770 36956 74668 8961
14401 8961 4149 163411 251994 231347 169737 19756 111250 45354 -59782 81895 45582
14390 45582 63958 105333 168959 181800 195031 116714 -15740 31717 -47852 -89910 -44630
14379 -44630 90300 156336 50179 -7778 67157 97942 68275 15896 20068 85137 115192
14368 115192 145404 254331 279106 250181 227743 170468 53090 -83983 -163276 -227396 -137356
14357 -137356 -75209 -133160 -135226 -22279 -74699 -13274 13216 -111662 -54991 121942 125565
14346 125565 -4656 2638 6543 -133847 -239525 -215329 -139375 -79404 -134204 -212742 -100897
14335a00897J08360K9382p9829m3922j8815J4126L1592m9890m5395K5415J57188
14324B7315l888j23948n2461J21725O5817N3027K7465j56777o8917L842J9310
14313h7490N946r0258k1098J2228L4446P3256P0470p8860J2813N7558j1741O9983
14301D7253k8106r4114m969L5316m7533K7471J86977P5705j17448j7367P1653
14290A34838k6957L07k5363J16470J3861j6893j57670q6276N8863J07659L2803
14279A51642K1853N0654k8558k24198k5118P7314J3211R6118M8048k3524j68971
14268a1529p184n2126o589J13527m2456k0938Q8930j791m3735k1011j1911m3526
14256f0339k2335J3649n2325K6978L3252q1009L4510N3771J02697Q5223N1908
$$ plain form
14335 -100897 7463 36845 -42984 -86906 -105721 -91595 -60003 -109893 -155288 -129873 27315
14324 27315 23427 -100521 -152982 -31257 34560 87587 115052 -41725 -110642 -106800 -87490
14313 -87490 -81544 -171802 -192900 -180672 -146226 -72970 -2500 -81360 -68547 -10989 -22730 47253
14301 47253 19147 -74967 -79936 -44620 -92153 -64682 122295 198000 80552 63185 134838
14290 134838 107881 108188 82825 199295 213156 196263 38593 -47683 11180 118839 151642
14279 151642 173495 224149 195591 -28607 -53725 23589 36800 132918 180966 157442 -11529
14268 -11529 -18713 -70839 -77428 36099 -6357 -27295 61635 59844 16109 -4902 -16813 -60339
14256 -60339 -82674 -69025 -121350 -94372 -61120 -142129 -107619 -53848 48849 134072 185980
14245A85980q994j12887n6801p949p628K3275j32172j9504j0358O775Q7652J58028
14233A05417L1420j28796N5241M1912j11595l8869J34880O3727k1447r9062k1687
14222A1141K9768j45481q874P2321K2933Q9542k4998q191m7494j06468l7240J44468
14210h573J16417J3817l4211k8671l755L7103m9334o8095L2116l7985j03520p833
14198a42524o0066j2980Q377k3284O501Q7228j0507m9316j6183P3697P2278M1259
14186b5520m4112r7035p8926Q3599Q7312J31495o831n89M5255m5579n8423O7703
14174E8349Q3792N9029L5694L1020q5057j57697j50535j2506L5461p6179J7490
14163a61139J3697m1096P4519M363M869R5435M7115j54349m3619K1881J19732
$$ plain form
14245 185980 176986 64099 7298 -651 -8279 14996 -117176 -136680 -147038 -140263 -52611 105417
14233 105417 136837 8041 63282 105194 -6401 -45270 89610 153337 131890 32828 11141
14222 11141 40909 -104572 -113446 -41125 -18192 71350 46352 38161 -9333 -115801 -153041 -8573
14210 -8573 107844 121661 87450 58779 55024 92127 42793 -25302 6814 -31171 -134691 -142524
14198 -142524 -202590 -215570 -207193 -230477 -223976 -136748 -147255 -196571 -212754 -139057 -66779 -25520
14186 -25520 -69632 -166667 -245593 -161994 -74682 56813 49982 49393 94648 49069 -9354 58349
14174 58349 142141 201170 236864 267884 182827 25130 -125405 -137911 -102450 -178629 -161139
14163 -161139 -147442 -188538 -114019 -109656 -104787 -9352 37763 -116586 -160205 -138324 -18592
14152a8592K1615m4476N9836n1071o1132N5295N9561L2939j13720L8796O5377
14141D4428N1868p9777j45825l7813M0243J05314L9540L5987j25598N421J4784
14130e1428l9091L9435j7084j3740P0160p81l448J09814p7j10905k8080K5308
14118a9917L8305p3302L8935O2221j20161n4226P4462N7921J06268n1597M5308
14107A04217J496n1998J7733O025j54733l0007M6974j0179m3920J24391O6804
14096G6803J01894m428j08352j65255l8743l2579j6521K0763J66918R2928j40842
14085d7414q5424Q2710M3673j93773j59924K63463J52498O7796p3418J4038R0278
14074A54503J3408J19315J12892k7047m7074r6534j22890r7103k8308k7357P0763
$$ plain form
14152 -18592 3023 -41453 18383 -32688 -93820 -38525 21036 53975 -59745 -20949 44428
14141 44428 96296 16519 -129306 -167119 -126876 -21562 17978 53965 -71633 -66212 -51428
14130 -51428 -90519 -51084 -68168 -81908 -11748 -12529 -15977 93837 93760 -17145 -45225 -19917
14118 -19917 18388 -54914 -15979 46242 -73919 -128145 -53683 4238 110506 58909 104217
14107 104217 105713 53715 71448 77473 -77260 -107267 -60293 -70472 -114392 9999 76803
14096 76803 178697 174269 65917 -99338 -138081 -170660 -187181 -166418 500 93428 -47414
14085 -47414 -132838 -50128 -6455 -200228 -360152 -96689 55809 123605 50187 64225 154503
14074 154503 167911 287226 400118 373071 325997 229463 106573 9470 -18838 -46195 24568
14063B4568J428n519l6445n472j02829l7065L4889N6070J55157j1512k2054j34735
14051h3519K009L2801l5955J07319O0736j19605m4807o002N8332P5304n3376K7394
14039B0631P2333q1262j21739m0596R9114J20702J3502m1835P4232m0436R0189
14028A64835l7601K2099j24833j09278J27798P1719m7740K1637p785M1547Q5160
14017B07558L4511L5017k9204j19906K1131l8967n1524K4839o3931r4613R0004
14006A4915J58712J0232q7252k4810p8373j22288j0152R4618K1542J16819M7870
13995A41833n9166j36084o2155N0412q7935J4847J27531M0592r2707N284k9753
13984h7301L2613R1891Q4310k3455n0769j20351M0476J02869n8323N3662J42556
$$ plain form
14063 24568 25996 20477 -15968 -21440 -124269 -161334 -126445 -70375 84782 73270 51216 -83519
14051 -83519 -81510 -48709 -84664 22655 83391 -36214 -81021 -87023 -28691 46613 -6763 20631
14039 20631 92964 11702 -110037 -150633 -51519 69183 82685 40850 115082 74646 164835
14028 164835 127234 149333 24500 -84778 43020 114739 66999 88636 80851 122398 207558
14017 207558 242069 277086 247882 127976 149107 110140 58616 83455 19524 -75089 14915
14006 14915 173627 183859 96607 71797 -6576 -128864 -139016 -44398 -22856 93963 141833
13995 141833 82667 -53417 -115572 -65160 -153095 -138248 -10717 29875 -62832 -57548 -87301
13984 -87301 -54688 37203 121513 98058 47289 -73062 -32586 70283 11960 65622 208178
13973B08178p5238j16008n1332Q187J13661J02255m5811m7803p4647n7357O131
13962b9784N8161M0889m303O7888J18567P6748j59549j98431p0816M589L0286
13951f5755n0665J38120O3331J2179p1408q7216m0116j07449O7817M5575l7271
13940a32858O4709N3951L5272k9863R9828R2814J09754q4385k64940j1549O3939
13929c328J25348K1546r1496n5083J2606k183k4844O7513N9396k4297j67370O9527
13917a2665l1734j4678J73993N7581j03974M9796j5608m0046N2596J8410j06499
13906B7172p6168r528J5784J06422L1142J25742K0767q7237k03864n1911K4082
13895g7597L7996K9166j8199J21282Q4620J2398k1243m6239j28927P1926J39266
$$ plain form
13973 208178 132940 16932 -34400 -26213 87448 189703 143892 96089 21442 -35915 -29784
13962 -29784 28377 69266 64963 132851 251418 328166 168617 -29814 -100630 -96041 -65755
13951 -65755 -116420 21700 85031 97210 25802 -61414 -101530 -208979 -141162 -95587 -132858
13940 -132858 -68149 -14198 21074 -8789 91039 183853 293607 209222 -55718 -67267 -3328
13929 -3328 122020 143566 52070 -3013 9593 7410 -17434 50079 109475 85178 -82192 -12665
13917 -12665 -44399 -59077 114916 172497 68523 118319 102711 62665 115261 133671 27172
13906 27172 -48996 -58524 -42740 63682 94824 220566 241333 154096 -49768 -101679 -77597
13895 -77597 -39601 -10435 -28634 92648 177268 189666 168423 122184 -6743 65183 204449
13884B04449n1201o7965q3971K3443O1904j00924p9034p439J19494P4317N2179
13873A45252k25110j75834J56811O6427j26186l6094N9681R9713j0834J11351
13863F5177Q2691O6118j01478N644n7441M492m1178J3544j8764j21263K7152K0600
13851e4706q4061m1410O5247n0019r9163P412J05680J08027M2182n761o4267k6094
13839i6933L5778L5724L6716J11397k9194j398j55355j07285L2615m2325Q4974
13828i5286Q2066J34974J02471q0671m9442n1627l2293N6460j9051n6669R1121
13817H2053M6191m2508l2313q0868j10605p3883L3746J9787K9743k6780J1900
13806a43537R4182J3133K4148M0675N9657M858J8964k8663k5904K102n3143l5394
$$ plain form
13884 204449 153248 85283 1312 24755 86659 -14265 -93299 -100738 18756 93073 145252
13873 145252 -79858 -255692 -98881 -32454 -158640 -194734 -135053 -35340 -46174 65177
13863 65177 147868 213986 112508 118152 60711 65203 24025 37569 18805 -102458 -75306 -54706
13851 -54706 -138767 -180177 -114930 -164949 -264112 -256700 -151020 -42993 -811 -6572 -70839 -96933
13839 -96933 -61155 -25431 11285 122682 93488 92090 -63265 -170550 -137935 -180260 -95286
13828 -95286 -13220 121754 224225 143554 94112 42485 10192 66652 47601 -9068 82053
13817 82053 128244 85736 53423 -27445 -138050 -211933 -178187 -158400 -128657 -155437 -143537
13806 -143537 -49355 -36222 -12074 28601 88258 93116 112080 83417 57513 59615 6472 -28922
13794b8922O0427l33k9400r0699j01966m1744J62184N0724L5291L8285p8983j17915
13782a43051K2446J87358j637j4934o684J41390J0023k4577L7242l0495j38495
13771C8586j32403O7008M2551p9385k9377L9924J25018J2358j31389N3780J88315
13760A94986R7626M8218o1868j24584j07017O7811J76959K7779q0196j07798m3146
13749H8770J1756k193q1548m7688J1159P1798N4695M6317J4441r7910L421j6823
13737E6195o2839p330N7293J16037M0770o578k6595j1122m6413J7875Q0917l5374
13725A72836o4679j4384j15640j67865M7269M1734k9645l2098m3052M5944J3852
13714a45728m8156N5110R6984j323Q4766K5050n3063k6434J08217J32928j49121
$$ plain form
13794 -28922 31505 31172 1772 -88927 -190893 -232637 -70453 -19729 15562 53847 -25136 -143051
13782 -143051 -120605 66753 65116 50182 43498 184888 194911 170334 207576 177081 38586
13771 38586 -93817 -26809 15742 -63643 -93020 -53096 71922 84280 -47109 6671 194986
13760 194986 292612 340830 278962 154378 47361 115172 292131 319910 239714 131916 88770
13749 88770 100526 98333 16785 -30903 -19744 52054 106749 153066 167507 69597 73018 56195
13737 56195 -6644 -13974 43319 159356 200126 193548 166953 155831 109418 127293 208210 172836
13725 172836 108157 93773 -21867 -189732 -142463 -100729 -130374 -162472 -205524 -159580 -145728
13714 -145728 -193884 -138774 -41790 -43113 41653 66703 13640 -12794 95423 228351 79230
13703G9230j4612N5948m7675M0814m8534N2418K11449J8696j59848j17114L0621
13692A01393m2402n46k7369O5768P838J2684J13246o2397m6892P578q8437j2756
13680B7708J04362M9151m6837n4658q9134K7902L1486p0916j6167P7989R141L6110
13668H6137p9930q6357K1608J24053n5495J1115M7317R414j25398O8325P3029
13657I3818N8006M1938Q7664M4347j14796o3092p0262m1406J37522M825l4979
13646A43585j00893n688k9002N9401J7087o1634L4685J03485R8981K5974k6004
13635B59977q4956n4301l4535M2895L3801N416Q2835M9930o1833k2253q1592r5788
13623C9596o9911q3276P5829J56184K3517N1526l1103N4154J45874m6269o905
$$ plain form
13703 79230 64618 120566 72891 113705 65171 117589 329038 347734 187886 70772 101393
13692 101393 58991 58445 31076 96844 104682 117366 230612 168215 121323 128901 40464 27708
13680 27708 132070 181221 134384 79726 -9408 18494 49980 -20936 -37103 40886 50027 86137
13668 86137 6207 -80150 -58542 65511 10016 21131 68448 77862 -47536 20789 93818
13657 93818 151824 193762 281426 325773 210977 147885 77623 36217 173739 178564 143585
13646 143585 42692 37004 8002 67403 84490 22856 57541 161026 260007 285981 259977
13635 259977 175021 120720 86185 129080 162881 168297 251132 301062 239229 216976 135384 39596
13623 39596 -30315 -113591 -37762 118422 141939 193465 162362 216516 362390 316121 309216
13612C09216m92N4820M391j61696j35563J22499o3023r6053J637m576n005O2495
13600H8650M6804N7149J58978J07585Q6887o8954r0552p4343j7518j00066l4044
13589A60576J32236p5037j42556L9799J65376M1616M4820J05491P4648N959L7975
13578E90903m2192k3289j08151l4431Q0331R8390O7635K528M4223J9590Q1766
13567G77303R2963J39965K07838J80130R5660K51929K37761L0426j30768P4377
13557A957584m8734n9767k27121k79484j74000j52234j24634m5255j35693j25782
13547E84880J16250n568n8359L1892M5287r4681j01711q8155J1328o1318l7271
13536C42574j3243P0064m6884n1777q1886J0180L5386n5592K166K1037N8521m2364
$$ plain form
13612 309216 308724 363544 367935 206239 70676 193175 130152 34099 35736 31160 26155 88650
13600 88650 135454 192603 351581 459166 546053 477099 386547 312204 294686 194620 160576
13589 160576 292812 217775 75219 115018 280394 322010 366830 472321 546969 552928 590903
13578 590903 548711 525422 417271 382840 463171 561561 629196 631724 675947 695537 777303
13567 777303 870266 1010231 1218069 1398199 1493859 1745788 1983549 2013975 1883207 1957584
13557 1957584 1908850 1849083 1621962 1342478 1168478 1016244 891610 846355 710662 584880
13547 584880 701130 695562 637203 669095 714382 619701 517990 429835 441163 379845 342574
13536 342574 329331 399395 352511 300734 218848 229028 264414 208822 210988 232025 290546 248182
13524B48182L9097r7957J4235Q3221p8673m4628Q5848L7377J0315j689O1025k22206
13512A34147j84807j5231J5055J00470K7861j1231P9038j7024j8739O8703l907
13501A74335j9289N3310o157J04683L0701m1378j3873k3140J4437J8467r6357
13490A95739j04111J04743R1116O0901P7908K2100j19947j77216M8184L5977K2870
13479B58264m7776O4873Q5672J37641k4548j6985j63973k69666p6599J30194P9815
13468A56912l2779m182o1125L5746J1705N1142O9199O6228J02274Q5596j44146
13457C36570k75015q7804J30156J23640k2701m2122j33022M8501J86721K0441
13447B85365p6790j1370O9521N5366m6923p9976K9767Q5609m7673r2218m1736
$$ plain form
13524 248182 287279 189322 203557 286778 208105 163477 249325 286702 297017 295328 356353 134147
13512 134147 -50660 -65891 -50836 49634 77495 66264 145302 128278 109539 178242 174335
13501 174335 155046 208356 202199 306882 337583 296205 282332 259192 273629 292096 195739
13490 195739 91628 196371 287487 348388 426296 448396 328449 151233 199417 235394 258264
13479 258264 210488 275361 361033 498674 474126 457141 293168 23502 -53097 77097 156912
13468 156912 124133 119951 58826 94572 106277 157419 226618 292846 395120 480716 336570
13457 336570 61555 -26249 103907 227547 204846 162724 29702 78203 264924 285365
13447 285365 208575 197205 266726 322092 275169 195193 224960 310569 262896 170678 128942
13436A28942m3576K1325K4596o579n0278R5032M0126l1971J3440k1419Q42R1730
13424B62210K6930j42018r5358m6356O444K2922k9876n5415r3796M6107J24355
13413B6149l5215K72m9747L984J43286J91611J0644j20067p0276n7054K3979P3999
13401A41565M7015Q798o6315M8135R7139r9619j76838k4132q8622q5464M17J26764
13389g1157J79765k297j36568L7555J59562K1708m547p2668m952R2884K681O0364
13377B62330k9579o9536K4581K7673R0580R6603m2116q2526o7911j0472K7205
13366B26832J21373l7891k0682K50214J10053m4332J8689m5359j70779r9908L6943
13355C45153P8568O198k8867J19767M4040j95612j55978j19411o65P8817q1871
$$ plain form
13436 128942 85366 106691 131287 124708 74430 169462 209588 177617 191057 169638 170480 262210
13424 262210 289140 147122 51764 5408 11852 34774 4898 -50517 -144313 -98206 26149
13413 26149 -9066 -8794 -58541 -54557 88729 280340 290984 170917 100641 43587 67566 141565
13401 141565 188580 197378 131063 179198 276337 176718 -120 -24252 -112874 -198338 -197921 -71157
13389 -71157 108608 106311 -30257 7298 166860 188568 184021 111353 106401 199285 201966 262330
13377 262330 232751 163215 187796 215469 306049 402652 360536 278010 210099 199627 226832
13366 226832 348205 310314 289632 539846 649899 605567 624256 578897 408118 308210 345153
13355 345153 423721 429919 401052 520819 564859 369247 213269 93858 93193 172010 90139
13344I0139o4636K15235N2636L2418O0000j23744j09461j1246J53984O370p6843
13333B24852J0839p5171q8293Q5213m6262P1714J01813M4622L978q8065k8950
13322B16290j9395L5929J7789K6696r034Q6487q8085o1526J18986R2357p8160
13311C38334K0608m2605o949L6162R9049K0116j9349j1375n279p6393j25183R419
13299B36555l3294p7651J43737N3445j9790q3925j11623P1385M0789J0052J6592
13288B46272R563O7082L0766l9986J26987N3722o597j40128j27832L3553M2596
13277B95998J25049m5641O8000L7031m1254m3341L8718L4389k8829j3691O3610
13266D90039k4226R5709P3620r4906j15895l9002M8727R0272m5979M5072l5127
$$ plain form
13344 90139 25503 240738 293374 325792 385792 262048 152587 141341 295325 301695 224852
13333 224852 235691 160520 72227 157440 111178 182892 284705 329327 333305 245240 216290
13322 216290 196895 232824 250613 277309 268275 354762 266677 205151 324137 416494 338334
13311 338334 358942 316337 309388 345550 444599 464715 445366 433991 428712 352319 227136 236555
13299 236555 203261 125610 269347 322792 303002 219077 107454 178839 219628 229680 246272
13288 246272 255835 322917 353683 313697 440684 494406 487809 347681 219849 253402 295998
13277 295998 421047 375406 443406 480437 439183 395842 434560 468949 440120 426429 490039
13266 490039 465813 561522 635142 540236 424341 385339 434066 524338 478359 523431 488304
13255D88304q7457K3232m3636K2113O7561k8698K7487n5808K7243P9099P0995
13244E90435O7497N4119J16628K02491n1929j00063M3934Q2980j46666Q0878J68884
13233A109188m1660j50807q9284l0763l2901l259N3770j67333j10376J89673J30142
13222H56390K1771j287J7406p7182o7506l760L750J60747M9926n09L4969J6307
13210A011022o3184L5919l9947k9413J26236P5126L3826M098K2392J6600l2308
13199A160367P2162m0795l4848L2441j4586N1038P1193J7569J23328o5362J03429
13188A475936N1579J40263O3277M0270Q6847k0579M8K7161Q128J19698J53052
13177B145680K9572j90046j2127j18446L9284K12628J68354J43882J26250Q3644
$$ plain form
13255 488304 400847 424079 380443 402556 470117 441419 468906 413098 440341 519440 590435
13244 590435 657932 712051 828679 1031170 979241 879178 923112 1006092 859426 940304 1109188
13233 1109188 1067528 916721 827437 796674 763773 760514 814284 646951 536575 726248 856390
13222 856390 878161 876874 894280 817098 749592 745832 749582 910329 960255 959746 994715 1011022
13210 1011022 947838 983757 943810 914397 1040633 1115759 1149585 1153683 1176075 1192675 1160367
13199 1160367 1232529 1191734 1156886 1189327 1174741 1225779 1296972 1314541 1437869 1372507 1475936
13188 1475936 1527515 1667778 1731055 1771325 1858172 1837593 1837641 1864802 1872930 1992628 2145680
13177 2145680 2175252 1985206 1973079 1854633 1893917 2106545 2274899 2418781 2545031 2628675
13167B628675J59480r1402Q672J64663K47644K05633Q200M8161J65080K67068
13157C811874J72161J39472K45128L33101K39614J46730J92159L51417L41442
13148E973098M11660M05699M54652M48516M37645M57031M82865O71742Q30601
13139A0573509Q08006R69996J059126J132446J375342J663339J960188K190995
13131B1732947K722211L033263L396982L759528M235363N139995N897763P123563
13123E7041615R059348J1491680J4719743J9090478K4722180L1044927L7239490
13116B04409461M1964720M3957114M1925206L5655033K5334569J1969963l260855
13109D01955211j7775698k9707209l7899765m1755483m1831865l8777352l3583305
$$ plain form
13167 2628675 2788155 2696753 2705425 2870088 3117732 3323365 3331565 3379726 3544806 3811874
13157 3811874 3984035 4123507 4368635 4701736 4941350 5088080 5280239 5631656 5973098
13148 5973098 6384758 6790457 7245109 7693625 8131270 8588301 9071166 9742908 10573509
13139 10573509 11381515 12351511 13410637 14543083 15918425 17581764 19541952 21732947
13131 21732947 24455158 27488421 30885403 34644931 38880294 44020289 49918052 57041615
13123 57041615 66100963 77592643 92312386 111402864 136125044 167169971 204409461
13116 204409461 246374181 290331295 332256501 367911534 393246103 405216066 401955211
13109 401955211 384179513 354472304 316572539 274817056 232985191 194207839 160624534
13102A60624534k7567916k1982548j7115054j3367743j0491721q417348p037904
13095E4644300n798727m930816m429411l973232l447067l060754k867285k508517
13087B3628491k265983j896585j697592j463436j335631j117632j081151r89994
13079A1780487q69380p41544n60132o19521o65928n09204m42473l94695l89516
13070F588094m22920j78370l94469k88447r4154k20402l33855k16462j82250q1345
13060D175420j19939k04903k34559k20211k09651o5410N0386n9941j80254k06742
13050B724196n216j21472p3649n0101N7388j49811k13189m9310o8153q6321m2500
13039A921862O4847p1600l7539o5136L196L2129j9882j14364o5069j18739L0996
$$ plain form
13102 160624534 133056618 111074070 93959016 80591273 70099552 61682204 54644300
13095 54644300 48845573 43914757 39485346 35512114 32065047 29004293 26137008 23628491
13087 23628491 21362508 19465923 17768331 16304895 14969264 13851632 12770481 11780487
13079 11780487 10911107 10169563 9609431 8989910 8323982 7814778 7372305 6977610 6588094
13070 6588094 6165174 5986804 5592335 5303888 5209734 4989332 4655477 4439015 4256765 4175420
13060 4175420 4055481 3850578 3616019 3395808 3186157 3120747 3171133 3111192 2930938 2724196
13050 2724196 2718980 2597508 2523859 2473758 2531146 2381335 2168146 2118836 2050683 1964362 1921862
13039 1921862 1986709 1915109 1877570 1812434 1815630 1847759 1827877 1713513 1648444 1529705 1560701
13028A560701P0091j76335j21524K0595M2507j23547p3118P1931n6153j10323
13018A104825l3956P8779K9128q4878r5044n9725j09374L7873K1731J17981P7795
13007A085135l5563m3130L5806l9994q7989j65725J16475J03580p0246j79062
12997G19287k0158R5639J19629l1300j26164o0846l1160m6830J5233K1760J14714
12986G69804k1614j47179o2255R2778J65701q7122j43921r2915K5206Q3203J30908
12975G12594J16756j14039n002l1834O78n7544r497o5740k4143o8672j985r9136
12963C52436J46201L4397k7163k0966n5854j15186j18994J8954P2115J34440J44922
12952E65302m2833j08583k17162l8507j3859J02290J01283j086M6626P6984k7569
$$ plain form
13028 1560701 1630792 1454457 1332933 1353528 1396035 1272488 1199370 1271301 1215148 1104825
13018 1104825 1070869 1149648 1178776 1093898 998854 939129 829755 867628 889359 1007340 1085135
13007 1085135 1049572 1006442 1042248 1002254 914265 748540 865015 968595 898349 719287
12997 719287 699129 794768 914397 883097 756933 696087 664927 618097 633330 655090 769804
12986 769804 748190 601011 538756 631534 797235 710113 566192 473277 498483 581686 712594
12975 712594 829350 715311 710309 678475 679153 621609 612112 546372 522229 453557 451572 352436
12963 352436 498637 533034 505871 484905 429051 313865 194871 213825 285940 420380 565302
12952 565302 522469 413886 196724 158217 144358 246648 347931 346845 393471 470455 442886
12941D42886k5286j7830j02140J05688O6484n1122j10024p1207j8331R0360J5676
12930C25154j7608o4190L4728J30623l7892O4910J3351p949j06661k7699O9454
12919C76221P7944k18211j09711J28006Q5298k6791j00320P4438K04013o0404
12909D30483j40588j6055O096j1578L5002O0388M6956n8735j01539j42148O4777
12898A73059m5583n6790m2765J4539r440J30875N2780j03512j63624k7150k5797
12887a03408P4669J37787J37829J47773K0537r1306o2190K4940J18134q1815k1573
12876C01377l627q8353l0252m064m1283m5101O1335m3626N113j1219k5812l9529
12864C4959J03782N1401J1110m8818M3089o0951r8347O5977N8955O3362m3635
$$ plain form
12941 442886 417600 399770 297630 403318 469802 418680 308656 237449 219118 309478 325154
12930 325154 307546 243356 278084 408707 370815 435725 449076 441127 334466 306767 376221
12919 376221 454165 235954 126243 254249 339547 312756 212436 286874 490887 430483
12909 430483 289895 273840 279936 268358 303360 363748 410704 351969 250430 108282 173059
12898 173059 127476 70686 27921 42460 33020 163895 216675 113163 -50461 -77611 -103408
12887 -103408 -28739 109048 246877 394650 415187 323881 261691 286631 404765 322950 301377
12876 301377 297750 209397 179145 175081 133798 88697 150032 106406 111519 100300 74488 34959
12864 34959 138741 190142 201252 152434 195523 134572 36225 102202 161157 224519 180884
12853A80884o5676J5160K6719J14952j9362N423K4396k6154j17067K0455m3623
12842A16107j01726R0867j1033l6564L7741K2711L4010K5551j00375o8817J322
12831I794L2062K8858R0890K5930p4668n78R435K6843O9015N9962k8872o9151
12819A79520o5324K9993N4124l2319l1200J37217n5611K4450j098j01244M4593
12808A83101J09653l0767P05L2831P3967q8410n3643M4515K7990j95278O4848
12797A69512J81412j12488l4833L1700K9578j00763m0434p6514N2383Q7115L9792
12786B26460j8238j4996J5678L3760N1580J5318P4610J4212m7851r0905q3911
12775A75717K9416J13106r6284j70486P2066M2927p3709r6311J21322J0632o4750
$$ plain form
12853 180884 115208 130368 157087 272039 252677 258100 282496 256342 139275 159730 116107
12842 116107 14381 105248 94215 57651 95392 118103 152113 177664 77289 8472 9794
12831 9794 41856 70714 161604 187534 112866 112288 121723 148566 217581 277543 248671 179520
12819 179520 114196 144189 198313 165994 134794 272011 216400 240850 239752 138508 183101
12808 183101 292754 261987 262692 295523 369490 281080 227437 271952 299942 104664 169512
12797 169512 350924 238436 203603 235303 264881 164118 123684 47170 99553 186668 226460
12786 226460 208222 193226 208904 242664 294244 309562 384172 398384 350533 259628 175717
12775 175717 205133 318239 221955 51469 123535 166462 92753 -3558 117764 128396 63646
12764F3646j35609j29345k1577N5173J53175P2704l6061K2769k7763O0501P7405
12753A55018L428m6067j9721J8062m942k0789j7666o4569K3946K4462m5124p6860
12741g0822Q7600N9271L4498m5966j5659L1540l5042l83k8399J31142K8625n869
12729A70536Q5699Q2135P4121K0969j92767j7210O1472m8148p3070n5044l2085
12718G6608M7250M2940l9898k5231K047M0880J89136J218n6215r615R0756o320
12706C53556j97910k7684n1524M2319j05820q2920k3751R6582J35738k8532O5481
12695A75535J33844P4225j16878j14639K0779N1900M0028j30547j1845M4669J15200
12684B82271p2924l4932j9535j8041o8256J05884R8793K6902K1127j8960K903
$$ plain form
12764 63646 -71963 -201308 -222885 -167712 -14537 58167 22106 44875 17112 77613 155018
12753 155018 158446 112379 92658 110720 105778 84989 67323 2754 26700 51162 6038 -70822
12741 -70822 16778 76049 110547 64581 48922 80462 45420 45037 16638 147780 176405 170536
12729 170536 256235 338370 412491 433460 240693 223483 284955 236807 163737 108693 76608
12718 76608 123858 166798 126900 101669 103716 144596 333732 334950 278735 269120 359876 353556
12706 353556 155646 127962 76438 118757 12937 -69983 -93734 2848 138586 110054 175535
12695 175535 309379 383604 266726 152087 172866 224766 264794 134247 122402 167071 282271
12684 282271 209347 174415 154880 136839 68583 174467 273260 300162 321289 302329 305232
12673C05232O4762O1157J9392M4792K5762O6528J27069N3589K2600J86503R0949
12662A068335O4958J28233J37610J12179N0099K15594k1840n9534p0325l667k0493
12651A601149r4066j00134k15252j65149k58537j76201k8078q3640j78150M5647
12641C47589J46491P0679k29916j15092P4364K3611Q7210N6531m6827j25497j2952
12630B76191j22824q2757m590K6910N2559o0610j3871J09654P7176j4104r4718
12619A49016m6333J6352n3851p1853N6120q3453p658R8008K0503j21129m6115
12608i0393J47434j5833n3795p5164L4111M4629L6002R3910R8615J7853L3417
12597B70786r881j66465k0486K2047J2527n603k4649Q1169J06220p0376m4930
$$ plain form
12673 305232 369994 431151 450543 495335 521097 587625 714694 768283 790883 977386 1068335
12662 1068335 1133293 1261526 1399136 1511315 1561414 1777008 1755168 1695634 1625309 1621642 1601149
12651 1601149 1507083 1406949 1191697 1026548 768011 591810 563732 480092 301942 347589
12641 347589 494080 564759 334843 219751 294115 317726 404936 461467 414640 289143 276191
12630 276191 153367 70610 66020 92930 145489 84879 71008 180662 257838 243734 149016
12619 149016 102683 119035 65184 -6669 49451 -34002 -41660 56348 76851 -44278 -90393
12608 -90393 57041 41208 -12587 -87751 -53640 -9011 26991 120901 219516 237369 270786
12597 270786 260905 94440 73954 96001 108528 102925 78276 159445 265665 195289 150359
12586A50359J33098m0586r2794r160n1182L4962Q5049m1202o5121o1198O4983
12575A07208P5720j11703k1533M4078O6401K4189o9517k5443L2629n3873P1524
12564A39680M7254l7245p2872o3422j1998N3707K5262j8034j9997K3500J1981
12553G7816M1584j589K0493L0314p6970N1120J28819l8844j3935p8407m0924j65617
12541f6140K6538J76851j5439r9104p1288J04569R1575l3155o2750K7082K4205
12530A02944R1829L9079k0693K9737j3584k6014m0746J8792k233o2638r0391m6065
12518a9983k8099L0145P838j14885K3203N9826J91806R1582L8878L5300j97825
12507A17786j4889l0084o0512P1166j4051J2522O036j7458n2341q0501N6181R4965
$$ plain form
12586 150359 283457 242871 150077 140917 89735 124697 209746 168544 103423 42225 107208
12575 107208 182928 71225 49692 93770 160171 184360 114843 89400 122029 68156 139680
12564 139680 186934 149689 76817 13395 1397 55104 80366 62332 42335 65835 77816
12553 77816 119400 117811 138304 168618 91648 142768 271587 232743 218808 140401 99477 -66140
12541 -66140 -39602 137249 121810 22706 -48582 55987 147562 114407 51657 78739 102944
12530 102944 194773 233852 213159 242896 229312 203298 162552 181344 179111 116473 26082 -19983
12518 -19983 -48082 -17937 -10099 -124984 -101781 -41955 149851 241433 280311 315611 117786
12507 117786 102897 72813 12301 83467 69416 81938 87974 70516 18175 -62326 -6145 88820
12495H8820K6016m2614m9795K5207P0806m2967L46J30732J5314j27325J3732J18902
12483B27174m5378m0104M1887j13654r8043K56N3010J34727n7806j65474l3912
12472i7317O3094N0408Q3916J2357K4343R5119P0878k0851o1369K9875M5661m305
12460B91809l8005N0492n2208m5794k0580Q425j3005o2217k8950j3822J06297
12449A82442O7150n9928q7399q8556K5675J30966o8493l8493l437K2395J641K8960
12437A12923q6399r0178r932j4721L1364K8754Q0353Q3230l1525l5560P3646N2338
12425A94293o0298j229R2977m7724p9255L9262k6276L9770r1395Q8708P51j7822
12413A31762q414P8355M3661j31584m4647j23163R695J70724J36173l9252q9953
$$ plain form
12495 88820 114836 72222 22427 47634 118440 75473 75819 206551 221865 94540 108272 227174
12483 227174 181796 141692 183579 69925 -28118 -27862 25148 159875 102069 -63405 -97317
12472 -97317 -34223 16185 100101 112458 136801 231920 302798 281947 220578 250453 296114 291809
12460 291809 253804 304296 252088 206294 185714 194139 181134 118917 89967 76145 182442
12449 182442 249592 189664 102265 13709 39384 170350 101857 63364 59927 82322 83963 112923
12437 112923 26524 -63654 -73586 -88307 -56943 -28189 52164 135394 103869 68309 141955 194293
12425 194293 133995 132766 225743 178019 98764 138026 111750 151520 60125 148833 149584 131762
12413 131762 123348 201703 245364 113780 69133 -54030 -44335 126389 262562 223310 133357
12402A33357O7565O2296n4297k9250n5666K3358M1640o1649K2857M4538Q400Q348
12390B11497o1780k1974Q1407r898k8230L6022L3688Q4509j06592p0663R2991
12379B40977J29116m5074j16912j18720o1920J28258o644m646q0035j46387R7216
12368A5229n1420N946R7867K5940n6360K2857K9455O8115J87676J6811j36721
12357B25395l0481q0034M332R2250L2135p1391m0747n346p7331o3546j2388J18243
12345I1091L1017p4849N772n4863M7484J04837J04201M4495M9770O5392k4556
12334C89791j19099q1850m6580M4356p5013o6900o1456N2288N3657P6721N4569
12323B20484J9407q7603n0248P9965M1232l3723n177K8564j25754n4335N5376
$$ plain form
12402 133357 200922 263218 208921 179671 124005 147363 189003 127354 150211 194749 203149 211497
12390 211497 149717 127743 209150 199252 171022 207044 240732 325241 218649 147986 240977
12379 240977 370093 325019 208107 89387 27467 155725 149081 144435 64400 -81987 15229
12368 15229 -36191 -30245 67622 93562 37202 60059 89514 157629 345305 362116 225395
12357 225395 194914 114880 119212 211462 243597 172206 131459 126113 48782 -14764 -27152 91091
12345 91091 122108 47259 53031 -1832 45652 150489 254690 299185 348955 414347 389791
12334 389791 270692 188842 142262 186618 111605 44705 -16751 35537 89194 165915 220484
12323 220484 239891 152288 102040 182005 223237 189514 184337 212901 87147 32812 88188
12312H8188P965l1346j895l6128L9802M400R9235O9676p8432N5075N8985K6510
12300C02035q1160j44730j43950k4157K9134N0423O2395O7958J7091o5192N479
12289G5326Q0182k6618o1587q620J3716L4039J45130l6498p4687j57042N0582
12278C3923P4187j3665K4272J05482l0134m3221o672k5433l3466O049M0723j01
12266A31944K5551L4817J41629j20231q4572L1378J39372J13699J17292N1137
12256E82016j52902j87271J2808M2174L583o8125M3710o3922M4832O6244p9428
12245B43719O3394j7504l2995j16960l2934L9654l7192r2927K1301J16802O4573
12234B18931O9872N8082O4598j28121j13133m8684r513r4786L3706J2496k6272
$$ plain form
12312 88188 96153 64807 62912 26784 66586 70986 170221 239897 161465 216540 275525 302035
12300 302035 220875 76145 -67805 -91962 -62828 -12405 49990 117948 135039 69847 75326
12289 75326 155508 128890 67303 58683 72399 106438 251568 215070 140383 -16659 33923
12278 33923 108110 94445 118717 224199 194065 150844 144172 118739 85273 91322 132045 131944
12266 131944 157495 192312 333941 213710 129138 160516 299888 413587 530879 582016
12256 582016 429114 241843 254651 296825 300408 232283 275993 212071 256903 323147 243719
12245 243719 307113 289609 256614 139654 106720 146374 109182 16255 37556 154358 218931
12234 218931 288803 346885 411483 283362 170229 121545 112032 17246 50952 63448 37176
12223C7176O1244R9735M8295j1565Q328J7146k9296j08803m1308L0790P2664O1263
12211B45669J5315K98l6991o4235l8229J04213O9952L6160O9380P3204l4268k813
12199D37655q848o7763R2147n3206l7744k9223o1067k1236N08j0703J1963R6827
12187C49310Q5451K8261r6444K0759L7751M0039o763l4714j09782j1300J9225
12176C21793O0903j07695j8606O9708K2188K3405k1030N743m3560r599K0215J01203
12164D24668K0890j01383n4003J0743N8976p4369p572K9141j2925n0369l2169
12153B11628l7220P7117N348O807O406Q3538K1633o3137r7954M965J02552J00300
12141D21983J30776j61618j10388k1665O6129R1280n8246k4244N3933n817R0020
$$ plain form
12223 37176 98420 198155 246450 234885 243213 260359 231063 122260 80952 111742 184406 245669
12211 245669 260984 261282 224291 160056 121827 226040 295992 332152 401532 474736 440468 437655
12199 437655 428807 361044 453191 399985 362241 333018 271951 250715 251223 240520 252483 349310
12187 349310 434761 463022 366578 387337 425088 465127 458364 423650 313868 302568 321793
12176 321793 382696 275001 256395 326103 348291 371696 350666 356409 312849 303250 323465 424668
12164 424668 445558 344175 290172 300915 359891 285522 277950 307091 294166 243797 211628
12153 211628 174408 251525 256873 263680 270086 353624 375257 312120 214166 219131 321683 421983
12141 421983 552759 391141 280753 259088 325217 416497 358251 334007 387940 382123 472143
12130D72143J9055m6990j2251M1025N0511L2711o6670l3135n2915R6388N1307
12119E51179m4610p7167J0920J26398K27512m2290j21015j549J38469M059j73023
12108E98883j70818J2547J03628J01384O5549J3254l8333J10209L2318J67772
12098I96393m5549j03669j24656m3123m9962j5242Q7625L0821M220j1843K0794
12087G45809M8639O235K6531J9316j04266P2594N384j39515O0229J30025P6734
12076I47715M019O7276R920K4710o0372m5485K1801O8600N1436O8325n8240p0712
12064A028993Q3854L0710J24089J08685j4349l3523j13184k1472O3003O0425O2017
12053A379248R0447J46688q7343q6267J00837n7265p0229j4725q4793j53949Q0364
$$ plain form
12130 472143 491198 444208 431957 472982 523493 556204 489534 456399 403484 499872 551179
12119 551179 506569 429402 440322 566720 794232 751942 630927 629378 767847 771906 598883
12108 598883 428065 440612 544240 645624 711173 724427 686094 796303 828621 996393
12098 996393 950844 847175 722519 679396 629434 614192 701817 732638 736858 725015 745809
12087 745809 794448 800683 827214 846530 742264 814858 820242 680727 740956 870981 947715
12076 947715 951734 1019010 1028930 1053640 993268 947783 969584 1038184 1089620 1157945 1099705 1028993
12064 1028993 1112847 1143557 1267646 1376331 1361982 1328459 1215275 1193803 1256806 1317231 1379248
12053 1379248 1469695 1616383 1529040 1442773 1543610 1486345 1416116 1401391 1316598 1162649 1243013
12042A243013j2898N152K24748M8422L1708P4772J3763l5132M2674m4402J15650
12031A707470K30203L6086p5904j10453Q1401J8122J105K9488l5914L790o1810
12020A823584J38618M8886J29083J37215L3733l239J00873O4130r130N7066J6337
12009B537156Q0843J7064J3110N6726J25713J11092P0090M1931R8107J68153O6270
11998C386255m5517M461J65150K33446M7845K57232K51719J00686J21450K68879
11988D791606K9879Q4424J91634J52941K24235J51075Q0429K15012L14749K29786
11978F465770K30095L11139L02089K60924K33797L97963N07682M74556M90707
11969I674722M60130M86077N04344N86636P31559P79884Q12005Q36071J074788
$$ plain form
12042 1243013 1230115 1235267 1460015 1508437 1540145 1614917 1628680 1593548 1636222 1591820 1707470
12031 1707470 1937673 1973759 1897855 1787402 1868803 1886925 1888030 1917518 1881604 1885394 1823584
12020 1823584 1962202 2011088 2140171 2277386 2311119 2307880 2408753 2472883 2463753 2520819 2537156
12009 2537156 2617999 2635063 2648173 2704899 2830612 2941704 3011794 3053725 3151832 3319985 3386255
11998 3386255 3340738 3345199 3510349 3743795 3791640 4048872 4300591 4401277 4522727 4791606
11988 4791606 4821485 4905909 5097543 5250484 5474719 5625794 5706223 5921235 6235984 6465770
11978 6465770 6695865 7007004 7309093 7570017 7803814 8201777 8709459 9184015 9674722
11969 9674722 10134852 10620929 11125273 11711909 12443468 13223352 14035357 14871428 15946216
11960A5946216J188086J092603J093512J233259J512456J664018J888451K058163
11952B7676764K212196K554569K792109L205733L685664M306443M773910N171352
11944E6378740N833185O516076P162010Q183755Q897219R731183J0195639J0488555
11936A23386362J0389948R380980P842795N604817K823379j7463k992303n704774
11928A50713741p842219r261544r995447j0147305r869548r502236q853444p999683
11920G7242315p236828o462869n783867n114711m649090m126015l652916l265804
11912C6950215k871391k529834k322526k187660k031776j671218j473986j275333
11904B0586491j279127j291464j105414j080636q26402p13536q55293p61007n69470
$$ plain form
11960 15946216 17134302 18226905 19320417 20553676 22066132 23730150 25618601 27676764
11952 27676764 29888960 32443529 35235638 38441371 42127035 46433478 51207388 56378740
11944 56378740 62211925 68728001 75890011 84073766 92970985 102702168 112897807 123386362
11936 123386362 133776310 143157290 151000085 156604902 159428281 159410818 156418515 150713741
11928 150713741 142871522 133609978 123614531 113467226 103597678 94095442 85241998 77242315
11920 77242315 70005487 63542618 57758751 52644040 47994950 43868935 40216019 36950215
11912 36950215 34078824 31548990 29226464 27038804 25007028 23335810 21861824 20586491
11904 20586491 19307364 18015900 16910486 15829850 15003448 14289912 13434619 12673612 12104142
11895A2104142n86593o95050n94316m49464l78281l29436l76725m17387l66081
11886G910809j91916k46582k84186l57873k91934k92275k71651k76347k14572
11877E483473k40756k62453k44697k9977j73592j60269k27541k33646j03580j59171
11867C647791j23078o7094J049j6081m6876r1527k02543n3548l8983m1450j07867
11856B859793o4575L2477j54089j00616m5974o2630K7282O9983m5435k50839j17097
11845B148280j01653j8217m2436j01900o5526n3152j3552P6361l1387l2195m2811
11834A721812p7242j35641p4412m3080j895n8374P0m9034J6724k7501K1232J21802
11822A414461O0694J679j39012m4569p7660J1929M7960n3377j46101l1356M1846
$$ plain form
11895 12104142 11517549 10822499 10228183 9778719 9400438 9071002 8694277 8276890 7910809
11886 7910809 7718893 7472311 7188125 6830252 6538318 6246043 5974392 5698045 5483473
11877 5483473 5242717 4980264 4735567 4705590 4531998 4371729 4144188 3910542 3806962 3647791
11867 3647791 3524713 3457619 3458668 3442587 3395711 3304184 3101641 3048093 3009110 2967660 2859793
11856 2859793 2795218 2827695 2673606 2572990 2527016 2464386 2491668 2561651 2516216 2265377 2148280
11845 2148280 2046627 2028410 1985974 1884074 1818548 1765396 1751844 1828205 1796818 1764623 1721812
11834 1721812 1644570 1508929 1434517 1391437 1389542 1331168 1331238 1282204 1298928 1271427 1292659 1414461
11822 1414461 1475155 1476834 1337822 1293253 1215593 1227522 1275482 1222105 1076004 1044648 1086494
11811A086494Q657j37047j2189M147j9553j8310J26261Q5731j29107j92360M413
11800H07137R0949j6273q7887m7456J4830L5097k2531n8313O6650q135l0697J51609
11788H94980J08711n848n5776o0067p2064n4232r765j5590k4786o871k3587P6496
11776G51601L0392O9510Q6277j71373j26976j2542L3035k621j01688r1216L3384
11765D97783J11272m7994j38513o292N7332M6592O653P8390p370l9024j3364O2333
11753F07798o121l7821l7165k1540m373P7567r6759j22066M5669J14696j4038
11742E05847j10105m7654q8680k2070J67477P2719n5956N7353L1784o677J03285
11731F07323M679l1583r4635j00364l7699p295l6983L5730Q8151J0941n9709q7928
$$ plain form
11811 1086494 1095151 958104 945915 950062 930509 912199 1038460 1124191 995084 802724 807137
11800 807137 898086 881813 793926 746470 761300 796397 773866 715553 782203 774068 743371 894980
11788 894980 1003691 997843 942067 882000 809936 755704 745939 730349 705563 698692 675105 751601
11776 751601 781993 851503 937780 766407 639431 626889 659924 657303 555615 464399 497783
11765 497783 609055 561061 422548 416256 473588 520180 526833 605223 597853 558829 545465 607798
11753 607798 601677 563856 526691 505151 500778 578345 481586 359520 405189 519885 505847
11742 505847 395742 348088 259408 237338 404815 477534 421578 478931 510715 504038 607323
11731 607323 612002 580419 485784 385420 347721 340426 303443 339173 427324 438265 378556 290628
11719B90628K8033N9320L063N7639o7454j2681P1182R319J7517J10878l7051j15031
11707D15362j40220k4852M3787o752L27M1605j22025o5911o3730J3117J5376J22453
11695B28537k0941q6998J85684J925j54958J3575j4651l5678Q3784l0931p4311
11684I5037m476J44855J62419m0555p4135q8210n9536K5988J29680K8273j00414
11673B18926R5494Q6208n8187K6320p6000P7465K8278q2278p5753j13253j48M9311
11661A76383J01946R2127j2604j05393j21838J0599P9182n7573j09910K4778J6964
11650I4661L1397Q8304J21091R8439m0151j64147K1972J28218l9223m1083r4446
11639B05032p4549L8982K0797N9474l2949j07738M591q354P1584P4147r8177j4002
$$ plain form
11719 290628 318661 377981 381044 438683 371229 358548 429730 439049 456566 567444 530393 415362
11707 415362 275142 250290 294077 287325 287652 329257 207232 141321 77591 90708 106084 228537
11695 228537 207596 120598 306282 308207 153249 166824 152173 116495 200279 169348 95037
11684 95037 90561 235416 397835 357280 283145 194935 135399 161387 291067 319340 218926
11673 218926 314420 400628 342441 368761 292761 370226 398504 316226 240473 127220 127072 176383
11661 176383 278329 370456 357852 252459 130621 141220 220402 162829 52919 77697 94661
11650 94661 126058 214362 335453 433892 393741 229594 251566 379784 340561 299478 205032
11639 205032 130483 169465 190262 249736 216787 109049 113640 105286 176870 251017 152840 138838
11627A38838J44171O7784j08673k13416j8768J18653J17397R8205J16j7620J00809
11616D27496n0939L7625m2176j37485j48757N553K07364M4538o5547K6404j18256
11605A85820p1495J39401j0968k9169N0220k6966j28732j16548P4560R847n2343
11594B3627j3147K4810N2286N339O5968Q0604K9489j4176p7349Q145M9536Q507
11582B43639K3010p8769J5612R9907n76j02592j40775k2751K053j24000l2811
11571a18053K0145J48309R2709m5304M574j5139L0911j06767j48675k3373J15126
11560d5537J05701O6825K06285K3102j44559j86559m6166J18243J9646n9999j47603
11549i0621M3223J10888R6124k6694n9976j3440n530P5165J1071m6068j40830
$$ plain form
11627 138838 283009 350793 242120 28704 9936 128589 245986 344191 344307 326687 427496
11616 427496 376557 414182 372006 234521 85764 91317 298681 343219 277672 304076 185820
11605 185820 114325 253726 242758 213589 263809 236843 108111 -8437 66123 75970 23627
11594 23627 10480 35290 87576 92915 158883 239487 268976 254800 177451 185596 235132 243639
11582 243639 266649 187880 203492 303399 302823 200231 59456 36705 38758 -85242 -118053
11571 -118053 -97908 50401 143110 97806 102380 87241 118152 11385 -137290 -160663 -45537
11560 -45537 60164 126989 333274 356376 211817 25258 -20908 97335 116981 56982 -90621
11549 -90621 -47398 63490 159614 132920 72944 59504 53974 129139 140210 94142 -46688
11538d6688l073J0469J32211q478o7572j0037j3311L3574j9267K2902L1561J18636
11526A80927K5609q2810m7148Q5900J03127j51369o4923j7707j25161K3237l6943
11515a07261M0559J02467j65164J11726J12597J1821M651N2668J07306k9746K2900
11504B64524k2909k21598j05770O1614O8382M3527Q1710m4832n8809R0868k3815
11493A32892k4396j12495n3912R5033J55282L8907J6640j12236j03997j69341
11483a37623K4794Q4720J57863J24101J624L0499J12762j32729j67404K6945m2307
11472H3245j6686J42147M6250j8995P959J5419m8189M4661R654p1294p5173j06034
11460A2964L6062K6714O6250N6558N5644R51j5900k9352o2643q1284j688M590
$$ plain form
11538 -46688 -49761 -39292 92919 84441 16869 6832 -6479 27095 7828 30730 62291 180927
11526 180927 206536 123726 76578 162478 265605 114236 49313 31606 -93555 -70318 -107261
11515 -107261 -66702 35765 -129399 -17673 94924 106745 111396 164064 271370 241624 264524
11504 264524 241615 20017 -85753 -24139 44243 87770 169480 124648 65839 156707 132892
11493 132892 108496 -3999 -57911 37122 192404 231311 247951 135715 31718 -137623
11483 -137623 -112829 -28109 129754 253855 255479 285978 398740 266011 98607 125552 83245
11472 83245 66559 208706 254956 235961 243920 259339 211150 255811 265465 194171 118998 12964
11460 12964 49026 75740 141990 198548 254192 255143 239243 209891 147248 65964 64276 68866
11448F8866k4396L6517p0450K2634n643o5469M318L3402R7939m8012p4917N6407
11436C1196m3994j4878L7178k4794L6916K4089j37199J8613P1244O3972M1587
11425A03930J5760J249j2250k2261l1139K9907k7982n3586P6237O4831L4437j8707
11413A60426L5469J00212j21497n6651J06621o588l8485l9430k1742J00153O3660
11402B82148n4378j36304j61672L5452Q9283p5139m5217j5709O2872J34505m3384
11391G2457j10062N9614N8117k9941k8332J39299R5767q945j24817l5902p2218
11380A5037L4435P6836J09478k8888m081j7374m4249j16055m0359O7744J7138
11369F9662m4939L0533L0513j9790j32604l5434n157O2671J18068J8032l2996
$$ plain form
11448 68866 44470 80987 10537 33171 27528 -37941 -33623 -221 97718 49706 -25211 31196
11436 31196 -12798 -27676 9502 -15292 21624 45713 -91486 -72873 -1629 62343 103930
11425 103930 119690 120939 108689 86428 55289 85196 57214 3628 79865 144696 179133 160426
11413 160426 195895 296107 174610 117959 224580 217992 179507 140077 118335 218488 282148
11402 282148 227770 91466 -70206 -34754 54529 -20610 -65827 -81536 -18664 115841 72457
11391 72457 -37605 22009 80126 50185 21853 161152 256919 247974 123157 87255 15037
11380 15037 49472 126308 235786 206898 202817 185443 141194 25139 -15220 52524 69662
11369 69662 24723 55256 85769 65979 -66625 -102059 -107216 -44545 73523 91555 58559
11358E8559j3762N419L7954P6831R9566L0158L1496J5455j0278o8046k3445j01285
11346A38622j41327n3088j1113n9384R2261J45772J28020J6993p6734p5981j10122
11335f081K130O5011Q1913J3944r618q4164j86297O5297J65024j1449r535N1318
11323A37493r3001N342J55784l957k28978j6069m2078j10027J1737N9416J06865
11312a7473o9071n5833K0010J00503o9653N7700L7398Q163J794k773Q8171k4451
11300G4485k7483J33448M268o9052J1595m2109o2873o9754q3011K9059J28866
11289B7439l281q5088q0102O1352o282l9465l2891L4213Q9012J5072p2063R9508
11277G424L0057l6537M368O3210K5480l4096O8633l5354L5946J10460m6317r1485
$$ plain form
11358 58559 44797 50216 88170 165001 264567 294725 326221 341676 331398 263352 239907 138622
11346 138622 -2705 -55793 -66906 -126290 -34029 111743 239763 256756 180022 104041 -6081
11335 -6081 -3951 61060 142973 156917 147299 63135 -123162 -57865 107159 95710 86175 137493
11323 137493 44492 49834 205618 201661 -27317 -43386 -85464 -195491 -183754 -124338 -17473
11312 -17473 -86544 -142377 -122367 -21864 -91517 -33817 3581 11744 13538 10765 98936 74485
11300 74485 47002 180450 184718 115666 127261 85152 22279 -47475 -130486 -101427 27439
11289 27439 24158 -60930 -141032 -79680 -85962 -125427 -158318 -124105 -35093 -20021 -92084 7424
11277 7424 37481 944 5312 68522 94002 59906 128539 93185 129131 239591 193274 101789
11265A01789L6224k6791r0696J4228J03687J2664j7479o7455l3587p8846n0835
11254i7097r934j658L7601K957j25715M3278P6721L2719N3423r1984j5311O1554
11242c3446O0722N4779N7875l9141Q5027J03159n5602m4350J9559m6165O4155
11231B26572Q6271j2072j15129n4161L7137k2678L0364P2463l7418j96168r7617
11220h2436M4246M5417j46320j05107R978J58340Q0429O6765L8297J04653K0667
11209B34929n9393p819j02114k681k126M2254m2248Q5918k7065p7771l4267k990
11197D627j21141j31068q7162J01044N4813P6457M3146m0210m2359J6608Q6335
11186c8910N3038P7640J63530R3434p9455q1608k0958o9171p6353K7443L6534
$$ plain form
11265 101789 138013 111222 20526 34754 138441 151105 133626 66171 32584 -46262 -97097
11254 -97097 -107031 -108689 -71088 -68131 -193846 -150568 -73847 -41128 12295 -79689 -95000 -33446
11242 -33446 27276 82055 139930 100789 185816 288975 233373 189023 208582 162417 226572
11231 226572 312843 300771 185642 131481 168618 145940 176304 248767 211349 15181 -82436
11220 -82436 -38190 7227 -139093 -244200 -234222 -75882 4547 71312 109609 214262 234929
11209 234929 175536 167717 65603 62922 60796 103050 60802 146720 119655 41884 7617 4627
11197 4627 -116514 -247582 -334744 -233700 -178887 -102430 -59284 -99494 -141853 -125245 -38910
11186 -38910 14128 91768 255298 348732 269277 187669 166711 97540 21187 48630 85164
11175H5164n4205O819K3227M907R1343M2069r1747j35962J0935J6170J38622J4899
11163A52241J4210L5193j6249K3360R9075q2930j39974p7302o579m5500R6032
11152E1577L2396k9149R1830P6721K0491j10713j22121q0276L44J45690P7405
11141A54195p2653m0224L7618o1184j8529k6532O0233M8252K2997q1015N8510
11130H1668J323P7674q9309J3940r1796j78444L2700O7153J1522K3605L0998O7455
11118D8489Q2641j5370o7353q310k6334m577P6096m7608m6651j14705p0993O1844
11106a32831N5774P6882J8223K2835L8235m3493j07176j08057o2441O1600P8902
11095a01547J27643L4657j32831q3653p8061L2978J75836P4603q3777j8762L878
$$ plain form
11175 85164 30959 37778 61005 65912 157255 199324 107577 -28385 -17450 -1280 137342 152241
11163 152241 166451 201644 185395 208755 307830 224900 84926 7624 1045 -44455 51577
11152 51577 83973 54824 146654 223375 243866 133153 11032 -69244 -68900 76790 154195
11141 154195 81542 41318 78936 17752 -777 -27309 32924 81176 104173 23158 81668
11130 81668 82991 160665 71356 85296 -6500 -184944 -152244 -85091 -73569 -49964 -18966 48489
11118 48489 131130 115760 48407 40097 13763 9186 85282 37674 -8977 -123682 -194675 -132831
11106 -132831 -77057 -175 18048 40883 79118 35625 -71551 -179608 -242049 -180449 -101547
11095 -101547 26096 60753 -72078 -155731 -233792 -200814 -24978 49625 -34152 -52914 -49036
11084d9036R4903K4049P4820Q1714q5753j32595p4944J17117O5468j1177k3423
11073H1143O0843O101j08821m214R1188o6552R284J1190m5743j198n2476M0302
11061B1047O3611r9144o7028K5972M5947P5864Q9437O5050K6122p9141j34907
11050C2830L7681K0404N1876J26110Q5567M1911M819j8117R623R5864K0689J8952
11038E28209j37472j2601Q3896k1144J30175Q1004N4044N6418p8122k6831j70873
11027D86703q0621M7970n6458J47030K01973k6700j4839J34529m6022r1898q6062
11016F15605K6865j78979j34706Q8558J1302J9955O3835J28256Q0948j11699j73689
11005D36251o8230m6743r3847p2239q0083J26164L1768M4652J8596j8761Q1465
$$ plain form
11084 -49036 45867 69916 144736 226450 140697 8102 -66842 50275 115743 104566 81143
11073 81143 141986 148087 39266 35052 126240 59688 68972 80162 34419 33221 -19255 21047
11061 21047 84658 -14486 -81514 -55542 -9595 66269 155706 220756 246878 167737 32830
11050 32830 70511 90915 142791 268901 354468 396379 401198 383081 392704 488568 509257 528209
11038 528209 390737 378136 462032 440888 571063 652067 706111 762529 684407 657576 486703
11027 486703 406082 454052 397594 544624 746597 719897 705058 839587 793565 701667 615605
11016 615605 642470 463491 328785 417343 428645 448600 512435 640691 721639 609940 436251
11005 436251 368021 321278 227431 155192 75109 201273 233041 277693 296289 277528 358993
10994C58993p2784p0776k6317k709n6710q6306p7311J4422p3287O0004R676j7068
10982d0173M6128j06330j35150m8330J10880J80840J00424P793r4357p6078J16208
10971F1855P8913j9947m8890l7953j38515q6914L962q6526J8212O0385M5946j2398
10959a61870k5015m4778M8096Q776J04337J04560O6703j14332p3300l7803R7260
10948b7366N5787r209j55673J2171L0095O8429O0330P057L5534O2164K945r9574
10936D2690Q5654J6107j08492j62459N2939J20900K9934n2360m270l1676J7460
10925F427n2796J9593J27947k0638j3562J7072m215l2721l4358M7741j32943m0157
10913a12610k4731l8998n11R8169P7738M2428l3389l6135J72537K3903j15827
$$ plain form
10994 358993 286209 215433 189116 186407 129697 43391 -33920 -19498 -92785 -32781 -23105 -40173
10982 -40173 5955 -100375 -235525 -283855 -172975 7865 108289 116082 21725 -54353 61855
10971 61855 140768 120821 71931 33978 -104537 -191451 -187489 -274015 -255803 -195418 -149472 -161870
10959 -161870 -186885 -231663 -183567 -174791 -70454 34106 100809 -13523 -86823 -124626 -27366
10948 -27366 28421 19212 -136461 -124290 -94195 -25766 34564 41621 77155 139319 142264 42690
10936 42690 128344 144451 35959 -126500 -73561 47339 77273 24913 20643 -11033 6427
10925 6427 -46369 -26776 101171 80533 66971 84043 79828 47107 12749 60490 -72453 -112610
10913 -112610 -137341 -176339 -176850 -78681 -943 41485 8096 -28039 144498 168401 52574
10902E2574l8381K2727J66772O8886m3831N9803j65856j13067q3739L2354O215
10891c5543K7528l75J32939k9235j00372K421k7278K8066J43318J7569J72m6076
10879A13134k3562N3830k7017j39198p7305K3330l7349M2643L7829k7078p7973
10868a38716k8808L0957J4994K636K4027M8461N6611M9788K9178O8282Q5973k6850
10856B16533j37120l1285J1671K9528M5014q9418j683O4876q70K2022n6990n2974
10844A9304o5050K8560J00600j4153n1324J9351R5708L3064J7934L0815J5412
10833B30221p3367p6212j3116K5206o7598L0934o5992p9287O2435N6577k9161
10822F40L9754L4815k6743j7791N6027K9055N3954N5160m8692q7479j00737j4070
$$ plain form
10902 52574 14193 36920 203692 272578 228747 288550 122694 9627 -74112 -41758 -35543
10891 -35543 -8015 -8390 124549 95314 -5058 -2637 -29915 -1849 141469 159038 159210 113134
10879 113134 89572 143402 116385 -22813 -100118 -76788 -114137 -71494 -33665 -60743 -138716
10868 -138716 -167524 -136567 -121573 -118937 -94910 -46449 10162 59950 89128 157410 243383 216533
10856 216533 79413 48128 59799 89327 134341 44923 43240 108116 107246 129268 72278 19304
10844 19304 -45746 -17186 83414 69261 17937 37288 132996 166060 183994 214809 230221
10833 230221 156854 80642 67526 92732 25134 56068 -9924 -89211 -26776 29801 640
10822 640 40394 75209 48466 30675 86702 115757 169711 224871 176179 88700 -12037 -26107
10810b6107q8247N6505n911K717K7196J5474m4254q862n5218Q923O4051P5442
10798B1709r215j6248n6431o278J51202K6924j59934r2238j0865P6375J30776
10787E5777P3128m8283j3897J5335p2119J0527M8737J06221l2491n1536j35204
10776d3805o6559J04475l4618J7593O4744j25724k2966P2731O8173L6444K4630
10765I5118o7919L5878n9880J8988o541r4586k7312J04602J31594J01493o4563
10754A66872o1570o7265j04803J366R385J41591L0126j90030n1347M2441K0950
10743f2284J2845l1903k4946N8721Q5133R6060J06382j30466q8716P4104J28637
10732B23567r299l0006M6342M9802q068n4954l8064Q5443j6150p6482j51324k9196
$$ plain form
10810 -26107 -114354 -57849 -63760 -61043 -33847 -18373 -62627 -71489 -126707 -117784 -53733 21709
10798 21709 12494 -3754 -60185 -66463 84739 111663 -48271 -140509 -151374 -74999 55777
10787 55777 128905 80622 66725 82060 9941 20468 69205 175426 142935 91399 -43805
10776 -43805 -110364 -5889 -40507 -22914 41830 -83894 -106860 -34129 34044 70488 95118
10765 95118 27199 63077 3197 22185 15644 -78942 -106254 -1652 129942 231435 166872
10754 166872 105302 38037 -66766 -65400 -56015 85576 115702 -74328 -125675 -83234 -62284
10743 -62284 -49439 -81342 -106288 -47567 37566 133626 240008 109542 20826 94930 223567
10732 223567 214268 184262 230604 280406 272338 217384 179320 264763 248613 172131 20807 -8389
10720h389n0483J96906R8180L8625l5305J6783J188j15087j01563j5281N2563
10709G8137m2245P4638n8918K0630P4223P575P2816k3518p1854Q1726K7750j51604
10697H9356o43N8002l528L3353N3815j5621o6834O1439p3777N408O6847K767L9656
10684B50240R1260q8983j69148j09966j1280J95321R0746K8419n794k8055J8080
10673B60840N035N781r1580k9028Q9091j55274P5915J45653l3833m1917L6487
10662B67170N7436R5308N2479r0174p9565q1449J54957N9479j3146K1673P2131
10651E16299M2532P469j8791P7788Q0126P2871J16744O1944q861o2486L9801Q5318
10639A010754l8224Q1167Q5398M3879J37179J30318J23499L50168M03133J75291
$$ plain form
10720 -8389 -58872 138034 236214 274839 239534 256317 257505 142418 40855 25574 78137
10709 78137 35892 110530 51612 72242 146465 154040 226856 203338 131484 213210 240960 89356
10697 89356 88713 146715 143187 176540 230355 214734 147900 209339 135562 140970 207817 210584 250240
10684 250240 341500 252517 83369 -26597 -37877 157444 248190 276609 270815 242760 260840
10673 260840 265875 271656 180076 151048 240139 84865 160780 306433 272600 230683 267170
10662 267170 324606 419914 472393 382219 302654 221205 376162 435641 422495 444168 516299
10651 516299 558831 566300 547509 625297 705423 778294 895038 956982 948121 885635 925436 1010754
10639 1010754 972530 1053697 1139095 1182974 1320153 1450471 1573970 1924138 2327271 2502562
10629B502562J87451K46522K85600M06594O35047P49585R32623J295076J819727
10620I060787K634125L496089M918386O636785Q112614Q436353O333707K424240
10612E2053086j361035l193299k993731j282907J152313M288665Q169556J2705300
10604F9537948J6845448J7450315J1427061O25138q441753j1821692j0147397
10597H5475068n884182r24602M489460J0618443J6973324K1800969K1130365J0691941
10589A64370786n493993j7740485k1495865j8414894j2786323o902388j247842
10582H0288996M015229Q919029J2013062J0615254K753579p966355j5340259j6909612
10574G8388923j4079062r768088n832294k452175K58118K543664L538559K296604
$$ plain form
10629 2502562 2690013 2936535 3222135 3628729 4263776 5013361 5945984 7241060 9060787
10620 9060787 11694912 15191001 20109387 26746172 34858786 43295139 49628846 52053086
10612 52053086 50692051 47498752 44505021 43222114 44374427 48663092 56832648 69537948
10604 69537948 86383396 103833711 115260772 115885910 107444157 95622465 85475068
10597 85475068 79590886 78666284 83155744 93774187 110747511 132548480 153678845 164370786
10589 164370786 158876793 141136308 119640443 101225549 88439226 81536838 80288996
10582 80288996 84304225 93223254 105236316 115851570 118605149 110638794 95298535 78388923
10574 78388923 64309861 54541773 48709479 46257304 46515422 49059086 52597645 54894249
10566E4894249j236806n371811q037385q223533p043695n527225m244835k982174
10558A2226785k020452j507042j217737j089293q68553o32924n68295l59364l03841
10549C659284l70478l72066k10155k14486j89188j71772k70856j73383n5674o630
10539A624596j02672j04245j83658j40685r4267M8083p7070o7400M7577r3053
10529H57206l8092j4340n2288l6931j05308j56925R3896J6951n0336J58223j4975
10518F57081j31834M2810r9387j88417m8K5844P2702l0762q2349m975j1151J27309
10506C76823J12201M8935O4333m3414l1433J6623m7749q4419j19440n1128O7989
10495C09321N461k2483O0838p1269n6303R3122k7874r192q2843p0547K0603J18999
$$ plain form
10566 54894249 53657443 48285632 40248247 32024714 24981019 19453794 15208959 12226785
10558 12226785 10206333 8699291 7481554 6392261 5523708 4890784 4322489 3963125 3659284
10549 3659284 3288806 2916740 2706585 2492099 2302911 2131139 1860283 1686900 1631226 1624596
10539 1624596 1521924 1417679 1234021 1093336 999069 1047152 970082 902682 950259 857206
10529 857206 819114 804774 752486 715555 610247 453322 547218 564169 513833 672056 657081
10518 657081 525247 568057 468670 280253 280205 306049 378751 347989 265640 260665 249514 376823
10506 376823 489024 537959 602292 558878 527445 544068 496319 411900 292460 241332 309321
10495 309321 314782 292299 353137 281868 225565 318687 290813 281621 198778 128231 148834 267833
10483B67833Q6501L3040O0066l8096r5806J0590j0942k388l9843m0727m8494L0458
10471B12192J22121J1705p3431j2925j10424n1758l5570j02714L1766J08108N2176
10460A51246J864r5992l8188R1428j7090j46271j7687R7139m1065J1737R0004
10449H7125n253N2331O1005J2799J1011K3930p6107k4520L2731N5885O1748j06722
10437A85963k3663p9207q963R1134N0934j9860N7795n8691r0224j34257Q4290
10426E5251j6093N0991J22890j37697n5440Q4780J0683L3212k1459Q6801J43711
10415C57630M8986j61785j68821L7764L7564r9546j01619r5930k5486j3012L6656
10404a47599k9413M0133J4528K3189Q0768r519L9663l9738k5638N6614J57569
$$ plain form
10483 267833 354334 387374 447440 409344 313538 324128 313186 310798 270955 230228 181734 212192
10471 212192 334313 346018 272587 259662 149238 97480 61910 -40804 -9038 99070 151246
10460 151246 153110 57118 18930 110358 93268 -53003 -70690 26449 -14616 -2879 87125
10449 87125 81872 134203 195208 208007 219018 242948 166841 142321 175052 230937 292685 185963
10437 185963 162300 83093 74130 165264 216198 196338 254133 195442 105218 -29039 55251
10426 55251 39158 90149 213039 75342 19902 104682 115365 148577 127118 213919 357630
10415 357630 406616 244831 76010 113774 151338 51792 -49827 -145757 -171243 -184255 -147599
10404 -147599 -177012 -136879 -122351 -99162 -18394 -27913 11750 -27988 -53626 2988 160557
10393A60557R6133q7970m1846l1354n0615p1915m2715R1460m10l0386J8497K3118
10381C2554L6696j80348j08907M1592k0093J00973R7821O2254N1056L2369K7261
10370A73228q2162j68299m9104q2711J16675P9278R3007L1573m5613j03689K6260
10359a1557o3833J23262L8078k0293k3409K0189j08767j3302M7300K4260l4269
10348b2341j05218m4542N7201O6943k8503O7520N9903J1418O1258K6150k3399
10337A26390K9383p3777n916O2123k5845l2078J11255R722j83184j11812j31487
10326b25226j775J39391J09760J09353l9894N2678N1086j5168o5890o6095j33971
10315h5751p6888k3799J37329J28804l0285j46148j30759j2688M1318n2210k0079
$$ plain form
10393 160557 256690 168720 126874 95520 44905 -27010 -69725 21735 21325 -9061 9436 32554
10381 32554 69250 -111098 -220005 -178413 -198506 -97533 288 62542 113598 145967 173228
10370 173228 91066 -77233 -126337 -209048 -92373 -13095 79912 111485 65872 -37817 -11557
10359 -11557 -75390 47872 85950 65657 42248 62437 -46330 -59632 -12332 11928 -22341
10348 -22341 -127559 -172101 -114900 -47957 -76460 -8940 50963 62381 123639 149789 126390
10337 126390 155773 81996 76080 138203 112358 80280 191535 201257 18073 -93739 -225226
10326 -225226 -227001 -87610 22150 131503 91609 144287 195373 180205 114315 48220 -85751
10315 -85751 -162639 -186438 -49109 79695 49410 -96738 -227497 -240185 -198867 -251077 -271156
10304b71156l9787J18752J01402L0716J07377J36907O4099j30632m4001o3048
10294A0629k630m8202o2978J15063O5861j04108N7698J04279l5580J16428J14790
10283C31250j44821j19531m8063l2076P7375J32337L0123j72578q7798M3379N6907
10272F6504L962K277n0767N04l8193N8451L7609k7422P205Q14j6060j42291q50
10259i8257J08016m2526q9412j54699J58355J15154J05245j09495j5158o8337
10249i1114K8534L6549M4702N213k9783m8004M095L662j3679N4701N0097Q0310
10237A25283j5366p3915R2473l199j29789j6499K28032j3477o8498m7451k28p2993
10225D373p2956o3674l331J24881O3762J10725K7374o148j0479M5339j16795j30978
$$ plain form
10304 -271156 -310943 -192191 -90789 -60073 47304 184211 248310 117678 73677 10629
10294 10629 7999 -40203 -103181 11882 77743 -26365 31333 135612 100032 216460 331250
10283 331250 186429 66898 18835 -13241 64134 196471 226594 54016 -33782 9597 66504
10272 66504 70466 72743 21976 22480 -15713 42738 80347 52925 60130 60944 44884 -97407 -98257
10259 -98257 9759 -32767 -122179 -276878 -118523 -3369 101876 -7619 -22777 -91114
10249 -91114 -62580 -26031 18671 23884 -5899 -53903 -49808 -46146 -59825 -5124 44973 125283
10237 125283 109917 36002 128475 125276 -4513 -21012 207020 193543 125045 77594 77366 4373
10225 4373 -68583 -132257 -135588 -10707 53055 163780 191154 185006 174527 219866 103071 -27907
10213b7907P414J26616k4286k2701j3414j1885N6777k5264m5147j25787m2689
10202a48273l2102m1454J24844J47002O0821l4841O803O8073M9148j09810j06099
10191a5888l3897P593L095R787K1462L2667j06327j77688l59J06786J58462J43761
10179A49454M7909n2376j0201P5777L9074n424o3198n5247R9396J34211J0088
10168C69463J1869K0818P4408J13388J03927j00269q9553o5413O9691N1683M4038
10157F04050N5178J56446J24546J61773J0267j73068k03544j18436k0209j2870
10147E84133J6607n1597r1381Q9659J59195L5683o9293j54013j14837j00952J284
10136C04488J26698L8026j32472o6002j63623l9023J09978M6593O6342K8512j09150
$$ plain form
10213 -27907 -20493 106123 81837 59136 45722 33837 90614 65350 20203 -105584 -148273
10202 -148273 -180375 -221829 -96985 50017 110838 75997 82800 150873 200021 90211 -15888
10191 -15888 -49785 -42192 -39097 -29310 -7848 24819 -81508 -259196 -259555 -152769 5693 149454
10179 149454 197363 144987 134786 210563 249637 244213 181015 125768 225164 359375 369463
10168 369463 381332 402150 476558 589946 693873 593604 504051 438638 508329 560012 604050
10157 604050 659228 815674 940220 1101993 1112260 939192 735648 617212 597003 584133
10147 584133 600740 549143 457762 547421 706616 742299 673006 518993 404156 303204 304488
10136 304488 431186 469212 336740 270738 107115 68092 178070 224663 291005 319517 210367
10125B10367r9654l1999n3379m0037k2587r019k7741n9512R7663N6096P5921J28495
10113B24614j35098n3710l0604j5366k6481Q6008P8928J2423q862q8582n4745
10102a1475r224m0001J3593k1360J47298N5180j06428j17059o8886L3292J2935
10091a12135l2642k5049N1418J40575O7342o801j7592J4975l7746j58031j2095
10080a27781n2837n3451O4896R4870J24469J30606p3560j04477K0017M7336J7972
10069H8060K873L1384j2971j24299m7555l1288J8091J36127p840m4728j3382J6747
10057A1219K4049l8486k7701o4088Q2868R147j66377j30877j4282J56670J04427
10046e3431O5182N415N2561l7857j29582r3300N2198N1916M0680n9240l3435Q633
$$ plain form
10125 210367 110713 78714 25335 -14702 -37289 -46308 -74049 -133561 -35898 20198 96119 224614
10113 224614 89516 35806 5202 -10164 -36645 49363 128291 140714 131852 43270 -11475
10102 -11475 -20699 -60700 -47107 -68467 78831 134011 27583 -89476 -158362 -125070 -112135
10091 -112135 -144777 -169826 -118408 22167 89509 82708 65116 80091 42345 -115686 -127781
10080 -127781 -180618 -234069 -169173 -74303 50166 180772 107212 2735 22752 70088 88060
10069 88060 90933 122317 109346 -14953 -62508 -93796 -75705 60422 52582 7854 -5528 11219
10057 11219 35268 -3218 -30919 -95007 -12139 -2992 -169369 -300246 -314528 -157858 -53431
10046 -53431 11751 17166 69727 31870 -97712 -191012 -138814 -86898 -46218 -105458 -138893 -130260
10034a30260O7504n221j09595j748R7804J0240p0278j5634J33002N4977n8156
10023b7365k7744j039n631R9611j915n0629r4888L0003L5413q3244M8358J01796
10011B2726m4738K2290k4331n2084n3215M0411j3246K70k179p3355L7778N0852
9999h8821O8328l46N7853J41154n9603j16678j00975m8068R9033M6719n7211q1306
9987a39921j26327J27025J33098O9062p7203l4466L613n1098O2547k9739J44113
9976H0704l4865J45293K9899j7495j15919j74107k04174J01149K22931j1623q7829
9965f6036q3574P5395M7341K587l9660P0301j5483j9270L9414l0183m6645l0682
9953i6495O3564j19492K0676K2860O6442Q8472K3927n1068k6217R7785j00292
$$ plain form
10034 -130260 -62756 -67977 -177572 -179320 -81516 -71276 -141554 -157188 -24186 30791 -27365
10023 -27365 -55109 -56148 -61779 37832 35917 -14712 -109600 -79597 -44184 -127428 -79070 22726
10011 22726 -22012 278 -24053 -76137 -129352 -88941 -102187 -101917 -104096 -177451 -139673 -88821
9999 -88821 -20493 -20839 37014 178168 118565 1887 -99088 -147156 -48123 -1404 -58615 -139921
9987 -139921 -266248 -139223 -6125 62937 -14266 -48732 -45119 -96217 -33670 -63409 80704
9976 80704 45839 191132 221031 203536 87617 -86490 -290664 -189515 33416 21793 -66036
9965 -66036 -149610 -74215 -26874 -24287 -63947 6354 -9129 -28399 11015 -19168 -65813 -96495
9953 -96495 -32931 -152423 -131747 -108887 -42445 46027 69954 18886 -7331 90454 -9838
9942i838l5338N852l9243Q4608P9668O1388l4414j63965n4652J1657N8378K16993
9930A81094K6453j13664j4526N1360M2175k1588j25807m1607l7370q2654J7002
9919a19132K1893P2407O236m2039o6097P3680l638j5730O8104J15870q6299j02086
9907g6831j5977l9677O0786M4729Q1879p2676j41181O9005J63120J04544L026
9896A80747j15805P6907J12087o9982k32142j8686Q1148O8904K8969k9836p4346
9885G965n5687k5914j73417o4573J57286M7372N4577R6094j26042J7104l4577
9874i9812R9347m1230q1755l2499j7022M2034J4950N5124L5629j7277r125j3795
9862f5431j12835Q863q001O2984J32537K6420K7330O3179n3323m8612L020M715
$$ plain form
9942 -9838 -45176 -39324 -78567 6041 85709 147097 112683 -51282 -105934 -94277 -35899 181094
9930 181094 207547 93883 79357 130717 172892 151304 25497 -16110 -53480 -136134 -119132
9919 -119132 -97239 -24832 -18596 -60635 -126732 -53052 -56690 -72420 -4316 111554 25255 -76831
9907 -76831 -92808 -132485 -71699 -26970 54909 -17767 -158948 -89943 73177 177721 180747
9896 180747 64942 141849 253936 183954 -48188 -66874 14274 83178 112147 82311 7965
9885 7965 -47722 -73636 -247053 -311626 -154340 -106968 -52391 43703 -82339 -65235 -99812
9874 -99812 -465 -41695 -123450 -155949 -172971 -130937 -115987 -60863 -25234 -42511 -51636 -65431
9862 -65431 -178266 -169403 -177404 -114420 18117 44537 71867 135046 81723 33111 36131 40846
9850D0846j21857o8851J04496O5503k6754m6200j7683J42244J16246m0497R513
9839A57006l4485K8610m1727j10157J11842O9157n5994n4518l6821J14156O5645
9828B12714j8500r3361j23711j2010n8130Q7839P9509R0317O814L9819k05366
9817E934j49012n9775J4450R3245O9597L6488j3609k2266q7458L193j9973n5411
9805a84597R6461N5128P5668P436j8946N5632L3625j03354m4413j2331M7075N8344
9793F5728K492L9336o9455k5164P6277l2644n2945p0269n0912J4356J84472O2386
9781A43658m1464j16460q5950P3098M7994p4377l3805j2908N0956J48495J8136
9770A17373j08838m3483j7405j09144j36451k301O4288P8061J9937O4682N6193
$$ plain form
9850 40846 -81011 -149862 -45366 20137 -6617 -52817 -70500 71744 187990 147493 157006
9839 157006 122521 151131 109404 -753 111089 180246 124252 69734 32913 147069 212714
9828 212714 194214 100853 -22858 -34868 -92998 -5159 74350 164667 171481 211300 5934
9817 5934 -143078 -202853 -188403 -95158 -25561 10927 -2682 -24948 -112406 -109213 -129186 -184597
9805 -184597 -88136 -33008 42660 50096 31150 86782 120407 17053 -27360 -39691 7384 65728
9793 65728 68220 107556 38101 12937 89214 56570 3625 -66644 -117556 -103200 81272 143658
9781 143658 102194 -14266 -100216 -27118 20876 -53501 -87306 -100214 -49258 99237 117373
9770 117373 8535 -34948 -52353 -161497 -297948 -300249 -235961 -157900 -137963 -73281 -17088
9759a7088O1035l6386O1576K18662m5668j09107o6094J3865m953J4196j1411r5340
9747a6713P1355N87J20675O9928j68258r4685L2237j389q3630L2799J02635o5429
9735A12r4679J05209p9835j32291L4192M0219m1483O4457K3398J27917K6801k1898
9723E2119j9290N3646l0329m0439p5680M7455M6958L367q3209N3869N6025r4999
9711c0507o9488P933J40514M4597k8943q508m2426j11204J901N1629q5462K6366
9699a03598K5138n2593P1186J15341k2188q565L7180r6339O4422O9787q9371n615
9687D785n2069q6962M0227N6918J0053j20442K6644J8639m1928n9622J62561K9152
9675a2044K8029k5108j36512p168n8464M5777k9946R2337J60659L2075M408j52707
$$ plain form
9759 -17088 43947 7561 69137 287799 242131 133024 66930 80795 75842 90038 78627 -16713
9747 -16713 54642 55229 175904 245832 77574 -17111 15126 13737 -69893 -37094 65541 112
9735 112 -94567 10642 -69193 -201484 -167292 -127073 -168556 -104099 -80701 47216 74017 52119
9723 52119 32829 86475 56146 15707 -59973 -12518 34440 37807 -45402 8467 64492 -30507
9711 -30507 -99995 -92062 48452 93049 64106 55598 13172 -98032 -96131 -44502 -129964 -103598
9699 -103598 -78460 -131053 -59867 55474 33286 24721 61901 -34438 29984 99771 10400 4785
9687 4785 -47284 -134246 -94019 -37101 -27048 -147490 -120846 -102207 -144135 -203757 -41196 -12044
9675 -12044 15985 -9123 -145635 -152803 -211267 -165490 -195436 -103099 57560 89635 94043 -58664
9663e8664r9249P1112K4197K9307j2156l3062n238M6075K8685J00636M8060R5181
9651B34884Q8965J37962j03503q5045p4812l1222m9577k1769M8312R5059K7497
9640B66751L3197o4505j64938j23913m9916P9578Q4801M7296o7164k8813o368
9629F006j66306L5519N7087L5260J25107l7045q2967r4358Q037N8818L863k5422
9617g6401R4922L1963Q1495L2700L0475M0677j28066q5547o9571r3826r563Q5193
9605f5549j3082k6370J5827o7635K4442J80739j444m7458M1674m9405K5825k7057
9593i493m6319m6884J0809n4280M1637Q3949J2011J04861O0398L2957j12501q3015
9581e870k7905J2186R2409M7424j38532p3546n6978J9733J38581J25043R911q9287
$$ plain form
9663 -58664 -157913 -86801 -62604 -33297 -45453 -78515 -83753 -37678 -8993 91643 139703 234884
9651 234884 323849 461811 358308 273263 198451 167229 117652 95883 144195 239254 266751
9640 266751 299948 235443 70505 -53408 -103324 -23746 61055 108351 41187 12374 6006
9629 6006 -160300 -124781 -67694 -32434 92673 55628 -27339 -121697 -113660 -54842 -50979 -76401
9617 -76401 18521 50484 131979 164679 195154 235831 107765 22218 -47353 -141179 -150742 -65549
9605 -65549 -78631 -105001 -89174 -156809 -132367 48372 46928 -530 41144 -8261 17564 -9493
9593 -9493 -55812 -102696 -91887 -146167 -104530 -20581 -8570 96291 156689 189646 77145 -5870
9581 -5870 -33775 -21589 70820 118244 -20288 -93834 -150812 -131079 7502 132545 142456 53169
9569E3169j82669q7055o5783N6456P2093L643n647J16853N9482o8797R5322J32067
9557A79134J9725l5785p6736o0678K5906q1089q3063j17459j8973J10657L2101
9546a06260k8902M8405J21653N1772L680q7205K5616j404o0659m6080k566J17109
9534C5159j5552n8222j8832J01849k3483K6763o4094L5169L3938o432m016r7330
9522e5083q857P7574O5276j31554k7786P0435q8950n2052R0236J0815K3057K4535
9510b354O960K9365N7639j14247j17269N5231l2454L1975J20371q702M7855o6751
9498G619L6015k6152k5111o0925p9112r7722R238J7256Q4446J55394K6582l1452
9486A6076n8438r8120p3082k1739L9673J43534P4428N495n1061M9983L2436j06985
$$ plain form
9569 53169 -129500 -216555 -282338 -225882 -153789 -150146 -155793 -38940 20542 -48255 47067 179134
9557 179134 198859 163074 86338 25660 51566 -29523 -112586 -230045 -249018 -138361 -106260
9546 -106260 -135162 -86757 34896 86668 90348 3143 28759 27355 -33304 -79384 -81950 35159
9534 35159 19607 -38615 -57447 44402 20919 47682 -16412 18757 52695 46263 42247 -55083
9522 -55083 -63940 13634 78910 -52644 -80430 -9995 -98945 -150997 -60761 -49946 -26889 -2354
9510 -2354 4606 33971 91610 -22637 -139906 -84675 -117129 -85154 35217 26515 74370 7619
9498 7619 43634 17482 -7629 -68554 -147666 -245388 -236150 -218894 -134448 20946 47528 16076
9486 16076 -42362 -140482 -213564 -235303 -195630 -52096 22332 27827 -23234 26749 59185 -47800
9474d7800j48193L3942M2598J16885L0611m7283l5860K2197j1677m4001k8493
9463a17074j6308k1550J05893K5269p9579M7880O8040p0950q4008p7901k8400
9452b48688K121L5398P897L3949k1226K6677J22956P9796m8513j2055N5226q9683
9440e6145p7159P038R3039O1309o9267j10131K8931N6795L8399M3034J65908J09174
9428B90925p6750j30906K9017J6085j05722o3820k6571n1442o3512N9043O2323
9417f1330J98525m0995l7120k2889r6251r8616J1986R6055P0983l3155j01619
9406a14426Q15M9021n5820M2046m8994o1210r350Q8648J13126K5650l0120J9231
9394A8617j41622n2586J11596O9759l3406N4714p8294L1385Q0984o1993j12062
$$ plain form
9474 -47800 -195993 -162051 -119453 -2568 28043 -19240 -55100 -32903 -44580 -88581 -117074
9463 -117074 -133382 -154932 -49039 -23770 -103349 -55469 12571 -58379 -142387 -220288 -248688
9452 -248688 -246567 -211169 -203272 -169323 -190549 -163872 -40916 38880 -9633 -21688 33538 -56145
9440 -56145 -133304 -126266 -33227 28082 -41185 -151316 -122385 -65590 -27191 15843 181751 290925
9428 290925 214175 83269 112286 128371 22649 -41171 -67742 -119184 -182696 -123653 -61330
9417 -61330 137195 96200 59080 36191 -60060 -158676 -146690 -50635 20348 -12807 -114426
9406 -114426 -113611 -64590 -120410 -78364 -127358 -188568 -197918 -109270 3856 29506 -614 18617
9394 18617 -123005 -175591 -63995 5764 -27642 27072 -51222 -19837 61147 -846 -112908
9383a12908O9781L9768l8418J4926L1948r6912n4909K7733k0629J8201k5370K9408
9371a17381l6864j9036J17783R4120o6663M4994j8756N5999K7477l9196n0695
9360h218n4558M3233Q9923M9156k626j12641j4326J01251M0443j43176l5659j8016
9348f5214j128K3817Q7272R5538r37p8402K6563n6179J21294k9097j25055J0915
9336I387K9894l1182j2889j0370j35459r5300l6571J6158N5636J16878M9501L3834
9324a0483n138l784r991q6207p8229p7128J10757o69M3365J35183Q6276o6903
9312C7049m6350P355Q001l7696j1209p5361J7123Q6588R572R7869n8224j18967
9300h4250m2910K5994J9240l2967O3067m1982l090m3662m6152N7761K6618m5654
$$ plain form
9383 -112908 -43127 -3359 -41777 -26851 5097 -91815 -146724 -118991 -139620 -121419 -146789 -117381
9371 -117381 -154245 -173281 -55498 38622 -28041 16953 -1803 54196 81673 42477 -8218
9360 -8218 -62776 -19543 70380 119536 116910 4269 -10057 91194 131637 -11539 -47198 -65214
9348 -65214 -66342 -42525 44747 140285 139348 60946 87509 31330 152624 123527 -1528 9387
9336 9387 39281 8099 -4790 -15160 -150619 -245919 -282490 -266332 -210696 -93818 -44317 -10483
9324 -10483 -15621 -19405 -29396 -115603 -193832 -270960 -160203 -160872 -117507 17676 103952 37049
9312 37049 -9301 -1946 6055 -31641 -42850 -118211 -101088 -14500 -4928 92941 34717 -84250
9300 -84250 -127160 -101166 -81926 -114893 -51826 -93808 -96898 -140560 -186712 -128951 -102333 -147987
9288a47987k5485P0180l5502P6342P6307O5447O2028R020k0208j3828m0834O6796
9276A42276N8587N962M2123m5520r9154o0409Q409O1803J0372K7757k4984p2127
9264E5095q3728O9858J24577o8951p8039O4089j25495m9751J37853l4733l7321
9253b6546j04258p5227m7390n1452Q0198n3387M2262k4169p6620J3899J51882
9242a70808R8466M0244k3286L4488L2570k4582Q249j2541q7951L4516K1941J615
9230d7079m1133p6598M5424M8741Q2207o3053K6787l6600K8379j7934n4272M5793
9218e9338J4417k4699p3298P9291J6055r687q2704L253k540r6811Q8708J8681
9206a28672M1423O9577j16082N0588J16803M4154o3208r5477K7276o5505o3436
$$ plain form
9288 -147987 -173472 -103292 -138794 -62452 13855 79302 141330 150350 130142 116314 75480 142276
9276 142276 200863 206825 248948 203428 104274 43865 52274 114077 124449 152206 127222 55095
9264 55095 -28633 41225 165802 96851 18812 82901 -42594 -92345 45508 10775 -26546
9253 -26546 -130804 -206031 -253421 -304873 -224675 -278062 -235800 -259969 -336589 -322690 -170808
9242 -170808 -72342 -32098 -55384 -20896 11674 -12908 -4659 -17200 -105151 -70635 -48694 -47079
9230 -47079 -88212 -164810 -119386 -70645 11562 -51491 -24704 -61304 -32925 -50859 -105131 -59338
9218 -59338 -44921 -69620 -142918 -63627 -47572 -57259 -139963 -136710 -139250 -236061 -147353 -128672
9206 -128672 -87249 -17672 -133754 -83166 33637 77791 14583 -80894 -53618 -119123 -182559
9195a82559N0988R2800K3605j29230l6545K2314Q636K5034J44173j32786j92744
9184c06314q457J34343J96736J03242p2849q0322J04189P1057N05M374o2313m1492
9172D2699k02L0734K4134L5969K8439J4177j76467j10177O7765K6562o014q9498
9160a11879M5181J05833k3383p1408l6861J9790j5848m7511m010K4893M4891J1880
9148e8432J0789O5172k1211N4328J87598l9334j14895r1313K218k9694p0745N8330
9136d7189J3956j3709J29500P4536P0318K9219k6371l1763m3038p2645j30460
9125d7646j00241Q8315P9047l8887M9435m3252k1436L5170o0681q758J01060K6041
9113E8167m522N595m3794m3636J6971j02618P3963N2047m8186K9982R4880P8412
$$ plain form
9195 -182559 -131571 -38771 -15166 -144396 -180941 -158627 -149991 -124957 19216 -113570 -306314
9184 -306314 -314771 -180428 16308 119550 46701 -33621 70568 141625 142130 146504 84191 42699
9172 42699 42497 73231 97365 133334 161773 175950 -517 -110694 -42929 -16367 -22381 -111879
9160 -111879 -66698 39135 15752 -55656 -92517 -72727 -88575 -136086 -140096 -115203 -70312 -58432
9148 -58432 -47643 17529 -3682 50646 238244 198910 84015 -7298 -5080 -34774 -105519 -47189
9136 -47189 -33233 -46942 82558 157094 227412 256631 230260 198497 155459 82814 -47646
9125 -47646 -147887 -59572 19475 -19412 30023 -13229 -34665 505 -60176 -68934 32126 58167
9113 58167 53645 59240 15446 -28190 -11219 -113837 -39874 12173 -36013 -6031 88849 167261
9101A67261n6474m7045m4410r5615L9688Q5854o0004l4547N0287m7417P3474J21727
9089A52779M139r4418n5352m1935j12149J00311K6373j44087o7391n0465J54736
9078a27459J3932R6533K3820J883N3302N8116j46817l074M2504n0399p2596M3073
9066f7182O0054k2343R3576L3567k0473R216j5134o3540p9515n2737l688J58828
9054C0629P7475r2275q8955M6698k692q4052J3356l630r105J00854J18049P097
9042A13449k7722n9535m642K1315j6546l9041j8746r2951l9043m815r2249L7576
9030b22950Q8072j1973k7911k1270K6396L3361j5406N8485j4195j23m6527K7425
9018a26616J0377q6350p2674Q4542P5933m047J0228L6378q1m7499m1384J849k1155
$$ plain form
9101 167261 110787 63742 19332 -76283 -36595 49259 -10745 -45292 4995 -42422 31052 152779
9089 152779 156918 62500 7148 -34787 -146936 -46625 -20252 -164339 -231730 -282195 -127459
9078 -127459 -113527 -16994 6826 8709 62011 120127 -26690 -29764 12740 -37659 -110255 -67182
9066 -67182 -7128 -29471 64105 97672 77199 86415 71281 7741 -71774 -124511 -128199 30629
9054 30629 108104 15829 -73126 -26428 -29120 -113172 -99816 -103446 -112551 -11697 106352 113449
9042 113449 85727 26192 21550 42865 26319 -12722 -31468 -124419 -163462 -168277 -260526 -222950
9030 -222950 -134878 -146851 -174762 -196032 -169636 -136275 -151681 -93196 -107391 -107514 -154041 -126616
9018 -126616 -116239 -202589 -275263 -190721 -114788 -118835 -108607 -72229 -72310 -119809 -161193 -159344 -180499
9005a80499M5120P7891q319j152r397O300M011j6048p9833M3030J27180J03551
8993A11835n4358L613R3600p3654j12750n7176K3204O5201L4721J52952L0160
8982B17348P22j47654j05034m605q4685n7869N7778k2396k6179J16017O8759j47774
8970a35572p1756l0309Q3393J02382P5826l1915j6224o6775L7792l8695K6649
8959f5204L4983J56388J5250k7166n2198l1393m1147K4567q788n5925l045K8427
8947b5251n2737o5859K2015J1332m6412l9711M396L6238P0162M1049J07072O402
8935F8696O357l4717p158o1324j06831P346J26668L5798r9078k08565o3768k0906
8923c57482J69161O3562O226Q1055Q5079j9739m1874n8925k04661r8299K0484
$$ plain form
9005 -180499 -135379 -57488 -65807 -66959 -76356 -70056 -66045 -82093 -161926 -118896 8284 111835
8993 111835 57477 61090 154690 81036 -31714 -88890 -65686 -485 34236 187188 217348
8982 217348 218070 70416 -34618 -39223 -123908 -181777 -123999 -146395 -172574 -56557 12202 -135572
8970 -135572 -207328 -237637 -154244 -51862 23964 -7951 -24175 -90950 -53158 -91853 -65204
8959 -65204 -30221 126167 141417 114251 62053 30660 -10487 14080 5292 -50633 -53678 -25251
8947 -25251 -77988 -143847 -121832 -110500 -156912 -196623 -192227 -155989 -85827 -44778 62294 68696
8935 68696 75053 40336 33178 -28146 -134977 -127631 -963 34835 -64243 -272808 -336576 -357482
8923 -357482 -188321 -124759 -118533 -37478 47601 27862 -14012 -72937 -277598 -375897 -355413
8912c55413J14867J47603l4698j33612J1354K7314L4006N9971O978Q0525O4411
8901B3306p008j4859K1471o6089m7196j3255M7548k2586j1735R1508m8364N3231
8889E972l550P5997L5886K271o3446j04150L2903Q0358k7760j7392k0765n337
8877i013Q4313J8991q3914p8437J7958m8261n0200J4067J7787k2948J57494Q3089
8865A00926o2627j5938k0981l3031p2273K3967Q3084J152k6800o6906J18466P8820
8853A07859K304K7516r4147n3517Q766q564J13142j6061j05089j11452q052m936
8841a42231N4588J69938R0580j26335N3061K0588K867k0574p803j7747O3356P6159
8829B16447O6594j17661m0798j4184J5564Q6695j8488j61460q0652P5583J2993
$$ plain form
8912 -355413 -240546 -92943 -127641 -261253 -249899 -222585 -188579 -128608 -121630 -41105 23306
8901 23306 16298 1439 22910 -43179 -90375 -103630 -56082 -78668 -90403 1105 -47259 5972
8889 5972 2422 78419 114305 116576 53130 -51020 -18117 62241 34481 17089 -3676 -9013
8877 -9013 75300 94291 10377 -68060 -50102 -98363 -148563 -134496 -116709 -139657 17837 100926
8865 100926 38299 22361 1380 -31651 -103924 -79957 3127 4279 -22521 -89427 29039 107859
8853 107859 110163 137679 43532 -9985 -1219 -9783 103359 87298 -17791 -129243 -137295 -142231
8841 -142231 -87643 82295 172875 46540 99601 120189 123056 102482 94679 76932 140288 216447
8829 216447 283041 165380 124582 110398 125962 212657 194169 32709 -47943 27640 40633
8818D0633n5970k270J29741k1632j2906m3613l4237j33607o8988p1588n5692J72518
8806a57611J08320J5187O8912P7611q2234m7437L3918O3216m6973j504o4895q6432
8794a19922q451n9174K9001O8263j4688j8811j18728q3242J19584K3695P8505
8783a03968M6878j3508o1275r3747l3557P8094P4334J30820J03936k1378j05417
8772A212M1057M0328L8294o4077n7163l8440L7246N476k5848o5143j08618K1821
8760a73855O0982M3450K88k393P2907R722k4774O5708P2410j07155k099l7079
8748b1888j04090q0801R9831J19088Q9947m3038j6707n3205n5178M7188O8904
8737E0051K5767j03756m5211j06783q1948R3487n8916K9517J74668M9149l809
$$ plain form
8818 40633 -15337 -17607 112134 90502 77596 33983 -254 -133861 -202849 -274437 -330129 -157611
8806 -157611 -49291 -34104 34808 112419 30185 -17252 16666 79882 32909 31405 -33490 -119922
8794 -119922 -128373 -187547 -158546 -90283 -104971 -123782 -242510 -325752 -206168 -182473 -103968
8783 -103968 -57090 -70598 -131873 -225620 -259177 -181083 -106749 24071 128007 106629 1212
8772 1212 42269 82597 120891 56814 -349 -38789 -1543 3933 -21915 -87058 -195676 -173855
8760 -173855 -112873 -69423 -69135 -71528 1379 11101 -13673 52035 124445 17290 15191 -21888
8748 -21888 -125978 -206779 -106948 12140 102087 59049 42342 -10863 -66041 -18853 50051
8737 50051 75818 -27938 -73149 -179932 -261880 -168393 -227309 -197792 -23124 26025 22216
8726B2216l707r0229k0111L1044q764p8532R0985K00847J0210j00998o2507N4961
8714D5415j0773n1264o6183J5713J4558R0720m5326j4313j5962o6634j8037j6909
8702a38995n965l8235R0942L5857K9397j5777L4447N1616j03225m1099J03830
8691B793P310o3205N2371p0113k8647M5982R5026j9561q4158k4603M7476N867
8679c3462j8742n4673m5914r121N5463J26449R0916r8170j53641P599Q7444R2620
8667D6768p3001o1281n2692J2348J48276J35536J7728j32431q5432l3988r9203
8656a77372M9271J02720j3393J2841n4129q4893Q0766j2031J158k932m9820P7532
8644g0282J11827n71q4094j01481n2453Q3973M6924J02256K2054N4788j0794N66
$$ plain form
8726 22216 18509 -71720 -91831 -60787 -69551 -148083 -57098 143749 153959 52961 -9546 45415
8714 45415 34642 -16622 -82805 -67092 -52534 38186 -7140 -21453 -37415 -104049 -122086 -138995
8702 -138995 -144960 -183195 -92253 -56396 -26999 -42776 -8329 43287 -59938 -101037 2793
8691 2793 10103 -53102 -731 -70844 -99491 -53509 41517 21956 -62202 -86805 -39329 -33462
8679 -33462 -52204 -106877 -152791 -161912 -106449 20000 110916 12746 -140895 -133296 -45852 46768
8667 46768 -26233 -87514 -140206 -127858 20418 155954 173682 41251 -44181 -78169 -177372
8656 -177372 -128101 -25381 -38774 -25933 -80062 -164955 -84189 -96220 -95062 -97994 -147814 -70282
8644 -70282 41545 40974 -43120 -144601 -197054 -113081 -66157 36099 58153 112941 102147 102713
8632A02713m259p7474O6759j5597L5456j07171n3485L1817n5559k2331j2626J9642
8620i2115j6066R9755J24114j23437l4372Q9219Q5840m4826k852n6390j19329
8609i0459m4462n3525L9194J41366N2842K1720r9135L7610N8936J8514P022l8280
8597E1343K331j53289p565P0158j8212n2120j7737J6810J04073R4183M7510k2769
8585A14716q2019N697N988Q8697n0539j01060r5994j21330p64N9192J5377j00353
8573b62392k3228P9728J01598L564L1207p7148k4893k9043N6704P251N7427J23753
8561D4528o0167k2392R4946o5492j37153l0290M9629J46151Q6436N1894L6907
8550A94997j6482j62491m4547O1569J65K3171L571q4136m8212j0505n8583P9185
$$ plain form
8632 102713 98454 20980 87739 72142 107598 427 -53058 -21241 -76800 -99131 -111757 -92115
8620 -92115 -108181 -8426 115688 -7749 -42121 47098 132938 88112 85260 28870 -90459
8609 -90459 -134921 -188446 -149252 -7886 44956 66676 -32459 5151 64087 82601 89623 51343
8597 51343 53674 -99615 -107180 -37022 -55234 -107354 -125091 -108281 -4208 89975 137485 114716
8585 114716 32697 38394 44382 133079 82540 -18520 -114514 -235844 -236608 -177416 -162039 -262392
8573 -262392 -285620 -205892 -104294 -100730 -69523 -146671 -171564 -200607 -143903 -136652 -79225 44528
8561 44528 -15639 -38031 56915 -8577 -145730 -176020 -126391 19760 106196 158090 194997
8550 194997 178515 16024 -28523 33046 33211 56382 59953 -24183 -72395 -82900 -141483 -62298
8538f2298J26427q599J190R9292j58394k1808J35974Q4374j4627m8305J2172m7113
8526I8285n8148m4479M640N2732K15129L9837p2261n2359j8993r344j75344n323
8514b5628Q7144j4816n2678N8523o0836k7730p2790J02564J19736O5012m5014
8503A33487k7364K65j664Q9626m604j07738j67065m7832O7207K1539M0140N256
8491A253m4879k9089O0288J52478j1769n8617n1980R5974j33164r4822o512M7842
8479g2997N5516R7000N1793j11680n7962J5895j5252j1267J0339O5941l7949j00124
8467a10747k03671m7981O5274R3461K8572K1039M7982m272L0499N2979J21917
8456I5052R7707j7320K2101J9265n5811r6980j37618r1506L219m9197O3206P6169
$$ plain form
8538 -62298 64129 55530 56720 156012 -2382 -24190 111784 196158 181531 133226 145398 98285
8526 98285 40137 -4342 298 53030 268159 307996 235735 183376 164383 155039 -20305 -25628
8514 -25628 61516 46700 -5978 52545 -8291 -36021 -108811 -6247 113489 178501 133487
8503 133487 106123 106388 104724 194350 189746 82008 -85057 -132889 -65682 -44143 -4003 1253
8491 1253 -43626 -72715 -12427 140051 128282 69665 17685 113659 -19505 -114327 -120839 -72997
8479 -72997 -17481 79519 131312 19632 -38330 -22435 -37687 -48954 -38615 27326 -10623 -110747
8467 -110747 -314418 -362399 -297125 -203664 -175092 -154053 -106071 -110343 -79844 -26865 95052
8456 95052 192759 175439 197540 216805 160994 64014 -73604 -165110 -161891 -211088 -147882 -71713
8444g1713N7589J12686P889j7464N3474j54728j65111P7614L7613k1862q7987
8433a72000K6204O2879J7745m450n0307L9661K10081l2548o3171m0998r3660K3685
8421g6879L2143M0320q411J04429n2778j44447J0573Q0101n0874N6041n669N4826
8409C9375j5463p005j00566o9414o3244m5596J86318J7036O145M3706m1752k2866
8397g3326N3188l685l3734P4840k2748l5656L0871J16929j0178j36804m4799k2140
8385a07242k783P7126Q5476q4735p6777j3463J48094P2906l5842R6450L9603p548
8373A91265L1994o7257j7640M4851l5505n6737L3057j02644J6316J12094N7856
8362B07650K836o5501l8823r2592J6487n042K0750q8396K8435O4779K61K9645
$$ plain form
8444 -71713 -14124 98562 106451 88987 142461 -12267 -177378 -99764 -62151 -84013 -172000
8433 -172000 -145796 -82917 -65172 -69622 -119929 -80268 129813 97265 34094 -6904 -100564 -76879
8421 -76879 -44736 -4416 -12827 91602 38824 -105623 -95050 -14949 -65823 -9782 -15451 39375
8409 39375 23912 16907 -83659 -153073 -216317 -261913 -75595 -58559 -52414 -8708 -50460 -73326
8397 -73326 -20138 -23823 -57557 17283 -5465 -41121 -10250 106679 96501 -40303 -85102 -107242
8385 -107242 -110025 -32899 52577 -32158 -108935 -122398 25696 98602 62760 159210 198813 191265
8373 191265 223259 156002 138362 183213 147708 90971 124028 21384 37700 149794 207650
8362 207650 210486 144985 106162 13570 30057 25015 45765 -42631 -14196 50583 50844 80489
8350H0489l7767j26965k8099M1111J27152R5223l6058o3009M8527J61492Q753
8339B70849N0400K89736M71821J41470l20664l52009r4932k12527j70440K7048
8329A00752l6511J9067l8756q6261j1205Q275N7382J262O7182J17527k771j5518
8317A80425j08995p1542J5100Q1721M8216j6996j34154K1316J8820J1927j0614
8306C5224O3716l2987Q2914O3826P4527k5425n0354j67409k9122K01589K57295
8295D73794K76687L86988P55983M53581m02769n64085m87821l87419j97098q6673
8285B21168M2138k3657j48714L6735P6287M4751q789j06333p9572l2036K8712
8274E0690j17968j00260o9745K2552L046J15384P1700L9954p5173j5437k6126
$$ plain form
8350 80489 42722 -84243 -112342 -71231 55921 151144 115086 52077 100604 262096 270849
8339 270849 321249 610985 1082806 1224276 903612 551603 456671 244144 73704 100752
8329 100752 64241 83308 44552 -41709 -52914 -44639 12743 14005 81187 198714 195943 180425
8317 180425 71430 -112 14988 96709 144925 127929 -6225 15091 33911 45838 35224
8306 35224 98940 65953 148867 212693 287220 261795 211441 44032 14910 216499 473794
8295 473794 750481 1137469 1893452 2347033 1944264 1380179 892358 504939 307841 221168
8285 221168 263306 239649 90935 127670 203957 248708 239919 133586 54014 21978 50690
8274 50690 -67278 -167538 -237283 -214731 -211685 -96301 -24601 15353 -59820 -75257 -101383
8263a01383k5544J05577L3665L5108Q4147N572j03875m5571J58089M4126K8869
8252B18780k953J50541K07668L45967J79547Q0628k86941l58390j39109j31328
8242B64410j14201j63681p5342R7693M977j5026n4172p9206M3100L2387J12307
8231E3246K6470M9734J8662J8914n0651j26160q422R0885l6966p3323M3436j7842
8219a2017q0967Q2936J03452K0199q690J1776l9222p5083N8033M0884N3546J1862
8207A66709j28780j82131p2529M9847Q8877R8612J14650j33991q1355K7553Q107
8196d4431k3421j0213j36674m4274J05413J08852n006j7991j2445J08853J25238
8185A53901N811m3909M2563j01448j06026o342l7437J20727M1588L0612n6448
$$ plain form
8263 -101383 -126927 -21350 12315 47423 131570 137142 33267 -12304 145785 189911 218780
8252 218780 215827 366368 574036 920003 1099550 1180178 893237 534847 395738 264410
8242 264410 150209 -13472 -88814 8879 13856 -1170 -55342 -134548 -91448 -59061 53246
8231 53246 79716 129450 148112 167026 116375 -9785 -18207 72678 35712 -37611 5825 -12017
8219 -12017 -92984 -10048 93404 113603 104913 116689 77467 2384 60417 101301 154847 166709
8207 166709 37929 -144202 -216731 -166884 -78007 20605 135255 1264 -80091 -52538 -44431
8196 -44431 -67852 -78065 -214739 -259013 -153600 -44748 -49754 -67745 -80190 28663 153901
8185 153901 159712 115803 158366 56918 -49108 -55450 -92887 27840 69428 100040 43592
8174D3592j33019K7772J1832L6097m411k4498M4085K7328p8449R700j48691q1589
8162b70251J65698J22814j21054j16261M0389J50631P9147n6344M9556R211m9702
8151C834L2924j02415R43Q2735l0816J8458j3219l9525p8565J22657R0189q6420
8139G80p7590K0996j8266k0957Q9692p3979J3587J19942P0519m724M6214P6581
8127B42795o6149j77168l1R3805K2641o422n9378m2581P0131K0479n6143j62364
8115a20385r3511L8554R6811P6693l8958q216r5415Q1475M724k8490L9268K6270
8103b1180L8467P0338N8802r6545p5760p3013n7510K3510K838M9979J11670r365
8091B2231p3743l0687m6786J00500Q8147L8400j44989n6893j5285m7584q706P1866
$$ plain form
8174 43592 -89427 -61655 -49823 -13726 -18137 -42635 1450 28778 -49671 -39971 -188662 -270251
8162 -270251 -104553 18261 -102793 -219054 -178665 -28034 51113 -5231 44325 53536 3834
8151 3834 36758 -65657 -64714 18021 -12795 5663 -7556 -47081 -125646 -2989 87200 780
8139 780 -76810 -55814 -74080 -95037 -5345 -79324 -65737 54205 124724 120000 166214 242795
8127 242795 176646 -522 -553 93252 115893 109471 50093 7512 77643 98122 41979 -120385
8115 -120385 -213896 -175342 -78531 -1838 -40796 -49012 -144427 -62952 -58228 -86718 -47450 -21180
8103 -21180 17287 87625 146427 49882 -25878 -98891 -156401 -132891 -130053 -80074 31596 22231
8091 22231 -51512 -82199 -128985 -28485 59662 98062 -46927 -103820 -119105 -166689 -175395 -103529
8079a03529O8166K1847j12349r7688J03415P0160J00667R7011n7052q494L0635
8068A12789M9596l3875n6336N152k7341r5540j42437m8067N3434J03520Q7790
8057H685l5242m1093O0522o2672j28875n8108J07901J37739k820p559j4613o2649
8045i8784m3821L4831j4203O5951J06409j4176m7593n9366M3261J33840j5617
8034I0732m6412l3107Q0336j11618j21222J59393Q7045l466N519J3026l9714Q0370
8022A60882M349p4122O6612k0206r0949j45594m6608J38865L5748o3136l9272
8011g3431N0974O2694P30l2986q6140q5275N0296k0575P9722R4216m9869j13953
7999a23597J68457J47881j8174K3389j20282j06324p824k5341J9906N311N3117
$$ plain form
8079 -103529 -35363 -13516 -125865 -223553 -120138 -49978 50689 147700 90648 82154 112789
8068 112789 162385 128510 72174 77326 49985 -45555 -187992 -236059 -182625 -79105 8685
8057 8685 -26557 -67650 -7128 -69800 -198675 -256783 -148882 -11143 -13963 -21522 -36135 -98784
8045 -98784 -142605 -107774 -121977 -56026 50383 36207 -11386 -70752 -27491 106349 90732
8034 90732 44320 11213 91549 -20069 -141291 18102 105147 101681 107200 120226 80512 160882
8022 160882 165231 91109 157721 137515 46566 -99028 -145636 -6771 28977 -34159 -73431
8011 -73431 -22457 40237 40967 7981 -78159 -163434 -113138 -133713 -53991 40225 -9644 -123597
7999 -123597 44860 192741 174567 197956 77674 -28650 -36474 -61815 -41909 -36598 16519
7988A6519l8378Q947o6721n8387J28603K8298l0775q2664l4860L7358P1181J86734
7976A65855K8993j4405j05902o3153J7207Q2454n9047o9232k2576O5703Q6716
7965A12613k7490j3723P7135j7827j33961p6008L4155M3327Q7496O0451q99m3121
7953A02148J2961N0245O990O0113p2668j04899q1031l3672J12912N2445J2407
7942A17951l2668J529l1907p1845k1717q8896l184j0693J20508J38831L7239k5362
7930A29786M6274K791m1414p4036M3453o2872J273j9681k05282l086J00038Q9966
7918G210n2610n9308j2074O7388K0587J4853p081M1272J05621n7951Q6202J4332
7906A68441k7473O1595K1968p1458O48m564J2921N0278o3577p9091n4622o161
$$ plain form
7988 16519 -21859 -12912 -79633 -138020 -9417 18881 -11894 -94558 -129418 -92060 -20879 165855
7976 165855 194848 180443 74541 11388 28595 111049 52002 -17230 -39806 25897 112613
7965 112613 85123 71400 148535 130708 -3253 -79261 -45106 -1779 85717 146168 145269 102148
7953 102148 115109 165354 172344 232457 159789 54890 -26141 -59813 53099 105544 117951
7942 117951 85283 86812 54905 -16940 -38657 -127553 -130737 -141430 -20922 117909 155148 129786
7930 129786 176060 178851 137437 63401 106854 43982 45255 25574 -179708 -182794 -82756 7210
7918 7210 -45400 -104708 -116782 -49394 -28807 -13954 -21035 20237 125858 67907 154109 168441
7906 168441 140968 202563 224531 153073 153721 149157 162078 212356 148779 69688 15066 8905
7894H905q250M4062l6885j5669J42261j01055j05843N2624L0583j1845l3738l3082
7882f7932j6421M5595L7787j18745m1170J6180Q331J60242o82q3183J04986l5155
7870I833L5916l7604r3251M7255J54200n5674j16428K4673p9282k6942j3848k6545
7858a77697j6728P5347M5206J8345M6500N254l3362j2153k398r5590p623L9663
7846a15236K6921o336N3405J4553J3O44j40389r3647R8941O3357L7651K1624J48165
7833A09666K6999n8833M6799m7831j49070J2544J21356K5212K0636N3326L2919
7822A93723p2470j19715M7443o0689l7725M5953k1379L3143J36140K2015k06552
7811d0113J8514R4639J07919k7023j15349l1243p8950p4783P6884R8249q9930
$$ plain form
7894 8905 655 44717 7832 -7837 134424 33369 -72474 -19850 10733 -1112 -34850 -67932
7882 -67932 -84353 -38758 -971 -119716 -160886 -144706 -136375 23867 23185 -59998 44988 9833
7870 9833 45749 8145 -85106 -37851 116349 60675 -55753 -31080 -110362 -137304 -151152 -177697
7858 -177697 -194425 -119078 -73872 -55527 -9027 -3773 -37135 -49288 -51686 -147276 -154899 -115236
7846 -115236 -88315 -94651 -41246 -26693 -26680 -26036 -166425 -260072 -161131 -97774 -60123 -38499 109666
7833 109666 136665 77832 124631 76800 -72270 -59726 61630 86842 107478 160804 193723
7822 193723 121253 1538 48981 -11708 -49433 -3480 -24859 8284 144424 166439 -40113
7811 -40113 -21599 73040 180959 153936 38587 7344 -71606 -146389 -69505 28744 -61186
7800f1186n5952Q7832L4004J6516j5046m5235p0378M5656J22812l632n7249j7515
7788a9373m3635M2403l5853l4763L7693J23374q7784r171Q7218O2823j18788J5428
7776A9572q3096j24473o7645R1064J891n998N9333M2342M5215J50644n2758m8709
7764B7382N5779j1881j12035n1738j4772m9572j4928k4831J02133Q7715L5023
7753B8275L854O500L2842n32o1598R4631j06947N3182N7996o6828n0661o1612
7741g0898K7387j0813J6767m8835l2955L7124M5669M1906n4285p0615r086k1082
7729a49716M2186R4546N9184P5825l2741O2590q1379o467P7685M0443k9173r2316
$$ plain form
7800 -61186 -117138 -29306 4698 21214 6168 -39067 -109445 -63789 59023 55391 -1858 -19373
7788 -19373 -63008 -20605 -56458 -91221 -53528 69846 -17938 -27109 60109 122932 4144 19572
7776 19572 -63524 -187997 -255642 -164578 -162687 -168685 -109352 -67010 -21795 128849 76091 27382
7764 27382 83161 71280 -40755 -92493 -107265 -156837 -171765 -196596 -94463 -6748 28275
7753 28275 32129 38629 71471 70939 9341 103972 -2975 50207 108203 41375 -9286 -70898
7741 -70898 -43511 -54324 -37557 -86392 -119347 -82223 -36554 5352 -48933 -119548 -128634 -149716
7729 -149716 -107530 -12984 46200 122025 89284 151874 70495 64028 141713 182156 152983 60667
$$ [...]
##END NTUPLES=NMR SPECTRUM
##END=
